##TITLE=Analysis number 315634
Compound Code cc 46923
Book Reference 422/109
Project Code adrs
Chemist Name robb
##JCAMPDX= 6.0         $$ Bruker NMR JCAMP-DX V2.0
##DATA TYPE= NMR SPECTRUM
##DATA CLASS= NTUPLES
##ORIGIN= Bruker BioSpin GmbH
##OWNER= NMR
$$ XWIN-NMR		Version 3.5
$$ Fri Nov 25 08:07:04 2005 GMT Standard Time (UT+0h)  MAYBRIDGE\NMR@NMR_250MHZ
##.OBSERVE FREQUENCY= 250.131544655141
##.OBSERVE NUCLEUS= ^1H
##.ACQUISITION MODE= SIMULTANEOUS (DQD)
##.ACQUISITION SCHEME= undefined
##.AVERAGES= 16
##.DIGITISER RES= 18
##SPECTROMETER/DATA SYSTEM= dpx250
##.PULSE SEQUENCE= zg30
##.SOLVENT NAME= CDCl3
##.SHIFT REFERENCE= (INTERNAL, CDCl3, 0, 16.522)
##AUDIT TRAIL= $$ (NUMBER, WHEN, WHO, WHERE, WHAT)
$$ ##TITLE= Audit trail, XWIN-NMR		Version 3.5
$$ ##JCAMPDX= 5.01
$$ ##ORIGIN= Bruker BioSpin GmbH
$$ ##OWNER= NMR
$$ C:\u/data/dgb/nmr/ADRS/13050/pdata/1/auditp.txt
$$ ##AUDIT TRAIL=  $$ (NUMBER, WHEN, WHO, WHERE, WHAT)
(   1,<2005-11-25 08:06:19.68 +000>,<MAYBRIDGE\NMR>,<NMR_250MHZ>,
      <created by zg, POWCHK disabled, PULCHK disabled
       configuration hash MD5:
       62 19 C7 07 E1 42 D1 B7 37 6C 3D D0 77 39 F9 E6
       data hash MD5: 64K
       E2 CE 76 61 BC 47 BC 15 3C 37 03 EE 0B 1F CB 42>)
(   2,<2005-11-25 08:06:31.56 +000>,<MAYBRIDGE\NMR>,<NMR_250MHZ>,
      <Start of raw data processing
       ef LB = 0.3 FT_mod = 6 PKNL = 1 SI = 32K 
       data hash MD5: 32K
       6D 0B 66 97 17 FF 1B 26 1C 8F DA A9 9D E9 4D 27>)
(   3,<2005-11-25 08:06:33.42 +000>,<MAYBRIDGE\NMR>,<NMR_250MHZ>,
      <apk 
       data hash MD5: 32K
       6E 78 11 B8 56 8E BB AD 23 4F 24 8A DB F9 4B 88>)
(   4,<2005-11-25 08:06:34.15 +000>,<MAYBRIDGE\NMR>,<NMR_250MHZ>,
      <abs ABSG = 5 
       data hash MD5: 32K
       E8 65 5D 98 0E B6 7D 6D 7B 9C B7 48 13 FF 91 FE>)
$$ ##END=
$$ 
$$ hash MD5
$$ 48 A3 3F EE BA B4 95 C8 28 46 26 48 FE B7 D1 4D
##$RELAX= 
##$RELAX= 
##$RELAX= 
##$RELAX= 
##$RELAX= 
##$RELAX= 
##$RELAX= 
$$ Bruker specific parameters
$$ --------------------------
##$DU= <C:\u>
##$EXPNO= 13050
##$NAME= <ADRS>
##$PROCNO= 1
##$TYPE= <nmr>
##$USER= <dgb>
##$AMP= (0..31)
100 100 100 100 100 100 100 100 100 100 100 100 100 100 100 100 100 100 
100 100 100 100 100 100 100 100 100 100 100 100 100 100 
##$AQSEQ= 0
##$AQ_mod= 3
##$AUNM= <au_zg>
##$AUTOPOS= <1 >
##$BF1= 250.13
##$BF2= 250.13
##$BF3= 250.13
##$BF4= 250.13
##$BF5= 500.13
##$BF6= 500.13
##$BF7= 500.13
##$BF8= 500.13
##$BYTORDA= 1
##$CFDGTYP= 0
##$CFRGTYP= 5
##$CHEMSTR= <none>
##$CNST= (0..31)
1 1 145 1 1 1 1 1 1 1 1 1 1 1 1 1 1 1 1 1 1 1 1 1 1 1 1 1 1 1 1 1 
##$CPDPRG= <>
##$CPDPRG1= <>
##$CPDPRG2= <>
##$CPDPRG3= <>
##$CPDPRG4= <mlev>
##$CPDPRG5= <mlev>
##$CPDPRG6= <mlev>
##$CPDPRG7= <mlev>
##$CPDPRG8= <mlev>
##$CPDPRGB= <>
##$CPDPRGT= <>
##$D= (0..31)
0 1 0 0 0 0 0 0 0 0.06 0 0 0 0 0 0 0.0002 0 0 0 0 0 0 0 0 0 0 0 0 0 0 
0 
##$DATE= 1132905978
##$DBL= (0..7)
120 120 120 120 120 120 120 120 
##$DBP= (0..7)
150 150 150 150 150 150 150 150 
##$DBP07= 0
##$DBPNAM0= <>
##$DBPNAM1= <>
$$ [...]
##$SUBNAM7= <"">
##$SUBNAM8= <"">
##$SUBNAM9= <"">
##$SW= 20.6930455092707
##$SWIBOX= (0..15)
0 0 3 0 0 0 0 0 0 0 0 0 0 0 0 0 
##$SW_h= 5175.983436853
##$TD= 65536
##$TD0= 1
##$TE= 294.16
##$TE2= 300
##$TE3= 300
##$TEG= 300
##$TL= (0..7)
0 120 120 120 120 120 120 120 
##$TP= (0..7)
150 150 150 150 150 150 150 150 
##$TP07= 0
##$TPNAME0= <>
##$TPNAME1= <>
##$TPNAME2= <>
##$TPNAME3= <>
##$TPNAME4= <>
##$TPNAME5= <>
##$TPNAME6= <>
##$TPNAME7= <>
##$TPOAL= (0..7)
0.5 0.5 0.5 0.5 0.5 0.5 0.5 0.5 
##$TPOFFS= (0..7)
0 0 0 0 0 0 0 0 
##$TUNHIN= 0
##$TUNHOUT= 0
##$TUNXOUT= 0
##$USERA1= <user>
##$USERA2= <user>
##$USERA3= <user>
##$USERA4= <user>
##$USERA5= <user>
##$V9= 5
##$VALIST= <valist>
##$VCLIST= <CCCCCCCCCCCCCCC>
##$VD= 0
##$VDLIST= <DDDDDDDDDDDDDDD>
##$VPLIST= <PPPPPPPPPPPPPPP>
##$VTLIST= <TTTTTTTTTTTTTTT>
##$WBST= 1024
##$WBSW= 4
##$XGAIN= (0..3)
0 0 0 0 
##$XL= 0
##$YL= 0
##$YMAX_a= 601200
##$YMIN_a= -480783
##$ZGOPTNS= <>
##$ZL1= 120
##$ZL2= 120
##$ZL3= 120
##$ZL4= 120
##$ABSF1= 16.522
##$ABSF2= -4.171173
##$ABSG= 5
##$ABSL= 3
##$ALPHA= 0
##$AQORDER= 0
##$ASSFAC= 0
##$ASSFACI= 0
##$ASSFACX= 0
##$ASSWID= 0
##$AUNMP= <proc_1d>
##$AZFE= 0.1
##$AZFW= 0.1
##$BCFW= 0
##$BC_mod= 0
##$BYTORDP= 0
##$COROFFS= 0
##$CY= 12.5
##$DATMOD= 1
##$DC= 0
##$DFILT= <>
##$DTYPP= 0
##$F1P= 14.0000005364418
##$F2P= -0.99999901652339
##$FCOR= 0.5
##$FTSIZE= 32768
##$FT_mod= 6
##$GAMMA= 0
##$GB= 0
##$INTBC= 1
##$INTSCL= 1
##$ISEN= 128
##$LB= 0.3
##$LEV0= 0
##$LPBIN= 0
##$MAXI= 10000
##$MC2= 0
##$MEAN= 0
##$ME_mod= 0
##$MI= 0
##$NCOEF= 0
##$NC_proc= -2
##$NLEV= 6
##$NOISF1= 0
##$NOISF2= 0
##$NSP= 0
##$NTH_PI= 0
##$NZP= 0
##$OFFSET= 16.522
##$PC= 1
##$PHC0= 80.97854
##$PHC1= 7.194258
##$PH_mod= 1
##$PKNL= yes
##$PPARMOD= 0
##$PSCAL= 4
##$PSIGN= 0
##$REVERSE= no
##$SF= 250.13
##$SI= 32768
##$SIGF1= 0
##$SIGF2= 0
##$SINO= 400
##$SIOLD= 32768
##$SREGLST= <1H.CDCl3>
##$SSB= 0
##$STSI= 32768
##$STSR= 0
##$SW_p= 5175.98343685301
##$SYMM= 0
##$S_DEV= 0
##$TDeff= 65536
##$TDoff= 0
##$TI= <Analysis number 999999
Compound Code 99
Book Reference 9
Project Code 9>
##$TILT= no
##$TM1= 0
##$TM2= 0
##$TOPLEV= 0
##$USERP1= <user>
##$USERP2= <user>
##$USERP3= <user>
##$USERP4= <user>
##$USERP5= <user>
##$WDW= 1
##$XDIM= 32768
##$YMAX_p= 289512862
##$YMIN_p= -353039
$$ End of Bruker specific parameters
$$ ---------------------------------
##NTUPLES= NMR SPECTRUM
##VAR_NAME=  FREQUENCY,     SPECTRUM/REAL,   SPECTRUM/IMAG
##SYMBOL=    X,             R,               I
##VAR_TYPE=  INDEPENDENT,   DEPENDENT,       DEPENDENT
##VAR_FORM=  AFFN,          ASDF,            ASDF
##VAR_DIM=   32768,         32768,           32768
##UNITS=     HZ,            ARBITRARY UNITS, ARBITRARY UNITS
##FACTOR=    0.157963299565203, 1,           1
##FIRST=     4132.6476996994, 0,             0
##LAST=      -1043.33573715361, 0,           0
##MIN=       -1043.33573715361, -353039,     0
##MAX=       4132.6476996994, 289512862,     0
$$ Real data points
##PAGE= N=1
##DATA TABLE= (X++(R..R)), XYDATA
$$ [...]
19423A997K559k637o42p672p157j625J0803N17J380R042K5o771n054p770j758
19408a4763J3317N343J097J621K505k436l566k75l316N474j585r963k623N258
19394c912k139p062L809L090n331m093M530N49L483j0325j986J0114O786l614
19380f101M292K884M541J224k217l429o34K579M252L733r49k71L45m282Q492j685
19364A2774J70l186n907l912m007P77l439J0216K410m924K466Q764l95m327k139
19349E341K827j537k499o384L52p03l193q06O036k535j0212p115k409O589R93
19334a5255N378O396O854Q835L637R8l134o504r046j3703l137M680j89P985L510
19319c595q50N377J565p631j081J1136L040J196p041l022K5o437m585J1372P817
$$ y = [1997, 4556, 1919, 1277, -6395, -13552, -15177, -4374, -3857, -2477, 6565, 6590, -181, -5235, -13005, -14763, -1446, 3897, 4994, 6615, 9120, 6684, 3118, 2843, -473, 5001, 3416, -6547, -9170, -3912, -6051, -13113, -9304, -6214, -11545, -15638, -11108, -10559, -7076, -17401, -19387, -9273, -2487, -6101, -1809, 1075, 5616, 6840, 4623, 1194, 560, 3139, 7391, 11124, 10175, 9904, 10249, 5967, 14459, 12774, 12944, 9758, 3851, -61, -4068, -3291, -6730, 3486, 5896, 972, 3438, 12202, 11807, 7480, 5341, 8168, 6631, 4132, -2252, -1900, -2603, -5796, -6602, -566, -3101, -13313, -20428, -22837, -16248, -15255, -9877, -3481, 3373, 12208, 15845, 15943, 12809, 6305, -2741, -16444, -19581, -14901, -15090, -7105, -3595, -4445, 932, 2497, -5134, -6215, 4921, 7961, 9157, 2116, -906, -881, -7318, -11903, -531, 7286]
19304G286k360o234q919N627m253o515P814Q541J2427K44p779J840L104j431O113
19289A5505M002n340p546j2818o51R862J460m130O163l118k366J841P216p08K136
19274A1508l223n014q147K616l162P781L961n612n573r025N170P492o413q556
19260a6197L237J1341R221L494r04N179n235q459j691O061M431r75m374r307R214
19245E036O294l305m248q165r804L677P126K803J04L981Q794M768m078k747J175
19230A1411j862j0775o710l69j224L809l701k523K896J060m314J1650Q180p860
19216c32P140q430m566R511N740k402o479l421L765n271L2R60K962k161J071J1255
19200I374j991l684K687j486R145Q160j384r4K725J406m925j800N20N328l010
$$ y = [7286, 4926, -1308, -10227, -4600, -8853, -15368, -7554, 987, 13414, 13658, 5879, 7719, 10823, 9392, 15505, 19507, 14167, 6621, -6197, -6848, 3014, 4474, 344, 6507, 3389, 1023, 2864, 10080, 9372, 11508, 8285, 3271, -4876, -2260, -5422, 2359, 6320, 708, -4865, -13890, -8720, -1228, -7641, -16197, -12960, -1619, 7602, 11096, 10192, 15371, 10136, 1677, -14, 6047, 10478, 9503, 5129, -4178, 5036, 11330, 8025, 3777, -4388, -14192, -10515, -3389, -586, -482, 3499, 12293, 17061, 12983, 10236, 11411, 9549, -1226, -7936, -8305, -9529, -5720, -9421, -11944, -9048, -7988, -12302, -652, 7528, -332, 6808, -1622, -6188, 3323, 9063, 6661, 182, -3239, 526, -4745, -4713, -3753, -791, -2952, -1881, 9374, 7383, 3699, 6386, 4900, 14045, 22205, 20821, 20727, 23452, 24858, 19933, 18133, 18653, 23981, 20971]
19185B0971O36J236j3336o710J586M147K516M964J2098K888L763R479K2678M5047
19171A11963L5385J4187O745K895R374K07r170j7461k2905J103J6109K8783K5256
19158B02471o610o843r197P017o189j7311k4787l0097k7317j7045j9387j6615
19146B8090r79m012j1085o785l755M317j1756J306N269K146M840k006J0564o527
19132I627j728N442J482O151k42k655o83n404j778J967k098j522k634n282m483
19117c840K57J359p647m524j801J4762Q593J115j296o063j88L76o08J3119n65
19102A3049m749K428L973j158K620o545l039l830k268O469M354q1J379J944n075
19087I471L946M119j2696j6298N8J960K294K945N190n319K48J906L907N961J430
$$ y = [20971, 21607, 22843, 9507, 2797, 4383, 8530, 11046, 16010, 28108, 30996, 34759, 44238, 66916, 111963, 147348, 161535, 168280, 171175, 180549, 180756, 171586, 154125, 131220, 132323, 148432, 177215, 202471, 195861, 189018, 179821, 186838, 180649, 163338, 138551, 108454, 81137, 64092, 44705, 28090, 27111, 23099, 12014, 5229, 1474, 5791, -5965, -4659, 610, 2756, 7596, 5590, 16154, 9627, 7899, 13341, 14823, 20974, 20732, 18077, 17394, 11990, 10212, 12179, 10081, 8559, 5925, 643, -3840, -3583, -2224, -9871, -14395, -16196, -1434, 7159, 8274, 6978, 915, 727, 1103, 495, 13614, 13049, 8300, 10728, 14701, 13543, 16163, 9618, 6579, 2749, 481, 6950, 11304, 11223, 12602, 14546, 9471, 13417, 17536, 4840, -11458, -11400, -9440, -7146, -4201, 989, -4330, -4082, -2176, 1731, 7692, 9122]
19072I122o10J640M88q58q056o17n785k680K20k197N527P980k937m668o735K78
19056i888J1973L379j1122r236M040P651l061L48j030M807J340J794j328M321
19042C988M660k481l101R327J3269O328m430j2911n597M466l576q901j343j071
19028a373j568q1O397N619n415m470J628J0080O127n171k790m349l770J1874K701
19013A5439J371m027o795o341j656n23O38L323O651N907J948j822o031q011p633
18998g562r62l142N489j835J587N941L241n242J286R573O162j1143j146k58K73
18983B262j909p15N581O520j613m472N88q182o196M590M416k404j243n155P837
18968i5j203Q779K605L534m665O230k635j1069M911j876o026M416Q794l222l613
$$ y = [9122, 8512, 10152, 10640, 9782, 1726, 1109, -4676, -7356, -7136, -9333, -3806, 4174, 1237, -3431, -10166, -9888, 2085, 5464, -5658, -14894, -10854, -3203, -6264, -5916, -6946, -2139, -799, 995, -333, 3988, 8648, 6167, 3066, 12393, 25662, 31990, 27560, 14649, 9052, 13518, 9942, 1041, -302, -1373, -2941, -3022, 3375, 8994, 3579, -891, 737, 10817, 16944, 11773, 8983, 4634, 864, 12738, 15439, 16810, 12783, 5988, -353, -2009, -2532, -1894, 1429, 8080, 13987, 15935, 14113, 8082, 71, -7562, -8524, -11666, -6177, -8012, -6425, -484, 2757, -2485, -1199, 8374, 14536, 3393, 2247, 1989, 2262, 353, -362, 5219, 11739, 10126, 5654, 6242, -1940, -8136, -3546, 870, -1534, -2777, -7932, -95, -1298, 7481, 10086, 13620, 8955, 15185, 12550, 1481, 6392, 4516, -1510, 2906, 11700, 8478, 4865]
18953D865J987J795l812j735J2213Q968m729l959r385r93o090l585j003J0357
18939D894O229m90p958l000P071k564q66R99J933K774l621M125k795k631J989
18924F089J60K702p775n811J0484N329j07k294m933J006K002Q166j149l426o151
18909D292K657O608k809k50P891m382j0627m66J050k669M858K863o194k037K56
18894A041M71M514J36J658J30M913j499l544k882N716q495O35N798L093j917r040
18878G28n75N207o937j014O95P623N86j868p426k269J28Q99k849m539P811N840
18862B040L212P812O056l222N351J791q603r689l710J4276J2952p951q296m048
18848G971k443o793k694O525M507m14m924J73N165j940j1505k171j03Q7Q753N228
$$ y = [4865, 6852, 8647, 4835, 3100, 15313, 24281, 19552, 15593, 6208, 5215, -875, -4460, -5463, 4894, 11123, 10633, 2675, -325, 6746, 4182, 3316, 4315, 6248, 9022, 5401, 9526, 6731, 4100, 6089, 6249, 8951, 1176, -4635, 5849, 11178, 11071, 8777, 3844, 4850, 6852, 15018, 13869, 10443, 4292, 6949, 13557, 10748, 10498, 18389, 14007, 3380, 2914, 3964, 1295, 6153, 9016, 2822, 785, 1041, 1512, 6026, 6162, 7820, 7950, 12863, 11364, 7820, 4938, 10654, 2159, 2794, 8592, 11685, 9768, 728, 153, 5360, -1577, -2591, -1896, 5727, 6313, 4445, -2981, -5250, -5122, -4223, -7072, -11611, -3800, 2040, 5252, 13064, 19120, 15898, 21249, 23040, 14437, 4748, 1038, 15314, 28266, 20315, 12019, 7971, 5528, -1265, -3959, 2566, 7073, 6659, 1735, 1908, 7073, 5133, -6372, -8543, -8646, -8559, 194, 5422]
18832E422q090o266o26j857K777N999K91o042m043K538M230N895M711N297J0421
18817B0657j514n29J958p643o825J999L393m396O069R412j025j1239n010L244
18803H551j94J0488K646L80p845o96L166L878j133k800o661q027r680L790L928
18788b09L505J1453J0170N748L804N348O239l506q338j0032j226o816R823P450
18774C3413n394j601L968K925k880p796M735J5453K2209J8954K5765J0834J747
18761A22332n897k2417k9006r558o345q705j3278j1691Q43J706m026n583o823
18748A552O100M801rL791q26J705O345J618N221j0358q163r991P028O701j887
18733A3628J712J0467p835q396j6423q48K860J4456Q736r42Q80j47o362m715k52
$$ y = [5422, -2668, -8934, -9560, -11417, -8640, -2641, -2350, -8392, -12435, -9897, -5667, 228, 4939, 10236, 20657, 19143, 18614, 20572, 12929, 6104, 8103, 11496, 7100, 13169, 22581, 21556, 10317, 5307, 8551, 8357, 18845, 21491, 21871, 14026, 13330, 16496, 20374, 19241, 16441, 9780, 1753, -7927, -4137, -209, 3296, 14749, 24919, 30667, 34471, 39819, 46058, 42552, 34214, 24182, 22956, 16140, 25963, 33413, 28019, 26418, 30386, 33311, 30431, 22635, 27370, 42823, 65032, 83986, 109751, 120585, 122332, 116435, 94018, 65012, 55454, 49109, 40404, 27126, 15435, 16278, 17984, 13958, 8375, 1552, 7652, 12453, 12444, 16235, 15409, 17114, 23459, 25077, 30298, 19940, 11777, 1786, 8814, 15515, 13628, 15340, 25807, 17972, 9576, -6847, -7695, -4835, 9621, 18357, 17415, 18295, 18148, 11786, 7071, 6819]
18718F819N617J0809l87o95p652k721J753p572q178L656Q780K797l01j0028n43
18703B154r80j411Q496O133J990K510r873j825j840M799j0899q542p217m106l177
18688b3788o699m608M054Q009K4402J9278K880L939J1448Q944P914k463j621j0176
18674D1513r783J0190J8512P217J463Q018J7542Q750R253O052l671o906p351j2436
18660H8363r560N27J39j42K983O973k812j0581j2293j323R116k120M756J597j0556
18645F5067J1073J306M620p629m169k849M671J1364J121M253m837p935j6999P247
18631F6304O272O373l5M506R259L549j657m214p06K367M052R921q655n582J083
18616I2837J0366R505l279k479o725l295J945Q609O402O710p372l948m204m70
$$ y = [6819, 12436, 23245, 22858, 22163, 14511, 11790, 13543, 5971, -2207, 1449, 10229, 13026, 12725, 2697, 2154, 1174, -237, 8259, 14392, 16382, 18892, 9019, 7194, 5354, 10153, -746, -9288, -16505, -20611, -23788, -30487, -35095, -31041, -23032, 1370, 20648, 23528, 27467, 38915, 47859, 55773, 53310, 51689, 41513, 31730, 41920, 60432, 67649, 69112, 77130, 94672, 103422, 112675, 118727, 115056, 108150, 100799, 88363, 78803, 79330, 79469, 79327, 82310, 89283, 86471, 75890, 63597, 62274, 71390, 69270, 74026, 75623, 65067, 76140, 77446, 82066, 74437, 70268, 67419, 72090, 83454, 84575, 88828, 83991, 76056, 59057, 66304, 72576, 78949, 78914, 83420, 92679, 96228, 94571, 90357, 89651, 92018, 96070, 105991, 97336, 91754, 92837, 103203, 112708, 109429, 106950, 100225, 96930, 98875, 107484, 113886, 120596, 113224, 109276, 105072, 104602]
18602A04602J425J970N322M232M952M737l846o978N523K421j475K390J2249R735
18588A47259k564j0410L853J2309K433R843R675r340l24J4408Q005M767R817J0377
18574B10108J6598K2519M1285M3695M1478K5395K2254N847J8162J7756P857k865
18562D70089M661J0322K9204M1487M8250K6783K2833N3224P0208P1341N5145L0945
18550I34492L1065N9652P8889O9966M8315M5159O5395Q8551J23649J61661J71672
18539A878466J99919K80214L87056N42356P29410J073234J734196L040851N358361
18530A5224063P583850N766301J757018J12118O91830K272238P96709k280579
18522C1923548l757564m014222j798191K722719N486930K968302j41332q23383
$$ y = [104602, 106027, 107997, 113319, 117551, 122503, 127240, 123394, 116416, 121939, 124360, 122885, 125275, 137524, 147259, 144695, 134285, 138138, 150447, 152880, 162723, 172398, 163058, 162734, 177142, 185147, 189914, 199731, 210108, 226706, 249225, 290510, 334205, 375683, 401078, 423332, 429179, 447341, 465097, 472954, 470089, 474750, 485072, 514276, 555763, 604013, 630796, 653629, 706853, 777061, 848402, 903547, 934492, 965557, 1025209, 1104098, 1174064, 1222379, 1267538, 1332933, 1421484, 1545133, 1706794, 1878466, 2078385, 2358599, 2745655, 3288011, 4017421, 5090655, 6824851, 9865702, 15224063, 22807913, 28574214, 30331232, 30443350, 31135180, 33407418, 34204127, 31923548, 28165984, 24151762, 22353571, 25076290, 30563220, 33531522, 33390190, 32566807]
18514C2566807L23476J175167j460472m229029n768441o351508n082975l083451
18506H089574j756610j092585p78052o11299m76626l51016k72429k34057k24470
18497B292430k05093j75915j42670j13484j22936j21256j04963q8577p6141o8970
18487A072425n8192o0536o6420o1733o0252m4452m2432l3895l2416l9187m0904
18476E32006k5641k1088J711j07j7702k2688j5396j9082l0594l1573l9653m0263
18464B69930k9325j5542j0492j5897j8840n752j1071r412p359j7895k767L928
18452A29506n378q812p113m062p004l71j1212J845L749N181m306j0268n586K162
18438G8331j028j838P539j407l020q478J708j0523P955n301J855l891j1308J4780
$$ y = [32566807, 32890283, 34065450, 32604978, 28375949, 22607508, 16256000, 11173025, 8089574, 6332964, 5240379, 4462327, 3851028, 3374402, 3023386, 2750957, 2516900, 2292430, 2087337, 1911422, 1768752, 1655268, 1532332, 1411076, 1306113, 1217536, 1141395, 1072425, 1014233, 953697, 887277, 825544, 765292, 720840, 678408, 644513, 612097, 572910, 532006, 506365, 485277, 486988, 486881, 469179, 446491, 431095, 412013, 381419, 349846, 310193, 269930, 240605, 225063, 214571, 198674, 179834, 174082, 163011, 153599, 146240, 128345, 125578, 129506, 124128, 115316, 108203, 104141, 97137, 96766, 85554, 87399, 91148, 96329, 92023, 81755, 76169, 78331, 77303, 75465, 83004, 81597, 78577, 70099, 71807, 61284, 69239, 63938, 65793, 61902, 50594, 65374]
18424F5374K8616K1902J7882J0668j702n235O466k938n049n307j2987j1606m78
18411A05606K0176J8880L068l414j028Q959N475L612k0287l4394k3257r371q895
18398F5130K080J925r036m839j918J616O867R732j055N224R228M354O64n575o789
18383G7608k899j3076j3938n208M195p052j2831K843j132N942N824k302L063n748
18369C5289j3250L309J3006J0070n627r492j2974M731J0608L647Q952M489J3373
18356F6131K8045J2637j890r797p286j8336m913J863p462j0174j256J652O68m47
18342D9435L885N944r683n919P006m334n639m098m341L684L865n194l382R744
18328D0973P1o271K037n32q166p394J2511M431O326M916j939k205l032K718m8
$$ y = [65374, 93990, 115892, 133774, 144442, 142740, 137505, 143971, 141033, 135984, 130677, 117690, 106084, 105606, 125782, 144662, 147730, 144316, 143288, 152247, 157722, 161334, 141047, 106653, 83396, 74025, 65130, 67210, 69135, 60099, 55260, 53342, 54958, 61825, 71557, 70502, 75726, 84954, 89308, 89972, 84397, 77608, 74709, 61633, 47695, 42487, 46682, 39630, 26799, 29642, 28510, 34452, 40276, 37974, 41037, 35289, 22039, 25348, 38354, 48424, 42797, 33305, 20331, 25062, 35670, 39317, 48269, 52758, 66131, 94176, 106813, 104923, 95126, 87840, 69504, 64591, 66454, 58992, 48818, 47562, 49214, 49882, 49435, 53320, 59264, 49581, 43662, 50668, 46334, 40695, 36597, 32256, 35940, 39805, 34611, 31229, 40973, 41044, 34773, 36810, 36278, 28112, 20718, 33229, 37660, 43986, 48902, 46963, 44758, 41726, 44444, 44396]
18313D4396N934O671o64j1242O374L204n53p6m054o068o405p166r46p145J345
18298B3605q65o339K25K306R18M195k041M426K647L027n513p222J840J2843M331
18283C8383k513k406j0102o949k669K86K661K003P123J909o41j2256R14l620m115
18268H008o593n642L373J092m79j860N301J4373J5337J2247P272Q99m464K687
18254E1551O664M741k231m083k105j625p6K084J1096J6632K6320L8746N6652O7555
18240B71921R2005Q4899L7355k6288p0723q3440p9634o3407m0992n737q339j3218
18228I4402r692r405j3246K807j0708j1624p04k461J0016N978R289N633K212m196
18214F8301n529P763n401j5617m275M031M539l76R118o868j0849o114N81L01q634
$$ y = [44396, 50330, 57001, 56337, 45095, 51469, 54673, 54120, 54044, 49990, 43922, 37517, 30351, 29405, 22260, 23605, 22740, 16401, 16626, 18932, 19850, 24045, 22004, 26430, 29077, 32104, 26591, 19369, 21209, 34052, 38383, 35870, 33464, 23362, 16413, 13744, 14030, 16691, 18694, 25817, 27726, 27085, 14829, 15743, 12123, 8008, 1415, -4227, -854, 238, -241, -2101, 3200, 17573, 32910, 45157, 52429, 53328, 48864, 51551, 58215, 62956, 60725, 56642, 54537, 52912, 52836, 54920, 66016, 82648, 108968, 147714, 204366, 271921, 363926, 448825, 486180, 459892, 389169, 305729, 226095, 162688, 121696, 115959, 107620, 94402, 84710, 75305, 62059, 64866, 54158, 42534, 41830, 39369, 49385, 55363, 64652, 70285, 72497, 68301, 62772, 70535, 65134, 49517, 45242, 49273, 53812, 53436, 62554, 55686, 44837, 38723, 39304, 39605, 30971]
18199C0971l590l92q993Q376Q229j0166j513o107p147l645L060J1335J1368o58
18185C1128q24N096O441l724M334L246j4975K992K603q325L379P984p264j760
18171C0331K26o415j606P101k74o875N824J190K492n774O526P048k665q185L292
18156C2236O298p668j894j281N433J7047j006j385k311k454o930L764N655O782
18142E2286J1230J2130J578o296O502R146j90j533j1167j752N071J3347J6235
18129A06587K5744K0104J6413J1225J2138J8622O310P948K3058K4802K5450L4847
18117C33248O0781P3255Q3485J06408J38561J91663K95372M59100P69774J391763
18107C903410K725404M960988M756486M16281k065385l477114m021073k834451
$$ y = [30971, 27381, 26989, 17996, 26372, 34601, 24435, 22922, 16815, 9668, 6023, 9083, 20418, 31786, 31128, 30304, 35400, 41841, 38117, 42451, 45697, 30722, 33714, 36317, 27992, 31371, 39355, 32091, 30331, 30557, 24142, 22536, 29637, 29363, 22488, 28312, 29502, 31994, 26220, 32746, 39794, 37129, 28944, 32236, 38534, 30866, 28972, 27691, 33124, 50171, 49165, 47780, 45469, 43015, 36085, 39849, 45504, 52286, 63516, 75646, 77224, 70928, 77430, 86576, 86386, 84853, 73686, 71934, 77005, 90352, 106587, 132331, 152435, 168848, 180073, 192211, 210833, 217143, 225091, 248149, 272951, 298401, 333248, 394029, 467284, 550769, 657177, 795738, 987401, 1282773, 1741873, 2511647, 3903410, 6628814, 11589802, 16346288, 16762569, 14697184, 11220070, 7198997, 4364546]
18099D364546j455190p58132m66252l22312k29188j68474j30160r5139q2218o6367
18089E91114o5854m7805n3843n5759l5704k0276l1248k6992k3479k6623j5892
18078A87639k391o29j3399j8023o930j1860j5028o387m866N947k231j0278j6523
18065H5041l020q01n719M382n440j731k153m048l798j719m14N030m877j0970p308
18050D2455J835J154m362L515K802M604j2105m596r461l102N867o39J1486L461
18036D2914n430N327K779J94O802n01j1050j1425K17L763p25j422o577Q87J310
18021B7063k25R46j461J121L870O432J425o857j0905n305p11O673J2517N562P426
18006D7571l655m925k648j883l271P271J420n736k142j496j0656K997n896k20
$$ y = [4364546, 2909356, 2151224, 1684972, 1362660, 1133472, 964998, 834838, 739699, 657481, 591114, 525260, 477455, 423612, 367853, 332149, 311873, 280625, 253633, 230154, 203531, 187639, 185248, 184619, 171220, 153197, 146267, 134407, 119379, 112992, 108126, 114073, 111842, 101564, 85041, 82021, 81220, 75501, 79883, 74443, 72712, 70559, 66511, 62713, 60994, 60580, 65610, 60733, 49763, 42455, 44290, 45444, 41082, 44597, 47399, 52003, 39898, 35302, 25841, 22739, 28606, 27967, 39453, 42914, 37484, 42811, 45590, 45784, 52586, 52085, 41035, 29610, 29827, 33590, 32865, 31443, 24866, 25753, 27063, 26838, 27784, 26323, 27444, 31314, 37746, 39171, 32314, 21409, 16104, 15393, 22066, 34583, 40145, 47571, 43916, 38991, 36343, 34460, 31189, 38460, 39880, 34144, 32002, 30506, 19850, 22847, 16951, 16731]
17992A6731L911r039k209P830M635j0831j316P848K528p17p017j5537j6348j3179
17978c2710j1454Q440J1448J2038J5711Q538J1185R40m955p411L282k315M408
17965A7145n2M245k83L119J266l65r372j4149k48M758k866o726k993J0841L614
17950G934J632J9055R726N67k057m851o763Q25r004n847M759P210r67R31K950
17935B6100L087k117Q281m203o229l053J399J202k526R44J1557J8233k004m193
17921D6478O652j25k707p570j0221l291l10P145k471q714m866m433k294K658P393
17906B3324m987N972j317M129Q954P090o696l928K762K635M4J1867n611j3308
17892C0930l726O553J0052O187q416p858o955L652N164P033K3423J8792J3718
$$ y = [16731, 20642, 11603, 9394, 17224, 21859, 11028, 9712, 17560, 20088, 19371, 12354, -3183, -19531, -32710, -44164, -35724, -24276, -12238, 3473, 12011, 23196, 24136, 19181, 11770, 15052, 12737, 17145, 17093, 21338, 21055, 24174, 25440, 25075, 15703, 1554, 1306, 6064, 3198, -3528, -6521, 4320, 7934, 9566, 28621, 38347, 38914, 36857, 32006, 25243, 26068, 17064, 11217, 15976, 23186, 22219, 23150, 26100, 29187, 27070, 35351, 31148, 24919, 21866, 23265, 24467, 21941, 22885, 34442, 52675, 50671, 46478, 53130, 53005, 50298, 42728, 32507, 29216, 28906, 36051, 33580, 24866, 20000, 15567, 13273, 15931, 23324, 18337, 24309, 22992, 27121, 36075, 43165, 36469, 32541, 35303, 37938, 37982, 49849, 44238, 30930, 27204, 33757, 43809, 49996, 41580, 33722, 26767, 30419, 35583, 42616, 66039, 84831, 98549]
17879I8549L0691L4163Q871J687P378M681O24j3559k2269k0209n641J5448K8620
17866A69034K0528L715q473p303n710m146n596j9960k7376j8894j8084r800j3675
17853E4260p571r019k277M261L535q996l017N698j333j0560k213K078n358o990
17839A2498J3017K825o984L305j233q808j6856j1102q683k386j3820r067p677
17826e4971j1478Q91K4934N5535P4243O1437K9897m328j9396j6055j3031j8240
17814A09438j0137n228M650J253j7817r902j0900k140Q309R062N441L521m586
17801H0964j722o938N16K900o130M374J6520K0172J4778j2215j4262k2127q085
17788F8745J1522j413r811k42n353J806O426K802K454m057k740l905j1229Q255
$$ y = [98549, 129240, 163403, 172274, 173961, 181339, 186020, 186644, 173085, 150816, 130607, 124966, 140414, 169034, 189562, 193277, 184804, 177501, 171791, 167645, 162049, 142089, 114713, 95819, 77735, 67935, 54260, 46689, 37670, 35393, 39654, 43189, 34193, 31176, 36874, 35541, 24981, 22768, 24846, 19488, 12498, 25515, 28340, 21356, 24661, 23428, 14620, -2236, -13338, -22021, -24407, -38227, -47294, -54971, -66449, -65558, -40624, 14911, 89154, 150591, 180488, 176160, 156764, 140709, 127678, 109438, 99301, 94073, 98723, 99976, 82159, 72257, 61357, 59217, 67526, 76588, 82029, 85550, 80964, 79242, 72304, 72820, 75720, 69590, 73964, 90484, 110656, 125434, 113219, 98957, 76830, 68745, 80267, 78854, 69043, 68801, 63448, 65254, 71680, 74482, 76936, 72879, 70139, 66234, 55005, 63260]
17774F3260P682L502K706k74l543L592N398K799p329l939L059j126k656L41L732
17759G7204o744K21P893K716j623l745N500j497m488J737J725m605l41J0812p32
17744H4033m361r131J771J2594J3917P428Q427L925O145J0329N256J3642R732
17731A63707L124k418j1778n755J896n273J0794J5821M075L27M294j17J1963K0635
17717B11295J8013J6701L4946N0908O9906P6803N8038P4482O8010K7598j6686
17706F90014n6805o4569m7515k2077k674J8997K3728K3791L4475L3716K9364N5644
17694G16089R2612J42807J97879J96072J42435P4129L9135K9969M6859P0783Q5188
17683A833957J05373J58419K49993L81402N29674O38805O97304Q28898J122503
$$ y = [63260, 70942, 74444, 77150, 76876, 73333, 76925, 82323, 85122, 77793, 73854, 76913, 75787, 73131, 73472, 77204, 70460, 70681, 78574, 81290, 79667, 75922, 81422, 79925, 75437, 77174, 78899, 74294, 73953, 84765, 84033, 79672, 70541, 72312, 84906, 98823, 106251, 114678, 118603, 124748, 135077, 140333, 153975, 163707, 166831, 164413, 152635, 146880, 148776, 143503, 154297, 170118, 174193, 174520, 178814, 178697, 190660, 211295, 229308, 246009, 280955, 331863, 401769, 478572, 536610, 611092, 679102, 706700, 690014, 633209, 568640, 521125, 499048, 496374, 515371, 539099, 562890, 597365, 631081, 660445, 716089, 808701, 951508, 1149387, 1345459, 1487894, 1562023, 1601158, 1631127, 1677986, 1748769, 1833957, 1939330, 2097749, 2347742, 2729144, 3258818, 3897623, 4594927, 5423825, 6546328]
17674F546328J709920K715485M503128P800261J3525536K0300323K1491865J2630703
17666I1223549j616693j3194886j8667826j8102411j3387945q177334m728658
17659A3347796k891521j914142j313721r13265o69640n60260n31964n04461m59216
17650C589606m04853l44184l07267k67484k23946j67785j08774k7411Q918j6211
17640A730609r6408j51301j79361j71986j46183j05814o5519m1678k6816j5976
17630G29567k9501m4496m0849j9166k0321l9796m8161n1373m6917m5560k7716
17619C15711k1661n344l864r176j0724j0985q983M759L5257K9153K4807J9078
17607C58028o159k0569k0336j7766k2695k8291l1535l0855k4496r928r003q321
$$ y = [6546328, 8256248, 10971733, 15474861, 23275122, 36800658, 57100981, 78592846, 91223549, 89606856, 76411970, 57744144, 39641733, 26253788, 18076454, 13347796, 10456275, 8542133, 7228412, 6315147, 5645507, 5085247, 4553283, 4048822, 3589606, 3184753, 2840569, 2533302, 2265818, 2041872, 1874087, 1765313, 1737902, 1746820, 1730609, 1634201, 1482900, 1303539, 1131553, 985370, 879556, 814037, 772359, 745543, 729567, 700066, 655570, 614721, 595555, 575234, 535438, 487277, 435904, 388987, 343427, 315711, 294050, 288706, 284842, 275666, 264942, 253957, 244974, 249733, 284990, 314143, 338950, 358028, 351869, 331300, 310964, 293198, 270503, 242212, 210677, 179822, 155326, 145398, 136395, 128074]
17595A28074n564L114q940P52j409j3886j2792k362L279j0794r83J923n735K987
17581G7664K572j2928j3535n970J602Q475q736o173j19K699k176K196j395o266
17567C7910q629M835m711p604N685J2297R481k080J1133O197q876q508j987p880
17553C7263k344q89P641m449j3195l385k903j65k477j903K0879J7705R624m459
17539E6943J154K964j3172r957j2454j3784p612K496k558N50J244n137k19n372
17525d914n412m593q269j2516q472m202r294o044j1436j4451j0521J989Q904J8753
17511g0478M6694N3829N0327L1704j645j279K942M42k37l576L299M92J3743J1216
17497A37473J6354J2313J0801p66k3254k4666j8712j7797k986L674M853K1364
$$ y = [128074, 122510, 125624, 116684, 117436, 116027, 102141, 89349, 86987, 90266, 79472, 78489, 80412, 74677, 77664, 80236, 67308, 53773, 47803, 49405, 57880, 49144, 42971, 42852, 45551, 43375, 45571, 44176, 37910, 29281, 34116, 29405, 21801, 27486, 39783, 49264, 47184, 58317, 64514, 55638, 47130, 45143, 37263, 34919, 34030, 41671, 37222, 24027, 20642, 17739, 17574, 15097, 13194, 34073, 51778, 61402, 56943, 58097, 61061, 47889, 37932, 25478, 11694, 4082, 6578, 4020, 4570, 5814, 677, 458, -4914, -10326, -14919, -23188, -35704, -44176, -48378, -57672, -63716, -75152, -89603, -100124, -98135, -89231, -70478, -23784, 30045, 80372, 112076, 110431, 109152, 112094, 112536, 112299, 108723, 112022, 112514, 126257, 137473, 153827, 166140, 176941, 176175, 152921, 128255, 109543, 91746, 88760, 92434, 97287, 118651]
17485A18651K5439J2328J479j0705j7775k0442j1881k7977j2773K5618M9941L6272
17473A68175K0329l996p041j8292j3878j7710j7958j2999l393K2654L5918L1331
17461A83140J2824j2759l2808l8316l0518k1650j4684j1090k192Q851o94n55J083
17448D0632k749J757K227n198k646o502J611N390K6037L1350J8962l568r249j6337
17434H1717k3569j2899k767K757r619j4098m49K751K046M660l75l863m036J0584
17420C2840R006N195M660L890j2196j5706m055M863o694k958k980N900L710j7658
17406G817k513Q65J688k752n68P183Q468k436j7576L511L547k718O382Q104j177
17391A7825j613k636o505O15k04o724o095N732R05j156J5532O465p96l824j289
$$ y = [118651, 144090, 156418, 157897, 147192, 129417, 108975, 97094, 69117, 56344, 81962, 131903, 168175, 188504, 184508, 177467, 159175, 145297, 127587, 109629, 96630, 93237, 115891, 151809, 183140, 195964, 183205, 150397, 112081, 81563, 59913, 45229, 34139, 31947, 40798, 40104, 39549, 40632, 37883, 39640, 41867, 36669, 34023, 27521, 29132, 34522, 60559, 91909, 110871, 107303, 98054, 81717, 58148, 45249, 42482, 45239, 35620, 21522, 21073, 23824, 25870, 30530, 30155, 26292, 22256, 32840, 41846, 47041, 51701, 55591, 43395, 27689, 23634, 28497, 21803, 18845, 15865, 21765, 25475, 7817, 5304, 6169, 7857, 5105, 4537, 11720, 20188, 17752, 176, 3687, 7234, 4516, 10898, 19002, 17825, 16212, 13576, 7071, 7686, 7482, 758, -5337, 395, 1300, 144, 15676, 22141, 21345, 17521, 16232]
17376A6232r628J633M903k834Q92l033p855L541k628J636K376p920p879N085J1042
17361E563P897J0562J7528J0943J8966J6796P44j3227j9325j7062k805o190j2893
17348A7497L23q124o636J0918M060l000P583k215N652M058M098k646m203P30J853
17333B9948k537j3l778M671J371m765J701J1518M957P15p615l450p798n676o952
17318A2297m02P95L716Q371J1385m91j406n113L412P341O58Q782n093r196J05
17303C5161M628R748N366M140p28l257j1406l098o669k105M11M542J873q872j1699
17288A8035k834K221O434k641o909j116Q71J305N776J645j020o87m648l193r98
17273A2241j55m505N99M480r23R158R330q51n681m412k776N970J041j930l431
$$ y = [16232, 6604, 8237, 13140, 10306, 11198, 8165, 310, 3851, 1223, 2859, 5235, -2685, -10564, -5479, 5563, 13460, 24022, 41550, 52493, 71459, 88255, 88999, 75772, 56447, 39385, 36580, 30390, 17497, 17820, 9696, 3060, 13978, 18038, 15038, 22621, 20406, 26058, 30116, 34214, 31568, 27365, 28095, 29948, 27411, 27398, 23620, 28291, 29662, 24897, 26598, 38116, 43073, 43788, 36173, 32723, 24925, 19249, 12297, 11895, 12690, 16406, 24777, 36162, 35671, 34265, 29152, 32564, 39905, 40563, 49345, 44252, 35056, 35161, 39789, 49537, 54903, 59043, 58315, 55058, 43652, 40554, 33885, 31780, 32191, 36733, 38606, 29734, 18035, 15201, 17422, 23856, 21215, 14306, 13190, 14061, 15366, 21142, 22787, 21767, 21080, 16432, 13239, 12241, 12086, 7581, 8180, 12660, 11737, 20895, 30225, 29374, 23693, 19281, 16505, 22475, 23516, 21586, 18155]
17258A8155J649L782l069q970j607R04q042j5944j6034j225R806J4896P759M356
17244F416m97m748R01n75M306r275q703l757J3479J3635J6746L2825M0142J8409
17230A19304n85J0627J3116Q105m328j5738k0956k4710k5792m311j1795j2278
17218C0659j8549r237m064L098Q652K3802M6735N6458L4189J0242K498J8744K3039
17205B26266J0742k241j9099k7243k1308j5621j3705p331j0539j3010m697L58
17193A02572P268j328J247k081o015n806k944k03R57P634J1075R716m191q247
17179A09654m288m543j912J512K798o585j4751j512P989J1162j519l992r635n992
17165G8386k598l324R45P162J5949O685K974J006L894l552j2768k681Q957L466
$$ y = [18155, 19804, 23586, 20517, 11547, 9940, 10844, 2802, -13142, -29176, -30401, -20595, -5699, 2060, 6416, 5919, 1171, 2072, 1497, 5803, -3472, -12175, -15932, -2453, 11182, 27928, 60753, 100895, 119304, 118719, 129346, 142462, 150567, 146239, 130501, 109545, 84835, 59043, 54732, 42937, 30659, 12110, 2873, -1191, 1907, 10559, 34361, 81096, 137554, 171743, 181985, 184483, 203227, 226266, 237008, 234767, 215668, 188425, 167117, 151496, 137791, 130460, 119921, 106911, 102214, 102572, 109840, 108512, 109759, 107678, 101663, 95857, 92913, 92710, 93667, 101301, 112376, 122092, 117901, 109654, 105366, 100823, 98911, 100423, 103221, 96636, 81885, 80373, 88362, 99524, 98005, 94013, 84378, 78386, 75788, 72464, 73409, 80571, 96520, 103205, 106179, 107185, 111079, 107527, 94759, 92078, 101035, 104501]
17151A04501L040R54k807M092R068Q879L342n906l312J0073J0535K832K545o696
17137A41140n697j6223o806O544R010O530j638J1960J4230O372J3725N678O824
17124A91649J0505M885J2641J4221J1677O330M7M21l06N412P208R591K7045L0992
17110C32318L8658L5701L4299L3879K3705M1149N2043M3647L9063K0135J1103
17099G05700K6283M2856N8024O1013O0105P8755J14111J72355K10327K36293K29011
17088A994833K20728K20268K68840L89214O51567J087065J821064L160111N043689
17079A4857379N681904L998964J312695J27982O81235Q60917m84560k815187m404833
17070A9816496m864279m162002k705838j431346o91681k75535K7262L34478P77177
$$ y = [104501, 107541, 108495, 105688, 109780, 118848, 127727, 131069, 125163, 121851, 131924, 142459, 145291, 147836, 141140, 135443, 119220, 112414, 118958, 127968, 134498, 132860, 144820, 159050, 165422, 179147, 184825, 191649, 202154, 207039, 219680, 233901, 245578, 251908, 251955, 252376, 252070, 257482, 264690, 274281, 301326, 332318, 370976, 406677, 440976, 474855, 498560, 539709, 591752, 635399, 674462, 694597, 705700, 731983, 774839, 832863, 893876, 953981, 1032736, 1146847, 1319202, 1529529, 1765822, 1994833, 2215561, 2435829, 2704669, 3093883, 3745450, 4832515, 6653579, 9813690, 14857379, 20539283, 24538247, 25850942, 25978924, 26660159, 27521076, 27036516, 24221329, 19816496, 14952217, 10790215, 8084377, 6653031, 5961350, 5685815, 5713077, 6047555, 6824732]
17061F824732J449922K638382M738757P232769P212234M269199Q80622o4820Q07204
17052C5989001N30152j688381m613219o346327o580988n317782l398437j970510
17044F603509j199338q25072o14461m79493l79921l27925k93718k60511k34307
17035A988763j93143j50063j18441r7599r0163q1484o8033p1364p6918o5779n3173
17024I22603l3287k2797k9249m9779n7809l8151k1039l8399n4927o2032n4001
17013D61133m3538l9255k4708r682k0769k4992j0034o807p025j4428j161O274
17001B65008K685o671j3138j0021L982m69Q573N011n401p593j2799l041r900o023
16987B10203O552Q464J2344R576K422p59P320O270P154J8000j908J2199J5319
$$ y = [6824732, 8274654, 10913036, 15651793, 22884562, 30096796, 34365995, 35246617, 35181797, 35989001, 36519153, 34830772, 30217553, 23871226, 17290238, 11972456, 8574019, 6603509, 5404171, 4579099, 3964638, 3485145, 3105224, 2777299, 2483581, 2223070, 1988763, 1795620, 1645557, 1527116, 1429517, 1339354, 1257870, 1189837, 1118473, 1041555, 975776, 922603, 889316, 866519, 837270, 787491, 729682, 691531, 670492, 632093, 577166, 515134, 461133, 417595, 378340, 353632, 343950, 323181, 298189, 288155, 281348, 274323, 259895, 258734, 265008, 267693, 261022, 247884, 237863, 241845, 241376, 249949, 254960, 249559, 241966, 229167, 226126, 216226, 210203, 216755, 225219, 237563, 247139, 249561, 248802, 256122, 262392, 269546, 287546, 285638, 297837, 313156]
16974C13156P940K2948L3511M4779N9759M4617P726j7672j1626K733K5737N1376
16962E84984P7263P1385M1338M8763M8380L3975K0401J7927K6474P0258J21976
16951A163124J75220K11055J97414J85816K04643K68801M09253O32443J040819
16942D488588J758374L139846N740134Q747002O308717p2241l640861n873631
16934B0595928n999314l789765j578087o5944J303714L222313O211645Q084525
16926B7985015L520257j862182m619246o183186n239086k702097m94205J501292
16918A1906562M036403N943468K938384j235466l410993m770589m293002k499867
16910H614900j023759o906J059848K702505N173579N694881J252698k259072m175252
$$ y = [313156, 321096, 344044, 377555, 422334, 482093, 526710, 534436, 516764, 505138, 507871, 533608, 584984, 662247, 733632, 774970, 823733, 872113, 906088, 926489, 944416, 970890, 1041148, 1163124, 1338344, 1549399, 1746813, 1932629, 2137272, 2406073, 2815326, 3447769, 4488588, 6246962, 9386808, 15126942, 23873944, 30182661, 30110420, 26469559, 20595928, 14596614, 10806849, 9228762, 9162818, 10466532, 13688845, 19900490, 27985015, 31505272, 29643090, 25023844, 18840658, 13601572, 10899475, 10405270, 11906562, 15942965, 21886433, 24824817, 23589351, 20178358, 15407769, 11114767, 8614900, 7591141, 7584235, 8644083, 11346588, 16520167, 22215048, 23467746, 21208674, 17033422]
16901A7033422n094541m035390k357127j309993p98761n26039l64773k42832j50525
16892B153441j22880j34882j58509j81669j78917j68161j45382r8701o0893k4982
16882H78465J3954J6820l2191n0381n2225o2671l2963m5029n1984n2079l5235
16871D94481k0002r245n879j8336k1608k3622j1195q966l2168k1455k0618l7674
16859B63713k2371j4873l072l45K7384L2619n849j2733k5911l3113k5607k0118
16847A59724j3454L120J0599J0297J3495N107j0227j2194j8637j8850o398l013
16835A19569n217r86k923q797n847j881P01l386r658j0716J340J2930Q3k757k73
16820H2182j984m473l400j334k105Q30N083N599N394k035M80M548j2137p863l272
$$ y = [17033422, 11938881, 7903491, 5546364, 4236371, 3437610, 2911571, 2546798, 2303966, 2153441, 2030561, 1895679, 1737170, 1555501, 1376584, 1208423, 1063041, 964340, 903447, 878465, 892419, 909239, 877048, 826667, 774442, 711771, 678808, 633779, 581795, 529716, 494481, 474479, 465234, 459355, 441019, 419411, 395789, 384594, 375628, 343460, 322005, 301387, 263713, 241342, 226469, 223397, 223052, 250436, 283055, 277206, 264473, 238562, 205449, 179842, 159724, 146270, 149390, 159989, 170286, 183781, 188888, 178661, 166467, 147830, 128980, 122582, 119569, 114352, 113366, 110443, 101646, 95799, 93918, 94619, 91233, 81575, 70859, 72199, 85129, 85212, 82455, 82182, 80198, 75725, 72325, 70991, 68886, 69716, 74799, 80398, 85792, 83757, 84237, 88785, 76648, 68785, 65513]
16805F5513j520p52M093Q066J167m853k099j0624j3844o866L502j132J5499J2220
16791F8370j012j0648j1743m951j3339j2832j0926r957M404K6359L1004J8718
16779G3447O437m738j4976r994j1203q525r039j301N624J5069J8020K819l225
16766E8415n265p345n659l373M308J2966J9258Q165l036r210j2755j9693o550
16753C0226J432r619R04m301o0P600J8757J8312O36L267M365O98j4572n982j414
16738E0249j32m082l872l535m244J513R863r4r680p054j388P50j1533o822P230
16723A7169Q817R139L79p037p627l051J4J51o557n261L61j315J494J0193J0568
16708B7437j508N620j129o647n308o904m391O899Q763J2417J255j1703N85k218
$$ y = [65513, 63993, 63241, 67334, 75400, 76567, 71714, 69615, 58991, 45147, 38281, 41783, 40651, 56150, 68370, 67358, 56710, 44967, 40016, 26677, 13845, 2919, -7038, -2634, 23725, 54729, 73447, 79884, 75146, 60170, 50176, 38973, 30448, 21409, 20108, 25732, 40801, 58821, 61640, 58415, 53150, 45805, 40146, 36773, 41081, 54047, 73305, 81470, 78434, 69224, 56469, 36776, 30226, 31658, 22039, 22943, 18642, 18582, 26182, 44939, 63251, 63887, 67154, 71519, 72217, 57645, 51663, 50249, 50117, 46035, 42163, 38628, 34384, 35897, 45760, 45666, 35986, 28932, 27544, 28294, 16761, 9939, 17169, 25986, 35125, 35504, 28467, 20840, 17789, 17803, 17954, 11397, 6136, 6497, 5182, 6676, 16869, 27437, 25929, 31549, 30420, 23773, 18465, 11561, 7170, 14069, 22832, 35249, 36504, 24801, 25386, 23168]
16694B3168k851M503j07p698n06P187M205J748m628n48p025j7506l951p256P246
16679d019R670J2568M521L032J624j1975p109K784K12K676j502n846j520K682
16665G798L628q87J695n50O060l049j273P681p625q647P624M10J2971L356q303
16650B0889j799M395r601m629j686r03M435O921O798o103j2742m52j574j4398
16636a0449Q080O987L932N176M683J992J263M371J362r88j9189j074k072l305
16622G69k748N643P426K688m451L642J2214N693m170o033o00n419j1994m489N422
16607C593N909N246k951K725k476J607l243K121o50j546r102M107N734P743j423
16592A7394j2734p512j117L29N445J163l142K614K792j2690l731K373k687L068
$$ y = [23168, 20317, 24820, 24713, 17015, 16509, 23696, 27901, 29649, 25021, 24473, 17448, -58, -4009, -11265, -4019, 5651, 18219, 22740, 25772, 27396, 15421, 8312, 11096, 11308, 13984, 12482, 6636, 5116, 7798, 11426, 10539, 12234, 11684, 17744, 14695, 13422, 21103, 13478, 4831, 12455, 12865, 25836, 29192, 20889, 19090, 23485, 13884, 9255, 7569, 6666, 11101, 18022, 24820, 18717, 5975, 5523, 3949, -10449, -2369, 4618, 8550, 13726, 18409, 20401, 21664, 26035, 27397, 26409, 7220, 6146, 4074, 769, -1979, 3664, 11090, 13778, 9327, 12969, 25183, 30876, 26706, 20673, 20073, 14654, 2660, -1829, 3593, 9502, 14748, 11797, 14522, 12046, 13653, 10410, 12531, 11881, 10335, 1233, 5340, 11074, 18817, 17394, 4660, -2852, -3969, -3640, 1805, 2968, -174, 2440, 5232, -7458, -11189, -8816, -11503, -8435]
16578h435N168P383q302L651m21l191n022q176J309Q183J4691M86j0091j0994
16564a3761m581L843R525R73p42K458p488M783Q951k908m390n792J940j428L798
16549d819j05q36m430J3116P698l244L773P735l02o299q219q91j835N27K93K811
16533D973L364K544J1707M413L88kk381q63L414J986j71R442J6454K3305L1922
16518A10495K8311J6448M331P319N631O902p545k1693k9144l0444k0831j2567
16506E7213r142j1325o751r982m913M779J4905J7741K4447K8930L1390J6395J319
16493A55006j128j558L812j2884k1628j4720k0925k7343k0436l192l058j2277
16481A9669r021j628K549L592m862k939N611m788r906m140N197j882l667k699
$$ y = [-8435, -3267, 4116, -4186, -535, -956, -4147, -9169, -17345, -16036, -7853, 6838, 7324, -2767, -13761, -18342, -14499, -4974, -4001, -4743, -2285, -9773, -4990, 3961, 1053, -3337, -9129, -7189, -8617, -4819, -4924, -5760, -10190, 2926, 10624, 7380, 11153, 18888, 18586, 12287, 4068, 3177, 1342, 1869, 2162, 4973, 8337, 10881, 22588, 27001, 27389, 27387, 25006, 24143, 27557, 29543, 29372, 38814, 55268, 78573, 110495, 138806, 155254, 159585, 166904, 172535, 179437, 171892, 150199, 121055, 90611, 69780, 57213, 48071, 36746, 29995, 20013, 15100, 19879, 34784, 52525, 76972, 105902, 137292, 153687, 155006, 153878, 152320, 156132, 143248, 121620, 106900, 85975, 58632, 38196, 35004, 31946, 19669, 10648, 9020, 11569, 15161, 10299, 7360, 12971, 8183, -1723, -5863, -666, -2548, -6215, -8914]
16467h914N491q174k440L161J2319P327r045j1084L618P861n46p367o244J0467
16453c570M131Q110N817l698q686M08j004l701n934j42O768P036q617m746J0830
16438C002N044m574o646J402j1157J057Q852j0473q403k74j031K719M441J420
16424a4621O89K968j825O475J287p90R858M637q941L727R730M835m388r941j751
16409A949N310P01r989o65O663J654m885J329Q939k703J9n884L597L737j950L761
16393A1583K911n970m581q41N944M935J889q551p742j588J1881J6636J3689J1563
16379E1758J4464K4996K9661J6854r70j3480j7278k4109k1257j6338j716P430
16367E0015Q574K8865M1710J2181r572j9380k3980k1308j2980j262L418L3400
$$ y = [-8914, -3423, -11597, -14037, -10876, 1443, 8770, -275, -11359, -7741, 120, -426, -7793, -14037, -3570, 561, 8671, 14488, 10790, 2104, 2512, 1508, -2193, -8127, -8269, -1501, 5535, -3082, -7828, 3002, 8046, 3472, -3174, -1772, -12929, -11872, -3020, -13493, -21896, -22170, -23201, -20482, -16041, -14621, -13932, -10964, -12789, -6314, -5027, -5817, 4041, 8678, -263, 3464, 13194, 18029, 13641, 3700, 1949, 7259, 7960, -2029, -2694, 3969, 5623, 738, 2067, 11006, 8303, 8322, 2438, 6035, 9772, 7822, 11583, 14494, 8524, 3943, 3102, 9046, 13981, 15870, 7319, -423, -2011, 9870, 26506, 40195, 51758, 66222, 91218, 120879, 137733, 136763, 123283, 106005, 81896, 60639, 44301, 42585, 50015, 58589, 87454, 129164, 141345, 131773, 112393, 88413, 67105, 54125, 52863, 56281, 89681]
16355H9681L7917J0205k261j987k6412l3488k5497r520N222Q953Q691L2461K9106
16342A23071P126o677j4838l2820k0981j9708j0831K3J4232m467j0670o539n98
16329A6323n782j490l560o082o940r71J268J58p304N464J1794K75k003o511q644
16314a4005O716m543n740n398J1137O471O190K616n433M88n814j689j186L06l698
16299a3582R23R276J0144o065l890k931O278n53l618q604P598M544n726M091K768
16284F53l355j341L845m167K109L04k618J530p369p8j351P194Q671p548r112M922
16268g711J064l959P614O638O7N411O194j331j371m469j0349q493L414N574R527
16253G820k448n83q465k140l538p059K546K642l42K16R847O309k516p48N564m498
$$ y = [89681, 127598, 137803, 135542, 133555, 107143, 73655, 48158, 38638, 43860, 52813, 61504, 93965, 123071, 130197, 123520, 108682, 75862, 54881, 35173, 24342, 24365, 38597, 34130, 23460, 16921, 16323, 10541, 9051, 5491, -591, -7531, -8502, -7234, -7076, -14380, -8916, 2878, 3153, 1150, -5361, -14005, -7289, -11832, -17572, -22970, -11833, -5362, 828, 3444, -1989, -1501, -7315, -9004, -10190, -9884, -13582, -12659, -3383, 6761, 696, -3194, -6125, 153, -400, -4018, -12622, -5024, -480, -6206, -2115, 653, -2702, -4043, -198, -4365, -2256, -1952, -4570, -3040, -10409, -10487, -11838, -4644, 4027, -3521, -12633, -7711, -6647, -10606, -2992, 3646, 3713, 9124, 15318, 13987, 12616, 8147, -2202, -10695, -7281, -1707, 7820, 5372, 4789, -3676, -5816, -9354, -16413, -13867, -11225, -11567, -11351, -1504, 4805, 2289, 1541, 7105, 2607]
16237B607R153k662j0300q467N011P542p904J430J0360K356n846q202o214J098
16223a0038q38m342K72Q97J0610K142Q90N946M59r514l368p283p513J2032n684
16208a5332j039K165J2900J3525k099M910l442q692m945j0586Q825P409O584n176
16194E007j4630l300J0696P448r58M336n186l772J569K92l439N840m896m936j194
16179g123o741j379K789K368J784O72l806J284P025n495m868O971K525K27J183
16164b584O78q833q8J0773K021l58p613m311R492L270j5121L372J826K847n313
16149i942n342n425l043l433j878R32Q997O519M087j0769k255j312R945N121n74
16134h372k931l287k703P807J1905O9j163m136m57L118K447j449j0252o13N852
$$ y = [2607, 11760, 9098, -1202, -9669, -4658, 2884, -5020, -3590, 6770, 9126, 3280, -4922, -11136, -10038, -10876, -15218, -14946, -14049, -3439, -1297, -407, 5539, 5998, -3516, -6884, -14167, -21680, -9648, -15332, -16371, -14206, -1306, 12219, 10120, 15030, 11588, 2896, -2049, -12635, -3810, 3599, 10183, 5007, -9623, -12923, -2227, 5221, 4263, 8599, 3413, -359, 1210, 1502, -1937, 3903, -993, -5929, -7123, -13864, -15243, -12454, -10086, -8302, -7630, -11436, -10152, -3127, -8622, -13490, -6519, -3994, -3767, -2584, -1906, -10739, -10827, -54, 1967, 1609, -6004, -10315, -823, 2447, -12674, -9302, -7476, -4629, -9942, -15284, -20709, -23752, -27185, -29063, -28131, -19134, -12615, -8528, -19297, -21552, -22864, -12919, -7798, -8372, -11303, -14590, -17293, -9486, 2419, 2488, 1325, -2811, -3268, -150, 2297, 848, -9404, -10017, -4165]
16119d165K187K932Q715q62l309R58K871m877o505l067J842N996J857J039q177
16104b565J333N851J2795p323j1246m51M590J498o018m397N799p99p256k729m65
16089a1383M17j990L166k159L007J0m708o57R386Q485K635j750m825p65l96m849
16073f376j0885J1319R559L774l182l128R803j362j3863j2496n097l634L354J1315
16059a0899P70q12o040q609k995P182J1357J774p029r2k689L272N703L529p257
16044a2835p71p00J864L556K61K607K373j523L406k832o526L976P038p290k894
16029a0290L609J651J054N742l061N001J018m840j0677o234M621Q152N344j947
16015h57j1056q05L614J6J440r515r14J0771J0149O336j1851r310N73L008N38
$$ y = [-4165, -1978, 954, 9669, 8807, 5498, 6456, 9327, 4450, -2055, -5122, -3280, 2716, 4573, 5612, -2565, -1232, 4619, 17414, 10091, -1155, -1606, 2984, 4482, -1536, -5933, -134, -933, -8189, -10918, -11383, -10966, -12956, -9790, -11949, -8942, -8932, -13640, -14297, -4911, 3574, 6209, 4459, -366, -1131, -1527, -6376, -17261, -5942, 3617, 7391, 4209, 1081, 10884, 9522, -4341, -16837, -21934, -25568, -22214, -10899, -10129, -10941, -16981, -25590, -28585, -21403, -10046, -8272, -15301, -15393, -18082, -14810, -9107, -5578, -12835, -13606, -14306, -12442, -8886, -8625, -6018, -3645, -5168, -1762, -4594, -11120, -7144, -106, -7396, -10290, -6681, -5030, -3976, 1766, -1295, 3706, 4724, -116, -10793, -17027, -12406, -4254, 1090, -857, -11913, -12718, -9104, -9088, -7648, -17163, -18077, -7306, 2843, 9179, -2672, -11982, -11409, -8401, -7863]
16000g863n244r677k288N9O938M516L763R3o565n732P255J2669Q596N920m498
15985G942k514j1481O65P733K096m156k751k058N07n295k986L960P198K586M5
15970A491j6392m817M232M900q256k013M010P820J921k695l549k446n42l83L985
15955a2734L215O144O922K966N351P86o929k425M336j847j4896p603k215O225
15941a2704L291J963Q8k322P801L740j53j0756j5761P1J3385R413P751p987r668
15926a1848n152J327J0025o41l826M409l09m574M006q26p153j181Q270K088q096
15911a3481m52k716N612k731o838P734Q867L903K609o807p123K619N898k288n887
15896a1081m190l871k755J0667Q765l87l06l349r868o151J187K522Q776K661R991
$$ y = [-7863, -13107, -22784, -25072, -25013, -18075, -13559, -9796, -9703, -16268, -22000, -14745, -2076, 6520, 12440, 7942, 5428, -6053, -5388, 2345, 4441, 285, -2466, -4524, -4017, -9312, -12298, -8338, -1140, 1446, 1491, -14901, -19718, -15486, -10586, -18842, -20855, -16845, -9025, -7104, -9799, -13348, -15794, -16336, -16719, -12734, -9519, -3375, 3547, 6513, 11864, 12650, 5721, 3296, 7632, 5785, -9111, -16714, -18929, -12704, -9413, -7450, -7362, -9684, -1883, 1857, 1704, -9052, -24813, -24742, -11357, -1944, 5807, -2180, -11848, -17000, -15673, -5648, -6289, -10115, -5706, -6015, -10589, -6583, -7409, -14562, -15743, -7473, -5385, -13481, -13933, -16649, -11037, -13768, -20606, -12872, -4005, -102, 2507, -4300, -11423, -8804, -2906, -5194, -11081, -15271, -19142, -21897, -11230, -2465, -2852, -3158, -6507, -16375, -22526, -21339, -18817, -10041, -7380, 2611]
15881B611k739k438q322j963N232K954K660o60k91p349j2652q411J0360Q505P398
15866e105J0645N039l116N16p401k508M456K881n710j4501o1N013n06q388m527
15851b3273J04k344j300J061J016R626J5016KM49P060j5826n883L365m428p245
15836b2600J1939R701l414Q25k13j480N101n478j740j886j0684n052p013j379
15822c3373O340Q249N696O904L48k481L190m96M28O697K952o250l201l553L523
15807e027J7223M481j4482k0580j990Q514O824j0372j4512O929P593N492r749
15794a9656k561J0753L445Q343K537m222o521P06j066j281L050M748p741q609
15780a8075r05m600J474R412J917o063J292L427K783J39K072M114J4793J802j37
$$ y = [2611, -128, -2566, -10888, -12851, -7619, -4665, -2005, -2665, -2956, -10305, -22957, -31368, -21008, -12503, -5105, 5540, 10579, 7463, 7979, 578, -1930, 2526, 5407, -303, -14804, -14865, -9852, -10358, -18746, -23273, -23169, -25513, -26813, -25752, -24736, -15110, -94, -92, 357, 7417, -8409, -14292, -10927, -15355, -22600, -10661, -960, -4374, -3549, -3762, -5242, -141, -5619, -7359, -9245, -19929, -24981, -31994, -33373, -27033, -18784, -13088, -6184, -5836, -8317, -5127, -5623, -5195, 1502, 4454, -1796, -4997, -8550, -5027, 12196, 16677, 2195, -18385, -20375, -11861, -5037, -15409, -29921, -22992, -15399, -9907, -19656, -22217, -11464, -8019, 324, 2861, -1361, -7882, -7176, -8242, -9523, -6473, -1725, -9466, -18075, -18980, -23580, -22106, -12694, -10777, -16840, -15548, -12121, -9338, -9199, -7127, -3013, 11780, 13582, 13445]
15765A3445j478j2638k644L893M739K745m870o585n223o756J0499R61J105p911
15751a0718J5044P387p959p236J2281k326r154n816q352Q052J3204O588K67r67
15737A0295j0490m57N168M413Q87j627J772M01k346q413m288k621J265q212o656
15722b0909K695P736P90o426Q447J163l100K34j709O598N873N226n09l343n858
15707c092P440q8l779m430q656L068J1698L048M227J595j419n366q475l486l341
15692a1056J572m992k292m07J263l243L658L967J421N311K394K544J39K418q5
15677B612j3389K183R840J0518m467p661N52k72K251N060j275k639M94r050k195
15662g438N642q2K94Q578O836l033Q499k905q01m376j1844J415k57K909o649j0030
$$ y = [13445, 11967, -671, -3315, 578, 5317, 8062, 3192, -3393, -8616, -15372, -4873, -3912, -2807, -10718, 4326, 11713, 3754, -3482, 8799, 6473, -2681, -8497, -16849, -8797, 4407, 10995, 11262, 10295, -195, -652, 4516, 8929, 9816, 8189, 9961, 10362, 8016, -397, -4685, -7306, -6041, -14253, -20909, -18214, -10478, -9688, -16114, -7667, -6504, -9604, -9370, -11079, -4481, 1392, 6618, 6109, 2766, -3092, 4348, 4260, 481, -3949, -12605, -9537, 2161, 5209, 9436, 11031, 9612, 4246, -4229, -7715, -11056, -9484, -14476, -16768, -17175, -15912, -19155, -15497, -11530, -10109, -4798, -2404, 140, 279, 2697, 2612, -10777, -8594, 1246, 11764, 7297, -364, 188, -84, 2167, 7227, 5952, 3313, 3807, -5243, -7438, -1796, -1878, -1584, 6994, 13830, 10797, 19296, 16391, 15590, 11214, -630, 785, 528, 3437, -3212, -13242]
15646a3242l18J479n348Q37r34m828q712q063J293J5290J2176O943l88m860k291
15631a0966L929J123N442j148l145K770p705m103J0172N549j183j256j1579p396
15617a9496Q988R018J282M725M312l174l994K884j041r456P590O30K34N075L766
15602A1343m083l675n887o920Mq39j271j008J0208l080l280n447m603P913J4380
15587C755K021K573Q81p760l833p960N742R902o00P182j1292r675P660Q660L795
15572A1051K250j0819k442L347M981m017m636m388k692M810k92j905l856K677
15558e931n13J226R884R843J583o745r401l216n825p587O44j202l964l401N291
15543a9314P443J444M161r91N556P305l621j386L675O956R786n088r781l421o26
$$ y = [-13242, -13560, -12081, -17429, -16592, -17526, -22354, -31066, -39129, -37836, -22546, -10370, -3427, -3815, -8675, -10966, -7037, -5914, -472, -1620, -4765, -1995, -9700, -13803, -3631, 1918, 735, -521, -12100, -19496, -10508, -1490, -208, 4517, 8829, 5655, 1661, 4545, 3504, -5952, 1638, 2268, 2502, 7577, 11343, 7260, 3585, -2302, -9222, -9218, -10057, -11328, -12336, -2128, -5208, -8488, -13935, -18538, -10625, 3755, 5776, 8349, 9230, 1470, -2363, -10323, -4581, 5321, 4721, 11903, 611, -9064, -1404, 7256, 11051, 13301, 2482, 40, 3387, 8368, 4351, -285, -4673, -7365, -2555, -2847, -4752, -8608, -5931, -6444, -5218, 4666, 14509, 16092, 9347, -54, -3270, -9095, -16682, -16038, -17240, -21204, -24605, -19314, -11871, -10427, -6266, -7257, -1701, 5604, 1983, 597, 4272, 11228, 21014, 15926, 6145, 2724, 2098]
15528B098l95p039K73l058n185n939j096J327N580K99O419R618j923o746J938
15513c829P271K561n764M215r735m147K700m626P556O607P616m544n508R8m143
15498c672N164Q933j4n202n585p156l475J965k79j692L752j039K743P435O243
15483H121k413o810j0255J92n104l536l877l552Q682O156L241l203K914K20N0
15468i174J0786m15k705l753n07P015L122n451o135K873P983L24L768l281l778
15453F72L487M67k959K695J0508K006R31j0866N320M909l137j2715j2247m765
15439a5694J407L34L035J0299R061J937O566M456q487j4262J356m871j2056L391
15425a3528j978n742j614L775o273J393P444P548J0046N673K87q617n608n466
$$ y = [2098, 1703, -5336, -5063, -8121, -13306, -19245, -20341, -19014, -13434, -13135, -6716, 2902, 979, -5767, -3829, 3442, 6003, 239, 4454, -5281, -9428, -6728, -11354, -3798, 2809, 10425, 5881, 373, 471, -3672, 1492, 10425, 10411, 5209, -376, -7532, -11007, -9042, -9321, -11013, -7261, -8300, -5557, 1878, 8121, 5708, -1102, -11357, -11165, -16269, -19805, -23682, -27234, -18552, -12396, -9155, -12358, -9444, -9224, -9174, 1612, 1197, -1508, -5261, -5768, 1247, 4369, -1082, -7217, -4344, 3639, 3963, 7731, 4450, 672, 4159, 4626, 1667, 4362, 14870, 16876, 17807, 6941, 12261, 17170, 14033, 1318, -10929, -15694, -14287, -13953, -10918, -619, 8442, 10379, 16945, 21401, 12914, -1348, 8, -4863, -16919, -13528, -15506, -21248, -22862, -19087, -25360, -23967, -16523, -8975, 1071, 6744, 7031, -1586, -7194, -12660]
15411a2660O606L979O92M86n138O411j237n150L277M166l888l773O513L41l101
15396b476j504l044l105k676J31nj726N260O32l382O242N568k555k709P89P76
15380c784r097J522M993l579L330N43K13J598n068q20P637R660m550q898o285
15365a2585j592R53k399L829Q063l142l084o967Q53K913p008n03N777R822K866
15350b204k196n521m763J0541R557m022K132L289l932J706k757M443K947o959
15336B261j5134l496N103J0405L112k074N307Q255q293o085K573j0543N470J4324
15322A1185j732n361p448p414k05M675K71p262k067K003O535l410l066J0852L534
15307A090l35q345m659M555k460L94Q02J088K707P65p284m514l239O320J054j639
$$ y = [-12660, -6054, -2075, -1383, -897, -6035, 376, -861, -6011, -2734, 1432, -2456, -6229, 284, 625, -2476, -3980, -7024, -10129, -12805, -12674, -12679, -14405, -9145, -8513, -11895, -5653, -85, -2640, -5349, -4560, -3784, -12881, -11359, -6366, -9945, -6615, -6072, -5859, -4261, -9329, -10149, -2512, 7148, 2598, -6300, -12585, -14177, -13224, -15623, -11794, -3731, -6873, -9957, -16924, -16071, -13158, -20166, -20669, -14892, -5070, -2204, -4400, -9921, -14684, -4143, 5414, 1392, 3524, 6813, 2881, 4587, 1830, 6273, 9220, 2261, -12873, -16369, -11266, -861, 2251, 177, 5484, 13739, 5446, -639, 1934, -8609, -3139, 11185, 9453, 4092, -3356, -10770, -10975, -6300, -6029, -13291, -15358, -13355, -6820, -10230, -13296, -2444, 1090, 755, -7590, -12249, -7694, -10154, -9760, -8958, -7870, -5163, -4398, -11682, -16196, -19435, -13115, -12061, -13700]
15291a3700O020J171J605K595J403J1938n034m428o427k31k770p126N344p893
15277a7533l257R756R595K646N765j531o729M46J420K578K579j1061O25o311p210
15262a8222j25Q530M951j784N52L789N642O755K324j2938r142M164K258K094P3
15247a079l11N952n46j0030J315n372q312m135J0998O274L359Q79n609J321R790
15232D494L475o97l300K982J688l200q79K823p711q109M396J3995N545j904q245
15217E353k087k758n207l644N554P521M225k534J189M52o855l120J1184j168P48
15202H853l343j39n399P583K076n098o714q330J227l437M661R195J632J414j1338
15187g157j2581M203L139k059M487J5086K504Q271K813q409p312k047J391l914
$$ y = [-13700, -7680, -6509, -4904, -2309, -906, 11032, 5998, 1570, -4857, -5088, -7858, -14984, -9640, -17533, -20790, -11034, -1439, 1207, 6972, 5441, -1288, -842, 578, 3156, 5735, -5326, -4701, -11012, -18222, -18347, -9817, -4866, -6650, -6098, -2309, 3333, 10088, 12412, -526, -9668, -5504, -3246, -1152, -1079, -1390, 4562, 4016, -6014, -4699, -10071, -18383, -22518, -11520, -5246, -1887, -1008, -6617, -5296, 4494, 7969, 7272, 3972, 6954, 8642, 5442, 4563, 7386, -325, -8434, -4038, 9957, 15502, 13598, 5353, 3266, 508, -4699, -8343, -2789, 4732, 8957, 6423, 7612, 8064, 1209, -1911, 9273, 8105, 8853, 5510, 5371, -28, 7555, 9631, 4533, -2181, -10511, -9284, -12721, -8060, 1135, 2767, 4181, -7157, -19738, -15535, -12396, -14455, -9968, 5118, 7622, 15893, 18706, 10297, 2985, 938, 2329, -1585]
15173a585m065Q101n968n746r55n95l610N303K511J2656Q705j2897o696l813M636
15158d018P90j2023L118N087N162N196q35m846m020k917n211J164J884Q599N880
15143C010k596n439l634j028K875K30l10k636n544o909M008p3N409P025M284J254
15127g4k545k780n215K879J1329j304L55j0591k81O096O752k4O668J534m904j1743
15111c848J313j521J532M516l340o330L602J3899m596r018n821j155N021M281
15097a465l156k066l815m709L569j379K895J708J627k168K866O60J0495n632k225
15082b795j915l726J432j119L912Q079O743m460K798j164n90L946K632L614l353
15067A4034p105j246j1410j3822p96O473q90O846L715N554o00N69O346l733p444
$$ y = [-1585, -5650, 2451, -3517, -9263, -10218, -10813, -14423, -9120, -6609, 6047, 14752, 1855, -4841, -8654, -4018, -3228, -15251, -12133, -7046, -1884, 3312, 2477, -2369, -6389, -9306, -14517, -13353, -11469, -2870, 3010, 414, -5025, -8659, -9687, -6812, -6582, -6892, -9528, -15072, -21981, -17973, -18046, -12637, -5612, -1328, -74, -2619, -5399, -10614, -7735, 3594, 2290, 2645, -7946, -8227, -2131, 4621, 4597, 11265, 12799, 7895, -3848, -2535, -4056, -2524, 1992, -1348, -7678, -4076, 9823, 5227, -3791, -9612, -10767, -5746, -1465, -4621, -6687, -10502, -15211, -11642, -13021, -10126, -8418, -6791, -8959, -6093, -5433, 5062, -570, -2795, -4710, -8436, -7004, -8123, -4211, 3868, 10611, 6151, 8949, 7785, 7195, 11141, 13773, 17387, 14034, 6929, 5683, -5727, -19549, -20345, -13872, -14762, -7916, -4201, 1353, 753, 1322, 7668, 3935, -3509]
15052c509j186O789J623p310j7294j953r72J8792J3898K000l851k965k19N69j1707
15037g295J47J4303L76j0667n96p72K214l383N964j67M362p56J355J1442j389
15022A5138m733n314o288r499P821N403n987N452n071J637R228j247j578k079
15008B883j050j2984p748O786J2495M805m54J867P321j590k374j296j2151p989
14994a1479N965M588j442K72k458o723R026O933r41m248n717n928p423k748O024
14979a6299J0310Q387o618J803M315O516k880o634p915N667N654L395o547j359
14965b205j55m421O241j747l47j789m241J78k059m886L848O328J216j235r842
14950a5116n451k082r88R609O966L922k31o810k456j633Q451K308j5925M34Q28
$$ y = [-3509, -4695, 2094, 3717, -3593, -20887, -22840, -23812, -5020, 8878, 10878, 7027, 4062, 3843, 4412, -7295, -7148, 7155, 7531, -3136, -3732, -4504, -2290, -5673, 291, 124, 4486, 3730, 5085, 16527, 15138, 10405, 5091, -1197, -10696, -2875, 2528, -3459, 1993, -3078, -1441, 7787, 6540, 4962, 2883, 1833, -11151, -18899, -12113, 382, 5187, 4733, 6600, 13921, 12331, 9957, 8661, -3490, -11479, -5514, -926, -2368, -2096, -4554, -11277, -2251, 4682, 3741, -507, -6224, -12152, -19575, -22323, -16299, -5989, 2398, -4220, -2417, 1898, 8414, 5534, -1100, -9015, -3348, 2306, 5701, -846, -2205, -2360, -6781, -540, -2287, -2634, -4423, -8664, -8486, -10545, -15431, -11583, -5255, -4039, -5274, -15116, -20567, -22649, -23637, -14028, -7062, -3140, -3371, -10181, -12637, -14270, -5819, -3511, -19436, -19002, -18174]
14935a8174j445K185N788M797Q449R432J777L713k414j4790j0041l978M408P716
14921b577N105k11p235o315M232J5770O793k291J95n43J754q84j654p109m262
14906G68q91l54j89k670l048l140M584R739m771q569k601Q348J1964k724j3699
14891g253N668O712m452k551j664j633J77j120l919j571L670N00J396P442J836
14876C238M147M388L962M17k489j0292K186K572M986k903j0064j5914j568n298
14862b2632k96J1704J6589J0191l494K603L162n278l418j361m574m455p660M045
14848d874P087P95o421l2l69N153l33l117P808R083p737j2368O118L354k280R64
14832B831j600m029m883n034j238O861R199J806q628r523o011J06K098L852O537
$$ y = [-18174, -19619, -17434, -11646, -6849, 1600, 11032, 12809, 16522, 14108, -682, -10723, -14701, -10293, -2577, 2528, 2317, -4918, -11233, -7001, 8769, 15562, 13271, 13466, 12923, 14677, 13793, 12139, 5030, 768, -123, -477, -666, -3336, -6384, -9524, -4940, 4799, 28, -8541, -11142, -2794, 9170, 6446, -7253, -1585, 5127, 675, -1876, -3540, -5173, -4996, -6116, -10035, -11606, -7936, -7436, -6040, 1402, 3238, 7385, 11773, 15735, 16152, 13663, 3371, 5557, 8129, 13115, 10212, 148, -15766, -17334, -22632, -22928, -11224, 5365, 15556, 12062, 14665, 17827, 12549, 9131, 7770, 3196, -1259, -8919, -4874, 2213, 3008, -3413, -3445, -3814, 1339, 1006, -2111, 5697, 14780, 7043, -5325, 793, 4147, 1867, 2831, 1231, -2798, -7681, -12715, -13953, -7092, 2107, 3913, -4715, -14238, -20249, -20143, -18045, -14193, -7656]
14817g656L573L93p721l07j442L04q95L285L628q60M245M047no497K408R56L358
14800H14R818L277m469n779j645M231K510l962l681q454k108r234J774P109K422
14785g377N202j290j900p192l1J518L26o576J0696M415O87J183q115m244J509
14770a1189o663m00Q059O531oR957J582k523r57k586q905O801L634K677Q909L282
14754A8203r285p820M91j740O920j46o095K532l801o940k526O915R041M075R65
14739A0789m752k880L49K157n028M804J646K219M765j0921p57J0121K778J0393
14725B5683O037j4383r164j792N516m463m305k022M603K95j0217K291K226m996
14711d691l552K422L592O389J27n978k453j0869J5318j26j0808M241q8p918m01
$$ y = [-7656, -4083, -3690, -11411, -11718, -13160, -12856, -13751, -10466, -6838, -7698, -3453, 594, 589, -5908, -3500, -2544, 814, 10632, 13909, 9440, 3661, 2016, 6247, 8757, 4795, 1114, -7340, -9448, -18682, -16908, -9799, -7377, -2175, -3465, -5365, -12557, -12588, -11070, -10744, -17320, -6624, -2209, -1522, -339, -8454, -12698, -11189, -17852, -18252, -10193, -3662, -3668, 6289, 7871, 5348, 4391, 1805, -7100, -299, 3335, 6012, 14921, 18203, 8918, 1098, 1589, -151, 6769, 6623, 528, 3060, -741, -7681, -10207, -3292, 5749, 9824, 10789, 6037, 3157, 3506, 5663, 635, 5439, 7085, 9304, 14069, 3148, 2391, 12512, 15290, 25683, 31720, 17337, 8173, 6381, 11897, 7434, 3129, 1107, 5710, 6005, -4212, -1921, 305, -4691, -8243, -5821, -2229, 4160, 4287, -1691, -4144, -15013, 305, 179, -10629, -6388, -6476, -14394, -14795]
14696a4795N077o91R111J602j51p096L185Q094j827J027M722L699m028r470O51
14681h90r009p306l51J003K774J928l545L054P062K632k665m14J229j609j274
14666g381M287p140j406O220m286M923L973k240P001l313o738n732P107l068L2
14651g761k050L976M281k885o25J177r243r37J960Q082j75q93o311O80m290N489
14635i525O632J505K250p078q305P126N003o147m172M042J258l887k547p60J658
14620a2947j477J1144J694l888M902m91j449m168M878J0095L370n606n472J0879
14606A1464j552M744j83m668K945O16k290m513o666K447J815l008K760q87m507
14591a483j738M351L085r881j6720J49L927L855J091O630L207l114N99n22L846
$$ y = [-14795, -9718, -10409, -1298, 304, 153, -6943, -3758, 4336, 2509, 3536, 8258, 11957, 7929, -1541, -890, -9899, -17205, -17556, -16553, -13779, -11851, -15396, -12342, -5280, -2648, -5313, -5727, -4498, -6107, -7381, -3094, -10234, -11640, -5420, -9706, -4783, -810, -3050, 3951, 638, -6100, -11832, -4725, -7793, -7761, -9811, -5835, -1554, -4439, -5064, -3887, -13130, -14067, -12107, -4025, -4200, -5093, -11404, -10724, -15014, -9525, -2893, -1388, 862, -6216, -14521, -7395, -2392, -8539, -12711, -8669, -7411, -11298, -13845, -14605, -12947, -14424, -3280, -1586, -5474, -572, -1063, -2512, -6680, -1802, 8293, 11663, 6057, 585, 11464, 9912, 14656, 14473, 9805, 12750, 13366, 11076, 6563, -103, 2344, 4159, 1151, 3911, 3024, -1483, -3221, 1130, 4215, -5666, -22386, -22237, -18310, -14455, -13364, -6734, -3527, -6641, -6042, -6564, -2718]
14576b718O043R776o87K725L504j4117l697k595M4M740P461l35n601r951r19M906
14560a421o901J216O048O351L237j0506j2891N761N116L074j03k140o607k617
14546a2383J293P01O792J193N188l007n298p66M175l801p224J953l005n59L050
14531a1698K410N794J3431M727J0030k821M853m023r093p688k558m747q268j480
14517a1131l724M26j480j25O114N041q787N325q74J234R141j2777p543o81Q765
14502a1076J1754M652O42k833m681j2785k849J0435N262M44J34L396K032N221
14488I748N676J4906m442r912n573r487n671Q609L430r837J081L103P951m409
14474E173n94M548j313o263m305k109O822q19o49j802l341J250M237p45n863j40
$$ y = [-2718, 3325, 13101, 12414, 15139, 18643, 4526, 829, -1766, -1722, 3018, 10479, 10144, 4543, -5408, -6327, -1421, -8322, -7106, -1058, 5293, 8530, -1976, -14867, -9106, -3990, -916, -1019, -3159, -9766, -12383, -11090, -10389, -3597, -2404, 2784, -223, -5521, -6287, -2112, -5913, -13137, -11184, -14189, -14748, -11698, -9288, -3494, 9937, 14664, 24694, 21873, 26726, 22703, 13610, 5922, 3364, -1383, -9651, -11131, -14855, -14429, -15909, -16034, -9920, -4879, -13666, -8341, -9215, -7981, 1160, -11617, -19160, -19841, -11076, 678, 5330, 5972, 3139, -1542, -14327, -17176, -6741, -1479, -1035, -901, 2495, 4527, 9748, 15424, 30330, 25888, 15976, 10403, 916, -4755, 3854, 7284, -2553, -1472, 1631, 9582, 5173, 4579, 9127, 7814, 1551, -2754, -4863, 1959, 1140, 491, -1311, -4652, -3402, 835, 90, -5773, -5913]
14458e913Q75K171k459r41J706J2654k591n686m717j5426j149m440J0894P056
14444g966m468M819l195QO639Q255N174Q316k998q934m567l10R448j14L904K603
14428A6614j840k494p889l075l971j672K800L336L970R63p655m18J827J0838N203
14413A6537p430n721q37J187L063L537n345k767o546l027j452n805m735J0555
14399h786k506p15P181J3033Q803j21j0466j2076p699N084P427J1965q06l004
14385G314m239K549M649K509l328n474P33J882j6803o764R907J3602O481p265
14371E753J81M052M304l487l448o972J324L143j893K363M734L762q968o179J839
14356E08L806k359r590R87m802q401O881j353k048K379q34m33L334k033J1680
$$ y = [-5913, -5038, -2867, -5326, -6267, -4561, 8093, 5502, -184, -4901, -20327, -21476, -25916, -15022, -7966, -12434, -7615, -10810, -10802, -4163, 4092, 9266, 17582, 14584, 5650, 1083, 773, 10221, 10107, 14011, 16614, 14774, 12280, 4391, 1316, -2655, -4327, -1527, 1809, 5779, 6742, -913, -1331, 496, 11334, 16537, 9107, 3386, 2549, 3736, 6799, 10336, 4991, 2224, -4322, -7349, -8801, -14606, -19341, -8786, -11292, -12007, -4826, 8207, 17010, 16889, 6423, -5653, -13352, -8268, -841, 11124, 10318, 7314, 3075, 5624, 10273, 12782, 9454, 3980, 4713, 6595, -10208, -16972, -7065, 6537, 13018, 5753, 5934, 9986, 14290, 10803, 7355, 383, 1707, 4850, 2957, 5320, 10054, 13816, 4848, -1331, 508, 4314, 1955, -7635, -6648, -11450, -19851, -12970, -14323, -16371, -13992, -14826, -15259, -11925, -13958, -2278]
14341b278p26j828M808L060J3399R43m504l47J039l944q484j1685N525K4159k106
14326A7031K056r41j623j2013j1454L055L433n143m531l474L920M940K342M382
14312A980k636m016n252J255l856J2596N449k62l407l153Q088O784o869l473N614
14297H842O342Q46N143p51J023k619o481L438O388l599j1976k262P38J86m134
14282A124q451r510R759J6927M537j0526n685j58Q290O967m416j1450p571L688
14268f475M469q871j0757J3378N958M104O577l953m27o920l325k679O421l239
14254e739N73N0p106j901R02P302J2315J091m700j6575n280P576N824J1188l312
14239B208L77N657j788K587j3286j2653O580o206q70Q002J1711l806l055N172
$$ y = [-2278, -3004, -4832, -24, 3036, 16435, 17378, 12874, 12527, 13566, 9622, 1138, -10547, -5022, 19137, 17031, 19087, 18146, 16523, 4510, -6944, -3889, -456, -5599, -10130, -13604, -9684, -4744, -2402, 1980, -656, -4672, -9924, -8669, -12525, 71, 5520, 5258, 1851, -1302, 6786, 13570, 6701, 3228, 8842, 15184, 16030, 21173, 20422, 21445, 18826, 12345, 15783, 22171, 18572, 6596, 4334, 5072, 5258, 1124, -7327, -16837, -7078, 9849, 14386, 3860, -1825, -1983, 6307, 13274, 8858, -2592, -10163, -6475, -2006, -10877, -21634, -8256, -2298, 1806, 8383, 4430, 4003, -2917, -6242, -8921, -2500, -5739, -5166, -5116, -12222, -14123, -13221, -5919, 6396, 7487, 2787, -13788, -19068, -11492, -5668, 5520, 2208, 2585, 8242, 6454, 9041, -4245, -16898, -10318, -16524, -17394, -9392, 2319, -1487, -4542, 630]
14225F30J1336P06j3416o786N556N846j727j1711K750J4777L425K160j425k132
14211I989J033J2662j275K60j1474o448j300J772n854K212J363P59L804n582m492
14196b571P410J852J592M40N940k722O111M806n799j2255j0374l504L421o506
14182a2159k138l972L502l066J650q91r3L092m241K824P510R251R671K427K71
14167A3638P952p966n900k486N875P172N398m964j4230j237J987r94n079m867
14153e701n40M006n41K944R538j1760j354J907J52O616N864k043j2424K119O579
14138E362J0859l629j0585R176P981m430j2416P107J4059N518o575m760q91k834
14124A3942L043N449L055n265r386O433Q764J686l655l047L542J8746K2772K4302
$$ y = [630, 11966, 12672, -744, -7530, -1974, 3872, 2145, -9566, -6816, 7961, 11386, 13546, 12121, 9989, 11022, 23684, 22409, 22669, 11195, 4747, 3447, 5219, -635, 1577, 2940, 3699, 7503, 1921, -2571, 4839, 6691, 8283, 8723, 14663, 11941, 18052, 22858, 17059, 4804, -5570, -9074, -5653, -12159, -14297, -18269, -14767, -17833, -16183, -17074, -17167, -14075, -18316, -15492, -7982, 1269, 10940, 13367, 13638, 21590, 13624, 7724, 5238, 11113, 18285, 23683, 18719, 4489, 3252, 5239, 4245, -834, -5701, -6241, -2235, -2776, 168, 9706, -2054, -3408, -1501, -1349, 5267, 11131, 9088, -3336, -1217, 5362, 16221, 12592, 2007, 11183, 19164, 14734, 2318, 9425, 23484, 29002, 22427, 17667, 16776, 13942, 16985, 22434, 25489, 20224, 10838, 17271, 26035, 27721, 24066, 21019, 24561, 43307, 66079, 90381]
14110I0381J2839j512j0246j2154j6456j1889o634k124o972p654n141p034J808
14097A7212J652j038k096o074N25M493R01n00M01M858L552p353n481M333j3138
14082B247j2401J0579Q245J2922R527N526M497J2J960j415O144Q887N422J9813
14068H1965M7745P3571P6695M6314N359k9590n9047n7937m7745l6525j7310r070
14056G4425P43j4218j2329j0618K237m051r883o802m734N071k83L004l181k281
14042A7100L335O193J560M425n215o356l861n63J521L263N848Q69K696J1901P160
14027D9876O773P158J5540K6183K8672N2706P5030O9788K1291l0599n0986n9130
14015B12302n0022m1301k9060j6022n849r440j0653N89j0372o438n467j105M652
$$ y = [90381, 103220, 101708, 91462, 79308, 62852, 50963, 44329, 42205, 35233, 27579, 22438, 15404, 17212, 18864, 17826, 15730, 9656, 10181, 14674, 15575, 15075, 15476, 20334, 23886, 16533, 11052, 15385, 2247, -10154, 425, 8670, 21592, 31119, 36645, 41142, 41154, 43114, 41699, 47843, 56730, 62152, 81965, 129710, 203281, 279976, 326290, 331649, 302059, 243012, 185075, 137330, 100805, 83495, 74425, 75168, 60950, 48621, 38003, 40240, 36189, 26306, 19504, 14770, 19841, 19558, 22562, 19381, 17100, 20435, 26628, 28188, 32613, 27398, 21042, 17181, 16618, 18139, 21402, 27250, 28119, 30815, 42716, 49876, 56649, 63807, 79347, 105530, 134202, 186908, 261938, 331726, 353017, 322418, 271432, 212302, 162280, 120979, 91919, 75897, 70048, 60608, 49955, 50544, 40172, 33734, 28267, 27162, 31814]
14002C1814M149M571l908o647k136r52p54n292q84M39O849p728j1540N081K0304
13987C3366J472m279N472O908l438p203L69J5188N267R972J0584J5094J9449N182
13973A13403j900j0006j4506j4805j4960j2871p997o332m527J2866P12k0927q646
13960I504J486j890k44J456j0077j681N713N981K737k442J443j4071R26J139J1522
13945A1502K597k331j764L681M444l753o543K814m063o682L798P846m158L333
13931A0721K982L271O17k090m348k78o968q416K18M285L05O153Q27l704o008l782
13915f215k184r205k97m197J141O169J3074O183M936j264j57P535L738n38J1925
13900C0644j448k637R252n923N89R290j3282p318j1833k98J3720K003p996o94
$$ y = [31814, 35963, 40534, 36626, 29979, 27843, 26891, 26137, 20845, 19961, 20400, 27249, 19521, 7981, 13062, 33366, 34838, 30559, 36031, 42939, 39501, 32298, 32667, 47855, 53122, 63094, 73678, 88772, 108221, 113403, 111503, 101497, 86991, 72186, 57226, 44355, 36358, 30026, 25499, 38365, 39077, 18150, 9504, 10990, 9100, 8856, 10312, 235, -1446, 4267, 10248, 12985, 10543, 11986, -2085, -1159, -20, 11502, 14099, 11768, 10004, 13685, 18129, 14376, 7833, 10647, 6584, -98, 3700, 11546, 7388, 10721, 13703, 16974, 17591, 15501, 11153, 10875, 3907, -4509, -4291, -6, 299, 6452, 7279, 3575, -2433, -6215, -8399, -17604, -17901, -22098, -20957, -14788, -1714, 4469, 9405, 8141, 7984, 15519, 19257, 18719, 30644, 29196, 26559, 35811, 29888, 30477, 39767, 26485, 19167, 7334, 7036, 20756, 22759, 14763, 14069]
13886A4069O463L109O3p379j366J014p449r010M576N487J493r694o504N26O313
13871A711q916j0505m468r180j937P191N967L716K3047Q581j0811Q673L434M911
13857B1414O193J4081J1473m026r361J081N154K847l050p329n906O46M216m625
13843C2808o936p059q245k031j118L998M503P825J1544O221n456j381k670k415
13829B9588K799l608j0485q894K584L956k149q878o438P565O756N893O13J681
13815B0983O868M218n317Q903L930n641k387N739p937p317q502Q0R682P211J500
13800C2013J774J923P486N678p782R089L851n443o560k289O019R918q31j732j077
13785E2037l581o448L118L207M64l754p824j824N942j5608q735O321J3145J1185
$$ y = [14069, 20532, 23641, 23704, 16325, 14959, 15973, 8524, -486, 4090, 9577, 11070, 1376, -5128, -4602, 1711, -7205, -17710, -22178, -31358, -33295, -26104, -20137, -16421, 6626, 15207, 4396, 13069, 16503, 21414, 27607, 41688, 53161, 49135, 39774, 40855, 46009, 48856, 45806, 38477, 32571, 33217, 37433, 32808, 25872, 18813, 10568, 8537, 7419, 11417, 15920, 23745, 35289, 41510, 36054, 34673, 32003, 29588, 32387, 28779, 18294, 9400, 11984, 15940, 13791, 4913, -1525, 6040, 12796, 18689, 19302, 20983, 27851, 32069, 26752, 35655, 39585, 33944, 31557, 37296, 29359, 22042, 13540, 13620, 23302, 30513, 32013, 33787, 35710, 43196, 48874, 41092, 50181, 54032, 48589, 42029, 39740, 45759, 55677, 54846, 53114, 52037, 48456, 42008, 45126, 48333, 48797, 45043, 37219, 35395, 41337, 25729, 16994, 23315, 36460, 47645]
13771D7645m007K218n71j0006m125j0245q591o129j0239j2045K078j986N842J9798
13757I637M1866L3498L1724K0271n32j3894j2820n456l800K727n489m156J0050
13744A03626K773o647j2336j153k847n838M900P620p904j2393l263n170K227o054
13730E7541L800J6250J9420R451j133p868j1430j0392l056k898j0902j5248j1788
13717C1747J287k228q208K976K3825L8241N1985N2473K7012P509r105j2333j0460
13704A94721j3110j1415M252M134N327M814L81K282j2414l492J0198J0652K689
13691A99019K86j641q05J5013L494P140Q663M564J3308R883l08l944K4770K1400
13677C00842M145m046n429N930J3722J6470J8617K2761L3583L2309L5182N4134
$$ y = [47645, 43638, 45856, 45285, 35279, 31154, 20909, 12318, 6189, -4050, -16095, -14017, -16003, -10161, 9637, 51503, 85001, 116725, 136996, 136464, 122570, 109750, 104294, 100494, 103221, 97732, 93576, 103626, 106399, 99752, 87416, 86263, 83416, 77578, 82478, 90098, 82194, 69801, 66538, 61368, 63595, 57541, 61341, 77591, 97011, 106462, 105329, 97461, 86031, 75639, 72583, 69685, 58783, 43535, 31747, 33034, 30806, 22598, 25574, 49399, 87640, 139625, 192098, 219110, 226619, 217514, 205181, 194721, 181611, 170196, 174448, 178582, 183909, 188723, 189104, 191386, 178972, 175480, 185678, 196330, 199019, 199305, 197664, 196859, 211872, 215366, 222506, 231169, 235733, 249041, 258924, 258616, 254672, 279442, 300842, 304987, 300941, 295512, 301442, 315164, 331634, 350251, 373012, 406595, 438904, 474086, 528220]
13665E28220O8172M8700M7207N1818P4973R1522J32703J69171K07639K39203K86320
13654A945648L81214N33132P81981J206464J937512L119311M508818M613014K158948
13645B1186042r16437l009859m002519l695789k627627j642811j018241o58006
13637C614753m63364l46366k67841k05807j67892j52566j37332j21197r4118o8100
13627A590170j9139J0595K978J9179L8245N3388O5238P6804Q6424J07363J39562
13616B170807J90726K43844L43016M86302N99002O97314Q45451J069847J447365
13607H093674K138034L345872N416549Q881155J3640474J5961512R019658j993852
13599F4503076r176759j3045248j2651108q949790n396116l268427k084348j416455
$$ y = [528220, 596392, 645092, 692299, 744117, 819090, 910612, 1043315, 1212486, 1420125, 1659328, 1945648, 2326862, 2859994, 3641975, 4848439, 6785951, 9905262, 14414080, 19027094, 21186042, 20269605, 17259746, 13257227, 9561438, 6933811, 5291000, 4272759, 3614753, 3151389, 2805023, 2537182, 2331375, 2163483, 2010917, 1873585, 1752388, 1658270, 1590170, 1571031, 1581626, 1584604, 1603783, 1642028, 1695416, 1760654, 1837458, 1923882, 2031245, 2170807, 2361533, 2605377, 2948393, 3434695, 4033697, 4731011, 5576462, 6646309, 8093674, 10231708, 13577580, 18994129, 27875284, 41515758, 57477270, 66496928, 64503076, 55326317, 42281069, 29629961, 20680171, 15284055, 12015628, 9931280, 8514825]
13591H514825j046394q31684o82604n84218n19195m85673m22248l61242l05412
13582C276155k22730j62687j04306o2068m0927j8623J77K8369N2299P2476R9714
13571B917849J40839K08283L17836M71849O13548P14597Q49448J106501J546092
13562H886842K287742L538950N483431Q487208J2957304J6040419J0403187r83601
13554F7101482q793865j3135658j3384891r805109n985815l595638k272524j540288
13546H587694j122684q85380p29953o22699n45519n05687m67227l95001l49502
13537B964042k94364k38422j83034j43866j01788p5544o1942m4313l3608k4488
13527A762673r033q434K0201N9956J04837J66591K15824K52675L28221M63324
$$ y = [8514825, 7468431, 6636747, 5954143, 5369925, 4850730, 4365057, 3942809, 3581567, 3276155, 3053425, 2890738, 2786432, 2724364, 2683437, 2664814, 2664991, 2693360, 2745659, 2818135, 2917849, 3058688, 3266971, 3584807, 4056656, 4670204, 5384801, 6234249, 7340750, 8886842, 11174584, 14713534, 20196965, 28684173, 41641477, 57681896, 68085083, 67101482, 58307617, 45171959, 31787068, 21981959, 15996144, 12400506, 10127982, 8587694, 7465010, 6579630, 5849677, 5226978, 4681459, 4175772, 3708545, 3313544, 2964042, 2669678, 2431256, 2248222, 2104356, 2002568, 1927024, 1865082, 1820769, 1787161, 1762673, 1753640, 1745206, 1765407, 1825363, 1930200, 2096791, 2312615, 2565290, 2893511, 3356835]
13517C356835O78677J017227J631625K655384M087886N052058L568365J97375
13509B2245432k513461m064459m308905l350184k157141j324505q43924n68143
13501C114710m20410l27542k62392k32852k02810j80780j60376j61313j44384
13492A021851j20783r0068n5075l2657m5797m8303m2910m4176l2694j9421j9012
13481D70955k6832k2017k6636k0532j4777r096p717m430M694K801j1693l0008
13469C04712l0365k6556k0673k0280p882p260j3080n892j3690p374j2666j8575
13457A20419j4151K398M27l459j3204p375q064J019p139j4891m524J3482M3706
13444A08644L8564K1145Q958l757j0044q083m803o194L563m690r656j4448j896
$$ y = [3356835, 4035512, 5052739, 6684364, 9339748, 13427634, 18479692, 22048057, 22245432, 19731971, 15667512, 11358607, 8008423, 5851282, 4526777, 3682853, 3114710, 2694300, 2366758, 2104366, 1871514, 1668704, 1487924, 1327548, 1166235, 1021851, 901068, 811000, 755925, 723268, 677471, 629168, 586258, 542082, 509388, 489967, 470955, 444123, 422106, 395470, 374938, 360161, 351065, 343348, 338918, 343612, 346413, 334720, 304712, 274347, 247791, 227118, 206838, 198956, 191696, 178616, 172724, 159034, 151660, 138994, 120419, 106268, 108666, 109093, 105634, 92430, 85055, 76991, 78010, 70871, 55980, 51456, 64938, 108644, 147208, 168353, 177311, 173554, 163510, 155427, 150624, 144430, 147993, 143303, 133647, 119199, 117303]
13431A17303q090k5937l7497m2739j8120M018P457K6846L0138K0739P537O276
13419H7931k56N313j0403q894o848j0058j2643j0242k077N033J6080O713l323
13406E6326n036j145r140j0993l908J9607L7198L5781L4773J1974K536n278j5345
13393A47350j6444j5725o46O193l040j2847n162K724k06M62L844j066j8066j58
13379H7213K540J833J560j351P013K1511K8696K1975J8801J7446J099K98l910
13366B04724k1365j4620m452j4858k2306j6005r537l777m262j1455q254m882P344
13353G6295K1763J0813J2639J202L729j507j219m803o884o223m178n466q010N893
13339I4044l714n412N258O743K594q439j1911J0010R337j178k834k79l660j6211
$$ y = [117303, 109213, 83276, 45779, 3040, -15080, -11062, -3605, 23241, 53379, 74118, 81655, 87931, 87675, 92988, 82585, 73691, 66843, 56785, 44142, 33900, 31823, 36856, 52936, 59649, 56326, 51290, 50145, 41005, 30012, 26104, 45711, 82909, 118690, 153463, 165437, 167973, 162695, 147350, 130906, 115181, 114535, 120728, 117688, 104841, 99679, 102403, 102197, 102659, 106503, 105437, 87371, 87213, 89753, 91586, 93146, 91795, 98808, 120319, 149015, 170990, 189791, 207237, 208336, 208634, 204724, 183359, 168739, 164287, 149429, 127123, 111118, 101581, 97804, 93542, 82087, 73833, 68951, 76295, 98058, 108871, 121510, 122712, 126441, 124934, 123715, 118912, 112028, 105805, 101627, 96161, 88151, 94044, 90330, 84918, 90176, 96919, 99513, 91074, 79163, 89173, 98510, 97332, 94498, 94219, 90559, 74348]
13325G4348k0495j130m994R680R608J904K04N824n674l468k2781j6951o569J208
13311B0714p426M028J9942K2178L2608K5032J8166P367k1649k8679j8138n454
13299F8689r09q72j166N493J421p597L361N686J1564J7678P789l958j2532j5096
13285G9551r590j8568j9076j5381j9133j0034j9752j4370k4470k9130l3729m309
13273a37991P6761J78044J98232J60664R1220N386o0795m8066k7471k0605k5988
13262C89391r020q488p851K861K646J714L5143P2315N9558J4222j7956m3684o3372
13249D27479l6232k4119l5129j9231J0257L4852N4507M0312r589n3404o0880l8726
13237B90097p904L264j1861j3235j767p011j6876r098K46Q41m275Q396J4979R164
$$ y = [74348, 53853, 52723, 47729, 57409, 67017, 68921, 69125, 74949, 69275, 65807, 43026, 26075, 19506, 20714, 13288, 17316, 37258, 59436, 92044, 117076, 135242, 142609, 120960, 92281, 74143, 68689, 67780, 66908, 65742, 71235, 72656, 65059, 68420, 74106, 85670, 103348, 111137, 107179, 94647, 79551, 69961, 51393, 32317, 16936, -2197, -12231, -31983, -46353, -70823, -99953, -133682, -137991, -61230, 116814, 315046, 475710, 566930, 572316, 511521, 463455, 435984, 415379, 389391, 380371, 371883, 364032, 366893, 369539, 371253, 406396, 478711, 538269, 552491, 534535, 490851, 427479, 391247, 367128, 331999, 312768, 323025, 357877, 412384, 452696, 443107, 389703, 328823, 290097, 282193, 285457, 273596, 260361, 258594, 251583, 234707, 225609, 225855, 226696, 222421, 230817, 245796, 254960]
13223B54960O859o52J868J3134N128l382k320N353k620N800k263j0817K301P812
13209B81161M152J0398N590N495j1496r618l622k445J1459N810J644J2613R022
13196C20163J0450N902n320o909j3082n20R127K8959L1118K2233K8084R901l236
13183D36870J3319J9341J2712J8619R587R320J4335J4864L1098M1153L8726K1421
13171F81365J1044L970j00j0886n119k127K6452N9803P4754O8868N2001J4217
13159I74242M586K8697N4502P1935O4846O0602L8757L8029N1315O1307Q6554J16561
13147A651933J10545Q0248N5259P8879J16457J76056K46258L11410L30798L24745
13137C482588L07986L12500L51318M04172M79338N70763P05031R02203J145860
$$ y = [254960, 261819, 261167, 263035, 276169, 281297, 277915, 275595, 280948, 278328, 284128, 281865, 271048, 273349, 281161, 285313, 295711, 301301, 306796, 295300, 285682, 282060, 279615, 291074, 296884, 298528, 311141, 320163, 330613, 336515, 331195, 324286, 311204, 310684, 319811, 348770, 379888, 402121, 430205, 440106, 436870, 450189, 469530, 482242, 500861, 510448, 519768, 534103, 548967, 580065, 621218, 659944, 681365, 692409, 696379, 696279, 685393, 680274, 678147, 704599, 764402, 839156, 908024, 960025, 974242, 978828, 1007525, 1062027, 1133962, 1198808, 1259410, 1298167, 1336196, 1387511, 1448818, 1535372, 1651933, 1762478, 1842726, 1897985, 1976864, 2093321, 2269377, 2515635, 2827045, 3157843, 3482588, 3790574, 4103074, 4454392, 4858564, 5337902, 5908665, 6613696, 7515899, 8661759]
13128H661759J488645J821971K280795L049152M227066N793456Q053997J2198568
13120D7575409K0262581L5767458O1463519P8885028M5558867q103973m0482712
13113B40926177n9756564n9235803m0577617k2867370j3305100q811475o469139
13106B9903109n050213l897071k927175k279398j838664j556033j385027j212089
13098I757439j057096r17465q27352p11406n88450m75284l84217l04894k44882
13089D246393k13944k23626k41168k17964j59701r8289j13305j60927k07075k44739
13079B365655k43906k13080j53595j10886r6337r2354q4203r4999q6401p1694
13069A118200o2012m3327k1691k8407m1459n6391n5396l2391j9178k0449j3460
$$ y = [8661759, 10150404, 11972375, 14253170, 17302322, 21529388, 27322844, 35376841, 47575409, 67837990, 103605448, 165068967, 243953995, 289512862, 281408889, 240926177, 181169613, 121933810, 81356193, 58488823, 45183723, 36372248, 29903109, 24852896, 20955825, 18028650, 15749252, 13910588, 12354555, 10969528, 9757439, 8700343, 7782878, 6955526, 6244120, 5655670, 5180386, 4796169, 4491275, 4246393, 4032449, 3808823, 3567655, 3349691, 3189990, 3091701, 2978396, 2817469, 2610394, 2365655, 2121749, 1908669, 1755074, 1644188, 1547851, 1455497, 1371294, 1276295, 1189894, 1118200, 1056188, 1012861, 991170, 962763, 921304, 864913, 809517, 777126, 757948, 737499, 724039]
13058G24039j8612k3465l3754l9331m7371n7712n0035k9280j4338J622o636j3009
13046C92118p754O403Q793K5222K2846K4523K3566J8490m52l5380l2346k7885
13034D18144l8751k5608l4127k6247k8252k2215j5410j5495J709O078q300m937
13022B06589n657q691j1349k923L29j2836m581n220j9339r237K085k931L934j763
13008A28410l031o442Q032J1188J3381j389m414R18j1298o125K627J4135K3234
12995A69226R217j432J313J0791R660j3037q227J0215l192j5494l3287l1851k6217
12982G7685j6593j2869q285k336o621r537j1179j3970p000l251n566j8348l3440
12969g1310k6797j9801l8971m4283l5030l8459n6202k2186R2696J95578J89423
$$ y = [724039, 705427, 681962, 648208, 608877, 561506, 503794, 453759, 424479, 410141, 411763, 405127, 392118, 384364, 390767, 399560, 424782, 447628, 472151, 495717, 514207, 513755, 478375, 446029, 418144, 379393, 353785, 319658, 293411, 265159, 242944, 227534, 212039, 213748, 219826, 211526, 206589, 200932, 192241, 180892, 177969, 178298, 165462, 160881, 155661, 136322, 127085, 129170, 126239, 130173, 128410, 125379, 118937, 126969, 138157, 151538, 150149, 145735, 146653, 135355, 129230, 131857, 145992, 169226, 178443, 177011, 178324, 189115, 198775, 185738, 177511, 187726, 184534, 169040, 135753, 103902, 77685, 61092, 48223, 39938, 37602, 30981, 21444, 10265, -3705, -10705, -13956, -19522, -37870, -71310, -98107, -117908, -156879, -201162, -236192, -274651, -330853, -353039, -260343, -64765, 124658]
12958A24658J46780Q1673M723k0582j7975j0915k2590l0027j7824j7143r988j0695
12946B00095j4029p171j2893m538k029m047R54l372j5534l484q524q905n817N858
12932A16564Q038l102q290j4694j7883k3357k2071j640K5046L5233L4130K0205
12920A48179K564j025K34l990l602p672j1894j3246p55L647J776O737m93j5805
12906A04655j0048p120m802K19o028K657K487O014J797r120q326l044m40p394
12892F1507N037Q570K991j1994O674r84n186j0684j1266P146J3783J945L088M058
12878G4685O882l250k226o333k330p529n897M528q498o401j901J4990P798L741
12864F8259N274N307Q958j4104q378j104L43p542M668J0758N443k154J900n795
$$ y = [124658, 271438, 353111, 357834, 337252, 319277, 308362, 285772, 255745, 237921, 220778, 210790, 200095, 186066, 178895, 166002, 161464, 159435, 155388, 156342, 152970, 137436, 133952, 125428, 116523, 110706, 116564, 124602, 121500, 113210, 98516, 80633, 57276, 35205, 33565, 58611, 93844, 127974, 148179, 150743, 149718, 149952, 145962, 142360, 134688, 122794, 109548, 108793, 112440, 114216, 120953, 120460, 104655, 94607, 87487, 82685, 82904, 76876, 79533, 82020, 88034, 89831, 80711, 72385, 69341, 68901, 61507, 66544, 75114, 78105, 66111, 72785, 71801, 66615, 55931, 44665, 51811, 65594, 67539, 70627, 74685, 81567, 78317, 76091, 69758, 67428, 59899, 54002, 58530, 50032, 43631, 41730, 56720, 64518, 68259, 73533, 78840, 87798, 73694, 65316, 64212, 64555, 57013, 61681, 72439, 77882, 75728, 77628, 71833]
12850G1833o820L601j557K785N078j424j0003n492k017M032N047Q067L886j1695
12836F5321j1004l726n059M417J877m861J0116J000k91k084J0290J8875K9178
12823A14049M7848M4441J1853r663j7637l7197l7783k5996j6926m092L532m107
12811F8322q951M162J1038K0616L2624N6609L4917j0015k9026k8693l5470k5371
12799I0762j8715n158n074p445m032m426Q73Q056j873l009J317l552k920m188
12785D0616J111K775K444M545L663k539q00L199l252k144k468p619n406J931M69
12770C6525N380J454l221R10J1683L881m410j3145p425K48l508m949O646k1L132
12755C3180P651j3787o997N813O006K859m5j228o191j635R385l178o145M588Q041
$$ y = [71833, 65013, 68614, 67057, 69842, 74920, 73496, 63493, 58001, 55984, 60016, 65063, 73130, 77016, 65321, 54317, 50591, 45532, 49949, 51826, 46965, 57081, 58081, 57790, 55706, 65996, 84871, 114049, 161897, 206338, 218191, 208528, 190891, 153694, 115911, 89915, 72989, 68897, 72429, 68322, 59371, 63533, 74571, 95187, 127811, 184420, 219337, 209322, 180296, 151603, 116133, 90762, 72047, 66889, 61815, 54370, 50338, 45912, 46785, 54841, 52968, 49959, 51276, 47724, 44804, 40616, 41727, 44502, 46946, 51491, 55154, 52615, 51815, 55014, 51762, 49618, 47150, 39531, 34125, 36056, 36525, 41905, 43359, 40138, 41048, 52731, 56612, 52202, 39057, 31632, 31880, 28372, 23423, 30069, 30048, 33180, 40831, 27044, 20047, 25860, 31866, 34725, 34680, 33452, 27261, 25626, 35011, 31833, 25688, 30276, 38317]
12740C8317N68J415k411m261N518j52m94N369l171N835J962r892k556k597r571
12725B3879o985M191J888k318J097Q246n204q711m238o418J0667J6028J855J101
12711C5078K6k436k344n060l109J4050J2397O745o712j719n181k287n970p975
12697B5503o275j274N761O82O410O586P93K0O490J7497j867K106j945L619L349
12682F7455L196l22L42J971N901R401K0694K0864K1788K4020L0995N7605Q5930
12669C49840J47386K67763L77253L22756P8890j54551k86765l19870k46629j53436
12659C82637r3224o0758l9656l3871k7032j6203j0245j872m273Q06m518r188j3398
12646F9205j7138o359o735L740J0252J030m339m168M380p230p566M943j0892k897
$$ y = [38317, 38885, 40300, 37889, 33628, 39146, 38994, 38500, 43869, 40698, 46533, 48495, 38603, 36047, 33450, 23879, 16894, 21085, 22973, 20655, 21752, 29998, 24794, 16083, 11845, 5427, 16094, 32122, 33977, 35078, 35104, 32668, 30324, 25264, 22155, 36205, 48602, 55347, 48635, 46916, 41735, 39448, 33478, 25503, 19228, 17954, 23715, 24397, 30807, 37393, 38186, 38206, 44696, 62193, 60326, 62432, 60487, 64106, 67455, 70651, 70329, 70671, 72642, 78543, 87944, 108638, 129502, 151290, 175310, 206305, 263910, 349840, 497226, 764989, 1142242, 1464998, 1543888, 1389337, 1102572, 782702, 536073, 382637, 289413, 228655, 188999, 155128, 128096, 111893, 101648, 99776, 95503, 96309, 91791, 82603, 69205, 52067, 45708, 38973, 42713, 52965, 53995, 49656, 45488, 49868, 42638, 35072, 40015, 29123, 26226]
12632B6226J1754N9k030k349l502Q67R149k390q691j0360j4597O582J0184L06
12618B1208P77K29l915R452r032J091M33L111K873p799k813R28l477L66L042k978
12602A3496o820K115J1420k074O362k625j826m436j2466l360J4961L096j3512
12589D331j1040K679O213O815k763o23L592n22m779l17N670l659o745R750J2657
12574B1259j44k962N82o295L210l185k18J577J006J259o224K774k848J941q06
12559A0926O935l215q490L340k404K451M872n737p957p141N047J3799L526m238
12545A1714p522k558L603M282K393n72L559j0467j938J682j179J0262M539k705
12531A5093r729m057J597O042M398J545j5902p041J1422J1383j1375m577j2039
$$ y = [26226, 37980, 38039, 36009, 33660, 30158, 31025, 40174, 37784, 29093, 18733, 4136, 10718, 20902, 21208, 21985, 22214, 18299, 27751, 18719, 19810, 20243, 23354, 26227, 18428, 15615, 16543, 13066, 13432, 16474, 13496, 6676, 8791, 20211, 18137, 24499, 21874, 20048, 15612, 3146, -214, 14747, 17843, 4331, -6709, -4030, 2183, 8998, 6235, 5612, 9204, 8682, 3903, 3586, 9256, 5597, -1148, 8602, 21259, 21115, 18153, 18735, 12440, 15650, 12465, 12247, 13824, 14830, 16089, 9865, 12639, 9791, 11732, 10926, 17861, 14646, 6156, 9496, 7092, 9543, 14415, 8678, 721, -6420, -1373, 12426, 15952, 11714, 4192, 1634, 5237, 9519, 11912, 11340, 14899, 4432, 2494, 4176, 2997, 13259, 17798, 15093, 5364, 1307, 2904, 8946, 13344, 14889, -1013, -8054, 3368, 14751, 3376, -1201, -13240]
12518a3240N334K602l781K766P889N792r10O327J0893q948n474j400M090R176
12504B1116J585k393p404K653J767j466J402j803J191l15J657Q54n94n112j024
12489A2114m702K292n771m554O9O080N826J198M127L7r669n303l469J819o154
12474f060n793M43J031R895J6449R431k80q60n527l995n260K715j0337j1409k263
12459a1820K432P704P47k117j117O729k87m89N361R239L505m294k169n019K93
12444H698o168r94n327n083R6J508K905R543km594l241K777k632J690M917L113
12428G206J783k729M925q700q501n470R590Q883K943j0558l625P746M936J3318
12414B1747n0o993p512m119N902R243p825j748r388k468J0604r93O718K881l925
$$ y = [-13240, -7906, -5304, -9085, -6319, 1570, 7362, 6452, 12779, 23672, 14724, 9250, 7850, 11940, 21116, 22701, 20308, 12904, 15557, 17324, 15858, 17260, 15457, 16648, 16333, 17990, 18844, 18250, 13138, 12114, 7412, 9704, 3933, -621, -552, 5528, 11354, 12552, 16679, 16716, 7047, 1744, -1725, 94, -6060, -11853, -11410, -10379, -484, 15965, 25396, 25116, 24256, 18729, 14734, 9474, 12189, 1852, -9557, -11820, -9388, -1684, -937, -3054, -4171, 2558, 2271, 1782, 7143, 16382, 19887, 15593, 13424, 8405, 8698, 2530, 1536, -3791, -8874, -8778, -7270, -4365, 5178, 5176, 582, -2659, 118, -2514, -824, 4093, 7206, 8989, 6260, 11185, 2485, -6016, -11486, -1896, 6987, 9930, -628, -4253, 3493, 8429, 21747, 21697, 14704, 7192, 3073, 8975, 18218, 10393, 8645, -743, -3211, 7393, 6400, 13118, 15999, 12074]
12399A2074q532l845O980P62N946l401k595m813p582O760J26J38P452N133N447
12384B0050k333q023r477q04K432o328j522R089L241p692l579J640L250O410J173
12369G527P156L980o9p935q286j27O75OO040M7Q17m330O58O390O838j992l24q320
12351H751J85K956m88o063j98n016J652P45N831p323l023N87K054K554L562q103
12335a337o946o837q34L823L331k50O704J793M086m745J993M039N80Q540q248
12320E692m110L86J633J921o372O831j324r147J506Q326M767k816k84j372M573
12305A0210Q234N747k715n282r099l210L292M907o673n608k269p452J572J594
12291f752j087M045J923n440l443J172k267P137J0056m349N114L836o965j3407
$$ y = [12074, 3542, -303, 6677, 7439, 13385, 9984, 7389, 2576, -5006, 1754, 1880, 2018, 9470, 14603, 20050, 17717, 9694, 217, -587, 1845, -4483, -6005, 3084, 6325, -1367, -4946, -3306, -56, 6354, 7527, 14683, 18663, 18594, 10659, 2373, 2246, 2921, 2927, 8967, 9014, 9831, 5501, 6159, 12549, 19387, 17395, 17071, 8751, 8936, 11892, 11404, 5341, 5143, 127, 1779, 2524, 8355, 1032, -1991, -1404, 650, 3204, 6766, -1337, -8283, -15120, -15954, -12131, -8800, -9050, -2346, -553, 3533, -1212, 781, 4820, 5400, 13940, 5692, 1582, 1968, 3601, 5522, -850, 5981, 4657, -4490, -2984, 5342, 10109, 7293, 7009, 5637, 10210, 18444, 24191, 21476, 16194, 7095, 3885, 7177, 12084, 5411, -197, -2466, -9918, -8346, -6752, -7839, -3794, -1871, -7311, -10754, -9582, -11849, -4712, 5344, 995, 6109, 9945, 2980, -10427]
12277a0427l494R925R052q072j0472k182L086J743Q738J155l154k190O390N778
12263E876L090J904n87L583O188L516r376j5592k953O774j916l546L897Q538N837
12248A5233j410k699m86j756M98J396N313K751o855p231o723Q267M17K712P981
12233A7408P94k039r388R49M434k176k041n560J403l221L2k321O04k808m762N215
12217c477L814j2092J490Q395r270j91J0101k589q27J4543L093j904m213o038
12203H35M27M283L85P41k408o583o674p452P773J8256K05o694o502j239k469M181
12187b935P498J076J264j51n565J995L330N519L180k389q831n245P326K222n564
12172B730R73r959j276Q478L014p27K006m689P056K277p580k717J361k062M858
$$ y = [-10427, -13921, -3996, 5056, -3016, -13488, -15670, -12584, -10841, -2103, -948, -4102, -6292, 98, 5876, 8966, 10870, 10283, 13866, 20054, 23570, 14194, -1398, -4351, 2423, 507, -3039, 858, 9396, 15233, 13823, 11124, 10638, 8882, 9380, 10776, 16089, 18840, 11985, 4754, -1969, 6298, 6715, 9427, 17408, 18202, 16163, 6775, 7724, 12158, 9982, 7941, 2381, 3784, 563, 595, -1726, -1122, -3930, -8692, -3477, 337, -11755, -10265, -1870, -11140, -11331, -1230, -3819, -4646, 9897, 12990, 11086, 6873, 835, 1262, 5545, 5930, 6671, 4263, -2320, -8994, -16446, -8673, 9583, 9788, 3094, -3408, -4647, -7116, -2935, 4563, 5639, 6903, 6752, 1187, 3182, 6512, 12031, 15211, 12822, 3991, -1254, 6072, 8294, 2730, 3703, -6256, -7532, 946, 3960, 3233, 5239, 550, 7606, 9883, 2303, -414, 947, -1115, 3743]
12157C743M142N755o78j581o400j398L734n566K357l256k950r202J1802P064m407
12142C159q205K238J2456N908m2o583O29j348p250j693R080R378j071m976j2383
12127g03N98M900P342K093j274j4569j2919O001J7920R609l289p780o238j0975
12113i284k632L987J7506N577R76l027n184N107n217L894R870M900M211O145J0874
12098D7703p260n806j4453r821J2408p271j8173q270J0992m353n549L078O19J472
12084d684M784L498M033p86l255N173Q462M377q804j5449n808P649J43Q449P052
12069A4834k265j1684m66P41L137N00Q369j940l652n857N080M553k206o699J043
12054C488P035k51K897r80m843j72o235L877k290q606Q23M836J2316R307r395
$$ y = [3743, 7885, 13640, 12962, 11381, 4981, 3583, 7317, 1751, 4108, 852, -2098, -11300, 502, 7566, 3159, -5046, -2808, 9648, 15556, 15514, 8931, 9560, 8212, 962, -731, 8349, 17727, 16656, 11680, -703, -105, 4795, 12137, 14230, 12956, -1613, -14532, -8531, 9389, 18998, 15709, 7929, 1691, -9284, -11916, -7929, 9577, 15154, 16130, 13103, 7919, 13026, 7809, 11703, 21573, 26473, 30684, 36829, 47703, 40443, 34637, 20184, 10363, 22771, 15500, -2673, -10943, 49, -4304, -9853, -6775, -6156, -4684, 100, 3598, 7631, 6845, 3590, 8763, 17225, 21602, 12798, -2651, -8459, -810, -667, 7782, 14834, 12569, 885, 419, 1160, 4297, 4797, 13166, 11226, 7574, 1717, 6797, 11350, 9144, 2445, 3488, 10523, 10272, 13169, 12189, 7346, 7174, 939, 4816, 2526, -6080, -5257, -421, 11895, 21202, 11807]
12039A1807q855M025J769o375k007j964K329O89n06L412N56J156M497o509R485
12024A3509J0146Q0k79P548O636q028l706r523r36R870M701m167j462l168L16
12009B1537k719l063r229m904n037k575L00j591L260O927J272k099l1J75M092
11994F315j248n553P666n762k673o009L688O268M283Q602O616n903q298r602m512
11979f122M96K204j323K606J7872l127o042q44L819n412k35Q24m176K117J3861
11964A6518o367n977N345M091N235K519M196j5111k533Q972o043j0977N145P861
11950A2874o104m625m63Q966N174l829p80j712O25m224o353P380Q49O804P986
11935B2568j0967l069J765L139K053j879J731n49N018l873o452r25n761p359N314
$$ y = [11807, 2952, 6977, 8746, 2371, 364, -1600, 729, 1418, 912, 4324, 4880, 6036, 10533, 4024, 13509, 23655, 23735, 23456, 31004, 37640, 29612, 25906, 16383, 15447, 25317, 30018, 25851, 24389, 21221, 21537, 18818, 15755, 6526, 1622, -3415, -5990, -5690, -7281, -4021, 2906, 4178, 2079, 2048, 2223, 6315, 5067, -486, 7180, 1418, -1255, -7264, -3576, 2692, 6975, 15577, 22193, 16290, 7992, -1610, -6122, -5626, -3422, -4745, -2139, 15733, 12606, 6564, 5720, 9539, 4127, 3892, 4716, 540, 2657, 16518, 10151, 4174, 9519, 13610, 18845, 21364, 25560, 10449, 7916, 16888, 10845, -132, 5013, 12874, 6770, 2145, 1682, 10648, 15822, 11993, 11213, 9501, 10126, 5902, -451, 6929, 7778, 14582, 22568, 11601, 8532, 10297, 13436, 15489, 13610, 15341, 14792, 19810, 15937, 9485, 8560, 2799, -4560, 754]
11920G54O394N934M472L208r899N22j509j356k874l022o31K729M410k419o327
11905C86m619N63j423R277K61j2553j093o93K026M926N665J453M68p071n073P761
11889B61N855M988J422k095J290O794K186r172p201m651J376P405M28k993p58
11874E135P81p913m407N71j164O176l087j628J2268N463L80r592m801J994J406
11859A582k297J893N779n713k363Q785K796J627j668j292K682k804j601p594J94
11844FK301j0838O211K243K249M78J926l03M583M400l004R674j0144n569Q54k088
11828B979p243q410k173O640l3J2540M837J0681n99o966L567O810l543M028l235
11813A9880m673L95K530P28l845K526k162j0085q350L505P946m33j142K211J968
$$ y = [754, 7148, 13082, 17554, 20762, 10863, 11385, 9876, 8520, 5646, 2624, 1993, 4722, 9132, 6713, 386, -4233, -3670, -5093, 4184, 4445, -8108, -9201, -9894, -7868, -2942, 2723, 4176, 4644, -2427, -7500, 261, 6116, 11104, 12526, 10431, 11721, 18515, 20701, 11529, 4328, -323, 1053, 8458, 8886, 5893, 5135, 5916, -1997, -6404, -5833, -6997, -821, -3908, -5536, 6732, 12195, 12575, 2983, -1818, 176, 1582, -715, 1178, 6957, 1244, -1119, 7666, 10462, 12089, 10421, 9129, 11811, 9007, 7406, -188, 6, 2307, -8531, -2320, -77, 2172, 2650, 4576, 4273, 8856, 13256, 10252, 19926, 9782, 4213, 5067, 2979, -4264, -12674, -14847, -8207, -8240, 4300, 9137, 19818, 19219, 12253, 15820, 22630, 19087, 23115, 19880, 15207, 15602, 18132, 18860, 15015, 17541, 15379, 5294, -3056, 449, 8395, 7962, 6820, 9031, 10999]
11798A0999L43n025M029L453J513M006P378k047k923M415L501k787M37l165n851
11783A8276j3397j6112M937Q503k568M419N606m911J311K049J06P137O126j1687
11769I795p683O169n366P94p74m440p91J636N378l574Q084P055k440o400n189
11754B254k345M715L561j2945l537N756L916N223K755k959M31O845M450o502n563
11739F055r32m822l402R914L571J333n670Q07N506j035p70j967m127P184N992
11724A7637M210l243o096j5260Q94N896J0933K858K786K688J158Q835J486p166
11710B7616r015m137%m635p198j75R948Q640q222r672m024K835O36m07o333L736
11694d07J2224n769K976l172K891Q501K83L530K07o278n573p498k516m58l649
$$ y = [10999, 11342, 6317, 10346, 13799, 15312, 19318, 26696, 24649, 21726, 26141, 29642, 26855, 27292, 24127, 18276, 4879, -11233, -6296, 2207, -361, 4058, 9664, 4753, 6064, 8113, 8219, 15356, 21482, 9795, 2112, 8281, 2915, 3709, 2935, -1505, -2296, -660, 4718, 1144, 9228, 16283, 13843, 7443, 2254, -91, 4624, 8185, -4760, -8297, -2541, 1375, 6598, 9353, 6394, 6825, 13670, 18120, 11618, 6055, 5123, 301, -3101, 6813, 10384, 11717, 6047, 6854, 12360, 11325, 10555, 8588, 4461, 11645, 17637, 21847, 18604, 12508, -2752, -1858, 4038, 14971, 17829, 20615, 23303, 24461, 33296, 34782, 27616, 18601, 14464, 14464, 9829, 2631, 2456, 12404, 21044, 12822, 3150, -874, 1961, 2597, 2190, -4143, -407, 11817, 6048, 9024, 5852, 8743, 17244, 17527, 21057, 21264, 14986, 9413, 1915, -601, -1059, -4708]
11679d708l696J7916R560k340m002K582P904K493m231l701k653J0894L653k886
11665B6785n125o258L111Q968o411o195K329J8530k551j3048n784m672m596J154
11651F237J4152K88j5826n412P779M239P198J0168o191J138j626K690p648l784
11637A3402m859l228m493m599J1057L655O68K017m198n320n783J536O291P033
11623A3179k381R389J2520m497o298L08j831K373K856o828K574m396O687J0488
11609C4143J0731J7521J441j3315n055J0791Q44j5164r743l375q674l477q00l845
11595A2023J2387Q466Q094P939l860q270K827P852O17R02K0582J1746m761j8826
11581E7718o241j4050o831M18l242m129m286J1050K087k199p910J454K716j2159
$$ y = [-4708, -8404, 9512, 19072, 16732, 12730, 15312, 23216, 25709, 21478, 17777, 15124, 26018, 29671, 26785, 21660, 15402, 18513, 27481, 21070, 14875, 17204, 35734, 33183, 20135, 14351, 9679, 5083, 6237, 20389, 20677, 4851, -561, 7218, 11457, 18655, 28823, 22632, 23770, 22144, 24834, 17186, 13402, 8543, 5315, 822, -3777, 7280, 10935, 11603, 13620, 9422, 4102, -1681, -145, 6146, 13179, 10798, 20187, 32707, 28210, 21912, 22220, 20389, 22762, 25618, 18790, 21364, 16968, 23655, 34143, 44874, 62395, 63836, 50521, 45466, 56257, 57101, 41937, 32194, 28819, 20145, 16668, 15868, 12023, 24410, 32876, 40970, 48909, 45049, 36779, 39606, 47458, 48075, 48977, 69559, 81305, 76544, 57718, 51477, 37427, 30596, 31014, 27772, 23643, 19357, 30407, 32494, 30295, 22385, 23839, 26555, 14396]
11567A4396J98N587K749N90L525M375o098q760K094m093n685n894kn162J79O807
11551D806J969K533M303J798O43J204J602n224j830n407n790M477K2771J4637
11537D2492K241p546o300K968M551m097o455Q933L992j1496j400r352j2838K891
11523H584K535L94j181M890n131k290P112P206J640k798o621j257n249n258N219
11508G795L490O781J2208L18n308J05K41L948O057j2628J664K607r561k933Q119
11493B2903j018J00P640J515L462n954j5041p4o58k835p339J1312M306l371K804
11478A7752J0945m870K94k117p661o975J216k880K817J503R137L725n227m305
11464A3354l756m33m210L999p309K622N238P826J869l331R25l81P106P489J0196
$$ y = [14396, 14594, 20181, 22930, 23520, 27045, 31420, 25322, 16562, 18656, 14563, 8878, 2984, 2982, -2180, -2001, 4806, 6775, 9308, 13611, 15409, 16052, 17256, 18858, 13634, 11804, 6397, 607, 5084, 27855, 42492, 44733, 37187, 30887, 33855, 38406, 34309, 27854, 36787, 40779, 29283, 27883, 18531, 5693, 8584, 11119, 11513, 10332, 15222, 10091, 7801, 14913, 22119, 23759, 20961, 14340, 13083, 7834, 2576, 7795, 11285, 18066, 30274, 30592, 25284, 25389, 25630, 29578, 35635, 23007, 24671, 27278, 17717, 14784, 22903, 21885, 21985, 29625, 31140, 34602, 28648, 13607, 13533, 12875, 10040, 2701, 14013, 18319, 14948, 17752, 28697, 23827, 24121, 22004, 14343, 7368, 8584, 5704, 8521, 10024, 19161, 22886, 17659, 13354, 9598, 9165, 4955, 8954, 1645, 4267, 9505, 17331, 19200, 15869, 16794, 16413, 23519, 31008, 41204]
11449D1204k392q029j5788p411k652O87n43M004k80l059l775Q157K217L705O23
11434A6668J210L029j1586l375P819o370o605O35L682J0248k701P250j22j1700
11420H082m899P055R671O522p25J519r564r245j370O276k757O697K000k254P37
11405A7745j7L920R86n812k985p712n561o03m176l474N390o014N207J4477p9p948
11389C344J394L741Q06k953l09O599J635j3297o358m8N026O388O327N520q57k514
11373A4444J4086J0127j673J057k037j1370l553j2437K190J5141K455r729M17
11360A9118M812J0618p207m546K779l171K980j669p190L238N55r872j631L654
11346A2468o553k297R721N889K137k089l425O529M845l135N06l475n183P658N031
$$ y = [41204, 38812, 30783, 14995, 7584, 4932, 5619, 5076, 9080, 8800, 5741, 1966, 10123, 12340, 16045, 16668, 17878, 20907, 9321, 5946, 13765, 7395, 790, 1425, 5107, 15355, 12654, 19904, 19782, 8082, 3183, 10238, 19909, 26431, 25706, 27225, 17661, 8416, 7046, 13322, 10565, 17262, 19262, 17008, 17745, 17728, 21648, 22634, 16822, 13837, 6125, 564, -39, -4215, -7689, -2299, -8313, -3106, 11371, 11292, 3344, 4738, 8479, 9285, 6332, 6023, 12622, 14257, 960, -5398, -5446, -420, 5968, 12295, 17815, 16958, 14444, 28530, 38657, 36984, 38041, 36004, 24634, 21081, 8644, 10834, 25975, 28430, 18701, 19118, 23930, 34548, 27341, 22795, 25574, 22403, 25383, 23714, 16524, 19762, 20317, 10445, 8814, 12468, 5915, 3618, 13339, 19228, 21365, 19276, 15851, 22380, 27225, 24090, 24596, 21121, 15938, 23596, 28627]
11331B8627L444o246K888m720O690j517O474k329o631M610J808k568Q098q391
11317C0237k216p086o249k052N909K857N535N012J1690K1344J0890Q458o890p462
11303F9977j3613j1261r261p937q225o145m132M200K180M82M095J1142R264p821
11289C2945j4189M91J616r920l948j373r421P95L846Q168l517M54L368N099J8237
11274C2651P982O438N465o402r399k297j726j015j371N074o030j467R468J902
11260C9273o260M05K180k274l269q00o090L08r632K104O196j2986k023J1021J758
11245A9911o098p803r08K614N343M879N678k331l77J234j2191l406j409O897M92
11230A2525l513k995K119L750j834J899m30P626J490L299J0660K8610M7060N9156
$$ y = [28627, 32071, 25825, 28713, 23993, 30683, 29166, 35640, 33311, 26680, 31290, 33098, 30530, 38628, 30237, 28021, 20935, 14686, 12634, 18543, 21400, 26935, 31947, 43637, 64981, 75871, 84329, 77439, 69977, 56364, 45103, 35842, 27905, 19680, 13535, 9403, 13603, 15783, 16265, 20360, 31502, 40766, 32945, 18756, 19247, 20863, 10943, 6995, 5622, -3799, -3004, 842, 9010, 5493, 5947, 9315, 14414, 32651, 40633, 47071, 52536, 46134, 36735, 34438, 32712, 31697, 30326, 35400, 29370, 27903, 37371, 39273, 33013, 33418, 35598, 33324, 30055, 29255, 23165, 23473, 13841, 15945, 22141, 9155, 7132, 18153, 19911, 13813, 6010, 5102, 7716, 13059, 17938, 23616, 21285, 20908, 22142, 9951, 6545, 5136, 12033, 12525, 9012, 6017, 8136, 11886, 10052, 11951, 11521, 19147, 20637, 23936, 34596, 63206, 110266, 169422]
11216A69422N8529K6105j957l0942m4801n4782m6225k7293o517J74O152J602j6262
11203C3205p313l298j988q057o695Q204M628j589K838M83l609q900q659K387O405
11188H042k18J383n3K101J4175j20r690o851O187Q250k055m944Q35q167K24R267
11172A8366j423q923O778Q232J719l562r325o199L97J694l098K467J0341L484
11158B0948r845q422J407q40L200K969l975m491K723n621p079J484L151J312P894
11143D815R301J0479J1948L828j477r211j2936m104j2582k416N524L771k09p088
11129c57M93J0481N26p640p475o18J3071O846o588K135m150k774N643K057l450
11114H200m692J190L025n522N249J842k983k863m485O977N980k395P946l877m739
$$ y = [169422, 227951, 254056, 252099, 221157, 176356, 121574, 75349, 48056, 41539, 41713, 47865, 49467, 33205, 25892, 22594, 20606, 12549, 5854, 14058, 18686, 17097, 19935, 20418, 16809, 7909, -750, 1637, 8042, 7824, 9207, 9154, 11255, 25430, 25310, 15620, 8769, 14956, 23206, 21151, 16207, 17042, 8875, 9099, 18366, 16943, 8020, 14798, 23030, 24749, 21187, 11862, 5663, 6060, 7754, 4656, 7123, 17464, 20948, 11103, 2681, 4088, 3248, 6448, 9417, 5442, 951, 3674, -1947, -9026, -7542, -4391, -3079, 4815, 14116, 24595, 36543, 40371, 38894, 29683, 16747, 12643, 61, -2355, 3169, 6940, 6731, -357, 136, 10617, 11143, 3503, -3972, -4590, 8481, 15327, 8739, 10874, 6724, 3950, 9593, 11650, 8200, 3508, 4698, 7723, 2201, 7450, 9292, 6309, 3446, -1039, 5938, 11918, 9523, 17469, 13592, 8853]
11099H853m201Q84j211j039Q67j418J075L640j1851n652O135Q433J3015j003j3131
11084C396j7634l690M706P411j883M871J1155L581p595j5658l649J1917N800p733
11070e005J037J904l676n486K071K921j224n136L941J876M296j558K204L489O337
11055G991K076K04j3577l748J274L240m724P248M701M556O745q665j272N030Q27
11040A1906K403m666k4o53j1202J859J0853p108m071J2043P156q201L012J686
11026A4993j546k634j0174K34k139J29k840M849Q039j473k228l843K165o412j878
11011d758k76J676N388j944j55m74r16k899m190M050J699N517L329L261R328M580
10995B3216o693p253q916O089L531j3568q006M250k914J735J012L314P673K927
$$ y = [8853, 4652, 5536, 4325, 3286, 4153, 2735, 3810, 7450, -4401, -10053, -3918, 4515, 17530, 16527, 3396, -14238, -17928, -13222, -5811, -7694, -2823, 8332, 11913, 4318, -11340, -14989, -3072, 2728, -5005, -3968, -2064, -5740, -11226, -9155, -6234, -7458, -12594, -8653, -6777, -2481, -4039, -1835, 1654, 7991, 10067, 10271, -3306, -7054, -5780, -2540, -7264, -16, 4685, 9241, 15986, 7321, 6049, 11079, 11906, 14309, 9643, 9619, 8966, -2236, -377, 10476, 3368, -703, 11340, 18496, 10295, 13307, 14993, 13447, 10813, 639, 873, -1266, -1137, -3977, 872, 8911, 7438, 5210, 1367, 3532, -2880, -4758, -5034, -3358, 2030, 86, -69, -543, -1459, -4358, -8548, -4498, -2799, 2718, 6047, 9308, 18636, 23216, 16523, 9270, 354, 6443, 9974, -3594, -11600, -7350, -10264, -8529, -7517, -4203, 3470, 6397]
10981F397M019p934m353j797J0188l937k130q61O39K411q94M735K416o837p044
10966d982j039n041l66P121L955j76K427L419p211K48o286J465Q959L710L03K482
10950H988L595M179M568n051l685o907l704k5m9j352P214L901K654J551l738k975
10934I164J643J013p269L834R491J603J02o639j3528k073M192m011l563Q18k071
10919g294O480L839j799L749J157p543m597L480k60m569j672M218P782M163k930
10904D204j0491k434P851L894L175n200l380M192p104j4760J115J265J2492J1702
10890F521j160J541L903L865m298N350m937j5676k875R122K838j195j326q483
10876f810M316N931P618n443j3214J59J98J154Q313K587q064K499Q97K475P57
$$ y = [6397, 10416, 2482, -1871, -3668, 6520, 2583, 453, -408, 231, 2642, 1748, 6483, 8899, 2062, -4982, -6021, -11062, -11428, -4307, -352, -528, 1899, 5318, -1893, -1645, -7931, -6466, 2493, 6203, 6506, 8988, 12583, 16762, 21330, 16279, 12594, 5687, 1983, 1958, 1909, 557, 7771, 11672, 14326, 15877, 12139, 9164, 10807, 11820, 4551, 8385, 17876, 19479, 19581, 12942, -586, -2659, 1533, -2478, -6041, -5223, -7294, -814, 3025, 1226, 4975, 6132, -1411, -6008, -2528, -2788, -7357, -9029, -4811, 2971, 7134, 4204, -6287, -8721, -870, 3024, 6199, 999, -2381, 1811, -5293, -20053, -18938, -17673, -5181, 6521, 5361, 6902, 10805, 14670, 10372, 15722, 10785, -4891, -7766, 1356, 4194, 2999, 1673, -6810, -2494, 3437, 11055, 5612, -7602, -7443, -7245, -6091, 2222, 4809, -3255, -756, 141, 2616, 3373]
10861C373J74K42j814n060m554o433L284K13K696k650J610N025M623J1732k617
10846I844l729p454N909J492L3p788p928O658Q310Q620r231j4684k905J947Q687
10831b219O322J898L2L372n345p861N953P076l238o51o893p745j992K39O923J3603
10815I474n03j4601q75R228n382l648L542L127M05K282o26m947j495l014J271
10800e762O985M341K462P45l612J324L763j1236j0030M270L52K642K078l952k571
10785h201O559Q127l566m942M866M163o270m419n41N716J322J273k372n298j1449
10770a5032j502O079P175l13J56j035J1736P334p755r853P31K856J893O704R37
10755A0111j2247q771J635l449K845J0686k443q701O741R050O084k771p649l076
$$ y = [3373, 3547, 3789, 1975, -3085, -7639, -14072, -10788, -10575, -7879, -10529, -8919, -3894, 729, 12461, 9844, 6115, -1339, 4570, 6062, 6095, -1693, -9621, -2963, 5347, 13967, 4736, -9948, -12853, -10906, -2219, 4103, 6001, 6033, 9405, 4060, -3801, 2152, 9228, 5990, 5339, -1554, -9299, -11291, -11052, -4129, 9474, 8971, -5630, -6505, 2723, -2659, -6307, -2765, 362, 767, 3049, 2423, -2524, -4019, -7033, -5762, 1223, 5564, 8026, 8771, 5159, 6483, 10246, -990, -11020, -6750, -6398, -3756, -1678, -5630, -8201, -1642, 6485, 2919, -2023, 2843, 7006, 736, -3683, -4224, 1492, 2814, 4087, 1715, -3583, -15032, -16534, -10455, -3280, -3593, -3437, -4472, 7264, 14598, 6843, -3010, -2279, 577, 2470, 9174, 10111, -2136, -10907, -9272, -12721, -9876, 810, -1633, -10334, -3593, 5457, 11541, 8770, 1121, -1955]
10741a955J955K661j5267L78P446P568N772k592q311J994J718k334J689j308q1
10726f67Q165k851P82J987L256l087K860P323k29j4979q998N649n567N634N597
10711D875o171K311L588j880K253L616R44p143r303o333L905N646J922N375p32
10696B873m243o473o512L7m010M511P975J667r67o759o734P726N337K010M655
10681A093j14m999N635k215l085K680J950L583j2188k841K591J490J0381k39n323
10666a601m293k178O924Q312K248p649L350m684P048k465j857O740l779o184p837
10651g905N71J824L81K393n274j44O272K541l055q351p825n748j721N258Q537
10636a2246Q337l241o123J5061P240l510m771j1723N00O723q0k744K574p658n847
$$ y = [-1955, 0, 2661, -12606, -12228, -4782, 2786, 8558, 5966, -2345, -351, 1367, -967, 722, -586, -667, 7498, 4647, 5429, 7416, 10672, 7585, 10445, 17768, 17539, 2560, -6438, -789, -6356, -722, 4875, -1296, 1015, 4603, 2723, 4976, 8592, 9536, 2393, -6910, -13243, -9338, -3692, -1770, 3605, 2873, -1370, -7843, -14355, -14318, -18328, -13817, -5842, -4175, -5142, -11901, -18635, -10909, -5572, -3562, 1093, 979, -4020, 1615, -600, -3685, -1005, 945, 4528, -7660, -10501, -7910, -6420, 3961, 3722, -1601, -5894, -8072, -1148, 7164, 9412, 1763, 5113, 429, 7477, 5012, 3155, 9895, 6116, -68, -7905, -7334, -5510, -5129, -2736, -8010, -8154, -1882, 659, -2396, -10747, -18572, -24320, -26041, -20783, -12246, -3909, -7150, -13273, 1788, 9028, 5518, 747, -10976, -10476, -3753, -3833, -6577, -4003, -11661, -17508]
10621a7508Q249R621M040m72q708o456J583N289O984J584j488M331p816j0507
10607a1274L332j737q643M636L685j962J671J1198l628j385N320r842P781k005
10593b853l153o466L673Q054L841j8153q468O403L48N762J0671L95j3400l978
10579a7324J1827R894l179p615l427N278O445N66K324p766j223P59M624N92J493
10564C268k528n43Q765Q26n836J486L293j2217r888K381J507O561Q681q144p045
10549i433j1432l747R71Q938P051L988L696K813L918L361M882n153j1209n331
10535f687Q980O096o371l825k782L78P76r37N968K818K966J706l308j334O172
10520A0616N181J1406J9358J8041K717j0417j6583j2886j4537j1881j716J0972
$$ y = [-17508, -9259, 362, 4402, 3930, -4778, -11234, -9651, -4362, 2622, 4206, 2718, 7049, -767, -11274, -7942, -9679, -18322, -13686, -10001, -11963, -10292, 906, -2722, -4107, 1213, -8629, -848, -2853, -6006, -12472, -8799, -745, 3096, -15057, -23525, -17122, -16774, -11012, -341, 54, -13346, -17324, -5497, 4397, 1218, -6397, -9824, -4546, 1899, 2465, 4789, -2977, -4200, -3441, 1183, 1775, 3268, 740, 197, 8962, 9788, 3952, 5438, 8731, -3486, -13374, -10993, -9486, -2925, 5756, -2388, -9433, -20865, -24612, -23641, -14703, -7652, -3664, 32, 2845, 6763, 10124, 15006, 9853, -1356, -6687, 2293, 8389, 2018, -1807, -4589, -4211, -3435, -4372, 1596, 4414, 7380, 9086, 5778, 4444, 10616, 15797, 27203, 46561, 64602, 67319, 56902, 40319, 27433, 12896, 1015, -701, 10271]
10508A0271M141n852p01j458r83Q018j1990r299r355q443L115K692K029P957Q310
10493a548o575k064l505K276J0806N414Q892m855K511p692q324Q889J961o177
10479IJ64P700K360m641p253o81k622j85k058J1695K459q693l022M423J312P908
10463H875k250p592q137o700R07O76J372N163K848N532N30N770L69k63O846m705
10447I241q556n701n230m16J059j561l460N695J3024j875q859q334J838N967L965
10432c203n0N877P59K92o418k314P442J296m802l17N093K170L806k515r399J258
10416a025J718q13j0476m886k853M769L700L248N09m223L368J248O70N393J0892
10401A1239m52p497j0065j835N570J1173l9r65q682p586p53q337J389J0585J0805
$$ y = [10271, 14412, 8560, 7859, 6401, 5418, 13436, 1446, -7853, -17208, -25651, -22536, -19844, -17815, -9858, -1548, -8123, -10187, -13692, -11416, -610, 4804, 13696, 8841, 11352, 3660, -4664, 4225, 6186, 9, 173, 7873, 10233, 5592, -1661, -2342, -4964, -5149, -7207, 4488, 6947, -1746, -4768, -345, 967, 8875, 6625, -967, -9104, -15804, -14897, -14221, -12849, -7686, -4838, 694, 1224, 6994, 7363, 7100, 13946, 9241, 685, -5016, -10246, -10662, -9603, -11164, -14624, -8929, 4095, 2220, -6639, -14973, -13135, -7168, -3203, -3253, 2624, 3383, 3675, -2743, -5057, 2385, 3681, -1121, -1438, 3655, 5825, 9631, 7116, -2283, -1025, 693, -120, -10596, -15482, -18335, -13566, -9866, -6618, -6109, -10332, -6964, -5716, -5046, 347, 11239, 10787, 3290, -6775, -8610, -3040, 8133, 8094, 7129, -1553, -9139, -9892, -18229, -16840, -6255, 4550]
10386D550k098o074N10m241K628M734j593M082N207M729j028J864K765p441j3695
10371e101p865M017k252P354L735l551l162M18r262K974j270Q17P256j1236L439
10356a3689M817l431l222Q678J3626Q202N318l457p208n234k247J894R670J2890
10342B6607J126k169k039m913m079k641K169l429j137N764n585r837l004J932
10328a235O121K540p19m729J96J966K161Q249J920q113p343L543L285n398j166
10313A278l326o698J281K666J187N07K6R17R013J4308m054M06k768o331j954p378
10297i20Q540l580j0305O407p20k10L648m774M487j604o467J572l917q5n199L422
10281i705J354P584P268J730r307P859R064l468O287l710o213l737K218k263o670
$$ y = [4550, 2452, -3622, -3112, -7353, -4725, 9, -1584, 2498, 7705, 12434, 11406, 13270, 16035, 8594, -5101, -12966, -8949, -11201, -3847, -112, -3663, -6825, -6407, -15669, -12695, -13965, -13148, -5892, -17128, -13689, -8872, -12303, -15525, -6847, 6779, 14981, 20299, 16842, 9634, 4400, 2153, 4047, 13717, 26607, 27733, 25564, 23525, 18612, 14533, 11892, 14061, 10632, 9495, 15259, 9674, -163, -3167, -1235, 4886, 7426, 6707, 1978, 2174, 4140, 6301, 14550, 16470, 8357, 1014, 4557, 7842, 2444, 1278, -2048, -8746, -7465, -4799, -3612, -3105, -3079, -2162, 6851, 21159, 17105, 17511, 14743, 8412, 6458, -920, 7620, 4040, -6265, 142, -578, -788, 2860, -1914, 2573, 969, -5498, -3926, -7843, -7928, -13127, -9705, -8351, -767, 6501, 8231, -1076, 6783, 15847, 12379, 18666, 14956, 8743, 5006, 7224, 4961, -1709]
10266a709j5431J0061J2164L69K830J577J530J638j0784k902J559m222k05M04
10252c121P484J610l136k999J0835L402p04k706j024j815k763k035J68k260L825
10237D761L68k668M785L648J559J260Q05L045l915l45L378M341k811k020m002
10222A2189k565m635L450J218L332k793m206R076l918p484m020j09k594M749j748
10207e8p501N446J483Q18J1212m077l949j42J511J812o072j0272j854K825L100
10192e718j905l011j1402q296L682J3747J3673J7377j496n518k312o787P225k578
10178F681j33j4346n026N572R983Q839o197K136l171r183j1153n541O865P95J1482
10163b397N941l533q42L122K326k303j3480j2293J2708R30p100j623K951M503
$$ y = [-1709, -17140, -7079, 5085, 5454, 8284, 9861, 11391, 13029, 2245, -657, 902, -3320, -3525, -3121, 4363, 5973, 2837, -162, 10673, 14075, 13371, 10665, 9641, 7826, 5063, 3028, 3196, 936, 4761, 5129, 2461, 7246, 10894, 12453, 13713, 14518, 17563, 13648, 13303, 16681, 21022, 18211, 16191, 12189, 9624, 4989, 8439, 9657, 12989, 10196, 5990, 15066, 11148, 3664, -356, -465, -3059, 1690, -58, -7559, -2113, -630, 188, 11400, 7323, 3374, 3232, 4743, 6555, 483, -9789, -11643, -8818, -5718, -7623, -10634, -22036, -30332, -26650, -12903, 770, 18147, 16651, 11133, 8821, 2034, 9259, 6681, 6548, -7798, -12824, -7252, 2731, 11570, 5373, 7509, 4338, -4845, -15998, -21539, -14674, -13879, -2397, 3544, 11, -831, 2291, 4617, 2314, -11166, -23459, -10751, -9821, -16921, -18544, -15593, -11090]
10149a1090m102J77N757R835M224k054j1050l65L032K402k209r801n192L460m54
10134a7430q207N17N123M695N184l67N470J1447J299q415j0739L494j370l706
10120a3005J94l404L086M940R645m99j727O514j1932j6906n78M671K133J2221
10106d647L206K895P68j2683o66Q036k804n769O465K449L022O337n908o185N298
10091a86L550m110j6217M989R940j880p560n273Q033M597l600K08k047P270O60
10076a626K179m058o032j289R43M0L779M894n176P285J094l281K563O542m712
10061C145n858o90j694P302N612O193K006j0637j0266n346m482L466M675L550
10047c024p665q61M153J321l346M239M154k99Q480k936o889o788p652k933O960
$$ y = [-11090, -15192, -15015, -9258, 577, 4801, 2747, -8303, -8668, -5636, -3234, -5443, -15244, -20436, -16976, -17430, -25637, -25120, -19997, -15302, -10118, -10485, -5015, 6432, 7731, -684, -11423, -7929, -9299, -13005, -12811, -16215, -13129, -8189, 1456, 957, -770, 5744, -6188, -23094, -23672, -19001, -16868, -4647, -1441, 1454, 2222, -10461, -11127, -3091, -5895, -11664, -5199, -2750, 272, 6609, 701, -5484, -186, 3364, -746, -16963, -11974, -2034, -3914, -11474, -16747, -8714, -4117, -7717, -7509, -9556, -2286, -1626, 553, -3505, -9537, -10826, -9883, -9843, -6064, -1170, -6346, 939, 2033, -1248, 1315, 7857, 3145, -2713, -3403, -5097, 2205, 7817, 14010, 16016, 5379, -4887, -10233, -14715, -11249, -6574, -3024, -10689, -11550, -7397, -6076, -9422, -5183, -1029, -1328, 7152, 4216, -2673, -9461, -17113, -20046, -13086]
10032a3086J5540K253m756P21o27O668P544Q31o418k306L040q069j3101o658J041
10017a7383J344N490J0865P578n894o118j687r532k283L848J832O662K617p425
10003a0086j2186k433M612J2220K537m358Q22k523k819k241L605K419L231P28
9989f472K499o753r902P314N247n414M98L868K731m48K215J8412R020k294j0846
9974I675k668n278N108R483J420r377j4825l695N692M315n158o269O561Q517k31
9959C270n627j5107n472J180j103J468R691O444n466J897k787q61O74L109Q107
9944e83l769K10N631M520J729n938o214l955J0799J303k41m956l358k973j595
9929i390O629K270K1O382J104o67r661j980L090N420N139j593P961J4443K5357
$$ y = [-13086, 2454, 4707, -49, 672, 45, 6713, 14257, 15088, 8670, 6364, 9404, 1335, -11766, -18424, -17383, -16039, -10549, 316, 7894, 2000, -4118, -5805, -15337, -17620, -13772, -11940, -5278, -2661, -10086, -22272, -24705, -20093, -7873, -5336, -9694, -8872, -11395, -14214, -16455, -12850, -10431, -7200, -6472, -3973, -10726, -20628, -13314, -8067, -13481, -12983, -9115, -6384, -6832, -4617, 13795, 22815, 20521, 9675, 7007, 1729, 6837, 16320, 17740, 8363, -6462, -10157, -4465, -150, -5308, -11577, -5016, 3501, 3270, -2357, -17464, -22936, -21756, -22859, -21391, -11700, -5256, -10722, -8825, -11612, -12473, -11799, -8690, -583, -4352, -4142, 1489, 6009, 7738, 1800, -4414, -8369, 2430, 3733, 3492, -1464, -4822, -7795, -9390, -2761, -491, -470, 5912, 7016, 6349, -3312, -5292, -2202, 3218, 8357, 6764, 14725, 29168, 54525]
9914E4525K5375M382j0912r304j3755j8804j6653q241J864M595o67p421k677j0267
9900g960n452J1430J4697L80q830J186J271o233l619N44K943J609n890J552j488
9885c860m500l430O305P137k36o71R227j713q401m226k715p51J263P30L77M009
9869a455R695k071N360P336k545J440l933p495L094J65J008P206m552r625N29
9854D157P52R522Q4m809M971k900q5j575p599q69l44R10K256k138J646J0110q255
9837E834K820L166K525N978J3977J1559N765o515Q157J2877J2420K0252L8637
9824A37452P4648J35768K17210K66514J79710N551j45252k15282k06955j55116
9814B94248r7098n9165m5036j1708r266q293n487k89j638o686j7254p262N549
$$ y = [54525, 79900, 84282, 73370, 64066, 50311, 31507, 14854, 6613, 8477, 13072, 12405, 4984, 2307, -7960, -13412, -1982, 12715, 13095, 4265, 5451, 6722, 489, -3130, -2586, 357, 1966, -3924, -2372, -3860, -8360, -11790, -5485, 1652, 1416, 745, 9972, 8259, -142, -4368, -7083, -7834, -6571, -5841, -5464, -1455, 8240, 6169, 11529, 18865, 16320, 17760, 13827, 6332, 9426, 9591, 10599, 17805, 13253, 3628, 4157, 4909, 14431, 14515, 9706, 14677, 11777, 11692, 10117, 2518, 1649, 1305, 2215, 4471, 2333, 3979, 14089, 5834, 8654, 11820, 14345, 20323, 34300, 45859, 51624, 45109, 53266, 66143, 78563, 98815, 137452, 212100, 347868, 565078, 831592, 1011302, 1016853, 871601, 656319, 449364, 294248, 197150, 137985, 92949, 81241, 71975, 63682, 58195, 57906, 56268, 49582, 32328, 25066, 30615]
9801C0615k676J849Q30m323r030q137L188l51N747O01j597O806m414q621M812
9786A5299J4169K929q028p818p83O88j8048p333P134P892P253P273j0102j985
9772H540k925j226L29M830Q503m394J826r892o597n143L334J380M29k138o922
9757a0066P186j211j150n113r114M675N138P178j460q745o86J4364K417l865N061
9742D609R89m991M612M043n313n985J2097M212J90m301o067j0490l399K833j1017
9727a7978q755m295K198O457M214r68L455N278J393Q732Q67n697l898l734L80
9712a2351N583L93N247o5j444L170L19o458j2200K422n21J047j723P034K396J1
9696g140K85Q93P835L251l496J859n11K265N491R95L769n452o398l550l551k691
$$ y = [30615, 27939, 29788, 30618, 26295, 17265, 9128, 12316, 11965, 17712, 18313, 16716, 23522, 19108, 10487, 15299, 29468, 32397, 24369, 16551, 15768, 16456, -1592, -8925, -1791, 6101, 13354, 20627, 10525, 8540, 5615, 4389, 4718, 9548, 18051, 13657, 15483, 5591, -1006, -6149, -2815, -1435, -1006, -3144, -10066, -2880, -4091, -5241, -10354, -19468, -14793, -9655, -2477, -3937, -12682, -13368, 996, 3413, -452, 4609, 5598, 607, 5219, 9262, 3949, -2036, 10061, 14273, 14463, 10162, 4095, -6395, -9794, -6961, -17978, -26733, -31028, -28830, -22373, -18159, -19127, -15672, -10394, -9001, -269, 598, -5099, -8997, -12731, -12351, -6768, -6375, -1128, -1193, -2637, 533, 852, -5606, -17806, -15384, -15905, -14858, -16581, -9547, -7151, -7140, -6855, -5962, 1873, 5124, 1628, 3487, 2976, 5241, 10732, 11727, 15496, 10044, 3646, 96, -3455, -6146]
9680f146R305j777r855n035J569L709k798r3K302L109J357L535j1287J729L559
9665f817P526o60l882j367J986J122j340K130q633j573J0442M544n541L072P952
9650H961m943k44O63p866pj2249j899j084p86k817Q004J8375J308j264l323l650
9634b821J2958L009q403M784P247n548N027r08p664r93O617R19o817n187n24N342
9618G038O65N284M826j1330m367l693q24O236N70p467j008Q472J4251o442o136
9603F075L759K842m300m527P806N304J777k449m315p33j5818j0199o637k193J3407
9588a0201P123N235J097k244K743o153N682p531j1481M916m75N783N870k040k532
9573d208J392K895P332j496o677l368K894J901K769O732J369K396o571k685p759
$$ y = [-6146, 3159, 1382, -8473, -13508, -11939, -8230, -11028, -11121, -8819, -5710, -4353, -818, -12105, -10376, -6817, 709, 49, -3833, -5200, -3214, -2092, -3432, -1302, -9935, -11508, -1066, 3478, -2063, 1009, 8961, 4018, 3774, 4437, -3429, -3436, -15685, -17584, -18668, -19454, -22271, -14267, 4108, 5416, 4152, 829, -2821, 10137, 13146, 4743, 9527, 16774, 11226, 16253, 15345, 7681, 6688, 13305, 14224, 7407, 2220, 1696, 7038, 7703, 12987, 17813, 6483, 2116, -1577, -2401, 3835, 4405, -3062, -4070, 4402, 18653, 12211, 6075, 9834, 12676, 8376, 3849, 11655, 16959, 18736, 16287, 11972, 11239, -4579, -14778, -21415, -23608, -10201, -3078, 2157, 3254, 1010, 3753, -2400, 3282, -4249, -15730, -10814, -11289, -5506, 364, -1676, -4208, -2816, 79, 7411, 5915, -762, -4130, -1236, 665, 3434, 10166, 11535, 13931, 7360, 4675, -3084]
9558c084m745j60M636L959k625j0847k178N016K302J904K597j406j0230n442L984
9543a6319J6573R082p515p849K60K348J568J511N663q560L131M172J2722r508
9529G279o089k206l225n601q304L2J3038k117k859P081L470k829r857k080R035
9514e232O694J264M31m689k806K185J966J341n19O730J0264p4m849j64n326L303
9498A0519j299k199j674l76P3q26l823K41k925n216J2719P332r419j645p470K800
9482c188R451J896K632k089L88J81N669L615p561j4206J289k057O34J818k346
9467c874j527K146K873k514P922O890J137m281N462J304j903n979j2886r76K968
9452c238J5986N355L11L8K218q474q984l278N508P847L534K76l399N231l020r981
$$ y = [-3084, -7829, -7989, -3353, 606, -2019, -12866, -15044, -10028, -7726, -5822, -3225, -4631, -14861, -20303, -16319, 254, 9336, 1821, -6028, -5768, -3420, -1852, -341, 5322, -3238, -107, 4065, 16787, 7279, 1190, -1016, -4241, -9842, -18146, -18114, -5076, -7193, -10052, -2971, 499, -2330, -12187, -14267, -5232, 1462, 2726, 3157, -1532, -4338, -2153, -187, 1154, 635, 7365, 17629, 17555, 12706, 12542, 7216, 10519, 9220, 7021, 5347, 4971, 5044, 4218, 395, 636, -2289, -7505, 5214, 12546, 3127, 1482, -5988, -3188, 6263, 8159, 10791, 8702, 9090, 9271, 14940, 18555, 10994, -3212, -1923, -3980, -3346, -1528, -3874, -5401, -3255, -382, -2896, 5026, 11916, 13053, 8772, 14234, 15538, 13635, 7656, -5230, -6206, -3238, 12748, 18103, 18414, 18452, 20670, 12196, 3212, -66, 5442, 13289, 16823, 17099, 13700, 18931, 15911, 5930]
9436E930N523P781j009j1195P01K455N341L421m249K929n442j884J273k042j197
9421H336P352K256N876R582J0947l396j3516j382K767K280m060p081R87Q373o107
9406B3214q197m293k220N014R943q09M433N092j347N595n315n169o93l931K389
9391B3706N245K674K303R422J285k978k503o293j3307m109R590Q005R29N063R80
9376D0012j081o581L631R078M985O009M335L70q839k889Q56J525J153l643Q499
9361E7420J3937j138K153O389M489O109m442j547m207O367j934P601K202l52M764
9346I7811J9862R324Q377O443O182M044J710j926J0691J4967J4232Q089J3516
9333B13322J4820K349r40J4641N660L415J0699j424M014J1864J9608J0022J0384
$$ y = [5930, 11453, 19234, 18225, 7030, 7731, 10186, 15527, 18948, 14699, 17628, 12186, 10302, 11575, 9533, 8336, 15688, 17944, 23820, 33402, 44349, 40953, 27437, 26055, 28822, 31102, 27042, 19961, 20948, 29321, 23214, 15017, 10724, 8504, 13518, 23461, 22652, 27085, 32177, 30830, 36425, 31110, 25941, 25248, 21317, 23706, 28951, 31625, 33928, 43350, 44635, 41657, 39154, 32861, 19554, 15445, 25035, 33040, 33969, 39032, 40012, 38931, 32350, 35981, 45059, 50044, 56053, 60388, 60758, 51919, 49030, 49886, 51411, 52564, 48921, 57420, 71357, 70219, 72372, 78761, 83250, 89359, 84917, 83370, 79163, 85530, 83596, 91197, 93399, 93047, 97811, 117673, 126997, 135374, 141817, 147999, 152043, 153753, 151827, 162518, 177485, 191717, 199806, 213322, 228142, 230491, 229551, 244192, 249852, 253267, 263966, 262542, 266556, 278420, 298028, 308050, 318434]
9320C18434J826J0204J1016Q967J0382l346n87L707M07j0027O533p202k240k692
9306C45382p814j6115j3010j1788k527j631n913j2566j0538n798j5611j2639p709
9293B21723j765j0910j2938p942o667n621q548n019j2742p689o869q068K96l069
9279A24172n034r537R28k42m049N729P839N116o786j0913p434p918J930J3293
9265A07094J1701J3580L8119N2582P5162P1390M3844n35l8533o6450o5164n8095
9253A84695m3247k1534q615n475o557m185r157n864q976k975j780Q127K583K5
9239G7065j546j7405j666J439p24J447J0270K381N697L195K559l650p380p249
9225F4433P659J0673P971n788N756K6547L7428N9859R1690J48997J90989J15438
$$ y = [318434, 320260, 330464, 341480, 350447, 360829, 357483, 356896, 360603, 361010, 350983, 357516, 350314, 348074, 345382, 337568, 321453, 308443, 296655, 294128, 292497, 286584, 274018, 263480, 257682, 242071, 229432, 221723, 219958, 209048, 196110, 188168, 181501, 175880, 167332, 162313, 149571, 141882, 135013, 126945, 127241, 124172, 119138, 109601, 110529, 110287, 106238, 111967, 119806, 124922, 118136, 107223, 99789, 91871, 93801, 107094, 118795, 132375, 170494, 223076, 298238, 369628, 413472, 412937, 374404, 307954, 242790, 184695, 141448, 119914, 111299, 105824, 99267, 95082, 85925, 80061, 71085, 68110, 66330, 74457, 77040, 77065, 75519, 58114, 56448, 57887, 57163, 58610, 68880, 71261, 76958, 80153, 82712, 79062, 71682, 64433, 72092, 82765, 90736, 84948, 90704, 117251, 154679, 214538, 306228, 455225, 646214, 761652]
9213G61652j1915q4634j31236j47645j12772o0497l4766k4922k7518k6337j5518
9202H3892j0112R56Q057M443p441j0172j2433o736l639k36K265m007o510O351
9188D4678j857l843m117m059O640J0323p939N025K391q50L663J3492J0108J1820
9174H5475N500J6201K7201M8129P3156O7061J9429l4953n9071o4155n4612l2386
9162I6975j6770r000j2216j513K696p821m321M8l073j210L181p359j0467j0987
9148A8163L333J5593L306p28l095j499j930o4j1462q949Q66R433q264r925J41
9133D919M743o917n886k998l355j4501j8758j3562j1813M652K8079J9195Q714
9120g488Q237J379K33K1168N663n589k399L273P070J1185M742J292o853j1398
$$ y = [761652, 749737, 665103, 533867, 386222, 273450, 212953, 178187, 153265, 125747, 99410, 83892, 73780, 74736, 82793, 87236, 79795, 69623, 57190, 50454, 46815, 46579, 48844, 44837, 38327, 44678, 42821, 38978, 34861, 30802, 37442, 47765, 39826, 44851, 47242, 46392, 50055, 63547, 73655, 85475, 90975, 107176, 134377, 182506, 255662, 322723, 342152, 307199, 248128, 183973, 129361, 96975, 80205, 71205, 58989, 57476, 60172, 52351, 48030, 48078, 45005, 43795, 46976, 39617, 29150, 18163, 21496, 37089, 40395, 39667, 36572, 35073, 33143, 33079, 21617, 12668, 13534, 22967, 14703, 4778, 4919, 9662, 2745, -3141, -6139, -9494, -23995, -42753, -56315, -68128, -63476, -35397, -16202, -7488, 749, 2128, 2361, 23529, 29192, 23603, 21204, 24477, 31547, 42732, 47474, 48766, 41913, 30515]
9106C0515r951J16M31K453J1180k686j1578n439k992j315l997J225J1884P223
9092B7069q883m373m778K61j377k633j837K993o29o963l984l472j7044r268M300
9077c0618O194M821J7392J4299J2159J3842J0935K1336Q731m102n977q675p221
9064E3116l377r83m579j2694j4359L251l958j1892J828K607R5m101k567Q626J2464
9049B3477P210j204J487L737j7190n555J755N088M718P062j1316j2271O854J700
9035A5552p928p051K403o848M313J1499J099k199j755p334l428J369L39j3358
9021a3327r629q898o015o181k25K4083M0995M5074K7738J3659j1278j1845L600
9008H7751O088m420P467O446O388l892n911k2375k0394l498j157R064m849j7339
$$ y = [30515, 20564, 20680, 21111, 23564, 34744, 32058, 20480, 15041, 12049, 10734, 6737, 7962, 19846, 27069, 18186, 13813, 9035, 9296, 7919, 5286, 3449, 6442, 5813, -1150, -5134, -8606, -25650, -34918, -30618, -24424, -19603, -2211, 12088, 24247, 38089, 49024, 70360, 79091, 74989, 69012, 60337, 53116, 49739, 48756, 44177, 31483, 17124, 20375, 16417, 4525, 6353, 8960, 9055, 4954, 2387, 11013, 23477, 30687, 29483, 30970, 34707, 17517, 11962, 13717, 18805, 23523, 30585, 19269, 6998, 13852, 15552, 7624, 573, 2976, -3872, 441, 11940, 13039, 10840, 9085, 1751, -1677, -308, 31, -13327, -22956, -31854, -37869, -44050, -44275, -20192, 20803, 65877, 93615, 107274, 95996, 84151, 87751, 93839, 89419, 96886, 103332, 109720, 105828, 99917, 77542, 57148, 53650, 52493, 61557, 56708, 39369]
8994C9369o206n669R1O699O373M434p287O84K3201R221q310j8402k0953j8281
8980D964j6742k638l689m601k755p685k3625j5536O626M6328R6265R7540O0462
8967B34914K2902m354j4579j7701j3437n967k164j25q503k926m197q947j3265
8954A61651j2447p535Q243J4299K185m412o896o496o660j5572n474J4201K0083
8941A55170L2442K4456j1325k4275k6354j6432j3710j3711J234M875J616j332
8929A12654N631k621J967J9791M8743N1592M1630K6645L209O61j4291j1726n528
8916B78357J965P77J4512R884k371m025k47Q44K667J2460K0479K2393J3709Q415
8902C79819J5067J3636K1642J5173K3557J5969J9139J6625J8257N120Q267K5214
$$ y = [39369, 33163, 27494, 27585, 34284, 40657, 45091, 37804, 38488, 61689, 70910, 62600, 44198, 23245, 4964, -11778, -14416, -18105, -22706, -25461, -33146, -56771, -72307, -65681, -19353, 76912, 174452, 234914, 257816, 253462, 238883, 221182, 207745, 201778, 199614, 199489, 190986, 188060, 183863, 174916, 161651, 149204, 141669, 149912, 164211, 166396, 161984, 155088, 148592, 141932, 126360, 120886, 135087, 155170, 187612, 212068, 200743, 176468, 150114, 133682, 119972, 106261, 107495, 112370, 113986, 112654, 118285, 115664, 117631, 137422, 186165, 237757, 279387, 306032, 309241, 309902, 295611, 283885, 278357, 280322, 281099, 295611, 305495, 303124, 299099, 298852, 299696, 302363, 314823, 335302, 357695, 371404, 379819, 394886, 408522, 430164, 445337, 468894, 484863, 504002, 520627, 538884, 544004, 552271, 577485]
8890E77485K5501K8827K2050L7785M8838O9316Q1324P7245Q8945J02449J04119
8879A263884J06157J17743J28204J67090K00456K68527L28761L59544L97235M71625
8869C809226O05900Q14407J154001J702863K582413M087740O734507J1156328
8861C2647385J6366798J5743615N455385m885323j1315660j4059991j2086750
8854B7865459q020787m887828l099405k093048j502958j094743q02399n80334
8846E783957m26545l37297l11924l09970k80288k34641j67045r8752n5636j3520
8836C548339K6255N8092R3032J19748J73248K20497K95320M23744N35587O02858
8826F096720O95884Q26659J031392J393684K019707K993411M565475P239857J2088650
$$ y = [577485, 602986, 631813, 653863, 691648, 740486, 809802, 891126, 968371, 1057316, 1159765, 1263884, 1370041, 1487784, 1615988, 1783078, 1983534, 2252061, 2580822, 2940366, 3337601, 3809226, 4415126, 5229533, 6383534, 8086397, 10668810, 14756550, 21491057, 32647385, 49014183, 64757798, 70213183, 65327860, 54012200, 39952209, 27865459, 19844672, 14956844, 11857439, 9764391, 8261433, 7166690, 6364291, 5783957, 5357412, 5020115, 4708191, 4398221, 4117933, 3883292, 3716247, 3617495, 3561859, 3548339, 3574594, 3632686, 3725718, 3845466, 4018714, 4239211, 4534531, 4958275, 5493862, 6096720, 6792604, 7619263, 8650655, 10044339, 12064046, 15057457, 19622932, 26862789, 38951439]
8817C8951439K0866858L3500453L5607488J3284865q895898k2526104k9536267
8810H1252834k5814100j6878847j0055529o288025m215666l007296k219489j615608
8802A1158274j193838q84302o60321o26666o73466o63437o12973n31258m34780
8793D877233l44461k54706j93587j53285r3236m6505j1298J412K6815Q2135J45317
8782D035834K20387K89768L73689M71298O57916R53069J411352K150368L387478
8773A3951159N516680R168499J4294122J6317777Q473202k486684r651046j3444881
8765D2138828j2735296q938827n462683l400336k264653j597158j174300q64564
8757E701011o46778m83349l68110l26396l50829l59882l34816l05642k58614k06594
$$ y = [38951439, 59818297, 93318750, 128926238, 142211103, 133315205, 110789101, 81252834, 55438734, 38559887, 28504358, 22216333, 18000667, 14993371, 12773882, 11158274, 9964436, 9080134, 8419813, 7793147, 7119681, 6456244, 5843271, 5312013, 4877233, 4532772, 4278066, 4084479, 3931194, 3837958, 3791453, 3780155, 3781567, 3808382, 3890517, 4035834, 4256221, 4545989, 4919678, 5390976, 6048892, 7001961, 8413313, 10563681, 13951159, 19467839, 28636338, 42930460, 59248237, 67721439, 65234755, 55583709, 42138828, 29403532, 20464705, 15002022, 11601686, 9337033, 7739875, 6565575, 5701011, 5054233, 4570884, 4202774, 3876378, 3525549, 3165667, 2830851, 2525209, 2266595, 2060001]
8747B060001j81130j54725j33596r5860p2849o5746p4996r1140q2499q2245o1415
8736I63800o0824m8610l9263m3123m2576l1932l4913l3870l8028l7446l0587k3836
8724D98792k2146k8044j5143m326J575j3538k2476k9559k2709k3047j1161j4609
8712B93609j0659o998j1834j3009j9157k4770j5134o947K4827M3705M7498L5879
8700C37010J8239p515j7278j5368j7269j0170Q72L972j2254q240L823O501L124
8687B85447O010L705r545j5858k6730r640p356j5936j2855m489r029m217l579
8674A75928k872p213o81k1475k5926k3003p701l127R9k975j7462j5526k2571l4412
8660h917o641N5422P5332P6756O6952L5484j786j5346j8542j1406j5615r006r170
$$ y = [2060001, 1878871, 1724146, 1590550, 1494690, 1421841, 1356095, 1281099, 1189959, 1107460, 1025215, 963800, 902976, 854366, 815103, 771980, 729404, 697472, 662559, 628689, 590661, 553215, 522628, 498792, 476646, 448602, 433459, 429133, 430708, 417170, 394694, 365135, 342426, 319379, 308218, 293609, 282950, 275952, 264118, 251109, 231952, 207182, 192048, 185101, 209928, 253633, 301131, 337010, 355249, 347734, 330456, 315088, 297819, 287649, 288521, 292493, 280239, 271999, 275822, 282323, 285447, 291457, 295162, 285617, 269759, 243029, 233389, 226033, 210097, 197242, 192753, 183724, 179507, 175928, 173056, 165843, 165162, 143687, 117761, 94758, 87057, 83930, 84029, 81054, 63592, 48066, 25495, -8917, -15558, 39864, 115196, 191952, 258904, 294388, 292602, 277256, 258714, 247308, 231693, 222687, 213517]
8647B13517j2766K90K073l96j1643k208l664l271p367j1946j2345m58P004j5800
8633A41020j4059m386N263K142K426o450j4865o074m750J917J0235L4206O2523
8620B09148Q2786O2742j229m4634p0840n6616j9162O615J3349J0771M368N317
8608B02615K964j0902j2780j995k448q330p587n702o863o615j57P447K863m799
8594A47711o554l778K601J1683K336l895j1141j642J320m778m312q681r830n791
8580A05249R926J4911L4637O5461R5123J37562J41389L6997n2722j03834j21312
8569C63387r8796n3624j9836l176l854j2513j3608o461p569j3691o363j59p236
8556A16501p624k820J215j844J304J1807J8517J1829J2542l834k718q952q287
$$ y = [213517, 200751, 201041, 203114, 202718, 191075, 188867, 185203, 181932, 174565, 162619, 150274, 149816, 156820, 141020, 126961, 122575, 127838, 129980, 132406, 125956, 111091, 105017, 100267, 102184, 112419, 146625, 209148, 291934, 354676, 353447, 308813, 237973, 181357, 162195, 168810, 182159, 192930, 197298, 202615, 205579, 194677, 181897, 179902, 177454, 169124, 161537, 155835, 148972, 142357, 142200, 149647, 152510, 147711, 141157, 137379, 139980, 151663, 153999, 150104, 138963, 137321, 138641, 133863, 129551, 120870, 111040, 105249, 115175, 130086, 164723, 230184, 325307, 462869, 604258, 641255, 588533, 484699, 363387, 264591, 210967, 191131, 187955, 184101, 171588, 157980, 151519, 143950, 130259, 123896, 123737, 116501, 108877, 106057, 107272, 105428, 106732, 118539, 137056, 148885, 161427, 157593, 154875, 145923, 137636]
8543A37636j5452j1706p959j988j5361L545N144q463n248J7455K1983K3413L1801
8530A74800N6931O9396K7209k0185l7974n7925n2894l7128k6675j7772r373j87
8518F8223N735K734Q667m205J0723L270j0110p066O50m213P36K622O460K3584
8504A07810J8353J5304J942j0726r551j0239j5798j6154l426j0687j304L674n839
8491F3359k973j938J128m245j484P68L566J28l079p834K399J1253J161q349l660
8476E0200L971L244m701o83L054R08p78J914R43M27K169K544K854L386J8456J8132
8460A06040J1179K1290L3695M7655O8059O9906M0658p283n0803o4809o4306l8489
8448A72792k3939k0530j8578j6096j4222r944M659M001k008n952l794j578j0213
$$ y = [137636, 122184, 110478, 102519, 100531, 85170, 88715, 93859, 85396, 80148, 97603, 119586, 142999, 174800, 231731, 301127, 328336, 308151, 270177, 212252, 159358, 122230, 95555, 77783, 68410, 68223, 73958, 76692, 85359, 81154, 91877, 95147, 85037, 77971, 78621, 74408, 75144, 77766, 84226, 107810, 126163, 141467, 143409, 132683, 123132, 112893, 97095, 80941, 77515, 66828, 65524, 69198, 63359, 60386, 58448, 59576, 55331, 53847, 54615, 58181, 58309, 55230, 47396, 49795, 61048, 62209, 53860, 50200, 54171, 57415, 52714, 52031, 55085, 55993, 55215, 57129, 58072, 58499, 60668, 63212, 66066, 69452, 87908, 106040, 117219, 138509, 172204, 219859, 287918, 357824, 398482, 391199, 340396, 275587, 211281, 172792, 148853, 128323, 109745, 93649, 79427, 69483, 74142, 78143, 76135, 70183, 66389, 64811, 54598]
8435E4598L398L572L551m103n180L616N433J439n755r019o540p137k772J2950
8421D8051J7325J0617K999J5389J8481J0131J0134L6211O0555R4827J51430J88043
8409F64193J02566j9878j04310j47317j34523j02171n6045l5909l0830k2284q318
8398A05174r61l286j4645o820r287k985k245N841j000j0491m790M617N138j660
8384F2600j4063l108O65j055k697l11m656R000L956L756J0465L188n230O475N02
8369F9487J9626K6878M3469P0775P9860M8670o135m4069n4875n7846m4012k8756
8357A23072k1484k1327j2062j1130q708n424L163N940j400j3945o214Q8k630J072
8343B9011P062M744j1790l135M959J994j654p723k94M708o869K353M376o96K536
$$ y = [54598, 57996, 61568, 65119, 61016, 55836, 59452, 64885, 66324, 60569, 51550, 45010, 37873, 35101, 48051, 65376, 75993, 78992, 94381, 112862, 122993, 133127, 169338, 229893, 324720, 476150, 664193, 766759, 746881, 642571, 495254, 360731, 258560, 202515, 166606, 135776, 113492, 105174, 104213, 100927, 86282, 79462, 70175, 67190, 64945, 70786, 69786, 59295, 54505, 59122, 64260, 62600, 48537, 45429, 46094, 45039, 42342, 42031, 37375, 46375, 50331, 54087, 64552, 67740, 62510, 68985, 69487, 89113, 115991, 159460, 230235, 310095, 358765, 352630, 308561, 253686, 195840, 151828, 123072, 101588, 80261, 68199, 57069, 48361, 42937, 46100, 52040, 50640, 36695, 30481, 30569, 27939, 29011, 36073, 40817, 29027, 25892, 30851, 32845, 31191, 23468, 23174, 27882, 21013, 23366, 27742, 27046, 29582]
8328B9582K907N110k731j6183k791J890K244k299M129J1927K046M263L001p596
8314C5499r695j1536j3356l337O066K844j116L903j233L293M239K848J039q303
8300A1155n111O797M024n24j916o719k969l748P069K680k611N590O464j642p59
8285A7780O036J283j375l408m315K77J068q72O571N821R43l068M172j0806j342
8270A8765j714m536P573N247n29p973j824P947J423m48o665J714N517l486m448
8255A6563r124M508P455k048o46N5m684k935J261K454k546m0j182N945o55n484
8239H897n352M785J883O47m397j452k457k917k548J582R29J0001P441m026M318
8224A7334J582J293Q225n068n159M73j284p819J3P247r852n827O304k514m843
$$ y = [29582, 32489, 37599, 34868, 18685, 15894, 17784, 20028, 17729, 21858, 33785, 35831, 40094, 43095, 35499, 25804, 14268, 912, -2425, 3641, 6485, 5369, 9272, 8039, 11332, 15571, 18419, 19458, 11155, 6044, 12841, 16865, 16341, 14425, 7706, 4737, 989, 8058, 10738, 8127, 13717, 20181, 18539, 17780, 23816, 25099, 23724, 20316, 16001, 16278, 17346, 16474, 23045, 28866, 29809, 26741, 30913, 20107, 18765, 17051, 12515, 20088, 25335, 24806, 16833, 15009, 22956, 24379, 23931, 17266, 18980, 24497, 21011, 16563, 7439, 11947, 19402, 17354, 16708, 16763, 12079, 9144, 10405, 12859, 10313, 10273, 9091, 15036, 14381, 8897, 3545, 8330, 10213, 10860, 6463, 5011, 2554, -363, -2911, -1329, -400, 9601, 17042, 13016, 17334, 18916, 20209, 28434, 23366, 18207, 18680, 17396, 9577, 9590, 16837, 6985, 1158, 7462, 4948, 105]
8209A05K228P756Q911j668m61n687J011n219n143J828p34N394O10J405o04m034
8193E698N46O326N182n64m383j118j082O719K845n754N033L272j581L98l187n526
8177A2824k338N570q945l479l286P29K681P390L495M300r774m497L758M586m667
8162H347j991K963l312p025O426R442l967P752n110q821j039M305r914j214L62
8147b796J2617P954l655j7351K50O732LM135K131m84J817l911j0029L652l105
8132b040K126J760k107J1172L863q241L261k156M376L793m32n412j6N985k784
8117A3148o52o236M079l84m130r192k596O33k01R416K340k331M631m13o85M814
8101A2241M463l653m304j975n20M570N477J919j514j007N558P479K981Q465N888
$$ y = [105, 2333, 10089, 19000, 17332, 16871, 11184, 12195, 6976, 1833, 3661, 2927, 8321, 8931, 10336, 9732, 5698, 6244, 12570, 17752, 17188, 12805, 11687, 10605, 17324, 20169, 14415, 19448, 22720, 21139, 21537, 18350, 12824, 10486, 16056, 7111, 3632, 346, 1075, 3756, 11146, 14641, 18941, 9167, 4670, 8428, 13014, 8347, 6356, 9319, 6007, -1018, 5408, 14850, 10883, 18635, 13525, 4704, 3665, 7970, -1944, -3158, -2796, 9821, 17775, 14120, -3231, -2981, 3751, 3754, 7889, 10020, 9536, 11353, 7442, -2587, 1065, -2040, 86, 1846, -261, 10911, 14774, 6533, 9794, 7638, 12014, 15807, 15375, 9963, 9947, 15932, 13148, 12496, 6260, 10339, 9955, 5825, -3367, -5963, -5330, -5531, 3885, 6225, 3894, 8525, 8112, 7427, 12241, 16704, 13051, 8747, 6772, 6252, 10822, 16299, 18218, 16704, 15697, 21255, 28734, 31715, 40180, 46068]
8086D6068L393n69O061R09j4359p806j1361J299M985m153m094o695q878K316M433
8071A1549l43K382n752j2059O931J0046J117K056J164k865M068N633M627n243
8057B3311j163N451o229K836J1223R296j761n156J778K257M663j298L13O328R288
8042F1137J8317K8935J6994q0R73L269j6441k3927k1258j0304k497P518o906o448
8028D9282k959n781J086m783q692m256O934o753p627J1408P749o018l083L280
8014B9787j2317m788J3531j960L409K513O135J831L269K272l890J2435J4129N104
8000G1460n432K731J2705N980n175N02l418j776R136q435k88J794j1345j2072
7986E6367n100j110q08q806p502p147m700o374l095P752p52l190n072L028M330
$$ y = [46068, 49461, 48892, 54953, 55862, 41503, 33697, 22336, 23635, 28620, 24467, 20373, 13678, 4800, 7116, 11549, 11206, 13588, 7836, -4223, 2708, 12754, 13871, 15927, 17091, 14226, 18294, 23927, 28554, 23311, 22148, 27599, 21370, 24206, 35429, 44725, 42964, 37808, 39586, 41843, 46506, 45208, 45521, 51849, 61137, 79454, 108389, 125383, 125303, 126276, 129545, 113104, 89177, 67919, 57615, 55118, 62636, 55730, 49282, 46323, 40542, 41628, 36845, 28153, 23897, 30831, 24078, 16451, 27859, 35608, 29590, 26507, 29787, 17470, 12682, 26213, 24253, 27662, 30175, 36310, 38141, 41410, 43682, 39792, 52227, 66356, 71460, 66028, 68759, 81464, 87444, 82269, 82771, 79353, 77577, 86713, 78278, 77990, 79784, 68439, 56367, 51267, 50157, 49349, 40543, 33041, 25894, 21194, 14820, 11725, 19477, 18725, 15535, 10463, 13491, 17821]
7971A7821J708N306k423n950n199L314k42p60Q82J4956l5j0730j5972o53O798
7956H821K408R42K418O660J1772n642o461N379r982j371J664m212O090Q261j320
7941B5427k395J083o186m374q194o381o022N933L769J059k263L506Q916K397l438
7926A2837L511N368p925L775Q12j1553o45P440K692M073n300J372K142p059k875
7911H665k407P022L662j121m07m031j5327P981J1190l263q850k876K031J2763
7897A5032n600p023m592M828M805j186K921M646n726l566j926J440j783j032J4500
7882A5738L465J106j0574m212R234J1124J0235k283o867j3259j2641O554J130
7869H750o072l459K581K724L947K558K148m096J726j834l783J026L651k838m912
$$ y = [17821, 19529, 24835, 22412, 16462, 11263, 14577, 14335, 13575, 14457, 29413, 29378, 18648, 2676, 2023, 8821, 11229, 12171, 14589, 21249, 33021, 27379, 20918, 26297, 16315, 14944, 16608, 12396, 18486, 26747, 25427, 23032, 24115, 17929, 13555, 5361, -1020, -7042, -1109, 2660, 3719, 1456, 4962, 13878, 16275, 12837, 16348, 21716, 13791, 17566, 18378, 6825, 6180, 13620, 16312, 20385, 15085, 16457, 18599, 11540, 8665, 6258, 13280, 16942, 15821, 15414, 11383, -3944, 4037, 15227, 11964, 3114, 238, 2269, 15032, 9432, 2409, -2183, 2645, 7450, 6264, 9185, 13831, 8105, 4539, 2613, 4053, 2270, 1238, 15738, 19203, 20309, 9735, 5523, 14757, 25881, 36116, 33833, 26966, 13707, 1066, 7620, 8750, 2678, -781, 1800, 4524, 8471, 11029, 13177, 9081, 10807, 8973, 5190, 6216, 9867, 7029, 2117]
7854B117o11J1932P17j3213o913k100j234o641J105P265O494m803p158k27L638
7839i632n16K436J378j592o878K366Q220O160n651j063j14L568k950j555m480
7824a0303O14O814j608L98O915K845J3265j60j6632j731J0678m120p230N651K513
7809G909L735j0426q02K346j623J295o688n970L29O665P180R12o983m317p272
7794a3710K338J0977n523p809p924K135N479N844L140m236J0877N565o436l698
7780b981P370J3369J045o020j449m774o662j672L068J2223m855j3927q922J337
7766a2850Q74k332Q238N79J416r007m805R921P350K054J223L5r144j216p35R55
7750g444K027j159J006P429L146M90J214n456o90K129J233M99J044j681M61j0800
$$ y = [2117, 1506, 13438, 14155, 942, -5971, -8071, -9305, -15946, -14841, -7576, -1082, -5885, -13043, -13270, -9632, -10148, -7712, -6334, -7926, -14804, -12438, -4218, 1942, -3709, -4772, -4886, -1318, -4268, -5823, -10303, -9689, -2875, -4483, -4085, 2830, 5675, 18940, 18780, 2148, 417, 11095, 6975, -255, 5396, 7909, 11644, 1218, 416, 2762, 1139, 2434, -4254, -10224, -9895, -3230, 3950, 4862, -2121, -6438, -13710, -11372, -395, -5918, -13727, -21651, -19516, -14037, -8193, -5053, -9289, 1588, 7153, 717, -2981, 4389, 17758, 18803, 12783, 11334, 6560, -102, -1774, 1294, 13517, 8662, -5265, -14187, -12850, -11976, -14308, -6070, -5491, -4075, -13082, -17887, -7966, -616, 1438, 2661, 2696, -6448, -7664, -8399, -7444, -5417, -6576, -5570, 1859, 5005, 5495, 6709, 1253, 563, 2692, 3925, 4424, 5468, 3787, 4248, -6552]
7734f552p799J0617Q142M925j2748j2644J123j960k527Q05r44J0508J3271M192
7720H409j4784j2222R127J3887l941N234j35O074k701J330O158o583m752J785
7706F886J030J009k678L873q215p988j180k444J858Q451L195o328K980M656J1873
7691A6978l811p724o659n044l101m698L233M288M487k347m747L458O103N134N952
7676A1502J559o249l748n43j0501N663Q6l189N35k38j608J500R992J83j998K590
7660E536r72O21M651j168j2164j6210J542J8452L020l048L067M43j1026M50M036
7645b770K74n523q818o82L075J1172P885m962j1151K460Q052O296p749n146L265
7630d322p08r061K613J0314J2458K661K429r770q925p858N882M372m018m363K403
$$ y = [-6552, -14351, -3734, 4408, 9333, -3415, -16059, -14936, -16896, -19423, -18618, -19562, -9054, 4217, 8409, -6375, -18597, -9470, 4417, 476, 5710, 5575, 11649, 8948, 10278, 16436, 9853, 5101, 6886, 7916, 8925, 6247, 10120, 1905, -6083, -7263, -9707, -7849, 602, 3797, -2531, 449, 5105, 16978, 13167, 5443, -1216, -6260, -9361, -14059, -10826, -6538, -2051, -4398, -9145, -5687, 416, 5550, 11502, 13061, 6812, 3064, 2521, -7980, -2317, -2231, -5420, -4885, -5123, -6731, -5231, 4761, 4944, 2946, 5536, 4564, 5185, 9836, 8668, -3496, -19706, -18164, 288, 3308, 260, 3327, 3770, -7256, -6806, -2770, -2496, -8019, -16837, -17519, -14444, -3272, 4613, -349, -11500, -9040, -988, 5308, -2441, -7587, -4322, -5030, -14091, -11478, -1164, 11294, 13955, 16384, 6614, -2311, -10169, -4287, 85, -3933, -8296, -5893]
7615e893Q654l959q2M183R840O170q079p805J382O898J653N68N150n761j4387
7600a468q944M83o04k101O158R170J4833R853k765M179q076o852n87N887o817
7585A2349o181J246M623J633R30m900O05M057l75o113p167k035o541n168K048
7570a0989M698Q50p19Q796M629N166j0987j4328K109J4487O432L439k769L344
7556A4158r386r069o924L806o17o35Q227M413N022J753l784K888j6004p103M106
7541i149J99j350L324J2897j505j3402l966Q06j473O032O619l782R58M404R054
7526I666K671J641o956L174K454j1612n599K189m859k114Q013k875J1559K170
7512I522j4142p743Q09Q349o55M021Q519K162o766j296R665O91k161o097N957
$$ y = [-5893, 2761, -1198, -1280, 2903, 12743, 18913, 10834, 3029, 4411, 11309, 12962, 13530, 18680, 12919, -1468, -10412, -9929, -10533, -12634, -6476, 2694, 17527, 27380, 24615, 28794, 20718, 13866, 13279, 19166, 12349, 6168, 7414, 12037, 13670, 14600, 9700, 10305, 14362, 13987, 7874, 707, -1328, -7869, -13037, -10989, -6291, -5441, -6160, 2636, 7265, 12431, 1444, -12884, -10775, 3712, 10144, 13583, 10814, 14158, 4772, -4297, -11221, -7415, -8032, -8667, -440, 3973, 8995, 10748, 6964, 9852, -6152, -13255, -9149, -8950, -10300, -6976, 5921, 4416, -8986, -12952, -12146, -13619, -7587, -968, -4750, -3792, 612, 9666, 12337, 13978, 7022, 10196, 12650, 1038, -4561, -2372, -7231, -9345, -1332, -4207, 7352, 9522, -4620, -12363, -11554, -3205, -3860, 161, 8680, 10842, 4076, 2780, 12445, 13136, 10975, 4878, 10835]
7497A0835l095l059P7p67o286m135o7M340l452k51L298J123k089K224n254k717
7481i275O983j810N026j927j894j983Q399P276j922N208k864j0145p057j786J594
7466f177K451M51p676l566Q018Q60P620L494M006l162K569L219k98k329n89M16
7450I307l292n629L401N798k904j4861k465K23j321j824Q39P885L417q552N517
7435d461R651k982M361l060j358N812j537l153j1630J3758L17n232p685n984P903
7420e280N296m297m608m75o26n458m470M015P496P569o300m754L085l079m952
7405a6838k072K656M208k8P614J6174m526l349P2J2045M990n597o760j574j481
7390E534O807J197j428q388J1745k004o536k709o132k799k914J506O422J0480
$$ y = [10835, 7740, 4681, 4758, 3991, -2295, -6430, -6497, -2157, -5609, -5860, -2562, -1439, -3528, -1304, -6558, -9275, -2292, -4102, 924, -1003, -2897, -4880, 3519, 10795, 8873, 14081, 11217, 1072, -5985, -7771, -6177, -3726, -3275, -10951, -14517, -6499, -5639, 1981, 5475, 9481, 6319, 8888, 12107, 11809, 9480, 8891, 9307, 6015, 386, 3787, 9585, 6681, -8180, -10645, -10422, -11743, -13567, -12728, -4843, -1426, -9978, -4461, 5190, 2208, 6569, 3509, 2151, 7963, 6426, 3273, -8357, 5401, 5718, 486, -7199, -13183, -5280, 16, -4281, -8889, -9364, -9990, -15448, -19918, -15903, -8407, -838, -7138, -11892, -8807, -11886, -16838, -18910, -16254, -12046, -12074, -4460, 11714, 7188, 3839, 3911, 15956, 20946, 15349, 8589, 7015, 5534, 12341, 13538, 12110, 3722, 15467, 13463, 6927, 4218, -1914, -4713, -7627, -6121, 301, 10781]
7376A0781j825M19p486o189m41J301l947K81k206j038O289n29Q413Q732J93o174
7360F574o687k872p66O421J27n988J287k113k703P556K091q42k55m110j061M895
7344A554M342R618o70n359j1358K601j332j546K16J0395j1257K193K619K247p44
7329C519K069o220n185M033J621j744M488k574L422Q028R797q688o204J117m76
7314G003j0373N002O294l418j334j021k883k150L004N9p186o149K277J647R37
7299h291J7089J1575n795j1893j4695l552Q988N864N701N312l34l0m697n633m222
7284d613R129P961k244R561j476j6741o287j5527k395O972M272j874O485J14q109
7269a4772n975j521J5907J2680J194q922r078l032J778k893r760R554l144k360
$$ y = [10781, 8956, 9375, 1889, -4300, -4741, -3440, -7387, -7106, -9312, -10350, -4061, -4590, 3823, 12555, 12748, 6574, -113, -2985, -3751, 2670, 2797, -3191, -1904, -4017, -6720, 836, 2927, 2085, 1830, -2280, -3341, 1554, 5896, 15514, 14844, 9485, -1873, 728, -604, -2150, -1934, 8461, -2796, -603, 2016, 4263, 3519, 5588, -632, -5817, -1784, -163, -1907, 2581, 7, 3429, 11457, 21254, 12566, 6362, 7479, 7003, -3370, 1632, 7926, 4508, 3174, 2153, -730, -2880, 124, 183, -7003, -13152, -10875, -9228, -8291, 8798, 20373, 14578, 2685, -12010, -15562, -6574, -710, 4991, 10303, 9969, 9939, 5242, -391, -4613, 4516, 12477, 10233, 19794, 18318, 1577, -4710, -20237, -22632, -15660, -11388, -13262, -6777, -6663, -14772, -20747, -22268, -6361, 6319, 7513, -1409, -10487, -13519, -11741, -14634, -24394, -14840, -17984, -20344]
7255b0344J0798N931j780m15o178J726K517j931l787q639Q559Q435K725j500m320
7240h203m877n619M871O789n567J8027n230o911O988K479j1554j897n02O25j040
7225a1621m904J303o098k969L33L895J365J809M686l97L582k370k775J1565N950
7210C354M512r128j615k755q225l618k870l16J2115L689l800o84K292N887o202
7195g364j0359J045J6972J6891M232l510r289l312K113J247L961M506j2712j2956
7181h535l704N745K550n153m521j009R676O9j030J552k798k722r8N674J778j753
7165d279q19P405O881M637J132p624o795K04Q99o36O269q870r065k214n815P206
7149a1484Q405p07n55L393P934n710j646k099K687R16m575N064N449j2515r88
$$ y = [-20344, -9546, -3615, -5395, -5810, -11988, -10262, -7745, -9676, -13463, -22102, -13543, -5108, -2383, -3883, -8203, -13080, -18699, -13828, -7039, -12606, 5421, 191, -6720, 268, 2747, -8807, -10704, -11206, -10581, -11621, -16525, -15222, -21320, -24289, -23956, -20061, -18696, -16887, -12201, -12598, -9016, -11386, -14161, -2596, 3354, 7866, -1262, -2877, -5632, -13857, -17475, -20345, -20661, -8546, -4857, -8657, -9341, -7049, -1162, -7364, -17723, -16678, 294, 17185, 21417, 17907, 8618, 5306, 7419, 8666, 12627, 17133, 4421, -8535, -12239, -6494, -3944, -9097, -13618, -14627, -4951, -4882, -5912, -4360, -7158, -9880, -9978, -4304, -2526, -4279, -5098, 2307, 9188, 13825, 14957, 7333, 538, 742, 1641, 1005, 7274, -1596, -10661, -12875, -18690, -11484, -3079, -3786, -4341, -948, 6986, 1276, -370, -2469, 218, 1134, -3441, 1623, 7072, -5443, -6431]
7134f431J914l143K940M895k484j2360J545P724P193J031j035m078k936N809l424
7119b840P199J674L53j252M455j0461j2571L216N853j945J0797J8655M514q698
7105A8949j1647p372p226o136M379J0825k492k338n530M944P09l780k345m961
7091a4021l908k025l98N155J0069Q110j555K701M012m603M075O020n447p236k537
7076a588L702l234j3155M273R309j702P987Q446n119k418N171j0679K047J2179
7062A5219K632L168j1746j3941m464j5546L175L915J2748P768j355o406l64K878
7048b319o275r659J2932J356j281J401l859R993L399n455m87P104J1292J252l65
7033A9029n907p784j808q540j4851q51L897L10J4397l09l153R918J464p47k737
$$ y = [-6431, -4517, -7660, -4720, 175, -2309, -14669, -13124, -5400, 1793, 2824, 1789, -2289, -5225, 584, -2840, 4359, 6033, 6386, 5134, 9589, -872, -13443, -10227, -4374, -6319, 4478, 23133, 27647, 18949, 7302, -70, -7296, -13432, -9053, 1772, -720, -3058, -8588, -3644, -2935, -6715, -9060, -14021, -17929, -19954, -20352, -15197, -5128, 2982, 1427, 4128, 8140, 3537, 7612, 13632, 8185, 949, -1588, 2114, -1120, -14275, -10002, -693, -2395, 5592, 14038, 8919, 6501, 11672, 993, 3040, 15219, 17851, 21019, 9273, -4668, -9132, -24678, -21503, -17588, -4840, 2928, 1573, -4833, -5197, -2319, -8594, -18253, -5321, -3965, -5246, -3845, -7704, 2289, 5688, 233, -254, 6850, 18142, 19394, 19029, 13122, 5338, 3530, -5010, -19861, -20712, -16815, -16505, -2108, -2417, -5570, 4348, 5812, 5065, 2328]
7018B328j0184r84J5497M100K503q200m676j462N544k648l613O564j114L597m355
7003B897j2050L425j8J2532q146k1332o366J0360P066K692j0285n87N015J0792
6989d005J0664r611m824O590P476M657j12r698L542l204q201L187n438n936R233
6974e680P249j2022m473N679J1134o78q643J743k710L981J0731K614p626j502
6960b03o777M821N175p53l166q067p840l55J028Q187N285Pk699K41J041J202R612
6943F739N373j0907p01j640j583p89N611p77k140j622p969o970K077P576N796
6928a926j234m709j708j729M710j4K717K474q088J095J195O484N697m695Q04N991
6912G064P255l311j1922r633j292N839J6574l596j4664j3924o580P725M760j952
$$ y = [2328, -7856, -8840, 6657, 10757, 13260, 5060, 384, -1078, 4466, 1818, -1795, 4769, 3655, 7252, 2897, -9153, -5728, -5746, 6786, -1360, -22692, -29058, -18698, -11632, -8940, -19225, -19812, -14797, -4005, 6659, -2952, -7776, -1186, 6290, 10947, 10835, 1137, 4679, 1475, -6726, -3539, -8977, -14913, -5680, 1569, -10453, -14926, -9247, 1887, 1209, -7434, -5691, -8401, -4420, 6311, 8925, 1299, -203, -6980, -2159, 3016, 2263, -903, -8970, -16810, -17165, -16137, -7950, -2665, -2658, -5357, -5116, -4075, -2873, 6739, 12112, 1205, 504, -1136, -2719, -3508, 2103, 1326, -814, -2436, -10405, -17375, -15298, -7722, -1926, -3160, -7869, -9577, -11306, -6596, -6610, -3893, -1419, -9507, -8412, -7217, -733, 4964, 269, 1073, 7064, 14319, 11008, -914, -10547, -11839, -6000, 10574, 6978, -7686, -21610, -28190, -20465, -15705, -17657]
6898a7657O766J5056m890p148j499K927J641r908K951N773J523j0705m921N846
6884a4245M306N532K100K715n261j789O431N738k576l305J2416K429j0181r661
6870e351o37K197P968K663j536j113J747K73q848M371N126l177m383o358N121
6855a937l400K104O235M503q39j2497M721L571M952K814o216k592o18O083J832
6840H716j3389q685P394N307L036j218K61L777k417k962n157j910k710k831N728
6825g060R342N011L364r136p43M418j093L000j635n467j501K987J210n149j096
6810c548n340m032L365k423o172N102k033p848R682J2077L063j323R41r758k330
6795a0577k243K50o532m796k411J5288J9506L142r471k346M469m227L803j314
$$ y = [-17657, -10891, 4165, -725, -7873, -9372, -6445, -4804, -14712, -11761, -5988, -4465, -15170, -20091, -14245, -9939, -4407, -2307, 408, -4853, -6642, -211, 5527, 2951, -354, 12062, 14491, 4310, -5351, -5988, -3791, 4177, 6840, 5304, 4191, 5938, 6211, -2637, 1734, 6860, 3683, -700, -7058, -1937, -5337, -3233, 3002, 7505, 6666, -5831, -1110, 2461, 7413, 10227, 4011, 1419, 801, 6884, 8716, -4673, -13358, -5964, -657, 2379, 1161, 1422, 5199, 2782, -180, -5337, -7247, -9957, -12788, -7060, 2282, 7293, 10657, 1521, 778, 5196, 4103, 7103, 5468, 1, -1500, 1487, 2697, -2452, -3548, -8888, -12920, -9555, -11978, -18150, -13048, -15081, -22929, -13247, -1170, 1893, 570, 1511, -8247, -10577, -12820, -12570, -19102, -23898, -26309, -11021, 8485, 11627, 2156, -190, 4279, 52, 3855, 2541]
6781B541j749K425M578p187n178J0261J921k504o641K275m463q94m073q571j499
6766a8758K282j430O012J5059o574p232L930J899O036j523q530M087P9m768L908
6751e523j308J763P387M429j670o67m290m24k694k007r87m417K910P317L517k677
6735F59m557N429J249q162M482O637O425M093N89j118l172q87k237m705m764J16
6719G7K409j1466k997Q965M70K351K58k365J0270O625r539o681r134J525J0370
6704A138Q258l134J6205J7651J4292J3595M125l958j3060j6374j8814p286q154
6691D484J161n8q97R80J135l085o086J454J468L842O236O663r390r386Q93j26
6675g12j098o516p29j637L268M300N248R847j0396l831N634O119j650J697o61
$$ y = [2541, 792, 3217, 7795, 608, -4570, 5691, 7612, 5108, -1533, 742, -3721, -4615, -8688, -17259, -18758, -16476, -17906, -11894, 3165, -3409, -10641, -6711, -4812, 1224, -299, -8829, -4742, -4663, -9431, -5523, -6831, -5068, 2319, 6748, 5078, 4411, 121, -303, -2997, -5004, -5991, -10408, -7498, -181, 3336, 659, -3898, 1531, 2780, -5382, -900, 5737, 12162, 16255, 16844, 15726, 12554, 11667, 9430, 4725, -39, 77, 2486, -8980, -11977, -3012, -2542, -191, 67, -2298, 7972, 14597, 5058, -1623, -10757, -9232, 1138, 9396, 6262, 22467, 40118, 54410, 68005, 72130, 68172, 55112, 38738, 19924, 12638, 4484, 5645, 5587, 4690, 5670, 6805, 3720, -2366, -912, 556, 4398, 10634, 17297, 7907, -1479, -586, -712, -1810, -8326, -9055, -10692, -7424, -3124, 2124, 11971, 1575, -2256, 3378, 9497, 7847, 9544, 8883]
6660H883P250Q849n094k366l759J120Mo354k087j6464j1757N067K829J784L465
6645h630m892M838K004r4p78m575p517O460l103j488J6241M294r700l059j5251
6630b5250n984J689M312l156m002q11J3795K219o489j739J3109J0062N930p370
6616c685k519j257M619N146K579r147l426P516O59l926M378m288m040M222K528
6601f41j967q680O333K019K031j607m230M76M39N212o585k684P344M563n107q835
6585a1919L763Q479O518N599j0667k538n87K917j848j1993o28R67N82M668L391
6570c296k374j0454j1434O842N064j974J304N637J0826Q480L032j1151q668j57
6556h323Q641j244o449L351K733O843P469q92o34n26j2630o399k413J096m105
$$ y = [8883, 16133, 24982, 19888, 17522, 13763, 14883, 14887, 8533, 6446, -10018, -21775, -16708, -13879, -12095, -8630, -13522, -8684, -6680, -6774, -7552, -12127, -19644, -13184, -16287, -17775, -1534, 2760, -6940, -9999, -25250, -31234, -29545, -25233, -28389, -32391, -33202, -19407, -17188, -23677, -25416, -12307, -2245, 3685, -3685, -6204, -7461, -2842, 2304, 4883, -4264, -7690, -174, 485, -3441, 937, -3351, -7391, -3169, -641, -2608, -11288, -4955, -2936, -905, -2512, -6742, -6266, -5827, -615, -7200, -9884, -2540, 2023, -3084, -11919, -8156, 323, 6841, 12440, 1773, -765, -1352, 1565, -283, -12276, -12904, -11937, -11355, -6687, -3296, -5670, -16124, -27558, -20716, -15652, -17626, -16322, -10685, 141, 8621, 11653, 502, -8166, -8323, 318, -926, -7375, -4024, -1291, 5552, 13021, 12129, 11495, 10969, -1661, -8060, -10473, -9377, -13482]
6541a3482O032Q481q60j1254l958k471J512l102n395j961L16R874k300l272K784
6526a9056P87J878J3192N517k49j3347k642P603O063q12j48R07J775m195l161
6511e888J484K805J0473K630p291M38k360j005O84N677L483p907p520k722l175
6496a0194n777N140M068J252J0371l712k197n790o904p084j692Q944J2042J373
6482a60o314j973k630k854J772L746j135O42J309p416l374J566j66m861j248p429
$$ y = [-13482, -7450, 1031, 171, -11083, -15041, -17512, -16000, -19102, -24497, -26458, -26142, -16268, -18568, -21840, -19056, -18269, -16391, -3199, 2318, 2069, -11278, -13920, -6317, -254, -1066, -1214, -307, 1468, -2727, -5888, -4404, -1599, 8874, 11504, 4213, 4651, 2291, 1286, 1970, 7647, 11130, 3223, -4297, -7019, -10194, -15971, -10831, -6763, -5511, 4860, 1148, -1049, -6839, -13743, -20827, -22519, -13575, -1533, -160, -6474, -8447, -11077, -13931, -12159, -8413, -9548, -8906, -7597, -15013, -18387, -16821, -16987, -21848, -23096, -30525]
$$ [...]
##END NTUPLES=NMR SPECTRUM
##END=
