##TITLE=Analysis number 315573
Compound Code cc 47001
Book Reference 422/127
Project Code adrs
Chemist Name robb
##JCAMPDX= 6.0         $$ Bruker NMR JCAMP-DX V2.0
##DATA TYPE= NMR SPECTRUM
##DATA CLASS= NTUPLES
##ORIGIN= Bruker BioSpin GmbH
##OWNER= NMR
$$ XWIN-NMR		Version 3.5
$$ Thu Nov 24 08:46:17 2005 GMT Standard Time (UT+0h)  MAYBRIDGE\NMR@NMR_250MHZ
##.OBSERVE FREQUENCY= 250.131544655141
##.OBSERVE NUCLEUS= ^1H
##.ACQUISITION MODE= SIMULTANEOUS (DQD)
##.ACQUISITION SCHEME= undefined
##.AVERAGES= 16
##.DIGITISER RES= 18
##SPECTROMETER/DATA SYSTEM= dpx250
##.PULSE SEQUENCE= zg30
##.SOLVENT NAME= DMSO
##.SHIFT REFERENCE= (INTERNAL, DMSO, 0, 16.522)
##AUDIT TRAIL= $$ (NUMBER, WHEN, WHO, WHERE, WHAT)
$$ ##TITLE= Audit trail, XWIN-NMR		Version 3.5
$$ ##JCAMPDX= 5.01
$$ ##ORIGIN= Bruker BioSpin GmbH
$$ ##OWNER= NMR
$$ C:\u/data/dgb/nmr/ADRS/12930/pdata/1/auditp.txt
$$ ##AUDIT TRAIL=  $$ (NUMBER, WHEN, WHO, WHERE, WHAT)
(   1,<2005-11-24 08:45:50.77 +000>,<MAYBRIDGE\NMR>,<NMR_250MHZ>,
      <created by zg, POWCHK disabled, PULCHK disabled
       configuration hash MD5:
       62 19 C7 07 E1 42 D1 B7 37 6C 3D D0 77 39 F9 E6
       data hash MD5: 64K
       01 4D B6 BB 95 B1 31 B7 35 1A DA D4 7E 2E DA 06>)
(   2,<2005-11-24 08:46:04.85 +000>,<MAYBRIDGE\NMR>,<NMR_250MHZ>,
      <Start of raw data processing
       ef LB = 0.3 FT_mod = 6 PKNL = 1 SI = 32K 
       data hash MD5: 32K
       82 76 D5 3A 04 F4 CA CB E4 91 7C C4 D9 FB AB E8>)
(   3,<2005-11-24 08:46:07.22 +000>,<MAYBRIDGE\NMR>,<NMR_250MHZ>,
      <apk 
       data hash MD5: 32K
       7B 12 CB 42 CC 0F DE 21 96 A3 01 A1 D7 77 C9 35>)
(   4,<2005-11-24 08:46:08.17 +000>,<MAYBRIDGE\NMR>,<NMR_250MHZ>,
      <abs ABSG = 5 
       data hash MD5: 32K
       FE C0 AE 2A CA E9 E4 6F EB AD 95 A7 F0 B4 8E E9>)
$$ ##END=
$$ 
$$ hash MD5
$$ 2F D1 30 30 FD 35 DE 30 F4 DD AB CE 01 C8 9F 34
##$RELAX= 
##$RELAX= 
##$RELAX= 
##$RELAX= 
##$RELAX= 
##$RELAX= 
##$RELAX= 
$$ Bruker specific parameters
$$ --------------------------
##$DU= <C:\u>
##$EXPNO= 12930
##$NAME= <ADRS>
##$PROCNO= 1
##$TYPE= <nmr>
##$USER= <dgb>
##$AMP= (0..31)
100 100 100 100 100 100 100 100 100 100 100 100 100 100 100 100 100 100 
100 100 100 100 100 100 100 100 100 100 100 100 100 100 
##$AQSEQ= 0
##$AQ_mod= 3
##$AUNM= <au_zg>
##$AUTOPOS= <1 >
##$BF1= 250.13
##$BF2= 250.13
##$BF3= 250.13
##$BF4= 250.13
##$BF5= 500.13
##$BF6= 500.13
##$BF7= 500.13
##$BF8= 500.13
##$BYTORDA= 1
##$CFDGTYP= 0
##$CFRGTYP= 5
##$CHEMSTR= <none>
##$CNST= (0..31)
1 1 145 1 1 1 1 1 1 1 1 1 1 1 1 1 1 1 1 1 1 1 1 1 1 1 1 1 1 1 1 1 
##$CPDPRG= <>
##$CPDPRG1= <>
##$CPDPRG2= <>
##$CPDPRG3= <>
##$CPDPRG4= <mlev>
##$CPDPRG5= <mlev>
##$CPDPRG6= <mlev>
##$CPDPRG7= <mlev>
##$CPDPRG8= <mlev>
##$CPDPRGB= <>
##$CPDPRGT= <>
##$D= (0..31)
0 1 0 0 0 0 0 0 0 0.06 0 0 0 0 0 0 0.0002 0 0 0 0 0 0 0 0 0 0 0 0 0 0 
0 
##$DATE= 1132821949
##$DBL= (0..7)
120 120 120 120 120 120 120 120 
##$DBP= (0..7)
150 150 150 150 150 150 150 150 
##$DBP07= 0
##$DBPNAM0= <>
##$DBPNAM1= <>
$$ [...]
##$SUBNAM7= <"">
##$SUBNAM8= <"">
##$SUBNAM9= <"">
##$SW= 20.6930455092707
##$SWIBOX= (0..15)
0 0 3 0 0 0 0 0 0 0 0 0 0 0 0 0 
##$SW_h= 5175.983436853
##$TD= 65536
##$TD0= 1
##$TE= 294.16
##$TE2= 300
##$TE3= 300
##$TEG= 300
##$TL= (0..7)
0 120 120 120 120 120 120 120 
##$TP= (0..7)
150 150 150 150 150 150 150 150 
##$TP07= 0
##$TPNAME0= <>
##$TPNAME1= <>
##$TPNAME2= <>
##$TPNAME3= <>
##$TPNAME4= <>
##$TPNAME5= <>
##$TPNAME6= <>
##$TPNAME7= <>
##$TPOAL= (0..7)
0.5 0.5 0.5 0.5 0.5 0.5 0.5 0.5 
##$TPOFFS= (0..7)
0 0 0 0 0 0 0 0 
##$TUNHIN= 0
##$TUNHOUT= 0
##$TUNXOUT= 0
##$USERA1= <user>
##$USERA2= <user>
##$USERA3= <user>
##$USERA4= <user>
##$USERA5= <user>
##$V9= 5
##$VALIST= <valist>
##$VCLIST= <CCCCCCCCCCCCCCC>
##$VD= 0
##$VDLIST= <DDDDDDDDDDDDDDD>
##$VPLIST= <PPPPPPPPPPPPPPP>
##$VTLIST= <TTTTTTTTTTTTTTT>
##$WBST= 1024
##$WBSW= 4
##$XGAIN= (0..3)
0 0 0 0 
##$XL= 0
##$YL= 0
##$YMAX_a= 550164
##$YMIN_a= -273739
##$ZGOPTNS= <>
##$ZL1= 120
##$ZL2= 120
##$ZL3= 120
##$ZL4= 120
##$ABSF1= 16.522
##$ABSF2= -4.171173
##$ABSG= 5
##$ABSL= 3
##$ALPHA= 0
##$AQORDER= 0
##$ASSFAC= 0
##$ASSFACI= 0
##$ASSFACX= 0
##$ASSWID= 0
##$AUNMP= <proc_1d>
##$AZFE= 0.1
##$AZFW= 0.1
##$BCFW= 0
##$BC_mod= 0
##$BYTORDP= 0
##$COROFFS= 0
##$CY= 12.5
##$DATMOD= 1
##$DC= 0
##$DFILT= <>
##$DTYPP= 0
##$F1P= 14.0000005364418
##$F2P= -0.99999901652339
##$FCOR= 0.5
##$FTSIZE= 32768
##$FT_mod= 6
##$GAMMA= 0
##$GB= 0
##$INTBC= 1
##$INTSCL= 1
##$ISEN= 128
##$LB= 0.3
##$LEV0= 0
##$LPBIN= 0
##$MAXI= 10000
##$MC2= 0
##$MEAN= 0
##$ME_mod= 0
##$MI= 0
##$NCOEF= 0
##$NC_proc= -3
##$NLEV= 6
##$NOISF1= 0
##$NOISF2= 0
##$NSP= 0
##$NTH_PI= 0
##$NZP= 0
##$OFFSET= 16.522
##$PC= 1
##$PHC0= 59.37115
##$PHC1= 42.10851
##$PH_mod= 1
##$PKNL= yes
##$PPARMOD= 0
##$PSCAL= 4
##$PSIGN= 0
##$REVERSE= no
##$SF= 250.13
##$SI= 32768
##$SIGF1= 0
##$SIGF2= 0
##$SINO= 400
##$SIOLD= 32768
##$SREGLST= <1H.DMSO>
##$SSB= 0
##$STSI= 32768
##$STSR= 0
##$SW_p= 5175.98343685301
##$SYMM= 0
##$S_DEV= 0
##$TDeff= 65536
##$TDoff= 0
##$TI= <Analysis number 999999
Compound Code 99
Book Reference 9
Project Code 9>
##$TILT= no
##$TM1= 0
##$TM2= 0
##$TOPLEV= 0
##$USERP1= <user>
##$USERP2= <user>
##$USERP3= <user>
##$USERP4= <user>
##$USERP5= <user>
##$WDW= 1
##$XDIM= 32768
##$YMAX_p= 479135881
##$YMIN_p= -902886
$$ End of Bruker specific parameters
$$ ---------------------------------
##NTUPLES= NMR SPECTRUM
##VAR_NAME=  FREQUENCY,     SPECTRUM/REAL,   SPECTRUM/IMAG
##SYMBOL=    X,             R,               I
##VAR_TYPE=  INDEPENDENT,   DEPENDENT,       DEPENDENT
##VAR_FORM=  AFFN,          ASDF,            ASDF
##VAR_DIM=   32768,         32768,           32768
##UNITS=     HZ,            ARBITRARY UNITS, ARBITRARY UNITS
##FACTOR=    0.157963299565203, 1,           1
##FIRST=     4132.6476996994, 0,             0
##LAST=      -1043.33573715361, 0,           0
##MIN=       -1043.33573715361, -902886,     0
##MAX=       4132.6476996994, 479135881,     0
$$ Real data points
##PAGE= N=1
##DATA TABLE= (X++(R..R)), XYDATA
$$ [...]
22993 -47201 -68204 -37451 -28952 -40999 -46186 -14378 -10588 -44026 -27948 -21821 -17370 -20326 -57396
22980 -57396 -68795 -41486 -18371 26673 41283 -1833 -29365 -13786 -18847 -21156 -27237 -17412
22968 -17412 -28005 2964 50687 33029 28008 -5105 -42042 -46670 -20568 8354 -6197 -12529
22956 -12529 -8199 -19629 -30791 -26192 9840 18141 26385 -2202 -26075 -38251 -24853 -27286 -22361
22943 -22361 -12819 -3068 33807 30649 3105 -8466 -17836 -23234 -44817 -29370 -19441 -33798 -49853
22930 -49853 -84512 -102106 -70751 -39688 -33534 -24262 -2401 -1157 11937 19351 -24818 -39164
22918 -39164 -15292 17096 16343 9194 39607 17844 8108 16898 11794 11961 9926 -6738 10888
22905 10888 41734 38533 -16386 -68220 -57431 -39945 -69145 -63055 -50967 -39311 -42160 -50631
22893 -50631 -47845 -54827 -68611 -69819 -80056 -70525 -63187 -59182 -63725 -61582 -61317 -78327 -68047 -43258
22879 -43258 -13865 -31081 -48489 -27820 -49335 -39639 -55196 -98877 -64356 -21234 -38364 -44298
22867 -44298 -31428 -16273 -48981 -72512 -74850 -45461 -33795 -3944 6548 45919 62095 28231
22855 28231 -23371 -21781 -9450 16059 10203 -18349 -30332 3845 -40533 -47707 -9733 55266
22843 55266 76570 67012 13917 -19702 -44584 -46954 -54632 -48739 -37167 -30158 17868 35781 42834
22830 42834 39474 7806 -47588 -78517 -72467 -53342 -27735 -4242 8678 4598 -15049 2658
22818 2658 7216 -15603 1200 -31448 -25285 -30378 18443 -2759 -9837 13980 58998 44477 27507
22805 27507 54401 47355 46233 18820 -33252 -41433 -37942 -34363 -30195 -47685 -41877 962 61670
22792 61670 41220 20551 42118 10067 -24784 3258 23736 33283 57649 31898 305 19193
22780 19193 67090 46754 -4583 -35712 -52468 -86434 -29665 -20206 -9267 14553 6261 -3914
22768 -3914 846 3361 -56443 -50579 -44681 -34127 8482 59192 16153 -23792 26734 28098 2164
22755 2164 4924 -28661 -38881 -1928 -21063 -28742 -21765 -30713 -20453 43632 59693 19986 1941
22742 1941 17769 23093 23593 42603 18409 -44128 -25880 11979 -26324 -40828 -65461 -51709
22730 -51709 -10905 4743 48830 42497 19104 -4635 -2132 4403 32523 45870 41792 14811
22718 14811 1720 39452 81639 52697 15386 12725 50763 62437 38840 502 -27873 -13763
22706 -13763 -4570 29365 618 -24406 -35957 -35644 -37559 -9318 24181 28914 20937 -10594 -22856
22693 -22856 -9883 -1486 39531 6396 -54622 -17981 -15812 -15875 -2593 -13492 -61417 -64399 -40716
22680 -40716 -34753 -54164 -50725 -43610 1144 41628 14237 -42053 -46399 -45170 -51128 -48580 -6943
22667 -6943 14888 21196 -8787 -34005 -60479 -51344 -11421 43614 51082 53983 17138 27082 43535
22654 43535 29802 41330 43416 -465 26589 34712 13626 16578 27681 -1972 -57840 -62740
22642 -62740 -83528 -83396 -82398 -48353 -27272 24396 17491 -24351 -9044 -41963 -77746 -42757 -40205
22629 -40205 -32764 -19569 -32350 -45342 -39783 1693 20314 6330 -36561 -29027 -17760 -54030
22617 -54030 -72857 -54287 -60886 -87403 -93994 -83043 -60139 -42353 -61855 -45142 3255 42824
22605 42824 19706 33367 16303 -19515 -30389 -5509 6670 -27401 -52772 -51773 -32520 -34344
22593 -34344 -48547 -22405 39826 18811 -33723 -11132 11520 43414 42901 -15368 -57149 -23754
22581 -23754 -3712 -4968 -32620 -7723 -13911 -1480 7607 -6211 -30227 -18408 -22388 2315
22569 2315 -24342 -23698 -23835 -55317 -73317 -73431 -75010 -105142 -71336 -53616 -33742 -37885 -50021
22556 -50021 -78484 -84967 -90687 -81691 -74520 -6071 19895 -44371 -48941 -27080 -15300 -36058 -16136
22543 -16136 -7085 39381 38676 37192 40567 -2353 161 -14187 -35688 -28728 -29150 -26477 -6640 17135
22529 17135 -243 -25588 -18536 -34685 6991 663 -17581 -39822 -72637 -49622 -6909 7780
22517 7780 -43217 -76469 -61435 9547 24879 -25106 -57501 -52976 -29999 2610 -2701 -9154
22505 -9154 -294 -13483 -32637 -87607 -113863 -69087 -839 35358 40629 29883 10994 2589
22493 2589 -3614 25043 43390 27166 28228 22727 9733 37959 63284 40180 23797 14225 1810
22480 1810 11341 17639 24929 20097 35253 -4284 7574 33883 34722 32784 8633 8095 7602 20806
22466 20806 33460 22646 35208 -15011 29799 52631 -18912 -83897 -96699 -86048 -41393 -23136
22454 -23136 -38803 -57565 -55456 -38442 -18655 10392 -13760 -9932 26967 26094 22480 -15081 -49537
22441 -49537 -32682 -14493 -21186 -59233 -49504 -12215 18185 -2009 -46083 -37529 -7767 6435
22429 6435 7300 -25874 -35494 -31937 -3643 956 -4796 4434 -7986 -3509 -3723 -49060 -60783 -31270
22415 -31270 -29992 -38697 -41957 -12883 -9530 -22003 -35805 -35175 -55657 -57262 1710 -6271 -10880
22402 -10880 -41571 -58068 -54317 -54915 -83576 -77885 -47128 -16078 -15006 -21115 -40399 -41070 -36657
22389 -36657 -8645 55968 46220 20242 -2821 -26788 -41162 -43654 -15661 5957 -12736 -50370
22377 -50370 -32421 -42828 -75322 -78043 -35957 21859 16092 37425 43105 24493 -868 19822
22365 19822 17582 12553 -43311 -61895 -25979 -7796 -33546 -31567 4957 3067 34645 63524
22353 63524 79780 73182 41462 -5290 -38661 -42414 -7077 -43516 -29205 -12980 -19868 -56101
22341 -56101 -64741 -21368 -774 -7259 40682 54686 -27541 -31081 -13394 -22092 -44634 -16170
22329 -16170 23838 14606 -2729 2923 -3260 -24746 -16203 -50092 -63557 -39483 2592 -15936
22317 -15936 -42458 -15247 18199 -246 -1808 18444 42596 16588 -22860 -31910 -58759 -74928
22305 -74928 -74116 -51123 -83784 -114077 -89843 -61977 -14166 -14301 -71502 -94158 -85448 -51064 -25865
22292 -25865 -8392 -15737 -52263 -89833 -89976 -42983 -21685 -4952 20925 333 -61019 -87985
22280 -87985 -99591 -48241 16165 -18040 -5637 5647 29496 18964 17000 4284 1290 -32152
22268 -32152 -51972 -62155 -80681 -33569 -35513 -88221 -54806 -46255 -61548 -60806 -67833 -75092 -55555
22255 -55555 -42740 -3215 10541 -3127 -18113 -30223 -11959 -10283 -19131 -1916 30925 60611
22243 60611 52640 32333 53556 -1571 -43573 -52148 -3820 7974 -37993 -53164 -56845 -45100
22231 -45100 -44128 -14979 5070 2463 10343 47233 55711 33654 -17132 -39204 -36904 11989 14710
22218 14710 25354 89251 143830 111663 57150 43153 63573 70297 45851 -9120 -47759 -19500
22206 -19500 7319 23849 27805 -31497 -44213 -41138 -9232 -34583 -49329 -46575 -7123 12440
22194 12440 12046 -31565 -33941 -57804 -77774 -85131 -58290 -73308 -78788 -54636 -32496 -55961 -55328
22181 -55328 -34921 -4045 21850 48112 16828 1545 -1324 5346 22590 29627 2098 -44114
22169 -44114 -50823 -45318 -62529 -58282 -23851 9770 7571 -13514 16041 39234 15490 -3337
22157 -3337 12691 -18897 -14557 -13743 -8839 -14328 -13280 -8290 10307 19171 17973 -17008 -30226 34616
22143 34616 36264 1725 -29355 -35553 -47265 -34589 -33579 -49613 -37307 -35062 -56184 -44163
22131 -44163 -7935 7799 -3315 -8845 -21503 11146 32948 11525 -22591 -50298 -42058 -20356
22119 -20356 -18319 -35944 -25511 -21809 14061 4379 4026 -4290 -42013 -94148 -103251 -114673 -148750
22106 -148750 -136405 -77282 -56679 -28145 -48962 -57143 -62291 -42607 -51795 -13204 -16768 -55092
22094 -55092 -70833 -99797 -111047 -107938 -50943 -16363 1379 9209 6213 -47166 -42550 -30914
22082 -30914 4595 3122 25831 59836 43220 -15926 10987 6226 12957 -2205 -21728 9396
22070 9396 13282 32327 46189 15960 -418 -13503 -15323 -47323 -41188 -29646 348 17458
22058 17458 32525 -6530 -24422 -13791 -4116 -45370 -39793 -89328 -116836 -57705 -33995 -26636
22046 -26636 -31524 -57719 -59332 -57554 -39155 12870 28552 -15357 -6524 167 -28725 -77430 -52941
22033 -52941 -55526 -38833 2104 -19994 -12287 7032 -1099 -8478 -16401 -21004 10959 25003 26679
22020 26679 9226 1131 -20718 -27096 2336 -16000 -37056 -73203 -55900 -27366 -41167 -44907
22008 -44907 -25893 -11339 5288 18813 18956 35395 33473 8786 -3908 -39079 -77424 -102074
21996 -102074 -108734 -123250 -110859 -92945 -64977 -27758 -2332 -13429 -7996 36588 79703 96998
21984 96998 81238 56563 21395 21159 322 15847 -1136 -31053 -44507 -31341 -31506 -48856
21972 -48856 -71258 -76382 -67217 -52957 -45707 -66267 -66477 -57872 -22526 -16196 -82265 -103732 -75326
21959 -75326 -74940 -35043 -36382 -21463 20564 14582 -35138 -59400 -69301 -43041 -31828 -22822 -19213
21946 -19213 21547 20927 30419 -2805 -13667 3039 39043 51787 36107 22620 415 24511
21934 24511 23445 -6253 -24772 -24514 8946 -8154 -46049 -32988 -7673 -27554 -52107 -6809
21922 -6809 10942 28008 11320 -12451 -51036 -65610 -60613 -48942 -40297 -38767 -65290 -76291
21910 -76291 -54257 20307 43384 20757 -16048 -54030 -53484 -35835 -22644 -19368 -94863 -107884
21898 -107884 -77363 -24583 -52126 -60003 -89632 -139347 -120814 -51160 -20687 -47784 -75864 -118488
21886 -118488 -100779 -85304 -56483 -29233 -54056 -33027 20033 2579 -46872 -51513 5684 19024
21874 19024 -52816 -67773 -19485 -20027 -35452 -69332 -63488 -39000 -65139 -48067 -18600 -17677 -8989
21861 -8989 -21604 -37577 -35654 9021 57884 34398 -8431 -1036 5469 -37672 -30559 -34649 -36481
21848 -36481 -2193 30112 4185 -28667 -67112 -89295 -95958 -59312 -37471 -74548 -61655 -54813
21836 -54813 -35154 -57440 -68781 -58269 -57839 -37927 -16777 -33016 -29237 -3649 3635 15952
21824 15952 33181 39989 7464 27884 35417 31743 15491 13376 -5176 -15816 -21846 -57080 -90260
21811 -90260 -27965 -9959 -10100 587 47072 40558 -19155 -17570 -10934 1583 -2632 -2491 -30776
21798 -30776 -58254 -32111 -36198 -52045 -9912 -29505 -35562 -7593 -6494 -33001 19857 41941
21786 41941 24041 20143 52130 61265 54965 35015 37637 27640 -7962 -32619 -45326 -38206 -24771
21773 -24771 -5833 -4973 2547 -14111 -38379 -34793 -35999 -34615 -35765 -72252 -87631 -90794 -52676
21760 -52676 -41041 -19159 15542 4455 7099 16620 52937 70226 57376 21824 -2337 4525
21748 4525 3809 -7689 11503 63167 86177 56888 41005 57970 50990 -4597 -21326 -13055 -16207
21735 -16207 -17958 -26978 -82514 -104715 -53326 -5468 7799 24371 26144 -22334 -22804 -5294 13319
21722 13319 38949 65532 40521 12023 19382 15299 -14536 -31440 -47928 -61945 -45457 -40284
21710 -40284 -62002 -96073 -70091 -67045 -97561 -74258 -45950 -47686 -49799 -13724 25091 15526
21698 15526 -29870 -47222 -25877 -29652 -32967 -23134 -30856 -64742 -58252 -38200 -41650 -48724 -40422
21685 -40422 -18764 -8250 -4155 -1785 -9498 -37586 -63183 -77660 -63851 -47837 13539 33234
21673 33234 15205 -48124 -58825 -68038 -46497 -5065 -45785 -57656 -84209 -84591 -68241 -92342
21661 -92342 -91741 -56850 -26934 -43178 -87618 -44183 597 13662 9942 -11006 14487 -2989
21649 -2989 9941 16112 -9693 -12130 11375 -17545 -45695 -75083 -53824 -63412 -72185 -52143 -63753
21636 -63753 -29426 13358 47256 63183 36292 4987 -2370 -13452 -21507 23072 36126 8122
21624 8122 -30472 -42894 -34589 -12839 17420 29840 20086 -35363 -59932 -63719 -91956 -41123
21612 -41123 29747 38578 -8527 -50693 -81231 -56491 -18787 12501 -9924 -56672 -58669 -64679
21600 -64679 -53168 -31370 14874 27980 24244 -13953 -14451 -47601 -37269 -22510 -10319 -33256
21588 -33256 -43286 1908 -2713 7170 42818 48474 27096 -39720 -92598 -100598 -78696 -56306
21576 -56306 -64014 -31980 6510 14900 27040 -18470 -26557 -31170 -49911 -48612 -37207 -19700 25497
21563 25497 39312 40448 922 -33742 -66093 -53840 -44101 -47662 -38101 -30411 -56402 -57036 -34464
21550 -34464 -62908 -81380 -57173 -4078 -18143 -34247 -43215 -30625 -9525 -3122 1697 19585
21538 19585 36020 15181 32906 26028 14634 27602 6854 11285 -20700 -23231 25707 39614
21526 39614 23726 -942 -17767 -22202 -15654 -28624 -44030 -44791 -52522 -50632 -39196 -45947 -34433
21513 -34433 -17346 -17610 -7081 3464 -10800 8709 2479 -22159 4650 5092 -36305 -56125 -46470
21500 -46470 1644 12188 9699 5294 6394 -2534 -24226 -22019 -23160 -22995 -52641 -54400 -92180
21487 -92180 -79001 -57294 -36365 -15252 -24054 -35996 -43427 -33699 -33573 -14409 -2739 2690 -17685
21474 -17685 -43608 -17208 -6555 -38525 -45705 -19544 -34670 -47678 -64112 -61757 -60192 -47742
21462 -47742 -8066 13130 19393 14825 13532 17723 42950 25881 -32722 -65446 -63823 -29264 9538
21449 9538 18781 -18638 -16355 14190 28784 463 -12039 -29957 -17568 -26014 -39169 -53039
21437 -53039 -84397 -84301 -79200 -62415 -26602 -26162 -48995 -28083 8063 23399 6860 14469 30480
21424 30480 52071 12832 -5646 18529 -10255 -32610 -49005 -55977 -22135 -19729 -54816 -72472
21412 -72472 -58982 -59826 -17526 36701 19562 -58365 -64473 -69900 -46447 -25620 -11359 -52977
21400 -52977 -45063 11457 49775 49833 61108 39986 -3767 -25469 -72823 -97644 -49481 -1569
21388 -1569 17466 -5976 14656 41452 28479 24606 13041 20694 27557 34691 23333 -4382 -28398
21375 -28398 12904 33564 4352 -31833 -21511 -20347 -16265 -1460 10671 27747 13286 -12863
21363 -12863 -62645 -54889 -36067 -46477 -47254 -70311 -65063 -23077 -5407 7406 -4972 5341
21351 5341 6100 -24638 -26175 -57784 -82820 -75172 -34224 -16456 26948 15502 19192 17872 28670
21338 28670 17738 4195 -34782 -53674 -46789 -34932 -55752 -24504 -26381 -31179 -43092 -16220
21326 -16220 1920 17308 4539 3608 4152 21008 -25842 -46585 -27643 -59735 -72315 -29346
21314 -29346 -16620 -25615 11807 -9778 -26622 -24460 -48460 -71890 -67326 -65140 -38437 -32986 -23086
21301 -23086 -38506 -41753 -51436 -21743 -4157 -26081 -23395 -52202 -56361 -144 -9528 -36199 -62807
21288 -62807 -90040 -74543 -69601 -75532 -100022 -86634 -65681 -70205 -21946 21335 -13068 -26008
21276 -26008 -33515 -52556 -27510 -28910 -2775 18585 22221 21760 1078 -45512 -75953 -45125 -18569
21263 -18569 -20472 -19005 -55380 -78828 -34051 15483 39099 22003 -14181 4353 6571 -28502
21251 -28502 -36944 12127 -14233 -36596 -34949 -11455 25653 29870 19458 -118 -35927 -97682
21239 -97682 -62394 -13310 13527 58417 32514 3527 -30704 -41855 -67712 -104576 -84309 -44866
21227 -44866 -46011 -15626 -27859 -35381 -44676 -44448 -29949 -73542 -61730 -5770 -21898 -52510 -40531
21214 -40531 -47924 -76475 -72271 -74206 -52499 -15687 -2370 20668 22191 -17270 -42745 -84193
21202 -84193 -89396 -53406 -32941 -9556 -25099 -45071 -49892 -50708 -29003 32245 33374 -2062 -21099
21189 -21099 1633 -19139 -43136 -48667 -24723 -7510 3959 -8799 -21236 -8890 -25476 -29204
21177 -29204 -41308 -31498 -13911 159 -22404 -61298 -52105 -40963 -4007 34236 65852 62310
21165 62310 12012 -10427 16097 68365 77184 10251 -60463 -73756 -57609 -37555 -11464 25961
21153 25961 36814 7138 -2196 -22862 -27362 4645 44109 14316 -18963 -23023 -2890 -43677
21141 -43677 -42881 -50061 -81774 -95558 -56414 -47559 -22950 -4051 -44292 -49015 -5212 3294 29993
21128 29993 -322 7350 58668 53815 10951 -42001 -61298 -81370 -60580 -22974 -26878 -16038
21116 -16038 -26423 -57944 -52022 -49373 -37619 -25150 -5810 -948 -3590 -5302 6526 40882 16950
21103 16950 -32011 -64465 -67660 -43898 -44688 -83011 -104364 -65171 -77676 -119719 -123209 -73464
21091 -73464 -78524 -72201 -48984 -53461 -27454 -26302 7305 -13120 -45065 -72928 -81593 -53510 -49991
21078 -49991 -37179 -41887 -15821 -79979 -101366 -69598 -46391 -42492 -65163 -81808 -40990 -5998
21066 -5998 28228 20542 31387 15772 -27315 -37531 -40508 -55253 -30248 -37037 -30193 -27344 -48461
21053 -48461 -62196 -58164 -43069 -38341 -41059 -31958 -4231 -13207 -31150 -10026 -2664 3019 -37971
21040 -37971 -71040 -46256 -30412 -33567 -56255 -24181 -38459 -34611 -7998 -10948 -7456 -72481
21028 -72481 -121959 -99054 -68421 -38620 -22615 -33339 -39770 -43390 -44990 -22228 -7777 -38635
21016 -38635 -72440 -84086 -97182 -116168 -77517 -19542 -32270 -50424 -22330 -3451 22152 44908
21004 44908 -15950 -62898 -62567 -30929 -17324 -10328 -34179 -72284 -43093 -31800 -34573 -34237 -55914
20991 -55914 -73841 -55737 -40396 -31203 -38114 -21989 -4741 -16371 -38394 -41315 -45599 -67102
20979 -67102 -53321 -31056 -15303 -19945 -3134 -34912 -31430 3970 4550 -15150 -7070 -8438 -1179
20966 -1179 31288 23272 12040 13971 -17131 -20058 -15300 -1169 8523 19668 10710 -28278 -47110
20953 -47110 -52605 -12964 13624 -34094 -15142 2360 1184 3044 30946 49356 58468 49201 46357
20940 46357 28299 16583 -8133 -11137 1371 -6271 -7110 -27918 -21634 383 2343 -8366 -17691
20927 -17691 -5043 -15319 -20979 -41335 -45264 -34742 -2327 -20748 -19776 -22631 -79791 -83714 -78143
20914 -78143 -78391 -84208 -63191 -65471 -90070 -73625 -64428 -78018 -94188 -78184 -43745 -51400 -58301
20901 -58301 -50490 -77338 -98000 -99007 -57548 -9505 -3573 -9170 35871 63531 63880 42903 43580
20888 43580 20099 38225 35884 -4435 15523 63831 44839 -13125 -44369 -54624 -16091 -23323
20876 -23323 -22656 6661 -36557 -68808 -37071 -28820 -33438 -15877 -1408 14977 7415 2684 -26820
20863 -26820 -21011 21442 27242 -11130 -23315 -2209 528 -21649 -28021 -3080 -888 -56540 -60348
20850 -60348 -47807 -92684 -114380 -101590 -88191 -37680 -12526 -20575 -33130 -58926 -43848 -54841
20838 -54841 -33791 46165 68810 -3719 -41430 -40945 -53770 -82716 -114570 -82555 -14578 -7743
20826 -7743 -37633 -54524 -51199 -13132 5494 -16613 -38218 -93600 -64361 -10344 -35730 -44225
20814 -44225 -27159 -26697 -28326 -37798 -35014 -27474 13143 10597 38981 44591 25653 -39254 -87341
20801 -87341 -63366 -54517 -47858 -78727 -90786 -77056 -75427 -81993 -73653 -61489 -85956 -52966 -9991
20788 -9991 -31682 -49816 -20654 -35395 -54892 -47274 -63178 -75040 -54961 -70912 -90815 -86623
20776 -86623 -100458 -90038 -66476 -40291 -11208 11943 3750 -11296 36368 52594 36182 14001
20764 14001 -44760 -43504 8031 2443 -2462 -13498 -29813 -34082 -36074 -17229 -22905 -15625 14351
20751 14351 27544 -4851 -15829 -12392 -7820 26524 62844 67447 21920 -32506 -48201 -28116
20739 -28116 -25969 -45108 -51060 -108491 -117061 -125056 -88924 -59551 -39034 -4024 -9027 -4473 -28424
20726 -28424 -12634 7589 43391 28345 17102 -21927 -63466 -72928 -64981 -31601 -64383 -71259
20714 -71259 -66353 -50701 -15430 -12095 -12830 -34287 -60038 -74998 -89689 -75742 -35702 2441
20702 2441 -1507 -29072 -53782 -59547 -39244 -49693 -40870 -34967 -39633 -28772 -36072 -48775 -27653
20689 -27653 -803 -36357 -34317 -54319 -58927 -6518 8428 -1466 -43954 -63875 -79429 -70023
20677 -70023 -50340 -35069 -45389 -25782 -8031 -19723 -19459 -11313 -7325 8245 27515 54373
20665 54373 99737 110586 67825 16877 15090 19962 -5058 -26443 -9142 -24615 -43409 -48243
20653 -48243 -54852 -47901 -23128 -24426 -73502 -53108 -10011 -9347 -14628 -68575 -96667 -58450 -59806
20640 -59806 -80321 -57546 -56882 -51129 -9863 535 -25417 -32663 -7998 992 -13856 17905 32035
20627 32035 24489 21783 10753 -15715 -42893 -15044 -11167 -56289 -96468 -75685 -23770 23586
20615 23586 28285 40097 49311 16960 3017 -15561 -4436 -3061 -37311 -7162 25663 6777
20603 6777 9136 32430 -1870 -27161 -9311 -27416 -55602 -11402 -4884 10867 -14861 -34660
20591 -34660 -32200 -4906 38289 31144 20579 -4915 -37522 -61203 -86768 -89802 -27450 -3286
20579 -3286 5469 16239 3736 -9306 -23646 -30170 -19602 1153 -32479 -28209 -1153 -26583
20567 -26583 -68936 -12877 -61 31707 12007 -24861 -46717 -28827 -21549 -46120 -24205 -47903
20555 -47903 -67053 -59557 -3298 -32782 -74755 -60088 -35927 -89125 -85328 -52150 -35838 -16346
20543 -16346 -10990 -24086 -12538 22577 -7116 -56640 -69298 -75004 -65793 -61858 -14351 2187
20531 2187 31557 -14959 -52751 -86973 -118683 -71166 -18367 -40872 -62313 -43655 -660 6585
20519 6585 -36721 -88783 -89495 -60035 -55720 -38428 -42164 -31336 1930 8994 4208 3326 10079 -10785
20505 -10785 -31146 41865 25127 -13955 3248 -54049 -62280 -30983 2576 28266 47294 67947
20493 67947 56409 24383 -33968 -72070 -42895 -3612 5412 -7414 -46286 -49999 -35261 -23556
20481 -23556 -3778 6013 -3034 -10277 -28987 -55547 -58937 -61583 -57766 -31195 -36683 -46678 -74839
20468 -74839 -87011 -85171 -80094 -64673 -38309 11935 17422 -38412 -61712 -33423 -68982 -40240
20456 -40240 -21356 -102358 -102324 -61859 -52032 -20030 8923 1479 -41057 -28786 -13763 -14140 2637
20443 2637 5304 7623 -7821 -32224 1649 29183 -21178 -20540 -11023 -44416 -30525 -12271 -25960
20430 -25960 -58159 -66486 -48245 -41005 -58808 -63969 -58107 -12259 22516 11673 -15704 -42393
20418 -42393 -90298 -81596 -24835 7276 19586 21655 3199 -20017 -34817 -30043 -27098 -34083 -17367
20405 -17367 10218 -8770 -38376 -24280 -46378 -93100 -116327 -104277 -147470 -129051 -89590 -49298
20393 -49298 -24397 -34056 -81757 -99974 -91332 -35704 24137 35679 -2073 -42903 -25353 -3994
20381 -3994 -50166 -75602 -68053 -86451 -93867 -92571 -52987 -57631 -29906 -1071 5547 -51998 -86747
20368 -86747 -106059 -84162 -65179 -77174 -70235 -36780 4804 492 -35216 -26382 15921 7521
20356 7521 -1661 -15388 -16065 -30823 -14386 17404 8098 10070 13306 9683 -14722 -23690 -8363
20343 -8363 -5737 -32731 -77937 -59105 -50564 -79337 -68663 -56325 -74032 -63625 -70545 -79085 -100102
20330 -100102 -70527 -37140 -6787 -20570 -8219 -6048 -47333 -46604 -7566 -12276 -32175 -50693
20318 -50693 -41470 -7922 2910 -4525 -15067 -45593 -63173 -27579 15358 -12339 -64451 -11333
20306 -11333 11587 1600 -34063 -39460 -19610 -39135 -60073 -66787 -63809 -39474 -55555 -73018
20294 -73018 -53387 -38698 11212 -135 28276 17889 43060 28501 -43684 -55721 -23927 -31786
20282 -31786 59 28274 37826 24009 -14131 -36977 -32850 -46170 -98389 -93286 -66719 -109696
20270 -109696 -112716 -80451 -25391 -32379 -22901 -25846 -24391 11387 -17055 -53390 -79219 -85399 -73115
20257 -73115 -54593 -65473 -35244 22037 4459 -39227 -80102 -52592 -16270 -24676 -7513 -30951
20245 -30951 -36035 -85809 -60136 4405 41582 17553 30845 6518 -37943 -55813 -53402 -45629
20233 -45629 -55679 -42372 -19695 -22703 -25369 15545 50790 52836 59460 53760 16318 -5581 -5042
20220 -5042 -26020 -22486 -34532 -34548 -27454 -44111 -52881 -35234 -24313 -8731 13583 5123 -12033
20207 -12033 -13696 3497 6973 23522 38845 2775 -3151 -9972 -15342 6009 -27665 -50076 -55393
20194 -55393 -28981 -35595 -30559 1861 -14710 18900 46765 -6921 -11416 -15351 -29319 -30514 -14856
20181 -14856 -33930 -54628 -88217 -70871 -76821 -114880 -108327 -86426 -75254 -48090 -25858 -27519
20169 -27519 -19203 -28484 -74948 -59537 -61401 -91420 -86802 -77330 -84675 -95091 -32744 36847 19211
20156 19211 -8750 -25410 -49306 -67241 -47024 -63712 -71549 -80496 -49567 -45470 -49402 -61807
20144 -61807 -49881 -6780 19654 42065 65828 49145 27754 17239 23599 25647 51431 23940
20132 23940 12812 23533 -124 -1329 -31037 -29194 -48935 -29775 2580 -34515 -70665 -78021
20120 -78021 -73519 -48300 -40668 -14568 10635 -2816 -22881 -39504 -40371 4240 3202 560 -21957
20107 -21957 -45044 -61008 -42726 -63323 -67153 -50611 -51606 -39670 -36607 -39710 -53845 -58951 -76717
20094 -76717 -70445 -58980 -72211 -58100 -12295 10403 23192 18083 1337 -26978 -72739 -41046
20082 -41046 -20864 -45515 -91446 -108162 -120513 -86386 -83905 -116358 -121965 -114025 -86059 -83905
20070 -83905 -77107 -64412 -72107 -72314 -81081 -79190 -62536 -63464 -81561 -56360 -31117 -81270 -95237
20057 -95237 -41989 -48820 -53069 -69796 -106437 -106520 -94206 -41636 -36710 -71421 -111007 -95010 -49791
20044 -49791 -20026 -34896 -44230 -18469 -17572 -28085 -51500 -63430 -70657 -69283 -72414 -74254 -77859
20031 -77859 -30407 -9652 -36370 -30620 -7005 -20708 -48152 -15241 -4754 -12905 -25213 -21597
20019 -21597 -37539 -63817 -73569 -108545 -50971 -17348 22596 68035 85927 55060 66056 49404
20007 49404 50738 52268 54626 77484 71261 17183 -10491 -63 16094 -47185 -104606 -127421
19995 -127421 -99527 -83667 -97155 -88821 -80627 -84880 -41951 2748 63079 34921 13816 14231
19983 14231 37895 71130 51499 44699 1094 -23609 -25677 -23946 17701 -7356 -49181 -67828
19971 -67828 -52888 -45059 -62904 -108973 -107815 -108119 -121658 -133448 -108286 -107363 -129771 -99417 -94645
19958 -94645 -70775 -27654 -65689 -68911 -36044 -27540 -9599 -34757 -45458 -73832 -35529 -17425
19946 -17425 -20521 -10717 5341 -16341 17720 32423 -18633 -61660 -43973 -20771 -21551 -34614
19934 -34614 -25902 -57278 -102105 -98268 -67883 -63534 -72928 -42828 -63151 -37523 -12847 -13873 -24584
19921 -24584 -60991 -67580 4908 19093 -10820 24019 47173 19581 -24328 -19306 -14767 -22465
19909 -22465 -2006 -37818 -71913 -94112 -83233 -84982 -54142 -21986 -65428 -94731 -65336 -61479
19897 -61479 -53080 -36559 -1137 -6184 -48335 -79854 -46996 -49904 -56214 -37100 -7853 -17481 -4684
19884 -4684 30568 26044 3632 -3261 -811 -6170 18976 30938 -1886 -26796 -35085 -35718 -27076
19871 -27076 39393 47426 5779 -14229 -13912 -5278 -30858 -32597 -47119 -67456 -38116 -1479 949
19858 949 -16874 -13617 12817 12873 -16617 -21900 -24844 -31412 -41340 -58019 -107718 -118634 -98535 -91315
19844 -91315 -57863 -15062 22798 9881 -54167 -67201 -41171 -36636 -23082 -19349 -21367 -33957
19832 -33957 -8678 -16646 -26014 -47111 -31317 -9881 -40734 -78035 -59349 -80980 -98825 -85357
19820 -85357 -70761 -66524 -91030 -80189 -58229 -48224 -55163 -70230 -88261 -59238 -37209 -10390
19808 -10390 -11409 -56547 -92281 -137311 -81703 -17188 -12413 -36585 -25083 -11302 -13485 -11259
19796 -11259 -29044 -45522 -53668 -55269 -82603 -84839 -60535 -20400 -22992 974 -28127 -60856
19784 -60856 -52302 -46100 -21604 -40414 -45051 -40196 -80514 -67479 -50597 -38740 -45040 -73056 -17958
19771 -17958 -18817 -67203 -104077 -100926 -74547 -55863 -32261 -39178 -47908 -32463 -44223 -59388 -32568
19758 -32568 -20449 -55729 -69763 -44553 -62340 -46984 -21435 -31159 -19638 15318 38937 37656
19746 37656 31756 13042 -26799 -27360 -7927 -19561 -44317 -37308 -30838 1807 -2885 7608 22248
19733 22248 7490 1537 -33709 -50979 -68689 -70338 -93836 -95847 -103584 -88355 -47556 -21317
19721 -21317 16711 2077 -52830 -87429 -65653 -56581 -26466 15618 -11543 -63708 -83491 -69461
19709 -69461 -44753 -34185 -46873 -38577 -22772 -46897 -71412 -39554 -31977 -37318 -59207 -46445
19697 -46445 -19770 -23558 -53205 -8262 -21 -26606 -12433 -217 14572 27529 16036 -4500
19685 -4500 -15426 -54702 -61681 -84695 -59981 -53439 -66939 -116799 -137613 -64823 2423 -9775
19673 -9775 -9968 1077 -18641 -47220 -37875 -28214 -23945 -67283 -85259 -90100 -34179 12500 6062
19660 6062 23596 31940 5803 -10141 9973 49508 49644 32255 -21177 -38530 -41928 -54737 -74014
19647 -74014 -72454 -51987 -32477 -71863 -100960 -104659 -78713 -12377 3587 3685 15325 -8347 -21703
19634 -21703 -45366 -37128 -44835 -27251 -46330 -27763 6548 25118 -10759 -18001 -16230 -4783
19622 -4783 -29283 -7518 -22905 -51310 -83721 -74156 -49063 -49174 -54881 -49796 -30883 -43048 -45670
19609 -45670 -56768 -73616 -75252 -25639 -26541 -34163 -52157 -45440 -43443 -10489 -38486 -55350 -42302
19596 -42302 -38674 -42878 -15419 14748 20394 -16549 -29359 -18418 -27440 -9790 -47200 -101717
19584 -101717 -127115 -111187 -82539 -80888 -70194 -30785 -17322 -37101 -59877 -48521 -36094 -10021
19572 -10021 14623 -8210 -8649 -11902 -25734 -8889 25536 37193 3002 -33832 -54664 -74203
19560 -74203 -41783 -20015 -23003 19847 19772 9661 9340 15782 -18518 -43524 -59574 -52359 -20566
19547 -20566 18736 53624 48412 58098 76291 51925 10013 24 -41550 -63728 -32476 -46612
19535 -46612 -84099 -77007 -59620 -41553 -36452 -18269 14622 48956 14575 -39274 -78500 -66244
19523 -66244 -38993 -68223 -26338 4305 14239 4720 -18835 -6163 -5834 -25058 -22649 -20627 -42611
19510 -42611 -36848 -2612 2535 -25782 -32896 -9567 25575 32139 27147 7808 -11367 41271 99232
19497 99232 81278 84267 88592 24651 -20511 -27762 -4261 22329 5998 -6246 11958 2672
19485 2672 16284 58726 100749 155429 202653 249564 254385 292664 286799 237330 237755 234467 280884
19472 280884 300477 257162 245961 254582 278232 286662 289077 274600 261924 297010 280704 195523
19460 195523 157191 140350 95605 53169 18132 64764 83612 67266 29214 44218 14643
19449 14643 -41884 -52597 -11095 20436 39490 35421 10963 2556 353 1621 35550 42447 60319
19436 60319 75253 76476 2075 4090 20677 18856 -25636 -22545 -5989 -48471 -69114 -59471 -47319
19423 -47319 -28777 -29195 -28265 -51482 -78932 -63493 -5646 24572 21442 2330 -8085 2802 8476
19410 8476 31630 60381 28852 -2561 -5826 -32491 -30747 2408 33116 22515 -3551 -36057
19398 -36057 -27318 -932 -30951 -55892 -70182 -76021 -76883 -41850 -6000 14023 447 -16394
19386 -16394 -41338 -42108 -10391 -40971 -50594 -32052 -36515 -23166 8842 1657 -11805 -20129 -50591
19373 -50591 -57984 -29374 -30652 -11764 34878 35361 6486 -48282 -81825 -68160 -46192 -40974 -45287
19360 -45287 -37652 -19315 -39959 -41812 -58464 -83099 -75066 -79827 -65611 -27254 -1247 -27153
19348 -27153 -66106 -70529 -87966 -63772 -51446 -23650 -34369 -48881 -23580 20503 50796 16714
19336 16714 -39100 -42851 -351 3093 -21752 -12837 -48341 -72358 -66756 -105811 -114225 -109792 -66012
19323 -66012 -38955 -54895 -38244 -21579 -29579 -29425 -40367 -36094 -11016 -17579 -21723 -25394 -26004
19310 -26004 -34960 769 -36965 -41902 16352 51639 89570 85698 71197 53362 46456 48330 9698
19297 9698 -18841 -32966 -12153 2128 -7244 -18763 -19509 -24201 -33706 -37288 -27680 -25994 -38081
19284 -38081 -41124 -66488 -66092 -70580 -71458 -76086 -74661 -63165 -39979 3529 -6472 -45145 -100361
19271 -100361 -82451 -49163 -42817 -90858 -75449 -43347 -21906 25459 -9567 -59041 -53534 -41440
19259 -41440 -26199 -23472 -14693 -7166 -16521 -16388 -21946 24521 45048 57114 37208 -12046 -40656
19246 -40656 -62002 -69751 -66700 -80507 -81479 -13534 15546 -8306 -50282 -51948 -57356 -69510 -81100
19233 -81100 -98471 -75884 -35963 -32894 -40187 -27899 -30749 9075 37174 43945 26230 5796
19221 5796 -28484 -30574 -12558 -65974 -96559 -100720 -109143 -97298 -86991 -73830 -26820 22261
19209 22261 10213 -11988 -40793 -56793 -35171 -35925 -33933 -48000 -62701 -35634 -7162 -23253
19197 -23253 -73638 -71329 -36993 -21326 1695 32486 42679 26665 -20171 -30342 -31721 -8993
19185 -8993 11990 -13565 -29741 -50359 -36372 -23864 -41794 -39187 -39814 -32739 -18862 -6451 -637
19172 -637 -1468 2385 -4777 -4111 -24042 -36920 -44201 -42380 -23561 -4027 7329 -9243 7431 26775
19158 26775 14227 23002 12534 1783 4249 -24879 -3909 -5396 -20672 -44099 -44352 -4795 21139
19145 21139 57501 90828 43453 5792 -52207 -69932 -57236 -36200 12335 45749 66957 69205
19133 69205 85351 47840 27579 4014 -38932 -28758 2838 3274 25072 31089 69241 103065
19121 103065 85969 12988 -6696 18222 28605 30844 -9012 -22999 -1796 56506 59714 -13799
19109 -13799 -6061 32404 20618 6966 30133 37943 34159 13585 22861 -13226 508 8617 -36746
19096 -36746 -25453 24162 58584 84258 71283 34212 16835 54716 59854 63604 114115 141197
19084 141197 132330 77423 68359 99708 79803 59692 67803 96120 121503 110819 70559 70416
19072 70416 112060 105335 98255 84811 59444 66835 62625 82189 44263 17438 10117 2202 10525
19059 10525 26087 42583 33853 11626 14961 53447 48866 57623 73084 63557 48980 52876 37755
19046 37755 25612 31325 26498 -6549 -42768 -48658 -8521 25090 -1947 -18583 11132 42029
19034 42029 69101 50709 18269 -15251 -21315 -63825 -90049 -89625 -48211 14921 9305 10183 66862
19021 66862 78125 30994 14028 -8640 37703 96684 92738 32936 1905 29570 45699 47563
19009 47563 60603 66729 71807 44145 30962 12437 8621 9948 -2992 18901 42457 31713
18997 31713 38587 42313 42491 32048 -7952 2908 20806 38725 59837 74815 62455 60232 62161
18984 62161 77451 95349 91898 74210 113750 139335 144929 174281 177242 191823 180891 121820
18972 121820 119276 154765 139447 125853 98742 89601 113922 126614 151925 135656 146918 160427
18960 160427 157029 136706 103273 92665 74613 65227 82485 100534 102262 132223 154697 168538
18948 168538 184498 240918 211637 186160 158150 141583 147952 151735 116503 103490 108609 94438
18936 94438 145301 161650 171582 194635 206808 178127 166885 147115 124778 142788 169156 231805
18924 231805 238017 206319 198490 213086 219344 213485 222834 247432 220895 136002 111528 171574
18912 171574 201513 152021 129399 182998 216012 228275 239253 212551 209261 225269 227039 250021
18900 250021 276122 322621 321390 305127 320601 293709 317111 328741 346291 378396 358123 333934
18888 333934 368882 440545 470351 498216 505705 492490 513010 564546 646352 660312 707439 798732
18876 798732 826590 841511 890536 892005 929303 982812 1030875 1058993 1085183 1121076 1186345 1260690
18864 1260690 1351690 1430935 1465309 1515454 1602982 1716080 1840087 1992251 2149529 2251863
18854 2251863 2408646 2601966 2860791 3090975 3357234 3592637 3885454 4307372 4792633
18845 4792633 5367949 6154469 7203196 8664536 10712183 13631386 17949510 24538455
18837 24538455 34508682 47652338 57810307 59252465 58727362 59475429 63522252 68202129
18829 68202129 65024548 59117969 54197172 52047349 56521650 64952472 67031318 63587699
18821 63587699 60960538 60234453 62764382 61148787 52377899 42347131 31558746 22354111
18813 22354111 16286232 12555959 10085671 8371825 7126847 6207054 5506357 4923756
18805 4923756 4409658 3971979 3634983 3353159 3157088 2917231 2677683 2468663 2248396
18796 2248396 2115091 1992059 1819846 1636530 1519046 1430591 1316148 1266684 1207340 1126168
18786 1126168 1117225 1107901 1103596 1015352 873146 782718 746885 728930 723067 650473 641498 592504
18774 592504 496660 473613 420008 342018 321807 302392 290939 299662 255084 268735 249284 190622
18762 190622 135937 121767 119994 123636 139736 140640 147288 132285 148007 148129 92481 108601 117713
18749 117713 130495 148485 117351 61661 64034 49214 50350 44655 39472 25959 7103 4434
18737 4434 11046 6799 -10586 7613 21911 -24781 -11336 -34273 -56415 -52704 -71636 -65123 -56133
18724 -56133 -39480 -54662 -89456 -101283 -77965 -30162 -65146 -109891 -87963 -57861 -89653 -67597
18712 -67597 -55959 -74272 -118299 -95400 -54722 1124 -9448 -15037 -16364 -35848 -68235 -26062
18700 -26062 -4475 -19555 -24068 -54684 -53330 -28675 -16448 -23548 -24252 -29720 -27352 -70921 -97016
18687 -97016 -88690 -99742 -117362 -112573 -130254 -183805 -173056 -164950 -159814 -162730 -109888 -110923 -102259
18674 -102259 -99735 -78104 -78787 -76839 -76154 -75806 -82421 -79823 -45976 28594 19383 -22421 8010 22695
18660 22695 7443 20067 14781 24952 8007 -17627 -19785 -31414 -58175 -15368 -10554 -8184
18648 -8184 -12631 -32877 -40997 -5036 17565 16631 -36860 -12680 -46287 -64692 -54108 -37260 -39347
18635 -39347 -31620 -13708 2051 -12683 -8351 -28 9630 10392 -13571 -32889 -50150 -36507 -58374
18622 -58374 -71314 -58192 -37743 -48315 -39961 -30351 -35410 -21950 1221 11817 -36018 -64541
18610 -64541 -53280 -19545 -23431 -48322 -24983 4631 22558 9816 -36469 -54040 -29931 -37559
18598 -37559 -18855 -13177 -24309 -24200 -23999 -92340 -105991 -85285 -75211 -114857 -120397 -110155 -99712
18585 -99712 -85963 -30988 -27278 -12354 -16651 19057 43919 -45960 -67964 -55913 -50212 -24011
18573 -24011 20975 34964 6142 -40837 -56492 -36664 -32537 -39658 -64134 -30418 -43844 -34223
18561 -34223 -24987 -13507 -43113 -87512 -92892 -111125 -92767 -41359 2335 -26734 -78941 -62264
18549 -62264 -19499 -19340 -71889 -70228 -84087 -56554 -31727 -49556 -48636 -71644 -45228 -23913 -30381
18536 -30381 -30611 -31902 -37194 -39721 -47022 -40170 -107398 -91557 -40277 -22614 -37614 -74854 -100623
18523 -100623 -94032 -64672 -28859 -38071 -57268 -41135 -58044 -57045 -24776 2226 -9139 -24871
18511 -24871 -43683 -66513 -60067 -23292 -47347 -47087 -53433 -63227 -72192 -61936 -5462 -1475 -42328
18498 -42328 -59902 -67721 -58791 -66521 -43071 -15380 -71240 -78129 -52508 -52262 -64539 -79141 -44773
18485 -44773 22980 -10441 -66873 -67637 -48024 -8456 1608 -3880 -19999 -50942 -62821 -55960
18473 -55960 -84144 -52881 -14712 -9904 -45204 -20159 9566 15253 1338 -20243 -45789 -43877
18461 -43877 -46995 -40493 -29761 -22643 -35423 -37104 -46989 -25405 -48696 -77143 -45304 -71071 -126536
18448 -126536 -106343 -79452 -55972 -66498 -74464 -41423 -37330 -79704 -59854 -23441 -19233 -15233
18436 -15233 -28914 -46809 -61105 -65250 -48511 -24594 -21336 -66958 -92828 -77188 -85529 -93232
18424 -93232 -117700 -120164 -96604 -97236 -86118 -137927 -155947 -109027 -61312 -27268 27885 33284
18412 33284 -19115 -36160 -17895 -33331 -67168 -54461 -44762 -70338 -89352 -151604 -133287 -87746
18400 -87746 -53839 -52900 -37988 -29854 16210 27082 10444 18434 -14516 -62104 -109711 -153823
18388 -153823 -129905 -70155 -47769 -23516 -23414 -25447 -28777 -37255 14038 35146 25949 3942 -53659
18375 -53659 -112363 -131550 -94133 -36547 -27703 -66923 -92828 -92689 -96311 -77869 -60005 -58248 -67022
18362 -67022 -23106 -43023 -83211 -53259 -61617 -106975 -81328 -97789 -149987 -143029 -91981 -104708
18350 -104708 -92094 -31327 -59825 -107398 -112090 -95744 -77087 -27782 -71206 -118109 -90371 -95669
18338 -95669 -108596 -101693 -96052 -111018 -113775 -88224 -92565 -80639 -88759 -111529 -88601 -120653 -134957
18325 -134957 -85224 -82438 -111862 -106200 -69876 -58770 -48213 -44287 -48948 -68806 -56007 -26706
18313 -26706 -25744 -17421 -17642 -16681 -43172 -94910 -86023 -32335 -59995 -63533 -18883 20813 31640
18300 31640 50000 118338 204470 310229 473712 590643 639031 677236 668808 536795 393668
18289 393668 338688 275998 230318 165154 133970 119559 114400 83327 49139 24804 41918 39004
18277 39004 58072 16759 -62261 -66557 -19481 -45844 -51823 -61847 -38408 -10652 5713 4941
18265 4941 -26984 -57866 -29744 -1837 -10858 -46414 -63395 -53378 -44625 -19887 -5378 -10855
18253 -10855 -15718 -45162 -12934 -37679 -63554 -114058 -97480 -115279 -141343 -126845 -91556 -50424
18241 -50424 -61298 -59371 -53069 -91678 -78216 -26102 -30404 -39476 -12246 9309 58831 22462
18229 22462 -5094 -33706 -4460 -12678 -8079 -73605 -78002 -51612 -85243 -89140 -35206 -27793 -83127
18216 -83127 -99814 -63313 -33047 -6273 -12448 -27794 -21450 1077 9130 17863 3067 -46677
18204 -46677 -41626 -27387 -27663 -32199 -10714 -1357 21746 -28177 -67445 -62343 -43232 -11752 -21339
18191 -21339 -5039 20819 -3868 -41600 -18921 55468 163440 193978 174888 151160 184884
18180 184884 202733 233118 250689 251751 268687 258537 274815 332974 319112 310987 294179 286824
18168 286824 303245 284438 251237 198484 182625 176062 162357 68871 16129 7149 39203 34715
18156 34715 3133 15906 8076 9912 24174 14433 4375 10389 147 -17143 -4154 -28875
18144 -28875 -13597 1772 -33154 -43453 -7554 -9810 -27426 -80311 -95509 -105965 -69041 -33791
18132 -33791 -3786 -16243 -57894 -68590 -49562 -30975 -41562 -64148 -61871 -45423 -71481 -70547
18120 -70547 -91024 -102160 -107797 -44635 -13478 -35513 -44777 -58643 -98151 -113200 -94891 -80303
18108 -80303 -71680 -32136 -44552 -33922 -56519 -39039 -30130 -46108 -25067 -21404 -21910 -46987 -79947
18095 -79947 -85551 -108324 -114781 -97615 -77367 -56659 -68134 -118562 -119646 -95869 -56951 -71620
18083 -71620 -67671 -57404 -61496 -67627 -31976 -27897 -21807 -33967 -67449 -86130 -64239 -50683 -19589
18070 -19589 -29485 -73584 -69313 -66554 -68418 -94368 -114914 -73775 -122132 -76270 -50855 -38013
18058 -38013 -78677 -87479 -52098 -37194 -35163 -34109 -36908 -80240 -95592 -118109 -113781 -99594 -120138
18045 -120138 -97077 -72355 -50039 -19620 -28500 -6856 7516 18067 -16470 -50425 -49517 -39618
18033 -39618 -59145 -58921 -92243 -85897 -59680 -61625 -9725 -8867 -41429 -33489 -82940 -128335 -111814
18020 -111814 -106454 -92963 -106125 -113200 -51446 -35885 -67664 -68470 -52549 -13587 -15084 -13996 -29813
18007 -29813 -71310 -38185 -33916 -67235 -77494 -68380 -45370 -23250 -9020 11026 -12116 -23570
17995 -23570 -21651 -24956 -43206 -35676 -20292 -7689 11069 4296 121 -43880 -108013 -132954 -84512
17982 -84512 -18752 25007 38779 38318 29733 5050 -14789 -5599 7945 20255 10853 4018 33695
17969 33695 51611 53054 5742 -20016 -26012 -47233 -2274 14806 -23912 -31363 -34891 -50870
17957 -50870 -72160 -55456 -73547 -76359 -60568 -34183 -62866 -86576 -44126 -27500 -55986 -73805
17945 -73805 -63526 -65217 -50805 -33663 -45334 -77938 -65003 -8674 -11077 -53289 -70067 -84398
17933 -84398 -57135 -51107 -10843 17900 51408 69114 76440 46696 -720 -8589 -37598 -81337
17921 -81337 -35962 52550 80180 93372 165403 192432 236673 244287 252884 231215 197884 191374
17909 191374 168525 92831 73993 60719 56139 26112 -29859 -6306 16008 42151 74062 86789
17897 86789 121882 204335 192233 169185 192767 210131 185639 213245 178344 164335 115781 28719
17885 28719 9304 -8750 -46869 -28795 45255 108397 117932 112122 111517 93064 95246 118924 71786
17872 71786 32920 25319 42518 54499 40364 34579 69224 92047 13261 -32484 -9629 3911
17860 3911 -50087 1613 9133 22464 80803 163116 171453 141722 179952 186989 174688 133428
17848 133428 82002 62815 30611 -8256 -2610 29301 38004 78866 68535 70092 68318 43520
17836 43520 19621 26444 46078 43491 48032 64895 88606 69283 49805 60818 3947 -21365
17824 -21365 -440 34605 50629 11161 -5310 6628 44910 20083 39987 28567 6644 18467
17812 18467 21688 16670 22694 37194 30785 18662 33829 18040 -32241 -31925 -12987 3401 43919
17799 43919 51586 66148 64339 37029 68388 131292 166534 173732 165563 157032 173463 169297 162022
17786 162022 174945 182834 205607 247282 296098 311869 322600 309349 311185 310833 288440 249452
17774 249452 257607 296080 334669 348898 360927 363418 406189 405366 439494 536017 596617 646556
17762 646556 641506 641957 689482 776970 861103 920560 1020646 1105384 1183361 1250285 1336339 1500562
17750 1500562 1709831 2019192 2395073 2801688 3048069 3219396 3452844 3693651 3999932
17741 3999932 4422892 4921496 5619566 6518402 7550174 8613259 9908428 11706942 14202295
17732 14202295 17770161 23162425 31465377 44459686 64896420 96303884 138687577
17725 138687577 173013422 174774222 154509855 130420396 100791140 70381251 47948062
17718 47948062 33976401 25404046 19940778 16208175 13534061 11599144 10204880 9236658
17710 9236658 8466441 7684349 6959837 6292470 5635429 5113978 4682398 4394340 4228770
17701 4228770 4048661 3775679 3462654 3109686 2727374 2376957 2152769 1949488 1754965
17692 1754965 1577001 1466143 1392713 1333815 1271157 1191869 1097594 1061260 1002776 875995 808772
17681 808772 787450 775216 772641 716592 660975 651809 639509 590546 524290 503861 473727 424613
17669 424613 411435 374410 343264 354605 343409 296048 261636 234421 193093 210606 225323
17658 225323 237701 258273 282112 312461 312676 284835 281797 252059 236940 227357 232574 244276
17646 244276 217771 168562 174704 162068 146293 102114 112402 115808 138041 136493 102168 118325
17634 118325 147946 134063 116448 141972 137938 139163 138507 92011 79674 120702 114580 102606
17622 102606 71552 80143 92097 74170 65127 66765 63598 42688 66353 93630 102206 99132 95087
17609 95087 90848 59359 65935 76375 107262 134677 165432 172483 176603 161958 103873 9537
17597 9537 -11102 55498 128222 157714 162155 194347 228509 238642 212289 152032 145513 205195
17585 205195 189407 165342 180115 185656 179482 161778 144853 150612 152513 125972 77812 25299
17573 25299 7210 56990 77236 38219 45098 80822 165739 232193 256515 229472 239964 279537
17561 279537 213805 200979 197953 219601 243972 187740 139463 149813 137918 134429 125560 108551
17549 108551 111060 76553 45352 54149 90272 91706 36701 17248 38735 25098 18729 4641
17537 4641 17405 19141 17217 35275 58055 37697 -3542 -16120 9179 49231 17873 9454
17525 9454 -33969 -80266 -87189 -50483 -65866 -34117 -19126 -47875 -20876 30907 61629 41171
17513 41171 20355 -2451 19683 965 -21653 -12298 24844 50495 -5120 -16763 7083 11674
17501 11674 260 14068 13885 -1422 26631 61266 66372 47004 2531 1945 63985 126263 145472
17488 145472 154003 118388 109171 107918 87553 77646 40223 35265 26307 24235 73675 109701 75368
17475 75368 73277 86388 73809 58378 114946 175534 169793 166610 145182 103229 91243 103547
17463 103547 132885 149238 109367 61092 63391 65467 50612 26869 41273 55287 50519 24032
17451 24032 22745 25626 49183 38907 22557 20337 34284 49738 54329 67652 72789 63141 56905
17438 56905 43386 20278 -6125 24837 42055 35183 64182 119675 121330 134710 129191 130116 92362
17425 92362 79846 61532 81707 94256 73780 72654 118895 165973 147843 135126 120707 134211
17413 134211 136077 98225 68804 117696 165992 179206 221498 278371 283632 249591 242836 247666
17401 247666 261450 294572 326354 353181 401394 511397 570683 609823 676745 747917 811505
17390 811505 894239 984954 1088850 1208572 1298508 1336125 1375931 1460103 1585288 1684299 1779734
17379 1779734 1892099 2068229 2304394 2585726 2924603 3378471 3953029 4693445 5651491
17370 5651491 6894640 8539984 10909660 14503357 20019067 28242477 39011998 48827834
17362 48827834 53034304 53014185 53152018 54924322 57160507 55347131 48460718 40082244
17354 40082244 31382401 23732667 18614529 15736406 14335963 13995221 14593784 16228320
17346 16228320 19316005 24442755 32667147 44555013 56573597 62046096 61887085 61093282
17338 61093282 61882508 63978801 62367758 55205794 45711800 35523819 26043582 19082529
17330 19082529 14566363 11683418 9702139 8274637 7153755 6257509 5536560 4973867
17322 4973867 4490642 4048602 3730509 3434669 3192587 3000347 2795015 2619772 2497769
17313 2497769 2378278 2207247 2048408 1925189 1816751 1740886 1630637 1562456 1486257 1427918
17303 1427918 1370241 1263984 1168752 1096590 1014928 910598 807714 773013 752747 725957 672415
17292 672415 651737 617449 590397 524982 512802 462715 398191 368613 360015 377288 365658 337468
17280 337468 369824 367743 335052 348922 341695 364409 363697 337428 321234 310433 319590 303536
17268 303536 320177 304490 255225 229770 213264 241013 268639 241150 189531 149065 165575
17257 165575 214064 223560 216997 217962 228480 218186 169135 102381 107251 119630 129057 118769 103137
17244 103137 86433 96567 78625 100642 109159 109923 148963 150729 84722 47112 34906 33280
17232 33280 12809 2845 19899 7099 19081 61570 85179 101991 58580 85937 101640 55796
17220 55796 10798 2067 53123 47794 36402 8908 -15249 -10264 -328 10581 -21549 -39288
17208 -39288 -51258 -52452 13452 -21449 -51328 -19219 -43265 -34190 9396 13881 4020 29054
17196 29054 37269 29926 23117 30233 3176 -12270 46930 52690 7686 1247 18284 33315 -15964
17183 -15964 -37065 -40205 4711 11740 59747 93453 99523 155565 175346 120545 77330 102678
17171 102678 117588 144505 168454 184988 225383 211177 166360 172307 194677 190715 210259 217290
17159 217290 209723 240367 277250 338396 374855 412067 528693 611017 688452 766508 788146
17148 788146 757143 725439 676772 560614 441316 342780 313849 276886 281643 259935 232984
17137 232984 200699 166316 139760 169307 220650 192197 157407 138088 134324 133311 126126 124996
17125 124996 92240 66566 63469 47928 57252 51601 56677 68971 79928 46209 33981 658
17113 658 20420 13520 41124 78750 59933 31810 19093 55441 90779 97479 110173 127155
17101 127155 116906 87991 69384 67003 76486 147255 136181 139601 133108 114334 83724 81064
17089 81064 134334 172184 161095 170812 149120 147286 154509 168994 207821 233459 232874 246721 236115
17076 236115 250751 282085 290892 291240 311026 371012 464366 545113 571771 593259 628796 657482
17064 657482 667707 660437 669386 736264 843145 1010270 1206009 1334160 1410948 1464731 1509616
17053 1509616 1597298 1693195 1805347 1996913 2323126 2709098 3183217 3651719 4127013 4761871
17043 4761871 5626183 6918761 8866768 11877585 16610594 24067234 35522835 49828807
17035 49828807 56007189 50559606 42975334 33260550 25234719 21071556 20089898 21699074
17027 21699074 26069072 33948577 45617682 55908318 55072623 48618392 40517367 32158915
17019 32158915 27141680 26262182 29171645 36165128 46410461 52700938 48817795 42060018
17011 42060018 33618597 25765559 20948912 19079433 19547671 22353160 28224671 37965166
17003 37965166 48882052 49858491 43166326 35074848 25402861 17787967 13044946 10125245
16995 10125245 8238298 6910869 5966685 5348443 4874876 4464966 4100679 3756026 3434040
16986 3434040 3126152 2878601 2688926 2498054 2333565 2221921 2162669 2073548 1951319 1825853
16976 1825853 1697921 1547999 1395875 1301905 1199113 1134806 1076090 1055657 1056806 1031890 995166
16965 995166 984158 944469 872675 824852 774909 704946 648222 651588 623209 531907 514416 482392
16953 482392 451911 475545 491596 493416 471523 470963 427778 391242 379387 396867 350246 336658
16941 336658 314732 353798 350573 337207 348974 305442 260134 270425 284053 276333 302197 347932
16929 347932 361300 320485 296585 254135 250898 255283 238959 226026 220656 200066 172435 191278
16917 191278 210938 233633 231405 252553 279007 245414 234479 208148 147228 139406 166070 184391
16905 184391 208250 213455 196976 192805 196427 167606 118892 122423 118093 105493 88352 128278
16893 128278 167425 186046 182927 186290 152575 133303 118970 141981 124273 63769 63054 64151
16881 64151 93085 97978 118272 112514 99165 93488 86998 73706 63569 53861 83782 68734 60272
16868 60272 107180 128892 105070 100382 113930 129289 138122 121616 104552 94546 114112 145750
16856 145750 130293 183863 229210 238977 238423 202765 185391 145652 124541 101929 77631 115124
16844 115124 123380 166940 159606 134138 119137 124566 141156 149422 155358 163124 142187 114558 113317
16831 113317 114241 97483 52352 47819 68617 87928 81172 109658 152979 105678 84238 89208
16819 89208 134070 114679 116431 108172 74817 66310 59514 75323 91193 123650 134516 150364
16807 150364 171342 163250 188437 250844 272560 321512 336561 351149 386285 442375 434270 428405
16795 428405 438022 382297 345122 299615 267957 241670 203399 176798 190458 162482 117725 153667
16783 153667 169361 188286 229279 271404 273830 290996 279872 306920 322817 286091 234651 229954
16771 229954 217198 146367 108732 117170 117153 99732 112291 99832 96113 107688 113095 99935 51684
16758 51684 30151 66203 83220 82502 71966 21032 -29229 -42536 -44773 -21406 7978 30915
16746 30915 50922 57913 32210 23849 -2654 41945 62582 -4928 -10129 8703 11004 -10589
16734 -10589 11417 29386 61236 49836 32016 20971 26164 -3226 9522 16956 -24044 -37538
16722 -37538 -394 -4366 6644 27141 85021 133477 150132 135648 107500 102036 97213 82449
16710 82449 82431 63347 81799 72546 18406 4222 13453 11364 51199 62959 35472 26371 66949
16697 66949 69510 59588 56808 13090 -25226 -38460 -36942 -18066 -1687 16375 11023 -5161 28389
16684 28389 52869 52238 36455 -10274 -25660 -10050 28717 57396 40721 53478 25123 25578
16672 25578 40853 3783 18187 9981 -49917 -12881 -15658 -11021 36874 44352 40458 43790 47496
16659 47496 9706 -14046 -7966 7171 -191 -12530 38439 20369 39039 53609 11868 -21634
16647 -21634 -54984 -62291 -50522 -30176 -30287 -45405 -67320 -45209 5366 28177 29811 34765 34252
16634 34252 26900 56142 32557 3707 -44028 -51523 -17498 4517 22856 24836 19820 34571
16622 34571 18392 10219 20770 6007 21368 -2515 -21588 2060 16049 -30315 -50598 -34121
16610 -34121 11960 52342 15716 -12195 10649 23763 11219 37410 28587 45016 38157 33927
16598 33927 50826 14515 -25643 -35735 16547 38705 22501 20136 5186 37767 60172 36335
16586 36335 42807 31801 25438 46862 13148 1408 20028 8848 28439 57054 24459 33952
16574 33952 22506 -6182 -57287 -52343 -28862 5655 30088 56876 78065 59118 54918 50471
16562 50471 43532 21041 11018 -15499 -48553 -71723 -42521 -45039 -96738 -101132 -51629 -38503
16550 -38503 -10260 29 12440 30717 12479 -22746 -19708 333 29298 19780 -5171 -7943
16538 -7943 32998 25972 1664 -15058 -24263 -17899 27291 43125 34133 16127 45315 77560 48077
16525 48077 46016 45106 25919 14222 14192 55613 56079 25837 19960 -15903 -31196 -245 23208
16512 23208 70296 101691 100653 68473 46301 44644 41244 32820 -8893 -4723 15942 -12661 -30958
16499 -30958 -52 23674 -21683 -30379 7125 15448 28198 41179 47319 69236 40043 14624
16487 14624 -22868 -32855 -3298 58853 56409 25707 37529 74990 129568 138593 211153 274319
16475 274319 267028 228651 152507 128957 115691 111985 118953 150751 137121 141021 216976 215917
16463 215917 211581 227274 221917 184593 158197 144562 147885 206363 221723 211338 229796 247607
16451 247607 229226 183111 160941 149331 190533 213342 162922 188549 198881 170558 131860
16440 131860 95325 71409 55911 29287 50682 66759 80648 71010 64412 47710 56112 48891
16428 48891 11695 23019 48738 47616 45010 33493 4263 32665 44905 68503 54210 22343
16416 22343 -3754 -7232 -6831 -31306 -60507 -58997 11352 39901 32718 16785 -1336 34868 38755
16403 38755 -2854 -23622 -2395 19293 20832 17871 6783 17440 18383 -9756 -15133 15596 36256
16390 36256 6198 -18658 -31280 11329 39013 20459 4782 -52295 -76761 -88631 -97211 -56572
16378 -56572 -36915 -65945 -57954 -44576 -19262 24448 13741 10260 13295 6744 6176 28634 46300
16365 46300 15169 -22410 -28985 -48221 -20159 9409 23824 14957 -27238 -70699 -57663 -57965
16353 -57965 -3964 30211 36436 87657 66693 40241 16366 -20554 -33287 -39773 -41881 -16985
16341 -16985 12689 45136 57025 77712 76448 52845 29690 2294 -37074 402 21320 42886
16329 42886 -3695 -32044 -17978 27049 38140 19074 -4004 2980 29676 16287 2137 2022
16317 2022 17486 58471 78479 45516 26743 20551 33711 20621 17580 66891 117789 77291
16305 77291 27855 -17285 -53677 -15751 2976 -16732 -7090 -4348 -15302 -44724 -68492 -47465
16293 -47465 -29053 16229 46507 70506 45812 27005 -19188 -37015 -35546 3497 1847 -3721
16281 -3721 -2813 -567 11331 -28824 -77981 -47296 -63145 -102093 -35596 17252 -10457 -32491
16269 -32491 -38410 7747 -3629 -872 -17241 -24412 19383 63482 63995 7107 -26023 -31223 -34938
16256 -34938 -44086 -29448 -1098 -380 14215 8598 4521 -24745 -4669 44330 68636 71146 34049
16243 34049 10596 12055 13139 30743 18479 -32710 -44973 -41645 -65286 -61818 -36958 -52724
16231 -52724 -63126 -47808 -30660 -3913 13184 22534 32150 21651 17187 -33843 -19404 -14819
16219 -14819 -34459 -30587 -14436 -6881 7497 5794 22203 -2934 -26512 -62915 -21680 -3777
16207 -3777 -30233 -26169 -64443 -22415 740 9785 10757 10219 17964 14769 16859 16270 7979 -18594
16193 -18594 -3591 -4820 -13245 -8386 -37035 -22128 -1140 -28989 -49069 -73229 -69030 -67444 -37224
16180 -37224 8542 19096 2804 30853 59898 75642 77772 77720 78607 69963 39038 11810 -1447
16167 -1447 -38884 -52506 -24769 -9777 -287 -4455 -13262 -11791 27098 30092 -8600 -38290 -49223
16154 -49223 -29925 -41335 -54571 -9731 -281 -20177 -31805 -17210 5867 -24869 -56856 -58449
16142 -58449 -68685 -41595 23649 13840 -33028 -45917 -51837 -42115 -38034 -50684 -46945 -47688 -73202
16129 -73202 -54757 9403 -7365 8331 20564 30513 42034 35500 47442 10452 -5213 23142
16117 23142 50985 33733 28648 10366 16276 33091 25661 -3022 -73726 -117014 -82074 -52941
16105 -52941 -49327 -31523 -16162 988 40274 73827 38389 19772 10692 -31218 -7176 7238
16093 7238 -9534 -38906 -46701 -15845 8463 58520 95749 62150 -26485 -82067 -81322 -51166
16081 -51166 -351 31113 43663 -6906 -25708 -5049 -8267 11907 3237 -14443 -4439 -27566
16069 -27566 -39347 -55646 -42114 -16813 -8916 7233 2218 1634 24137 35720 24882 -19429
16057 -19429 -16392 -10410 -7109 -29096 -43725 -75001 -54075 -19361 19865 -2678 10308 22343
16045 22343 30809 31434 37867 65564 69646 -22125 -3122 22810 6859 -40171 -16841 7572 -15850
16032 -15850 -1539 -5092 -31172 -80306 -106778 -62576 -80693 -77624 -73770 -80431 -73175 -58953 -52509
16019 -52509 -29734 -13039 -51670 -58194 -70632 -70228 -67300 -65371 -65877 -35266 -14229 -7931 -23942
16006 -23942 -42626 -51765 -38945 -2 52024 61886 54186 34206 40535 18752 8256 17377 39528
15993 39528 15759 -24443 -23462 -38726 -46425 -78454 -55924 -12704 24766 1738 -14465 4461
15981 4461 17374 -11539 -46437 -34490 -54051 -74658 -64622 -69029 -62392 -22637 -36961 -64259
15969 -64259 -29229 -11088 206 26889 23965 60 2952 -23729 -35849 -43593 -27468 -44020
15957 -44020 -54208 -62805 -67140 -59322 -48359 -24867 -39446 -82951 -57733 -7839 3282 -7222
15945 -7222 -29676 -28110 4343 -8875 -23822 -52012 -68714 -93465 -43204 -7021 2021 270
15933 270 -84070 -109434 -84396 -40190 -20676 -16477 14858 -26986 -7929 27967 56326 48143
15921 48143 50083 22342 22255 -17905 -34902 -61391 -71213 -57970 -69000 -44175 38277 42820 1109
15908 1109 472 -7417 -40668 -87177 -98943 -68417 -20909 -8888 14591 21065 31742 2834 -37959
15895 -37959 -70615 -63908 -84468 -49760 3785 48097 35867 24099 17231 14586 12274 16247 -5875
15882 -5875 -3036 -7115 16133 56792 56524 18835 -7454 13957 -1012 -3403 -9215 -40622 -59331
15869 -59331 -60352 -35193 -7831 3311 -18039 -65062 -48761 -6982 10650 3865 -7029 4554
15857 4554 33848 4234 3349 30422 955 -22728 -15522 6021 13214 -42239 -73221 -39226 -7371
15844 -7371 -1689 -19483 -57886 -91469 -88395 -44813 9794 54666 48207 1106 -73197 -79046 -37396
15831 -37396 -42037 -20148 -52627 -67939 -54598 12049 32831 16891 15661 23971 15319 -20456
15819 -20456 -2728 40880 58307 22068 -37793 -51023 -47165 -31073 -29024 -1262 -11958 -42648
15807 -42648 -55729 -43461 -5639 23275 51336 30157 19766 -14193 -63339 -60738 -47232 -27506
15795 -27506 -13311 27295 28888 6652 23191 4754 -835 -22340 -14193 -26044 -52398 -53450
15783 -53450 -66354 -75081 -62037 -42574 -17018 -7707 -14 8179 4744 1021 1249 -7699 -15302 15440
15769 15440 -1257 -55945 -28947 12669 -5018 -3903 -21854 -19345 -44906 -48511 -59017 -74301
15757 -74301 -89234 -59809 -51418 -33909 -34400 -40724 -57974 -56971 -37939 -2236 -12941 -24977 -39871
15744 -39871 -41679 51868 134531 113974 84963 23902 -7787 -8847 1838 -8083 -14611 18768
15732 18768 8412 17089 21629 72683 125241 76738 13700 -8436 -15196 5601 43448 44797
15720 44797 17431 6830 8705 4890 -5667 -12846 -21763 3575 41174 73639 35901 16608
15708 16608 28190 22431 34625 14796 49642 60634 15318 -13763 -48711 -32689 -20845 -44868
15696 -44868 -71923 -46306 -21173 6924 -36031 3168 4209 9326 19535 8718 -29239 -47244
15684 -47244 -28554 -15767 -45301 -64776 -41270 -12664 -11210 -19186 10667 12311 -3134 -17959
15672 -17959 -35804 -42305 -72600 -24133 -4086 1554 -2932 -38923 -20896 -27802 -43363 -43129 -36402
15659 -36402 -5776 9628 16039 28697 13781 -8124 -65319 -42030 22790 13735 -50020 -83412
15647 -83412 -98366 -113105 -96995 -87490 -25453 8240 -2989 -17816 -16627 9657 27964 68460
15635 68460 55417 5455 -6831 1429 -470 22347 77047 65814 2994 -49825 -52681 -68355
15623 -68355 -66267 -23314 7972 4510 20288 5642 -27994 -27252 14870 36354 28346 7258 -39476
15610 -39476 -47218 -26350 16664 25457 -16070 -81660 -88235 -78961 -21000 -5418 4221 13114 -15516
15597 -15516 -12511 -18489 -7680 18783 16994 18499 8547 -1519 29057 30288 9311 -23084 7441
15584 7441 42211 56367 37434 -50378 -77796 -82704 -29057 -11412 -9564 3758 45112 71646
15572 71646 68384 75401 22465 -4539 -44152 -55651 -53663 -39688 -20321 2681 -6070 -31539
15560 -31539 -26545 -31914 -40977 -13884 36249 15917 26004 16445 -35880 -49933 -31085 -66182
15548 -66182 -88555 -40866 -15194 24938 53459 10758 -20711 -17949 -33006 -21081 -2739 -26626
15536 -26626 -19538 4478 39407 54146 -6877 -39518 -4484 -4354 -9835 -10744 -7461 4434 15710
15523 15710 19823 -1484 -27037 -41171 -21368 27136 51635 64482 44393 43936 58828 59588 38090
15510 38090 5157 -19381 -19178 -12213 27503 52629 28628 -18880 -37619 -35988 -34202 -46897 -49002
15497 -49002 -44906 -29318 -14881 -32658 -30201 11714 42514 54208 9551 -40226 -7854 8850
15485 8850 56186 32775 15995 -11937 -32759 6603 14540 -268 17008 13298 6979 38071
15473 38071 17944 18737 15185 -13952 -21944 12173 27959 32412 41948 30684 -10338 4721 25977
15460 25977 1110 -7880 -16747 19999 -26449 -39449 -27003 -18955 941 35392 27102 -15927
15448 -15927 -5060 -490 1577 6015 -27741 -26907 -6126 38675 48144 39582 25055 20448 8755
15435 8755 1821 40128 23597 -39775 -63120 -19749 -35359 -69484 -48567 -11820 -37545 -46517
15423 -46517 -59405 -41605 -26540 1835 40719 95174 79243 54820 66655 68432 47979 2487
15411 2487 18487 45521 50110 33199 5698 -28649 8106 43527 57218 87943 71042 46543
15399 46543 36601 17946 11436 -12328 -8665 32158 41108 58424 76131 72136 75439 96442 141488
15386 141488 116874 74269 37767 19952 68837 57204 16165 -2277 -12363 22138 32626
15375 32626 -11263 -4202 22206 20478 50580 60743 63618 44417 38594 33885 -10439 15881 20086
15362 20086 7076 -42291 -25854 -5162 352 -11517 -10252 -29212 -40216 14849 71407 54053
15350 54053 9823 -3067 -38317 -9928 15984 -3201 -810 -21094 -81830 -34616 -5048 -10760
15338 -10760 -1197 18613 39109 13964 -19328 -15889 2906 28575 48041 17779 9685 -11015
15326 -11015 -52394 -87263 -54232 -22286 10414 8785 11265 44525 29146 21888 19038 45622
15314 45622 58154 38347 18736 26616 29763 26101 26043 35836 57029 77440 77822 82747 98279 112663
15300 112663 111278 118885 98319 106153 92471 51427 44593 16195 -12746 3841 6197 42326
15288 42326 80460 85175 67835 51403 28381 -8368 -11954 1368 30868 37923 3712 19127
15276 19127 33215 45988 36132 20578 -12670 -22747 -27061 -701 38197 58904 26236 11594
15264 11594 14289 -15147 -12812 -456 -34013 -10248 6170 74346 77627 3783 3752 -14119 -27616
15251 -27616 -33424 -17225 -33276 -20575 8646 33504 6847 -24395 -899 -18331 -64794 -75895
15239 -75895 -61419 -16144 7449 -20139 -46159 -84642 -100328 -72855 -66640 -56405 -15426 -34479
15227 -34479 -60111 -64586 4180 4254 -13716 -23287 -44307 -41425 -18092 -19874 -39949 -51905 -50863
15214 -50863 -35414 -2435 28027 -17732 -20128 5009 -2859 -24454 -10854 -10724 -8808 2916 54033
15201 54033 40304 53042 81330 100684 46191 30592 13188 -14214 -11569 7527 9599 24490
15189 24490 -42681 -39729 -27363 9603 46589 41572 12425 -29098 -2559 37673 48967 38594
15177 38594 52746 69719 43528 -7480 -9627 1080 -24160 -43104 -42136 -55900 -49283 -5916
15165 -5916 23265 281 -11058 -13874 -9077 -30085 -34131 -24706 9741 2261 17035 54528 47566
15152 47566 45734 37261 63695 76925 63657 42709 36214 51585 62079 54836 67163 77250
15140 77250 40007 -8770 -23365 -20184 33460 60594 53962 18536 9423 -59809 -24907 11328
15128 11328 -6809 14529 3041 4725 8787 30553 24478 24479 49045 49741 42173 15676 -27931 -26155
15114 -26155 -4526 26663 37373 -3699 -13466 -6520 -1885 -6305 -27939 -12742 -20834 -17729 -38176
15101 -38176 -62575 -85482 -70342 -51117 -12106 32027 36625 10130 36635 62254 41043 34566
15089 34566 35055 89142 86265 54998 39993 73154 82638 74359 75522 42979 18911 56249 66086
15076 66086 29607 33416 30264 38484 56365 50892 75412 54902 39569 31824 16632 53571 75927
15063 75927 81061 88389 67691 60653 55131 56457 24604 15989 14854 34203 16114 -13372 -16097
15050 -16097 25891 -842 -33849 -13797 -13005 -28905 -38606 -13318 8336 31868 23056 -1238
15038 -1238 12930 2496 8277 34499 51590 18801 -27162 -59394 -46819 -54396 -78803 -59614
15026 -59614 20644 27137 6863 6121 -27246 -17293 5458 33943 44563 18209 16338 48262 72570
15013 72570 81712 77234 86927 82841 72687 55261 50556 50744 54870 48374 82357 100635 57686
15000 57686 60655 49437 11384 16981 23641 29173 18155 25996 45204 14438 -3716 3436 30792
14987 30792 30877 28491 27971 28186 11929 25646 49341 119796 136165 130020 80269 35137 15962
14974 15962 7139 -13964 -1897 -9081 -18723 30431 59888 72440 79402 73354 56108 28992 25240
14961 25240 20026 39489 23081 34602 44912 38358 -13695 -30151 -16881 -18261 -19599 -1362
14949 -1362 30725 46004 22781 -1824 10725 9887 25003 16363 -6811 4425 18905 -2517
14937 -2517 -26187 13070 12688 2173 22560 53828 47308 27110 20289 -10190 -47380 -21441 -44987
14924 -44987 -43336 -15094 5859 24236 30544 17676 44654 61985 61143 31636 -4960 -15525
14912 -15525 23942 87936 88166 82812 117307 117662 65033 16992 -7967 -33373 -1424 13115 2905
14899 2905 219 -40731 -33436 -6719 11731 44003 60953 38308 23508 39086 73792 80903
14887 80903 64858 10879 16957 1703 1666 45807 45140 15935 30903 23550 -1289 13401 33741
14874 33741 40540 27258 -5956 13901 4106 2809 -7989 -27551 -7603 9222 5951 -5529
14862 -5529 27 33536 53667 32598 36121 44416 41011 -324 -26407 -26555 -27445 3257 55809
14849 55809 84474 63312 50427 19044 26540 24861 49784 40656 11796 12147 9647 35791 41148
14836 41148 40169 13338 7635 862 2520 -10307 -19350 -51148 -52859 -54102 20954 30415 17768
14823 17768 -16325 -35416 8395 56558 35167 12332 25650 72753 101664 63128 28333 40792
14811 40792 42158 49266 69307 44315 56298 51287 20402 -32356 -37314 -23758 -26079 -38154 -49802
14798 -49802 -53032 -43187 -12613 11143 35202 26715 2582 15125 62791 48884 17077 -3227
14786 -3227 -52083 -43657 -12913 -28970 33 5538 44888 16162 12182 67067 56493 58304 80194
14773 80194 76806 68165 71471 73785 62157 5847 16613 69293 45281 18480 10416 53396 63034
14760 63034 20259 37519 25703 13592 -43058 -14905 -20130 4040 34944 85762 98295 126136
14748 126136 175942 173067 142653 141325 93383 41612 40323 83459 117012 103996 98790 54792
14736 54792 66466 87459 95529 74272 46269 24366 29011 34023 13350 -42966 -7275 38890
14724 38890 25286 43298 59550 66816 48194 27017 36963 49757 70217 11905 -17277 -14140
14712 -14140 -13174 -2812 -12950 -8362 48827 64071 26891 54952 50656 34324 9102 17492 14775
14699 14775 29830 53616 67880 49099 40859 3112 -34347 -22619 3427 8094 27825 60641
14687 60641 112246 106795 51090 21243 43981 68009 45173 50132 40408 61155 34138 46423
14675 46423 97049 87376 61646 83951 95904 115054 82275 79533 93959 57799 43818 50494
14663 50494 39674 35031 23982 32061 69148 80160 98038 110760 92390 91122 73104 56935
14651 56935 68138 37611 35083 54340 64873 50322 39951 9298 -2259 20574 73429 71205
14639 71205 49489 19931 32324 26734 17752 20071 21546 44438 68831 47926 56155 103053 106554
14626 106554 83069 89980 49184 64127 105078 106468 93994 100514 66620 39084 49948 31910
14614 31910 33381 34141 7732 12150 32814 19604 -21923 -2498 38692 71095 94714 76475
14602 76475 22382 -23119 -2360 -17482 -589 10196 3259 5847 23951 42137 44733 30574
14590 30574 43700 41019 61762 51071 22832 30248 43306 68297 73822 61438 50609 56072
14578 56072 29449 2034 -18515 -6697 -22521 2105 3923 19347 76224 97910 88293 43706
14566 43706 42064 -3267 -1528 -19089 5910 34556 48232 82240 117644 86933 97658 73420
14554 73420 45987 31475 67679 37449 27152 23548 -10945 -14768 9685 17421 -3657 -28130
14542 -28130 -50488 -3735 45380 75226 59563 34873 35091 63287 68064 77385 80161 86542 58238
14529 58238 40836 61554 52123 16971 -20237 -25440 -16635 -4571 18509 36101 49622 72504
14517 72504 53819 37732 28136 26114 15726 18268 42858 42620 54788 51704 42699 60629 42749
14504 42749 22190 39664 52315 61670 42997 10699 -8163 15840 44677 51315 23255 -540
14492 -540 -6282 -28109 -45624 -8775 53361 81343 100451 47804 32880 12903 26396 41981
14480 41981 66483 74829 85869 56998 31763 29461 1857 11268 37051 24288 31659 32212 58208
14467 58208 55275 48875 34505 35254 25620 12061 -6279 5105 53291 54687 19091 -30648 9192
14454 9192 -2612 -15794 17288 84269 95367 78398 79692 75885 82934 77838 73022 52094 37802
14441 37802 25649 4294 42796 40413 14259 -48459 -52068 -6932 26599 8669 18120 31817
14429 31817 19398 14387 20669 22641 36240 75039 88451 74806 23385 15529 22731 35160 39557
14416 39557 38887 30750 48701 107442 106814 46473 11978 24058 43484 63285 88775 100295 82126
14403 82126 41122 -16612 -40689 -48884 -42680 -12390 58111 78431 87197 86996 87640 91301 95718
14390 95718 73756 55985 86397 98790 50262 42918 51796 23599 36470 78052 27709 32441
14378 32441 76202 101335 113595 72254 79551 101133 131099 145217 140800 139440 125140 116508
14366 116508 86071 91258 102700 85055 92861 72558 21623 -20862 11074 54125 73696 49322
14354 49322 48867 88289 115149 93574 65004 71190 80473 56005 57291 65383 54887 68519 89466
14341 89466 93917 99662 37460 36752 93151 90420 24582 10240 54430 81930 36560 19223 18377
14328 18377 14682 61921 118162 93622 49232 29174 12608 65649 75204 30520 31533 67013
14316 67013 64630 53135 29175 2488 24827 23009 30112 28154 44794 42695 73303 100799 115708
14303 115708 120271 91491 105361 139737 138113 151344 162295 150673 133877 103409 75712 75936
14291 75936 46911 40909 35429 65119 116367 75390 63526 83565 87009 74062 84854 108257
14279 108257 116654 117462 106821 83214 61016 88719 110801 93679 87443 53106 38731 32320
14267 32320 98307 84163 45103 28059 67681 72939 94675 116794 90752 72906 34997 46352
14255 46352 17820 61822 71595 43385 32360 55674 63065 73743 99770 89547 16901 2027
14243 2027 8205 69308 61389 59071 72057 70533 72027 59127 81732 93292 116433 94198 63566
14230 63566 68019 54413 67703 83503 106410 136561 112784 50339 22955 39948 46361 69169
14218 69169 65633 34423 46920 47402 34690 38583 55426 72235 88937 96507 90334 96183 81685
14205 81685 48312 78369 119042 128080 121871 128486 136756 131695 108956 83574 18974 33317 93262
14192 93262 125845 116832 51516 43172 61768 48410 49918 87475 89674 72125 64389 69077 42908
14179 42908 34335 34963 119855 138905 156911 115770 79985 73008 45248 32634 100780 140313
14167 140313 112571 97019 95752 119603 107491 54720 63190 82950 92019 92225 98393 108682 94168
14154 94168 96974 88154 67122 71414 52386 61274 60085 58044 102332 129930 110269 80511 74890
14141 74890 60915 82392 111543 76287 75145 49456 64611 84723 74482 94362 127501 127465
14129 127465 138105 129056 126522 100058 114289 111076 95857 101534 95111 66498 74456 63305 81862
14116 81862 94913 96993 113315 84699 61097 77055 40793 44462 56472 96963 102636 91600
14104 91600 100296 87777 66153 70825 93490 112564 94187 114391 165478 145913 102080 98698
14092 98698 119555 131228 137924 147429 160778 124809 82324 72641 79737 52390 47060 56135 44013
14079 44013 21058 37953 42722 54502 62852 40296 69916 114367 104884 81213 95087 115402
14067 115402 107482 82769 95509 104319 85413 39663 24576 35365 64511 103117 130953 151912
14055 151912 126653 87874 109071 98829 93704 124701 95408 51945 63101 68073 50177 54003
14043 54003 84816 82190 82642 69905 48864 43438 53645 37788 28273 26544 79119 127526 100885
14030 100885 102109 106121 141113 127224 108997 100176 99067 131159 159593 119746 137567 115137
14018 115137 83576 95424 86262 72545 85137 114384 96785 92751 99093 116681 105580 87349
14006 87349 69237 63360 55664 74003 120861 128891 124250 92615 124520 113476 128284 159909
13994 159909 120461 106905 73879 43811 28735 32530 34866 61473 51981 63833 89272 94926
13982 94926 94644 100080 76056 96680 105221 102469 66379 64357 53545 46846 65507 89950 79445
13969 79445 90934 73331 94699 110683 113603 131034 93060 87254 130361 162296 130692 83862
13957 83862 102858 97397 68407 99597 145087 139819 115520 125668 122481 77650 47942 70075
13945 70075 88389 125853 104227 54513 47099 92191 149184 167849 170722 166178 131391 80715
13933 80715 62085 69566 92750 158574 156751 119895 101988 107184 101944 86235 91605 114088 131427
13920 131427 144276 138481 139371 154330 125394 123332 111433 129185 146337 95841 71279 112680
13908 112680 86591 49967 90355 126717 97212 86891 86203 112158 119904 83005 40792 27467
13896 27467 15582 24182 56539 80222 87957 84339 51923 89402 107997 120257 112933 54820
13884 54820 55316 25782 28655 76264 98400 91849 78297 97217 106952 99861 96523 69208 75423
13871 75423 115191 71104 71022 98045 105368 99468 98824 94445 105866 139123 120908 122603 124084 109320
13857 109320 128789 160997 166632 170738 162796 133765 137819 101523 80058 101384 134319 149250
13845 149250 154987 153310 129795 87535 46205 74438 142489 162435 145571 106267 64409 101682
13833 101682 122645 105691 65242 62928 91858 144198 153410 139411 166898 131821 147019 177713
13821 177713 125019 98628 89246 98992 111624 122486 164483 133579 146880 143629 129162 90573
13809 90573 47172 47475 64133 104775 106653 118502 114067 128384 128439 135683 138790 163601 181515
13796 181515 165652 160771 130612 102171 55551 60587 95758 102788 77528 88170 107662 114904
13784 114904 81668 60361 58773 95968 123172 105326 76225 75685 87265 76043 73662 98944
13772 98944 98715 106358 88186 90675 131786 105939 85781 99722 79668 83939 116109 101098 144870
13759 144870 137733 151084 127732 132161 103063 93815 109468 117466 95091 89862 97637 130731 131161
13746 131161 136379 83284 24044 32063 60688 73679 93405 103035 115010 140453 142216 134181
13734 134181 133936 142523 151534 160757 131427 100367 120285 116248 86044 97125 123052 75429 59892
13721 59892 88590 112396 90501 85269 92829 116684 152557 145026 159132 149262 104738 91904
13709 91904 124328 132658 87275 40873 47974 66965 82986 96845 100807 90104 108825 96654
13697 96654 87822 88322 117599 120839 132398 176021 151681 116695 128951 104020 61483 42877
13685 42877 47956 31245 43509 69185 79223 62288 74154 80592 74769 96717 109684 119490
13673 119490 109199 93048 89864 129560 127536 112722 98436 85317 92342 119523 136680 134349
13661 134349 139793 110911 79988 79346 115386 105266 71660 68642 87384 85931 46588 28326
13649 28326 43242 47319 70450 120653 143816 136424 118793 122494 149371 170531 119807 101800
13637 101800 118007 112748 52171 2125 15731 43480 86987 82238 106204 113213 128517 96334
13625 96334 41531 25697 87214 87942 102540 179526 200839 216828 221531 181542 149487 153400
13613 153400 186820 187113 152615 153425 139167 129410 127603 132607 162966 118700 89643 104559 129381
13600 129381 139462 154094 189831 152910 134564 110463 68195 62871 81326 75412 89855 123251
13588 123251 120982 94106 120231 111579 107927 126743 152263 116619 96946 150715 150740 168737 119461
13575 119461 72119 102680 138395 158774 184735 198966 231512 243288 243271 287175 353084 409669
13563 409669 501046 678098 909611 1227126 1639841 2114278 2408315 2312201 2043990 1701195
13553 1701195 1340617 1057544 861098 716035 601521 516278 446219 437015 439178 405130 342442
13542 342442 282332 268272 262263 240036 243165 209837 198599 170318 151167 134949 98201 98030
13530 98030 94137 96946 127094 131921 152997 128267 144636 144961 144728 151910 153739 154798 129409 105247
13516 105247 60563 75576 123782 119469 85523 67884 78993 71773 89636 130678 159478 166237
13504 166237 151758 137306 132694 128306 121923 76439 26202 26088 39337 67030 85398 67659
13492 67659 51511 24843 4273 25023 62911 70933 86243 91055 90000 91019 76022 48972
13480 48972 66464 84796 87322 89826 78002 58553 62182 54108 24788 59411 74729 58051
13468 58051 54050 74222 63209 80541 74706 50036 33494 27328 52217 57690 38353 35432 27919
13455 27919 29904 -13298 -17373 23403 24758 -5983 -18561 11403 26450 26726 45040 52295 67488
13442 67488 51664 78453 52482 12648 39320 37826 45865 66374 42159 39631 26525 23524
13430 23524 92363 98693 82348 60194 59046 88968 138074 138545 69389 58640 84840 104989
13418 104989 58078 41612 3751 6503 51770 56425 11164 11026 52771 27593 17421 16366
13406 16366 -2834 -32693 -48727 -20402 -1128 10822 -15387 -19779 -66 21370 46499 20906
13394 20906 -32293 -77025 -44731 50280 62886 25278 16799 -26839 -32798 12518 5560 7584
13382 7584 -6360 -22409 -30985 -30998 -38149 -39016 -75854 -94702 -94315 -86991 -91989 -68474 -46768 -49505
13368 -49505 14930 113834 182490 230019 265734 284958 284406 205674 153280 125725 92227 65588
13356 65588 54467 7871 -8072 -32926 -46064 4101 14839 -19254 -39139 -43182 -40028 -36117
13344 -36117 -51879 -58930 -25569 -34916 -69427 -94653 -104869 -67869 -76767 -49888 -78702 -96075
13332 -96075 -86560 -115721 -100651 -55731 -63939 -102348 -123054 -132516 -160775 -224389 -222569 -227159 -232841
13319 -232841 -191761 -158058 -92528 -79972 -109684 -128767 -169969 -180357 -214211 -221090 -292499 -333251
13307 -333251 -351690 -313260 -316323 -323089 -292017 -294282 -266147 -258044 -264258 -289434 -234457 -224350
13295 -224350 -230081 -220298 -279663 -259644 -259995 -284795 -243498 -297664 -369411 -388755 -385461 -374557
13283 -374557 -349302 -366497 -381891 -380146 -377438 -392670 -369163 -354498 -367323 -411434 -408687 -387353
13271 -387353 -374416 -400816 -289809 -154779 -16600 45364 59137 58144 29255 -3657 -24083
13260 -24083 -39478 -42970 -60963 -109682 -166715 -203470 -225290 -220648 -233213 -208845 -206748 -231775
13248 -231775 -240039 -209768 -181130 -144635 -127223 -100223 -38679 31777 164805 290925 277630
13237 277630 215999 84587 -97161 -157767 -239327 -247509 -254662 -271792 -304120 -317279 -325200 -294791
13225 -294791 -317633 -347424 -393059 -450426 -481505 -461121 -421679 -413546 -397788 -378679 -399990 -419727
13213 -419727 -441707 -459399 -456831 -455592 -479556 -469298 -468551 -435396 -435005 -448963 -517595 -562639 -542966
13200 -542966 -524245 -543920 -559968 -573721 -602696 -627898 -578963 -571841 -611816 -632161 -688125 -718238
13188 -718238 -742401 -772085 -778296 -845926 -863636 -807112 -758432 -722733 -686708 -648916 -627440 -604535
13176 -604535 -631787 -629358 -583957 -574875 -571659 -558408 -528430 -529024 -576136 -629443 -646531 -631898
13164 -631898 -611969 -601348 -582804 -608452 -665346 -694077 -709992 -676935 -624093 -563054 -465294
13153 -465294 -379348 -382624 -375231 -346098 -287146 -217149 -172111 -60225 79583 193049 369449
13142 369449 489424 626272 805507 1011900 1266412 1548173 1883734 2281791 2726266 3264844
13132 3264844 3989007 4899509 5960748 7175594 8622275 10380296 12530721 15268942
13124 15268942 18780367 23311941 29303399 37314062 48226773 63240381 84255380 114022110
13116 114022110 157202892 220217770 307723544 410522182 479135881 465962009 409894261
13109 409894261 330601102 250261573 188708770 146382155 117197403 96246011 80459654
13102 80459654 68280292 58746851 51255525 45283311 40393943 36299333 32881125 29964096
13094 29964096 27483444 25322908 23397458 21728592 20259415 18955255 17801818 16742533
13086 16742533 15787798 14922882 14156225 13442588 12682872 12004716 11418204 10922697 10480391
13077 10480391 10028737 9611630 9223447 8827578 8490299 8175684 7856727 7598904 7363326
13068 7363326 7169514 6973026 6791782 6621356 6458211 6256048 6052157 5847769 5625497
13059 5625497 5451609 5341024 5278560 5149482 4983330 4850341 4707558 4589632 4483602 4429198
13049 4429198 4398648 4339510 4206811 4109791 4022790 3979366 3893630 3865939 3820285 3801108 3806818
13038 3806818 3796057 3747581 3666719 3576164 3497281 3429800 3341102 3287695 3267111 3260561 3234194
13027 3234194 3199245 3147067 3099257 3047342 2988511 2932005 2908017 2862678 2804834 2768544 2743704
13016 2743704 2708944 2715658 2696103 2665225 2629841 2602526 2605593 2599810 2587087 2586953 2544745 2502751
13004 2502751 2495833 2457259 2419152 2398150 2357615 2329738 2296900 2277241 2297438 2327100 2337794
12993 2337794 2306280 2293538 2313435 2310196 2282404 2262841 2247224 2118736 1980572 1909977 1904468
12982 1904468 1931995 1937636 1951072 1939298 1915467 1893859 1888242 1852230 1877718 1855645 1855373 1832733
12970 1832733 1828696 1812309 1770265 1727398 1724476 1686653 1630215 1611154 1559287 1524876 1509814 1468653
12958 1468653 1424208 1409194 1486280 1634659 1734516 1812907 1853331 1868905 1877937 1906380 1938289
12947 1938289 1940275 1944491 1932109 1905428 1893250 1908135 1864215 1853664 1835151 1839032 1789009 1791956
12935 1791956 1774335 1774452 1788950 1784013 1759839 1730849 1689006 1651106 1620952 1631338 1682130 1705972
12923 1705972 1759805 1808509 1813723 1829206 1796632 1743320 1728449 1725067 1764385 1745308 1697235 1674984
12911 1674984 1661288 1613501 1545673 1539903 1572180 1550278 1545390 1579790 1591720 1546575 1479861 1469180
12899 1469180 1503250 1532912 1542420 1554585 1553661 1525335 1521904 1528270 1493810 1513998 1541677 1518610
12887 1518610 1508555 1512086 1468475 1472846 1477340 1467718 1472968 1455250 1423829 1400065 1402175 1404673 1406176
12874 1406176 1437331 1482780 1441208 1404148 1429875 1443687 1445398 1445914 1430054 1444466 1431474 1433093
12862 1433093 1430642 1439609 1442084 1445062 1466300 1471212 1449131 1394796 1348263 1350842 1373001 1412154
12850 1412154 1399336 1370891 1372861 1368937 1384847 1402102 1372269 1306252 1277796 1320938 1360644 1343669
12838 1343669 1339401 1298436 1293026 1302565 1328218 1335628 1318846 1284005 1293127 1339348 1340228 1341859 1316340
12825 1316340 1314926 1297379 1321389 1332696 1311423 1327901 1331277 1349847 1365466 1332471 1383073 1392494
12813 1392494 1360226 1337303 1303994 1286571 1254016 1270145 1274174 1276149 1285087 1254144 1255681 1235441
12801 1235441 1203394 1161190 1155903 1155430 1197763 1234587 1259251 1270163 1248640 1240514 1199989 1196787
12789 1196787 1222527 1211909 1204330 1227459 1224083 1226188 1241043 1238803 1244938 1245051 1241684 1253338 1248800
12776 1248800 1249865 1244537 1230507 1248185 1232710 1224374 1219327 1202126 1194486 1188674 1211358 1207569 1200837
12763 1200837 1232222 1188363 1224043 1265332 1274618 1254314 1187683 1162732 1192199 1179309 1171380 1153490
12751 1153490 1187404 1197059 1212652 1211724 1200126 1194248 1186657 1217592 1215436 1184749 1198089 1194648 1138028
12738 1138028 1143554 1159361 1168868 1173415 1167334 1164128 1164612 1196869 1218426 1232698 1191148 1120150 1134084
12725 1134084 1137265 1134878 1142690 1151158 1118462 1099027 1145088 1166265 1199592 1227958 1217765 1235150
12713 1235150 1261050 1251409 1185860 1163857 1165967 1140715 1129879 1150022 1122280 1077344 1106390 1100041
12701 1100041 1100944 1117169 1167793 1154052 1147697 1152745 1160002 1153007 1149524 1154837 1150506 1131324 1141426
12688 1141426 1145205 1148202 1169675 1162842 1154621 1172026 1170332 1158397 1198653 1199168 1187248 1199602 1216446
12675 1216446 1240347 1283271 1297967 1319055 1388433 1412089 1399683 1410156 1454628 1545019 1677441
12664 1677441 1867708 2159257 2541137 3012877 3412540 3463734 3235453 2906413 2560953 2236214
12654 2236214 2008861 1865484 1740911 1563257 1483934 1471994 1458987 1430774 1392689 1380983
12644 1380983 1355806 1316794 1306353 1328871 1292224 1259222 1229830 1194449 1201989 1196491 1211948 1210166
12632 1210166 1211584 1168792 1156903 1153856 1142309 1180850 1212054 1201485 1185306 1201969 1217579 1211972
12620 1211972 1220836 1188012 1174522 1146960 1137839 1146272 1169210 1148125 1106933 1097599 1098951 1072473
12608 1072473 1065869 1100411 1125283 1133031 1140484 1159962 1144576 1160447 1179371 1163746 1176124 1179859
12596 1179859 1196183 1208500 1216224 1223855 1216022 1165751 1128573 1117186 1091233 1057131 1079046 1072212
12584 1072212 1070955 1081692 1096125 1087474 1093069 1125335 1149425 1139948 1109974 1099684 1104809 1134808
12572 1134808 1166081 1149364 1082373 1045493 1060479 1101888 1091533 1086195 1059392 1043792 1038196 1056106
12560 1056106 1089666 1148006 1148804 1132650 1132221 1130226 1127417 1137283 1136207 1086041 1029659 1043858 1082698
12547 1082698 1085058 1084358 1069866 1057724 1057117 1080154 1118972 1123612 1118640 1145513 1181621 1162114 1096151
12534 1096151 1066555 1087662 1116986 1096918 1073987 1045041 996550 1008322 1078372 1071399 1006158
12523 1006158 1019117 1060292 1083890 1075421 1015891 1027576 1094936 1136691 1110851 1071282 1064357 1096412
12511 1096412 1113041 1079638 1037851 1060427 1103229 1093924 1096164 1066335 1039595 1049449 1041100 1050563
12499 1050563 1037321 1043356 1017217 1048706 1042227 1050018 1055456 1073709 1060176 1028389 1033413 1039030
12487 1039030 1047231 1070709 1072543 1062252 1089714 1122828 1104312 1077935 1075582 1026990 1045615 1049643
12475 1049643 1062959 1082405 1070451 1082045 1077460 1080726 1078796 1054653 1018522 1015225 1062527 1090431
12463 1090431 1114406 1074039 1047948 1065243 1085608 1094493 1147188 1150324 1098675 1106027 1119880 1128832
12451 1128832 1152686 1131868 1074405 1065618 1063531 1083611 1051880 1020114 1083113 1106908 1113428 1139709
12439 1139709 1108998 1124964 1161247 1137506 1118815 1124120 1102170 1027646 1008770 1036159 1081000
12428 1081000 1085474 1037419 993314 999533 1008779 1038536 1067772 1038624 1022420 997136 1053874 1116657
12416 1116657 1116960 1114953 1145782 1126447 1074159 1024502 992257 1010511 1018258 1058384 1064453 1041174
12404 1041174 1057924 1053632 1078945 1086404 1089631 1079866 1041296 1035090 1051931 1061653 1054534 1054866 1054720
12391 1054720 1052852 1070287 1059791 1059507 1090378 1104524 1068202 1051602 1016682 1022439 1053190 1038499
12379 1038499 998922 1006172 1004411 1013189 1039758 1071105 1085174 1091775 1094747 1074444 1032015 1054865
12367 1054865 1056129 1087790 1100088 1107402 1087637 1090274 1059019 1025640 1020937 1065412 1092025 1100625
12355 1100625 1091421 1077679 1078920 1076942 1118554 1103131 1048804 1058922 1018070 999814 1000927 1011284
12343 1011284 1027920 1057547 1053570 1030231 1048449 1055079 1089189 1080202 1034722 1010816 972773 986880
12331 986880 967736 946697 952129 984536 1017793 1014375 1049954 1078293 1068707 1073642 1024697 1003431
12319 1003431 979949 994404 1051534 1075966 993067 1000749 1029646 1034755 1057605 1047812 1049069 1055591
12307 1055591 1089097 1063721 1044966 1037339 1041194 1024513 1026604 1046356 1059717 1062790 1075181 1093848
12295 1093848 1066269 1075528 1061787 1080924 1087483 1059998 1023055 1006904 1038560 1061392 1101008 1137482
12283 1137482 1121138 1096011 1068150 1059063 1065460 1046278 1037054 1027167 1034631 1031745 1008506 1027824
12271 1027824 1056552 1098041 1065249 1025404 986390 967322 975119 992796 1006475 1005874 982791 947708
12259 947708 1012116 1016630 1041099 1047793 1002936 963148 974273 1006248 1035223 990035 973720 984620
12247 984620 1006584 1032721 1033486 1034770 985132 945219 945700 969259 1030773 1047814 1038178 1002484 963121
12234 963121 967243 981435 970273 985022 980977 945575 946681 943695 963643 1017165 1030155 1004968
12222 1004968 967870 955929 964792 1034593 1062902 1036871 992318 966182 946037 919885 945786
12211 945786 978043 1009204 1027157 1024973 1011820 1028370 1052682 1005717 986341 990302 1001169 976847
12199 976847 980648 971582 975589 991133 965596 965266 993429 994119 971919 959837 920116 931121 964579
12186 964579 1009616 1022885 1051566 1075241 1053040 1031567 1011697 976729 944351 927807 946111
12175 946111 953208 975628 996323 972880 973302 990454 958312 991590 1016803 1048008 1039164 1030657
12163 1030657 998990 976860 997744 983872 1003210 982390 941143 917213 896378 939781 987810
12152 987810 998018 1010833 958403 936751 944301 975032 980785 1016399 1051063 994429 959407 970888
12140 970888 958682 925335 947116 968713 954818 957933 964463 966252 907212 893974 928605 941645
12128 941645 941283 925146 958612 943882 907835 925339 981207 1022150 984053 954998 977576 986317
12116 986317 981428 962296 926669 924594 951663 976143 1002788 1004084 1003325 1003863 973843 976320 952665
12103 952665 899048 890886 919785 928215 954559 968093 989210 1016434 1018635 1016283 984573 971887
12091 971887 978245 931681 917417 973887 1010525 1024998 1022542 1056498 1087243 1059128 1036309 1029401
12079 1029401 1011079 998710 963361 948308 957522 944286 913314 933268 978668 969037 958414 960813
12067 960813 998757 1008041 995988 946007 929415 958637 986955 978219 948457 956119 963871 942010
12055 942010 940513 1001437 1009413 971649 960895 911987 912986 934599 945818 963774 967997 946652
12043 946652 928301 902532 875962 896916 929103 939641 932640 925441 930844 922180 967568 977030
12031 977030 942169 911686 916099 925879 928093 981172 1029347 1004095 934361 913308 908297 928316
12019 928316 937206 922755 925594 941717 936627 905428 937235 947102 946422 951253 923223 927322 918815
12006 918815 946349 928301 880438 882205 882514 873622 888827 924775 913869 923393 945699 982101
11994 982101 997324 972431 970547 954555 912522 899758 895360 883144 855765 850863 877368 908969
11982 908969 896549 940869 932613 898115 893673 907326 900105 895269 911812 920538 917485 890829 915838
11969 915838 957054 944531 944557 930402 919884 924345 908503 895774 896759 950511 937877 892321 864293
11956 864293 846365 858107 874360 919663 928584 965836 997710 959916 912141 865390 885570 925710
11944 925710 941086 900023 908028 857177 854232 901858 930301 921976 916504 883472 887149 864919
11932 864919 882442 882562 898635 845278 841684 864533 893407 910569 914074 907593 893251 856050
11920 856050 832760 865774 861929 855443 869534 881161 885712 887645 895355 859946 784583 820999
11908 820999 878171 943791 954345 940412 916039 884638 864477 878128 871921 827583 836676 848815
11896 848815 838983 835918 876872 906784 896521 895524 872307 859534 861116 906084 956313 981285
11884 981285 949559 878013 841756 833450 885809 872110 863226 897862 892893 850100 887516 853123
11872 853123 800400 783494 792642 807061 851667 895793 931872 909476 875458 859411 848152 846882
11860 846882 852706 862039 844486 799430 841547 854683 826803 830057 829162 868277 896379 878648
11848 878648 864412 845875 853772 856136 819470 758692 768077 801107 826270 826914 794412 742046
11836 742046 712852 736574 791381 858647 875572 853865 811064 826664 841046 823604 813385
11825 813385 834858 856952 857756 816181 822484 837091 838725 847717 827598 855713 837235 841068 874672
11812 874672 855433 809951 805193 777044 757778 763244 795709 789300 766878 792341 789551 765724
11800 765724 796036 805662 799882 818711 867463 892761 882342 842267 834017 849108 863447 876228
11788 876228 880753 861354 856328 852684 850610 884041 878217 848978 802719 784257 791056 825442 885357
11775 885357 883366 846596 856206 846013 802903 790170 765357 781239 828621 821526 782034 779894
11763 779894 818269 823897 819911 804051 809432 791240 763941 751129 731334 792590 804023 791380
11751 791380 810136 807440 809556 794206 778404 781043 748612 710840 724207 733014 775399 773775
11739 773775 783312 824064 795470 791739 831349 874238 844298 840538 848844 836787 829581 816111
11727 816111 828084 782660 747908 769344 774075 782323 763068 754007 766172 748296 719958 705110
11715 705110 701597 692208 690918 724094 743233 745642 754699 747091 727526 692379 706376 695094 672603
11702 672603 683051 711370 747588 725831 731149 753948 732402 731003 701617 696785 723061 756038
11690 756038 734738 727419 766280 770898 755738 720932 712226 735703 756008 738006 739408 750686
11678 750686 734532 748083 754703 749880 741973 771530 818919 797422 754260 700606 678834 701875
11666 701875 756984 751684 752296 719228 682847 689630 705682 752538 742823 729292 727378 725978 707232
11653 707232 701525 723644 717549 714588 725267 728894 719810 659963 650639 677163 661365 675459 691037
11640 691037 670699 694941 729096 750296 725508 736346 742084 730470 737740 730135 711105 709830
11628 709830 725206 776006 770897 726904 708596 705061 745961 770636 748921 758355 762446 731773
11616 731773 730223 743154 712862 736375 741932 736251 735678 735327 722609 695120 725152 746386 764777
11603 764777 737273 737893 738632 736493 734227 682657 668372 675863 700368 701732 729920 782207 761999
11590 761999 732369 705872 718562 713671 708270 682783 686070 687203 665845 633033 621646 621223 627434
11577 627434 650312 668596 678908 708663 718728 706851 699999 713944 734777 737135 736620 707700
11565 707700 658767 648838 631995 631866 667148 677690 706468 723385 704449 690380 698010 662022
11553 662022 636101 607320 638795 644952 627655 632718 626094 632969 617257 622219 602366 589264
11541 589264 590773 571344 577879 617275 632299 612322 588282 606908 580887 561921 595802 584612
11529 584612 599764 634744 623455 650663 645112 658869 697986 698746 677096 683226 688905 703664
11517 703664 692040 644246 623916 663211 664356 625918 621724 592022 638054 688769 717801 706710
11505 706710 676960 638898 606932 591825 586503 578522 605529 601691 548335 525867 568689 608935
11493 608935 638435 611131 625712 643367 610946 566206 575200 566538 553500 582882 602501 606118
11481 606118 604331 646835 656852 632599 654366 624880 602773 617521 656610 654231 659793 627949
11469 627949 621771 616647 621241 624206 642147 595217 589661 608252 619416 626395 652225 705317 662899
11456 662899 587815 581891 604401 595302 597243 569909 538235 532575 601398 635793 616616 564460
11444 564460 589720 648471 656133 641794 632465 600907 568970 557874 530132 525048 550730 581823
11432 581823 596285 549542 547421 514676 496808 490029 534190 609517 622900 603789 590319 598715
11420 598715 587269 599385 619667 623165 601427 594226 569420 516750 504114 522586 569063 589179
11408 589179 557950 559804 569687 554619 513703 525286 586567 573715 540333 553842 544750 537672
11396 537672 546506 598915 602098 572641 591482 593762 578989 569754 541639 503601 535828 540290
11384 540290 569410 556991 529522 512255 549544 557181 532737 562380 552172 508703 534928 575153
11372 575153 576001 576561 585030 558764 512375 481077 489726 510061 523236 516598 506826 554409 580979
11359 580979 560231 549079 591486 567114 550545 515724 499157 507934 497265 444790 461173 510829
11347 510829 536745 572460 535890 525989 533338 524768 523106 512255 507974 498547 517479 531760 516500
11334 516500 526352 531672 528418 545698 537939 523480 531771 510123 484425 503443 508132 477507 463559
11321 463559 501294 451100 426157 431598 401424 427637 496091 483693 482420 489776 477082 509786
11309 509786 523936 521740 498632 488248 498661 526881 535770 513609 527948 525794 501997 467088
11297 467088 468520 504711 526727 529233 486947 463722 497655 524888 495416 476052 486544 463539
11285 463539 480474 507461 521310 523928 506117 508488 490968 475047 451464 454976 473028 459616
11273 459616 449598 463624 496897 500299 501936 515686 535099 511602 497166 490496 479313 500248
11261 500248 480709 512252 530333 486346 480367 486587 478999 476186 483309 458879 469993 509757
11249 509757 518054 507617 517927 474203 484639 506757 487620 475701 493043 487063 488596 470641
11237 470641 418274 403132 428426 452992 461698 435766 397686 443067 497561 488229 455969 449040
11225 449040 408247 393205 422633 423297 447338 464964 522127 481931 444822 452455 462456 500133
11213 500133 494654 459848 431218 456788 427017 379910 392154 426280 393897 389822 437872 450466
11201 450466 425717 417272 390992 417167 398431 390377 397103 385727 380669 336113 340646 342586 369454
11188 369454 356713 341982 347333 397964 390001 352116 326957 329157 356474 404905 444045 416707
11176 416707 368254 343240 376347 390211 338516 348247 401851 450082 433035 432504 440806 428136
11164 428136 399822 404622 376325 378341 345371 356306 374355 354800 365651 409551 409768 427434
11152 427434 425570 403094 444996 427211 394586 366234 331021 348160 358657 387039 401550 383405
11140 383405 382928 398003 388572 333480 334901 349579 341797 327567 288482 282248 292795 306632 315604
11127 315604 353843 410185 428149 427114 408525 361450 356188 328536 311795 303061 306616 297778
11115 297778 355911 405608 432538 465049 446267 389462 384542 379609 369900 364273 373821 371500 387799
11102 387799 383598 408400 418355 405874 428241 398300 360014 361829 369308 363085 338630 315246
11090 315246 337209 324303 339411 332065 337653 321250 267239 257761 306564 316824 323353 319919
11078 319919 308069 313751 309059 308909 349747 382164 381770 367372 348608 346515 374144 350087 335917
11065 335917 303461 266486 300938 347660 365011 360518 340272 290140 267442 270005 316995 326661
11053 326661 311725 308488 331635 319124 305246 297492 275314 245101 248328 282015 285385 291052
11041 291052 295980 333656 367819 355680 339953 344632 353440 356855 363540 371466 406080 445220 457575
11028 457575 432161 426699 411280 433201 493188 499116 481641 455354 405645 419359 441494 469303
11016 469303 452214 461284 498661 506921 511794 508516 507242 525256 529047 520862 498870 481159 509677
11003 509677 515769 516115 513261 531035 490370 469024 461242 411098 381286 367649 378519 382259 340034
10990 340034 342816 340609 362232 391333 362300 340883 313034 285879 238253 261024 311149 324687
10978 324687 322913 306765 292390 267376 268851 241856 238790 236993 253669 268859 188759 167589
10966 167589 226167 242221 198579 205754 249833 266201 296870 298225 266592 280889 308857 271230
10954 271230 228338 245003 235474 241567 252064 223043 202585 197785 189046 158106 152576 154042 188335
10941 188335 163261 166115 207725 226119 215185 214579 219922 193125 150678 181851 209963 220524
10929 220524 223888 212755 198592 194536 199145 210345 174947 151623 161482 183863 186403 153033
10917 153033 133418 132563 159642 184034 215231 232517 175536 139329 140705 164213 180991 167971
10905 167971 155640 173495 173086 190023 168210 125147 129274 153430 163214 153453 158382 199552 225776
10892 225776 257497 229943 241783 234000 238131 190463 186312 228457 221313 199889 198029 200930 168678
10879 168678 148266 143337 146419 179624 186487 168109 123440 96142 112978 76030 74656 82412
10867 82412 86422 98853 75102 57310 41319 81609 94128 104113 146508 115051 105495 127158
10855 127158 150553 135027 108684 87211 61453 73853 96729 82443 43315 23096 63128
10844 63128 140290 120814 105797 65734 91396 139558 146629 114684 119057 115032 110541 98934
10832 98934 105069 121491 52113 53625 90013 107025 124320 128303 86114 37944 30704 59623
10820 59623 58335 70195 101822 93971 85087 94695 78844 102331 139193 135946 149878 137371 129943
10807 129943 113750 94610 39197 10696 -6401 -3835 32312 -30572 -38678 -15920 15442 -13051
10795 -13051 5166 63754 65391 28441 16200 7550 -15811 -17184 294 -17523 -35429 -42273
10783 -42273 -45646 -42400 -18533 6453 17864 -23127 -69337 -44701 -27215 -19920 -31765 -56030
10771 -56030 -64177 -37152 -27883 -56975 -82342 -92970 -107702 -109834 -76020 -104240 -135928 -103803
10759 -103803 -112726 -133515 -120698 -132533 -193205 -221007 -179513 -144304 -95311 -98643 -100613 -56144
10747 -56144 -58340 -75931 -97690 -137405 -89583 -46549 -56798 -99412 -119120 -132269 -134484 -128223
10735 -128223 -126038 -87539 -66189 -74358 -120934 -147426 -153159 -126805 -127325 -105506 -96895 -93054 -88965
10722 -88965 -73349 -69594 -97679 -114047 -150889 -172708 -174595 -181116 -207801 -181687 -154849 -149034
10710 -149034 -162581 -186471 -212506 -200727 -163940 -114257 -111363 -162856 -163793 -164695 -163629 -171192 -207160
10697 -207160 -205245 -203813 -262734 -317157 -252176 -269436 -306817 -305646 -351265 -401574 -417477 -388700
10685 -388700 -401376 -391456 -370233 -377437 -406110 -387170 -387161 -371060 -389671 -424460 -444057 -417076 -416588
10672 -416588 -436236 -478817 -484459 -474284 -491828 -492278 -523079 -585972 -593158 -613411 -629310 -627900
10660 -627900 -634151 -635783 -621326 -650689 -696982 -697816 -729994 -711836 -672895 -654520 -638893 -621273
10648 -621273 -646779 -708896 -742857 -757008 -752215 -735499 -735120 -746298 -756164 -780998 -799576 -784400
10636 -784400 -771279 -813428 -868315 -902886 -888276 -858260 -847984 -867287 -901307 -874010 -807311
10625 -807311 -752197 -697276 -669479 -618278 -576334 -487887 -356118 -240300 -77818 107790 403263
10614 403263 845912 1525408 2450775 3649746 5257961 7330050 9803148 12323472 14297416
10605 14297416 15325381 15447838 15076615 14726906 14693925 15355162 16938173 19665464 23660638
10596 23660638 28676067 33659111 36995919 37837828 36623085 34288496 31921456 30498339
10588 30498339 30484818 32070868 35423656 40563182 46863716 52645184 55645362 54881178
10580 54881178 51168454 45993875 40951608 37087039 34808833 34185188 35148552 37448604
10572 37448604 40515641 43117548 43650970 41649737 37913741 33409228 29183595 25885691
10564 25885691 23698126 22522160 22149328 22405565 22897845 23126323 22563733 21064569 18820972
10555 18820972 16345833 13988596 11967689 10319912 9088908 8120069 7336816 6702525
10547 6702525 6180300 5752130 5401362 5077380 4795923 4532487 4286314 4041377 3820282
10538 3820282 3673207 3515407 3381998 3353312 3291720 3097920 2944593 2852924 2732074 2648261
10528 2648261 2562401 2496047 2407256 2367802 2366477 2312980 2244150 2179728 2137277 2136114 2083020 2014033
10516 2014033 1951765 1920697 1886066 1860906 1853114 1808588 1761244 1736855 1738974 1726366 1670209 1676091
10504 1676091 1679149 1646424 1623606 1574672 1538449 1532389 1498508 1451319 1440172 1456429 1469995 1435158
10492 1435158 1385878 1367668 1359169 1356230 1348910 1320753 1322609 1297816 1267184 1283018 1241852 1184308
10480 1184308 1204507 1211977 1233367 1179674 1126609 1086865 1107591 1160539 1152488 1142427 1105800 1095649
10468 1095649 1099408 1075415 1041398 1012320 1023703 1048224 1087272 1094526 1086393 1035764 990543 969486
10456 969486 925618 919378 930937 932201 934604 886886 882417 894978 891097 873736 869438 817219 811237
10443 811237 827312 800365 811733 846072 860511 861620 872986 899069 908714 910404 894419 884279
10431 884279 865523 842671 804030 816532 834661 834841 843005 845832 829574 838356 783706 792713 809495
10418 809495 782622 753561 757214 773281 779560 785424 757131 765435 766735 738599 782571 800105
10406 800105 813894 779421 720585 696656 714939 726897 713872 711980 738249 762515 796864 757676
10394 757676 712566 742249 744157 735473 676506 672778 736322 710077 651586 652655 663956 651679
10382 651679 665434 634486 618287 610947 620373 623317 628924 635554 659186 618175 620292 680542 698394
10369 698394 655351 645367 596327 579858 594465 650937 680272 666888 676456 646762 621757 645997
10357 645997 617715 571880 567535 625144 647892 624706 640789 636799 650637 667106 658017 662935
10345 662935 649398 627443 601470 586561 588631 603988 601018 609071 582012 576801 528866 490861
10333 490861 435536 468487 538802 536452 491345 521953 514874 520928 510944 498533 499797 505307 505591
10320 505591 527216 535913 592502 569577 513608 451631 483313 470744 461884 488482 483093 491724
10308 491724 477664 451503 481706 518718 523590 499103 487937 511471 531961 519811 493332 537032
10296 537032 546637 546134 547990 526911 545852 564269 547682 559253 540612 542833 570133 577263 539858
10283 539858 495178 507001 522374 571888 553254 501276 513602 515431 487610 499525 512867 525744
10271 525744 545925 536874 505455 490797 516031 529798 481543 429244 452399 478567 486094 476315
10259 476315 452971 442242 469905 494741 452583 459922 445701 442461 467952 441870 429717 419976
10247 419976 404043 422254 447841 448738 460815 454165 425930 433199 450350 450945 421595 402918 392338
10234 392338 396222 378644 385507 404011 427137 424745 442547 444033 441167 454415 510215 509831 503996
10221 503996 493560 510794 519003 499668 449677 422905 444564 428629 377491 382945 384030 380460
10209 380460 390105 387857 331227 367270 385229 363045 391861 432064 450089 424792 417469 366756
10197 366756 345418 347591 349727 366662 376565 368551 377913 369774 373940 365433 355921 362851 384210
10184 384210 436687 471062 445137 419973 433832 427358 403819 389705 434871 421512 374098 382252
10172 382252 402373 445998 463525 458918 426995 435447 440416 426349 470214 494794 470550 495766
10160 495766 552175 601524 635272 624052 646877 643696 633255 624359 609005 549126 562009 585826
10148 585826 600572 607529 648223 706565 711375 659629 619542 610350 615101 609515 614115 627485 600250
10135 600250 597349 624262 608758 574612 549068 501156 452171 446622 469018 481689 513167 521729
10123 521729 525272 529978 538832 510393 491141 484308 444089 439300 431769 428998 459927 420358 378068
10110 378068 392911 396141 410588 408270 427358 423121 392787 387499 386853 384759 403870 399078 365142
10097 365142 374442 306512 318112 354250 363948 345704 333948 390232 426445 412107 409360 433795
10085 433795 400783 358321 326297 327013 300226 305517 368252 393531 384921 353971 332530 342962
10073 342962 353577 364894 397288 442601 457594 432533 392820 390380 413073 441482 379637 352423
10061 352423 369214 385691 361362 287091 305453 321689 315560 342913 343863 346986 362703 348588
10049 348588 340658 353546 316111 318553 347096 370590 372229 324606 306726 270965 307454 339944
10037 339944 342014 336836 280406 296926 332797 358330 361770 374752 387953 425990 411194 436292
10025 436292 450042 430630 447688 448869 415320 361168 374375 383763 340862 299585 313323 333627
10013 333627 337210 356867 341280 285060 296298 309577 286066 291011 277963 303915 303628 327590
10001 327590 363978 367215 345732 318703 285221 261433 240268 258985 286268 304693 309081 310746
9989 310746 287130 285526 297489 264743 267883 286009 290906 262450 247566 255350 306493 361165
9977 361165 353249 352922 349487 327642 302064 297005 288106 302382 334227 348661 321006 322591 326770
9964 326770 334451 349602 327918 286363 283832 307300 278843 271454 281047 293217 297032 261146 269172
9951 269172 275689 260582 249444 255433 249356 229313 199149 194285 186173 174538 209384 262118 238774
9938 238774 253269 243951 255920 272889 291121 283646 318092 302649 281037 278002 323448 336719
9926 336719 295068 275147 262234 274493 298718 282136 250624 206451 207621 201801 248479 261752
9914 261752 269113 293844 319441 275305 216319 241583 288443 306305 270523 268796 263282 312465
9902 312465 309870 259710 238794 259578 233186 259271 248982 254652 288949 304637 269912 225244
9890 225244 235877 271689 225876 155088 190581 213895 230331 192167 194116 209318 180739 148257
9878 148257 205224 227285 216844 218189 215967 178585 155748 167153 183764 188232 152582 99096
9866 99096 117085 194198 239499 243470 272762 297205 259845 219904 265628 278371 301826 296881
9854 296881 301674 273030 243432 244117 255193 245049 261094 259634 242989 234837 260670 233902 219976
9841 219976 260007 252292 237634 248280 263056 257795 289766 282396 278672 266659 223215 200138
9829 200138 211652 193260 192246 225849 232500 269533 276479 297314 303486 251523 203681 193150
9817 193150 219229 234648 230918 250325 282017 262200 273780 312724 303502 255347 214117 208070
9805 208070 279934 307358 241323 183735 177715 146708 121012 107154 124107 111692 112991 157056
9793 157056 183146 208430 225576 244584 220461 202011 202625 238720 225131 219878 241151 231313
9781 231313 222150 230747 207654 188416 202090 235440 256097 241018 248428 289187 266059 274892
9769 274892 293011 260734 242330 248571 198534 177850 227698 232402 227749 227027 237581 260170 255395
9756 255395 258045 269411 286077 268931 246650 231048 225147 235723 237598 253296 265271 261536
9744 261536 235353 217030 214867 202588 175932 205852 231252 213726 230419 222211 180744 165804
9732 165804 205344 259843 244642 216066 195903 176604 160535 158924 166151 186555 214201 178116
9720 178116 148034 171511 201538 191217 234762 263678 287443 273878 268001 217203 170602 177180
9708 177180 189457 204262 180203 152306 156102 161713 228195 270226 305517 335017 292185 253973
9696 253973 247980 250797 201150 185504 198808 211412 219254 184595 143292 192689 194279 148314
9684 148314 192266 235930 272529 264986 234513 198074 195619 201222 219381 205942 186702 199847
9672 199847 183231 171221 162600 164432 143516 149375 156907 209506 247980 246380 218557 206219 227125
9659 227125 203855 193640 209369 218545 220015 255641 266958 258966 241692 185466 192520 195534 211027
9646 211027 256705 287377 320381 316490 313477 279088 273482 243742 203596 188474 160847 143230
9634 143230 167336 216632 249340 233723 236314 234773 172082 160069 188188 188689 172206 159661
9622 159661 215592 252240 206967 165199 135172 143771 200979 238946 238401 230934 236173 176542 197666
9609 197666 210878 160766 149755 133830 178714 239608 244620 187035 169076 146402 120494 132551
9597 132551 125091 129683 177215 217568 250351 236538 180783 131303 141800 133197 134006 128651 152322
9584 152322 158091 144988 128070 152058 210077 244182 208572 198542 186517 186944 221910 237915
9572 237915 201485 188655 214436 231509 179418 149345 153052 151655 148407 180609 188163 181076 154222
9559 154222 142058 151498 149455 127289 111543 155779 186944 214166 186757 129856 115685 147603
9547 147603 167857 165057 136584 92244 110974 123876 132402 129778 173867 236937 221761 162620
9535 162620 141642 142993 169108 147893 148704 148502 171490 149744 123960 130802 126631 122591 130255
9522 130255 144807 136035 111327 104570 93416 106241 115454 116357 150608 177170 156144 141713 123243
9509 123243 93581 99207 106360 99163 114438 111681 134905 158189 134682 127953 107472 107098 122322
9496 122322 156255 153930 156158 119540 99981 115657 134889 129577 166659 189619 165258 131528
9484 131528 104245 119047 125209 135693 132254 130641 126822 113790 126254 110351 126461 125742 90034
9471 90034 87444 98448 157646 207765 167877 165966 230758 251322 242203 218112 197544 173263
9459 173263 188218 185566 165526 186436 198095 185224 214496 189090 163939 160382 147568 133468
9447 133468 134693 160866 188832 135052 80931 114878 116847 119222 99782 80424 118651 146318
9435 146318 138115 114067 78996 85438 71935 44140 90127 129023 97640 72143 104973 89234
9423 89234 61974 60632 94943 119095 126629 110246 142063 145110 142722 139364 157177 128659 106833
9410 106833 131501 130295 121422 128204 161661 169663 178722 176142 129745 128744 105102 108542 125458
9397 125458 149736 149337 106114 107343 133289 103547 94616 124128 147295 146312 133918 102069 106174
9384 106174 124786 118212 113072 114535 121487 140999 116428 141048 151326 151190 109800 92947 79683
9371 79683 115480 153696 173848 155395 165860 189387 172523 155746 165834 178495 146198 122386
9359 122386 128238 91763 94977 69734 59623 98692 124618 111539 95677 121564 76476 107570
9347 107570 118569 70523 73631 128469 188390 202610 170038 135293 146800 136347 127509 110688
9335 110688 96546 101121 115829 110928 94068 52514 45153 68194 101181 72662 65617 105939
9323 105939 105184 105602 85978 68019 51800 73741 124683 137550 135713 156822 151806 107147 100773
9310 100773 84923 38056 93173 168068 137227 87809 83354 92353 91424 101595 136557 132777 72571
9297 72571 51149 102283 133221 143903 127781 144659 121336 146380 167599 111058 57737 66043
9285 66043 108879 136237 112795 85475 138057 168422 182093 205195 194253 157335 109025 115090
9273 115090 181950 202962 187862 165363 145613 159064 122598 138703 156781 172514 174034 201751
9261 201751 174254 131015 96302 81997 107663 175701 181998 151960 129173 117265 121544 114331
9249 114331 82520 71528 103374 131023 115398 116220 103954 56487 58844 97213 89398 84943 123530
9236 123530 142393 174794 212835 193308 163407 161397 145352 121451 93982 55169 25548 66409
9224 66409 91080 105884 134603 148306 99477 67538 73837 88538 83895 98754 84852 101313
9212 101313 111258 159895 216672 234826 234779 163335 122391 161250 151225 152260 177390 200565 185683
9199 185683 149546 92458 -10548 26188 104665 120102 94402 82918 84372 111734 145004 128404
9187 128404 118516 100570 110458 129196 127741 155111 179419 141155 100314 57843 23606 53951
9175 53951 56780 77131 93546 152750 226639 197785 132352 88818 121460 160610 116944 133747
9163 133747 145402 122900 104433 62293 72545 66549 84304 129239 149090 147667 155916 84320
9151 84320 41234 42824 92783 116091 128969 101995 41669 19526 24751 67424 60801 97325
9139 97325 115174 111159 146486 161798 112186 92894 133057 168847 135270 140139 149915 185781
9127 185781 184447 179220 147297 74566 88164 130658 111190 102855 69474 115397 145107 140468
9115 140468 128815 84032 45735 78082 115538 102741 107216 100980 68504 65277 109394 135354
9103 135354 87493 61417 104201 104314 157285 131480 114511 81170 71091 84670 119143 139366
9091 139366 109885 92973 102758 103703 117030 91102 120799 163995 130204 98980 106916 92257
9079 92257 104563 77502 40167 34417 42805 88089 96457 116329 120860 86775 61804 79892 125796
9066 125796 115876 129378 110689 86064 100289 135091 148642 181012 168466 154977 77007 65622
9054 65622 77295 78647 102936 126431 87827 90346 108918 74602 53353 78217 67543 70366
9042 70366 82083 78969 101806 42090 39689 91160 70198 45534 41029 37557 19249 23704 26320
9029 26320 36273 66127 71673 93635 101416 92429 64248 18809 46872 104032 57085 17892 74975
9016 74975 120072 120911 89204 56328 50229 45578 83649 76871 134975 146105 144449 133760 137933
9003 137933 172352 184352 177041 164612 139445 113108 122703 135542 133443 128958 108686 119536
8991 119536 102151 85044 80453 121832 161390 138817 137300 91664 84417 92338 114912 88712
8979 88712 54602 103500 103910 78951 95263 85435 124429 145208 124904 75684 39422 43690 75758
8966 75758 71219 62540 86518 112262 95874 33200 18326 36656 75854 108727 77719 93417
8954 93417 77126 92923 129967 185482 165281 155526 174770 134998 109113 91037 114923 121854
8942 121854 117420 120067 114218 99567 98795 96751 78932 93753 134059 153449 153905 138686 110192
8929 110192 89800 92426 79246 65667 64863 94861 99252 100321 103154 98097 90953 80109 59099
8916 59099 113476 165155 152722 117491 58038 65327 104254 105756 126840 106995 94370 105600
8904 105600 115536 87517 58936 53954 48550 42409 45581 52921 57988 59558 15849 21851 49031
8891 49031 46474 49153 51748 111683 137456 175736 204262 159162 96320 102469 158760 175513 132590
8878 132590 121316 70955 38352 43247 55884 65682 62722 111609 171934 146098 109914 129013
8866 129013 134245 106712 127303 164555 182818 161785 142721 168137 129503 89189 60884 61850
8854 61850 63723 53683 55016 74943 58907 75043 115257 86851 50549 29209 58456 78028
8842 78028 74535 36533 37727 62669 89747 146270 141381 138261 78318 78010 84737 110578 125550
8829 125550 121976 109400 133693 136917 135756 75969 45515 39721 71966 77928 61370 60533 106759
8816 106759 106285 111733 113134 102524 92742 71123 112873 130491 85224 74123 83478 115187 109680
8803 109680 69181 79222 110924 130614 117663 92736 102051 126384 142836 114977 93871 82800
8791 82800 47067 99170 111366 72108 86771 91733 88707 101861 112398 159443 163736 158029 190949
8778 190949 162085 137880 148593 120432 121947 134670 153303 150159 130982 136328 134962 119613
8766 119613 115443 131087 143092 167840 157659 126461 69900 75753 123067 175453 181608 123897
8754 123897 93538 128782 126700 98933 128280 147111 135682 145402 146315 122912 166742 189984
8742 189984 166827 126716 79877 46982 62466 84844 101913 88420 68300 55883 111814 156017
8730 156017 165727 103848 49717 74166 148280 142901 116144 118810 102758 88014 109446 118396
8718 118396 88218 87093 148763 207218 164988 105710 112689 170869 151863 71291 73426 106183
8706 106183 111243 92663 81743 61690 75691 55325 10660 31554 57731 42473 39280 74748
8694 74748 87828 84734 86460 84460 112529 136629 190865 179982 147288 123104 108858 84419
8682 84419 108038 131168 88254 108580 87558 79997 57411 53481 64812 102142 137926 125802
8670 125802 116638 128764 114981 149007 144983 100571 32008 59270 88606 61277 97903 154371
8658 154371 129323 108707 132111 144486 159485 199652 210655 185908 195303 172906 142797 161159
8646 161159 156288 140141 159611 155139 180571 201520 144168 132118 165324 139334 109642 124884
8634 124884 115038 65073 54668 62361 76769 64401 76999 113361 79940 68424 44301 42423
8622 42423 63947 104323 109673 92175 124838 129139 76094 46639 111671 137519 161502 171119
8610 171119 161414 120934 116044 150989 175305 147907 129957 162174 173519 175674 115803 100152
8598 100152 146459 153296 148404 164995 146003 165635 191063 181629 195790 203125 221727 215019 243404
8585 243404 220456 199493 248765 249021 177332 158070 197699 284333 345305 393614 444142 506976
8573 506976 553452 570344 580446 571934 619390 698147 784318 837679 884372 956988 1043108 1115312
8561 1115312 1178877 1191062 1187150 1158346 1077076 980572 872626 802570 736451 664742 607376
8550 607376 519092 431895 430799 395273 359336 320960 326443 310390 287038 260316 244162 230657
8538 230657 198182 214758 204260 236256 244694 256104 287222 270958 235696 248334 277676 276806
8526 276806 223850 148767 115708 125974 167454 168490 195570 204113 185400 174426 175405 153339
8514 153339 144678 133881 119704 103319 67651 79835 130310 131511 143686 152945 149604 174188
8502 174188 216239 254245 275062 278019 241928 189868 169797 137948 107913 94418 120238 136399
8490 136399 120416 120539 102088 72649 94015 160552 184249 180289 169647 142668 113689 105908
8478 105908 130443 105133 107296 102357 112427 95281 101199 84486 104121 146985 125372 128637
8466 128637 125140 115067 85629 75334 84336 77877 75654 106713 95499 88510 62769 18966 53247
8453 53247 71602 74943 116615 147525 112397 94552 81822 127002 169812 189907 168614 142059
8441 142059 165619 157349 154820 151755 110707 69590 88006 129631 143446 118646 74540 117685
8429 117685 100770 64298 84624 103622 77252 43408 54560 66019 87244 61297 61431 73838
8417 73838 75217 118065 128254 121183 98279 108598 74774 34461 22250 38514 40113 65006
8405 65006 54159 72412 101956 102494 82268 39567 16489 522 12029 40996 62553 41781
8393 41781 46020 48178 54418 64129 33712 16202 -7673 48408 125419 129692 134758 139994 97114
8380 97114 103946 94612 52968 66666 46089 43819 23754 12802 72542 87687 67497 59939 78663
8367 78663 88489 102488 86665 50112 70886 60455 42219 65156 70436 75654 106072 106376 61947
8354 61947 49492 57056 62911 73055 102160 97091 97195 63945 67732 107219 113923 105682 125655
8341 125655 134227 79097 73433 52522 47440 80044 85075 92525 51803 31292 9277 22498 50233
8328 50233 66671 81843 82601 87306 71785 15695 28909 32181 34706 41402 5038 -15607 12796
8315 12796 17684 47513 27848 9474 17568 24256 57691 105404 137878 157924 118570 96097
8303 96097 65977 31677 5757 -2007 28488 52672 73506 83877 68871 73865 87228 70482
8291 70482 33728 12933 46926 65301 65944 42420 46690 22027 17961 7428 7607 35478 24631
8278 24631 46485 75433 98162 118593 122501 94552 97184 87074 54693 21656 18435 55082
8266 55082 89744 101377 40895 46939 25050 25004 42228 40952 67636 114780 149558 135718 144251
8253 144251 116661 92810 93527 89324 65311 80697 91139 90032 76766 70689 69618 82233 107189
8240 107189 88052 68734 90423 93849 43339 29431 105953 105042 95651 88196 115075 155238 97063
8227 97063 34777 53337 66107 65372 89603 132142 132011 141892 156005 146068 146873 133058 117157
8214 117157 78946 76771 111147 101346 97437 76015 54994 82413 107200 107914 82221 45151 44402
8201 44402 49264 79045 79023 66833 93792 138908 130384 121260 166180 177741 119155 74699 43047
8188 43047 36769 38155 38919 28744 31442 52697 56274 54880 82370 77882 83209 71594 31594 16028
8174 16028 46202 111697 116972 110887 134087 142279 141125 108025 74647 73167 80784 78393 89287
8161 89287 51268 61393 60187 28489 27611 29959 47780 75101 88260 23992 6036 45081 38314
8148 38314 64634 82202 69956 17020 8001 18266 2669 -21620 21553 36651 25548 7636
8136 7636 34673 68046 73646 26892 41601 83950 81665 68169 71510 22515 -4458 23560 39264
8123 39264 42372 23885 28700 62609 87206 89203 80954 46162 26375 28145 24984 44467 51694
8110 51694 102645 57742 48616 67636 69302 36676 9821 18230 36991 46405 15050 39954 50749
8097 50749 8149 -38181 -54610 -35916 -30187 -9256 6977 1511 -3259 31106 27044 30246 91850
8084 91850 109275 98812 90869 90518 81994 68509 51146 53427 40346 38529 13392 2474 7381
8071 7381 61102 91449 97679 36178 6980 14604 7667 8740 -7254 3805 1527 50540 61615
8058 61615 -4869 -1345 24631 82130 88442 97200 98012 98982 89866 85997 100677 83548 44189 41925
8044 41925 45589 60771 117869 127262 84319 46270 20710 10959 5704 24008 70703 67519 87116
8031 87116 75206 70624 85235 72784 71216 53202 7647 15787 53928 41700 21571 8831
8019 8831 -32690 5382 51628 51427 1294 -9156 12815 36481 79232 93940 88092 97117 100177
8006 100177 102831 115788 105743 118076 109397 92615 108675 135904 168003 147897 133319 150318
7994 150318 162415 157186 130694 78896 68152 93602 112696 118453 137903 168845 191640 187628
7982 187628 170612 133853 105746 134996 134150 149645 161068 105589 101479 117999 114835 95308
7970 95308 67733 73589 92620 107718 141529 168418 195843 238605 276986 269163 211200 171521
7958 171521 125565 90885 116589 151704 153410 175121 219228 223789 207378 219370 216577 204005
7946 204005 178818 145618 134603 116523 55746 6487 26778 69550 103600 114089 149367 204135
7934 204135 219116 231939 214309 167783 136984 130358 157981 165385 140169 118804 120228 134264
7922 134264 118260 108695 122012 127884 116066 165629 199244 203776 138762 138728 140363 109085 88737
7909 88737 77251 128351 166024 154807 162334 158257 157991 157991 196936 174469 139286 136177 173029 140999
7895 140999 104890 107185 130241 179086 174953 139739 160789 189503 210043 182713 128975 105390
7883 105390 110157 121844 153035 180841 202193 194418 176081 136892 84920 64230 115601 129140
7871 129140 123482 138829 120369 150368 131196 133218 111851 95250 84395 101760 73422 74464
7859 74464 117644 154113 116436 73065 69753 93933 93916 87812 96830 135501 114144 43506 -17144
7846 -17144 16912 75745 70092 61473 26476 8820 9902 34449 39469 -1678 -18341 20310 69818
7833 69818 108866 122243 129178 85230 55224 117942 139954 119668 58446 50192 58263 28311
7821 28311 31015 48696 67773 91729 120950 151661 128120 85010 46521 28153 64186 116200
7809 116200 121692 80009 82713 112139 94401 105802 116273 51749 30863 43380 35227 36977
7797 36977 82342 98805 64287 38247 18293 -18827 -22439 -39953 -48501 4786 18073 39887
7785 39887 32846 22637 45646 29500 17683 3853 1139 1769 35091 72518 79692 80307 80539 108405
7771 108405 147126 135097 98175 94701 75346 93562 116681 84849 91128 95334 83691 123653
7759 123653 135045 124448 107584 64489 66601 95248 93667 82710 70391 113604 114201 64951
7747 64951 7926 161 12169 3377 -27795 -8074 55676 55642 4110 3720 63550 67410 80024
7734 80024 67547 13530 8865 8730 37910 49974 55768 29629 35165 54551 39480 28932 77942
7721 77942 73720 28500 2111 53364 69252 19340 -5862 -10088 -20190 8827 25344 41457
7709 41457 32368 18508 18021 8115 67217 40842 22668 25033 38335 39340 25115 66941 109237
7696 109237 129791 90500 70005 87936 65561 31554 15182 38197 51034 37425 20361 20728
7684 20728 21549 51943 55362 60727 61158 71131 75728 78133 83397 31545 32350 48786 17580 43425
7670 43425 99219 132450 90332 69417 100828 134432 144965 122270 79785 73600 72509 14840
7658 14840 -13822 7532 17792 -704 -27734 42 30341 66068 81183 62278 21924 45002
7646 45002 85630 85643 42382 3715 10011 30599 36079 62502 99739 79473 -7109 -1621 -4224
7633 -4224 37179 32422 -6383 2322 49249 4967 -35035 -8725 5354 -4521 -5154 10910 51920
7620 51920 48115 52388 22147 -19900 -39256 -56479 -42051 -17327 873 -3897 -747 19833 18700
7607 18700 12073 25595 50572 65517 46531 32971 4830 10659 20652 -5428 -62479 -7189
7595 -7189 13694 -22845 -23871 -27780 -7364 -28051 -52428 -22635 -3070 -12855 -34403 -10503 56461
7582 56461 86739 61287 8488 -5558 23858 63588 53950 39270 46001 37110 9722 43621
7570 43621 22251 27394 16181 -3013 -16557 14505 60434 61627 43621 34459 25307 24186 846
7557 846 757 15458 12158 29841 12491 72807 45845 -24403 -21264 -5123 24767 40550 6063
7544 6063 -38915 -3395 28655 42406 87390 79626 39341 -20047 -23692 -17713 1345 -9128 4849
7531 4849 30238 28918 36278 59056 37308 289 -15385 -10810 -24324 -36617 3926 29059 33059
7518 33059 28414 -16779 1316 28926 30105 23612 -808 -30053 -18008 -7437 -19737 -26541 -28183
7505 -28183 -17481 11504 -15540 5958 4929 2056 -15515 -31107 -12509 33912 46645 1845
7493 1845 -39248 -69580 -71739 -39353 -5789 18903 -39715 -94157 -85510 -76833 -74544 -83996 -28325
7480 -28325 24190 32448 46949 56592 125785 117873 75076 26494 -10359 -46032 -34510 9369
7468 9369 28822 42171 37553 80525 106462 69507 39144 -16634 -52961 -21098 14498 20281
7456 20281 17709 26985 74135 119934 117354 72965 82373 83965 81533 82030 61794 41912 5056
7443 5056 17739 14151 -50222 -72425 -47702 -37749 -8828 10873 37897 28781 38265 322 -68607
7430 -68607 -47609 -12179 32639 35309 -940 -12148 -29714 -47202 583 32807 -1658 5936
7418 5936 8111 44551 20864 -47360 -53078 11811 24692 -9944 13713 78 -35428 -3920
7406 -3920 34452 24814 -7927 -39735 -85693 -93783 -55174 -27056 -8498 21520 51532 53507 58757
7393 58757 78534 83618 71224 42660 11738 8233 25829 6426 -16287 -10210 18286 18333 14312
7380 14312 40462 14061 -4307 32913 48253 30543 52841 53911 21967 15017 8874 -14991
7368 -14991 -36673 -21368 -6044 1212 -4562 -13761 -12151 -26579 32124 11926 -49809 -54972 -41156
7355 -41156 -11053 15380 -15879 926 19119 -21547 -50123 -38994 -20276 13157 27035 11394
7343 11394 -5867 -42895 -47921 -65711 -66015 -40072 -37098 -60276 -47349 -37846 -32676 -22188 -32088
7330 -32088 -46521 -44122 -53866 -42900 -12020 -13709 -9760 -35967 -14026 -25530 -58153 -47196 3661
7317 3661 -91 29660 32571 17205 10574 -30539 -70329 -86006 -97867 -70050 -13800 -5200 28184
7304 28184 36265 5836 7517 6580 -25313 468 16660 30848 41942 58380 8636 -49129 -76581
7291 -76581 -45627 -30703 -26870 -28951 -4801 -39950 -57546 -58841 -78851 -89852 -59744 -29098
7279 -29098 -13974 7459 32747 -6378 -14449 10354 19261 -49225 -52817 -57300 -21408 737 -9346
7266 -9346 -6201 19622 35714 7237 22153 52294 -16765 15761 38962 42130 3529 30349
7254 30349 36102 62098 23528 10754 14007 -20126 -39433 -65285 -56343 -16006 10627 4680 16574
7241 16574 8282 2823 11030 35595 57193 78502 90954 91315 70756 42109 -21770 -22153 26756
7228 26756 71599 68177 31567 36642 40483 32508 8046 -10520 -26047 -23223 -22411 -19676 -33638
7215 -33638 -63674 -25353 5505 -3548 9364 4584 11858 -17447 -26467 -27533 -16386 -6025 20430
7202 20430 -5235 -51301 -118287 -107638 -65391 -69822 -45002 -37667 -47236 -28605 -45981 -37688 -11287
7189 -11287 5221 -28034 -67147 -82937 -84583 -66474 -90195 -79739 -72009 -49655 -58407 -75077
7177 -75077 -38614 -30388 -31858 620 30321 36682 2110 44191 62695 23431 45799 18134
7165 18134 -5743 -19070 12872 50323 41802 43644 21783 -6925 -37643 -35532 -47637 -51416 -13927
7152 -13927 -11946 -45559 -38220 -54579 -30134 -16942 -28396 -47701 -56000 -54397 -27693 -29784 -34970
7139 -34970 -15654 -39506 -55823 -48665 -31567 -8134 -15330 -17734 2159 12532 -38962 -72211
7127 -72211 -83844 -40005 -9239 -4083 892 -18545 -51473 -85264 -79233 -47983 18292 21461 -45228
7114 -45228 -73335 -47335 -21209 10967 12281 21010 7918 -9570 -19642 -32424 -8895 -1259
7102 -1259 -48458 -59590 -48898 -48674 -47327 -74177 -65652 -64698 -85478 -62707 -30699 -11043 10272
7089 10272 34143 34042 39861 20872 -5670 5535 36585 37153 8830 -6345 18110 8435 -34765
7076 -34765 -17470 16634 -26666 -30772 -14592 -36204 -64230 -52146 -39875 -47338 -22285 -9695
7064 -9695 -10010 -7487 -1802 10232 12034 2420 -28144 -65357 -35780 -40295 -81999 -76977 -74933 -56793
7050 -56793 -58739 -57325 -55706 -88037 -79507 -63548 -96090 -90633 -40931 13605 6097 11518 -22210
7037 -22210 -14586 15821 9440 -4948 -4775 -11309 -10561 -26573 -50395 -59007 -21010 -20619 -31335 8097
7023 8097 44234 26099 -14426 -14015 46859 10173 19133 58818 58934 58967 43393 19540 -13830 -24136
7009 -24136 -28646 -11984 -34851 -34556 -35187 -43228 -53097 -25157 -22851 -39095 -68590 -75669 -53413 -30447
6995 -30447 -1483 -9102 -26184 -34952 -31676 -25819 -16607 -7720 -14208 -45404 -55972 -12124 2461
6982 2461 -19919 -60180 -19862 -19225 -19757 -21874 -43979 -51043 11680 31475 11347 48720 70849
6969 70849 63301 38344 23960 43135 27419 20999 -2720 -31508 -32653 -53176 -84990 -84052 -80892
6956 -80892 -59263 -42572 -26195 -19889 -47690 -48999 -19259 15764 4053 -25151 -4262 -6992
6944 -6992 -19505 -34097 -43970 -36863 -23237 -10861 -26013 -5483 -17203 -52589 -80265 -57223
6932 -57223 -63925 -69508 -47072 -8974 -25092 -4337 -7015 -8554 4925 29264 10960 -1429 -20780
6919 -20780 556 20616 20502 3108 -24803 -21373 21514 31294 29721 20330 11197 -35341 -46446
6906 -46446 -46292 -25355 -991 -272 -8759 -25031 -15222 -28920 -64004 -77156 -51258 -14082 6434
6893 6434 -7451 2017 -14735 -33520 7336 15847 -37742 -52547 -28478 -32275 -23228 4109 -6201
6880 -6201 -6442 -22499 -45920 -63343 -63136 -67340 -76144 -65778 -37861 -5821 -13248 4873 3133 33331
6866 33331 30435 13917 17041 12542 43924 22250 -23300 12833 28209 32084 54829 48956 47140
6853 47140 42481 21720 13058 5623 -10351 -28919 -24859 36602 50088 17699 -17444 -53582 -51369
6840 -51369 -48766 -81163 -66213 -29585 410 22067 48286 45241 -11752 -25688 11861 16559
6828 16559 -7711 -34341 -14265 -33675 -60915 -46280 -68406 -76716 -45518 -26895 10890 37003
6816 37003 -12725 -13334 -13386 -34945 7046 20976 24326 -5175 -47205 -65911 -42566 -48077 -68315
6803 -68315 -72094 -76427 -135066 -132368 -87896 -74347 -56658 -25373 -10827 48191 57678 9008 1983
6790 1983 -8842 -29920 -15650 2833 3697 -8279 -1658 -17029 -27318 -23968 -44068 -25299 7500
6777 7500 13803 -24502 -59301 -98683 -56056 -19918 -18972 -13518 -5368 -13553 -6261 -3342 -28131 -8392
6763 -8392 -7111 -58559 -73156 -66921 -80067 -54909 -35469 -43289 -37577 -42627 -14889 -7993 -32147
6750 -32147 -43885 -82742 -107766 -100227 -61556 -36990 -30051 -6186 19452 -866 -16847 -21498
6738 -21498 -26914 -47829 -34113 -25159 -55641 -76848 -23254 8760 -8802 -5167 -1486 -6995 -15414
6725 -15414 4955 29077 -18398 -36024 -42881 -74828 -94024 -87971 -54636 -55512 -75406 -96159 -65979
6712 -65979 -1499 14388 2694 -9381 37713 36037 11226 21544 9830 -14583 -63632 -69741
6700 -69741 -48391 -12953 6108 -32311 -89565 -110386 -85717 -96793 -120241 -137923 -128140 -87702
6688 -87702 -48542 -16213 13917 5286 -7520 -16422 -1333 -27811 -47274 -38229 -35020 -23295 -21564
6675 -21564 -26264 -614 -15489 -60720 -48221 -23152 -49090 -64518 -62445 -31683 -18176 3299
6663 3299 -36005 -71276 -48974 -42217 -19246 22532 32664 5110 7161 -6442 -20741 -17091 -26578
6650 -26578 8777 30505 12717 -42143 -25699 -24282 -3846 -11578 -19869 -9430 -8736 37420 45383
6637 45383 22412 43290 41539 72583 79598 61343 42739 22691 37709 43203 2101 10173 -6688
6624 -6688 -13642 -25266 -18449 -50136 -83950 -56235 -6764 17655 29618 27059 -18153 -40985 -51415
6611 -51415 -91628 -79068 -57535 -28613 -28251 -54642 -76000 -48753 -56503 -43976 -50217 -33112 -52584
6598 -52584 -34673 -61385 -54002 1459 25655 -16551 -25801 -17365 -28762 -21424 -14261 -16928 36040
6585 36040 50801 -16611 -7633 17942 36558 12991 -16671 15351 11921 7799 24819 19874 10202
6572 10202 19297 69503 109288 96786 34592 7794 40344 28032 2231 -62648 -23417 9912
6560 9912 -18956 -34541 -2403 -8745 -31196 -10275 12361 8540 -18117 -933 -3455 -18700 -11533
6547 -11533 7246 4598 37820 27179 45051 -5794 -56926 -35149 -19009 -23117 -64487 -88941
6535 -88941 -58901 -8715 18080 12099 3584 -5282 -19853 2128 -945 -25004 2055 34724 24724
6522 24724 13192 30683 52894 -4408 -38575 -59417 -56827 -67077 -64381 -52403 -70708 -40992
6510 -40992 -42418 -46462 -39402 -34737 -12943 -5365 34098 35413 12574 -4156 521 11090 32378
6497 32378 50382 31722 22535 -523 8825 31906 -1641 -15563 -3668 13228 -27754 -45524
6485 -45524 -43907 -22942 -43960 -23116 27310 24165 -18618 -6361 -13306 5559 3950 -20948 51910
6472 51910 102111 77368 35785 32692 11445 -8258 -12692 18066 14469 14318 -8671 -44767 -45162
6459 -45162 -60162 -42697 -5278 -14496 -22867 -38444 -30639 21327 40866 50464 27791 35062 48615
6446 48615 54114 35474 57039 101069 72117 42141 30428 1046 3934 49743 11702 -14746
6434 -14746 -5836 18853 57893 59397 53091 70924 55060 28284 2432 -68919 -93255 -106260
6422 -106260 -127967 -118898 -88707 -51830 -38918 -27704 -42826 -54654 -34220 -35370 -39148 -12933
6410 -12933 15620 63797 68013 49551 44098 8434 -6487 3823 -30640 -41467 -38573 -8978
6398 -8978 -8047 -19351 7853 -10723 -4028 36999 5055 -8675 -8034 -30258 -22061 4819 -31327
6385 -31327 -63693 -41510 -23948 -16441 62270 71714 39726 22352 -1734 -4968 -26245 -19161 -31792
6372 -31792 -11362 -1640 45227 51269 12510 11966 27407 41540 30162 -17445 2466 -152 -22609
6359 -22609 -11901 -1724 -12408 -15585 -55981 -58636 -60874 -75958 -54866 -40734 -38037 -7905 -12239
6346 -12239 -35037 -42803 -67220 -56347 -40535 -67835 -116266 -153245 -127176 -69663 -58787 -75946
6334 -75946 -86694 -49998 -11444 -7305 3306 -19403 -63229 -18685 315 -31851 -7913 -3549
6322 -3549 -7725 -14572 -42981 -68736 -35891 -3590 -33938 -51120 -28005 -3351 -44893 -46639 52053
6309 52053 6741 -14610 23562 3594 -36341 -38671 -54248 -58042 -92571 -88102 -91539 -75382 -42395
6296 -42395 -28188 -41280 -67862 -75199 -37477 -53552 -81345 -63959 -42260 -47666 -19456 39104
6284 39104 29107 27013 48966 24305 -15063 -55476 -74059 -87787 -53882 -28023 -37254 -47855
6272 -47855 -45926 -41002 -31562 -13598 -15482 -14462 11239 24699 25455 7905 -35762 -28771 -11290
6259 -11290 -34285 -45798 -34137 22253 80337 78184 67048 49587 24845 43906 49769 70118
6247 70118 51815 24847 727 -37689 -58128 -62905 -74257 -89192 -68298 -79895 -31792 -9633
6235 -9633 -14252 14119 37133 30460 11066 9578 -10911 -6934 -340 11412 18686 61940 33937
6222 33937 5647 -22205 -47069 -81481 -100913 -91719 -54767 -11034 -16850 9451 34080 7622
6210 7622 20313 -19325 -56900 -30215 -64561 -91132 -60587 -25201 -37934 -37507 -38306 -51990 -46231
6197 -46231 -6678 -3007 -28437 -25272 -53963 -57554 -73457 -77021 -93565 -57609 -22497 -54455 -69718
6184 -69718 -62223 -72563 -71160 -92369 -122071 -109120 -87045 -62015 -33804 -4652 -14136 -38711
6172 -38711 -97175 -99580 -80849 -70462 -87710 -79867 -52346 -32550 4216 -10144 18908 23501
6160 23501 -15441 -79138 -66867 -36449 -43200 -59550 -57584 -93186 -113772 -79206 -82619 -87052 -75136
6147 -75136 -85053 -103315 -64569 -48090 -3156 30355 12461 -12472 28827 -4092 -24227 -19430
6135 -19430 -16987 -474 -25471 -25238 -11336 -10985 -8508 14652 16779 -10135 -24863 -43422 -39586
6122 -39586 4802 4499 -21056 -53398 -75920 -67563 -58189 -55813 -15453 -12766 -11529 -34831 -88317
6109 -88317 -104947 -51992 5778 35279 14 -11133 22524 879 -13004 -38734 -35798 -28268
6097 -28268 -9782 37541 23684 -28172 -66287 -100502 -72957 -52458 -41656 -37353 -35692 -20922
6085 -20922 -40758 -21088 -29040 -36348 -28445 -15336 -31222 -75018 -94107 -82896 -43627 -29941
6073 -29941 -42564 -25306 -23861 -41591 -42166 -59102 -39376 22747 8991 14564 28828 -4987 26519
6060 26519 65790 64293 46941 34363 59697 30569 2761 -18272 -23275 1017 20549 37008
6048 37008 11722 -77033 -110700 -91906 -64189 -33257 -1898 17937 25405 13330 13758 -1493
6036 -1493 -23069 -47276 -82481 -57939 -27571 -43309 -49405 -10423 -41943 -40192 -17655 -26471 -16414
6023 -16414 13719 29919 56377 57945 41892 25959 31425 -24890 -73863 -55523 -39334 -20180
6011 -20180 10032 15277 25283 25792 29119 51181 69347 51060 32796 -21662 -65698 -69798 -63039
5998 -63039 -45278 -34211 -30243 -45855 -60536 -36807 -22187 -2096 -8406 -57979 -72191 -46303
5986 -46303 -60963 -65300 -59684 -74811 -96773 -98140 -83225 -70659 -101462 -109366 -97583 -90083 -33921
5973 -33921 -63024 -152007 -141306 -103411 -59015 -16125 28216 2320 -32580 -21264 -5049 -559
5961 -559 -48028 -75737 -81544 -83003 -97463 -92405 -47434 -18153 -27583 -30055 -38498 -53917 -55339 -68130
5947 -68130 -62354 -82358 -64955 -40558 -66232 -66436 -75537 -56582 -49936 -94758 -112744 -106025 -99298
5934 -99298 -81196 -66774 -25974 -9635 -3009 -15605 -32265 -43301 -52697 -90489 -146319 -129795
5922 -129795 -87967 -97887 -59202 -38144 -5269 6364 -36052 -36748 -28677 -35955 -36144 -41491 -58162
5909 -58162 -51836 -20205 -23195 24086 3677 -68539 -92728 -103750 -58466 4328 17474 16195
5897 16195 -9136 -28957 -18832 15608 1758 -19709 -26742 -13018 -676 -19895 -83669 -60567
5885 -60567 -16267 -22696 -28555 -25446 -18280 -27090 -32390 2584 1413 30459 763 -37469 17069
5872 17069 58309 30051 -5204 -22974 -10973 16606 -33353 10317 8342 -35313 -51535 -38392
5860 -38392 -33800 -41419 -60639 -80572 -118029 -111133 -79671 -63232 -36446 -12576 -52770 -39799
5848 -39799 4847 -13708 8674 23650 25740 -47951 -58754 -18692 -25094 -13657 -8180 17956
5836 17956 38336 48383 -3284 -55414 -41454 -48054 -76719 -85412 -68237 -64158 -31961 -44931
5824 -44931 -36297 -10496 -965 -35978 -64413 -42956 -9017 -18634 -65903 -71509 -44580 -45786 -26604
5811 -26604 -42904 -72014 -47462 -17559 1209 -2324 7427 9790 4089 -4836 -39298 -47236 -15589
5798 -15589 -26565 -47189 -50861 -55386 -45948 -34432 -73662 -67543 -61069 -61090 -47320 -51020 -30019 -27328
5784 -27328 -79026 -83031 -67817 -51164 -9908 29655 30640 46520 61875 52415 71345 56439 1300
5771 1300 -9575 -2521 34408 29208 -4417 -10126 -13626 -24231 -41086 -19140 2641 8099 22503
5758 22503 7297 -7002 -3267 32265 33077 -6645 -34851 -30660 -22779 -35939 -17001 -20418 -38358
5745 -38358 -61496 -48150 -26595 -17885 -27041 -22025 -28300 -36546 -37407 -39226 -35516 -59579 -78152 -101636
5731 -101636 -77331 -42279 -22156 -41216 -52377 -47911 -47647 -45582 -79389 -66379 7898 42208
5719 42208 36189 31721 23093 19948 -13566 -82568 -84513 -93629 -55730 -23116 -42800 -30392 -25995
5706 -25995 -15379 -1657 -6972 -37818 -31263 -70408 -80404 -71561 -65604 -76397 -98001 -55057 -9257
5693 -9257 -17586 -37749 -23328 -21752 5385 13517 -11448 -20624 16521 19337 13703 -13828 -56050
5680 -56050 -70704 -55672 -68299 -57139 -57344 -29817 -35853 -24645 -8828 -52150 -48248 -3252 -26741
5667 -26741 -34127 -25431 -5960 -12907 -10149 -35495 -23518 -18031 -26860 -76608 -118730 -98503 -63303
5654 -63303 -47558 15133 15605 -5304 -21366 -29849 -29942 -29197 -18943 -28774 1846 -22003 -66428 -83345
5640 -83345 -79064 -55327 -40319 -23154 -10650 -15590 -52281 -53617 -46945 -55044 -55745 -50007 -34587
5627 -34587 -17232 -33849 -36477 -47787 -38818 -25021 -32196 -30598 -30950 -40368 -39786 -9138 -48376 -63585
5613 -63585 -79562 -64139 -32551 4761 28199 33581 -10820 -28224 -37763 34936 42289 -42710
5601 -42710 -38936 -27247 -37970 -48610 -62942 -39493 -10594 -31061 -49870 -33093 -31430 -49442
5589 -49442 -68828 -81523 -86952 -41732 -83019 -80952 -70075 -50993 -55376 -59881 -67906 -43336 -21835
5576 -21835 39664 7131 -38763 -42205 -35938 -34651 -55886 -54629 -86274 -95543 -69534 -45707 -40659
5563 -40659 -11177 -25379 -20929 -52173 -35226 -18956 -18325 -42496 -63805 -48774 -77480 -80050 -49110
5550 -49110 -109116 -170543 -160846 -137912 -95884 -116132 -87314 -53302 -40072 -23742 -3032 -3026 -54700
5537 -54700 -104539 -86158 -66911 -15340 51544 61215 26031 -7736 -20521 -11952 -3499 -20115
5525 -20115 -7306 -49224 -15749 -17198 -55592 -99521 -87575 -137391 -196852 -167575 -119045 -83991
5513 -83991 -31051 -46129 -48544 -19350 -26732 -27432 -59962 -33936 -31950 -46925 -41994 -64207 -40365
5500 -40365 -51244 -29306 -11042 -7257 -35832 -47134 -38659 -8711 -18772 -1530 19704 21499
5488 21499 -32521 -16693 -4095 10744 25403 1693 -19577 27249 20821 -4613 -29755 -18314
5476 -18314 -37616 -52892 -67968 -78518 -43149 -28561 -45601 -58073 -73795 -88303 -128382 -121768
5464 -121768 -69655 -59987 -64447 -55167 -38733 -19253 -47326 -92336 -87968 -86218 -56092 -49169 -18195
5451 -18195 -27167 -81934 -109240 -87044 -66667 -40286 2514 -9959 -15810 -9463 -1492 -36221 -38382
5438 -38382 -11551 -42116 -84130 -89150 -43982 -17583 -34397 -48542 -27676 -38178 -62721 -105741
5426 -105741 -115837 -104436 -91254 -26710 -7581 -61338 -55875 -47668 -30989 3748 13419 9324
5414 9324 1991 11582 25968 21093 -27927 -55107 -40029 -53674 -80522 -28991 -1675 3875 -55585
5401 -55585 -81243 -97636 -99948 -72891 -80128 -114380 -84298 2808 30925 30421 -49247 -93100 -87775
5388 -87775 -88990 -109754 -129764 -140383 -120641 -94654 -81849 -63996 -27575 4375 -19718 -17322
5376 -17322 -14066 -36529 -98328 -124982 -69446 -4208 13046 14000 16987 25422 -10568 13751 -1830
5363 -1830 -7359 -42157 -62331 -54763 -53195 -35350 -48851 -55686 -63250 -101401 -115597 -58292 -46950
5350 -46950 -53049 -73428 -60567 -27900 -37824 -21200 -21228 -30048 -27095 -57803 -100914 -139807 -143894
5337 -143894 -108594 -95631 -58515 -78933 -117311 -147851 -153988 -126226 -73972 -15626 19334 -23378
5325 -23378 -48802 -17571 -14800 -59643 -91396 -78661 -73186 -33423 -17576 -30112 -35322 -6543
5313 -6543 -12774 -8559 10488 12084 12663 -6962 -13521 -42143 -27120 13314 13282 12527 4310 15345
5299 15345 -3952 -43466 -46814 -54806 -53805 -45325 -24093 -39460 -56329 -46444 -89683 -130494 -128443
5286 -128443 -87610 -70218 -57462 -41880 -81821 -113483 -110588 -140044 -105860 -102665 -77440 -80588
5274 -80588 -93855 -60847 -29226 -4493 25601 33350 -18592 -46773 -64632 -49555 -32959 -19127
5262 -19127 -25823 -2370 23994 9948 -32256 -42222 -68241 -70276 -70203 -3228 17395 39671 -3771
5249 -3771 -75469 -63636 -29547 -19493 -10284 13097 3208 -51598 -71445 -34702 -30562 -36218 -50019
5236 -50019 -33511 -13212 9315 17678 -10528 -64188 -110975 -98436 -66708 -30029 -8379 -18026
5224 -18026 -12903 5385 -18926 -47595 -73319 -63966 -42342 -39797 -44771 -57200 -37958 -17665 4509
5211 4509 -39126 -86314 -72071 -51346 -55737 -26293 -15148 -15725 5411 3819 -3648 -1244 -34261
5198 -34261 -78473 -60314 -27731 -12946 -17003 -51831 -82596 -105128 -78862 -40432 -35388 -15744
5186 -15744 -22276 -42563 -40060 -43761 -49895 -101260 -96005 -108545 -97461 -43112 -31937 -53718 -65300
5173 -65300 -99357 -84113 -51004 -35564 -25814 -18992 7339 38451 -15364 -66918 -70036 -35814
5161 -35814 -14716 -36182 -82554 -81313 -97855 -109034 -105117 -67725 -51353 -33389 -21028 -18046
5149 -18046 -51055 -86300 -112925 -129530 -118495 -114613 -107237 -107756 -99377 -97621 -73413 -59576 -42306
5136 -42306 -56547 -52801 14415 47071 -29547 -78722 -57541 -40829 -40773 -61209 -65935 -44082 -26875
5123 -26875 -42462 -80349 -84201 -39473 -31417 -54196 -53281 -55136 -38245 -22698 -24946 -28541 -48911
5110 -48911 -46532 -27540 -20127 -37018 -41967 -22118 -1041 -12895 -25349 -29242 -63587 -110890 -86543
5097 -86543 -27553 -10756 -22849 13304 15700 31306 44239 -13367 -13514 26186 32390 -1763 5229
5084 5229 -493 -14634 -4553 -41760 -50895 -57244 -90150 -137297 -103984 -72009 -30334 27045 31831
5071 31831 31409 19720 13112 15414 2246 -5685 -3246 -19967 -40956 -9795 1160 -10415 -8312
5058 -8312 15255 646 -12674 -27681 -48784 -47953 -58231 -92760 -92317 -107730 -101589 -86968 -59404
5045 -59404 -31882 -26806 -25111 -20178 -25037 -47250 -43377 -34907 -27557 6162 3246 -33874 -59182
5032 -59182 -67119 -48807 17362 -2698 -10636 -5032 -55824 -62392 -69887 -53890 -16440 16673 24457
5019 24457 20658 12849 -36126 -78242 -74189 -92432 -88475 -104618 -103223 -50375 -43945 -22085 -26300
5006 -26300 -28936 -4137 -41532 -33678 1378 16563 -15819 -20731 -16204 -39986 -34749 -39895 -22721
4993 -22721 -40283 -57735 -51375 -71930 -61508 -61522 -54713 -32761 16224 27254 29335 -12548 -64694
4980 -64694 -88158 -113924 -117812 -69072 -49910 -55475 -70935 -73280 -88298 -87272 -58241 -43980 -16215
4967 -16215 -35276 -48258 -36215 -62333 -55810 -14967 -27713 -53644 -33727 -315 -28363 -91146
4955 -91146 -166420 -165324 -127407 -80097 -64908 -66584 -86715 -105689 -88610 -34270 -37650 -40170 -85231
4942 -85231 -94923 -83197 -30569 -21197 -17486 17305 6824 1877 30106 38965 66761 49777 -122
4929 -122 -45357 -66174 -57076 -44212 -50359 -53655 -15621 11879 -18539 4218 34400 24908 4753
4916 4753 7724 -4534 -20063 18740 -3691 -24355 -66843 -71628 -40677 -46284 -44210 -22953 -37129
4903 -37129 -46143 -30698 -40087 -86036 -113816 -106629 -49501 -2019 13859 -14468 -26777 -17400 6046
4890 6046 -55331 -103336 -74894 -7545 19803 -27881 -23812 -28307 -11598 -48160 -68804 -94439
4878 -94439 -88256 -72851 -96843 -78615 -61294 -54888 -67832 -53564 -26549 -31239 11808 1111
4866 1111 -22266 -27245 -35882 -78812 -67207 -23370 -18107 -4276 -7915 -6220 6486 2770 5040
4853 5040 30880 45656 19126 25586 25553 19018 20750 -18728 -3318 -6869 8019 19935 5364
4840 5364 26646 38982 -5393 -41918 -61792 -47085 -48232 -39786 -47866 -26450 17285 16061 -338
4827 -338 -59671 -51069 -19927 -914 17358 24718 13341 14482 25252 20023 -22579 -22974 -48533
4814 -48533 -81477 -80534 -74315 -77078 -81690 -95550 -25638 -14647 -47353 -90984 -104095 -69150 -28298
4801 -28298 -39333 -33024 -28003 -33209 -55938 -65352 -35972 -21780 9194 -1770 8358 17297 10496
4788 10496 -25447 -51587 -36175 -30698 -36685 -57765 -61546 -56721 -23127 14397 34723 4444 -35696
4775 -35696 -41853 -70541 -108043 -108272 -49860 -15619 13459 19285 16186 10138 -27645 -23893 -19728
4762 -19728 -24916 -30572 -14986 2936 13835 32020 8297 -26362 -91500 -79335 -79320 -53659 -40844
4749 -40844 -45364 -46192 -39634 32009 42862 19055 -7541 28021 16519 -39571 -55740 -53041 5277
4736 5277 -9949 -28232 -26617 -3100 -7918 11994 -4460 -27276 -75594 -120411 -106487 -64144
4724 -64144 -21357 18797 -1640 -48785 -73905 -71058 -52797 -74943 -66551 -43338 9315 20833
4712 20833 -8118 -5187 -62462 -48204 15787 16419 4851 10255 19568 -10403 -73006 -69586 -49953
4699 -49953 -40074 -65969 -66271 -39690 -6265 -27547 -33125 -42349 -32417 -44935 -5997 3298 -35189
4686 -35189 -48582 -23980 -2902 6668 10738 -6196 -31839 -36519 -45961 -60691 -37239 -30446 -30596
4673 -30596 -45897 -46454 -73341 -37639 -18421 -16639 -27397 -53179 -56722 -92308 -43551 9855 -12005
4660 -12005 -29459 -11157 -14203 -12446 -13622 -54522 -55764 -54483 -33252 -37083 -63206 -79494 -54770
4647 -54770 -32327 -58320 -61753 -69248 -43793 -25840 -42523 -63243 -23135 -33380 -67539 -67222 -10855
4634 -10855 -6457 -18606 4170 -1307 -37112 -27914 23579 23306 -38777 -26856 -44335 -14982 20296
4621 20296 14029 11447 33253 8805 23497 39242 13268 27287 42991 28885 -12749 -19628
4609 -19628 7349 16577 -7595 -68041 -44480 -13761 -47089 -37912 20154 -2157 -64257 -110406
4597 -110406 -117054 -109740 -77429 -20067 -3345 -7285 -18165 -28647 -18982 3577 21668 2536
4585 2536 -40120 -60994 -71321 -32931 -21338 -4008 -16101 -18433 4776 -8365 -14117 8861
4573 8861 13916 415 3439 -28079 -45893 -17188 37918 44346 2563 9664 -15761 -45632 -74467
4560 -74467 -97862 -94080 -83815 -80332 -50414 -47120 -42136 -65051 -49712 -53041 -70015 -60040 -56384
4547 -56384 -21389 -22254 -27290 -50654 -60707 -87235 -98069 -62940 -46702 -45088 -18222 -14131 13430
4534 13430 15775 1508 -20563 -21096 11479 33495 20273 -30323 -47790 -27778 3478 16505
4522 16505 -35452 -67315 -71695 -70129 -62182 -37830 2648 24939 26599 26979 1036 -59121 -67033
4509 -67033 -67609 -53546 -5910 34695 21530 12198 18560 14787 9423 3292 -39627 -35583 -31639 -19877
4495 -19877 -34969 -9488 2394 -33780 -48547 -23716 -15263 -30550 -18367 -9977 7086 10027
4483 10027 32580 65487 77625 45490 1825 -15000 -16608 -19802 -26821 -36491 -35464 -20048 -35326
4470 -35326 -35343 -17234 -11744 -30293 -20599 -56559 -37443 -30070 -19984 2127 -22417 -5565 4479
4457 4479 -46605 -66728 -49601 -21847 -35060 -13741 -21825 -32113 -17910 -5550 -29808 -26677
4445 -26677 -8332 -12562 6937 61258 68940 15366 -44063 -70596 -61161 -42356 -40410 -5665 -15193
4432 -15193 -10120 -38459 -46637 -13400 -5574 -2718 3039 -25385 -62564 -52857 -31491 -31511 -53766 -74949
4418 -74949 -22152 22271 -9855 -53580 -66031 -67073 -18944 -38492 -59565 -25595 -19516 -20686
4406 -20686 -21719 -29597 -67452 -51694 -20863 -10466 -4545 12688 4530 -728 -3794 -49073 -93457
4393 -93457 -115994 -79624 -54763 -28321 -3931 3138 -25066 -38249 -31584 -20101 -26328 -1553
4381 -1553 -24358 -4778 -24670 -43868 -15480 -13464 -59506 -76185 -111112 -126366 -102977 -48072
4369 -48072 -15115 -6582 -9266 -1858 -20007 -39841 -57469 -61441 -49135 -13550 -52358 -41908 -19975
4356 -19975 -37910 -23453 -26736 -14240 -24704 -48287 -40814 -79862 -47717 -50467 817 16749
4344 16749 -36647 -54887 -49447 -39273 -56577 -49558 -6009 -2880 12564 -20065 -22936 -14066 6529
4331 6529 19038 10082 -16694 -32218 -1652 27812 33870 13579 3854 -3653 -14365 -61586 -50902
4318 -50902 -5231 30265 29051 43520 17468 1987 -15570 -16063 -19005 -28378 14327 16053 32176
4305 32176 27902 -10327 -39557 -13472 18211 -26913 -82875 -58055 -48051 -11011 26867 1752
4293 1752 -44688 153 -6485 -11696 33289 25384 27321 -3000 -31613 -42193 -6790 38803 8595
4280 8595 -20745 -23153 -6429 -31613 -38067 -47547 -73406 -61029 -62532 -75786 -52847 -38548 14815
4267 14815 10320 33642 24624 -18667 -39401 -57762 -90968 -85242 -51030 -29253 -27363 -37584 -16699
4254 -16699 1297 -8751 470 -23954 -10408 -20265 -62722 -80601 -76801 -40281 -18241 11847
4242 11847 5913 -36874 -54307 -54712 -56506 -31313 -34121 -57360 -20151 -23529 -30662 -27265 -52102
4229 -52102 -48843 -33452 -32768 -23953 -32074 -32461 -54993 -76832 -109095 -93486 -76316 -48389 -22582
4216 -22582 25834 60428 26803 23840 28863 480 -2003 -5546 -37573 -88764 -88593 -53408 -91106
4203 -91106 -122608 -110727 -67619 -80643 -48138 -26190 -34970 -24401 -64042 -68742 -51712 -52863
4191 -52863 -54887 -59022 -80316 -73654 -24472 28153 12651 2885 -17041 -18058 -51103 -82393 -76188
4178 -76188 -37723 -28314 -34874 -77158 -111372 -84819 -30834 -1204 20949 30657 81018 54944
4166 54944 -17081 -71904 -63330 -14037 -1237 11454 11307 -324 -44031 -64433 -27656 -31977 -50375
4153 -50375 -73080 -96672 -73834 -16055 -19798 -21601 4281 -8236 29761 41620 32317 44094
4141 44094 18938 10972 -15913 -22269 -60098 -42269 -5403 44113 -7974 -40209 -38840 -17179
4129 -17179 -53664 -45163 -16184 -20552 -24655 9001 54067 33045 50768 51234 27777 24371 28064
4116 28064 -3932 -11723 -2984 12203 9829 37980 37326 8765 38970 39892 31800 6022 -9753
4103 -9753 48792 -2006 -45615 -31766 -64423 -108801 -112234 -81038 -77824 -87595 -34852 -7021 -20735
4090 -20735 -10788 -8677 -7050 -39477 -108 23523 23191 -12585 -9327 12473 -4445 -3976 915 -21721
4076 -21721 -39051 -32229 -25240 -45385 -26802 -16565 3674 -26491 -34657 -73848 -74115 -26672 -3198
4063 -3198 -13317 -59590 -40798 -14505 -12624 -35700 -21117 -3638 6847 -17533 -21130 -1637
4051 -1637 -14132 2647 -34405 -48821 -59845 -37169 20076 58632 74208 60234 50223 41130
4039 41130 25701 36564 26504 28311 7506 -16770 -32289 -15314 -13673 -14246 -27491 3407 35719
4026 35719 23578 -18190 -49545 -34500 -23719 -24676 -7291 -12487 13628 -811 -67008 -64039 -43493
4013 -43493 -9776 -37054 -41802 -57334 -64729 -61695 -50579 -41615 -24012 -9334 -29914 -42018 -42135
4000 -42135 -27956 -11644 -31013 -20311 -5943 22032 28753 2625 -15469 -10893 -23627 -18665
3988 -18665 17948 48109 14640 22597 27298 -13173 -46076 -38345 -30281 2768 14338 23485 22648
3975 22648 26552 39213 24700 18583 4741 -7840 -18008 17023 6093 -11176 29336 71125
3963 71125 55309 11360 -5075 -45431 -50854 701 15797 38685 21314 -42381 -57533 -46832
3951 -46832 -21799 -48852 -72226 -74316 -27868 -33042 -42182 -23203 7938 -1191 -5308 7860 12145
3938 12145 -15221 -49540 -43455 2077 26241 6392 1071 -8781 -1182 15170 7649 8830 -5125
3925 -5125 -30393 -53236 -27194 -12750 -28047 -19137 23905 53184 41125 -7788 -18235 -44965
3913 -44965 -33561 -12721 -30072 -39690 -30848 -15990 1756 -5131 -25511 -29883 -34604 -25234 30622
3900 30622 54612 60483 34722 25653 12749 -3530 -27187 -28079 33881 25713 -16525 -43661 -44933
3887 -44933 -42341 -15127 -9360 13877 -7760 -31202 -28513 -22672 3192 26584 58719 64665 74842
3874 74842 44672 11305 1755 18737 -6264 -21316 -1993 537 2269 -8992 -26111 -21054 -16568
3861 -16568 -4194 -14143 -2256 -5755 -11828 -21196 3517 12029 -51346 -57357 -50570 -28826 -23210
3848 -23210 -492 -11829 -47801 -55892 -48807 -11070 24742 7944 32221 21706 26731 28937 16685
3835 16685 -30239 -45800 -52033 -33235 -52321 -101068 -111567 -62664 -29321 -40274 -39984 -17396
3823 -17396 -14166 -60175 -95394 -67545 -24841 3626 12636 8817 70759 79623 69684 34917 -1859
3810 -1859 -11384 -27470 -40171 -8367 -49614 -72999 -39986 -53877 -55646 -32298 -27312 -38146 -53401
3797 -53401 -16476 -24346 -45369 -16270 2363 8091 -5693 -7269 -9398 -572 13726 -245 -14067
3784 -14067 -36901 -27851 -36267 -28824 -10799 -8569 11479 27118 33018 26791 11767 32696 31531
3771 31531 78300 56627 51068 46900 12883 -16021 -22734 -43791 -14938 3768 25900 -264
3759 -264 -21997 1925 10787 54689 71497 15299 -34689 -79696 -80359 -63249 -42198 -20539 -3403
3746 -3403 -19712 -10366 24295 23848 22458 -12409 -27804 23760 27612 33497 6938 12753 31780
3733 31780 30385 42591 35542 41008 80733 116435 70326 18466 21692 15722 -4925 -25160 -28760
3720 -28760 -38116 -45857 -44746 -11482 -6385 -11368 -3231 23439 60416 43036 12158 31618 44611
3707 44611 30713 24688 9506 -1103 -44138 -38687 -10555 7658 -9325 -21432 -6054 7863
3695 7863 1369 -31136 -11923 4878 -3202 4131 2848 -8827 -23295 12791 -42666 -32889 -32052
3682 -32052 -38975 -2806 39142 13203 -10170 -38916 -41275 -5636 3790 28015 33153 15273 21307
3669 21307 29293 47017 39817 16042 25726 23427 32007 38708 61372 87039 66960 30407 -15426
3656 -15426 -22338 -46131 -74660 -58714 17203 42469 42982 27218 -26601 -53417 -57632 -35853 -40991
3643 -40991 -51830 -74102 -51931 -40281 -67483 -52773 6591 -16635 -17189 -9706 -41316 -51715
3631 -51715 -50546 -62893 -68634 -62744 -68417 -54565 2834 -8849 -45507 -94262 -117687 -74152 -91063
3618 -91063 -101225 -97738 -70185 -10074 -35921 -7687 37615 14640 -19730 -58692 -71469 -61182
3606 -61182 -63892 -103841 -93308 -83410 -41803 -18854 -29163 -44584 -47567 -28807 -21383 -7967 -639
3593 -639 15786 -17962 -58214 -79715 -51099 -15366 -6258 -32672 -33886 19501 4911 6524 18506
3580 18506 -12502 -33064 -57028 -61151 -30033 12056 1437 -41671 -42012 -15371 39278 47498 55313
3567 55313 38101 37986 42976 51061 5920 -23359 -18348 -25102 -4812 -2447 -17171 -13858 -15136 -45604
3553 -45604 -44851 -30413 -54258 -44768 -69393 -125937 -111535 -72273 -52798 -95807 -69142 -95787
3541 -95787 -87408 -75455 -53944 -4766 -8312 21788 15135 -23617 -10119 10391 -4144 -1255 -450
3528 -450 -7970 -20770 -15608 -914 42691 33917 -23222 -38330 -459 26105 14773 7473 -12218
3515 -12218 -14306 -10035 44444 47870 9272 -17846 554 15215 -16109 -42224 -6394 -9585 -24804
3502 -24804 -25450 -32866 -37931 -50438 -30325 -16632 -29619 -18641 2247 15668 3235 -11421 5107
3489 5107 -13186 -21517 -55841 -48920 -58076 -75114 -61080 -56973 -43533 -38720 -23650 -14554 6842
3476 6842 6749 -9951 -21270 -15054 16282 8121 -3066 -16732 -37232 -60324 -93783 -112148 -83664
3463 -83664 -97559 -104078 -110466 -68946 -31043 -31461 -44174 -45705 -20762 16842 -552 -17073 -28065
3450 -28065 -17596 -38577 -64599 -65618 -87394 -71249 -55510 -52753 -40305 -29056 -778 17831
3438 17831 44184 70648 88261 48190 24468 40415 39504 49672 19176 7513 11796 -18096
3426 -18096 -50407 -19861 28047 9372 -43865 -55751 -35765 -2340 -21380 -45362 -73953 -34834
3414 -34834 -17858 -17721 -30346 -21930 -16223 -40760 -58192 -61321 -55076 -38747 -50141 -52270 -51771 -34591
3400 -34591 -24871 -70985 -45184 -8432 -18386 -29153 -60406 -60792 -66450 -60110 -44161 13674 34349
3387 34349 19218 10885 20614 29985 27431 6352 -15576 -8520 -12898 -3693 18315 -8203 -53552
3374 -53552 -63825 -54683 -49607 -25970 -1285 14295 -13717 -15776 -28177 -54152 -50644 -49027 -49033 -57577
3360 -57577 -45204 -9513 -8447 -43803 -20714 -25363 1014 11045 -12956 -43643 -55579 -40138
3348 -40138 -26806 -21466 10609 54055 -1091 -70362 -86644 -102401 -48736 16408 26280 9219
3336 9219 -32322 -18857 -16730 31065 40150 48265 -3802 5180 19206 35101 66941 14279 -1229
3323 -1229 14747 14983 -19875 -17532 20212 18844 -19548 -45577 -14835 13271 24729 34817 28602
3310 28602 -7744 -16799 -3756 -18331 -17660 -18248 12491 20996 -17145 -33345 -49199 -37456 -20622
3297 -20622 -5184 52862 36132 -696 -26608 2458 44387 25261 15665 24331 28893 -4773
3285 -4773 -6692 -3393 9725 11188 -25284 -2089 -15377 828 18127 31024 24075 -9486 -66910
3272 -66910 -51996 -19933 -27639 -21375 -9036 -4992 -29162 4377 34760 34054 58073 54810 72110
3259 72110 65530 77613 89618 99550 44751 20683 46583 27877 15219 6389 -29791 -22302 -19251
3246 -19251 -28628 -46371 -69384 -31080 -32850 -31515 -19043 33048 80265 101207 62664 -11507
3234 -11507 -39943 -59568 -38929 -41201 -16715 24802 29281 3060 -18760 8458 37010 27486
3222 27486 -9750 -60785 -47860 -15472 -18205 -923 27497 50643 20703 -34893 -27332 31493
3210 31493 51371 32413 6913 -29031 -8957 -5818 1539 4491 3579 2620 -6989 -19649 -41798
3197 -41798 -67209 -59206 -114109 -90228 -44727 -17374 2357 -2416 -51765 -14838 -8968 -29597
3185 -29597 17044 14821 -10939 -36422 -76962 -63037 -15221 -10653 -44406 -84280 -88868 -48475
3173 -48475 -10463 -2159 46328 12228 13065 27866 2710 -512 -19683 -37713 -53814 -43790 -36412
3160 -36412 -23799 16577 42020 58049 79688 46446 17955 12880 16526 -14747 -13805 21300 1708
3147 1708 -22766 -42069 -32255 -1042 -6025 -51988 -54217 -68061 -61493 -56354 -39123 -43666 -54806
3134 -54806 -52653 -33704 20325 31137 -5482 -22731 -11788 -8922 -17748 11335 -916 -19554
3122 -19554 -24223 -40731 -14143 -9412 -8296 -13180 29949 1216 -17437 40406 63756 21838 -32299
3109 -32299 -67093 -37967 -46207 -31361 32885 72342 44897 4006 -11862 -1329 13890 -3044
3097 -3044 -32178 -12333 61475 46591 -12753 -45368 -63081 -70774 -42228 30770 24551 3981
3085 3981 9376 9038 21396 41832 53764 19630 10460 -15511 -8978 12899 9381 27101 24241
3072 24241 13866 -12250 -22315 -41966 -13918 18352 23227 19567 40326 48503 -5039 -35452
3060 -35452 -14499 37028 39838 10761 50791 66880 51744 26480 17694 25050 28564 -8415 -41827
$$ [...]
##END NTUPLES=NMR SPECTRUM
##END=
