##TITLE=Analysis number 319500
Compound Code cc 47009
Book Reference 422/171
Project Code adrs
Chemist Name robb
##JCAMPDX= 6.0         $$ Bruker NMR JCAMP-DX V2.0
##DATA TYPE= NMR SPECTRUM
##DATA CLASS= NTUPLES
##ORIGIN= Bruker BioSpin GmbH
##OWNER= nmr
$$ XWIN-NMR		Version 3.5
$$ Wed May 17 11:11:53 2006 GMT Daylight Time (UT+1h)  MAYBRIDGE\nmr@NMR_250MHZ
##.OBSERVE FREQUENCY= 250.131544655141
##.OBSERVE NUCLEUS= ^1H
##.ACQUISITION MODE= SIMULTANEOUS (DQD)
##.ACQUISITION SCHEME= undefined
##.AVERAGES= 16
##.DIGITISER RES= 18
##SPECTROMETER/DATA SYSTEM= dpx250
##.PULSE SEQUENCE= zg30
##.SOLVENT NAME= CDCl3
##.SHIFT REFERENCE= (INTERNAL, CDCl3, 0, 16.522)
##AUDIT TRAIL= $$ (NUMBER, WHEN, WHO, WHERE, WHAT)
$$ ##TITLE= Audit trail, XWIN-NMR		Version 3.5
$$ ##JCAMPDX= 5.01
$$ ##ORIGIN= Bruker BioSpin GmbH
$$ ##OWNER= nmr
$$ C:\u/data/dgb/nmr/ADRS/4560/pdata/1/auditp.txt
$$ ##AUDIT TRAIL=  $$ (NUMBER, WHEN, WHO, WHERE, WHAT)
(   1,<2006-05-17 11:11:34.45 +100>,<MAYBRIDGE\nmr>,<NMR_250MHZ>,
      <created by zg, POWCHK disabled, PULCHK disabled
       configuration hash MD5:
       84 BC 41 DB A1 6E 1D 46 DA 25 12 A5 C1 ED C5 3A
       data hash MD5: 64K
       DB 7F C9 6B B5 F9 68 E7 E9 64 95 49 48 9F ED DD>)
(   2,<2006-05-17 11:11:45.31 +100>,<MAYBRIDGE\nmr>,<NMR_250MHZ>,
      <Start of raw data processing
       ef LB = 0.3 FT_mod = 6 PKNL = 1 SI = 32K 
       data hash MD5: 32K
       41 AE 1E E6 D6 08 8A 51 F3 C4 9B 44 F7 78 9A B6>)
(   3,<2006-05-17 11:11:46.88 +100>,<MAYBRIDGE\nmr>,<NMR_250MHZ>,
      <apk 
       data hash MD5: 32K
       C9 43 B6 77 9F 75 F8 7C 6B CF F9 00 D6 C3 49 B1>)
(   4,<2006-05-17 11:11:47.63 +100>,<MAYBRIDGE\nmr>,<NMR_250MHZ>,
      <abs ABSG = 5 
       data hash MD5: 32K
       23 B1 F1 0E E7 02 E8 B5 E9 49 77 8F 32 BC 85 0A>)
$$ ##END=
$$ 
$$ hash MD5
$$ 45 6A 0B B2 6B 66 CB 3D 87 47 56 86 10 51 55 9B
##$RELAX= 
##$RELAX= 
##$RELAX= 
##$RELAX= 
##$RELAX= 
##$RELAX= 
##$RELAX= 
$$ Bruker specific parameters
$$ --------------------------
##$DU= <C:\u>
##$EXPNO= 4560
##$NAME= <ADRS>
##$PROCNO= 1
##$TYPE= <nmr>
##$USER= <dgb>
##$AMP= (0..31)
100 100 100 100 100 100 100 100 100 100 100 100 100 100 100 100 100 100 
100 100 100 100 100 100 100 100 100 100 100 100 100 100 
##$AQSEQ= 0
##$AQ_mod= 3
##$AUNM= <au_zg>
##$AUTOPOS= <16 >
##$BF1= 250.13
##$BF2= 250.13
##$BF3= 250.13
##$BF4= 250.13
##$BF5= 500.13
##$BF6= 500.13
##$BF7= 500.13
##$BF8= 500.13
##$BYTORDA= 1
##$CFDGTYP= 0
##$CFRGTYP= 5
##$CHEMSTR= <none>
##$CNST= (0..31)
1 1 145 1 1 1 1 1 1 1 1 1 1 1 1 1 1 1 1 1 1 1 1 1 1 1 1 1 1 1 1 1 
##$CPDPRG= <>
##$CPDPRG1= <>
##$CPDPRG2= <>
##$CPDPRG3= <>
##$CPDPRG4= <mlev>
##$CPDPRG5= <mlev>
##$CPDPRG6= <mlev>
##$CPDPRG7= <mlev>
##$CPDPRG8= <mlev>
##$CPDPRGB= <>
##$CPDPRGT= <>
##$D= (0..31)
0 1 0 0 0 0 0 0 0 0.06 0 0 0 0 0 0 0.0002 0 0 0 0 0 0 0 0 0 0 0 0 0 0 
0 
##$DATE= 1147860693
##$DBL= (0..7)
120 120 120 120 120 120 120 120 
##$DBP= (0..7)
150 150 150 150 150 150 150 150 
##$DBP07= 0
##$DBPNAM0= <>
##$DBPNAM1= <>
$$ [...]
##$SUBNAM7= <"">
##$SUBNAM8= <"">
##$SUBNAM9= <"">
##$SW= 20.6930455092707
##$SWIBOX= (0..15)
0 0 3 0 0 0 0 0 0 0 0 0 0 0 0 0 
##$SW_h= 5175.983436853
##$TD= 65536
##$TD0= 1
##$TE= 295.16
##$TE2= 300
##$TE3= 300
##$TEG= 300
##$TL= (0..7)
0 120 120 120 120 120 120 120 
##$TP= (0..7)
150 150 150 150 150 150 150 150 
##$TP07= 0
##$TPNAME0= <>
##$TPNAME1= <>
##$TPNAME2= <>
##$TPNAME3= <>
##$TPNAME4= <>
##$TPNAME5= <>
##$TPNAME6= <>
##$TPNAME7= <>
##$TPOAL= (0..7)
0.5 0.5 0.5 0.5 0.5 0.5 0.5 0.5 
##$TPOFFS= (0..7)
0 0 0 0 0 0 0 0 
##$TUNHIN= 0
##$TUNHOUT= 0
##$TUNXOUT= 0
##$USERA1= <user>
##$USERA2= <user>
##$USERA3= <user>
##$USERA4= <user>
##$USERA5= <user>
##$V9= 5
##$VALIST= <valist>
##$VCLIST= <CCCCCCCCCCCCCCC>
##$VD= 0
##$VDLIST= <DDDDDDDDDDDDDDD>
##$VPLIST= <PPPPPPPPPPPPPPP>
##$VTLIST= <TTTTTTTTTTTTTTT>
##$WBST= 1024
##$WBSW= 4
##$XGAIN= (0..3)
0 0 0 0 
##$XL= 0
##$YL= 0
##$YMAX_a= 349667
##$YMIN_a= -491937
##$ZGOPTNS= <>
##$ZL1= 120
##$ZL2= 120
##$ZL3= 120
##$ZL4= 120
##$ABSF1= 16.522
##$ABSF2= -4.171173
##$ABSG= 5
##$ABSL= 3
##$ALPHA= 0
##$AQORDER= 0
##$ASSFAC= 0
##$ASSFACI= 0
##$ASSFACX= 0
##$ASSWID= 0
##$AUNMP= <proc_1d>
##$AZFE= 0.1
##$AZFW= 0.1
##$BCFW= 0
##$BC_mod= 0
##$BYTORDP= 0
##$COROFFS= 0
##$CY= 12.5
##$DATMOD= 1
##$DC= 0
##$DFILT= <>
##$DTYPP= 0
##$F1P= 14.0000005364418
##$F2P= -0.99999901652339
##$FCOR= 0.5
##$FTSIZE= 32768
##$FT_mod= 6
##$GAMMA= 0
##$GB= 0
##$INTBC= 1
##$INTSCL= 1
##$ISEN= 128
##$LB= 0.3
##$LEV0= 0
##$LPBIN= 0
##$MAXI= 10000
##$MC2= 0
##$MEAN= 0
##$ME_mod= 0
##$MI= 0
##$NCOEF= 0
##$NC_proc= -3
##$NLEV= 6
##$NOISF1= 0
##$NOISF2= 0
##$NSP= 0
##$NTH_PI= 0
##$NZP= 0
##$OFFSET= 16.522
##$PC= 1
##$PHC0= 166.3898
##$PHC1= 13.8129
##$PH_mod= 1
##$PKNL= yes
##$PPARMOD= 0
##$PSCAL= 4
##$PSIGN= 0
##$REVERSE= no
##$SF= 250.13
##$SI= 32768
##$SIGF1= 0
##$SIGF2= 0
##$SINO= 400
##$SIOLD= 32768
##$SREGLST= <1H.CDCl3>
##$SSB= 0
##$STSI= 32768
##$STSR= 0
##$SW_p= 5175.98343685301
##$SYMM= 0
##$S_DEV= 0
##$TDeff= 65536
##$TDoff= 0
##$TI= <Analysis number 999999
Compound Code 99
Book Reference 9
Project Code 9>
##$TILT= no
##$TM1= 0
##$TM2= 0
##$TOPLEV= 0
##$USERP1= <user>
##$USERP2= <user>
##$USERP3= <user>
##$USERP4= <user>
##$USERP5= <user>
##$WDW= 1
##$XDIM= 32768
##$YMAX_p= 423296225
##$YMIN_p= -163459
$$ End of Bruker specific parameters
$$ ---------------------------------
##NTUPLES= NMR SPECTRUM
##VAR_NAME=  FREQUENCY,     SPECTRUM/REAL,   SPECTRUM/IMAG
##SYMBOL=    X,             R,               I
##VAR_TYPE=  INDEPENDENT,   DEPENDENT,       DEPENDENT
##VAR_FORM=  AFFN,          ASDF,            ASDF
##VAR_DIM=   32768,         32768,           32768
##UNITS=     HZ,            ARBITRARY UNITS, ARBITRARY UNITS
##FACTOR=    0.157963299565203, 1,           1
##FIRST=     4132.6476996994, 0,             0
##LAST=      -1043.33573715361, 0,           0
##MIN=       -1043.33573715361, -163459,     0
##MAX=       4132.6476996994, 423296225,     0
$$ Real data points
##PAGE= N=1
##DATA TABLE= (X++(R..R)), XYDATA
$$ [...]
$$ plain form
18396 1254653 1317855 1393893 1530628 1653765 1750065 1811303 1898378 2074575 2278199 2445284
18386 2445284 2682405 2995090 3414462 3992853 4785210 6018191 8183446 12007473 18643613
18377 18643613 27680929 36410758 42587093 42716193 39408957 40415758 44454435 47620225
18369 47620225 45152005 37396076 33514729 36451540 42763252 48678401 50999887 47133628
18361 47133628 44171528 45891316 48502959 47795400 39393438 28422756 21154884 17045199
18353 17045199 14602266 13053177 11938539 11063120 10306859 9676894 9184188 8724882 8314495
18344 8314495 7994985 7638900 7346526 7126478 6870479 6571674 6294909 6064934 5841653
18335 5841653 5643633 5435487 5232320 5102004 4945059 4724413 4563040 4428122 4272504
$$ packed form
18396A254653O3202P6038J36735J23137R6300O1238Q7075J76197K03624J67085
18386B445284K37121L12685M19372N78391P92357J232981K165255L824027O636140
18377A8643613R037316Q729829O176335J29100l307236J006801M038677L165790
18369D7620225k468220p755929l881347K936811O311712N915149K321486l866259
18361D7133628k962100J719788K611643p07559q401962j0970682p267872m109685
18353A7045199k442933j549089j114638q75419p56261o29965m92706m59306m10387
18344H314495l19510l56085k92374k20048k55999k98805k76765k29975k23281
18335E841653j98020k08146k03167j30316j56945k20646j61373j34918j55618
$$ plain form
18326 4272504 4138745 3967365 3784947 3675504 3581452 3459190 3371091 3287540 3202521 3118414
18316 3118414 3049948 2955357 2841702 2679652 2567063 2492862 2411495 2328267 2288881 2216931 2137805
18305 2137805 2117528 2059398 1988030 1909455 1850959 1835603 1802690 1733250 1674139 1592015 1554319
18294 1554319 1583504 1572983 1544488 1527746 1453336 1380954 1348210 1288970 1244396 1237320 1223892
18283 1223892 1164050 1120423 1103393 1133183 1093465 1027607 997599 931489 849154 836943 828437
18272 828437 808521 818808 786091 751439 734878 722445 741555 786237 779018 732227 686322 679510
18260 679510 678251 616107 527458 502759 557824 562836 524838 497992 524758 526143 510257 469189
18248 469189 463486 523656 518257 521247 514183 451089 412242 407856 405906 455689 472688 453624 453988
$$ packed form
18326D272504j33759j71380j82418j09443r4052j22262q8099q3551q5019q4107
18316C118414o8466r4591j13655j62050j12589p4201q1367q3228l9386p1950p9126
18305B137805k0277n8130p1368p8575n8496j5356l2913o9440n9111q2124l7696
18294A554319K9185j0521k8495j6742p4410p2382l2744n9240m4574p076j3428
18283A223892n9842m3627j7030K9790l9718o5858l0008o6110q2335j2211q506
18272H28437j9916J0287l2717l4652j6561j2433J9110M4682p219m6791m5905o812
18260F79510j259o2144q8649k4699N5065N012l7998k6846K6766J385j5886m1068
18248D69189n703O0170n399K990p064o3094l8847m386j950M9783J6999j9064L64
$$ plain form
18235 453988 445521 395786 341012 353655 350007 365032 371282 343498 269309 233383 232728 246433
18223 246433 267594 221694 189055 192951 212292 231473 217828 226556 200518 164921 171062 176553
18211 176553 159581 136379 127453 188741 178462 146689 146052 142069 152311 161402 170511 155221 160667
18198 160667 168092 111791 107678 127270 149876 151714 116005 86922 35445 12903 45765 125168
18186 125168 153797 144668 144083 115652 124424 116813 52092 56438 102668 113484 124104 116466 111493
18173 111493 116971 137374 187122 242158 218327 196558 211482 219542 165635 124091 124654 145395
18161 145395 166158 186392 240783 245884 250668 268938 247719 237077 217836 213326 195067 174196
18149 174196 166707 155728 150688 173377 182351 196594 167337 199948 273131 290512 316967 329500
$$ packed form
18235D53988q467m9735n4774J2643l648J5025O250k7784p4189l5926o55J3705
18223B46433K1161m5900l2639L896J9341J9181j3645Q728k6038l5597O141N491
18211A76553j6972k3202q926O1288j0279l1773o37l983J0242R091R109j5290N446
18198A60667P425n6301m113J9592K2606J838l5709k9083n1477k2542L2862P9403
18186A25168K8629r129n85k8431Q772p611o4721M346M6230J0816J0620p638m973
18173A11493N478K0403M9748N5036k3831k1769J4924Q060n3907m1544N63K0741
18161A45395K0763K0234N4391N101M784J8270k1219j0642j9241m510j8259k0871
18149A74196p489j0979n040K2689Q974J4243k9257L2611P3183J7381K6455J2533
$$ plain form
18137 329500 364577 377133 352609 311229 272897 311650 334808 342269 421082 513675 588995 644467
18125 644467 734471 826968 937384 1058299 1168345 1329082 1527992 1762538 2145203 2662384
18115 2662384 3461367 4799145 7074500 11515444 20299809 33771125 46760216 55425095
18107 55425095 51896910 34232899 20656258 13840270 10352668 8423877 7222149 6480674
18099 6480674 5903101 5356896 4862828 4426683 4099614 3852492 3650726 3425663 3230225
18090 3230225 3097863 2947761 2821330 2731436 2648576 2556648 2475134 2387323 2245859 2149590
18080 2149590 2106093 2048368 1961855 1897655 1842246 1744976 1651517 1580150 1486629 1455705 1422558
18069 1422558 1386544 1388665 1372991 1328825 1290231 1252070 1201637 1123261 1077717 1075386 1065338 1041339
$$ packed form
18137C29500L5077J2556k4524m1380l8332L8753K3158P461P8813R2593P5320N5472
18125F44467R0004R2497J10416J20915J10046J60737J98910K34546L82665N17181
18115B662384P98983J337778K275355M440944Q784365J3471316J2989091Q664879
18107E5425095l528185j7664011j3576641o815988l487602j928791j201728p41475
18099F480674n77573n46205m94068m36145l27069k47122k01766k25063j95438
18090C230225j32362j50102j26431q9894q2860r1928q1514q7811j41464r6269
18080B149590m3497n7725q6513o4200n5409r7270r3459p1367r3521l0924l3147
18069A422558l6014K121j5674m4166l8594l8161n0433p8376m5544k331j0048k3999
$$ plain form
18057 1041339 1029132 970503 913555 918568 891440 874921 852228 828434 765935 736099 725828
18046 725828 679499 655476 609712 609466 658815 659913 635019 595761 591199 588826 559241 561544 511875
18033 511875 464416 468063 490963 442147 440471 446938 453103 442393 457729 410945 371021 368048
18021 368048 349845 355420 308767 276536 262701 272722 280141 296727 283687 286223 309816 296538
18009 296538 299184 306354 272148 254376 225316 238092 287911 290654 287511 285559 273684 230238
17997 230238 198073 207840 213136 202382 210126 200554 200345 145316 121882 134949 128505 109539 157374
17984 157374 164397 137988 127241 77443 55244 100662 117298 114419 170016 246651 250108 185028
17972 185028 136022 148702 135305 128194 112223 86914 61533 64424 112366 131795 142605 136592
$$ packed form
18057A041339j2207n8629n6948N013k7128j6519k2693k3794o2499k9836j0271
18046G25828m6329k4023m5764k46M9349J098k4894l9258m562k373k9585K303m9669
18033E11875m7459L647K2900m8816j676O467O165j0710J5336m6784l9924k973
18021C68048j8203N575m6653l2231j3835J0021P419J6586j3040K536K3593j3278
18009B96538K646P170l4206j7772k9060J2776M9819K743l143j952j1875m3446
17997B30238l2165R767N296j0754P744r572k09n5029k3434J3067o444j8966M7835
17984A57374P023k6409j0747m9798k2199M5418J6636k879N5597P6635L457o5080
17972A85028m9006J2680j3397p111j5971k5309k5381K891M7942J9429J0810o013
$$ plain form
17960 136592 103106 89877 97758 73373 52477 36999 18136 -1245 -2225 53747 35184 -29775
17948 -29775 -19326 45151 52714 37633 28884 6115 16723 5413 -12387 -5865 32939 48302
17936 48302 35684 44632 52229 56632 38913 4470 -21182 -45164 -51032 2189 68274 93400
17924 93400 61843 46109 18953 -31056 -43968 -17738 11532 17231 44835 85793 72584 91038
17912 91038 130750 79273 26707 23617 10223 15519 16630 37198 -12331 -26946 -19397 -20684 -10136
17899 -10136 -8879 -17433 -16896 8382 49061 38194 25667 7302 12416 33450 52368 33223 -25185
17886 -25185 -21700 -19422 -10414 22271 42147 36176 11847 -5702 -7552 -57614 -71694 -72214 -35013
17873 -35013 -6528 -4880 15118 38290 72793 81969 18503 -32039 -38442 3678 29435 1346
$$ packed form
17960A36592l3486j3229P881k4385k0896j5478j8863j9381r80N5972j8563o4959
17948b9775J0449O4477P563j5081q749k2769J0608j1310j7800O522L8804J5363
17936D8302j2618Q948P597M403j7719l4443k5652k3982n868N3221O6085K5126
17924I3400l1557j5734k7156n0009j2912K6230K9270N699K7604M0958j3209J8454
17912I1038L9712n1477n2566l090j3394N296J111K0568m9529j4615P549j287J0548
17899a0136J257q554N37K5278M0679j0867j2527j8365N114K1034J8918j9145n8408
17886b5185L485K278R008L2685J9876n971k4329j7549j850n0062j4080n20L7201
17873c5013K8485J648J9998K3172L4503R176o3466n0542o403M2120K5757k8089
$$ plain form
17861 1346 -15211 3183 21271 9717 -15757 -29764 3030 32115 -3965 4300 -6851 25905
17849 25905 17334 16292 -4732 -3596 -7621 -13045 -17281 -14426 -29252 -29477 4027 712 4839 5304
17835 5304 25889 43799 -16079 -55065 -58408 -53634 -61875 -39462 784 25847 39090 28906
17823 28906 19141 26691 29028 13973 -16138 -3711 9429 21030 31083 25351 39176 53513
17811 53513 32576 -10588 -54637 -40202 -33871 -4980 27256 102599 125182 112775 64789 -7175
17799 -7175 -16507 17604 45894 22822 15876 -11293 -35371 -16354 -23243 -39855 22668 44290
17787 44290 32094 45634 29900 12952 46566 34401 11349 -12306 -34850 -41961 -37005 -62451
17775 -62451 -48673 -25326 -13918 -2449 -19078 -39548 -5752 66852 39345 28786 31701 34360
$$ packed form
17861A346j6557J8394J8088j1554k5474j4007L2794K9085l6080Q265j1151L2756
17849B5905q571j042k1024J136m025n424m236K855j4826k25L3504l315M127M65
17835E304K0585J7910n9878l8986l343M774q241K2413M0246K5063J3243j0184
17823B8906r765P550K337j5055l0111J2427J3140J1601J0053n732J3825J4337
17811E3513k0937m3164m4049J4435O331K8891L2236P5343K2583j2407m7986p1964
17799g175r332L4111K8290k3072o946k7169k4078J9017o889j6612O2523K1622
17787D4290j2196J3540j5734j6948L3614j2165k3052k3655k2544p111M956k5446
17775f2451J3778K3347J1408J1469j6629k0470L3796P2604k7507j0559K915K659
$$ plain form
17763 34360 10926 26717 24624 -53231 -38233 32936 -8231 -6748 -16761 -56642 -61896 17773
17751 17773 26775 16478 -26702 -39748 -26261 3107 11321 -54451 -30293 -971 -1370 25649
17739 25649 12260 9533 37928 24847 31518 33988 84154 103331 98566 123791 194787 191285 154106
17726 154106 151304 143980 183876 209381 211219 174961 178938 205461 258830 285606 248915 193518
17714 193518 227681 279697 262646 191520 156171 151462 139834 95055 76694 104262 119376 107418
17702 107418 94520 65312 95132 103855 31440 -5802 -3235 -6442 1541 34181 64636 50336
17690 50336 56407 34723 4669 51596 66344 53367 36720 46964 62815 27748 14603 31267
17678 31267 14596 22124 3875 7994 -20815 -65783 -61300 -27471 -21783 -35703 -20194 16130
$$ packed form
17763C4360k3434J5791k093p7855J4998P1169m1167J483j0013l9881n254P9669
17751A7773R002j0297m3180j3046J3487K9368Q214o5772K4158K9322l99K7019
17739B5649j3389k727K8395j3081O671K470N0166J9177m765K5225P0996l502l7179
17726A54106k802p324L9896K5505J838l6258L977K6523N3369K6776l6691n5397
17714A93518L4163N2016j7051p1126l5349m709j1628m4779j8361K7568J5114j1958
17702A07418j2898k9208K9820Q723p2415l7242K567l207P983L2640L0455j4300
17690E0336O071k1684l0054M6927J4748j2977j6647J0244J5851l5067j3145J6664
17678C1267j6671P528j8249M119k8809m4968M483L3829N688j3920J5509L6324
$$ plain form
17666 16130 44193 48560 46663 15798 -19748 26734 60743 27991 25517 54659 47278 -1792
17654 -1792 581 36271 76247 85350 13098 40414 56462 34338 13243 42182 29519 25130
17642 25130 57272 66700 16774 -5069 8079 -3201 11035 41444 50105 76376 109277 156927
17630 156927 197442 223890 237028 225185 213288 254164 252949 228579 224821 204510 138626 94942
17618 94942 59102 76732 104987 95949 81025 62148 37321 31511 84168 175769 236395 198050
17606 198050 177411 207340 260821 288694 204556 140278 106428 57738 47543 35770 42936 51478
17594 51478 55064 74942 87739 77313 80261 69895 34620 41638 45647 71768 66496 100073 90634
17581 90634 44456 19805 15018 8517 35427 66422 78370 97003 105049 130006 128760 72760
$$ packed form
17666A6130K8063M367j897l0865l5546M6482L4009l2752k474K9142p381m9070
17654a792K373L5690L9976R103p2252K7316J6048k2124k1095K8939j2663m389
17642B5130L2142R428m9926k1843J3148j1280J4236L0409Q661K6271L2901M7650
17630A56927M0515K6448J3138j1843j1897M0876j215k4370l758k0311o5884m3684
17618I4942l5840J7630K8255r038j4924j8877k4827n810N2657R1601O0626l8345
17606A98050k0639K9929N3481K7873q4138o4278l3850m8690j0195j1773P166Q542
17594E1478L586J9878J2797j0426K948j0366l5275P018M009K6121n272L3577r439
17581I0634m6178k4651m787o501K6910L0995J1948J8633Q046K4957j246n6000
$$ plain form
17569 72760 51693 70592 82131 76350 56895 58787 67023 26924 -1790 12778 22873 17986
17557 17986 -2071 -19525 -40212 -78752 -74337 -44316 -3666 10022 3638 6589 42683 58419
17545 58419 60807 43535 27302 58827 34229 35600 33351 4470 -43103 -51241 -2334 16335
17533 16335 30179 37774 25396 -6608 9881 41078 38889 50612 37752 -600 -10512 -10867 -44031
17520 -44031 -5156 30260 27378 51714 56864 45265 4843 -15073 11247 54994 68061 69980
17508 69980 42278 13994 2814 24913 77797 54791 -3513 23731 45729 37573 67489 88185
17496 88185 45877 40327 47459 56655 32399 -7541 -19661 -19113 -30139 -24272 -22813 -8127 16205
17483 16205 20274 -24135 -7579 5609 -21865 2924 1581 -2984 17366 22674 39106 54275
$$ packed form
17569G2760k1067J8899J1539n781j9455J892Q236m0099k8714J4568J0095m887
17557A7986k0057j7454k0687l8540M415L0021M0650J3688o384K951L6094J5736
17545E8419K388j7272j6233L1525k4598J371k249k8881m7573q138M8907J8669
17533A6335J3844P595j2378l2004J6489L1197k189J1723j2860l8352r912l55l3164
17520d4031L8875L5416k882K4336N150j1599m0422j9916K6320M3747J3067J919
17508F9980k7702k8284j1180K2099N2884k3006n8304K7244K1998q156K9916K0696
17496H8185m2308n550P132R196k4256l9940j2120N48j1026N867J459J4686K4332
17483A6205M069m4409J6556J3188k7474K4789j343m565K0350N308J6432J5169
$$ plain form
17471 54275 72406 74661 86456 57807 32106 18572 2384 18285 44444 50342 58275 58417 21543
17458 21543 -2257 3532 16825 62222 20881 -4813 18399 21459 -523 40313 81986 85694
17446 85694 111107 163466 218388 269229 314963 332888 253860 188351 110795 91602 118938 99590
17434 99590 80436 78770 63119 42112 31310 -6551 -36062 -38268 -13755 -372 26808 40332
17422 40332 30838 36067 8267 -4301 28523 41292 44088 34819 85849 150669 141402 70617 33287
17409 33287 44821 35623 41794 66515 50279 49260 66877 28874 -8337 25234 68702 72717
17397 72717 60923 49932 81643 68566 51365 35386 50359 56201 18065 24242 44703 74541
17385 74541 62175 65625 120506 194391 242525 218371 213982 190897 179033 162524 148437 170787
$$ packed form
17471E4275J8131K255J1795k8649k5701j3534j6188J5901K6159N898P933J42l6874
17458B1543k3800N789J3293M5397m1341k5694K3212L060k1982M0836M1673L708
17446H5694K5413N2359N4922N0841M5734J7925p9028o5509p7556j9193K7336j9348
17434I9590j9154j666j5651k1007j0802l7861k9511k206K4513J3383K7180J3524
17422D0332r494N229k7800j2568L2824J2769K796r269N1030O4820r267p0785l7330
17409C3287J1534r198O171K4721j6236j019J7617l8003l7211L3571M3468M015
17397G2717j1794j0991L1711j3077j7201j5979J4973N842l8136O177K0461K9838
17385G4541j2366L450N4881P3885M8134k4154m389k3085j1864j6509j4087K2350
$$ plain form
17373 170787 194162 192672 178971 199700 222415 232182 229078 171807 122906 107993 105782 99894
17361 99894 115423 151793 215562 243431 235653 253849 230129 195584 183819 167880 132099 150691
17349 150691 204674 276695 258220 235200 197527 166218 151375 150017 115308 124051 128167 139834
17337 139834 157693 142971 94430 107455 135643 130030 73167 71780 89548 110623 161209 154026
17325 154026 151082 144000 120344 99547 82035 132484 150529 97696 117296 166723 168862 184637
17313 184637 172122 167717 168175 130380 89525 105247 108831 126651 103004 85218 119316 121090
17301 121090 122903 160041 128632 139193 172619 183688 169219 194382 209374 277706 350412 419414
17289 419414 510642 573935 611142 654669 610515 502711 435890 370934 273062 206163 178921
$$ packed form
17373A70787K3375j490j3701K0729K2715R767l104n7271m8901j4913k211n888
17361I9894J5529L6370O3769K7869p778J8196k3720l4545j1765j5939l5781J8592
17349A50691N3983P2021j8475k3020l7673l1309j4843j358l4709Q743M116J1667
17337A39834J7859j4722m8541J3025K8188n613n6863j387J7768K1075N0586p183
17325A54026k944p082k3656k0797j7512N0449J8045n2833J9600M9427K139J5775
17313A84637j2515m405M58l7795m0855J5722L584J7820k3647j7786L4098J774
17301A21090J813L7138l1409J0561L3426J1069j4469K5163J4992O8332P2706O9002
17289D19414R1228O3293L7207M3527m4154j07804o6821o4956r7872o6899k7242
$$ plain form
17278 178921 187994 192852 163200 118800 135838 160122 146119 131726 150538 136734 117921 116317
17266 116317 102965 126626 158231 161249 123599 117838 116008 111356 139807 179591 183743 189874 152162
17253 152162 91600 66542 53318 34348 53042 103706 136836 149280 105837 80961 103401
17242 103401 122207 90725 60104 59786 75202 87969 120480 100165 87793 112958 129480 121343
17230 121343 102423 92752 127778 134218 111400 137311 110013 107715 106094 107709 103350 81139 17120
17217 17120 4102 12290 81315 93985 99862 127922 146017 127660 101187 139697 163212 130243
17205 130243 103863 83827 87470 90636 108804 83784 73209 88974 104308 125271 124608 163730
17193 163730 168602 168664 123508 81473 84366 127313 184604 239600 238602 225237 205489 200278 236068
$$ packed form
17278A78921R073M858k9652m4400J7038K4284j4003j4393J8812j3804j8813j604
17266A16317j3352K3661L1605L018l7650n761j830m652K8451L9784M152O131l7712
17253A52162o0562k5058j3224j8970J8694N0664L3130J2444m3443k4876K2440
17242A03401J8806l1482l0621l18J5416J2767L2511k0315j2372K5165J6522q137
17230A21343j8920r671L5026O440k2818K5911k7298k298j621J615m359k2211o4019
17217A7120j3018Q188O9025J2670N877K8060J8095j8357k6473L8510K3515l2969
17205A30243k6380k0036L643L166J8168k5020j0575J5765J5334K0963o63L9122
17193A63730M872O2m5156m2035K893M2947N7291N4996r98j3365j9748n211L5790
$$ plain form
17180 236068 299948 266758 223761 231752 217005 159121 156894 211785 210065 203639 212608 242303
17168 242303 219686 247664 275817 291575 232283 236583 281148 259485 187760 177696 219205 201153
17156 201153 171746 211368 240387 249264 231080 236999 225163 229798 224919 232054 220629 260179
17144 260179 288515 288196 290205 316985 312403 292378 282924 241459 228511 241697 272414 257643
17132 257643 230950 239476 289838 310627 293420 281925 249565 279107 293614 329518 329765 304911
17120 304911 322398 310925 331080 366441 393662 394577 366316 396234 466356 557234 607882 651636
17108 651636 700700 769923 817414 834218 887045 958063 1020854 1028503 1035059 1062890 1112324 1200932
17096 1200932 1220488 1243945 1300805 1473438 1650029 1866774 2123888 2471267 2845340 3301243
$$ packed form
17180B36068O3880l3190m2997P991j4747n7884k227N4891j720o426Q969K9695
17168B42303k2617K7978K8153J5758n9292M300M4565k1663p1725j0064M1509j8052
17156B01153k9407L9622K9019Q877j8184N919j1836M635m879P135j1425L9550
17144B60179K8336l19K009K6780m582k0025r454m1465j2948J3186L0717j4771
17132B57643k6693Q526N0362K0789j7207j1495l2360K9542J4507L5904K47k4854
17120C04911J7487j1473K0155L5361K7221R15k8261K9918P0122R0878N0648M3754
17108F51636M9064O9223M7491J6804N2827P1018O2791P649O556K7831M9434Q8608
17096A200932J9556K3457N6860J72633J76591K16745K57114L47379L74073M55903
$$ plain form
17086 3301243 3919819 4886880 6482994 9236034 14048242 21273612 29441847 36150581
17078 36150581 38884111 37187244 35781713 37496377 39934485 39116842 32550937 23792255
17070 23792255 17509201 14035376 12189859 11227745 10793190 10768629 11231174 12443428 14954834
17061 14954834 19830731 27642421 36987882 45155460 49195952 47506923 44881552 45887214
17053 45887214 48562107 48334143 41517292 30964584 22564544 17550751 14652539 12895853
17045 12895853 11719558 10851810 10109792 9456856 8907243 8400233 7911812 7474201 7152912
17036 7152912 6891211 6679548 6439613 6194345 5935093 5705743 5560850 5363625 5169453
17027 5169453 5002239 4879924 4763957 4598055 4337654 4172614 4099246 4008692 3873483 3696142
$$ packed form
17086C301243O18576R67061J596114K753040M812208P225370Q168235O708734
17078C6150581K733530j696867j405531J714664K438108q17643o565905q758682
17070B3792255o283054l473825j845517r62114m34555k4561M62545J212254K511406
17061A4954834M875897P811690R345461Q167578M040492j689029k625371J005662
17053D5887214K674893k27964o816851j0552708q400040n013793k898212j756686
17045A2895853j176295q67748p42018o52936n49613n07010m88421m37611l21289
17036G152912k61701k11663k39935k45268k59252k29350j44893j97225j94172
17027E169453j67214j22315j15967j65902k60401j65040p3368r0554j35209j77341
$$ plain form
17017 3696142 3519759 3388280 3283965 3232124 3117425 2965588 2863017 2800497 2709852 2627645
17007 2627645 2586607 2520718 2412334 2328670 2234475 2181113 2133463 2059835 1990099 1928334 1913099
16996 1913099 1870292 1826303 1789731 1778025 1762836 1717732 1652197 1623966 1586456 1537874 1454187
16985 1454187 1382164 1363978 1366802 1328310 1281248 1244394 1214381 1219599 1166722 1133070 1138057 1075309
16973 1075309 1027015 991041 951979 889246 860802 867528 873039 880741 857263 860369 842749 810156
16961 810156 763651 737243 721595 715689 686594 683083 683063 655143 615633 587827 549275 559784
16949 559784 533572 509898 535494 533288 543605 605842 593815 507856 419019 419650 442749 432228
16937 432228 502481 485404 447591 450713 421993 376991 364739 375464 420397 443191 451092 470978
$$ packed form
17017C696142j76383j31479j04315n1841j14699j51837j02571o2520r0645q2207
17007B627645m1038o5889j08384q3664r4195n3362m7650p3628o9736o1765j5235
16996A913099m2807m3989l6572j1706j5189m5104o5535k8231l7510m8582q3687
16985A454187p2023j8186K824l8492m7062l6854l0013N218n2877l3652M987o2748
16973A075309m8294l5974l9062o2733k8444O726N511P702k3478L106j7620l2593
16961H10156m6505k6408j5648n906k9095l511k0k7920l9510k7806l8552J0509
16949E59784k6212k3674K5596k206J0317O2237j2027q5959q8837O31K3099j0521
16937D32228P0253j7077l7813L122k8720m5002j2252J0725M4933K2794P901J9886
$$ plain form
16925 470978 453088 410431 422398 463430 473878 431127 381899 361619 364919 386536 391452 369347
16913 369347 371836 361653 327963 284124 278069 268721 257812 253959 281536 324745 311489 299529
16901 299529 311784 291990 319160 339179 347743 350077 297449 293530 314520 306099 293288 302687
16889 302687 308734 323153 332950 300714 285034 318065 339460 311684 326148 383107 412830 399551
16877 399551 425814 421019 389745 412332 418561 347641 317528 324803 371528 368782 370867 385755
16865 385755 451786 514079 560232 633953 742138 858698 915858 940920 898395 865223 832458
16854 832458 820213 873519 990491 1113224 1206093 1243155 1309110 1413582 1441345 1443666 1522676
16843 1522676 1636563 1787832 2029312 2261832 2452781 2647223 2902539 3256433 3929094
$$ packed form
16925D70978j7890m2657J1967M1032J0448m2751m9228k0280L300K1617M916k2105
16913C69347K489j0183l3690m3839o055r348j0909l853K7577M3209j3256j1960
16901B99529J2255j9794K7170K0019Q564K334n2628l919K0990q421j2811R399
16889C02687O047J4419R797l2236j5680L3031K1395k7776J4464N6959K9723j3279
16877C99551K6263m795l1274K2587O229p0920l0113P275M6725k746K085J4888
16865C85755O6031O2293M6153P3721J08185J16560N7160K5062m2525l3172l2765
16854H32458j2245N3306J16972J22733R2869L7062O5955J04472K7763K321P9010
16843A522676J13887J51269K41480K32520J90949J94442K55316L53894O72661
$$ plain form
16834 3929094 5018120 6885337 10443140 17038935 26605228 35861455 41959719 39879442
16826 39879442 28877558 19740591 15090347 13161110 12995689 14570525 18678977 26172361
16818 26172361 35265311 42451647 45017402 37638746 26693946 20215110 17688042 18087248
16810 18087248 21695439 28495550 35834493 41041595 40469262 31531154 22733746 17783765
16802 17783765 15474070 14767384 15473257 18156269 23709662 31277701 37699384 40842904
16794 40842904 35815604 25516563 18270669 14325324 12049639 10667704 9722525 9062998
16786 9062998 8578616 8155223 7751591 7422255 7121539 6831843 6496637 6165513 5905398
16777 5905398 5718654 5530871 5377215 5276390 5197441 5085392 4906866 4709774 4542274 4330996
$$ packed form
16834C929094J089026J867217L557803O595795R566293R256227O098264k080277
16826C9879442j1001884r136967m650244j929237j65421J574836M108452P493384
16818B6172361R092950P186336K565755p378656j0944800o478836k527068L99206
16810A8087248L608191O800111P338943N207102n72333q938108q797408m949981
16802A7783765k309695p06686P05873K683012N553393P568039O421683L143520
16794D0842904n027300j0299041p245894l945345k275685j381935r45179o59527
16786I062998m84382m23393m03632l29336l00716k89696l35206l31124k60115
16777E905398j86744j87783j53656j00825p8949j12049j78526j97092j67500k11278
$$ plain form
16767 4330996 4179874 4113249 4051738 3988200 3964907 3978168 4007401 4028202 4074147 4094020 4155189
16756 4155189 4197674 4206843 4237156 4271557 4289400 4296627 4380000 4457521 4626068 4908343 5218153
16745 5218153 5501906 5911915 6442214 7116038 8029874 9461695 11845213 15870327 22537326
16736 22537326 32524913 45807045 61656842 77927839 90900353 99169639 100668134
16729 100668134 92548873 78791067 64790449 50992573 38606676 29747902 24152020
16722 24152020 20545161 18127017 16368942 15055386 14040904 13176250 12441949 11800074
16714 11800074 11179171 10578716 10043280 9515162 9054731 8718577 8490483 8241713 7940804
16705 7940804 7707508 7515910 7284315 6955467 6635806 6344769 6059803 5803754 5582114
$$ packed form
16767D330996j51122o6625o1511o3538k3293J3261K9233K0801M5945J9873O1169
16756D155189M2485R169L0313L4401J7843P227Q3373P7521J68547K82275L09810
16745E218153K83753M10009N30299O73824R13836J431821K383518M025114O666999
16736B2537326R987587J3282132J5849797J6270997J2972514Q269286J498495
16729A00668134q119261j3757806j4000618j3797876j2385897q858774n595882
16722B4152020l606859k418144j758075j313556j014482q64654p34301o41875
16714A1800074o20903o00455n35436n28118m60431l36154k28094k48770l00909
16705G940804k33296j91598k31595l28848l19661k91037k84966k56049k21640
$$ plain form
16696 5582114 5340669 5134480 4941542 4789853 4638162 4457759 4271528 4118245 3994196
16687 3994196 3884836 3775113 3634258 3548786 3415024 3286507 3197480 3107885 2994224 2897363
16677 2897363 2820681 2748386 2671005 2604472 2531320 2467198 2407690 2360027 2284159 2241536 2168893
16666 2168893 2085899 2025612 1967192 1938172 1936542 1896359 1819481 1749847 1706799 1713934 1666894 1595444
16654 1595444 1537810 1461010 1407612 1381764 1366859 1349138 1268898 1183412 1112627 1076039 1085758
16643 1085758 1070444 1038681 1001845 989197 948133 933094 960602 954353 920198 854882 779632
16632 779632 721618 712704 699457 655482 578873 569684 599923 596268 603895 606580 598631 572624 551288
16619 551288 503070 510260 536138 527458 537188 555931 540974 487793 444423 423832 382373 347664
$$ packed form
16696E582114k41445k06189j92938j51689j51691j80403j86231j53283j24049
16687C994196j09360j09723j40855q5472j33762j28517q9027q9595j13661r6861
16677B897363p6682p2295p7381o6533p3152o4122n9508m7663p5868m2623p2643
16666B168893q2994o0287n8420k9020j630m0183p6878o9634m3048P135m7040p1450
16654A595444n7634p6800n3398k5848j4905j7721q0240q5486p0785l6588R719
16643A085758j5314l1763l6836j2648m1064j5039K7508o249l4155o5316p5250
16632G79632n8014q914j3247m3975p6609r189L0239l655P627K685p949k6007k1336
16619E51288m8218P190K5878q680R730J8743j4957n3181m3370k0591m1459l4709
$$ plain form
16607 347664 309693 274281 218281 242458 236270 200047 184844 204790 225855 209233 187741 185033
16595 185033 201459 240340 259620 244609 179180 135577 125932 98637 97211 119347 124132 112957
16583 112957 110233 90774 71718 70527 76786 67051 41550 40988 51238 58895 76211 128868 157857
16570 157857 148518 106990 107863 86212 69753 78302 64328 39583 73140 98700 100279 67464
16558 67464 49650 34482 52862 16662 17108 36651 47121 41769 26848 31254 116 30840
16546 30840 35297 50788 53813 35651 16652 9126 604 32265 64936 92067 68343 11214
16534 11214 29394 22786 2569 -23823 -21905 11373 32966 20512 40897 110965 112474 132052
16522 132052 185273 220425 266528 289396 254864 237003 261548 292163 302331 264780 195858
$$ packed form
16607C47664l7971l5412n6000K4177o188l6223j5203J9946K1065j6622k1492k708
16595A85033J6426L8881J9280j5011o5429m3603r645k7295j426K2136M785j1175
16583A12957k724j9459j9056j191O259r735k5501n62J0250P657J7316N2657K8989
16570A57857r339m1528Q73k1651j6459Q549j3974k4745L3557K5560J579l2815
16558F7464j7814j5168J8380l6200M46J9543J0470n352j4921M406l1138L0724
16546C0840M457J5491L025j8162j8999p526q522L1661L2671K7131k3724n7129
16534A1214J8180o608k0217k6392J918L3278K1593j2454K0385P0068J509J9578
16522A32052N3221L5152M6103K2868l4532j7861K4545L0615J0168l7551o8922
$$ plain form
16511 195858 150977 141379 111943 51109 50225 57958 73952 102744 72083 91405 143060 181722
16499 181722 196108 179180 168114 173180 204340 214817 204561 176723 125214 65530 17664 21156
16487 21156 41192 39054 62074 93757 103421 95983 103124 88346 63309 87126 94335 102701 68708
16474 68708 72413 71959 56886 28926 36386 25600 46214 83156 112607 93264 66011 41046
16462 41046 55794 33222 20830 60342 73968 79760 43331 24812 2419 11494 1786 9205
16450 9205 -8909 -3668 36023 50406 69407 37329 11080 -2088 22511 5974 863 -18234
16438 -18234 -20432 -39960 -16584 -30743 -27954 -18438 -15899 -9054 -12208 -35383 -71664 -118994 -109905
16425 -109905 -43455 -29636 -17319 28 -1996 -6808 3323 7983 -34422 -41519 -30719 -3111
$$ packed form
16511A95858m4881r598k9436o0834q84P733J5994K8792l0661J9322N1655L8662
16499A81722J4386j6928j1066N066L1160J0477j0256k7838n1509n9684m7866L492
16487B1156K0036k138K3020L1683R664p438P141j4778k5037K3817P209Q366l3993
16474F8708L705m54j5073k7960P460j0786K0614L6942K9451j9343k7253k4965
16462D1046J4748k2572j2392L9512J3626N792l6429j8519k2393R075r708P419
16450I205j8114N241L9691J4383J9001l2078k6249j3168K4599j6537n111j9097
16438a8234k198j9528K3376j4159K789R516K539O845l154k3175l6281m7330R089
16425a09905O6450J3819J2317J7347k024m812J0131M660m2405p097J0800K7608
$$ plain form
16413 -3111 -17837 -51141 -57433 -56857 -23699 -47313 -72372 -70823 -44591 -10270 28204 50657 10972
16400 10972 -46541 -102657 -98216 -79335 -93952 -71547 -45155 11171 13364 -17569 -28092 -42685
16388 -42685 -34489 -43395 -19681 -11761 23772 69980 60778 23055 -13939 -678 -9885 -34453 -81506
16375 -81506 -78476 -65900 -56569 -21626 -8031 -10173 -30473 -33688 2917 -71882 -146265 -163459
16363 -163459 -140639 -73437 -23880 -27731 -36661 10 46162 42035 21839 1853 4161 4600 15048
16350 15048 -5642 -70426 -31293 13603 -2600 -22439 2590 291 -5738 -23978 -47274 -26424
16338 -26424 -40103 -28369 -12671 -19663 -37369 -1715 36452 23950 50748 35994 -19017 -14144
16326 -14144 4362 16296 21307 -7542 -218 32448 42323 31799 20622 2690 44098 76842
$$ packed form
16413c111j4726l3304o292N76L3158k3614k5059J549K6232L4321L8474K2453l9685
16400A0972n7513n6116M441J8881j4617K2405K6392N6326K193l0933j0523j4593
16388d2685Q196q906K3714P920L5533M6208r202l7723l6994J3261r207k4568m7053
16375h1506L030J2576R331L4943J3595k142k0300l215L6605p4799p4383j7194
16363a63459K2820O7202M9557l851q930L6671M6152m127k0196j9986K308M39J0448
16350A5048k0690o4784L9133M4896j6203j9839K5029k299o029j8240k3296K0850
16338b6424j3679J1734J5698o992j7706L5654L8167j2502K6798j4754n5011M873
16326a4144J8506J1934N011k8849P324L2666R875j0524j1177j7932M1408L2744
$$ plain form
16314 76842 79142 128949 126778 147973 105808 82642 55982 59882 45810 43117 8261 -18509
16302 -18509 -56735 -90021 -69400 -60057 -33180 4233 -18647 -7220 -6741 21309 12458 -5484
16290 -5484 -2748 -23506 -53792 -36034 -33594 -4970 3134 15935 25936 55763 26135 22722 22769
16277 22769 17120 2966 5658 23438 73633 163802 224018 231108 192794 140465 112018 84996
16265 84996 84141 106808 110822 109680 140018 183763 211185 168159 103108 54108 58268 88192 88539
16252 88539 130363 207982 246953 216544 202929 183106 147584 109623 109976 73883 58073 136670
16240 136670 221993 228892 237037 212684 181567 163421 118727 77437 85489 79686 66722 50654
16228 50654 94979 105597 133761 104891 55528 17583 13408 59187 24534 -9082 189 9168
$$ packed form
16314G6842K300M9807k171K1195m2165k3166k6660L900j4072k693l4856k6770
16302a8509l8226l3286K0621R343K6877L7413k2880J1427M79K8050q851j7942
16290e484K736k0758l0286J7758K440K8624Q104J2801J0001K9827k9628l413M7
16277B2769n649j4154K692J7780N0195R0169O0216P090l8314n2329k8447k7022
16265H4996q55K2667M014j142L0338M3745K7422m3026o5051m9000M160K9924L47
16252H8539M1824P7619L8971l0409j3615j9823l5522l7961L53l6093j5810P8597
16240A36670Q5323O899Q145k4353l1117j8146m4694m1290Q052n803j2964j6068
16228E0654M4325J0618K8164k8870m9363l7945m175M5779l4653l3616R271Q979
$$ plain form
16216 9168 29078 30896 18772 -5328 -4918 -12697 -5425 -11437 -24712 -30574 -20157 -27520 -38091
16203 -38091 -51834 -71087 -55143 -76908 -70059 -34854 6794 28336 13366 8247 11833 2997
16191 2997 9330 -25570 -46172 -35528 -31412 -33269 -57573 -46499 -25491 -7809 43849 38950 21497
16178 21497 42849 67133 110475 164566 187808 244441 329202 409045 467240 493031 483138 468730
16166 468730 420530 353987 328422 228175 184604 181584 188499 163738 123046 91897 53387 19705
16154 19705 -24062 -55740 -24336 19154 33101 33781 61759 38361 21901 38783 87721 91149
16142 91149 92436 48963 11925 5594 -6171 -23391 -11798 -2408 -4001 16060 44045 8062
16130 8062 -9802 -14275 -36511 -59086 -38066 406 23239 16869 20701 33556 44904 18855
$$ packed form
16216I168J9910J818j2124k4100M10p779P272o012j3275n862J0417p363j0571
16203c8091j3743j9253J5944k1765O849L5205M1648K1542j4970n119L586q836
16191B997O333l4900k0602J0644M116j857k4304J1074K1008J7682N1658m899j7453
16178B1497K1352K4284M3342N4091K3242N6633Q4761P9843N8195K5791r893j4408
16166D68730m8200o6543k5565j00247m3571l020O915k4761m0692l1149l8510l3682
16154A9705m3767l1678L1404M3490J3947O80K7978k3398j6460J6882M8938L428
16142I1149J287m3473l7038o331j1765j7220J1593R390j593K0061K7985l5983
16130H062j7864m473k2236k2575K1020L8472K2833o370L832J2855J1348k6049
$$ plain form
16118 18855 39404 44569 10047 -32323 -81240 -76456 -29548 -21339 -45380 -73481 -77284 -67000
16106 -67000 -90034 -41493 11514 27191 4986 -20109 -24175 36294 43066 -837 6618 3538
16094 3538 -49472 -49575 -20687 22950 75805 52589 -3631 -35610 -24937 22918 21467 -32608
16082 -32608 -11356 -10439 -6055 -52181 -53682 -36987 -11379 -22293 8500 16655 1831 -20653 -47247
16069 -47247 -55215 -20426 -1897 -32710 -22142 23373 -24870 -70857 -61131 -35261 -35530 -85270
16057 -85270 -106523 -50041 -19788 15571 12613 -18260 -383 33818 22303 -41089 -51010 -64684
16045 -64684 -29344 -19577 -51518 -41172 -6565 -14468 -16317 -42051 -46494 16942 30854 4267
16033 4267 -29374 -42823 -66424 -74431 -70611 -66370 -82145 -31290 -551 -6771 -3420 -10683 -20922
$$ packed form
16118A8855K0549N165l4522m2370m8917M784M6908Q209k4041k8101l803J0284
16106f7000k3034M8541N3007J5677k2205k5095m066O0469O772m3903P455l080
16094C538n3010j03K8888M3637N2855k3216n6220l1979J0673M7855j451n4075
16082c2608K1252R17M384m6126j501J6695K5608j0914L0793Q155j4824k2484k6594
16069d7247p968L4789J8529l0813J0568M5515m8243m5987R726K5870k69m9740
16057h5270k1253N6482L0253L5359k958l0873J7877L4201j1515o3392r921j3674
16045f4684L5340R767l1941J0346L4607p903j849k5734m443O3436J3912k6587
16033D267l3641j3449k3601q007L820M241j5775N0855L0739o220L351p263j0239
$$ plain form
16020 -20922 -46737 -59604 -89326 -71768 -61262 -53674 -33517 -48700 -51539 -21670 10221 134
16008 134 -58410 -89311 -82402 -85639 -76782 -58813 -63904 -65507 -52424 -18700 -235 30885 15483
15995 15483 -18762 -17738 -5299 -6095 51055 61178 41208 23299 3740 6367 161 -15208 -17862
15982 -17862 -36741 -65787 -82034 -39321 -50353 -82744 -47300 -34703 -44229 -19169 19004 42372
15970 42372 30909 -5294 -57417 -47314 -3061 20625 11122 -13295 -14469 -32609 -33088 20921
15958 20921 10380 -8514 17864 14810 33572 28807 36394 9979 -27338 -57508 -79940 -90332
15946 -90332 -82311 -68151 -33153 -22386 -29318 -45251 -55484 -45128 -64906 -50632 -35952 -69163
15934 -69163 -39391 -5916 -27700 -51572 12691 44930 34655 33235 49925 4973 -30316 -27278
$$ packed form
16020b0922k5815j2867k9722J7558J0506P588K0157j5183k839K9869L1891j0087
16008A34n8544l0901O909l237Q857J7969n091j603J3083L3724J8465L1120j5402
15995A5483l4245J024J2439p96N7150J0123j9970j7909j9559K627o206j5369k654
15982a7862j8879k9046j6247M2713j1032l2391L5444J2597r526K5060L8173K3368
15970D2372j1463l6203n2123J0103M4253K3686r503k4417j174j8140m79N4009
15958B0921j0541j8894K6378l054J8762m765P587k6415l7317l0170k2432j0392
15946i0332Q021J4160L4998J0767o932j5933j0233J0356j9778J4274J4680l3211
15934f9163K9772L3475k1784k3872O4263L2239j0275j420J6690m4952l5289L038
$$ plain form
15922 -27278 -16367 -19770 -36729 -18057 -40825 -56529 -55518 -48724 -54418 -26299 -32321 -35724 2160
15909 2160 -10050 -8338 -36411 -52646 -46411 -21437 -6459 -16371 -64402 -112642 -98972 -94189 -90773
15896 -90773 -68825 -56871 -42872 -22048 6549 639 -44827 -65776 -51625 -7229 -24084 -13562
15884 -13562 -20582 -4506 12374 75561 77173 24770 10752 20883 27878 5835 -5885 -50938
15872 -50938 -70013 -50392 -65813 -97464 -101384 -128893 -108659 -68278 -61594 -20566 8257 -33043
15860 -33043 -53533 -22301 63573 61519 36107 30053 -45307 -60547 -10269 -8879 -27839 -34337
15848 -34337 -47474 -91545 -126908 -103645 -105192 -71471 -42219 -50228 -39365 -9933 23684 13728
15836 13728 24196 4715 -20380 -17304 -4523 4737 3390 -5247 -75419 -101773 -104409 -114168 -126851
$$ packed form
15922b7278J0911l403j6959J8672k2768j5704J011O794n694K8119o022l403L7884
15909B160j2210J712k8073j6235O235K4974J4978r912m8031m8240J3670M783L416
15896i0773K1948J1954J3999K0824K8597n910m5466k0949J4151M4396j6855J0522
15884a3562p020J6076J6880O3187J612n2403j4018J0131O995k2043j1720m5053
15872e0938j9075J9621j5421l1651l920k7509K0234M0381O684M1028K8823m1300
15860c3043k0490L1232Q5874k054k5412o054p5360j5240N0278J390j8960o498
15848c4337j3137m4071l5363K3263j547L3721K9252q009J0863K9432L3617r956
15836A3728J0468j9481k5095L076J2781R260j347q637p0172k6354k636r759j2683
$$ plain form
15823 -126851 -103555 -102778 -70017 -40628 -33782 -29221 1427 6927 -17207 -30622 -10164 -16182 -55834
15810 -55834 -69010 -86611 -86956 -101024 -111919 -99044 -75379 -52855 -20244 13961 -11820 -81853
15798 -81853 -102385 -80811 -50841 -53081 -40512 -42202 -66279 -42672 -45390 -74359 -83641 -88706 -66435
15785 -66435 -52607 -43321 -51992 -71217 -71772 -62548 -25912 -43562 -72749 -49050 -20552 20227 14185
15772 14185 8289 26578 27078 9840 -6707 -42195 -46251 -39124 -16881 -2005 9457 41182 83769
15759 83769 31731 -34631 -52255 -86325 -89426 -64379 -84249 -42899 -14006 -13856 -34563 -61592
15747 -61592 -61241 941 30232 15853 -4486 -54713 -32690 3605 35840 32213 20673 8687
15735 8687 -18095 -38286 -45498 -4199 1123 6886 28888 36444 8443 -9821 -14009 -42613 -32777
$$ packed form
15823a26851K3296P77L2761K9389O846M561L0648N500k4134j3415K0458o018l9652
15810e5834j3176j7601l45j4068j0895J2875K3665K2524L2611L4205k5781p0033
15798h1853k0532K1574K9970k240J2569j690k4077K3607k718k8969r282n065K2271
15785f6435J3828R286q671j9225n55R224L6636j7650k9187K3699K8498M0779o042
15772A4185n896J8289N00j7238j6547l5488m056P127K2243J4876J1462L1725M2587
15759H3769n2038o6362j7624l4070l101K5047j9870M1350K8893J50k0707k7029
15747f1592L51O2182K9291j4379k0339n0227K2023L6295L2235l627j1540j1986
15735H687k6782k0191p212M1299N322N763K2002P556k8001j8264m188k8604R836
$$ plain form
15722 -32777 -55526 -74481 -61909 -30062 -26693 -29167 -43011 -26824 -16727 -15291 -26919 -36733
15710 -36733 -17028 -37907 -47856 -5055 13258 2453 -17442 4246 54634 63726 42524 27037
15698 27037 -9395 14835 30672 30441 -18055 -36304 -26966 4346 -15254 -49385 -65850 -31417
15686 -31417 8597 23265 -14248 -12212 -1826 -8579 -3951 3439 38775 15531 3388 -15918
15674 -15918 -19645 -69273 -105532 -105560 -65696 -53185 -17138 15733 68 8610 1722 -13252 -2537
15661 -2537 -16965 -4739 -2622 -30591 -53508 -69082 -39584 -20289 -27293 -64888 -86266 -59936
15649 -59936 -37576 -37283 -9322 -68729 -80726 -78147 -79227 -80050 -63568 -86201 -100486 -83323 -97181
15636 -97181 -64421 -45982 -86158 -151373 -114968 -32375 -775 -32659 -30999 -46991 -74573 -40440
$$ packed form
15722c2777k2749j8955J2572L1847L369k474j3844J6187J0097J436j1628r814
15710c6733J9705k0879r949M2801J8313j0805j9895K1688N0388R092k1202j5487
15698B7037l6432K4230J5837k31m8496j8249R338L1312j9600l4131j6465L4433
15686c1417M0014J4668l7513K036J0386o753M628P390L5336k3244j2143j9306
15674a5918l727m9628l6259k8L9864J2511L6047L2871j5665Q542o888j4974J0715
15661b537j4428J2226K117k7969k2917j5574K9498J9295p004l7595k1378K6330
15649e9936K2360K93K7961n9407j1997K579j080q23J6482k2633j4285J7163j3858
15636i7181L2760J8439m0176o5215L6405Q2593L1600l1884J660j5992k7582L4133
$$ plain form
15624 -40440 -12518 -45061 -32519 -18220 -43720 -54414 -38549 -46319 -30558 29240 69004 44512
15612 44512 -8543 -25163 -37917 -21980 -39049 -80402 -40328 -28054 -23145 -2350 -9071 24305
15600 24305 -19371 -36724 -16621 -700 -1778 -12390 -31837 -42249 -32501 -40729 -37935 -75039
15588 -75039 -100045 -120144 -95427 -56452 -48693 -33843 -58393 -41390 -31727 -63430 -62903 -81534
15576 -81534 -59093 -42584 -88763 -87449 -87546 -117610 -76712 -10275 13196 4354 -24941 -37543 -60280
15563 -60280 -95227 -67894 -66505 -54028 -38937 -100223 -92075 -63785 -50632 -35538 -4473 9649
15551 9649 31105 -26191 -60918 -74963 -25694 -28369 -55065 -97034 -64564 -50788 -56975 -46838
15539 -46838 -35828 -36006 -28146 -18369 -26010 -52890 -70687 -30331 10175 15974 3948 47161 57831
$$ packed form
15624d0440K7922l2543J2542J4299k5500j0694J5865p770J5761N9798L9764k4492
15612D4512n3055j6620j2754J5937j7069m1353M0074J2274M909K0795o721L3376
15600B4305m3676j7353K0103J5921j078j0612j9447j0412R748q228K794l7104
15588g5039k5006k0099K4717L8975P759J4850k4550J7003R663l1703N27j8631
15576h1534K2441J6509m6179J314r7l0064M0898O6437K3471q842k9295j2602k2737
15563f0280l4947K7333J389J2477J5091o1286Q148K8290J3153J5094L1065J4122
15551I649K1456n7296l4727j4045M9269k675k6696m1969L2470J3776o187J0137
15539d6838J1010j78P860R777p641k6880j7797M0356M0506N799j2026M3213J0670
$$ plain form
15526 57831 48594 40455 12041 -15623 -11648 -1650 -6456 -17426 -10416 -11925 -27475 -10218 27977
15513 27977 64892 33575 -46240 -46201 -16917 19558 1645 -47925 -81933 -78287 -56025 -23354
15501 -23354 -385 3736 2520 -9984 5605 4349 19451 4604 -25549 -42667 -29397 -1154
15489 -1154 12248 14580 -27344 -60696 -59073 -75229 -45535 -34117 -18105 -18504 -49736 -19302 23433
15476 23433 22113 -31273 -49033 -19024 -42157 -33719 -12057 -4682 -36581 -28352 -21024 -9821 -36081
15463 -36081 -65422 -47283 -28385 -24338 -73676 -108611 -103456 -69558 -67466 -51648 -27693 -36388
15451 -36388 -53122 -51863 -27041 -5210 3577 14095 -1271 -28221 -35995 -19839 -15614 -1259
15439 -1259 1072 -24169 -26178 -5761 -3117 -40938 -38357 -118576 -143206 -126081 -100354 -74413 -58253
$$ packed form
15526E7831r237q139k8414k7664L975R998m806j0970P010j509j5550J7257L8195
15513B7977L6915l1317p9815L9K9284L6475j7913m9570l4008L646K2262L2671
15501b3354K2969M121j216j2504J5589j256J5102j4847l0153j7118J3270K8243
15489a154J3402K332m1924l3352J623j6156K9694J1418J6012l99l1232L0434M2735
15476B3433j320n3386j7760L0009k3133Q438K1662P375l1899Q229P328J1203k6260
15463c6081k9341J8139J8898M047m9338l4935N155L3898K092J5818K3955q695
15451c6388j6734J259K4822K1831Q787J0518j5366k6950p774J6156M225J4355
15439a259K331k5241k009K0417K644l7821K581q0219k4630J7125K5727K5941J6160
$$ plain form
15426 -58253 -83731 -80743 -16172 8330 -2044 -18389 -26295 -5673 -24506 -57429 -44517 -12069
15414 -12069 18301 -519 -24169 -49296 -80371 -121149 -101950 -77846 -80282 -103794 -64803 -43213
15402 -43213 -91524 -111616 -76223 -66964 -62333 -46727 -60721 -22508 -8399 17223 -28808 -6519
15390 -6519 -32849 -43241 -7959 -3185 12428 7670 190 -5491 25185 21278 30305 18966 -1149
15377 -1149 2039 23856 19508 1800 11630 -24723 -27212 -42565 -32369 -57940 -72258 -60765 -43123
15364 -43123 -15939 -9343 -17727 -3332 -3054 -29498 -47168 -56594 -36826 -56405 -126390 -87593 -64943
15351 -64943 -95210 -61373 -68342 -59340 -38482 -33126 -58484 -59933 -32851 -59845 -86853 -102638
15339 -102638 -117279 -99393 -46697 -35307 -62875 -39566 -45172 -48740 -62303 -55695 5998 -17641
$$ packed form
15426e8253k5478K988O4571K4502j0374j6345p906K0622j8833l2923J2912L2448
15414a2069L0370j8820k3650k5127l1075m0778J9199K4104k436k3512L8991K1590
15402d3213m8311k0092L5393R259M631J5606j3994L8213J4109K5622m6031K2289
15390f519k6330j0392L5282M774J5613m758p480n681L0676l907R027j1339k0115
15377a149L188K1817m348j7708R830l6353k489j5353J0196k5571j4318J1493J7642
15364d3123K7184O596q384J4395K78k6444j7670r426J9768j9579o9985L8797K2650
15351f4943l0267L3837o969R002K0858N356k5358j449K7082k6994k7008j5785
15339a02638j4641J7886N2696J1390k7568K3309n606l568j3563O608O1693k3639
$$ plain form
15327 -17641 -65722 -125555 -82212 -4020 12876 5335 57929 45799 58826 59634 54075 12286
15315 12286 -23747 -6104 -11861 -45543 -89121 -26437 38040 20245 -7 26933 -1901 -46474
15303 -46474 -34589 -49907 -51892 -31483 -4800 24060 28428 42804 22975 27232 43433 56966
15291 56966 34515 -14815 -67743 -97042 -63304 -51913 -21858 -32210 -76515 -122885 -150752 -147029
15279 -147029 -104948 -41841 -42157 -37115 -54863 -72618 -76953 -85385 -82552 -43519 1822 1071 -15123
15266 -15123 -42228 -42416 -65602 -113050 -104229 -97180 -74042 -67668 -62089 -69965 -67738 -40983 -54370
15253 -54370 -80785 -73732 -105690 -75472 -29845 -8542 -10645 -37223 -43381 -79223 -68280 -60355
15241 -60355 -55161 -49194 -26425 -32228 -59448 -87786 -92909 -122694 -114639 -103850 -104759 -129013 -127852
$$ packed form
15327a7641m8081n9833M3343P8192J6896p541N2594j2130J3027Q08n559m1789
15315A2286l6033J7643n757l3682m3578O2684O4477j7795k0252K6940k8834m4573
15303d6474J1885j5318j985K0409K6683K8860M368J4376j9829M257J6201J3533
15291E6966k2451m9330n2928k9299L3738J1391L0055j0352m4305m6370k7867L723
15279a47029M2081O3107l16N042j7748j7755m335q432K833L9033M5341p51j6194
15266a5123k7105j88k3186m7448Q821P049K3138O374N579p876K227K6755j3387
15253e4370k6415P053l1958L0218M5627K1303k103k6578o158l5842J0943P925
15241f0355N194N967K2769n803k7220k8338n123k9785Q055J0789r09k4254J161
$$ plain form
15228 -127852 -80636 -51347 -23882 22665 15315 -47802 -57424 -8255 27127 36550 15930 -37699
15216 -37699 -66097 -93380 -53072 -18740 -23205 -35616 -31914 -2714 -43285 -41300 -26685 -37538
15204 -37538 -45051 -24890 -2968 -43956 -75075 -55937 -49969 -47313 -59937 -39648 -2780 6776
15192 6776 19909 27533 33401 27988 1842 -17064 -17263 7438 -3545 -9927 -24162 -56182 -11103
15179 -11103 -15096 -93461 -110983 -91841 -43610 -4777 -26772 -23977 19829 35654 9076 -16768
15167 -16768 -47721 -14854 2776 562 -54262 -44780 -33543 -29241 -10381 -7083 -5930 -13471 22112
15154 22112 34156 25955 -7881 -22828 -30819 -34166 -46725 -41024 -13907 7001 -28617 -48981
15142 -48981 -49109 -77880 -85680 -66438 -7296 -12120 -5224 28086 33574 35825 43698 6001 -1807
$$ packed form
15228a27852M7216K9289K7465M6547p350o3117r622M9169L5382R423k0620n3629
15216c7699k8398k7283M0308L4332m465j2411L702K9200m0571J985J4615j0853
15204c7538p513K0161K1922m0988l1119J9138N968K656j2624K0289L6868R556
15192F776J3133P624N868n413k6146j8906j99K4701j0983o382j4235l2020M5079
15179a1103l993p8365j7522J9142M8231L8833k1995K795M3806J5825k6578k5844
15167a6768l0953L2867J7630k214n4824R482J1237M302J8860L298J153p541L5583
15154B2112J2044q201l3836j4947p991l347j2559N701K7117K0908l5618k0364
15142d8981j28k8771p800J9242N9142m824O896L3310N488K251P873l7697p808
$$ plain form
15129 -1807 -48416 -93102 -89912 -70453 -41040 -31015 -55007 -50563 -26298 23458 6718 -36367
15117 -36367 -50204 -54159 -62703 -77195 -101928 -116140 -95199 -31910 -27771 -39204 -12237 15471
15105 15471 34566 16187 7117 28295 22895 27338 -30763 -76840 -65581 -33485 9650 -6759
15093 -6759 -37301 -28085 -7058 -45455 -42090 -24359 -5996 902 -13120 -44197 -93956 -69687
15081 -69687 -46037 5956 12798 -9493 -885 36820 35877 266 -13601 -17485 21180 -10600 -31209
15068 -31209 -22437 -38977 -28139 -13034 -4694 2353 -8407 -16155 -35508 -62672 -54120 -22638 24975
15055 24975 34960 28814 11915 7427 59095 42562 1534 -38471 -39457 -7942 9266 -5464 29266
15042 29266 77051 79033 76491 70939 71909 50044 42304 8572 -30729 -43440 -30699 -31344 -14718
$$ packed form
15129a807m6609m4686L190J9459K9413J0025k3992M444K4265M9756j6740m3085
15117c6367j3837l955q544j4492k4733j4212K0941O3289M139j1433K6967K7708
15105A5471J9095j8379r070K1178n400M443n8101m6077J1259L2096M3135j6409
15093f759l0542R216K1027l8397L365J7731J8363O898j4022l1077m9759K4269
15081f9687K3650N1993O842k2291Q608L7705r43l5611j3867l884L8665l1780k0609
15068c1209Q772j6540J0838J5105Q340P047j0760p748j9353k7164Q552L1482M7613
15055B4975R985o146j6899m488N1668j6533m1028m0005r86L1515J7208j4730L4730
15042B9266M7785J982k542n552R70k1865p740l3732l9301j2711J2741o45J6626
$$ plain form
15029 -14718 -17307 1526 7700 306 23378 20073 35898 37133 -13187 -37782 -41921 -5412 -11980
15016 -11980 -43643 -35326 -44579 -43323 -29679 -37841 -16905 -32332 -4496 34037 -26386 -55874
15004 -55874 -36855 -60216 -56439 -54081 -35180 -20502 -28543 -27514 -12492 -11917 37702 54529 29707
14991 29707 13039 -4236 -45542 -30380 -12464 4274 9287 -13152 -32555 -49813 -20370 15139
14979 15139 8525 -26733 -27399 -9287 -7607 20080 6117 31410 61906 38692 24258 2634
14967 2634 30059 -13224 -17865 2643 12520 20270 37808 69051 91216 93757 60855 58030 56554
14954 56554 86876 71775 48477 23905 -20072 12752 24856 30085 20736 -30397 -80450 -105216
14942 -105216 -98916 -75427 -56350 -38134 -76027 -58135 -37576 -7386 18213 -42845 -67258 -24967
$$ packed form
15029a4718k589J8833O174p394K3072l305J5825J235n0320k4595m139L6509o568
15016a1980l1663Q317r253J256J3644q162K0936j5427K7836L8533o0423k9488
15004e5874J9019k3361L777K358J8901J4678q041J029J5022N75M9619J6827k4822
14991B9707j6668j7275m1306J5162J7916J6738N013k2439j9403j7258K9443L5509
14979A5139o614l5258o66J8112J680K7687j3963K5293L0496k3214j4434k1624
14967B634K7425m3283m641K0508R877P750J7538L1243K2165K541l2902k825j476
14954E6554L0322j5101k3298k4572m3977L2824J2104N229r349n1133n0053k4766
14942a05216O300K3489J9077J8216l7893J7892K0559L0190K5599o1058k4413M2291
$$ plain form
14930 -24967 -35741 -39302 -26599 -1437 -14799 -39940 -76133 -70569 -60594 -73169 -35629 18647
14918 18647 26782 43796 -6583 -63960 -17299 18105 19540 10048 3519 -51522 -73600 -68300 -5104
14905 -5104 28065 -8292 -23895 -9530 21993 7848 -23891 -31554 29100 36902 37530 -2554 15275
14892 15275 20110 46112 39536 39450 33957 15658 22391 31421 41634 62866 54490 57481 58664 40179
14878 40179 -29976 -60063 -60114 -30313 7648 44350 66392 79510 60085 58600 28093 23113 35805
14865 35805 20658 -7399 -44494 -3614 40525 13065 -3055 -2898 7251 29919 -15600 -38328
14853 -38328 -55770 -35199 -37676 -46484 -32412 -53286 -39386 -24973 -38007 -30518 472 -7388
14841 -7388 8131 32170 16394 -19912 -87012 -82848 -84936 -91626 -40548 -87189 -86528 -63662 -25689
$$ packed form
14930b4967j0774l561J2703K5162j3362k5141l6193N564R975j2575L7540N4276
14918A8647Q135J7014n0379n7377M6661L5404J435r492o529n5041k2078N300O3196
14905e104L3169l6357j5603J4365L1523j4145l1739p663O0654P802O28m0084J7829
14892A5275M835K6002o576q6n493j8299O733R030J0213K1232q376K991J183j8485
14878D0179p0155l0087n1K9801L7961L6702K2042J3118j9425j485l0507m980J2692
14865C5805j5147k8057l7095M0880M4139k7460j6120J57J0149K2668m5519k2728
14853c8328j7442K0571k477q808J4072k0874J3900J4413j3034P489L0990p860
14841g388J5519K4039j5776l6306o7100M164k088o690N1078m6641O61K2866L7973
$$ plain form
14828 -25689 -7014 -12961 13465 4678 -40457 1689 11766 -34621 -18473 -4482 2832 36283
14816 36283 16729 29069 44963 26652 18246 -10698 8163 27825 20033 24321 48706 -3734
14804 -3734 -59883 -41753 -24922 -16598 -20081 4 2475 -22998 -806 5954 3192 34231 24591
14791 24591 -34783 -16979 -3412 -18654 -43129 -40884 -15184 -2901 8465 -25486 -32041 -38729
14779 -38729 -12681 -55289 -68549 -41859 800 -2856 -8088 3438 34973 57360 68412 27834
14767 27834 6377 -8843 -6150 -23663 -36430 -29178 -25155 22192 27806 23881 7768 15866 33134
14754 33134 45520 55034 76538 74935 41993 67838 76183 85680 71436 63780 40961 8367 3974
14741 3974 -32938 -69779 -39785 -36897 -46713 -40973 -3243 25106 17467 11413 51806 74300 55040
$$ packed form
14828b5689J8675n947K6426q787m5135M2146J0077m6387J6148J3991P314L3451
14816C6283j9554J2340J5894j8311q406k8944J8861J9662p792M288K4385n2440
14804c734n6149J8130J6831Q324l483K0085K471k5473K2192O760k762L1039r640
14791B4591n9374J7804J3567j5242k4475K245K5700J2283J1366l3951o555o688
14779c8729K6048m2608j3260K6690M2659l656n232J1526L1535K2387J1052m0578
14767B7834k1457j5220K693j7513j2767P252M023M7347N614l925j6113Q098J7268
14754C3134J2386R514K1504j603l2942K5845Q345R497j4244p656k2819l2594m393
14741C974l6912l6841K9994K888r816N740L7730K8349p639o054M0393K2494j9260
$$ plain form
14728 55040 36181 -13841 -27705 -49606 -65710 -80072 -19892 20863 -13994 -15079 8420 -11481
14716 -11481 -14895 -8211 11028 40353 77873 62920 43010 23090 13623 51976 75981 77882
14704 77882 109104 129577 155015 233125 323932 342845 329498 326148 274749 193049 137343 131756
14692 131756 119632 131997 141998 120086 55900 38803 2627 -3640 -2724 8959 17621 9915
14680 9915 35663 83945 55706 48615 46724 -26386 -60269 -41836 -25765 -44084 -19639 6849
14668 6849 2114 -15947 -590 10311 9298 -20077 -26157 -28690 -60381 -49513 -27756 3447 60739
14655 60739 72816 30908 -3076 -3190 35687 18713 -1102 3576 -14160 -20552 107 11358
14643 11358 -13244 -11464 4808 -4433 -8895 12011 40199 11802 -8225 13347 38637 57706
$$ packed form
14728E5040j8859n0022j3864k1901j6104j4362O0180M0755l4857j085K3499j9901
14716a1481l414O684J9239K9325L7520j4953j9910j9920r467L8353K4005J901
14704G7882L1222K0473K5438P8110R0807J8913j3347l350n1399q1700n5706n587
14692A31756j2124J2365J0001k1912o4186j7097l6176o267R16J1683Q662p706
14680I915K5748M8282k8239p091j891p3110l3883J8433J6071j8319K4445K6488
14668F849m735j8061J5357J0901j013k9375o080k533l1691J0868K1757L1203N7292
14655F0739J2077m1908l3984j14L8877j6974j9815M678j7736o392K0659J1251
14643A1358k4602J780J6272r241m462K0906K8188k8397k0027K1572K5290J9069
$$ plain form
14631 57706 20249 -18110 -35766 33906 26972 -6768 1170 7140 -31213 8055 -20312 -36413
14619 -36413 -23155 -29209 -29597 461 5290 -9970 15257 24759 24906 25875 28947 -12366 -19307 -7814
14605 -7814 9905 19460 38742 -612 -16262 -14291 -36018 -75847 -33622 -44417 -74588 -129003
14593 -129003 -98564 -38594 -17522 -14650 -34112 -38202 -5430 -4154 40751 74611 93929 87175
14581 87175 40157 44074 55500 54844 32584 39717 35791 46629 25603 14734 19700 29728 16469
14568 16469 48421 41212 30787 35418 65441 38443 30053 31328 -10641 -20509 -20833 -39932 -29282
14555 -29282 -32803 -28968 -21250 -40608 -36595 -65734 -59738 -8475 21709 -10141 -27107 -31393 1041
14542 1041 6538 15015 -26191 -44591 -58938 -34248 -20449 -18100 -27023 -10619 5948 27709 28610
$$ packed form
14631E7706l7457l8359j7656O9672o934l3740P938N970l8353L9268k8367j6101
14619c6413J3258o054l88L0058M829j5260K5227R502J47R69L072m1313o941J1493
14605g814J7719R555J9282l9354j5650J971k1727l9829M2225j0795l0171n4415
14593a29003L0439N9970K1072K872j9462m090L2772J276M4905L3860J9318o754
14581H7175m7018L917J1426o56k2260P133l926J0838k1026j0869M966J0028j3259
14568A6469L1952p209j0425M631L0023k6998q390J275m1969r868l24j9099J0650
14555b9282l521L835P718j9358M013k9139N996N1263L0184l1850j6966m286L2434
14542A041N497Q477m1206j8400j4347K4690J3799K349q923J6404J6567K1761R01
$$ plain form
14529 28610 3179 3416 17670 40052 40103 18226 10824 34248 14104 -19630 -55689 -79507 -86974
14516 -86974 -55121 -44375 -14116 -18612 -18132 40210 54912 17170 -3508 20944 44485 71888
14504 71888 80548 63595 50748 27793 62868 47581 71720 47542 8302 32290 63599 30299
14492 30299 12894 43850 59913 57104 30792 18067 22431 16970 37942 60309 44297 42379
14480 42379 61654 63301 74136 119467 90311 117482 153902 169717 196628 189522 167872 198198
14468 198198 174620 214921 242372 246664 266370 260664 236930 231310 287778 285615 311179 333891
14456 333891 325952 281427 281654 359733 373454 349378 319052 315335 305222 315585 302689 281299
14444 281299 272611 305972 324464 305851 291488 256223 235922 226289 200415 172351 176684 130568
$$ packed form
14529B8610k5431K37J4254K2382N1k1877p402K3424k0144l3734l6059k3818p467
14516h6974L1853J0746L0259m496M80N8342J4702l7742k0678K4452K3541K7403
14504G1888Q660j6953j2847k2955L5075j5287K4139k4178l9240K3988L1309l3300
14492C0299j7405L0956J6063k809k6312j2725M364n461K0972K2367j6012j918
14480D2379J9275J647J0835M5331k9156K7171L6420J5815K6911p106k1650L0326
14468A98198k3578M0301K7451M292J9706n706k3734n620N6468k163K5564K2712
14456C33891p939m4525K27P8079J3721k4076l0326l717j0113J0363j2896k1390
14444B81299q688L3361J8492j8613j4363l5265k0301r633k5874k8064M333m6116
$$ plain form
14432 130568 104942 79909 89430 107757 97710 115701 127479 122445 171898 161614 95480 77189
14420 77189 85965 118662 113650 114694 60126 13564 -9633 26523 61124 62791 91961 74283
14408 74283 16541 -692 37859 94798 119447 73874 13942 -14382 7994 27328 42079 17147
14396 17147 32585 51978 12115 23503 19388 -22334 -21033 -3283 14097 19075 32932 30678
14384 30678 61237 72429 38132 12989 8785 -7507 842 18220 20689 27599 2633 -8402
14372 -8402 35992 22828 53141 82840 70319 7958 5315 42567 45465 38520 11364 -16350
14360 -16350 6985 48783 63165 62829 67626 92212 106107 87973 62847 38311 38917 50401 78615
14347 78615 45932 -8880 -1074 3655 9224 40586 61204 62249 48798 47744 60073 63390 23814
$$ packed form
14432A30568k5626k5033R521J8327j0047J7991J1778n034M9453j0284o6134j8291
14420G7189Q776L2697n012J044n4568m6562k3197L6156L4601J667K9170j7678
14408G4283n7742j7233L8551N6939K4649m5573n9932k8324K2376J9334J4751k4932
14396A7147J5438J9393l9863J1388m115m1722J301J7750J7380M978J3857k254
14384C0678L0559J1192l4297k5143m204j6292Q349J7378K469O910k4966j1035
14372h402M4394j3164L0313K9699j2521o2361k643L7252K898o945k7156k7714
14360a6350K3335M1798J4382l36M797K4586J3895j8134k5126k4536O06J1484K8214
14347G8615l2683n4812P806M729N569L1362K0618J045j3451j054J2329L317l9576
$$ plain form
14334 23814 -17411 -59451 -42676 -35254 -43027 -12589 3137 19739 38886 22221 36878 16887
14322 16887 -9485 -41090 -35262 -9332 -6567 -9428 -23398 -19400 -12166 1814 25216 47255 32948
14309 32948 49550 57096 25923 -11938 -39572 20333 32622 18111 48052 67067 88533 83803
14297 83803 83394 92829 24952 -5202 9042 -5584 -22618 -24960 -45792 13924 55038 53343 12712
14284 12712 -401 -19449 -28470 -83336 -84162 -33873 -2328 -5438 53172 103984 99721 109274 80979
14271 80979 70525 78811 82375 61770 37411 55988 69820 9233 -9546 -10837 16166 82491
14259 82491 109582 83150 83702 88970 65771 47663 84664 62033 35332 8373 21597 86139
14247 86139 88739 83392 81550 35343 9951 27667 23346 3639 -34034 -26300 -11997 13480 63677
$$ packed form
14334B3814m1225m2040J6775P422p773L0438J5726J6602J9147j6665J4657j9991
14322A6887k6372l1605N828K5930K765k861j3970L998P234J3980K3402K2039j4307
14309C2948J6602P546l1173l7861k7634N9905J2289j4511K9941J9015K1466m730
14297H3803m09R435o7877l0154J4244j4626j7034k342k0832N9716M1114j695m0631
14284A2712j3113j9048r021n4866q26N0289L1545l110N8610N0812m263R553k8295
14271H0979j0454Q286L564k0605k4359J8577J3832o0587j8779j291K7003O6325
14259H2491K7091k6432N52N268k3199j8108L7001k2631k6701k6959J3224O4542
14247H6139K600n347j842m6207k5392J7716m321j9707l7673P734J4303K5477N0197
$$ plain form
14234 63677 92696 61877 31353 -26118 -37447 20035 58726 87373 79136 36936 36259 26000
14222 26000 18166 21494 41592 37360 -470 -24074 -9577 63258 54057 -13770 -40802 -28809
14210 -28809 4782 8778 -1518 -15833 12868 78176 131268 124350 111081 108356 76688 62107
14198 62107 63381 101249 127004 140873 139423 96287 71949 25383 30236 25247 -7142 1576 58805
14185 58805 78858 67873 22044 20847 18056 34994 103950 105392 96614 128781 98577 84404
14173 84404 36410 47469 39187 43211 39600 69133 77169 41514 82886 104934 57399 33995
14161 33995 78599 112103 112059 122872 123424 150960 142664 87128 40567 69755 108050 122660 124654
14148 124654 116582 97239 96448 129008 160967 171112 149352 133383 152924 196568 225683 227971
$$ packed form
14234F3677K9019l0819l0524n7471j1329N7482L8691K8647q237m2200o77j0259
14222B6000p834L328K0098m232l7830k3604J4497P2835r201o7827k7032J1993
14210b8809L3591L996j0296j4315K8701O5308N3092o918j3269k725l1668j4581
14198F2107J274L7868K5755J3869j450m3136k4338m6566M853m989l2389Q718N7229
14185E8805K0053j0985m5829j197k791J6938O8956J442q778L2167l0204j4173
14173H4404m7994J1059q282M024l611K9533Q036l5655M1372K2048m7535k3404
14161C3995M4604L3504m4J0813N52K7536q296n5536m6561K9188L8295J4610J994
14148A24654q072j9343p91L2560L1959J0145k1760j5969J9541M3644K9115K288
$$ plain form
14136 227971 259674 274281 241237 223319 227822 243494 236338 233047 267242 259810 234784 266435
14124 266435 282990 294610 318899 304091 309467 304385 299736 322977 303113 326843 351673 370515
14112 370515 357520 367677 433169 498756 510740 447399 414400 442441 450623 489173 528072 550217
14100 550217 524738 522644 533076 527467 522486 512015 532558 551744 614388 638414 594555 558033
14088 558033 585170 630031 618018 608729 626794 690248 659033 665191 653792 643638 681936 704981
14076 704981 722315 780209 785792 770260 777887 836178 813301 784798 810268 865716 930395 1018509
14064 1018509 1034165 1038068 1084082 1146927 1161322 1213936 1309772 1411368 1537708 1621983 1717707
14053 1717707 1804104 1935015 2068860 2195574 2342189 2495479 2623018 2825376 3074396 3356898
$$ packed form
14136B27971L1703J4607l3044j7918M503J5672p156l291L4195p432k5026L1651
14124B66435J6555J1620K4289j4808N376n082m649K3241j9864K3730K4830J8842
14112C70515j2995J0157O5492O5587J1984o3341l2999K8041Q182L8550L8899K2145
14100E50217k5479k094J0432n609m981j0471K0543J9186O2644K4026m3859l6522
14088E58033K7137M4861j2013r289J8065O3454l1215O158j1399j0154L8298K3045
14076G04981J7334N7894N583j5532P627N8291k2877k8503K5470N5448O4679Q8114
14064A018509J5656L903M6014O2845J4395N2614R5836J01596J26340Q4275R5724
14053A717707Q6397J30911J33845J26714J46615J53290J27539K02358K49020K82502
$$ plain form
14043 3356898 3650218 3997241 4382703 4767227 5263846 5789149 6300417 6896078 7629786
14034 7629786 8490193 9386524 10328634 11472618 12747257 14120116 15664168 17341065 19134185
14025 19134185 21099464 23197151 25368208 27587802 29883803 32155765 34438142 36707035
14017 36707035 38760970 40644560 42339356 43802658 45057050 46138707 47097648 47871580
14009 47871580 48512222 49084457 49563231 49944525 50311819 50651303 50998449 51284147 51594004
14000 51594004 51941500 52266453 52471498 52552667 52552122 52393539 52103766 51611349 50908128 50032673
13990 50032673 48889478 47466005 45857842 44041405 42120145 40110570 38028160 35933392
13982 35933392 33904938 31955425 30003771 28162166 26457097 24882025 23445461 22157687
$$ packed form
14043C356898K93320L47023L85462L84524M96619N25303N11268N95661P33708
14034G629786Q60407Q96331R42110J143984J274639J372859J544052J676897J793120
14025A9134185J965279K097687K171057K219594K296001K271962K282377K268893
14017C6707035K053935J883590J694796J463302J254392J081657R58941P73932
14009D7871580O40642N72235M78774L81294L67294L39484L47146K85698L09857
14000E1594004L47496L24953K05045Q1169n45j58583k89773m92417p03221q75455
13990E0032673j143195j423473j608163j816437j921260k009575k082410k094768
13982C5933392k028454j949513j951654j841605j705069j575072j436564j287774
$$ plain form
13974 22157687 20895447 19687720 18578140 17601643 16720326 15890053 15112572 14368408 13709022
13965 13709022 13135353 12511939 11948000 11447554 10961825 10505857 10155067 9832351 9457506
13956 9457506 9116092 8782926 8433084 8145910 7875698 7587126 7331816 7091859 6857873
13947 6857873 6646820 6432621 6222181 6003021 5766254 5655329 5547805 5399842 5179940
13938 5179940 5020868 4864575 4739033 4625484 4468980 4310190 4233674 4128739 4046764 3933184
13928 3933184 3820369 3720163 3650273 3576148 3456148 3312373 3215233 3131100 3087701 3020424
13918 3020424 2894911 2811427 2727790 2656696 2632622 2569127 2456096 2429851 2399543 2369877 2301299
13907 2301299 2195675 2147320 2085302 2024110 1962084 1851606 1802105 1749113 1737961 1724514 1677395
$$ packed form
13974B2157687j262240j207727j109580r76497q81317q30273p77481p44164o59386
13965A3709022n73669o23414n63939n00446m85729m55968l50790l22716l74845
13956I457506l41414l33166l49842k87174k70212k88572k55310k39957k33986
13947F857873k11053k14199k10440k19160k36767j10925j07524j47963k19902
13938E179940j59072j56293j25542j13549j56504j58790p6516j04935q1975j13580
13928C933184j12815j00206o9890p4125j20000j43775r7140q4133m3399o7277
13918C020424j25513q3484q3637p1094k4074o3495j13031k6245l0308k9666o8578
13907B301299j05624m8355o2018o1192o2026j10478m9501n2992j1152j3447m7119
$$ plain form
13896 1677395 1615818 1543325 1475085 1415047 1399033 1372322 1338205 1307136 1291336 1217612 1192245
13885 1192245 1155788 1120556 1100325 1120266 1123448 1097548 1029609 990050 954961 876156 848234
13874 848234 819133 807216 764851 727028 658649 581036 580365 606430 575727 494751 475473 519584
13862 519584 547844 555488 581971 544530 475257 433465 392776 426576 405509 365717 368159 381013
13850 381013 386188 385579 385982 399596 361349 301254 277971 303367 314736 310218 271772 249606 245871
13837 245871 234603 255163 245477 248614 282218 277942 283989 255424 246268 221704 204767 173844
13825 173844 131288 134397 151240 140043 107276 138004 196653 221911 184058 136932 120957 144747
13813 144747 139347 129893 132861 117875 112408 126961 169585 187473 162679 149774 162357 213542
$$ packed form
13896A677395o1577p2493o8240o0038j6014k6711l4117l1069j5800p3724k5367
13885A192245l6457l5232k0231J9941L182k5900o7939l9559l5089p8805k7922
13874H48234k9101j1917m2365l7823o8379p7613o71K6065l0703q0976j9278M4111
13862E19584K8260P644K6483l7441o9273m1792m0689L3800k1067l9792K442J2854
13850C81013N175o09M03J3614l8247o0095k3283K5396J1369m518l8446k2166l735
13837B45871j1268K0560r686L137L3604m276O047k8565r156k4564j6937l0923
13825A73844m2556L109J6843j1197l2767L0728N8649K5258l7853m7126j5975K3790
13813A44747n400r454K968j4986n467J4553M2624J7888k4794j2905J2583N1185
$$ plain form
13801 213542 203033 200504 220265 180332 130072 122584 131472 114842 72177 25726 23561 30396
13789 30396 67162 108116 149412 132402 131163 155000 157515 110699 103301 131829 132162 114274 102754
13776 102754 98193 97304 131401 157675 123811 124494 143011 145439 158023 177167 116646 141092 156902
13763 156902 148662 154923 146920 91062 53092 73114 136134 147470 156577 147848 128109 140155
13751 140155 176318 156515 134488 135876 99993 31140 14805 46308 105828 123767 104278 97034
13739 97034 44288 79869 135019 126302 98695 83141 109208 143607 149174 115966 107540 59612
13727 59612 34775 46842 48082 37039 4721 -12782 14380 32697 2323 17479 47103 41804
13715 41804 58805 36422 23559 1043 -29399 -20132 -46567 -25127 -6684 16137 -7842 -27828
$$ packed form
13801B13542j0509k529J9761l9933n0260p488Q888j6630m2665m6451k165O835
13789C0396L6766M0954M1296j7010j239K3837K515m6816p398K8528L33j7888j1520
13776A02754m561q89L4097K6274l3864O83J8517K428J2584J9144o0521K4446J5810
13763A56902q240O261q003n5858l7970K0022O3020J1336R107q729j9739J2046
13751A40155L6163j9803k2027J388l5883o8853j6335L1503N9520J7939j9489p244
13739I7034n2746L5581N5150q717k7607j5554K6067L4399N567l3208q426m7928
13727E9612k4837J2067J240j1043l2318j7503K7162J8317l0374J5156K9624n299
13715D1804J7001k2383j2863k2516l0442R267k6435K1440J8443K2821k3979j9986
$$ plain form
13703 -27828 18348 36113 33791 27072 15630 19503 1721 11764 26618 -9093 -28076 -32970
13691 -32970 -55987 -14579 4491 -24224 -11007 40931 70877 74728 70699 45606 27334 -12073
13679 -12073 -65945 -64925 -63148 -30765 -52897 -54201 -46189 -26408 1592 8485 -11646 -22326 5019
13666 5019 38258 19419 5538 9202 27258 25999 2431 -35582 -37984 -13012 524 -14574
13654 -14574 -23636 -11523 1953 -20858 -3477 15765 56713 23979 21781 43094 24266 44106
13642 44106 63139 47371 39557 -20186 -43451 -43787 -47298 -65487 -43968 -12983 13996 30892
13630 30892 12348 32038 35835 -31503 -14364 1866 11178 31683 -2693 -34712 -987 19541
13618 19541 17987 33519 744 -40093 -67091 -59019 -32169 3721 11049 -10875 -12083 3073
$$ packed form
13703b7828M6176J7765k322o719j1442L873j7782J0043J4854l5711j8983m894
13691c2970k3017M1408J9070k8715J3217N1938K9946L851m029k5093j8272l9407
13679a2073n3872J020J777L2383k2132j304Q012J9781K8000O893k0131j0680K7345
13666E019L3239j8839j3881L664J8056j259k3568l8013k402K4972J3536j5098
13654a4574r062J2113J3476k2811J7381J9242M0948l2734k198K1313j8828J9840
13642D4106J9033j5768p814n9743k3265l36l511j8189K1519L0985K6979J6896
13630C0892j8544J9690L797o7338J7139J6230R312K0505l4376l2019L3725K0528
13618A9541j554J5532l2775m0837k6998Q072K6850L5890P328k1924j208J5156
$$ plain form
13606 3073 -2909 -6024 -60127 -95287 -50964 21594 47138 79444 81969 67504 75211 95419 89758
13593 89758 70385 40126 37297 3029 -26622 -10637 18069 -11309 -53318 -35459 -7855 -21074
13581 -21074 -22383 -10670 14567 34766 47536 56557 40158 27074 41817 81062 115737 118422
13569 118422 121449 89560 67954 62135 98454 104304 122827 134055 177361 215714 193115 187055
13557 187055 199617 235465 303295 317561 320321 308596 298533 326659 356209 319627 238169 198975
13545 198975 250947 312226 344527 310725 278378 278536 276373 253770 225234 254968 263003 273776
13533 273776 277047 248119 248338 290108 314513 347018 354771 313498 287848 270222 247976 236817
13521 236817 234075 204380 180165 192607 165810 229711 186556 98355 92531 152509 178237 148804
$$ packed form
13606C073n982l115n4103l5160M4323P2558K5544L2306K525j4465P707K0208n661
13593H9758j9373l0259k829l4268k9651J5985K8706k9378m2009J7859K7604j3219
13581b1074j309J1713K5237K0199J2770R021j6399j3084J4743L9245L4675K685
13569A18422L027l1889k1606n819L6319N850J8523J1228M3306L8353k2599o060
13557A87055J2562L5848O7830J4266K760j1725j0063K8126K9550l6582q1458l9194
13545A98975N1972O1279L2301l3802l2347J58k163k2603k8536K9734Q035J0773
13533B73776L271k8928K19M1770K4405L2505P753m1273k5650j7626k2246j1159
13521B36817k742k9695k4215J2442k6797O3901m3155q8201n824N9978K5728k9433
$$ plain form
13509 148804 165474 170791 158128 115501 69154 49344 40216 42845 19639 55146 101725 127238
13497 127238 104680 64475 10518 -48806 -44700 -6930 11277 23430 39333 20216 -1245 20351
13485 20351 12465 24721 60577 18496 22412 56441 64767 49167 56039 23457 -23903 -37206
13473 -37206 -74370 -95621 -120280 -74518 11875 70798 58756 3952 34745 24099 2133 -16746
13461 -16746 5316 40999 42265 81942 65243 34328 76387 92154 92905 105261 87855 47163
13449 47163 17717 16602 38651 65428 65546 29751 -15274 9940 51674 79877 78371 50889
13437 50889 71995 54864 4265 -29203 -79301 -42193 -5670 2278 16294 6920 -23282 -29345
13425 -29345 -12437 3317 -3414 -17262 -25008 -19401 37329 83522 63324 12936 -28906 -18993
$$ packed form
13509A48804J6670N317j2663m2627m6347j9810r128K629k3206L5507M6579K5513
13497A27238k2558m0205n3957n9324M106L7770J8207J2153J5903j9117k1461K1596
13485B0351p886J2256L5856m2081L916L4029Q326j5600O872l2582m7360j3303
13473c7206l7164k1251k4659M5762Q6393N8923j2042n4804L0793j0646k1966j8879
13461a6746K2062L5683J266L9677j6699l0915M2059J5767P51J2356j7406m0692
13449D7163k9446j115K2049K6777J18l5795m5025K5214M1734K8203j506k7482
13437E0889K1106j7131n0599l3468n0098L7108L6523P948J4016r374l0202o063
13425b9345J6908J5754o731j3848p746N607N6730M6193k0198n0388m1842R913
$$ plain form
13413 -18993 -23856 9013 16391 3714 -15499 -1176 15199 17003 -15305 -56099 -70629 -43992
13401 -43992 -4793 19985 -2180 -32313 -17108 -3389 1297 -49565 -86229 -51524 -37724 -11570
13389 -11570 -22058 -50315 -43924 -48564 -42156 -4427 26337 -6836 17355 74883 47016 10666
13377 10666 -8766 19419 16801 22745 41129 71269 63340 24842 57986 80630 65900 42273
13365 42273 20447 30141 42995 58590 -3136 18645 46768 15499 -139 -2586 -14931 -26498
13353 -26498 6913 9004 18305 5126 8912 30484 55450 41435 5752 22472 1600 -24946
13341 -24946 -3740 -31970 -59565 -49647 23081 21854 -11427 -31301 15156 23558 48783 76123
13329 76123 48321 45968 40342 37780 33036 5504 -23050 42078 45368 -35000 -12545 -5236 -24185
$$ packed form
13413a8993m863L2869P378j2677j9213J4323J6375J804l2308m0794j4530K6637
13401d3992L9199K4778k2165l0133J5205J3719M686n0862l6664L4705J3800K6154
13389a1570j0488k8257O391m640O408L7729L0764l3173K4191N7528k7867l6350
13377A0666j9432K8185k618N944J8384L0140p929l8498L3144K2644j4730k3627
13365D2273k1826R694J2854J5595o1726K1781K8123l1269j5638k447j2345j1567
13353b6498L3411K091R301j3179L786K1572K4966j4015l5683J6720k0872k6546
13341b4946K1206k8230k7595R918P2728j227l3281j9874M6457Q402K5225K7340
13329G6123k7802k353n626k562m744k7532k8554O5128L290q0368K2455P309j8949
$$ plain form
13316 -24185 -61556 -96583 -87077 -1183 74765 63910 36082 28508 -33022 -31455 -58199 -31393
13304 -31393 29297 16155 13065 30788 23152 -14398 -23375 -30862 -51969 -71220 -53546 -42659
13292 -42659 -11414 35953 7681 -21770 3388 20977 26055 27663 30746 50879 81437 65282
13280 65282 19411 -28567 -30005 -31137 -4221 -34536 -54867 -71773 -53152 2971 44994 51867
13268 51867 42959 15252 102190 258255 379092 418500 390412 255154 167139 86611 52375
13257 52375 27168 8708 14560 38154 75712 111744 132420 94652 84681 97560 79586 92378
13245 92378 99009 104636 119733 230695 370662 615246 1005586 1494174 1902802 2094271 1911440
13234 1911440 1392753 974508 723840 591279 473763 391592 358834 300827 256527 253763
$$ packed form
13316b4185l7371l5027R506Q5894P5948j0855k7828p574o1530J567k6744K6806
13304c1393O0690j3142l090J7723p636l7550q977p487k1107j9251J7674J0887
13292d2659L1245M7367k8272k9451K5158J7589N078J608L083K0133L0558j6155
13280F5282m5871m7978j438j132K6916l0315k0331j6906J8621N6123M2023O873
13268E1867q908k7707Q6938J56065J20837L9408k8088j35258q8015q0528l4236
13257E2375k5207j8460N852K3594L7558L6032K0676l7768r971J2879j7974J2792
13245I2378O631N627J5097J10962J39967K44584L90340M88588M08628J91469j82831
13234A911440n18687m18245k50668j32561j17516q2171l2758n8007m4300k764
$$ plain form
13224 253763 250302 242721 236878 231590 200005 125785 116587 138369 152074 147686 131139 161006 144747
13211 144747 159566 173735 160201 166944 152500 132520 111477 137677 116412 115944 107809 50036
13199 50036 43786 27497 28372 31408 38511 35417 39829 53479 49504 45515 42469 31620 22495 58225
13185 58225 101589 115173 76052 72574 82920 71360 106333 127827 112389 34383 -22374 -18870
13173 -18870 -2511 -14597 -6735 -20849 21308 40843 59212 62092 16551 -20981 -15112 -19493
13161 -19493 -7364 -42002 -29823 11086 13248 38813 80479 64366 62922 50880 23841 15721
13149 15721 36755 -8835 -15945 23101 23882 63508 54934 42943 26306 12958 51752 50378 51908
13136 51908 53693 15910 -6834 4252 28215 53574 9001 -14737 15994 29881 -18391 -27836
$$ packed form
13224B53763l461p581n843n288l1585p4220r198K1782J3705m388j6547K9867j6259
13211A44747J4819J4169j3534O743j4444j9980k1043K6200k1265m68q135n7773
13199E0036o250j6289Q75L036P103l094M412J3650l975l989l046j0849r125L5730
13185E8225M3364J3584l9121l478J0346j1560L4973K1494j5438p8006n6757L504
13173a8870J6359j2086P862j4114M2157J9535J8369K880m5541l7532N869m381
13161a9493J2129l4638J2179M0909K162K5565M1666j6113j444j2042k7039q120
13149A5721K1034m5590p110L9046P81L9626q574j1991j6637j3348L8794j374J530
13136E1908J785l7783k2744J1086K3963K5359m4573k3738L0731J3887m8272r445
$$ plain form
13124 -27836 30044 58689 16426 -28568 -51948 -27052 14685 18640 3384 50077 98616 78238
13112 78238 73059 68764 47758 613 11764 3338 -56073 -50687 -57134 -40570 -4370 30245 37566
13099 37566 13829 -4097 -18543 -1879 13230 24968 -12565 -21231 14389 -678 -19870 -59990
13087 -59990 -106950 -90983 -43566 -18700 -42450 -27757 -2333 -6859 -2289 13816 26187 39049
13075 39049 12224 -6808 16488 49702 60527 47121 90703 37997 -16273 -1152 15002 5849
13063 5849 -7185 22387 30670 19370 7302 23620 44971 63024 86931 142129 188015 161266
13051 161266 135027 137553 139734 118877 101674 81414 92382 97447 68446 50796 23433 34777
13039 34777 41069 7422 46540 69614 93174 133316 127737 105006 64644 12416 32573 88550
$$ packed form
13124b7836N7880K8645m2263m4994k3380K4896M1737L955j5256M6693M8539k0378
13112G8238n179m295k1006m7145J1151q426n9411N386o447J6564L6200L4615P321
13099C7566k3737j7926j4446J6664J5109J1738l7533q666L5620j5067j9192m0120
13087e9990m6960J5967M7417K4866k3750J4693K5424m526M570J6105J2371J2862
13075C9049k6825j9032K3296L3214J0825j3406M3582n2706n4270J5121J6154r153
13063E849j3034K9572Q283j1300j2068J6318K1351J8053K3907N5198M5886k6749
13051A61266k6239K526K181k0857j7203k0260J0968N065k9001j7650k7363J1344
13039C4777O292l3647L9118K3074K3560M0142n579k2731m0362n2228K0157N5977
$$ plain form
13027 88550 68994 52554 70299 94886 102127 55920 14476 46601 19056 55245 76054 57301
13015 57301 17614 -11208 -4034 41927 45684 -17040 -41018 -19073 -28032 -3651 21266 20733 25798
13002 25798 -3907 -12981 -16949 -56494 -29746 -4016 31720 62540 56491 47886 20755 -18552
12990 -18552 -31142 -46403 -3459 68675 100043 112416 108290 97693 113206 105418 102312 88730
12978 88730 34243 26314 14985 -5107 -27741 495 74927 58559 -9853 -91348 -52160 -26144
12966 -26144 -6723 -36072 -20778 49750 19216 2360 -20553 -62654 -59062 -65799 -49452 2528
12954 2528 20075 39635 27545 27132 26365 2609 13698 23892 -3787 25683 75994 57892 51346
12941 51346 50976 46674 32795 4667 -5993 -8455 -13416 15660 26415 36686 39776 33251 47563
$$ packed form
13027H8550j9556j6440J7745K4587P241m6207m1444L2125k7545L6189K0809j8753
13015E7301l9687k8822P174M5961L757o2724k3978K1945q959K4381K4917n33N065
13002B5798k9705r074l968l9545K6748K5730L5736L0820o049q605k7131l9307
12990a8552j2590j5261M2944P2134L1368J2373m126j0597J5513p788l106j3582
12978H8730n4487p929j1329k0092k2634K8236P4432j6368o8412q1495L9188K6016
12966b6144J9421k9349J5294P0528l0534j6856k2913m2101L592o737J6347N1980
12954B528J7547J9560j2090m13p67k3756J1089J0194k7679K9470N0311j8102o546
12941E1346l70m302j3879k8128j0660k462m961K9076J0755J0271L090o525J4312
$$ plain form
12928 47563 76923 192347 364738 543957 630174 707921 717022 588795 437998 426028 420564
12917 420564 375087 330883 297952 311900 331768 327021 334343 349542 336290 324350 345477 347063
12905 347063 332316 273247 274196 273625 268999 270061 295458 304551 324156 335265 332753 292058 301922
12892 301922 351806 384373 408308 406213 407344 431434 440652 430694 401001 395619 388657 391434 391363
12879 391363 389064 344125 312629 242068 222770 255736 267933 218467 226495 286821 331257 346205
12867 346205 376042 388707 379704 308413 281669 294309 329430 396637 435737 431157 427431 461026
12855 461026 523540 555801 561808 601059 614717 619081 638495 723534 765281 829997 868002 843190
12843 843190 782681 752637 738852 735660 730237 761978 835639 875518 919559 993621 1019878 1045108
$$ packed form
12928D7563K9360J15424J72391J79219Q6217P7747R101j28227j50797j1970n464
12917D20564m5477m4204l2931J3948J9868m747P322J5199j3252j1940K1127J586
12905C47063j4747n9069R49n71m626J062K5397R093J9605J1109k512m0695R864
12892C01922M9884L2567K3935k095J131K4090R218r958k9693n382o962K777p1
12879C91363k299m4939l1496p0561j9298L2966J2197m9466Q028O0326M4436J4948
12867C46205K9837J2665r003p1291k6744J2640L5121O7207L9100m580l726L3595
12855D61026O2514L2261O007L9251J3658M364J9414Q5039M1747O4716L8005k4812
12843H43190o0509l0044j3785l192n423L1741P3661L9879M4041P4062K6257K5230
$$ plain form
12831 1045108 1115104 1260714 1362303 1519386 1697008 1844934 1954906 2023760 2150721 2303299
12821 2303299 2394586 2559944 2823317 3160302 3534853 3941805 4427836 5003755 5709164 6539294
12811 6539294 7508487 8621369 9908076 11483107 13471196 16314581 20447623 26268300
12803 26268300 34783525 47798551 69471206 109789031 181675428 279205302 368387920
12796 368387920 423296225 398718702 293001774 193338011 133929271 101611129 83304904
12789 83304904 72066395 64012497 57230445 51274019 46208927 42143385 38873286 36238612
12781 36238612 34199061 32540055 31094370 29726291 28310197 26935628 25768394 24757831
12773 24757831 23871864 22983498 22106123 21267164 20362117 19477289 18673203 17963446 17357750
$$ packed form
12831A045108O9996J45610J01589J57083J77622J47926J09972O8854J26961J52578
12821B303299R1287J65358K63373L36985L74551M06952M86031N75919P05409Q30130
12811F539294R69193J112882J286707J575031J988089K843385M133042N820677
12803B6268300Q515225J3015026K1672655M0317825P1886397R7529874Q9182618
12796C68387920N4908305k4577523j05716928r9663763n9408740l2318142j8306225
12789H3304904j1238509q053898o782052n956426n065092m065542l270099k634674
12781C6238612k039551j659006j445685j368079j416094j374569j167234j010563
12773B4757831q85967q88366q77375q38959r05047q84828q04086p09757o05696
$$ plain form
12764 17357750 16810224 16286397 15755128 15246700 14734400 14232736 13733958 13219802 12791232
12755 12791232 12448828 12055470 11691086 11336468 11027768 10645037 10305461 9982438 9665297
12746 9665297 9354506 9104752 8870511 8664682 8498908 8292081 8077584 7842353 7626774
12737 7626774 7435577 7260434 7080240 6900295 6735191 6573413 6422635 6282608 6098872
12728 6098872 5920065 5710837 5521885 5393773 5218400 5078844 5002144 4932121 4860479 4716512
12718 4716512 4623904 4548727 4448555 4294825 4143908 3995781 3850646 3735554 3656482 3581072
12708 3581072 3478889 3310210 3155237 3063199 3049005 3012741 2888611 2826382 2767450 2683761
12698 2683761 2596536 2576776 2554313 2482253 2468174 2455901 2388580 2274648 2226413 2175944 2147274
$$ packed form
12764A7357750n47526n23827n31269n08428n12300n01664m98778n14156m28570
12755A2791232l42404l93358l64384l54618l08700l82731l39576l23023l17141
12746I665297l10791k49754k34241k05829j65774k06827k14497k35231k15579
12737G626774j91197j75143j80194j79945j65104j61778j50778j40027j83736
12728F098872j78807k09228j88952j28112j75373j39556p6700p0023p1642j43967
12718D716512r2608p5177j00172j53730j50917j48127j45135j15092p9072p5410
12708C581072j02183j68679j54973r2038j4194l6264j24130o2229n8932q3689
12698B683761q7225j9760k2463p2060j4079j2273o7321j13932m8235n0469k8670
$$ plain form
12687 2147274 2125357 2141803 2150765 2130743 2125842 2109575 2054986 1989560 1962611 1927657 1881895 1840074
12675 1840074 1769493 1726809 1700359 1561122 1381459 1268802 1174096 1053483 1037545 1127716
12665 1127716 1248656 1249295 1161047 1078025 1040543 994854 950295 920301 890154 833271 763725
12654 763725 707621 710170 701372 691125 705601 692103 643791 601121 556487 530503 482141 457272
12642 457272 417409 379143 296198 343762 428570 450071 478535 516782 456948 404566 462617
12631 462617 499176 475434 449548 459273 497411 526614 500316 498545 499051 490568 475984 503662
12619 503662 463619 427331 434759 456011 464432 442468 373489 333055 358640 351907 329502 314608
12607 314608 272948 275153 324745 416080 442135 438615 412012 359663 316252 335535 318877 311571
$$ packed form
12687B147274k1917J6446Q962k0022m901j6267n4589o5426k6949l4954m5762m1821
12675A840074p0581m2684k6450j39237j79663j12657r4706j20613j5938R0171
12665A127716J20940O39q8248q3022l7482m5689m4559k9994l0147n6883o9546
12654G63725n6104K549q798j0247J4476j3498m8312m2670m4634k5984m8362k4869
12642D57272l9863l8266q2945M7564Q4808K1501K8464L8247n9834n2382N8051
12631D62617L6559k3742k5886R725L8138K9203k6298j771N06q483j4584K7678
12619E03662m0043l6288P428K1252Q421k1964o8979m0434K5585o733k2405j4894
12607C14608m1660K205M9592R1335K6055l520k6603n2349m3411J9283j6658p306
$$ plain form
12595 311571 322935 335097 347435 352718 361807 381724 398255 396713 401352 401371 387833 402051 414072
12582 414072 386344 404720 367245 358294 369554 371640 399191 404410 356984 332386 388038 408544
12570 408544 432238 422743 332717 302145 282501 220700 245899 232491 276226 278900 277908 264015
12558 264015 227719 228113 250109 277124 302051 276385 254657 250175 260991 279339 309984 221054
12546 221054 151936 129290 194124 275542 285035 267810 255015 256923 302441 300099 261641 227820
12534 227820 224671 207389 224351 278200 275433 224271 184318 192367 176714 202915 192286 222633
12522 222633 234593 230711 222577 191480 172124 190042 167020 139040 134376 114296 102393 109073
12510 109073 112780 112899 109940 113812 115016 107542 109083 118549 107731 124862 116417 159558 166842 113190
$$ packed form
12595C11571J1364J2162J2338N283R089J9917J6531j542M639J9j3538J4218J2021
12582D14072k7728J8376l7475q951J1260K086K7551N219m7426k4598N5652K0506
12570D08544K3694r495r0026l0572j9644o1801K5199j3408M3735K674r92j3893
12558B64015l6296L94K1996K7015K4927k5666k1728m482J0816J8348L0645q8930
12546B21054o9118k2646O4834Q1418R493j7225j2795J908M5518k342l8458l3821
12534B27820l149j7282J6962N3849k767n1162l9953Q049j5653K6201j0629L0347
12522B22633J1960l882q134l1097j9356J7918k3022k7980m664k0080j1903O680
12510A09073L707J19k959L872J204p474J541R466j0818J7131q445M3141P284n3652
$$ plain form
12496 113190 81744 98376 111050 175256 187926 145160 112531 116940 143149 136958 114701 115612
12484 115612 59672 14572 56874 32626 24202 30082 35678 35890 93501 133862 167586 185725
12472 185725 174247 158494 168518 157775 110563 98323 111242 147901 212360 266940 268471 234103
12460 234103 221085 229716 234368 232844 187603 135150 142293 155517 187199 215272 227431 187818
12448 187818 129404 117268 159232 191834 163641 180227 173076 156627 216772 273293 276683 270904
12436 270904 321390 353918 340136 322463 279817 268818 299321 334908 339168 344218 302917 266616
12424 266616 240691 239193 223772 233739 258709 304532 301678 267105 238006 241647 203059 210811
12412 210811 203099 203254 231896 235894 240856 294190 309371 335188 323538 307611 296820 317312
$$ packed form
12496A13190l1446J6632J2674O4206J2670m2766l2629M409K6209o191k2257R11
12484A15612n5940m5100M2302k4248q424N880N596K12N7611M0361L3724J8139
12472A85725j1478j5753J0024j0743m7212j2240J2919L6659O4459N4580J531l4368
12460B34103j3018Q631M652j524m5241n2453P143J3224L1682K8073J2159l9613
12448A87818n8414j2136M1964L2602k8193J6586p151j6449O0145N6521L390n779
12436B70904N0486L2528j3782j7673m2646j0999L0503L5587M260N050m1301l6301
12424B66616k5925j498j5421R967K4970M5823k854l4573k9099L641l8588P752
12412B10811p712J55K8642L998M962N3334J5181K5817j1650j5927j0791K0492
$$ plain form
12400 317312 348456 391237 441625 452311 421977 405884 393398 393219 372515 365767 351666 318535
12388 318535 357061 399566 399005 392879 353701 309725 307633 259200 238188 209334 180392 153945
12376 153945 158763 120456 113571 122896 133238 147310 160777 175494 195837 238164 208632 198728
12364 198728 194633 186056 144320 164562 223598 225488 241952 275281 349048 445290 599837 831570
12352 831570 1178438 1628782 2010621 2282214 2185843 1699153 1199333 944564 800132 681741
12342 681741 602401 536704 456112 393117 380997 343782 352491 406016 378460 367059 360575 301179
12330 301179 300790 312360 286651 280399 282698 242246 214971 226252 223179 237116 240195 235477 270003
12317 270003 275737 232208 190672 134692 123640 107369 89905 112508 183380 176952 135105 161665
$$ packed form
12400C17312L1144M2781N0388J0686l0334j6093j2486j79k0704o748j4101l3131
12388C18535L8526M2505n61o126l9178m3976k092m8433k1012k8854k8942k6447
12376A53945M818l8307o885R325J0342J4072J3467J4717K0343M2327k9532r904
12364A98728m095q577m1736K0242N9036J890J6464L3329P3767R6242J54547K31733
12352H31570L46868M50344L81839K71593r6371m86690m99820k54769j44432j18391
12342F81741p9340o5697q0592o2995j2120l7215Q709N3525k7556j1401o484n9396
12330C01179l89J1570k5709o252K299m0452k7275J1281l073J3937L079m718L4526
12317B70003N734m3529m1536n5980j1052j6271j7464K2603P0872o428m1847K6560
$$ plain form
12305 161665 190561 191961 163225 153091 134735 85387 58240 84374 117976 118181 118280 91894 91602
12292 91602 57388 88728 126621 119977 85219 74945 85249 85014 77101 83797 108512 67449 45334
12279 45334 84779 103940 111466 104246 79090 97628 110708 114673 96509 69106 48480 2621
12267 2621 14294 22707 -27861 754 20415 23027 38375 42154 48093 32957 40095 76908 57141
12254 57141 68724 109836 103629 24839 -11642 796 13347 21821 4647 24923 28859 41058
12242 41058 12586 19457 43669 36626 30093 32858 37604 31157 46431 109635 133956 135164 93124
12229 93124 48583 24020 40061 9849 13580 79307 89083 99807 86926 68099 58053 51514
12217 51514 72538 85622 67814 54608 56580 69446 64064 58824 36624 -17967 -24752 14209
$$ packed form
12305A61665K8896J400k8736j0134j8356m9348k7147K6134L3602K05R9k6386k92
12292I1602l4214L1340L7893o644l4758j0274J0304k35p913O696K4715m1063k2115
12279D5334L9445J9161P526p220k5156J8538J3080L965j8164k7403k0626m5859
12267B621J1673Q413n0568K8615J9661K612J5348L779N939j5136P138L6813j9767
12254E7141J1583M1112o207p8790l6481J2438J2551Q474j7174K0276L936J2199
12242D1058k8472O871K4212p043o533K765M746o447J5274O3204K4321J208m2040
12229I3124m4541k4563J6041l0212L731O5727R776J0724j2881j8827j0046o539
12217E1514K1024J3084j7808j3206J972J2866n382n240k2200n4591o785L8961
$$ plain form
12205 14209 48919 36947 41066 63156 73307 105177 70571 -10509 -14998 3887 -15226 -23125
12193 -23125 7400 -12062 -6939 12854 25670 24671 8571 32067 41146 12725 13076 33394 -2312
12180 -2312 -24559 -4539 2916 3416 -1819 5866 26369 41556 20254 -19467 -17924 2165 10740
12167 10740 18731 -20782 -66864 -22448 49165 83768 76580 52642 42373 29365 35488 17242
12155 17242 319 30003 57791 49819 46652 44345 52916 56097 38025 51206 52927 51861 341
12142 341 -1190 -3359 44503 63642 54575 33381 45437 78038 86612 55248 15227 29202 15410
12129 15410 30310 20988 57626 45915 22866 51069 61258 75340 49617 63859 60783 70745
12117 70745 49075 22443 17077 32484 58812 89312 80489 55496 39352 22582 22683 -154
$$ packed form
12205A4209L4710j1972M119K2090J0151L1870l4606q1080m489J8885j9113p899
12193b3125L0525j9462N123J9793J2816r99j6100K3496R079k8421L51K0318l5706
12180b312k2247K0020P455N00n235P685K0503J5187k1302l9721J543K0089Q575
12167A0740P991l9513m6082M4416P1613L4603p188k3938j0269j3008O123j8246
12155A7242j6923K9684K7788p972l167k307Q571L181j8072J3181J721j066n1520
12142C41j531k169M7862J9139r067k1194J2056L2601Q574l1364m0021J3975j3792
12129A5410J4900r322L6638j1711k3049K8203J0189J4082k5723J4242l076R962
12117G0745k1670k6632n366J5407K6328L0500q823k4993j6144j6770J01k2837
$$ plain form
12105 -154 27530 30945 56645 41595 42629 79457 55455 28107 -1616 -17274 -26894 -13597 25883
12092 25883 59025 37063 19604 19969 66685 81473 48261 40846 36572 5433 -3085 11919 10330
12079 10330 15848 32865 70463 87177 90161 88887 45990 43033 14993 -32147 -31280 -33893 -60299
12066 -60299 -80861 -95772 -127986 -60245 41843 65253 78632 63733 14714 -26947 -37051
12055 -37051 -52956 -24733 47599 58543 45907 45511 49918 59598 39841 15342 9799 -8646 -9360
12042 -9360 3724 19957 19026 -14605 -16433 -7320 -45767 -23441 3941 23821 22006 3563 -10130
12029 -10130 -32031 -10298 30753 49220 46784 64904 71184 50385 44880 97182 91566 59073
12017 59073 36576 49140 43423 35780 32172 72916 62808 38387 -31115 -70389 -33803 -26924
$$ packed form
12105a54K7684L415K5700j5050J034L6828k4002k7348k9723j5658r620J3297L9480
12092B5883L3142k1962j7459L65M6716J4788l3212p415m274l1139q518J5004j589
12079A0330N518J7017L7598J6714K984j274m2897k957k8040m7140Q67k613k6406
12066f0299k0562j4911l2214O7741J02088K3410J3379j4899m9019m1661j0104
12055c7051j5905K8223P2332J0944j2636l96M407R680j9757k4499n543j8445p14
12042i360J3084J6233r31l3631j828R113l8447K2326K7382J9880j815j8443j3693
12029a0130k1901K1733M1051J8467k436J8120O280k0799n505N2302n616l2493
12017E9073k2497J2564n717p643l608M0744j0108k4421o9502l9274L6586O879
$$ plain form
12005 -26924 -23737 -7148 -20374 -61500 -87280 -47098 25823 26732 -17657 -33257 -10069 38786
11993 38786 -870 561 -4715 13938 10226 -43230 -33081 -5116 41283 47564 -18033 -59895
11981 -59895 -23373 2145 3895 -25368 -15175 -7977 8973 5276 -9946 -11811 34655 89309
11969 89309 67802 85027 71337 40751 53998 68085 68016 23780 21995 13400 -62640 -74452 -38142
11956 -38142 464 7283 -26013 -39314 -30471 -91839 -91239 -51601 -33473 -36616 -24451 13328 31951
11943 31951 9467 -15458 11927 10905 5096 15439 54118 54045 -3928 -2300 -28273 -65812 -90757
11930 -90757 -60824 -52785 -66059 -56343 -55515 -43031 -17371 -16169 -35454 -34729 -56784 -82118 -69893
11917 -69893 -38128 -11828 -27821 -72199 -43636 -17477 -46209 -36972 -24135 -12120 -234 -6793
$$ packed form
12005b6924L187J6589j3226m1126k5780M0182P2921R09m4389j5600K3188M8855
11993C8786l9656J431n276J8653l712n3456J0149K7965M6399O281o5597m1862
11981e9895L6522K5518J750k9263J0193P198J6950l697j5222j865M6466N4654
11969H9309k1507J7225j3690l0586J3247J4087o9m4236j785q595p6040j1812L6310
11956c8142L8606O819l3296j3301Q843o1368O00L9638J8128l143J2165L7779J8623
11943C1951k2484k4925K7385j022n809J0343L8679p3n7973J628k5973l7539k4945
11930i0757K9933Q039j3274R716Q28J2484K5660J202j9285P25k2055k5334J2225
11917f9893L1765K6300j5993m4378K8563K6159k8732R237J2837J2015J1886o559
$$ plain form
11905 -6793 6257 15762 9758 -4155 -43911 -70193 -58180 -45110 -14922 37992 25789 11588
11893 11588 37650 7771 13818 -20367 -9407 -19996 -17743 -30378 -35067 -46700 -39397 -63486
11881 -63486 -19680 -14133 -2426 -21991 4145 423 -15899 15405 89299 74442 36860 13531
11869 13531 36132 10064 50472 76277 38851 39201 40212 45414 76823 80536 57825 41397 46189
11856 46189 48497 12140 -22743 9188 37967 41868 39888 7693 -7916 -5272 30303 48368
11844 48368 68830 63409 32035 -7175 -27634 888 -12219 -29700 -26996 -42159 -61364 -46543
11832 -46543 49506 78768 43999 -8429 -42470 -33450 -53610 -30332 -28502 -31088 -58136 -59017 -5215
11819 -5215 15241 5963 37256 66198 42217 24409 11682 45025 54300 34732 -6403 -32471
$$ packed form
11905f793J3050R505o004j3913l9756k6282J2013J3070L0188N2914j2203j4201
11893A1588K6062k9879O047l4185J0960j0589K253j2635m689j1633P303k4089
11881f3486M3806N547J1707j9565K6136l722j6322L1304P3894j4857l7582k3329
11869A3531K2601k6068M0408K5805l7426L50J011N202L1409L713k2711j6428M792
11856D6189K308l6357l4883L1931K8779L901j980l2195j5609K644L5575J8065
11844D8368K0462n421l1374l9210k0459K8522j3107j7481K704j5163j9205J4821
11832d6543R6049K9262l4769n2428l4041R020k0160K3278J830k586k7048q81N3802
11819e215K0456r278L1293K8942k3981j7808j2727L3343R275j9568m1135k6068
$$ plain form
11807 -32471 -5422 24567 -22301 -41792 -32948 -6926 16128 12946 -6270 -48448 -69343 -65333
11795 -65333 -59539 -61226 -62785 -62300 -37585 -41350 -46581 -33698 -14473 -6524 4802 -682 -19817
11782 -19817 12935 24941 14751 25794 83609 81258 46282 30293 -38306 -81928 -73008 -46616
11770 -46616 -39563 -39154 -19634 16159 32574 14120 15663 9716 -22428 -9374 12010 45884 54127
11757 54127 21886 -12355 -12194 9855 17758 35935 9164 3436 -23565 1893 -28237 -57907
11745 -57907 -44152 3209 1627 -10086 -4677 50149 50360 32339 25637 13439 37220 46064 40487
11732 40487 58203 56985 29303 68815 80426 67726 7399 13932 -2193 -35403 15475 30383
11720 30383 16553 21210 45712 57017 67261 58633 59528 26051 24547 42793 25582 1989 -46941
$$ packed form
11807c2471K7049K9989m6868j9491Q844K6022K3054l182j9216m2178k0895M010
11795f5333N794j687j559M85K4715l765n231J2883J9225P949J1326n484j9135
11782a9817L2752J2006j0190J1043N7815k351l4976j5989o8599m3622Q920K6392
11770d6616P053M09J9520L5793J6415j8454J543n947l2144J3054K1384L3874Q243
11757E4127l2241l4241J61K2049P903J8177k6771n728k7001K5458l0130k9670
11745e7907J3755M7361j582j1713N409N4826K11j8021o702j2198K3781Q844n577
11732D0487J7716j218k7682L9512J1611j2700o0327O533j6125l3210N0878J4908
11720C0383j3830M657K4502J1305J0244q628Q95l3477j504J8246j7211k3593m8930
$$ plain form
11707 -46941 -83322 -84408 -35150 28110 45275 -16825 -58460 -1068 15074 -4693 -8948 21465
11695 21465 29120 24344 -10037 -16478 -16702 -26242 -2606 6857 -4377 -13785 -31308 -71047 -63629
11682 -63629 -36442 -40917 18772 69785 64385 43151 34447 32928 -32808 -82023 -95169 -24997
11670 -24997 9712 16909 8906 -19153 -22427 -14532 39708 41543 42073 15857 -7218 4903 9208
11657 9208 -9360 -75928 -86188 -28210 5665 -26904 -15655 16785 38723 -20240 -20265 -28842 -70145
11644 -70145 -82795 -35670 -2869 -23964 -40491 -12498 13770 -10116 -65093 -34370 37917 48282
11632 48282 37163 -5014 -4677 14135 14334 21367 32505 2197 -2953 -1224 1206 -34653 -62822
11619 -62822 -74755 -77114 -33290 -11607 -20144 -26846 -32981 8211 48395 32059 27770 31825 23255
$$ packed form
11707d6941l6381j086M9258O3260J7165o2100m1635N7392J6142j9767m255L0413
11695B1465P655m776l4381o441k24r540K3636R463j1234r408j7523l9739P418
11682f3629K7187m475N9689N1013n400k1234q704j519o5736m9215j3146P0172
11670b4997L4709P197q003k8059l274P895N4240J835N30k6216k3075J2121M305
11657I208j8568o6568j0260N7978L3875l2569J1249L2440K1938n8963k5q577m1303
11644g0145j2650M7125L2801k1095j6527K7993K6268k3886n4977L0723P2287J0365
11632D8282j1119m2177L37J8812J99P033J1138l0308n150J729K430l5859k8169
11619f2822j1933k359M3824K1683q537o702o135M1192M0184j6336m289M055q570
$$ plain form
11606 23255 -17392 -64108 -36324 -17830 -33515 5878 4755 -17225 -33836 -34543 -1561 5575
11594 5575 -20482 7769 -11605 -4863 48313 71946 53675 48334 13720 -1816 -24996 -16959
11582 -16959 -2012 -37616 -4375 3362 96 45384 27969 -14874 -39928 -60891 -111924 -115788
11570 -115788 -120654 -66074 -27739 -38826 -6102 -9829 -50973 -12812 22823 -29863 -50394 -16947
11558 -16947 -4035 -18701 -47422 -14976 91 17539 -14159 -30696 -25378 -53515 -88379 -104874
11546 -104874 -100219 -79176 -28677 -9428 -6464 -24543 -11543 -51601 -79550 -69946 -86493 -60810
11534 -60810 -28127 5627 29799 16085 62679 37182 19835 33538 8773 -42820 -31837 -2575
11522 -2575 -53916 -83670 -102004 -79223 -23167 13049 7017 295 2386 22571 34069 60370
$$ packed form
11606B3255m0647m6716K7784J8494j5685L9393j123k1980j6611p07L2982P136
11594E575k6057K8251j9374O742N3176K3633j8271n341l4614j5536k3180Q037
11582a6959J4947l5604L3241P737l266M5288j7415m2843k5054k0963n1033l864
11570a15788m866N4580L8335j1087L2724l727m1144L8161L5635n2686k0531L3447
11558a6947J2912j4666k8721L2446J5067J7448l1698j6537N318k8137l4864j6495
11546a04874M655K1043N0499J9249K964j8079J3000m0058k7949R604j6547K5683
11534f0810L2683L3754K4172j3714M6594k5497j7347J3703k4765n1593J0983K9262
11522b575n1341k9754j8334K2781N6056L6216o032o722K091K0185J1498K6301
$$ plain form
11510 60370 65287 48857 -3586 -27666 -48873 -16975 7050 30226 -35451 -61870 -34527 -27040
11498 -27040 -10336 3175 -10426 -33837 -55171 -37647 -23490 5189 11266 16248 -1309 -35470
11486 -35470 761 -12442 -56792 -78017 -78606 -62692 -57908 -19207 -14215 -24074 -19640 -13335 -52669
11473 -52669 -39696 8926 9173 -31069 -23215 -38 45655 31613 25657 -3566 -36730 -44542 -16481
11460 -16481 -58889 -85280 -36577 -17603 -35057 -54431 -58517 -31796 -40701 -71484 -36033 -11971
11448 -11971 -7461 22080 1400 1166 11724 -17344 5906 4774 -12107 -29332 -50252 -106940
11436 -106940 -100033 -28496 -12625 -4412 5303 9193 24631 6618 -12833 -11565 -19928 -13227 -24885
11423 -24885 -47918 -68156 -82923 -30852 -3643 19701 61572 78127 42642 -36790 -61538 -58076
$$ packed form
11510F0370M917j6430n2443k4080k1207L1898K4025K3176o5677k6419K7343P487
11498b7040J6704J3511j3601k3411k1334J7524J4157K8679O077M982j7557l4161
11486c5470L6231j3203m4350k1225n89J5914M784L8701M992r859M434O305l9334
11473e2669J2973M8622K47m0242P854K3177M5693j4042n956k9223l3164p812K8061
11460a6481m2408k6391M8703J8974j7454j9374m086K6721q905l0783L5451K4062
11448a1971M510K9541k0680k34J0558k9068K3250j132j6881j7225k0920n6688
11436a06940O907P1537J5871Q213R715L890J5438j8013j9451J268q363O701j1658
11423b4885k3033k0238j4767N2071K7209K3344M1871J6555l5485p9432k4748L462
$$ plain form
11411 -58076 -19493 -10574 -61740 -82163 -23964 15995 11818 12966 31332 33546 -43649 -46087 -28149
11398 -28149 -69124 -50319 -30052 -59382 -44611 19598 49265 15723 31611 33544 27035 -88
11386 -88 -24472 -6400 -24790 4750 43779 24449 25437 6252 7356 28404 -12819 -35374 -29180
11373 -29180 -11451 3648 13890 49934 51529 28604 9007 5139 -1255 -4827 11110 -10484
11361 -10484 -38767 -25304 14856 -18390 -38194 -13779 -12288 -8350 -9763 -6174 -12843 -63658 -64766
11348 -64766 -66308 -40732 23774 34855 4673 -34475 -33138 -41888 -25149 20490 27810 31034 60683
11335 60683 41463 -1861 -21840 -4421 1558 7125 -16696 -38964 -16547 13434 -10950 -30793
11323 -30793 -23242 -18916 -76092 -120390 -88139 -45867 -21528 -1952 17167 -25106 -31287 -36362
$$ packed form
11411e8076L8583Q919n1166k0423N8199L9959m177J148J8366K214p7195k438J7938
11398b8149m0975J8805K0267k9330J4771O4209K9667l3542J5888J933o509k7123
11386h8k4384J8072j8390K9540L9029j9330R88j9185J104K1048m1223k2555O194
11373b9180J7729J5099J0242L6044J595k2925j9597l868o394l572J5937k1594
11361a0484k8283J3463M0160l3246j9804K4415J491L938j413L589o669n0815j108
11348f4766j542K5576O4506J1081l0182l9148J337q750J6739M5639P320L224K9649
11335F0683j9220m3324j9979J7419N979N567k3821k2268K2417K9981k4384j9843
11323c0793P551M326n7176m4298L2251M2272K4339J9576J9119m2273o181n075
$$ plain form
11311 -36362 -26690 -3967 12587 14978 7349 -21838 -36059 -28859 -42846 -64393 -40582 -4384
11299 -4384 27756 42434 -11489 -38276 -40058 -69244 -49782 -23347 5664 -9730 -10813 5946
11287 5946 17779 15805 -6772 16597 50948 51630 24572 -36548 -85805 -57624 -6809 53724
11275 53724 42027 29358 11167 -56498 -22065 -5919 -52828 -43029 -19975 31779 44930 12697
11263 12697 -23451 -83772 -52502 -30595 -38215 -50793 -74888 -68121 -70245 -57730 -21869 -35327
11251 -35327 -23360 -44663 -13805 -253 -44549 -73018 -70309 -94314 -127027 -138949 -60987 9354
11239 9354 9448 -6889 -50096 -47651 -45917 -26418 -38383 -51416 -24881 4629 -16728 -44505 -48564
11226 -48564 -25290 2862 -39811 -42803 -21978 25039 1458 -22524 -37420 -6617 18161 45563
$$ packed form
11311c6362R672K2723J6554K391p629k9187j4221P200j3987k1547K3811L6198
11299d384L2140J4678n3923k6787j782k9186J9462K6435K9011j5394j083J6759
11287E946J1833j974k2577K3369L4351O82k7058o1120m9257K8181N0815O0533
11275E3724j1697j2669j8191o7665L4433J6146m6909R799K3054N1754J3151l2233
11263A2697l6148o0321L1270K1907p620j2578k4095O767k124J2515L5861j3458
11251c5327J1967k1303L0858J3552m4296k8469K709k4005l2713j1922P7962P0341
11239I354R4j6337m3207K445J734J9499j1965j3033K6535K9510k1357k7777m059
11226d8564K3274K8152m2673k992K0825M7017k3581k3982j4896L0803K4778K7402
$$ plain form
11214 45563 -4416 -36850 -25638 -13156 -21601 -41162 -9416 3867 -13019 3368 41801 26017
11202 26017 -2055 1696 9187 51641 42424 34381 3195 -9594 11864 -5742 -66651 -31441
11190 -31441 -310 -9914 4174 1908 14907 -4327 -964 -1711 19037 13970 11301 -43301 -56310
11177 -56310 -37228 -7457 17553 -23019 -24776 15896 32586 30652 57337 17362 -15289 -5328
11165 -5328 -7252 -8905 -27345 -26356 -37594 -36288 -83038 -83845 -24523 -19324 -76167 -87602 -69078
11152 -69078 -62342 -27347 -30615 -73716 -86269 -42245 -16982 -30165 7829 16192 18677 27201 29878
11139 29878 26092 -3595 -1016 -47142 -31887 16118 13932 -44832 -56418 -23833 -27260 -25823 -8948
11126 -8948 24883 27610 9586 -22365 -63368 -29047 28634 37330 41672 19509 4020 29935
$$ packed form
11214D5563m9979l2434J1212J2482q445j9561L1746J3283j6886J6387L8433j5784
11202B6017k8072L751P491M2454r217q043l1186j2789K1458j7606o0909L5210
11190c1441L1131r604J4088k266J2999j9234L363p47K0748n067k669n4602j3009
11177e6310J9082K9771K5010m0572j757M0672J6690j934K6685l9975l2651R961
11165e328j924j653j8440R89j1238J306m6750q07N9322N199n6843j1435J8524
11152f9078O736L4995l268m3101j2553M4024K5263j3183L7994Q363K485Q524K677
11139B9878l786k9687K579m6126J5255M8005k186n8764j1586L2585l427J437J6875
11126h948L3831K727j8024l1951m1003L4321N7681Q696M342k2163j5489K5915
$$ plain form
11114 29935 46421 -15617 -5726 -2113 -14756 -38034 -23929 -3206 -14392 18264 39990 35338
11102 35338 32515 15905 9496 22741 15512 20134 1636 -20169 -24531 -24601 -2381 8189 19208
11089 19208 192 -23911 -36294 -11740 5718 17483 10688 -2412 -28502 7569 21782 -1386
11077 -1386 -43362 -80038 -64145 20685 46217 63197 31742 -7218 30492 67027 45887 19660
11065 19660 -18313 -37954 -62927 -87290 -63441 -26058 -19159 9346 19325 30287 19941 32674
11053 32674 35289 -20713 -16176 15512 -5028 -2533 22386 22058 42632 37713 37932 3982 2204
11040 2204 13786 17981 -33984 -26613 21060 13233 10947 11476 25295 -1156 6301 3775 29190
11027 29190 46937 20514 29856 28430 -17227 -22970 7218 -7478 12296 26866 17348 10284 47225
$$ packed form
11114B9935J6486o2038R891L613j2643k3278J4105K0723j1186L2656K1726m652
11102C5338k823j6610o409J3245p229M622j8498k1805m362p0K2220J0570J1019
11089A9208j9016k4103j2383K4554J7458J1765o795j3100k6090L6071J4213k3168
11077a386m1976l6676J5893Q4830K5532J6980l1455l8960L7710L6535k1140k6227
11065A9660l7973j9641k4973k4363K3849L7383O899K8505R979J0962j0346J2733
11053C2674K615n6002M537L1688k0540K495K4919l28K0574m919K19l3950j778
11040B204J1582M195n1965P371M7673p827k286N29J3819k6451P457k526K5415
11027B9190J7747k6423R342j426m5657n743L0188j4696J9774J4570r518p064L6941
$$ plain form
11014 47225 62042 35254 14232 1791 30493 50718 17293 -11223 -15177 -22107 -21606 -14895 35952
11001 35952 83507 72082 34756 2360 -2368 16752 12235 -15003 -47819 -41875 -49044 -44731 -16851
10988 -16851 -22958 -53215 -53895 -37177 -16545 -27065 -32436 -3914 -8172 -29347 -25848 -62748 -105390
10975 -105390 -52631 38482 44902 35705 -609 28878 50496 26205 39833 27205 -33527 -53369
10963 -53369 -49785 -41615 8683 16556 -14121 14107 25285 42805 29259 -6982 14244 1946
10951 1946 -1625 -7059 -47736 -57304 154 -2306 -47945 -55818 -29239 -4691 -19748 -23839 25321
10938 25321 43287 61583 83888 118751 67553 34200 -11124 6331 -5443 -11682 -18682 -29932
10926 -29932 -43721 -43703 -23598 -46303 -88298 -107425 -101132 -84359 -64030 -35931 -8469 -10353 -25754
$$ packed form
11014D7225J4817k6788k1022j2441K8702K0225l3425k8516l954o930N01O711N0847
11001C5952M7555j1425l7326l2396m728J9120m517k7238l2816N944p169M313K7880
10988a6851o107l0257o80J6718K0632j0520n371K8522m258k1175L499l6900m2642
10975a05390N2759R1113O420r197l6314K9487K1618k4291J3628j2628o0732j9842
10963e3369L584Q170N0298P873l0677K8228J1178J7520j3546l6241K1226j2298
10951A946l571n434m0677r568N7458k460m5639p873K6579K4548j5057m091M9160
10938B5321J7966J8296K2305L4863n1198l3353m5324J7455j1774o239p000j1250
10926b9932j3789J8K0105k2705m1995j9127O293J6773K0329K8099K7462j884j5401
$$ plain form
10913 -25754 1192 6647 -31819 -51126 -30853 -11893 6133 -23732 -26068 -40806 -96069 -103280
10901 -103280 -66717 -38769 6361 8515 -51448 -65228 -17825 45380 65989 64481 42280 13622
10889 13622 10246 4508 -44187 -28893 37076 38126 68018 106184 113513 98550 134406 130496 92516
10876 92516 68192 20355 45266 24462 26189 25005 -35768 -25245 14791 56331 98560 95203
10864 95203 95219 114252 68837 40546 22824 46183 51142 37484 58952 72240 75554 79941 51638
10851 51638 18326 19740 17721 -26938 -37491 -11251 -7416 -23039 -12466 21097 33631 49328
10839 49328 20305 38938 72530 78641 64515 59526 42532 20182 15682 46094 102204 100884
10827 100884 78912 90013 40091 24876 14328 6804 11442 -13191 -53158 -60664 -14679 30778
$$ packed form
10913b5754K6946N455l8466j9307K0273J8960J8026k9865k336j4738n5263p211
10901a03280L6563K7948M5130K154n9963j3780M7403O3205K0609j508k2201k8658
10889A3622l376n738m8695J5294O5969J050K9892L8166P329j4963L5856l910l7980
10876I2516k4324m7837K4911k0804J727j184o0773J0523M0036M1540M2229l357
10864I5203J6J9033m5415k8291j7722K3359M959j3658K1468J3288L314M387k8303
10851E1638l3312J414k019m4659j0553K6240L835j5623J0573L3563J2534J5697
10839D9328k9023J8633L3592O111j4126m989j6994k2350m500L0412N6110j320
10827A00884k1972J1101m9922j5215j0548p524M638k4633l9967p506M5985M5457
$$ plain form
10815 30778 63184 41361 43995 15840 5326 1941 -27954 -39726 -34064 -4633 38376 77265
10803 77265 77414 64867 61540 36034 43625 60722 79667 123873 105517 48915 50928 46684 -11313
10790 -11313 13602 68760 71048 21479 -20663 -66617 -77932 -60384 -28283 7747 15959 23382
10778 23382 25816 6399 -39524 -17329 -12783 -18751 19733 10637 -3186 -10026 10012 -8160 -49000
10765 -49000 -37303 -8460 7177 -11896 6374 -10379 -82729 -115860 -112870 -78886 -72350 -41720
10753 -41720 -46935 -65244 -75972 -37185 -10659 18851 39942 77551 32339 -11756 -32022 -12595
10741 -12595 -50609 -66748 -6170 22580 31526 -287 -25159 -19384 -12806 -21001 -14545 -47082 -42381
10728 -42381 -20140 -26702 -4788 40551 68502 50883 34799 16475 -13687 -137 27738 26161
$$ packed form
10815C0778L2406k1823K634k8155j0514l385k9895j1772N662K9431M3009L8889
10803G7265J49j2547l327k5506P591J7097J8945M4206j8356n6602K013m244n7997
10790a1313K4915N5158K288m9569m2142m5954j1315J7548L2101L6030Q212P423
10778B3382K434j9417m5923K2195M546n968L8484r096j3823o840K0038j8172m0840
10765d9000J1697K8843J5637j9073J8270j6753p2350l3131K990L3984O536L0630
10753d1720n215j8309j0728L8787K6526K9510K1091L7609m5212m4095k0266J9427
10741a2595l8014j6139O0578K8750Q946l1813k4872N775O578q195O456l2537M701
10728d2381K2241o562K1914M5339K7951j7619j6084j8324l0162J3550K7875j577
$$ plain form
10716 26161 31139 -2196 31229 53787 44679 39051 14961 -22241 2567 15365 5680 51852
10704 51852 67045 -664 -8060 -506 5103 199 -5949 -34868 -56228 -63378 -38136 69 49850
10691 49850 37637 44797 49476 14687 -64415 -55897 -40996 -12335 -21301 -21077 -17570 -27767 -45864
10678 -45864 -97533 -85835 -47208 -42175 -1445 11714 -9635 -15265 -9428 -8403 -9121 -8611 -35210
10665 -35210 3880 30763 24277 -3480 28840 28154 3475 9242 12745 5109 -16928 19239 5964
10652 5964 12656 20541 -8704 -19812 -16591 -66501 -41520 1666 -3560 18485 64761 72737 82076
10639 82076 66966 65034 91186 93405 76621 58054 39025 29713 2980 -10806 -5734 -27925
10627 -27925 -7136 -6033 21953 31903 60456 69412 21370 11227 32817 35400 20133 28727 45372
$$ packed form
10716B6161M978l3335L3425K2558r108n628k4090l7202K4808J2798r685M6172
10704E1852J5193o7709p396P554N609m904o148k8919k1360p150K5242L8205M9781
10691D9850j2213P160M679l4789p9102Q518J4901K8661q966K24L507j0197j8097
10678d5864n1669J1698L8627N033M0730J3159k1349n630N837J025p18N10k6599
10665c5210L9090K6883o486k7757L2320o86k4679N767L503p636k2037L6167j3275
10652E964O692P885k9245j1108L221m9910K4981M3186n226K2045M6276P976R339
10639H2076j5110j932K6152K219j6784j8567j9029r312k6733j3786N072k2191
10627b7925K0789J103K7986R950K8553Q956m8042j0143K1590K583j5267Q594J6645
$$ plain form
10614 45372 16637 39853 58607 42252 -8868 3610 20387 -14503 -24916 -17122 -17629 -28258
10602 -28258 -19046 4824 -14295 -7735 4621 19618 -2232 -80405 -74187 -13217 13867 -15626
10590 -15626 29762 71970 85698 48890 23227 -25993 -25323 13410 21720 -7749 -70720 -136665
10578 -136665 -110659 -49654 8818 3516 -2030 -3724 -27338 -18026 4176 31191 31467 -486 -23947
10565 -23947 -45889 -38278 10641 -7823 -15115 -41809 -36866 -34613 -15604 -3076 15105 4695
10553 4695 -59781 -53660 13130 19105 15762 26924 -23337 -45978 -54187 -38513 -80240 -78520 -72018
10540 -72018 -44956 -29027 -39575 -32404 -8237 33948 44061 8024 -48134 -100882 -52530 -8976
10528 -8976 4899 23985 28036 59772 65816 27486 15934 -22004 -15808 -13522 -31213 32145 12600
$$ packed form
10614D5372k8735K3216J8754j6355n1120J2478J6777l4890j0413P794n07j0629
10602b8258R212K3870j9119O560J2356J4997k1850p8173O218O0970K7084k9493
10590a5626M5388M2208J3728l6808k5663m9220O70L8733Q310k9469o2971o5945
10578a36665K6006O1005N8472n302n546j694k3614R312K2202K7015K76l1953k3461
10565b3947k1942P611M8919j8464p292k6694M943K253J9009J2528J8181j0410
10553D695o4476O121O6790N975l343J1162n0261k2641q209J5674m1727J720O502
10540g2018K7062J5929j0548P171K4167M2185J0113l6037n6158n2748M8352M3554
10528h976J3875J9086M051L1736O044l8330j1552l7938O196K286j7691O3358j9545
$$ plain form
10515 12600 6477 -224 1107 45770 82677 108198 113041 43750 7470 -7275 -14853 7274 53717
10502 53717 56378 21552 -3639 -5256 -9937 -45054 -36543 9907 38229 54526 36095 -406
10490 -406 974 41914 29900 29183 56461 81352 38495 51160 44091 44909 -31643 -60686 -46625
10477 -46625 15503 66103 73818 104702 76980 44462 -2877 -21313 45249 67570 46125 39827
10465 39827 54118 46864 33044 4546 22113 23680 19193 19388 23042 33145 14248 -5649 -24
10452 -24 14859 1580 -41716 -6584 -31862 -23113 25832 76237 104239 96699 52235 34107 33604
10439 33604 39090 62996 12274 20708 -20583 -36123 12635 60377 30260 -17832 -1142 244
10427 244 32197 57640 74508 93113 69965 44118 53477 77273 64371 65988 84506 70600
$$ packed form
10515A2600o123o701J331M4663L6907K5521M843o9291l6280j4745p578K2127M6443
10502E3717K661l4826k5191j617m681l5117Q511M6450K8322J6297j8431l6501
10490d06J380M0940j2014p17K7278K4891m2857J2665p069Q18p6552k9043J4061
10477d6625O2128N0600P715L0884k7722l2518m7339j8436O6562K2321k1445o298
10465C9827J4291p254j3820k8498J7567J567m487J95L654J0103j8897j9897N625
10452b4J4883j3279m3296L5132k5278Q749M8945N0405K8002p540m4464j8128n03
10439C3604N486K3906n0722Q434m1291j5540M8758M7742l0117m8092J6690J386
10427B44L1953K5443J6868J8605k3148k5847R359K3796j2902J617J8518j3906
$$ plain form
10415 70600 40862 45456 48362 19891 8412 27230 50373 54467 42867 30091 51265 38978
10403 38978 38224 65079 24857 -34071 17214 46687 -2956 -11563 12894 19727 7414 15465 51467
10390 51467 131386 113237 110153 98303 20649 -18731 -31852 -30737 -20856 35791 20375 4894
10378 4894 -61551 -65258 -10138 43028 45032 36280 47707 36439 68091 92932 94073 65741 57615
10365 57615 47033 33069 55423 65207 74570 74709 70073 72483 50257 46913 46306 62668 48326
10352 48326 11481 -5048 7334 23418 24746 34528 54427 57567 55348 80676 133080 140826 109849
10339 109849 98627 78022 28015 35396 31692 15790 -7206 14304 30614 71024 89881 37042
10327 37042 -6498 33548 23801 63711 75672 118489 152078 138206 151005 149068 147123 166348
$$ packed form
10415G0600k9738M594K906k8471j1479J8818K3143M094j1600j2776K1174j2287
10403C8978p54K6855m0222n8928N1285K9473m9643q607K4457O833j2313Q051L6002
10390E1467P9919j8149l084j1850p7654l9380j3121J115R881N6647j5416j5481
10378D894o6445l707N5120N3166K004q752J1427j1268L1652K4841J141k8332q126
10365E7615j0582j3964K2354R784R363J39m636K410k2226l344o07J6362j4342
10352D8326l6845j6529J2382J6084J328R782J9899L140k219K5328N2404P746l0977
10339A09849j1222k0605n0007P381l704j5902k2996K1510J6310M0410J8857n2839
10327C7042m3540M0046r747L9910J1961M2817L3589j3872J2799j937j945J9225
$$ plain form
10315 166348 146106 103576 107194 124349 121109 105388 131475 113031 103157 118309 103530 145781
10303 145781 146831 80879 87298 46932 14107 21227 25366 73765 67694 37808 13836 -3280
10291 -3280 8049 11675 -16675 -9995 39646 94797 132880 105405 56314 49144 59345 11083
10279 11083 -9763 20411 71216 108527 88478 90321 72525 82728 102680 97653 108437 75361
10267 75361 88041 110412 92987 107899 136415 114798 64327 65450 97415 101049 82909 53053
10255 53053 30189 44603 46187 24253 11939 33071 86608 91313 65354 727 -5633 19306
10243 19306 47553 81166 79622 82546 118733 119152 107484 100115 85412 51284 22780 24625 35207
10230 35207 62292 83001 100784 85393 60165 25000 12841 -3299 26589 42143 74725 64868
$$ packed form
10315A66348k0242m2530L618J7155l240j5721K6087j8444r874J5152j4779M2251
10303A45781J050o5952O419m0366l2825P120M139M8399o071k9886k3972j7116
10291c280J1329L626k8350O680M9641N5151L8083k7475m9091p170J0201m8262
10279A1083k0846L0174N0805L7311k0049J843j7796J0203J9952n027J0784l3076
10267G5361J2680K2371j7425J4912K8516k1617n0471J123L1965L634j8140k9856
10255E3053k2864J4414J584k1934j2314K1132N3537M705k5959o4627o360K4939
10243A9306K8247L3613j544K924L6187M19j1668p369j4703l4128k8504J845J0582
10230C5207K7085K0709J7783j5391k5228l5165j2159j6140K9888J5554L2582r857
$$ plain form
10218 64868 75074 81498 130071 123844 145835 157897 199439 189511 198683 206727 210302 158385 154798
10205 154798 107720 98271 71953 -592 -26822 20093 58316 58132 60510 87530 120655 143052
10193 143052 103053 104747 100395 50623 64079 68932 35310 72813 104070 64418 38814 39961
10181 39961 120493 112119 110191 80532 95008 80665 67102 115313 127840 129566 109132 122534
10169 122534 150345 118439 119096 111797 83384 80157 60685 81896 110912 69382 50291 94276
10157 94276 159851 146439 134696 117949 149008 145316 94347 97320 88232 84372 47261 40794 76472
10144 76472 108845 78940 49433 27207 54781 77534 72714 66910 37825 34445 17785 8361
10132 8361 22783 75264 133119 157811 145802 163964 123846 151804 168443 180034 190264 180149
$$ packed form
10218F4868J0206O424M8573o227K1991J2062M1542r928R172Q044L575n1917l587
10205A54798m7078r449k6318p2545k6230M6915L8223j84K378K7020L3125K2397
10193A43052l9999J694m352m9772J3456M853l3622L7503L1257l9652k5604J147
10181C9961Q0532q374j928k9659J4476j4343j3563M8211J2527J726k0434J3402
10169A22534K7811l1906O57p299k8413l227j9472K1211K9016m1530j9091M3985
10157I4276O5575j3412j1743j6747L1059l692n0969K973r088l860l7111o467L5678
10144G6472L2373k9905k9507k2226K7574K2753m820n804k9085l380j6660r424
10132H361J4422N2481N7855K4692j2009J8162m0118K7958J6639J1591J0230j0115
$$ plain form
10120 180149 209635 199660 161511 134097 105944 132776 147982 119791 92757 109269 123912 112613
10108 112613 94970 115580 112356 119704 102251 57388 65728 137204 184838 178093 170426 167198 177709
10095 177709 172334 162591 149745 138839 149655 146259 137261 157058 201884 238845 250992 229034
10083 229034 171397 216116 238302 242602 219222 207001 241974 252432 231208 245965 244826 299851
10071 299851 297431 247560 241881 249569 247636 239789 242697 276117 289784 311913 355053 346476 306747
10058 306747 259366 268926 303529 284329 255225 287885 298842 305927 353567 382128 356526 366075
10046 366075 380906 394590 430393 466940 486258 509428 556631 567663 557296 571854 598867
10035 598867 585869 530888 501825 531792 567787 562889 544706 544942 581670 584760 582279 570659
$$ packed form
10120A80149K9486r975l8149k7414k8153K6832J5206k8191k7034J6512J4643j1299
10108A12613j7643K0610l224P348j7453m4863Q340P1476M7634o745p667l228J0511
10095A77709n375r743j2846j0906J0816l396q998J9797M4826L6961J2147k1958
10083B29034n7637M4719K2186M300k3380j2221L4973J0458k1224J4757j139N5025
10071B99851k420m9871n679P688j933p847K908L3420J3667K2129M3140q577l9729
10058C06747m7381R560L4603j9200k9104L2660J0957P085M7640K8561k5602R549
10046C66075J4831J3684L5803L6547J9318K3170M7203J1032j0367J4558K7013
10035E98867j2998n4981k9063K9967L5995m898j8183K36L6728L090k481j1620
$$ plain form
10023 570659 551602 596989 635246 652632 674640 668250 661402 658149 677839 737359 789427 824849
10011 824849 826537 837780 833446 865573 886482 893573 911685 944962 976885 1067885 1094685 1099771
9999 1099771 1104893 1121904 1175568 1193577 1217778 1270110 1342171 1406150 1456877 1518635 1607830 1676603
9987 1676603 1704518 1699485 1756463 1865077 1982445 2086793 2162745 2261275 2398813 2508187 2607533
9976 2607533 2702108 2828912 2977498 3119501 3273195 3459439 3661865 3852957 4037871 4234204
9966 4234204 4440046 4676540 4958827 5165541 5364281 5593312 5881441 6222881 6547239 6839220
9956 6839220 7058820 7321594 7596121 7895589 8149107 8343061 8539433 8773415 9019710 9254553
9946 9254553 9466168 9638264 9861560 10095903 10258528 10384179 10593632 10823785 11034161 11296576
$$ packed form
10023E70659j9057M5387L8257J7386K2008o390o848l253J9690N9520N2068L5422
10011H24849J688J1243m334L2127K0909P091J8112L3277L1923R1000K6800N086
9999A099771N122J7011N3664J8009K4201N2332P2061O3979N0727O1758Q9195O8773
9987A676603K7915n033N6978J08614J17368J04348P5952R8530J37538J09374R9346
9976B607533R4575J26804J48586J42003J53694J86244K02426J91092J84914J96333
9966D234204K05842K36494K82287K06714J98740K29031K88129L41440L24358K91981
9956F839220K19600K62774K74527K99468K53518J93954J96372K33982K46295K34843
9946I254553K11615J72096K23296K34343J62625J25651K09453K30153K10376K62415
$$ plain form
9936 11296576 11522119 11758344 12025055 12344885 12703671 13061648 13413203 13698115 13917154
9927 13917154 14088737 14308353 14544099 14769016 14954182 15164228 15341466 15499931 15634310
9918 15634310 15745072 15814149 15799428 15735191 15637196 15516429 15407615 15201381 14944733 14637870
9908 14637870 14370406 14113856 13879296 13595049 13280249 12937103 12661221 12415711 12140552
9899 12140552 11877100 11708407 11549845 11319024 11037546 10823439 10656255 10489308 10362738
9890 10362738 10239305 10038701 9873678 9683828 9490703 9341543 9201353 9076369 8910065
9881 8910065 8773795 8679762 8505976 8349043 8200881 8028474 7847350 7660139 7481061 7283629
9871 7283629 7070874 6854877 6641718 6495410 6345007 6171239 6016052 5812336 5652819 5483897
$$ packed form
9936A1296576K25543K36225K66711L19830L58786L57977L51555K84912K19039
9927A3917154J71583K19616K35746K24917J85166K10046J77238J58465J34379
9918A5634310J10762O9077j4721o4237r7995j20767j08814k06234k56648l06863
9908A4637870k67464k56550k34560k84247l14800l43146k75882k45510k75159
9899A2140552k63452j68693j58562k30821k81478k14107j67184j66947j26570
9890A0362738j23433k00604j65023j89850j93125j49160j40190j24984j66304
9881H910065j36270r4033j73786j56933j48162j72407j81124j87211j79078j97432
9871G283629k12755k15997k13159j46308j50403j73768j55187k03716j59517j68922
$$ plain form
9861 5483897 5330625 5149002 5020238 4861972 4678012 4544559 4423817 4310515 4185481 4086102
9851 4086102 3957992 3861571 3722180 3603336 3470051 3334717 3291298 3286445 3204794 3094136
9841 3094136 2987449 2935316 2873701 2812768 2753332 2691290 2596966 2492275 2430962 2378298 2314241
9830 2314241 2253744 2203803 2195953 2136489 2090236 2065731 2003597 1934867 1867720 1784523 1715787 1707214
9818 1707214 1672814 1704123 1689303 1652356 1613093 1580201 1571087 1575036 1537844 1468981 1411346 1344496
9806 1344496 1301415 1264266 1206308 1216689 1196707 1166731 1169468 1129386 1129322 1069888 1064529 1044209
9794 1044209 1039678 999119 919703 915498 923167 932705 920075 855183 816286 814483 801578 791236
9782 791236 844835 858705 816393 798086 788842 774735 711319 708929 726915 706817 679923 661966
$$ packed form
9861E483897j53272j81623j28764j58266j83960j33453j20742j13302j25034r9379
9851D086102j28110r6421j39391j18844j33285j35334m3419m853q1651j10658
9841C094136j06687n2133o1615o0933n9436o2042r4324j04691o1313n2664o4057
9830B314241o0497m9941p850n9464m6253k4505o2134o8730o7147q3197o8736q573
9818A707214l4400L1309j4820l6947l9263l2892r114L949l7192o8863n7635o6850
9806A344496m3081l7149n7958J0381j9982k9976K737m0082o4n9434n359k0320
9794A044209m531m0559p9416m205P669R538j2630o4892l8897j803j2905j0342
9782G91236N3599J3870m2312j8307r244j4107o3416k390J7986k0098k6894j7957
$$ plain form
9770 661966 646789 611989 591985 581615 572279 573631 534407 525096 542046 522408 509939 502652
9758 502652 484478 472469 457892 475778 518641 509012 516445 502534 485002 482561 486987 441415
9746 441415 404873 444042 438951 411571 406463 409978 415246 395704 372771 407288 400316 384880 357213
9733 357213 357360 364275 395922 431894 400086 374414 379957 417167 379888 352612 344447 321678 314586
9720 314586 301608 278236 264073 273719 280730 274397 234508 215164 231325 278241 307165 281248
9708 281248 264340 267610 263644 215849 234991 211564 187747 231869 258794 285872 332443 291306
9696 291306 249167 255264 281307 271864 255506 270074 261546 242064 257960 220926 238411 259961
9684 259961 255796 242272 249042 278415 295528 293684 268588 287449 282584 258040 260609 219293 214657
$$ packed form
9770F61966j5177l4800k0004j0370r336J352l9224r311J6950j9638j2469p287
9758E02652j8174j2009j4577J7886M2863r629P433j3911j7532k441M426m5572
9746D41415l6542L9169n091k7380n108L515N268j9542k2933L4517o972j5436k7667
9733C57213J47O915L1647L5972l1808k5672N543L7210l7279k7276q165k2769p092
9720C14586j2978k3372j4163R646P011o333l9889j9344J6161M6916K8924k5917
9708B81248j6908L270l966m7795J9142k3427k3817M4122K6925K7078M6571m1137
9696B91306m2139O097K6043r443j6358J4568q528j9482J5896l7034J7485K1550
9684B59961m165j3524O770K9373J7113j844k5096J8861m865k4544K569m1316m636
$$ plain form
9671 214657 254741 278780 260557 228361 184187 152961 90023 95056 135314 159299 174444 197057
9659 197057 263731 287734 299665 280780 238382 242394 227759 205670 206913 207118 167051 196012
9647 196012 191322 156997 182346 207070 203497 238809 227541 218870 189983 150158 156265 185923
9635 185923 247002 236763 222788 239418 200662 160377 170283 158321 99904 74439 118651 143943
9623 143943 143793 185921 132872 131767 172801 146801 115427 143713 126174 109785 109737 59829 50754
9610 50754 64441 87640 99737 94750 109907 140006 143639 173863 189252 157445 122002 100035
9598 100035 142036 140668 106244 132655 144556 146712 127133 145937 192006 222623 224776 233344
9586 233344 183232 158869 145760 149064 165482 182592 163902 162573 192656 203433 176649 165631
$$ packed form
9671B14657M0084K4039j8223l2196m4174l1226o2938N033M0258K3985J5145K2613
9659A97057O6674K4003J1931j8885m2398M012j4635k2089J243K05m0067K8961
9647A96012m690l4325K5349K4724l573L5312j1268q671k8887l9825O107K9658
9635A85923O1079j0239j3975J6630l8756m0285R906j1962n8417k5465M4212K5292
9623A43943j50M2128n3049j105M1034k6000l1374K8286j7539j6389m8m9908r075
9610E0754J3687K3199J2097m987J5157L0099L633L0224J5389l1807l5443k1967
9598A00035M2001j368l4424K6411J1901K156j9579J8804M6069L0617K153Q568
9586B33344n0112k4363j3109L304J6418J7110j8690j329L0083J0777k6784j1018
$$ plain form
9574 165631 109793 131618 147208 135472 131644 116353 114662 135317 133433 140361 122814 124119 134222
9561 134222 162810 149731 113440 85518 101759 160762 169415 129471 103312 128126 119618 101477
9549 101477 127655 156831 136010 142056 157470 156767 91571 40434 86471 129586 181914 171937
9537 171937 159388 135043 129143 108255 101060 123270 133117 112576 68342 115975 140067 99107
9525 99107 70297 107744 113670 114568 108157 131208 107532 106009 131146 123925 90539 75480 95563
9512 95563 132939 150185 168783 149024 114096 99804 108958 108745 138893 173831 146348 135104
9500 135104 122629 87060 64082 76568 99976 116630 119045 160018 189947 173362 136210 110082
9488 110082 92855 101985 96851 92930 107098 128254 134693 145643 159280 123822 124477 154382 107206
$$ packed form
9574A65631n5838K1825J5590j1736l828j5291j691K0655j884O928j7547J305J0103
9561A34222K8588j3079l6291k7922J6241N9003Q653l9944k6159K4814q508j8141
9549A01477K6178K9176k0821O046J5414p03o5196n1137M6037M3115N2328r977
9537A71937j2549k4345n900k0888p195K2210R847k0541m4234M7633K4092m0960
9525I9107k8810L7447N926Q98o411K3051k3676j523K5137p221l3386j5059K0083
9512I5563L7376J7246J8598j9759l4928j4292R154k13L0148L4938k7483j1244
9500A35104j2475l5569k2978J2486K3408J6654K415M0973K9929j6585l7152k6128
9488A10082j7227R130n134l921J4168K1156O439J0950J3637l5458O55K9905m7176
$$ plain form
9475 107206 101984 131518 177735 162623 148599 150146 139972 101823 113782 108592 157792 178836
9463 178836 119876 88498 81654 73485 65700 79604 115151 137536 148386 168374 224750 269884
9451 269884 250192 213702 205431 172592 120275 92523 125427 116800 101738 98718 96694 132376
9439 132376 138508 172773 158843 105949 103855 99225 143700 174371 171160 170412 173750 164941 198490
9426 198490 214280 177924 115365 144343 206697 193336 156059 165369 156880 124414 115423 108863
9414 108863 162643 210082 188400 115588 103344 108674 152217 181964 200967 196890 213548 208790
9402 208790 220728 180243 147232 148133 162037 135062 157833 184304 187054 150290 143006 164446
9390 164446 124813 141316 172711 164068 172224 154553 142192 169934 165381 119037 128392 156232
$$ packed form
9475A07206n222K9534M6217j5112j4024J547j0174l8149J1959n190M9200K1044
9463A78836n8960l1378o844q169p785J3904L5547K2385J0850J9988N6376M5134
9451B69884j9692l6490q271l2839n2317k7752L2904q627j5062l020k024L5682
9439A32376O132L4265j3930n2894k094m630M4475L0671l211p48L338q809L3549
9426A98490J5790l6356o2559K8978O2354j3361l7277R310q489l2466q991o560
9414A08863N3780M7439k1682p2812j2244N330M3543K9747J9003m077J6658m758
9402B08790J1938m0485l3011R01J3904k6975K2771K6471K750l6764p284K1440
9390A64446l9633J6503L1395q643Q156j7671j2361K7742m553m6344R355K7840
$$ plain form
9378 156232 152266 180131 204477 175357 202668 198508 174261 156320 160819 186823 218408 238767
9366 238767 266932 263867 199123 152278 157242 195058 222224 217456 209584 213544 182087 168014 144054
9353 144054 166038 198891 220336 227879 262438 274226 258474 269107 289452 285365 302343 307813
9341 307813 277013 276492 273515 289868 320059 289528 299838 293892 262758 263371 245956 235410 295370
9328 295370 353928 377779 368386 349005 328940 378056 395022 375861 347548 344401 386044 396625
9316 396625 391079 374905 378529 420576 399976 421139 448132 416462 408620 413697 447977 438431 471947
9303 471947 503830 523341 533120 487237 477169 570744 635168 608864 611047 690390 779328 792705
9291 792705 750362 785344 793168 815030 825146 828883 824742 859013 850229 867139 920540 985315
$$ packed form
9378A56232l966K7865K4346k9120K7311m160k4247j7941M499K6004L1585K0359
9366B38767K8165l065o4744m6845M964L7816K7166m768p872L960l1457j4073k3960
9353A44054K1984L2853K1445P543L4559J1788j5752J0633K0345m087J6978N470
9341C07813l0800n21k977J6353L0191l0531J0310n946l1134O13j7415j0546N9960
9328B95370N8558K3851r393j9381k0065M9116J6966j9161k8313l147M1643J0581
9316C96625n546j6174L624M2047k0600K1163K6993l1670p842N077L4280r546L3516
9303D71947L1883J9511R779m5883j0068R3575O4424k6304K183P9343Q8938J3377
9291G92705m2343L4982P824K1862J0116L737m141L4271q784J6910N3401O4775
$$ plain form
9279 985315 1073382 1161397 1206206 1228633 1241494 1254766 1313375 1375901 1419980 1478619 1536695 1587144
9267 1587144 1639085 1708347 1758882 1777899 1853972 1990715 2114129 2200634 2303710 2372262 2471152
9256 2471152 2550834 2675243 2818501 2920579 2985745 3047986 3084895 3114368 3174276 3206926 3245309
9245 3245309 3263244 3297793 3327491 3355312 3342448 3301140 3246024 3197014 3151233 3143230 3125978 3076858
9233 3076858 2976609 2914501 2894973 2830036 2755406 2639148 2523884 2455909 2406158 2339107 2256318
9222 2256318 2172665 2112794 2089342 2082018 2062641 1990049 1919717 1890429 1834096 1800404 1738143 1677944
9210 1677944 1591194 1494710 1464587 1431835 1433048 1410595 1355628 1344812 1310334 1273458 1193907 1180426
9198 1180426 1188281 1181754 1161158 1134908 1076764 1045561 1045102 1046403 1012972 1008407 972479 927780 862937
$$ packed form
9279I85315Q8067Q8015M4809K2427J2861J3272N8609O2526M4079N8639N8076N0449
9267A587144N1941O9262N0535J9017P6073J36743J23414Q6505J03076O8552R8890
9256B471152P9682J24409J43258J02078O5166O2241L6909K9473N9908L2650L8383
9245C245309J7935L4549K9698K7821j2864m1308n5116m9010m5781q003j7252m9120
9233C076858j00249o2108j9528o4937p4630j16258j15264o7975m9751o7051q2789
9222B256318q3653n9871k3452p324j9377p2592p0332k9288n6333l3692o2261o0199
9210A677944q6750r6484l0123l2752J213k2453n4967j0816l4478l6876p9551j3481
9198A180426P855o527k0596k6250n8144l1203m59J301l3431m565l5928m4699o4843
$$ plain form
9185 862937 843988 837666 804360 794376 849457 874232 892333 880767 827420 775892 739003 730784
9173 730784 724892 731426 728437 737924 694465 705138 683844 649357 584226 604197 634107 607208
9161 607208 636218 666879 692645 657948 620266 572687 574143 585398 548665 551952 536024 546958
9149 546958 533386 485410 418412 416596 453519 477454 459967 441570 478883 538959 522744 492285
9137 492285 497712 509688 497550 504009 549356 553095 507237 494370 447260 451811 460357 477367 469460
9124 469460 475328 488257 465614 424468 398718 374154 363992 393774 392592 381588 373107 384115
9112 384115 386784 423002 452440 441933 379459 327106 323109 381339 440419 482346 449519 385893
9100 385893 383295 402802 418371 419577 384736 354210 391056 378046 358296 376830 411853 398689
$$ packed form
9185H62937j8949o322l3306r984N5081K4775J8101j1566n3347n1528l6889q219
9173G30784n892O534k989R487m3459J0673k1294l4487o5131J9971K9910k6899
9161F07208K9010L0661K5766l4697l7682m7579J456J1255l6733L287j5928J0934
9149E46958j3572m7976o6998j816L6923K3935j7487j8397L7313O0076j6215l0459
9137D92285N427J1976j2138O459M5347L739m5858j2867m7110M551Q546J7010p907
9124D69460N868J2929k2643m1146k5750k4564j0162K9782j182j1004q481J1008
9112C84115K669L6218K9438j0507o2474n2353l997N8230N9080M1927l2827o3626
9100C85893k598J9507J5569J206l4841l0526L6846j3010j9750J8534L5023j3164
$$ plain form
9088 398689 380119 375168 363080 335833 289566 274379 294699 278829 235618 259463 283468 315989
9076 315989 350983 356603 372300 362503 339635 355034 359367 365250 345007 315489 333488 371422
9064 371422 371820 385285 434537 405263 355007 355875 366574 405469 370471 324901 319019 337369 364077
9051 364077 335211 306272 311997 279460 304402 347745 332689 323904 328863 314267 273543 232160
9039 232160 221108 270676 269793 257358 292751 351314 362754 349474 306759 320363 358669 351007
9027 351007 384713 372222 294259 348036 381371 350568 311222 272975 267473 268591 293844 281466
9015 281466 244999 217451 203975 209121 186971 198987 258301 264817 210053 189447 215442 232818
9003 232818 247760 227582 201932 206345 235907 303292 343595 349799 340167 346091 360463 338606
$$ packed form
9088C98689j8570m951j2088k7247m6267j5187K0320j5870m3211K3845K4005L2521
9076C15989L4994N620J5697r797k2868J5399M333N883k0243k9518J7999L7934
9064C71422L98J3465M9252k9274n0256Q68J0699L8895l4998m5570n882J8350K6708
9051C64077k8866k8939N725l2537K4942M3343j5056q785M959j4596m0724m1383
9039B32160j1052M9568q83j2435L5393N8563J1440j3280m2715J3604L8306p662
9027C51007L3706j2491p7963N3777L3335l0803l9346l8247n502J118K5253j2378
9015B81466l6467k7548j3476N146k2150J2016N9314O516n4764k0606K5995J7376
9003B32818J4942k0178k5650M413K9562O7385M0303O204r632N924J4372k1857
$$ plain form
8991 338606 320411 269102 218145 190313 204154 243171 253561 249788 260901 265660 252154 264031
8979 264031 276589 301044 287718 259943 258613 244408 229574 197244 211159 227749 206101 192849
8967 192849 217926 196803 150648 192024 201157 182914 183062 174635 147949 170888 205708 241907
8955 241907 275013 304725 319910 341909 387455 411137 403585 396801 380000 391131 402069 397420
8943 397420 402080 395483 356659 329985 301344 300821 338626 351877 319626 326589 332518 343162 381056
8930 381056 376077 355577 322413 373430 377107 347731 349533 355676 325511 338463 353498 356973 342104
8917 342104 303462 326624 369050 372643 325870 353451 346884 327684 324939 359838 401252 382665
8905 382665 410584 377283 363900 394904 385946 339365 365232 377196 381544 355926 331307 360465
$$ packed form
8991C38606j8195n1309n0957k7832J3841L9017J0390l773J1113M759j3506J1877
8979B64031J2558K4455j3326k7775j330j4205j4834l2330J3915J6590k1648j3252
8967A92849K5077k1123m6155M1376R133j8243J48q427k6686K2939L4820L6199
8955B41907L3106K9712J5185K1999M5546K3682p552o784j6801J1131J0938m649
8943C97420M660o597l8824k6674k8641n23L7805J3251l2251O963N929J0644L7894
8930C81056m979k0500l3164N1017L677k9376J802O143l0165J2952J5035L475j4869
8917C42104l8642K3162M2426L593m6773K7581o567j9200k745L4899M1414j8587
8905C82665K7919l3301j3383L1004q958m6581K5867J1964M348k5618k4619K9158
$$ plain form
8893 360465 364151 389426 344256 339426 307966 269573 261621 274364 305018 324817 346418 331450
8881 331450 319617 347682 333180 268844 284215 281881 263960 272690 279700 290120 294214 301211 303388
8868 303388 286367 278020 281081 314136 295613 272273 279417 313099 328992 322542 325695 306671 289267
8855 289267 311888 363267 385518 351451 347457 330680 282886 285018 293190 300309 274012 259113
8843 259113 262720 253884 216125 192482 170150 149834 142270 114572 100582 85803 102158 118670
8831 118670 146137 175177 168482 155017 133483 149683 129768 74594 71640 97106 126794 154838
8819 154838 152527 162025 187154 241580 216433 190422 203782 164002 112460 163849 192332 209321
8807 209321 242611 246142 249376 228907 213783 204725 198704 142511 138147 132620 131321 162815 163125
$$ packed form
8893C60465L686K5275m5170m830l1460l8393p952J2743L0654J9799K1601j4968
8881C31450j1833K8065j4502o4336J5371k334j7921Q730P010J0420M094O997K177
8868C03388j7021q347L061L3055j8523k3340P144L3682J5893o450L153j9024j7404
8855B89267K2621N1379K2251l4067l994j6777m7794K132Q172P119k6297j4899
8843B59113L607q836l7759k3643k2332k0316p564k7698j3990j4779J6355J6512
8831A18670K7467K9040o695j3465k1534J6200j9915n5174k954K5466K9688K8044
8819A54838k311R498K5129N4426k5147k6011J3360l9780n1542N1389K8483J6989
8807B09321L3290L531L234k0469j5124r058o021n6193m364n527j299L1494L10
$$ plain form
8794 163125 113237 84781 85110 104143 156706 150807 144863 128723 154117 123490 78015 32369
8782 32369 64595 97007 77311 38587 44300 78685 94259 102281 91204 65758 76888 103810
8770 103810 107467 134643 174711 128200 158731 160877 97806 84164 113539 93497 75608 102986
8758 102986 140992 161283 149876 158741 162401 140235 117900 157362 134925 86411 64005 81301
8746 81301 125751 139897 161677 122516 85118 63473 16813 21838 74028 104497 145327 165159
8734 165159 119864 132082 165241 191629 221423 210471 201182 182458 165310 192327 217203 202669
8722 202669 149316 109521 51803 69073 110835 123193 122959 183932 185683 134902 87680 76684
8710 76684 114750 125412 153972 160265 151230 184191 269584 269571 296901 326130 260104 210801 203135
$$ packed form
8794A63125m9888k8456L29J9033N2563n899n944j6140K5394l0627m5475m5646
8782C2369L2226L2412j9696l8724N713L4385J5574Q022j1077k5446J1130K6922
8770A03810L657K7176M0068m6511L0531K146o3071j3642K9375k0042j7889K7378
8758A02986L8006K0291j1407Q865L660k2166k2335L9462k2437m8514k2406J7296
8746H1301M4450J4146K1780l9161l7398k1645m6660N025N2190L0469M0830J9832
8734A65159m5295J2218L3159K6388K9794j0952r289j8724j7148K7017K4876j4534
8722B02669n3353l9795n7718J7270M1762J2358k34O0973J751n0781m7222j0996
8710G6684L8066J0662K8560O293r035L2961Q5393j3K7330K9229o6026m9303p666
$$ plain form
8697 203135 193062 167062 110522 114838 158953 227808 253239 225675 173731 164384 144321 152952
8685 152952 151082 115308 118825 175974 203388 230609 213155 203577 171571 170572 207062 259253 263315
8672 263315 248009 245322 246978 258272 227929 217672 241952 226303 190973 194158 195542 217137
8660 217137 209607 198035 188388 147490 159505 220182 305549 391819 426165 460776 475656 413176
8648 413176 316641 252847 251167 248126 261895 310614 334350 314482 252669 231435 239798 251008
8636 251008 222856 180023 155269 162560 181305 222280 223385 254320 273783 298154 293598 307923
8624 307923 323073 326781 346428 363367 322207 289456 303454 330834 335371 359394 403022 428059
8612 428059 439722 422323 448732 486824 478921 455988 484889 495402 539956 516197 503015 494329
$$ packed form
8697B03135j0073k6000n6540M316M4115O8855K5431k7564n1944r347k0063Q631
8685A52952j870l5774L517N7149K7414K7221j7454r578l2006r99L6490N2191M062
8672B63315j5306k687J656J1294l0343j0257K4280j5649l5330L185J384K1595
8660B17137p530j1572r647m0898J2015O0677Q5367Q6270L4346L4611J4880o2480
8648D13176r6535o3794j680l041J3769M8719K3736j9868o1813k1234Q363J1210
8636B51008k8152m2833k4754P291J8745M0975J105L0935J9463K4371m556J4325
8624C07923J5150L708J9647J6939m1160l2751J3998K7380M537K4023M3628K5037
8612D28059J1663j7399K6409L8092p903k2933K8901J0513M4554k3759j3182q686
$$ plain form
8600 494329 504789 525722 561268 596460 596780 618332 647612 624273 640868 673657 704418 683874
8588 683874 662512 645362 608453 567187 536205 493253 429697 413988 435919 489202 498222 450687
8576 450687 472897 532725 626692 768607 959539 1087615 1181474 1148641 999309 820024 670732
8565 670732 547055 458467 447852 464796 432550 397521 383071 355868 366348 359681 367820 375811
8553 375811 328845 276277 238403 233410 211010 268297 308981 285420 284775 285640 265783 272031 272593
8540 272593 288858 344272 367930 381255 275298 252769 263964 320214 373839 453282 573120
8529 573120 685465 821087 896056 859775 825003 760179 688274 561477 508278 541732 553636
8518 553636 573631 537725 520808 600494 722080 858768 963812 985925 866325 655747 491223
$$ packed form
8600D94329J0460K0933L5546L5192L20K1552K9280k3339J6595L2789L0761k0544
8588F83874k1362j7150l6909m1266l0982m2952o3556j5709K1931N3283R020m7535
8576D50687K2210N9828R3967J41915J90932J28076R3859l2833j49332j79285j49292
8565F70732j23677q8588j0615J6944l2246l5029j4450k7203J0480o667Q139P991
8553C75811m6966n2568l7874m993k2400N7287M0684k3561o45Q65j9857O248N62
8540B72593J6265N5414K3658J3325j05957k2529J1195N6250N3625P9443J19838
8529E73120J12345J35622P4969l6281l4772o4824p1905j26797n3199L3454J1904
8518E53636J9995l5906j6917P9686J21586J36688J05044K2113j19600k10578j64524
$$ plain form
8507 491223 421301 425977 375952 363446 328854 309480 360301 404569 373789 332326 330359 350236
8495 350236 358210 372619 413160 455046 517059 626084 713725 811816 833475 824486 776844 630707
8483 630707 559917 512941 445454 450739 506961 495044 503261 571931 729306 892850 983154 995060
8471 995060 862053 622100 488553 448964 461379 430558 402708 380391 362331 359868 384837
8460 384837 396813 398802 377453 368859 369448 360497 345081 322157 275640 248139 178974 141489 150177
8447 150177 115453 115697 140390 194781 181671 170863 117382 123719 155826 165072 131668 136426 127216
8434 127216 110862 129046 136951 105733 79656 82507 60364 81705 61554 105189 124924 85386
8422 85386 77572 85756 78742 81378 102232 101723 102217 106316 102815 112535 102545 120144 120800 92319 117350
$$ packed form
8507D91223o9922M676n0025j2506l4592j9374N0821M4268l0780m1463j967J9877
8495C50236P974J4409M0541M1886O2013J09025Q7641R8091K1659q989m7642j46137
8483F30707p0790m6976o7487N285N6222j1917Q217O8670J57375J63544R0304J1906
8471I95060j33007k39953j33547l9589J2415l0821k7850k2317j8060k463K4969
8460C84837J1976J989k1349q594N89q951j5416k2924m6517k7501o9165l7485Q688
8447A50177l4724K44K4693N4391j3110j0808n3481O337L2107R246l3404M758r210
8434A27216j6354J8184P905l1218k6077K851k2143K1341k0151M3635J9735l9538
8422H5386p814Q184p014K636K0854n09M94M099l501R720r990J7599O56k8481K5031
$$ plain form
8407 117350 128884 118038 109307 105372 106047 111760 98693 99929 61919 20754 60832 85168 89047
8394 89047 58383 75131 85741 85896 63607 86832 83042 109368 139797 131946 91015 49241 18117
8381 18117 8784 -1554 -37523 -4802 1349 12718 42539 48668 66625 57902 1964 -2901 24537
8368 24537 35571 -3727 -12477 37047 83441 115609 100182 77896 53861 50391 78551 61980
8356 61980 22413 6229 7012 53917 64547 53380 20725 -5781 18682 34871 38876 34634 44578
8343 44578 68628 87096 69275 59209 42704 52805 73072 67810 63878 65284 36750 -4079
8331 -4079 -39599 -44154 1079 59257 121364 83446 62879 44624 35258 32287 55887 42605 34345
8318 34345 38330 39453 34559 27749 11503 10263 -3822 -42038 -3408 38126 45365 30546 9864
$$ packed form
8407A17350J1534j0846q731l935O75N713j3067J236l8010m1165M0078K4336L879
8394H9047l0664J6748J0610J55k2289K3225l790K6326L0429p851m0931m1774l1124
8381A8117r333j0338l5969L2721O151J1369K9821O129J7957q723n5938m865K7438
8368B4537J1034l9298q750M9524M6394L2168j5427k2286k4035l470K8160j6571
8356F1980l9567j6184P83M6905J0630j1167l2655k6506K4463J6189M005m242R944
8343D4578K4050J8468j7821j0066j6505J0101K0267n262l932J406k8534m0829
8331d079l5520m555M5233N8178O2107l7918k0567j8255r366k971K3600j3282q260
8318C4345L985J123m894o810j6246j240j4085l8216L8630M1534P239j4819k0682
$$ plain form
8305 9864 -3040 -29162 -6441 10020 27679 23487 -26423 -49034 21460 80832 79142 62981
8293 62981 58061 76405 48561 32804 -3074 -15768 6190 53307 73423 76607 91276 79003
8281 79003 62445 67964 54359 -1881 -4108 -11392 -23673 -15810 22336 49970 27629 -2680 39956
8268 39956 74755 46513 -38542 -79708 -59894 -60224 -59155 -66727 -38599 20242 26036 -9332 -39901
8255 -39901 -19790 2587 -8095 -35264 -9769 7512 37197 40372 11250 -2687 -15667 -17066
8243 -17066 6703 -13356 31243 44611 43171 32676 42151 24547 20489 55910 79892 83838 79137
8230 79137 62780 55683 5262 -16905 3019 12101 25340 17036 -11720 -25039 -31701 8834 34055
8217 34055 -21716 -17783 16372 1003 -14271 -23890 -22235 12004 80193 85170 57973 74504 101085
$$ packed form
8305I864j2904k6122K2721J6461J7659m192m9910k2611P0494N9372j690j6161
8293F2981m920J8344k7844j5757l5878j2694K1958M7117K0116L184J4669j2273
8281G9003j6558N519j3605n6240k227p284j2281P863L8146K7634k2341l0309M2636
8268C9956L4799k8242q5055m1166J9814l30J069p572K8128N8841N794l5368l0569
8255c9901K0111K2377j0682k7169K5495J7281K9685L175k9122j3937j2980j399
8243a7066K3769k0059M4599J3368j440j0495R475j7604m058L5421K3982L946m701
8230G9137j6357p097n0421k2167J9924R082J3239q304k8756j3319o662M0535K5221
8217C4055n5771L933L4155j5369j5274r619J655L4239O8189M977k7197J6531K6581
$$ plain form
8204 101085 128780 90596 94631 105200 103267 125274 59140 4800 5765 30984 27564 19241 32638
8191 32638 31506 45104 24498 37887 48441 21072 17101 39716 44109 56077 27867 8070
8179 8070 13016 -7689 -35624 -3728 33865 30561 -9601 19016 57702 45143 39807 38926 38041
8166 38041 45584 32492 60193 52480 57013 26681 6383 71368 65113 72950 99290 102146 48544
8153 48544 47870 78712 89431 70227 79499 77046 111927 149053 151886 167843 178315 148488 155762
8140 155762 162402 164578 184682 140615 120505 131114 145209 163861 170937 167052 170128 173795 167554
8127 167554 181299 149284 141517 119743 95277 58883 22071 122 33574 60722 94267 120108
8115 120108 105522 72250 116305 113458 100937 92257 59309 95247 109357 104607 135746 141368
$$ packed form
8204A01085K7695l8184M035J0569j933K2007o6134n4340R65K5219l420q323J3397
8191C2638j132J3598k0606J3389J0554k7369l971K2615M393J1968k8210j9797
8179H070M946k0705k7935L1896L7593l304m0162K8617L8686j2559n336q81q85
8166C8041P543j3092K7701p713M533l0332k0298O4985o255P837K6340K856n3602
8153D8544o74L0842J0719j9204R272k453L4881L7126K833J5957J0472k9827P274
8140A55762O640K176K0104m4067k0110J0609J4095J8652P076l885L076L667o241
8127A67554J3745l2015p767k1774k4466l6394l6812k1949L3452K7148L3545K5841
8115A20108j4586l3272M4055k847j2521q680l2948L5938J4110m750L1139N622
$$ plain form
8103 141368 139638 152343 179978 161573 185455 240998 276498 253812 226258 222036 245795 227254
8091 227254 205294 193208 160455 161136 150149 186653 172916 150601 131016 87508 94839 75263
8079 75263 110058 144749 143006 131796 151628 134751 138876 203424 226793 209886 178884 158180
8067 158180 185203 249570 254807 241832 225305 255970 243875 229080 219584 204820 217222 213401
8055 213401 183570 166255 156949 204812 204120 211901 235321 247988 301185 283695 242804 243050 243203
8042 243203 215886 227758 234608 237089 249470 243184 243215 238472 276593 319462 275092 230695 218984
8029 218984 215980 181360 149202 185114 213851 275435 261022 177119 105165 112557 154145 191947
8017 191947 192904 208625 204552 200288 218313 194710 193949 172041 177204 222920 226412 254301 273204
$$ packed form
8103A41368j730J2705K7635j8405K3882N5543L5500k2686k7554m222K3759j8541
8091B27254k1960j2086l2753O81j0987L6504j3737k2315j9585m3508P331j9576
8079G5263L4795L4691j743j1210J9832j6877M125O4548K3369j6907l1002k0704
8067A58180K7023O4367N237j2975j6527L0665j2095j4795r496j4764J2402l821
8055B13401k9831j7315r306M7863o92P781K3420J2667N3197j7490m0891K46J53
8042B43203k7317J1872O850K481J2381o286L1m743L8121M2869m4370m4397j1711
8029B18984l004l4620l2158L5912K8737O1584j4413q3903p1954P392M1588L7802
8017A91947R57J5721m073m264J8025k3603p61k1908N163M5716L492K7889J8903
$$ plain form
8004 273204 288218 275110 253951 276266 303794 289387 307480 318997 270307 259121 297773 304395
7992 304395 257341 236376 229311 202903 131924 144877 140617 125746 85711 61973 89896 122535
7980 122535 154018 129329 117059 116840 104805 90163 123094 127111 150249 147063 150190 173936 150864
7967 150864 128353 95379 104875 113425 135093 161713 180764 194181 212549 210747 185222 170265
7955 170265 150924 114822 132380 162817 192927 208202 254324 279733 241097 215759 215132 165991
7943 165991 162661 173749 168358 136746 101705 53252 59941 106322 97244 86955 63373 71954 138249
7930 138249 139830 95200 133631 171806 167809 167110 163561 181905 181145 184030 159482 150664 114837
7917 114837 85642 84971 92555 118014 84995 54764 45273 73474 55088 2221 32543 99721
$$ packed form
8004B73204J5014j3108k1159K2315K7528j4407J8093J1517m8690j1186L8652O622
7992C04395m7054k0965p065k6408p0979J2953m260j4871m0035k3738K7923L2639
7980A22535L1483k4689j2270k19j2035j4642L2931M017K3138l186L127K3746k3072
7967A50864k2511l2974R496Q550K1668K6620J9051J3417J8368j802k5525j4957
7955A70265j9341l6102J7558L0437L0110J5275M6122K5409l8636k5338o27m9141
7943A65991l330J1088n391l1612l5041m8453O689M6381r078j0289k3582Q581O6295
7930A38249J581m4630L8431L8175l997o99l549J8344p60K885k4548q818l5827
7917A14837k9195o71P584K5459l3019l0231r491K8201j8386n2867L0322O7178
$$ plain form
7905 99721 121407 144897 92416 34936 24968 27387 52487 77690 101990 121758 133987 115988
7893 115988 93125 95240 84241 73607 65939 77700 42884 51730 89090 109747 123747 133164
7881 133164 125593 137518 135460 122277 88040 81308 107745 104787 87689 60725 57317 55979 45721
7868 45721 14249 30340 11012 10990 38510 75220 86008 51688 32650 39198 4073 -69672 -71052
7855 -71052 -18885 44095 38520 9526 15555 36264 34468 -2358 -28423 -6196 15342 -130
7843 -130 12660 48661 34523 -17867 -7323 9192 9784 35501 7706 31035 15924 10547 11068
7830 11068 20673 -9159 -40945 -30748 -1896 -8548 32907 71053 38279 70562 94808 114776
7818 114776 105200 95705 103625 73558 75397 71106 63452 84098 88970 53286 -11992 -44802 -73514
$$ packed form
7905I9721K1686K3490n2481n7480r968K419K5100K5203K4300J9768J2229j7999
7893A15988k2863K115j0999j0634p668J1761l4816Q846L7360K0657J4000R417
7881A33164p571J1925k058j3183l4237o732K6437k958j7098k6964l408j338j0258
7868D5721l1472J6091j9328k2K7520L6710J0788l4320j9038O548l5125p3745j380
7855g1052N2167O2980n575k8994O029K0709j796l6826k6065K2227K1538j5472
7843a30J2790L6001j4138n2390J0544J6515N92K5717k7795K3329j5111n377N21
7830A1068R605k9832l1786J0197K8852o652M1455L8146l2774L2283K4246J9968
7818A14776r576r495P920l0067J839m291p654K0646M872l5684o5278l2810k8712
$$ plain form
7805 -73514 -11871 8345 -31217 -36165 -16570 4248 -8585 16794 42889 24856 -1860 10246
7793 10246 30097 22527 10370 5185 17032 -7143 -44610 -62134 -52378 -20723 -5059 2999 -38006
7780 -38006 -49169 -14683 -60606 -72380 -42060 -25555 -3334 20033 35985 1650 12139 29365
7768 29365 22064 9623 -47519 -31213 -19785 -19740 12878 17905 10260 63777 93178 39022 -1998
7755 -1998 -13711 25411 38569 5943 75742 99176 110451 112539 74672 16461 -28821 -67481
7743 -67481 -88919 -98981 -91744 -70011 -65292 -89719 -61071 -30762 -30073 -21729 -25815 -34272 -60992
7730 -60992 -33578 -30691 -19262 -17385 -19517 -16042 -14458 2441 6935 31448 58533 49417 -19281
7717 -19281 -2229 33696 57928 21409 -9331 -10507 -12895 -8268 -12220 -35302 -64320 -48852 -24971
$$ packed form
7805g3514O1643K0216l9562m948J9595K0818j2833K5379K6095j8033k6716J2106
7793A0246J9851p570j2157n185J1847k4175l7467j7524R756L1655J5664Q058m1005
7780c8006j1163L4486m5923j1774L0320J6505K2221K3367J5952l4335J0489J7226
7768B9365p301j2441n7142J6306J1428M5L2618N027p645N3517K9401n4156m1020
7755a998j1713L9122J3158l2626O9799K3434J1275K088l7867n8211m5282l8660
7743f7481k1438j0062P237K1733M719k4427K8648L0309O89Q344m086q457k6720
7730f0992K7414K887J1429J877k132L475J584J6899M494K4513K7085r116o8698
7717a9281J7052L5925K4232l6519l0740j176k388M627l952k3082k9018J5468K3881
$$ plain form
7704 -24971 25300 20004 -2903 -29302 -38913 -14356 12277 -8231 41568 61785 54018 382
7692 382 -60730 -78177 -49604 -25030 -14928 12746 33785 42506 19574 -15896 -45514 -19267
7680 -19267 17781 67597 84340 56309 45275 84558 119310 102512 81001 65226 92502 34077
7668 34077 19345 36766 55915 75315 111279 141322 104607 93588 71742 65202 32769 40883
7656 40883 56016 28209 19545 27980 3121 -894 33299 69130 50444 3455 2982 2345 -8148
7643 -8148 -19177 5793 -5508 -36896 -33645 21233 39448 30609 -24294 -49581 -17310 -6532
7631 -6532 1437 -38621 -77555 -85770 -58457 -33061 -26181 -1330 -17891 -14798 -15518 -16171 -6220 -4156
7617 -4156 47307 88654 51560 -2793 -7258 -18076 3153 -56750 -56540 -39340 -43639 -3270 22084
$$ packed form
7704b4971N0271n296k2907k6399r611K4557K6633k0508M9799K0217p767n3636
7692C82o1112j7447K8573K4574J0102K7674K1039Q721k2932l5470k9618K6247
7680a9267L7048M9816J6743k8031j1034L9283L4752j6798k1511j5775K7276n8425
7668C4077j4732J7421J9149J9400L5964L0043l6715j1019k1846o540l2433Q114
7656D0883J5133k7807q664Q435k4859m015L4193L5831j8686m6989m73o37j0493
7643h148j1029K4970j1301l1388L251N4878J8215q839n4903k5287L2271J0778
7631f532P969m0058l8934q215K7313K5396O880K4851j6561L093p20o53R951K064
7617d156N1463M1347l7094n4353m465j0818K1229n9903K10J7200m299M0369K5354
$$ plain form
7604 22084 9828 33192 -9196 8683 38344 10963 -519 -64634 -76219 -38279 7673 18810
7592 18810 -2324 -4039 -547 -32692 -19514 -41248 -53828 -64117 -56585 -29176 -29192 -65528 -72272
7579 -72272 -24858 28696 71171 73347 40471 42239 31029 7885 31672 32768 13301 6501 27974
7566 27974 28916 37504 2636 -70943 -74290 -45651 -47729 -45381 -51631 -46637 3851 40402 10633
7553 10633 -24099 -40703 1189 -9233 -7575 38596 61204 59403 75537 44047 -2274 36577
7541 36577 16619 36204 48146 37453 2898 -3675 -927 3250 -31031 1051 -16846 -59483
7529 -59483 -76617 -59723 -45047 -23794 -28047 -47136 -71246 -42181 -23742 14307 7712 -32366
7517 -32366 -80860 -71230 -78385 -90999 -92005 -23010 20373 -7914 -3757 -8690 -25282 -28256 -28955
$$ packed form
7604B2084j2256K3364m2388J7879K9661k7381j1482o4115j1585L7940M5952J1137
7592A8810k1134j715L492l2145J3178k1734j2580j0289P532K7409j6l6336o744
7579g2272M7414N3554M2475K176l2876J768j1210k3144K3787J096j9467o800K1473
7566B7974R42Q588l4868p3579l347K8639k078K348o250M994N0488L6551k9769
7553A0633l4732j6604M1892j0422J658M6171K2608j801J6134l1490m6321L8851
7541C6577j9958J9585J1942j0693l4555o573K748M177l4281L2082j7897m2637
7529e9483j7134J6894J4676K1253m253j9089k4110K9065J8439L8049o595m0078
7517c2366m8494R630p155j2614j006O8995M3383k8287M157m933j6592k974o99
$$ plain form
7504 -28955 -319 85974 64783 37303 -9876 -37329 -29887 -36964 -41864 -47950 -37946 9983 32798
7491 32798 33044 23271 45109 45674 10837 -21132 -1340 52527 40930 20363 27306 20644 7044
7478 7044 35077 6000 31707 52551 39735 11051 -2714 -1402 -1541 -15228 -11102 -19582 1323
7465 1323 58797 43785 41916 44446 2651 -19370 -44047 -23611 -7429 -30436 -44404 -15309
7453 -15309 16292 -32492 -115039 -82781 -13686 -20302 -49118 -49317 -33067 -28545 -56234 -52127 -18339
7440 -18339 670 55687 19013 62865 108940 94948 55264 -19971 -47271 -58932 -33047 -7180
7428 -7180 -18803 25689 67339 46910 25454 -8252 -19012 5478 68612 105689 85893 48637
7416 48637 41824 51918 45303 58153 64512 62898 35838 -5497 -13184 60457 27092 -14702 40626
$$ packed form
7504b8955K8636Q6293k1191k7480m7179k7453P442p077m900o086J0004M7929K2815
7491C2798K46r773K1838N65l4837l1969J9792N3867j1597k0567O943o662j3600
7478G044K8033k9077K5707K0844j2816k8684j3765J312j39j3687M126q480K0905
7465A323N7474j5012j869K530m1795k2021k4677K0436J6182k3007j3968K9095
7453a5309L1601m8784q2547L2258O9095o616k8816j99J6250M522k7689M107L3788
7440a8339J9009N5017l6674M3852M6075j3992l9684p5235k7300j1661K5885K5867
7428g180j1623M4492M1650k0429k1456l3706j0760K4490O3134L7077j9796l7256
7416D8637o813J0094o615J2850O359j614k7060m1335p687P3641l3365m1794N5328
$$ plain form
7403 40626 57885 8294 -47230 -73001 -34052 30395 34418 8853 -18409 -39674 -46755 -86268
7391 -86268 -82676 -68815 -111629 -105868 -51835 -20869 -16009 -31718 3025 28442 32452 26096 36081
7378 36081 14287 -13649 -3931 31257 34923 42350 22900 -16662 -29429 -12788 7710 4564 9966
7365 9966 422 -33327 -70605 -47191 -27168 -37645 -62381 -34140 -16991 -31211 -34445 -32816 -42141
7352 -42141 -46328 -54511 -32128 1179 3262 -15804 -36857 -39761 -37363 -32204 -25113 21954 39106
7339 39106 46095 61358 50097 38095 709 -5466 10965 12426 21019 10605 -38171 -37399 -47026
7326 -47026 -12853 -19798 -32403 -9175 10376 -28816 -75061 -51334 123 33784 20221 27863
7314 27863 49772 63723 40386 4111 -32130 -34016 -23299 13164 37260 34728 4894 -108
$$ packed form
7403D0626J7259m9591n5524k5771L8949O4447M023k5565k7262k1265p081l9513
7391h6268L592J3861m2814N761N4033L0966M860j5709L4743K5417M010o356R985
7378C6081k1794k7936R718L5188L666P427j9450l9562j2767J6641K0498l146N402
7365I966r544l3749l7278K3414K0023j0477k4736K8241J7149j4220l234J629r325
7352d2141m187q183K2383L3307K083j9066k1053k904K398N159P091M7067J7152
7339C9106O989J5263j1261j2002l7386o175J6431J461Q593j0414m8776P72r627
7326d7026L4173o945j2605K3228J9551l9192m6245K3727N1457L3661j3563P642
7314B7863K1909J3951k3337l6275l6241j886J0717L6463K4096k532k9834n002
$$ plain form
7302 -108 -8711 -16643 -19786 -35852 -5561 -445 -16611 -60433 -71952 -48309 -23424 -39453 -61333
7289 -61333 -43656 -51732 -27066 -26208 -51566 -29192 1357 3220 -6694 -25537 1583 -11504 -27745
7276 -27745 -34438 -17262 6253 24166 33742 -441 -53572 -59169 -37469 -27339 -13367 -388
7264 -388 -8536 27778 70777 66716 5540 -50440 -63851 -36099 -22567 -28679 -27924 -22824 -15776 -15636
7250 -15636 -50743 -90781 -68402 -37854 -69357 -57030 -50760 -49296 -41044 -50644 -41807 -13995 -11778
7237 -11778 -13108 18196 27091 3446 18314 38836 28252 -5040 -24337 -25394 -10025 -54196
7225 -54196 -28916 22937 51427 48597 44425 43295 34488 44925 25010 54955 80504 49939 37079
7212 37079 27586 8644 -13644 -16993 -56202 -34633 -26352 -78072 -106363 -74630 -71067 -66197 -58832
$$ packed form
7302a08q603p932l143j6066L0291N116j6166m3822j1519K3643K4885j6029k1880
7289f1333J7677q076K4666Q58k5358K2374L0549J863r914j8843K7120j3087j6241
7276b7745o693J7176K3515J7913R576l4183n3131n597K1700J0130J3972J2979
7264c88q148L6314M2999m061o1176n5980j3411K7752J3532o112P55N100P048J40
7250a5636l5107m0038K2379L0548l1503J2327O270J464Q252r600Q837K7812K217
7237a1778j330L1304Q895k3645J4868K0522j0584l3292j9297j057J5369m4171
7225e4196K5280N1853K8490k830m172j130q807J0437j9915K9945K5549l0565j2860
7212C7079r493j8942k2288l349l9209K1569Q281n1720k8291L1733L563M870P365
$$ plain form
7199 -58832 -55637 -10379 20504 65855 66621 12061 6219 13980 3904 26839 10298 -17768 -35253
7186 -35253 -57034 -34278 -30568 -36255 11150 -3637 27458 5966 -8087 -21877 -34113 -42298
7174 -42298 2865 44004 24712 49943 53528 18589 10109 18000 61979 59736 78229 48607 12147
7161 12147 13681 -3954 4887 15144 974 -25752 -23794 -14164 31350 20402 -44025 -27643 33150
7148 33150 60653 4798 -27179 -11558 -18210 -3997 21365 -8755 -11118 3619 -11444 15083
7136 15083 75213 92675 44826 -5738 -19125 -77970 -49155 -18129 -25783 -18848 15038 3681
7124 3681 18114 22837 32920 54561 44496 5040 -9897 -19783 -15238 29881 63449 18787 18859
7111 18859 19660 -34359 -49760 -28497 -17901 -17713 28391 26704 36404 55801 67824 34690 8912
$$ packed form
7199e8832L195M5258L0883M5351P66n4560n842P761j0076K2935j6541k8066j7485
7186c5253k1781K2756L710n687M7405j4787L1095k1492j4053j3790j2236q185
7174d2298M5163M1139j9292K5231L585l4939q480P891M3979k243J8493k9622l6460
7161A2147J534j7635Q841J0257j4170k6726J958R630M5514j0948o4427J6382O0793
7148C3150K7503n5855l1977J5621o652J4213K5362l0120k363J4737j5063K6527
7136A5083O0130J7462m7849n0564j3387n8845K8815L1026p654O935L3886j1357
7124C681J4433M723J0083K1641j0065l9456j4937r886M545M5119L3568m4662P2
7111A8859Q01n4019j5401K1263J0596J88M6104j687R700J9397J2023l3134k5778
$$ plain form
7098 8912 -17372 -40055 -34407 -39805 -36510 -49273 -54113 -58016 -58236 -49162 -39989 -55513 -13496 -20906
7084 -20906 -11355 4344 -347 -12748 24082 14415 -30571 -44449 -69510 -60772 -44545 -47714 -66215
7071 -66215 -48155 -24752 18452 29240 -12378 -19063 -33883 -12625 18950 -9951 -26724 -22874
7059 -22874 -52289 -60438 -48203 -41216 -7334 -3271 -13346 -17840 -7540 -16773 -1038 7557 19701
7046 19701 43019 54199 43376 -2599 11406 27400 11306 25753 15345 9839 -26984 -65088
7034 -65088 -14479 9441 -45280 -48320 -39314 -47654 -84763 -40469 -9362 -42383 -27841 -20106 -600
7021 -600 12668 155 -8578 -10 25521 31440 36250 25096 4487 12637 -9741 -36130 -66880
7008 -66880 -44299 -20389 -19900 -32000 -41804 -23287 14255 58263 64233 42410 16307 17769 39223
$$ packed form
7098H912k6284k2683N648n398L295j2763m840l903k20R074R173j5524M2017p410
7084b0906R551J5699m691j2401L6830r667m4986j3878k5061Q738J6227l169j8501
7071f6215J8060K3403M3204J0788m1618o685j4820K1258L1575k8901j6773L850
7059b2874k9415q149J2235O987L3882M063j0075m494J0300r233J5735Q595J2144
7046A9701K3318J1180j0823m5975J4005J5994j6094J4447j0408n506l6823l8104
7034f5088N0609K3920n4721l040R006q340l7109M4294L1107l3021J4542P735J9506
7021f00J3268j2513q733Q568K5531N919M810j1154k0609Q150k2378k6389l0750
7008f6880K2581K3910M89j2100r804J8517L7542M4008N970k1823k6103J462K1454
$$ plain form
6995 39223 18015 -2671 18253 41157 16781 -39219 -83570 -42400 18929 33942 58793 50686
$$ packed form
6995C9223k1208k0686K0924K2904k4376n6000m4351M1170O1329J5013K4851q107
$$ [...]
##END NTUPLES=NMR SPECTRUM
##END=
