##TITLE=Analysis number 315731
Compound Code cc 47023
Book Reference 422/109
Project Code adrs
Chemist Name robb
##JCAMPDX= 6.0         $$ Bruker NMR JCAMP-DX V2.0
##DATA TYPE= NMR SPECTRUM
##DATA CLASS= NTUPLES
##ORIGIN= Bruker BioSpin GmbH
##OWNER= NMR
$$ XWIN-NMR		Version 3.5
$$ Wed Nov 30 09:38:37 2005 GMT Standard Time (UT+0h)  MAYBRIDGE\NMR@NMR_250MHZ
##.OBSERVE FREQUENCY= 250.131544655141
##.OBSERVE NUCLEUS= ^1H
##.ACQUISITION MODE= SIMULTANEOUS (DQD)
##.ACQUISITION SCHEME= undefined
##.AVERAGES= 16
##.DIGITISER RES= 18
##SPECTROMETER/DATA SYSTEM= dpx250
##.PULSE SEQUENCE= zg30
##.SOLVENT NAME= CDCl3
##.SHIFT REFERENCE= (INTERNAL, CDCl3, 0, 16.522)
##AUDIT TRAIL= $$ (NUMBER, WHEN, WHO, WHERE, WHAT)
$$ ##TITLE= Audit trail, XWIN-NMR		Version 3.5
$$ ##JCAMPDX= 5.01
$$ ##ORIGIN= Bruker BioSpin GmbH
$$ ##OWNER= NMR
$$ C:\u/data/dgb/nmr/ADRS/13190/pdata/1/auditp.txt
$$ ##AUDIT TRAIL=  $$ (NUMBER, WHEN, WHO, WHERE, WHAT)
(   1,<2005-11-30 09:38:03.40 +000>,<MAYBRIDGE\NMR>,<NMR_250MHZ>,
      <created by zg, POWCHK disabled, PULCHK disabled
       configuration hash MD5:
       62 19 C7 07 E1 42 D1 B7 37 6C 3D D0 77 39 F9 E6
       data hash MD5: 64K
       27 DC BB 5C 18 41 AB 64 A7 19 1F 98 90 BF 8D B4>)
(   2,<2005-11-30 09:38:18.46 +000>,<MAYBRIDGE\NMR>,<NMR_250MHZ>,
      <Start of raw data processing
       ef LB = 0.3 FT_mod = 6 PKNL = 1 SI = 32K 
       data hash MD5: 32K
       2D 2E 42 B0 0F 10 31 C7 EE 2D F1 34 6E 88 1F D4>)
(   3,<2005-11-30 09:38:20.79 +000>,<MAYBRIDGE\NMR>,<NMR_250MHZ>,
      <apk 
       data hash MD5: 32K
       CD D4 48 B1 C2 1A 9A 78 7F 67 F3 C3 8D EC CB 18>)
(   4,<2005-11-30 09:38:22.18 +000>,<MAYBRIDGE\NMR>,<NMR_250MHZ>,
      <abs ABSG = 5 
       data hash MD5: 32K
       7B 39 19 2A B8 0A 6E C9 E0 6A 93 67 D7 89 08 66>)
$$ ##END=
$$ 
$$ hash MD5
$$ E6 A7 AA 71 0A 21 AC 6A BA EA 73 83 A9 2D 65 AF
##$RELAX= 
##$RELAX= 
##$RELAX= 
##$RELAX= 
##$RELAX= 
##$RELAX= 
##$RELAX= 
$$ Bruker specific parameters
$$ --------------------------
##$DU= <C:\u>
##$EXPNO= 13190
##$NAME= <ADRS>
##$PROCNO= 1
##$TYPE= <nmr>
##$USER= <dgb>
##$AMP= (0..31)
100 100 100 100 100 100 100 100 100 100 100 100 100 100 100 100 100 100 
100 100 100 100 100 100 100 100 100 100 100 100 100 100 
##$AQSEQ= 0
##$AQ_mod= 3
##$AUNM= <au_zg>
##$AUTOPOS= <5 >
##$BF1= 250.13
##$BF2= 250.13
##$BF3= 250.13
##$BF4= 250.13
##$BF5= 500.13
##$BF6= 500.13
##$BF7= 500.13
##$BF8= 500.13
##$BYTORDA= 1
##$CFDGTYP= 0
##$CFRGTYP= 5
##$CHEMSTR= <none>
##$CNST= (0..31)
1 1 145 1 1 1 1 1 1 1 1 1 1 1 1 1 1 1 1 1 1 1 1 1 1 1 1 1 1 1 1 1 
##$CPDPRG= <>
##$CPDPRG1= <>
##$CPDPRG2= <>
##$CPDPRG3= <>
##$CPDPRG4= <mlev>
##$CPDPRG5= <mlev>
##$CPDPRG6= <mlev>
##$CPDPRG7= <mlev>
##$CPDPRG8= <mlev>
##$CPDPRGB= <>
##$CPDPRGT= <>
##$D= (0..31)
0 1 0 0 0 0 0 0 0 0.06 0 0 0 0 0 0 0.0002 0 0 0 0 0 0 0 0 0 0 0 0 0 0 
0 
##$DATE= 1133343482
##$DBL= (0..7)
120 120 120 120 120 120 120 120 
##$DBP= (0..7)
150 150 150 150 150 150 150 150 
##$DBP07= 0
##$DBPNAM0= <>
##$DBPNAM1= <>
$$ [...]
##$SUBNAM7= <"">
##$SUBNAM8= <"">
##$SUBNAM9= <"">
##$SW= 20.6930455092707
##$SWIBOX= (0..15)
0 0 3 0 0 0 0 0 0 0 0 0 0 0 0 0 
##$SW_h= 5175.983436853
##$TD= 65536
##$TD0= 1
##$TE= 294.16
##$TE2= 300
##$TE3= 300
##$TEG= 300
##$TL= (0..7)
0 120 120 120 120 120 120 120 
##$TP= (0..7)
150 150 150 150 150 150 150 150 
##$TP07= 0
##$TPNAME0= <>
##$TPNAME1= <>
##$TPNAME2= <>
##$TPNAME3= <>
##$TPNAME4= <>
##$TPNAME5= <>
##$TPNAME6= <>
##$TPNAME7= <>
##$TPOAL= (0..7)
0.5 0.5 0.5 0.5 0.5 0.5 0.5 0.5 
##$TPOFFS= (0..7)
0 0 0 0 0 0 0 0 
##$TUNHIN= 0
##$TUNHOUT= 0
##$TUNXOUT= 0
##$USERA1= <user>
##$USERA2= <user>
##$USERA3= <user>
##$USERA4= <user>
##$USERA5= <user>
##$V9= 5
##$VALIST= <valist>
##$VCLIST= <CCCCCCCCCCCCCCC>
##$VD= 0
##$VDLIST= <DDDDDDDDDDDDDDD>
##$VPLIST= <PPPPPPPPPPPPPPP>
##$VTLIST= <TTTTTTTTTTTTTTT>
##$WBST= 1024
##$WBSW= 4
##$XGAIN= (0..3)
0 0 0 0 
##$XL= 0
##$YL= 0
##$YMAX_a= 480170
##$YMIN_a= -376011
##$ZGOPTNS= <>
##$ZL1= 120
##$ZL2= 120
##$ZL3= 120
##$ZL4= 120
##$ABSF1= 16.522
##$ABSF2= -4.171173
##$ABSG= 5
##$ABSL= 3
##$ALPHA= 0
##$AQORDER= 0
##$ASSFAC= 0
##$ASSFACI= 0
##$ASSFACX= 0
##$ASSWID= 0
##$AUNMP= <proc_1d>
##$AZFE= 0.1
##$AZFW= 0.1
##$BCFW= 0
##$BC_mod= 0
##$BYTORDP= 0
##$COROFFS= 0
##$CY= 12.5
##$DATMOD= 1
##$DC= 0
##$DFILT= <>
##$DTYPP= 0
##$F1P= 14.0000005364418
##$F2P= -0.99999901652339
##$FCOR= 0.5
##$FTSIZE= 32768
##$FT_mod= 6
##$GAMMA= 0
##$GB= 0
##$INTBC= 1
##$INTSCL= 1
##$ISEN= 128
##$LB= 0.3
##$LEV0= 0
##$LPBIN= 0
##$MAXI= 10000
##$MC2= 0
##$MEAN= 0
##$ME_mod= 0
##$MI= 0
##$NCOEF= 0
##$NC_proc= -3
##$NLEV= 6
##$NOISF1= 0
##$NOISF2= 0
##$NSP= 0
##$NTH_PI= 0
##$NZP= 0
##$OFFSET= 16.522
##$PC= 1
##$PHC0= 88.27535
##$PHC1= 5.931027
##$PH_mod= 1
##$PKNL= yes
##$PPARMOD= 0
##$PSCAL= 4
##$PSIGN= 0
##$REVERSE= no
##$SF= 250.13
##$SI= 32768
##$SIGF1= 0
##$SIGF2= 0
##$SINO= 400
##$SIOLD= 32768
##$SREGLST= <1H.CDCl3>
##$SSB= 0
##$STSI= 32768
##$STSR= 0
##$SW_p= 5175.98343685301
##$SYMM= 0
##$S_DEV= 0
##$TDeff= 65536
##$TDoff= 0
##$TI= <Analysis number 999999
Compound Code 99
Book Reference 9
Project Code 9>
##$TILT= no
##$TM1= 0
##$TM2= 0
##$TOPLEV= 0
##$USERP1= <user>
##$USERP2= <user>
##$USERP3= <user>
##$USERP4= <user>
##$USERP5= <user>
##$WDW= 1
##$XDIM= 32768
##$YMAX_p= 315393974
##$YMIN_p= -569789
$$ End of Bruker specific parameters
$$ ---------------------------------
##NTUPLES= NMR SPECTRUM
##VAR_NAME=  FREQUENCY,     SPECTRUM/REAL,   SPECTRUM/IMAG
##SYMBOL=    X,             R,               I
##VAR_TYPE=  INDEPENDENT,   DEPENDENT,       DEPENDENT
##VAR_FORM=  AFFN,          ASDF,            ASDF
##VAR_DIM=   32768,         32768,           32768
##UNITS=     HZ,            ARBITRARY UNITS, ARBITRARY UNITS
##FACTOR=    0.157963299565203, 1,           1
##FIRST=     4132.6476996994, 0,             0
##LAST=      -1043.33573715361, 0,           0
##MIN=       -1043.33573715361, -569789,     0
##MAX=       4132.6476996994, 315393974,     0
$$ Real data points
##PAGE= N=1
##DATA TABLE= (X++(R..R)), XYDATA
$$ [...]
##PAGE= N=2
##DATA TABLE= (X++(I..I)), XYDATA
$$ plain form
18145 5475890 5572841 5694608 5785029 5836176 5939111 6098948 6241686 6341077 6470108 6593182
18135 6593182 6700507 6787347 6886857 7005765 7189366 7387599 7566364 7832964 8095026 8287238
18125 8287238 8466910 8731102 9015820 9326238 9640974 9938246 10312288 10743976 11212053
18116 11212053 11791797 12499887 13341850 14291879 15345754 16491825 17669652 18789272 19433281
18107 19433281 19105668 17592150 15250186 13258608 12260390 11160093 8024590 -1288576
18099 -1288576 -21450831 -35214278 -32975129 -27757657 -23441945 -20044084 -17506913 -15573406
18091 -15573406 -14042011 -12765336 -11688933 -10722005 -9928556 -9289251 -8656449 -8087002 -7612249
18082 -7612249 -7137832 -6714750 -6351514 -5933407 -5593692 -5349472 -5124287 -4900249 -4712447
$$ packed form
18145E475890R6951J21767R0421N1147J02935J59837J42738R9391J29031J23074
18135F593182J07325Q6840R9510J18908J83601J98233J78765K66600K62062J92212
18125H287238J79672K64192K84718L10418L14736K97272L74042M31688M68077
18116A1212053N79744P08090Q41963R50029J053875J146071J177827J119620O44009
18107A9433281l27613j513518k341964j991578r98218j100297l135503r313166
18099a288576k0162255j3763447K239149N217472M315712L397861K537171J933507
18091a5573406J531395J276675J076403R66928P93449O39305O32802N69447M74753
18082g612249M74417M23082L63236M18107L39715K44220K25185K24038J87802
$$ plain form
18073 -4712447 -4530096 -4325871 -4141676 -3972971 -3783666 -3599152 -3473095 -3351852 -3187536
18064 -3187536 -3058388 -2965634 -2836617 -2674628 -2534249 -2425913 -2332701 -2284645 -2265729 -2169105
18054 -2169105 -2072132 -1975064 -1899586 -1842666 -1753203 -1649521 -1583780 -1543424 -1484426 -1413443 -1298430
18043 -1298430 -1206423 -1167132 -1151077 -1145087 -1087334 -1012141 -935423 -868084 -737442 -666747 -638129
18032 -638129 -653170 -663526 -626460 -581669 -514093 -514720 -465839 -443427 -397881 -351209 -339754 -306735
18020 -306735 -348988 -350171 -290430 -215009 -168085 -120355 -70783 -32616 5213 5702 18165 48885
18008 48885 103852 158505 195632 136667 154965 207971 277553 332842 323673 301644 367788 410737
17996 410737 409007 413432 435717 473659 482013 489502 503905 543595 565740 579716 581728 616859
$$ packed form
18073d712447J82351K04225J84195J68705J89305J84514J26057J21243J64316
18064c187536J29148R2754J29017J61989J40379J08336R3212M8056J8916R6624
18054b169105R6973R7068P5478N6920Q9463J03682O5741M0356N8998P0983J15013
18043a298430R2007L9291J6055N990N7753P5193P6718O7339J30642P0695K8618
18032f38129j5041j0356L7066M4791O7576o27M8881K2412M5546M6672J1455L3019
18020c06735m2253j183N9741P5421M6924M7730M9572L8167L7829M89J2463L0720
18008D8885N4967N4653L7127n8965J8298N3006O9582N5289r169k2029O6144M2949
17996D10737j730M425K2285L7942Q354P489J4403L9690K2145J3976K012L5131
$$ plain form
17984 616859 659873 650522 687465 746449 762401 824491 850282 827674 873587 949113 963660 951996
17972 951996 934438 915628 940942 968859 947082 936223 978811 1048381 1093696 1126708 1122158 1139938
17960 1139938 1153257 1193063 1241140 1274383 1268377 1284555 1305135 1311850 1317679 1312152 1315791 1338710
17948 1338710 1391070 1421038 1429872 1425007 1406849 1419413 1462085 1506332 1588451 1578297 1632044 1680915
17936 1680915 1736830 1719704 1710189 1718895 1737913 1754202 1742661 1722060 1692599 1661137 1659569 1669574
17924 1669574 1673366 1703994 1725822 1680366 1638606 1647374 1669636 1775097 1861241 1909913 1984355
17913 1984355 2003568 1972522 1919358 1919833 2033176 2131703 2175603 2197036 2228470 2278845 2314724
17902 2314724 2341052 2369762 2401659 2438889 2446786 2431917 2413100 2460681 2491233 2508733 2556054
$$ packed form
17984F16859M3014r351L6943N8984J5952O2090K5791k2608M5913P5526J4547j1664
17972I51996j7558j8810K5314K7917k1777j0859M2588O9570M5315L3012m550J7780
17960A139938J3319L9806M8077L3243o006J6178K0580O715N829n527L639K2919
17948A338710N2360K9968Q834m865j8158J2564M2672M4247Q2119j0154N3747M8871
17936A680915N5915j7126r515Q706J9018J6289j1541k0601k9461l1462j568J0005
17924A669574L792L0628K1828m5456m1760Q768K2262J05461Q6144M8672P4442
17913A984355J9213l1046n3164M75J13343R8527M3900K1433L1434N0375L5879
17902B314724K6328K8710L1897L7230P897j4869j8817M7581L0552J7500M7321
$$ plain form
17891 2556054 2589936 2632247 2656766 2666760 2683096 2684659 2721594 2763661 2760361 2776103 2750286 2794744
17879 2794744 2841985 2817197 2840781 2864359 2906085 2945503 3004847 3028550 3061942 3151489 3159445
17868 3159445 3181678 3202376 3237877 3262350 3301151 3388395 3448578 3471475 3498429 3495875 3507895
17857 3507895 3525480 3545482 3603845 3647020 3662392 3694983 3713702 3747817 3826018 3871056 3899614
17846 3899614 3970324 4012281 4071203 4077398 4095845 4137579 4188030 4250199 4326456 4359917 4362825 4413318
17834 4413318 4465939 4510975 4537602 4605010 4706533 4753335 4791855 4872288 4911952 5018875 5156490
17823 5156490 5221348 5253549 5304643 5358730 5387694 5454030 5514176 5548414 5603486 5681434 5763243
17812 5763243 5843752 5936118 6044901 6145655 6247690 6342959 6424621 6541769 6651738 6757253
$$ packed form
17891B556054L3882M2311K4519R994J6336J563L6935M2067l300J5742k5817M4458
17879B794744M7241k4788K3584K3578M1726L9418N9344K3703L3392Q9547P956
17868C159445K2233K0698L5501K4473L8801Q7244O0183K2897K6954k554J2020
17857C507895J7585K0002N8363M3175J5372L2591J8719L4115P8201M5038K8558
17846C899614P0710M1957N8922O195J8447M1734N0451O2169P6257L3461K908N0493
17834D413318N2621M5036K6627O7408J01523M6802L8520Q0433L9664J06923J37615
17823E156490O4858L2201N1094N4087K8964O6336O0146L4238N5072P7948Q1809
17812E763243Q0509R2366J08783J00754J02035R5269Q1662J17148J09969J05515
$$ plain form
17802 6757253 6876332 7018473 7107386 7166057 7291579 7445492 7608144 7768158 7912413 7985993
17792 7985993 8113812 8246306 8324263 8497283 8669044 8803458 9003605 9221643 9440327 9581597
17782 9581597 9779801 9964874 10111057 10275582 10463399 10669965 10895935 11072502 11307918
17773 11307918 11537827 11721652 11908216 12120134 12388089 12645999 12949754 13245834 13509160
17764 13509160 13807768 14070786 14367129 14728306 15093276 15465341 15864312 16276789 16731372
17755 16731372 17187012 17699559 18228049 18758570 19280363 19804358 20434695 21303818 22334340
17746 22334340 23551468 24968596 26675236 28610175 30663702 32848410 35181420 37231829
17738 37231829 38262673 37531396 34763324 30663285 26816480 23804304 19814165 10739195
$$ packed form
17802F757253J19079J42141Q8913N8671J25522J53913J62652J60014J44255P3580
17792G985993J27819J32494P7957J73020J71761J34414K00147K18038K18684J41270
17782I581597J98204J85073J46183J64525J87817K06566K25970J76567K35416
17773A1307918K29909J83825J86564K11918K67955K57910L03755K96080K63326
17764A3509160K98608K63018K96343L61177L64970L72065L98971M12477M54583
17755A6731372M55640N12547N28490N30521N21793N23995O30337Q69123J030522
17746B2334340J217128J417128J706640J934939K053527K184708K333010K050409
17738C7231829J030844p31277k768072m100039l846805l012176l990139r074970
$$ plain form
17730 10739195 -10077762 -41751085 -64911036 -67573535 -59930482 -51612422 -44651939 -39261737
17722 -39261737 -35107431 -31861180 -29178219 -26849919 -24881825 -23223876 -21789590 -20657258
17714 -20657258 -19689808 -18742485 -17777958 -16885131 -16073511 -15329583 -14633134 -14023247 -13602485
17705 -13602485 -13272609 -12854566 -12393444 -11932249 -11487694 -11063907 -10720021 -10379769 -10077214
17696 -10077214 -9799724 -9524578 -9234539 -9007682 -8762428 -8510285 -8303525 -8097392 -7917722
17687 -7917722 -7751930 -7545890 -7327799 -7112147 -6957767 -6821192 -6674718 -6519191 -6350754
17678 -6350754 -6267993 -6173340 -6022103 -5886062 -5773420 -5681391 -5564458 -5431710 -5327860 -5177199
17668 -5177199 -5036376 -4967487 -4890112 -4782896 -4673300 -4616737 -4540694 -4465767 -4429328 -4395717 -4318587
$$ packed form
17730A0739195k0816957l1673323k3159951k662499P643053Q318060O960483N390202
17722c9261737M154306L246251K682961K328300J968094J657949J434286J132332
17714b0657258R67450R47323R64527Q92827Q11620P43928O96449O09887M20762
17705a3602485L29876M18043M61122M61195M44555M23787L43886L40252L02555
17696a0077214K77490K75146K90039K26857K45254K52143K06760K06133J79670
17687g917722J65792K06040K18091K15652J54380J36575J46474J55527J68437
17678f350754Q2761R4653J51237J36041J12642R2029J16933J32748J03850J50661
17668e177199J40823O8889P7375J07216J09596N6563P6043P4927L6439L3611P7130
$$ plain form
17657 -4318587 -4200748 -4109138 -4028260 -3953854 -3881027 -3847479 -3804243 -3738310 -3659849 -3588592 -3516727
17646 -3516727 -3463906 -3411640 -3367627 -3284864 -3185207 -3087583 -3043518 -2999919 -2995959 -2960321 -2900548
17635 -2900548 -2859881 -2820126 -2817361 -2768836 -2697159 -2676571 -2645676 -2623616 -2598832 -2572500 -2508589
17624 -2508589 -2492561 -2477645 -2465420 -2395659 -2336818 -2271404 -2246376 -2217939 -2191010 -2173395 -2114071
17613 -2114071 -2076515 -2035530 -2029967 -2035437 -2045765 -2055283 -1994897 -1899154 -1835840 -1799279 -1736058 -1720198
17601 -1720198 -1737014 -1735666 -1725441 -1696915 -1676986 -1625384 -1604354 -1636577 -1634903 -1582120 -1544337 -1562831
17589 -1562831 -1567781 -1537386 -1498459 -1409342 -1375139 -1399796 -1408887 -1381874 -1356180 -1337682 -1306163 -1278870
17577 -1278870 -1240211 -1234608 -1180222 -1130379 -1109286 -1063912 -1017683 -1001883 -971041 -927699 -930280 -944990
$$ packed form
17657d318587J17839R1610Q0878P4406P2827L3548M3236O5933P8461P1257P1865
17646c516727N2821N2266M4013Q2763R9657R7624M4065M3599L960L5638N9773
17635b900548M0667L9755K765M8525P1677K0588L0895K2060K4784K6332O3911
17624b508589J6028J4916J2225O9761N8841O5414K5028K8437K6929J7615N9324
17613b114071L7556M0985N563n470j0328r518O0386R5743O3314L6561O3221J5860
17601a720198j6816J348J0225K8526J9929N1602K1030l2223J674N2783L7783j8494
17589a562831m950L0395L8927Q9117L4203k4657r091K7013K5694J8498L1519K7293
17577a278870L8659N603N4386M9843K1093M5374M6229J5800L0842M3342k581j4710
$$ plain form
17565 -944990 -961071 -967005 -936400 -927730 -919390 -865087 -871604 -881837 -877843 -876590 -857990 -863621 -866489
17552 -866489 -863619 -870202 -867249 -851137 -810321 -790328 -743881 -727032 -725807 -703272 -745232 -779164
17540 -779164 -798751 -744180 -656305 -524793 -419574 -383773 -333965 -313905 -310061 -279998 -252154
17529 -252154 -200325 -179442 -202260 -157935 -156296 -195802 -171272 -133618 -103470 -100819 -120737 -135328
17517 -135328 -121735 -90569 -80802 -104049 -141744 -133090 -113065 -87631 -41306 -39080 -60785 -49976
17505 -49976 -8062 14230 72242 63898 46226 47679 124543 131365 123383 102530 72840 80918 128210
17492 128210 154204 179164 171704 169247 140568 185314 251661 291696 328972 322078 332238 369037
17480 369037 407105 461985 445071 414437 399441 437613 459295 450113 433139 431511 475299 494969
$$ packed form
17565i44990j6081n934L0605Q670Q340N4303o517j0233L994J253J8600n631k868
17552h66489K870o583K953J6112M0816J9993M6447J6849J225K2535m1960l3932
17540g79164j9587N4571Q7875J31512J05219L5801M9808K0060L844L0063K7844
17529b52154N1829K0883k2818M4325J639l9506K4530L7654L0148K651j9918j4591
17517a35328J3593L1166R767k3247l7695Q654K0025K5434M6325K226k1705J0809
17505d9976M1914K2292N8012q344j7672J453P6864O822p982k0853k9690Q078M7292
17492A28210K5994K4960p460k457k8679M4746O6347M0035L7276o894J0160L6799
17480C69037L8068N4880j6914l0634j4996L8172K1682r182j6974j628M3788J9670
$$ plain form
17468 494969 495765 531570 549608 586253 628834 631619 613968 633593 625860 654587 676817 646048
17456 646048 658847 699062 715028 725961 762054 794593 816557 812111 848217 837287 835117 833810
17444 833810 901468 949262 914862 874052 912194 968434 977181 961510 943675 957544 974220 916022
17432 916022 804852 758418 769908 881850 930790 942576 946119 956318 996707 981332 1020754
17421 1020754 1077979 1095109 1113335 1105146 1086107 1103403 1108233 1121482 1139532 1184104 1179477 1164745
17409 1164745 1203176 1231227 1275637 1249301 1180333 1164788 1170323 1212005 1214397 1207245 1240652 1275915
17397 1275915 1300921 1338416 1331552 1305013 1351222 1374864 1370232 1377421 1410335 1413576 1431625 1424386
17385 1424386 1403651 1387176 1365495 1372353 1400112 1440782 1438363 1485849 1484619 1503355 1516676 1489147
$$ packed form
17468D94969P96L5805J8038L6645M2581K785j7651J9625p733K8727K2230l0769
17456F46048J2799M0215J5966J0933L6093L2539K1964m446L6106j0930k170j307
17444H33810O7658M7794l4400m0810L8142N6240Q747j5671j7835J3869J6676n8198
17432I16022j11170m6434J1490J11942M8940J1786L543J0199M0389j5375L9422
17421A020754N7225J7130J8226q189j9039J7296M830J3249J8050M4572m627j4732
17409A164745L8431K8051M4410k6336o8968j5545N535M1682K392p152L3407L5263
17397A275915K5006L7495o864k6539M6209K3642m632P189L2914L241J8049p239
17385A424386k0735j6475k1681O858K7759M0670k419M7486j230J8736J3321k7529
$$ plain form
17373 1489147 1445068 1395547 1406744 1439373 1477336 1530371 1601346 1658581 1668855 1663576 1669795 1668697
17361 1668697 1689081 1719705 1758899 1762221 1733560 1731855 1740116 1760709 1768708 1779665 1803193 1841177
17349 1841177 1873439 1879348 1889441 1894442 1913269 1934148 1969241 2025674 2043250 2073861 2091304 2120846
17337 2120846 2097647 2081195 2096318 2111024 2106102 2134488 2187678 2212915 2197931 2201629 2190471 2219522
17325 2219522 2226944 2274417 2333485 2371628 2410149 2451420 2465874 2486581 2507735 2540427 2556840
17314 2556840 2561764 2550251 2619865 2680912 2671895 2653318 2730522 2837450 2833471 2768843 2762538 2804656
17302 2804656 2852738 2859425 2887585 2893662 2923937 2980033 3028941 2995520 2989924 3026660 3087752 3152311
17290 3152311 3186133 3227717 3259335 3321550 3361635 3333860 3350593 3380804 3412747 3461366 3482799
$$ packed form
17373A489147m4079m9521J1197L2629L7963N3035P0975N7235J0274n279O219j098
17361A668697K0384L0624L9194L322k8661j705Q261K0593P999J0957K3528L7984
17349A841177L2262N909J0093N001J8827K0879L5093N6433J7576L0611J7443K9542
17337B120846k3199j6452J5123J4706m922K8386N3190K5237j4984L698j1158K9051
17325B219522P422M7473N9068L8143L8521M1271J4454K0707K1154L2692J6413
17314B556840M924j1513O9614O1047r017j8577P7204J06928l979o4628o305M2118
17302B804656M8082O687K8160O077L0275N6096M8908l3421n596L6736O1092O4559
17290C152311L3822M1584L1618O2215M0085k7775J6733L0211L1943M8619K1433
$$ plain form
17279 3482799 3512501 3563654 3614683 3652204 3697758 3723368 3709986 3736006 3792004 3805082 3813201
17268 3813201 3881234 3934300 3965862 3980551 3998511 4059962 4108398 4196130 4255632 4301987 4317972
17257 4317972 4370599 4413419 4416765 4445245 4573437 4668105 4761705 4829874 4850223 4880232 4979123
17246 4979123 5026311 5054459 5151144 5216784 5289688 5371185 5467354 5576084 5672355 5734201 5797767
17235 5797767 5873426 5969122 6060433 6147734 6285038 6365636 6427012 6483083 6552796 6640925 6759150
17224 6759150 6836572 6934838 7030022 7143056 7295632 7425503 7537078 7645334 7746010 7915804
17214 7915804 8091530 8281368 8405223 8579325 8675336 8829605 9028480 9213984 9372108 9526482
17204 9526482 9691093 9927058 10101690 10284295 10494534 10637738 10826066 11022317 11289286
$$ packed form
17279C482799K9702N1153N1029L7521M5554K5610j3382K6020N5998J3078Q119
17268C813201O8033N3066L1562J4689J7960O1451M8436Q7732N9502M6355J5985
17257D317972N2627M2820L346K8480J28192R4668R3600O8169K0349L0009R8891
17246D979123M7188K8148R6685O5640P2904Q1497R6169J08730R6271O1846O3566
17235E797767P5659R5696R1311Q7301J37304Q0598O1376N6071O9713Q8129J18225
17224F759150P7422R8266R5184J13034J52576J29871J11575J08256J00676J69794
17214G915804J75726J89838J23855J74102R6011J54269J98875J85504J58124J54374
17204I526482J64611K35965J74632J82605K10239J43204J88328J96251K66969
$$ plain form
17195 11289286 11540896 11815204 12053937 12262118 12477569 12699906 12942232 13291371 13581606
17186 13581606 13898082 14253672 14659571 15074908 15513073 16029324 16616060 17211083 17954788
17177 17954788 18773992 19648301 20643053 21679336 22705765 23525849 24010723 24118049 23980304
17168 23980304 23779041 23577498 22771517 20461857 15366435 7600712 1396881 -318647
17160 -318647 -254844 -2155864 -7048798 -11220487 -10948436 -7745717 -4233235 -1140121 1460240
17151 1460240 3631486 5284280 6318574 6740030 6909448 7067444 6755159 5000235 289399
17142 289399 -8097957 -16306208 -19678300 -19828174 -21266422 -26301323 -32128655 -33811358
17134 -33811358 -31450095 -28196542 -25336540 -23012017 -21162388 -19648234 -18322194 -17213541
$$ packed form
17195A1289286K51610K74308K38733K08181K15451K22337K42326L49139K90235
17186A3581606L16476L55590M05899M15337M38165N16251N86736N95023P43705
17177A7954788Q19204Q74309R94752J036283J026429Q20084M84874J07326j37745
17168B3980304k01263k01543q05981k309660n095422p765723o203831j715528
17160c18647O3803j901020m892934m171689K72051L202719L512482L093114K600361
17151A460240K171246J652794J034294M21456J69418J57996l12285j754924m710836
17142B89399q387356q208251l372092j49874j438248n034901n827332j682703
17134c3811358K361263L253553K860002K324523J849629J514154J326040J108653
$$ plain form
17126 -17213541 -16262622 -15447310 -14642841 -13920826 -13266698 -12671091 -12088471 -11591091 -11119932
17117 -11119932 -10719396 -10392414 -10068606 -9738133 -9420962 -9153792 -8873908 -8624706 -8399697
17108 -8399697 -8220739 -8023046 -7824174 -7621605 -7442801 -7247150 -7060399 -6886213 -6675281
17099 -6675281 -6434666 -6251782 -6108607 -5956118 -5869791 -5723662 -5578727 -5484228 -5347648 -5166411
17089 -5166411 -5040543 -4943025 -4845303 -4779960 -4702097 -4602925 -4526809 -4422606 -4331263 -4278560 -4223209
17078 -4223209 -4118450 -4012287 -3902290 -3795229 -3682927 -3602962 -3539545 -3464624 -3369605 -3289979
17068 -3289979 -3228450 -3176204 -3136415 -3058923 -2984537 -2942525 -2887490 -2828599 -2766339 -2787703 -2782276
17057 -2782276 -2686554 -2575694 -2525005 -2467412 -2429519 -2367017 -2282310 -2244532 -2242657 -2192062 -2107929
$$ packed form
17126a7213541R50919Q15312Q04469P22015O54128N95607N82620M97380M71159
17117a1119932M00536L26982L23808L30473L17171K67170K79884K49202K25009
17108h399697J78958J97693J98872K02569J78804J95651J86751J74186K10932
17099f675281K40615J82884J43175J52489Q6327J46129J44935R4499J36580J81237
17089e166411J25868R7518R7722O5343P7863R9172P6116J04203R1343N2703N5351
17078d223209J04759J06163J09997J07061J12302P9965O3417P4921R5019P9626
17068c289979O1529N2246L9789P7492P4386M2012N5035N8891O2260k1364N427
17057b782276R5722J10860N0689N7593L7893O2502Q4707L7778J875N0595Q4133
$$ plain form
17046 -2107929 -2026700 -2016599 -2022887 -2000761 -1942270 -1894390 -1838792 -1799409 -1762749 -1675835 -1623238
17035 -1623238 -1634998 -1606482 -1585784 -1552969 -1534251 -1468486 -1393976 -1339031 -1268120 -1233441 -1195199
17024 -1195199 -1182151 -1167202 -1096911 -1035429 -1009076 -980380 -908048 -871162 -866682 -847778 -793885
17013 -793885 -792621 -775916 -703080 -710989 -679886 -632506 -584926 -528959 -500192 -462135 -455294 -425017
17001 -425017 -370447 -334757 -298427 -266134 -240549 -181946 -135485 -81699 -65732 -29447 51205
16990 51205 132122 135645 113617 133876 175379 216758 258087 280619 345664 364601 366852 448150
16978 448150 528671 557475 568564 571604 598256 647872 742425 805447 833753 836942 854640 931485
16966 931485 1009558 1080972 1161152 1180236 1188548 1198262 1254315 1295760 1311792 1363117 1391667 1409488
$$ packed form
17046b107929Q1229J0101o288K2126N8491M7880N5598L9383L6660Q6914N2597
17035a623238j1760K8516K0698L2815J8718O5765P4510N4945P0911L4679L8242
17024a195199J3048J4949P0291O1482K6353K8696P2332L6886M480J8904N3893
17013g93885J264J6705P2836p909L1103M7380M7580N5967K8767L8057O841L0277
17001d25017N4570L5690L6330L2293K5585N8603M6461N3786J5967L6285Q0652
16990E1205Q0917L523k2028K0259M1503M1379M1329K2532O5045J8937K251Q1298
16978D48150Q0521K8804J1089L040K6652M9616R4553O3022K8306L189J7698P6845
16966I31485P8073P1414Q0180J9084Q312R714N6053M1445J6032N1325K8550J7821
$$ plain form
16954 1409488 1463159 1524527 1645018 1710539 1736050 1762450 1795327 1846160 1928073 2034633 2095075
16943 2095075 2146523 2226074 2282383 2371934 2507711 2575912 2584059 2589876 2642917 2709904 2742613
16932 2742613 2792008 2897092 3048783 3113895 3207821 3273930 3352035 3416663 3470424 3550989 3665040
16921 3665040 3735933 3842782 3909640 3960882 4037971 4180117 4364867 4488184 4555939 4676969
16911 4676969 4771934 4920974 5078282 5187592 5269692 5375520 5511468 5694676 5902968 6078319
16901 6078319 6180524 6276409 6366512 6505131 6694215 6868125 7014564 7170853 7357320 7570522
16891 7570522 7787121 7972561 8154402 8334178 8570391 8786283 8975223 9172511 9345926
16882 9345926 9585657 9864647 10131743 10410751 10679183 10998496 11331475 11608281 11964870
$$ packed form
16954A409488N3671O1368J20491O5521K5511K6400L2877N0833Q1913J06560O0442
16943B095075N1448P9551N6309Q9551J35777O8201Q147N817N3041O6987L2709
16932B742613M9395J05084J51691O5112R3926O6109P8105O4628N3761Q0565J14051
16921C665040P0893J06849O6858N1242P7089J42146J84750J23317O7755J21030
16911D676969R4965J49040J57308J09310Q2100J05828J35948J83208K08292J75351
16901F078319J02205R5885R0103J38619J89084J73910J46439J56289J86467K13202
16891G570522K16599J85440J81841J79776K36213K15892J88940J97288J73415
16882I345926K39731K78990K67096K79008K68432L19313L32979K76806L56589
$$ plain form
16873 11964870 12292184 12735881 13246299 13752719 14387503 15103868 15865364 16708788 17555887
16864 17555887 18376288 19234017 19982813 20354242 20130718 19432042 18813171 18665464 18562889
16855 18562889 17550943 13767332 5035488 -2569124 -2366056 448606 2782443 4114175
16847 4114175 4797579 5497709 6267297 6524919 5056323 -368164 -9402588 -13177953 -11623217
16838 -11623217 -9585134 -7950224 -6425574 -5109488 -4576774 -6141270 -11854891 -19225728
16830 -19225728 -20362618 -17828882 -15387696 -13888880 -13162721 -12698969 -12137947 -11914504 -12888145
16821 -12888145 -16732206 -24863370 -30416962 -29413290 -26730444 -24204288 -22125906 -20474210
16813 -20474210 -19175266 -18109156 -17181814 -16341636 -15663723 -15093254 -14565066 -14086960 -13624278
$$ packed form
16873A1964870L27314M43697N10418N06420O34784P16365P61496Q43424Q47099
16864A7555887Q20401Q57729P48796L71429k23524o98676o18871j47707j02575
16855A8562889j011946l783611q731844p604612K03068K814662K333837J331732
16847D114175O83404P00130P69588K57622j468596n424487r034424l775365J554736
16838a1623217K038083J634910J524650J316086N32714j564496n713621p370837
16830a9225728j136890K533736K441186J498816P26159M63752N61022K23443r73641
16821a2888145l844061q131164n553592J003672K682846K526156K078382J651696
16813b0474210J298944J066110R27342Q40178O77913N70469N28188M78106M62682
$$ plain form
16804 -13624278 -13176887 -12721902 -12287812 -11953861 -11637141 -11304333 -11028004 -10828020 -10612082
16795 -10612082 -10438310 -10219900 -9959309 -9681925 -9496092 -9366502 -9177443 -8986790 -8833339
16786 -8833339 -8643844 -8500955 -8441089 -8320412 -8164805 -7998199 -7877642 -7749067 -7637987 -7558823
16776 -7558823 -7461807 -7364628 -7234353 -7098327 -6986884 -6898760 -6770754 -6673552 -6626664 -6540638
16766 -6540638 -6455442 -6378162 -6303507 -6286938 -6182067 -6050699 -5977126 -5930633 -5900017 -5844415 -5731350
16755 -5731350 -5673380 -5644715 -5562928 -5468983 -5401890 -5393275 -5338388 -5274183 -5223050 -5153655 -5120172
16744 -5120172 -5139686 -5148240 -5076325 -5053200 -5022033 -4944029 -4901243 -4874460 -4850137 -4782578 -4695334
16733 -4695334 -4656225 -4612110 -4558129 -4492550 -4461035 -4400780 -4358983 -4347918 -4340747 -4300458 -4252176
$$ packed form
16804a3624278M47391M54985M34090L33951L16720L32808K76329J99984K15938
16795a0612082J73772K18410K60591K77384J85833J29590J89059J90653J53451
16786h833339J89495J42889N9866J20677J55607J66606J20557J28575J11080P9164
16776g558823R7016R7179J30275J36026J11443Q8124J28006R7202M6888Q6026
16766f540638Q5196P7280P4655J6569J04871J31368P3573M6493L0616N5602J13065
16755e731350N7970K8665Q1787R3945O7093Q615N4887O4205N1133O9395L3483
16744e120172j9514q554P1915K3125L1167P8004M2786K6783K4323O7559Q7244
16733d695334L9109M4115N3981O5579L1515O0255M1797J1065P171M0289M8282
$$ plain form
16722 -4252176 -4253828 -4233303 -4233536 -4218671 -4160767 -4128922 -4095045 -4036525 -3997887 -3956970 -3914435 -3911642
16710 -3911642 -3911142 -3895840 -3870018 -3831932 -3788332 -3754130 -3760792 -3754027 -3690560 -3643955 -3655320 -3637988
16698 -3637988 -3611081 -3603479 -3575264 -3587155 -3577699 -3585808 -3561933 -3492561 -3430942 -3436831 -3464679 -3437533
16686 -3437533 -3396700 -3385656 -3369856 -3362812 -3334035 -3340094 -3334497 -3330203 -3269198 -3259377 -3262746 -3252369
16674 -3252369 -3182038 -3146407 -3124572 -3069285 -3067848 -3102345 -3098298 -3061637 -3035197 -3022376 -3012371 -3017718
16662 -3017718 -2983280 -2953053 -2941943 -2896241 -2920006 -2902917 -2896643 -2896154 -2882393 -2846605 -2811533 -2815431
16650 -2815431 -2772369 -2733890 -2707096 -2724664 -2705258 -2643174 -2620341 -2613475 -2640937 -2631062 -2603143 -2589445
16638 -2589445 -2578098 -2582175 -2585113 -2597091 -2626188 -2574259 -2537392 -2529142 -2505073 -2468715 -2464536 -2444897
$$ packed form
16722d252176j652K0525k33J4865N7904L1845L3877N8520L8638M0917M2535K793
16710c911642N00J5302K5822L8086M3600L4202o662O765O3467M6605j1365J7332
16698c637988K6907P602K8215j1891R456q109K3875O9372O1619n889k7848K7146
16686c437533M0833J1044J5800P044K8777o059N597M294O1005R821l369J0377
16674c252369P0331L5631K1835N5287J437l4497M047L6661K6440J2821J0005n347
16662c017718L4438L0227J1110M5702k3765J7089O274M89J3761L5788L5072l898
16650b815431M3062L8479K6794j7568J9406O2084K2833O866k7462R875K7919J3698
16638b589445J1347m077k938j1978k9097N1929L6867Q250K4069L6358M179J9639
$$ plain form
16626 -2444897 -2404710 -2426700 -2468031 -2459579 -2403879 -2376514 -2356269 -2340163 -2340409 -2302728 -2283472 -2301620
16614 -2301620 -2288804 -2244115 -2214115 -2211766 -2244338 -2271032 -2239408 -2213587 -2178919 -2202186 -2256252
16603 -2256252 -2317384 -2308797 -2254010 -2217672 -2233145 -2280977 -2304382 -2272443 -2246955 -2210038 -2219343 -2194178
16591 -2194178 -2216603 -2244274 -2217357 -2164489 -2178404 -2161990 -2143475 -2138252 -2110391 -2104693 -2163121 -2155761
16579 -2155761 -2139397 -2178013 -2220471 -2229056 -2187267 -2170349 -2151069 -2111485 -2089548 -2086554 -2117894 -2111015
16567 -2111015 -2074652 -2052259 -2024112 -2050794 -2016908 -1993463 -1963757 -1933359 -1917958 -1927477 -1950403
16556 -1950403 -1976907 -1983006 -1951712 -1920747 -1902820 -1876628 -1882651 -1900704 -1909966 -1922432 -1872005 -1833374
16544 -1833374 -1859807 -1861588 -1874096 -1894329 -1849213 -1777069 -1749203 -1764020 -1812618 -1839417 -1840578 -1833568
$$ packed form
16626b444897M0187k1990m1331Q452N5700K7365K0245J6106k46L7681J9256j8148
16614b301620J2816M4689L0000K349l2572k6694L1624K5821L4668k3267n4066
16603b256252o1132Q587N4787L6338j5473m7832k3405L1939K5488L6917r305K5165
16591b194178k2425k7671K6917N2868j3915J6414J8515N223K7861N698n8428P360
16579b155761J6364l8616m2458q585M1789J6918J9280L9584K1937K994l1340O879
16567b111015L6363K2393K8147k6682L3886K3445K9706L0398J5401r519k2926
16556a950403k6504o099L1294L0965J7927K6192o023j8053r262j2466N0427L8631
16544a833374k6433j781j2508k0233M5116P2144K7866j4817m8598k6799j161P010
$$ plain form
16532 -1833568 -1795679 -1730630 -1738325 -1758492 -1757656 -1731947 -1742541 -1741981 -1744398 -1767511 -1771680 -1771577 -1747580
16519 -1747580 -1741561 -1731179 -1712108 -1653950 -1590019 -1614050 -1634309 -1664361 -1694383 -1677888 -1635078
16508 -1635078 -1626730 -1631179 -1615017 -1591661 -1574831 -1559872 -1568021 -1542717 -1532333 -1582368 -1581466 -1582715
16496 -1582715 -1539475 -1489808 -1460062 -1440943 -1465870 -1513761 -1573235 -1602223 -1584626 -1555092 -1487239
16485 -1487239 -1443012 -1458808 -1457775 -1457982 -1448839 -1446385 -1450298 -1449928 -1437748 -1431943 -1436143 -1481911 -1516550
16472 -1516550 -1521833 -1521862 -1489208 -1433935 -1408036 -1402485 -1390517 -1393433 -1400039 -1398851 -1399575 -1377902 -1374635
16459 -1374635 -1386051 -1397528 -1382225 -1360372 -1368354 -1386624 -1394709 -1346990 -1303813 -1296694 -1295977 -1321575
16447 -1321575 -1335688 -1325361 -1322652 -1324608 -1303874 -1279908 -1261156 -1277702 -1270590 -1235906 -1215181 -1266638
$$ packed form
16532a833568L7889O5049p695k0167Q36K5709j0594N60k417k3113m169J03K3997
16519a747580O019J0382J9071N8158O3931k4031k0259l0052l0022J6495M2810
16508a635078Q348m449J6162K3356J6830J4959q149K5304J0384n0035R02j249
16496a582715M3240M9667K9746J9119k4927m7891n9474k8988J7597K9534O7853
16485a487239M4227j5796J033k07R143K454l913L70J2180N805m200m5768l4639
16472a516550n283k9L2654N5273K5899N551J1968k916o606J188p24K1673L267
16459a374635j1416j1477J5303K1853p982j8270q085M7719M3177P119P17k5598
16447a321575j4113J0327K709j956K0734K3966J8752j6546P112L4684K0725n1457
$$ plain form
16435 -1266638 -1325213 -1349526 -1354423 -1311367 -1235230 -1164448 -1137844 -1240222 -1228904 -1222110 -1230164 -1203395
16423 -1203395 -1214024 -1258538 -1274130 -1237638 -1220959 -1223467 -1200383 -1194907 -1236078 -1249656 -1210406 -1225674
16411 -1225674 -1225921 -1252088 -1232913 -1233663 -1210228 -1178047 -1160049 -1146354 -1155214 -1159312 -1176712 -1174507 -1189506
16398 -1189506 -1164829 -1149869 -1108500 -1082721 -1097324 -1066204 -1043343 -1085595 -1092748 -1101863 -1121226 -1099660
16386 -1099660 -1052836 -1056588 -1072846 -1086087 -1069210 -1077043 -1091388 -1079568 -1074659 -1091889 -1111464 -1106857
16374 -1106857 -1119465 -1155548 -1126616 -1110939 -1074294 -1068933 -1059246 -1007575 -1020278 -1044403 -1050171 -1038957
16362 -1038957 -1066190 -1090136 -1057775 -1032671 -1035854 -1029758 -1017840 -1021084 -1004021 -998712 -1013102 -977268
16350 -977268 -957975 -968937 -1001959 -987904 -986392 -990901 -949288 -924281 -930222 -967472 -976567 -971702
$$ packed form
16435a266638n8575k4313m897M3056P6137P0782K6604j02378J1318O794q054K6769
16423a203395j0629m4514j5592L6492J6679k508K3084N476m1171j3578L9250j5268
16411a225674k47k6167J9175p50K3435L2181J7998J3695q860m098j7400K205j4999
16398a189506K4677J4960M1369K5779j4603L1120K2861m2252p153r115j9363K1566
16386a099660M6824l752j6258j3241J6877p833j4345J1820M909j7230j9575M607
16374a106857j2608l6083K8932J5677L6645N361R687N1671j2703k4125n768J1214
16362a038957k7233k3946L2361K5104l183O096J1918l244J7063N309j4390L5834
16350i77268J9293j0962l3022J4055J512m509M1613K5007n941l7250r095M865
$$ plain form
16338 -971702 -952299 -917122 -926138 -952797 -977814 -962052 -924699 -907270 -906327 -921351 -921126 -939619
16326 -939619 -919346 -898853 -903837 -847975 -852978 -883668 -873603 -843764 -876924 -879088 -841760 -819749
16314 -819749 -819465 -827112 -768368 -767894 -776456 -750605 -744315 -738262 -705610 -687559 -714439 -743178 -792085
16301 -792085 -804684 -820112 -834038 -794383 -763935 -798751 -840748 -912982 -870705 -813951 -850447
16290 -850447 -867647 -870810 -816371 -725844 -696620 -753971 -767009 -847734 -908568 -896623 -862619 -854297
16278 -854297 -825339 -814846 -833832 -836271 -873046 -898135 -878246 -879890 -867974 -848344 -851947 -877062
16266 -877062 -854535 -826631 -833786 -837354 -848965 -903825 -949447 -902469 -838794 -809017 -834874 -849796
16254 -849796 -858117 -859949 -849670 -834197 -840886 -796750 -807017 -834279 -848807 -848520 -821625 -809738
$$ packed form
16338i71702J9403L5177r016k6659k5017J5762L7353J7429R43j5024K25j8493
16326i39619K0273K0493m984N5862n003l0690J0065K9839l3160k164L7328K2011
16314h19749K84p647N8744M74q562K5851O290O053L2652J8051k6880k8739m8907
16301g92085j2599j5428j3926L9655L0448l4816m1997p2234M2277N6754l6496
16290h50447j7200l163N4439R0527K9224n7351j3038q0725o0834J1945L4004Q322
16278h54297K8958J0493j8986k439l6775k5089J9889j644J1916J9630l603k5115
16266h77062K2527K7904p155l568j1611n4860m5622M6978O3675K9777k5857j4922
16254h49796q321j832J0279J5473o689M4136j0267k7262j4528K87K6895J1887
$$ plain form
16242 -809738 -796875 -814420 -819736 -763611 -750212 -792879 -812413 -773036 -714957 -735920 -751722 -763810
16230 -763810 -771535 -753302 -723113 -707299 -737292 -760336 -761788 -754858 -740628 -710082 -683598 -683996
16218 -683996 -705999 -718251 -731968 -749554 -698310 -673942 -706068 -751766 -755894 -738393 -709337 -667432
16206 -667432 -646957 -657706 -692374 -677117 -652078 -644247 -673422 -652683 -612126 -626580 -643866 -639076
16194 -639076 -613894 -581220 -608294 -624069 -597025 -598847 -601137 -574062 -552533 -546426 -556063 -589431
16182 -589431 -592292 -582509 -603700 -599627 -611620 -622821 -609582 -653749 -634336 -617335 -608372 -612963
16170 -612963 -617286 -638722 -598661 -589495 -597183 -594370 -604437 -595773 -594633 -584667 -586642 -566776 -547167
16157 -547167 -544306 -561500 -604430 -597663 -571242 -528991 -522563 -549584 -553079 -587348 -620547 -615194
$$ packed form
16242h09738J2863j7545n316N6125J3399m2667j9534L9377N8079k0963j5802j2088
16230g63810p725J8233L0189J5814k9993k3044j452O930J4230L0546K6484l98
16218f83996k2003j2252j3717j7586N1244K4368l2126m5698m128J7501K9056M1905
16206f67432K0475j0749l4668J5257K5039P831k9175K0739M0557j4454j7286M790
16194f39076K5182L2674k7074j5775K7044j822k290K7075K1529O107r637l3368
16182e89431k861R783k1191M073j1993j1201J3239m4167J9413J7001Q963m591
16170f12963m323k1436M0061R166p688K813j0067Q664J140R966j975J9866J9609
16157e47167K861j7194m2930O767K6421M2251O428k7021l495l4269l3199N353
$$ plain form
16145 -615194 -638383 -583194 -577843 -555429 -529822 -519940 -542478 -551286 -565418 -577517 -562601 -517742
16133 -517742 -519991 -491351 -511409 -549100 -568975 -574218 -577053 -571315 -561503 -530230 -521224 -518666 -504450
16120 -504450 -522568 -520315 -532983 -519277 -494350 -454667 -433925 -418720 -487590 -534107 -569930 -566556
16108 -566556 -540665 -533056 -512229 -464220 -476912 -489669 -471486 -461795 -461465 -468325 -462569 -453928 -448815
16095 -448815 -457045 -451018 -476756 -512241 -528977 -481863 -430138 -415721 -384224 -358860 -345860 -347818
16083 -347818 -379441 -394748 -395259 -399563 -427545 -463249 -448788 -424536 -425033 -417457 -406861 -390474 -362836
16070 -362836 -363235 -385458 -411681 -432290 -407146 -354209 -331672 -356673 -411063 -399980 -412157 -396966
16058 -396966 -397935 -396459 -401492 -407622 -419219 -437619 -404298 -370641 -372715 -389381 -385092 -377099 -420239
$$ packed form
16145f15194k3189N5189N351K2414K5607R882k2538q808j4132j2099J4916M4859
16133e17742k249K8640k0058l7691j9875n243k835N738R812L1273R006K558J4216
16120e04450j8118K253j2668J3706K4927L9683K0742J5205o8870m6517l5823L374
16108e66556K5891P609K0827M8009j2692j2757J8183R691L30o860N756Q641N113
16095d48815q230O027k5738l5485j6736M7114N1725J4417L1497K5364J3000j958
16083c47818l1623j5307n11m304k7982l5704J4461K4252m97P576J0596J6387K7638
16070c62836l99k2223k6223k0609K5144N2937K2537k5001n4390J1083j2177J5191
16058c96966r69J476n033o130j1597j8400L3321L3657k074j6666M289P993m3140
$$ plain form
16045 -420239 -387109 -360008 -353412 -381802 -402220 -368376 -365055 -343088 -315561 -301570 -342475 -333006
16033 -333006 -290824 -287785 -339579 -375496 -381685 -338387 -331781 -335715 -352669 -337379 -366850 -379295
16021 -379295 -349458 -320855 -338530 -365524 -399902 -387919 -347369 -343937 -413185 -393537 -384641 -350740
16009 -350740 -314180 -289836 -276945 -314577 -340716 -367701 -374704 -349391 -343103 -353851 -350961 -287334
15997 -287334 -273600 -301823 -324609 -293354 -252024 -238379 -264521 -273456 -264234 -281642 -271889 -288695
15985 -288695 -301919 -284424 -289194 -294871 -281758 -295575 -332305 -353457 -321184 -330855 -308129 -318288
15973 -318288 -295870 -270200 -282239 -310628 -291233 -265110 -235992 -257159 -270552 -217314 -211800 -237958
15961 -237958 -242212 -229920 -228575 -268656 -316617 -349794 -342133 -302980 -260288 -267940 -271438 -254467
$$ packed form
16045d20239L3130K7101O596k8390k0418L3844L321K1967K7527J3991m0905R469
16033c33006M2182L039n1794l5917o189M3298O606l934j6954J5290k9471j2445
16021c79295K9837K8603j7675k6994l4378J1983M0550L432o9248J9648Q896L3901
16009c50740L6560K4344J2891l7632k6139k6985p003K5313O288j0748K890O3627
15997b87334J3734k8223k2786L1255M1330J3645k6142q935R222j7408R753j6806
15985b88695j3224J7495m770n677J3113j3817l6730k1152L2273r671K2726j0159
15973c18288K2418K5670j2039k8389J9395K6123K9118k1167j3393N3238N514k6158
15961b37958m254J2292J345m0081m7961l3177P661L9153M2692p652l498J6971
$$ plain form
15949 -254467 -230740 -214755 -259916 -252142 -228263 -223324 -237500 -238887 -228543 -209458 -234904 -226022
15937 -226022 -235447 -251960 -265754 -234838 -232606 -230308 -198996 -159288 -163972 -148678 -182025 -165923
15925 -165923 -194224 -244733 -242275 -253687 -275775 -312222 -324685 -306464 -306376 -259006 -219955 -196556
15913 -196556 -201446 -223410 -217692 -206114 -246618 -245139 -177000 -189812 -200888 -200775 -189363 -170145
15901 -170145 -151807 -153670 -156487 -172888 -142441 -150854 -191998 -153586 -98037 -90724 -102695 -124512
15889 -124512 -136443 -169232 -203821 -224775 -175602 -158159 -124487 -107467 -135140 -161318 -157745 -165594
15877 -165594 -168278 -127416 -108652 -136995 -119053 -156321 -176913 -152966 -134270 -124644 -145463 -110979
15865 -110979 -79523 -151500 -175980 -183218 -138138 -80998 -106297 -122269 -102269 -99272 -84405 -60668
$$ packed form
15949b54467K3727J5985m5161P774K3879M939j4176j387J0344J9085k5446Q882
15937b26022r425j6513j3794L0916K232K298L1312L9708m684J5294l3347J6102
15925a65923k8301n0509K458j1412k2088l6447j2463J8221Q8M7370L9051K3399
15913a96556m890k1964N718J1578m0504J479O8139j2812j1076J13J1412J9218
15901a70145J8338j863k817j6401L0447q413m1144L8412N5549P313j1971k1817
15889a24512j1931l2789l4589k0954M9173J7443L3672J7020k7673k6178L573p849
15877a65594k684M0862J8764k8343J7942l7268k0592K3947J8696R626k0819L4484
15865a10979L1456p1977k4480p238M5080N7140k5299j5972K0000K997J4867K3737
$$ plain form
15853 -60668 -76405 -144339 -146837 -109701 -100123 -113807 -122679 -143445 -106952 -80458 -99574 -65352
15841 -65352 -65339 -62365 -49900 -69309 -63192 -30209 -36614 -82749 -104667 -87462 -118622 -151607 -127308
15828 -127308 -85897 -38782 -44406 -108415 -104227 -76038 -58041 -74018 -69716 -88855 -124246 -98809
15816 -98809 -58434 -56314 -75276 -68229 -52626 -44004 -39437 -69218 -74858 -99100 -75317 -29742 -29638
15803 -29638 -70935 -55854 -41125 -80383 -91659 -62382 -57649 -39579 -51985 -77359 -81760 -50455
15791 -50455 -9450 -26390 -29498 -37033 -45635 -63990 -107043 -97975 -63761 -51183 -69824 -75478 -60883
15778 -60883 -47611 -59507 -39484 -16623 -4679 -42950 -39777 -60169 -49475 -36493 -47231 -43642
15766 -43642 6243 -3606 -5763 31485 -823 4866 -2438 -28390 -41685 -50876 -37196 5118 -29142
$$ packed form
15853f0668j5737o7934k498L7136R578j3684q872k0766L6493K6494j9116L4222
15841f5352J3K974J2465j9409O117L2983o405m6135k1918J7205l1160l2985K4299
15828a27308M1411M7115n624o4009M188K8189J7997j5977M302j9139l5391K5437
15816i8809M0375K120j8962P047J5603Q622M567k9781n640k4242K3783M5575J04
15803b9638m1297J5081J4729l9258j1276K9277M733J8070j2406k5374m401L1305
15791e0455M1005j6940l108p535q602j8355m3053R068L4214J2578j8641n654J4595
15778f0883J3272j1896K0023K2861J1944l8271L173k0392J0694J2982j0738L589
15766d3642M9885r849k157L7248l2308N689p304k5952j3295r191J3680M2314l4260
$$ plain form
15753 -29142 -27376 -5374 -4573 -51966 -72309 -77763 -90049 -65753 -6034 6383 -2547 -2524 -10191
15740 -10191 -18439 -55309 -67437 -67735 -65336 -7107 57858 68467 63676 88952 69274 10426 39167
15727 39167 61015 58917 48896 37472 78304 110602 88450 81298 92727 116115 52938 40326
15715 40326 71838 99911 79178 107071 134676 135946 125280 126270 81865 54923 94563 79190
15703 79190 42765 36077 43490 68862 94107 104759 116692 128567 156252 146672 100814 108706
15691 108706 106392 120304 101644 84870 56329 76956 74131 66262 81362 83267 74227 59289
15679 59289 82675 127258 98608 40324 33275 30982 35887 70204 78861 64017 90759 67435
15667 67435 53785 42283 48237 65845 97436 94081 100648 109606 73644 93602 88152 95831 109707
$$ packed form
15753b9142J766K2002Q01m7393k0343n454j2286K4296N9719J2417q930K3p667
15740a0191q248l6870j2128k98K399N8229O4965J0609m791K5276j9678n8848K8741
15727C9167K1848k098j0021j1424M0832L2298k2152p152J1429K3388o3177j2612
15715D0326L1512K8073k0733K7893K7605J270j0666R90m4405k6942L9640j5373
15703G9190l6425o688P413K5372K5245J0652J1933J1875K7685r580m5858P892
15691A08706k314J3912j8660j6774k8541K0627k825p869J5100J905r040j4938
15679E9289K3386M4583k8650n8284p049k293M905L4317Q657j4844K6742k3324
15667F7435j3650j1502N954J7608L1591l355O567Q958l5962J9958n450P679J3876
$$ plain form
15654 109707 116841 99742 36592 26515 80230 77871 119633 142444 155433 126408 122980 148855
15642 148855 126225 115891 119034 118337 102690 100363 104737 79326 54885 57099 54280 60119 72629
15629 72629 89730 126833 127693 138449 130654 115634 120259 132344 152573 136410 106049 136957
15617 136957 176972 173900 162771 127384 159913 178115 156447 123412 104841 109743 149178 158216
15605 158216 153510 133091 136055 146527 87964 109168 150093 121912 78775 99392 113356 139447
15593 139447 140816 113787 131123 119043 97702 87634 139823 176711 153160 104317 107721 143101
15581 143101 202956 211014 212798 217961 191449 173628 174022 159095 171392 171072 159341 164927 188298
15568 188298 203919 259377 282544 235474 218481 177290 162247 181205 141204 135823 122679 151900
$$ packed form
15654A09707P134j7099o3150j0077N3715k359M1762K2811J2989k9025l428K5875
15642A48855k2630j0334L143o97j5647k327M374k5411k4441K214k819N839J2510
15629G2629J7101L7103Q60J0756p795j5020M625J2085K0229j6163l0361L0908
15617A36957M0015l072j1129l5387L2529J8202k1668l3035j8571M902L9435R038
15605A58216m706k0419K964J0472n8563K1204M0925k8181m3137K0617J3964K6091
15593A39447J369k7029J7336j2080k1341j0068N2189L6888k3551m8843L404L5380
15581A43101N9855Q058J784N163k6512j7821L94j4927J2297l20j1731N586K3371
15568A88298J5621N5458K3167m7070j6993m1191j5043J8958m0001n381j3144K9221
$$ plain form
15556 151900 136228 113561 127479 150023 196834 187083 180089 182337 208936 241605 250875 275126
15544 275126 288305 271462 273447 286573 271592 241995 233443 249403 238732 207572 224857 248420
15532 248420 268956 272453 265564 286450 311589 283135 236119 239530 242729 230563 207105 227704
15520 227704 272940 281210 280533 276170 281905 265297 260463 289184 294525 303385 261147 230348 260869
15507 260869 267459 249124 254196 283461 277386 297811 337537 278938 213860 221792 290367 317139
15495 317139 305965 286081 226333 198783 222656 243443 239524 221199 217747 252649 291027 298773
15483 298773 290026 272542 277167 279615 273283 275768 262221 271698 268094 308998 325656 290064 284306
15470 284306 301441 322487 355499 315985 286374 320367 355847 382621 405673 403452 344584 321986
$$ packed form
15556A51900j5672k2667J3918K2544M6811r751o994K248K6599L2669R270K4251
15544B75126J3179j6843J985J3126j4981k9597q552J5960j0671l1160J7285K3563
15532B48420K0536L497o889K0886K5139k8454m7016L411L199j2166k3458K0599
15520B27704M5236Q270o77m363N735j6608m834K8721N341Q860m2238l0799L0521
15507B60869O590j8335N072K9265o075K0425L9726n8599o5078P932O8575K6772
15495C17139j1174j9884n9748k7550K3873K0787l919j8325l452L4902L8378P746
15483B98773q747j7484M625K448o332K485j3547R477l604M0904J6658l5592n758
15470B84306J7135K1046L3012l9514k9611L3993L5480K6774K3052k221n8868k2598
$$ plain form
15458 321986 330359 321952 353083 377681 366525 341202 339454 322069 309567 277742 270459 299898
15446 299898 344264 368196 357937 354010 331725 320967 345473 345788 382763 343690 271995 300196
15434 300196 360810 374252 348644 333820 331471 355339 383795 367379 330225 319878 337557 402688
15422 402688 439829 438174 423052 398356 378163 376735 364833 370278 378290 345124 315339 347354
15410 347354 373711 396587 411600 358454 366688 382593 382335 372345 340431 326531 332260 370479
15398 370479 384100 329715 358462 383428 416657 433464 416897 387460 336232 324704 355762
15387 355762 383170 435431 451126 427193 447779 430370 371649 383399 375771 390248 417803 457732
15375 457732 467932 406747 370175 398447 417473 392532 378785 423779 425146 435818 466147 424163
$$ packed form
15458C21986Q373q407L1131K4598j1156k5323j748j7385j2502l1825p283K9439
15446B99898M4366K3932j0259l927k2285j0758K4506L15L6975l9073p1695K8201
15434C00196O0614J3442k5608j4824k349K3868K8456j6416l7154j0347J7679O5131
15422D02688L7141j655j5122k4696k0193j428j1902N445Q012l3166k9785L2015
15410C47354K6357K2876J5013n3146Q234J5905k58r990l1914j3900N729L8219
15398C70479J3621n4385K8747K4966L3229J6807j6567k9437n1228j1528L1058
15387C55762K7408N2261J5695k3933K0586j7409n8721J1750p628J4477K7555L9929
15375D57732J0200o1185l6572K8272J9026k4941j3747M4994J367J0672L0329m1984
$$ plain form
15363 424163 406781 416132 413868 430540 405584 387722 417370 450575 443334 428878 424774 449335
15351 449335 467534 469229 461281 426713 459267 432587 390108 379222 400485 443690 469804 456452
15339 456452 470316 476875 474603 468192 482128 473585 431807 430935 422106 422607 455576 473917 435223
15326 435223 456036 453080 450941 444680 439829 445538 451350 418134 433893 490409 494493 488559 524125
15313 524125 543784 513330 492067 478400 479106 500623 482539 536832 522411 473141 459126 459878
15301 459878 442883 443064 486149 499655 462609 475812 450349 449699 482881 510052 522159 520680
15289 520680 496568 512686 495536 509163 552266 578434 577818 529049 500263 492292 508299 508787
15277 508787 478176 479325 478773 525546 543077 548109 519244 494342 513800 522667 532383 533469 519414
$$ packed form
15363D24163j7382R351k264J6672k4956j7862K9648L3205p241j4456m104K4561
15351D49335J8199J695p948l4568L2554k6680m2479j0886K1263M3205K6114j3352
15339D56452J3864O559k272o411J3936q543m1778q72q829N01L2969J8341l8694
15326D35223K0813k956k139o261m851N709N812l3216J5759N6516M084n934L5566
15313E24125J9659l0454k1263j3667P06K1517j8084N4293j4421m9270j4015P52
15301D59878j6995J81M3085J3506l7046J3203k5463o50L3182K7171J2107j479
15289E20680k4112J6118j7150J3627M3103K6168o16m8769k8786p971J6007M88
15277E08787l0611J149n52M6773J7531N032k8865k4902J9458Q867R716J086j4055
$$ plain form
15264 519414 496920 478509 464011 530423 575901 553549 551452 528035 504823 477354 472749 462543
15252 462543 483936 498317 546024 596287 583179 556967 555965 497369 509259 510863 544806 583812
15240 583812 600204 598462 576218 568708 567235 551277 559327 554944 517890 514034 548868 534240 482197
15227 482197 439128 451958 494397 469112 472961 503173 548666 582587 618518 622450 567114 525486
15215 525486 520194 551534 561062 552583 593253 612283 574805 535372 526554 523866 546129 565816
15203 565816 570731 585429 554997 511111 475513 479948 540926 583980 622665 597979 615081 646854
15191 646854 630950 575099 570660 580995 576307 549086 567981 609818 620863 600955 630683 650463
15179 650463 651524 647056 645065 666611 656958 632323 634439 638794 599335 556647 545395 555109 557692
$$ packed form
15264E19414k2494j8411j4498O6412M5478k2352k097k3417k3212k7469m605j0206
15252D62543K1393J4381M7707N0263j3108k6212j002n8596J1890J604L3943L9006
15240E83812J6392j742k2244p510j473j5958Q050m383l7054l856L4834j4628n2043
15227D82197m3069J2830M2439k5285L849L0212M5493L3921L5931L932n5336m1628
15215E25486n292L1340R528q479M0670J9030l7478l9433q818k688K2263J9687
15203E65816M915J4698l0432m3886l5598M435O0978M3054L8685k4686J7102L1773
15191F46854j5904n5851m439J0335m688k7221J8895M1837J1045j9908K9728J9780
15179F50463J061m468j991K1546r653k4635K116M355l9459m2688j1252R714K583
$$ plain form
15166 557692 614524 622674 601547 579571 610465 592557 581074 523069 542925 621073 623133 597559
15154 597559 574550 610610 630783 614642 598785 608030 606226 624071 668190 646810 608116 598055
15142 598055 625866 640451 662917 656899 668989 666707 637841 624719 640999 676834 659780 611546
15130 611546 586955 603883 640228 660312 648320 639903 644382 649680 614007 614833 645976 659891
15118 659891 655394 669823 656507 677137 693688 709212 703334 730073 735731 707034 740579 715536
15106 715536 701000 695863 696065 723853 697482 715184 738335 695957 680252 688772 681332 664201
15094 664201 673205 677793 696778 708451 720718 714648 670122 657902 675590 661794 671002 676715
15082 676715 720898 751877 758607 721708 713036 689847 640374 611593 611898 686337 727092 743766
$$ packed form
15166E57692N6832Q150k1127k1976L0894j7908j1483n8005J9856P8148K060k5574
15154E97559k3009L6060K0173j6141j5857R245j804J7845M4119k1380l8694j0061
15142E98055K7811J4585K2466o018J2090k282k8866j3122J6280L5835j7054m8234
15130F11546k4591J6928L6345K0084j1992q417M479N298l5673Q26L1143J3915
15118F59891m497J4429j3316K0630J6551J5524n878K6739N658k8697L3545k5043
15106G15536j4536n137K02K7788k6371J7702K3151m2378j5705Q520p440j7131
15094F64201R004M588J8985J1673J2267o070m4526j2220J7688j3796R208N713
15082F76715M4183L0979O730l6899q672k3189m9473k8781L05P4439M0755J6674
$$ plain form
15070 743766 765151 732003 742868 772470 725975 704776 730183 742009 731157 698590 695505 681776
15058 681776 664063 690942 639238 629325 674432 722625 719433 672439 657988 691444 725800 735394
15046 735394 735383 718298 707497 737796 734218 744911 786621 797149 772452 730761 723300 714601 715634
15033 715634 699173 709976 713721 757405 753720 755508 702740 717510 783485 807171 790016 781529
15021 781529 758775 764758 780235 788443 774269 784179 747943 717268 748701 764890 746119 740832
15009 740832 802420 841331 859023 841112 839758 832345 857694 886532 846587 812508 820989 789772
14997 789772 734201 784307 803434 776562 785294 793130 766554 760721 721768 764199 783447 767771
14985 767771 786887 771932 817817 867062 846921 838990 789303 732811 813246 849574 830887 816348
$$ packed form
15070G43766K1385l3148J0865K9602m6495k1199K5407J1826j0852l2567l085j3729
15058F81776j7713K6879n1704r913M5107M8193l192m6994j4451L3456L4356R594
15046G35394j1j7085j0801L0299l578J0693M1710J0528k4697m1691p461q699J033
15033G15634j6461J0803L745M3684l685J788n2768J4770O5975K3686j7155q487
15021G81529k2754N983J5477Q208j4174R910l6236l0675L1433J6189j8771n287
15009G40832O1588L8911J7692j7911j354p413K5349K8838l9945l4079Q481l1217
14997G89772n5571N0106J9127k6872Q732P836k6576n833l8953M2431J9248j5676
14985G67771J9116j4955M5885M9245k0141p931m9687n6492Q0435L6328j8687j4539
$$ plain form
14973 816348 827424 838212 863844 854137 804282 780129 814139 806120 814411 820353 810178 808782
14961 808782 802261 779104 795665 823258 808578 796853 803259 841114 839373 828614 834818 841606
14949 841606 835168 843675 792914 800579 841518 876705 915984 924752 934659 919046 930504 930961 928249
14936 928249 944689 946157 972452 969241 960041 957842 947883 923833 915656 948637 941835 903833 860997
14923 860997 870281 922357 969424 932667 887395 867229 830423 789162 823191 880532 900911 913116
14911 913116 932839 901494 929494 924840 940295 955136 995539 1011566 977368 953262 926635 912618
14899 912618 921961 959063 945651 882101 856880 856285 871954 885124 931747 947784 941289 959384
14887 959384 988834 1005163 1029831 1008822 990906 972691 1008153 1033815 999417 951267 933506
$$ packed form
14973H16348J1076J0788K5632r707m9855k4153L4010q019Q291N942j0175j396
14961H08782o521k3157J6561K7593j4680j1725O406L7855j741j0759O204O788
14949H41606o438Q507n0761P665M0939L5187L9279Q768R907j5613J1458M57k712
14936I28249J6440J468K6295l211r200k199r959k4050q177L2981o802l8002m2836
14923H60997R284N2076M7067l6757m5272k0166l6806m1261L4029N7341K0379J2205
14911I13116J9723l1345K8000m654J5455J4841M0403J6027l4198k4106k6627j4017
14899I12618R343L7102j3412o3550k5221n95J5669J3170M6623J6037o495J8095
14887I59384K9450J6329K4668k1009j7916j8215L5462K5662l4398m8150j7761
$$ plain form
14876 933506 949564 1005676 1034711 984741 950866 949293 922789 927505 936949 954959 959779 910481
14864 910481 864120 883080 918928 950613 969689 987055 968087 995291 977969 955195 969636
14853 969636 972989 974533 996189 973432 955677 971127 1005607 993281 984239 994930 1000085 987927
14841 987927 955499 972043 978384 970170 915811 911249 966072 1024901 1023700 991706 1008581 1024039
14829 1024039 1025059 1073656 1059566 1035896 1049591 1037913 1027495 1028600 1074439 1113557 1074239 1094326
14817 1094326 1092748 1088150 1073136 1029192 1022021 1032092 1084092 1146708 1139287 1054883 1052723 1023586
14805 1023586 1023510 1031122 1078651 1082309 1069381 1058811 1030488 1029509 1057191 1027403 1037900 1037488 1022237
14792 1022237 1004715 976088 967855 989038 1000159 1025080 1058660 1071933 1068454 1064146 1089362 1093571
$$ packed form
14876I33506J6058N6112K9035m9970l3875j573k6504M716R444J8010M820m9298
14864I10481m6361J8960L5848L1685J9076J7366j8968K7204j7322k2774J4441
14853I69636L353J544K1656k2757j7755J5450L4480j2326r042J0691N155j2158
14841I87927l2428J6544O341q214n4359m562N4823N8829j201l1994J6875J5458
14829A024039J020M8597j4090k3670J3695j1678j0418J105M5839L9118l9318K0087
14817A094326j578m598j5014m3944p171J0071N2000O2616p421q4404k160k9137
14805A023586p6P612M7529L658j2928j0570k8323r79K7682k9788J0497m12j5251
14792A022237j7522k8627q233K1183J1121K4921L3580J3273l479m308K5216M209
$$ plain form
14780 1093571 1062683 1043102 1009801 1035973 1068544 1046568 1004969 1014477 1063606 1084462 1055595
14769 1055595 1064715 1090480 1109798 1081876 1041780 1030791 1046939 1047150 1055434 1094216 1131673 1094356
14757 1094356 1075408 1073177 1096089 1120059 1088792 1086947 1098416 1114092 1120623 1130099 1134544 1145477
14745 1145477 1145614 1090978 1092708 1109376 1091022 1108807 1100917 1104506 1128561 1127653 1134331 1140051 1121358
14732 1121358 1141102 1132075 1109889 1098238 1118746 1110321 1116567 1161030 1185483 1164034 1158321 1154885
14720 1154885 1186624 1187978 1173434 1149911 1135475 1158272 1145533 1105974 1102792 1081756 1101451 1202973
14708 1202973 1207262 1209032 1210250 1219675 1210749 1187095 1197715 1208962 1192877 1190764 1175106 1164316
14696 1164316 1134621 1117340 1145934 1208376 1214535 1260896 1285626 1267054 1252222 1254198 1223524 1208554
$$ packed form
14780A093571l0888j9581l3301K6172L2571k1976m1599R508M9129K0856k8867
14769A055595R120K5765J9318k7922m0096j0989J6148K11Q284L8782L7457l7317
14757A094356j8948k231K2912K3970l1267j845J1469J5676O531R476M445J0933
14745A145477J37n4636J730J6668j8354J7785p890L589K4055r08O678N720j8693
14732A121358J9744r027k2186j1651K0508q425O246M4463K4453k1449n713l436
14720A154885L1739J354j4544k3523j4436K2797j2739l9559l182k1036J9695J01522
14708A202973M289J770J218R425q926k3654J0620J1247j6085k113j5658j0790
14696A164316k9695j7281K8594O2442O159M6361K4730j8572j4832J976l0674j4970
$$ plain form
14684 1208554 1211269 1220442 1254610 1280748 1263548 1262859 1275797 1282326 1292366 1293754 1281727 1256229
14672 1256229 1223992 1221611 1267658 1253573 1251510 1247927 1275486 1302695 1284350 1240544 1234862 1265558
14660 1265558 1251052 1222440 1206772 1215250 1216744 1193433 1203792 1239692 1265072 1273267 1260660 1219893
14648 1219893 1254463 1297298 1348601 1371397 1368718 1300644 1252577 1227211 1254017 1279579 1253849
14637 1253849 1275047 1315153 1308254 1288141 1322536 1370777 1347411 1327978 1316517 1290663 1299589 1271891
14625 1271891 1276397 1279933 1246885 1233991 1266406 1294347 1299801 1275939 1272780 1326961 1325923 1333387
14613 1333387 1310700 1262127 1254223 1306331 1340280 1319018 1304013 1319758 1314444 1321201 1343843 1348309
14601 1348309 1393969 1409262 1406381 1389200 1359674 1372847 1367953 1341384 1338792 1365680 1359659 1343177
$$ packed form
14684A208554K715R173L4168K6138j7200o89J2938O529J0040J388j2027k5498
14672A256229l2237k381M6047j4085k063l583K7559K7209j8345m3806n682L0696
14660A265558j4506k8612j5668Q478J494k3311J0359L5900K5380Q195j2607m0767
14648A219893L4570M2835N1303K2796k679o8074m8067k5366K6806K5562k5730
14637A253849K1198M0106o899k0113L4395M8241k3366j9433j1461k5854Q926k7698
14625A271891M506L536l3048j2894L2415K7941N454k3862l159N4181j038P464
14613A333387k2687m8573p904N2108L3949k1262j5005J5745n314O757K2642M466
14601A348309M5660J5293k881j7181k9526J3173m894k6569k592K6888o021j6482
$$ plain form
14589 1343177 1353814 1355715 1359430 1348415 1387709 1355792 1324540 1306010 1353546 1417783 1427101 1410628
14577 1410628 1413718 1413659 1432440 1431881 1440734 1442726 1449143 1434782 1400645 1367214 1376860 1395759 1406071
14564 1406071 1431409 1464238 1445887 1439500 1460228 1425580 1418976 1447779 1457742 1468634 1486805 1454359
14552 1454359 1441291 1444529 1437099 1445897 1410716 1430607 1440321 1448696 1466925 1464632 1485106 1513234
14540 1513234 1511718 1552257 1558803 1512880 1464140 1470422 1507348 1507609 1495532 1502767 1535529 1543050 1488874
14527 1488874 1461966 1465370 1456657 1474134 1535618 1541486 1513786 1547641 1559386 1545110 1479881 1465620
14515 1465620 1483397 1526150 1556926 1560800 1563731 1568700 1526745 1574443 1574945 1554724 1580222 1596203
14503 1596203 1592119 1560523 1547922 1550978 1528213 1508172 1480544 1461532 1491171 1502122 1528395 1521682
$$ packed form
14589A343177J0637J901L715j1015L9294l1917l1252j8530M7536O4237R318j6473
14577A410628L090n9J8781n59Q853J992O417j4361l4137l3431R646J8899J0312
14564A406071K5338L2829j8351o387K0728l4648o604K8803R963J0892J8171l2446
14552A454359j3068L238p430Q798l5181J9891R714Q375J8229k293K0474K8128
14540A513234j516M0539O546m5923m8740O282L6926K61j2077P235L2762P521n4176
14527A488874k6908L404q713J7477O1484N868k7700L3855J1745j4276o5229j4261
14515A465620J7777M2753L0776L874K931M969m1955M7698N02k0221K5498J5981
14503A596203m084l1596j2601L056k2765k0041k7628j9012K9639J0951K6273o713
$$ plain form
14491 1521682 1535364 1519776 1504420 1479842 1445403 1452533 1482335 1488819 1551396 1565927 1549701 1535983
14479 1535983 1516666 1529317 1556435 1559491 1547762 1564372 1558610 1589616 1633752 1613702 1580932 1591677
14467 1591677 1626447 1680214 1684866 1664961 1684121 1673826 1653264 1600725 1575444 1583969 1583230 1614141
14455 1614141 1657665 1709363 1703942 1659949 1654055 1626662 1637286 1637732 1649933 1668183 1668706 1645429
14443 1645429 1656215 1642463 1650098 1633984 1659732 1694417 1678053 1693204 1705956 1670635 1663407 1740296
14431 1740296 1718504 1705261 1717721 1718678 1721213 1727198 1705016 1675721 1622586 1655474 1660765 1669639
14419 1669639 1666348 1692950 1691747 1720124 1734429 1716989 1714338 1770343 1787876 1765336 1736159 1740417
14407 1740417 1772326 1749401 1743545 1788379 1748364 1720112 1742242 1764902 1741844 1727325 1754341
$$ packed form
14491A521682J3682j5588j5356k4578l4439P130K9802O484O2577J4531j6226j3718
14479A535983j9317J2651K7118L056j1729J6610n762L1006M4136k0050l2770J0745
14467A591677L4770N3767M652j9905J9160j0295k0562n2539k5281Q525p39L0911
14455A614141M3524N1698n421m3993n894k7393J0624M46J2201J8250N23k3277
14443A645429J0786j3752P635j6114K5748L4685j6364J5151J2752l5321p228P6889
14431A740296k1792j3243J2460R57K535N985k2182k9295n3135L2888N291Q874
14419A669639l291K6602j203K8377J4305j7440k651N6005J7533k2540k9177M258
14407A740417L1909k2925n856M4834m0015k8252K2130K2660k3058j4519K7016
$$ plain form
14396 1754341 1764332 1775296 1757013 1767826 1750107 1736507 1735317 1770575 1797900 1732229 1739185 1726691
14384 1726691 1751477 1763632 1729890 1723054 1699822 1726403 1783186 1814577 1803923 1794945 1813725 1784244
14372 1784244 1740669 1753525 1814830 1836543 1799981 1803416 1822394 1845730 1815908 1804063 1821893
14361 1821893 1820533 1829779 1785706 1761121 1813976 1854438 1843063 1824252 1817181 1816464 1883696 1923509
14349 1923509 1934153 1948038 1882541 1868389 1907307 1909810 1928773 1946524 1937858 1916429 1944827 1925932
14337 1925932 1873589 1874768 1907518 1944332 1961067 1943122 1914997 1901118 1906302 1908812 1948225 1922943
14325 1922943 1938247 1959234 1916927 1926355 1948758 1943409 1965908 1979873 1939253 1915833 1936214 1933690
14313 1933690 1905907 1925242 1937483 1938520 1945122 1950382 1954517 1999837 1990846 1988843 1969899 2002734
$$ packed form
14396A754341R991J0964j8283J0813j7719j3600j190L5258K7325o5671O956j2494
14384A726691K4786J2155l3742o836k3232K6581N6783L1391j0654q978J8780k9481
14372A784244m3575J2856O1305K1713l6562L435J8978K3336k9822j1845J7830
14361A821893j360R246m4073k4585N2855M0462j1375j8811p071p17O7232L9813
14349A923509J0644J3885o5497j4152L8918K503J8963J7751q666k1429K8398j8895
14337A925932n2343J179L2750L6814J6735j7945k8125j3879N184K510L9413k5282
14325A922943J5304K0987m2307R428K2403n349K2499J3965m0620k3420K0381k524
14313A933690k7783J9335J2241J037O602N260M135M5320q991k003j8944L2835
$$ plain form
14301 2002734 2053926 2028251 2028199 2009314 2014514 2028634 2008229 2011704 2049642 2119511 2166726 2158465
14289 2158465 2093893 2059399 2038536 2038825 2062616 2106637 2095524 2092890 2093055 2051850 2065438 2050439
14277 2050439 2014927 2052542 2101936 2081045 2053610 2070034 2094795 2138927 2181055 2171760 2174418 2151649
14265 2151649 2091128 2075922 2099042 2109528 2129421 2085956 2065029 2064092 2068481 2070705 2074656 2084758
14253 2084758 2130144 2145149 2119997 2125663 2117015 2151088 2173515 2162840 2153602 2141155 2100340 2074118
14241 2074118 2103776 2132999 2144918 2177911 2196426 2176773 2170448 2188734 2237953 2266282 2258856 2273584
14229 2273584 2256327 2240226 2243707 2216047 2224502 2271364 2297135 2226675 2227577 2261806 2294684 2319526
14217 2319526 2338225 2329808 2248569 2219791 2251582 2235944 2250648 2305013 2284977 2283988 2287708 2304636
$$ packed form
14301B002734N1192k5675n2j8885N200J4120k0405L475L7938O9869M7215q261
14289B158465o4572l4494k0863K89K3791M4021j1113k634J65m1205J3588j4999
14277B050439l5512L7615M9394k0891k7435J6424K4761M4132M2128r295K658k2769
14265B151649o0521j5206K3120J0486J9893m3465k0927r37M389K224L951J0102
14253B084758M5386J5005k5152N666q648L4073K2427j0675r238j2447m0815k6222
14241B074118K9658K9223J1919L2993J8515j9653o325J8286M9219K8329p426J4728
14229B273584j7257j6101L481k7660Q455M6862K5771p0460R02L4229L2878K4842
14217B319526J8699q417q1239k8778L1791j5638J4704N4365k0036r89L720J6928
$$ plain form
14205 2304636 2298803 2265148 2282680 2271966 2296880 2342461 2369268 2380055 2330544 2332411 2370479 2377243
14193 2377243 2386704 2398661 2339854 2344676 2363940 2394530 2399691 2360152 2383510 2417631 2420267 2407833
14181 2407833 2374397 2362698 2398854 2419331 2420610 2432245 2435454 2430274 2408989 2424707 2458552 2462971
14169 2462971 2430321 2449909 2467269 2476287 2492276 2472921 2427805 2456183 2432910 2402278 2423247
14158 2423247 2418101 2448013 2487973 2518905 2532480 2523180 2518952 2542666 2566636 2542336 2546842 2548346
14146 2548346 2548570 2558781 2544934 2579162 2592487 2582628 2578855 2528196 2487720 2495066 2519564 2559089
14134 2559089 2588959 2549274 2564916 2604175 2593507 2598691 2610764 2583277 2583150 2611360 2594861 2622611
14122 2622611 2675716 2691023 2665208 2645627 2668972 2652830 2672676 2710678 2726236 2733038 2756065
$$ packed form
14205B304636n833l3655J7532j0714K4914M5581K6807J0787m9511J867L8068O764
14193B377243R461J1957n8807M822J9264L0590N161l9539K3358L4121K636j2434
14181B407833l3436j1699L6156K0477J279J1635L209n180k1285J5718L3845M419
14169B462971l2650J9588J7360R018J5989j9355m5116K8378k3273l0632K0969
14158B423247n146K9912L9960L0932J3575r300m228K3714K3970k4300M506J504
14146B548346K24J0211j3847L4228J3325r859l773n0659m0476P346K4498L9525
14134B559089K9870l9685J5642L9259j0668N184J2073k7487j27K8210j6499K7750
14122B622611N3105J5307k5815j9581K3345j6142J9846L8002J5558O802K3027
$$ plain form
14111 2756065 2712080 2733186 2763759 2727123 2706911 2707242 2686075 2685430 2732457 2763477 2775165 2803548
14099 2803548 2810916 2814768 2838185 2858465 2817170 2806378 2792156 2784578 2839234 2840283 2836592 2789667
14087 2789667 2794400 2771245 2790954 2832432 2839860 2835435 2868564 2882203 2853488 2851464 2860478 2869364
14075 2869364 2849883 2844268 2857559 2895814 2949478 2909478 2894484 2906033 2868861 2860701 2882289 2902149
14063 2902149 2979006 3011867 2993852 2993365 2980277 2980476 2970864 2966511 2999774 3020538 3045091 3063960
14051 3063960 3090339 3069422 3039708 3021959 3060521 3100859 3094830 3073959 3045744 3039373 2996084 2963183
14039 2963183 2965227 2989947 3015054 3032448 3060053 3087552 3103853 3092459 3104801 3124117 3133183 3134562
14027 3134562 3159513 3205305 3195851 3180403 3172767 3164902 3144594 3176310 3186527 3191780 3223661 3297564
$$ packed form
14111B756065m3985K1106L0573l6636k0212L31k1167o45M7027L1020J1688K8383
14099B803548P368L852K3417K0280m1295j0792j4222p578N4656J049l691m6925
14087B789667M733k3155J9709M1478P428m425L3129J3639k8715k024R014Q886
14075B869364j9481n615J3291L8255N3664m0000j4994J1549l7172q160K1588J9860
14063B902149P6857L2861j8015m87j3088J99r612m353L3263K0764K4553J8869
14051C063960K6379k0917k9714j7749L8562M0338o029k0871k8215o371m3289l2901
14039B963183K044K4720K5107J7394K7605K7499J6301j1394J2342J9316R066J379
14027C134562K4951M5792r454j5448p636p865k0308L1716J0217N253L1881P3903
$$ plain form
14015 3297564 3296402 3247332 3231386 3263887 3309463 3339108 3374795 3401755 3442143 3441319 3411152 3398113
14003 3398113 3407146 3411197 3398988 3392969 3343460 3244475 3166148 3123685 3088966 3088185 3096670 3134971
13991 3134971 3181413 3241983 3293887 3339346 3326485 3279225 3249747 3275831 3340283 3351093 3352382
13980 3352382 3337650 3329974 3357763 3377911 3401626 3417423 3459766 3488772 3471048 3494415 3495315 3478286
13968 3478286 3501859 3531783 3545554 3547430 3547363 3587835 3621432 3623782 3588829 3570914 3581369 3613609
13956 3613609 3664953 3663204 3624312 3544646 3450346 3355205 3327630 3388009 3441583 3444526 3484204 3507574
13944 3507574 3513853 3520104 3510243 3502055 3555914 3576959 3550993 3572136 3582831 3588005 3580032 3573491 3578564
13931 3578564 3608133 3660883 3699860 3714335 3681882 3628591 3609941 3626279 3689470 3694675 3697145 3716403
$$ packed form
14015C297564j162m9070j5946L2501M5576K9645L5687K6960M0388q24l0167j3039
14003C398113R033M051j2209o019m9509r8985p8327m2463l4719p81Q485L8301
13991C134971M6442O0570N1904M5459j2861m7260k9478K6084O4452J0810J289
13980C352382j4732p676K7789K0148K3715J5797M2343K9006j7724K3367R00j7029
13968C478286K3573K9924J3771J876o7M0472L3597K350l4953j7915J0455L2240
13956C613609N1344j749l8892p9666r4300r5141k7575O0379N3574K943L9678K3370
13944C507574O279O251r861q188N3859K1045k5966K1143J0695N174p973o541N073
13931C578564K9569N2750L8977J4475l2453n3291j8650J6338O3191N205K470J9258
$$ plain form
13919 3716403 3785345 3818818 3870278 3906675 3921938 3899525 3830713 3803567 3836738 3854968 3893110
13908 3893110 3875325 3856440 3871939 3882156 3890978 3868153 3846417 3855363 3869201 3893955 3933708 3951452
13896 3951452 3958087 3955720 3993659 4014363 3967193 3948006 3984350 4032680 4077707 4114797 4093989 4091195
13884 4091195 4159124 4152580 4128421 4099246 4129873 4174484 4180067 4186173 4168603 4145570 4155592 4218289
13872 4218289 4279411 4281972 4278226 4314027 4338173 4312196 4316102 4324836 4308383 4319918 4372720 4395323
13860 4395323 4403624 4400629 4400049 4441445 4461478 4457126 4488632 4511687 4529620 4598009 4592107 4561747
13848 4561747 4529853 4559019 4541286 4544160 4559722 4588198 4596332 4599967 4639229 4690342 4696557 4716764
13836 4716764 4745964 4697605 4695978 4685500 4695851 4750702 4799824 4780956 4744274 4735526 4721667 4767025
$$ packed form
13919C716403O8942L3473N1460L6397J5263k2413o8812k7146L3171J8230L8142
13908C893110j7785j8885J5499J0217Q822k2825k1736Q946J3838K4754L9753J7744
13896C951452O635k367L7939K0704m7170j9187L6344M8330M5027L7090k0808k794
13884D091195O7929o544k4159k9175L0627M4611N583O106j7570k3033J0022O2697
13872D218289O1122K561l746L5801K4146k5977L906Q734j6453J1535N2802K2603
13860D395323Q301k995n80M1396K0033m352L1506K3055J7933O8389n902l0360
13848D561747l1894K9166j7733K874J5562K8476Q134L635L9262N1113O215K0207
13836D716764K9200m8359j627j0478J0351N4851M9122j8868l6682q748j3859M5358
$$ plain form
13824 4767025 4798141 4789741 4799039 4836571 4872252 4896036 4942526 4942436 4950360 4973045 4981653 5016465 5030781
13811 5030781 5012383 5029482 5043974 5072059 5105356 5175963 5191913 5149490 5124555 5124726 5136233 5182995
13799 5182995 5157159 5187308 5234566 5239534 5257626 5276492 5306410 5344601 5378836 5368163 5371544 5394140
13787 5394140 5416696 5462801 5446980 5460755 5470445 5483256 5549859 5570350 5590937 5631847 5635399 5614498
13775 5614498 5587603 5590907 5613584 5638689 5718215 5722643 5703877 5738397 5788676 5843424 5901312 5909986
13763 5909986 5930287 5946373 5990491 6036318 6047476 6059253 6068273 6105523 6162436 6213310 6235435
13752 6235435 6286164 6329948 6368942 6325173 6331068 6408582 6463829 6458051 6476352 6534494 6581089 6609874
13740 6609874 6638702 6690542 6710183 6720959 6761575 6833254 6865931 6860831 6822706 6834472 6934908
$$ packed form
13824D767025L1116q400R298L7532L5681K3784M6490r0P924K2685Q608L4812J4316
13811E030781j8398J7099J4492K8085L3297P0607J5950m2423k4935J71J1507M6762
13799E182995k5836L0149M7258M968J8092J8866K9918L8191L4235j0673L381K2596
13787E394140K2556M6105j5821J3775R690J2811O6603K0491K0587M0910L552k0901
13775E614498k6895L304K2677K5105P9526M428j8766L4520N0279N4748N7888Q674
13763E909986K0301J6086M4118M5827J1158J1777R020L7250N6913N0874K2125
13752F235435N0729M3784L8994m3769N895P7514N5247n778J8301N8142M6595K8785
13740F609874K8828N1840J9641J0776M0616P1679L2677n100l8125J1766J00436
$$ plain form
13729 6934908 7048877 7112314 7163850 7184684 7188168 7098230 6993476 6958267 6991966 6962204 6881455
13718 6881455 6654287 6188895 5857754 5869634 6011159 6154091 6295688 6424419 6530137 6572346
13708 6572346 6628078 6678164 6741933 6865021 6952928 6984579 7001441 7049950 7147980 7227134 7305810
13697 7305810 7384690 7437505 7507047 7562115 7553541 7525530 7533770 7617586 7715605 7779026 7800208 7796325
13685 7796325 7792127 7810080 7831327 7895549 7921420 7938256 7966564 7997085 8037978 8154148 8313915
13674 8313915 8402068 8443422 8490665 8542666 8559682 8584513 8673541 8757146 8876049 8969259 9039541
13663 9039541 9103773 9157948 9197307 9265659 9336700 9375146 9446350 9548552 9640812 9716672 9800878
13652 9800878 9831722 9864756 9940515 10005870 10068730 10149076 10244509 10334928 10438407 10542413 10687752
$$ packed form
13729F934908J13969O3437N1536K0834L484q9938j04754l5209L3699k9762q0749
13718F881455k27168m65392l31141J1880J41525J42932J41597J28731J05718M2209
13708F572346N5732N0086O3769J23088Q7907L1651J6862M8509R8030P9154P8676
13697G305810P8880N2815O9542N5068q574k8011Q240Q3816R8019O3421K1182l883
13685G796325m198J7953K1247O4222K5871J6836K8308L0521M0893J16170J59767
13674H313915Q8153M1354M7243N2001J7016K4831Q9028Q3605J18903R3210P0282
13663I039541O4232N4175L9359O8352P1041L8446P1204J02202R2260P5860Q4206
13652I800878L0844L3034P5759O5355O2860Q0346R5433R0419J03479J04006J45339
$$ plain form
13641 10687752 10775556 10860960 10936878 11006192 11087246 11188681 11267399 11386724 11474617 11547828 11656649
13630 11656649 11775882 11934031 12060021 12205068 12331789 12439659 12596893 12724615 12836527
13621 12836527 12966042 13104958 13261654 13434925 13566544 13716814 13855919 14034009 14193807
13612 14193807 14330954 14488405 14691870 14924600 15134001 15346378 15587639 15826700 16085954
13603 16085954 16337314 16607535 16935849 17260770 17544384 17872071 18189974 18545108 18962971
13594 18962971 19408331 19910288 20476346 21080666 21723506 22343646 22917346 23345088 23485039
13585 23485039 23258296 22685113 21950992 21238285 20425788 18973907 15976431 10847070 5350558
13576 5350558 2842829 3244963 4718076 6338205 7788169 9073071 10101317 11012061
$$ packed form
13641A0687752Q7804Q5404P5918O9314Q1054J01435P8718J19325Q7893P3211J08821
13630A1656649J19233J58149J25990J45047J26721J07870J57234J27722J11912
13621A2836527J29515J38916J56696J73271J31619J50270J39105J78090J59798
13612A4193807J37147J57451K03465K32730K09401K12377K41261K39061K59254
13603A6085954K51360K70221L28314L24921K83614L27687L17903L55134M17863
13594A8962971M45360N01957N66058O04320O42840O20140N73700M27742J39951
13585B3485039k26743n73183p34121p12707q12497j451881k997476n129361n496512
13576E350558k507729M02134J473113J620129J449964J284902J028246R10744
$$ plain form
13568 11012061 11831108 12577905 13269825 13994065 14700838 15409521 16081162 16721356 17351233
13559 17351233 18016082 18731361 19478296 20207158 20949747 21692705 22488580 23316523 24257383
13550 24257383 25297644 26394260 27649621 29003753 30579441 32293050 34039673 35661847
13542 35661847 36783101 37053055 36105542 33953936 31151292 28514875 25936501 21935729
13534 21935729 13870789 -1341768 -21621694 -33326527 -32709070 -27881003 -22860111 -18522080
13526 -18522080 -15000467 -12168550 -9810071 -7856422 -6178565 -4666121 -3148030 -1664552
13518 -1664552 -339126 864601 2031070 3173749 4289681 5382916 6431060 7449311
13510 7449311 8493198 9483241 10465510 11458187 12560813 13714839 14982076 16314871 17812416
$$ packed form
13568A1012061Q19047P46797O91920P24240P06773P08683O71641O40194O29877
13559A7351233O64849P15279P46935P28862P42589P42958P95875Q27943R40860
13550B4257383J040261J096616J255361J354132J575688J713609J746623J622174
13542C5661847J121254K69954r47513k151606k802644k636417k578374m000772
13534B1935729q064940j5212557k0279926j1704833O17457M828067N020892M338031
13526a8522080L521613K831917K358479J953649J677857J512444J518091J483478
13518a664552J325426J203727J166469J142679J115932J093235J048144J018251
13510G449311J043887R90043R82269R92677J102626J154026J267237J332795J497545
$$ plain form
13501 17812416 19481511 21244020 23013285 24663133 25961083 26427049 25696479 23709355
13493 23709355 20886541 18066471 15498924 11864257 4692895 -9297129 -29887380 -44544201
13485 -44544201 -45571701 -40825185 -35539675 -30912826 -27163065 -24120696 -21704439 -19760873
13477 -19760873 -18118914 -16585212 -15117610 -13810983 -12543690 -11409011 -10413630 -9531751
13469 -9531751 -8676768 -7848619 -7109043 -6403956 -5711760 -5112659 -4639290 -4149135 -3454508
13460 -3454508 -2613558 -1806348 -1009272 -223943 597652 1389962 2192772 2918034 3489372
13451 3489372 3903334 3923131 3510388 2801024 2028969 1278640 202464 -1908669 -6020061
13442 -6020061 -12106507 -16882944 -17847140 -16598158 -14853116 -13226031 -11844689 -10683234
$$ packed form
13501A7812416J669095J762509J769265J649848J297950M65966p30570j987124
13493B3709355k822814k820070k567547l634667p171362j3990024k0590251j4656821
13485d4544201j027500M746516N285510M626849L749761L042369K416257J943566
13477a9760873J641959J533702J467602J306627J267293J134679R95381Q81879
13469i531751Q54983Q28149P39576P05087O92196N99101M73369M90155O94627
13460c454508Q40950Q07210P97076P85329Q21595P92310Q02810P25262N71338
13451C489372M13962J9797m12743p09364p72055p50329j076176k111133m111392
13442f020061o086446m776437r64196J248982J745042J627085J381342J161455
$$ plain form
13434 -10683234 -9741334 -8951784 -8271581 -7632467 -7026965 -6522717 -6026635 -5548482 -5063693
13425 -5063693 -4608999 -4201020 -3815772 -3472783 -3140366 -2811788 -2519185 -2264237 -2074852
13416 -2074852 -1809571 -1524837 -1255339 -1026399 -725505 -503969 -312243 -63677 184518
13407 184518 402612 640452 848893 1004540 1167332 1387831 1611118 1822044 1975069 2076974
13397 2076974 2224623 2415818 2583367 2741559 2910955 3099168 3332138 3482784 3663977
13388 3663977 3830966 4017914 4221536 4416682 4588806 4747543 4957959 5143084 5372401
13379 5372401 5595182 5801913 5981314 6161914 6364430 6603968 6806057 6995633 7209556
13370 7209556 7441078 7624356 7846610 8094497 8302035 8484960 8703825 8923495 9119790
$$ packed form
13434a0683234R41900P89550O80203O39114O05502N04248M96082M78153M84789
13425e063693M54694M07979L85248L42989L32417L28578K92603K54948J89385
13416b074852K65281K84734K69498K28940L00894K21536J91726K48566K48195
13407A84518K18094K37840K08441J55647J62792K20499K23287K10926J53025J01905
13397B076974J47649J91195J67549J58192J69396J88213K32970J50646J81193
13388C663977J66989J86948K03622J95146J72124J58737K10416J85125K29317
13379E372401K22781K06731J79401J80600K02516K39538K02089J89576K13923
13370G209556K31522J83278K22254K47887K07538J82925K18865K19670J96295
$$ plain form
13361 9119790 9342047 9540641 9778259 10017584 10256042 10485507 10717912 10983537 11249981
13352 11249981 11553163 11864127 12183205 12483619 12805185 13129366 13459843 13821047 14173072
13343 14173072 14504255 14881802 15270140 15700156 16123315 16574413 16981477 17367407 17785696
13334 17785696 18225901 18649835 19084665 19544989 20099323 20630222 21196590 21756350 22294597
13325 22294597 22854961 23437628 24050366 24598221 25111848 25624983 26203833 26781404 27389244
13316 27389244 28040322 28704281 29357618 30009820 30785890 31594514 32408576 33287707 34131582
13307 34131582 34879197 35731573 36724101 37792292 38980112 40193644 41369982 42629408
13299 42629408 43983555 45446055 47091514 48955512 50919922 52931610 55057419 57412226
$$ packed form
13361I119790K22257J98594K37618K39325K38458K29465K32405K65625K66444
13352A1249981L03182L10964L19078L00414L21566L24181L30477L61204L52025
13343A4173072L31183L77547L88338M30016M23159M51098M07064L85930M18289
13334A7785696M40205M23934M34830M60324N54334N30899N66368N59760N38247
13325B2294597N60364N82667O12738N47855N13627N13135N78850N77571O07840
13316B7389244O51078O63959O53337O52202P76070Q08624Q14062Q79131Q43875
13307C4131582P47615Q52376R92528J068191J187820J213532J176338J259426
13299D2629408J354147J462500J645459J863998J964410K011688K125809K354807
$$ plain form
13291 57412226 60080956 63118015 66638077 70797078 75705387 81328449 87539068 94226920
13283 94226920 101336124 108144475 112712721 112494988 105764561 92887645 78707580 68521064
13275 68521064 59720431 42665127 231444 -90773215 -193272904 -219282657 -198247712
13268 -198247712 -172136370 -150120222 -133147718 -120259679 -109902374 -101103289 -93425659
13261 -93425659 -86847833 -81202470 -76288989 -72069504 -68280001 -64714552 -61445390 -58567610
13253 -58567610 -55946964 -53497780 -51287781 -49307199 -47569216 -46040404 -44629157 -43288526
13245 -43288526 -41990978 -40748773 -39594553 -38531117 -37610920 -36690993 -35768269 -34894079 -34018373
13236 -34018373 -33141356 -32381253 -31670444 -30991654 -30298834 -29583614 -28970218 -28439101 -27946999
$$ packed form
13291E7412226K668730L037059L520062M159001M908309N623062O210619O687852
13283I4226920P109204O808351M568246k17733o730427j2876916j4180065j0186516
13275F8521064q800633j7055304m2433683r1004659j02499689k6009753K1034945
13268a98247712K6111342K2016148J6972504J2888039J0357305Q799085P677630
13261i3425659O577826N645363M913481M219485L789503L565449L269162K877780
13253e8567610K620646K449184K209999J980582J737983J528812J411247J340631
13245d3288526J297548J242205J154220J063436R20197R19927R22724Q74190Q75706
13236c4018373Q77017P60103P10809O78790O92820P15220O13396N31117M92102
$$ plain form
13227 -27946999 -27464947 -26962143 -26455159 -25954706 -25538166 -25148335 -24700537 -24320378 -23994256
13218 -23994256 -23659111 -23317426 -22934766 -22609071 -22294818 -21965161 -21648859 -21317599 -21004436
13209 -21004436 -20711344 -20470654 -20232344 -19964925 -19693447 -19448911 -19211758 -18986966 -18772877
13200 -18772877 -18589937 -18374258 -18196014 -18012063 -17844466 -17679185 -17429400 -17203286 -17046428
13191 -17046428 -16897190 -16700546 -16454172 -16253127 -16086153 -15967694 -15791879 -15595036 -15453759
13182 -15453759 -15349124 -15264242 -15133180 -15008651 -14858073 -14731489 -14643264 -14541261 -14440069 -14262222
13172 -14262222 -14100788 -13949220 -13837410 -13712781 -13583030 -13455305 -13375070 -13283668 -13227554 -13175412
13162 -13175412 -13091554 -12994147 -12856854 -12686584 -12584184 -12510130 -12412163 -12323826 -12263423 -12165663
$$ packed form
13227b7946999M82052N02804N06984N00453M16540L89831M47798L80159L26122
13218b3994256L35145L41685L82660L25695L14253L29657L16302L31260L13163
13209b1004436K93092K40690K38310K67419K71478K44536K37153K24792K14089
13200a8772877J82940K15679J78244J83951J67597J65281K49785K26114J56858
13191a7046428J49238J96644K46374K01045J66974J18459J75815J96843J41277
13182a5453759J04635Q4882J31062J24529J50578J26584Q8225J02003J01192J77847
13172a4262222J61434J51568J11810J24629J29751J27725Q0235R1402N6114N2142
13162a3175412Q3858R7407J37293J70270J02400P4054R7967Q8337O0403R7760
$$ plain form
13152 -12165663 -12095270 -12004827 -11931750 -11913606 -11799043 -11726194 -11646676 -11568546 -11504703 -11433882 -11356956
13141 -11356956 -11296437 -11274747 -11226776 -11144371 -11066810 -11015853 -10994377 -10978990 -10896848 -10786504 -10711233
13130 -10711233 -10645785 -10604890 -10510678 -10409354 -10360173 -10320829 -10281118 -10214275 -10124088 -10051503 -9993101
13119 -9993101 -9922512 -9885675 -9800200 -9748389 -9709776 -9645555 -9604217 -9604631 -9577018 -9488216 -9391146 -9312058
13107 -9312058 -9261402 -9247376 -9238578 -9224679 -9279324 -9295711 -9275146 -9262819 -9183143 -9144326 -9108195
13096 -9108195 -9043516 -9041256 -9048840 -9009349 -8914621 -8904153 -8896515 -8927221 -8944693 -8896526 -8835523 -8848198
13084 -8848198 -8886656 -8881196 -8783566 -8535933 -8235274 -8029186 -7951620 -7886876 -7805119 -7750172 -7795115
13073 -7795115 -7758012 -7708410 -7693857 -7613519 -7573174 -7554620 -7509315 -7471171 -7453815 -7451410 -7450906 -7418654
$$ packed form
13152a2165663P0393R0443P3077J8144J14563P2849P9518P8130O3843P0821P6926
13141a1356956O0519K1690M7971Q2405P7561N0957K1476J5387Q2142J10344P5271
13130a0711233O5448M0895R4212J01324M9181L9344L9711O6843R0187P2585N8402
13119i993101P0589L6837Q5475N1811L8613O4221M1338m14K7613Q8802R7070P9088
13107i312058N0656J4026Q798J3899n4645j6387K0565J2327P9676L8817L6131
13096i108195O4679K260p584L9491R4728J0468P638l0706j7472M8167O1003j2675
13084h848198l8458N460R7630K47633L00659K06088P7566O4744Q1757N4947m4943
13073g795115L7103M9602J4553Q0338M0345J8554M5305L8144J7356K405N04L2252
$$ plain form
13061 -7418654 -7477722 -7548121 -7658454 -7674034 -7647543 -7598866 -7543791 -7472498 -7416629 -7353616 -7299776
13050 -7299776 -7289755 -7293889 -7270527 -7227413 -7130766 -7093839 -7072803 -7041646 -7004539 -6947229 -6918320
13039 -6918320 -6904408 -6833516 -6775280 -6805133 -6780691 -6714167 -6690495 -6710668 -6682552 -6633376 -6578961
13028 -6578961 -6481815 -6449249 -6467095 -6449167 -6413274 -6424662 -6436269 -6425909 -6413480 -6417502 -6420224 -6422357
13016 -6422357 -6426436 -6452849 -6604771 -6681941 -6645342 -6585656 -6479818 -6448917 -6441865 -6408590 -6353448
13005 -6353448 -6275950 -6262506 -6238356 -6219490 -6173701 -6191791 -6214384 -6140171 -6077115 -6034104 -6030787
12994 -6030787 -6031352 -6038617 -5986221 -5949291 -5924716 -5912614 -5904290 -5885665 -5830199 -5812646 -5850304 -5842452
12982 -5842452 -5792005 -5746858 -5697141 -5664906 -5657550 -5685803 -5654907 -5643332 -5620488 -5597896 -5572708
$$ packed form
13061g418654n9068p0399j10333j5580K6491M8677N5075P1293N5869O3013N3840
13050g299776J0021m134K3362M3114R6647L6927K1036L1157L7107N7310K8909
13039f918320J3912P0892N8236k9853K4442O6524K3672k0173K8116M9176N4415
13028f578961R7146L2566j7846J7928L5893j1388j1607J0360J2429m022k722k133
13016f422357m079k6413j51922p7170L6599N9686J05838L0901P052L3275N5142
13005f353448P7498J3444K4150J8866M5789j8090k2593P4213O3056M3011L317
12994f030787n65p265N2396L6930K4575J2102Q324J8625N5466J7553l7658P852
12982e842452N0447M5147M9717L2235P356k8253L0896J1575K2844K2592K5188
$$ plain form
12971 -5572708 -5486337 -5450895 -5469695 -5495028 -5493462 -5472564 -5465237 -5484179 -5469971 -5459202 -5385697 -5329356
12959 -5329356 -5356192 -5400807 -5403926 -5404050 -5387455 -5376618 -5393696 -5385399 -5330987 -5255084 -5220559 -5192628
12947 -5192628 -5251427 -5263982 -5228655 -5188870 -5169522 -5159346 -5180839 -5178655 -5139114 -5142126 -5135752 -5136869
12935 -5136869 -5100647 -5039448 -5016671 -4998268 -5003448 -4990922 -4968129 -4950735 -4943917 -4959272 -4966791 -4930968
12923 -4930968 -4873545 -4847496 -4821220 -4826293 -4852779 -4835411 -4774193 -4743033 -4745793 -4712249 -4672032 -4643408
12911 -4643408 -4646110 -4641741 -4626843 -4591618 -4585193 -4575102 -4602204 -4617203 -4639088 -4657009 -4664969 -4654834
12899 -4654834 -4599252 -4561241 -4530353 -4529873 -4539009 -4517646 -4487177 -4448768 -4401656 -4364459 -4375225 -4354601
12887 -4354601 -4356294 -4378104 -4350658 -4359481 -4343384 -4303011 -4337970 -4379187 -4401883 -4376987 -4341986 -4349183
$$ packed form
12971e572708Q6371L5442j8800k5333J566K0898P327j8942J4208J0769P3505N6341
12959e329356k6836m4615l119j24J6595J0837j7078Q297N4412P5903L4525K7931
12947e192628n8799j2555L5327L9785J9348J0176k1493K184L9541l012O374j117
12935e136869L6222O1199K2777J8403n180J2526K2793J7394O818j5355p519L5823
12923d930968N7423K6049K6276n073k6486J7368O1218L1160k760L3544M0217K8624
12911d643408k702M369J4898L5225O425J0091k7102j4999k1885j7921p960J0135
12899d654834N5582L8011L0888M80r136K1363L0469L8409M7112L7197j0766K0624
12887d354601j693k1810K7446q823J6097M0373l4959m1217k2696K4896L5001p197
$$ plain form
12875 -4349183 -4302937 -4271610 -4276467 -4228555 -4203039 -4221850 -4165410 -4136400 -4154730 -4181635 -4172557 -4150232
12863 -4150232 -4120700 -4081515 -4045962 -4088574 -4082905 -4054041 -4033015 -4031194 -4003838 -3944990 -3943067 -3967422
12851 -3967422 -3966237 -3914552 -3886072 -3886669 -3874932 -3839527 -3832937 -3828240 -3809440 -3749920 -3724418 -3717588
12839 -3717588 -3707003 -3660653 -3634473 -3594449 -3539686 -3484931 -3456380 -3434333 -3417475 -3393094 -3370464
12828 -3370464 -3340473 -3344422 -3400051 -3500745 -3570349 -3591033 -3637175 -3777901 -4128035 -4663862 -4978192
12817 -4978192 -4911713 -4748449 -4597596 -4475814 -4381427 -4317213 -4237499 -4200479 -4127812 -4094528 -4094086
12806 -4094086 -4062607 -3981595 -4000505 -4015779 -3991218 -4020802 -3997154 -3909646 -3850244 -3788983 -3764484
12795 -3764484 -3727337 -3680385 -3730755 -3780695 -3806139 -3816329 -3778815 -3759504 -3801308 -3897797 -4037301
$$ packed form
12875d349183M6246L1327m857M7912K5516j8811N6440K9010j8330k6905R078K2325
12863d150232K9532L9185L5553m2612N669K8864K1026J821K7356N8848J923k4355
12851c967422J185N1685K8480n97J1737L5405O590M697J8800N9520K5502O830
12839c717588J0585M6350K6180M0024N4763N4755K8551K2047J6858K4381K2630
12828c370464K9991l949n5629j00694o9604k0684m6142j40726l50134n35827l14330
12817d978192O6479J63264J50853J21782R4387O4214P9714L7020P2667L3284M42
12806d094086L1479Q1012j8910j5274K4561k9584K3648Q7508N9402O1261K4499
12795c764484L7147M6952n0370m9940k5444j0190L7514J9311m1804r6489j39504
$$ plain form
12784 -4037301 -4203934 -4261055 -4268069 -4226347 -4152632 -4105562 -4079110 -4051887 -4018347 -4027926 -3993206
12773 -3993206 -3942831 -3915897 -3877484 -3861890 -3816746 -3772491 -3756974 -3780846 -3793670 -3794175 -3823524 -3806365
12761 -3806365 -3760914 -3760119 -3758796 -3746065 -3709450 -3723904 -3733149 -3729899 -3681806 -3619192 -3612408 -3596775
12749 -3596775 -3555435 -3552151 -3528418 -3532061 -3545469 -3567109 -3556696 -3497804 -3504527 -3522391 -3526096 -3517425
12737 -3517425 -3522665 -3541719 -3539576 -3548629 -3557882 -3527187 -3479624 -3446995 -3447374 -3425793 -3426328 -3425969 -3481882
12724 -3481882 -3435718 -3414027 -3391598 -3362123 -3350976 -3368283 -3379758 -3382657 -3395210 -3381063 -3360991
12713 -3360991 -3330507 -3352143 -3397668 -3375834 -3338964 -3325748 -3338322 -3321222 -3268404 -3251109 -3262364
12702 -3262364 -3258350 -3248726 -3275903 -3294276 -3267768 -3264351 -3258533 -3260203 -3253397 -3218653 -3234050 -3265220
$$ packed form
12784d037301j66633n7121p014M1722P3715M7070K6452K7223L3540r579L4720
12773c993206N0375K6934L8413J5594M5144M4255J5517k3872j2824n05k9349J7159
12761c806365M5451P95J323J2731L6615j4454r245L250M8093O2614O784J5633
12749c596775M1340L284K3733l643j3408k1640J0413N8892o723j7864l705Q671
12737c517425n240j9054K143r053r253L0695M7563L2629l79K1581n35L59n5913
12724c481882M6164K1691K2429K9475J1147j7307j1475k899j2553J4147K0072
12713c360991L0484k1636m5525K1834L6870J3216j2574J7100N2818J7295j1255
12702c262364M014R624k7177j8373K6508L417N818j670O806L4744j5397l1170
$$ plain form
12690 -3265220 -3247713 -3209076 -3157214 -3168329 -3188671 -3205338 -3211302 -3171760 -3168798 -3160011 -3175832 -3187283
12678 -3187283 -3195865 -3188553 -3160664 -3125202 -3131110 -3156602 -3129830 -3144844 -3135975 -3128971 -3116670 -3096359
12666 -3096359 -3060572 -3094460 -3114909 -3109330 -3077274 -3066277 -3078091 -3072507 -3073955 -3061808 -3044136 -2994435
12654 -2994435 -2969369 -3032688 -3035815 -3004156 -2985403 -2985726 -3004797 -3016066 -2996193 -2954273 -2916150 -2902109
12642 -2902109 -2889491 -2884541 -2912679 -2956230 -2956650 -2954186 -2940863 -2952578 -2942454 -2918233 -2921414 -2931079
12630 -2931079 -2937062 -2939335 -2917735 -2845542 -2838688 -2885011 -2866091 -2817416 -2812985 -2849001 -2851033 -2831634
12618 -2831634 -2824319 -2828366 -2857180 -2852939 -2837373 -2849131 -2832235 -2797577 -2821246 -2803636 -2785120 -2803357
12606 -2803357 -2800707 -2781089 -2828408 -2841366 -2844216 -2866015 -2835702 -2839033 -2849980 -2780921 -2781286 -2827875
$$ packed form
12690c265220J7507L8637N1862j1115k0342j6667n964L9542K962Q787j5821j1451
12678c187283q582P312K7889L5462n908k5492K6772j5014Q869P004J2301K0311
12666c096359L5787l3888k0449N579L2056J0997j1814N584j448J2147J7672M9701
12654b994435K5066o3319l127L1659J8753l23j9071j1269J9873M1920L8123J4041
12642b902109J2618M950k8138m3551m20K464J3323j1715J0124K4221l181r665
12630b931079n983k273K1600P2193O854m6323J8920M8675M431l6016k032J9399
12618b831634P315m047k8814M241J5566j1758J6896L4658k3669J7610J8516j8237
12606b803357K650J9618m7319j2958k850k1799L0313l331j0947O9059l65m6589
$$ plain form
12594 -2827875 -2787763 -2777741 -2775025 -2795156 -2792925 -2785875 -2755393 -2724445 -2717498 -2687506 -2685069 -2708579
12582 -2708579 -2722198 -2751416 -2736112 -2690449 -2667542 -2664830 -2678493 -2679044 -2693674 -2746815 -2719631 -2695607
12570 -2695607 -2687958 -2645038 -2629591 -2620301 -2627552 -2656690 -2688863 -2688776 -2657801 -2635853 -2577478 -2580536 -2627448
12557 -2627448 -2638047 -2652353 -2633369 -2604489 -2606800 -2608586 -2633396 -2620977 -2592432 -2577993 -2626838 -2614719
12545 -2614719 -2576533 -2576442 -2568354 -2570359 -2582335 -2600619 -2625138 -2632155 -2616850 -2560332 -2541264 -2561428
12533 -2561428 -2545338 -2537551 -2542311 -2549347 -2575280 -2545027 -2570148 -2563083 -2537641 -2547516 -2516665 -2496993
12521 -2496993 -2493751 -2488594 -2496419 -2488511 -2483367 -2455563 -2483815 -2466636 -2446927 -2429142 -2418154 -2399547
12509 -2399547 -2424868 -2412417 -2413707 -2412778 -2416699 -2428055 -2413996 -2413212 -2436759 -2401081 -2407919 -2457718 -2458773
$$ packed form
12594b827875M0112J0022K716k0131K231P050L0482L0948O947K9992K437k3510
12582b708579j3619k9218J5304M5663K2907K712j3663n51j4630n3141K7184K4024
12570b695607P649M2920J5447R290p251k9138l2173Q7L0975K1948N8375l058m6912
12557b627448j0599j4306J8984K8880k311j786k4810J2419K8545J4439m8845J2119
12545b614719L8186R1Q088k005j1976j8284k4519p017J5305N6518J9068k0164
12533b561428J6090P787m760p036k5933L0253k5121P065K5442r875L0851J9672
12521b496993L242N157p825P908N144K7804k8252J7179J9709J7785J0988J8607
12509b399547k5321J2451j290R29l921j1356J4059P84k3547L5678o838m9799j055
$$ plain form
12496 -2458773 -2405839 -2365779 -2340615 -2334218 -2391117 -2398813 -2350451 -2345930 -2367698 -2362097 -2335371 -2305044
12484 -2305044 -2324317 -2378158 -2387325 -2378630 -2362159 -2350713 -2370310 -2359805 -2324082 -2345061 -2389996 -2363221
12472 -2363221 -2322732 -2331678 -2388568 -2338783 -2302499 -2298257 -2320709 -2325875 -2315907 -2340309 -2375639 -2326127
12460 -2326127 -2250276 -2213733 -2213941 -2215942 -2256897 -2290799 -2255757 -2216399 -2256455 -2306348 -2307221 -2287955
12448 -2287955 -2268205 -2315244 -2339042 -2283901 -2282758 -2307723 -2318501 -2301865 -2274386 -2215656 -2252191
12437 -2252191 -2269436 -2268939 -2262839 -2236341 -2237437 -2246751 -2238767 -2240269 -2247481 -2248753 -2264547 -2268364 -2237618
12424 -2237618 -2236079 -2246055 -2252885 -2235449 -2196164 -2144579 -2155195 -2176067 -2189904 -2234766 -2233429 -2196009
12412 -2196009 -2177782 -2178258 -2172464 -2180548 -2181150 -2166516 -2183747 -2180090 -2156730 -2179171 -2156313 -2126650 -2136240
$$ packed form
12496b458773N2934M0060K5164O397n6899p696M8362M521k1768N601K6726L0327
12484b305044j9273n3841r167Q695J6471J1446j9597J0505L5723k0979m4935K6775
12472b363221M0489q946n6890M9785L6284M242k2452n166R968k4402l5330M9512
12460b326127P5851L6543k08k001m0955l3902L5042L9358m0056m9893q73J9266
12448b287955J9750m7039k3798N5141J143k4965j0778J6636K7479N8730l6535
12437b252191j7245M97O100K6498j096r314P984j502p212j272j5794l817L0746
12424b237618J539r976o830J7436L9285N1585j0616k0872j3837m4862J337L7420
12412b196009J8227m76N794q084o02J4634j7231L657K3360k2441K2858K9663r590
$$ plain form
12399 -2136240 -2161020 -2148119 -2128892 -2141323 -2151463 -2124741 -2128586 -2096863 -2056841 -2066381 -2096811 -2130747
12387 -2130747 -2161879 -2169577 -2174776 -2146316 -2152390 -2178658 -2173784 -2115895 -2090671 -2104384 -2108944 -2058892
12375 -2058892 -2052356 -2062742 -2105645 -2088635 -2080909 -2052796 -2004254 -1998279 -2045762 -2061653 -2065162 -2063874
12363 -2063874 -2097620 -2114950 -2079423 -2034872 -2004090 -2027454 -2050009 -2068038 -2046222 -2007478 -1982030
12352 -1982030 -1992297 -2014689 -2014100 -2042469 -2038140 -2027208 -2028661 -2003810 -2041621 -2076710 -2095401 -2058456
12340 -2058456 -2048422 -2059133 -2034223 -1957982 -1958298 -1993148 -2024138 -2034777 -2024651 -2024334 -1992642 -1925117
12328 -1925117 -1900522 -1935895 -1949948 -1972783 -1988951 -1983586 -1968803 -1964176 -1989757 -2019741 -1997967 -1993836
12316 -1993836 -1956578 -1937801 -1929566 -1934886 -1966095 -1932654 -1943355 -1972613 -1949365 -1944028 -1952417 -1987507
$$ packed form
12399b136240k4780J2901J9227j2431j0140K6722l845L1723M0022r540l0430l3936
12387b130747l1132p698n199K8460o074k6268M874N7889K5224j3713m560N0052
12375b058892O536j0386m2903J7010P726K8113M8542N975m7483j5891l509J288
12363b063874l3746j7330L5527M4551L0782k3364k2555j8029K1816L8744K5448
12352a982030j0267k2392N89k8369M329J0932j453K4851l7811l5089j8691L6945
12340b058456J0034j0711K4910P6241l16l4850l0990j0639J0126L17L1692O7525
12328a925117K4595l5373j4053k2835j6168N365J4783M627k5581k9984K1774M131
12316a993836L7258J8777Q235n320l1209L3441j0701k9258K3248N337q389l5090
$$ plain form
12304 -1987507 -1957857 -1978324 -1943368 -1931327 -1908519 -1865219 -1847112 -1837863 -1837680 -1827020 -1817111 -1830144
12292 -1830144 -1873715 -1881784 -1887981 -1931030 -1922528 -1882262 -1894808 -1918383 -1925606 -1871371 -1885805 -1917592
12280 -1917592 -1924485 -1887301 -1855692 -1850117 -1826208 -1866143 -1872232 -1826487 -1783381 -1835825 -1860087 -1826614
12268 -1826614 -1809912 -1809595 -1820465 -1755059 -1721674 -1771783 -1775013 -1766839 -1763524 -1789440 -1830403 -1839515
12256 -1839515 -1825754 -1863489 -1873149 -1871835 -1847132 -1851818 -1874177 -1876369 -1852972 -1791406 -1770725 -1803282
12244 -1803282 -1799253 -1784762 -1831063 -1870873 -1860824 -1858498 -1852067 -1840154 -1830982 -1807666 -1806866 -1823998
12232 -1823998 -1847294 -1828718 -1833646 -1820773 -1780722 -1759759 -1775640 -1790477 -1721154 -1671047 -1663248 -1696711
12220 -1696711 -1740296 -1788443 -1766610 -1742162 -1752713 -1763970 -1755556 -1724467 -1717948 -1730741 -1730570 -1743910
$$ packed form
12304a987507K9650k0467L4956J2041K2808M3300J8107R249J83J0660R909j3033
12292a830144m3571q069o197m3049Q502M0266j2546k3575p223N4235j4434l1787
12280a917592o893L7184L1609N575K3909l9935o089M5745M3106n2444k4262L3473
12268a826614J6702L17j0870O5406L3385n0109l230Q174L315k5916m0963r112
12256a839515J3761l7735r660J314K4703m686k2359k192K3397O1566K0681l2557
12244a803282M029J4491m6301l9810J0049K326O431J1913R172K3316Q00j7132
12232a823998k3296J8576m928J2873M0051K0963j5881j4837O9323N0107P799l3463
12220a696711m3585m8147K1833K4448j0551j1257Q414L1089O519j2793J71j3340
$$ plain form
12208 -1743910 -1732012 -1693774 -1703851 -1744279 -1729821 -1729315 -1743378 -1747503 -1700661 -1651689 -1649237 -1658381
12196 -1658381 -1684457 -1701067 -1728588 -1765698 -1775857 -1752037 -1765774 -1758489 -1748595 -1754573 -1721473 -1675378
12184 -1675378 -1659327 -1678609 -1705525 -1738627 -1742110 -1721664 -1683899 -1675947 -1720015 -1741405 -1718815 -1723268
12172 -1723268 -1699484 -1745177 -1807616 -1776114 -1722970 -1671668 -1669011 -1711829 -1711887 -1698084 -1702571 -1726182
12160 -1726182 -1690791 -1653811 -1681365 -1678219 -1662976 -1661593 -1666264 -1676074 -1644242 -1620037 -1616177 -1649665
12148 -1649665 -1652633 -1612356 -1586700 -1590114 -1593032 -1565690 -1551505 -1614783 -1665330 -1683582 -1669820 -1650366
12136 -1650366 -1651880 -1617283 -1575350 -1577097 -1572995 -1572306 -1561138 -1550858 -1566706 -1561838 -1567450 -1555416 -1536670
12123 -1536670 -1524958 -1526931 -1557775 -1591500 -1588879 -1584987 -1568912 -1576634 -1609217 -1616367 -1599509 -1578021
$$ packed form
12208a743910J1898L8238j0077m0428J4458N06j4063m125M6842M8972K452r144
12196a658381k6076j6610k7521l7110j0159K3820j3737P285R894n978L3100M6095
12184a675378J6051j9282k6916l3102l483K0446L7765P952m4068k1390K2590m453
12172a723268K3784m5693o2439L1502N3144N1302K657m2818n8J3803m487k3611
12160a726182L5391L6980k7554L146J5243J383m671r810L1832K4205L860l3488
12148a649665k968M0277K5656l414k918K7342J4185o3278n0547j8252J3762J9454
12136a650366j514L4597M1933j747M102O89J1168J0280j5848M868n612J2034J8746
12123a536670J1712j973l0844l3725K621L892J6075p722l2583p150J6858K1488
$$ plain form
12111 -1578021 -1590861 -1575832 -1569347 -1600489 -1628335 -1608504 -1612066 -1607107 -1597561 -1581871 -1596433 -1576209
12099 -1576209 -1553965 -1597790 -1585097 -1545437 -1513422 -1531144 -1607963 -1665654 -1615298 -1559012 -1550145
12088 -1550145 -1541234 -1553079 -1552450 -1545166 -1546564 -1586879 -1553991 -1499512 -1516130 -1549530 -1583374 -1611575
12076 -1611575 -1564305 -1563605 -1546134 -1514493 -1469515 -1444550 -1430338 -1474905 -1523451 -1536826 -1542233 -1521109
12064 -1521109 -1551174 -1580409 -1629413 -1587787 -1533074 -1503766 -1481006 -1525082 -1531177 -1484163 -1470691
12053 -1470691 -1463201 -1456158 -1465958 -1466962 -1501565 -1520037 -1512673 -1512289 -1541573 -1568052 -1555665 -1521852 -1521584
12040 -1521584 -1533784 -1525739 -1475071 -1452110 -1472462 -1494715 -1458051 -1449585 -1495641 -1519833 -1530670 -1512409
12028 -1512409 -1513929 -1471345 -1470258 -1503734 -1501980 -1463886 -1466809 -1455285 -1453367 -1450337 -1504667 -1494136
$$ packed form
12111a578021j2840J5029O485l1142k7846J9831l562M959R546J5690j4562K0224
12099a576209K2244m3825J2693L9660L2015j7722p6819n7691N0356N6286Q867
12088a550145Q911j1845O29P284j398m0315L2888N4479j6618l3400l3844k8201
12076a611575M7270P00J7471L1641M4978K4965J4212m4567m8546j3375n407K1124
12064a521109l0065k9235m9004M1626N4713K9308K2760m4076o095M7014J3472
12053a470691P490P043r800j004l4603j8472P364L84k9284k6479J2387L3813K68
12040a521584j2200Q045N0668K2961k0352k2253L6664Q466m6056k4192j0837J8261
12028a512409j520M2584J087l3476J754L8094k923J1524J918L030n4330J0531
$$ plain form
12016 -1494136 -1457686 -1413423 -1408283 -1415558 -1423063 -1395911 -1394418 -1376276 -1372309 -1387152 -1419636 -1440871
12004 -1440871 -1418116 -1392878 -1435352 -1400540 -1389903 -1452046 -1442671 -1429565 -1390925 -1373620 -1360052
11993 -1360052 -1340149 -1339115 -1380186 -1425741 -1427334 -1384815 -1388133 -1398920 -1363702 -1375798 -1409023 -1408760
11981 -1408760 -1379458 -1367476 -1371281 -1372729 -1372490 -1337544 -1337170 -1379272 -1327621 -1313940 -1341929 -1330130
11969 -1330130 -1328870 -1354590 -1374944 -1393949 -1379914 -1383591 -1340497 -1352711 -1337290 -1298613 -1302498 -1356178
11957 -1356178 -1365532 -1361470 -1383625 -1383325 -1400917 -1411845 -1417198 -1400975 -1354758 -1312979 -1288798 -1271911
11945 -1271911 -1322184 -1314651 -1327373 -1335575 -1392580 -1345230 -1329257 -1372474 -1377984 -1420244 -1452679 -1385959
11933 -1385959 -1383272 -1380700 -1352991 -1311624 -1279602 -1301745 -1314638 -1355854 -1358146 -1321958 -1299188 -1258744
$$ packed form
12016a494136L6450M4263N140p275p505K7152J493J8142L967j4843l2484k1235
12004a440871K2755K5238m2474L4812J0637o2143R375J3106L8640J7305J3568
11993a360052J9903J034m1071m5555j593M2519l318j0787L5218j2096l3225K63
11981a408760K9302J1982l805j448K39L4946L74m2102N1651J3681k7989J1799
11969a330130J260k5720k0354j9005J4035l677M3094j2214J5421L8677l885n3680
11957a356178r354M062k2155L00j7592j0928n353J6223M6217M1779K4181J6887
11945a271911n0273P533j2722q202n7005M7350J5973m3217n510m2260l2435O6720
11933a385959K687K572K7709M1367L2022k2143j2893m1216k292L6188K2770M0444
$$ plain form
11921 -1258744 -1293722 -1330029 -1361536 -1388183 -1367153 -1339838 -1290296 -1299202 -1341907 -1343527 -1364512 -1338543
11909 -1338543 -1272573 -1275981 -1302588 -1335182 -1316993 -1317193 -1269018 -1270928 -1269949 -1299766 -1326559 -1308512
11897 -1308512 -1289176 -1261302 -1266502 -1267640 -1304318 -1313622 -1337992 -1344785 -1264649 -1256414 -1272701 -1303340
11885 -1303340 -1315584 -1338982 -1336499 -1286713 -1278294 -1250532 -1249071 -1235398 -1277963 -1289682 -1266869 -1246877
11873 -1246877 -1256485 -1284461 -1298206 -1316962 -1327807 -1311930 -1287253 -1306120 -1289281 -1267824 -1204822
11862 -1204822 -1200391 -1214015 -1223963 -1269790 -1255423 -1242380 -1251843 -1278215 -1256681 -1218925 -1228318 -1260545
11850 -1260545 -1272092 -1274937 -1314329 -1325597 -1263162 -1235468 -1247740 -1293512 -1261220 -1234117 -1253112
11839 -1253112 -1277385 -1283611 -1247226 -1222456 -1158361 -1139870 -1156737 -1184763 -1203271 -1173805 -1148825
$$ packed form
11921a258744l4978l6307l1507k6647K1030K7315M9542q906m2705j620k0985K5969
11909a338543O5970l408k6607l2594J8189k00M8175j910R79k9817k6793J8047
11897a308512J9336K7874n200j138l6678r304k4370o793Q0136Q235j6287l0639
11885a303340j2244k3398K483M9786Q419K7762J461J3673m2565j1719K2813J9992
11873a246877r608k7976j3745j8756j0845J5877K4677j8867J6839K1457O3002
11862a204822M431j3624r948m5827J4367J3043r463k6372K1534L7756r393l2227
11850a260545j1547k845l9392j1268O2435K7694j2272m5772L2292K7103j8995
11839a253112k4273o226L6385K4770O4095J8491j6867k8026j8508K9466K4980
$$ plain form
11828 -1148825 -1141174 -1126118 -1169609 -1201494 -1215988 -1214576 -1197809 -1221402 -1250232 -1266906 -1249031 -1243538
11816 -1243538 -1227701 -1199747 -1154991 -1130113 -1151798 -1170519 -1178113 -1181289 -1194060 -1190372 -1221791 -1222638
11804 -1222638 -1184700 -1218985 -1205725 -1207211 -1187480 -1172844 -1141908 -1159396 -1178928 -1172807 -1182455 -1138417
11792 -1138417 -1127341 -1147103 -1129210 -1183141 -1209675 -1187970 -1163388 -1142869 -1123970 -1150894 -1172339
11781 -1172339 -1182998 -1200763 -1212770 -1173631 -1181584 -1197504 -1153825 -1159820 -1162624 -1108004 -1126514 -1177300
11769 -1177300 -1226028 -1228188 -1227739 -1219078 -1185955 -1187895 -1194692 -1197939 -1165506 -1179327 -1179229 -1176734 -1173311 -1192228
11755 -1192228 -1181688 -1162292 -1139009 -1123232 -1118631 -1147857 -1178018 -1177700 -1164221 -1134223 -1157308 -1145421
11743 -1145421 -1090611 -1058527 -1066436 -1099356 -1102696 -1072583 -1081623 -1123330 -1122385 -1118741 -1131177 -1157003
$$ packed form
11828a148825P651J5056m3491l1885j4494J412J6767k3593k8830j6674J7875N493
11816a243538J5837K7954M4756K4878k1685j8721p594l176j2771L688l1419q47
11804a222638L7938l4285J3260j486J9731J4636L0936j7488j9532O121r648M4038
11792a138417J1076j9762J7893n3931k6534K1705K4582K0519J8899k6924k1445
11781a172339j0659j7765j2007L9139p953j5920M3679n995k804N4620j8510n0786
11769a177300m8728k160M49Q661L3123j940o797l247L2433j3821R8K495L423j8917
11755a192228J0540J9396K3283J5777M601k9226l0161L18J3479K9998k3085J1887
11743a145421N4810L2084p909l2920l340L0113r040m1707R45L644j2436k5826
$$ plain form
11731 -1157003 -1165775 -1147737 -1183354 -1161961 -1146328 -1146300 -1101396 -1088215 -1117516 -1123438 -1122711 -1187448 -1214573
11718 -1214573 -1162986 -1124845 -1086967 -1054860 -1052761 -1063124 -1080764 -1112235 -1101028 -1086922 -1140524
11707 -1140524 -1161235 -1143345 -1139351 -1096065 -1063565 -1082436 -1107683 -1093476 -1079651 -1053309 -1035638
11696 -1035638 -1003213 -991780 -998359 -987818 -1035018 -1084841 -1089856 -1124550 -1139729 -1111206 -1107960 -1096806
11684 -1096806 -1071040 -1092282 -1089150 -1035808 -1062636 -1083207 -1083140 -1056928 -1060661 -1083821 -1123140 -1132911
11672 -1132911 -1122094 -1064536 -1068908 -1060293 -1073577 -1051711 -1051986 -1124366 -1161754 -1132007 -1075261 -1050287
11660 -1050287 -1055669 -1070819 -1060984 -1037120 -1018512 -1021756 -1027171 -1012512 -1010508 -1044275 -1082488 -1101892
11648 -1101892 -1095164 -1056799 -1068752 -1061038 -1019669 -1002166 -1044468 -1047701 -1036206 -1032446 -1045617 -1078945
$$ packed form
11731a157003q772J8038l5617K1393J5633K8M4904J3181k9301n922P27o4737k7125
11718a214573N1587L8141L7878L2107K099j0363j7640l1471J1207J4106n3602
11707a140524k0711J7890L994M3286L2500j8871k5247J4207J3825K6342J7671
11696a035638L2425J1433o579J0541m7200m9823n015l4694j5179K8523L246J1154
11684a096806K5766k1242L132N3342k6828k0571O7K6212l733k3160l9319r771
11672a132911J0817N7558m372Q615j3284K1866k75p2380l7388K9747N6746K4974
11660a050287n382j5150R835K3864J8608l244n415J4659K004l3767l8213j9404
11648a101892O728L8365j1953P714M1369J7503m2302l233J1495L760j3171l3328
$$ plain form
11636 -1078945 -1076698 -1032860 -1009247 -997234 -1002960 -994692 -989948 -975889 -980349 -982582 -974820 -967520 -991823
11623 -991823 -1004472 -1019287 -1077874 -1091340 -1068235 -1058047 -1044982 -1036502 -1018106 -978599 -964602 -966704
11611 -966704 -1016712 -1051380 -1051300 -1032537 -999456 -995082 -1023500 -963991 -936524 -978309 -1000306 -987672
11599 -987672 -964514 -982371 -986209 -976354 -985644 -1013832 -1017600 -1036322 -1016619 -1018988 -996171 -974977
11587 -974977 -974621 -997152 -993357 -1004616 -982929 -935450 -912289 -938894 -940433 -980975 -972306 -972898 -996148
11574 -996148 -995958 -974798 -929714 -893229 -957785 -975724 -964278 -994685 -972593 -948165 -951234 -940063
11562 -940063 -942928 -987197 -1004182 -1006683 -1028064 -1021662 -1034428 -1018238 -967710 -940590 -957822 -957781 -925181
11549 -925181 -923769 -964007 -970246 -918583 -886962 -903345 -932205 -944620 -968691 -971040 -960006 -991833
$$ packed form
11636a078945K247M3838K3613J2013n726Q268M744J4059m460k233P762P300k4303
11623i91823j2649j4815n8587j3466K3105J0188J3065Q480J8396L9507J3997k102
11611i66704n0008l4668Q0J8763L3081M374k8418N9509K7467m1785k1997J2634
11599i87672K3158j7857l838R855r290k8188l768j8722J9703k369K2817K1194
11587i74977L56k2531L795j1259K1687M7479K3161k6605j539m0542Q669n92k3250
11574i96148J90K1160M5084L6485o4556j7939J1446l0407K2092K4428l069J1171
11562i40063k865m4269j6985k501k1381O402j2766J6190N0528K7120j7232M1L2600
11549i25181J412m0238o239N1663L1621j6383k8860j2415k4071k349J1034l1827
$$ plain form
11537 -991833 -1010468 -993910 -986115 -995435 -962879 -956402 -955364 -940166 -950133 -1032604 -1003172 -981823
11525 -981823 -948875 -912510 -928674 -964254 -948324 -965942 -954509 -920695 -896924 -885874 -890267 -879003
11513 -879003 -914403 -934535 -949573 -933144 -918183 -912321 -906839 -941959 -925869 -905245 -889891 -881707
11501 -881707 -877056 -879072 -917379 -915853 -868932 -856759 -899450 -913872 -894463 -886755 -892391 -847046
11489 -847046 -866729 -897291 -908606 -895753 -895096 -914071 -887445 -863978 -842405 -858183 -857610 -902202
11477 -902202 -908136 -885889 -893251 -895680 -892396 -906198 -931676 -914310 -868897 -897766 -921754 -908319
11465 -908319 -890599 -930484 -927865 -943890 -927551 -899353 -861085 -867888 -880897 -876620 -910549 -902368
11453 -902368 -876376 -910434 -919038 -864672 -799790 -820639 -825980 -825508 -847390 -860793 -820969 -836439
$$ packed form
11537i91833j8635J6558P795r320L2556O477J038J5198r967q2471K9432K1349
11525i81823L2948L6365j6164l5580J5930j7618J1433L3814K3771J1050m393J1264
11513h79003l5400k0132j5038J6429J4961N862N482l5120J6090K0624J5354Q184
11501h81707M651k016l8307J526M6921J2173m2691j4422J9409P708n636M5345
11489h47046j9683l0562j1315J2853O57j8975K6626K3467K1573j5778N73m4592
11477i02202n934K2247p362k429L284j3802k5478J7366M5413k8869k3988J3435
11465i08319J7720l9885K619j6025J6339K8198L8268o803j3009M277l3929Q181
11453i02368K5992l4058q604N4366O4882k0849n341M72k1882j3403L9824j5470
$$ plain form
11441 -836439 -858086 -863124 -830659 -829655 -861347 -865473 -836296 -813259 -828873 -873522 -881772 -889039
11429 -889039 -914612 -866551 -852967 -872391 -882115 -865313 -884765 -916805 -910577 -930140 -907438 -908547
11417 -908547 -922267 -864873 -846758 -852942 -837396 -853053 -845877 -855408 -862260 -898705 -880062 -885021
11405 -885021 -860809 -817676 -809384 -808081 -830655 -894596 -852724 -838035 -884763 -905904 -907885 -912723
11393 -912723 -912151 -870527 -832062 -846176 -883954 -851796 -804629 -811788 -812448 -808667 -800858 -794327 -844094
11380 -844094 -897981 -859892 -830232 -856943 -868348 -821756 -828120 -828318 -822280 -805195 -829189 -827155
11368 -827155 -848444 -878429 -844109 -819406 -795452 -794444 -779271 -788712 -758690 -744378 -777875 -769042
11356 -769042 -733391 -721407 -762291 -785402 -780760 -788654 -829780 -801797 -765261 -797426 -785772 -770303
$$ packed form
11441h36439k1647n038L2465J004l1692m126K9177K3037j5614m4649q250p267
11429h89039k5573M8061J3584j9424r724J6802j9452l2040O228j9563K2702j109
11417i08547j3720N7394J8115o184J5546j5657P176r531o852l6445J8643m959
11405h85021K4212M3133Q292J303k2574o3941M1872J4689m6728k1141j981m838
11393i12723N72M1624L8465j4114l7778L2158M7167p159o60L781P809O531m9767
11380h44094n3887L8089K9660k6711j1405M6592o364j98O038J7085k3994K034
11368h27155k1289k9985L4320K4703K3954J008J5173r441L0022J4312l3497Q833
11356g69042L5651J1984m0884k3111M642p894m1126K7983L6536l2165J1654J5469
$$ plain form
11344 -770303 -769517 -811217 -820098 -820210 -771390 -762486 -709730 -704993 -739521 -740760 -728811 -727532 -758781
11331 -758781 -729245 -658831 -651225 -711217 -786594 -805040 -825555 -839446 -816774 -799228 -754055 -767632
11319 -767632 -725366 -731139 -771633 -811771 -830928 -806960 -802466 -789516 -823741 -834828 -797892 -774896
11307 -774896 -772280 -720289 -686482 -692907 -690120 -700803 -756954 -766336 -774320 -763383 -742687 -781793
11295 -781793 -784659 -772235 -778314 -750359 -718105 -729163 -708233 -676482 -692624 -724460 -740453 -740371
11283 -740371 -741564 -734848 -744635 -735579 -722459 -725080 -741802 -747761 -753020 -738785 -682786 -656767 -694561
11270 -694561 -693556 -734753 -728548 -730601 -680393 -683216 -710095 -732585 -725370 -709525 -755228 -766986
11258 -766986 -748354 -747142 -706525 -688900 -682197 -682119 -735383 -767064 -744486 -701024 -686257 -689090 -730603
$$ packed form
11344g70303P86m1700q881j12M8820Q904N2756M737l4528j239J1949J279l1249
11331g58781K9536P0414P606n9992p5377j8446k0515j3891K2672J7546M5173j3577
11319g67632M2266n773m0494m0138j9157K3968M494J2950l4225j1087L6936K2996
11307g74896K616N1991L3807o425K787j0683n6151r382p984J0937K0696l9106
11295g81793k866J2424o079K7955L2254j1058K0930L1751j6142l1836j5993Q2
11283g40371j193O716r787R056J3120k621j6722n959n259J4235N5999K6019l7794
11270f94561J005m1197O205k053N0208k823k6879k2490P215J5845m5703j1758
11258g66986J8632J212M0617J7625O703P8n3264l1681K2578M3462J4767k833m1513
$$ plain form
11245 -730603 -771156 -752253 -725714 -720971 -712531 -720821 -702817 -690501 -652007 -659178 -688829 -667356
11233 -667356 -662888 -690746 -696101 -667429 -638930 -662140 -700240 -705945 -713862 -698180 -700726 -690677
11221 -690677 -705867 -723642 -740171 -718986 -750073 -737593 -721766 -730239 -696867 -664532 -654290 -621920
11209 -621920 -626507 -627254 -628929 -663021 -701379 -664145 -694259 -700294 -689874 -712437 -705387 -684596 -669678
11196 -669678 -683963 -682376 -650150 -655891 -677636 -691632 -704312 -726663 -700086 -698959 -702400 -699193
11184 -699193 -698648 -676205 -631835 -612790 -639329 -644012 -606402 -591240 -613715 -667364 -647079 -680335
11172 -680335 -723094 -734022 -714571 -692129 -706664 -714712 -698491 -698397 -677404 -656167 -663765 -683460
11160 -683460 -700369 -675862 -617578 -590395 -623779 -638294 -656107 -684939 -668792 -614436 -584744
$$ packed form
11245g30603m0553J8903K6539M743Q440q290J8004J2316L8494p171k9651K1473
11233f67356M468k7858n355K8672K8499k3210l8100n705p917J5682k546J0049
11221f90677j5190j7775j6529K1185l1087J2480J5827q473L3372L2335J0242L2370
11209f21920m587p47j675l4092l8358L7234l0114o035J0420k2563P050K0791J4918
11196f69678j4285J587L2226n741k1745j3996j2680k2351K6577J127l441L207
11184f99193N45K2443M4370J9045k6539m683L7610J5162k2475n3649K0285l3256
11172f80335m2759j0928J9451K2442j4535q048J6221R4K0993K1237p598j9695
11160f83460j6909K4507N8284K7183l3384j4515j7813k8832J6147N4356K9692
$$ plain form
11149 -584744 -592853 -614632 -606466 -603646 -615818 -632930 -637876 -643232 -664476 -660880 -641711 -626701 -614156
11136 -614156 -613098 -622929 -648759 -648841 -623851 -660290 -723054 -739498 -716107 -688549 -662451 -646127
11124 -646127 -630635 -667669 -648212 -586569 -585344 -614077 -644555 -682656 -680203 -658904 -678512 -667716
11112 -667716 -641038 -633882 -623473 -599877 -580569 -611524 -650500 -675603 -658248 -658845 -671431 -644908
11100 -644908 -581925 -532613 -538197 -547414 -593075 -565865 -570731 -582139 -632442 -630573 -634477 -608482
11088 -608482 -560571 -544237 -566733 -554763 -547159 -562820 -607110 -591819 -554766 -593329 -594478 -582402
11076 -582402 -574697 -581801 -589458 -617671 -624560 -600495 -566584 -541901 -544297 -548511 -555526 -571175 -609679
11063 -609679 -590082 -560811 -601503 -601225 -615040 -656016 -641332 -632973 -605512 -602905 -573251 -591464
$$ packed form
11149e84744q109k1779Q166K820j2172j7112m946n356k1244L596J9169J5010J2545
11136f14156J058r831k5830q2K4990l6439o2764j6444K3391K7558K6098J6324
11124f46127J5492l7034J9457O1643J225k8733l0478l8101K453K1299j9608J0796
11112f67716K6678P156J0409K3596J9308l0955l8976k5103J7355n97j2586K6523
11100f44908O2983M9312n584r217m5661K7210m866j1408n0303J869l904K5995
11088f08482M7911J6334k2496J1970P604j5661m4290J5291L7053l8563j149J2076
11076e82402P705p104p657k8213o889K4065L3911K4683k396m214p015j5649l8504
11063f09679J9597K9271m0692K78j3815m0976J4684Q359K7461K607K9654j8213
$$ plain form
11051 -591464 -586670 -536566 -517426 -516492 -486577 -532369 -560512 -555432 -553120 -534259 -553967 -548211 -552929
11038 -552929 -552146 -551498 -548851 -515998 -491279 -534417 -558489 -563353 -567229 -568687 -526915 -463863 -501999
11025 -501999 -515552 -508329 -554445 -554487 -571080 -565938 -526694 -528642 -555888 -563566 -562590 -561226 -544731
11012 -544731 -566270 -561211 -551274 -536872 -541784 -532179 -477044 -456453 -465974 -524544 -564537 -568184 -590523
10999 -590523 -545141 -513500 -518219 -511477 -526375 -534771 -553675 -547397 -538402 -504682 -487108 -462717
10987 -462717 -472086 -529301 -560623 -552554 -546936 -548022 -540257 -576561 -577560 -533594 -480880 -507450 -489345
10974 -489345 -485397 -470522 -426195 -442116 -474569 -516931 -494400 -452208 -464964 -486567 -505032 -503861
10962 -503861 -510613 -462274 -424788 -420381 -452622 -465619 -497594 -542585 -575130 -562437 -548643 -515057
$$ packed form
11051e91464M794N0104J9140R34K9915m5792k8143N080K312J8861j9708N756m718
11038e52929P83O48K647L2853K4719m3138k4072m864l876j458M1772O3052l8136
11025e01999j3553P223m6116m2j6593N142L9244j948k7246p678R76J364J6495
11012e44731k1539N059R937J4402m912R605N5135K0591r521n8570l9993l647k2339
10999e90523M5382L1641m719O742j4898q396j8904O278Q995L3720J7574K4391
10987d62717r369n7215l1322Q069N618j086P765l6304r99M3966N2714k6570J8105
10974d89345L948J4875M4327j5921l2453m2362K2531M2192j2756k1603j8465J171
10962e03861o752M8339L7486M407l2241j2997l1975m4991l2545J2693J3794L3586
$$ plain form
10950 -515057 -504837 -489527 -435934 -427007 -448426 -465422 -504856 -510585 -495298 -460827 -457924 -467595
10938 -467595 -471214 -490203 -480748 -438837 -381747 -375340 -422436 -472610 -487038 -445797 -457339 -486697
10926 -486697 -534932 -534303 -529011 -484549 -449125 -436141 -450017 -467075 -426960 -401683 -439841 -444741
10914 -444741 -442629 -479204 -531874 -512627 -454351 -445359 -420547 -384123 -417817 -465365 -496610 -503965
10902 -503965 -524225 -509368 -455740 -399714 -418473 -461519 -460046 -468192 -460437 -435227 -414873 -402966
10890 -402966 -429472 -466726 -460042 -481320 -502556 -446366 -407162 -455368 -529566 -527729 -545637 -520411
10878 -520411 -489655 -437869 -427217 -411469 -463449 -472767 -463415 -441655 -419687 -453415 -448343 -423542
10866 -423542 -417296 -478287 -502852 -501044 -476110 -430994 -439887 -466423 -488122 -487786 -474587 -466542 -484700
$$ packed form
10950e15057J0220J5310N3593Q927k1419j6996l9434n729J5287L4471K903r671
10938d67595l619j8989R455M1911N7090O407m7096n0174j4428M1241j1542k9358
10926d86697m8235O29N292M4462L5424J2984j3876j7058M0115K5277l8158m900
10914d44741K112l6575n2670J9247N8276Q992K4812L6424l3694m7548l1245p355
10902e03965k0260J4857N3628N6026j8759m3046J473q146P755K5210K0354J1907
10890d02966k6506l7254O684k1278k1236N6190L9204m8206p4198J837j7908K5226
10878e20411L0756N1786J0652J5748n1980r318R352K1760K1968l3728N072K4801
10866d23542O246o0991k4565J808K4934M5116q893k6536k1699L36J3199Q045j8158
$$ plain form
10853 -484700 -493774 -461409 -414278 -389465 -400821 -380078 -352948 -378187 -402637 -398176 -423706 -408993
10841 -408993 -402550 -417223 -442647 -437534 -430837 -435370 -478393 -482353 -429980 -377662 -360333 -383774
10829 -383774 -390314 -392667 -427890 -463146 -503771 -474612 -449075 -458556 -499024 -470999 -468112 -438967
10817 -438967 -427109 -456093 -426805 -421714 -428707 -444667 -466570 -486648 -478278 -458170 -411943 -396971
10805 -396971 -360738 -369921 -392790 -337590 -328731 -376573 -441109 -450211 -401089 -377129 -398990 -392228
10793 -392228 -402679 -395639 -415639 -388284 -387760 -388788 -389156 -397265 -412831 -384287 -397195 -412458 -406347
10780 -406347 -390241 -367804 -376797 -380630 -325811 -340060 -331165 -307953 -305409 -306140 -313644 -298958 -327533
10767 -327533 -353534 -310591 -310407 -347130 -368237 -316983 -304219 -352308 -354194 -358644 -352914 -386259
$$ packed form
10853d84700r074L2365M7131K4813j1356K0743K7130k5239k4450M461k5530J4713
10841d08993O443j4673k5424N113O697m533m3023l960N2373N2318J7329k3441
10829c83774o540k353l5223l5256m0625K9159K5537r481m0468K8025K887K9145
10817d38967J1858k8984K9288N091o993j5960k1903k0078Q370K0108M6227J4972
10805c96971L6233r183k2869N5200Q859m7842o4536r102M9122K3960k1861O762
10793c92228j0451P040k0000K7355N24j028l68q109j5566K8544j2908j5263O111
10780d06347J6106K2437q993l833N4819j4249Q895K3212K544p31p504J4686k8575
10767c27533k6001M2943J84l6723k1107N1254J2764m8089j886m450N730l3345
$$ plain form
10755 -386259 -396440 -369991 -324864 -388435 -363839 -320444 -372344 -365764 -377709 -412816 -414035 -384806
10743 -384806 -377225 -371094 -399828 -405092 -367571 -352453 -345576 -297945 -291052 -315904 -333746 -299683
10731 -299683 -302321 -319395 -362193 -351252 -363248 -380830 -384015 -345140 -341049 -359320 -366557 -360993
10719 -360993 -371436 -374028 -380955 -418879 -385699 -387543 -380004 -335160 -349508 -363922 -328190 -308760
10707 -308760 -308069 -324257 -288894 -258342 -282252 -283705 -303729 -308606 -306285 -298115 -285767 -307773 -350380
10694 -350380 -352959 -337859 -336373 -340896 -357541 -344671 -316481 -302072 -336652 -359717 -345221 -323140
10682 -323140 -345528 -356837 -372757 -348830 -322253 -346563 -358652 -372322 -350063 -347408 -324169 -292777
10670 -292777 -308295 -343106 -392917 -362069 -351314 -355903 -347226 -327133 -315486 -279246 -276699 -301138
$$ packed form
10755c86259j0181K6449M5127o3571K4596M3395n1900O580j1945l5107j219K9229
10743c84806P581O131k8734n264L7521J5118O877M7631O893k4852j7842L4063
10731b99683k638j7074m2798J0941j1996j7582l185L8875M091j8271p237N564
10719c60993j0443k592o927l7924L3180j844P539M4844j4348j4414L5732J9430
10707c08760O91j6188L5363L0552k3910j453k0024m877K321Q170J2348k2006m2607
10694c50380k579J5100J486m523j6645J2870K8190J4409l4580k3065J4496K2081
10682c23140k2388j1309j5920K3927K6577k4310j2089j3670K2259K655K3239L1392
10670b92777j5518l4811m9811L0848J0755m589Q677K0093J1647L6240K547k4439
$$ plain form
10658 -301138 -321636 -329102 -312258 -301658 -263224 -256290 -283579 -308080 -239350 -247215 -285959 -297281
10646 -297281 -282551 -314920 -297857 -309790 -313352 -311388 -284854 -251903 -246675 -289640 -307700 -301832
10634 -301832 -303969 -274966 -301356 -281575 -250669 -257017 -248029 -266621 -323092 -361798 -346501 -331604
10622 -331604 -282868 -268868 -250187 -229105 -211521 -237476 -301490 -292103 -231604 -263673 -293261 -242050
10610 -242050 -206662 -193066 -247745 -256220 -269250 -272820 -276117 -275930 -258617 -208932 -173433 -206830
10598 -206830 -198315 -210543 -234171 -251090 -253984 -236287 -283089 -291601 -277952 -268677 -277526 -265357
10586 -265357 -251945 -245041 -255026 -229841 -227782 -244034 -246119 -247738 -247693 -220059 -226259 -254507 -231552
10573 -231552 -238122 -238405 -185529 -163110 -138512 -167216 -189559 -193792 -226069 -220059 -180170 -186256 -229368
$$ packed form
10658c01138k0498p466J6844J0600L8434O934k7289k4501O8730p865l8744j1322
10646b97281J4730l2369J7063j1933l562J964K6534L2951N228m2965j8060N868
10634c01832k137K9003k6390J9781L0906o348Q988j8592n6471l8706J5297J4897
10622c31604M8736J4000J8681K1082J7584k5955o4014R387O0499l2069k9588N1211
10610b42050L5388J3596n4679q475j3030l570l297J87J7313M9685L5499l3397
10598b06830Q515j2228k3628j6919k894J7697m6802q512J3649R275q849J2169
10586b65357J3412O904r985K5185K059j6252k085j619M5K7634o200k8248K2955
10573b31552o570k83N2876K2419K4598k8704k2343m233l2277O010L9889o086m3112
$$ plain form
10560 -229368 -208680 -205034 -217131 -241726 -228151 -228682 -197600 -200239 -228438 -245625 -235509 -229476
10548 -229476 -239897 -211069 -196784 -162820 -142397 -153802 -185351 -221910 -242298 -227467 -202928
10537 -202928 -196814 -223938 -234993 -215853 -219465 -197678 -230995 -229009 -229847 -238779 -211438 -212417 -202460
10524 -202460 -173160 -169122 -207984 -237325 -199785 -203467 -229920 -193539 -172279 -201432 -198044 -178043
10512 -178043 -182130 -211069 -224861 -212289 -218794 -213558 -185139 -167857 -180651 -187738 -201564 -219190
10500 -219190 -237271 -229703 -197253 -169547 -135411 -96899 -36942 -56335 -101780 -144985 -141582 -130431
10488 -130431 -146989 -127167 -145349 -178560 -172336 -158805 -142160 -112721 -117534 -151534 -179874 -179177
10476 -179177 -147600 -120552 -134792 -125150 -152930 -160740 -133113 -142234 -154668 -164541 -145315 -122566
$$ packed form
10560b29368K0688L646j2097k4595J3575n31L1082k639k8199j7187J0116O033
10548b29476j0421K8828J4285L3964K0423j1405l1549l6559k0388J4831K4539
10537b02928O114k7124j1055J9140l612K1787l3317J986q38q932K7341r79R957
10524b02460K9300M038l8862k9341L7540l682k6453L6381K1260k9153L388K0001
10512a78043m087k8939j3792J2572o505N236K8419J7282j2794p087j3826j7626
10500b19190j8081P568L2450K7706L4136L8512N9957j9393m5445m3205L403J1151
10488a30431j6558J9822j8182l3211O224J3531J6645K9439m813l4000k8340O97
10476a79177L1577K7048j4240R642k7780p810K7627r121j2434r873J9226K2749
$$ plain form
10464 -122566 -124850 -115137 -158647 -180253 -129546 -100682 -86990 -88869 -106692 -97865 -141727 -128696
10452 -128696 -133952 -117177 -91656 -113778 -131413 -167409 -196000 -201121 -185318 -164415 -132316 -100881
10440 -100881 -97198 -96546 -155284 -149453 -105655 -109808 -171144 -216112 -223547 -189081 -156564 -159558 -182102
10427 -182102 -152540 -120825 -143630 -146929 -148945 -155338 -164262 -157863 -165868 -215414 -192529 -156932 -119536
10414 -119536 -92870 -70397 -34945 -24732 -61941 -79437 -101032 -112970 -87405 -76604 -77236 -113335
10402 -113335 -122945 -135110 -154317 -81432 -65299 -62992 -43323 -76018 -34678 -31020 -44617 -22239
10390 -22239 -12832 -17681 -43510 -38939 -59073 -104665 -139676 -123016 -93725 -92127 -75371 -72475 -82686
10377 -82686 -116551 -136310 -100969 -84467 -36429 -13639 -14425 -39456 -72895 -109608 -103577 -159987
$$ packed form
10464a22566k284R713m3510k1606N0707K8864J3692j879j7823Q827m3862J3031
10452a28696n256J6775K5521k2122j7635l5996k8591n121J5803K0903L2099L1435
10440a00881L683O52n8738N831M3798m153o1336m4968p435L4466L2517k994k2544
10427a82102K9562L1715k2805l299k016o393q924O399q005m9546K2885L5597L7396
10414a19536K6666K2473L5452J0213l7209j7496k1595j1938K5565J0801o32l6099
10402a13335r610j2165j9207P2885J6133K307J9669l2695M1340L658j3597K2378
10390b2239R407m849k5829M571k0134m5592l5011J6660K9291J598J6756K896j0211
10377h2686l3865j9759L5341J6502M8038K2790p86k5031l3439l6713O031n6410
$$ plain form
10365 -159987 -156894 -133580 -93556 -40597 -24332 -21397 -29840 -15207 2292 4839 -26296 -45625
10353 -45625 -44577 -22670 -30333 -46203 -11182 -9732 -51676 -75295 -73967 -89743 -78735 -85852 -93425
10340 -93425 -50857 -17654 -9624 7922 -28448 -21738 -19352 -28685 -8505 -12518 -53870 -85928 -95304
10327 -95304 -106763 -95887 -81230 -55637 -50582 -61223 -59874 -66837 -72937 -73089 -35965 -26706 -48375
10314 -48375 -66831 -64381 -62644 -59542 -51422 -14478 -22919 13543 60713 15157 -10255 -10819 -13821
10301 -13821 31905 60602 53670 -3492 -32516 -41160 -35439 16242 19656 366 6118 -3436 -48575
10288 -48575 -54152 -27673 8721 29081 39995 27468 -18842 -23101 97868 98975 49206 35424
10276 35424 35276 55092 24263 16473 4177 26239 62791 59327 50421 57184 40481 57187 59779
$$ packed form
10365a59987L093K3314M0024N2959J6265K935q443J4633J7499K547l1135j9329
10353d5625J048K1907p663j5870L5021J450m1944k3619J328j5776J1008p117p573
10340i3425M2568L3203Q030J7546l6370O710K386r333K0180m013m1352l2058r376
10327i5304j1459J0876J4657K5593N055j0641J349o963o100j52L7124R259k1669
10314d8375j8456K450J737L102Q120L6944q441L6462M7170m5556k5412n64l002
10301a3821M5726K8697o932n7162k9024q644N721N1681L414j9290N752r554m5139
10288d8575n577K6479L6394K0360J0914j2527m6310m259J20969J107m9769j3782
10276C5424j48J9816l0829p790j2296K2062L6552l464q906O763j6703J6706K592
$$ plain form
10263 59779 31903 3279 -6101 -37753 -22473 2025 15238 41569 -48 -7281 25554 36478
10251 36478 43830 74694 65258 59926 58705 47575 48184 41219 35093 41153 47599 67369 85254 49675
10237 49675 33001 53493 94980 78155 49470 33798 54523 89457 79017 90800 102334 84046
10225 84046 66459 35679 13456 60027 72056 88150 99355 78580 92247 95096 76425 53773
10213 53773 26036 -5168 1229 36323 -3169 -6689 -19920 1905 16789 11744 47239 47613 60564
10200 60564 -1884 -27568 -27488 6854 26949 16459 34899 66556 95104 131798 102529 98778
10188 98778 66077 82514 111116 96272 45627 42073 76639 94425 123948 132861 155461 120331
10176 120331 123169 89703 73008 101230 145181 160989 164415 119052 81806 73929 107312 104750
$$ packed form
10263E9779k7876k8624r380l1652J5280K4498J3213K6331m1617p233L2835J0924
10251C6478P352L0864r436n332j221j1130O09o965o126O060O446J9770J7885l5579
10237D9675j6674K0492M1487j6825k8685j5672K0725L4934j0440J1783J1534j8288
10225H4046j7587l0780k2223M6571J2029J6094J1205k0775J3667K849j8671k2652
10213E3773k7737l1204O397L5094l9492l520j3231K1825J4884n045L5495L74J2951
10200F0564o2448k5684Q0L4342K0095j0490J8440L1657K8548L6694k9269l751
10188I8778l2701J6437K8602j4844n0645l554L4566J7786K9523Q913K2600l5130
10176A20331K838l3466j6695K8222M3951J5808L426m5363l7246p877L3383k562
$$ plain form
10164 104750 111295 119281 117190 89950 69914 75887 86666 87589 142955 140269 100982 83697 84968
10151 84968 100011 121215 140562 149670 147548 148993 172189 145885 91952 56465 70262 92871
10139 92871 137971 188201 173506 139345 95656 89820 110812 136505 125793 129828 152769 145425
10127 145425 121915 105262 117039 148130 170149 181476 165405 144862 111186 86248 92248 121089
10115 121089 140954 131301 138526 149627 156236 191664 145743 140393 170859 180194 179674 182121 208953
10102 208953 226006 217181 200118 183077 143726 134140 170483 164912 175762 178523 212003 218925
10090 218925 194785 206313 220522 213693 201990 150754 147653 135368 123186 153479 187002 198121
10078 198121 198022 201935 186672 180184 223657 261733 247985 211303 234725 212345 204617 189251 191569
$$ packed form
10164A04750O545P986k091k7240k0036N973J0779R23N5366k686l9287j7285J271
10151H4968J5043K1204J9347R108k122J445K3196k6304n3933l5487J3797K2609
10139I2871M5100N0230j4695l4161m3689n836K0992K5693j0712M035K2941p344
10127A45425k3510j6653J1777L1091K2019J1327j6071k0543l3676k4938O000K8841
10115A21089J9865r653P225J1101O609L5428m5921n350L0466R335n20K447K6832
10102B08953J7053q825j7063j7041l9351r586L6343n571J0850K761L3480O922
10090B18925k4140J1528J4209o829j1703n1236l101j2285j2182L0293L3523J1119
10078A98121r9L913j5263o488M3473L8076j3748l6682K3422k2380p728j5366K318
$$ plain form
10065 191569 198023 237907 236783 207765 179606 216546 260191 277267 238489 253433 281145 277189
10053 277189 211717 197321 235501 246456 232989 212413 212844 231595 247907 239568 215061 221299
10041 221299 244758 254256 230823 204849 197863 206760 206160 207223 242762 259186 233970 245111 272169
10028 272169 276522 257897 269370 305684 273110 284079 316335 265914 233720 214216 263070 264141
10016 264141 238177 246760 246599 220708 249332 258694 257980 268891 267190 234639 191306 217458 273193
10003 273193 271042 234783 231624 243685 251814 277949 284774 270551 234933 225755 248999 219669
9991 219669 223600 218509 208243 216812 238706 258678 288310 288227 268949 268492 285711 306454 295107
9978 295107 286478 310871 337907 364856 334195 327356 364132 379659 388553 367987 371532 406901
$$ packed form
10065A91569O454L9884j124k9018k8159L6940M3645J7076l8778J4944K7712l956
10053B77189o5472j4396L8180J0955j3467k0576M31J8751J6312q339k4507O238
10041B21299K3459R498k3433k5974o986Q897o00J063L5539J6424k5216J1141K7058
10028B72169M353j8625J1473L6314l2574J0969L2256n0421l2194j9504M8854J071
10016B64141k5964Q583j61k5891K8624R362p14J0911j701l2551m3333K6152N5735
10003B73193k151l6259l159J2061Q129K6135O825j4223l5618r178K3244k9330
9991B19669L931n091j0266Q569K1894J9972K9632q3j9278m57J7219K0743j1347
9978B95107q629K4393K7036K6949l0661o839L6776J5527Q894k0566L545L5369
$$ plain form
9966 406901 378727 366130 379277 377012 413616 427443 409507 369924 378617 411128 388281 342981
9954 342981 319523 308624 316200 335208 365988 376077 373437 375338 346673 337194 362890 402051
9942 402051 419550 413142 397933 396900 394155 393357 408808 384296 397582 420336 397332 387983 368621
9929 368621 382559 405877 431780 442496 408164 391226 386667 353858 329789 331401 402396 429308
9917 429308 363452 332169 355916 370414 401055 437472 477076 470303 471473 472898 456187 400884
9905 400884 413027 408825 445127 486652 437802 427519 423410 403637 430782 433390 433813 431491 442734
9892 442734 472437 451842 420146 396569 390253 400569 412027 445852 443524 453830 467049 462465
9880 462465 446116 467234 459267 386478 405081 430263 427683 452821 460297 459888 491263 484605 488568
$$ packed form
9966D06901k8174j2597J3147k265L6604J3827j7936l9583Q693L2511k2847m5300
9954C42981k3458j0899P576J9008L0780J0089k640J901k8665r479K5696L9161
9942D02051J7499o408j5209j033k745p98J5451k4512J3286K2754k3004r349j9362
9929C68621J3938K3318K5903J0716l4332j6938m559l2809k4069J612P0995K6912
9917D29308o5856l1283K3747J4498L0641L6417L9604o773J170J425j6711n5303
9905D00884J2143m202L6302M1525m8850j0283m109j9773K7145K608M23k322J1243
9892D42734K9703k0595l1696k3577o316J0316J1458L3825k328J0306J3219m584
9880D62465j6349K1118p967p2789J8603K5182k580K5138P476m09L1375o658L963
$$ plain form
9867 488568 499582 506337 452520 423244 473703 501806 483479 451083 444204 495828 488216 489952
9855 489952 482390 474282 506475 569432 586773 576878 605588 623157 609949 545615 533642 520272
9843 520272 497821 541120 524552 528711 482598 404551 402154 441899 448936 469011 472846 463040 469132
9830 469132 444677 442746 459313 493641 495004 522948 495185 462432 500841 528976 503866 484970
9818 484970 514766 528811 520206 543852 533343 493045 499721 511730 499653 492457 539285 587245
9806 587245 589185 590134 609972 622768 604979 542640 508377 535538 552121 552753 558582 532239 508095
9793 508095 508787 496037 481478 473571 489986 536503 530019 520786 579731 595224 609280 579779 563594
9780 563594 547493 541640 570689 558476 535112 545667 580405 584156 586354 599042 626493 617190
$$ packed form
9867D88568J1014O755n3817k9276N0459K8103j8327l2396o879N1624p612J736
9855D89952p562q108L2193O2957J7341r895K8710J7569j3208o4334j1973j3370
9843E20272k2451M3299j6568M159m6113p8047k397L9745P037K0075L835r806O092
9830D69132k4455j931J6567L4328J363K7944k7763l2753L8409K8135k5110j8896
9818D84970K9796J4045q605K3646j0509m0298O676J2009j2077p196M6828M7960
9806E87245J940R49J9838J2796j7789o2339l4263K7161J6583O32N829k6343k4144
9793E08095O92j2750j4559p907J6415M6517o484r233N8945J5493J4056k9501j6185
9780E63594j6101n853K9049j2213k3364J0555L4738L751K198J2688K7451r303
$$ plain form
9768 617190 613413 637989 655240 630637 639438 635142 608052 581212 581336 588252 616709 638411 638253
9755 638253 619679 637484 606610 585236 593606 594581 642744 668759 630915 595221 618279 673912
9743 673912 713272 723719 699815 686029 696665 710295 729479 755096 757257 754139 751460 780699
9731 780699 761219 717380 682506 699195 719034 712268 669997 685634 702141 724431 727267 753854
9719 753854 786110 744487 727424 759159 748956 743560 739959 728716 683029 655621 685413 715744
9707 715744 722923 722595 743666 741190 724081 741865 757205 788347 821820 810428 826554 857926
9695 857926 861525 875963 819791 770679 821650 874371 833431 824766 818227 798356 804868 782201
9683 782201 761817 796454 782518 756907 737240 780437 799222 775543 797467 799826 781904 786688
$$ packed form
9768F17190l777K4576J7251k4603Q801m296k7090k6840J24O916K8457K1702j58
9755F38253j8574J7805l0874k1374Q370R75M8163K6015l7844l5694K3058N5633
9743F73912L9360J0447k3904j3786J0636J3630J9184K5617K161l118k679K9239
9731G80699j9480m3839l4874J6689J9839o766m2271J5637J6507K2290K836K6587
9719G53854L2256m1623j7063L1735j0203n396l601j1243m5687k7408K9792L0331
9707G15744P179l28K1071k476j7109J7784J5340L1142L3473j1392J6126L1372
9695H57926L599J4438n6172m9112N0971N2721m0940q665o539j9871O512k2667
9683G82201k0384L4637j3936k5611j9667M3197J8785k3679K1924K359j7922M784
$$ plain form
9671 786688 783819 793212 789652 799950 823577 824721 833634 852228 860392 883691 894485 913965 920929
9658 920929 895155 857102 826902 826681 815969 826013 813223 829494 891948 908487 886934 836369
9646 836369 806316 828098 847606 886716 900842 890724 865772 876504 904737 898672 892549 880403
9634 880403 886932 870953 875073 928791 922014 888224 887227 894197 884899 929403 926495 910974 908194
9621 908194 888347 890798 933839 967824 999790 961330 964272 966141 943883 949869 958319 972377 1000890
9608 1000890 1003461 1008863 981552 989961 989830 1008704 1009902 1001413 990915 992261 1003014 997526 996790 1038158
9594 1038158 1122251 1119587 1050757 1018213 996625 1009342 1019314 1039624 1062493 1081554 1090627 1089986
9582 1089986 1060775 981738 955095 999672 1009777 1026288 1102576 1096511 1055562 1017345 997970 989976
$$ packed form
9671G86688k869R393l560J0298K3627J144Q913J8594Q164K3299J0794J9480O964
9658I20929k5774l8053l0200k21j0712J0044j2790J6271O2454J6539k1553n0565
9646H36369l0053K1782J9508L9110J4126j0118k4952J0732K8233o065o123j2146
9634H80403O529j5979M120N3718o777l3790r97O970r298M4504k908j5521k780
9621I08194j9847K451M3041L3985L1966l8460K942J869k2258N986Q450J4058K8513
9608A000890K571N402k7311Q409j31J8874J198q489j0498J346J0753n488p36M1368
9594A038158Q4093k664o8830l2544k1588J2717R972K0310K2869J9061R073o41
9582A089986k9211p9037k6643M4577J0105J6511P6288o065m0949l8217j9375p994
$$ plain form
9570 989976 981926 965911 1001398 1010959 1001404 1037953 1072259 1065857 1041320 1034856 1029351 1038729 1086940
9557 1086940 1145459 1174019 1148768 1158628 1139116 1096475 1080836 1085663 1052467 1050081 1075826 1090349
9545 1090349 1100960 1111847 1107728 1094752 1127950 1128883 1128997 1153693 1168219 1178444 1210291 1170356
9533 1170356 1132578 1140701 1106130 1125554 1171782 1204648 1221856 1260215 1247373 1209570 1219027 1235936
9521 1235936 1222727 1178150 1224736 1245266 1232135 1209101 1188727 1183372 1172771 1162784 1174810 1274556
9509 1274556 1280114 1297995 1328328 1273695 1227685 1230021 1234302 1208047 1240997 1278763 1258145 1235892
9497 1235892 1234356 1249195 1249467 1285351 1310561 1312106 1324852 1353594 1352135 1352243 1331930 1324052 1346255
9484 1346255 1367049 1365774 1383581 1386428 1371354 1359122 1379118 1369273 1388324 1385118 1363610 1362889 1375184
$$ packed form
9570I89976q050j6015L5487R561r555L6549L4306o402k4537o464n505R378M8211
9557A086940N8519K8560k5251R860j9512m2641j5639M827l3196k386K5745J4523
9545A090349J0611J0887m119j2976L3198R33J14K4696J4526J0225L1847l9935
9533A170356l7778Q123l4571J9424M6228L2866J7208L8359j2842l7803R457J6909
9521A235936j3209m4577M6586K0530j3131k3034k0374n355j0601r987J2026R9746
9509A274556N558J7881L0333n4633m6010K336M281k6255L2950L7766k0618k2253
9497A235892j536J4839K72L5884K5210J545J2746K8742j459J08k0313p878K2203
9484A346255K0794j275J7807K847j5074j2232J9996r845J9051l206k1508p21J2295
$$ plain form
9471 1375184 1367215 1341721 1327432 1371033 1351576 1377302 1408052 1448312 1463528 1453481 1410595 1400056
9459 1400056 1392264 1383251 1373911 1420031 1430005 1447868 1493315 1496259 1475037 1479045 1500396 1478869 1486068
9446 1486068 1481384 1468595 1447528 1487529 1471357 1481059 1480081 1498468 1511576 1527903 1514372 1504624
9434 1504624 1497821 1508190 1534810 1533911 1564644 1570696 1578836 1566000 1573699 1604223 1620201 1645914 1650703
9421 1650703 1642747 1591441 1546653 1577642 1573685 1604405 1611833 1591369 1606380 1645574 1695635 1681942
9409 1681942 1686422 1686618 1663643 1683913 1651281 1617545 1597766 1607054 1636772 1652525 1690819 1708691
9397 1708691 1710223 1708202 1730632 1782458 1802510 1794446 1744077 1781471 1817054 1846989 1820268 1744234
9385 1744234 1737827 1738385 1778627 1826842 1831239 1820829 1842395 1876029 1845082 1826924 1810478 1789860
$$ packed form
9471A375184p969k5494j4289M3601j9457K5726L0750M0260J5216j0047m2886j0539
9459A400056p792r013r340M6120R974J7863M5447K944k1222M008K1351k1527P199
9446A486068m684j2789k1067M0001j6172R702r78J8387J3108J6327j3531r748
9434A504624o803J0369K6620q99L0733O052Q140j2836P699L0524J5978K5713M789
9421A650703p956n1306m4788L0989l957L0720P428k0464J5011L9194N0061j3693
9409A681942M480J96k2975K0270l2632l3736j9779R288K9718J5753L8294J7872
9397A708691J532k021K2430N1826K0052q064n0369L7394L5583K9935k6721p6034
9385A744234o407N58M0242M8215M397j0410K1566L3634l0947j8158j6446k0618
$$ plain form
9373 1789860 1787030 1822663 1865024 1843061 1816180 1855622 1814422 1811858 1846351 1873696 1916550 1938250
9361 1938250 1921868 1909091 1937191 1908974 1944823 2015978 2012718 1974517 1943197 1939586 1952404 1914198
9349 1914198 1905169 1946539 1967166 2001854 2019014 2011278 2011138 1999169 2019667 2048736 2072752 2083448
9337 2083448 2121565 2106773 2132540 2144349 2135924 2140269 2120976 2119942 2105950 2076809 2104607 2105817
9325 2105817 2086987 2124194 2104244 2090450 2135789 2137987 2136076 2138053 2120890 2168895 2198745 2209602
9313 2209602 2232402 2198575 2235687 2248062 2254244 2267863 2286787 2292588 2289085 2279224 2235120 2249914
9301 2249914 2282873 2299353 2358883 2378489 2378705 2376242 2371650 2392702 2411703 2444540 2422306 2439817
9289 2439817 2474959 2446626 2418254 2440061 2479283 2477501 2510362 2569548 2579390 2596706 2625898 2677168
$$ packed form
9373A789860k830L5633M2361k1963k6881L9442m1200k564L4493K7345M2854K1700
9361A938250j6382j2777K8100k8217L5849P1155l260l8201l1320l611J2818l8206
9349A914198r029M1370K0627L4688J7160p736j40j1969K0498K9069K4016J0696
9337B083448L8117j4792K5767J1809q425M345j9293j034j3992k9141K7798J210
9325B105817j8830L7207j9950j3794M5339K198j911J977j7163M8005K9850J0857
9313B209602K2800l3827L7112J2375O182J3619J8924N801l503r861m4104J4794
9301B249914L2959J6480N9530J9606K16k463m592K1052J9001L2837k2234J7511
9289B439817L5142k8333k8372K1807L9222j782L2861N9186R842J7316K9192N1270
$$ plain form
9277 2677168 2671185 2623856 2576356 2606477 2640465 2666187 2704618 2724902 2775509 2772776 2754549 2738996
9265 2738996 2704562 2723795 2773093 2770700 2725165 2720328 2715451 2705268 2725673 2719371 2654800 2590378
9253 2590378 2542092 2558695 2583732 2568523 2565067 2628749 2691289 2759267 2783207 2776606 2822247 2832582
9241 2832582 2867705 2884894 2906455 2917131 2955163 2985359 2969122 2977807 3003678 3013233 3077405 3127679
9229 3127679 3141108 3140501 3165605 3202533 3269289 3283828 3296035 3308751 3337168 3349982 3334407 3372086
9217 3372086 3400665 3387061 3368839 3380186 3374396 3331836 3237105 3095450 2948780 2859817 2872829
9206 2872829 2935600 3040057 3110985 3141294 3176288 3220422 3286314 3335152 3362752 3414781 3459247
9195 3459247 3538574 3595405 3620916 3643520 3676346 3696445 3733019 3781676 3785350 3800856 3861612 3897643
$$ packed form
9277B677168n983m7329m7500L0121L3988K5722L8431K0284N0607k733j8227j5553
9265B738996l4434J9233M9298k393m5535m837m877j0183K0405o302o4571o4422
9253B590378m8286J6603K5037j5209l456O3682O2540O7978K3940o601M5641J0335
9241B832582L5123J7189K1561J0676L8032L0196j6237Q685K5871R555O4172N0274
9229C127679J3429o07K5104L6928O6756J4539J2207J2716K8417J2814j5575L7679
9217C372086K8579j3604j8222J1347n790m2560r4731j41655j46670q8963J3012
9206B872829O2771J04457P0928L0309L4994M4134O5892M8838K7600N2029M4466
9195C459247P9327N6831K5511K2604L2826K0099L6574M8657L674J5506O0756L6031
$$ plain form
9183 3897643 3957487 4031653 4087412 4152495 4197248 4218429 4248709 4284015 4318488 4356808 4432057
9172 4432057 4467183 4480885 4499280 4508642 4526411 4559479 4551574 4502611 4434837 4428489 4500400 4580846
9160 4580846 4686706 4772648 4847684 4970144 5082798 5124470 5145650 5162234 5213427 5325629 5428304
9149 5428304 5534582 5638936 5790373 5914933 6003615 6143822 6312854 6514309 6722903 7002970
9139 7002970 7308438 7603837 7937577 8287516 8680807 9010889 9160500 8984805 8473757 7763084
9129 7763084 7226420 6922467 6373134 4917753 1051566 -5493776 -8203280 -7065811 -5533563
9120 -5533563 -4213157 -3236489 -2507896 -1904742 -1367705 -957270 -595385 -318398 -102453
9111 -102453 185373 400624 579323 754331 932631 1053263 1153424 1274298 1405293 1474398
$$ packed form
9183C897643N9844P4166N5759O5083M4753K1181L0280L5306L4473L8320P5249
9172D432057L5126J3702J8395R362J7769L3068p905m8963o7774o348P1911Q0446
9160D580846J05860Q5942P5036J22460J12654M1672K1180J6584N1193J12202J02675
9149E428304J06278J04354J51437J24560Q8682J40207J69032K01455K08594K80067
9139G002970L05468K95399L33740L49939L93291L30082J49611j75695n11048p10673
9129G763084n36664l03953n49333j455381l866187o545342k709504J137469J532248
9120e533563J320406R76668P28593O03154N37037M10435L61885K76987K15945
9111a02453K87826K15251J78699J75008J78300J20632J00161J20874J30995O9105
$$ plain form
9101 1474398 1547086 1639843 1730315 1793295 1911300 2000738 2054086 2128379 2222110 2291870 2332378
9090 2332378 2387916 2484063 2560811 2600812 2677916 2755374 2790057 2818686 2816093 2838675 2890840 2960979
9078 2960979 3001165 3067052 3120490 3146714 3171192 3178857 3240163 3248899 3264579 3288688 3326089 3378542
9066 3378542 3381489 3425466 3441243 3452172 3504947 3528460 3574483 3606078 3629432 3684214 3712815 3731135
9054 3731135 3728322 3760857 3844249 3891920 3899465 3903554 3888394 3850692 3879084 3940911 3994537 4051812
9042 4051812 4095349 4133351 4188762 4284130 4339445 4358769 4356909 4379441 4433704 4485984 4516921 4580564
9030 4580564 4657817 4675313 4705653 4729293 4792866 4864399 4865719 4885255 4899976 4945973 4986685 5056061
9018 5056061 5088340 5152594 5215414 5243514 5259585 5309816 5362556 5412291 5435327 5492909 5497728 5452507
$$ packed form
9101A474398P2688R2757R0472O2980J18005Q9438N3348P4293R3731O9760M0508
9090B332378N5538R6147P6748M0001P7104P7458L4683K8629k593K2582N2165P0139
9078B960979M0186O5887N3438K6224K4478P665O1306Q736J5680K4109L7401N2453
9066C378542K947M3977J5777J0929N2775K3513M6023L1595K3354N4782K8601J8320
9054C731135k813L2535Q3392M7671P545M089j5160l7702K8392O1827N3626N7275
9042D051812M3537L8002N5411R5368N5315J9324j860K2532N4263N2280L0937O3643
9030D580564P7253J7496L0340K3640O3573P1533J320J9536J4721M5997M0712O9376
9018E056061L2279O4254O2820K8100J6071N0231N2740M9735K3036N7582M819m5221
$$ plain form
9006 5452507 5433074 5445817 5456638 5462279 5460622 5393945 5367003 5424268 5582634 5699607 5804009
8995 5804009 5876544 5947912 5999253 6088730 6164839 6255628 6336620 6421288 6468918 6509351 6545041
8984 6545041 6549416 6563291 6573710 6636807 6703185 6749806 6826313 6938588 7047025 7116773 7175977
8973 7175977 7246072 7296294 7369946 7409974 7475514 7567108 7659441 7741700 7819858 7871116 7905381
8962 7905381 7958252 8019243 8069075 8168920 8286632 8317230 8309944 8324338 8382407 8483362 8623664
8951 8623664 8734526 8867326 9013804 9126291 9199829 9271709 9347560 9434215 9581466 9729841
8941 9729841 9832218 9972744 10086079 10172458 10235701 10309989 10438555 10603755 10773678 10922295
8931 10922295 11041005 11139371 11301643 11485385 11670073 11796085 11948545 12117654 12261672 12419783
$$ packed form
9006E452507j9433J2743J0821N641j657o6677k6942N7265J58366J16973J04402
8995E804009P2535P1368N1341Q9477P6109R0789Q0992Q4668M7630M0433L5690
8984F545041M375J3875J0419O3097O6378M6621P6507J12275J08437O9748N9204
8973G175977P0095N0222P3652M0028O5540R1594R2333Q2259P8158N1258L4265
8962G905381N2871O0991M9832R9845J17712L0598p286J4394N8069J00955J40302
8951H623664J10862J32800J46478J12487P3538P1880P5851Q6655J47251J48375
8941I729841J02377J40526J13335Q6379O3243P4288J28566J65200J69923J48617
8931A0922295J18710R8366J62272J83742J84688J26012J52460J69109J44018J58111
$$ plain form
8921 12419783 12593318 12792381 12943957 13125624 13346831 13507525 13673434 13853344 14031403
8912 14031403 14266169 14533997 14782980 15051826 15287157 15538587 15748624 15993183 16274150
8903 16274150 16492574 16744206 17026296 17322106 17584473 17859114 18146287 18423858 18725045
8894 18725045 19104974 19446625 19768360 20102168 20460928 20868594 21279170 21711693 22150866
8885 22150866 22509024 23004046 23583621 24137991 24651689 25271571 25919036 26608869 27380620
8876 27380620 28156192 28898122 29724784 30736804 31868324 33157016 34617171 36197109 37912651
8867 37912651 39689472 41537022 43234407 44267539 44206077 42793662 40248481 37544341
8859 37544341 35148898 32147893 26272865 13992915 -6395024 -24444283 -28953155 -25248689
$$ packed form
8921A2419783J73535J99063J51576J81667K21207J60694J65909J79910J78059
8912A4031403K34766K67828K48983K68846K35331K51430K10037K44559K80967
8903A6274150K18424K51632K82090K95810K62367K74641K87173K77571L01187
8894A8725045L79929L41651L21735L33808L58760M07666M10576M32523M39173
8885B2150866L58158M95022N79575N54370N13698O19882O47465O89833P71751
8876B7380620P75572P41930Q26662J012020J131520J288692J460155J579938J715542
8867C7912651J776821J847550J697385J033132o1462j412415k545181k704140
8859C7544341k395443l001005n875028j2279950k0387939j8049259m508872L704466
$$ plain form
8851 -25248689 -19825306 -14750810 -10419075 -6847974 -3855282 -1319202 940345 2941921
8843 2941921 4792998 6555134 8222809 9753386 11174727 12593139 14032160 15466386
8835 15466386 16978458 18488643 19991498 21485665 23017079 24567477 26263609 28128617
8827 28128617 30173432 32526335 35196101 38138582 41258423 44548757 48121882 51570888
8819 51570888 53859203 53931541 51089363 45650110 39674092 34849251 29762682 20176995
8811 20176995 -1502675 -43588593 -86562720 -98499543 -91132397 -80017944 -69740163
8804 -69740163 -61242826 -54444277 -48939782 -44390646 -40523699 -37085240 -34030812 -31370731
8796 -31370731 -29062858 -27015860 -25172108 -23308546 -21502086 -19753819 -18061887 -16505303
$$ packed form
8851b5248689N423383N074496M331735L571101K992692K536080K259547K001576
8843B941921J851077J762136J667675J530577J421341J418412J439021J434226
8835A5466386J512072J510185J502855J494167J531414J550398J696132J865008
8827B8128617K044815K352903K669766K942481L119841L290334L573125L449006
8819E1570888K288315P2338k842178n439253n976018m824841n086569r585687
8811B0176995k1679670m2085918m2974127j1936823P367146J1114453J0277781
8804f9740163Q497337O798549N504495M549136L866947L438459L054428K660081
8796c1370731K307873K046998J843752J863562J806460J748267J691932J556584
$$ plain form
8788 -16505303 -15033471 -13637076 -12332516 -11033218 -9680983 -8309115 -6900455 -5371048
8780 -5371048 -3727407 -1969004 -152607 1726369 3680902 5546158 6957215 7422364
8772 7422364 6592158 4460867 1745527 -710781 -3237383 -7531311 -16546933 -33488286
8764 -33488286 -53702662 -63079805 -61319088 -56200503 -51090305 -46721994 -43174472 -40327198
8756 -40327198 -37982055 -35978626 -34220227 -32638988 -31233840 -30044469 -29034705 -28136016
8748 -28136016 -27238332 -26343081 -25511554 -24719677 -23963239 -23308106 -22751361 -22255492 -21788251
8739 -21788251 -21335439 -20900601 -20441685 -19998422 -19563198 -19235399 -18919509 -18586658 -18259054
8730 -18259054 -17957662 -17662042 -17382260 -17131734 -16878189 -16593257 -16387154 -16156780 -15901012
$$ packed form
8788a6505303J471832J396395J304560J299298J352235J371868J408660J529407
8780e371048J643641J758403J816397J878976J954533J865256J411057M65149
8772G422364q30206k131291k715340k456308k526602m293928r015622j6941353
8764c3488286k0214376r377143J760717N118585N110198M368311L547522K847274
8756d0327198K345143K003429J758399J581239J405148J189371J009764Q98689
8748b8136016Q97684Q95251Q31527P91877P56438O55133N56745M95869M67241
8739b1788251M52812M34838M58916M43263M35224L27799L15890L32851L27604
8730a8259054L01392K95620K79782K50526K53545K84932K06103K30374K55768
$$ plain form
8721 -15901012 -15684721 -15480116 -15293936 -15050839 -14827354 -14666382 -14458954 -14265673 -14094720
8712 -14094720 -13950922 -13847193 -13723367 -13574696 -13375344 -13234222 -13129967 -13010363 -12836529
8703 -12836529 -12705175 -12575173 -12392797 -12201748 -12110360 -12034927 -11949411 -11865011 -11770244 -11645378
8693 -11645378 -11520473 -11406599 -11262932 -11129573 -11084181 -11050044 -10915052 -10820597 -10767638 -10676414
8683 -10676414 -10606341 -10505982 -10411264 -10357193 -10290246 -10183422 -10079460 -10057752 -10021403 -9938232 -9871458
8672 -9871458 -9871120 -9819372 -9725610 -9674844 -9638276 -9590388 -9524831 -9408205 -9288736 -9232735 -9166444
8661 -9166444 -9082557 -9010174 -8972373 -8897394 -8795106 -8701740 -8636759 -8576601 -8500985 -8415220 -8370484
8650 -8370484 -8348955 -8285228 -8287738 -8258087 -8222019 -8200974 -8166518 -8142291 -8058365 -7994217 -7977537 -7911530
$$ packed form
8721a5901012K16291K04605J86180K43097K23485J60972K07428J93281J70953
8712a4094720J43798J03729J23826J48671J99352J41122J04255J19604J73834
8703a2836529J31354J30002J82376J91049R1388P5433Q5516Q4400R4767J24866
8693a1645378J24905J13874J43667J33359M5392L4137J34992R4455N2959R1224
8683a0676414P0073J00359R4718N4071O6947J06824J03962K1708L6349Q3171O6774
8672i871458L38N1748R3762N0766L6568M7888O5557J16626J19469N6001O6291
8661i166444Q3887P2383L7801P4979J02288R3366O4981O0158P5616Q5765M4736
8650h370484K1529O3727k510K9651L6068K1045L4456K4227Q3926O4148J6680O6007
$$ plain form
8638 -7911530 -7853773 -7835718 -7797852 -7778270 -7737289 -7678131 -7660422 -7621041 -7635444 -7662908 -7666732 -7624152
8626 -7624152 -7522256 -7474057 -7492316 -7456000 -7428796 -7358338 -7252883 -7118008 -7023166 -6979578 -6927360
8615 -6927360 -6818587 -6788196 -6772871 -6794790 -6750618 -6730514 -6704226 -6724314 -6703281 -6665024 -6658390
8604 -6658390 -6637339 -6627440 -6646433 -6648192 -6682827 -6678014 -6643054 -6613801 -6574084 -6584902 -6646467 -6628693
8592 -6628693 -6627965 -6618571 -6601865 -6541211 -6483044 -6493538 -6513988 -6511188 -6495742 -6556285 -6582130 -6571931
8580 -6571931 -6574825 -6557300 -6515728 -6509762 -6545851 -6474976 -6386156 -6330371 -6224998 -6130479 -6061565 -6002653
8568 -6002653 -5994362 -5975157 -5943700 -5951813 -5946422 -5908214 -5864675 -5851363 -5841851 -5792117 -5755484 -5723136
8556 -5723136 -5715842 -5712182 -5679576 -5646729 -5628466 -5578873 -5539571 -5530052 -5537313 -5563693 -5517621 -5474346
$$ packed form
8638g911530N7757J8055L7866J9582M0981N9158J7709L9381j4403k7464l824M2580
8626g624152J01896M8199j8259L6316K7204P0458J05455J34875R4842M3588N2218
8615f927360J08773L0391J5325k1919M4172K0104K6288k0088K1033L8257O634
8604f658390K1051R899j8993j759l4635M813L4960K9253L9717j0818o1565J7774
8592f628693P28R394J6706O0654N8167j0494k0450K800J5446o0543k5845J0199
8580f571931k894J7525M1572N966l6089P0875Q8820N5785J05373R4519O8914N8912
8568f002653Q291J9205L1457q113N391L8208M3539J3312R512M9734L6633L2348
8556e723136P294L660L2606L2847J8263M9593L9302R519p261k6380M6072M3275
$$ plain form
8544 -5474346 -5474334 -5438584 -5467237 -5458637 -5416476 -5368991 -5296621 -5305890 -5284053 -5258151 -5248945 -5229811 -5214616
8531 -5214616 -5199329 -5169362 -5150054 -5113555 -5084771 -5085910 -5054914 -5037148 -5002787 -5030888 -5013748 -4978669
8519 -4978669 -4961643 -4926588 -4883957 -4866755 -4878295 -4883132 -4833695 -4849334 -4855525 -4833870 -4777118 -4743267
8507 -4743267 -4727273 -4727275 -4761206 -4774300 -4750342 -4771923 -4773040 -4727399 -4679833 -4683617 -4668858 -4642206 -4641456
8494 -4641456 -4602004 -4558659 -4551354 -4562179 -4538335 -4521646 -4489785 -4498775 -4533332 -4518811 -4549843 -4528085
8482 -4528085 -4459967 -4389764 -4360160 -4341427 -4330240 -4333164 -4352912 -4317083 -4315829 -4305433 -4273999 -4217457
8470 -4217457 -4155950 -4168247 -4129971 -4104732 -4150603 -4185305 -4169412 -4161827 -4113748 -4045184 -4030430 -4013097
8458 -4013097 -3984280 -3981254 -4007560 -4020810 -4038429 -4050692 -4063682 -4111815 -4160761 -4220423 -4288063 -4292987
$$ packed form
8544e474346J2L5750k8653Q600M2161M7485P2370r269K1837K5902R206J9134J5195
8531e214616J5287K9967J9308L6499K8784j139L0996J7766L4361k8101J7140L5079
8519d978669J7026L5055M2631J7202j1540m837M9437j5639o191K1655N6752L3851
8507d743267J5994kl3931j3094K3958k1581j117M5641M7566l784J4759K6652P50
8494d641456L9452M3345P305j0825K3844J6689L1861q990l4557J4521l1032K1758
8482d528085O8118P0203K9604J8733J1187k924j9748L5829J254J0396L1434N6542
8470d217457O1507j2297L8276K5239m5871l4702J5893P585M8079O8564J4754J7333
8458d013097K8817L026k6306j3250j7619j2263j2990m8133m8946n9662o7640m924
$$ plain form
8446 -4292987 -4241069 -4196652 -4199512 -4183900 -4165822 -4127486 -4100783 -4068721 -4017085 -3981616 -3978421 -3989394
8434 -3989394 -3987038 -3988457 -3971330 -4008200 -4007750 -3960037 -3922668 -3879448 -3853470 -3778481 -3743782 -3784161
8422 -3784161 -3794819 -3762426 -3746225 -3723972 -3666210 -3645919 -3620490 -3595017 -3579627 -3557811 -3553585 -3549889
8410 -3549889 -3617429 -3615115 -3610856 -3651043 -3751583 -3946883 -4194728 -4346648 -4343719 -4272588 -4203747
8399 -4203747 -4127051 -4078355 -4076643 -4067535 -4009774 -3958200 -3896023 -3864562 -3856590 -3819933 -3797124 -3784280
8387 -3784280 -3757812 -3721970 -3695855 -3701115 -3718607 -3705238 -3706629 -3705425 -3653799 -3613497 -3674440 -3710560
8375 -3710560 -3682894 -3633058 -3562990 -3512320 -3465175 -3462785 -3467854 -3444700 -3416730 -3430163 -3462189 -3460151
8363 -3460151 -3432326 -3430572 -3483546 -3573373 -3664785 -3694667 -3736742 -3762100 -3700209 -3637443 -3601505 -3539321
$$ packed form
8446d292987N1918M4417k860J5612J8078L8336K6703L2062N1636L5469L195j0973
8434c989394K356j419J7127l6870M50M7713L7369M3220K5978P4989L4699m0379
8422c784161j0658L2393J6201K2253N7762K0291K5429K5473J5390K1816M226L696
8410c549889o7540K314M259m0187j00540j95300k47845j51920K929P1131O8841
8399d203747P6696M8696J712R108N7761N1574O2177L1461P972L6657K2809J2844
8387c784280K6468L5842K6115n260j7492J3369j391J204N1626M0302o0943l6120
8375c710560K7666M9836P0068N0670M7145K390n069K3154K7970j3433l2026K038
8363c460151K7825J754n2974q9827r1412k9882m2075k5358O1891O2766L5938O2184
$$ plain form
8351 -3539321 -3499392 -3471879 -3480131 -3498727 -3524915 -3540186 -3532984 -3539477 -3507174 -3505982 -3491630 -3510813
8339 -3510813 -3499199 -3452859 -3402539 -3378526 -3384012 -3409207 -3388244 -3342681 -3354085 -3386802 -3349232 -3293085
8327 -3293085 -3357228 -3394836 -3387097 -3382632 -3376062 -3366187 -3336143 -3366056 -3341019 -3329376 -3346323 -3322900
8315 -3322900 -3321326 -3318201 -3308832 -3303267 -3264980 -3241133 -3225415 -3196066 -3205221 -3235028 -3263968 -3208838
8303 -3208838 -3194169 -3224774 -3267404 -3216584 -3191869 -3201972 -3153551 -3158198 -3176226 -3154888 -3144351 -3153346
8291 -3153346 -3160280 -3146525 -3135962 -3105143 -3098925 -3082184 -3041745 -3025137 -3037493 -3035289 -3076209 -3080512
8279 -3080512 -3040613 -3033306 -3056284 -3073460 -3056179 -3041031 -3019378 -3033672 -3048519 -3074876 -3078168 -3059518
8267 -3059518 -3023449 -3009917 -3002297 -3001350 -3018464 -3021653 -3009034 -2951805 -2906152 -2912696 -2904397 -2904366 -2923893
$$ packed form
8351c539321L9929K7513q252j8596k6188j5271P202o493L2303J192J4352j9183
8339c510813J1614M6340N0320K4013n486k5195K0963M5563j1404l2717L7570N6147
8327c293085o4143l7608P739M465O570R875L0044k9913K5037J1643j6947K3423
8315c322900J574L125R369N565L8287K3847J5718K9349r155k9807k8940N5130
8303c208838J4669l0605m2630N0820K4715j0103M8421m647j8028K1338J0537q995
8291c153346o934J3755J0563L0819O218J6741M0439J6608j2356K204m0920m303
8279c080512L9899P307k2978j7176J7281J5148K1653j4294j4847k6357l292J8650
8267c059518L6069J3532P620R47j7114l189J2619N7229M5653o544Q299L1j9527
$$ plain form
8254 -2923893 -2934105 -2903896 -2910030 -2957468 -2972543 -2962749 -2937914 -2954854 -2959811 -2981796 -2966593 -2924028
8242 -2924028 -2943040 -2897250 -2884645 -2901919 -2899808 -2919843 -2925388 -2924590 -2893556 -2868173 -2880109 -2886536
8230 -2886536 -2867381 -2793258 -2737855 -2783926 -2877935 -2896287 -2872922 -2821495 -2782134 -2761744 -2747205
8219 -2747205 -2752600 -2779763 -2751408 -2750315 -2780260 -2787164 -2766824 -2735831 -2748554 -2776425 -2745238 -2727112
8207 -2727112 -2742392 -2775008 -2787452 -2746666 -2754902 -2748502 -2747773 -2710948 -2679848 -2678734 -2680166 -2691348 -2680097
8194 -2680097 -2680938 -2699264 -2710366 -2707170 -2679094 -2688918 -2692327 -2649138 -2652840 -2615354 -2592342 -2608201 -2618038
8181 -2618038 -2587026 -2543079 -2550289 -2643387 -2628278 -2583442 -2578525 -2586082 -2569247 -2596312 -2582448 -2554436
$$ packed form
8254b923893j0212L0209o134m7438j5075R794K4835j6940m957k1985J5203M2565
8242b924028j9012M5790J2605j7274K111k0035n545P98L1034K5383j1936o427
8230b886536J9155P4123N5403m6071r4009j8352K3365N1427L9361K0390J4539
8219b747205n395k7163K8355J093k9945o904K0340L0993j2723k7871L1187J8126
8207b727112j5280l2616j2444M0786q236O400P29L6825L1100J114j432j1182J1251
8194b680097q41j8326j1102L196K8076r824l409M3189l702L7486K3012j5859r837
8181b618038L1012M3947p210r3098J5109M4836M917p557J6835k7065J3864K8012
$$ [...]
##END NTUPLES=NMR SPECTRUM
##END=
