##TITLE=Analysis number 315475
Compound Code cc 47101
Book Reference 437/55
Project Code adrs
Chemist Name wendyb
##JCAMPDX= 6.0         $$ Bruker NMR JCAMP-DX V2.0
##DATA TYPE= NMR SPECTRUM
##DATA CLASS= NTUPLES
##ORIGIN= Bruker BioSpin GmbH
##OWNER= NMR
$$ XWIN-NMR		Version 3.5
$$ Mon Nov 21 11:52:06 2005 GMT Standard Time (UT+0h)  MAYBRIDGE\NMR@NMR_250MHZ
##.OBSERVE FREQUENCY= 250.131544655141
##.OBSERVE NUCLEUS= ^1H
##.ACQUISITION MODE= SIMULTANEOUS (DQD)
##.ACQUISITION SCHEME= undefined
##.AVERAGES= 16
##.DIGITISER RES= 18
##SPECTROMETER/DATA SYSTEM= dpx250
##.PULSE SEQUENCE= zg30
##.SOLVENT NAME= DMSO
##.SHIFT REFERENCE= (INTERNAL, DMSO, 0, 16.522)
##AUDIT TRAIL= $$ (NUMBER, WHEN, WHO, WHERE, WHAT)
$$ ##TITLE= Audit trail, XWIN-NMR		Version 3.5
$$ ##JCAMPDX= 5.01
$$ ##ORIGIN= Bruker BioSpin GmbH
$$ ##OWNER= NMR
$$ C:\u/data/dgb/nmr/ADRS/12720/pdata/1/auditp.txt
$$ ##AUDIT TRAIL=  $$ (NUMBER, WHEN, WHO, WHERE, WHAT)
(   1,<2005-11-21 11:51:25.37 +000>,<MAYBRIDGE\NMR>,<NMR_250MHZ>,
      <created by zg, POWCHK disabled, PULCHK disabled
       configuration hash MD5:
       62 19 C7 07 E1 42 D1 B7 37 6C 3D D0 77 39 F9 E6
       data hash MD5: 64K
       BB 36 0B 49 3E 5D C9 53 B1 4B 80 09 27 64 15 B6>)
(   2,<2005-11-21 11:51:43.23 +000>,<MAYBRIDGE\NMR>,<NMR_250MHZ>,
      <Start of raw data processing
       ef LB = 0.3 FT_mod = 6 PKNL = 1 SI = 32K 
       data hash MD5: 32K
       F3 93 D6 2B A4 EE BD F7 B7 18 F2 1A AA AC C9 1F>)
(   3,<2005-11-21 11:51:47.59 +000>,<MAYBRIDGE\NMR>,<NMR_250MHZ>,
      <apk 
       data hash MD5: 32K
       CC B5 49 93 FA 6B B8 95 70 C9 32 1F C8 84 CF 61>)
(   4,<2005-11-21 11:51:48.90 +000>,<MAYBRIDGE\NMR>,<NMR_250MHZ>,
      <abs ABSG = 5 
       data hash MD5: 32K
       E2 3D 29 18 1E 21 2E 80 CD 86 D6 D6 61 52 35 05>)
$$ ##END=
$$ 
$$ hash MD5
$$ BB 54 37 78 D9 10 22 E3 4D E5 46 77 D9 5C AD E7
##$RELAX= 
##$RELAX= 
##$RELAX= 
##$RELAX= 
##$RELAX= 
##$RELAX= 
##$RELAX= 
$$ Bruker specific parameters
$$ --------------------------
##$DU= <C:\u>
##$EXPNO= 12720
##$NAME= <ADRS>
##$PROCNO= 1
##$TYPE= <nmr>
##$USER= <dgb>
##$AMP= (0..31)
100 100 100 100 100 100 100 100 100 100 100 100 100 100 100 100 100 100 
100 100 100 100 100 100 100 100 100 100 100 100 100 100 
##$AQSEQ= 0
##$AQ_mod= 3
##$AUNM= <au_zg>
##$AUTOPOS= <20 >
##$BF1= 250.13
##$BF2= 250.13
##$BF3= 250.13
##$BF4= 250.13
##$BF5= 500.13
##$BF6= 500.13
##$BF7= 500.13
##$BF8= 500.13
##$BYTORDA= 1
##$CFDGTYP= 0
##$CFRGTYP= 5
##$CHEMSTR= <none>
##$CNST= (0..31)
1 1 145 1 1 1 1 1 1 1 1 1 1 1 1 1 1 1 1 1 1 1 1 1 1 1 1 1 1 1 1 1 
##$CPDPRG= <>
##$CPDPRG1= <>
##$CPDPRG2= <>
##$CPDPRG3= <>
##$CPDPRG4= <mlev>
##$CPDPRG5= <mlev>
##$CPDPRG6= <mlev>
##$CPDPRG7= <mlev>
##$CPDPRG8= <mlev>
##$CPDPRGB= <>
##$CPDPRGT= <>
##$D= (0..31)
0 1 0 0 0 0 0 0 0 0.06 0 0 0 0 0 0 0.0002 0 0 0 0 0 0 0 0 0 0 0 0 0 0 
0 
##$DATE= 1132573882
##$DBL= (0..7)
120 120 120 120 120 120 120 120 
##$DBP= (0..7)
150 150 150 150 150 150 150 150 
##$DBP07= 0
##$DBPNAM0= <>
##$DBPNAM1= <>
$$ [...]
##$SUBNAM7= <"">
##$SUBNAM8= <"">
##$SUBNAM9= <"">
##$SW= 20.6930455092707
##$SWIBOX= (0..15)
0 0 3 0 0 0 0 0 0 0 0 0 0 0 0 0 
##$SW_h= 5175.983436853
##$TD= 65536
##$TD0= 1
##$TE= 294.16
##$TE2= 300
##$TE3= 300
##$TEG= 300
##$TL= (0..7)
0 120 120 120 120 120 120 120 
##$TP= (0..7)
150 150 150 150 150 150 150 150 
##$TP07= 0
##$TPNAME0= <>
##$TPNAME1= <>
##$TPNAME2= <>
##$TPNAME3= <>
##$TPNAME4= <>
##$TPNAME5= <>
##$TPNAME6= <>
##$TPNAME7= <>
##$TPOAL= (0..7)
0.5 0.5 0.5 0.5 0.5 0.5 0.5 0.5 
##$TPOFFS= (0..7)
0 0 0 0 0 0 0 0 
##$TUNHIN= 0
##$TUNHOUT= 0
##$TUNXOUT= 0
##$USERA1= <user>
##$USERA2= <user>
##$USERA3= <user>
##$USERA4= <user>
##$USERA5= <user>
##$V9= 5
##$VALIST= <valist>
##$VCLIST= <CCCCCCCCCCCCCCC>
##$VD= 0
##$VDLIST= <DDDDDDDDDDDDDDD>
##$VPLIST= <PPPPPPPPPPPPPPP>
##$VTLIST= <TTTTTTTTTTTTTTT>
##$WBST= 1024
##$WBSW= 4
##$XGAIN= (0..3)
0 0 0 0 
##$XL= 0
##$YL= 0
##$YMAX_a= 438178
##$YMIN_a= -313073
##$ZGOPTNS= <>
##$ZL1= 120
##$ZL2= 120
##$ZL3= 120
##$ZL4= 120
##$ABSF1= 16.522
##$ABSF2= -4.171173
##$ABSG= 5
##$ABSL= 3
##$ALPHA= 0
##$AQORDER= 0
##$ASSFAC= 0
##$ASSFACI= 0
##$ASSFACX= 0
##$ASSWID= 0
##$AUNMP= <proc_1d>
##$AZFE= 0.1
##$AZFW= 0.1
##$BCFW= 0
##$BC_mod= 0
##$BYTORDP= 0
##$COROFFS= 0
##$CY= 12.5
##$DATMOD= 1
##$DC= 0
##$DFILT= <>
##$DTYPP= 0
##$F1P= 14.0000005364418
##$F2P= -0.99999901652339
##$FCOR= 0.5
##$FTSIZE= 32768
##$FT_mod= 6
##$GAMMA= 0
##$GB= 0
##$INTBC= 1
##$INTSCL= 1
##$ISEN= 128
##$LB= 0.3
##$LEV0= 0
##$LPBIN= 0
##$MAXI= 10000
##$MC2= 0
##$MEAN= 0
##$ME_mod= 0
##$MI= 0
##$NCOEF= 0
##$NC_proc= -3
##$NLEV= 6
##$NOISF1= 0
##$NOISF2= 0
##$NSP= 0
##$NTH_PI= 0
##$NZP= 0
##$OFFSET= 16.522
##$PC= 1
##$PHC0= 72.73492
##$PHC1= 13.73833
##$PH_mod= 1
##$PKNL= yes
##$PPARMOD= 0
##$PSCAL= 4
##$PSIGN= 0
##$REVERSE= no
##$SF= 250.13
##$SI= 32768
##$SIGF1= 0
##$SIGF2= 0
##$SINO= 400
##$SIOLD= 32768
##$SREGLST= <1H.DMSO>
##$SSB= 0
##$STSI= 32768
##$STSR= 0
##$SW_p= 5175.98343685301
##$SYMM= 0
##$S_DEV= 0
##$TDeff= 65536
##$TDoff= 0
##$TI= <Analysis number 999999
Compound Code 99
Book Reference 9
Project Code 9>
##$TILT= no
##$TM1= 0
##$TM2= 0
##$TOPLEV= 0
##$USERP1= <user>
##$USERP2= <user>
##$USERP3= <user>
##$USERP4= <user>
##$USERP5= <user>
##$WDW= 1
##$XDIM= 32768
##$YMAX_p= 409735126
##$YMIN_p= -549942
$$ End of Bruker specific parameters
$$ ---------------------------------
##NTUPLES= NMR SPECTRUM
##VAR_NAME=  FREQUENCY,     SPECTRUM/REAL,   SPECTRUM/IMAG
##SYMBOL=    X,             R,               I
##VAR_TYPE=  INDEPENDENT,   DEPENDENT,       DEPENDENT
##VAR_FORM=  AFFN,          ASDF,            ASDF
##VAR_DIM=   32768,         32768,           32768
##UNITS=     HZ,            ARBITRARY UNITS, ARBITRARY UNITS
##FACTOR=    0.157963299565203, 1,           1
##FIRST=     4132.6476996994, 0,             0
##LAST=      -1043.33573715361, 0,           0
##MIN=       -1043.33573715361, -549942,     0
##MAX=       4132.6476996994, 409735126,     0
$$ Real data points
##PAGE= N=1
##DATA TABLE= (X++(R..R)), XYDATA
$$ [...]
18644A42895J5180K6785n604o5963k9153P1389K7529j0606r6203j9898J9849Q1427
18632A57627M9582P2249P4554M0143r267l2274l6209l9596m7142L0176N5543K3841
18620C39227j0511k6052p6434l9462p271K939O5797J1597n4554J2429L2235L8850
18608B88790O9769Q2809L7837k7826l3505q7455m0467j1626O5167J8145l5977
18597C25661j6208L3164L5927K9757J3019o2240o4261l251p309J0630K7963j1912
18585C10940j2531J4413J0294L495J3784K020k6714K484J8731N3517K1189N690
18573D17312O9863J4519l4636o1633k4071P501k4455j9974O4501J4781m5739Q819
18561C86788K6344Q556l583m8914k9325n2272L4441r007J3579N6497J7782k2887
$$ y = [142895, 158075, 184860, 179256, 113293, 84140, 155529, 183058, 172452, 76249, 56351, 76200, 157627, 207209, 279458, 354012, 394155, 384888, 352614, 316405, 276809, 229667, 259843, 315386, 339227, 328716, 302664, 226230, 186768, 179497, 182436, 248233, 259830, 205276, 217705, 249940, 288790, 358559, 441368, 479205, 451379, 417874, 330419, 289952, 278326, 343493, 361638, 325661, 309453, 342617, 378544, 408301, 421320, 359080, 294819, 291568, 284259, 294889, 322852, 310940, 298409, 312822, 323116, 326611, 340395, 342415, 315701, 318185, 336916, 390433, 411622, 417312, 487175, 501694, 467058, 405425, 381354, 388855, 364400, 344426, 408927, 423708, 377969, 386788, 413132, 421688, 418105, 369191, 339866, 287594, 322035, 313028, 326607, 383104, 400886, 377999]
18549C77999j8957M457J3339j0443O6069k4052K2481N7202N4918N7904j464j8709
18537E80744N905Q647j8697J7436R1751K9267P3616P2689J6811L9168Q0922M8261
18525A046520M2693K8546M0308Q0440J10505M5707N085P9558R6682Q1188J34880
18514A792112M3933J18888K27400K46028K69300K69985K03453K32521L86152M88985
18504D278757N43578P13668J097052J676112K680729M384612P510966J0849772
18496C3735246Q025407j901527o549172l856431p8589L538101P646013Q609483
18488D9168531R6639r069551q896732n427066l107290j992045j539238j423308
18480A7809940j414687j015017o2625J594517L963506P920186J2310346Q830827
$$ y = [377999, 359042, 363499, 376838, 366395, 432464, 408412, 430893, 488095, 543013, 600917, 599453, 580744, 586649, 595296, 576599, 594035, 685786, 715053, 788669, 861358, 878169, 917337, 998259, 1046520, 1089213, 1117759, 1158067, 1238507, 1349012, 1394719, 1399804, 1479362, 1576044, 1657232, 1792112, 1836045, 1954933, 2182333, 2428361, 2697661, 2967646, 3171099, 3403620, 3789772, 4278757, 4822335, 5536003, 6633055, 8309167, 10989896, 15374508, 22885474, 33735246, 41760653, 39859126, 33309954, 29453523, 29374934, 32913035, 40559048, 49168531, 49265170, 40195619, 31298887, 25871821, 22764531, 20772486, 19233248, 17809940, 16395253, 15380236, 15317611, 16912128, 20875634, 28795820, 41106166, 49936993]
18472D9936993l095799q024128m830585n80240L400216P911727Q874896m33515
18464E3159565r947092r939472o344510l880978k792777k340401k274028k484110
18456A3156197k459714j939102j333564q95192p69214o07745n35085m76427l93907
18447C746247k77678j82754j24550j24293k14994k95876k37488j43386j22034
18438B023194j75506j46251q9924r3172r2742j00017j42346p2837o459K9616K386
18427A135942L349l3669J4735R2132J89454K19062Q4005p8231j39947j99171j24960
18416A162701q0082l5913n3192k1235O716j30773j78443j03851q8705j4758N0672
18405E13137q9050j00187p2721q4629l0944P7395K5255L320m9494k3951J4031
$$ y = [49936993, 46841194, 38817066, 33986481, 33406241, 36806457, 44718184, 53593080, 53159565, 43212473, 33273001, 26928491, 23047513, 20254736, 17914335, 15640307, 13156197, 10696483, 8757381, 7423817, 6528625, 5759411, 5151666, 4616581, 4140154, 3746247, 3468569, 3285815, 3161265, 3036972, 2821978, 2526102, 2288614, 2145228, 2023194, 1847688, 1701437, 1611513, 1518341, 1425599, 1325582, 1183236, 1110399, 1103940, 1133556, 1135942, 1139291, 1105622, 1120357, 1212489, 1401943, 1621005, 1705010, 1626779, 1486832, 1287661, 1162701, 1082619, 1046706, 993514, 972279, 978995, 848222, 669779, 565928, 477223, 462465, 513137, 424087, 323900, 251179, 166550, 135606, 213001, 238256, 241576, 192082, 168131, 182162]
18394A82162o3334p6035m7045M5023m899M2353P4190l674r422k3716k3810K113
18382I3906j3228k1992j505J702K463K2269K9086J6091K1150m5002L0906n6930
18370G8916o8057K9931N8578N245m0125n4350O21J3069N6354M6625J8754p6262
18358F9299l6128L0972l6322k5120J2264r909J0514M6734r766m358N3588K8438
18346A30206j8532m331n1850k1334q96q866M183M1978M3392l6895p6607K8449
18334B8897P494q877O1523L4329k0946m7336J6883M0808K3003J6204Q983j3195
18322A47770J7856j1694M857k5418R503K3652j8277l8818o20M3967n279o858K2749
18309A63390J0255l2146o5328j3808J8403M2392L0799m0081k0506j2977K849J5783
$$ y = [182162, 118828, 42793, -4252, 40771, 35872, 78225, 152415, 148741, 139319, 115603, 91793, 93906, 80678, 58686, 57181, 58883, 61346, 83615, 112701, 128792, 149942, 104940, 135846, 78916, 10859, 40790, 99368, 104613, 64488, 10138, 10759, 23828, 80182, 126807, 145561, 69299, 33171, 64143, 27821, 2701, 14965, 5056, 15570, 62304, 52538, 48180, 101768, 130206, 111674, 107343, 55493, 34159, 33263, 24397, 28580, 70558, 113950, 77055, 448, 28897, 36391, 27514, 89037, 123366, 102420, 55084, 71967, 112775, 135778, 151982, 160965, 147770, 165626, 153932, 158789, 133371, 142874, 166526, 148249, 109431, 108811, 152778, 147499, 140641, 163390, 173645, 141499, 76171, 62363, 80766, 123158, 153957, 113876, 93370, 80393, 83242, 99025]
18297I9025J5794j9474l011O857o0656L9312N7236O88L4838L5457M7896M3142
18285B97104j6182p1369n9044J030M4788J2918J0919K1142p241m4896k1667j1069
18273A56433j4343k6079n3803M2366k5902n1312l211j2630N7239M3384K8983L0905
18261A72030j0601n003k6476J7612L1493L0999l4021q9970N7813N3178L4498n0363
18249A81189l1496L0275O523m8674L985R540R458j7682o152L048m1566p918m1232
18236D9298o69M505M5264J0922K2361M0529J1874K851l1672j3766J8862n141o066
18223A49152l3423k9496K8708P2020k8766k8317N5398K4492r797m656j292K911
18211A96934j868j5826k933j7825m7611j388M4873J2365n277J5497O471K0533
$$ y = [99025, 114819, 95345, 92334, 99191, 38535, 77847, 135083, 135771, 170609, 206066, 253962, 297104, 280922, 209553, 150509, 151539, 196327, 209245, 220164, 241306, 234065, 189169, 167502, 156433, 142090, 116011, 62208, 104574, 78672, 27360, 24149, 11519, 68758, 112142, 141125, 172030, 161429, 156426, 129950, 147562, 179055, 210054, 176033, 86063, 143876, 197054, 231552, 181189, 149693, 179968, 186491, 137817, 141802, 151342, 160800, 143118, 136966, 140014, 98448, 90530, 49298, 48629, 53134, 98398, 109320, 131681, 172210, 184084, 186935, 155263, 141497, 160359, 155218, 149152, 115729, 86233, 114941, 186961, 158195, 129878, 185276, 209768, 199971, 195315, 194023, 196934, 195066, 179240, 176307, 158482, 110871, 109483, 154356, 166721, 161444, 176941, 183412, 203945]
18199B03945r548J0016n941J1971O155J1046l3590k2084K2084K3743N663J2912
18187B36372j4183K223j5619m2635j3589N2713J3783l0196j7016k2059M0861Q415
18175A99070o9706n0084J2282P1000J1607n155m114p553K4444k4968N3120K2916
18163B32859K1238J3248k6189K7914j1950j4403K3677o757K4660k6362K5049K1298
18151C04282r176l1285M0865N1857m2361q092M3899j2350m8060J6695M531L7457
18139C48262J3812J9757M0147K2203J2620J1563M7500l5108k4165Q1644J45844
18128F84079M0988M593l5107j1519L98L6538P8795P2084P1601M4568J15764Q8425
18116A191207J17925J65967J79283J51842J48629J71784J67051J50754J22205
$$ y = [203945, 194397, 204413, 198472, 210443, 216598, 227644, 194054, 171970, 194054, 217797, 223460, 236372, 222189, 224412, 208793, 166158, 152569, 205282, 219065, 188869, 171853, 149794, 190655, 199070, 129364, 79280, 91562, 162562, 174169, 169014, 164900, 157347, 181791, 156823, 209943, 232859, 254097, 267345, 241156, 269070, 257120, 242717, 266394, 259637, 284297, 257935, 282984, 304282, 295106, 263821, 304686, 356543, 314182, 306090, 349989, 337639, 289579, 306274, 310805, 348262, 362074, 381831, 421978, 444181, 456801, 468364, 515864, 480756, 456591, 538235, 684079, 725067, 729660, 694553, 683034, 683432, 719970, 798765, 870849, 942450, 987018, 1102782, 1191207, 1309132, 1475099, 1654382, 1806224, 1954853, 2126637, 2293688, 2444442, 2566647]
18107B566647J09840J53870K81505L47460M60197O12889Q92602J406137K291862
18098I123009L876023P142433J2591639J4303564j185272j1134399q041710m228756
18090B2446531k424438j912518j726206j855252k338685k255036j568124r06189
18082G460083n31035j88536R0923K78023O51685J223178K053152L516364O234365
18073B0788202J0545425J1435184m22846q389413o152317k784248o12811J134262
18065B5541438L462162P219416J0403920L019297r062154r460995n882527l420644
18057B1819913k380243j958914j948814k298561k386451j876915j253788q55766
18049F860461m88004k08901N0647L34247P05540J236248K232778M310009Q101465
$$ y = [2566647, 2676487, 2830357, 3111862, 3459322, 3919519, 4532408, 5425010, 6831147, 9123009, 12999032, 20141465, 32733104, 47036668, 45851396, 34716997, 26675287, 22446531, 20022093, 18109575, 16383369, 14528117, 12189432, 9934396, 8366272, 7460083, 6929048, 6740512, 6831435, 7109458, 7761143, 8984321, 11037473, 14553837, 20788202, 31333627, 42768811, 42345965, 33956552, 27804235, 25019987, 24407176, 25541438, 29003600, 36223016, 46626936, 49646233, 40584079, 31123084, 25240557, 21819913, 19439670, 17480756, 15531942, 13233381, 10846930, 8970015, 7716227, 6860461, 6372457, 6163556, 6214203, 6548450, 7253990, 8490238, 10723016, 15033025, 23134490]
18040B3134490J2535701N588046q142159q543611m905404k677546j830178j608449
18032A3550890j643155j975329k131130j673098j269460r39581o33622m85165
18024B800350l67944k16088j92854j00704j76698k02883j40947j22511j22334
18015A157387j07043n2924n1993n4745p4398n0721n3679j556N3794m4658r4391
18004F25073P53n0916o4608q4191K37j3658M746r6279j04930m7351K151N2554
17992B23581p746R040J1029l6212O473k5934q1191P814K9624k3997K0484L1420
17980A64385K4520L6271N357o6801n4167m2661l4163L511J1774P0183L3689O89
17968A52587j3174j7673Q563k5541l5924N238J2637P1363N2072K5019M0719k180
$$ y = [23134490, 35670191, 41258237, 33116078, 24572467, 19667063, 16989517, 15159339, 13550890, 11907735, 9932406, 7801276, 6128178, 4858718, 3919137, 3285515, 2800350, 2432406, 2216318, 2023464, 1922760, 1746062, 1543179, 1402232, 1279721, 1157387, 1050344, 997420, 945427, 890682, 816284, 765563, 711884, 710328, 764122, 719464, 625073, 625826, 574910, 510302, 426111, 426348, 412690, 417436, 321157, 216227, 168876, 171027, 223581, 215835, 224875, 235904, 199692, 206165, 180231, 99040, 106854, 136478, 112481, 132965, 164385, 188905, 225176, 230533, 163732, 109565, 66904, 32741, 36252, 48026, 118209, 151898, 152587, 139413, 121740, 130303, 104762, 68838, 74076, 86713, 158076, 210148, 235167, 275886, 273706]
17956B73706K3662J2577m5497j2885j4469L8687K3076L0340M1545k0268p7768
17945B72706q1334m3273m0955J9011J6641L3539l8857m8074K4560J6458K5306
17934A55728N1040N41M068j162k9817l4383k449J7481K2656K6805l8438n7744
17922A14326m7956o7290J7054O878k0471j5804k6166L2692O2167l8746j8229J1841
17910A0296k7783M87K6045l3747l8374n9049J4801J5380p881Q3009P6020N7954
17898A17158J2405o3145j6122m611k045k2174l6677l2170J6097P5463J4559k6400
17886C2338j1345k8364L194j6760k6756J1223K4185L9039O78K7359L202n9893
17874a900J5096l8394P866J8352K8336M6916L8689N9316M0669K9308N3896J36380
$$ y = [273706, 297368, 309945, 264448, 251563, 237094, 275781, 298857, 329197, 370742, 350474, 272706, 191372, 148099, 107144, 126155, 142796, 176335, 137478, 89404, 113964, 130422, 155728, 206768, 207309, 211377, 210215, 180398, 146015, 143566, 161047, 183703, 210508, 172070, 114326, 66370, -920, 16134, 23012, 2541, -13263, -39429, -6737, 55430, 16684, -1545, 10296, -17487, -17000, 9045, -24702, -63076, -122125, -107324, -91944, -99825, -16816, 59204, 117158, 129563, 66418, 50296, 45685, 43640, 21466, -15211, -47381, -31284, 44179, 58738, 32338, 20993, -7371, -4177, -20937, -47693, -36470, -12285, 26754, 27432, 54791, 57993, -1900, 13196, -25198, -17332, 1020, 29356, 76272, 114961, 174277, 214946, 244254, 298150, 434530]
17862D34530J19667n4902n8440n0345m1418j254K375n3105p8341m999R911J6039
17850B39718j0361L4428M3790K4778O405r527R132R0307Q6430O4208J02618J04271
17838G86197R240n7580o8570j9995K1926J7013J282k6930j12249j25993l1958
17827C92383k5504n213o488p3048j37589K668N0797L0656k4628j0937o177j7963
17815A68957m5229k9430J0250L3059K4051M6456O6338P3295P577l6038o6110p6023
17803A77153k3698l4839k9106L0829N3057L1919r088l0421l0973J227k8195m1749
17791F6116o1569j7910O8143J4029N309M7170J9041R280L895k3665l370L966L766
17778A34201q750m5369j9453j5161L8248Q264l7689j449K9000L3040K6126K4539
$$ y = [434530, 554197, 499295, 440855, 390510, 349092, 347838, 350213, 297108, 218767, 213768, 223679, 239718, 229357, 263785, 307575, 332353, 338758, 329231, 338363, 428670, 515100, 579308, 681926, 786197, 795437, 737857, 669287, 649292, 671218, 688231, 689513, 662583, 550334, 424341, 392383, 366879, 361666, 355178, 282130, 144541, 147209, 198006, 228662, 204034, 193097, 186920, 168957, 123728, 94298, 104548, 137607, 161658, 208114, 274452, 347747, 355324, 319286, 253176, 177153, 153455, 118616, 89510, 120339, 173396, 205315, 196227, 165806, 134833, 136060, 107865, 66116, 4547, -13363, 54780, 68809, 74118, 121288, 140329, 149609, 153504, 129839, 126469, 130435, 134201, 125451, 80082, 60629, 45468, 83716, 91980, 54291, 52842, 81842, 114882, 141008, 165547]
17766A65547k3191L337N26m3504j8295l3128j6157L475m1694N790j3989l502K6345
17753A1560L3479j0390M6997j254l6070N639M71R443j3577j026j42J6846o239
17740E5737n589M0469K5091k3549J9911R665K3229O0073N9548K5602l1025l1987
17728B27175k5360j0138n805m9555k3822k2460j2572o3912n2226K0961N4640K017
17716C8943m978M039K9258M3429n3518k7737J0094M2050K2527j3151k2082k7436
17704D1438M6835p365m4697j0367j4304K9101k1245p141L9532O7653L4372Q579
17692A62391J4186k6000o0189l5750L3123N9263j3404o3801j8297J76J6433k945
17680F5186j1353l6183j5946o63N1191J5500l00N1515N3736L4710M4399P466n5361
$$ y = [165547, 142356, 145693, 146219, 102715, 84420, 51292, 35135, 38610, -3084, 2706, -11283, -14785, 11560, 45039, 34649, 81646, 80392, 44322, 49961, 50432, 59875, 46298, 45272, 45130, 61976, 55737, 50148, 90617, 115708, 92159, 112070, 121735, 144964, 205037, 264585, 290187, 259162, 227175, 201815, 191677, 185872, 136317, 112495, 90035, 77463, 13551, -38675, -17714, 36926, 38943, 33965, 38004, 67262, 110691, 57173, 29436, 39530, 81580, 104107, 90956, 68874, 41438, 88273, 80908, 36211, 25844, 11540, 40641, 19396, 12255, 51787, 119440, 153812, 162391, 176577, 150577, 90388, 54638, 87761, 147024, 133620, 69819, 51522, 51698, 68131, 65186, 53833, 17650, 1704, 1041, 52232, 67732, 67432, 118947, 172683, 207393, 251792, 259258, 203897]
17667B03897k1494M6513Q589n8480j1259K8323r432n6311M012o276J2791J4041
17655A54914j5287l2950n926M9749m425k2555J6773o88M5850r919j8949J1619
17643A68206l1818k0953O94M2540l2459j2543J3262M6218M9348K0202M4304L4745
17631C21746n1016p8622m241j9916l508l178J3987M6334K2731M7526L0128P329
17619C29300n2136k1910j1514l4377m567k4685L5232L4227K2461Q3656K6851M967
17607C87505k4790k9030m6024K7927M7081k4083R557J6988K286M2085J4798L7454
17595D61754L0501L7604K4131m3949j0174L3196M6415k3788J4271J8434N6161
17584F44556J03232N6321K1320L3011M2194J05985J10693J93181L03263M05846
$$ y = [203897, 182403, 228916, 237505, 179025, 167766, 196089, 186657, 130346, 134358, 128082, 140873, 154914, 139627, 106677, 100751, 150500, 146075, 123520, 140293, 139605, 185455, 175536, 156587, 168206, 136388, 115435, 116129, 158669, 126210, 113667, 126929, 173147, 222495, 242697, 287001, 321746, 270730, 192108, 187867, 167951, 164443, 161265, 175252, 221586, 244317, 291843, 321971, 329300, 277164, 255254, 243740, 209363, 204796, 180111, 215343, 249570, 272031, 355687, 382538, 387505, 362715, 333685, 287661, 315588, 362669, 338586, 348143, 365131, 367417, 409502, 424300, 461754, 492255, 529859, 553990, 510041, 499867, 533063, 579478, 555690, 569961, 588395, 644556, 747788, 804109, 825429, 858440, 900634, 1006619, 1117312, 1310493, 1613756, 2019602]
17574B019602K90055J6524j54739q7003P0092K03312K57344K10249L9702n0734
17564B814404n6012O5542K18181K46170J59325K77432L47524M31364O64947Q65604
17554F034481Q74377Q68406J123686J596915K340995L578112N681764R423383
17546C1522119J6445199K9529201M5020083L5950298p839868l4050357k7463591
17539H9113084j5538516r276765p055587o779958p676473q752047q090739o006101
17531A9936898m011687k711575k101799j778640j351622r46621p28130o85403
17523E621421o44279n71458m50890l69848l19690j74757R094l620j96751l99278
17513B499944l68096k20463j93795j94638j04748r5552j06568r5341r6087j32196
$$ y = [2019602, 2309657, 2326181, 2171442, 2084439, 2154531, 2357843, 2615187, 2825436, 2865138, 2814404, 2758392, 2823934, 3042115, 3288285, 3447610, 3725042, 4072566, 4503930, 5168877, 6034481, 6908858, 7777264, 8900950, 10497865, 12838860, 16416972, 22098736, 31522119, 47967318, 77496519, 122516602, 158466900, 150627032, 116576675, 89113084, 73574568, 64297803, 57242216, 50462258, 42785785, 34033738, 25942999, 19936898, 15925211, 13213636, 11111837, 9333197, 7981575, 7034954, 6306824, 5621421, 4977142, 4405684, 3954794, 3584946, 3265256, 3090499, 3099593, 3095973, 2899222, 2499944, 2131848, 1911385, 1717590, 1522952, 1418204, 1322652, 1216084, 1120743, 1024656, 892460]
17503H92460n5064n7678j8436m784o4046n5961l1337k8677j0280n8675o1561Q30
17491D46791j8382k1265l3577l0130J6034m4445n4443k5598m8964k7134m0904
17480A17983k4971M0376K8934l9326k8303m0942k229P1418J8657l9418l8878k0721
17468D2580J4639l1065l854J5114m0002m283M9339J8143l6953q084j1216j214
17456C144j0813k8204q463R241M627j0441j1025j797j1809M9260K8239k805J7749
17443B6903l1346R417R650q3266l811p60n8736p942N2294L7205J1386n6530J5400
17430h0136l4694m6852L7901Q4929L1591k1811J0599n4437k3486M8881M9193M3888
17418D5566M0654J0141l3059k115j9179k3686l4121j902K6670m600r671m1678
$$ y = [892460, 837396, 779718, 761282, 756498, 692452, 636491, 605154, 576477, 566197, 507522, 445961, 446791, 428409, 407144, 373567, 343437, 359471, 315026, 260583, 234985, 186021, 158887, 117983, 93012, 133388, 162322, 122996, 94693, 53751, 51522, 122940, 141597, 102179, 63301, 42580, 57219, 26154, 22300, 37414, -2588, -6871, 42468, 60611, 23658, 15574, 4358, 3144, -7669, -35873, -44336, -35095, -30468, -40909, -51934, -53731, -65540, -16280, 11959, 9154, 26903, -4443, 4974, 14624, -68642, -72453, -73213, -131949, -139891, -87597, -50392, -39006, -95536, -80136, -114830, -161682, -123781, -38852, -7261, -29072, -18473, -72910, -96396, -47515, 1678, 45566, 86220, 96361, 63302, 61187, 42008, 18322, -15799, -17701, 8969, 4369, -5302, -46980]
17406d6980l1901l8083K1470K3402M8207k1125l4387m357K9411K7807k1402j0293
17394e8231m4299P471K2525k1567l1401L0803M2478N586k0567k9492l9107M0772
17382i5029L9937j1112n3888R69N8087K6226j2909k7245K8853K5035k1571k843
17370d5490L4476K1600m3094o5087n3068K976o371M3747N0830R353q7836j3202
17358a51166n307r299r835o0553n8440J1665L0072Q0218Q7948J51M536l850q775
17345i2635L9934L7278q857R019l6904r892J9085N4399K6561P396k6666k0952
17333b234k2782J1847k6571P276l590m5972K5789J4242N163l7075j2814n845K651
17320h9915L6610M7501j7975J4291k7384J4643K9171M4450n536m4353p0128m4510
$$ y = [-46980, -78881, -116964, -95494, -72092, -23885, -45010, -79397, -83754, -54343, -26536, -47938, -58231, -102530, -95059, -72534, -94101, -125502, -94699, -52221, -46635, -67202, -96694, -135801, -95029, -55092, -66204, -120092, -119123, -61036, -34810, -47719, -74964, -46111, -21076, -42647, -45490, -11014, 10586, -32508, -97595, -150663, -147687, -154058, -110311, -59481, -50128, -137964, -151166, -156473, -165772, -175607, -236160, -294600, -282935, -252863, -172645, -84697, -84546, -80010, -83860, -92635, -52701, -15423, -24280, -15261, -52165, -62057, -42972, 11427, 37988, 45384, 18718, -2234, -25016, -13169, -39740, -32464, -36054, -82026, -56237, -41995, -36832, -73907, -86721, -92566, -89915, -53305, -5804, -23779, -9488, -36872, -22229, 6942, 51392, 45856, 1503, -68625, -113135]
17308a13135K8505L0025m526j6814j0249q995J1836N5642J91r276Q553o508k5454
17295f0205l4673k4882N4948N3975j1257L382J7471k3906l5376K7531j5073l7389
17283h5454q9143j3707J08353R489K0428P031r15N073J532o5J5420K499j187m4559
17269f5205K9248O613k0790K9166j3417j7559l2821M5434M7821J2881k3298j3941
17257a5868L131l3649k7853J8831j038J2003r35m4216J7651K0888M3211M6113
17245C8269n0715j5159p470p479P831L6422l903j8978k7839j0876m0212J4806
17233h5303L4239K781p666M22R883M9771J5366l8035M01K8478L3487K4149N982
17220G3955J7652M986k0069o9150m9346l4181l4473r357O6668M1231O420n9205
$$ y = [-113135, -84630, -54605, -59131, -75945, -86194, -95189, -83353, -27711, -27520, -36796, -28243, -34751, -60205, -94878, -119760, -64812, -10837, -22094, -18712, -1241, -25147, -60523, -32992, -48065, -85454, -174597, -188304, -79951, -70462, -50034, -43003, -43918, -38845, -37313, -37378, -21958, -19459, -20646, -65205, -35957, -29344, -50134, -20968, -34385, -51944, -84765, -39331, 8490, 21371, -1927, -15868, -12737, -46386, -74239, -55408, -56446, -44443, -45378, -89594, -71943, -51055, -7844, 38269, -12446, -27605, -35075, -42554, -34723, 1699, -2204, -21182, -49021, -59897, -100109, -85303, -51064, -48283, -55949, -55527, -45644, 4127, 19493, -18542, -18141, 10337, 43824, 67973, 73955, 91607, 96593, 76524, 7374, -41972, -76153, -110626, -119983, -53315, -12084, -5664, -64869]
17208f4869m3837J389K4744N6095J2527L783m0064k8711N6643j6102j8395m605
17196f1402j9175j0582R10N0167N725K0340J5318k5076K3194J4819n9077j0450
17184e5289O0343J5989m0218m6733O7891K2932L4972O6367l901l561K98m6600
17172G2490p6136r732N573n0004Q742J3579j6773K2864Q401j729J0991N863j8112
17159b3983l416J9477L1942l0423p954P527M1014J8369j5465o2052l0573q524
17147f4061j369J2096j2357L4097o3556j9354N7046L5610K1467K6162m4108p0456
17135h8783j529K5755m100l907O144K8855N1393L762J2678l9775o6055j0170k095
17122h7827J7738J5588j8834K3142j4021K4617N2730j7739m2176K3821l4438m3811
$$ y = [-64869, -108706, -107317, -82573, -26478, -13951, -10168, -50232, -78943, -22300, -38402, -56797, -61402, -80577, -91159, -90249, -40082, -34357, -14017, 1301, -23775, -581, 14238, -44839, -55289, 5054, 21043, -19175, -65908, 1983, 24915, 59887, 126254, 122353, 118792, 119090, 72490, -3646, -13378, -7805, -57809, -49067, -35488, -52261, -29397, -20996, -22725, -11734, -5871, -23983, -27399, -7922, 24020, -6403, -14357, -6830, 34184, 52553, 37088, -24964, -55537, -64061, -65430, -53334, -65691, -31594, -95150, -114504, -57458, -21848, -381, 25781, -18327, -88783, -90312, -64557, -68657, -72564, -66420, -37565, 13828, 17590, 30268, -9507, -75562, -85732, -87827, -70089, -54501, -73335, -50193, -64214, -39597, 13133, -4606, -46782, -22961, -57399, -101210]
17110a01210o253K679J8004L9564L8243L4251p929K4012N936m0646k7158n7795
17098g8302l7812J1120m148r137M5439L8362m372n0342k5388k7617M0855P3956
17086b7386Q048m0187L6032Q653j2730o0224Q032L1822J39J8802k1214l2938Q950
17073g4201K6511J8177m2598k7102K7057K7759k8759j4552k283M5280j1320m1174
17061i7205J0758l338J0265M9365j6822j8831L1330k221j1249K1062k7037l0370
17049h4293K1016M0073M9136j4691m923K7143k6656j7613l6284J6670J1233j0151
17037b9340K0342k1447l3838k2157K732L9820N200N6235L5032m416K234m2164
17025H233j8499k2806k4423J0143K9222p12l0041k3267K3211P112J7136P7355
$$ y = [-101210, -107463, -104784, -86780, -47216, -8973, 25278, 17349, 41361, 47297, 6651, -20507, -78302, -116114, -104994, -109142, -118279, -72840, -34478, -38850, -89192, -114580, -142197, -101342, -27386, -19338, -59525, -23493, -14840, -27570, -87794, -79762, -47940, -47801, -28999, -50213, -83151, -74201, -47690, -29513, -72111, -99213, -72156, -44397, -73156, -87708, -89991, -44711, -56031, -97205, -86447, -89785, -79520, -30155, -46977, -65808, -34478, -36699, -47948, -26886, -53923, -84293, -63277, -23204, 25932, 11241, 6318, 33461, 6805, -10808, -47092, -30422, -19189, -29340, -8998, -30445, -64283, -86440, -83708, -43888, -38688, 17547, 52579, 48163, 50397, 8233, -10266, -33072, -57495, -47352, -18130, -18842, -48883, -72150, -48939, -41827, -24691, 52664]
17013E2664k5452n554J2251M0736j6373n5040l3826l2639k0193N1811M4820L004
17001A6209K9873j4542m6244J170J2085K2098m2045p781j997N5533M1M3435R034
16988G6869N466J2780j9795k2230l6054J4147j2987j8212K0006J3370M0651N6720
16976A30731J1068O5969O1433J29539J36080Q3167K6135j1227o2870j36076r1211
16965C42738n6927J8478k9806l0518k2845m4489m4590p6164k9005k9989R877K7856
16953C4616k0625k4366k6246M2476P2692K4628j2708j559j8022l9760m0912q715
16941a8501j2307J6537J1625k9302j7471p33L3831L8004J883j8687n0209n3300
16929i8630M2364J7452k2625J70N2954L9564j5097m1153l6886N6186J6322j0795
$$ y = [52664, 27212, 21658, 33909, 74645, 58272, 3232, -30594, -63233, -83426, -31615, 13205, 16209, 46082, 31540, -14704, -13534, -1449, 20649, -21396, -29177, -31174, 24359, 24400, 67835, 76869, 82335, 95115, 75320, 53090, 17036, 31183, 18196, -16, 19990, 33360, 74011, 130731, 141799, 207768, 269201, 398740, 534820, 617987, 644122, 632895, 570025, 433949, 342738, 285811, 304289, 274483, 243965, 221120, 176631, 132041, 55877, 26872, -3117, 6760, 34616, 13991, -10375, -36621, 5855, 78547, 103175, 90467, 88908, 70886, 31126, -9786, -18501, -30808, -14271, -2646, -31948, -49419, -50152, -16321, 21683, 23566, 4879, -45330, -98630, -56266, -38814, -61439, -61269, -8315, 31249, 16152, -25001, -61887, -5701, 10621, -174]
16917a74n023L4778mm5749M5032k6237m0519k5305J7968Q3437M3318M2614J0849
16904A34985p2789n9046j4890J7345r259m4289L9537K5227k820m1415p3108n1668
16892a52190M5164Q7499J1299K5236K8606j8051L819j5778j0678j7110K8233k2308
16880f259k4361l3010J6887L4553M531j9133K8169P38n1478n64J9331L7313k2847
16867a6130P609R926K4164m3529l2640l22m06k4467J9691L2182J0414j7443J3385
16854a7566m42J0813R031K0407K2376N4050L305m2338m0229l6919l3446m1848
16842i2806j7656l021N0886M9705K3724J7037k6466n6677l7583M3219L3725m0479
16830e6392l7093j9439k26l3627J5657L8949j1625m7767J4317L2325l8542O0903
$$ y = [-174, -5197, 29581, 29577, -16172, 28860, 2623, -37896, -63201, -45233, 38204, 81522, 124136, 134985, 62196, 3150, -11740, 5605, -3654, -47943, -8406, 16821, 14001, -27414, -100522, -152190, -107026, -19527, -8228, 17008, 45614, 27563, 31382, 15604, 4926, -12184, 16049, -6259, -30620, -63630, -46743, -12190, -7659, -26792, 1377, 2115, -49363, -49927, -30596, 6717, -16130, -8521, 1405, 25569, -17960, -50600, -50922, -51328, -75795, -56104, -23922, -13508, -30951, -17566, -18008, -7195, 1836, 22243, 44619, 98669, 101974, 59636, 19407, -17512, -50958, -92806, -110462, -113483, -62597, -12892, 10832, 27869, 1403, -55274, -92857, -49638, -15913, -56392, -93485, -112924, -113150, -146777, -131120, -92171, -103796, -151563, -137246, -104921, -143463, -82560]
16818h2560P9199m772n7303r583L8251j9516n931J0506K2481l200q292L0286M206
16805f228k4884n8953k0300J2075J6797K5577J0368J3419P796M664n729j7343
16793d2741j2130M6872k5248j5823k6150m0371n2659K5268L8191M6256Q702K2464
16781b7369p8168k1041j3209J5312O212N030j9946K0010M1815O0251K6063j0061
16769D899n0762m9441J3105p365J9252P2906M0656j871l5036K3569J2994m4641
16757a735n413j3948N4324m448p1427j0548N107l313K3407j9096j2883J9990j023
16744d1006j2394j6649M387K0523K7570k9136q695K7362M3086L3416j7515J3735
16732D4684j9505k7855o1018l1525L4501l207O55L872j536K0768k9821J1582M2244
$$ y = [-82560, -3361, -8133, -65436, -75019, -36768, -56284, -62215, -51709, -29228, -32428, -40720, -10434, -6228, -31112, -90065, -110365, -98290, -81493, -55916, -45548, -32129, -24333, -19669, -25398, -42741, -54871, -7999, -33247, -49070, -75220, -115591, -168250, -142982, -104791, -58535, -49833, -27369, -105537, -126578, -139787, -124475, -118263, -113233, -133179, -113169, -71354, -11103, 14960, 4899, -45863, -95304, -82199, -89564, -70312, 2594, 43250, 41379, 6343, 29912, 42906, -1735, -7148, -21096, 33228, 28780, -42647, -53195, -48088, -51401, -27994, -47090, -59973, -39983, -41006, -53400, -70049, -65662, -45139, -17569, -46705, -55400, -28038, 15048, 48464, 30949, 44684, 25179, -2676, -63694, -95219, -60718, -63925, -63270, -59398, -60934, -40166, -69987, -58405, -16161]
16719a6161J6754K4621L7073n6960m5648M5856J3334J6799M2942j8153l5010j2400
16707A3047l5317k5151j6590j7291J1979J582l5216q135M6429J8460P133k925
16695d1995o857j7267K195j1986m611M5523J4493k5183k8589J0609K6547j0149
16683d7270k050m4742L7566K9563k3868j9324l1190K4184K6398O017p437k4567
16671g6720j0965k0908j4278L0563K1316K086q595n437J7720q796L3246J0294
16659c0474K545L5092K3707j3783j6197R882J1452k1763k4564k7983n3542K4252
16647h1376M049n3794N9544M7580J967J9371L642n3702j8247j5361L1297K4446
16635c0584o448l5830k846p556o072N7289k4520L057N1442l0490j1683l0521J0448
$$ y = [-16161, 593, 25214, 62287, 5327, -40321, 5535, 18869, 35668, 78610, 60457, 25447, 13047, -22270, -47421, -64011, -81302, -69323, -67741, -102957, -111092, -64663, -46203, -39070, -41995, -48852, -66119, -63924, -75910, -80521, -34998, -20505, -45688, -74277, -63668, -37121, -47270, -49320, -94062, -56496, -26933, -50801, -70125, -101315, -77131, -50733, -44716, -52153, -76720, -87685, -108593, -122871, -92308, -70992, -68906, -77501, -82938, -65218, -74014, -40768, -30474, -27929, 7163, 30870, 17087, 890, 10772, 22224, 461, -24103, -52086, -105628, -81376, -77327, -131121, -71577, -23997, -22030, -2659, 983, -52719, -70966, -86327, -55030, -30584, -37032, -72862, -75708, -83264, -89336, -32047, -56567, -53510, -2068, -32558, -44241, -74762, -64314]
16622f4314O7429J6036m42J1157P36L5632j9250r0611M5177N9352M0340o340o4476
16609C0426l5329o724L207m3325k2726M0838J396L192n5674m0847O7619P0040
16597A2093L4420l5199n3448r422K1313r367K2229J172k5939K236j7293N8678
16585A473J1156l3732L55J4696K5106K0018J5250m4284l9033m6025M771J247j2263
16572h1265o3184J4557M5706J0616j1825K3493R567m3301k2732J8083L8588J6671
16560d5026P3346J4347l9473j8147j0726n3244j6516N7316K1068J4906j653J501
16548b301m2283K754O3354J8728q6017q0429K7720L9486J1343l99Q678K4195L068
16535a2103K3979J7979J0679K1257l1796Q109N543k7985o375m2728J8432J3276
$$ y = [-64314, 3115, 19151, 18709, 29866, 30602, 66234, 46984, -43627, 1550, 60902, 101242, 94902, 30426, -4903, -11627, -8420, -51745, -74471, -33633, -32237, -29045, -84719, -125566, -57947, 12093, 46513, 11314, -42134, -51556, -30243, -39610, -17381, -16209, -42148, -39912, -57205, 1473, 12629, -21103, -20748, -6052, 19054, 39072, 54322, 10038, -28995, -75020, -70249, -69002, -81265, -144449, -129892, -84186, -73570, -85395, -61902, -52335, -95636, -118368, -100285, -61697, -45026, 28320, 42667, 3194, -14953, -25679, -78923, -95439, -38123, -17055, -2149, -3802, -2301, -44584, -41830, 21524, 40252, -45765, -126194, -98474, -58988, -47645, -48044, -39366, -15171, -12103, 11876, 29855, 40534, 61791, 29995, 38104, 43647, 15662, 9287, -33441, -15009, -1733]
16523a733m5571L2056K4756k2390J8808o790J3970j4684L3745M0277J7152J7003
16511A06599k0010j1515N276n1911k1999J4385j1781o672Q601l4235l0744l8616
16499i2622k5137K5700M0218L0520J5130j9335J6638M8872l2178k4342K6875l1167
16487b0828K2079J575j6832J8841l9365l1804k3253K523M1712q332J4793L449
16475c5442k2807p296M5126q354l5143J9850O2503R673k7331j4277j428J9311
16463D385m0529J6311Q074l682J3404J0006m2838p273L2915P458o696m3021O97
16450e0789P958M6910j917n0921m2833J6511L1395J7269J1400k3582l0524J523
16438f7600J9275L3057l7252m514R83k725J4108p725k3945L8310j616j9422N856
$$ y = [-1733, -47304, -15248, 9508, -12882, 5926, -864, 13106, -1578, 32167, 72444, 89596, 106599, 86589, 75074, 80350, 28439, 6440, 20825, 9044, 2372, 10973, -23262, -54006, -92622, -117759, -92059, -51841, -21321, -6191, -25526, -8888, 39984, 7806, -16536, 10339, -20828, 1251, 2826, -14006, 4835, -34530, -66334, -89587, -87064, -45352, -53684, -38891, -35442, -58249, -65545, -20419, -28773, -63916, -44066, 18437, 28110, 779, -13498, -14926, 4385, -36144, -19833, -11759, -15441, -2037, 7969, -34869, -42142, -9227, -1769, -8465, -51486, -50789, -42831, 4079, 2162, -48759, -91592, -75081, -43686, -26417, -15017, -38599, -69123, -67600, -48325, -15268, -52520, -57034, -56051, -58776, -44668, -52393, -76338, -38028, -39644, -59066, -53210]
16425e3210l4671j0664J5396N7487j1378m7246K0585L9827l1468k9698Q407O561
16413g0072J3539O257J3626J7991l8892j8757N6098J00110r555o5194m3563J1391
16401b7021K9575j2136P92r688J4971j1263l9916k9294K551K1911k2681q616J6585
16388g4230L7975k876k133N164O005M84r86P021n356o0859J2799N605J2076N8920
16374c91K9296k2904k3544l2177L2616Q860j6312L0898M1732N10k7205o7865j2166
16361e8652L9340J7986k2142M0121K944l8228l0358L8456k2592l5672r87K2286
16349d7498M0807o63M147k7647k3803K4492P707l8229j67q459m2837J6261P4377
16336b1512M7845J7283j0482j5585m065j7874j6567m915N684k3416k4182L2019
$$ y = [-53210, -87881, -98545, -83149, -25662, -37040, -84286, -63701, -23874, -55342, -85040, -76633, -70072, -56533, -50276, -36650, -18659, -57551, -76308, -20210, 79900, 70345, 5151, -38412, -27021, 2554, -9582, -8790, -18478, -3507, -14770, -54686, -83980, -81429, -59518, -82199, -90815, -74230, -36255, -39131, -41264, -36100, -30095, -29611, -30597, -23576, -28932, -89791, -76992, -71387, -59311, -391, 28905, 6001, -17543, -49720, -17104, -8244, -24556, 6342, 48074, 48584, 21379, -46486, -58652, -19312, -1326, -23468, 16653, 19597, -18631, -48989, -10533, -33125, -68797, -69784, -47498, -6691, -7354, -3207, -30854, -54657, -30165, -22458, -60687, -60854, -69313, -112150, -95889, -21512, 26333, 43616, 33134, 17549, 13484, -4390, -20957, -25872, -20188, -43604, -67786, -35767]
16324c5767J4322r886K8758M401J0328l0101n3509q792j1006Q3709N7562m7014
16312C005j02981k3021Q1906N7627j5792j506M2424M6J9203k0004k3257l4472
16300a6822j1390p738K2788j949J867M9169n5848m6648m163M583K6480M4596j0667
16287e742l6596p478K3942N6686K3845J6482o199K1276Q96m87l6157P543r842
16274D8169j6346j3080q382j141j8637l2261l3886j1658K4644N1246O614l5286
16262d0004j3537N8151N038q116m803M2675l2586j2004K1697J2879J8014k92l9936
16249G176k5154j5710m3735l5079J8363L7151j0496j6395Q992L551J1383l1973
16237i1926l458Q594N5001K3319j0674K323j4057K8825K1379l8371J0178J7935
$$ y = [-35767, -21445, -31331, -2573, 1828, 12156, -17945, -71454, -80246, -91252, -7543, 50019, 3005, -99976, -122997, -41091, 16536, 744, -762, 41662, 41708, 60911, 40907, 17650, -16822, -28212, -35950, -13162, -15111, -13244, 35925, -19923, -66571, -70734, -66151, -39671, 4925, -5742, -42338, -49816, -25874, 30812, 54657, 71139, 64940, 86216, 87112, 86625, 50468, 58011, 48169, 31823, 18743, 10361, 9220, -9417, -41678, -75564, -87222, -62578, -11332, -4718, -40004, -53541, 4610, 9648, 1532, -3271, 39404, 6818, -5186, 16511, 29390, 47404, 47112, 7176, -17978, -33688, -77423, -112502, -94139, -56988, -67484, -83879, -74887, -71336, -59953, -91926, -95384, -86790, -31789, -8470, -19144, -16821, -30878, -2053, 19326, -19045, -8867, 9068]
16225I068l7722j0317J670n3765r029P074N7448L1474L6142p574j17039q157M7066
16212e3661K9440m6317n939L8325O54L0619R049j6054n8216J6158N0716L6710
16200C1484m0631k3551L468K268J8018K2636J5639j3411l643o337j3588K0481
16188A2833L3685r74M5529k0177n8851k6613o6268l1359L7301O32N4049R7217
16176G7004J1706m0149l8046l4121j3942K1556M398j9005K6579q368K2578J4613
16164B4803m1338k0175j1458m3378L8065N5030J9831j3405k9188j1547N6830K8538
16152E2608k6623m6466j3320k5299p45M152j5645l8712J177L8062J7917J508K5313
16139b6073L1620M4634N760m2463k0515L35m874J4316k7363J5340j1349N009j1232
$$ y = [9068, -28654, -38971, -37301, -91066, -100095, -93021, -35573, -4099, 32043, 24469, -92570, -100727, -53661, -24221, -70538, -76477, -38152, -37498, -6879, 2170, -13884, -72100, -55942, -5226, 31484, -9147, -32698, -29230, -26962, -8944, 13692, 29331, 15920, 12277, 5940, -7648, 12833, 46518, 45544, 91073, 70896, 12045, -14568, -80836, -112195, -74894, -74262, -20213, 77004, 88710, 48561, 10515, -23606, -37548, -15992, -11594, -30599, -4020, -12388, 10190, 24803, -16535, -36710, -48168, -91546, -53481, 1549, 21380, 7975, -21213, -32760, 24070, 52608, 25985, -20481, -33801, -59100, -59845, -55693, -71338, -110050, -108873, -70811, -52894, -51386, -26073, 5547, 50181, 55941, 13478, -7037, -6702, -11576, 2740, -24623, -9283, -20632, -15623, -26855]
16126b6855L5695J0047l9940K2523J1074j3870n3087k0514K716j2740K3466K5886
16114c5599L4854J4774r420k558L9298k2555l3749K0929n929m4635m7945K030
16102i0505L64J9236K8667M4268J4481J93J0095m6333k0648p636K6558J8052m9368
16089e2576n9784J5003N1045J0574m3226k1774L5410N2879J4874J2283L7735K8722
16077H1165r582r566K8274k5208l7222K4928m5500j3738N607j539l7353k8678
16065f8412L5522K1111R019K7822j4063J0277L7520j2999J9161j1531l6786k1619
16053d978r743J5239Q72k6001l7809L1777K4850M4144L292k6484j4838k3923j1546
16040c5148K5118k2514R711K5162k810L9588N8003k9721k8064J0720q346k4848
$$ y = [-26855, 8840, 18887, -21053, 1470, 12544, -1326, -54413, -74927, -72211, -84951, -61485, -35599, -745, 14029, 4609, 2051, 41349, 18794, -14955, 5974, 45, -44590, -92535, -90505, -90141, -70905, -42238, 2030, 16511, 16704, 26799, -19534, -40182, -47818, -21260, -3208, -52576, -112360, -97357, -46312, -35738, -78964, -100738, -65328, -12449, 2425, 14708, 52443, 81165, 71583, 62017, 90291, 65083, 27861, 52789, 7289, -6449, -842, -2381, -39734, -68412, -32890, -11779, -2760, 25062, 10999, 21276, 58796, 45797, 64958, 53427, 16641, -4978, -14721, 518, 1390, -24611, -62420, -30643, -5793, 38351, 41643, 15159, 321, -23602, -35148, -10030, -32544, -22833, 2329, -481, 39107, 97110, 67389, 39325, 50045, 41699, 16851]
16028A6851L0079K8896j7987k0164J1332N6l0360m5692L1329N985j3153q8810
16016i1638r6315K2271M9582P3894m543j1358L956L3856Q720P647J8197j3337
16004I32p8920o6273l4799N0313K5483N82K2107J4814p689L869K0147r577J8425
15991d0586N1994j5838k6710n3121J9653N0327K8458K5292O205k3967m223j7816
15979c32J5879k430N252K6641j1652m5410k9081O846j6502M6682j8864O99q675
15966c0947m3772j0029j3020P594J5235j1708j3398L8711j9381J0282N5964J9582
15954E113l8497M162J3191o7616j2210K7439K6559j6551J0207Q48L776l0312o848
15941h0739J0974k0106K1636R690M3644N5442K5781M015k3251k3477q919m3889
$$ y = [16851, 46930, 75826, 57839, 37675, 49007, 49063, 18703, -26989, 4340, 10325, -2828, -91638, -187953, -165682, -116100, -42206, -46749, -58107, -54151, -20295, -11575, -3928, 14269, 932, -77988, -144261, -179060, -128747, -103264, -102682, -80575, -65761, -73450, -69581, -49434, -59011, -40586, 11408, -4430, -31140, -84261, -64608, -14281, 14177, 39469, 45674, 21707, 17484, -332, 15547, 13117, 18369, 45010, 33358, -12052, -41133, -34287, -50789, -4107, -22971, -22272, -30947, -74719, -84748, -97768, -90174, -74939, -86647, -100045, -61334, -80715, -70433, -14469, 5113, -33384, -29222, -16031, -83647, -95857, -68418, -41859, -58410, -48203, -47355, -43579, -73891, -80739, -69765, -89871, -68235, -58545, -14901, 40541, 66322, 70337, 47086, 23609, 14690, -29199]
15929b9199j468K3030O009n287N9035K7097l6114p5501n9667l3107J6258J3535
15917i5379L2081l9536J4228O567L2827M7886K0482m1552m922J1276K027K4996
15905A0981K355J8438n3395k2155j4403M5843n373o790J672Q895L971N2014J282
15892D3335K8043J1474m1647n6836k4789j2807M6269P3034J8903j2933Q384r460
15880G0970m0497k2195O892n262M34K2566j9125k0522K5752K706o0792j907O276
15867c4704J5921k5165j6091k503J102j2491q8629J8558L1176O785K4235M8444
15855c3362N0173L458p3449Q791L2810j5536j3035L1463R066j8278j6237k3106
15843e7242L5626N0905m262q9274k6415k157K9256J4983k0466j9562p23M739J6228
$$ y = [-29199, -30667, -7637, -1628, -6915, 52120, 79217, 43103, -32398, -92065, -125172, -108914, -95379, -63298, -102834, -88606, -82039, -49212, -1326, 19156, -22396, -27318, -16042, -14015, 10981, 13336, 31774, -21621, -43776, -58179, -12336, -17709, -24499, -22827, -13932, -9961, 42053, 43335, 71378, 82852, 41205, -15631, -40420, -53227, -6958, 66076, 84979, 72046, 80430, 70970, 30473, 8278, 15170, 9908, 10342, 32908, 13783, -6739, 19013, 21719, -39073, -40980, -34704, -18783, -43948, -60039, -62542, -61440, -73931, -162560, -144002, -112826, -106041, -81806, -33362, 16811, 20269, -53180, -44389, -11579, -27115, -40150, -8687, 379, -17899, -34136, -57242, -21616, 29289, 25027, -64247, -90662, -92819, -63563, -48580, -69046, -88608, -89331, -84592, -68364]
15830f8364r615O575K2933L9095k2503K8984L7825L1378N736j8706n9448m9016
15818e5126j2352K588P0878L0586N615O407J8797K4917j6740m4223j9622k8608
15806a6883m9164j9143K3942O1731L1241J768m4608l440l3454J6064K2750M479
15794d717n8239L1102R105P461n418n185J0183J6803K6905L5943M3725k3454K2638
15781A06852L5914j1554p9549n700l2199n8778R600Q4244R866j7090j8188m2005
15769a8587l6632k1533L7100N0245J9235j9720L0277j779m336l958k59K4017j4898
15756C9172l9794j0589J0224J823j0277J2509j2334m8107L8347L2860l2044P533
15744a0677l0270N578L2520k149l162l0263o157j6008j2168j6233L4472m663L187
$$ y = [-68364, -77979, -71404, -48471, -9376, -31879, -2895, 34930, 66308, 72044, 53338, -6110, -55126, -67478, -64890, 5988, 36574, 42189, 48596, 67393, 92310, 75570, 31347, 11725, -16883, -66047, -85190, -61248, 483, 31724, 33492, -11116, -14556, -48010, -31946, -9196, -4717, -62956, -31854, -22749, -15288, -20706, -25891, -15708, 1095, 28000, 63943, 107668, 84214, 106852, 142766, 131212, 51663, 45963, 13764, -45014, -35414, 48830, 58696, 41606, 23418, -18587, -55219, -76752, -39652, 10593, 29828, 10108, 40385, 38606, 34270, 30312, 30053, 54070, 39172, -622, -11211, -987, 836, -9441, 3068, -9266, -57373, -19026, 13834, -18210, -10677, -40947, -35369, -2849, -4998, -8160, -38423, -44580, -60588, -72756, -88989, -54517, -59180, -55993]
15731e5993K5177N2224L0384L4349L2088j1587l4338m0964m5418j0251K9512j6937
15719a1754m2206l951M6089k6356j1211J8836o097j5373p325r249K451o02J4840
15706e1908N0905J4357m1893n3281J7576k6277j37O3247K0515q840L5945m938
15694A5271j9441M7995K5044m7920l0576p912K7421L9129k217l2463m2267j9061
15682d6997J3136L4750M2772j1227Q821m4249j565k3631j6621J0289J8963L481
15670a2078l3763k1616j3835K3921J4451L1706K4733J5082J5046K8213K4150k8164
15658F7846o9026n737m2803o5605k4616K8358J3341L6624L3453K1948r683k7634
15646d3534J1939j384Q554J0337j8549j999M1221K2921j3785k4735N262p3114
$$ y = [-55993, -30816, 21408, 51792, 86141, 118229, 106642, 72304, 31340, -14078, -24329, 5183, -11754, -53960, -57911, -11822, -38178, -49389, -30553, -36650, -52023, -59348, -68597, -66146, -66748, -51908, -1003, 13354, -28539, -81820, -64244, -90521, -90658, -27411, -6896, -15736, 20209, 15271, -4170, 43825, 68869, 20949, -9627, -17539, 9882, 49011, 46794, 14331, -27936, -46997, -33861, 889, 43661, 32434, 41255, -2994, -4559, -28190, -44811, -34522, -15559, -12078, -45841, -67457, -81292, -57371, -42920, -11214, 13519, 28601, 43647, 71860, 96010, 67846, -1180, -6917, -49720, -115325, -139941, -111583, -98242, -61618, -28165, -6217, -15900, -43534, -31595, -32979, -24425, -14088, -32637, -34636, 6585, 29506, 15721, -9014, -3752, -76866]
15634g6866r528M4234M8412K4444K5225J8299n867O883l2618k9533k0329j2540
15622a9784R653l647Q542L9135M1791k1539k5045r492J6014J2777n0113p6428
15610g8136N590k275O0206J366l4861N8037r13J619K8379L5999j549k3380q915
15597D1167j7594O1436J2951k8076k2948J3381m8323n992Q3K3564k2868J5061
15585B1842J9797N522K1068P110m3364l6159j4207K1606M4194O0174j2889m8732
15573D5962l2658j29L9025k3384o116R924N987l6809j839M317R144K6200j1015
15560B8609p77L286L9090l6695o2879n0030K8627J4742j5507k1894M239j819O1358
15547i650L6710j3846l0617m0656n8184K5634M6042K6551k6214m6006L7526J6476
$$ y = [-76866, -86394, -42160, 6252, 30696, 55921, 74220, 68353, 75236, 42618, 13085, -7244, -19784, -10131, -13778, -5236, 33899, 75690, 54151, 29106, 19614, 35628, 48405, -1708, -78136, -72546, -74821, -14615, -13249, -48110, 9927, 9014, 10633, 39012, 75011, 73462, 50082, 41167, 23573, 85009, 97960, 69884, 46936, 60317, 11994, 6002, 6085, 29649, 6781, 21842, 41639, 47161, 68229, 75339, 31975, -4184, -18391, 3215, 47409, 107583, 94694, 45962, 13304, 13175, 52200, 28816, 22700, 32624, 38611, 1802, -37, 4280, 13424, 39624, 28609, 27832, 31118, 70208, 33513, -29366, -79396, -50769, -36027, -51534, -73428, -69189, -71008, -9650, 27060, 13214, -17403, -58059, -116243, -90609, -44567, -18016, -44230, -90236, -52710, -36234]
15535c6234L9744M019k1094j325J229J5986j7886M0416L3979j5657l645n1007
15523a1475m7851J1422l3037j4946N4959Q047O974L5540J8559m4856p9062k571
15511i8297K2401j3855K3433j3483L742L0516l3376k9263M050N655L1505J9510
15499d7462j3888L2550K7604R42j6889j3852M4591M7200m6453m0204J1684M425
15487i752l1851J8383L6260M688l8633l2904L2738P0439P302l5953l6216K8835
15475A3336L2897N1572N4794l7638p4489n3440P75q138l6245J2089K469J13n5610
15462i7515k1330J0901J9886L3335L9093l0006q182P185M1487Q957J8767n04q743
15449A3331k0958L4669J3782j5466j6430J0756j3226K2470j9873j8322K1807j2265
$$ y = [-36234, 3510, 7529, -13565, -14890, -13661, 2325, -15561, 24855, 58834, 43177, 39532, -11475, -59326, -47904, -80941, -95887, -40928, -32881, -25907, 9633, 28192, -16664, -95726, -98297, -75896, -89751, -66318, -79801, -76059, -45543, -78919, -108182, -104132, -98477, -66972, -47462, -61350, -28800, -1196, -254, -17143, -30995, 13596, 60796, 14343, -25861, -14177, -9752, -41603, -23220, 13040, 17728, -20905, -53809, -21071, 49368, 56670, 20717, -15499, 13336, 46233, 97805, 152599, 114961, 40472, -12968, -12193, -20331, -56576, -44487, -42018, -41905, -97515, -118845, -107944, -88058, -54723, -15630, -45636, -53818, -46633, -5146, 3811, 22578, 22074, 13331, -7627, 27042, 40824, 25358, 8928, 19684, 6458, 28928, 9055, -9267, 12540, 275]
15437B75P119J4437L2793p248l158L1993J605k4698j0397o3891o6774J6094O3685
15424h165j1392l7353m927J8546k7327l5855K2631J0061m307J2994J7078J9282
15412b8734K2519L3472j080l070l671o461L356J2197k8530k2173m754p263n457
15399c9649k5918R609L3500M6834r413n1187m2751j3898Q7126L3818m2100L2680
15387A8651n1011k7154N0270l1109m538j9750K2997J1980k6262J7922J3481N2537
15375B8014N519L5l7990l6008p033K8380M656l0331J9978J6019J3261R950o566
15362G884j3845l0693P858M182M0637N6679L48J9248r505j14195m6175J2552K9284
15349c5741N0766N029K6910L342l8436Q180j8005l8868K0600J9226J1222L5665
$$ y = [275, 7394, 21831, 54624, 47376, 44218, 76211, 77816, 53118, 42721, -21170, -87944, -71850, -8165, -19557, -56910, -61837, -43291, -70618, -106473, -83842, -73781, -78088, -65094, -48016, -28734, -6215, 27257, 26177, 23107, 19436, 12975, 16331, 28528, -2, -22175, -26929, -34192, -39649, -65567, -55958, -22458, 24376, 14963, -36224, -78975, -92873, -5747, 28071, -14029, 18651, -32360, -59514, -9244, -40353, -44891, -64641, -41644, -29664, -55926, -38004, -24523, 28014, 33533, 33568, -4422, -40430, -47463, -19083, -14427, -44758, -24780, -8761, 4500, 14450, 7884, -5961, -36654, -28796, -24614, 16023, 72702, 73050, 92298, 82793, -31402, -77577, -65025, -35741, 15025, 20054, 46964, 50306, 11870, 20050, 2045, -36823, -16223, 3003, 14225, 49890]
15337D9890n1202m0346j9653J3408K1554p703j3461j2248J7697l9906P3063M7030
15325C8123p2p522m8131l9347l0267K3979r379l9531K2013P2449J3718N1493k1567
15312B5959r880l9896o821j3985L5096R969l0964o8282L3615K1657k9185M2436
15300c0281N5669J7638j4261k8091M318l4L0043K741m6636m2082o535K4660o31
15287c3482O5746n4448m6880K7991K7747k1937j3120M1446L997J8932J238m2225
15275b4995N0033J855l9825j8374L9312N2733j562l8377k5692k93P905J1928p319
15262G329k1956j8466J5839M997m8852l2329r648M4773J5063j2698P247k5559
15250g4260M49J1090K2744m2649j3666P7M626N0269Q266J1415J284M1239j5098
$$ y = [49890, -1312, -41658, -61311, -47903, -26349, -34052, -47513, -59761, -42064, -81970, -8907, 38123, 38051, 30529, -17602, -56949, -87216, -63237, -72616, -112147, -90134, -17685, -3967, 47526, 25959, 16079, -23817, -30638, -44623, -9527, 442, -30522, -98804, -65189, -43532, -72717, -30281, 25388, 43026, 28765, 674, 4992, 4958, 35001, 37742, -8894, -50976, -57511, -32851, -33482, 32264, -22184, -69064, -41073, -13326, -35263, -48383, -6937, -2940, 15992, 17230, -24995, 25038, 26893, -12932, -31306, 8006, 60739, 59177, 20800, -4892, -5185, 2720, 14648, 7329, -14627, -33093, -17254, -12257, -61109, -93438, -103086, -58313, -43250, -55948, -48701, -74260, -73811, -62721, -39977, -82626, -96292, -96215, -91589, -41320, -33054, -21639, -20355, 20884, 5786]
15237E786k6421p019m150J6104O8759J8405j8900L2416K985k6525l1625m8212
15225a8397m2275J8838L4817l7677J7083Q077k3410o798j9272o490N4095N1587
15213C0178q394m0957M3645M1118j2864k9453o137j6253j9693n6601Q682N1032
15201a5697J9967m991L9907j8093N5021j9620p2197K7022k4048o8078k215N2066
15189c0956j7540J9561K5049J9477j1897k6092m5221J5679J0599M1164J1396J9800
15177C1019Q542P993K2564P644j1581m4414K999R584k700j876m142l3615O845
15164a138K8633n9287j1370m5660j8558L4606L2258J3939M0957J8927k0630l0358
15152a7681j4577k6410L6063k8291J6076o238k6635j3433K8996J0542k8694k6069
$$ y = [5786, -20635, -27654, -31804, -15700, 53059, 71464, 52564, 84980, 87965, 61440, 29815, -18397, -60672, -41834, -7017, -44694, -27611, -19534, -42944, -49742, -69014, -75504, -21409, 30178, 21784, -19173, 24472, 65590, 52726, 23273, 17136, 883, -18810, -75411, -66729, -15697, 4270, -721, 39186, 21093, 76114, 56494, -15703, 11319, -12729, -80807, -83022, -30956, -48496, -28935, -3886, 15591, 3694, -22398, -67619, -51940, -41341, -177, 11219, 31019, 39561, 47554, 70118, 77762, 66181, 21767, 24766, 34350, 31650, 29774, 25632, -7983, -1138, 27495, -31792, -43162, -88822, -107380, -72774, -40516, -26577, 14380, 33307, 12677, -17681, -32258, -58668, -22605, -50896, -34820, -41058, -67693, -81126, -52130, -41588, -70282, -96351]
15140i6351K4283L1689J5115j3833M5593L9865R93l7238K2067k3715j5707M978
15128b261n781L6277l767J9299J2936l6871l7932n560M5392L4651o215o4012o1101
15115g4945p789L1944M0107j2341L5402j8571o5898l597N2115K9401K316K21k3566
15102a5201n917m3672k1507K3452Q6451o661j8069o230k2698o822N932J2294J512
15089a7136L919j5528o7055K0284P1271P021L3991P2950l4961o0215O408j9986
15077I63J7298N2722n214k6730l3189k5887j9236M4114K7786M836j8325j2722
15065F416n0173P1621K2567l4813n9544p337L7100n1882k6110J8984L5635J1787
15053b5749L7402R255j3439k4235q7391R611J4373J5020J7443j9509p97K3582
$$ y = [-96351, -72068, -40379, -25264, -39097, 6496, 46361, 47354, 10116, 32183, 8468, -7239, -2261, -8042, 28235, 24468, 43767, 56703, 19832, -18100, -23660, 21732, 56383, 50168, -13844, -74945, -82734, -50790, -10683, -23024, 12378, -6193, -72091, -75688, -23573, 5828, 8144, 8365, -15201, -21118, -64790, -86297, -62845, 23606, 16945, -1124, -7354, -30052, -36874, -30942, -18648, -17136, -13217, -28745, -95800, -75516, -4245, 2776, 36767, 109717, 74756, 14541, 20949, 963, 18261, 70983, 65769, 39039, 5850, -20037, -39273, 4841, 32627, 37463, 19138, 6416, -43757, 27864, 50431, 15618, -43926, -51263, -14163, -66045, -92155, -73171, -37536, -25749, 11653, 20908, 7469, -16766, -104157, -94546, -80173, -65153, -47710, -67219, -68016, -44434]
15041d4434K3171L2356J9060j5922r611L9457j6231l1901l5232j9649p036j0926
15029g6898r298L4573n782M826L8022k2976k3851k0423j9557K9985M8673K1514
15017a192L6253Q565j102Q770j0747l6614k5267M2261j7812m2752l114J6706k7564
15004e3609J5455M2031K7116J3930k7553k2477J8089m0767q0764m4331K1781N3502
14992g7597K5559r65J722M8731M8335O2042l6628n3261o314n9235k8634O676J8579
14979e0990N8891K2548o956k3667o4922L6857O7123K1974l3511p4179j5141P707
14967e4266j0321j4061Q514L0173K9693J7454N9164N5390L1912l9509l5082l8052
14955D1009p1799m4585M4962J0866J4453K8341M4906P202j639k3447n9439k3228
$$ y = [-44434, -21263, 11093, 30153, 14231, 4620, 44077, 27846, -4055, -39287, -58936, -65972, -76898, -86196, -51623, -57405, -52579, -14557, -37533, -61384, -81807, -101364, -71379, -22706, -1192, 35061, 43626, 42524, 51294, 40547, 3933, -21334, 20927, 3115, -39637, -42751, -26045, -53609, -38154, 3877, 30993, 44923, 17370, -5107, 12982, -27785, -108549, -152880, -131099, -77597, -52038, -53003, -51281, -2550, 45785, 107827, 71199, 17938, 11624, -47611, -76245, -69569, -50990, 7901, 30449, 23493, -174, -65096, -28239, 38884, 60858, 27347, -46832, -61973, -54266, -64587, -78648, -70134, -39961, -10268, 7186, 66350, 121740, 153652, 114143, 79061, 41009, -30790, -75375, -30413, -19547, -5094, 23247, 68153, 75355, 73716, 50269, -9170, -32398]
14943c2398j574J500K3851K0566J4392K0744K2208k7148l0635M2690l1618Q556
14931C1134m156j4197l9497L076K1707n08k1483j2202P384r018L5214L3834m7389
14918a6101l8631L2993K1976k0901l3478k6676K4915P0631K2242M133J6670o602
14906E1171n0708r373n990J571r027K3199J1990L413K512R625j7212j8660j8169
14893b5658M0643K8293l200j3948l459k2606n7136k6033j315K9750K4132j0763
14881d1300n501K5633J8432m2369O966l8348k313L1084m2127J0618P348K2904
14869d8973M5053l0371j4526J8365J4044K9605j5332j275l0977k4013N313K0579
14857c2508O452p132k3990j1744M9367M5739m783r940k942L7007l0258K2920L2142
$$ y = [-32398, -33972, -32472, -8621, 11945, 26337, 47081, 69289, 42141, 11506, 54196, 22578, 31134, 26978, 12781, -26716, -23640, -1933, -2441, -23924, -36126, -28742, -37760, -2546, 31288, -16101, -54732, -21739, 237, -20664, -54142, -80818, -55903, 14728, 36970, 41103, 57773, 51171, 463, -8910, -14900, -13329, -22356, 843, 12833, 16246, 18758, 28383, 11171, -7489, -25658, 14985, 43278, 40078, 26130, 22671, 65, -57071, -83104, -84419, -54669, -30537, -41300, -46801, -21168, -2736, -45105, -38139, -76487, -78800, -47716, -89843, -79225, -71877, -48973, -3920, -34291, -48817, -30452, -16408, 13197, -2135, -3410, -34387, -58400, -53087, -32508, -26056, -33188, -57178, -68922, -19555, 26184, 21401, 11461, 8519, 45526, 15268, 38188, 70330]
14844G0330o7023j7881N4131l9106m3224J3819M1293n0818J456K7338J7118l8932
14832c1499r636L903k9708L9712K242n6031M4114L7660k3928k8754p870l5340
14820i5135K2698K2538M4949O2890J5791l418j3369m6272n2060j3071K9058k0291
14808d5692n863Q5631K3568m5870n0283n9735J1962K4106J3330M1473L074L533
14796g66j8288L517N5283R076K9291k6681p469n5141k7981j0115K0787k6090L095
14783e1482k9866N7607K3193l8390K1321k6924K6036L4091J7691k3498k6711m4055
14771f0987k0799J162K7062M3205M3108J4766m8909m7155L2738k6L0562k7807
14759a3080m593L050O37k9679l0316k713N037K5680K2775o909j5141j0220M9640
$$ y = [70330, 3307, -14574, 39557, 451, -42773, -28954, 12339, -38479, -37023, -9685, 7433, -31499, -41135, -37232, -66940, -27228, -24986, -81017, -36903, 757, -23171, -51925, -59795, -95135, -72437, -49899, -4950, 57940, 73731, 70313, 56944, 10672, -41388, -54459, -25401, -45692, -51555, 34076, 57644, 11774, -38509, -98244, -86282, -62176, -48846, -7373, -4299, -766, -19054, -15537, 39746, 48822, 78113, 51432, 43963, -11178, -39159, -49274, -28487, -54577, -51482, -81348, -23741, -548, -38938, -17617, -44541, -18505, 15586, 33277, 9779, -16932, -60987, -81786, -80624, -53562, -10357, 32751, 47517, -1392, -48547, -15809, -15835, 14727, -13080, -17673, -14623, -13986, -43665, -73981, -76694, -71657, -45977, -23202, -30111, -45252, -55472, -5832]
14746e832M442m4382J9968o57O222O3851M5808j9595p112j6117n619m593r919
14733B6465p503L4752j6509o5460K7431L4000k2905l4322J1479K5751J7731j9474
14721A1436k8667j4355l8652K1665N1698L9483O302j2626K5029l545l1748J7495
14709D3515j9040l6851j0723j011J3800N4297L4270l7307j7350k3879M6668q974
14697C7415j4703j4575k2221J6182L7214l580j1229m0033l6150n003O344K0637
14685b9702j3737J035J2006M3553P377n8549P568N4717M9558nl9k3102j9803m1575
14671a0698n7160n000M781L4019r072Q278N822q723J3216j1966L619l3301K0297
14658d5888J7910J3346J9597l0907J3051m099k2222m1665k787M9032N7200J1199
$$ y = [-5832, -1390, -45772, -25804, -26461, -20239, 43612, 89420, 69825, 62713, 46596, 40977, 36384, 26465, 18962, 53714, 37205, -28255, -824, 33176, 10271, -24051, -12572, 13179, 30910, 11436, -17231, -31586, -70238, -48573, 3125, 42608, 48910, 36284, 61313, 57768, 26020, 43515, 24475, -12376, -23099, -24110, -10310, 43987, 78257, 40950, 23600, -279, 46389, 37415, 22712, 8137, -14084, 2098, 39312, 35732, 24503, -15530, -51680, -56683, -50339, -29702, -43439, -42404, -30398, 13155, 20532, -38017, -30449, 24268, 73826, 73821, 73782, 50680, 30877, -10698, -67858, -72858, -68077, -34058, -43130, -34852, -29030, -37753, -24537, -36503, -32884, -66185, -45888, -27978, -14632, 4965, -25942, -12891, -16990, -39212, -80877, -83664, -34632, 22568, 33767]
14646C3767m9927l7324N1197r348J666j2704k3902J2662K3551O9442L0213o1484
14634B7809k1745l1693J2810M4130m747q495O578j5982K1825J1580l8904m3718
14622d0552M5978J8035k7950n3397J3749J0396R600o942J1579K6135N691k3135
14610a0813k0867N45L4803j349k8230J9568k5104J8386M8907L1327K917m5269
14598B4821l8432k1206M2901M2280j1436l1604j5068j9502m327k7799J7828l991
14586d5535l5235j06o793P0501M0369n9113j069J1637L457m9978n6813L0731K2634
14573g5313Q5987O5337k3996o1986K8292L9157p725l8823j9363m6152K7000L0040
14561B455m3616l0356k6877L4042N3535K4878L220k5136K8185P114P120j9447
$$ y = [33767, -16160, -53484, -2287, -11635, -9969, -22673, -46575, -33913, -10362, 59080, 89293, 27809, 6064, -25629, -12819, 31311, 26564, 18069, 24647, 8665, 30490, 42070, 3166, -40552, 5426, 23461, -4489, -57886, -44137, -33741, -24141, -31083, -19504, 6631, 12322, -10813, -31680, -31135, 3668, 2319, -25911, -6343, -31447, -13061, 35846, 67173, 70090, 24821, -13611, -34817, 8084, 50364, 38928, 7324, -7744, -27246, -31573, -59372, -41544, -45535, -80770, -80876, -87669, -17168, 23201, -35912, -36981, -25344, -21887, -71865, -128678, -97947, -75313, 10674, 76011, 52015, -9971, 18321, 57478, 49753, 10930, -8433, -54585, -27585, 2455, -41161, -71517, -98394, -64352, -10817, 14061, 17281, -7855, 20330, 27444, 34564, 15117]
14549A5117j5007K3394k3659k4618K624J6271n1911J0144J8922M0334J7380m4517
14537a5526k4234J8590J4940L150K8515M8542l9582j6495K2021j156o4782l9923
14525f5940J932K0664m9313J8087K6243M590j5064J445K1320O2183k6314o4012
14513f4179k392J4082j0617N327L2126k5743J8586Q4343J3881k8290m8442j626
14501a2944j2389r134k0247K3608J5670K3768L4378L4947J0535n1023j06858L1443
14489c8246J9085m2050j162N0193N4851K8676j1520m5786M5725L525R545O4617
14477A37453L6249o0467o2361J1067J402k3796j8908J4326j1752n918l808n5884
14465d2397m8366N951K9028J8004m2897K1501K061k7229L4911N8341J3023J6473
$$ y = [15117, 110, 23504, -155, -24773, -22149, -5878, -57789, -47645, -28723, 11611, 28991, -15526, -39760, -21170, -6230, -3080, 25435, 73977, 34395, 17900, 39921, 38765, -26017, -65940, -64008, -43344, -92657, -74570, -48327, -43737, -58801, -57356, -36036, 26147, -167, -64179, -66571, -52489, -63106, -57779, -25653, -51396, -32810, 51533, 65414, 37124, -11318, -12944, -25333, -34467, -54714, -31106, -15436, 8332, 42710, 77657, 88192, 37169, -69689, -38246, -19161, -61211, -62373, -12180, 42671, 71347, 59827, 14041, 59766, 63291, 72836, 137453, 173702, 113235, 50874, 61941, 63343, 39547, 20639, 34965, 23213, 17295, 13487, -42397, -90763, -84812, -55784, -37780, -80677, -59176, -57115, -84344, -49433, 8908, 21931, 38404]
14453C8404q374m0561J3866M1736Q485j8012M721l4641j906J3700l0739l1316
14441d4637J5694R541k9554j7302k1358l0780J4518J4428q772N8478O8370l6154
14429g528l2904M886k736L2273k6973n465K2755k5580o9650j0183n05O0860P6809
14416A6059K890l4237k975L3157L5094l684l539n795J1549J9086q0483l0850J2072
14403c1656j5676q96l5882r535N2642M0482k2590q1859k5429J32637M5193J1649
14391E9080K7442J5149k2903n4069r772J5945M1100L041j5677o9375N829L2399
14379B8189j9981L5905N804j9286m1164l3006l753l6207K1698L7368J4203r525
14367a9755L8867K9769n871M101k4838J4813K6877K8279J1096p4077q7737L0174
$$ y = [38404, 30030, -10531, 3335, 45071, 53556, 35544, 40265, 5624, 3718, 17418, -13321, -44637, -28943, -19402, -48956, -66258, -87616, -118396, -103878, -89450, -98222, -39744, 28626, -7528, -40432, -35546, -38282, -6009, -32982, -38447, -15692, -41272, -110922, -121105, -121610, -60750, 16059, 18949, -15288, -18263, 14894, 49988, 46304, 42765, 36970, 48519, 67605, -12878, -43728, -31656, -47332, -48228, -84110, -93645, -41003, -521, -23111, -104970, -130399, 2238, 47431, 59080, 86522, 101671, 78768, 24699, 14927, 30872, 71972, 75013, 59336, -10039, -4210, 28189, 8208, 44113, 49917, 30631, -10533, -43539, -47292, -83499, -61801, -24433, -10230, -19755, 19112, 48881, 43010, 47111, 22273, 37086, 63963, 92242, 103338, 29261, -58476, -28302]
14355b8302j88r811k2210K841J1344n179M2284O6956M2894K0213o0164m1065o5161
14342d5548N0799J2526j0702k354P780M1379n1009n8410k1575N618N7359J7613
14330C476n927k9766K4125K7845L562m9973q5492J2525L2672k41K2716J1713M3768
14317A1003j734j6088L7129l1957q4966K1942N2972J7756l9283l2423k42K7724
14305c8167J5452k5922l1061p34K5218N8458J793L3262Q1657N243o8666l7663
14293A8870J3327l5676M5398N6603M702n0683j6412k9070p445m4648m2557J2799
14281g4792K1255R9500M3130M4359J2212m9964n7216K5073K1978o6736n3748K1834
14269a3115k5176J5677L4507K7513L003m3788J1775L9616Q144j3463Q224M948
$$ y = [-28302, -28490, -38301, -60511, -57670, -46326, -51505, -9221, 57735, 100629, 120842, 60678, 19613, -45548, 5251, 17777, 7075, 4721, 12501, 53880, 2871, -55539, -77114, -71496, -14137, 3476, -2451, -32217, -8092, 19753, 23315, -26658, -112150, -99625, -66953, -67194, -44478, -32765, 11003, 9269, -6819, 30310, -1647, -86613, -64671, -11699, 6057, -33226, -65649, -65891, -38167, -22715, -48637, -79698, -80432, -55214, 3244, 5037, 38299, 119956, 125199, 56533, 18870, 32197, -3479, 41919, 98522, 103224, 52541, 36129, 7059, -386, -45034, -87591, -74792, -53537, 45963, 89093, 133452, 145664, 95700, 38484, 63557, 85535, 18799, -34949, -13115, -38291, -22614, 11893, 39406, 42409, -1379, 10396, 50012, 58156, 44693, 52917, 57865]
14257E7865q380k1672k2515k4297N78k5040n4208K9990N2015J3790L8078q95o1386
14244b6077n6364J1370N2501K0973j1147r887N771N310k6065j4603O5171j0973
14232E980k1602K5773M6678J499k53J184k5452j1088M5622l705l6625j7068K2539
14219C3482M418n9049L4975J9620l0516o9908J8530L0686K52m2575K5265P8896
14207D4076k7415l1345k4484m9730l1489k0891K9351N4647K7634L3609N1724j9212
14195C6475o6659j7517L0328M110k5866K2728K745j7182K5374k8433k1448j4742
14183g0087L9182L9650o935L4214K909M2362k1814o4664m6682r252L4015K9435
14171B333l4163N6289M0832l6756m5663m3882j7531K0944o903N3465K6604l0146
$$ y = [57865, 49485, 27813, 5298, -18999, -18421, -43461, -97669, -67679, -15664, -1874, 36204, 35309, -26077, -82441, -71071, -18570, 2403, -8744, -18631, -12860, -7550, -33615, -48218, 16953, 5980, -15622, 10151, 56829, 58328, 58075, 59259, 33807, 22719, 68341, 64636, 28011, 10943, 33482, 37900, -21149, 13826, 33446, 2930, -66978, -48448, -17762, -17510, -60085, -34820, 44076, 16661, -14684, -39168, -88898, -120387, -141278, -111927, -57280, -29646, 3963, 55687, 36475, -30184, -47701, -17373, -13263, -39129, -16401, -13656, -30838, -5464, -33897, -55345, -70087, -30905, 8745, 1810, 36024, 38933, 81295, 59481, -5183, -51865, -61117, -27102, 2333, -31830, 24459, 65291, 28535, -17128, -61010, -78541, -57597, -64500, -11035, 15569, -14577]
14159a4577k8331l4877K4162N2791J8467p755n912N0157J1792m5279P406N874
14147C3918J3202j4761j7298l4557j169j6829L338M5187j09k8027L440J668K9897
14134A7900K639j0749j9335o40n51M4971K3627m4135m5786r546J244M4385J9326
14121B3350k318K3452l4221j2892J7091l405k3941J9312L4132J1054O175n1643
14109F146n5095J6068L080K1291K8333k035J985J2901j7706J3349l8336m9108
14097e9127o023O2483K4826m375k5689o6393m5966K8907K6015K8400J4851K1727
14085c64M7426M0949j8923k9470o6624n2706o011L1031J7354p206j6226L2438
14073b8332M3212M8409J9344p5996K1165j1706o612K623J5782K7355k1706j9044
$$ y = [-14577, -42908, -77785, -53623, -832, 17635, 9880, 3968, 54125, 65917, 20638, 28044, 33918, 47120, 32359, 15061, -19496, -20665, -37494, -34156, 11031, 10922, -17105, -13665, -11997, 17900, 20539, 9790, -9545, -10185, -10736, 34235, 57862, 13727, -32059, -41605, -40361, 4024, 23350, 21032, 44484, 10263, -2629, 14462, 11057, -12884, 6428, 40560, 51614, 57789, 6146, -48949, -32881, -29801, -8510, 19823, 17788, 19773, 32674, 14968, 28317, -10019, -59127, -65150, -2667, 22159, 17784, -7905, -74298, -120264, -91357, -65342, -36942, -22091, -364, 47062, 88011, 69088, 39618, -27006, -79712, -85723, -54692, -37338, -44544, -60770, -28332, 14880, 63289, 82633, 6637, 27802, 16096, 9484, 12107, 27889, 55244, 33538, 14494]
14061A4494L7526J1425J5608L613j3892p1943K2499o704M9685L9623k7945p1566
14049B423n915K1672j929o750L9239O961l6926q3522j4563K9180P2096j867k5407
14036e308j9249J1386j2471l8429J817L5398L9780L3010j0154p2954k1234M2991
14024a5417P1870m064j4540J0918p525n4103k647l917p443L9460j7887N29r427
14011a4193L9863j4483l1030L7531L1941J5743j8378Q26K7383k4154n098n979
13999C9972k6628J9720j524n9664K239K2731K5344K7015o9600l0610K8813K809
13987a9383l1703L5307J4280J5723L2313k2527R369q156j3873K1580n1377k1009
13975c9456L5312N6840j1688m0809k8111m2805j1868K6635N288m4949j3664K2271
$$ y = [14494, 52020, 63445, 79053, 82666, 68774, -3169, 19330, 12626, 62311, 101934, 73989, 2423, -3492, 18180, 16251, 9501, 48740, 55701, 18775, -64747, -79310, -50130, 21966, 20099, -5308, -24557, -13171, -25642, -64071, -62254, -26856, 12924, 45934, 35780, -37174, -58408, -15417, 56453, 52389, 37849, 48767, 41242, -12861, -15508, -19425, -26868, 12592, -5295, -4766, -14193, 25670, 11187, -19843, 17688, 49629, 65372, 46994, 47820, 75203, 51049, 45951, 39972, 13344, 33064, 31540, -28124, -25885, -3154, 22190, 49205, -20395, -51005, -22192, -19383, -51086, -15779, -1499, 14224, 46537, 24010, 33379, 25223, 11350, 32930, -18447, -39456, -4144, 52696, 41008, 199, -27912, -70717, -82585, -55950, -50662, -95611, -109275, -87004]
13963h7004M4135k1019m1944K5908J04919J01031m216n2468r195L3695l1864j5630
13951D6348j9122L1728O861k998m537o959k1754k6857K520j7607O394N9290r535
13938D3772o5790M5318M3854m432K7024j0940n1439m5721N3148L056k7182j8860
13926h192N6645K9502k4669m7988k1438j3964L2927N8024N276l6359R00N5112
13914H5776J618o1765n3846m4750j8666N5962P6380J8252m1426k6419j2469J8220
13902c133J8374J2903P183o842K536J4263n431l4541j154r498J1395K2579N214
13889C3848n8979k5297K4362N1638L6740K8290P700j10846m2917M6402k5183n695
13877c9937m0286K1744m2708k1139M1540Q4500K5932j5597J1226J2315n5070k0783
$$ y = [-87004, -42869, -63888, -105832, -79924, 24995, 126026, 121810, 69342, 60147, 93842, 61978, 46348, 27226, 58954, 65815, 62817, 58280, 51321, 29567, 2710, 5230, -12377, -5983, 53307, 43772, -22018, 23300, 67154, 62722, 89746, 78806, 27367, -18354, 34794, 37850, 10668, -8192, 48453, 77955, 53286, 5298, -16140, -30104, 2823, 60847, 66123, 29764, 30664, 85776, 87394, 25629, -28217, -72967, -91633, -35671, 40709, 58961, 17535, -8884, -21353, -3133, 15241, 28144, 35327, 28485, 31021, 45284, 39853, 5312, 4158, -5340, 6055, 28634, 33848, -25131, -50428, -26066, 25572, 62312, 90602, 98302, -12544, -55461, -9059, -34242, -39937, -80223, -58479, -101187, -122326, -80786, 3714, 29646, 14049, 25275, 37590, -17480, -38263]
13865c8263L2011J7920l1355J7803m959j6074o063k0060J5653k0723J0498J8196
13853b5416N741O2484L191k3138K1698o4945n9475j0433M0369O4879L5757m031
13841D6681J8382m4706n4656n488j6866p339J0893L313l195M8671N1666M3121
13829I0477k5811p1626m6806K8832P023K1537L6357m654l2796L471m437M902k2303
13816a5834k7410M3051L0081J8861m3909m7830p7128q300M2656K6244K6395L0385
13804b738K5510N049n7171n0193K7834M7195J641M1957N4546m1215p9500J9464
13792g621L9543J9290Q22O70j0879r839j3448l0522J0908L7388k0932M359J3725
13779C3464k355l8540l229q338O3186N3381n2923l174j8264l8509j1001j0148
$$ y = [-38263, -6252, 11668, -19687, -1884, -6843, -22917, -28980, -49040, -33387, -54110, -43612, -25416, -19675, 42809, 46000, 22862, 44560, -20385, -79860, -90293, -49924, 14955, 50712, 46681, 65063, 20357, -34299, -39787, -56653, -63992, -53099, -49786, -52981, -4310, 47356, 90477, 64666, -6960, -53766, -24934, -17911, 3626, 39983, 35329, 2533, 6004, 1567, 6469, -15834, -43244, -193, 29888, 48749, 4840, -42990, -120118, -128418, -85762, -59518, -33123, -2738, 22772, 27821, -29350, -79543, -51709, -4514, -2873, 39084, 93630, 52415, -27085, -7621, 31922, 51212, 52034, 52704, 41825, 31986, 18538, -11984, -1076, 36312, 15380, 19739, 33464, 31109, -7431, -10660, -18998, 44188, 97569, 44646, 41472, 23208, -15301, -26302, -36450]
13767c6450m284P499J2093M9656P721l3484j1369J155L568J3196R304j2000L183
13754I788k0071j1070J5031O3226J7857k4432j7605o069N1276k0852n2933j1717
13742g571N7171o2581k8747J9955J9473L3907K8719l9990j0557K4046k4186L5305
13730D4944K2731j7304k3128R814j3337J4254L3534j7414j7262L5539k0521o0025
13718h175k1641m835k2464j263l1036L2173L6294K941j7741L940P860l5476M5653
13705a3770M6647j166k8273K5354J0858N2377K4294j0350j2759K446j8677j7744
13693E9237k0701k1608r285J0877K1544j2624l6852k6714J2467j3320k9112j0643
13681g6734N0654L9798L6744k8545N434Q0455j8959q7291o9429k371L0635j4083
$$ y = [-36450, -40734, -33235, -21142, 28514, 36235, 2751, -8618, -7463, -3895, 9301, 18605, 6605, 9788, -10283, -21353, -6322, 56904, 74761, 50329, 32724, 26655, 77931, 57079, 4146, -7571, 49600, -12981, -41728, -21773, -2300, 31607, 60326, 20336, 9779, 33825, 9639, 44944, 67675, 50371, 27243, 37057, 23720, 37974, 71508, 54094, 36832, 72371, 51850, -8175, -29816, -34651, -57115, -58378, -89414, -57241, -20947, -18006, -35747, -31807, -23947, -59423, -13770, 32877, 31711, 3438, 28792, 39650, 92027, 116321, 105971, 93212, 95658, 76981, 59237, 38536, 16928, 7643, 18520, 40064, 27440, -9412, -36126, -23659, -36979, -66091, -76734, -26080, 13718, 50462, 21917, 27351, 107806, 88847, 1556, -67873, -70244, -39609, -53692]
13669e3692R5848M3796n1310p7283K1895M8811J2799n467r241J706n492k0480
13657A890J5080J4359K1776M4979J1500N909L7037k665l5161k1512j3921R126
13645H8397l7657J97L4992k2278o6136m242l4358l530N0573M1280J8972J7005
13633H3215n849O101k1626J1067L9516m0601o7246o6342N0148J1277j886J0399
13621H173O943j5197j6550J6318k9451k7462j8458J7309M4702L6815k1511J3245
13609A4876L4521K8331L7669n814m0438O902o192j0729K45l4373p9384K5928O3246
13596C4788J9265j2671n27m810k8576O3623P2265l1980r0095J377K0273N395L0320
13583G8647J8084j4807k833K6592l2736j6763n4050l428K4344l1632L0915p392
$$ y = [-53692, 42156, 85952, 34642, -42641, -20746, 28065, 40864, 35397, 26156, 27862, 22370, 1890, 16970, 31329, 53105, 98084, 109584, 115493, 152530, 149865, 114704, 93192, 79271, 88397, 50740, 50937, 85929, 63651, -2485, -6727, -41085, -44615, 5958, 47238, 66210, 83215, 77366, 83467, 61841, 72908, 112424, 71823, 4577, -61765, -11617, -340, -2226, 8173, 15116, -81, -16631, -313, -29764, -57226, -75684, -58375, -13673, 23142, 1631, 14876, 49397, 77728, 115397, 109583, 69145, 76047, 69855, 59126, 59371, 24998, -54386, -28458, 34788, 54053, 41382, 40855, 36045, 7469, 71092, 143357, 111377, 21282, 22659, 42932, 48327, 78647, 96731, 81924, 79091, 105683, 72947, 56184, 2134, -1294, 23050, -8582, 22333, 14941]
13571A4941J8168n688L4201m991k0548M049L0171n0003l0411N4253J4157j2084
13559D6215K3160K6239k8901k8147J5026j5723l5711j1768n6739M1201k118J3400
13547a3866K0749j2725L5311M4580J4904l506R193l8855j8918k0398m9792m711
13535c8034j3926O119R486N0262O5393M4082J0464l7884o0884p221k5411K0761
13523B3207N1489J5303k994j8532q73k1801L6681k800o3511n172L0187L5674K9985
13510A06843n0497n7949o117K6835K7577K09l9178J6630r554m0439J8558K6106
13498A9024p212j4273k4333L5906L5763J2604k5541N605J0328j6264j8860k8203
13486a5456j1789q508O206K4115J1384q071L3356M9413M307J4611j7321n2544
$$ y = [14941, 33109, 27421, 61622, 56631, 36083, 40132, 70303, 20300, -10111, 44142, 58299, 46215, 69375, 95614, 66713, 38566, 53592, 37869, 2158, -9610, -66349, -25148, -27266, -13866, 6883, -5842, 29469, 74049, 88953, 85447, 94640, 55785, 36867, 16469, -33323, -38034, -51960, -45841, -36355, 13907, 79300, 123382, 133846, 95962, 35078, 27857, 2446, 23207, 74696, 89999, 87005, 68473, 67600, 45799, 82480, 79680, 16169, 10997, 41184, 76858, 106843, 56346, -1603, -7720, 19115, 46692, 46901, 7723, 24353, 14799, -25640, -7082, 19024, 11812, -2461, -26794, 9112, 44875, 57479, 31938, 37543, 47871, 31607, 12747, -15456, -27245, -35753, -29547, -5432, 5952, -2119, 31237, 80650, 84957, 99568, 82247, 29703]
13474B9703l8081K623N703L708M9900j5052l5481l4981N3871L7215O664k9397
13462C6395k1562J9225K3426K9705p2627M9702J9328n9124l4100L6234L359p3714
13450d3753l3792P9338M2346n73K3750k5503R228N4880L5n5084K9624K8438m8476
13437F0458J0200J8469l8888j3088L9998J2673M8605K2114l1402m434l1226m007
13425H9472k4889L4004Q9562O7065R220l3023j5049j0422n8262k0601N1231O762
13413A85070O3827O0445Q4795Q7361P5574J67699K41593L78922M30482L33797
13403B109565o4409l13622k73178j68037j19038j28813j22551j53709j52267j07593
13393E06348k1920q4362r7102k3576j9677j7629j9253o067P484n0933l9463j7614
$$ y = [29703, -8378, -5755, -52, 3656, 53556, 38504, 3023, -31958, 21913, 59128, 65792, 36395, 14833, 34058, 57484, 87189, 14562, 64264, 83592, 24468, -9632, 26602, 29961, -43753, -77545, 1793, 44139, 43566, 67316, 41813, 51041, 105921, 105956, 50872, 80496, 108934, 60458, 70658, 89127, 50239, 37151, 77149, 89822, 138427, 160541, 129139, 124705, 93479, 89472, 64583, 98587, 188149, 255214, 264434, 231411, 216362, 205940, 147678, 127077, 178308, 185070, 248897, 309342, 394137, 481498, 557072, 724771, 966364, 1345286, 1775768, 2109565, 2045156, 1731534, 1458356, 1290319, 1171281, 1042468, 919917, 766208, 613941, 506348, 484428, 400066, 302964, 279388, 259711, 242082, 222829, 216762, 224246, 173313, 133850, 116236]
13381A16236m969O1158J5995m0334K7514J4333Q749R765l1999o7333o5298k0159
13369B3658m1176M2732K464j2832O8637O859n4379j5295j7391p942r365K5429
13357A1399j9387k4440L2809M6784L9723Q495J4605J0494j1888k8355m056K14
13345G6397J9714r714m960l5398L7081M046k56j0759J8169K3619l4089l7675j2904
13332C3271J1097K813L1209K0284k6050k0976K4843J4890j4685l0458o508L4867
13320G4597K3842j4339p1971L246J8542J8645k2367O464K6678j5841J5797l3792
13308B9501L9883k5263P60j5776J2442k0405k8409M7792N2084k9793k8545O1126
13296I5397M7429k3592j6585L0400k5952j3908n997J4274l7388k4395O892L2647
$$ y = [116236, 111267, 172425, 188420, 148086, 175600, 189933, 198682, 208447, 176448, 109115, 43817, 23658, -17518, 25214, 27678, 14846, 83483, 90342, 35963, 20668, 3277, -4665, -14030, 11399, -7988, -32428, 381, 47165, 86888, 95383, 109988, 120482, 108594, 80239, 76183, 76397, 96111, 86397, 81437, 46039, 83120, 87166, 86910, 76151, 94320, 117939, 83850, 46175, 33271, 44368, 47181, 78390, 98674, 72624, 51648, 76491, 91381, 76696, 46238, 39730, 74597, 98439, 84100, 12129, 15375, 33917, 52562, 30195, 36659, 63337, 47496, 63293, 29501, 69384, 44121, 44881, 29105, 41547, 21142, -7267, 40525, 92609, 62816, 34271, 95397, 142826, 119234, 102649, 133049, 107097, 93189, 87192, 101466, 64078, 39683, 46575, 79222]
13284G9222j341J2692l3948j1474J3596L538N887M3269l3571m3440J9635J7000
13272G1065j2730O1179L5576j5154k2427l7755M153J2635j7889j2355k1907P703
13260E2094N6925O465j8962K2864k6665k6827J932K8869n198k87M5741M5673J327
13247A83951L612n9710r965l0128k6121n516l8258J8699M8141R714k5505l6236
13235C2678M711K6896j9574j4658J5418K8772K3371m4999k8923K7420K8045k7948
13223E1209o518p230K7298L4111K3043M6186M0572J7026l3056l7075L9540n836
13211A89270k9451j9043L9672k7071J3342L8190J6438k6744m3325m2205m157P810
13199A12726J7217k2605Q1513k938m0985k7170J4097l1060o7950n4675K1536P5029
$$ y = [79222, 77881, 90573, 56625, 45151, 58747, 62285, 68172, 111441, 77870, 34430, 54065, 71065, 58335, 119514, 155090, 139936, 117509, 79754, 83907, 96542, 78653, 66298, 44391, 52094, 109019, 115484, 96522, 119386, 92721, 65894, 67826, 96695, 91497, 91210, 136951, 182624, 183951, 187563, 127853, 117888, 87760, 61639, 56123, 17865, 36564, 84705, 94419, 68914, 32678, 37389, 64285, 44711, 30053, 45471, 74243, 97614, 52615, 23692, 51112, 79157, 51209, 44691, 37461, 64759, 98870, 121913, 168099, 208671, 225697, 192641, 155566, 195106, 189270, 159819, 140776, 180448, 153377, 166719, 204909, 221347, 194603, 151278, 109073, 104916, 112726, 129943, 107338, 188851, 185913, 144928, 117758, 131855, 100795, 32845, -21830, -294, 74735]
13187G4735L8175j8687m6751R597P9563K5425k8916n4598l7373o534j741K9504
13175F2399l082N5644L3859n6319n0076K182j0675l5042P401L1250K3163O2750
13163A23454O1394N454k6917m2882J4207L8478K6242o167K1966j2484R5123J28051
13151D25919J75639J32460N5679j6869n5808p1293q9734k7265n5172l5059j2504
13140D25993r459J0590l421o5574l4629n7209o2738l765L7975M7129P029j7509
13128B74412p9087L0924M3382J1410k5380j7049J1313L501N2797k6023o5986m7190
13116A67024M1234N5718P2302M3155K5729m4068n9769l4141L019j0719L6705L1597
13104C27786l7871m1908L287L2753L4784P546L7585J7821k8447K7803R654K5172
$$ y = [74735, 112910, 94223, 47472, 57069, 136632, 162057, 133141, 78543, 41170, 34636, 32895, 62399, 59317, 114961, 148820, 92501, 42425, 44607, 33932, -1110, 6291, 37541, 60704, 123454, 184848, 190302, 163385, 120503, 134710, 173188, 199430, 193263, 215229, 202745, 297868, 425919, 601558, 734018, 789697, 772828, 717020, 645727, 555993, 528728, 473556, 438497, 425993, 416534, 427124, 423703, 358129, 323500, 266291, 203553, 199788, 237763, 284892, 291921, 274412, 195325, 226249, 269631, 281041, 255661, 238612, 249925, 253426, 306223, 280200, 214214, 167024, 208258, 263976, 336278, 379433, 405162, 361094, 301325, 267184, 270203, 259484, 296189, 327786, 289915, 248007, 251294, 284047, 318831, 326377, 363962, 381783, 353336, 381139, 390793, 415965]
13092D15965Q2908N1716O4022P1995P4907Q4097o816J8040O3872J72579K83373
13081A376658L53160N59329Q01894P38339N6260n13105n20495l69217k70392j86501
13071B025930j70191j77189j38292k25820k03107j19404q4057k1031m5525m2459
13061G98855q2097j1114m989j7421l4742k3829k0315K5684l6435l4304J6950K8256
13049F04499j5264J8856J1605k1552J8221L1573K2010M3288o000l2920N352N6063
13037G35731M0048L4273J8775K7285J3884L403O4245k3638N3545O7717L2054M54
13025A067776l3235k0573j2582j8538L3052M2075j4470N8440K4363N6425N7729
13014A240462M7964N252Q1033N8378M4149O0970K6723K6411O0372P9920J02823
$$ y = [415965, 498873, 550589, 614611, 686606, 761513, 845610, 838794, 856834, 920706, 1093285, 1376658, 1729818, 2289147, 3091041, 3829380, 3885640, 3372535, 2852040, 2482823, 2212431, 2025930, 1855739, 1678550, 1540258, 1314438, 1111331, 991927, 907870, 886839, 841314, 798855, 716758, 705644, 700655, 683234, 648492, 624663, 604348, 630032, 593597, 559293, 576243, 604499, 589235, 608091, 619696, 598144, 616365, 647938, 669948, 713236, 707236, 674316, 679668, 735731, 775779, 810052, 828827, 856112, 869996, 873399, 937644, 914006, 967551, 1035268, 1067322, 1067776, 1034541, 1013968, 1001386, 982848, 1015900, 1057975, 1043505, 1101945, 1126308, 1182733, 1240462, 1288426, 1293678, 1374711, 1433089, 1477238, 1538208, 1564931, 1591342, 1651714, 1731634, 1834457]
13003A834457J76911J18260L7209K7730Q6225J49385J77087J70887J25713J82529
12993C086393K14198J94206J88093K44379K89377L34870L24135L46019M58968
12984E680638N06634N49925N78557O50711O71428P96988R40311J174398J392941
12975A2942531J645591J934907K388667L058228L964972N152560O778920R013694
12967D6880070J1877231J6457568K4705006L8804122O1388508R0151536R5140295
12960C85404336K4330790n6068050o6468429m6990598l0924901k2916603j9990383
12953A66376162k0863544k3688020k3739037j9611698j4767482j1016322q291615
12946D4398444o376120n007503l836099k908145k153312j799446k018170k137971
$$ y = [1834457, 2011368, 2129628, 2166837, 2194567, 2280792, 2430177, 2607264, 2778151, 2903864, 3086393, 3300591, 3494797, 3682890, 3927269, 4216646, 4551516, 4875651, 5221670, 5680638, 6187272, 6737197, 7315754, 7966465, 8637893, 9434881, 10375192, 11549590, 12942531, 14588122, 16523029, 18911696, 21969924, 25934896, 31087456, 37866376, 46880070, 58757301, 75214869, 99919875, 138723997, 200112505, 290264041, 385404336, 409735126, 353667076, 287198647, 240208049, 209283148, 186366545, 166376162, 145512618, 121824598, 98085561, 78473863, 63706381, 52690059, 44398444, 38022324, 33014821, 29178722, 26270577, 24117265, 22317819, 20299649, 18161678]
12938A8161678j913892j575144j285095j128249j043103r76082r74785q26547
12930H438781o36571n92406n10366m40104m01418m30674l25215k45697k65332
12921D590998k40340k01498k17678j91734j66501j75254j36974j80953j66381
12912B913685j06680r9074j66603j89267j54311r1273j31214r2286k5972p1063
12902A785942l4965l4848o1118q6242q8993j24257m5043m4932m4364p8385O586
12891A149381j6813p4569n4635j8556l8058j6266L486l3631J96l5355o2108l9921
12879G63151l3197Q194l912L496J1557m1020m4314l3084r785j9561J2130K7036
12867F40691k3121l8119l9913j380J5308m6373j2169j0941m3404R844M578k0891
$$ y = [18161678, 16247786, 14672642, 13387547, 12259298, 11216195, 10240113, 9265328, 8438781, 7802210, 7209804, 6699438, 6259334, 5857916, 5427242, 5102027, 4856330, 4590998, 4350658, 4149160, 3931482, 3739748, 3573247, 3397993, 3261019, 3080066, 2913685, 2807005, 2707931, 2541328, 2352061, 2197750, 2106477, 1975263, 1882977, 1857005, 1785942, 1750977, 1716129, 1655011, 1568769, 1479776, 1355519, 1310476, 1265544, 1221180, 1142795, 1149381, 1132568, 1057999, 1003364, 984808, 946750, 930484, 933970, 900339, 900535, 865180, 803072, 763151, 729954, 738148, 734236, 737732, 749289, 708269, 663955, 630871, 621086, 601525, 613655, 640691, 617570, 579451, 539538, 538158, 553466, 507093, 494924, 483983, 440579, 450423, 455001, 434110]
12855D34110Q24J417j8618k5150J8812J4919L9998J5841J7336j67l8010q437k6167
12842D26708J4730L8869l1885p3521j8579n33L8471L0292L8890K7378Q239j6285
12830D82774J2186l2553q4329m1151j6534k9318o0904J7676O3632J45M8520L9771
12818C99915L1874L0623j7809j1551n9356l3502J5056J4635m4431k6908o2954
12807B35592k992J08630j1167N369J2001n4839j9807J5413m9062j2113K2064O968
12795B56057l6446n2895j0758N2040K919J5449J5992p509k1989k1667n1635m6253
12783I3305K6225M8590j6533l6130k2823j7117l0841p9343o6652m4652q6197j76071
12771d08239j41703P9731J39707J51755J19211r365M8520P3832O2715N4577M2348
$$ y = [434110, 434934, 436351, 417733, 392583, 411395, 426314, 466312, 482153, 499489, 499322, 461312, 452875, 426708, 441438, 480307, 448422, 374901, 356322, 355789, 394260, 424552, 463442, 490820, 499059, 482774, 494960, 462407, 378078, 336927, 320393, 291075, 230171, 247847, 311479, 311624, 360144, 399915, 431789, 462412, 444603, 433052, 373696, 340194, 355250, 369885, 325454, 298546, 235592, 232600, 341230, 330063, 335432, 347433, 292594, 272787, 288200, 239138, 227025, 249089, 256057, 219611, 166716, 155958, 207998, 210917, 226366, 242358, 234849, 212860, 191193, 139558, 93305, 119530, 168120, 151587, 115457, 92634, 75517, 44676, -34667, -101319, -145971, -232168, -408239, -549942, -470211, -330504, -178749, -59538, -68903, -20383, 53449, 116164, 170741, 213089]
12760B13089q4944k3320N6126J439P0008M0628m2170m5423k3707j0145j0389K7697
12748A68889J7816J1101N3806o932Q186k8912n2145L6232o270k8154l950l4464
12736A35203K4802M3530n902O471N581k0260j8691j0668M0474J1091j3137k1779
12724A76715l0437j8910o005K1423K17M1079J7283j1283k0641P3726J602m6780
12712A97989J20M6133K501l4495k8984l5778L8923J1742l3191l4993J7961N124
12700A53052k0705J5787K973R670j3983K4726J3953l0934k9779j2889j2298j24
12688I9449Q747M8536K8955j9062k8424j9699P992k2891L913M1381M0727k2874
12676A66750l2567K8213j3346Q786M1926P461k4591o3235j3987K1797k8j8195
$$ y = [213089, 128145, 104825, 160951, 162390, 232398, 273026, 230856, 185433, 161726, 151581, 141192, 168889, 186705, 197806, 251612, 244680, 252866, 223954, 171809, 208041, 201771, 173617, 169667, 135203, 160005, 203535, 197633, 204104, 209685, 189425, 170734, 160066, 200540, 211631, 198494, 176715, 146278, 127368, 121363, 142786, 143003, 184082, 201365, 190082, 169441, 243167, 244769, 197989, 198109, 244242, 246743, 212248, 183264, 147486, 186409, 198151, 164960, 129967, 147928, 153052, 132347, 148134, 151107, 160777, 146794, 171520, 185473, 154539, 124760, 111871, 99573, 99449, 108196, 156732, 185687, 166625, 138201, 118502, 126494, 103603, 107516, 148897, 189624, 166750, 134183, 162396, 149050, 157836, 199762, 207223, 182632, 119397, 105410, 127207, 127179, 108984]
12664A08984j8596M4461j310Q4278K2234k7004l6863R387l0833j3211l8595K7593
12652A30525L4469q167J3499k4868P743r819J4486N7376K9213J917l6324k271
12640B07779m8034j1051l1572L2503N4990j2592k8012L393o255J9945j0505L340
12628A73929p047j863K1860m3724k0409J9986M237K9214q767L4183j7481n4367
12616A29751L2229P280m3191k8554M6327l294J9464K9536j0297l7706J4334O054
12604A61933l3013o069L6862l8681J6892K360m2220j5278M8023K6654o420m9853
12592A01190J9379M1596l2451K562M68k220j2036j3898m766O674O1117K0431M5619
12579B33665k7637j935q757K5449j3076k6970n905n4464k685l422q885J291K8265
$$ y = [108984, 90388, 134849, 133539, 217817, 240051, 213047, 176184, 185571, 154738, 141527, 102932, 130525, 164994, 156827, 170326, 145458, 153201, 143382, 157868, 215244, 244457, 246374, 210050, 207779, 159745, 148694, 117122, 149625, 204615, 192023, 164011, 167404, 161149, 181094, 170589, 173929, 166882, 165019, 186879, 143155, 122746, 142732, 146969, 176183, 167416, 201599, 184118, 129751, 161980, 169260, 126069, 97515, 143842, 140548, 160012, 189548, 179251, 141545, 155879, 161933, 128920, 122851, 159713, 121032, 137924, 140284, 98064, 82786, 130809, 157463, 151043, 101190, 120569, 162165, 129714, 132276, 132744, 130524, 118488, 104590, 99824, 106498, 167615, 188046, 233665, 206028, 204093, 195336, 220785, 207709, 180739, 174834, 120370, 117685, 114263, 105378, 106669, 134934]
12566A34934j400N3299J6674j5751l181J0989N0359r287j5145n4255m8795l976
12554A14465L7171L821p07K3298m4597K1041q965r7252n719M9217L2149n2P631
12541A31501L5509o784J1462J5230j9450J0089L5808P216j2383R041j0516j5486
12529A91237J0936k3998P72L6568M6387l026N915N7434M5058J1589m4727K8751
12517C62896L2928O5823J20230J58846K15523L93894M77753L40065o6419l33973
12507A767566k64571k28478j54302j14898j04831n6872r9878r8429q6578p1535
12497D87194n5735k0309M0436K120J29J006l8908k0407p6367q1388l7322k1832
12485A78617k3565J1909K9732J0380k8347K5381J0722j5237L6020K4080Q393J2708
$$ y = [134934, 133534, 186833, 203507, 187756, 184575, 195564, 245923, 236636, 221491, 167236, 118441, 114465, 151636, 155457, 154750, 178048, 133451, 154492, 145527, 48275, 42556, 91773, 123922, 123870, 131501, 167010, 160226, 171688, 186918, 167468, 177557, 213365, 220581, 208198, 217239, 206723, 191237, 202173, 178175, 178947, 215515, 261902, 258876, 264791, 322225, 367283, 378872, 334145, 362896, 395824, 461647, 581877, 740723, 956246, 1350140, 1827893, 2167958, 2101539, 1767566, 1502995, 1274517, 1120215, 1005317, 900486, 843614, 743736, 645307, 558729, 487194, 431459, 411150, 451586, 453706, 453835, 454841, 415933, 395526, 319159, 237771, 200449, 178617, 155052, 166961, 196693, 207073, 178726, 204107, 214829, 199592, 235612, 259692, 268085, 280793]
12473B80793M007j9544j6686l7009n1145p4960j5665L5058P8057J1218O366J9000
12461B19490l12L672m661K935l0134J3047p529j9593j8886k2777k5J8660k6660
12448A27227k6070p310P540K4691N1330K1321m0186m2311k424m560M7906M7511
12436B04665k1781m3237o640j7785K7857k0674L2303L0778k509J3631m9657l2873
12424A14078r695j132M7471P7786p244p051o0771m9435M121J0588J2534J9728
12412A50978l0047k8326j9802j0567N7344Q1875K3023l9278J3385q263j7066k8736
12400A44520k5552K5531J5842l395J1728Q131L3810K2870o031J4369m2188j272
12388A98363m3704M3156M024l1009K0801k8280m538M3830M776j3556j0919o9959
$$ y = [280793, 284800, 265256, 248570, 211561, 160416, 85456, 69791, 104849, 182906, 194124, 200490, 219490, 219178, 222850, 218189, 221124, 190990, 204037, 196508, 176915, 158029, 135252, 135227, 153887, 127227, 101157, 93847, 101387, 126078, 177408, 198729, 158543, 116232, 113808, 109248, 157154, 204665, 182884, 139647, 133007, 115222, 143079, 122405, 154708, 185486, 182977, 196608, 146951, 114078, 104383, 103251, 150722, 228508, 221264, 214213, 153442, 104007, 108128, 118716, 131250, 150978, 120931, 92605, 72803, 62236, 119580, 201455, 224478, 185200, 198585, 190322, 173256, 144520, 118968, 144499, 160341, 156946, 168674, 176805, 210615, 233485, 227454, 241823, 199635, 198363, 154659, 197815, 201839, 170830, 191631, 163351, 158813, 202643, 207419, 193863, 182944, 112985]
12376A12985L682M3942J4541j174m403P5029P0745L082l5826k8452k5417J9286
12364B48020k408k2667k0714j93l5307k6248K6118K3027J6396r363L2698L7167
12352B66526j9430m2450l9427j0082N143K0573N7022L7435P331k902k3449j2299
12340B43991M2310K4043L7041Q210m6689l7905m8395J1233l37K9180k8266Q120
12328B42536L4120k023j3991l2642j1121K6096j1254j1550L7664L1113k2992l0094
12316B35862k9669K704k585n5463J6628O7031N2454m2323J6125j008m076L2368
12304B88048L4090j5765K9361j2531K5860j7922m4974Q893j8826J4946L8201J4840
12292C44221K1827M393n5838k6231J0238J7156J214k022l4504l0492l9429K6289
$$ y = [112985, 116667, 160609, 175150, 173976, 169573, 244602, 315347, 318429, 282603, 254151, 228734, 248020, 245612, 222945, 202231, 202038, 166731, 140483, 166601, 189628, 206024, 196661, 229359, 266526, 247096, 204646, 165219, 155137, 160280, 180853, 237875, 275310, 282641, 279739, 256290, 243991, 286301, 310344, 347385, 355595, 308906, 271001, 222606, 233839, 233502, 262682, 234416, 242536, 276656, 274633, 260642, 228000, 216879, 242975, 231721, 220171, 257835, 288948, 265956, 235862, 206193, 208897, 206312, 150849, 167477, 234508, 286962, 244639, 260764, 259756, 255680, 288048, 322138, 306373, 335734, 323203, 349063, 331141, 286167, 295060, 276234, 291180, 329381, 344221, 366048, 370441, 314603, 288372, 298610, 315766, 316980, 314958, 280454, 249962, 210533, 236822]
12280B36822L8172j4634M6636N7880J4755j3359K3706K2826l4351j6809j3749
12269C47895l0749l8708L742K0452M574o308k7476j2603K0334J3997m22l50L7668
12256C32046k8569j7007L0003L7959L5032K8479J10q6033m5369J2221M7988L5029
12244C81889M3296l9682m8687k6190j6509J6966J089L458J2971M0189K1060N8784
12232D48634L4135M691K082n4833p3487K492N528j1271J5148j432M9653N2939
12220D74279P07n345l7377n5714J7919L3913L2248N227L8975k4833p0007l9772
12208C70220N2660M809K1611K110M1790j1565J8347K0642q6653m1496J9560k49
12196D11786P942J775N9835O4554J268J3535l1290l4247k4096q536l904N3094
$$ y = [236822, 274994, 260360, 306996, 364876, 379631, 366272, 389978, 412804, 378453, 361644, 347895, 317146, 278438, 282180, 302632, 307206, 300898, 273422, 260819, 281153, 295150, 294728, 294378, 332046, 303477, 286470, 316473, 354432, 389464, 417943, 418053, 332020, 286651, 298872, 346860, 381889, 425185, 385503, 336816, 310626, 294117, 311083, 312172, 315630, 328601, 368790, 389850, 448634, 482769, 487460, 489542, 434709, 361222, 363714, 369242, 357971, 373119, 371687, 421340, 474279, 474986, 469641, 432264, 376550, 394469, 428382, 460630, 465857, 504832, 479999, 409992, 370220, 422880, 427689, 449300, 451410, 493200, 481635, 499982, 520624, 433971, 392475, 412035, 411786, 419728, 421503, 481338, 545892, 547160, 560695, 529405, 495158, 471062, 462526, 458622, 511716]
12184E11716l105o089K3524j6003Q777K5690j320k2756L2016M0746L758j8637
12172E78317K4602M5422k0808m4684j8054k0230j5601K0983M1823m1460o145j245
12160E42920j8985L020P2193N5016k6867k8606k013O504J748l828N5964L6746
12148F93812o035m9080k9682L1573J5590K9545M8376k8338k0459j0885l5463o102
12136F32852M9842N0145n043k4336L1562j1253j8105j2212N4240N6189K1931K1727
12124H47539r309p3L888k0608j8584N2064l2877j9218J9208J7030L5451K2251
12112H96762M3923p76k0188Q414M8263r610l3081J8439j1845l4341K8434j2411
12100I21983L722J2021L7642n0840l6658N8280M7172j2021n5863O1780M4435K1436
$$ y = [511716, 508611, 502522, 526046, 510043, 518820, 544510, 543190, 520434, 552450, 593196, 596954, 578317, 602919, 648341, 627533, 582849, 564795, 544565, 528964, 549947, 591770, 550310, 544165, 542920, 523935, 526955, 599148, 654164, 627297, 598691, 596678, 603182, 604930, 601102, 657066, 693812, 687777, 638697, 609015, 640588, 656178, 685723, 734099, 705761, 685302, 674417, 638954, 632852, 682694, 732839, 727796, 703460, 735022, 723769, 705664, 693452, 747692, 803881, 825812, 847539, 838230, 838157, 842045, 821437, 802853, 854917, 822040, 802822, 822030, 839060, 874511, 896762, 940685, 939909, 919721, 928135, 976398, 966788, 933707, 952146, 940301, 905960, 934394, 921983, 925705, 937726, 975368, 924528, 887870, 946150, 993322, 981301, 925438, 987218, 1031653, 1053089]
12088A053089M998k9K9163j6286R102M0352J0455j4144k2640K9092L7518j8893
12076A141777P129L5280Q9840N6918L0629j7995m6226L1019J8279J5989Q050j5131
12064A355558m4867m104N8509K6128M9374j1258k1548J965M7192M6814K7138Q096
12052A538997R84L0305K9062j9633o923K2762N5007M7733L5336j5316o9191J1797
12040A660920M7479M8870K816K2560M8351Q468J00940K2652L1164O1161M2255
12029B097636k3626j942L2855L1238M2861L205L5577M4500L7010k771K351K2265
12017B321159K2966k1857L3455L6950J2912J4083M402M2531Q1725O1768M1527
12006B651621L6269L4448m650Q850O1662N7970N7679O0318k1157J5944p941O8407
$$ y = [1053089, 1058087, 1058058, 1087221, 1070935, 1080037, 1120389, 1130844, 1116700, 1094060, 1123152, 1160670, 1141777, 1148906, 1184186, 1274026, 1330944, 1361573, 1343578, 1297352, 1328371, 1346650, 1362639, 1370689, 1355558, 1310691, 1306587, 1365096, 1391224, 1440598, 1429340, 1407792, 1409757, 1456949, 1503763, 1530901, 1538997, 1539981, 1570286, 1599348, 1579715, 1572792, 1595554, 1650561, 1698294, 1733630, 1718314, 1649123, 1660920, 1708399, 1757269, 1760085, 1782645, 1830996, 1839464, 1940404, 1963056, 1994220, 2055381, 2097636, 2074010, 2072068, 2104923, 2136161, 2179022, 2182227, 2217804, 2262304, 2299314, 2296543, 2298894, 2321159, 2344125, 2322268, 2355723, 2392673, 2405585, 2419668, 2424070, 2466601, 2548326, 2610094, 2651621, 2687890, 2722338, 2717688, 2726538, 2788200, 2846170, 2903849, 2964167, 2943010, 2958954, 2951013, 3019420]
11994C019420P4553K8949N0905P6292R018N3800R7114M1565k5425m08N9751L1992
11982C517526N2334P0859O6502J04526L1243N797N5173K9872J8432L2836N0362
11971D035462N9032M7554M5134M7085L6524N0530P5602K3605R4150N5631P616
11960D577925M6283J1568R8222P2883L3047O0748K3494N2659M4608Q3386Q2262
11949E187085l070N3649P4411P4195P0700K3715k7513M0685J7075r113O7Q1086
11937E582972Q5167J9492j321N940j3534K4875L7622K750k6839N1527j8584P062
11925E757129O8920N5732j297o134J9778L2376j4627k6850k5346l1232l0966K1764
11913E819247J5112K99m5709J0512K7623o3225n7198N5785l2030o7420n6885k1428
$$ y = [3019420, 3093973, 3122922, 3173827, 3250119, 3259137, 3312937, 3410051, 3451616, 3426191, 3425783, 3485534, 3517526, 3569860, 3640719, 3707221, 3811747, 3842990, 3848787, 3903960, 3933832, 3952264, 3985100, 4035462, 4094494, 4142048, 4187182, 4234267, 4270791, 4321321, 4396923, 4420528, 4514678, 4570309, 4577925, 4624208, 4635776, 4733998, 4806881, 4839928, 4900676, 4924170, 4976829, 5021437, 5104823, 5187085, 5184015, 5237664, 5312075, 5386270, 5456970, 5480685, 5453172, 5493857, 5510932, 5501819, 5501886, 5582972, 5668139, 5687631, 5686310, 5692250, 5678716, 5703591, 5741213, 5743963, 5717124, 5768651, 5750067, 5757129, 5826049, 5881781, 5880484, 5874350, 5894128, 5926504, 5911877, 5885027, 5859681, 5828449, 5797483, 5819247, 5834359, 5834658, 5788949, 5799461, 5827084, 5763859, 5706661, 5762446, 5730416, 5662996, 5606111, 5584683]
11901E584683m9222l8619l0939m684m3180n9651r0221p859j8691m0437q1905n5200
11889E064075j2199o1527p9896J4663M060J7749o5792p6077m7132l9439n4407
11878D664078n3494r6200r3510R274l4834o4456n9424p5432n745k1243p1166n6894
11866D040954m2709l1644k1628n4727n1140m3151m5830j01726j00924l1105J1413
11855C527783N3449n9181m1220k1040J869o1369p7036p1133r5091j23339J6384
11844C050076L3613l8859o7516l1620k8881j7235l4172n0161n7407o1218q0574
11833B616046m2756K6012J1083j4450j982o1660o5538k6142l3817m9330o4402
11822B293064p7572j5582K431J0423m9783j5226j2110j2905l9287j8184j0854
$$ y = [5584683, 5535461, 5496842, 5465903, 5461219, 5418039, 5358388, 5268167, 5260308, 5241617, 5201180, 5119275, 5064075, 5051876, 4990349, 4910453, 4925116, 4929176, 4946925, 4881133, 4805056, 4757924, 4718485, 4664078, 4610584, 4514384, 4420874, 4430148, 4395314, 4330858, 4271434, 4196002, 4190257, 4169014, 4097848, 4040954, 3998245, 3966601, 3944973, 3890246, 3839106, 3795955, 3750125, 3648399, 3547475, 3516370, 3527783, 3581232, 3522051, 3480831, 3459791, 3461660, 3400291, 3323255, 3252122, 3157031, 3033692, 3050076, 3083689, 3044830, 2977314, 2945694, 2916813, 2899578, 2865406, 2815245, 2757838, 2696620, 2616046, 2573290, 2599302, 2610385, 2595935, 2593953, 2532293, 2466755, 2440613, 2406796, 2357466, 2293064, 2215492, 2199910, 2202341, 2212764, 2162981, 2147755, 2135645, 2122740, 2083453, 2065269, 2054415]
11811B054415m0871l1190j9800j5526j8624o2397m8862m9340K099m1938m4646
11800A683320J6121P22r378J4665m6581m0662k5159N3979Q249m1428m9224n2795
11788A511829m3193Q067k6242j4561L5849J0330l3313k3188l5834j9210O950k8078
11776A349406J212K2015M556M3273N360n6567j18499j6279K0870j6289L165j35
11764A242088j1058r7538n3403J3420J6544m4304l9883L2983l5280j6394R581
11753A016756J3216m63j6370n7064j0930L4933K6767n812L9900j6580m5301j694
11741I77358j3704r8380M0110J6276k6413r937j7235j0243k2136O4012N832m4885
11729H60655l8014m4064K4524L5369n2534k9125N3153M0410m909K4547k7725j8146
$$ y = [2054415, 2013544, 1982354, 1962554, 1947028, 1928404, 1866007, 1817145, 1767805, 1769904, 1727966, 1683320, 1699441, 1700163, 1690785, 1705450, 1658869, 1618207, 1593048, 1647027, 1655276, 1613848, 1564624, 1511829, 1468636, 1476703, 1450461, 1435900, 1471749, 1482079, 1448766, 1425578, 1389744, 1370534, 1377484, 1349406, 1350618, 1372633, 1377189, 1420462, 1425822, 1369255, 1250756, 1234477, 1255347, 1239058, 1242223, 1242088, 1231030, 1133492, 1080089, 1093509, 1110053, 1065749, 1025866, 1058849, 1023569, 1007175, 1016756, 1029972, 1029509, 1013139, 956075, 945145, 980078, 1006845, 1001033, 1040933, 1024353, 979052, 977358, 963654, 865274, 905384, 921660, 895247, 885310, 868075, 857832, 835696, 899708, 905540, 860655, 822641, 778577, 803101, 838470, 785936, 756811, 809964, 850374, 845465, 870012, 842287, 824141]
11717H24141n1564n9886j8524l061N1928J130R209J1679O751N645m2346p013j197
11704G26892K0966L5748p9561m8455k3832M843j7570j5911j632J3804k344K2651
11692F35599K5955p405l6754l5029M081O399L6245J1418j2041k1908p033k3731
11680E75796l613m346l0316l2119J387K9815J618j8672K7496m3893m0435j8115
11668D44603M8770l2551j1704o77J1393L5474K82q2824n3850K8663L9746J580
11656D28905j3256L3624P4155N342l9678j6762o0609n907P3469p93n0912l5298
11644C92280k0927J3167L9210j5063m2375J6921J2300l282j2169L0945J2131l6421
11632C86717j4931L5020M4556Q584j838k7438m3428l2464P064K145K3453L567
$$ y = [824141, 772577, 712691, 694167, 691106, 743034, 744164, 753373, 765052, 771803, 777448, 735102, 728089, 726892, 747858, 783606, 704045, 655590, 631758, 636601, 619031, 603120, 601488, 615292, 612948, 635599, 661554, 654149, 617395, 582366, 586447, 592846, 629091, 640509, 628468, 606560, 599527, 575796, 572183, 567837, 537521, 505402, 506789, 536604, 538222, 519550, 547046, 503153, 462718, 444603, 493373, 460822, 449118, 448441, 459834, 495308, 495590, 412766, 358916, 387579, 427325, 428905, 415649, 449273, 523428, 528770, 489092, 472330, 411721, 405814, 479283, 478490, 427578, 392280, 371353, 384520, 423730, 408667, 366292, 383213, 395513, 392231, 380062, 411007, 423138, 386717, 371786, 406806, 451362, 459946, 458108, 430670, 387242, 354778, 361842, 363987, 387440, 391007]
11620C91007k8975r333l6920L4170l136l3539n3368J0015N8262j3012R420J2243
11608C36834l7846K9745m7762l7481L8016P1603J9080k7143r2447l3118N3840
11597B73321N9493K1261j3094r364j7493j1848j4262J3386j2140J0928K7872K5454
11585C53514J5042k6270l9899k0908l682O539L5270R422J4346L465o321o4276
11573B76242p636j2430k5264m3113j5530J9096O4703l7170j3586K2581k5369J6791
11561B19315L3041L7988P298R445l1384j8617j6876j1359m8724o391K7175j5482
11549A85429N962k664L721N7158Q611j3163k4530j0526J6156j9116l906L4693
11537B37825L3063l4879J4646L0761J7472M141m5461o8095N756L2220l1756m816
$$ y = [391007, 362032, 352699, 315779, 349949, 346813, 313274, 259906, 269921, 328183, 315171, 324591, 336834, 298988, 328733, 280971, 243490, 281506, 353109, 372189, 345046, 252599, 219481, 273321, 332814, 354075, 340981, 331617, 314124, 302276, 288014, 301400, 289260, 300188, 328060, 353514, 368556, 342286, 302387, 281479, 277797, 284336, 319606, 329028, 343374, 346839, 340518, 276242, 268606, 256176, 230912, 187799, 172269, 191365, 256068, 218898, 205312, 227893, 202524, 219315, 252356, 290344, 297642, 307087, 275703, 257086, 240210, 228851, 180127, 173736, 200911, 185429, 191391, 188727, 192448, 249606, 258217, 245054, 220524, 209998, 226154, 207038, 203132, 237825, 270888, 236009, 250655, 281416, 298888, 303029, 257568, 189473, 195229, 227449, 195693, 190877]
11525A90877M9109J0478l9352j9637P781P429N0879n225r837J1985l6229k9009
11513A89249l7215M329K8751L0908n5232J6847L6168K0771o632J6915l6978q0126
11501A27755j7033P074L1844M0468O4080n1412k9665k1236l8509K0103N0403j5156
11489A68716J651K4344K86n171L1254n7819R725L242K6722O131M5724P991n4555
11476B08241p6713J4883M4638m9476l9738L3368J0940j9336k8768Q559K2963k896
11464A26665m044k5384M7997L6442o326P013l1830m794J6546L6395k3556n2141
11452A22983O3221J2868q3388j9123L4332j5936L7530J1331k7666k2046k3227
11441I0879M3411P569p3446o394N8831L1835l7323n1386j6142L3404n262J0136
$$ y = [190877, 239986, 250464, 211112, 191475, 199256, 206685, 257564, 252339, 242502, 254487, 218258, 189249, 152034, 156363, 185114, 216022, 160790, 177637, 213805, 234576, 227944, 244859, 207881, 127755, 110722, 117796, 149640, 190108, 254188, 202776, 173111, 151875, 113366, 133469, 183872, 168716, 170367, 194711, 194997, 189826, 221080, 163261, 172986, 176228, 202950, 209081, 254805, 262796, 208241, 131528, 146411, 191049, 141573, 101835, 135203, 146143, 126807, 98039, 106598, 129561, 126665, 122621, 97237, 145234, 181676, 175350, 182363, 150533, 145739, 162285, 198680, 175124, 122983, 186204, 199072, 115684, 96561, 130893, 114957, 152487, 163818, 136152, 114106, 90879, 134290, 141859, 68413, 62019, 120850, 152685, 115362, 63976, 47834, 81238, 75976, 86112]
11429H6112j4398L4395L0107k9144j3727P1104M1158k2419j4011l020n665k8073
11417A32419n971p949j6309k1802K1278j3865M5053M7670J1374Q976j0716J2411
11405B02569O9131j9161o5321K631j9482n0344R494J2178N4102J1395L1407p781
11393B30818j9823q5314k2882K3711N004K4938K2413k7073q0883k3968L6558L3230
11381A16729J1286j0209M25M911j9169n153L0148j3642l1263j8668K8855o610
11369H7640k0190K3673J9362r059J7446R129k2581m5587l668L4885M7133M6694
11357A84877R2l8823j0141j787n6588m6041p421L6558l4704J1962O1979J1699
11345A11662L2938J3673m2964k6308k336k6209k3243O5135J289R454M3672l4138
$$ y = [86112, 71714, 106109, 136216, 107072, 93345, 164449, 205607, 183188, 169177, 166157, 160492, 132419, 126448, 118499, 102190, 80388, 101666, 87801, 132854, 180524, 191898, 200874, 190158, 202569, 271700, 252539, 187218, 189849, 170367, 120023, 129517, 141695, 195797, 207192, 238599, 230818, 210995, 125681, 102799, 126510, 131514, 156452, 178865, 151792, 70909, 46941, 83499, 116729, 128015, 117806, 118231, 123142, 103973, 98820, 128968, 115326, 84063, 65395, 94250, 87640, 67450, 91123, 110485, 101426, 118872, 128001, 105420, 59833, 56165, 91050, 138183, 184877, 184969, 146146, 136005, 134218, 77630, 31589, 24168, 60726, 26022, 37984, 99963, 111662, 144600, 158273, 115309, 89001, 86665, 60456, 37213, 102348, 103637, 113091, 156763, 122625]
11333A22625k9559j2855k9903M131k638M9547M7537n0784l063L7692l3165k3142
11321G6423j4956k1186Q3339M1900m1803j6023J9401K3097J9366k7312K2776r388
11309A55634k972K0844K3486o8916m8883l7700n0524N6161P2566J6640m4559k3679
11297F8098j9351L8259M0198R895o2034n4866l6536R438K9200N5878M6803K8174
11285A53156n8212k2939p376j5599k6517k3550o473o489k501J1984N6841O054
11273E8379N013P1331L6282k9252l3488l0679N75K5930l9859L917M245k3636O6816
11260A15574k534j6738M668j2448m3170J4505L0037l2290k7092j1915l7153n646
11248b4202K8089M9835K3730O1135m509k9218J692n2705q1476J4035L6703n797
$$ y = [122625, 93066, 80211, 50308, 54439, 51801, 101348, 148885, 98101, 95038, 132730, 99565, 76423, 61467, 40281, 123620, 165520, 123717, 107694, 127095, 150192, 169558, 142246, 165022, 155634, 152662, 173506, 196992, 128076, 79193, 41493, -9031, 47130, 119696, 136336, 91777, 68098, 48747, 87006, 127204, 137099, 75065, 20199, -16337, -6899, 22301, 78179, 124982, 153156, 94944, 72005, 64629, 49030, 22513, -1037, -7510, -13999, -16500, -4516, 52325, 58379, 63392, 134723, 171005, 141753, 108265, 77586, 78161, 104091, 64232, 68149, 72394, 48758, 115574, 113040, 96302, 100970, 88522, 45352, 59857, 89894, 57604, 30512, 18597, -18556, -24202, 3887, 53722, 77452, 138587, 134078, 104860, 106552, 53847, -27629, -13594, 23109, 17312]
11236A7312O793J5987M3912K3789l11l3849j7041k75j8739J5281J087j5455J2461
11223E0952J6872j6437p2815Q35O4694n3451p375L6903J8732r65k7241O035K944
11210A9683k7288j4416j5403l1570j8815J5672K0111N4903n5026l440k8542J1358
11198g2773N2082n286K9298L305k9598J188M0696K666L1220j8593m541L7854L0262
11185I7780K3486j1187o3119r680j7489k1988R086P317K3458L1928K9779k3732
11173G5639K395J1193l4726j1443k3075N136L8323j4888m6338j2880O5367N1384
11161A06087N1311j6693r1941j2516K7896M4173n190j0029j0906k0764J0333k4783
11149D6978j289M4601L047k9832O459l7927j7779J3068Q627j9470J9473M9160
$$ y = [17312, 24105, 40092, 84004, 107793, 107482, 73633, 56592, 56317, 37578, 52859, 53946, 38491, 50952, 67824, 51387, -21428, -20593, 44101, -9350, -16725, 20178, 38910, 37945, 10704, 16739, 19683, -7605, -22021, -37424, -68994, -87809, -72137, -52026, 2877, -52149, -55589, -84131, -72773, -20691, -25977, 3321, 6626, -22972, -21784, 18912, 21578, 52798, 34205, 29664, 67518, 97780, 121266, 110079, 46960, 37280, 19791, -2197, 6889, 14206, 37664, 69592, 99371, 75639, 78034, 89227, 54501, 43058, 19983, 25119, 63442, 48554, 2216, -10664, 54703, 106087, 157398, 140705, 48764, 36248, 64144, 108317, 103127, 93098, 82192, 61428, 71761, 46978, 45689, 90290, 93337, 63505, 69964, 32037, 14258, 27326, 35953, 16483, 35956, 85116]
11137H5116j4653n0840J8946M4380p9761k3318J4144J5851N3618o003k3063j5069
11125A9348m6014N957L0489M3122J5504j9682L1235Q265J0417l6758k9641k1263
11113A0979J7923N2572q86R42j2453n0367j5361p578K5770k8112K2190r717p700
11100a798J1781k4118j6910J4302L5085J0265m8030M8494M4628L7157j4769j148
11088I4939j8449p842j3248O4137M7942l5321l7369q279j7394j6956k2466m7082
11076a7388O9847N5213k711j4518j8469J8281M2151l3469k7713n6431j4306L1117
11064C1604J799J1017k1532n305K9998O5096P917k092J3360n2890L740r04o4101
11051A7707N305K6310p556M5604k3511l0269M6901L2009j9293j3153J6860O186
$$ y = [85116, 70463, 19623, 38569, 82949, 3188, -20130, -5986, 9865, 63483, 57480, 34417, 19348, -26666, -20709, 9780, 52902, 68406, 48724, 79959, 88224, 98641, 61883, 32242, 10979, 28902, 81474, 80588, 81530, 69077, 18710, 3349, -4229, 21541, -6571, 15619, 5902, -1798, 9983, -14135, -31045, -16743, 18342, 28607, -19423, 29071, 73699, 110856, 96087, 94939, 76490, 68648, 55400, 119537, 167479, 132158, 94789, 86510, 69116, 52160, 29694, -17388, 52459, 107672, 104961, 90443, 71974, 90255, 132406, 98937, 71224, 14793, 487, 31604, 33403, 44420, 22888, 17583, 47581, 112677, 120594, 118502, 131862, 78972, 82712, 81808, 17707, 23012, 49322, 41766, 87370, 63859, 33590, 80491, 112500, 93207, 80054, 96914, 103100]
11039A03100R876M1867J3598p348l4138Q73l0830l0591K8619N3993M394M4474
11027A97887N9166K4529k2966L1566m7938k7306q385L067J6165M5831j7528O6165
11015C20253N4899K0781M5090j362l6724m5255p8454m8642m7920j2765m621P1527
11003B36807K8074j3816j3126k7183l1093N5055L2804K760r939p2510m8150j664
10991A38019k381O523n1043n4196J0341k6886k9232k9516M6520k7038L3684J5465
10979C0260J472M0525M7464M3296j4867m5454o169k0048j7608M6661k4771j5687
10967F5074k9268k7222k1794J7708O424J9753p624J7929K8516K303l3801n8893
10955b0895q174L2476o999K3075M2075K4440m7425j1727L0825l1753J4621q513
$$ y = [103100, 112976, 154843, 168441, 161093, 126955, 127828, 96998, 66407, 95026, 149019, 153413, 197887, 257053, 281582, 258616, 290182, 242244, 214938, 206553, 209620, 225785, 271616, 254088, 320253, 375152, 395933, 441023, 439661, 402937, 357682, 279228, 230586, 182666, 169901, 165280, 236807, 264881, 251065, 237939, 210756, 179663, 234718, 267522, 270282, 260343, 187833, 139683, 138019, 135638, 142161, 91118, 36922, 47263, 20377, -8855, -38371, 8149, -18889, 14795, 30260, 31732, 72257, 119721, 163017, 148150, 102696, 96527, 76479, 58871, 105532, 80761, 65074, 35806, 8584, -13210, 4498, 10922, 30675, 23051, 40980, 69496, 71799, 37998, -20895, -29069, 3407, -3592, 19483, 61558, 85998, 38573, 26846, 57671, 25918, 40539, 32026]
10943C2026j9756K8686O421j8410K3354J2589j0939m5790o9405K9230L4324j9729
10931a7399L3153j5116n047J7443K4415M4031j966j4447j6757J4415O553k9263
10919D0015k7820M0665o480p1182k8481J6625k1420K7453O187K1225q486N484
10907f215J4850l0152J4069N8096j6094K1653N283o6220l7008J8851O8460n535
10895D0038j9937L7429k1918J9063j13j4559k1263l993j074k3429K1358P3522
10883H5124l3129l1519L9858J1059j7651l7866j3464P8030J4106m5317K4295j4067
10871E9459J41m140J3775j1801q504l4332l6344K1767N8553j3427k4743P372J1176
10858C8952K434L8016n957L3871J0608J4898K175p8842q6128q414N4741P6639
$$ y = [32026, 12270, 40956, 47377, 28967, 52321, 64910, 53971, 8181, -61224, -31994, 2330, -17399, 15754, 638, -4409, 13034, 37449, 81480, 79514, 65067, 48310, 62725, 69278, 40015, 12195, 52860, 46380, -24802, -53283, -36658, -58078, -30625, -24438, -3213, -11699, -6215, 8635, -21517, -7448, 50648, 34554, 56207, 61490, -4730, -41738, -22887, 45573, 40038, 20101, 57530, 35612, 54675, 54562, 40003, 18740, 14747, 13673, -9756, 11602, 85124, 51995, 20476, 60334, 71393, 53742, 15876, 2412, 80442, 94548, 49231, 73526, 59459, 59600, 55460, 69235, 57434, 48930, 14598, -21746, 21, 58574, 45147, 20404, 27776, 38952, 41386, 79402, 73445, 107316, 117924, 132822, 134997, 56155, -29973, -38387, 16354, 92993]
10846I2993N5437m129n4591j7901k2587l3262K3634m0090J2871M9245l7223L3010
10834E7407N6689R653j0699R329l2537l1201K6998J4514l1483J1806l4022k3669
10822B2785K9890Q59l0763k3433m8750k9256J7022K1137L1679j5912L7838J864
10810A4960K3438k0031n5152L0184J742k901j4184N3462L2030j6353m0366M7186
10798E4015M6910O645K707k2058k3732q287J0889K3775J5571l6054j9085L5484
10786H6780N9970L0745l3260j0621l8608j1657R650K4900o3244N304k7428j9110
10774A3421O5599J0367r129K0669K0765J5203J191J2512K110R994K8329J8268
10762B09299j1592l8369n2771l2016k3491o783L0251L7439K2822l2707n2875l4948
$$ y = [92993, 148430, 144301, 89710, 71809, 49222, 15960, 39594, -496, 12375, 61620, 24397, 57407, 114096, 123749, 113050, 122379, 89842, 58641, 85639, 100153, 68670, 80476, 46454, 22785, 52675, 53534, 22771, -662, -49412, -78668, -61646, -40509, -8830, -24742, 13096, 14960, 38398, 18367, -36785, -6601, -4859, -7760, -21944, 31518, 63548, 47195, 6829, 54015, 100925, 107570, 110277, 88219, 64487, 56200, 67089, 90864, 106435, 70381, 51296, 86780, 146750, 177495, 144235, 133614, 95006, 83349, 92999, 117899, 54655, 59959, 32531, 13421, 79020, 89387, 80258, 100927, 121692, 136895, 138086, 150598, 152708, 162702, 191031, 209299, 197707, 159338, 106567, 74551, 51060, 44277, 74528, 111967, 134789, 102082, 49207, 14259]
10750A4259M967j8586j1335L4665N244M9356K1482k9992O225n9438l8445N020
10738a6578Q23K3623L6464j4870n083J2121p61J6425K4034J9632m7926J666K3480
10725G3050L6117j3488P039L9560L4956k1038J5136K6097k713o3937n1646j9809
10713E9324K1386M7070K7185l8891n3645K2508M764J47J2713R745r253n1889K5208
10700G6372N6274N1441O438l2830l3905Q690K0664N6439q945k6805k2013k1685
10688A30135j3149l4796l642J7345n7008R545J6973N6168n3982l5122M0458M0774
10676A13699L7758l3173n8148k568N4099O986J5985m0953l875j3599J6828M1375
10664A34414K4181o031j910l8416l2432m2145m43L8395l780J6256J9429O4158
$$ y = [14259, 19226, 640, -10695, 23970, 29214, 78570, 100052, 70060, 76285, 16847, -21598, -16578, -15755, 7868, 44332, 29462, 24379, 36500, 35739, 52164, 76198, 95830, 47904, 49570, 73050, 109167, 95679, 102718, 142278, 177234, 156196, 171332, 197429, 194716, 130779, 79133, 59324, 80710, 127780, 154965, 116074, 62429, 84937, 89701, 89848, 102561, 112306, 103053, 51164, 76372, 132646, 184087, 190525, 157695, 123790, 132480, 153144, 209583, 200638, 173833, 151820, 130135, 116986, 82190, 78548, 95893, 38885, 48430, 65403, 121571, 67589, 32467, 72925, 113699, 151457, 118284, 60136, 57568, 111667, 118653, 134638, 93685, 89810, 76211, 93039, 134414, 158595, 152564, 150654, 112238, 79806, 37661, 37218, 75613, 71833, 88089, 107518, 171676]
10652A71676M5104N982J0062J2487L9530K3653K2843k085O7742P3018J31724O2715
10640F64451r9735l4605j5669n5K4146M3771M1199J830l8956J8864Q0974Q2049
10628G68264O5217N2767J09473Q2624R1075J37960J25371J33690K29823K32723
10618B028987K97150L77650M70377N36895Q19613J067882J517772K080891K635450
10609A1832667L024683K803099J733257N00594j62074j56456J77292P23359J437841
10600B1914262K345408L518635N008720N960747M923922J818191j132542k305017
10592D2052326j886786r95573K8939J099267K465192M184505O021915O953767
10584E9923552N025041K34900l957514n143129m461565l334514k273470j207855
$$ y = [171676, 216780, 222762, 232824, 245311, 284841, 308494, 331337, 329252, 396994, 470012, 601736, 664451, 564716, 530111, 514442, 514387, 538533, 582304, 623503, 625333, 586377, 605241, 686215, 768264, 833481, 886248, 995721, 1078345, 1169420, 1307380, 1432751, 1566441, 1796264, 2028987, 2326137, 2703787, 3174164, 3711059, 4530672, 5598554, 7116326, 9197217, 11832667, 14857350, 17660449, 19393706, 19894300, 19732226, 19575770, 19753062, 20476421, 21914262, 24259670, 27778305, 32787025, 38747772, 43671694, 45489885, 44357343, 42052326, 40165540, 39169967, 39198906, 40298173, 42763365, 46947870, 52969785, 59923552, 64948593, 65183493, 61225979, 56082850, 51621285, 48286771, 46013301, 44805446]
10576D4805446j33721R88736K144331K684544J243873j957904m396213m858024
10568D0521068m080673l097039k359883j738691j221034p56188l14587j67530
10560B6785443p38744j807092k575686k665963k390557k092312j822502j610042
10552A1082545j389641j260902j190301j007895p68961o52483n55108m49655l93275
10543C414324l05631k88733k20213k02571j93038k00548j45524j24034q6825r8853
10533A548354p9079q9331j24588o3294j5779l8262p2173r8678q4436j8670m8857
10522H15207n1579j7053l6358n402l1684k0476k2846j8309j1868m2263l6134m4949
10510D76286l9096l3977J6621J9482L5595q248P438N0067j3378j04037k8113j1702
$$ y = [44805446, 44671725, 45660461, 47804792, 50489336, 51733209, 49775305, 45379092, 40521068, 36440395, 33343356, 30983473, 29244782, 28023748, 27267560, 26952973, 26785443, 26046699, 24239607, 21663921, 18997958, 16607401, 14515089, 12692587, 11082545, 9692904, 8432002, 7241701, 6233806, 5464845, 4812362, 4257254, 3807599, 3414324, 3108693, 2819960, 2599747, 2397176, 2204138, 2003590, 1858066, 1734032, 1647207, 1548354, 1469275, 1379944, 1255356, 1192062, 1176283, 1138021, 1065848, 967170, 882734, 864064, 815207, 763628, 746575, 710217, 704815, 673131, 652655, 629809, 611500, 599632, 557369, 521235, 476286, 437190, 403213, 419834, 439316, 474911, 466663, 474101, 524168, 510790, 406753, 378640, 366938]
10498C66938L030M745J1849l4231j1696n2313K3088M2513k7776j1778j2975k7586
10486B73808k3264k6194o3220L961N091k1911K0710M963J2415J0060N3639n2473
10474A97585l5636J2814K7145J5688l8995J5283J7155l8494j7584K1088m644J1180
10462A82585j5230l0049L4005J324m095J2612J3132r43k8075k8662J6K1103m836
10449A52887N3916K2399l1937m8270l0644J646n359K4064K3448L1249J1143l5272
10437A69270j8199n2067k7443m7p834R718L0683j465l226q5996k1833L0735L5006
10424E7302N470P588q131Q039j3693K3319j1220K101k3686n8861k6936j8764K2247
10411c5225O2736P375j3740Q600k418l337P812q094N000L4695l675m0349J7543
$$ y = [366938, 369968, 374713, 386562, 352331, 340635, 288322, 311410, 353923, 326147, 314369, 301394, 273808, 250544, 224350, 161130, 165091, 170182, 148271, 168981, 173944, 186359, 196419, 250058, 197585, 161949, 174763, 201908, 217596, 178601, 193884, 211039, 172545, 154961, 176049, 171405, 182585, 167355, 137306, 171311, 172635, 168540, 181152, 194284, 193341, 165266, 136604, 136620, 157723, 152887, 206803, 229202, 197265, 148995, 118351, 119997, 114638, 138702, 162150, 193399, 204542, 169270, 151071, 99004, 71561, 71514, 63680, 73398, 104081, 102616, 99390, 13394, -8439, 22296, 57302, 62772, 70360, 62229, 70268, 56575, 79894, 68674, 70775, 47089, -11772, -38708, -57472, -35225, 27511, 34886, 21146, 29746, 27328, 23991, 31803, 23709, 28709, 63404, 59729, 19380, 36923]
10398C6923L5590j0657l5539o6008k0070K3141K6641M3932M9437P827J5412O399
10386A13028l276j6865j6679k0606K7797K750k3891p0036k2223L0640P0781K6476
10374I7896q662k8500J1992K3515k9676m8148L529L3487L2916m6067M9J3445L8679
10361I4455K2755Q177P243l1401k6808o1583P047o188M360K8628O8246N3758k8668
10348A40021k5298j2316m018L6478K0067n4864l8577O7575J9491l6560l6143m3913
10336C1943j821J10822N7358n0386m9913N1792l9849o8576M618L3095K3372l4843
10324F7612j6857O360M4709L2079j5672K4120j0136k5351J8037N6661m661m6343
10312A30558m4613r247m1066m2004k6205N2338K0681L5009M8013R550J5431l1228
$$ y = [36923, 72513, 61856, 26317, -39691, -59761, -36620, -9979, 33953, 83390, 91217, 106629, 113028, 109752, 92887, 76208, 55602, 83399, 86149, 62258, -7778, -30001, 639, 71420, 97896, 89234, 60734, 72726, 96241, 66565, 18417, 21946, 55433, 88349, 42282, 42331, 55776, 94455, 117210, 125387, 132630, 101229, 74421, 12838, 19885, 13697, 18057, 46685, 114931, 168689, 140021, 114723, 102407, 98389, 134867, 154934, 100070, 61493, 129068, 148559, 111999, 75856, 31943, 30122, 140944, 198302, 147916, 98003, 149795, 109946, 41370, 45988, 79083, 102455, 67612, 50755, 57115, 101824, 133903, 118231, 142351, 132215, 106864, 124901, 181562, 176901, 130558, 85945, 76698, 35632, -6372, -32577, 19761, 40442, 75451, 123464, 133014, 148445, 117217]
10300A17217m1376J3274j2310r492L2862L0176J6537k8895k1597m823m2236J7387
10288F6724k8886l7249L5914K6837k6895k1263J8415R589K0037M499j9639L3371
10276H1454K1407j5496M7204N4480j9600m2751K8413n0556l2888P316o347K5945
10264I8581N7448K532l3564p969o4489l0065M686q899k0155K1119O7620J6992
10252A03837J6806Q407j5721n5438m8408l6348K7899M4647M0555M6601q224m4389
10240H0224J6783J5966j4755M6169J9066n5548n3592k5141j2548J6719L1076K2072
10228H6491P343J6262o0089k0217M4246q855o069l7799l872K8193K6243K5897
10216I7774l2156o020l4174l1233K8501L1017N7105k9669o2617M7534k947j3333
$$ y = [117217, 75841, 89115, 76805, 67313, 100175, 130351, 146888, 117993, 96396, 91573, 49337, 66724, 37838, 589, 36503, 63340, 36445, 15182, 33597, 43186, 63223, 67722, 48083, 81454, 102861, 87365, 134569, 189049, 169449, 126698, 155111, 104555, 71667, 78983, 72636, 98581, 156029, 158561, 124997, 117028, 52539, 22474, 27160, 18261, -1894, 19225, 86845, 103837, 120643, 129050, 113329, 57891, 9483, -26865, 1034, 45681, 86236, 132837, 124613, 80224, 97007, 112973, 98218, 144387, 163453, 107905, 54313, 29172, 16624, 33343, 64419, 86491, 93834, 110096, 50007, 29790, 74036, 65181, 59112, 21313, 17441, 45634, 71877, 97774, 65618, 59598, 25424, -5809, 22692, 53709, 110814, 81145, 18528, 66062, 63115, 49782]
10204D9782n144k145J8277J153l5892j385J0487j1085j0166N8540L7083m1010
10192F8495L0686k3955o3375M0989J583m1397k4709j7996J0554L3431L7605J7664
10180F9575j471K8502L3127J0355q060j8785O361L4834L1932L3949J6931j8146
10168B19104m9037O721l967n629L0990K6838M5885N1809L0629o6500k4365K7020
10156B89498J7726j4730l3040L4134O1717k7657M713k2469K3123N1546j5065k0549
10144C48947n9380l2029K6761L5857j39l2750M5755K7892k3392j4207k0820n6555
10132B45940r274j4836l8935O1128L2282N10l4199n9799l4581l7145k9647M7863
10120A29307j1035M691k8919k1877j4088P081J6304K092m9035l5951K0809j0070
$$ y = [49782, 44638, 42493, 60770, 61923, 26031, 24646, 35133, 24048, 13882, 72422, 109505, 68495, 99181, 75226, 11851, 52840, 54423, 13026, -11683, -29679, -19125, 14306, 51911, 69575, 68104, 96606, 129733, 140088, 132028, 113243, 119604, 154438, 186370, 220319, 237250, 219104, 170067, 176788, 172821, 167192, 198182, 225020, 270905, 322714, 353343, 286843, 262478, 289498, 307224, 292494, 259454, 293588, 355305, 327648, 332361, 309892, 333015, 384561, 369496, 348947, 289567, 257538, 284299, 320156, 320017, 287267, 333022, 360914, 337522, 323315, 302495, 245940, 236666, 221830, 182895, 244023, 276305, 276815, 242616, 182817, 148236, 111091, 81444, 129307, 118272, 122963, 94044, 72167, 58079, 65160, 81464, 83556, 34521, -1430, 19379, 9309]
10108I309j7458p093j5605n648O7966j2658M4487o515Q241Q018L0734k6934j4814
10095F2030J0852l148K1270k0411m9607j536L9444O651k611j7609L2663l9563
10083C8425p4958j6959J3504J3032J2194M969k0434J4625J9147P46O2420L9633
10071A06344J1473K0280K712j5078k6884l5585l3207J6475K5140k1421j383R296
10059E8162j6412J1746N5771n1863l1204M43j1194J7258K7517K6237o633r539
10047G0289N205o8407j2875K0816m0115M1763L2854k3770j7380l9888L5260M0534
10035D4286M6170M3017J1602m356k6566n3354m0383K6451K6445k9482j3763k7977
10023B090P304j1358N036M7619N6536k273n7351k4725J9702K5200l8920j8769
$$ y = [9309, -8149, -15242, -30847, -36495, 31471, 18813, 63300, 56785, 65026, 73044, 103778, 76844, 62030, 72882, 69734, 91004, 70593, 20986, 19450, 58894, 65545, 62934, 45325, 77988, 38425, -36533, -53492, -39988, -26956, -14762, -9793, -30227, -15602, 3545, 4291, 66711, 106344, 117817, 138097, 140809, 125731, 98847, 63262, 30055, 46530, 71670, 50249, 48866, 58162, 41750, 53496, 109267, 57404, 26200, 26643, 15449, 32707, 60224, 86461, 79828, 70289, 75494, 7087, -5788, 15028, -25087, 16676, 49530, 25760, 8380, -31508, 3752, 44286, 90456, 133473, 145075, 140719, 114153, 60799, 20416, 46867, 73312, 43830, 30067, 2090, 9394, -1964, 3072, 50691, 107227, 104954, 47603, 22878, 42580, 67780, 28860, 10091]
10011A0091K4068L086O62j2521L4755K3927n0371K7785L1924n4574l5881M479
9999G430q383k1003k9922p172K2092N2308L4837r871K7563j6881j0782L9181J7487
9986I6884o7270o1742m4668m3118K2546O1870J8726l2251k0778J5677P342k87
9974d7069M4472K9126K5655L1619N880L008J6963r010J0639k2412l0397l0559
9962B7915K2422l7637n312J4558K3739L7698j7023m4718j2584J05795L9509o5604
9950H8758q6936k7185L4034N453J3596N0L0196j1966j1376K0880l2367n8736p584
9937d3183j5892N7105L6925q384M4852M725j7956j7273M358j1095m8369P7J5701
9924A591k7018j9552K0671J4799R78J2626J2085J1417K7326p283k764l4467k011
$$ y = [10091, 34159, 37245, 37907, 25386, 60141, 84068, 33697, 61482, 93406, 38832, 2951, 7430, -953, -21956, -51878, -59050, -36958, 15350, 50187, 40316, 67879, 50998, 40216, 79397, 96884, 29614, -32128, -76796, -119914, -97368, -35498, -16772, -49023, -69801, -54124, -46782, -47069, -2597, 26529, 52184, 83803, 89683, 92691, 109654, 100644, 111283, 88871, 58474, 27915, 50337, 12700, 7388, 21946, 45685, 83383, 66360, 21642, 9058, 114853, 154362, 88758, 1822, -25363, 8671, 14124, 27720, 27770, 57966, 46000, 34624, 55504, 23137, -35599, -43183, -59075, -1970, 34955, 26571, 71423, 76148, 58192, 40919, 45277, 34182, -14187, -14110, 1591, -25427, -44979, -24308, -9509, -8531, 4095, 16180, 27597, 54923, 47640, 44876, 10409, 8398]
9911H398R094K5402l4597J4358k6092p088Q868K7416n243m4502k9008N8423O782
9898A2211L9413l266R712K2500K980k3239J2119n205k823k3653j2612l1228j7420
9885b0511L9045k5520j2954J3977L397o297j6803l104j4618O937Q908p685J6690
9872a8538L5415J1257m3567k0884M095k6220O611M7853L802p417J7980o335O232
9859A0284N6732m951P94N3533J1164l9550j1210j9717j5627J831o0920M0917L7824
9846F1104l906m4480j2466M6863J8392k1192l6383Q392j2597l0763K1472J4127
9834H563p289J7081m0297l3266N7597M9843N19k0675J7403o390m0883j7436J7500
9821B270K0367j4887R337M0005l821L4901q10k0740l7191N073O676k5364j8317
$$ y = [8398, 17492, 42894, 8297, 22655, -3437, -10525, -1657, 25759, 20516, -23986, -52994, 5429, 12211, 51624, 48358, 58070, 80570, 83550, 60311, 72430, 67225, 64402, 40749, 28137, -3091, -20511, 18534, -6986, -19940, -5963, -2566, -8863, -25666, -28770, -43388, -36451, -27543, -35228, -18538, 16877, 28134, -15433, -36317, -32222, -58442, -51831, -3978, -176, -7593, 10387, 4052, 10284, 67016, 62065, 62859, 116392, 127556, 88006, 76796, 57079, 41452, 43283, -17637, 23280, 61104, 57198, 12718, 252, 47115, 65507, 44315, 7932, 16324, 3727, -27036, -5564, 8563, 1274, 18355, -21942, -55208, 2389, 52232, 52751, 32076, 49479, 43089, 2206, -15230, 2270, 22637, 7750, 17087, 57092, 53271, 88172, 87362, 66622, 29431, 34504, 41180, 15816, -2501]
9808b501M9439K7285P079j6444J1996k5134k3687j8363m2691j1550J0574J5082
9796a8915M6634O566o0435q990L3028P4390k9176j5521J4807J0966l5548J6102
9784C3908j8636q813J0496j9580L8190N776K1517n126k7208K3930J4159k8160
9772D0453k7704k7718L5307N326N884N636L25r311L6920K9657k7533l8011k8437
9759G94m582n7324L9851L535M8576P306o99k9443q835m498K1642P876l6146j0533
9745b2480J682j0445K3270J3300J9619q579m1275n444K2172J0225M6703q217l4913
9732E618q639L1780J4375J7760n2563k6215L2450k2827j1284Q392P543j3844o837
9719b4291K3394j5858K0766j866J5563n467M875k9038k6416J9899J0678k6964
$$ y = [-2501, 46938, 74223, 81302, 64858, 76854, 51720, 28033, 9670, -33021, -44571, -33997, -18915, 27719, 34285, -26150, -35140, -2112, 72278, 43102, 27581, 42388, 53354, 17806, 33908, 15272, 6459, 16955, -2625, 35565, 41341, 62858, 57732, 30524, 54454, 68613, 40453, 12749, -14969, 20338, 25664, 31548, 37184, 37509, 28198, 65118, 94775, 67242, 29231, 794, -3788, -61112, -21261, -17726, 30850, 38156, 37457, 8014, -821, -5319, 16323, 24199, -11947, -22480, -20798, -31243, -7973, 5327, 24946, 16367, -24908, -30352, -8180, 2045, 48748, 40531, 5618, -3021, 28759, 43134, 60894, 8331, -17884, 14566, -8261, -19545, -11153, -3610, -17454, -24291, -897, -16755, 4011, 2145, 17708, 12241, 17116, -11922, -38338, -18439, -7761, -34725]
9707c4725k4593L9990K0677n059j1718r354P389L6326K5780j3031m1517j6585
9695b6420o394m3453J2180J9298j1042O6880J4301m2547J804L2720M2645j4857
9683D5115n1931j8562M823j5478M4570L4032m8626l2534O9630L5375l3592m6052
9671a3230k2339q466J797J1773M9151J4104J4755k2852p345r818o004Q17m5576
9658d3233l0064k841o589M5323L4362Q728M7548K4832K4603L8087o3336N779O1707
9645A44906M1593m331n6721k8632K6963K4792k3795L1091j7016k6581k7601Q026
9633I2694O358n7107K2426j6227k9073K0153K9303K8924n9687p6314o559O1424
9621A6315M1207R676K6510K720n0135k6026p197K6556J5986N1913L951n1142n2126
$$ y = [-34725, -59318, -19328, 1349, -3710, -15428, -24782, -17393, 18933, 44713, 31682, -9835, -26420, -32814, -76267, -64087, -44789, -55831, 11049, 25350, -17197, -15393, 17327, 59972, 45115, -6816, -25378, -20555, -36033, 8537, 42569, -6057, -38591, 31039, 66414, 32822, -13230, -35569, -44035, -42238, -30465, 18686, 32790, 47545, 24693, 17348, 7530, 1526, 2343, -43233, -73297, -76138, -82727, -37404, -3042, 5686, 53234, 78066, 102669, 140756, 77420, 83199, 144906, 186499, 182168, 125447, 96815, 123778, 148570, 124775, 155866, 138850, 112269, 84668, 92694, 99052, 41945, 64371, 48144, 19071, 39224, 68527, 97451, 37764, -38550, -45109, 16315, 57522, 67198, 93708, 96428, 46293, 20267, 13070, 39626, 55612, 107525, 111476, 60334, 8208]
9608H208m2032m6385N5773N0949r317n3847J3947Q955k3339O677J1857J4776j3178
9595a6956N607p697o023J3632j8477L112j7193M1135N3607Q97j1425k7258m094
9582H867K9119p984k4214J2705J6964L6391K9241q3100o8733k4814L3808J3585
9570b8165l6899m2309O3942L4849m9399k4645q809L5042L0850J057k692j3118
9558d0296k0030Q479p040J4417q29N1194K5579K2136K495j4477l3893o6516l3841
9545i2622L5639Q3740L1302m3915k9158p604L7944M5757L5246j8031l9093l4397
9533D808q783J5418l7928k2594K420L3592j4029K6046l8572J8821r561K1511K720
9520f131M650J0475l6956k1203P739P224j176J0325J837K296j0916M190N6200
$$ y = [8208, -33824, -80209, -24436, 26513, 17196, -36651, -22704, -13749, -37088, -30411, -18554, -3778, -16956, -11349, -19046, -25069, -11437, -29914, -26802, -43995, -2860, 50747, 51644, 40219, 12961, 8867, 37986, 30002, 5788, 18493, 35457, 71848, 101089, 17989, -50744, -75558, -41750, -28165, -65064, -107373, -43431, -8582, -57981, -82626, -91435, -56393, -25543, -24486, -27178, -40296, -60326, -51847, -58887, -44470, -45299, 5895, 31474, 53610, 56105, 41628, 7735, -58781, -92622, -56983, 26757, 58059, 14144, -15014, -22618, 15326, 61083, 96329, 78298, 39205, 4808, -3975, 11443, -26485, -49079, -46659, -13067, -27096, -1050, -39622, -20801, -30362, -8851, -6131, -1481, 8994, -27962, -49165, -41426, -34202, -35378, -25053, -23216, -20920, -31836, -27646, 28554]
9507B8554L2188j6436N2999n354k0839J2941r677R040k5127l2844p258J9972J7874
9494E6033K4608M0824o891j0148l3072P986M5895k2030j5326n933m9407j2188
9482B0351k0727J7240M3789J4383l053R481j3435j5905N0824m3654m543K096r899
9469D6948n2078k8549o332J43M409l6085n931L5462O0237j7465l2286l6485K0088
9456d7924L912L9775r943k973J1657R208N658k7453J3072P2390J2654J5850j7521
9443G8362m1260o2093j351L4493K726P360m0726K1146K4995m5181k5511J4045
9431c2995k147k9933o340J4955L7874L0341q461M7l1909Q561K9041J6287m276
9418B1045L2257M9595l1911n8272R599l028n0628K2141j4046k4333M590N617p545
$$ y = [28554, 60742, 44306, 97305, 91951, 71112, 84053, 74376, 83416, 58289, 25445, 18187, 38159, 56033, 80641, 121465, 114574, 104426, 71354, 79340, 125235, 103205, 87879, 81946, 32539, 20351, -376, 16864, 60653, 75036, 71983, 81464, 68029, 52124, 102948, 59294, 54751, 56847, 46948, -5130, -33679, -40011, -39868, -35459, -71544, -77475, -42013, 18224, 759, -31527, -68012, -47924, -44012, -4237, -14180, -17153, -5496, 3712, 9370, -18083, -5011, 67379, 80033, 95883, 78362, 37102, -24991, -26342, 8151, 10877, 18237, -22489, -1343, 23652, -21529, -47040, -32995, -35142, -65075, -71415, -56460, -18586, 11755, 3294, 3341, -28568, -20007, 9034, 25321, 21045, 53302, 102897, 70986, 12714, 22313, 19285, -31343, -9202, -23248, -47581, -42991, -37374, -44919]
9405d4919K5230n773J8737K8702j6119k3624J4922k641j5488m1126K5600P0098
9393C3599R200m5653Q5l432P296L3442N0656J9709l5078o9507l7380k6946J5938
9380d8071N2435M474L2049l165n1881p412j4600K1472K314P947j2937l483j635
9367b2493O597j7134J6137J1260j6055K0212L7804o2552o6955P7813q207j2600
9355c6173r991N347L0957k5082p921N1470L017Q303M5152l1584o8739k5002L0691
9342b9555N2602L1116J9714l3260o1392m5203k4204K2507J5200L6601j6448k9825
9330f2147P430J722p917M875l442P107J9164j1997M951K1948L9821J3166l5708
9317a027K7934l035m0832M7982j2143k0896k3718Q5541J1267J599k2316m4250
$$ y = [-44919, -19689, -25462, -6725, 21977, 5858, -17766, -2844, -5485, -20973, -62099, -36499, 33599, 42799, -2854, -2769, -6201, 1095, 34537, 85193, 104902, 69824, 317, -37063, -64009, -48071, 4364, 8838, 40887, 37722, -14159, -21571, -36171, -14699, -12385, -4438, -17375, -20858, -22493, -15896, -33030, -16893, -5633, -21688, -1476, 36328, -26224, -93179, -15366, -23573, -36173, -46164, -40817, -9860, -34942, -42863, 8607, 11624, 19927, 65079, 33495, -35244, -60246, -29555, 23047, 54163, 73877, 40617, -20775, -65978, -90182, -67675, -52475, -15874, -32322, -62147, -54717, -52995, -60912, -56037, -59479, -52372, -33208, -45205, -40254, -18306, 21515, 34681, -1027, 26907, 23872, -16960, 31022, 18879, -2017, -25735, 59806, 71073, 72672, 50356, 6106]
9305F106n6469r108L6301K1372k2839O361r407M2955j9912l4184k1376J3084K1521
9292b5595l2005l3683j0146P0523J4886L4132N3643k1000m0950k7860m4157K704
9280e9508Q351K9025K3271j3150L1151j6441j4572k0301L321J9313m0300l3874
9268h3714N310j2873k0242n763J2846R6982J2525L650J5909l069P875J2837K3883
9255F6156N6166l3009p4227j270J2434j7871k3691m6565r292M1397K2264j4001
9243b1509K2676L0069j4835J7547Q088j5212o8154M3271K3804l8573j9043l100
9231c4971l6566N379k2476J9329J444K9345J9908r855k3284k0262j5990j6300
9219a04299M2003N8161l295K4326L7188k489o0307o2378M612k4550O5027j957
$$ y = [6106, -50363, -59471, -23170, -1798, -24637, -18276, -27683, 15272, -4640, -38824, -60200, -47116, -25595, -57600, -91283, -101429, -30906, -16020, 18112, 71755, 50755, 9805, -18055, -62212, -59508, -51157, -22132, 1139, -12011, 19140, 2699, -11873, -32174, -28853, -9540, -49840, -83714, -78404, -91277, -111519, -117282, -104436, -7454, 5071, 8721, 24630, 21561, 29436, 42273, 66156, 122322, 89313, 15086, 13816, 26250, 8379, -15312, -61877, -71169, -29772, -7508, -21509, 1167, 31236, 16401, 33948, 42036, 26824, -41330, 1941, 25745, -12828, -31871, -34971, -71537, -66158, -88634, -69305, -67861, -38516, -18608, -28463, -51747, -72009, -87999, -104299, -62296, -4135, -7430, 16896, 54084, 51595, -8712, -71090, -66478, -91028, -26001, -27958]
9207b7958k0226J6931M5280K2874o698r001K9777N456R487m7584j4882j8001k3191
9194c7736K4447M6544J4958k2797j8119M9616l569j3248k017K2568p0083j833
9182a1269N8689O0119j3838l7138r481P3090k7078p0662j6519J7726J2468k3180
9170A2927j1120k5046J9439l1583L939J6050p348n580m218l2187L9480N0949J3448
9157C9150k8622l8137k7734l3254l9794J9868J9230K1649J2604L5506K0423l4967
9145c4078l3278L261M3632L3766j4634J4286N996J3560J277K7102J8843o1819
9133A7914m3097Q026j9745M6736K6219o1874o0222L6380M5748J9490p527l0583
9121b2535J562j07K3090K278k0503N3222N4116o2172l7174k510J5820K4028o4909
$$ y = [-27958, -48184, -31253, 14027, 36901, 30203, 21202, 50979, 56435, 65922, 18338, 3456, -14545, -37736, -13289, 33255, 48213, 25416, 7297, 56913, 53344, 40096, 38079, 60647, -9436, -11269, 47420, 107539, 93701, 56563, 47082, 120172, 93094, 22432, 5913, 23639, 36107, 12927, 1807, -23239, -3800, -35383, -31444, -15394, -22742, -28322, -32540, -64727, -25247, 25702, 39150, 10528, -27609, -55343, -88597, -128391, -108523, -89293, -67644, -55040, -19534, 889, -34078, -67356, -64095, -20463, 13303, -1331, 12955, 18951, 32511, 33788, 60890, 79733, 17914, -25183, -17157, -36902, 9834, 36053, -25821, -86043, -49663, -3915, 15575, 8048, -22535, -20973, -21080, 2010, 4288, -16215, 37007, 91123, 28951, -8223, -10733, 5087, 29115, -35794]
9108c5794j7728K4203m2747K5117K9476M0800K6579Q094J5755l7964m5128k808
9096a2145J6024k2528J5310L1589p810j2269j5582n6387l2495K8243J05013r046
9084B7917m1935q98P838l6560R044k6493k8104K9409O0083K5409k5782k5330J4624
9071a0778K0148l593k7203j9920M0550J9531j2027l219L8639R131J3234n8887
9059E606k7770R383j5636O659l5693o619O806K3141L5071J8800K2346K3399k8021
9046C7472k0602L2115j0680k0287j0958L4228J2667k1248k1309k6322k3457R10
9034c7471L4096q187o480M4971p682Q015k6903J1099O186j1416k7691j4683J8174
9021a7972M9350k763l4342K8466j5834n3808K7073O0655J1663n5038j2476j8587
$$ y = [-35794, -53522, -29319, -72066, -46949, -17473, 23327, 49906, 58000, 73755, 35791, -9337, -12145, 3879, -18649, -3339, 28250, 20440, 8171, -7411, -63798, -96293, -68050, 36963, 27917, -14018, -14916, -7078, -43638, -34594, -61087, -89191, -59782, 301, 25710, -72, -25402, -10778, 9370, 5777, -21426, -41346, -796, 18735, 6708, 3489, 42128, 51259, 64493, 5606, -22164, -12781, -28417, -21758, -57451, -64070, -57264, -34123, 948, 19748, 42094, 65493, 37472, 16870, 48985, 38305, 18018, 7060, 41288, 53955, 32707, 11398, -14924, -38381, -37471, -3375, -11562, -18042, 26929, 19247, 27262, 359, 11458, 17644, 6228, -21463, -36146, -17972, 31378, 28615, -5727, 22739, 6905, -46903, -19830, 40825, 52488, -2550, -15026, -33613]
9009c3613l9751K8032M8186Q588l5017J6851N2879Q118k7953J1949p74k5715p607
8996D173n295j8840j1789J5004M4585O020j5676j2743j959J6781M4092p495n6915
8983e7n6267j0860M6323L2640m432L1826j4607l1508N634O1522J2404L6170K316
8970A11104r9403k9980j2886n488l0003J7790L0147K6595J205M410m85m090m491
8957D425k0322K3832R066j2082J0051J3201n589k7088J4488J098K0389M1027l2883
8944C9613k9358l8083k5802J9284m033K1755j2447K474Q5412j0310l2932J0447
8932B6020m1290l5314K2301L5917L5955k5379j4622p236j5074m6785J532j2668
8920g6643M5071L0877M1927L584k4303l0975o278o0821M511N3302P015N374K5988
$$ y = [-33613, -73364, -45332, 2854, 11442, -23575, -6724, 46155, 54273, 26320, 38269, 37495, 11780, 4173, -1122, -19962, -31751, -16747, 27838, 33858, 18182, 5439, 3480, 20261, 64353, 56858, -57, -56324, -67184, -20861, 11779, 7347, 39173, 24566, -6942, -1308, 60214, 72618, 108788, 111104, 11701, -18279, -31165, -36653, -66656, -48866, -18719, 7876, 9081, 13491, 13006, 8916, 4425, -15897, 7935, 17001, 4919, 14970, 28171, 22582, -4506, 9982, 11080, 31469, 72496, 39613, 10255, -27828, -53630, -34346, -38379, -16624, -29071, -26597, 58815, 48505, 15573, 26020, -15270, -50584, -28283, 7634, 43589, 18210, 3588, -3648, -18722, -65507, -63975, -76643, -31572, -695, 41232, 44816, 20513, -10462, -16740, -77561, -73050, -19748, -12733, -7359, 18629]
8907A8629K3519N460J6221J6065K7228j1169l0826J7765k3946j5906k7689j0360
8895D991K395Q965o4802K7800J7680r028p670o460L0142M8903l6557j9462J1862
8882H759N1927J3796l9988l5461j1805n724l9137K0322K8744j1158J7153n227
8870g799l1225P677L4045M9609R5k3941m0424m426M3825J7253k5159l1548j4812
8857b6830l5237J3706l1594n484K1747M6184J7853M7183J6397j13698m4267J0417
8845h3623N8285M4991N7870l3364k6982O515j6089J4846K7810k8871k0170R908
8833A1126O906M5189M815n3231k3645k5398O0471M9045n1987j2800K5846K411
8821C8748m9874n1584l4340j1445L9842K0589k7696L0318K2296k5878l96J4398
$$ y = [18629, 42148, 47608, 63829, 79894, 107122, 95953, 65127, 82892, 58946, 43040, 15351, 4991, 7386, 16351, -48451, -20651, -2971, -11999, -19669, -26129, 4013, 52916, 16359, -3103, 8759, 60686, 74482, 34494, -967, -12772, -18496, -57633, -37311, -8567, -19725, -2572, -7799, -39024, -31347, 2698, 52307, 52402, 28461, -11963, -16389, 27436, 44689, 19530, -12018, -26830, -62067, -48361, -79955, -85439, -63692, -17508, 345, 47528, 63925, -49773, -94040, -83623, -25338, 19653, 77523, 44159, 17177, 23692, 7603, 22449, 50259, 21388, 1218, 11126, 18032, 63221, 68036, 14805, -8840, -34238, 26233, 75278, 23291, 10491, 36337, 38748, -11126, -62710, -97050, -108495, -68653, -48064, -75760, -45442, -23146, -49024, -49420, -35022]
8809c5022J0035L557P794J3039J1795o1267j9685J0058M421R628N2179J4522M7887
8796F8941o5591q4484K1191N0873k4856L3094N5120m0028o0864J1668n133j8268
8784e8337K2056Q9235M217J337m7279j6892N509l6838J6803R470j0686k5005j9929
8771f6339K7814K7474L0530N243j3496l0588R947M1226N350j1893m6403m7679
8759f8814J9312K4773N1884N6674j8857o3918m7830N0929j6695O437K4277m240
8747A3932M082N5949q245l7364m6858K3011L5539p924p89K1405K1886m4374o3456
8734c3206K9917K0085m967K359j0814l113k2051M2677Q360l8169K7470K3384p209
8721C4723m6941k9443J9951L7991j6040K870J1970j434O1209k5191O545L17o2202
$$ y = [-35022, -24987, -21430, -13636, -597, 11198, -50069, -69754, -59696, -55275, -45647, 6532, 21054, 68941, 3350, -81134, -59943, -9070, -33926, -832, 54288, 14260, -46604, -34936, -40069, -58337, -36281, 52954, 57171, 58508, 11229, -5663, -154, -36992, -20189, -10719, -21405, -46410, -66339, -38525, -11051, 19479, 24722, 11226, -19362, -9415, 31811, 37161, 25268, -21135, -68814, -49502, -24729, 27155, 83829, 64972, 1054, -46776, 4153, -12542, -6105, 18172, 13932, 18014, 73963, 65718, 28354, -18504, 4507, 40046, 32122, 31333, 52738, 74624, 30250, -33206, -3289, 16796, 11829, 14188, 3374, 261, -21790, 20887, 29247, -8922, 18548, 41932, 34723, -12218, -41661, -21710, 16281, 241, 3111, 15081, 13647, 74856, 49665, 56210, 56527, -5675]
8708e675q355J4400m1282L4004M9456N461l688J4484R796j9769O167J4550p7292
8695g743j32062M2659R4906Q7501k3728j4737k8591J6491O990n0730n1632K7038
8683c3638N1087K2089M396J1019m162j8578K8848M3032m9894m5784J5922N7560
8671H1897O1601Q840l1966j2216m1757m3245j1669J2706J2076l6945L6216k259
8659C3279m0884L4549J6313n9853l4857j8120L7469L8241L3767N220j8774L296
8647B9646L1260K2751p8572p4974L893N5544R1124L6296q3230j381M383l6305
8635D35J8466Q035L0051L197o9728j0113L0909J0098m766K3960j1209M0839J4998
8622H5172m6127j2099j3310j3224L1700Q707k2061L3314K0872n3060l6096J4676
$$ y = [-5675, -14030, 370, -40912, -6908, 42548, 48009, 44321, 58805, 68601, 48832, 54999, 69549, -7743, -139805, -97146, -2240, 85261, 61533, 46796, 18205, 34696, 41686, -9044, -60676, -33638, 17449, 39538, 43934, 54953, 50791, 32213, 61061, 104093, 54199, 8415, 24337, 81897, 143498, 152338, 120372, 108156, 66399, 23154, 11485, 24191, 36267, -678, 35538, 33279, -7605, 26944, 43257, -16596, -51453, -69573, -32104, 6137, 39904, 45124, 26350, 29646, 60906, 83657, 5085, -69889, -65996, -10452, 80672, 116968, 33738, 32357, 36740, 435, 18901, 26936, 56987, 60184, -9544, -19657, 11252, 21350, 16584, 40544, 29335, 70174, 85172, 39045, 26946, 13636, 412, 32112, 40819, 18758, 52072, 72944, 19884, -16212, -1536]
8610a536K9015N042l2491O8977J2251L4862q497n7996q027L4057R602n1488l9150
8597e379J0215j7162K0030O3843P2698J6270p5618l1458K6355j7693m107O159
8585F4153j0482j2924l798k8175L0418M8753J510n1316o890P5643J4050m4598
8573G6344L9802J783m161l1212j569O3005M5896o1701Q734N9787M4121o045l4908
8560A99876k3105j356l3970O816O179l254q9946L8649N0687L406j5188l8767N700
8547A05727l1230j4482P7792o5664m3614L7453O0635j1983k4707j7375m309L6222
8535A04465n1205m866L1033l524l4626l3297l3221J5967o735O605l4730q026l4320
8522h6480N395M5111L1098P971j7858o0073j6429L1638L5406n836p687P720q448
$$ y = [-1536, 27479, 32521, 30, 69007, 81258, 116120, 107623, 49627, 41600, 75657, 85259, 33771, -5379, 4836, -12326, 7704, 71547, 144245, 160515, 84897, 53439, 79794, 62101, 57994, 64153, 53671, 40747, 36949, 8774, 39192, 87945, 89455, 38139, 31249, 106892, 120942, 76344, 116146, 117929, 113768, 82556, 80987, 143992, 189888, 128187, 136921, 196708, 240829, 234784, 199876, 176771, 175415, 141445, 148261, 154440, 151186, 61240, 99889, 150576, 153982, 138794, 100027, 105727, 74497, 60015, 137807, 72143, 28529, 65982, 126617, 114634, 89927, 72552, 68243, 104465, 53260, 48394, 79427, 75903, 41277, 7980, -25241, -9274, -16009, -9404, -44134, -52160, -86480, -81085, -35974, -4876, 3095, -14763, -74836, -91265, -59627, -24221, -30057, -37744, -30024, -38472]
8509c8472j1061m799K546M2651l96k5148J4722J5044L4241j201p248K208L0404
8496E3491J6005l8588K1785K4749l2652k2942j558j8128L0085L5776q696K1111
8484H0438m8243q4135j6965N9843K5079K7140m1259n1673m6332J2193L0369K0819
8472c2726j6924N1030K3890N149J9905j9112l6173j5426N324q261K75N1632L0871
8459E9454K7340k0723l0859K1364J3519j6858K7371L742j7295j6805n522O237
8447E0965l1586j9334k2473J7286P174O5652M8777l900o7139J2782M0237J6455
8435A14896L1640n0531l9939p253k0145l519J7891m889k577L9447J0298j7337
8423F7982J0499j1188l4737K6925K4735n0536m0036p039K0548L8653K8586l4016
$$ y = [-38472, -49533, -54332, -51786, -9135, -9531, -34679, -19957, -4913, 29328, 28127, 20879, 23087, 53491, 69496, 30908, 52693, 77442, 44790, 21848, 20290, 2162, 32247, 68023, 59327, 80438, 32195, -51940, -68905, -9062, 16017, 43157, 1898, -49775, -96107, -83914, -53545, -32726, -49650, 1380, 25270, 30419, 50324, 31212, -4961, -20387, -15063, -23324, -23049, 28583, 59454, 86794, 66071, 35212, 56576, 70095, 53237, 80608, 84350, 67055, 50250, 44728, 50965, 19379, 45, -22428, -5142, 2032, 67684, 116461, 112561, 45422, 58204, 98441, 114896, 146536, 96005, 56066, 48813, 28668, 25149, 43040, 38151, 35574, 75021, 85319, 67982, 78481, 67293, 32556, 59481, 84216, 33680, -6356, -13395, 7153, 45806, 74392, 40376]
8411D0376o5005k8141K2807K2607L5783j3176M5437K7540r031m836K0609l0342
8399F4628l4898q572P424J1609n6240l2310Q223m2507J3247P5502L6494j0694
8387C1906K4225k9822k9075Q608j1315k898J5818j5899k9391O3481Q402q172K1935
8374D7803K5254m2990l1886j4486K0199m7700N64K5962j4740j2209o218p008k5716
8361h3171k3703L2149M9177j6897l7530J5820j679K2129M7433k5627k4415J5477
8349c0837Q5432J6096J636K7427n3671n9777P595O4j106O264J4284J9407m9541
8336a6727L8355K4939K1692L0801L7564j2275J5077M4204n633n3967j1898l5188
8324G6944l1120q2366k6168N5286J3021o037o080j8770J369P1199j607J9925J9894
$$ y = [40376, -24629, -52770, -29963, -7356, 28427, 15251, 60688, 88228, 79197, 74361, 94970, 64628, 29730, 21158, 28582, 40191, -16049, -48359, -40136, -82643, -69396, 6106, 42600, 31906, 56131, 26309, -2766, 5842, -5473, -8371, 7447, -8452, -37843, 25638, 34040, 25868, 47803, 73057, 30067, -1819, -16305, 3894, -43806, -43242, -17280, -32020, -44229, -50447, -57455, -83171, -106874, -74725, -25548, -42445, -79975, -64155, -65834, -43705, 3728, -21899, -46314, -30837, 54595, 70691, 72327, 99754, 46083, -13694, -6099, -6035, -7141, -877, 13407, 32814, -16727, 21628, 46567, 68259, 99060, 136624, 124349, 139426, 183630, 177997, 124030, 112132, 76944, 45824, -36542, -62710, -7424, 5597, -440, -6520, -25290, -23921, 47278, 45671, 65596, 85490]
8311H5490k4843q0980n0207O257K5148l3772K2201L9957L6848L6013k5651K1984
8299E8445p228K274m0605J5889J9871j0195o391j398J1157K3657l2338k4892L585
8286A1831J1800J4809L7268j9912L487M896k2307L3089O1208q038l0107o0983
8274C7041m8956P390m233K1681M6239j4602l0470Q4660M659n2199L173l723Q769
8261E9429j454l2787k2284k3160k123M0123L3823j2322j6924l5187j5570l7803
8249f6239M4152L6394j5521l0695k2281P427o859l679L2005O1641J912j0584m5660
8236a7987J0459l399j3907L977k0540l530n909Q475L7469j2588K2410O510j1950
8223e10j8656K7823L7986m979j1427k942J932q646j4787p712l3848K1526k2661
$$ y = [85490, 60647, -20333, -70540, -64283, -39135, -72907, -50706, -10749, 26099, 62112, 36461, 58445, 51217, 53491, 12886, 28775, 48646, 38451, 32060, 30662, 41819, 65476, 33138, 8246, 11831, 23631, 38440, 75708, 55796, 59283, 64179, 41872, 74961, 136169, 128131, 98024, 37041, -11915, -4525, -8758, 12923, 59162, 44560, 14090, 98750, 103409, 51210, 54383, 50660, 59429, 57975, 25188, 2904, -20256, -22379, 17744, 51567, 39245, 22321, -12866, -28436, -66239, -22087, 14307, -1214, -31909, -54190, -46763, -53622, -57301, -25296, 36345, 38257, 27673, -17987, -7528, -10927, -24834, -20857, -41397, -44927, -50836, -42361, -4892, -17480, 4930, 11440, -510, -19166, 8657, 46643, 41664, 30237, 27295, 29227, 20581, 5794, -1918, -35766, -14240, -36901]
8210c6901K5440R522m7304n0078m2249J4434J8551j3877J3729J0653M5798l619
8198e5901J4929p924L0636R648R741j837K5867J754R658M956k4817j6124J0089
8185A0675m3516n931J3935K1182N4599J5373l9327k0536l9523m0957J895M3667
8173b8464J5577L3783J7626J0975L798n3456L4514M2102L00j3416n3410J1128
8161B1057M1296l8114k2245L94j7697k0852m942q610j393j8577N3405J754l5176
8148d9700K3104J6429J8785q304K2822J3843k1532r555k6314M9L4212J9507J1182
8135D4528l7915J7318K2391n123L787k1333k376n0703k1923j7320j6050J033O8315
8122a5371N3479k9949l6512l1400M7325O222j9255K3655j4927M646j8275k2415
$$ y = [-36901, -11461, -1939, -49243, -99321, -141570, -127136, -108585, -122462, -108733, -98080, -52282, -55901, -40972, -48896, -18260, -8612, 1129, -708, 25159, 26913, 36571, 41527, 16710, 586, 10675, -32841, -38772, -24837, -3655, 50944, 66317, 26990, 6454, -33069, -74026, -72131, -28464, -12887, 20896, 38522, 49497, 53295, -161, 34353, 76455, 76755, 63339, 9929, 21057, 62353, 24239, 1994, 2388, -15309, -36161, -41103, -49713, -51106, -69683, -16278, -14524, -49700, -26596, -10167, 8618, 314, 23136, 36979, 15447, 5892, -20422, -20373, 13839, 33346, 44528, 6613, 23931, 46322, 41199, 44986, 23653, 21277, -29426, -51349, -68669, -84719, -83686, -15371, 38108, 8159, -28353, -59753, -12428, -6206, -25461, -1806, -16733, -12087, -30362, -52777]
8110e2777L7133k5901j132n41L3038o656J3224M4181L67l3514l0414M0021M1137
8097E8166j0387L320N751p9870k6652K4576n1658M3808J04007P0864n1167n7258
8085C3500j9886m7241j9924Q157j6206K8956M7163O4645j0137n5887k0382M8256
8073D1014J0922m4416j6258J4110l841K4979J6491j2989K6567l0761P525o628
8061B6715k4143j3031R118l0673l8555K0831N7446J2811q3258N0655N4297K6674
8049F8887J6956q0727k5238L0731L4610n6302k7031J0628k4260p173M68L4960
8037b3491J8691m5278k8484M7420M4157q535j1188P553j7107K4625l7242J5033
8025a3846L7323K1232j4617l6791j2318P290k113P2923M9677Q861n6733Q243n090
$$ y = [-52777, -15644, -41545, -42677, -43218, -10180, -16836, -3612, 40569, 40936, 7422, -22992, 17029, 58166, 47779, 51099, 56850, -23020, -49672, -25096, -76754, -32946, 71061, 141925, 90758, 33500, 13614, -33627, -53551, -45394, -61600, -32644, 14519, 79164, 69027, 13140, -7242, 41014, 51936, 7520, -8738, 5372, 1531, 26510, 43001, 30012, 56579, 25818, 33343, 26715, 2572, -10459, -1341, -32014, -70569, -49738, 7708, 20519, -62739, -12084, 42213, 68887, 85843, 5116, -20122, 10609, 45219, -11083, -38114, -27486, -51746, -58919, -58451, -23491, -4800, -50078, -78562, -31142, 13015, 4480, -6708, 845, -16262, 8363, -28879, -13846, 23477, 44709, 30092, -6699, -19017, -11727, -13840, 59083, 108760, 117621, 60888, 69131, 64041]
8012F4041k0133j5412m353J3221L113J9313n358j5524j5635m164j4015P636j5183
7999b453k9294r155L464L9397O331L19q770j805M1257J4085J2928K3582n0297
7986C9589j11044r587n58M2533L6425J7479L132K3338L1143k1658n983l440j6734
7973B4635r926K1957J361k0207L3025M915n184M130k4784k0192L4693l7512l5428
7960b8517k316j167L2953J8489K903j8344J7925J5094P6541M962m5512k0493j5519
7947C6999l0428m3826l3974k0673j3839N4466L1971J5560o408J2271O3328L9851
7935A05298j4820L77l8547k1565l6406j9426J2728J732J9491L8142M3074J5880
7923A05958k4028m9869p8658j505L5431o220l2789P970J4464p115J5580k708J9623
$$ y = [64041, 43908, 28496, 24143, 37364, 40477, 59790, 54432, 38908, 23273, 19109, 5094, 12730, -2453, -31747, -40902, -37438, 1959, 8290, 8609, -161, -1966, 39291, 53376, 66304, 89886, 39589, -71455, -81042, -81600, -39067, -2642, 14837, 17969, 41307, 72450, 50792, 44809, 41369, 24635, 14709, 36666, 38027, 17820, 50845, 55760, 50576, 54706, 29922, 9730, 44423, 6911, -28517, -30833, -32000, 953, 19442, 22345, 4001, 21926, 37020, 113561, 118523, 73011, 52518, 36999, 6571, -37255, -71229, -91902, -105741, -51275, -19304, -3744, -10152, 2119, 65447, 105298, 90478, 90855, 52308, 30743, -5663, -25089, -12361, -10629, 8862, 47004, 90078, 105958, 81930, 32061, -46597, -48102, -12671, -18891, -51680, -43710, -29246, -36361, -20781, -23489, -3866]
7910c866j1956j6714p471j4487J8387J1636L0535l3386k5963K717p9811K6027
7898a04352M5489M7225P082m2930k4086N0083J0413j6729Q801k864L8908m7477
7886c0437k5964J4291J0418J7264K7580k1947n1967k8059J0497K2282P137K3507
7874b5398K0566Q615M3064l2917R436N9087L0314l2263l5612K4672K1472k9802
7862F1234n2246o3853P644N3449J7019l1357n0385K403P118M0557J8739K5420
7850C5742n8990m3430P934M7998M4361k9072n4081J4159L203j206k4607m8448
7838a06437M141J7191M0014L8446J6352J2967q946J394k3897J0707M4421J0707
7826E7060m1948n7267j6101J5016j9125L7180N0555K4388J3629R256k8550k7127
$$ y = [-3866, -15822, -32536, -40007, -54494, -36107, -24471, 6064, -27322, -53285, -50568, -130379, -104352, -58863, -11638, -4556, -47486, -71572, -21489, -11076, -27805, -19004, -21868, 17040, -30437, -56401, -42110, -31692, -14428, 13152, -8795, -60762, -88821, -78324, -56042, -48905, -25398, -4832, 3783, 46847, 13930, 23366, 82453, 112767, 80504, 44892, 69564, 91036, 61234, 8988, -54865, -47221, 6228, 23247, -8110, -58495, -56092, -48974, -8417, 10322, 35742, -23248, -66678, -58744, -10746, 33615, 4543, -49538, -35379, -32176, -33382, -57989, -106437, -102296, -85105, -45091, -6645, 9707, 22674, 13728, 15122, -8775, 1932, 46353, 57060, 15112, -42155, -58256, -43240, -62365, -25185, 25370, 49758, 63387, 72643, 44093, 16966]
7814A6966n306L525L3760j706m0502m6034L8947R429k7865J8249o642o2034k5554
7801i4767n986K8103N2611j9253k6243L976J203Q017J8326K0618K4817k3453L4895
7788B2864L4314K2761J8678J772l3341n654J2337l4711m7979o130N1650J5247
7776E1808m8113k918L1933J4041L8597M3379n5755o820l2827n9925j8516J899
7764d3217J9533J9709k124j6755K5951J0571k858m3877l3848k912J3802J9225
7752c6800L5317J7978p712m0604k4530M5102k5073P368j4856j5804J676p072k1650
7739h6660K8548M4035M7022q545k7936j1772l7078n9524O199l680N471J4199K9978
7726e9743N3536N2355k0988o3669l233j696L2503K8214J2530J1998l78l1991k5279
$$ y = [16966, 11660, 15185, 48945, 47239, 6737, -39297, -350, 9079, -18786, -537, -7179, -69213, -94767, -100753, -72650, -20039, -39292, -65535, -61559, -60356, -52339, -34013, -13395, 11422, -12031, 22864, 57178, 79939, 98617, 100389, 67048, 61394, 73731, 39020, -8959, -15089, 36561, 51808, 3695, 777, 32710, 46751, 85348, 128727, 72972, 66152, 33325, -26600, -45116, -43217, -23684, -3975, -6099, -22854, 3097, 13668, 10810, -33067, -66915, -69827, -56025, -36800, -1483, 16495, 8783, -31821, -56351, -11249, -36322, -28954, -43810, -59614, -57938, -65010, -86660, -58112, -14077, 32945, 24400, -3536, -15308, -52386, -111910, -105711, -109391, -103920, -89721, -59743, -6207, 46148, 25160, -38509, -41742, -43438, -10935, 17279, 29809, 41807, 41429, 9438, -15841]
7713a5841k1633l0612J5053J7221J379K5570L201M286N976j0724K9130j9138m432
7700e64K2925R837m5088m5381M6371M5255Q944k9429p922L881M0561k3417n5020
7687b9047k8484K0732K2587j3252k1618l089J0552J4382j3119m7724p168j3644
7675a08892J1048L3081K9497N68k9086L2214M068l8029J2687O749K661N6534K1094
7662C4194J4234k0804k4312j1827L7873l1758l6371j3949p530O232O9906N5039
7650G0927j4097l9283P261k2700l8000n426M9390J7659J0490J3044l0682o1493
7638d2910L6559M7435K174l8984m9905l9300m4540o487O8339P1365L644l0550
7626b3160m8283j806K2110k5866k4836M0738O0984O2789q118o1839k4065O0678
$$ y = [-15841, -37474, -68086, -53033, -35812, -34433, -8863, -5662, -1376, 4600, -6124, 23006, 3868, -564, 22361, 32198, -12890, -58271, -11900, 33355, 42299, 12870, 4948, 8829, 49390, 25973, -29047, -57531, -36799, -14212, -27464, -49082, -52171, -41619, -27237, -40356, -88080, -95248, -108892, -97844, -64763, -35266, -34698, -63784, -31570, -27502, -65531, -52844, -46095, -43434, 13100, 34194, 48428, 27624, 3312, -8515, 29358, -2400, -38771, -52720, -60250, -54018, 15888, 70927, 56830, 17547, 24808, 2108, -35892, -41318, 8072, 25731, 36221, 49265, 18583, -42910, -6351, 41084, 43258, 4274, -45631, -84931, -129471, -135958, -67619, 3746, 7390, -23160, -71443, -73249, -51139, -77005, -101841, -61103, -119, 62670, 54552, -7287, -31352, 29326]
7614B9326L961J5670k346j1120k7579k744L326k0457L772m071l585n532p038l2601
7600f1018O7519J6266l5604l5852j1757N3210k1756j3847k3692K475J1472Q83
7588e1701J8967M1269L8008M1511j7474o7648k4549j7582Q01J2670j7103K7890
7576a4941Q261k6369K6376M2998q067p551L8823R204l8075j3234j7425o5688O97
7563f4991L4502L7275k5040j0241m858j7083k1273L0521O8004L288J5328J5810
7551F1242j2314K4156k4263j7211n7051o7265p583R1703L9542k8725K0819q786
7539A4264J6520k9108J9217N2540n5169m0602j4112L2771J0627k6525l2440n925
7527e7942N6626Q22k4377n2650p066L2314q497N28K4696J4752m50l9445j9077
$$ y = [29326, 33287, 48957, 46611, 35491, 7912, 5168, 8494, -11963, -8191, -12262, -15847, -21379, -28417, -61018, 6501, 22767, -12837, -48689, -60446, -7236, -28992, -42839, -66531, -64056, -52584, -51701, -32734, 8535, 46543, 88054, 70580, 2932, -21617, -39199, -38398, -25728, -42831, -14941, -6680, -33049, -6673, 36325, 28258, 20707, 59530, 68734, 30659, 17425, 0, -65688, -64991, -30489, 6786, -18254, -28495, -33353, -50436, -71709, -41188, 26816, 30104, 45432, 61242, 48928, 73084, 48821, 31610, -25441, -92706, -100289, -8586, 30956, 2231, 23050, 14264, 30784, 1676, 20893, 73433, 18264, -22338, -36450, -3679, 6948, -19577, -52017, -57942, -1316, -494, -24871, -77521, -84587, -52273, -60770, -60242, -35546, -20794, -21244, -60689, -79766]
7514g9766J8216J7398N2044k2143l9745j5777M308N1278M3175j2204j3677j9413
7502a6306Q159O2213J3730k0232j0527o052P42k6246L4J7938L0189n6848k6743
7489b9949L3001l8168k9250M952j65J5188K7464o349k4006M5976J0587l4998L2860
7476G143J4360K3196n438m1886j8922M8115L4777K0850L5344l391n0293k1987
7464D1868j2957J4378Q882l0982m7523n2346K2093L0070K3642K5658Q19k385l7815
7451a6598p2627k9951j5005M1347N6168O8947j5254K7378M7705j0040K766j9268
7439F5568k4759J8641m9384j7017K4694P914j0953K4192n759m3476M073L2364
7427B6098j6762p3492k7145M8618N6865N9968k3188J4685j0031n121K5868m7788
$$ y = [-79766, -61550, -44152, 7892, -14251, -53996, -69773, -65465, -14187, 28988, 16784, 3107, -16306, -8147, 54066, 67796, 47564, 37037, 30985, 31727, 5481, 5515, 23453, 53642, -3206, -29949, 3052, -35116, -64366, -59414, -59579, -44391, -16927, -23276, -47282, -1306, 9281, -25717, 7143, 21503, 44699, 39261, -2625, -21547, 26568, 61345, 82195, 117539, 114148, 63855, 41868, 28911, 43289, 52171, 21189, -26334, -78680, -56587, -26517, -2875, 22783, 23602, 21217, -16598, -89225, -119176, -134181, -92834, -36666, 32281, 17027, 44405, 92110, 82070, 84836, 65568, 40809, 59450, 10066, -6951, 17743, 25657, 14704, 38896, 33137, -10339, -6266, 26098, 9336, -64156, -91301, -42683, 14182, 74150, 50962, 65647, 55616, 50495, 76363, 28575]
7415B8575j1286J1440J0882R646J9602O682j3034j2392j6497p2182L0075L179
7403e310J674L173m263j8443k0297n7730J3728p166N6144J4337K8473L4010n6385
7390a8055J8124N7323J7008k4728l1014j1594j0285M1172J7730n7318p76M7964
7378D5551J3932j8700K9659m006l1381J3582J4473k3657M1504J8246n4145q3214
7366c8156K4639N8456J7434m9264L1668N4158P2448n5856o0748M077n5156P287
7354A0987M6271k7502O979j3845n1L8736m8178M996p927l7535m609l7895m759
7341g4332k551N7668j292l2328k9336l124O4717k6142p480N0035L0959N013R941
7328D1748k0712M899L8713J3348o331l9209k6257m3264j2548J5888j6282k4654
$$ y = [28575, 17289, 28729, 39611, 49257, 68859, 75541, 62507, 50115, 33618, -38564, -8489, -5310, -3636, -463, -4726, -23169, -43466, -101196, -87468, -94634, -38490, -24153, 4320, 38330, -18055, 69, 57392, 74400, 49672, 18658, 7064, -3221, 37951, 55681, -1637, -2413, 45551, 59483, 40783, 70442, 66436, 35055, 48637, 63110, 39453, 80957, 99203, 45058, -38156, -13517, 44939, 62373, 13109, 44777, 98935, 171383, 115527, 54779, 58856, 3700, 10987, 57258, 29756, 36735, 22890, 22839, 61575, 13397, 18393, 10466, -27069, -31678, -69573, -74332, -76883, -19215, -20507, -52835, -82171, -85295, -20578, -46720, -54200, -4165, 26794, 31807, 41748, 21036, 25935, 64648, 77996, 71665, 32456, 6199, -37065, -49613, -33725, -50007, -74661]
7316g4661o304L7685L2986O505L5142J7464n869l6389o268p094P7557J0257J3377
7303I4388k2536m8403k3098l3305k9843k9537j948R590M2705q961J4237N386J599
7290b9726L8054M7353K1000J1379j9369m3845l2601l2059K8981k4976k5201L8
7278f0972K2255j8270L6147M3269p577L3194M5158k3634m9424m0230r746k0578
7266e0408K5212K4934L314O486n8590k3675K4347M0748K3021l180n3288j7150
7254e8229J1790K3896O2400r768J5603J004k5557J381K543k0213p1903q41K2483
7241d5411L7717K9599M8947L5354o4601p9917L6603M3445K8142L46j1150j5193
7229D3881m2866j2161k3625O42K8194l0831k9056J9727L7074R775P829k6686R342
$$ y = [-74661, -80965, -43280, -10294, -3789, 31353, 48817, 42948, 6559, 291, -6803, 70754, 81011, 94388, 71852, 23449, 351, -32954, -62797, -92334, -94282, -84692, -41987, -50948, -36711, -31325, -29726, 8328, 55681, 76681, 88060, 68691, 24846, -7755, -39814, -10833, -35809, -61010, -60972, -38717, -56987, -20840, 22429, 14852, 48046, 93204, 69570, 20146, -20084, -29830, -50408, -25196, -262, 3052, 9538, -49052, -72727, -48380, -7632, 15389, 12209, -41079, -58229, -46439, -22543, 39857, 30089, 45692, 46696, 21139, 22520, 25063, 4850, -67053, -67894, -45411, -7694, 21905, 70852, 106206, 41605, -38312, -1709, 41736, 69878, 70224, 59074, 43881, 1015, -11146, -34771, -34129, -5935, -36766, -65822, -46095, -9021, 754, 8583, -18103, -8761]
7216h761o005j6909o1611P912N8214N1730k4868r708J2870j188n7345J8580O672
7203c0417K2685m3137l2365J4433p909K3446P6722L0534n3380o601J281m5270
7191d9978o935k4606J2425K6650K5243j2873J6019J3184L047l115J3884L9272
$$ y = [-8761, -14766, -31675, -93286, -85374, -27160, 24570, -298, -10006, 2864, 1676, -55669, -37089, -30417, -7732, -50869, -83234, -68801, -76710, -53264, 23458, 53992, 612, -5989, -4708, -49978, -56913, -81519, -69094, -42444, -17201, -30074, -14055, -871, 2176, -939, 12945, 52217]
$$ [...]
##END NTUPLES=NMR SPECTRUM
##END=
