##TITLE=Analysis number 316627
Compound Code cc 47102
Book Reference 437/56
Project Code adrs
Chemist Name wendyb
##JCAMPDX= 6.0         $$ Bruker NMR JCAMP-DX V2.0
##DATA TYPE= NMR SPECTRUM
##DATA CLASS= NTUPLES
##ORIGIN= Bruker BioSpin GmbH
##OWNER= nmr
$$ XWIN-NMR		Version 3.5
$$ Fri Jan 20 14:58:02 2006 GMT Standard Time (UT+0h)  MAYBRIDGE\nmr@NMR_250MHZ
##.OBSERVE FREQUENCY= 250.131544655141
##.OBSERVE NUCLEUS= ^1H
##.ACQUISITION MODE= SIMULTANEOUS (DQD)
##.ACQUISITION SCHEME= undefined
##.AVERAGES= 16
##.DIGITISER RES= 18
##SPECTROMETER/DATA SYSTEM= dpx250
##.PULSE SEQUENCE= zg30
##.SOLVENT NAME= CDCl3
##.SHIFT REFERENCE= (INTERNAL, CDCl3, 0, 16.4539)
##AUDIT TRAIL= $$ (NUMBER, WHEN, WHO, WHERE, WHAT)
$$ ##TITLE= Audit trail, XWIN-NMR		Version 3.5
$$ ##JCAMPDX= 5.01
$$ ##ORIGIN= Bruker BioSpin GmbH
$$ ##OWNER= nmr
$$ C:\u/data/dgb/nmr/ADRS/15070/pdata/1/auditp.txt
$$ ##AUDIT TRAIL=  $$ (NUMBER, WHEN, WHO, WHERE, WHAT)
(   1,<2006-01-20 14:57:11.59 +000>,<MAYBRIDGE\nmr>,<NMR_250MHZ>,
      <created by zg, POWCHK disabled, PULCHK disabled
       configuration hash MD5:
       62 19 C7 07 E1 42 D1 B7 37 6C 3D D0 77 39 F9 E6
       data hash MD5: 64K
       7B AD EE 29 DA 51 E0 0E 73 82 49 5F C0 2F 65 60>)
(   2,<2006-01-20 14:57:37.13 +000>,<MAYBRIDGE\nmr>,<NMR_250MHZ>,
      <Start of raw data processing
       ef LB = 0.3 FT_mod = 6 PKNL = 1 SI = 32K 
       data hash MD5: 32K
       26 4A 3E DF E0 6D FE FD 52 84 F3 20 F8 64 FF 58>)
(   3,<2006-01-20 14:57:39.87 +000>,<MAYBRIDGE\nmr>,<NMR_250MHZ>,
      <apk 
       data hash MD5: 32K
       3A 5D 6A F1 61 E1 27 F1 51 71 55 D2 76 BD A1 8A>)
(   4,<2006-01-20 14:57:41.23 +000>,<MAYBRIDGE\nmr>,<NMR_250MHZ>,
      <abs ABSG = 5 
       data hash MD5: 32K
       97 8E 0A 8E D5 8C 7B D4 AB 7D 5D 32 2D 50 7C 7A>)
$$ ##END=
$$ 
$$ hash MD5
$$ B8 C5 52 94 19 A6 97 B6 ED 74 AB 5D DF 2A 84 B6
##$RELAX= 
##$RELAX= 
##$RELAX= 
##$RELAX= 
##$RELAX= 
##$RELAX= 
##$RELAX= 
$$ Bruker specific parameters
$$ --------------------------
##$DU= <C:\u>
##$EXPNO= 15070
##$NAME= <ADRS>
##$PROCNO= 1
##$TYPE= <nmr>
##$USER= <dgb>
##$AMP= (0..31)
100 100 100 100 100 100 100 100 100 100 100 100 100 100 100 100 100 100 
100 100 100 100 100 100 100 100 100 100 100 100 100 100 
##$AQSEQ= 0
##$AQ_mod= 3
##$AUNM= <au_zg>
##$AUTOPOS= <4 >
##$BF1= 250.13
##$BF2= 250.13
##$BF3= 250.13
##$BF4= 250.13
##$BF5= 500.13
##$BF6= 500.13
##$BF7= 500.13
##$BF8= 500.13
##$BYTORDA= 1
##$CFDGTYP= 0
##$CFRGTYP= 5
##$CHEMSTR= <none>
##$CNST= (0..31)
1 1 145 1 1 1 1 1 1 1 1 1 1 1 1 1 1 1 1 1 1 1 1 1 1 1 1 1 1 1 1 1 
##$CPDPRG= <>
##$CPDPRG1= <>
##$CPDPRG2= <>
##$CPDPRG3= <>
##$CPDPRG4= <mlev>
##$CPDPRG5= <mlev>
##$CPDPRG6= <mlev>
##$CPDPRG7= <mlev>
##$CPDPRG8= <mlev>
##$CPDPRGB= <>
##$CPDPRGT= <>
##$D= (0..31)
0 1 0 0 0 0 0 0 0 0.06 0 0 0 0 0 0 0.0002 0 0 0 0 0 0 0 0 0 0 0 0 0 0 
0 
##$DATE= 1137769024
##$DBL= (0..7)
120 120 120 120 120 120 120 120 
##$DBP= (0..7)
150 150 150 150 150 150 150 150 
##$DBP07= 0
##$DBPNAM0= <>
##$DBPNAM1= <>
$$ [...]
##$SUBNAM7= <"">
##$SUBNAM8= <"">
##$SUBNAM9= <"">
##$SW= 20.6930455092707
##$SWIBOX= (0..15)
0 0 3 0 0 0 0 0 0 0 0 0 0 0 0 0 
##$SW_h= 5175.983436853
##$TD= 65536
##$TD0= 1
##$TE= 294.16
##$TE2= 300
##$TE3= 300
##$TEG= 300
##$TL= (0..7)
0 120 120 120 120 120 120 120 
##$TP= (0..7)
150 150 150 150 150 150 150 150 
##$TP07= 0
##$TPNAME0= <>
##$TPNAME1= <>
##$TPNAME2= <>
##$TPNAME3= <>
##$TPNAME4= <>
##$TPNAME5= <>
##$TPNAME6= <>
##$TPNAME7= <>
##$TPOAL= (0..7)
0.5 0.5 0.5 0.5 0.5 0.5 0.5 0.5 
##$TPOFFS= (0..7)
0 0 0 0 0 0 0 0 
##$TUNHIN= 0
##$TUNHOUT= 0
##$TUNXOUT= 0
##$USERA1= <user>
##$USERA2= <user>
##$USERA3= <user>
##$USERA4= <user>
##$USERA5= <user>
##$V9= 5
##$VALIST= <valist>
##$VCLIST= <CCCCCCCCCCCCCCC>
##$VD= 0
##$VDLIST= <DDDDDDDDDDDDDDD>
##$VPLIST= <PPPPPPPPPPPPPPP>
##$VTLIST= <TTTTTTTTTTTTTTT>
##$WBST= 1024
##$WBSW= 4
##$XGAIN= (0..3)
0 0 0 0 
##$XL= 0
##$YL= 0
##$YMAX_a= 324284
##$YMIN_a= -463118
##$ZGOPTNS= <>
##$ZL1= 120
##$ZL2= 120
##$ZL3= 120
##$ZL4= 120
##$ABSF1= 16.45393
##$ABSF2= -4.239243
##$ABSG= 5
##$ABSL= 3
##$ALPHA= 0
##$AQORDER= 0
##$ASSFAC= 0
##$ASSFACI= 0
##$ASSFACX= 0
##$ASSWID= 0
##$AUNMP= <proc_1d>
##$AZFE= 0.1
##$AZFW= 0.1
##$BCFW= 0
##$BC_mod= 0
##$BYTORDP= 0
##$COROFFS= 0
##$CY= 12.5
##$DATMOD= 1
##$DC= 0
##$DFILT= <>
##$DTYPP= 0
##$F1P= 14.0000005364418
##$F2P= -0.99999901652339
##$FCOR= 0.5
##$FTSIZE= 32768
##$FT_mod= 6
##$GAMMA= 0
##$GB= 0
##$INTBC= 1
##$INTSCL= 1
##$ISEN= 128
##$LB= 0.3
##$LEV0= 0
##$LPBIN= 0
##$MAXI= 10000
##$MC2= 0
##$MEAN= 0
##$ME_mod= 0
##$MI= 0
##$NCOEF= 0
##$NC_proc= -3
##$NLEV= 6
##$NOISF1= 0
##$NOISF2= 0
##$NSP= 0
##$NTH_PI= 0
##$NZP= 0
##$OFFSET= 16.45393
##$PC= 1
##$PHC0= 243.6589
##$PHC1= 3.897065
##$PH_mod= 1
##$PKNL= yes
##$PPARMOD= 0
##$PSCAL= 4
##$PSIGN= 0
##$REVERSE= no
##$SF= 250.130017024694
##$SI= 32768
##$SIGF1= 0
##$SIGF2= 0
##$SINO= 400
##$SIOLD= 32768
##$SREGLST= <1H.CDCl3>
##$SSB= 0
##$STSI= 32768
##$STSR= 0
##$SW_p= 5175.98343685301
##$SYMM= 0
##$S_DEV= 0
##$TDeff= 65536
##$TDoff= 0
##$TI= <Analysis number 999999
Compound Code 99
Book Reference 9
Project Code 9>
##$TILT= no
##$TM1= 0
##$TM2= 0
##$TOPLEV= 0
##$USERP1= <user>
##$USERP2= <user>
##$USERP3= <user>
##$USERP4= <user>
##$USERP5= <user>
##$WDW= 1
##$XDIM= 32768
##$YMAX_p= 555085968
##$YMIN_p= -282571
$$ End of Bruker specific parameters
$$ ---------------------------------
##NTUPLES= NMR SPECTRUM
##VAR_NAME=  FREQUENCY,     SPECTRUM/REAL,   SPECTRUM/IMAG
##SYMBOL=    X,             R,               I
##VAR_TYPE=  INDEPENDENT,   DEPENDENT,       DEPENDENT
##VAR_FORM=  AFFN,          ASDF,            ASDF
##VAR_DIM=   32768,         32768,           32768
##UNITS=     HZ,            ARBITRARY UNITS, ARBITRARY UNITS
##FACTOR=    0.157963299565203, 1,           1
##FIRST=     4115.62176629103, 0,            0
##LAST=      -1060.36167056198, 0,           0
##MIN=       -1060.36167056198, -282571,     0
##MAX=       4115.62176629103, 555085968,    0
$$ Real data points
##PAGE= N=1
##DATA TABLE= (X++(R..R)), XYDATA
$$ [...]
##PAGE= N=2
##DATA TABLE= (X++(I..I)), XYDATA
21005 1215834 1169787 1205000 1196137 1195850 1249887 1288159 1305211 1265021 1195162 1180564 1149111 1171878
20993 1171878 1226726 1283196 1241964 1204435 1187114 1123939 1093131 1159467 1193715 1222047 1241982
20982 1241982 1228635 1227015 1227972 1220988 1212933 1213863 1217404 1197225 1155517 1156809 1120428 1124721 1158461
20969 1158461 1232297 1272953 1294050 1274263 1216612 1245418 1279040 1283986 1265247 1252593 1219268
20958 1219268 1208842 1200193 1210284 1185520 1183618 1202945 1161761 1133839 1167783 1212260 1216330 1243445
20946 1243445 1272844 1256827 1227437 1182887 1161431 1187980 1181820 1129777 1114617 1151912 1229963
20935 1229963 1204490 1155647 1182704 1248984 1233777 1245849 1285284 1238594 1228911 1223529 1236300 1181574
20923 1181574 1099522 1102849 1142553 1202877 1196681 1166854 1184110 1209246 1235393 1239219 1235083 1200754
20911 1200754 1226553 1211763 1223024 1237557 1254406 1253800 1293435 1331691 1356384 1305771 1226686 1231328
20899 1231328 1283586 1308468 1253084 1267599 1282563 1261103 1224579 1246627 1249811 1226198 1228566 1274492
20887 1274492 1261672 1255777 1222985 1128483 1064893 1089351 1169521 1217511 1219935 1240006 1323994 1350147
20875 1350147 1309015 1319460 1299202 1303294 1262213 1263954 1269147 1270022 1230195 1256202 1313439 1313788 1268116
20862 1268116 1224062 1249648 1248708 1233805 1247783 1237470 1222738 1149211 1160051 1170776 1144671 1167048
20850 1167048 1220232 1212812 1227617 1249860 1252955 1241706 1177610 1168479 1155150 1209634 1201324 1187058
20838 1187058 1166707 1173242 1211014 1288754 1282169 1215519 1216524 1244123 1299908 1341068 1332831 1331374
20826 1331374 1323597 1335625 1291435 1274972 1249076 1217379 1254339 1268188 1211338 1206395 1244639 1257154
20814 1257154 1287304 1302967 1295128 1297382 1303253 1325411 1373457 1308581 1213316 1214375 1230608 1161462
20802 1161462 1148063 1135513 1136416 1155905 1194901 1247684 1271981 1284230 1333829 1349047 1284045 1273376
20790 1273376 1345077 1312971 1307238 1316524 1262362 1297359 1297114 1297492 1276986 1305179 1328856 1372812
20778 1372812 1405291 1368191 1311085 1301907 1238540 1253820 1318797 1302064 1273646 1277301 1253195 1270784
20766 1270784 1284951 1344527 1319443 1244939 1215989 1242481 1236331 1266924 1308205 1297606 1327312
20755 1327312 1289629 1291365 1264886 1270800 1285021 1294756 1285458 1253300 1213896 1258728 1296291 1364071
20743 1364071 1401780 1427167 1356646 1335250 1384985 1416219 1341978 1271408 1283164 1332913 1319655
20732 1319655 1352429 1373005 1316635 1263305 1229450 1281567 1347643 1355584 1262880 1201709 1263672
20721 1263672 1316493 1298343 1300878 1314477 1315814 1331036 1406813 1430766 1388665 1359857 1362951 1366681
20709 1366681 1281161 1206509 1194566 1244753 1283603 1284505 1254572 1320295 1389331 1386301 1425727 1392579
20697 1392579 1281589 1294839 1360248 1345735 1343376 1315118 1325525 1375143 1363885 1284660 1287884
20686 1287884 1293700 1324710 1327864 1312599 1307762 1276348 1276961 1257160 1302558 1341354 1333261 1346183
20674 1346183 1299443 1239188 1239157 1324320 1372713 1397984 1399848 1387018 1345911 1363275 1298890 1270133
20662 1270133 1259914 1258185 1266142 1303057 1348776 1371694 1412462 1393905 1415204 1371147 1346720 1359862
20650 1359862 1384669 1336818 1283049 1202390 1205655 1224146 1300694 1326926 1357103 1319117 1347570
20639 1347570 1353663 1358496 1322496 1309401 1300490 1323268 1276255 1224702 1223675 1270679 1306322 1303456
20627 1303456 1302880 1315043 1347911 1329008 1354061 1352210 1356353 1301642 1243139 1278144 1285019 1277256
20615 1277256 1294559 1313417 1271907 1263809 1254871 1272583 1242346 1236846 1269830 1306888 1323776 1334480
20603 1334480 1351827 1371660 1345395 1361759 1353717 1347363 1359566 1380497 1383354 1422370 1393551 1326681
20591 1326681 1334870 1290958 1315142 1362291 1333732 1371224 1444967 1396144 1343996 1328670 1302204
20580 1302204 1329900 1326468 1320739 1334459 1258826 1202662 1248920 1273002 1263549 1300163 1373805 1426437
20568 1426437 1361775 1340675 1373385 1309806 1309844 1377790 1355601 1311083 1308073 1331929 1309388 1271273
20556 1271273 1287009 1343605 1322398 1327904 1372971 1341105 1321311 1307812 1300873 1306592 1329330 1346372
20544 1346372 1340224 1350498 1344875 1326430 1386023 1405921 1342306 1303419 1324317 1341262 1345868 1353101
20532 1353101 1398472 1446505 1433007 1376108 1354149 1373442 1352719 1366000 1325072 1349549 1349014 1381800
20520 1381800 1383282 1406553 1372345 1371107 1404858 1407798 1430557 1452238 1433769 1400235 1355504 1322947
20508 1322947 1305638 1387898 1451345 1486428 1415334 1416565 1394163 1356394 1327444 1319093 1329832 1288180
20496 1288180 1312266 1373482 1311191 1326625 1371926 1384876 1441599 1406749 1385253 1365156 1311649
20485 1311649 1320924 1372551 1370037 1376262 1318915 1352590 1412290 1413908 1402620 1456138 1474883 1463315
20473 1463315 1445212 1464497 1447915 1433696 1466038 1454384 1448624 1401741 1385867 1396785 1402862 1384039
20461 1384039 1393066 1368846 1350043 1351548 1413474 1522968 1558354 1491609 1384293 1353421 1420068
20450 1420068 1376717 1361186 1377827 1409481 1442010 1437944 1394844 1437950 1423551 1378172 1374409 1401815
20438 1401815 1413563 1438663 1481404 1471962 1464351 1479552 1484559 1510915 1475895 1395478 1391307 1383420
20426 1383420 1371725 1399302 1446608 1451018 1401429 1393708 1360877 1341176 1315567 1343858 1415468 1465112
20414 1465112 1424014 1432656 1426933 1507159 1505870 1429803 1378257 1347837 1393601 1436268 1445008 1408984
20402 1408984 1440608 1461278 1471547 1449070 1443480 1455774 1477329 1494665 1471595 1422442 1420491 1376160
20390 1376160 1358367 1454431 1449148 1418347 1381738 1339106 1437178 1472176 1423655 1394614 1384707 1426943
20378 1426943 1419966 1476837 1476848 1526124 1508116 1496021 1529200 1507320 1428392 1391406 1429933 1433519
20366 1433519 1458413 1458553 1439304 1448149 1485225 1472492 1443444 1480627 1519602 1526814 1535118 1513416
20354 1513416 1473323 1499209 1519674 1468934 1414034 1414052 1415930 1449444 1499413 1496394 1450482 1442020
20342 1442020 1455623 1478790 1502467 1485310 1465364 1534015 1559874 1558161 1566134 1611928 1572679 1509604
20330 1509604 1452995 1470732 1487063 1480906 1513754 1506022 1535845 1591811 1565161 1509702 1458648 1440521
20318 1440521 1495440 1489580 1464540 1539458 1548018 1538224 1602105 1596929 1536064 1462832 1451825 1428705
20306 1428705 1479999 1544815 1506087 1446335 1437739 1481455 1477172 1417554 1411670 1484898 1493604 1505825
20294 1505825 1536518 1522762 1479077 1491801 1549440 1611296 1576201 1543415 1540313 1581820 1596166
20283 1596166 1610217 1622936 1581650 1520937 1486811 1515099 1522517 1519347 1491514 1510421 1523125 1481416
20271 1481416 1483482 1464752 1516911 1585687 1654451 1645297 1563703 1542113 1577702 1598615 1543201 1527449
20259 1527449 1520758 1512792 1510897 1551065 1570564 1543416 1554501 1592334 1588503 1592635 1488953 1425712
20247 1425712 1484284 1549942 1522980 1499295 1493532 1558318 1600682 1568274 1508486 1542464 1621906
20236 1621906 1650422 1647713 1592488 1563366 1604090 1667634 1740914 1708900 1633481 1533295 1533306 1528504
20224 1528504 1521261 1531727 1610137 1680533 1687476 1648145 1621881 1597476 1580826 1524433 1509227 1529308
20212 1529308 1627716 1684306 1655440 1632150 1586013 1579737 1492465 1477889 1494683 1512417 1519061 1535893
20200 1535893 1581952 1576834 1560840 1555602 1577351 1603783 1608106 1630183 1614206 1611757 1663140 1620325
20188 1620325 1614373 1564125 1607564 1593673 1608968 1643645 1600677 1525649 1493294 1495974 1546163 1568760
20176 1568760 1538262 1508299 1517135 1580086 1602673 1626303 1655467 1659446 1656942 1646633 1604220 1545519
20164 1545519 1543462 1564562 1552673 1543361 1582184 1590612 1610316 1656196 1673889 1661638 1641469 1680524
20152 1680524 1689135 1633223 1595264 1655274 1633508 1609283 1607240 1552617 1575256 1616318 1628851 1618744
20140 1618744 1641959 1634990 1624226 1550115 1540650 1611682 1615774 1617578 1586436 1654386 1644191 1650236
20128 1650236 1692814 1676002 1630213 1624176 1570515 1554939 1597962 1628765 1638645 1575529 1603929 1621016
20116 1621016 1570227 1615731 1631423 1648855 1645801 1644197 1656906 1660488 1696547 1700667 1687955 1678752
20104 1678752 1670266 1646937 1680943 1666101 1579091 1527000 1541587 1611058 1685327 1676107 1642333 1638874
20092 1638874 1616779 1637410 1652897 1637707 1586631 1576071 1627190 1734951 1722541 1703732 1690414
20081 1690414 1616291 1631580 1685763 1696771 1687878 1644681 1667292 1702153 1652185 1677321 1667538 1584090
20069 1584090 1562739 1620119 1649630 1701895 1771612 1759745 1693848 1646236 1647777 1648326 1637103 1656900
20057 1656900 1709298 1698739 1663646 1668872 1729372 1720806 1724524 1649657 1694856 1649947 1649679 1681005
20045 1681005 1614889 1596042 1623660 1663862 1685986 1705652 1706557 1708142 1716176 1707924 1707593 1641617 1649258
20032 1649258 1641155 1635490 1671554 1690853 1649628 1674592 1687719 1680325 1676060 1682549 1725776 1725208 1762843
20019 1762843 1685868 1605912 1650013 1724200 1696423 1679512 1608317 1580775 1606063 1596383 1624617
20008 1624617 1645934 1677230 1623606 1661189 1643101 1645033 1606898 1604911 1564951 1641277 1701930 1708035
19996 1708035 1713606 1770582 1720278 1658543 1664853 1725016 1781619 1797793 1828284 1828155 1865180 1837388
19984 1837388 1879712 1850902 1752870 1727800 1735541 1739183 1729211 1733199 1742573 1759627 1718977 1781297
19972 1781297 1803486 1809630 1852968 1816642 1774525 1757928 1737395 1737021 1744656 1756474 1772729 1762854
19960 1762854 1770386 1761989 1815170 1827338 1783271 1712955 1676648 1715096 1706133 1740918 1749078 1757493
19948 1757493 1750870 1762290 1731250 1757419 1821099 1835247 1752733 1698999 1704968 1696253 1667907 1706016
19936 1706016 1727423 1758166 1785376 1820569 1810027 1749161 1808984 1814825 1812745 1800934 1797209 1798119
19924 1798119 1762232 1741694 1731482 1752934 1795313 1794039 1759554 1791099 1806350 1780540 1778923 1761258
19912 1761258 1779423 1793740 1768936 1808073 1857903 1829674 1753319 1708860 1713630 1760918 1790883
19901 1790883 1813554 1804399 1827676 1888235 1868518 1806790 1800938 1804406 1736916 1707813 1715308 1772256
19889 1772256 1800567 1821336 1862377 1931090 1917093 1890612 1876422 1861509 1803611 1791413 1876757
19878 1876757 1898069 1849713 1784516 1759453 1717418 1745414 1815324 1888302 1909514 1870487 1857815
19867 1857815 1808231 1843730 1852454 1810662 1840272 1869150 1878437 1769656 1801354 1808111 1773886 1812043
19855 1812043 1830211 1881478 1849220 1867355 1921057 1919932 1863080 1803389 1802333 1850872 1801992 1759000
19843 1759000 1745848 1762963 1786596 1849920 1911307 1900393 1869385 1841754 1899994 1928694 1937836
19832 1937836 1990197 1997583 1965828 1885535 1853501 1859552 1819952 1818714 1870680 1875509 1889311 1877007
19820 1877007 1862032 1895204 1895116 1897018 1873115 1875667 1857864 1877723 1901855 1915131 1885488 1849001
19808 1849001 1853696 1903485 1870402 1841357 1840559 1817789 1879271 1895724 1907517 1894274 1874416 1836047
19796 1836047 1865614 1870731 1850267 1871927 1876749 1851482 1840455 1844123 1884842 1883879 1926755 1929459
19784 1929459 1865287 1828652 1869596 1900844 1851076 1831739 1854682 1902987 1897871 1891819 1974601 2028328
19772 2028328 1999095 1961858 1969802 2007813 1929909 1857209 1874905 1887761 1945467 1987912 1994896 1966398
19760 1966398 1921897 1893512 1871909 1896562 1870912 1916386 1909395 1921246 1979934 1956647 1976215
19749 1976215 1956830 1875802 1865993 1927337 1957315 1963462 1980193 1994279 1982850 1947642 1962249 1917119
19737 1917119 1879497 1876049 1856117 1853632 1863317 1921161 1955011 1977474 2003636 2049666 2064685 2005771
19725 2005771 1994523 1986923 2000953 1973256 1983763 1995376 1985244 1996880 2036660 2063857 2075341
19714 2075341 2103265 2100840 2054025 2022239 2002993 1978298 1950393 1974578 2022709 1996710 1968922
19703 1968922 1956194 1978962 2020192 2044932 2072946 2055596 1987711 1957325 1942802 1975884 2031194
19692 2031194 2086065 2113752 2075701 2035031 1997432 2016038 2011554 1988567 1955517 1879910 1940913
19681 1940913 2092062 2114723 2079322 2012460 2023665 2022990 2081962 2132872 2138851 2074870 2018418 1968034
19669 1968034 1929755 1957346 1962344 2018701 2027283 2057357 2071268 2118459 2135984 2077689 2023644 2054383
19657 2054383 2060319 2045475 2017387 2042837 2061733 2032400 2067038 2146162 2201839 2241330 2148560
19646 2148560 2027187 2024927 2093538 2113616 2097152 2141769 2119789 2109303 2129139 2143664 2119026
19635 2119026 2097195 2090825 2109875 2076829 2095338 2047672 1996923 2082171 2175569 2179320 2089805 2103557
19623 2103557 2103782 2081419 2099435 2119119 2102746 2103862 2139490 2149982 2145086 2100203 2059906 2035157
19611 2035157 2032695 2067623 2036000 2010865 1949872 1967967 1975256 2030910 2042331 2159262 2186775
19600 2186775 2164183 2146765 2124824 2104235 2091574 2100770 2050929 2047965 2100811 2088123 2071068 2063564
19588 2063564 2048151 2047893 2035763 2032978 2072185 2085502 2124453 2161491 2138627 2068498 2062939 2061455
19576 2061455 2049912 2055436 2133518 2166056 2152802 2148622 2150392 2080911 2075917 2080068 2112831 2132384
19564 2132384 2143312 2105087 2086550 2075998 2118978 2159007 2208113 2238166 2247858 2220851 2180650
19553 2180650 2185892 2200276 2193506 2173903 2186361 2204233 2197662 2176830 2163561 2150951 2182040 2172259
19541 2172259 2151843 2198644 2250882 2271533 2251786 2198502 2118952 2043267 2061717 2089260 2166445
19530 2166445 2243261 2233205 2264058 2315324 2353589 2332979 2326756 2332523 2273853 2247816 2260976 2206601
19518 2206601 2169839 2165779 2173406 2238604 2297385 2285771 2217869 2166653 2184018 2243893 2295585 2228576
19506 2228576 2227244 2256062 2253730 2277836 2311134 2323824 2304632 2346212 2337275 2293618 2323577 2357690
19494 2357690 2279191 2221290 2201968 2233390 2267737 2327643 2399193 2382533 2288284 2243478 2271991
19483 2271991 2292483 2316701 2328628 2384307 2446300 2428124 2387604 2289421 2259418 2263209 2299297
19472 2299297 2302607 2348546 2339173 2357751 2389900 2383148 2372306 2376763 2363604 2326311 2333857 2341858
19460 2341858 2313445 2291907 2327625 2337277 2355441 2403497 2400242 2391280 2411064 2432062 2365573 2323764
19448 2323764 2352483 2306835 2288491 2280157 2347777 2409962 2371626 2368340 2331126 2328750 2334082 2342716
19436 2342716 2368159 2302897 2311219 2381515 2408455 2389467 2356122 2390198 2458583 2458533 2345721 2297677
19424 2297677 2302931 2366567 2374284 2361776 2346057 2343241 2315421 2304206 2287560 2277833 2316971 2348321
19412 2348321 2368387 2374002 2390712 2300513 2298115 2361483 2407218 2412582 2414205 2408268 2364123 2387374
19400 2387374 2373484 2394253 2379616 2376597 2351111 2313311 2360742 2380868 2346333 2372206 2381707 2420659
19388 2420659 2456386 2417547 2384379 2384190 2372213 2417690 2364242 2361693 2417111 2445006 2447070 2411963
19376 2411963 2381885 2446474 2440452 2419873 2470996 2433779 2429965 2479108 2480084 2469721 2434175 2413942
19364 2413942 2517607 2547419 2508499 2511022 2501213 2509549 2504905 2525639 2546201 2507156 2500307 2554874
19352 2554874 2581475 2531806 2508165 2490178 2539655 2574172 2578181 2559178 2526736 2496708 2455506
19341 2455506 2438774 2462868 2499105 2519521 2539465 2547388 2539702 2499177 2484786 2518541 2537480 2564408
19329 2564408 2550705 2512737 2469782 2469061 2434751 2455242 2487216 2512194 2511510 2514476 2511575 2514220 2541457
19316 2541457 2584383 2586433 2600021 2614993 2594398 2617339 2633847 2648296 2628446 2596157 2616319
19305 2616319 2585148 2591037 2623958 2636463 2599853 2617336 2604203 2590096 2586591 2606239 2631428 2657371
19293 2657371 2640531 2677697 2718391 2680236 2612477 2578089 2526354 2514274 2527790 2464969 2417756
19282 2417756 2517981 2592918 2579481 2540105 2583049 2616820 2636245 2717218 2703983 2752164 2797466
19271 2797466 2756373 2642626 2596650 2621950 2622388 2653149 2702235 2702341 2704241 2681682 2631496 2616174
19259 2616174 2609090 2689029 2748950 2754947 2793391 2764288 2685668 2672297 2663951 2668753 2708972 2697639
19247 2697639 2648789 2660268 2672864 2638138 2631422 2634132 2734011 2767133 2742412 2695635 2773019 2779486
19235 2779486 2739310 2725426 2794114 2827573 2864564 2843878 2795836 2765212 2754281 2756857 2757142 2820398
19223 2820398 2848585 2843314 2845479 2825231 2745239 2704497 2754339 2778373 2771476 2769774 2767570 2804058
19211 2804058 2808402 2771573 2784661 2756799 2725454 2774794 2809370 2781431 2761850 2799155 2893489
19200 2893489 2964844 3006774 2918411 2856148 2865700 2907544 2905250 2895654 2873624 2894968 2956505 2967243
19188 2967243 3009712 2975243 2989358 2909719 2808018 2838391 2883350 2874321 2929088 2951979 2957949
19177 2957949 2923479 2893140 2948807 2946853 2953615 2940829 2953938 2944766 2909601 2923141 2927035 2986934
19165 2986934 2991893 2990076 2986538 2909495 2895014 2945561 2953307 2936429 2952647 2984307 3018946 2979146
19153 2979146 2932013 2940931 3032093 3054798 2976774 2972342 2993615 2998942 2961662 2963378 2956631 3052087
19141 3052087 3088682 3102550 3108953 3064857 3068183 3073170 3040214 3089215 3021531 2939719 2965312 3027469
19129 3027469 3057581 3061465 3066865 3056683 3141326 3110599 3085301 3089233 3122734 3145451 3160476 3148578
19117 3148578 3137359 3124438 3224484 3250868 3266621 3251667 3188323 3148767 3175781 3181147 3144596
19106 3144596 3126494 3181759 3255908 3272334 3250920 3262069 3244082 3221317 3234592 3280821 3350355
19095 3350355 3321456 3310609 3371893 3387847 3393512 3353755 3267068 3214269 3149980 3176197 3197598
19084 3197598 3268783 3303543 3319418 3243484 3131037 3060482 3085286 3091233 3049616 3092745 3125527
19073 3125527 3197935 3251036 3217469 3218024 3230510 3222641 3232370 3242824 3224249 3255946 3387593 3439536
19061 3439536 3425813 3417047 3442635 3438073 3412525 3382432 3337298 3320377 3395433 3397619 3298582 3252265
19049 3252265 3190696 3122627 3088812 3103019 3063898 3092281 3071500 3067660 3155251 3195182 3166693
19038 3166693 3193101 3207042 3210824 3185749 3149118 3141265 3167259 3200973 3180021 3196358 3232209 3234230
19026 3234230 3256438 3221217 3267231 3355093 3357013 3293489 3229751 3224821 3263519 3304133 3311362 3285421
19014 3285421 3337191 3408464 3317614 3262979 3310795 3335045 3325103 3333390 3297240 3285911 3352764 3411736
19002 3411736 3367178 3331203 3364415 3380557 3438267 3468121 3447472 3445478 3493565 3521188 3497518
18991 3497518 3504481 3507190 3495620 3509448 3520856 3524355 3523750 3528617 3536412 3569757 3529561 3470026 3433896
18978 3433896 3426656 3448903 3476454 3516687 3488288 3478295 3496001 3523870 3533172 3540986 3467739 3398711
18966 3398711 3458883 3484421 3540179 3514060 3472522 3455199 3468054 3599203 3638228 3613814 3617576
18955 3617576 3615106 3621009 3602761 3621169 3668589 3720817 3779615 3801962 3753933 3692734 3667273 3698590
18943 3698590 3731434 3746063 3699591 3621904 3647117 3620784 3613801 3647047 3628340 3620579 3652228 3670304
18931 3670304 3668539 3719101 3675907 3677885 3758574 3754513 3695324 3749695 3831545 3838573 3819412 3847629
18919 3847629 3876593 3873177 3870195 3908905 3897097 3898017 3866944 3875157 3885192 3865637 3782838 3804825
18907 3804825 3813393 3816244 3791620 3821775 3811069 3812840 3906147 3979617 3990205 4005137 4069330 4112428
18895 4112428 4100818 4056475 4058549 3991961 3932203 3936017 3949394 3991385 4000191 3975788 3959135 3930040
18883 3930040 3983039 4038465 4059522 4012712 4042290 4136415 4200240 4147694 4099419 4097023 4097295 4056767
18871 4056767 4040263 4096815 4117675 4073900 4087936 4153306 4157913 4207204 4229197 4212539 4198483
18860 4198483 4193766 4209636 4286463 4278082 4221157 4206684 4218837 4239114 4210918 4251681 4245859 4234634
18848 4234634 4225618 4204629 4225983 4258786 4271129 4266721 4301343 4333903 4348909 4320612 4394491 4442422
18836 4442422 4459049 4416659 4403153 4441921 4439832 4377904 4334549 4342717 4383460 4452870 4496671 4525492
18824 4525492 4507553 4496300 4523135 4522887 4524851 4544036 4520919 4476044 4485500 4456591 4437543 4491429
18812 4491429 4539183 4528001 4530496 4566419 4604259 4664006 4656956 4653168 4690162 4703231 4731299 4776244
18800 4776244 4754979 4717165 4715562 4747338 4677498 4675312 4713702 4723666 4686640 4662274 4665859 4693301
18788 4693301 4737557 4673058 4624104 4636643 4705333 4782253 4842532 4823104 4857872 4909677 4952700
18777 4952700 4973743 4997430 4964408 4973482 5021051 5038442 5065939 5122008 5151566 5148403 5280215
18766 5280215 5393488 5391858 5325157 5156066 4952751 4840022 4824450 4761769 4774250 4799739 4824931
18755 4824931 4834377 4884488 4960790 4952159 4958560 4948623 4957571 5021428 5076483 5095651 5101799 5048254
18743 5048254 5095643 5110784 5121008 5117965 5102088 5125436 5119586 5126317 5242941 5336423 5331712 5354210
18731 5354210 5342418 5330016 5282459 5273611 5329121 5341889 5355389 5361257 5336108 5330945 5357904 5422269
18719 5422269 5431899 5458408 5469712 5513365 5498028 5514589 5536929 5498658 5485551 5493286 5540203 5580933
18707 5580933 5547335 5537076 5531667 5513804 5612318 5657123 5620288 5677598 5693086 5725705 5743467
18696 5743467 5725619 5773672 5752796 5738121 5767965 5826887 5834864 5901397 5913106 5967739 5992983
18685 5992983 6005853 5916949 5884957 5880110 5953387 5985996 6018132 6008853 6023132 6046945 6103714 6085254
18673 6085254 6139739 6139945 6159566 6264050 6285828 6247600 6236936 6209539 6254544 6327581 6409134
18662 6409134 6400410 6441592 6427644 6405983 6417666 6492290 6484414 6493538 6553213 6533868 6505885 6582431
18650 6582431 6676034 6705332 6750768 6789898 6795039 6783134 6813701 6858549 6955375 6975760 6970754 6964610
18638 6964610 7007391 7096669 7104999 7123789 7167754 7156378 7165378 7193102 7278276 7382031 7359268
18627 7359268 7381980 7389902 7429929 7499137 7522082 7493468 7613123 7666255 7723986 7769285 7798297
18616 7798297 7838004 7860254 7861501 7996095 8071317 8071560 8090158 8062160 8077334 8107318 8156474 8208806
18604 8208806 8257619 8343719 8333236 8205929 8072913 8108043 8194586 8257286 8288926 8333893 8401955
18593 8401955 8498659 8534897 8633153 8737315 8807743 8860239 8828816 8828126 8773445 8814257 8924426
18582 8924426 9040715 9093730 9064942 9030760 9032244 9161901 9290513 9347079 9332681 9398065 9506477
18571 9506477 9602655 9676849 9751207 9843669 9928742 10009567 10107651 10164789 10220666 10303949 10431590
18560 10431590 10525764 10626357 10778578 10931691 11017314 11108538 11171240 11219609 11338731 11514391
18550 11514391 11636054 11767231 11938264 12082200 12210386 12341780 12454641 12605583 12809184
18541 12809184 12956414 13100233 13323929 13547447 13723613 13898374 14083335 14356872 14649227
18532 14649227 14897705 15133463 15395022 15543445 15745069 15982272 16333392 16675662 17021496
18523 17021496 17364104 17704409 18093083 18525161 18941195 19451696 19970854 20593945 21293376
18514 21293376 22109236 22965996 23925367 24969396 26078653 27364243 28999742 31007035
18506 31007035 33363890 36196784 39644528 43931099 48289844 48291379 38611062 23688082
18498 23688082 13321825 11968095 15260727 20394437 25023034 22705049 10095671 -5548309
18490 -5548309 -13861474 -14278579 -11893439 -9025722 -6406484 -4121170 -2031011 135679
18482 135679 2435599 4542210 6475235 8279728 10133715 12145030 14603756 17378678
18474 17378678 20453105 24031842 28143939 33121346 38620680 41003750 33498804 18189669
18466 18189669 5318181 2144591 4005764 7106753 10424608 9297071 -2344596 -19404590
18458 -19404590 -30926526 -33520219 -33387278 -33152257 -32057113 -29656443 -26993158 -24719910
18450 -24719910 -22824285 -21263678 -19799261 -18300825 -16928931 -15673414 -14433921 -13138468
18442 -13138468 -11977682 -10945968 -9984850 -8967081 -7857736 -6726048 -5647881 -4435667
18434 -4435667 -3042221 -1948918 -2152324 -4067903 -6348324 -7378695 -6971202 -5978953 -5101264
18425 -5101264 -4888740 -6208826 -8747800 -10989144 -11687422 -11414067 -10960532 -10672676 -10333217
18416 -10333217 -9786351 -9129013 -8564549 -8090868 -7722337 -7351751 -6975398 -6648130 -6366567
18407 -6366567 -6033005 -5672411 -5311943 -5044161 -4937441 -4797755 -4610369 -4361686 -4144126
18398 -4144126 -3906230 -3731223 -3542756 -3365529 -3191949 -3040905 -2959405 -2875214 -2762420 -2586315
18388 -2586315 -2360092 -2214371 -2088124 -2014737 -1958883 -1839773 -1742431 -1681816 -1584569 -1419091
18378 -1419091 -1266843 -1198832 -1118533 -1022986 -876688 -717491 -671403 -684565 -634733 -524544
18368 -524544 -425057 -313697 -248644 -123728 27196 113216 165385 224948 295807 351040 447769
18357 447769 564982 637748 658435 674023 717397 733352 756432 866595 976029 1031340 1078605
18346 1078605 1168252 1201440 1224234 1286158 1348953 1413140 1519338 1552759 1567534 1620845 1728937
18335 1728937 1780969 1836098 1924544 1947396 2012392 2058313 2092555 2171180 2212017 2249921 2385050
18324 2385050 2491372 2532536 2560086 2595817 2658782 2712633 2766660 2872234 2948538 3042490 3030057
18313 3030057 3113876 3184913 3273344 3384894 3500727 3604694 3599507 3631871 3543982 3267211 3082349
18302 3082349 2962486 2960448 3007595 3060432 3130760 3206553 3295560 3382383 3449778 3463832 3504792
18291 3504792 3673624 3791969 3821261 3885108 3917506 3934389 4056104 4091547 4144447 4214387 4244412
18280 4244412 4323525 4378225 4429086 4480928 4538324 4630150 4695209 4732124 4798754 4837789 4829116
18269 4829116 4823748 4816593 4875539 4964227 5040535 5110348 5169797 5210676 5255621 5303096 5353730 5321660
18257 5321660 5322943 5394090 5466420 5505716 5597603 5698986 5699688 5691575 5762819 5882367 5977246 6074790
18245 6074790 6101486 6131883 6158668 6216852 6240411 6271477 6340783 6455061 6583266 6639013 6675178
18234 6675178 6745421 6825399 6848830 6818497 6801984 6827233 6912524 6936254 7044166 7160081 7130108
18223 7130108 7058100 7115608 7239179 7392363 7498025 7521819 7601349 7656354 7717514 7830241
18213 7830241 7949548 7986411 8005263 8081491 8105864 8135879 8178497 8224229 8344016 8445958 8545923
18202 8545923 8605242 8615349 8625722 8664226 8711692 8752457 8835078 8940470 9017217 9158976 9252604
18191 9252604 9349505 9530204 9611584 9690208 9790473 9893344 10010720 10105811 10155503 10287082
18181 10287082 10430176 10543672 10661824 10822708 10888967 11002978 11194363 11349812 11460194
18172 11460194 11556107 11663378 11796572 11976379 12144926 12269231 12378466 12481044 12705699
18163 12705699 12922714 13008673 13150118 13339681 13471356 13670826 13872965 14039861 14261344
18154 14261344 14433790 14596057 14732679 14904673 15096914 15415076 15705129 15990530 16255328
18145 16255328 16477009 16721509 16956607 17315816 17683412 18004898 18336784 18659944 19012242
18136 19012242 19375491 19730073 20133311 20600826 21032956 21492594 21976740 22507343 23126023
18127 23126023 23771628 24425332 25165055 25927308 26757562 27702103 28745595 29999191 31390939
18118 31390939 32881620 34672148 36553911 38538157 41151655 44463724 48210724 53035500
18110 53035500 59336787 67244391 77315288 85580636 73507247 35088576 -7784806
18103 -7784806 -28568224 -29657708 -25214628 -20098471 -14844698 -9850898 -5722892 -2015083
18095 -2015083 1393504 4393928 7214432 9958519 12868613 16026366 19549424 23596786
18087 23596786 28239720 33111045 36348811 33683071 24549576 15146040 11679929 13593325
18079 13593325 17093631 20179112 20516173 14344094 3235824 -5617075 -7674019 -5698505
18071 -5698505 -3464056 -1618176 927657 4678056 9170074 14254523 20016676 26540559
18063 26540559 33563036 37879165 32467903 16528302 -2807 -7097265 -5565726 -1613262
18055 -1613262 1710608 983465 -8705270 -25272723 -38879530 -43312796 -42297232 -40820145
18047 -40820145 -39985138 -38623229 -36264148 -33548516 -30882106 -28670637 -26853777 -25193070
18039 -25193070 -23508644 -21864755 -20378754 -19062236 -17894628 -17027115 -16249979 -15380662
18031 -15380662 -14511723 -13603306 -12704005 -11870189 -11031193 -10198520 -9431644 -8645866 -7844035
18022 -7844035 -7097142 -6385787 -5734513 -5190099 -4605731 -3949383 -3296972 -2660572 -2048321
18013 -2048321 -1502024 -856705 -133435 686045 1449710 2147420 2798481 3387078 4027198
18004 4027198 4723905 5550021 6589740 7786492 9047132 10483374 11997713 13594365
17996 13594365 15577025 17944233 20682197 24015365 28133502 33238044 38602806 38779822
17988 38779822 24989061 1929087 -16854741 -23050359 -22380930 -19726395 -16602699 -13318833
17980 -13318833 -10176851 -7267082 -4429475 -1713128 996160 3773610 6537926 8850920
17972 8850920 9426803 8492965 8034084 9608299 12997038 17273805 18870126 12105952 -228371
17963 -228371 -9782703 -11209475 -7873866 -2712982 3429127 10053072 13671942 6380375
17955 6380375 -10852692 -27553880 -34064967 -33217798 -30159860 -27023960 -25006326 -24259974
17947 -24259974 -23760911 -22493829 -20458701 -18011009 -15366286 -12575446 -9942468 -8621450
17939 -8621450 -8936537 -9481388 -8726626 -6381903 -3009422 -1087975 -6472457 -18757291
17931 -18757291 -30681236 -35405853 -34962865 -33058728 -30841111 -28592412 -26456032 -24640855
17923 -24640855 -23018993 -21551243 -20220539 -18785789 -17413786 -16311849 -16249499 -17573001
17915 -17573001 -19269182 -20198882 -20361425 -20067790 -19449378 -18689376 -17854602 -17190369 -16572374
17906 -16572374 -15967528 -15441771 -14948169 -14460293 -13997931 -13581151 -13264863 -12995021 -12798342
17897 -12798342 -12660879 -12457093 -12157988 -11869143 -11637523 -11357548 -11091572 -10929376 -10805564
17888 -10805564 -10669074 -10422387 -10139229 -9964210 -9808830 -9535013 -9289375 -9088413 -8882922
17879 -8882922 -8639629 -8407384 -8245465 -8023447 -7807773 -7621327 -7574750 -7443519 -7248942 -7038322
17869 -7038322 -6804251 -6571452 -6418266 -6312348 -6230053 -6102951 -5984820 -5860815 -5661070 -5428499
17859 -5428499 -5300307 -5209571 -5039192 -4924452 -4792314 -4644027 -4508126 -4311783 -4187621 -4069801
17849 -4069801 -3899618 -3711721 -3535310 -3285267 -3118924 -2930914 -2722590 -2520057 -2234106
17840 -2234106 -1873588 -1641109 -1613993 -1693588 -1742891 -1616589 -1428252 -1232741 -1014665 -761155
17830 -761155 -526075 -229359 100003 473247 842005 1216844 1673684 2167330 2701741 3290869
17820 3290869 3977922 4848227 5822378 6995181 8434626 10196261 12338466 14686330 16025321
17811 16025321 13449325 5579804 -4821347 -12795265 -16067438 -16175175 -15108739 -13779364
17803 -13779364 -12394853 -11072400 -9910919 -8941013 -8168843 -7475953 -6838049 -6285362 -5792242
17794 -5792242 -5297392 -4849374 -4452372 -4103584 -3794720 -3483861 -3167309 -2842923 -2465164
17785 -2465164 -2077660 -1821656 -1632370 -1450068 -1162637 -847227 -531133 -217232 99903
17776 99903 443514 790278 1152030 1487463 1855176 2189479 2538526 2921750 3240191 3607975
17766 3607975 4011038 4428221 4857800 5283562 5732471 6228421 6788581 7364365 7938332
17757 7938332 8538047 9295240 10085677 10817425 11489294 12043034 12645216 13393045 14345827
17748 14345827 15406750 16568182 17963083 19666684 21610007 23722056 26078192 28727458
17740 28727458 31680958 35231864 39587233 45021659 51764599 60263629 70742418 82590401
17732 82590401 91441611 86471235 56787501 6351862 -44036687 -75551295 -86168447
17725 -86168447 -84792369 -79030869 -72063131 -65342534 -59385652 -54415012 -50199209 -46668410
17717 -46668410 -43829409 -41518802 -39541890 -37623212 -35824158 -34179653 -32632016 -31205898
17709 -31205898 -29855791 -28669700 -27512564 -26362344 -25418175 -24757532 -24245575 -23769823 -23247205
17700 -23247205 -22710044 -22165075 -21647408 -21106716 -20563430 -20066518 -19613119 -19214258 -18786124
17691 -18786124 -18417763 -18049974 -17652492 -17308843 -16959318 -16647630 -16383228 -16086443 -15754589
17682 -15754589 -15457745 -15177733 -14984863 -14773537 -14517529 -14273593 -14031964 -13818070 -13646014
17673 -13646014 -13439097 -13238694 -13026781 -12841832 -12670630 -12442949 -12213519 -12069765 -11843615
17664 -11843615 -11581599 -11407266 -11218764 -11021743 -10874175 -10684194 -10467784 -10159158 -9843687
17655 -9843687 -9604925 -9346991 -8942220 -8505741 -8138068 -7910912 -8111885 -9055030 -10497759
17646 -10497759 -11695978 -12349747 -12510801 -12339576 -12121691 -11875842 -11619916 -11353799 -11158215
17637 -11158215 -11021231 -10815306 -10653729 -10518189 -10422093 -10305118 -10181373 -10032099 -9883030
17628 -9883030 -9756902 -9680652 -9643983 -9600223 -9500387 -9422357 -9314089 -9270939 -9166151 -9065603
17618 -9065603 -8913577 -8848169 -8784494 -8774071 -8727196 -8642659 -8611940 -8600690 -8529957 -8473337 -8481463
17607 -8481463 -8372185 -8297595 -8198371 -8130469 -8144679 -8080357 -8055479 -8017272 -7966985 -7935834 -7868450
17596 -7868450 -7784951 -7762610 -7693340 -7634092 -7546703 -7542526 -7568047 -7592889 -7584623 -7492139 -7432355 -7378199
17584 -7378199 -7336325 -7290849 -7240913 -7190284 -7131331 -7075070 -7091446 -7055263 -7025336 -6990030 -6976712
17573 -6976712 -6973177 -6919442 -6939334 -6933658 -6899516 -6851791 -6729357 -6567005 -6477468 -6482359 -6503498
17562 -6503498 -6524991 -6493186 -6432812 -6368448 -6386268 -6419049 -6446507 -6389811 -6312869 -6250983 -6202596
17551 -6202596 -6155854 -6140674 -6076734 -6036656 -6005209 -6058880 -6045330 -6076042 -6122530 -6161256 -6194202
17540 -6194202 -6204212 -6148407 -6151109 -6163308 -6174398 -6141061 -6141188 -6043280 -5920925 -5842853 -5827514 -5791300
17528 -5791300 -5704543 -5689782 -5659577 -5695700 -5774573 -5738909 -5723942 -5682906 -5690525 -5713132 -5758656
17517 -5758656 -5753507 -5845779 -5910777 -5865193 -5799128 -5764943 -5710086 -5694666 -5705130 -5650506 -5559192
17506 -5559192 -5538466 -5554875 -5550704 -5516588 -5445271 -5396289 -5360352 -5368048 -5383900 -5404234 -5367657 -5348867
17494 -5348867 -5350004 -5382204 -5357291 -5361613 -5269201 -5168889 -5082141 -5091396 -5123761 -5108533 -5070635 -5026745
17482 -5026745 -4967207 -5001159 -4968204 -4971244 -4946168 -4938570 -4922310 -4904833 -4934793 -4895810 -4878462 -4839100
17470 -4839100 -4786983 -4715786 -4746845 -4739225 -4730670 -4718475 -4703944 -4713235 -4760241 -4735091 -4675870 -4570609
17458 -4570609 -4612917 -4601524 -4557418 -4481652 -4404646 -4358680 -4297712 -4292226 -4299093 -4412751 -4497690
17447 -4497690 -4499511 -4475709 -4409766 -4456921 -4410108 -4277651 -4189170 -4213295 -4374698 -4555765 -4703197
17436 -4703197 -4749782 -4726572 -4687177 -4642704 -4574995 -4534245 -4451988 -4372256 -4288770 -4313499 -4373205
17425 -4373205 -4468035 -4516457 -4512713 -4447618 -4429626 -4402914 -4344835 -4285180 -4242985 -4303103 -4311962 -4369123
17413 -4369123 -4436400 -4438128 -4346872 -4325432 -4352028 -4301084 -4223566 -4170224 -4189119 -4156703 -4141162
17402 -4141162 -4178163 -4179548 -4157269 -4134025 -4110570 -4079990 -3989014 -3897370 -3918035 -4005037 -4092956
17391 -4092956 -4111115 -4137451 -4174133 -4209024 -4201469 -4207240 -4210643 -4179026 -4151404 -4127478 -4062845 -4017209
17379 -4017209 -4030255 -3997344 -3983103 -3973765 -3977783 -3976779 -3978858 -3956060 -3943337 -3947360 -3906967 -3906835 -3892824
17366 -3892824 -3806265 -3776369 -3806187 -3806780 -3818092 -3759340 -3730170 -3715439 -3721379 -3732065 -3717656 -3737343
17354 -3737343 -3749984 -3827777 -3902582 -3858722 -3809651 -3813970 -3885008 -3891162 -3850943 -3790585 -3781306 -3716340
17342 -3716340 -3631323 -3619788 -3634752 -3627934 -3597567 -3615319 -3680327 -3695426 -3705455 -3700836 -3600217
17331 -3600217 -3625093 -3694762 -3697601 -3691831 -3695474 -3716362 -3687780 -3599601 -3576359 -3595772 -3608649 -3601832
17319 -3601832 -3529379 -3486357 -3476743 -3436544 -3473016 -3462281 -3435042 -3482921 -3498058 -3440219 -3421940
17308 -3421940 -3423462 -3458731 -3433615 -3436613 -3445157 -3482491 -3467340 -3446803 -3393365 -3372876 -3368356 -3428677
17296 -3428677 -3446169 -3393163 -3337826 -3303438 -3317245 -3235361 -3183740 -3200631 -3202033 -3193746 -3127965 -3186013
17284 -3186013 -3196186 -3188999 -3179276 -3166976 -3236192 -3283792 -3279549 -3295210 -3293757 -3225932 -3202588 -3168785
17272 -3168785 -3199150 -3148885 -3116621 -3134295 -3130682 -3143168 -3138702 -3170337 -3176069 -3137545 -3136340 -3119752
17260 -3119752 -3089073 -3149777 -3196478 -3087987 -3050722 -3067282 -3050801 -3027144 -2966951 -2981904 -3034797
17249 -3034797 -3055577 -3053378 -3070902 -3033047 -3019687 -3049389 -3008516 -2947328 -2956775 -2984649 -2969379 -2951772
17237 -2951772 -2960505 -2923113 -2881685 -2840179 -2845172 -2887858 -2923396 -2924405 -2945000 -3028181 -3011266 -2994598
17225 -2994598 -2937328 -2909577 -2937987 -2877901 -2827765 -2821021 -2852675 -2853452 -2878369 -2892771 -2828474 -2793072
17213 -2793072 -2862206 -2907467 -2878376 -2881249 -2861952 -2858089 -2835742 -2782634 -2674973 -2696446 -2681191
17202 -2681191 -2681276 -2741979 -2791417 -2764107 -2793382 -2824201 -2804004 -2828013 -2824758 -2781271 -2758663 -2774944
17190 -2774944 -2799551 -2763182 -2703421 -2712404 -2734975 -2722476 -2751947 -2775954 -2764592 -2738423 -2684235
17179 -2684235 -2652654 -2679972 -2716850 -2746970 -2686788 -2632242 -2635855 -2542242 -2516129 -2592941 -2639422
17168 -2639422 -2618461 -2587900 -2535360 -2468615 -2498058 -2508425 -2493147 -2509482 -2494957 -2465590 -2458144
17157 -2458144 -2526561 -2428723 -2290498 -2233392 -2190949 -2181117 -2249276 -2191349 -2197184 -2445232 -2701377
17146 -2701377 -2830189 -2931215 -3001133 -2998812 -2960626 -2915405 -2885362 -2876948 -2841109 -2810958 -2830606
17135 -2830606 -2785240 -2730693 -2697430 -2643902 -2666274 -2660350 -2684193 -2668315 -2665613 -2676862 -2706903 -2707296
17123 -2707296 -2712702 -2694037 -2657425 -2623035 -2586375 -2584200 -2594992 -2594510 -2566774 -2527126 -2507461 -2482408
17111 -2482408 -2471327 -2489172 -2538015 -2493984 -2462579 -2490325 -2547830 -2497876 -2400184 -2405690 -2404488 -2366582
17099 -2366582 -2408015 -2384159 -2333733 -2364854 -2353360 -2385944 -2393437 -2378750 -2345397 -2349765 -2346187 -2382361
17087 -2382361 -2346770 -2291772 -2341428 -2335662 -2340525 -2385154 -2350190 -2313887 -2323171 -2349834 -2368166 -2361735
17075 -2361735 -2369131 -2365526 -2375534 -2359417 -2338293 -2301375 -2257122 -2242601 -2294855 -2305642 -2324152 -2348852
17063 -2348852 -2322718 -2342715 -2390848 -2347808 -2312572 -2345856 -2429745 -2405779 -2342884 -2241922 -2181921
17052 -2181921 -2233216 -2202148 -2170318 -2190624 -2170940 -2159393 -2158265 -2213258 -2236282 -2268401 -2242031
17041 -2242031 -2225701 -2188515 -2158549 -2195399 -2218670 -2174021 -2179456 -2265866 -2258818 -2210052 -2218639 -2173921
17029 -2173921 -2137242 -2135869 -2214399 -2238936 -2216479 -2189144 -2206174 -2235688 -2261972 -2286132 -2223614
17018 -2223614 -2124541 -2079380 -2049788 -2123673 -2181952 -2169027 -2137322 -2113455 -2058533 -2026978 -2025296
17007 -2025296 -2038843 -2048408 -2043591 -2105238 -2178309 -2208757 -2218682 -2166799 -2120243 -2111206 -2132736 -2073025
16995 -2073025 -2033504 -2064697 -2116770 -2102328 -2062339 -2062058 -2040141 -2031309 -2012771 -2007850 -2027263 -2078858
16983 -2078858 -2053060 -2038032 -2050448 -2065630 -2039640 -2031345 -2018577 -2063921 -2028225 -1889818 -1930263
16972 -1930263 -1972038 -1945363 -1964998 -2009275 -2008441 -2004917 -2009114 -2002365 -2041061 -1992012 -1985719 -1955776
16960 -1955776 -1915849 -2002326 -2058854 -2047807 -2006713 -1969388 -1979074 -1971198 -1994432 -2011023 -1980183 -1976677
16948 -1976677 -1956940 -1908282 -1893186 -1826858 -1873971 -1909601 -1933455 -1892194 -1889193 -1908365 -1931878
16937 -1931878 -1952900 -1952115 -1941880 -1990319 -2032354 -2055567 -2029404 -1981919 -1968084 -1927507 -1906495 -1927632
16925 -1927632 -1903472 -1884991 -1888929 -1899719 -1914676 -1898372 -1871805 -1879537 -1869271 -1832127 -1828051 -1858950
16913 -1858950 -1855206 -1958611 -1988272 -1929858 -1945780 -1947875 -1912619 -1932658 -1914200 -1895048 -1872018
16902 -1872018 -1849851 -1814770 -1779697 -1818842 -1776605 -1776760 -1790504 -1813454 -1817213 -1814945 -1769180 -1737433
16890 -1737433 -1805077 -1837610 -1799839 -1749534 -1736690 -1698634 -1709542 -1755246 -1731768 -1652785 -1681000
16879 -1681000 -1737217 -1713908 -1675859 -1691110 -1752144 -1736034 -1744811 -1811371 -1883465 -1806905 -1771827
16868 -1771827 -1800726 -1818605 -1807506 -1689548 -1696894 -1733917 -1743204 -1748539 -1784490 -1768170 -1775504 -1763632
16856 -1763632 -1715838 -1645126 -1616578 -1673601 -1699046 -1711916 -1699995 -1692417 -1614724 -1586641 -1670596
16845 -1670596 -1682517 -1674179 -1659358 -1686554 -1721987 -1751871 -1742547 -1722534 -1786820 -1756190 -1715964 -1690134
16833 -1690134 -1632348 -1664398 -1700795 -1766527 -1762291 -1695285 -1619546 -1573455 -1610466 -1649987 -1684261
16822 -1684261 -1715550 -1652714 -1574959 -1499250 -1559178 -1627156 -1652832 -1656316 -1646787 -1642784 -1624454 -1659699
16810 -1659699 -1614964 -1600740 -1603783 -1609145 -1636879 -1677837 -1649809 -1582462 -1628955 -1741551 -1717000
16799 -1717000 -1706689 -1666282 -1548097 -1563645 -1652232 -1688319 -1632735 -1591257 -1632239 -1680194 -1658118
16788 -1658118 -1617132 -1654612 -1671469 -1673001 -1677643 -1620331 -1601399 -1657418 -1656993 -1639820 -1574374 -1494182
16776 -1494182 -1504728 -1480869 -1526066 -1529960 -1499473 -1439341 -1426271 -1432213 -1440902 -1468735 -1462644 -1460529
16764 -1460529 -1451505 -1484793 -1519007 -1545326 -1581617 -1599447 -1591366 -1569249 -1564236 -1598177 -1626138 -1617637
16752 -1617637 -1615462 -1582605 -1533815 -1534259 -1535036 -1550702 -1575075 -1534347 -1482311 -1401340 -1368411 -1435039
16740 -1435039 -1497704 -1489192 -1477435 -1444861 -1425446 -1454709 -1469754 -1420495 -1374052 -1429046 -1442237
16729 -1442237 -1440953 -1420631 -1439324 -1491127 -1528654 -1524609 -1495441 -1425760 -1365717 -1352391 -1407229 -1460345
16717 -1460345 -1462460 -1460392 -1439490 -1480362 -1475769 -1418529 -1362932 -1378005 -1409753 -1449213 -1474791 -1417161
16705 -1417161 -1413821 -1437662 -1425629 -1436757 -1404150 -1359575 -1344597 -1374966 -1404910 -1470765 -1455141
16694 -1455141 -1412867 -1360399 -1322274 -1369226 -1416658 -1465225 -1486242 -1494084 -1516664 -1563371 -1510698
16683 -1510698 -1465448 -1445573 -1375747 -1337621 -1301496 -1314685 -1333215 -1368239 -1412403 -1429164 -1455858
16672 -1455858 -1453493 -1450916 -1403442 -1416203 -1412831 -1381476 -1353577 -1312960 -1426550 -1413906 -1334926 -1313111
16660 -1313111 -1323437 -1348505 -1380791 -1409995 -1422363 -1403581 -1424104 -1425840 -1420458 -1352061 -1313061 -1313835
16648 -1313835 -1327601 -1352308 -1342985 -1325299 -1304167 -1304134 -1348928 -1372379 -1323874 -1296197 -1279177 -1278320
16636 -1278320 -1281597 -1325264 -1333527 -1324908 -1361594 -1401668 -1385370 -1378893 -1401836 -1463965 -1438237 -1383129
16624 -1383129 -1376117 -1356638 -1333121 -1293111 -1292201 -1332381 -1330196 -1285016 -1299664 -1346816 -1301800 -1281293
16612 -1281293 -1318687 -1236677 -1181266 -1235310 -1272325 -1286458 -1325425 -1375162 -1355807 -1353243 -1301950
16601 -1301950 -1273904 -1266676 -1251051 -1241052 -1243252 -1216252 -1207713 -1264810 -1292694 -1328794 -1311135 -1236357
16589 -1236357 -1235898 -1258129 -1278642 -1280849 -1290613 -1287178 -1291618 -1327458 -1336025 -1287142 -1237278 -1256097 -1310349
16576 -1310349 -1322451 -1328207 -1307955 -1308133 -1283572 -1323605 -1316521 -1215394 -1183512 -1181272 -1188374 -1168591
16564 -1168591 -1142180 -1133760 -1194360 -1229522 -1249807 -1254426 -1233969 -1210745 -1203218 -1197710 -1156029 -1157406
16552 -1157406 -1120880 -1142077 -1153849 -1188162 -1187283 -1216193 -1198431 -1157533 -1093347 -1078924 -1130416 -1159394
16540 -1159394 -1173609 -1157776 -1192861 -1214156 -1221454 -1187552 -1216561 -1187571 -1135096 -1093866 -1129668
16529 -1129668 -1159414 -1205639 -1176277 -1117963 -1138666 -1136094 -1138700 -1127424 -1121233 -1141648 -1113753 -1124957
16517 -1124957 -1127787 -1124128 -1153523 -1119157 -1145298 -1189990 -1189661 -1163363 -1119202 -1107636 -1072834 -1044531
16505 -1044531 -1061186 -1134084 -1158866 -1126700 -1113090 -1094521 -1120486 -1130780 -1179955 -1183037 -1193589
16494 -1193589 -1151633 -1124836 -1125521 -1097053 -1095880 -1101432 -1081779 -1098725 -1107636 -1142697 -1135024 -1204107
16482 -1204107 -1233200 -1185347 -1140282 -1150341 -1183407 -1151525 -1088058 -1055534 -1089294 -1099383 -1143410
16471 -1143410 -1137659 -1070172 -1052540 -1050298 -1049811 -1028976 -1056818 -1023965 -1059718 -1101185 -1053490 -1049374
16459 -1049374 -1051409 -1089737 -1085938 -1038324 -1071039 -1089279 -1123507 -1082005 -1056173 -1016641 -1017157 -1089618
16447 -1089618 -1098865 -1119355 -1131196 -1040549 -1024265 -1030199 -1063101 -1119873 -1112442 -1106693 -1107152 -1065771
16435 -1065771 -1045543 -1010087 -1017061 -1059205 -1120185 -1112861 -1071160 -1040932 -1025515 -1008495 -1060017 -1070991
16423 -1070991 -1003103 -971149 -959238 -952659 -1012234 -1088442 -1123501 -1033184 -995491 -1003181 -984521 -988405
16411 -988405 -1037914 -1045017 -1053812 -1008421 -963965 -965678 -999538 -990228 -951207 -943890 -995281 -1045674
16399 -1045674 -1033928 -1031926 -1013257 -1059741 -1066185 -1082726 -1081630 -1066317 -1057845 -1039057 -1032827 -1030657
16387 -1030657 -1047864 -1020569 -997998 -983767 -1022480 -1083882 -1067426 -1022033 -970271 -945750 -968370
16376 -968370 -983348 -1006633 -1013630 -1019350 -1023437 -955976 -955910 -1013093 -1035046 -1009454 -950541 -966511 -1010366
16363 -1010366 -1025016 -1005013 -973291 -1031693 -1063376 -953589 -940910 -945085 -895283 -893034 -865701
16352 -865701 -870702 -914000 -946400 -936779 -916690 -888553 -866196 -895635 -925220 -989722 -996990 -1025014
16340 -1025014 -1035457 -1010647 -996917 -961739 -936976 -980879 -987870 -1006190 -981714 -955005 -967305
16329 -967305 -919377 -894049 -975079 -954942 -964266 -1010794 -1030139 -1011921 -980231 -929859 -932138 -919284
16317 -919284 -864217 -871455 -838120 -835275 -874318 -934807 -947393 -970477 -942216 -911558 -925965 -902962
16305 -902962 -903591 -945194 -960657 -958618 -956361 -988254 -975176 -910478 -932006 -991078 -953270 -875433
16293 -875433 -863400 -850425 -842880 -835016 -874920 -958380 -976843 -966511 -963938 -931247 -857441 -797914
16281 -797914 -813343 -878918 -976275 -1003794 -985578 -970056 -958676 -1019108 -996925 -923214 -894472
16270 -894472 -908881 -919413 -918656 -900777 -853587 -797414 -835374 -882891 -880299 -921256 -898628 -894749
16258 -894749 -829980 -764425 -748161 -739716 -745856 -732926 -745004 -793089 -807676 -743693 -748948 -749213
16246 -749213 -761546 -745371 -717834 -789071 -854832 -860446 -768322 -753836 -803431 -803525 -832460 -805903
16234 -805903 -825779 -816309 -778454 -731406 -716843 -730232 -785544 -782500 -761932 -798357 -808883 -833540
16222 -833540 -810513 -834405 -844254 -832405 -862546 -821351 -802789 -791416 -818473 -767229 -727476 -713971
16210 -713971 -652283 -618495 -643277 -697516 -739257 -712278 -671961 -681165 -706042 -736471 -810540 -821269
16198 -821269 -806388 -833549 -815293 -816827 -752014 -762057 -782244 -799527 -763177 -824417 -843511 -820330
16186 -820330 -804861 -719789 -617264 -635181 -690824 -767228 -831320 -828146 -837068 -859316 -799268 -776761
16174 -776761 -807476 -784799 -795710 -776093 -766922 -782074 -741282 -716123 -741727 -759272 -760922 -767694
16162 -767694 -736829 -690235 -709691 -723785 -704905 -775385 -784110 -744248 -759912 -741708 -760119 -777651
16150 -777651 -783532 -741445 -720066 -689442 -716799 -727552 -711299 -745282 -725604 -751525 -776682 -776370
16138 -776370 -766457 -745163 -735953 -774100 -744007 -664451 -642241 -657862 -694421 -725986 -690444 -649812
16126 -649812 -636543 -651466 -690195 -705869 -770495 -803029 -785187 -777664 -757505 -746507 -711728 -667731
16114 -667731 -609633 -596437 -613915 -635444 -689525 -717047 -703823 -674662 -657625 -658787 -648329 -654935
16102 -654935 -688917 -703824 -670129 -690109 -692024 -674522 -633825 -661338 -652413 -660349 -641315 -582587
16090 -582587 -628909 -664757 -694269 -703098 -641390 -622343 -609115 -656110 -711321 -784436 -726528 -702080
16078 -702080 -684868 -712551 -784234 -792967 -750140 -727941 -720851 -682174 -689883 -714641 -645501 -641997
16066 -641997 -662516 -644750 -607461 -625847 -623490 -607170 -670164 -678018 -711833 -728623 -715656 -716153
16054 -716153 -674791 -702320 -718678 -698824 -721324 -713702 -694389 -652719 -630081 -630859 -666737 -625302
16042 -625302 -590600 -622435 -654560 -657997 -640603 -630380 -625612 -656409 -713807 -707129 -674827 -664280
16030 -664280 -637475 -646013 -699539 -746134 -780294 -771807 -727745 -695580 -639421 -647389 -662885 -634144
16018 -634144 -624440 -582082 -586663 -615356 -604199 -582968 -603031 -635618 -618378 -537195 -477739 -491415
16006 -491415 -573980 -633161 -627326 -622467 -649782 -674400 -700637 -729955 -742973 -722210 -719586 -698424
15994 -698424 -746076 -773331 -718072 -701925 -654415 -658194 -663638 -623919 -597348 -599132 -568489 -541095
15982 -541095 -540115 -529988 -522309 -548002 -610710 -574517 -576925 -555563 -556888 -570233 -564463 -565065 -616672
15969 -616672 -542708 -499451 -531906 -546130 -621202 -605624 -575496 -529312 -564099 -570649 -617624 -543272
15957 -543272 -520936 -536440 -553785 -566282 -638981 -618740 -620765 -622595 -668195 -693313 -652175 -581016
15945 -581016 -611796 -601643 -519792 -515910 -571441 -549623 -505983 -482142 -493218 -542054 -477559 -443409
15933 -443409 -468413 -528704 -602944 -668372 -668008 -599250 -548813 -626021 -585905 -522008 -547243 -586701
15921 -586701 -639357 -646079 -605623 -560860 -551628 -441942 -402401 -442375 -467308 -478478 -483954 -533284
15909 -533284 -565459 -549679 -542505 -577522 -532940 -552461 -577625 -612571 -642797 -612715 -576893 -549578
15897 -549578 -552565 -563248 -598789 -621419 -599386 -556607 -544854 -503105 -477107 -537231 -576590 -529844
15885 -529844 -566687 -556842 -500913 -500224 -503692 -522744 -487915 -490376 -584914 -587130 -526352 -531739 -572589
15872 -572589 -615185 -617156 -616309 -583641 -573299 -574036 -555020 -528942 -496243 -456893 -494757 -504702 -424324
15859 -424324 -421522 -472193 -443009 -439483 -494398 -488726 -494451 -510680 -440844 -389666 -407303 -467701
15847 -467701 -442725 -463407 -480476 -449326 -420832 -509656 -540197 -563725 -569184 -546555 -534960 -570279
15835 -570279 -536896 -445718 -395033 -370801 -385787 -405889 -376647 -372010 -428525 -402265 -398659 -417952
15823 -417952 -455538 -440555 -375068 -307481 -391780 -419540 -403897 -401307 -433576 -464239 -523341 -572964
15811 -572964 -550315 -510388 -486493 -494769 -380033 -347932 -409817 -482422 -538121 -524775 -493394
15800 -493394 -494404 -479280 -458883 -421015 -397845 -406144 -440946 -462201 -497274 -447890 -435881 -400197
15788 -400197 -384485 -327919 -354955 -376436 -408614 -446016 -502578 -515138 -499022 -424808 -412755
15777 -412755 -411214 -411189 -422590 -415303 -385154 -388958 -379946 -344394 -426045 -542286 -534116 -422614 -411412
15764 -411412 -457240 -484160 -499296 -525812 -469524 -447998 -379462 -328072 -341662 -364082 -460140
15753 -460140 -443856 -363164 -342021 -388965 -385260 -338438 -323994 -314171 -283848 -401765 -412833 -352660
15741 -352660 -301673 -317518 -380753 -426022 -408457 -372707 -358549 -362095 -381228 -404037 -387144 -338177
15729 -338177 -348848 -407911 -356254 -355185 -373172 -401948 -394124 -379820 -437230 -360109 -261695 -305293
15717 -305293 -364356 -445891 -458715 -400546 -343555 -341894 -369266 -387836 -347944 -282960 -337423 -338751
15705 -338751 -299448 -356055 -379426 -334259 -289916 -262143 -358754 -425037 -381194 -327997 -293782
15694 -293782 -327036 -432180 -437039 -333436 -271977 -252660 -257751 -273199 -258781 -309275 -332778
15683 -332778 -343952 -378110 -334621 -244770 -269217 -333567 -320888 -344665 -376823 -377913 -380326 -400060
15671 -400060 -446290 -460355 -431648 -466043 -486015 -362208 -295097 -245779 -253068 -283221 -321899
15660 -321899 -349561 -347544 -342637 -358094 -369364 -338016 -287224 -250328 -239886 -246808 -259647 -345320
15648 -345320 -362706 -352683 -375305 -364223 -291478 -301023 -317665 -291756 -232115 -208721 -260335 -308981
15636 -308981 -345153 -353834 -380714 -344889 -252997 -234893 -246151 -218614 -256515 -269868 -303849 -301255
15624 -301255 -286968 -260112 -299360 -338434 -366128 -363139 -359364 -334439 -312401 -294163 -292243 -256809
15612 -256809 -305003 -309560 -259618 -217822 -226445 -297882 -298796 -297323 -240786 -214425 -227488 -252523
15600 -252523 -315087 -336067 -322614 -333691 -348336 -365211 -315832 -283904 -334741 -340714 -248080 -144311
15588 -144311 -155469 -210062 -182413 -195178 -224623 -265732 -258370 -204989 -236287 -273060 -287929 -265977
15576 -265977 -251095 -277909 -298997 -257237 -238910 -235962 -270824 -287885 -283519 -278153 -240680 -283366
15564 -283366 -347541 -326253 -252666 -255896 -270918 -290061 -310595 -343984 -347444 -353792 -368232 -301512
15552 -301512 -299661 -307010 -197198 -152331 -162583 -212466 -284122 -333131 -329792 -308422 -315974 -315773
15540 -315773 -341580 -341887 -337161 -352459 -384691 -390826 -416249 -366938 -334499 -346222 -343684 -308386
15528 -308386 -285851 -293919 -333965 -336435 -270886 -243603 -240533 -276992 -287206 -266174 -260393 -264544
15516 -264544 -223025 -218746 -237046 -246691 -281657 -224933 -179757 -165996 -170267 -141835 -185303 -179409
15504 -179409 -195653 -193546 -195118 -213869 -194290 -210140 -279232 -305896 -272808 -252353 -269095 -212971
15492 -212971 -168203 -164874 -201288 -190586 -194557 -210773 -172526 -161868 -222039 -240117 -166043 -149084
15480 -149084 -214340 -250998 -218662 -208228 -240026 -240129 -241622 -250544 -281894 -260704 -228192 -155945
15468 -155945 -117333 -158561 -162017 -192082 -174425 -156258 -174353 -167743 -179250 -171740 -187050 -193726
15456 -193726 -240531 -258973 -268711 -213183 -206840 -233260 -241205 -251007 -162564 -218349 -302565 -304750
15444 -304750 -242107 -256379 -194412 -174897 -181384 -146590 -144707 -142905 -105644 -133589 -142823 -200517
15432 -200517 -181855 -122133 -129584 -154812 -152585 -181331 -155287 -133246 -137248 -167651 -194725 -212187
15420 -212187 -228044 -174016 -149429 -162391 -192539 -219586 -204251 -158360 -116628 -137147 -158973
15409 -158973 -219834 -244876 -180654 -155782 -190826 -139432 -113454 -157830 -165142 -183669 -232417 -234703
15397 -234703 -224155 -164970 -192713 -201330 -163769 -156452 -150671 -133259 -185909 -217686 -246026 -266258
15385 -266258 -233175 -168967 -135272 -140750 -195420 -218314 -269790 -294780 -269902 -223504 -194623 -226118
15373 -226118 -253309 -218604 -228838 -170695 -137805 -128342 -158626 -140529 -72732 -96841 -181106 -103463
15361 -103463 -98515 -120789 -90462 -69456 -74669 -85109 -148987 -168182 -195973 -125102 -127946 -164804
15349 -164804 -194517 -126234 -73216 -97491 -10577 20509 34387 -37334 -86056 -124983 -111420
15338 -111420 -124100 -115986 -153577 -145705 -63473 -59275 -137512 -118972 -119636 -132235 -108305 -117003 -110363
15325 -110363 -150600 -126183 -120375 -142572 -81794 -31441 -68511 -122421 -151643 -153788 -162616 -129395
15313 -129395 -67960 -55709 -73436 -73894 -105635 -131141 -136299 -68045 -25176 17853 14314 -21692
15301 -21692 -61568 -83236 -36705 23667 2364 -60822 -90023 -45914 -109186 -77016 -73566 -102783
15289 -102783 -116462 -138325 -82991 -18843 -28844 -49093 -49766 -35869 -17630 -44904 -132807 -132877
15277 -132877 -108248 -126107 -72836 -41086 -62500 -27377 -15849 -103226 -125460 -113481 -67012
15266 -67012 -36141 -55980 -106450 -46753 47788 60116 65751 677 -15786 350 3679 37634
15254 37634 4793 62422 54560 -17241 -28689 -3014 -41614 -38926 9075 57646 75981 77391
15242 77391 95644 89878 21480 -3294 -726 61542 83255 12532 -63377 -103589 -72296 -31628
15230 -31628 -51720 -79913 -85592 -80651 -72782 -1768 39760 36005 -637 21476 -75042 -108944
15218 -108944 -157629 -153898 -147116 -133596 -68363 -47132 -26532 -1727 -4654 27015 61093 75439
15206 75439 78059 48468 28730 50908 5089 -14040 -34251 -35832 -18639 -37000 -96329 -94966
15194 -94966 -87471 -81511 -72235 -46598 -57755 -78837 -33754 -16385 39246 25575 -23790 240
15182 240 48336 11579 18479 59711 45927 32519 9099 -19972 -34796 -25580 -42468 -54916
15170 -54916 10412 32152 49993 85524 40816 -24386 -63438 -37431 23077 83487 85968 40340
15158 40340 3647 20476 8937 -16614 -19432 -36385 -19642 12505 29635 47638 96789 160750
15146 160750 180883 208595 158320 94668 -16628 -34665 36075 33307 -1089 27666 5874
15135 5874 13945 66099 79507 44897 14460 25459 56496 -1429 35415 97964 122549 138106
15123 138106 112333 93533 124173 140911 114807 144143 105325 45935 71498 146868 150881 88253
15111 88253 92056 50209 22456 60145 104429 44586 -6176 40631 40239 131783 136634 82165
15099 82165 42965 66950 83560 60546 88333 109262 50259 61620 54313 70700 107244 74265
15087 74265 40257 58090 101091 96614 91639 125398 130558 121882 113788 187041 213950 171223 133267
15074 133267 98303 51132 -8865 30805 47538 94855 95577 98352 104644 140002 117940 56442
15062 56442 30322 39562 34452 49516 64874 53739 57524 43136 27315 47100 122118 102204
15050 102204 87352 65173 50330 51477 95322 80998 94417 58508 59447 88534 131758 160629
15038 160629 147725 158143 139997 121259 69261 35772 104920 139328 166004 164262 117568 87160
15026 87160 142986 164293 176265 188751 120563 56746 149998 179557 107934 124438 178954 176357
15014 176357 140671 169402 171466 154910 96361 87585 131747 168296 145588 133951 175808 164561
15002 164561 137205 155324 178907 116112 46847 79294 130207 129879 106822 50668 35504 68728
14990 68728 129797 156330 252807 214048 134034 87757 79611 131020 125597 77083 124868 164822
14978 164822 124034 148117 190759 206657 190505 148952 167536 161671 156891 158311 175113 172192
14966 172192 165365 98346 42688 87020 105843 121108 195369 166461 149118 173998 150437 133342
14954 133342 178349 146433 141631 140885 139840 199613 208858 215228 221425 142194 125826 136137 145785
14941 145785 168254 206268 220024 219188 219863 177461 151538 167636 182495 172217 190524 148589
14929 148589 173539 255548 258934 236589 181822 152993 126733 125280 129628 95721 131154 182786
14917 182786 206589 220918 228159 235083 215142 155964 145530 155532 152483 169983 170768 149017
14905 149017 166708 203775 235888 307516 341274 364083 376169 310101 224799 150329 125201
14894 125201 180134 219667 212513 223609 184746 181749 176050 123375 138898 150803 195801 201784
14882 201784 224885 277216 296325 212623 256219 276085 276762 259028 218573 197141 204059 220629
14870 220629 284890 294917 240240 218750 232852 298734 310205 358231 306354 328163 317647
14859 317647 243004 237619 267215 272379 241852 268733 227908 273359 340319 253632 258002 259424
14847 259424 230306 273802 355408 345911 307987 292196 279823 300340 257330 188927 191226 220444
14835 220444 257362 262112 206214 179296 221076 232782 212254 215176 253477 319844 298521 290321
14823 290321 225600 230287 258205 334884 345828 340033 350117 370942 391607 337663 257286 209214
14811 209214 184541 206233 194403 216914 274757 258745 204982 260348 292227 293389 310818 337764
14799 337764 296090 298129 310406 377620 417301 367103 302091 270398 324069 342840 376554 345765
14787 345765 313003 308403 237269 217631 193649 216458 244303 214933 253111 306512 348425 312014
14775 312014 293402 218811 196064 199769 177936 231854 248803 256990 314505 343344 387202 374750
14763 374750 372205 271758 226715 258694 296026 275180 287712 286162 259330 204000 172733 225190
14751 225190 316441 358132 382759 348660 310306 349982 413079 379839 364405 348219 311144
14740 311144 298561 327985 340686 328996 391792 423818 489522 452233 453903 437835 381959 362153
14728 362153 417412 449755 444683 387887 414292 442949 446714 415681 335546 320985 315048 388652
14716 388652 373915 339170 302848 303465 308053 325363 403614 398552 392726 397182 398688 429493 476856
14703 476856 488106 389715 313257 289268 269045 278502 347683 392424 424707 390648 393939 350056
14691 350056 312287 266180 298491 351650 400474 437805 454325 436685 390302 426343 436089 436532
14679 436532 437487 437393 400294 377726 446629 506368 463311 411379 358311 306461 332065 356152
14667 356152 399143 422992 412163 362564 301133 316738 367339 407965 418519 477973 496073
14656 496073 471725 395359 435089 453877 406651 439387 489613 421541 370724 404596 460273
14645 460273 466752 434037 403503 417695 448789 450242 474540 472847 440996 427803 382969 412792
14633 412792 467999 490456 542327 593525 559710 537629 551421 542908 492550 470832 494199 521892
14621 521892 532804 513637 463211 441484 410332 415645 476448 536868 536234 573506 556496 544824
14609 544824 469711 452074 466321 487032 517597 505322 501928 518732 581129 569757 489014 481540
14597 481540 509633 573631 587511 519072 491106 477203 484738 480691 494362 512821 446587 479452
14585 479452 523377 520474 505224 472925 481374 513120 507344 505424 546945 552835 560459 529957 522090
14572 522090 428602 396268 401992 436645 436369 435455 453330 505052 498034 429190 401157 429886 522783
14559 522783 541548 487378 446105 447787 474623 461634 433584 474028 519404 512213 460503 408606
14547 408606 433682 448717 489548 502319 526694 555873 572737 558415 592920 554770 542659
14536 542659 565260 538428 494669 482838 520202 588604 631023 605481 603890 596141 547138 513909
14524 513909 512558 522050 544502 557771 541468 607554 627418 527964 468750 490722 541655 554324
14512 554324 602577 581677 550794 549820 570932 565689 568315 546318 529566 508065 534026 549719
14500 549719 571092 545888 535629 537541 543623 615044 577198 536142 496840 506967 573318 623406
14488 623406 651333 657030 639665 641484 612992 602029 633073 667937 681246 595687 609947 632565
14476 632565 645181 688779 611029 580980 527935 483965 501504 459791 433922 535903 640231
14465 640231 633438 658741 676924 604486 537773 547513 542185 565683 581384 582339 589920 608765 661940
14452 661940 658372 674933 691024 619428 561624 545920 563383 562595 486711 544557 611472 594391
14440 594391 541130 535333 619046 609401 650932 644674 626724 689161 694222 598247 527985 538951
14428 538951 640537 655467 644279 658861 623527 600350 634492 683316 747824 749769 663769
14417 663769 611983 675877 660754 634122 628679 699196 700389 619621 608589 661588 785299 761008
14405 761008 644428 625646 624199 682110 707204 696883 697856 679899 654308 638167 643610 676777
14393 676777 690900 728653 776018 763359 741047 720461 694702 744539 735448 702622 697290 756022
14381 756022 780827 790115 816771 794477 788487 764594 729012 717212 704333 659863 696805 765175
14369 765175 762611 666516 622848 621879 684411 767538 741094 682283 647318 635768 646878 689433
14357 689433 739115 793201 741581 702112 728463 727807 745277 742570 753896 754733 747701 746874 734343
14344 734343 774647 775952 802300 773676 809558 810105 798779 820862 823036 832027 816655 810553 795823
14331 795823 796873 856139 889855 857476 806888 817079 846486 912632 883410 857097 888653 838763
14319 838763 851933 801984 734266 695581 719138 707482 652292 643420 738257 794019 787211 773292
14307 773292 785602 812102 827065 889342 968851 910798 827647 848610 871806 828684 798810
14296 798810 776799 789223 832992 908063 858636 880704 974183 958562 905330 869149 876085 867051
14284 867051 861884 836571 810633 827214 903673 976912 963957 975479 956160 929419 930895 976652
14272 976652 981260 927841 851915 835342 873769 869815 808676 825595 845196 825505 808224 820723
14260 820723 895436 908875 890781 858775 878672 899278 931973 912368 901705 867205 867641 864120
14248 864120 853291 879359 862798 851463 816764 836769 889237 968583 941021 922863 945407
14237 945407 979404 939130 832860 845879 906938 949601 1016635 1025459 1007514 1020479 970607
14226 970607 889033 877124 889549 937665 932730 892730 958652 1008664 973465 962963 957257 979891
14214 979891 1014091 1023947 1011923 994432 993207 974715 994331 927324 847864 894284 921640 940008
14202 940008 942897 968032 968388 933199 943966 968821 965517 955196 872391 834481 853353 890249
14190 890249 899666 917814 954478 936099 1000045 1022859 1031204 939813 868160 855632 904382 973493
14178 973493 1013565 1060834 1047167 1040673 1031798 1066776 1073515 1050899 1056202 1059799 1022134 986583
14166 986583 1017385 1029461 1015728 1003338 998804 1046960 1027424 1028345 1048038 1000039 1000366 974996
14154 974996 972616 1040392 1064481 1054897 978324 1001878 1071535 1043317 956472 1004532 1086250 1153324
14142 1153324 1144431 1114024 1151365 1152328 1109735 1111922 1080785 1046250 1062778 1078402 1067594 1030271
14130 1030271 1075460 1067937 1082803 1126893 1099619 1068338 1079581 1057481 1039928 1030581 1065986 1141821
14118 1141821 1157445 1139733 1123047 1140530 1116004 1111974 1172658 1189549 1227985 1229127 1253164 1262139
14106 1262139 1183326 1146176 1160439 1162557 1149320 1215020 1201462 1206334 1232200 1193853 1213270 1235703
14094 1235703 1195151 1198173 1236991 1185870 1141835 1123516 1155813 1191565 1153037 1180763 1237149
14083 1237149 1234261 1201644 1279409 1256598 1214953 1248043 1289047 1261746 1229312 1224547 1184803 1179040
14071 1179040 1186743 1195953 1218240 1181204 1150338 1190264 1234792 1261228 1238244 1218927 1210783 1207481
14059 1207481 1215973 1239041 1274781 1253100 1260955 1296482 1329063 1296958 1233208 1277158 1294757 1279400
14047 1279400 1327712 1302562 1280484 1287652 1252672 1278717 1297871 1264859 1262062 1283340 1273530 1244047
14035 1244047 1257353 1310948 1369149 1349384 1314578 1343887 1282847 1234115 1265107 1318911 1389969
14024 1389969 1434319 1445566 1430390 1383355 1367352 1361919 1308762 1324744 1357810 1322388 1306291
14013 1306291 1330106 1323135 1374670 1409867 1429763 1380511 1336945 1336711 1336412 1350714 1410969 1448743
14001 1448743 1409635 1436551 1459126 1465036 1514111 1544777 1478631 1472225 1468746 1477622 1457784 1457662
13989 1457662 1468367 1418948 1445642 1481397 1485709 1418581 1443241 1494239 1457659 1430971 1434704 1439093
13977 1439093 1419761 1398376 1414774 1502877 1562067 1563189 1561067 1564676 1521704 1459976 1487612 1418089
13965 1418089 1397981 1408007 1425101 1398737 1359288 1346186 1357135 1380919 1419086 1419923 1449506 1472653
13953 1472653 1455917 1503962 1526989 1470796 1434920 1440956 1453680 1441720 1488487 1475715 1488315
13942 1488315 1482412 1465397 1458677 1497451 1495336 1530491 1519532 1521543 1548957 1650148 1607418 1560121
13930 1560121 1549944 1560773 1586763 1591702 1608485 1602602 1539293 1506707 1486990 1545440 1552330 1527631
13918 1527631 1538483 1516036 1468774 1531678 1606736 1659813 1661021 1695774 1690480 1672011 1701217 1648841
13906 1648841 1612757 1655592 1682754 1696730 1696170 1631310 1642248 1650926 1642556 1601209 1613780 1656736
13894 1656736 1720613 1752568 1697520 1677299 1682463 1706864 1667399 1663588 1647503 1650836 1610456 1627445
13882 1627445 1666178 1635131 1665774 1655662 1613550 1630728 1630268 1659020 1714315 1688496 1701247 1634455
13870 1634455 1590376 1639257 1694344 1673836 1668258 1696020 1714435 1723162 1756291 1790621 1723560 1685570
13858 1685570 1685264 1710337 1770446 1818223 1744531 1723675 1705559 1687813 1771068 1796675 1796151 1813474
13846 1813474 1826803 1858598 1809820 1793470 1785483 1789165 1810329 1782248 1781763 1789716 1807530 1812877
13834 1812877 1726940 1693031 1749614 1753398 1787632 1829875 1846966 1892755 1974910 1976224 1980041 1953804
13822 1953804 1934561 1867394 1833178 1837509 1874430 1864359 1900425 1969015 1996276 2007869 1968083
13811 1968083 1946466 1987802 1996429 1917830 1871002 1848021 1886561 1989345 1990514 1954895 1904991
13800 1904991 1872729 1889414 1889809 1952408 1971296 1917225 1946860 1966501 1894471 1835535 1861488 1878208
13788 1878208 1937390 2006628 1987117 1991134 1962960 1942837 1954265 1986422 2059396 2085947 2018884
13777 2018884 2017626 2030404 2035053 2089331 2103286 2118845 2081817 2087078 2137517 2120102 2091239 1998092
13765 1998092 1900554 1881289 1921121 1971071 1975423 1997977 2037164 2079362 2048010 2098375 2128351
13754 2128351 2059377 2010630 2007095 1969058 1976732 1937584 1992497 2005662 1993924 2109391 2169440
13743 2169440 2112834 2099961 2122099 2179023 2220595 2268259 2310388 2380468 2319522 2216999 2240554
13732 2240554 2237949 2206787 2186723 2186481 2165122 2146501 2192831 2196535 2166845 2179656 2176555 2126888
13720 2126888 2174400 2222558 2269511 2310482 2306753 2264352 2220291 2188466 2238264 2312147 2292433
13709 2292433 2256623 2250831 2276938 2252791 2244609 2321943 2343391 2331973 2397661 2472486 2463010 2349880
13697 2349880 2307483 2324831 2274771 2257731 2280964 2348716 2398895 2414162 2472235 2441915 2424979
13686 2424979 2443837 2482833 2495410 2511107 2497768 2440836 2414828 2436206 2497198 2549509 2589806
13675 2589806 2563736 2512790 2497156 2455710 2416895 2476916 2435684 2461243 2530506 2518149 2490478
13664 2490478 2488617 2521037 2518536 2549262 2549770 2498887 2504872 2460103 2489654 2560376 2574816 2613529
13652 2613529 2641827 2644855 2580543 2581190 2624767 2685991 2704851 2752532 2795144 2820804 2797674 2849868
13640 2849868 2816310 2791835 2814390 2869660 2889216 2843344 2785226 2745503 2792216 2791828 2772025 2812952
13628 2812952 2809668 2815803 2778772 2784438 2858699 2832654 2821740 2853879 2827211 2828988 2833903 2874162
13616 2874162 2887752 2944910 2979179 2930672 2902375 2866341 2826437 2853716 2981064 2976563 2883598
13605 2883598 2897083 2984455 2956079 2914092 2997766 3056067 3032063 3023856 2995848 3099634 3075863
13594 3075863 3022876 3012471 3072279 3131586 3127090 3148660 3171914 3179561 3166909 3124495 3065402 3038872
13582 3038872 3111120 3165238 3154645 3140573 3097880 3082723 3132757 3159433 3230661 3223968 3201272
13571 3201272 3187016 3145931 3145494 3208024 3287428 3284334 3228669 3206851 3243261 3301827 3328088 3281682
13559 3281682 3410546 3457428 3425844 3388436 3370814 3356616 3437361 3522151 3561797 3609342 3564964
13548 3564964 3565828 3616205 3650395 3658511 3710967 3729974 3744794 3798636 3867866 3852056 3900686 3934530
13536 3934530 3953828 3976147 4024730 4105733 4205107 4233987 4329759 4462632 4609825 4803563 5010249
13525 5010249 5184063 5009987 4317550 3327191 2575825 2272449 2252443 2362260 2489105 2578974
13515 2578974 2691128 2775511 2850047 2948089 2969289 3024496 3111914 3160580 3232156 3301211 3277687
13504 3277687 3245251 3230565 3241365 3190003 3217110 3218537 3274734 3283615 3236124 3205657 3254437 3300202
13492 3300202 3307567 3381986 3404060 3408369 3412031 3426912 3536245 3633466 3598804 3576499 3606150 3634175
13480 3634175 3717350 3766302 3759629 3802720 3790055 3773911 3835769 3889914 3913141 3926201 3930939 3940826
13468 3940826 3983290 3980541 3944639 3894206 3883378 3912801 3995815 3993287 3986159 4000105 3989520 3993466
13456 3993466 4007348 4022608 4004726 4023501 4085943 4063075 4088885 4122913 4132876 4190528 4194737 4208180
13444 4208180 4231802 4282345 4278292 4233917 4240664 4257888 4354948 4392886 4414297 4391664 4329095 4314618
13432 4314618 4337126 4388837 4362444 4350862 4451298 4495053 4525048 4536410 4509058 4527650 4584069
13421 4584069 4594812 4602721 4619139 4647057 4642978 4654767 4666439 4671780 4689205 4663811 4643126 4689753
13409 4689753 4784916 4862685 4870417 4849407 4883500 4917572 4944447 4965046 4992296 5011737 5026066
13398 5026066 5035582 5081338 5132647 5138480 5171889 5182422 5148946 5184261 5220279 5296806 5310055 5336913
13386 5336913 5331903 5313620 5366350 5406522 5401301 5395953 5409825 5470696 5570486 5530436 5452871 5485929
13374 5485929 5549385 5565395 5582772 5627350 5587812 5570683 5657490 5802134 5885040 5974465 6024701
13363 6024701 6036347 5958942 5740588 5404949 5288338 5287449 5299361 5346559 5471227 5568904 5592570
13352 5592570 5628560 5688656 5679501 5701833 5795383 5843913 5912076 5992014 6024557 6038307 6056336
13341 6056336 6091823 6042576 6049712 6096722 6124493 6160716 6179448 6231516 6302946 6292689 6308982
13330 6308982 6391629 6432121 6323925 6338776 6347016 6329518 6391937 6442611 6451546 6385054 6424135
13319 6424135 6599359 6691321 6678477 6726240 6751796 6775849 6803212 6846467 6895496 6938426 6986738
13308 6986738 7054167 7096611 7119067 7189971 7226280 7244409 7258267 7312563 7382457 7431189 7438917
13297 7438917 7404589 7443631 7588956 7691637 7696094 7659543 7632421 7657795 7719865 7760021 7832395
13286 7832395 7888916 7932400 7981923 8063525 8089002 8148372 8257909 8300489 8321661 8359392 8401979
13275 8401979 8543755 8641152 8670065 8766847 8874006 8978225 9195150 9424082 9616511 9766826
13265 9766826 9575981 8966603 8191969 7660289 7573949 7695937 7846593 7929788 8053269 8199120
13255 8199120 8291917 8395486 8515413 8606912 8731918 8816256 8846179 8943878 9071247 9181013
13245 9181013 9309144 9416597 9474091 9463471 9502795 9658789 9763940 9853332 9937576 10045669
13235 10045669 10135248 10171136 10263797 10383351 10457136 10549069 10680306 10738853 10744499 10775012 10841646
13224 10841646 10948419 11046964 11129345 11185526 11243422 11329900 11368011 11428167 11522224 11654959 11846473
13213 11846473 12011800 12086280 12168177 12213926 12256734 12295342 12363222 12415018 12433260 12586784 12690267
13202 12690267 12749587 12791622 12778553 12909586 13088114 13282379 13398622 13595316 13790409 13895752
13192 13895752 14017532 14160401 14221252 14241241 14319853 14470501 14638250 14814440 14972585 15229990
13182 15229990 15435374 15463176 15548960 15689775 15863838 16068441 16269952 16435660 16536604 16686220
13172 16686220 16815401 16978434 17228059 17458972 17658984 17882464 17999012 18195572 18489102
13163 18489102 18751656 18986040 19233774 19467339 19744376 20052964 20346173 20570699 20772563
13154 20772563 20986540 21226825 21447568 21722165 21994313 22291389 22605155 22996729 23353541
13145 23353541 23678593 24009030 24375424 24755360 25144341 25504460 25906876 26298432 26778334
13136 26778334 27259094 27671773 28160587 28625719 29111994 29702914 30290860 30785192 31333546
13127 31333546 31981126 32626733 33288622 33979905 34734425 35459976 36226779 37087563 37954086
13118 37954086 38815336 39627236 40554879 41682020 42860453 44050790 45305898 46545631
13110 46545631 47838693 49295483 50856960 52465847 54262921 56149229 58066530 60251087
13102 60251087 62645830 65087545 67671550 70544818 73544055 76805531 80452760 84583693
13094 84583693 89329314 94881007 101226540 108424018 116856844 126666428 137727870 150703497
13086 150703497 165991248 183330734 204742737 233288978 270374775 313956769 341537833
13079 341537833 291888150 133537268 -66661267 -203813973 -246939486 -239550255 -217722993
13072 -217722993 -193400367 -170516050 -151118933 -134304195 -118626177 -104162037 -90625406
13065 -90625406 -77575310 -64960687 -53847776 -49307202 -58438632 -79747784 -101277145
13058 -101277145 -112253075 -112931851 -108759384 -103107091 -97177314 -91696422 -86815255 -82403520
13050 -82403520 -78325766 -74658625 -71360023 -68393297 -65682660 -63157582 -60786865 -58515543
13042 -58515543 -56348957 -54371064 -52599739 -50860602 -49122476 -47505246 -46003245 -44516889
13034 -44516889 -42959243 -41488912 -40132915 -38725390 -37343995 -35967154 -34506188 -32974698
13026 -32974698 -31312767 -29710608 -28950176 -30167143 -33031781 -35604208 -36565624 -36027827
13018 -36027827 -34891537 -34065386 -34040451 -34601124 -34963786 -34671053 -33928157 -33125815 -32252278
13009 -32252278 -31396149 -30607000 -29867587 -29158324 -28541168 -27977722 -27424494 -26907814 -26451058
13000 -26451058 -26063473 -25702956 -25473209 -25199250 -24930926 -24599255 -24197387 -23798381 -23433836
12991 -23433836 -23120262 -22775726 -22438182 -22145636 -21858387 -21638664 -21415658 -21126754 -20836945
12982 -20836945 -20575044 -20313007 -20077676 -19865806 -19618688 -19411859 -19198513 -18976678 -18793816
12973 -18793816 -18576188 -18387306 -18171361 -18011105 -17856504 -17725886 -17530991 -17320625 -17095020
12964 -17095020 -16851408 -16659356 -16554442 -16507887 -16397241 -16314382 -16179651 -16069449 -15904635 -15722096
12954 -15722096 -15578190 -15459054 -15295152 -15128597 -14955357 -14827471 -14723330 -14611129 -14426705
12945 -14426705 -14285448 -14168532 -14054445 -13918036 -13784184 -13663805 -13567496 -13516933 -13363330 -13136214
12935 -13136214 -12961080 -12749399 -12592140 -12705523 -12934073 -13054125 -13064599 -13053356 -13010812 -12871822
12925 -12871822 -12767554 -12653363 -12467956 -12274265 -12098201 -12031837 -12020835 -12045066 -12088258 -12077100
12915 -12077100 -12056166 -12034838 -11890867 -11757042 -11752189 -11621592 -11459449 -11360404 -11302646 -11267197
12905 -11267197 -11213936 -11123988 -11067781 -10996737 -10837735 -10803522 -10743426 -10690752 -10697625 -10635195 -10595162
12894 -10595162 -10552697 -10442072 -10410473 -10430769 -10433775 -10392626 -10350137 -10322642 -10311753 -10259707 -10150278
12883 -10150278 -10018692 -9937582 -9912104 -9895896 -9835950 -9761309 -9712745 -9586095 -9435384 -9364156
12873 -9364156 -9381380 -9364330 -9344063 -9361879 -9313403 -9229268 -9121787 -9094237 -9091835 -9060069 -9006387
12862 -9006387 -8984321 -8971697 -8868462 -8797745 -8794637 -8711504 -8631138 -8591159 -8636004 -8641131 -8594511
12851 -8594511 -8498396 -8404767 -8374818 -8360841 -8297207 -8225421 -8220892 -8222251 -8199841 -8185220 -8187346 -8154298
12839 -8154298 -8055875 -7997322 -7951322 -7867355 -7848375 -7825335 -7810810 -7885546 -7900571 -7821891 -7747488
12828 -7747488 -7684883 -7672596 -7664417 -7602437 -7616443 -7542247 -7497934 -7449179 -7474418 -7491883 -7494818 -7485706
12816 -7485706 -7435989 -7397897 -7272986 -7224737 -7220028 -7227012 -7214443 -7166649 -7143248 -7154121 -7140661
12805 -7140661 -7153638 -7109037 -7048230 -7036175 -7081376 -7059517 -7031277 -7004683 -6997650 -6995961 -6987358 -6910275
12793 -6910275 -6875305 -6815913 -6744669 -6729187 -6675749 -6713639 -6697284 -6601363 -6597193 -6611335 -6568004
12782 -6568004 -6514649 -6476841 -6449583 -6407378 -6404393 -6418676 -6318531 -6354546 -6417831 -6472427 -6376693
12771 -6376693 -6248016 -6208662 -6242089 -6240474 -6174455 -6159160 -6168998 -6205028 -6144080 -6086494 -6094406 -6087022
12759 -6087022 -6002134 -6030438 -6024632 -6009990 -5980569 -5916916 -5925690 -5875433 -5853008 -5857658 -5853082 -5820081
12747 -5820081 -5820475 -5766932 -5781425 -5784957 -5803403 -5717622 -5651831 -5679946 -5694535 -5707357 -5659455 -5590693
12735 -5590693 -5593838 -5568508 -5540890 -5546129 -5495857 -5458879 -5416460 -5461035 -5524253 -5604926 -5614968 -5586662
12723 -5586662 -5514793 -5516995 -5530362 -5440962 -5374175 -5371655 -5383258 -5387449 -5353229 -5342103 -5373036 -5340407
12711 -5340407 -5348359 -5277925 -5206128 -5191104 -5213740 -5178251 -5115831 -5154802 -5155784 -5217334 -5201804 -5217597
12699 -5217597 -5155316 -5152089 -5142232 -5163032 -5136559 -5121011 -5119271 -5090866 -5103091 -5111220 -5021427 -4929895
12687 -4929895 -4928768 -4919138 -4920309 -4868151 -4785948 -4792200 -4847543 -4821568 -4789301 -4779815 -4736153 -4768761
12675 -4768761 -4771882 -4709692 -4710704 -4728127 -4816258 -4710081 -4663699 -4666426 -4692937 -4638481 -4585557 -4542881
12663 -4542881 -4517704 -4512138 -4464847 -4429358 -4426581 -4388630 -4451541 -4500719 -4471935 -4457910 -4463149 -4389772
12651 -4389772 -4307620 -4219737 -4188812 -4228265 -4250304 -4201407 -4175218 -4176850 -4174228 -4058637 -4024060
12640 -4024060 -4001254 -3969255 -3953396 -3890547 -3799059 -3652942 -3553475 -3468796 -3291692 -3143592 -2970751
12629 -2970751 -2766782 -2737838 -3166183 -4020157 -4976954 -5505620 -5627962 -5529433 -5434127 -5312146
12619 -5312146 -5211695 -5117354 -4980331 -4955402 -4855796 -4740310 -4651634 -4620317 -4629926 -4680024 -4806972
12608 -4806972 -4841340 -4829736 -4840368 -4878618 -4901437 -4807419 -4759699 -4728589 -4666452 -4658207 -4630708
12597 -4630708 -4593441 -4597268 -4605757 -4612661 -4527691 -4492162 -4495027 -4438441 -4400194 -4397254 -4425109 -4437469
12585 -4437469 -4389640 -4407501 -4413579 -4366698 -4347967 -4346041 -4292339 -4258639 -4277152 -4267964 -4274132 -4233742
12573 -4233742 -4236176 -4258079 -4178355 -4138032 -4185137 -4161037 -4136065 -4123836 -4106570 -4098147 -4081035 -4043563
12561 -4043563 -4011294 -4026081 -4064483 -4012763 -4001228 -4044255 -4061400 -4099401 -4130232 -4067045 -4016667
12550 -4016667 -4010750 -4030074 -4015660 -3988429 -4000644 -3971998 -3955181 -3988192 -4020639 -3971054 -3900947
12539 -3900947 -3845508 -3845517 -3858122 -3866820 -3924783 -3944192 -3944124 -3898807 -3854114 -3741791 -3717949 -3733512 -3838618
12526 -3838618 -3833706 -3785033 -3778348 -3768310 -3721135 -3740553 -3777501 -3802282 -3834514 -3829004 -3786747 -3770853
12514 -3770853 -3736608 -3687478 -3677784 -3663455 -3682353 -3715491 -3705725 -3634400 -3647654 -3643688 -3620366 -3606774
12502 -3606774 -3582082 -3576436 -3592066 -3570716 -3654484 -3649805 -3597171 -3609161 -3552871 -3526291 -3523819 -3505129
12490 -3505129 -3462233 -3453580 -3438360 -3388780 -3419137 -3438935 -3472655 -3484685 -3477318 -3449745 -3461658 -3422572
12478 -3422572 -3470256 -3495144 -3422818 -3362478 -3373667 -3423890 -3391433 -3324142 -3314908 -3365342 -3367220 -3420750
12466 -3420750 -3441480 -3421151 -3368334 -3363480 -3411628 -3403930 -3407392 -3388867 -3339491 -3350109 -3349230 -3325465
12454 -3325465 -3291252 -3326526 -3340091 -3345565 -3378607 -3418336 -3421360 -3364075 -3344059 -3327227 -3348444 -3375217
12442 -3375217 -3366363 -3364283 -3313227 -3269837 -3263279 -3225031 -3229382 -3235764 -3276908 -3275173 -3183976 -3153842
12430 -3153842 -3165137 -3188709 -3223737 -3234923 -3265121 -3266999 -3282994 -3286683 -3252212 -3220591 -3138791 -3123648
12418 -3123648 -3132030 -3159497 -3206216 -3264824 -3197254 -3208238 -3212930 -3204780 -3212462 -3245025 -3217660 -3211200
12406 -3211200 -3214326 -3193884 -3187605 -3164740 -3199454 -3191633 -3181952 -3165619 -3175984 -3194394 -3186699 -3156925
12394 -3156925 -3185042 -3199019 -3074564 -3037775 -3066014 -3070019 -3070533 -3054671 -3021997 -3054595 -3061397 -3045024
12382 -3045024 -2976303 -2956532 -2960792 -2968715 -2982693 -2954625 -2964936 -3047564 -3083309 -3010175 -2920766 -2907966
12370 -2907966 -2930722 -2972875 -2943528 -2923186 -2923712 -2924043 -2930729 -2922604 -2965070 -2961268 -2993455 -3007856 -3004884
12357 -3004884 -2943283 -2957100 -2943982 -2905794 -2869143 -2894171 -2949715 -3002939 -3014551 -3056007 -3033609
12346 -3033609 -2947598 -2939221 -2956246 -2927807 -2916407 -2953194 -2929731 -2907571 -2927829 -2906218 -2849077
12335 -2849077 -2848369 -2829074 -2854567 -2843793 -2822165 -2880248 -2854162 -2836706 -2857153 -2840640 -2803176 -2828691
12323 -2828691 -2880406 -2866172 -2849263 -2932417 -2895167 -2872750 -2842149 -2849164 -2808348 -2832340 -2875097
12312 -2875097 -2840860 -2791165 -2779503 -2773510 -2732615 -2713764 -2645693 -2601097 -2638674 -2706136 -2714342 -2748540
12300 -2748540 -2786599 -2767021 -2761206 -2779758 -2724364 -2659122 -2646326 -2666411 -2750228 -2750033 -2752536 -2776348
12288 -2776348 -2845977 -2812137 -2759024 -2729598 -2722273 -2717671 -2677155 -2676140 -2709304 -2695623 -2698461 -2653789
12276 -2653789 -2671401 -2735339 -2727551 -2618080 -2586632 -2581983 -2596534 -2624822 -2670905 -2648654 -2558547
12265 -2558547 -2516948 -2563835 -2607374 -2599408 -2613033 -2589307 -2588207 -2589137 -2535689 -2508718 -2502939 -2504842
12253 -2504842 -2499957 -2565110 -2592759 -2640771 -2653259 -2643644 -2610292 -2631552 -2609413 -2586256 -2598743 -2622209
12241 -2622209 -2642145 -2648885 -2625633 -2532695 -2426420 -2444967 -2416376 -2452552 -2476641 -2396512 -2423299
12230 -2423299 -2482807 -2449101 -2421930 -2365511 -2321701 -2353076 -2386146 -2433556 -2496962 -2522427 -2499968
12219 -2499968 -2529182 -2500028 -2495934 -2488412 -2481194 -2507335 -2495963 -2479497 -2436871 -2465053 -2502516 -2500486
12207 -2500486 -2526764 -2467829 -2467437 -2446158 -2412918 -2408915 -2413548 -2351648 -2334102 -2340890 -2325706 -2303921
12195 -2303921 -2371968 -2444388 -2429174 -2466933 -2509793 -2500490 -2476182 -2411860 -2341524 -2328141 -2329301 -2365797
12183 -2365797 -2347133 -2345605 -2437363 -2389725 -2305669 -2339907 -2418045 -2398965 -2369584 -2330682 -2310051
12172 -2310051 -2307140 -2337329 -2355158 -2392592 -2412190 -2395919 -2394134 -2429857 -2415454 -2429119 -2414445 -2364506
12160 -2364506 -2304658 -2333793 -2367245 -2409472 -2437587 -2401579 -2371376 -2355428 -2363783 -2387494 -2353615
12149 -2353615 -2305843 -2365686 -2363273 -2260627 -2255434 -2278823 -2303827 -2370289 -2398232 -2340832 -2301509
12138 -2301509 -2354341 -2355243 -2321629 -2357046 -2376538 -2410983 -2353839 -2369971 -2395984 -2340198 -2245509 -2229320
12126 -2229320 -2283326 -2340327 -2335780 -2319744 -2304734 -2287803 -2285040 -2310351 -2354219 -2300578 -2304495 -2300506
12114 -2300506 -2218948 -2179703 -2191212 -2216680 -2237585 -2238448 -2205007 -2202558 -2196497 -2174608 -2171311 -2231108
12102 -2231108 -2234202 -2226810 -2269061 -2223660 -2116052 -2107867 -2160857 -2216324 -2289096 -2223451 -2118728
12091 -2118728 -2062857 -2101919 -2146179 -2112637 -2122271 -2124930 -2166478 -2207061 -2219386 -2180040 -2106220 -2088082
12079 -2088082 -2097021 -2094318 -2121375 -2122697 -2135827 -2125034 -2162970 -2151843 -2156412 -2115370 -2135017 -2148468
12067 -2148468 -2118069 -2113428 -2105348 -2140891 -2179281 -2144865 -2138705 -2093850 -2139509 -2156859 -2144245 -2149107
12055 -2149107 -2121289 -2078784 -2031671 -2023357 -2108658 -2071198 -2041389 -2092929 -2103834 -2067342 -2112498
12044 -2112498 -2102820 -2070819 -2051105 -2044569 -2099494 -2143233 -2100251 -2061670 -2054576 -2016418 -2022870 -2028558
12032 -2028558 -2045087 -2010154 -2025151 -2088328 -2137708 -2140993 -2167401 -2102370 -2084253 -2112422 -2128093
12021 -2128093 -2147180 -2115429 -2028713 -2050779 -2072402 -2035385 -2024094 -2095868 -2084021 -2049630 -2043946
12010 -2043946 -2062759 -2071486 -2044099 -2012614 -2015164 -1995052 -1979377 -1998515 -2027724 -2009087 -1957317 -1958581
11998 -1958581 -2017804 -2073040 -2082488 -2018163 -1939229 -1942413 -1984002 -1980601 -2014886 -2046266 -2025275 -2017215
11986 -2017215 -1972935 -1995512 -2026867 -2017300 -1993309 -2024424 -2021002 -2006864 -1957812 -1898837 -1872503 -1926325
11974 -1926325 -1985423 -2038047 -2059033 -2068801 -2008819 -1931411 -1901250 -1923434 -1955574 -1967635 -1921637
11963 -1921637 -1954626 -1989022 -1987267 -1970661 -2018160 -2037323 -2015254 -1996374 -1971371 -1945890 -1994022
11952 -1994022 -2004606 -1980006 -1970528 -1968365 -1941470 -1922102 -1844976 -1786175 -1869868 -1920392 -1911199 -1917398
11940 -1917398 -1905309 -1887473 -1896262 -1902180 -1892990 -1916932 -1941572 -1937199 -1932357 -1971079 -1962275 -1917383
11928 -1917383 -1893368 -1909796 -1946245 -1924226 -1925155 -1915757 -1930934 -1933713 -1940685 -1974901 -2051795 -2075990
11916 -2075990 -2061126 -1987164 -1956678 -2041529 -2047285 -1988202 -1942339 -1879617 -1952531 -1999589 -1939728
11905 -1939728 -1876086 -1805994 -1778362 -1804744 -1828791 -1828213 -1825789 -1837278 -1828752 -1832777 -1862963 -1884359
11893 -1884359 -1927846 -1945626 -1974326 -1954090 -1926276 -1965863 -1965815 -1955603 -1917110 -1848835 -1868922 -1849727
11881 -1849727 -1806003 -1727170 -1701441 -1700574 -1708441 -1681319 -1666770 -1692630 -1794044 -1839696 -1847353 -1901628
11869 -1901628 -1940236 -1932299 -1886565 -1813207 -1745977 -1761367 -1777290 -1806487 -1786487 -1782558 -1881414 -1883239
11857 -1883239 -1808178 -1795140 -1807435 -1787605 -1784543 -1816686 -1798256 -1821276 -1814268 -1761646 -1695386 -1724154
11845 -1724154 -1720505 -1771612 -1776538 -1803093 -1838686 -1876952 -1811380 -1755355 -1743250 -1711940 -1727725 -1772568
11833 -1772568 -1822665 -1833919 -1762559 -1707409 -1628692 -1626286 -1649427 -1735161 -1773380 -1705943 -1697759 -1677915
11821 -1677915 -1640572 -1655302 -1716970 -1714999 -1665006 -1597378 -1620117 -1689173 -1677587 -1692752 -1806607
11810 -1806607 -1859624 -1878059 -1818239 -1748418 -1752034 -1727270 -1771665 -1745573 -1722183 -1730657 -1713182 -1656083
11798 -1656083 -1677754 -1686300 -1713423 -1790011 -1753086 -1688546 -1691243 -1734543 -1737949 -1708691 -1701629 -1662875
11786 -1662875 -1644690 -1700578 -1794413 -1780846 -1779356 -1709199 -1678954 -1698666 -1709920 -1724346 -1689947
11775 -1689947 -1643761 -1572492 -1497897 -1522394 -1613838 -1653141 -1667915 -1676032 -1629178 -1633628 -1629388 -1691984
11763 -1691984 -1688133 -1651879 -1678257 -1688981 -1669794 -1621880 -1638170 -1673649 -1674446 -1690295 -1726547 -1764992
11751 -1764992 -1752480 -1731597 -1767032 -1748625 -1696652 -1700539 -1715481 -1680165 -1733625 -1699286 -1687129
11740 -1687129 -1712099 -1678216 -1668712 -1642592 -1639912 -1687387 -1691527 -1685671 -1676654 -1699212 -1670186 -1671155 -1606926
11727 -1606926 -1594862 -1650021 -1667338 -1688712 -1670498 -1624592 -1637964 -1643060 -1626618 -1684330 -1699699
11716 -1699699 -1783107 -1813716 -1799665 -1756968 -1760901 -1753668 -1724082 -1646639 -1582928 -1594057 -1598489 -1645763
11704 -1645763 -1626842 -1637459 -1663003 -1642705 -1614466 -1612346 -1604618 -1605289 -1632944 -1683020 -1678513 -1706946
11692 -1706946 -1719146 -1579982 -1549689 -1595837 -1670695 -1638886 -1609342 -1630271 -1556609 -1556509 -1553654 -1549125
11680 -1549125 -1543956 -1551129 -1599348 -1579143 -1587406 -1631944 -1653068 -1659646 -1665766 -1663195 -1679618 -1608299
11668 -1608299 -1552273 -1577264 -1600528 -1620629 -1662796 -1692569 -1713075 -1677370 -1633677 -1575140 -1562900
11657 -1562900 -1599035 -1582317 -1535260 -1524230 -1530003 -1488106 -1500108 -1550041 -1529695 -1487647 -1501520
11646 -1501520 -1531076 -1526465 -1611990 -1619529 -1550556 -1536412 -1607960 -1582169 -1628194 -1616909 -1608811 -1593850
11634 -1593850 -1587610 -1587280 -1542936 -1549504 -1567072 -1512762 -1422783 -1422648 -1455590 -1435987 -1441258 -1442930 -1454308
11621 -1454308 -1463537 -1568881 -1501679 -1393531 -1378374 -1320801 -1318619 -1337822 -1319308 -1338544 -1265838
11610 -1265838 -1219853 -1213951 -1261381 -1424221 -1574862 -1697219 -1804247 -1868947 -1894190 -1889721 -1863194
11599 -1863194 -1877030 -1840620 -1755354 -1648753 -1643601 -1667748 -1707122 -1717750 -1672318 -1714201 -1723887
11588 -1723887 -1721474 -1693309 -1677783 -1621672 -1640612 -1636786 -1582018 -1612641 -1643041 -1646655 -1703968 -1729672
11576 -1729672 -1759451 -1750354 -1702691 -1663445 -1547290 -1536975 -1627209 -1599955 -1619634 -1652933 -1595599
11565 -1595599 -1580256 -1647532 -1642957 -1654556 -1629742 -1632644 -1627779 -1550293 -1543386 -1534583 -1480335 -1507783
11553 -1507783 -1539820 -1502419 -1542677 -1570055 -1592147 -1614409 -1650893 -1632005 -1624176 -1630345 -1641307 -1624748
11541 -1624748 -1578294 -1575863 -1585891 -1557847 -1491903 -1435411 -1431445 -1475877 -1533277 -1543356 -1507352 -1452597
11529 -1452597 -1527441 -1588357 -1598645 -1571193 -1558843 -1561072 -1543564 -1514824 -1495818 -1539552 -1563129
11518 -1563129 -1606407 -1559441 -1552240 -1592209 -1665412 -1580335 -1519291 -1492459 -1437436 -1457853 -1513629
11507 -1513629 -1525694 -1554511 -1556356 -1539507 -1449693 -1419894 -1470603 -1500691 -1419617 -1390758 -1452573
11496 -1452573 -1486315 -1468974 -1451438 -1471357 -1463443 -1427530 -1414868 -1382762 -1351489 -1338240 -1357359
11485 -1357359 -1328399 -1323823 -1358655 -1327382 -1351214 -1340483 -1293020 -1301297 -1305303 -1321250 -1343297 -1357485
11473 -1357485 -1356673 -1312228 -1340767 -1415359 -1381581 -1379419 -1301811 -1203298 -1199445 -1220481 -1177059 -1185859
11461 -1185859 -1190110 -1355657 -1518268 -1711410 -1841945 -1855569 -1765857 -1706019 -1781662 -1798212 -1721680
11450 -1721680 -1690558 -1723021 -1780148 -1791041 -1710602 -1712241 -1685400 -1621188 -1613368 -1573223 -1552626 -1557570
11438 -1557570 -1523958 -1561220 -1512399 -1516251 -1541103 -1502211 -1519482 -1563195 -1539853 -1490212 -1529286
11427 -1529286 -1551081 -1560206 -1546382 -1551649 -1576411 -1608688 -1585726 -1543226 -1497627 -1480222 -1473175 -1459507
11415 -1459507 -1467424 -1496328 -1500941 -1462355 -1435213 -1454239 -1509015 -1578521 -1642544 -1623543 -1567840 -1482714
11403 -1482714 -1487486 -1514479 -1536039 -1500328 -1463292 -1481895 -1484263 -1483861 -1498254 -1523137 -1582914 -1562799
11391 -1562799 -1532075 -1590654 -1603593 -1593505 -1553097 -1448353 -1428027 -1412863 -1462404 -1428118 -1426596
11380 -1426596 -1433282 -1473246 -1486310 -1471594 -1461269 -1444818 -1434298 -1464435 -1483157 -1447956 -1405945
11369 -1405945 -1374303 -1385146 -1413038 -1355977 -1298049 -1339015 -1393820 -1412813 -1364428 -1461106 -1514403
11358 -1514403 -1504450 -1459740 -1435334 -1468034 -1436214 -1485922 -1489374 -1517299 -1505284 -1527236 -1523387 -1479781
11346 -1479781 -1438707 -1474491 -1477627 -1446624 -1452492 -1471900 -1551722 -1523453 -1492889 -1485075 -1437104 -1357901
11334 -1357901 -1361916 -1391161 -1405221 -1413564 -1424421 -1439054 -1452992 -1409471 -1435247 -1491101 -1511648 -1473613
11322 -1473613 -1470692 -1493793 -1458001 -1448216 -1433520 -1365160 -1343752 -1367230 -1408198 -1370609 -1315824 -1341778
11310 -1341778 -1288293 -1292756 -1331067 -1417600 -1522371 -1490126 -1469287 -1443527 -1406362 -1367473 -1385253
11299 -1385253 -1298893 -1241118 -1254903 -1293328 -1298712 -1347662 -1400896 -1397974 -1352367 -1346776 -1339915 -1317233
11287 -1317233 -1325641 -1326760 -1390805 -1380740 -1321845 -1313291 -1317198 -1320473 -1344874 -1348890 -1331923 -1343342
11275 -1343342 -1281362 -1274440 -1331703 -1356876 -1378911 -1391069 -1380218 -1377966 -1457141 -1506545 -1490322 -1389032
11263 -1389032 -1318606 -1308621 -1332467 -1383190 -1399305 -1433154 -1389586 -1352738 -1368929 -1416530 -1376312
11252 -1376312 -1344221 -1351132 -1388268 -1383696 -1458282 -1430228 -1460537 -1450739 -1435459 -1439235 -1398250 -1325363
11240 -1325363 -1303736 -1290912 -1352277 -1317473 -1338075 -1359344 -1383803 -1376837 -1389624 -1367159 -1307029
11229 -1307029 -1313251 -1297660 -1285868 -1277105 -1243344 -1240984 -1277411 -1329019 -1343664 -1349452 -1370739 -1327791
11217 -1327791 -1282255 -1263153 -1275904 -1324149 -1366709 -1397446 -1366841 -1355815 -1354309 -1311906 -1290769
11206 -1290769 -1304096 -1279460 -1303022 -1331812 -1331778 -1290103 -1209063 -1225168 -1210558 -1177579 -1205145 -1250928
11194 -1250928 -1274804 -1268435 -1264156 -1334957 -1346897 -1346587 -1301940 -1250089 -1253199 -1238257 -1191959 -1222863
11182 -1222863 -1265875 -1291371 -1274468 -1301275 -1332904 -1341558 -1352216 -1306230 -1280649 -1299048 -1265179
11171 -1265179 -1269270 -1249139 -1192446 -1243500 -1228717 -1160045 -1138253 -1176047 -1201199 -1225128 -1246202
11160 -1246202 -1272395 -1277220 -1300131 -1268764 -1232298 -1251233 -1258536 -1259300 -1227921 -1188405 -1192567 -1206450
11148 -1206450 -1293521 -1314638 -1293544 -1294297 -1345375 -1327092 -1270758 -1266853 -1337223 -1341863 -1262186 -1229282
11136 -1229282 -1261733 -1276693 -1280390 -1292053 -1388395 -1346681 -1269052 -1306793 -1298440 -1257007 -1229876 -1188951
11124 -1188951 -1215620 -1225589 -1236292 -1260235 -1267938 -1268333 -1271640 -1276909 -1258582 -1217953 -1234157 -1298169
11112 -1298169 -1292520 -1244092 -1242506 -1237325 -1200861 -1164923 -1208633 -1237317 -1257466 -1276606 -1261343 -1221615
11100 -1221615 -1189608 -1207261 -1241305 -1246152 -1174045 -1139078 -1188114 -1188777 -1218900 -1258079 -1276914 -1247284
11088 -1247284 -1244460 -1264173 -1216806 -1187517 -1199226 -1243225 -1345916 -1320773 -1271491 -1301438 -1351386
11077 -1351386 -1306985 -1251341 -1179343 -1189319 -1165807 -1189252 -1207871 -1186676 -1191159 -1245480 -1231728 -1241370
11065 -1241370 -1177880 -1135682 -1117622 -1151857 -1172789 -1204813 -1232646 -1270274 -1215655 -1179209 -1187024
11054 -1187024 -1183471 -1143256 -1205307 -1231767 -1212611 -1182801 -1187328 -1157081 -1132397 -1183237 -1223529 -1210956
11042 -1210956 -1156550 -1182080 -1186430 -1144979 -1152603 -1183567 -1217203 -1199921 -1123813 -1149924 -1211442 -1179468
11030 -1179468 -1173251 -1174330 -1188363 -1201647 -1205478 -1208434 -1165451 -1173385 -1244889 -1211446 -1176275 -1208702
11018 -1208702 -1261056 -1257893 -1213988 -1167282 -1106152 -1124943 -1171265 -1113065 -1100416 -1109285 -1146811 -1149903
11006 -1149903 -1198308 -1155812 -1103393 -1193174 -1238037 -1234951 -1191642 -1176965 -1193497 -1178049 -1123307
10995 -1123307 -1146848 -1170525 -1175178 -1140660 -1153052 -1165582 -1192686 -1201635 -1239695 -1287423 -1246100 -1198296
10983 -1198296 -1229384 -1264212 -1225551 -1188542 -1213666 -1160905 -1158992 -1121559 -1124817 -1153440 -1161683 -1216790
10971 -1216790 -1215189 -1205632 -1232717 -1316385 -1289611 -1232446 -1256223 -1281806 -1285876 -1331234 -1268311 -1225348
10959 -1225348 -1243035 -1220813 -1201771 -1219650 -1197448 -1102004 -1076868 -1145744 -1178290 -1187869 -1253151
10948 -1253151 -1199611 -1183137 -1179852 -1173188 -1203167 -1170403 -1155853 -1125522 -1140438 -1168846 -1169056 -1172205
10936 -1172205 -1207074 -1194313 -1172621 -1148640 -1150924 -1124949 -1106372 -1103442 -1087397 -1120926 -1189143 -1194914
10924 -1194914 -1195603 -1137543 -1105032 -1076910 -1091719 -1096405 -1090796 -1094861 -1120816 -1063441 -1031814 -1035607
10912 -1035607 -1113063 -1119752 -1050204 -1019201 -1056091 -1124359 -1150501 -1120915 -1148918 -1201595 -1189257
10901 -1189257 -1139357 -1137848 -1178379 -1180367 -1098055 -1023589 -1046380 -1107470 -1158443 -1146555 -1173364 -1137981
10889 -1137981 -1168866 -1203719 -1183932 -1155184 -1170181 -1195566 -1253394 -1215056 -1174139 -1136185 -1135737 -1145379
10877 -1145379 -1216955 -1194038 -1154808 -1193504 -1187097 -1204131 -1213579 -1272252 -1261536 -1210159 -1234693 -1217961
10865 -1217961 -1086748 -1019955 -1021834 -1074603 -1088489 -1111130 -1147401 -1171750 -1180135 -1114742 -1076095
10854 -1076095 -1055315 -1046043 -1094559 -1180336 -1201630 -1185750 -1125510 -1099056 -1119456 -1123225 -1094686 -1104568
10842 -1104568 -1068339 -1058789 -1082765 -1122663 -1121476 -1110732 -1130703 -1152569 -1173955 -1192937 -1206540 -1224910
10830 -1224910 -1172303 -1141795 -1134153 -1117010 -1114189 -1116447 -1124373 -1053738 -1050725 -1132455 -1172564 -1136999
10818 -1136999 -1102482 -1097581 -1109125 -1107493 -1107239 -1078091 -1043636 -1077826 -1152479 -1128755 -1061498 -1037052
10806 -1037052 -1073261 -1159124 -1205655 -1196411 -1153119 -1088322 -1101294 -1109945 -1092748 -1079377 -1135725 -1109902
10794 -1109902 -1121514 -1236180 -1235753 -1210083 -1113018 -1056723 -1056057 -1081416 -1103133 -1088515 -1094078 -1112849
10782 -1112849 -1143072 -1130024 -1126107 -1119834 -1027928 -993960 -1040405 -1096904 -1125833 -1127540 -1147629 -1147149
10770 -1147149 -1169617 -1177007 -1127224 -1099197 -1076116 -1094937 -1091856 -1079295 -1102245 -1105358 -1110911 -1164956
10758 -1164956 -1140431 -1079545 -1097690 -1101573 -1074194 -1024997 -1042402 -1088738 -1144365 -1186799 -1228476
10747 -1228476 -1205989 -1134271 -1055796 -1054159 -1063838 -1066787 -1063052 -1035984 -1070445 -1100059 -1138292 -1137543
10735 -1137543 -1132939 -1172620 -1147730 -1081980 -1079425 -1086845 -1079533 -1040359 -1117786 -1171343 -1128890 -1092560
10723 -1092560 -1125802 -1155442 -1158293 -1094390 -1027751 -992143 -979500 -1026642 -1046362 -1056445 -1070002
10712 -1070002 -1071220 -1018783 -1081325 -1123581 -1147388 -1104095 -1055612 -1050165 -1048884 -1062836 -1095838 -1148106
10700 -1148106 -1142896 -1127139 -1110326 -1124306 -1113131 -1100790 -1102881 -1075971 -1126964 -1121770 -1075222 -1057158
10688 -1057158 -1045797 -1038605 -1013150 -1010912 -1063574 -1157125 -1184761 -1176265 -1150679 -1078489 -1040695 -1060095
10676 -1060095 -1066945 -1083667 -1090840 -1111604 -1068446 -1018994 -1034854 -993969 -989011 -935400 -981813 -1061520
10664 -1061520 -1135683 -1110600 -1059549 -1039227 -1029449 -1049128 -1044356 -1030789 -1006230 -1057573 -1060351 -992231
10652 -992231 -982649 -993208 -975075 -1035809 -1064443 -1027456 -1090027 -1113970 -1065596 -1048413 -1022585 -1026774
10640 -1026774 -1004669 -1014538 -1026698 -977847 -1018421 -1058149 -1100975 -1101740 -1100588 -1118508 -1119302 -1102995
10628 -1102995 -1070957 -1042725 -1039010 -1121375 -1139270 -1115097 -1151163 -1173092 -1202382 -1241104 -1257053
10617 -1257053 -1212269 -1202465 -1155913 -1073636 -1057473 -1109868 -1087426 -1062415 -1070173 -1064959 -1075592 -1083203
10605 -1083203 -1018111 -1043066 -1101471 -1105264 -1069000 -1057149 -1031750 -1000457 -1036314 -1040598 -1040703 -1001865
10593 -1001865 -939771 -928839 -941626 -967412 -1000515 -983636 -1049311 -1104852 -1085035 -1096757 -1074084
10582 -1074084 -1046553 -1002022 -1027455 -1019977 -1068554 -1097695 -1030475 -1055334 -1050736 -1051630 -1059254 -1020420
10570 -1020420 -1024072 -1070306 -1105467 -1133326 -1158213 -1144863 -1054863 -1027489 -1066178 -1035877 -1063067
10559 -1063067 -1108703 -1069409 -1052418 -1033219 -1028642 -1048045 -994242 -908286 -903828 -1011749 -1090126
10548 -1090126 -1080009 -1089084 -1091275 -1089958 -1149760 -1119017 -1053433 -970609 -924689 -948583 -1005108 -1038886
10536 -1038886 -1048549 -1050134 -1045238 -1020292 -1038301 -994744 -977796 -1003042 -1030231 -1072744 -1060978 -1020345
10524 -1020345 -999719 -1017367 -1022303 -1048134 -1037772 -974273 -1024043 -1061294 -989308 -961021 -959195 -998852
10512 -998852 -1026668 -1062737 -1114227 -1103353 -1091245 -1092803 -1071409 -1013732 -951130 -915447 -917530 -928804
10500 -928804 -916353 -932179 -904581 -919465 -882087 -896179 -883252 -904146 -940575 -985824 -985255 -974035
10488 -974035 -967397 -917028 -939614 -980880 -993167 -1023554 -1021425 -968249 -951782 -948855 -925157 -957754
10476 -957754 -962774 -967312 -988998 -1027978 -1013478 -1000632 -958568 -980732 -976449 -1004085 -1032148 -1048965
10464 -1048965 -1005807 -986309 -993546 -991207 -1036205 -1037087 -1033626 -997792 -973357 -945265 -966062 -988456
10452 -988456 -981724 -958584 -1035306 -1040671 -1059316 -1063063 -1050727 -1034343 -988444 -952348 -972684 -964867
10440 -964867 -937943 -947267 -945956 -1001937 -1045831 -1038227 -973585 -948545 -964604 -953415 -915626 -933699
10428 -933699 -912775 -937383 -970637 -937435 -946816 -949364 -981552 -980580 -1012912 -996418 -964844 -1016180
10416 -1016180 -1022841 -987374 -949720 -965158 -917674 -886419 -845328 -890069 -999267 -1047583 -993682
10405 -993682 -924095 -959383 -922634 -877351 -892979 -888345 -918655 -920453 -942538 -1010235 -1065001 -1050313
10393 -1050313 -997338 -980615 -956450 -949944 -924183 -939575 -942967 -952961 -955593 -948400 -995246 -1000273
10381 -1000273 -941161 -915476 -908293 -930514 -954284 -924147 -874905 -816432 -857158 -921085 -921397 -858106
10369 -858106 -827643 -802713 -836388 -814894 -785128 -770091 -817967 -815238 -853771 -896523 -915770 -877746
10357 -877746 -810061 -759626 -783847 -800782 -770260 -724709 -751655 -760193 -743826 -678716 -649063 -611015
10345 -611015 -587695 -550343 -450359 -325913 -230762 -222497 -243013 -279323 -359322 -535431 -758486
10334 -758486 -870849 -1049711 -1285656 -1463981 -1522126 -1547625 -1592443 -1701643 -1763133 -1735343
10324 -1735343 -1698545 -1664438 -1572672 -1549893 -1516164 -1448609 -1408761 -1317916 -1298807 -1318449 -1371832
10313 -1371832 -1340148 -1283896 -1242250 -1255433 -1256965 -1264728 -1269596 -1225595 -1233315 -1277185 -1319340 -1409971
10301 -1409971 -1398490 -1299402 -1244405 -1214429 -1167568 -1181033 -1195726 -1184353 -1183103 -1254297 -1265443
10290 -1265443 -1198616 -1172536 -1192504 -1222518 -1191134 -1166869 -1141468 -1118772 -1108797 -1152303 -1221498
10279 -1221498 -1219290 -1205599 -1213332 -1166422 -1075895 -1081908 -1143330 -1121009 -1089146 -1098260 -1092706 -1104508
10267 -1104508 -1083811 -1056257 -1056582 -1060308 -1106477 -1107832 -1086392 -1085489 -1069716 -1055932 -1102687 -1100677 -1101437
10254 -1101437 -1127893 -1115706 -1046534 -1093092 -1109691 -1122850 -1125190 -1084226 -1095232 -1010829 -996995
10243 -996995 -1013642 -1064412 -1051343 -988456 -947623 -1010941 -1080954 -1023468 -974682 -972134 -1006501 -1029860
10231 -1029860 -1024446 -1048343 -1080035 -1001227 -951068 -1021441 -1031917 -1058864 -1108352 -1088863 -1060766
10220 -1060766 -1083270 -1109388 -1091923 -1129643 -1107596 -1097040 -1118140 -1138777 -1139857 -1093447 -1068460
10209 -1068460 -1020927 -1033629 -1017611 -1055554 -1138916 -1098831 -1029732 -955669 -1002842 -1009519 -1050877
10198 -1050877 -1073422 -1062045 -1043090 -1056798 -1085846 -1103039 -1085083 -1086874 -1015086 -990016 -989334 -1040093
10186 -1040093 -1012960 -1019697 -1024536 -1044306 -1049912 -1057217 -1043706 -1052271 -1045357 -991406 -956363 -973359
10174 -973359 -999382 -975779 -1016082 -1060160 -1040279 -1026278 -1011966 -1005563 -1030791 -1052807 -1055956 -1083291
10162 -1083291 -1068585 -1039892 -1056068 -1114637 -1093489 -1105392 -1089107 -1067361 -1046006 -1057960 -1053786
10151 -1053786 -1041181 -1030208 -1069637 -1042896 -1005968 -994244 -987731 -974451 -1061557 -1093388 -1090033 -1102125
10139 -1102125 -1023923 -997088 -1105494 -1181526 -1174608 -1164103 -1097431 -1100476 -1062364 -1042049 -1072000
10128 -1072000 -1078000 -1041859 -1038553 -1010400 -1018012 -1040806 -1065605 -1074378 -1002123 -923077 -928342 -945659
10116 -945659 -924542 -952959 -941768 -978248 -998361 -1007433 -1007010 -1042763 -1109236 -1097236 -1071106 -1031940
10104 -1031940 -1031553 -1011283 -1020740 -1049831 -1025982 -1085485 -1070183 -1034950 -1015466 -1058921 -1104018 -1076501
10092 -1076501 -1111482 -1140254 -1100888 -1043342 -1027667 -1008453 -976098 -1037402 -1071631 -1038810 -1051048
10081 -1051048 -1103244 -1073930 -1087459 -1114600 -1070855 -1024120 -980844 -967703 -1016817 -1012724 -982281
10070 -982281 -941723 -988964 -1045809 -1047609 -1098957 -1079893 -1023114 -1033318 -1103877 -1094577 -1062108 -1011254
10058 -1011254 -1046363 -1124791 -1111274 -1064387 -1066292 -1042573 -976635 -969626 -982634 -1053093 -1069611 -1047837
10046 -1047837 -1019163 -992386 -980268 -1011602 -1035135 -1034388 -1085473 -1083094 -990686 -988494 -1025996 -1020564
10034 -1020564 -1042523 -1110934 -1091637 -1054712 -999557 -1022589 -1023763 -944359 -864921 -908795 -931477
10023 -931477 -1001409 -1071796 -1028724 -984643 -980418 -945771 -991029 -1017106 -999562 -1019178 -1017377 -983221
10011 -983221 -976177 -985929 -1025870 -1028271 -1005077 -1036268 -1048487 -985446 -1024467 -1075643 -1077892 -1058081
9999 -1058081 -1071855 -1047967 -1047231 -1070997 -1074824 -1107910 -1060579 -1055177 -1070406 -1074633 -1071225 -1063948 -1065195
9986 -1065195 -1047861 -1006086 -1015107 -1088302 -1076488 -1049754 -1003456 -950603 -924482 -900723 -867250 -874655
9974 -874655 -932107 -967967 -965406 -937260 -930383 -938570 -948100 -954201 -949237 -929483 -986179 -981803 -970917
9961 -970917 -992219 -1008782 -972010 -894219 -947127 -1032161 -1062891 -1099003 -1095666 -1060976 -1040466 -1063527
9949 -1063527 -1094993 -1067150 -1035567 -1002086 -958757 -964909 -1030264 -1029523 -1011290 -992152 -1049062 -1015409
9937 -1015409 -939943 -957972 -998475 -995107 -941673 -949020 -965315 -972117 -983288 -999582 -930557 -950781
9925 -950781 -1042197 -1054771 -1072933 -1093292 -1062445 -1061555 -1038895 -1038381 -973252 -988802 -959141 -909268
9913 -909268 -939467 -946506 -926055 -943023 -951386 -937817 -938921 -974141 -1017548 -1034775 -1065029 -1084048
9901 -1084048 -1043823 -968335 -934225 -934742 -901221 -888824 -910183 -866466 -832553 -820513 -884400 -924571
9889 -924571 -933040 -986568 -1009719 -1007428 -1051407 -1127520 -1134986 -1089691 -1007380 -968253 -950180 -949568 -932144
9876 -932144 -953714 -951861 -909363 -912215 -952893 -955045 -946910 -977065 -1034224 -1041863 -998124 -971787 -1022801
9863 -1022801 -1070599 -1041996 -995187 -956667 -982571 -1002393 -1025482 -1009861 -982173 -939774 -934506 -962657
9851 -962657 -1009175 -1047417 -1032831 -1058020 -1120744 -1062321 -1054973 -1068995 -1129011 -1207665 -1152498 -1081466
9839 -1081466 -994130 -941211 -952974 -997237 -1010419 -936518 -973376 -1013167 -997184 -959028 -953996 -943836
9827 -943836 -988181 -1016604 -1010434 -1005299 -988341 -1036411 -1074519 -1054863 -987159 -986104 -1012880 -959461
9815 -959461 -975089 -984621 -991894 -960713 -980135 -1012500 -1012064 -976414 -987345 -1007151 -988921 -980306 -1027589
9802 -1027589 -984762 -935168 -954599 -983782 -1036708 -1075694 -1061372 -1087902 -1033493 -957455 -957191 -968499
9790 -968499 -941234 -962935 -967924 -999562 -969186 -925231 -977464 -992681 -977710 -975071 -1040960 -983216
9778 -983216 -912138 -942874 -1049320 -1044066 -1027401 -1000170 -939982 -951706 -992744 -954180 -951719 -959008
9766 -959008 -975104 -974172 -993646 -980369 -999790 -1026426 -1048966 -993035 -960207 -940882 -928673 -933156
9754 -933156 -959911 -950269 -939324 -963751 -990413 -985531 -974132 -1032419 -1034886 -993700 -999402 -1023460
9742 -1023460 -1000165 -959608 -982464 -963459 -978559 -1002156 -983535 -964395 -996864 -947939 -872423
9731 -872423 -831669 -809138 -852106 -898622 -917443 -942931 -964683 -913590 -926244 -953794 -973540 -971980
9719 -971980 -921646 -939612 -971787 -984290 -954370 -890248 -874095 -942044 -929236 -902160 -895335 -891097
9707 -891097 -909020 -972830 -1028925 -1026888 -1022497 -1008959 -970912 -1002587 -1044671 -994734 -973579 -994281
9695 -994281 -1016383 -987227 -956836 -965512 -949071 -879731 -878568 -874301 -888804 -910063 -924971 -995915
9683 -995915 -1063112 -1005813 -997380 -999130 -1030911 -964153 -933278 -952244 -921137 -872707 -875081 -871065
9671 -871065 -948423 -981105 -927543 -952818 -967173 -972177 -929173 -925541 -920174 -967096 -1013913 -1029923
9659 -1029923 -1030086 -1081998 -1038087 -1007584 -1016893 -974610 -939775 -928129 -903410 -810565 -805302 -800370
9647 -800370 -848793 -864025 -889758 -963346 -1044824 -1016498 -982202 -929691 -942270 -969025 -994422 -977873
9635 -977873 -966215 -923368 -900951 -881081 -883372 -886780 -925750 -965712 -1030676 -1039340 -1088306 -1061786
9623 -1061786 -977864 -916050 -866597 -891158 -944038 -911737 -861901 -845529 -879806 -944722 -960853
9612 -960853 -931280 -921961 -975231 -1032960 -1092909 -1013818 -966731 -981949 -956405 -992629 -1003435 -961180
9600 -961180 -946795 -935772 -897470 -881623 -849945 -783895 -790754 -841381 -861784 -925082 -975019 -955234
9588 -955234 -918248 -897785 -922278 -901378 -864530 -863981 -892153 -897369 -861047 -842291 -876441 -945542
9576 -945542 -968187 -973640 -976310 -990680 -978050 -945235 -925314 -892257 -845164 -851726 -896863 -933617
9564 -933617 -964621 -926492 -949791 -923287 -885724 -902949 -912927 -908428 -906506 -936356 -961377 -997633
9552 -997633 -1011693 -968804 -932877 -978174 -959109 -979407 -972905 -921128 -919570 -853195 -793189 -884452
9540 -884452 -923164 -924462 -991361 -980624 -944526 -924229 -956663 -938896 -906067 -933166 -927878 -920895
9528 -920895 -893756 -859941 -903047 -926001 -978401 -972641 -969500 -954247 -941184 -943359 -973708 -960721
9516 -960721 -973994 -945418 -882386 -904868 -946314 -966387 -969364 -943517 -933999 -922268 -907573 -873547
9504 -873547 -855505 -902110 -985186 -962451 -906780 -906359 -916541 -910915 -898784 -842074 -818414 -785637
9492 -785637 -793185 -865621 -887576 -879878 -810152 -746066 -817982 -838185 -807613 -845253 -879063 -874083
9480 -874083 -921730 -955145 -937770 -957319 -960965 -937422 -894071 -932591 -920444 -900484 -828248 -775331
9468 -775331 -779625 -787002 -860370 -910852 -909109 -911970 -937363 -883115 -876871 -877632 -901674 -964601 -1009653
9455 -1009653 -1004152 -934781 -877113 -894400 -939667 -952296 -894138 -921573 -892276 -851407 -841436 -893601
9443 -893601 -954367 -1005321 -1019160 -1007530 -956036 -925661 -906692 -826660 -764800 -825039 -836596 -888076
9431 -888076 -888198 -780709 -720075 -820348 -903000 -879948 -841610 -877143 -885982 -904085 -877437 -865622
9419 -865622 -874360 -871807 -864151 -901786 -938562 -984613 -930445 -944373 -985690 -959359 -955384 -956152 -917203
9406 -917203 -893111 -881572 -859806 -887493 -951011 -996680 -968810 -894105 -876500 -899843 -863748 -860228
9394 -860228 -835371 -791494 -811545 -860916 -853212 -854817 -883786 -892771 -857388 -846827 -892592 -856504
9382 -856504 -849278 -878271 -882871 -882701 -857657 -937706 -990160 -975642 -972848 -960014 -918936 -864940 -821651
9369 -821651 -842779 -885038 -875309 -878500 -909830 -852616 -816362 -823051 -854276 -895284 -894770 -909646 -951142
9356 -951142 -949689 -933209 -935243 -941125 -980135 -964140 -927444 -943431 -989326 -1016145 -990781 -974270
9344 -974270 -955192 -941180 -941992 -894472 -896830 -911121 -888290 -865080 -813804 -775819 -799271 -789367
9332 -789367 -803602 -811923 -835484 -849582 -862845 -908285 -973166 -925307 -894512 -903756 -871129 -859724
9320 -859724 -908963 -897156 -895110 -944442 -954468 -896057 -837595 -816201 -842266 -811167 -794778 -789414
9308 -789414 -838366 -884014 -886291 -912207 -863964 -833200 -819558 -774885 -796863 -836173 -881093 -946654
9296 -946654 -926253 -839543 -818023 -852750 -842303 -855315 -937298 -939055 -868237 -829959 -882542 -867515
9284 -867515 -835710 -862665 -883922 -887987 -863025 -876975 -897813 -864351 -827072 -819481 -819744 -841474
9272 -841474 -891206 -877166 -824292 -838869 -854852 -879268 -946544 -918096 -872793 -867302 -818858 -849887
9260 -849887 -857183 -864638 -891669 -882855 -834878 -770292 -753302 -777641 -810577 -797474 -851201 -898329
9248 -898329 -867025 -844390 -782933 -831943 -891433 -897757 -944878 -894680 -891671 -934944 -834468 -794255
9236 -794255 -777758 -815868 -854473 -858105 -813445 -796026 -804223 -770168 -801297 -789551 -771638 -806067
9224 -806067 -840272 -844132 -924019 -957036 -1019674 -934819 -818286 -843522 -905667 -890657 -878670 -864312
9212 -864312 -919388 -960768 -910069 -883553 -835925 -791042 -755823 -756256 -814804 -768840 -714083 -729102
9200 -729102 -747593 -755499 -806060 -806127 -779610 -833186 -822344 -743252 -797609 -863591 -827433 -828345 -857105
9187 -857105 -835376 -832295 -848317 -907282 -912266 -847399 -816379 -811035 -833284 -820109 -837878 -841944
9175 -841944 -845194 -858385 -789521 -757342 -774885 -785094 -829310 -808618 -786262 -809144 -802614 -784790
9163 -784790 -781583 -779263 -784104 -826193 -859900 -799994 -771631 -723332 -794065 -823810 -809381 -822361
9151 -822361 -847494 -827338 -829630 -809998 -818298 -873394 -907863 -858688 -805706 -766166 -751306 -728168
9139 -728168 -737107 -704780 -708450 -723394 -737017 -793544 -824893 -858110 -871636 -836614 -847695 -830177
9127 -830177 -840708 -865500 -886341 -811808 -827614 -844431 -815351 -803044 -830127 -843237 -815793 -789156
9115 -789156 -792275 -790973 -844473 -828916 -792279 -774553 -831748 -888922 -876818 -877496 -894197 -906865
9103 -906865 -899369 -877347 -902244 -945662 -957865 -970014 -956198 -921007 -917498 -908143 -909889 -897211
9091 -897211 -881980 -853009 -843537 -856644 -885685 -935700 -916842 -860414 -835324 -837204 -872626 -854976
9079 -854976 -854205 -867623 -847654 -859408 -894567 -903574 -911954 -928407 -886942 -809779 -818648 -857707 -901919
9066 -901919 -850995 -847479 -863333 -834098 -832683 -837701 -914694 -885489 -917119 -913227 -895269 -864658
9054 -864658 -823012 -799369 -775357 -779846 -835084 -850191 -865773 -910245 -891824 -895742 -878932 -790335
9042 -790335 -781518 -796897 -829848 -889651 -893851 -882769 -869642 -850111 -853524 -885552 -955256 -873329
9030 -873329 -832695 -858890 -853303 -840195 -822346 -806694 -837506 -849471 -858792 -833505 -806235 -812094
9018 -812094 -848751 -840291 -758380 -764007 -802596 -815593 -849570 -823753 -813773 -827266 -816293 -819156
9006 -819156 -813970 -763869 -730558 -726952 -712201 -760413 -762968 -815055 -848667 -807263 -809212 -799709 -791673
8993 -791673 -845879 -820819 -797627 -791167 -758569 -801144 -822082 -844019 -770655 -731397 -778671 -828341
8981 -828341 -834137 -832437 -842407 -825626 -731292 -726751 -822916 -841438 -850981 -845511 -808932 -799505 -826235
8968 -826235 -850888 -864782 -871945 -847697 -789511 -739801 -766603 -769065 -793616 -776011 -778843 -811925
8956 -811925 -836124 -895307 -881215 -857344 -815265 -790695 -817340 -838519 -853800 -805061 -781403 -805320
8944 -805320 -884131 -933282 -908202 -838047 -794318 -760088 -759272 -833418 -911634 -807298 -756247 -760474
8932 -760474 -737807 -739758 -751490 -798614 -805168 -862326 -864884 -829524 -842790 -861006 -906874 -868035
8920 -868035 -758314 -740960 -770650 -738025 -742191 -767431 -801909 -837093 -868499 -776345 -736020 -763074
8908 -763074 -783964 -781016 -776165 -698183 -678576 -734692 -767986 -764267 -753292 -765246 -703325 -771419
8896 -771419 -765536 -722806 -686763 -701811 -731119 -743420 -719778 -704434 -697159 -698888 -664609 -651313
8884 -651313 -707502 -752710 -799561 -833128 -749633 -742710 -681229 -630401 -626315 -652885 -686330 -703540
8872 -703540 -818409 -837825 -805167 -748750 -702522 -705469 -759932 -813189 -806899 -732608 -688943 -660623
8860 -660623 -694111 -744916 -822962 -903378 -922931 -904810 -872117 -861857 -877715 -891355 -852438 -846533
8848 -846533 -861013 -877493 -840846 -828841 -856661 -886792 -897830 -844492 -810281 -853368 -882173 -884203
8836 -884203 -870001 -888154 -852481 -871055 -934585 -960096 -954425 -867924 -804640 -759575 -821560 -799487
8824 -799487 -784049 -774090 -817774 -824680 -836078 -833711 -903858 -918013 -889729 -845202 -808265 -840885
8812 -840885 -867211 -815990 -797377 -797367 -840211 -867292 -836651 -743520 -711755 -785422 -841104 -783723
8800 -783723 -777487 -752911 -767867 -802124 -766261 -712055 -721025 -743887 -838339 -912221 -895140 -804267
8788 -804267 -738923 -741788 -798026 -796791 -779778 -776918 -795658 -821762 -906369 -892050 -834465 -764143
8776 -764143 -747041 -746813 -780225 -732340 -698367 -723276 -714813 -736212 -787704 -793222 -833524 -870746
8764 -870746 -802161 -759380 -699435 -648040 -646118 -680958 -707058 -758511 -767105 -794920 -815211 -780489
8752 -780489 -705121 -737502 -759633 -768399 -749884 -745076 -819688 -809795 -795498 -801274 -808243 -783217 -744802
8739 -744802 -747440 -731240 -735398 -786409 -794476 -765819 -744205 -761567 -801077 -816453 -764827 -794086
8727 -794086 -776226 -741558 -746041 -800565 -837173 -814634 -781715 -769988 -751645 -780235 -821820 -837051
8715 -837051 -776505 -809075 -797760 -778378 -789283 -813642 -804874 -796928 -814732 -810211 -869443 -877414
8703 -877414 -783617 -750280 -792328 -834635 -845790 -763080 -762794 -787098 -844040 -877189 -862372 -806947
8691 -806947 -752542 -764387 -745946 -700771 -710521 -750511 -764337 -781293 -801850 -824611 -776637 -739273
8679 -739273 -718364 -722716 -732592 -721182 -681570 -689085 -692369 -694272 -714673 -743136 -728266 -714855 -724608
8666 -724608 -798323 -835104 -792051 -746134 -705790 -725723 -745981 -780697 -735725 -681168 -670825 -707964
8654 -707964 -771788 -752342 -720003 -752693 -721186 -684978 -726015 -814308 -780886 -743906 -746444 -783005
8642 -783005 -846803 -783607 -749590 -778872 -795109 -773810 -724413 -657874 -662738 -707975 -748266 -753533
8630 -753533 -760348 -730296 -771686 -818198 -796480 -782273 -753159 -773144 -794364 -812398 -806547 -796384
8618 -796384 -822384 -815952 -780968 -766739 -726025 -697995 -723916 -796501 -807836 -733357 -737198 -747068
8606 -747068 -714968 -706647 -656498 -668922 -702178 -687557 -741858 -730221 -720584 -719095 -690838 -615387
8594 -615387 -628288 -661884 -698276 -773920 -847731 -875894 -889072 -915794 -877480 -805246 -785065 -873006
8582 -873006 -906449 -879867 -874343 -888141 -847106 -819305 -882903 -949875 -962347 -974893 -928424 -888712
8570 -888712 -876352 -872711 -874009 -850494 -803458 -791196 -847253 -871494 -807993 -764366 -789678 -792854
8558 -792854 -799665 -878488 -879218 -859560 -855976 -809142 -765442 -806010 -818648 -772140 -763974 -780469 -780705
8545 -780705 -827747 -843862 -795535 -772100 -750487 -763280 -847856 -901328 -887342 -829090 -799858 -819293
8533 -819293 -802876 -837384 -860829 -836412 -870076 -851269 -808115 -763339 -759364 -814124 -815667 -784509
8521 -784509 -758331 -731895 -710433 -732704 -746143 -758632 -732288 -646978 -657786 -700379 -725745 -756382
8509 -756382 -819032 -827546 -818095 -819237 -778507 -807485 -771857 -754019 -779652 -804726 -774403 -775759
8497 -775759 -763534 -730987 -748480 -813551 -801927 -768586 -741834 -719104 -716139 -741476 -751178 -755771
8485 -755771 -817373 -772152 -766307 -808317 -813977 -808876 -750817 -733954 -667555 -692962 -758886 -758507 -792697
8472 -792697 -862469 -905209 -851549 -811308 -775342 -799642 -762987 -741674 -773748 -812808 -889241 -929092
8460 -929092 -938151 -889281 -825461 -816243 -772781 -809123 -845018 -800331 -779240 -773542 -817217 -897858
8448 -897858 -930733 -913220 -850446 -786958 -714472 -703996 -717595 -710189 -787643 -778576 -762718 -782620
8436 -782620 -801905 -800970 -799143 -807480 -832866 -886847 -818071 -752449 -784106 -780521 -786617 -811763 -842043
8423 -842043 -871726 -863721 -848544 -820317 -801733 -815329 -718172 -642300 -649909 -650009 -736702 -787439
8411 -787439 -774195 -761157 -705412 -746429 -806209 -835740 -780203 -759939 -758566 -787547 -811858 -816061
8399 -816061 -808595 -761410 -739741 -707714 -694563 -756121 -724998 -689487 -653230 -685950 -761946 -802754
8387 -802754 -814223 -799176 -775096 -742012 -767244 -797856 -785092 -797456 -804399 -777044 -768047 -736775
8375 -736775 -717657 -716299 -716642 -689228 -711096 -759403 -744262 -787429 -771698 -781694 -801624 -773315
8363 -773315 -726588 -725512 -743934 -750805 -748906 -703717 -653298 -711306 -749112 -735762 -741197 -799031
8351 -799031 -876773 -881821 -849444 -809365 -751229 -789450 -795214 -770025 -762371 -737446 -736991 -787893 -766071
8338 -766071 -722782 -734249 -755473 -772405 -781516 -781439 -761093 -806098 -801013 -731119 -695406 -687919 -682302
8325 -682302 -663432 -631888 -588638 -616324 -654419 -722856 -730261 -762191 -712054 -705157 -768082 -777543
8313 -777543 -732810 -782357 -808722 -771169 -674900 -714001 -772036 -800381 -784554 -740021 -708402 -650448
8301 -650448 -659653 -664240 -594788 -591381 -661775 -663212 -646739 -626789 -631713 -649884 -710193 -693234 -710952
8288 -710952 -748494 -731918 -747047 -744968 -729595 -754045 -761158 -747646 -736789 -721144 -683990 -696691
8276 -696691 -741259 -740621 -762409 -813998 -785218 -745254 -732533 -764292 -731860 -714041 -743916 -755074
8264 -755074 -800825 -774918 -739788 -756397 -727006 -701302 -728341 -770615 -804920 -812245 -777213 -745633
8252 -745633 -728209 -665349 -623630 -657538 -721659 -745635 -737499 -813196 -833781 -801066 -734831 -680706
8240 -680706 -645425 -679755 -687940 -717366 -702444 -684967 -695035 -683549 -719960 -711776 -682037 -676341
8228 -676341 -700003 -709439 -682834 -653626 -626983 -618444 -664983 -748794 -743634 -708364 -697184 -746454
8216 -746454 -786546 -731076 -720568 -757503 -745246 -739641 -755944 -747610 -737195 -720493 -744591 -744022
8204 -744022 -735133 -724719 -786078 -822482 -820531 -790241 -754008 -706576 -716002 -761950 -808457 -864240
8192 -864240 -843949 -741744 -739293 -729103 -721708 -727246 -708833 -661122 -678712 -693699 -721326 -755337
8180 -755337 -773373 -749212 -748868 -752515 -761410 -775970 -702451 -718641 -764644 -741000 -688060 -671028
8168 -671028 -675539 -676240 -736553 -739441 -732365 -695595 -666754 -760629 -807452 -771223 -729928 -728918 -731397
8155 -731397 -721764 -756825 -735083 -690284 -731287 -734108 -711252 -714837 -752054 -719777 -713041 -709257 -662332
8142 -662332 -684959 -728911 -707390 -654734 -646119 -685134 -704365 -804789 -817133 -762804 -710891 -647814
8130 -647814 -662462 -713619 -742732 -700718 -684586 -652671 -696282 -682271 -700929 -686703 -654573 -666134
8118 -666134 -654606 -723588 -789784 -764752 -748156 -668372 -636457 -674404 -706516 -734935 -756561 -728198
8106 -728198 -759694 -767897 -747813 -712291 -645120 -697766 -722365 -788244 -740075 -725085 -762499 -780159
8094 -780159 -818663 -781833 -733447 -673740 -641576 -628855 -644965 -621795 -597855 -577938 -563886 -556195
8082 -556195 -616771 -701360 -752103 -771309 -737879 -693313 -640642 -638687 -619287 -620733 -668017 -695626
8070 -695626 -705962 -751556 -709515 -717184 -714991 -697438 -666294 -692952 -688395 -744369 -778147 -762396
8058 -762396 -722301 -763845 -712126 -664783 -693448 -699920 -670846 -681434 -701938 -680102 -686558 -726168
8046 -726168 -701727 -707400 -720575 -682032 -639055 -729948 -721724 -650738 -646205 -660982 -672830 -664041
8034 -664041 -658365 -603473 -538645 -589043 -573092 -595116 -618373 -650929 -681268 -708977 -722195 -671689
8022 -671689 -664720 -662802 -690226 -689617 -683455 -677734 -656036 -653169 -652470 -647095 -634067 -654199 -668518 -654021
8008 -654021 -652911 -672986 -678176 -666711 -620531 -652554 -666769 -705098 -691625 -696780 -774673 -834689
7996 -834689 -828942 -801565 -795911 -835524 -795605 -741999 -716889 -725448 -762224 -758750 -770493 -776914 -823618
7983 -823618 -855705 -830044 -759423 -749971 -624289 -619690 -608587 -602090 -589172 -598611 -596693 -652415
7971 -652415 -643154 -653139 -619674 -594106 -636445 -698626 -726389 -731171 -668164 -634122 -642700 -677051
7959 -677051 -645690 -642585 -663748 -748818 -788541 -810966 -833499 -882475 -826794 -771802 -726780 -703292
7947 -703292 -657143 -671260 -778402 -807384 -738289 -713112 -782198 -719061 -664153 -683074 -710804
7936 -710804 -700855 -747783 -791419 -798932 -794638 -750577 -692525 -717791 -739126 -771221 -776382 -756062
7924 -756062 -789091 -808828 -854909 -832771 -818888 -780758 -801779 -826356 -798720 -794350 -782554 -763040
7912 -763040 -747390 -736733 -736692 -765924 -748753 -777640 -771269 -731871 -702180 -674516 -696220 -736230
7900 -736230 -766803 -740683 -766343 -768171 -749295 -794805 -799273 -724502 -771983 -795060 -804142 -817686
7888 -817686 -754420 -750734 -762886 -741725 -738896 -768730 -689083 -694907 -754385 -769067 -778761 -779995 -804688
7875 -804688 -768827 -717956 -714630 -734390 -705914 -687873 -712779 -735632 -724323 -720437 -773485 -779041
7863 -779041 -723085 -679620 -631142 -723388 -772181 -689694 -692646 -713690 -753615 -772709 -710801 -702104
7851 -702104 -702296 -744373 -773122 -781795 -754159 -787095 -826424 -832586 -756141 -721174 -737501 -662789
7839 -662789 -671560 -680765 -702297 -730592 -732872 -716221 -715237 -754660 -715477 -764049 -799178 -716986 -640142
7826 -640142 -679126 -652941 -608145 -658639 -725209 -722678 -665610 -602122 -592354 -599920 -634096 -635759
7814 -635759 -655339 -635263 -672792 -716891 -701182 -693531 -735911 -788970 -758433 -725526 -697441 -646929
7802 -646929 -600973 -634582 -627651 -615377 -701350 -709458 -672519 -602402 -610585 -657202 -649232 -638378
7790 -638378 -656448 -644224 -631791 -626408 -676464 -735707 -767438 -729983 -653385 -663747 -695608 -642670
7778 -642670 -647491 -632129 -685690 -741744 -750723 -753052 -732696 -752390 -782512 -749119 -748748 -737994 -726745
7765 -726745 -722372 -753309 -756801 -696555 -643597 -653963 -643810 -634010 -677774 -732308 -736151 -761232
7753 -761232 -730769 -684176 -714798 -761537 -709110 -697633 -724309 -760403 -725124 -637366 -565035 -543373
7741 -543373 -566890 -608409 -642534 -712687 -779734 -829217 -811612 -727626 -687042 -614963 -637020 -646201
7729 -646201 -644977 -668136 -650690 -675400 -759956 -757329 -725478 -742913 -742498 -711742 -692129 -628668
7717 -628668 -669225 -669511 -685541 -726393 -731095 -716141 -711413 -719875 -767303 -777025 -761194 -761547 -733323
7704 -733323 -734071 -725643 -661222 -691121 -705110 -656991 -600914 -651961 -681354 -693459 -716989 -761175
7692 -761175 -771147 -729321 -697177 -721616 -749613 -770033 -764396 -757647 -726040 -723517 -750562 -748462 -736918
7679 -736918 -703951 -660733 -692946 -715754 -650808 -655794 -645703 -648176 -645181 -651183 -615400 -577723
7667 -577723 -629951 -690202 -653937 -578571 -576644 -612554 -631471 -680893 -668346 -651883 -680026 -666267
7655 -666267 -747435 -770909 -743991 -719954 -684285 -698795 -701960 -676144 -720615 -717711 -701255 -695214
7643 -695214 -730001 -628098 -560944 -618738 -750691 -725683 -691596 -702412 -657008 -661702 -701401
7632 -701401 -758654 -718448 -716287 -706769 -676236 -707900 -673303 -694088 -692358 -637973 -660557 -764732
7620 -764732 -781385 -722888 -657690 -670662 -713021 -787121 -811939 -778918 -668183 -634479 -596336
7609 -596336 -576890 -615610 -654114 -688088 -687244 -688617 -686663 -596449 -591015 -679513 -678628 -698771 -682168
7596 -682168 -623939 -636694 -664381 -702649 -722616 -683716 -666083 -683735 -690199 -655880 -682940 -741718
7584 -741718 -765879 -699526 -699056 -690313 -644335 -657399 -692106 -724614 -719870 -746170 -726238 -640323
7572 -640323 -546387 -575328 -680802 -721683 -651933 -611141 -608263 -639032 -634112 -645868 -610424 -600481
7560 -600481 -630578 -656584 -680923 -673936 -626118 -617029 -622527 -562873 -531729 -549789 -537793 -624267
7548 -624267 -662638 -631211 -588683 -566012 -560375 -508653 -523513 -551783 -586734 -591414 -643328 -608943
7536 -608943 -562278 -603801 -604038 -618504 -687806 -730439 -680570 -620872 -600911 -537438 -581560 -607123
7524 -607123 -604101 -606196 -650186 -647909 -663511 -716281 -723939 -663492 -645491 -627903 -638668 -648024 -625401
7511 -625401 -646499 -618448 -563685 -598133 -622719 -609679 -620613 -614117 -589985 -582718 -616688 -627707
7499 -627707 -589022 -606291 -645174 -656715 -722029 -706883 -663007 -615738 -587625 -625525 -647173 -626309
7487 -626309 -645039 -678429 -702008 -703681 -728086 -692321 -644593 -667188 -712311 -670227 -687130 -746136
7475 -746136 -750834 -715987 -672049 -700652 -678705 -731629 -711346 -703535 -700190 -672531 -676933 -651743
7463 -651743 -611506 -637147 -631743 -604407 -638299 -670597 -705813 -654594 -604812 -635064 -681558 -668536
7451 -668536 -664165 -691783 -655571 -706157 -695405 -670561 -561630 -563733 -578383 -637584 -707593 -736654
7439 -736654 -720195 -732818 -764310 -778471 -762744 -736520 -743638 -726218 -679592 -640645 -679034 -670175
7427 -670175 -672181 -699356 -683181 -658344 -634866 -614417 -612615 -575382 -516407 -535173 -547526 -543523
7415 -543523 -568003 -580201 -570250 -619431 -682452 -765312 -757656 -719841 -637210 -651097 -646044 -608540
7403 -608540 -588786 -598073 -580468 -514445 -560157 -589385 -610640 -576609 -589159 -612035 -646978 -676831
7391 -676831 -695441 -733753 -736582 -707378 -662834 -715370 -699558 -704888 -695761 -664307 -652870 -653163 -604148
7378 -604148 -565064 -637669 -708368 -673832 -665993 -630539 -630055 -689505 -737321 -731361 -631754 -620139
7366 -620139 -626012 -605443 -639445 -610061 -556082 -609228 -643562 -629107 -660487 -696646 -603405 -558302
7354 -558302 -589231 -707211 -683821 -658967 -652972 -683781 -692025 -641214 -594593 -609489 -572524 -482960
7342 -482960 -451284 -525820 -584365 -619384 -704465 -724270 -680654 -661711 -695621 -664327 -673782 -686430
7330 -686430 -647673 -663116 -664280 -623064 -660817 -639480 -608814 -590780 -570531 -555216 -576707 -597772
7318 -597772 -619773 -597127 -616462 -657150 -646771 -621943 -681361 -663229 -661086 -661250 -653456 -614723
7306 -614723 -581715 -561600 -590096 -625283 -648773 -627503 -585605 -652296 -664881 -651182 -653630 -691643
7294 -691643 -684405 -676493 -626453 -617160 -600819 -635679 -620897 -581502 -619689 -674935 -670627 -668172 -666662
7281 -666662 -636961 -638372 -618093 -604277 -632945 -623982 -607618 -662153 -665058 -644944 -665320 -656014
7269 -656014 -642158 -631576 -591872 -619285 -654764 -633065 -587953 -621384 -607989 -649860 -635396 -663474
7257 -663474 -660146 -642857 -661097 -670870 -617388 -567578 -596447 -597559 -618238 -640994 -632336 -670590
7245 -670590 -631771 -651734 -669731 -637786 -626431 -595573 -534439 -610153 -619344 -610550 -646146 -617711
7233 -617711 -588648 -585088 -593473 -672233 -716205 -675970 -708838 -721171 -699656 -673575 -695596 -678888
7221 -678888 -617746 -571349 -568018 -569397 -565951 -544566 -550305 -521365 -526536 -572326 -592798 -587159 -610147
7208 -610147 -667456 -674557 -691171 -755050 -769051 -718754 -689286 -676614 -702094 -670550 -659991 -596739
7196 -596739 -585054 -551319 -571032 -581364 -622809 -627950 -635475 -615403 -632157 -688028 -695403 -666046
7184 -666046 -665442 -615930 -615240 -643958 -683418 -674689 -630602 -608359 -624343 -612555 -573062 -567855 -508164
7171 -508164 -560758 -605978 -561967 -539469 -580874 -667078 -732323 -740289 -708577 -679353 -644884 -664026
7159 -664026 -684954 -654453 -608048 -584790 -629841 -664333 -682005 -582445 -586580 -552572 -590069 -607238
7147 -607238 -658158 -703091 -645586 -615562 -568314 -564640 -633024 -677680 -628620 -617103 -564625 -577739
7135 -577739 -611760 -592258 -605168 -630757 -666378 -668321 -635889 -661771 -668390 -558265 -466687 -499465
7123 -499465 -528653 -529481 -566715 -635884 -614039 -540938 -568263 -619693 -654078 -657502 -616015 -544382
7111 -544382 -540015 -549028 -545437 -566811 -538236 -563941 -585762 -641467 -632329 -629060 -647693 -641042 -676610
7098 -676610 -672069 -680700 -623706 -559740 -575544 -625414 -629074 -683753 -704262 -676875 -658187 -616112
7086 -616112 -588431 -566355 -521570 -573463 -630906 -618262 -595833 -512878 -437752 -408597 -462433 -498464
7074 -498464 -544379 -539713 -574123 -642938 -690053 -667333 -618470 -628697 -623897 -648340 -681351 -639724
7062 -639724 -657281 -647883 -628189 -693809 -698264 -689291 -642350 -639149 -669259 -672380 -680143 -711921 -660621
7049 -660621 -587341 -559735 -602886 -628045 -663682 -658371 -695098 -704952 -636485 -613725 -577979 -550919
7037 -550919 -552548 -541677 -577339 -607617 -576612 -527945 -556411 -627179 -679764 -641391 -630292 -651829
7025 -651829 -665746 -655317 -628205 -545131 -559648 -520529 -577738 -599049 -575026 -609443 -606646 -632850
7013 -632850 -647632 -650158 -630852 -620600 -592846 -637956 -611250 -563380 -541343 -562132 -549393 -631756
7001 -631756 -668765 -652443 -620697 -618611 -625173 -564609 -611488 -652009 -710943 -730855 -671507 -660251
6989 -660251 -617116 -562610 -514468 -560500 -563052 -594940 -652203 -696416 -734918 -681948 -638204 -604491
6977 -604491 -553071 -545753 -643692 -683595 -624416 -564939 -557987 -570221 -563840 -590167 -538380 -529139
6965 -529139 -554920 -562453 -619391 -617690 -581058 -590604 -595920 -624208 -623379 -629705 -624168 -609108 -536864
6952 -536864 -537776 -557561 -591504 -556720 -569981 -608845 -615865 -638533 -656835 -587557 -546660 -537311
6940 -537311 -572372 -599452 -613738 -682326 -659801 -630944 -659530 -647461 -613927 -594552 -594501 -611215
6928 -611215 -575756 -664359 -693741 -633062 -561914 -599147 -596059 -572000 -560994 -614750 -634964 -679584
6916 -679584 -723055 -737822 -653542 -560596 -537310 -559388 -623208 -629393 -580799 -566412 -583194 -574936
6904 -574936 -562145 -551444 -569234 -565553 -617233 -636790 -646400 -656283 -640806 -634998 -607923 -612941 -609144
6891 -609144 -631565 -646324 -676709 -677292 -616477 -628432 -635015 -614160 -633534 -646231 -635643 -631285
6879 -631285 -633285 -572806 -544340 -517158 -507309 -605540 -619784 -579696 -596487 -628203 -614999 -583420
6867 -583420 -545144 -582839 -651559 -706502 -704705 -708782 -663956 -650001 -628456 -608097 -582083 -543550
6855 -543550 -605456 -571000 -611555 -587821 -562513 -583726 -610709 -600397 -603304 -652153 -591870 -531565
6843 -531565 -543695 -564613 -517406 -461856 -429156 -462336 -515618 -565409 -558296 -565967 -520086 -550363
6831 -550363 -601044 -599970 -555350 -557873 -510816 -552222 -580978 -583987 -560185 -617316 -623388 -583831
6819 -583831 -536413 -550977 -602043 -641297 -651806 -629967 -633537 -631229 -634181 -648165 -599553 -586685
6807 -586685 -612855 -602240 -638956 -670112 -747706 -735040 -661018 -603766 -578395 -599421 -598373 -513796
6795 -513796 -489848 -569073 -620864 -618780 -629114 -618976 -642066 -705270 -672367 -616552 -517708 -477264
6783 -477264 -508767 -549680 -550290 -526556 -451566 -440453 -492106 -520016 -472575 -541894 -675169 -662153
6771 -662153 -652243 -673947 -622744 -576632 -540883 -527674 -550344 -553133 -590120 -566385 -548120 -554375
6759 -554375 -557696 -539749 -601996 -689121 -719574 -690139 -665238 -652072 -588040 -548290 -552134 -581357
6747 -581357 -596946 -565201 -549273 -499135 -472357 -471503 -483157 -480045 -506588 -550694 -543916 -555653
6735 -555653 -547421 -498397 -444834 -478266 -510826 -523845 -524484 -580442 -601737 -597829 -504974 -437392
6723 -437392 -451419 -524583 -568511 -525935 -523183 -479421 -393785 -376966 -433689 -531754 -634428 -798630
6711 -798630 -890146 -847709 -797507 -730883 -701656 -732475 -742531 -776175 -806942 -697335 -610131
6700 -610131 -662809 -644036 -628144 -627978 -656348 -669725 -647678 -615100 -601437 -564852 -605538 -648691
6688 -648691 -697218 -709883 -632038 -601012 -632049 -616165 -666918 -702911 -691081 -618532 -546448 -575429
6676 -575429 -581901 -599077 -626893 -629893 -617558 -608080 -551336 -519716 -498723 -489286 -528019 -577088
6664 -577088 -652202 -709237 -668562 -659754 -697248 -668072 -569385 -563165 -586300 -579569 -599168 -587780
6652 -587780 -556383 -511753 -558198 -538169 -512520 -573361 -642768 -664185 -691656 -640004 -621942 -659606
6640 -659606 -679568 -642039 -600691 -546835 -514239 -543279 -595181 -567068 -578268 -614695 -657094 -638307
6628 -638307 -642098 -651247 -624404 -607777 -596237 -560109 -530980 -591173 -610352 -625061 -574052 -594151
6616 -594151 -599654 -566613 -545639 -557193 -635228 -599460 -580407 -612753 -604170 -621542 -584604 -588036
6604 -588036 -574168 -637570 -648078 -633023 -579891 -564067 -600499 -611408 -597496 -564376 -571924 -618964
6592 -618964 -640182 -573762 -504175 -528702 -509659 -492286 -488960 -504728 -524503 -574872 -684343 -702624
6580 -702624 -674452 -642506 -637829 -658550 -637354 -550339 -563865 -589845 -558768 -569012 -566205 -532198
6568 -532198 -510731 -529660 -545654 -570524 -593871 -652860 -716445 -698254 -701980 -669680 -615190 -613681
6556 -613681 -570960 -552298 -634344 -588640 -551956 -531224 -504198 -502406 -499753 -494482 -482451 -553750
6544 -553750 -537628 -515454 -501801 -554978 -597274 -619771 -595065 -628773 -687867 -700012 -679387 -635877
6532 -635877 -635721 -634998 -635874 -601946 -559225 -580509 -589459 -580687 -540213 -552066 -560158 -652096 -691786
6519 -691786 -638967 -560511 -582799 -595643 -576352 -629989 -625435 -617876 -562236 -553207 -552185 -524016
6507 -524016 -503822 -485777 -497460 -545715 -614743 -621347 -631957 -643286 -640992 -696667 -684043 -719537
6495 -719537 -698023 -607661 -545204 -591008 -669982 -723410 -686679 -622549 -552760 -532935 -585329 -619090
6483 -619090 -604144 -514070 -464008 -474346 -498947 -585485 -655547 -583662 -568167 -543589 -521167 -521505
6471 -521505 -479996 -493192 -572141 -573611 -555598 -564113 -589172 -608201 -600958 -568976 -569950 -578640 -623509
6458 -623509 -689799 -699353 -676121 -633558 -608535 -600983 -648658 -683780 -717465 -674163 -675151 -634007
6446 -634007 -653356 -624243 -505313 -471032 -536680 -539094 -570213 -619829 -687424 -654276 -648984 -545360
6434 -545360 -496606 -518037 -507915 -477905 -488296 -552227 -561040 -548199 -569698 -573879 -559297 -490433
6422 -490433 -531499 -551334 -536556 -541067 -516051 -522119 -522009 -530117 -566107 -581175 -583071 -582725 -580980
6409 -580980 -570566 -566194 -581214 -612002 -696100 -720245 -671451 -662475 -674369 -621933 -564662 -553096
6397 -553096 -538302 -518724 -558874 -557499 -527973 -496474 -523102 -562166 -548924 -511913 -533542 -526810
6385 -526810 -515264 -572420 -635837 -632653 -616073 -676287 -694874 -719161 -721819 -647168 -591938 -630108
6373 -630108 -715206 -718399 -654791 -586267 -559435 -560419 -608198 -610358 -617035 -611693 -542973 -486923 -529588
6360 -529588 -573600 -578125 -573318 -511735 -518548 -562053 -587980 -586166 -549570 -607628 -649576 -671578
6348 -671578 -582314 -547554 -573647 -597184 -579535 -577696 -595829 -571302 -575895 -560570 -578096 -605449
6336 -605449 -604775 -633196 -667977 -610799 -591571 -578587 -560878 -581910 -651947 -679121 -630291 -564231
6324 -564231 -578544 -651939 -642328 -594151 -551302 -545515 -520328 -495629 -503233 -489289 -477304 -537165
6312 -537165 -540946 -460099 -478017 -546145 -574464 -575963 -562797 -543060 -573070 -619475 -662843 -657491
6300 -657491 -590290 -552479 -571900 -562869 -546248 -467135 -455538 -530208 -588296 -638001 -719351 -645402
6288 -645402 -525460 -477752 -579067 -660321 -638957 -569456 -552950 -560361 -526434 -490430 -493442 -497905
6276 -497905 -545425 -563721 -532742 -557348 -590648 -566997 -519307 -492287 -521613 -547623 -550556 -572084
6264 -572084 -568721 -527625 -509135 -534608 -560763 -582791 -566517 -552349 -555514 -542197 -563880 -642917
6252 -642917 -635218 -578726 -589083 -657577 -636991 -636561 -619390 -637345 -631973 -573247 -536065 -515055
6240 -515055 -566644 -582926 -568298 -589493 -609417 -578469 -583188 -576099 -543101 -558228 -574598 -552061
6228 -552061 -573854 -594614 -605294 -597182 -565882 -536830 -532792 -500976 -478492 -515896 -528180 -515233
6216 -515233 -578061 -585447 -645961 -620180 -494998 -547133 -631677 -718227 -622982 -543492 -558284 -549607
6204 -549607 -500332 -511452 -534656 -539911 -528247 -562807 -610003 -577447 -553556 -571682 -573376 -531950
6192 -531950 -481468 -489691 -559987 -582674 -523530 -480498 -490731 -534924 -558478 -600855 -564434 -495802
6180 -495802 -542204 -570571 -605549 -634419 -638672 -620635 -609554 -580579 -519327 -501380 -480443 -516068
6168 -516068 -533594 -537417 -565623 -538214 -579194 -567812 -542232 -554680 -603628 -607815 -612810 -557642
6156 -557642 -477563 -503026 -500197 -568557 -669202 -694444 -654498 -551338 -503754 -514155 -440996
6145 -440996 -357588 -330867 -382049 -454360 -472039 -469274 -471285 -486123 -519965 -542077 -553140 -479377
6133 -479377 -464334 -500427 -546408 -568634 -559247 -554280 -564950 -616915 -582090 -546079 -497571 -521461
6121 -521461 -608693 -586667 -556282 -612802 -591602 -564014 -572050 -599638 -548154 -520386 -533091 -565984
6109 -565984 -611792 -635354 -655327 -666446 -700074 -691374 -717981 -657845 -655845 -643863 -559874 -540955
6097 -540955 -537010 -521000 -545619 -530339 -539275 -557638 -530450 -498482 -469498 -534318 -560695 -573422
6085 -573422 -661671 -694805 -660318 -540429 -525237 -557760 -620370 -663899 -671680 -621036 -600636 -600069
6073 -600069 -616182 -603156 -598869 -645373 -647392 -627254 -624875 -584452 -566056 -524187 -477649 -476330
6061 -476330 -469394 -432324 -443250 -466298 -525948 -562919 -533087 -581384 -545497 -600958 -665290 -620647
6049 -620647 -575796 -533760 -497649 -510179 -530147 -532421 -540598 -556898 -561969 -540427 -557595 -609554
6037 -609554 -593917 -547404 -562627 -609038 -605781 -555465 -514537 -502650 -548249 -576326 -569545 -530308
6025 -530308 -531516 -547721 -539759 -484084 -524283 -591008 -615653 -596985 -618638 -711720 -689755 -656109
6013 -656109 -603855 -553754 -546567 -503686 -464651 -446164 -474291 -522333 -536476 -502093 -532323 -542938
6001 -542938 -536620 -521466 -513425 -512956 -569743 -594760 -607792 -620367 -617373 -584327 -583746 -609017 -682521
5988 -682521 -700589 -669990 -615097 -632022 -626882 -607281 -572507 -560125 -568693 -523175 -541512 -622271
5976 -622271 -593005 -571150 -585051 -581737 -552685 -559526 -541926 -527241 -545452 -553558 -536038 -496685
5964 -496685 -509742 -537537 -578729 -559069 -573745 -585802 -565566 -620376 -681754 -690076 -565712 -550668
5952 -550668 -498100 -485940 -513608 -525218 -496067 -472245 -527769 -575015 -543975 -494302 -529769 -575536
5940 -575536 -600992 -549456 -573960 -545105 -516146 -546444 -630911 -633476 -556670 -535995 -568143 -519796
5928 -519796 -525393 -559095 -575903 -630167 -630216 -571216 -584027 -539573 -465500 -471768 -486550 -480973 -506302
5915 -506302 -574659 -543736 -512698 -554791 -586395 -599261 -618805 -585059 -507991 -549485 -561792 -540324
5903 -540324 -563247 -591888 -578565 -543916 -560091 -582025 -625274 -691095 -679627 -694109 -724308 -671745
5891 -671745 -612882 -578651 -550731 -536171 -540350 -546211 -615880 -593745 -491635 -455484 -436911 -480108
5879 -480108 -466146 -460611 -446826 -443944 -488138 -504075 -523234 -494827 -519697 -516362 -512438 -512204 -462368
5866 -462368 -438482 -490018 -552005 -555395 -584400 -634811 -588742 -529970 -646897 -678085 -616695 -516433
5854 -516433 -478657 -433737 -394859 -442859 -507904 -556521 -553160 -495590 -506544 -573717 -571653 -532889
5842 -532889 -479733 -530090 -555178 -558589 -513963 -451823 -502709 -566678 -569996 -528744 -551649 -568155
5830 -568155 -572990 -567700 -555831 -603968 -653834 -651068 -628329 -588420 -546635 -558404 -578905 -579336 -490685
5817 -490685 -457882 -510779 -584687 -593406 -586570 -588559 -582041 -487372 -491031 -552077 -590303 -646471 -596928
5804 -596928 -522642 -486809 -525360 -519111 -509303 -507977 -484261 -394733 -370294 -394763 -441561 -455135
5792 -455135 -424697 -370302 -489962 -550690 -569321 -555759 -480882 -434976 -443869 -473434 -456171 -446030
5780 -446030 -436281 -488158 -498452 -541791 -549361 -585081 -555180 -549713 -543502 -487305 -503790 -515850
5768 -515850 -515720 -566825 -569646 -534101 -508995 -496580 -457317 -470915 -479967 -496899 -482936 -476472 -506698
5755 -506698 -531325 -472485 -464502 -514968 -519374 -470950 -522617 -592915 -557326 -538048 -503206 -489127
5743 -489127 -564508 -593514 -555383 -575231 -598644 -598695 -604419 -578911 -560592 -520073 -504342 -483239
5731 -483239 -507891 -496317 -520021 -540078 -575724 -577997 -531141 -527658 -579313 -588127 -533628 -500112
5719 -500112 -467422 -450114 -482545 -479451 -526275 -558970 -628811 -641984 -568060 -519821 -476223 -516851
5707 -516851 -554654 -512910 -533850 -571961 -543679 -501807 -485779 -474597 -445592 -423924 -450231 -451087
5695 -451087 -469204 -476108 -504017 -549254 -536346 -497171 -496817 -480834 -455878 -538154 -559266 -504118
5683 -504118 -509924 -503112 -533841 -575093 -544715 -480824 -453631 -502590 -538460 -611364 -603187 -600999
5671 -600999 -604866 -566590 -515734 -534084 -519342 -542373 -561430 -490654 -483329 -499006 -522673 -520377
5659 -520377 -468554 -425824 -453293 -477919 -447801 -406958 -425368 -434198 -453402 -448936 -438104 -468962
5647 -468962 -478905 -480141 -550974 -591037 -618072 -614311 -601327 -596070 -581796 -599452 -548135 -528174
5635 -528174 -526217 -487429 -578208 -610631 -548232 -517870 -527701 -544910 -566664 -537322 -539675 -655571
5623 -655571 -685047 -657712 -623461 -583432 -593706 -586052 -571361 -509704 -541151 -582637 -537979 -504437
5611 -504437 -455470 -503896 -559773 -547766 -534550 -561664 -563251 -529267 -507472 -490616 -443390 -406719
5599 -406719 -443527 -485340 -452681 -425472 -435760 -429215 -444730 -480700 -475103 -511764 -568711 -607295
5587 -607295 -642457 -561175 -575730 -577343 -483707 -472392 -466266 -523653 -583159 -613053 -595291 -555099
5575 -555099 -511235 -529066 -559616 -501587 -459948 -470414 -471468 -546073 -557409 -547629 -528277 -511713
5563 -511713 -502459 -511358 -521277 -520817 -576547 -559492 -550686 -543231 -521136 -516743 -549131 -511726 -500300
5550 -500300 -519021 -550462 -571039 -545358 -522938 -514026 -511395 -542508 -582240 -552474 -501524 -480156
5538 -480156 -483502 -486502 -479946 -496018 -534443 -568915 -618506 -648436 -593359 -532923 -536539 -456609
5526 -456609 -460566 -480236 -477560 -506569 -504242 -531017 -589650 -588437 -578821 -603404 -607076 -568798 -541452
5513 -541452 -559059 -520599 -575698 -525986 -534221 -519788 -534594 -531747 -528936 -497941 -487741 -522852
5501 -522852 -502884 -482225 -481284 -450430 -433049 -462331 -534036 -603652 -588260 -574386 -557058 -522143
5489 -522143 -562232 -590293 -584336 -574577 -524450 -471006 -512523 -558690 -537361 -595491 -562015 -522550
5477 -522550 -510390 -529288 -519583 -495815 -472247 -509658 -507201 -481011 -514720 -452972 -420642 -397924
5465 -397924 -385746 -390529 -463633 -428470 -414836 -409162 -466412 -528953 -537316 -489045 -443480 -543069
5453 -543069 -588615 -556984 -531466 -531091 -532486 -529071 -507792 -523331 -495459 -463388 -544588 -580673
5441 -580673 -524784 -523581 -597236 -653491 -611734 -542942 -555153 -535209 -501620 -489063 -475541 -454136
5429 -454136 -465409 -444575 -457914 -457562 -468177 -446483 -448622 -436355 -484295 -531823 -486989 -451082
5417 -451082 -500974 -488437 -442149 -406346 -388902 -396300 -389729 -454398 -498784 -510457 -524448 -514205
5405 -514205 -450651 -439406 -416940 -442649 -471100 -545179 -645384 -649551 -622647 -619267 -599606 -542766
5393 -542766 -524710 -438727 -400076 -385087 -415123 -452694 -470022 -498905 -491121 -503195 -533940 -526976
5381 -526976 -570404 -583517 -601216 -513610 -510364 -562733 -594854 -557909 -602170 -640044 -624254 -649339
5369 -649339 -593145 -559628 -564204 -552488 -550486 -554328 -457412 -343093 -328921 -367877 -420289 -396358
5357 -396358 -387832 -357453 -417628 -503261 -544037 -553432 -538415 -554042 -633621 -678235 -708670 -671181
5345 -671181 -669600 -631995 -571473 -544401 -533993 -540140 -496234 -475036 -514488 -526513 -486219 -428326
5333 -428326 -431160 -471534 -519032 -578666 -581293 -576403 -591430 -590102 -505908 -446297 -403640 -369162
5321 -369162 -421736 -450138 -473224 -462482 -469308 -490150 -508133 -559152 -513353 -514875 -528716 -502080
5309 -502080 -509827 -524574 -455201 -464662 -502475 -455863 -426824 -482557 -522895 -557254 -563946 -599313
5297 -599313 -612829 -606231 -551529 -557472 -524787 -484161 -507147 -490903 -417852 -429844 -493831 -489680
5285 -489680 -506909 -601745 -620524 -643851 -618486 -586840 -496638 -445241 -447555 -455646 -511988 -523559
5273 -523559 -455741 -422259 -417672 -449700 -437133 -481115 -537910 -514675 -479791 -468797 -518923 -511209
5261 -511209 -475346 -491058 -495223 -493719 -476513 -486520 -491844 -502223 -542992 -572801 -547983 -519578
5249 -519578 -508876 -514884 -541293 -566249 -594640 -594806 -561678 -533903 -523378 -515388 -465116 -429896
5237 -429896 -438400 -494941 -528683 -557785 -552879 -507890 -487751 -513171 -510915 -531174 -484719 -482536
5225 -482536 -469966 -446830 -463158 -520542 -544011 -537018 -517157 -491547 -492915 -466418 -436762 -454641
5213 -454641 -469847 -474646 -459730 -481506 -522874 -499447 -497418 -479028 -459038 -405659 -422101 -382439
5201 -382439 -416700 -451719 -413638 -413643 -453128 -453008 -477327 -471442 -488440 -454000 -461368 -496161 -525003
5188 -525003 -504435 -523212 -502648 -518417 -492234 -432802 -481148 -573446 -581709 -523779 -510201 -438085
5176 -438085 -408976 -444744 -499561 -535754 -560927 -603888 -582474 -539542 -490117 -487820 -516858 -531047
5164 -531047 -576286 -588732 -548073 -506441 -507862 -516521 -526714 -569763 -616078 -539460 -514684 -520644
5152 -520644 -556908 -553212 -557039 -477500 -424893 -396468 -422036 -409798 -425774 -492641 -482449 -481641
5140 -481641 -523857 -486593 -462033 -466242 -463191 -453086 -442564 -460705 -438325 -417353 -434025 -404090
5128 -404090 -466066 -430615 -383076 -375799 -419365 -485576 -462883 -482188 -469105 -544962 -548644 -514123
5116 -514123 -530703 -513886 -527922 -570119 -573190 -543038 -511794 -519930 -493623 -456274 -463347 -558979
5104 -558979 -634806 -614103 -585411 -541312 -468837 -418591 -400687 -514283 -525886 -500270 -496399 -447903
5092 -447903 -408411 -419584 -404881 -475986 -538794 -500517 -494720 -464906 -500284 -487242 -515880 -563074
5080 -563074 -568903 -498870 -475316 -473710 -498559 -516976 -512217 -480020 -497708 -534777 -537739 -476498
5068 -476498 -481386 -453253 -455910 -521113 -465910 -447282 -457748 -474117 -524358 -482265 -453286 -487890
5056 -487890 -497005 -493872 -457833 -441209 -459138 -442067 -399526 -393051 -387105 -421820 -397251 -423405
5044 -423405 -457807 -431767 -431213 -493526 -556487 -561819 -616048 -534430 -448038 -455425 -438043 -402564
5032 -402564 -447036 -472342 -454197 -459390 -473969 -442438 -450845 -448274 -441710 -441732 -511595 -516622 -518471
5019 -518471 -553646 -501311 -429601 -435123 -407240 -374812 -374188 -447660 -521407 -506901 -411932 -374647
5007 -374647 -357779 -359137 -394018 -463797 -498390 -515666 -532763 -524578 -473281 -475559 -519137 -491738
4995 -491738 -473623 -477508 -476873 -459430 -480036 -493726 -466941 -467038 -512580 -548330 -551004 -506344 -481310
4982 -481310 -458485 -481612 -475192 -465112 -451965 -509479 -495389 -443928 -463272 -498662 -521988 -577938
4970 -577938 -568363 -533041 -482385 -493418 -543216 -499132 -522222 -524014 -529831 -526055 -423210 -366129
4958 -366129 -417794 -427158 -447896 -492862 -409827 -371969 -507035 -556596 -522935 -479688 -486258 -523195
4946 -523195 -541712 -517411 -551365 -553539 -510485 -541021 -569853 -573189 -549604 -565900 -553903 -516099
4934 -516099 -528688 -520819 -486400 -496692 -531889 -509292 -439750 -402298 -431419 -453325 -480222 -530868
4922 -530868 -501104 -466433 -454845 -425346 -416464 -457182 -437736 -428588 -438709 -487081 -449657 -409515
4910 -409515 -443899 -490699 -462579 -458383 -419803 -452811 -479816 -476089 -447539 -485850 -504994 -477937
4898 -477937 -457685 -499280 -527287 -505053 -481863 -499626 -559092 -584286 -553634 -553580 -571616 -506127
4886 -506127 -448685 -458248 -488724 -498457 -540524 -597201 -631447 -614142 -498100 -507040 -546526 -570962
4874 -570962 -572153 -540555 -522553 -547511 -612341 -651796 -583360 -544021 -534790 -509072 -540421 -569115
4862 -569115 -548260 -521884 -507088 -457751 -428645 -401740 -431314 -464486 -468690 -436023 -454863 -501888
4850 -501888 -489303 -480436 -473778 -445321 -414392 -451958 -538326 -565711 -533646 -508100 -555626 -606603
4838 -606603 -614059 -613643 -583009 -531953 -528634 -494929 -462407 -504800 -493900 -429940 -419770 -405872
4826 -405872 -372693 -430876 -494272 -526501 -565588 -592205 -599459 -642085 -646156 -631205 -569287 -498714
4814 -498714 -480496 -483471 -477465 -517985 -510070 -448796 -479808 -513980 -524534 -496576 -419126 -418738 -488278
4801 -488278 -550932 -547961 -522388 -465028 -474715 -506377 -570180 -557643 -501659 -439613 -443335 -452893
4789 -452893 -435930 -446176 -520106 -532105 -521352 -524758 -600275 -597686 -588680 -621799 -607734 -561551
4777 -561551 -526134 -490472 -524028 -529209 -495885 -512459 -515244 -513287 -546585 -526577 -467130 -462621
4765 -462621 -472033 -516709 -487931 -478311 -456994 -460352 -463253 -483898 -479062 -475679 -514178 -502937 -512086
4752 -512086 -507084 -489654 -471808 -472663 -495169 -463082 -480095 -498413 -539718 -549679 -537436 -496540
4740 -496540 -500036 -516265 -468105 -463739 -507926 -540337 -576401 -561875 -517739 -427092 -435804 -451662
$$ [...]
##END NTUPLES=NMR SPECTRUM
##END=
