##TITLE=Analysis number 317578
Compound Code cc 47109
Book Reference 437/64
Project Code qc-cat
Chemist Name wendyb
##JCAMPDX= 6.0         $$ Bruker NMR JCAMP-DX V2.0
##DATA TYPE= NMR SPECTRUM
##DATA CLASS= NTUPLES
##ORIGIN= Bruker BioSpin GmbH
##OWNER= nmr
$$ XWIN-NMR		Version 3.5
$$ Fri Feb 24 09:30:41 2006 GMT Standard Time (UT+0h)  MAYBRIDGE\nmr@NMR_250MHZ
##.OBSERVE FREQUENCY= 250.131544655141
##.OBSERVE NUCLEUS= ^1H
##.ACQUISITION MODE= SIMULTANEOUS (DQD)
##.ACQUISITION SCHEME= undefined
##.AVERAGES= 16
##.DIGITISER RES= 18
##SPECTROMETER/DATA SYSTEM= dpx250
##.PULSE SEQUENCE= zg30
##.SOLVENT NAME= DMSO
##.SHIFT REFERENCE= (INTERNAL, DMSO, 0, 16.5806)
##AUDIT TRAIL= $$ (NUMBER, WHEN, WHO, WHERE, WHAT)
$$ ##TITLE= Audit trail, XWIN-NMR		Version 3.5
$$ ##JCAMPDX= 5.01
$$ ##ORIGIN= Bruker BioSpin GmbH
$$ ##OWNER= nmr
$$ C:\u/data/dgb/nmr/ADRS/16850/pdata/1/auditp.txt
$$ ##AUDIT TRAIL=  $$ (NUMBER, WHEN, WHO, WHERE, WHAT)
(   1,<2006-02-24 09:30:19.54 +000>,<MAYBRIDGE\nmr>,<NMR_250MHZ>,
      <created by zg, POWCHK disabled, PULCHK disabled
       configuration hash MD5:
       84 BC 41 DB A1 6E 1D 46 DA 25 12 A5 C1 ED C5 3A
       data hash MD5: 64K
       1D 5D 1D BE 94 F6 2F 03 9C 34 FB F8 9F 36 20 98>)
(   2,<2006-02-24 09:30:32.49 +000>,<MAYBRIDGE\nmr>,<NMR_250MHZ>,
      <Start of raw data processing
       ef LB = 0.3 FT_mod = 6 PKNL = 1 SI = 32K 
       data hash MD5: 32K
       98 D4 C9 BE CF 31 20 12 70 3E 18 C0 7D 34 6E 62>)
(   3,<2006-02-24 09:30:34.43 +000>,<MAYBRIDGE\nmr>,<NMR_250MHZ>,
      <apk 
       data hash MD5: 32K
       AE 2A 80 19 6A B0 4A F9 C2 68 4F E2 01 D2 2F 11>)
(   4,<2006-02-24 09:30:35.13 +000>,<MAYBRIDGE\nmr>,<NMR_250MHZ>,
      <abs ABSG = 5 
       data hash MD5: 32K
       70 E9 A4 37 4C CC 0C 2A EB 90 1D 65 9C C1 C5 BC>)
$$ ##END=
$$ 
$$ hash MD5
$$ AB 8E 5C FD 29 0C 38 66 36 B2 48 0C CA E5 0A DC
##$RELAX= 
##$RELAX= 
##$RELAX= 
##$RELAX= 
##$RELAX= 
##$RELAX= 
##$RELAX= 
$$ Bruker specific parameters
$$ --------------------------
##$DU= <C:\u>
##$EXPNO= 16850
##$NAME= <ADRS>
##$PROCNO= 1
##$TYPE= <nmr>
##$USER= <dgb>
##$AMP= (0..31)
100 100 100 100 100 100 100 100 100 100 100 100 100 100 100 100 100 100 
100 100 100 100 100 100 100 100 100 100 100 100 100 100 
##$AQSEQ= 0
##$AQ_mod= 3
##$AUNM= <au_zg>
##$AUTOPOS= <8 >
##$BF1= 250.13
##$BF2= 250.13
##$BF3= 250.13
##$BF4= 250.13
##$BF5= 500.13
##$BF6= 500.13
##$BF7= 500.13
##$BF8= 500.13
##$BYTORDA= 1
##$CFDGTYP= 0
##$CFRGTYP= 5
##$CHEMSTR= <none>
##$CNST= (0..31)
1 1 145 1 1 1 1 1 1 1 1 1 1 1 1 1 1 1 1 1 1 1 1 1 1 1 1 1 1 1 1 1 
##$CPDPRG= <>
##$CPDPRG1= <>
##$CPDPRG2= <>
##$CPDPRG3= <>
##$CPDPRG4= <mlev>
##$CPDPRG5= <mlev>
##$CPDPRG6= <mlev>
##$CPDPRG7= <mlev>
##$CPDPRG8= <mlev>
##$CPDPRGB= <>
##$CPDPRGT= <>
##$D= (0..31)
0 1 0 0 0 0 0 0 0 0.06 0 0 0 0 0 0 0.0002 0 0 0 0 0 0 0 0 0 0 0 0 0 0 
0 
##$DATE= 1140773418
##$DBL= (0..7)
120 120 120 120 120 120 120 120 
##$DBP= (0..7)
150 150 150 150 150 150 150 150 
##$DBP07= 0
##$DBPNAM0= <>
##$DBPNAM1= <>
$$ [...]
##$SUBNAM7= <"">
##$SUBNAM8= <"">
##$SUBNAM9= <"">
##$SW= 20.6930455092707
##$SWIBOX= (0..15)
0 0 3 0 0 0 0 0 0 0 0 0 0 0 0 0 
##$SW_h= 5175.983436853
##$TD= 65536
##$TD0= 1
##$TE= 293.16
##$TE2= 300
##$TE3= 300
##$TEG= 300
##$TL= (0..7)
0 120 120 120 120 120 120 120 
##$TP= (0..7)
150 150 150 150 150 150 150 150 
##$TP07= 0
##$TPNAME0= <>
##$TPNAME1= <>
##$TPNAME2= <>
##$TPNAME3= <>
##$TPNAME4= <>
##$TPNAME5= <>
##$TPNAME6= <>
##$TPNAME7= <>
##$TPOAL= (0..7)
0.5 0.5 0.5 0.5 0.5 0.5 0.5 0.5 
##$TPOFFS= (0..7)
0 0 0 0 0 0 0 0 
##$TUNHIN= 0
##$TUNHOUT= 0
##$TUNXOUT= 0
##$USERA1= <user>
##$USERA2= <user>
##$USERA3= <user>
##$USERA4= <user>
##$USERA5= <user>
##$V9= 5
##$VALIST= <valist>
##$VCLIST= <CCCCCCCCCCCCCCC>
##$VD= 0
##$VDLIST= <DDDDDDDDDDDDDDD>
##$VPLIST= <PPPPPPPPPPPPPPP>
##$VTLIST= <TTTTTTTTTTTTTTT>
##$WBST= 1024
##$WBSW= 4
##$XGAIN= (0..3)
0 0 0 0 
##$XL= 0
##$YL= 0
##$YMAX_a= 439425
##$YMIN_a= -461462
##$ZGOPTNS= <>
##$ZL1= 120
##$ZL2= 120
##$ZL3= 120
##$ZL4= 120
##$ABSF1= 16.58061
##$ABSF2= -4.112564
##$ABSG= 5
##$ABSL= 3
##$ALPHA= 0
##$AQORDER= 0
##$ASSFAC= 0
##$ASSFACI= 0
##$ASSFACX= 0
##$ASSWID= 0
##$AUNMP= <proc_1d>
##$AZFE= 0.1
##$AZFW= 0.1
##$BCFW= 0
##$BC_mod= 0
##$BYTORDP= 0
##$COROFFS= 0
##$CY= 12.5
##$DATMOD= 1
##$DC= 0
##$DFILT= <>
##$DTYPP= 0
##$F1P= 14.0000005364418
##$F2P= -0.99999901652339
##$FCOR= 0.5
##$FTSIZE= 32768
##$FT_mod= 6
##$GAMMA= 0
##$GB= 0
##$INTBC= 1
##$INTSCL= 1
##$ISEN= 128
##$LB= 0.3
##$LEV0= 0
##$LPBIN= 0
##$MAXI= 10000
##$MC2= 0
##$MEAN= 0
##$ME_mod= 0
##$MI= 0
##$NCOEF= 0
##$NC_proc= -2
##$NLEV= 6
##$NOISF1= 0
##$NOISF2= 0
##$NSP= 0
##$NTH_PI= 0
##$NZP= 0
##$OFFSET= 16.58061
##$PC= 1
##$PHC0= 245.4427
##$PHC1= 4.727592
##$PH_mod= 1
##$PKNL= yes
##$PPARMOD= 0
##$PSCAL= 4
##$PSIGN= 0
##$REVERSE= no
##$SF= 250.129985339828
##$SI= 32768
##$SIGF1= 0
##$SIGF2= 0
##$SINO= 400
##$SIOLD= 32768
##$SREGLST= <1H.DMSO>
##$SSB= 0
##$STSI= 32768
##$STSR= 0
##$SW_p= 5175.98343685301
##$SYMM= 0
##$S_DEV= 0
##$TDeff= 65536
##$TDoff= 0
##$TI= <Analysis number 999999
Compound Code 99
Book Reference 9
Project Code 9>
##$TILT= no
##$TM1= 0
##$TM2= 0
##$TOPLEV= 0
##$USERP1= <user>
##$USERP2= <user>
##$USERP3= <user>
##$USERP4= <user>
##$USERP5= <user>
##$WDW= 1
##$XDIM= 32768
##$YMAX_p= 279035130
##$YMIN_p= -197717
$$ End of Bruker specific parameters
$$ ---------------------------------
##NTUPLES= NMR SPECTRUM
##VAR_NAME=  FREQUENCY,     SPECTRUM/REAL,   SPECTRUM/IMAG
##SYMBOL=    X,             R,               I
##VAR_TYPE=  INDEPENDENT,   DEPENDENT,       DEPENDENT
##VAR_FORM=  AFFN,          ASDF,            ASDF
##VAR_DIM=   32768,         32768,           32768
##UNITS=     HZ,            ARBITRARY UNITS, ARBITRARY UNITS
##FACTOR=    0.157963299565203, 1,           1
##FIRST=     4147.30780507833, 0,            0
##LAST=      -1028.67563177468, 0,           0
##MIN=       -1028.67563177468, -197717,     0
##MAX=       4147.30780507833, 279035130,    0
$$ Real data points
##PAGE= N=1
##DATA TABLE= (X++(R..R)), XYDATA
$$ [...]
11606e21p848k979M045j554M189K075j328L208k103Q980O914M419K059n873j3511
$$ -521 -8369 -11348 -7303 -8857 -4668 -2593 -3921 -713 -2816 6164 13078 17497 19556 13683 172
11591A72m234O970K841j3221r05J0475L484J743J510J31j4592l079M238l534J633
$$ 172 -4062 2908 5749 -7472 -8377 2098 5582 7325 8835 8966 -5626 -8705 -4467 -8001 -6368
11576f368J2531L72q487n14O060j949k050N97l393q273k922N934J013K173j562
$$ -6368 6163 6535 -1952 -2466 3594 1645 -405 192 -3201 -11474 -14396 -8462 -7449 -5276 -6838
11561f838Q437N678J3368k24o569k553p463j594n082M657J727O721j296j2962
$$ -6838 1599 7277 20645 20421 13852 11299 3836 2242 -2840 1817 3544 10265 8969 -3993
11547c993n524L700J587j819m263l530P139M051L389N144N39J744k2m047j645
$$ -3993 -9517 -5817 -4230 -6049 -10312 -13842 -6703 -2652 737 5881 6420 8164 8142 4095 2450
11532B450M86O62k086k081K358J226J877j820P207k480j3585q663P740p55L411
$$ 2450 2936 3598 1512 -569 1789 3015 4892 3072 10279 7799 -5786 -14449 -6709 -7464 -4053
11517d053n540j953J672O954R089Q027k083m100j0105l746n831p62N342p02m893
$$ -4053 -9593 -11546 -9874 -2920 6169 14196 12113 8013 -2092 -5838 -11669 -12431 -7089 -7791 -12684
11502a2684o62k289M38J1333O500J347J0827L049m906R24K205m146n662q165L978
$$ -12684 -13346 -15635 -15197 -3864 2636 3983 14810 17859 12953 13877 16082 11936 6274 -1891 2087
11487B087J0691n733J329J0084R052J096n616j8814N515N70j0987J230Q391L858
$$ 2087 12778 7045 8374 18458 27510 28606 22990 4176 9691 10261 -726 504 8895 12753
11473A2753K644o778m91K243J850L877J658m374K488m470o699o134k931M160M640
$$ 12753 15397 8619 8128 10371 12221 16098 17756 13382 15870 11400 4701 -1433 -4364 -204 4436
11458D436P342R627L430J464l979m310J0214K0537J8929J8031J9120K4903J7331
$$ 4436 11778 21405 24835 26299 22320 18010 28224 48761 67690 85721 104841 129744 147075
11445A47075n184k1381k2975j6270Q274K4034K6461J5473j8638k2628j9300k4546
$$ 147075 141891 120510 97535 81265 89539 113573 140034 155507 136869 114241 94941 70395
11433G0395j2680j5981k0022K041N836j802J828l141j2032Q087K940J0106L285
$$ 70395 57715 41734 21712 23753 29589 27787 29615 26474 14442 22529 25469 35575 38860
11420C8860O412Q795Q547K6612L3270K3687J4637P301j6268k6628j6223Q10K2330
$$ 38860 45272 54067 62614 89226 122496 146183 160820 168121 151853 125225 109002 109812 132142
11407A32142K9463M50j5125j7055k8950k5659k3044j7080q739O589J5562K43r603
$$ 132142 161605 162055 146930 129875 100925 75266 52222 35142 26403 32992 48554 48797 39194
11394C9194j0851j087l386L881O773o256p959j1061lQ85J288k138r50N326L055
$$ 39194 28343 27256 23870 27751 34524 28268 20309 9248 9245 10130 11418 9280 8330 13656 16711
11379A6711j52L09k967N230o287j2176K379R286J546J631m92M888L350j877M083
$$ 16711 16559 16868 13901 19131 12844 668 3047 12333 13879 15510 15018 19906 23256 21379 25462
11364B5462j029K000J919n525j783N459J1081k992k984n629r574k088N28o75J928
$$ 25462 24433 26433 28352 22827 21044 26503 37584 34592 31608 25979 16405 14317 14845 14170 16098
11349A6098M866p785R87m893L89P87r813L177O636M43o300j142k689m911J553
$$ 16098 20964 13179 14166 9273 9662 10449 636 3813 10449 10892 4592 3450 761 -4150 -2597
11334b597O825L651P542m699m648o983j4596l200R463J6051J2241m420l559M38
$$ -2597 4228 7879 15421 10722 6074 -909 -15505 -18705 -9242 6809 19050 14630 11071 11509
11320A1509n236K678J262O063M835p576n589K161l039N84k414K611M634M53q116
$$ 11509 6273 8951 10213 16276 21111 13535 7946 10107 7068 7652 5238 7849 12483 12936 4820
11305D820Q250J0633o355j2643J138J530k769Q941M728M496L152q001k820J3368
$$ 4820 13070 23703 17348 4705 5843 7373 4604 13545 18273 22769 25921 17920 15100 28468
11291B8468K4263K3065J5910k106j0331n091k7707k2707p205k435k387j53j340
$$ 28468 52731 75796 91706 89600 79269 74178 46471 23764 16559 14124 11737 11584 10244
11278A0244J722K897L210j32Q270l48j0682q213K978P847J0585P063O071K026
$$ 10244 11966 14863 18073 17941 26211 25863 15181 6968 9946 17793 28378 35441 41512 43538
11264D3538j8748j0908N330K306n649P032R173o027l276k930P75j064k530M716
$$ 43538 24790 13882 19212 21518 15869 22901 32074 26047 22771 19841 20616 19552 17022 21738
11250B1738N548J418n182m627k264K591n559J003N642k147Q580N570N614j0551
$$ 21738 27286 28704 23522 18895 16631 19222 13663 14666 20308 18161 26741 32311 37925 27374
11236B7374o848k561k763l80k975J1289P290K096l059l440n376K218P038p707
$$ 27374 20526 17965 15202 14822 11847 23136 30426 32522 29463 26023 20647 22865 29903 22196
11222B2196p896L334m708L065k097j703r116M658J0045N906O196k990n732L9j580
$$ 22196 14300 17634 12926 15991 13894 12191 3075 7733 17778 23684 29880 26890 21158 21197 19617
11207A9617J069L309J712o237j106L046j564L903K535p343m793N465Q20J854q099
$$ 19617 20686 23995 25707 19470 18364 21410 19846 23749 26284 18941 14148 19613 20433 22287 14188
11192A4188p827K096K164n146J2384R320q170j1018k589J0091K776P365l704n94
$$ 14188 6361 8457 10621 5475 17859 27179 19009 7991 5402 15493 18269 25634 21930 21336
11178B1336P108j552j1407Q25L29p085m317m185o452O399J4399M377n644n409
$$ 21336 28444 26892 15485 16310 16639 9554 5237 1052 -5400 999 15398 19775 14131 8722
11164H722l527O123N661j613N94l373m47J4488O61q552p088j0588p831J497O998
$$ 8722 5195 11318 16979 15366 15960 12587 12140 26628 27289 18737 11649 1061 -6770 -5273 1725
11149A725q06N004Q383M203P62j21J717R667J625p089J815O903j244J240N87j2213
$$ 1725 919 5923 14306 18509 19271 19150 20867 30534 32159 25070 26885 33788 32544 33784 34371 22158
11133B2158m381O552j880n16p780J34Q814J0672P855j2586k894N075J454o67j1159
$$ 22158 17777 24329 22449 21933 14153 14287 23101 33773 41628 29042 26148 31223 32677 32010 20851
11118B0851M86m147J700N920J930L914m098M868R055M246J238m618J076n400r522
$$ 20851 21337 17190 18890 24810 26740 30654 26556 31424 40479 44725 45963 41345 42421 37021 27499
11103B7499Q626P894O63J488r529K421l442j744m33O24M022M226j3468j3406r746
$$ 27499 36125 44019 44682 46170 36641 39062 35620 33876 33443 34067 38089 42315 28847 15441 5695
11088E695N172J0611L738O52k473M873J504Oj10M580J238O170P930k178o0m619
$$ 5695 10867 21478 25216 25868 23395 28268 29772 29778 29668 34248 35486 41656 49586 47408 47348 42729
11072D2729k809m982p002P918K0726p883j4327j1590j851N850J0887K769L327
$$ 42729 39920 34938 27936 35854 56580 48697 34370 22780 20929 26779 37666 40435 43762
11059D3762N462K700k898j1964j0623k63R330J0709m747j0105j100J0592O122
$$ 43762 49224 51924 49026 37062 26439 26176 35506 46215 41468 31363 30263 40855 46977
11046D6977L248m558n526m151R905R894q681l234K660J0732j0r860p338K467P539
$$ 46977 50225 45667 40141 35990 45895 55789 47108 43874 46534 57266 57256 47396 40058 42525 50064
11031E0064L290m03M652L490p47J919l287o145J0342L976M567M644j1248R44J3584
$$ 50064 53354 52951 57603 61093 60346 62265 58978 52833 63175 67151 71718 76362 65114 66058 79642
11016G9642n97q083J46k367K867R639j508J380q1K767o029j0548j4117m40o058
$$ 79642 79045 70962 71108 68741 71608 81247 79739 81119 81038 83805 77776 67228 53111 52671 46613
11001D6613j2560Q454J6736P389k545M586K247l219N771O856K5314J7377J5544
$$ 46613 34053 42507 59243 66632 64087 68673 70920 67701 73472 80328 105642 123019 138563
10988A38563L5266L9231N084j1587j1401q406k66J9901J6949o594k2386k0870
$$ 138563 173829 213060 218144 206557 195156 186750 186484 206385 223334 216740 194354 173484
10976A73484j8910j5741j0770j8019k3277k943P410M929M247J8988L1466L1133
$$ 173484 154574 138833 128063 110044 86767 83824 91234 96163 100410 119398 150864 181997
10964A81997K1842N2j3035k1359J59K2155K9056J7790Q254o840j2296K489o117
$$ 181997 203839 203891 190856 169497 169656 191811 220867 238657 246911 240071 227775 230264 224147
10951B24147k1178l1831k0908k2690r116n082n910l913M363j819k062m76R363
$$ 224147 202969 171138 150230 127540 118424 113342 107432 103519 107882 106063 104001 103525 112888
10938A12888J3005J1334l638j5271J4200K1487K2069K7721J1336o83j4721k1126
$$ 112888 125893 137227 133589 118318 132518 154005 176074 203795 215131 214448 199727 178601
10926A78601j9454r319O621K0780L6322N6048L7053N828j9740k0243k8808l1400
$$ 178601 159147 149828 156449 177229 213551 269599 306652 312480 292740 272497 243689 212289
10914B12289j8325j0524m63M518J0244O093N383K427l491J3461K7019L0475M1718
$$ 212289 193964 183440 182977 187495 197739 203832 209215 211642 208151 221612 248631 279106 320824
10901C20824P2463J02305J06912O1003o460o0941p3833n9601m4485j9407J0661
$$ 320824 393287 495592 602504 663507 657047 596106 522273 462672 418187 398780 409441
10890D09441L1283L9875K9310K5802J5594N244J0841L9002P5141R2054O3584M8870
$$ 409441 440724 480599 509909 535711 551305 556549 567390 606392 681533 773587 837171 886041
10878H86041O9694O3654P3032J13762O9561L0480M3375R2182J68116K81801M07730
$$ 886041 955735 1019389 1092421 1206183 1275744 1306224 1349599 1441781 1609897 1891698 2299428
10867B299428M88751N10762O10119R19809J530508K774669N113726P128889L504527
$$ 2299428 2788179 3298941 3909060 4828869 6359377 9134046 14247772 21376661 24881188
10858B4881188j592541l019802l517801k868377n80163K378545N836663N395029
$$ 24881188 23288647 20268845 16751044 13882667 13302504 15681049 21517712 26912741
10850B6912741q20999l858200m564272m953462l684778k185886j253264p37702
$$ 26912741 26091742 22233542 17669270 12715808 9031030 6845144 5591880 4854178
10842D854178n21465l81963k59739j29844J1714J10705K36110M24013N93632Q52718
$$ 4854178 4332713 3950750 3691011 3561167 3572881 3683586 3919696 4343709 4937341 5790059
10832E790059J350381K315648M243079P110343O677682N40176k946960l695171
$$ 5790059 7140440 9456088 13699167 20809510 27487192 28027368 25080408 21385237
10824B1385237l799402j976202R92983M630641O993498K323995l446399n009289
$$ 21385237 17585835 15609633 16602616 21233257 28226755 30550750 27104351 22095062
10816B2095062n676363n144437l353873j983361j220967q37559n87273m41764
$$ 22095062 16418699 11274262 7920389 5937028 4716061 3878502 3291229 2849465
10808B849465l76178l00537k40988j83798j59820j33898q0343o7240o9730m9608
$$ 2849465 2473287 2172750 1931762 1747964 1588144 1454246 1373903 1306663 1236933 1187325
10798A187325l8279m9858p0006q2015q6941o2008l2417Q36m591j5816j3981j1127
$$ 1187325 1149046 1099188 1029182 947167 860226 798218 765801 766637 762046 746230 732249 721122
10786G21122j4036p841l104k8354l3674j2982K5247L3981R856R627m753o0554
$$ 721122 707086 699245 696141 667787 634113 621131 646378 680359 690215 699842 695089 634535
10774F34535p7348p6885p1390n9671l7668r719L96J0953K1043J6663r129k7282
$$ 634535 557187 480302 408912 349241 311573 301854 302250 313203 334246 350909 341780 314498
10762C14498k6145k2187n879P302L2681L2242P817j7094k7885m2535l6497k0728
$$ 314498 288353 266166 260287 267589 300270 332512 340329 323235 295350 252815 216318 195590
10750A95590j3825j368J4898J8162q62j3571k1475k8398j3409o641k780r87K625
$$ 195590 181765 180397 195295 213457 212595 199024 177549 149151 135742 129101 126321 125334 127959
10737A27959l602p243j624O498m282l592l508P133r17j2918m899l762q750J1913
$$ 127959 124357 117114 115490 121988 117706 114114 110606 117739 116822 103904 99005 95243 86493 98406
10723I8406K1357O570l875r115j6335q565N764J0590J0303J968N390O765k071
$$ 98406 119763 126333 122458 113343 97008 88443 94207 104797 115100 117068 122458 129223 127152
10710A27152R58j498l862j3715j1627o874j984P68P79J2082J6354L545j3050o190
$$ 127152 128110 126612 122750 109035 97408 90534 88550 89318 90097 102179 118533 122078 109028 102838
10696A02838j8611k4036q636K599J4729R233R266J3795M73J8892L945L479J273
$$ 102838 84227 60191 51555 54154 68883 78116 87382 101177 101650 120542 124487 127966 129239
10683A29239q056l821k399P627M958M928Q26Q923R886j1248j0113o742N014q172
$$ 129239 121183 117362 114963 122590 127548 132476 133302 142225 152111 140863 130750 124008 129022 120850
10669A20850l62O509P809J3212N358n868j7678J496j228J965O477O985O803N969
$$ 120850 120488 126997 134806 148018 153376 147508 129830 131326 130098 132063 138540 145525 152328 158297
10655A58297p64P075R382J8323M1535M1213K4303K4266K5916M2059L7115L1070
$$ 158297 157533 164608 173990 192313 233848 275061 299364 323630 349546 391605 428720 459790
10643D59790N1440N5486O0487J08390J46093K12027L05083M54933P00919J195878
$$ 459790 511230 566716 627203 735593 881686 1093713 1398796 1853729 2554648 3750526
10633C750526K220796M256543N619782J311708k368857k956972l521954l025061
$$ 3750526 5971322 10227865 15847647 17159355 14790498 11833526 8311572 5286511
10625E286511j768390r65326n72844l81444k72435k16372j66202j27708j01533
$$ 5286511 3518121 2552795 1979951 1598507 1326072 1109700 943498 815790 714257
10616G14257q3230o5157m5892l7645l8227l4213k5824j7739k6059j4995n790O090
$$ 714257 631027 565870 519978 482333 444106 409893 384069 366330 340271 325276 319486 325576
10604C25576p333j4011j0492r964p9M115n22j0354k2102j8169k512k900p119n036
$$ 325576 318243 304232 293740 283776 283697 287812 287290 276936 254834 236665 234153 231253 224134 219098
10590B19098j4597j705M602j4178j4586r369o605j1939j3595M16k043k889k63
$$ 219098 204501 202796 207398 193220 178634 169265 162660 150721 137126 137542 135499 132610 132347
10577A32347P560N960M4J1827O418Q900N745j1790o758q297j2444n273P928n659
$$ 132347 139907 145867 145911 157738 164156 173056 178801 167011 160253 151956 139512 134239 142167 136508
10563A36508j5850l431P000j115J1690K2037J1470J4983J3807p955p804J948o531
$$ 136508 120658 117227 124227 123112 134802 156839 168309 183292 197099 189144 181340 183288 176757
10550A76757j2023J3679J3564N955m027j2721j9019q527P496J9288P514k74n40
$$ 176757 164734 178413 191977 197932 193905 181184 162165 153638 161134 180422 187936 187662 187122
10537A87122n491j1657j1329n67K168J010k266J1083R286K78O247J8902J9249
$$ 187122 181631 169974 158645 158078 160246 161256 158990 170073 179359 179637 185884 204786 224035
10524B24035J8158J3494K8370N9178M2745N30j8584k2639k2225n052R303J7930
$$ 224035 242193 255687 284057 343235 385980 386510 367926 345287 323062 318010 327313 345243
10512C45243K4874K1916j0744k2603j8688l8748l4172j3681J97K1882J2571P139
$$ 345243 370117 392033 381289 358686 339998 301250 267078 253397 253594 275476 288047 295186
10500B95186K0329J6908K3082L9136K3599L811J4566Q292J8914M1900O5844Q1953
$$ 295186 315515 332423 355505 394641 418240 422051 436617 444909 463823 505723 571567 653520
10488F53520M4555K2348J8575L6282N9847P5510P0797M2242K9762K2572L8912
$$ 653520 698075 720423 738998 775280 835127 910637 981434 1023676 1053438 1076010 1114922
10477A114922Q8971J57295J95260J61811J12629J12493J48178K28155L80071O26224
$$ 1114922 1203893 1361188 1556448 1718259 1830888 1943381 2091559 2319714 2699785 3326009
10467C326009J019756J745005L039622M059621K274439n36192j529495j793818
$$ 3326009 4345765 6090770 9130392 13190013 15464452 14928260 13398765 11604947
10459A1604947j443360m5892J955437M121681L801243Q6969k320624k984027l241928
$$ 11604947 10161587 10115695 12071132 16192813 19994056 20081025 17760401 14776374 11534446
10450A1534446k480254j319360m73378J82193Q17720J524888K761357N080118
$$ 11534446 9054192 7734832 7261454 7443647 8261367 9786255 12547612 17627730
10442A7627730Q813040J0483588M300770k873557n319687n956279m554610r88210
$$ 17627730 26440770 36924358 41225128 38351571 33031884 27075605 22520995 21532785
10434B1532785L350810P057385N118222j627832n308042o383445o433034m771557
$$ 21532785 24883595 31940980 37059202 35431370 30123328 23739883 17306849 12535292
10426A2535292k813156j504309p00611k90667r4327J97783O43926J333788K516985
$$ 12535292 9722136 8217827 7517216 7226549 7132222 7330005 7973931 9307719 11824704
10417A1824704M643461Q447464J1740503N419762l628242o379299p728198p403086
$$ 11824704 16468165 24915629 36656132 42075894 38447652 32068353 24340155 16937069
10409A6937069m900448k901771j802338j172621p81300n41890l69998k05239r5654
$$ 16937069 12036621 9134850 7332512 6159891 5378591 4836701 4466703 4261464 4165810
10400D165810l6476M8542J48536K70354N43578J085917K059066L738053M753847
$$ 4165810 4129334 4177876 4326412 4596766 5140344 6226261 8285327 12023380 16777227
10391A6777227J687413j345013j930737k042622j080096J109737M099478P879445
$$ 16777227 18464640 17119627 15188890 13146268 12066172 13175909 17275387 25154832
10383B5154832P608805m2770m512843n684047o365475n002198l060805j804867
$$ 25154832 32763637 32720867 28208024 22523977 16158502 11156304 8095499 6290632
10375F290632j134174p79692n69938l96334k60050j33604l4069J7815J01661K52243
$$ 6290632 5156458 4376766 3806828 3410494 3150444 3016840 2982771 3000586 3102247 3354490
10365C354490M49846Q07483J522123K893809M766891L733324p30872k618097l121506
$$ 3354490 3804336 4611819 6133942 9027751 13794642 17527966 16797094 14178997 11057491
10356A1057491l331497k401723j408800q29409m98135l18617k69644k47300j95669
$$ 11057491 7725994 5324271 3915471 3086062 2587927 2269310 1999666 1752366 1556697
10347A556697j52207j30490r8285o1439n1950p3362o9980n5113n1628o8217o7369
$$ 1556697 1404490 1274000 1175715 1114276 1062326 988964 918984 863871 812243 744026 676657
10336F76657p3068p5204n0194k1263j4655j1984p661J4479J3753j7378m1213k1174
$$ 676657 603589 528385 478191 456928 442273 430289 422628 437107 450860 433482 392269 371095
10324C71095l0932l4217r016k304l68O411L581J4884r99j5112k4251k4755l2740
$$ 371095 340163 305946 296930 294626 294258 300669 304250 319134 318135 303023 278772 254017 221277
10311B21277k2574j2553p613o277N041k459q575j3583j434j256r824m437J603
$$ 221277 198703 186150 178537 172260 177301 174842 166267 152684 151250 149994 140170 135733 137336
10298A37336o781j767O237J1706L433m688k562O196L857L234n791r729k3878m1004
$$ 137336 130555 128788 135025 146731 150164 145476 142914 149110 152967 156201 150410 140681 116803 75799
10284G5799j6667M320J852O216K313N2o827j6390k0428L953J331N082P351R300
$$ 75799 59132 63452 65304 71520 73833 73885 67058 50668 30240 34193 35524 40606 47957 57257
10270E7257J1754J8057K4634K0281N792J2482K7954K8337L3112J9985j5474l3975
$$ 57257 69011 87068 111702 131983 137775 150257 178211 206548 239660 259645 244171 210196
10258B10196l4306k2297j2444P654J6469K8011O772j7360k3583k5106k1995j2470
$$ 210196 175890 153593 141149 148803 165272 193283 200055 182695 159112 134006 112011 99541
10246I9541r674N26l570M312j723M779n894J440Q736O019M976O943J0439L048
$$ 99541 89867 90393 86823 91135 89412 94191 88297 89737 98473 104492 109468 116411 126850 129898
10232A29898R246K4829K8731p375k6952k9710l2171l5141j1523J0735L1656K0384
$$ 129898 139144 163973 192704 185329 158377 128667 96496 61355 49832 60567 92223 112607
10220A12607L053j507l879j4326j5657r833o062L520L018N743N500k475n941j8948
$$ 112607 115660 114153 110274 95948 80291 70458 64396 67916 70934 76677 82177 79702 73761 54813
10206E4813j9338j714p523r323J735J76J901M263O77k227l53K694k96J873n455
$$ 54813 35475 33761 26238 16915 18650 18826 20727 24990 25667 23440 23087 25781 25485 27358 21903
10191B1903M378k232K728Q42J4471R958M534m007l923k053K694K654M338l546
$$ 21903 26281 24049 26777 27619 42090 52048 56582 52575 48652 46599 49293 51947 56285 52739
10177E2739J823K283p962q529N74J894Q565K341K307O34N811J836m020M599N740
$$ 52739 54562 56845 48883 40354 40928 42822 51387 53728 56035 56669 62480 64316 60296 64895 70635
10162G0635K5620J6126Q520M590j2470k0509r682l726J993J0565r825o932j0728
$$ 70635 96255 112381 120901 125491 113021 92512 82830 79104 81097 91662 81837 74905 64177
10149F4177q409L28J344L278l203O105o93q973q763j753M755j0211L678O617O518
$$ 64177 55768 56096 57440 60718 57515 63620 62927 53954 45191 43438 48193 37982 41660 48277 54795
10134E4795n534m05Q722J5292L613m447l30k1209p493K683P94N732M197m003M491
$$ 54795 49261 48856 57578 72870 76483 72036 71706 50497 43004 45687 46481 52213 56410 52407 56898
10119E6898P707n482m476P75j320j128j554N576J1350J0259K760j779l062j5222
$$ 56898 64605 59123 54647 55422 54102 52974 51420 56996 68346 78605 81365 79586 76524 61302
10105F1302p926l713q044j1185l226j902m891P428O168J966J620J427j662l950
$$ 61302 53376 49663 41619 30434 27208 25306 20415 27843 34011 35977 37597 39024 37362 33412
10091C3412l38L313K240J5559P919l83K792J934j9243j1274j569J693o233l032
$$ 33412 33074 36387 38627 54186 62105 61722 64514 66448 47205 35931 34362 36055 29822 26790
10077B6790l613L328k888j4902m648J565O508p744o273M032M359N951R667n506
$$ 26790 23177 26505 23617 8715 4067 5632 12140 4396 -1877 2155 6514 12465 22132 16626
10063A6626j2435k489O066J1967J3002j754k2934K861n553J884P09Q63j332Q557
$$ 16626 4191 1702 7768 19735 32737 30983 8049 10910 5357 7241 7950 8813 7481 16038
10049A6038J0425L149n728R444r648j6137q202J1018J792O416o309o510O340m825
$$ 16038 26463 29612 23884 33328 23680 7543 -659 10359 12151 18567 12258 5748 12088 7263
10035G263l962p832l213N003O707M14M042M24L938n934l951m99M974k935l063
$$ 7263 3301 -4531 -7744 -2741 3966 4380 8422 8846 12784 6850 2899 2400 7374 4439 1376
10020A376l173l813o308J1708r58m698J511M434N220L656L610R250M056L073J850
$$ 1376 -1797 -5610 -11918 -210 -1168 -5866 -4355 79 5299 8955 12565 21815 25871 28944 30794
10005C0794q060q834j886O835J597r478j019M603L816O523l189o93l301m67m860
$$ 30794 22734 13900 12014 18849 20446 10968 9949 14552 18368 24891 21702 21009 17708 17241 12381
9990A2381j3984k866k50O323P38J511O84O408N757k416l748n833m353L783O942
$$ 12381 -1603 -4469 -4719 1604 2342 3853 4537 10945 16702 14286 10538 4705 352 4135 11077
9975A1077M953r512o833j799k983Q735J0382N406J2729J2517K6572J7355o174
$$ 11077 16030 6518 -315 -2114 -5097 3638 14020 19426 32155 44672 71244 88599 82425
9962H2425j163j0789k5753k3540r105o264n977R160J084o353k977k460J453j806
$$ 82425 81262 70473 44720 21180 12075 5811 -166 8994 10078 3725 748 -1712 -259 -2065
9948b065N136M002R72M28L603M350N877n477m896J1630o32o754q169L718J3294
$$ -2065 3071 7073 8045 8473 12076 16426 22303 16826 11930 23560 22928 16174 8005 11723 25017
9933B5017J1155R078J8083Q558K1505L9520J7996r496j6453k313j3033j824K2678
$$ 25017 36172 45250 63333 71891 93396 132916 150912 141416 124963 122650 109617 107793 130471
9920A30471K1948o022k0143k2559k8223j5873j2704K183k170p06l593O7P263J4117
$$ 130471 152419 146397 126254 103695 75472 59599 46895 49078 46908 46202 42609 42676 49939 64056
9906F4056L4047L9242J1306n271j4176j7443j697J3612J6163K8759k340l2449
$$ 64056 98103 137345 148651 143380 129204 111761 110064 123676 139839 168598 166258 133809
9894A33809l8633j3930j6288k2634q644l270l36M32R704J136O805J5721J6912
$$ 133809 95176 81246 64958 42324 33680 30410 30074 30506 40210 41346 48151 63872 80784
9881H0784L2814L9773Q466j3655j9357k6917k5051j5833j7147l74j0214j6649
$$ 80784 113598 153371 161837 148182 128825 101908 76857 61024 43877 43503 33289 16640
9869A6640J999M287J1588q777l400J6751J0925l007L165O362J5425L1962L6497
$$ 16640 18639 22926 34514 25737 22337 39088 50013 47006 50171 56533 71958 103920 140417
9856A40417J2153j4917k7377k5067j6613o434P164L1436K9744J7063l682j0867
$$ 140417 152570 137653 110276 85209 68596 62162 69326 100762 130506 147569 143887 133020
9844A33020j8804k4056j1290j0628q413j3871o659M878P64j661o424j506l156
$$ 133020 114216 90160 78870 68242 59829 45958 39299 44177 44941 43280 36856 35350 32194
9831C2194p420J989K1238R148J4628K5992L0659J6160p178l1154j8856j3563r748
$$ 32194 24774 26763 48001 57149 71777 97769 128428 144588 137410 106256 87400 73837 64089
9818F4089o152l089l030M244K397k999j0788O391J1223l450J1737R397K6126M7900
$$ 64089 57937 54848 51818 56062 58459 55460 44672 51063 62286 58836 70573 79970 106096 153996
9804A53996N1878P0027N9065N2934K7570j0300l3462n4615o6417n9748m9282l9068
$$ 153996 205874 275901 334966 387900 415470 405170 371708 317093 250676 190928 141646 102578
9792A02578k1245k4156k1587j5473Q73j262K467L138Q79j81L97l823r547K51O74
$$ 102578 81333 57177 35590 20117 20990 19728 22195 25333 26212 26031 26428 22605 13058 13309 13983
9777A3983q209m395J1111L583n028J881N349j246M86o18j1565p984J691j1662
$$ 13983 5774 1379 12490 16073 11045 12926 18275 17029 17515 16897 5332 -2652 -961 -12623
9763a2623K517P194L278O848N911L083L823O8k657M056L943n574r586p5k836j246
$$ -12623 -10106 -2912 366 7214 13125 16208 20031 20099 17442 21498 25441 19867 10281 10206 7370 6124
9747F124p046q188J2596p0j3462k131J0793M127K975Q12m308J756J650m559N969
$$ 6124 -922 -9110 3486 3416 -10046 -12177 -1384 2743 5718 6530 2222 3978 5628 1069 7038
9732G038n47q761l130Q785Q072j600o078L402N16r447j6675j2157M461m19m798
$$ 7038 6491 -2270 -5400 3385 11457 9857 3779 7181 7697 -1750 -18425 -30582 -26121 -26540 -31338
9717c1338R858J0701J0316o580r623N085M191M397j397K980Q522q783l323n412
$$ -31338 -21480 -10779 -463 -7043 -16666 -11581 -7390 -2993 -4390 -1410 7112 -1671 -4994 -10406
9703a0406J870J5055l559L038k119k698L838O73K105l701j866L485p551J170J2291
$$ -10406 -8536 6519 2960 5998 3879 1181 5019 5692 7797 4096 2230 5715 -1836 -666 11625
9688A1625k040r286q481k011k853P254K346m414q91J420k361M348O580M053R115
$$ 11625 9585 299 -8182 -10193 -13046 -5792 -3446 -7860 -8751 -7331 -9692 -5344 1236 5289 14404
9673A4404L965m902n653J1208J120m272r771n574J927K097R55R279N821M096o848
$$ 14404 18369 13467 7814 19022 20142 15870 6099 525 2452 4549 5504 14783 20604 24700 17852
9658A7852q683k680L285O232n497l343M785J473l058o628K947p43J642O491L007
$$ 17852 9169 6489 9774 16006 10509 7166 11951 13424 10366 3738 6685 5942 7584 14075 17082
9643A7082q79j3184k812Q787N166N0n857o177o346M878M951J285K773M653l516
$$ 17082 16203 3019 207 8994 14160 14210 8353 2176 -4170 708 5659 6944 9717 14370 10854
9628A0854M10O741j592k783q232j6320m942R089J8002L855l438J255o999j0251
$$ 10854 11264 18005 16413 13630 5398 -10922 -15864 -6775 11227 15082 11644 12899 5900 -4351
9614d351k62O755L913k451P66n439K296P031p093Q008J0840R177M055p385j951
$$ -4351 -4613 2142 6055 3604 4370 -1069 1227 8258 1165 9173 20013 29190 33245 25860 23909
9599B3909p606j1685m498O912J2484J3253q84m227J337n885j0569J861j874j202
$$ 23909 16303 4618 120 7032 19516 32769 31885 27658 28995 23110 12541 14402 12528 11326
9585A1326N524m013K745N00M72J817k430n234k297R521r652q454P565j918L243
$$ 11326 16850 12837 15582 16082 16554 18371 15941 10707 8410 17931 8279 -175 7390 5472 8715
9570H715J0255k637L086j2066j6130J900M814L651j666J0891j3200j8035l319
$$ 8715 18970 16333 19419 7353 -8777 -6877 -2063 1588 -78 10813 -2387 -20422 -23741
9557b3741K0818Q132o503o273J3930J5444m187p01l021p324l312r988q136m454
$$ -23741 -2923 5209 -1294 -7567 6363 21807 17620 16919 13898 6574 3262 -6726 -14862 -19316
9543a9316j411J4930J2476j950l873K626R04j657L300P936O957J330K740K716
$$ -19316 -20727 -5797 6679 4729 856 3482 4386 2729 6029 13965 20922 22252 24992 27708
9529B7708M096k632o762O009M067m270o467Q016j656J112Q846K234L751n248n208
$$ 27708 31804 29172 22410 28419 32486 28216 21749 29765 28109 29221 38067 40301 44052 38804 33596
9514C3596R52o739j603k280n694k943L178K399M994J364L953J2267J5222J3001
$$ 33596 34548 27809 26206 23926 18232 15289 18467 20866 25860 27224 31177 43444 58666 71667
9500G1667k358m103k292J35n58q464p636O070j080J690o925n657k602o692l105
$$ 71667 69309 65206 62914 63049 62491 54027 46391 52461 51381 53071 46146 40489 37887 31195 28090
9485B8090P148K407L796p88n794O93l180p7J912q258l428j739j2364n209K7J0351
$$ 28090 35238 37645 41441 40653 34859 35552 32372 32295 34207 25949 22521 20782 8418 3209 3236 13587
9469A3587M848L62P666l433Q13k364O873q24j4139l196R648o130O07J8162R536
$$ 13587 18435 18797 26463 23030 23843 21479 28352 27528 13389 10193 19841 13711 14318 32480 42016
9454D2016n835j672p313m229o268q266J733l429J315K099n039Q059O299M189J2966
$$ 42016 36181 34509 27196 22967 16699 8433 10166 6737 8052 10151 5112 13171 19470 23659 36625
9439C6625O309Q610N153k543K131j848j00P48J293K959q603o895k309P04p558
$$ 36625 42934 51544 56697 54154 56285 54437 54337 55085 56378 59337 50734 43839 41530 42234 34676
9424C4676j0342m332R6L854J3207J0554N495P311m530n03j342P791Q296N254j146
$$ 34676 24334 20002 20098 23952 37159 47713 53208 60519 55989 55486 54144 61935 70231 75485 74339
9409G4339N13N23J1527J4604K238K425M584j5961k3365k0616j7368k2017k1251
$$ 74339 74852 75375 86902 101506 103744 106169 110753 94792 71427 50811 33443 11426 -9825
9396i825o758l218o033n87J1777J2084L14k265P925J2179K272j4127j268J0642
$$ -9825 -16583 -19801 -25834 -26421 -14644 -2560 -2246 -4511 3414 15593 17865 3738 2470 13112
9382A3112L515M807O395L649L95j070J0470L205q077n178l713R785J5292J792
$$ 13112 16627 21434 27829 31478 31873 30803 41273 44478 36401 31223 27510 37295 52587 54379
9368E4379N039R377L042M774R269q803m507n421j430m021k80m52k901j883p411
$$ 54379 59418 68795 71837 76611 85880 77077 72570 67149 65719 61698 61418 60966 58065 56182 48771
9353D8771j773N972Q493M4P57N047p913n504K986j811L845J767k024J0845J5194
$$ 48771 46998 52970 61463 61507 62264 67311 59398 53894 56880 55069 58914 60681 58657 69502 84696
9338H4696J099p602p475K202Q06m023n44J3874N996R295J7562J7043O385l071
$$ 84696 85795 78193 70718 72920 73726 69703 69159 83033 89029 98324 115886 132929 139314 136243
9324A36243p876o970l284J7047J8174K0658K3115J2983K7154J3577J2105J9248
$$ 136243 128367 121397 118113 135160 153334 173992 197107 210090 237244 250821 262926 282174
9312B82174L8142M8647J00650J52784J76851J94260J28906J4297o6175j35455
$$ 282174 320316 368963 469613 622397 799248 993508 1122414 1136711 1070536 935081
9302I35081j65927j46978j15630q9005n3205l0588k0086m812m40n137l15J021
$$ 935081 769154 622176 506546 417541 364336 333748 313662 308850 308410 303273 302958 303979
9290C03979M021N742P926J6219R839K2662K3052L4030M4608K9861J9752L6814
$$ 303979 308000 313742 321668 337887 347726 370388 393440 427470 472078 501939 521691 558505
9278E58505M1045L5806M6319P1725R1541J20518J40297J60932J61817J51765J35211
$$ 558505 599550 635356 681675 753400 844941 965459 1105756 1266688 1428505 1580270 1715481
9267A715481J41166J46920J67369J88510K03260K37822K72174K87650L30094M24061
$$ 1715481 1856647 2003567 2170936 2359446 2562706 2800528 3072702 3360352 3690446 4114507
9257D114507N72739Q20968J219202J852409K886094M578584P358112J0716569
$$ 4114507 4687246 5508214 6727416 8579825 11465919 16044503 23402615 34119184
9249C4119184J2579165J3242392J2422868N319630k625484p296241j1753099j3203119
$$ 34119184 46698349 59940741 72363609 77683239 75057755 67761514 56008415 42805296
9241D2805296j1259952q782184o305739m161270k725604j880021j344917r69447
$$ 42805296 31545344 22763160 16457421 12296151 9570547 7690526 6345609 5376162
9233E376162p22685n51558m17717l29099k90009k67866k53849k30482j97387j41144
$$ 5376162 4653477 4101919 3684202 3355103 3065094 2797228 2543379 2312897 2115510 1974366
9223A974366r1924p9322m8328n1408q8950j22222j20704j44511j31536j24186
$$ 1974366 1882442 1803120 1754792 1703384 1614434 1492212 1371508 1226997 1095461 971275
9213I71275j02164q3177o7814o1547l5532k2514k2261k2951k3245l4188l9054
$$ 971275 869111 785934 718120 656573 621041 598527 576266 553315 530070 495882 456828
9202D56828m0465k9289j4960k9827k9718j8434k4992k4154j8171j4900j2670k8099
$$ 456828 416363 387074 372114 342287 312569 294135 269143 244989 226818 211918 199248 171149
9190A71149j8508m189L740J3903L904N636o652j3479m132j3154k3030k7719k8451
$$ 171149 152641 148452 152192 166095 169999 175635 168983 155504 151372 138218 115188 87469 59018
9177E9018p303K952J2777Q107J2914J3670O720J63j3440j2824p251p312J021K382
$$ 59018 51715 54667 67444 75551 88465 102135 108855 109018 95578 82754 75503 68191 69212 71594
9163G1594P593O836J0144M08O371J4944J3085R908K0587L9258O0527P0949Q7901
$$ 71594 79187 86023 96167 96575 102946 117890 130975 140883 161470 200728 261255 332204 420105
9150D20105P3176K7355j3913l4775o0786p9462o9413o1650n5725l7316k1213j0029
$$ 420105 493281 520636 506723 471948 411162 331700 262287 200637 144912 107596 86383 76354
9138G6354m347j3137j0762R457P018K167n831r766n894r765k470P756K026l659
$$ 76354 72007 58870 48108 57565 64583 66750 60919 51153 45259 35494 33024 40780 42806 39147
9124C9147Q184J2841N209J837j466N884M505l09k885j5337n952P886p389K306
$$ 39147 47331 60172 65381 67218 65752 71636 76141 75832 72947 57610 51658 59544 52155 54461
9110E4461r20O071P715K496m442J924L528m998j805J6020J149j2580O471L657
$$ 54461 53541 59612 67327 69823 65381 67305 70833 65835 64030 80050 81199 68619 75090 78747
9096G8747J613q505j7279k4235j9383k1479j9660j0482j0080p295O103M245K489
$$ 78747 80360 71855 54576 30341 10958 -10521 -30181 -40663 -50743 -58038 -51935 -47690 -45201
9083d5201O954N698J397M416N636m457N339R424m874O985L987J406o5j686N99
$$ -45201 -38247 -32549 -31152 -26736 -21100 -25557 -20218 -10794 -15668 -8683 -4696 -3290 -3355 -5041 -4442
9068d442Q475J1576l237J234l282n075Q849L974j1240j4638j6693p170r333J2357
$$ -4442 4033 15609 12372 13606 10324 5249 14098 18072 6832 -7806 -24499 -31669 -41002 -28645
9054b8645K2151M263k307N358J3232M498n075L191J310N0p837j3761p61L420N42
$$ -28645 -6494 -2231 -4538 820 14052 18550 13475 16666 17976 18026 10189 -3572 -4333 -913 -371
9039c71q328n856O574K776k344N921P679Q92M128r94j360k225J2051k724j0716
$$ -371 -8699 -14555 -7981 -5205 -7549 -1628 6051 6943 11071 10077 8717 6492 18543 15819 5103
9024E103j1550p304J204M762q08N133J713O317k319J254p432p343L110Q57j401
$$ 5103 -6447 -13751 -12547 -7785 -8593 -3460 -1747 4570 2251 3505 -3927 -11270 -8160 -7303 -8704
9009h704k042N259m456q788M750K167m653M213m913L18P787p784q934L185J0142
$$ -8704 -10746 -5487 -9943 -18731 -13981 -11814 -16467 -12254 -17167 -16849 -9062 -16846 -25780 -22595 -12453
8994a2453O925Q73j446l902K871Q39L776l536m582k868O828Q290q167q517J348
$$ -12453 -5528 -4655 -6101 -10003 -7132 -6293 -2517 -6053 -10635 -13503 -6675 1615 -6552 -15069 -13721
8979a3721L436N39J523n379n753Q810N423K56j84l976p816L095N224L067P535
$$ -13721 -10285 -9746 -8223 -13602 -19355 -10545 -5122 -4866 -5050 -9026 -16842 -13747 -8523 -5456 2079
8964B079p787J70Q963n272j980l920K294k489k51J2079K984Q624Q274j2113j0113
$$ 2079 -5708 -5538 3425 -1847 -3827 -7747 -5453 -7942 -8193 3886 6870 15494 23768 11655 1542
8949A542P653M814n863J973J77m13p528l322N261J5402K660j0925q436M24J376
$$ 1542 9195 14009 8146 10119 10296 9883 2355 -967 4294 19696 22356 11431 2995 3419 4795
8934D795l553Q453O111j2956j430l043r916j319j256P177m628M78K361j0617K537
$$ 4795 1242 9695 15806 2850 1420 -1623 -11539 -12858 -14114 -6937 -11565 -11087 -8726 -19343 -16806
8919a6806R299L310M564M888p118j3456M379r58m193N215P813k44N686j2162j3362
$$ -16806 -7507 -4197 367 5255 -1863 -15319 -10940 -11898 -16091 -10876 -3063 -3307 2379 -9783 -23145
8904b3145L004Q707P802O754l616j622O158L014j368J362o076p560p621J367n030
$$ -23145 -20141 -11434 -3632 3122 -494 -2116 4042 7056 5688 7050 974 -6586 -14207 -12840 -17870
8889a7870J494l083j934K242Q752j350P892K984M434n574n440O382J0764K587
$$ -17870 -16376 -19459 -21393 -19151 -10399 -11749 -3857 -873 3561 -2013 -7453 -1071 9693 12280
8875A2280j567q165l66k564L891J1281l555o387L10m643q90r52o536k93l370O793
$$ 12280 10713 2548 2182 -382 3509 14790 11235 4848 5158 515 -375 -1327 -7863 -8156 -11526 -4733
8859d733Q403k517J929k378K145n592J006P077o71k203l580J941R95j536n193
$$ -4733 3670 1153 3082 704 2849 -2743 -1737 5340 4669 2466 -1114 827 1822 286 -4907
8844d907r650k527O62N26J1773J842o861J474P333Q788K267o277K409q883j178
$$ -4907 -14557 -17084 -16422 -15896 -4123 -2281 -9142 -7668 -335 8453 10720 4443 6852 -2031 -3209
8829c209M00Q450P669n032q271r068O307P55r451j596m77M855J644P832M950P164
$$ -3209 -2809 5641 13310 8278 7 -9061 -2754 -1999 -11450 -13046 -13523 -8668 -7024 808 5758 12922
8813A2922p49n896r776l928J212K930j4075n911k685J1041J2479M138J746J034
$$ 12922 12173 6277 -3499 -7427 -6215 -3285 -17360 -23271 -25956 -14915 -2436 1702 3448 4482
8799D482L007L679N3k238K074N526R85P614j139n154n286j755k00m035q597l33
$$ 4482 7489 11168 11221 8983 11057 16583 17568 25182 24043 18889 13603 11848 11648 7613 -984 -1317
8783a317J1695l083o874J3777M82L269P94j060Q470m289l927j2620n667K359N180
$$ -1317 10378 7295 421 14198 14680 17949 18743 17683 26153 21864 17937 5317 -350 2009 7189
8768G189l586l789r960m319M379M641l086j753K796P199K352l915N081K15K498
$$ 7189 3603 -186 -10146 -14465 -10086 -5445 -8531 -10284 -7488 -289 2063 -1852 3229 3444 5942
8753E942q61M298p489l346N00J25k040Q166O238O171j837n909q616Q206K942j48
$$ 5942 5081 9379 1890 -1456 -956 -831 -2871 5295 11533 17704 15867 9958 1342 9548 12490 12342
8737A2342J380L707m466r614l033k575j17o821Q05j591J996n816n459O69P527
$$ 12342 13722 17429 12963 3349 316 -2259 -2376 -9197 -8392 -9983 -7987 -13803 -19262 -18593 -11066
8722a1066m377o61M420J0298K629n222j0928J440Q26O707K74q273J2289J9228
$$ -11066 -15443 -16104 -11684 -1386 1243 -3979 -14907 -13467 -12641 -5934 -5660 -13933 -1644 17584
8708A7584O551p37k199m702l788P193O33R91Q110L070k538p408P737J1455Q471
$$ 17584 24135 23398 21199 16497 12709 19902 20535 21526 29636 32706 30168 22760 30497 41952 50423
8693E0423J2431J8160L8770M9768N3982N0800O1353M4660J593j9288l8763n8093
$$ 50423 62854 81014 119784 169552 223534 274334 335687 380347 381940 362652 323889 265796
8681B65796o7404o2974l5715j7209j2697j3362j0185p172q254m269j484R20j871
$$ 265796 198392 135418 99703 82494 69797 56435 46250 39078 30824 26555 25071 25991 24120
8668B4120m208L191L804l072j8386j0596R952m665j5635l566O247N08R298N00
$$ 24120 19912 23103 26907 23835 5449 -5147 4805 140 -15495 -19061 -12814 -12306 -3008 -2508
8654b508p987L253J0897L468k27M250L96o412L284j3784l152J0626N656q317l940
$$ -2508 -10495 -7242 3655 7123 6896 11146 11542 5130 8414 -5370 -8522 2104 7760 -557 -4497
8639d497O897m948J932j998k266L891k681r134M672J945N712M878o922J317p444
$$ -4497 2400 -2548 -616 -2614 -4880 -989 -3670 -12804 -8132 -6187 -475 4403 -2519 -1202 -8646
8624h646j1589J407K593M487Q113n222j0926K505L096J1914K356k091N034j160
$$ -8646 -20235 -18828 -16235 -11748 -3635 -8857 -19783 -17278 -14182 -2268 88 -2003 3031 1871
8610A871J554m484j2340o321L029L691Q706m519k869j896l58J1762K852O882J788
$$ 1871 3425 -1059 -13399 -19720 -16691 -13000 -4294 -8813 -11682 -13578 -13936 -2174 678 7560 9348
8595I348r70l659r841L027N62J4292N33j1974r633J627r7O29N132j219L740M789
$$ 9348 8378 4719 -5122 -2095 -1533 12759 13292 1318 -8315 -6688 -6785 -6156 -1024 -2243 1497 6286
8579F286j0930l290P819K154L246J568r066l056Q76p898p509L785J2707O250Q020
$$ 6286 -4644 -7934 -115 2039 5285 6853 -2213 -5269 -4393 -12291 -19800 -16015 -3308 2942 10962
8564A0962J1332N07j7107j2984l67P564o448L615P865k828O66n40N260O937j405
$$ 10962 22294 22801 5694 -7290 -7657 -93 -6541 -2926 4939 2111 2777 2237 7497 14434 13029
8549A3029j0075r206l231k744M33J2660O21j1190m284K129Q363P199J37K012j731
$$ 13029 2954 -6252 -9483 -12227 -11794 866 1487 -9703 -13987 -11858 -3495 3704 3841 5853 4122
8534D122n147J003l42K01J026M148J755j058k362k02N953P991O096N216q182n587
$$ 4122 -1025 -22 -364 -163 863 5011 6766 5708 3346 3144 9097 17088 23184 28400 20218 14631
8518A4631k700q24q930p140Q094P306k090j177L187q058j0873j164J969k106o88
$$ 14631 11931 11107 2177 -4963 3131 10437 8347 7170 10357 2299 -8574 -9738 -7769 -9875 -10563
8503a0563K757J560Q596J432o592j0964N276Q515l965J358L531J670J362n275
$$ -10563 -7806 -6246 2350 3782 -2810 -13774 -8498 17 -3948 -2590 941 2611 3973 -1302
8489a302k120K632J1388J5567m136j6298q276k352M384L773l172M893o606n072
$$ -1302 -3422 -790 10598 26165 22029 5731 -2545 -4897 -513 3260 88 4981 -1625 -6697
8475f697O064L602j406p763O636n790k219J0681K194r300l877N106L140n357p313
$$ -6697 -633 2969 1563 -6200 436 -5354 -7573 3108 5302 -3998 -7875 -2769 371 -4986 -12299
8460a2299J591R261L590o408j2813k404m614j929m220J683Q000J0456L100l450
$$ -12299 -10708 -1447 2143 -4265 -17078 -19482 -24096 -26025 -30245 -28562 -20562 -10106 -7006 -10456
8446a0456J986q067Q908j696q878Q161J0254L254K069J809M385n921n519k138
$$ -10456 -8470 -16537 -7629 -9325 -18203 -10042 212 3466 5535 7344 11729 5808 289 -1849
8432a849P773N20j914m530j0081L932M78N72Q634L032K98L523j2555L404l45n701
$$ -1849 5924 6444 4530 0 -10081 -6149 -5671 -5099 3535 6567 6865 10388 -2167 1237 892 -4809
8416d809n443J0278J1521m038n033n431J157q44M74M370N70j152m332P283M393
$$ -4809 -10252 26 11547 7509 2476 -2955 -1798 -2642 -2168 2202 2772 1620 -2712 4571 8964
8401H964r05k818N321j5261p334j117l723K899j995j228M4P087P851K957j1255
$$ 8964 8059 5241 10562 -4699 -12033 -13150 -16873 -13974 -15969 -17197 -17153 -10066 -2215 742 -10513
8386a0513R86N355O414J628L585k355j337p378J139L624r426m773j766L9P412
$$ -10513 -9527 -4172 2242 3870 7455 5100 3763 -3615 -2476 1148 -8278 -13051 -14817 -14778 -7366
8371g366P416q01O525j831L168m934m433l83M092P151R38j472j0440j0890L771
$$ -7366 50 -751 5774 3943 7111 2177 -2256 -2639 1453 8604 9542 8070 -2370 -13260 -9489
8356i489K170m049l521J472M361k532L52Q275O056Q7p598m157Q073J390j264o046
$$ -9489 -7319 -11368 -14889 -13417 -9056 -11588 -11236 -2961 3095 3182 -4416 -8573 -500 890 -374 -6420
8340f420K470m406N573K116j3301N595n059k845k710M720N806P519J087j237p448
$$ -6420 -3950 -8356 -2783 -667 -13968 -8373 -13432 -16277 -18987 -14267 -8461 -942 145 -1092 -8540
8325h540m248N777m238M09J914N006l921J681J958l098l262K187n698o917J01
$$ -8540 -12788 -7011 -11249 -10840 -8926 -3920 -7841 -6160 -4202 -7300 -10562 -8375 -14073 -20990 -20889
8310b0889P434K212R654L621j2042O740l276q925k568n87P495R580l343nQ61n13
$$ -20889 -13455 -11243 -1589 2032 -10010 -3270 -6546 -15471 -18039 -18626 -11131 -1551 -4894 -4899 -4038 -4551
8294d551J652K02P286M949q385r118n152J674j143m802P898L430n52jL947M245
$$ -4551 -2899 -2697 4589 9538 1153 -7965 -13117 -11443 -12586 -17388 -9490 -6060 -6612 -6613 -2666 1579
8278A579m916m582N090M284L283j3257q303K27n204M574P619J1392l051L11L32
$$ 1579 -3337 -7919 -2829 1455 4738 -8519 -16822 -16595 -21799 -17225 -9606 1786 -1265 -954 -622
8263f22l442K068K128q053k350J3428J1247M047n447q884k17K577m787M558O40
$$ -622 -4064 -1996 132 -7921 -10271 3157 14404 18451 13004 4120 3903 6480 1693 6251 6891
8248F891j0821j5771j233J3604N956R612J134k80p305j062L508n594l266J533
$$ 6891 -3930 -19701 -20934 -7330 -1374 8238 9372 9092 1787 725 4233 -1361 -4627 -3094
8234c094l095J942k682l633J200p049l135m490N456J5391m3n046o262N663J47
$$ -3094 -6189 -4247 -6929 -10562 -9362 -16411 -19546 -24036 -18580 -3189 -3232 -8278 -14540 -8877 -8730
8219h730J190O260q144n729J868P715j226P648N440l54o905j4322K948J3606K530
$$ -8730 -7540 -1280 -9424 -15153 -13285 -5570 -6796 852 6292 5938 -967 -15289 -12341 1265 3795
8204C795M256P555n502m72j2110n604N827l690n684k388N708Q287k668M041l602
$$ 3795 8051 15606 10104 9632 -2478 -8082 -2255 -5945 -11629 -14017 -8309 -22 -2690 1351 -2251
8189b251n182j0246n593K717M379M26Q343J361j0400k148L825J0941l571j964
$$ -2251 -7433 -17679 -23272 -20555 -16176 -15750 -7407 -6046 -16446 -18594 -14769 -3828 -7399 -9363
8175i363O676K433j2372M601R331J0844n963r081M293k494k171L451j67j612m218
$$ -9363 -2687 -254 -12626 -8025 1306 12150 6187 -2894 1399 -1095 -3266 185 18 -1594 -5812
8160e812L21l224N3k127j1609K896P514Q557J734r124q22Q333Q74O413L071O01
$$ -5812 -5491 -8715 -8662 -10789 -22398 -19502 -11988 -3431 -1697 -10821 -11643 -3310 -2436 3977 7048 7649
8144G649K489m276j008j544o67j374l525j266q00M406n535Q67k751j744J1752
$$ 7649 10138 5862 4854 3310 2643 1269 -2256 -3522 -4322 84 -5451 -4584 -7335 -9079 2673
8129B673K0097J183j0305J915P484J3860n790j5450j0633k545P297k829n045k678
$$ 2673 22770 23953 13648 15563 23047 36907 31117 15667 5034 2489 9786 6957 1912 -766
8115g66j279j2264o60R551K203L559L242J904J073J267l768j670J869m595p857
$$ -766 -2045 -14309 -14969 -5418 -3215 344 3586 5490 6563 7830 4062 2392 4261 -334 -8191
8100h191m191J242J799Q427L348M214q147p867P04k507j920M72q6O441J831M840
$$ -8191 -12382 -11140 -9341 -914 2434 6648 -1499 -9366 -8662 -11169 -13089 -12617 -12703 -6262 -4431 409
8084D09M492J157J521J692o559O79n915o334p24q31L07M696O799j50n846n89J1776
$$ 409 4901 6058 7579 9271 2712 3391 -2524 -8858 -9582 -10413 -10106 -5410 1389 1239 -4607 -5196 6580
8067F580L718k853J823R06j703k137q838o856k561K203K389O22P575m786O21K399
$$ 6580 10298 7445 9268 10174 8471 6334 -2504 -9360 -11921 -9718 -7329 -6707 868 -3918 -3297 -898
8051h98L49K476Q246k289M688J149m524o906j1812j088N807Q62j0049j177J0713
$$ -898 -549 1927 10173 7884 12572 13721 9197 2291 -9521 -10609 -4802 -3940 -13989 -15166 -4453
8036d453O411L070q586L699r206k343k262o599J956P081P602p39k580J4403J1384
$$ -4453 1958 5028 -3558 141 -9065 -11408 -13670 -20269 -18313 -11232 -3630 -4369 -6949 7454 18838
8021A8838k966k522K689j62n024j662o201k993m506l017K991N914q296m629Q666
$$ 18838 15872 13350 16039 15877 10853 9191 2990 -3 -4509 -7526 -4535 1379 -6917 -11546 -2880
8006b880J193j489O100P586o746m482l310m815q893M94Q652M853Q851K32L124
$$ -2880 -1687 -3176 2924 10510 3764 -718 -4028 -8843 -17736 -17242 -8590 -3737 5114 5346 8470
7991H470j758O21K39m395o130q541L899J0859k270L38P612Q18l87O29o038l776
$$ 8470 6712 7333 7572 3177 -2953 -11494 -7595 3264 994 1332 8944 9762 9375 10004 3966 190
7975A90L676m649l672l4N781O228J0322P402r123o696q326K384M951k086j594
$$ 190 3866 -783 -4455 -4489 1292 7520 17842 25244 16121 9425 1099 3483 8434 6348 4754
7960D754m246M98P058J4174O226m999j6708j4017j1l669R379o66Q155j354N904
$$ 4754 508 1006 8064 22238 28464 23465 6757 -7260 -7271 -10940 -1561 -2227 5928 4574 10478
7945A0478M772J855Q100r527j0830k72P230m6p680k309L353m378l261p28N009
$$ 10478 15250 17105 25205 15678 4848 4576 11806 11760 4080 1771 5124 746 -2515 -3243 1766
7930A766l070j1813n932K126N954J0568m89P790K708L769o979r122p603p728j0032
$$ 1766 -1304 -13117 -19049 -16923 -10969 -401 -890 6900 9608 13377 6398 -2724 -10327 -18055 -28087
7915b8087K191J3723J1412O212k392J614n01j1771q132R043Q369m462J257M678
$$ -28087 -25896 -12173 -761 5451 3059 4673 4172 -7599 -15731 -6688 1681 -2781 -1524 3154
7901C154o721n667Q856N290m487j0267N127O252k086M273l713o188k83m64N83
$$ 3154 -3567 -9234 -378 4912 425 -9842 -4715 1537 -549 3724 11 -6177 -6460 -6924 -6341
7886f341o047k711P518R299J739O403O545j88j8387l025O211R5n521J20K066L417
$$ -6341 -12388 -15099 -7581 1718 3457 9860 16405 16217 -2170 -5195 1016 1111 -4410 -4290 -2224 1193
7870A193m243j2776O0P480n641o806L671O481K939Q418R12M056j452j1133j2695
$$ 1193 -3050 -15826 -15766 -8286 -13927 -20733 -17062 -10581 -7642 776 1688 5744 4292 -6841 -19536
7855a9536m526J5151J550j1658O57J967j0909J4002J0999o599r312Q374Q561n710
$$ -19536 -24062 -8911 -7361 -19019 -18362 -16395 -27304 -13302 -2303 -8902 -18214 -9840 -1279 -6989
7841f989L833O226M921j378p292k889k373Q994k197p817J855j041K972L869N825
$$ -6989 -3156 3070 7991 6613 -679 -3568 -5941 3053 856 -6961 -5106 -6147 -3175 694 6519
7826F519q82n302j788ml521J071M906M899o207m909l091L754k131r23K701R14
$$ 6519 5637 335 -1453 -1457 -4978 -3907 999 5898 -309 -5218 -8309 -4555 -6686 -7609 -4908 -3994
7810c994N211R77r249J1871J1851J584m286N344K476m169q542q640M966K069p709
$$ -3994 1217 2194 -7055 4816 16667 18251 13965 19309 21785 17616 9074 434 5400 7469 -240
7795b40J508n768N09Q067m375l978j96l16p92R19K12n144J6687M760p885j555
$$ -240 1268 -4500 -3991 4076 -299 -4277 -4473 -4789 -5581 -4662 -4450 -9594 7093 11853 3968 2413
7779B413l942j3640J1328L129l333O094n65L968R667o530m209l719l819J699L180
$$ 2413 -1529 -15169 -3841 -712 -4045 2049 1484 5452 15119 8589 4380 661 -3158 -1459 1721
7764A721k497p734M241N399l005p32Q35R642R175l460l659j6219m840L147j2651
$$ 1721 -776 -8510 -4269 1130 -1875 -2607 -1772 7870 17045 13585 9926 -6293 -11133 -7986 -20637
7749b0637n431J9980O062j0232q204p432N855L860J0834M565K812o95M337j438
$$ -20637 -26068 -6088 -26 -10258 -18462 -25894 -20039 -16179 -5345 -780 2032 1337 5674 4236
7735D236K542k569o802J499k546O023o047M042N247j096K248j02r566o68O63L171
$$ 4236 6778 4209 -2593 -1094 -3640 2383 -3664 378 5625 4529 6777 6675 -2891 -3559 -2896 275
7719B75O33O917m998m410j299M124M81q058m733Q75n183j128P091O030j2135J193
$$ 275 908 7825 2827 -1583 -2882 1242 1723 -6335 -11068 -10193 -15376 -16504 -9413 -3383 -15518 -14325
7703a4325M227J1300Q765n80k573J269O510p616j512Q17n304l103M39J3469N067
$$ -14325 -10098 1202 9967 9387 6814 8083 14593 6977 5465 6282 978 -2125 -1686 11783 16850
7688A6850K792m781j4518J188K358Q12k254k469n927m807R622R630J580k252r946
$$ 16850 19642 14861 343 1531 3889 4701 2447 -22 -5949 -10756 -1134 8496 10076 7824 -2122
7673b122o78L160J0035k955K452J1850n299r372j788L840k834k373l522m033N229
$$ -2122 -2800 360 10395 7440 9892 21742 16443 7071 5283 9123 6289 3916 394 -3639 1590
7658A590N494m497p020P006p998j1911Q775J0196N543J0355n442m931p15l124
$$ 1590 7084 2587 -4433 2573 -5425 -17336 -8561 1635 7178 17533 12091 7160 6445 3321
7644C321P37m891o837j70l981l10O004Q894J1312j1035r328L882Q04j208L906
$$ 3321 4058 -833 -7670 -7840 -11821 -12131 -6127 2767 14079 3044 -6284 -2402 -1598 -2806 1100
7629A100j009J322q301N77m74r114r661O332J0045J596N360M783R101M779K677
$$ 1100 91 1413 -6888 -6311 -6785 -15899 -25560 -19228 -9183 -7587 -2227 2556 11657 16436 19113
7614A9113k383j5039l998P074K923J1130J3636N8j1223n725l946r083M303L39
$$ 19113 16730 1691 -2307 4767 7690 18820 32456 32514 21291 15566 11620 2537 6840 7179
7600G179o39l268k785m350N009M805j1818M618P901M6L996k984j0585l869o077
$$ 7179 6540 3272 487 -3863 1146 5951 -5867 -1249 6652 6698 10694 7710 -2875 -6744 -12821
7585a2821R970J0957r098j222L209L89J24m804N25k009P963p359J425K503L456
$$ -12821 -2851 8106 -992 -2214 995 1384 1508 -3296 -2771 -4780 3183 -4176 -2751 -248 3208
7570C208M616R67j059j3505L270J5620n178P554J773o339j663j3058j3481o561
$$ 3208 7824 8791 7732 -5773 -2503 13117 7939 15493 17266 10927 9264 -3794 -17275 -23836
7556b3836P717M789J1463L894J010R007l939N119m136o297n011P94J350p49k607
$$ -23836 -16119 -11330 133 4027 5037 14044 10105 15224 11088 4791 -220 574 1924 1175 -1432
7541a432m974J656L52J455O56Q700j464p755Q152J4332q634q044n488J647J2184
$$ -1432 -6406 -4750 -4398 -2943 -2287 6413 4949 -2806 5346 19678 11044 3000 -2488 -841 11343
7526A1343J5135L524n110n544k513m644j457p264o95R84P078K297M337j5784n586
$$ 11343 26478 30002 24892 19348 16835 12191 10734 3470 2775 3759 10837 13134 17471 1687 -3899
7511c899L074j744L033N51j054P415n620M527Q873k431L45k944P417q754p262
$$ -3899 -825 -2569 464 1015 -39 7376 1756 6283 15156 12725 13070 10126 17543 8789 1527
7496A527Q512P853J452o094j0053K045q215j1252k78N232m14L524J363O53K25
$$ 1527 10039 17892 19344 13250 3197 5242 -2973 -14225 -14503 -9271 -9685 -6161 -4798 -4145 -3920
7481c920Q99Q565N127M667J127l862k360k459m706j094M114L14k86Q454P077k537
$$ -3920 -3021 5544 10671 15338 16465 12603 10243 7784 3078 1984 6098 6412 6126 14580 21657 19120
7465A9120o983j295Q54n915J272k465j656Q45J4170J716j5325p297M75K882O101
$$ 19120 12137 10842 11696 5781 7053 4588 2932 3777 17947 19663 4338 -2959 -2484 398 6499
7450F499J1914O650l011J50L955j0009k695L350O31j0341n067M206J0832p057
$$ 6499 18413 25063 22052 22202 26157 16148 13453 16803 17434 7093 2026 6232 17064 10007
7436A0007j918J603J0584k599k267r754q422l299O124l274N628K816l371J917
$$ 10007 8089 9692 20276 17677 15410 5656 -2766 -6065 59 -3215 2413 5229 1858 3775
7422C775L239L680K147m976Q240q20m838l133K811L781J486M377p94q25r22O212
$$ 3775 7014 10694 12841 7865 16105 15285 10447 7314 10125 13906 15392 19769 18975 18150 17228 23440
7406B3440j921o144l196j806L806J16m501P223m255l726r680k818J35K089K591
$$ 23440 21519 15375 12179 10373 14179 14295 9794 17017 12762 9036 -644 -3462 -3327 -1238 1353
7391A353O280O044J0235l308K244l498j5335k4J2332K55p573N72j11q211r158
$$ 1353 7633 13677 23912 20604 22848 19350 4015 3991 16323 16578 9005 9577 9466 1255 -7903
7376g903K880L319k148j464P614K293L618k083r826p253P041L921n019J922l126
$$ -7903 -5023 -1704 -3852 -5316 2298 4591 8209 6126 -3700 -10953 -3912 9 -5010 -3088 -6214
7361f214P988K487l669Q083M259L967Q937q055l002M13j0973l834J0568Q712j722
$$ -6214 1774 4261 592 8675 12934 16901 25838 17783 14781 15194 4221 387 10955 19667 17945
7346A7945l365m936o321k517m30N805m278Q699J4899R062j3973j0332M116N371
$$ 17945 14580 9644 3323 806 376 6181 1903 10602 25501 34563 20590 10258 14374 19745
7332A9745k541q784P94R07K780r93O830l33n706l107O834K491j822k699l159n107
$$ 19745 17204 8420 9214 10121 12901 11908 18738 18405 12699 9592 16426 18917 17095 14396 11237 6130
7316F130K666q09Q61K159P592M871o842p201k689J0568O254m869L41J357K368
$$ 6130 8796 7987 8848 11007 18599 23470 16628 9427 6738 17306 23560 18691 19032 20389 22757
7301B2757N040J301r229m050J9745l085j0531k762m092O797j713l493o999l660
$$ 22757 27797 29098 19869 15819 35564 32479 21948 19186 15094 21891 20178 16685 9686 6026
7287F026M80L255O066n173N420N599J307l92m559M008R684J749k487r162J062
$$ 6026 6506 9761 15827 10654 16074 21673 22980 22588 18029 22037 31721 33470 30983 21821 22883
7272B2883J715k637J682J935K17n213q070P044K785R081K527m689O30L766j283
$$ 22883 24598 21961 23643 25578 25795 20582 12512 19556 22341 31422 33949 29260 29890 33656 32373
7257C2373R186Q234p033r135k056m514L613L669n685j0697o580J4822J0824m975
$$ 32373 41559 49793 42760 33625 31569 27055 30668 34337 28652 17955 11375 26197 37021 32046
7243C2046k491m692n963J189J1604N454N911o18p395r875O86O11P200N216R157
$$ 32046 29555 24863 18900 20089 31693 37147 43058 42440 35045 25170 25856 26467 33667 38883 48040
7228D8040O789M563k073o970j1481j1345j896J3947J0728p567J095J435n600j265
$$ 48040 54829 59392 57319 50349 38868 27523 25627 39574 50302 42735 43830 45265 39665 38400
7214C8400J6745Q724p618J1737J8313P6J4940J6964J2395J6165L2884L0114L2952
$$ 38400 55145 63869 56251 67988 86301 86377 101317 118281 130676 146841 179725 209839 242791
7201B42791M4057O6391J21254K08317K72714L21117L24602K38900P6970j04760
$$ 242791 286848 353239 474493 682810 955524 1276641 1601243 1840143 1917113 1812353
7191A812353k57500l17363k97728k36495j78676j25295q7654n7710l3062k2663
$$ 1812353 1554853 1237490 939762 703267 524591 399296 311642 253932 220870 198207
7181A98207k4595k2389j3628k3288j7013j5557q138j1814j2480j308J236M585
$$ 198207 173612 151223 137595 114307 97294 81737 73599 61785 49305 47997 49233 53818
7169E3818k579n654O800l310K875l990j4503J454M156m753n985k819j564l747
$$ 53818 51239 45585 52385 49075 51950 47960 33457 34911 39067 34314 28329 25510 23946 20199
7155B0199O244L976M294l715L037N063k31O20l390m400j477n469q712l459J1759
$$ 20199 26443 30419 34713 30998 34035 39098 38867 39487 36097 31697 30220 24751 16039 12580 24339
7140B4339O312l236m734L851j124n513j611k14J1699p084j2566m280k585k3J1657
$$ 24339 30651 27415 22681 26532 25408 19895 18284 18070 29769 22685 10119 5839 3254 3231 14888
7125A4888K757L563m900k491o82O553r70q57o879o759R558Q621m256k511P779
$$ 14888 17645 21208 16308 13817 13135 19688 18718 17861 10982 4223 13781 22402 18146 15635 23414
7110B3414L914n349l600j553k544p80J2232L75n949l871j825l979L66O570K948
$$ 23414 27328 21979 18379 16826 14282 13502 25734 26109 20160 16289 14464 10485 10851 17421 20369
7095B0369q104l154N460O851K010l720O810M524Q456J359o133o975j347l655o280
$$ 20369 12265 9111 14571 21422 23432 19712 26522 31046 39502 40861 34728 27753 26406 22751 16471
7080A6471L883Q191J593k95l576k029m514M380O372m178J560J237J437K735M078
$$ 16471 20354 28545 30138 29843 26267 24238 19724 24104 30476 26298 27858 29095 30532 33267 37345
7065C7345M143n617j441n409N124n076m917J477J2488o008l533K053N615j1570
$$ 37345 41488 35871 34430 29021 34145 29069 24152 25629 38117 32109 28576 30629 36244 24674
7051B4674j673M830Q575p251J431J095M831q98o019o953j303J097L422P303J739
$$ 24674 23001 27831 36406 29155 30586 31681 36512 35614 29595 22642 21339 22436 25858 33161 34900
7036C4900j68L606j542l492m260M70n622O096J142j238p79k086J0982J1485L761
$$ 34900 34732 38338 36796 33304 29044 29514 23892 29988 31130 29892 29113 27027 38009 49494 53255
7021E3255j1541j0091q97R412J0748K933o823R42J5994N111r063l866p32Q520
$$ 53255 41714 31623 30726 40138 50886 53819 46996 47938 63932 69043 59980 56114 55382 63902
7007F3902J3598L304J531J1236J0542L990L037J4087J0046N495R244K2423J5291
$$ 63902 77500 80804 82335 93571 104113 108103 111140 125227 135273 140768 150012 172435 187726
6994A87726J1905O613O955j462n305l717L59Q31p205l074j894j3993r495j0855
$$ 187726 199631 206244 213199 211737 206432 202715 203074 203905 196700 193626 191732 177739 168244 157389
6980A57389k333M331q018L369J1336P55o001R55J189l170K524k880k244K2268
$$ 157389 155056 159387 151369 154738 166074 166829 160828 161783 162972 159802 162326 159446 157202 179470
6966A79470K5199N009M060P074j4467P23K2982j997p588k586j0981r115k001J3707
$$ 179470 204669 209678 213738 220812 206345 207068 230050 228053 220465 217879 206898 197783 195782 209489
6952B09489O334J31Q784J2717J2167K6586M0777M1813L5441L7813L2406K5351
$$ 209489 215823 215954 224738 237455 249622 276208 316985 358798 394239 432052 464458 489809
6940D89809p452j7262l1255m3950l6895l7909l5877m3681l1628j2443j5850j3839
$$ 489809 482357 465095 433840 389890 352995 315086 279209 235528 203900 191457 175607 161768
6928A61768j4328j3914l389k837j0465o970l520J483k751L042o820k972l990j0079
$$ 161768 147440 133526 130137 127300 116835 109865 106345 107828 105077 108119 101299 98327 94337 84258
6914H4258J963K41J7821O375q90J0344M874m818J537J8565J1894L391j661q628
$$ 84258 86221 86462 104283 110658 109768 120112 124986 120168 121705 140270 152164 155555 153894 145266
6900A45266K407j095m443j1230j2991k58J695o707r361p793j4536j2873m191K961
$$ 145266 147673 146578 142135 130905 117914 117656 119351 112644 103283 95490 80954 68081 63890 66851
6886F6851M233O077r246j7550j262J3872L216J0341m25l206O446k08l369o465
$$ 66851 71084 77161 67915 50365 49103 62975 66191 76532 76107 72901 79347 79139 75770 69305
6872F9305o94N69m078o502m434L244P338Q099j1287J439L82p255q127l898P739
$$ 69305 68611 69180 65102 58600 54166 57410 64748 72847 61560 62999 63381 56126 47999 44101 51840
6857E1840R30O227J910j5564q649L974O049o886M073Q301n044p573j0166R66M59
$$ 51840 52770 58997 60907 45343 36694 40668 46717 39831 43904 52205 47161 39588 29422 30388 30847
6842C0847j746O017M025L973O912P195j040O820kq182k198R426k535j2796k055
$$ 30847 29101 35118 39143 43116 50028 57223 56183 63003 63001 54819 52621 62047 59512 46716 44661
6827D4661r83N418l127o499N039L939m728q080r921P679Q319m320j29J277K077
$$ 44661 43678 49096 45969 39470 44509 48448 43720 35640 25719 33398 41717 37397 37268 38545 40622
6812D0622M896K756L620K589m120J395N941M328l616L493J1681j596K717P680
$$ 40622 45518 48274 51894 54483 50363 51758 57699 62027 58411 61904 73585 71989 74706 82386
6798H2386k548K882j3M48k433K207J7800K144n319l310j0306L998k354k920l351
$$ 82386 79838 82720 82707 83155 80722 82929 100729 102873 97554 94244 83938 87936 85582 82662 79311
6783G9311n306K086J537N027M226m681K074m991j917J916J6315L433o966o821
$$ 79311 74005 76091 77628 82655 86881 82200 84274 79283 77366 79282 95597 99030 92064 85243
6769H5243m673j2121j403J5437P371o979K608J2290m522q533q293k132j2258q762
$$ 85243 80570 68449 67046 82483 89854 82875 85483 97773 93251 84718 76425 74293 62035 53273
6755E3273J142R193k39K708Q921j1560j0686P55N885O254J761j309o737J484j0299
$$ 53273 54415 63608 63369 66077 74998 63438 52752 53507 59392 65646 67407 66098 59361 60845 50546
6740E0546q145N792R386L678K308m186p305J2010R878m120p189n381P713Q191
$$ 50546 42401 48193 57579 61257 63565 59379 52074 64084 73962 69842 62653 57272 64985 73176
6726G3176J0070N78o65L851J9184j32o905M972l757J541O705n740o889o868L363
$$ 73176 83246 83824 83159 87010 106194 106062 99157 104129 100372 101913 108618 102878 95989 89121 92484
6711I2484K468m91j498N846K274J514K919R368J225O482M605o560j3249p971l031
$$ 92484 94952 94461 92963 98809 101083 102597 105516 114884 116109 122591 127196 120636 107387 99416 96385
6696I6385l637j476J3006L838J396m569j3874j690N677m461P569R694p077M276
$$ 96385 92748 91272 104278 108116 109512 104943 91069 89379 95056 90595 98164 107858 100781 105057
6682A05057L412K892J515R604j999R804J5857j806j747k281o752P252R960l010
$$ 105057 108469 111361 112876 122480 120481 130285 146142 144336 142589 140308 133556 140808 150768 147758
6668A47758P60K805m913l048K184J028k408r9m790k294j527L950J163q336K060
$$ 147758 148518 151323 146410 143362 145546 146574 144166 144067 139277 136983 135456 139406 140569 132233 134293
6653A34293n218j2943J557J704N970R208J1879J515O343N104l468R114J4154N622
$$ 134293 129075 116132 117689 119393 125363 134571 146450 147965 154308 159412 155944 165058 179212 184834
6639A84834n974j894O939R595m053j091L174R626J4375o594p150N181L840N793
$$ 184834 178860 176966 183905 193500 189447 188356 191530 201156 215531 208937 201787 206968 210808 216601
6625B16601J0359O364P104K947N954J3587n98P459J6055J0470j477p7M069J3776
$$ 216601 226960 233324 240428 243375 249329 262916 262318 269777 285832 296302 294825 294748 298817 312593
6611C12593J6417J8858O639o58l109P044J5208J1979J5809K0057J5853J8992J6574
$$ 312593 329010 347868 354507 353849 350740 357784 372992 384971 400780 420837 436690 455682 472256
6598D72256J2623J4480K6563K3933K0891K9882J8817K3734L3012K4536L4764M2189
$$ 472256 484879 499359 525922 549855 570746 600628 619445 643179 676191 700727 735491 777680
6586G77680L8204M3997M0121N1584N2335O0048O9134P7579O1206P0151Q1235R4851
$$ 777680 815884 859881 900002 951586 1003921 1063969 1133103 1210682 1271888 1342039 1423274 1518125
6574A518125J17340J36803J44511J63847J77483J99171K31825K47423K75999L16382
$$ 1518125 1635465 1772268 1916779 2080626 2258109 2457280 2689105 2936528 3212527 3528909
6564C528909L66134M19271M81763N29128O00802O85693P86700R09058J030485
$$ 3528909 3895043 4314314 4796077 5325205 5926007 6611700 7398400 8307458 9337943
6555I337943J170541J326149J487770J653918J814982J968156K066879K077641
$$ 9337943 10508484 11834633 13322403 14976321 16791303 18759459 20826338 22903979
6547B2903979K029302J902081J684567J387924J033447O57598K95082l9708l22452
$$ 22903979 24933281 26835362 28519929 29907853 30941300 31598898 31893980 31854272 31531820
6538C1531820n33346o73844p49026p72055p45566o85610o20666n22706m21752
$$ 31531820 30998474 30324630 29575604 28803549 28057983 27372373 26751707 26229001 25807249
6529B5807249l08721j86602q2603L4272J48785K61740L74595N00707O03113O81672
$$ 25807249 25498528 25311926 25229323 25263595 25412380 25674120 26048715 26549422 27152535 27834207
6519B7834207P73360Q35858Q60594Q30048P46516N92160L55955N9983k78512o59452
$$ 27834207 28607567 29443425 30304019 31134067 31880583 32472743 32828698 32888681 32610169 31950717
6509C1950717j048860j411314j700298j911787k050856k088803k056169j965034
$$ 31950717 30901857 29490543 27790245 25878458 23827602 21738799 19682630 17717596
6501A7717596j823411j675247j518851j356143j201026j054600r35517q25207
$$ 17717596 15894185 14218938 12700087 11343944 10142918 9088318 8152801 7327594
6493G327594p28512o38805n58910m96278m52420l94343l46417l10614k77999k42821
$$ 7327594 6599082 5960277 5401367 4905089 4452669 4058326 3711909 3401295 3123296 2880475
6483B880475k24174k01372j86941j77147j53041j23689j16703j21107j03349r5590
$$ 2880475 2656301 2454929 2267988 2090841 1937800 1814111 1697408 1576301 1472952 1377362
6473A377362q0735q7125p3059o6660n7995n1514o4790o1789n1567l9915m0680
$$ 1377362 1296627 1209502 1136443 1069783 1011788 960274 895484 833695 782128 742213 701533
6462G01533m6778l6858k7845k5141j8499l1253k6569k3454l3137k3251k0908j2852
$$ 701533 654755 617897 590052 564911 546412 515159 488590 465136 431999 408748 387840 374988
6450C74988j4419j1850j8974k1193j1089J277R17j1358j5250o752j4618j9182
$$ 374988 360569 348719 329745 308552 297463 298740 299657 288299 273049 266297 251679 232497
6438B32497j0982k0l672l735o725q635o387k339j880l386J891j0305q182J800
$$ 232497 221515 221495 217823 214088 207363 198728 192341 190002 188122 184736 186627 176322 168140 169940
6424A69940k7j1714p730P536J643J041q96o679j0763l265P263N560r263K71n416
$$ 169940 169913 158199 150469 158005 159648 160689 159793 153114 142351 139086 146349 151909 142646 142917 137501
6409A37501j7477Q081M960m618M099P231m81l087q714o423J213O640q012J733
$$ 137501 120024 128105 133065 128447 132546 139777 139296 136209 127495 121072 122285 128925 120913 122646
6395A22646n715j122o720j3441r130j65J0144n423q963n444o774L124m483k087
$$ 122646 116931 115809 109089 95648 86518 86353 96497 91074 82111 76667 69893 73017 68534 66447
6381F6447j448n47P75m450j4k813k690K389n635j495J036Q594J597j16m826q005
$$ 66447 64999 64452 65227 60777 60763 57950 55260 57649 52014 50519 51555 60149 61746 61630 56804 48799
6365D8799m410L059P383j534k667R34p000j7827l788p838q533j419o801k522n963
$$ 48799 44389 47448 54831 53297 50630 51564 44564 26737 22949 15111 6578 5159 -1642 -4164 -10127
6350a0127O483O052o95l125l639O307k826k538R063Q458K466r708k769J203M259
$$ -10127 -3644 2408 1713 -1412 -5051 1256 -1570 -4108 4955 13413 15879 6171 3402 4605 8864
6335H864R815K748l42k013r806q956p556J664J4935J459k579j836k727J02m291
$$ 8864 18679 21427 21085 19072 9266 310 -7246 -5582 9353 10812 8233 6397 3670 3772 -519
6320e19l058J970m843M180Q321m036n6l864P484J4306R060K77M999R524p423J074
$$ -519 -3577 -1607 -6450 -2270 6051 2015 1959 -1905 5579 19885 28945 29222 34221 43745 36322 37396
6304C7396j0112M070R59Q29o917j3323q205J228J0503J076O396k356j2711q947
$$ 37396 27284 31354 32313 33142 26225 12902 4697 5925 16428 17504 23900 21544 8833 -114
6290a14j532j106P884J489j223k017J51l23m88J5529R120k818j0516r293o609
$$ -114 -1646 -2752 5132 6621 5398 3381 3532 3209 2721 18250 27370 24552 14036 4743 -1866
6275a866o367o440j426O613P932j312J737m176l98J1755M053o717o816n799J1174
$$ -1866 -8233 -14673 -16099 -9486 -1554 -2866 -1129 -5305 -5703 6052 10105 3388 -3428 -9227 1947
6260A947Q543L901o504j0078p878J826K984K733L861N179l683M432M789K331j2025
$$ 1947 10490 14391 7887 -2191 -10069 -8243 -5259 -2526 1335 6514 2831 7263 12052 14383 2358
6245B358q685J1224J2271P042L789k373N756m325m341o832O23K543o339m431j336
$$ 2358 -6327 4897 17168 24210 27999 25626 31382 27057 22716 15884 16507 19050 12711 8280 6944
6230F944o234r925L63J825k879m207J1372J4905k559k994j148N38J0212M781K386
$$ 6944 710 -9215 -8852 -7027 -9906 -14113 -2741 12164 9605 6611 5463 6001 16213 20994 23380
6215B3380Q36J3624m054j501q86j0018m248k610l439N055O88p470Q265Q232o2
$$ 23380 24216 37840 33786 32285 31399 21381 17133 14523 11084 16139 16827 9357 17622 25854 25792
6200B5792L949R63o44o466k721k177K761n181m323o969j3451O955M256R20J372
$$ 25792 29741 30704 30060 23594 20873 18696 21457 16276 11953 4984 -8467 -1512 2744 3664 5036
6185E036O956L74l555K331j464j976J762l811n1m353j2670N853k650P02J0227
$$ 5036 11992 12366 8811 11142 9678 7702 9464 5653 5602 1249 -11421 -5568 -8218 -7516 2711
6170B711Q960l94M482m17q517J123l25O477J189j1815q309O918P618O39P101J444
$$ 2711 11671 11277 15759 15342 6825 7948 7623 14100 15289 3474 -4835 2083 9701 10340 17441 18885
6154A8885j675j931j3540J350J1338q765r169K36J2495R423j647P950K570k899
$$ 18885 17210 15279 1739 3089 14427 5662 -3507 -3271 9224 18647 17000 24950 27520 24621
6140B4621Q51p902j4929J954K503J619m507j857L239P189O76q803n189o790O531
$$ 24621 25472 17570 2641 4595 7098 8717 4210 2353 5592 12781 13457 4654 -535 -7325 -794
6125g94j951K726N883P996o701q981Q429L533l488K53j045Q487L704n180M521
$$ -794 -2745 -19 5864 13860 7159 -1822 6607 10140 6652 6905 5860 14347 18051 12871 17392
6110A7392M850L45j19L754n37J885L181J2276P756k397O725J2807J0974P188R464
$$ 17392 22242 22587 22468 26222 25685 27570 30751 43027 50783 48386 55111 67918 78892 86080 95544
6095I5544N825R549N039K463N089J2221K0084J8273O817J625J2395O853k840l94
$$ 95544 101369 110918 115957 118420 123509 135730 155814 174087 180904 182529 194924 201777 198937 198543
6081A98543j4951p263j610J980R214K695j5259l948k744O97N989q036j3121p740
$$ 198543 183592 176329 174719 176699 185913 188608 173349 169401 166657 167354 173343 165307 152186 144446
6067A44446J0587q38J820P976N511J3672J0859o116r657J392R758K959q719k537
$$ 144446 155033 154195 156015 163991 169502 183174 194033 187917 178260 179652 189410 192369 183650 181113
6053A81113l28J310j214j3325j6576j3445j4760j4444n702n466r633j0353k416
$$ 181113 180785 182095 180881 167556 150980 137535 122775 108331 102629 97163 87530 77177 74761
6040G4761j577k392q603n754n463p662K291n241q554Q9q710m860j43k35K073L522
$$ 74761 73184 70792 62189 56435 50972 43310 45601 40360 31806 31895 23185 18325 18182 17947 20020 23542
6024B3542L713k404Q761R649n143j2362j1300m604m347k919L190P084k530N787
$$ 23542 27255 24851 33612 43261 38118 25756 14456 9852 5505 2586 5776 12860 10330 16117
6010A6117k489q418p500N793J265O209n54j395n866l167n373k259R145K222k994
$$ 16117 13628 5210 -2290 3503 4768 10977 10423 9028 3162 -5 -5378 -7637 1508 3730 736
5995G36L766j77j1593k418P69k728L217O764l98J391j148P704m468P152J1587
$$ 736 4502 4325 -7268 -9686 -8917 -11645 -8428 -1664 -2062 -671 -1819 5885 1417 8569 20156
5980B0156P632k492L736l584R272L013j124L447o699j6277j1530o189n727N104
$$ 20156 27788 25296 29032 25448 34720 37733 36609 40056 33357 17080 5550 -639 -6366 -1262
5966a262L962R853P129J66J16n689k055L095Q30q042J0985J0272l871r63k447
$$ -1262 2700 12553 19682 19848 19964 14275 12220 15315 16145 8103 19088 29360 25489 24526 22079
5951B2079j0210j1520K610o89k74R424N807l986m037j012K201M956p034L156n21
$$ 22079 11869 349 2959 2270 1996 11420 17227 13241 9204 8192 10393 15349 8315 11471 10950
5936A0950o040q813m894L478J0050R068j732K926O934L545l010K808k365p286
$$ 10950 4910 -3903 -8797 -5319 4731 13799 12067 14993 21927 25472 22462 25270 22905 15619
5922A5619j124q268k385Q869J3364k03J94l107m482l752p770Q746R86m245M359
$$ 15619 14495 6227 3842 12711 26075 25872 26066 22959 18477 14725 6955 15701 16687 12442 16801
5907A6801m53J5197P580o685l533J1681n638j2635j226k208r935j6422J834J1323
$$ 16801 16348 31545 39125 32440 28907 40588 34950 22315 21089 18881 8946 -7476 -5642 5681
5893E681O57q39R164M738J0134o09k537j138o510P009J943K91m276q164o349J1616
$$ 5681 6338 5499 14663 19401 29535 28926 26389 25251 18741 25750 27693 27984 23708 15544 9195 20811
5877B0811J0413n053o099J1746R644l381l880N10J055l512r777P07M301p195n452
$$ 20811 31224 26171 20072 31818 41462 38081 34201 34711 35766 32254 22477 23184 27485 20290 14838
5862A4838k470L357l441R564J4622K683J933P83J962R481L485l088j3413m655
$$ 14838 12368 15725 12284 21848 36470 39153 41086 41869 43831 53312 56797 53709 40296 35641
5848C5641n047l394l396k165J0511o572j4078J694m403J826J771P359M830n255
$$ 35641 30594 27200 23804 21639 32150 25578 11500 13194 8791 10617 12388 19747 24577 19322
5834A9322O596J0135M546Q221J3648M388L416J196j2602j1058p368J641j0725
$$ 19322 25918 36053 40599 48820 62468 66856 70272 71468 58866 47808 40440 42081 31356
5821C1356n968n918o87l508k139K331m911L253J0147o802j1478J655Q762J0799
$$ 31356 25388 19470 18783 15275 13136 15467 10556 13809 23956 17154 5676 7331 16093 26892
5807B6892J0710J0026J068R119m572J521k86P83l670M785O640Q600K5330K7870
$$ 26892 37602 47628 48696 57815 53243 54764 54478 55261 51591 56376 63016 71616 96946 124816
5793A24816L8635N7728P7776J20670K17570L24870L53879J84603o1135k19267
$$ 124816 163451 221179 298955 419625 637195 962065 1315944 1500547 1439412 1220145
5783A220145k87936k64031k00835j27779o9231m6495l5131k2458k7794l2001j7534
$$ 1220145 932209 668178 467343 339564 270333 223838 188707 166249 138455 106454 88920
5772H8920j3343j4118q024L795J3407L773J04m344n262k787m288m482J3229N110
$$ 88920 75577 61459 53435 57230 70637 74410 74514 70170 64908 62121 57833 53351 66580 71690
5758G1690J538n711p585j0082o234K526P437J158j036k376N25m103M149O191o754
$$ 71690 73228 67517 59932 49850 43616 46142 53579 54737 53701 51325 51850 47747 51896 58087 51333
5743E1333n368l343L032K499k868M595l342J367J650Q581O275M626j013l655Q5
$$ 51333 45965 42622 45654 48153 45285 49880 46538 47905 49555 58136 64411 69037 68024 64369 64454
5728F4454O274J3043Q27j0342k696m837r698o334j902j419J0578J4149J2792L1320
$$ 64454 70728 83771 84598 74256 71560 66723 57025 50691 48789 47370 57948 72097 84889 116209
5714A16209L2099J8698n654p321r810k8768k5197j8915p873q62K966M322m133
$$ 116209 148308 167006 161352 154031 144221 115453 90256 71341 63468 62606 65572 69894 65761
5701F5761n03M681l011j557K428k500n787m844o473j3595j659M436J1933J5060
$$ 65761 65258 69939 66928 65371 67799 65299 59512 54668 48195 34600 32941 37377 49310 64370
5687F4370K153o375P465j514J345p491j2915L517J1566J9782J2639O051J2142
$$ 64370 66523 60148 67613 66099 67444 59953 47038 50555 62121 81903 94542 100593 112735
5674A12735O838Q036K1461K7968N6487Q5536P9722M4293j3589o3345q5530p8155
$$ 112735 119573 127609 149070 177038 233525 319061 398783 443076 429487 366142 280612 202457
5662B02457n3867l8902l2370l4510k0517q852J1589K4456K6064l672p475j473
$$ 202457 148590 109688 77318 42808 22291 13439 25028 49484 75548 71876 64401 62928
5650F2928n363j297j141k1943p90O828o701L985N145J1221Q340J3670P672N044
$$ 62928 57565 56268 55127 33184 32394 39222 32521 36506 41651 52872 61212 74882 82554 87598
5636H7598N859K715j241J352J0502K111O889O198J4061K4962M4470N6520P8783
$$ 87598 93457 96172 94931 96283 106785 108896 115785 121983 136044 161006 205476 261996 340779
5623C40779Q1632N4848p347m7207p1856p0016m7466m5563l2731j5553j4789j2899
$$ 340779 422411 477259 469912 422705 350849 280833 233367 187804 155073 139520 124731 111832
5611A11832j0599n145o133K223J2747O288K3127L0396J8969L547k73j482J5504
$$ 111832 101233 96088 89955 92178 104925 111213 134340 164736 183705 187252 186979 185497 201001
5598B01001M077r99L76M649M887m768k4116k1951j5478j2588p398j9102j5082
$$ 201001 205078 204079 204455 209104 213991 209223 185107 163156 147678 135090 127692 108590 93508
5585I3508k243k059Q073R183K0419J5471K7267J6361J4135J273j8662k2705k8286
$$ 93508 91265 89206 97279 106462 126881 142352 169619 185980 200115 201388 182726 160021 131735
5572A31735j7455l462J805k585o346j363j415n341o115j3540j4569q172k829k459
$$ 131735 114280 110818 112623 110038 103692 102329 100914 95573 89458 75918 61349 53177 50348 47889
5558D7889M742J5825K3094M644l994j646j015n953j1166l175m981k3538q755Q702
$$ 47889 52631 68456 91550 96194 92200 90554 89539 83586 72420 69245 64264 40726 31971 40673
5544D0673L556O312M103L084R014K4188L7938L8419K4194L364k5228k6052j9567
$$ 40673 44229 50541 54644 57728 66742 90930 128868 167287 191481 194845 169617 143565 123998
5531A23998j0501L342K388p846l592n136j635J2379J0321O300O225K903J7060
$$ 123998 113497 116839 119227 111381 107789 102653 101018 113397 123718 130018 136243 139146 156206
5518A56206K2842J9422R653J2851k936r556j1427l808J1074J3415J5905K9523
$$ 156206 179048 198470 208123 220974 218038 208482 197055 193247 204321 217736 233641 263164
5506B63164L5081M2808M4986K9914k3491p4563r6291r7505q2167o0302k7132q23
$$ 263164 298245 341053 386039 415953 392462 317899 221608 124103 41936 -18366 -45498 -46321
5494d6321J6295J8574J2904K4659J5830K641L299k776n758J4594K4675J4146J4343
$$ -46321 -30026 -11452 1452 26111 41941 44582 47881 45105 39347 53941 78616 92762 107105
5481A07105R444Q212J9072P951k211j0597j0796P124P322L146J7518K0507N045
$$ 107105 116549 124761 143833 151784 149573 138976 128180 135304 142626 145772 163290 183797 188842
5468A88842K192J6747J8703R421J4518J1111Q380r48l515m623O062K151j989l763
$$ 188842 191034 207781 226484 235905 250423 261534 269914 268966 265451 260828 266890 269041 267052 263289
5454B63289Q898P202o959r109J015J426o796j7207j4356m185n437J062J0998J6383
$$ 263289 272187 279389 272430 263321 264336 265762 258966 241759 227403 223218 217781 218843 229841 246224
5440B46224K8792K3313K402j0656j4772j1710O101K2032P921K1667J5169J3962
$$ 246224 275016 298329 300731 290075 275303 263593 269694 291726 299647 321314 336483 350445
5428C50445K7404L1771K2100K820j6459k3083j0386jJ7114K5606M1423O5447O6480
$$ 350445 377849 409620 431720 434540 418081 394998 384612 384611 401725 427331 468754 534201 600681
5415F00681L5901K887k0815l9656m9829m7537l4311L639L2775N2487P4454Q3234
$$ 600681 636582 639469 618654 578998 529169 481632 447321 450960 483735 536222 610676 693910
5403F93910P8086N5929L3361Q461L907O248K5015P1859R9569J27814J76856K31956
$$ 693910 771996 827925 861286 869747 873654 879902 904917 976776 1076345 1204159 1381015 1612971
5391A612971L28126N56679Q76690Q77715K71949l06109n41705o03981n07355k73210
$$ 1612971 1941097 2497776 3374466 4252181 4524130 4218021 3676316 3072335 2564980 2291770
5381B291770j31228j04632p0836j8625J0574K5950M7912P4461R7799J35069J70171
$$ 2291770 2160542 2055910 1985074 1966449 1977023 2002973 2050885 2125346 2223145 2358214 2528385
5370B528385K10818K57215L01246L89402M85778N57401N87604O42582P44252Q42031
$$ 2528385 2739203 2996418 3297664 3687066 4172844 4730245 5317849 5960431 6704683 7546714
5360G546714R51503J126645J428201J865727K515898L519393M878377O607581
$$ 7546714 8498217 9624862 11053063 12918790 15434688 18954081 23832458 30440039
5352C0440039R173186J3713495K2056485L6942422N7742854O7640923M1325726
$$ 30440039 39613225 53326720 75383205 112325627 170068481 237709404 279035130
5345B79035130n996759l7584173n0884062n1562007m0479725k6363211j6310581
$$ 279035130 273038371 235454198 184570136 133008129 92528404 66165193 49854612
5338D9854612j0702875p618366n768645m513103l532088k780311k204837j724124
$$ 49854612 39151737 31533371 25764726 21251623 17719535 14939224 12734387 11010263
5330A1010263j342771j062249q52910o56266m74751l72404l74147l84163l95097
$$ 11010263 9667492 8605243 7752333 7096067 6621316 6248912 5874765 5490602 5095505
5321E095505l75497l22401k90524k74797k46158k04935j83728j87886k28588k35874
$$ 5095505 4720008 4397607 4107083 3832286 3586128 3381193 3197465 3009579 2780991 2545117
5311B545117j81562r9452l7045l715K1244L5657L0176K6604k4034j04322j69751
$$ 2545117 2363555 2264103 2227058 2223343 2244587 2280244 2310420 2337024 2312990 2208668 2038917
5300B038917j81987j86946j77730j44284j07124r6794r2419o5780n1633m0903
$$ 2038917 1856930 1669984 1492254 1347970 1240846 1144052 1051633 985853 934220 893317
5290H93317L320R5012K49038L97881M19657J67268j24137k91089l52055l19021
$$ 893317 896637 991649 1240687 1638568 2058225 2225493 2101356 1810267 1458212 1139191
5280A139191k60978k03504j65884j05619n8692j2683M126K2461J2796l132l440
$$ 1139191 878213 674709 508825 403206 344514 331831 335957 358418 371214 368082 364642
5269C64642k6789l7051l6522l0333j2492R249N644J106o21L456N324J1414P167
$$ 364642 337853 300802 264280 233947 221455 230704 236348 237454 236833 240289 245613 257027 264194
5256B64194j6998l6668k8373q834l271J0708J0003J6049O483n648q276J252j1912
$$ 264194 247196 210528 182155 173321 170050 180758 190761 206810 213293 207645 199369 200621 188709
5243A88709k3946j9971j6035j1854j2307j1047J1627J8543K166J1357Q124o772
$$ 188709 164763 144792 128757 116903 104596 93549 105176 123719 125885 137242 145366 138594
5231A38594l1571k3585p215j3696o845K821J4051J8602K2924K2810K3211K3194
$$ 138594 107023 83438 76223 62527 55682 58503 72554 91156 114080 136890 160101 183295
5219A83295J7937P755j8952k8402k1575j3267p579M234N794K9304L9004L0158
$$ 183295 201232 208987 190035 161633 140058 126791 119212 123446 129240 158544 197548 227706
5207B27706M541p506l345m343j7672n770L759P450J7223J8660J4531R100M31j7965
$$ 227706 232247 224741 221396 217053 199381 193611 197370 204820 222043 240703 255234 264334 264765 246800
5193B46800n0936q5831j23176j15257n8587j0730J0546K5529K8774K3948K6185
$$ 246800 195864 110033 -13143 -128400 -186987 -197717 -187171 -161642 -132868 -108920 -82735
5182h2735K7711J3613j109l778j235k479p089K087J4813L2514O370O697J0535
$$ -82735 -55024 -41411 -42520 -46298 -47533 -50012 -57101 -55014 -40201 -7687 -1317 5380 15915
5169A5915K037K283O658L602M243O234j39n094j737j349j4227j9025l1656l2899
$$ 15915 17952 20235 26893 30495 34738 40972 40833 35739 34002 32653 18426 -599 -32255 -65154
5155f5154j5503J1549L7395L6202L2685J7351J4521J8221K451j458j3046k642
$$ -65154 -80657 -69108 -31713 4489 37174 54525 69046 87267 89718 88260 75214 72572
5143G2572Q53o648j1009j4256j0246q448n931J489J0852K0131J1882M449J3105
$$ 72572 73425 66777 55768 41512 31266 22818 16887 18376 29228 49359 61241 65690 78795
5130G8795m335k3620j9782n317o71R991K763j896j0320n907n08R267L499j3375
$$ 78795 74460 50840 31058 25741 25070 35061 37824 35928 25608 19701 19193 28460 31959 18584
5116A8584M56J1447j0348j9172q183k831O326J4099J5046P945n494q753j1787
$$ 18584 19040 30487 20139 967 -7216 -10047 -3721 10378 25424 33369 27875 19122 7335
5103G335j1400j3006J566J073j9792j1265j266N416J875k030J3538R280k809P001
$$ 7335 -4065 -17071 -15505 -14432 -34224 -45489 -46755 -41339 -39464 -41494 -27956 -18676 -21485 -14484
5089a4484M560L903J5182J8817J5972L569p691j1012j5069j8421o119l461J697
$$ -14484 -9924 -6021 9161 27978 43950 47519 39828 28816 13747 -4674 -10793 -14254 -12557
5076a2557R183J7402J1688N60O49j1895k6537j2334j857J100r72m221K106R413
$$ -12557 -3374 14028 25716 26276 26925 15030 -11507 -23841 -25698 -24598 -25570 -29791 -27685 -18272
5062a8272M917J3501p322p181P705J1858R883P875N201J0243L793j324j033J720
$$ -18272 -13355 146 -7176 -14357 -6652 5206 15089 22964 28165 38408 42201 40877 39844 41564
5048D1564J875R703m105j0351j1773l636l176J4767P515o83r348k335K1656K1451
$$ 41564 43439 53142 49037 38686 26913 23277 20101 34868 42383 41700 32352 30017 51673 73124
5034G3124O982q471m420m576j7368q863m75j1282q256k933o3q76k320p344o950
$$ 73124 80106 71635 67215 62639 45271 36408 35933 24651 16395 13462 13399 12523 10203 2859 -4091
5019d091M159l799o702o513j446P214L739J504j229j795j511Q242R570n00l768
$$ -4091 68 -3731 -10433 -16946 -18392 -11178 -7439 -5935 -7164 -8959 -10470 -2228 7342 6842 3074
5004C074l729n73n058L071J274L2L552m87m757o626k169J813k595j988L165R21
$$ 3074 -655 -1228 -6286 -3215 -1941 -1909 1643 1156 -3601 -10227 -12396 -10583 -13178 -15166 -12001 -11080
4988a1080M072P279p9M767N6p026R82P80m194R059Q553l626o224R45J068R083
$$ -11080 -7008 271 192 4959 5015 -2011 -1029 -249 -4443 4616 13169 9543 3319 4264 5332 14415
4972A4415M141k411j0196k290N278N46q903j5573R2J2406O925L385M773m132P385
$$ 14415 18556 16145 5949 3659 8937 9483 580 -14993 -14901 -2495 4430 7815 12588 8456 15841
4957A5841K384j1503m340K604P836Q126j1476j1340n973J000O842n870p548K351
$$ 15841 18225 6722 2382 4986 12822 20948 9472 -1868 -7841 -6841 1 -5869 -13417 -11066
4943a1066L504Q266J5836J2237N164n509m134J148k212r207m170J91l988o288
$$ -11066 -7562 704 16540 28777 33941 28432 24298 25446 23234 14027 9857 10048 6060 -228
4929b28M517Q344O03K834N224j73j3435N223K721Q655R120K513L385l729O399
$$ -228 4289 12633 13236 16070 21294 21121 7686 12909 15630 24285 33405 35918 39303 35574 41973
4914D1973J5817J5722J4425Q130M269R591J3730K2398L7594N4504P8020J18854
$$ 41973 57790 73512 87937 96067 100336 109927 123657 146055 183649 238153 316173 435027
4902D35027J97162L12525L61554K01081m2529k07458k67342k70275k11539j39174
$$ 435027 632189 944714 1306268 1507349 1464820 1257362 990020 719745 508206 369032
4892C69032p6772o0763m2688l7085k6298k0340m031k6263k1595j3876j1339O77
$$ 369032 292260 231497 188809 151724 125426 105086 101055 74792 53197 39321 27982 28659
4880B8659N254M45l26L481J6154P935j4658n777m664L07J0420j4584j6052j2164
$$ 28659 33913 34358 34032 37513 53667 61602 46944 41167 36503 36810 47230 32646 16594 4430
4866D430m905P926j6253n193O167M721J532m74Q270O367K009O009O715m41m54
$$ 4430 -475 7451 -8802 -13995 -7828 -3107 -1575 -2049 6221 12588 14597 20606 27321 26880 26426
4851B6426p236j912k754j2597m627K68o910J139K935J438j702L138J59q100l987
$$ 26426 19190 17278 14524 1927 -2700 -2432 -9342 -8203 -5268 -3830 -5532 -2394 -2235 -10335 -14322
4836a4322J3349L427Q366M246j1169m482K678R160M137N80j2638p300M98m79k447
$$ -14322 -973 2454 10820 15066 3897 -585 2093 11253 15390 15970 3332 -3968 -3470 -3949 -6396
4821f396J652R506L311M056r457j3532K446m112j303l839n590K685J193n527k682
$$ -6396 -4744 4762 8073 12129 2672 -10860 -8414 -12526 -13829 -17668 -23258 -20573 -19380 -24907 -27589
4806b7589K967K114l274O931J0954R384J917o810o220O749q0p464J446n593J891
$$ -27589 -24622 -22508 -25782 -18851 -7897 1487 3404 -3406 -9626 -2877 -2957 -10421 -8975 -14568 -12677
4791a2677Q600n668j1443P829L247o980j3404Q87P693M213n744L346J0923O814
$$ -12677 -4077 -9745 -21188 -13359 -10112 -17092 -30496 -29609 -21916 -17703 -23447 -20101 -9178 -2364
4777b364p859j7050L660J1744j274J566Q003R036k391M55j544K771J6595M852
$$ -2364 -10223 -27273 -23613 -11869 -13143 -11577 -3574 5462 3071 3526 1982 4753 21348 26200
4763B6200j1757j0322j9129o594O392J5100M482q441n942r299R2J0042K946K34
$$ 26200 14443 4121 -15008 -21602 -15210 -110 4372 -4069 -10011 -19310 -19218 -9176 -6230 -5996
4749e996O805O858l09m584o717k376o628q437q39J2025M123q179r457m689l771
$$ -5996 809 7667 7358 2774 -3943 -6319 -12947 -21384 -22223 -10198 -6075 -14254 -23711 -28400 -32171
4734c2171L423J218J031Q238Q555J738q475L984M172Q590P532k279R238K274k3171
$$ -32171 -28748 -27530 -26499 -18261 -9706 -7968 -16443 -12459 -8287 303 7835 5556 14794 17068 -6103
4719f103j9695l91r578R231M840J892K788J0028m529o743K137J7236j971n579
$$ -6103 -25798 -26189 -35767 -26536 -21696 -19804 -17016 -6988 -11517 -18260 -16123 1113 -858 -6437
4705f437l096J1633J3780l730k0327k716L246P192M140R341l164j1488n443O841
$$ -6437 -9533 2100 15880 12150 -8177 -10893 -7647 -455 3685 13026 9862 -1626 -7069 -228
4691b28o553l989K305O794M52j863r785r801N892R164l002m753K089n84P106P694
$$ -228 -6781 -10770 -8465 -1671 -1219 -3082 -12867 -22668 -16776 -7612 -10614 -15367 -13278 -13862 -6756 938
4675I38R78L128l224J428J116n151J799O926J492k509J99J87k550l215l033MQ578
$$ 938 1916 5044 1820 3248 4364 -787 1012 7938 9430 6921 7120 7307 4757 1542 -1491 -1487 7091
4658G091qj4087P35L972K430r571o184o551J0932M142p240j639L046N073p457
$$ 7091 7083 -7004 -6269 -2297 133 -9438 -15622 -22173 -11241 -7099 -14339 -15978 -12932 -7859 -15316
4643a5316j3061r728n35J0040K542k680J1721J5714l949m794n310L117J308P1
$$ -15316 -28377 -38105 -38640 -28600 -26058 -28738 -17017 -1303 -5252 -10046 -15356 -12239 -10931 -10860
4629a0860M545o497L003P777P036k16j2078n36k535rK315Q128L927j1621j963
$$ -10860 -6315 -12812 -9809 -2032 5004 4788 -7290 -7826 -10361 -10370 -8055 73 4000 -7621 -9584
4614i584l656L875L548p31L194p209R900Q323q575k940N324j51N834j30N35J137
$$ -9584 -13240 -9365 -5817 -6548 -3354 -10563 -663 7660 -915 -3855 1469 1318 7152 7022 7557 8694
4598H694l714n150q938j0599K628L906J0866l51r701p095l322k038L863O604Q959
$$ 8694 4980 -170 -9108 -19707 -17079 -13173 -2307 -2658 -12359 -19454 -22776 -24814 -20951 -14347 -5388
4583e388j129O607J64l754k412l35M093O430L796R68m206j0545o353N414j163
$$ -5388 -6517 90 254 -3500 -5912 -6247 -2154 4276 8072 9040 4834 -5711 -12064 -6650 -7813
4568g813o7o512L852K558j805m434J182K089L783k77l679m693p918p71N616L601
$$ -7813 -7880 -14392 -10540 -7982 -9787 -14221 -13039 -10950 -7167 -7444 -11123 -15816 -23734 -24505 -18889 -15288
4552a5288N054L809J899P188Q7j2806q664p698k130k071P719J2876L945K811N343
$$ -15288 -10234 -6425 -4526 2662 2749 -10057 -18721 -26419 -28549 -30620 -22901 -10025 -6080 -3269 2074
4537B074k349q622q72M855l073j0549P220J4294o721n534K12q701R950M401l314
$$ 2074 -275 -8897 -9769 -4914 -7987 -18536 -11316 2978 -3743 -9277 -9065 -17766 -7816 -3415 -6729
4522f729M84k035K836L436Q126J165j1447l777o85K444J486m156j0865j378P373
$$ -6729 -6245 -8280 -5444 -2008 6118 7283 -4164 -7941 -8626 -6182 -4696 -8852 -19717 -21095 -13722
4507a3722J1286R379l23J916P493o155j7353p636O992N885j473q93q88J487J266
$$ -13722 -2436 6943 6620 8536 16029 9874 -7479 -15115 -8123 -2238 -3711 -4604 -5492 -4005 -2739
4492b739Q705P95n555n189P156m37P54O455O857j617J609M286r776j4726M016
$$ -2739 5966 6761 1206 -3983 3173 2736 3490 9945 16802 15185 16794 21080 11304 -3422 594
4477E94K501l298p648N367P826j338k682N936p828r461K367j20K08k878K625J2736
$$ 594 3095 -203 -7851 -2484 5342 4004 1322 7258 -570 -10031 -7664 -7784 -7576 -10454 -7829 4907
4461D907L699j3501j0633P175N884q02p15L999m349L593Q574m41p555k047O278
$$ 4907 8606 -4895 -15528 -8353 -2469 -3271 -3986 13 -4336 -743 7831 7390 -165 -2212 4066
4446D066K020O751q121p598L765R338l12j5150l078N715J1157O848l976r541k719
$$ 4066 6086 12837 4716 -2882 883 10221 9909 -5241 -8319 -2604 8553 15401 11425 1884 -835
4431h35L363J25m234O907K287k025M467K334k728l275j1434O977O93k889J49o4
$$ -835 2528 2653 -1581 5326 7613 5588 10055 12389 9661 6386 -5048 1929 2622 -267 -118 -182
4415a82o536o24K587l089l424O446p32q768j0189N927K1913L591n013J55L13Q921
$$ -182 -6718 -7342 -4755 -7844 -11268 -4822 -5554 -14322 -24511 -18584 3329 6920 1907 2062 2375 11296
4399A1296J001m411m2k357k016n454J539J060J65K63m791l096J061j50K520N35
$$ 11296 12297 7886 7844 5487 3471 -1983 -444 616 781 1044 -3747 -6843 -5782 -5932 -3412 -2877
4383b877o519j1057J7988P272O765l422r580K854J503k884r891J615J825M942
$$ -2877 -9396 -20453 -2465 4807 11572 8150 -1430 1424 2927 43 -9848 -8233 -6408 -1466
4369a466J3941k444p273k418j0821O481N160J2289Q483m007j0360k291K191p465
$$ -1466 12475 10031 2758 340 -10481 -4000 1160 13449 21932 17925 7565 5274 7465 0
4355@o6J2954o738l680n431L434L071M994K453k573O750n091j2772r972M661J3819
$$ 0 -66 12888 6150 2470 -2961 473 3544 8538 10991 8418 15168 10077 -2695 -12667 -8006 5813
4339E813m706j3042L062P866J968n191J162L810M567o882L07N338J87j2403o571
$$ 5813 1107 -11935 -8873 -1007 961 -4230 -3068 742 5309 -1573 -1266 4072 4259 -8144 -14715
4324a4715L975k65Q432L558m775n20P741N631o259o835P63n475N051J1381L449
$$ -14715 -10740 -11005 -2573 985 -3790 -4310 3431 9062 2803 -4032 -3269 -8744 -3693 7688 11137
4309A1137K430K430m352M109J067p075l676P67j0087n060j206l414O550L790l587
$$ 11137 13567 15997 11645 15754 16821 9746 6070 6837 -3250 -8310 -9516 -12930 -6380 -2590 -6177
4294f177l855M243P194N178j1577q829J516L235P036n896j2575O600P003n356
$$ -6177 -10032 -5789 1405 6583 -4994 -13823 -12307 -9072 -2036 -7932 -20507 -13907 -6904 -12260
4280a2260J501k204K696P588j883j1135m38J2700J9841J741p184j0196j358k669
$$ -12260 -10759 -12963 -10267 -2679 -4562 -15697 -16135 -3435 16406 18147 10963 767 -591 -3260
4266c260K293R454m71m156r004k8M931j732j495l897o391M526K034j644O608O562
$$ -3260 -967 8487 8016 3860 -5144 -5172 -241 -1973 -3468 -7365 -13756 -9230 -7196 -8840 -2232 4330
4250D330m450m746J418J4241M952k320M490J0545p183M78p636j1943j694J2330
$$ 4330 -120 -4866 -3448 10793 15745 13425 17915 28460 21277 21755 14119 2176 482 12812
4236A2812l316o964N324R641K628O168K375r207l489j173l528l870n270K755M95
$$ 12812 9496 2532 7856 17497 20125 26293 28668 19461 15972 14799 11271 7401 2131 4886 5381
4221E381q7L418J1770N843k440J399m240l89K882j690K815m01m618o584r060N973
$$ 5381 5294 8712 20482 26325 23885 25284 21044 20655 23537 21847 24662 24261 19643 13059 3999 9972
4205I972J2961K134p824J972M64N425l180M834k25n495o514K441O575K028N523
$$ 9972 22933 25067 17243 19215 19679 25104 21924 26758 26533 21038 14524 16965 23540 25568 31091
4190C1091O896m930j0434m28k583k067l170J752J0393M797M09Q04O439p8o528
$$ 31091 37987 33057 22623 22195 19612 17545 14375 16127 26520 31317 31726 32530 38969 38891 32363
4175C2363l340P785m605r751m45N256O593R235o564m911J267K392p722M830R484
$$ 32363 29023 36808 32203 22452 22007 27263 33856 43091 36527 31616 32883 35275 27553 32383 41867
4160D1867j049k701J201n013j1326L445Q214L582P484o661o998M761M150M317
$$ 41867 40818 38117 39318 34305 22979 26424 34638 38220 45704 39043 32045 36806 40956 45273
4146D5273k670p689l583M661j521M106P959O720m991j3701n660l307p926J4844
$$ 45273 42603 34914 31331 35992 34471 38577 46536 53256 48265 34564 28904 25597 17671 32515
4132C2515L594j5205N403M33o755j782Q629O640l620k082J290K428N854L083p131
$$ 32515 36109 20904 26307 26740 19985 18203 26832 33472 29852 27770 29060 31488 37342 40425 33294
4117C3294k959O052m180K634L777P423J0793N294l788j9722j2899N934J627L664
$$ 33294 30335 36387 32207 34841 38618 46041 56834 62128 58340 38618 25719 31653 33280 36944
4103C6944J0973R096O99j7921k331O484M113r751q707N233R778K018j678P602
$$ 36944 47917 57013 57712 39791 37460 43944 48057 38306 29599 34832 44610 46628 44950 52552
4089E2552L423q860p610m049o140K305J4417R60q180r525J2753J0150k884K663
$$ 52552 55975 47115 39505 35456 29316 31621 46038 46998 38818 29293 42046 52196 49312 51975
4075E1975J4l803K74J049R34l553j335P772J3627p54j3902j921J1468p57j0787
$$ 51975 51989 48186 48460 49509 50443 46890 45555 53327 66954 66200 52298 50377 61845 61088 50301
4060E0301r977P93O288j871O484M915o255J308O680P054p475n483L222j114N891
$$ 50301 40324 41117 47405 45534 52018 56933 50678 51986 58666 65720 58245 52762 55984 54870 60761
4045F0761M813L356N263N102R71k108k477p565n532Q072m087k006O716j0821L455
$$ 60761 65574 68930 74193 79295 80266 78158 75681 68116 62584 70656 66569 64563 71279 60458 63913
4030F3913J697n553J279N702p93J772p64L309O01r023P334J0461o045O630M854
$$ 63913 65610 60057 61336 67038 66245 68017 67253 70562 71163 62140 69474 79935 73890 80520 85374
4015H5374p175J681L037L19l177k386k405K252P705r62O167q357j228M371Q203
$$ 85374 78199 79880 82917 83236 80059 77673 75268 77520 85225 84263 90430 82073 80845 85216 93419
4000I3419Q418l951j2058M363N608P934k64j157L212k637N912K712R19M411n220
$$ 93419 101837 97886 85828 90191 95799 103733 103469 102312 105524 102887 108799 111511 112430 116841 111621
3985A11621j1009j681O2L273O355K570J488N579j883o76l265j0145J376R970Q357
$$ 111621 100612 98931 98993 102266 108621 111191 112679 118258 116375 115699 112434 102289 103665 113635 121992
3970A21992J1197n35N87M537k092k106L368J494K692j048N88N27R71J338q07K186
$$ 121992 133189 132654 133241 137778 135686 133580 136948 138442 141134 140086 140674 141201 142172 143510 142703 144889
3954A44889J0931L965j70L669M212K424J5583J3422q0n719Q162P031J326P094
$$ 144889 155820 159785 159615 163284 167496 169920 185503 198925 198845 193126 201288 208319 209645 216739
3940B16739M164o596j793J76l443J4489Q538j229Q811J0161J0586P081O410J1342
$$ 216739 220903 214307 212514 212690 209247 223736 232274 231045 239856 250017 260603 267684 274094 285436
3926B85436J0338J1148L099j713K319K6776J8703R0J3028J0159o16J5061J4620
$$ 285436 295774 306922 310021 308308 310627 337403 356106 356196 369224 379383 378767 393828 408448
3913D08448Q411P972K2092K5768R288J0996O347j012J3085K7294L2664L6985K0706
$$ 408448 416859 424831 446923 472691 481979 492975 499322 498310 511395 538689 571353 608338 629044
3900F29044K0405J7483M0469L8825K5243J6508K2449L3705M0986M0789M9738M1010
$$ 629044 649449 666932 707401 746226 771469 787977 810426 844131 885117 925906 975644 1016654
3888A016654M9673M4686M6407N3442P0099O6032Q4301R4362R9187R4733J01613
$$ 1016654 1066327 1111013 1157420 1210862 1280961 1346993 1431294 1525656 1624843 1719576 1821189
3877A821189J20132J32238J39034J34296J60637J87695J94189K06926K11137K24178
$$ 1821189 1941321 2073559 2212593 2346889 2507526 2695221 2889410 3096336 3307473 3531651
3867C531651K28512K61780K62680K52349K73060K73719K62216K54361K27234K11729
$$ 3531651 3760163 4021943 4284623 4536972 4810032 5083751 5345967 5600328 5827562 6039291
3857F039291J97732J72021J40447J00342Q3777M8339J6242J807r071p445p535
$$ 6039291 6237023 6409044 6549491 6649833 6733610 6781949 6798191 6799998 6790927 6783482 6775947
3846F775947q089N5J3011K6155M2349O2273Q3069J09977J44143J51620J87800
$$ 6775947 6767858 6767913 6780924 6807079 6849428 6911701 6994770 7104747 7248890 7400510 7588310
3835G588310K25327K64517K94246L25891L58677L69103M10554M48713M49304M27700
$$ 7588310 7813637 8078154 8372400 8698291 9056968 9426071 9836625 10285338 10734642 11162342
3825A1162342M27930L90657L41917K64232J68139Q4897j3060j14710k26044l08373
$$ 11162342 11590272 11980929 12322846 12587078 12755217 12840114 12827054 12712344 12486300 12177927
3815A2177927l77473m07524m55986m82136m89101m67647m49151m34656m10779
$$ 12177927 11800454 11392930 10936944 10454808 9965707 9498060 9048909 8614253 8203474
3806H203474l70237l22038k86201k59415k38129k11792j88381j62675j38999j15481
$$ 8203474 7833237 7511199 7224998 6965583 6727454 6515662 6327281 6164606 6025607 5910126
3796E910126q6500o7486m6266m8936l6143k7275k3837j3427j4700j8552k7032
$$ 5910126 5823626 5756140 5709874 5660938 5624795 5597520 5573683 5560256 5545556 5527004 5499972
3785E499972m6172n0558q1930j02201j05462j29253j48630j69356j78507j82902
$$ 5499972 5453800 5403242 5321312 5219111 5113649 4984396 4835766 4666410 4487903 4305001
3775D305001j96518k13949k23139k14890k11845j93794j86723j76179j73218j61988
$$ 4305001 4108483 3894534 3671395 3456505 3244660 3050866 2864143 2687964 2514746 2352758
3765B352758j37592j26519j26380j13575j16596j09070r3282q0519p2218p3851
$$ 2352758 2215166 2088647 1962267 1848692 1732096 1623026 1529744 1449225 1377007 1303156
3755A303156p6295p9417o9836n1269m3933n6140m5017l5897k8905l3010m8191
$$ 1303156 1226861 1147444 1077608 1026339 982406 926266 881249 845352 816447 783437 735246
3744G35246l4381k7495k8172k9617k6266k6262j3639j6038k3846j5871o496j0331
$$ 735246 700865 673370 645198 615581 589315 563053 549414 533376 509530 493659 487163 476832
3732D76832k7956k4516q310j0925j3274j6287j3400p441r871j2161o184L55j2717
$$ 476832 448876 424360 416050 405125 391851 375564 362164 354723 344852 332691 326507 326862 314145
3719C14145j5038j1178p813p394l595l682j0113k0001j912q397L315R10j7327
$$ 314145 299107 287929 280116 272722 269127 265445 255332 235331 233419 225022 228337 229247 211920
3706B11920k004J0748q235j1971N521L278j2696j0625j0252m543q577K360j1233
$$ 211920 209916 220664 212429 200458 205979 209257 196561 185936 175684 171141 162564 164924 153691
3693A53691L303O072J1203k209n499q922j1866N853k539p875j5877n04J0701Q462
$$ 153691 156994 163066 174269 172060 166561 157639 145773 151626 149087 141212 125335 124831 135532 143994
3679A43994l599j7485j4372K222N102o897N907l245k643j256q99J596j0369o643
$$ 143994 140395 122910 108538 110760 115862 108965 114872 111627 108984 107728 106829 108425 98056 91413
3665I1413J1217M382P084n906n160p629k176p030J037j6801j3705j441R067j268
$$ 91413 102630 107012 114096 108190 103030 95401 93225 86195 87232 70431 56726 55285 64352 63084
3651F3084j4031N676M564l243l083O749M816K936o074L139j313K441R119Q724
$$ 63084 49053 54729 59293 56050 52967 59716 64532 67468 61394 64533 63220 65661 74780 83504
3637H3504K714q468q942o372l847q291r92N025j020q456r690O68M679M262l858
$$ 83504 86218 77750 68808 62436 58589 50298 49306 54331 53311 44855 35165 35833 40512 44774 40916
3622D0916m228O943J861J200m048k860j360l884N203J730O998K266j3333m111
$$ 40916 36688 43631 45492 46692 42644 39784 38424 34540 39743 41473 48471 50737 37404 33293
3608C3293q345P228P537m841m799R360N016o125j79j3073l307Q683m97k976q78
$$ 33293 24948 32176 39713 34872 30073 39433 44449 38324 38145 25072 21765 30448 29951 26975 26097
3593B6097M786K002J766M364j4343j1801n254M235R70O351O32J067m67P116p557
$$ 26097 30883 32885 34651 39015 24672 12871 7617 11852 12822 19173 19805 20872 20405 27521 19964
3578A9964l567j653q3K527P73O822J865O999M100q839M875o99k30m323l779O225
$$ 19964 16397 14744 14661 17188 17961 24783 26648 33647 37747 28908 33783 33084 32854 28531 24752 30977
3562C0977l421j2483L060R08J380J270J0263N963k135r414o273j1630J249J4707
$$ 30977 27556 15073 18133 19041 20421 21691 31954 37917 35782 26368 20095 8465 9714 24421
3548B4421n14p838O091K792J006Q814r805l561n87l76l980j5979j1480O762J410
$$ 24421 23907 16069 22160 24952 25958 34772 24967 21406 20819 20443 16463 484 -10996 -4234 -2824
3533b824M014j163R577N429j0136R76l594K952J1023k341q809n857O476N082K629
$$ -2824 1190 27 9604 15033 4897 5873 2279 5231 16254 13913 5104 -753 5723 10805 13434
3518A3434j793K049M06j5794q88N523Q331j198N478j37p818m853p164Q9O353j625
$$ 13434 11641 13690 14096 -1698 -2586 2937 11268 10070 15548 15411 7593 2740 -4424 -4335 2018 393
3502C93J277K072J3448L106o826j97q632o747j1139O046O574Q782P774o953j682
$$ 393 1670 3742 17190 20296 13470 13273 4641 -2106 -13245 -7199 -625 8157 15931 8978 7296
3487G296J0875N661o433k550K885m414p092n222P067k096o271o819j750k090L806
$$ 7296 18171 23832 17399 14849 17734 13320 6228 1006 8073 5977 -294 -7113 -8863 -10953 -7147
3472g147Q607L140r871j00O828K765r785K4N524O089M379p411j4215P89N88k063
$$ -7147 1460 4600 -5271 -5371 1457 4222 -5563 -5539 -15 6074 10453 3042 -11173 -10384 -9796 -11859
3456a1859J689m221r688O679Q434L636O560j532p542r408q40L064N329J1015J1608
$$ -11859 -10170 -14391 -24079 -17400 -8966 -5330 1230 -302 -7844 -17252 -18092 -15028 -9699 1316 12924
3441A2924J024j2773Q55J5060J0108j3545p410M469J844R33q052K019K068j0536
$$ 12924 13948 1175 2030 17090 27198 13653 6243 10712 12556 13489 5437 7456 9524 -1012
3427a012n833N458J0545l69M8r688m478N255r482m831K02j715N986M903k094Q117
$$ -1012 -6845 -1387 9158 8789 8837 -851 -5329 -74 -9556 -14387 -14185 -15900 -9914 -5011 -7105 1012
3411A012P289O325M883r610j0016M916o57R02k007K74J1224M626j3379q176K406
$$ 1012 8301 14626 19509 9899 -117 4799 4142 5044 3037 3311 14535 19161 5782 -2394 12
3396A2O196O378j77j2147j0818N236L545k94n015j540Q901O997L929q483k906
$$ 12 6208 12586 12409 262 -10556 -5320 -1775 -2069 -7084 -8624 277 7274 11203 2720 -186
3381a86J755R536k150m475o651P67L337M004j405O851M785N69o070J396m48r22
$$ -186 1569 11105 8955 4480 -2171 -1404 1933 5937 4532 11383 16168 16737 10667 12063 11615 10693
3365A0693M054l395l796j478k164q29m423j183K29J343J435J998N236n345j0953
$$ 10693 14747 11352 7556 6078 3914 3085 -1338 -2521 -2292 -949 486 2484 7720 2375 -8578
3350h578p532Q927J3862M604L589l595J34j2L445j2468q639K62j930p126j0398
$$ -8578 -16110 -7183 6679 11283 14872 11277 11411 11399 14844 2376 -6263 -6001 -7931 -15057 -25455
3335b5455n27J1039Q030J0595L217Q651q160K037J078j0444p78L591L20K358q064
$$ -25455 -25982 -14943 -6913 3682 6899 15550 7390 9427 10505 61 -717 2874 3194 5552 -2512
3320b512Q21N671k281K174j224n331m549l864R347J1019p49j4978n287O483J3689
$$ -2512 -1691 3980 1699 3873 2649 -2682 -7231 -11095 -1748 9271 8522 -6456 -11743 -5260 8429
3305H429K964j2499Q97k16j3382R30L998J608M165j329m911K033J1099o032k757
$$ 8429 11393 -1106 -209 -425 -13807 -12877 -8879 -7271 -3106 -4435 -9346 -7313 3786 -2246 -5003
3290e003J980k522M829k273l324m798o034q733q57p5Q285R73L670J374M030k307
$$ -5003 -3023 -5545 -716 -2989 -6313 -11111 -17145 -25878 -26735 -26810 -18525 -17552 -13882 -12508 -8478 -10785
3274a0785J0094m915m996M234j3M311o461l955l630r92J0846J7133l7k209o168
$$ -10785 -691 -5606 -10602 -6368 -6381 -2070 -8531 -12486 -16116 -17108 -6262 10871 10834 8625 2457
3259B457m202k12l212k862L127N908n764L636K32o326J4155L214K43R999M336
$$ 2457 -1745 -1957 -5169 -8031 -4904 1004 -4760 -1124 -892 -7218 6937 10151 10394 20393 24729
3244B4729l391n346J316j894N590K065M457j2812j6159M474R966q1n596o985L741
$$ 24729 21338 15992 17308 15414 21004 23069 27526 14714 -1445 3029 12995 12914 7318 333 4074
3229D074Q178p142m207k353L103J665j701p928Q18J0105N158k219M005n462q963
$$ 4074 12252 5110 903 -1450 1653 3318 1617 -6311 -5493 4612 9770 7551 11556 6094 -2869
3214b869J526l12O429j9j352j531k487M454J072L027Q342M638r978n351l008O351
$$ -2869 -1343 -1655 4774 4755 3403 1872 -615 3839 4911 7938 16280 20918 10940 5589 2581 8932
3198H932k734j432k85l854N631M275k796j730N09n457K772J1692M776m112K032
$$ 8932 6198 4766 4481 627 6258 10533 7737 6007 6516 1059 3831 15523 20299 16187 18219
3183A8219L746J219J901j5506j9781L301O243l496k946L194o392k79L101o9m758
$$ 18219 21965 23184 25085 9579 -10202 -6901 -658 -4154 -7100 -3906 -10298 -10577 -7476 -7545 -12303
3168a2303r890K383J7284P254n255j5106k907j14p288k379K919q72N062k03L575
$$ -12303 -22193 -19810 -2526 4728 -527 -15633 -18540 -18654 -25942 -28321 -25402 -26274 -21212 -21415 -17840
3153a7840k643k253O398j0657N60N917J5258L527o898m585o060r863j836J0122
$$ -17840 -20483 -22736 -16338 -26995 -26435 -20518 -5260 -1733 -8631 -13216 -19276 -29139 -30975 -20853
3139b0853M957K369j2m099K477J1893J0643K456j5680n834L636k017Q36k309L538
$$ -20853 -15896 -13527 -13539 -17638 -15161 -3268 7375 9831 -5849 -11683 -8047 -10064 -9228 -11537 -7999
3124g999L064j587J217M135k313J565L809P89O925l921N92n251n778O259N471
$$ -7999 -4935 -6522 -5305 -1170 -3483 -1918 1891 2680 9605 5684 6276 1025 -4753 1506 6977
3109F977M402J9736K0360J9542L195R18o474j318M538N106K97J249r110q247j9541
$$ 6977 11379 31115 51475 71017 74212 75130 68656 67338 71876 76982 77279 78528 69418 61171 41630
3094D1630k0339o074o694l056j001j5220J102J8058M390m876j3684o551k165m37
$$ 41630 21291 15217 8523 5467 4466 -10754 -9652 8406 12796 7920 -5764 -12315 -14480 -14917
3080a4917k798l161M956O279M953N827L438J685j9223J368M213O763M284L801
$$ -14917 -17715 -20876 -15920 -9641 -4688 1139 4577 6262 -12961 -11593 -7380 -617 3667 7468
3066G468o963Q333M675k773o648n749k226m173r243m199J389J0546M929n682p990
$$ 7468 505 8838 13513 10740 4092 -1657 -3883 -8056 -17299 -21498 -20109 -9563 -4634 -10316 -18306
3051a8306M960r92J205k539j987K174N508N834N629m614q860Q280J937P517n297
$$ -18306 -13346 -14338 -13133 -15672 -17659 -15485 -9977 -4143 1486 -3128 -11988 -3708 -1771 5746 449
3036D49j0382l938j703M812O874j908k505o293K466Q752J0616J28q550r588j2173
$$ 449 -9933 -13871 -15574 -10762 -3888 -5796 -8301 -14594 -12128 -3376 7240 7368 -1182 -10770 -22943
3021b2943k190O699N752P085N491o259l251r901K651N397K498p081q47l320l935
$$ -22943 -25133 -18434 -12682 -5597 -106 -6365 -9616 -19517 -16866 -11469 -8971 -16052 -16899 -20219 -24154
3006b4154m528M643N524L21J1404J755o613p48J061M542l058M706k451p721P068
$$ -24154 -28682 -24039 -18515 -18194 -6790 -5035 -11648 -12396 -11335 -6793 -9851 -5145 -7596 -15317 -8249
2991h249o695r4Q646M368o629o579q306j351m81N301P610k122j68k640J592l413
$$ -8249 -14944 -15038 -6392 -2024 -8653 -15232 -23538 -24889 -25370 -20069 -12459 -14581 -14749 -17389 -15797 -19210
2975a9210o29n311Q9P130Q899M91l050j833K851L081N159r66L784M841N591J316
$$ -19210 -19839 -25150 -25061 -17931 -9032 -8541 -11591 -13424 -10573 -7492 -2333 -3299 485 5326 10917 12233
2959A2233l389o77p372l755N953j298q757n039j541R72j1327R374N17N37L148
$$ 12233 8844 8167 795 -2960 2993 1695 -7062 -12101 -13642 -12670 -23997 -14623 -14106 -13569 -10421
2944a0421Q80M550l363L670L155o474l810j068K942j265N84R911Q385k767O08
$$ -10421 -9541 -4991 -8354 -4684 -1529 -8003 -11813 -12881 -9939 -11204 -10620 -709 7676 4909 5517
2929E517m250l109K968J1402m351m978k625K682M528L654R560n745j0230j4k196
$$ 5517 1267 -1842 1126 12528 8177 3199 574 3256 7784 11438 20998 15253 5023 5009 2813
2914B813p218J633J850K751L98p104l09J547l698l599l537P931K226K470M383
$$ 2813 -4405 -2772 -922 1829 2227 -4877 -5186 -3639 -7337 -10936 -14473 -6542 -4316 -1846 2537
2899B537Q923m778j0438l389N176k737j139q185l245J026J1354J066n374n283
$$ 2537 11460 6682 -3756 -7145 -1969 -4706 -5845 -14030 -17275 -16249 -4895 -3829 -9203 -14486
2885a4486N296m14Q181r791l343J077J778R69Q545m662j189M989M023j149m635
$$ -14486 -9190 -9604 -1423 -11214 -14557 -13480 -11702 -10733 -2188 -6850 -8039 -3050 973 -176 -4811
2870d811l968P015K315L06k742L237P507R28M909o348p040O756o339j5892j433
$$ -4811 -8779 -1764 551 857 -1885 1352 8859 9787 14696 8348 1308 8064 1725 -14167 -15600
2855a5600J2193J562m742N142k404j550K069j898n859k38r55p443L161R275R113
$$ -15600 -3407 -1845 -6587 -1445 -3849 -5399 -3330 -5228 -11087 -11325 -12280 -19723 -16562 -7287 1826
2840A826R080K841N649L864n703p78L720j0037j467O486r66n179q58o674o226
$$ 1826 10906 13747 19396 23260 17557 16779 20499 10462 8995 15481 14515 9336 8478 1804 -4422
2825d422L397J504P92j532K384q089O104k506j0229N528J2506K488n941M230J789
$$ -4422 -1025 479 1271 -261 2123 -5966 138 -2368 -12597 -7069 5437 7925 1984 6214 8003
2810H003j2322l117J0382n771j955N728l252j924n704Q730J532j1881Q074k233
$$ 8003 -4319 -7436 2946 -2825 -4780 948 -2304 -4228 -9932 -1202 330 -11551 -3477 -5710
2796e710r502K042J121j33o26j976n456M58l36j758O99J2088J314j1340l308K321
$$ -5710 -15212 -13170 -12049 -12182 -12808 -14784 -20240 -19782 -20118 -21876 -21177 -9089 -7775 -19115 -22423 -20102
2780b0102M437p50K776K065J136q670p956J804j824k373M044Q581N980M938r615
$$ -20102 -15665 -16415 -13639 -11574 -10438 -19108 -27064 -25260 -27084 -29457 -25413 -16832 -10852 -5914 -15529
2765a5529N586J3420L427o420K147l121j0260m913m815Q411J5051M978q522J737
$$ -15529 -9943 3477 6904 484 2631 -490 -10750 -15663 -20478 -12067 2984 7962 -560 1177
2751A177J2116k487n558n611q409k736j811k708j924O002J673N972l192m717Q269
$$ 1177 13293 10806 5248 -363 -8772 -11508 -13319 -16027 -17951 -11949 -10276 -4304 -7496 -12213 -3944
2736c944M182N794j343n367j90O337J05j597o042m306N039M706J0805O422n887
$$ -3944 238 6032 4689 -678 -868 5469 5574 3977 -2065 -6371 -1332 3374 14179 20601 14714
2721A4714Q317J0233n153l927j865J364m163q466j2129j792L307m914K355M006
$$ 14714 23031 33264 28111 24184 22319 23683 19520 11054 -1075 -2867 440 -4474 -2119 1887
2707A887k649K279k085j598k409M87O925j79k882n371p578P042O340O977k650
$$ 1887 -762 1517 -568 -2166 -4575 -4088 2837 2658 -224 -5595 -13173 -6131 209 7186 4536
2692D536N92K70l644O218k221q52K349p56l525j58O189m336q301k58R734q73O46
$$ 4536 5128 5398 1754 7972 5751 4899 7248 6492 2967 2809 8998 4662 -3639 -3897 5837 4964 5610
2675E610p383r974L051N332N629M111m985k922K081J4802L271k842O947l8o409
$$ 5610 -1773 -11747 -8696 -3364 2265 6376 1391 -1531 550 15352 18623 15781 22728 22690 16281
2660A6281Q25m197o260j71n189n630J0109Q16k947J041r69N768P794L382p749
$$ 16281 17106 12909 6649 6478 1289 -4341 5768 6584 3637 4678 3709 9477 17271 20653 12904
2645A2904k826K371r589K194p467j6063O867J0898P489J034j369M277Q070r269
$$ 12904 10078 12449 2860 5054 -2413 -18476 -11609 -711 6778 7812 6443 10720 18790 9521
2631I521j1536O076P566j4k103M129n693n659N348m017N374k187m589k037N626
$$ 9521 -2015 4061 11627 11613 9510 13639 7946 2287 7635 3618 8992 6805 2216 179 5805
2616E805J3738n747m891j537R20q117K029L909k827O198p244k128L801N054N194
$$ 5805 19543 13796 8905 7368 8288 171 2200 6109 3282 9480 2236 108 3909 8963 14157
2601A4157j168p589J326N179R031m305J140q151k325O502M779q952p744N39L299
$$ 14157 12989 5400 6726 11905 20936 16631 17771 9620 7295 13797 18576 9624 1880 2419 5718
2586E718J4319O12J16N931N031Q802J4427J2863L757Q333j044r913R292K0117
$$ 5718 20037 20649 20765 26696 31727 40529 54956 67819 71576 79909 78865 68952 78244 98361
2572I8361J4020K2910K7989L6681O4251R1479J46102K37652M25165Q33599J301626
$$ 98361 112381 135291 163280 199961 264212 355691 501793 739445 1164610 1998209 3299835
2561C299835N31220m82528o32494p70049p29372m29896k28868j55359p8596n4648
$$ 3299835 3831055 3348527 2716033 1945984 1216612 786716 557848 402489 323893 269245
2551B69245n2665l2047k1255k4779j8830j0702j2358k116L916P371j557m633j3990
$$ 269245 216580 184533 163278 138499 119669 108967 96609 94493 98409 105780 104223 99590 85600
2538H5600q342j1055j3828l067l56K819p548K342J367j0173r224N841o70j5257
$$ 85600 77258 66203 52375 49308 48952 51771 44223 46565 47932 37759 28535 34376 33706 18449
2524A8449o150N83M016K80l274l661P31M762J0448N370j2360j0968M444Q105k041
$$ 18449 12299 12882 16898 17178 13904 10243 10974 15736 26184 31554 19194 8226 12670 20775 18734
2509A8734k386o098j4148k48Q743P448r894k299j621M990P904J128l016j510M340
$$ 18734 16348 10250 -3898 -4146 4597 12045 2151 -148 -1769 3221 11125 12253 9237 7727 12067
2494A2067P686Q238m882n123K057K582l41N13R07J200m554J463L43m724P988J0262
$$ 12067 19753 27991 23109 17986 20043 22625 22284 22797 23704 24904 20350 21813 22156 17432 25420 35682
2478C5682J4410J7012O841N104M691N62J0723R564K2661L1006K6440K3742M4494
$$ 35682 50092 67104 73945 79049 83740 84302 95025 104589 127250 158256 184696 208438 252932
2465B52932P4532J15707J68717K85127N16020Q14677R31783M96307j83499n61171
$$ 252932 327464 443171 611888 897015 1413035 2227712 3159495 3655802 3472303 2911132
2455B911132p02051o83393n04437l09806j76104j14720q5962o2640m8754l8603
$$ 2911132 2209081 1525688 1021251 711445 535341 420621 334659 272019 223265 184662
2445A84662j5455j2289j3819k1090j4918j2389q484l02m308P7O796l768j308n229
$$ 184662 169207 156918 143099 122009 107091 94702 86218 85916 81608 81685 88481 84713 83405 78176
2431G8176L38p183j4223q442j3576Q885O055N730n12q227j718M622Q86q826Q04
$$ 78176 78514 71331 57108 48666 35090 43975 50030 55760 55248 47021 45303 49925 50811 41985 42789
2416D2789M255k325p334l430J1528O101j0833j2229j383n140M879M908J512n074
$$ 42789 47044 44719 37385 33955 45483 51584 40751 28522 27139 21999 26878 31786 33298 28224
2402B8224j734j1609l401J7933L569J559l997P548p455j2884j489j066J1000J659
$$ 28224 26490 14881 11480 29413 32982 34541 30544 38092 30637 17753 16264 15198 26198 27857
2388B7857m842p697l436J0487O941k658m444J1620Q453K767M390K98j1743O914
$$ 27857 23015 15318 11882 22369 29310 26652 22208 33828 42281 45048 49438 49736 37993 44907
2374D4907J1768N47o88L907J6433J9346L0820L6566O2389Q9574J59739K87408
$$ 44907 56675 57222 56534 60441 76874 96220 127040 163606 225995 315569 475308 762716
2362G62716M26981M26048J72394j41867l13624l49638l07990k26125j33330p5846
$$ 762716 1189697 1615745 1788139 1646272 1332648 983010 675020 448895 315565 239719
2352B39719n1059k4463k2759j9269k6260j7285n236k454K03p111r985p141N081
$$ 239719 188660 164197 141438 122169 95909 78624 73388 70934 71137 64026 54041 46900 51981
2339E1981l468N944L531m345n151P336k547j3945m35O889M731o070n365L157M450
$$ 51981 48513 54457 57988 53643 48492 55828 53281 39336 38901 45790 50521 44451 39086 42243 46693
2324D6693k981K703N239L280q718m97K715j925n283M027J486m584q480Q751N895
$$ 46693 43712 46415 51654 54934 46216 45719 48434 46509 41226 45253 46739 42155 33675 42426 48321
2309D8321r157K372M125J291N975K247P104M651n877j283M885R917J92O90j661
$$ 48321 39164 41536 45661 46952 52927 55174 62278 66929 61052 59769 64654 74571 74763 75453 73792
2294G3792j1132p425N96O027R224M223Q851P402j25M98J415k133l954J8073J1227
$$ 73792 62660 55235 55831 61858 71082 75305 84156 91558 91433 91931 93346 91213 87259 105332 116559
2279A16559l444Q008N591j215J3277J1182m016m559q963M849Q043L263Q398J1998
$$ 116559 113115 121123 126714 125499 138776 149958 145942 141383 132420 137269 145312 148575 156973 168971
2265A68971O580Q881J6952K003M927J4717P232m84J7211K4072K4379J2737J7271
$$ 168971 175551 184432 201384 203387 208314 223031 230263 229779 246990 271062 295441 308178 325449
2252C25449J6949K0365R527J1994J6465K4453L1281L0566J4309K1231K8701K0872
$$ 325449 342398 362763 372290 384284 400749 425202 456483 487049 501358 522589 551290 572162
2240E72162K0016M078J3460N119j426J3084P858M708M070p158m601Q93j8143k0666
$$ 572162 592178 596256 609716 614835 613409 626493 634351 639059 643129 635971 631370 632263 614120 593454
2226E93454j4855q343k0250k8279k2850j8917k3285j2876j3163k1646k4183k1568
$$ 593454 578599 570256 550006 521727 498877 479960 456675 443799 430636 408990 384807 363239
2214C63239j5394k4552k3092j1472l947q768j1355j6246j1786j9387o203j0066
$$ 363239 347845 323293 300201 288729 284782 276014 264659 248413 236627 217240 211037 200971
2202B00971j4125o806p947p755o137J5J108j3990K424r218o202o848n373m036
$$ 200971 186846 180040 172093 164338 158201 158216 159324 145334 147758 138540 132338 125490 120117 116081
2188A16081J794j2030p795j1810q888j1390n843K093Q951o028r569n030o527L312
$$ 116081 117875 105845 98050 86240 77352 65962 60119 62212 71163 65135 55566 50536 44009 47321
2174D7321N043M382o14n114l069j901M408m34n51p794q898j553m383l878N935
$$ 47321 52364 56746 56132 51018 47949 46048 50456 50022 49471 41677 32779 31226 26843 22965 28900
2159B8900K653M927J681j861J330k118o685n022J562m491q012J321R172l277M196
$$ 28900 31553 36480 38161 36300 37630 35512 28827 23805 25367 20876 12864 14185 23357 20080 24276
2144B4276J191M560o260j38j959k458m031L530L606L032p953k675q041K831M594
$$ 24276 25467 30027 23767 23629 21670 19212 15181 18711 22317 25349 17396 14721 6680 9511 14105
2129A4105R715R929o875j0396o231L692l210k375O325M93j952j051L199J457n923
$$ 14105 23820 33749 26874 16478 10247 13939 10729 8354 14679 15172 13220 12169 15368 16825 10902
2114A0902j0580R4O965l193p31N251m762M879m146N678P920N211j4058j0411j671
$$ 10902 322 416 7381 4188 3457 8708 3946 8825 4679 10357 18277 23488 9430 -981 -2652
2099b652K376o41M839J272J525j578L658N176o802k648L210K669J1531J883q127
$$ -2652 -276 -917 3922 5194 6719 5141 8799 13975 7173 4525 7735 10404 21935 23818 15691
2084A5691J861J306j3990r714k154L42O429m845p348Q2J0092L001O850M827l808
$$ 15691 17552 18858 4868 -4846 -7000 -6658 -229 -5074 -12422 -12340 -2248 753 7603 12430 8622
2069H622q52N022L515j1891m628Q847l395j0680q580P440L912P157m809o246m820
$$ 8622 7770 12792 16307 4416 -212 8635 5240 -5440 -14020 -6580 -2668 4489 -320 -6566 -11386
2054a1386q518J1258J6377P847l027p594k101k45N361J3146J3919l678q200r585
$$ -11386 -19904 -8646 7731 15578 12551 4957 2856 2611 7972 21118 35037 31359 23159 13574
2040A3574j2786j0074O193L76o57n503p767J132N44K698J3753J47p539o536n356
$$ 13574 788 -9286 -3093 -2717 -3374 -8877 -16644 -15512 -14968 -12270 1483 1630 -5909 -12445 -17801
2025a7801J700R235o761k974L44J3093K4481p21q882r556q422j905k230l754P433
$$ -17801 -16101 -6866 -13627 -16601 -16257 -3164 21317 20596 11714 2158 -6264 -8169 -10399 -14153 -6720
2010f720k033p285R344N509l423J802o837j281k25R691k66j0228m14R127L778
$$ -6720 -8753 -16038 -6694 -1185 -4608 -2806 -9643 -10924 -11149 -1458 -1724 -11952 -12366 -3239 539
1995E39n423l866r888l374P484j975O27N384K550l836k327M984l875M049L743
$$ 539 -4884 -8750 -18638 -22012 -14528 -16503 -15876 -10492 -7942 -11778 -14105 -9121 -12996 -8947 -5204
1980e204j3869o153m308J4361n408j755n1r335N728L519P329N363N709K271N01
$$ -5204 -19073 -25226 -29534 -15173 -20581 -22336 -22387 -31722 -25994 -22475 -15146 -9783 -4074 -1803 -1302
1965a302l139r997N754N761L29p477N809j31P631J308k922P5k99q655K623J0488
$$ -1302 -4441 -14438 -8684 -2923 -2594 -10071 -4262 -4393 3238 4546 1624 1699 1400 -7255 -4632 5856
1949E856n311j1655k902J798j338K926m137L402N477O816L529l543n004l622J0051
$$ 5856 545 -11110 -14012 -12214 -13552 -10626 -14763 -11361 -5884 932 4461 918 -4086 -7708 2343
1934B343N992p06N111L934k700J203o880j504J097K664r723n526k893k681J2959
$$ 2343 8335 7629 12740 16674 13974 15177 8297 6793 7890 10554 831 -4695 -7588 -10269 2690
1919B690O346o803j061n106M738K607j6720m953R398K746Q017K351j7187j783
$$ 2690 9036 2233 1172 -3934 804 3411 -13309 -18262 -8864 -6118 1899 4250 -12937 -14720
1905a4720N354R560J706L70K31n365L800Q651n112p563j0618m22J2998K113l406
$$ -14720 -9366 194 1900 2270 2501 -2864 936 9587 4475 -3088 -13706 -14128 -1130 983 -2423
1890b423J220o22j096L226M025J555J572j5038j8340j254Q439J1964M418M313
$$ -2423 -1203 -1825 -2921 305 4330 5885 7457 -7581 -25921 -27175 -18736 -6772 -2354 1959
1876A959O316m889l189n39k824Q737r798j5070o81L704o150l378J1906O908K4
$$ 1959 8275 3386 197 -342 -3166 5571 -4227 -19297 -19978 -16274 -22424 -25802 -13896 -6988 -6964
1861f964K818Q644n03J113p0j4211k889M327m887O59L146L652O969M100m904r307
$$ -6964 -4146 4498 3995 5108 5038 -9173 -12062 -7735 -12622 -11963 -8817 -5165 1804 5904 1000 -8307
1845h307r653L685M236K438m514N163J0831k480m491j3296P576K81l605n66Q187
$$ -8307 -17960 -14275 -10039 -7601 -12115 -6952 3879 1399 -3092 -16388 -8812 -8531 -12136 -12702 -4515
1830d515J6224o009J526N098K238j0511M490P00o120J190J238P303p331j3822
$$ -4515 11709 5700 7226 12324 14562 4051 8541 9241 3121 4311 5549 12852 5521 -8301
1816h301K178n021q934l62N945J3854O77P851N573p290o392J737j2164R08M520
$$ -8301 -6123 -11144 -20078 -20440 -14495 -641 36 7887 13460 6170 -222 1515 -10649 -9741 -5221
1801e221Q421N259O876p589o307R00r7l563k570J1237J932n952k397P274O236
$$ -5221 3200 8459 15335 7746 1439 2339 2242 -1321 -3891 7346 9278 3326 929 8203 14439
1786A4439k744l716j877r402q497K848K860J0222k504m751o77N054n287j1465
$$ 14439 11695 7979 6102 -3300 -11797 -8949 -6089 4133 1629 -3122 -3799 1255 -4032 -15497
1772a5497m224Q160Q904Q07k473N713n273Q960l746l645M416k987m957l860N115
$$ -15497 -19721 -11561 -2657 -1850 -4323 1390 -3883 5077 1331 -2314 2102 -885 -5842 -9702 -4587
1757d587L481l649p971l4P921J857k151p068j653n62l122O426J2965P007l509
$$ -4587 -1106 -4755 -12726 -12760 -4839 -2982 -5133 -12201 -13854 -14416 -17538 -11112 1853 8860 5351
1742E351q386r001K550L474M253J609N57o245l084M93j158Q759K975p535m636
$$ 5351 -3035 -12036 -9486 -6012 -1759 -150 407 -5838 -8922 -8429 -9587 -828 2147 -5388 -10024
1727a0024k67O152J753J34j395J0735J3567K46j2768n651L591j389L694m176l724
$$ -10024 -10291 -4139 -2386 -2252 -3647 7088 20655 20901 8133 2482 6073 4684 8378 4202 478
1712D78n92q187N85j980L097N030O87p703n517m706O08N060O068L757m356P101
$$ 478 -114 -8301 -7716 -9696 -6599 -1569 -882 -8585 -14102 -18808 -18200 -13140 -7072 -3315 -7671 -570
1696e70O346J0261Q79k931M935P049J7182J4022K7306L3252K1863n777r148k3761
$$ -570 5776 16037 16916 13985 18920 25969 43151 57173 84479 117731 139594 133817 124669 100908
1682A00908j9671q389r435j1228p620n143q61j3636j8282j1659M843J1033J125
$$ 100908 81237 72848 63413 52185 44565 39422 38561 24925 6643 -5016 -173 10860 11985
1669A1985k010p24N880q80p859L514K285L389k891n940k351P78m527L773J2815
$$ 11985 9975 9251 15131 14251 6392 9906 12191 15580 12689 6749 4398 5176 649 4422 17237
1654A7237L258o77N636o089K079K0046J5591K5192M2735K3648q280j5916l8663
$$ 17237 20495 19818 25454 19365 21444 41490 57081 82273 125008 148656 140376 124460 85797
1641H5797k7804j7569j7204j0927K10N160o517j768o465J936k689J775o895m903
$$ 85797 57993 40424 23220 12293 12503 17663 11146 9378 2913 4849 2160 3935 -2960 -7863
1627g863M880n903N479P446Q118n200M887k175j811m735p127O811Q821k083q543
$$ -7863 -2983 -8886 -3407 4039 12157 6957 11844 9669 7858 3123 -4004 2807 11628 9545 1002
1612A002m300O983j474j01k650l304l123q493L372L090L188P124l10M334n770
$$ 1002 -3298 3685 2211 2110 -540 -3844 -6967 -15460 -12088 -8998 -5810 1314 1004 5338 -432
1597d32p53Q50Q11O46n071N114O511L734p020K23q664r465N790J0040K806r300
$$ -432 -1185 -335 476 1122 -3949 1165 7676 11410 4390 4613 -4051 -13516 -7726 2314 5120 -4180
1581d180l676R46j07O47P959L196K200n010j0339M164l637M16O472j890p211J3149
$$ -4180 -7856 -6910 -7017 -6370 1589 4785 6985 1975 -8364 -4200 -7837 -7421 -949 -2839 -10050 3099
1565C099R522n217o304J425N980n536p16k5P056m693l667J848m324l869M371k443
$$ 3099 12621 7404 1100 2525 8505 2969 2253 2228 9284 4591 924 2772 -1552 -5421 -1050 -3493
1549c493K608R039j858M954m83N842o511j850l603j172j130N907k597P323m20
$$ -3493 -885 8154 6296 11250 10767 16609 10098 8248 4645 3473 2343 8250 5653 12976 12556
1534A2556q962l802l604M235L002p29N237r862k0638J618J0783K664j081L209
$$ 12556 3594 -208 -3812 423 3425 2696 7933 -1929 -22567 -20949 -10166 -7502 -8583 -5374
1520e374J157k128K499N535J505L458p799r388M083K653l204j993N485P06J822
$$ -5374 -4217 -6345 -3846 1689 3194 6652 -1147 -10535 -6452 -3799 -7003 -8996 -3511 -2805 -983
1505i83M003N869M802k73j457m020r69L457Q153J0675r028j0566q271j1689q312
$$ -983 3020 8889 13691 13418 11961 7941 6972 10429 18582 29257 20229 9663 1392 -10297 -18609
1490a8609P838J5215J0096q939l134Q8J588O900L396j3508m816k5l932O75N9K690
$$ -18609 -10771 4444 14540 5601 2467 2555 4143 11043 14439 931 -3885 -3910 -7842 -7167 -7108 -4418
1474d418J3395R956J5344j509l456Ok149r730j0810m73j435q124n096P491O406
$$ -4418 8977 18933 34277 32768 29312 29318 27169 17439 6629 6156 4721 -3403 -8499 -1008 5398
1459E398K5K465M099k899O129M292m408j677n330N80m386O966Q012N360J862r77
$$ 5398 5423 7888 11987 9088 15217 19509 15101 13424 8094 8674 4288 11254 19266 24626 26488 25511
1443B5511n798r996j7915o148m7K784J1583O991L234k358M687k840k957n107M919
$$ 25511 19713 9717 -8198 -14346 -14393 -11609 -26 6965 10199 7841 12528 9688 6731 1624 6543
1428F543J3873K57r698L171L949q944p283P020O63P55L0l178Q25n85j17j1443
$$ 6543 20416 20673 10975 14146 18095 9151 1868 8888 9551 10306 10336 7158 7983 7398 7281 -4162
1412d162n377m659R942P325M512j937o355P491J328k514j776N853K144j726K994
$$ -4162 -9539 -14198 -4256 3069 7581 5644 -711 6780 8108 5594 3818 9671 11815 10089 13083
1397A3083k949M718R298N735M161R146K3752K4250K4499M267j0734j0535j4019
$$ 13083 10134 14852 24150 29885 34046 43192 66944 91194 115693 119960 109226 98691 84672
1384H4672j8493j4185p178j1721L907L120K798L908J3647m77o086r330p672o814
$$ 84672 66179 51994 44816 33095 37002 40122 42920 46828 60475 59998 53912 44582 36910 30096
1370C0096j8954j2500R167k34k175m077L436j396l527N403J54m351j987O706n539
$$ 30096 11142 -1358 7809 7575 5400 1323 4759 3363 -164 5239 5393 1042 -945 5761 222
1355B22p527L515P88j458K97Q758J0006K837m127p894j4914J012Q153m282m046
$$ 222 -7305 -3790 -3002 -4460 -4163 4595 14601 17438 13311 5417 -9497 -8485 -332 -4614 -8660
1340h660P629O696L378k736j0013l667L829K629J73p422R751N384j3430p633O647
$$ -8660 -1031 5665 9043 6307 -3706 -7373 -3544 -915 -742 -8164 1587 6971 -6459 -14092 -7445
1325g445M477l844J601r282q802K734M668N312R719J2669j802O91m021K437m810
$$ -7445 -2968 -6812 -5211 -14493 -23295 -20561 -15893 -10581 -862 11807 10005 10696 6675 9112 4302
1310D302o258r388O105p934l314O233J3236j792j0889l27Q570m495q474K269P02
$$ 4302 -1956 -11344 -5239 -13173 -16487 -10254 2982 1190 -9699 -10026 -1456 -5951 -14425 -12156 -11454
1295a1454O648N977j5p90n628m128K327K125P498j157l073j3000l681J0463M216
$$ -11454 -4806 1171 1156 366 -5262 -9390 -7063 -4938 2560 1403 -1670 -14670 -18351 -7888 -3672
1280c672n460m977m470Q274L708O221Q55P28j435k356O605J054p354l047N482
$$ -3672 -9132 -14109 -18579 -10305 -6597 -376 479 1207 -228 -2584 4021 5075 -2279 -5326 156
1265A56m7r19K5M609J4208M008k215r368k589P976j309J216k627m968O47o00P288
$$ 156 109 -810 -785 3824 18032 22040 19825 10457 7868 15844 14535 15751 13124 8156 8803 8203 15491
1248A5491l214j0297p14j90L530P018Q389j609r25L322J900n305o618n60J81o91
$$ 15491 12277 1980 1266 1076 4606 11624 20013 18404 17479 20801 22701 17396 10778 10218 10399 9708
1232I708k25r64O711q251m50J1081k25Q01m147r915n892o233k296J0294M223r338
$$ 9708 9483 8519 15230 6979 6529 17610 17385 18186 14039 4124 -1768 -8001 -10297 -3 4220 -5118
1216e118K122J656J188O340O991m231j828L235l918q083R652J0974O814n479j0514
$$ -5118 -2996 -1340 -152 6188 13179 8948 7120 10355 6437 -1646 8006 18980 25794 20315 9801
1201I801k370L161j194j267O030R882Q496q675j1888j279l000j008P233m50L257
$$ 9801 7431 10592 9398 8131 14161 24043 32539 23864 11976 10697 7697 6689 13922 13472 16729
1186A6729Q638M501L660n245m499j0059j104L403J210P440M071Q969O902L808
$$ 16729 25367 29868 33528 28283 23784 13725 12621 16024 17234 24674 28745 37714 44616 48424
1172D8424j286l878k196P776J0117O865j05n605J8175K8071M6527Q3361J27874
$$ 48424 47138 43260 41064 48840 58957 65822 65717 60112 78287 106358 152885 236246 364120
1159C64120J08150L107o7910p1299p6391o9870m8619k3484j4794j4293p773n810
$$ 364120 472270 475377 407467 336168 259777 189907 141288 117804 103010 88717 80944 75134
1147G5134n518M39j238L250j0314q387p911M782R145J1716K739J2594j306L572
$$ 75134 69616 70055 68817 72067 61753 53366 45455 50237 59382 71098 73837 86431 85125 88697
1133H8697P598J2317J3003K17O927J6506l531j975J320M332J5359R706Q75J8977
$$ 88697 96295 108612 121615 121832 128759 145265 141734 139759 141079 145411 160770 170476 171351 190328
1119A90328K8209M4931O9140J36939K29842K65175P4068r5989j51530j75825j53881
$$ 190328 218537 263468 332608 469547 699389 964564 1038632 942643 791113 615288 461407
1108D61407j07367o1351l4097k8759k3886k3320k5495j7949j6341j2571o728j1703
$$ 461407 354040 292689 258592 229833 205947 182627 157132 139183 122842 110271 103543 91840
1096I1840j2123j805j2418j0010l008R362r019q565N164m756k428Q333J0777P127
$$ 91840 79717 77912 65494 55484 52476 61838 52819 44254 49418 44662 42234 50567 61344 68471
1082F8471J083j1541r108m985O733R500l25M685J5371K1902K6951M0482R1146
$$ 68471 69554 58013 48905 43920 50653 60153 59828 64513 79884 101786 128737 169219 260365
1069B60365J23670P1385k4802p1437r1715r4399n8557l3333k5442j8515q526m141
$$ 260365 384035 455420 430618 359181 267466 173067 114510 81177 55735 37220 28694 24553
1057B4553k187J48J0734L48L50R226m668k1734l594k506R978K774l972J502M068
$$ 24553 22366 22514 33248 33596 33946 43172 38504 16770 13176 10670 20648 23422 19450 20952 25020
1042B5020P95K933p287n923j0408M90N506P055n183m024O719j040k260m745M192
$$ 25020 25815 28748 21461 15538 5130 5620 11126 18181 12998 8974 15693 14653 12393 7648 11840
1027A1840l131r567J4036k448j4368r161o5P939K845N520M866P10R95K994J931
$$ 11840 8709 -858 13178 10730 -3638 -12799 -12864 -4925 -2080 3440 8306 9016 10011 13005 14936
1012A4936K87q58K476m073l854k336p673j2169j343J097O084o70J814j414K568
$$ 14936 15223 14365 16841 12768 8914 6578 -1095 -13264 -14607 -13510 -7426 -8096 -6282 -7696 -5128
997e128O077K219O413R27o350K61M032n736q577k969R223P473k340j468p437j0715
$$ -5128 949 3168 9581 10508 4158 4419 8451 2715 -5862 -8831 392 7865 5525 4057 -3380 -14095
981a4095Q279K475o16m107o315K483l179N984L075m654P871M774p861k521L527
$$ -14095 -5816 -3341 -3957 -8064 -14379 -11896 -15075 -9091 -6016 -10670 -2799 1975 -5886 -8407 -4880
966d880R64m068j020m35n696r43R860L47L584J68k674l783J4323Q598r6j087q184
$$ -4880 -3916 -7984 -9004 -9439 -15135 -16078 -6218 -5871 -2287 -2119 -4793 -8576 5747 14345 14249 13162 4978
949D978r348m322n288J570J2088J2270M522L36J2683o888n040j4400q469Q857
$$ 4978 -4370 -8692 -13980 -12410 -322 11948 16470 16806 29489 22601 17561 3161 -5308 3549
935C549L233k576p56K816r711M936p40O049M235j816N567l426r960o961j177J095
$$ 3549 6782 4206 3450 6266 -3445 1491 751 6800 11035 9219 14786 11360 1400 -5561 -6738 -5643
919e643L089j2487l739l962l176N933M263L727K128j2539K022Q663O509n865L708
$$ -5643 -2554 -15041 -18780 -22742 -25918 -19985 -15722 -11995 -9867 -22406 -20384 -11721 -5212 -11077 -7369
904g369K376m203L543O992m96J716k438p558o288O79J5436N173n59n978l135m54
$$ -7369 -4993 -9196 -5653 1339 843 2559 121 -7437 -13725 -13046 2390 7563 7004 1026 -2109 -2563
888b563n707R03K441L457O141M375p354l404p584l476L774K261J0607O020r700
$$ -2563 -8270 -7367 -4926 -1469 4672 9047 1693 -1711 -9295 -12771 -8997 -6736 3871 9891 191
873A91j024M159J65m575m227l429J1095P626r55k712M24r258L488n153N032J0591
$$ 191 -833 3326 3491 -1084 -5311 -8740 2355 9981 9026 6314 6738 -2520 968 -4185 847 11438
857A1438o407J118j415q163O358J443L996k266p021m856r622l360K548J0546Q898
$$ 11438 5031 6149 4734 -3429 2929 4372 8368 6102 -919 -5775 -15397 -18757 -16209 -5663 3235
842C235k077l666j3464m695O585K603M004J896M855M261Q899r30o331l372o123
$$ 3235 1158 -2508 -15972 -20667 -14082 -11479 -7475 -5579 -724 3537 12436 11506 5175 1803 -4320
827d320l231J690L099J19q732L286N755n25N231k665M667j1019n970L827J736
$$ -4320 -7551 -5861 -2762 -2643 -11375 -8089 -2334 -2859 2372 -293 4374 -6645 -12615 -8788 -7052
812g052k948m622P13R540Q046n214K130l650o291j0310Q409L116k950j593l818
$$ -7052 -10000 -14622 -13909 -4369 3677 -1537 593 -3057 -9348 -19658 -11249 -8133 -11083 -12676 -16494
797a6494L049J1839R468O325m327M932j608r888p008j581o167J0606R185j305
$$ -16494 -13445 -1606 7862 14187 9860 14792 13184 3296 -3712 -5293 -11460 -854 8331 7026
783G026l163K745j099l067m95M692J0235l923m04k827j1783l230J494j3508K202
$$ 7026 3863 6608 5509 2442 1947 6639 16874 12951 12547 9720 -2063 -5293 -3799 -17307 -15105
768a5105l010K4M571N353K541L019N247O38l409l53K157n756j0841M352j680m62
$$ -15105 -18115 -18091 -13520 -8167 -5626 -2607 2640 3278 -131 -484 1673 -4083 -14924 -10572 -12252 -12714
752a2714R653J480m500M367M590k477L500J4038J0862j674l599p550n432J585
$$ -12714 -3061 -1581 -6081 -1714 2876 399 3899 17937 28799 27125 23526 15976 10544 12129
738A2129l583j1479n792Q031O885P89L11j31n990j3507l627J591Q398N498L550
$$ 12129 8546 -2933 -8725 -694 6191 6980 7291 7160 1170 -12337 -15964 -14373 -5975 -477 3073
723C073M613j745N897m836j4396j364L846R90R044j582k317R33M12o741J810Q647
$$ 3073 7686 5941 11838 7002 -7394 -8758 -4912 -3922 5122 3540 1223 2156 2568 -4173 -2363 6284
707F284o81N585P866M433o67k266P80j1841l370j840j267K862o82j1365l634N768
$$ 6284 5603 11188 19054 23487 22820 20554 21334 9493 6123 4283 3016 5878 5196 -6169 -9803 -4035
691d035L590N564m913k308N468l141K68q137j6798K708J0899j211m38L796N102
$$ -4035 -445 5119 206 -2102 3366 225 493 -7644 -24442 -21734 -10835 -12046 -12484 -8688 -3586
676c586M81M32L08l241k329R173Q602M930m206o817m278J910R113m735k271o637
$$ -3586 -3105 -2673 -2365 -5606 -7935 1238 9840 14770 10564 3747 -531 1379 10492 5757 3486 -3151
660c151k340o59N784J957j1279o733K458J0110j236k233o509l681r59L433P427
$$ -3151 -5491 -6150 -366 1591 -9688 -16421 -13963 -3853 -5089 -7322 -13831 -17512 -18471 -15038 -7611
645g611J090p168k969L12M899L53R26j1682r99L653k910M136r9O392M531P866
$$ -7611 -6521 -13689 -16658 -16346 -11447 -11094 -10168 -21850 -22849 -19196 -22106 -17970 -18069 -11677 -7146 720
629G20J53K444k170l972l105l038n968r542j960L234J96R929J59j2172l991o785
$$ 720 873 3317 1147 -2825 -5930 -8968 -14936 -24478 -26438 -23204 -23008 -13079 -12920 -25092 -29083 -35868
613c5868Q856J973p973Q918P494l659M112k736p214o914r71L049j29J218N314
$$ -35868 -27012 -25039 -33012 -24094 -16600 -20259 -16147 -18883 -26097 -33011 -33982 -30933 -31062 -29844 -24530
598b4530O818j151p024K737J490M23j718q719l537L794Q208n908j3831J283K593
$$ -24530 -17712 -18863 -25887 -23150 -21660 -21237 -22955 -31674 -35211 -31417 -23209 -29117 -42948 -41665 -39072
583c9072j59M748M691Q717N892l334r294O29J1616J0864K953n058j384K078l3
$$ -39072 -39231 -34483 -29792 -21075 -15183 -18517 -27811 -27182 -15566 -4702 -1749 -6807 -8191 -6113 -6146
568f146Q064M164N05j227N83K993J978j1175j476l868K835J47L08p531J747N769
$$ -6146 1918 6082 6587 5360 5943 8936 10914 -261 -1737 -5605 -2770 -2623 -2315 -9846 -8099 -2330
552b330J593J1609N086r901l063l02M180P134M467j1624j3709M617K709K656k349
$$ -2330 -737 10872 15958 6057 2994 2692 6872 14006 18473 6849 -6860 -2243 466 3122 773
537G73K439j37m431J611L220P787J0198Q149k757l621k964m960o586O788J5536
$$ 773 3212 3075 -1356 255 3475 11262 21460 29609 26852 23231 20267 15307 8721 15509 31045
522C1045J0774J234K3305J5157l087o32j0431j0083j0388r881m287k867O05J0427
$$ 31045 41819 43053 66358 81515 78428 77796 67365 57282 46894 37013 32726 29859 30464 40891
508D0891J6068J5491J326r385j3163q668j4004j0359n36l335m985n746j0972j5416
$$ 40891 56959 72450 73776 64391 51228 42560 28556 18197 17661 14326 9341 3595 -7377 -22793
494b2793n617M450J8018o152k756J3393J1157J532m46j019o062q91k101o490O458
$$ -22793 -28410 -23960 -5942 -12094 -14850 -1457 9700 11232 10786 9767 3705 2814 713 -5777 681
479F81J1388K223Q804J4253J2077J646k435p179K567k514o369n208l916J0743
$$ 681 12069 14292 23096 37349 49426 51072 48637 41458 44025 41511 35142 29934 26018 36761
465C6761Q074q949j367l145p910q041o184k063r377j0293k053J3182N944j0727
$$ 36761 44835 35886 34519 31374 23464 15423 9239 7176 -2201 -12494 -14547 -1365 4579 -6148
451f148k825K628K691K304r578J010P637p704q842m854Q467R656R310J1669Q577
$$ -6148 -8973 -6345 -3654 -1350 -10928 -9918 -2281 -9985 -18827 -23681 -15214 -5558 3752 15421 23998
436B3998J6l269P4J0099J433j0124j5305q192P453o721m94j843p675M498Q402
$$ 23998 24014 20745 20819 30918 32351 22227 6922 -1270 6183 -538 -1032 -2875 -10550 -6052 2350
421B350M106j217p116o815J212L268q783q530o255K22o546j057J1234Q627K873
$$ 2350 6456 5239 -1877 -8692 -7480 -4212 -12995 -21525 -27780 -27558 -34104 -35161 -23927 -15300 -12427
406a2427J873k031M4N80k415K142J960K559k176o210M768p422j518m109m776J67
$$ -12427 -10554 -12585 -12541 -11961 -14376 -12234 -10274 -7715 -9891 -16101 -11333 -18755 -20273 -24382 -29158 -28991
390b8991Q47P960R521R824M046L756o289q278M735Q273n508q398j948J795L358
$$ -28991 -28144 -20184 -10663 -839 3207 6963 674 -7604 -2869 5404 -104 -8502 -10450 -8655 -5297
375e297j1054n798M062k318K22l053j3765Q179J1970K460k866Q88M718M802k627
$$ -5297 -16351 -22149 -18087 -20405 -20183 -23236 -37001 -28822 -16852 -14392 -17258 -16370 -11652 -6850 -9477
360i477O970o597m660j6524O82R658L334Q23p345M481j74m996K042O447j0575
$$ -9477 -2507 -9104 -13764 -30288 -29606 -19948 -16614 -15791 -23136 -18655 -18829 -23825 -21783 -15336 -25911
345b5911j67Q496O971P219R991k168L666k064j0397j1977J163P027N672J317j039
$$ -25911 -26078 -17582 -10611 -3392 6599 4431 8097 6033 -4364 -16341 -15178 -8151 -2479 -1162 -2201
330b201p711p054P262J2796p744r548l994K765l730M743N520o260Q50K855M987
$$ -2201 -9912 -16966 -9704 3092 -4652 -14200 -18194 -15429 -19159 -14416 -8896 -15156 -14306 -11451 -6464
315f464p51o779p04Q634J380M853N510m126p015l446j0101N027K04P185N306j724
$$ -6464 -7215 -13994 -14698 -6064 -4684 169 5679 1553 -5462 -8908 -19009 -13982 -13778 -6593 -1287 -3011
299c011r200m532l677k187J924L126K874j339R554p271r803L336K795M431L816
$$ -3011 -12211 -16743 -20420 -22607 -20683 -17557 -14683 -16022 -6468 -13739 -23542 -20206 -17411 -12980 -9164
284i164R940m353o198K19Q638J2334L019j35n701n568l841k429n658j376N649
$$ -9164 776 -3577 -9775 -9556 -918 11416 14435 14300 8599 3031 -810 -3239 -8897 -10273 -4624
269d624J430L661J612o192k637P706j494j435j632k650m823k421K551k941o380
$$ -4624 -3194 467 2079 -4113 -6750 956 -538 -1973 -3605 -6255 -11078 -13499 -10948 -13889 -20269
254b0269J0977J653Q718k874J912m557j0762k878K037Q592M840Q127m581Q14m46
$$ -20269 -9292 -7639 1079 -1795 117 -4440 -15202 -18080 -16043 -7451 -2611 5516 935 1749 1303
239A303k708O214O607o265p738l068j763O07L737M883P361j845k422J938p765
$$ 1303 -1405 4809 11416 5151 -2587 -5655 -7418 -6811 -3074 1809 9170 7325 4903 6841 -924
224i24j8186j843P820m11k946N449M382N845m502M343M990K113M830p354o549
$$ -924 -19110 -20953 -13133 -13544 -16490 -11041 -6659 -814 -5316 -973 4017 6130 10960 3606 -2943
209b943o434l708k382K539K556K636L527Q84l337L398M196p98K572J043k468p439
$$ -2943 -9377 -13085 -15467 -12928 -10372 -7736 -4209 -3325 -6662 -3264 932 134 2706 3749 1281 -6158
193f158Q90L671K388l18j814l934l072k122N834O027J540l375m114j51k093o912
$$ -6158 -5268 -1597 791 473 -1341 -5275 -8347 -10469 -4635 1392 2932 -443 -4557 -4708 -6801 -13713
177a3713k52L088O924N58P68J0787r43l083P865M48k853j488l497r798p244L768
$$ -13713 -13965 -10877 -3953 -3395 -2627 8160 7217 4134 11999 12447 9594 8106 4609 -5189 -12433 -8665
161h665J890K07M412N085o03m731p936Q84k618J417q58o755M726P43o145O573
$$ -8665 -6775 -6568 -2156 2929 2326 -2405 -10341 -9457 -12075 -10658 -11516 -18271 -13545 -12802 -18947 -12374
145a2374J0723N574P276o743o743M83N027n028K56r51N215K871k752k250j972
$$ -12374 -1651 3923 11199 4456 -2287 -1804 3223 -1805 -1549 -2500 2715 5586 2834 584 -1388
130a388j5K620Q29k954m469K411M717P95j850N612J978k648o718m45j184j457
$$ -1388 -1403 1217 2046 -908 -5377 -2966 1751 2546 696 6308 8286 5638 -1080 -1525 -2709 -4166
114d166L144l262M095j116m548k220L061M414n2l468m415J242M204Q593l338p427
$$ -4166 -1022 -4284 -189 -1305 -5853 -8073 -5012 -598 -650 -4118 -8533 -7291 -3087 5506 2168 -5259
98e259K645M786q540j0829R94J762N877R247J345o083j902j098R155N882q050
$$ -5259 -2614 2172 -6368 -17197 -16203 -14441 -8564 683 2028 -4055 -5957 -7055 2100 7982 -68
83f8m301j717o31K904N987M259q875j3412k185J801K835K057P790K460n327L577
$$ -68 -4369 -6086 -6717 -3813 2174 6433 -2442 -15854 -18039 -16238 -13403 -11346 -3556 -1096 -6423 -2846
67b846L007r025l260R047J003M120L102l727k772l939N099J0024J864k757n954
$$ -2846 161 -8864 -12124 -3077 -2074 2046 5148 1421 -1351 -5290 -191 9833 11697 8940 2986
52B986l559l258j549M192K622R70k655K339l007n131q21N198M968l379r108P12
$$ 2986 -573 -3831 -5380 -1188 1434 2404 -251 2088 -919 -6050 -6871 -1673 3295 -84 -9192 -8480
36h480k369j733k013R50n103o69L828L839O586J589m651J980J014n658k566J652
$$ -8480 -10849 -12582 -14595 -13645 -18748 -19417 -15589 -11750 -5164 -3575 -8226 -6246 -5232 -10890 -13456 -11804
20a1804L128J015o404k403j917K197N921L212M574j599j298r73P99N53m825r060
$$ -11804 -8676 -7661 -14065 -16468 -18385 -16188 -10267 -7055 -2481 -4080 -5378 -6351 -5552 -4999 -9824 -18884
4a8884k194P235K278N088
$$ -18884 -21078 -13843 -11565 -6477
0f477
$$ -6477
$$ Imaginary data points
##PAGE= N=2
##DATA TABLE= (X++(I..I)), XYDATA
32767c6232L435p105q077K92Q966O105L114l270O271N336n127j710N906m792n420
$$ -36232 -32797 -39902 -47979 -47687 -38721 -32616 -29502 -32772 -26501 -21165 -26292 -28002 -22096 -26888 -32308
32752c2308J121N397K387K021n039k661K028K340j142K131l759L211R18k891j65
$$ -32308 -31187 -25790 -23403 -21382 -26421 -29082 -27054 -24714 -25856 -23725 -27484 -24273 -23355 -26246 -26411
32737b6411L184O954J294M1P03m890N363l59K581J604m038l80L089l136P69O407
$$ -26411 -23227 -16273 -14979 -14938 -14235 -19125 -13762 -14121 -11540 -9936 -13974 -14354 -11265 -14401 -13632 -7225
32721g225M496J45m214O0k425j450L048o80j841M220J557k866p992K501M887L017
$$ -7225 -2729 -2584 -6798 -6738 -9163 -10613 -7565 -8245 -10086 -5866 -4309 -7175 -15167 -12666 -7779 -4762
32705d762O050m215k368N042k009R59j391n488K819M737L669l026K228m94j302
$$ -4762 1288 -2927 -5295 -253 -2262 -1303 -2694 -8182 -5363 -626 3043 17 2245 1751 449
32690D49K053J309j760K04m665J723P342L244k550K379L038j913J445j502l925
$$ 449 2502 3811 2051 2255 -2410 -687 6655 9899 7349 9728 12766 10853 12298 10796 6871
32675F871l396O453o58j733k47o495M617N148Q00J792O183k011K738J5782M15
$$ 6871 3475 9928 9270 7537 7290 795 5412 10560 11360 13152 19335 17324 20062 35844 36259
32660C6259p769m587n451n499k818R603j355k07L985M048Pl338n023l697J377
$$ 36259 28490 23903 18452 12953 10135 19738 18383 18176 22161 26209 26216 22878 17855 14158 15535
32645A5535N926L662K751j386n282j085L10Q240K887k387q96K428O340m647j1627
$$ 15535 21461 25123 27874 26488 21206 20121 20431 28671 31558 29171 28275 30703 37043 32396 20769
32630B0769N877N986J03N982K916J713j973k715n874L155j635m503M241J532j454
$$ 20769 26646 32632 32735 38717 41633 43346 41373 38658 32784 35939 34304 29801 34042 35574 34120
32615C4120K076P782L286o947J162k895r3J586O219N754J984o627r00j07n066
$$ 34120 36196 43978 47264 40317 41479 38584 38491 40077 46296 52050 54034 47407 46507 46400 41334
32600D1334m195K356M74P28J807m893K400O621Q76o122k279N461P610L391n056
$$ 41334 37139 39495 39969 40697 42504 37611 40011 46632 47508 41386 39107 44568 52178 55569 50513
32585E0513k163J1224O048j42M604l610q183J676k818k29r1J912P583l845p348
$$ 50513 48350 59574 65622 65480 70084 66474 58291 59967 57149 56920 56829 58741 66324 62479 55131
32570E5131n938N363J470Q38l242n102Q42l64P259q97l746M233J0289N773q203
$$ 55131 49193 54556 56026 56864 53622 48520 49362 48998 56257 55360 51614 55847 66136 71909 63706
32555F3706l304L031K333O422L800r03L10l010m378N875K806l830o192L697m088
$$ 63706 60402 63433 65766 72188 75988 75085 75395 72385 68007 73882 76688 72858 66666 70363 66275
32540F6275L234N906J0234M426l821q718q230O179K830n295k292j862J992O396
$$ 66275 69509 75415 85649 90075 86254 77536 69306 75485 78315 73020 70728 68866 70858 77254
32526G7254P19l624R709J813j2616m481j872K672N988j879o279Q83J269O773J0825
$$ 77254 77973 74349 84058 85871 73255 68774 66902 69574 75562 73683 67404 68287 69556 76329 87154
32511H7154J698J059k703J728J906k674N209p90M358o75l829n032k051m2k153
$$ 87154 88852 89911 87208 88936 90842 88168 93377 92587 96945 96270 92441 87409 85358 85316 83163
32496H3163L590J368p8K199N523m81o354l34p583m392O786J175N026q16l742j537
$$ 83163 86753 88121 88043 90242 95765 95284 88930 88596 81013 76621 83407 84582 89608 88792 85050 83513
32480H3513O361J1014m623p740k152n951k964Q731J3905p149m446m555N933M245
$$ 83513 89874 100888 96265 88525 86373 80422 77458 86189 100094 92945 88499 83944 89877 94122
32466I4122J737M540l441l523k525n116K779J1989P020J11Q9K959n794o132l916
$$ 94122 95859 100399 96958 93435 90910 85794 88573 100562 107582 107693 107782 110741 104947 98815 94899
32451I4899r365o881O884O596j415%k596n583L929L16Q71m698J0569Q526n213
$$ 94899 85534 78653 85537 92133 90718 90718 88122 82539 86468 86784 87655 82957 93526 102052 96839
32436I6839j0482l490J3451M690o584J06J3914o417m166O299j351l818O100M030
$$ 96839 86357 82867 96318 101008 94424 94530 108444 102027 97861 104160 102809 98991 105091 109121
32422A09121K425k112p077Q90K209p6J076j073M360K636m093k90j927n711J645
$$ 109121 111546 109434 102357 103247 105456 105380 106456 105383 109743 112379 108286 107996 106069 100358 102003
32407A02003O43m181q560k720M587Q448P514J307K604R027N610j356j3668q439
$$ 102003 102646 98465 89905 87185 91772 100220 107734 109041 111645 120672 126282 124926 111258 102819
32393A02819O108Q479q612m943P499K571k647j1324K081Q732m963k142M034J4968
$$ 102819 108927 117406 108794 103851 111350 113921 111274 99950 102031 110763 105800 103658 107692 122660
32379A22660j018m454j88l97K858O662Q078o968j4667j2753o783L492r42M392
$$ 122660 121642 117188 117000 116603 119461 126123 134201 127233 112566 99813 93030 96522 95580 99972
32365I9972J356R497N366J838J527J3070K683q783j3237j2582r156K710J6129
$$ 99972 101328 110825 116191 118029 119556 132626 135309 126526 113289 100707 91551 94261 110390
32352A10390Q237j5248o575j926P689R248P815o7l589j893k028j2607j4666J4553
$$ 110390 118627 103379 96804 94878 102567 111815 119630 119563 115974 114081 112053 99446 84780 99333
32338I9333J1610J047j839n636l891N041N905M607Q731J371k792k233M489O725
$$ 99333 110943 111990 110151 104515 100624 105665 111570 116177 124908 126279 123487 121254 125743 132468
32324A32468L437q507j7979N082Q383L688l514J675l87l466J167o204O184p29
$$ 132468 135905 127398 109419 114501 122884 126572 123058 124733 124346 120880 122047 115843 122027 121298
32310A21298j426j28L443n373n185r57k03M130j200J788l902Q0o0L376L587O755
$$ 121298 119872 119744 123187 117814 112629 111672 111469 115599 114399 116187 112285 112365 112305 115681 119268 126023
32294A26023N007o796q256p523K497P475p188M604J2181O511j2247l898J0614
$$ 126023 131030 124234 115978 108455 110952 118427 111239 115843 128024 134535 122288 118390 129004
32281A29004N302J059N867k526n061j0588K001O423K553M175m36r332j930n33
$$ 129004 134306 135365 141232 138706 133645 123057 125058 131481 134034 138209 137773 128441 126511 125978
32267A25978n909n14Q924N926L134O230j1805o178J09Q226o075j1953n545P315
$$ 125978 120069 119555 128479 134405 137539 143769 131964 125786 125895 134121 128046 116093 110548 117863
32253A17863N939j948m233J271m290j2621M325R413O061N968L92j782J590M112
$$ 117863 123802 121854 117621 118892 114602 101981 106306 115719 121780 127748 128140 126358 127948 132060
32239A32060N722p185n379j707O306M886N053R373m589o530j5119n915L950N721
$$ 132060 137782 130597 125218 123511 129817 134703 139756 149129 144540 138010 122891 116976 120926 126647
32225A26647q235l516o67m81M452O085j121n746M618J1118m586r585J1844P457
$$ 126647 118412 114896 114229 113748 118200 124285 123164 117418 122036 133154 128568 118983 130827 138284
32211A38284p059n560N09P112K097n083p234j814N103L359m187l795K493n035
$$ 138284 131225 125665 126174 133286 135383 130300 123066 121252 126355 129714 125527 121732 124225 119190
32197A19190P010L776r17J648m297P988R341k192j1397k536n602j925k005l0K034
$$ 119190 126200 129976 129059 130707 126410 134398 143739 141547 130150 127614 122012 120087 118082 118052 120086
32182A20086M022J983j2861o106M698L749L896j431l239m12j974L736P577Q927
$$ 120086 124108 126091 113230 107124 111822 115571 119467 118036 114797 114385 112411 116147 123724 132651
32168A32651K234m688J083O537j238P300J814j4022r628j1374K559J9157l169
$$ 132651 134885 130197 131280 137817 136579 143879 145693 131671 122043 110669 113228 132385 129216
32155A29216m60r724k212j297J0463N754L6O72j114L02l592J209L224l590l304
$$ 129216 128756 119032 116820 115523 125986 131740 131776 132448 131334 131636 128044 129253 132477 128887 125583
32140A25583p507K839P573L095N623J905l123j0610J363M819J017m399k519O25
$$ 125583 118076 120915 128488 131583 137206 139111 135988 125378 126741 131560 132577 128178 125659 126284
32126A26284P884l952j016Q324N451O49k395k623q340j617k994m325L944J0896
$$ 126284 134168 130216 129200 137524 142975 143624 141229 138606 130266 128649 125655 121330 125274 136170
32112A36170L909J295J317q58l328q835o852j689M379j988J759j707l087J2592
$$ 136170 140079 141374 142691 141833 138505 129670 122818 121129 125508 123520 125279 123572 120485 133077
32098A33077Q301J886o779p121P132l07o309M274M21m749j321p555o499J104Q219
$$ 133077 141378 143264 136485 129364 136496 136189 129880 134154 134575 129826 128505 120950 114451 115555 123774
32083A23774Q920p94j5681K97J6535M863K200n202m457P284O868l461k296q493
$$ 123774 132694 131900 116219 116516 133051 137914 140114 134912 130455 137739 144607 141146 138850 130357
32069A30357O781N756q875j5921N205Q312o264Pk503J852o450m672J368L197O812
$$ 130357 137138 142894 134019 118098 123303 131615 125351 125358 122855 124707 118257 113585 114953 118150 124962
32054A24962J009L925P038j322j0790M924j421K793j477N146R331k797o101l63
$$ 124962 125971 129896 136934 135612 124822 129746 128325 131118 129641 134787 144118 141321 135220 134857
32040A34857j0033J508J2819N111J649N269j910o552q600p996l57R974K657o08
$$ 134857 124824 126332 139151 144262 145911 151180 149270 142718 134118 126122 125765 135739 138396 137788
32026A37788L790O664N7O198O17q760j6541k785K444q212o60R481P647K421l078
$$ 137788 141578 148242 148299 154497 155114 146354 129813 127028 129472 121260 120600 130081 137728 140149 137071
32011A37071J787M22N64N127K108r196j2873P13q571M373Q085J1129N579l426
$$ 137071 138858 139280 139844 144971 147079 137883 125010 125723 117152 121525 129610 140739 146318 142892
31997A42892k732K642M938j1231M323J839M607M342M122n813j1147L036L99n836
$$ 142892 140160 142802 147740 136509 140832 142671 147278 151620 155742 149929 138782 141818 142217 136381
31983A36381O89N648p075j3708o913P388P000J011k356l095O098R050m543k447
$$ 136381 137070 142718 135643 121935 115022 122410 129410 130421 128065 124970 131068 140118 135575 133128
31969A33128N798r750l87m86O44J4879O378m357o597p723J408R27J174l886r41
$$ 133128 138926 129176 128789 128303 128947 143826 150204 145847 139250 131527 132935 133862 135036 131150 130209
31954A30209o709k485N779J266j69L304N667K121j426j0427O711o856q769J0483
$$ 130209 123500 121015 126794 128060 127891 131195 136862 138983 137557 127130 133841 126985 118216 128699
31940A28699K246o03j920r77j887n129O625O116k316N69O551J140J454j2440K36
$$ 128699 130945 130342 128422 127445 125558 120429 127054 133170 130854 131423 137974 139114 140568 128128 128364
31925A28364J3994M335m929p857p290p737j984k447R679J1304n503j1160q70n78
$$ 128364 142358 146693 141764 133907 126617 118880 116896 114449 124128 135432 129929 118769 117899 117321
31911A17321j095J0568m253K676L737K907j376R095K36j7481k135J1970N003m755
$$ 117321 116226 126794 122541 125217 128954 131861 130485 139580 139816 122335 120200 132170 137173 132418
31897A32418r44n897m67Q38k421p622J530P841K114M369P020M635r551l253k907
$$ 132418 131474 125577 125110 125948 123527 115905 117435 125276 127390 131759 138779 143414 133863 130610 127703
31882A27703j82K985K826L524m264R75N368q519Q600M263k155P750K651j6278
$$ 127703 127521 130506 133332 136856 132592 133567 138935 130416 139016 143279 141124 148874 151525 135247
31868A35247j3763m437j587Q991J1183n784K995O232J0860P845j6429j3057k626
$$ 135247 121484 117047 115460 124451 135634 129850 132845 139077 149937 157782 141353 128296 125670
31855A25670O327n87j904l89M976N157n66j183m630n131M630o81J827N26j215
$$ 125670 131997 131410 129506 129117 134093 139250 138684 137501 132871 127740 132370 131689 133516 134042 132827
31840A32827l832J417M32R859l670j765J77K348O02N758j3387n098n821K041J1142
$$ 132827 128995 130412 130844 140703 137033 135268 135445 137793 138395 144153 130766 125668 119847 121888 133030
31825A33030n872K328Q665q561m75Q976P387J411j602p427m931j0620l335M867
$$ 133030 127158 129486 138151 129590 129115 138091 145478 146889 145287 137860 132929 122309 118974 123841
31811A23841R259k593m32K020o381K958O44K73M336J2190m725n729J740J155L403
$$ 123841 133100 130507 130075 132095 125714 128672 129316 129589 133925 146115 141390 135661 137401 138556 141959
31796A41959N02k462n094l194K523m015j052L35o89l68P714q484m006M844M618
$$ 141959 142461 139999 134905 131711 134234 130219 129167 129502 128813 128445 136159 127675 123669 128513 133131
31781A33131Q055L231Q62o777j2227J675j999k121L77K025M827Q668J000j967
$$ 133131 141186 144417 145279 138502 126275 127950 125951 123830 124207 126232 131059 139727 140727 138760
31767A38760k750k673k762l749J981J1955L384l774p00j922q79m738n911l566
$$ 138760 136010 133337 130575 126826 128807 140762 144146 140372 139672 137750 136871 132133 126222 122656
31753A22656J983R780N46r38p037k636J3147N496k237j0342j746J058J462L179
$$ 122656 124639 134419 134965 134027 126990 124354 137501 142997 140760 130418 128672 129730 131192 134371
31739A34371J975R72m308q789O543N304m6K240K610k469l882j1562n84K896J2722
$$ 134371 136346 137318 133010 124221 130764 136068 136022 138262 140872 138403 134521 122959 122375 125271 137993
31724A37993M941q89o303l780J817J906n784L629k870M154M002M76p64K484J428
$$ 137993 142934 142045 135742 131962 133779 135685 129901 133530 130660 134814 138816 139292 138528 141012 142440
31709A42440p867n535j883k896M677O535m67Q957J0792L216M828l548l250l278
$$ 142440 134573 129038 127155 124259 128936 135471 135004 143961 154753 157969 162797 159249 155999 152721
31695A52721p350p96r420o922j956r270k276R630Q368J4954l139j1765L930N003
$$ 152721 145371 144575 135155 128233 126277 117007 114731 124361 132729 147683 144544 132779 136709 141712
31681A41712r032l610m386L87J50J4l608O849L730K24Q860P017O428n464j0278
$$ 141712 132680 129070 124684 125071 125221 125235 121627 128476 132206 132430 141290 148307 154735 149271 138993
31666A38993j6070m303j918O546P625J0696N184p302J347J193r321N371O636J870
$$ 138993 122923 118620 116702 123248 130873 141569 146753 139451 140798 141991 132670 138041 144677 146547
31652A46547j282L01m500p049j4614N827O631N932n525n046K945N323P166k220
$$ 146547 145265 145566 141066 134017 119403 125230 131861 137793 132268 127222 130167 135490 142656 140436
31638A40436m229q918J1961L926j0098K110r52p020j0091j355J0190J0898m962
$$ 140436 136207 127289 139250 143176 133078 135188 134236 127216 117125 115770 125960 136858 131896
31625A31896n606J488J1698l915m429L215M799J1543k594L043m874o357M997O79
$$ 131896 126290 127778 139476 135561 131132 134347 139146 150689 148095 151138 146264 139907 144904 145583
31611A45583p097n878K39j092P219Q515J513m493K685j1935o504K449j96O343
$$ 145583 138486 132608 132847 131755 138974 147489 149002 144509 147194 135259 128755 131204 131008 137351
31597A37351J1581P860r148j4482l887j5j866J0701J1345j512j2666q080J850
$$ 137351 148932 156792 147644 133162 129275 129260 127394 138095 149440 147928 135262 127182 129032
31584A29032J1968p09M86j08n38n714l311P604Q06l59P465L93p990k24k948J445
$$ 129032 141000 140291 140777 140669 140131 134417 131106 138710 139516 139157 146622 147015 139025 138801 135853 137298
31568A37298P985L916j812k071R2l741p42J494o833K199o841l353O168k427o95
$$ 137298 145283 149199 147387 145316 145408 141667 140925 142419 135586 137785 130944 127591 133759 131332 130637
31553A30637K647j874m438J048j577Q626J0983l706m124j0956O578P672q505j142
$$ 130637 133284 131410 126972 128020 126443 135069 146052 142346 138222 127266 133844 141516 133011 131869
31539A31869O178K506K818l287J238l710P29N31M940K16L181o99j107j015j3437
$$ 131869 138047 140553 143371 140084 141322 137612 138341 138872 143812 144028 147209 146510 145403 144388 130951
$$ [...]
##END NTUPLES=NMR SPECTRUM
##END=
