##TITLE=Analysis number 314599
Compound Code cc 47123
Book Reference 437/44/1
Project Code adrs
Chemist Name wendyb
##JCAMPDX= 6.0         $$ Bruker NMR JCAMP-DX V2.0
##DATA TYPE= NMR SPECTRUM
##DATA CLASS= NTUPLES
##ORIGIN= Bruker BioSpin GmbH
##OWNER= NMR
$$ XWIN-NMR		Version 3.5
$$ Fri Oct 21 08:21:30 2005 GMT Daylight Time (UT+1h)  MAYBRIDGE\NMR@NMR_250MHZ
##.OBSERVE FREQUENCY= 250.131544655141
##.OBSERVE NUCLEUS= ^1H
##.ACQUISITION MODE= SIMULTANEOUS (DQD)
##.ACQUISITION SCHEME= undefined
##.AVERAGES= 16
##.DIGITISER RES= 18
##SPECTROMETER/DATA SYSTEM= dpx250
##.PULSE SEQUENCE= zg30
##.SOLVENT NAME= CDCl3
##.SHIFT REFERENCE= (INTERNAL, CDCl3, 0, 16.522)
##AUDIT TRAIL= $$ (NUMBER, WHEN, WHO, WHERE, WHAT)
$$ ##TITLE= Audit trail, XWIN-NMR		Version 3.5
$$ ##JCAMPDX= 5.01
$$ ##ORIGIN= Bruker BioSpin GmbH
$$ ##OWNER= NMR
$$ C:\u/data/dgb/nmr/ADRS/11150/pdata/1/auditp.txt
$$ ##AUDIT TRAIL=  $$ (NUMBER, WHEN, WHO, WHERE, WHAT)
(   1,<2005-10-21 08:21:12.75 +100>,<MAYBRIDGE\NMR>,<NMR_250MHZ>,
      <created by zg, POWCHK disabled, PULCHK disabled
       configuration hash MD5:
       62 19 C7 07 E1 42 D1 B7 37 6C 3D D0 77 39 F9 E6
       data hash MD5: 64K
       20 3B 26 22 3B CC F3 7A AD AA 62 CE ED 9D AD 05>)
(   2,<2005-10-21 08:21:23.27 +100>,<MAYBRIDGE\NMR>,<NMR_250MHZ>,
      <Start of raw data processing
       ef LB = 0.3 FT_mod = 6 PKNL = 1 SI = 32K 
       data hash MD5: 32K
       6E 7F 9E 5D CC AE 5C 3B A9 B3 29 71 4D 2D 87 3F>)
(   3,<2005-10-21 08:21:24.83 +100>,<MAYBRIDGE\NMR>,<NMR_250MHZ>,
      <apk 
       data hash MD5: 32K
       9D 9F F4 5C 9F 0D E9 DA 8C D5 F5 C0 7B 09 37 3D>)
(   4,<2005-10-21 08:21:25.57 +100>,<MAYBRIDGE\NMR>,<NMR_250MHZ>,
      <abs ABSG = 5 
       data hash MD5: 32K
       C2 CC AC 06 3A 76 B2 6B C9 D1 49 09 00 29 CD 3E>)
$$ ##END=
$$ 
$$ hash MD5
$$ CD 9A 6F 0A 8B 6B B5 DE 02 12 22 8C 60 10 D7 10
##$RELAX= 
##$RELAX= 
##$RELAX= 
##$RELAX= 
##$RELAX= 
##$RELAX= 
##$RELAX= 
$$ Bruker specific parameters
$$ --------------------------
##$DU= <C:\u>
##$EXPNO= 11150
##$NAME= <ADRS>
##$PROCNO= 1
##$TYPE= <nmr>
##$USER= <dgb>
##$AMP= (0..31)
100 100 100 100 100 100 100 100 100 100 100 100 100 100 100 100 100 100 
100 100 100 100 100 100 100 100 100 100 100 100 100 100 
##$AQSEQ= 0
##$AQ_mod= 3
##$AUNM= <au_zg>
##$AUTOPOS= <2 >
##$BF1= 250.13
##$BF2= 250.13
##$BF3= 250.13
##$BF4= 250.13
##$BF5= 500.13
##$BF6= 500.13
##$BF7= 500.13
##$BF8= 500.13
##$BYTORDA= 1
##$CFDGTYP= 0
##$CFRGTYP= 5
##$CHEMSTR= <none>
##$CNST= (0..31)
1 1 145 1 1 1 1 1 1 1 1 1 1 1 1 1 1 1 1 1 1 1 1 1 1 1 1 1 1 1 1 1 
##$CPDPRG= <>
##$CPDPRG1= <>
##$CPDPRG2= <>
##$CPDPRG3= <>
##$CPDPRG4= <mlev>
##$CPDPRG5= <mlev>
##$CPDPRG6= <mlev>
##$CPDPRG7= <mlev>
##$CPDPRG8= <mlev>
##$CPDPRGB= <>
##$CPDPRGT= <>
##$D= (0..31)
0 1 0 0 0 0 0 0 0 0.06 0 0 0 0 0 0 0.0002 0 0 0 0 0 0 0 0 0 0 0 0 0 0 
0 
##$DATE= 1129879271
##$DBL= (0..7)
120 120 120 120 120 120 120 120 
##$DBP= (0..7)
150 150 150 150 150 150 150 150 
##$DBP07= 0
##$DBPNAM0= <>
##$DBPNAM1= <>
$$ [...]
##$SUBNAM7= <"">
##$SUBNAM8= <"">
##$SUBNAM9= <"">
##$SW= 20.6930455092707
##$SWIBOX= (0..15)
0 0 3 0 0 0 0 0 0 0 0 0 0 0 0 0 
##$SW_h= 5175.983436853
##$TD= 65536
##$TD0= 1
##$TE= 295.16
##$TE2= 300
##$TE3= 300
##$TEG= 300
##$TL= (0..7)
0 120 120 120 120 120 120 120 
##$TP= (0..7)
150 150 150 150 150 150 150 150 
##$TP07= 0
##$TPNAME0= <>
##$TPNAME1= <>
##$TPNAME2= <>
##$TPNAME3= <>
##$TPNAME4= <>
##$TPNAME5= <>
##$TPNAME6= <>
##$TPNAME7= <>
##$TPOAL= (0..7)
0.5 0.5 0.5 0.5 0.5 0.5 0.5 0.5 
##$TPOFFS= (0..7)
0 0 0 0 0 0 0 0 
##$TUNHIN= 0
##$TUNHOUT= 0
##$TUNXOUT= 0
##$USERA1= <user>
##$USERA2= <user>
##$USERA3= <user>
##$USERA4= <user>
##$USERA5= <user>
##$V9= 5
##$VALIST= <valist>
##$VCLIST= <CCCCCCCCCCCCCCC>
##$VD= 0
##$VDLIST= <DDDDDDDDDDDDDDD>
##$VPLIST= <PPPPPPPPPPPPPPP>
##$VTLIST= <TTTTTTTTTTTTTTT>
##$WBST= 1024
##$WBSW= 4
##$XGAIN= (0..3)
0 0 0 0 
##$XL= 0
##$YL= 0
##$YMAX_a= 446610
##$YMIN_a= -404349
##$ZGOPTNS= <>
##$ZL1= 120
##$ZL2= 120
##$ZL3= 120
##$ZL4= 120
##$ABSF1= 16.522
##$ABSF2= -4.171173
##$ABSG= 5
##$ABSL= 3
##$ALPHA= 0
##$AQORDER= 0
##$ASSFAC= 0
##$ASSFACI= 0
##$ASSFACX= 0
##$ASSWID= 0
##$AUNMP= <proc_1d>
##$AZFE= 0.1
##$AZFW= 0.1
##$BCFW= 0
##$BC_mod= 0
##$BYTORDP= 0
##$COROFFS= 0
##$CY= 12.5
##$DATMOD= 1
##$DC= 0
##$DFILT= <>
##$DTYPP= 0
##$F1P= 14.0000005364418
##$F2P= -0.99999901652339
##$FCOR= 0.5
##$FTSIZE= 32768
##$FT_mod= 6
##$GAMMA= 0
##$GB= 0
##$INTBC= 1
##$INTSCL= 1
##$ISEN= 128
##$LB= 0.3
##$LEV0= 0
##$LPBIN= 0
##$MAXI= 10000
##$MC2= 0
##$MEAN= 0
##$ME_mod= 0
##$MI= 0
##$NCOEF= 0
##$NC_proc= -3
##$NLEV= 6
##$NOISF1= 0
##$NOISF2= 0
##$NSP= 0
##$NTH_PI= 0
##$NZP= 0
##$OFFSET= 16.522
##$PC= 1
##$PHC0= -71.38676
##$PHC1= 8.448992
##$PH_mod= 1
##$PKNL= yes
##$PPARMOD= 0
##$PSCAL= 4
##$PSIGN= 0
##$REVERSE= no
##$SF= 250.13
##$SI= 32768
##$SIGF1= 0
##$SIGF2= 0
##$SINO= 400
##$SIOLD= 32768
##$SREGLST= <1H.CDCl3>
##$SSB= 0
##$STSI= 32768
##$STSR= 0
##$SW_p= 5175.98343685301
##$SYMM= 0
##$S_DEV= 0
##$TDeff= 65536
##$TDoff= 0
##$TI= <Analysis number 999999
Compound Code 99
Book Reference 9
Project Code 9>
##$TILT= no
##$TM1= 0
##$TM2= 0
##$TOPLEV= 0
##$USERP1= <user>
##$USERP2= <user>
##$USERP3= <user>
##$USERP4= <user>
##$USERP5= <user>
##$WDW= 1
##$XDIM= 32768
##$YMAX_p= 400256338
##$YMIN_p= -81298
$$ End of Bruker specific parameters
$$ ---------------------------------
##NTUPLES= NMR SPECTRUM
##VAR_NAME=  FREQUENCY,     SPECTRUM/REAL,   SPECTRUM/IMAG
##SYMBOL=    X,             R,               I
##VAR_TYPE=  INDEPENDENT,   DEPENDENT,       DEPENDENT
##VAR_FORM=  AFFN,          ASDF,            ASDF
##VAR_DIM=   32768,         32768,           32768
##UNITS=     HZ,            ARBITRARY UNITS, ARBITRARY UNITS
##FACTOR=    0.157963299565203, 1,           1
##FIRST=     4132.6476996994, 0,             0
##LAST=      -1043.33573715361, 0,           0
##MIN=       -1043.33573715361, -81298,      0
##MAX=       4132.6476996994, 400256338,     0
$$ Real data points
##PAGE= N=1
##DATA TABLE= (X++(R..R)), XYDATA
$$ [...]
23706 -8187 -22526 -33809 -36490 -25514 -9009 3593 932 2010 6746 9472 1912 2642 -608 1254
23692 1254 -2594 -12417 -16896 -10900 -2161 -341 -3908 -12248 -13423 -15193 -11957 -3389 9639 7433
23678 7433 -5268 -5754 -3158 3131 -114 7048 2273 -3443 -1810 13912 10341 -1725 -11315 -7601
23664 -7601 832 2333 -3176 -72 -2010 -7978 -16714 -22383 -18594 -11654 -4653 3266 3666 -40 -3217
23649 -3217 -2210 7600 455 -12758 -12785 -13462 -6901 -2767 1051 1748 -539 -8683 -3706 15324 16050
23634 16050 -581 2953 -1247 -7017 -17190 -17699 -20493 -24346 -22839 -8312 -2229 -3953 4453 13633
23620 13633 21449 18317 8998 4055 11472 16848 12964 6733 14601 23650 15262 9869 13930 21980
23606 21980 25263 18941 16561 5473 3939 26723 23498 4950 1793 -4187 1396 9839 17729 11758
23592 11758 1042 -2078 -9465 -16802 -7018 -8780 -16238 -5526 3444 4949 5203 14312 16938 7792
23578 7792 841 -1890 7812 4677 2406 10104 24976 19041 5299 12215 20637 16629 25204 17436
23564 17436 17753 20057 15346 16129 18789 10654 -7940 -23838 -25895 -33142 -22016 -13151 -13427 -1739
23550 -1739 306 -9484 -6412 9799 9075 380 -15646 -26840 -27422 -25724 -19847 -17044 -7179 -5776
23536 -5776 -5928 -4743 -5151 -3302 16296 19041 24980 13015 -2859 52 2539 -2008 7233 5765
23522 5765 -4836 -632 -9537 -14049 -514 1152 -4589 -11247 -13554 -3240 -5824 -17934 -11573 -5855
23508 -5855 -3522 -9222 -5307 -10771 -15317 -17986 -15046 -13696 -22907 -12273 -8829 -13579 -10956 -8811
23494 -8811 -4793 833 1513 -16979 -30848 -31144 -17609 -17612 -16010 -1937 14118 24582 24843 21288 21025
23479 21025 16135 5705 -9247 -13936 -8375 -11570 -13214 -13466 -23118 -23213 -12487 -1328 -2624 -669
23465 -669 2771 9841 19805 17877 10680 3896 -13924 -10579 -6718 -18799 -4314 17543 27817 30495
23451 30495 13614 3673 6233 18111 14117 4989 1362 2447 -6152 -7487 -888 -4656 -734 12536
23437 12536 3686 4668 8941 9558 -402 -590 -5055 -13233 -15359 -23670 -17606 1495 18426 11669 4347
23422 4347 10979 2649 -14768 -9374 -3399 -1809 2506 10577 7001 6583 10008 13302 7072 2530 5882
23407 5882 4140 1541 10 12148 18340 16220 12932 15853 4195 -1624 -22116 -24272 -11526 -12089
23393 -12089 -24438 -33263 -28286 -18157 -6153 5708 14527 17140 16628 14196 18864 29845 28127
23380 28127 5022 -10177 -13549 -24031 -13723 -5120 -8956 -21537 -14320 -16210 -19389 -21937 -23803
23367 -23803 -19846 -346 -10240 -13495 1747 6579 7451 490 10927 6617 -836 -15738 -21033 -5580
23353 -5580 1761 -8296 -13787 -2682 14372 16675 1861 13644 8393 -4474 9451 8028 13596
23340 13596 5020 -4768 -6285 4749 4571 585 7023 7819 4528 1976 6828 12158 8590 11874 3326
23325 3326 -1011 -6395 -18729 -28360 -31959 -13303 -2053 -13634 -20536 -2546 11452 775 -27683
23312 -27683 -31465 -29952 -19892 -19969 -26559 -14880 2648 -1985 -1963 -4446 -11786 -16043 -17498 -18435 -25260
23297 -25260 -29763 -17446 -6682 1194 5710 3547 -6147 3079 4427 -6517 4300 12819 19607
23284 19607 18065 2934 -12126 -14557 -15596 -15687 -3557 863 -7251 -9660 -1537 6571 7264 3331
23270 3331 -798 5596 -12025 -15511 -13507 -12834 -23854 -23691 -11907 -705 -3656 -673 12785 9239
23256 9239 9099 -4931 -7417 4592 -743 4418 13045 23997 20711 9466 7391 8436 11918 12022
23242 12022 12526 14614 2893 -4131 6066 17097 8306 2 2471 9403 16237 25868 37790 29289
23228 29289 29007 19902 20680 10778 -4444 -4066 -3002 -18704 -24989 -12970 -13117 -261 2616 -6641
23214 -6641 -15827 -4776 9226 8348 -1690 -4256 -1570 7195 -16 602 -2829 -4894 -9890 -4353
23200 -4353 -273 6081 8037 10089 -5382 -10000 -12098 -8901 2841 330 -3847 -14776 -24184 -17384
23186 -17384 -2711 -3309 2953 3721 -6549 591 -2123 -4196 -4626 -1740 -8567 -5140 584 -5030 -9569
23171 -9569 -17345 -14099 -3456 11033 10389 10939 2375 8648 5866 2821 2632 -1425 13436 -4382
23157 -4382 -20389 -17002 -13432 -6334 14255 19149 4661 -3613 -6889 -11855 -17612 -3004 12685
23144 12685 4643 -1476 -8433 1034 10382 11 571 4457 -3309 -10207 -7653 -16069 -10891 -7837
23130 -7837 -6100 -7816 8172 17571 6558 -2422 3875 3850 -2187 -2606 14353 21105 11826 7774 10227
23115 10227 26061 40820 47829 41711 35673 31073 20660 8575 -5155 -14474 -16704 -3851 1240
23102 1240 -11171 -2628 229 5282 8029 -6082 6515 20781 15241 -1252 -4585 -294 -185 -12199
23088 -12199 -15025 -13456 -12856 43 4745 -57 3492 2513 1742 6932 13242 10922 10565 12339 3934
23073 3934 3563 -4784 -8915 -7878 -6542 -1741 3055 -5201 1197 5649 11360 12518 11814 1752 7425
23058 7425 9368 7044 539 -2777 -7856 -9146 -14109 -8699 12309 14304 5778 -8635 -6645 -5657
23044 -5657 -14148 -13795 9842 19340 6078 3815 5253 -2018 -7541 -12124 -1405 3280 -1377 -1766
23030 -1766 10245 20040 12692 368 -3798 -7493 -8818 2139 1544 7303 7013 9404 19051 23201
23016 23201 6627 -1764 7328 10821 20436 16754 12682 3201 -8327 -8492 -3808 5784 12970 16676
23002 16676 8017 -13717 -13231 -23349 -38514 -26212 -14294 -3916 -3978 -6441 -19082 -13497 -3536
22989 -3536 -1467 -2502 -4842 2116 1623 -7997 59 9144 20780 17306 10079 8563 2770 -1560 -2793
22974 -2793 -5996 -6484 -9912 860 8223 -4789 -7777 -16078 -5219 -1524 -8283 -15726 -13729 -5379
22960 -5379 856 1611 2668 5744 -13332 -13183 -11361 -2307 13617 15243 777 -1203 -1370 -9509 -2664
22945 -2664 5519 6883 11275 8051 12914 13490 21461 19587 11763 7226 8064 9937 -2026 5362 -1966
22930 -1966 -3120 2208 5794 8519 17876 17803 6849 6124 11044 6110 -368 5119 15242 2648 -8236
22915 -8236 577 6674 13909 11605 3536 -13392 2931 9615 -579 -10398 -17268 -17783 -16406 -8956
22901 -8956 3149 8209 -10801 -7395 2191 5081 -925 -345 -7730 2880 17157 10542 -1819 -5358
22887 -5358 -10394 -10076 -6578 -6995 1655 11405 14245 19181 15110 -9 5672 2728 11592 3758 -17524
22872 -17524 -18805 -18999 -9011 -3970 -8829 8288 14202 1094 -12429 -23486 -11917 -3041 7281
22859 7281 8214 13390 17329 17411 15630 11359 10229 208 1036 11782 14971 13415 17873 26187 17993
22844 17993 6272 -4284 -8289 -5864 -6558 11711 12961 12579 16424 16798 14247 15035 22527 23994 18886
22829 18886 22597 17542 17211 16146 17391 13216 23136 15949 20799 28932 25308 19389 8140 12150
22815 12150 22003 9394 3763 -8269 100 9833 2989 17270 21925 4226 -4292 -6789 -3592
22802 -3592 -5710 -21392 -24122 -5812 -320 1624 6750 21839 17412 221 -7476 -4808 4574 -2484
22788 -2484 -9032 8546 11570 7820 4015 -1215 -624 -9557 -337 15175 10395 18585 19690 16955
22774 16955 6378 8548 8317 7699 2037 -1676 3952 7862 -5397 -10905 -12118 1335 2210 4608
22760 4608 14395 7393 1006 2634 4682 9099 16031 17394 18846 11471 11713 7785 -3829 -17015
22746 -17015 -10228 -11675 -16972 -9039 -12606 -13628 -13391 -18761 -15268 -11342 -7862 -12312 -20426 -6700
22732 -6700 15316 25792 24015 14474 -458 -9847 -8125 -14113 -14579 13956 21342 9556 2162 -2099
22718 -2099 -5970 2058 -10183 -21143 -20282 -8722 11010 11292 22245 28408 31937 31334 34638 27263
22704 27263 20735 14035 11814 10379 2699 -2274 978 3417 -2991 -12970 -10688 3106 9032 9545
22690 9545 14611 16434 10884 510 569 1286 -9883 -2326 42 -14792 -12624 -11973 -12843 4071 -251
22675 -251 -24462 -29602 -31930 -29113 -27584 -30149 -23682 -22524 -18031 -15741 -14197 -10132 -8842 -7046 5048
22660 5048 825 -2688 1299 8312 10660 3671 -11376 -8591 -1771 -7558 -8959 -5675 11 -332 5553
22645 5553 7035 13786 12168 19850 14144 10626 250 -10473 -2155 8627 2861 1927 9422 10381
22631 10381 6524 -6320 -5130 -7296 -14089 -17606 -6565 5760 -4993 -11555 -19168 -18853 -5857
22618 -5857 -694 4746 9936 -8174 -11746 -15401 -9430 -7118 -10248 -21681 -17336 -14503 -21668 -23573
22604 -23573 -8981 -5582 -16802 -12716 -2217 -2965 -3423 -4071 4014 3042 4059 17383 15642 12360
22590 12360 15222 8362 5928 7388 12821 4632 2047 9509 -414 -11297 -17052 -8528 -11950 -1899
22576 -1899 -1377 1144 10519 14893 14416 8771 -5953 -5952 -6910 -15753 -15738 -5285 12739 11362 -1728 2781
22560 2781 -1944 13941 16680 18597 22538 25839 18413 4547 -7354 -8689 -11989 -871 10334
22547 10334 890 9617 11474 5290 18014 28457 20453 10830 5279 16109 10330 2848 244 10712
22533 10712 11712 25801 28429 21055 3971 -2591 2509 -787 -8670 414 10248 6095 3412 -2529
22519 -2529 -7208 -8521 -9335 -14606 -19598 -18881 1402 16225 15491 3926 -3050 -5782 -12351 -7956 5869
22504 5869 9422 7159 1697 5513 -8471 -23215 -19840 -10557 -3669 -4297 -3152 6826 11977 10525
22490 10525 14744 13354 11154 7028 -2862 -9550 -6768 3122 8506 7601 -3671 -9939 -10894 -3165 403
22475 403 -643 -3032 -432 -1669 -1708 8978 17514 9659 5714 -4881 1807 -2240 -17613 -19464 -13754
22460 -13754 -13548 -3091 -5065 1141 965 -1052 1356 -5153 -2222 1840 7987 5463 9579 18915 16061
22445 16061 19673 25717 29681 23548 15448 6532 12693 -5602 -17638 3755 8096 215 -11717
22432 -11717 -6871 7585 9056 5186 -1080 3369 8528 -11894 -11348 -5622 -387 8037 9447 17455
22418 17455 4898 6705 5138 3001 -7386 -8323 11020 6964 7527 20075 13783 3792 -9108 -6702
22404 -6702 14546 12536 9257 -1477 3473 12217 4446 959 4851 6896 -2043 -12405 -18449 -22016
22390 -22016 -19127 -9389 -2334 7059 3895 -8292 -22917 -34357 -24815 -12144 3069 6432 2154
22377 2154 1089 -2511 11613 10105 -3100 -4727 -16188 -2792 10745 14193 17675 17912 1951
22364 1951 -15223 -8957 -16719 -12377 1469 14642 21269 28008 26768 17612 -1202 -1204 6039 10397
22350 10397 19215 20609 7024 5779 8436 -8134 -12760 -14051 -11173 2644 2468 -9049 -12730 -17144
22336 -17144 -10171 -14108 -19157 -11968 -8175 6678 15699 16019 18507 20788 16447 3647 -14683 2367
22322 2367 13009 13633 20874 4649 264 4038 8254 5629 -3649 -19416 -26626 -24434 -15868 -16599
22308 -16599 -22526 -27803 -19925 -12110 -8335 -13539 -30977 -17701 -10143 -5717 -11343 -6902 4275 5761
22294 5761 9087 7058 6669 4599 5528 2093 5602 8758 4715 -4539 -20570 -23186 -10486 748
22280 748 5650 -5931 -11350 -16372 -20747 -14317 -7380 -2147 459 10054 10866 6561 -7396 -4611 7784
22265 7784 17707 19155 30723 24891 6935 2319 -1965 -4198 -9572 -9170 3219 15274 9899 -10332
22251 -10332 -25616 -21236 -15298 -9571 2048 -3108 3112 2351 -12568 -12767 -7584 -12290 -7619 -1880
22237 -1880 -3569 -20911 -26371 -26489 -22382 -15163 2495 5396 1881 -2183 -3826 2483 3118 13801
22223 13801 26024 18775 13400 8941 13174 6988 13805 25501 16422 11723 7113 2150 4270 3507
22209 3507 -2266 -7331 -6893 1447 -6069 -14375 -7147 2615 12639 14563 -402 -17212 -22476 -8781
22195 -8781 13473 17064 12559 -4064 -8296 -8422 -8849 -9288 -9323 -18855 -17854 -15150 -16344 -18168 -7686
22180 -7686 -8302 7801 17380 14991 7794 16476 30374 29295 11313 1360 4158 962 1282 8056
22166 8056 17219 12224 14173 25564 27781 19815 10312 8701 2050 12 -12527 -15600 -22463 -26892
22152 -26892 -20667 -11897 1742 9645 6442 13347 8325 4767 9033 13603 25682 4751 -15805
22139 -15805 -12758 1407 7437 12078 7002 -30 7373 11357 5866 5969 20329 28093 15337 -1416
22125 -1416 -11239 -10855 -6018 -2942 -4461 -18487 -17232 -597 9093 17394 12897 10383 11241 6955 -1119
22110 -1119 -2925 -3522 -5441 -2792 2076 12859 13338 10412 11647 9864 -422 -2324 5452 9164 9147
22095 9147 2879 -7504 -5187 -15689 -15869 -9191 -64 -1212 3454 4480 3699 -3971 -4520 -3473 -3016
22080 -3016 7117 6135 11895 9382 17881 9279 12143 5760 2585 9829 12913 3765 5167 -5604
22066 -5604 -9763 -9100 -6946 -19125 -17196 -10067 -11361 -4864 -3806 -389 -7370 -7288 -2298 -4381 4901
22051 4901 3992 3448 -10070 -19818 -7282 4291 -8497 -1855 10736 9229 3145 -5903 308 1737
22037 1737 -10088 -15308 -17490 3072 6787 -8971 -22898 -22369 -10196 -3080 -105 2291 1614 -7975
22023 -7975 -2859 -7797 -9928 -4148 -7947 -8494 -19560 -32176 -25712 -21014 -21796 -5205 -11075 -21044
22009 -21044 -19836 -18756 -8633 977 -4770 -6267 3265 8141 18358 6275 6453 8012 11587 2203
21995 2203 -12692 -16352 -14078 -1934 4058 4838 900 11550 9962 10359 14900 6810 680 -3041
21981 -3041 -7180 -3740 5900 16287 10980 16460 16520 8438 8979 2899 -10328 -20232 -22542 -16222 -8286
21966 -8286 -3507 3809 146 4789 11348 -684 -14530 -3504 -2972 -5664 -8692 -1994 -2941 -7912
21952 -7912 -10142 -12709 -6472 -3214 9267 1502 6022 16763 16348 19817 24498 13448 17740 32039
21938 32039 28721 14761 -122 -3860 -8440 -15016 -15658 -2151 21759 19263 11082 7371 10030 8351
21924 8351 -1593 3093 11169 12763 8731 5430 -2279 8858 15425 13550 10600 21715 18889 7619
21910 7619 6446 400 2967 3359 5754 5072 1257 -19612 -33323 -23928 -9325 6912 9440 7893
21896 7893 1412 -7072 3204 -875 -6366 -1061 7991 18866 23457 36636 24927 9281 -1793
21883 -1793 836 -1573 -3286 -1338 1163 -11437 -19775 -22683 -26089 -10909 -21793 -23868 6340 24952
21869 24952 28466 24799 14059 -358 528 8838 758 -11764 -21776 -23020 -29567 -30686 -19960
21856 -19960 -21997 -25995 -28794 -28908 -17262 -2368 9871 -186 -6923 -1374 569 -5177 -8419 -430
21842 -430 11787 7815 1139 -3107 1228 8310 12143 18651 11967 7345 9604 5010 5790 10079 9766
21827 9766 4701 -4916 -1386 -10907 -21642 -19596 -15199 -19840 -8836 -17873 -19033 -16905 -26473 -30414
21813 -30414 -23780 -23079 -11801 9437 6473 -6694 -1309 7785 17665 23867 13272 11737 6722 6436
21799 6436 -2714 -7673 -14388 -11254 -14691 -9721 -1719 8443 -1587 -221 8552 14036 18838 18154
21785 18154 22114 22767 18619 5761 -14986 -21744 -31281 -22724 6138 24903 27215 16021 11313
21772 11313 13139 7904 -4509 4031 7660 -7021 -5091 -15934 -15020 -13334 -12672 -2192 3911 -2017
21758 -2017 2686 11794 6820 253 -7463 -13719 -18641 -20039 -22888 -12934 -14322 -12619 1889 10526
21744 10526 4810 8656 21165 35036 35687 26312 10831 10683 12957 3352 -1256 -8974 -7758 -5686
21730 -5686 -8847 -8364 -4572 -2607 -26962 -24731 -24725 -5931 7250 -7933 -16300 -13706 -20260 -16762 -11525
21715 -11525 3229 2178 -8094 -13908 -9738 -2440 -2736 -11328 -11104 -16343 -12818 -10170 -10249 469 -5540
21700 -5540 -9164 -15975 -15488 -9875 -11816 -3771 -7469 464 1351 -3512 -14150 -21567 -19725 -10537 -1539
21685 -1539 9371 13323 14473 13293 -2548 -16683 -13281 -11943 192 -3173 -7834 1582 3303 -4701
21671 -4701 -8274 -2514 -1733 3422 11375 11624 -2944 11725 12696 -2844 2452 11347 7472 -9836
21657 -9836 -11682 -7525 -13359 -16477 -8201 -1833 -4754 2345 3396 1887 5823 4164 8096 -1366 1424
21642 1424 4422 4242 14536 28200 16331 22713 21495 12776 7093 358 -2211 -3890 -3031 -14652
21628 -14652 -24506 -20459 -7026 7518 19272 20449 19057 21156 13803 12369 1478 -5467 -9883
21615 -9883 -4339 -3102 -8013 8190 6165 -1192 -789 -5758 -12103 -15643 -18448 -20302 -17631 -14041 -1754
21600 -1754 1906 -42 -1388 2235 1877 6719 8237 4934 -4308 -1688 8 -13362 -19019 -29866
21586 -29866 -18416 -13943 -17069 -6252 -13176 -26239 -31728 -33107 -26554 -8048 -11478 -8322 -9526
21573 -9526 -10101 -10575 -9148 -9336 3040 1763 -7419 -5210 3157 -1283 -16340 -17097 -17943 -10979 -2277
21558 -2277 -15920 -18715 -9197 -12504 -12749 -11949 -12612 370 17470 14728 14313 4109 1099 4679 -6965
21543 -6965 -22530 -10877 1317 2622 5614 2868 -2551 -894 3119 -7840 -17075 -14507 226
21530 226 2728 19957 7566 6502 -180 -721 30 8585 11124 19671 20495 9311 15053 22881 20036
21515 20036 14730 3227 5438 15877 5898 7512 13826 26414 26155 11876 6291 -4958 7112
21502 7112 11855 5302 -1174 -22238 -27991 -15989 -11525 -5097 -2430 -5342 -12693 -26924 -27342 -11794
21488 -11794 -11068 -20159 -14681 -11306 4872 11769 15486 19005 18561 25601 24521 10547 2004 -10
21474 -10 -6349 -13273 -2550 5756 4566 2871 2256 -1574 4528 20112 15280 -6397 -6008 7054 8340
21459 8340 1680 -7237 -10676 -12573 -159 2239 -4658 -8795 696 3619 -267 6815 25687 22409
21445 22409 7106 4410 8518 4038 8097 580 -11800 -11548 -6395 -10083 -14603 -22524 -33093 -23353
21431 -23353 -8148 7999 -3584 -13327 -23393 -33546 -25002 -16806 -18306 -25313 -29035 -26634 -19181
21418 -19181 -8804 1552 3314 -15769 -28591 -19435 -13157 1576 1743 -2278 -10601 -12814 459
21405 459 12627 5250 8620 17038 5388 -3936 -12510 -17542 -1991 4282 -10367 -13871 -15104 -19102
21391 -19102 -14070 669 15828 24540 14174 -331 -7535 -7695 -2153 -7870 -1885 -1295 -6800 -8024
21377 -8024 6215 -3956 -17249 -25313 -27082 -12509 1238 -9208 -17098 874 14554 13483 15861
21364 15861 24539 26768 12658 11269 17195 19109 10294 11516 2393 6776 11606 10947 7877 4589
21350 4589 -2263 -5959 -14491 -13700 3707 18057 10328 -4092 -5978 1614 3539 11513 9381 -8582
21336 -8582 -12952 1841 10000 -2159 -13850 -21534 -24750 -2860 13820 12104 16875 19090 6329
21323 6329 7842 6638 4950 -17825 -22872 -32179 -31880 -20169 -10978 1460 7041 1353 3929 -3962
21309 -3962 -8378 -8763 -10036 3272 8532 4467 2926 -1658 1773 21968 24236 25412 17480 8976
21295 8976 14131 9640 6158 10933 15618 -589 -6261 -6262 -13830 -20425 -27051 -22700 -14265 -30466 -32448
21280 -32448 -25585 -6848 3732 3537 -4843 -723 -2341 -13404 -12999 -1334 -3817 -15313 -10414 -9145
21266 -9145 -7474 -6298 -7527 -13184 -6000 8669 6330 -3710 -5873 -19289 -17947 -16441 -1515 8979
21252 8979 11151 6170 -2902 -4701 3493 4367 1731 -13614 -33374 -26107 -13820 -13028 -3368 3116
21238 3116 10974 6473 -9828 -17302 -13623 -16096 -17083 -13882 -6330 -3113 8780 12883 7970 1578
21224 1578 -2308 -14797 -16524 -3127 5629 -2859 2600 7482 10470 7288 871 15329 16919 14770
21210 14770 19035 4281 6593 18919 15685 18651 19021 4756 -17251 -11594 9566 16841 3034
21197 3034 586 -6008 -3738 16224 4783 -13686 -23648 -15396 -5742 -6474 -5507 7630 15228 8584
21183 8584 4281 -6350 -5395 11357 20165 23315 12243 -4881 -15926 -11548 -8650 -16028 -10685 -7204
21169 -7204 -2902 -6516 -14600 -22403 -23469 -15207 -612 -7096 -4714 8272 14319 15556 11273 7633
21155 7633 -938 3357 3157 -1505 -3111 -4089 -15955 980 13804 16752 18963 22180 19950 21215
21141 21215 19128 3270 -18597 -25932 -21599 -6766 1496 1585 -4369 291 6126 12834 -7582 -16180
21127 -16180 -15351 -9136 3103 9354 2063 -2182 -5302 -16323 -16356 -14527 -21852 -27839 -20848 -1257
21113 -1257 4111 4211 -5713 -19768 -20287 -29194 -25776 -11512 2012 -1340 -11290 -5975 6342 5038
21099 5038 2824 9527 -846 -2639 -4989 -14792 -13792 -4634 935 -8165 -21017 -31360 -34457 -28464
21085 -28464 -20144 -20899 -31592 -22815 -4683 -8594 -20344 -27115 -27703 -23513 -25244 -25589 -18224 -14496
21071 -14496 -10547 -6535 -7668 -21899 -13114 -6895 126 3760 4556 -1052 -12570 -11234 1222 11406
21057 11406 15388 7956 11565 17617 24077 7819 -2672 6156 13339 14797 -530 -4141 -5539 -748
21043 -748 4756 8480 4426 10919 5486 3560 2340 6582 17121 3310 657 3097 620 -9757
21029 -9757 -3784 5777 18192 25301 10151 -1313 -17810 -15413 -9406 -8910 -14000 -17453 -14957 -11446
21015 -11446 -1740 -7909 -12822 -9904 -25122 -28813 -24116 -24671 -24590 -11584 3994 9334 5733 2012
21001 2012 7752 11246 10223 8956 1655 -5137 -4932 -3407 -324 -5185 -13653 -15855 -3869 -1513 4619
20986 4619 -748 -11019 -12387 -14208 -5977 -9140 1171 15177 11156 7196 26969 28498 10534
20973 10534 5245 15087 23157 10826 13937 17164 12391 24232 35533 27907 17484 26647 19784
20960 19784 22357 16581 18389 15772 1439 -6831 -2683 -4419 -16127 -8817 -14740 9543 27604
20947 27604 20848 7864 14461 17448 5465 -857 -1771 -5761 -4264 730 4745 20683 22579 15456
20933 15456 22744 10917 940 2134 6971 1387 3613 -2098 -3462 -5388 -6411 -16019 -6935 -6174
20919 -6174 -10162 -5167 -11236 -18033 -10088 2784 -1409 9179 6993 -304 -5215 -21459 -20799 -15379
20905 -15379 -11026 -22316 -17338 -11994 -13792 -13557 -6074 6462 -5234 -2188 -3047 540 -5874 -8186
20891 -8186 -9731 -9708 -10370 -24214 -13810 2491 17116 17660 6274 2456 1884 425 -1654 -6333 -21626
20876 -21626 -29097 -17691 -4354 1815 9100 5516 13376 9447 13062 -3886 -12217 -9814 -17347 -2321
20862 -2321 -5410 -5900 -6597 -2526 7314 3141 -22616 -26753 -21233 -34336 -37154 -24130 -13731 -19348
20848 -19348 -27804 -32143 -26526 -17377 -20295 -19301 -10392 -14444 -9376 -14065 -17774 -2735 -6738 -10456
20834 -10456 -9085 257 4913 -1805 3639 -8374 -9109 -9103 -4301 -13460 -34706 -25465 -25070 -20953 -18325
20819 -18325 -21126 -22120 -10846 -7423 5518 3024 -2596 -7002 -15156 -12119 -10371 -6970 -18460 -19563
20805 -19563 -22738 -23542 -16937 -13327 -8378 1944 -18886 -42574 -48190 -39080 -17335 1595 6610
20792 6610 12897 25926 26374 27691 6399 11924 21198 16724 13119 -5009 -8603 -7474 -17476 -36027
20778 -36027 -29387 -12897 -7180 -7658 -29038 -29544 -9432 9611 15735 12438 17792 17050 17844 11094
20764 11094 -9131 -2829 15743 4416 -2287 11219 13539 2052 -9002 -11787 -18832 -26729 -23946
20751 -23946 -16855 -6618 -2594 1979 -523 6323 16718 14469 3298 -10145 -5707 -1806 1403
20738 1403 6691 8703 7653 -366 6229 14027 10630 -2778 -7487 -9138 -23429 -14877 -15758 -19209
20724 -19209 -26873 -26059 -18223 -19643 -14238 -4306 -4503 9021 17210 10394 2249 -7382 -8420 -12068 -5854
20709 -5854 14498 14835 6459 -2731 -11892 -8556 -1556 -5584 -7175 10004 6761 7020 5985 -4871
20695 -4871 1391 8261 264 -8201 -15550 -24874 -20150 -4941 -12116 -22190 -12976 -7497 8 -11467
20681 -11467 -15037 -26927 -39267 -43403 -31060 -14496 -242 -2452 -13553 -21196 -10473 -28
20669 -28 2549 -1541 -9237 -11002 -17417 -11589 -4315 -993 6051 -12464 -24511 -26020 -27688 -26278 -13420
20654 -13420 2909 7042 4401 4075 -8346 5029 6694 3634 -6210 -7113 7401 2930 -3735 6330
20640 6330 -2730 -9614 -3864 6326 10927 9539 8450 5921 1102 9188 9508 4986 7026 -5021
20626 -5021 -16962 -13387 -12642 501 12127 1883 4750 1241 -9149 -19213 -12722 -7823 -11750
20613 -11750 -14661 -6720 -3619 -5202 -21306 -27821 -19617 -1167 4 -9155 -7180 -14781 -12089 -173
20599 -173 -4468 -361 8906 5048 1332 -1546 4253 6652 4979 10761 20200 20364 24433 21848 27296
20584 27296 23742 21201 15292 8619 -771 5856 10890 9949 5208 4042 -2126 -10378 -432 -1609 -2976
20569 -2976 3322 -6948 -7265 -1248 -9351 -2410 4583 15558 18157 8591 4618 -7892 -7896 4344 -2108
20554 -2108 3116 -3948 -1464 396 6509 -9516 -30603 -28914 -17680 -13574 -16498 -6222 2472 11160
20540 11160 12713 15536 5127 2043 -1904 -443 -11004 -8660 13540 10966 12336 10019 -5150
20527 -5150 -10136 -11175 -14951 -3588 3580 -2348 -13248 -7646 -4384 -13110 -17001 -19057 -16571 -6186
20513 -6186 5420 -4686 -12808 -1429 -1830 -18692 -23577 -16406 -16236 -8661 3994 921 6607 1515
20499 1515 11754 5262 -10677 -19847 -19885 -28124 -22906 -31059 -31949 -31096 -21404 -11829 -6804 -458 7874
20484 7874 8046 12894 19680 10204 802 -21 -3935 -2777 8548 10186 -5326 -12584 -17179 -10781 -1101
20469 -1101 5456 4507 1718 8836 11181 11448 8594 4346 1371 13343 25520 24300 24699 6639 -11102
20454 -11102 -2214 13766 16180 12952 9522 9723 17955 22466 16381 6539 -1987 -6668 -6819 -3448 15269
20439 15269 12980 5602 -1886 4308 -694 -595 -15652 -16327 -12127 -9854 -4617 7892 2986 -7504
20425 -7504 -6145 1892 -1945 -8567 -15447 -9871 -21327 -22302 -8581 -2315 -11579 -11415 -23032 -25044
20411 -25044 -25833 -14306 -12286 -12532 -23293 -29528 -32377 -30737 -23195 -13368 -414 -8640 -8416 2856
20397 2856 6043 9390 18229 22948 21374 11786 -7542 -16411 -22500 -13696 -19457 -10955 -23690 -18992
20383 -18992 -3768 3576 -1303 -11867 -9658 4495 7909 6261 -718 9581 11746 -6833 -13007
20370 -13007 -12518 -5575 2585 -2032 -12785 -7247 -3835 -4321 -1612 -11006 852 10080 5908 -8013
20356 -8013 -23585 -26429 -1824 6058 2371 -7837 -17494 -18519 -16219 -17920 -21967 -22803 -18586 -14867
20342 -14867 -10305 -5775 5369 1341 -18337 -11238 -4035 -6879 -4063 -11368 -12648 -6800 -7522 -8954
20328 -8954 -13669 -13748 -10775 -9436 3915 1354 6985 7980 398 -135 6558 5734 14718 18425 -2662
20313 -2662 -3371 5450 1594 -13317 -26332 -34985 -26571 -17650 -20161 -37264 -49011 -43192 -41721 -31753
20299 -31753 -24711 -29264 -29227 -10059 -4764 -2059 5668 8369 -719 11921 -2667 -2553 10137 2573
20285 2573 -6398 -8994 -7135 -9819 -12624 -11016 -9334 -9801 -7246 -10601 1233 2317 -9784 -21928
20271 -21928 -29763 -24297 -17552 -24018 -14850 -16170 -12194 -3215 -7270 1440 5719 -871 -4799 -13166
20257 -13166 -17881 -13736 -13708 -25721 -22177 -9052 -9491 -15361 -20268 -16498 4593 6265 10653 5300
20243 5300 1848 -13968 -13899 -9590 -7483 -87 9554 12501 10208 -342 -11875 2294 -3858 9046
20229 9046 12142 12062 3666 -1876 -7059 -10817 -10869 -16642 -8145 2031 7155 854 -16756 -22069 -31687
20214 -31687 -13296 2536 -4901 2101 10141 31 -357 -2543 -10862 -28553 -29976 -17920 -4054
20201 -4054 -5264 1085 -1452 -9725 -7230 -6910 -18613 -16955 -15553 -7881 10930 4626 8144 14485
20187 14485 -1382 -12374 -20658 -26673 -28913 -22312 -22228 -2558 4930 -8433 -4075 -5254 -5773 -1940
20173 -1940 -7279 -12574 -10699 1869 5715 11693 15651 5030 -523 -15710 -27859 -14967 -12837
20160 -12837 -19620 -28383 -24253 -21213 -11108 8942 -3234 -18755 -16781 -16065 -13774 -9003 -7059 10538
20146 10538 22855 12761 19560 17662 7872 -1527 -9344 -9770 -6612 -14542 -25757 -20961 -11390 -1448
20132 -1448 -13429 -25162 -16111 -16878 -15617 -1867 3282 245 -8943 -17864 -5353 9348 1984 3344
20118 3344 5828 15963 11505 69 -10967 -6023 -4611 -3263 -11239 -11111 -17427 -24874 -21894 -22362
20104 -22362 -21359 -10184 3909 3205 -2401 -8031 -2190 -3931 -474 -4389 -2599 -11891 -22712 -20314
20090 -20314 -26009 -26467 -7176 8393 3286 -581 663 -5450 -9984 -14691 -19171 -18626 -15493 -5661
20076 -5661 10743 13908 10066 16826 10142 11231 18495 7458 -5039 -1915 4496 7221 7329 8773
20062 8773 -1414 -8573 -8919 -4986 -5560 -9720 -202 1576 -4159 -12615 -7465 1831 6900 10208 -1095
20047 -1095 3513 8795 12215 8587 3670 651 -1940 -5654 3879 513 9674 11522 23153 15646
20033 15646 5216 3689 3961 -1832 1834 14232 21944 17677 17763 17363 -9841 -27514 -25598 -23188
20019 -23188 -22915 -21158 -9234 4083 1039 -12917 -690 6050 2189 13523 10188 14750 13812 12690
20005 12690 8001 9398 9834 4915 6463 4629 -661 -917 -3375 -10601 -11664 -10316 -4582 8377 10282
19990 10282 -2804 -11570 -20208 -15889 -3312 4591 -2031 -17890 -18630 -2080 -8251 -11669 -2683 1236
19976 1236 15427 32316 28626 11051 4670 12471 17974 8270 1648 1318 14182 11880 4862 11571
19962 11571 -1123 -7783 614 4536 2087 2475 10364 19095 16630 13084 15847 21487 34053 26581
19948 26581 20348 21744 -1213 -7739 -15613 -19262 -8663 5850 6891 5608 4566 -10267 -21955
19935 -21955 -31960 -18264 10235 16452 21149 2202 -2539 -5397 -2306 3443 2333 9378 11918
19922 11918 2169 6337 -2507 2617 7155 4900 -966 4000 10494 15554 30486 29447 34454 41508
19908 41508 30187 36625 28760 18331 13310 21519 22183 34465 31662 21730 16665 5011 -1337 8117
19894 8117 15393 14866 15808 12909 2361 -3227 -11079 -6367 -10627 -3250 -7820 -3845 8503 14810 2430
19879 2430 -2629 6920 14787 25764 22258 5266 -2503 -1010 -1395 -6433 -10990 -1429 1603 -6918
19865 -6918 -429 15860 15232 -9227 -11215 6785 14417 12649 2461 -3300 5532 3214 -23 7684
19851 7684 6994 5302 2786 -3763 -8497 -4650 -7073 3649 5453 -4452 1097 5676 17016 14577
19837 14577 11759 1560 -2561 8753 9347 1962 -11912 -15117 -3751 477 -8884 -9427 -11037 -10764
19823 -10764 -368 -4806 -2250 92 3564 -8326 9481 10376 -3597 -17009 -18998 -14765 -25934
19810 -25934 -25751 -10509 -15626 -18421 -13136 -6908 -13632 -10478 -17470 -18666 -5560 3797 -6102 -17807
19796 -17807 -22763 -11111 -12432 -17143 -15685 -20786 -24303 -12137 -15290 -12208 -10174 -8284 992 -368
19782 -368 -12036 -6784 -1996 44 8149 6442 2628 -3783 -36 5996 6402 6105 11201 23950 27631
19767 27631 26678 29470 22605 19828 18255 8023 227 -1364 -6580 -11310 -10068 -519 7430 7533 6483
19752 6483 10214 2323 -139 2960 7242 7430 -1565 -4384 -2840 -14597 -25522 -21785 -18839 -18441 -16967
19737 -16967 -27330 -24366 -15929 -17250 -13190 -6827 -4505 -1098 2024 -6418 -11885 -12073 -20130 -18959
19723 -18959 -28902 -27564 -19032 -12545 -11447 1732 10146 6514 2364 4159 1899 -12038 -8387 2033
19709 2033 -1016 2178 -8928 -10294 -10955 983 8155 -12190 -26651 -8596 -11370 -23381 -15113
19696 -15113 -6049 3468 -1247 -4935 -12058 -17844 -19909 -17300 -10324 1595 9653 6962 12460 7929
19682 7929 997 -5473 -9225 -18582 -9565 -6941 -9163 -14067 -22250 -26195 -20454 -16682 -17846 -16745 -22118
19667 -22118 -10633 -4952 -20941 -29783 -19217 -9658 -6758 -317 3357 4147 -221 -12808 -22021 -25532
19653 -25532 -17317 -15491 -17892 -21425 -17356 -7388 1999 -765 -5684 -4386 -4275 -8888 -9559 -18511 -18189
19638 -18189 -16164 -12507 -4716 -14342 -20091 -23243 -19042 -13736 -442 -7205 -1804 -785 5120 12459
19624 12459 9182 -5574 -1114 4245 -8257 -27079 -24531 -7261 -6145 7023 -6734 -17616 -33118
19611 -33118 -26233 -17436 -10917 -8065 -16467 -16673 -5443 -5561 -15925 -25473 -25765 -37268 -34719 -29573
19597 -29573 -26465 -19815 -5143 -12058 -18503 -19362 -14360 -7681 -15417 -7342 -11235 -13521 -12111 -3295
19583 -3295 -1206 -5837 -11190 -825 2234 4832 8124 25094 19946 7923 -11881 -5408 -2752 -10382
19569 -10382 -9115 -1974 -7671 -9423 -17238 -22279 -15512 -5991 -9808 -5106 -13023 -10533 -9100 -13009
19555 -13009 -9733 -1403 10647 6060 9169 -16210 -25761 -26684 -17837 -3178 19872 28662 27311 10213
19541 10213 -2038 -13071 -31245 -41798 -31199 -17665 -13119 -17869 -12791 4478 19649 17313
19529 17313 9646 5659 16934 9264 1699 5348 4192 -6615 -8044 -8317 -24994 -28324 -20197 -359
19515 -359 5482 6887 19287 13466 15093 16023 23032 25275 23431 19809 15482 28853 31816 21705
19501 21705 24141 4931 -10182 -5653 7768 6850 8467 11247 9001 3007 5875 -3471 -16285 -14361
19487 -14361 -1550 -6209 -8600 -38 1175 3001 3221 3717 -2172 -17821 -14600 -8668 5039 12770
19473 12770 2955 -8491 -18675 -10404 -6492 -2537 -8531 -5572 15376 9625 -162 9574 34065
19460 34065 46338 38519 18945 23461 24585 26158 10890 13122 25016 14130 -9955 -25711 -19043
19447 -19043 -18373 -23183 -15916 -12344 5688 10857 18906 18046 644 -4993 -10981 -20984 -11884 -13701
19433 -13701 -13591 -21326 -22818 -915 18171 4879 -425 234 2116 -3769 -3041 -6114 -12763 -12995 269
19418 269 2377 9833 13526 9376 18357 13008 7892 4540 1435 5111 1363 -1696 -16210 -16341 -18962
19403 -18962 -3351 5216 -16266 -11815 -6672 -9974 -14196 -6974 5468 13912 30126 25909 15629
19390 15629 12367 1688 -17402 -15891 -12745 -15903 -14470 -10593 435 4953 2532 11272 1559 4422
19376 4422 304 -1130 -4819 -17007 -12712 -3883 -8078 -9977 -14332 -13880 -1586 -495 -12776 -23284
19362 -23284 -18087 -18787 -18040 -15949 -16852 -14049 -18043 -27269 -16279 -6461 -8248 -23542 -29765 -17878
19348 -17878 -1780 3705 -1904 -2860 3218 -3388 -4125 -7417 -20406 -13942 -6947 -23547 -36738 -31831
19334 -31831 -16004 1043 -7441 -13193 -26347 -30013 -16849 -9763 -3776 -4617 3743 8756 488 913
19320 913 858 -3758 610 -17783 -20891 -6708 9066 -3622 -17853 -13744 964 6603 12705 14402
19306 14402 9997 9944 4560 11830 24876 35730 51511 46085 36894 20967 10990 13416 23837 11400
19292 11400 -1759 -7042 -5627 -15989 -14465 -8743 -1525 -4813 -4820 1127 5702 -159 -3821 -4877 -13161
19277 -13161 -8185 -1015 4729 15758 1817 -11286 -15713 -20917 -21369 -11979 -9704 -15560 -13831 -11168
19263 -11168 -13115 -3446 -7318 -12619 -2016 -5067 -9785 -14237 -15419 -3787 1791 715 3345 12215
19249 12215 15367 2533 -8413 -15442 -20428 -16766 -11014 -16831 -25202 -19022 -9830 -8707 -8793 -2150
19235 -2150 2179 7187 1186 14249 15523 -1655 -20275 -22591 -11396 -4966 7108 17268 11307
19222 11307 16665 25913 16149 -11834 -6020 -8290 -3654 1326 -12163 -4400 -2931 9723 5815 6013
19208 6013 -4965 -16952 -22406 -21316 -18268 -9584 -8730 -12030 -11739 282 16961 12427 5520 1677
19194 1677 928 -300 -960 -4048 -8661 -12281 -11618 823 6277 11979 15316 7990 570 -5218 -4390
19179 -4390 -1403 7704 11247 14787 14985 18287 19532 4928 5785 23089 18114 -2048 -2378 3103 -13034
19164 -13034 -26644 -18240 -4971 -1946 -6862 -11027 9397 21263 23390 25393 9167 7827 17310
19151 17310 18467 10116 1192 2608 1660 1860 -925 937 4023 24147 26291 6259 -5816 -13980
19137 -13980 -16283 -21049 -4690 20 1888 1957 6693 11229 21679 22026 30232 22080 24559 18434 10277
19122 10277 2191 -1513 -6895 1736 2866 -8083 -5740 1525 -2904 1538 -2979 -9045 -2831 -3161
19108 -3161 -10932 -11102 -13167 -5232 3409 2473 5281 1960 -6368 -30035 -22570 -14294 -15937 1365 726
19093 726 4609 10263 21515 24541 26766 26429 11054 -16086 -34339 -22247 -139 8861 21200
19080 21200 26597 19566 9 -5851 -8825 -5575 -19988 -19632 -3345 11902 17480 19192 8752
19067 8752 -10315 -20005 -27655 -21441 2279 1720 -3593 -8709 -3856 -372 1370 -988 -2880 -1396
19053 -1396 7882 -110 3878 9601 20454 2525 -4859 1207 4731 10612 26136 27587 10632 12028
19039 12028 6081 -1481 3622 7662 2582 12346 19604 17874 14915 8814 5388 13667 9134 4359
19025 4359 12655 9375 9614 -3812 3368 2015 -17242 -17361 -9767 -5210 5099 13789 10258 8333
19011 8333 17254 33554 30607 14867 4816 12127 9391 23593 26066 5761 1051 7617 9203
18998 9203 8899 18615 30336 38662 43506 62887 74786 105359 151008 179162 191629 177542 154590
18985 154590 130297 137711 162170 190177 208335 197869 175208 148528 122109 93794 71054 68767
18973 68767 67793 62072 56566 54830 60076 64015 61269 43599 27621 26868 29041 40466 44766 56928
18959 56928 90029 134396 167561 187296 195946 192948 172850 158458 173346 209336 225425 225272
18947 225272 198501 152633 115941 98736 71439 65996 63174 66519 66909 57819 43367 33884 38079
18934 38079 42010 42410 47086 44374 40140 38833 40211 35965 26515 18610 20465 7964 3853 11962
18920 11962 9130 5176 15079 15652 10919 27159 51201 69695 66141 49252 32354 26261 30786
18907 30786 46263 44206 39155 35157 25034 22994 22909 13399 6852 5774 11245 30813 41568 44147
18893 44147 48010 36826 34299 31016 28239 32025 38266 47752 47146 51876 60226 65684 63525 57585
18879 57585 55771 46037 43517 35075 36052 39391 37800 31416 28276 39364 51273 48936 32658 35922
18865 35922 35718 35153 48462 33576 36075 38858 43561 40671 35204 27683 45297 39426 30228 39072
18851 39072 53031 48787 42689 39041 41280 44020 39607 24651 20306 37230 51200 56501 44601
18838 44601 29612 24931 20747 11342 7412 14109 10198 10130 16991 17657 18947 30031 41538 36268
18824 36268 22015 16419 39493 48022 33967 44781 51929 32589 28559 34653 28433 36608 36256
18811 36256 31511 25171 24931 23232 33617 28816 24102 14672 10617 11764 16270 12440 7109 14259
18797 14259 11598 27033 37434 33921 27195 14485 22717 30833 37865 24944 26274 25445 15963 5835
18783 5835 10929 9606 7170 15748 28005 35622 36490 34828 28908 29224 28822 29076 42906 69631 104455
18768 104455 146726 149647 147236 134272 101266 88508 85350 80179 74806 62129 50774 55038 66659
18755 66659 56259 45781 49220 50871 53834 57593 49893 41018 42207 40450 50885 48296 34732
18742 34732 35074 43807 48225 49252 39225 40372 53046 51858 37980 34456 58173 75161 87805
18729 87805 74327 64940 66878 70102 66159 76168 93008 92486 86509 75339 65119 49056 47344
18716 47344 45846 43147 40470 37311 39932 44014 36967 23824 14816 21990 33860 30923 15255 9208
18702 9208 22777 37174 38845 34395 34120 22553 30015 28275 22080 9581 20481 30244 24088 29100
18688 29100 30808 26025 34894 48053 42850 30468 26257 29848 22363 17901 22844 26781 31630 32953
18674 32953 8829 2165 3280 9243 17915 25960 18208 9012 4831 11285 18052 8281 6667 11168
18660 11168 18442 18156 23763 37333 31134 21388 16310 13288 21409 36304 38847 41275 34919 19108
18646 19108 17443 24746 25201 19351 21217 25929 15611 19426 19293 4982 -11704 -10678 -2777 -6403
18632 -6403 -11241 4285 13798 7982 -2312 -2536 6856 4707 18981 37192 46021 52462 44332 28704
18618 28704 13342 18300 24371 27845 29043 25874 29117 34282 15570 -1861 853 11329 21217
18605 21217 11979 -2274 913 -1252 -5856 -2563 20700 29230 14989 6993 1337 9422 2771 7446
18591 7446 4197 -1121 1149 -5392 -13147 -3123 -1277 -5052 -20590 -33253 -25657 -9388 -13587 -4730
18577 -4730 7398 10565 -1433 -6985 -7268 -6849 2276 -1168 3275 7543 6006 -12563 -15839 -5687
18563 -5687 9328 15447 10153 10520 18999 19364 13794 -997 -4095 3301 -1637 -7111 7076 6283 11812
18548 11812 12190 26027 56147 92090 134733 171113 187400 183902 157727 148849 161618 190680
18536 190680 223716 241957 238661 200259 151016 119194 105655 105962 87569 76411 88031 81019
18524 81019 96937 142342 195860 252549 284750 289648 250435 205449 191756 207874 226068 261583
18512 261583 283878 264412 233362 193518 159461 151711 146261 136205 121866 104669 98677 94701
18500 94701 89170 86607 97457 104236 94001 104425 121096 128706 122566 105436 89741 99215 99167
18487 99167 96526 104798 91026 77154 73987 75039 69428 68975 63267 57235 68221 63856 63387 68909
18473 68909 83982 83091 88845 84737 90462 103230 104363 106339 131662 166206 182081 167749 134278
18460 134278 118265 115378 102337 102674 111066 117302 109911 96805 88861 70556 85743 99035 114828
18447 114828 114529 120790 127052 133661 144288 165012 190871 199640 195239 202311 223003 232005 245042
18434 245042 318214 411603 512239 595154 631621 607410 554495 512529 498093 522252 580004
18423 580004 664158 744246 794421 815199 824846 826625 851353 875496 914813 999152 1169523 1422866
18411 1422866 1723251 2034663 2382756 2814452 3491326 4590259 6373374 9428551 14702980
18402 14702980 22685147 30625567 33951721 32698446 27520477 22422635 21258969 24737823
18394 24737823 31779272 37610273 38059174 33719592 25523306 18194971 13799032 11264229
18386 11264229 9629236 8493392 7675335 7092849 6739705 6543468 6394357 6195073 5998870
18377 5998870 5922167 6043730 6493863 7427284 9088750 12005632 17162512 25421916 34742277
18368 34742277 39648734 39088911 33785716 27354403 24826339 27555061 34643807 41722435
18360 41722435 43262546 39345654 30705117 21888010 16208678 12929325 10869525 9450846
18352 9450846 8420114 7672521 7107261 6649911 6200327 5664996 5110576 4618009 4241103
18343 4241103 3938574 3647041 3351702 3046692 2754787 2506758 2292032 2096964 1928817
18334 1928817 1810957 1728504 1659185 1567340 1447131 1313872 1187817 1100864 1041381 989791
18324 989791 940684 876009 800807 723839 670686 626848 572285 532407 487889 457935 428208
18313 428208 407090 384422 360328 346124 332576 330637 315095 299059 289479 268974 250371 232179
18301 232179 210404 200993 189709 167146 156662 161932 156049 146063 136554 128355 118561 115638 113325
18288 113325 113605 116838 134346 151108 162028 169118 152450 148771 170360 183711 196369 211850
18276 211850 223833 230977 207286 194167 195301 199502 206508 202271 204913 186534 160171 131579 111585
18263 111585 114212 121513 123632 106268 94319 87069 84953 87311 109938 133008 146326 163515 166651
18250 166651 160977 156701 173301 200479 210920 206291 200492 202306 182307 168527 165177 172838 177325
18237 177325 169993 168015 158016 141502 114994 97127 89292 86017 74375 69940 79036 82627 96751
18224 96751 87772 99569 117281 111776 94170 87006 84716 97061 105809 111569 108660 102745 116266
18211 116266 117852 110531 112977 113242 103427 107694 115159 108148 106017 115643 111316 100739 95269 62947
18197 62947 47359 52606 62219 68693 80332 74641 61069 59282 59842 56571 57181 59523 60304 74645
18183 74645 83776 84303 89790 95999 93870 86901 96584 83365 75024 50458 40425 48448 42724 48571
18169 48571 56422 69095 73305 81264 78033 73932 73937 63907 76834 84249 96247 113834 122197 113976
18155 113976 122065 112213 87621 75896 96802 113098 115464 115703 122510 132399 154687 157847 165061
18142 165061 158406 148730 147825 166497 201876 250936 310788 372766 464325 607995 769134 873945
18130 873945 892853 833784 716544 606158 538818 505876 488733 501522 543851 598917 671151
18119 671151 760659 880776 1069486 1323041 1733700 2434639 3672061 5963442 10153105
18110 10153105 16456982 21830883 22863217 20347769 14596512 9301519 6246046 4645781
18102 4645781 3740080 3194920 2850649 2620376 2488389 2419655 2319400 2110698 1870534 1656117
18092 1656117 1458424 1303808 1189252 1089257 998628 912860 811762 723343 652551 590924
18082 590924 530818 507609 499207 474378 446141 424595 397044 356002 334259 328484 310218 292880
18070 292880 284090 276686 272161 270287 271501 277946 282627 279915 267976 246795 238151 232716 231316 235967
18056 235967 247888 257711 282491 314911 352462 372129 396352 394875 371274 342219 351408 389724
18044 389724 435561 491288 513672 502866 489922 485804 518723 578119 631756 694733 786682 905831
18032 905831 1073736 1295091 1517026 1692729 1848907 1997039 2179502 2436972 2849019 3561061
18022 3561061 4811244 6907983 10439593 16039617 22895759 27739538 28581358 25804689
18014 25804689 21241274 18472247 19461723 24051991 29871874 32815234 31420834 26255620
18006 26255620 19703653 14872655 12187714 10808939 10213801 10269040 10975269 12584878 15730579
17997 15730579 21456971 30685487 41684034 48924570 49456495 43962386 35772782 30684042
17989 30684042 31440467 37430898 44830766 47997289 45119091 37062932 27385514 20146285
17981 20146285 15756403 13025899 11230104 9993910 9099720 8421310 7871009 7348765 6760940
17972 6760940 6130992 5542745 5000698 4504104 4075492 3715179 3431733 3222125 3037746
17963 3037746 2868032 2698902 2528179 2362039 2221183 2122775 2036813 1939456 1834248 1733115
17953 1733115 1647565 1554376 1465933 1386153 1326808 1295661 1294664 1320792 1376942 1414243 1417571 1390790
17941 1390790 1347845 1323451 1336777 1379360 1470405 1637305 1863698 2139012 2494964 2983834
17931 2983834 3729943 4951261 7024731 10664104 17078900 27476066 39809278 46723280
17923 46723280 45904050 38103453 26776931 18181330 13266785 10495197 8839770 7806842
17915 7806842 7178524 6850212 6731180 6704660 6598457 6406094 6302727 6417799 6906794 7982875
17905 7982875 10108640 14018477 20396047 27769407 31648271 30987256 26329353 20225408
17897 20225408 16627015 16383753 19473675 26384077 36045071 42845414 43136808 37675353
17889 37675353 28124275 19880817 14814909 11850054 10032621 8841028 8045157 7498793
17881 7498793 7123801 6842792 6557947 6225392 5972244 5942618 6260904 7074288 8722026
17872 8722026 11825187 17160818 24074984 28516248 28300765 24056788 17213894 11699512
17864 11699512 8527237 6773049 5730830 5077260 4654482 4329787 4075604 3855603 3572090
17855 3572090 3244637 2929886 2693713 2515291 2377906 2246196 2093070 1906947 1715900
17846 1715900 1541643 1374676 1242531 1144295 1065469 1010217 979741 952268 924028 911584 883742
17835 883742 825771 757187 691596 632091 583964 550512 543898 520371 492870 466127 441090 409872
17823 409872 384662 368392 349142 358170 364350 378432 373688 373592 387199 396507 366322 332259 308767
17810 308767 297861 301017 304938 313195 312894 314938 332836 381775 450849 500873 515197 504223 454994
17797 454994 403144 400560 429811 468773 502659 516523 504065 458100 404209 343802 304299 278854
17785 278854 273334 263912 270615 300989 307239 292607 287252 280414 257650 253122 246830 234311 242176
17772 242176 251095 279048 315039 359420 372874 365629 327878 279484 267960 264047 289311 306347
17760 306347 316779 299467 286559 258915 236752 224232 190690 171819 163374 156530 159978 170702
17748 170702 190734 213745 216227 212540 216480 198059 160992 141775 130050 134527 124081 118608
17736 118608 135816 144865 140077 145895 148010 145922 136483 133914 138307 128064 115091 120249 116657
17723 116657 106339 95445 72855 46451 41522 37334 49046 84668 115011 128040 150198 171960
17711 171960 186214 184065 175725 155490 148083 156977 162032 148074 140581 152431 159491 177457 204405
17698 204405 236237 250203 242264 221019 201521 201564 212871 231659 252215 252810 239289 215526 172473
17685 172473 148247 120827 100071 100817 112205 117218 131061 125067 121558 127501 133141 132655 147153
17672 147153 167542 176897 182127 162031 154626 162397 161649 165770 165462 163836 163347 159122 152017 132713
17658 132713 133770 136948 136068 134761 146876 137693 118286 123086 126748 116550 113749 105546 89977
17645 89977 90847 99335 106384 103429 114858 119063 111077 115490 127303 130025 132234 148800 146420 145215
17631 145215 144054 131721 136055 138558 134169 124549 118599 120703 115914 129705 137377 133576 126167 129530
17617 129530 139006 139795 133652 126397 118335 119550 118086 121898 140168 152981 138895 138748 147289 151856
17603 151856 170574 203514 248675 296493 330327 352992 377358 403449 411505 407787 398437 414088
17591 414088 473824 576415 739916 951872 1182415 1377423 1470231 1472555 1403414 1354464 1399491
17580 1399491 1514924 1658463 1845870 2057623 2353352 2794187 3410589 4135598 4958728
17571 4958728 5953866 7291709 9377154 12864485 18874085 29325524 47169433 74355720
17563 74355720 105781697 127790232 130326375 113489298 85324748 58810193 40961366
17556 40961366 30506143 24368242 20612452 18248002 16773744 15903580 15292789 14470093
17548 14470093 13245041 11812381 10411452 9186669 8185253 7319080 6546440 5852524
17540 5852524 5261570 4792586 4435383 4190768 4003009 3801699 3560719 3250426 2921115
17531 2921115 2601909 2340677 2105433 1899795 1734936 1600797 1490363 1395813 1304028 1219837
17521 1219837 1151208 1100175 1038077 965586 885700 819174 755827 696562 652441 605190 566874
17510 566874 530994 497223 464033 437405 428226 415245 399373 373445 349897 330346 315947 311123
17498 311123 310366 296570 276614 265891 254030 236471 229367 234200 231202 240045 273694 311165 351032
17485 351032 406208 515300 685330 901464 1104172 1214241 1190891 1040740 838480 689836
17475 689836 614411 555292 514233 457908 397584 353308 326083 306970 300658 284775 277353 275854
17463 275854 275915 262863 278608 298303 329915 343636 326002 318622 314620 318618 334024 346178 345240
17450 345240 338476 310286 271294 262550 262218 263208 273660 293178 321258 328298 315870 315460 307030
17437 307030 283886 255515 221874 184833 155184 141217 129822 118904 107584 118062 125554 128261
17425 128261 121331 112339 118173 129653 118139 115791 117804 111793 100307 102670 99331 88185 84005
17412 84005 90946 94664 93582 120301 138099 150229 164828 166761 159756 148725 143553 140174 133514
17399 133514 137991 136952 134001 125458 113270 105468 114111 127855 138626 165685 193587 229400 279328
17386 279328 299706 299124 276972 223280 173899 145705 122944 98088 92847 102042 103205 93393 94685
17373 94685 97751 108425 107010 101923 99729 107891 130620 167590 214975 250437 266262 251945 215366
17360 215366 187871 167347 156016 156713 171012 211595 265006 278983 262702 231095 193139 145090
17348 145090 117851 100883 101395 91152 80916 77311 81802 81004 82777 73395 62422 68145 81801
17335 81801 96587 119071 153745 181624 211168 218768 199159 171196 140637 121717 96062 84636
17323 84636 85069 73889 73091 71789 63215 49022 62526 56537 44199 40622 55070 53113 59274 52713
17309 52713 45659 44725 41378 56188 66749 53129 38053 22235 9874 6958 20326 32171 33112
17296 33112 36276 30653 25303 21977 22942 27307 30467 31812 34912 41968 51812 46167 36461 37485 50422
17281 50422 52547 61504 61534 50433 52855 43296 37879 42630 49956 56690 55851 48906 41569 43237 43687
17266 43687 44568 52447 50709 55255 48529 41035 29013 35113 34826 32281 36490 35272 21543 16480
17252 16480 22881 32628 24598 9951 5674 7842 8331 14802 5252 7693 12292 932 -10515 -10631
17238 -10631 -11952 -8788 -868 9128 15446 20969 15313 22348 26077 25604 23728 19091 16118 15601 20928
17223 20928 28810 44517 39324 36710 35269 23791 15276 21457 20448 15847 18897 23178 26267 22508
17209 22508 11495 10000 3464 -483 21997 34242 28202 14986 5127 1598 6827 17683 13060
17196 13060 8289 23406 28991 8313 4464 18117 16072 7452 15687 18660 14247 17819 21415 19493
17182 19493 6337 -2788 21555 35607 60298 73116 81694 81907 66361 33705 21496 34150
17170 34150 21511 15947 18135 16658 5428 11949 16316 19136 11282 26721 25365 24726 22037 13776
17156 13776 19254 30019 25453 14211 5311 5298 4425 26987 37803 34662 38654 24250 18379 26647
17142 26647 40746 36328 27863 21632 18422 6227 -310 16237 23596 29722 31097 34430 40701 41553
17128 41553 24548 12856 6464 14851 26683 41823 56283 48812 45829 53780 41690 30779 27090
17115 27090 30601 37635 30064 20160 6876 15438 21752 19339 16376 18778 21362 27389 32714 26403
17101 26403 23994 32817 32387 33597 37920 25134 8159 11245 13810 25219 26350 18764 4524 -651
17087 -651 3556 3829 15301 30266 31960 28335 31629 26835 17719 35899 47358 31440 13180 2304
17073 2304 11198 24892 24523 22388 22274 15468 18448 7874 -9665 -4766 10053 5275 17512 22053
17059 22053 29980 30427 44171 64304 65571 60894 56465 52751 63795 59632 44193 36485 32902 27467
17045 27467 15280 -723 8673 5512 756 7829 3855 8951 8901 9826 14112 4746 8464 20576
17031 20576 32107 38013 30813 22969 27290 22972 15464 14973 14245 16129 17840 19187 24787 29801 34534
17016 34534 35134 26476 19975 30984 34243 35007 25720 27623 33570 34417 26740 23456 30319 30436 29752
17001 29752 27824 20632 32812 45330 48007 45878 52631 62675 78213 113994 173851 279744
16989 279744 407089 554370 667462 700973 614321 484287 359689 254488 180373 144565
16979 144565 127406 116816 103197 100959 97414 95982 89356 86013 66464 53655 41319 51596
16967 51596 48787 48081 43265 35671 25979 22899 30042 33767 32355 23915 29735 30059 26571 20944 20944 28577
16951 28577 19113 16005 20361 5864 1818 13934 22240 19017 18326 28293 34683 24955 21805 22038
16937 22038 30986 17545 16799 24457 26782 27944 38123 36083 40299 40798 25580 24790 20325 14455
16923 14455 9012 16977 23085 29147 31402 30402 26923 14178 17011 7589 10542 10992 10114 10133 11779
16908 11779 23908 28065 43735 58798 54970 46730 21397 8725 11943 8275 7222 11156 14402
16895 14402 3470 -2283 -6361 71 2681 15064 29205 38535 46950 34525 19132 14526 14990
16882 14990 12916 6517 -658 7325 24658 26337 31745 15777 1156 -10885 -11118 -4381 -1173 10386
16868 10386 8631 15343 11911 2781 1233 -97 2860 12734 15202 6688 11874 4204 9217 21710
16854 21710 24577 23577 33149 27784 25389 25031 16312 12223 10949 14480 19925 11163 4422 -61 -1202
16839 -1202 1493 13890 18176 14942 6253 6082 11319 21758 14637 5759 7540 3004 7665 11206
16825 11206 7090 2177 -1141 10771 27281 22137 8334 193 5636 12893 17949 23377 14051 -4836
16811 -4836 -11775 -5293 6365 8452 1964 -6510 -7811 -3916 3490 130 -11365 -7654 9568 14707
16797 14707 6916 -2748 -10234 -7073 -3107 -1933 -7116 4787 16024 15294 7154 -1567 -2659 3787
16783 3787 10444 9228 10763 -1708 -25999 -25884 -8404 -7717 -5558 -2354 -4215 -3702 -46 8378 12848
16768 12848 14514 20766 35518 33399 29271 4411 -2349 295 -6655 910 -5467 -9429 -1277 -313
16754 -313 2650 10198 -2166 2429 179 -4694 -6417 -4760 -1083 -4650 -8752 -2582 -1260 -7501 -11878
16739 -11878 -17523 -13791 -18239 -23720 -7812 36 3700 2765 -2497 725 -4613 -16671 -7436 -3330
16725 -3330 -869 4715 6595 -5 -1597 6594 13914 7366 -6576 -13227 -1813 7198 16005 8623
16711 8623 4320 1511 839 1916 11172 16546 12693 170 8325 7745 15758 21609 19125 9851 9839
16696 9839 12542 2969 -9703 2019 8299 11132 18661 26926 20786 15981 9795 15945 18546 8975
16682 8975 13121 17914 9744 -4032 -594 1295 865 -3789 -3434 86 -7238 -9571 -7364 7163 23227
16667 23227 12693 14514 20929 9654 -16051 136 8607 5627 -3032 -2250 1478 -3203 1789 -2204
16653 -2204 -4999 6469 12150 15449 8242 -17548 -23876 -16802 -11295 -14543 -12062 -20370 -26768 -33109
16639 -33109 -25145 -19775 -10095 -14003 -11709 -10983 -4969 -4882 -13680 -7536 -13208 -6107 -3090 -3305 1333
16624 1333 7116 3789 11431 1885 -3174 -9178 -9849 -4333 -13067 -10075 2656 6688 14559 2166
16610 2166 -11224 -10468 -10317 -11425 -18217 -7744 -2535 5703 5765 -1620 7564 6512 -2324 -751 -15523
16595 -15523 -17138 -16449 -18034 -16309 -10882 -8687 -5619 -3471 569 -3628 -10657 -15218 -1594 7712
16581 7712 1491 -1405 6779 11060 15801 20947 18926 12235 15423 1056 -10053 -10714 -10440 -2530 6224
16566 6224 5185 -9480 -14918 -7875 -6154 -2826 10172 10894 26426 40596 26758 25026 22572 17980
16552 17980 12513 3198 -7338 -7654 -6988 -8905 -16135 -6014 -5886 771 13290 -3177 -21710 -24533
16538 -24533 -10975 -16857 -19459 -22646 -13661 -12475 -18465 -22462 -11888 14050 25366 21429 7424
16525 7424 7948 10195 -1342 -3313 -8008 1074 960 -3931 8108 9344 -960 5570 1202 -8760
16511 -8760 -15798 -11257 -1975 -1065 -719 4448 155 7216 16167 20578 19833 17349 11645 987 -6157
16496 -6157 -1227 3414 11431 16504 14768 13707 15797 9570 -1888 9079 17041 13974 17593 22458
16482 22458 11048 -11249 -11792 -20961 -20848 -8324 12326 23169 20996 16243 7632 12937 5260 12531
16468 12531 22283 15598 11033 -2096 6633 9287 2491 3350 -7217 -10281 -519 10256 29771 34568
16454 34568 22388 18892 16318 13485 14265 9244 -4284 -4781 5870 6829 -7707 -22138 -13490 -10576
16440 -10576 -9749 -14781 -12661 -4210 10262 25841 20044 13656 4057 1217 5229 17399 19286 13407
16426 13407 -14035 -6510 14861 11478 11708 18093 23228 16332 13462 8039 11213 4864 -2547 -4545
16412 -4545 -11877 -21205 -21323 -20031 -25309 -17446 -16700 -7465 3447 -1718 -2136 -13971 -23821 -19817 -3976
16397 -3976 15032 24660 25784 18685 5565 -2204 -1196 -3770 -6004 -11902 -6858 -747 -7971 -11763
16383 -11763 -10384 -6554 -9345 -13172 -7261 -6950 -3300 -2823 -796 -1053 -6411 2368 2709 -4646 -7960
16368 -7960 -8819 -1770 5937 10347 9906 11061 13016 14890 22949 6164 -8464 -8083 -12019 -5752 -9870
16353 -9870 -1795 4995 2605 12069 22185 24169 15643 11079 10173 16470 23724 28999 34942 33342 27738
16338 27738 19711 14021 14406 14173 17396 9461 -7071 -19698 -16132 -11188 -6253 2912 -3243 -4686
16324 -4686 1369 827 7970 15843 17881 18537 29314 53963 33133 6462 -20982 -26863 -18524 -2051
16310 -2051 16444 19790 9300 17084 6470 2598 -5948 -6427 -3849 -8645 -15989 -19835 -15784 1651
16296 1651 16066 12766 19341 25118 13584 -1007 -5389 -2399 7436 10056 -2068 -5100 4054 2061
16282 2061 5056 10397 4941 -5489 -14262 -14541 -20929 -26429 -2121 4013 -155 -10887 -20091 -5284
16268 -5284 13136 19715 2921 11700 11231 8575 354 1485 2528 8600 6264 8393 13283 3424
16254 3424 -2213 -5311 -6947 -424 787 -1861 5482 17646 15175 -1727 692 7798 -1109 3286
16240 3286 7527 14317 25821 32005 29471 25028 22860 19835 7088 -943 -56 6372 6973 4274 -11028
16225 -11028 -17922 -17492 -9913 -7042 -10882 -14790 -19527 -23210 -22677 -21206 -15952 -13045 -11888 -12243 4182
16210 4182 8081 7642 3525 -2808 -3982 2970 23517 28609 31935 16267 -2183 -2716 13333 -340
16196 -340 -5495 13683 24177 31365 25212 11615 -328 -2227 4314 7018 15233 14236 2987 -12665
16182 -12665 -15325 -5483 15197 9593 8165 16124 15500 24483 28094 32160 20154 616 -8264 -1117
16168 -1117 8324 19810 3312 -1411 -1853 -6304 -18258 -10552 -2298 -6687 -19776 -30208 -38911 -34750
16154 -34750 -33152 -17435 -3051 2168 -5833 -23230 -25988 -16554 -9738 -4186 6972 12199 3509
16141 3509 408 -71 8215 12533 21474 27558 25599 12144 6326 3164 963 9629 15032 5606 1282
16126 1282 -394 -9400 -17704 -25091 -22571 9753 14440 6860 9464 8844 11442 16201 29089 33622
16112 33622 22608 21570 9873 -2613 5221 6816 3912 -12078 -18929 -23642 -16989 -2165 2568
16099 2568 876 -6664 -16564 -37442 -28291 -20370 -15114 7866 -127 -15978 -19806 -16718 -19045 -10617
16085 -10617 6765 6971 -7832 -9414 -9724 -13513 -6810 -13350 -8511 3183 13937 -5838 -18373
16072 -18373 -16185 1839 4724 -5228 -18111 -18425 -19926 -14825 -11040 1920 11697 25983 36125
16059 36125 21788 10971 15428 5669 5041 16564 22635 25458 1305 -13192 -11961 -21621 -15116
16046 -15116 -1742 8414 -12050 -27543 -16155 -16806 -32194 -37875 -26692 -16450 -7273 15964
16034 15964 35618 32151 24957 20448 13142 2200 -7296 -22514 -15577 -1623 5963 -7205 -15925
16021 -15925 10893 15811 10115 9413 2745 -15144 -11737 -14201 -35320 -27358 -15332 -1336 12300
16008 12300 12957 14673 8552 -2626 -7831 -11468 -9779 -8988 -5100 3050 23470 33244 28416 22020
15994 22020 25880 17914 2319 -14225 -11849 -7838 -1001 2217 -9715 -13384 -7328 -8114 438 13106
15980 13106 5190 -8084 -25950 -18938 -4769 9688 24659 17605 13435 8480 10054 15728 14849
15967 14849 4203 -3679 -10650 -19497 -12950 -9852 -11185 -3138 10390 -80 -2368 -2350 8343 6671
15953 6671 3098 -5373 -20243 -21675 -1841 4846 3518 5725 11232 4099 -7144 -20084 -20914 -3290
15939 -3290 -13571 -35280 -32153 -25014 -7846 9325 11295 -4939 -19051 -20254 -26727 -14176 -9465
15926 -9465 -18826 -25455 -17455 -793 -121 -11287 -1375 3296 4553 25 -6926 3067 7000 -1333
15912 -1333 6862 16651 18630 6467 6767 24327 22151 7317 1523 -6757 -19734 -14623 535 687
15898 687 -1311 3929 -11507 -18814 -5194 4540 3559 -2910 -2915 -5471 -10894 -8285 -8427 -11420 1724
15883 1724 1987 -1602 9273 553 -7230 -2143 3986 10189 21281 22717 14292 1147 11482 23055
15869 23055 15012 12679 23538 15612 -2696 -14021 -8849 -6972 -238 1107 5408 4591 7177 3121
15855 3121 4016 -2968 -16650 -14235 -16195 -11501 -5461 -6271 -6193 -16227 -11012 -15141 -26233 -24074 -10905
15840 -10905 -7513 948 -3284 -24400 -21975 -19631 -29785 -47255 -46202 -32541 -21720 -18273 -31583
15827 -31583 -32597 -26250 -25564 -33194 -30175 -15088 7012 25409 26601 14133 25914 25779 7977
15814 7977 6883 4274 -8931 -19476 -15062 -15015 -20541 -27558 -16785 -9562 -9267 -14781 -20401 -10060
15800 -10060 4726 5982 9625 15467 9702 5945 8601 2442 -664 6620 2187 -219 -14469 -14440
15786 -14440 -4808 11928 14958 5229 -1892 -1318 6430 9179 -1273 -17163 -23825 -21837 -19121 -11759
15772 -11759 -7511 -8424 -3226 -6378 -19568 -10992 -894 -8658 -6203 5507 10325 7106 3543 4080
15758 4080 8840 15764 5956 4482 -8907 -12595 -11567 -15911 -15138 -8781 -3204 -1338 8595 13400 2385
15743 2385 -13764 -16071 -18282 -19262 -2456 5896 6088 -689 -14790 -14438 -2119 10666 8040 1218
15729 1218 -8171 -17304 -16584 -17563 -35377 -25228 -4236 -7331 -12246 -22545 -19770 -26439 -31700 -22408
15715 -22408 -22675 -24887 -24825 -14438 -10767 -19677 -37770 -45190 -42226 -45122 -39350 -22377 -21544 -15002 -12520
15700 -12520 -23655 -22871 -9743 -7586 91 -8758 -18649 -6758 -3814 -7154 -18715 -27608 -14114
15687 -14114 -14911 -29341 -29874 -34508 -28787 -29494 -25753 -23890 -16918 -15679 -18600 -2487 5873 5480 3311
15672 3311 18185 25203 15700 776 -5402 -5748 -8877 -15055 -4938 -4521 -3096 2608 4278 93
15658 93 9089 14777 3485 -11944 -15635 -16115 -19637 -27372 -22023 -4753 14214 18161 19626 12684
15644 12684 6003 6063 2238 -3873 -1322 6095 8505 3095 -11104 -19283 -14166 -13282 -18735 -16024 -26082
15629 -26082 -22812 -13065 11534 18934 4853 -15556 -22232 -9583 -6429 -25506 -41289 -40061 -27954
15616 -27954 -11359 -19382 -26803 -22004 -16709 -8205 785 -8008 -18450 -4478 10179 14676 3848
15603 3848 -3866 2261 14212 11175 7563 -3215 5780 3199 -5991 -7844 -1985 -3407 81 -1995
15589 -1995 -14188 -20572 -20279 -19128 -7252 4889 6137 6604 2741 -6760 -1984 8025 16396 14473
15575 14473 -1486 -5015 -7253 -14303 -11297 -6632 815 -2114 1188 24098 17235 -3004 3370 2239
15561 2239 4139 11546 21419 6856 2522 6704 7916 11544 17182 -3107 -4105 877 -7402 -3249
15547 -3249 -12795 -19766 -9925 13735 18896 4541 742 16106 23999 10651 947 -8998 -10028 -13125
15533 -13125 -15837 -18641 -20428 -14356 -8012 -3619 -5579 -4424 -3267 -12167 -14050 -11700 -4587 4547
15519 4547 13 -3610 11064 12749 12606 16451 13378 18772 27182 41926 38764 28859 18506 14676
15505 14676 9424 2512 -2091 -12000 -12702 -12505 -9639 -5820 7483 15745 6434 -10214 -13630 -12677 -11981
15490 -11981 -1402 -439 -5064 -21145 -7991 7012 -243 520 1611 4576 5004 1347 3990 6861
15476 6861 13221 19141 28367 29112 16884 6430 2822 -1859 6523 19735 17892 5571 6357 10351
15462 10351 2144 -9558 -9342 -6531 -5375 -21988 -28768 -19973 -9535 -12718 -17631 -18389 -10220 -8902
15448 -8902 -18999 -21407 -32234 -37552 -21569 -12532 -18242 -17188 -16082 -10576 -7550 -14353 -12675 1974
15434 1974 10824 17509 7676 -623 -3899 -1545 -8875 -3241 -2856 -20249 -34753 -24229 -632 -1324
15420 -1324 -10495 -11853 -14771 -12651 -7547 -19898 -34056 -29563 -3077 5228 2285 -665 3077 3342
15406 3342 -6511 -9699 -11317 -13945 538 -1838 -14103 -24035 -20385 -8352 -18297 -36715 -32221 -17422
15392 -17422 5232 10909 6482 -683 -10920 -13801 -19838 -20766 -19775 -15734 -16091 -7661 -7452 -7176 -11074
15377 -11074 -5219 -10873 -8499 11882 19688 14939 6060 -9302 -14436 -9873 -7800 -5070 -11649 1123
15363 1123 12282 12285 5438 -1536 2913 -9410 -7849 -3313 7567 22471 26491 12194 9851 15554
15349 15554 18999 2025 -11364 1581 17789 17496 -7552 -6985 -284 6602 5925 -2788 -12111 -19899
15335 -19899 -32083 -45821 -30327 -17011 -17960 -19649 -5339 1144 993 4189 18802 23297 16224
15322 16224 9069 -6664 -7810 -10788 -10067 -21993 -23368 -12486 13366 7435 -1025 -5384 -3672 -9304
15308 -9304 -4441 -1363 -9478 -5267 -9441 -6119 6319 11459 9704 11072 7629 -2467 -16261 -23845
15294 -23845 -36288 -27532 -23081 -18818 -12859 -14731 -16007 -698 -2042 890 -1969 -13412 -13341 -13578
15280 -13578 -6737 -9271 -18943 -23409 -16578 -14406 -21644 -22345 -29725 -30010 -26638 -30576 -29164 -19609 -4204
15265 -4204 7099 3128 -6593 -4973 -2575 -4624 -5910 4654 905 -11871 -11875 -6289 -985 295 -6760
15250 -6760 -13034 -29323 -29941 -28842 -23679 -17523 -11740 -7056 -4681 1784 6888 -11572 -17760 -17701 1820
15235 1820 8494 -4256 -13595 -20527 -24902 -29792 -26294 -28859 -22951 -18329 -5641 -17093 -27401 -26200
15221 -26200 -12597 -9873 -13767 -22260 -17994 -5092 -9336 -2285 -14364 -21725 -15022 -16972 -21130 -17023
15207 -17023 -19525 -14825 4773 -5159 -8437 -14510 -19063 -12880 -9800 8358 14981 8223 6088 1300
15193 1300 -5111 -16966 -13850 299 -7198 -14256 -17683 -28088 -23438 -36008 -29356 -18696 -16436
15180 -16436 -18548 -17079 -2030 -8204 -9985 -11504 -5494 -8884 -16854 -20412 -8403 279 -7543 -18831
15166 -18831 -12099 6183 2411 -2067 -11001 -22467 -15879 -6276 -13175 -12272 -17457 -22937 -15550 -18826
15152 -18826 -19106 -15714 -12880 -7316 -5506 -19000 -33254 -34510 -24646 -16659 -4243 -164 6425 -1864
15138 -1864 -16067 -19661 -14354 1583 14035 -3087 -22721 -13461 -20642 -18058 -13180 -10862 -24748
15125 -24748 -29345 -30498 -22453 -28053 -39163 -26790 -15837 -4384 -8337 -5389 -6313 -11365 -19260 -9861
15111 -9861 -6927 -14977 -18116 -17652 -17312 -14536 -20445 -21783 -19063 -20252 -4424 -3271 -7909 -8813 -14892
15096 -14892 -22721 -35992 -34459 -34147 -39281 -34104 -19784 -12812 -9074 -15850 -18563 -7188 -5290 -9272
15082 -9272 -6174 -15595 -25747 -20153 -16382 -22780 -20114 -12749 -17219 -17081 -10939 -5788 -4072 -2544 -4609
15067 -4609 -5775 -9492 -17128 -18315 -16994 -15771 -14284 -21937 -23383 -21600 -13218 -16056 -19665 -11786 -7044
15052 -7044 -4896 6206 12168 15807 17108 4473 -3789 -5900 -66 -13102 -10369 1905 10837 15503
15038 15503 4501 -13230 -6983 -13723 -15855 -13373 -22587 -14374 -23847 -31980 -33943 -27478 -21952 -32192
15024 -32192 -21473 -926 -6966 -22527 -19514 -17221 -9988 -4565 3758 -5192 -18995 -21223 -14163
15011 -14163 -9444 -23344 -24772 -12694 -13450 -16537 -19967 -22507 -15291 -18739 -31055 -24730 -15393 -2798
14997 -2798 4758 10657 1879 -16342 -23217 -21822 -27587 -29733 -24765 -23104 -24818 -15259 -3193 -1730
14983 -1730 -19648 -36292 -39672 -28760 -20508 -24802 -31830 -21263 -24268 -24597 -32699 -19152 -3609
14970 -3609 -603 3885 660 -16678 -8323 -2267 -9602 -22339 -24803 -20011 -17859 -15921 -19842 -20471
14956 -20471 -15344 -11506 -5911 -5201 -19894 -18835 -16914 -3781 -2062 -8232 -1824 -12931 -2779 -1426
14942 -1426 7145 822 -12251 -9007 -1425 1762 -2974 -8094 -12529 -15793 -22106 -28816 -8728 -4824
14928 -4824 -14643 -19458 -26537 -24115 -15868 -2163 -10718 -11222 12861 15475 16743 21046 17252 12556
14914 12556 17867 24004 18717 -1526 -6823 -19763 -22113 -20496 -13811 -3678 9021 4276 -3972
14901 -3972 -7955 -9621 -15685 -15828 -17531 -11000 -10145 -6947 -21205 -21202 -8975 -7768 -4042 5000 9208
14886 9208 -6488 -25955 -27730 -20170 -26313 -42035 -32813 -20384 -14850 -9840 -5889 5075 -12084
14873 -12084 -21475 -13718 -12497 -11073 -19854 -21528 -14193 -19097 -13684 -6594 -899 6926 -8745 -25735
14859 -25735 -26602 -19116 -18215 -16995 -13930 -11488 -12717 -14771 -9660 -6910 -6175 -5009 -6335 -13622 -5587
14844 -5587 -10330 -4278 6458 5699 -5672 -9859 -27013 -15761 -21564 -18206 -11524 -4155 -8215 -9518
14830 -9518 -16568 -8472 -5388 -4957 -1242 -537 12012 14898 -4076 -22446 -20773 -5594 1688 -8963
14816 -8963 -11301 -18682 -17417 -12314 -17075 -15917 -6938 -1204 1466 4727 -4979 -20193 -21507 -28473
14802 -28473 -10990 -1203 -11132 -24083 -18162 -21283 -23243 -22972 -8301 -2906 6276 16818 13972 7237
14788 7237 428 -3322 -15517 -18549 -13154 -11700 -15179 4136 17762 14133 14392 -700 -18798 -16218
14774 -16218 -5620 5866 3171 -22713 -28077 -28214 -20132 -15188 -16712 -15198 -21805 -32195 -31989 -34638
14760 -34638 -34695 -30806 -30015 -32386 -26504 -14667 -9694 -5015 3103 -2090 -3785 -6133 -3990 -8635 -13030
14745 -13030 -29183 -37660 -29997 -22918 -14052 -17795 -14495 -17339 -27397 -25947 -22233 -14698 -6671 -6449
14731 -6449 3371 7963 2814 -12311 -8451 -16601 -20352 -8844 -10303 -2724 4076 9771 18899 17646
14717 17646 3731 -4524 -5867 -4308 -13396 -16100 -9026 2670 7735 7571 -998 5455 16005 13215
14703 13215 11340 1235 3401 -3100 -13988 -16892 -11877 -16416 -16772 -22825 -22198 -18404 -13680 -5451
14689 -5451 -9885 -2593 3182 -1615 -4854 7028 12599 14333 -7998 -22046 -32137 -31221 -26227 -21023
14675 -21023 -12485 -17400 -20236 -17871 -26352 -31408 -23149 -7597 -16094 -24600 -12465 -10821 -15549 -8500
14661 -8500 -1076 -8566 -13349 -8174 -1212 -5837 1483 2400 -14920 -5952 -8763 -3525 -13947 -23907
14647 -23907 -30889 -30456 -10657 -11110 -21004 -15384 -16007 -18770 -9179 -1282 -2137 13635 9379 10990 1999
14632 1999 7041 8470 -513 -16329 -9183 -9563 -26769 -28153 -19040 -16655 -20633 -20917 -25062 -15494 1513
14617 1513 -6644 -18269 -17866 -7405 -7422 -14935 -27187 -27113 -15697 -15673 -13782 -25079 -19378 -5550 -16804
14602 -16804 -21665 -19137 -8706 -4591 -1997 15019 18994 14374 6640 2464 6995 8877 6965 2187
14588 2187 6187 -998 -11578 -14557 -21777 -34615 -17502 -17599 -21468 -22573 -8317 7083 12708 2026
14574 2026 -5598 -10586 -23578 -31201 -25263 -10243 -6428 -9318 -20179 -17164 -6405 -5769 656 3632
14560 3632 -14973 -12421 -9170 -3217 -7992 -17556 -21116 -12144 -5616 -9185 -15846 -15608 -21663 -16796 -14356
14545 -14356 -13861 -7628 -2002 -2767 -5437 -891 -2874 9968 14593 13837 7396 -3359 -10516 -8255 3450
14530 3450 6444 -10525 -21412 -25403 -23692 -10355 -10772 -19834 -24033 -15853 -10035 -14014 -24715 -32730
14516 -32730 -32006 -13182 3541 1217 -23406 -30215 -27650 -33652 -30707 -33105 -24038 -25316 -38675 -42117
14502 -42117 -28286 -13958 -18425 -26056 -23065 -11077 -2944 -5528 -11100 -15503 -12654 -7873 2077 -347
14488 -347 -16425 -20225 -19214 -9625 -1253 -3071 -10276 -15512 -11366 -13054 -13937 -14117 -18509 -25032 -11902
14473 -11902 7365 2746 -12194 -19924 -11781 -6832 -10393 -29648 -39451 -42786 -30844 -6427 -618
14460 -618 5727 5988 7298 4111 -18419 -28902 -28307 -23721 -9323 -3197 1992 12050 6972 -10393
14446 -10393 -17786 827 19322 8817 -11240 -13954 -11393 -22203 -25001 -17490 -12709 -6700 -8079
14433 -8079 -25169 -27022 -20139 -14937 -13274 -30270 -27495 -21784 -20644 -32384 -50117 -54126 -48608 -34694
14419 -34694 -18506 -17147 -14775 -21066 -27769 -9327 2388 -1976 -12609 -33500 -35878 -29112 -19166
14406 -19166 -9720 -5524 -2331 -14439 -8530 -8713 -17641 -20801 -22342 -23829 -19901 -15563 -7866 -13445
14392 -13445 -13778 -17035 -18518 -22266 -14754 -2574 -4025 -20409 -41139 -53146 -42850 -38892 -38648 -27339
14378 -27339 -18266 -26008 -28273 -27097 -31193 -36775 -28392 -9831 -8281 -9257 -5880 -10753 -15331 -22127
14364 -22127 -18305 -23097 -18397 -6456 -1626 -17548 -27417 -21671 -20118 -23075 -24832 -34540 -24697 -6042
14350 -6042 -8912 -10164 -21565 -32940 -21619 -7322 -6272 -246 -5386 -18951 -20143 -19294 -21722 -24695
14336 -24695 -18070 -18774 -15526 -295 8419 -7722 -16159 -13617 -15509 -4370 1711 -10900 -27586
14323 -27586 -34735 -24414 -17444 -18070 -7721 -12378 -26311 -20297 -30082 -25557 -18558 -9957 1702 228
14309 228 -13529 -16820 -28574 -37190 -34590 -16721 -7445 -10136 -6595 -14227 -6244 8374 2934 1823
14295 1823 -3602 -4386 -1318 -15126 -23196 -32853 -30016 -19424 -17067 -11470 -18746 -36074 -35322 -29163
14281 -29163 -22763 -20610 -9127 2210 8029 11043 7040 17757 12023 -3451 -9821 4091 818
14268 818 4257 8751 14863 8531 -10714 -9907 -5651 -2783 10885 6738 -12201 -29435 -31649 -32675
14254 -32675 -13754 -14243 -20318 -20619 -14049 -3678 -16561 -19256 -11091 -7068 -4815 -2743 2458 5516
14240 5516 9116 28823 40269 34820 20272 18519 9924 -10728 -8742 -5875 -17623 -17236 -14710 -22099
14226 -22099 -25360 -17749 465 11773 8902 5422 1151 -2193 -7570 -9221 -10816 -6739 -2330 5978
14212 5978 -7831 -26959 -21685 -19661 -27847 -30290 -29371 -25662 -23742 -17618 -13936 -24990 -27752 -24362
14198 -24362 -21152 -27700 -35898 -29228 -14144 5831 15051 4577 13057 17732 9639 4366 8076 9935
14184 9935 2003 -2850 -15338 -25390 -31369 -26122 -25107 -31336 -15591 -16483 -16897 -17868 -2213 18103
14170 18103 19460 14435 4045 -11702 -18980 -20669 -21678 -24087 -33625 -24717 -28170 -24035 -19498 -8843
14156 -8843 -12706 -17811 -28446 -23628 -27375 -29931 -28514 -32638 -30002 -20116 -18445 -11282 -12950 -7060
14142 -7060 1601 1467 -7111 -14058 -9202 3298 -6255 -14978 -8222 -2652 3133 -6078 -22398 -21824 -20650
14127 -20650 -18199 -604 -2443 -1149 18915 61702 104394 121033 126518 103163 81522 51216
14115 51216 32877 9631 5890 -9732 2728 7852 11807 9367 -11 -8930 -16255 -30723 -38357
14102 -38357 -24635 -16654 -20936 -20983 -14234 -10824 -7749 -8512 -10381 -5865 1110 6292 4397 5596 -1014
14087 -1014 -6105 4412 7350 7249 15416 34315 53100 82777 128461 194268 271867 365560 437085
14074 437085 458387 413723 324477 241024 174272 123916 103298 82624 70787 75119 62451 49442
14062 49442 42612 48807 49851 43182 33754 36125 30153 26594 5902 -4310 -14502 -12769 -1812
14049 -1812 -3925 7948 17709 25940 36615 46507 36895 25057 26360 20772 36965 46587 56702
14036 56702 80169 106995 136807 192422 275318 375029 448702 471273 427562 326256 239905
14025 239905 180980 155405 139246 126342 111671 84690 76884 65656 61124 45343 44724 37231
14013 37231 34308 39361 42845 29438 15864 41 -3517 -13271 -24364 -15035 -1663 21036 25912
14000 25912 15707 6975 -9927 -8544 1262 1161 -2061 -2071 660 13413 36463 63480 72933 74474
13986 74474 108907 120846 138652 142334 119337 81722 55510 43187 29492 27602 12764 9353
13974 9353 836 13031 14433 6425 -594 -7758 -8334 -12555 -8528 -3745 -6272 -2315 -5991 -7593 -4631
13959 -4631 -6090 -19822 -26362 -20974 -17130 -30524 -38179 -35137 -20791 -19032 -33276 -30694 -24111 -23190
13945 -23190 -16310 2334 1282 280 834 -2432 -8462 -7834 -8304 -12011 -6350 5582 1847 -2009 -1772
13930 -1772 6303 11201 5849 -5991 -3437 4860 12869 13464 14382 26342 27468 27181 22328 22373 3966
13915 3966 -3774 3438 9052 -3999 -10574 -11582 -2334 -13754 -18521 -31241 -19633 -18265 -21983 -21811
13901 -21811 -28944 -29670 -28480 -30335 -29094 -22070 -20340 -14957 -16397 -21166 -23797 -25971 -26195 -29764 -20628
13886 -20628 -19107 -18176 -16146 -4790 2025 14369 10731 21202 21055 13678 5779 353 5924 8749
13872 8749 2686 -12278 -27427 -31693 -26844 -21583 -20517 -17602 -1962 3152 -12725 -21866 -8084
13859 -8084 3331 14581 24326 26039 24219 19486 5737 -10429 -15933 -21059 -35270 -38942 -35460
13846 -35460 -29778 -25273 -9787 16399 36739 44096 50496 44840 37203 42737 34550 26784 13740
13833 13740 8948 11306 3346 -3261 -9723 -28592 -36934 -30183 2076 4426 -5671 -5863 1351 3659
13819 3659 9096 11543 9923 -2966 3007 184 -20385 -34947 -36039 -24470 -22010 -31390 -26727 -25978
13805 -25978 -20019 -33421 -50386 -54960 -49571 -48954 -42708 -30530 -14216 3638 1058 -12549 -5481
13792 -5481 -3315 -6432 -11485 -16305 -6119 -21807 -30204 -21602 -20991 -29229 -30877 -26573 -15953 -13722
13778 -13722 -21450 -27930 -30341 -33167 -22328 -8309 -10660 -22221 -44177 -58187 -47884 -58876 -60779
13765 -60779 -53313 -28435 -169 -5667 -17630 -17876 -18119 -7959 -4670 -4774 2085 -106 58 19398
13751 19398 18543 4494 1998 -2345 -8061 -5521 -11399 -4970 15118 24459 18306 25933 34109 27744
13737 27744 40701 38372 22391 19963 12783 16806 19121 5237 4737 10729 2709 -1598 -6513 -8078
13723 -8078 -5565 -20334 -26039 -3628 22375 39628 46253 48262 59164 73994 87027 87724 81004
13710 81004 79180 68591 61616 64936 63083 48459 59137 72390 77148 72968 74353 61706 64402
13697 64402 84682 88821 111673 140621 142789 135801 142111 147536 145334 147396 141896 135782 159515
13684 159515 174126 191079 222034 258096 282075 303828 325622 338311 369643 416023 470408
13673 470408 557123 648063 737616 865152 1033917 1260343 1532611 1840846 2231538 2756943
13663 2756943 3508975 4663326 6512376 9488732 14059971 20139353 26074774 29174871
13655 29174871 28291431 23989151 18287941 13501350 10289795 8271829 7007782 6180667
13647 6180667 5632624 5242587 4937435 4632030 4277698 3890647 3531630 3246166 3023477
13638 3023477 2824646 2656988 2519624 2404340 2319059 2261807 2226569 2209985 2225235 2303157
13628 2303157 2443819 2618200 2831171 3144656 3585931 4166491 4902816 5797265 6920302
13619 6920302 8411835 10525870 13747409 18914693 27339889 40703200 59604650 79924734
13611 79924734 92036074 90876316 77941254 58781437 42224952 31386843 24784009
13604 24784009 20688641 18083775 16355227 15176800 14263570 13386604 12350144 11144105
13596 11144105 9956482 8929122 8079260 7365811 6767884 6258010 5817719 5431599 5107379
13587 5107379 4831925 4582257 4405995 4318697 4318270 4382027 4519545 4742594 5063545 5540659
13577 5540659 6195175 7021598 8080537 9478320 11488260 14583251 19509373 27530230
13569 27530230 40313783 58791453 79693350 93564719 94013604 82104590 62694024
13562 62694024 44992303 33149730 25915732 21440027 18596956 16733599 15452541 14489932
13554 14489932 13592598 12561756 11348059 10121080 9015632 8072171 7287597 6605894 6034699
13545 6034699 5531883 5081636 4693196 4336748 4021987 3755278 3547077 3401139 3315670 3263284
13535 3263284 3245863 3277454 3359153 3497265 3691364 3973939 4379559 5004203 5994907 7582466
13525 7582466 10158809 14199727 19987065 26554403 31169261 31761845 28325853 22355220
13517 22355220 16548470 12378765 9705287 8010733 6912532 6170923 5658003 5273215
13509 5273215 4922931 4553876 4127335 3698769 3304644 2973638 2693425 2439980 2232243
13500 2232243 2040723 1872672 1727639 1580762 1463986 1352227 1243863 1164281 1109735 1060289
13490 1060289 1016942 990875 958322 909135 863706 816307 765195 725397 693246 661004 636722
13479 636722 617232 593974 583951 584549 586072 619654 622709 582986 532681 482876 445876 418349
13467 418349 379726 355632 355254 350352 335753 325671 315506 310437 300014 299079 307774 313521 337902
13454 337902 355691 347210 333560 340176 356834 369815 419028 491305 570121 709555 941003
13443 941003 1326354 1819162 2248884 2380675 2172957 1734958 1282236 953441 760530 677633
13433 677633 622136 569218 529845 523686 520704 495359 459060 418774 388636 360117 320775 295429
13421 295429 289941 268040 247279 222774 205359 203984 207087 215115 226341 243153 238994 243215 243309
13408 243309 225770 215538 213112 199052 201168 199257 184721 169967 171094 172652 156611 160197 160837
13395 160837 160873 147948 139237 140752 131933 134502 137751 134706 133167 139976 148925 157156 153341 148623
13381 148623 141943 132490 116728 119186 146631 166199 155334 142674 132108 136323 154817 162526
13369 162526 157681 150093 156115 163156 169832 156437 141359 129992 125216 130297 134846 137759 137561 124530
13355 124530 112685 111059 124978 117789 124678 139182 138407 110574 92516 104946 108960 110797 102431
13342 102431 89071 94877 106458 110524 109106 94445 93317 81062 70507 73421 80922 103630 116881
13329 116881 135053 142752 142896 130518 126095 135876 144715 148378 131552 124460 116808 128657 136461
13316 136461 153170 160272 158609 166154 158486 145333 157013 169913 177038 176887 180944 158159 116384
13303 116384 50015 -6482 -29442 -27688 -21699 -15331 7532 16335 28164 8859 479 2585 20144
13290 20144 48200 56156 65541 65884 66412 63917 55754 52298 51188 43671 46993 53355 78562 92230
13276 92230 92989 86049 78987 69601 63912 64111 71162 72442 69817 80215 96449 103202 108146 102115
13262 102115 86058 81212 82120 83730 99622 119348 143559 190816 216116 213143 227790 264745
13250 264745 284170 263642 208612 186330 194540 177019 168117 156170 157722 166405 177389 175051
13238 175051 161809 172787 189237 196554 209274 233721 286668 347013 366915 360409 317589 247871
13226 247871 204492 165066 155581 155583 151688 144222 133577 137751 130805 118818 123815 108429 91106
13213 91106 81547 60265 52983 52114 70968 79167 94548 84773 86034 89495 84389 87002 94705 101353
13199 101353 116488 122527 114203 114363 114179 103975 102083 90331 71474 40571 33475 65172 96998
13186 96998 136692 192940 247052 282333 331457 387327 484926 654461 848286 1005752 1080854
13175 1080854 1030921 863409 664519 491511 379635 316907 276547 242567 217205 199822
13165 199822 176471 152354 141938 141298 129008 108812 92996 86086 53006 -7784 -61042 -81298
13153 -81298 -72153 -27234 37785 110231 171784 205018 222185 237759 268624 305509 366071 447591
13141 447591 542665 678119 817768 923060 1010600 1147780 1453237 1970015 2665786 3313525
13131 3313525 3649603 3522541 3010534 2364519 1824471 1435801 1177779 1040964 945755 859583
13121 859583 794210 732516 669071 602864 543172 483101 439928 404859 378224 353540 334164
13110 334164 328670 325352 321033 332161 358311 390735 435174 467604 499984 532006 559000 574518
13098 574518 591871 649195 755915 877837 1009236 1095989 1168231 1295802 1575185 2072764
13088 2072764 2771898 3452603 3842787 3783267 3288303 2573456 1898482 1413323 1092315 905914
13078 905914 786630 710730 673571 657563 633547 606888 583343 577708 567640 556177 538154
13067 538154 509179 494522 463162 430067 419084 414000 398191 397502 383602 363778 363090 370494 379884
13054 379884 399029 420568 446230 475374 504712 520196 529244 555263 629985 752444 925170
13043 925170 1148762 1386915 1548847 1572197 1482185 1366798 1281851 1224342 1200037 1207510 1230767
13032 1230767 1247648 1231174 1191336 1160353 1179048 1292293 1482109 1715245 1923608 2095961
13022 2095961 2237530 2390827 2563388 2782615 3025713 3324343 3767517 4373517 5102051
13013 5102051 5905573 6825715 7992229 9588033 11788598 14822723 18977435 24589461
13005 24589461 32251872 43318539 60614875 89668250 139748878 219730354 318507705
12998 318507705 389603725 400256338 353349507 266804825 184744168 131331509 100683170
12991 100683170 82521975 70785367 62588413 56588187 52331430 49198866 45864912 41624114
12983 41624114 37071702 32854113 29173289 26017468 23319522 20956118 18834857 16942470
12975 16942470 15261567 13815687 12538217 11416487 10474830 9685227 9035111 8448765 7876319
12966 7876319 7309097 6745333 6204019 5719379 5300188 4925321 4590549 4311253 4090348
12957 4090348 3912731 3768533 3601108 3398673 3176026 2962728 2754655 2573208 2422573
12948 2422573 2318731 2254910 2233573 2278183 2471970 2876733 3424840 3867717 3945595 3621456
12938 3621456 3022147 2420669 2016197 1760260 1588017 1470835 1370390 1282318 1214246 1143543
12928 1143543 1062504 994813 953356 929224 911701 897723 880137 873845 869134 864816 845138 840720
12916 840720 830923 801444 779908 754486 732690 712269 704262 680116 653031 633625 609177 604182
12904 604182 585120 567335 559474 540484 515372 491634 452205 411430 376355 355840 356026 374796
12892 374796 389238 409171 429164 428286 420772 418440 424119 429392 422896 410487 406030 411033 426408
12879 426408 448982 472835 504409 552047 619544 685137 711166 668135 556411 455403 381623
12868 381623 338377 324009 316503 311779 310144 321856 329772 335611 330385 331780 339702 360497 371553
12855 371553 394257 435339 440621 427296 418752 399160 362941 356021 396020 427030 464467 520537
12843 520537 568532 585096 580476 559225 513412 494522 470506 466740 470565 468287 475870 507485
12831 507485 570090 644548 678648 663358 600327 528762 462994 424455 404837 389135 382140 371225
12819 371225 362526 357466 356735 342826 313800 286286 280065 276543 277862 286141 288639 304594 321611
12806 321611 316330 293215 258110 244744 230165 213621 210177 225454 237934 239549 219422 189386
12794 189386 172211 149624 150639 155503 158794 171650 186024 190577 180292 197974 213452 211959
12782 211959 208757 196031 198751 185306 173410 176171 169874 165675 162139 169247 175889 181138 179077
12769 179077 165757 152090 149366 134418 143488 158409 155831 153358 150609 136046 128903 140922 146009
12756 146009 150386 145914 145882 152699 155549 153867 150300 170648 191385 197891 194384 188901 193645 192430
12742 192430 185023 173739 164724 163335 149718 135418 131507 129032 129627 124288 121538 113013 129509
12729 129509 142911 150856 142467 144263 145968 150725 135928 122627 129193 138130 146609 156279 159506
12716 159506 155622 161305 171873 168541 163550 174905 169894 157918 139755 135351 134227 145177 156649
12703 156649 175700 190921 202760 205556 209162 218309 211922 208414 212291 204067 196466 158696 105624
12690 105624 77035 53315 34951 51380 81823 86202 68373 62316 69368 70254 62446 65604 73605
12677 73605 70205 66721 65218 68787 80716 69780 71228 76921 69242 65841 66636 80367 81951 87431
12663 87431 99811 117765 132782 124161 130122 130827 124708 118131 97956 104209 103618 92183 85343 87887
12649 87887 94955 92392 88345 81313 69705 54359 52623 65559 80139 86994 86965 80820 79409 72509
12635 72509 63724 69263 73987 57166 36906 45681 48208 61646 72860 85513 95422 86961 76414
12622 76414 65720 57477 64892 62466 63471 76009 86113 88731 81430 85562 82908 75174 59848
12609 59848 52947 58849 57556 53324 67265 71480 63338 76661 86781 93007 87477 73757 66738
12596 66738 66791 64803 68081 69528 71483 71387 66184 70086 77089 70233 69127 66662 70966 82265 84077
12581 84077 84050 98267 98659 102108 105436 104419 105324 102430 105641 109114 104656 79668 65998 74704 95052
12566 95052 118753 112520 117526 136636 146137 135523 151047 176179 197931 215062 237178 290773
12554 290773 356680 450598 630379 943814 1415516 1900365 2157908 2095831 1752481 1287914
12544 1287914 928038 700753 555997 480977 435527 379706 341113 322525 307739 279154 251032
12533 251032 228502 209080 201310 189670 180825 177830 170132 159699 143581 144166 142143 128454 112825
12520 112825 104253 102833 102596 101970 107194 109752 112260 108967 91942 86526 89581 83140 79090 72027
12506 72027 80640 82649 80578 86457 86753 71484 71953 74746 77900 81688 88241 71997 60952 47867
12492 47867 50980 66010 56851 55635 54754 48922 54338 55661 59643 71427 71954 62323 44611 43817
12478 43817 50452 49987 46356 43831 48994 39945 44645 56142 54118 41024 34875 36185 51237 46970
12464 46970 41918 36869 38155 48823 50746 56176 52288 51583 62674 70693 74196 69485 68967 66811
12450 66811 62006 67635 60863 47501 54151 49178 50190 43099 37176 55970 55750 38690 24846 25908
12436 25908 35317 41644 45113 52457 40544 41915 68422 82226 90009 89121 93074 88868 90668 90970
12422 90970 76861 80415 74616 66376 69363 67276 65691 62938 58402 62998 54689 44474 38244 52107
12408 52107 56728 58958 63615 57997 56595 60576 67842 64658 60656 66313 64773 56856 55535 53844
12394 53844 51325 50083 40213 41698 41915 40010 39393 48400 54432 44175 46916 39944 38921 23867
12380 23867 8686 23973 30695 25253 31720 37377 27392 22596 25088 26283 26035 31687 44319 55881
12366 55881 64721 54549 50292 50473 40769 27314 15375 20283 20640 20952 22129 23121 30701 36882 52592
12351 52592 68780 90691 102337 92977 68827 48187 43264 49872 58702 52283 54526 57152 54859
12338 54859 40917 32082 33083 39190 40245 44447 50121 51463 57611 54916 44916 43295 52145 52278
12324 52278 57199 63480 53955 41255 34269 37698 38492 39119 38955 50837 45451 48032 53507 43532 46371
12309 46371 55189 59794 63553 60718 66831 64319 55218 42047 30119 23462 24834 32025 43938 45165
12295 45165 33019 35124 44396 61160 56411 47257 55911 60672 55393 41421 30945 26898 22537
12282 22537 20927 34695 28698 25893 40291 29570 14190 22567 28426 32038 47419 51259 42451
12269 42451 40805 40564 46714 47826 48656 68085 75353 67740 62457 55461 50267 51883 55032 54225 48793
12254 48793 36004 24655 18215 24256 41408 55779 70267 79890 70898 68562 67565 63147 50718
12241 50718 37205 25017 27158 33611 41733 34507 29541 35308 43926 41575 42304 40448 55368 51140
12227 51140 33022 34778 47383 46790 45889 43748 31316 22297 26588 27145 25226 24374 24198 42718 59476
12212 59476 77596 75090 42385 41939 44268 47910 36484 43290 45250 49785 41771 40173 40299 44280
12198 44280 46678 42154 36331 35371 27710 38950 50277 69748 89043 112897 138598 156012 173653
12185 173653 191111 203744 208923 221649 222780 231945 230541 207556 189707 168464 138833 114040
12173 114040 94877 90665 93270 74477 54911 58154 64054 70381 54716 39371 48141 45350 53430
12160 53430 63451 62591 57682 54861 58571 54656 53402 42330 35050 39626 45800 45128 38038 36118
12146 36118 36377 50345 66555 65455 51749 41063 22414 21823 28060 40436 52487 53062 54119
12133 54119 55392 46807 51708 64530 69691 63957 71351 64569 56776 51510 46308 38104 35332 31416
12119 31416 31919 38775 33381 21480 18397 17887 22449 32845 33903 36849 37373 35810 40252 43499 33741
12104 33741 26680 20395 24179 30702 29630 22672 17077 27723 25390 11650 11647 20283 30851 27552
12090 27552 23147 30570 41469 36463 28391 21766 14939 13496 23179 32186 33466 35976 41173 39514
12076 39514 31634 27036 21894 17683 20065 14607 7905 6628 7031 17013 18265 23702 25370 17018 11451
12061 11451 23951 31490 29629 39030 43418 51643 42245 34804 35736 32724 31262 27121 29783 34687
12047 34687 40600 52292 39266 37027 37927 44946 40109 29580 35562 31785 26229 19075 13642 27268
12033 27268 32901 36572 41219 36845 21245 10676 10470 24788 41128 42237 36424 25392 26571
12020 26571 14139 16047 23561 33928 28966 13974 10021 11759 21021 10694 2963 12912 18244
12007 18244 25248 35764 25200 24868 29235 28697 45852 46154 47062 45214 45777 43252 39666 37484 29618
11992 29618 34492 38418 35480 22399 17641 15026 12260 485 -2116 1064 2238 18696 35698
11979 35698 53763 48611 32426 24355 33828 28023 27309 33451 31329 28705 30911 32569 18242 23376
11965 23376 30448 35184 38614 29390 15722 11591 14595 24528 31376 19259 11972 7777 25932 30432
11951 30432 20890 15454 20307 32800 34385 37565 41140 35651 38251 48594 48081 30061 20220 18169
11937 18169 20007 32227 31665 24448 14128 6246 6426 5819 21382 25024 12675 12422 31482 23996
11923 23996 15238 2143 -6013 -15405 -19276 -8556 -14106 -8562 645 14701 19631 26256 21517 27363
11909 27363 22093 20428 9644 8902 4414 16500 35238 40258 36241 36192 39432 46192 61401 46928
11895 46928 30851 21839 29069 37437 34553 32894 33871 44304 39245 31352 35703 30221 28971 19266
11881 19266 12244 31064 24912 26441 38445 39602 32674 45906 39206 33737 34581 28983 49730 55860
11867 55860 58899 54033 44218 34419 25433 19181 25562 35263 37471 32401 25419 27295 21950 37139
11853 37139 37563 38246 36838 41131 37585 31664 27437 16046 17170 16516 16419 18885 30067 16235 1195
11838 1195 10461 16986 35610 23014 31184 30755 28529 28228 13126 24299 41443 49905 37761 17108
11824 17108 31319 49927 55120 51731 50271 56855 51316 40558 46376 43138 44382 40431 33311 34262
11810 34262 45113 46706 25434 14747 14126 24926 23097 27274 30758 27883 26477 18909 15434 19252
11796 19252 16351 21648 31922 40649 45984 46468 20379 -7815 -7402 18261 34192 36458 22541
11783 22541 5542 20458 42970 57706 47592 35141 33212 34963 45832 44927 30128 31430 26096
11770 26096 25836 13993 20222 27619 35195 40986 47925 49719 59575 58936 55051 52255 36539 16786
11756 16786 10448 3410 6286 34844 37814 30813 29058 17685 11901 28607 42732 39266 47877
11743 47877 44756 29192 18907 22270 33317 39947 49107 41967 41328 36837 18801 11449 12014 -1846
11729 -1846 -8763 3366 2108 2345 5586 15787 14265 7127 4064 8939 5291 20109 46214 36669
11715 36669 24406 17938 18158 30482 35230 24686 20939 21988 23943 31452 39314 46773 61793 61370
11701 61370 54090 59451 61180 64869 67213 66162 58436 62354 65836 55252 67531 68888 63029 55284
11687 55284 43598 50283 53167 44374 35409 34238 40305 25903 14415 21634 37319 40897 62304
11674 62304 72240 80318 69864 64126 43793 39808 23067 21021 30286 37021 49373 49989 41120 23410
11660 23410 23817 35212 31705 33536 26630 31575 26666 23215 24040 24748 28971 45086 48570 59429
11646 59429 66279 48761 38468 23235 23255 30194 27428 29870 37735 45385 54195 53924 38980 45629
11632 45629 49840 44945 42951 46017 44439 21824 8424 22998 39121 62375 97332 133786 153158
11619 153158 171624 166095 138820 99397 68054 41418 42878 46250 38134 44806 54189 59188 55432
11606 55432 46189 46416 41742 39252 24699 34292 36598 25586 15098 18150 25555 30427 37408 48578
11592 48578 49494 42311 31384 30084 26765 29397 32831 24851 27129 30464 33912 33352 31812 28517 44186
11577 44186 58836 64812 65889 55594 52652 56341 59752 50835 40041 27616 10383 7519 27882
11564 27882 45342 49219 45118 42885 50972 54855 65880 65058 57515 58354 58593 55301 60922 53681 42196
11549 42196 33279 22743 24096 20814 13147 17966 41581 50887 46135 45633 51753 42902 16956 7903
11535 7903 28826 45734 50519 33160 13361 23218 18989 15573 20343 17831 6104 -7603 2828
11522 2828 25295 21252 3081 -6650 -2692 11721 20200 3814 -1226 9142 15102 14613 12256 14160
11508 14160 21260 27737 21322 18139 19835 30399 32675 13962 5888 11691 21687 22906 24264 12194
11494 12194 -3081 -9860 5619 6728 9766 14403 19863 25056 23456 26921 27784 15132 21388 38457
11480 38457 37483 16168 21611 30403 12036 6998 12605 11429 9761 15965 14831 17284 27947 23766
11466 23766 14534 7093 14457 17315 17566 24930 32409 30957 24739 16102 11549 23145 28170 6709
11452 6709 6283 10841 20135 32302 34906 19242 1455 -12640 711 12622 24193 24666 7747
11439 7747 12626 27055 40032 30714 46764 53764 57593 43522 39835 30384 16356 23960 34127
11426 34127 24969 29477 30369 41911 46378 39782 37112 37135 28288 25005 31833 33637 34764 28352 34185
11411 34185 29389 21827 21509 11035 14732 29809 19963 16765 22778 30084 28987 23436 23522 27710 22839
11396 22839 20157 18368 23136 18331 6770 6123 1418 15523 28139 21413 20099 12939 13539 14801
11382 14801 20981 10312 -7627 -8070 10542 21646 10351 8995 28976 31474 43357 31538 21283
11369 21283 25791 29969 35593 33897 30039 29465 37322 46371 37877 38723 36444 30829 30345 23849 18998
11354 18998 30575 31346 26256 25962 21692 10995 3851 -6651 -14676 -5696 8569 9073 7592 19538
11340 19538 27855 20217 16974 17966 16216 12787 -2668 967 17709 18959 19483 34080 26463 24637
11326 24637 22303 11510 4691 2660 923 4978 15138 19503 29847 39882 30080 19706 15854
11313 15854 4583 -5767 1347 5358 6379 2548 10666 13575 18616 24933 29371 26482 32142 34804
11299 34804 40777 39160 36356 28846 23633 29907 45330 45076 51205 65478 81542 88478 102515 115116
11285 115116 114882 97738 74613 41027 19417 26841 30949 43851 40000 32225 28383 18197 7506
11272 7506 5358 6028 10733 15158 23402 29374 28762 5318 -18911 -23185 -8931 11751 15213 14286
11258 14286 9861 1677 538 9998 14447 23897 17746 1380 -7152 -19089 -360 8938 6366 4750
11244 4750 5238 7311 17823 7126 7314 20244 20700 9448 6652 9698 -4220 -2648 13713 15513
11230 15513 6369 -1836 9912 16371 23654 27748 26975 23288 23570 16832 2878 6106 6639 13774 14664
11215 14664 10825 9505 16102 16888 15944 5252 -3106 -2671 8010 11109 7830 2938 -3462 -3719 -13894
11200 -13894 2493 27201 34487 38104 39792 57224 72636 95270 132253 174700 213089 199791
11188 199791 148960 106513 78602 74818 78155 55621 47511 39090 30777 37531 42513 31757 21765
11175 21765 29801 25997 23764 35153 42675 25094 19871 7950 4639 17293 14164 5129 11992
11162 11992 8659 690 -3738 2969 3297 -2371 -16485 -15450 -28807 -22303 12333 7041 6597 7294
11148 7294 10727 13778 20648 10612 4982 10595 8510 9508 17324 19968 16647 9451 13743 7097 -6591
11133 -6591 -12289 -7969 6133 21716 28899 20760 -3112 -3308 366 4070 5320 7732 13379 -1402
11119 -1402 -5774 -7667 5229 4600 -10643 -20832 -6363 8167 -6439 -4171 13837 9835 14719
11106 14719 5097 -10909 -7805 2163 6387 6677 6942 10217 11899 6845 5834 12639 21946 11235
11092 11235 -12372 -16251 -8398 -6045 4528 4617 470 7361 -4834 -13546 1613 996 -7735 -10929
11078 -10929 -17111 -11473 -674 9904 21213 13150 2682 11864 14094 16397 21708 24128 22592
11065 22592 12887 20062 16471 -628 -3793 4694 -1836 -8964 -12889 -3209 11937 -3241 -8005 1988
11051 1988 3474 -7556 -8423 1340 438 -3024 -179 -337 732 9250 16907 14898 16485 28176 29821
11036 29821 10334 12517 10535 -1240 -1083 1504 -8 -11522 -9503 -9319 -2941 6557 13212 7650
11022 7650 -2488 10783 20607 14136 7448 3995 -3562 -13263 -4937 6382 -3284 -8246 -18654 -15193
11008 -15193 -12226 -6420 10679 8588 6077 15610 390 -14594 -13553 2109 2473 -3544 -8803 2612
10994 2612 10625 20895 16362 10515 12298 20963 13010 5619 12044 9685 7235 5501 17419 41292
10980 41292 36185 33008 33086 26922 21156 9177 12088 5006 668 -3958 9162 9801 -4490 -3052
10966 -3052 -985 7178 5025 14765 20016 16703 14150 13909 15256 9069 9561 7623 6024 4287 2007
10951 2007 -298 17934 27319 13677 10577 11387 -4175 -9195 -4082 -6488 -7412 -9818 -9851 -2007 10472
10936 10472 18299 7828 -236 1571 -320 -1738 -5045 9033 8843 7698 12238 16958 5950 8454
10922 8454 25625 37436 25376 11580 163 -7723 8693 15460 24027 22697 24378 30167 36568
10909 36568 32825 30028 28044 29154 21434 17232 11248 9655 6816 6024 6047 3612 12177 17862 20722
10894 20722 28483 33566 23094 17264 10600 -1266 1944 15223 22169 10125 2170 9470 17542
10881 17542 18332 28247 25775 18629 9229 -12365 -4601 13476 22237 36853 43798 49099 32852 29412
10867 29412 27262 31987 44973 55859 76937 88954 80141 89880 103526 136035 188324 263065
10855 263065 367382 488969 574741 595400 546121 460010 365647 292154 236784 199424 159333
10844 159333 134924 113317 94998 91933 95507 82857 80791 75323 42574 35620 47140 42873 42814
10831 42814 44694 50722 51843 29625 28997 30123 36551 44857 48453 33065 12920 16015 21235 10253
10817 10253 -9558 -14483 -626 22657 26668 23226 14680 12210 -126 -13299 -16094 -7373 10167
10804 10167 12697 15536 10326 12143 9231 2633 -11337 -6786 9197 24681 20497 13910 11112 24806
10790 24806 27781 19574 18145 19567 17933 22963 20226 16016 21704 14769 14232 11408 1212 2383
10776 2383 7481 12388 15301 -1712 -3438 18370 9639 -296 -10248 -4380 -3170 -7441 -4413 2291
10762 2291 3437 14458 26871 33266 31510 24251 19214 16136 11257 2943 3785 9999 7799 4604
10748 4604 -2547 -1957 986 -4922 5746 11620 3752 -5304 -5431 -20864 -20080 -10377 -6799 -24094 -38404
10733 -38404 -39003 -14060 9263 12598 -1517 3787 -1968 -1324 15134 25471 28950 23991 23344 24445
10719 24445 16335 10757 3060 -3401 -5916 -4080 4742 4400 284 4351 20796 26389 21422 -5042
10705 -5042 -5200 -8621 -22968 -28304 -33757 -42676 -19375 -3096 3502 18033 18881 12796 3401 2081
10691 2081 556 10705 8189 11026 -1920 -13042 -15339 -12913 -4153 12464 18900 526 -9994
10678 -9994 -14892 -15190 -9916 -14130 -23834 -11654 3248 -5943 -6526 8640 14016 989 -1085 9229
10664 9229 11660 12077 7186 17914 31897 36382 40855 35943 31294 20613 14245 24941 33092 29825
10650 29825 25044 21054 27067 21616 9590 -1845 -14550 -16977 -4401 -5245 -11256 -7253 7129
10637 7129 19220 10005 -1740 2469 1267 -7273 -1827 22782 31900 31835 29573 8443 -3839 -11199
10623 -11199 -14856 -4990 3570 17335 25827 22359 16555 9124 11518 14639 12276 10286 11046 13158
10609 13158 4503 2272 -7050 -4084 5426 21438 25173 18518 12235 9349 -1166 -8640 -6311 4763
10595 4763 7452 10577 27920 40132 42881 51545 44833 31765 21243 19488 22404 28006 8185
10582 8185 -651 3599 -3057 -2649 2209 -4575 9120 10899 696 6973 3630 2358 11972 8050
10568 8050 19700 21518 17868 14929 9752 1492 1014 2951 20024 25007 25111 16322 14729 10466 6944
10553 6944 3865 8650 11159 6937 -7031 -2445 11011 11829 4287 -2111 -2179 684 789 12414 18183
10538 18183 8174 -5925 -19108 -20651 -19134 -12928 -16138 -21495 -12787 5174 11012 -8945 -12624
10525 -12624 -9923 -16567 -16761 -3283 -3969 7020 2890 -5741 -8119 -9402 -19675 -26681 -35027 -8308
10511 -8308 10825 24683 26760 22567 2683 1033 7153 5497 -942 -1256 6546 52 -8704 -726
10497 -726 1604 9101 5633 6869 -9926 -14227 -5423 -17145 -23616 -16854 -1215 5716 22851 31986
10483 31986 30430 17890 11136 3425 -2844 -11463 -1016 -2076 1282 5816 15019 7352 13449 16012
10469 16012 6889 17210 28625 16828 10753 401 -330 5383 -12748 -14940 -10796 2438 6571
10456 6571 4327 7768 2823 -3162 -1491 5653 4003 -2713 -14904 -13513 -4957 5108 14344 8995
10442 8995 12157 9551 7473 -3416 -8947 -12100 -27855 -31600 -19303 -14051 -11158 -2003 -1228 1996
10428 1996 2016 -4021 -4573 575 -1341 -6480 -2911 -3994 -13522 -3032 -5945 -8205 1460 4604 2921
10413 2921 -3356 -3905 -1364 8191 991 -16879 -6822 9822 17284 16120 26225 19949 9603 3344
10399 3344 15177 18563 19493 14008 5759 4698 -5033 -6007 -2375 1626 9979 8404 -19033 -27804 -35461
10384 -35461 -20769 -17124 -18944 -12138 2758 -1085 -4033 -2089 -10781 -16361 -23653 -8565 6662
10371 6662 14627 23503 10093 -908 -149 -582 -7548 -10637 -42 8173 13694 22911 26209 24029
10357 24029 6052 -394 -1896 1744 6215 17446 20747 16143 14980 19868 33742 45238 36846
10344 36846 21790 15147 12806 11864 7271 -655 2948 411 -3666 -14595 -27532 -25677 -4066 14615
10330 14615 23432 32860 28807 27043 24012 3600 -8460 5800 27208 32106 11419 10697 19695
10317 19695 22603 37552 32773 13649 21248 23009 27523 27844 16142 11688 19197 26447 29269 17779
10303 17779 26624 33423 44515 45265 43185 42258 40949 24897 27701 16684 1366 2241 11766 14303
10289 14303 22364 22938 22851 22272 27599 36482 47781 50497 49561 53189 50885 48285 32524 6430 12183
10274 12183 22547 20776 28470 26772 26339 24580 29080 27356 24501 15334 7046 17538 31037 37779
10260 37779 30038 13970 13244 18202 2881 694 -2728 4583 5534 1833 9345 26275 24987 18314
10246 18314 17161 12434 22781 27992 17554 10899 -5933 7046 15057 15053 17003 21053 38744 65713
10232 65713 89884 108509 120720 119155 105365 95638 64149 49841 36942 38386 43014 39268 40913
10219 40913 33419 16422 3259 -7341 -2599 6500 2387 2870 7971 19652 12583 1756 -4736
10206 -4736 -2930 1210 -2159 -4629 2405 8162 11356 6036 -2700 -16431 -5342 8147 16043 28735
10192 28735 25223 36345 45584 46894 48026 36112 35091 31770 23608 13650 2543 -9052 -6620
10179 -6620 -1758 -10357 -4316 -1681 -8273 -2593 3728 2805 1919 3876 -516 20451 16021 12354 19824
10164 19824 18166 19116 14189 5056 -6489 -837 1838 5933 12423 2000 -8635 3704 17457
10151 17457 21314 24478 15368 3829 5382 -827 -11846 -7948 -13583 -19843 -13719 1261 -7907 -6417
10137 -6417 9146 10357 5305 -2780 1538 7593 16945 11468 -4287 -10350 -10727 -12851 -10332 4183
10123 4183 17697 9109 13873 13557 11966 8658 9504 22639 17391 10334 1434 -4559 -9927 -4139 7429
10108 7429 -1268 -14311 -10337 -48 17380 32895 27777 921 -8151 -12186 -3802 6847 9190
10095 9190 5476 3125 -13899 -11692 -11595 -6340 14324 24746 18295 21701 10258 6772 -6451 -16284
10081 -16284 -20133 -4370 1223 -7435 -20381 -21726 -4018 -10989 -21735 -19860 -12720 -13914 -4827
10068 -4827 5419 -394 -193 2979 6746 -1698 -15742 -12111 -22 3623 4313 -4254 -8831 -24277
10054 -24277 -29013 -22779 -20255 -12956 -8843 -13578 4777 9269 6503 9870 -2644 -21399 -12855 -2758
10040 -2758 11105 8540 19203 28908 38743 25789 16063 18757 19806 22321 27573 22574 21542 20267
10026 20267 25930 47749 74843 78038 88354 78439 59020 43228 29252 25047 13975 195
10014 195 -3516 17149 26357 21139 18517 19915 16325 7798 8361 19741 25636 12468 10529 8109
10000 8109 5724 -314 -537 3661 8044 9379 23949 18668 2124 -6488 15064 16497 15331 12179
9986 12179 13657 12577 9637 8399 20203 7079 1151 -210 -3178 -8377 -4204 -1851 14142 20344
9972 20344 30055 26888 13377 5349 5707 4108 6895 13179 16041 13044 12997 17283 17368 10189 10123 11388
9956 11388 3850 1315 -43 11312 16399 25438 29513 20373 20824 12406 2235 1126 -7998 -2670
9942 -2670 6527 12733 -2930 -5869 15699 11625 -2376 3974 22175 24338 16570 17815 13144 10725
9928 10725 15385 17104 24599 36694 45037 39481 41631 36420 25863 28679 49866 56637 56271 69054
9914 69054 101273 139333 195578 244110 261904 248681 207035 169679 128789 101586 78218 65767
9902 65767 61432 55011 46126 46556 54858 66642 70659 77857 71176 72532 64713 41274 33524 30296
9888 30296 26247 22367 22145 26643 18846 9100 17683 19121 21384 15452 3628 3326 1067 5094 9692
9873 9692 24115 33971 40304 35696 20192 23422 25560 29305 41017 34576 11574 6431 27048 33153
9859 33153 37519 28708 30318 30041 29883 28436 26352 31496 36521 58581 91539 120667 154572 186516
9845 186516 217830 228517 227642 224836 217556 211492 212644 227249 266543 332236 407185 482675 567535
9832 567535 671877 805467 973314 1288533 1868620 2914779 4796608 7862280 11681448
9823 11681448 14850996 15868071 14357154 11128788 7745021 5267825 3812599 2996458
9815 2996458 2496076 2175444 1979454 1867212 1796406 1700999 1569910 1412454 1246612 1107682
9805 1107682 994725 901599 813905 744296 700412 667026 606595 546622 492256 433517 386700
9794 386700 346486 329550 323568 303378 275579 241095 217456 207677 196813 186389 167688 154795
9782 154795 146514 146753 154257 149573 149262 144250 122307 105742 100884 110818 107999 93293 78347 69055
9768 69055 60418 68050 80188 84320 69119 60714 69625 76091 70230 71444 66838 56067 56653 61508
9754 61508 71415 73730 75558 70404 61195 56728 65717 68763 79682 80702 80481 80224 80234 78446 82174
9739 82174 58811 46562 52670 60193 61460 55609 34559 33217 47730 64509 64693 64699 68068 65139
9725 65139 51637 63777 75696 70712 64429 61483 59158 57332 53513 46305 54083 48032 44786 57642
9711 57642 61859 62041 73230 68247 62670 71337 77995 74784 80769 78037 73977 68494 80457 85089
9697 85089 78749 64283 53467 48437 46796 46289 58069 65128 57750 57792 54395 48211 46788 49033 65039
9682 65039 72978 72657 69927 71924 60216 50236 59452 56972 65214 72944 68253 56053 37943 47576
9668 47576 69890 80023 73219 70055 75052 71609 71838 81626 80703 77593 82732 79476 67945 73574
9654 73574 76773 72549 75699 78255 76080 72903 65200 58255 58973 60493 57825 49449 61762 76509
9640 76509 75053 62453 62003 62410 75251 82268 70607 80094 96119 109051 104144 95989 87782 85790
9626 85790 101927 95894 104356 99585 92804 89450 98213 97431 89267 84656 87945 99162 109577 105345
9612 105345 93238 88094 80460 84235 87634 87395 91114 98144 113193 113581 114354 104387 95178 99397 103801
9597 103801 90886 95354 106526 116727 126709 123353 105193 98223 93506 89501 93112 102752 99318
9584 99318 112154 106558 95768 112437 125609 129513 139291 137224 121949 106779 110118 119533 115946
9571 115946 104646 94296 98187 103523 106427 111778 116583 118164 125206 104839 83734 67580 77522
9558 77522 95040 99979 105257 108893 111892 108472 113859 129325 148077 146139 136625 140259 140964 137491
9544 137491 128189 134372 141481 128264 120936 119452 124597 125211 131455 139846 147954 152598 137496 123907
9530 123907 130769 137341 141389 143204 142744 154011 162217 152283 142878 141597 137759 144414 146048 142484
9516 142484 141115 143062 146506 147157 162010 162380 141488 144959 155128 167032 174546 175211 168557 159083
9502 159083 154745 154667 148770 148841 165032 161679 144754 134624 138664 140641 144494 150774 163317 167512
9488 167512 159485 154885 154613 171985 178279 178986 178620 182696 177468 175244 180453 173775 193199 199118 198843
9473 198843 192674 181351 183596 182217 175005 176813 177697 182589 174845 154339 139478 143473 149067 157405
9459 157405 149847 152720 162993 165983 182475 194814 189561 180135 186005 184200 179209 162163 165198
9446 165198 171148 173252 172671 182497 199606 181211 184705 185603 181503 178141 188568 184287 189819 191470
9432 191470 195202 196070 203156 196137 185988 183972 195169 213699 198380 179221 178727 186334 184575 185431
9418 185431 185255 179661 181912 193182 204680 224389 241905 254476 270060 275517 250184 217659 201387
9405 201387 203285 208731 217713 220516 228433 206892 192990 193557 181113 173127 187075 187477 173494 171093
9391 171093 182137 199925 200158 214782 217812 211436 198806 181066 170692 178368 193818 188958 176553
9378 176553 178086 180032 167152 155293 147866 148715 155989 153962 161059 162090 179338 181805 167041 163352
9364 163352 165875 160687 162740 149100 150736 158178 159730 153535 150827 158278 166138 163784 153773 142934
9350 142934 153265 162156 149476 148714 149030 143463 146200 155787 151008 153813 156595 147072 141951 145087
9336 145087 146479 154768 150779 148281 136038 132488 126276 132508 146693 150890 136889 127560 129889 139428
9322 139428 146690 145044 139875 137023 136318 137706 120446 107484 117264 122034 123009 126955 128139 133794
9308 133794 129569 133255 131325 120542 107467 110186 112563 107784 113936 117847 105975 100363 101516 104955
9294 104955 105430 111567 118186 126286 118361 87886 77801 87985 89136 92988 97386 106468 116966 114570
9280 114570 106462 118815 134935 139893 138576 146665 141723 126479 133090 152663 177969 210704 267011
9267 267011 338233 427541 532214 586803 590229 531782 423820 313035 252999 214643 196796
9256 196796 177081 173317 169647 161989 146598 129795 124559 123755 125217 126137 116955 124403 124923 105157
9242 105157 93414 102343 96416 98755 110306 107890 101547 96344 96063 113652 122314 134193 137994 150339
9228 150339 160586 164608 185662 213008 259028 344476 477975 677894 915151 1086862 1101547
9217 1101547 984781 789632 589781 437743 349339 292872 262184 234029 227829 224683 204013
9206 204013 184451 169413 156327 147977 137678 135192 137714 138523 146577 134671 113233 111931 109662
9193 109662 118046 117771 111657 101276 102057 114256 118120 122641 119671 117512 115099 126125 140520 157535
9179 157535 185850 221415 282694 370536 467672 547099 570681 531154 421649 315003 251265
9168 251265 207466 172059 151288 159761 172787 171048 167020 155746 139325 130758 128580 111136 103071
9155 103071 101573 93930 85448 80804 85574 89931 76177 69386 75149 76516 74258 70329 75253 79072
9141 79072 75044 62189 38263 27901 43858 71660 93949 98766 103443 99941 106099 109073 112526
9128 112526 114278 107155 80952 58453 45194 30784 35812 44842 51885 44538 42727 44575 55147
9115 55147 38560 31976 40717 31626 25510 33467 36222 33889 38293 26923 14230 13848 22978 31683
9101 31683 30118 25379 29967 26134 16270 14208 2576 -10561 -3197 17609 22813 17839 18849 33013
9087 33013 41541 47598 44947 43143 46929 46778 43192 38790 28699 30356 51724 81383 82376 64497
9073 64497 59213 79514 81583 70022 56832 36961 34506 31034 23045 19514 23150 28771 13306
9060 13306 10440 2022 -1479 1318 -4774 -2379 -1431 -11647 -807 4054 5368 -3156 2603 128
9046 128 -12658 -12994 -28415 -29079 -36849 -33836 -20827 -17811 -10876 -4896 -11593 -30289 -34024 -24615 -1367
9031 -1367 19562 23990 32036 45984 59331 51517 30374 2791 -14964 -19451 -28817 -49252 -56597
9018 -56597 -48970 -43742 -32070 -17917 -8282 -5172 -17025 -29877 -39084 -33014 -22115 -18108 -6249
9005 -6249 -1444 9607 2508 -25755 -31086 -42305 -52478 -48292 -54422 -54660 -29430 -13393 -15526 -5062
8991 -5062 2273 14799 11236 -10992 -13024 -12778 -21287 -17793 -22075 -47247 -59612 -60669 -55828 -62969
8977 -62969 -69253 -56948 -52717 -52828 -39108 -4045 21506 33775 30317 33010 31492 24695 35191
8964 35191 26952 14860 16950 16457 19573 18872 28031 30664 21789 12124 1009 9943 31092 48894
8950 48894 54686 68087 92663 100998 113329 112115 96360 94641 117184 178150 246948 295521 312543
8937 312543 287797 245726 196168 166097 132304 93119 71379 79084 78385 95639 121179 137876
8925 137876 153402 159102 173518 167315 158201 149633 137848 130869 119917 103450 91765 91169 85877
8912 85877 93242 100561 96195 106020 100640 107815 148673 170790 185065 210788 226912 228327 241150
8899 241150 247404 257690 256471 240306 235081 262944 327580 401442 471225 540053 594825 648482
8887 648482 707364 756768 834490 922153 1040905 1228584 1467804 1748626 2098575 2502714
8877 2502714 2932069 3429539 4026148 4795748 5877410 7460803 9863767 13646398 19800563
8868 19800563 29873902 45691212 67145594 87632030 97078647 92663972 76521828
8861 76521828 56503239 40770644 30716396 24515527 20570404 17937270 16144817 14937196
8853 14937196 14081130 13329024 12427335 11400609 10396547 9481159 8677369 7979836 7374345
8844 7374345 6833834 6368335 5974493 5650867 5418974 5287103 5256896 5378481 5677100 6080578
8834 6080578 6568203 7119243 7715729 8404149 9289913 10553319 12408960 15124030 19320633
8825 19320633 26025427 37066027 55578621 86029844 130290533 175509978 197586710
8818 197586710 190914936 157968229 115079049 81594226 60634409 47914184 39912985
8811 39912985 34662493 31095965 28663292 27010599 25640779 23959704 21950010 19885627
8803 19885627 17933604 16122723 14466328 13018431 11780759 10739449 9835532 9048649
8795 9048649 8408908 7879156 7490552 7266238 7223715 7250104 7279037 7294137 7301357 7375316 7622357
8784 7622357 8092501 8874646 10105712 12051493 15173864 20278880 28661355 42097873
8776 42097873 61364425 82132095 94435462 93307913 79953004 60316269 43362668
8769 43362668 32192394 25301610 20962960 18093159 16130980 14762230 13808241 13059375
8761 13059375 12242107 11286520 10260149 9263131 8330530 7452958 6682850 6018649 5439318
8752 5439318 4939469 4500549 4111794 3786277 3534633 3343168 3191572 3061425 2934521 2792655
8742 2792655 2612652 2432053 2277124 2127819 1979629 1858264 1745706 1654781 1579776 1511831
8732 1511831 1453911 1398678 1335825 1266498 1213064 1153317 1097036 1040058 998800 949531 889441
8721 889441 851276 817590 786059 757269 723123 698830 670913 659581 677937 688193 692582 698236
8709 698236 714692 705435 686076 682620 660059 630748 616717 614522 621474 623939 630368 642066 669729
8696 669729 699622 735172 743486 694001 620995 573489 521704 495648 478775 470496 455883 447413
8684 447413 448416 456875 465847 470753 464537 462481 456044 450920 439229 428178 416186 395498 378488
8671 378488 375598 386229 399737 409386 425092 449886 478945 519289 557365 573193 558737 528544
8659 528544 486823 460675 437535 440063 452838 446781 452118 478768 490130 491824 501644 499393 474730
8646 474730 444383 419902 419088 418377 428468 450368 454347 441002 432853 425505 409889 416014 432894
8633 432894 453595 485191 534238 591988 674486 797473 1006250 1392534 2046017 3013670 3977841
8622 3977841 4387828 4171885 3405121 2495227 1854264 1485090 1252948 1109995 1008284 940231
8612 940231 885473 847750 827372 795221 752428 719365 685162 650652 613584 580564 571933 552310
8600 552310 536156 540144 546516 551814 550660 558229 576430 597917 609545 612130 612627 630252 664719
8587 664719 722936 799803 905743 1054139 1273249 1655851 2332359 3504153 5372096 7521746
8577 7521746 8690893 8568665 7219533 5349864 3948402 3145362 2694071 2416794 2225054
8568 2225054 2082329 1949206 1835482 1716249 1597231 1462202 1336422 1233996 1139164 1036305
8558 1036305 941232 851130 774249 699885 647625 613643 585192 559347 555889 552136 545352 528941
8546 528941 510131 497329 494769 493285 505384 513459 548775 600593 688624 847500 1127499 1608624
8534 1608624 2379988 3382506 4097243 4148363 3625476 2706066 1914742 1430024 1156847 983702
8524 983702 868594 796496 755499 729952 708032 676852 640978 598323 554771 517223 473442
8513 473442 411247 373657 327616 295476 283596 283741 275508 260812 259456 255195 244110 250038 249432
8500 249432 248911 263824 257488 237144 226306 216040 216662 205857 195803 193590 195599 186500 180258
8487 180258 191736 211820 210828 221742 230180 225356 239825 241413 210820 176364 155774 161927 188748
8474 188748 202615 204609 209036 218692 211115 202679 194495 196640 201147 211925 255855 305324 382401
8461 382401 464420 570115 640080 635149 567045 490811 399233 322214 284836 264761 250589 233848
8449 233848 213405 201205 193509 185756 183005 188251 196030 195278 200267 210860 202801 219601 235359
8436 235359 251791 281334 280340 256206 233109 211354 189902 168832 178576 187016 196585 203236 204088
8423 204088 208927 239781 270433 309752 375943 450680 600371 817550 1063697 1210880 1203912
8412 1203912 1045112 808248 611815 482731 411486 364931 341191 321353 301745 283709 274651
8401 274651 259886 244768 244732 235582 222447 219179 212177 210847 210019 199884 198022 197520 206341 203851
8387 203851 206780 223997 219858 205252 195543 176102 169478 182054 201354 218887 214896 215519 210376
8374 210376 222914 280957 344044 424459 546458 629092 622903 553264 447766 353147 291551
8363 291551 258527 224012 188394 183420 189689 193231 188452 182003 172643 153882 142304 134679 125309
8350 125309 126531 135120 144997 122205 116140 118868 123174 119395 128420 132407 135043 138620 134670 130017
8336 130017 119344 122045 123490 109434 106936 95822 96080 100955 89623 92107 99178 81752 70091
8323 70091 79266 74891 73403 80957 94004 84364 78479 82306 79511 81234 79997 83674 79131 80237
8309 80237 84645 82338 76785 77680 73981 72087 66019 70210 78105 76850 84709 92665 80553 68105
8295 68105 65090 62610 56355 61980 62176 53869 60322 64943 72713 85456 94487 90434 79299 66770
8281 66770 72829 87709 89648 85623 95043 93614 92559 93447 84898 90909 97427 89796 78971 76112
8267 76112 71873 66179 65103 54561 48785 54410 61724 62488 68825 69419 62430 74080 74766 63117 72126
8252 72126 93341 94026 96592 90297 83062 75732 75352 76823 84067 77567 59167 67903 80273 79625 75677
8237 75677 76705 75869 58755 43985 45794 47633 49371 42666 40514 48566 45575 46593 59312 67588
8223 67588 60407 56906 66940 66592 69524 74319 78697 79054 74839 80181 74295 72100 66963 52295 67311
8208 67311 92655 98222 100540 93777 87064 73167 77420 81173 63174 63258 74155 68703 67016 58835
8194 58835 55369 61164 60148 62562 72934 70517 58342 61565 76587 79813 70773 49410 54303 58988
8180 58988 53009 52204 52468 59022 69493 71737 82394 91242 91110 82745 77496 82983 81711 82061 82242
8165 82242 80335 76792 68105 68664 66472 71545 78508 70399 55884 52974 44101 34108 44655 47255
8151 47255 42897 48534 65655 63485 62481 61079 57778 55950 61035 63192 62241 64716 69938 60429 59240
8136 59240 67186 69115 60568 60631 63952 55116 56825 101231 120709 116150 119755 111433 99062 96608
8122 96608 94679 90657 74702 53062 50913 50761 46949 54429 43335 44064 40372 44846 61679 66240
8108 66240 72813 82234 69990 63588 70455 71826 58178 45475 40338 40594 34091 26776 37057 47327
8094 47327 47483 64745 67937 59832 56630 57416 65920 76313 80339 79407 84135 110118 153621 172258
8080 172258 176651 172516 171606 160935 151077 137509 117403 105076 91130 84353 92392 86496 79665
8067 79665 64595 60744 70124 70797 66727 60062 50109 39460 50792 45708 46528 50814 64689 71180
8053 71180 66077 74328 77962 93627 85125 80107 81683 81503 81599 86173 99018 106662 120306 127136 138589
8038 138589 144864 152550 129655 110385 89793 83408 97808 115073 116752 103362 86286 81595 87171
8025 87171 93114 103103 121418 114656 107478 95766 92471 103738 108069 107953 101972 90777 88875 90705
8011 90705 101646 115156 119850 95967 80584 91639 108945 111505 101886 100647 105492 97588 97803
7998 97803 87889 86913 86459 73944 77626 87715 81451 80769 96990 103812 115482 116153 107705 103981 96288
7983 96288 97306 102585 96375 111314 137401 140474 144864 145692 147614 145990 133959 122915 114080 103011
7969 103011 86066 78089 69423 51216 54591 58168 68251 73050 83202 81374 72917 72884 84298 83876
7955 83876 76797 77646 81124 80950 84184 76134 74380 66752 84070 91747 86665 86235 99072 98858 94785
7940 94785 89635 88315 95092 92950 91372 95968 92983 95739 112809 105872 92041 102203 95332 107079
7926 107079 114690 102277 94480 83425 84419 73298 66549 63980 64479 72779 75331 70149 77215 84272
7912 84272 74449 74692 75919 62711 55195 56483 50035 40331 45808 51964 52237 49388 50577 59300 59926
7897 59926 54703 54455 68781 72248 58744 49460 55479 67821 60552 49998 56462 67361 76675 87310
7883 87310 80626 64233 53285 60219 57662 54386 38990 36163 39777 40748 38819 48678 45170 50568
7869 50568 57875 72852 66480 64573 50296 48876 57277 44056 34363 45415 44978 51446 59125 50080
7855 50080 54422 75441 68845 60117 58389 53035 42875 43130 42485 47772 38578 34546 32903 37189 41282
7840 41282 41038 42507 38047 37592 45711 48096 44502 48544 52190 62263 54981 36516 19550 23647
7826 23647 33171 35737 34959 34528 30573 30055 39726 48199 40359 26989 28964 30331 25917 26932 28942
7811 28942 30632 20049 19897 23376 27369 34574 37307 31473 23256 11404 16834 14568 23966 38648
7797 38648 46261 43227 24168 4717 -2078 2540 3464 14494 20972 18459 14582 9947 8981 6435
7783 6435 16521 17572 21581 30274 42597 43222 16218 -2129 -7203 5878 8236 17193 14775 19012
7769 19012 18249 12791 26315 29950 11361 -9665 -9951 -2912 12467 15587 16777 14120 25216 39800
7755 39800 41159 40498 28510 27186 28636 34376 37261 26608 12996 3442 7416 6197 14610 20290
7741 20290 11609 13100 21976 23502 17600 13045 9938 8601 16364 22932 31250 23027 11187 15909
7727 15909 25713 19293 19768 9116 11320 16291 16632 19034 52213 46772 33141 36411 40632 27007
7713 27007 24451 23587 19269 23718 37546 37053 37464 40447 42065 29630 23971 21035 14810 26463 37600
7698 37600 25767 11017 16632 10311 9392 12266 2593 3027 16517 14669 19672 24174 23966 21412 11975
7683 11975 -15224 -23057 -18403 -21468 -17664 -15051 -18635 -22818 -16362 9443 26870 23345 25529 18006
7669 18006 12747 15036 5267 15310 23420 19971 27410 33328 32870 23311 19351 13798 12256 4737 574
7654 574 6035 23695 29877 21538 27067 35616 41082 41111 29965 15589 23488 30677 21983 11797 12552
7639 12552 -1109 2231 15783 26042 32415 27700 21026 28228 31325 37526 45249 38903 35883 33314
7625 33314 37556 42508 32593 18889 21518 20738 16426 17490 4982 9828 22905 25244 20502 31001
7611 31001 54669 50945 30650 24082 33372 34254 24253 21638 36153 42744 42387 42703 34839 35957
7597 35957 25596 23758 38654 27042 12569 12366 14113 20696 29712 31976 25850 21341 17350 8970
7583 8970 9698 11658 18079 23512 25559 16112 16324 19092 3792 -212 7929 19838 10437 7240 8395
7568 8395 13378 1929 7591 31124 36016 37322 43814 29205 18594 13479 24626 35248 29285
7555 29285 25526 31740 23497 3410 -1298 15726 27764 34194 26627 23736 25793 36980 33881 27364
7541 27364 16131 9563 7389 6801 15670 25959 19069 303 3193 20154 18394 5631 -3633 -5315
7527 -5315 -11629 -11500 -10242 -10744 -8236 -223 7746 8868 9265 10309 16272 22086 17953 11952 -1162
7512 -1162 -9399 9259 27417 36302 18922 5602 10058 1363 11481 13177 17815 18444 17166 11460
7498 11460 10490 5120 11939 8690 7421 11166 11706 2654 2086 15508 31624 32364 31752 21333 20493
7483 20493 30237 24259 3887 -1985 3468 12301 15163 18102 31281 29380 22559 24169 15114 -2260
7469 -2260 -2764 -5286 -9072 -4173 -5588 -1910 6346 5180 1292 10944 4009 -8846 -18106 -15019 -21712
7454 -21712 -11867 -8776 -6084 15155 36099 36920 21419 7471 8395 7589 8438 3783 -1827 -2065 16898
7439 16898 23187 18378 17209 15472 13353 8890 17825 22883 18488 15123 23751 48238 40832 32108
7425 32108 29702 32838 41271 45342 33030 33940 20025 10129 5392 -4041 -5347 7840 3167 -5451
7411 -5451 5663 15826 25136 24251 18903 27964 11711 12249 17579 20328 11572 12028 7197 4993 7872
7396 7872 3559 10500 35831 49533 34672 2673 -4896 -5152 -3696 18653 17445 -5071 3768 9785
7382 9785 7762 -1050 68 -3891 -9868 -11356 -7403 1261 12046 -81 2801 554 6456 -3110
7368 -3110 -8387 3849 17902 22663 22355 28245 32892 24500 20719 13753 5714 -5452 983 16110
7354 16110 23377 27493 28447 19496 -1856 -4742 3148 1954 19261 29205 16217 5472 747 -3343
7340 -3343 -17476 -23532 -25413 -19105 -12858 -8596 -5373 6476 16539 9980 13821 7730 13121 2478
7326 2478 -3682 3512 12780 6418 4888 6467 8727 1062 4977 10396 15558 -1799 -8530 -10025 2042
7311 2042 9635 12543 13342 8177 -1150 -6242 -5791 2813 -165 -23992 -19687 -14911 -7306 -5979 -14
7296 -14 19765 15825 13129 24045 26248 31513 36341 37778 32116 20110 10339 3821 6421 7943 11994
7281 11994 14871 3304 3420 10971 19601 19176 16766 23562 23688 23403 18214 27600 28625 34634 26486
7266 26486 26681 24738 22594 9453 12585 28535 19193 6008 18357 12783 3344 2518 10293 11868
7252 11868 10269 21969 21076 22853 6706 326 4979 9137 9832 7176 2170 871 -11325 -4718
7238 -4718 11332 14485 22907 27685 26400 23014 29727 47005 34896 15825 -5137 -690 11525
7225 11525 10649 8463 9498 6689 5442 12201 17036 25554 29552 26457 8258 6941 3016 513 8988
7210 8988 -3660 -6312 -2864 1438 13516 -3177 -11758 -14781 -4099 9374 15122 19382 8545
7197 8545 9519 7507 4988 19724 12583 5622 137 5450 4137 -14511 -23271 -13388 -7680 -7435 -5974
7182 -5974 -11019 -14743 -8756 -1040 10375 11277 10450 2668 7372 18093 10336 10061 11667 6975 4740
7167 4740 -15830 -13272 1796 18538 12012 20531 17876 13220 3614 1867 7647 13792 17853 4934
7153 4934 1970 13532 10714 12846 12802 15413 8660 8560 -901 -5078 4078 244 -532 -10848 -27284
7138 -27284 -21227 -13086 1222 4748 -8039 -15665 -11554 -6916 -11699 -24488 -24354 -20144 -6561 5313
7124 5313 -3840 -7283 -7742 -7526 366 7035 2620 2678 6369 3357 9427 12861 18289 23085 14004 755
7108 755 -12722 -9691 -11790 968 15674 19322 8524 -4681 -936 -208 -7033 -6021 -24664 -16005
7094 -16005 -1645 7946 8727 17914 18973 4197 2390 -5812 -5728 13127 20708 2141 -19314 -13344
7080 -13344 2334 22514 29123 13067 -89 9037 14224 9271 13090 21600 27641 4101 -176
7067 -176 3535 2653 878 8623 8086 2803 6749 4726 -1026 3872 6375 -4942 4069 14457 17036
7052 17036 -2999 890 12641 3074 7723 2113 -1609 3247 13239 20045 20043 10777 -2877 -7088 49
7037 49 7325 20388 22098 4963 3049 9577 8830 -6 -1122 -8486 -7831 -1927 -241 -3645 -12808
7022 -12808 -11125 4048 4909 4595 1665 -2540 -2049 -10316 -5552 2220 2669 43 7547 12202 4984
7007 4984 -3025 -20304 -30993 -31201 -18830 5991 11002 18898 14481 9404 16014 29930 23302 16849
6993 16849 9653 -97 -3598 1603 -3142 -8317 4410 7119 15933 2412 9652 34740 36341 32489
6979 32489 25528 9113 -4057 10340 25389 18528 -3097 -1279 296 7480 15336 18510 26949
6966 26949 27848 20975 14492 2308 3522 4441 -2611 9817 18338 22310 20443 16846 16176 23922 12786
6951 12786 10522 20390 24604 18025 18561 16381 15761 19430 24885 12751 2879 6251 10745 3929 -4651
6936 -4651 -20067 -15462 -9878 -12048 -1271 4146 4305 585 -2486 -3674 -3156 -3693 -11284 -12840 -6784
6921 -6784 16824 20028 15595 8206 7742 5668 -1102 -5517 5099 -6431 -21703 -16071 -1498 6264
6907 6264 9738 2376 -2501 6690 7481 1193 5935 10979 -2059 -11495 -17952 -22102 -15130 729 11349
6892 11349 3550 -1242 -2298 -1219 -5854 6707 14157 11487 6393 11242 9203 8132 12037 17903
6878 17903 6201 -2739 -14580 -5132 -3173 -14332 -14760 4792 20444 27161 35120 31970 30064 21708
6864 21708 18978 11602 -2550 -8440 -5217 577 -474 -5407 -11050 -15542 -16908 -5446 -1263 -3145
6850 -3145 -20108 -13524 6196 1706 4508 12673 16449 11419 5009 8057 2049 -2057 5131 2749
6836 2749 -5068 -16689 -12408 -15204 -21503 -18381 271 6215 14758 12157 4218 2395 1371 13167
6822 13167 21697 22938 13321 16887 24284 25298 17629 974 -6780 -7785 -4417 11030 19453 4581
6808 4581 3955 9625 14160 13506 16124 8693 -10511 -9957 -13415 -6010 5368 13565 12377 11369 19043
6793 19043 17441 24925 35127 14664 14122 18921 23788 26824 33230 26410 27340 22550 14982 10222 1043
6778 1043 -7070 -4651 -8359 -11510 -3604 15352 22654 13580 18157 9244 -2675 -12272 -13354 -9248
6764 -9248 -10913 -2806 6978 414 -2694 -10582 -7328 9772 11867 4439 12839 19583 24462 26159 23483
6749 23483 20506 2758 11404 14857 14438 14557 9314 13837 20456 15784 -2134 -2226 5458 8784 4961
6734 4961 5266 12207 11864 12328 9626 7029 -4130 -12972 -10941 -1311 -1987 -11539 -14846 -18767 -28066 -16216
6718 -16216 -4020 6403 9264 12219 19373 31262 41251 36234 22885 15405 19549 22171 6246
6705 6246 -6185 851 20569 12675 2246 -3384 4915 13533 17193 6014 -8361 -5571 -2962 4261
6691 4261 -8663 -29359 -19686 -8994 -4139 -5443 -4280 21836 17197 3919 -7136 -9186 2500
6678 2500 2902 -4667 546 -6007 -12703 5531 7672 1776 3412 5953 -146 3112 1832 -9378 -6037
6663 -6037 867 6961 18185 23297 12364 11282 1205 10688 14292 4594 -3030 -2883 -6121 4607
6649 4607 18189 28055 2478 -8622 6846 19875 7025 13637 4901 2036 4177 9643 5066
6636 5066 3619 356 11141 12425 19859 19179 10612 -2985 -10075 5919 12120 -3770 -5955 -3757
6622 -3757 -3882 3005 5129 13523 6662 -2225 -5361 -8892 -8450 -13317 -2901 16831 25286 5716 -3711
6607 -3711 -2291 -3982 -5617 -14363 -15719 867 -9176 -11513 -2660 13662 10071 8032 10074 -6307
6593 -6307 -15489 -20195 -15200 -17236 -13349 -4466 -3719 -2941 -8931 -17018 -8833 -3865 -13701 -14046 3333
6578 3333 5063 2341 396 9242 8754 -6600 -19859 -25091 -21047 -3156 437 8085 24636 21597
6564 21597 15837 9378 4711 10369 1288 -988 -5461 -8644 -14066 -16776 -1493 5157 3327 8
6550 8 4735 5578 1651 603 8378 275 1155 -16659 -18925 -5990 2377 22393 11726 2257 -12824
6535 -12824 -8221 460 -11506 -7478 5537 10578 21646 18077 7517 9932 9688 5366 -3134 13379
6521 13379 17484 11433 23838 25980 13444 13759 17932 20629 19303 17474 30649 31845 18991 17133
6507 17133 28321 20819 16858 7923 2361 10142 17606 21745 25437 29208 20319 20771 25865 17960 5336
6492 5336 9543 5007 -397 -3656 457 1780 -5149 -5540 -13882 -13063 -13973 -8809 -5905 3271 22780
6477 22780 22627 14063 -7283 -17354 -14903 -3686 -3890 -1251 5833 11243 3859 -11828 -12996 3601
6463 3601 13031 14652 13159 -4616 -2884 1318 -4530 -11367 -24441 -20199 -18223 -4290 5151 -3107
6449 -3107 -5290 -7513 -6511 1405 7596 13385 15852 18212 10141 12098 18932 6711 -613 -4864 -7311
6434 -7311 -12126 -17561 -21269 -5550 5351 868 -6191 -877 7998 4211 6328 5832 14317 22728 18253
6419 18253 18758 4304 -10017 -7532 -1443 -7325 -5848 5094 -528 -964 -1650 6661 3325 -11245
6405 -11245 -19102 -10819 -14738 -20932 -8165 -3139 -13429 -33157 -33429 -11869 -5169 -9174 -14532 -12821
6391 -12821 -16522 -13365 -4473 8143 29047 39808 27645 9282 5951 8397 -5792 -9831 2661
6378 2661 10799 10783 2370 6877 3179 -5986 -13571 -5429 7731 6731 11620 6580 -7817 -19846 -16280
6363 -16280 -3720 170 -4481 -7995 -11065 -16094 -19588 -9535 -3641 -8521 -8440 6580 -1076 -1940 -15124
6348 -15124 -11657 -2927 -13852 -23595 -20986 -24987 -15522 3342 7110 -11195 -18226 -19963 -27828 -36013
6334 -36013 -36069 -23195 -18326 -20132 -20527 -18820 -11337 -12742 -11633 -13593 -4154 15940 22109 -4854 -16863
6319 -16863 -7497 -14643 -6144 120 9009 22955 24837 21342 17924 6012 -11555 -13917 -9930 -21805
6305 -21805 -12455 -16938 -22856 -18176 -13397 -8129 -7024 -12747 -1400 4903 -978 3413 4792 6307
6291 6307 -6282 -7128 -11228 -10829 -29 5390 -2474 -13526 -7201 -13804 -16895 2392 1205 1304 6340
6276 6340 9342 14613 3790 -1818 6031 4210 2722 751 10444 1673 -312 3001 4292 -5945
6262 -5945 -14365 -9884 6411 -1480 -9599 -10409 -273 -1814 -11708 -14488 -7577 2305 10335 13974 -2140
6247 -2140 636 -2194 -1308 -242 -9556 -1641 -9713 -8124 -18043 -20662 -9733 3541 2538 -23926
6233 -23926 -41730 -37437 -24061 -28896 -33152 -30521 -26143 -15903 -9271 -6942 5905 19614 19267 12762
6219 12762 8584 83 -14733 -10396 -8191 -2899 -6778 -2032 -1281 -4737 -4386 8473 -1549 2448
6205 2448 7941 13642 -357 -19660 -31039 -24407 -26329 -19894 -6303 11415 16764 -3250 -5098
6192 -5098 5946 18737 18328 21270 18087 16926 4522 -4278 -14820 -10803 -964 -9472 -21093 -29841
6178 -29841 -39975 -35086 -28029 -19627 -17379 -11320 -2775 9415 18528 6451 1466 4966 13744 26281
6164 26281 27441 15566 16116 24350 11160 -16603 -25376 -16388 -269 -6979 -23265 -15235 -11035 -24431
6150 -24431 -8792 -3951 -6296 2598 -2449 -4812 -14655 -15338 -526 16966 29148 20927 525 -2613
6136 -2613 -3035 692 -3600 -4678 -872 -777 4787 10551 -266 -5158 -3139 -4275 -15334 -9964 -14041
6121 -14041 -13920 -6654 -4723 5413 16901 7788 14618 6030 989 7065 1107 -1856 15556 6163
6107 6163 2085 6935 4563 16792 23935 19354 12090 486 -385 -2379 -1318 -221 6218 7932 -1786
6092 -1786 -11432 -17705 -15433 -9322 -4078 -780 -1950 8082 2022 -3318 -12927 -14420 -12336 -9159 -5922
6077 -5922 -2561 5045 13522 20747 6332 -1866 -2391 -777 3780 -1337 -8144 -16168 -12631 -8019 -2899
6062 -2899 -11216 -14245 -17774 -6140 -7450 3360 2662 5746 7524 -1910 6794 14688 22461 20890 9866
6047 9866 5382 4081 7980 -3513 -13290 -4619 -6193 -1038 5925 -2891 -4324 -1934 -992 -5021 118
6032 118 -1531 -2907 -15522 -8036 7584 20449 13515 1501 -11352 -7642 -15243 -16238 -7676 -9106
6018 -9106 -16936 -10514 -11311 -14424 -12080 -5536 -11351 -13006 -12299 -3324 -15338 -19061 -16159 2169 11415
6003 11415 2193 13390 16654 4683 -1166 -4347 -6335 -938 -2207 -1648 -3422 -4570 -8610 -3727
5989 -3727 5264 22111 21360 7889 -7443 -954 8675 5206 1666 -4125 -5604 -17327 -28779 -32394
5975 -32394 -24977 -16103 -16464 -16768 -6164 -14953 -19769 -13735 -4733 -12522 -21711 -27195 -16055 5085
5961 5085 10696 22068 13789 4798 -24617 -25205 -9332 8494 13862 9695 12345 4012 5063 5721
5947 5721 10856 4368 -11386 -17037 -22568 -12676 -917 -3968 7496 21631 25541 25032 14794 8044
5933 8044 -12402 -24423 -16152 -8542 -6634 -11132 -4916 -6188 -14129 -14975 -12411 -18413 -11560 -16597 -10721
5918 -10721 -15223 -14763 -12595 -21248 -26163 -21849 -16047 -31769 -35901 -38760 -38280 -36266 -23870 -17730 -10941
5903 -10941 -17357 -33654 -36610 -35405 -21157 732 -3863 -11826 -20744 -16895 -8761 -742 10385 8262
5889 8262 4717 3801 13570 1376 348 -3581 1750 724 3147 4537 2342 -5500 -11634 -11744 -13801
5874 -13801 -9825 -6787 -9026 -1392 5545 19911 17555 9021 3017 11102 2453 -13698 -17070 -6369
5860 -6369 -12515 -21097 -18515 -19732 -26284 -13217 -7503 -12226 -7080 -1301 -583 4639 8006 9443 24837
5845 24837 19466 8619 -4754 -13756 -5301 1045 -11199 -12243 -18117 -21352 -19584 -10663 1946 3890
5831 3890 14626 3529 -1121 -9295 6607 5897 11031 16790 5963 2990 -430 -8600 -24462 -32308
5817 -32308 -27677 -27985 -35257 -31390 -28036 -24689 -26751 -24924 -30373 -26821 -4986 -7677 -8188 -4819 6320
5802 6320 23539 21162 -4512 -14626 -21805 -24410 -22757 -26660 -16996 -6010 2295 14600 18475 21528
5788 21528 11708 11847 8149 871 -20944 -18666 -16417 -15950 -20643 -19431 -10331 -2334 -4607 -771 1372
5773 1372 5772 4259 -6531 -17294 -10151 -1974 -9297 -11528 338 -4718 -9091 -9982 1489 11708
5759 11708 15501 6005 -3557 -3836 -19604 -37631 -28821 -11718 -6312 -1307 3966 3354 2986 -351 5612
5744 5612 9141 3501 -4840 -3680 -12645 -30486 -42243 -34777 -17497 -1177 8697 2719 -139 881
5730 881 9803 9611 14309 10365 5727 1576 -7828 1741 4261 -936 -1273 -986 -5489 4384 16981 14069
5714 14069 12379 23363 19602 10134 4751 12980 8575 -8873 -14392 -2812 -10803 -18008 -15532 276
5700 276 2298 -2998 -9739 -17934 -30980 -30165 -18830 -4034 4350 13738 14217 11103 15619 11958 -7910
5685 -7910 -30890 -21416 -14358 -18027 -12925 -5652 4781 4960 10606 12062 -261 -7482 -1041 -8359
5671 -8359 -10211 2478 -7108 -8475 -9874 -8475 -20662 -26183 -22898 -14835 -5353 -3099 -204 -7286
5657 -7286 -12319 -2080 17065 14940 11350 9260 6082 -5915 -8092 -21513 -18216 -4418 1652 2192
5643 2192 -3939 -13894 -7165 9593 20821 15746 6101 -487 -174 -3365 -8390 -2390 -85 -1894 9657
5628 9657 18306 15309 11306 -1849 -12945 -14449 -17877 -12349 -13109 -15927 -17341 -15898 -13586 -23606
5614 -23606 -34211 -40278 -24737 -15672 -16798 -10914 -13998 -21563 -20879 -16488 -9250 -5577 -15740 -32801
5600 -32801 -29462 -25371 -24202 -7371 2989 -622 -1759 923 -4773 -10425 -12870 -11610 -11028 -3781
5586 -3781 -8775 3281 1972 2075 3774 5105 5037 4160 3551 8650 -7260 -16282 -16850 -24708 -31927 -22449
5570 -22449 -13395 -12332 -7285 -2131 19532 18271 4805 -4256 1924 6669 5267 6588 4703 -2993
5556 -2993 -4719 5259 14478 -5742 -11726 -9203 -11403 -9144 926 -2572 -7970 -18835 -22078 -15121
5542 -15121 -2439 6148 8117 10941 14718 8134 14481 9570 12168 21150 18124 13514 3102 -6102
5528 -6102 -14009 -3916 2414 654 4833 11579 24639 5064 1881 10753 14398 1328 3487 2575
5514 2575 467 -529 -1182 -7288 -5560 -7700 -12608 -22952 -21502 -21685 -27438 -26332 -19043 -6203 -5677
5499 -5677 -8868 -11592 -13662 -11854 -6868 -391 -3903 2680 -2640 -5413 -2699 -3708 -2745 -10615 -9238
5484 -9238 -5976 -448 2817 402 5403 3910 3569 14233 15779 13667 20851 12957 -905 -1324 10896
5469 10896 12441 16667 17847 4439 -8644 -16496 -3588 -2622 -7581 -4464 -8822 -14094 -17908 -16997
5455 -16997 -2324 16933 14752 34 -3752 -1007 -3883 6517 3135 4178 -13469 -13014 77
5442 77 -9913 -16201 -7929 -8530 -13990 -14584 -20279 -15878 1949 -4132 -19204 -13118 7401 9652 12784
5427 12784 17597 15514 18200 20412 18765 17952 12354 17387 20508 16239 12919 9504 7693 -6981 -15220
5412 -15220 -17862 -15930 -6721 -5483 -11671 -1450 17220 20435 15671 14898 6408 1075 2631 -5555
5398 -5555 -13918 -7256 -10406 -8423 -16695 -23578 -20712 2089 16174 15462 -485 -3282 -23372 -31359
5384 -31359 -13409 4746 8199 2914 -3414 4373 16976 16547 432 -16374 -31523 -47904 -38042
5371 -38042 -17829 -6580 -10163 -717 -2260 -2945 9613 14440 5277 7577 16671 17944 26033 19442
5357 19442 6082 4970 10135 3988 -3339 -2027 1569 -15970 -16441 -19057 -19111 -20530 -22692 -12963 -20745
5342 -20745 -27067 -15778 -7226 -10789 -20418 -16989 -8736 219 1174 -11101 -19947 -18942 -14835 -16947
5328 -16947 -13557 -7274 -4234 -13338 -8118 1067 1558 -13594 -42289 -34492 -23952 -16790 -10884 -3855
5314 -3855 -12734 -10126 4609 4308 8291 -3017 -3858 7642 9833 446 -10843 -9967 4032 3902 5967
5299 5967 19340 4662 -14051 -9365 -1202 -3143 -19692 -15665 -5447 -4841 7211 14537 13945 9023
5285 9023 1439 -7557 1074 335 -955 -15555 -14974 -5482 3362 7868 11508 6920 -18412 -25951 -26046
5270 -26046 -32508 -31637 -23085 -19053 -11842 -10240 -21413 -22405 -15208 -19468 -29379 -21311 -15374 -24827 -17541
5255 -17541 -10954 4916 -1424 2376 -1508 -6138 -5344 -4627 -7901 2002 8702 6218 844 7265 5514
5240 5514 5463 -2465 2776 7025 5774 -16973 -17086 -6516 -3533 -8913 -4516 1532 -9920 -13805 -7539
5225 -7539 -2692 -45 -3269 -4746 10005 12786 1933 2013 1393 -25 -5095 -8130 -14947 -14227 -10807
5210 -10807 -16000 -14387 794 5469 -8185 -5351 1883 8186 -232 -15331 -6283 -9228 -16890 -18230
5196 -18230 -24512 -24123 -11626 6220 13887 1725 -10570 -6233 4513 -4508 -15261 -8544 -2763
5183 -2763 18773 10701 8583 -8336 -17903 -15391 -31475 -19696 9683 9420 1094 1333 1470 1365 -6776
5168 -6776 -7895 -13931 -22364 -17821 2350 -8001 -23649 -22781 -7928 8013 8733 7672 5237 -4880
5154 -4880 -14490 -18299 -16946 -9613 -2506 5927 5590 5859 1873 -2368 -11232 -11187 -3047 10181 9529 -7573
5138 -7573 -23282 -15271 -7520 -20308 -11647 -4103 -2724 4695 4576 10696 16544 1084 -2048 2784
5124 2784 -4677 -756 -3282 -13564 -9414 -12350 -27419 -31591 -27122 -19569 -8575 353 -3814 -3366
5110 -3366 653 13639 15591 15066 5423 -11296 -12876 -837 -8286 -20100 -24298 -21727 -20913 -19612
5096 -19612 -4460 4314 2634 -8759 -12963 -7082 3392 6162 -12153 -17085 -8975 -2820 5887 13994
5082 13994 10840 -240 -8694 -23259 -23849 -1822 3020 -13510 -36653 -35789 -38364 -30557 -13653 3184
5068 3184 -6681 -7770 -11417 -10599 -6809 -8350 -11610 -5085 -1729 3921 -619 -8512 -18215 -12372 -13314
5053 -13314 -11176 -3924 -2793 -1856 -6757 -20955 -27561 -22536 -19756 -14357 4017 3849 -267 4626 4757
5038 4757 -7240 -9182 -4720 -11434 -11703 -18185 -19565 -20939 -26402 -23868 -22460 -14394 5565 16031
5024 16031 21090 19132 17149 3254 -1080 11614 18999 23467 21490 9209 20346 26616 17121 23564
5010 23564 18907 13480 6083 9064 2310 -5067 -3255 -12539 1228 336 -12251 123 8057 2487
4996 2487 -8545 -14896 -12306 6251 3730 1567 395 -5843 -18109 426 9279 6183 -9375 -6949
4982 -6949 3745 -6500 -19710 -28466 -25069 -24478 -16490 -27620 -34346 -21400 -8681 -2179 2213 -6500
4968 -6500 -4780 -2645 6254 13194 23533 18957 7587 164 -16805 -19573 -18959 -4977 12186 7124
4954 7124 4060 1413 6381 3190 407 -6275 -19394 -22581 -19653 -8701 2539 -1411 -5023 -7259
4940 -7259 -17002 -24640 -15375 -4482 235 2543 -14891 -18058 -7178 3258 -2910 -3810 -3808 -4671 -2163
4925 -2163 -15137 -4862 10175 10936 39 4594 1850 -7492 2027 4690 8030 25337 21268 11112
4911 11112 -769 -10467 -1398 3897 5619 11052 11024 8171 12279 2492 -11256 -26166 -29518 -33983
4897 -33983 -26009 -10131 -3205 -10483 -16280 -18067 -16071 -7712 -9567 -13482 506 3651 11558 16317
4883 16317 5033 -3217 -11540 -16773 -24330 -14289 -12227 -10255 -10144 -16409 -18010 -14403 -12553 -10691
4869 -10691 -8030 -16787 -26811 -35135 -19907 4719 2861 -316 5379 164 -8407 -10262 -12238 -6926
4855 -6926 4018 2782 2416 -8005 -5715 -17635 -21260 -12389 -23895 -31560 -12228 -2033 -8284 -12440
4841 -12440 -7747 -9690 -3622 -1948 488 -3957 -4777 8940 3794 -13982 -24103 -12983 -10048 -12781
4827 -12781 -556 11127 7805 1885 -470 6446 4 -8355 -5397 -11208 -21047 -22882 -7676 -11938
4813 -11938 -23001 -9466 -13137 -22647 -29910 -25443 -28158 -18390 -2244 1040 -1546 -8400 -8539 -4454
4799 -4454 5577 2568 12908 22719 13636 -4896 -8545 -57 -6333 1402 6574 9363 7729 8440
4785 8440 -4025 -18248 -10948 -11352 -2786 10026 9611 11264 15010 6837 5279 5583 -4142 -8070 -13306
4770 -13306 -17144 -14374 -4762 4505 -6662 -14901 -22241 -36672 -37063 -19586 1816 2220 4978 8465
4756 8465 11838 12478 6471 7052 8470 9218 -7156 -11277 -7666 -11382 -13768 -14519 -14274 -19817 -24655 -18065
4740 -18065 -3478 3485 -4855 -3811 3699 -8138 -29884 -23418 -12410 -4735 4039 4345 4742 9533
4726 9533 5046 -3843 -5798 -12702 -8822 11239 4586 -8771 -12938 -17664 -24151 -23062 -20186 -17250
4712 -17250 -4734 -4344 5361 5210 1654 -592 -9271 -3011 -7423 -8233 -6819 -5997 -5189 -6889 -8739 -510
4696 -510 -8661 -3944 -4739 -14261 -27201 -21420 -27484 -28826 -25168 -9331 13194 7443 -5668 -9380
4682 -9380 -6106 -266 12215 34201 38253 24406 24973 15270 9569 -6236 -13671 -22493 -16198 -5138
4668 -5138 4979 6937 4746 -523 -7030 -8793 -8854 -6854 -3404 1500 -13953 -14839 -8853 -12396 -4160
4653 -4160 2565 4564 -5812 -24940 -16000 11777 12082 -12729 -25125 -17597 -4892 15813 20805
4640 20805 26067 25034 24495 3819 -8504 5981 2794 -1775 -6608 -23230 -25134 -19339 -29376 -29003
4626 -29003 -26572 -28425 -14961 -27199 -23857 -17663 -22382 -26864 -14238 6667 -2476 -12346 -5364 -6437
4612 -6437 -5601 -5278 -7945 -10006 -16884 -33227 -35000 -21136 -9379 -3982 -13612 -15007 -16686 -16022 -27528
4597 -27528 -6259 2455 -2042 357 -6519 -16145 -16808 -10143 -3636 -17690 -29103 -22489 -19549 -9965
4583 -9965 -3386 -4248 -10148 -8477 -20494 -18012 -9075 -23616 -24057 -16470 -17972 -16970 -11821 -9803 -9918
4568 -9918 -1908 -157 3197 -14561 -8518 -8547 -5164 -13371 -15353 -17657 -11581 -10716 -11447 -13249 -11042 -15522
4552 -15522 -5287 -2284 -11134 -10444 -2262 -7931 -18433 -16810 -1806 -20745 -42728 -42952 -24996 -20949
4538 -20949 -31167 -35279 -31381 -8185 -5693 -269 -4289 -26449 -29027 -20179 -17507 -7391 -5040 -12719
4524 -12719 -2751 11277 20852 8355 4409 1883 1634 -4135 -8320 -7345 -13237 -6895 -1395 -6656 -2080
4509 -2080 -690 -4226 -718 -7740 -8364 -5094 8043 17802 13304 -6591 -16004 -12979 -5848 -17824
4495 -17824 -16711 -19782 -4413 11930 9783 5149 6975 7967 8761 11575 9097 12864 9568 4117 70
4480 70 -3057 6799 9746 3889 6543 15950 10499 -8114 -16382 -15620 -6402 5298 -9338 -5884 -7968
4465 -7968 -19954 -9965 -1151 2330 3164 5864 -310 6754 13389 11633 -3459 4465 13354 15409 14982
4450 14982 17314 11026 17652 22307 22178 25112 25207 22012 16477 2315 -4104 -7762 -15050 -16217 -20173
4435 -20173 -9426 -13327 -19666 -12485 -7606 -16159 -14399 -8092 15687 22411 7065 -1983 2695 14981
4421 14981 13362 11995 19014 8573 9460 1221 -2419 -18894 -12213 -3438 -11990 -11680 544 9589
4407 9589 11353 14642 19226 13818 6741 11719 19265 15248 13757 1500 -6230 -14086 -20159 -21329 -14645
4392 -14645 -3755 -1293 -10403 -1264 -9977 -26148 -27426 -13767 -5590 6666 12814 -10305 -9822 2335
4378 2335 -8887 -8800 -3308 -12920 -18008 -5262 -7563 -6856 -4854 2888 5705 3073 9503 15481 11079
4363 11079 8956 822 625 2339 3802 -9839 -9421 -17067 -14537 -3751 4651 5370 3789 -9191 -4868
4348 -4868 4992 -634 -3514 -9309 -21522 -20331 -22117 -26644 -35629 -27537 -20515 -22743 -16835 2332
4334 2332 8873 1664 -3829 4509 4638 4317 -841 -4817 -13064 -4923 -9015 -8525 -5249 -17583 -20443
4319 -20443 -18015 -11269 -770 14797 18582 11758 7921 11184 2477 -5261 -2965 -7671 -14334 -17892
4305 -17892 -18497 -13562 -12841 -11507 -14590 -12406 6634 19825 6465 1384 -1249 3367 5162 13553
4291 13553 19121 -4328 -18452 -17480 -5787 -2247 3873 13147 7578 12165 2008 -1182 -5313 -2434
4277 -2434 -1980 6580 8346 8545 -3529 -56 -1839 -11035 -85 -6573 2881 11686 136 4494 1349
4262 1349 4039 -11609 -14044 -19718 -2059 19951 25791 13575 -2634 -936 20544 23888 13027
4249 13027 14702 3514 6118 16380 17854 5989 -11347 -14701 2683 -11330 -12045 846 -4702
4236 -4702 -10057 -5420 4894 6670 3172 -350 -10523 -16289 -4585 -16227 -21421 -3886 3677 -1276
4222 -1276 -17878 -1141 7444 -9194 -17072 -12390 -8358 -6792 -8029 -7175 -18008 -27241 -14047 -9793
4208 -9793 -14587 -9015 1751 3757 -10223 -518 3725 -2548 2011 1230 5382 -5588 -3680 -9205
4194 -9205 -26327 -24854 1228 -6446 -9774 -6436 -7536 -20106 -22927 -19349 -25459 -25914 -2679 9665
4180 9665 -3348 -8795 -6286 -2018 10482 14823 17861 14274 16869 18328 12930 18375 13751 6918
4166 6918 76 1356 9839 10147 1055 1005 9674 3746 -6847 -9052 -3158 -9368 -1707 -942 -13789
4151 -13789 -17784 -8768 3585 12153 -2408 -17966 -31356 -37992 -24748 -12869 -11481 -5503 -1945
4138 -1945 -7643 7710 25155 31996 7449 -16375 -21715 -41633 -60112 -56893 -47072 -32200 -26475
4125 -26475 -22036 -19141 -13009 -9582 -13507 -17517 -19103 -10334 1593 -143 -3272 5132 1793 -4252
4111 -4252 1234 -1052 -13444 -17794 -15658 -14281 -26705 -18064 -8053 -3592 2658 1658 -12658 -23186
4097 -23186 -9956 -9096 -17791 -1490 7560 7353 1571 -1585 4437 -1384 -10185 -11670 -3793 6648
4083 6648 14505 11021 2431 -7578 -14152 -16330 -638 -5105 -6462 -9552 -10440 -19651 -14819 -5384 -13658
4068 -13658 -17005 -18832 -18260 -10238 -18855 -26016 -24151 -17388 -23530 -40917 -37992 -17707 -4203 -2919
4054 -2919 -7315 -15844 -17023 -9592 -20172 -24158 -28716 -23087 -15920 -4309 -12651 -18734 -10985 -1250
4040 -1250 -3200 -17759 -13990 -10683 -17426 -10298 4192 12628 11322 12865 86 -2754 1416 -6231
4026 -6231 -13310 -6482 3657 15151 9215 -427 -2806 871 2795 2360 9852 10669 22639 13378 1536
4011 1536 -4471 -7043 -11791 -16053 -12144 -5064 -2953 -5753 -8723 -5172 -7844 -2299 8600 17619 18850
3996 18850 8346 10624 18225 11754 7931 -5355 1079 548 -1251 -2123 -1698 -2568 -5208 -4484 -6
3981 -6 2453 788 7969 24147 25771 10128 -1510 464 9970 8078 5184 22188 20469 8425
3967 8425 14716 8163 9054 2499 -6154 -10413 -6754 8310 13406 6465 -2314 -9968 -15279 -31050 -27170
3952 -27170 -22597 -11871 -11124 -9543 -5018 3008 -2619 -18975 -32669 -16007 -13094 -11570 -15266 -22157
3938 -22157 -29501 -26730 -30391 -25523 -25245 -14591 -124 9962 2174 0 8018 22958 15281 3498
3924 3498 3966 7088 2245 -10787 -19720 -11767 4887 23515 28012 10112 -4679 -2596 889 5478
3910 5478 7785 7406 8313 4617 -4164 -8177 -10300 -7248 201 -720 1242 2645 8612 -5251 -12701
3895 -12701 -6343 8105 21169 10829 6127 520 -10973 -6982 3632 -12941 -22607 -23901 -12587
3882 -12587 -2397 3169 8261 8446 14160 22805 26317 27238 20599 -2601 -17545 -15415 -26480 -21099
3868 -21099 -16524 -8122 4762 4824 3986 7133 8394 -2447 -7072 -2925 -8583 -23349 -25853 -16153 -1928
3853 -1928 1088 16655 37893 31220 15879 3851 -12237 -9776 -3459 -7231 -24388 -27061 -20251
3840 -20251 -21676 -24216 -10148 -11903 -14500 -10495 -6020 -16353 -12951 19151 15053 3654 5136 999
3826 999 5726 1463 -4331 7002 2288 -15090 -22814 -19412 -20176 -14648 -8853 -1602 107 -5212 -6761
3811 -6761 -6726 -8494 -7307 1932 -1121 -10069 -11880 -4781 -1915 -3664 1675 -4147 -1161 1382 -2653
3796 -2653 -7140 -5864 -13168 -13801 -4406 -3584 -15862 -11085 -6104 -1501 -2261 -14296 -6162 9483 -112
3781 -112 -16009 -27582 -21217 -24587 -22336 -5450 10310 10990 1524 -1008 -5960 -4993 7823 11353
3767 11353 10980 648 -6898 -14370 -6819 -7737 -6117 2146 2605 5576 5513 18453 13995 9642 6757
3752 6757 6062 2885 6120 -7212 -9793 6374 5593 1455 -1131 5400 -7718 -11064 6104 4852
3738 4852 3511 4393 -2290 375 14293 6748 5277 10705 1427 2049 13886 16510 12779 -2303 -1641
3723 -1641 -11307 -13241 -10589 -8332 -13675 -6482 -3043 -13605 -23062 -24313 -26723 -15980 4342 12540
3709 12540 21398 5684 -2409 3023 -5160 -6554 -15429 -24755 -15595 452 2406 -9442 -15432 -19090
3695 -19090 -15699 -11883 -15475 -22895 -31050 -21764 -7612 -2708 -2073 4892 2495 10422 18587 6229
3681 6229 -3627 -4978 -3111 5892 -123 -26405 -27278 -19806 -24673 -33866 -30150 -19195 -25006 -36194
3667 -36194 -34028 -33056 -27592 -30850 -4921 2838 366 4881 -3334 -12952 -20975 -25922 -30661 -25703 -26821
3652 -26821 -30199 -21508 -20856 -15180 87 2837 -5120 -22773 -19413 -1489 -9064 -8490 -6071 1201
3638 1201 -3238 2904 -4891 -5669 -5807 -2653 7293 16653 10498 -3519 1302 -2437 -13563 -12016 -10150
3623 -10150 -21711 -16210 -15177 -11836 -672 4389 6136 1605 780 2194 -4504 -9055 -6763 -5658
3609 -5658 -18131 -16458 -18459 -28882 -18389 -21656 -7898 5500 -167 -5627 -8522 -1385 2638 -12726
3595 -12726 -15239 -6762 -4496 -10021 -3397 10298 -1298 -6657 -10710 -7303 465 -8245 -16707 -17057
3581 -17057 -21100 -27590 -26596 -23753 -7647 -11153 -6550 -5102 -13317 -21401 -18230 -26810 -16397 -7419
3567 -7419 -10608 -14501 -10449 -17903 -10830 -5497 7338 11630 10062 4047 9518 8599 7329 -4524 5316
3552 5316 12742 1678 -2672 -3338 -5706 -7826 -10721 -6223 17481 29350 25238 24614 20587 20709 12906
3537 12906 9499 2113 -2779 -8816 -4701 -12193 -16958 -13421 7304 2889 -3379 -12722 -7870 -7171 -15218
3522 -15218 -24857 -33121 -18580 -13469 -6265 10540 8358 -8601 -11148 330 2530 6050 6321 -6305
3508 -6305 7187 -1814 -13165 -15856 -1442 1002 -7588 -1045 1740 16917 15182 35 -5727 -14800
3494 -14800 -6238 4266 10857 21425 11761 101 -2395 -3227 -8397 -2537 3716 13024 6608 -3630
3480 -3630 -15743 -16371 -22747 -27125 -15991 -10350 -13444 -21168 -18113 -13232 -2303 -6071 10036 -1784
3466 -1784 2236 9477 3416 -1396 2881 -4287 -16320 -17390 -5131 722 -1259 -10221 -8683 -20578
3452 -20578 -18096 856 7954 4083 3691 -6551 3822 3381 -9661 -8941 -3401 -1633 -8940 -15758
3438 -15758 -7659 3896 4362 6308 -3207 -13705 -13290 -11377 -6248 -5777 912 -6061 -15426 -16903 -15191
3423 -15191 -8637 -21137 -22169 -2297 4209 1384 -7512 -11796 -13694 -10418 -11159 -6568 6148 5415
3409 5415 4343 -11887 -13746 1899 -733 6443 614 -1013 295 7463 9386 14876 6034 -3678
3395 -3678 -3268 2658 11270 18846 16951 1391 -9987 -12589 -1404 -8724 -3610 -4117 -8158 -697 4508
3380 4508 1494 2297 15748 13504 6900 11941 5392 10519 14519 5333 2236 2635 -24 -11224 -15837
3365 -15837 -23589 -15177 -11417 -2141 16 -6052 4608 5692 733 -16869 -26629 -20660 -3961 -97
3351 -97 -5639 -19380 -28315 -18350 -5427 -3291 -5554 -4187 -3541 2440 -1528 -5397 3411 -3920 -12717
3336 -12717 -23540 -28887 -9017 -41 -12276 -22996 -9283 -239 6774 8486 6877 6529 -2908 1207
3322 1207 -389 3654 3958 2223 -5850 -6644 -10834 -3920 -4096 4489 13075 3498 6646 4017 11539 14848
3306 14848 7062 7349 5804 -6345 -15669 -11274 -4665 2763 16225 7861 -12029 -17556 -7038 -15201
3292 -15201 -7377 -1999 -9580 -13169 -17386 -26268 -28644 -14988 -2350 2699 -9388 -7316 -14284 -25041
3278 -25041 -38090 -35376 -33499 -35813 -20800 -4293 503 13240 29053 24222 6176 -7466 -6157
3265 -6157 -2538 -3302 -11939 -15022 -14814 -8009 -807 -5227 -13698 -9189 -6339 -11084 -1494 -6635 -12226
3250 -12226 -7755 4008 5709 -4414 -3872 -4059 -1060 -5998 -17982 -11312 2893 7906 7114 2913
3236 2913 2105 4632 1605 -6307 -1086 7303 -5432 -24296 -26971 -12968 -11292 -11236 -9954 -4605 -3581
3221 -3581 -523 13215 20224 14750 -390 -2259 -11192 -11128 -17418 -8199 -6059 9287 11811 -1975
3207 -1975 -5716 3872 5704 -3254 -253 4230 7413 11658 16986 8938 893 -1720 414 496 11163
3192 11163 976 -2235 8789 8231 -1639 -5664 -13551 -11407 -18623 -17525 -13386 -370 3719 4655
3178 4655 -1524 654 4249 14662 6475 2292 4130 -61 -13436 -28826 -22115 -5670 2046 2878
3164 2878 3598 -1263 -15011 -26602 -14075 406 2487 -9770 -12789 -18433 -29482 -9998 10151
3151 10151 -1419 1124 11394 -3976 -16826 -13515 -10999 -8941 -10457 -6643 -1495 -7226 -13253 -7114
3137 -7114 1530 956 -5477 -3175 -2744 -20388 -17291 4478 14231 13457 21211 21715 24414 28864 15041
3122 15041 1132 1780 -9853 -13805 -16209 -11873 -2179 -3272 -10471 5787 14514 10669 5694 7016
3108 7016 -2483 -7971 3208 9665 8284 6980 12230 7612 -4655 -15027 -29965 -24917 -13016 -3225
3094 -3225 -4199 -3726 -12925 -15330 -2241 5004 51 -3224 4716 12917 10657 8837 8692 2057 -7886
3079 -7886 -8237 -1853 3917 -1747 -7735 -5551 3321 999 14371 11943 -3142 -4610 -16281 -32436
3065 -32436 -33166 -19779 -13247 -11358 -4204 5002 5047 23855 35101 15568 7413 12475 3001 5726
3051 5726 10731 15240 21965 3550 -21676 -14732 -2616 3842 -10758 -22704 -14529 -11279 -8343 -5819
3037 -5819 -293 -4625 -2845 -262 -8489 -20114 -24364 -20883 -5199 16483 18006 16602 11859 2579
3023 2579 -1441 -5231 -13022 -15394 -8391 -6003 -7089 1020 1936 -4025 2646 4795 25203 28586 15686
3008 15686 592 -5037 -8290 -1779 -477 -9509 -9731 -7707 1125 6956 5642 4942 1019 -986 2125
2993 2125 -1421 6710 11614 11739 16935 18284 8577 12893 5015 -11346 -15059 -27935 -16642 -6633
2979 -6633 2963 -13157 -30950 -17054 -9182 -6704 -4177 4593 6814 16044 27594 12361 640
2966 640 5406 4654 54 -9006 -12287 -6927 -19094 -19114 -26436 -13936 -10069 -19465 -20016 -15822 -10511 -13101
2950 -13101 -10097 -10158 -6896 -16477 -16840 -8971 -4736 -8715 -14404 -4706 1849 437 -9528 -5207 2816
2935 2816 10951 19375 17427 7197 18792 27189 22452 19936 17671 12425 4447 -26437 -28439 -15599
2921 -15599 -27226 -30304 -17250 -18692 -5601 7326 2520 87 -8641 -2079 -6413 -8674 -9357 -13431
2907 -13431 -9062 -12652 -14637 -11975 89 -2364 -9008 -7679 3169 15559 14672 9314 -4226 3724
2893 3724 5246 11921 -348 -20248 -1836 14016 19490 23862 18910 1921 -3050 7776 11299
2880 11299 11945 6212 11844 17362 30448 16381 6413 12192 12279 6762 -2321 -9786 -6414 -2133 -4423
2865 -4423 1166 5878 835 4043 12683 8508 -4190 -9671 -5971 -884 7520 10503 6035 2860 -2401
2850 -2401 -13389 -17254 -20261 -31097 -13843 -5389 -10932 -8906 -8274 -21160 -29169 -9548 -7984 -19968
2836 -19968 -25478 -36312 -43193 -19545 -6726 -4240 -4584 -2340 -3326 -3669 -8978 -6672 4772 849
2822 849 -22735 -33149 -22513 -18981 -14727 290 -936 -9234 -13359 -12806 -19137 -21312 -17255 -15172
2808 -15172 -14188 -12896 -25677 -18977 -16226 -14826 -19920 -14361 -10972 -24078 -22909 -10999 -10431 -11566
2794 -11566 -7432 -9267 -16590 -10826 -10625 -8763 -3005 -4528 -10814 -11284 -9179 -8068 -6467 -12374 -1402
2779 -1402 4939 6463 3792 -12796 -10436 2540 -8078 -19404 -23660 -28439 -16970 -21336 -17040 -19202
2765 -19202 -20440 -8127 3288 6430 8668 7762 14045 8422 -3182 -1715 -2430 -4552 -3601 -16221
2751 -16221 -6933 -12186 -10365 6029 17512 8860 -12829 -27631 -28852 -18954 -4515 4498 4412 9166
2737 9166 5105 -2540 -13538 -9567 -10413 2193 -16446 -18626 -4562 -5346 -5239 841 5618 9048 -835
2722 -835 -11965 -500 12573 25079 23611 28228 27778 16043 14634 24496 18488 13823 19431 19540
2708 19540 22445 17258 26890 21451 6332 -1496 4513 -6196 -5059 2578 -3009 -11638 1235 4730
2694 4730 -2172 -9084 -10590 -7255 1704 17031 23848 14204 11156 10381 14284 8904 26102 29470 11567
2679 11567 12490 15882 8218 -15010 -25857 -26906 -19798 -16192 -23309 -24650 -20253 -7144 -8382 -16145
2665 -16145 -5741 -10556 -19705 -16254 -3374 3396 20328 22687 10097 -6887 -21239 -25927 -7528
2652 -7528 9932 14866 24531 34403 31268 19581 8339 -5198 -13410 -17296 -14960 -18299 -26202 -14072
2638 -14072 -3466 11710 -3112 -14026 -4929 1347 -5310 -14287 -9707 3568 10375 3722 1388
2625 1388 880 8031 2524 -2810 9557 15609 16350 7673 5923 6914 18562 21137 -1125 -13206 -9965
2610 -9965 -14898 -17495 -11209 -8282 -5135 1701 5123 8289 3656 7341 -2721 -13399 -17554 -1307
2596 -1307 10233 -1786 -12206 -10589 2418 -573 -1854 -1936 3260 12475 21324 19594 5620 -1389
2582 -1389 4548 -459 2031 -6130 -4548 1268 -519 1173 -16103 -34465 -31344 -19950 -13280 -474
2568 -474 16875 19900 2759 -8841 -1411 -9229 -2089 3341 16945 2530 -18239 -11605 -3850 5439
2554 5439 -974 -10412 -9680 7882 18104 15847 13069 10096 2570 -41 -886 6557 2036 -4965 -14543
2539 -14543 -17316 -7372 -10322 -24839 -10446 7832 12618 637 -13220 -16042 -9535 -2357 2399
2526 2399 9045 9876 11303 6380 5936 7410 18064 13255 7757 -4555 -13549 4684 12035 28488
2512 28488 28605 10156 -1563 -24682 -21220 -9458 6270 5067 681 2388 -14395 -21608 -19125
2499 -19125 2812 9816 5153 8323 9806 552 -3627 -8554 -12703 -13364 -10148 -12149 -10754 -11636 -10909
2484 -10909 -18890 -18441 -7232 -11541 -22427 -17316 2928 6939 1011 973 -6455 -18680 -19813 -9155
2470 -9155 2421 11015 10880 11165 4180 -6022 -7249 6288 2922 13305 7776 -340 -2763 -15129
2456 -15129 -27422 -18163 2048 1537 -5363 -879 7594 6331 10560 1117 -14776 -25273 -24589 -2816
2442 -2816 4820 14339 13107 3623 -18634 -23224 -21786 -14133 2790 20 -16506 -20987 -15430 7786
2428 7786 17643 14331 14743 13248 8996 -1559 7253 14235 13316 10555 -1142 -16008 -14811 -9816 -14519
2413 -14519 -17319 -9451 -5583 -13652 -21582 -12191 -7156 -6709 -3172 412 3492 -688 3670 1694 7797
2398 7797 -1376 -5768 -1312 5485 8126 13003 4956 -13471 -9417 -2424 -10202 -1921 7606 10357 734
2383 734 1738 2755 -860 1536 -3157 -3011 429 4738 6695 3593 -302 -7948 -7609 5744 1067
2368 1067 -9235 -10492 -2789 1964 3231 1457 -4136 -9640 3177 -5879 -7895 -13192 -7484 -6975 -10607
2353 -10607 -15793 -16048 -8990 -8847 -3319 15300 28797 24655 12097 5341 -10857 -17141 -2671 9973
2339 9973 4896 3835 -5202 -4629 -1553 6344 8543 7790 -3754 -21757 -18000 -22534 -24780 -13605 -5993
2324 -5993 -9038 -10144 9739 14427 13090 10284 22970 36400 25911 20678 11463 2155 9989 882
2310 882 -14328 -9784 7659 3505 -4952 -18205 -25029 -20438 -11976 -7202 5997 985 -13062 -17459
2296 -17459 -12639 32 4570 3480 8216 -6550 -11284 -20518 -16551 -300 19628 24666 29123 23085
2282 23085 14214 -1598 -12139 -15343 -8315 -13841 -19561 183 16430 12276 20812 20143 -4106 -7352
2268 -7352 -7256 -6260 2949 -3801 -6629 -14652 -17039 -670 -2841 -241 8541 17982 7371 -4312 -1214
2253 -1214 -17419 -25584 -23086 -12412 -10274 1008 4730 -10939 -3672 1936 8196 2895 4712 6728
2239 6728 10480 5993 4372 6885 -3794 3508 17580 25416 18277 11734 11178 8474 13663 8943 14974
2224 14974 23717 17370 3557 5055 17898 4966 -7716 -3550 2504 9513 14585 14036 6593 -12575
2210 -12575 -21577 -15139 -17913 -13680 -4203 -3122 -6250 -19021 -29340 -23100 -12563 -13960 -22768 -24318
2196 -24318 -24987 1689 5541 3108 1321 -1151 -13179 -4584 5853 4536 5629 17035 21946 18177
2182 18177 0 -8442 6344 18954 12410 1787 -3986 -7522 -20379 -13435 2268 8388 -3530
2169 -3530 -8000 -6156 1386 8305 7887 12375 13295 11499 11399 4830 2183 1478 10061 10646 5874 17862
2153 17862 20028 12092 -2026 -8329 -12049 -19342 -17377 -9729 -5964 -7815 1393 8443 8692 329 -6024
2138 -6024 -13010 -6098 2451 10668 6592 -5492 -11928 -22118 -19768 -12345 437 1001 6268 -85
2124 -85 -5303 -7651 -5805 -4640 -3601 2587 -7888 -20139 -11592 -3967 -2667 -8264 -4572 -10114 -9534
2109 -9534 -8871 -19876 -23045 -19999 -26325 -23184 -15668 5199 27316 19686 17044 13171 11916 10137
2095 10137 -2193 -8944 -575 -3987 4264 11247 15701 6809 3597 -4074 -13690 -22524 -15211 -5094
2081 -5094 -10572 -8465 3436 1361 -6869 -11767 -10856 -4535 4458 13843 10450 5705 13991 10515 7842
2066 7842 1740 8237 8864 1133 10759 17838 12488 9213 5478 18467 18805 17676 14015 2951 2873
2051 2873 556 -3672 -4749 -7685 -18594 -35894 -27180 -6076 5933 4083 5917 16687 9226 -1747
2037 -1747 -9464 -575 -4038 4453 14419 -1001 -1760 9544 9449 -1023 -6796 -293 -2420 3237 9733
2022 9733 4024 -3464 -10985 -13930 -13595 -12797 -13013 -4277 -5250 2609 -6737 926 13903 2782 -8660
2007 -8660 -7156 5816 10101 11585 7983 3877 -3443 -5837 2153 4303 12697 17631 16470 8005 10725
1992 10725 9645 3090 5997 9603 9379 -434 -5689 -12220 -6236 659 11211 7589 19548 28741
1978 28741 27328 16097 3624 -2785 -5133 8882 5531 13563 7557 12664 11592 6487 13195 21930
1964 21930 28980 27412 10056 -964 -8117 5941 18431 17639 6250 -9285 -17344 -23579 -26384
1951 -26384 -9724 10041 2941 -5451 7508 6831 2628 14713 10214 -3411 -9706 -20393 -26929
1938 -26929 -17222 -2458 -5149 -19770 -25988 -24380 -16030 -1459 -2990 9385 11056 2457 2656 8113
$$ [...]
##END NTUPLES=NMR SPECTRUM
##END=
