##TITLE=Analysis number 319599
Compound Code cc 47124
Book Reference 437/82/5
Project Code adrs
Chemist Name wendyb
##JCAMPDX= 6.0         $$ Bruker NMR JCAMP-DX V2.0
##DATA TYPE= NMR SPECTRUM
##DATA CLASS= NTUPLES
##ORIGIN= Bruker BioSpin GmbH
##OWNER= nmr
$$ XWIN-NMR		Version 3.5
$$ Mon May 22 09:14:10 2006 GMT Daylight Time (UT+1h)  MAYBRIDGE\nmr@NMR_250MHZ
##.OBSERVE FREQUENCY= 250.131544655141
##.OBSERVE NUCLEUS= ^1H
##.ACQUISITION MODE= SIMULTANEOUS (DQD)
##.ACQUISITION SCHEME= undefined
##.AVERAGES= 16
##.DIGITISER RES= 18
##SPECTROMETER/DATA SYSTEM= dpx250
##.PULSE SEQUENCE= zg30
##.SOLVENT NAME= CDCl3
##.SHIFT REFERENCE= (INTERNAL, CDCl3, 0, 16.4491)
##AUDIT TRAIL= $$ (NUMBER, WHEN, WHO, WHERE, WHAT)
$$ ##TITLE= Audit trail, XWIN-NMR		Version 3.5
$$ ##JCAMPDX= 5.01
$$ ##ORIGIN= Bruker BioSpin GmbH
$$ ##OWNER= nmr
$$ C:\u/data/dgb/nmr/ADRS/4840/pdata/1/auditp.txt
$$ ##AUDIT TRAIL=  $$ (NUMBER, WHEN, WHO, WHERE, WHAT)
(   1,<2006-05-22 09:13:44.62 +100>,<MAYBRIDGE\nmr>,<NMR_250MHZ>,
      <created by zg, POWCHK disabled, PULCHK disabled
       configuration hash MD5:
       84 BC 41 DB A1 6E 1D 46 DA 25 12 A5 C1 ED C5 3A
       data hash MD5: 64K
       52 EF BB FA 59 99 8F 9F 7F DA FF 03 DC 1F EB A5>)
(   2,<2006-05-22 09:14:00.16 +100>,<MAYBRIDGE\nmr>,<NMR_250MHZ>,
      <Start of raw data processing
       ef LB = 0.3 FT_mod = 6 PKNL = 1 SI = 32K 
       data hash MD5: 32K
       6B 13 B2 B6 C3 3F F4 91 2D 78 9E 97 A1 7A F2 DD>)
(   3,<2006-05-22 09:14:01.76 +100>,<MAYBRIDGE\nmr>,<NMR_250MHZ>,
      <apk 
       data hash MD5: 32K
       CA FB B9 7C D6 9E E1 D5 C5 76 BA 08 89 B5 03 9F>)
(   4,<2006-05-22 09:14:02.50 +100>,<MAYBRIDGE\nmr>,<NMR_250MHZ>,
      <abs ABSG = 5 
       data hash MD5: 32K
       82 C0 22 DE 44 BB EE 01 0A 25 13 5A 4E 05 5F 8C>)
$$ ##END=
$$ 
$$ hash MD5
$$ C4 19 22 6C 29 07 B6 C8 60 0D 97 D6 96 C0 59 8A
##$RELAX= 
##$RELAX= 
##$RELAX= 
##$RELAX= 
##$RELAX= 
##$RELAX= 
##$RELAX= 
$$ Bruker specific parameters
$$ --------------------------
##$DU= <C:\u>
##$EXPNO= 4840
##$NAME= <ADRS>
##$PROCNO= 1
##$TYPE= <nmr>
##$USER= <dgb>
##$AMP= (0..31)
100 100 100 100 100 100 100 100 100 100 100 100 100 100 100 100 100 100 
100 100 100 100 100 100 100 100 100 100 100 100 100 100 
##$AQSEQ= 0
##$AQ_mod= 3
##$AUNM= <au_zg>
##$AUTOPOS= <3 >
##$BF1= 250.13
##$BF2= 250.13
##$BF3= 250.13
##$BF4= 250.13
##$BF5= 500.13
##$BF6= 500.13
##$BF7= 500.13
##$BF8= 500.13
##$BYTORDA= 1
##$CFDGTYP= 0
##$CFRGTYP= 5
##$CHEMSTR= <none>
##$CNST= (0..31)
1 1 145 1 1 1 1 1 1 1 1 1 1 1 1 1 1 1 1 1 1 1 1 1 1 1 1 1 1 1 1 1 
##$CPDPRG= <>
##$CPDPRG1= <>
##$CPDPRG2= <>
##$CPDPRG3= <>
##$CPDPRG4= <mlev>
##$CPDPRG5= <mlev>
##$CPDPRG6= <mlev>
##$CPDPRG7= <mlev>
##$CPDPRG8= <mlev>
##$CPDPRGB= <>
##$CPDPRGT= <>
##$D= (0..31)
0 1 0 0 0 0 0 0 0 0.06 0 0 0 0 0 0 0.0002 0 0 0 0 0 0 0 0 0 0 0 0 0 0 
0 
##$DATE= 1148285623
##$DBL= (0..7)
120 120 120 120 120 120 120 120 
##$DBP= (0..7)
150 150 150 150 150 150 150 150 
##$DBP07= 0
##$DBPNAM0= <>
##$DBPNAM1= <>
$$ [...]
##$SUBNAM7= <"">
##$SUBNAM8= <"">
##$SUBNAM9= <"">
##$SW= 20.6930455092707
##$SWIBOX= (0..15)
0 0 3 0 0 0 0 0 0 0 0 0 0 0 0 0 
##$SW_h= 5175.983436853
##$TD= 65536
##$TD0= 1
##$TE= 294.16
##$TE2= 300
##$TE3= 300
##$TEG= 300
##$TL= (0..7)
0 120 120 120 120 120 120 120 
##$TP= (0..7)
150 150 150 150 150 150 150 150 
##$TP07= 0
##$TPNAME0= <>
##$TPNAME1= <>
##$TPNAME2= <>
##$TPNAME3= <>
##$TPNAME4= <>
##$TPNAME5= <>
##$TPNAME6= <>
##$TPNAME7= <>
##$TPOAL= (0..7)
0.5 0.5 0.5 0.5 0.5 0.5 0.5 0.5 
##$TPOFFS= (0..7)
0 0 0 0 0 0 0 0 
##$TUNHIN= 0
##$TUNHOUT= 0
##$TUNXOUT= 0
##$USERA1= <user>
##$USERA2= <user>
##$USERA3= <user>
##$USERA4= <user>
##$USERA5= <user>
##$V9= 5
##$VALIST= <valist>
##$VCLIST= <CCCCCCCCCCCCCCC>
##$VD= 0
##$VDLIST= <DDDDDDDDDDDDDDD>
##$VPLIST= <PPPPPPPPPPPPPPP>
##$VTLIST= <TTTTTTTTTTTTTTT>
##$WBST= 1024
##$WBSW= 4
##$XGAIN= (0..3)
0 0 0 0 
##$XL= 0
##$YL= 0
##$YMAX_a= 384917
##$YMIN_a= -558229
##$ZGOPTNS= <>
##$ZL1= 120
##$ZL2= 120
##$ZL3= 120
##$ZL4= 120
##$ABSF1= 16.44914
##$ABSF2= -4.244032
##$ABSG= 5
##$ABSL= 3
##$ALPHA= 0
##$AQORDER= 0
##$ASSFAC= 0
##$ASSFACI= 0
##$ASSFACX= 0
##$ASSWID= 0
##$AUNMP= <proc_1d>
##$AZFE= 0.1
##$AZFW= 0.1
##$BCFW= 0
##$BC_mod= 0
##$BYTORDP= 0
##$COROFFS= 0
##$CY= 12.5
##$DATMOD= 1
##$DC= 0
##$DFILT= <>
##$DTYPP= 0
##$F1P= 14.0000005364418
##$F2P= -0.99999901652339
##$FCOR= 0.5
##$FTSIZE= 32768
##$FT_mod= 6
##$GAMMA= 0
##$GB= 0
##$INTBC= 1
##$INTSCL= 1
##$ISEN= 128
##$LB= 0.3
##$LEV0= 0
##$LPBIN= 0
##$MAXI= 10000
##$MC2= 0
##$MEAN= 0
##$ME_mod= 0
##$MI= 0
##$NCOEF= 0
##$NC_proc= -3
##$NLEV= 6
##$NOISF1= 0
##$NOISF2= 0
##$NSP= 0
##$NTH_PI= 0
##$NZP= 0
##$OFFSET= 16.44914
##$PC= 1
##$PHC0= 172.7254
##$PHC1= 7.433177
##$PH_mod= 1
##$PKNL= yes
##$PPARMOD= 0
##$PSCAL= 4
##$PSIGN= 0
##$REVERSE= no
##$SF= 250.130018222649
##$SI= 32768
##$SIGF1= 0
##$SIGF2= 0
##$SINO= 400
##$SIOLD= 32768
##$SREGLST= <1H.CDCl3>
##$SSB= 0
##$STSI= 32768
##$STSR= 0
##$SW_p= 5175.98343685301
##$SYMM= 0
##$S_DEV= 0
##$TDeff= 65536
##$TDoff= 0
##$TI= <Analysis number 999999
Compound Code 99
Book Reference 9
Project Code 9>
##$TILT= no
##$TM1= 0
##$TM2= 0
##$TOPLEV= 0
##$USERP1= <user>
##$USERP2= <user>
##$USERP3= <user>
##$USERP4= <user>
##$USERP5= <user>
##$WDW= 1
##$XDIM= 32768
##$YMAX_p= 487971647
##$YMIN_p= -158096
$$ End of Bruker specific parameters
$$ ---------------------------------
##NTUPLES= NMR SPECTRUM
##VAR_NAME=  FREQUENCY,     SPECTRUM/REAL,   SPECTRUM/IMAG
##SYMBOL=    X,             R,               I
##VAR_TYPE=  INDEPENDENT,   DEPENDENT,       DEPENDENT
##VAR_FORM=  AFFN,          ASDF,            ASDF
##VAR_DIM=   32768,         32768,           32768
##UNITS=     HZ,            ARBITRARY UNITS, ARBITRARY UNITS
##FACTOR=    0.157963299565203, 1,           1
##FIRST=     4114.42382519476, 0,            0
##LAST=      -1061.55961165825, 0,           0
##MIN=       -1061.55961165825, -158096,     0
##MAX=       4114.42382519476, 487971647,    0
$$ Real data points
##PAGE= N=1
##DATA TABLE= (X++(R..R)), XYDATA
$$ [...]
##PAGE= N=2
##DATA TABLE= (X++(I..I)), XYDATA
17650d425528N690P1270K3872m1475o282J0599J7729O7973R7341K4824K5634R018
17638d119335k2152P928K4593K1392M3254J9830L3188Q719L483M574k7033j9457
17626d021016K9756R5835M9813o295k634J7848J4622J4762N2825K6274L3382O3315
17614c631513k1311l3104j0527P899M2283M7099L2023J4822J9281k4719k3649
17603c581416M4953K9178J2961M0181k4387K6862M9157K4062K0655m829J7503
17592c345120L1983L7983M0862K2153l4033K010M1599O8266R699j5936q554j790
17580c150878j3974J8410J5527j3729K5467K9838k272K3877M8572K4314K705K8539
17568b963604J8870Q923M024k0729j5729P1267K5927J0090J3388L6207M919j0654
$$ y = [-4425528, -4419838, -4348568, -4324696, -4366171, -4372453, -4361854, -4344125, -4276152, -4178811, -4153987, -4128353, -4119335, -4141487, -4133559, -4108966, -4087574, -4044320, -4024490, -3991302, -3982583, -3979100, -3974526, -4001559, -4021016, -3991260, -3895425, -3845612, -3851907, -3854541, -3836693, -3822071, -3807309, -3754484, -3728210, -3694828, -3631513, -3652824, -3685928, -3696455, -3688556, -3646273, -3599174, -3567151, -3552329, -3533048, -3557767, -3581416, -3536463, -3507285, -3494324, -3454143, -3478530, -3451668, -3402511, -3378449, -3357794, -3362623, -3345120, -3313137, -3275154, -3234292, -3212139, -3246172, -3244162, -3202563, -3134297, -3124598, -3140534, -3149088, -3150878, -3164852, -3146442, -3130915, -3144644, -3119177, -3089339, -3091611, -3067734, -3019162, -2994848, -2992143, -2963604, -2944734, -2935811, -2931787, -2952516, -2968245, -2896978, -2871051, -2860961, -2847573, -2811366, -2806447, -2817101]
17556b817101K1373L7895K965J3571j1402k7427j4081L7457Q7295L1627j2128
17545b649956n2242K5911N8921O029K8214J6849J2840j0370j4048j8759k744O0134
17533b539221j0922O64K6883k967j3919j7918j299N8151N9703K0850k4839M7N7359
17520b387428L1895J3529r031M8643L4434L7968j7698j2383K7544Q297K5878J4908
17508b183444n430j2970j4618k928K5318q400K5601L9509K0481K8599K3966Q521
17496b055795l0094l9523k408L8191J0706j1390K8435K8797N7544j9896p471K6870
17484a976034K2275K3277O496k1895K1270L6061J6003L4576Q517P067L6774m006
17472a789619J7498L9213k075p485J1526O52n4326p436M0949J8191M5869j3095
$$ y = [-2817101, -2795728, -2757833, -2754868, -2741297, -2752699, -2780126, -2794207, -2756750, -2669455, -2637828, -2649956, -2702198, -2676287, -2617366, -2611337, -2583123, -2566274, -2553434, -2563804, -2577852, -2596611, -2599355, -2539221, -2550143, -2549479, -2522596, -2525563, -2539482, -2557400, -2558699, -2500548, -2440845, -2419995, -2444834, -2444787, -2387428, -2355533, -2342004, -2351035, -2302392, -2267958, -2229990, -2247688, -2260071, -2232527, -2224230, -2198352, -2183444, -2188874, -2201844, -2216462, -2219390, -2194072, -2202472, -2176871, -2137362, -2116881, -2088282, -2064316, -2055795, -2085889, -2125412, -2127820, -2089629, -2078923, -2090313, -2061878, -2033081, -1975537, -1995433, -2002904, -1976034, -1953759, -1930482, -1923986, -1945881, -1924611, -1888550, -1872547, -1837971, -1829454, -1822387, -1785613, -1789619, -1772121, -1732908, -1734983, -1742468, -1730942, -1730290, -1784616, -1792052, -1751103, -1732912, -1687043, -1700138]
17460a700138k2768K1004O9264L5496K3965M8801J2204J1928O5475J2558M2711
17449a379500L1648j9124J4773n2113q7092j4686j6357n726j07275j06052o3808
17438a805312m77J9480K7615J8972M4830J02815N3255J0640L1028K4430O5430
17427a407294L6228k1574j820m0283o5270j1122n587r464l006J754n727l5897
17415a569062j1094L5352L7810L1655M503K5793l800K4096J8444j5784k772L0667
17403a394192L7143K841j2385L8203M5735M9066J8495N3023O1090M9161K0722
17392a031098J9110M2688M2379L6515N4100Q5301Q6522p810j50235j92418j64921
17381a179867j74643j40838o0781k6319j914J5354M1089K4269O196M1833M3196
$$ y = [-1700138, -1722906, -1701902, -1632638, -1597142, -1573177, -1524376, -1512172, -1500244, -1434769, -1422211, -1379500, -1347852, -1366976, -1352203, -1404316, -1491408, -1506094, -1522451, -1528177, -1635452, -1741504, -1805312, -1805789, -1786309, -1758694, -1739722, -1694892, -1592077, -1538822, -1528182, -1497154, -1472724, -1407294, -1371066, -1392640, -1394460, -1434743, -1500013, -1511135, -1516722, -1526186, -1529192, -1527438, -1533165, -1569062, -1580156, -1544804, -1506994, -1475339, -1470836, -1445043, -1448843, -1424747, -1406303, -1422087, -1424859, -1394192, -1357049, -1354208, -1366593, -1328390, -1282655, -1233589, -1215094, -1162071, -1100981, -1051820, -1031098, -1011988, -969300, -926921, -890406, -836306, -751005, -664483, -672293, -822528, -1014946, -1179867, -1354510, -1495348, -1556129, -1582448, -1584362, -1569008, -1527919, -1503650, -1497454, -1455621, -1412425]
17370a412425Q1881O3922j2759k3508L7779O0047J6803M0568M105k5610o5737
17359a234934o9088j4423L4005o056M3019N1198K4621l4331n3355m1380j6080
17348a316804K6667j0340j6247q451L6557M6763J3100K3312R2296N6404J2826
17337a043917J7951M107J5313l1265P168N1108N1353K9588n0017p0247n7787m5252
17325a121897l2352J1796J3750L8710N3506o777K1324L4840l6226k741J0759K0454
17313i94854K9174J914K4823L6527l709j4144M168K6608j9527k1690M8445L4676
17301h47589J2737J0558K9986l2467o3012M5797K6492M2676L107N2015L5509k1676
17289g05867J0580J3390K4563l8638m3226L8026M0343o003l6053p965M6488o696
$$ y = [-1412425, -1330544, -1266622, -1279381, -1302889, -1265110, -1205063, -1188260, -1147692, -1143587, -1169197, -1234934, -1304022, -1318445, -1284440, -1290496, -1247477, -1196279, -1171658, -1205989, -1259344, -1300724, -1316804, -1290137, -1300477, -1316724, -1325175, -1288618, -1241855, -1228755, -1205443, -1113147, -1056743, -1043917, -1025966, -1021859, -1006546, -1037811, -1030643, -979535, -928182, -898594, -948611, -1018858, -1076645, -1121897, -1154249, -1142453, -1128703, -1089993, -1036487, -1043264, -1021940, -987100, -1023326, -1026067, -1015308, -994854, -965680, -963766, -938943, -902416, -906125, -920269, -916101, -889493, -909020, -930710, -882265, -847589, -834852, -824294, -794308, -826775, -889787, -843990, -817498, -774822, -771715, -719700, -684191, -705867, -695287, -681897, -657334, -695972, -739198, -701172, -660829, -666832, -702885, -710850, -664362, -671058]
17277f71058N580J1852M7178j3142N9258K6265L6250L7154k4514j2157j6188o688
17265e20210L1310J8156o831p969J7513K6827j0265K1352J8860m4456M968N2930
17253c97815r644k1902J3257L966j5871K2768J6999P988k8579j3517K2884K7947
17241c71519K0171J6070Q321K2490R866K233o585K5454K9649l624k2728r250K2670
17228b56782J7608J4427J1530K5613k8811n1449J1742P3395L0640J1355P296l7289
17216a70725J43l2721k1604M9876O4033J9389j1456l4820k6372k3131O372O166
17204a74850O017N3588K1022R018K9275r929N314M0686L0855K6992M999j9218
17192B3769J2584n364J3067L3926N0127K462l9939J9422j1834k2790L4350L200
$$ y = [-671058, -665478, -653626, -606448, -619590, -560332, -534067, -497817, -460663, -485177, -497334, -513522, -520210, -488900, -470744, -477575, -485544, -468031, -441204, -451469, -430117, -411257, -455713, -450745, -397815, -407459, -429361, -416104, -412138, -428009, -405241, -388242, -380254, -408833, -422350, -399466, -371519, -351348, -335278, -326957, -304467, -294601, -292368, -298953, -273499, -243850, -247474, -270202, -279452, -256782, -239174, -224747, -213217, -187604, -216415, -267864, -256122, -182727, -152087, -140732, -133436, -170725, -170582, -203303, -224907, -175031, -110998, -91609, -103065, -137885, -164257, -187388, -181016, -174850, -168833, -115245, -94223, -85205, -55930, -65859, -60545, -19859, 10996, 37988, 42987, 23769, 36353, 30989, 44056, 77982, 128109, 130571, 90632, 110054, 98220, 75430, 109780, 112980]
17180A12980m460K7902P512j7943N568P711M4691J6082N717j1327R891q325l3757
17167A62242n171P3869N2018J3732j5302j0665K5916J705p888N3786p047k6618
17155C10577L9760k5803j8047J7921M8913k910P133N4828L411k2168K0477J0513
17143D44605J8684N777k3918j3230J6756J3413n69q923k11l95N7168n455k1332
17130D82370j0303j3721L3865L3313J7905P1715j5862m7717P075J0718L9166J4588
17118F23112L630J2603L7167M1282p82j0995j3723J8159o043K8847P407N0834
17106G91498L445j8476M876l9291k1331J6996J2037J2290K3649o723m6390M4881
17094G77461P0953M6815M0153M4720j3933k9368k488k72N474l0959p950J00567
$$ y = [112980, 108520, 136422, 143934, 125991, 131559, 139270, 183961, 200043, 205760, 194433, 204324, 195999, 162242, 157071, 230940, 282958, 296690, 281388, 270723, 296639, 298344, 290456, 344242, 337195, 310577, 350337, 324534, 306487, 324408, 373321, 370411, 377544, 432372, 435783, 413615, 434092, 444605, 463289, 469066, 445148, 431918, 448674, 462087, 461518, 452595, 452384, 451989, 509157, 503702, 482370, 472067, 458346, 492211, 525524, 543429, 615144, 599282, 551565, 558640, 569358, 608524, 623112, 626742, 639345, 676512, 717794, 717012, 706017, 692294, 710453, 704410, 733257, 740664, 791498, 794943, 776467, 781343, 742052, 720721, 737717, 749754, 762044, 785693, 778970, 732580, 777461, 848414, 895229, 935382, 980102, 966169, 936801, 934313, 934041, 939515, 908556, 900606, 1001173]
17082A001173N1658q226j4761l38p114O3840K5579j9904m5078K307J5894M0788
17070A105818P9184Q830j8071j9866r015J5299r333L9615M3797K4755j0394l641
17058A246978N56J1351K4300j0102l121L8744O7016r420m143j0047j7617J6121
17046A350616N7514J1094j4688j4778M2764N5427M4908l4272L4310N2802J6786
17035A602483j0924k3341L2367j8494L4071P3612L0927L96j0279j2814M748K3208
17023A725960j3029K5485M2870M8909M3547j3057K7528N0863K8841L943l2505
17012A939355L9889L1195q964K6871J7272j2266M3876N9115K7635K9418M3885
17001B237281K8255K0503j5623q757N3577P8355K0569m2605j4300M063N0301L3671
$$ y = [1001173, 1052831, 1044605, 1029844, 1029506, 1022392, 1086232, 1111811, 1091907, 1046829, 1049136, 1065030, 1105818, 1185002, 1193832, 1175761, 1155895, 1146880, 1162179, 1152846, 1192461, 1236258, 1261013, 1250619, 1246978, 1247534, 1258885, 1283185, 1273083, 1269962, 1308706, 1375722, 1366302, 1362159, 1352112, 1334495, 1350616, 1408130, 1419224, 1404536, 1389758, 1432522, 1487949, 1532857, 1498585, 1532895, 1585697, 1602483, 1591559, 1568218, 1600585, 1582091, 1616162, 1689774, 1720701, 1721097, 1710818, 1698004, 1702752, 1725960, 1712931, 1738416, 1781286, 1830195, 1873742, 1860685, 1888213, 1939076, 1967917, 1971860, 1939355, 1979244, 2010439, 2001475, 2028346, 2045618, 2033352, 2077228, 2136343, 2163978, 2193396, 2237281, 2265536, 2286039, 2270416, 2261659, 2315236, 2393591, 2414160, 2371555, 2357255, 2361318, 2411619, 2445290]
16989B445290M0155m300O144L5315p145M2431K0116N1818L6711M1749J8114j2562
16977B713836K2350M8779N6154M6737M1614L4323L3133J5752M069J7246J294J3792
16965C049079J7871K6424J0576L2369M3343K8340O9578L2015L0061M3248O7892
16954C450796M4619N0734M9406l317K7918J4396N0787L7560N6744M4777M6602
16943C871022j145J1225Q5765Q7794N0790K6642J9627L2219N1872M8759M8968
16932D333538N5085l690K0339O533j6030N3615K7184N7455J04670P7897R7553
16921D814149J6882L2794P6815J19630P7698N6309J03083N6229L0461R9125O7634
16910E550809J9312N7779P9132P3596R2603P0981J02453P9694R0170R8383J34279
$$ y = [2445290, 2485445, 2481145, 2487289, 2522604, 2515459, 2557890, 2578006, 2629824, 2666535, 2708284, 2726398, 2713836, 2736186, 2784965, 2841119, 2887856, 2929470, 2963793, 2996926, 3012678, 3016747, 3033993, 3035287, 3049079, 3066950, 3093374, 3103950, 3136319, 3179662, 3208002, 3277580, 3309595, 3339656, 3382904, 3450796, 3495415, 3546149, 3595555, 3592238, 3620156, 3634552, 3685339, 3722899, 3779643, 3824420, 3871022, 3869877, 3881102, 3966867, 4054661, 4105451, 4132093, 4151720, 4183939, 4235811, 4284570, 4333538, 4388623, 4384933, 4405272, 4411805, 4395775, 4449390, 4476574, 4534029, 4638699, 4716596, 4814149, 4831031, 4863825, 4940640, 5060270, 5137968, 5194277, 5297360, 5353589, 5384050, 5483175, 5550809, 5570121, 5627900, 5707032, 5780628, 5873231, 5944212, 6046665, 6126359, 6216529, 6314912, 6449191]
16899F449191J33100M0780O5828J31211J36083J10314J20124Q4711J11962J26059
16889G509363Q4162J14061J10383J51093J60091J43503J84146J42800J50499J72596
16879H922697J78187J54112J92835K32330K10871J68754J92648K45457K53668
16870A0751559K60858K39601K72224K50315K88738L10285L21456L51511L97764
16861A3444311M01899M04049M24900M78265M96184N69165N82821N80319O35818
16852A8017731O47857O97057P40763P02688P56021Q03374R26289J041872J180425
16843B5514077J353577J509651J683165J872081K007626K269203K665020L135423
16835D2009823L826155M674049N786188P044539P781431P015017L915142j471464
$$ y = [6449191, 6582291, 6623071, 6688899, 6820110, 6956193, 7066507, 7186631, 7271342, 7383304, 7509363, 7593525, 7707586, 7817969, 7969062, 8129153, 8272656, 8456802, 8599602, 8750101, 8922697, 9100884, 9254996, 9447831, 9680161, 9891032, 10059786, 10252434, 10497891, 10751559, 11012417, 11252018, 11524242, 11774557, 12063295, 12373580, 12695036, 13046547, 13444311, 13846210, 14250259, 14675159, 15153424, 15649608, 16218773, 16801594, 17381913, 18017731, 18665588, 19362645, 20103408, 20806096, 21562117, 22365491, 23291780, 24333652, 25514077, 26867654, 28377305, 30060470, 31932551, 33940177, 36209380, 38874400, 42009823, 45835978, 50510027, 56296215, 63340754, 71122185, 78137202, 82052344, 80580880]
16827H0580880j0306418k0515301k6832633k9767980k8418647j9526496r700178
16820f4486773k187443L477710N997259N975523N094152M193846L403777K788406
16812c5743543K324723J973372J693422J436172J127848R91072Q81888Q87805
16804b4427241Q79270Q22041P20655N93518M80679L62696L55362L27882L04307
16795a9580831L43868M21200M19496M57469M64874M11531M37266M29782L67387
16786a5827958L52761K91252K53739L10196K76953K19469K12047K06406K52024
16777a3453111K19646J50335J47445J95905J83244J13811J58614J81711J62562
16768a1939838J86793J52998J53525J84455J99681J43806J40761J74975J49023
$$ y = [80580880, 70274462, 49759161, 22926528, -6841452, -35260099, -54786595, -64486773, -66674216, -63196506, -57199247, -51223724, -46129572, -41935726, -38531949, -35743543, -33418820, -31445448, -29752026, -28315854, -27188006, -26196934, -25315046, -24427241, -23547971, -22725930, -22005275, -21411757, -20931078, -20568382, -20213020, -19885138, -19580831, -19236963, -18815763, -18396267, -17938798, -17473924, -17062393, -16625127, -16195345, -15827958, -15475197, -15183945, -14930206, -14620010, -14343057, -14123588, -13911541, -13705135, -13453111, -13233465, -13083130, -12935685, -12739780, -12556536, -12442725, -12284111, -12102400, -11939838, -11753045, -11600047, -11446522, -11262067, -11062386, -10918580, -10777819, -10602844, -10453821]
16759a0453821J67585J51314J19137J26545J21992J57125J32712J19674J10280
16750i247457R3341J11878Q2200J16513J18984J34769J19364N6173J10154J13370
16740h190711J21663J32338J52646J40361O2743L4066j9250O98k1106o0473m9593
16729g696618j7369K8453N7631J08282J30492L9100N2871J33418J03289O4498
16719f995953M5458K7932l675L5558P2119Q5916P4186M7550Q0655N4402O9841
16708f406011m351K8806N4226O8328Q6439R1941J06092L4225O1428P6925J5361
16697e786591K5951J6149l2233K8022N2685R1043O7956O3258Q0468K9735M9182
16686e314375K9190K9183M9369L9961M698N0733O4159M5979J4893J0586M6286
$$ y = [-10453821, -10286236, -10134922, -10015785, -9889240, -9767248, -9610123, -9477411, -9357737, -9247457, -9154116, -9042238, -8960038, -8843525, -8724541, -8589772, -8470408, -8414235, -8304081, -8190711, -8069048, -7936710, -7784064, -7643703, -7580960, -7546894, -7566144, -7565446, -7586552, -7647025, -7696618, -7713987, -7685534, -7627903, -7519621, -7389129, -7350029, -7297158, -7163740, -7060451, -6995953, -6950495, -6922563, -6926238, -6890680, -6818561, -6732645, -6658459, -6610909, -6530254, -6475852, -6406011, -6410362, -6381556, -6327330, -6259002, -6172563, -6080622, -5974530, -5940305, -5878877, -5801952, -5786591, -5760640, -5744491, -5776724, -5748702, -5696017, -5604974, -5537018, -5473760, -5393292, -5363557, -5314375, -5285185, -5256002, -5206633, -5166672, -5161974, -5111241, -5047082, -5001103, -4986210, -4975624, -4929338]
16675d929338M6392J07520L3012K3408J8146L0925O1534M9816k0879J2464Q1350
16664d485650N3695N4756M5270k3437j8343J7160K851J6126K0083K7977O5262
16653d224250J9459M8088L9301N2327k1273j6123N8935L0719L4854L6208K6504
16642c915251L7044N5871K230K5590J6766K6295K8882N0560L6312K2488l9329
16631c652542P225K4573P29q605n386J9655J4649l215L3013k1647l773J8320J6036
16618c560968N5370K8143K2513o696K6209L0620k1336L8725Q3833N0139O923k0607
16606c267132j1038J2419O193L3342M9342j730K8758M1184l036K1181K1910j2294
16594c080901L5906J6057N890L0615j4718l5936J4102L6263L5569k1537n881K0825
$$ y = [-4929338, -4882946, -4775426, -4742414, -4719006, -4700860, -4669935, -4608401, -4558585, -4579464, -4567000, -4485650, -4431955, -4377199, -4331929, -4355366, -4373709, -4356549, -4353698, -4337572, -4317489, -4289512, -4224250, -4204791, -4156703, -4117402, -4065075, -4086348, -4102471, -4043536, -4012817, -3977963, -3941755, -3915251, -3878207, -3822336, -3820106, -3794516, -3777750, -3751455, -3722573, -3672013, -3635701, -3613213, -3652542, -3645317, -3620744, -3620015, -3628620, -3634006, -3614351, -3599702, -3602917, -3569904, -3591551, -3595324, -3577004, -3560968, -3505598, -3477455, -3454942, -3461638, -3435429, -3404809, -3426145, -3387420, -3303587, -3253448, -3246525, -3267132, -3278170, -3265751, -3259558, -3226216, -3176874, -3178604, -3149846, -3108662, -3111698, -3090517, -3068607, -3080901, -3044995, -3028938, -3023048, -2992433, -3007151, -3043087, -3028985, -2992722, -2957153, -2978690, -2984571, -2963746]
16582b963746L5059J3603M0975O2933n86n9851l1946o4920J6735J6144k9671j98
16570b965469L8675j114Q505N2662N2553L6428j1820J752K2645J7705M1594K7764
16558b678120J4357J6439M478Q893j2637l208k3545k8912k8302K8957Q4553J8113
16546b598934K6734N762N8711N1509J5783N324l494k8150o574K5308k0741k9278
16534b498040J1170q19l3069K4440P4675L1844K9591J704O925K987K3263R640
16522b315689j7274n0242n7431J373J3178O157K5533j4899L4896L1423M4627K2171
16510b276177k0887K6347J7454L8866J0088k9264l148P122R2964N8744j9707j233
16498b098831k2438k1862J7869L2937q905k4017j3339J1576M3676r495J1626N291
$$ y = [-2963746, -2928687, -2915084, -2874109, -2811176, -2811762, -2871613, -2903559, -2968479, -2951744, -2935600, -2965271, -2965469, -2926794, -2927908, -2919403, -2866741, -2814188, -2777760, -2789580, -2787828, -2765183, -2747478, -2705884, -2678120, -2663763, -2647324, -2642846, -2633953, -2646590, -2649798, -2673343, -2702255, -2730557, -2701600, -2617047, -2598934, -2572200, -2566438, -2507727, -2456218, -2440435, -2435111, -2438605, -2466755, -2473329, -2448021, -2468762, -2498040, -2486870, -2487689, -2520758, -2496318, -2421643, -2389799, -2360208, -2358504, -2351579, -2348592, -2325329, -2315689, -2332963, -2383205, -2440636, -2439263, -2426085, -2419928, -2394395, -2409294, -2374398, -2342975, -2298348, -2276177, -2297064, -2270717, -2253263, -2214397, -2204309, -2233573, -2236721, -2229599, -2136635, -2077891, -2097598, -2098831, -2121269, -2143131, -2125262, -2092325, -2101230, -2125247, -2138586, -2127010, -2083334, -2092829, -2081203, -2075912]
16486b075912M1657L5058J7327J5362q284r490m527K7209m123K523M6525l632
16474a920307n333j925M170J2915L555l5693k8621p817N45k977j8750j1946J2085
16461b000099N4285J8454m2367j865K48K5416N5183j7602K6059K7459K3751k488
16449a833566N105K676k7645J7800O7209p443o5918k9165O342L9022N0430P4354
16437a700799L018j2882o248k463j1524M491L587J663Q617j8678p599K2244J736
16424a714837m1016K7742L6917L0458j7046m833K0214K4942j2438Q427k0429j5683
16412a677582O1188M3921k5305K4174K393o256k2691m0300o513P1209P5024m8802
16400a549540k1057K0164o815j4016m491q446l6389J1891N015M9891J5180N761
$$ y = [-2075912, -2034255, -1999197, -1981870, -1966508, -1974792, -1984282, -1988809, -1961600, -1965723, -1963200, -1916675, -1920307, -1925640, -1927565, -1923395, -1910480, -1906925, -1942618, -1971239, -1979056, -1978511, -1981488, -2000238, -2012184, -2000099, -1945814, -1927360, -1969727, -1971592, -1971344, -1945928, -1890745, -1908347, -1882288, -1854829, -1831078, -1833566, -1828461, -1825785, -1853430, -1835630, -1768421, -1775864, -1841782, -1870947, -1864605, -1825583, -1775153, -1700799, -1697781, -1710663, -1716911, -1719374, -1730898, -1726407, -1722820, -1721157, -1712540, -1731218, -1738817, -1716573, -1714837, -1755853, -1728111, -1691194, -1660736, -1677782, -1682615, -1662401, -1637459, -1649897, -1641470, -1661899, -1677582, -1616394, -1572473, -1597778, -1573604, -1571211, -1577467, -1600158, -1640458, -1646971, -1575762, -1500738, -1549540, -1570597, -1550433, -1557248, -1571264, -1575755, -1584201, -1620590, -1608699, -1603684, -1553793, -1538613, -1532852]
16388a532852K1705J5931O337k6165L5467L5943m065l1011m3245J852J7936J3793
16376a488374r97L3957K1513j1942K594k422L4286L1802l0297N351k3948J8099
16364a410378N627j160j5355K5180M970P48q371k5319j9071l090K0603L3142K4972
16351a367502J8438j7386J6032J5934J0102J7300M471Q636j7253k593K3220J9279
16339a271322J6871j4103l6989l4057l3725M9231L8292l293N0334o783l8644K0649
16327a263539J0024N064R74J6755L777k3862J6073K0894J2420j0992O432L9779
16315a166201j1756k3180l95L1038J3155L898K931O22p250j2066j1802L5775O389
16302a138842J6051K5104L36l2288j186L6686K4302k7841m292k7309l1606K5249
$$ y = [-1532852, -1511147, -1495216, -1488879, -1515044, -1479577, -1443634, -1447699, -1478710, -1521955, -1520103, -1502167, -1488374, -1489371, -1455414, -1433901, -1445843, -1443249, -1445671, -1411385, -1379583, -1409880, -1404529, -1428477, -1410378, -1404751, -1405911, -1421266, -1396086, -1391116, -1390368, -1398739, -1424058, -1443129, -1446219, -1425616, -1392474, -1367502, -1349064, -1366450, -1350418, -1334484, -1324382, -1307082, -1302611, -1293975, -1311228, -1313821, -1290601, -1271322, -1254451, -1268554, -1305543, -1339600, -1373325, -1324094, -1285802, -1289095, -1238761, -1245544, -1284188, -1263539, -1253515, -1248451, -1247477, -1230722, -1226945, -1250807, -1234734, -1213840, -1201420, -1212412, -1205980, -1166201, -1177957, -1201137, -1201532, -1170494, -1157339, -1153441, -1150510, -1149888, -1157138, -1169204, -1181006, -1145231, -1138842, -1122791, -1097687, -1097351, -1129639, -1130825, -1094139, -1069837, -1097678, -1101970, -1129279, -1160885, -1135636]
16290a135636N3766J4774K3064Q259J6866N990L4606O981R14K9342k4114l0130
16278i95318J0658M9792j311j6025J9761J4881M3288M0886N4267M8474L7420K4601
16266f68626M123l1177q1473r4732j12591j28008q9069o0964o8540n2875J5512
16255a368420J8155K7190L248K4796L0612K3185K8980k0649K9967J9383n3988
16244a237541n586M0005K2717K1948J763K6542J3259K4473R430k7164K0693k8343
16232a117804j9629M7257j4068l7933K0826R701O926j9056r879K421K2627O3101
16220a045510Q39j1331J7193q749J9708J6828J3420j2067K5902J061K563l9376
16208a019519J704n015K8724K8268j2208q451k5080j24L9014M5906J3183k5139
$$ y = [-1135636, -1081870, -1067096, -1044032, -1035773, -1018907, -1012917, -978311, -971330, -970416, -941074, -965188, -995318, -984660, -934868, -936179, -952204, -932443, -917562, -874274, -833388, -779121, -730647, -693227, -668626, -664503, -695680, -777153, -871885, -984476, -1112484, -1201553, -1262517, -1331057, -1383932, -1368420, -1350265, -1323075, -1319827, -1295031, -1264419, -1241234, -1212254, -1232903, -1202936, -1183553, -1237541, -1243127, -1203122, -1180405, -1158457, -1156694, -1130152, -1116893, -1092420, -1082990, -1110154, -1089461, -1117804, -1137433, -1090176, -1104244, -1142177, -1121351, -1111650, -1104724, -1123780, -1133659, -1131238, -1108611, -1045510, -1044671, -1056002, -1038809, -1047558, -1027850, -1011022, -997602, -1009669, -983767, -982706, -980143, -1019519, -1017815, -1022830, -994106, -965838, -978046, -986497, -1011577, -1011701, -972687, -926781, -913598, -938737]
16196i38737J003J612k236j2698P674J8159J549L1820l722m2562j5945N5969N6468
16183h41646j764k3108k5579k2800l517K2510O510J388j408n498l3924o851N8872
16170h76815M7177j506j9804j0339J4396O9619K4341J0832k1059k952J1830M4912
16158g09368J4702p8675m9218L4935N849l7720j8282L8709k5082k0638k2416L304
16146h63900l962n9N2168K7882L3925J9023j102p453K7825J5600j1587k2191k0766
16133g54597m3458j3982K5584M132l440M3267K5138n3565L2272L5841M011r325
16121g08122J0462o27n3851J6129k1520K0690M0140o831j3382j9297L6358J6389
16109f83462k3873O134N2356k590L5545j2457k9584k5566J3866J4917p05k0220
$$ y = [-938737, -937734, -936122, -938358, -951056, -943382, -925223, -923674, -891854, -895576, -938138, -954083, -898114, -841646, -843410, -866518, -892097, -914897, -918414, -895904, -889394, -888006, -889414, -894912, -928836, -935687, -876815, -829638, -831144, -850948, -861287, -846891, -777272, -752931, -742099, -763158, -766110, -754280, -709368, -694666, -773341, -822559, -787624, -781775, -819495, -837777, -799068, -824150, -844788, -867204, -863900, -867862, -867921, -815753, -787871, -753946, -734923, -736025, -743478, -715653, -700053, -711640, -733831, -754597, -798055, -812037, -786453, -782321, -785761, -742494, -717356, -770921, -738649, -702808, -698797, -708122, -697660, -698287, -752138, -736009, -757529, -736839, -696699, -703530, -716912, -736209, -699851, -683462, -707335, -701201, -648845, -651435, -615890, -628347, -657931, -683497, -669631, -654714, -655419, -675639]
16097f75639l9062m3488K5027N4875l640j8781m2504j9061J6297M8053J5802j8167
16085g00288K811K0329J7169r980k0323l4453K3210K8419N74K1354j4928j0613
16073f76719J6391N4016K614k6915K545K4896l0311J1821L8865J8041k5450k5940
16061f16146j0363L6415l7622O849J2327j665L0534J3413l376l3027J4839L6723
16049e51099j8387j8438k1384k43R636L1708K4908r203K6423N3L9785j2967k5780
16036e24988j878l0632J7963L16n9067J2853O578k3748J5967O9967R346K5035
16024d82288K8229J602j6810k3278M136L5808N9471j2625p1007m0513r70K2598
16012d95647K9295r84k2430k4601o642q032P324N7295N3347l7114l0649l5826
$$ y = [-675639, -714701, -758189, -733162, -678287, -681927, -700708, -743212, -762273, -745976, -697923, -682121, -700288, -697477, -677148, -659979, -669959, -690282, -724735, -701525, -673106, -672532, -651178, -666106, -676719, -660328, -606312, -603698, -630613, -628068, -603172, -633483, -621662, -582797, -564756, -590206, -616146, -626509, -590094, -627716, -620867, -608540, -610205, -579671, -566258, -569634, -602661, -587822, -551099, -569486, -587924, -609308, -609551, -599915, -568207, -543299, -552502, -526079, -526026, -486241, -499208, -524988, -526866, -557498, -539535, -539219, -598286, -585433, -578855, -602603, -586636, -516669, -507323, -482288, -454059, -452457, -469267, -492545, -488409, -452601, -393130, -405755, -476762, -517275, -518245, -495647, -466352, -467336, -489766, -514367, -521009, -529041, -521717, -464422, -411075, -448189, -478838, -514664]
16000e14664k9793Q2690K1356j0596k3106l6022q316J2230K1032j2060K0749K1767
15988d54733k9362j5305q459J0817K6113K27R545K4788n099J3285q479M989K0769
15975d10904k1367P295J2461n703J6771r48k5912M126K0630l0454j0416j0857
15963d55278M2919N9754n7195m8980r551K1942L9203M8133J5258k1883k8784j5496
15951d09958j2146J9318R728K5950L6576j1164k4553m0898n021K7844K4038P68
15939c59518p363J9590K4026j5070k6295P583K8244M973l2413Q708P852j6677
15927c56360l895K2116N0707N668j9089j4546k373k5588L3457K2161p829Q200
15915b87371K4820l3974p2191q943K2786j9876K1738o629J7604J5099L8634K0153
$$ y = [-514664, -544457, -461767, -440411, -451007, -474113, -510135, -518451, -506221, -485189, -497249, -476500, -454733, -484095, -499400, -507859, -497042, -470929, -470702, -461157, -436369, -441468, -428183, -436662, -431673, -410904, -432271, -424976, -412515, -418218, -401447, -402395, -428307, -424181, -403551, -434005, -444421, -455278, -412359, -352605, -409800, -458780, -468331, -446389, -407186, -359053, -343795, -365678, -394462, -409958, -422104, -402786, -393058, -367108, -330532, -341696, -366249, -407147, -412168, -384324, -360286, -359518, -366881, -347291, -323265, -338335, -364630, -357047, -328803, -323830, -356243, -347535, -339683, -356360, -360255, -338139, -287432, -281764, -300853, -315399, -317772, -343360, -309903, -287742, -295571, -287371, -262551, -296525, -368716, -377659, -354873, -374749, -353011, -359640, -342036, -326937, -288303, -268150]
15903b68150r59J0815l7683l4477O007N1946O639k1694k439k9794J8988O4060
15891b36741l3049j0119J702J0768J2265K8805J1923l7009l2539j6205J7192j321
15879b84328k9973j6999K7977K7098K3706l603j9683p87k2373K2100M6984J3344
15867b16537j7482j0940M519k2030j0446P3161L5235j0458J3247j5617j6744p070
15855b01162j4848k7289M1738R848N012J2346J581m181J5895j2540l5710k1891
15843b31201p969O836M978M1760l6270j4976j9752J6448N1622K6056m2892k1489
15831b26849L586j0059J1447J6468j7839N1759K3837j8860l790m2067J859J4108
15819a96400O212J0146O20L3024M7392l0208m7422l0715l883J616M420L7210J638
$$ y = [-268150, -269109, -258294, -295977, -330454, -324447, -272501, -265862, -287556, -289995, -319789, -300801, -236741, -269790, -279909, -278207, -267439, -255174, -226369, -214446, -251455, -283994, -300199, -283007, -284328, -314301, -331300, -303323, -276225, -252519, -256122, -275805, -276592, -298965, -276865, -229881, -216537, -234019, -244959, -240440, -262470, -272916, -199755, -164520, -174978, -161731, -177348, -194092, -201162, -216010, -243299, -201561, -191713, -186701, -174355, -172774, -176955, -161060, -173600, -209310, -231201, -239170, -232334, -227356, -185596, -221866, -236842, -256594, -240146, -188524, -162468, -205360, -226849, -223263, -233322, -221875, -205407, -223246, -171487, -147650, -166510, -170300, -212367, -210508, -196400, -190188, -180042, -179422, -146398, -99006, -129214, -176636, -207351, -211234, -209618, -205198, -167988, -166350]
15806a66350J5649Q891N693K1100k8566j9183M0637j4584J6216k3739j3016k5212
15794a82464R820J0159k3238l1101J6790R709L8865r201R998R869j3645J4955
15782a39484N9558M938q740k9317j4157j5359K5859L0373K1870m982k0645m871
15770i4957K2807J480j5530p283J496l1020J4578M0638K0433j3527R291L8678
15758a2916J8512O610J8626m7520j5570k5908j8591K5904K6653j6872o164J3209
15746c4027k6576k4170l1551M2697N0547L740K0372P957m2460n2412N55K4010
15734f1318l4625r503L3037O3127m1202l8738M9863K1973j7483j0251J3894K3591
15722g635k627n10n2180j2592K6856K3609K9002L6095K685k002j4214K3196j0055
$$ y = [-166350, -150701, -141810, -136117, -115017, -143583, -162766, -122129, -136713, -120497, -144236, -157252, -182464, -172644, -162485, -185723, -216824, -200034, -190325, -151460, -160661, -150663, -140794, -154439, -139484, -79926, -74988, -83728, -113045, -127202, -142561, -116702, -86329, -64459, -69441, -90086, -94957, -72150, -70670, -86200, -93483, -91987, -123007, -108429, -67791, -47358, -60885, -51594, -12916, 5596, 12206, 30832, -16688, -32258, -58166, -76757, -50853, -24200, -41072, -47236, -34027, -60603, -84773, -116324, -73627, -23080, -19340, 1032, 8989, -33471, -85883, -85328, -61318, -95943, -105446, -72409, -9282, -50484, -89222, -39359, -17386, -34869, -45120, -31226, -7635, -10262, -10772, -62952, -75544, -48688, -25079, 3923, 40018, 42703, 40701, 26487, 49683, 39628]
15709C9628o7144l0499N9475L4446j8639J6903N303m2278k7442j492j534N1754
15697A8481K7601l9052k0733j6888l5834L5713N6410J6212J336j3757p5942K44
15685d6209L1294L1979J3602j8130L2606L4445J9618q931O79j3984k7861k665
15673D6443j888J6064J9533j8539R189N397L3529l6846l9283N137r689K8412L2845
15660I0304L7713m8600j935P770k0781k6797K0776K4637p528j7721m515j6898
15648C6425P32K1573q00J2721M6491P6k0728j3351m4770m0666J716k4387K0535
15635d433N4333M1828j2324j5233L7499M1101J9707l4076O551J0196l948Q725
15623A49926m1865J6334p204J7066L6385j5809k1645k1474J6541J2624K6412R786
$$ y = [39628, -27516, -58015, 1460, 35906, 17267, 34170, 39473, -2805, -30247, -31739, -33273, 18481, 46082, 7030, -13703, -30591, -66425, -30712, 25698, 41910, 43246, 29489, -46453, -46209, -14915, 17064, 30666, 12536, 45142, 79587, 99205, 90274, 90953, 76969, 49108, 46443, 44555, 60619, 80152, 61613, 70802, 76199, 109728, 72882, 33599, 38736, 29047, 57459, 90304, 128017, 79417, 77482, 85252, 64471, 37674, 58450, 83087, 75559, 57838, 53323, 36425, 37157, 58730, 57930, 70651, 117142, 117218, 96490, 83139, 38369, -2297, -581, -24968, -4433, 49900, 91728, 79404, 64171, 101670, 142771, 162478, 128402, 134953, 145149, 141201, 149926, 108061, 124395, 117191, 134257, 170642, 154833, 133188, 111714, 128255, 140879, 167291, 177077]
15611A77077k3783j969J4028J1221j4161K423K016k3473J6803j8046k9814n853
15599A06469M3318J6866K3111p565m642p397O236L4234K3940k934l6547n2211
15587A42878m526N9751K1554m4594J4596M2365K045q968L0458k4272k1247J2916
15575B22956n413j207O330k9692K9945L1999K7274o387j9831k9995m075j5322
15563B06582P477l1294K2166J0486j0288J3625M1978J5473l0052k073M792j3717
15551B35155P167K726j8493J6528L5587l2333j6149k990J3005j1187J768j2472
15539B18312j3775O4286L468J7003L452J297j4912o9010j1760N7751K8605K9064
15527C13781n04m3054J8059L8846J6771o4261j9930L3527M7641k432j3691j0859
$$ y = [177077, 153294, 151325, 165353, 176574, 162413, 164836, 166852, 143379, 160182, 142136, 112322, 106469, 149787, 166653, 189764, 182199, 177557, 170160, 176396, 210630, 234570, 231636, 195089, 142878, 138352, 198103, 219657, 175063, 189659, 232024, 234069, 225101, 255559, 231287, 210040, 222956, 217543, 216336, 222666, 192974, 222919, 254918, 282192, 275805, 255974, 225979, 221904, 206582, 214059, 182765, 204931, 215417, 205129, 218754, 260732, 276205, 246153, 244080, 248872, 235155, 242322, 245048, 226555, 243083, 278670, 246337, 230188, 227198, 240203, 229016, 230784, 218312, 204537, 268823, 272291, 289294, 292746, 294043, 279131, 210121, 198361, 256112, 284717, 313781, 313277, 270223, 288282, 327128, 343899, 279638, 259708, 293235, 340876, 338444, 324753, 313894]
15515C13894m1412j1430K7686p449o472K8359K849J6212L358l9764o378K1485
15503C00938M803j5713j6447j7439R179P015Q443J8616K7047L6355j0257l9640
15491C12900q04n041J5350J2408l353n6295n6121k9004K8074J6232J8548K3975
15479B76869J9200L1748j012N679l0553J3180L4390l5000J5726J1599n419J0595
15467C47002R443N521m2245l9407p445k5991P4475M8006R80k4992M981R776l5172
15454C24932M975M7384K9977j8067o344k756O277j5768j9619L61P391J5426J205
15441C75374J8390K4958K7700K7102l3622k0176o822K4305r759R458M227K1757
15429D62892P954j0207K8802L5945j6653k100o6044m1758L1107N5701l3263n338
$$ y = [313894, 272482, 261052, 288738, 281289, 274817, 303176, 306025, 322237, 325595, 285831, 279453, 300938, 305741, 290028, 273581, 256142, 265321, 272336, 280779, 299395, 326442, 362797, 352540, 312900, 312096, 307055, 322405, 334813, 331460, 275165, 219044, 190040, 218114, 234346, 252894, 276869, 296069, 327817, 326805, 332484, 301931, 315111, 349501, 314501, 330227, 341826, 336407, 347002, 356445, 361966, 319721, 280314, 272869, 246878, 321353, 369359, 370339, 345347, 350328, 360104, 324932, 329907, 377291, 407268, 389201, 382857, 380101, 386378, 370610, 350991, 351352, 358743, 374169, 375374, 393764, 418722, 446422, 473524, 439902, 419726, 412904, 437209, 427450, 436908, 441135, 462892, 470846, 460639, 489441, 525386, 508733, 506633, 440589, 398831, 429938, 485639, 452376, 447038]
15417D47038M19j9765j3066K2634J6583P670j3388O576L3294J2984k5406n6729
15405D18844m8740K6782P0772J8311J9412K0036k2500K3932J4861j1750k3402
15394E06558l9507j6509M014L9933K6572k614l5657k9195R138j1226J6409K8298
15382D96214K159K624k4917j9881m468L5668K1336K502l4214N557J6915k4212
15370D75283j6255m473M9727L9263n3362o5318m0901L3707K4566K7702N0490k4964
15358D95465k0848L4503L0509J6270j8825j8787R122N926j2654K6199J2267J4800
15346E73947k6182l4224J5352l694k1388j7587M0405J8551O6358L9886m8938n9675
15334E42811M54j5343p849K5708J3159j6322k2501M4828O4841l9420k0577J6500
$$ y = [447038, 447457, 427692, 414626, 437260, 453843, 461513, 448125, 454701, 487995, 500979, 475573, 418844, 370104, 396886, 467658, 485969, 505381, 525417, 502917, 526849, 541710, 529960, 506558, 467051, 450542, 454556, 494489, 521061, 518447, 482790, 453595, 462733, 451507, 467916, 496214, 498373, 500997, 476080, 456199, 451731, 487399, 508735, 511237, 477023, 482580, 499495, 475283, 459028, 454555, 504282, 543545, 490183, 424865, 383964, 417671, 442237, 469939, 520429, 495465, 474617, 509120, 539629, 555899, 537074, 518287, 527409, 533335, 520681, 546880, 559147, 573947, 547765, 513541, 528893, 525199, 503811, 486224, 526629, 545180, 611538, 651424, 602486, 542811, 543265, 527922, 520073, 545781, 558940, 542618, 520117, 564945, 629786, 590366, 569789, 586289]
15322E86289K2002k0935k1055K2698J7496K8592j1266j0890j0188P304q26N1J1144
15309F20416M2935j6526j3742n1050k1224j4544L5221J9699l9095m018L2546k31
15297E90387k5131J7199K3549J1493J7281L6943j5711j0561l5947j6971k002J4207
15285F04736R577L0893k927l4436p008N4808J8743n829j7954k2149j1533j5967
15273F00954L0528p297L2248J8571m4711l754K0407p348K437M0631q435n925J1460
15260F79766o4745m137R089r478r274L6986N3778j5713j9370J281j3252L6326
15248F81257M325J182j1722J2464K2393L6958k4698n4010l8409q805M2656M8161
15236G11752R155r042l0386K0794L2775r106j3400P032m748k6579k269J2302M4269
$$ y = [586289, 608291, 587356, 566301, 588999, 606495, 635087, 623821, 612931, 602743, 610047, 609221, 609272, 620416, 663351, 646825, 633083, 582033, 560809, 546265, 581486, 601185, 562090, 558072, 590618, 590387, 565256, 582455, 606004, 617497, 634778, 671721, 656010, 645449, 609502, 592531, 590529, 604736, 614313, 645206, 642279, 607843, 600835, 655643, 674386, 668557, 650603, 628454, 616921, 600954, 631482, 624185, 656433, 675004, 630293, 626539, 646946, 639598, 642035, 682666, 674231, 668306, 679766, 615021, 610884, 619973, 610495, 601221, 638207, 691985, 676272, 656902, 658183, 644931, 681257, 685582, 686764, 675042, 687506, 709899, 746857, 722159, 668149, 629740, 620935, 663591, 711752, 720907, 711865, 681479, 702273, 735048, 725942, 712542, 719574, 714826, 688247, 685978, 698280, 742549]
15223G42549L6095J9019j3008k2423P875k1707L8243K2250j8240J0920J1022m926
15211H07669j1843J8980j2409m4707k9684j448j0300l0516o6048j0314L5285m789
15199F39876k2567J1974K6969K3864N993n449K3279K6543L2619j5167m3779k4426
15187F79729q041k4733k0378L6421J8921K2369K2113K2508L9275P460j474o777
15175G87393j9874R060L7017j1111j8904J2159K28L1143j1861p456l1188k4502
15163G52104P981K6265k1432j9582J9862J59L7315P931n015L3120J1213M6359
15151H96280K9408l2692l9866M3116o916n0709j0280K1378J7880M04j6300l8743
15139H12960j9890L4322J3937l8563J5296P5939M2213P33m0187m4633J6604N2008
$$ y = [742549, 778644, 797663, 784655, 762232, 770107, 748400, 786643, 808893, 790653, 801573, 812595, 807669, 795826, 814806, 802397, 757690, 728006, 726558, 716258, 685742, 619694, 609380, 644665, 639876, 617309, 629283, 656252, 680116, 686109, 680660, 703939, 730482, 763101, 747934, 704155, 679729, 671688, 646955, 626577, 662998, 681919, 704288, 726401, 748909, 788184, 795644, 794170, 787393, 767519, 776579, 813596, 802485, 783581, 795740, 795968, 827111, 815250, 807794, 776606, 752104, 760085, 786350, 764918, 745336, 765198, 765357, 802672, 810603, 805588, 838708, 849921, 896280, 925688, 892996, 853130, 896246, 889330, 838621, 828341, 849719, 867599, 868003, 851703, 812960, 793070, 827392, 841329, 802766, 818062, 894001, 936214, 936947, 896760, 852127, 868731, 920739]
15127I20739J3746k6296j018J3806q305l9472J4541l4708l4705j3006J9218M8769
15115H73309M9754j2883P573j7461n3112k551J8953L4627J9195k0283K7630j1879
15103I12872Q567r69k005q871q762k517j5280J0676M9789J0511l9320j0416k3761
15090H80514k6298l3979O8644O1629J5940j3186m4590K0548M4838k5355o743M585
15078I46547k0762J2899J0083P172J9557l3622m206r706K170L0669k7999J2008
15066I44810J7760m041K7990O650k3336n252j5139K1091j2052J9241P358J8057
15054A003137k352m3337p717j9829q601P366n193L8004M2984M307l9028l3918
15042I35823j561m506L0424P7376N9563Q395n0116n0719l0396K861K6979L1407
$$ y = [920739, 934485, 908189, 907171, 920977, 912672, 873200, 887741, 853033, 818328, 805322, 824540, 873309, 923063, 910180, 917753, 900292, 847180, 844629, 863582, 898209, 917404, 897121, 924751, 912872, 921439, 920470, 918465, 909594, 900832, 898315, 883035, 893711, 943500, 954011, 914691, 904275, 880514, 854216, 820237, 888881, 950510, 966450, 953264, 908674, 929222, 974060, 948705, 941962, 946547, 925785, 938684, 948767, 955939, 975496, 941874, 937668, 927962, 930132, 960801, 932802, 944810, 962570, 958529, 986519, 993169, 969833, 964581, 949442, 970533, 958481, 977722, 985080, 1003137, 1000785, 957448, 949731, 929902, 921301, 928667, 923474, 961478, 1004462, 1008769, 969741, 935823, 934262, 929756, 960180, 1037556, 1097119, 1105514, 1055398, 1004679, 974283, 977144, 1004123, 1035530]
15030A035530M0782L0240j2960j1390m7584l2180L1735K9110L8299m638l1325
15019A065619k9750k870K8984k902K498K4034J1282M5717J1959j5341J0617J4946
15007A164793o420M4502L0203L4015P7509j6957o5425j07341j10524r9689n2368
14996H92298J5580L7361K143J1645M1800M3700P886K502l0363j7013l5685M8772
14984A020626K8099j948J0581j5283l741J4447l501m5939r925K2321L4208M2511
14972A092456K9769j8315k3757O155J5400R059M4520J5678l6129m3867L4736N1920
14960A177625K347l2809j4951k6191l7129J4167O612R603K4835K4938J4819L1821
14948A195687J7033o609j5519p471J1429m3998m1634l3510r463K3651M7812J6518
$$ y = [1035530, 1076312, 1106552, 1093592, 1082202, 1034618, 1002438, 1034173, 1063283, 1101582, 1096944, 1065619, 1035869, 1032999, 1061983, 1059081, 1061579, 1085613, 1096895, 1142612, 1154571, 1139230, 1149847, 1164793, 1158373, 1202875, 1233078, 1267093, 1344602, 1327645, 1262220, 1154879, 1044355, 944666, 892298, 907878, 945239, 947382, 959027, 1000827, 1044527, 1052413, 1054915, 1024552, 1007539, 971854, 1020626, 1048725, 1046777, 1057358, 1042075, 1038334, 1052781, 1049280, 1003341, 993416, 1015737, 1049945, 1092456, 1122225, 1103910, 1080153, 1086308, 1101708, 1110767, 1155287, 1170965, 1134836, 1090969, 1125705, 1177625, 1179972, 1147163, 1132212, 1106021, 1068892, 1083059, 1089671, 1099274, 1124109, 1149047, 1163866, 1195687, 1212720, 1206111, 1190592, 1183121, 1194550, 1150552, 1108918, 1075408, 1065945, 1089596, 1137408, 1153926]
14936A153926K689o195K0238J6860k4986L6647J3566O609n925p372J1929j5675
14924A202311m1185M4037N1165J8760k4348J324q3811K8311M5964m391m1208j0123
14912A186806J5115L1834M5326J1125n0954k0550L5036M0154R085m0778k5683
14901A236516Q038j339J4711L2557K0279l8085K725m5997l5711L5315K0642N7055
14889A306706L7725k106l2657R570K8293j4586J2369k352j7134m6861l1918J4144
14877A261193K0264R606M1012K9999K4579j5127n0397k8597N328K8702J6736o423
14865A336875j7864M778J12J0596J2472J8633L0573r583m7904l719J5109L9170
14853A389248Q493j2219m2171j1809K1878J368n271n3966n397K7149K8232R329
$$ y = [1153926, 1156615, 1150420, 1170658, 1187518, 1162532, 1199179, 1212745, 1219354, 1213429, 1206057, 1217986, 1202311, 1161126, 1205163, 1256328, 1275088, 1250740, 1252064, 1168253, 1196564, 1242528, 1238137, 1196929, 1186806, 1201921, 1233755, 1279081, 1290206, 1239252, 1218702, 1253738, 1293892, 1302977, 1262199, 1236516, 1244554, 1243215, 1257926, 1290483, 1310762, 1272677, 1275402, 1229405, 1193694, 1229009, 1249651, 1306706, 1344431, 1342325, 1309668, 1319238, 1347531, 1332945, 1345314, 1342962, 1325828, 1278967, 1247049, 1261193, 1281457, 1291063, 1332075, 1362074, 1386653, 1371526, 1321129, 1292532, 1297860, 1326562, 1343298, 1336875, 1319011, 1323789, 1323901, 1334497, 1346969, 1365602, 1396175, 1386592, 1338688, 1334969, 1350078, 1389248, 1397741, 1385522, 1343351, 1331542, 1353420, 1354788, 1349517, 1295551, 1290154, 1317303, 1345535, 1354864]
14841A354864r419K985K7364L3022n492r922j3551j8919n737n460K6164K4193
14829A400092K7358R054k8939o991J0592o590q677L6640L379j4082k5053m565
14817A392218j2111l9368J335K3977M5027L7897o410l4630J48J908N853L6466
14805A452310K2607k9957m296r410K5815o573O917K3824k7462m4171L5149Q152
14793A452905q605K0712K1928n8448K944L0069N6132o236j1324P634j7121J4265
14781A504855N1020K2684O522k8205P353O676p2047j4469K2812Q638K3800M1324
14769A580963l89Q609j4626k7170P371J4952K6067K932N1948O025J414l177n7340
14756A597579p6413N038N2433j7611Q936L4294J5977J0800L9615N7271L9675J3455
$$ y = [1354864, 1345445, 1348430, 1375794, 1408816, 1403324, 1393402, 1379851, 1360932, 1355195, 1349735, 1375899, 1400092, 1427450, 1436504, 1407565, 1400574, 1411166, 1404576, 1395899, 1432539, 1435918, 1421836, 1396783, 1392218, 1380107, 1340739, 1342074, 1366051, 1411078, 1448975, 1442565, 1407935, 1408083, 1409991, 1415844, 1452310, 1474917, 1444960, 1440664, 1431254, 1457069, 1450496, 1457413, 1481237, 1453775, 1409604, 1444753, 1452905, 1444300, 1465012, 1486940, 1428492, 1431436, 1461505, 1517637, 1511401, 1500077, 1507711, 1490590, 1504855, 1555875, 1578559, 1585081, 1556876, 1564229, 1570905, 1498858, 1484389, 1507201, 1515839, 1539639, 1580963, 1580574, 1589183, 1574557, 1547387, 1554758, 1569710, 1595777, 1598709, 1650657, 1656682, 1658096, 1654919, 1597579, 1521166, 1526204, 1578637, 1561026, 1569962, 1604256, 1620233, 1631033, 1670648, 1727919, 1767594, 1781049]
14744A781049p5253k9180M2j5102J519k8826L4498O245J3019l363J1857m513O7214
14731A759206K8989m3929L6046M5169K0733M911L7496m1240n0587L189K5335J3984
14719A839302K2555j2829J3554L1231K0229k6526n9609j1355M2734L6733m272
14708A891747l440N5316K6679J7306J3098L3519L7627L4115L4807N8027L5708
14697B234509P6052Q2444p277j0986k7619j57350k05357k21007j98270j46797
14687A418342p7382m4421j6671R411M5389K7584N1815L9762N2958P0923j2886
14676A564824L2457q702k0569M2865L3461L7998j6943m1262R661p122J083K9814
14664A657565N760J2880j87J8600J9917k9873k5101j2021K0640L7713M2251J4993
$$ y = [1781049, 1705796, 1676616, 1676658, 1661556, 1663075, 1634249, 1668747, 1674992, 1688011, 1684648, 1696505, 1691992, 1759206, 1788195, 1744266, 1780312, 1825481, 1846214, 1851125, 1888621, 1847381, 1796794, 1799983, 1825318, 1839302, 1861857, 1849028, 1862582, 1893813, 1914042, 1887516, 1827907, 1816552, 1859286, 1896019, 1891747, 1888307, 1943623, 1970302, 1987608, 2000706, 2034225, 2071852, 2105967, 2140774, 2198801, 2234509, 2310561, 2393005, 2385728, 2374742, 2347123, 2189773, 1984416, 1763409, 1565139, 1418342, 1340960, 1296539, 1279868, 1289279, 1334668, 1362252, 1414067, 1453829, 1506787, 1577710, 1564824, 1597281, 1588579, 1568010, 1610875, 1644336, 1682334, 1665391, 1624129, 1633790, 1626668, 1627751, 1657565, 1663325, 1676205, 1676018, 1694618, 1714535, 1684662, 1659561, 1647540, 1668180, 1705893, 1748144, 1763137]
14652A763137r97L7563r554n0888J0685M797Q529k030k2251K6211L1026j7852
14640A778376j4639K1059K5872J6323L4122N261J3706j241p699J8658l6911k6663
14628A826224K8034K5796O3807M2387q909k2779k2037K6530K4258l2901J2641
14617A963051J7885m5673K7253j7863j7700j8553p578j617J1233j7421L0413J1897
14605A935327O486N858J8418L5750o812n107k031n541N271M8206k0030m2392N9005
14592B032408L6280p049J1697P471k3483m9621K0440M9805Q482P476L5549J1591
14580B141046m3296l112N808J3287n626j1471o395K8904Q315K73J7590L761O064
14567B155148j0811k3511R620k0254J5939K1336J2070k7111N724J2420O146J3956
$$ y = [1763137, 1762140, 1799703, 1790149, 1739261, 1749946, 1754743, 1763272, 1761242, 1738991, 1765202, 1796228, 1778376, 1763737, 1784796, 1810668, 1826991, 1861113, 1866374, 1880080, 1878839, 1871140, 1889798, 1852887, 1826224, 1854258, 1880054, 1943861, 1986248, 1977339, 1954560, 1932523, 1959053, 1983311, 1950410, 1963051, 1980936, 1935263, 1962516, 1944653, 1926953, 1908400, 1900822, 1899205, 1910438, 1893017, 1923430, 1935327, 1941813, 1947671, 1966089, 2001839, 1995027, 1989920, 1987889, 1982348, 1987619, 2035825, 2015795, 1973403, 2032408, 2068688, 2061639, 2073336, 2080807, 2057324, 2007703, 2028143, 2077948, 2086430, 2093906, 2129455, 2141046, 2097750, 2094638, 2100446, 2113733, 2108107, 2096636, 2090241, 2119145, 2127460, 2127733, 2145323, 2149084, 2155148, 2144337, 2120826, 2130446, 2110192, 2126131, 2147467, 2159537, 2132426, 2138150, 2150570, 2156716, 2170672]
14555B170672K8848n045n0500j2067J6937K5083K9612P063m766n933k0779J3804
14543B192929J4847L3895L1566m6116m6764O778P5434M1408K909M566j5452k162
14531B293838p20o699m00L5819K0077m694K487m2768k618K5239J3167N770O283
14518B344781N591J7140j3577O742j7808l3364j6546N9579O7573k0151p1766J1468
14506B339662M1185M2220L3565j565l5762l290o566m2601J6616M6286o936K1468
14494B444282J771l5910J7923K6187l6181j4299l0959M0361L6730R384j205K8573
14482B486657L4932k0547J7983L7686M1801p373l4511l1915o897J5972K1944J6979
14470B572711k8568l3962J9651K8996j3862j849L3659L1581k6095N5624l572l8363
$$ y = [2170672, 2199520, 2194475, 2143975, 2131908, 2148845, 2173928, 2203540, 2210603, 2205837, 2199904, 2179125, 2192929, 2207776, 2241671, 2273237, 2227121, 2180357, 2187135, 2262569, 2303977, 2306886, 2311452, 2296000, 2293838, 2293118, 2286419, 2286019, 2321838, 2341915, 2337221, 2339708, 2296940, 2294322, 2319561, 2332728, 2338498, 2344781, 2350372, 2367512, 2353935, 2360677, 2342869, 2309505, 2292959, 2352538, 2420111, 2399960, 2328194, 2339662, 2380847, 2423067, 2456632, 2455067, 2419305, 2416015, 2409449, 2366848, 2383464, 2429750, 2422814, 2444282, 2446053, 2410143, 2428066, 2454253, 2418072, 2403773, 2372814, 2413175, 2449905, 2459289, 2458084, 2486657, 2521589, 2501042, 2519025, 2556711, 2598512, 2591139, 2556628, 2524713, 2517816, 2533788, 2555732, 2572711, 2544143, 2510181, 2529832, 2558828, 2544966, 2543117, 2576776, 2608357, 2582262, 2637886, 2634314, 2595951]
14458B595951J4265q582j3354l2467P242M5942J9312J2213j2211M1407m525k706
14446B662487J4789R625Q438K5713J3646k7388L17K7251K8432k71N19L4841j1342
14433B787057l4390j9736M3549r265j6163L7398Q51L5164K9593O044p199L2416
14421B885319j1019k3963J7950K2826K6977j6459l3975k042P2152M4187m1059
14410B940894K4140N2261K7080j7588q709Q192j3090L9034N443J352K7790J4520
14398C101319q721J827K8122M3702M615M6748r398q172P024J0111N3220O8544
14386C338941L7301L4065L4273L1936J7250O8758P8581Q7639J22388Q6590Q003
14375C945725m5904j54480k98879l67155l48120k67548j81649k8252P0935Q2437
$$ y = [2595951, 2610216, 2601634, 2588280, 2555813, 2563055, 2608997, 2628309, 2640522, 2628311, 2669718, 2665193, 2662487, 2677276, 2686901, 2695339, 2721052, 2734698, 2707310, 2707627, 2734878, 2763310, 2763039, 2763558, 2798399, 2787057, 2752667, 2732931, 2776480, 2767215, 2751052, 2788450, 2789301, 2824465, 2854058, 2860102, 2852903, 2885319, 2874300, 2850337, 2868287, 2891113, 2918090, 2901631, 2867656, 2865614, 2937766, 2981953, 2940894, 2965034, 3017295, 3044375, 3026787, 3018078, 3026270, 3013180, 3052214, 3057657, 3059009, 3086799, 3101319, 3092598, 3094425, 3122547, 3166249, 3170864, 3217612, 3208214, 3200042, 3207066, 3217177, 3270397, 3338941, 3376242, 3410307, 3444580, 3476516, 3493766, 3562524, 3641105, 3728744, 3851132, 3937722, 3945725, 3899821, 3745341, 3446462, 3079307, 2731187, 2463639, 2281990, 2253738, 2324673, 2407110]
14365B407110R7377M9557K7056K7170L6501p209M8378M1409K0347N4343L901K7706
14353B833646L6687K6275K8136m2689m0857O276L9684K3985K6460J6605J4109
14342B968317k837L8603P126j6842J2476J7684K8421N9291K6886Q469M6077Q277
14330C201948J2213n29m0431J3041L5520J0645k6060K3107J0759j37j938N1267
14318C289405l28M399K0510n035l251J644O642M0695M9557j9894l0237K8146N2390
14305C434643j8838k0204k0099N2457N0412j7760l6885P872L3391J4557J5189
14294C494735o571J7761O463L5057o786k0680M1478Q0185M8970L8661l155n4958
14282C671160m8976l004l572k738K6720N1112L4709J7214n995K2756k0637J5712
$$ y = [2407110, 2504487, 2554044, 2581100, 2608270, 2644771, 2637562, 2685940, 2727349, 2747696, 2802039, 2805940, 2833646, 2870333, 2896608, 2924744, 2882055, 2841198, 2847474, 2887158, 2911143, 2937603, 2954208, 2968317, 2965480, 3004083, 3011209, 2994367, 3006843, 3024527, 3052948, 3112239, 3139125, 3147594, 3193671, 3201948, 3214161, 3213632, 3173201, 3186242, 3221762, 3232407, 3206347, 3229454, 3240213, 3240076, 3238138, 3289405, 3289077, 3293476, 3313986, 3308951, 3305700, 3307344, 3313986, 3354681, 3404238, 3384344, 3354107, 3382253, 3434643, 3415805, 3395601, 3375502, 3427959, 3478371, 3460611, 3423726, 3431598, 3464989, 3479546, 3494735, 3488164, 3505925, 3512388, 3547445, 3540659, 3519979, 3561457, 3641642, 3690612, 3729273, 3726118, 3671160, 3622184, 3619180, 3615608, 3612870, 3639590, 3690702, 3725411, 3742625, 3736630, 3759386, 3738749, 3754461]
14270C754461K5139N4175k4472L0352q134m705K0863P3224K6403n8798k0236J1211
14258C879483K0931J6497l6102j6175K0898R607k5481K894J2230J231K5742J3971
14246C925726O9103K4466j3866l8822j5352N0821P2058K6441O428J4641K0470
14235D142114K1311L6195K8419m6985j8291M1070J4025Q488L9351N2508k7982
14224D290223Q75j5444k409P313K2959L4680m527m9828L2272K6009K5670n662
14212D362131N898O7653J0540q898n489J0274j0866J3953k6734N187j4010k5763
14200D383876L8802O1569L212M4861M0418k4556k3130L4614N2825L7851L8594
14189D688936o750r263O0407P5642L0180M0441L6488k2799L2560J0875j357J3797
$$ y = [3754461, 3779600, 3833775, 3809303, 3839655, 3831521, 3826816, 3847679, 3920903, 3947306, 3888508, 3868272, 3879483, 3900414, 3916911, 3880809, 3864634, 3885532, 3895139, 3869658, 3872552, 3884782, 3886013, 3911755, 3925726, 3994829, 4019295, 4005429, 3966607, 3951255, 4002076, 4074134, 4100575, 4107003, 4121644, 4142114, 4163425, 4199620, 4228039, 4181054, 4162763, 4203833, 4217858, 4226346, 4265697, 4318205, 4290223, 4291098, 4275654, 4273245, 4280558, 4303517, 4338197, 4333670, 4283842, 4316114, 4342123, 4367793, 4362131, 4368029, 4435682, 4446222, 4437324, 4431835, 4442109, 4431243, 4445196, 4418462, 4423649, 4409639, 4383876, 4422678, 4484247, 4487459, 4532320, 4572738, 4548182, 4525052, 4559666, 4612491, 4650342, 4688936, 4682186, 4672923, 4733330, 4808972, 4839152, 4879593, 4916081, 4893282, 4925842, 4936717, 4935360, 4949157]
14177D949157L6939J6139J9181r287o2330q858K1377Q797L6059O3781O4501L8446
14165E173902n924j6677M8906N9386J9578J441K9936K0293R117k1791J4483R172
14153E341822P673J0942K0256l6366K3943L3797k9587K7967O1865L934N276L2956
14141E504478N3525K5545j3461J9934P2912L6326J35L6942L6898k8646L0006R6562
14129E871156K5336J3549L7625p061M634J9616Q928L3940Q5255J8908j857Q455
14117F118484K7308K4824J6552N4381q314J6274N6762N8775m172k776N7973N1618
14105F467689P7374j438J7666J3641j3328R083K5660M070K5438O847L0119N0741
14093F713562O8205P8831R8118M8565M6854K8836R554R8781N1818J3888l9585
$$ y = [4949157, 4986096, 5002235, 5021416, 5012129, 4949799, 4940941, 4962318, 4971115, 5007174, 5070955, 5135456, 5173902, 5167978, 5151301, 5200207, 5259593, 5279171, 5280612, 5310548, 5330841, 5339958, 5318167, 5332650, 5341822, 5349495, 5360437, 5380693, 5344327, 5368270, 5402067, 5372480, 5400447, 5462312, 5466246, 5471522, 5504478, 5558003, 5583548, 5570087, 5590021, 5662933, 5699259, 5699394, 5736336, 5773234, 5744588, 5774594, 5871156, 5896492, 5910041, 5947666, 5940605, 5945239, 5964855, 5973783, 6007723, 6092978, 6111886, 6110029, 6118484, 6145792, 6170616, 6187168, 6241549, 6233235, 6249509, 6306271, 6365046, 6360874, 6358098, 6416071, 6467689, 6545063, 6543625, 6561291, 6574932, 6561604, 6570687, 6596347, 6600417, 6625855, 6632702, 6662821, 6713562, 6781767, 6860598, 6958716, 7007281, 7054135, 7082971, 7092525, 7191306, 7243124, 7257012, 7217427]
14082G217427m62K468j5122k3154m3791P605J3302O6967N7472N8391K4183O0844
14070G426130M3814O3630O4199N8792L4540L3630K2814q133K0706K0174N3905
14059G834201N7934P7347R7601N6596O0332P9537M5829M9458O1816N7647N3050
14048H531348L4458N5418K2115L6336N0551O2916P6374P8249N5240K9654K0604
14037I053263O0330P4135M2645O8640N3024N5185Q3484P4352P7612J04114P1795
14026I818579O4629P0016N9028R9471J29584Q2176L6036L9865P0056R9239J08636
14015A0677315K1942N0763M4842Q0510J20653P8394N0750O8110N8073Q4312P3408
14004A1409072R7443O1588R0726J07014J28473R9547J09514R3157P8165R0423
$$ y = [7217427, 7216965, 7219433, 7204311, 7181157, 7137366, 7144971, 7158273, 7225240, 7282712, 7341103, 7365286, 7426130, 7469944, 7533574, 7597773, 7656565, 7691105, 7724735, 7747549, 7739416, 7760122, 7780296, 7834201, 7892135, 7969482, 8067083, 8123679, 8184011, 8263548, 8309377, 8358835, 8420651, 8478298, 8531348, 8565806, 8621224, 8643339, 8679675, 8730226, 8793142, 8869516, 8947765, 9003005, 9032659, 9053263, 9113593, 9187728, 9230373, 9299013, 9352037, 9407222, 9490706, 9565058, 9642670, 9746784, 9818579, 9883208, 9953224, 10012252, 10111723, 10241307, 10323483, 10359519, 10399384, 10469440, 10568679, 10677315, 10699257, 10750020, 10794862, 10875372, 10996025, 11074419, 11125169, 11193279, 11251352, 11335664, 11409072, 11506515, 11568103, 11658829, 11765843, 11894316, 11993863, 12103377, 12196534, 12274699, 12365122]
13994A2365122J18244J43292J05352R1717J47117J22330J76457J74123J52628
13985A3596382R2935R8496J87717J70501R7804J03178J02726J57176K22494K01284
13975A5030693J73479J50005J80615K21359K00768J70786J62176J97997K13367
13966A6701245K48436K55370K35621K16484K06703K12218K78841K68262K28728
13957A8851908K34697K75608K80779K96302K99847L15937L45688L86749L88435
13948B1675950L96667M14248M75449M80824M78125M20821M41107M05384L08928
13939B5497503L40435M41638N93685O37178O42250O58323P31148P60787Q13592
13930C1116539Q15417R16781R82078J031356J124670J197337J230621J339647
$$ y = [12365122, 12483366, 12626658, 12732010, 12823727, 12970844, 13093174, 13269631, 13443754, 13596382, 13689317, 13787813, 13975530, 14146031, 14243835, 14347013, 14449739, 14606915, 14829409, 15030693, 15204172, 15354177, 15534792, 15756151, 15956919, 16127705, 16289881, 16487878, 16701245, 16949681, 17205051, 17440672, 17657156, 17863859, 18076077, 18354918, 18623180, 18851908, 19086605, 19362213, 19642992, 19939294, 20239141, 20555078, 20900766, 21287515, 21675950, 22072617, 22486865, 22962314, 23443138, 23921263, 24342084, 24783191, 25188575, 25497503, 25837938, 26279576, 26873261, 27510439, 28152689, 28811012, 29542160, 30302947, 31116539, 31931956, 32848737, 33830815, 34862171, 35986841, 37184178, 38414799, 39754446]
13922C9754446J449839J540150J639717J718375J790644J926904K071122K239904
13914E4131101K457747K744015L092458L433601L741629M065750M545520N272654
13906H3484475O313078P716925R580218J1912725J4652986J7121479J6850812
13899A67632698J0065552m311253k3627554m6123360o4818256o8182790n6900832
13892h6265795l8572081j6012279L516308J2791110J3924427J1940125R516179
13885h9162006P476094N994195M940679M198680L571299L021329K663351K308641
13877e4987738K041906J887748J763324J637031J562669J507272J493245J383031
13869d1711512J292998J175763J059731J029820R69189Q90801Q33137Q10218P98646
$$ y = [39754446, 41204285, 42744435, 44384152, 46102527, 47893171, 49820075, 51891197, 54131101, 56588848, 59332863, 62425321, 65858922, 69600551, 73666301, 78211821, 83484475, 89797553, 97514478, 107094696, 119007421, 133660407, 150781886, 167632698, 177698250, 173386997, 149759443, 103636083, 38817827, -29364963, -86265795, -124837876, -140850155, -137333847, -124542737, -110618310, -98678185, -89162006, -81685912, -75691717, -70751038, -66552358, -62981059, -59959730, -57296379, -54987738, -52945832, -51058084, -49294760, -47657729, -46095060, -44587788, -43094543, -41711512, -40418514, -39242751, -38183020, -37153200, -36184011, -35293210, -34460073, -33649855, -32851209]
13860c2851209P85453P68969P46256P34723O91498O43942N67210N20424N19368
13851b6873366M61947M72249M57169L84752L70497L65208L50604L71549L36041
13842b3303350L18855L50284L68082L30126L43036L19439L61559L66512L50292
13833b0195165K98509L01474K97592L28909K79093K70775K71546K39008K67073
13824a7641186K74020K62833K43590K10442K16839K06579J54963J94297K22064
13815a5655559J97900J93071J84045J96349K24894J94146J84002K02490J87394
13806a3891268J14526J18563J44371J73135J76918J23970P4044J66376J81457
13797a2617908J20492J01325J01390J35027Q4849J51670J26980R7890N2887R0784
$$ y = [-32851209, -32065756, -31296787, -30550531, -29815808, -29124310, -28480368, -27913158, -27392734, -26873366, -26411419, -25939170, -25482001, -25097249, -24726752, -24361544, -24010940, -23639391, -23303350, -22984495, -22634211, -22266129, -21936003, -21592967, -21273528, -20911969, -20545457, -20195165, -19896656, -19595182, -19297590, -18968681, -18689588, -18418813, -18147267, -17908259, -17641186, -17367166, -17104333, -16860743, -16650301, -16433462, -16226883, -16071920, -15877623, -15655559, -15457659, -15264588, -15080543, -14884194, -14659300, -14465154, -14281152, -14078662, -13891268, -13776742, -13658179, -13513808, -13340673, -13163755, -13039785, -12965741, -12799365, -12617908, -12497416, -12396091, -12294701, -12159674, -12074825, -11923155, -11796175, -11698285, -11645398, -11554614]
13787a1554614R5568J02225J13246J16570J17267J23523O9111J38735J78095J17200
13777a0383074J05783J36252J22861J38385J15645Q8971P4810J13419N0446K8210
13767i408292L5923K9201M1166J24310Q7604P7691J12938J06848J10643J45956
13757h536012R7644P7110R2891J07557Q5829J39399J21203O9818J11741J18560
13747g514260J10531O0448P5701O0060J7424M9144R2820N5953O9948M9557M9510
13736f823164R6078P4215N9087P9021M4124J0185L5631J09230M4172M6931O3887
13725f160603R5433O9140Q3497L5879M7217M6062L9504M7757L8626K7362J9342
13714e610784L0669M9436N2491K3829K8384n620k943M3249J05373N4005j7806
$$ y = [-11554614, -11459046, -11356821, -11243575, -11127005, -11009738, -10886215, -10817104, -10678369, -10500274, -10383074, -10277291, -10141039, -10018178, -9879793, -9764148, -9675177, -9600367, -9486948, -9436502, -9408292, -9372369, -9343168, -9302002, -9177692, -9090088, -9012397, -8899459, -8792611, -8681968, -8536012, -8438368, -8361258, -8268367, -8160810, -8074981, -7935582, -7814379, -7744561, -7632820, -7514260, -7403729, -7343281, -7267580, -7207520, -7190096, -7140952, -7048132, -6992179, -6922231, -6872674, -6823164, -6727086, -6652871, -6593784, -6514763, -6470639, -6460454, -6424823, -6315593, -6271421, -6224490, -6160603, -6065170, -5996030, -5912533, -5876654, -5829437, -5783375, -5743871, -5696114, -5657488, -5630126, -5610784, -5580115, -5530679, -5478188, -5454359, -5425975, -5431595, -5434538, -5391289, -5285916, -5231911, -5249717]
13703e249717L3306K7456P2738K8285N1871K7267O8795L4539k3671J7481R8938
13692d812712L2366M640O4867P6230R1927P3550J6795K1469K9407K2476M1676
13681d337309J2895j33P311J1630K8853O1686P3865J5304N1633M5641K9015p904
13669d007513j2954M8977O1925M9133K5313J3784J0843J2888j533J2450K3711
13658c762976M0394M1300L8838J8509K3847M6883K8632M0371j5404K5528Q6040
13647c388038N7424J8769m389m4279p796J0405n568K0077N8217M1495J8633O349
13635c218701K7824Q6130R5895J0126j7053K1651J3491M5476m707o692M6420J7651
13623b882489R519l6645k9500Q3061Q9757K4083O17K1008L2003j4560m444J0986
$$ y = [-5249717, -5216411, -5188955, -5116217, -5087932, -5036061, -5008794, -4939999, -4905460, -4929131, -4911650, -4812712, -4780346, -4775706, -4710839, -4634609, -4542682, -4469132, -4452337, -4430868, -4401461, -4378985, -4337309, -4324414, -4324547, -4317236, -4305606, -4276753, -4215067, -4141202, -4125898, -4074265, -4028624, -3999609, -4007513, -4020467, -3971490, -3909565, -3860432, -3835119, -3821335, -3810492, -3797604, -3799137, -3786687, -3762976, -3722582, -3681282, -3642444, -3623935, -3600088, -3553205, -3524573, -3484202, -3499606, -3474078, -3388038, -3330614, -3311845, -3316234, -3360513, -3368309, -3357904, -3363472, -3343395, -3285178, -3243683, -3225050, -3218701, -3190877, -3104747, -3008852, -2998726, -3015779, -2994128, -2980637, -2935161, -2939868, -2946560, -2900140, -2882489, -2872970, -2909615, -2939115, -2856054, -2766297, -2742214, -2741597, -2720589, -2688586, -2703146, -2707590, -2696604]
13611b696604M9005N4475P107L3252P9411J2231N927R441J8795M057J5772R656
13599b397475L0574K4341m2023J3345N1733n69j2634n2690m3960k1088K4414K2032
13587b404000K6129N3755L1657O8090P4490K0411L7950L3462J8344n523J7019
13576b028216L0147J1501K861L2702M4089K9956j0773K0574K5516J3267M2193
13565a786183k589q930P2363M1269L6913J2797P218J118M246N8496J1339p821
13553a559764k5845N050N3054M0860j1212N737Q1071N0177J8593M416K3878K1265
13541a292720k6026k4778L2537N2408J4674r031J1733K1972J0051L590l9687L7735
13529a207542J6859J6695J8043J8889L278M2340j1902p320J1617K2282K0083j7003
$$ y = [-2696604, -2647599, -2593124, -2586017, -2552765, -2473354, -2461123, -2455196, -2445755, -2426960, -2422903, -2407131, -2397475, -2366901, -2342560, -2384583, -2371238, -2319505, -2320074, -2332708, -2385398, -2429358, -2450446, -2426032, -2404000, -2377871, -2324116, -2292459, -2224369, -2149879, -2129468, -2091518, -2058056, -2039712, -2045235, -2028216, -1998069, -1986568, -1983707, -1951005, -1906916, -1876960, -1887733, -1867159, -1841643, -1828376, -1786183, -1788772, -1797702, -1725339, -1684070, -1647157, -1634360, -1627142, -1626024, -1621778, -1563282, -1551943, -1559764, -1585609, -1580559, -1527505, -1486645, -1497857, -1492120, -1411049, -1360872, -1342279, -1337863, -1313985, -1292720, -1318746, -1343524, -1310987, -1258579, -1243905, -1252936, -1241203, -1219231, -1209180, -1205590, -1245277, -1207542, -1190683, -1173988, -1155945, -1137056, -1133778, -1091438, -1103340, -1110660, -1099043, -1076761, -1056678, -1073681]
13517a073681K0562J5297L8713o161j1404K0995N3644N7440k4055K6794L5253
13506h46603n7968J3644M3301j1977L9197N3572Q522Q24p606K1568k1615K3213
13494g41928M5438L3977J534M1496L8626K0092L1118M286k1689j0819K2916J2802
13482e22151K1394M6451r778k3617O771L0700O570M132L6624N2275J6324q48p197
13469c42350k3986l1647O7573N3457L0493m967O730M0841J3656L042j7552L1925
13457a72785O9151K2795K4099J0682l3054k0630j1058M0764J168J2646K8338K6423
13445a461R023L5002M1925J9878L8308J8516o515J1587J9979L909j2245M935J5641
13432A98482n448J7290M0448M1849P5400M2031L8012L8904M0011K4690Q959n006
$$ y = [-1073681, -1053119, -1037822, -999109, -1005270, -1016674, -995679, -942035, -884595, -908650, -881856, -846603, -904571, -890927, -847626, -859603, -820406, -766834, -758312, -757488, -765094, -743526, -765141, -741928, -696490, -662513, -660979, -619483, -580857, -560765, -529647, -525361, -547050, -557869, -534953, -522151, -500757, -454306, -464084, -487701, -480930, -450230, -443660, -439528, -402904, -350629, -334305, -335153, -342350, -366336, -397983, -330410, -276953, -246460, -251427, -244697, -203856, -190200, -187158, -204710, -172785, -103634, -80839, -56740, -46058, -79112, -99742, -110800, -70036, -68868, -56222, -27884, -1461, 7562, 42564, 84489, 104367, 142675, 161191, 154676, 166263, 186242, 190151, 177906, 182841, 198482, 193034, 210324, 250772, 292621, 368021, 410052, 448064, 486968, 526979, 551669, 560628, 555622]
13420E55622R6387J08612P1898Q3692J03710J01907L9681k3480j21067l03362
13410G13600l72640l16702k37966j23271o2698K5796O5431R0797N5887L7261N4026
13399g0479N0015o845L3328M8239L398L4145K0679O4102J7579J0051K1367Q0509
13387C06088O6934J0108J2721p21J6059J2289L6647K3032K2041K1804K2085m0100
13375E08987K5282P0921J9628k43k6633L2060K4117L3337K0369n992p149k510
13363F92174j7629L1800O8784M8200M589J3785K3929K067q90L3597k603L8680
13351I36483N0077J3666L0705J635J5993k1261K0563K9818K7877K7071l0613J9705
13339A121719N5435O1618k1657l321M7650N0110J9084j704K7642O9269j1443J6023
$$ y = [555622, 652009, 760621, 832519, 916211, 1019921, 1121828, 1161509, 1138029, 1016962, 713600, 340960, 24258, -213708, -336979, -399677, -373881, -308450, -217653, -161766, -124505, -70479, -20464, -27309, 6019, 54258, 57656, 91801, 112480, 176582, 194161, 204212, 225579, 306088, 373022, 383130, 395851, 395130, 411189, 423478, 460125, 483157, 505198, 527002, 549087, 508987, 534269, 605190, 624818, 624575, 597942, 630002, 654119, 687456, 707825, 701833, 694684, 692174, 674545, 706345, 775129, 823329, 827918, 841703, 865632, 867699, 866809, 900406, 897803, 936483, 986560, 1000226, 1030931, 1032566, 1048559, 1027298, 1047861, 1077679, 1105556, 1132627, 1102014, 1121719, 1177154, 1238772, 1217115, 1213794, 1261444, 1311554, 1330638, 1328934, 1356576, 1425845, 1414402, 1430425]
13327A430425M0731L6522j6920j8448L7818P0545M4571L683N3850J21183Q6319
13316A890279O7405K5354J00294J33543J25230J58059J27528J30985Q1693o7401
13306B772969k99983n75233p46566o02573k94765j3334J10409J35493J08380Q2128
13296F76925O8486J19264N1414M9482L2585K9385L3665N9311N6152n122J5575
13285A187122K5878M5792O5898O1784J5490K2345k236O4178J2955K7787M3469
13274A570462L2455K2182k9815j8773J9250j5074M467L2784N0912N6741J3755
13263A739346J6417k4392n522K8426r313R3125L5424L02j4872J3852K8398N9286
13251A960477O7218L0530J023L1509J8585N951L9659j7997J5882O0400K6772n0346
$$ y = [1430425, 1471156, 1507678, 1490758, 1472310, 1510128, 1580673, 1625244, 1628927, 1682777, 1803960, 1890279, 1957684, 1983038, 2083332, 2216875, 2342105, 2500164, 2627692, 2758677, 2840370, 2772969, 2472986, 1897753, 1151187, 548614, 253849, 240515, 350924, 486417, 594797, 676925, 745411, 864675, 916089, 965571, 998156, 1027541, 1061206, 1120517, 1176669, 1171547, 1187122, 1213000, 1258792, 1324690, 1386474, 1401964, 1424309, 1422073, 1486251, 1499206, 1526993, 1570462, 1602917, 1625099, 1595284, 1576511, 1595761, 1580687, 1585154, 1617938, 1668850, 1725591, 1739346, 1755763, 1731371, 1725849, 1754275, 1744962, 1838087, 1873511, 1873813, 1858941, 1872793, 1901191, 1960477, 2027695, 2058225, 2059248, 2090757, 2109342, 2115293, 2154952, 2136955, 2152837, 2213237, 2240009, 2189663]
13239B189663J0634N3454j1272j9576K0368L349L9945O7788M7119k6747j12L0401
13227B405014L4982M5168K8335J1032J6870J311L5245j4982N7082M4962j9587
13216B645432j1188l2790J5055L6312j3189L8503M9527L4739Q670K3217l066P932
13204B799154K6563j4342J0009N1204M0646J7997N2606O1067j9565J234L414J7365
13192C047352l8609N943M4075M8915M2801N9023J5756l1862k9754J1271L7994
13181C212905N1625O3358Q485n903N310J0568j758n2881r5698o3971M8813M3577
13169C224430L4163J07823P0108M0843N9305L2803n176N8121M7751K2254N1890
13158C744315N1134R7530M1277J931P935m1727J1657K8696L1415N0237J9295K880
$$ y = [2189663, 2200297, 2253751, 2242479, 2222903, 2243271, 2246620, 2286565, 2354353, 2401472, 2374725, 2374613, 2405014, 2439996, 2485164, 2513499, 2524531, 2541401, 2542712, 2577957, 2562975, 2620057, 2665019, 2645432, 2634244, 2601454, 2616509, 2652821, 2639632, 2678135, 2727662, 2762401, 2771071, 2794288, 2791222, 2799154, 2825717, 2811375, 2821384, 2872588, 2913234, 2931231, 2983837, 3044904, 3025339, 3026573, 3029987, 3047352, 3008743, 3014686, 3058761, 3107676, 3150477, 3209500, 3225256, 3193394, 3163640, 3174911, 3212905, 3264530, 3327888, 3336373, 3330470, 3335780, 3346348, 3344590, 3291709, 3196011, 3132040, 3180853, 3224430, 3258593, 3366416, 3436524, 3477367, 3536672, 3569475, 3564299, 3622420, 3670171, 3692425, 3744315, 3795449, 3892979, 3934256, 3936187, 3944122, 3902395, 3914052, 3942748, 3974163, 4024400, 4043695, 4046575]
13146D046575M021l0179M0732J05700P4077L9396Q405L349j6710N5546O4597K8962
13134D424471L6779M7349K9240K1618J6848L6780L3810P521M1977P9383q844p493
13122D759439l5019O4526L7403j0573n2706p002Q4796M4543o659L3391N1316J1842
13110D975297M5025M9709K7867M4345N6565K1586K6964N0999L2507L5090K0891
13099E386845J4175M7657k791Q126O7102N7548K5569J2450K6986P1135K5152O559
13087E746513J5085Q2475J18498N5999O2115L5827k0134K4446M0809O8106K6861
13076F256600N4546Q8475j1630P900M8189J3791j1391J4479L3963R2582N9953
13065F647457L1455J5573J9057M3377M9505N0041K0264O2990R9284P0144J6531
$$ y = [4046575, 4050596, 4020417, 4061149, 4166849, 4240926, 4280322, 4288727, 4292076, 4275366, 4330912, 4395509, 4424471, 4461250, 4508599, 4537839, 4559457, 4576305, 4613085, 4646895, 4654416, 4696393, 4775776, 4766932, 4759439, 4724420, 4788946, 4826349, 4815776, 4763070, 4756068, 4840864, 4885407, 4878748, 4912139, 4963455, 4975297, 5020322, 5070031, 5097898, 5142243, 5198808, 5220394, 5247358, 5298357, 5330864, 5365954, 5386845, 5401020, 5448677, 5445886, 5454012, 5521114, 5578662, 5604231, 5616681, 5643667, 5714802, 5739954, 5746513, 5761598, 5844073, 5962571, 6018570, 6080685, 6116512, 6096378, 6120824, 6161633, 6229739, 6256600, 6311146, 6399621, 6387991, 6395891, 6444080, 6457871, 6446480, 6460959, 6494922, 6587504, 6647457, 6678912, 6694485, 6713542, 6756919, 6806424, 6856465, 6876729, 6939719, 7039003, 7109147, 7125678]
13054G125678J01051J09672L0579M2395J16101N5526K7541M7025J17404O2107
13044G835079J2548L2016O9198N4053N8592J05746L8849O1995O9585K2356L156
13033H363173k135P1937M8048P3349Q4835O3447J03689M2821Q0379J05561J17789
13022I152893Q3410P8578J30025O8221Q9438J16514Q0927M4265M0422J7478M8069
13011I950240J32315R8432N5239P3851J11665J24484Q4014L5248P7481R8323J18979
13000A0960271J37078J04933O4474M2977J13507J61082J00624Q8210J78092J22196
12990A2073444J07417J15462J16551J11640O6723P5779R5908R2288J72535J11106
12980A3138853O0739P1758P7632Q2961J31229J78288J20317J21975Q8427J09180
$$ y = [7125678, 7226729, 7336401, 7366980, 7409375, 7525476, 7581002, 7608543, 7655568, 7772972, 7835079, 7847627, 7879643, 7948841, 8002894, 8061486, 8167232, 8206081, 8268076, 8337661, 8360017, 8363173, 8361038, 8432975, 8481023, 8554372, 8639207, 8702654, 8806343, 8849164, 8929543, 9035104, 9152893, 9236303, 9314881, 9444906, 9513127, 9602565, 9719079, 9800006, 9844271, 9884693, 9902171, 9950240, 10082555, 10180987, 10236226, 10310077, 10421742, 10546226, 10630240, 10665488, 10742969, 10841292, 10960271, 11097349, 11202282, 11266756, 11309733, 11423240, 11584322, 11684946, 11773156, 11951248, 12073444, 12180861, 12296323, 12412874, 12524514, 12591237, 12667016, 12762924, 12855212, 13027747, 13138853, 13199592, 13271350, 13348982, 13431943, 13563172, 13741460, 13861777, 13983752, 14072179, 14181359]
12970A4181359J65923J21009J44641J58253J57858J35877J68427J32918J74600
12961A5540865K29799J98741K10287K28680K29087K08116J91089K56468K65692
12952A7558824J97608J61507J90713K42162J87869K45380K21682K67326K47007
12943A9520078K13088K62504L24762L52344K88098K65044K57891L07922L18088
12934B2109819K61216K42919K76559L67065L15885L32331L35506L20475L61259
12925B4923034M02628M42609M32153M53788M68212M65438M88929N46741N69614
12916B9193146O21538O59664P36437P82615P09765P55577P71013P54359P77914
12907C5762028P52785Q08133R00124R48253R93975J012878J089557J144205J222729
$$ y = [14181359, 14347282, 14468291, 14612932, 14771185, 14929043, 15064920, 15233347, 15366265, 15540865, 15770664, 15969405, 16179692, 16408372, 16637459, 16845575, 17036664, 17293132, 17558824, 17756432, 17917939, 18108652, 18350814, 18538683, 18784063, 19005745, 19273071, 19520078, 19733166, 19995670, 20320432, 20672776, 20960874, 21225918, 21483809, 21791731, 22109819, 22371035, 22613954, 22890513, 23257578, 23573463, 23905794, 24241300, 24561775, 24923034, 25325662, 25768271, 26200424, 26654212, 27122424, 27587862, 28076791, 28623532, 29193146, 29814684, 30474348, 31210785, 31993400, 32703165, 33458742, 34229755, 34984114, 35762028, 36514813, 37322946, 38223070, 39171323, 40165298, 41178176, 42267733, 43411938, 44634667]
12898D4634667J389631J488099J523311J683261J776423J857272J987772K141320
12890E8481756K309042K391349K364088K379009K484270K718259L110272L806351
12882H0044396M437863M955138N447942N990923O696383P630707Q763812J0298382
12874A34265546J2246665J4515418J7568257K1554903K6495686L1232147K9212497
12867B87091119P070636l7978357q3248394j15616501j35914452j14379219m8876927
12860b41852095N227862K5014785K5497940K0739326J5913634J2298301J0169004
12853a26991243Q874417P825771O858565O007143N232055M487776L919286L437567
12845h0348663K884013K436522K161027K058602K000982J962583J864062J811143
$$ y = [44634667, 46024298, 47512397, 49035708, 50718969, 52495392, 54352664, 56340436, 58481756, 60790798, 63182147, 65546235, 67925244, 70409514, 73127773, 76238045, 80044396, 84482259, 89437397, 94885339, 100876262, 107572645, 115203352, 123967164, 134265546, 146512211, 161027629, 178595886, 200150789, 226646475, 257878622, 287091119, 294161755, 256183398, 172935004, 57318503, -78595949, -192975168, -241852095, -236624233, -211609448, -186111508, -165372182, -149458548, -137160247, -126991243, -118116826, -110291055, -103432490, -97425347, -92193292, -87705516, -83786230, -80348663, -77464650, -75028128, -72867101, -70808499, -68807517, -66844934, -64980872, -63169729]
12837f3169729J726886J608427J423848J341976J312071J296099J248113J180337
12829e2031972J142838J140876J135088J087713J027112R77446Q59413Q26469
12821d3835017Q31625P74998P11035O76750O84929P25018O14202N60133O08248
12812c7648079O13190N92985O30820N75632L35910J64298J04367J3727R0643L91394
12802c4135113N31687M50832L71281L10809K43695K83981M00116M46049M35288
12793c0661375M23146M26721L54266L77883L60569L21386L44135L50950L26866
12784b7375453L21842L41243K80764K39353K87484K85056L10501K90647K82482
12775b4736081K34787K14443K01109J93572K13531J84397K06594J96808J91481
$$ y = [-63169729, -61442843, -59834416, -58410568, -57068592, -55756521, -54460422, -53212309, -52031972, -50889134, -49748258, -48613170, -47525457, -46498345, -45520899, -44661486, -43835017, -43003392, -42228394, -41517359, -40840609, -40155680, -39430662, -38816460, -38256327, -37648079, -37034889, -36441904, -35811084, -35235452, -34899542, -34735244, -34630877, -34617150, -34526507, -34135113, -33603426, -33152594, -32781313, -32470504, -32226809, -31942828, -31542712, -31096663, -30661375, -30238229, -29811508, -29457242, -29079359, -28718790, -28397404, -28053269, -27702319, -27375453, -27053611, -26712368, -26431604, -26192251, -25904767, -25619711, -25309210, -25018563, -24736081, -24501294, -24286851, -24085742, -23892170, -23678639, -23494242, -23287648, -23090840, -22899359]
12766b2899359J93809K11011K16234K05407K11266J50474J41344J78725J92705
12757b1198384J26560J04270J17467P8223J19338J84866K16708J81231J68941
12748a9900780K11012K44071J90087J85935K09161K32523K36068J44349J47891
12739a8099683J09600Q5226O0263R0713J01571J46855J11721J21917J16817J51575
12729a7003425J52616J29516R6229J45018J19162J76326J72325J15173J63221
12720a5733839J33153J52052J36079J05240R0914Q4754J34061J80421J59793J01427
12710a4455945N2738R5186Q4515O0226R6051R3833Q2779P7198N4666J8559N7099
12699a3683095J15746J14793O9082O0595J28977N6857O1667J43747R8184Q4049
$$ y = [-22899359, -22705550, -22494539, -22278305, -22072898, -21861632, -21711158, -21569814, -21391089, -21198384, -21071824, -20967554, -20850087, -20771864, -20652526, -20467660, -20250952, -20069721, -19900780, -19689768, -19445697, -19255610, -19069675, -18860514, -18627991, -18391923, -18247574, -18099683, -17990083, -17904857, -17844594, -17753881, -17652310, -17505455, -17393734, -17271817, -17155000, -17003425, -16850809, -16721293, -16625064, -16480046, -16360884, -16184558, -16012233, -15897060, -15733839, -15600686, -15448634, -15312555, -15207315, -15116401, -15031647, -14897586, -14717165, -14557372, -14455945, -14403207, -14308021, -14223506, -14163280, -14067229, -13973396, -13890617, -13813419, -13758753, -13740194, -13683095, -13567349, -13452556, -13383474, -13322879, -13193902, -13137045, -13075378, -12931631, -12833447, -12749398]
12689a2749398P5448Q9237N2226P8389P2593O1335M9235K3640N8495J16058O3410
12678a2009332M5976N9719N9279N1141N4048J0603K4754O1261M6063J1094M0023
12667a1545371K5634M7254O4672O0395M4551O2362P4593J48417J05244J5012L2063
12656a0865174L5000M2960L0070P6339N2475N0683P5719M4464N5755N4805M7384
12645a0299520n775R391O2125P3220L3618k220K0224P7327P7600N947L2040j5434
12633i931457O2513N3369O6290Q7949M1562J0379N49L7885K8612l618J3005J6308
12621i516654Q476M6357N5691L7115Q032J3557J01865K0856k527l639l345M2813
12609i191403P2398N4081M0741L7315j0919J4172L5541P4087R9002L3458J7590
$$ y = [-12749398, -12673950, -12584713, -12532487, -12454098, -12381505, -12320170, -12270935, -12247295, -12188800, -12072742, -12009332, -11963356, -11903637, -11844358, -11793217, -11739169, -11728566, -11703812, -11642551, -11596488, -11585394, -11545371, -11519737, -11472483, -11407811, -11347416, -11302865, -11240503, -11165910, -11017493, -10912249, -10897237, -10865174, -10830174, -10787214, -10757144, -10680805, -10628330, -10577647, -10501928, -10457464, -10401709, -10346904, -10299520, -10305295, -10295904, -10233779, -10160559, -10126941, -10129161, -10108937, -10031610, -9954010, -9948063, -9916023, -9931457, -9868944, -9815575, -9749285, -9661336, -9619774, -9609395, -9608846, -9570961, -9542349, -9545967, -9532962, -9516654, -9508178, -9461821, -9406130, -9369015, -9360983, -9347426, -9245561, -9224705, -9227232, -9230871, -9234216, -9191403, -9119005, -9064924, -9024183, -8986868, -8997787, -8983615, -8948074, -8873987, -8774985, -8741527, -8723937]
12598h723937O0314K2250K9035N6490N1443K0023k6269K068M2862O3063N837k4469
12586h421290L7194P1560M9573l439J7245P430J402L7719M3067M5703J3102K5745
12574h074989J8035L9254L8673P187J9144j1650j926L9747K4564J6149J6703J3686
12562g855423J378l2377m2966o8145l2339J9194J3792P5744J44557J00932J5978
12551g659675Q7665Q9791k772o282K4292M7602M6029M3768K077Q025K4308N2798
12539g242374N0856L7392k4664O07o313M8739N5067Q071L8443j763j9503M0002
12527g015440M6663M9521O4823j2338j5399Q951J501K6660K8066o122q339M2172
12515f789281J344q836J8637N5870M6190J6115p24L764J8384O8917L7786j0931
$$ y = [-8723937, -8663623, -8641373, -8612338, -8555848, -8504405, -8484382, -8510651, -8508583, -8465721, -8402658, -8396821, -8421290, -8384096, -8312536, -8262963, -8266402, -8249157, -8241727, -8240325, -8202606, -8159539, -8113836, -8100734, -8074989, -8056954, -8017700, -7979027, -7971840, -7952696, -7964346, -7966272, -7926525, -7901961, -7885812, -7869109, -7855423, -7854045, -7886422, -7929388, -7997533, -8029872, -8010678, -7996886, -7921142, -7776585, -7675653, -7659675, -7572010, -7482219, -7484991, -7491273, -7466981, -7419379, -7373350, -7329582, -7327505, -7319480, -7295172, -7242374, -7191518, -7154126, -7178790, -7178183, -7184496, -7135757, -7080690, -7072619, -7034176, -7035939, -7055442, -7015440, -6968777, -6919256, -6854433, -6866771, -6882170, -6873219, -6871718, -6845058, -6816992, -6823114, -6831453, -6789281, -6787937, -6796773, -6778136, -6722266, -6676076, -6659961, -6660685, -6656921, -6638537, -6569620, -6531834, -6542765]
12503f542765k0223m147M5519P2615L4217N7409K3615J6160J0653k9017J3588
12492f322376p989k7184J2635J9032K7072K1674K9015j2626j8497K61O9335L2142
12480f177506Q83j1913j8226O303L2947R3892J3279J7149m998J4413N1878L0792
12468e951107K2581L672l2853K8982J0436Q709K7723L8186K5398l4673k9136K4400
12456e857682O2002M8085M0315P2650K9048N268k3562p38J6562K8181L910O736
12444e569225K1764M4112J4002J578k1680L9404O4224Q5662L4900J8037K9484
12433e237738L1369M4342L5848Q0463L4960L4440N1245J11717Q2179J25768J46532
12422d458875J52799J92676J45312p2650l28994m86214o38894o90982m69431j10001
$$ y = [-6542765, -6562988, -6567135, -6521616, -6449001, -6414784, -6357375, -6333760, -6317600, -6306947, -6335964, -6322376, -6330365, -6357549, -6344914, -6325882, -6298810, -6277136, -6248121, -6260747, -6279244, -6278983, -6209648, -6177506, -6176623, -6188536, -6206762, -6200459, -6167512, -6073620, -6060341, -6043192, -6048190, -6033777, -5981899, -5951107, -5928526, -5924854, -5957707, -5928725, -5918289, -5909580, -5881857, -5843671, -5818273, -5852946, -5882082, -5857682, -5795680, -5747595, -5707280, -5634630, -5605582, -5600314, -5623876, -5624614, -5608052, -5579871, -5575961, -5569225, -5547461, -5503349, -5489347, -5487769, -5509449, -5470045, -5405821, -5320159, -5285259, -5267222, -5237738, -5206369, -5162027, -5126179, -5045716, -5010756, -4976316, -4925071, -4813354, -4731175, -4605407, -4458875, -4306076, -4113400, -3968088, -4040738, -4369732, -4855946, -5494840, -6185822, -6655253, -6765254]
12412f765254J09522J71440P7980L3974P1886J02194J09437O3935K4818R771N6370
12401e933927Q4437O9203M7701K7415L8467K8859j3080m9086k5924j3886M2602
12390e697219K5134Q198M3217M4523J1747P3136J3468K548J1711o304K8680L7598
12378e403563Q442r185n950L7320N5205M6819j1879K8124K5370l2662l6589L2518
12366e266030K4252L3719L1325l2228l7282K8638N3132L2779K7823J3761J8746
12355e071365n0444k8364j1726O883L2805L6891n5073L5020O6885L0497R270J7317
12343d981404j3938m0614K1l639K566r352p087L4535L0944J1699L1383R754J4847
12330d920285Q931n317M3459K8793j5332k7403J9630L0699O6511M230m1087k3881
$$ y = [-6765254, -6655732, -6484292, -6406312, -6372338, -6300452, -6198258, -6088821, -6024886, -6000068, -5990297, -5933927, -5849490, -5780287, -5732586, -5705171, -5666704, -5637845, -5650925, -5700011, -5725935, -5739821, -5697219, -5672085, -5663887, -5620670, -5576147, -5564400, -5491264, -5477796, -5475248, -5463537, -5469841, -5441161, -5403563, -5395121, -5404306, -5410256, -5372936, -5317731, -5270912, -5282791, -5254667, -5229297, -5261959, -5298548, -5266030, -5241778, -5208059, -5176734, -5208962, -5246244, -5217606, -5164474, -5131695, -5103872, -5090111, -5071365, -5121809, -5150173, -5161899, -5155016, -5122211, -5085320, -5140393, -5105373, -5038488, -5007991, -4998721, -4981404, -4995342, -5035956, -5035935, -5039574, -5037008, -5046360, -5053447, -5018912, -4987968, -4976269, -4944886, -4935132, -4920285, -4911354, -4916671, -4873212, -4844419, -4859751, -4887154, -4867524, -4836825, -4770314, -4766084, -4807171, -4831052]
12318d831052k9335N479L3507j1334K364R766k1650K3677K576J8022K1327M910
12306d771743J6010J9132O5420L7324m8008l733M5659N8164j9112j0884J8879
12295d592892J9016L0866q685k4963p570L3713m997M129j4539r327P4023K4786
12283d476440q296m618j9233K8328J1796K7065r43m6964j5203l7430Q523M0531
12271d492884L5996k0027L809j137R094K3453L606J2344L2804J7124m491o990
12259d387299j2398j5817L4032r790j8650r316L1645J3618K1793L4332J2516L159
12247d302175O1001M4691p188K3435q052m7080J1621P431k5864m6948O014L7976
12235d245138k7960J9569J2584j9816J0858M0768j9105j7973K8247O2507L9801
$$ y = [-4831052, -4860387, -4854908, -4821401, -4832735, -4830371, -4820605, -4842255, -4818578, -4816002, -4797980, -4776653, -4771743, -4755733, -4736601, -4671181, -4633857, -4681865, -4685598, -4639939, -4581775, -4600887, -4611771, -4592892, -4573876, -4543010, -4551695, -4576658, -4584228, -4550515, -4555512, -4551383, -4565922, -4575249, -4501226, -4476440, -4484736, -4489354, -4508587, -4480259, -4468463, -4441398, -4442341, -4489305, -4504508, -4541938, -4533415, -4492884, -4456888, -4476915, -4473106, -4474243, -4465149, -4441696, -4438090, -4425746, -4392942, -4375818, -4380309, -4387299, -4399697, -4415514, -4381482, -4391272, -4409922, -4419238, -4387593, -4373975, -4352182, -4317850, -4305334, -4302175, -4241174, -4196483, -4203671, -4180236, -4188288, -4235368, -4223747, -4216316, -4242180, -4289128, -4283114, -4245138, -4273098, -4253529, -4240945, -4260761, -4249903, -4209135, -4228240, -4246213, -4217966, -4155459, -4115658]
12224d115658J0057K2730O300j2240J9683q468n8206R947n85k9962k5549L0640
12212d151311M0752P960J2322L4314M0623n7557k8853K8056Q694l6134j9609Q4437
12200d036306M6989k8893k7140M124j8990J0898j5695q317J0821J5753p623K4306
12188d030073M6225n501j3695L1659j5376J800q234j3277L7682L2050M113J9416
12176c913211j552K0707O175L8781q144l4969R439O0112p431k1332j134L4880
12164c817679j7777k1881K7392Q258P383q022j5707l27j3148J3711O9989J955
12152c765853o2756M732M3835k2319O066J628J8561n594j9398J5191M9632K997
12140c733278k8468m7519Q123K6451k8081m398K8974L5417O0007p649p5663k5256
$$ y = [-4115658, -4105601, -4082871, -4076571, -4088811, -4069128, -4077596, -4135802, -4125855, -4126440, -4156402, -4181951, -4151311, -4110559, -4102599, -4090277, -4055963, -4015340, -4072897, -4101750, -4073694, -4065000, -4101134, -4120743, -4036306, -3989317, -4018210, -4045350, -4041226, -4060216, -4049318, -4065013, -4073330, -4062509, -4046756, -4054379, -4030073, -3983848, -3989349, -4003044, -3971385, -3986761, -3984961, -3993195, -4006472, -3968790, -3936740, -3932627, -3913211, -3914763, -3894056, -3887881, -3849100, -3857244, -3892213, -3882774, -3822662, -3830093, -3851425, -3852559, -3817679, -3835456, -3857337, -3829945, -3821687, -3814304, -3822326, -3838033, -3838360, -3851508, -3837797, -3767808, -3765853, -3828609, -3823877, -3780042, -3802361, -3796295, -3794667, -3776106, -3781700, -3801098, -3785907, -3736275, -3733278, -3761746, -3809265, -3801142, -3774691, -3802772, -3807170, -3778196, -3742779, -3682772, -3690421, -3766084, -3791340]
12128c791340J0671M7459L7754k273j9534P051k6368j1751K0333J081K3532K4257
12116c679128L5627K0619j655j9979J904l3141m5506N1765Q3898M3889K1996k2250
12104c541961k4254J0116l4283m4615K9861J1461k197L2776K6174j7425l188k1485
12092c579020m6611j777k010j5950K2374N387L6841P573J2619L4668P882J0681
12080c507343m6428j5031J3969K9985L4578r934r835l411L0892M0642K1795j6300
12068c436421j6702j9842K5723M6385m17k4078n867m3157j7808K1636j056P862
12056c463742N707R621m644J1592K581j4249L7213K2664n951l7515l823J4567
12044c425979J4347J8241J0851J49j4769k940j7651K093m001k097M5764l3751
$$ y = [-3791340, -3780669, -3733210, -3695456, -3697729, -3717263, -3710212, -3736580, -3748331, -3727998, -3726917, -3703385, -3679128, -3643501, -3622882, -3624537, -3644516, -3642612, -3675753, -3721259, -3669494, -3585596, -3541707, -3519711, -3541961, -3566215, -3556099, -3590382, -3634997, -3605136, -3593675, -3595872, -3563096, -3536922, -3554347, -3557535, -3579020, -3625631, -3627408, -3629418, -3645368, -3622994, -3617607, -3580766, -3573193, -3560574, -3525906, -3518024, -3507343, -3553771, -3568802, -3554833, -3524848, -3490270, -3500204, -3510039, -3513450, -3482558, -3441916, -3420121, -3436421, -3453123, -3472965, -3447242, -3400857, -3401274, -3425352, -3431219, -3474376, -3492184, -3470548, -3471604, -3463742, -3458035, -3448414, -3453058, -3441466, -3438885, -3453134, -3415921, -3393257, -3399208, -3436723, -3440546, -3425979, -3411632, -3393391, -3382540, -3382391, -3397160, -3400100, -3417751, -3415658, -3419659, -3421756, -3375992, -3409743]
12032c409743J8611O9527K2561Q416Q024m0547l9615J4464j2221K1708j7804k453
12020c359072N713k1078K0391J9017K3028L909J8185l4155Q860J2683j5990Q815
12008c309694l350L7574L2348L716k0928K1928j1292M27K3890j7980k042K0169
11996c225234k6817Q106j2043j4918l1783o513k8719J2220M0260K6950K1628K5634
11984c211229J5365o533m2913k3198K6720K3923M297J4966J1154L613l3872J7969
11972c199738K4397m733n9096O654M5430K1923K654K7619J2169Q988M704j2122
11960c121151q105j5353k3227J0641j3554J2773J0883l744k032M3027K0460l2552
11948c121934j9948o849N13n282K2395M0394N2086Q663p288k179k3004O075J2752
$$ y = [-3409743, -3391132, -3321605, -3299044, -3290628, -3282604, -3323151, -3362766, -3348302, -3360523, -3338815, -3356619, -3359072, -3353359, -3374437, -3354046, -3335029, -3312001, -3308092, -3289907, -3324062, -3315202, -3302519, -3318509, -3309694, -3313044, -3275470, -3243122, -3239406, -3260334, -3238406, -3249698, -3249271, -3225381, -3243361, -3245403, -3225234, -3252051, -3243945, -3255988, -3270906, -3302689, -3309202, -3337921, -3325701, -3285441, -3258491, -3236863, -3211229, -3195864, -3202397, -3245310, -3268508, -3241788, -3217865, -3213568, -3198602, -3187448, -3183835, -3217707, -3199738, -3175341, -3180074, -3239170, -3232516, -3187086, -3165163, -3162509, -3134890, -3122721, -3113733, -3109029, -3121151, -3129256, -3144609, -3167836, -3157195, -3170749, -3157976, -3147093, -3150837, -3152869, -3109842, -3089382, -3121934, -3141882, -3148731, -3148218, -3153500, -3131105, -3090711, -3038625, -3029962, -3037250, -3039429, -3062433, -3056358, -3043606]
11935c043606m8962K9971L0004J2720j0925k0214K0368O074o37l8548k5407O493
11923c082669n022m517M5896J7649k182N4002j6486j6955j0452J1162k6606m293
11911c040473O987L4641j2219P620l101l509K9116k5988k538k7383k2444M2239
11899c017052N8599j1018k200j3738r720J4259P411J2535L4700K002k6353l1229
11887b981804J5798K2036N9440j6817n7038k1529K0037M214k4673m765L86k910
11875b987625K2744M1432l5947o116j0032J9939K0124J9932J5944j0038p4538
11864b984181R226O7688M1353J0678K4092K7640l4533k7683M513l5399M830K2085
11852b869691K8021J3221L217O955m2905L518R666j0478M1547M0410L3875q704
$$ y = [-3043606, -3092568, -3062597, -3032593, -3019873, -3030798, -3051012, -3030644, -3024570, -3025207, -3063755, -3089162, -3082669, -3087691, -3092208, -3046312, -3028663, -3030845, -2976843, -2993329, -3010284, -3020736, -3009574, -3036180, -3040473, -3033486, -2998845, -3011064, -3003444, -3006545, -3010054, -2980938, -3006926, -3009464, -3036847, -3059291, -3017052, -2958453, -2969471, -2971671, -2985409, -2995129, -2980870, -2973459, -2960924, -2926224, -2924222, -2950575, -2981804, -2966006, -2943970, -2884530, -2901347, -2958385, -2979914, -2959877, -2955663, -2980336, -2985101, -2984715, -2987625, -2964881, -2923449, -2959396, -2965512, -2975544, -2955605, -2935481, -2915549, -2899605, -2909643, -2984181, -2974955, -2907267, -2865914, -2855236, -2831144, -2803504, -2838037, -2865720, -2861207, -2896606, -2891776, -2869691, -2841670, -2828449, -2825232, -2818277, -2861182, -2857664, -2847998, -2858476, -2816929, -2776519, -2742644, -2751348]
11840b751348q30j3582k3550L6475J6272k8664k2756n0011j7920k4081j3036j0629
11828b903660q386M3423M4280M381M452M4762N0377k7248k9590j4581n3190L4759
11816b810221M6991M0458l9393l1756j1937l3617L1193K1646L900l1280K6788
11805b787228L4886j823M3354o776j3651j0479j9899J128m2520P586K1155J1636
11793b762631M3744K4522l6224n0888j1756J6528N983j1384o646K4755K2084N707
11781b736206n040J8604M8807m1183l1349p503J2998M2930j1742j7645R448J2967
11769b704914J7134K4792j6946j1712K8527R917J1577o0686J371M2160J9207k4642
11757b664215k5965k664J6205N4332k7926j1066O767K4327j8319r510L3641k183
$$ y = [-2751348, -2752178, -2765760, -2789310, -2752835, -2736563, -2765227, -2787983, -2837994, -2855914, -2879995, -2893031, -2903660, -2912046, -2868623, -2824343, -2819962, -2815510, -2770748, -2720371, -2747619, -2777209, -2791790, -2844980, -2810221, -2763230, -2722772, -2762165, -2793921, -2805858, -2839475, -2808282, -2786636, -2782736, -2814016, -2787228, -2752342, -2754165, -2710811, -2717587, -2731238, -2741717, -2761616, -2760488, -2803008, -2795422, -2774267, -2762631, -2718887, -2694365, -2730589, -2781477, -2793233, -2776705, -2770722, -2782106, -2788752, -2763997, -2741913, -2736206, -2741246, -2722642, -2673835, -2715018, -2746367, -2753870, -2740872, -2697942, -2709684, -2727329, -2717881, -2704914, -2687780, -2662988, -2679934, -2691646, -2663119, -2653202, -2641625, -2702311, -2700940, -2658780, -2639573, -2664215, -2690180, -2692844, -2676639, -2622307, -2650233, -2661299, -2654532, -2630205, -2648524, -2658034, -2624393, -2626576]
11745b626576J2838k951J1385o694k6061l1763j8164j0770L2374N390k3572K9751
11733b654813M799j0235j0571L8318K1757k191k6254j3224J7253N053n589L287
11721b632410N1252L0710J0665k7671q5158P2M0567k5958k2773M5185M7660L0010
11709b537849K0016O3137K2134k3432m9485j1778J5760k555r884M9031j8031l2089
11697b515025M1218p095j9877K6457R411j153l8324j3167k283J6938M4528j4744
11685b473116m2925O130n40k2065m4541j9878k577k3316P763J07867K9508k6681
11673b504371m5105J4568N3042k0455K4444K6938K4596p425k5608j7670L251j1914
11661b485709K5283K0976n678j4616n588o5265L9722L1556l7716R06J6032o861
$$ y = [-2626576, -2613738, -2616689, -2605304, -2611998, -2638059, -2669822, -2687986, -2698756, -2666382, -2660992, -2684564, -2654813, -2650014, -2660249, -2670820, -2632502, -2610745, -2612936, -2639190, -2652414, -2635161, -2630108, -2635697, -2632410, -2581158, -2550448, -2539783, -2567454, -2652612, -2652540, -2611973, -2637931, -2660704, -2615519, -2567859, -2537849, -2517833, -2454696, -2432562, -2455994, -2505479, -2517257, -2501497, -2504052, -2513936, -2464905, -2482936, -2515025, -2473807, -2480902, -2500779, -2474322, -2464911, -2466064, -2504388, -2517555, -2519838, -2502900, -2458372, -2473116, -2516041, -2509911, -2510451, -2532516, -2577057, -2596935, -2599512, -2622828, -2615065, -2507198, -2477690, -2504371, -2549476, -2534908, -2481866, -2502321, -2477877, -2450939, -2426343, -2433768, -2459376, -2477046, -2473795, -2485709, -2460426, -2439450, -2445128, -2459744, -2465332, -2530597, -2490875, -2459319, -2497035, -2496129, -2480097, -2486958]
11649b486958J9180L7510L0502K7757j3754k1271o883l9826j9932K8887r785n6520
11637b511093j4583L2380O6349k271R554o287j1779k4096J9074K3694m0559K4274
11625b435343K8645j95j8963k0767k6328Q838M5649K2344k1860P615L6708j4356
11613b388013l687j168K2784J9542m2290J2944J7137m6176j2717P354M302j3948
11601b423936L242L9471O598k8429m4357J8664K4604K641L136J655j8451k5671
11589b440833j1694M4574N0660K6831L6807k34n6581o0332R261J5045K643J2085
11577b371768Q528N8518j8183K7672P281n6570q348n5656l392O4295K8520k3565
11565b342668L0766O959k0004j3366M298l1146p704K0482J2027j9136n39l8363
$$ y = [-2486958, -2467778, -2430268, -2399766, -2372009, -2385763, -2407034, -2413917, -2453743, -2473675, -2444788, -2454573, -2511093, -2525676, -2493296, -2426947, -2429218, -2419664, -2425951, -2437730, -2461826, -2442752, -2419058, -2459617, -2435343, -2406698, -2406893, -2425856, -2446623, -2472951, -2464113, -2418464, -2396120, -2417980, -2410365, -2373657, -2388013, -2391700, -2392868, -2370084, -2350542, -2392832, -2379888, -2362751, -2408927, -2421644, -2414290, -2409988, -2423936, -2420694, -2381223, -2374625, -2403054, -2447411, -2428747, -2404143, -2401502, -2398366, -2396711, -2415162, -2440833, -2452527, -2407953, -2357293, -2330462, -2293655, -2293889, -2350470, -2410802, -2401541, -2386496, -2383853, -2371768, -2363240, -2304722, -2322905, -2295233, -2287952, -2344522, -2352870, -2408526, -2411918, -2347623, -2319103, -2342668, -2311902, -2304943, -2324947, -2338313, -2334015, -2365161, -2372865, -2352383, -2340356, -2359492, -2360031, -2398394]
11553b398394K4358K3503k2353L114J8556M4220L4302j0869m0053n1808l663j2447
11541b391534N5990M0277k8254K948J7217o964k8322k2198l3347J8455O1769L3181
11529b280782j9020j1978L12J4508j9652J71J6878Q342M7861O8146J415p999m0461
11516b222259l643L0106r711k9754j6858q033l9510k0605M5685O5288m6284k691
11504b258269j4867K6971L7455L887j9845P066j021m946k6035J4735k110K3428
11492b213551j4673o0620k6981O1700K1917j7894M6476K8480j4305j8518j3463
11481b221432L0668j2173r068j7378N3536M3530m6806j8223j7871L1842k3709
11470b207084l6249O1690K1986o196j3379k2397K561P105M874j6K6930J6491j2974
$$ y = [-2398394, -2374036, -2350533, -2372886, -2369772, -2351216, -2306996, -2272694, -2283563, -2323616, -2375424, -2379087, -2391534, -2335544, -2295267, -2323521, -2320573, -2303356, -2310320, -2338642, -2360840, -2394187, -2375732, -2313963, -2280782, -2299802, -2311780, -2311468, -2296960, -2316612, -2316441, -2299563, -2291221, -2243360, -2175214, -2173799, -2181798, -2222259, -2225902, -2195796, -2205507, -2235261, -2252119, -2260152, -2299662, -2320267, -2274582, -2209294, -2255578, -2258269, -2273136, -2246165, -2208710, -2204823, -2224668, -2217602, -2218623, -2223569, -2249604, -2234869, -2236979, -2213551, -2228224, -2288844, -2315825, -2254125, -2232208, -2250102, -2203626, -2175146, -2189451, -2207969, -2221432, -2190764, -2202937, -2212005, -2229383, -2175847, -2132317, -2179123, -2197346, -2215217, -2183375, -2207084, -2243333, -2181643, -2159657, -2165853, -2179232, -2201629, -2199068, -2191963, -2187089, -2187105, -2160175, -2143684, -2156658]
11457b156658p6727r116K6453k504J80R538P893J6192J0289l2000l7280K8454
11445b215286K8839K9048J1606j6909l1322R355j3487r124M4176L1114k325l6776
11433b171091L595n982j9076M5327K9761j0149k6175m0643k57M0912Q570l7808
11421b183016q162N8703j2827k0852j6804J4311K6883p007j686J3743k3446Q80
11409b159280R1j142J7984L4202j459J1316M1220k1046k7335K5879K2365J0331
11397b046874l3503r140Q276J3952O258o103k9143k3597j4572J2001j4147k1458
11385b158050J8556L2398J6649P099j2854j4093J116N2904K4708o346k9900l9807
11373b107620k6436j0595r94k563M6280N3265j0215k9146K6542J9017L2237L83
$$ y = [-2156658, -2233385, -2242501, -2216048, -2218552, -2218372, -2208834, -2200941, -2184749, -2174460, -2206460, -2243740, -2215286, -2186447, -2157399, -2145793, -2162702, -2194024, -2184669, -2198156, -2207280, -2163104, -2131990, -2134315, -2171091, -2167496, -2173478, -2192554, -2147227, -2117466, -2127615, -2153790, -2194433, -2194690, -2153778, -2145208, -2183016, -2191178, -2132475, -2145302, -2166154, -2182958, -2168647, -2141764, -2148771, -2150457, -2136714, -2160160, -2159280, -2159189, -2160331, -2142347, -2108145, -2109604, -2098288, -2057068, -2078114, -2105449, -2079570, -2057205, -2046874, -2080377, -2089517, -2081241, -2067289, -2061031, -2067134, -2096277, -2119874, -2134446, -2122445, -2136592, -2158050, -2139494, -2107096, -2090447, -2083348, -2096202, -2110295, -2109179, -2056275, -2031567, -2037913, -2067813, -2107620, -2134056, -2144651, -2145645, -2148208, -2101928, -2048663, -2058878, -2088024, -2061482, -2042465, -2010228, -2009845]
11361b009845m4314J8633L5528k9579m4348l6272R09J1344j2949J3462M7174j5828
11349b066085M0p289l2075J8218L4647K2478L8189j4765p492k3675M691k0748
11337b053866j3411j2458L101L9160K927j5424n382l993j5801J7077N495R734
11325b042841m3572L9924K166l8721j1485J2288p318P312O1918Q6944j2538m4489
11313a990412o696R97k5481k1604j9177J466K6505J021q236q808j0329m9522J1306
11300b098970j274P210O979M5524k394j2494L9228N2603K20M916P14L0606p804
11287a934936k3605j3712k5161j8637R245J3975L8350j419m4630q539K4039M8930
11275a936100M6813q820k9966m9793o578K5825k7P995j434J40k0391j0156l952
$$ y = [-2009845, -2054159, -2035526, -1999998, -2029577, -2073925, -2110197, -2109288, -2097944, -2110893, -2097431, -2050257, -2066085, -2066045, -2073334, -2105409, -2087191, -2052544, -2030066, -1991877, -2006642, -2014134, -2037809, -2033118, -2053866, -2067277, -2079735, -2076634, -2037474, -2034547, -2049971, -2055353, -2059346, -2075147, -2058070, -2052575, -2042841, -2086413, -2046489, -2044323, -2083044, -2094529, -2082241, -2089559, -2082247, -2020329, -1933385, -1945923, -1990412, -1997108, -1996111, -2021592, -2043196, -2062373, -2060907, -2034402, -2033381, -2041617, -2050425, -2060754, -2110276, -2098970, -2100244, -2093034, -2086055, -2040531, -2042925, -2055419, -2016191, -1963588, -1963368, -1958452, -1957738, -1927132, -1934936, -1958541, -1972253, -1997414, -2016051, -2006806, -1992831, -1954481, -1955900, -2000530, -2009069, -1985030, -1936100, -1889287, -1898107, -1928073, -1977866, -1984444, -1958619, -1958646, -1950651, -1952085, -1951945, -1972336, -1982492, -1986444]
11262a986444M6376K9399P318q411k4640k1840j2681o366N767j4595j9703K3396
11250a982424J0871k2663p408L022K5777J1105k984J1026L2211Q051l9594k87
11238a953297M2998j8181l0648n7804n266N6368L7847l0756L5238j3574J4309
11227a922766L9857J1385J810l2396j8055%j2582m017O43J9929J2712M7321L1425
11214a824734k7113o3933j9109r389L5526K3567j868n8719j6408J2825M4469M9213
11202a855673J8465k238n905l21k841K007j8469J8178K0216O697k8787k3983K474
11189a870180q16P510j6776L1519J6693L817l3152l7852k7452k3539K514L7511
11177a910203P0655N363k3006l422l9650j3388r731m859L5309J2153m8773r557
$$ y = [-1986444, -1940068, -1910669, -1903351, -1911762, -1936402, -1958242, -1970923, -1977289, -1971522, -1986117, -2005820, -1982424, -1971553, -1994216, -2001624, -1998602, -1972825, -1961720, -1964704, -1953678, -1921467, -1913416, -1953010, -1953297, -1910299, -1928480, -1959128, -2016932, -2022198, -1965830, -1927983, -1958739, -1923501, -1937075, -1922766, -1882909, -1871524, -1869714, -1902110, -1920165, -1920165, -1932747, -1936764, -1936121, -1916192, -1903480, -1856159, -1824734, -1851847, -1915780, -1934889, -1944278, -1908752, -1885185, -1887053, -1945772, -1962180, -1949355, -1904886, -1855673, -1837208, -1839446, -1845351, -1845672, -1848513, -1846506, -1864975, -1846797, -1826581, -1819884, -1848671, -1872654, -1870180, -1870996, -1863486, -1880262, -1848743, -1832050, -1828233, -1861385, -1899237, -1926689, -1950228, -1947714, -1910203, -1839548, -1834185, -1857191, -1860613, -1900263, -1913651, -1923382, -1928241, -1892932, -1880779, -1929552, -1939109]
11165a939109K7821K4351J0240Q423J1078l2080j1093R50m044L4024J5463P653
11153a846323J9093J3932l2857l3729K5822K1336j406j5970j0453J1567m2011
11142a890999N6726J7644r918j4175k46j7594L1278r784P416L8513J5422J5356
11130a760361n3414l8424o312O409j7888j7632J0441K1706k711M5513M3093P231
11118a762349k0566K1393K2475l1376j1792j2142j3930R683K5992Q827m6777k0037
11106a830599K6308J1530J1423r919M0166M316J2200j534n6911j664M980j6901
11094a806605k7142k8939m345M4948J222J2000j5527j193P1691J9117j6744j4392
11082a765909j5414K6968J0353n2839n202m5231o524M2879O920J811k2196j6097
$$ y = [-1939109, -1911288, -1886937, -1876697, -1868274, -1857196, -1889276, -1900369, -1899419, -1903463, -1869439, -1853976, -1846323, -1827230, -1813298, -1846155, -1879884, -1854062, -1832726, -1834132, -1850102, -1860555, -1848988, -1890999, -1834273, -1816629, -1826547, -1840722, -1840968, -1858562, -1827284, -1837068, -1829652, -1791139, -1775717, -1760361, -1813775, -1852199, -1858511, -1852102, -1869990, -1887622, -1877181, -1855475, -1858186, -1812673, -1769580, -1762349, -1782915, -1761522, -1739047, -1770423, -1782215, -1794357, -1808287, -1798604, -1772612, -1763785, -1810562, -1830599, -1804291, -1792761, -1781338, -1791257, -1751091, -1746775, -1734575, -1736109, -1793020, -1794684, -1789704, -1806605, -1833747, -1862686, -1867031, -1822083, -1820861, -1808861, -1824388, -1825581, -1753890, -1734773, -1751517, -1765909, -1781323, -1754355, -1744002, -1796841, -1802043, -1847274, -1853798, -1810919, -1803999, -1802188, -1824384, -1840481]
11070a840481L0877L2610N5045O20o6445m4191o206Q936K4558N9091L0017m6463
11058a762032M4191L4358m6247n2944j6464p437L7446J4297R663L2706K3756j8027
11046a706734n281n744j94k8815J9240j6374l0381p06J4061j5174M5724k2674
11034a753052j7993P669o724K3859J3103R478n986m5178j8375L9937K3488m549
11022a734323k1364N1886K1175l5560m9109j0599j6658P285L6974j127M357J9599
11010a727464L3746q263l6691k2968N8374j2630J2156N193j4737r948J8659J0693
10998a693880J7356J2418j8259l1130N073K8592L1803j268n3758J8287J609k9042
10986a712199L380O6510K1027L8785n8112m7656l3694j803k742K2258N1529O488
$$ y = [-1840481, -1809604, -1776994, -1721949, -1721329, -1787774, -1831965, -1838171, -1829235, -1804677, -1745586, -1715569, -1762032, -1717841, -1683483, -1729730, -1782674, -1799138, -1806575, -1769129, -1754832, -1745169, -1712463, -1688707, -1706734, -1712015, -1717759, -1717953, -1746768, -1727528, -1743902, -1774283, -1774989, -1760928, -1776102, -1730378, -1753052, -1771045, -1763376, -1770100, -1746241, -1733138, -1723660, -1729646, -1774824, -1793199, -1753262, -1729774, -1734323, -1755687, -1703801, -1682626, -1718186, -1767295, -1777894, -1794552, -1787267, -1750293, -1751420, -1747063, -1727464, -1693718, -1701981, -1738672, -1761640, -1703266, -1715896, -1703740, -1698547, -1713284, -1723232, -1704573, -1693880, -1676524, -1664106, -1682365, -1713495, -1708422, -1679830, -1648027, -1649295, -1703053, -1684766, -1683157, -1712199, -1708819, -1642309, -1621282, -1582497, -1640609, -1688265, -1721959, -1723762, -1726504, -1704246, -1652717, -1646229]
10974a646229m6504l4095K3181K6674N027K1824J1912L2357k8808l6591k1464
10963a692716j062J3795K2649M910j3942l6674o4903K0848R243K3753j8762J8080
10951a714781M4680J6157J1536j1231M750j281J7126j7038m8064L3548K8041k9890
10939a666447j7902L6493K6487l6321l3846L0603K2620O482O840L0943K6817l5261
10927a602492o1863J220J561j1016J3311j2551j2450J3972K791J9908J9186O857
10915a621566j3907L625k6201j9373K961J564j9791j8163L1355K8848J0728k9834
10903a669754K4998P3995m971M6156l338K816P466k275o6786n5063m582L6452
10891a614886K4859j4209J381k0963j9112N397N83J053J7137N255o440m192N2693
$$ y = [-1646229, -1692733, -1726828, -1703647, -1676973, -1671946, -1650122, -1638210, -1605853, -1634661, -1671252, -1692716, -1693778, -1679983, -1657334, -1652424, -1666366, -1703040, -1767943, -1747095, -1737852, -1714099, -1732861, -1714781, -1670101, -1653944, -1642408, -1653639, -1648889, -1650170, -1633044, -1650082, -1698146, -1664598, -1636557, -1666447, -1684349, -1647856, -1621369, -1657690, -1691536, -1660933, -1638313, -1631831, -1624991, -1594048, -1567231, -1602492, -1664355, -1663135, -1661574, -1672590, -1659279, -1671830, -1684280, -1670308, -1667517, -1647609, -1628423, -1621566, -1635473, -1631848, -1658049, -1677422, -1674461, -1672897, -1692688, -1710851, -1679496, -1650648, -1639920, -1669754, -1644756, -1570761, -1575732, -1529576, -1532914, -1530098, -1522632, -1524907, -1591693, -1646756, -1651338, -1614886, -1590027, -1604236, -1602855, -1623818, -1642930, -1637533, -1636950, -1635897, -1618760, -1613505, -1619945, -1624137, -1571444]
10878a571444M6630j1248l4570j1330L8175O77k6329J2272j5050k1471N213K6864
10866a561611k2024j5582m644k8449K9018L8186j7469K3821P222l8802l5410M7636
10854a578108Q069r276l8672L0624N7489o250Q902K59O291l6666j1154p189k83
10841a575964k085P35p945R102K983L1581j4164j5896j4765k753j2831K9075L6020
10828a536907p379M34J7999k7458q150Q606J472l4545M950M730J2892L0308M7956
10815a485092Q167l3890n5595K4694m524l8509j3548M4471L9408p4104m0956N9130
10803a570348J6697J1902j3447L0497K2051M78J2323K4996j476m7072J060N913
10791a506426l12r017j2680j193L2476M2039q093J428K9139r728j0949j3578k4810
$$ y = [-1571444, -1524814, -1536062, -1570632, -1581962, -1543787, -1543110, -1569439, -1557167, -1572217, -1593688, -1588475, -1561611, -1583635, -1599217, -1603861, -1632310, -1603292, -1565106, -1582575, -1558754, -1551532, -1590334, -1625744, -1578108, -1570039, -1579315, -1617987, -1587363, -1529874, -1536124, -1527222, -1526963, -1520672, -1557338, -1568492, -1575681, -1575964, -1578049, -1577314, -1585259, -1576157, -1573174, -1541593, -1555757, -1571653, -1586418, -1589171, -1602002, -1572927, -1536907, -1544286, -1543852, -1525853, -1553311, -1561461, -1552855, -1551383, -1585928, -1580978, -1576248, -1563356, -1533048, -1485092, -1476925, -1510815, -1566410, -1541716, -1546240, -1584749, -1598297, -1553826, -1514418, -1588522, -1629478, -1570348, -1553651, -1541749, -1555196, -1524699, -1502648, -1502170, -1489847, -1464851, -1466327, -1513399, -1512339, -1506426, -1506738, -1515755, -1528435, -1529628, -1497152, -1455113, -1463206, -1461778, -1432639, -1442367, -1453316, -1466894, -1491704]
10778a491704m4450q643K2252k8849M0054K6089j3247K0657J3412j0171j7275
10767a491875r323j6260q06k892M8470L7321L4683J5077m2394l664M1533m8997
10755a439127j4249M9507R797m3962m3497K9062J4816J6770l6285l528K7285k1481
10743a454892K1659k8818j5238L2012O075K6863j2712l3559k279R853K1517O40
10731a428879K109l3105m4860k9655J610M2490M2206j2749j9641K7607j936j6770
10719a471573j3700L1725N8113J7238K64n604q342r57J383q434J0426J172l6557
10706a424846l0787j6571j9426N170K2734N3628J0235N828K4176k0944J2115J1367
10694a367321j2241k4624l707j7199J297L784j261M3760k5k4356L0403J7299O9247
$$ y = [-1491704, -1536154, -1544797, -1522545, -1551394, -1511340, -1485251, -1498498, -1477841, -1464429, -1474600, -1491875, -1501198, -1517458, -1518264, -1521156, -1472686, -1435365, -1400682, -1385605, -1427999, -1431663, -1390130, -1439127, -1453376, -1403869, -1394072, -1438034, -1481531, -1452469, -1437653, -1420883, -1457168, -1460696, -1433411, -1454892, -1433233, -1462051, -1477289, -1445277, -1439202, -1412339, -1425051, -1458610, -1460889, -1451036, -1429519, -1428879, -1426770, -1459875, -1504735, -1534390, -1532780, -1490290, -1448084, -1460833, -1480474, -1452867, -1454803, -1471573, -1485273, -1453548, -1395435, -1378197, -1377933, -1383537, -1391879, -1392836, -1391453, -1399887, -1389461, -1388289, -1424846, -1455633, -1472204, -1491630, -1486460, -1463726, -1410098, -1399863, -1394035, -1369859, -1390803, -1378688, -1367321, -1379562, -1404186, -1407893, -1425092, -1423795, -1420011, -1421272, -1377512, -1377537, -1401893, -1371490, -1354191, -1284944]
10681a284944L0176l1881r242m7035k4903J4320p880K9862m97k7667k8080l1879
10669a419650m3704j3742J8523K1303l7967l952K2313N1795k8131m265M530L8605
10657a394342J3849L1370j0997k0010l6093O482m2416J3905N5994K8989j2994
10646a366263J3210k6476q899R611P977J8259l7818P878J2557r363M085K5032
10634a350210J6177K9280j6614n8913j2360o217L197Q666J0769L0585N0664K4111
10622a270865o188l2565N240l3239k0766L4106J8453k0981n3776M6469L5116J8580
10610a280416m1880O13j8869k0491L5138K1370j0790k2691k331K8406J2517K6051
10598a273373L405m6529n2056l664N974R807N555R219j8225q501j1145l2242j3526
$$ y = [-1284944, -1254768, -1286649, -1295891, -1342926, -1367829, -1353509, -1361389, -1331527, -1332024, -1359691, -1387771, -1419650, -1463354, -1477096, -1458573, -1437270, -1475237, -1479189, -1456876, -1405081, -1433212, -1437477, -1432947, -1394342, -1380493, -1349123, -1360120, -1380130, -1416223, -1409741, -1452157, -1438252, -1382258, -1353269, -1366263, -1353053, -1379529, -1388428, -1378817, -1370840, -1352581, -1390399, -1382521, -1369964, -1379327, -1375242, -1350210, -1334033, -1304753, -1321367, -1380280, -1392640, -1398857, -1395660, -1386994, -1376225, -1345640, -1294976, -1270865, -1277053, -1309618, -1304378, -1337617, -1358383, -1324277, -1305824, -1326805, -1380581, -1334112, -1298996, -1280416, -1322296, -1321683, -1340552, -1361043, -1325905, -1304535, -1315325, -1338016, -1340347, -1311941, -1299424, -1273373, -1269968, -1316497, -1368553, -1372217, -1366243, -1356436, -1350881, -1341662, -1359887, -1368388, -1379533, -1411775, -1425301]
10585a425301O2441L0746p642l2335k8784N8869n96k5868l9843M5398K3823L6372
10573a302720L2652j1332n4341k618M7905K986k4874J5993K1228j5896q441J5366
10561a284092j045O963q188M962L1243J2956p9933k4418J2999p674K5046k0148
10549a331329p2K3462K1007K9702R404j9105m0192L2734K2037M25j203L156k4530
10536a274504n980M9852n624o6422R052J3370K5308l5762m0331L376L3003K3412
10524a271250J2111n854P512j0714p651L6301j4545m7762j6916r895p829J8515
10512a317977J9870L90L2232O5705N0206p901k8033r189k7095J3987L1219J9657
10500a156929j9353j7472j4068o0229n2594J2391M5312M3264K4651m0511k3719
$$ y = [-1425301, -1362860, -1332114, -1339756, -1372091, -1400875, -1342006, -1342602, -1368470, -1408313, -1362915, -1339092, -1302720, -1270068, -1281400, -1335741, -1338359, -1290454, -1287468, -1312342, -1296349, -1275121, -1291017, -1299458, -1284092, -1285137, -1278174, -1286362, -1281400, -1250157, -1237201, -1317134, -1341552, -1328553, -1336227, -1311181, -1331329, -1331401, -1307939, -1286932, -1257230, -1247826, -1266931, -1307123, -1274389, -1252352, -1251927, -1253130, -1249974, -1274504, -1280484, -1230632, -1236256, -1302678, -1293626, -1280256, -1254948, -1290710, -1331041, -1327665, -1294662, -1271250, -1259139, -1264993, -1257481, -1268195, -1275846, -1239545, -1254090, -1301852, -1318768, -1328663, -1336492, -1317977, -1298107, -1297717, -1265485, -1199780, -1149574, -1157475, -1185508, -1194697, -1221792, -1207805, -1176586, -1156929, -1176282, -1193754, -1207822, -1268051, -1320645, -1308254, -1262942, -1219678, -1195027, -1235538, -1259257]
10489a259257j1598N621J9237L0597k3907l3331K9825k6281k3887k2684l0427
10478a346092L5263K2411j2983L9755p095o0937l2713M7057O2305M8941p028l7007
10466a248123k8063J7033M4424O799m1031l090K9156o044m4098K9337J6721j2513
10454a239492N777r627p596m5383j4144J1993L4222N5538J0681j0313K9147K987
10442a176210P496L994p1308k7901N8015O2143p7801m8500k904R402L8160R609
10430a215805P530l6552k2140j6640K6360M6938Q468l8615n0153N585K56r177
10418a293945N3282K0772j7582J0054L0257m173k9855J4793j220l0357k0676k7167
10406a295817r145P1230K5543P872L423p0756J6513J546J6942j2777l9558r903
$$ y = [-1259257, -1270855, -1265234, -1245997, -1215400, -1239307, -1272638, -1242813, -1269094, -1292981, -1315665, -1346092, -1310829, -1288418, -1301401, -1261646, -1268741, -1329678, -1362391, -1315334, -1253029, -1204088, -1211116, -1248123, -1276186, -1259153, -1214729, -1207930, -1248961, -1252051, -1222895, -1228939, -1273037, -1243700, -1226979, -1239492, -1233715, -1243342, -1250938, -1296321, -1310465, -1298472, -1264250, -1208712, -1198031, -1208344, -1179197, -1176210, -1168714, -1164720, -1236028, -1263929, -1205914, -1143771, -1221572, -1270072, -1272976, -1263574, -1225414, -1215805, -1208275, -1244827, -1266967, -1283607, -1257247, -1210309, -1201841, -1240456, -1290609, -1285024, -1284768, -1293945, -1240663, -1219891, -1237473, -1227419, -1197162, -1201335, -1231190, -1216397, -1217617, -1247974, -1268650, -1295817, -1304962, -1233732, -1208189, -1200317, -1196894, -1267650, -1251137, -1249591, -1232649, -1245426, -1284984, -1294887]
10394a294887J9669L1815j7205P891r170m319k9100k9235r1J3402q33J6773l92
10381a295682N673K1089K4357k816k8126l3131r772l813N6628Q460J1513k2784
10369a268404k5380J1176K1945j8185J5033j570m8962N553L1247K8870p413k2124
10357a278214j6221n0338j1315L62N2997L1164l2781k3055k5096Q550K15m3432
10345a387164N219J9450r415j5969J5082J9981J1958m473J3378J5176m2115l6343
10333a395235j2245L690P990M8043K5450k1687n2060L9681p975j9147K899O7973
10321a312623J1538j3782j3458K5842l403o6111o2286k2064L17j1477j3843K4552
10309a456798r763R716p17l6319L337Q316K6925m58k3364k6075l2600L7793k067
$$ y = [-1294887, -1275218, -1243403, -1260608, -1252717, -1261887, -1266206, -1295306, -1324541, -1324632, -1311230, -1312063, -1295290, -1295682, -1290009, -1268920, -1244563, -1247379, -1275505, -1308636, -1318408, -1322221, -1265593, -1257133, -1245620, -1268404, -1293784, -1282608, -1260663, -1278848, -1263815, -1265385, -1314347, -1308794, -1277547, -1248677, -1256090, -1278214, -1294435, -1344773, -1356088, -1355726, -1302729, -1271565, -1304346, -1327401, -1352497, -1343947, -1343732, -1387164, -1381945, -1362495, -1371910, -1387879, -1372797, -1352816, -1340858, -1345331, -1331953, -1316777, -1358892, -1395235, -1407480, -1403790, -1395800, -1347757, -1322307, -1343994, -1396054, -1356373, -1364348, -1383495, -1380596, -1312623, -1301085, -1314867, -1328325, -1302483, -1305886, -1371997, -1434283, -1456347, -1456030, -1467507, -1481350, -1456798, -1466561, -1456845, -1457562, -1493881, -1490544, -1482228, -1455303, -1455761, -1479125, -1505200, -1537800, -1500007, -1502074]
10296a502074l1652L6517M1673L2232r894n3544j2419q76m342r707J9746j8799
10284a513139p4895j2907M5190K9963Q193l709J0207Q180j3537k5449K508N129
10272a534266J563l2870k3161K2602j2212O832M4496k35j8126k0072J5761K4747
10260a524941Q879M3912M020P586k136o525j946l5828l5863k6313j7518l422J415
10247a588680K3891Q7787o309m3429o2720j2041K5594J7648l777l2902K2547j5797
10235a588188J1936J2310k0278j1560l505j3864Q346J734N072j813M0826L2716
10223a526268j7199k3774M809M0744j3538m1723l0193k4416M8352J9382l2951
10212a596775j0068P9081M5873l8054n4971Q248q520n705K5774K0322j975k2702
$$ y = [-1502074, -1533726, -1497209, -1455536, -1423304, -1433198, -1486742, -1499161, -1500037, -1504379, -1514086, -1494340, -1513139, -1588034, -1600941, -1555751, -1525788, -1517595, -1521304, -1511097, -1502917, -1516454, -1541903, -1539395, -1534266, -1532703, -1565573, -1588734, -1566132, -1578344, -1571512, -1527016, -1527251, -1545377, -1565449, -1549688, -1524941, -1516062, -1472150, -1468130, -1460544, -1462680, -1469205, -1471151, -1506979, -1542842, -1569155, -1586673, -1590095, -1588680, -1564789, -1477002, -1483311, -1526740, -1589460, -1601501, -1575907, -1558259, -1562036, -1594938, -1572391, -1588188, -1576252, -1563942, -1584220, -1595780, -1599285, -1613149, -1604803, -1603069, -1597997, -1599810, -1558984, -1526268, -1543467, -1567241, -1562432, -1521688, -1535226, -1576949, -1607142, -1631558, -1583206, -1563824, -1596775, -1606843, -1527762, -1481889, -1519943, -1574914, -1566666, -1575186, -1580891, -1555117, -1534795, -1536770, -1559472]
10200a559472J2312k4924k1658J5831M9867M2062J531o4931n7191l0608J4300
10189a622881J7021q186k7907J4238R022j9339J4766P139O5035j7331j3429J5733
10177a566119J1977k8575l848m247K4961l382k2139l5521n114K1596k0499k7146
10165a658056O284J4654K2787O8210K7714k752j4153k3687k2388j7677l35L8507
10153a560892J9047k0638l4014J8080j1193k34L7123K0788r599K2670J0803m779
10141a512838k760k7964p752K9968K9250j2822n2783k3169J7043M8989R376j0385
10129a515847j4230R711J1243n081J1447J1783K156j6397m431O596j4658j478
10117a519186l9854j5415M0788p347k0454n538K511k9883J6397J0576N370J039
$$ y = [-1559472, -1547160, -1572084, -1593742, -1577911, -1528044, -1485982, -1484451, -1549382, -1606573, -1637181, -1622881, -1605860, -1614046, -1641953, -1627715, -1618693, -1638032, -1623266, -1616127, -1551092, -1568423, -1581852, -1566119, -1554142, -1582717, -1586565, -1590812, -1565851, -1569233, -1591372, -1626893, -1632007, -1610411, -1630910, -1658056, -1651772, -1637118, -1614331, -1546121, -1518407, -1521159, -1535312, -1558999, -1581387, -1599064, -1599399, -1560892, -1541845, -1562483, -1596497, -1578417, -1589610, -1589844, -1552721, -1531933, -1541532, -1518862, -1508059, -1512838, -1515598, -1543562, -1551314, -1521346, -1492096, -1504918, -1557701, -1580870, -1563827, -1514838, -1505462, -1515847, -1530077, -1520366, -1509123, -1514204, -1502757, -1490974, -1488818, -1505215, -1509646, -1503050, -1517708, -1519186, -1559040, -1574455, -1533667, -1541014, -1561468, -1567006, -1564495, -1594378, -1577981, -1567405, -1562035, -1560996]
10105a560996L2701O4411j6191k8532k0220L7340K7219m3268N624J899l7200J4379
10093a522834l832J4977K5512J4624J7700n3867l5328o590L6983P245j1893Q544
10081a508759r782M989J0347p556O0483M2906j823k0251k3794Q188j6267K3185
10069a438134q095k7851Q844J5198L0989m2706j1676L5460k3652o413j3829M9840
10057a432025J5448k6787k1081J9119K2398m3447j5465k2210J1187K7034l4915
10046a500744k0646L1724Q615k5057k0360j1663M5367P4011P905l907k1134j397
10034a437286K5765k1064J4402k6707J4967M0911J951k8054J687j468k3220j0590
10022a448706J8596O569o752J9112J2373j8617p45L3262K3759M1220k8114j8413
$$ y = [-1560996, -1528295, -1463884, -1480075, -1508607, -1528827, -1491487, -1464268, -1507536, -1501912, -1500013, -1537213, -1522834, -1526666, -1511689, -1486177, -1471553, -1453853, -1507720, -1543048, -1549638, -1512655, -1505410, -1517303, -1508759, -1518541, -1513552, -1503205, -1510761, -1450278, -1407372, -1409195, -1429446, -1453240, -1445052, -1461319, -1438134, -1446229, -1474080, -1465236, -1450038, -1419049, -1461755, -1473431, -1437971, -1461623, -1468036, -1481865, -1432025, -1416577, -1443364, -1464445, -1445326, -1422928, -1466375, -1481840, -1504050, -1492863, -1465829, -1500744, -1521390, -1489666, -1481051, -1506108, -1526468, -1538131, -1492764, -1418753, -1410848, -1414755, -1435889, -1437286, -1411521, -1432585, -1418183, -1444890, -1429923, -1389012, -1387061, -1415115, -1413428, -1414896, -1438116, -1448706, -1430110, -1423541, -1430293, -1411181, -1398808, -1417425, -1418170, -1384908, -1361149, -1319929, -1348043, -1366456]
10010a366456k4346j6600J0131L439L5825J5955l6243j0073J184m3436j0554M2989
9998a398185O2170N4407M048J457r296p921k6997m4616j1226J3568L0930m324
9986a335985O248K5104K2320K7823L3637J9859M2960R429K0570l33N094o065P041
9973a122298j0355k0985K5800M2094L9638K2781M2913L1277M752m1114k7841M7554
9961i65784Q3469O6433Q4610J05560J85317J60523N6678O627j54243l52807m91822
9950a215439n56425m18076j65828M422Q9667J48542M7705O7019J09603K7176L116
9939a858518P7276J2051o83K1907J8222j3352p6647m8951L5235L1980L9588L0206
9927a731686q319K1134O793j7442J3974K3833M1524J9256j4270j218n113M97j8825
$$ y = [-1366456, -1390802, -1407402, -1397271, -1393832, -1358007, -1342052, -1378295, -1388368, -1387184, -1430620, -1441174, -1398185, -1336015, -1281608, -1277560, -1276103, -1285399, -1293320, -1320317, -1364933, -1376159, -1362591, -1331661, -1335985, -1329737, -1304633, -1282313, -1254490, -1220853, -1200994, -1158034, -1148605, -1128035, -1128368, -1123274, -1129339, -1122298, -1132653, -1153638, -1127838, -1085744, -1046106, -1023325, -980412, -949135, -944383, -985497, -1013338, -965784, -882315, -815882, -731272, -625712, -440395, -279872, -223194, -216567, -370810, -723617, -1215439, -1771864, -2189940, -2355768, -2351346, -2261679, -2113137, -2065432, -1998413, -1888810, -1861634, -1858518, -1781242, -1769191, -1769874, -1747967, -1729745, -1743097, -1819744, -1868695, -1833460, -1801480, -1761892, -1731686, -1740005, -1718871, -1712078, -1729520, -1715546, -1691713, -1650189, -1630933, -1645203, -1646421, -1651534, -1651037, -1669862]
9914a669862j3716k7128M7191K3171J2398P439o751J6360K6789J2397J5059L7364
9902a519289K3424l4085l8179K5152k7893J2727K0990L6591J854k02J485J4824
9890a482601q25m4569k1991l6051Q981K8370l8930p209K1077K8561M6663K3289
9878a475235n456q477m7711m3673m603K5914M799K7130O062J8257J8201J7328
9866a467464J4471l6098j3522J1860q049k5777Q961J5150J1667J1233K373K040
9854a473155J9854q4412m690M3564K0852J7404j5357l572K6315J8950r235l5482
9842a478964k4729n27J840J7796K3481m0548j8491K8162m250K9970L480k671j0003
9829a475454N472K3979K1850L824l7613K0527M8327j2636l500L3936j2141J898
$$ y = [-1669862, -1683578, -1710706, -1663515, -1640344, -1627946, -1620507, -1627258, -1610898, -1584109, -1571712, -1556653, -1519289, -1495865, -1529950, -1568129, -1542977, -1570870, -1558143, -1537153, -1500562, -1498708, -1498910, -1497425, -1482601, -1483426, -1527995, -1549986, -1586037, -1577056, -1548686, -1587616, -1594825, -1573748, -1545187, -1498524, -1475235, -1480691, -1489168, -1536879, -1580552, -1585155, -1559241, -1554442, -1527312, -1521250, -1502993, -1484792, -1467464, -1452993, -1489091, -1502613, -1490753, -1498802, -1524579, -1515618, -1500468, -1488801, -1477568, -1475195, -1473155, -1453301, -1537713, -1542403, -1498839, -1477987, -1460583, -1475940, -1479512, -1453197, -1434247, -1443482, -1478964, -1503693, -1504220, -1502380, -1484584, -1461103, -1501651, -1520142, -1491980, -1496230, -1466260, -1462780, -1465451, -1475454, -1469982, -1446003, -1424153, -1420329, -1457942, -1437415, -1389088, -1401724, -1405224, -1371288, -1383429, -1381531]
9817a381531m231n2968n4758k113k6869J018O5028N7615O554j7117l5251p318
9805a451941J3896N945J7950P380j8708J4898l4268o2057J5223N1982O2537l5904
9793a413067j8556L3833P383p434p73m936j8833K9381j9405N62J0698J3687K0312
9780a367148o1009j7495J7381Q658J8504K7443L5972k8311j1000o824o1008L4811
9768a410026N1361L3350j2276k370l0184K464k2612k3528j5263o763L1280N4466
9756a350101l238j6805J3536l7053l0654J777j1122M2317J4148J3535l3200n8549
9744a455409l7650M3802N006k133R618j206J2991j1294K8104L3194N5176r7l6189
9731a356087M598l5859P371M0808J5217k9710l1389J3828K2359L7622j6390k5681
$$ y = [-1381531, -1385762, -1438730, -1493488, -1495601, -1522470, -1521452, -1456424, -1398809, -1392255, -1409372, -1444623, -1451941, -1438045, -1432100, -1414150, -1406770, -1425478, -1410580, -1444848, -1506905, -1491682, -1439700, -1377163, -1413067, -1431623, -1397790, -1390407, -1397841, -1398614, -1403550, -1422383, -1393002, -1412407, -1411845, -1401147, -1387460, -1367148, -1428157, -1445652, -1428271, -1419613, -1401109, -1373666, -1337694, -1366005, -1377005, -1383829, -1444837, -1410026, -1358665, -1325315, -1337591, -1339961, -1370145, -1367681, -1390293, -1413821, -1429084, -1435847, -1404567, -1350101, -1353339, -1370144, -1356608, -1393661, -1424315, -1422538, -1433660, -1391343, -1377195, -1363660, -1396860, -1455409, -1493059, -1449257, -1444251, -1446384, -1436766, -1437972, -1424981, -1436275, -1408171, -1374977, -1319801, -1319898, -1356087, -1351489, -1387348, -1379977, -1339169, -1323952, -1353662, -1385051, -1371223, -1348864, -1311242, -1327632, -1353313]
9719a353313R822M0957j5889l6580l6746M14J0989J6975P269K4339L8198J9392
9707a274173J4732l9755k6952j4721q017L2837j9510L9812m316l8927j5057L0894
9695a323153j8328k0549j722L4292L9528J2469j1722l0549j1675M7343j2875K5432
9683a271509l3410l7274j1874N92J5180j1841J0593K1338j7982o667J5204l5666
9671a363316M800N4814J6052J312q637O329L0500l2386n4553m356k3116J5477
9659a357080N0626K4462m635k8508l94N693J0722L579L4152K3513n6818j8261
9647a312949N971O403j536j7472J1115M0124k9854j1516K7105K9369l9722l6437
9635a329399k4014L7620j7350l9918j8377j020K3132L244J3285K3348K5492K0846
$$ y = [-1353313, -1343491, -1302534, -1318423, -1355003, -1391749, -1391335, -1380346, -1363371, -1356102, -1331763, -1293565, -1274173, -1259441, -1299196, -1326148, -1340869, -1348886, -1316049, -1335559, -1295747, -1300063, -1338990, -1354047, -1323153, -1341481, -1362030, -1363752, -1329460, -1289932, -1277463, -1289185, -1319734, -1331409, -1284066, -1296941, -1271509, -1304919, -1342193, -1354067, -1353475, -1338295, -1350136, -1339543, -1318205, -1336187, -1342854, -1327650, -1363316, -1358516, -1303702, -1287650, -1286338, -1294975, -1288646, -1258146, -1290532, -1345085, -1349441, -1372557, -1357080, -1306454, -1281992, -1286627, -1315135, -1315529, -1309836, -1299114, -1295535, -1261383, -1237870, -1294688, -1312949, -1306978, -1300575, -1302111, -1319583, -1308468, -1268344, -1298198, -1309714, -1282609, -1253240, -1292962, -1329399, -1353413, -1315793, -1333143, -1373061, -1391438, -1392458, -1369326, -1366082, -1352797, -1329449, -1303957, -1283111]
9623a283111l910K366M5165m766r337j3481J1905O48K8566j2626J9650m0879m4757
9610a304567j4471k3271q051K8177J8983M1296n839J725l9025r932O1561k4056
9598a277470k39L8116L364l1540l7263l6251J8041o577j5848J7642J4837j704
9586a314892K3343K1392N119p1702O64N0226L405J8628K6770M765K3537K322l5105
9573a241528n0705l1525N9636L0465j0432j4387Q138j2607o197o138k1595K8438
9561a268437N0463N7806j2144l9645p203r344J1943J7187k2778J3770J5478m081
9549a196985k7281j4598Q218n9685l4322K9754L0110o461k0265j757M1562k2599
9537a274309j7355K8498J9152O752O74r413J0661L6984k2634j3111J400l0641
$$ y = [-1283111, -1287021, -1284655, -1239490, -1244256, -1253593, -1267074, -1255169, -1254521, -1225955, -1238581, -1218931, -1259810, -1304567, -1319038, -1342309, -1350360, -1322183, -1303200, -1261904, -1267743, -1266018, -1305043, -1314975, -1253414, -1277470, -1277709, -1239593, -1236229, -1267769, -1305032, -1341283, -1323242, -1329819, -1345667, -1328025, -1313188, -1314892, -1291549, -1270157, -1265038, -1336740, -1336076, -1285850, -1282445, -1263817, -1237047, -1232282, -1208745, -1206423, -1241528, -1292233, -1323758, -1264122, -1233657, -1244089, -1258476, -1250338, -1262945, -1269142, -1275280, -1296875, -1268437, -1217974, -1160168, -1172312, -1211957, -1219160, -1228504, -1216561, -1199374, -1222152, -1208382, -1192904, -1196985, -1224266, -1238864, -1230646, -1290331, -1324653, -1294899, -1264789, -1271250, -1291515, -1293272, -1251710, -1274309, -1291664, -1263166, -1244014, -1237262, -1236588, -1246001, -1235340, -1198356, -1220990, -1234101, -1232701, -1263342]
9525a263342l0333J7414L5003O0628L3028J633j2748m8663n3605m8132M63N4812
9513a253842L8846l1572l9918J0080L3073M7341l0847m6007n706L6737K5340r465
9501a225940J7937k2679l0652M8657j3766r48J5998q438m721j9358J7052K1671
9489a205187l1871J4158L337k0878q995N1595J8330m4429J4424j3123k8509J2775
9477a238373J2707J4544P663p054L0521K4077J0746m3349M035J3363k1779L8373
9465a154526N095l5113J7687l508L031m7564k0394K3757m840K6580P883j6590
9453a198502j3271n6571j6131L1029n2658l613Q139L3230L7987K9740O417l7341
9441a231545K1096L0758j7043j0785m4058O845L0286n170n585K0203j017j1992
$$ y = [-1263342, -1293675, -1276261, -1241258, -1180630, -1147602, -1145969, -1158717, -1207380, -1260985, -1309117, -1308654, -1253842, -1214996, -1246568, -1286486, -1276406, -1243333, -1195992, -1226839, -1272846, -1278552, -1241815, -1216475, -1225940, -1208003, -1230682, -1261334, -1212677, -1226443, -1227391, -1211393, -1219831, -1224552, -1243910, -1226858, -1205187, -1237058, -1222900, -1219563, -1240441, -1249436, -1197841, -1179511, -1223940, -1209516, -1222639, -1251148, -1238373, -1225666, -1211122, -1203459, -1210513, -1179992, -1155915, -1145169, -1188518, -1184483, -1171120, -1192899, -1154526, -1149431, -1184544, -1166857, -1170365, -1167334, -1214898, -1235292, -1211535, -1216375, -1189795, -1181912, -1198502, -1211773, -1268344, -1284475, -1253446, -1306104, -1309717, -1301578, -1268348, -1230361, -1200621, -1194204, -1231545, -1210449, -1179691, -1196734, -1207519, -1251577, -1244732, -1214446, -1219616, -1225201, -1204998, -1206015, -1218007]
9429a218007l1793p248j8358M288J0700P358k177j5616K8985L9569K2996j7836
9417a197139k6946M3306M6621k1342m1146L499O9679O758k1101J0k3556j0285
9405a171642J3294k3911k5311J9879M6009J6835K706q378l2037l1035q099l06
9393a201996J4443o267k552k8070l4431j2217O612p93N1694L0191m032J8218J6693
9380a152507K8605p308o8322K2109P8140l988j6964k3411J4856j1381k0807r616
9368a170594m9402q154k2168J7384k505j3549o328M3977O7121K0841J2897k5262
9356a135742p9791l9795R2646M7914k6593l8337m1243k7166M046J9712O984L2297
9344a185068L3090J6045l9697K1954j0890J9798L5475k3340j8758j303K8299j5855
$$ y = [-1218007, -1249800, -1257048, -1275406, -1271118, -1260418, -1253060, -1255237, -1270853, -1241868, -1202299, -1179303, -1197139, -1224085, -1180779, -1134158, -1155500, -1196646, -1193147, -1123468, -1116710, -1137811, -1137801, -1161357, -1171642, -1158348, -1182259, -1207570, -1187691, -1141682, -1124847, -1122141, -1130519, -1162556, -1193591, -1201690, -1201996, -1187553, -1193820, -1196372, -1224442, -1258873, -1271090, -1264478, -1265271, -1213577, -1183386, -1187418, -1169200, -1152507, -1123902, -1131210, -1199532, -1177423, -1099283, -1103271, -1120235, -1143646, -1128790, -1140171, -1160978, -1170594, -1219996, -1228150, -1250318, -1232934, -1235439, -1248988, -1255316, -1211339, -1144218, -1123377, -1110480, -1135742, -1215533, -1255328, -1162682, -1114768, -1141361, -1179698, -1220941, -1248107, -1244061, -1224349, -1217365, -1185068, -1151978, -1135933, -1175630, -1153676, -1164566, -1144768, -1109293, -1132633, -1151391, -1152694, -1124395, -1140250]
9332a140250k446j6938n192j6528l5222K4237K1378L12K4141P662J6989K3919
9320a097938m6511l2118J521K481L415N4614J9926n5854o5431J7837Q653k5937
9308a215342j500K2301J7610K3485L2370K6395j5026m0609j0916j2899r770K3583
9296a160318J4594q026J0712j7136q440J3068m17n580o385j4181k6341J0495J1749
9283a186206N5854j399J0577P695l7536o5643q668M4205j951q745J5789N0588
9271a125440R14k1997m4776j1162J4994K1974J1209l988J2982J2600K7483m0015
9259a145222l7342K7650N70K1872O225K404n766K5628k4805n4098j7655L5169
9247a165370p40k5902K5877M4558J8398k6623r10l023j9783k7661q056J9601o310
$$ y = [-1140250, -1142696, -1159634, -1164826, -1181354, -1216576, -1192339, -1170961, -1170649, -1146508, -1138846, -1121857, -1097938, -1144449, -1176567, -1175046, -1172565, -1169150, -1114536, -1094610, -1150464, -1215895, -1198058, -1189405, -1215342, -1216842, -1194541, -1176931, -1153446, -1121076, -1094681, -1109707, -1150316, -1161232, -1174131, -1183901, -1160318, -1145724, -1153750, -1143038, -1160174, -1168614, -1155546, -1155963, -1161543, -1167928, -1182109, -1208450, -1197955, -1186206, -1130352, -1131751, -1121174, -1113479, -1151015, -1216658, -1225326, -1181121, -1183072, -1191817, -1176028, -1125440, -1124526, -1146523, -1191299, -1202461, -1187467, -1165493, -1154284, -1158272, -1145290, -1132690, -1105207, -1145222, -1182564, -1154914, -1154344, -1132472, -1126247, -1123843, -1129609, -1103981, -1128786, -1182884, -1200539, -1165370, -1166110, -1192012, -1166135, -1121577, -1103179, -1129802, -1130712, -1133735, -1153518, -1181179, -1189235, -1169634, -1175944]
9234a175944j9306l0109L6300L5780q487k06M0132N4509o394l6461r711l5466
9222a155363j7654J9999L1850L3351J571K3371K440j034o205m3446m4344L7092
9210a118372L1678k4865j8347m152K4241K6733J1756n255n1716P06J7123K720
9198a107750o42j2309Q855K3575K067R547j2120m1824j3743j4384j1450J1566
9186a158612K6822j5021M120K5632o203j0544N2439M991j199J6689k253O910P769
9173a048460l6807M356L4724n6252l998j3253n0904K185K6499J5444K2862K3277
9161a080327L4251Q437k7363m773L8707j1152R552m581k7734P330m4803k794J5895
9148a089355l684m9733q035N038M216k6684L1391O117J4610K7112m254m1492l9316
$$ y = [-1175944, -1195250, -1225359, -1189059, -1153279, -1161766, -1161972, -1121840, -1067331, -1073725, -1110186, -1119897, -1155363, -1173017, -1153018, -1121168, -1087817, -1086246, -1062875, -1060435, -1061469, -1067674, -1111120, -1155464, -1118372, -1086694, -1111559, -1129906, -1134058, -1109817, -1083084, -1071328, -1076583, -1128299, -1127593, -1110470, -1107750, -1108392, -1120701, -1111846, -1088271, -1086204, -1076657, -1088777, -1130601, -1144344, -1158728, -1170178, -1158612, -1131790, -1146811, -1142691, -1117059, -1123262, -1133806, -1081367, -1076376, -1077575, -1060886, -1063139, -1056229, -1048460, -1085267, -1080911, -1046187, -1102439, -1106437, -1119690, -1170594, -1168409, -1141910, -1126466, -1103604, -1080327, -1046076, -1037639, -1065002, -1069775, -1031068, -1042220, -1032668, -1037249, -1064983, -1057653, -1102456, -1105250, -1089355, -1093039, -1142772, -1150807, -1145769, -1141553, -1168237, -1136846, -1130729, -1116119, -1089007, -1093261, -1134753, -1174069]
9135a174069L4916J9754N841j9911l8136k1965N5390K5908j4261k0723L8272N3645
9123a055339K6896J5812O210m6114p2573p896M3155J3478J801j4774J3864K0232
9111a055248l5898l628R662K2479J3458o692J6082j5421K2206J2302j6610M4182
9099i93126K8929n9500l3510k1830K0309j1259r361K9711P80k1946K0223k4017
9087a074597j3874L93L9371l125n383n268k291J0826k0040o580J6103l671r079
9074a077215j6689J4826N3846P375k5604L241L4667M693m757j8261m2700L2226
9062a034352L6884k9428l7346l7976L826L8688K7309k7149l0767O541K0670m39
9050a063539L2685j5215j999o733K1406P603j7725j4580J9462Q438l3927L86L2559
$$ y = [-1174069, -1139153, -1119399, -1113558, -1133469, -1171605, -1193570, -1138180, -1112272, -1126533, -1147256, -1108984, -1055339, -1028443, -1012631, -1006421, -1052535, -1125108, -1133004, -1089849, -1076371, -1074570, -1089344, -1075480, -1055248, -1091146, -1094774, -1085112, -1062633, -1049175, -1055867, -1039785, -1055206, -1033000, -1020698, -1037308, -993126, -964197, -1023697, -1057207, -1079037, -1058728, -1069987, -1079348, -1049637, -1048857, -1070803, -1050580, -1074597, -1088471, -1088078, -1048707, -1051832, -1057215, -1062483, -1064774, -1053948, -1073988, -1080568, -1064465, -1068136, -1077215, -1093904, -1079078, -1025232, -1017857, -1043461, -1040220, -1005553, -1000860, -1005617, -1023878, -1066578, -1034352, -997468, -1026896, -1064242, -1102218, -1098392, -1059704, -1032395, -1059544, -1090311, -1083770, -1063100, -1063539, -1030854, -1046069, -1048068, -1054801, -1033395, -1025792, -1043517, -1058097, -1038635, -1030197, -1064124, -1063738, -1031179]
9037a031179k3804m655p81J726J6250K6052k2211k8617m920q096L8056j224k7264
9024a070667j7761J880j4684j6096n010K9284M301l455J5438k0671J0597M2796
9012a044048M0928J2274k7353k9546k1957K6763k8906j566J0573Q476J9951j9558
9000a053969m2371M4109J0969k351K685J1085K509o2447K033P362J7117k7392
8988a090661K7473M1577j0992P294j8674m429J8595j6192l870J9471j759k7414
8976a059581N423k1149k0570J5833M7008k7699k5445M3153J2547l5463K147j6590
8964a080386l0309J2975l1568Q264J9196K9616K8550M365J8720l9569q778r542
8952a078466N4822j2821k6053l746O7408L1395n789j7970j9726o431k1201r897
$$ y = [-1031179, -1054983, -1059638, -1060419, -1058693, -1042443, -1016391, -1038602, -1067219, -1072139, -1080235, -1042179, -1043403, -1070667, -1088428, -1086548, -1101232, -1117328, -1122338, -1093054, -1088753, -1092208, -1076770, -1097441, -1086844, -1044048, -1003120, -990846, -1018199, -1047745, -1069702, -1042939, -1071845, -1073411, -1062838, -1054362, -1034411, -1053969, -1096340, -1052231, -1041262, -1043613, -1040928, -1029843, -1027334, -1089781, -1087748, -1080386, -1063269, -1090661, -1063188, -1021611, -1032603, -1025309, -1043983, -1048412, -1029817, -1046009, -1049879, -1030408, -1032167, -1059581, -1054158, -1075307, -1095877, -1080044, -1033036, -1060735, -1086180, -1043027, -1030480, -1065943, -1063796, -1080386, -1110695, -1097720, -1129288, -1121024, -1101828, -1072212, -1043662, -1039297, -1020577, -1060146, -1068924, -1078466, -1023644, -1036465, -1062518, -1066264, -998856, -967461, -973250, -991220, -1010946, -1017377, -1038578, -1048475]
8940a048475k2839R953l2472j4242M1707L9794J2290l2286J316J8086q043J8989
8928a016222m204K6532j0106q670j6142k4991R889J1611R377j9822j4493k4711
8916a081952K5869k1869l0587K1751K5582L1808L0953l2872n0084M693M1845N1956
8904i82907q425k3680R766K5319L9077P440j1980k2216K1796N6758m875k4171
8892i18098m6554K1505J1784k8090j8680j5795r467L8782l258J2354J1826r917
8880i53608k2371K3347O780m215k772k1175L204L1237J0917j5303L0626l650J5621
8867i01362P560k3080n0400q5982p5541m8933K3753N9401M4540L4021l3591j3705
8855a063319j7496j4134J9653J4266k4607L6640M3211J0185p582m938P760K8959
$$ y = [-1048475, -1071314, -1061361, -1093833, -1108075, -1066368, -1026574, -1014284, -1046570, -1045254, -1027168, -1035211, -1016222, -1020426, -993894, -1004000, -1012670, -1028812, -1053803, -1043914, -1032303, -1022926, -1042748, -1057241, -1081952, -1056083, -1077952, -1108539, -1086788, -1061206, -1029398, -998445, -1031317, -1081401, -1076708, -1034863, -982907, -991332, -1015012, -1005246, -979927, -940850, -933410, -945390, -967606, -945810, -889052, -893927, -918098, -964652, -943147, -931363, -959453, -978133, -993928, -1003395, -964613, -967871, -955517, -943691, -953608, -975979, -952632, -945852, -950067, -952839, -974014, -970810, -939573, -928656, -943959, -913333, -916983, -901362, -893802, -916882, -967282, -1053264, -1128805, -1177738, -1153985, -1094584, -1050044, -1016023, -1049614, -1063319, -1080815, -1094949, -1075296, -1061030, -1085637, -1048997, -1005786, -995601, -1003183, -1008121, -1000361, -971402]
8843i71402R365j7490k064l4478J1001p790q707k7911Q61L4984K8700l848n5146
8830a043925n2016p3982j8388M2953N4388L7383Q372j0317K8915l0264N882k4180
8818a075179M333N3585K3035l3096j7583J675l403K5303k0092J0511K7609J8202
8806i85100J7405q891O630M1017l0718k0728J87k8159k4375K8440l285J7121m667
8793i95123p194K0457L8594K293K022j168n3503m983J0027o8241J0652l4780K0713
8780a060234M9902J1587L2574n537l4558n099N1788J9945r328k1087K0537k0243
8768i69753O935N5945L4297L3083j9786j7374p23K3159l6354Q734n750K320q397
8755h93664j7438k1963P017J7180J1791k3550m8038p037q730K0963J327m938J9801
$$ y = [-971402, -962037, -979527, -981591, -1016069, -1005068, -1012858, -1021565, -1049476, -1048615, -1013631, -984931, -988779, -1043925, -1095941, -1169923, -1188311, -1145358, -1090970, -1053587, -1045215, -1055532, -1026617, -1056881, -1050999, -1075179, -1070846, -1017261, -994226, -1027322, -1044905, -1043230, -1046633, -1021330, -1041422, -1030911, -1003302, -985100, -967695, -976586, -969956, -928939, -959657, -980385, -980198, -1008357, -1032732, -1004292, -1007577, -990456, -995123, -1002317, -981860, -943266, -940973, -938951, -940119, -993622, -998605, -988578, -1056819, -1046167, -1080947, -1060234, -1010332, -998745, -966171, -971708, -1006266, -1011365, -959577, -939632, -948960, -970047, -949510, -969753, -962818, -906873, -872576, -839493, -859279, -876653, -877376, -854217, -890571, -881837, -887587, -885267, -893664, -911102, -933065, -926048, -908868, -897077, -920627, -968665, -975702, -984432, -963469, -962142, -967080, -947279]
8742i47279p399k4942K4849N3455k0392J7629j0810K7801L2952l7598k2488O0601
8730h53621K3814r250o568j9039l5514l3982J4223K0124n6J1872J0120k890k1115
8717i01882k4663j8291o565K7095j5603J2623K5777j9956J5945L6338p33L598
8705h66317J4708J9826o207o7312n4989K8744K8097N27l4379j9801J9005M4590
8693h93508k7989p20L1179p114O677j8112m052L1932R76k0314j4895N2319K9667
8680h33954j7663K3639j7473m580k754r157J2630k691j0351j3141q316n4675j3558
8667i52044L4059K6618M9142Q752J2339M583k4645o5415k4778J2447O8848L7894
8655h12200j9166K8516Q3671k4698k2612m3137J0621L7190j818k3631k4207M7917
$$ y = [-947279, -954678, -979620, -954771, -901316, -921708, -904079, -914889, -887088, -854136, -891734, -914222, -853621, -829807, -839057, -845625, -864664, -900178, -934160, -919937, -899813, -899869, -887997, -877877, -880767, -901882, -926545, -944836, -951401, -924306, -939909, -927286, -901509, -921465, -905520, -869182, -869915, -866317, -851609, -831783, -837990, -905302, -960291, -931547, -903450, -902923, -937302, -957103, -938098, -893508, -921497, -922217, -891038, -898152, -891475, -909587, -913639, -881707, -880731, -901045, -915940, -863621, -833954, -851617, -827978, -845451, -850031, -852785, -861942, -849312, -852003, -862354, -875495, -883811, -938486, -952044, -917985, -891367, -842225, -833473, -821134, -816551, -841196, -906611, -931389, -918942, -850094, -812200, -831366, -802850, -719179, -743877, -766489, -809626, -799005, -761815, -763633, -787264, -811471, -763554]
8643g63554q612k7414K859K5203j3821m783K036J166j2683M779M8474j2690k3289
8630g82329m0963Q316J7051L3087q845j2166K7611m9915j2250k6114m645K4831
8618h26331K968j0843n9332k3791l1700P545J0494k0110k5099j0240J4696K2503
8606i49240l9959l7410q495J1470j2821r922J8415Q93m7626l6242q865l2001o1125
8593a212928m870k047k1182l6156O196J5267K2826j3259n2051k9659M2243L8212
8581a247408j3279n5987r066J2258K291O281L5419K0293J1614R582k2659k43O8770
8568a182134O6653n0801m416M2651K1555n2621j3358J1782P250j1148k5218J6475
8556a173330J6895k0566L2921k9756k6800j9658K2358P196J8199K926j3545R52
$$ y = [-763554, -772166, -799580, -796721, -771518, -785339, -790122, -788086, -786920, -799603, -794824, -746350, -759040, -782329, -823292, -814976, -797925, -764838, -773683, -785849, -758238, -808153, -820403, -846517, -851162, -826331, -823363, -834206, -893538, -917329, -949029, -941484, -930990, -951100, -976199, -986439, -971743, -949240, -989199, -1026609, -1035104, -1023634, -1036455, -1046377, -1027962, -1027069, -1074695, -1110937, -1119802, -1151803, -1212928, -1217798, -1219845, -1241027, -1277183, -1270987, -1255720, -1232894, -1246153, -1298204, -1327863, -1285620, -1247408, -1260687, -1316674, -1325740, -1313482, -1311191, -1304910, -1269491, -1249198, -1237584, -1228002, -1250661, -1250904, -1182134, -1115481, -1166282, -1170698, -1128047, -1106492, -1159113, -1172471, -1160689, -1153439, -1164587, -1189805, -1173330, -1156435, -1177001, -1144080, -1173836, -1200636, -1220294, -1197936, -1190740, -1172541, -1169615, -1183160, -1182208]
8544a182208L3189M101k7501j0428M4029O391o3102j0908L0817J5692j412k0658
8532a181998R570m1Q249k654p455l223K8248K644J7434K6259j4702j6368j7696
8519a151733L259j8687L0603M6688K73m998M809L1198k3247L312k9206m1O6705
8506a041065Q067j8804K3023K9941l8587k5691l606J4777J6564K0541j1615j1750
8494a038205m6762R652L0073j3354k2624o393j3170L2521L9380J3378j6385l5306
8482a067195l756L69O794R019K0469J4982p4776j0207K0431Q821L9485M2613m1978
8469a034929R936q82N2350O829N714m4811l9996K7146j5110n5579j8805j504K0693
8456a088948o204K6609Q470n064j908m7392j9070O099J3339L7147N617M948K1831
$$ y = [-1182208, -1149019, -1144918, -1172419, -1182847, -1138818, -1132427, -1195529, -1206437, -1175620, -1159928, -1161340, -1181998, -1172428, -1172469, -1164220, -1166874, -1174329, -1177552, -1149304, -1146660, -1129226, -1102967, -1117669, -1134037, -1151733, -1148474, -1167161, -1136558, -1089870, -1089597, -1094595, -1089786, -1058588, -1081835, -1078523, -1107729, -1107770, -1041065, -1032998, -1051802, -1028779, -998838, -1037425, -1063116, -1066722, -1051945, -1035381, -1014840, -1026455, -1038205, -1084967, -1075315, -1045242, -1058596, -1081220, -1087613, -1100783, -1068262, -1028882, -1015504, -1031889, -1067195, -1070951, -1070582, -1063788, -1054769, -1034300, -1019318, -1094094, -1104301, -1083870, -1075049, -1035564, -992951, -1034929, -1024993, -1025875, -973525, -966696, -960982, -1005793, -1045789, -1018643, -1033753, -1089332, -1108137, -1109641, -1088948, -1095152, -1068543, -1060073, -1065137, -1067045, -1114437, -1133507, -1127408, -1114069, -1076922, -1071305, -1066357, -1044526]
8443a044526L1523J3801m2903m2132K2399J5111j3064k5856K6423r420n608K2419
8431a051833N4033j3856k7066J5296l2491J6166M7670q061m5955L4462J0998n0917
8419a051554j6114J2884M5161J8618j684j8183q226l3095r376K2762J5816J9270
8407a003721j1045j1114l5209Q381L7186j4984k0042N3078J2020J1938J0922j1800
8395i74390P918l976n9210l9060J5560L8133L1950J5272j6119j3775J7932j8919
8383i98684J2896L7307m2140o1572Q185M7782p954m6582J9683M8673K7999l3463
8371i87870j2262Q175L6978o6748m362K9323q673M931m771J3660J2133L1946O6881
8358h80659J3720n7807k066j458n4045K775L3064L1644l3467o7655J2324m0038
$$ y = [-1044526, -1013003, -999202, -1042105, -1084237, -1061838, -1046727, -1059791, -1085647, -1059224, -1068644, -1074252, -1051833, -997800, -1011656, -1038722, -1023426, -1055917, -1039751, -992081, -1000142, -1046097, -1011635, -1000637, -1051554, -1067668, -1054784, -1009623, -991005, -992689, -1010872, -1019098, -1052193, -1061569, -1038807, -1022991, -1003721, -1014766, -1025880, -1061089, -1052708, -1015522, -1030506, -1050548, -997470, -985450, -973512, -962590, -974390, -966472, -970448, -1029658, -1068718, -1053158, -1015025, -983075, -967803, -983922, -997697, -979765, -998684, -985788, -948481, -990621, -1052193, -1044008, -996226, -1004180, -1050762, -1031079, -982406, -954407, -987870, -1000132, -991957, -954979, -1021727, -1026089, -996766, -1005439, -1000508, -1005279, -991619, -979486, -947540, -880659, -866939, -924746, -926812, -928270, -982315, -979540, -946476, -914832, -948299, -1015954, -1003630, -1043668]
8346a043668J4532L3738R319P071k476N21N140j6407l0670k8130J6305N698K0836
8333a008191K9534J9196k6221L9138N4163J4544J17k8729l8488q737k8063j4289
8321i96026j562L758L9740J5638r970r199l0757K2420M6005k9121O758P162l1305
8308i66459k5893K5588k8810l2012pL5596N0523P700j9278K0963k061j2449n7847
8295a004446R766K398O530m326k1465k3739k5083L489M5308O0045j3662Q39J3541
8282i50805J4590R29n6943o370K1650N0578Q268l3798n4290J8351K2622j5580
8270i80798k6487q544K7481M792m323L4218J7699J0235P071k513j1215l57k4056
8257i56797k8122k4965q92M5518J8770j1874J5674L540K3573K2296J8677k3720
$$ y = [-1043668, -1029136, -995398, -986079, -979008, -981484, -980963, -975823, -992230, -1022900, -1051030, -1034725, -1029027, -1008191, -978657, -959461, -985682, -946544, -892381, -877837, -877720, -906449, -944937, -953674, -981737, -996026, -997588, -993830, -954090, -938452, -948422, -957621, -988378, -965958, -919953, -949074, -942316, -935154, -966459, -992352, -966764, -995574, -1027586, -1027593, -991997, -941474, -933774, -953052, -932089, -934150, -946599, -1004446, -994680, -992282, -985752, -990078, -1011543, -1035282, -1060365, -1056876, -1011568, -951523, -965185, -964346, -950805, -936215, -935286, -992229, -998599, -976949, -926371, -918103, -951901, -1006191, -987840, -965218, -980798, -1007285, -1015829, -988348, -983556, -987879, -953661, -935962, -925727, -918656, -921169, -932384, -932741, -956797, -984919, -1009884, -1010776, -965258, -946488, -958362, -942688, -939148, -915575, -893279, -874602, -898322]
8245h98322m9155m890K8175j9993j0001L7022R570o685n1701l5574k551K7334
8233i76771p353J6828K2965L0211J8097q827k4873p473k9254l0144K8954L7094
8221i30546K9661J7991j4069j8854K8394n212J0079K8386K3421m9032n3386j4454
8209i47621R962O165q385o708M764K9038K1625q943J0164n362l9832r011l7761
8196i81905P647K9045R905K27J5510m969j1497m572r898m6036J7205K8913L7346
8183i13079J5487k3937j3087m6419L99K4157j3872J4486K7707k5620q116L4981
8171i26913M2064J6020l8372j1857O4542K4375L272j6437l071p889q308L6656
8159h25918j6299m2919q424m613l8886k5105N613L8443K708q905j483j6565M217
$$ y = [-898322, -947477, -952367, -924192, -944185, -954186, -917164, -907594, -914279, -965980, -1001554, -1004105, -976771, -984124, -967296, -944331, -914120, -896023, -904850, -929723, -937196, -966450, -996594, -967640, -930546, -900885, -882894, -896963, -915817, -887423, -892635, -882556, -854170, -830749, -879781, -933167, -947621, -937659, -931494, -939879, -946587, -941823, -912785, -891160, -900103, -889939, -895301, -935133, -944144, -981905, -974258, -945213, -935308, -935081, -919571, -924540, -936037, -940609, -950507, -996543, -979338, -950425, -913079, -897592, -921529, -934616, -981035, -980636, -956479, -970351, -955865, -928158, -953778, -961894, -926913, -884849, -868829, -907201, -919058, -854516, -830141, -826869, -843306, -846377, -854266, -862574, -825918, -842217, -885136, -893560, -898173, -937059, -962164, -956551, -918108, -915400, -924305, -925788, -942353, -938136]
8146i38136j0729J2524M5704J4230K8315j7432k1484k0501k0400k4260J2475N1820
8134h87874K7314j9677L9961L5539j3066j7538j2574m2689L401L4470K7704J7656
8122h07373n497L4786k0023k1110j5040o1934O15K0040k281k3138k0337j9318
8110i40610j0302J7031N175P739K3886N764L4246j2649l8203J3263o869J5898
8098h85631J1206j8556r636M192L9882L9406q390J3828j6809j2467J439k1773
8086h63309l6451J1245K4999j2658J0315M4519J1548L233K7553J1788M660N413
8074g57145K5319p968o985k5053m4987J0388j2728J7586J4140m2958m4218N4695
8062h19914J7984j3875p142K5726M6878o948J1727J7056p845J0602Q945k7649
$$ y = [-938136, -948865, -936341, -890637, -876407, -848092, -865524, -887008, -907509, -927909, -952169, -939694, -887874, -860560, -880237, -840276, -804737, -817803, -835341, -847915, -890604, -887203, -852733, -825029, -807373, -812870, -778084, -798107, -819217, -834257, -896191, -895576, -875536, -877817, -900955, -921292, -940610, -950912, -933881, -928706, -920967, -897081, -891317, -857071, -869720, -907923, -894660, -901529, -885631, -874425, -892981, -902617, -898425, -858543, -819137, -827527, -813699, -830508, -842975, -841536, -863309, -899760, -888515, -863516, -876174, -865859, -821340, -809792, -806559, -779006, -767218, -762558, -757145, -731826, -739794, -746779, -771832, -816819, -806431, -819159, -801573, -787433, -830391, -874609, -819914, -801930, -815805, -822947, -797221, -750343, -757291, -745564, -728508, -736353, -725751, -716806, -744455]
8050g44455j4815K8662K3198k3060k9080k7286K7496R510k4654k3895J0547k4406
8038h12238K5080q054n6149K5001L0565K592J0884K041J9775m988N107l1314l3595
8025h25293O164K0432K5405q530K2415j183N3780N2962n1918k5831j0602K8332
8013g13867M6839J2868M8495j8845k5174j2388J6168r2180j46219r5185n7073
8002a036561m41M3805Q490J9050L9557M5655k8728K1177k4509j02819q5246j1378
7990a111948j8991K500L2067n340J4584J0829K0148J2529j5612J7413J6596L9188
7978i86037N5840J3872l7561o785L2155K1153J3095K2958m0512K4576O3631n0363
7966h73978J0145L70l9445j4367K6733l3440o3251p4450m1754L4350L4410l9861
$$ y = [-744455, -759270, -730608, -707410, -730470, -759550, -786836, -759340, -749830, -774484, -798379, -787832, -812238, -787158, -795212, -851361, -826360, -795795, -793203, -782319, -780278, -760503, -765491, -760384, -791698, -825293, -819129, -798697, -773292, -781822, -759407, -760590, -706810, -653848, -705766, -731597, -742199, -713867, -667028, -654160, -605665, -624510, -649684, -662072, -645904, -738084, -884303, -979488, -1036561, -1037002, -993197, -984707, -965657, -926100, -880445, -909173, -887996, -912505, -1015324, -1100570, -1111948, -1130939, -1128439, -1096372, -1101712, -1087128, -1076299, -1056151, -1043622, -1059234, -1041821, -1025225, -986037, -930197, -916325, -953886, -960671, -928516, -907363, -894268, -871310, -911822, -887246, -823615, -873978, -863833, -863463, -902908, -917275, -890542, -923982, -987233, -1061683, -1103437, -1069087, -1034677, -1074538]
7954a074538m6074J8435q645k2827m3692p7042j0446K124L2815L9927l6926l5951
7942a262840j2482K9178O9975J47q630N1495o475j3312L713Q486M7555l546n378
7929a102114k6723J4203K6230K0198J9202r315j7289j332J9543M528p6115l5479
7917a164463J3043L0599J1655J6928l7709j5000K7824J3228l5305m495j7255J4417
7905a146533j3205Q873j1225k1434p891m904K8435L8470O241M1568K2414j9402
7893a078593j9215j4488k6701M107Q324L9495O0375o8369p1845j1645J6760K491
7881a159304R457K3452K7733J2848J0774m156l7675o8867K3984R4234M6120k1021
7869a042421l0252j4376P512j6096j0626M6406N6454K334m9295j4186K4645o152
$$ y = [-1074538, -1120612, -1102177, -1110822, -1133649, -1177341, -1254383, -1264829, -1262705, -1229890, -1189963, -1226889, -1262840, -1275322, -1246144, -1176169, -1176022, -1184652, -1133157, -1139632, -1152944, -1149231, -1140745, -1093190, -1096736, -1102114, -1128837, -1114634, -1088404, -1068206, -1049004, -1058319, -1075608, -1076940, -1057397, -1052869, -1128984, -1164463, -1151420, -1120821, -1109166, -1092238, -1129947, -1144947, -1117123, -1103895, -1139200, -1143695, -1160950, -1146533, -1159738, -1150865, -1162090, -1183524, -1191415, -1196319, -1167884, -1129414, -1123173, -1081605, -1059191, -1078593, -1097808, -1112296, -1138997, -1134890, -1126566, -1087071, -1026696, -1095065, -1166910, -1178555, -1161795, -1159304, -1149847, -1126395, -1098662, -1085814, -1075040, -1079196, -1116871, -1185738, -1161754, -1067520, -1021400, -1042421, -1072673, -1087049, -1079537, -1095633, -1106259, -1059853, -1003399, -1001065, -1050360, -1064546, -1039901, -1046053]
7857a046053k9697P412k4990l4944j2564R017N9109J0479J435j6462L1348K3347
7845a022563k2234l8669m378K2558n972Q1387J3489p717k5100n6314L1193O3605
$$ y = [-1046053, -1075750, -1068338, -1093328, -1128272, -1140836, -1131819, -1072710, -1062231, -1060796, -1077258, -1045910, -1022563, -1044797, -1083466, -1087844, -1065286, -1071258, -989871, -976382, -984099, -1009199, -1065513, -1034320, -970715]
$$ [...]
##END NTUPLES=NMR SPECTRUM
##END=
