##TITLE=Analysis number 315835
Compound Code cc 47201
Book Reference 437/58
Project Code adrs
Chemist Name wendyb
##JCAMPDX= 6.0         $$ Bruker NMR JCAMP-DX V2.0
##DATA TYPE= NMR SPECTRUM
##DATA CLASS= NTUPLES
##ORIGIN= Bruker BioSpin GmbH
##OWNER= NMR
$$ XWIN-NMR		Version 3.5
$$ Mon Dec  5 13:40:56 2005 GMT Standard Time (UT+0h)  MAYBRIDGE\NMR@NMR_250MHZ
##.OBSERVE FREQUENCY= 250.131544655141
##.OBSERVE NUCLEUS= ^1H
##.ACQUISITION MODE= SIMULTANEOUS (DQD)
##.ACQUISITION SCHEME= undefined
##.AVERAGES= 16
##.DIGITISER RES= 18
##SPECTROMETER/DATA SYSTEM= dpx250
##.PULSE SEQUENCE= zg30
##.SOLVENT NAME= DMSO
##.SHIFT REFERENCE= (INTERNAL, DMSO, 0, 16.522)
##AUDIT TRAIL= $$ (NUMBER, WHEN, WHO, WHERE, WHAT)
$$ ##TITLE= Audit trail, XWIN-NMR		Version 3.5
$$ ##JCAMPDX= 5.01
$$ ##ORIGIN= Bruker BioSpin GmbH
$$ ##OWNER= NMR
$$ C:\u/data/dgb/nmr/ADRS/13410/pdata/1/auditp.txt
$$ ##AUDIT TRAIL=  $$ (NUMBER, WHEN, WHO, WHERE, WHAT)
(   1,<2005-12-05 13:40:33.56 +000>,<MAYBRIDGE\NMR>,<NMR_250MHZ>,
      <created by zg, POWCHK disabled, PULCHK disabled
       configuration hash MD5:
       62 19 C7 07 E1 42 D1 B7 37 6C 3D D0 77 39 F9 E6
       data hash MD5: 64K
       50 F2 61 3D 7A A4 06 3C 73 FD CF 80 31 2A A1 F4>)
(   2,<2005-12-05 13:40:46.66 +000>,<MAYBRIDGE\NMR>,<NMR_250MHZ>,
      <Start of raw data processing
       ef LB = 0.3 FT_mod = 6 PKNL = 1 SI = 32K 
       data hash MD5: 32K
       0D A7 CB 18 BC CF 1B 8A 03 A0 95 7F 0C 5D E0 30>)
(   3,<2005-12-05 13:40:48.50 +000>,<MAYBRIDGE\NMR>,<NMR_250MHZ>,
      <apk 
       data hash MD5: 32K
       45 9D C0 B3 F4 09 EF 82 B4 10 0F 8F 23 D9 A7 92>)
(   4,<2005-12-05 13:40:49.27 +000>,<MAYBRIDGE\NMR>,<NMR_250MHZ>,
      <abs ABSG = 5 
       data hash MD5: 32K
       D8 EC D7 56 16 C4 90 5B 85 7F 9A AA AB EC 04 DB>)
$$ ##END=
$$ 
$$ hash MD5
$$ FF 62 E7 B9 1A 1B CF 34 65 EF 49 70 03 E9 7D 5D
##$RELAX= 
##$RELAX= 
##$RELAX= 
##$RELAX= 
##$RELAX= 
##$RELAX= 
##$RELAX= 
$$ Bruker specific parameters
$$ --------------------------
##$DU= <C:\u>
##$EXPNO= 13410
##$NAME= <ADRS>
##$PROCNO= 1
##$TYPE= <nmr>
##$USER= <dgb>
##$AMP= (0..31)
100 100 100 100 100 100 100 100 100 100 100 100 100 100 100 100 100 100 
100 100 100 100 100 100 100 100 100 100 100 100 100 100 
##$AQSEQ= 0
##$AQ_mod= 3
##$AUNM= <au_zg>
##$AUTOPOS= <19 >
##$BF1= 250.13
##$BF2= 250.13
##$BF3= 250.13
##$BF4= 250.13
##$BF5= 500.13
##$BF6= 500.13
##$BF7= 500.13
##$BF8= 500.13
##$BYTORDA= 1
##$CFDGTYP= 0
##$CFRGTYP= 5
##$CHEMSTR= <none>
##$CNST= (0..31)
1 1 145 1 1 1 1 1 1 1 1 1 1 1 1 1 1 1 1 1 1 1 1 1 1 1 1 1 1 1 1 1 
##$CPDPRG= <>
##$CPDPRG1= <>
##$CPDPRG2= <>
##$CPDPRG3= <>
##$CPDPRG4= <mlev>
##$CPDPRG5= <mlev>
##$CPDPRG6= <mlev>
##$CPDPRG7= <mlev>
##$CPDPRG8= <mlev>
##$CPDPRGB= <>
##$CPDPRGT= <>
##$D= (0..31)
0 1 0 0 0 0 0 0 0 0.06 0 0 0 0 0 0 0.0002 0 0 0 0 0 0 0 0 0 0 0 0 0 0 
0 
##$DATE= 1133790032
##$DBL= (0..7)
120 120 120 120 120 120 120 120 
##$DBP= (0..7)
150 150 150 150 150 150 150 150 
##$DBP07= 0
##$DBPNAM0= <>
##$DBPNAM1= <>
$$ [...]
##$SUBNAM6= <"">
##$SUBNAM7= <"">
##$SUBNAM8= <"">
##$SUBNAM9= <"">
##$SW= 20.6930455092707
##$SWIBOX= (0..15)
0 0 3 0 0 0 0 0 0 0 0 0 0 0 0 0 
##$SW_h= 5175.983436853
##$TD= 65536
##$TD0= 1
##$TE= 294.16
##$TE2= 300
##$TE3= 300
##$TEG= 300
##$TL= (0..7)
0 120 120 120 120 120 120 120 
##$TP= (0..7)
150 150 150 150 150 150 150 150 
##$TP07= 0
##$TPNAME0= <>
##$TPNAME1= <>
##$TPNAME2= <>
##$TPNAME3= <>
##$TPNAME4= <>
##$TPNAME5= <>
##$TPNAME6= <>
##$TPNAME7= <>
##$TPOAL= (0..7)
0.5 0.5 0.5 0.5 0.5 0.5 0.5 0.5 
##$TPOFFS= (0..7)
0 0 0 0 0 0 0 0 
##$TUNHIN= 0
##$TUNHOUT= 0
##$TUNXOUT= 0
##$USERA1= <user>
##$USERA2= <user>
##$USERA3= <user>
##$USERA4= <user>
##$USERA5= <user>
##$V9= 5
##$VALIST= <valist>
##$VCLIST= <CCCCCCCCCCCCCCC>
##$VD= 0
##$VDLIST= <DDDDDDDDDDDDDDD>
##$VPLIST= <PPPPPPPPPPPPPPP>
##$VTLIST= <TTTTTTTTTTTTTTT>
##$WBST= 1024
##$WBSW= 4
##$XGAIN= (0..3)
0 0 0 0 
##$XL= 0
##$YL= 0
##$YMAX_a= 477093
##$YMIN_a= -373228
##$ZGOPTNS= <>
##$ZL1= 120
##$ZL2= 120
##$ZL3= 120
##$ZL4= 120
##$ABSF1= 16.522
##$ABSF2= -4.171173
##$ABSG= 5
##$ABSL= 3
##$ALPHA= 0
##$AQORDER= 0
##$ASSFAC= 0
##$ASSFACI= 0
##$ASSFACX= 0
##$ASSWID= 0
##$AUNMP= <proc_1d>
##$AZFE= 0.1
##$AZFW= 0.1
##$BCFW= 0
##$BC_mod= 0
##$BYTORDP= 0
##$COROFFS= 0
##$CY= 12.5
##$DATMOD= 1
##$DC= 0
##$DFILT= <>
##$DTYPP= 0
##$F1P= 14.0000005364418
##$F2P= -0.99999901652339
##$FCOR= 0.5
##$FTSIZE= 32768
##$FT_mod= 6
##$GAMMA= 0
##$GB= 0
##$INTBC= 1
##$INTSCL= 1
##$ISEN= 128
##$LB= 0.3
##$LEV0= 0
##$LPBIN= 0
##$MAXI= 10000
##$MC2= 0
##$MEAN= 0
##$ME_mod= 0
##$MI= 0
##$NCOEF= 0
##$NC_proc= -3
##$NLEV= 6
##$NOISF1= 0
##$NOISF2= 0
##$NSP= 0
##$NTH_PI= 0
##$NZP= 0
##$OFFSET= 16.522
##$PC= 1
##$PHC0= 76.47607
##$PHC1= 8.93275
##$PH_mod= 1
##$PKNL= yes
##$PPARMOD= 0
##$PSCAL= 4
##$PSIGN= 0
##$REVERSE= no
##$SF= 250.13
##$SI= 32768
##$SIGF1= 0
##$SIGF2= 0
##$SINO= 400
##$SIOLD= 32768
##$SREGLST= <1H.DMSO>
##$SSB= 0
##$STSI= 32768
##$STSR= 0
##$SW_p= 5175.98343685301
##$SYMM= 0
##$S_DEV= 0
##$TDeff= 65536
##$TDoff= 0
##$TI= <Analysis number 999999
Compound Code 99
Book Reference 9
Project Code 9>
##$TILT= no
##$TM1= 0
##$TM2= 0
##$TOPLEV= 0
##$USERP1= <user>
##$USERP2= <user>
##$USERP3= <user>
##$USERP4= <user>
##$USERP5= <user>
##$WDW= 1
##$XDIM= 32768
##$YMAX_p= 483144824
##$YMIN_p= -304251
$$ End of Bruker specific parameters
$$ ---------------------------------
##NTUPLES= NMR SPECTRUM
##VAR_NAME=  FREQUENCY,     SPECTRUM/REAL,   SPECTRUM/IMAG
##SYMBOL=    X,             R,               I
##VAR_TYPE=  INDEPENDENT,   DEPENDENT,       DEPENDENT
##VAR_FORM=  AFFN,          ASDF,            ASDF
##VAR_DIM=   32768,         32768,           32768
##UNITS=     HZ,            ARBITRARY UNITS, ARBITRARY UNITS
##FACTOR=    0.157963299565203, 1,           1
##FIRST=     4132.6476996994, 0,             0
##LAST=      -1043.33573715361, 0,           0
##MIN=       -1043.33573715361, -304251,     0
##MAX=       4132.6476996994, 483144824,     0
$$ Real data points
##PAGE= N=1
##DATA TABLE= (X++(R..R)), XYDATA
$$ [...]
18733H9411n826J6625L4432r541J3812M771m3521L4214L9325R811M7224Q1128
18721C11865j1895j39701q0583o0838P4030M300n5107n47Q3427K3420K2154k1597
18709A48928q1028j0542m037K6070J7348o04n1605K3508J5329j1299L2097l592
18697A00573q0664n896L4102L1920n6122r3295k3279K1348N8420J03869K4702
18686A15678j2071J7880O6546M593M4419P5845l1087m5475r651l3360o5864j9696
18674A07757N3760J0690r8800p0210Q54P4917N2121j7318j9805K4189N0832n612
18662A63375M1966l3361k5621N6418N001o688j3686j7832P307k9699L0278J47060
18650C24518J08674J17825M1161l6249o4255l7551n7824j17682o8856j1614j68
$$ plain form
18733 89411 83585 100210 134642 125101 138913 143684 100163 134377 173702 183513 230737 311865
18721 311865 299970 160269 79686 18848 92878 97178 42071 41524 124951 148371 170525 148928
18709 148928 67900 57358 53321 79391 96739 96135 44530 68038 83367 72068 104165 100573
18697 100573 19909 14013 48115 80035 23913 -69382 -92661 -71313 -12893 90976 115678
18686 115678 103607 121487 188033 192626 237045 312890 281803 236328 226677 193317 127453 107757
18674 107757 161517 172207 73407 3197 4051 78968 131089 113771 93966 118155 168987 163375
18662 163375 205341 171980 146359 202777 207778 201090 187404 169572 176879 147180 177458 324518
18650 324518 433192 551017 592178 555929 491674 454123 396299 278617 209761 198147 197979
18639A97979M6522J8812O5222o3921o8721L7110Q3987N2386N5551M9591n192L2931
18627E02257l1115n3467m6877j4175n9566n2272J8628M6792L2342M6400J4005
18616D02952Q078j8692m0074j2646J6482l9021L1745K6930m5527P394J5181N1279
18604D04081N892j9826k5051K2476o4266l5504M678J9587J6119J00028R2631k3457
18592D97388o0714o547K7368L9281m1065k0357l9820K3894J6976J3080M6368Q7185
18580E83037O8283J34545J02288P7388R3536L1620l5160q6867q9237k5245o5916
18569G88272j12998o4644l1099l9084K119l3429M2615O4346q484K556M8234P1743
18557G30147o9806q2534l5667J289P5431n9673l4934J3877R045K598P558L6310
$$ plain form
18639 197979 244501 263313 328535 264614 195893 233003 316990 369376 424927 474518 469326 502257
18627 502257 471142 417675 370798 356623 297057 244785 263413 310205 342547 388947 402952
18616 402952 411030 392338 352264 339618 356100 317079 348824 375754 330227 337621 352802 404081
18604 404081 409973 390147 365096 387572 323306 287802 292480 312067 328186 428214 520845 497388
18592 497388 436674 430127 457495 496776 455711 435354 395534 419428 436404 449484 495852 583037
18580 583037 651320 785865 888153 965541 1059077 1090697 1055537 968670 879433 854188 788272
18569 788272 675274 610630 579531 540447 542566 509137 551752 616098 607614 610170 658404 730147
18557 730147 660341 577807 542140 543429 618860 559187 524253 538130 547175 549773 557331 593641
18545E93641N2167J10350N5064L6177J02818P4380k0982J6863J32348J60749Q3903
18534A397478N9281k2448j0405K9113O4373Q0870J26694M4314L4436R0855M2265
18523A936826P1800J08456O1553L5172J53568J83881J62806L24934M15142M36753
18513C890891L89725L94327M56798M55913N89623Q54661J310962J953485K919756
18504A3216141L761890L872374K629727K035785L461992O497147J2150326K0716333
18496F8341715K9125232K9519557J6992478R69348j6119771k4312343k4281176
18489H0235040k1046135j3740988o409389k664740k395689k473765q49111J001832
18481C1657055L197753M445864J891466q57609o52181N11533L659932R220317
$$ plain form
18545 593641 645808 756158 811222 847399 950217 1024597 1003615 1020478 1152826 1313575 1397478
18534 1397478 1456759 1434311 1423906 1453019 1517392 1598262 1724956 1769270 1803706 1894561 1936826
18523 1936826 2008626 2117082 2178635 2213807 2367375 2551256 2714062 3038996 3454138 3890891
18513 3890891 4280616 4674943 5131741 5587654 6177277 7031938 8342900 10296385 13216141
18504 13216141 16978031 20850405 23480132 25515917 28977909 35475056 47625382 68341715
18496 68341715 97466947 126986504 143978982 144948330 128828559 104516216 80235040
18489 80235040 59188905 45447917 39038528 36373788 33978099 31504334 30655223 31657055
18481 31657055 34854808 39300672 41192138 40334529 39682348 40193881 43853813 53074130
18473E3074130J3223444R902120j297117p665180r679280j1204573q718770l062677
18465C4572097K918963R152523J4925305J5569380L807682p842097r295147j1287996
18457E2520710j0590921m436307N53283N37738l636750n216762n389061o050997
18449A8290933m987275l113399j905226j317721q38031o35095o27211o20321m21077
18440C825577l56157l66291l56444k55576j28360j61824r5218j27831j32110j82508
18430A663258j74795j58766j12870q1933q3503q0594o4243n9120j12567o8431
18420F66436o5637m8956j4858n3514j543p3647o0622Q1670L2262L702K5044L7513
18408E27850M5660J669n34L3856o4571o8564q0588r3367p1042j6438k1540J8313
$$ plain form
18473 53074130 66297574 76199694 74902577 67237397 57558117 46353544 37634774 34572097
18465 34572097 37491060 46643583 61568888 77138268 80945950 73103853 63808706 52520710
18457 52520710 41929789 37493482 38046765 38584503 34947753 29730991 24341930 18290933
18449 18290933 13303658 10190259 8285033 6967312 6129281 5494186 4866975 4246654 3825577
18440 3825577 3469420 3103129 2746685 2491109 2362749 2200925 2105707 1977876 1845766 1663258
18430 1663258 1488463 1329697 1216827 1134894 1051391 970797 906554 847434 734867 666436
18420 666436 600799 551843 536985 483471 481928 408281 347659 429329 461591 465293 490337 527850
18408 527850 573510 575179 574645 608501 543930 475366 394778 301411 230369 213931 192391 210704
18396B10704j4519j8886L503q7413K5767L0951j072M9160l1663L7803M3038L0038
18384B77411n0777l0781j8604J1696J0078j756j2527k1626K9477n686l0512M2354
18372A98747k2983l5457R1162k3344j7052m0701n4671J4949k0749n7829L0126
18361F2198P560J5132M0124k1100k3154j9210P789K0183M0904K2766q5496q8767
18349b1071j3430L1149j4391q82M5784j533q525K0878k7370k0693j8792J1896
18337a6980N1167M6034N543K5428J4023J2909k1165p145k1770j2368n1261o7275
18325d2860j5646K3844k6735j2638J3145M8558J9666k2262K1793J6941j0776K7212
18313D0242O6391L5165k1896n8657J4302J9504k6260k5768j9652j194M6885j508
$$ plain form
18396 210704 196185 177299 180802 93389 119156 150107 149035 198195 166532 204335 247373 277411
18384 277411 226634 195853 177249 188945 199023 197267 184740 163114 192591 186905 156393 198747
18372 198747 175764 140307 231469 208125 191073 150372 95701 110650 89901 32072 62198
18361 62198 69758 84890 125014 103914 80760 61550 69339 89522 130426 153192 67696 -21071
18349 -21071 -34501 -3352 -17743 -18625 27159 25626 17101 37979 10609 -10084 -28876 -16980
18337 -16980 34187 80221 85764 111192 125215 138124 116959 109814 88044 75676 24415 -42860
18325 -42860 -58506 -34662 -61397 -74035 -60890 -12332 7334 -14928 6865 23806 13030 40242
18313 40242 106633 141798 119902 61245 75547 95051 68791 43023 23371 22177 69062 67554
18301F7554K3612M6492O1529K5859j431m6287J3944J1929k2734l7462r678K692
18289A36019l720L818M708n880m87q224L14o884L598m7310p8008k9752J7792L4884
18275B0868Q346j2832K7284M1822K4647J0334l1165o2496k2659m644K9953N0462
18263G9920K6726M4741n193L8582K0022Q35N0447m4798k8360p434l7613p3723
18251F4152p5977N4848M8128n9249O6986J4095o2015J3509K3079K1271l2516j3497
18239F2814n425k2504j3784K1711R9255Q456n3522m7464r338j758J1970J6246
18227F6657l456j7468n7567m042L7377O716J2660J5152l1862o1983j030N8189
18215A9343M2781M0424j4447K7257j7384R268J0523m1277o366o5875o3082j8418
$$ plain form
18301 67554 91166 137658 199187 225046 223615 177328 191272 203201 180467 143005 133327 136019
18289 136019 132299 136117 140825 134945 134458 126234 126548 119664 123262 75952 -2056 -31808 -14016 20868
18275 20868 29214 16382 43666 85488 110135 120469 89304 26808 4149 -495 29458 79920
18263 79920 106646 151387 146194 184776 204798 205633 256080 211282 182922 175488 137875 64152
18251 64152 -11825 43023 91151 31902 98888 112983 50968 64477 87556 108827 76311 62814
18239 62814 57389 34885 21101 42812 142067 150523 97001 49537 40199 38441 50411 66657
18227 66657 63201 45733 -11834 -15876 21501 28217 40877 56029 24167 -37816 -38846 19343
18215 19343 62124 102548 88101 115358 97974 107242 117765 76488 70122 4247 -58835 -77253
18203g7253L8625K0524j1414m5069o6557J2941J788N6892L7249M3079N2530L6355
18191I9690P2321k4268l0742K0430M7299K4086J3539n3542j8855l2871r1873m2302
18179a7088L3879M7556M4768L3508K3234J1170l1145j1728l0557j2519p1020k7874
18167g816K1163O1171K3434O8558P5447N6488M700L9035K6400m5148n3557o3226
18155B06649p4348J5373r073L5038O1126j6444q5906p301k8801j9057K2877K3480
18143A23613L4932O268l5412K9314L5428K4000j4871l792k4330N007K1138K3252
18131B24547N650m0409j2506P161K5358k6067k6299k7199l4075k980L7251N4767
18119A85199Q4706m4131l7624l1634J4942k5764M714L8748Q8039k5060p0248J1561
$$ plain form
18203 -77253 -38628 -18104 -29518 -74587 -141144 -128203 -126415 -69523 -32274 10805 63335 99690
18191 99690 172011 147743 117001 137431 184730 208816 222355 168813 149958 117087 25214 -17088
18179 -17088 16791 64347 109115 142623 165857 177027 145882 134154 103597 91078 20058 -7816
18167 -7816 13347 74518 97952 166510 241957 298445 303145 342180 368580 323432 269875 206649
18155 206649 132301 147674 138601 173639 234765 218321 132415 125114 96313 77256 100133 123613
18143 123613 158545 164813 129401 158715 194143 218143 203272 199480 175150 180157 201295 224547
18131 224547 230197 189788 177282 184443 209801 183734 157435 130236 96161 93181 130432 185199
18119 185199 269905 225774 188150 156516 171458 145694 150408 189156 277195 252135 181887 193448
18107A93448K5654l0331J8034k9087m2586Q564p88L8534O7245Q6806P5625P2247
18095D83365Q6641N9599n1691r5903j32470m1170K294n8816k9371P47O2381q36
18083B84770n3992p153Q094j3281M0236P195K9750J5427N9467P8204J50479J60487
18071G59683M088o8212q9015l0624K7079k4150K5606N6622J5031N9523o6597p3277
18059E95757l8170l6032M85K1605N2507l0103l7820k1626k1622J699O0520K0164
18047E67364J3911M2440L4194M1278J07802J25987Q8286J19133Q2043O2305R1918
18036A376661K9650L2862P6301J65582K30955K56212L77075L38057J00872J3258
18026B997485J44819J61305K84857L51411N20419O87646P14920O34338Q15776
$$ plain form
18107 193448 219102 188771 206805 177718 135132 143696 142908 181442 248687 335493 411118 483365
18095 483365 570006 629605 577914 482011 349541 308371 310665 251849 222478 223225 285606 284770
18083 284770 230778 223625 231719 218438 258674 265869 295619 311046 370513 448717 599196 759683
18071 759683 763771 695559 606544 575920 602999 578849 604455 661077 676108 735631 669034 595757
18059 595757 557587 521555 522040 543645 596152 566049 528229 506603 484981 486680 547200 567364
18047 567364 581275 623715 657909 699187 806989 932976 1021262 1140395 1222438 1284743 1376661
18036 1376661 1406311 1439173 1515474 1681056 1912011 2168223 2545298 2883355 2984227 2997485
18026 2997485 3142304 3303609 3588466 3939877 4460296 5147942 5862862 6497200 7312976
18017G312976J167015J701876K707482L895603N941675J0065988J7602091K9577825
18009G9972531M3659628M9320561K2364538j8958179k6941525l3291960l9330703
18002G6794891k8511427j5757944q752562n275304l514510k420056j783957j320102
17994I459029j006269p06037o41551o72272o52148o38898o72877n06771l72388
17985C589818j80528j5468p9183k31107k17665l11411l53965k90379j97320j04016
17975A608776r0748j09523j27271j21552p3263j6857o279l0712l7435p9123m502
17964I11511M5545l3788k594r8321j39139j07177m1493M9538l3024o1731m8975
17953D40352j4171L6228j6314m5224k1915k1446N7475P6049m789l2927k1505P9724
$$ plain form
18017 7312976 8479991 10181867 12889349 16784952 22726627 32792615 50394706 79972531
18009 79972531 123632159 172952720 195317258 176359079 149417554 116125594 76794891
18002 76794891 48283464 32525520 23772958 18497654 14983144 12563088 10779131 9459029
17994 9459029 8452760 7746723 7105172 6432900 5780752 5141854 4468977 3962206 3589818
17985 3589818 3409290 3393822 3314639 3083532 2865867 2554456 2200491 1910112 1712792 1608776
17975 1608776 1518028 1408505 1281234 1159682 1086419 1069562 1063283 1032571 995136 916013 911511
17964 911511 957056 923268 920674 822353 683214 576037 534544 584082 551058 489327 440352
17953 440352 426181 462409 446095 400871 378956 357510 414985 491034 486245 453318 431813 511537
17941E11537Q4589k0604k4104J976K3111l1430n7774n4881l5269l0511j9394p887
17929C39359N5677L6696k9728k7454J1805o604m1741m2376K2705M9264M8714k656
17917D13661j3097L8812R2030O8823L4592R7634L3001O222o236o8M7391j3377
17905G99388L0584N8533K2150R5075R9605J30478J09220J49173P0345M6124M3051
17894A653726O0587J45882K12693L12147M15401M88057P14583J018080J558073
17885F579229K500155M225158P011205J0632371J3037973Q718275l010969o638108
17877D3055289p905791j0318917q274635m659996k526894j423863p61482m12885
17869F770826j23199J33730K77523L43832L03618N34719J089725J900778L406353
$$ plain form
17941 511537 596126 575522 551418 553394 576505 545075 487301 432420 397151 366640 347246 339359
17929 339359 395036 431732 402004 374550 386355 379751 338010 295634 318339 367603 416317 413661
17917 413661 400564 439376 531406 600229 634821 732455 765456 771678 765442 765374 812765 799388
17905 799388 829972 888505 910655 1005730 1105335 1235813 1345033 1494206 1564551 1610675 1653726
17894 1653726 1714313 1860195 2072888 2385035 2800436 3288493 4003076 5021156 6579229
17885 6579229 9079384 13304542 20315747 30948118 43986091 52704366 49693397 43055289
17877 43055289 35149498 24830581 16555946 11895950 9369056 7945193 7183711 6770826
17869 6770826 6647627 6781357 7058880 7402712 7706330 8241049 9330774 11231552 14637905
17860A4637905N694094Q624526J0728165Q369658l10141m631579n150352n886990
17852C2075286k996967K590405P303719Q475363K002075n339323o574759q201596
17844B9334203q681624n920403l328889j954128j081769o63444o51143o05284
17836F447519m60267k91197k6723K18732O00039J219660K194756L869742O473559
17827B0245820R527848J0778393M860578m635287o135674p599861q853379o252096
17819A1936342l521163k008339j254299r38365o26866m97447m05429l23533k78288
17810B082613k60948j84776j74420j12384j38680l7508j9271q9311j11932l0788
17800I22595n5397n8403n6047r0577L553K5242j251r940o9052j38479m6710l1719
$$ plain form
17860 14637905 20331999 28956525 39684690 48054348 47744207 43112628 37962276 32075286
17852 32075286 29078319 31668724 38972443 47447806 49449881 44110558 37535799 29334203
17844 29334203 20652579 14732176 11403287 9449159 8367390 7703946 7052803 6447519
17836 6447519 5987252 5696055 5669332 5888064 6488103 7707763 9902519 13772261 20245820
17827 20245820 29773668 40552061 45412639 40777352 34641678 27041817 18188438 11936342
17819 11936342 8415179 6406840 5152541 4214176 3587310 3089863 2684434 2360901 2082613
17810 2082613 1821665 1636889 1462469 1350085 1211405 1173897 1154626 1065315 953383 922595
17800 922595 867198 808795 752748 662171 665724 690966 689715 679775 610723 472244 425534 393815
17788C93815j03575p6718l9103l0580L5243O8396M2161l1337m7526o3529o5984
17777H1263m2034j4452O3918K2660L9452j5771n6571j3401Q1992J4800l3467k5797
17765A02592o8821o8496j5993j5765l277Q836K4185J9381R1927P3169j056m1821
17753A04861j5310J1958p6223m7285K256K4440n141j9465m560M0171M504j7573
17741B633q224p111j7925M3699l899m1192K7873L2099j742j3283Q093M1025k9849
17728C2197k1245J8989m8172k9033O1492L7276l3440j5144j0774r0168j6152M4679
17716f9495O1177L0567k7995m7387J4660R916L0624l474p7565m3786M568K6322
17704i1868r107m7559k5297J3070N3672p842M1970K9509K2301k0187n3282L1097
$$ plain form
17788 393815 290240 213522 174419 143839 179082 247478 289639 258302 210776 147247 81263
17777 81263 39229 24777 88695 111355 150807 135036 78465 65064 147056 161856 128389 102592
17765 102592 33771 -34725 -50718 -66483 -69760 -60924 -36739 -17358 74569 147738 146682 104861
17753 104861 89551 101509 25286 -21999 -19743 4697 -444 -19909 -24469 15702 20206 2633
17741 2633 -5591 -12702 -30627 13072 9173 -32019 -4146 27953 26211 12928 21021 62046 32197
17728 32197 10952 29941 -18231 -47264 14228 51504 18064 2920 -7854 -98022 -114174 -69495
17716 -69495 -8318 22249 -5746 -53133 -38473 -28557 2067 -1407 -78972 -122758 -118190 -91868
17704 -91868 -100975 -148534 -173831 -160761 -107089 -114931 -72961 -43452 -21151 -41338 -94620 -63523
17692f3523N9254N295N0655L9025L0235o7010l2046L8519j5790m9758j7733J7148
17680e729l0799r351M813j5853l5333j4695K6522J0376M9814N730k5332M2590
17668B753M7759L7870j2695m3460p3085Q626N1641R3892j2528o1771k4924K2541
17656C6619J0233l8914k8459M7068j8460m677N163n115J0660L369P163l707j4842
17643F101l2873L5079J9094l8611j5529O2523K7939l7998p0560k5452N0065M6386
17631B6164J9220k8758q7245K3726O1716j4493k2178m1060k0431o26K8868O471
17619d8626o953j5916m112K1755M1632K9231n0275j7223N4046M2485n6388n8974
17607f9318p996M8412L4535J4727l2990J1186o654L181m949k201K9860R686j4255
$$ plain form
17692 -63523 -4269 1026 51681 90706 120941 53931 21885 60404 44614 -5144 -22877 -5729
17680 -5729 -36528 -45879 -41066 -56919 -92252 -106947 -80425 -70049 -20235 -14505 -39837 2753
17668 2753 50512 88382 75687 32227 -40858 -32232 19409 113301 100773 39002 14078 36619
17656 36619 46852 7938 -20521 26547 8087 3410 8573 3458 14118 17487 24650 20943 6101
17643 6101 -26772 8307 27401 -11210 -26739 35784 63723 25725 -44835 -70287 -20222 26164
17631 26164 45384 16626 -70619 -46893 14823 330 -21848 -62908 -83339 -83965 -55097 -48626
17619 -48626 -55579 -71495 -75607 -53852 -12220 17011 -33264 -50487 3559 46044 -10344 -69318
17607 -69318 -77314 -28902 5633 20360 -12630 -1444 -8098 -4917 -9866 -12067 17793 27479 13224
17594A3224P066j1102j2045l4282l1060n2530J5864J6172J5974m0255k2475K5752
17582a09697K0058j1928M5635N860l896R103m6058O256R7460k3725m6877K9900
17570b7909M2482N524p4991m2597L307M1609L2066K4778m4645k7647j2585O3846
17558a6762Q6458q399J9510L8767j3371k3663J9118L337M1697K07171K96832M00923
17546A051618L80602Q0137j86623k68471k91434k39073j99204j40928q7527j09009
17536i912l8386L3477L1774J769M427k33K0308k4217l350P521J5148k3057n8308
17523d3039j3518N0889J1810J3684j9738l148J9788j9729m2203M1633J0823j7305
17511a0053m197L4239J8472K7709k5705o5567k0681Q808m4642n087L1737O5603
$$ plain form
17594 13224 20290 9188 -2857 -37139 -68199 -120729 -104865 -88693 -72719 -112974 -135449 -109697
17582 -109697 -89639 -101567 -55932 -50072 -53968 -44865 -90923 -84667 12793 -10932 -57809 -27909
17570 -27909 14573 20097 -54894 -97491 -94184 -52575 -20509 4269 -40376 -68023 -80608 -16762
17558 -16762 69696 61297 80807 119574 106203 82540 101658 104995 146692 353863 650695 1051618
17546 1051618 1432220 1512357 1325734 1057263 765829 526756 327552 186624 99097 -9912
17536 -9912 -48298 -14821 16953 18722 23149 22916 43224 19007 15657 23178 38326 15269 -43039
17523 -43039 -56557 -5668 6142 19826 88 -3060 16728 -3001 -45204 -3571 7252 -10053
17511 -10053 -14250 19989 38461 66170 40465 -25102 -45783 -36975 -81617 -86704 -54967 10636
17499A0636L8610q074J2086l1537k0339J4665l4557l2437k2125j911N5426N0606
17487C1049j8561p966j1010L004j4294M2601J0560j7304m7329j6031m1729J24
17475h6886L5821O6725K8596j1823j246n012K8503K940q988K0238k3002O1277
17463A07143j636p1789j1454j0665J4159M6649l6597o5672k6825K1350K6683K4262
17451A5608O3396l0775p7629k5004J2114N8706M8226K9011J1617J130p3642l322
17439B9436P3761P0698q669J18290J22465J33936R5264O6915k2462m7790j73200
17428D58644j53032o1644j9616q0814n1534j9436n7915J1326k5314K1798M5891
17417F8354L0582O0785m4697j02889p1749j1687M8286P4491j8795R348j5198P65
$$ plain form
17499 10636 49246 41172 53258 21721 1382 16047 -18510 -50947 -73072 -74983 -19557 31049
17487 31049 12488 4522 -6488 -3484 -17778 24823 35383 18079 -29250 -45281 -87010 -86886
17475 -86886 -51065 15660 44256 32433 31187 26175 54678 57618 48630 68868 45866 107143
17463 107143 105507 33718 22264 11599 25758 72407 35810 -29862 -56687 -35337 -8654 15608
17451 15608 79004 48229 -29400 -54404 -42290 16416 64642 93653 105270 106400 32758 29436
17439 29436 103197 173895 165226 283516 405981 539917 635181 702096 679634 631844 458644
17428 458644 305612 243968 224352 143538 92004 72568 14653 25979 665 22463 68354
17417 68354 98936 159721 115024 12135 -59614 -71301 -23015 51476 32681 42029 26831 27596
17405B7596n4513j8465K2693l515l5597l3594P0077N765j136J586N278J2811l0888
17392c1902Q856L7402p170o7324K6236K1246N259r468k8479l1456j003L687j7388
17379i1504m2603N5964O2624l3971Q167O8452j648P877J4373L95k9455n5171l6256
17366g2756J7848k5042L4629J3861m46j6088K5360l782J3459L8254M1366J1544
17354G8207L0213m2743l9924j7040J4108q9467J3200J08293P8301N2603q949l3027
17342A43775o4080L5807l7089l7504J4375l0185j5734k5872j1342L2480O845j9128
17330g652m319K4160O5301n764n7571m4421O8071J07995P6749J3671o7807k7151
17318A41262o293j0587J2768K0740n233O0897m4654m5005N094m3872o4109o3318
$$ plain form
17405 27596 -26917 -45382 -22689 -26204 -61801 -95395 -25318 -19553 -20689 -19103 -13825 -1014 -31902
17392 -31902 -23046 14356 7186 -60138 -33902 -12656 -7397 -16865 -45344 -76800 -77803 -74116 -91504
17379 -91504 -134107 -78143 -15519 -49490 -41323 27129 25481 33358 47731 48126 18671 -36500 -72756
17366 -72756 -54908 -79950 -45321 -31460 -31906 -47994 -22634 -26416 -12957 25297 66663 78207
17354 78207 108420 65677 25753 8713 22821 -66646 -53446 54847 133148 185751 176802 143775
17342 143775 79695 115502 78413 40909 55284 25099 9365 -16507 -27849 4631 11476 -7652
17330 -7652 -11971 12189 77490 71726 14155 -30266 37805 145800 222549 236220 168413 141262
17318 141262 134969 124382 137150 157890 152657 213554 168900 123895 128989 85117 21008 -42310
17306d2310l3419N5854K637K4359K8417l7864o6801j7995O4876M7101j4563m6471
17294c6179J3602K0027o183O497P7760J4803m5011J5835N6536Q898o0757n4680
17282A1148j5308o7858K3471L0455k3859L0580K0863L8248J032J1306q244J5646
17270F7480L8095l2868J6688k8061l7508m2982J3766K5368o9433j3782J7024k4886
17258g1099J1917j859K1720n6539n9057J4945j4081j5471J5041K2249K3928j7554
17246a25860J6195L9425M3324N015p0772L133n996K9822L5054P8750l3820l5940
17234b1670k8274J1507j2620j7445L6983j0323l258n750L8481K6191L3778m8480
17222h80m3927j5270L1648L0065J4275k9848o7731n8303L0487M0410M8379n3259
$$ plain form
17306 -42310 -75729 -19875 -17238 7121 35538 -2326 -69127 -87122 -22246 24855 10292 -36179
17294 -36179 -22577 -2550 -8733 -2236 75524 90327 45316 61151 117687 126585 65828 11148
17282 11148 -4160 -72018 -48547 -18092 -41951 -11371 9492 47740 48772 60078 51834 67480
17270 67480 105575 72707 89395 61334 23826 -19156 -5390 19978 -49455 -63237 -46213 -71099
17258 -71099 -59182 -61041 -39321 -95860 -154917 -139972 -154053 -169524 -154483 -132234 -108306 -125860
17246 -125860 -109665 -70240 -26916 -21901 -92673 -89540 -95536 -65714 -30660 48090 14270 -21670
17234 -21670 -49944 -38437 -51057 -68502 -31519 -41842 -45100 -50850 -12369 13822 47600 -880
17222 -880 -44807 -60077 -28429 1636 15911 -13937 -81668 -139971 -109484 -69074 -20695 -73954
17210g3954J6883J7645p348r934K903K3216k5860O0543N9730o7640o7162k0054
17198i1032l9879K8834L7161M6318L3980N6884J8925n0397l1455j3499k0753l3559
17186e8472o63M2207m9715m9706l7784O1146J0977L562L2401K1780n8850j7252
17174a00369L6101j6004n24P6950k1732r0790Q259M1696L3178M1770K0069j9525
17162I079M369O4452k6021o5293q914L0853k1921l0303o1922M6917o701k1883
17150h7288L3568M6289M4096m6078N73J0353l6570J3697q336p860L3117l1559
17138c5998J4156j5316o5015P2866O8780l3555J2222L6402m3231K2869j3106R150
17126C0224j3144j8230P044K5434N911p3327n2632q80K3926k2902K7720J7268
$$ plain form
17210 -73954 -57071 -39426 -46774 -56708 -53805 -30589 -56449 4094 63824 -3816 -70978 -91032
17198 -91032 -130911 -102077 -64916 -18598 15382 72266 91191 40794 9339 -4160 -24913 -58472
17186 -58472 -59135 -16928 -66643 -116349 -154133 -92987 -82010 -78448 -46047 -24267 -83117 -100369
17174 -100369 -64268 -80272 -80796 -3846 -25578 -116368 -108109 -66413 -33235 8535 28604 9079
17162 9079 13448 77900 51879 -13414 -22328 8525 -13396 -43699 -105621 -58704 -65405 -87288
17150 -87288 -53720 -7431 36665 -9413 -8840 1513 -35057 -21360 -29696 -37556 -4439 -35998
17138 -35998 -21842 -37158 -102173 -29307 39473 5918 18140 54542 11311 34180 21074 30224
17126 30224 17080 -1150 5894 31328 37239 -36088 -88720 -89600 -65674 -88576 -60856 -43588
17114d3588p4067l5853M4840P6297L1615p3891j17781p2257R2760P0133n442P201
17102a00033K4662J8039n1461l1238N5160K9793N6569K5957Ln0766J9662j0167
17090a3820p191k7303n382L4723j4824l4861L4508K7185L85n3717M5631K8563
17078A3897K9544l098j8748k3422M3531m782l3565K8674p3567p3402j2052K3298
17066a03692j0791L9593j6119L8564j2441J7458M4430K9851k9747P955J5217m2235
17054b1957M088J9270l8954K0021K866M75J0592k6962n969K1901k7779J3944K3463
17041e001M737J0390K8302j8856K2492P729k4238k8412o612k8935m7624o335L2896
17028e9467K0268L0790M730L3925M750j4817J1856L4436K0693k5188n3665L9818
$$ plain form
17114 -43588 -117655 -153508 -108668 -32371 -756 -74647 -192428 -264685 -171925 -101792 -107234 -100033
17102 -100033 -75371 -57332 -108793 -140031 -84871 -55078 1491 27448 27451 -23315 -3653 -13820
17090 -13820 -21011 -48314 -53696 -18973 -33797 -68658 -34150 -6965 -6580 -60297 -14666 13897
17078 13897 43441 40343 21595 -1827 41704 36922 3357 32031 -41536 -114938 -126990 -103692
17066 -103692 -114483 -74890 -91009 -52445 -64886 -47428 -2998 26853 -2894 5061 20278 -21957
17054 -21957 -17869 1401 -37553 -17532 -14666 -14191 -3599 -30561 -36530 -14629 -42408 -28464 -5001
17041 -5001 -264 10126 38428 19572 42064 49793 25555 -2857 -9469 -38404 -86028 -92363 -59467
17028 -59467 -39199 -8409 -3679 30246 34996 20179 32035 66471 87164 61976 8311 48129
17016D8129k371m0304L1300o057j0594R30p0599m1249N7736L244k7663K813L1796
17003b2889L0471M6266J1740o2259l4293P0185n096j4936j9327J2004J7783j5301
16991A4348k5203J387k5055J8762J122O974R802N252L6823k5644k6743j374J1426
16978A877L9705m5562m8530P084J4101J6391q633j3669M3852Q2901j1067r064
16966F9386j7526k5465m6793N131l6525k7833K4377N7971n3112m4919N882Q526
16954h0900K7933R8319L7621m82o9121R849N9597m7559r2810j4407j2888K8265
16942e6583M0670M1675M7033k9218r3825n4479J96J5878L2448J5801O7128P9372
16930A06096L1131q7257j8193n856N751l865q681K4010J2701k6328k5956o1985
$$ plain form
17016 48129 45758 5454 36754 30697 20103 21033 -49566 -90815 -33079 -29835 -57498 -54685 -22889
17003 -22889 7582 53848 65588 3329 -30964 39221 34125 19189 -138 11866 29649 14348
16991 14348 -10855 -9468 -34523 -15761 -14639 -7665 2137 7389 44212 18568 -8175 -9549 1877
16978 1877 41582 -3980 -52510 -45426 -31325 -14934 -23567 -37236 6616 89517 78450 69386
16966 69386 51860 26395 -20398 -15267 -51792 -79625 -55248 2723 -50389 -95308 -89426 -80900
16954 -80900 -52967 45352 82973 82491 13370 23219 82816 35257 -57553 -71960 -84848 -56583
16942 -56583 -15913 25762 72795 43577 -50248 -104727 -104531 -88653 -56205 -40404 26724 106096
16930 106096 137227 49970 31777 25921 31672 27807 19126 43136 55837 29509 3553 -58432
16918e8432j0906M6113M7119Q87j3435k4418m4562k9777J2864M8351K2467J0619
16906F890k8757o059j1867o535m9575k4989K1330R814m104K3610j726J2704M4169
16893a5095L4426l0000j0165n2380o4848p661K4324L8370j0549r498R7848M318
16881i10l8028l0946K823L4407N4127o4349j6473L8355K500N3358J4713o3920
16869a4343m4996Q978m569k2814j563k2171N1853P6901o588L8925l273l1125l4136
16856h921k9284J9123k904p1062o228M0634K0677L0727j456j2077J8921m1545
16844d3395L7764J4039k404k5431j8729J9607N1830K2828J1826K2511n440k7413
16832E7593q8597j219r24R2l2561k3515j0535L1943L7969M7709j1068l992m0951
$$ plain form
16918 -58432 -69338 -23225 23894 24781 11346 -13072 -57634 -87411 -74547 -26196 -3729 6890
16906 6890 -21867 -27926 -39793 -46328 -95903 -120892 -99562 -89748 -93852 -70242 -71968 -59264 -15095
16893 -15095 19331 -10669 -20834 -73214 -138062 -145723 -121399 -83029 -93578 -103076 -5228 -910
16881 -910 -38938 -69884 -67061 -32654 21473 -42876 -59349 -20994 -18494 34864 49577 -14343
16869 -14343 -59339 -50361 -54930 -77744 -79307 -101478 -49625 27276 20688 59613 56340 25215 -8921
16856 -8921 -38205 -19082 -21986 -93048 -99276 -58642 -37965 -7238 -8694 -20771 -1850 -43395
16844 -43395 -5631 8408 6004 -19427 -38156 -18549 33281 56109 67935 90446 85006 57593
16832 57593 -31004 -32223 -33147 -33055 -65616 -89131 -99666 -67723 -29754 17955 6887 2895 -38056
16819c8056M021j4368J2691M1128Q6324o5480m8638K0685J5942j9311p8618p1011
16807a54691N1720O6067J4517J8668m6900m1573K5788k9363n7139J766J4405Q7129
16795d9606o533L8450n6821l4011N5356P2310N0922m9905q3984m9025Q0474l977
16783c6350L1551m133l1990j4235N788L9866j2827m372j196l3481j1791K2164
16771e1006L1505M2425l620m0125J240o514J5194K5486L953L1850k0241M230J9265
16758E3642J1053o1003k7123L7440Q6059j0267j01081m4763j4862L7750J2429
16747b0726j3900M829L6596J0308J5835m7992k9961J085k9492l4333k005P0954
16735c8802k5850J3354O6130K547o3451j4127m373M2292L6419l628O83Q595k0218
$$ plain form
16819 -38056 -34035 -48403 -35712 5416 91740 26260 -22378 -1693 14249 -5062 -83680 -154691
16807 -154691 -102971 -36904 -22387 -3719 -50619 -92192 -66404 -95767 -152906 -151140 -136735 -49606
16795 -49606 -56139 -17689 -74510 -108521 -53165 19145 70067 20162 -63822 -112847 -32373 -36350
16783 -36350 -4799 -8932 -40922 -55157 -49369 -9503 -22330 -26702 -27898 -61379 -73170 -51006
16771 -51006 -19501 22924 19304 -20821 -19581 -26095 -10901 14585 18538 50388 30147 34377 53642
16758 53642 64695 3692 -23431 14009 100068 89801 -11280 -56043 -70905 -33155 -20726
16747 -20726 -34626 -29797 6799 17107 32942 -15050 -45011 -43926 -73418 -107751 -109756 -38802
16735 -38802 -64652 -51298 14832 17379 -46072 -60199 -64572 -22280 14139 10511 11194 19789 -429
16722d29j6421k9370l7836m2931J1514l34m160J8458L8647O4572j4118N169J0881
16709C642J081L6466k5705k7177J6895k0710K3285J3693K6014k2312j6843j593
16697F736m7512l6110m1399P7508l2217j5130K4930N6306M9892O578q357R0607
16685A31832j0535j8519p2938q5448o367J480n40R962R377R4663O6607o3027o3734
16672g187j8690N7929j9010l0946m2495L852Q712m5952J4616R214j7005K742K6803
16659e7417M846j4036K2234J6467k8351k9041L6263j7153p866l1541J3763L0217
16647f1615P3569L0403j8168j38636r553Q8755O3137J2359j8426M812n620Q99
16635B1916r981k4721k4026L1696J6690k4765P2026L171k6571r1495M0162P564
$$ plain form
16722 -429 -16850 -46220 -84056 -126987 -115473 -115807 -119967 -101509 -62862 1710 -12408 -7239 3642
16709 3642 4723 41189 15484 -11693 5202 -15508 7777 21470 47484 25172 8329 6736
16697 6736 -40776 -76886 -118285 -40777 -72994 -88124 -63194 -6888 43004 49582 41225 131832
16685 131832 121297 102778 29840 -55608 -61975 -60495 -61035 -51073 -41696 52967 119574 56547 -7187
16672 -7187 -25877 32052 13042 -17904 -60399 -56547 -47835 -93787 -79171 -69957 -86962 -84220 -57417
16659 -57417 -52571 -66607 -44373 -27906 -56257 -85298 -49035 -66188 -74054 -105595 -91832 -61615
16647 -61615 11954 42357 24189 -114447 -124000 -35245 27892 40251 21825 26637 21017 21916
16635 21916 11935 -12786 -36812 -5116 11574 -13191 58835 62006 35435 -56060 -15898 -8334
16623h334l7520m1372K7610J319L8056Q069M443K6661N0504k1561n2075k7418
16611c1618M688k7012j1684K4810L2146L8878j9228l0822l6975Q759L980K5087
16599a8991J4063P69J0894q569J9665m905K3447m6076m0063M217L9045K8393O909
16586B8798J155q0097l3480k917L5949m012p365r138R362R559J6206J2977k3479
16573d6482L6311O2801J0716K4165k9082n5719K702N6303j273q1132n3617L2324
16561d1983N6590J3613m3436q8229l0896K3379J9852J0321L5407M8898L2495m4019
16549h008j5049O483k6335K2075L7958M3801Q65r350L432J5822l3440o3049r8820
16536a23615m376O9458K9957l5639O2793M1125k9060P0373L4646o4429k1651J9061
$$ plain form
16623 -8334 -45854 -87226 -59616 -58297 -20241 -12172 -7729 18932 69436 47875 -4200 -31618
16611 -31618 -26930 -53942 -65626 -40816 -8670 30208 10980 -19842 -56817 -48058 -44078 -18991
16599 -18991 -4928 -4159 6735 -1834 17831 12926 36373 -9703 -49766 -45549 -6504 21889 28798
16586 28798 29953 -50144 -83624 -86541 -50592 -54604 -61969 -71107 -61745 -52186 -35980 -23003 -46482
16573 -46482 -10171 52630 63346 87511 58429 2710 5412 61715 60442 -20690 -74307 -41983
16561 -41983 14607 28220 -15216 -103445 -134341 -110962 -91110 -80789 -45382 3516 36011 -8008
16549 -8008 -23057 -16574 -42909 -20834 17124 60925 61790 52440 55872 71694 38254 -24795 -123615
16536 -123615 -127991 -58533 -28576 -64215 -1422 39703 10643 81016 115662 51233 29582 48643
16524D8643k1321j8195k5376L0878j7966l9591R041p2316J3794K7043r309O57
16512g4018N7112L8777N20L2687J5928j4514k9160m6146n9727k8274P4349J2205
16500b0261m8427L150K9074N6345q841N66m2j1371k8968l7628J8245K8718r438
16487b8878R972J4636J1354J3848n3507l1134q7555R552M302r600K4509K2529
16475i9972N5217M7550l1000k3297j5544l2938J9089M2591p381k8163l9882m4143
16463a57873J6164K9665M8033o305L7794J4191n4502Q133O8597J3320M0411K282
16451E9910l5050p3763l0563N1757M5908n6463K0115P5455N012k2698q5049J9586
16439b5843N2498K6045m5801q0854k5356M1472M6159K9987K428l4959k6549J8743
$$ plain form
16524 48643 27322 9127 -16249 14629 -3337 -42928 -33887 -106203 -92409 -65366 -74675 -74018
16512 -74018 -16906 21871 22391 55078 71006 56492 27332 -18814 -78541 -106815 -32466 -20261
16500 -20261 -68688 -65538 -36464 19881 11040 11606 11564 193 -28775 -66403 -48158 -19440 -28878
16487 -28878 -18906 -4270 7084 20932 -32575 -63709 -151264 -141712 -137410 -147010 -122501 -99972
16475 -99972 -44755 2795 -28205 -51502 -67046 -99984 -80895 -38304 -45685 -73848 -113730 -157873
16463 -157873 -141709 -112044 -64011 -70316 -32522 -18331 -72833 -64700 3897 17217 57628 59910
16451 59910 24860 -48903 -79466 -27709 18199 -38264 -18149 57306 62318 39620 -45429 -25843
16439 -25843 26655 52700 6899 -73955 -99311 -57839 -11680 18307 20735 -14224 -40773 -22030
16427b2030L3107K7396R413p5316K2699N0163j951L41o1265k9690l9903p569P7672
16414a6933L5987m4604K9522L2137n8204j9609l0794k720J7407R3714L0040m6019
16402A9924m3578K2586j3305k8352M1758Mn3598l383k7670o1169K956M3964m789
16389a04652l1143M4285O7436J4247l5541j5787J92Q788n579L9277o33j7889K7403
16376i596N0828l3025l7482k8747K3070j729q999O8682m8506r018O0228r3248
16364f7542j7112Q470J689j608k265j8893P1710K9253j459l6022O977j3156o3573
16351a03531l8290K6585l2586j1883N3066M0093K9763n976l3922j465n581O108
16339g7619n9520J8679R1867K5555M545n3041K8791P114KK9357j6466N600p2084
$$ plain form
16427 -22030 11077 38473 47886 -27430 -4731 45432 43481 43822 -17443 -47133 -87036 -94605 -16933
16414 -16933 19054 -25550 3972 36109 -22095 -41704 -72498 -75218 -57811 35903 65943 19924
16402 19924 -23654 -1068 -14373 -42725 -967 -963 -54561 -57944 -85614 -146783 -143827 -99863 -104652
16389 -104652 -135795 -91510 -24074 -9827 -45368 -61155 -60963 -52175 -57754 -18477 -19110 -36999 -9596
16376 -9596 41232 8207 -29275 -58022 -34952 -36681 -45680 23002 -25504 -34522 25706 -67542
16364 -67542 -84654 -76184 -74495 -76103 -78368 -97261 -25551 3702 2243 -33779 -26802 -39958 -103531
16351 -103531 -141821 -115236 -147822 -159705 -106639 -66546 -36783 -42759 -76681 -78146 -83727 -77619
16339 -77619 -137139 -118460 -26593 -1038 3507 -49534 -20743 -13629 -13627 15730 -736 4864 -67220
16326f7220N4748L7331n7082m57N4948k9938M021L4318m2910k6635n269J3353
16314c0792k9100K618N9372l199p124J7037N3351J6916j19734j9387M9403K6691
16302A6052J7816k1679N989M6193m3080K987K3965n4038p379q843M845J3158K8009
16289B3995R80J05266n952o6687L8793m3609o2057j6588n4869L1101O5138J9850
16277C5361j4289j3735J8207j4587k0133l646N3928K6895o5362k0889j3316J511
16265c0055k4019J6524J3034p353k5538L2076P893L7597p063m6994K817k7325
16253e8406K1246l6126k865K3238L067l1844p241J4713J5848J3308l7288k3473
16241a05823J02480K7649p59K5080l7727n0332L2556q5447o5187K8469O7922L7694
$$ plain form
16326 -67220 -12472 24859 -32223 -32680 22268 -7670 -3649 30669 -12241 -38876 -44145 -30792
16314 -30792 -59892 -57274 2098 -1101 -8225 8812 62163 79079 -40655 -60042 -10639 16052
16302 16052 33868 12189 18178 64371 21291 24278 48243 -5795 -13174 -22017 -17172 -4014 23995
16289 23995 24975 130241 124289 57602 96395 52786 -9271 -25859 -80728 -49627 15511 35361
16277 35361 21072 7337 25544 10957 -9176 -12822 41106 68001 2639 -18250 -31566 -30055
16265 -30055 -54074 -37550 -24516 -31869 -57407 -25331 -17438 20159 13096 -33898 -31081 -58406
16253 -58406 -37160 -73286 -76151 -52913 -49846 -81690 -88931 -74218 -58370 -45062 -82350 -105823
16241 -105823 -3343 24306 23547 48627 10900 -39432 -6876 -92323 -157510 -129041 -61119 -23425
16229b3425L3794o5961o1942K2054N8148j5290k499P9899m5221r3245J5548P6078
16217b2062J8880q2487R744M2246k1571j4859K7854N317N5548J7375k5829n1363
16205d1207l8638o396j0470O3002K2577K4865k5238k6386j9819o2049k3748M2385
16193a01122N8382L5133J1997k6409K6461M1042n0020n0096J7565O5657j4900
16182A3690k9221L6666N339N816l3814m4504L6419l5638o7249K8383K685l8893
16170a20321L1286K2770K2577j5607k9943Q257o0653J8987K5731Q3441K067K8979
16158A7571L4469o184j3822k6752k6773P28M7019K8148J3717m3777k7665M7036
16146D3715l0205l5766l0941j7908M39J7553l160L8621J0518j4349l0596K6408
$$ plain form
16229 -23425 10369 -55592 -117534 -95480 -37332 -52622 -55121 24778 -20443 -113688 -98140 -22062
16217 -22062 -3182 -85669 -75925 -33679 -55250 -70109 -42255 -36938 18610 35985 10156 -41207
16205 -41207 -79845 -86241 -96711 -33709 -11132 13733 -11505 -37891 -57710 -119759 -143507 -101122
16193 -101122 -42740 -7607 4390 -22019 4442 45484 -4536 -54632 -37067 28590 13690
16182 13690 -15531 21135 26474 32290 -1524 -46028 -9609 -45247 -112496 -84113 -81428 -120321
16170 -120321 -89035 -66265 -43688 -59295 -89238 -80981 -141634 -122647 -96916 -13475 -11408 17571
16158 17571 52040 45856 32034 5282 -21491 -20763 26256 54404 68121 24344 -3321 43715
16146 43715 13510 -22256 -53197 -71105 -70666 -53113 -56273 -17652 -7134 -21483 -52079 -25671
16134b5671K5470J4111M531l7747m1667j4257O5395j0232m9477m995n9780K6399
16122a07920M0426K6231k3970q0010J0682K4627N744J4054R1951j6099J1518J2966
16110A0200j4304m0685K7278l6229n4954L9313M7348j7358K1329K9701l1988m8208
16098f8557J0833L2346j2799R091j8325n6290m0444M2173N7454J3626N4609J5197
16086C8914N531M077K2953o201k6882K6831J2482j5133q6426q5068K7523P2176
16074i223m3047j3108L8719J2041P548L3J5138M848K6658J8152k3755k0278K2219
16061C5945l4074q1451l1635N7583j1385J5418L1221j7063k2546L6465J7762n007
16049h767q909l3162O8090L3500m5771m3198j4149P9486K9813j0888J757n6764
$$ plain form
16134 -25671 -201 13910 18441 -19306 -60973 -75230 -9835 -20067 -69544 -74539 -134319 -107920
16122 -107920 -67494 -41263 -65233 -145243 -134561 -109934 -104190 -90136 1815 -14284 -2766 10200
16110 10200 -4104 -44789 -17511 -53740 -108694 -69381 -22033 -39391 -18062 11639 -20349 -68557
16098 -68557 -57724 -25378 -38177 -29086 -47411 -103701 -144145 -101972 -44518 -30892 23717 38914
16086 38914 44445 48522 71475 65274 38392 65223 77705 62572 -23854 -108922 -81399 -9223
16074 -9223 -52270 -65378 -26659 -14618 -7070 -7037 8101 12949 39607 57759 34004 13726 35945
16061 35945 1871 -79580 -111215 -53632 -65017 -49599 -18378 -35441 -57987 -21522 -3760 -8767
16049 -8767 -17676 -50838 17252 50752 4981 -38217 -52366 27120 56933 46045 47802 -8962
16037h962n4457k9628L650o2k275J0477J9015J56M816J4043O8647K6196j6258
16024C5358k4606k3991J840M801N2628J9805N744n323J7522n1691l2368r17M5761
16011D4563J8422k7700n2074m1568m4344n436J0835L7927r959N886L3383n1756
15999h1821M948O6765M2117M0562K591N929m2578o1127o4153O154k3005l6711
15987a40329J5919n001O3930O4075j45J4163j1137O458r100k9377n6208P1694
15975a5058N1994l7659q237P714l8085l0226j5873K6460L0356J9763K1099M9858
15963F2106p0686p4833l3873L7778Q4912K9805j6563r417K122k1958n4350l1282
15951i6239l4428L1982M101K6559K1562L214M7129P0238l095j7175K6379l8221
$$ plain form
16037 -8962 -63419 -93047 -89397 -89459 -91734 -81257 -62242 -62086 -57270 -43227 25420 51616 35358
16024 35358 10752 -13239 -11399 -6598 46030 65835 71579 66256 83778 32087 -281 -1198 44563
16011 44563 62985 35285 -16789 -58357 -102701 -108137 -97302 -59375 -69334 -63448 -30065 -81821
15999 -81821 -76873 -10108 32009 72571 75162 81091 38513 -22614 -86767 -80613 -103618 -140329
15987 -140329 -124410 -129411 -65481 -1406 -1551 12612 1475 7933 -1167 -30544 -86752 -15058
15975 -15058 36936 -723 -8960 -1246 -39331 -69557 -85430 -58970 -28614 -8851 12248 62106
15963 62106 -8580 -83413 -117286 -79508 5404 35209 18646 9229 11351 -10607 -64957 -96239
15951 -96239 -130667 -98685 -94584 -68025 -46463 -43249 3880 74118 71023 53848 80227 42006
15939D2006n3739j5692J5756l636k624J6981N5559J4629p0800l3020k4291M5148
15927a3723L6761K2864l4303L3623O4665p504l7318l8102j5891r594j5550j2351
15915b6423m5142M8721q052l0236M1148M633m8797j4330j9778P1111O5419k2217
15903A6057J0738K5505n1102l2895r484N546J3120q002J7232r361J5475l1648
15891c8819j9465P7157K1698m3710k7519j9270M6661L8189n4338n835O8518k5224
15879A8043n6089R337m4837l9618O9910L8583J670L187J3079j6938k1425o723
15867c1821k287j2736P171M4321j9633j4140j222l9746o3450M2680L7808k0249
15855g3304R759n1595N3165n46K3241L1212n0644j1678J1606L706Q691j4812n0530
$$ plain form
15939 42006 -11733 -27425 -11669 -15305 -17929 -948 54611 69240 -1560 -34580 -58871 -13723
15927 -13723 23038 45902 11599 45222 109887 102383 65065 26963 11072 1478 -14072 -26423
15915 -26423 -71565 -22844 -30896 -61132 -19984 -15351 -64148 -78478 -98256 -27145 38274 16057
15903 16057 26795 52300 1198 -31697 -41181 -35635 -22515 -30517 -13285 -22646 -7171 -38819
15891 -38819 -58284 18873 40571 -3139 -30658 -49928 -3267 34922 -19416 -25251 43267 18043
15879 18043 -38046 -28709 -73546 -113164 -43254 -4671 -3001 186 13265 -3673 -25098 -31821
15867 -31821 -34108 -46844 -39673 4648 -14985 -29125 -30347 -70093 -133543 -90863 -53055 -73304
15855 -73304 -63545 -115140 -61975 -62521 -39280 -8068 -58712 -70390 -58784 -55078 -46387 -61199 -111729
15842a11729L3663J1433m8001O191L6569j7118J1810O4487L8579m0294l8722j2137
15830f5269K1223M8846M4460M8742o0965m0215o880l4984l1465L9401L5644l1950
15818c3412k5354Q757M3282L0403K94K077k4679J4761P006j7424k2549j1799j4669
15805d3306m6486m1970K4251N1781l4029j3267L3098J4920K3646j0279k8523j6281
15793h6445J6866J5106N3322m3540k0946N9704P6130n291j27951l2375q293J1891
15781i1822L9214j2506L1373N5717K6428J2633k4314N990k7039L2094J3565l4569
15769B6764p4803J0576K5324J3211l7243n726J5029K4711p8180k513M2035o9304
15757a10119o533M5246O6472P6124N1345N0908m7970n5977p593O366j9836l3301
$$ plain form
15842 -111729 -78066 -66633 -114634 -108443 -71874 -88992 -77182 -12695 25884 -14410 -53132 -65269
15830 -65269 -44046 4800 49260 98002 37037 -3178 -10058 -45042 -76507 -37106 -1462 -33412
15818 -33412 -58766 -50009 -6727 23676 23970 26047 1368 16129 23135 5711 -16838 -28637 -43306
15805 -43306 -89792 -131762 -107511 -55730 -89759 -103026 -69928 -55008 -31362 -41641 -70164 -86445
15793 -86445 -69579 -54473 -1151 -44691 -65637 -5933 70197 64906 -63045 -95420 -103713 -91822
15781 -91822 -52608 -65114 -33741 21976 48404 61037 36723 42713 15674 47768 61333 26764
15769 26764 -48039 -37463 -12139 1072 -36171 -41897 -26868 -2157 -80337 -82850 -40815 -110119
15757 -110119 -116652 -71406 -4934 71190 122535 173443 125473 69496 61903 68269 48433 15132
15745A5132P045j0203o5878m3074J1078N6052J8100n1754K7450j3212k7302O4586
15733a1980M5618K6391J2043l0631J517N7853l3685o4515J6517J0549j5944P0634
15721H4367O745m3019o4505O1180m733q225p7311r033K7486M0923o2431M0212
15709h344r834q131O767P030k9482l3227N605O9664N6684J4017q1135j23770K7476
15696a06680Q5453L4352j5983m5479l4063J5685J7216Q973L2932K7817k3757m0301
15684d3835K6998O6613P207o638M126l6387q4154o507P1821J3756M8011J240K0962
15671H3213p4189p2459O2170N8643m1157n1081k0222J0029m7679L5760P6355K144
15659B1527o9616j9292K8307P2828K9788K6781O8n8774j5063j0798M624r926j3132
$$ plain form
15745 15132 22177 11974 -53904 -96978 -85900 -29848 -11748 -63502 -36052 -49264 -76566 -11980
15733 -11980 33638 60029 72072 41441 42958 100811 67126 2611 19128 29677 13733 84367
15721 84367 91112 48093 -16412 44768 40035 31810 -45501 -54534 -27048 13875 -48556 -8344
15709 -8344 -18178 -26309 -19542 -12512 -41994 -75221 -69616 48 56732 70749 -10386 -134156 -106680
15696 -106680 -21227 13125 -2858 -48337 -82400 -66715 -49499 -40526 -7594 20223 -3534 -43835
15684 -43835 -16837 49776 56983 50345 54471 18084 -66070 -72577 -756 13000 61011 62251 83213
15671 83213 9024 -63435 -1265 57378 16221 -34860 -55082 -45053 -92732 -56972 19383 21527
15659 21527 -48089 -67381 -39074 33754 63542 90323 90391 31617 16554 5756 10380 454 -12678
15646a2678j2836k566M852o6041j1095K0884N8166m9550J8580M2299l2304o198
15634d8487N1488l1179o2515l3634P6429J8030K6818M4674J7860J2041O228l1563
15622D6190m0251j5994M0792N2142j1115j1803n500J2517k0779k3069J0294k910
15610C0514K8814K5045J8080m1724n3116M1506N222N4729K0162o8283n2648M3111
15598E1412P151M9413L3121j0707m1647n0908RQ144m7555Q6465q704k8546oQ207
15584E5849l6124j259M1370k2648j7999l5717J2197O497k5279N8618m380K5972
15572E7097N2088k7714o2368l179j6261J0325L206J286j9109l0679J2372l284
15560b6220O1722N5337j9555l1159J8973M486k4616m6645n8104M7389R1760J2557
$$ plain form
15646 -12678 -25514 -28080 -23228 -89269 -100364 -79480 -21314 -70864 -52284 -9985 -42289 -48487
15634 -48487 3001 -28178 -90693 -124327 -47898 -29868 -3050 41624 59484 71525 77753 46190
15622 46190 5939 -10055 30737 82879 71764 59961 54461 66978 46199 23130 33424 30514
15610 30514 59328 84373 102453 60729 7613 49119 54341 109070 129232 60949 8301 51412
15598 51412 58563 107976 141097 130390 88743 37835 37844 45988 -1567 84898 76194 47648 47642 55849
15584 55849 19725 18466 59836 37188 19189 -16528 -4331 2166 -23113 35505 31125 57097
15572 57097 109185 81471 19103 15924 -337 9988 13194 14480 -4629 -35308 -22936 -26220
15560 -26220 35502 90839 71284 40125 59098 63584 38968 -7677 -65781 -18392 73368 85925
15548H5925p5928n3047L3841K1036o7885n5769J9855L4934O899j2712m3525P57
15536a05619K1687j6381M4480N4612k5543O77P6899n05P541m265k4973m6955J9160
15523H15j5134o1248K730L5519K5444j9194k408o2218k7319M4744P7761J5553
15511A5045O8537L4105n0878j4109j1639o4699N485J04324j2881m5892J1525j3188
15499B5735k0604r697k3658K821j6835k938k2443n812P5326N762m3555j3546L3999
15486a5445k2904k5386j1189m3345j5038M7915J15480L4384m7217m2587P760k5765
15474d3337R80l3656L3134P1725L5068M720l4729p3643k0799k7282L6393K7407
15462b4019R809K2503R61j3744P47J1325j5928J2369l4418q87N2512O0433J8079
$$ plain form
15548 85925 9997 -43050 -9209 11827 -56058 -111827 -91972 -57038 -50139 -62851 -106376 -105619
15536 -105619 -83932 -100313 -55833 -1221 -26764 -26087 50812 50307 57848 53583 28610 -18345 815
15523 815 -14319 -75567 -72837 -37318 -11874 -31068 -33476 -95694 -123013 -78269 -508 15045
15511 15045 83582 117687 66809 52700 41061 -23638 -18153 86171 73290 27398 38923 25735
15499 25735 5131 -4566 -28224 -25403 -42238 -45176 -67619 -73431 1895 7657 -35898 -49444 -15445
15486 -15445 -38349 -63735 -74924 -118269 -133307 -85392 30088 64472 17255 -25332 -17572 -43337
15474 -43337 -42357 -76013 -42879 28846 63914 68634 33905 -39738 -60537 -87819 -51426 -24019
15462 -24019 -14210 8293 9254 -4490 -3743 7582 -8346 4023 -30395 -31282 21230 81663 99742
15449I9742o2954n0825p0096j7954N1509N9576j8995m0414L6323Q609J5166k720
15437F967j2444q70j8910K3810k0420j0530P431l3114m1953N2618L3444J0972
15425b999j2888j9986p378J6476p933J1634R711o6793n9785L4084L5672P4638
15413D453N7331m5427J6569N2776K6063n8697o7745N0034k9691k2214M1949k6787
15401a386K5341j8959k9553N6857J4919m271J2002L6849o9552L4189M9892r327
15389I7001Q301m0885q417J6732J7114p5953m2054L4065K411O405R230J1848L5212
15376G1010K850l2171k7603K9203k8360m9578J1423Q3385j8533n6661j2269j0664
15364c7968k8561p541q108J231M8516r50J1589J6353L4972j2916M946l2606L1582
$$ plain form
15449 99742 36788 -14037 -84133 -102087 -50578 8998 -9997 -50411 -14088 -5479 9687 6967
15437 6967 -5477 -6347 -25257 -1447 -21867 -32397 -24966 -58080 -100033 -47415 -13971 -2999
15425 -2999 -15887 -35873 -43251 -26775 -34708 -23074 -13363 -80156 -139941 -105857 -70185 4453
15413 4453 61784 16357 32926 85702 111765 53068 -14677 35357 5666 -16548 25401 -1386
15401 -1386 23955 4996 -24557 32300 47219 42948 54950 91799 22247 56436 106328 97001
15389 97001 105302 64417 56000 72732 89846 13893 -28161 5904 8315 14720 23950 35798 71010
15376 71010 73860 41689 14086 43289 14929 -34649 -23226 60159 41626 -15035 -27304 -37968
15364 -37968 -66529 -74070 -82178 -80947 -32431 -33381 -21792 -5439 29533 16617 21563 -11043 20539
15351B0539J952J2450k9419q2715k2966J2764M4362J4943k1669J615M1678K3017
15339A6551k7563K7035L3190l1448j8434j1734J8915M6115l3266o7193p233R177
15327d5888O875p3418L2727O0661K712m9924m8284l7572j2613N8711K1456l2800
15315a17357M523L7201J2260J6757L4863L1754j5692l4337j2181M282J3395K9176
15303D644J2332J3586n160n8913k9167K1761L0688K2263o7248o7890O6110K4638
15291c2356J3215R230P173M0086k3525n7647o46l242l1565n191L713K3461J3011
15278d4283n9549l6848O0640L8803L0355M6030k0099m1847L0475k0302m6714j0903
15266g4242m1544Q327K4424j5079l4959J9589R1799R651j5577J7591j2923K2904
$$ plain form
15351 20539 22491 34941 5522 -77193 -100159 -87395 -43033 -28090 -49759 -48144 -6466 16551
15339 16551 -11012 16023 49213 17765 -669 -12403 6512 52627 19361 -47832 -55065 -45888
15327 -45888 -39013 -112431 -79704 -19043 -16331 -66255 -114539 -152111 -164724 -106013 -84557 -117357
15315 -117357 -112834 -75633 -63373 -46616 -11753 20001 4309 -30028 -42209 -37927 -24532 4644
15303 4644 16976 30562 25402 -33511 -62678 -40917 -10229 12034 -55214 -123104 -56994 -32356
15291 -32356 -19141 -9911 -2738 37348 13823 -43824 -44470 -47712 -79277 -84468 -80755 -57294 -44283
15278 -44283 -103832 -140680 -80040 -41237 -10882 35148 15049 -26798 3677 -16625 -63339 -74242
15266 -74242 -115786 -107459 -83035 -98114 -133073 -113484 -21685 -12034 -27611 -10020 -22943 -39
15254c9j8655l9801k1963l7750N821j3105q100J9330j1612n886L3744L1259k0821
15241h7578P5655M8320m549k261m680j3370m4497m2128J2776p823K3847N0956
15229D668N1682p936j5645K8901m1325l2407n31J1751M460k7674r387N1453K4143
15216D2153k8484j9625j9394n9913l7395R404P8991l528J7077J08920L4308l8966
15204H3548l0860p4304o2801N3825P9831l6068n6801l34j2514L7762O9253n5612
15192e075l5325M9359R1098J4964l4243l7720l3814l094O026N875k2819o386o940
15179a8094P832p0604L1374K4707q2584k1239O6791J1147P756J789l7564J1486
15167f7203L4483N2020N2696L9759o5960q2402m1046k5820M6732N5191o879L1274
$$ plain form
15254 -39 -18694 -58495 -80458 -118208 -112387 -125492 -133592 -114262 -125874 -131760 -98016 -66757 -87578
15241 -87578 -11923 36397 31848 29587 24907 11537 -32960 -75088 -62312 -70135 -46288 4668
15229 4668 56350 48414 32769 61670 20345 -12062 -12593 -842 3618 -24056 -33443 18010 42153
15216 42153 13669 -5956 -25350 -85263 -122658 -113254 -34263 -37791 -20714 88206 122514 83548
15204 83548 52688 -21616 -84417 -30592 49239 13171 -43630 -43964 -56478 -18716 50537 -5075
15192 -5075 -40400 8959 100057 115021 80778 43058 9244 6150 12176 18051 -4768 -11154 -18094
15179 -18094 -10262 -80866 -49492 -24785 -107369 -128608 -61817 -50670 -42914 -41125 -78689 -67203
15167 -67203 -32720 19300 71996 111755 45795 -36607 -77653 -103473 -56741 -1550 -8429 22845
15155B2845K7267j3086O366k1855m5236P485L032j4441k7232K0938N119M622M5848
15142B1672L452M508m719m3830J6449L3170k371p678J0891J6632L0843J1792k1975
15129F8836j2410p7682j0677J5070l3197m3711J3453J0990J8639k1488j9650L333
15117h8494K7226m5829j3503K6835N2379o83k8516N2904P6438K1104j6027m1233
15105B2601l0846k7315L1390J9413k1880L5492m6338o7976k3027K0452L1822O8970
15093A2758J2790L5494L3033k7472k7101m1142k9503o096J7319K0277O4669j3549
15081E1477n1020J8447J8221j6845N251J3954J9303q386o2433J425L2808N9806
15069H2008J1318j3616l716m5380l1420O104M8019j2120m2035k3250k2127M0606
$$ plain form
15155 22845 50112 37026 43392 21537 -23699 -16214 -13182 -27623 -54855 -33917 -28798 -24176 21672
15142 21672 25124 29632 24913 -18917 -2468 30702 28331 20653 31544 48176 79019 90811 68836
15129 68836 56426 -21256 -31933 -16863 -50060 -93771 -80318 -69328 -50689 -72177 -91827 -88494
15117 -88494 -61268 -107097 -120600 -93765 -41386 -42069 -70585 -17681 58757 79861 63834 22601
15105 22601 -8245 -35560 -4170 15243 -6637 28855 -17483 -85459 -108486 -88034 -56212 12758
15093 12758 25548 61042 94075 66603 39502 -1640 -31143 -37239 -19920 357 65026 51477
15081 51477 457 18904 37125 20280 25531 39485 58788 50402 -12031 -10606 22202 82008
15069 82008 93326 79710 75994 30614 -806 5298 53317 41197 -838 -24088 -46215 -5609
15057e609m6576k1029J10192j4501l1259L855j7600K4615J1343J603k3879n3058
15045f1903N4389Q1352n034J3147m7047Q901J0284l1590p4735l1109R2204L9199
15033D8058l9959l3489j6993o110L4065N194J6411K4135n770j2902N457l2977
15021a4880J5703R499l7367l2879l862L9084L9398L7635j0747m6103k053j9954
15009b6526p936k5720j801P0343P415m7659M939q556j419k2216L42O7168K4560
14996C2934r005N156K5912l4086P483J4168N7583l3645n2408O0823j933J0137
14984H3119R170p3086k5884M4966m498j3687J784j8363n1331j3885j8674L1612
14972d8757L1245K373j5999M9842N4728L0781o4611n2181L2879J7452j6098k3079
$$ plain form
15057 -5609 -52185 -73214 36978 22477 -8782 -4927 -22527 2088 13431 15034 -8845 -61903
15045 -61903 -7514 73838 68804 81951 34904 43805 54089 22499 -52236 -83345 8859 48058
15033 48058 8099 -25390 -42383 -48493 -14428 -9234 7177 31312 25542 12640 18097 -14880
15021 -14880 823 10322 -27045 -59924 -63786 -24702 14696 52331 41584 -4519 -6572 -26526
15009 -26526 -34462 -60182 -61983 8360 15775 -31884 -26945 -35501 -36920 -59136 -58794 8374 32934
14996 32934 23929 29085 54997 20911 28394 42562 100145 66500 14092 74915 72982 83119
14984 83119 92289 19203 -6681 38285 33787 20100 21884 3521 -47810 -61695 -80369 -48757
14972 -48757 -17512 -15139 -31138 18704 73432 104213 39602 -12579 20300 37752 21654 -1425
14960a425l0074j7661l2787K2045L8227N3611L2068k892k0692j2782j679n4885
14948b8926J8296M0135o4507j8412j95L5658L8148l6031j7900M0335K6941j2447
14936B1095j2687R665o288o845L9256j9967k4117K6240n942K3579k679k2175j1327
14923G808M1337l9690m4825m1375L5047M4445m3974j7914j1924P3725J0992N57
14911A4209j6232l2954L0273M5520q201R15P7974k0567o2789m8755l3586L8923
14899a5270K2924K8418L1638j1275m9321m623N333L5146K6346k2854l5791M6199
14887E6870K1160r4374p3482M6042k437J7066K0768R563m3406p174j8471j7639
14875h5514L9003P0905J1430J6474m9324j8838K9586L2878m6807k5104q176N1790
$$ plain form
14960 -1425 -31499 -49160 -81947 -59902 -21675 31936 64004 61112 40420 27638 25959 -28926
14948 -28926 -10630 29505 -35002 -53414 -53609 -17951 20197 -15834 -33734 6601 33542 21095
14936 21095 8408 18073 11785 4940 44196 24229 112 26352 20410 43989 41310 19135 7808
14923 7808 49145 9455 -35370 -76745 -41698 2747 -41227 -59141 -71065 2660 13652 14209
14911 14209 -2023 -34977 -4704 40816 32615 33530 111504 90937 28148 -20607 -54193 -15270
14899 -15270 7654 36072 67710 56435 7114 2491 7824 42970 69316 46462 10671 56870
14887 56870 78030 -16344 -89826 -43784 -46221 -29155 -8387 1176 -42230 -49404 -67875 -85514
14875 -85514 -46511 24394 35824 52298 2974 -15864 13722 46600 -207 -25311 -33487 18303
14863A8303O365j5871l5000m3402J009J8688o873J6630K9781k4730m4267J9386
14851e9981J5427L3133M0948L0469l871j5581m8853J1570L8779k2946j4181K7194
14839C2107n6348k5456K8673M2582r549K4756m3226K4909q166O5386r362k7491
14827C8815l7025Q736J29483m056k1573K0914n0629n7179l0809R897R785L6214
14815E2573L1710m5053r5175K9411M5196o8670m0288J8693N9140j1193L1270j1634
14803d020r187K3094p1964l3222P427k0746K7682N7777L6714p4072K2099j8801
14791e7219k7947M5782R564m06N9132Q4649l3120m9345q784l3198j4126p754Q2492
14778D9720r909m3332k7021k0212R711K3441J9365j1917R363l0961j4143K9903
$$ plain form
14863 18303 24668 8797 -26203 -69605 -68596 -49908 -56781 -40151 -10370 -35100 -79367 -59981
14851 -59981 -44554 -11421 29527 59996 56125 40544 -8309 3261 42040 19094 4913 32107
14839 32107 -24241 -49697 -21024 21558 12009 36765 -6461 18448 10282 75668 66306 38815
14827 38815 1790 10526 140009 135953 114380 135294 84665 27486 -3323 6574 16359 52573
14815 52573 84283 39230 -55945 -26534 18662 -50008 -90296 -71603 -12463 -23656 7614 -4020
14803 -4020 -13207 9887 -62077 -95299 -87872 -108618 -80936 -23159 13555 -60517 -38418 -57219
14791 -57219 -85166 -39384 -29820 -30226 28906 113555 80435 31090 22306 -10892 -25018 -32772 49720
14778 49720 39811 -3521 -30542 -50754 -41043 -17602 1763 -10154 -791 -31752 -45895 -15992
14766a5992k511O736l1975j5276K2310r914l2390K0329M4728k8569n3864L4880
14754f1508R8404N1790j4191m3449n2197l4495l7516O3693M7914J0870l7230N4485
14742D6570J9710q385n0194n2116k2380k4496M9498K4734j3110n1580o048N6190
14730c1607p01q4331j9664K6531M0002J14920O810n5693K0151R523J1580n421
14718C2100L0644m4915l2153J2096K4920Q9939j0501j02752m9506O2514M6669
14707E9055m0684l9930O2863k4338j5652k47N1529J0234l9790n39Q3l8177j5051
14694c0644M8105J2308l2102Q100N8468L3847J7807l8404n0512j4383k1217J2175
14682C548l0956p6577K8918O0397K4948n814k9233j4076J1729k2665k7168J140
$$ plain form
14766 -15992 -18503 -11767 -43742 -59018 -36708 -46622 -79012 -58683 -13955 -42524 -96388 -61508
14754 -61508 36896 88686 74495 31046 -21151 -55646 -93162 -29469 18445 29315 -7915 46570
14742 46570 66280 57895 7701 -44415 -66795 -91291 -41793 -17059 -30169 -81749 -87797 -31607
14730 -31607 -32308 -116639 -136303 -109772 -69770 45150 51960 -3733 16418 25941 37521 32100
14718 32100 62744 17829 -14324 -2228 22692 112631 102130 -622 -50128 12386 59055
14707 59055 18371 -21559 41304 16966 1314 1067 52596 62830 23040 22501 22584 -15593 -30644
14694 -30644 17461 29769 -2333 5767 64235 98082 115889 77485 26973 12590 -8627 3548
14682 3548 -27408 -103985 -75067 -14670 10278 4464 -24769 -38845 -27116 -49781 -76949 -75809
14670g5809L3688j4415J7310k4328K2738J8407j4046J6797K6105q9150o1186L2434
14658a11455L3270P5530L7019m4043n224Q4781L879j5644l663l3250K3878J9725
14646F4803o4051m3888j1675K3577L5447m5660J1529L7648j5331J8549j342L4186
14634D3792j0110p7090k2135N8664J2228K4842P6525l716n9386q0629l0828j9566
14622h7409Q8146O6516k4844P65l0568j9681n3897L1768J07519p0656p1465n1820
14610a15626R397N7584Q0m0863J2405J3563k0616K7370O1789M2162n4747j8891
14598b6393k53J234O6256K8702K3640j8167p2929L131k1383k5215M2380M20J6136
14585A7559L4863N493J78m7863l1860k7253q665P835l4671J4402K1167m2411K8554
$$ plain form
14670 -75809 -42121 -56536 -39226 -63554 -40816 -22409 -36455 -19658 6447 -82703 -143889 -111455
14658 -111455 -78185 -2655 34364 -9679 -14903 69878 73757 58113 54450 21200 45078 64803
14646 64803 752 -43136 -54811 -31234 4213 -41447 -29918 7730 -7601 10948 9606 43792
14634 43792 33682 -43408 -65543 -6879 5349 30191 106716 103000 43614 -37015 -67843 -87409
14622 -87409 737 67253 42409 43174 12606 -7075 -60972 -29204 78315 7659 -63806 -115626
14610 -115626 -106229 -48645 -48565 -89428 -77023 -63460 -84076 -56706 5083 47245 -7502 -26393
14598 -26393 -26646 -25412 40844 69546 93186 75019 2090 5221 -16162 -41377 1003 1423 17559
14585 17559 52422 57915 58093 10230 -21630 -48883 -57548 -49713 -84384 -69982 -48815 -91226 -62672
14572f2672Q1098J7874j5220K756k0561l3277j011l7312j5100K5763n9677j8004
14560a35343M1377m094J4291K4340M3825J1429r580O604L8156J763r243M010R211
14547C6746K0810k6379n6274J6806r828j574K7059J646j809K5229J0695j5844
14535B7283j9511M1189O5989L0204O27K4637o3795o7490o156l1318o3289j2892
14523g4522j2150j54j253O6156K2747l8507j5598J5420L2601L1527p653p95j6980
14510H39j8059J7878N8174O372l7644L4407M0081r3466m3293o13J9642k0756q423
14497d4861P7875j5348j6575q999k557j1510L1371M0533q546J826Q408j569m61
14484D9587j7595j583M1878j3258l1131l3950l5474o8739r405J4849j5296J4068
$$ plain form
14572 -62672 18426 36300 21080 23836 3275 -30002 -31013 -68325 -83425 -57662 -117339 -135343
14560 -135343 -93966 -98060 -83769 -59429 -15604 -4175 -13755 -7151 31005 32768 23525 27535 36746
14547 36746 57556 31177 -25097 -8291 -18119 -19693 7366 9012 7203 32432 43127 27283
14535 27283 7772 48961 114950 145154 145781 170418 106623 39133 32977 1659 -61630 -74522
14523 -74522 -86672 -86826 -88079 -21923 824 -37683 -53281 -37861 -5260 26267 18614 17819 839
14510 839 -17220 658 58832 65204 27560 61967 102048 8582 -34711 -35324 -15682 -36438 -44861
14497 -44861 33014 17666 1091 -7908 -10465 -21975 9396 49929 41383 43209 51617 50048 49587
14484 49587 31992 30409 72287 59029 27898 -6052 -41526 -110265 -119670 -104821 -120117 -106049
14472a06049M2114L961M122P8121N7593o3717m513L02K222m336m3273l1476P2624
14459G695M2331p192J1833L5415k8738o4392q5293P893O5053K4837J5264j0706
14447A4000k1138l2048J982L8449M8435l8442m007k0572P651L9028K0957L3761
14435H8056P461j8819m680m1116n5823P208N0585l3753O0077M4962n9450o338
14423C8370j9627P338L5840j7981j1285M6653M1605J0085q0057n6097o388p477
14411a9021M633N980l2324j73L4789Q685n042M7033J01916M4480l6305n8901p1203
14398B4547q7199J3578P383K2866l518M687l9139P584K0083J2580j4725M2776
14386A1503L8065m4210j2984m53J1328o302m3628N0799N3569l2782j4618j7047
$$ plain form
14472 -106049 -63935 -59974 -55852 22269 79862 16145 11632 11934 14156 9820 -33453 -64929 7695
14459 7695 50026 42834 54667 90082 61344 -3048 -88341 -80448 -15395 9442 24706 14000
14447 14000 -7138 -39186 -37204 1245 49680 11238 7231 -13341 -5690 33338 54295 88056
14435 88056 95517 76698 72018 30902 -24921 -17713 32872 -881 59196 104158 44708 38370
14423 38370 18743 26081 61921 43940 32655 79308 120913 130998 50941 -5156 -11544 -19021
14411 -19021 -14388 -8408 -40732 -40905 -6116 2569 -2473 44560 146476 190956 154651 95750 24547
14398 24547 -62652 -49074 -41691 -18825 -22343 -17656 -56795 -49211 -29128 -16548 -31273 11503
14386 11503 49568 5358 -7626 -8079 3249 -3053 -46681 4118 57687 24905 10287 -6760
14374f760J9184j740l0371k5023j1615J0264l0804n603j6661L951J10549j8515
14362c144q939K1370N0854N1281L1700l5909l4361M0575q851p435n3098j21366
14350g7323Q156L2656k8470K1735L2483N7695o372r211j3530L703l2159k2655
14338c3292Q048K9744j518l4883o2311m7938K8771L03M221K7825r608J6232L5710
14325c8696O2607M8392K7478l048k4505L029j849k5136n9622n2290K2679K9660
14313a1301m1013O56K5633M4035l585k5585M5862P8861j7591l3047o4616m8756
14301e0447q21L1623N7783m7550n6666L1990m4831l9504O3681L2900j3998L6040
14289B00l1810l1345m9516l6959Q448K2190M1172l804j8307K1228N3161L5515
$$ plain form
14374 -6760 12424 10684 -19687 -44710 -56325 -46061 -76865 -82468 -99129 -95178 15371 -3144
14362 -3144 -12083 9287 60141 111422 143122 107213 72852 113427 104576 97141 44043 -77323
14350 -77323 -69167 -36511 -64981 -43246 -10763 46932 40560 31349 17819 21522 -10637 -33292
14338 -33292 -25244 4500 2982 -31901 -94212 -142150 -113379 -113076 -108855 -81030 -90638 -74406 -38696
14325 -38696 23911 72303 99781 96733 72228 75257 73408 48272 -11350 -63640 -40961 -11301
14313 -11301 -52314 -51658 -26025 18010 14425 -11160 34702 113563 95972 62925 -1691 -50447
14301 -50447 -51268 -19645 38138 -9412 -66078 -34088 -78919 -118423 -54742 -21842 -35840 200
14289 200 -31610 -62955 -112471 -149430 -140982 -118792 -77620 -81424 -99731 -78503 -25342 10173
14277A0173n7107j8334M4999l113K7139m058j4802j5283k6547J9717K2631k3089
14265c7674m254J1379K4928m7686K8550l6574K2303O820Q822j3184O272K4515
14253e783K8254m9512q268M074l047p3019J0025O2179M2l0464j2917M0188O1495
14240B3247N664j9753k7878L7630n035L444j1790l8021m6112k8375L0019M4841
14228c2119J6493K7927n4082o84O1087J7835j9705p1056J8249o687j0749M2451
14216a1040P900K3518K7671P751k1327J464k0885k420k0363j6107k7344M8967
14204b215M2274m551l0187j9652L4638l2852p213M6512M3894J2462K5182K1445
14192A29737k581p1387o3327l4915k1065L0479L7758L0381K6724K2561k1878j9655
$$ plain form
14277 10173 -46934 -65268 -20269 -23382 3757 -301 -15103 -30386 -56933 -37216 -14585 -37674
14265 -37674 -41928 -30549 -5621 -53307 -24757 -61331 -39028 -32208 -23386 -36570 -30298 -5783
14253 -5783 22471 -27041 -35309 -31235 -34282 -107301 -97276 -35097 -35055 -65519 -78436 -38248 23247
14240 23247 28911 9158 -18720 18910 13875 17319 5529 -32492 -78604 -106979 -76960 -32119
14228 -32119 -15626 12301 -41781 -42465 18622 36457 16752 -54304 -36055 -42742 -53491 -11040
14216 -11040 -3140 20378 48049 55800 34473 35937 15052 12632 -7731 -23838 -51182 -2215
14204 -2215 40059 35508 5321 -14331 20307 -12545 -19758 26754 70648 83110 108292 129737
14192 129737 127156 55769 -7558 -42473 -63538 -33059 4699 35080 61804 84365 62487 42832
14180D2832n0134j339l428k2879n4091K9555L0984r782O8997J9299k5133K7344
14168E2225l5786l8740l513m4717l4703o723N3455K1477o338O076m5127L5572
14156d6842K0734J0771M2020O057l8815L0895P046l0596N813N779n0104j4842
14144e2084k3791J6303L4885J4137K6475o978K1772J5647p3981j8445L6890P1673
14132F2503l5782p3478Q151M5058J9790q513l9984m0986j3604K9851J7844J2375
14120a6775j0833N5297N0375j3743m9727q4761N9694N5062K2126q982l7514l447
14108A6772N9465L7818J998l4763p3202m8957j1877K9404N4644j4620m48J9181
14096C5415K3463j9915K7044K3990K0590o7921n8657o0k80J4386K9425m7022j8730
$$ plain form
14180 42832 -7302 -8641 -12069 -34948 -89039 -59484 -28500 -38282 30715 50014 24881 52225
14168 52225 16439 -22301 -25814 -70531 -105234 -111957 -58502 -37025 -43363 -37287 -82414 -46842
14156 -46842 -26108 -15337 26683 32740 -6075 24820 31866 1270 7083 12862 -37242 -52084
14144 -52084 -75875 -59572 -24687 -10550 15925 8947 30719 46366 -27615 -46060 -9170 62503
14132 62503 26721 -46757 -38606 6452 26242 17729 -22255 -63241 -76845 -46994 -29150 -16775
14120 -16775 -27608 27689 78064 64321 14594 -70167 -10473 44589 66715 57733 20219 16772
14108 16772 76237 114055 116053 81290 8088 -40869 -52746 -23342 31302 16682 16234 35415
14096 35415 58878 38963 66007 89997 110587 42666 -15991 -16051 -16331 -1945 27480 -19542 -38272
14083c8272M0960Q1120l2713o0188o5224N1010L9646J2875m1601J9574j2720o1064
14071f6597N0090J9860K9091M4697N0726p6621r7542P1459L0796J0530j4843P997
14059E9643j200j592k5832k8597K7815m1416q2622M7621L618R528k7309n2851
14047a13194O5825O1055p8591l8898L0718P4541M3121K5813k663l0962k0228L8609
14035E5146J6061j9204o2356k3449K2547L2920L4269M3563j5117m8050J4977L796
14023E5103l7407N7051k1316o093L7288j7164P700m363K973J0957l1308l8967
14011A4454k658k2656n2622j9467J1369M8467L6066m190k7648j2473q389K0402
13999a9345K1721J0092M9888M4036l9000n8922L960J3238n262L2225M1185k9983
$$ plain form
14083 -38272 2688 83808 51095 -9093 -74317 -23307 16339 29214 -12387 7187 -5533 -66597
14071 -66597 -16507 3353 32444 77141 127867 51246 -46296 25163 55959 66489 51646 59643
14059 59643 58443 56851 31019 2422 30237 -11179 -93801 -46180 -42562 -33034 -60343 -113194
14047 -113194 -47369 13686 -64905 -103803 -73085 1456 44577 70390 67727 36765 16537 55146
14035 55146 71207 52003 -10353 -33802 -11255 21665 55934 99497 84380 36330 51307 55103
14023 55103 17696 74747 53431 47338 84626 67462 75162 70799 73772 84729 53421 14454
14011 14454 11796 -10860 -63482 -82949 -71580 -23113 12953 8763 -18885 -31358 -39747 -19345
13999 -19345 2376 12468 62356 106392 67392 8470 12430 25668 20406 52631 93816 63833
13987F3833j0266m219J5603J1195L9478m0166k6513m1600O413M8713n5948m6653
13975d0130k051J8491j7902j748M7628J5161p6210k8984L601O3298m361n00l595
13962b7302L6913j9339K6603l9747O702M036K8718M9278K2521n1271o4779q9739
13950a17406O095L3977K445M2756K374J8448M5303M7592j1856o980m4576q5555
13938f7383l8411J8495L3612Q0842K7963m5692k0815L8897L1185k254k9253m8203
13926b1017M5974m195K3103o265J333J2150k9458l1860N3031k4755j217J179p149
13913A0854k9461L3847M0460L1003l385R840K9381J7104N45k2293m7247L0650
13901A01298m906k7476K2371p41K2308J238n2750l4778k9568L9652l7665r7738
$$ plain form
13987 63833 53567 49348 64951 76146 115624 75458 48945 7345 13758 62471 6523 -40130
13975 -40130 -42181 -23690 -41592 -43340 4288 19449 -56761 -85745 -82144 -18846 -23207 -23707 -27302
13962 -27302 9611 -9728 16875 -22872 -16170 -12134 16584 65862 88383 37112 -27667 -117406
13950 -117406 -111311 -77334 -74889 -32133 -29759 -11311 33992 81584 69728 62748 18172 -67383
13938 -67383 -105794 -87299 -53687 27155 55118 9426 -11389 27508 58693 56439 27186 -21017
13926 -21017 24957 20762 43865 37600 38933 51083 21625 -10235 42796 18041 16824 18003 10854
13913 10854 -18607 15240 55700 86703 83318 93158 122539 139643 140188 117895 70648 101298
13901 101298 96392 68916 91287 90546 112854 114092 61342 26564 -3004 36648 -1017 -98755
13889i8755r393K0413L4862L5488N241l0275o027N6225O5006k3497m1959j157
13877F172k9220o7203J1092K4087N0938N1811j4369l5356q386m697N7216J6738
13865E8823P819m303q8893m9189j0657M3371O2563K4269L5470k0200o2148k9974
13853c3049K3437K7913N2539P5517j5444n6389n8919J8754r579k4743K6106K6142
13841E2285n3310k3163j7800M4581K6086o7079l2177k410L4865K1193J3219M7262
13829D3552k7711J1383L1214J0674l0759l4486m8848K96J2223O14N4290l843l6682
13816a8083j8604J843O3842o2449j23263M1684M5121N1610Q9048J0164o8922m4098
13804c2107j148L5729q70n582P4433j4565q0241m2395m54L8016O2679J8487l3067
$$ plain form
13889 -98755 -108148 -87735 -52873 -17385 -12144 -42419 -48446 7779 72785 49288 7329 6172
13877 6172 -23048 -90251 -79159 -55072 -4134 47677 33308 -2048 -10434 -15131 42085 58823
13865 58823 66642 62339 -26554 -75743 -86400 -43029 19534 43803 79273 59073 -3075 -33049
13853 -33049 -9612 18301 70840 146357 130913 74524 15605 34359 24780 37 26143 52285
13841 52285 -1025 -24188 -41988 2593 28679 -38400 -70577 -72987 -38122 -16929 -3710 43552
13829 43552 15841 27224 58438 69112 38353 3867 -44981 -44685 -32462 -31848 22442 18599 -18083
13816 -18083 -36687 -34844 28998 -33451 -156714 -115030 -69909 -18299 70749 80913 11991 -32107
13804 -32107 -33255 2474 1604 -3978 70455 55890 -24351 -66746 -67200 -29184 33495 51982 18915
13791A8915K3207M0173l262l7282n1957k7966o685O0355P7702o156j0988p6236
13779a80k275p427M9657M9097M8457j1551k2811j1036j128J5711o8188m7335l130
13766a2139J0753l2990L2004r561J318J0239M9689K2005K4391m4223l739n9529
13754a1782q6153j2678M7624J6771L0865M6438O5406J4877n915k8625j9509k0912
13742C6407K6531L4021l7296k8743R710o3442K5864L8q776J2677Q2535J4783o2860
13729D1449Q144k1994L2010m2412O202p404n623K7042j5936j8712J3403K3865
13717D0034L7453L0033J7622k947j3448p6695J1469L3081k9224r6936k8242M1146
13705c6654Q0072O5857L4920J1363J0118k3774n9734j6108k102m6184k2985j8043
$$ plain form
13791 18915 42122 82295 79033 41751 -10206 -38172 -44857 15498 93200 87044 76056 -180
13779 -180 -2455 -9882 39775 88872 137329 125778 102967 91931 90803 106514 38326 -9009 -12139
13766 -12139 -1386 -34376 -2372 -11933 -10615 -376 49313 71318 95709 51486 47747 -11782
13754 -11782 -97935 -110613 -62989 -46218 -15353 31085 96491 111368 105453 76828 57319 36407
13742 36407 62938 96959 59663 30920 40630 -22812 3052 3090 -5686 6991 89526 104309 41449
13729 41449 49593 27599 59609 17197 23399 15995 10372 37414 21478 2766 16169 40034
13717 40034 77487 107520 125142 122195 108747 32052 43521 76602 47378 -49558 -77800 -36654
13705 -36654 43418 109275 144195 155558 165676 141902 82168 66060 63958 17774 -5211 -23254
13693b3254M941L778m581k7833N7873M0760P720k9094m4577L8522p840n984M2870
13680E3301j1212p4421j5959K9743M645R637k0234J1689K5745j445L1480l7477
13668E492Q756k0883N0672n787k9776N1097N1530j6396p7519l4099J4367J4608
13656A2062K6787M980n8049J2325O3976p558L7365j2256j0188M9315q0099r1936
13644e3276j6532M3446j351J9846K0797j5471L088l8961J5334P8598J1799q8728
13632b1411l0063N3683L0229J7577m0338m5006J5799J5198J3184n427j699Q5095
13620H6821M1466k3999l0907n9644L9918Q9406P780k3572p1416O395M7262L7949
13608A47459l6150Q607O6262L3513k8621n0582l8519m0085J8094L9211O020j8681
$$ plain form
13693 -23254 -18313 -14535 -19116 -46949 10924 51684 59404 30310 -14267 24255 16415 10431 53301
13680 53301 42089 -32332 -48291 -18548 -13903 -4266 -24500 -12811 12934 11489 42969 5492
13668 5492 14248 -6635 44037 38250 8474 59571 111101 94705 17186 -16913 -2546 12062
13656 12062 38849 43829 -14220 -1895 62081 54523 91888 79632 69444 118759 38660 -53276
13644 -53276 -69808 -26362 -27713 -7867 12930 -2541 547 -38414 -23080 55518 67317 -21411
13632 -21411 -51474 2209 32438 50015 9677 -35329 -19530 -4332 8852 3425 1726 86821
13620 86821 128287 104288 73381 13737 53655 143061 150841 127269 55853 62248 109510 147459
13608 147459 111309 119916 186178 219691 191070 140488 101969 61884 79978 119189 125209 106528
13596A06528J4285K81O231j8076l137L6843M2105k8130n2293j4951k1932j0586
13584E7168m0870J7236K6091m1855k5206J7086k83L5321O0151r763o550n9797
13572B8729l5460j5044K428O6958j5919J0040J4609K0451n046L6710L8374K8114
13560A74944N142m6516k5185j7897M5044L127p669p209L4855j5717k370J930K0955
13547A63434o271l814N18N876J3304L2488k7524j3064R0896J33548J37957K16839
13535G44187K77718L82675M53933L95813O6289j53323l39511l76004l08496k32905
13525I10376j82310j41164j66576q7645r3299p6549N237M2499L8589j1513r796
13514B27849m8919M2116N035p0807p7548K519L8373N1450l9399m1407k4202k4320
$$ plain form
13596 106528 120813 121094 127325 109249 106112 142955 185060 156930 104637 89686 67754 57168
13584 57168 16298 33534 59625 17770 -7436 9650 9367 44688 104839 95076 88526 28729
13572 28729 -6731 -21775 -19347 47611 31692 41732 56341 76792 71746 108456 146830 174944
13560 174944 180086 133570 108385 90488 135532 138659 130990 123781 158636 142919 140549 142479 163434
13547 163434 157163 153349 153867 159743 173047 205535 178011 164947 255843 389391 527348 744187
13535 744187 1021905 1404580 1858513 2254326 2320615 2167292 1827781 1451777 1143281 910376
13525 910376 728066 586902 420326 332681 239382 162833 168070 210569 249158 237645 227849
13514 227849 178930 221046 226081 155274 77726 80245 118618 170068 130669 89262 65060 40740
13502D0740k3659K0597J1457k1030J4238K3527k288O562J7401j3052K2648l7842
13490E9299k1802m928K1016q257L6020K0956m1107k3010o801m9129k7608N205
13478d0146L4366J179J9059k3336m8112L3728J5885M4836J2041J2965k4378m7644
13466i557K5488N551M0808j6623o907k6626q9003n8744P8942N8112k5861J8612
13454e808J252M1211O3103j9431J2356N5191l1673k0981r266l1155n165k0620
13442B9014j575K6379L4586n1938K617K0271J2644k5406k8148r628L5910j6720
13430B8006R305p3697m713K6232J7869J8875K4609k5980J5932l6503j0100O9434
13418E9269J3864O464J2935J6753k8016j0057j330m4971L9389N5662k4950J253
$$ plain form
13502 40740 17081 37678 49135 28105 42343 65870 63582 70144 87545 74493 97141 59299
13490 59299 37497 32569 53585 45328 81348 102304 61197 38187 31386 -17743 -45351 -40146
13478 -40146 -5780 -4601 14458 -8878 -56990 -23262 -7377 37459 49500 62465 38087 -9557
13466 -9557 15931 21482 62290 45667 38760 12134 -76869 -135613 -56671 1441 -24420 -5808
13454 -5808 -4556 36655 99758 80327 92683 147874 116201 95220 85954 54799 49634 29014
13442 29014 27439 53818 88404 36466 39083 59354 71998 46592 18444 8816 44726 28006
13430 28006 37311 -36386 -41099 -14867 3002 21877 46486 20506 36438 -65 -10165 59269
13418 59269 73133 79597 92532 109285 81269 71212 69882 24911 64300 119962 95012 96265
13406I6265m3322k588N6250L3469n0616k3490j3860K8184k1649O518m4313m062
13394A6786l3895Q586M8943j3303j8693K6162k2089k3539K3288K392L0573J2232
13382E7443l2074k3960k0315K5519L9699M5530L1672K6138K579n811n7304l8738
13370E0378j8169l1830k5143R545Q1784L6061L1302K8059L7066R4j7753n5035
13358A26359l7432m0207J88O1438P7236J280K7270k2266m137J1796l9117p6501
13346H5907L0310K6224J2108N7409M7712J8863P7714K3613j2176r1155N0753L6684
13334C63966k4167n8508j24416m8520P2931J6761k4090N0681k4887m6160n9810
13323I3781j6602K9080j0217o2045J3751K5584P864p690L7464j0691j022K3570
$$ plain form
13406 96265 52943 50355 106605 140074 89458 65968 52108 80292 58643 65161 20848 16786
13394 16786 -17109 -8523 40420 27117 8424 34586 12497 -11042 12246 14638 45211 57443
13382 57443 25369 1409 -18906 6613 46312 91842 123514 149652 152231 146420 89116 50378
13370 50378 32209 379 -24764 -15219 66565 102626 133928 161987 199053 199147 181394 126359
13358 126359 88927 48720 48908 110346 187582 188862 216132 193866 189729 201525 162408 85907
13346 85907 116217 142441 154549 211958 259670 278533 356247 379860 367684 276529 327282 363966
13334 363966 339799 281291 156875 108355 181286 198047 173957 224638 199751 153591 93781
13323 93781 77179 106259 96042 33997 47748 73332 81196 73506 110970 100279 99257 122827
13311A22827m2545K6991K4423j5488j5771P548n2331n3916J555j2646O0254J19904
13299A70805m9809n4247K7424m422k5304j9663l2483J1309M6212o165j7082m373
13287D2202l8274J7224j8610n4607j2323o5372k8460n175O7051K133r123P1015
13275c2319O6872L6975P3298P3084R304R809K6822K4317o7646n1839o045n2626
13263A10006n1230n7113p180J0467M963O5272N9756M4444J6286m6021o262l7642
13251A05746K0243l9741l9105m8595j7546j0375K7666R6330K50850K13858O7649
13240F26980N5680Q011k4574p9790l9414l2812r5677M585j9007n2106P022O544
13228C65442l5110J5379n5324P304L2923N4360O5800O8946N5934K4225j5454l1450
$$ plain form
13311 122827 80282 107273 131696 116208 100437 107985 55654 1738 3293 -9353 50901 170805
13299 170805 120996 66749 94173 89751 64447 44784 12301 23610 69822 63657 46575 42202
13287 42202 3928 21152 2542 -52065 -64388 -129760 -158220 -163395 -96344 -94211 -103334 -32319
13275 -32319 34553 71528 144826 217910 227214 237023 263845 288162 220516 168677 162632 110006
13263 110006 58776 1663 -5517 4950 9913 75185 134941 179385 195671 149650 143388 105746
13251 105746 125989 86248 47143 -1452 -18998 -29373 -1707 94623 345473 559331 626980
13240 626980 682660 690671 666097 586307 546893 514081 418404 422989 403982 351876 358898 365442
13228 365442 330332 345711 290387 297691 330614 384974 450774 519720 575654 599879 584425 552975
13216E52975R502j6490j8353l2071k8803M4075O1600n805m8049m5913l3722J7313
13204D56259L612l8962k8243k4904k2078J3031L8987M8810J4002N2231K0141q630
13192E24256m3615j5214r417M2911m5468L0977J4908m6833L428N6968L3832K39
13180E46972J8510j0485m8234L3301L9854j1091K7006O8973M5042J7651j1419
13169G16080n6889o3508m6701J029N3516L8679N0400K0786J7514J15753L7369
13158H84028O2127L9439j4102L5358N6666p883j220K7722N3936L3105p490N0124
13146A211810L4097r051j1992l6809r631Q1226L1216p300O2663J7378M3778K5175
13134A432560O9808J02231Q9037J07936Q7308P0461J00141O8593O1015J10561
$$ plain form
13216 552975 562477 545987 527634 495563 466760 510835 572435 566630 518581 472668 438946 456259
13204 456259 459871 420909 392666 367762 345684 358715 397702 446512 460514 512745 532886 524256
13192 524256 480641 465427 456010 498921 453453 484430 499338 452505 455933 512901 546733 546972
13180 546972 565482 554997 506763 540064 579918 568827 595833 664806 709848 727499 716080
13169 716080 659191 595683 548982 550011 603527 642206 692606 713392 730906 846659 884028
13158 884028 946155 985594 971492 1006850 1063516 1055633 1054413 1082135 1136071 1169176 1161686 1211810
13146 1211810 1245907 1236856 1224864 1188055 1178424 1259650 1290866 1283566 1346229 1363607 1407385 1432560
13134 1432560 1502368 1604599 1693636 1801572 1888880 1959341 2059482 2128075 2189090 2299651
13124B299651J16621J15720J36507J60274J97366K30338K32115L09950K77786
13115D076328L86085L81606M18995N66966P22168R10497R96795P74890M28476
13106I662806M12300M15367N87859R87497J326369J711047K133585K673880L466458
13097B3377168M558109O185077Q465327J1763339J6413588K3649796L5729581
13090A30141985N5039285Q0029382J00545607R2073572K5314993m2473555o2225810
13083C78445459q1213374q4397451o1424445l9156902k5270523j7362197j2645281
13076E6975286r515809p368611n839081m701074l838696l131843k607626k226764
13068A7745782j815818j566599j397452j212206j090725r41145q42396p15643
$$ plain form
13124 2299651 2416272 2531992 2668499 2828773 3026139 3256477 3488592 3798542 4076328
13115 4076328 4462413 4844019 5263014 5829980 6552148 7462645 8459440 9234330 9662806
13106 9662806 10075106 10490473 11078332 12065829 13392198 15103245 17236830 19910710 23377168
13097 23377168 27935277 34120354 42585681 54349020 70762608 94412404 130141985
13090 130141985 185181270 265210652 365756259 457829831 483144824 440671269 378445459
13083 378445459 297232085 212834634 151410189 112253287 86982764 69620567 56975286
13076 56975286 47459477 40090866 34251785 29550711 25712015 22580172 19972546 17745782
13068 17745782 15929964 14363365 12965913 11753707 10662982 9721837 8879441 8163798
13060H163798n16593n61576n14754m89494m24528m00136k92667k97423k99880
13051D366747k71239l06821k63715k09130j46018j61721j79864j97139j53162
13042B477938k18545j75025j21937r7252q2124n3655j22091m3826o8385q6543
13032A408555j9275p6976q5282q9742j07829j5665L1858j2123r7411l8410o5743
13021H31957k5868l4895k4643J427k5065M5303n7039l9766O8602K1569j2656k5098
13009G23828l455l3715l0222j7668q7360r9078N010j6495L2716L3341l6317m2128
12997D28457n596N1668k9933r9958l8881k6308m5558M122K5748O3636k8529L2651
12985C31519O0815J7501q1463k5163M9250j3577l3890K7194O4521N2017k2942
$$ plain form
13060 8163798 7647205 7085629 6570875 6081381 5656853 5256717 4964050 4666627 4366747
13051 4366747 4095508 3788687 3524972 3315842 3169824 3008103 2828239 2631100 2477938
13042 2477938 2259393 2084368 1962431 1865179 1783055 1729400 1607309 1563483 1495098 1408555
13032 1408555 1389280 1312304 1227022 1137280 1029451 1013786 1045644 1033521 936110 897700 831957
13021 831957 806089 771194 746551 747978 722913 768216 711177 671411 740013 761582 748926 723828
13009 723828 720373 686658 656436 638768 551408 452330 457340 440845 473561 506902 470585 428457
12997 428457 422861 474529 444596 344638 305757 279449 233891 238013 263761 327397 298868 331519
12985 331519 392334 409835 328372 303209 352459 338882 304992 332186 396707 448724 425782
12974D25782r6586L1525K2425n9K4692N4075J45919J06594J94600L27499M89250
12963A725716O77704R69069Q96923L44411l48827o32401p78595p54813n65084
12954A534103m13823k77675j68817j40342j31570n8217N2580l7492q4054j52902
12944A21791q1390N3544j150P854J8393n6363q6177n9041L664j803j0580j02324
12932a93582j10669Q113J08212R4650K06079J60453K0862L049j6796P5995k0666
12921C35700m2582J9819o9343l0839M0851m226l7589p6276l654o8179M2704Q3563
12909A89949Q0206N993k0375o3567m545J6156k0381L8290L8282p2816P755P0324
12897B65271O8374M5296O8013L1977M6734k5405p4034k6302k2739k4638k3557
$$ plain form
12974 425782 329196 360721 383146 383087 407779 461854 607773 714367 908967 1236466 1725716
12963 1725716 2403420 3372489 4269412 4613823 4264996 3632595 2854000 2099187 1534103
12954 1534103 1120280 842605 673788 533446 401876 343659 396239 358747 274693 121791
12944 121791 40401 93945 92795 100649 119042 62679 -23498 -82539 -78875 -80678 -91258 -193582
12932 -193582 -304251 -296138 -187926 -93276 112803 273256 294118 297167 280371 356366 335700
12921 335700 293118 312937 243594 212755 253606 249380 211791 135515 131861 63682 106386 189949
12909 189949 270155 276148 255773 192206 187661 203817 183436 221726 260008 187192 194947 265271
12897 265271 333645 378941 446954 478931 525665 500260 426226 399924 377185 352547 328990
12886C28990l1520m4276j6839J5829L7785M0139j0739o0206n8186l0152L7099
12875B07924J18568O611r6769p5162m6937N700N7939K0976M5634K2292j7524l2982
12863B16270N2699q4047j11747P5943L0251m4592l7035k6274J1146q189n2996
12852B1429J6889N9647K1561m1823k583N4084M7571l7491p2449n0509M1283J5698
12840G3307J7990M3123N9458K5627J0015n2401j8203p8638k5366O164O682N6498
12828A24256L9901n6304n9570L8018l8328n4969J2932L9921M9857L0594j1267
12817A15041k5892J146n112K4710O3635O8188j4811m7196k6586p7020l1938M203
12805D8368L5539n5905J290R6328M0463l4777J1931J0484J0093m90Q1579m8355
$$ plain form
12886 328990 297470 253194 236355 252184 289969 330108 319369 259163 200977 170825 207924
12875 207924 326492 333103 236334 161172 114235 119935 177874 198850 244484 266776 249252 216270
12863 216270 268969 184922 73175 149118 179369 134777 97742 71468 82614 74425 21429
12852 21429 38318 97965 119526 77703 75120 129204 176775 139284 66835 16326 57609 73307
12840 73307 91297 134420 193878 219505 229520 177119 158916 80278 54912 61076 67758 124256
12828 124256 164157 107853 48283 86301 47973 -6996 5936 45857 95714 126308 115041
12817 115041 89149 90295 85183 109893 173528 241716 226905 179709 153123 76103 44165 48368
12805 48368 83907 28002 29292 125620 166083 131306 143237 153721 163814 163324 244903 196548
12793A96548q8571O532M5906k9641j7782j2325J1061j5257o403N4421k8304n3737
12781F2448P392r772k5216K6278J9509J9585k0865M047L3833J0075q650k8024
12769I0640N241K3667j6363L0940j017l428j9598J1799K6045k3171l5035k2727
12757F6993J4701J13955L0546m0175m484l0254l434m464M727p60K1216k2222j0331
12744A36014j4447n540J0778m7296r484M1553N318l2590l6434j3887k094l5776
12732c885n341M7810P9732J6063o6326k9594M1091j0579m5997Q408K8050l4316
12720B5116P494L1519P1857n4919o2862l5281L8736O8288j0419q6883P007K3687
12708B3340N5069K3744o0737L7839L0026l4783j9637k0534K3849R7327l2239n5825
$$ plain form
12793 196548 107977 114509 160415 130774 112992 100667 111728 96471 90068 144489 116185 62448
12781 62448 69840 60068 34852 61130 80639 100224 79359 83406 117239 127314 118664 90640
12769 90640 95881 119548 103185 134125 133108 129680 110082 121881 147926 124755 89720 66993
12757 66993 81694 195649 226195 186020 181536 151282 147848 143384 148111 147351 168567 146345 136014
12744 136014 121567 116027 126805 79509 70025 111578 116896 84306 47872 33985 31891 -3885
12732 -3885 -9226 38584 118316 134379 68053 38459 79550 68971 22974 31382 59432 25116
12720 25116 32610 64129 135986 81067 18205 -17076 21660 89948 79529 -7354 -347 23340
12708 23340 78409 102153 41416 79255 109281 74498 54861 34327 58176 155503 123264 67439
12696F7439m9390L1232K980J4749J3516k4076r714J1859N0446J8502n0639l1807
12684D5097l6420J8665M2863O0841k031j28694k8037J9058P090N6248J9311K095
12672G6086M8708r115m9442l2508J3323K7777K1940K5441j4588k440k0074P557
12660I2665J0214R2922M4002j2200R266l1804l8244J9758j6118j3580K5102k1810
12648A60173J6578J4983k7815Q635J4837j930K2176J35497J59173J86036K26906
12637I15249L42276L99051M80735K35836p1078k41031l61036m32822l47717k22591
12627F96872j47917q3968n5002l2478j9649l4127k7305m7727Q1l8043k1622K5774
12615B14889l0457l9630m3000M6014M4407L9697L4217K190n4717l7562k7740p5765
$$ plain form
12696 67439 18049 49281 52261 67010 80526 56450 46736 58595 109041 127543 76904 45097
12684 45097 8677 27342 70205 131046 129015 321 -27716 -8658 -1568 54680 73991 76086
12672 76086 124794 115679 66237 33729 47052 74829 96769 122210 107622 105182 85108 92665
12660 92665 102879 195801 239803 227603 236869 205065 166821 186579 170461 156881 181983 160173
12648 160173 176751 191734 163919 172554 187391 185461 207637 343134 502307 688343 915249
12637 915249 1257525 1656576 2137311 2373147 2302069 2061038 1700002 1267180 919463 696872
12627 696872 548955 464987 409985 377507 357858 323731 296426 248699 248780 210737 189115 214889
12615 214889 184432 144802 101802 147816 192223 231920 266137 268327 213610 176048 148308 72543
12603G2543l4999m0933J0123P1378K5380q04L4991j6390m0730m2938l3826K0298
12591B4093O7181L3978n1941l9969l3790K8056N7289m4465m606J65L4699O2731
12579A33421L7877l3455J1971K4166L4248m9485P003k2255L1302l1644k5755O832
12567A24226l9367k1505J8083J5536K0045n0726j2830r362j5634L7530k2952k4970
12555A8074l540J424l0007l8129K8807K6909K0341L1561K3434o1570N502r014
12543A3792J2026O0679K8809L9900O1644l8136n315j659k5357k2312J2177J5953
12531A52201m9870p8021J103K6012k6816o750L9292L6167J6420J7039L5492j255
12519A61014n8159m0866K1132J09599M8615l2195l7767N798o405l2947o039M1898
$$ plain form
12603 72543 37544 -3389 6734 78112 103492 102688 137679 121289 80559 37621 3795 24093
12591 24093 91274 125252 73311 33342 -448 27608 84897 40432 35826 35991 70690 133421
12579 133421 171298 137843 149814 173980 208228 158743 165746 143491 174793 143149 117394 124226
12567 124226 84859 63354 81437 96973 117018 66292 53462 44100 28466 65996 43044 18074
12555 18074 14534 15958 -14049 -52178 -23371 3538 23879 55440 78874 17304 22806 13792
12543 13792 25818 86497 115306 155206 216850 178714 173399 171740 146383 124071 136248 152201
12531 152201 102331 24310 25413 51425 24609 17859 57151 93318 109738 126777 162269 161014
12519 161014 102855 61989 83121 192720 241335 209140 171373 177171 170766 137819 131780 173678
12507A73678k047q8137j6115L0944K3720O802p3856j6801L5296K8481K7938K2597
12495A52500k9885J856O343N9064P827o9497J269m5580M5594M9024J3419n3197
12483A38737m6540K2490j1408M5661J4566l310m386m9991q5457m9833R84J1081
12471a7406O4226K0816m4551K3877L5634L9179K9049p664k456k5993n0474Q39
12459F5076Q782K887l646M1604M8924R952l5504n3070j8720J6562R917j64K7901
12446A20501J5051k5907k2540l7473K0640M0339o806N218N6651m0312j9394r493
12434I6475L4471K0459j5743n4512K1787J8650n3869k8249L1847O3604K6412L3801
12422A95133n6811l4629j1589L89l3108o190L1711L8419L1182M2542L073q3150
$$ plain form
12507 173678 171631 83494 67379 98323 122043 128845 54989 38188 73484 101965 129903 152500
12495 152500 122615 124471 130814 189878 197705 128208 129477 83897 129491 178515 191934 138737
12483 138737 92197 114687 103279 148940 163506 160196 155810 105819 20362 -29471 -28487 -17406
12471 -17406 46820 67636 23085 46962 82596 121775 150824 143160 140704 114711 64237 65076
12459 65076 73858 76745 73099 114703 163627 173579 138075 85005 66285 82847 92764 92600 120501
12446 120501 135552 109645 87105 49632 70272 110611 103805 109023 165674 125362 105968 96475
12434 96475 130946 151405 135662 81150 102937 121587 67718 39469 71316 134920 161332 195133
12422 195133 138322 103693 92104 92493 59385 53195 84906 123325 154507 197049 200122 116972
12410A16972j4668m0382Q990P2500O486k7564k1874j8176N941O4230m4465n2132
12398E5858J9014M9965O0184O1418M7509M5896k1259k6708j5983p0661l4946n5917
12386A14370R13O1767P0648k9524p8229l4118L1886K9132M006k3760n4264M1100
12374A33927k3947k7579M7845J2599l8884j0161N1606j0197n231k0508n3104K8257
12362H4623L0804l8573m094M0637J1633K3480M9264L3448q595k9398l3297p60
12350A59172j6859L5943l2405L449M7094J0441n2720l1680l6147l1187Q944L2414
12338I6459L3212j0955O1432K317l0387j6169J2520m377L9963K2630j8936j2765
12326A74944J0263J2064j5828k6710K8263O0870L8505p5937j2463M5568Q051l6745
$$ plain form
12410 116972 102304 61922 70912 143412 149898 122334 100460 82284 88225 152455 107990 55858
12398 55858 74872 124837 185021 246439 293948 339844 318585 291877 275894 205233 170287 114370
12386 114370 115283 177050 247698 218174 139945 105827 137713 166845 170851 147091 92827 133927
12374 133927 109980 82401 130246 142845 103961 93800 145406 135209 129978 109470 56366 84623
12362 84623 115427 76854 72760 113397 125030 148510 197774 231222 222627 193229 159932 159172
12350 159172 142313 178256 145851 149300 196394 206835 154115 122435 86288 55101 64045 96459
12338 96459 129671 118716 180148 182465 152078 135909 148429 144052 184015 206645 187709 174944
12326 174944 185207 197271 181443 154733 182996 243866 282371 206434 193971 239539 247590 210845
12314B10845m9568K1154j4761N6567L5959r4963k3173O8550m430r147j2820p489
12302A76724K4764j539K3908Q056K6738k6624O837P46N499K494m087J8806R149
12289B71471p885o6080r313l3818P0174P4504J4724m5523K4291J5143j437O249
12277C12500J0524o1337j4171P361m0195q613J5458Q667O5395J9477j3180p5515
12265B26371j9618R084L2522l0915K54R753L7740N098j9647L1131k411j4029j6737
12252B48596p23L6745l2310o7434K4762K9516m8297k0884J6846L3774O0478P121
12240B88190J2651J6227J9500M42o8360o482j5373j3213J2523J521L3546K7505
12228C08677N6111Q9406L622j3359m7482j5871L7619j1667k9845p6091K7922M9014
$$ plain form
12314 210845 161277 182431 167670 224237 260196 165233 142060 210610 206180 197033 184213 176724
12302 176724 201488 199949 223857 231913 258651 232027 238864 239610 245109 247603 243516 262322 271471
12289 271471 263586 197506 188193 154375 224549 299053 313777 268254 292545 307688 306251 312500
12277 312500 323024 261687 247516 254877 214682 206069 221527 230194 295589 315066 301886 226371
12265 226371 206753 215837 248359 217444 217698 227451 265191 270289 250642 281773 279362 265333 248596
12252 248596 247873 284618 252308 184874 209636 239152 190855 169971 186817 220591 281069 288190
12240 288190 300841 317068 336568 337010 268650 262168 246795 233582 246105 247626 281172 308677
12228 308677 364788 454194 457816 444457 396975 381104 418723 407056 377211 301120 329042 378056
12216C78056O6498q0474n6476M3773L5796n1037k0318O2289K1962l1763n749j288
12204C61269j2959K8266j2360J1137K7413k5396J13J3262n7672K2791Q0486P2225
12192E08575L0932j06418p391k1729L0641N8380m1166p2012J6561J2722O3186
12181D72281L2714j6066p649N2418J6005j9836n5183n5622J5721k0499J1000Q8366
12169E13650K0352J2669l9012P055K390K2283m4747n2233m914M631L0106M331
12157D76561j5126N1552J5156m2372N7333O4072L7744R691J039J5766J3832l3479
12145F51769n5345m0495N8636J4056K5347n7986n208M6544j1368J0964J2316j3626
12133F35604r199M950M452m0180J1618P0582L3799K5720O5380p333m50j1795l5340
$$ plain form
12216 378056 444554 364080 307604 351377 387173 336136 315818 378107 400069 368306 362557 361269
12204 361269 348310 376576 364216 375353 402766 377370 377483 390745 333073 355864 436350 508575
12192 508575 539507 433089 425698 403969 434610 492990 451824 379812 396373 409095 472281
12181 472281 504995 488929 481280 533698 549703 529867 474684 419062 434783 414284 425284 513650
12169 513650 534002 546671 507659 514714 517104 539387 494640 442407 437493 442124 472230 476561
12157 476561 461435 512987 528143 485771 543104 607176 644920 654611 655650 671416 685248 651769
12145 651769 596424 555929 614565 628621 653968 595982 590774 637318 625950 636914 649230 635604
12133 635604 626405 631355 635807 595627 607245 677827 711626 737346 802726 795393 794943 783148 747808
12120G47808L9344L2133J882l2172p9292k509R2044J3396R446L1738k7077J5390
12108H42131O0400K7009k5418j0874r468P346J5457K1049l4657k2253K5303O7527
12096I63552N8260j6171J1402m288J4779R751j828M2927m0959k0622l1551L6748
12084A022000P4166M3961P9756m3194l2396n476J2019N4955L9308K5140L9483
12073A309722Q3816K7234n052k9641Q125n562L2451k4439p636o508M9415K2144
12061A454069R683J7094K804k7832J6343R3956K1379N4370K2655j1097m677M0690
12049A689437L4710k4168P630O7975L0109O1396N6270o087P477n705J1946L82
12037A931372o887K6655Q3646L5633Q0390j1576L7871M6265P4264L0443L3233
$$ plain form
12120 747808 787152 819285 821167 788995 709703 707194 799238 812634 822080 853818 826741 842131
12108 842131 902531 929540 904122 893248 883780 891126 906583 927632 892975 870722 896025 963552
12096 963552 1021812 1005641 1017043 1012755 1027534 1037285 1035457 1078384 1037425 1016803 985252 1022000
12084 1022000 1096166 1140127 1219883 1176689 1144293 1138817 1150836 1205791 1245099 1270239 1309722
12073 1309722 1393538 1420772 1415720 1386079 1394204 1388642 1421093 1396654 1389018 1382510 1431925 1454069
12061 1454069 1463752 1480846 1483650 1455818 1472161 1566117 1587496 1641866 1664521 1653424 1648747 1689437
12049 1689437 1724147 1699979 1707609 1775584 1805693 1867089 1923359 1917272 1924749 1919044 1930990 1931372
12037 1931372 1924485 1951140 2034786 2070419 2150809 2139233 2177104 2223369 2297633 2328076 2361309
12026B361309O7434K3381Q249L3308M9335Q0752j9627J3562L2705R0248N1085
12015B791741N7717R3286M0359k6710O8443J31515N2892O0756Q4712L6234L8591
12004C429536M2698P4225P7109N1284R5069J21899O1408L1550L3145M6515P6561
11993D140999J05356J48466R1437Q6077Q8327N2891R2176O1834J32029J77291
11983E176883J55974Q2974N2415J43452J35414J42828J02713J16935J62239J62405
11973F434232J08046J31886J75878K01240J62971J13356J85795K14358K06316
11964G934078K02193J83408J35394J39043K29478K86260K20780J57930J70940
11955I659504J76107J76497J94600K18997K34985K20082J93142J60329L21340
$$ plain form
12026 2361309 2428743 2452124 2460373 2493681 2543016 2623768 2604141 2617703 2650408 2740656 2791741
12015 2791741 2849458 2942744 2983103 2956393 3024836 3156351 3209243 3269999 3354711 3390945 3429536
12004 3429536 3472234 3546459 3623568 3674852 3769921 3891820 3953228 3984778 4017923 4064438 4140999
11993 4140999 4246355 4394821 4486258 4572335 4660662 4713553 4805729 4867563 4999592 5176883
11983 5176883 5332857 5415831 5468246 5611698 5747112 5889940 5992653 6109588 6271827 6434232
11973 6434232 6542278 6674164 6850042 7051282 7214253 7327609 7513404 7727762 7934078
11964 7934078 8136271 8319679 8455073 8594116 8823594 9109854 9330634 9488564 9659504
11955 9659504 9835611 10012108 10206708 10425705 10660690 10880772 11073914 11234243 11555583
11946A1555583K70640J86050J98228J86192J96582K22390J47535Q8795K21501
11937A3273496K01746J72407J95758J57732J30478R0042J28648J30260J04611
11928A4585178P5428P4587J3132K0583J821l4622j7959l226r637q8178r5472r6569
11916A4425066o7707r3825j63946j89874j35714q9453r6759k09341j81633j48171
11906A3048643j98855j68617j64180j77821j90182k03114k32429k53548k19660
11897A1240237k22027k07055j57059k11707k63753k38130k18607j79890k39692
11888I302317k80824j98659k03957j71597j39201j63296j68757j96863j38230
11879G640933j45717j41097j29905j74974j81826j64301j92964j18699j13555
$$ plain form
11946 11555583 11826223 12012273 12210501 12396693 12593275 12815665 12963200 13051995 13273496
11937 13273496 13475242 13647649 13843407 14001139 14131617 14221659 14350307 14480567 14585178
11928 14585178 14660606 14735193 14748325 14768908 14770729 14736107 14718148 14714922 14705285 14617107 14521635 14425066
11916 14425066 14357359 14263534 14099588 13909714 13774000 13684547 13587788 13378447 13196814 13048643
11906 13048643 12849788 12681171 12516991 12339170 12148988 11945874 11713445 11459897 11240237
11897 11240237 11018210 10811155 10654096 10442389 10178636 9940506 9721899 9542009 9302317
11888 9302317 9021493 8822834 8618877 8447280 8308079 8144783 7976026 7779163 7640933
11879 7640933 7495216 7354119 7224214 7049240 6867414 6703113 6510149 6391450 6277895
11870F277895j73245j84616r5049j10164j24103j67699j12618j31401q4102m2637
11860E052261p4936j81552j32714r0913r3281p0502j07864n2746p8431j38034
11850D031288p2137j6913j10856j08737q1184q0005o402n3059n3971n4274j15576
11839C278174q1436o7866r9879q6824j5453L5600j0928j00058o7584o7080p1557
11828B645109k8618o7583o1141n271m4391p3385p4098j03793k5967K6045J8286
11817B205193j06829m4732J7148N489o9474j06790K095N0117k248n6016m4950
11806A849003j3864j5001l0987k9660l7694k068k2080n3206k1277M2290n6352
11795A609104n2317K825j8087m4535L8426k1638k2477m9173J5835K0819J3301
$$ plain form
11870 6277895 6104650 5920034 5824985 5714821 5590718 5423019 5310401 5179000 5094898 5052261
11860 5052261 4977325 4795773 4663059 4572146 4478865 4408363 4300499 4247753 4169322 4031288
11850 4031288 3959151 3942238 3831382 3722645 3641461 3561456 3555054 3501995 3448024 3393750 3278174
11839 3278174 3196738 3128872 3028993 2942169 2926716 2962316 2951388 2851330 2783746 2716666 2645109
11828 2645109 2616491 2548908 2487767 2482496 2438105 2364720 2290622 2186829 2160862 2186907 2205193
11817 2205193 2098364 2053632 2070780 2076269 2006795 1900005 1902100 1952217 1949969 1893953 1849003
11806 1849003 1835139 1820138 1789151 1759491 1721797 1719729 1697649 1644443 1623166 1665456 1609104
11795 1609104 1556787 1559612 1541525 1496990 1535416 1513778 1491301 1442128 1457963 1478782 1492083
11784A492083q2601n8143k9438j8220l8430m533k3974j5936l5498k8268k5606
11773A131436p699M4984k4347j7737m5758n4922L8597m2113l7820m4454n0974
11762H89193N0378P2533L8204o994l7933j6304P285o0818K131j1117M0132O530
11750I73220n627p236m9160L048j6260m9727q238N5865K0685k7966J3306J4813
11738I16723r522j3739p2895n5965M6393J501r0790r9692j9628M3454J7960p6516
11726E87284o54j3809j745j1318N0136K3111N881l7951K0278Q9210Q8852m2277
11714G56998m0946k7099j3085n2181K150R022k6864l6879p046k3534j8333L2946
11702E55149r707q706L919m6174M5895Q7059J6456o5928j20511j5179n419P4208
$$ plain form
11784 1492083 1409482 1351339 1321901 1303681 1265251 1260718 1236744 1220808 1185310 1157042 1131436
11773 1131436 1123737 1168721 1144374 1126637 1080879 1025957 1064554 1022441 984621 940167 889193
11762 889193 939571 1012104 1050308 1043314 1005381 989077 996362 935544 937675 926558 966690 973220
11750 973220 967593 960357 911197 914245 897985 848258 840020 895885 916570 888604 901910 916723
11738 916723 907201 893462 820567 764602 810995 812496 721706 622014 602386 645840 663800 587284
11726 587284 586630 572821 571076 559758 609894 633005 638886 600935 621213 710423 799275 756998
11714 756998 716052 688953 675868 623687 625837 634859 607995 571116 564070 540536 522203 555149
11702 555149 545442 536736 540655 494481 540376 627435 643891 577963 457452 442273 436854 511062
11690E11062r99M597O4650J1097o5411p4549O705K3520o435N8544K44l4901l3013
11677D65111M4554q838j5024K4017j3294n1973l1982j8380K53L44N9661P447p5493
11664C86403J6804j5255J1696j3870J4542j1743J0795m1973j14839M2806Q0090
11653C65456P6911j4845k3929o1510p2094L8997k9762o657J6023R372L0932k3019
11641C05875J7563Q1720k8045L1120j9736J7349L5786j9532K5027J1281o7814
11630C90594m2872o084O7945r06j2317l9981J9188j3526q7583l7072m782Q3r013
11617B23674j0406N9794J6204k6622k5436K0641K8057r941k5979O1155J0886o1316
11605B60711k0900j216M8842J8728j0944l5807M1760L9964R533N359l8199l2161
$$ plain form
11690 511062 510063 514660 579310 590407 524996 450447 457152 480672 474237 532781 533025 498124 465111
11677 465111 509665 500827 485803 509820 496526 444553 412571 394191 394444 394788 454449 461896 386403
11664 386403 403207 387952 399648 385778 400320 388577 399372 357399 242560 285366 365456
11653 365456 442367 427522 403593 342083 269989 308986 279224 272567 288590 297962 328894 305875
11641 305875 323438 405158 377113 408233 388497 405846 441632 422100 447127 458408 390594
11630 390594 347722 341638 409583 408677 396360 356379 375567 362041 274458 237386 232604 232687 223674
11617 223674 213268 273062 289266 262644 237208 257849 285906 275965 249986 311141 322027 260711
11605 260711 239811 238595 287437 306165 295221 259414 301174 341138 350671 356030 317831 285670
11593B85670J8966k4086K2704M5676L6470l6847l5334r840m8546j6095Q859k6087
11581B21510n4703N3043n174l96m6307K4041K1898J1616j5039k4636M0977M782
11569B31612K6289N5081j800K2664p0927k7930n644m5814R0809O0104k5260m1148
11557B68036j1155j3646q44j1157l2774j0032l4400L0021l5560q7350O827L5525
11545A03491o429N4771L0673J6676k5809j6674j9357N0827J2747m1146n1887J7499
11533A25382O8724K8855m4858n2618l2879L4880M6505l1295P271m0092M6190N4849
11521B10914l0473l6769K9390l487J7657L4123m0279n6512l9012m0251j6974L2102
11509F0429N0965O5550Q2490l083k1346k6163j6030R2803j6906n5699J3603j911
$$ plain form
11593 285670 304636 280550 303254 348930 385400 348553 313219 303379 254833 238738 247597 221510
11581 221510 166807 219850 214676 214280 167973 192014 213912 225528 210489 185853 226830 231612
11569 231612 257901 312982 311182 333846 262919 234989 229345 183531 274340 334444 309184 268036
11557 268036 256881 243235 242391 231234 198460 188428 154028 184049 148489 61139 67966 103491
11545 103491 97062 151833 182506 199182 173373 156699 137342 188169 200916 159770 107883 125382
11533 125382 194106 222961 178103 125485 92606 127486 173991 142696 149967 109875 156065 210914
11521 210914 180441 143672 173062 169575 187232 221355 181076 124564 85552 45301 28327 60429
11509 60429 111394 176944 259434 256351 235005 208842 192812 285615 268709 213010 226613 224702
11497B24702O2489j4270n3136J7301k4543l4098l6425p7960p550O1168L527l1439
11485H9766J538M0902J1604l980J4110M6458K0229l6969p2985J8193P0621l4753
11473A64734k770Q20n3819L5651N843m2475l0066J03753L1378O50k9041l5610
11461A49048N2442j2647J6535j42j7167p5267r344Q8N7708K1828j0618k5878J6572
11448A63158k1502o104J9951k0829K6839J8907l6365j9498J9865m4638o7786k9592
11436B406O7475Q9459M905l6703K6545M9911K7576l8482m9150l1133l971k1908
11424H6930k6024L8926P0852j8019j02561J1045J2082O8342K0609o8243J623M9168
11412A44730m3957l7284k9179m150L0899L7534k3286L958L250k7595J047O2957
$$ plain form
11497 224702 287191 272921 219785 237086 212543 178445 142020 64060 56510 117678 121205 89766
11485 89766 91304 132206 143810 139830 153940 200398 220627 183658 110673 128866 199487 164734
11473 164734 161964 162784 108965 144616 150459 107984 77918 181671 213049 213699 184658 149048
11461 149048 201490 188843 205378 205236 188069 112802 103458 103546 161254 183082 172464 146586 163158
11448 163158 141656 135552 155503 134674 161513 180420 144055 124557 144422 99784 31998 2406
11436 2406 69881 159340 164245 127542 154087 203998 231574 193092 143942 112809 108838 86930
11424 86930 60906 99832 170684 152665 50104 61149 73231 141573 162182 93939 95562 144730
11412 144730 100773 63489 34310 30160 61059 98593 75307 79265 82515 54920 55967 118924
11400A18924M8172k540k3039n8581p343l6821L2844J5555J9691k0229q347L6362
11388A14648N7990K2942k2079l2698j2494l7137q088J2595J7789n0210j4026O3008
11376A12240N0034k868m2824l8726J5955J7023o3038n8748M8985N5555K2624j1227
11364A04985k1928l2665J9858M8131K6369J1997K7646l2081n3975M4147N189N453
11352A53126m8432p0343n3707j0258J14937J9058o2457j8889k187j9802J4139
11341A5185M902K0763L8268M0l908j4526j3789L180p882O904n6330o900L8322
11328B4229M9783l2953N519P2840Q160n6729k3841K3022L5382k6884L4666J2329
11316A25523n9856L4145l505m0653L7082k2101j5421m4866l2591L8027L2680j4789
$$ plain form
11400 118924 167096 164556 141517 82936 75593 38772 71616 87171 106862 86633 78286 114648
11388 114648 172638 195580 173501 140803 128309 91172 83084 95679 113468 63258 49232 112240
11376 112240 162274 159406 116582 77856 93811 110834 47796 -10952 38033 93588 116212 104985
11364 104985 83057 50392 70250 118381 144750 156747 184393 152312 98337 142484 147673 153126
11352 153126 104694 34351 -19356 -29614 85323 104381 41924 23035 20848 1046 15185
11341 15185 20087 40850 79118 79158 75250 60724 46935 50115 42233 49137 -7193 -14093 24229
11328 24229 74012 41059 46578 119418 127578 70849 47008 70030 105412 78528 113194 125523
11316 125523 65667 99812 96307 55654 92736 70635 55214 10348 -22243 15784 48464 33675
11304C3675r576R320N2884M9921j5333j7269M933k2828M074j852k5272m0458K6706
11291D8925K1657m5429O271O0024P722K7112M4233l044n5949m1872o1791l6407
11279b8548q007J5306K6957j1108P339J2824J7214J7426j1802L0419L3340m1595
11267E9765j0898K7300l900j9954M338O0963Q340Q349n4758q079k1575p3174l6114
11254e9397J8291P6039j3933k4144K8825N0494J6761K3670k6059k7977L9433k2511
11242G9492l1362L8805k45J3403j3875k2517M7367m3245M0187P506K4519L2873
11230A72908l6949k9484R651m2432n500K9504q660M5490l3115q0983n2240J3139
11218a8671l1624N59K0479k6396M576K8180k3927o0045J5275K2651J2683L1416
$$ plain form
11304 33675 24099 33419 86303 136224 120891 103622 108555 85727 89801 87949 62677 22219 48925
11291 48925 70582 25153 31424 91448 99170 126282 170515 167471 111522 69650 7859 -28548
11279 -28548 -36555 -21249 5708 -5400 1939 14763 31977 49403 37601 68020 101360 59765
11267 59765 48867 76167 72267 52313 56651 117614 125954 134303 79545 71466 49891 -23283 -59397
11254 -59397 -41106 34933 21000 -3144 25681 76175 92936 116606 90547 62570 102003 79492
11242 79492 48130 86935 86690 100093 86218 63701 111068 67823 108010 115516 140035 172908
11230 172908 135959 106475 116126 73694 68194 97698 89038 134528 101413 20430 -31810 -18671
11218 -18671 -50295 -49736 -29257 -55653 -51077 -22897 -46824 -106869 -91594 -68943 -56260 -24844
11206b4844q49k4518k161j2653j6570j6098L683K7711L9380Q061N627m8660K5139
11193c6752N2991J2830l6617k3179N6574N5713J1835j07345k0471P103l7107L3259
11181c1166M3118J1130M0559J4305p593j9016o809r309Q182o578k5128r52K4126
11168C4869l736L5580J3649k3969O146J402k3065j6804K067N6866L9674r6412
11156B6267l6897P654J3429k238k0294l4499r432K1490K2492l5873J0419N0862
11144A3380N5035o828l221l9734k3265L8627M3038R913l6764m8477M2263L0608
11132G4575K6598m5006l2064M4495J7989p3190j6427J9495p764J3695L3297K4122
11120G9815q967m9476k0580O344O1324L981J2773J8369j3824J985j7533m4486
$$ plain form
11206 -24844 -25693 -50211 -52372 -65025 -81595 -97693 -94010 -66299 -26919 -18858 -13231 -61891 -36752
11193 -36752 16239 29069 -7548 -30727 25847 81560 93395 -13950 -34421 -27318 -64425 -31166
11181 -31166 11952 23082 63641 77946 70353 51337 44528 35219 43401 36823 11695 10743 34869
11168 34869 31133 66713 80362 56393 62539 63941 40876 24072 26139 83005 122679 26267
11156 26267 -10630 -2976 10453 8215 -12079 -46578 -56010 -34520 -12028 -47901 -37482 13380
11144 13380 68415 61587 58366 18632 -4633 33994 77032 86945 50181 1704 43967 74575
11132 74575 101173 56167 24103 68598 86587 13397 -3030 16465 8701 22396 55693 79815
11120 79815 70848 21372 792 7136 68460 72441 85214 103583 89759 91744 74211 29725
11108B9725L3944O495k984M3128L442J0083k6077m9362p182k8470l2740J0917
11096i081K2708Q0505l0312k3001L374N3244j0503n2590J7527o51l0998O0823
11084H1045k7899j9404K218J455p0834j0471P1829L3052k9488N5237K2697q9765
11072A9672p3780n230K3637M9240J8853J2278L4203O9680j4591l7351k6071m349
11060F6191N2226k770K1400K0853j1472l8214l0351k5020j3717j1567j0854J4062
11048C0767o5335l9304O4241L3692k2930J1506k3327k1118K2795M3358Q4310Q5473
11036B04128L8338N513J1057n3974m2148j3775j6335M1245Q0384M8714N6448M5104
11024D04699l0111K3197j5393j6306l1260M451j838N2013L2720M6421J6674k795
$$ plain form
11108 29725 63669 70164 67180 110308 113750 123833 97756 48394 41212 12742 -19998 -9081
11096 -9081 13627 94132 63820 40819 44193 97437 86934 34344 51871 51220 20222 81045
11084 81045 53146 33742 35960 37415 -33419 -43890 27939 60991 31503 86740 109437 19672
11072 19672 -54108 -59338 -35701 13539 32392 44670 78873 148553 133962 96611 70540 66191
11060 66191 118417 115647 137047 157900 146428 108214 77863 52843 39126 27559 16705 30767
11048 30767 -34568 -73872 -9631 24061 1131 12637 -10690 -31808 -9013 34345 118655 204128
11036 204128 242466 247979 259036 205062 162914 149139 132804 174049 254433 303147 359595 404699
11024 404699 374588 397785 382392 366086 334826 339277 337439 389452 422172 468593 485267 482472
11012D82472J4455K0307p3461j17064j5671P108l0907M2913J10298K0200k9867
11001D30783j7890j7470l9217j24317n3836L7913k3840o0433N62l910k0629M3211
10989A50927N3060k8711o3764j7152k8595J6540k3944m7230n303K0860J1055k7918
10977I825m548J7532m612k9030j0013J8178l5193k6333Q234L4060K1543N313J1022
10964A5978M6104l8262M1732J0801l8228l7255j196n756n5827j5223P6915J3819
10952A3602j5956N9198m3712j3756K6947j6153K3444K4039l9018m3710L013k6375
10940d8437L1913J16878L771j15327n2570L7717O4862J2295n0378k641n4089J963
10928e4043R949j3950p658o2963M471L1932J2671M638Q1806J0812l3601k7108
$$ plain form
11012 482472 496927 517234 443773 326709 311038 318146 287239 330152 440450 460650 430783
11001 430783 412893 395423 356206 231889 178053 215966 192126 131693 132255 128345 107716 150927
10989 150927 203987 175276 111512 94360 65765 82305 58361 11131 5828 26688 37743 9825
10977 9825 5277 22809 18197 -10833 -20846 -2668 -37861 -64194 -55960 -21900 -357 4956 15978
10964 15978 62082 23820 65552 76353 38125 870 -326 -6082 -61909 -77132 -217 13602
10952 13602 -2354 56844 13132 -624 26323 10170 33614 57653 18635 -25075 -22062 -48437
10940 -48437 -16524 100354 104125 -11202 -63772 -26055 38807 51102 724 -1917 -56006 -54043
10928 -54043 -44094 -58044 -65702 -128665 -124194 -92262 -79591 -74953 6853 17665 -15936 -43044
10916d3044m1967K983O844L1571n8769O266L9096O6077j6180k6070K3082N4040
10904D3929L3410K0194j00082m7362M930K4060k8253j5208m586J1446N8062O389
10892F929m8952J7802o84K1186o500j9247q931P475j930J9522l54o377k2336l7181
10878g9578N92o390K0648J7377K7794J7808M3493N4585j851n7404L845p721n5818
10865b2620n1880j5992O9447k551N8251P4425K7324p1016p4884J3059J7064o8366
10853d7739r169N0871j0692K4003M5364N0923l8298k7072k7555L2942k525k4079
10841A6974K6367N707j137k1436K300J03813N1956L082j6764l7387n6740O447
10829H3182J6503j2530m7665J5135n5133m49j0825j8123J3746J4446K0394P0625
$$ plain form
10916 -43044 -85011 -82028 -75184 -43613 -102382 -96116 -57020 9057 -7123 -33193 -10111 43929
10904 43929 77339 97533 -2549 -49911 -44981 -20921 -49174 -64382 -68968 -57522 540 6929
10892 6929 -42023 -24221 -24905 -3719 -10219 -29466 -38397 -30922 -32852 -13330 -13684 -20061 -42397 -79578
10878 -79578 -78986 -85376 -64728 -47351 -19557 -1749 41744 96329 94478 37074 40919 33198 -22620
10865 -22620 -74500 -90492 -21045 -23596 34655 109080 136404 65388 -9496 3563 20627 -47739
10853 -47739 -56908 -6037 -16729 7274 52638 103561 65263 38191 10636 43578 41053 16974
10841 16974 43341 49048 47911 26475 28775 132588 184544 187626 170862 133475 76735 83182
10829 83182 99685 87155 39490 54625 -508 -957 -11782 -29905 -16159 -1713 18681 89306
10817H9306M8918k3836m5133m1540O360L2920l4242O990j610n8266k4332j745
10805d6210m8065j4006m312j1118j9892N9939O9184M1815k1956l3574J3728J1949
10793b518Q972m1701p0776O4782P3048N853k430n5612q3387M2864J3275L2461
10781a5169M6301o785o2424k4620P3497M5980j6561n9437j2023o588n726j4682
10769e8237M1661K1575m8777n2690N5017k350j968O863M1624Q662p429L5473J3228
10756E2652O331k0469j2269m8538j6835M1429M2594j032k1422j1634q158M3448
10744D6097j9791p719n375O9703L2834J6354K9769n3386l9448k3471q405M5280
10732H2442K7811O7201o165l4023J131o133j5800M184N5302J8411n9775n9470
$$ plain form
10817 89306 138224 114388 69255 27715 34075 66995 32753 39743 38133 -20133 -44465 -46210
10805 -46210 -94275 -108281 -112593 -123711 -143603 -83664 -14480 27335 5379 -28195 -14467 -2518
10793 -2518 6454 -35247 -106023 -41241 31807 37660 35230 -20382 -103769 -60905 -47630 -15169
10781 -15169 31132 24347 -38077 -62697 10800 56780 40219 -19218 -31241 -37829 -43555 -58237
10769 -58237 -16576 4999 -43778 -96468 -41451 -43801 -45769 -38906 2718 11380 3951 39424 52652
10756 52652 58983 38514 26245 -22293 -39128 2301 44895 43863 22441 10807 2649 46097
10744 46097 26306 18587 13212 82915 115749 132103 161872 108486 69038 45567 37162 82442
10732 82442 110253 177454 171289 137266 138397 132264 116464 120648 175950 194361 134586 75116
10720G5116J0715N0559K6484R861k5509j4734K413P1568R506j7576j8871J8272
10708A97804J8170J2906k3446n1511m2045J8326M932K5634O654Q513l9264J3626
10696A50299k906M7238N7289m5487n2955L6087P3170J8276l9872m4255m9864K2772
10684A69792J3239k2731j2277O1421N2152j5290p1844J8186k5742j8967L8178
10673A86117J8797M23m504Q931l6597m899j3197J7551M0782K0801l9133K7460
10661B22532J2411q188p390n380k2255j7588J019Q8476M3486r877K4219j3548
10649C07917K687m4443K2555L3786O515K060N1232R398k6850k5035P0561O9637
10637D80020l9532K7427j7610R917P4032N0963L4102L2039N3639M8135Q0307J36704
$$ plain form
10720 75116 85831 136390 162874 172735 147226 132492 134905 206473 215979 198403 179532 197804
10708 197804 215974 228880 205434 153923 111878 130204 135136 160770 167424 175937 136673 150299
10696 150299 147393 194631 251920 206433 153478 189565 262735 281011 241139 196884 147020 169792
10684 169792 183031 160300 148023 209444 261596 246306 174462 192648 166906 147939 186117
10673 186117 204914 205337 200833 209764 173167 168268 155071 172622 213404 234205 195072 222532
10661 222532 234943 226755 219365 213985 191730 174142 175161 263637 307123 297246 321465 307917
10649 307917 310604 266161 288716 322502 329017 331077 382309 391707 364857 339822 410383 480020
10637 480020 440488 467915 450305 460222 534254 585217 619319 651358 704997 753132 833439 970143
10625I70143J66686J85839J28493J59416J36511J90827K52837K95211L04792N24412
10615C315167O97688R46817J391568J851947K459791L287880L810534L825708
10607B1587100K968767J516692K55820o39047q67086m14084O56349K222587M149931
10598C1437029O118686P512061P373278M864899J147866j933495l746194m183065
10590D8591065l055930p54375K110909N040909P807581R535424Q640796M383870
10582H2300249j326207n634171q054665q578669p045147m343717j304031J514735
10574D7528377L737099M781289L919840P91040l026588n640764o930898o915669
10566C8243726n597930l760255j826506l58948O28444R93445N39691p22578k211293
$$ plain form
10625 970143 1136829 1322668 1451161 1610577 1747088 1937915 2190752 2485963 2790755 3315167
10615 3315167 4012855 4959672 6351240 8203187 10662978 13950858 17761392 21587100
10607 21587100 24555867 26072559 26328379 25689332 24822246 24408162 25064511 27287098 31437029
10598 31437029 37555715 45067776 52441054 57305953 58453819 56520324 52774130 48591065
10590 48591065 45535135 44780760 46891669 51932578 59740159 69275583 77916379 82300249
10582 82300249 80974042 75339871 67285206 58706537 51661390 47317673 46013642 47528377
10574 47528377 51265476 56046765 59966605 60757645 57731057 52090293 45159395 38243726
10566 38243726 32645796 28885541 27059035 26700087 27328531 28321976 28861667 28139089 25927796
10557B5927796l284467l688330l619204l174251k480998j829295j345679j009413
10549E496159p75460o01883m90005l45184k90315k82895k55686l08034k29866
10540A916831j50285j42137j24767n2059j02115j12661p9706l9816m8465l4020
10530A030800p0009j36060j14671m1118o2762n4083r503m2382r9600l6258O2005
10519D26359k0103m6836N407k8107o8301j4898R332M0905J331L0415J16m7949
10507B87671p6262n1344j6493m967L0540Q8103L8481M627p594n0110k2244j0718
10495B09690J1371n4643O5P4626q999k8521k3105m7551k0913l8105j7069P0690
10483A27536L0982J9759j8404m0083r024n4L1410k3131n9740k1212o062K4485
$$ plain form
10557 25927796 22643329 18954999 15335795 12161544 9680546 7851251 6505572 5496159
10549 5496159 4720699 4118816 3628811 3283627 2993312 2710417 2454731 2146697 1916831
10540 1916831 1766546 1624409 1499642 1447583 1345468 1232807 1153101 1113285 1064820 1030800
10530 1030800 960791 824731 710060 668942 606180 552097 542594 500212 400612 364354 426359
10519 426359 406256 359420 364827 336720 268419 253521 262853 303758 305089 335504 335620 287671
10507 287671 211409 160065 143572 138605 169145 257248 295729 300356 292762 242652 220408 209690
10495 209690 221061 166418 166483 241109 232110 203589 180484 132933 112020 73915 56846 127536
10483 127536 158518 178277 159873 119790 110766 110712 142122 118991 59251 38039 31977 56462
10471E6462N0968O5082n4234o4747J7963O095l1909q0511l0302J8104P525j6391
10459e5895J4194O8798N7386m416J341m5593n019J51K4028O0539p8916j9219L9082
10446E6461j2016m4570R513M238k9521m3827n3904Q199J36675Q2891n0510l6286
10434B7343n6427p829M157k9059L2647j6608N2869L8616j2402J0587O4867N0071
10422A58832Q7774M1782m0356m1269k0713m9351j8819m0591l77O542o320M9697
10410A26831K3855o419O76L519K0078o0584l2616J2913j6274j167K2864O1723
10398A55399M7206J3141M7547N3784l3565n4873p3506M4956l4997j4074j9403
10387A31615L124K6298K3370m5165L320m2377k3431n222L075Q389M0645J9594
$$ plain form
10471 56462 107430 172512 118278 53531 71494 77589 45680 -34831 -65133 -47029 -39504 -55895
10459 -55895 -41701 27097 84483 80067 81408 35815 30796 30947 54975 115514 36598 17379 56461
10446 56461 44445 -125 9388 13626 -15895 -59722 -113626 -105427 31248 114139 63629 27343
10434 27343 -29084 -36913 -32756 -61815 -29168 -45776 7093 45709 33307 43894 108761 158832
10422 158832 246606 288388 248032 206763 186050 136699 117880 77289 76912 83454 77134 126831
10410 126831 150686 144267 144943 148462 168540 107956 75340 88253 71979 70812 93676 155399
10398 155399 202605 215746 263293 317077 283512 228639 155133 200089 165092 151018 131615
10387 131615 134739 161037 184407 139242 142562 100185 76754 71532 74607 82996 123641 143235
10375A43235J9363m7569p994m1061j8221L111L4172J2302P556K5972J6684j8606
10363A28944j1181l4215k9905M5077P1457J7923M8764o672n2676n8803L4523m1922
10351A11314k9402P933k5585J373K6893j0777j3368j3003O595K588P275K0495
10339I2331J1659J7120j8830l2827l3480K5135J8784j8998k5444N85L1391l344
10327F4082M4236K2613l7424m8220J4837k5985j1231k1505n0055k7394N9519M4471
10315B7944j5780K771L5963l6926J1712J6448m0217j4262O482K7510N7280k260
10303G6665m0561n9789K9925K5621q5402k8314J8684l8883M047J9587O5504O2591
10291D9675m5288q125N6564K7392m4249j14031l2674P1916k2216K1890L0539J4380
$$ plain form
10375 143235 162598 115029 107035 65974 47753 50864 85036 97338 104894 130866 147550 128944
10363 128944 117763 83548 53643 98720 170177 188100 236864 230192 177516 118713 153236 111314
10351 111314 81912 89845 64260 65633 92526 81749 68381 55378 61973 64561 71836 92331
10339 92331 103990 121110 102280 69453 35973 61108 79892 60894 35450 36035 67426 64082
10327 64082 108318 130931 93507 45287 60124 34139 22908 1403 -48652 -76046 -16527 27944
10315 27944 12164 14935 50898 13972 25684 42132 1915 -12347 -5865 21645 78925 76665
10303 76665 36104 -23685 6240 31861 -53541 -81855 -63171 -102054 -98007 -78420 -12916 49675
10291 49675 4387 -3738 52826 80218 35969 -78062 -110736 -38820 -61036 -39146 -8607 5773
10279E773L448r875j9465j4996m3536K5797K1871K107L458Q4564J2472r5798n8129
10266h2309J8605j3276N3439L9132k2514n0319O0647M4191n1002J5820L3987K8755
10254G5156o2364p1428K8476Q0006O5961J6232j3594r210k1184p8806o1070J5736
10242c6089M1175R4189N1922L032k976q80o5435m3035p797J4778L4108o5698k4216
10229f922n0143P5869P2346l5334L4188N402J4949k1783k959j0858L606p5576
10217B785p013M4766j7091j5058j167j0035O0099J253o750k3708Q07k9808O461
10204E541J1761K791L1113k444J388k0629J1014R982J5161m1395m9626P718J5758
10191a867N0277K9840m1837o193N7775J464m9465l4765L5060j0085r719o303L1185
$$ plain form
10279 5773 9221 -654 -20119 -35115 -78651 -52854 -30983 -28876 -25418 59146 71618 -24180 -82309
10266 -82309 -63704 -76980 -23541 15591 -6923 -57242 3405 47596 -3406 12414 46401 75156
10254 75156 12792 -58636 -30160 49846 115807 132039 118445 109235 88051 9245 -51825 -36089
10242 -36089 5086 99275 151197 154229 151253 150373 84938 41903 34106 48884 82992 17294 -6922
10229 -6922 -57065 18804 91150 55816 90004 95406 110355 88572 85613 74755 78361 2785
10217 2785 -4228 40538 23447 8389 7222 -2813 57286 58539 51789 28081 28888 -920 5541
10204 5541 17302 20093 51206 48762 50150 29521 40535 50517 65678 24283 -25343 -17625 -1867
10191 -1867 48410 78250 36413 30220 87995 89459 39994 5229 40289 30204 20485 14182 45367
10178D5367O096N071n522K9088l060K7651P075L3783J0272K1472j8531j0121J2938
10165A61579L9249N1118k7794n3331R6806J02586L1107J0952j9555n1443l1610
10154C09664r0272K6000j9699K8337N2826N4598Q8479N3101J6129k368n5427l2006
10142D29362q1909q8583m8117K639M3056l2549K8867P609l7546j9872J6620m8929
10130A70648n1619j7325m1675m069R4927P2667k8647K1782J6201r021k9389q187
10118A86293l7134k0217m7293l6994k9386J2452J1225m0273K7865L1177J8262
10107G5977n3911J8168L5268K9387J1931j3837K8968j8551n1970M337M9873J9488
10095A35128k8473p1371m6299n0044l4337O0966N642k6604k5982J3283J6925P1266
$$ plain form
10178 45367 51463 56534 51012 80100 77040 104691 111766 145549 155821 177293 158762 148641 161579
10165 161579 200828 251946 224152 170821 267627 370213 401320 412272 392717 341274 309664
10154 309664 219392 245392 225693 254030 306856 361454 449933 503034 519163 516795 461368 429362
10142 429362 347453 258870 210753 213392 256448 223899 252766 260375 222829 202957 219577 170648
10130 170648 119029 101704 60029 55960 150887 223554 194907 216689 232890 223869 194480 186293
10118 186293 149159 128942 81649 44655 15269 27721 38946 -1327 26538 57715 75977
10107 75977 22066 40234 75502 104889 116820 102983 131951 113400 61430 65767 115640 135128
10095 135128 106655 35284 -11015 -61059 -95396 -34430 -28788 -55392 -81374 -68091 -51166 20100
10083B0100K4809M9609l8680n9888k8118l0336O0414J8578K5488M1375L372m7241
10071C9482j4972J9668L7486J494j4563m0838k5878m728M2851M1718l6342o9504
10059b4126k6845K1130p77R11P9744L1106k6946J981k6791l4850l5042L6761k7606
10046c1350j4948K3677K9437m861p1942o610j38M2415N1643m2233j8167Q855l3536
10033f7758J4872M0637k19J8736l0472k7274K9932j2532J7623J5695L5983o3207
10021b7984m5070J1447M177J9964p289P5094o1626p340M0229k988N195J2596O252
10008B2657k4260n808J3759M9870l942n1056k2568L670M8535n201n0078J931K055
9995b0436K0906J4578O1560P2131J1857l7252m4725J8855L840j8590j4931K3207
$$ plain form
10083 20100 44909 94518 55838 -4050 -32168 -62504 -2090 16488 41976 83351 86723 39482
10071 39482 24510 44178 81664 83158 68595 27757 1879 -2849 40002 81720 45378 -24126
10059 -24126 -50971 -29841 -30618 -29707 50037 81143 54197 56178 29387 -5463 -40505 -3744 -31350
10046 -31350 -46298 -22621 6816 1955 -69987 -76597 -76735 -34320 17323 -24910 -43077 -34222 -67758
10033 -67758 -52886 -12249 -12468 6268 -24204 -51478 -21546 -34078 -16455 -760 35223 -27984
10021 -27984 -73054 -61607 -57430 -37466 -44755 30339 -31287 -38627 1602 -1386 3809 16405 22657
10008 22657 -1603 -7411 6348 56218 52276 1220 -21348 -17678 30857 25656 -24422 -22491 -20436
9995 -20436 470 15048 76608 148739 160596 123344 78619 97474 101314 82724 67793 91000
9983I1000n3966j4232m4336j5575J9005j579j8176n014k2837J5497L9315k3738
9971c4636P252L3268l0263n3051K565L100M0945K7697O923n2668J9847J5205m271
9958a8087k9678m6110J6741q161p077J040m335L1404j2708N2517L2975k1960Q459
9945d980k0634j6756J6394Q211J4436p426M2186l297m302K3198j4565K3181L9357
9932I5003k5375K3122J4147k0688J3195n924r1339o9380j0744K9225K2925J2685
9920a3148K0231K527k7728J832J7679K7979N322m4418M0498M3040O3891J0371
9908A48076p5844m6465k4913n5251J8053K3143J3974M0895j3442p726l867N690
9896B2323O8484j1499p5015R125n688k5055l3550k5201l9278K4768n033K2963
$$ plain form
9983 91000 37034 22802 -21534 -37109 -18104 -19683 -37859 -42873 -65710 -50213 -10898 -34636
9971 -34636 -27384 5884 -24379 -77430 -74865 -71765 -30820 -3123 3800 -48868 -29021 -13816 -18087
9958 -18087 -47765 -93875 -77134 -85295 -92372 -91332 -95667 -64263 -76971 -24454 8521 -13439 -4980
9945 -4980 -25614 -42370 -25976 -17765 -3329 -10755 31431 28134 23832 47030 32465 55646 95003
9932 95003 69628 92750 106897 86209 99404 93480 2141 -67239 -77983 -48758 -25833 -13148
9920 -13148 7083 9610 -18118 -16286 1393 29372 34694 -9724 30774 73814 137705 148076
9908 148076 72232 25767 854 -54397 -36344 -13201 773 41668 28226 20500 16633 22323
9896 22323 90807 79308 4293 13418 7730 -17325 -50875 -76076 -115354 -90586 -95619 -72656
9884g2656J628L4941K8626K6945k0209L6039K7495K4643k7458k3751j9783n94
9872A5866L1675K5540K0531l0767j4400L654m1620j00241k4628l73j3463L7302
9860i0924J1972K90Q958M7912j0620K5030j5002o7876o1944M3124Q1374l796j7381
9847d8883K3467l0453j7244L1382P1655K6922O983j9141m112L1545k1041k3867
9835B7213k4223J5181O117p4292j8257K6584k0728K4338J027j0217K099M4598
9823e60J5174m144l6277n4495L2414K7272K5344o933j5067k7288m8134m9735n8381
9810b00810Q0515O1191N1661J3003k9249k740N8218L0569j0068K7313L1403l501
9798A07505m5802k0057j5169n2653p913L4387p810J3404P5674k1612p5295k3044
$$ plain form
9884 -72656 -71028 -36087 -7461 19484 -725 35314 62809 87452 59994 36243 16460 15866
9872 15866 47541 73081 93612 62845 48445 52099 10479 -89762 -114390 -114763 -128226 -90924
9860 -90924 -78952 -78662 -69704 -21792 -32412 -7382 -22384 -90260 -152204 -109080 -27706 -31502 -48883
9847 -48883 -25416 -55869 -73113 -41731 29924 56846 63829 44688 40576 72121 51080 27213
9835 27213 2990 18171 24288 -50004 -68261 -41677 -62405 -38067 -37040 -47257 -45158 -560
9823 -560 14614 10470 -25807 -80302 -47888 -20616 4728 -2205 -17272 -44560 -92694 -142429 -200810
9810 -200810 -120295 -59104 -7443 5560 -23689 -26429 31789 62358 52290 79603 111006 107505
9798 107505 61703 41646 26477 -26176 -34089 298 -7512 5892 81566 59954 -15341 -38385
9786c8385k3444J01711J8939j2435j3989j9932n3645p795J7989J6620J0628l9546
9774d3284q401j6191J1918K7663K1164P0636l5521l2399j4228q022J8130R1390
9762H2855J0551N370M5934K1659p0764k4922p1104n6487R658J8380J077P699J7056
9749c038O6158o3642j7928L235J6682l4502m3955r968L6880L0980l7960p4362
9737a31420J7094L6337K0920n305J8523K1886o7169J5921M8562K9240k6077l2480
9725e3968Q858m0862j8509k7337J8970N7187J3179J8502J1084l3530J3650j54
9713c2930N3582L1717k171J3489r2859m4651L1390N7091N706J5274k8149k749
9701D740L8234L2415j7035l434k2967o3392p0491O1150Q7505N3880j5769m4225
$$ plain form
9786 -38385 -61829 39882 58821 46386 32397 12465 -41180 -48975 -30986 -14366 -3738 -43284
9774 -43284 -51685 -67876 -55958 -28295 -7131 63505 27984 -4415 -18643 -26665 -8535 82855
9762 82855 93406 98776 144710 166369 95605 70683 -421 -56908 -47250 -28870 -27793 -20094 -3038
9749 -3038 63120 -522 -18450 -15215 1467 -33035 -76990 -86958 -50078 -19098 -57058 -131420
9737 -131420 -114326 -77989 -57069 -62374 -43851 -21965 -89134 -73213 -24651 4589 -21488 -53968
9725 -53968 -45110 -85972 -104481 -131818 -112848 -55661 -42482 -23980 -12896 -46426 -32776 -32930
9713 -32930 20652 52369 50198 63687 -29172 -73823 -42433 14658 20364 35638 7489 4740
9701 4740 42974 75389 58354 54920 31953 -31439 -101930 -40780 46725 100605 84836 40611
9689D0611k013P93j4924m360j260q468o8247l2998J5107N2601O766P1920p7116
9676b1588m9708M1921P2113J4556r24j1868r402K1714m0825q156J7643j1052M9390
9663F3814j2289n1031m9636L2683n5866k7097k166l6587k3642M7171P1015K8894
9651a4737Q904n3917p726M1035M0238O6143Q8703Q7008m6571l9780o5714o4784
9639C8802n6265p5224K64J6914J1942N1661J987m6366j227L3460l0798m8673N6133
9626d7390N1572j7678k4877N5031K7508k1803m9863k0978J0675J6166L4128J4420
9614B6911o3890O602R689J5559n2915L1413L4545j0780K983M0622K9044l8450
9602C1333l1831l739q055M1881m0824j5668K0382N8147n714o8906n7071R959O974
$$ plain form
9689 40611 38598 39391 24467 20107 18847 10379 -57868 -90866 -75759 -23158 -16392 55528 -21588
9676 -21588 -71296 -29375 42738 57294 56370 44502 35100 56814 15989 7833 25476 14424 63814
9663 63814 51525 494 -49142 -16459 -72325 -99422 -101588 -138175 -161817 -114646 -43631 -14737
9651 -14737 -5833 -59750 -67476 -26441 13797 79940 168643 255651 209080 169300 103586 38802
9639 38802 -17463 -92687 -92423 -75509 -63567 -11906 -9919 -56285 -57512 -24052 -54850 -103523 -47390
9626 -47390 4182 -13496 -38373 16658 44166 22363 -27500 -48478 -37803 -21637 12491 26911
9614 26911 -36979 -30377 -20688 -5129 -58044 -26631 7914 -2866 117 40739 69783 31333
9602 31333 -498 -4237 -12292 29589 -11235 -26903 -6521 51626 45912 -22994 -80065 -70106 -63132
9589f3132J8084k881k8919P749N869j5663M1643Q0631L8545J704j0718k7675K4505
9576F9742L1402o4108J2511n1264k1930M4885N6726q853M6026o3742j11268m4699
9564a04572J9535N5066j5273l7123L6681O2152o3377k4784L5104J3489l6252l5679
9552i5033j2882n955M1633K4990O3358j8524l5068j2740J4169J2772R180j0493
9540b4593j135j9286j1887L5172L7781K502m6581o368j2621r467L2134k9818L5465
9527a8702K5764j6185j594K2934M611j1280j8183J0702P067O364J2201j9425j2648
9514h374M347j5860J3739L6450K245l9838j03173n3211L2265N9919J5247N74J352
9501e4318K8428O5084K1551j9548n8106k1406O5864m890l8619j1651j9704j5106
$$ plain form
9589 -63132 -45048 -47929 -76848 -69099 -63230 -78893 -37250 43381 81926 83630 72912 45237 69742
9576 69742 101144 37036 49547 -1717 -23647 21238 77964 69111 115137 51395 -59873 -104572
9564 -104572 -85037 -29971 -45244 -82367 -45686 16466 -46911 -71695 -36591 -23102 -59354 -95033
9552 -95033 -107915 -113870 -72237 -47247 16111 -2413 -37481 -50221 -36052 -23280 -14100 -24593
9540 -24593 -25728 -45014 -56901 -21729 16052 18554 -28027 -34395 -47016 -56483 -24349 -54167 -18702
9527 -18702 7062 -9123 -10717 12217 16828 5548 -12635 -1933 5134 11498 23699 4274 -8374
9514 -8374 -4027 -19887 -6148 30302 32547 -7291 -110464 -163675 -131410 -71491 -56244 -55670 -54318
9501 -54318 -25890 39194 60745 41197 -16909 -38315 27549 22659 -15960 -27611 -47315 -62421
9489f2421O6440M1509m3735l0387P4057N8749O3698k3882l1760J2564m1383p8050
9477E399l5148K6197K6891M2063j5361m8224m4569N6654J0252l1019m5934j5590
9465f8389N953P2840j1803n7263k3468K6370K3053K1575n9283l485L1891K0468
9453b1541P454J7736P232L4167o398r556k8479j9909M0533J9006N9260O4785j8538
9440A45752j21000r3022R432L6361Q085K6514l7054n2226J5352L9297m09o898
9428b9816K0851m7234k7174o845l2372k7083P3176K7827L559K7329O5523O3101
9416A10842k2777m7496J7961p1685o1058n0433K9612K9864J5679L1135L3956n832
9404I768j1616m678L6469L3483J2974l1313k9959k0788K7022p849o049L2721O3281
$$ plain form
9489 -62421 4019 45528 1793 -28594 45463 104212 167910 144028 112268 124832 83449 5399
9477 5399 -29749 -3552 23339 65402 50041 1817 -42752 13902 24154 -6865 -52799 -68389
9465 -68389 -62436 10404 -1399 -58662 -82130 -55760 -32707 -11132 -70415 -73900 -42009 -21541
9453 -21541 -14087 3649 10881 45048 38650 29094 615 -19294 21239 40245 99505 164290 145752
9440 145752 24752 -68270 -58838 -22477 -14392 12122 -24932 -77158 -61806 -22509 -22918 -29816
9428 -29816 -8965 -56199 -83373 -90218 -122590 -149673 -76497 -48670 -45111 -17782 47741 110842
9416 110842 88065 40569 58530 -13155 -74213 -124646 -95034 -65170 -49491 -18356 15600 9768
9404 9768 -1848 -6526 29943 63426 76400 45087 15128 -5660 21362 13513 7464 40185 103466
9391A03466k4869j4072l84J045n2794J2781M8621M507j7774J5271O2595J8358
9379A56751m5743l9051k9792J4764K309M8067k5606p0163j2776M4523q810J348
9367C5821l2834l9665L0359N8722k6105J3085m5865k7090J1276l341j0915K9877
9355f675j6615k1825M6235L4086l7686o0703k3940R6037L7627J0061p0445r774
9343b3617K5654J2162J3471j9831m0828N938j3576l3004N1679J0826l9983O362
9331d4747M0196J8955j1202j8918k8347j1198J8005M0228J700L2763m3543L6001
9319B9893j205l4948k4014p885r081J2341k9772j2498J5288k7657M1456n733M0251
9306a3564o270m136M4442j0848K0994O7427J5294j7499k3958M257k2347j4400
$$ plain form
9391 103466 78597 64525 64141 65186 12392 25173 73794 78301 60527 75798 138393 156751
9379 156751 111008 71957 42165 56929 59238 107305 81699 11536 -1240 43283 34473 35821
9367 35821 2987 -36678 -6319 52403 26298 39383 -6482 -33572 -22296 -25637 -36552 -6675
9355 -6675 -23290 -45115 1120 35206 -2480 -63183 -87123 8914 46541 56602 -13843 -23617
9343 -23617 2037 14199 27670 7839 -32989 -27051 -40627 -73631 -21952 -11126 -51109 -44747
9331 -44747 -4551 14404 3202 -15716 -44063 -55261 -37256 2972 4672 37435 -6108 29893
9319 29893 28688 -6260 -30274 -38159 -47240 -34899 -64671 -77169 -61881 -89538 -48082 -53815 -13564
9306 -13564 -19834 -23970 20472 9624 30618 98045 113339 95840 71882 76139 53792 39392
9294C9392j7490l5815k575k3368r573J5412k3564J3017L2925k7928J4296K1348
9282c923K2015K9730j7852l6540q2359k5111J7709K8513P5552J4902p4697o2278
9270a14339M7129K9254N1153M0309N3113Q084j9789p3467o3046j5552K1565P212
9258b8374N623M173n6623n7575J2328K5351j0086J3338O8081J14280k7292m2556
9246B0668j471K9834J3459j5547r673j8851n1743R566O6650J3595k6845k2236
9234G406q732J2169O999J2353O992n1135L2878M8879n9220j7843K4826l1440n677
9221b1545j0741J3197J9413L9024N2998k5428r523K3967J7711n1404r00n3562
9209f793K2160M063K3712K5758K5043j4678l0623m9446K5866M4907k1829m2367
$$ plain form
9294 39392 21902 -13913 -16488 -39856 -49429 -34017 -57581 -44564 -11639 -39567 -25271 -3923
9282 -3923 18092 47822 29970 -6570 -88929 -114040 -96331 -67818 7734 22636 -52061 -114339
9270 -114339 -67210 -37956 13197 53506 106619 114703 94914 21447 -41599 -57151 -35586 -28374
9258 -28374 -22751 -18578 -75201 -132776 -120448 -95097 -105183 -91845 -23764 90516 63224 20668
9246 20668 19197 49031 62490 46943 37270 18419 -33324 -23758 42892 56487 29642 7406
9234 7406 -1326 10843 17842 30195 37187 -13948 18930 67809 8589 -9254 15572 -15868 -21545
9221 -21545 -32286 -19089 324 39348 92346 66918 57395 81362 99073 47669 46769 -6793
9209 -6793 15367 19430 43142 68900 93943 79265 48642 -804 25062 69969 48140 5773
9197E773j5943n956K1231N941L7515k1521K8089k4730n5609p3231J7747K4770
9185e5924J5202O6767L5705j7747l2541m7203N4606j3489k2346K4083N2077K2232
9173H1422j05460l6569j2332j9175l4433K3019P2391K7242L6379j9502J9984M2102
9161G5068k8858J6374K6246l934p0972n38M4759J0948K1489o3735o3334o741K041
9148d1187J7972m7901J8150P9169K2700r086K1756l1284k5343l5890l2793J8588
9136d5149o642k2565k7726O0141O1700Q678J2758m8313j9425o245M7181K2196
9124C6589J6887L6783n5739j5937m8042K4956l2268m7530p096j1597n0694L6929
9112a16759M9374Q815K0157P346J7335K6032m6702O575M6248k7714j7153m1034
$$ plain form
9197 5773 -10170 -16126 5105 11046 48561 27040 55129 30399 -25210 -98441 -80694 -55924
9185 -55924 -40722 26045 61750 44003 11462 -35741 18865 5376 -16970 7113 59190 81422
9173 81422 -24038 -60607 -72939 -92114 -126547 -103528 -31137 -3895 32484 12982 32966 75068
9161 75068 46210 62584 88830 84896 13924 13386 58145 69093 90582 26847 -36487 -43228 -41187
9148 -41187 -23215 -71116 -52966 26203 48903 39817 61573 30289 4946 -30944 -63737 -45149
9136 -45149 -51791 -74356 -102082 -41941 19759 28437 41195 -7118 -26543 -32788 14393 36589
9124 36589 53476 90259 34520 18583 -29459 -4503 -36771 -84301 -91397 -102994 -153688 -116759
9112 -116759 -67385 -58570 -38413 -31067 -13732 12300 -34402 -27827 18421 -9293 -26446 -67480
9100f7480O0117M1193j4079o9221l3296M5084M9873l8543Q52L9885l8449k6663
9088e0727K7503j5585m3739n905M9601K9764n2283j2491K9071k3215l1782J3817
9076h5971O19L0332m4567l1573N9416M4885L8339j1680l8663m7375m8804L944
9064a31098L1005j5330j771J2016N7299L3615j9194J439N9947K068o800K0376
9052D3572j3893K2400j2114n7285j2622K1395q98o668J4207j2088l280N4022J8185
9039E4933p341o998L79K1568J0295l7043r4154R410M9420P2611j294n7978l4202
9026b0394l5699J2633M6067K5160Q737m0582j0696j2217K3265O1654j1438k4064
9014B2426r590L3978r631m5378l4501O295M2804K1352k4277K1046M6231J6662
$$ plain form
9100 -67480 -7363 33830 19751 -49470 -82766 -37682 12191 -26352 -25500 14385 -24064 -50727
9088 -50727 -23224 -38809 -82548 -88453 -38852 -9088 -61371 -73862 -44791 -68006 -99788 -85971
9076 -85971 -85352 -55020 -99587 -131160 -71744 -26859 11480 -200 -38863 -86238 -135042 -131098
9064 -131098 -100093 -115423 -117194 -105178 -47879 -14264 -33458 -32019 27928 29996 23196 43572
9052 43572 29679 52079 39965 -17320 -29942 -8547 -9445 -16113 -1906 -13994 -17274 36748 54933
9039 54933 47592 40594 40973 62541 72836 35793 -58361 -48951 469 73080 71786 13808 -20394
9026 -20394 -56093 -43460 2607 27767 36504 -4078 -14774 -26991 -3726 57928 46490 22426
9014 22426 12836 46814 37183 -8195 -42696 -36401 6403 27755 3478 24524 70755 87417
9002H7417k3377o6956n527N361L2643O0625L232k3308l0259N657n3951n8894r577
8989g6914N0566Q3238O7233P100m0746k4813J154n1121l1685K8681L2437k8922
8977A6208j7039N7286m7948j8530k900K5809j9049o7752j3035N2651K8480j0505
8965a6324q952p831L6742k3746m64K8671n430J6279J5574n2020k0913L1775K8688
8952B2049N513k3489n5180j2536K4903n1939J1712j0415J5497K6045L9668j4765
8940b2937j5147j1202L5353J5944l0695j8015l35r906R377L6355l075k7914R0745
8927D8548n462Q4L8350J6593K781r898m9178m2742j6653m4422O3192j8356j6734
8914c3897J2348l1037l0326k2813J1621k819k6162k2207M3686R189L460L7921
$$ plain form
9002 87417 64040 -2916 -8443 -3082 29561 90186 93418 70110 39851 45508 -8443 -67337 -76914
8989 -76914 -26348 56890 124123 131223 90477 65664 66818 15697 -15988 12693 45130 16208
8977 16208 -831 56455 8507 -10023 -12923 12886 -6163 -73915 -86950 -34299 -5819 -16324
8965 -16324 -25276 -33107 3635 -20111 -20575 8096 2666 18945 34519 -17501 -38414 -6639 22049
8952 22049 27562 4073 -51107 -63643 -38740 -90679 -78967 -89382 -73885 -47840 -8172 -22937
8940 -22937 -38084 -49286 -13933 2011 -28684 -46699 -47034 -56940 -47563 -11208 -14283 -42197 48548
8927 48548 43086 43170 81520 98113 100894 90996 41818 -924 -17577 -61999 1193 -17163 -33897
8914 -33897 -21549 -52586 -82912 -105725 -94104 -96923 -123085 -145292 -101606 -92417 -88957 -51036
8902e1036K0164n972n748o8071j257k284P8706J0385n2938N987p104M2359o645
8889d3454J071r11m817L1090J6685J6359M7662J3075k9717R68K5163k2497n8764
8876h087L8089m44r618o0657m3417K2476K6797M8801M2259K0277J7935L698l3572
8863F4537Q843k7061k4214j2461M4880p693K8784J6420J2840m1451o734M444K417
8850F3551k9887l7894j9125K8308L2788o2057m1770O675Q0688L5811M736J4232
8838G6056k9495j4368j7243q1762l0889N9731m556k3333K0808K410l8488M2455
8826c8674P014k1190k331p7632k5354M3035K8974L3738O6325K2955j9820l2141
8814a5101k3790J7423N3022q386k773j7412j6740q179J8343j50j8647k4183K3071
$$ plain form
8902 -51036 -30872 -36844 -42592 -110663 -111920 -114204 -35498 -25113 -78051 -72064 -79168 -36809 -43454
8889 -43454 -42383 -43294 -48111 -17021 -336 16023 63685 76760 47043 48011 73174 50677 -8087
8876 -8087 30002 29558 19940 -40717 -84134 -61658 -34861 13940 56199 76476 94411 98109 64537
8863 64537 73380 46319 22105 9644 54524 46831 75615 92035 104875 63424 56690 61134 63551
8850 63551 33664 -4230 -23355 4953 37741 -24316 -66086 -59411 21277 57088 61824 76056
8838 76056 46561 32193 14950 -66812 -97701 -37970 -42526 -65859 -45051 -42641 -81129 -38674
8826 -38674 -31660 -52850 -55181 -132813 -158167 -115132 -86158 -52420 13905 36860 17040 -15101
8814 -15101 -38891 -21468 31554 23168 20395 2983 -13757 -21936 -3593 -3743 -22390 -46573 -23502
8801b3502K2950r412l6380J3070K812m2018l2910N0072n624j2496o0407J9559
8789a14286M7263M9294K0563j203j10L0756M7020J6492m1072K623o4064m5L8598
8776C1829k2839r637p642j3688j3271m4674L387O941L2590M1973k0402l9549k765
8763e7747L6842J1357k3056j4084L9545K5691J5925n887M880k4769l671P296m0701
8750b8379k5992k2816k0374K6456M7459J3955m2885j6599N9684J166p044j6233
8738c1602L5948L0680m8074o4978J1517K8871m0379k8139L9813L5044K3359j889
8726i829k19l6717J4173q378L307J4947J2450J0032o5038k027K4401L6823K732
8713c343j5843o203K9812l7283J898M8304M0055j848n9239j7358N547m306P2120
$$ plain form
8801 -23502 -552 -9964 -46344 -33274 -30462 -72480 -105390 -55318 -60942 -73438 -133845 -114286
8789 -114286 -67023 -17729 2834 1631 1521 32277 79297 95789 54717 57340 -6724 -6769 31829
8776 31829 8990 -647 -8289 -21977 -35248 -79922 -76535 -69594 -37004 4969 -15433 -54982 -57747
8763 -57747 -20905 -9548 -32604 -46688 -7143 18548 34473 28586 33466 8697 5026 12322 -28379
8750 -28379 -54371 -77187 -97561 -71105 -23646 -9691 -52576 -69175 -9491 -8325 -15369 -31602
8738 -31602 4346 35026 -13048 -78026 -66509 -37638 -78017 -106156 -66343 -31299 -7940 -9829
8726 -9829 -10048 -46765 -32592 -40970 -37663 -22716 -10266 -234 -65272 -67299 -42898 -6075 -3343
8713 -3343 -19186 -25389 4423 -32860 -30962 17342 57397 55549 -3690 -21048 -15501 -19807 52313
8700E2313l6108o6123j7914P084k8873J8751L66K5010M8722O2510K2190p331j21615
8687d1018O701J5261L4409n099j5610L9079l1250O202k0529l7049M7053N5507
8675E3657J0519l0719m3761j5633Q49K8597j8663o74O0948p002J9104n9908k8554
8662c1240N3828L2419j7877k2041O004N0610L1659m4839p9230p1891L94J3017
8650g9187k0257K2662L9988K1103k280m3154K9517N2974m3994j7619N5376k7259
8638a2130m3958N6611M8457l685K0479n1866n152J8225N1939K3179j8386l9951
8626D3762j3388k2905j6118m0822M816K1449p788J227l6713k502N3215k3924k5797
8613f5488R2652P2736j6045j3061k9910k952L0293M5620K0330n832K8768m2865
$$ plain form
8700 52313 16205 -49918 -67832 -60748 -89621 -70870 -70504 -45494 3228 65738 87928 80597 -41018
8687 -41018 -34317 -19056 15353 10254 -5356 33723 2473 8675 -11854 -48903 -1850 53657
8675 53657 64176 33457 -10304 -25937 -25088 3509 -15154 -15828 45120 38118 57222 -2686 -31240
8662 -31240 22588 55007 37130 15089 21093 71703 103362 58523 -20707 -92598 -92204 -79187
8650 -79187 -99444 -76782 -36794 -15691 -17971 -61125 -31608 21366 -22628 -40247 15129 -12130
8638 -12130 -56088 523 48980 45295 65774 13908 8756 26981 78920 102099 83713 43762
8626 43762 30374 7469 -8649 -49471 -44655 -23206 -30994 -29767 -66480 -68982 -15767 -39691 -65488
8613 -65488 27164 99900 83855 70794 40884 37932 68225 113845 134175 128343 157111 114246
8601A14246n3432k0670n1470J3597L1187m4938k8805Q145j2260J0835L7596P1731
8589G5762l5067j3740N5759o058k4708L3436M497J7588o696N826M7591n0579m8909
8576E4702L015J124j0790r531k3156O6820L147L10j7471o787j8640l1920N3245
8563F4068O9009K3356l2379m9607O517k342k7257J1440k1584l3965j9755R261
8551c238J0258k9242n3287j978n9644L0707N8697N3627l4126O032J569M0064L5043
8538E4482L0574L3726j4350m9960n2964l6483k1569M4414m631R281R63p410k695
8525a6622K9796P6141M0448o2015m9962l2554k7744J700Q749L7912O987m750m5779
8512c7693q949n804j0535J7626K5550K4679M3540O2763j3128r5416k369M4680
$$ plain form
8601 114246 60814 40144 -11326 2271 33458 -11480 -40285 -32140 -44400 -33565 4031 75762
8589 75762 40695 26955 82714 76656 51948 85384 89881 107469 100773 106599 154190 103611 54702
8576 54702 57717 58841 48051 38520 15364 82184 85331 85641 68170 61383 42743 10823 64068
8563 64068 133077 156433 124054 74447 80964 78622 51365 62805 41221 7256 -12499 -3238
8551 -3238 7020 -22222 -75509 -77487 -137131 -106424 -47727 5900 -28226 -22194 -20625 19439 54482
8538 54482 85056 118782 104432 54472 1508 -34975 -56544 -12130 -16761 -7480 -6517 -13927 -16622
8525 -16622 13174 89315 129763 67748 17786 -14768 -42512 -40812 -32063 5849 12836 8086 -37693
8512 -37693 -46642 -52446 -62981 -45355 -19805 4874 48414 111177 98049 2633 264 44944
8500D4944K6272L400K3325m0961l3988l9629j03084k9748N9970O9659n7110j0216
8488h7166J03335N903p4780M7776O4053j9649q125J7727j9008j9931m6468K0507
8476a5826p227O607j3057M560J4283J9603R403l5106L2883P195K2401J9240n0118
8463A4841j5831K9162L0345q243q0699j8589l4477K9343k324K6359l3780r354
8451g3247j098Q0520K4449m7086l2822K0123N9930L8463j8950j02050p6532R4656
8439c3644P7993j9500o6876l9880J180J5367L1459N7103l2800Q300j8109J4195
8427e212p585m2664J4199L3990P7931m3599q9508j6640J7884M4730L8465J0259
8415C2250K9544q127n1497k4344L3053J3428j6460k8854J4474J2597j6159O6903
$$ plain form
8500 44944 71216 74616 97941 56980 22992 -16637 -119721 -149469 -89499 -19840 -76950 -87166
8488 -87166 16169 22072 -52708 -4932 59121 39472 31347 49074 30066 10135 -36333 -15826
8476 -15826 -23053 -16446 -29503 -24943 -10660 8943 18346 -16760 16123 23318 45719 64959 14841
8463 14841 -990 28172 58517 50274 -30425 -49014 -83491 -54148 -56472 -30113 -63893 -73247
8451 -73247 -74345 6175 30624 -16462 -49284 -29161 30769 69232 50282 -51768 -128300 -33644
8439 -33644 44349 24849 -42027 -81907 -80727 -65360 -33901 23202 -9598 -1298 -19407 -5212
8427 -5212 -12797 -55461 -41262 -7272 70659 27060 -62448 -79088 -61204 -16474 21991 32250
8415 32250 61794 53667 2170 -22174 10879 24307 7847 -21007 -6533 6064 -10095 56808
8403E6808M4002J8885K1201j6229k8178M3636k9897K2635j7078k7962J1044j9690
8391G9177l1524m7282k1867J7404K3762J654l6011j1952k029K7741L6534l0611
8379D996o388N5230M7659k3671m7977r957Q186m7762j8850r332J5412J9818N1039
8366C8403K2704j3827j8391J4105M6466j4791l8130N5353l6701p3216m7810J8934
8354d6901P0447M2078K7114q7876o1210J5690M0740M3892J0886j4620N358m2605
8342B993n8099l1324O2547M6653o2444m1416k8761M0948L493M2837K4543L777
8330E747m2468j9646M9497k6765Q2352n027J135j0450L6385k2690n5122l3087
8318d0139Q8889j1979k3759k6641n0978L704N3675l4720o5442K2565M1968K0869
$$ plain form
8403 56808 100810 119695 140896 124667 96489 140125 110228 132863 115785 87823 98867 79177
8391 79177 47653 371 -21496 -4092 19670 21324 -14687 -26639 -28668 -927 35607 4996
8379 4996 -1392 53838 101497 77826 29849 19892 28078 -19684 -38534 -47866 -32454 -12636 38403
8366 38403 61107 47280 28889 42994 89460 74669 36539 91892 55191 -18025 -65835 -46901
8354 -46901 23546 65624 92738 4862 -56348 -40658 82 43974 54860 40240 45598 2993
8342 2993 -55106 -86430 -23883 22770 -39674 -81090 -109851 -68903 -65410 -22573 1970 5747
8330 5747 -36721 -56367 -6870 -33635 48717 43690 44825 34375 70760 48070 -7052 -40139
8318 -40139 48750 36771 13012 -13629 -64607 -60903 -7228 -41948 -107390 -84825 -42857 -21988
8306b1988m8759P503N6224N490m624k311j542l3246J4769L9726Q540K0024j8196
8293B1610m6116J2147o2210K2560P4006N8796m6581o7018o0098L762K5657O883
8281e6602L5623q133J4176K9992l8200q749M6422r569N9922O8325l1115j52470
8269e0378o5455M7727O5062Q1479q1367m3845l5021J684L8562M8452m8199m4417
8257h5716L3698m830K6453L2366p058j681M7996L33l2942k0356l1487J9819k9881
8244e3286m000J7845J2503k1576k2178k6455J6164k0990N2617R196K1879P6806
8232E8525n4013k4250M7447M0242p29m0363l6145k2031j59m3945j0407N86P7990
8219g252O0162k324k7121M2373R975n3381p0446K0455L7078m0070l6092m0517
$$ plain form
8306 -21988 -70747 -63244 -7020 -1530 -6154 -8465 -10007 -43253 -28484 11242 19782 39806 21610
8293 21610 -24506 -12359 -74569 -52009 21997 80793 34212 -32806 -92904 -89142 -63485 -56602
8281 -56602 -20979 -29112 -14936 15056 -23144 -31893 14529 4960 64882 133207 102092 -50378
8269 -50378 -115833 -68106 -3044 78435 -2932 -46777 -81798 -80114 -41552 6900 -41299 -85716
8257 -85716 -52018 -56848 -30395 1971 -5087 -6768 41228 41561 8619 -11737 -43224 -23405 -53286
8244 -53286 -57286 -39441 -26938 -48514 -70692 -97147 -80983 -101973 -49356 -40160 -18281 58525
8232 58525 4512 -19738 27709 67951 67222 26859 -9286 -31317 -31476 -75421 -85828 -85242 -7252
8219 -7252 52910 50586 23465 65838 75813 22432 -48014 -27559 9519 -30551 -66643 -107160
8207a07160L1837K7025k3304j7349k1805J7424M5425K780L6338M5614O1856M658
8195A03339m9402n4345p1001m5560j8555K0041J0651P7559K0749n7960k4984K7829
8183f1639q166J1752k095K0216K7746J971M9p2229j6653M496N3703J4699l5241
8170f1391m236K1136R3502P2342K9421j3967l4194n9028k0798r183k5464K626
8158i234N8150o4174M0003M719l7686J8999L1207K9113j9626k4708j6240l0440
8146a9917K7468J6191m201j7237j0760p517M1610m7073m9260k5509l1177M1225
8134h6157J7982K7423L7379n925p0250k9751M5301M3725j4191n1816l8717K602
8122a22395M8894Q1531M2596k7853Q397L8448m0837m5812k7061r917q0974j5680
$$ plain form
8207 -107160 -75323 -48298 -71602 -88951 -110756 -93332 -47907 -45127 -8789 36825 98681 103339
8195 103339 53937 -408 -71409 -116969 -135524 -115483 -104832 -27273 -6524 -64484 -89468 -61639
8183 -61639 -69805 -58053 -60148 -39932 -12186 -10215 -10166 -82395 -99048 -94552 -40849 -26150 -61391
8170 -61391 -65627 -44491 49011 121353 150774 136807 102613 43585 22787 13604 -11860 -9234
8158 -9234 48916 -15258 24745 29464 -8222 10777 41984 71097 51471 26763 10523 -19917
8146 -19917 7551 23742 19541 2304 -8456 -15973 25637 -21436 -70696 -96205 -127382 -86157
8134 -86157 -68175 -40752 -3373 -9298 -79548 -109299 -63998 -20273 -34464 -86280 -124997 -122395
8122 -122395 -73501 8030 50626 22773 31170 69618 28781 -17031 -44092 -54009 -134983 -150663
8110a50663M5609M1085n103M1018k0392J7680j6436N999M2676j8798j45N2469
8098C4999M3004K3449j0925j3860j9661r9887m3739J4124K8394L111K7731N715
8086g545K2495J1144m9854m0412J9439Q5673p133J2289M5020k7172J3675q192
8074F9427p0267q733j1017j4458N0794j617j3045j7677p8962k7845N3910M2702
8062b6788l6038P2825M9380k7951l3459p975N207J7198P968q102l124K7470p659
8049B8952m8610k3713j0992M8185M8431L2796m7764m308Q1908j8343o9402o2361
8037d5221k6910J9547k294k1875j0855O3455N7589N16n3770j9595K9217K7153
8025A6957j178l2103k0629L142k0313j7377R367j1867n6264K2389M2702M426l7160
$$ plain form
8110 -150663 -105054 -63969 -69072 -28054 -48446 -30766 -47202 -41203 1473 -17325 -17470 34999
8098 34999 78003 101452 90527 76667 57006 -42881 -86620 -72496 -44102 -40991 -13260 -7545
8086 -7545 14950 26094 -23760 -64172 -44733 40940 33807 46096 91116 63944 77619 69427
8074 69427 -840 -9573 -20590 -35048 15746 14129 1084 -16593 -95555 -123400 -69490 -26788
8062 -26788 -62826 9999 59379 31428 -2031 -10006 -4799 12399 20367 12265 9141 36611 28952
8049 28952 -19658 -43371 -54363 -6178 42253 75049 27285 22977 104885 86542 17140 -45221
8037 -45221 -72131 -52584 -54878 -76753 -87608 -24153 33436 33952 -19818 -39413 -10196 16957
8025 16957 15779 -16324 -36953 -33811 -54124 -71501 -62134 -74001 -130265 -107876 -65174 -60748 -97908
8012i7908K1441M0631r422K3554M3313N475m2563q0814K2640J797N688K0399k2949
7999f8718l276l0018k3508P683O1375Q7436r492n3543l1388p4784J9345L690J5146
7986a00052M3072N1090o506l3459P228L9276J1577K871n7758l9753J8951L9426
7974b4037K4731K6730k1951J2123j8379k2422q771K0347n1533N5542j7137m4569
7962f9326K074K4169j5078J6097l951k961L1194m5743M8474n407k7900L8121P038
7949c199l0118K3919J02685j4326k5291m0662j1665L9360K4451j5956m1730N119
7937A2587n487J2483J040k1560M720K2965k6681K733M7885l2656j06778k0308
7925a09057O5647O279j0114R22n854K8801m2092K0616Q0464M8294K723m0231j7398
$$ plain form
8012 -97908 -76467 -35836 -45258 -21704 21609 27084 -15479 -96293 -73653 -71856 -66168 -45769 -68718
7999 -68718 -71994 -102012 -125520 -117837 -56462 30974 21482 -32061 -63449 -138233 -118888 -115198 -100052
7986 -100052 -56980 -5890 -12396 -45855 -38627 649 12226 15097 -42661 -82414 -63463 -24037
7974 -24037 694 27424 5473 17596 -783 -23205 -31976 -11629 -63162 -7620 -24757 -69326
7962 -69326 -67252 -43083 -58161 -42064 -46015 -48976 -17782 -63525 -15051 -20458 -48358 -10237 -3199
7949 -3199 -33317 -9398 93287 78961 53670 13008 1343 40703 65154 49198 7468 12587
7937 12587 7100 19583 20623 -937 3783 26748 67 2800 50685 18029 -88749 -109057
7925 -109057 -43410 -37131 -47245 -46323 -52177 -23376 -65468 -44852 35612 83906 86629 46398 29000
7912B9000L213J1264K4924n6917k15r089m8533R245J7650Q236p330l206N666j1660
7898b7752k2635M3145P6663k7996n2331n737L9331K7472J6568j7962k283m494
7886D1989j9774j4279L3413k4136l7623M017P8680n8103m5777r792J6166L4595
7874f24n090N3288Q6310N3509o0870m7423L1782J2822m2367p8636l8182r06j6624
7861e3011J1914l4715K5930L8314j821l0758j1819P25K2916K2733m6217n7190
7849a12999J3709N3845O0168l246j9534k9081K0156j6225l5801m060j4373j248
7837h8689L9858M1498K781q204r918Q422r372K8154M7579R938j072l3750l3325
7824f100N4543j3275k9574r189N336j3700K1073K970k6698m716j2767K0075K0001
$$ plain form
7912 29000 32213 43477 68401 11484 11269 2180 -46353 -37108 -19458 -11222 -18552 -21758 -16092 -27752
7898 -27752 -50387 -7242 69421 41425 -10906 -16643 22688 50160 66728 48766 46483 41989
7886 41989 22215 7936 41349 17213 -20410 -16393 62287 4184 -41593 -51385 -35219 -624
7874 -624 -5714 47574 133884 187393 126523 79100 110882 123704 81337 2701 -35481 -36387 -53011
7861 -53011 -41097 -75812 -49882 -11568 -13389 -44147 -55966 -55241 -32325 -9592 -55809 -112999
7849 -112999 -99290 -45445 14723 11477 -8057 -37138 -16982 -33207 -69008 -73068 -87441 -88689
7837 -88689 -48831 -7333 -4552 -12756 -22674 -14252 -23624 4530 52109 62047 60975 27225 -6100
7824 -6100 48443 35168 5594 -3595 1741 -11959 9114 12084 -14614 -19330 -32097 -12022 7979
7811G979p2358j7711L8594P1983k620m3895J1029L2817o277K5791n5429n1204
7799f1301n035Q890N775L8645j1462N987l6337m7015m2700M3945P3025J01387
7787G3804Q254k0877J6572m1120p0185m6401K978k3889J9008k758P201K5288N8712
7774F587o423J2859L2328N912J1671l10l7805k1348L6855j0195q021k2434J3724
7761A3400J1517L7506M4327k0988p335l4144o790M3703j5304p1075n018m7269
7749e7470k6760j1733k5498J11458L9490k7484q92j1855N184n6566j1520k7799
7737a01445R1095M2288j1660j0832m9780o6057J397N3979K0292L5302J7695l3911
7725a1637j2108l7240J0888K415n7220k5136M7889J16978p380q1652L8613L1303
$$ plain form
7811 7979 -64379 -82090 -43496 28487 25867 -18028 -6999 25818 19541 45332 -10097 -61301
7799 -61301 -66336 -57446 -51671 -13026 -24488 -18501 -54838 -101853 -144553 -100608 -27583 73804
7787 73804 82058 61181 77753 36633 -33552 -79953 -76975 -100864 -81856 -84614 -77413 -52125 6587
7774 6587 164 13023 45351 51263 62934 62624 24819 3471 40326 30131 22110 -324 13400
7761 13400 24917 62423 106750 85762 78427 44283 37493 81196 65892 -5183 -10201 -57470
7749 -57470 -84230 -95963 -121461 -10003 29487 2003 1111 -10744 -5560 -62126 -73646 -101445
7737 -101445 -10350 31938 20278 9446 -40334 -106391 -104994 -51015 -30723 4579 22274 -11637
7725 -11637 -23745 -60985 -50097 -47682 -104902 -130038 -82149 34829 27449 -54203 -15590 15713
7713A5713J1691l9638k4464o170J9677j6944j3713k5973l3045L3334J7306J8938
7701d3288j4378j97j397J8817m1027m869Q8100j0999M7199J3695m5546n9623J2203
7688d1310O7582N9633q333m2537l0483R33l8932L0276L7735P149K918j3853k4115
7675F663j6583j9048q4414l4887P4792O7511N5366m6608K0801k3881m7669Q827
7663c9130J999o411r776R4578j3537j2732m7025K0813k099O546K5582L338O2917
7650H5063m26j3617j3132l0008n1553l4371M6943p981L9501P906L912M401J5992
7637E2630J2220m8497o9607j8343K3115M1294L0641O4266k9721l5645J6246O794
7625D5393k4962m8867m1475J1125M8209O8731l0968M9071k1720p8316L705L4397
$$ plain form
7713 15713 27404 -12234 -36698 -42868 -23191 -40135 -53848 -79821 -112866 -79532 -62226 -43288
7701 -43288 -57666 -57863 -59260 -40443 -81470 -86339 1761 -9238 37961 51656 6110 -53513 -41310
7688 -41310 26272 85905 77572 35035 4552 5485 -33447 -3171 34564 41713 44631 30778 6663
7675 6663 -9920 -28968 -113382 -148269 -73477 -5966 49400 2792 23593 -288 -47957 -39130
7663 -39130 -37131 -43542 -53318 41260 27723 14991 -32034 -11221 -13320 -6774 18808 22146 85063
7650 85063 84637 71020 57888 27880 -23673 -58044 -11101 -19082 20419 28325 32237 36638 52630
7637 52630 64850 16353 -53254 -71597 -48482 -7188 23453 87719 57998 22353 38599 45393
7625 45393 20431 -28436 -69911 -58786 -10577 58154 27186 76257 54537 -23779 -20074 14323
7613A4323P1984J8l4478l8274l8226l5357l6134K9986k893k3083n8102k5180M1541
7600a33875P4208J8940J6117n434n668l0900K340K6996k2086K5047M0004o112
7588d23l3082k1479q20M3429l6469L260j5826M2329K6199p2370q435N9547p697
7575b1837l413j3195O5400n8466K0538K1471K6459K4732k1880p545L8876l2486
7563C8654R835j0636k1538j0754K3523L3679l4801l2705O024k0332l6749N9719
7551C919P4876m2154q2645P590N1702j270l2353K9226O5328j2005l8367K6896
7539E0743L2244k0360l8619n3489l5620L3039O4654J5559l5127j1787q07P2967
7527G3397N4742k43r7007q9100m390L2717N2506n4210J3618P4032K1815k3242
$$ plain form
7613 14323 86307 86325 51847 13573 -24653 -60010 -96144 -66158 -69051 -92134 -150236 -175416 -133875
7600 -133875 -59667 -40727 -24610 -30044 -35712 -66612 -64272 -37276 -59362 -34315 5689 -423
7588 -423 -33505 -54984 -55804 -12375 -48844 -45584 -61410 -19081 7118 -65252 -73687 -14140 -21837
7575 -21837 -25250 -38445 26955 -31511 -10973 10498 36957 61689 39809 32264 71140 38654
7563 38654 48489 37853 16315 5561 29084 62763 27962 -4743 1281 -19051 -55800 3919
7551 3919 78795 36641 -46004 -38414 13288 12018 -20335 8891 74219 62214 23847 50743
7539 50743 82987 62627 24008 -29481 -65101 -32062 32592 48151 13024 1237 430 73397
7527 73397 128139 127896 30889 -58211 -62601 -29884 22622 -31588 -17970 56062 77877 54635
7515E4635q845J1908l0974M286N8445j1144l1538j6540R271j8295n5348K6210
7503g929K8397o366O0107M6156L0743n4296q1908l3090j1946j5749l0953n6912
7491a33746N1144L1003O6075O203o8711L6432j1470K8987R183O335l5367p6856
7479i0788M1929K9109O929N033r326N421l9224l5564j9511P3870P3257q479n9471
7466b6815L5798k0875n115P2147m2988l1107M8248Q984p975j3226j385J7460n9989
7453b6838N2685L1490o7137M1181L5644n8299j8324P8826j4501n710K3631Q3962
7441A56610m9261q3085k2028j1572n2658j7702k215K4700q662P684j2747l1635
7429a02571L2348L5926j6557k1642L4630j9239j1730k6735K5735J9983r0j8515
$$ plain form
7515 54635 45790 57698 26724 31010 89455 78311 46773 30233 39504 21209 -34139 -7929
7503 -7929 20468 14102 74209 120365 151108 96812 14904 -18186 -30132 -45881 -76834 -133746
7491 -133746 -82602 -51599 14476 20679 -48032 -11600 -23070 5917 15100 21435 -13932 -90788
7479 -90788 -48859 -19750 -12821 -7788 -17114 -11693 -50917 -86481 -105992 -32122 41135 32656 -26815
7466 -26815 8983 -11892 -17007 55140 12152 -18955 29293 38277 30302 17076 15691 33151 -26838
7453 -26838 25847 57337 -9800 31381 67025 8726 -9598 69228 54727 49017 72648 156610
7441 156610 107349 24264 2236 -9336 -61994 -79696 -81911 -57211 -65873 -58189 -70936 -102571
7429 -102571 -70223 -34297 -50854 -72496 -37866 -57105 -68835 -95570 -69835 -49852 -49942 -68457
7417f8457K0653L9549J9594K5305m0331k2111L4248m3898M2073M2747k3961J4046
7405C9457K8678k5773o6141j3169p166l423q433J2771M1142N414K6493O4828N4368
7392A49046J2637r0924r588l5324r5357m1935R951j2936l6708L6015P251j0208
7380a18080K4571m3943P9513N8435j4300k8740M5996l309l1628J0067o291n3058
$$ plain form
7417 -68457 -47804 -8255 11339 36644 -3687 -25798 8450 -35448 6625 49372 25411 39457
7405 39457 68135 42362 -23779 -36948 -44114 -47537 -55970 -43199 -2057 3357 29850 94678 149046
7392 149046 161683 70759 61171 25847 -69510 -111445 -101494 -114430 -151138 -115123 -107872 -118080
7380 -118080 -93509 -137452 -57939 496 -13804 -42544 3452 143 -31485 -21418 -27709 -80767
$$ [...]
##END NTUPLES=NMR SPECTRUM
##END=
