##TITLE=316689	cc 47202	437/60	adrs	wendyb
##JCAMPDX= 6.0         $$ Bruker NMR JCAMP-DX V2.0
##DATA TYPE= NMR SPECTRUM
##DATA CLASS= NTUPLES
##ORIGIN= Bruker BioSpin GmbH
##OWNER= nmr
$$ XWIN-NMR		Version 3.5
$$ Tue Jul 11 13:42:48 2006 GMT Daylight Time (UT+1h)  MAYBRIDGE\nmr@NMR_250MHZ
##.OBSERVE FREQUENCY= 250.131544655141
##.OBSERVE NUCLEUS= ^1H
##.ACQUISITION MODE= SIMULTANEOUS (DQD)
##.ACQUISITION SCHEME= undefined
##.AVERAGES= 16
##.DIGITISER RES= 18
##SPECTROMETER/DATA SYSTEM= dpx250
##.PULSE SEQUENCE= zg30
##.SOLVENT NAME= CDCl3
##.SHIFT REFERENCE= (INTERNAL, CDCl3, 0, 16.522)
##AUDIT TRAIL= $$ (NUMBER, WHEN, WHO, WHERE, WHAT)
$$ ##TITLE= Audit trail, XWIN-NMR		Version 3.5
$$ ##JCAMPDX= 5.01
$$ ##ORIGIN= Bruker BioSpin GmbH
$$ ##OWNER= nmr
$$ C:/u/data/dgb/nmr/ADRS/15150/pdata/1/auditp.txt
$$ ##AUDIT TRAIL=  $$ (NUMBER, WHEN, WHO, WHERE, WHAT)
(   1,<2006-01-25 10:17:31.82 +000>,<MAYBRIDGE\nmr>,<NMR_250MHZ>,
      <created by zg, POWCHK disabled, PULCHK disabled
       configuration hash MD5:
       62 19 C7 07 E1 42 D1 B7 37 6C 3D D0 77 39 F9 E6
       data hash MD5: 64K
       9A 99 5E 7C 65 0B 34 F5 D5 89 DA 1F 37 77 13 BF>)
(   2,<2006-01-25 10:17:39.09 +000>,<MAYBRIDGE\nmr>,<NMR_250MHZ>,
      <Start of raw data processing
       ef LB = 0.3 FT_mod = 6 PKNL = 1 SI = 32K 
       data hash MD5: 32K
       59 07 5B 82 07 A6 FE 82 73 C1 9E 9D 48 2E 5D 1D>)
(   3,<2006-01-25 10:17:41.35 +000>,<MAYBRIDGE\nmr>,<NMR_250MHZ>,
      <apk 
       data hash MD5: 32K
       48 E5 1B 14 BB 84 E0 1E 92 F7 72 9C B8 E8 FA 97>)
(   4,<2006-01-25 10:17:42.24 +000>,<MAYBRIDGE\nmr>,<NMR_250MHZ>,
      <abs ABSG = 5 
       data hash MD5: 32K
       0B AB BA 25 0D A6 DE 16 80 2A 68 3F EB 3F FE 84>)
$$ ##END=
$$ 
$$ hash MD5
$$ D6 99 3E FC 4F 2D 8A D2 06 E9 9B BB 8C 60 C7 0B
##$RELAX= 
##$RELAX= 
##$RELAX= 
##$RELAX= 
##$RELAX= 
##$RELAX= 
##$RELAX= 
$$ Bruker specific parameters
$$ --------------------------
##$DU= <C:\Restored>
##$EXPNO= 15150
##$NAME= <ADRS>
##$PROCNO= 1
##$TYPE= <nmr>
##$USER= <dgb>
##$AMP= (0..31)
100 100 100 100 100 100 100 100 100 100 100 100 100 100 100 100 100 100 
100 100 100 100 100 100 100 100 100 100 100 100 100 100 
##$AQSEQ= 0
##$AQ_mod= 3
##$AUNM= <au_zg>
##$AUTOPOS= <9 >
##$BF1= 250.13
##$BF2= 250.13
##$BF3= 250.13
##$BF4= 250.13
##$BF5= 500.13
##$BF6= 500.13
##$BF7= 500.13
##$BF8= 500.13
##$BYTORDA= 1
##$CFDGTYP= 0
##$CFRGTYP= 5
##$CHEMSTR= <none>
##$CNST= (0..31)
1 1 145 1 1 1 1 1 1 1 1 1 1 1 1 1 1 1 1 1 1 1 1 1 1 1 1 1 1 1 1 1 
##$CPDPRG= <>
##$CPDPRG1= <>
##$CPDPRG2= <>
##$CPDPRG3= <>
##$CPDPRG4= <mlev>
##$CPDPRG5= <mlev>
##$CPDPRG6= <mlev>
##$CPDPRG7= <mlev>
##$CPDPRG8= <mlev>
##$CPDPRGB= <>
##$CPDPRGT= <>
##$D= (0..31)
0 1 0 0 0 0 0 0 0 0.06 0 0 0 0 0 0 0.0002 0 0 0 0 0 0 0 0 0 0 0 0 0 0 
0 
##$DATE= 1138184250
##$DBL= (0..7)
120 120 120 120 120 120 120 120 
##$DBP= (0..7)
150 150 150 150 150 150 150 150 
##$DBP07= 0
##$DBPNAM0= <>
##$DBPNAM1= <>
##$DBPNAM2= <>
##$DBPNAM3= <>
##$DBPNAM4= <>
##$DBPNAM5= <>
$$ [...]
##$SUBNAM7= <"">
##$SUBNAM8= <"">
##$SUBNAM9= <"">
##$SW= 20.6930455092707
##$SWIBOX= (0..15)
0 0 3 0 0 0 0 0 0 0 0 0 0 0 0 0 
##$SW_h= 5175.983436853
##$TD= 65536
##$TD0= 1
##$TE= 293.16
##$TE2= 300
##$TE3= 300
##$TEG= 300
##$TL= (0..7)
0 120 120 120 120 120 120 120 
##$TP= (0..7)
150 150 150 150 150 150 150 150 
##$TP07= 0
##$TPNAME0= <>
##$TPNAME1= <>
##$TPNAME2= <>
##$TPNAME3= <>
##$TPNAME4= <>
##$TPNAME5= <>
##$TPNAME6= <>
##$TPNAME7= <>
##$TPOAL= (0..7)
0.5 0.5 0.5 0.5 0.5 0.5 0.5 0.5 
##$TPOFFS= (0..7)
0 0 0 0 0 0 0 0 
##$TUNHIN= 0
##$TUNHOUT= 0
##$TUNXOUT= 0
##$USERA1= <user>
##$USERA2= <user>
##$USERA3= <user>
##$USERA4= <user>
##$USERA5= <user>
##$V9= 5
##$VALIST= <valist>
##$VCLIST= <CCCCCCCCCCCCCCC>
##$VD= 0
##$VDLIST= <DDDDDDDDDDDDDDD>
##$VPLIST= <PPPPPPPPPPPPPPP>
##$VTLIST= <TTTTTTTTTTTTTTT>
##$WBST= 1024
##$WBSW= 4
##$XGAIN= (0..3)
0 0 0 0 
##$XL= 0
##$YL= 0
##$YMAX_a= 427365
##$YMIN_a= -595351
##$ZGOPTNS= <>
##$ZL1= 120
##$ZL2= 120
##$ZL3= 120
##$ZL4= 120
##$ABSF1= 16.522
##$ABSF2= -4.171173
##$ABSG= 5
##$ABSL= 3
##$ALPHA= 0
##$AQORDER= 0
##$ASSFAC= 0
##$ASSFACI= 0
##$ASSFACX= 0
##$ASSWID= 0
##$AUNMP= <proc_1d>
##$AZFE= 0.1
##$AZFW= 0.1
##$BCFW= 0
##$BC_mod= 0
##$BYTORDP= 0
##$COROFFS= 0
##$CY= 12.5
##$DATMOD= 1
##$DC= 0
##$DFILT= <>
##$DTYPP= 0
##$F1P= 14.0000005364418
##$F2P= -0.99999901652339
##$FCOR= 0.5
##$FTSIZE= 32768
##$FT_mod= 6
##$GAMMA= 0
##$GB= 0
##$INTBC= 1
##$INTSCL= 1
##$ISEN= 128
##$LB= 0.3
##$LEV0= 0
##$LPBIN= 0
##$MAXI= 10000
##$MC2= 0
##$MEAN= 0
##$ME_mod= 0
##$MI= 0
##$NCOEF= 0
##$NC_proc= -2
##$NLEV= 6
##$NOISF1= 0
##$NOISF2= 0
##$NSP= 0
##$NTH_PI= 0
##$NZP= 0
##$OFFSET= 16.522
##$PC= 1
##$PHC0= -107.4153
##$PHC1= 4.21099
##$PH_mod= 1
##$PKNL= yes
##$PPARMOD= 0
##$PSCAL= 4
##$PSIGN= 0
##$REVERSE= no
##$SF= 250.13
##$SI= 32768
##$SIGF1= 0
##$SIGF2= 0
##$SINO= 400
##$SIOLD= 32768
##$SREGLST= <1H.CDCl3>
##$SSB= 0
##$STSI= 32768
##$STSR= 0
##$SW_p= 5175.98343685301
##$SYMM= 0
##$S_DEV= 0
##$TDeff= 65536
##$TDoff= 0
##$TI= <Analysis number 999999
Compound Code 99
Book Reference 9
Project Code 9>
##$TILT= no
##$TM1= 0
##$TM2= 0
##$TOPLEV= 0
##$USERP1= <user>
##$USERP2= <user>
##$USERP3= <user>
##$USERP4= <user>
##$USERP5= <user>
##$WDW= 1
##$XDIM= 32768
##$YMAX_p= 508084964
##$YMIN_p= -755374
$$ End of Bruker specific parameters
$$ ---------------------------------
##NTUPLES= NMR SPECTRUM
##VAR_NAME=  FREQUENCY,     SPECTRUM/REAL,   SPECTRUM/IMAG
##SYMBOL=    X,             R,               I
##VAR_TYPE=  INDEPENDENT,   DEPENDENT,       DEPENDENT
##VAR_FORM=  AFFN,          ASDF,            ASDF
##VAR_DIM=   32768,         32768,           32768
##UNITS=     HZ,            ARBITRARY UNITS, ARBITRARY UNITS
##FACTOR=    0.157963299565203, 1,           1
##FIRST=     4132.6476996994, 0,             0
##LAST=      -1043.33573715361, 0,           0
##MIN=       -1043.33573715361, -755374,     0
##MAX=       4132.6476996994, 508084964,     0
$$ Real data points
##PAGE= N=1
##DATA TABLE= (X++(R..R)), XYDATA
$$ [...]
19175i1119J0397M7769J1474j8145l695L1381J9338j1937j1788P176L026j0222
19163a6345j1110o5l97Q504J1686O146l906j594j7185m185J2997J0283K145l362
19149f388R863J4373j1076l851J868j7149O841l472j6395o623Q14J5692R569K3111
19135A7177L991N593l652q846j0252j2828l809K9420r788m580Q304J8395j6328
19122A2797m955m770r631j4699j9355K942m44K3476L6299k5269j0622n973p906
19109b8110J3069Q557j0620k3161r935K2214J4125J1229J7114N521o118j5953
19097b068O638p055p904m235q636J4271l559m002Q336L917n748j7996K1386J6546
19083I891m063j2646r64k4638q388J0661J0361J5961N829k8279Q62J0925n123
$$ y = [-91119, -80722, -32953, -21479, -39624, -43319, -11938, 7400, -4537, -16325, -9149, -6123, -16345, -27455, -27520, -27917, -19413, -7727, -1581, -5487, -7081, -24266, -28451, -15454, -5171, -3026, -6388, 3475, 17848, 6772, 2921, 4789, -12360, -5519, -8991, -25386, -32009, -31195, -15503, -5934, 17177, 21168, 26761, 23109, 14263, 4011, -8817, -12626, 16794, 7006, 2426, 10730, 29125, 12797, 7842, 3072, -6559, -21258, -40613, -37671, -38115, -14639, 21660, -3609, -14231, -20204, -28110, -15041, -6484, -17104, -40265, -50200, -27986, -13861, -2632, 14482, 20003, 13885, -2068, 4570, -2485, -10389, -14624, -23260, -8989, -12548, -16550, -8214, -4297, -10045, -28041, -6655, 9891, 5828, -6818, -7782, -32420, -40808, -30147, -19786, -3825, 2004, -26275, -25413, -14488, -19611]
19070a9611p129j2039J8174L3406N274J0836j2100r281O244q485O079O77J0536
19057B2581p226Q372p130N025j1142r741k730r246r961k270N269R67J0649J1146
19043D563j4371r677L929j4484o560l824K6489L2719j7700j3462J4141J7447m4
19030A9166J1780N771m067p863j6416J892n598m101J4863N584M998R080j6877
19017A8212j8180j9826P952K539p354o954Q011j0682j064J3609K5363M894r131
19004G389N990R287j5322j7786p116J8026K843k769j6820m2458J0267M3601J3560
18991H692J4503k0825o508O890j4680j2706J3775J431K6135Q430k7636j6776P698
18978a1577K5427N485q780k928M800j3520l5188J7028L5340o093Q686K2731L348
$$ y = [-19611, -26740, -38779, -20605, 12801, 18075, 28911, 16811, 7530, 13774, 5289, 11368, 12045, 22581, 15355, 23727, 16597, 21622, 10480, 739, -1991, -11237, -21198, -23468, -18199, -17232, -6583, 4563, -9808, -19485, -15556, -30040, -36600, -40424, -13935, 18784, 1084, -12378, 1763, 19210, 19166, 30946, 36717, 32650, 24787, 8371, 10263, 4665, 564, 15427, 21011, 26009, 35089, 18212, 32, -19794, -11842, -9303, -16657, -23611, -15600, -26282, -27346, -13737, 11626, 16520, 7389, 13379, 22666, 7344, -10442, -17558, 468, 3311, 542, -16278, -58736, -48469, -4868, 8692, 23195, 2370, -4138, 2752, -11928, -24634, -10859, -9428, 16707, 25137, -2499, -19275, -11577, 13850, 19335, 10555, 7627, 12427, -1093, -36281, -19253, 16087, 9994, 18680, 41411, 44759]
18965D4759j9635j6114J2097n29k0632J943o491q936M009j255j8904K5169K6688
18952B2169J1148q516j8346o805R783J0925j434P110J7500j7110q37q194j0311
18939G082J4099J4206n217k4866o496q944J2103J2015M771m824n106L958K570
18926A5351r843m486j6355l24J8435O961j632k9160N627K1779j7061j1560M513
18913a7755K3907P332l071k962j4916J0748K289r122P115N572p360P542M661Q086
18899B2066j0985j0721J5458j2351j7672m795J5541K3976p474J445r804j9382
18887a4698k3867j4758J1370J5385L4496J9626N512q860k9575j4728m204j1245
18875c5546j1625J2146l745l738J3490N728Q375J0283O37n39j7108N028J9882
$$ y = [44759, 25124, 9010, 21107, 20578, -54, 1889, -4602, -13538, -9529, -10784, -29688, -4519, 22169, 33317, 24801, 6455, -350, 9433, 20358, 18924, 26034, 43534, 26424, 25587, 17393, 7082, 21181, 35387, 30170, 5304, -1192, -10136, 1967, 13982, 18753, 13929, 8823, 12781, 15351, 5508, 1022, -15333, -15657, 2778, 9739, 8107, -21053, -15426, 6353, -10708, -22268, -17755, 6152, 13484, 10413, 7451, -7465, 3283, 5572, -3550, 3565, 9137, 1777, 9319, 13980, 22066, 11081, 360, 15818, 3467, -14205, -19000, -3459, 20517, 13043, 14488, 4684, -14698, -38565, -53323, -41953, -26568, 7928, 27554, 33066, 24206, -5369, -20097, -24301, -35546, -47171, -35025, -38770, -42508, -29018, -23290, -14915, -4632, -3995, -4534, -21642, -16614, 3268]
18862C268J8962j2342k267L824r664N560j1203r810M70J1228m681p472o608j0351
18848c1086p520M036Q141J7444J0651r666l103N306J0596j5347j7731L738O208
18835a8333R57J6638J7481r962o300n522K095J1714k0053L392q699n590j2337
18822c4519J0892Q799R824J9560J7207j648r179J9522M162K7583O9596R1437L3883
18809B67119j7661l1666l5138j6097J1133L3537M0653M540l7751o5615n5936j5763
18797H1355r348j3273k9002j316K1099J1460N8153M5094O1345Q8304P5998J8884
18785D08753o38j7220m1198k2024M670M1506J4688j3145l8440m9399p0590n6976
18773A59987k0736k1094j5014j8234K8786P5492P9271K6373o0247p9754l8937
$$ y = [3268, 22230, 9888, 7621, 11445, 1781, 7341, -3862, -13672, -13202, -1974, -6655, -14127, -20735, -31086, -38606, -34570, -26429, -8985, 1666, -8000, -11103, -5797, 4799, -10548, -28279, -24541, -18333, -17376, -738, 16743, 6781, 481, -5041, -2946, 8768, -11285, -7893, -16592, -22182, -34519, -23627, -14828, -5004, 14556, 31763, 30115, 20936, 40458, 44620, 72203, 141799, 233236, 267119, 249458, 217792, 182654, 166557, 177690, 211227, 251880, 256420, 218669, 153054, 97118, 81355, 72007, 58734, 29732, 28416, 49515, 60975, 119128, 164222, 225567, 313871, 389869, 408753, 408115, 390895, 349697, 327673, 332343, 373849, 388537, 375392, 336952, 287553, 216963, 159987, 139251, 118157, 103143, 84909, 113695, 189187, 268458, 294831, 234584, 154830, 115893]
18762A15893m7490l4784J747L297J850K8286M090N5396O6597M6896n9j4184o307
18749B21228k9560n297J8263K7778Q460j6459n1894n4723m3895k9335J06j5691
18737B8981K4170J5582k6455k5266j6966N636J9255N261j6879J4327J1045j7271
18725B1420k903k284o885j00J4357p469k5056k4029O49N634L1714J7920k934J820
18711B1854q47J4858j625J0168R342Q713P207K3715j1919l4907k3359N463K6564
18698E5227K7307L347N675o827L5824K5125O6740J11268J40800K17617K20217
18687I02320J07516p9486k37641k30158j19618p0484j9510P593m2226o0142l1876
18676A26288j6049p560q063l678L6401N7354L4051k7661m7637m3059l2196J1043
$$ y = [115893, 68403, 33619, 35366, 38663, 40513, 68799, 72889, 128285, 194882, 241778, 241719, 227535, 221228, 191668, 186371, 204634, 232412, 240872, 224413, 172519, 117796, 73901, 44566, 44672, 28981, 53151, 68733, 42278, 17012, 46, 5682, 24937, 30198, 13319, 27646, 38691, 21420, 18517, 16233, 9348, 9248, 23605, 16136, -8920, -32949, -32300, -26666, 5048, 22968, 20034, 21854, 21007, 35865, 34240, 44408, 53750, 62463, 69670, 93385, 81466, 46559, 23200, 28663, 55227, 82534, 85881, 91556, 84729, 120553, 145678, 212418, 323686, 464486, 682103, 902320, 1009836, 930350, 692709, 462551, 342933, 272449, 252939, 260532, 218306, 158164, 126288, 110239, 102679, 94616, 90938, 127339, 184693, 218744, 191083, 143446, 100387, 68191, 79234]
18664G9234L4572K6950N5341J8204n4817m7421k5266j5201n815j2214j7969J922
18652C7520j3852J7629J1828k3505j5552K639K0421j4726l078m596p91O443m303
18639A6077j6094q117Q527R631J1287L777j4719M551L430J8261R931o024k334
18626C8184K3948n750k5110k9083r151m695M21L503K53M612K1481Q88K628j387
18612B0742k1085J3705L1369o56k0655j3247j0325p117J3251J0318j2877L195
18600F618J2693j7867l5012J9560J5940q665k1018j6074l631J2857j828j0380
18588d6807J1452J7444J2946K0990K3640J1697J0503K2761J1881j4895j0477O06
18576G1741j245O84Q425K013j1324n442j8749n280N906l4491L227J6852J5882
$$ y = [79234, 113806, 140756, 196097, 214301, 159484, 112063, 86797, 71596, 65781, 53567, 35598, 37520, 23668, 41297, 53125, 29620, 14068, 16707, 37128, 22402, 19324, 14728, 13937, 20380, 16077, -17, -8134, 393, 10024, 21311, 25088, 10369, 14920, 18350, 36611, 46542, 40518, 38184, 62132, 56382, 31272, 2189, -6962, -11657, -11236, -7733, -7480, -2868, 18613, 19501, 22129, 20742, -343, 13362, 44731, 44075, 23420, 10173, -152, -7269, 5982, 16300, 3423, 6618, 19311, 1444, -33568, -14008, 1932, -6733, -27751, -43825, -47456, -34599, -36427, -46807, -35355, -17911, -4965, 16025, 39665, 51362, 61865, 84626, 96507, 81612, 71135, 71741, 70496, 71180, 79605, 81618, 70294, 64852, 46103, 40823, 46729, 12238, 15465, 32317, 48199]
18563D8199k0642j5040J1396j048M531P107k854r605r245J0256Q696J2708J3107
18550E7566o225j907o857l245j9877P776J6056l904r251j8798K1299M159j0119
18537B6673k528J6681M408j9544r325J3575O626K3605J2763j4422p89j5999l2279
18524I445n475j73j281K3709Q796J419j211P679K1185l671q560J861L390r809
18510D7304o132j3029l364n181K0858n87L688o854J4582L372j8918R045K2129
18497F6913o722j6519p425k6265n555J4137J3079L0231K993k1528k1830j9173
18485B336j3312J8472K1240r436l720P277N913j6547k046r366M746r424P817N463
18471I413q18J913M887K868M827J7048M643l937q81J4651o30J1557j0335J21j7698
$$ y = [48199, 27557, 12517, 23913, 22865, 27396, 34503, 31649, 22044, 12799, 23055, 31751, 44459, 57566, 51341, 49434, 42577, 39332, 19455, 27231, 43287, 39383, 30132, 11334, 32633, 36792, 26673, 24145, 40826, 45234, 25690, 16365, 29940, 36566, 60171, 72934, 58512, 57723, 41724, 9445, 3970, 3797, 2516, 26225, 35021, 36440, 35229, 42908, 64093, 60422, 51862, 53723, 57113, 47304, 41172, 28143, 24779, 19598, 40456, 39869, 43557, 36703, 51285, 54657, 35739, 44784, 66913, 60191, 43672, 36247, 9982, 4427, 18564, 31643, 61874, 64867, 43339, 21509, 2336, -10976, 7496, 28736, 19300, 15580, 22857, 28770, 12223, 10177, 811, 5557, -3867, 3950, 9413, 8595, 10508, 15395, 18263, 23090, 40138, 44781, 40844, 39963, 54614, 53984, 65541, 55206, 55327, 37629]
18456C7629P321j2027k406K9448J2440l994J5885k4581m6128l298M031K3405l1858
18443E867j2343Q170J9568J8454p99J944J7376O336O807L4021M4241K0818j2218
18430A58242k5957j885P025j0132j833L4226K8235j2057o1386k9688j5882j7445
18418E1463j672j489J6850J3933J0211q928k1902n332J5825j2723N45p103j1154
18405C8524r59K1708P9099O8696Q1138J5198n3030p5827k9696j1374M0931M3584
18393B17992O293R661l4889p7360m4930O046K4304L6044J2445O77O937M672J051
18380A68943M937j0412p309k8754k9655M205K5245P235j322O842M677o322L0418
18367A68728J5046K034j2153j4088L0357O7360M9256M4162J4917j6591q1345p1865
$$ y = [37629, 44950, 32923, 30517, 59965, 72405, 68411, 84296, 59715, 13587, 10289, 14320, 37725, 5867, -6476, 1694, 21262, 39716, 38917, 40861, 58237, 64573, 71380, 105401, 149642, 170460, 158242, 132285, 130400, 137425, 127293, 125460, 159686, 187921, 175864, 114478, 84790, 68908, 51463, 49791, 48302, 65152, 79085, 89296, 80368, 58466, 53134, 68959, 56236, 56781, 49678, 38524, 37565, 59273, 138372, 207068, 288206, 303404, 250374, 174547, 144851, 133477, 174408, 217992, 224285, 233946, 199057, 121697, 76767, 82813, 107117, 143161, 155606, 156283, 163220, 167892, 168943, 173880, 163468, 156159, 127405, 97750, 101955, 127200, 134435, 133113, 139955, 144632, 138310, 168728, 183774, 185808, 173655, 159567, 189924, 257284, 306540, 350702, 365619, 349028, 267683, 195818]
18355A95818j0801K8220L1394K7574K0547j5425l3065l8731j8568J8082k1239
18344A83806j3071r328J4232J0189J5820J6383R900J7956J0283K921K8056L7112
18332C24259M7088J13116J49151J17961K1088j15005j39327q5027L01l021M157
18321D34741K2762Q050K2138N8365N1052K2055P2847J41149J93461K62870K83009
18310A572499J49870o2602j79357j24944J6420J81170K78525K80937J09861l4155
18300B188224n1496R8295J91333K22636K42107K00534K47172M82279Q69832J391828
18290F082744K190533L632413O164463R279644R922005M657525l714323p820277
18282C0394727n408356J0552N887726R852263P531318j697283j0362327j1757755
$$ y = [195818, 185017, 213237, 244631, 272205, 292752, 277327, 244262, 205531, 186963, 205045, 183806, 170735, 161407, 175639, 185828, 201648, 218031, 227931, 245887, 256170, 259091, 287147, 324259, 371347, 484463, 633614, 751575, 772663, 657658, 518331, 433304, 433605, 430584, 434741, 457503, 465553, 487691, 546056, 597108, 619163, 692010, 833159, 1026620, 1289490, 1572499, 1722369, 1659767, 1480410, 1355466, 1371886, 1553056, 1831581, 2112518, 2222379, 2188224, 2136728, 2235023, 2426356, 2648992, 2891099, 3091633, 3338805, 3821084, 4690916, 6082744, 8273277, 11905690, 18070153, 27349797, 37271802, 41929327, 38215004, 30394727, 24986371, 24996923, 30884649, 40736912, 48268230, 46570947, 36208620, 24450865]
18274B4450865q242598m662491k425579j156311k74386L89610J086122K117075
18266A1282307L947397P141593J0568908J0074996K919275n844794q585787m894378
18258B6609517J247278P529001J0747349O134421m708731j2516050j2345565q294877
18250A4402343m784366k669377j505701r20205o15355m96109m39262m47245l59522
18241B165201j94388p0915m1351o0994q8113j03170r8990m3575k0408m7103j8778
18230A377416K5476L8597j9174q9567p9166m4201L0406R4392R9123M8933m8525
18219A433710p5668j7732M8979P1111L7795M0648P7719J48752K41280L37303M01851
18208B745748M36753N47681Q35588J294454J866070K796566M763642Q331902J1541215
$$ y = [24450865, 16208267, 11545776, 9120197, 7963886, 7689500, 8079110, 9165232, 11282307, 15229704, 22371297, 32940205, 43015201, 45934476, 40089682, 31503895, 26609517, 27856795, 35385796, 46133145, 52267566, 47558835, 35042785, 22697220, 14402343, 9617977, 6948600, 5442899, 4522694, 3907339, 3411230, 2971968, 2524723, 2165201, 1970813, 1899898, 1858547, 1797553, 1709440, 1606270, 1507280, 1463705, 1443297, 1396194, 1377416, 1402892, 1441489, 1422315, 1332748, 1253582, 1209381, 1239787, 1334179, 1433302, 1482235, 1433710, 1358042, 1340310, 1389289, 1460400, 1498195, 1538843, 1616562, 1765314, 2006594, 2343897, 2745748, 3182501, 3730182, 4565770, 5860224, 7726294, 10522860, 15286502, 23618404, 35159619]
18199C5159619R169521N7103q120190q811341m462147J054126O212936P805608
18191C8065235K357970o386520j0398920q410222n054075k718602j455023q44400
18183E155443n88103l96658k27545q6820K5497K07006L15331L75164N43640Q68727
18173F191682J403226K083178L060748N111284R036955J3354647J2336572K524639
18165E5102931q614986j1445693o809248k88230N933118Q891937M323595n572733
18157D1520691j1812805j0616842o728899l757714k062693j252853q37115n97205
18149C854565m43282l20390k75354k14803j00198m9045l7855J414P112L5422Q5721
18138B543307J59250K13541K59574K50215J42504N6994J06512K42539L42497M22900
$$ y = [35159619, 44329140, 44386243, 36266053, 27454712, 22992565, 24046691, 30259627, 38065235, 40423205, 34036685, 23637765, 15227543, 10173468, 7454866, 5999843, 5155443, 4567340, 4170682, 3943137, 3856317, 3881814, 4088820, 4404151, 4779315, 5322955, 6191682, 7594908, 9678086, 12738834, 17850118, 26887073, 40241720, 52578292, 55102931, 46487945, 35042252, 28233004, 27944774, 33877892, 42769829, 47093424, 41520691, 29707886, 19091044, 12362145, 8604431, 6541738, 5288885, 4451770, 3854565, 3411283, 3090893, 2815539, 2600736, 2500538, 2451493, 2413638, 2415052, 2422164, 2457586, 2543307, 2702557, 2916098, 3175672, 3425887, 3568391, 3625385, 3731897, 3974436, 4316933, 4739833]
18128D739833M86752O45804Q02712R17674J161298J748838K835729M522558P186525
18119B5047723J1894861K0499192L3082924M1655365L0991483q34617l1211503
18112A31125428l8699970k6979763j0451735J883907L318836o064936j4475717
18105C9656050j3665235q583053m628497k519540j617032j271189j110674r16546
18097E344284o85306m84423l17154j84895k11349l31014l90036l86106k92144
18088B061857k37598j83215j33679j04830n8780m1616l6899l1667l718k2801o7098
18077A139956m3421o3845q0735k8271j9692l6278m8583l8158k9362r549J6788
18066G58850M3430O0487P4209P6191L7083n571l3358m4099l4913n0239m3586l7874
$$ y = [4739833, 5226585, 5872389, 6675101, 7592775, 8754073, 10502911, 13338640, 17861198, 25047723, 36942584, 57441776, 90524700, 132180065, 163171548, 162336931, 131125428, 92425458, 65445695, 54993960, 56877867, 60196703, 54131767, 39656050, 25990815, 17407762, 12779265, 10259725, 8642693, 7371504, 6260830, 5344284, 4658978, 4174555, 3857401, 3672506, 3461157, 3130143, 2740107, 2354001, 2061857, 1824259, 1641044, 1507365, 1402535, 1343755, 1302139, 1265240, 1233573, 1229855, 1207054, 1139956, 1096535, 1032690, 951955, 923684, 903992, 867714, 819131, 780973, 751611, 742062, 758850, 802280, 862767, 936976, 1013167, 1050250, 1044679, 1011321, 967222, 932309, 882070, 838484, 800610]
18054H00610m3157o6915k8771m2230n4941m7494j6556k4091j3507m616j2555M497
18042D50274J4064k9023k1029n911l1127k2689Q62Q740O328k4432j6478k6905
18030C02674m886J3424K0423k983k3438k2446R898K4529j365J6933L0539J8126
18018C81428j8371n2941l1042J4985K219R819R451J5357j800M036K2065J6904
18006C72110J9399J9854O4388P7861N1274M8800P5946O8953O5038M2690O0746
17995I67059O3904K0700m437P690J4159J5353m7374q6755r4048o7566q5584p2108
17983F30993o8634p9961o0027n5025l8908l6950k7058l1642M062J4626L8599L5099
17971C25174m288k4239k3716j2489o776l124J831K7925K8442L2299J4649K2248
$$ y = [800610, 757453, 690538, 661767, 619537, 564596, 517102, 500546, 476455, 462948, 458332, 445777, 450274, 464338, 435315, 414286, 408375, 377248, 354559, 355421, 364161, 370489, 346057, 329579, 302674, 297788, 311212, 331635, 328652, 305214, 282768, 292666, 317195, 315830, 332763, 363302, 381428, 363057, 310116, 279074, 294059, 296278, 306097, 315548, 330905, 329105, 333141, 355206, 372110, 391509, 411363, 475751, 553612, 604886, 653686, 729632, 798585, 863623, 906313, 967059, 1030963, 1051663, 1047226, 1054916, 1069075, 1084428, 1037054, 950299, 856251, 788685, 703101, 630993, 562359, 482398, 422371, 367346, 328438, 291488, 264430, 232788, 236850, 251476, 290075, 325174, 320886, 296647, 272931, 260442, 253666, 250542, 252373, 280298, 308740, 341039, 355688, 377936]
17959C77936J6035n122r96R529k842j2168j3731L3724N7284M6062J4933J6272
17947E36916l201j7467j2535j6868l9L3317K3916M968k2260k8440l6115n8787
17935D03405l3593l0333j8168q711K3787Q468k170L5539J11652J73688K68818
17924I32382M60005P44628R43043O99137m5873p53600r51066p01794m23833k46239
17914F56790j30350p9881m6714j5951k8293r647k2184j5101J700Q47n943k2578
17902B82695j0447n415J0208J2748m305j4273k1049N614j2495j4625K2488J5595
17890B66739J4693j551j110J6580R798M555K1169J6925N5165R8663J00923M3064
17878F45613k3365o0644n6915j0210M9522M0061O6786R3541J19180Q6250J4499
$$ y = [377936, 393971, 388849, 387853, 397382, 394540, 382372, 368641, 402365, 459649, 505711, 520644, 536916, 533715, 516248, 503713, 486845, 486806, 520123, 544039, 549007, 526747, 498307, 462192, 403405, 369812, 339479, 321311, 312600, 336387, 344855, 342685, 378224, 489876, 663564, 932382, 1392387, 2137015, 3080058, 3779195, 3733322, 2979722, 2028656, 1326862, 903029, 656790, 526440, 446559, 399845, 383894, 355601, 345954, 323770, 308669, 310369, 311216, 305273, 282695, 272248, 266833, 277041, 289789, 285484, 271211, 250162, 255776, 243281, 228656, 251144, 266739, 281432, 279881, 278771, 295351, 305149, 309704, 330873, 347798, 402963, 501626, 602549, 645613, 622248, 561604, 504689, 494479, 544001, 584062, 650848, 744389, 863569, 949819, 964318]
17867I64318O8446Q9201L1552K7375N2090J09843J63008K15641K95820M21804
17857B439098N86253Q22366J192688J724648K449581L931788P145035J1840795
17849C2132252J3474860N956084o909508j3672562j1501723p027430l842418k101753
17841F507802j257627p37930m39789k08738n5095N3741K10964M56287P74098J202057
17831F505770J710055K447090M096168P413602J1503814J1376543K872265q036233
17823C9889074j1597476q134192l712236j19866L527411P916913J0656988O382937
17815D4809553l983804j1206139j0529311o733813l753579k031254j184971p66984
17807D619698n42462l70509k41951p6863N5394J91815M65550Q42797J267065J790107
$$ y = [964318, 1032764, 1121965, 1153517, 1180892, 1232982, 1342825, 1505833, 1721474, 2017294, 2439098, 3025351, 3847717, 5040405, 6765053, 9214634, 13146422, 20291457, 32132252, 45607112, 51563196, 44653688, 30981126, 19479403, 12451973, 8609555, 6507802, 5250175, 4512245, 4072456, 3863718, 3808623, 3862364, 4073328, 4529615, 5303713, 6505770, 8215825, 10662915, 14759083, 22172685, 33676499, 45053042, 47925307, 39889074, 28291598, 20157406, 16445170, 16325304, 19852715, 27769628, 38426616, 44809553, 40825749, 29619610, 19090299, 12356486, 8602907, 6571653, 5386682, 4619698, 4077236, 3706727, 3464776, 3387913, 3443307, 3635122, 4100672, 4943469, 6210534, 8000641]
17797H000641K928581N397465Q992448J0146157M175163n805944j0807050q865748
17789A4161713n342993k944934j626930r34180n65129m21620l89492k95090k18520
17780A422825j48118q3524l0433k3547o0720q5974q7348n3277j4814j5320l2631
17769G87119o0822p9899o0906m6601l8239J7347M0475M9661r838n3022n2754l9798
17757D52723l6199k0319P423N6912O0605L7642P067m0934m1334n9045k2305J8807
17745D21043N2119M0551q024m8838r0960n9496l8819l9063k9888j3K2338r237
17733B11713k4433J9051M3734M5576M2173L085m3723m2856j3161M646J6308K5248
17721B87361K4278j8934l8626m7158j1776n495k6254k2380k0100l743N698O277
$$ y = [8000641, 10929222, 16326687, 25319135, 35465292, 39640455, 33834511, 23027461, 14161713, 8818720, 5873786, 4246856, 3312676, 2747547, 2325927, 1936435, 1641345, 1422825, 1274707, 1191183, 1160750, 1137203, 1076483, 990509, 903161, 849884, 835070, 819750, 787119, 726297, 646398, 585492, 538891, 500652, 517999, 558474, 608135, 598297, 545275, 492521, 452723, 416524, 396205, 403628, 460540, 521145, 558787, 565854, 524920, 483586, 424541, 402236, 421043, 473162, 513713, 505689, 456851, 365891, 306395, 267576, 228513, 198625, 198612, 220950, 211713, 187280, 206331, 250065, 295641, 337814, 340899, 297176, 254320, 241159, 245805, 262113, 287361, 311639, 292705, 254079, 206921, 195145, 189650, 163396, 141016, 120916, 117173, 122871, 129148]
17709A29148j9823k0178j218l316O396K343J6034L054P89p036r269p113P213k755
17695I4269j4780R256L7688J0589N134j1358j0223l165j2165J617j9935j9791
17683F7136L028M086J679J5466N910p223J721l922L081k07j4762K465K9033J5691
17669A23182j4451l608l7137k2574L728j12L587J1107k404q716m578J9899k631
17656F5292k0924j9026L255J4297J4042j3758m144p167j9J3460K9764J7702j4573
17643G8201m593k2402K05j3152J9531J8052R534J391k9012r625n448L81l28q972
17629C3763N60k574K940l286o238M367J6829Q002o677J1913n994n924l193J2j9893
17614B4607j798K3986J8827J0753N141L664R186J2763L8021O4707N9047K7778
$$ y = [129148, 109325, 89147, 87929, 84613, 91009, 93352, 109386, 112440, 113229, 106193, 96924, 89811, 97024, 94269, 79489, 88745, 126433, 137022, 142156, 130798, 120575, 117410, 105245, 106862, 86927, 67136, 70164, 74250, 75929, 91395, 97305, 90082, 91803, 87881, 90962, 90755, 75993, 78458, 107491, 123182, 108731, 105123, 67986, 45412, 49140, 49028, 52615, 63722, 61318, 52602, 48024, 67923, 65292, 44368, 25342, 28597, 42894, 56936, 43178, 39034, 31867, 31848, 45308, 75072, 92774, 78201, 73608, 51206, 51411, 38259, 57790, 75842, 85376, 86767, 57755, 48130, 42682, 43063, 42735, 33763, 34323, 31749, 34689, 31403, 25165, 29532, 46361, 54363, 47686, 59599, 53605, 47681, 44488, 44500, 24607, 22809, 46795, 65622, 76375, 81516, 85180, 94366, 107129, 145150, 209857, 268904, 296682]
17602B96682J5440l0562m1452j9007R562J6814L3043P411k0529n8102p6453k0427
17590A12420m45j4807j3017j7775m882j4484Q665J8271j039j5882j0794J1945
17578E8176R979K950n14J5814J6367K4783P2254M9375o301o1599k8610L270K1932
17565A77876L3098L5239J5755k4952n7902m5272m3172l5539j2735j065k885J6710
17553E5156J1397k8J6874M875j017j8034R005J1160j666N251J7238L5263O0028
17540B05502Q4151J32989J98393J82985Q2255p6618j75502j91112j53412q7785
17530B01846l2898q125l8094k448J6857N018j2923m7421k9470k2509j5024k965
17518A1844M955K0024K4519P687P481j1452Q72j8631l8374m428m812L513L3558
$$ y = [296682, 312122, 281560, 240108, 221101, 230663, 247477, 280520, 287931, 267402, 209300, 132847, 112420, 111975, 97168, 84151, 66376, 61494, 47010, 55675, 73946, 72907, 57025, 46231, 58176, 68155, 71105, 70591, 86405, 102772, 127555, 199809, 249184, 242883, 181284, 152674, 155944, 177876, 210974, 246213, 261968, 237016, 179114, 133842, 90670, 55131, 42396, 41331, 38446, 55156, 66553, 66525, 83399, 88274, 87257, 69223, 78228, 89388, 87722, 92973, 110211, 145474, 205502, 289653, 422642, 621035, 804020, 886275, 809657, 634155, 443043, 289631, 201846, 168948, 160823, 122729, 120281, 137138, 142156, 129233, 81812, 52342, 29833, 14809, 11844, 16799, 36823, 61342, 69029, 76510, 65058, 65930, 47299, 8925, 4497, -315, 3198, 36756]
17505C6756J7557N007j5J0560K1222J4421j9168p715J2792j6291j0073m54j2868
17492E1731l3078j7728Q350P592R411R804J1286k0794j2718J3185K0966k60M68
17479D8215o756k8555j0837P57J7807l954q353n575O559p876K670J6120R380k354
17465B7248Q875J3878k0407j3319K423L144J7732p307Q852J4000j2575j4010K231
17452C0765j0446j312j1472J234Q488J3122L1315l535K6462O1511N7305r99m4082
17439A58356o4353l7807k1747j6543j5883O545p095r859O072P277r235m870J0642
17426A500K7972K352o074k16r750p026N879Q902R635J3987m347j664p233q26o804
17411B6287J3325j0569k8n380l0509j8823K4423J1468j166q48J1595O396j3176
$$ y = [36756, 54313, 59320, 59305, 69865, 91087, 105508, 86340, 78625, 91417, 75126, 65053, 64599, 51731, 18653, 925, 9275, 16867, 26278, 36082, 47368, 26574, 13856, 27041, 48007, 47747, 48215, 41459, 12904, 2067, 2824, 20631, 16677, 8324, 2749, 9308, 1432, 4102, 20222, 29602, 27248, 36123, 50001, 29594, 16275, 18698, 21842, 39574, 32267, 41119, 55119, 42544, 28534, 30765, 20319, 19007, 7535, 8769, 17257, 30379, 61694, 58159, 84621, 146132, 203437, 202438, 158356, 94003, 56196, 34449, 17906, 2023, 8568, 1473, -8386, -2314, 4963, -4272, -9142, 1500, 29472, 31824, 25750, 25534, 15784, 8758, 14637, 23539, 33174, 47161, 42814, 41150, 33917, 33091, 26287, 39612, 29043, 29015, 23635, -6874, -25697, -1274, 10194, 9028, 8180, 19775, 26171, 12995]
17398A2995j6228K2338K2652j9773m776K84L625P070P543p584m26p304k1827J1073
17384I662n615J6260J0613n550N826q32J3566J4993p549M735j7637l3532J0520
17371A5460K822j4682l717J7640J0477K3939L183k2564k4346l627L084m239J0160
17358A3590L8621K1266l5333k0574l2054k079J1910J3817M588p227k326P05K858
17345G762j0646q615K0332J0444l704r639j3143K101J2104K79r006o423N808p780
17331a0126J4178J1689J594K2995n00N731k858P68j3312J0015J7705J736K340
17318F1955p65j147J7571K2923M4093P4294M0213k668q7748q0528j6415j5669
17306E6109k4425j2928J0885J1468j5372k53l683J4162K2591j2288j7853J7781
$$ y = [12995, -3233, 19105, 41757, 21984, 17208, 17492, 21117, 28187, 35730, 28146, 27720, 20416, -1411, 9662, 4047, 20307, 30920, 25370, 31196, 30364, 43930, 58923, 51374, 56109, 38472, 4940, 15460, 18282, 3600, -117, 17523, 28000, 51939, 55122, 32558, 8212, 4585, 7669, 3430, 13590, 52211, 73477, 38144, 17570, -14484, -16563, -4653, 9164, 13752, 6525, 4199, 4904, 7762, -2884, -11499, 8833, 19277, 15573, 5934, -7209, -5108, 6996, 7275, -1731, -8154, -2346, -10126, 4052, 15741, 17335, 40330, 39830, 45561, 42703, 43471, 30159, 40174, 57879, 59615, 61955, 61190, 60043, 77614, 100537, 144630, 218924, 259137, 256469, 168721, 88193, 71778, 56109, 31684, 18756, 29641, 41109, 25737, 25484, 21801, 35963, 58554, 46266, 28413, 46194]
17294D6194K0020K7851L3497L8402N4222N2099j5696o7434m8760j4427o377J4101
17282A33692M2434M2211L3723k1536o9168n5131n0199j5967m345j1532N491P684
17270C7357O758M462j6369J5475m18J8674K5610k3399j3118J0722L4668N6513
17258A56935L9271K3755q741n6582m9928l8193l4908o388J4867R844r270j4586
17246B6076J5392j9246j8069q02O176J8377K901L3814J1859p012O750k3780j6987
17233C5449k8466q922r521J1195K8794P155j4608k5637k1945M366K1500N580j7958
17220a3018l4589j203M0541K7714K85l780k1686O243K5518j4780k0625J5688M762
17207A1070J917k875r442O330N775r054m799m04R109J2984K932J878K669J224
$$ y = [46194, 66214, 94065, 127562, 165964, 220186, 272285, 256589, 189155, 140395, 125968, 119591, 133692, 176126, 218337, 252060, 230524, 161356, 106225, 56026, 40059, 35714, 24182, 29673, 37357, 44115, 48577, 32208, 47683, 47265, 65939, 91549, 68150, 55032, 65754, 100422, 156935, 196206, 219961, 211220, 154638, 104710, 66517, 31609, 25221, 40088, 49932, 40662, 26076, 41468, 22222, 4153, 3351, 9527, 27904, 30805, 64619, 76478, 69466, 76216, 52436, 35449, 6983, -1939, -11460, -265, 28529, 35684, 21076, -4561, -26506, -22140, -640, 4940, -13018, -47607, -48810, -8269, 19445, 19730, 15950, -5736, 507, 26025, 11245, -9380, 6308, 11070, 12987, 10112, 670, 7000, 12775, 3721, -1078, -1482, 7627, 20611, 23543, 25421, 28090, 29314]
17193B9314p706M705j1289J8854L0545J188j8842M661k8079k4333q006J3487J9940
17180B4439M998k5058M413j6245j3061J4669m363M883Q675j1011p850J3992p030
17167h549N69J6079J2503k80K3818M095o477j9002j4836k5769K0301K1549m151
17154A9850l0457o884p208R363J9527L815J060J5051J7588L082r794k8875k242
17141C876R078l957q186N942j0737P5K9543M93k043l251N488j2549k063J545j589
17126A1665j8788k68K0515J5636j5320O049j4870j972k281j1898J636n908K11
17113a5593M892n833m66L330L729J569k426q510J4801M625o198l229n453R570
17099e192M735r238R703K3175j5468K561r879P010J8260J2424n787l054k0670
$$ y = [29314, 21608, 26313, 15024, 33878, 64423, 65611, 46769, 51430, 23351, -982, -8988, 4499, 24439, 29437, 4379, 8792, -7453, -20514, -5845, -10208, -5325, 3350, -7661, -15511, -1519, -8549, -7980, 8099, 20602, 20322, 44140, 48235, 41758, 22756, 7920, -17849, 2452, 24001, 19850, -10607, -17491, -24699, -15336, 4191, 8006, 9066, 24117, 41705, 44787, 34993, 6118, 3876, 12954, 8997, 811, 6753, -3984, -3909, 25634, 26127, 24084, 20833, 26321, 13772, 11709, 13254, 11665, -7123, -7391, 13124, 28760, 13440, 19489, 4619, 2647, 366, -11532, -9896, -15804, -15593, -10701, -16534, -17000, -13670, -9941, -8372, -10798, -19308, -4507, 118, -6080, -9309, -14762, -5192, -457, -9695, 8, 23183, 7715, 10276, 397, 7407, 25667, 38091, 32304, 29250, 8580]
17086H580j0443o023r0K2955M837k3273j481K3518J5013J4396J394l6946j4563
17073b126j7893J5642K5249r71j8302k010K1093j8426j2249m174K421K123P783
17060a840m422P0j3177l199K0971N843L150l226j1854J7117K518M698L383j5894
17046D138p96l244m773N618m106k6895r38O161K0828J0629L492O750j995J5456
17032C0325j893O538p594l843j4119n890P908q183K0714l1J3825j1980k2590Q512
17018A1699J8336j1803q459m805J4661j8302k286j0092q154O651P311m627J6319
17005F449J0210q964J7278p041j0990N320k1328j4795k695J4912J450J864j7478
16992b5808j1743J4267k218l599m455J7720L752N907l65k4470q829Q233K6345
$$ y = [8580, -1863, -7886, -7976, 14979, 19816, -3457, -4938, 18580, 33593, 47989, 49383, 12437, -2126, -20019, -4377, 20872, 19901, 1599, -411, 20682, 2256, -9993, -14167, -11746, -9623, -1840, -6262, -6192, -19369, -22568, -1597, 4246, 7396, 4170, -7684, 9433, 11951, 16649, 20032, 4138, 3342, 98, -4675, 943, -3163, -30058, -30996, -24835, -4007, 6622, 10114, 16864, 14869, 30325, 28432, 34970, 27376, 23533, 9414, 3524, 11432, 3249, 23963, 23932, 37757, 25777, 3187, 11699, 30035, 18232, 9773, 4968, 19629, 1327, -959, -11051, -19205, -12554, -5243, -9870, 6449, 16659, 7695, 24973, 17932, 6942, 12262, -9066, -23861, -26556, -11644, -10194, -8330, -25808, -37551, -23284, -25502, -29101, -33556, -15836, -12084, -6177, -6542, -31012, -39841, -31608, -5263]
16979e263K2767j5982o048n768Q681L903q262r979K5792k4649q895J7830q801
16966a4674j991J9450J3220r411j3061J913M146L597K1330J5039m229j3467j9157
16953B705q173N441p291R519L731j237J9226J9287j0907j0442k0660q823J2786
16940E162m734K531o236j066J3662K2838K514j9798n534M04j2928j2366K0157
16927D606J1361j8472j0523m232J1539O90j4094k0048j4607L474J3460K1732J8075
16914B961o629q002Q183k5239M696K4306j5537k746N719J8009n863j6021Q538
16901g625N684j1728q085L744j1845l0686J6380J8866K8247J1033k8624K036M1543
16888B8940k762m3003k8019j5498Q988Q880K4174J8600q71j1012L667k790J2957
$$ y = [-5263, 17504, 1522, -4526, -10294, -1613, 2290, -5972, -15951, 9841, -14808, -23703, -5873, -14674, -16665, 2785, 16005, 6594, -6467, -4554, -408, 3189, 24519, 39558, 35329, 21862, 2705, -5468, -27, -7318, 2201, 5932, 4695, 23921, 43208, 32301, 21859, 1199, -7624, 5162, 428, 2959, -3277, -4343, 9319, 32157, 34671, 14873, 9339, 9743, -3185, -15551, 4606, 15967, -2505, -13028, -17260, -5721, -5031, -19125, -39173, -53780, -50306, -36846, -15114, 2961, -3668, -11670, -3487, -28726, -24030, 276, -15261, -18007, -12288, 5721, -142, -16163, -7625, -1941, -13669, -21754, -18010, -29855, -60541, -44161, -25295, 2952, 13985, -14639, -12603, 28940, 26178, -16825, -44844, -60342, -51354, -42474, -18300, 300, -571, -11583, -7916, -10706, 2251]
16875B251j3581J3725L5691J8618j0549l3572j6722J2018l778n034j950P936J8342
16862B3395j4080L571j0841J0188J6257J5786k1389j7798j5021K970O749r677
16850i890J115J5459o62q105o503p631J3689L321J5908k33k6071j2363K1254J2150
16836A1438L095k6688L644M858kR733J2883Q6j3071p728Q24j2451N530J6795m273
16821D673p489J192o244j537Q2J9197P801J4899J2096j070j1993j4948n944j6356
16807e641J5158N050J573n513k5775j3095m529L200L0360K4672j7451j6481m554
16794a3026m741J5898P224n650R530k0017K348o053j2112J773M071K1367K202
16781B814J202j6846K0582K1474l546l160J1818M884J612N972r210L335O472o481
$$ y = [2251, -11330, 2395, 38086, 56704, 46155, 12583, -4139, 7879, 4101, -933, -2883, 5053, 23395, 9315, 12886, 2045, 12233, 28490, 44276, 22887, 5089, -9932, -6962, -213, -9890, -8775, 6684, 6022, -2083, -8586, -16217, -2528, 793, 16701, 16468, -9603, -21966, -712, 11438, 14533, -12155, -8511, -3653, -3655, 6078, 18961, 19047, 5976, -1752, -928, -13379, -7849, 8946, 4673, -2816, -1624, -7868, -9405, -9323, 9874, 17675, 32574, 44670, 43600, 31607, 16659, 10715, -5641, 9517, 14567, 16140, 10627, -15148, -28243, -32772, -29572, 788, 25460, 8009, -8472, -13026, -17767, -1869, 5355, -295, 9235, -10782, -8434, -14487, -26599, -24826, -20755, 612, 2814, 4016, -12830, 7752, 29226, 25680, 22520, 34338, 39222, 40834, 46806, 37596, 40931, 47403, 40922]
16767D0922j216J87j1615j7729Q863J496k5167J4030L1291k4388k6132o911p578
16754b3947J2023Q336K2613K018j121J2255J5796n731j3193j4434p890O248n070
16741G903l806r52L768p30M916j4569j4470j887J5783K1732L0320k4524j4104
16728I380Q478L627p047p832n411k253N484o86j8490q736m642Q520J3810q224
16714a4022J0313J5295K284J636J6561r15j1147j6716r358l345m086J3299J0880
16701A0679r142O22p715K225j4763k894K8795L0944J4890j0935l6746j9357Q875
16688d522J5811N273L003o09n391O736q706j5245m867P769J7745N647p550r506
16674E588K731J1995j1413l5017n239J3547M982J0088P817Q721J0691j4197l7737
$$ y = [40922, 39706, 39893, 28278, 10549, 19412, 20908, -4259, 9771, 41062, 16674, -9458, -16369, -23947, -11924, -3588, 19025, 21043, 19922, 32177, 47973, 42242, 29049, 14615, 6725, 12973, 7903, 4097, 3145, 6913, 6183, 11099, -3470, -17940, -19827, -4044, 17688, 48008, 23484, 9380, 17858, 21485, 14438, 6606, 1195, -1058, 4426, 3740, -14750, -23486, -28128, -19608, -5798, -14022, -3709, 11586, 13870, 15506, 32067, 31152, 20005, 3289, -6069, -9414, -13500, -201, 10679, 1537, 2159, -5556, -3331, -18094, -20988, 7807, 38751, 53641, 42706, 5960, -13397, -4522, 11289, 16562, 19565, 18956, 13565, 20301, 11595, -3650, -8517, -748, 16997, 22644, 15094, 5588, 8319, 20314, 8901, -26116, -31355, -17808, -12826, -2738, 5079, 13800, 24491, 10294, -27443]
16661b7443j8457K7287P222q296o698J8644J5654j8763Q629J1888J047J9883R217
16648C9814k5529j4380r50j6148L933l397L0342M218j5958Q387k6925o491J1121
16635a1963M469L063J0293J4746m751j117M29K3415j8399k7305P964K5260Q005
16622C4109j1224j2644q512j5538J3426J6419j6453j873j0069R124K4332m459
16610A6638n811J0929J7775j0122j0769j6155k920K747L162Q005k9768j8314J6617
16597a7986O203j8991n585j128K6218J4350j0397j3087p680n895M437J7140O658
16584e743j6450q292Q63n944L843L5582M073K5547J80p719L828j2760j0965m85
16570E558j0323N157J9621j2493k220J6416J452K445Q182J3392O718p617j6339
$$ y = [-27443, -45900, -18613, -11391, -19687, -26385, -7741, 7913, -10850, -2221, 9667, 10714, 30597, 39814, 14285, -95, -1045, -17193, -13260, -16657, 13685, 17903, 1945, 10332, -16593, -23084, -11963, -7494, -4431, 5862, 20608, 15857, 14740, 15169, 38584, 20185, -7120, 844, 26104, 34109, 22885, 10241, 1729, -13809, -383, 16036, -417, -2290, -12359, -3235, 21097, 16638, 10827, 21756, 39531, 29409, 18640, 2485, -435, 2312, 5474, 13479, -16289, -34603, -17986, -11783, -30774, -36359, -37487, -11269, 3081, -7316, -20403, -28083, -33978, -29541, -12401, -5743, -22193, -30485, -29622, -35566, -31723, 3859, 7932, 33479, 33659, 25940, 29768, 17008, 6043, 5558, -4765, 392, 20013, 7520, 5300, 21716, 23168, 25613, 33795, 47187, 53905, 46288, 29949]
16557B9949j3676p755R676J5503m029l9084k1760O569J9876L624J815P843J5046
16544B3597j9958j2221J5748m609j8416m523J5798l539j9794P217J7118K586L4336
16531C3340m535j6737j2426J79J4092P532k0283j3633K234o571P480j4845k784
16518b6957R664K2820j34L174L068o686p517j0957m697K427M464k515n033j0338
16504b9217k721K2770k743j0230J2389j330j971l116p460K203K1979R93O585j4922
16490f791l9626j0949J8191J7589K0740L244O432J2853j1052n968O536R671L243
16477B4113M956j559q548j829O988K247j2185k2047m420K0329j7712o526K2086
16464E893Q150k43j4064k1472N846L726J3179q64l438j990j0734k3856j7473J9111
$$ y = [29949, 16273, 8518, 18194, 33697, 29668, -9416, -31176, -24607, -4731, -1107, 708, 8551, 23597, 3639, -8582, 7166, 2557, -15859, -20382, -4584, -8123, -27917, -20700, -3582, -996, 33340, 28805, 12068, -358, -179, 13913, 21445, 1162, -12471, -10237, -16808, -9328, -24173, -26957, -17293, 5527, 5393, 8567, 11635, 4949, -2568, -13525, -18222, -15795, -11331, -13846, -18879, -29217, -31938, -9168, -11911, -22141, -9752, -11082, -13053, -16169, -23629, -21426, 553, 1546, 8131, -6791, -46417, -57366, -39175, -21586, -846, 2398, 8830, 21683, 10631, 4663, 11199, 20870, 24113, 29069, 27510, 18962, 17133, 24121, 26368, 14183, -7864, -12284, 8045, -9667, -16193, 5893, 14043, 13800, -264, -21736, -15890, -12164, 1015, 151, -3287, -5277, -16011, -39867, -57340, -38229]
16450c8229J9509K2162K3508O573Q554j9240j9794k463J0419j1517j9074j1438
16438c1030l218J6510M0589O80r819k8652j157N367j69J5824J1933P268J9024
16425D3150n966j2768p359J4629N834O951k1625M912q265k1334M260N266m366
16412C319j8328J2064P35j9447N120N809N807R407P519K162K497P851Q433O627
16398C9575M866p893K0149r486k3697M660l2066k1624J0558J6892j0041j0971
16386a9078N749J1659o77P737M025k387j4591k987m683J1478l650j1096k817n248
16372b6566K528N275R655J1717j803k91n959R874L320L852J7329R314P561j0026
16358C5780n266J2901j1406j9377j3517j446j8325J5173Q666j1014P604P84M922
$$ y = [-38229, -18720, 3442, 26950, 33523, 42077, 22837, 3043, 580, 10999, -518, -19592, -31030, -34248, -17738, 22851, 23531, 13712, -14940, -16097, -10730, -10899, 4925, 16858, 24126, 43150, 37184, 24416, 17057, 31686, 37520, 44471, 22846, 27758, 19493, -1841, 2419, 7685, 3319, -15009, -2945, -2210, -21657, -16537, -10728, -4921, 4486, 12005, 14167, 16664, 24515, 32948, 39575, 44441, 36548, 56697, 47211, 23514, 28174, -3892, -25516, -14958, 1934, -8107, -19078, -13329, -1670, -2347, 5390, 9415, 7028, -7563, -10550, -15233, -3755, -7405, -18501, -21318, -26566, -24038, -18763, -9108, 2609, 806, 515, -5444, 4430, 7750, 11602, 28931, 38245, 45806, 35780, 30514, 43415, 32009, 12632, -885, -2331, -20656, -5483, 3183, -7831, -227, 557, 5479]
16345E479K5270m859K090N546J4627L857l443l1028j0393j3557P380n749k338
16332g118o922J2882J5429m069l1244l6767R866K672J081l782L31R261q1K572
16318c5889J1510J860j667J817j784Q187P733K265L4126M834m6833p174J8054
16305b961J333q103l663J6044R517j0517l7364j2191J4671q137Q640K628J856
16292b8247J0105K8151N518k8173J7696J4668k5598j5062J5088J3576P634j3435
16280A921J3444J729P393P741Q169N546k5999k3450Q85J3302J0652k1951l0510
16267c1128l879J4986O904Q200N155M082j8777J249K5355J7285n337j5130j7453
16254h488R954R971j146o785J8101P224j4268l52j4466k867j6521J6954l9L469
$$ y = [5479, 30749, 25890, 27980, 33526, 48153, 52010, 48567, 17539, 7146, -6411, 969, -4780, -7118, -14040, -1158, 14271, 10202, -21042, -57809, -47943, -45271, -44190, -47972, -47641, -38380, -38461, -35889, -24379, -22519, -24186, -22369, -24153, -15966, -8233, -5968, 28158, 32992, -13841, -21015, -2961, -1628, -9731, -13394, 2650, 12167, 1650, -35714, -47905, -33234, -41371, -32731, -30103, -28247, -18142, 10009, 15527, -12646, 5050, 19718, -5880, -20942, -5854, 7722, 15356, 1921, 15365, 17094, 24487, 32228, 40397, 45943, 19944, -3506, -2621, 10681, 21333, -618, -31128, -35007, -20021, -13117, -4917, 238, 4320, -14457, -13208, 12147, 29432, 24095, 8965, -8488, 1466, 11437, 10291, 3506, 21607, 28831, 14563, 14211, -255, -3122, -19643, -2689, -2728, 741]
16240G41Q256M195j0883j2471m452R252J6417k4826j1152j8227k372J5821K0007
16227i694J1626L267O107o827j514j645m922Q51Q792J461r426J9397P329j6054
16213H748l3190m397J1048m888K4880J0895J3308j8499j4475J5100J0627L791
16201B2948J3287J893l4251k2579j9603k071J1381L300R575M515N240R612j8275
16188a5028q161J4133J077r658J4862K6029R527k8094l270K991j2831o945K0513
16175E145j816r485k144Q771k863K1031N480m421N557K441J0003j2932L376j1117
16161A7026j2702P491j2653q202J93j9267k436N473R431K9244j7510p269j4827
16148b6008R275K242J0002J1826q127n218J1903K6249j6257k5612k475j816N907
$$ y = [741, 8997, 13192, 2309, -10162, -14614, -5362, 11055, -13771, -24923, -43150, -45522, -29701, -9694, 1932, 5199, 11306, 4479, 2965, 1320, -3602, -2751, 6041, 7502, -1924, 17473, 24802, 8748, -24442, -28839, -17791, -22679, 2201, 13096, 26404, 7905, -6570, 8530, 19157, 22948, 36235, 38128, 3877, -18702, -38305, -40376, -28995, -25695, -16120, -11605, -6365, 3247, -15028, -23189, -9056, -7979, -17637, -2775, 23254, 32781, 4687, 1417, 4408, -8423, -15368, 5145, 3329, -6156, -8300, 471, -2392, 18639, 24119, 19698, 25255, 27696, 37699, 24767, 28143, 17026, 4324, 11815, -838, -9040, -8847, -28114, -30550, -25077, -15646, 13598, -3912, -11181, -26008, -16733, -14491, -4489, 7337, -790, -6008, 5895, 32144, 15887, -9725, -12200, -14016, -8109]
16135h109P361J4717j3147K877o84n948J6121l790M729o858J267N377k5859n228
16121a7174k031p375J1280p097L191M560j0757j6288Q457J4755P590K06j518K4513
16107A2312J740k9496l0091j1694K347M196K935l175J160J1251J2837n731J8440
16094a2969o127m406K324l707K3101K4888j3860o529k9709q848J0366j6879m013
16081d6368L9803o77j3358J1973Q112J8846o199j2659J3946n987j328j2322J489
16068d729j905r043o776j1162J8263K1791J6079j2296l1487j7342Q512L3092q187
16055e190j957J936j1591j8208L409O169n85o56N275n341N018J642K571l263m490
16040b5261J0632L0533j7027m0684l3J9598K4188n658j4529J0916r229J6099J036
$$ y = [-8109, -748, 13969, 822, 3699, 3015, -2933, 13188, 9398, 14127, 7269, 8536, 13913, -11946, -17174, -19205, -26580, -15300, -22397, -19206, -14646, -25403, -41691, -33234, -18479, -10889, -10683, -12201, 12312, 14052, -15444, -45535, -57229, -54882, -50686, -47751, -50926, -49766, -38515, -25678, -31409, -12969, -19096, -23502, -21178, -24885, -1784, 23104, 9244, 2715, -26994, -35842, -25476, -42355, -46368, -6565, -7242, -20600, -8627, -515, 18331, 12132, -527, 13419, 7432, 6104, -6218, -4729, -6634, -15677, -22453, -33615, -15352, 6439, 22518, 10222, -21265, -38607, -30095, 2997, -5190, -7147, -5211, -16802, -35010, -31601, -25432, -26017, -26673, -21398, -26739, -21721, -20079, -17508, -20771, -25261, -14629, 15904, -1123, -41807, -41840, -22242, 1946, -3712, -18241, -7325, -16554, -455, 581]
16027E81n749j38Q788O964j970n03n006J2329P165p673k6426m637J2369J4988
16013A1082n095q441J1124j6261j506J6870Q419Q018N084m971k0665k4851J8086
16000c107J6219L944j5184m260R539J2966j5833j4354j0282J5963r116M935r453
15987a8023J3163P537L825J0048j6514q602J1367J0815O957Q131j2037j2592k871
15974A204P235J6801J6838K179j2135p799J3683l2076j6099O29n19K012j1709
15961a9756Q30Q370N669j57M87k952J720J084k6277p357J0022Q499J9703O92J2271
15946A2848J1900l172m435L710j394N111J515J7808M68j8757j7001J2148k910
15933A7839j5148l9176L456K3606J4256R541j6918k3395J3160J5809N117l890
$$ y = [581, -5168, -5306, 3482, 10446, 8476, 7973, 2967, 15296, 22461, 14788, -11638, -16275, -3906, 11082, 5987, -2454, 8670, -7591, -9097, 7773, 16192, 24210, 29294, 24323, 3658, -21193, -3107, 13112, 17056, 1872, -2388, 7151, 20117, 4284, -10070, -20352, -4389, -13505, -8570, -18023, -4860, 2677, 6502, 16550, 36, -8566, 2801, 13616, 20573, 28704, 16667, 4075, 1204, 8439, 25240, 42078, 44257, 32122, 24323, 38006, 5930, -10169, -9540, -10059, -8047, -19756, -18926, -10556, -4887, -5044, -4557, -7509, -5789, -4705, -30982, -38339, -28317, -19818, -115, 577, 12848, 24748, 21576, 17141, 20851, 19457, 24568, 26083, 43891, 44359, 25602, 8601, 20749, 17839, 2691, -36485, -33029, -9423, 4833, 14374, -2544, -25939, -12779, 3030, 8147, 4257]
15921D257M694k5008j57J2903J1294k6674q831R292l416r913R200n673P735K733
15907a7564j0257r989J1084L6237L707q50P198n680O937Q520j8578j1797O742
15894E710q739m715J095J0602q29R58q30j4325l332k0684q612J0763K3776L624
15880e538q687n935K283J3611l215J8475J4632J1092L6984j9219k1841j2355k8982
15867h695k717K1285J4832l1684k6003n584K004q316J7402M860J3764J210M046
15854c596m386l4297j2070J9049m322o825K0666R434k776M592Q320J2481o450
15841a80j36p386k061K6902P351j6846L11q045j6633r03Q332j7J668j155j5193
15826b3991O635J8416l57P01Q069j5175K862P839R753J2912O269J7483j31j9140
$$ y = [4257, 8951, -16057, -16214, -3311, 7983, -18691, -27522, -18230, -21646, -31559, -22359, -28032, -20297, -17564, -27821, -37810, -26726, 9511, 13218, 12368, 19566, 13886, 20823, 29343, 10765, -1032, 5710, -3029, -7744, -6649, 3953, 3124, 4082, 3252, -11073, -14405, -35089, -43701, -32938, -9162, -5538, -14225, -20160, -17877, -4266, -7481, 10994, 25626, 36718, 73702, 54483, 32642, 20287, -8695, -11412, 9873, 24705, -6979, -32982, -38566, -36562, -44878, -27476, -22616, -8852, -7642, -3596, -7982, -42279, -54349, -35300, -39622, -46447, -25781, -16347, -19123, -14531, -6211, 6270, -180, -316, -7702, -9763, 17139, 24490, 7644, 7955, -90, -16723, -17626, -9294, -9311, -7643, -8798, -23991, -17356, 1060, 703, 1404, 9473, -5702, -2840, 4999, 14752, 27664, 33933, 51416, 51285, 32145]
15812C2145r995r143k0533Q50J9620K901j0122k813K3440O207k1237j1179j2856
15799a2715l049K4218O387k3838J3278J4496k503j640k2069j5942J9358L3896
15787B9877n911k8827p32J6676j5106k2342r824n018O206K3271J5248l321N080
15774E277N650Rm590J248j293K1807J0272o327k3023j5903p764N711p756J3879
15760b803J6639o189n372J1116M762J0728O713m066j06j4825r255K3601R792k0493
15746B0242m245Q227j3040q148k86k903R332L152q463r723p287J0280K0063O087
15732B3288k6920k870K275P11J350M892K8J7607R873k4685k0896o419n020R050
15718a7736p01J1024p325p387K0230q275P100j7778l254J8871O646L076j3256
$$ y = [32145, 22150, 13007, -7526, -6676, 12944, 15845, 5723, 2910, 26350, 32557, 11320, 141, -12715, -15764, 8454, 14841, -8997, 4281, 18777, 16274, 14634, -7435, -23377, -4019, 29877, 23966, -4861, -5593, 11083, -4023, -26365, -36189, -41207, -35001, -11730, 3518, 197, 5277, 10927, 10936, 6346, 7594, 6301, 28108, 38380, 32053, 9030, -6873, -14637, -8926, -16682, -2803, 13836, 7647, 2275, 13391, 18153, 28881, 35594, 31528, 31422, 16597, 7342, 30943, 40735, 20242, 15997, 24224, 11184, 3036, 2750, -153, 9179, 12331, 3868, -5855, -13142, -2862, 17201, 23288, -3632, -6502, -4227, -3516, -2166, 2726, 2754, 20361, 30234, 5549, -15347, -21766, -26786, -17736, -18437, -7413, -14738, -22125, -1895, -10170, -3070, -20848, -24102, -5231, 1415, 4491, -8765]
15705h765j5138P132q406P819J3965m378L178R563O418Q227k0156O601K1984K129
15691C0173j7310j1961k289L0051K1202k2478l4368j5788P854J9805Q141J178
15679A4210j4821p385j2787j248K9002L102r021N694m309N738k1411k1509j4146
15666d8891J0342K0642K970o696K0699K9640j9947k6748L980O816P011j145q99
15653b226k2853n976K956J6269j3996r137J0835K816r178N884L1176r409M631
15640A792J1563j5286k6777j2671N463J070l741N936P163J0028O846J379J8120
15627A0885j3576L582J2397k178k6488R67M982J8328J9099K1881J0800k3352k0525
15614A6802j520o876j2602j9203K387O525K8657J116j2029j680j672N922M846
$$ y = [-8765, -23903, -16771, -25177, -17358, -3393, -7771, -4593, 4970, 11388, 19615, -541, 6060, 28044, 30173, 12863, 902, -1387, 28664, 49866, 27388, -6980, -22768, -14914, 4891, 13032, 14210, -611, -7996, -20783, -22031, 6971, 10073, 1052, 6746, 2437, 8175, -13236, -34745, -48891, -38549, -17907, -14937, -21633, -934, 28706, 8759, -17989, -14009, -7193, -182, -1327, -2226, -25079, -31055, -28099, -11830, -25826, -34963, -24128, -21312, -30490, -24606, 6570, -2839, 1792, 13355, -1931, -28708, -41379, -35916, -34846, -38587, -32651, -25488, -15460, -8614, -7235, 10885, -2691, 891, 13288, 11110, -15378, -14411, -9429, 8899, 27998, 49879, 60679, 37327, 16802, 15282, 8406, -4196, -23399, -21012, -14487, 14170, 15286, 3257, 1577, -95, 5827, 10673]
15601A0673J846K053O369j3300j2207k0359j042K1759p336n954k118J5636Q67
15588c113j2868l668j0632K1132K0242J9840J8578k392j9537k8155m32L297r72
15575A320m239J4952O019j97k4297L600J9129K2526j9212j8350l502j9095K0374
15562i72l327j7055J9408O34p019O818L617j0546j9662k2732J7019K3679J4827
15549D689k9667l309J2703J6414P709n902l11n740R00J9097r02J038l660q277
15535D782n831J6395K314r726j4581p225R505J616j0205r947m770j3443K5381
15522a5735J536j9700j088M2547K4762l765k3788m155J3535l921l516J3927m873
15509A5766j9038J958R479j9434J2951j2588K81K6447o936r722j388o150J0749
$$ y = [10673, 12519, 14572, 20941, 7641, -4566, -24925, -25967, -4208, -11544, -17498, -19616, -3980, -3113, -15981, -19649, -30281, -9149, 11093, 30933, 49511, 47119, 27582, -573, -1005, 2292, 1320, -2919, 12033, 18052, 17855, -6442, -2842, 16287, 38813, 19601, 1251, -2251, -21346, -972, -4299, -21354, -1946, -1312, -8331, -1513, 2104, -8442, -28104, -50836, -33817, -10138, 4689, -24978, -28287, -15584, 830, 8539, 2637, 2326, -3414, -2514, 16583, 15681, 16719, 13059, 4782, -1049, 15346, 17660, 7934, -6647, -13872, -4367, -2751, -12956, -22903, -27673, -41116, -15735, -14199, -33899, -34987, 7560, 32322, 28557, 4769, 614, 14149, 10228, 6712, 20639, 15766, -3272, -1314, 8165, -11269, 1682, -10906, -10625, 15822, 8886, -836, -2224, -8374, 2375]
15496B375j0507q769L681J0246L22j2564K2541J9864l51l468j363q950M199K2224
15482C9480m711j5091P300q268l535m15j0765j2547j1897r151J1450O643J6803
15469E296J840l733J700k679R453l177l285j398q157o234l547K80N91J9899M525
15454A1374j2664J9318K123k0074j3825P643P698O418m00P80l4003j7753Q698
15441c4667J2018N536J633P435p61j0060r440P330N809j185o378R697R137J6227
15427A2331J5651J2516j1797k1271q923P279q159p265r331J7955L3181Q995j0930
15414C0232r046n082k166J1791J3933l9491k0018r972K2920R011K542j5878j4384
15401b5608K2319M545n616P237l734N673P459j3402j8921j3318J4571J4975J0071
$$ y = [2375, -8132, -16901, -13220, -2974, -2652, -15216, 7325, 27189, 26838, 23370, 22007, 13057, 17256, 39480, 34769, 19678, 26978, 18710, 15175, 14760, 3995, -8552, -20449, -29600, -18150, -11507, 5296, 7136, 3403, 5103, 2424, 11877, 8700, 5415, 4017, -4140, -10374, -13921, -13641, -13050, 6849, 11374, -1290, 18028, 20151, 77, -13748, -6105, 1593, 8011, 7611, 8391, -25612, -43365, -34667, -22649, -17113, -15480, -8045, -8806, -18866, -28306, -20976, -15167, -16352, -22730, -13033, -3896, 12331, 27982, 40498, 28701, 7430, -1493, 5786, -2373, -9638, -18969, -1014, 32167, 41162, 30232, 21186, 16104, 13938, 25729, 39662, 171, -19847, -29819, -6899, 2112, 4654, -11224, -25608, -3289, 1256, -4360, 2877, -857, 4816, 12275, -1127, -20048, -33366, -18795, -3820, 6251]
15388F251j139j465n082J0022J3336j697j5725l828K590P486J4583r078j7816
15375a562J32m1n684J0257J2934j0165k497J1863m436j4716j9416J1965K1510
15362A0144K0346k6822p254L526j0574Q292k25k403j750k1201Q589J6589R653
15349F910q427j6066O879K2511l1170j2079P942P223L502j0203J6028J92o658
15336a3416O555P813j3489n215j084L1177o251n761j1826l694J1674J4730j532
15323I681n464j8357k2742n503L0505J8785R598O746J4498n451j1799K192N072
15310B7761m427j9979j7226m914k42l4532J1774J8243J6238J714P781j506k1660
15297b0975J4045j0056j0065Q422J9433L115m94l943J2305r39L70m236J6052j075
$$ y = [6251, 5112, 3647, -1435, 8587, 21923, 20226, 4501, 673, 3263, 10749, 25332, 16254, -1562, -1430, -1471, -7155, 3102, 16036, 5871, 3374, 15237, 10801, -3915, -23331, -11366, 10144, 30490, 3668, -3586, -60, -10634, -2342, -2567, -4970, -6720, -27921, -19332, -2743, 6910, -1517, -17583, -10704, 11807, -19363, -31442, -23500, -16277, -12775, -22978, -6950, -6758, -13416, -6861, 952, -12537, -17752, -18836, 12341, 6090, 329, -11497, -15191, -3517, 11213, 9681, 4217, -14140, -36882, -42385, -11880, 6905, 16503, 23249, 37747, 32296, 20497, 22689, 27761, 23334, 3355, -13871, -18785, -19027, -53559, -41785, -23542, -7304, -5590, 2191, 685, -20975, -6930, -16986, -27051, -18629, 804, 3919, 3425, -518, 11787, 10848, 11218, 6982, 23034, 21959]
15283B1959m965K640Q660j9282j3888J4321j3793j3522k511q879J9857K8418j9810
15270g95k8355R729K0270r407N446j1013m571J680J3573O401q03l041J7774R819
15256B6707l7442k5924n60Q180K9917J3211j5524P50l627q440J5910J5088Mj7850
15242D00J0472j2605l898N493j389J790l044J8766l694P642O857m301l1392j8499
15228b7402R263O76q495L093m118J5610L1340J7419k231j8050k0171k6066k0432
15215d9564J9628J9278K1735l714n091k0725J1080J3301r483n991J1571K2782
15203B4807O841l269P178M872j0762j8876n603J4196j195j8969J3641J6499J46
15190B9506o509K157J1645J6053J6625k0421l4675k0831K9681P399r361p780k6194
$$ y = [21959, 16994, 19634, 28294, 9012, -4876, 9445, -4348, -17870, -20381, -29260, -9403, 19015, -795, -29150, -19421, 849, -8558, -3112, -14125, -18696, -17016, -3443, 2958, 2155, -886, 16888, 26707, -10735, -36659, -37219, -29039, 878, 14089, -1435, -685, -4312, -12752, 3158, 18246, 18250, 400, 10872, -1733, -5631, -138, -1527, 263, -2781, 15985, 12291, 19933, 26790, 22489, -8903, -27402, -18139, -17463, -25958, -22865, -26983, -11373, 19967, 37386, 35155, 17105, -3066, -29132, -49564, -29936, -10658, 11077, 7363, 2272, -18453, -7373, 5928, -3555, -9546, 2025, 24807, 31648, 28379, 35557, 40429, 29667, 10791, 5188, 19384, 18189, -780, 12861, 29360, 29506, 22997, 25154, 36799, 52852, 69477, 49056, 14381, -6450, 23231, 30630, 21269, 13489, -12705]
15177a2705R39K739J4191Q224k0378n347J500J4619J6870p35r881j3186j3467
15164a6617k845K379m694Q764J9523L704j0205j3932j752P778j241J2217N652
15151H731r221J2189J0203K234J6037L664K291k1285k1157J129J0351N335k2541
15138b040K721M74K440p333J8228K2954J783n439j4350k1921m144K2907J5221
15125C1501k437k8917l259J3530K1959J533l5481p152n352J7352p993P778P412
15112A0474o259j5241j2411j4911J2186J3758J890J7032J9429M645k3313k2897
15100a5618l963L787o197q228j3891J9358J6186M689J698j6307j6577K112J9265
15087a3686J1495L136j581Q414q507P217J5852k2007j1326K60K9811k0697r485
$$ y = [-12705, -11766, -9027, 5164, 13388, -6990, -12337, -10837, 3782, 20652, 19917, 10036, -3150, -16617, -19462, -17083, -21777, -13013, 6510, 10214, 9, -13923, -15675, -7897, -9138, 3079, 8731, -490, 11699, 21902, 24136, 40173, 43837, 46128, 24843, 3686, 4815, 15166, 20501, -2040, 681, 1155, 3595, -3738, 14490, 37444, 39227, 33788, 19438, -2483, -6627, 16280, 31501, 29064, 147, -3112, 10418, 32377, 33910, -1571, -8723, -14075, 3277, -4716, 3062, 10474, 4215, -11026, -23437, -38348, -26162, -12404, -10514, 6518, 25947, 30592, 7279, -15618, -19581, -15794, -21991, -30219, -44110, -24752, -8566, -3877, -2179, -18486, -35063, -32951, -13686, -2191, 945, -636, 7778, -729, 6488, 22340, 333, -10993, -10733, 19078, -1619, -11104]
15074a1104j4279k2292j9M757J4713K9694J1756r69k584n248J8959l839m596k252
15060A2697O13r164j9487J2020P013m999K386J3729O252j3863j7042j3155o02
15047b3602K3245J2199P573P485o719K692r244k983M303K6449O082k7197n898
15034A4385J065k97J6848m951J472q966k5945J394K5854O680j323Q261M238j5512
15020B3203r357q425j433j0469l8881J3117L0596K557P933K552L376j5256j9712
15007b0199J2822K7890Q000n613j8580j3274o611J2433m637j0071K5668J336m293
14994D871N548J802o473M948K170j1786n133q612N82L969Q390P210J7245j5413
14980I318j9157k4786j1206M1310M5527l338k0430l4394m889J0756j90P388k750
$$ y = [-11104, -25383, -47675, -47694, -42937, -28224, 1470, 13226, 12257, 9673, 4425, 23384, 19545, 14949, 12697, 13310, 4146, -15341, -3321, 3692, -1307, 1079, 14808, 21060, 7197, -9845, -23000, -23602, -357, 11842, 19415, 26900, 20181, 22873, 13629, 10646, 14949, 41398, 47480, 20283, 14385, 15450, 15153, 32001, 27050, 28522, 19556, -6389, -4995, 20859, 27539, 26216, 34477, 38715, 23203, 13846, 5421, 3988, -6481, -45362, -32245, -1649, 908, 8841, 11393, 14769, -487, -20199, -7377, 20513, 28513, 22900, 4320, -8954, -15565, -3132, -7769, -17840, 7828, 9164, 4871, 10419, 12221, 5748, 10696, 12866, 1080, -4053, -12665, -12083, -8114, 276, 7486, 24731, 9318, -9839, -34625, -45831, -4521, 41006, 37668, 17238, -17156, -22045, -11289, -11479, -4091, -6841]
14967f841J3681K7941o456n994J4353j4631m639P074j7406k573N503L42k758j1755
14953d159J0169r619K795j886J3236K102j2427j3939o039L747R177L583r650r218
14939b2128M009K5228J4316j9555j1270j3394j320n591L024l646j5390J1262J4003
14926b0452J2897o828Q800J5935j1397P883J1761R70r477q14j5416P553K1741
14913B3156L0769j0502l7604j8357m599K5075k2018l3719o187R459K0432J1979
14901a2116P720K6670R29k3426k0626P569J5574J5372k5099O47Q303j4271j842
14888a4596J09O532m830J3734O24j6306J6481O868k914l490k4153k5830M550L2029
14874a1192j390j0045K4353j1731n552n168K202K801j0737j8350O480K1033J8819
$$ y = [-6841, 6840, 34781, 28325, 22331, 36684, 22053, 17414, 24488, 7082, 4509, 10012, 10354, 7596, -4159, 6010, -3609, -814, -2700, 10536, 12638, 211, -13728, -19767, -16020, -6843, -3260, -12910, -22128, -18119, 7109, 21425, 1870, -9400, -22794, -24114, -29705, -26681, -30327, -45717, -34455, -20452, -7555, -14383, -5583, 10352, -1045, 6838, 18599, 19569, 10092, 9278, -6138, 1415, 23156, 53925, 43423, 5819, -12538, -17137, 7938, -14080, -47799, -53986, -44527, -24095, -12116, -4396, 22274, 23203, -223, -20849, -13280, 2294, 17666, -7433, -6786, 1517, -12754, -14596, -14487, -7955, -12785, 949, 1573, -14733, 1748, 8616, 5702, 2212, -21941, -47771, -43221, -11192, -12582, -22627, 1726, -10005, -15557, -20725, -18523, -15722, -26459, -44809, -38329, -17296, 1523]
14861A523J0593j292k8744J3433P846j5243j2198l363J497L126R548K3257J3350
14848B3333N17p248q784m281j6567J4295K4890J2920k0688j5729J0114N699q09
14835A7662o181j7986q609j24J1616J9633j585n320J0712J1847K911j7837k3871
14822g132k265O319J1173o437m448J805J2257k343R048P693J920p456n550K1679
14808C6263M734l1199k0506l309N676L6381J3015j9470m577n28L972j6172J502
14795E782J3892r081k4968K619P830m65k245J8026J6177j4466j3010j954K702
14782H39R758o690p433p393j2854j3145J8396P250R735P466j905P018J7578p820
14768B0800k3621j91J8015J1547k55j3608r171O202l962J2018R186j418j0191
$$ y = [1523, 12116, 10824, -17920, -4487, 3359, -11884, -24082, -27445, -25948, -22822, -13274, 9983, 23333, 23850, 16602, 7818, 3537, -13030, 1265, 26155, 39075, 18387, 2658, 12772, 18471, 17662, 11481, -6505, -15114, -15238, -3622, 16011, 14426, 9106, 19818, 31665, 34576, 16739, -7132, -9397, -3078, 8095, 1658, -2790, -985, 11272, 8929, 17977, 25670, 27590, 20134, 14584, 36263, 40997, 9798, -10708, -14017, -8341, 28040, 41055, 21585, 17008, 16480, 20452, 4280, 5782, 19674, 10593, -14375, -11756, -3926, -4391, -6636, 11390, 27567, 13101, 91, -1863, 839, 10597, 3907, -3526, -10919, -23773, -36918, -18522, -11272, -1537, 5929, 4024, 11042, 28620, 20800, -2821, -3012, 15003, 26550, 26295, 12687, 3516, 9718, 5756, 17774, 26960, 25542, 15351]
14755A5351M804O280l0552l940J3620L3220j7973o288O200j847j9694m14m782
14742f015L145J6496j2493q312J1687j6086J319J5052r56j9237j0524p795J2689
14729b1030j8509p235K0680j677R609l047J5854J6991r36j0536n474j1263r049
14716b5622l803O838P903J511L914J8851j3621p22j2450K066J4450Q410R021N811
14702B2557J6039P994j2253K995l4070j7632R864K4877M191k5466k4775L616j659
14689b3722J1646K8165P595j8909l0937j6805K908O30r77K3514l072J1291O243
14676b430P27J3865J3504l1641l2764l384K7335J4479l652q39K5173l153n279
14663A1941l609K501j3769o796J2383O875J0707J4565j0087j6007N596p633J383
$$ y = [15351, 20155, 26435, -4117, -8057, 5563, 38783, 20810, 14522, 20722, 18875, -819, -1233, -6015, -2870, 13626, 1133, -7179, 4508, -11578, -10259, 4793, 3837, -15400, -25924, -33719, -21030, -39539, -46774, -26094, -27771, -18162, -21209, -5355, 11636, 10700, 164, -5310, -16573, -25622, -29425, -22587, -14684, -13173, -9259, 9592, -4029, -4751, -17201, -15135, -685, 7725, 16746, 22557, 38596, 46590, 34337, 37332, 3262, -14370, -4506, 20371, 24562, -904, -25679, -22063, -23722, -12076, 16089, 23684, 4775, -26162, -42967, -40059, -39429, -40406, -16892, -19964, -8673, -2430, -1703, 12162, 25666, -5975, -38739, -42123, -14788, -309, -3961, -4800, 20373, 17220, 11941, 8332, 10833, -2936, -9732, 2651, 9526, 20233, 34798, 24711, 8704, 14300, 6667, 8050]
14650H050k6392J326K7801m999j5621m105K1207p904k4575j3577j5692J5457J0014
14637b9010k44K8551L0384J4697k0701j3977k025q381J8570N523q544P123p657
14624A4309L621r082k698k347o155l593P012q005J5534k557k3485K180K0229p356
14610b393J8086Q500N863M757L801p769L47r516N817k4053l1515m974K0529l911
14596a6431J6241j3304k8054n60q456J1543J5520j4161k286j0960J6242M3065
14584H399Q331j0134l481k3259j1830K315J4296J6140K283j1722J2943l328j0284
14571i331j4008Q171J6513R337k130j5405o573o087K509j0991J1754J0662M502
14558a077J4298J0787j0744N350J8872j6637j1197J5825J7338j1481j8990Q282
$$ y = [8050, -18342, -17016, 10785, 5786, -9835, -13940, 7267, -637, -25212, -38789, -54481, -39024, -29010, -29254, -703, 29681, 44378, 23677, 9700, 7675, -706, 17864, 23387, 14843, 21966, 14309, 17930, 8848, 6150, 3803, -2352, -5945, 1067, -6938, 8596, 6039, -17446, -15266, 4963, -2393, 15693, 24193, 30056, 34813, 38614, 30845, 31192, 21676, 27493, 3440, -28075, -33049, -12520, -16431, -190, -13494, -41548, -42108, -50564, -39021, -23501, -37662, -39948, -50908, -34666, 8399, 16730, 6596, 3115, -20144, -31974, -29659, -15363, 777, 3060, -8662, 4281, 953, -9331, -23339, -15168, 1345, 10682, 8552, -6853, -13426, -19513, -17004, -27995, -16241, -5579, -1077, 13221, 24008, 13264, 18614, 37486, 20849, 9652, 25477, 42815, 31334, 12344, 20626]
14546B0626k2237l1182r23l654q665K2936J4523p962k1516N914L629J7635p827
14533a8703k317K0965r805j0824q897J7252j2171p817M386q375n72M770K9067
14520c041J3462j3642p962Q347J4823q36k3467n749J2740J3470J3723J2536r349
14507B5055j2180j1446p605j1633M332P540J1628j642J8510J8683j0419p067m810
14494A8946k2868l70J0112j6008J3605R440n449J0751k319k5641j8621k198P485
14481b3135K0327K528j3096p678o273j399k426n166J2596L2827Q691l843k9659
14468a5706R761J1008N951N823N761k0391n59N586N179o151m888r304J342N798
14454g90R389P734O144n288Q80m985j4607k1947j712O085P398m649r648O443K3455
$$ y = [20626, -1611, -32793, -33716, -37370, -46035, -23099, -8576, -16538, -38054, -32140, -28511, -10876, -18703, -21020, -55, -9860, -20684, -29581, -12329, -24500, -32317, -27931, -36306, -36878, -32108, -3041, 10421, -3221, -11183, -2836, 11987, 11151, -12316, -18065, -5325, 8145, 21868, 34404, 25055, 12875, 1429, -6176, -17809, -13477, -5937, 5691, 4049, 22559, 41242, 30823, 23756, 18946, -3922, -4292, 5820, -10188, 3417, 12857, 7408, 18159, 15840, -9801, -28422, -30620, -23135, -2808, -280, -13376, -21054, -27327, -28726, -31152, -36318, -23722, 9105, 17796, 13953, -15706, -5945, 5063, 11014, 16837, 22598, 2207, 1648, 7234, 12413, 6262, 1374, -7930, -6588, -790, 8599, 16333, 22477, 17189, 18069, 13084, -1523, -23470, -25182, -19097, -11699, -16348, -25996, -19553, 3902]
14439C902Q990k2743j8308K91J0436k6869N785J4350J1330n2l898J3031J3468
14426I713j9509J188j5720L329K0877M284j1391K979m371J396J0467R669M385
14413A7296k0769k0350j9829J9493J5015J0707J2860p523n695j5277N124N818
14401c130J6707L429j1243n640n486K0695K26q374N352j1242j2859m226p840K101
14387b1530J0280J3452R273o694j1516j5025O156p103R954M433n959K6036J972
14374A3729k9679N882J2331r402P94J3720K2717r180N586k310j0693J3869j3357
14361A4007k4021m65j3213o126j994J5699J1652K7203J3481j57q143l0401k7620
14348c0098Q605M657j2731J6727J0408q301o158j76L803J4572j684j5687j1686
$$ y = [3902, 12892, -9851, -28159, -27868, -17432, -44301, -38516, -24166, -12836, -12888, -16786, -3755, 9713, -9796, -8608, -24328, -20999, -122, 4162, -7229, -4250, -8621, -7225, 3242, 12911, 17296, -3473, -23823, -43652, -24159, -9144, 1563, 14423, 6900, 1205, -14072, -8948, -3130, 13577, 17006, 5763, 123, -5363, 15332, 15558, 7184, 12536, 1294, -11565, -15791, -23631, -21530, -11250, 2202, 11475, 4781, -6735, -21760, -15604, -22707, -12753, -8320, -14279, 11757, 13729, -15950, -10068, 2263, -7139, -6345, 7375, 30092, 20912, 26498, 24188, 13495, 27364, 14007, -10014, -10479, -23692, -29818, -31812, -16113, -4461, 22742, 36223, 36066, 27923, -2478, -30098, -21493, -16836, -29567, -12840, -2432, -10733, -16891, -17067, -13264, 1308, -376, -16063, -27749]
14335b7749J2500R77J366L292j5717q753m945O914Q148J8399j248j4714p342m819
14321c3691j682J8993K1423j6367j5720o730J0669K296r32k6855J19K0546n302
14308c3233J091J1191P816N782J4157l724J1707r265l403j0632j1147Q916m993
14295a5737j935j5569k6720J2803K7892k006K1935j255l806J7569K743j3450J6971
14282A9435q289m824l372K635K727P805k00j3308R441J3779j1601p189r337O868
14268D570J90p314p259j0455o882J30J4095J1356N059J3363k7485P598J8522p005
14254H483J0122Q155j5863j0015Q550n491j9950j1146N670K123J0587N312j1040
14241a4503Q790R028J7298M953k2903L183J0011j4505K300J1657j8615j9341J3897
$$ y = [-27749, -15249, -14272, -12906, -9614, -25331, -34084, -39029, -32115, -23967, -5568, -6816, -21530, -28872, -33691, -35373, -16380, 5043, -11324, -27044, -33774, -23105, -20809, -21741, -48596, -48477, -27931, -33233, -32142, -20951, -13135, -7353, 6804, 3080, 14787, 5522, 2119, -8513, -19660, -10744, -15737, -17672, -33241, -59961, -47158, -19266, -21272, 663, -592, -4398, 13171, 15914, 2464, 19435, 11146, 6322, 2950, 5585, 8312, 16117, 15917, 2609, 12050, 25829, 14228, 7039, -2298, 4570, 4760, -2554, -9813, -20268, -27150, -27020, -12925, -1569, 3490, 16853, -10632, -3034, 15488, 8483, 18605, 26760, 10897, 882, 9432, 3941, -16009, -27155, -21485, -19362, -8775, -3463, -14503, -5713, 3315, 20613, 25566, 2663, 5846, 15857, 1352, 3652, 15309, -3306, -22647, -8750]
14228h750J4220j0497j5775q512K4881j376m277q307K840j8579L886J2114Q630
14215i502K4170K204O435k4534j0099N026J458r309q23l574k23p48K1870l105
14201g54j0315J1671J2711m096J782R104k4539j1399J0055N671p752j5586J5258
14188h189J3979p522J2981K6659J9375m531L812j8975j5584L514j3534l283J2147
14175B0849M997R20J0241p402j6978j4495p725k870R940q951J0055K707k4900
14162b3612R070K5058J2871o062o611j1578l538j132J4405J4878L92l384j1934
14149H823j0580k8921k3470J5281L8604J5853J0669j6821l193j6674j2043j2314
14137c4786P227J6826J4272P8J5735K3801n092j3785j9735k112P55J2744k2995
$$ y = [-8750, 5470, -5027, -20802, -29314, -4433, -5809, -10086, -18393, -15553, -34132, -30246, -18132, -9502, 14668, 16872, 23307, -1227, -11326, -6300, -4842, -14151, -14974, -18548, -18771, -19519, 2351, -754, -11069, 602, 13313, 9217, 10999, 20103, -4436, -15835, -5780, -109, -7861, -23447, -8189, 5790, -1732, 11249, 37908, 57283, 52752, 56564, 37589, 22005, 25519, 11985, 8702, 20849, 25846, 26766, 37007, 29605, 12627, -1868, -9593, -12463, -2523, -11474, -1419, 1288, -23612, -14542, 10516, 23387, 17325, 10714, -864, -4402, -5534, 8871, 23749, 24141, 20757, 8823, -1757, -30678, -54148, -38867, -263, 15590, 26259, 9438, 6245, -10429, -22472, -34786, -27559, -10733, 3539, 3617, 19352, 43153, 38061, 24276, 4541, 2429, 3184, 15928, -7067]
14124g067j6240J2872L488L88N134R942J9444o663j3521q749l32Q027M902K214
14110A3839j452n257m083j5255k306K0986J0487J9795j632j9199k6296R707R274
14097H608J6779j1634j9473j011J6149L315j0131O750J6120P22o441k0470j0579
14084a1296J4418j4771K014k51Q627K500k7527K728J3620K3488j6974r453L308
14071i569P17J8585O647J927L350J2915J776j4991k1591j093K3007j0202j2345
14058h67R25J5853J5919k628j0841L093J1468N852K027l99j0905q967K481J2622
14044C5633O941R434j2678j5749k6792m859J6672N558l409J443j6759j1442M489
14031a1518R126K9638J3079l837Q182K921k9573j0904j8461l519K6962K6423J6138
$$ y = [-7067, -23307, -10435, -6947, -6559, -1425, 8517, 27961, 21298, 7777, -972, -1304, 6723, 11625, 13839, 12387, 7130, 3047, -12208, -14514, 6472, 16959, 36754, 35122, 15923, -10373, -666, 8608, 25387, 13753, -5720, -6731, 9418, 12733, 2602, 9352, 25472, 26194, 19753, -717, -11296, 3122, -11649, -9635, -9886, -1259, 1241, -26286, -23558, -9938, 13550, -3424, -12877, -9569, -8852, 9733, 16380, 18307, 21657, 34572, 36348, 21357, -234, -1327, 21680, 11478, -867, 58, 15911, 31830, 29202, 18361, 21454, 32922, 38774, 40801, 40402, 29497, 20530, 23011, 35633, 42574, 52008, 39330, 23581, -3211, -8070, 8602, 14160, 10751, 12194, -4565, -16007, -11518, -2392, 27246, 40325, 36488, 44670, 47591, 18018, 7114, -11347, -14866, 12096, 38519, 54657]
14018E4657l9110p599K9615l692k1951n046J633j4616j0519Q063J6784J7791J2434
14005C8444j2948r062M180J611N117J1436p99n100K607j4104j0269J4881q480
13992A7514J4178j855j423M840m212p940j3265K798J378j1150k816R297L207m435
13978F116r677j0632J7776J2462k5203j0690J6290Q012J510J907J441K653J4429
13965B6394J0840p846k2454j1644m991k631m396o869L2663Q897j1560l145L560
13952F818k487j1561J4298m551r851p301K003p693O501k429l600N154K0090o334
13938i43j6722j851J9663R787j7941j6437R084j751J1904J7221K0544R39j7472
13925A6025o670k2749j2641K2152O201j4708J0590J3310N707O129p625j688N85
$$ y = [54657, 15547, 7948, 37563, 33871, 11920, 6874, 8507, -6109, -16628, -8565, 8219, 26010, 38444, 25496, 16434, 20614, 22225, 27342, 38778, 37979, 32879, 35486, 21382, 11113, 25994, 17514, 31692, 29837, 28414, 33254, 29042, 21102, 7837, 10635, 12013, 863, -1953, 7344, 10551, 6116, -3561, -14193, 3583, 16045, -9158, -19848, -3558, 4454, 5964, 7871, 9312, 11965, 26394, 37234, 29388, 6934, -4710, -9701, -12332, -16728, -23597, 9066, 17963, 6403, 3258, 6818, 4331, -7230, 7068, 2517, -7334, -14635, -12632, -20325, -13824, -16253, -19853, -14699, 5391, -943, -17665, -19516, 147, 9934, -8007, -24444, -15360, -17111, -5207, 12014, 32558, 33497, 16025, 9355, -13394, -26035, -3883, 2318, -12390, -1800, 11510, 17217, 23346, 15721, 14033, 14618]
13912A4618j1961L492J4198J5689j3474j8823R101J6952j3226O980k1902p053
13900e409L203J4341j0586J960J1416j1979j0468n144r902J2603J3728J641o184
13887g80K540O45j706M461k26k1309j3468R946j3328K650L1935K1925l212j3573
13873F500J0284Q515j0206R178J3877r107m687j7200j4641k809N355j7393k886
13860b5220j450j135O090R406J1533J6872J755j5177J068J2396j4044j8696K458
13847a4144n110k071k284Q395q27P899P842J5800q205k2539R154K1393M302j1914
13833G691M717J6413R119k424k1405m027M6537J3904k6941k3998j5118M65j4504
13820i571p96k066L718k262r059N783q6J4982N8k5542j1780l867P815j6203R451
$$ y = [14618, 2657, 6149, 20347, 36036, 22562, 3739, 12840, 29792, 16566, 23546, 1644, -5409, -2206, 12135, 1549, 3509, 14925, 2946, -7522, -12666, -22568, -9965, 3763, 5404, -780, 1760, 2405, 699, 5160, 4934, -16375, -29843, -19897, -33225, -30575, 1360, 23285, 20073, 6500, 16784, 25299, 15093, 24271, 38148, 29041, 24354, 7154, -7487, -10296, -4941, -22334, -25220, -26670, -27805, -21715, -12309, -776, 16096, 17851, 2674, 3742, 16138, 2094, -16602, -14144, -19254, -21325, -23609, -15214, -16041, -8142, -300, 15500, 7295, -15244, -6090, 15303, 19605, 7691, 12408, 28821, 37940, 35516, 14111, 10084, 56621, 70525, 43584, 19586, 4468, 4933, -9571, -10367, -12433, -8715, -10977, -20036, -14253, -14339, 643, 701, -24841, -36621, -40488, -32673, -48876, -39425]
13805c9425n051r179J3628P930K2971K2543L416j2925J2964j224k2472p001K139
13792a1686J4405k182q169Q906K1334K390j2758n81o625K731r576j2179M425K6561
13778A6996L657J7141J2701j3592j0749j8266j2174Q54J686j5776k404p144J7522
13765i548L642j8441n737l293J1190J1124J319j7197O146J9573O50j06p130O170
13751a638j0266k9276J8017K4256L903R269j120j5936J7477n957o362J7317P147
13738B6831k4668r857J3363r213J666O661k261k315k16O579M699j7506Q463P032
13724I258J2846P825o254j4240k319q026j5877J504K8268P161j0947j0584J0678
13711I293J4396M113n637l079J800n481k199m47K1424J2375p743q335j8915l371
$$ y = [-39425, -44476, -53655, -40027, -32097, -9126, 13417, 16833, 3908, 16872, 15648, -6824, -13825, -11686, 2719, 537, -7632, 1274, 22608, 24998, 12240, 11659, 5034, 7765, -1811, -13990, -9565, 16996, 20653, 37794, 50495, 36903, 26154, 7888, -4286, -3432, -1746, -17522, -19926, -27070, -9548, -5906, -24347, -30084, -33377, -22187, -11063, -9744, -26941, -20795, -1222, -572, -678, -7808, -1638, -11904, -41180, -23163, 1093, 4996, 14265, 13145, -2791, 14686, 8729, 2367, 19684, 26831, 2163, -7694, 5669, -3544, -1878, 4783, 2522, 207, -9, 6570, 11269, -6237, 2226, 9258, 22104, 29929, 23675, 9435, 7116, -910, -16787, -15283, 12985, 20146, 9199, -1385, 9293, 23689, 27802, 22165, 19086, 20886, 15405, 13206, 12759, 34183, 46558, 38815, 30480, 11565, 8194]
13697H194J2824k4955j1146k229K7529L6270p658j1605P426j3449Q178j193m222
13684B3964M611P154M350O62o138j0346j8812m739j4223J0274Q407J6403l000
13671A8567j3398j1106O300j0130p988j8898K7885J33M920O271K788m799n768
13658e223r09K4827k746K295O703R385p736j0966j3496K0118J9497J8512K3321
13645H3582L4585L9236J0415j0583k2426J035J446N725J8356K0769L2534N2426
13633B67100O5996R1511J11957K36204L83774N98360O33748K33920l50779o59204
13623A612587n82742l56862k00321j15780p2415p5316m4577l2995j8713k5592
13613H7274j4583j0005Q450J892j7237l1094P11o718l6490M941K0292K1389J4384
$$ y = [8194, 21018, -3937, -15083, -17312, 10217, 46487, 38829, 27224, 34650, 21201, 29379, 28186, 23964, 28575, 35729, 40079, 40741, 34603, 24257, 5445, 706, -13517, -3243, 5164, 21567, 18567, 5169, -5937, 363, -9767, -17755, -36653, -8768, -8635, -3715, 2556, 5344, 545, -5223, -6132, 18695, 15949, 18244, 24947, 34332, 26596, 15630, 2134, 22252, 41749, 60261, 83582, 118167, 157403, 167818, 157235, 134809, 135844, 137290, 143015, 161371, 182140, 214674, 267100, 333096, 424607, 536564, 772768, 1156542, 1754902, 2388650, 2622570, 2271791, 1612587, 1029845, 672983, 472662, 356882, 284467, 209151, 164574, 131579, 112866, 87274, 72691, 62686, 71136, 73028, 55791, 24697, 25408, 18690, -17800, -12859, 7433, 28822, 43206]
13600D3206j7097o240Q766n610K334r512J6641L920j3271k387K071k390N212L783
13586B9426J1679O85j4401n971j1948J6164P990m568J62J9517o913j0863p416
13573B3543M865J5542o360O222p844o592k522m931K7840L8473J0097k2926j5598
13560E9809L39k7543n226J4686O261n164m086r101j8210J0427J9072J5444j404
13547E5304o292P134j0401j3099J0846o571j6540j1586o452N613R7J2281J1081
13534C1415m81j526J02j101j499m789j2808J7319K4679m925j7661j9072J2850
13521B2503J1033k204J2874l063n706M573j32j7682n071Q235P172J3802O616Q576
13507F1526n612k0023p772l949j098J9647J0321m310j0684R037M550R230J1389
$$ y = [43206, 26109, 19869, 28635, 23025, 25359, 15847, 32488, 36408, 23137, 20750, 22821, 20431, 25643, 29426, 41105, 41790, 27389, 21418, 9470, 25634, 33624, 29056, 29218, 48735, 41822, 30959, 23543, 28408, 43950, 37590, 43812, 35968, 29376, 26854, 21923, 49763, 88236, 98333, 75407, 59809, 60148, 32605, 27379, 42065, 48326, 43162, 39076, 29975, 11765, 22192, 41264, 56708, 55304, 49012, 56146, 45745, 32646, 43492, 36921, 20381, 8795, 2343, 7956, 8053, 20334, 31415, 30934, 29408, 29510, 28409, 26910, 22121, 9313, 26632, 51311, 46386, 28725, 9653, 22503, 33536, 31332, 44206, 41143, 35437, 40010, 39878, 22196, 17125, 25360, 32532, 46334, 52950, 61526, 55914, 35891, 28119, 24170, 23072, 42719, 53040, 48730, 38046, 47083, 51633, 60863, 72252]
13494G2252P400j9729k3843K980l889O519P820j8665o379J30q91p097P456j5934
13480H130j0693K4075O811q707K1341n912J7263J4151n405J0344R155k0941j5898
13467D3714o618m816o064j8338l612J700J5317N729K4340J5824j304O978k788
13454G0062j4412n183Q898o043J7115m307j04j0440K9646J6866k3141j9321k6514
13441C3122M811K6952J5306M9770P6971J1188o1572j5159J05160L3460j2962L1631
13429B98678J7032l9596k6538l0871n1086m3634k9197j4377K0229J826p425R891
13417A04932K1110J8828o296k5153n504j3324L0881J8029L744O178J4322K9164
13405A96911J8938r803n471j594J3753J1090O667q204J9778K6782M3557M5984
$$ y = [72252, 79652, 59923, 36080, 39060, 35171, 41690, 49510, 30845, 24466, 24596, 23705, 16608, 24064, 8130, -2563, 21512, 28323, 19616, 40957, 35045, 52308, 66459, 61054, 71398, 80553, 59612, 43714, 37096, 32280, 26216, 7878, 4266, 5966, 21283, 27012, 51352, 67176, 65872, 72850, 70062, 55650, 50467, 59365, 53322, 70437, 66130, 66026, 55586, 85232, 102098, 78957, 59636, 33122, 37933, 64885, 80191, 129961, 206932, 218120, 156548, 141389, 246549, 280009, 267047, 298678, 315710, 276114, 249576, 218705, 167619, 123985, 94788, 80411, 100640, 102466, 95041, 104932, 126042, 144870, 138574, 113421, 107917, 94593, 125474, 143503, 147247, 153425, 167747, 196911, 215849, 206046, 200575, 198981, 212734, 223824, 230491, 222287, 242065, 268847, 312404, 358388]
13393C58388M1378O9680R8775R7791J51988J76386K24696L51196N63268R54624
13383C088170J591714K318442K410916J020900j178746k457334k257209j528067
13375C008786r43925n71559l61677k84821k17174j43912o4223m8347k0053J1795
13365C64890o237j5035j2688j2367Q351j4829l8923k7012o600j8501j4591k3136
13353A83322k2534l172Q506J3568M642J538q680k2259j911Q030J7609M69m234
13340A74894j7105l0709k3791k6701l5476j3928R828J6204P024r237J2886Q999
13328G2888j0683l6723L033M5676L4706K9355J8809k1037m1389J0550J3946J2939
13316A32070K0589Q380N039k3636l274k71n8364j21033k01126l12982k00766J46482
$$ y = [358388, 399766, 469446, 568221, 666012, 818000, 994386, 1219082, 1570278, 2133546, 3088170, 4679884, 6998326, 9409242, 10430142, 9251396, 6794062, 4536853, 3008786, 2064861, 1493302, 1131625, 846804, 629630, 485718, 421495, 373148, 353095, 364890, 358653, 343618, 330930, 318563, 326914, 312085, 273162, 246150, 239550, 221049, 206458, 183322, 160788, 157616, 166122, 179690, 184332, 185870, 177190, 154931, 153020, 161050, 178659, 179128, 174894, 157789, 127080, 103289, 76588, 41112, 27184, 37012, 53216, 60240, 51003, 63889, 72888, 62205, 25482, 28515, 74191, 108897, 138252, 157061, 136024, 94635, 105185, 119131, 132070, 152659, 161039, 166078, 142442, 139168, 138897, 80533, -40500, -241626, -554608, -755374, -608892]
13304f08892M05075L64720K13336L4827m8349m9109n1392L08n892j5515k0006
13293B19111k7502j538o913m425J0059K7821K7301j8507j0675P58o232Q448J0958
13280B28664J7281N55K0459P670K1578j4155K78K5859K5467L7299M7496K593j823
13267D19221l6536m6092m7958l1436J8185K0035J805k5599K430K2847J9847K7754
13255C44503K782l379k4526j1042n708l650j685L5209N0281L2456M6993M4489
13243E06723J6163K2885L7740K0814j1616j1442N365N7985R2812J13172J13176
13232I63777P4794K3294k9132m6400o753L114P910J9307N419L4621K6780N2850
13220A129581N4764N7226M4886M1111J7720K9409Q3396R5229J17680J55325K04051
$$ y = [-608892, -203817, 160903, 374239, 409066, 360717, 311608, 260216, 260524, 254632, 239117, 219111, 191609, 190071, 183158, 178733, 188792, 216613, 243914, 225407, 214732, 215490, 209258, 217706, 228664, 245945, 246500, 266959, 274629, 296207, 282052, 282330, 308189, 333656, 370955, 418451, 421044, 419221, 382685, 336593, 288635, 257199, 275384, 295419, 297224, 271625, 274055, 296902, 316749, 344503, 347285, 343906, 319380, 308338, 302630, 298980, 297295, 332504, 382785, 415241, 462234, 506723, 522886, 545771, 583511, 604325, 592709, 581267, 586632, 644617, 737429, 850601, 963777, 1038571, 1061865, 1032733, 986333, 979580, 982694, 990604, 1009911, 1015330, 1049951, 1076731, 1129581, 1184345, 1241571, 1286457, 1327568, 1345288, 1374697, 1458093, 1553322, 1671002, 1826327, 2030378]
13209B030378K16864J96933J59805J15945J49963K52062K87743L38810L96031
13200D144534M11508M42097N27767O03696P99397R84775J206406J478598J771558
13191A2370336K184380K847574L822054N076303O822400R459563J3625708K0548362
13183G6756680L3787353O0119738J02278122J34736080J00406991j0086566j13256853
13176C84741545j33972630r6163678n5684171l0627144j7927772j1745185q439404
13169C0181561o387565m777863l514925k575752j879307j410209j099202q97936
13161G638802p64915o92658o14051n03647m44905l53163l10277k76659k36441
13152C442086j93244j34393j29547m8092p0052j48086j88757j95111j65151j38668
$$ y = [2030378, 2247242, 2444175, 2603980, 2719925, 2869888, 3121950, 3409693, 3748503, 4144534, 4556042, 4998139, 5525906, 6129602, 6928999, 7913774, 9120180, 10598778, 12370336, 14554716, 17402290, 21224344, 26300647, 33123047, 42582610, 56208318, 76756680, 110544033, 170663771, 272941893, 407677973, 508084964, 497998398, 384741545, 250768915, 154605237, 98921066, 68293922, 50366150, 38620965, 30181561, 23793996, 19016133, 15501208, 12925456, 11046149, 9635940, 8536738, 7638802, 6873887, 6181229, 5567178, 5063531, 4618626, 4265463, 3955186, 3678527, 3442086, 3248842, 3114449, 2984902, 2936810, 2866758, 2718672, 2529915, 2334804, 2169653, 2030985]
13142B030985j37401j54153j38102j20770p8225n2843o0600m9034n9012m8640
13132A132205l1500j4941n363j7343l4882m9717n4651m5902m3806n0225m1320
13121G42555j4962n896n3823l4717j6050l2722k7852j0454j8538P976L9141J7786
13109E92444k798J023j6840l9844m8070l3815k6035j955j2271m584k999j3562
13097C90694k4340l8829l0179N09K695n311k3992q497k6605k3751J0250K638j3874
13084B11408j8825k873J5008n129l054M4334K3276M680o463o160k3128j6441L432
13071B20065j2116k2067K0428K8614K5828N623l0067l6641J5614K432K1249J2878
13059B51840Q992L7028M8402M9836P3560O6911k6503q7754r4390p8799l9001M668
$$ y = [2030985, 1893584, 1739431, 1601329, 1480559, 1402334, 1349491, 1288891, 1239857, 1180845, 1132205, 1100705, 1085764, 1080401, 1063058, 1028176, 978459, 923808, 877906, 834100, 783875, 742555, 727593, 721697, 667874, 633157, 617107, 584385, 556533, 546079, 527541, 535517, 574658, 592444, 589646, 590669, 573829, 533985, 485915, 452100, 426065, 424110, 411839, 407255, 404256, 390694, 366354, 327525, 297346, 297855, 300550, 295239, 271247, 262750, 236145, 212394, 222644, 225282, 211408, 192583, 189710, 204718, 199589, 196535, 240869, 264145, 268825, 262362, 256202, 233074, 216633, 220065, 207949, 185882, 206310, 234924, 260752, 266375, 236308, 199667, 215281, 217713, 238962, 251840, 260832, 297860, 346262, 396098, 469658, 536569, 510066, 422312, 327922, 249123, 210122, 214790]
13047B14790p440j947M869J146k6318j6429K794j535O660J242j5931j5260J0503
13034A57144J9348L6628J8853j0359j8015j3673l2346j3391K0751J2761N627Q748
13022A92076P183j8759l6828l2886j3398j138P630L382R555m611J1624j8027m2090
13009F3713j1232J412J1235K9711J4604p383j6449r098o92l4714l2359p565k98
12996H85K1018K1060Q992J8108J1338K0168J4662K2616K7313L0961j502m0803
12984A54816l3000l5851k7727m1205m1836R650L1906L7739K6408J8217J9621M949
12972A23687j0034j6940r733r792k0010j2556J3703Q163M430r648R575K5211n4914
12959D1142j2022l040m379q058j5720P479R356J7372J5590J8552P867j5987j5898
$$ y = [214790, 207350, 205403, 210272, 211418, 185100, 168671, 171465, 169930, 176590, 177832, 161901, 146641, 157144, 176492, 213120, 231973, 221614, 203599, 189926, 157580, 144189, 164940, 177701, 183328, 192076, 199259, 180500, 143672, 110786, 97388, 96250, 103880, 107262, 116817, 112206, 123830, 105803, 63713, 52481, 53893, 65128, 94839, 109443, 102060, 85611, 76513, 75821, 41107, 8748, 1183, 885, 21903, 42963, 51955, 70063, 81401, 101569, 116231, 138847, 166160, 197121, 195619, 154816, 121816, 85965, 58238, 17033, -24803, -15153, 16753, 54492, 80900, 99117, 118738, 123687, 113653, 96713, 86980, 77188, 57178, 44622, 58325, 66488, 70918, 61270, 70845, 96056, 41142, 29120, 26080, 21701, 13643, -2077, 5402, 14758, 32130, 47720, 66272, 74139, 58152, 42254]
12946D2254k2190p083K719j1119r59n783p14J5354J4360N1257R737r320j7775
12933F0738n287n065j643Q577J1224K4590L985J6535J4091r566k1549k2275j0982
12920F3373J822j486k0055p487j152j7769j8711P297j671L660K0282J1577P227
12907D6907j2114r282n44k7051k844K1094J3107P327M184J3085r693j0183j4139
12894A9854L1549K4442j2728l830k2305j3386R054J9161n93P24q507j3976j975
12881B7484J0752J2124p793j2894O55L437J1156J1175k2264k4484l187j5293P770
12868a362L4146P724M277j741j4339j5741o357L400j3740o289J4633p393o90J3814
12854A0342J7285k905l0187j2293Q628J4595J3278J7017N709j7713j0923L041
$$ y = [42254, 20064, 12981, 15700, 4581, 3622, -2161, -2875, 12479, 26839, 78096, 87833, 78513, 60738, 55451, 50386, 48743, 57320, 68544, 93134, 97119, 113654, 127745, 118179, 96630, 74355, 63373, 65195, 63709, 43654, 36167, 35015, 17246, -1465, 5832, 4161, 7821, 28103, 39680, 46907, 34793, 25511, 24967, -2084, -4928, 16166, 29273, 36600, 40784, 53869, 44176, 33993, 19854, 51403, 75845, 63117, 59287, 36982, 23596, 32650, 51811, 51218, 51942, 43435, 29459, 27484, 38236, 50360, 42567, 29673, 30328, 33765, 44921, 56096, 33832, 9348, 6161, -9132, -1362, 32784, 40508, 44785, 43044, 28705, 12964, 6607, 10007, -3733, -10022, 4611, -2782, -3472, 10342, 27627, 24722, -5465, -17758, -9130, 5465, 18743, 35760, 41469, 23756, 12833, 15874]
12842A5874N4M529p18n870N236K1530m377j1920q725o412p526j0652L058L6188
12828C0269Q425k411j152K06q756r615Q580K9534J0852j0716j6853j0035j1966
12815A6362l516R142J1829j5510k1538j5829l5K946p879J2470K054q09K3107m862
12801G932l024j7095K301M884r867J404l708m731J0215M93K6424J3062J2766q705
12787C2351O96m286J2720m379m135R889j1637m783L634K3422j364j5149j3368
12774B3611q306K686J872p172m105J1481J2668j6903n437J4283M243J1688J2610
12761E3219n579j7593q568P551k1516J3526J3710j2207Q585O928l695J1629n729
12748D0261j3440M981K6554N744k380k123Q592m430Q474J2616q907k8593O028
$$ y = [15874, 15928, 20457, 19739, 13869, 19105, 40635, 36258, 24338, 15613, 9201, 1675, -8977, -5919, 30269, 38694, 36283, 35131, 35337, 26581, 16966, 25546, 55080, 65932, 55216, 38363, 28328, 16362, 12846, 21988, 33817, 18307, -3231, -19060, -19095, -16149, -24028, -11558, -9504, -10313, 12794, 7932, 4908, -12187, -9886, -5002, -14869, -13465, -17173, -21904, -11689, -11196, 15228, 28290, 41056, 32351, 33047, 28761, 41481, 37102, 32967, 42856, 31219, 26436, 30070, 53492, 52128, 36979, 23611, 15305, 17991, 19863, 12691, 8586, 20067, 32735, 15832, 10395, 24678, 28921, 40609, 53219, 47640, 30047, 21479, 29030, 7514, 21040, 34750, 22543, 31128, 38056, 34361, 45990, 40261, 26821, 31802, 58356, 64100, 61720, 59597, 68189, 63759, 72233, 84849, 75942, 47349, 53377]
12735E3377L4046K9114J9543L8235M2513N5339J30099K28134L53431N82028O39335
12724B205194K96016k80569o24997n76955l97890k34144j16599p6646p5230p5530
12714D2650o0385J6927O2296L5800R986q353j0652j6087l401R165Q786j7825j9172
12701D9735j0488P644j5920j6673L7183O599k0249l1655o157J0704J7555P458
12689C5736k554R593j2692K065L742l1759Q011J3021j9325n986L645J2818l52
12676A5963j6940L452M534O644p20J1676K104O342j6070k2727n753j0640K099
12663b0036K9026M556J1594l985m141n024Q326K9768N70p346k3087j9888L208
12650C541R148n749J2505K314j739q680j9598Q662K153o842K4459m230k1605j0680
$$ y = [53377, 87423, 116537, 136080, 174315, 216828, 272167, 402266, 630400, 983831, 1565859, 2205194, 2501210, 2220641, 1595644, 1018689, 620799, 386655, 270056, 193410, 118180, 42650, -17735, -808, 61488, 97288, 107274, 98921, 88269, 72182, 68781, 77946, 86732, 68907, 49735, 39247, 46891, 30971, 14298, 51481, 58080, 37831, 6176, 19, 10723, 28278, 35736, 33182, 42775, 30083, 32148, 35890, 4131, 12142, 25163, 5838, -148, 3497, 16315, 15963, -977, 2475, 7009, 13653, 12933, 24609, 26713, 33055, 16985, -5742, -11495, -22135, -20036, 8990, 13546, 25140, 21155, 17014, 11990, 20316, 50084, 50654, 43308, 20221, 333, 3541, 12689, 6940, 19445, 21759, 20020, 11340, -8258, 404, 2557, -4285, 20174, 15944, -5661, -16341]
12636a6341l607J0837O534k144J900K1780l354K777j2940k676J472j0957J073
12623e646Q805Q504J0456m076O322N835J5089q787k4097j4975j0262N168n579
12610a3243O215q544p752J298m972k456J4565J9283m880j9331m949K0289J7056
12597A2579J5793R361n544M411o787j371J278k4667K652J0427N134P498p199k6912
12583c347j6139O316J3961P846J3741j2277k0397M90J4983K9786J4658J723k3788
12570B7556j5841K993M41J3802J1705K02k5157j4153n587J570j7099l395K0539
12557b424O183k030j2006J4079J4504p246Q460Q8J099k8361K784O123J0815m895
12543G173K4895N203m987j8084j2850k131k467J0402j625K0715J260k404O660
$$ y = [-16341, -19948, -9111, -2577, -4721, -2821, 18959, 15605, 18382, 5442, 2766, 4238, -6719, -5646, 3159, 11663, 22119, 18043, 24365, 30200, 45289, 36502, 12405, -2570, -12832, -7664, -13243, -7028, -15572, -23324, -22026, -26998, -29454, -14889, 4394, -486, -19817, -24766, -4477, 12579, 28372, 37733, 32189, 36600, 29813, 28442, 29720, 5053, 7705, 18132, 23266, 30764, 23565, -3347, -19486, -13170, 791, 8637, 22378, 10101, -10296, -9806, 5177, 34963, 49621, 51344, 27556, 11715, 14708, 15149, 28951, 40656, 40858, 15701, 1548, -4039, -2469, -19568, -22963, -2424, 3759, 1729, -10277, 3802, 18306, 11060, 19520, 19608, 20707, -7654, -4870, 1253, 12068, 7173, 32068, 37271, 32284, 14200, 1350, -781, -3248, 7154, 5529, 26244, 27504, 25100, 31760]
12530C1760j0972j0340o73K592p97j4014j4816K208L491J322n381p386p184P708
12516b2482J2125M570K9302J3663j9964P967R423l588j3352p458l117r356J1875
12503I608J0206Q403J73K895P580j0328q271N215j685l9053j4624M099n169J2139
12489a8812K1797p060q545r558j0495J3290J7362K6053n448N438k0640k6850J0333
12476a3135Q996o216j480J2294J9511l483L863P300O762l888j8460o454J0691
12463A6301l782N643R560l726q603j376j4305M463P24m023M82P327J482n295R846
12448A4718J8630k2186k3569j3936J7197N413J2829k24n488j8761o861J2070j251
12435a1419J5947R455L789J4020M975j280k9127r309K847l38m137L419n338l414
$$ y = [31760, 20788, 10448, 9775, 12367, 11570, -2444, -17260, -15052, -11561, -10239, -15620, -23006, -30190, -22482, -10357, -5787, 23515, 37178, 17214, 25181, 34604, 31016, 17664, 10206, 7089, -2267, 9608, 19814, 28217, 28390, 31285, 38865, 28537, 20266, 25481, 23796, -15257, -29881, -25782, -30951, -18812, 2985, -4075, -12620, -22178, -32673, -19383, -2021, 24032, 18584, 24022, 3382, -23468, -13135, -4139, -10355, -11835, 459, 19970, 16487, 20350, 27650, 34412, 30524, 12064, 5610, 16301, 12519, 18162, 27722, 23996, 15393, 14017, -288, 4175, 4899, 876, 1358, 8685, 10167, 4872, 14718, 33348, 11162, -12407, -26343, -9146, -3733, 9096, 8872, 3384, -15377, -22238, -10168, -11419, 4528, 13983, 17772, 31792, 36767, 35487, 6360, -2949, -102, -440, -4577, -1158, -6496, -9910]
12421i910L331J5433m711n59M527J0583r275k922m777J9799Q470K93l5806j005
12407f529P700M028M089M985k032l2905j3243J2099l90J2395R68j3245j5808L2450
12393e438J9181O161q277q879L422L596L501J085k2145K214k0960q311k819R377
12379b8292L2734P4m546M732N353j184o113J4853j081j3926j1172M173O796L685
12365F086j385j0370L722J3590R172Q337k8867J0052J8366o276j2741K1190N707
12352C6583n798n478j3817j1272j1535J5995l592j0236L169J6697L213q249j0396
12339d716J4320J4085p243j0555J194j9029r222k153J7892J3206m191l289k650
12326b351P622J3211j2734l802J8097O321L481j4143k5839K3730m153j8029k2154
$$ y = [-9910, -6579, 8854, 4143, 3584, 8111, 18694, 9419, 6497, 1720, 21519, 29989, 30282, -5524, -6529, 1171, 5199, 9288, 14273, 12241, -20664, -33907, -21808, -22198, -9803, -8835, -22080, -37888, -5438, 13743, 19904, 11627, 2748, 6170, 9766, 13267, 14352, -7793, -5579, -26539, -34850, -37669, -28292, 4442, 4516, -30, 4702, 10055, 8871, 2758, 17611, 16530, 2604, -8568, -4395, 2401, 6086, 4701, -5669, -1947, 11643, 20815, 29152, 285, 10337, 28703, 22427, 9686, 30876, 36583, 30785, 25307, 11490, 218, -11317, 4678, 1086, -9150, -5981, 10716, 13929, 5680, -4716, 9604, 23689, 16446, 5891, 7085, -11944, -21166, -23319, -5427, 7779, 3588, 299, -2351, 5271, 18482, 5748, 1946, 20043, 26364, 29845, 15702, -10137, 13593, 9440, -8589, -30743]
12313c0743N61J6083k006J8707N291K069J434k6635j214O610K4297p597n243j9485
12299a7871k2828l544J9326p896r144M486M070R208j646J1086L029n211L2111
12286A5176N049o129j1595p212J832j4658J1074Q416M631p133o406o628J5893
12273B310K318j8534J1429L024j2640Q35J0490n896j8610j547J2197Q620q589
12260a4593j2612M87r237j9503K1018J1656o172l144J9185m62j305O72R636j6420
12246b0794k7682l689K7588K0768q274k560j531r251Q943O446O959N715k2602
12233a9964p901K1738J0086Q972J021L847J2790N308j1182j4283o766r078o814
12220a2226P863N463K6194n842j5535L617R40j2742k7432K6444P266k0768k7052
$$ y = [-30743, -30182, -14099, -16105, 2602, 7893, 9962, 11396, -15239, -16453, -9843, 14454, 6857, 1614, -17871, -40699, -44243, -24917, -32813, -41957, -37471, -33401, -24193, -25839, -14753, -11724, -16935, 15176, 20225, 14096, 2501, -4711, -2879, -17537, -6463, 1953, 6584, -549, -6955, -13583, 2310, 4628, -13906, -2477, 547, -12093, -11258, -768, -6664, -25274, -26821, -14624, -6004, -14593, -27205, -26718, -35955, -55458, -34440, -22784, -28956, -32100, -12915, -13377, -14682, -14010, -4374, -20794, -48476, -52165, -24577, -3809, -12083, -14643, -16174, -25425, -16482, -10036, -3077, 2638, -19964, -27865, -6127, 3959, 12931, 13952, 17799, 30589, 35897, 24715, 10432, 3666, -5412, -12226, -4363, 1100, 27294, 21452, 5917, 9534, 10474, -2268, -29700, -3256, 4010, -16758, -43810]
12207d3810j0100K4220J2114K0605L895p204N256o988j1362j0871K2016k897j2884
12194a8010r802J7344K3008Q969J4028K204M136j1164K444j9051l014J936m443
12181H585J25o088j5570J8425N146k4325L522L95L4049L0301M390J2710k7651
12168D4014j5286l20K940q696l789j1603j1954m429j5720K7860J5912r810j562
12155G557j884j7100j4472r718J3430K5751J1232j0882j5019J1175J5172J4613
12143B9855k0836r824J6589P571j6929l387K957p054r150J9209P091P191l02J3229
12129C6210j3344j1645k095o427K3244p009k1991l42O381J2441j712N417M409
12116B3537k1415j6926l84j374J1463J4815q012N887l546p104R260L625j0460
$$ y = [-43810, -53910, -29690, -17576, 3029, 6924, -280, 4976, -2012, -13374, -24245, -2229, -5126, -18010, -27812, -10468, 12540, 21509, 35537, 37741, 41877, 30713, 33157, 14106, 11092, 13028, 8585, 8710, 2622, -12948, 5477, 10623, -13702, -10180, -9785, 24264, 54565, 58955, 71665, 44014, 28728, 28408, 31348, 22652, 18863, 7260, -4694, -9123, -24843, 3017, 18929, 9119, 7557, 5673, -11427, -25899, -35617, -22187, 3564, 14796, 3914, -11105, 70, 15242, 29855, 9019, -805, 15784, 23355, 6426, 3039, 5996, -1058, -10208, 9001, 16092, 23283, 22981, 36210, 22866, 11221, 9126, 2699, 25943, 18934, -3057, -3399, 2982, 15423, 13711, 19128, 23537, 2122, -14804, -15188, -16562, -5099, 9716, 1704, 7591, 4045, -3059, 6201, 9826, -634]
12103f34j708O218o411m562L64n250j0176j4171r186K3221J8548j338j0707J4094
12089a698j415j4753P16J8316J2917J9835j7928l2119l1464j902J8953J92Q247
12076b2103J0734N624P281J7461m196p109m80Q204k0887j1547Q341l733J594N376
12062e440K667o083P639K510K0400J570r986o748l1776R405N151k6931J7276J4458
12048e888m733r832M998R571o259k573K5445L0011j9052k3112j3125O270J5978
12035G699J0318j504l3169m311J4405j1455J0151J0083k539J987p39j5328o01
12022a5003n105K3486K8474j3423k3149j0337j8906Q355o110j5117N680K5789
12010a5366j3576k500J0300o823M156o02Q283K6656J4938p186l0707P948L881
$$ y = [-634, -2342, 3876, -2535, -7097, -6733, -11983, -22159, -36330, -45516, -22295, -3747, -5085, -15792, -1698, -3113, -17866, -17150, 1166, 14083, 33918, 15990, -16129, -47593, -49495, -30542, -30350, -22103, -11369, -5745, 1536, 18997, 14801, 7692, 7212, 15416, -5471, -17018, -8677, -12410, -10816, -5440, -2773, -8856, -1217, 1293, 21693, 23263, 13277, 6529, -25247, -15842, -10691, -37622, -20346, -5888, -10621, -20453, -15455, -5884, -12143, -14716, 10729, 40740, 21688, -1424, -14549, -8279, 7699, 18017, 16513, -16656, -20967, -6562, -18017, -7866, 2217, -322, 1665, 926, -14402, -15003, -20108, 3378, 31852, 18429, -4720, -15057, -33963, -25608, -31718, -46835, -41155, -15366, -28942, -31442, -21142, -27965, -23809, -24411, -16128, 10528, 25466, 18280, -12427, -4479, -598]
11997e98n627k0922r866J565m443J4732Q574M74k0526j182J2426J214P864R757
11983f558J6974N116M390k5388R281J2155j6563P585L339m722q773K665N561k460
11969B602k3428O837P916L942j0988L851K2656L1146J4982m355l0472j8938K953
11956H704n10K30j162j806j5637O032K1169m293j9581P39o891R547P826k9079
11942b4712k797j849k525j288k874P475Q851J5661J0374j344N549j5424j7888
11929b2791J2414j1095k56J109j795j7244J3058M950m781n7o255j8044j922K731
11915d9978J959K1611K9158J328J1913j4164J0417J8640P569l3984j9931M397
11903a1065K4441q851J5869Q829l652j780k8377r777M771j1558j6896M419J1672
$$ y = [-598, -6225, -27147, -37013, -35448, -39891, -25159, -16585, -16111, -36637, -37819, -25393, -24179, -16315, -6558, 10416, 15532, 19922, -5466, 3815, 15970, -593, 6992, 10331, 5609, -3164, -499, 5062, 2602, -20826, -13989, -6073, -2131, -13119, -9268, 13388, 44534, 59516, 55161, 24689, 5751, 8704, 8194, 8424, 7262, 5456, -10181, -4149, 17020, 12727, -6854, -6115, -13006, -3459, 4367, -24712, -27509, -29358, -31883, -33171, -36045, -28570, -19719, -4058, 6316, 4972, 10521, -4903, -22791, -10377, -21472, -21728, -20619, -22414, -39658, -26600, -21650, -26431, -26488, -32743, -50787, -52709, -49978, -48019, -26408, 2750, 4078, 15991, 1827, 12244, 30884, 38453, 4469, -15462, -11065, 13376, 4525, 20394, 29223, 25571, 23791, -4586, -14363, -9592, -21150, -38046, -33627, -21955]
11890b1955j9476J0242K8667J1108K1182J1321P643P853k186k7720j1160k4776
11878i257M861o618l240L547R654m480K2727J6095k1211n261k1625j2890J7205
11865a0493J703m664k697l537l868J0048J1563n352r650J7231L690j9807J1718
11852d115J9599Q177k043j7186j0053j5231J547O602l266J0266j846R803K9712
11839C1966n444j8089J249j6003p550J3102J597m848L616J0892k4783P529K6588
11826A9822P581j961P831k6133l5213L211J7508J1772o243l2881j5389q40J8679
11813c2256J3081J4713j249j0569R972J0905n630J1043k210o653q379j2432k823
11800b2487K4826J4938k7024k9668L263K2418K0603R251k689p735j3416k6321
$$ y = [-21955, -41431, -31189, -2522, 8586, 29768, 41089, 48732, 56585, 54399, 26679, 15519, -9257, -4396, -11014, -14254, -10707, -1053, -5533, 17194, 33289, 12078, 6817, -14808, -27698, -10493, -8790, -13454, -16151, -19688, -23556, -13508, -1945, -7297, -16947, 284, 3974, -15833, -4115, 15484, 23661, 21618, 4432, -5621, -20852, -19305, -12703, -15969, -5703, -7549, 2254, 31966, 26522, 8433, 9682, -6321, -13871, -769, 828, -4020, -404, 10488, -14295, -6766, 19822, 27403, 25442, 33273, 7140, -28073, -24862, -7354, 4418, -1825, -34706, -50095, -50935, -32256, -19175, -4462, -5711, -16280, -6308, 4597, -1033, 10010, 7800, 1147, -7232, -19664, -22487, 2339, 17277, -9747, -39415, -36152, -13734, 6869, 16120, 13431, 5696, -7720, -34041]
11788c4041j3180K4072K8004J4288J2445J5153j2529m2843j5411J7789N554j8694
11776a9393J2328r548o505q88Q997J4402K0450J0083j4203k4396O470M086k3369
11763b1486j7744J0609n679J2739L8205J8353l840j1769p438K0511L747q12j6054
11750A9342j3229k1053J4363q950k7216j1800L1310L4128Q760l4372n665Q648
11738e734k0315J9392j4083j3340n917m861K8665K4584J8450J6715j34m709q378
11725C0335n501P18l140L784p915r954Q011J2398j5815j114J3682m114j4075J763
11711I063J1673K761l367l335p447l2301k2798K416J5591O040J1722p936J1859
11698f059K6923K084n429P505M751j2921j9872N496J1450J388k1431j6982l433
$$ y = [-34041, -47221, -23149, 4855, 19143, 31588, 46741, 34212, -8631, -24042, -6253, -699, -19393, -7065, -16613, -23118, -24006, -15009, -607, 19843, 29926, 15723, -8673, -2203, 1883, -21486, -39230, -28621, -34300, -21561, 16644, 34997, 31157, 19388, 11950, 32461, 36208, 35396, 19342, 6113, -14940, -577, -9527, -36743, -48543, -17233, 16895, 25655, -8717, -14382, -5734, -26049, -6657, -20740, -34080, -39997, -44858, -16193, 8391, 26841, 43556, 43422, 38713, 30335, 24834, 25552, 22412, 26196, 18281, 8327, 16338, 28736, 12921, 11807, 25489, 21375, 7300, 9063, 20736, 23497, 20130, 16795, 9348, -22953, -45751, -43335, -27744, -21704, -9982, -17918, -6059, 20864, 22948, 17519, 25024, 29775, 16854, -3018, 2478, 13928, 15316, -6115, -23097, -26530]
11685b6530J3294J7109J9713O435k5568r014j876n431j5493K744J2416j570Q310
11672e461K4331L0785j637k063r106j9914L729o836j0652O919k4734K151K9659
11659A7171Q311J3653n712r604k467J5779j917l8508j8050J0717P937n347k738
11646a0775J0395M658o421p561p683o664J6224L0209j3278j6277Q426k010j8705
11633a9462m872K715O116Q933p703l911J4954p718p173j3819L09L127J8363j3270
11619b3411k183J6809j1070m312j1835J0462K6277J1612J4980Q579p730k1100
11607G078j1445K851N850k164o34k9154k509J9262P026J5511P659O277J5346R098
11593E0052j5782k2879j6793j6777K4353Q534M054L056o334l694j0415o631M0181
$$ y = [-26530, -13236, 3873, 23586, 30021, 4453, -4561, -6437, -11868, -27361, -24617, -12201, -13771, -5461, 18870, 49655, 48018, 45955, 36849, 16935, 20664, 13828, 3176, 10095, -14639, -12488, 17171, 25482, 39135, 33423, 23819, 21352, 37131, 35214, -3294, -21344, -10627, -2690, -8037, -10775, -380, 4278, -2143, -9704, -17387, -24051, -7827, 22382, 9104, -7173, 1253, -757, -19462, -24334, -21619, -15503, -6570, -14273, -18184, -3230, -10948, -18121, -31940, -31631, -28504, -10141, -23411, -25594, -8785, -19855, -24167, -36002, -25540, 737, 12349, 27329, 35908, 28178, 7078, -4367, -1516, 4334, 2170, 1536, -27618, -30127, -10865, -3839, 11672, 19331, 25608, 40954, 50052, 34270, 11391, -5402, -22179, 2174, 10708, 14762, 17818, 11484, 7790, -2625, -9256, 30925]
11580C0925L555l602J552k5001j4506q61J2113P002r84r74r50l572j5428m719
11566a5450r616j3397Q426M200M60o881J6473J7361J1808K2075P731p039P731
11553D3882k5488k3286L693N15k788l165R343K3837O098J124J8464j7401j7390
11540A7438k7176k0388n983J4646J4054J2204O797J7241O295o618k2107k3832
11528a7429L979K633j3307m195P435m55j5985J6181K5182n870j6000J9012K324
11515C505j5576J2393J2901J3557r627j6210j2223p681Q511J258J8125J2383n846
11502A5470r120l982J616N629k9248m84J2651J9221J0597J1263Q296j814k5159
11489A4936n956k309k5718j7774P839M240J153j649J4572K1318J6849p16j3114
$$ y = [30925, 34480, 30878, 32430, 7429, -7077, -7938, 4175, 11177, 10193, 9219, 8269, 4697, -10731, -15450, -25066, -38463, -30037, -25837, -25377, -32258, -15785, 1576, 13384, 35459, 43190, 36151, 43882, 18394, -4892, -1199, -684, -3472, -6637, 2706, 26543, 32641, 33765, 52229, 34828, 17438, -9738, -30126, -36109, -21463, -7409, 4795, 11592, 28833, 35128, 28510, 6403, -17429, -13450, -10817, -24124, -28319, -20884, -21339, -37324, -21143, 4039, -1831, -17831, 1181, 3505, -12071, 322, 13223, 26780, 17153, 943, -11280, -18961, -10450, -9192, 8933, 21316, 15470, 6350, 2368, 3984, 9613, -19635, -20119, -7468, 11753, 22350, 33613, 41909, 40095, 14936, 8980, 6671, -19047, -36821, -28982, -24742, -23589, -25238, -10666, 10652, 27501, 26785, 13671]
11476A3671j3855j8888M737K1286P090J000j8250j0038J466O495J2209J2472R769
11463B9164K916k1448n921J7746m193M796k2495j7276M886j5406q444J0073K255
11450b3347j5729n080J3407K5815J4290K938M545k695n813p750r385J5251j95
11437F252j999j4115K293m286J282R769J0160j2485m472P356K0761O215Q672j912
11423C3491L885n37n896j1024k0988P880o445o802J0989j4392k9618K0897K9061
11410A0501k293r297K9913n425k2866j5110j997j2652J6414J6101j0790q850o675
11397b3026J1946M376o575j1281l574J1617J1437N833J7063q801r843j3921L477
11384a1272J7000k874p930k698J7239k326k5387p766J7247J5708m069J1602Q45
$$ y = [13671, -184, -19072, -14335, 6951, 14041, 15041, -3209, -13247, -11781, -5286, 6923, 19395, 29164, 32080, 10632, 4711, 22457, 18264, 23060, 565, -16711, -11825, -27231, -35675, -25602, -23347, -39076, -44156, -30749, -4934, 9356, 12294, 16839, 14144, 8331, 581, -8804, 6447, 6252, 4253, -9862, -7569, -11855, -10573, -804, 9356, -3129, -7601, -245, 20516, 26731, 35403, 33491, 37376, 36839, 30943, 19919, -1069, 6811, 366, -6436, 4553, -9839, -39457, -18560, 10501, 8208, -1089, 28824, 23399, 533, -14577, -16574, -29226, -12812, 3289, -7501, -16351, -23026, -11080, -6704, -13279, -24560, -28134, -16517, -5080, 753, 17816, 9015, -828, -14749, -11272, 5728, 2854, -5076, -7774, 9465, 7139, -18248, -26014, -8767, 6941, 2872, 14474, 15319]
11371A5319k288J2837l086k1459q440p322R530p80n231n595K873K8484p811j5152
11357h121p048m88N654j129j2207K4947N335n766j2310j8263o10l122j7930J7181
11343c3877L1503r771J0246J5979J473P999q277m881j0034k9936j8169J5459J0305
11330b1981K0398j2015j6840N318Q843R527N829K2069m211o681j2800j5717K501
11317a5760N785r129o470J6791L3731j7355j3798J908N085J3549k4174n223K4405
11304I345J7811q788J4614j2099j0291j4375j2640P644M357J7913k267j8199L3018
11291B6043j159j6343j2028l961J6691o548q021N060P290R763Q959l53p141L081
11277B1333J1507k855m384m825J5614j8917q322k71j0579j3295o691J298J7132
$$ y = [15319, 13031, 25868, 22782, 1323, -7117, -14439, -4909, -5689, -10920, -16515, -13642, 14842, 7031, -8121, -15169, -15657, -10003, -11132, -23339, 1608, 6943, 1177, -11133, -29396, -30006, -33128, -51058, -33877, -2374, -12145, -1899, 14080, 15553, 23552, 15275, 10394, 360, -29576, -47745, -32286, -21981, -1583, -13598, -30438, -25120, -16277, -6750, -921, 21148, 16937, 10256, -2544, -18261, -15760, -9975, -19104, -25574, -8783, 24948, 7593, -6205, -4297, 788, 14337, -9837, -15060, 9345, 27156, 18368, 32982, 20883, 10592, -3783, -16423, -8779, -4422, 13491, 11224, -6975, 26043, 24884, 8541, -3487, -7448, 9243, 2695, -5326, -266, 7024, 16787, 25746, 25393, 18252, 21333, 32840, 29985, 25601, 20776, 36390, 17473, 9151, 8880, -1699, -14994, -21685, -20387, -3255]
11264c255K305J5543j9199L669J0372J747J1925j9969j7677J4952L2202j7032
11252A5583l867n14N398j3191k6575l574J7319J4737q76K559J7059n162k3048
11239d152r010N426J3394P228J6945q549p238l537M414k648m354O172L025Q341
11225B5457P765j7273k2546k591j7363k4459l292K5459Q959k454K3050N02n735
11212d521k1086k1498O145J663k760O263K6723J9079k002p668Q168K3606j0970
11199B1142l2045k9258M58N316n407J0705K6815Q690k4688n822J5425J2310J9432
11186B3073K696k1581j6272J4969J0151j8733j0960k322J5435r863j278q042R665
11173a3062J2115Q83m13P635J5811k5152k0710J0495O041N476P018J0633o930
$$ y = [-3255, -950, 14593, -4606, -937, 9435, 11182, 23107, 3138, -14539, 413, 32615, 15583, 11716, 11202, 16600, 3409, -23166, -26740, -9421, 5316, 4440, 6999, 24058, 18896, -4152, -13162, -7736, 5658, 12886, 29831, 21282, 14044, 10507, 14921, 12273, 7919, 14091, 17116, 25457, 33222, 15949, -6597, -9188, -26551, -51010, -54302, -28843, -19884, -22338, 712, 1214, -4521, -25607, -47105, -40960, -39297, -42057, -35794, -9071, 10008, 8006, 338, 8506, 32112, 21142, -10903, -40161, -39703, -34387, -39794, -29089, -2274, 6416, -18272, -24094, -8669, 3641, 23073, 25769, 4188, -12084, 2885, 13036, -5697, -16657, -18979, -3544, -13407, -14685, -22727, -13062, -947, -64, -477, 7158, 22969, -2183, -22893, -12398, -6357, -881, 6137, 16770, 9840]
11160I840n252q718O918O459j8463J859q170J8543L044p765p888k1345N506M728
11146b0704O989Q091M440m646k0915j8812J3984K466j9248O943J9215L0400R535
11133A7738k1684k5102J2211J3459M732o507j2649R078J6331j1437k476K80Q200
11120B174Q319p66j7745L967Q603l204k5011P633o795K682K0175J4592j31k8334
11106a3841j1223Q818K491J6162n769j972k3463j4169O309K6717J1690J1933K8122
11093D1805J6133j8923k5930m106j4360k756P946l408Q436J8947k308j2228Q75
11080A0123N249l157r347j814L374n413J6270j2055r386P439j0670o496J6374
11067D91N702j0686p813J3875j4093r933P089J4785N049o904j7040O487J5948
$$ y = [9840, 4588, -4130, 2788, 9247, -9216, -7357, -15527, 3016, 6060, -1705, -9593, -30938, -25432, -20704, -13715, -5624, -1184, -5830, -26745, -45557, -31573, -29107, -48355, -41412, -22197, 8203, 17738, -3946, -29048, -16837, -3378, 1354, -5153, -17802, -8724, 7607, -3830, -6306, -6026, 2174, 10493, 9727, -8018, -4051, 4552, 1348, -23663, -16030, -22825, -20143, 32, 14624, 14493, -13841, -25064, -16246, -13755, 2407, -3362, -5334, -28797, -42966, -36657, -9940, 1750, 13683, 41805, 57938, 39015, 13085, 8979, -5381, -8137, -191, -3599, 4837, 23784, 21476, 9248, 10123, 15372, 12215, 2868, 1054, 4428, -985, 15285, 3230, -6156, 1283, -9387, -15883, 491, 6193, -4493, -12306, 1569, -12524, -22457, -15368, -583, 4466, -2438, -19478, -12991, 2957]
11054B957o44j0564j0267m798j8959J7777K3488j8078L49l774m78K513N317L555
11040a1606M198j0711j1964O20k72P756J3867j9163j5328j5345K4425K3197p899
11027a8225k910j623N634J6670P643j0537j6248j5016J0633J9965j368n79M351
11014a610m379j4996J0694j51j1612J1012M891p253j2791o69j5715n717J1260
11001c7036M560K1970K4934n822j7064M330q721o978n596j3391j3984K5446J7132
10988a0220r366k188J25P548K38j8077o669Q409J128K8370P060k3863q382J9252
10974f635j3512l0200J7139J4124m132j1721K757M457J3556J0867O029r752l196
10961a0219J4589K5819J2007j3192l0023k0153j4770k4573j0603J9537J3731K0102
$$ y = [2957, 2313, -8251, -18518, -23316, -42275, -24498, -1010, -19088, -18739, -22513, -22991, -20478, -15161, -11606, -7408, -18119, -30083, -29463, -29735, -21979, -8112, -27275, -42603, -57948, -33523, -10326, -18225, -21135, -22758, -17124, -454, 7189, -3348, -19596, -34612, -23979, -4014, -5382, -5961, -1610, -5989, -20985, -10291, -10442, -22054, -11042, -6151, -13404, -26195, -26864, -42579, -48296, -37036, -32476, -10506, 14428, 8606, -8458, -4128, -12849, -19827, -25423, -38814, -52798, -27352, -10220, -19586, -21774, -21649, -14101, -13863, -31940, -38609, -30200, -29072, -702, 6358, -17505, -25887, -6635, -20147, -50347, -33208, -19084, -23216, -34937, -32180, -27723, -14167, -3300, 2729, -7023, -10219, 4370, 30189, 42196, 29004, -1019, -21172, -35942, -60515, -71118, -51581, -37850, -17748]
10949a7748l854m342q0J1083J4073J7777j606j0097j7907l731M568m047k305k834
10935b1050l101P860J488Q110K8603J6226j4449k5309j5917Q542N115j4270r351
10922b7503q518L011o8L2050J724k2941J8980J52p433O900j915p834R445O605
10908B655J762N219R959K35J0163p259m472l731M805J3346j9758j4694L767O57
10894B654P876J310k8011k5801K6078K5003J7522N685l3083j3813J2051n289n596
10881a3414J1655k5726j4648J8728q30J3093p063r688q06N647J9255K2198M402
10868B2803J1259o15J2192O380j7608k7976j3315r698N467J7283n07j3314j4256
10855b1905P821k354J1962L120l489J4111J9242M403j9706k4075o26O457n042
$$ y = [-17748, -21602, -25944, -26024, -14941, -868, 16909, 15303, 5206, -12701, -16432, -11864, -15911, -18216, -21050, -24151, -16291, -14803, -6693, 21910, 38136, 23687, -1622, -17539, -8997, -3882, -18152, -27503, -36021, -33010, -33078, -1028, 696, -22245, -3265, -3113, -10546, -3646, -5561, -13395, -3950, 2655, 4417, 9636, 19595, 19830, 29993, 22734, 18262, 14531, 19336, 32682, 12924, -1770, 1997, 2654, 10530, 11840, -16171, -41972, -15894, 9109, 26631, 32316, -767, -14580, -2529, -7818, -13414, -1759, -27485, -42133, -23405, -24235, -11142, -18205, -27893, -28699, -23052, -3797, 18401, 22803, 34062, 33447, 45639, 52019, 34411, 6435, -6880, -16578, -11111, 6172, 5665, -7649, -21905, -14084, -16438, -4476, -1356, -4845, 9266, 28508, 32911, 13205, -10870, -11496, -5039, -10081]
10842a0081L874n048o50P937k882o885o976J1825k740j6899N315J4842k4054r377
10828d1799J8280K1274O141n147j2117J618K8530O67L298n39k9578R342K086j7146
10814a5090N721J5065R097k039Q662M0l779q5j1403k7329j0689K2787K9387j746
10800A8599R545r396q968N949K893j3078j7974j4896j6772p027K2493J5871J1323
10787a438r255J487P632K122L384k6k8223k4131K7223J9433P983j6608j5151J6332
10773i236p934p541J2540J1837L893l069l570j5886L824K5025K2924k0266k0507
10760g966n567K9303k386k3643k7306k1752J6120Q806J0816P874J2045J2942k072
10747G214J491M667k5095k1268K0662N435K870p034L234M374J4265L26K5089Q921
$$ y = [-10081, -6207, -11255, -11905, -3968, -6850, -13735, -20711, -8886, -11626, -28525, -23210, -8368, -32422, -41799, -23519, -2245, 3896, -1251, -13368, -11750, 16780, 17447, 20745, 20206, -9372, -30, 2056, -15090, -9369, 5696, 14793, 12754, 21416, 21456, 17677, 17592, 6189, -21140, -31829, -9042, 20345, 18599, 28144, 18748, 9780, 15729, 18622, 5544, -12430, -27326, -44098, -51125, -28632, -12761, -1438, -10693, -9206, -1574, 548, 3932, 3906, -24317, -48448, -21225, -1792, 6191, -10417, -25568, -9236, -17170, -24711, -12171, -334, 3559, 490, -3080, -18966, -15142, 9883, 32807, 12541, -7966, -13533, 15770, 13384, -10259, -37565, -59317, -43197, -34391, -23575, -15701, -3656, 9286, 7214, 8705, 13372, -11723, -32991, -12329, -6894, -4024, -11058, -7824, -3450, 10815, 11141, 36230, 45151]
10733D5151j514k3772J1964J9659J1437o718k4461R884J6502j3379r681n575M901
10720C4398k038k5005k1269k598r964o034m931K45L3911R928K804N368j1439L857
10706G233P905k1864j3865k7524J732J4426K4371m131j7706j191J0810m460m412
10693b8676Q003r988p482K5490K965R801p180j5275q814M01K047K3090K3919l0254
10679a1953q431O86J2213R055N305n830n643J5548k0870n514L2108j2563o938
10666b827L1L563o380j8098J5010P834l670N422k581n333P936J1968k3767j1911
10652b2803l001J9650n699J388r474j8549K2803K5137M20L968o345q492k0945
10639b1942j5325J1504J2718j2032J3072K3626J0394r50L052l837o119k485j4617
$$ y = [45151, 43637, 19865, 31829, 51488, 62925, 56207, 31746, 41630, 58132, 44753, 35072, 29497, 34398, 32360, 7355, -13914, -16512, -26476, -32510, -37441, -37196, -3285, 6643, 9447, 14815, 3376, 7233, 15138, -6726, -20591, -48115, -46383, -31957, -7586, -11717, -29423, -30614, -19804, -24264, -28676, -20673, -30661, -38143, -12653, -9688, 113, -7067, -22342, -31156, -30755, -28708, -5618, 18301, -11953, -20384, -19698, -7485, 1570, 6875, 1045, -4598, 10950, -9920, -15434, 16674, 4111, -2827, -2796, 767, -5613, -23711, -8701, -867, -4537, 885, -1696, -7029, 907, 12875, -10892, -22803, -25804, -6154, -11853, -10465, -19939, -38488, -15685, 9452, 9872, 13840, 7495, -997, -21942, -37267, -25763, -13045, -25077, -12005, 11621, 22015, 21065, 24117, 20280, 14161, 11676, -2941]
10626b941j8466m697J8329J0675k5985j7791k2357K4485P881n62j042N245j566
10613b8792R387O658m556J3794R996J944n606R616Q030J407l671K172o005k3519
10599i145j8519o29L466J8950J0951J165Q606j425L060o507n06R183l263m378
10585A1009p99J0146K310J0361J497k9900k8262o283j667R20K5529K8626O33j5789
10571H331l0462j3432k497K1812j4897K2244J9668P071l814n356K7972J0446J421
10558D8507l2399j7724O114Q054j3696k1121J9380J9698l187K212j0099K072j1517
10545c706n741J4870j4532j3031N287j1992j5594m061R380j0341L3L1561L6899
10532A9032m13k1851J462P794J2563m192j5421L237j005Q003r73O797j149Q699
$$ y = [-2941, -21407, -26104, -7775, 2900, -23085, -40876, -63233, -38748, -30867, -31429, -32471, -27226, -28792, -19405, -12747, -17303, -3509, 6487, 8431, 2825, 12441, 20471, 21878, 18207, 20379, 14374, -9145, -27664, -28293, -24827, -5877, 5074, 6239, 14845, 13420, 16480, 9973, 9467, 18650, 15387, 11009, 10210, 20356, 22666, 33027, 34524, 4624, -23638, -29921, -31588, -30668, -5139, 23487, 24120, 8331, -22131, -35563, -38060, -16248, -31145, -8901, 10767, 17838, 14024, 8668, 36640, 47086, 48507, 16108, -1616, 4498, 12552, -1144, -22265, -2885, 16813, 13626, 15838, 5739, 7811, -3706, -9447, 5423, -9109, -22140, -16853, -28845, -44439, -48500, -39120, -49461, -49428, -17867, 19032, 18619, -3232, -1770, 6024, 18587, 14395, -1026, 2211, 1206, 9209, 8236, 15033, 13884, 22583]
10518B2583j0263k3181j2838j0189O420K0616J7878K687m765j0860j022q945N106
10505f773K0902l0322r398R370P875k6J5305K516K199j1124k5976L268j4004l392
10491c9580J2118J0985O190K548r812j8784J276K6364N580J995j0823P507k241
10478f677l143o429K8422L60k6842l492k744p142Q927K0070n743k5027n062R967
10464b4555K346J4457J2832J9518N910J4360P609Q016K2996j425J141P663k7141
10451F3727j2260J3152j7294L484q761r00p174j5181k4585l209J3342J0303J0938
10438B5582L812k7308j0131K744R562j252J5479p7q697L091J144j1643q614J324
10424d984K438r25k432Q981n015o145j3522l087J1812P058q745k472l872Q310
$$ y = [22583, 12320, -10861, -23699, -33888, -27468, -6852, 11026, 13713, 8948, -1912, -2934, -11879, -6773, 14129, -16193, -25591, -16221, -8346, -8372, 6933, 9449, 11648, 524, -25452, -22184, -36188, -39580, -27462, -16477, -10287, -7739, -17551, -36335, -35059, -8695, -3115, -1120, -11943, -4436, -6677, -9820, -16249, 12173, 12533, -14309, -17801, -20545, -27687, -18760, 1310, -4433, -29460, -34522, -24555, -22209, -7752, 5080, 24598, 30508, 44868, 52477, 60493, 83489, 82064, 83205, 90868, 63727, 51467, 64619, 47325, 50809, 42048, 41148, 33974, 18793, -5792, -9001, 4341, 14644, 25582, 29394, 2086, -8045, -5301, 4261, 3009, 18488, 18411, 9714, 12805, 13949, 2306, -6308, -4984, -2546, -3471, -5903, 3078, -1937, -8082, -21604, -24691, -12879, -5821, -14566, -17038, -20910, -12600]
10410a2600j0866J8901J9353j2644r002O614l671L373Q608J560l811J3698q023
10397A1490q434q201J633R685Q987J6964n865k3631j1792J1535P953j2540L736
10384A520O571q680L878N527k624k4067p768J0709K1795K1331j2350R688J0364
10371C5894q748n805p464r778M863m621J6158J1601J7339m644q593j299p006M930
10357C2827J8112J8381J8845K6683K2741M1596M6596O0721R0499J59200K15416
10346G51617K70164K56397K49671K52417K03468J41174N3540m8474j12589k07235
10336A810150k71792k93793k67382k33148j98912j65270j24672o9245m3794j3179
10326A28963k8938j6973J1168p758o904j2644j3470j4090o160P59j0333R622m97
$$ y = [-12600, -23466, -4565, 14788, 2144, -6858, -244, -3915, -542, 8066, 9626, 5815, 19513, 11490, 3056, -5145, -3512, 6173, 15160, 32124, 26259, 2628, -9164, 2371, 10324, -2216, 1520, 8091, -589, 3289, 8816, 6192, -17875, -25643, -14934, 6861, 28192, 15842, 25530, 35894, 27146, 21341, 13877, 4099, 8962, 4341, 20499, 32100, 49439, 44795, 36202, 34903, 27897, 32827, 50939, 69320, 88165, 114848, 137589, 179185, 225781, 286502, 377001, 536201, 751617, 1021781, 1278178, 1527849, 1780266, 1983734, 2124908, 2178448, 2129974, 2017385, 1810150, 1538358, 1244565, 977183, 744035, 545123, 379853, 255181, 185936, 142142, 128963, 100025, 83052, 94220, 86462, 79558, 66914, 53444, 39354, 33194, 33953, 23620, 33242, 32745]
10313C2745K536j605m865O084J546o477O362O530k431m138K034j55p592j853j3532
10298A5189j5849j5273n943J4967J746m23M979R893O505l751p711j204J5027K018
10284B0170j1612O705q534l269j1511m688P5k792J3620J4393m620j4004j4113
10271b0180k7295K0742J4178k010n598J4160M13K085J0997J8263q492j9422J69
10258a990j5158k797J7851m529j4109r217J4823Q827K4596Q021l46k4303j473
10245A96r02k0945j0312j096O904J3299J4254p365M509J1700k0362r374K0064
10232E70N536K163K120L458Q980j6032o065J9034J4752n307k5974p543n105J5089
10218E676k023j9464J869Q155m777K0847K7293l927Q719l20k611J500J797j1544
$$ y = [32745, 35281, 33676, 28811, 34895, 36441, 29964, 36326, 42856, 40425, 36287, 38321, 38166, 30574, 28721, 15189, -660, -15933, -21876, -6909, -5163, -5586, -607, 9286, 15791, 12040, 4329, 3125, 18152, 20170, 8558, 15263, 6729, 3460, -8051, -12739, -12664, -15456, -1836, 12557, 7937, -6067, -20180, -47475, -26733, -12555, -14565, -20163, -6003, -5590, -3505, 7492, 25755, 17263, -2159, -1990, -17148, -19945, -2094, -6623, -20732, -29949, -15126, -6299, 18297, 26318, 25972, 1669, 196, -706, -21651, -31963, -33059, -26155, -12856, 1398, -5967, -1458, 10242, -10120, -19494, 570, 6106, 8269, 10389, 13847, 22827, 6795, 730, 19764, 34516, 29209, 3235, -4308, -9413, 5676, 3653, -15811, -13942, -5787, -10564, 10283, 37576, 33649, 42368, 42048, 39437, 40937, 42734, 31190]
10204C1190k0093l709J4279J5448j959k2050o110L634k041l7924k714J7198J5204
10191C53L5667K1378j913o034n923j388j4000j1166K0051m833k6275k6252J6473
10178c862K2673J6027R54K424o041J2283K117j0301L369m370J471j0300k2379
10165D065j551J3027J3285k3627r488J823K3120J0204R48r849j4884k800j2493
10152h220j955n957j0302K0308J4666P413J7327L919j1933q607j1215K1966J8137
10139D5547o319l292p581k317K2487j3332k2911K639j5278l204J2628O436R36
10126A6439O52j1800j7949p401K22j669J7576J2145N713l254q882J6285q424n673
10112C980J0652N919O099N308R415L65o474k380J3241J8298m809k4621J649J9201
$$ y = [31190, 11097, 7388, 21667, 37115, 35156, 13106, 6996, 10630, 8589, -29335, -32049, -14851, 353, 36020, 57398, 55485, 49451, 43528, 42140, 28140, 16974, 37025, 32192, 5917, -20335, -3862, 18811, 34838, 35792, 38216, 32175, 44458, 46575, 36274, 39643, 35273, 36744, 26444, 4065, 2514, 15541, 28826, 5199, -4289, -2466, 20654, 30858, 31806, 21957, 7073, 4273, -8220, -10175, -16132, -26434, -6126, 8540, 15953, 33280, 37199, 25266, 16659, 5444, 27410, 45547, 39228, 35936, 28355, 26038, 48525, 35193, 12282, 14921, -357, -3561, 9067, 15503, 16439, 17091, 5291, -12658, -20059, -19837, -21506, -3930, 8215, 13928, 10674, 1792, 18077, 9653, 3980, 14632, 20551, 26650, 31958, 41373, 41738, 35264, 32884, 46125, 64423, 59614, 34993, 36642, 55843]
10098E5843P007l736k5697n963J4959r549j704J5520j687J1424J287j248L3137
10085H9593J0914K79K2468R62R099J8511k541j192K3049Q767J2541K7735M3366
10072B63551M5254Q3384Q7215K2971n122L3110M3830Q1294J03604J29975J67649
10061A056715K31156L84162O13209Q86831J451778K663667N091772Q473015Q702859
10052B9555164J806531o949846r395001o454151l493439j804725r36113n43711
10044A784709l67948k71550k18349j84366j40124j06740p0721l3778k34M963Q337
10033D04199m873n8478o9902o0809l2875j7081k2086j8185j7308N382Q766J2622
10021A29372J229m535j5653j1156j1575O026N319j6534k041K750J135r283j3900
$$ y = [55843, 62850, 59114, 33417, 27454, 42413, 32864, 31160, 46680, 44993, 56417, 57704, 56456, 89593, 100507, 100786, 123254, 124216, 133315, 151826, 149285, 148093, 171142, 179909, 192450, 220185, 263551, 308805, 392189, 479404, 502375, 497253, 530363, 574193, 655487, 759091, 889066, 1056715, 1287871, 1672033, 2285242, 3172073, 4623851, 7287518, 12379290, 20852305, 29555164, 31361695, 24411849, 15016848, 8562697, 5069258, 3264533, 2328420, 1784709, 1416761, 1145211, 926862, 742496, 602372, 495632, 424911, 391133, 390899, 395862, 404199, 399326, 340848, 270946, 210137, 177262, 160181, 138095, 119910, 102602, 107984, 116750, 129372, 130601, 126066, 110413, 99257, 87682, 93708, 99027, 82493, 80452, 83202, 84337, 75054, 61154]
10008F1154k2923j8682l672o828K240J4701M588q543O570O849j8036K734J0339
9995C0491k985k4285l008J351m938k451J8071o097j768j4666J9182L9697m67J4108
9981F2235q695j2191J489K433o110m398J5035P10k8558k4846j0915k400m998k408
9967b3617K1652J3609M560j5066l3637J5736J5766L705j793k3082k979n575J378
9954b9343J5409R471N696K6076j341j7969j1156j1641O772J4709K2377J0008j2857
9941B6211J0597R220p286n918n922k3963n348O931J9743J1515j7738J933K3527
9928D3502k177j9628K7571J9796l0287j5789J4478J6294r485j4172j7755L027
9916A5375l957l1643k9860P995L4248J8183k2218j0422R457J8982R58j482O377
$$ y = [61154, 38231, 19549, 15877, 9049, 11289, 25990, 30578, 22035, 28605, 35454, 17418, 20152, 30491, 27506, 3221, 213, 1564, -3374, -5825, 12246, 6149, 4381, -10285, 8897, 48594, 48127, 62235, 53540, 41349, 42838, 45271, 39161, 34763, 49798, 50508, 21950, -2896, -13811, -16211, -21209, -23617, -1965, 11644, 16204, 1138, -32499, -16763, -997, 2708, 915, -22167, -25146, -30721, -29343, -13934, -4463, 1233, 27309, 25968, 7999, -3157, -14798, -8026, 6683, 29060, 39068, 26211, 36808, 46028, 38742, 32824, 26902, 2939, -2409, 4522, 24265, 35780, 18042, 19975, 43502, 41325, 21697, 49268, 69064, 38777, 22988, 37466, 53760, 44275, 30103, 12348, 15375, 11418, -20225, -50085, -42090, -7842, 10341, -11877, -22299, -12842, 6140, 7098, 5616, 11993]
9903A1993J0635l897K45j7982J0214K1373N587J2508p442k8208j7647j6352J409
9890a7564m028P628k264Q661M582j8599j2508K3770L3391J9006M386j9139j3796
9877A3526J3728j3124q878j7213j4837J5108J6409M24Q072n734l0107o092R694
9864a9024N276j1352J9630O04l110J8935K1175m647j2384j1094j8468O147O304
9851b008j810n412j7076O51J2351J1243Q536j0169j7230J8017L503j682J212n502
9837e376L05k2461O8m948k612j0623k772l688J6621Q508m17J2027j618P675o90
9822a0001k007J209J7372K0233k257q655k3108j1931R009J2173K814M293N02j2931
9808c285k2668J3716N253j646Q455K2687J4758p993j5385j380j9018j5410Q7J0112
$$ y = [11993, 22628, 18731, 18976, 994, 11208, 32581, 38168, 50676, 43234, 15026, -2621, -18973, -17564, -21592, -13964, -16228, -7567, -2985, -21584, -34092, -10322, 23069, 42075, 46461, 27322, 13526, 27254, 14130, 5252, -11961, -26798, -11690, 4719, 5143, 13215, 7481, -22626, -28718, -19024, -13748, -25100, -5470, -4866, -7976, 10959, 32134, 27487, 15103, 4009, -14459, -8312, -2008, -3818, -9230, -26306, -25655, -13304, -2061, 6475, -3694, -20924, -2907, 596, -1086, 126, -5376, -5071, -27532, -27464, -32412, -35024, -45647, -48419, -52107, -35486, -26978, -27395, -15368, -16986, -9311, -10001, -12008, -10799, 6573, 26806, 24549, 15894, -7214, -19145, -10136, 2037, 4851, 9144, 9646, -3285, -25953, -12237, -6984, -8630, -175, 22512, 37270, 29277, 13892, 12512, -6506, -21916, -21829, -11717]
9794a1717n990J8337K890J8254J4831m28j421j0551n732J2320j272j0280j9674
9781d33j1653J454R400R355P800j2316j7707q954J6981P901L912n617j1395L1717
9767B0445j6603j9647J6999K6508K9436j0915k8340j599L799n367N479k6460j2611
9754a8876J7266K348r526M290O563L919M901m401j1454J1573J4956J757o745l824
9740A2747o87J214k527j5960o851j0077r948r448r554N274K1181J2262j237n04
9726a4115J308N245p596R673P871J1032L061j5549Q139O751l1384p275L0494n433
9712B222j1122r222K4820R145p028J0486O791j6128J678j3835m2522j664K7204
9699a9175J166j519L660J9274P643p793j0410l0282j2157p922j5409K78J7629
$$ y = [-11717, -17707, 630, 3520, 21774, 36605, 36177, 34756, 24205, 18473, 30793, 29521, 19241, -433, -12086, -10632, -1232, 8123, 15923, 3607, -14100, -23054, -6073, 1828, 5740, 123, -11272, 20445, 3842, -15805, 1194, 27702, 57138, 46223, 17883, 16284, 20083, 14716, 20195, -6265, -18876, -1610, 738, -8788, -4498, 2065, 5984, 10885, 6484, -4970, 6603, 21559, 23316, 16571, 12747, 12060, 13274, 10747, -5213, -12064, -22141, -32089, -41537, -51091, -45817, -24636, -12374, -13611, -14115, -12807, -7562, -15158, -5485, 2386, 13418, 16479, 930, 9069, 15820, -15564, -22839, 7655, 2222, -8900, -18122, 6698, 15843, 8815, 19301, 26092, 9964, 11642, -2193, -44715, -46379, -19175, -18009, -19528, -15868, 3406, 11049, 3256, -7154, -37436, -49593, -57515, -72924, -72646, -55017]
9686e5017K0857k581j0797J2649R544K495L870Q914j7612r580k63j817P818m306
9672c5826J1836J2318J506J0753j6047j8149M0200R675k0736j5931q218J662R951
9659a7006p371M889K2412K806J4689L433J3949J7587K0733J4569r33K1056n592
9646A05221j5667j3264k0529k3093j3054J2981p293j3527J620K8752l241j8075
9634B0831j1912j4741J5192M328r327o444k5196l430J849l547J0823K1909J6804
9621A7139l178M388N687l246o033J8711j6590j479J0801R309J2710Q618l0793
9608B6044m8443P834P665o358J1371Q097m393J5553K7804k6300j8085M969M622
9595A0380L952K907k3001q101R94N081r163J498J6370n374o45P975k969O048N632
$$ y = [-55017, -34160, -36741, -47538, -34889, -25345, -22850, -18980, -10066, -27678, -37258, -37521, -39338, -31520, -35826, -23990, -11672, -10166, 587, -15460, -33609, 6591, 16266, -4470, -20401, -28619, -26957, -17006, -24377, -19488, 2924, 5730, 20419, 23852, 37801, 55388, 76121, 90690, 89757, 110813, 105221, 89554, 76290, 55761, 32668, 19614, 32595, 25302, 11775, 13395, 42147, 38906, 20831, 8919, -5822, 9370, 13698, 4371, -2073, -27269, -30699, -28850, -32397, -21574, 335, 17139, 13961, 18349, 24036, 20790, 14757, 33468, 16878, 15399, 26200, 35509, 48219, 56837, 26044, -22399, -14565, -6900, -13258, -1887, 6210, 1817, 17370, 45174, 18874, 789, 5758, 10380, 14332, 17239, -5762, -13863, -12869, -7788, -16951, -15453, 917, -4457, -5102, 2873, -96, 5952, 11584]
9580A1584O521J0868j9867l6193J1546R54O721K2073P711j5509k908j108l410
9567a017j7751J378k64J987J6937M141j6000k0443J600L4334K4858j7054j7477
9554d771J3832K2303R620k547j6762j0843j0267j1679N786p51p645J777Q793J851
9540a303k11J5001J5960M952M028k2380l743r264j1811j88L842J6409N025J1565
9526B7882p596L560p798k4850M096M186Q473K665j7185K811n366j0262R45J3382
9512e057J4257N8j6860l497L246L206J3359P326n034O42K847Q804j8187p066j4351
9497a6307j3957r346L4517J4044k4240o533j1588j3825J0993N920J8783P053q81
9484e367Q420o731J931o724j3507J231K6783j663O580J4931M215N140k0087j0001
$$ y = [11584, 18105, 28973, 9106, -27087, -15541, -14587, -7866, 14207, 21918, 6409, 3501, 2393, -1017, -18768, -17390, -17654, -15667, 1270, 5411, -10589, -31032, -29432, 4902, 29760, 12706, -4771, 9061, 31364, 40984, 38437, 21675, 10832, 565, -11114, -5328, -6079, -13724, -11947, -3154, -1303, -1514, 13487, 29447, 34399, 38427, 16047, 12304, 3040, -8771, -8959, -5117, 11292, 16317, 27882, 20286, 23846, 16048, -8802, -4706, -520, 7953, 10618, -6567, -3756, -9122, -19384, -18439, -5057, 9200, 9258, -7602, -11099, -7853, -4647, 8712, 16038, 11004, 11646, 14493, 23297, 5110, -1956, -16307, -30264, -39610, -5093, 8951, -15289, -21822, -33410, -47235, -36242, -30322, -11539, -4486, -5367, 3053, -3678, -1747, -8471, -21978, -20747, 6036, 4373, 10953, 25884, 30099, 35239, 15152, 5151]
9470E151p627j3434L783N543J2939P982R590k2444j1227J5635J1712k0470k855
9457e722j2439M223K1460r5K011M674M022J308N127k8670k1303L0960O212j6895
9443e127J5577J7514J0564j1222j7143P510r787j40J8419O850J0761j0471m100
9430B9205m349L464r642K489J7230k1202k1169j3921m44K9501L355J8521k3910
9417I128p234k3074O059l328Q996K5076N478J3968J463o596j781j4020J028N859
9403B1022K0883M903j0175p938j277J5069K7229m779k4551L071m064N404J528
9390D6325J924j2117k1449k3005j5188J8124J4629K7629O121q226M72k3874L526
9377A4891n317K865j4513l096K1886J0017k8919l551O277J4442N892J9450K1424
$$ y = [5151, -2476, -15910, -12127, -6584, 6355, 14337, 23927, 1483, -9744, 5891, 17603, -2867, -5722, -18161, -13938, 7522, 7427, 9438, 14112, 18134, 19442, 24569, -4101, -25404, 5556, 11768, -5127, 10450, 27964, 38528, 27306, 10163, 17673, 7886, 7746, 26165, 33015, 43776, 33305, 29205, 24856, 28320, 18678, 21167, 38397, 17195, -3974, -17895, -18339, 11162, 14517, 33038, 9128, 1894, -21180, -15121, -18449, -9453, 15623, 21101, 35069, 36532, 29936, 28155, 14135, 15163, 21022, 41905, 46808, 36633, 28695, 27418, 42487, 69716, 64937, 40386, 43457, 39393, 44797, 46325, 48249, 36132, 14683, -8322, -23510, -5386, 9243, 36872, 42993, 34767, 35239, 11365, 14891, 9574, 12439, -2074, -5170, 16716, 26733, -2186, -5737, 540, 14982, 20874, 40324, 61748]
9364F1748K723j6838r578k573K3127L777j2000q841L537k165n224k460M471p712
9350C1992k2485r175J6804J052J142N565J8271N903p441J0712j8416j5514p630
9337A0780O846J7436J6686j0021o5Q159j0209j0317r464O263J2793J5270J1142
9324F5299O161q734j1425j1174j0366j3287J4815J2028o262Q386K2810J3207k2557
9311E8901j6207j989j3157l916P764N543j6692j5294p515J3352K7732J1623J502
9298E1647k35j0893J1826R908l882k1235r147J5250N133q938q02r288n136J7072
9284D1280P900P839L211j2118p910O173R893J0425n355J3957p777Q543J6977j1382
9270H1656k4870j2788P328j4113J2802J7076J0484Q182K118K612R102J020k096
$$ y = [61748, 64471, 47633, 38055, 35482, 58609, 62386, 50386, 41545, 45082, 42917, 37693, 35233, 39704, 31992, 9507, 332, 17136, 18188, 19330, 24895, 43166, 49069, 41628, 52340, 33924, 18410, 10780, 17626, 35062, 51748, 41727, 41662, 49821, 39612, 29295, 19831, 26094, 38887, 54157, 65299, 71460, 62726, 51301, 40127, 29761, 16474, 31289, 43317, 37055, 45441, 68251, 81458, 58901, 42694, 40705, 27548, 23632, 31396, 36939, 20247, 4953, -2562, 10790, 38522, 50145, 51647, 51412, 40519, 52345, 62253, 58371, 37136, 27989, 43239, 48372, 39434, 38632, 29344, 24208, 41280, 49180, 57019, 60230, 48112, 40202, 46375, 56268, 66693, 61338, 75295, 67518, 76061, 93038, 81656, 56786, 43998, 51326, 37213, 50015, 67091, 77575, 85757, 87875, 90487, 99589, 100609, 98513]
9257I8513j1291j4303L7230K1195J624l1794j8598J0583J6914O239o843j3203
9245I6266k240p416j2449P755M821L683L728j954K6551J2435J2135k762m625K6088
9231A62016O289q33j5585J676O962r515L999j4996j0995J8745J2490J8970K6583
9218B05806k084k3027R421O297L298L3768J3629N36K120J2414J844k882K841k015
9204B61966j2543j3443K1544N962K2873Q418j673L7519Q612k599J7480J7364J1088
9191C82568j97o920J3443K5675j1765K4967J6829K8714J1568k530M380K6840L0536
9178E44108K8326K2257K3606L2572o04J1860M8656N7420L1301L5217K9877L5802
9166I00398M2568M2633P3488O1225N2555L0876L4030N7361N3767M8970O8507O0094
$$ y = [98513, 87222, 72919, 110149, 131344, 132968, 101174, 82576, 93159, 110073, 116312, 109469, 96266, 94026, 86610, 74161, 81916, 86737, 90420, 94148, 92194, 118745, 131180, 143315, 140553, 135928, 162016, 168305, 167472, 151887, 153563, 160525, 151010, 155009, 140013, 129018, 147763, 160253, 179223, 205806, 203722, 180695, 190116, 196413, 199711, 233479, 247108, 247644, 249764, 262178, 264022, 261140, 263981, 261966, 249423, 235980, 257524, 263486, 286359, 294777, 293104, 330623, 339235, 336636, 354116, 371480, 382568, 382371, 375451, 388894, 414569, 402804, 427771, 444600, 473314, 484882, 482352, 486732, 513572, 544108, 572434, 594691, 618297, 650869, 650265, 662125, 710781, 768201, 799502, 834719, 864596, 900398, 942966, 985599, 1059087, 1120312, 1172867, 1203743, 1237773, 1295134, 1348901, 1397871, 1466378, 1526472]
9154A526472O0310N0085M8577L5393O1132O3113P2451M5504K2325N1782M8311
9143B085455L0399J5351j6391k0747J1963k091q455j798m7265o1016n9356m3122
9131A882927l6575p8230r2321m1959m3674k4303l3931p3458o0765n6135m5157
9120A296419o6899o0926m0052l1604m5596p7638m4878k2444m7042l9396m1088
9109G78856k3870k5446l8837j2125j5337l8618m8318m9047r170j4452j0490k1646
9097D71500l4606j7134P575m599L834m610k9446m0915k6192K5332M914O134j7604
9084C44183m0186k0325j0714p530k5839m308L213o560m627m170J1795n152q760
9071B21020p661J2901Q48j1138k6607k8166k248Q403N689N255J1566O24l626o761
$$ y = [1526472, 1586782, 1636867, 1685444, 1720837, 1781969, 1845082, 1917533, 1963037, 1985362, 2037144, 2085455, 2115854, 2131205, 2114814, 2094067, 2106030, 2103939, 2095484, 2093686, 2046421, 1985405, 1926049, 1882927, 1846352, 1768122, 1675801, 1633842, 1590168, 1565865, 1531934, 1458476, 1397711, 1341576, 1296419, 1229520, 1168594, 1128542, 1096938, 1051342, 973704, 928826, 906382, 859340, 819944, 778856, 754986, 729540, 690703, 678578, 663241, 624623, 576305, 527258, 518088, 503636, 493146, 471500, 436894, 419760, 427335, 422736, 426570, 421960, 392514, 351599, 325407, 350739, 355653, 361787, 344183, 303997, 283672, 272958, 265428, 239589, 235281, 238494, 231934, 227307, 223137, 234932, 229780, 221020, 213359, 226260, 227108, 215970, 189363, 161197, 158949, 167352, 173041, 178296, 189862, 190486, 186860, 180099]
9057A80099r129k744j4055j1223L32n50j5296M677Q736k3382r108Q804J0419j4191
9043A13389j995J5496l918J4975n638L90j2205J872N706j3824L345N623J4618
9030A37834J112o139p303j4807l0065j9226N728K0340K1121j6878l5453r435K7972
9017G4801P798Q075P484N390K335j4488q427L318j2064K267J3350j4698q891P897
9003G4147L0833j2269k1285K435K856j7426p391j1776Q874K4352K833k426l4764
8990C8993p996l234J7609K8478Q968p041l931p202k408J2553J236j1565j5066
8977D9394m845P136q042j0151k3751r831L0536K8020m306J4954R887M693q350
8964G5344k4446k1362j2166K9578j569l158j1805j4542N349R137j1454j0824J1976
$$ y = [180099, 170970, 168226, 154171, 142948, 143280, 142730, 127434, 132111, 140847, 117465, 108357, 117161, 127580, 113389, 111394, 126890, 122972, 137947, 132309, 132699, 120494, 122366, 128072, 114248, 117593, 123216, 137834, 138946, 132807, 125504, 110697, 80632, 61406, 67134, 87474, 108595, 91717, 56264, 46829, 74801, 82599, 90674, 98158, 103548, 105883, 91395, 82968, 86286, 74222, 76489, 89839, 75141, 66250, 74147, 104980, 92711, 71426, 73861, 76717, 59291, 51900, 40124, 48998, 73350, 76183, 73757, 38993, 30997, 27763, 45372, 73850, 82818, 75777, 71846, 64644, 62236, 74789, 76025, 64460, 49394, 44549, 51685, 43643, 33492, 9741, -90, 30446, 58466, 54160, 69114, 79001, 83694, 75344, 50898, 29536, 17370, 46948, 45379, 42221, 30416, 15874, 21223, 30360, 18906, 8082, 20058]
8951B0058j0637M775J9037K0799k2010j858J4194m479k358k40j9160L836J1732
8938C3689j3568k6995J7916j713L076r91J3540j7917J2098R97k978j5809J1499
8925A2844Q224q102j689j1993K1453j2068j27P200K8889J5990O389r867k7354
8912B9789k7919K4877K8463j773p374k3833L441j4013j4109l280l76K5656N558
8899B5107J747k748j248r86J0561j1269Q65o143l775J0096l357j778q29L050K127
8884B1420j6377L007q488K98K985L789K4737l449n032K371k480j4372m400K3459
8870B7468L5688K0607L6317K631j9889l7142k3217o499q765L976J4998l357j1884
8857C0932n107j1915J4620m444k1354p253M350N001K6569R1q426N96J0658k1293
$$ y = [20058, 9421, 14196, 33233, 54032, 32022, 30164, 44358, 39879, 37521, 37281, 18121, 21957, 33689, 20121, -6874, 11042, 9329, 12405, 11414, 24954, 7037, 19135, 20132, 17154, 1345, 12844, 21068, 12966, 11277, -716, 20737, 8669, 8542, 15742, 44631, 60621, 67010, 57143, 29789, 1870, 26747, 55210, 53437, 46063, 22230, 25671, 11658, -2451, -5731, -6107, 19549, 25107, 26854, 24106, 22858, 21872, 32433, 21164, 22029, 15886, 12111, 22207, 18850, 17072, 16243, 19293, 21420, 5043, 8050, -438, -140, 2845, 6634, 31371, 27922, 22890, 25261, 22781, 8409, 4009, 27468, 63156, 83763, 120080, 122711, 102822, 65680, 42463, 35964, 27199, 31175, 46173, 42816, 30932, 25825, 13910, 28530, 24086, 2732, -4521, -171, 4830, 31399, 31490, 23064, 23660, 34318, 13025]
8843A3025j3839p162k793k58K450J701O153K4210K4865N598k4427l563j3817k6968
8829a4825J7192J0239j6018O890K568O016J2620J1644l736j9303q430n361P729
8816G225K279k715j1172k656o397J1286J4004j2463Q539K0371J5754r474j6903
8803A7678j725Q331j0360l4633l040N527n972n197J7783j6859l573j0635K2231
8790b0444J4735N954J5647K4774J8696m458j0950j5638n980L217k200p454k359
8777A3540J720Q883J7843m531p059q160o437k628l132r373k4158k808J2480p007
8763b0827o6K1244N34n134j3432j4945P767J8723K0185J3494q288k5796j6430
8750b2971J9772J6889R76m520k899J9038K2702p146o390l213m042J4981j4625
$$ y = [13025, -814, -7976, -10769, -11027, -8577, -6876, -723, 23487, 48352, 53950, 29523, 25960, 12143, -14825, 2367, 12606, -3412, 3478, 6046, 12062, 24682, 36326, 32590, 13287, 4857, -504, 7225, 9504, 6789, -4383, -7039, -13436, -2150, 11854, -609, 7930, 28301, 44055, 34581, 17678, 15953, 24284, 13924, -20709, -23749, -18222, -24194, -29391, -11608, -28467, -32040, -42675, -20444, -5709, 245, 15892, 40666, 59362, 54904, 43954, 28316, 22336, 25553, 23353, 15899, 13540, 15260, 24143, 41986, 37455, 30396, 22236, 15799, 13171, 10039, 666, -23492, -26300, -13820, -20827, -20893, 351, 885, -4249, -17681, -32626, -24859, -6136, 14049, 27543, 19255, -6541, -22971, -3199, 13690, 14666, 10146, 7247, 26285, 48987, 41841, 35451, 32238, 28196, 43177, 28552]
8737B8552k4327j5684J3768J3070n180k438J520R496J6722l1201n307L632J6806
8724A9429J7263j3352J6016P090M868k1315L668K216j9024p088J8153p428k5257
8711d761k5785J3192q3R742Q000j8160R792J8228J4447J2193l872k228K170o803
8697B6072o902M404J8055J4183r83k2009n654J9899L482j3997j2854o8J6976M056
8683D4660N441J141M066o38k1673m1594j5670J1162J4354J485J0007K9791o498
8670C6034j1653o893r584L1648L1131O999q666K783J0217k1470p850r17P27L84
8656E2890J7343K2137j2459j7969k0721j2716o144k611J0979J7497J4861p04j2614
8643D9769l2047j2690K0313J5759J6488N373K1K8936J3817K0062j724j8123n884
$$ y = [28552, 4225, -11459, 2309, 15379, 10199, 7761, 9281, 18777, 35499, 4298, -1009, 2623, 19429, 36692, 23340, 39356, 46446, 51314, 29999, 33667, 35883, 16859, 9771, 27924, 20496, -4761, -30546, -17354, -17437, -7695, 305, -17855, -8063, 10165, 24612, 36805, 32933, 30705, 32875, 26072, 19170, 23574, 41629, 55812, 54829, 32820, 27166, 47065, 50547, 36550, 23696, 23628, 40604, 44660, 50101, 51242, 55308, 54670, 32997, -8597, -24267, -13105, 1249, 2734, 12741, 42532, 36034, 24381, 17488, 7904, 39552, 70683, 77682, 69016, 71799, 82016, 60546, 52696, 51779, 52506, 52890, 70233, 92370, 79911, 61942, 41221, 28505, 22361, 19750, 30729, 48226, 63087, 62383, 49769, 17722, 5032, 25345, 41104, 57592, 62965, 62986, 91922, 105739, 125801, 124077, 105954, 100070]
8630A00070M300J2709l643j9785j028l592M228K8646Q601o616J7946J0787P134
8617A59757j4883j5079M493l91K643J0896L358K620R398J0329j9978k7993o775
8604A18395O191o39P977J3147J4981j8648j5844J1206L179o234j5772k4233j8327
8591G5379j7238p297L415j2421j1610K079Q493P618l0224j8454q446j9442J8764
8578i384K7453n460l3369M790Q929N968R214K173J4809J8184J3257j0386j3909
8565C2269j6329J219N786l2376j4379q652P620L185P417J8699Q978J0346j7475
8552F308k4549k716O199J6546n268K1497R563J841j4589r483J0037K216j05k0044
8538b547n308N161N910J7913K1948j3719M523q084k296k7516j1277K1796K741
$$ y = [100070, 104370, 117079, 113436, 93651, 92623, 89031, 93259, 121905, 130506, 123890, 141836, 152623, 159757, 144874, 129795, 134288, 133897, 136540, 147436, 150794, 153414, 162812, 173141, 153163, 125170, 118395, 124586, 123947, 131924, 145071, 160052, 141404, 125560, 136766, 139945, 133711, 117939, 93706, 75379, 58141, 50844, 54259, 41838, 30228, 32307, 40800, 48418, 18194, -260, -8706, -28148, -9384, 18069, 12609, -20760, -15970, -7041, -1073, 8141, 10314, 25123, 43307, 56564, 46178, 32269, 15940, 17159, 22945, -9431, -23810, -32462, -24842, -21657, -14240, 4459, 13437, 23783, 6308, -18241, -20957, -14758, 1788, -3480, 18017, 27580, 29421, 14832, 5349, 15386, 17602, 17497, -2547, -7855, -2694, 3216, 21129, 43077, 29358, 33881, 25797, 23501, -4015, -15292, 6504, 9245]
8525I245k9821r852M277K5304K2466J8002l714k5616k2309L361j1399q559K0781
8512g834J3376J8878P429j6354j2475k1350k3810n050M697K6132L1564J1466R102
8499C5771J3422q238j7830j9155j4075j5479J8269Q429o990j3569j309m07M741
8486a6420q62J9264M662j3891j1434k536p946o588j1303J5156P664K1060Q176
8473E002j17q015K964q409J954o531j8123J3675L6822K0243o75r614k0879j2761
8459d464J274M173j4236m028J6631n937n492K7185R983k1866k5618L359P431J6260
8445D655J040q843j0811l2936J0903L8288J4618j2638j1360m243K4338k3687j5565
8432b6241k0134k990q321J4058K0598J7042K807M71n226L3552J5597k0618k4539
$$ y = [9245, -20576, -30428, -26151, -847, 21619, 39621, 35907, 10291, -12018, -8657, -20056, -28615, -7834, 5542, 24420, 31849, 15495, 3020, -18330, -42140, -47190, -42493, -16361, 15203, 26669, 35771, 49193, 40955, 23125, 3970, -10105, -25584, -7315, 1114, -5876, -19445, -20754, -21161, -16420, -17282, 1982, 6644, -7247, -18681, -21217, -29163, -35751, -47054, -31898, -24234, -3174, 5002, 4885, -3130, -166, -8575, -6621, -13152, -31275, -17600, 19222, 39465, 38790, 29176, 8297, -4464, -3190, 983, -13253, -17281, -650, -6587, -12079, 15106, 25089, 3223, -22395, -19036, -11605, 4655, 5695, -3148, -13959, -46895, -35992, 2296, 16914, 4276, -7084, -11327, 13011, -10676, -26241, -46375, -49365, -57686, -43628, -23030, -5988, -3181, -2710, -7936, 25616, 41213, 20595, -3944]
8419c944j0423K0745J1683K510L31j571o825L905M829q639k724p740l354J4087
8405A2870M447r212n225p044l438j3171P431J6822j4902J2034k0590j0601J398
8392b9181L791K3129j1608O590J4232J6389r968K61J3174k2209J535R623J2260
8379B8018N452N223k0507l101Q781N250k742k0008Q607J1940P301k1311k2942
8366a0039L522L0410n763M267j0410j0705K6374J8697k1333R43M928k4579J2177
8353A8489J5803j1389k1609m662n451m397k899j6473J3217K5448R210J3281K2547
8340E1115k3153j5167p05m500j203j8717J6785J3029p427j0072O533p03k981n216
8326b382j2599j5144R636J6990Q857J076j111j6635K57l515O183N132J0121M136
$$ y = [-3944, -14367, 6378, 18061, 20571, 20902, 19331, 12506, 16411, 21240, 12601, 9877, 2137, -1217, 12870, 17317, 8105, 2880, -4164, -7602, -20773, -13342, 3480, -11422, 612, -19978, -30579, -29181, -25390, -2261, -13869, -7279, 6953, 23342, 13374, 13635, 26809, 4600, 6135, 15758, 28018, 33470, 38693, 18186, 15085, 23866, 29116, 26374, 6366, 14973, 26913, 34214, 12903, -10039, -6517, 23893, 18130, 22397, 11987, 1282, 27656, 46353, 25020, 25963, 30891, 6312, 18489, 34292, 22903, 1294, -3368, -8819, -13216, -16115, -32588, -19371, 6077, 15287, 28568, 51115, 27962, 12795, 12090, 7590, 6387, -12330, 4455, 17484, 10057, -15, 6518, 5815, 2834, -2382, -14981, -30125, -20489, -3499, 5358, 6434, 5323, -11312, -11055, -14570, -8387, -3255, 6866, 11002]
8312A1002R89j8582j8564j0868J4773M1788K3376m169j8961m0628k2408q787J0442
8299d0597K6794L4687N517l685k321P951j221k7220p216q343l571J2970o344K8419
8285A5820M066p547m245j934J4792M417l760K974N263j5087j9930q750j993J0162
8271e752J103P875o674J4593L993j9123j5988J8546r028o304L636J1129K767n220
8257d447n664J0045J5536k776J2592J0600l772j9225k4690P376J9334k4607P373
8244b325J2022K1391k4275k4324j8031Q21J5100L68N448N517J1253N760l289j3586
8230h150l411R429J1797P13o376p366R438k309K6398q399q439J3670k56p343k2708
8215c312L296r857j6289j3385J0632K886Q188R936P921j9267k6132J78P508J2439
$$ y = [11002, 11991, -6591, -25155, -36023, -21250, 20538, 43914, 39745, 20784, -19844, -42252, -51039, -40597, -13803, 20884, 26401, 22716, 20395, 28346, 27125, -95, -7311, -15654, -19225, -6255, -12599, 15820, 19886, 12339, 8094, 6160, 20952, 25369, 21609, 24583, 29846, 14759, -5171, -13921, -15914, -5752, -4649, 3226, -3448, 11145, 15138, -3985, -19973, -1427, -10455, -16759, -13123, -1994, 773, -4447, -10111, -66, 15470, 12694, 25286, 35886, 32114, 12889, -11801, -4425, 14909, -9698, -2325, 9697, 31088, 6813, -17511, -35542, -34721, -19621, -19253, -13805, -8288, 2965, 8725, 5436, -8150, -11561, -2132, 9665, 10378, 4002, -3364, 6074, 3765, 30163, 21764, 13325, 26995, 26739, 19396, -3312, -16, -9873, -26162, -39547, -28915, -26029, -17841, -7905, 16, -19251, -45383, -45205, -37697, -25258]
8201b5258J4005j3746l848J4728J9119J0977j3571k5565N602P696N006J1269P039
8188A3453j6493j792l303k571J2433J5409j0981L769k211k5138l208K316j0303
8175b8620K231K0085J681r037n730n06j826Q589P156Q618O870R19K193O639J9890
8160C9152J9843J5010j9180j7212k8949j2139K2537m64k3589j0389Q05k5104M39
8147c9240R464J9530M0830J1603j0549J1185k0109k5137j8290O391M311J7703
8135G692J1231j0113j3217M793Q045M214r082r971J6000L3681j8797r22J1118
8122C4672j0787K224J3779J2816j1650l6406l1356N796J3205k353P971n956J0253
8109B208M330N695J595j3828N181j1856n14J6803o023n630r55k1227j3825K4594
$$ y = [-25258, -11253, -24999, -28847, -14119, 5000, 15977, 2406, -23159, -17557, -9861, -4855, 6414, 13453, -3040, -4832, -8135, -10706, 1727, 17136, 6155, 9924, 7713, -17425, -20633, -18317, -28620, -26389, -6304, -4623, -13660, -19390, -19896, -21722, -13133, -5977, 2641, 9511, 10430, 12623, 19262, 39152, 58995, 74005, 54825, 37613, 8664, -3475, 19062, 18598, -4991, -15380, -14575, -39679, -39240, -29776, -10246, 30584, 42187, 31638, 42823, 22714, -2423, -20713, -14322, -10011, 7692, 18923, 8810, -4407, 386, 8431, 12645, 3563, -6408, 9592, 43273, 24476, 23554, 34672, 23885, 26109, 39888, 52704, 41054, 4648, -26708, -20912, -7707, -10060, -2089, -8045, 2208, 6538, 12233, 13828, 0, 5181, -6675, -7189, 9614, 3591, -2039, -2994, -24221, -38046, -13452]
8095a3452L0819J4167j0174k764L16l4025k826O996n061N333J1677k0211j0091
8082b9296J4286J4424J9025K3144L0756l0970m0478M298n82K244j4016j3614J2586
8069h193L405L370J5864j4354J5846K2151R081J0734J3791M537o543j9451k3297
8056B6941n41p021J8195K863K931J9478K802Q368j532J4298j7271l9877j2756
8043A6878L5327L3909J1764j6385k273m662k017j6993k0207k143j1145J395O500
8030B9948L1279P484o252n947N019p532j7472P266J1595N705K0617n442j3482
8017F2786q823j540K6698K9027P982j924J7043N2646M4794J8203l051m6430n1553
8004A45858l9107j663N186J5j3736J1259J0610L0014M8420m359m5105l9276l9097
$$ y = [-13452, 17367, 31534, 21360, 18596, 18912, -15113, -17939, -10943, -16004, -10671, 1006, -19205, -29296, -15010, -586, 18439, 41583, 72339, 41369, 891, 5189, 4607, 6851, -7165, -20779, -8193, -4788, -1418, 14446, 92, 15938, 38089, 47170, 57904, 71695, 76232, 69689, 50238, 26941, 26400, 19379, 37574, 40437, 43368, 62846, 65648, 74016, 72484, 86782, 69511, 29634, 16878, 52205, 86114, 97878, 81493, 79220, 74558, 72541, 55548, 35341, 33198, 22053, 23448, 29948, 61227, 68711, 62459, 56512, 61531, 53999, 36527, 43793, 55388, 61093, 81710, 76268, 62786, 53963, 52423, 79121, 108148, 116130, 114206, 131249, 183895, 228689, 246892, 243841, 197411, 145858, 106751, 105088, 110274, 110289, 96553, 107812, 118422, 148436, 196856, 192497, 147392, 108116, 69019]
7991F9019k6244j7129P368K713P452J0065j041j4712r749J1813J6722R981Q130
7978G4388R352r058j0854K152J2505M218k8520n222J3513n66K1758L0051K1453
7965A35170L1952J0183m63k0649j4399p052j2451k195q113Q925L6215J9121k3395
7952A52849m8771j7648j4508J6491J960l312l359K275j3390j9060k0221K241O553
7939D2100J0495j8625j9741n315O188K0529j1210J3139J1134L722j2522j890J4844
7926E2848K0694K3547J0000l813J5559k0168k6096j4661l382j72j8678n146k93
7913C0239k29n145k485j8520m468J1956L949P605q885N02j9662k0281J6489j2027
7899b0962R910P795k22p036n993N162m107q87L546K1500k601j2903l672J2244
$$ y = [69019, 42775, 25646, 33014, 35727, 43179, 53244, 52203, 37491, 27742, 39555, 56277, 66258, 74388, 83740, 74682, 63828, 65980, 78485, 82703, 54183, 48961, 62474, 61908, 83666, 113717, 135170, 167122, 177305, 176842, 156193, 141794, 134742, 122291, 120096, 111983, 120908, 157123, 176244, 152849, 104078, 86430, 71922, 88413, 90373, 87061, 83702, 85977, 72587, 53527, 33306, 35547, 42100, 52595, 33970, 14229, 8914, 15102, 35631, 24421, 37560, 48694, 52416, 39894, 38004, 52848, 73542, 97089, 107089, 103276, 118835, 98667, 72571, 57910, 54528, 54356, 35678, 30532, 30239, 30010, 24865, 22380, 3860, -608, 11348, 15297, 22902, 14017, 14519, -5143, -25424, -8935, -20962, -11052, -3257, -3479, -10515, -16508, -11346, -15453, -16340, -12794, 8706, 6105, -6798, -10470, 1774]
7885A774k1045q510J892P203k84j3034J7760N774k1746L978Q592K222o806J2739
7871i491L6934r121k7060M657m974J0958M827J055m50R649r900l756J6859j007
7857A9180J500l992j5663p944L355Q986j4134k5452J1791J577L531j1958R383
7844a9840J3258j706N565j9377r320M558j2031j2001J8519J8428k3615j6308K5279
7831b8591K1331J4516P344j3393j6671N139k1751M94J148O443j977p99l625Q913
7817b1479j352R792k536J470R024o077m551J2360L938J793K848M772J1832N143
7803B6977k009j9237k7360J535j2210j4013J7705J0252Q751K3132P342k2510n829
7790g474k2831P666K7543K4570R492j2629j8330n667p424O848J6010k1577j3463
$$ y = [1774, -19271, -27781, -25889, -18686, -18970, -32004, -14244, -8470, -30216, -26238, -17646, -15424, -22230, -9491, 27443, 18322, -8738, -4081, -9055, 1903, 6730, 7785, 7335, 16984, 7084, 3328, 20187, 19180, 20680, 16688, 1025, -6919, -3564, 5422, -8712, -34164, -22373, -20796, -17265, -29223, -19840, -6582, -8288, -2723, -22100, -31420, -26862, -38893, -50894, -32375, -13947, -37562, -53870, -28591, -7260, 7256, 14600, 1207, -15464, -10325, -32076, -31582, -30434, -23991, -25968, -26767, -30392, -21479, -22831, -13039, -15575, -14105, -5081, -11158, -15709, -3349, 589, 2382, 5230, 10002, 21834, 26977, 24968, 5731, -21629, -20094, -32304, -46317, -28612, -18360, -9609, 13523, 20865, -1645, -7474, -30305, -22639, 4904, 29474, 38966, 26337, 8007, 2340, -5084, 1764, 17774, -3803, -17266]
7777a7266K119J5898J1454J287m767k2524k3104J898K2878J1573J883r269j9256
7764b7196J0906l0J541m118j201J199K674J0373K204j0185o110J1955P623r00
7750a265j7563k507q859J075o596l21J4345J3728J4975k581n638j4021O84j4593
7736b9137k162Q84K281J5037n671j2569j3803j6807k774O127J1609K0322K4890
7723a773J7571M52k7072j365J0778l583l712K527P303M785N173M315J0460p901
7709A7958j3419J086L437O747K728k0515l5185l413K4358m338L354k0543R100
7696b8645J6539O078J361o088j974J1357o319j1068R416J1741j1608n141R370
7683d981l369j9189j3422q186K0625J3071r846J8923K2429J2009L989j1029l5443
$$ y = [-17266, -15147, 751, 12205, 13492, 8725, -13799, -36903, -35005, -12127, -554, 1329, -7940, -27196, -16290, -16320, -14779, -18897, -20098, -18899, -16225, -5852, -3648, -13833, -19943, -7988, -365, -1265, -18828, -21335, -30194, -29119, -35715, -36036, -21691, -7963, 7012, 4431, -1207, -15228, -14544, -29137, -31299, -30415, -28134, -13097, -18768, -31337, -45140, -61947, -64721, -58594, -46985, -26663, -1773, 15798, 16250, -10822, -12187, -1409, -4992, -8704, -6177, 1126, 5911, 11084, 15399, 25859, 17958, 4539, 5625, 9062, 15809, 18537, -1978, -37163, -40576, -16218, -20556, -17202, -37745, -28645, -12106, -6028, -4667, -10755, -12729, -1372, -7691, -18759, -9343, 2398, -9210, -14351, -4981, -8350, -27539, -40961, -49147, -28522, -15451, -25297, -6374, 16055, 28064, 32053, 21024, -14419]
7670a4419l052J0887O626J0922O027j041J554j6462j1633J394P708j5645m296
7657b1430l094K240k923J0920L969m611N461R853k3545j482J7994K8795k097k6489
7643f439p026j0681N11J3983J2386J894l662j9692j3586m697J2694J3471j3128
7630b3972l4591j1492M6350L0423R88r504L19M420j5876k0704J906K0214Q848
7617b671m934M16r642j1471j548J9910M276q756p837q10R553P804O679q160P236
7602D5k5607R133J6033r129o104J3462N777k788j8731N388J2738j6851r536K1720
7588d450L0698r155j9633k0597N195J5375J7101n747k0378o512K7177J9329o330
7575B2073r727J3353Q597k0978r522j7118l395L7417O588j4677l870n119k0162
$$ y = [-14419, -17471, -6584, 42, 10964, 16991, 15950, 17504, 1042, -10591, -9197, -1489, -17134, -21430, -24524, -22284, -25207, -14287, -10318, -14929, -9468, 385, -23160, -24642, -6648, 22147, 20050, -6439, -13465, -24146, -23635, -9652, 2734, 4628, 966, -18726, -32312, -37009, -24315, -10844, -23972, -58563, -70055, -23705, 6718, 7706, -1798, -1479, 2941, -12935, -33639, -31733, -11519, -2671, -7605, -7189, -16831, -28302, -29850, -9940, -5664, -14420, -22257, -23067, -13514, -5710, 969, -7191, 45, -25562, -16429, -396, -9525, -15629, -2167, 3610, 822, -17909, -12521, 217, -16634, -26170, -4450, 26248, 17093, -2540, -23137, -17942, -2567, 14534, 8787, -11591, -18103, 9074, 28403, 22073, 12346, 25699, 34296, 13318, 3796, -13322, -16717, 20700, 27288, 12611, 8741, 3622, -16540]
7562a6540L164J8204J0693J205M085o66j1127J936J4320k258k4114k0878L5102
7549A3126J3670k3956q671k1502O109O417Q16J7871o756j5758j275r267k1229
7536e0405l81K8638q978p763J4622L6098J4652o691j7008k6J4695J1803r866k7372
7522g982l1258j0766J4126J5088K3781l113J728L886j081Q309J2450j6253j8288
7509i373k665j1682l814J2223J3587R557P75k9423o443J275p48N802M954J0549
7495e426K0796M608q798m496k660j0768j0601M720J0613J5797j1376j5016K4358
7482A1751J1815K180J1944O239J46j4453l194k1808n553J589O583j481j1265j5922
7468b1429J439J3542k718l853j0807K5904J0829j9196j4103P510M540n632O593
$$ y = [-16540, -13376, 4828, 15521, 16726, 20811, 20145, 9018, 10954, 25274, 23016, -1098, -21976, 13126, 26796, 2840, -5831, -27333, -21224, -14807, -13991, 3880, -2876, -18634, -19909, -29176, -50405, -50786, -22148, -31126, -38889, -24267, 11831, 26483, 19792, 2784, 2758, 17453, 29256, 19390, -7982, -39240, -50006, -35880, -20792, 2989, -124, 1604, 5490, 4409, 12718, 25168, 8915, -9373, -12038, -23720, -27534, -15311, -1724, 7833, 8608, -20815, -27258, -25983, -26731, -20929, -15975, -5426, 15370, 19978, 11180, 6684, 4024, -6744, -17345, -12625, -2012, 13785, 2409, -12607, 11751, 23566, 25746, 37690, 43929, 44075, 29622, 26428, 4620, -933, 656, 7239, 5758, -5507, -21429, -19990, -6448, -9166, -13019, -23826, 2078, 12907, -6289, -20392, -12882, -8342, -13974, -7381]
7455g381J4503j354n666N036j450r701J2095M121l628K873J5443p556O825j2402
7441A1758j3057j5063j1116K777L075j3013O587M834q50K2826J2795j587J017
7428A0983p362L905k0194j6946m141K1199L689j8684O969O619n896K2712J8887
7415B1740r829j2090l3595Q711L760p070j0368J2021j928P262L420o271J5514
7402h723K927o26m676P802p395J6750K354J3707L845m584j2059j1849p518K0531
7388A0486k847j7782Q67J5549j893R81n943j8707P808J0243j546r932j5100r632
7374c7448K7374K9920r825k245O875R65r804k1084j6309K9854O860j2760l501
7361a1128j4266n534J465j7377k34M3225K8646j708j9853J9157O569N505j858
$$ y = [-7381, 7122, 5768, 102, 5138, 3688, -6013, 6082, 10203, 6575, 9448, 24891, 17335, 24160, 11758, -1299, -16362, -27478, -24701, -21626, -34639, -28052, -23218, -24068, -1242, 11553, 9966, 10983, 3621, 7526, -12668, -29614, -33755, -12556, -8867, -27551, -20582, -13963, -19859, 2853, 21740, 11911, -179, -33774, -25063, -21303, -28373, -38741, -26720, -28648, -21386, -17966, -24237, -8723, -5796, -6422, -11098, -3296, -10691, 6059, 8413, 22120, 25965, 21381, 9322, -2527, -10045, 10486, 7639, -10143, -9276, 6273, 4380, 5361, -582, -19289, -11481, -1238, -2784, -12716, -27816, -37448, -10074, 19846, 10021, 7776, 14651, 15616, 5812, -15272, -31581, -1727, 5133, -7627, -11128, -25394, -30928, -29463, -46840, -47074, -3849, 24797, 23089, 3236, 22393, 28962, 34467, 32609]
7348C2609j9555j8131o407J0668P784k118o545k618j7874m306j0151l85R88K330
7334c3711J9021k079p805n940L4281N678j1921j1212k140K697J2858q014J595
7321f692k03J7708k7j5496J0429j7258p190O308j0533j4681j0935Q840O391Q003
7307b5336M061K527M565K7152J5142k7420k9124k2416J4505K4193J6931L54r866
7294d732M739l581j2015o587P965K540k1725o13L0545p9j5067J3389J7323J8048
7280C0150O231j9537l476o058j876j9475j3345J4430K2288J006M843N901J1715
7267C2797o825j5283j1781J1941J8201k2733j4006L5372L1608o659l5144j2116
7255E372Q138k138k3097J3627o954k2370j8101J243J7573Q422k491M326q890m07
$$ y = [32609, 13054, -5077, -11484, -816, 6968, 4850, -1695, -4313, -22187, -26493, -36644, -37029, -36041, -33711, -14690, -16769, -24574, -30514, 3767, 9445, -2476, -13688, -15828, -13131, -273, -8287, -6692, -6895, 10813, 10786, -4710, 5719, -11539, -18729, -12421, -22954, -37635, -48570, -39730, -33339, -25336, -21275, -18748, -14183, 12969, 28111, 691, -28433, -50849, -36344, -12151, 4780, 5134, -4732, 7, -3574, -15589, -22176, -14211, -11671, -33396, -34009, -3464, -3543, -18610, -5221, 12102, 30150, 36381, 16844, 13368, 7310, 5434, -14041, -27386, -12956, 9332, 10338, 15181, 21082, 32797, 25972, 10689, -1092, 10849, 29050, 6317, -7689, 27683, 59291, 52632, 17488, 5372, 13510, 11372, -11725, 1902, -5052, -27422, -45523, -44280, -26707, -18285, -20776, -16450, -25340, -25747]
7241b5747O582q192j8260r097J2687K2612J4923k0864q76K0690P599r064k1085
7228b8092R804K7075J5719J3582J1505j9821j4424k4256q569K5247Q230q381r007
7215a388j2438K0318J7719j0558q848k0645j556r688J0516k783j1110J1348L013
7202a6100K1236L510k490j3235m809Q531K4459L209p253k5103n250J1621J1534
7189I860L090o345R252j0260J0840P473j6412j1120K892J3910K672O609o269k5967
7175i775R244J0667J643N645O09K2122J4461j0108k3984k5191o823J6604k218
7162B896j4771j4211J0576K732J506J450J3629n105J3313K8096j3971j5677p227
7149C236q371p109M2044P96J835k3649l5486R783K7684J845m257M695j663j296
$$ y = [-25747, -19165, -27357, -45617, -54714, -42027, -19415, -4492, -25356, -26232, -5542, 2057, -7007, -28092, -18288, 8787, 24506, 38088, 49593, 29772, 15348, -8908, -17477, 7770, 16000, 7619, -1388, -13826, 6492, 24211, 13653, 4805, -15840, -17396, -27084, -16568, -19351, -30461, -19113, -16100, 5136, 8646, 6156, -7079, -11888, -3357, 21102, 24311, 17058, -8045, -13295, -1674, 9860, 12950, 6605, 15857, 5597, 16437, 23910, 7498, -3622, -730, 13180, 15852, 22461, 16192, -9775, -531, 10136, 11779, 17424, 18033, 40155, 54616, 44508, 20524, -4667, -11490, 5114, 2896, -11875, -26086, -15510, -12778, -11272, -9822, 3807, -1298, 12015, 40111, 26140, 10463, 3236, -5135, -12244, 29800, 30596, 32431, 8782, -26704, -16921, 10763, 12608, 8351, 13046, 11383, 10087]
7135A0087j9999J7408O82P915J3748R39l05j454k1959j7861j2794q084J9224J4764
7121B311K4663o887j5630R801J3474j792k4098j2428k4126J2959N86j507K891
7108a9783k048l252N202K983l766J699k892p764m536J9455J7945p968r660M150
7094a0235m311J1011O846m902j5718J9276J2594k5335n122o700k677p333o969
7081c9575K0393m074j914O956q00O708J207L340J2246J6366M682m5003k8447J1793
7067c6122J8291J6462J574j8176j1600P77l56K962j7335j346J2414Q393j4498
7054c8560Q085J1921j4198M105J512Q199J8931q30P267J5484n302k9303j8610
7041c1299K654K7120J1473q866k787j0804k2332J4269m686M577J6910r771j4793
$$ y = [10087, -9912, 7496, 8178, 16093, 29841, 30780, 30475, 29021, 7062, -10799, -23593, -31677, -12453, 2311, 26974, 20087, 4457, 14258, 27732, 25940, 1842, -10586, -34712, -21753, -21167, -22674, -19783, -21831, -25083, -19881, -16898, -20664, -18965, -21857, -29621, -34157, -14702, 3243, -4725, -14385, -10235, -14546, -3535, 3311, -1591, -17309, 1967, 14561, -10774, -15896, -22596, -25273, -32606, -39575, -19182, -23256, -25170, -18214, -19014, -12306, -11099, -7759, 4487, 20853, 25535, -19468, -47915, -36122, -17831, -1369, 205, -17971, -29571, -28794, -29150, -26188, -43523, -44869, -32455, -24062, -38560, -30475, -18554, -32752, -28647, -27135, -18936, -5, -835, 6432, 21916, 16614, -12689, -31299, -28645, -1525, 9948, 1082, -1705, -12509, -34841, -20572, -25258, -20681, -3771, -13542, -28335]
7028b8335Q769J6702J762J8267k6527j2371J142L5730K7045k0028j9771j673K080
7015B792m437Q055J6156L844n481o293n282j0575M117k3679j2928L2754n108l644
7001i709J2702r46N626l164j8203K544Q525j217j3611J0498M427q383l8630j2167
6987f1708J5959J5378J0888M2J6204R194k1167j831J6450N665N258j7535k164
6974i367K5214J761j7501q208q368r619J1345j2127Q425J1969j1948k1768j915
6961d2107Q904Q628J7944j330k7042N728P44J4266N517J472j3402r888L8698K4250
6947C2382l782l450j8262j0885k287K4709l1k4344j8275P575q222j9368Q23J1639
6933c1778O089J5266J7249k6005r329J0147N86m800m090J2576J5719j925K827
$$ y = [-28335, -19566, -2864, -1102, 17165, -9362, -21733, -20591, 15139, 42184, 22156, 2385, 712, 2792, -1645, 6410, 22566, 26410, 20929, 14636, 9354, -1221, 2896, -20783, -33711, -957, -6065, -9709, 2993, 2047, 7673, 4509, -13694, -11150, -2625, -3842, -17453, -6955, -2528, -10911, -49541, -61708, -45749, -30371, -19483, -19441, -3237, 5957, -15210, -17041, -591, 5074, 10332, -7203, -9367, 15847, 17608, 107, -8101, -16469, -26088, -14743, -26870, -18445, -6476, -18424, -40192, -42107, -33203, -24575, -6631, -7961, -35003, -29275, -28531, -14265, -8748, -7276, -20678, -30566, 8132, 32382, 28600, 25150, 6888, -3997, -6284, 18425, 18394, -5950, -24225, -16650, -24872, -44240, -43417, -31778, -25689, -10423, 6826, -19179, -28508, -18361, -17775, -22575, -26665, -14089, 1630, -295, 2532]
6920B532K0714O115N632k3592j3096p447r866R271K70K0220J2153q278K1253J8451
6906E4332n995j0450k3095j5568j0593P065j5151j4848j5625o458Q093K6245L0889
$$ y = [2532, 23246, 29361, 34993, 11401, -1695, -9142, -19008, -9737, -9467, 10753, 22906, 14628, 35881, 54332, 48337, 37887, 14792, -776, -11369, -4304, -19455, -34303, -49928, -56386, -48293, -22048, 8841]
$$ [...]
##END NTUPLES=NMR SPECTRUM
##END=
