##TITLE=Analysis number 318358
Compound Code cc 47204
Book Reference 437/72
Project Code adrs
Chemist Name wendyb
##JCAMPDX= 6.0         $$ Bruker NMR JCAMP-DX V2.0
##DATA TYPE= NMR SPECTRUM
##DATA CLASS= NTUPLES
##ORIGIN= Bruker BioSpin GmbH
##OWNER= nmr
$$ XWIN-NMR		Version 3.5
$$ Fri Mar 24 12:17:12 2006 GMT Standard Time (UT+0h)  MAYBRIDGE\nmr@NMR_250MHZ
##.OBSERVE FREQUENCY= 250.131544655141
##.OBSERVE NUCLEUS= ^1H
##.ACQUISITION MODE= SIMULTANEOUS (DQD)
##.ACQUISITION SCHEME= undefined
##.AVERAGES= 16
##.DIGITISER RES= 18
##SPECTROMETER/DATA SYSTEM= dpx250
##.PULSE SEQUENCE= zg30
##.SOLVENT NAME= CDCl3
##.SHIFT REFERENCE= (INTERNAL, CDCl3, 0, 16.451)
##AUDIT TRAIL= $$ (NUMBER, WHEN, WHO, WHERE, WHAT)
$$ ##TITLE= Audit trail, XWIN-NMR		Version 3.5
$$ ##JCAMPDX= 5.01
$$ ##ORIGIN= Bruker BioSpin GmbH
$$ ##OWNER= nmr
$$ C:\u/data/dgb/nmr/ADRS/1460/pdata/1/auditp.txt
$$ ##AUDIT TRAIL=  $$ (NUMBER, WHEN, WHO, WHERE, WHAT)
(   1,<2006-03-24 12:16:02.78 +000>,<MAYBRIDGE\nmr>,<NMR_250MHZ>,
      <created by zg, POWCHK disabled, PULCHK disabled
       configuration hash MD5:
       84 BC 41 DB A1 6E 1D 46 DA 25 12 A5 C1 ED C5 3A
       data hash MD5: 64K
       B1 D6 81 11 BE A7 FB F8 F1 B5 42 87 A6 59 FD EC>)
(   2,<2006-03-24 12:16:37.99 +000>,<MAYBRIDGE\nmr>,<NMR_250MHZ>,
      <Start of raw data processing
       ef LB = 0.3 FT_mod = 6 PKNL = 1 SI = 32K 
       data hash MD5: 32K
       67 0C 55 5A E2 2A FA BF C2 42 CF 74 2C 17 ED 65>)
(   3,<2006-03-24 12:16:48.20 +000>,<MAYBRIDGE\nmr>,<NMR_250MHZ>,
      <apk 
       data hash MD5: 32K
       CF E4 53 BA D3 62 49 C9 C2 FB 3B 22 43 B6 75 BB>)
(   4,<2006-03-24 12:16:51.55 +000>,<MAYBRIDGE\nmr>,<NMR_250MHZ>,
      <abs ABSG = 5 
       data hash MD5: 32K
       4B 25 E0 E4 C8 99 3E 7F 2A 35 71 32 C3 C0 53 62>)
$$ ##END=
$$ 
$$ hash MD5
$$ E1 6C 9F 6A 83 5D AD E5 E3 D2 62 0F D2 0B 00 51
##$RELAX= 
##$RELAX= 
##$RELAX= 
##$RELAX= 
##$RELAX= 
##$RELAX= 
##$RELAX= 
$$ Bruker specific parameters
$$ --------------------------
##$DU= <C:\u>
##$EXPNO= 1460
##$NAME= <ADRS>
##$PROCNO= 1
##$TYPE= <nmr>
##$USER= <dgb>
##$AMP= (0..31)
100 100 100 100 100 100 100 100 100 100 100 100 100 100 100 100 100 100 
100 100 100 100 100 100 100 100 100 100 100 100 100 100 
##$AQSEQ= 0
##$AQ_mod= 3
##$AUNM= <au_zg>
##$AUTOPOS= <20 >
##$BF1= 250.13
##$BF2= 250.13
##$BF3= 250.13
##$BF4= 250.13
##$BF5= 500.13
##$BF6= 500.13
##$BF7= 500.13
##$BF8= 500.13
##$BYTORDA= 1
##$CFDGTYP= 0
##$CFRGTYP= 5
##$CHEMSTR= <none>
##$CNST= (0..31)
1 1 145 1 1 1 1 1 1 1 1 1 1 1 1 1 1 1 1 1 1 1 1 1 1 1 1 1 1 1 1 1 
##$CPDPRG= <>
##$CPDPRG1= <>
##$CPDPRG2= <>
##$CPDPRG3= <>
##$CPDPRG4= <mlev>
##$CPDPRG5= <mlev>
##$CPDPRG6= <mlev>
##$CPDPRG7= <mlev>
##$CPDPRG8= <mlev>
##$CPDPRGB= <>
##$CPDPRGT= <>
##$D= (0..31)
0 1 0 0 0 0 0 0 0 0.06 0 0 0 0 0 0 0.0002 0 0 0 0 0 0 0 0 0 0 0 0 0 0 
0 
##$DATE= 1143202558
##$DBL= (0..7)
120 120 120 120 120 120 120 120 
##$DBP= (0..7)
150 150 150 150 150 150 150 150 
##$DBP07= 0
##$DBPNAM0= <>
##$DBPNAM1= <>
$$ [...]
##$SUBNAM7= <"">
##$SUBNAM8= <"">
##$SUBNAM9= <"">
##$SW= 20.6930455092707
##$SWIBOX= (0..15)
0 0 3 0 0 0 0 0 0 0 0 0 0 0 0 0 
##$SW_h= 5175.983436853
##$TD= 65536
##$TD0= 1
##$TE= 294.16
##$TE2= 300
##$TE3= 300
##$TEG= 300
##$TL= (0..7)
0 120 120 120 120 120 120 120 
##$TP= (0..7)
150 150 150 150 150 150 150 150 
##$TP07= 0
##$TPNAME0= <>
##$TPNAME1= <>
##$TPNAME2= <>
##$TPNAME3= <>
##$TPNAME4= <>
##$TPNAME5= <>
##$TPNAME6= <>
##$TPNAME7= <>
##$TPOAL= (0..7)
0.5 0.5 0.5 0.5 0.5 0.5 0.5 0.5 
##$TPOFFS= (0..7)
0 0 0 0 0 0 0 0 
##$TUNHIN= 0
##$TUNHOUT= 0
##$TUNXOUT= 0
##$USERA1= <user>
##$USERA2= <user>
##$USERA3= <user>
##$USERA4= <user>
##$USERA5= <user>
##$V9= 5
##$VALIST= <valist>
##$VCLIST= <CCCCCCCCCCCCCCC>
##$VD= 0
##$VDLIST= <DDDDDDDDDDDDDDD>
##$VPLIST= <PPPPPPPPPPPPPPP>
##$VTLIST= <TTTTTTTTTTTTTTT>
##$WBST= 1024
##$WBSW= 4
##$XGAIN= (0..3)
0 0 0 0 
##$XL= 0
##$YL= 0
##$YMAX_a= 409427
##$YMIN_a= -435954
##$ZGOPTNS= <>
##$ZL1= 120
##$ZL2= 120
##$ZL3= 120
##$ZL4= 120
##$ABSF1= 16.45095
##$ABSF2= -4.242222
##$ABSG= 5
##$ABSL= 3
##$ALPHA= 0
##$AQORDER= 0
##$ASSFAC= 0
##$ASSFACI= 0
##$ASSFACX= 0
##$ASSWID= 0
##$AUNMP= <proc_1d>
##$AZFE= 0.1
##$AZFW= 0.1
##$BCFW= 0
##$BC_mod= 0
##$BYTORDP= 0
##$COROFFS= 0
##$CY= 12.5
##$DATMOD= 1
##$DC= 0
##$DFILT= <>
##$DTYPP= 0
##$F1P= 14.0000005364418
##$F2P= -0.99999901652339
##$FCOR= 0.5
##$FTSIZE= 32768
##$FT_mod= 6
##$GAMMA= 0
##$GB= 0
##$INTBC= 1
##$INTSCL= 1
##$ISEN= 128
##$LB= 0.3
##$LEV0= 0
##$LPBIN= 0
##$MAXI= 10000
##$MC2= 0
##$MEAN= 0
##$ME_mod= 0
##$MI= 0
##$NCOEF= 0
##$NC_proc= -2
##$NLEV= 6
##$NOISF1= 0
##$NOISF2= 0
##$NSP= 0
##$NTH_PI= 0
##$NZP= 0
##$OFFSET= 16.45095
##$PC= 1
##$PHC0= 175.9561
##$PHC1= 4.850329
##$PH_mod= 1
##$PKNL= yes
##$PPARMOD= 0
##$PSCAL= 4
##$PSIGN= 0
##$REVERSE= no
##$SF= 250.13001777037
##$SI= 32768
##$SIGF1= 0
##$SIGF2= 0
##$SINO= 400
##$SIOLD= 32768
##$SREGLST= <1H.CDCl3>
##$SSB= 0
##$STSI= 32768
##$STSR= 0
##$SW_p= 5175.98343685301
##$SYMM= 0
##$S_DEV= 0
##$TDeff= 65536
##$TDoff= 0
##$TI= <Analysis number 999999
Compound Code 99
Book Reference 9
Project Code 9>
##$TILT= no
##$TM1= 0
##$TM2= 0
##$TOPLEV= 0
##$USERP1= <user>
##$USERP2= <user>
##$USERP3= <user>
##$USERP4= <user>
##$USERP5= <user>
##$WDW= 1
##$XDIM= 32768
##$YMAX_p= 396253283
##$YMIN_p= -605182
$$ End of Bruker specific parameters
$$ ---------------------------------
##NTUPLES= NMR SPECTRUM
##VAR_NAME=  FREQUENCY,     SPECTRUM/REAL,   SPECTRUM/IMAG
##SYMBOL=    X,             R,               I
##VAR_TYPE=  INDEPENDENT,   DEPENDENT,       DEPENDENT
##VAR_FORM=  AFFN,          ASDF,            ASDF
##VAR_DIM=   32768,         32768,           32768
##UNITS=     HZ,            ARBITRARY UNITS, ARBITRARY UNITS
##FACTOR=    0.157963299565203, 1,           1
##FIRST=     4114.87657156006, 0,            0
##LAST=      -1061.10686529295, 0,           0
##MIN=       -1061.10686529295, -605182,     0
##MAX=       4114.87657156006, 396253283,    0
$$ Real data points
##PAGE= N=1
##DATA TABLE= (X++(R..R)), XYDATA
$$ [...]
19320B1076j5084J243m414j6610k4633m726K0435J5590J066j2438K989N60R335
19307e611j9628j8504Q62J5271J4805Q924L064K822k2177j6290j2393J7088J0326
19294b1441j3249m905n65J548K2057J0972j5636r391J1448K02k2790l91L4864
19281g277R681Q798K042J48k0231j7615N059K3577k93j3987j7225N616j439o751
19267b9897l704K5812M788m368J1141R308k676j2926j6803j1183O46Q232J5060
19254f570K490k0324j0339R089J7331J5129K666j006K1162j6062j9673j2284j0947
19241b9338J1956R102M296K0047l948K029p494J3806L660k7775q586J1764O400
19228E919Q055L122l384j0175Q172J4489m203J7790R903k9468j5469j5481O040
$$ y = [21076, 5992, 7235, 2821, -13789, -38422, -43148, -22713, -7123, -6057, -18495, -15506, -14946, -5611, -25239, -43743, -42881, -27610, -12805, -3881, -817, 2005, -20172, -36462, -48855, -31767, -21441, -34690, -39595, -40160, -38612, -16555, -5583, -21219, -30610, -19162, -18960, -41750, -42141, -7277, 2404, 11202, 13244, 13392, -6839, -24454, -19395, 4182, 3889, -10098, -27323, -21707, -23146, -29897, -33601, -7789, -3001, -7369, 3772, 13080, 10404, -2522, -19325, -30508, -29862, -21630, -6570, -4080, -24404, -34743, -25654, -8323, 6806, 9472, 8466, 29628, 13566, -6107, -18391, -29338, -17382, -8280, -3984, 16063, 12115, 14144, 6650, 20456, 24116, -3659, -12245, -481, 5919, 13974, 17096, 13712, 3537, 11709, 26198, 21995, 39785, 49688, 20220, 4751, -10730, -4690]
19215d690N4L017j4370R382K5469j7146k1587J921m919m320O212K6579J7674M421
19201B7697j6051L753j3538J0406k4241j010K4796J628j8069j5042r634p986J6591
19188b0700l127q063l487K2703K214J2700J1385o711q094J41O268p15j6441K4261
19174A2334M224j0225P46k4086j405K0308J018J0542k461k6290j75J2937R512
19161F979m759K747j96l1044Q631R347K335j7365l318J5558P468O534p632j109
19147e824N56p171j8111K1145J2785n617O133J7603p814r392l881J188J6143M451
19133B2194j4444j4897J1776M388J1020j8282j7449J5640k8964J7597K3852q728
19121C703q837m368J0709K5607K768j4269j8524m745J3952K166k0681N355K9996
$$ y = [-4690, -4636, -1619, -15989, -6607, 18862, 1716, -19871, -17950, -22869, -27189, -20977, 5602, 23276, 27697, 11646, 15399, 1861, 12267, -11974, -12984, 11812, 13440, -4629, -19671, -29305, -37291, -20700, -23827, -31890, -35377, -12674, -10460, 2240, 13625, 6914, -1180, -1039, 5229, 4514, -11927, 12334, 16558, 6333, 7079, -17007, -18412, 1896, 2914, 13456, 10995, -15295, -15470, -2533, 6979, 2220, 4967, 4771, -26273, -17642, -8295, -5960, -23325, -26643, -11085, -3617, 2917, -4715, -5824, -5268, -12439, -30550, -9405, 3380, -2237, 3896, 21499, 13685, 4293, 412, 1600, 17743, 22194, 7750, -7147, 4629, 9017, 20037, 1755, -15694, -54, -29018, -11421, 12431, 3703, -5134, -9502, 1207, 26814, 29582, 15313, -3211, -7956, 5996, 8162, -12519, -7164, 22832]
19108B2832j2284k0333M293l96J1211J3461j4979K644L130m453j8957r909j2131
19095c5871P541J1009J5992J1117j7480l7836p602J8532k548j474J7852j985j664
19082b4417J702J1015m07j7589q050K1801J5245r503m32k3105J8309J6664j0500
19069i267q280k405l895j3004J0735K6676L471J78Q795J2297P338j6967j8700
19056c028P716K3892J333j7534j2917o406q881j1062J5736M368k64M671Q597Q201
19042A4422j2974j3479J91n512j1442o221K3856J9808j535j2363j3983j027R508
19029a0751q073k0969k0453J0146J3793J8025k270J6528J5667L116j4377k9981
19017b9599J3302l552k3537M430J0618L0113J0883l899N064m309m201n245j6282
$$ y = [22832, 10548, -9785, -5492, -5888, 5323, 18784, 3805, 6449, 9579, 5126, -13831, -23740, -35871, -28330, -17321, -1329, 9788, -7692, -45528, -53130, -34598, -37146, -38620, -20768, -22753, -24417, -22715, -11700, -12107, -29696, -37746, -15945, -700, -10203, -10635, -33740, -15431, 1233, -9267, -17547, -19952, -23847, -36851, -26116, 560, 4031, 4209, 13004, 25301, 32639, 15672, -3028, 4688, 28580, 29913, 12379, -538, -6944, -15825, -26887, -11151, -6783, -7047, -2376, 6221, 14422, 1448, -12031, -11840, -17352, -28794, -35015, -11159, 8649, 7114, -5249, -19232, -20259, -10751, -18824, -39793, -60246, -50100, -36307, -18282, -20552, -4024, 11643, 14759, 382, -29599, -16297, -19849, -43386, -38956, -28338, 1775, 12658, 8759, 13823, 9514, 5313, 68, -16214]
19004a6214Q003J4546k640j1775m668N073L0651n655k986p978Q305p809j321j2690
18990g158l449j8660J6546K1563j0384j9849K5058R659o941k951M861j002n569
18977A724k7551M512R10J3021L2972L574K914K5471o901j5995j7551M497J3182
18964C4779j2195o587R78Q338J1108j403j0627K25J0246K632k0690r607k2691
18951a5494n031M1K852L0529M487l852K995K4742j7221m271p821k313Q452K6185
18937D4280N992l6894r348M465j5857R642J624j8465M167K4867J8478K892K968
18924C8811n216k8572j7004J6211J3428L229m243r863R597R963J4976j1376j1949
18911A7992k4764m641J2908K3205J74n539n428q622K2849j1105o709k98k466j0307
$$ y = [-16214, -8211, 6335, 3695, -8080, -12748, -7675, 22976, 17321, 14335, 6357, 14662, 6853, 5532, -7158, -10607, -29267, -12721, 8842, -1542, -21391, 3667, 13326, 6385, 3434, 8295, 7293, 1724, -25827, -21315, -20405, -7384, 25588, 29162, 32076, 57547, 50646, 34651, 17100, 21597, 34779, 22584, 15997, 16975, 25313, 36421, 35018, 24391, 24616, 34862, 37494, 16804, 7197, -15494, -20525, -20484, -17632, 12897, 17384, 13532, 16527, 41269, 24048, 19777, 11956, 9643, 18095, 44280, 50272, 13378, 4030, 8495, -7362, 2280, 3904, -14561, -10394, 14473, 32951, 35843, 38811, 33595, 5023, -11981, 4230, 17658, 20887, 16644, 6781, 16378, 26341, 41317, 29941, 17992, -6772, -11413, 1495, 24700, 24874, 19335, 13907, 5285, 28134, 17029, 10320, 10022, 7556, -2751]
18897b751r584o99j5057l147L46J669M223J1K41J2167m273j5865L4465Q592n51
18882I787r459j2736K2172N959n195J951j538J854J0977o568q153j3687j5693
18869b0329Q493k47k820K5150K4642q632k128r104k761j1981o03J0675r463J0489
18855A1381L396j8796j4149K303K1430L1733K792l007J9775J0731k3813l0150
18843A3626r062k3813k4109j4228K0061J0491p284N031K910J1371Q114o754m312
18830a7958j0148j6591J2514L2628K9744j2592j5557l673j3573l761l161L023
18818a9105n7J6965J7415J1086M089q92k1047k2458K1144R981m977M725n208k8960
18804a7299R211L4318K2662j860k3392q66m548L927j4432l124J8039J5305j0903
$$ y = [-2751, -12335, -13034, -28091, -31238, -30892, -29223, -25000, -24989, -24748, -12581, -16854, -32719, 1746, 10338, 9787, 328, -12408, 9764, 15723, 10528, 12479, 10941, 12795, 23772, 17204, 9051, -4636, -20329, -11836, -12083, -14903, 10247, 34889, 26257, 24129, 15025, 12264, 283, -320, 10355, 892, 11381, 14777, -4019, -18168, -15865, 5565, 37298, 40090, 37083, 56858, 67589, 43776, 13626, 4564, -19249, -43358, -57586, -37525, -27034, -34318, -29287, -26377, -15006, -6892, -13646, -17958, -28106, -44697, -32183, 445, 30189, 17597, 2040, -1633, -15206, -18967, -22128, -19105, -19162, -2197, 15218, 26304, 30393, 29501, 8454, -14004, 7140, 17121, 12144, 16869, 11661, -17299, -8088, 26230, 48892, 47032, 23640, 22774, 18226, 22153, 7721, 4597, 22636, 37941, 27038]
18791B7038J2551M7339N8427L7584j8300j9450k0557j6015J2852L7236L8973J269
18779A98947l6191k3981l1366k0744j6456j3033j9893l734J6935Q958K1771M2245
18767A23458P1202O1033N3849M9866J7963k9746l6587m3121Q839J5842R041K714
18755C04353j8079m0272o1549m5490j0693N822J9591M8934L642k3351m5168k4751
18743A12989k4979j8027k0732o847J3795r458j6688J441j8P345l608j826j214
18730C2173j2513K405K5062M903K3121L6315N5818L9940J767k9226l9563r441
18718A30761L086J2089L0583L38l8668l7184m2868l6377j553K2705R579l2399
18706B0092p801m051N548J2435N22j5507k0581j0221r724J4019J3195J0261Q711
$$ y = [27038, 39589, 86928, 145355, 182939, 164639, 145189, 124632, 108617, 121469, 158705, 197678, 198947, 162756, 138775, 107409, 86665, 70209, 57176, 37283, 33549, 50484, 59442, 81213, 123458, 194660, 255693, 309542, 359408, 377371, 347625, 311038, 267917, 276756, 292598, 301639, 304353, 286274, 246002, 184453, 138963, 128270, 134092, 153683, 202617, 206259, 182908, 137740, 112989, 88010, 69983, 49251, 42404, 56199, 46741, 30053, 31494, 31476, 38821, 35213, 33387, 32173, 19660, 22065, 47127, 52030, 75151, 111466, 167284, 207224, 208991, 179765, 140202, 130761, 133847, 145936, 176519, 176857, 138189, 101005, 58137, 21760, 20207, 42912, 52491, 20092, 12291, 8240, 13788, 26223, 26745, 11238, -9343, -19564, -29288, -15269, -2074, 8187, 16898]
18693A6898J1966K4722j0161j9572q859o805Q708j931j6235K385J949K010L2138
18680C7213j3238k2767K1355K0485q757j3210K424Q848M411j3861J1338L1887
18668F6128K1503J8992k2371m9555j4402J0754K1955J8576M8170J9539l54k853
18656A36082k4123k5286j3888l045m947J9880K6708L1974o284j1433l0661m1802
18644E3175m967J2955L5706L2422N826l5255l0138M197J666k0960j2346j4340
18632B7941L532J8882l568j1762k6109p916O131l251q056N195M160L130J0406
18619A8715p953p613j6975o639K4547J1230N060P872k1763q334Q582N993K2325
18606C5047m076p653l2872n323L003J2689J9424J0386m323r223K135o190k1925
$$ y = [16898, 28864, 53586, 43425, 23853, 14994, 8189, 16897, 14966, -1269, 1116, 3065, 5075, 37213, 23975, 1208, 22563, 43048, 34291, 21081, 23505, 32353, 36764, 22903, 34241, 66128, 87631, 106623, 84252, 34697, 20295, 31049, 53004, 71580, 119750, 139289, 138935, 136082, 111959, 86673, 72785, 69740, 64793, 84673, 111381, 143355, 137071, 125638, 94977, 53175, 48208, 61163, 96869, 129291, 135117, 99862, 69724, 73921, 75587, 54627, 42281, 27941, 31473, 50355, 46787, 35025, 8916, 1000, 7131, 3880, -4176, 1019, 5179, 8309, 18715, 10762, 3149, -13826, -20465, 4082, 15312, 20372, 28244, 6481, -1853, 6729, 12722, 35047, 30971, 23318, -9554, -14877, -11874, 815, 20239, 30625, 26302, 17079, 19214, 13024, -8901]
18593h901J5496m008p048P27k0558j295J1284K2929J3697J1684n863o185J2342
18580C4301J2223l63k151j5155j360J2585o034Q247J2800p398k6665k9902k194
18567a1066k320J1473K9764J1615l658j2799l3801n042K4483j2168j1287K0449
18555E643J3339o001k2597j8127J9822O291J8016K3966K2782l658j9125n715r775
18542B4861j1111j9781j836j8190K7066J81j1243j5944N371O857L2081J5871q21
18529C3362L096m587J2128J5742J4698j5140j9984j8395R016J6486L1647J2761
18517I0830N03j5453j9118j4580J2783J0233j599l0469J490N580o008j159q35
18504C2198j902K2106J1366k88r929m708j320j5944L901q94l525Q384r280J4882
$$ y = [-8901, 6595, 2587, -4461, -3734, -24292, -25587, -14303, 8626, 22323, 34007, 28144, 21959, 34301, 46524, 46161, 44010, 28855, 27495, 40080, 34046, 42293, 55093, 47695, 21030, -8872, -11066, -13386, -1913, 27851, 39466, 35808, 23009, -10792, -15834, 8649, -3519, -14806, 5643, 18982, 12981, -9616, -27743, -7921, -1630, 16386, 40352, 63134, 59476, 40351, 34636, 24861, 13750, -6031, -7867, -26057, 1009, 1190, -10053, -25997, -20626, -13769, 18312, 34183, 33362, 36458, 31871, 43999, 59741, 74439, 59299, 39315, 20920, 29936, 46422, 78069, 90830, 91333, 75880, 56762, 42182, 54965, 65198, 63599, 33130, 34620, 40200, 34192, 33033, 32198, 30296, 52402, 63768, 63480, 53551, 48843, 47523, 31579, 35480, 34586, 31061, 39445, 30165, 45047]
18490D5047K6693j9199j2270K590L825J2611j6707j3504N179R389J973j4544j639
18477B9444r406l622K9256J9708K527J4527r789o724k6413k487r852N625K0623
18464E3417j0820P179j2397k3119j7157j019J2495R107O491J477J718Q872J2477
18451D8721k5316J3057K1447L0226L0035q552l2852j0118L078l194P180L1629
18439A05341K1470L51M658j3557j7853q775j5961r03q42Q652q871k4304r658J1387
18425E1135P149J5953J3408j2065m0185l1360J0138L6908N7789M0285K5240k9075
18413A45320l6899o3324j3435J1587L5893L9395L5898l982m1043m0311j3611q999
18401D6489J4837j3964q863j3557k5544O818J662K6213J4916J308k0624k1270
$$ y = [45047, 71740, 52541, 40271, 42861, 46686, 59297, 42590, 29086, 34265, 43654, 45627, 31083, 29444, 20038, 16416, 45672, 65380, 67907, 82434, 72645, 65921, 39508, 37021, 27169, 32794, 53417, 42597, 49776, 37379, 14260, -2897, -3916, 8579, 17686, 24177, 25654, 27372, 36244, 48721, 23405, 36462, 57909, 88135, 118170, 109618, 76766, 66648, 69726, 66532, 73712, 105341, 126811, 127162, 131820, 118263, 100410, 91635, 75674, 74771, 73929, 82581, 73710, 49406, 39748, 51135, 58284, 74237, 87645, 75580, 35395, 4035, 14173, 51081, 108870, 149155, 174395, 145320, 108421, 45097, 31662, 43249, 79142, 118537, 154435, 150453, 109410, 69099, 55488, 46489, 61326, 47362, 38499, 24942, -602, 6216, 7878, 34091, 49007, 50315, 29691, 8421]
18389H421L959j3723N647P520O877K4953J4211k6567R410R849o970k4901k119
18376A6567R735M14J0071L5110L3439J4793K0933j0808l3194l7062j9261j2877
18364B7860m478J0839J0409J5593J2144l476r477K0140K583j5400O964K054j1524
18351F4231J6113K3722J0946K8782N4473K7341k437j8954k6060j4449J4717K1063
18339A99488K0637J8818j8925m1048O121l596J0785K6159M8054Q4190J44832J75572
18327F71087J16180n9589j62101j56528r8626m1027O939L1847L7104J9813J3118
18316C78217M7221M394n0218n3274m4690l1246k6601l4666j2568j4533K6899J7297
18304B06232P584L5152N2926M8799K6056L9882K9785n168m2010l7593l8590k8082
$$ y = [8421, 12380, -1343, 4304, 11824, 18701, 43654, 57865, 31298, 40708, 50557, 43587, 18686, 16567, 26302, 26716, 36787, 71897, 105336, 120129, 141062, 130254, 97060, 59998, 40737, 27860, 23382, 34221, 44630, 60223, 72367, 68891, 59414, 79554, 82137, 66737, 73701, 75755, 64231, 80344, 104066, 115012, 143794, 198267, 225608, 223171, 204217, 178157, 163708, 178425, 199488, 220125, 238943, 220018, 178970, 185091, 181495, 192280, 218439, 266493, 350683, 495515, 671087, 787267, 727678, 565577, 409049, 310423, 269396, 276335, 308182, 345286, 365099, 378217, 425438, 429832, 379614, 326340, 281650, 250404, 223803, 189137, 176569, 162036, 188935, 206232, 213816, 248968, 301894, 350693, 376749, 416631, 446416, 441248, 399238, 361645, 323055, 294973]
18292B94973N441N2601P0893M5662J963j706P694K9285L5092P5384O3164N2307
18280G32753N7096P5594J38495J61158J99346K26306K02132K04780K77952M59877
18270B735489P07814J130881J933112L572502O609945R004026N356084j721570
18262B9328283n662814m934157j542618K886352P747098P919321N65586o453182
18254B9853869q483092o549070m015833k305960j300829o32199j09908L90193
18246F847171J005971K188306M559480Q325952R378052L279378l896710o571518
18238B5116082m535394l84009M839594R319084O434897k465803q616125r185093
18230B0523233o598315m110073k497489j545419r68661o29568m70779m17951l62098
$$ y = [294973, 300414, 353015, 423908, 469570, 471533, 469827, 477521, 506806, 541898, 617282, 680446, 732753, 789849, 865443, 1003938, 1165096, 1364442, 1590748, 1792880, 1997660, 2275612, 2735489, 3443303, 4574184, 6507296, 10079798, 16689743, 25693769, 31049853, 29328283, 23665469, 18731312, 17188694, 20075046, 27822144, 35741465, 36307051, 29853869, 21370777, 14821707, 10805874, 8499914, 7199085, 6566886, 6456978, 6847171, 7853142, 10041448, 14600928, 22926880, 32304932, 35584310, 31687600, 25116082, 20580688, 20196679, 25036273, 34355357, 40790254, 38324451, 29708326, 20523233, 13924918, 9814845, 7317356, 5771937, 4803276, 4173708, 3702929, 3284978, 2922880]
18221B922880k93649k51025k25070k07352j53121j19157j00983o9191o3130j20584
18211A319618j31797q4238k3725k0234m4191q4801o9993m9427n238K0297L3881
18200H60152L0114j3821n0021p4554m7138k5381j3110M2890K7883j428p933K3753
18188G51406M7626P4222K9128o920K2216P9618R7713J31897K27434K68375K70169
18177A992884K91700M24939P09368J220634K159397M122601P815436J0230538
18169B8967497M696588l172470o754803n410696j925063K273924O737173N926441
18161C1338591j126618o414128p270006n180653l118617j809920j089744p56761
18153D572144n71055l99696k61825j53552l1821R9054J56573J62254K30603M44752
$$ y = [2922880, 2629231, 2378206, 2153136, 1945784, 1792663, 1673506, 1572523, 1503332, 1440202, 1319618, 1187821, 1103583, 1079858, 1059624, 1015433, 930632, 860639, 811212, 805974, 826271, 860152, 890266, 876445, 826424, 751870, 704732, 679351, 666241, 709131, 737014, 735586, 727653, 751406, 799032, 873254, 902382, 895462, 917678, 997296, 1095009, 1226906, 1454340, 1722715, 1992884, 2284584, 2709523, 3418891, 4639525, 6798922, 10921523, 18736959, 28967497, 33664085, 30491615, 23736812, 18326116, 16401053, 18674977, 25412150, 31338591, 30211973, 23797845, 16527839, 11347186, 8228569, 6418649, 5328905, 4572144, 4001089, 3601393, 3339568, 3186016, 3154195, 3253249, 3409822, 3572076, 3802679, 4247431]
18143D247431P55542J281172K273894M320385Q345915J2436598P880950k223207
18135C9318680q057604p473889l437936J368687O692791P700057L95311o695957
18127B9810140q787476o767852m222465k506670j494568r76508o84575m63826
18119C906200l24145k71361k28785j21723j7354J01878K60321M29009O27283J022584
18109E383907J937864L786464P996574J4414156J0705294k516005j0655936j0944558
18101B0107760p109405m139529k406840j477956j010754p10962m71948l63896
18093B416470l15746k53584k15975j60035j35354j20805r1524q8776q8024q5920
18083H60727p2453m2181l5961j8520k8053m3419m6532n8253l3472k9178m0700
$$ y = [4247431, 5002973, 6284145, 8558039, 12878424, 21224339, 33660937, 41541887, 39318680, 31261076, 23787187, 20349251, 21717938, 28410729, 36110786, 36506097, 29810140, 21022664, 14254812, 10032347, 7525677, 6031109, 5054601, 4370026, 3906200, 3582055, 3310694, 3081909, 2960186, 2942832, 3044710, 3305031, 3734040, 4361323, 5383907, 7321771, 11108235, 19104809, 33518965, 44224259, 41708254, 31052318, 20107760, 12998355, 8858826, 6451986, 4974030, 3963276, 3252314, 2780366, 2416470, 2100724, 1847140, 1631165, 1471130, 1335776, 1214971, 1123447, 1034671, 946647, 860727, 788274, 746093, 710132, 691612, 663559, 620140, 573608, 515355, 481883, 452705, 412005]
18072D12005o835J5511K6241j4358k0390k9649l6332j3192J0251J0300j5016l6299
18060C02237m7351j8792l715k8617O058L3003O095j8235k3721j2445j1717J5473
18048A98273m334k941j203r603l21q279l498J3610J0622K8847K6190K5999m708
18035B68654l8118k9865m581K1309K8134p63m477l0618l8351k2485K1126N143
18023A75108O426K927j2673K406o46L7l300J3572K0728j4530j4659j1258K5910
18010A90048o965l0031j5867J4056j5691j843J37N735j8011r526j3968k8520j5312
17997E4242J1056M1639P106k0838k0530m2313m474L0684J4251J5179J2847p625
17985I1224o255L1498K1944J4255K3679p970j9777l6151q657M5490J7794m338
$$ y = [412005, 405170, 420681, 446922, 432564, 412174, 382525, 346193, 333001, 343252, 353552, 338536, 302237, 254886, 236094, 232379, 203762, 209820, 242823, 248918, 230683, 206962, 194517, 182800, 198273, 193939, 190998, 189795, 180192, 179871, 171592, 168094, 181704, 192326, 221173, 247363, 273362, 268654, 230536, 200671, 196090, 217399, 245533, 244770, 240293, 209675, 171324, 148839, 169965, 175108, 181534, 184461, 171788, 174194, 173548, 173585, 170285, 183857, 204585, 190055, 175396, 164138, 190048, 183083, 153052, 137185, 151241, 135550, 133707, 133844, 139579, 121568, 112042, 98074, 69554, 54242, 65298, 106937, 114043, 93205, 72675, 30362, 25888, 56572, 70823, 86002, 98849, 91224, 84969, 116467, 138411, 152666, 176345, 168375, 148598, 112447, 103790, 149280, 167074, 162736]
17973A62736m3249n7985l0033k1861k5699j7204J1032M5289K4805L737K3330L6187
17961A11085J646m3685m5627r978K4950L0747K7967J1723L229M02J418J9955j1254
17948A22578j6792J9253k721j5425n093q681j4996J0094k0905l8472j4297K1190
17936C5733J677k9505K167M4186M0431l808L682j4979N072j3548l6372o5491p6551
17923a07306m0496L3525L6129L5283M7012K7308j549N812Q695j5819n614j3431
17911I549j5520M828O938K5536K4641K7678R693J2871j8596J801K919j0536k1705
17898F0097p923j3570N533J0365J4836K6506K2854l48m914k696P652m68j078m434
17884A12412k3454J031K528R361Q366J2906R540j3204K2184K6199j1578o915J0903
$$ y = [162736, 119487, 61502, 31469, 9608, -16091, -33295, -22263, 23026, 47831, 51568, 74898, 111085, 112731, 69046, 23419, 13441, 38391, 69138, 97105, 108828, 112057, 112459, 113877, 133832, 122578, 105786, 125039, 122318, 106893, 101800, 93119, 78123, 88217, 67312, 28840, 14543, 35733, 37410, 7905, 10072, 54258, 94689, 90881, 94563, 79584, 84656, 71108, 34736, -30755, -107306, -147802, -114277, -78148, -42865, 4147, 31455, 29906, 35718, 44413, 28594, 22980, 9549, -5971, -1143, 5795, 31331, 55972, 83650, 93343, 106214, 87618, 89419, 92338, 81802, 60097, 52174, 38604, 44137, 54502, 69338, 95844, 118698, 118350, 113436, 110740, 118392, 117924, 116846, 112412, 88958, 89989, 92517, 101878, 110244, 123150, 132690, 119486, 141670, 167869, 156291, 149376, 160279]
17871A60279J8810N9504J12468Q7218R074l0602l4555l0518j1315K1472K6571
17860C88406L4891O0398N4483N4492N3076P7626P0946K5794N690k916K6670N7184
17848I06740R8675J86808L02832L70869M40591O09017R13551J567607K891638
17839H288328N659752J0592143J2047211K721246o517768r855485p741062m750339
17831A0444026k825042j739550j107814p38525m43874k32842j38167m0471R5396
17822C273137K14267L58463N60593R12277J655392L180170O252015J0707964R025304
17813C6139582m40840p220355q248239n481972k564857q8366K702302O849486
17805B1646741R750625L798054m422960q245629p129401m549953k701544j599446
$$ y = [160279, 179089, 238593, 351061, 438279, 447353, 416751, 382196, 351678, 340363, 361835, 388406, 423297, 483695, 538178, 592670, 645746, 723372, 794318, 820112, 825802, 822886, 849556, 906740, 1005415, 1192223, 1495055, 1865924, 2306515, 2915532, 3829083, 5396690, 8288328, 13948080, 24540223, 36587434, 39308680, 32790912, 22935427, 15194365, 10444026, 7618984, 5879434, 4771620, 4033095, 3589221, 3356379, 3218212, 3177741, 3273137, 3487404, 3845867, 4406460, 5318737, 6974129, 10154299, 16406314, 27114278, 36139582, 35698742, 28478387, 20230148, 14748176, 12183319, 12094953, 14797255, 21646741, 31397366, 35195420, 30772460, 22526831, 15397430, 10847477, 8145933, 6546487]
17797F546487r76587o22352l51201j43654p9148j13082j42139k7617K02036M66008
17787D758751Q15449J382251K410009M580185Q428824R032770J571977n092607
17779B7887609p007251m924075k283509k05226J542907L493997O690395J2901231
17771C8096078K4227027L5310441K6960683j201965k4229749k9706194k2948520
17764D6507801j4612765q953200n634788l729824k534089j755033j275818r19902
17756G092382o53192n62628n72125m93524m02754l54223l34159l37174l50491
17747C032112k89503k05600j19152j4547O8844n5736k40640k86161k62124k16628
17737A410865j49861r2104o9748o3859l4590j0325j6113l4311p8251o6405m3095
$$ y = [6546487, 5569900, 4947548, 4596347, 4452693, 4373545, 4260463, 4118324, 4090707, 4292743, 4758751, 5574200, 6956451, 9366460, 13946645, 22375469, 31408239, 32980216, 27887609, 20880358, 15956283, 13672774, 13467548, 15010455, 18504452, 25194847, 38096078, 62323105, 97633546, 124594229, 123392264, 99162515, 69456321, 46507801, 31895036, 22941836, 17307048, 13577224, 11043135, 9288102, 8012284, 7092382, 6439190, 5876562, 5304437, 4810913, 4408159, 4053936, 3719777, 3382603, 3032112, 2742609, 2537009, 2417857, 2403310, 2472154, 2416418, 2175778, 1889617, 1627493, 1410865, 1261004, 1168900, 1099152, 1035293, 1000703, 990378, 974265, 939954, 861703, 795298, 752203]
17726G52203l5677q894j4697j4694l5613n3714l8598k6926k5881n5475k3392j9664
17714C98978j0537n27k5178K5364N9572K2777j8783n0657l7850k7786l3634l308
17702B98431J5358J9609J5801p152o4881n6416p754J1069K3407J8976J0645l1653
17690B45440k7396J0460j8056j5435J0677m54K738P930J0455J892m2093k7754
17678A58404J131j2420j3582P695J5113J353k8200j8640j0568n28r249J064K924
17665I4497K5855J0381L745J3575J3738Q034N98pk9468k0825k2478N043K5645
17652A28333M152K2948K4302l615l2693j1717j7025P587N912j299j2900J000l4471
17639H0514k032L0957K3809J175l4130j3863q675M534o878J5452K9320K4677J1755
$$ y = [752203, 716526, 707632, 692935, 678241, 642628, 588914, 550316, 523390, 497509, 442034, 418642, 398978, 388441, 387914, 362736, 388100, 447672, 470449, 451666, 401009, 363159, 335373, 301739, 298431, 313789, 333398, 349199, 342047, 277166, 220750, 212996, 224065, 247472, 266448, 277093, 245440, 218044, 228504, 210448, 195013, 205690, 205236, 207974, 215904, 226359, 228251, 186158, 158404, 159535, 147115, 133533, 141228, 156341, 157694, 129494, 110854, 100286, 99758, 90509, 91573, 94497, 120352, 130733, 134478, 148053, 161791, 169825, 170423, 170416, 140948, 120123, 97645, 102688, 128333, 132485, 155433, 179735, 176120, 143427, 131710, 114685, 122272, 128184, 126885, 113985, 114985, 80514, 78482, 109439, 133248, 134423, 100293, 86430, 77755, 82289, 75411, 90863, 120183, 144860, 156615]
17626A56615M672j7596k4672j7485L959J2700M898O424J4043K2115K7254K6288
17614B19215L2315j8454p6567p4203n2296q015k06l389l2849L426J7559Q151M604
17601A9291J0712M41j1035L358n585j3793L484M531L586P100J9535L142J3869
17588E8636j027K748L332j7553M249K188J0106j847o661p273O749K4428L8076
17575A16151L7636N7816K3253k2335k2669l9277O16N3322M3034K8602j4794n9703
17563B01652l3370k0293m6845k7380n688p459r069K987J0559M793p305J8023k887
17550G7718n606J105O95P014R069L6139K3037K8053K7008J4938k0211m9927m9212
17537I9820j5860K2869N5357L1286k4482k4979j5669l5229k5412j5628m344K094
$$ y = [156615, 161287, 143691, 119019, 101534, 105493, 118193, 123091, 129515, 143558, 165673, 192927, 219215, 251530, 233076, 156509, 82306, 30010, 21995, 21789, 18400, -14449, -11023, 6536, 14687, 19291, 30003, 30444, 19409, 22767, 17182, 3389, 6873, 11404, 14990, 22090, 41625, 44767, 58636, 57609, 60357, 63689, 46136, 50385, 52573, 62679, 60832, 54171, 46898, 53647, 78075, 116151, 153787, 211603, 234856, 212521, 189852, 150575, 151191, 204513, 247547, 276149, 261355, 201652, 168282, 147989, 101144, 73764, 68076, 60617, 51548, 54535, 65094, 69887, 62582, 80605, 77718, 72112, 73217, 73912, 80926, 89995, 126134, 149171, 177224, 204232, 219170, 198959, 149032, 99820, 83960, 106829, 162186, 193472, 168990, 144011, 128342, 93113, 67701, 52073, 47729, 49823]
17525D9823o406M092j0907J9660J282j2741o004M416Q364j348r425M962O778j3083
17511C9463l554j0406q26J2520J080r59j5798j8507j0358J1341K331o488J5866
17498A5705j0843l455Q654N696K5241J6397j1926l6903l22Q867P57j908o354l0241
17484b0635J4187L2584k7211J1293J1143j7371P622J0764o840J9602J0203j70
17472D5171j3493r332r450p370j972m356N601K7611k550j2001j3087m99k114O709
17458H868J6987K421m626j4544Q142R776o749q029Q406J5646P65j4522J0633p315
17444B5859m551K1273J7194L0339N9080P0522K027m4263o3309m2399k8803p611
17432C5358p687j5231L138K4533K0939j0204k1548q463k763L180j4731j0763J6152
$$ y = [49823, 43417, 47509, 36602, 56262, 57544, 44803, 38799, 43215, 51579, 50231, 40806, 45768, 52546, 39463, 35909, 25503, 24677, 37197, 38277, 37318, 21520, 3013, -7345, 3996, 6327, -161, 15705, 4862, 1407, 10061, 15757, 40998, 57395, 45469, 8566, 8244, 17111, 17868, 15960, 9606, -20635, -6448, 26136, -1075, 10218, 21361, 3990, 11612, 22376, 15536, 35138, 45341, 45171, 31678, 22346, 12896, 5526, 3554, -802, 4799, 32410, 29860, 17859, 4772, 4273, 2159, 8868, 25855, 28276, 23650, 9106, 17248, 27024, 20275, 12246, 20652, 36298, 37063, 22541, 33174, 25859, 21308, 42581, 59775, 90114, 149194, 219716, 221743, 177480, 114171, 71772, 42969, 35358, 27671, 12440, 15578, 40111, 61050, 50846, 29298, 20835, 18072, 21252, 6521, -4242, 11910]
17419A1910l53K102q648j5025J2811R436j5091m411J2758m019l558K704L33k26
17405G23o034M318K188j50K0207L353j8303p195m399k7303J1919J4842k928m90
17391i252J642P21j250N373l53J5518J8516j8344k9735k0613j027J1765K7125
17378H6M953K4575Q837m069N567O896j6245k9426o422j080J5435J7247O909k2457
17364A0806m935R298K0943L402j7744M261j2171o573p21n891j0577l328O414R096
17350B280k931L11j3901K2198J6706m600j8769r191j3433n516J6284K08J877J428
17336g049m681K2792o45o592J4837O365o530k7803k9461K6428M5487p281j9717
17323F150M692J9482o977q773p922N982K1359j2262m941o801N680J735J6350J002
$$ y = [11910, 11557, 13659, 5011, -10014, 2797, 12233, -2858, -7269, 5489, 1470, -2088, 616, 949, 723, -5311, -993, 1195, 1045, 21252, 24605, 6302, -893, -5292, -32595, -20676, -5834, -8762, -9252, -7610, -6889, -8139, -2766, -3119, 12399, 30915, 12571, -17164, -37777, -38804, -27039, 86, 5039, 29614, 38451, 34382, 39949, 46845, 30600, 1174, -5248, -6328, 9107, 26354, 33263, 10806, 5871, 15169, 36112, 39514, 21770, 26031, 13860, 7287, 6566, 675, -9902, -13230, -6816, 2280, -651, -340, -14241, 7957, 24663, 20063, 1294, -7897, -21330, -26846, -10562, -10354, -8477, -7049, -11730, 11062, 10417, 3825, 18662, 25027, 18497, -9306, -38767, -12339, 33148, 25867, 6150, 10842, 30324, 23347, 14574, 6652, 12634, 33993, 21731, 16790, 9989, 15669, 17404, 33754, 34756]
17309C4756k6350O442J2836o107M565K8926M6383N9783K9161k4897l8549j2321
17297A14628k2345l8363j7363j9474j6849J2629N435J902m740J4570J4697J076
17285D5803j3488K109N471L586K4232M6864L9363L1678j5892l3085l7031j7460
17273H2150j0034J5008M6068N3714L4389l3170l9446m5053l1008R37M022k0905
17261E6672l3933O001J0342J8317k452k497P657p367N729J7337N856J0861J8229
17248A10752L7883M5814K4032j3372l4193m5015n2660k0945k0106Q624r933l848
17236B7033J7316j3750m344m351N159K304k5008m37J5039Q681J9263l230q430
17223C5245J495r558j3129l997N550J0191j4663j1951K995J5593J1617J3001J4921
$$ y = [34756, 8406, 14848, 27684, 21577, 26142, 55068, 101451, 161234, 190395, 165498, 126949, 114628, 92283, 53920, 36557, 17083, 234, 12863, 18298, 20200, 15460, 30030, 44727, 45803, 32315, 34424, 39895, 43481, 67713, 114577, 153940, 185618, 169726, 136641, 99610, 82150, 72116, 87124, 133192, 186906, 221295, 188125, 148679, 103626, 72618, 73555, 77577, 56672, 22739, 28740, 39082, 57399, 54947, 52450, 60107, 52740, 58469, 75806, 81662, 92523, 110752, 148635, 194449, 218481, 205109, 170916, 125901, 73241, 52296, 32190, 40814, 30881, 27033, 44349, 30599, 26255, 21904, 27063, 29367, 4359, 3922, 18961, 27642, 46905, 43675, 35245, 36740, 27182, 14053, 10056, 15606, 25797, 11134, -817, 2178, 17771, 29388, 42389, 57310]
17210E7310L5711O047L5970P0195J21093J64863J34242j9497j26534j31955r0473
17199B56972o1468p4854l7521k8053j708k85k565j2040J204Q369k2742L949J1162
17186D0420j160l128Q273l789m125j1575p66N231j597k708R774j4427k3197o015
17172h789k7n092L975J9616L106j4888l273R241k314l293k400j0037j3780P735
17158b0220J1709L7955J8222k845k3588l2318n796L690k331j1893J3350J0012
17146d053K6094N920p235R75j4650M667k476Q625j2293o151r386P068K0605n743
17132A1967J073k6563m971K4249J2622j6503L064r749J1645J0240J6643j0353
17120B3364r002l845J6935l250q26J5660j5238J4150Q870q985j5785r397j6803
$$ y = [57310, 93021, 99068, 135038, 205233, 326326, 491189, 625431, 605934, 479400, 347445, 256972, 195504, 120650, 83129, 55076, 53368, 53083, 50518, 38478, 39682, 48051, 25309, 29258, 40420, 39260, 36132, 44405, 40616, 36491, 24916, 24150, 29381, 27784, 25076, 34850, 20423, -2774, -8789, -8816, -13908, -9933, 9683, 12789, -2099, -5372, 3869, 1555, -1738, -4138, -14175, -27955, -20220, -8511, 29444, 47666, 44821, 21233, -11085, -16881, -13191, -15522, -27415, -14065, -4053, 22041, 27961, 20726, 21701, 7051, 11718, 9242, 17867, 5574, -577, -9963, -2895, 17710, 11967, 13040, -13523, -18494, 5755, 18377, 1874, 4938, -4811, 6834, 17074, 33717, 23364, 14362, 10517, 27452, 24202, 23376, 39036, 23798, 37948, 46818, 37833, 22048, 12651, -4152]
17107d152l646J6669P796l0955o245K3118j8127P652J8460O698o568J17r746j2824
17093a1753J432J1577N715N216m565p930j2449P440P298j2821m626p587j6950
17080d0003j117M200J3772K1523j2845m023K4674o572j4660l667J4292j6182N016
17067a5592J5163r763Q604J0904n202j0977p413K944L802P589K3290j5752k3541
17054a5944j0845K8870J3304L687k3448l4593m944K7939J5553P263R759O27j6378
17041H50j9511K544J399j1550P479L813J585M832Q099k273M923J2999J8589J9368
17027E3146k8594j7824q9J5590L839l4761r628L0081j5017p657J5341K0666O888
17014C1981j2601k7285j5649q193K492K0015P648l690j644J4720j78n573O780
$$ y = [-4152, -7798, 8871, 16667, -14288, -20533, 2585, -15542, -7890, 10570, 17268, 10700, 10817, 1071, -11753, -10321, 1256, 6971, 12187, 7622, -308, -12757, -5317, 1981, -10840, -15466, -23053, -40003, -41120, -36920, -23148, -1625, -14470, -18493, 6181, -391, -15051, -18718, -4426, -20608, -15592, -429, -10192, -1588, 9316, 4114, -6863, -14276, -11332, -7530, 59, 23349, 7597, -15944, -26789, 2081, 15385, 19072, -4376, -38969, -43913, -15974, -421, 6842, 16601, 17228, 850, -18661, -16117, -14718, -26268, -18789, -14976, -13391, -8559, -460, -2733, 2190, 15189, 33778, 53146, 24552, 6728, 6639, 22229, 26068, -8693, -18321, 11760, -3257, -10914, 4427, 25093, 31981, 19380, -7905, -23554, -31747, -29255, -9240, -1592, -5282, -6926, 7794, 7616, 2043, 8823]
17001H823j2372j4981R106o329j9253j199J2065Q276j345j1421Q793J5868K0386
16988A6417j6221j5861r676K581R305J0858p99N266R542M29P50n593J0186k577
16974A4607k4950Q148m775o1r748m389L244J8730K3357P978j3812l0018K109l004
16960a2584N029k712P05J1998L2535k2851l1085J1447J0491O162j7116j9466j3950
16947d1397J9311K3382K140j2878Q412N112M839K544R370j4635j0803M954j499
16934a148q521L276L0463J0581k4470j8183k0122O604j1875R814L696J9819L5367
16921C5301J6448k985L1258L9094O0920P1759O2611L9269k869m8621n4740n3040
16909A94405o4539k8674r535k644j6259l2349j7627j0505M578P875O495O321j2785
$$ y = [8823, -3549, -18530, -9424, -15753, -35006, -36205, -24140, -15864, -17209, -28630, -19837, -3969, 16417, 196, -15665, -25341, -22760, -13455, -2597, -3396, 1870, 11412, 11841, 12591, 6998, 17184, 14607, -10343, -2195, -6970, -7031, -16779, -21168, -17924, 806, 24163, 32141, 18329, -11689, -9580, -12584, -7555, -10267, -9562, 2436, 34971, 12120, -18965, -7518, 2973, 9135, -7981, -27447, -41397, -22086, 1296, 3436, -9442, -1030, 4082, 8921, 11465, 20835, 6200, -4603, 351, -1148, -9669, -6393, 24070, 34651, 10181, -8002, -28124, -21520, -33395, -23581, -19885, -66, 35301, 51749, 48764, 80022, 119116, 180036, 251795, 314406, 353675, 350806, 302185, 247445, 194405, 129866, 101192, 91657, 89013, 72754, 40405, 22778, 12273, 16851, 24726, 31221, 37542, 24757]
16896B4757k0287q558L1311o440l9098L478R574J7986K0478k3262k4039N131J3178
16883D209J0693K3977l209l2327p504O700J9880J1945m595j128J175j9635R23
16870A1104L276J392Q516O853l865n412p439j019J8983K585k6367J491K0357j3670
16856A6785J723M078Q741j0883o508Q773Q104P809M857P441q672q147j3667k739
16842A7695j3816N875J8745R14j6494j4936K991J7477L7k0768n713J2246q299
16829d046j4583K6269J1630l560j067R085J735j2792m982m933R354L894m487j2697
16815a180L477J642l241M070j3605M092k392k5669N855K1570J8248J0870q8M753
16801B8402l41j2142m430J169l862L061M821J965O979n747o477q169K2706q763
$$ y = [24757, 4470, -4088, 27223, 20783, -18315, -14837, -5263, 12723, 33201, 9939, -14100, -8969, 4209, 14902, 38879, 35670, 3343, -4161, 2539, 22419, 34364, 29769, 28641, 29816, 10181, 11104, 14380, 15772, 24288, 31141, 27276, 21864, 14425, 13406, 32389, 34974, 8607, 10098, 30455, 16785, 18508, 22586, 31327, 20444, 13936, 22709, 30813, 38622, 43479, 50920, 42248, 34101, 20434, 17695, 3879, 9754, 28499, 29413, 12919, -2017, 974, 18451, 18488, -2280, -7993, 4253, -4046, -18629, 7640, 19270, 15710, 14643, 23728, 25463, 12671, 7689, 2756, 12110, 16004, 11517, -1180, 2297, 3939, 698, 4768, -8837, -4745, -7137, -32806, -26951, -5381, 12867, 23737, 23649, 28402, 28061, 15919, 11489, 12658, 8796, 11857, 16678, 18643, 25622, 19875, 13398, 5229, 27935, 19172]
16787A9172j4523L579L491M313j4137j3814j702P716J4052j8185r553J0139l030
16774a2482j353k1146k5191J8098M3095l259M121N15J4537k8634j0521J3293j709
16761a0636P741r289q072J9654J1471j2655j0817l003L311P550K2018K6073r891
16748C3455q725j277r539j4675l53J3414Q228R193J5740P674n532l5137k8605
16735a6139j1796p925P764J0308J2071L815K4679O172O256j0442j1748j2648r246
16722h879j147O992J3162K716p84l521K845O322J6523O58q021k1527Q66J1215
16708A7420R381j6189j8092k780J7334K7101j2849p976n456l7876j4006J7771
16696b6217r599m1k331k397K0550Q615J2298K1636J8139j4632K266l271j5289
$$ y = [19172, 4649, 8228, 11719, 16032, 1895, -11919, -13621, -5905, 8147, -10038, -19591, -9452, -12482, -13835, -34981, -60172, -42074, 1021, -2238, 1883, 2398, 16935, -11699, -22220, -8927, -10636, -2895, -12184, -20256, -602, 10869, -1786, -12603, -15606, -12295, -4745, 17273, 43346, 33455, 24730, 23453, 13914, -761, -1114, 12300, 20528, 29721, 45461, 53135, 47603, 12466, -16139, -27935, -35860, -28096, -17788, -5717, -1902, 22777, 28949, 35205, 24763, 13015, 367, -8879, -10026, -3034, 10128, 12844, 12060, 8539, 11384, 17706, 34229, 34887, 26866, 5339, 6205, 17420, 26801, 10612, -7480, -10260, 7074, 34175, 21326, 13350, 7894, -29982, -43988, -26217, -35816, -35857, -38188, -40585, -20035, -11420, 878, 22514, 40653, 26021, 28287, 25016, 9727]
16683I727j4251r314j7148K0469J1949l135k643M943O813j005j4120P475j0859
16670a1099q980L1731L1912K5946Q101j8332l0133q447r442j6236j5035j3271
16658c3285N348J3784K618J1958K3272O310J3746k4125j1762p775j7399r876k573
16645b9759N892J2660J0786J6694K381P939p865j4543M438j0055j0826J6786J72
16632D700R737j4740q673K6860K3930J1802p476k4076k7834j6172j1690j0252
16620d3884o486J9426L788J7980R517M576q650j1512O14j0366J2665O754j647
16607g225M380M192K870J1619P63j9257j4408N922j0382J3149K260j6154K2730
16594D59M214j6026L910N192J7646k273p080j998p85j3772k746J6815K1314n624
$$ y = [9727, -4524, -13838, -30986, -10517, 1432, -1703, -4346, 597, 7410, 6405, -7715, -240, -11099, -20079, 11652, 43564, 69510, 77611, 59279, 29146, 20699, 11257, -4979, -20014, -33285, -27937, -14153, -11535, 423, 23695, 30005, 43751, 19626, 7864, 89, -17310, -27186, -29759, -23867, -11207, -421, 16273, 18654, 26593, 18728, 4185, 8623, -1432, -12258, 4528, 4700, 14437, -303, -8976, 17884, 41814, 53616, 46140, 22064, -5770, -21942, -33632, -43884, -50370, -30944, -27156, -9176, 341, 4917, -3733, -15245, -14631, -24997, -12332, -5578, -7225, -2845, 1347, 4217, 15836, 16599, -2658, -17066, -11144, -21526, -8377, -6117, -22271, 459, 4673, -11353, -7443, -2251, 15395, 13122, 6042, 4044, 3259, -10513, -13259, 3556, 24870, 19246]
16580A9246K3756l157l9346j3374J8886K5444p558j2195j6066K8410M824j6684
16568A2186j0667k0122k945R975L3122L75p406j8045q657J9436J9807k5631r808
16555h380J6317J1265k4843j6075N518j2556o91Q666Q364J6767o126j8102p650
16542b7526K135O068J1467J9309N320j4280k0139J2040J7306j474k4342n283n551
16529b4950J0882J0283j2066m385Q513J6023K1660q905L559O30l897j8888J355
16516a86P38J666m049J9092n589l12J842J4192J2458m40p16K257k7519l3269n76
16501b0411J663O993J3948J3719n892l294q510k123J911K807J0132M739q646m786
16487B250J2176J0252Q961r122k1940j5412P910J8556K4419Q113p836J002q884
$$ y = [19246, 43002, 39845, 499, -12875, 6011, 31455, 23897, 11702, -4364, 24046, 28870, 12186, 1519, -18603, -21548, -11573, 21549, 21924, 14518, -3527, -12184, 7252, 27059, 1428, -8380, 7937, 19202, -5641, -21716, -16198, -28754, -29445, -20779, -12415, 4352, -1774, -19876, -27526, -25391, -19323, -7856, 11453, 16773, 2493, -17646, -5606, 11700, 10226, -14116, -19399, -24950, -14068, -3785, -15851, -20236, -11723, 4300, 25960, 17055, 20614, 21244, 17347, -1541, -186, 552, 2218, -1831, 17261, 11672, 11360, 13202, 27394, 39852, 39412, 38696, 40953, 13434, -19835, -20411, -18748, -11755, 2193, 15912, 10020, 6726, -1784, -3907, -1996, 811, 10943, 15682, 7036, 2250, 14426, 24678, 33639, 24517, 2577, -12835, -4925, 13631, 38050, 46163, 38327, 39329, 30445]
16474C0445k6837j7117k177n427Q987j4206j5633R099K9905m801j3467N804J3221
16461b204L281J9607K0123j1422p920o744L135K3067J127k4132j5331m551p223
16448i187K227R802p725J4856P287n220l712J0381l534j2932j3863j0903P957
16435a4566K0547k815j1370J1971O16J3780N43j543K654j640k0434j840k156O740
16421D87L016J7964n858Q870N128j1947j5843k1609j8729K9226M3468L231j3185
16408B4219r583M042J7928J1031N315j9211k0742j3409R647J74j858r847j948
16395d242J5936K3915P386m734q879j3073k0716k5964j5221j2060J895K1267j379
16382c5869M801K300L522J9477K8043k661j9340q29Q339Q391j521j65p03k6630
$$ y = [30445, 3608, -13509, -15686, -21113, -12126, -26332, -41965, -32866, -2961, -7762, -21229, -15425, -2204, 1077, 20684, 40807, 29385, 21465, 14721, 17856, 40923, 42050, 17918, 2587, -1964, -9187, -6960, 2842, -4883, 9973, 17260, 12040, 8328, 18709, 15175, 2243, -11620, -22523, -14566, 5981, 3166, -8204, 3767, 4383, 18163, 18706, 17163, 19817, 18177, -2257, -4097, -6253, 487, 3503, 21467, 15609, 24479, 29607, 17660, 1817, -19792, -38521, -9295, 34173, 37404, 24219, 14636, 18678, 36606, 47637, 52952, 33741, 12999, -410, 9237, 9411, 7553, -2294, -4242, 11694, 35609, 42995, 38261, 29382, 16309, -4407, -30371, -45592, -57652, -55757, -34490, -35869, -31068, -28768, -25246, -5769, 22274, 19613, 273, -556, 7783, 16174, 14653, 14488, 13785, -12845]
16368a2845p114o790q217M604J8447J3455R114j3952j0641J5101N017k761m439
16355a021O833j4796q312P621m938J3191m208m73J709k0879L92J6843K0628L347
16341A5937m752N347k352m802j0416l316J3643j604P3L3441J3879k1667j8633
16328A4778l2914J6499K9698j0925k0954q693j9169O171J1678N920L276J2215
16316G580J802Q949k353M835N074N272m334k775p303k3099j2282R060J4292q072
16302c354o947J9399q459N41J6759K331p747r099l23P993o454J7697K0301R095
16288E1733j0347k0712j8463j2454l173J9780O667k8626L638J5472K157O759J817
16275A4248j4245l1200k992K6530J0339n462r171J0439N203M26J6290r235j1811
$$ y = [-12845, -19959, -26749, -34966, -30362, -11915, 1540, 10654, -3298, -13939, 1162, 6179, 3418, -1021, 5812, -8984, -17296, -9675, -14613, -1422, -5630, -6103, -4394, -25273, -24881, -8038, 12590, 15937, 11185, 16532, 14180, 9378, -1038, -4354, 9289, 7685, 7758, 41199, 55078, 33411, 14778, -18136, -1637, 28061, 17136, -3818, -12511, -31680, -25509, -13831, -7911, -4635, 7580, 9382, 18331, 15978, 20813, 25887, 31159, 26825, 24050, 16747, -6352, -18634, -9574, 4718, -3354, -10301, 9098, 639, 1180, 17939, 20270, 12523, 3424, 3101, 11094, 4640, 22337, 42638, 51733, 41386, 20674, 2211, -10243, -13416, 6364, 13031, -15595, -11957, 3515, 5672, 12431, 14248, 3, -31197, -34189, -7659, 2680, -2782, -11953, -1514, 3689, 4115, 20405, 11170, -641]
16262f41L974j29l18o516n290J552J9525M86N943n035k0579j3530M673J7870L021
16247E006j5577O642M856j52j6044j2466L539J5067n253J0036J3349j1336J4199
16234A1866j2523j7813J44Q247L33k1711n890J7263P63J185j680r915j310L186
16220b7855J3779J0899K43J5009N124n006l726P86L3586M9k4790j2201L674k0156
16206a0585r642J6341j257j3084O555j012J3392r954j0349N276l352Q96l935j1293
16192c2003L512J1607J5195N687Q235o158j6512J770J9391K2329n659j4693J865
16179A4566L827J744j8681j6585k777J8552J5908q653j9249Q2j0599k1307j098
16166d4270K7250R098m46r018J1846R934Q458O292l619Q16j6989q518l596N004
$$ y = [-641, 3333, 3204, 2886, -3630, -8920, -7368, 12157, 12643, 18586, 13551, -7028, -20558, -15885, 1985, 5006, -10571, -3929, 927, 775, -15269, -27735, -24196, -9129, -14382, -4346, 9003, -2333, 11866, -657, -18470, -18326, -10079, -9746, -31457, -37347, -20084, -19321, -18136, -19816, -29731, -31041, -27855, -14076, -3177, -2934, 12075, 17199, 12193, 8467, 9253, 42839, 42888, 18098, 5897, 9571, -10585, -20227, -3886, -5143, -18227, -11672, -12684, 708, -9246, -19595, -14319, -17671, -16775, -20710, -32003, -28491, -16884, -1689, 3998, 12233, 6075, -10437, -8667, 10724, 33053, 27394, 12701, 14566, 18393, 20137, 1456, -15129, -17906, 646, 16554, 7901, -11348, -11266, -21865, -43172, -44270, -17020, -7922, -8368, -17386, -5540, 4394, 12852, 19144, 15525, 16341, -648, -9166, -12762, -7758]
16152g758J5685N728m963j248j5942P708L7020J845j5367j5574j5415J8734P788
16139A8241k8502j6396K7579O277k1346L399Q925Q516L452r324n531J6032p237
16126D085o346j8575L989k786j960J4127K2518Q998M914q037j7139R64N248k1743
16112a1743L338r909j4191Q764J9078O404M109j0626K0147L002l756L30J6328
16099C1275J809o976k2062q009O892J8027O015r958n176R204n917n206K1247J454
16085C2619m759J876j1494l6102K8969J7632q342k9323k001j253l74Q265k609
16072f896o179J7969m742k5675l767J5016R982O808J6614J1502j7313K4K979K53
16058A6575P176p945k4757l891l02K098k735J8185K0575o798q244l2372M215q625
$$ y = [-7758, 7927, 13655, 8692, 7444, -8498, -790, 36230, 38075, 22708, 7134, -8281, 10453, 18241, -10261, -26657, 922, 7199, -14147, -10748, -1823, 6693, 10145, 821, -4710, 11322, 4085, -2261, -20836, -16847, -19633, -21593, -7466, 15052, 24050, 28964, 20927, 3788, 4752, 10000, -11743, -8405, -18314, -32505, -23741, -4663, 1741, 5850, -4776, 15371, 18373, 14617, 14947, 31275, 33084, 26108, 4046, -3963, 2929, 20956, 26971, 17013, 11837, 21041, 15124, 9918, 31165, 32619, 27860, 29736, 18242, -17860, 11109, 28741, 20399, -8924, -10925, -12178, -12552, -4287, -6896, -13075, 4894, 152, -25523, -29290, -14274, -4292, 2516, 19130, 30632, 13319, 13343, 16322, 16575, 23751, 15806, -8951, -12842, -13144, -11046, -13781, 4404, 24979, 18181, 9937, -22435, -18220, -26845]
16044b6845k7087K885L3100K8545J599j5331n339K9041r10M35n528O870l472J1008
16030B8971j441k3083j7808J0357K0503j1137r907L836K733q835j4401R261K3706
16017A2755K553k906j839J0868j8199k3018q956N909J1536N214J2461P048k222
16004A1204M83K398L283r018j2522p152J8101O108j2826p838j2884j011Q038K67
15990a3369J1200L0080M703k5487j0555J8587k0841j0519k958J474P265K8739
15978A8319o839r836O895J0906j4652r185L836J0339q791K547P079J0050r822
15965A0846j6484n400J78Q978j0973J9561O446J552k3404J796l642P367J0450
15952G271j3604N484j8001P143J9549J2613j6531k555L799J4300o600O968k7039
$$ y = [-26845, -53932, -51047, -17947, 10598, 12197, -3134, -8473, 20568, 19658, 20093, 14565, 21435, 17963, 28971, 27530, 4447, -13361, -3004, 17499, 6362, -3545, 291, 3024, -5811, -20212, -10951, 12755, 15308, 12402, 10563, 21431, 3232, -19786, -28742, -22833, -11297, -6083, 6378, 13426, 11204, 11687, 14085, 17368, 8350, -4172, -11324, 6777, 12885, 59, -7779, -20663, -21674, -13636, -13369, -2169, 27911, 32614, 7127, -3428, 15159, -5682, -16201, -19159, -17685, -10420, 18319, 11480, 1644, 8539, 19445, 4793, -4392, -556, 9783, 992, 3539, 10618, 20668, 10846, -5638, -11038, -10860, -1882, -12855, 6706, 13152, 14704, -8700, -6904, -10546, -3179, 7271, -6333, -849, -18850, -11707, 7842, 20455, 3924, 1369, 5168, 19468, 12868, 19836, -7203]
15939g203j8445N805L648J3907j5617l012k840Q070J7203K6860Q428j1847k0656
15926D301K483J2957M810l570r195k02N949o207n65j2240m471k4798n101J7257
15912a8592J9618P747J0124Q045J2681j6702k4019q070j4756Q511O354J6648M098
15899A1687k0432j5136O813N264J4461q61j1324K3487K8511j0948k6308k981L6209
15886C8442O125k2723k0667q051p423j1534j4853O701M536j527O455L392J3324
15873g803k273J262j3406J349l284R116M829J4003k9369l6350k794K2858J4005
15860b7857K8617O529j7935j142j9971m659M5621K1286J0030j2687j6368j4511
15848c047L563m984q27J60P038J322K233j2201j9735n507k549N905K8162M313
$$ y = [-7203, -25648, -19843, -16195, -2288, -17905, -20917, -23757, -15687, 1516, 28376, 36804, 24957, 4301, 6784, 19741, 24551, 20981, 11786, 11584, 17533, 11326, 10761, -1479, -5950, -30748, -35849, -18592, 1026, 8773, 18897, 26942, 39623, 22921, -1098, -9168, -23924, -15413, -9059, 7589, 11687, -8745, -23881, -17068, -11804, 2657, 1796, -9528, 13959, 42470, 31522, 5214, 2233, 38442, 44567, 21844, 1177, -6874, -14297, -25831, -40684, -33983, -29447, -30974, -24519, -21127, -7803, -10076, -8814, -22220, -20871, -24155, -15039, -10210, 3793, -25576, -61926, -64720, -41862, -27857, 760, 7289, -10646, -11788, -31759, -36418, 9203, 30489, 40519, 27832, 11464, -3047, 516, -4468, -5295, -5135, 1903, 3225, 5458, -6743, -26478, -31985, -34534, -28629, -467, 3846]
15834C846J8440J0052l6765k9796O433J1134Q89n659M277k30j9505J771Q353J6572
15820a0188M375P100j4529p433l01j6344J8632Q769J3316J1925q76k5589j3992
15807b5135m529P708J5938J9499r812L043J0067M41r39l1497L49K5683J3241J466
15793B5523n496m536p712J6715K0368k4152l1920O09j2505p074N063Q841P884
15780h392k8155K0791J6994j0564k4566l943R682K4919l395M84P001l280k436
15767d860K960p343L020k4229j5721k623P593L3244K6434Q405l3151k7979l252
15754c7502K5774J227j8186j723J3897j826j2589m008K4485Q397j3815k5815j2905
15741e4589J7923K8385J1247O887Q391o323k4576j7404J1729p980L40J8367m217
$$ y = [3846, 22286, 32338, -4427, -34223, -27790, -16656, -15767, -21426, -17149, -17379, -36884, -35113, -26760, -10188, -5813, 1287, -13242, -20675, -20976, -37320, -18688, -9919, 3397, 15322, 14446, -11143, -25135, -29664, -21956, -6018, 13481, 3669, 6712, 16779, 17220, 16281, -15216, -14867, 10816, 24057, 25523, 20027, 15491, 7779, 24494, 44862, 20710, -11210, -10601, -23106, -30180, -25117, -16276, -8392, -36547, -15756, 1238, -9326, -33892, -37835, -28153, -3234, -6629, -6145, 856, -2424, -4860, -1900, -9243, -6223, -30452, -46173, -48796, -41203, -7959, 18475, 26880, -6271, -34250, -37502, -11728, -10501, -28687, -30410, -16513, -18339, -30928, -34936, -10451, -2054, -15869, -41684, -54589, -36666, -8281, 2966, 9853, 18244, 11921, -12655, -30059, -18330, -26310, -25970, -7603, -11820]
15728a1820J2271K241j9789j5864J4120J4301N271o406k924K4802r61K382r03
15715A6721q5j3666j9927r609K5064J8463Q611r735j7363k652J6770m960J068
15702H700n510J183Q063P76j0306Q100J0758j7439j4313r080l812q629L5980K1081
15688B5552m083O92J0395j5999M663J0042k6325n166k1675J816K6378Q580j5442
15675e72j6760k282J2002m013J1339N908J5216L1006M527k9119q783q056Q935
15662A9348m295o140q633j2692n184N59j0170L0495r227n609K2973r538l139M888
15648C636p187j573q219l514K098l240J1200J6926J4566j5414P755J5605q558
15635B4081k5895j2714J0911J0094K3043K661l395k219P126q812j4682P158P083
$$ y = [-11820, 451, 2692, -17097, -32961, -18841, -4540, 731, -5675, -8599, 16203, 15242, 17624, 16721, 16636, 2970, -16957, -26566, -1502, 16961, 25572, 15837, -1526, -4178, 12592, 7632, 8700, 3190, 4373, 12436, 13212, 2906, 11006, 21764, 4325, -9988, -19068, -22880, -31509, 4471, 25552, 21469, 22161, 32556, 16557, 21220, 31262, 4937, -229, -21904, -20088, 6290, 14870, -572, -17332, -19614, -7612, -11625, -286, 5622, 20838, 51844, 56371, 27252, 18469, 10413, 19348, 15053, 8913, 280, -12412, -17596, -17037, -27207, 3288, -5939, -11548, 11425, 1887, -1252, 3636, -3551, -5124, -13343, -16857, -14759, -17999, -6799, 10127, 24693, 9279, 17034, 32639, 24081, -1814, -14528, -3617, 6477, 29520, 32181, 28786, 26567, 33693, 24881, 10199, 17357, 24440]
15622B4440R845k4945k5792J162p26L1359K434k5482j5395o24Q563M0039J7821
15609D2699k4634k1908P66j2931j0313J1768Q8N827M143J4869L936l24j383k3614
15595a1011l170K487K0143M393P694o159N141J3298j8284k5041p772K0572k679
15582c88m475k042J6365Q328k0469p848k238l879l7578p675J8294J8232K1172
15569d201J0133K3297j2406l2929j7427k906m98P377O39K1890J0194o971m337
15556h145J0126O913J9230j0842q464N36P70J7066m038Q536l2193n199J610M24
15542c670p203O939Q965j4939j3374O512k20N966P356J7199K552r755J3949j0563
15528I714O607j204j3670P165J0448l173n510N325m567m349r696r312N12k8004
$$ y = [24440, 34285, 9340, -16452, -15290, -16016, 15343, 17777, -7705, -23100, -23724, -15161, 24878, 42699, 18065, -3843, -3077, -16008, -26321, -14553, -14465, -8638, -4495, 10374, 14310, 13986, 12603, -11011, -14181, -11694, 8449, 12842, 20536, 14377, 19518, 32816, 14532, -10509, -18281, 2291, -388, -4863, -6905, 9460, 17788, -2681, -10529, -12767, -16646, -54224, -61899, -43605, -25373, -4201, 5932, 29229, 16823, -16106, -33533, -36439, -36937, -29560, -28921, -7031, 3163, -3808, -8145, 1981, 8894, 28124, 17282, 8818, 9354, 10124, 27190, 23152, 31688, -505, -5704, -4094, -3670, -10873, -3934, 5031, -9908, -23282, -16770, -16990, -11024, -3668, 13531, 16083, 6328, 20277, 9714, 16321, 15117, 1447, 8612, 19060, 15887, 10377, 15702, 11135, 6786, -2910, -12222, -11710, -39714]
15514c9714j0173K5564J1580J6378L0207j092j3831J302M304N88m979k074j0984
15501G076l277k1730r480J1408K2420J5112m541p548j6145l440K015j1392J3675
15488e847Q457j5635K892N483Q470K1828M605k1339l3005j0157N049K2945O774
15475E20r378k838J2351p4p921m303N459J9732l242Q601R887r95k5264j4083J3911
15460B363K062m053K0880K8672J1421k2594j3606k718l2794k0820J772Q213J2513
15447h689J7137M693j120J1321m594k673m687q616j2608j4115P568m297n418J6710
15433i388J8389k47P250j3341m891j235J0460K2862j2628l433Q977k432k1355
15420a012j6196J2109J0030K8750o241k885j2086k0233O038J2767k7040O903K54
$$ y = [-39714, -49887, -24323, -12743, 3635, 33842, 32750, 18919, 20221, 24525, 25113, 20134, 18060, 7076, 3799, -17931, -27411, -16003, 6417, 21529, 16988, 9440, -6705, -10145, -8130, -19522, -5847, 2610, -13025, -10133, -4650, 3820, 25648, 30253, 8914, -24091, -34248, -29199, -6254, 520, -8858, -11696, 655, 581, -7340, -11643, -6184, 13548, 10306, 18907, 28794, 27799, 2535, -11548, 2363, 4425, 372, 21252, 49924, 61345, 38751, 25145, 22427, -10367, -31187, -29415, -21202, -8689, 8448, 13141, 12021, 23342, 18748, 16075, 11388, 2772, -9836, -23951, -16383, -20680, -26098, -9388, 9001, 8754, 16004, 2663, -2228, -3463, 6997, 29859, 17231, 13798, 22775, 20343, -1012, -17208, -5099, 4931, 33681, 27440, 24555, 12469, -7764, -1726, 11041, -15999, -9096, -8842]
15407h842j942N642l338k4750j4170N742J920K052J7381K1870k0556k1900M175
15394c6716M857J1231K3231r014j8584Q939j351o506K8753M211m325q496j1704
15381a5474J0287K58J30J06n997J4232l672j1630K0601k182M043j826o97j7765
15367i586j3167r29J8009Q872J9746J3753k6787r729K9319k6217l7512j012l299
15354c8539J4493m792j430J3477J2354Q679J3338r201l325j576n626j3840q930
15341b4918P260J1082J1620r164K3410q769k1646n265m300l444Q753R267J2954
15328F840J1781Q384k4432R14K5675K832j0655k4618R426J4914J5798j7195j4899
15315D765m129o457J2414K3590k4769n017j0727j6237J8077J367J3929Q805o649
$$ y = [-8842, -10784, -5142, -8480, -33230, -47400, -41658, -39738, -37686, -20305, 1565, -18991, -40891, -36716, -31859, -20628, 2603, -6411, -24995, -16056, -17407, -23913, 4840, 9051, 4726, -3770, -15474, -5187, -4929, -4799, -4693, -10690, 3542, -130, -11760, 8841, 6659, 10702, 8876, 8179, -9586, -22753, -23682, -5673, 3199, 22945, 36698, 9911, 182, 29501, 3284, -34228, -35240, -38539, -24046, -28838, -30268, -16791, -4437, 4242, 17580, 8379, 5054, 3478, -2148, -15988, -24918, -17658, -6576, 5044, -4120, 19290, 10521, -11125, -16390, -20690, -24134, -15381, -6114, 6840, 18621, 27005, 2573, 3487, 29162, 31994, 21339, -3279, 6147, 21061, 36859, 19664, 4765, 636, -5821, 6593, 30183, 5414, 397, -10330, -26567, -8490, -7123, 6806, 15611, 8962]
15302H962L106j4040k909q236J428L510q293j7908j949O450l927j84j5744j323
15288e1057J7702J9139J0367P065j6533j1785l261J0935l211m40o425l145M344
15275b6305L744q8n150j3493J2867K6913k90M945l875J7j5518m811L4502J5805
15261B9263m660K558j8081j5417j2495R073J1026J002m467M526K7539K84Q185
15248C8336L159k1444n344k4348K0125K2867L378r926N130j1203j9636J548J0332
15235A2974L410o918n945R875Q990j3422l9088q626J1958J1621K4611Q880k4841
15222f521j9224N616P476N135L0734J5881r761k5889N640J298L163q635K4100
15209B9013J0380r8J413M47j0892k3587o043R511p622k798n615J5224k720j5139
$$ y = [8962, 12068, -1972, -4881, -13117, -11689, -8179, -16472, -34380, -36329, -29879, -33806, -33990, -49734, -51057, -33355, -14216, -3849, 3216, -13317, -25102, -28363, -17428, -20639, -21079, -27504, -30649, -26305, -22561, -22649, -27799, -41292, -28425, -1512, -1802, 3143, -732, -715, -16233, -21044, 13458, 29263, 24603, 27161, 9080, -6337, -18832, -9759, 1267, 2269, -2198, 2328, 29867, 30151, 38336, 41495, 20051, 14707, -9641, 10484, 33351, 36729, 26803, 31933, 20730, 1094, 2642, 12974, 16384, 9466, 3521, 13396, 22386, 8964, -30124, -38750, -26792, -15171, 9440, 18320, -6521, -25745, -20129, -12653, -7518, 23216, 39097, 29336, 3447, 9087, 10385, 13548, 4913, 29013, 39393, 39295, 40708, 41155, 30263, 6676, 633, 10144, 2522, -276, -5891, 9333, 6613, -8526]
15195h526o159J1054P05L304J1940P036L234p297j9267Q285l429k786o580j6889
15181b5375R023M55n552p915J1460Q600J1596j6558M550M262P403M29k389J4963
15167A4952j0702j1860j1420J0833J8324j3781j8412M716K0375m068k605k582
15155f230k031o4n293O210J194j387L722K0331j7680k2800m718N939K0092K6512
15141B3797R725K0499l1179k8609R398K8972M554l1585R376N422M538q668r822
15128F418J8625j0436k0997L01l792Q801j466J3485L156J4119N006k5330j2794
15115d904q803Q569Q717j6486j6861Q667K4774J6938n667o825p904L034p702J516
15101b937J988k5269M565J3357K3466O992p111r519J0194j4468j7878M134K0102
$$ y = [-8526, -14685, -3631, -2926, 378, 12318, 19354, 22588, 15291, -3976, 4309, 880, -1906, -8486, -25375, -16352, -15897, -21449, -29364, -17904, -9304, 2292, -14266, -9716, -5454, 1949, 2378, -11, 14952, 4250, -7610, -19030, -8197, 10127, -3654, -22066, -17350, 3025, -1043, -3648, -6230, -8261, -8325, -13618, -7408, -6214, -7601, -3879, 16452, -1228, -24028, -28746, -22807, -2715, 23797, 33522, 54021, 22842, -5767, 3631, 32603, 37157, 5572, 14948, 20370, 24908, 16240, 6418, 25043, 14607, -6390, -6089, -9881, -1080, -2546, 10939, 14095, 28214, 33220, 7890, -4904, -13707, -5138, 3579, -12907, -29768, -21101, 3673, 20611, 14944, 8119, 215, 3249, -4453, -2937, -949, -26218, -21653, -8296, 15170, 22162, 15051, 5532, 15726, 1258, -16620, -12486, 7616]
15088G616J2045k292j212q294l291K1852j3301j1582l869j526J546J6998J9786
15075C4476J0339P119p322j4991n302n798k3P936K0668k92k0153j9283K3742O654
15061C7770k8504o468j823m814J4005Q841m115r394j1342J4791n656l8637P123
15048b8223K686k33r677R93M568n802K0952J2880J1397M92n475j7606m766j683
15034a9497O973m456J956J7861J1022o011k770j3527j060o47J1662L845R293j5847
15020a203o977J0983L299j7579j5059Q967R90l546J7130j506r057P722R430k916
15006F78J986L525k649m453Q921r785k0751o677O916q379m608J1638K6036K1744
14992B4142j421R72J2677j3150k4912K427J2155J7122J5517m050K0524o047l3312
$$ y = [7616, 19661, 17369, 16157, 7863, 4572, 26424, 13123, 1541, -2328, -3854, -2308, 14690, 34476, 44815, 51934, 44612, 29621, 24319, 18521, 18498, 26434, 47102, 46810, 26657, 7374, 31116, 37770, 9266, 2798, 975, -3839, 10166, 19007, 14892, 5498, -5844, 8947, 3291, -35346, -28223, -25537, -25770, -35447, -34454, -29886, -35688, -14736, -1856, 9541, 10033, 4558, -13048, -17814, -19497, -12524, -16980, -15024, 2837, 13859, 7848, 5078, -8449, -9509, -10156, 1506, 5351, 14644, -1203, -8180, 2803, 6102, -11477, -26536, -17569, -16579, -20125, -2995, -4501, -13558, -5836, 3594, 678, 2664, 6189, 3540, -913, 8008, -1777, -22528, -29205, -22289, -30668, -35276, -23638, 2398, 24142, 22721, 23693, 36370, 23220, -1692, 735, 12890, 30012, 45529, 41479, 62003, 55956, 22644]
14979B2644l9364j187J6166K1176L95o267N617j4310k3989j5279K952J1977K9896
14966A0427N372p075j3018k701p707l981J5916J4187R210j6357j1411q595m537
14953b0270Q493K5655n213k2114k658j316J405m97r779j551Q352j168j7482p446
14939d5589k651J7989p83l616n893p310J7396P089K0039Q139J127l563J5876K2105
14925D0355r745k362k585j1749j0870o797O409q66n011j3268r581l716M266o623
14911c2143l626J244J5141j7034J386K1318K5058K247l3446r415N37j375p77K5460
14897e425J2515K656J3003K033j7896j2514J1528j100m391j4409M733M150J376
14884c741J1005p029j502m213L27k6241j5324L487M436J9125J1166q117P930J6951
$$ y = [22644, -16720, -17907, -1741, 19435, 19830, 13563, 19180, 4870, -19119, -34398, -31446, -19469, 10427, 15799, 8724, -4294, -6995, -14702, -18683, -2767, 11420, 20630, 4273, -7138, -15733, -20270, -11777, 13878, 8665, -13449, -16107, -17423, -16018, -16515, -26294, -27845, -19493, -20661, -38143, -45589, -48240, -30251, -31034, -34650, -40543, -47853, -30457, -23368, -3329, 4810, 5937, 2374, 18250, 40355, 30610, 28248, 25663, 13914, 3044, -3753, 2656, 1790, -3221, -16489, -26070, -29786, -25520, -32143, -35769, -34525, -19384, -36418, -35032, -13714, 11344, 13591, -19855, -29270, -28733, -30108, -30885, -5425, 7090, 9746, 22749, 24782, 6886, -5628, 5900, 4800, 409, -14000, -9267, -5117, -3741, 7264, 235, -1267, -5480, -5153, -31394, -46718, -43231, -38795, -19670, -8504, -16621, -8691, 8260]
14870H260o165j3842N757k40J9387L654K641j9328k0217l125J4434j4231Q44J4014
14856h157k3973j6482K4784J7007m155J0848J1019o663r774k672j0735J2639J3190
14843F876K3542K160j5135o213k0018j0693L127J6473K3668O397j937J789J163
14830C1199l248l6600o043L8400M738k7377J2075j2962j7761k022J1431K1163
14818A2993K4467L243j8258j9589M54j7080l0383P667K5936J2682k891n06m87
14805a752Q003o633O555R06L815J462j9712k168j0270J3312r618k7109J2469J490
14791b9250J7710J5738J2600R664l3568j1355J5621K1131m746k1411J3844K266
14779H244K150Q346o088k2054O567J913j2267J887k141m354J9829O313Q968N14
$$ y = [8260, 2095, -11747, -5990, -6230, 13157, 16811, 19452, 124, -20093, -23218, -8784, -23015, -22171, -8157, -32130, -48612, -23828, -6821, -10976, -128, 10891, 4228, -5546, -8218, -18953, -6314, 6876, 30418, 32578, 17443, 11230, -8788, -19481, -16354, 119, 23787, 30184, 28247, 30036, 31199, 27951, -8649, -14692, 23708, 28446, 1069, 13144, 182, -17579, -19601, -8170, 12993, 37460, 40703, 22445, 2856, 3310, -13770, -44153, -36486, -10550, 2132, -759, -1265, -1752, 6251, -382, 6173, 7079, 10894, 12356, -7356, -9524, -19794, -6482, -16100, -43209, -30740, -29250, -11540, 4198, 16798, 26462, -7106, -18461, -2840, 18291, 13545, -7866, 5978, 8244, 10394, 18740, 12652, -9402, -2835, -922, -13189, -11302, -13443, -17797, 2032, 8345, 17313, 17827]
14765A7827j1124j1652j1700P787J9460L366k7840p889J5903m952P972J1896j0622
14752a568j4314J1708j4283j9735K2260p20K0908J5202k571n742K498R77P996
14739B2616j5341o998L806L337j280j0102p754j4545P818J3900j1308JJ7857O821
14725H828j4316Q562J5387K264K928K2183J5720n246N245L041k934n989J8056
14712G3729K3833N9568R6862J03152J48036J14629M7275k430r3150j33644j13742
14701C24118j03931n9249j9595l6285l885j1568j1676L866J708j4132j0952j4359
14689D4060l534q113r001K1532N689Q83J56l205m344k5969j5165R805P861p177
14675A3478q947r406L328J0322J37P759k1774j19M528n341L332j3190L356k35
$$ y = [17827, 6703, -4949, -16649, -8862, 10598, 13964, -13876, -21765, -5862, -10814, -2842, 9054, -1568, -15882, -4174, -18457, -38192, -15932, -16652, 4256, 19458, 16887, 11145, 13643, 14620, 22616, 7275, 277, 4083, 7420, 6140, -3962, -11716, -26261, -18443, -4543, -15851, -15850, 2007, 8828, -5488, 3074, 18461, 20725, 23653, 45836, 61556, 56310, 61555, 64596, 61662, 55673, 73729, 97562, 157130, 253992, 357144, 505180, 619809, 667084, 664654, 571504, 437860, 324118, 220187, 160938, 141343, 105058, 101173, 89605, 77929, 81795, 83503, 69371, 58419, 44060, 40526, 32413, 23412, 44944, 50633, 51516, 51672, 48467, 44123, 18154, 2989, 12794, 20655, 13478, 4531, -4875, -1547, 8775, 8912, 16671, -5103, -5222, -694, -6035, -2703, -15893, -12537, -12772]
14661a2772o238J863J8535p39J4157J6811l39k327r631k0690J882K7906m16j0029
14647A7973k2508j4184m783K434J6572k675m291l74r470n832J2203J6104p207
14634f038J394M35j4204P206m675j1271K0349J9386p234r228n519o356L7680J5037
14620C6962K745O529l1681k8887M012J4620m868j1146Q7R203q724k6997J3628
14607b4517o503j949K9198K5261k2618l5340K027L2399j918j469j9189k0364P244
14594c7738K3645R370J9581J0285J1682m044j7371l0906l59J6701L665k0246k4292
14581d0027M190J4556K8377k744J7015J1514l1231k0877o212J0928K695J7458
14569E642k2020P431P576j0372j1194J6793L7897J6068j1798k2576j0107R211
$$ y = [-12772, -19010, -17147, 1388, 649, 14806, 31617, 31278, 28951, 19320, -1370, 512, 28418, 28002, 17973, -4535, -18719, -23502, -21068, -4496, -7171, -11462, -11836, -21306, -27138, -14935, 1169, -6038, -4644, -4209, -18413, -11207, -15882, -27153, -6804, 12582, 5348, -3880, -9399, -15755, 21925, 36962, 39707, 46236, 14555, -14332, -10320, 4300, -568, -11714, -11627, -2424, -11148, -38145, -24517, -31020, -32969, -3771, 21490, -1128, -36468, -34441, -2042, -3960, -5429, -24618, -44982, -37738, -14093, -4723, 14858, 25143, 36825, 32781, 15410, -15496, -15855, 846, 4511, -15735, -40027, -35837, -21281, 7096, 4352, 21367, 32881, 1650, -19227, -25439, -14511, -11816, 5642, -16378, -8947, -1371, -11743, -22937, -6144, 31753, 47821, 36023, 13447, 3340, 12551]
14557A2551Q065J0738r297l3949J918o822J3087K6762J0337M036k106R194K506
14544D7020J8686j2089l3005r829R586k502o599n789j0103l315J7420K2209j1272
14531B0418j0691j2949m444m704o624K3935P695o367K275k228Q543m981M245K390
14517A6513r21j9998n758O815K87k339J0677J3533L99j0459k645J6010j0260o121
14503E733j1050J005J0675K0874P239k1551l0033P24n005J558R88K4312L36j730
14489D075n193r296k3176j2159R055K6233J8608O965j7464j9232R668J8699k976
14476C807J3064Q598k0076Q831Q386J8695R21p07l317j0385j1996Q689R19l633
14462B1796J0945n175j9474P292k38O88n465M202j850o781P258J0052j7038o600
$$ y = [12551, 20616, 31354, 22057, -11892, -9974, -16796, -3709, 23053, 33390, 37426, 35320, 44514, 47020, 65706, 53617, 20612, 10783, 20369, 17867, 11268, 5479, -4624, -7939, 9481, 31690, 20418, 9727, -3222, -7666, -12370, -18994, 4941, 12636, 6269, 8544, 6316, 14859, 9878, 14123, 16513, 15592, -4406, -10164, -3349, -3062, -5401, 5276, 18809, 19208, 8749, 6104, 22114, 11854, 5733, -5317, -4312, 6363, 27237, 34476, 12925, -17108, -16384, -21389, -19831, -18843, 5469, 5805, 4075, -1118, -10414, -33590, -45749, -36694, -10461, 8147, 15112, -2352, -21584, -11916, 6783, 3807, 16871, 25469, 5393, 14224, 22610, 41305, 42226, 41519, 38202, 27817, 15821, 24510, 25429, 21796, 32741, 27566, 8092, 15384, 15146, 15834, 10369, 14571, 12721, 5940, 13198, 23250, 6212, -388]
14448c88l23n841r534k489K209J5123J6196m719o171J5307Q753q716j7669J0631
14434A2369L958O95o958j727M371K1027L927j3463l67K010j2546N750m24j6922
14420A700r613J066J8265Q62Q518M853j0719j0152N73p151n375O931M2p912N194
14405b918l282j2863L1958J5567L831J4150J7586j0199k1870n590j8992j1697
14393d319J1450j1130j9744J599J6903O412J0879k3954k7404O666N155K0242J8224
14380A0979j6143j9042J953J4145J8336J5825J0929j1305q466J0700j3969j1402
14368B540O395R950j3402l86J4491J2980j2913k0111p874J4697J9006j8853n783
14355G37J5866J7312k1989k2712j3545R258K0462K1058K6604j0822j7970j3858
$$ y = [-388, -711, -6552, -16086, -18575, -16366, -1243, 14953, 10234, 4063, 19370, 28123, 19407, 1738, 12369, 16327, 17022, 10064, 8337, 12708, 33735, 37662, 24199, 23832, 25842, 13296, 19046, 18622, 1700, -7913, -6847, 11418, 12280, 20798, 25651, 14932, 4780, 5353, -1798, -7173, -242, -200, -8112, -2918, -6200, -19063, 12895, 28462, 32293, 46443, 64029, 53830, 31960, 26370, 7378, -4319, 7131, -3999, -23743, -22144, -5241, 1171, 12050, -11904, -39308, -32642, -27487, -7245, 10979, -5164, -24206, -22253, -8108, 10228, 26053, 36982, 25677, 17211, 27911, 13942, 2540, 8935, 18885, 5483, 5097, 19588, 32568, 19655, -456, -8330, 6367, 25373, 6520, 737, 16603, 33915, 11926, -10786, -24331, -15073, 5389, 26447, 53051, 42229, 24259, 10401]
14343A0401k4592j2596L05J8356J7763o539j438q352r376r324J5194K6738N656
14330B2196O443j5514l790j297K1674k707r846O930J6784J613j9671j1460J0712
14317B2067N310M015J0309j2948j2574M445J0069j0238k0664L77O076p473J005
14304b24n082j2672J5061J1618L204J2440J1004J433n294n229l267j2521j5676
14291e205j0641j8626N825J0659j5439L444K6772P248k925M91J9056Q470j2785
14278A6344k6951J1265J3217k984k316j9344j0410j1314M952J8560J04p753N818
14265a0812J611K564q787J119m664q060J2210j050k2895L799J5357J25j309n172
14251b5964K4521P831L964R560k0924J279J9653P589p291K675j2333J544R714
$$ y = [10401, -14191, -26787, -26482, -8126, 9637, 3098, 1660, -6692, -16068, -25392, -10198, 16540, 22196, 28639, 13125, 9335, 8038, 29712, 27005, 17159, 24089, 40873, 42486, 22815, 11355, 22067, 27377, 31392, 41701, 28753, 16179, 20624, 30693, 20455, -209, 168, 6244, -1229, -224, -5306, -17978, -2917, 8701, 11905, 24345, 35349, 36782, 31488, 26259, 22992, 10471, -5205, -15846, -34472, -28647, -17988, -33427, -29983, -3211, 4037, 1112, 1603, 20659, 29129, 16344, -10607, 658, 13875, 10891, 8575, -10769, -21179, -32493, -27541, -8981, -8877, -16630, -10812, -9201, -6637, -15424, -14305, -18969, -27029, -14819, -15869, -38764, -34965, -19608, -19483, -20792, -25964, -1443, 6388, 10352, 19912, -1012, 267, 19920, 27509, 20218, 22893, 10560, 12104, 21818]
14238B1818k8006k3803J076J7908J7263K4410J3889o615k1130p085M973R310O780
14225C0788J3117k4358m5343l366K2947J314j8725j0783K7194K4916L703m423
14213A6981L607k16j5919n549J300p541K026J5250j242p915J477k217J2229r817
14199B454J058j5850O344K8539N471k324M120o848j5624o128j8937j0752p390
14186c5867J3213R572J0933m88o927l051q87J6861K5764R613k2136j9144JR271
14172F728J3111j2265j2021m181R584J2614K9393R068l031p340j002K73N012j0270
14158C5673j3763j3394j2208j774p651J6582K72J770k467l977K889P645J4516
14145B4113N240J1976j2459j4439q09j3857o823P48R449n322p63j3417K766J4353
$$ y = [21818, -6188, -29991, -28915, -11007, 6256, 30666, 44555, 37940, 16810, 9725, 14698, 24008, 30788, 43905, 19547, -25796, -29162, -6215, -4901, -23626, -34409, -7215, 17701, 21404, 16981, 20588, 20372, 4453, -1096, 204, -7337, -5311, 9939, 8697, 782, 2259, 42, 12271, 2454, 3512, -12338, -5994, 22545, 28016, 25692, 29812, 22964, 7340, 1212, -17725, -28477, -35867, -22654, -13082, -2149, -2637, -9564, -12615, -13502, 3359, 29123, 38736, 16600, -2544, -2543, 6728, 19839, 7574, -4447, -8628, 956, 13570, 42963, 52031, 49000, 41660, 40658, 40931, 45943, 35673, 21910, 8516, -3692, -5466, -13117, 3465, 3737, 5507, 3040, -937, 1952, 9597, 24113, 29353, 41329, 28870, 14431, 13622, -235, -7058, -6310, 3139, -2183, -2946, -16363, -13597, 756]
14131G56L551j0661j1140P360N7695J1541m604o586l0967j8192J4617N450Q158
14118B6978j546j0414j5055Q792k077K585K0954J5373j8774k8873j5524j1991
14106b9572Q987O645K21l761P057Q07n656n501j1073K112K9473j9679k669n14
14092b3123J6626j845Q088n536j6691J7897O373J667N116J0479q073l7301m043
14079c0366J9882n225K5083L740l134L896j0799J0698Q769l749M029j5007k0393
14066a2576j2352J4958l815j7794K1731K3701r665O07J8364r494k2004K1013K6051
14053C8725M556r048k2752r056r254R775J5448q497k7108k3263j190R906n085
14040c6843k612J4650K1922K1594M31l673M685m597r418O001Q574k9076j7557
$$ y = [756, 4307, -6354, -17494, -10134, 47561, 59102, 54498, 47912, 16945, -1247, 13370, 18820, 26978, 25432, 15018, -37, 8755, 6678, 9263, 30217, 45590, 26816, -2057, -17581, -29572, -20585, -13940, -13719, -17480, -10423, -9616, -15272, -20773, -31846, -29734, -261, -19940, -22609, -23123, -6497, -8342, -254, -5790, -22481, -4584, 1789, 3456, 8572, 19051, 10978, -26323, -30366, -10484, -15709, 9374, 13114, 9980, 13876, 3077, 13775, 22544, 18795, 22824, 7817, -12576, -24928, -9970, -13785, -31579, -9848, 13853, 4188, 4795, 23159, 13665, -8339, 12674, 38725, 43281, 34233, 11481, 2425, -6829, 2946, 18394, 9897, -17211, -40474, -41664, -31758, -36843, -39455, -24805, -2883, 18711, 19142, 15469, 20154, 15557, 6139, 12140, 20714, -8362, -25919]
14027b5919J9878J2843L003K299O73k2068m290p144J8024P909k035j1671j5262
14014b3760K629N96j7137j6107K5646K7106j1007Q037P063O931J2976L819J2868
14001C9660j920m7129l2917J704J8837J7714M813R678P675k6028q810Q96P975
13988g852r294J4541L0629K0409j8817j7942r044j1650O388J5154m071J385k92
13975I544J9893P959j1985L7q568j9240p475j2242J1818O642l588J423j6609K3219
13961H28K5055q497k0669J0936J0028l998j3090J2787K8758j3809L457K0357j7575
13948C4568L073l469N083J2645j9249k4539l3047k5160J0240K6310m29N94O286
13935g094J1825K4386L4489j048k4283O363j6820L167M296j8028j2268J3637J1232
$$ y = [-25919, -6041, 6802, 9805, 12104, 12777, -9291, -13581, -20725, -2701, 5208, 3173, -8498, -23760, -21131, -20535, -37672, -53779, -28133, -1027, -12034, -3997, 3066, 9997, 22973, 26792, 39660, 37740, -9389, -42306, -40602, -21765, -4051, 762, 10440, 18115, -7913, -16723, -15827, -7852, -17146, -2605, 28024, 48433, 29616, 11674, 2630, -9020, -2632, 12522, 8451, 9836, 9544, 29437, 37396, 25411, 25448, 16880, -2360, -9835, -22077, -10259, -3617, -7205, -5782, -22391, 828, 25883, 17386, -3283, 7653, 17681, 13683, 593, 13380, 42138, 28329, 31786, 52143, 34568, 37641, 34172, 39255, 51900, 32651, 8112, -24935, -50095, -39855, -13545, -13974, -13380, -7094, 4731, 29117, 63606, 62558, 38275, 44638, 27818, 30985, 35281, 17253, 4985, 18622, 29854]
13922B9854k7044k954J6821j5335j1945N787P469R180J4710o001P36k230r232
13909I816J1555k775k1206j6345j3482J8075K1341P339L976J1060k3887j7619
13897a2152k5795M509J6009L1518J4256L805J0723j4425j1019k980J1834j2416
13885A3867L455k0408N80K019M149J2400J7264j4824j26j6349k634J0416l342
13872F467j937j786j6562k770O588J4516Q288K659J7821j6327q087j714M823R513
13858B1492j5073m812r03o79J7259R344J1172n540k0480K768l582J049J0068n676
13844A6407P035J5998Q447j2339k0562k632m938K2028j2372j7195j5696P001m045
13831a2863K7026Q459m647q746J3799o418j3597M264J5600l947P449j356N692
$$ y = [29854, 2810, -144, 16677, 1342, -10603, -4816, 2653, 11833, 26543, 20542, 21278, 19048, 9816, 21371, 18596, -2610, -18955, -32437, -14362, 6979, 14318, 18294, 29354, 5467, -12152, -37947, -33438, -17429, 14089, 28345, 32150, 42873, 28448, 17429, 14449, 26283, 13867, 17322, -3086, -2506, -487, 3662, 16062, 33326, 18502, 18376, 2027, -607, 9809, 6467, 4530, 2744, -13818, -16588, -10000, 4516, 12804, 15463, 33284, 16957, 8870, 7156, 11979, 21492, 6419, 1607, 704, 25, 17284, 26628, 37800, 32260, 11780, 14548, 10966, 12015, 22083, 16407, 23442, 39440, 47887, 35548, 14986, 12354, 7416, 29444, 17072, -123, -15819, -8818, -12863, 14163, 22622, 17975, 9229, 23028, 16610, 3013, 7277, 22877, 18930, 26379, 25023, 30715]
13818C0715R392r610M795j3714Q815Q722n367j9812k1686j8503r224O257K5238
13805c982j570p854j0238r558P314M2289J6425j1786q39lN906j6655j8188j9445
13791b8184J2992P615K669q546J966M1905J7998q738m029j304j7377m937m373
13778G657k0188o44j4219L505L44r919R17K3013Q752j2020K0025R580L2209M508
13764E3520p163l010l703j9995j9489R822K1496K1517K837k0876k232L1247M064
13751F8035k0163k2882O149M914r13k0549o3J196J4872k1282j0299r61J3045N473
13737A6572J6693j0820j8043o043k50K762J8087Q84k37R265J3465q738Q195j9992
13723B1800l523J1942J1270n787L327l494R508J6443j7043m522o039j6448J5117
$$ y = [30715, 40107, 30497, 35292, 21578, 30393, 39115, 33748, 13936, -7750, -26253, -35477, -29220, -3982, -5552, -13406, -23644, -33202, -25888, 16401, 32826, 21040, 20201, 20198, 26104, 9449, -8739, -28184, -15192, -7577, -4908, -13454, -11488, 30417, 48415, 39677, 35648, 34344, 16967, 12030, 7657, -12531, -13175, -27394, -23889, -23545, -33464, -32547, -9534, -782, -12802, 7223, 16803, 49012, 53520, 46357, 43347, 39644, 19649, 160, 9982, 31478, 52995, 55832, 34956, 32724, 63971, 68035, 47872, 24990, 31139, 36053, 35140, 14591, 14528, 15724, 30596, 9314, -985, -1946, 11099, 16572, 33265, 22445, 4402, -1641, -1891, 871, 18958, 19842, 19605, 28870, 42335, 33597, 41792, 21800, 18277, 30219, 41489, 35702, 39029, 35535, 45043, 61486, 44443, 39921, 33882, 17434, 32551]
13710C2551J6045J1523J2734k896K5285L7776P9748J09381J42239K64371M74210
13699A202967N93918K38286k58883m80560m25498k75153j51122j06104p2697m6733
13689B18421k6354l4177k9718k4985J8050J698m5464l0326r589j4982k1261j915
13677f02J3542n812m636J3986j562L262L553P716k3195M045J002N771j1499R600
13663A5171J5482J4289J4550M060k3954J2586K4133n800o884K277l7053k2084
13651F773j0236M308R640L021K1073L5460J6236M496J5639j8791k6127k5905j396
13638C4191J6042K36k4778O84J5874K4096N94j1009Q696n189O397J2729J6263
13625I4826j3839j5147O081J0737O665Q433j6640j1479r169j9065q579j209K4459
$$ y = [32551, 48596, 60119, 72853, 69957, 95242, 133018, 212766, 322147, 464386, 728757, 1202967, 1796885, 2035171, 1776288, 1295728, 870230, 595077, 443955, 337851, 265154, 218421, 192067, 157890, 128172, 103187, 121237, 122935, 77471, 47145, 37556, 22574, 1313, -602, 12940, 7128, 2492, 16478, 14916, 18178, 21731, 29447, 6252, 10297, 11299, 17070, 5571, 15171, 30653, 44942, 59492, 63552, 39598, 52184, 76317, 70517, 63633, 65910, 28857, 6773, -3463, 845, 10485, 13506, 34579, 70039, 86275, 90771, 106410, 87619, 61492, 35587, 34191, 50233, 50469, 25691, 26375, 42249, 66345, 66939, 55930, 64626, 59437, 65834, 78563, 94826, 80987, 65840, 71921, 82658, 89323, 97756, 81116, 69637, 60468, 41403, 32824, 31615, 56074]
13612E6074Q259k330j0735K731j0824p130k6601L956K0455J0902J1324r028k3832
13599B3221m604P587Q658N680M38j6944n773J1293Q35n907K289p125J613p10K0367
13584D0918J4219j7865j3429P090l319M78p717J2580l412K031Q718J2599K4192
13571G7083q091j8209j2672j2243K47m91J691J042O607j226k1842l8584K229k1575
13557d6034j4349J2986L682J8899P189L539j0067k493j0847j3384Q280K9454J0854
13544b291L0547K2441J5791O465P569j3480r878k7433j0132J2877K0564J0213
13532F3253j8758j3955M73J0575q09N446k4885n974q036P131J1627Q662l605Q413
13518C9558J4413J2391J8824P12r427j6503P906J8494K8495K0242K9739N359l854
$$ y = [56074, 64333, 62003, 51268, 53999, 43175, 36045, 9444, 13400, 33855, 44757, 56081, 47053, 23221, 18617, 26204, 34862, 40542, 40980, 24036, 18263, 29556, 30391, 24484, 26773, 19648, 21261, 20551, 40918, 55137, 37272, 23843, 30933, 27614, 28092, 20375, 32955, 29543, 31574, 40292, 52891, 77083, 68992, 50783, 38111, 25868, 26115, 25624, 27315, 28357, 34964, 33738, 11896, -26688, -24459, -46034, -60383, -47397, -43715, -24816, -17627, -14088, -24155, -26648, -37495, -50879, -42599, -13145, -2291, 28256, 50697, 66488, 72953, 80522, 67042, 57164, 29731, 19599, 32476, 53040, 63253, 44495, 30540, 31013, 41588, 40779, 46225, 21340, 15366, 7330, 14461, 26088, 34750, 31145, 39558, 53971, 66362, 85186, 85898, 76471, 59968, 67874, 86368, 114863, 135105, 164844, 170203, 166349]
13505A66349K6212L407l0618q284n903k3049j5996k1785j6586j2829r330j1198
13493D0390N102K164J8596Q764L81K879L662J875q895m236j2746m821r598J9283
13479F2800O505j1206O037K7167m16k2244N653P24j1324l564L244m540J56p920
13465E1072q530L072n431N136k061n26J3274J1013k673k0959K931j2516j2387
13452B1415K1993O106o434K652K8195J5764p798q104J2435k8289l6439n022J0061
13439B6535J3449L2130J5234R976j3512J192J7282j0335j979k226N603R631J0607
13426A13587M671K7891L0356J003N800J3122P173k093j5549j9757J7296J1234
13414A94734n805J2568k2447n5343j73672l01779k29754k3684Q5890J21855J01076
$$ y = [166349, 192561, 195968, 165350, 157066, 151163, 128114, 112118, 90333, 73747, 60918, 51588, 40390, 45492, 47656, 66252, 75016, 75397, 78276, 81938, 83813, 74918, 70682, 57936, 53115, 43517, 62800, 69305, 58099, 64136, 91303, 90887, 68643, 74296, 75020, 63696, 60132, 63376, 58836, 58992, 51072, 42542, 45614, 40183, 45319, 43258, 42732, 56006, 67019, 64346, 43387, 46318, 33802, 21415, 43408, 49514, 43080, 45732, 73927, 89691, 81893, 73789, 86224, 57935, 21496, 16474, 26535, 39984, 72114, 87348, 97324, 83812, 85004, 102286, 91951, 89972, 87746, 93349, 102980, 113587, 118258, 146149, 176505, 177508, 183308, 196430, 203603, 201510, 185961, 166204, 183500, 194734, 188929, 201497, 179050, 123707, -49965, -351744, -581498, -605182, -519292, -397437, -296361]
13403b96361O3738N8465M3065L3366L8800J0415o961Q344R798J4716L997J4495
13391d123K5846O414k448j1237R968J499j5590k1491R618N576n936k0502K2217
13378a89L1409J9610K3919N352K6254O861k889k4992j0321j772k3381Q395L928
13365F2184K634K4567m638j9893r785J9631L1586J5857j0160O799n999l057J8984
13352A28710J0381O284j5438q134k9536p84J4836L1700K3792K9571J2736Q219
13340B12337j2780p807J2698J1834j938m384P063j1734m711n31k4546j2474J0713
13327A73740M109n97L766J6779L6431N2002J9594j266k3718p817J0166L213K627
13314B89029J7464J5755J5413J8962P95J1194K0454J2819L5982L5027J9067J2292
$$ y = [-296361, -232623, -174158, -131093, -97727, -58927, -48512, -55473, -47129, -37331, -22615, -18618, -4123, 21723, 28137, 25689, 14452, 24420, 25919, 10329, -11162, -1544, 4032, -1904, -22406, -189, 31220, 50830, 74749, 80101, 106355, 113216, 110327, 85335, 75014, 73242, 49861, 58256, 62184, 64818, 89385, 84747, 64854, 55069, 74700, 106286, 122143, 111983, 118782, 112783, 109726, 128710, 139091, 145375, 129937, 121803, 92267, 91483, 106319, 138019, 161811, 191382, 204118, 212337, 199557, 191750, 204448, 216282, 214344, 209960, 217023, 205289, 200578, 200047, 175501, 163027, 173740, 177849, 177252, 181018, 197797, 234228, 286230, 305824, 304558, 280840, 273023, 283189, 286402, 289029, 306493, 322248, 337661, 356623, 357418, 368612, 389066, 401885, 437867, 472894, 491961, 504253]
13302E04253K8172L5964M7024M2676P574l3106p4668k5071K2545K9131M2362N5821
13290F82677P9955N7979L1772M7127J01130J51724J31134R2706O6430R6614J12946
13279A652194J23066J03796R1856J26043J55215K68739L86461M98677N89982N57037
13269D553066M52558M84922O92463J004961J395841J891563K402984L099498M260993
13260B0238849N996916Q432588J2488578K0881656L8799580P5423130J21058297
13253C03319594R2933689j0056539q4463089r7385782p0085380m2579807k5361258
13246F6321428j5784751j0768738p808851n700999m241236l295091k627117k088722
13238A4005923j804985j620168j372674j015235p34903n24133m37845m45835m83597
$$ y = [504253, 532425, 568389, 615413, 658089, 665663, 632557, 557889, 532818, 555363, 584494, 626856, 682677, 762632, 820611, 852383, 899510, 1000640, 1152364, 1283498, 1376204, 1442634, 1539248, 1652194, 1775260, 1879056, 1970912, 2096955, 2252170, 2520909, 2907370, 3406047, 3996029, 4553066, 5005624, 5490546, 6183009, 7187970, 8583811, 10475374, 12878358, 15977856, 20238849, 26235765, 34668353, 47156931, 68038587, 106838167, 182261297, 303319594, 396253283, 386196744, 301733655, 204347873, 134262493, 91682686, 66321428, 50536677, 39767939, 31959088, 26258089, 22016853, 18721762, 16094645, 14005923, 12200938, 10580770, 9208096, 8192861, 7457958, 6933825, 6495980, 6050145, 5566548]
13229E566548m45267l91624l78110l50874k95948k46725k53790k55782k06107
13220B742321k00273j68519j62928j86342j66988j21500j07537j13459r1065o1885
13210A361825p7655j52841j42671r6232l9252l5126k2270k3768k2094j9624k0758
13199G09534j6140l6611r469l538k2237l4089k7528l51j8740j0093l5674m1217
13187D53847m0577j6204L355j8171K503J817j7947m409K5367j911l06l3989k4226
13174C29149j6823m2253k3050K979r788l3139J2836O142k0380j6894N80K9599
13162B18958K7128r88m327J0130q11k941j8850k8561l2158J327P428J263o429
13149A71169k2136L234M96M575Q151M642k301P721j2666r013J903J1259N644n957
$$ y = [5566548, 5121281, 4729657, 4351547, 4000673, 3704725, 3458000, 3204210, 2948428, 2742321, 2542048, 2373529, 2210601, 2024259, 1857271, 1735771, 1628234, 1514775, 1423710, 1361825, 1284170, 1131329, 988658, 892426, 853174, 818048, 795778, 772010, 749916, 730292, 709534, 693394, 656783, 647314, 643776, 621539, 587450, 559922, 559571, 540831, 530738, 495064, 453847, 413270, 397066, 400421, 382250, 384753, 386570, 368623, 364214, 389581, 387670, 387364, 353375, 329149, 312326, 270073, 247023, 250002, 240214, 207075, 219911, 226053, 205673, 188779, 189359, 218958, 246086, 245098, 240771, 250901, 250090, 247149, 228299, 199738, 167580, 168907, 176335, 177598, 171169, 149033, 152267, 152763, 157338, 165489, 170131, 167830, 175551, 162885, 153872, 155775, 167034, 172678, 166721]
13135A66721l3357k6311M328Q827j133J0431L1341N5252O7765K5841l2774j4942
13123B61989j1184j5711l5607l4347P782j123K2560j1707j0075k4745l380p618
13111A36834p575N405K5447M8991L3500n124j6070K66L7733O4891P2587J13066
13099E09951J61986J33862p2098k48734k52015j60723p1267k2085q94J3480Q149
13088c88j0048Q72J9618j0968j1146l0426j67K5874Q826J4042r275k3124L815
13075b2495J4657o130N722N138j1037M999L4688J941j6749n514K0296J4381N209
13062D5106j4108K809J6804j0699R305k510J2552L5712K3177J6590K8489L2192
13050A95419k0111l1396l6974l9334k4924K7717j2898m699J3425N863J049K493
$$ y = [166721, 133364, 107053, 111381, 120208, 119075, 129506, 160847, 216099, 283864, 309705, 276931, 261989, 250805, 235094, 199487, 165140, 172922, 171799, 194359, 182652, 172577, 147832, 144452, 136834, 129259, 134664, 160111, 209102, 242602, 237478, 221408, 221674, 259407, 324298, 396885, 509951, 671937, 805799, 733701, 484967, 232952, 72229, 962, -21123, -22017, -8537, -388, -10436, -9564, 10054, -914, -12060, -42486, -42653, -16779, -7953, 6089, -3186, -26310, -22495, -7838, -13968, -8246, -3108, -14145, -9146, 25542, 27483, 10734, 5220, 25516, 39897, 45106, 30998, 33807, 50611, 39912, 49217, 46707, 59259, 94971, 118148, 134738, 163227, 195419, 175308, 143912, 106938, 67604, 42680, 70397, 57499, 52800, 66225, 72088, 73137, 75630]
13038G5630j064J952m007k0031l921p085j3349K723J0412K299k4483j5743j643
13025A690NR0N54O271J5241J777j8935K122K0729o959M336j069P051K1484N334
13010E9721l133j1179l761J5658P717J6767j0650k962j2328l554j4334j6750N965
12997B7177J2738K7968O615j1789j6176q350n103j6344n184k3349J5227K0830
12985B4260L137Q177Q223Q679K2875j0818j8877k1686r749l1938q687L0790J2975
12972A7361p642J7687j6766k0906L220M354j7208m146Q177K890J0128K4331N828
12959B7308J4249L4402o768L086r31k1569j0704K8476Q251j6943l406K549M01
12946E8401n877j5128L080r935R038k874j2094j6909P964n368n704j133j718K3534
$$ y = [75630, 74566, 76518, 72511, 52480, 48559, 41474, 28125, 30848, 41260, 43559, 19076, 3333, 1690, 1695, 1785, 2339, 8610, 23851, 25628, 6693, 8815, 29544, 22585, 26921, 25852, 32903, 54387, 59721, 56588, 45409, 41648, 57306, 65023, 81790, 71140, 68178, 55850, 52296, 37962, 21212, 27177, 39915, 67883, 74498, 62709, 46533, 38183, 33080, 16736, 11552, -11797, 3430, 24260, 27397, 35574, 43797, 52476, 75351, 64533, 45656, 23970, 14221, -17717, -26404, 4386, 17361, 9719, 27406, 10640, -10266, -7046, -2692, -19900, -24046, -15869, -12979, -2851, 21480, 27308, 41557, 75959, 69191, 72277, 71346, 49777, 39073, 67549, 75800, 58857, 55451, 58000, 58401, 52524, 37396, 40476, 30541, 39579, 36705, 24611, 7702, 15666, 10298, 4594, 3461, 1743, 25277]
12932B5277l422n447L1203J048j2411k1905j0542j0063l029J63p700j446P648
12919a0626J6505J7600L555j4418o246M458J1352k439J5891R60q155j2256j9443
12906c262J1522N348m79J3620K995K656o218j402J6978l830n156n769r17N512
12892C1598P432j1797j1154J2432J8464j5595j5602k2196P878j2720J1829M330
12880D899j9989o163J0860J0588R135o713J2566r47m159M67j0632q00J283J1920
12866A2315J9917j2702l9196j2439m947J0935J5875l764K637p350K328P195n658
12853a4854K2078K7536j3720j3610J0472j1321l9756J1142J0742j4624j3770K0143
12841a9542J3726J641j9160k778L1209J4931L857L754j412k446o473k533J5620
$$ y = [25277, 21855, 16408, 47611, 48659, 36248, 14343, 3801, -6262, -9291, -9128, -16828, -18274, -10626, 5879, 23479, 27034, 12616, 6370, 10828, 22180, 19741, 35632, 36592, 28437, 16181, -3262, 8260, 13608, 13129, 26749, 29744, 32400, 26182, 24780, 41758, 37928, 32772, 27003, 26086, 31598, 39030, 27233, 16079, 28511, 46975, 31380, 15778, -6418, 1460, -11260, 569, 4899, -15090, -21253, -10393, 195, 9330, 2617, 15183, 14236, 10077, 10544, -88, -888, 395, 12315, 32232, 19530, -19666, -32105, -37052, -26117, -10242, -14006, -11369, -18719, -16391, -9196, -14854, 7224, 34760, 21040, 7430, 17902, 6581, -33175, -22033, -11291, -25915, -39685, -19542, -5816, -4175, -23335, -26113, 5096, 20027, 23884, 27638, 26226, 23780, 17307, 14774, 30394]
12828C0394P758j499N304J7956q600j5260J4772J2270k729Q683j5500j1285j6675
12815B5589K6610K0734J0574K399R115K0169O904K4052M3111N2337N9952J31712
12803D33258K68141N25464O08414K19465k45465m95865m27074k66561j56333p4790
12793C88654n2993l5358O496J1182N0247J06153K09627L65120L27235k0364k59660
12782A096339l12975k41766j61458q3484m9804n1575n5879k0307j3182m156M313
12771A06066k4617k8982j5087j178j0604R915J2802J2718n433k0932M648P028
12759D6344n204j060K4370k788q290k7921j5634j1742q95J0357J9556K4122k556
12746D8659j4682K2460R252k981m0684j6999M206K9489M18j0125j7415K645J6964
$$ y = [30394, 38152, 36653, 41957, 59913, 51313, 36053, 50825, 63095, 60366, 69049, 53549, 42264, 25589, 52199, 72933, 83507, 85906, 95021, 115190, 122094, 146146, 189257, 241594, 301546, 433258, 701399, 1226863, 1835277, 2054742, 1809277, 1313412, 886338, 619777, 463444, 388654, 335661, 300303, 306799, 317981, 368228, 474381, 684008, 1049128, 1376363, 1355999, 1096339, 783364, 541598, 380140, 296656, 246852, 195277, 139398, 119091, 105909, 101753, 106066, 81449, 52467, 37380, 36202, 25598, 35513, 48315, 61033, 55600, 34668, 39316, 46344, 41140, 40080, 64450, 61662, 53372, 25451, 9817, -1925, -2820, 7537, 27093, 51215, 48659, 33977, 56437, 65689, 62708, 22024, 5025, 9231, 38720, 39138, 29013, 11598, 14243, 31207]
12733C1207L715o583k672j3622j2989K2017k1276j9378l410j034J4243N920k308
12720f170J5454m770o885n971j3996O192N558R447J7902N500K3862Q320j4620
12707C9823j2022m093k5874K914k888k92J5229Q235q454j3341J0730j529L974
12694A2412n085k4034K0067o065N627J0663Q087j1373o338P791J6490J1856O180
12681D6278n647j7930n0Q948o236k6401p063J7301M722R527L176J3887J5357n978
12667D9891l288j764j744j3645j5397K593M563o16J703J6507K3882M930k4885
12654D2730l9408l5959J0112J2691Q406j4083j5349J2376J593L060J1953K2623
12642B0745k761k8975j615M461J0500Q619j7698P911L573k105J9799J6123p136
$$ y = [31207, 34922, 28339, 25667, 12045, -944, 21073, -203, -19581, -22991, -24025, -9782, -3862, -6170, 9284, 4514, -2371, -8342, -22338, -16146, -10588, -1141, 16761, 22261, 46123, 54443, 39823, 27801, 23708, -2166, 748, -2140, -2432, 12797, 21032, 12578, -763, 9967, 8438, 12412, 7327, -16707, 3360, -2705, 2922, 13585, 21672, 10299, 3961, 11752, 28242, 40098, 46278, 40631, 22701, 22651, 31599, 25363, -1038, -8101, 9200, 13922, 23449, 26625, 40512, 55869, 49891, 46603, 44839, 43095, 29450, 14053, 16646, 21209, 20593, 22296, 38803, 62685, 67615, 42730, 3322, -32637, -22525, -9834, -1428, -15511, -30860, -18484, -16891, -13831, -1878, 20745, 17984, -10991, -12606, -8145, 2355, 10974, -6724, 1187, 4760, 2655, 22454, 38577, 31441]
12629C1441l1155j8039j7730J0608K2513N086k393J3482R493Q292N99o152r391
12616A6654j0784J3945l264k348J9294J2191j7342K866k677j6133j623m435L688
12603A0032K6662j8531j9070j8007k3851q814J0425K3236L1540Q696o589k6196
12591a0467k4558J6274J5157l541J8431J33l507J6131j0133j0887o969R559Q388
12578A4011J036k89J0407Q149j1720j6539k0J6923j1656j7586o865J3316L818
12565B985l973J212J011p866j3840j0346j0682N658J5258K4110N024L455k203
12552I803j7191j882J577J4729R974p552o770K2227p416j5219o368K212J439m443
12538d880j2985Q640j276R751l756R868R676j0569K275J059K631j4723o961N961
$$ y = [31441, 286, -17753, -35483, -24875, -2362, 2724, 331, 13813, 23306, 31598, 32197, 26045, 16654, 5870, 19815, 16551, 14203, 33497, 45688, 28346, 31212, 28535, 12402, 10779, 6344, 10032, 36694, 18163, -907, -18914, -42765, -51579, -41154, -17918, 13622, 22318, 15729, -10467, -35025, -18751, -3594, -7135, 11296, 11429, 7922, 24053, 13920, 3033, -3936, 5623, 14011, 15047, 14758, 25165, 33314, 21594, 5055, 5035, 21958, 10302, -7284, -14149, -833, 2985, -988, 224, 1235, -6631, -20471, -30817, -41499, -35841, -20583, 3527, 8551, 12006, 9803, -7388, -9270, -7693, 7036, 17010, 9458, 2688, 24915, 17499, 2280, -4088, -1876, -437, -4880, -17865, -9225, -10501, -750, -4506, 5362, 15038, 4469, 6744, 7803, 10434, -4289, -11250, -5289]
12524e289l929M485j9431j95J0426k861J828k479K8014J4264J9241m873k1046
12511A8155J436j8007r345O842L798N900J913p081q67k5359J4370J0850j7360
12498a4755J1156J4676J3430O175j1088j5464N61l153O00K8438M322j0061m564
12485B0273L602j2138l513N880J1295j545J596o075p235K575n38J149n385k154
12471G787Q896K412j2648j5867o352J3845J0634L309o196L340K959m226J9222
12458B7115J935j029p190o369k5489j2459M996L2683m665r133P232K0437j352
12445B6712j7100j2858J9666j0297J8966n318k6585n386L083o8o138R549J7684
12432A1910K0072j6183j7014K0909J8656p26j3595M27l04j9972J467j7202o637
$$ y = [-5289, -9218, -4733, -24164, -24359, -13933, -16794, -14966, -17445, 10569, 24833, 44074, 39201, 18155, 19591, 1584, -7761, -919, 2879, 8779, 10692, 3611, 2744, -22615, -8245, 2605, -14755, -3599, 11077, 24507, 30682, 19594, 4130, 4691, 1538, 2138, 30576, 34898, 24837, 20273, 23875, 11737, 8224, 14104, 25399, 23854, 25450, 19375, 12140, 14715, 14177, 15326, 9941, 7787, 16683, 19095, 6447, -9420, -15772, -1927, 8707, 12016, 5820, 9160, 12119, 7893, 27115, 29050, 28021, 20831, 14462, -11027, -23486, -18490, 14193, 9528, 395, 7627, 28064, 26712, 9612, -3246, 16420, 6123, 25089, 19771, -6814, -12200, -9117, -9185, -15323, -5774, 11910, 31982, 15799, -1215, 19694, 38350, 37624, 24029, 24456, 24152, 4180, 5647, -11555, -18192]
12419a8192j6665J209N043J1409K041K5837J9003l220j033J6265O872l3457r289
12406E823k1153r771l866p91O934J0833L199J290K6346n944j4524k3515R398K0560
12392D819K788j6169k6522J4335K6153q561m114L458m932p639M899l347o620l322
12378b4774Q365L014Q66k8648L1512K0567j865K46j0108j3797L255Q558j8209
12365b1018N556J9490K3653l266m168k2363Q411M516l079m156k5424l765J582
12352b4031J5355J8549J3796m787k1068J627k400M178M635K1294r22k1463k6967
12339b2204j5168L0986L0724r408k8049J819o279j8251R955K2455j7124j6389
12327c6933J4554J6148J132L925k0924J7300m655J5q668j1719j1697J4282J2185
$$ y = [-18192, -34857, -33648, -28605, -17196, -15155, 10682, 29685, 26465, 25432, 41697, 48569, 15112, 5823, -15330, -25101, -28967, -29758, -22824, -11991, -8792, -7502, 18844, 12900, -1624, -25139, -15741, 4819, 7607, -8562, -35084, -20749, 5404, -3157, -7271, -3813, -8745, -16384, -11485, -14832, -21452, -24774, -16409, -13395, -12529, -41177, -9665, 10902, 9037, 9283, -825, -14622, -11367, -2809, -21018, -15462, 4028, 27681, 24415, 20247, -2116, 6295, 10811, 7732, 3576, -21848, -25613, -24031, -8676, 9873, 23669, 18882, -2186, -559, -2959, 1219, 5854, 27148, 26226, 4763, -22204, -37372, -6386, 24338, 14930, -13119, -11300, -17579, -35830, -25875, -3420, -20544, -36933, -22379, -6231, -5099, -1174, -22098, -4798, -9453, -9438, -18106, -29825, -41522, -27240, -15055]
12314a5055j4500J258K1713K942j3916N065r152j0296M235k835n26K7991J7950
12301A4874m11J3040k699q607j5094j595p833j3731J7245L1382K666l293k1544
12288D400j399q000J450Q28Q256j1000J3059J2453j7236j4335J130O026P60J8637
12274A5029R909O430j8491j6514J4358L4q932k3388o316J5442J7568O181k2602
12261a1292j0469K501J0610R871P077J3069j6766K6015J3725j5920k0530p299
12249E92m237J246j244j4180n854P874K0256Q536q428J2135j3070M468J3225P810
12235B9129r754j9292r887o372K2615n781p516P166j7168j6902P908N911m270
12222b4213L452J2775r222o103n248O029K0350j3688j5274O544K4873j2969J0900
$$ y = [-15055, -29555, -28297, -6584, -3642, -17558, -12493, -21645, -31941, -27706, -30541, -31067, -3076, 14874, 14463, 27503, 24804, 16197, 1103, -492, -8325, -22056, -4811, 26571, 29237, 25944, 4400, 3001, -4999, -3549, -2721, 5535, -5465, 7594, 20047, 2811, -11524, -10394, -4368, -3608, 15029, 24938, 31368, 12877, -3637, 10721, 10755, 1823, -21565, -27881, -12439, 5129, 11310, -11292, -21761, -19260, -8650, 1221, 8298, 21367, 4601, 30616, 44341, 28421, 7891, 592, -3645, -2399, -3643, -17823, -23677, -15803, 4453, 12989, 4561, 16696, 3626, 8094, 21319, 29129, 19375, 83, -9804, -16176, 6439, 658, -6858, 308, -16860, -33762, -25854, -19943, -24213, -20761, -7986, -17208, -23311, -28559, -22530, -2180, -15868, -31142, -24598, 275, -12694, -1794]
12209a794J013j038J8414L066j466r715j1857q97L283q633L404r559L040Q925
12195c814K4924J0906k5041k0010m497J6368l129K371n613j0889J4783l727J801
12182e567K7802Q221p082j5942j9436J1718k687n984q575J0130J464P837J6811
12169A8710p621q501j7376p978Q63K585M029K9669M838j3282J451L452j7119m146
12155a0426K2614K3733j2142k2916r175L172m361N16J1854o230m778Q842J2362
12142A3065R542j1446n548k4625j131N132M598K855J4742O107m117k6279J5700
12129a405o60m514p57k63J3779J0160p812J5420K1218k1326k1257L461l673J2619
12115A4990p147n568N66K220L1600R521K480j2979l4577k3734J656K0132J0805
$$ y = [-1794, -781, -1819, 16595, 19661, 18195, 8480, -3377, -4274, -991, -9624, -6220, -15779, -12739, -3814, 21110, 32016, 6975, -13035, -17532, -1164, -4293, -1922, -7535, -18424, -3641, -7368, -5567, 22235, 30456, 23374, 7432, -12004, -286, -2973, -8957, -17532, -7402, -5938, 1899, 18710, 11089, 2588, -14788, -22766, -21903, -19318, -15289, 14380, 19218, 5936, 7387, 10839, -6280, -10426, 12188, 35921, 23779, 863, -8312, -5140, -9501, -8985, 2869, -3361, -8139, 703, 13065, 22607, 11161, 5613, -19012, -20143, -15011, -10413, -7558, 7184, 13291, 9174, -17105, -1405, -2065, -6579, -7336, -7599, 6180, 16340, 8528, 23948, 45166, 23840, 2583, 6044, 2371, 14990, 7843, 2275, 2841, 5061, 36661, 46182, 48662, 35683, 1106, -22628, -20972, -840, 9965]
12102I965j1981P153J5638l397n037k1577j04l086O014K6666K9836J2924j3327
12089D9687p289K839k5550l1772q410p769K2433j781K044q144k4344Q529J8297
12076a1230o613j514M488m585M853n953k683j3106P204J8575O656K4419k5875
12063e364J306K1802j716j3208l192J360Q398o192j4994j9876L2312M667k7785
12050b2482R754K7484k881M812N474j3882k8681q566K450M229J8791J5497o953
12037E046j3420k7152o764K1939J6988p629Q818J7747l195l992l8645j0027K7485
12024a2801m172k2616o195K896K9218M949q125k244P474J412L506m507k3191J0318
12010b4078K1598Q125j7507j2326J3715L0796O251J6621n132k1788k713P745L26
$$ y = [9965, -2016, 5137, 20775, 17378, 12341, -9236, -9340, -12426, -6412, 20254, 50090, 63014, 49687, 42398, 45237, 19687, -12085, -20495, -28264, -5831, -7612, -5568, -13712, -38056, -29527, -11230, -17843, -19357, -14869, -19454, -14601, -20554, -23237, -36343, -29139, -10564, -3908, 20511, -5364, -4058, 17744, 16028, 2820, -372, 988, 9386, 3194, -11800, -31676, 636, 5303, -22482, -12728, 14756, 11875, 16687, 22161, 8279, -20402, -28968, -26518, -22289, -3498, 11999, 5046, -8374, -35526, -42290, -20351, -3363, -10992, -2174, 15573, 12378, 8386, -30259, -40286, -12801, -16973, -39589, -45784, -42888, -13670, -8721, -16846, -19090, -11616, -10204, -6698, -11205, -34396, -24078, -2480, 5645, -11862, -24188, -10473, 20323, 26574, 43195, 38063, 16275, 13562, 21307, 21633]
11997B1633j6270Q040j8149j07j149n256J4560j5670n104j540J1641J3136N347
11984A1112j2633j925J126J894O032o748K004o524k136m089L1498l878m5179j628
11970c1074j2278p096J6794J7375n1j227J7619J698k668l202J5841P757J2383
11957C1871j3574j5399M872R002j1798r749m409l864j0463m611j2513O118K4568
11944i949R923M869q161r265J6171L123j8458J7237q81J2148K0349j5677k7196
11931e767j3323J7091k568J5869R39j7324j4373J4031N076K584o233p42K0277
11918A5537j8888J1606N050J1095R738q201l774p327j8934j4271J3091k208J3824
11905F338O064P130k4463j8756p912p244J6455J8991K693P568K716o917k2114
$$ y = [21633, 5363, 13403, -4746, -4853, -6002, -11258, 3302, -12368, -17472, -19012, -7371, 5765, 11112, -1521, -3446, -2320, -426, 5606, -1142, 862, -5662, -7798, -11887, 19611, 15733, -29446, -31074, -43352, -50448, -33654, -16279, -16330, -17557, 62, 1760, -908, -4110, 11731, 19488, 31871, 18297, 2898, 7770, 16772, 4974, -4775, -9184, -13048, -23511, -28122, -40635, -34517, -9949, -26, 4843, -3318, -12583, 3588, 6711, -11747, 5490, 4609, 16757, 37106, 21429, -5767, -19090, -1999, -4567, 11302, 12241, -5083, -19456, -5425, -349, 2235, -3998, -4740, 15537, -3351, 8255, 13305, 24400, 34138, 25937, 22163, 14836, -4098, -18369, -5278, -7486, 6338, 12402, 19532, -4931, -23687, -31599, -38843, -22388, -3397, -704, 6864, 9580, 2663, -19451]
11892a9451j1653J5170N871M713K2011K2192j8561r501J401j7715q31O412k3N911
11878E946J967m513J8150n872o487K3554q947j1593r496j3508Q956J0768J4160
11865B3085N358j5871l4137M132n09K0315N737K808K6397j496j9621q517k3898
11852a6217P199Q752K0709Q071j0911j6974l969m854J2796J1632j6426j2458j0048
11839b2698j6414J3006j0l098q87M335N726k555Q920N170J4558m228O743Q898
11825A7466l621P052J5300J528R357P597l4327k7893o121l664j53J1936N284m37
11811f96j1462M332R907J1244k9490q399L1404M206P73j1743k4980j7813j723
11798d4440J1928J1700M538o413J2443J5219n36l5741k1999o612J312J5704J4987
$$ y = [-19451, -31104, -15934, -10063, -5350, 16661, 38853, 20292, 10791, 12192, -5523, -6354, 58, 35, 5946, 7913, 3400, 21550, 15678, 9191, 32745, 23798, 12205, 2709, -10799, -1843, 8925, 23085, 28443, 12572, -21565, -17433, -17942, 2373, 8110, 10918, 37315, 35819, 16198, 7681, -16217, -9018, -266, 20443, 28514, 17603, 629, -3340, -8194, 4602, 16234, -192, -12650, -22698, -39112, -26106, -26116, -29214, -30101, -25766, -20040, -22595, -13675, -8505, 6053, 1825, 8568, 17466, 13845, 20897, 36197, 37725, 47082, 54679, 20352, -7541, -13662, -17326, -17479, -5543, -259, -696, -12158, -7826, 2081, 13325, -16165, -24564, 6840, 11046, 11819, 76, -24904, -42717, -44440, -32512, -20812, -16274, -22687, -10244, 4975, 4439, -31302, -53301, -59913, -58601, -42897, -27910]
11785b7910k6717J2729K3727O271j475l871J4013M77m658l494m586l082J4760
11772c816m260l248K459l237j6434J2485J5730j2967j6756k4914j5212K4334K4216
11759b1620J8173Q718j1115n030J635j118o201j806J2423P52K430R29n933r553
11745a7316L737J4261M404m007k5099j3815l996J8806K9606J1891J803J0790Q810
11732C9875k7963k1125K3040J8007J726j8965k5199n66O480k647k497L2837j1617
11719A1386j8079l730j7137J6474J7282J5397j8784j8800K0986J5440n243j7168
11707a976m382p932J9859k6183n542K4512K6241R696j2453p389k1264j3155k94
11694b0262L12K0172j2106R459P090J7267K973j277j7284l4326J5479J2683R934
$$ y = [-27910, -54627, -41898, -18171, -11900, -13375, -17246, -3233, -2756, -7414, -10908, -15494, -18576, -3816, -8076, -11324, -8865, -12102, -28536, -16051, -321, -13288, -30044, -54958, -70170, -45836, -21620, -3447, 5271, -5844, -10874, -9239, -10357, -16558, -18364, -5941, -5189, -2759, -1830, -7763, -17316, -13579, 682, 5086, 1079, -24020, -37835, -41831, -23025, 6581, 18472, 20275, 31065, 39875, 11912, -9213, 13827, 31834, 33560, 14595, -10604, -11170, -4690, -7337, -9834, 23003, 11386, -6693, -10423, -27560, -11086, 6196, 21593, 2809, -15991, 4995, 20435, 15192, -1976, -6358, -14290, 5569, -20614, -26156, -1644, 24597, 34293, 21840, 14451, -6813, -19968, -20262, -19950, 222, -11884, -2425, 4665, 21932, 24905, 23628, 6344, -27982, -12503, 180, 10114]
11681A0114j4825l823R434q397m645m151R626M871j637l2j0922j8750N010K2429
11667e698M15m32J9752K1948L3j6175j9151j3270K0497J7269J307p112k4481Q898
11653C800m406j3110J0872P457j0916j9959J117m905o36K4070J0203r529J859
11640d083L519j794k559Q194J4548j3267j1533R232M97N109N481K627q870k1758
11626a4657O480j0324K584o93k0535N923J9854k822j895r500Q859P904j7835j2772
11612c9429M454j743n963J6304K1264J794k05m535n485R235r244R050N56j2657
11598a6604m363J5460O309p111n006j5858Q738J3516K198n162O915k094o050p087
11584a6199p14Q726q341j4593l4N262P494J6357j0171O973j1172L374J2957r77
$$ y = [10114, -4711, -8534, 900, -7497, -12142, -16293, -6667, -1796, -3433, -3465, -14387, -33137, -28127, -5698, -5283, -5715, 14037, 35985, 36018, 19843, 692, -12578, 7919, 25188, 26495, 19383, -5098, 3800, -606, -13716, -2844, 4613, -6303, -26262, -25145, -30050, -30686, -6616, 3587, -5942, -4083, -564, -2358, -4917, 3277, 17825, 4558, -6975, 2257, 2754, 7863, 13344, 15971, 7101, -14657, -8177, -18501, -15917, -16610, -37145, -31222, -11368, -14190, -16085, -25585, -16726, -8822, -26657, -39429, -34975, -36718, -42681, -26377, -5113, -3319, -3524, -8059, -13544, -4309, -13553, -4503, -3947, -16604, -20967, -5507, 802, -6309, -11315, -27173, -18435, -4919, -2721, -7883, -968, -3062, -9112, -16199, -16913, -8187, -16528, -31121, -31155, -25893, -18399, -2042, -12213, -5240, -16412, -13038, -81, -1058]
11570a058j5806l830N610L239J2331K5828j8030r250j762n652J5302Q270L003
11557A8195J2905L120n350k0468p991j1713P851p036N323M497k310m727L608J7845
11543A3749O7m779j8097j843K547l193n674j9502j122K279J7225J4975j4287m525
11529b2180L69o59K5540N692J590L628o909j0652j2016l672l334o782J0563K7638
11515H816j6184n559j646m498K1361o726k2960j7198J7479J8271M363k9918r425
11502d3824R422q322j505J2186L462J0280J1576o427P53J3757K0519J0404O529
11489C8810j6260j3112q841j1265j1717j2968k1518j027J5279K9504k607O958
11477h764K2861M554l59j8648j7234J5671l889Q846Q65j2399j9999L771J1644
$$ y = [-1058, -16864, -20694, -15084, -11845, 486, 26314, 8284, -966, -2728, -8380, 6922, 15192, 18195, 31100, 34220, 28870, 8402, 411, -11302, -3451, -10487, -5164, -667, -2977, -7704, -4096, 13749, 13816, 9037, -9060, -10903, -8356, -11549, -17223, -36725, -37847, -35568, -18343, -3368, -17655, -22180, -21811, -22470, 3070, 8762, 10352, 13980, 7071, -3581, -15597, -19269, -22603, -29385, -18822, 8816, -7368, -12927, -14573, -19071, 2290, -4436, -27396, -44594, -27115, -8844, -4481, -34399, -43824, -34402, -42724, -44229, -32043, -28581, -18301, -6725, -13152, -12399, 1358, 21877, 32281, 38810, 22550, 9438, 597, -10668, -22385, -35353, -56871, -57898, -42619, -13115, -15722, -8764, 14097, 18651, 18292, -356, -17590, -1919, -5808, 3038, 3903, -8496, -28495, -24724, -13080]
11464a3080O252R742R769K4159m428j5832L188J647n907m740J8635p312K0500
11451D2593N261j0798r436j4385j7481O345j0062q004n212M756J1340K092k829
11438e820j1394P274J4442N997j0366n414L1216p032o978j865j142J567k354J1320
11424A9451K590j1437r919j5867m976K4535P732j9793j4615l0325j2635K0076
11412d5183K3261j0152N967J7433k58j7285J0536K243L96K7491m315j0106o570
11399f542M898J4500j8122j4875P042J0483L991K525J4572J603j5384q119L294
11386a34J0565J5950r171o206k1664l357l536l638P106O738l772M221p690K112
11372a2476j533r207m170k456Q746K08j0894r17O882j177K2570L9902j5608j4664
$$ y = [-13080, -6828, 2914, 12683, 36842, 32414, 16582, 19770, 21417, 15510, 10770, 29405, 22093, 42593, 47854, 37056, 27620, 13235, -4246, 2099, -7963, -15967, -21179, -16423, -5083, -2991, -5820, -17214, -9940, 4502, 10499, 133, -5281, 25935, 18903, 11925, 10060, 8918, 10485, 8131, 19451, 22041, 10604, 685, -15182, -20158, 4377, 12109, -7684, -22299, -52624, -65259, -45183, -21922, -32074, -26107, -8674, -8932, -26217, -15681, -13438, -13042, 14449, 10134, 28, -6542, -1644, 12856, -5266, -20141, -13099, -2616, 1375, 3900, 18472, 20075, 4691, -3428, -134, 10431, 26381, 17210, 11004, -10660, -14017, -17553, -21191, -14085, -7347, -11119, -6898, -14588, -12476, -14009, -23216, -27386, -29842, -21096, -20888, -31782, -32699, -25817, -26994, -4424, 35478, 19870, 5206]
11358E206k724L958J5989p342k108n309j9169o440L54K0527l927j6546j3657J368
11344b9820K3965l559k396M030K7025J212N32j201Q851J3380n623J0666l2119
11331A4943j8492m253l813N327M193m686j8024J2083P107R563Q830R021l464p96
11317A7539j398L716M596K739k6662J4854J198o211j3586n29L1391N600o996m745
11303B1506m619l386k0393j701J1987R670J9109j3882n736J495J729k144p661
11290E974l1217M092K1401L5208j7646j1142j2281j000N219K831n567K805j339
11277b662k0J3987m706o427M220K5384p972q764J0924k4696k1651K18j5015p910
11263d5090J4426J0113K0938K509k76j7479j4788o804R31n732K262R500L1858
$$ y = [5206, 2482, 6440, 22429, 15087, 12979, 7670, -11499, -17939, -17585, 2942, -985, -17531, -31188, -29820, -5855, -9414, -11810, -7780, 19245, 20457, 20989, 19788, 28639, 42019, 36396, 47062, 14943, -3549, -7802, -11615, -6288, -2095, -6781, -24805, -12722, -5615, 3948, 12778, 21799, 18335, 17539, 16141, 19857, 24453, 27192, 530, 15384, 16582, 10371, -3215, -3744, 27647, 33247, 26251, 21506, 16887, 13501, -6892, -8593, 3394, 13064, 32173, 18291, 12555, 14050, 15779, 13635, 5974, -25243, -21151, 250, 35458, 17812, 6670, -5611, -6611, -1392, 1439, -4128, -1323, -2662, -2682, 11305, 6599, 172, 4392, 29776, 21804, 13040, 23964, -732, -22383, -22165, -37180, -45090, -30664, -20551, 387, 2896, 2620, -14859, -29647, -36451, -35520, -41252, -38990, -29490, 2368]
11250B368K552m351o272J1148p728j6669N535l725J550O534P851l477r946J187
11236a3443J3465p195j3281J0228R289K4632J7141r178n388l728l5425j3539J5876
11223a0546J1650q71M660n677R464O735n77Q801j3113j3258j457p736j0344j249
11209b3518K1745j3940j7032R064J3148K850k3609O414J2049j2944Q629J8707
11197A563J2804o403m731R164Q186j0054K6865J8059j8450k0644K0083R94o291
11184C1145k2998j07j9309J0579K4225q656k499J6497J114m792O803j5929k8951
11171a2878k0622J8246J0471J2157j0512j4327j858j0454J1483K1308r564J0915
11159D365P277j6722j0619p882L637j4347q220q667j7700K3098M2572P520J2221
$$ y = [2368, 4920, 569, -5703, 5445, -2283, -18952, -13417, -17142, -15592, -9058, -1207, -4684, -14630, -13443, 22, -7173, -20454, -10226, -937, 23695, 40836, 31658, 26270, 22542, -12883, -26422, -10546, 1104, 233, 4893, -784, 8680, 15415, 14838, 23639, 10526, -2732, -4189, -11925, -22269, -23518, -1773, -15713, -32745, -23681, -10533, -7683, -31292, -24878, -12829, -25773, -17144, 1563, 14367, 7964, 3233, 12397, 20583, 10529, 37394, 55453, 37003, 16359, 36442, 37436, 31145, 8147, 8040, -11269, -690, 23535, 14879, 12380, 28877, 29991, 25199, 32002, 16073, -12878, -33500, -15254, -4783, 7374, -3138, -17465, -19323, -29777, -18294, 3014, -6550, 4365, 11642, -5080, -15699, -23581, -19944, -34291, -42511, -51178, -68878, -45780, -3208, 4312, 16533]
11146A6533O614j8922l5J0501O04j2335j1246q200J2604R144N097R663J2248o049
11132B6221N578k893q989k3481j2667m691o026J2715k0132K7902O583N909N13
11119F542N038J2380j1333k6826p401r656k649K1005J0802l330k002J3948k233
11106D285L135j3503r814J5954J4274K6951J5474j8222J067k2995r126P614j4670
11093D24j2360L6j3729O681K4821p901M371J3594J2942J5527j5576M551j2953
11080B0428P240j9784l7480m351N425O664O289o495J1480J1658j0546j4156J908
11067b1720N30j1590o824J034L1509J5330j1999m348J0210L563r193L546N355
11054E403l1747k5554J6397L0599Q997P961P339j8573l2727R190L2156L266j3445
$$ y = [16533, 23147, 4225, 4190, 14691, 15295, 2960, -8286, -16486, -3882, 5262, 10359, 20022, 32270, 26221, 31799, 28906, 19917, -3564, -16231, -20922, -26948, -14233, -34365, -6463, 120, 6029, 6542, 11580, 23960, 12627, -14199, -21600, -31256, -33905, -12900, -2098, -5428, -7430, 6518, 4285, 7420, -6083, -15897, 57, 14331, 41282, 56756, 38534, 39601, 16606, 7480, 15094, 424, -11936, -11900, -25629, -18948, 5873, -2028, 2343, 15937, 28879, 44406, 28830, 33381, 20428, 27668, 7884, -29596, -33947, -28522, -21858, -15569, -22064, -10584, 1074, -9472, -23628, -21720, -21190, -32780, -39604, -38570, -7061, 8269, -3730, -8078, 2132, 5695, -3498, 48, 5403, -26344, -51898, -35501, -4902, 4095, 12056, 19395, 822, -31905, -22715, 9441, 12707, -738]
11041g38o597J5619p036j479Q386L8101J2972k4873q957q622r433j949N014J3098
11027B3506K475j19r525K318Q572m878j6905k2091k166j803J8702J1330P605k953
11013A4068j0820l826k2610o688n71O269J1786P012m054p49K5618n410j5884O281
10999D22J059l739j077j2113L274Q082P650n819m089p93J5901N601n053o555K5584
10984B8335O313k2105j4778j042J0406m239M0j7698k632K0602o898r587j846p954
10970b3083J6666J4545q347j0890k342R094k889j1112k033N324o619j4634o665
10957d2985L205q014J0072J8646j577J232O652k429N920K0759K1826N649j9390
10944A9566j3122j6331p252k978p14m001J3228m588M445J3230J848L5879l483
$$ y = [-738, -7335, 8284, 1248, -231, 8155, 46256, 59228, 34355, 25398, 16776, 7343, 5394, 10408, 23506, 25981, 25862, 16337, 18655, 27227, 22349, 5444, -16647, -18813, -20616, -1914, 9416, 17021, 14068, 3248, -578, -23188, -29876, -30447, -24178, -12392, -5380, -9434, -10183, 15435, 10025, -5859, 422, 1481, -2258, -3335, -15448, -12174, -4092, 3558, -2261, -6350, -7143, 8758, 14359, 9306, 2751, 28335, 34648, 12543, -2235, -3277, 7129, 2890, 2930, -14768, -17400, 3202, -3696, -13283, -15129, -23083, -6417, 8128, -219, -11109, -13451, -4357, -7246, -18358, -20391, -15067, -21686, -36320, -42985, -39780, -47794, -37722, -19076, -20653, -19421, -12769, -15198, -9278, 11481, 33307, 38956, 19566, 6444, -9887, -17139, -20117, -20831, -24832, -11604, -16192, -11747, 1483, 3331, 39210, 35727]
10931C5727q782r189j2728O233j9746j4888R394J9851k829k9199j9637J1197J2300
10918b2296O978P148j4383j094N503j1146j1998j368J2952J1914J4250q796R261
10905c075M239m647j7525K0390K4602k5612l0387M857j595P762q565R546P878
10892a2132Q548J9122j1292K588P069j6959j272L151m500J5511N352R818P803
10879C2807j1635J7567O343o164k0971M783q686p612q230k7986o887L6887M980
10866E196R720R276n189k5382j2110O69R65K689M602M135O362K119k5641j1425
10852c4014j6833J9228K4247j2893q863J2350P93m826J5347M271j6152j8866J8500
10839a7711J9937J597j8322p303K2739J3939J566k0736l813k688K7012J110j4492
$$ y = [35727, 26945, 17756, 5028, 11261, -8485, -23373, -13979, 5872, 3043, -26156, -45793, -34596, -22296, -15318, -8170, -22553, -23647, -18144, -29290, -41288, -42656, -29704, -17790, -3540, -12336, -3075, 1164, -3483, -21008, -618, 23984, -1628, -32015, -27158, -28753, -20991, -29556, -20010, -12132, -3584, 15538, 4246, 6834, 13903, -3056, -4328, -1177, -5677, 9834, 15186, 25004, 32807, 21172, 38739, 45082, 38918, 17947, 22730, 14044, 6432, -1798, -29784, -36671, 216, 5196, 14916, 24192, 19003, -6379, -18489, -17820, -16855, -14166, -9564, -5429, 933, 3052, -22589, -34014, -50847, -31619, -7372, -20265, -29128, -16778, -15985, -20811, -5464, -1193, -17345, -36211, -17711, 2226, 3823, -14499, -21802, 937, 14876, 16442, -4294, -8107, -10795, 16217, 17327, 2835]
10826B835l112K531j5420J584m461O439j0541l087j2852K4795M0779j7219j2767
10813d96L453j177J6092R028m959P961p664j5621R667l375r538r302m79J7927
10799A1517J4392l698j1193p864p129N022j3413j9999K2768P785o217p574O456
10786i147K7850J2005k8555j0306j0878j5738Q509j5297M666J9154p009j2080
10774c6826k028Q440O097m233J5996J3897J3318J0252j551k4810j803N0j1853
10761a5054O862K5478j823n836k3874j534j63M512j052J4332J2747k4559l1437
10748d1401p034J6898q68J7384q201J0864J9214k1008P659j271k458k078J8082
10735E782J4327j3629k4139p671J4302n714M867K6361o704j0548K303m264J4642
$$ y = [2835, -277, 2254, -13166, -11582, -16043, -9604, -20145, -23232, -36084, -11289, 29490, 12271, -496, 2957, 1780, 17872, 26900, 21941, 29902, 22238, 6617, 16284, 12909, 3371, -5931, -6410, 11517, 25909, 22211, 11018, 3154, -3975, 1047, -12366, -32365, -9597, -1812, -8029, -15603, -9147, 18703, 30708, 2153, -8153, -19031, -34769, -26260, -41557, -36891, -17737, -24746, -36826, -38854, -30414, -24317, -28550, -12554, 1343, 14661, 24913, 23362, -1448, -3251, -3201, -15054, -8192, 17286, 15463, 9627, -14247, -15781, -15944, -11432, -12484, 1848, 14595, -9964, -41401, -48435, -31537, -32405, -15021, -23222, -12358, 6856, -14152, -6493, -7764, -10222, -12300, 5782, 20109, 6480, -17659, -25330, -11028, -16742, -11875, 14486, 7782, -2766, -463, -4727, 9915]
10722I915J6675n532j1532m493J4713j6256j2680l400K9024N481l9919j2262Q948
10709b1318L361j470J0907P014k435p61p015J0271r063J4841J5405J3590r463
10696B3864j9941j2603n988R715j0286J714Q615k2753j7187J7501K4879J1140
10684H670R26p128P36j776r217O242L326N719k154J6866P017O990j9257j6576
10670C84R819o793j3493N298k2222N988p8Q705j387P301L981J3407J760j1300
10656A370l751q785j1035M896l176k310j210J4905J0270o281j0500p481j7271
10643d0359J2791O472p41o629J2658J2426j0568o523P203L7254L823j6882j1072
10630a47J872K3660Q085k700j978l6304l1735J1072J0877J8371K188q917J2310
$$ y = [9915, 26590, 21058, 9526, 5033, 19746, 3490, -9190, -12590, 16434, 21915, -18004, -30266, -21318, -17957, -19427, -8520, -1506, -3941, -4702, -11717, -1446, -10509, 4332, 19737, 33327, 23864, 3923, -8680, -14668, -4953, -15239, -13525, -4910, -27663, -44850, -27349, -2470, 8670, 9596, 2468, 3204, 1428, -7789, -1547, 1779, 7498, 5344, 22210, 29227, 36217, 16960, 384, 10203, 3410, -10083, -4785, -27007, -21019, -21097, -12392, -13779, -6478, -2497, 10910, 12670, 1370, -2381, -11166, -22201, -17305, -20481, -22791, -24001, -9096, 1174, -5107, -15607, -23088, -40359, -27568, -21096, -21837, -28466, -15808, -3382, -13950, -20473, -13270, 23984, 27807, 10925, -147, 1725, 25385, 33470, 30770, 28792, -7512, -39247, -28175, -17298, 1073, 3261, -5656, 6654]
10617F654O55n981j0277k9869j6194K8422K0265j2555n914J3286K8531k17l743
10604A3063o664j1403J8339Q525j6517l833Q410N113R417l021l4307l269j508
10591a7655J986K694J5899Q229K1449r766m692j2484k4219j0947q942N093L193
10578c0162K2053L877Q566k4017K4948J8824r71q247N990O839J938o19M743J480
10564C5242n990p094q832k0008r908K3497o999O51N518N629P457k783R228P338
10550C2946l1670k143N978j6406k01J4183j9360k1098l313K1352K6965k4236r633
10537b6636K4730R327j9201M134P044J0092J2568K362j700J0990r800j7744r092
10524b926j8825j7327K2712l76q935l576p939Q417K7198K9950m203k545k6103
$$ y = [6654, 7309, 1328, -8949, -38818, -55012, -26590, -6325, -18880, -24794, -11508, 17023, 16806, 13063, 6399, -5004, 13335, 21860, 5343, 1510, 9920, 15033, 24450, 21429, -12878, -16147, -17655, -15669, -12975, 2924, 11153, 32602, 22836, 18144, 5660, -18559, -29506, -38448, -33355, -30162, -8109, -4232, 4334, -19683, 5265, 24089, 23118, 14871, 20861, 27700, 29638, 29019, 33762, 35242, 29252, 22158, 13326, -6682, -16590, 6907, -92, 559, 6077, 11706, 19163, 16380, 25608, 32946, 1276, -867, 5111, -11295, -11496, 2687, -16673, -37771, -41084, -19732, 7233, -17003, -26636, -1906, 7421, -11780, -7646, -602, 9490, 22058, 24420, 22720, 33710, 23910, 6166, -2926, -21751, -39078, -16366, -16742, -25677, -29253, -37192, -28775, -1577, 28373, 24170, 21625, -4478]
10511d478m0634M264m824K0930J3100R257K73K973L159O432j2455n384r889r36
10497a8212J6958o752k5633J1940K8802P928o211O901m344l610K7106j6452j8320
10484A01K69j5510j4466K518L552K717K533L186P145P681K2067K528p542J7440
10470C4219N159j4381k3623j5753J115m171j4590Q366M0488N615j5883J46j0423
10457c716j0727R635j0044L0786J4851r154o65R153q213k5191k354O066K1948
10444B2375J976k4167j3635j8672J0221M516j0224r584J7877J1472J1300J449
10432D904R02J249k918n756J3987J3858m209k1323K1662J1172r514j0949n673
10419G392l92j4395J9835K5198j1387n789K4632j0462m186j4230j8492j0334J5550
$$ y = [-4478, -45112, -40848, -45672, -24742, -11642, -2385, -2112, 861, 4020, 10452, -2003, -7387, -17276, -18212, -1254, -8006, -33639, -21699, 7103, 15031, 8820, 15721, 11377, 7767, 34873, 18421, 101, 370, -15140, -29606, -27088, -23536, -20819, -18286, -15100, -7955, -274, 21793, 24321, 16779, 34219, 39378, 24997, 1374, -14379, -13264, -17435, -32025, -23659, 16829, 22444, 6561, 6707, -3716, -14443, -4808, -14852, 15934, 30785, 21631, 20966, 30119, 21906, -3285, -5639, 427, 22375, 24351, 184, -13451, -32123, -21902, -17386, -27610, -37194, -19317, -7845, 3455, 4904, 5806, 7055, 4137, -1619, 12368, 26226, 22017, 694, 22356, 33528, 24014, 13065, 7392, 7000, -7395, 12440, 37638, 26251, 20462, 45094, 34632, 30446, 16216, -2276, -12610, 2940]
10406B940N481Q386R883j3364o096l200q406j3215q904J0642K899j8456L002o497
10392c4905K2416K4822j8914j2475q150M273J5034l662J2896l806r898K035K4250
10379A3916L468k4676L708Q071k521k690q515j3339k270M64j0662O147L102q504
10365c4301K0715Q573J1666mj2676j8760jJ8437Q301K638N88K475Q462j1197Q056
10350A2972J2409r918j8500j0088o604J9552j775O587P207O493q197j7995j0786
10337a8643l601k105r120Q260K1465l740J2090J690j0194j4604J398Q929R065
10324H90K421M736k549M066m746j4589k8946j2079J4544J2000K983J7233J475
10311b561j348N042K0574q283m870j1058j7275P563j4784K1529K5372k4629R941
$$ y = [2940, 8421, 16807, 26690, 13326, 7230, 4030, -4376, -17591, -26495, -15853, -12954, -31410, -28408, -34905, -12489, 12333, -6581, -19056, -27206, -22933, -7899, -11561, 1335, -2471, -12369, -10334, 13916, 17384, -7292, -3584, 4487, 1966, -724, -9239, -22578, -24848, -24384, -35046, -28899, -25797, -34301, -13586, -5013, 6653, 6649, -6027, -24787, -24788, -6351, 1950, 4588, 5176, 7651, 16113, 4916, 12972, 25381, 15463, -3037, -13125, -19729, -177, -1952, 4635, 11842, 18335, 10138, -7857, -18643, -22244, -24349, -33469, -25209, -3744, -7484, 4606, 6296, -3898, -18502, -17104, -8175, 890, 3311, 8047, 5498, 9564, 4818, -9771, -38717, -50796, -36252, -24252, -21269, -4036, -2561, -3909, 1133, 21707, 13424, 8554, -2504, -19779, -12216, -27000, -5471, 19901, -4728, 5213]
10298E213j738K3641j2559j5810J192O93q900J3402p133p679O855l932j692J2931
10284D484k3688J551M295p821M589J45k228M145j4647j6146Q864R922J2597J0580
10270c358M33J5582j6221p972J736p70k1108j21N466K0645J9011K025j104k134
10256A2110k139q014j541J6074j3651n580J8272j3576m627O734J5438J3471M432
10243C7403j8025O388j4693p033P167o709j0065P650p74J7060K2968K044l1055
10230A2326J249r25L469N728m089p229J560k985j9408l541K873K275L166R785
10216D254l211J414P045j9062j1290m161q858p0r643K1907J7610N865j6510k5850
10202d0560l136K498m058L2845k681L726j877j1257K178J2985n93K3905p129l0528
$$ y = [5213, 3475, 27116, 14557, -1253, -61, 632, -8268, 5134, -1999, -9678, -2823, -6755, -8447, 4484, -19204, -17653, -13358, -21179, -16590, -16445, -18673, -14528, -29175, -45321, -36457, -26535, -13938, -3358, -2925, 12657, -3564, -11536, -9800, -10570, -31678, -31799, -26333, -5688, 13323, 15348, 14244, 12110, 9971, 1957, 416, 16490, 2839, -2741, 15531, 1955, -2672, 4062, 19500, 32971, 37403, 19378, 25766, 11073, 4040, 11207, 4498, -5567, 2083, 1309, 18369, 41337, 43381, 12326, 13575, 12650, 16119, 21847, 17758, 10529, 12089, 9104, -10304, -13845, -10972, -8697, -5531, 4254, 1043, 2457, 9502, -9560, -20850, -25011, -33869, -33939, -43582, -21675, -4065, 1800, -14710, -40560, -43696, -41198, -45256, -12411, -15092, -11366, -13243, -24500, -22322, -9337, -9930, 13975, 6846, -23682]
10188b3682n875J92R095R136R579J6418J0370k435j2189j8536j7263r181R320
10175b5051P992k59R168j3834k778O683l122j8527J3965N383P251k3810n699P744
10161c4894R450K1886O530K067j0507q491J733o311j5171j0737N007J1877K1048
10148f513N367l340J451j8686M411R830m933j8131m242j3767p997K673L3970M4078
10134B4171R064m711k4604l2377r582J0825k598O231J577J0307M11K655K254Q077
10120A700K3916k036j245M61M053j0841k0442k1212j5260r509P927K0308N123
10107a7057K1369r425J370m667q966P912j173j9850j3180j8923P215K3906m367
10094c5836M622K7900N593J6177l231j0133j6523Q692J3438J5383k16m075j5319
$$ y = [-23682, -29557, -29365, -20270, -11134, -1555, 14863, 25233, 22798, 10609, -7927, -25190, -34371, -25051, -17059, -17318, -8150, -21984, -24762, -18079, -21201, -39728, -25763, -20380, -13129, -36939, -42638, -34894, -25444, -3558, 2972, 5039, -5468, -13959, -12226, -18537, -33708, -44445, -39438, -27561, -6513, -1146, -4486, -3035, -21721, -17310, -7480, -12413, -30544, -34786, -48553, -56550, -53877, -19907, 24171, 33235, 28524, 3920, -28457, -38039, -27214, -29812, -23581, -22004, -11697, -11286, -8631, -6377, 1700, 25616, 23580, 22335, 22796, 26849, 16008, -4434, -25646, -40906, -50415, -42488, -22180, -17057, 4312, -5113, -3743, -8410, -17376, -9464, -10637, -30487, -43667, -62590, -55375, -31469, -35836, -31214, -3314, 2279, 18456, 15225, 5092, -11431, -2739, 10699, 26082, 25866, 21791, 6472]
10081F472p290k6073j8660k147J9781J1978o048O307N082J2156o22j572J4512
10068A3876N595n83j5809m062q299J4445K804R710N620j1218j6271P855P97K144
10054F604K0881m963K698J3937k61J1257K2006Q3623O3265K1590n4734n8056k7321
10041A00526j3197k4555k2186j3420K0968P742k0896l0616L831J7299O476r137
10029B2835O645Q989P895r542j2602k4034m897J4801J0027j4025j008r903j8721
10016b3540K0318M470j7090p471m780J5509P976j4680K495K856N269K683K1304
10003A5319L496k0984Q132J493q395K669p229L1287K756K741k5378l9185m809
9990c8087R920m630J3839J7673K2414j6964j9383R472Q271r359n82J1785J2998
$$ y = [6472, -818, -26891, -45551, -47698, -27917, -15939, -21987, -15680, -10598, 1558, 936, -636, 13876, 19471, 18888, 3079, -983, -9282, 5163, 7967, 17677, 23297, 12079, -4192, 3663, 4460, 6604, 27485, 22522, 25220, 39157, 38896, 50153, 72159, 155782, 219047, 240637, 185903, 127847, 100526, 87329, 62774, 40588, 27168, 48136, 55878, 34982, 4366, 8197, 25496, 31972, 22835, 29480, 38469, 46364, 36822, 24220, 186, -4711, 10090, 20117, 6092, 5084, -4819, -23540, -3222, 1248, -15842, -23313, -28093, -12584, -4608, -19288, -16793, -13937, -8668, -5985, 15319, 18815, -2169, 5963, 7456, -939, 1730, -5499, 25788, 28544, 31285, 5907, -33278, -38087, -28167, -32797, -18958, -1285, 21129, 4165, -15218, -5746, 2525, -6834, -7416, 4369, 17367]
9977A7367J895l4905j1504j0477J9318J4209k279J3594K3760M901j7186J125q582
9964A1236k081N199k693o291m136L299P858K428L32O012J1697J0066L970L7273
9950H4169K4156K7577M8339M7227O5824J41911K89955L84576K33513p9060k77732
9939I90455l14303k09573j35389j00986n8192m4007r807k1334m3558k1989O71
9928C1988J3691n915P865J7302k5409k6869n211O471l41J0205Q904j9801j4259
9915a379m171M407j0165O476K6673j1920j6630J7453j1198J034N163J4267r779
9902A0231q119J2331R63j1670j5306j7895r841r266J2855l413M4538L3027j762
9889C6673j8831M961N684j511k2043k1937J2442K682j8926O200J7993J918p233
$$ y = [17367, 19262, -15643, -27147, -37624, -18306, -4097, -6376, 7218, 30978, 35879, 18693, 19818, 11236, 9155, 14354, 11661, 5370, 1234, 4533, 12391, 14819, 15151, 21163, 32860, 42926, 46896, 84169, 108325, 135902, 184241, 231468, 297292, 439203, 729158, 1113734, 1347247, 1268187, 990455, 676152, 466579, 331190, 230204, 172012, 128005, 118198, 96864, 53306, 31317, 31988, 45679, 39764, 47629, 64931, 39522, 12653, 7442, 13913, 13572, 23777, 32681, 12880, -1379, -5550, -1143, -11308, -4832, 21841, 9921, -6709, 10744, -454, 580, 5743, 20010, 10231, 2112, 14443, 15406, 3736, -11570, -29465, -39306, -48572, -35717, -39130, 5408, 38435, 36673, 17842, 22803, 28487, 26976, 4933, -17004, -4562, -1880, -20806, -14606, 3387, 5305, -1928]
9876a928M424L2250m612q108M246l0500j654M243R600J378J0202J3133J7215n779
9862D4110j1657m332j981j0396j5016J1061Q011J0808J4827n81j0238j2998K642
9849B4260k389j284j1387k808J4187r307j5288j105q355L652K1614r282m979q636
9835a1107M219K0893N824m854j3754k1704O378o883J6605P857J132O965O649J887
9821B0107j0848q354R423k2571N556M291o680O149P745q269J2493R642Q798K0389
9807D7871j8530k0780j1350q907O312J62r604k062K8522J2539j214r948J4039
9794B7050Q744k8177l2709j0902L1054L8334O999k7728j2623j5182N579k707j7074
9781b9342l2l714J4968J8664n903R879M939L662L8757n734j3850j7167j7515J1971
$$ y = [-1928, 2496, 34746, 30134, 22026, 26272, -4228, -5882, -1639, 7961, 9339, 19541, 32674, 49889, 44110, 32453, 28121, 26140, 15744, 728, 11789, 19800, 30608, 45435, 44854, 34616, 21618, 24260, 21871, 20587, 9200, 6392, 20579, 11272, -4016, -5121, -13476, -9824, 11790, 2508, -2471, -11107, -6888, 14005, 19829, 14975, 1221, -20483, -14105, -20988, -4383, 3474, 4606, 11571, 18220, 20107, 9259, 905, 10328, -12243, -6687, -2396, -9076, -2927, 4818, -3451, 9042, 18684, 27482, 47871, 29341, 8561, -2789, -11696, -5384, -5222, -14826, -16888, 11634, 24173, 22959, 13011, 27050, 35794, 7617, -25092, -35994, -4940, 33394, 40393, 12665, 42, -15140, -9561, -12268, -29342, -29374, -33088, -18120, 544, -5359, 4520, 9459, 13121, 51878, 46144, 32294, 15127, -2388, 9583]
9767I583K40j4988R90R928j365j1266k3795O03j3775J279J2232J733q819K7856
9753i564K8731M711j0590j3034j4376j334K3706q773k103p152k9421M362K687
9740c2150L256o291j039J1560j224n651q788K5201o863o221J9185k0021n615J4541
9726b0120K00j1830Q72l300M0j8535J609k614n349N961J9511J8581K0812j994
9712C844Q448J0573J908J722J0622J373M095k2301j223j1671j3201k2138O37J2199
9698a5113O415l308J9525j00J8462k405j2895N882j2203J59p791o334J0693j3488
9684a2501j4799J1698k955R828m74n166K7011J297l8570j2464J9313J8989J0245
9671A1452j5687J8224J1338O94K938N297O757k208j6603k4557l5607J9572L2114
$$ y = [9583, 9823, -5165, -4175, 5753, 4388, -6878, -30673, -30070, -43845, -42566, -30334, -28601, -37420, -9564, 19167, 23878, 13288, 254, -14122, -15456, 8250, -523, -2626, -9778, -39199, -34837, -32150, -28894, -35185, -36224, -24664, -25888, -31539, -40327, -15126, -21989, -28210, -9025, -29046, -34661, -20120, -19920, -31750, -30878, -34178, -34138, -52673, -51064, -53678, -59027, -53066, -33555, -14974, 5838, 3844, 12292, 22865, 24773, 26495, 37117, 38490, 42585, 20284, 19061, 7390, -5811, -27949, -27312, -15113, -8698, -12006, 7519, 7419, 25881, 23476, 10581, 16463, 4260, 4419, -3372, -9706, 987, -12501, -27300, -15602, -18557, -8729, -9203, -14369, 12642, 13939, -24631, -37095, -17782, 1207, 11452, -4235, 13989, 25327, 26021, 28959, 34256, 41013, 38805, 22202, -2355, -37962, -18390, 13724]
9658A3724P136j1408j4376P023K596r469j7281k0022R56K5026J8331r365Q74J6370
9644A0115m752r999k4978K778K3629m624k170p54J6174J7793p537k5304j8705
9631b8334n888J5596J9263J7194J6103j1359l2930m853J8057q573j1547J767r134
9618b4638o086J0208J0152j4387k419J6791J1627J473K557n470q082Q014J1719
9605A1459M417j848k5843l981Q553j2415k508J1215o759r620N76R528J1761n900
9591a1365L731J8386J179J9652j4158j045R018j4395L201L478o217L134q054j1063
9577d518K094J1381J352n030o599O326J7477J2019p050k4527j4987K4166l359
9564H745p635J8037J3620J1091j2336j2800j9448m475L511J1103J7915J8170L299
$$ y = [13724, 20860, 9452, -4924, 2099, 4695, -4774, -22055, -42077, -41121, -16095, 2236, -7129, -6255, 10115, 5363, -4636, -29614, -26836, -3207, -7831, -10001, -10755, 5419, 23212, 15675, -9629, -28334, -34222, -18626, 637, 17831, 33934, 22575, -10355, -15208, 2849, -5724, -17271, -15504, -24638, -30724, -20516, -10364, -24751, -27170, -10379, 1248, 2721, 5278, -192, -8274, -260, 11459, 15876, 14028, -11815, -15796, -7243, -19658, -22166, -10951, -17710, -27330, -26754, -17226, -5465, -11365, -7634, 10752, 11931, 31583, 17425, 16380, 25398, 11003, 14204, 17682, 11465, 14599, 6545, -4518, -2424, 8957, 10309, 5279, -1320, 5006, 22483, 34502, 27452, 2925, -12062, 12104, 8745, 1110, 19147, 32767, 43858, 31522, 18722, -726, -5201, -1690, 9413, 27328, 45498, 48797]
9551D8797j5294j1375j3096J0116j8759j487j1324J1355K4982L450r863P313P750
9538C2565k443r656k859l79j3305L383Q043k564k1354K3313L1322r153k4799q161
9524C953J2453J5741J3621o024L80k4618q443j395p688j935K1187J1412j0525
9511A8119j0901j9850j5780J1522L7180L856j9089R568J9577k2764j3368p679
9499i609J2887j6129j0275j813K5202L366K214k147k3621k4011j313K9546J1306
9486d397m3P633L891N524j07M10Q377J151p945n107j9595n047M462K0044k0395
9471a1144j3677J9563m417l77P771o90p544P853K7069K492l7120Q068K624j9982
9457a9511M049K360o651o248K3426j782p129k5055m959P218K8058j6876R211K2054
$$ y = [48797, 33503, 22128, 9032, 19148, 389, -1098, -12422, -1067, 23915, 27365, 17502, 24815, 32565, 30122, 20466, 17607, 17228, 3923, 7306, 15349, 12785, -8569, 14744, 46066, 36913, 12114, 3953, 16406, 32147, 45768, 39744, 40124, 15506, 7063, 5668, -2020, -3955, 17232, 28644, 18119, 7218, -12632, -28412, -16890, 20290, 24146, 5057, 14625, 34202, 11438, -1930, -9609, 3278, -12851, -23126, -24939, 263, 3629, 5843, 3696, -19925, -43936, -45249, -15703, -4397, -4440, 3193, 7084, 12608, 12501, 12911, 21288, 22439, 14494, 9387, -10208, -15255, -10793, 9251, -11144, -24821, -5258, -9675, -10052, -2281, -2971, -10515, -2662, 24407, 26899, -10221, -2153, 471, -19511, -15462, -13102, -19753, -26001, -2575, -4357, -11486, -36541, -41500, -34282, -6224, -23100, -13889, 8165]
9443H165o447j3683j7719L5840J8063j4312p757l401M238J762r89p546p622J0671
9429g37n961r475p742Q310K7263J0545m244J500k6439j4473k032K669r352j059
9415c1227J1316J3662K7360j0243k1385r939j6640K518J4732P912Q701P844p829
9402c218l949O681K937p487J3737m357j2004J3248j458j2123R606O090n604J0276
9388A2375O478l247j6691O568N301J2080o392k4427K1468K74l128m770L960K8393
9374C8242r739j6477r982J0755K693m416n485j8338K361J487P213K38j545N320
9360B327o538N775k329J2238J039j6598q580R062j3002o70R992M641k0158J1528
9346a1273K306K7710K4641j1599j1753p479N419j3320k1505j9476k1581j4311
$$ y = [8165, 1718, -11965, -29684, 6156, 24219, 9907, 2150, -1251, 2987, 4749, 3760, -3786, -11408, -737, -6698, -16173, -23915, -15605, 11658, 22203, 17959, 19459, -6980, -21453, -23485, -20816, -30168, -31227, -19911, -6249, 21111, 10868, -10517, -20456, -37096, -34578, -19846, -11934, -3233, 4611, -3218, -7167, -486, 2451, -5036, 8701, 4344, -7660, 5588, 4130, -7993, 1613, 7703, 2099, 12375, 18853, 15606, -1085, 5483, 10784, 22864, 16472, -7955, 13513, 13787, 10659, 5889, 9849, 38242, 28503, 12026, 2044, 12799, 15492, 11076, 5591, -12747, -10386, -8899, -1686, -1448, -2993, 2327, -4211, 1564, -765, 11473, 12512, -4086, -12666, -3604, -16606, -17276, -7284, -2643, -22801, -11273, -8967, 18743, 43384, 31785, 20032, 12553, 17972, 4652, -16853, -36329, -57910, -72221]
9334g2221L604K0521L0277J7355K4181j4892j7983K9498J1298J1966j6844n452
9322B1308j0377K124J1558L712k354o117l883l863Q171M975p125j4892k4467r59
9308b2189J1663J7784P75P466j0019j8214l234O367J1174m298j3489k851Q433
9295a0632r154l294J0340J4329j6559Q042J1220p801r928j3974P737P921L955
9282g798o414L826J5196M48j3977J6426M128j8466j2941j7958m242K0057K037
9269a9678q931O372L7367J3710j7220J7935J0110j5602j6033N805L047j3558Q547
9256A1871M20o552r982k449r270n893o462K3441j208J2848l287j6103q947J6939
9242d634K1977M683R010l594m641j814O957J490M619r049P808m911k3191q571
$$ y = [-72221, -68617, -48096, -17819, -464, 23717, 8825, -9158, 20340, 31638, 43604, 26760, 21308, 10931, 13055, 24613, 28325, 25971, 19854, 15971, 12108, 20279, 25254, 18129, 3237, -21230, -22189, -10526, 7258, 8033, 15499, 5480, -12734, -15968, -9601, 1573, -2725, -16214, -19065, -10632, -19786, -23080, -12740, 1589, -14970, -6928, 4292, -3509, -13437, -27411, -19674, -11753, -7798, -14212, -10386, 4810, 5258, -8719, 7707, 11835, -6631, -19572, -37530, -41772, -21715, -19678, -28609, -22237, 15130, 28840, 11620, 29555, 39665, 24063, 8030, 13835, 16882, 3324, 11871, 12291, 5739, -4243, -6692, -15962, -21855, -28317, -4876, -6084, 6764, 3477, -12626, -21573, -4634, 17343, 22026, 31036, 27442, 22801, 20987, 27944, 29434, 34053, 25004, 32812, 27901, 4710, -3861]
9228c861J774P576J1977J6841n441m937r797k15J88j069M036j3537m462r937J8834
9213G970M0406J2197m957m707j2217l7105j2623J4411O087p236o626q588K405
9200a0583J4370O590k388O679Q86j0555J7226J8314j2299j4976J4497L5257j1574
9187E1444j9984J5742l799j8327k827K4827O644j2427P053n373j9015j8772j8186
9174a3000Q811J065K615L1569L0964J5552r823l1290j2590J7098K6865Q31J4269
9161H2936M166K7722K3589M335K3281L3065j083J2635L2279J6685L8047Q7401
9149C85058J11668J23294J93153K83260M75611Q79726J688444L102879L332672
9140A0575765N90847j997449k840783k213436j381188q19335m91011l01941k10749
$$ y = [-3861, -2087, 5489, 17466, 34307, 28866, 23929, 14132, 13917, 14105, 13036, 17072, 3535, -927, -10864, 7970, 48376, 60573, 55616, 50909, 38692, 1587, -11036, 3375, 9462, 2226, -4400, -12988, -10583, 3787, 10377, 7989, 14668, 15554, 4999, 22225, 40539, 28240, 13264, 27761, 63018, 51444, 31460, 47202, 43403, 25076, 22249, 47076, 53720, 41293, 48346, 42973, 23958, 5186, -13000, -4189, -3124, -509, 31060, 62024, 77576, 67753, 36463, 23873, 40971, 67836, 68667, 82936, 87102, 114824, 138413, 142748, 166029, 199094, 198011, 210646, 242925, 259610, 297657, 385058, 496726, 620020, 813173, 1096433, 1572044, 2451770, 4140214, 7243093, 10575765, 11166612, 9169163, 6328380, 4114944, 2733756, 1914421, 1423410, 1121469, 910720]
9131I10720j50535j08456r5093r3608o2881m8741m9305m9845k3172M3l2299o472
9119A90356p125j3330k667j8990j9923l714j3805l5050o74J1713K204j3055j9890
9106E6050k2107K077K1296J7276r572N174p246k175J2756k1701j2774p255j0365
9093B1434R813K668j3312j1545o693R057N529O73n73J0624j4540j0388j8800j2094
9079b8147Q933J5771P368k182N321n562p44N058L135P500j207Q518J7831j6811
9065B4782n984n919j9766J1122L4481m493k6605j5216j6649M177Q780J1772q19
9052c37n709o12Q738q280q925J1079J1923l657J1360J241R046K548k2770J1028
9038A6673j1648q226l063J542j861j2816o320l0560N940K9903M1287K288l85k1822
$$ y = [910720, 760185, 651729, 556636, 463028, 400147, 351406, 302101, 252256, 229084, 229127, 196828, 190356, 183231, 169901, 167234, 148244, 128321, 124607, 110802, 75752, 75078, 86791, 88995, 75940, 56050, 33943, 36020, 57316, 74592, 65020, 70194, 62948, 60773, 73529, 51828, 39054, 31799, 21434, 31247, 33915, 20603, 9058, 2365, 11422, 16951, 17624, 17051, 27675, 13135, 2747, -16053, -28147, -19214, -3443, 3925, 1743, 7064, 1502, 758, 5816, 8951, 16451, 15244, 23762, 41593, 24782, 18798, 12879, -6887, 4235, 38716, 34223, 7618, -7598, -24247, -20070, -11290, 482, -337, -6046, -6658, 2080, -6200, -15125, -4046, 7877, 4220, 15580, 16821, 25867, 28415, 5645, 16673, 5025, -3201, -6264, -4722, -6583, -19399, -25719, -56279, -50339, -20436, 20851, 23139, 22754, 932]
9024I32k2982k663J855J3615J7926p557m0838k866P536J5983K4932Q776M325j560
9010A7414R357J2745O274m86l2712o194J519q700j4182j0482J5934J4015j2984
8997h482q165K2494K1698Q18p67j4909k558P007L306J8019J5065N078J1182P292
8983G7078j1897k5367l1808j1267j851n013j0807j007K4192k238q177J5542P292
8970A4672o514k0704o813J5485Q769P762j5282m973j269P463p519k343R772r400
8956a0894K0602J0210l485l301n418j3964Q847O153k17n432o799L502j916L897
8942A785O822q258j5943Q225J9020j7351k9584P80J8121K898r852K1958J1855
8929A0476J7147k510N040l267j5248J877J366j1719k258Q987k0980J781J0809
$$ y = [932, -22050, -24713, -22858, -9243, 8683, 1126, -39712, -42578, -35042, -19059, 5873, 14649, 18974, 17414, 26771, 39516, 45790, 45304, 12592, 6398, 7917, -783, -14965, -25447, -9513, 4502, -8482, -16647, 5847, 27545, 28363, 27596, 12687, 10129, 17136, 20442, 38461, 53526, 58604, 69786, 77078, 65181, 39814, 8006, -3261, -5112, -10125, -20932, -21939, 2253, 15, -8162, 7380, 14672, 8158, -12546, -19359, -3874, 4895, 12657, -2625, -7598, -8867, -1404, -8923, -11266, -1494, -10894, 9708, 19918, 16433, 13132, 7714, -6250, 2597, 8750, 8533, 3101, -3698, -196, -2112, 1785, 8607, 349, -15594, -7369, 11651, -5700, -35284, -34504, -16383, -13485, -23337, -1379, 10476, 27623, 25113, 30153, 26886, 11638, 13515, 14881, 3162, 904, 9891, -11089, -9308, 1501]
8916A501o003N561N566P743R576Q949k5512o587J7346j1680l4498p292J8688Q443
8902h199j8897n692L3163l623L113L443l0783R912j2452n781l895J3296K7402
8889A007j4304j6533J7922K1427L148R233p141j0786r385j9565J0112Q25L447
8876a0593J1283M686p690q094R124k536M16l903J01J5151j7546j2536J5561P952
8862A376O934J5874q406l989j3554m09j3857o483N145P522k553J7455K4413j3971
8848A5497k3229j5188P943R997Q734j554J9365J7352r115k1047J1114J8861q00
8835C7930o079n53j4562j9241n200j0352j9829l747J9329Q089j421J5159p395
8822g872q356P025O538J9320q739q995J443N116P421q28q243j3427P966Q966K5969
$$ y = [1501, -4502, 1059, 6625, 14368, 23944, 32893, 7381, 794, 18140, 6460, -28038, -35330, -16642, -8199, -27096, -32788, 375, -3248, -135, 3308, -27475, -17563, -30015, -35796, -39691, -26395, 1007, -13297, -29830, -11908, 9519, 12667, 21900, 14759, 3973, -5412, -24977, -14865, -14040, -10593, 690, 5376, -2314, -10408, -1284, -3820, -3404, -7307, -7206, 7945, -9601, -22137, -6576, 1376, 8310, 24184, 15778, 11789, -1765, -2174, -16031, -22514, -17369, -9847, -12400, 5055, 29468, 15497, -7732, -22920, -14977, -4980, 3754, 2200, 21565, 38917, 29802, 8755, 19869, 38730, 37930, 31851, 31298, 16736, -2505, -7705, -18057, -37886, -41633, -22304, -14215, -15636, -477, -7872, -16228, -9203, -2665, 16655, 7916, -1079, 364, 5480, 12901, 12073, 3830, -9597, -1631, 7335, 33304]
8807C3304Q668j8334j9903j392l272n606Q70l831J3793M059k7527j9217k888Q99
8793d0377K438J2475J2943j1559J3536M212K694r790J5147R818j3329r412M584
8780f620K2426K1523m162n355j043j1636q470o983P407P238l73j2126n727K3009
8766A9108L79k362q348J2808Q484P418Q71j1664J362L285O267K6259j3082j5727
8752C5058m86k3251k1651k3457o087L7353J8231j028j4849K096Q296J3950R55
8739B5130Q942J0751J8605Q773j8898l052j5994k0102L683Q856Q030P489m200
8726C8013j7392j2644j8930r541J124J1428J583K8057m04j0158j5305J5089N845
8713A6765l307J1112J655j7498l0078r519p18L057n865k993M425R347L4117L071
$$ y = [33304, 41972, 23638, 3735, 2343, -929, -6535, -5665, -9496, 4297, 8356, -19171, -38388, -41276, -40377, -37939, -25464, -12521, -24080, -10544, -6332, -3638, -13428, 1719, 11537, -1792, -11204, -6620, 15806, 37329, 33167, 27812, 26769, 15133, 6663, -320, 7087, 14325, 13952, 1826, -3901, 19108, 19487, 17125, 8777, 21585, 30069, 37487, 38358, 26694, 28056, 31341, 37608, 63867, 50785, 35058, 34572, 11321, -10330, -33787, -39874, -2521, 15710, 14682, -167, 1929, 10225, 24175, 25130, 34072, 44823, 63428, 72201, 53303, 50251, 34257, 14155, 17838, 26694, 34724, 42213, 38013, 20621, 7977, -10953, -20494, -19370, -7942, -6359, 21698, 21294, 11136, -4169, 10920, 16765, 13458, 24570, 26225, 8727, -21351, -30870, -31588, -28531, -34396, -37389, -32964, -23617, 10500, 13571]
8699A3571j5930R515K1580j4757j5838j2983R873K3325L112k1398K197Q761O2
8686A1090o81j2064j7509j3418n443L3513P233l519j5212L235m096K3950J1783
8673A8862K017N041j709n735l319q482K408M486j7896m608l380J1945J1420j5315
8659d265q227L0025J1321k7172j2855j0164r376o05j294J4157J7963J4489j393
8646A2604M402P217R18n590P556R050j5495n862J4816J6281p919j0357j5101P31
8632A3251j9391m870K5653K9091l418o837L803q603l171o468l734q805j516l728
8618A257l729K5562J99P723J089K2979m104l1851O401J1825N78L35J8713m085
8604E2892q493m143R260O520m651r523o937k7876J6002M0842J7328J1749K449
$$ y = [13571, -2359, 7156, 28736, 13979, -1859, -14842, -4969, 18356, 21468, 70, 2267, 11028, 11090, 10409, -1655, -19164, -32582, -38025, -4512, 2721, -798, -16010, -12775, -16871, 7079, 18862, 20879, 25920, 24211, 18476, 15157, 6675, 9083, 13569, -4327, -8935, -12315, -370, 11050, -4265, -12492, 17533, 28854, 1682, -11173, -21337, -30713, -31318, -32612, -18455, -492, 13997, 12604, 17006, 24223, 25141, 19551, 27107, 36157, 20662, 14800, 29616, 45897, 37978, 27621, 12520, 13251, -6140, -11010, 14643, 43734, 40316, 33479, 37282, 28679, 25508, 19040, 15306, 6501, 4985, 1257, -2472, 23090, 23289, 31012, 32101, 55080, 50976, 19125, 25526, 37351, 37929, 38264, 56977, 52892, 44399, 40256, 49516, 56036, 51385, 41862, 34925, 7049, 23051, 63893, 81221, 92970, 95419]
8591I5419K0648K5077r916j5072j2825l397o619j4430r804M790n911l1437p061
8578B9462R838P355k504l0445j2805l425k967M717M099L0681M603q486j0439J218
8564B0902n750j0590k4459J6505K6708M743k5066k3045L866N61J9467R149o410
8551F581K2985O299k6040P11O666k2666K430l710Q38K9853J8798k669m500j0484
8537B5092k4017q647O412O783k455j3726k763K6724J818k4967j7522m117J9071
8524a2314N077P767J0667o179k6880l4010L373K5559J4940N28P439J2595j993
8511F569n055J8617K6514k2447j4953J5421K101K306j0953k586K997q409O4N107
8497A5293j3626j1289J6279O043o351N214J2700N706J5920m34k6457p488Q694
$$ y = [95419, 116067, 141144, 131228, 116156, 103331, 99934, 93315, 78885, 69081, 73871, 67960, 36523, 29462, 39300, 46655, 44151, 13706, 901, -2524, -5491, -774, 3325, 34006, 38609, 30123, 19684, 20902, 15152, 4562, -19897, -3392, 23316, 28059, 2993, -20052, -16186, -15625, 3842, 12991, 6581, 29566, 35865, 9825, 10536, 17202, -5464, -3034, -6744, -5906, 23947, 42745, 40076, 35576, 25092, 1075, -7572, -1160, 5623, 3168, -10558, -13321, 13403, 15221, -9746, -27268, -31385, -12314, -7237, 530, 11197, 5018, -21862, -55872, -52499, -26940, -12000, -11472, -4033, 8562, 6569, 1514, 20131, 46645, 24198, 9245, 24666, 26767, 29073, 18120, 15534, 18531, 10122, 10186, 15293, 1667, -9622, 6657, 12700, 6349, 11563, 24263, 29969, 45889, 45455, 18998, 11510, 20204]
8484B0204r982l613p041k0964k1411q687J6070J6262Q381n915j1370Q931Q567
8471a0568J4896J9824J6230l862J7954j2403j6924k3117R706L97j0655j2835p404
8458a8761j810k932K0844J7831j7770k9577O062L1501L338q315j0620J9798J0600
8445B0189j2609R324O661j090j244J9219R618k765l3345j1292N614O314Q318J9024
8431D1936j1422K917Q376q320j8927O879K0245m47n929M126j5636m4534M792r123
8417b5067K8789n37p913J0093K8816L54m0147j6891J0346M110P124j226O312n411
8403a248r819l100J7665j5414k7410R716K0412m49q597K336N001M504K1947L859
8389A9403k3814Q994j786o886K3300k439j2625r272R860K713K399r010L081j9763
$$ y = [20204, 10222, 6609, -432, -21396, -42807, -51494, -35424, -19162, -10781, -16696, -28066, -19135, -10568, 4328, 24152, 40382, 36520, 54474, 42071, 25147, 2030, 11736, 12133, 1478, -11357, -18761, -20571, -23503, -2659, 15172, -2598, -32175, -26113, 5388, 8726, 411, -10209, 9589, 20189, 7580, 16904, 23565, 22475, 21231, 40450, 50068, 47303, 13958, 2666, 8280, 14594, 22912, 41936, 30514, 33431, 41807, 33487, 14560, 21439, 41684, 41237, 35308, 39434, 23798, -20736, -15944, -25067, 3722, 3185, -4728, 5365, 34181, 34535, -5612, -22503, -12157, -8047, -923, -2149, 4163, -1248, -11067, -14167, 3498, -11916, -39326, -29610, -9198, -9647, -18244, -15908, -10907, -6403, 15544, 19403, -4411, 4583, 2797, -4089, 19211, 16772, 4147, -5125, 4735, 7448, 9847, 837, 3918, -15845]
8375a5845j4790K564O704j490j547L1575J7071J2546j8278j440m63j2140J6423
8362B0890J3794K492J2648R70J2507o208j4589N70q472q110r407j6394j9044J9474
8348A121J7951M574q802m922k6581j587r948n033M3889R64j8419J8945J3399m977
8334B0574l051M153k0225R43K9672Q477j5273j2540n908k2961k5718N953J3869
8321b2035k841k70J0820R773M788j4946J3655r352j292J7619J5441k499l138j1703
8307D020l239J5153L416p753p213K602k2230J51J1146o340k4184R664L480n779
8293b7106r001K2980J7437K3622J3895j6357j5978j5100P818J9599K074J826r844
8280A5865n297o335q551J1036K081j0745o145p153J0686K0481l856j4148j2324
$$ y = [-15845, -30635, -28071, -21367, -22857, -24404, 7171, 24242, 36788, 18510, 17070, 16607, 4467, 20890, 34684, 37176, 49824, 50794, 63301, 57093, 42504, 43074, 34602, 26492, 17085, 691, -18353, 1121, 19072, 23646, 14844, 9922, -16659, -18246, -28194, -33227, 10662, 11626, -6793, 12152, 25551, 20574, 17523, 21676, 1451, 2394, 32066, 40543, 25270, 12730, 6822, -16139, -41857, -35904, -22035, -24876, -25146, -14326, -4553, 235, -14711, -1056, -10408, -11700, 5919, 21360, 18861, 15723, 4020, 781, 15934, 19350, 11597, 4384, 6986, -15244, -15093, -3947, -10287, -34471, -24807, -21327, -27106, -36107, -13127, 4310, 27932, 41827, 25470, 9492, -5608, 2210, 21809, 23883, 25709, 15865, 10568, 4233, -4318, 6718, 8799, -1946, -8091, -15244, -4558, 15923, 12067, -2081, -14405]
8267a4405K4280J2839K608j0201n722l5826j4639R787Q697j0212j6786r931Q162
8254e1349K0042K2206J5815M490p053J7540L6397o470j2526j9840l1488O722R467
8241C953Q995k424K703j1757q051r375R365O216q491k6218j7139j0525J1504J5357
8227c5887K4242N070O587m142Q279K6298O602m8511o519R656J937k647l545o974
8213a9554J8526K8540N87P719L505k8032l1777J6988J8028J943n104k2672J222
8200a0081j1486J4526J9180l2472k1505P318J9053L7362J0221k208M737J5744
8188E0389j9440l12j5186k5074j6333K885R960J0060k33M109n204J457p774L365
8174g331J3953j7534j785n23K1835m079j1120J7590j9783j6573P227P661O234
$$ y = [-14405, 9875, 22714, 25322, 15121, 9399, -26427, -41066, -31279, -22582, -32794, -49580, -59511, -51349, -31307, -9101, 6714, 11204, 4151, 21691, 58088, 51618, 39092, 19252, -12236, -5514, 3953, 12948, 10524, 13227, 1470, -6581, -15956, -6591, -375, -8866, -35084, -52223, -62748, -51244, -35887, -11645, -6575, 12, -4130, 4149, 30447, 37049, -11462, -17981, -8325, -6388, -9035, -12580, -19554, -1028, 27512, 28099, 35818, 39323, 11291, -20486, -3498, 14530, 16473, 11369, -11303, -10081, -21567, -7041, 12139, -20333, -41838, -34520, -15467, 21895, 32116, 29908, 34645, 50389, 30949, 30637, 15451, -9623, -25956, -23071, -13111, -3051, -3284, 825, -4379, -2922, -10696, -7331, 6622, -10912, -12697, -13220, 8615, 4536, -6584, 11006, -8777, -25350, -18123, -10462, -4228]
8161d228J6667P73j2900k7742j390K6022L203R607k106P545r76P173J8316J1944
8147E1908R023n2K2198Q287k4019k8359j2093P610m645J3737J8865q079k656j6570
8133C5155k4957K558K669p013q769l449J7456M89P473Q695O425K1569j3366j1568
8119C3367j0092j883j0780j2047M845J7918R171l263j2977P7M579K5644J4815
8106E9374k2173k8361Q264J8667O601n699J8261j736k9824m004J7728P186o675
8093C7609j4338m042L363O424J6137K996k1714l191j9331j0090j3342K2845O22
8080C948o169J3843j0630n528J8191N610P895L593r667M251O207m532j9171k124
8066E717J8550J5534L706L887r341k9467k8185J6077K4305J8022K446j4649l0275
$$ y = [-4228, 12439, 13212, 312, -27430, -28820, -2798, 405, 10012, 7906, 15451, 14475, 21648, 39964, 51908, 60931, 60879, 83077, 91364, 67345, 38986, 26893, 34503, 29858, 43595, 62460, 54381, 51725, 35155, 10198, 12756, 15425, 8412, -357, -3806, 13650, 14139, 21612, 30307, 36732, 58301, 44935, 33367, 23275, 21392, 10612, -1435, 3410, 21328, 30499, 27236, 14259, 14336, 18915, 44559, 59374, 37201, 8840, 17104, 35771, 42372, 36673, 54934, 53198, 23374, 19370, 37098, 44284, 37609, 23271, 19229, 22592, 29016, 45153, 48149, 26435, 23244, 3913, -6177, -19519, 3326, 3948, -2221, 11622, 992, -4536, 13655, 19265, 27160, 30753, 21086, 25337, 31544, 27012, 7841, 5717, 24267, 39801, 43507, 47394, 38053, 8586, -19599, -3522, 20783, 38805, 41251, 26602, -3673]
8053c673j268J3379J1833R329P53J010l633j1366l247j1602Q457k0373K48J7708
8039G555M835k4460P394K8760L366n918J0086k207N041j15j7351j4504j055J2557
8025A3984j0872p802l33M315m369N799M938P560r822r178K133M489J4228j914
8011A3156O535J1820j3636j1663q438J747j3963j103O642O929P464M124P893K5424
7997D2931M040j5971j7558K1118J7470M140L50j1625k3281l1091R708J0811j2327
7984a285O6k578P721J3362l826J273J1015j7277k455J8873n487j1592N782j5654
7970b062J35K3024j6424J4633J6425j5656r23P568j0562k4985J9418J947J6r393
7956C161O392M65o245q982j2095M949k732P069K5567J2768M916j6782L361k1875
$$ y = [-3673, -4941, 8438, 20271, 29600, 30353, 31363, 27730, 16364, 13117, 1515, 9972, -10401, -10153, 7555, 12390, -12070, -4676, 24084, 27450, 21532, 31618, 29411, 34452, 34337, 16986, 2482, 1427, 13984, 3112, -4690, -5023, -708, -5077, 722, 5660, 13220, 3398, -5780, -3647, 842, 15070, 13156, 19691, 31511, 17875, 6212, -2226, -479, -14442, -15545, -8903, -1974, 5490, 9614, 17507, 42931, 46971, 31000, 13442, 34560, 52030, 56170, 56520, 44895, 21614, -9477, 231, 11042, -1285, -1219, -3797, 3924, 17286, 13460, 14733, 25748, 8471, 6016, 24889, 19402, 7810, 13592, -2062, -1927, 21097, 4673, 19306, 35731, 20075, 19152, 26720, 16158, -8827, 10591, 12538, 12554, 3161, 9553, 10018, 3773, -5209, -17304, -12355, -15087, -8018, 17549, 30317, 35233, 18451, 21812, -63]
7942f3m126L0001Q517k6251q981m106J558J0444j2899J5488o589N12J6796l367
7928A6934m119j0897j545k184j6488K5982M335j2728j2807m241j4855P781K0792
7915d040l337j1668L360L0095J1460M208P002o412R127l442k3029l5857J914M871
7901a5748N825n151k5501J7083P44n033P857P90L0365K0065m417j3126J7153K3466
7887E4372j1915l1167k0328j7643R858J4427K1878n388o668j0701k377J4655r266
7874b63Q823p638q633K4931J1946N397p125j2230K05J8091j233M279R221J041
7860D6812L723k5848k2889N9q30r646N415O213M388R929l357l4654j3782R654
7846b4813r863J1892k103j1767J5977J1217J3574j0118P691J7554q386k3222k2201
$$ y = [-63, -4189, 25812, 34329, 8078, -903, -5009, -3451, 6993, -5906, 9582, 2993, 3505, 20301, 16934, 12815, 1918, 373, -1811, -18299, 7683, 12018, -710, -13517, -17758, -32613, -24832, -4040, -7377, -19045, -15685, 14410, 25870, 30078, 37080, 30668, 39795, 36353, 13324, -22533, -20619, -15748, -9923, -15074, -40575, -23492, -22748, -27781, -19924, -19134, 11231, 31296, 26879, 13753, 30906, 54372, 42457, 11290, -9038, -26681, -16823, -2396, 19482, 14094, 7426, -3275, -5652, 9003, -263, 8560, 922, -7711, 17220, 29166, 34563, 27438, 15208, 15413, 33504, 32271, 36550, 45771, 46812, 50535, 24687, 1798, 1857, 1027, -8619, -3204, 3009, 7397, 17326, 13969, -20685, -34467, -24813, -34676, -22784, -24887, -36654, -20677, -9460, 4114, -6004, 1687, 19241, 10855, -12367, -34568]
7833c4568N438J6100n008r794j7790K2882J0795p930j3768K6317J5987N397R80
7820A5038j8700P90J046M365l204k78P250M575j2430K702m39j7230r144J1317
7806a4342Q370J936J25R285J7728P477q131K0441Q886k1054j1701j4874k0172
7793a6026n014K5600N4071r07m2209k8289r345J3850R740n262J7107j8752k1629
7780b7065p884J4276Q454K6841K4421J969j8169j6666Q45N233O449o5k2521k6823
7766c0705K87K5546P061m745Q615O69j7834j8327O213N737J1814Q923M63j6398
7752a2681Q028M095j5595K8840P967j7947j9785m893Q881n625J0362m219P603
7739d969J640J1090M048l394L075P068l736l538K335j1549k3646K290J9240k931
$$ y = [-34568, -29130, -13030, -18038, -27832, -45622, -22740, -11945, -19875, -33643, -7326, 8661, 14058, 15038, -3662, -2872, -1826, 2539, -665, -943, 6307, 10882, -1548, 1154, 715, -16515, -25659, -14342, -5972, -4036, -3911, 5374, 23102, 30579, 22448, 42889, 51775, 30721, 19020, 4146, -16026, -21040, 4560, 58631, 57724, 15515, -12774, -22119, -8269, 1471, -3791, 13316, -5436, -27065, -34949, -20673, -12219, 14622, 39043, 41012, 22843, 6177, 7022, 12255, 18704, 18639, -3882, -30705, -30418, -4872, 2189, -2556, 6059, 6728, -11106, -29433, -23220, -17483, -5669, 3254, 3717, -12681, -4653, -558, -16153, 12687, 20654, 2707, -17078, -21971, -13090, -18715, -8353, -12572, -4969, -3329, 7761, 11809, 8415, 11490, 18558, 14822, 11284, 13619, 2070, -21576, -19286, -46, -2977]
7725b977L544K5458k8115j1760K0581N367m366r282n202J0874l031R307J1652
7712B2050l2655j9119K899K02N225N772l476M576j0336J022K2387J0353r40k0331
7698a2371k0471J1542K7926J3584j3510M657O603N150k4016j4319k338K8978j4638
7685c223k8811J6567Q477j754K170o584J855l729P499j1160p119P598P804o556
7671a6966n128L366p812k738j4956J1797R238j2102n365K2150m541j0258J1717
7658b1598L137l380J3395L7126J3636k3292n155m646k521l155m739j217K3604
7645B1195j1542k1753K9903n203l1048j9671J8164Q730j0362j5611J2818r392
7633c3772M851J4847Q319M256P58L7589j0182k9801j3614m051K0262J9343J635
$$ y = [-2977, 567, 26025, -2090, -13850, 6731, 12098, 7732, -1550, -6752, 4122, 1091, 10398, 22050, -10605, -29724, -26825, -26623, -21398, -15626, -19102, -14526, -24862, -23840, -1453, 8900, 7960, -12371, -32842, -21300, 6626, 20210, 6700, 11357, 17960, 23110, -906, -15225, -17563, 11415, -3223, -32034, -15467, -6990, -8744, -6574, -13158, -11303, -15032, -7533, -18693, -25812, -18214, -10410, -16966, -22094, -18728, -26540, -29278, -44234, -32437, -23199, -35301, -40666, -18516, -23057, -33315, -21598, -18461, -21841, -8446, 28680, 42316, 19024, 13869, 9223, 6702, 3547, -1192, -2409, 21195, 9653, -12100, 17803, 12600, -18448, -38119, -19955, -11225, -21587, -37198, -24380, -33772, -28921, -14074, -5755, -1499, -741, 36848, 26666, -3135, -16749, -20800, -538, 18805, 20440]
7620B0440K113M510P24n833j0688m283k61N496p521o16N073q9k3397m649j2668
7605c1649J6357L3333j739R477j8682k7624j223K1281J8314J7573k697q413k667
7592B1641N087Q655J3919j068j9262k8695j3935j0068j2517J3559O306J0943O361
7579I26q266J5894Q216j9613N060o419j0354K078J2132P207m394M528l826l157
7565A2j6966M001q21j5554O848P988j2293J2767J744q743J7451k1906j4534O056
7551c3950m785j915Q141R288j0830L586P241J2031J193k8657P877K1602K172J6911
7537I905k1960j2079N728l116N109n41K1863J7194K1332j6887M90k4367k6631
7524b3960J524L176K536P997j636j0664O631J3541K0093o715p608K824J2701M265
$$ y = [20440, 22553, 27063, 27787, 21954, 11266, 6983, 6722, 12218, 4697, 4081, 9154, 9065, -14332, -18981, -31649, -15292, 18041, 16302, 25779, 7097, -20527, -21750, -469, 17845, 35418, 32721, 24308, 21641, 26728, 35383, 49302, 48234, 28972, 277, -13658, -23726, -36243, -22684, -16378, -5435, 926, -7340, 8554, 16770, -2843, 2217, -4202, -14556, -12478, -346, 6861, 2467, 6995, 3169, 12, -16954, -12953, -13774, -29328, -22480, -14492, -26785, -14018, -12274, -21017, -3566, -25472, -40006, -33950, -38735, -40650, -32509, -23221, -34051, -30465, -23224, -11193, -10000, -38657, -30780, -9178, -7006, 9905, -12055, -24134, -18406, -21522, -16413, -16954, 4909, 22103, 43435, 26548, 27038, 2671, -23960, -22436, -19260, -16724, -8727, -10363, -21027, -14396, -855, 19238, 12523, 4915, 7739, 20440, 24705]
7510B4705n423j7862m229j7755m208k709J7501J0891L150J7067R027l84Q857j0972
7496B7656k1348J951R599J1442k4667l2065M604k246J2899L0580K4206Q018j5151
7483C5478k8704k878j4705N792L352J1232o234o455j031P805j0251J6645R361
7470A9407k743k1285M8R759P458k138J0521J4046J352k9002N681j8543L140o191
7456h490Q779L376K533L049l39j7672R156K6838J2981j0830j6683r995N796N672
7442A4171o267R78P745R605L024m926k977j5086J626M167l752K205o983L882J477
7427H889j0419k3158M464K2009j0870K5217K0139p089j1952J2104q401j0713j5378
7414e158k5565J0940K3172J1343k443o938r824o087J833k961J7457o957j8432
$$ y = [24705, 19282, 1420, -2809, -20564, -24772, -27481, -9980, 911, 4061, 21128, 30155, 29771, 38628, 27656, 6308, 8259, 17858, 29300, 4633, -27432, -22828, -25074, -12175, 18405, 42611, 50629, 35478, 6774, 3896, -10809, -5017, -1665, 9567, 3333, -3122, -4153, 3652, -6599, 10046, 19407, 16664, -4621, -4573, 5186, 12644, 10506, 21027, 35073, 36425, 7423, 13104, -5439, -2299, -8490, 289, 3665, 6198, 9247, 8908, -8764, 392, 27230, 40211, 29381, 12698, 2703, 8499, 14171, 7904, 8882, 16627, 26232, 29256, 24330, 21353, 6267, 7893, 12060, 8308, 10513, 3530, 7412, 8889, -1530, -24688, -20224, 1785, -9085, 16132, 36271, 29182, 17230, 29334, 20933, 10220, -5158, -30723, -19783, 3389, 14732, 12289, 5351, -4473, -10560, -8727, -11688, 5769, -1188, -19620]
7401a9620n311M685m039L127n10K8187K4552j1588j0006k0174j0994j4624O91
7388c5624K7623J8808o636J2886R949p204j5977k352j7109K3833J9442J6483k5913
7375A8209m8955p079K8046M823L988k4321N655M113J5534Q0R098O238N268m302
7361A6395l9934k6493K7219M1071J3306m617q340m24R84o247J3720J6512J1035
7348E4187n59j1466l3683j0856j78j5483m077K2735J3851j5498j1695j1835J7549
7335g008J2138K108J6737O422j9473m204J2405j8230j2559o752L064m511k3498
7322d3361O955J485J7376O416J5546l267l970r692k3757J2787j869P422M394J2548
7308i87r25R060J9843p76j1754R649K004r094r779m981O294k3852j2848J8329
$$ y = [-19620, -24931, -20246, -24285, -21158, -21668, 6519, 31071, 19483, 9477, -10697, -21691, -36315, -35624, -8001, 10807, 4171, 17057, 27006, 19802, 3825, 1473, -15636, 8197, 27639, 44122, 18209, -30746, -37825, -9779, -4956, -968, -25289, -19634, -15521, 13, 93, 9191, 15429, 20697, 16395, -23539, -50032, -22813, 18258, 31564, 26947, 18607, 18183, 19167, 12920, 26640, 43152, 54187, 53628, 42162, 8479, -2377, -2555, -18038, -22115, 620, 14471, -1027, -12722, -24557, -7008, 5130, 7238, 23975, 30397, 10924, 6720, 19125, 895, -11664, -18416, -15352, -19863, -43361, -36406, -34921, -17545, -11129, 4417, 1150, -2820, -12512, -36269, -23482, -25351, -17929, -13535, -987, -1912, 7148, 26991, 26215, 14461, 24110, 26114, 17020, 7241, 2260, 8554, -15298, -28146, -9817]
7294i817l788m842j4878P742o538m647J1808R469j2723J7790J6950q892N362K331
7280E327J1824J3912J4747k1306K799r815j6267J5812j0042j628o752p797L790
7267e396J4798J2583q657k545N33j1320j4540J0806J1438k737k0135j6880q708
7254d0760K455O979M868j5126R320K744r841J031L2881Q254j3715p003j1008j2854
7240d1775k811M905P703K6103K9553j5291j1232P2r431M818M434j6592l690J3203
7226a0031J0033j1608l985M617q35J707m62j543J932j1155j2719K7185J0216P080
7212A0432L150O81M240j3742o158r260j0596L67n872O274J7475n980L050j1657
7198a7596j2588j640J8325R720n603K3509j8620m395l982R974K2853K0346k3173
$$ y = [-9817, -13605, -18447, -33325, -25583, -32121, -36768, -24960, -15491, -28214, -10424, 6526, -2366, 2996, 5327, 17151, 31063, 45810, 24504, 27303, 17488, 1221, 17033, 6991, 5363, -1389, -9186, -5396, 9402, 21985, 13328, 10783, 11316, -4, -14544, -3738, 7700, 4963, -15172, -32052, -40760, -38305, -31326, -26458, -41584, -32264, -29520, -39361, -38330, -5449, 2805, -10910, -17913, -28921, -41775, -44586, -39681, -31978, -5875, 23678, 8387, -2845, -2773, -12204, -7386, -2952, -19544, -23234, -10031, 2, -11606, -15591, -10974, -11809, -10102, -10564, -12107, -10175, -21330, -34049, -6864, 3352, 10432, 13582, 14263, 18503, 4761, -1397, -10657, -21253, -20886, -26758, -20484, -3009, -8989, -5939, -17596, -30184, -31824, -13499, -3779, -9382, 14127, -4493, -8888, -12870, -2896, 19957, 40303, 17130]
7185A7130k9947j6277N072J9361M971J0243K5874O008j6389j9573J3732n59k378
7172A7268j6604j1674j0609k114J8238P89n648j091j477L060o88j363J0927J0864
7158I878k1754n713L437k2478J287L3774J6440N363j667k043r571K002p243m709
7144b997J123J3554r17k5235J3925J6826j454p994l795o505R619O705j0842j3915
7130a1902P876K8330P108o217j3982j6534j8858j0088J1454M2845J724k4791q76
7117c911K178m656j9934J7668R0j8918r442J2191K2868O546k4400N277K2383J3537
7103B1477K218j475r072j5229k5740p52K728j2854R7r186J351J34R674K05L2147
7088d277J9685j3964k1326K206J1754L455O698O457K954k0157j3530O141p560
$$ y = [17130, -12817, -29094, -24022, -4661, 310, 10553, 36427, 42435, 26046, 6473, 20205, 19646, 17268, 664, -11010, -21619, -23733, -5495, -4706, -10354, -11445, -12922, -9862, -10550, -11913, -986, 9878, -11876, -17589, -14152, -36630, -35343, -1569, 14871, 20234, 18567, 16524, 6953, 8955, 1712, -2997, -1874, 11680, 10763, -14472, -547, 16279, 14825, 6831, 3036, -3469, 6150, 12855, 2013, -11902, -4026, 24304, 31412, 25195, 11213, -5321, -24179, -34267, -22813, 20032, 21756, -3035, -3911, -1733, -6389, -26323, -8655, -8565, -27483, -36925, -24734, -1866, 4680, -19720, -14443, 7940, 21477, 23695, 22220, 13148, -2081, -27821, -28573, -25845, -38699, -38602, -47788, -46437, -46303, -36629, -36424, -4277, 15408, 1444, -19882, -17676, -5922, -2467, 4231, 10688, 13642, -6515, -20045, -13904, -21464]
7075b1464N392K2810N055j7843j1837J6903o545n096k8652j1606J3842L0088n576
7062a4529n576R070r015R056j780n046J2381j771j2260j8184k859N171R794O124
7048a9424K5533L3057p80j4206Q20j4752Q476K5574K0577k2201j9329k2489O141
7035F997j0101k256M023L248J212j4302N762J4030o302k7829j2578O049L4339
7022B292K6901j8549q258j2307J285J6856P989j7605j6741J520P189r453R326
7009i555p871R033J2829P530j2338j7309r654K0517J586j1663Q083q498K1914
6996D604J6526J7531j8935L745J7351j4692m6574L230O933J9011M791r251r451
6983e181N942Q925m769J1402R699k980j3884p414N971J4378J161j5293j997J3310
$$ y = [-21464, -16072, 6738, 11793, -6050, -17887, -984, -7529, -12625, -41277, -52883, -39041, -8953, -14529, -20105, -11035, -20050, -10994, -12774, -17820, -5439, -7210, -19470, -37654, -40513, -35342, -25548, -19424, 6109, 39166, 38386, 24180, 25000, 10248, 18724, 44298, 64875, 42674, 23345, 856, 6997, -3104, -5360, -1337, 1911, 3123, -11179, -5417, 8613, 2311, -25518, -38096, -32047, 2292, 29193, 10644, 2386, -9921, -8636, 8220, 16209, -1396, -18137, -16617, -9428, -18881, -9555, -17426, -8393, 4436, 11966, -372, -17681, -27335, -6818, -5232, -16895, -8812, -17310, 4604, 21130, 38661, 19726, 23471, 40822, 26130, -20444, -17214, -10281, 8730, 13521, 4270, -5181, 761, 9686, 4917, 16319, 26018, 23038, 9154, 1740, 7711, 22089, 23250, 7957, 5960, 19270]
6969A9270k5198k1059k640J0499K562q897p566R866J0403M851K100J9716J1988
6956B5895n048j6997j9313J268K4535k3134j6570j4123m719K347J3546K8053m337
6943h597p592O613K627J0390j7311q168j5524L803K0715K1254K60j2910N745M887
$$ y = [19270, -5928, -26987, -29627, -19128, -16566, -25463, -33029, -23163, -12760, -7909, -5809, 13907, 25895, 20847, 3850, -15463, -14195, 10340, -12794, -29364, -43487, -48206, -45859, -32313, -4260, -8597, -16189, -9576, -6949, 3441, -13870, -22038, -37562, -33759, -13044, 8210, 8470, -4440, 1305, 6192]
$$ [...]
##END NTUPLES=NMR SPECTRUM
##END=
