##TITLE=Analysis number 317504
Compound Code cc 47209
Book Reference 437/62
Project Code qc-cat
Chemist Name wendyb
##JCAMPDX= 6.0         $$ Bruker NMR JCAMP-DX V2.0
##DATA TYPE= NMR SPECTRUM
##DATA CLASS= NTUPLES
##ORIGIN= Bruker BioSpin GmbH
##OWNER= nmr
$$ XWIN-NMR		Version 3.5
$$ Wed Feb 22 10:15:29 2006 GMT Standard Time (UT+0h)  MAYBRIDGE\nmr@NMR_250MHZ
##.OBSERVE FREQUENCY= 250.131544655141
##.OBSERVE NUCLEUS= ^1H
##.ACQUISITION MODE= SIMULTANEOUS (DQD)
##.ACQUISITION SCHEME= undefined
##.AVERAGES= 16
##.DIGITISER RES= 18
##SPECTROMETER/DATA SYSTEM= dpx250
##.PULSE SEQUENCE= zg30
##.SOLVENT NAME= CDCl3
##.SHIFT REFERENCE= (INTERNAL, CDCl3, 0, 16.4492)
##AUDIT TRAIL= $$ (NUMBER, WHEN, WHO, WHERE, WHAT)
$$ ##TITLE= Audit trail, XWIN-NMR		Version 3.5
$$ ##JCAMPDX= 5.01
$$ ##ORIGIN= Bruker BioSpin GmbH
$$ ##OWNER= nmr
$$ C:\u/data/dgb/nmr/ADRS/16580/pdata/1/auditp.txt
$$ ##AUDIT TRAIL=  $$ (NUMBER, WHEN, WHO, WHERE, WHAT)
(   1,<2006-02-22 10:14:48.54 +000>,<MAYBRIDGE\nmr>,<NMR_250MHZ>,
      <created by zg, POWCHK disabled, PULCHK disabled
       configuration hash MD5:
       84 BC 41 DB A1 6E 1D 46 DA 25 12 A5 C1 ED C5 3A
       data hash MD5: 64K
       2A 1E D1 D7 AB 45 B4 96 F0 BF 01 12 FC BC 35 77>)
(   2,<2006-02-22 10:15:10.67 +000>,<MAYBRIDGE\nmr>,<NMR_250MHZ>,
      <Start of raw data processing
       ef LB = 0.3 FT_mod = 6 PKNL = 1 SI = 32K 
       data hash MD5: 32K
       0D 36 A7 3E F9 BC F1 52 05 AB 96 8C 28 70 D3 F1>)
(   3,<2006-02-22 10:15:13.87 +000>,<MAYBRIDGE\nmr>,<NMR_250MHZ>,
      <apk 
       data hash MD5: 32K
       D7 91 1D 0C CB C5 06 ED DA 21 E5 53 12 11 2E 0D>)
(   4,<2006-02-22 10:15:15.17 +000>,<MAYBRIDGE\nmr>,<NMR_250MHZ>,
      <abs ABSG = 5 
       data hash MD5: 32K
       44 7B D7 7B 28 59 BB 9C 94 76 89 C3 EF F9 E8 28>)
$$ ##END=
$$ 
$$ hash MD5
$$ 4F EF 13 76 BA 61 A0 C6 D6 EB B7 2D 65 49 50 59
##$RELAX= 
##$RELAX= 
##$RELAX= 
##$RELAX= 
##$RELAX= 
##$RELAX= 
##$RELAX= 
$$ Bruker specific parameters
$$ --------------------------
##$DU= <C:\u>
##$EXPNO= 16580
##$NAME= <ADRS>
##$PROCNO= 1
##$TYPE= <nmr>
##$USER= <dgb>
##$AMP= (0..31)
100 100 100 100 100 100 100 100 100 100 100 100 100 100 100 100 100 100 
100 100 100 100 100 100 100 100 100 100 100 100 100 100 
##$AQSEQ= 0
##$AQ_mod= 3
##$AUNM= <au_zg>
##$AUTOPOS= <10 >
##$BF1= 250.13
##$BF2= 250.13
##$BF3= 250.13
##$BF4= 250.13
##$BF5= 500.13
##$BF6= 500.13
##$BF7= 500.13
##$BF8= 500.13
##$BYTORDA= 1
##$CFDGTYP= 0
##$CFRGTYP= 5
##$CHEMSTR= <none>
##$CNST= (0..31)
1 1 145 1 1 1 1 1 1 1 1 1 1 1 1 1 1 1 1 1 1 1 1 1 1 1 1 1 1 1 1 1 
##$CPDPRG= <>
##$CPDPRG1= <>
##$CPDPRG2= <>
##$CPDPRG3= <>
##$CPDPRG4= <mlev>
##$CPDPRG5= <mlev>
##$CPDPRG6= <mlev>
##$CPDPRG7= <mlev>
##$CPDPRG8= <mlev>
##$CPDPRGB= <>
##$CPDPRGT= <>
##$D= (0..31)
0 1 0 0 0 0 0 0 0 0.06 0 0 0 0 0 0 0.0002 0 0 0 0 0 0 0 0 0 0 0 0 0 0 
0 
##$DATE= 1140603286
##$DBL= (0..7)
120 120 120 120 120 120 120 120 
##$DBP= (0..7)
150 150 150 150 150 150 150 150 
##$DBP07= 0
##$DBPNAM0= <>
##$DBPNAM1= <>
$$ [...]
##$SUBNAM7= <"">
##$SUBNAM8= <"">
##$SUBNAM9= <"">
##$SW= 20.6930455092707
##$SWIBOX= (0..15)
0 0 3 0 0 0 0 0 0 0 0 0 0 0 0 0 
##$SW_h= 5175.983436853
##$TD= 65536
##$TD0= 1
##$TE= 293.16
##$TE2= 300
##$TE3= 300
##$TEG= 300
##$TL= (0..7)
0 120 120 120 120 120 120 120 
##$TP= (0..7)
150 150 150 150 150 150 150 150 
##$TP07= 0
##$TPNAME0= <>
##$TPNAME1= <>
##$TPNAME2= <>
##$TPNAME3= <>
##$TPNAME4= <>
##$TPNAME5= <>
##$TPNAME6= <>
##$TPNAME7= <>
##$TPOAL= (0..7)
0.5 0.5 0.5 0.5 0.5 0.5 0.5 0.5 
##$TPOFFS= (0..7)
0 0 0 0 0 0 0 0 
##$TUNHIN= 0
##$TUNHOUT= 0
##$TUNXOUT= 0
##$USERA1= <user>
##$USERA2= <user>
##$USERA3= <user>
##$USERA4= <user>
##$USERA5= <user>
##$V9= 5
##$VALIST= <valist>
##$VCLIST= <CCCCCCCCCCCCCCC>
##$VD= 0
##$VDLIST= <DDDDDDDDDDDDDDD>
##$VPLIST= <PPPPPPPPPPPPPPP>
##$VTLIST= <TTTTTTTTTTTTTTT>
##$WBST= 1024
##$WBSW= 4
##$XGAIN= (0..3)
0 0 0 0 
##$XL= 0
##$YL= 0
##$YMAX_a= 422640
##$YMIN_a= -561031
##$ZGOPTNS= <>
##$ZL1= 120
##$ZL2= 120
##$ZL3= 120
##$ZL4= 120
##$ABSF1= 16.44922
##$ABSF2= -4.243952
##$ABSG= 5
##$ABSL= 3
##$ALPHA= 0
##$AQORDER= 0
##$ASSFAC= 0
##$ASSFACI= 0
##$ASSFACX= 0
##$ASSWID= 0
##$AUNMP= <proc_1d>
##$AZFE= 0.1
##$AZFW= 0.1
##$BCFW= 0
##$BC_mod= 0
##$BYTORDP= 0
##$COROFFS= 0
##$CY= 12.5
##$DATMOD= 1
##$DC= 0
##$DFILT= <>
##$DTYPP= 0
##$F1P= 14.0000005364418
##$F2P= -0.99999901652339
##$FCOR= 0.5
##$FTSIZE= 32768
##$FT_mod= 6
##$GAMMA= 0
##$GB= 0
##$INTBC= 1
##$INTSCL= 1
##$ISEN= 128
##$LB= 0.3
##$LEV0= 0
##$LPBIN= 0
##$MAXI= 10000
##$MC2= 0
##$MEAN= 0
##$ME_mod= 0
##$MI= 0
##$NCOEF= 0
##$NC_proc= -2
##$NLEV= 6
##$NOISF1= 0
##$NOISF2= 0
##$NSP= 0
##$NTH_PI= 0
##$NZP= 0
##$OFFSET= 16.44922
##$PC= 1
##$PHC0= 244.4684
##$PHC1= 5.444802
##$PH_mod= 1
##$PKNL= yes
##$PPARMOD= 0
##$PSCAL= 4
##$PSIGN= 0
##$REVERSE= no
##$SF= 250.130018202596
##$SI= 32768
##$SIGF1= 0
##$SIGF2= 0
##$SINO= 400
##$SIOLD= 32768
##$SREGLST= <1H.CDCl3>
##$SSB= 0
##$STSI= 32768
##$STSR= 0
##$SW_p= 5175.98343685301
##$SYMM= 0
##$S_DEV= 0
##$TDeff= 65536
##$TDoff= 0
##$TI= <Analysis number 999999
Compound Code 99
Book Reference 9
Project Code 9>
##$TILT= no
##$TM1= 0
##$TM2= 0
##$TOPLEV= 0
##$USERP1= <user>
##$USERP2= <user>
##$USERP3= <user>
##$USERP4= <user>
##$USERP5= <user>
##$WDW= 1
##$XDIM= 32768
##$YMAX_p= 316036234
##$YMIN_p= -119420
$$ End of Bruker specific parameters
$$ ---------------------------------
##NTUPLES= NMR SPECTRUM
##VAR_NAME=  FREQUENCY,     SPECTRUM/REAL,   SPECTRUM/IMAG
##SYMBOL=    X,             R,               I
##VAR_TYPE=  INDEPENDENT,   DEPENDENT,       DEPENDENT
##VAR_FORM=  AFFN,          ASDF,            ASDF
##VAR_DIM=   32768,         32768,           32768
##UNITS=     HZ,            ARBITRARY UNITS, ARBITRARY UNITS
##FACTOR=    0.157963299565203, 1,           1
##FIRST=     4114.44386244113, 0,            0
##LAST=      -1061.53957441188, 0,           0
##MIN=       -1061.53957441188, -119420,     0
##MAX=       4114.44386244113, 316036234,    0
$$ Real data points
##PAGE= N=1
##DATA TABLE= (X++(R..R)), XYDATA
$$ [...]
18948B599o073R323m261m709L651R419J2568o559r011K609j4464p984J0472P470
$$ 2599 -3474 5849 1588 -3121 530 9949 22517 15958 6947 9556 -4908 -12892 -2420 5050
18934E050M59L155j206o388l643K385k236r95k458o812O049Q387P063J0256l972
$$ 5050 5509 8664 7458 1070 -2573 -188 -2424 -3419 -5877 -12689 -6640 1747 8810 19066 15094
18919A5094r107n255l128N459J4959J838N58o467l095K105N870N06o835q802p655
$$ 15094 5987 732 -2396 3063 18022 19860 20418 13951 10856 12961 18831 19337 12502 3700 -3955
18904c955R637L922j718r192k26m81n072q239K763J0001O003J1909P865P31m966
$$ -3955 5682 9604 7886 -1306 -1532 -2013 -7085 -15324 -12561 -2560 3443 15352 23217 23948 18982
18889A8982J627P802J247j4618r043k555K049Q032J0975J264j3725j3777N654
$$ 18982 20609 28411 29658 15040 5997 3442 5491 13523 24498 25762 12037 -1740 3914
18876C914J3029L940R906M820l99j347J782k024j1861j3521M124L679P126M811
$$ 3914 16943 20883 30789 35609 35210 33863 35645 33621 21760 8239 12363 16042 23168 27979
18862B7979m883o314j1868k705K030P003J714K115Q84K773j689J669M714q562
$$ 27979 23096 16782 4914 2209 4239 11242 12956 15071 15955 18728 17039 18708 23422 14860
18848A4860j867K311k825r799k839L359L848J74K142k716j1272j859L312L097
$$ 14860 12993 15304 12479 2680 -159 3200 7048 7222 9364 6648 -4624 -6483 -3171 -74
18834g4N408R760L054l470l101p19l298L174L079M597q176Q92n580N50k166j107
$$ -74 5334 15094 18148 14678 11577 10858 7560 10734 13813 18410 10234 11126 5546 6096 3930 2823
18818B823J0467N826J7361M223m387m259n81l028p345p677n624k790J259l89M012
$$ 2823 13290 19116 36477 40700 36313 32054 31473 28445 21100 13423 7799 5009 6268 5879 9891
18803I891J928J396j222l27O375j068N821M526n520l426p577l394k803P444J257
$$ 9891 11819 13215 11993 11666 18041 16973 22794 27320 21800 18374 10797 7403 4600 12044 13301
18788A3301J3084N598p457l792K427j056j1628N470J53q226J0397l0q902l501
$$ 13301 26385 31983 24526 20734 23161 22105 10477 15947 16100 7874 18271 18241 9339 5838
18774E838R116M47r415L602J3460M955p17O388N225J9167L0596J4031j9628j8704
$$ 5838 14954 15401 5986 9588 23048 28003 27286 33674 38899 58066 88662 102693 83065 64361
18760F4361j6429j4837J126L722j636j2387N668R2q115q182n486o71J835O716
$$ 64361 47932 33095 34221 37943 36307 23920 29588 29680 21565 13383 7897 7226 9061 15777
18746A5777O971j580p322l993l619n162P669Q959J245M552L14Q271N686m461o100
$$ 15777 22748 21168 13846 9853 6234 1072 8741 17700 18945 23497 23811 32082 37768 33307 27207
18731B7207L141O145n445J331m979j2891m126K218N234K429q845j2758K305j857
$$ 27207 30348 36493 31048 32379 27400 14509 10383 12601 17835 20264 11419 -1339 966 -891
18717h91J0965J0001p505j446J805K758L32M585j145l754k239j863M589N842n996
$$ -891 10074 20075 12570 11124 12929 15687 16019 20604 19459 15705 13466 11603 16192 22034 16038
18702A6038j5008p190J496k81N058J0473J566j0184K409J0815M029p22q807M066
$$ 16038 1030 -6160 -4664 -4945 113 10586 12152 1968 4377 15192 19221 18499 9692 13758
18688A3758R449j14n125l364n316Q1m72K493o958L021J2350P467j2587l412J523
$$ 13758 23207 23093 17968 14604 9288 9369 8897 11390 4432 7453 19803 27270 14683 11271 12794
18673A2794N461Q887n959q825k088O999Q920n292l56l131M42Q162Q589p98L770
$$ 12794 18255 27142 21183 12358 10270 17269 26189 20897 20541 17410 17852 26014 34603 33805 37575
18658C7575j4078q423l034N620J0603M337L382K300Q968M358P041R441J3550K5667
$$ 37575 23497 15074 12040 17660 28263 32600 35982 38282 47250 51608 58649 68090 81640 107307
18644A07307K4841K5907k145j3908j3698j9677P324L0203K6349m992k2865k9368
$$ 107307 132148 158055 155910 142002 128304 108627 115951 146154 172503 167511 144646 115278
18632A15278j8042j2300o646o020j2646j2671J104J160M405k617R147K5709K5236
$$ 115278 97236 84936 78290 72270 59624 46953 48057 49217 53622 51005 60152 85861 111097
18619A11097K8830L3863K1426J0348m262R627L0577M5842L7241J7529k3559m7914
$$ 111097 139927 173790 195216 205564 201302 210929 241506 287348 324589 342118 318559 270645
18607B70645m7110k4841o3J2004n997j7383j8863k5634j8696O771J1675L1370
$$ 270645 223535 198694 198631 210635 204638 187255 168392 142758 124062 130833 142508 173878
18595A73878J8860m406k7997k2696L902r82J6375K2612J0095j1844l0674l4527
$$ 173878 192738 188332 160335 137639 141541 140559 156934 179546 189641 177797 147123 112596
18583A12596k8688j2151j0087J524j0082q20K533n628k027n104j5416j598O784
$$ 112596 83908 71757 61670 63194 53112 52292 54825 49197 47170 42066 26650 25052 31836
18570C1836l9K103j761M275R290o991j5549j2732k553J065Q604N673Q633j103
$$ 31836 31797 33900 32139 36414 45704 38713 23164 10432 7879 8944 17548 23221 31854 30751
18556C0751j0012k526o246L699R493j0567r6J1006P401m364q199p492j062J0479
$$ 30751 20739 18213 11967 15666 25159 14592 14496 25502 32903 28539 20340 12848 11786 22265
18542B2265R388q687n646R875J0416j844J718k633m421K690n353r757P1J0632
$$ 22265 31653 22966 17320 27195 37611 35767 37485 34852 30431 33121 27768 18011 18082 28714
18528B8714J544m761o303j0768N069k09o11J0433J4744q501m072q28j044m329
$$ 28714 30258 25497 19194 8426 13495 13286 12675 23108 37852 29351 25279 24451 23407 19078
18514A9078m364j81p39K325K351k036K563N188O296R492M667o606J810m722k62
$$ 19078 14714 14533 13794 16119 18470 16434 18997 24185 30481 39973 44640 38034 39844 35122 34860
18499C4860m740l420k866k082N330R058P57J611k566J7816K4942K8797J3183N296
$$ 34860 30120 26700 23834 21752 27082 36140 36897 38508 35942 53758 78700 107497 120680 125976
18485A25976j3798j1757q511k76P652J5239J1853j290k2040j7611j0653j861K912
$$ 125976 112178 100421 91910 91634 99286 114525 126378 125088 103048 85437 74784 72923 75835
18472G5835o344J1157K6498K3519K340j4142j8789j0764j5836P684K0125K5968
$$ 75835 69491 80648 107146 130665 133005 118863 100074 89310 73474 81158 101283 127251
18460A27251K1128j2157l3061k4755j5082M334l22j3809j1790r19k756j0525q080
$$ 127251 148379 136222 103161 78406 63324 67658 67336 53527 41737 40818 38062 27537 19457
18447A9457p379J840J2196J755l801J0775J6329L653r393r084k234L053K044k772
$$ 19457 12078 13918 26114 27869 24068 34843 51172 54825 45432 36348 34114 37167 39211 36439
18433C6439l486O578J1489l729K032r03p481k851k670j071J8135J4216j23j0701
$$ 36439 32953 39531 51020 47291 49323 48420 40939 38088 35418 34347 52482 66698 66575 55874
18419E5874p251l580p217o837m77L166R262Q27M35o64R072j610j2872l189l647
$$ 55874 48623 45043 37826 30989 30512 33678 42940 43767 44202 43538 52610 51000 38128 34939 31292
18404C1292M161J3805l365o162K391Q034J875j672P728k794j2201M529K292r208
$$ 31292 35453 49258 45893 39731 42122 50156 52031 50359 58087 55293 43092 47621 49913 40705
18390D0705l763J2463J0816J005l435l482j654m970m391j794o502L499J0003K832
$$ 40705 36942 49405 60221 61226 57791 54309 52655 47685 43294 41500 34998 38497 48500 51332
18376E1332k357P988O293n144n50j160O919J1889l201m113M86n851J327O899J0970
$$ 51332 48975 56963 63256 58112 57562 56402 63321 75210 72009 67896 68382 62531 63858 70757 81727
18361H1727P216O594K246j0554q332O900J882K114K4166K8992J0272O392n219
$$ 81727 88943 95537 97783 87229 78897 85797 87679 89793 113959 142951 153223 159615 154396
18348A54396j8926j4874p85K6343L2673L9241L3766M5382J8747k0541l4632l4663
$$ 154396 135470 120596 119811 146154 178827 218068 251834 297216 315963 295422 260790 226127
18336B26127m0209j4571Q569K6765N9480L5165k8990l7077m2617l4547j2493j6069
$$ 226127 185918 171347 179916 206681 266161 301326 272336 235259 192642 158095 145602 129533
18324A29533r789O27K5131K0837K3943K5850k564j5241j8300o026J935K5083N0535
$$ 129533 119744 120371 145502 166339 190282 216132 213568 198327 180027 174001 175936 201019 251554
18311B51554N5535N0406J8991k5459m3492m6297l6767r229p68K9745O2817L1652
$$ 251554 307089 357495 376486 351027 307535 261238 224471 215242 214474 244219 307036 338688
18299C38688j7910k2480k7420k0279j3701j7978k5775l0395j3129j4149r410j0766
$$ 338688 320778 298298 270878 250599 236898 218920 193145 162750 149621 135472 126062 115296
18287A15296l996j602L781K972k729l604N439J1513L817j784R944O569J7188L2473
$$ 115296 111300 109698 113479 116451 113722 110118 115557 127070 130887 129103 139047 145616 162804 195277
18273A95277K1856l253j4169j5287j1691m472P042J6266J9367Q792j0629j3761
$$ 195277 217133 213880 199711 184424 172733 168261 175303 191569 210936 219728 209099 195338
18261A95338k3583j9980j7733n478n849K19J1012J576k987j849q061l238Q972
$$ 195338 171755 151775 134042 128564 122715 122934 133946 135522 132535 130686 122625 119387 128359
18248A28359M464L122L738J1845J5474L9967N6247K5000k2683j9664r597j2574
$$ 128359 132823 135945 139683 151528 167002 206969 263216 288216 265533 245869 236272 223698
18236B23698O625J7459k430l0622l5472k2342j6847q233j2142p811m759P391J564
$$ 223698 230323 247782 245352 214730 179258 156916 140069 131836 119694 111883 107124 114515 116079
18223A16079N979K751n582J0031J3863J0714L9144L3847j0166l4922k3894j0334
$$ 116079 122058 124809 119227 129258 143121 153835 192979 226826 216660 181738 157844 147510
18211A47510j4305o459O356M970R44j812J378J6841K1076K512j7344j6105k8980
$$ 147510 133205 126746 133102 138072 139016 137204 138582 155423 176499 179011 161667 145562 116582
18198A16582p932Q059P916P19m425q177o182L02R6j85J3230J4223J7630J2450
$$ 116582 108650 116709 124625 125344 120919 112742 106560 106862 106958 106773 120003 134226 151856 164306
18184A64306M357j3614q398r562r666p475l293M560J2019J69k594k774J884J4931
$$ 164306 168663 155049 146651 137089 127423 119948 116655 121215 133234 133403 130809 128035 129919 144850
18170A44850R697N263J1568l162M344J255n182K642M215K880R899J0117K671J860
$$ 144850 154547 159810 171378 168216 172560 173815 168633 171275 175490 178370 188269 198386 201057 202917
18156B02917N624r68j9025j2043m658K887J7355J2448J747Q504K532J2556J3164
$$ 202917 208541 207573 188548 176505 171847 174734 192089 204537 206284 214788 217320 229876 243040
18143B43040O173Q685M127J7972K5159K2689K5790J3705J477J2623J1322K5469
$$ 243040 249213 257898 262025 279997 305156 327845 353635 367340 368817 381440 392762 418231
18131D18231L7183M8045M9108L9685K0067J5662R304M813J5962N0184O5982O1618
$$ 418231 455414 503459 552567 592252 612319 627981 637285 642098 658060 708244 774226 835844
18119H35844N4450N4889O7136J08474J33924J73945K09224K49848L65553N85043
$$ 835844 890294 945183 1012319 1120793 1254717 1428662 1637886 1887734 2253287 2838330
18109B838330R53000J635807L108405N543827N378534J10492k997740l738548
$$ 2838330 3791330 5427137 8535542 14079369 19457903 19568395 16570655 12832107
18101A2832107l207157j683401k80193J017178K694446M902406N692658K448880
$$ 12832107 9624950 7941549 7661356 8678534 11372980 16275386 21968044 24416924
18093B4416924j494152k977467k425069p4722L574666O976669N524886q48604
$$ 24416924 22922772 19945305 17520236 17445514 21020180 27996849 33521735 32673131
18085C2673131n249055o484875n676276l832756k256803j228965n34960j6482
$$ 32673131 27424076 20939201 15262925 11430169 9173366 7944401 7409441 7392959
18077G392959M97535J210574K447960M599576O710613N150640K87662k720487
$$ 7392959 7890494 9101068 11549028 16148604 22859217 28009857 28297519 25577032
18069B5577032l089615j348831K196893O597916Q226989L182272k810524m621223
$$ 25577032 22487417 21138586 23335479 29933395 38160384 41342656 38532132 33910909
18061C3910909k617615K085975L974803o76242m777793n842435m839916k097749
$$ 33910909 31293294 33379269 37354072 36677830 31900037 26057602 21217686 19119937
18053A9119937J386497M008760J959625k498433m565616m838702l860810k508996
$$ 19119937 20506434 24515194 26474819 23976386 19410770 14572068 10711258 8202262
18045H202262j501944q95804o12644m78803l68900k70032j45994j1958Q7192J25038
$$ 8202262 6700318 5804514 5191870 4713067 4344167 4074135 3928141 3916183 4003375 4128413
18035D128413J66049L07696N58422R60445J639990K785237N018812Q677250J0268796
$$ 4128413 4294462 4602158 5160580 6121025 7761015 10546252 15565064 24242314 34511110
18026C4511110L959773l356300o152904n869455l084042Q86019M461346L603443
$$ 34511110 38470883 35114583 28961679 23092224 20008182 20894201 25355547 28958990
18018B8958990j654534m940922n745490m951684l370690k088708j290221q53594
$$ 28958990 27304456 22363534 16618044 11666360 8295670 6206962 4916741 4063147
18010D063147o02073m66351l92557l34823k60662j94852j54126j17830q1194p8948
$$ 4063147 3461074 2994723 2602166 2267343 2006681 1811829 1657703 1539873 1458679 1379731
18000A379731r5718p8318n7271o2718p8938p9805p6539m8071l0090j9574j2425
$$ 1379731 1284013 1205695 1148424 1085706 1006768 926963 850424 802353 772263 752689 740264
17989G40264m2912p4229p5594n7583l6486k8319l6052k6754l3948l7555k4722
$$ 740264 697352 623123 547529 489946 453460 425141 389089 362335 328387 290832 266110
17978B66110q200j849j7796n809j3839j0770O838J107j2169j1790j3175K596J422
$$ 266110 257910 256061 238265 232456 218617 207847 214685 215792 203623 191833 178658 181254 182676
17965A82676q119J6j980j036J418m506k8992j6722N805j651r368q506m225Q24
$$ 182676 174557 174573 172593 171557 172975 168469 139477 122755 128560 126909 117541 109035 104810 105634
17951A05634j0177j175L946Q09n380N169R320K52k737m137k747M595Q061J4591
$$ 105634 95457 94282 98228 99037 93657 98826 108146 108398 105661 101524 98777 103372 111433 126024
17937A26024N309n345k352n343K772L903k865j405Q672K2617K0989m297o706q349
$$ 126024 131333 125988 123636 118293 121065 124968 122103 120698 129370 151987 172976 168679 161973 153624
17923A53624k1625j4818J1131K6518L4299J2994j3796k4456k2450k2138j2128
$$ 153624 131999 117181 128312 154830 189129 202123 188327 163871 141421 119283 107155
17912A07155j882J2138R975J3003J9239M5331R0071R4069L3624k6860n0976o0628
$$ 107155 105273 117411 127386 140389 159628 204959 295030 389099 422723 395863 344887 284259
17900B84259k9324j0641J1021O1449O6218J3615l6888m9277m0994j5168L8532
$$ 284259 254935 244294 255315 316764 382982 396597 359709 310432 269438 254270 292802
17889B92802Q4530O6453j8406o9353p9755o5888m9743l3526j2578n506r840l313
$$ 292802 377332 443785 425379 356026 276271 210383 160640 127114 114536 109030 99190 95877
17877I5877o589j2800n444J629O794J971Q23O901J613Q808J9298L1185P803K472
$$ 95877 89288 76488 71044 72673 79467 81438 82261 89162 90775 99583 118881 150066 157869 160341
17863A60341L656k916q068J0436M3733Q0886N1666j5779n3658n5124m8247l4381
$$ 160341 163997 161081 153013 163449 207182 288068 339734 323955 270297 215173 166926 132545
17851A32545j5292j982o579r085j918n697l665j056P317J728n171j790M484J822
$$ 132545 117253 115271 108692 99607 97689 91992 88327 87271 94588 96316 91145 89355 93839 95661
17837I5661J1532K8735L2665J9737o056j5240k9894j9534l123n393n415O566o345
$$ 95661 107193 135928 168593 188330 182274 167034 137140 117606 114483 109090 103675 110241 103896
17824A03896l155q247J1960P251k08J179J9204R633r559j953R454J4683K730O062
$$ 103896 100741 92494 104454 111705 111497 112676 131880 141513 131954 130001 139455 154138 156868 162930
17810A62930j053r884r07N626O657J7953O645J679o719J5190K2901K2611M5514
$$ 162930 161877 151993 151086 156712 163369 181322 187967 189646 182927 198117 221018 243629 289143
17797B89143O2575M0268N732k0076l5385p893K0016K3764M5602O1030O1325M7451
$$ 289143 351718 391986 397718 377642 342257 334364 354380 378144 423746 484776 546101 593552
17785E93552M2563N5431O9378M4865K7628L8841P5874J03442J21274J66326K27064
$$ 593552 636115 691546 760924 805789 833417 872258 948132 1051574 1172848 1339174 1566238
17774A566238L04697L84201N38045Q23925J339877K296215M160415P478727R954467
$$ 1566238 1870935 2255136 2793181 3617106 4956983 7253198 11413613 18892340 28846807
17765B8846807M700800l010952o304083o916744n417503l437967k086810j293286
$$ 28846807 33547607 30536655 24232572 17315828 11898325 8460358 6373548 5080262
17757E080262q26070n22258l18955j96308q7244L4541J52755L10148N59914R46717
$$ 5080262 4254192 3731934 3412979 3216671 3129427 3163968 3316723 3626871 4186785 5133502
17747E133502J568640K725991M979777Q045268P158955K18208m372993n710482
$$ 5133502 6702142 9428133 14407910 22453178 29612133 29830341 25457348 19746866
17739A9746866m989718k871664p38296J420323M241663P047588M869899j522392
$$ 19746866 14757148 11885484 11147188 12567511 16809174 23856762 28726661 27204269
17731B7204269m918422n795253m929189l257339j996015j239498p95041n53463
$$ 27204269 22285847 16490594 11561405 8304066 6308051 5068553 4273512 3720049
17723C720049m06550k70667j73155q0556J7466J44716L27749O12668J052706J849148
$$ 3720049 3313499 3042832 2869677 2789121 2806587 2951303 3279052 3891720 4944426 6793574
17713F793574L416212N959586O712693J499870l333877n004326m955449l576568
$$ 6793574 10209786 16169372 22882065 24381935 21048058 16043732 11088283 7511715
17705G511715k205441j324510q24083n72895m26033l39750k83802k31457j77112
$$ 7511715 5306274 3981764 3157681 2584786 2158753 1819003 1535201 1303744 1126632
17696A126632j21471p4926n9637l6843l6835m8680l9067m0132l4411m2538m6679
$$ 1126632 1005161 930235 870598 833755 796920 748240 709173 669041 634630 592092 545413
17685E45413m0476m6693l6364j7689Q633K0225p904m2864m9007n2970l1147k0305
$$ 545413 504937 458244 421880 404191 412824 433049 425145 382281 333274 280304 249157 228852
17673B28852k1922k7484k1438j3142j4522j2618j2957k907n78k491q364p863l852
$$ 228852 206930 179446 158008 144866 130344 117726 104769 101862 101284 98793 90429 82566 78714
17660G8714K6n151N131M4O89j967J608P363r717o067l511l362q930j2499P11Q213
$$ 78714 78740 73589 78720 78764 79453 77486 79094 86457 76740 70673 67162 63800 54870 42371 43082 51295
17644E1295L501K445j550j4217Q25J2809N248o305j7601n010J009P507J336n696
$$ 51295 54796 57241 55691 41474 42299 55108 60356 54051 36450 31440 32449 39956 41292 35596
17630C5596K987J131L701J718o523M692J640m802N77k388p150M500M348p07K921
$$ 35596 38583 39714 43415 45133 38610 43302 44942 40140 40717 38329 31179 35679 40027 39320 42241
17615D2241l335j0603r949K949K226O419l873N534J2638m495j0065r449k199N048
$$ 42241 38906 28303 18354 21303 23529 29948 26075 31609 44247 39752 29687 20238 18039 23087
17601B3087O242n25j267m646o629K919m27n153n330N061J105q051j459Q295m491
$$ 23087 29329 28804 27537 22891 16262 19181 18754 13601 8271 13332 14437 6386 4927 13222 8731
17586H731o509N089J9378O573j2816q509j5039r210l936p043r143o07R499M306
$$ 8731 2222 7311 26689 33262 20446 11937 -3102 -12312 -16248 -23291 -32434 -33041 -23542 -19236
17572a9236J0246N196J0175J1166k890J398K6397L3064M3530L4795O661j3117
$$ -19236 -8990 -3794 6381 17547 14657 16055 42452 75516 119046 153841 160502 147385
17560A47385l0683j1320J2109J7338K1426O196j5876k5891l5955l2188j6836q511
$$ 147385 116702 105382 117491 134829 156255 162451 146575 120684 84729 52541 35705 27194
17548B7194r309M189N469k648J1763J5676K0556K7848K9429m313r293j1436k846
$$ 27194 17885 22074 27543 24895 36658 52334 72890 100738 130167 125854 116561 105125 102279
17535A02279J1321K1021J1638j208j8456k3055j8590j2264j2197k0835j6486l961
$$ 102279 113600 134621 146259 145051 126595 103540 84950 72686 60489 39654 23168 19207
17523A9207L346M768k705l378M30R8j228n116n346j0980k488M616j867N983qm50
$$ 19207 22553 27321 24616 21238 21668 21766 20538 15422 10076 -904 -3392 1224 -643 5340 5332 4882
17507D882n576K659P097N53L714L4m519Q219J2874o36j1326n711n428N407j191
$$ 4882 -694 1965 9062 9615 13329 13363 8844 17063 29937 29301 17975 12264 6836 12243 11052
17492A1052q76P494K555R42p449j0189L629P649n914j4493m077L792L203l428
$$ 11052 10176 17670 20225 21167 13718 3529 7158 14807 8893 -5600 -9677 -5885 -2682 -6110
17478f110j989J0989M274J1346o967m616K947O409L887K154J5031K4078L9143
$$ -6110 -8099 2890 7164 18510 11543 6927 9874 16283 20170 22324 37355 61433 100576
17465A00576M1491J3102j8133j3184j0670p120J2773J8746J9185J708j8978l0028
$$ 100576 142067 155169 137036 123852 113182 106062 118835 137581 156766 158474 139496 109468
17453A09468l0330j7434j0777m001j3897j5626p607O656L266P41N91N470Q444
$$ 109468 79138 61704 50927 46926 33029 17403 9796 16452 19718 20459 21050 26520 34964
17440C4964K3245L9459J4092M13j2922r145J4493K3127J4931q852k5146k2689
$$ 34964 58209 97668 111760 112173 99251 90106 104599 127726 142657 133805 108659 85970
17428H5970j5203N486J8926K3011K326k0947j5868k7818k4861j5086j1653o118
$$ 85970 70767 76253 95179 118190 120516 99569 83701 55883 31022 15936 4283 -1835
17416a835L484J9092O65l219j0460j2048N283R509L906l441K640l134j3161j645
$$ -1835 1649 20741 21406 18187 7727 -4321 962 10471 14377 10936 13576 10442 -2719 -4364
17402d364j525N641o64O088l903j315l77O771l271l082k634J209J84N095M750
$$ -4364 -5889 -248 -912 5176 1273 -42 -419 6352 3081 -1 -2635 -1426 -1242 3853 8603
17387H603m375M29L592O08n28L46O313j3657j350L6M535Q95m380L198O490j289
$$ 8603 4228 4657 8249 8857 8329 8675 14988 1331 -19 17 4552 5447 1067 4265 10755 9466
17371I466o106j985O451N203j102p035M5J3520m351j2765r831k39j757p35O56
$$ 9466 3360 1375 7826 13029 11927 4892 4937 18457 14106 1341 -8490 -8729 -10486 -11221 -10565
17356a0565L298j562Q175N168m715m956j454k865l327p184J538O942L081K571
$$ -10565 -7267 -8829 -654 4514 -201 -5157 -6611 -9476 -12803 -19987 -18449 -11507 -8426 -5855
17342e855j0315m926Q390P020m295L569l089l147P753q98k951j1467j62l524N958
$$ -5855 -16170 -21096 -12706 -5686 -9981 -6412 -9501 -12648 -4895 -5793 -8744 -20211 -20373 -23897 -17939
17327a7939N365n213N454J6859O28o078K705K586p700q582M50l43N117K37J461
$$ -17939 -12574 -17787 -12333 4526 5154 -924 1781 4367 -3333 -11915 -11465 -11808 -6691 -6454 -4993
17312d993o616k846J1674L507j133m807j3660L176k723m460J3248J2129K669m278
$$ -4993 -11609 -14455 -2781 726 -407 -5214 -18874 -15698 -18421 -22881 -9633 2496 5165 887
17298H87n716L509l356L815K607k829k261J1292M770j0249k0166o649O062J1895
$$ 887 -4829 -1320 -4676 -861 1746 -1083 -3344 7948 12718 2469 -17697 -24346 -18284 -6389
17284f389K324Q232J3309P997q670J05o064p488p53p63r394j7099m002O601J483
$$ -6389 -4065 4167 17476 25473 16803 16908 10844 3356 2603 1840 -7554 -24653 -28655 -22054 -20571
17269b0571P113J675Q78p305M522J1405N293r86q794K113m818m586m99Q616J435
$$ -20571 -13458 -11783 -10905 -18210 -13688 -2283 3010 2024 -6770 -4657 -9475 -14061 -14560 -5944 -4509
17254d509J0402r56m613M043K842M164J906K102k596n769K64q146N650K025j745
$$ -4509 5893 4937 324 4367 7209 11373 13279 15381 12785 7016 7280 -866 4784 6809 5064
17239E064k184O900J1440M175J8820L4733L7966K8319k174k2208k6202k4743j9566
$$ 5064 2880 9780 21220 25395 44215 78948 116914 145233 143059 120851 94649 69906 50340
17226E0340j7834N163J424p404k645q692M244o19j570N485J0115J477j53J0782
$$ 50340 32506 37669 39093 31689 29044 20352 24596 23977 22407 27892 38007 39484 39331 50113
17212E0113K3241K2172K4720J0894j2702r577j4325j3161K88N388J2790K2492
$$ 50113 73354 95526 120246 131140 118438 108861 94536 81375 81663 87051 99841 122333
17200A22333K2009l820j8149k8965k9993j2593j0397j1781k623p10o6j0927L627
$$ 122333 144342 140522 122373 93408 63415 50822 40425 28644 26021 25311 25245 14318 17945
17187A7945J389N566J1784M838J0149P301P069K5562K7520M2841L4542J3914N354
$$ 17945 19334 24900 36684 41522 51671 58972 66041 91603 119123 161964 196506 210420 215774
17174B15774J7471K7695M6500M3502M5781K5035r264m2923n5967p0112n7261m6431
$$ 215774 233245 260940 307440 350942 396723 421758 412494 369571 313604 243492 186231 139800
17162A39800m8124k4196j7553k934n021n363q412L340r440j4576K149J0606l884
$$ 139800 91676 67480 49927 46993 41972 36609 28197 31537 22097 7521 9670 20276 16392
17149A6392j777j444r880n378p155P908L945O150N767L102m054N446j0582m227
$$ 16392 14615 13171 3291 -2087 -9242 -1334 2611 8761 14528 17630 13576 19022 8440 4213
17135D213o118Q466J4856Q224l819j0180j803M099L200o099j60j138m956j035
$$ 4213 -1905 6561 21417 29641 25822 15642 13839 17938 21138 15039 14879 13741 8785 7750
17121G750j0534L78J0246P327L38p251j5753q0L852j248J875J4214M183o883o829
$$ 7750 -2784 -2406 7840 15167 15505 8254 -7499 -7579 -3727 -4975 -3100 11114 15297 8414 1585
17106A585j0080l668J2126L898m343k162J6437L267j961j5639n959k781O310N332
$$ 1585 -8495 -12163 -37 3861 -482 -2644 13793 17060 15099 -540 -6499 -9280 -2970 2362
17092B362L110K237N51N408K459J0071O692m712j4517j2675j566K007K690J75
$$ 2362 5472 7709 8260 13668 16127 26198 32890 28178 13661 986 -580 1427 4117 4292
17078D292l538L950O725m952n319L997o420o667P083M685l776k023p57k176R42
$$ 4292 754 4704 11429 6477 1158 5155 -1265 -7932 -849 3836 60 -1963 -2720 -4896 -3954
17063c954l060R057P262l816p369q094P672o56J259k408k894M360M270L210n550
$$ -3954 -7014 2043 9305 5489 -1880 -9974 -2302 -2958 -1699 -4107 -7001 -2641 1629 4839 -711
17048g11L743L183n144r408l482J2622P107L419M490K401J573P837O63j419m878
$$ -711 3032 6215 1071 -8337 -11819 803 7910 11329 15819 18220 19793 27630 28293 26874 21996
17033B1996n270j2459o259J0642K053j09o884L730L327P6l618p252n777J3640
$$ 21996 16726 4267 -1992 8650 10703 10594 3710 7440 10767 10843 7225 -27 -5804 7836
17019G836J2142p113j0378J889J113j652q692O499P821o979O93L36o955j4312
$$ 7836 19978 12865 2487 4376 5489 3837 -4855 1644 9465 2486 3179 3515 -3440 -17752
17005a7752P752N90p209N269Q495J0929l416R368P254L519r415j1205J488P719
$$ -17752 -10000 -9410 -16619 -11350 -2855 8074 4658 14026 21280 24799 15384 4179 5667 13386
16991A3386m013q535M777R787L151j7124l503Q857o576j1959M053L853K720M513
$$ 13386 9373 838 5615 15402 18553 1429 -2074 6783 207 -11752 -7699 -3846 -1126 3387
16977C387J789l148l264N394R782L601m958j054K108m101p968l816K073L801J892
$$ 3387 5176 2028 -1236 4158 13940 17541 12583 11529 13637 9536 1568 -2248 -175 3626 5518
16962E518j2764M055J6191r85k023l950L36L422K592n054J849R560L488q111j2095
$$ 5518 -7246 -3191 13000 12015 9992 6042 6378 9800 12392 7338 9187 18747 22235 14124 2029
16947B029J67J2297K640m477l859r663m84p054O71N383j366J09M013Q405K104
$$ 2029 2196 14493 17133 12656 8797 -866 -1350 -8404 -7733 -2350 -3716 -3607 406 8811 10915
16932A0915K339O876j542L246O05o90K957k568M500L995n719M747J0851o942o089
$$ 10915 13254 20130 18588 21834 22439 21749 24706 22138 26638 30633 24914 29661 40512 33570 27481
16917B7481l14j453o152j338P68K808N358n797r527r392N16J143R941N793Q333
$$ 27481 27167 25714 19562 18224 18992 21800 27158 21361 11834 2442 2958 4101 14042 19835 28168
16902B8168j035J920P835M051K4541L5225L1374L4618J6220j67q487k1694l6941
$$ 28168 27133 29053 36888 40939 65480 100705 132079 166697 182917 182750 174263 152569 115628
16889A15628l3521k6643j4014q453n197N124m690j0045q54O49j847O919Q166J1025
$$ 115628 82107 55464 41450 32997 27800 32924 28234 18189 17335 17984 16137 23056 31222 42247
16875D2247Q571K338o355k066R811O669q561q551j466n662k103l058q856j1569
$$ 42247 50818 53156 46801 44735 54546 61215 52654 44103 42637 36975 34872 31814 22958 11389
16861A1389k046R512Q120O254k295m52l798M183n184q811l835K848K003m578j749
$$ 11389 9343 18855 26975 33229 30934 30482 26684 30867 25683 16872 13037 15885 17888 13310 11561
16846A1561J0436K883n162k65j209K407Q206K081n300o085o22J361m75L897K50
$$ 11561 21997 24880 19718 19453 18244 20651 28857 30938 25638 19553 18931 20292 19817 23714 23964
16831B3964o659p25P56n522P08q602k04N345N943j851M577j409l191l599J015
$$ 23964 17305 16580 17336 11814 12522 3920 3716 9061 15004 13153 17730 16321 13130 9531 10546
16816A0546j281j1634q71P614J3849K5307M526J3056J0713M159O43j2514m136
$$ 10546 9265 -2369 -3240 4374 18223 43530 48056 61112 71825 75984 76627 64113 59977
16803E9977J773j1455j2379j5149k446O354r12K850j1908L800N811n008j590J097
$$ 59977 61750 50295 37916 22767 20321 26675 25763 28613 16705 20505 26316 21308 19718 20815
16789B0815J3134K971o95J732J067j073n620L165n86O54J76O922O768N828N511
$$ 20815 33949 36920 36225 37957 39024 37951 32331 35496 34910 35564 35740 42662 49430 55258 60769
16774F0769j648o055j0713j309k81K996M721q090l728J3670M19K601k199k519
$$ 60769 59121 53066 42353 41044 40763 43759 48480 40390 36662 50332 50751 53352 51153 48634
16760D8634o051r340J215o47P600M845p92Q332p43N828Q705J998r856k0820p528
$$ 48634 42583 33243 34458 33811 41411 46256 45464 53796 53053 58881 67586 69584 59728 38908 31380
16745C1380j1258j5734p377k637R81J4828o417Q900K877K202k195m16P822l77
$$ 31380 20122 4388 -2989 -5626 -4645 10183 3766 12666 15543 17745 15550 15134 22956 22579
16731B2579k99n500L98P241O936k381r548M032J1650r41L180J2541J1663J3815
$$ 22579 22280 16780 17178 24419 31355 28974 19426 23458 35108 34167 37347 49888 61551 75366
16717G5366J5445L058p036m976p061m21O719M426m304J31K67M273L653J9547J6195
$$ 75366 90811 93869 86833 81857 74796 74375 81094 85520 81216 81347 81614 85887 89540 109087 125282
16702A25282J6062M4368P3000R6368J00127J14600J02410L9314k2752o5065r7974
$$ 125282 141344 185712 258712 355080 455207 569807 672217 711531 688779 623714 525740
16691E25740r9069p7711o0661l7791k3002k5908j9710r346l98n597r924k094Q839
$$ 525740 426671 348960 288299 250508 227506 201598 181888 172542 172144 166547 156623 154529 163368
16678A63368l962r586k995j908L756J0260j679J1293K2634J9469J1118J6529J6977
$$ 163368 159406 149820 146825 144917 148673 158933 157254 168547 191181 210650 221768 238297 255274
16665B55274K737O163J869O233j107N580Q483K892J0300J8375Q798K4074K2252
$$ 255274 258011 264174 266043 272276 271169 276749 285232 288124 298424 316799 325597 349671 371923
16652C71923J5946J0958L706J0988K8562L8431M3911O2180Q3862J15239J43239
$$ 371923 387869 398827 402533 413521 442083 480514 524425 586605 670467 785706 928945
16641I28945J46998J40084R5446P7530P9891J02284J42129J69910K05528K68440
$$ 928945 1075943 1216027 1311473 1389003 1468894 1571178 1713307 1883217 2088745 2357185
16631B357185L32149L67401M15643N14066O84702R72107J470741K308828L780832
$$ 2357185 2689334 3056735 3472378 3986444 4671146 5643253 7113994 9422822 13203654
16622A3203654O239851R510661J1737627J2153714J2993031J0991688K650962
$$ 13203654 19443505 28954166 40691793 52845507 65838538 76830226 79481188
16615G9481188m465522q375596j1621279j2496451j1034223q716360o237253m180304
$$ 79481188 75015666 66640070 55018791 42522340 31488117 22771757 16534504 12354200
16607A2354200k784054j908251j345560r71388p03718n04832l83780l44559l04292
$$ 12354200 9570146 7661895 6316335 5344947 4641229 4136397 3752617 3408058 3103766
16598C103766k89417k63612k21716j61044r2202m8805j9469P968k6610r5953j32242
$$ 3103766 2814349 2550737 2329021 2167977 2075775 2026970 2007501 2015469 1988859 1892906 1760664
16587A760664j55754j81366j83999j59443j23911j12466q9124p9504p2603o3158
$$ 1760664 1604910 1423544 1239545 1080102 956191 843725 754601 675097 602494 539336
16577E39336n2014m6077l9140l6476k3962k2752l0567j9462k3304l2089k2654
$$ 539336 487322 441245 402105 365629 341667 318915 288348 268886 245582 213493 190839
16566A90839p530r201n029L289J521m977q242o196j0974j0740j531n884j1391
$$ 190839 183309 174108 169079 172368 173889 168912 160670 154474 143500 132760 131229 125345 113954
16553A13954j7341j6972p553L648Q911J257q615p794j3335q141M302m375m438
$$ 113954 96613 79641 72088 75736 84647 85904 77289 69495 56160 48019 52321 47946 43508
16540D3508R357M795r295m285K936j0271o005R520K277L732m228J260P490P901
$$ 43508 52865 57660 48365 44080 47016 36745 30740 40260 42537 46269 42041 43301 50791 58692
16526E8692O930p119l937j672n529q145n679M340l833l560K223L034M102p422
$$ 58692 65622 58503 54566 52894 47365 39220 33541 37881 34048 30488 32711 35745 39847 32425
16512C2425O517Q797m436k942K276Q11L114n845n786L887o225j203R264P06J1276
$$ 32425 38942 47739 43303 40361 42637 43448 46562 40717 34931 38818 32593 31390 40654 41360 52636
16497E2636M018m625j746J783L512J4685m076J598K097j8660o933r231j6158k3238
$$ 52636 56654 52029 50283 52066 55578 70263 66187 67785 69882 51222 44289 35058 18900 -4338
16483d338j5516o379j308L901K916R300K347Q940J0283N530j1581j0670J0452
$$ -4338 -19854 -26233 -27541 -23640 -20724 -11424 -9077 -137 10146 15676 4095 -6575 3877
16470C877R867J723k854p914P90n806m944L145O928Q20q629K504M494m178q598
$$ 3877 13744 15467 12613 4699 5489 -317 -5261 -2116 4812 5632 -2997 -493 4001 -177 -8775
16455h775k04N935O429l983K23M537R657L047r566N361K612j1627j044N47k391
$$ -8775 -8979 -3044 3385 -598 -375 4162 13819 16866 7300 12661 15273 3646 2602 3149 758
16440G58k333r854m640J2566J452j243K232K946L249j7180j0134L842m121j1367
$$ 758 -1575 -11429 -16069 -3503 -2051 -3294 -1062 1884 5133 -12047 -22181 -18339 -22460 -33827
16426c3827o581R768K0889J2526R838j384q371J252J0435J912J445p463k809J308
$$ -33827 -40408 -30640 -9751 2775 12613 11229 2858 4110 14545 16457 17902 10439 7630 8938
16412H938m840j793l852O504J438Q07j896m333J615j1327j0202K151J7K936J2219
$$ 8938 4098 2305 -1547 4957 6395 7202 5306 973 2588 -8739 -18941 -16790 -16773 -13837 -1618
16397a618P578K43p213J693n887n757M199Q827O25j1271J178J656m588Q062N119
$$ -1618 5960 6203 -1010 683 -5204 -10961 -6762 2065 2690 -8581 -7403 -5747 -10335 -2273 2846
16382B846q656j224P158j224j4281o821l089O711K952R275L096j145L148R86l342
$$ 2846 -5810 -7034 124 -1100 -15381 -22202 -25291 -18580 -15628 -6353 -3257 -4402 -1254 -268 -3610
16367c610r45k926K606J222P153k223K213K805L326o139l358K731P511M878p369
$$ -3610 -4555 -7481 -4875 -3653 3500 1277 3490 6295 9621 3482 124 2855 10366 15244 7875
16352G875n178J928M639j598N846j0352m065Q065m861M353m138q768K022R80l012
$$ 7875 2697 4625 9264 7666 13512 3160 -905 7160 2299 6652 2514 -6254 -4232 -3252 -6264
16337f264l013O598J1178M579j2675r527N11o948N383K224M068o420L231Q428
$$ -6264 -9277 -2679 8499 13078 403 -9124 -8613 -15561 -10178 -7954 -3886 -10306 -7075 1353
16323A353N796j003r196j0281M15J299P299L602r246p602r992R950J3242K198
$$ 1353 7149 6146 -3050 -13331 -12916 -11617 -4318 -716 -9962 -17564 -27556 -17606 -4364 -2166
16309b166N852o018m103m840n613k087L009m924p062J2759J4294N424J041O796
$$ -2166 3686 -2332 -6435 -11275 -16888 -18975 -15966 -20890 -27952 -15193 -899 4525 5566 12362
16295A2362n497p669o286o197M464O452M150J329r457j396n586J184J1266K737
$$ 12362 6865 -804 -7090 -13287 -8823 -2371 1779 3108 -6349 -7745 -13331 -12147 -881 1856
16281A856p082K045O454j1177j0528J824P08m538N849J215j501k208N628o512
$$ 1856 -5226 -3181 3273 -7904 -18432 -16608 -15900 -20438 -14589 -13374 -14875 -17083 -11455 -17967
16267a7967k17L28K617Q433J993p495p947l607K186J8102P460n683o338m94K677
$$ -17967 -18184 -17856 -15239 -6806 -4813 -12308 -20255 -23862 -21676 -3574 3886 -1797 -8135 -8629 -5952
16252e952M039L870N742j1248m434l789n503O871K71m052j233J843L457L837j355
$$ -5952 -1913 1957 7699 -3549 -7983 -11772 -17275 -10404 -10133 -14185 -15418 -13575 -10118 -6281 -7636
16237g636M976J305m715j1881K762J4824Q945l390p597q47r163K879m823j844
$$ -7636 -2660 -1355 -6070 -17951 -15189 -365 8580 5190 -2407 -3254 -12417 -9538 -14361 -16205
16223a6205P616k293j587Q225n435j0101l285L724k971K989O818M136m271k445
$$ -16205 -8589 -10882 -12469 -4244 -9679 -19780 -23065 -19341 -22312 -19323 -12505 -8369 -12640 -15085
16209a5085o192L545p8M735O356J169P813j158p781J150j443L683N372k731p087
$$ -15085 -21277 -17732 -17810 -13075 -6719 -5550 2263 1105 -6676 -5526 -6969 -3286 2086 -645 -7732
16194g732p153n753n676L617O021k559l536l463K828N515J244o86P531L187m635
$$ -7732 -14885 -20638 -26314 -22697 -16676 -19235 -22771 -26234 -23406 -17891 -16647 -17333 -9802 -6615 -11250
16179a1250L07P36o262k176O703Q12n716Q345J4010K799l698n075Q52m357j6106
$$ -11250 -10943 -10207 -16469 -18645 -11942 -11130 -16846 -8501 5509 8308 4610 -465 387 -3970 -20076
16164b0076l46N157K041M192K50m157K334j041j771L450O285l861j0408Q62J2622
$$ -20076 -20422 -15265 -13224 -9032 -8782 -12939 -10605 -11646 -13417 -9967 -3682 -7543 -17951 -17089 -4467
16149d467k190k036r594L83r15o33O542J098O397J1783q685p012j760L295L325
$$ -4467 -6657 -8693 -18287 -17904 -18819 -19452 -12910 -11812 -5415 6368 -2317 -9329 -11089 -7794 -4469
16134d469M079J0439m85j820J306o708j822P648n546p802m277L952J2561n142
$$ -4469 -390 10049 9564 7744 9050 2342 520 8168 2622 -5180 -9457 -5505 7056 1914
16120A914l679L673P50m196q103P95K468n091N27Q608j352p766m160O058O358
$$ 1914 -1765 1908 2658 -1538 -9641 -8846 -6378 -11469 -10942 -2334 -3686 -11452 -15612 -9554 -3196
16105c196R241j015n699q339J529K900m683j353J609l705j894P850P833l580M884
$$ -3196 6045 5030 -669 -9008 -7479 -4579 -9262 -10615 -9006 -12711 -14605 -6755 1078 -2502 2382
16090B382r20k545M540o356J024p37l517L202P405m565K33m703J252K503P416
$$ 2382 1462 -1083 3457 -2899 -1875 -2612 -6129 -2927 4478 -87 146 -4557 -3305 -802 6614
16075F614q48K25P67O237O700M874k294N420J2582J2453J0497K2359K8674L8326
$$ 6614 5766 5991 6758 12995 19695 24569 22275 27695 40277 52730 63227 85586 114260 152586
16061A52586N7781O5733N2455L9596K7754n115l6603n6504n4690n3610m4409k6380
$$ 152586 210367 276100 328555 368151 395905 390790 354187 297683 242993 189383 144974 118594
16049A18594l1307l0698j8965r520q46N374Q83q148j0780K92k898j1709j931j344
$$ 118594 87287 56589 37624 28104 27258 32632 33515 25367 14587 14879 11981 272 -1659 -3003
16035c003j668M837R435J971q994j1613M285O518M263k835l475j481l34K91K263
$$ -3003 -4671 166 9601 11572 2578 -9035 -4750 1768 6031 3196 -279 -1760 -2094 -1803 460
16020D60k894J874M54N605O73m595j4399l604m643L52J1238J6464q670o376l644
$$ 460 -2434 -560 -106 5499 6172 1577 -12822 -16426 -21069 -20717 -9479 6985 -1685 -8061 -11705
16005a1705j0957J256R015K396J4770P739l649j0131k263K089P088l464n365k337
$$ -11705 -22662 -21406 -12391 -9995 4775 12514 8865 -1266 -3529 -1440 5648 2184 -3181 -5518
15991e518Q04K145O535N07j1774l262j1557j360M34N349Q827J6188j746q784O47
$$ -5518 -4714 -2569 3966 4473 -7301 -10563 -22120 -23480 -23046 -17697 -8870 7318 5572 -3212 -2565
15976b565N688p143o023J304P683m18p40O408m839l499p321n935k430J4568O421
$$ -2565 3123 -4020 -10043 -8739 -1056 -1474 -2214 4194 -645 -4144 -11465 -17400 -19830 -5262 1159
15961A159q373m60O311l346j3056n944n039O482J3344n049P72P610n3N850o33
$$ 1159 -7214 -7674 -1363 -4709 -17765 -23709 -28748 -22266 -8922 -13971 -13199 -5589 -5642 208 -425
15946d25O045M996m959j4999L301J0020j4282k299J8011N040j0095k07K513O709
$$ -425 5620 10616 5657 -9342 -6041 3979 -10303 -12602 5409 10449 354 147 2660 9369
15932I369O789j3992j2344j2186r488k986O154N965n003K746M301J229J2820J814
$$ 9369 16158 2166 -10178 -22364 -31852 -34838 -28684 -22719 -27722 -24976 -20675 -19446 -6626 -4812
15918d812p219O795l78q457o733L126M733j991R206R022q463m484r359K256k969
$$ -4812 -12031 -5236 -5614 -14071 -20804 -17678 -12945 -14936 -5730 3292 -5171 -9655 -19014 -16758 -19727
15903a9727N117P939O433o35j132k959M233n959L966j749k798L450K293M374j799
$$ -19727 -14610 -6671 -238 -873 -2005 -4964 -731 -6690 -2724 -4473 -7271 -3821 -1528 2846 1047
15888A047n455r00Q736m868n040M441O252o19L02l211r137J455J0221J0829q92
$$ 1047 -4408 -5308 3428 -1440 -6480 -2039 4213 3594 3896 685 -8452 -6997 3224 14053 13161
15873A3161j5687j65N356L276O835J968n442o865q897M362M251K062P660j0702
$$ 13161 -2526 -2691 2665 5941 12776 14744 9302 2437 -6460 -2098 2153 4215 11875 1173
15859A173n961N309R792l59j2571k622j380j603K320Q883J4077j0482j6142M48
$$ 1173 -4788 521 10313 9954 -2617 -5239 -6619 -8222 -5902 2981 17058 6576 -9566 -9118
15845i118J1259O880m194p149O939L296m58m258q49k177R912n15J121p435j698
$$ -9118 2141 9021 4827 -2322 4617 7913 7455 3197 2348 171 10083 9568 10689 3254 1556
15830A556m859o646j742N434J679J2742K534k472k995n079M77r080p101K460J939
$$ 1556 -3303 -9949 -11691 -6257 -4578 8164 10698 8226 5231 152 629 -8451 -15552 -13092 -11153
15815a1153O482P633N08l561k472J000q80Q0M832p67p590r47k349J674O229l673
$$ -11153 -4671 2962 3470 -91 -2563 -1563 -2443 -2363 2469 1702 -5888 -6835 -9184 -7510 -1281 -4954
15799d954j934M180o737o92J2690Q581o881p458o279k687L042J0597l488m108
$$ -4954 -6888 -2708 -9445 -10137 2553 11134 4253 -3205 -9484 -12171 -9129 1468 -2020 -6128
15785f128k714j0512R75P861O305n80M36L404n221o63L480K671J2056N57o961
$$ -6128 -8842 -19354 -18379 -10518 -4213 -4793 -4357 -953 -6174 -6837 -3357 -686 11370 11927 4966
15770D966j0696j642N018Q548O646j998j2521j3389k788J1547O213L661j774j2304
$$ 4966 -5730 -7372 -2354 6194 12840 10842 -1679 -15068 -17856 -6309 -96 3565 1791 -10513
15756a0513m948J5015J1731l682j5636O20Q143O247p079o024l254o431j69N932
$$ -10513 -15461 -446 11285 7603 -8033 -7413 730 6977 -102 -6126 -9380 -15811 -15980 -10048
15742a0048k851q532j1992m46N155P995P133K685r183N92O525N873R366o177n322
$$ -10048 -12899 -21431 -33423 -33869 -28714 -20719 -13586 -10901 -20084 -19492 -12967 -7094 2272 -3905 -9227
15727i227l922o38J522K074N645q876J128p935J0657J1235k701r724n335P811
$$ -9227 -13149 -13787 -12265 -10191 -4546 -13422 -12294 -20229 -9572 1663 -1038 -10762 -16097 -8286
15713h286J7746n702j3593K499K300m189q744J82Q241O356q61p308Q185M290n86
$$ -8286 9460 3758 -9835 -7336 -5036 -9225 -17969 -17787 -9546 -3190 -4051 -11359 -3174 1116 530
15698E30N228q115p224m797O882J245Q25k254p610j129l06L032j224k411J2105
$$ 530 5758 -2357 -9581 -14378 -7496 -6251 -5426 -7680 -15290 -16419 -16725 -13693 -14917 -17328 -5223
15683e223J1818k903m179J244k54J4741J093l570o048P106j708m755q134q425
$$ -5223 6595 3692 -487 757 503 15244 16337 12767 6719 13825 12117 7362 -772 -9197
15669i197m700m565k791P596j117n433K119P63K634N591R563R916o97o223m534
$$ -9197 -13897 -18462 -21253 -13657 -14774 -20207 -18088 -17325 -14691 -9100 463 10379 9682 3459 -1075
15654a075o091k185j364J207j2778k855R858k472J0405N988J523K882L129M393
$$ -1075 -7166 -9351 -10715 -9508 -22286 -25141 -15283 -17755 -7350 -1362 161 3043 6172 10565
15640A0565j2641j6519J75J7881j315o237o549p647N05n836N515J3872J085m61
$$ 10565 -2076 -18595 -18420 -539 -1854 -8091 -14640 -22287 -21782 -27618 -22103 -8231 -7146 -7607
15626g607R962N781l154n075k177Q79p860o58j520J189L421m703P852J1590j668
$$ -7607 2355 8136 4982 -93 -2270 -1391 -9251 -9909 -11429 -10240 -6819 -11522 -3670 7920 6252
15611F252o007j512j695p420J802O772m59K3O819J08K019p356o488l872N08j260
$$ 6252 245 -1267 -2962 -10382 -8580 -1808 -2267 -2244 4575 4683 6702 -654 -7142 -11014 -10506 -11766
15595a1766J284N881P527Q986j0530p096k532L637l463k47l13P004N198l523l385
$$ -11766 -10482 -4601 2926 11912 1382 -5714 -8246 -4609 -8072 -8319 -8632 -1628 3570 47 -3338
15580c338Q81q987m527O936K749K711Q059N793p714r546l149K518Q47P000l048
$$ -3338 -2457 -11444 -15971 -9035 -6286 -3575 4484 10277 2563 -6983 -10132 -7614 -6767 233 -2815
15565b815L822Oj804k865j0179M788J1348K484o620k61O239k511l105l523l561
$$ -2815 1007 1013 -791 -3656 -13835 -9047 2301 4785 -1835 -2096 4143 1632 -1473 -4996 -8557
15550h557O488K042M119m191j281l016O76K20Q489j710p553k380P226N428J092
$$ -8557 -2069 -27 4092 -99 -1380 -4396 -3720 -3500 4989 3279 -4274 -6654 572 6000 7092
15535G092J070k859n941q255R544L181r597o125l252p59J1665N250k540j242k171
$$ 7092 8162 5303 -638 -8893 651 3832 -5765 -11890 -15142 -15901 -4236 1014 -1526 -2768 -4939
15520d939J0035J1104r678m25K531p880n439M166O657j121L169q176p939O310
$$ -4939 5096 16200 6522 6097 8628 748 -4691 -525 6132 5011 8180 4 -7935 -1625
15506a625O867j196J186N637M051q888k856P003R621J069o164k455l928j0341
$$ -1625 5242 4046 5232 10869 14920 6032 3176 10179 19800 20869 14705 12250 8322 -2019
15492b019M041L032N501k158n466M980k079l665K821k54K034o44M057j893n511
$$ -2019 2022 5054 10555 8397 2931 7911 5832 2167 4988 4734 6768 6124 10181 8288 2777
15477B777o941m370q11K020P650o053q854o065J800J1824O180O487M306L851j2915
$$ 2777 -4164 -8534 -9345 -7325 325 -5728 -14582 -20647 -18847 -7023 -843 5644 9950 13801 886
15462H86m779j1234k969l288l01J3909J3580K133j1809m840l667N142O73R09R338
$$ 886 -3893 -15127 -18096 -21384 -21685 -7776 5804 7937 -3872 -8712 -12379 -7237 -6564 -5655 3683
15447C683r21p020r735o141K239K682M502J384N422R544N040k053p684o245j797
$$ 3683 2762 -4258 -13993 -20134 -17895 -15213 -10711 -9327 -3905 5639 10679 8626 942 -5303 -7100
15432g100J642m376m133J0729J4824k458q294q057P663K396p398O909J975O114
$$ -7100 -5458 -9834 -13967 -3238 11586 9128 834 -7223 440 2836 -4562 2347 4322 10436
15418A0436Q8p045o207o625N830J5215K383J204l843l692L132r39n454K037K734
$$ 10436 10524 3479 -2728 -9353 -3523 11692 14075 15279 11436 7744 10876 9937 4483 6520 9254
15403I254k1203K479Q771J978l181j3838P198R953O296o754l80m118L524N67L67
$$ 9254 -11949 -9470 -699 1279 -1902 -15740 -8542 1411 7707 953 573 -3545 -21 546 913
15388I13m215p116l771p793k833J5148K214Q769j1697m452J0048Q993J033n38
$$ 913 -3302 -10418 -14189 -21982 -24815 -9667 -7453 1316 -10381 -14833 -4785 4208 5241 4703
15374D703q940j200j851P145J0944J1448O165j3686o769J3128q901r887j532k534
$$ 4703 -4237 -5437 -7288 -143 10801 22249 28414 14728 7959 21087 12186 2299 767 -1767
15360a767q57Q506Q007j2166p94Q04m136m809j527Q238N751p585o697L282n370
$$ -1767 -2624 5882 13889 1723 929 1733 -2403 -7212 -8739 -501 5250 -2335 -9032 -5750 -11120
15345a1120k077m591K440M070M292l532K423m538l603M333J641K820p87P048O169
$$ -11120 -13197 -17788 -15348 -11278 -6986 -10518 -8095 -12633 -16236 -11903 -10262 -7442 -8229 -1181 4988
15330D988J18J758j895j4943l032J0776J1154l734p925K67k601j76n255n231O665
$$ 4988 5106 6864 4969 -9974 -13006 -2230 8924 5190 -2735 -2468 -5069 -5245 -10500 -15731 -9066
15315i066K639R113P956l124J32n607n555J936k637P895j522k410j246j159N540
$$ -9066 -6427 2686 10642 7518 7650 2043 -3512 -1576 -4213 3682 2160 -250 -1496 -2655 2885
15300B885j714L551j7683J51J5549j504M578O669M321k239J191M871k629j2777
$$ 2885 1171 4722 -12961 -12810 2739 1235 5813 12482 16803 14564 15755 20626 17997 5220
15286E220j7582m794K243O302J4756m733m607n0q023J931J0892o878p067M528
$$ 5220 -12362 -17156 -14913 -8611 6145 1412 -3195 -3245 -11268 -9337 1555 -5323 -12390 -7862
15272g862k555p334M669O850q35L751M190m671l731m020P474J838j786m337O273
$$ -7862 -10417 -17751 -13082 -6232 -7067 -3316 874 -3797 -7528 -11548 -4074 -2236 -4022 -8359 -2086
15257b086J2457o286k2716L259P858J2667J823q188J43J581j539q706l303P329
$$ -2086 10371 4085 -18631 -15372 -7514 5153 6976 -1212 -1069 512 -1027 -9733 -13036 -5707
15243e707m527M2O762O62n778M5P656Q958R76r841J76M684J000P892P122J80r454
$$ -5707 -10234 -10192 -3430 -2768 -8546 -8501 -845 8113 9089 -752 -576 4108 5108 13000 20122 20302 10848
15226A0848j1989k600L492O517L192j604j971N240M235m249k609K059J809q227
$$ 10848 -1141 -3741 -249 6268 9460 7856 5885 11125 15360 11111 8502 10561 12370 4143
15212D143j146O988L42J215o630j0269j3627J0617P525N382L232k526K303j162
$$ 4143 2997 9985 10327 11542 4912 -5357 -18984 -8367 -842 4540 7772 5246 7549 6387
15198F387j786K240n123j2780k005J856L245Q640n568l093N392Q178J4488q176
$$ 6387 4601 6841 1718 -11062 -13067 -11211 -7966 674 -4894 -7987 -2595 5583 20071 11895
15184A1895j0900L345J0929J570n944L984l536p179p836L21l48j947O889j446
$$ 11895 995 4340 15269 16839 10895 14879 11343 4164 -3672 -3351 -3699 -5646 1243 -203
15170b03l922k55R301J0185m316r534M233Q877J599o635Q47j388K458L540j0242
$$ -203 -4125 -4380 4921 15106 10790 1256 5489 14366 15965 9330 10177 8789 11247 14787 4545
15155D545m6O618O617l689l575L993q8N931k697k513j060m321j0456m565P189
$$ 4545 4499 11117 17734 14045 10470 14463 14375 20306 17609 15096 14036 9715 -741 -5306 1883
15140A883P494J783n170k236R098j940L968M958m900n338j084k558k140Q583j462
$$ 1883 9377 11160 5990 3754 12852 10912 14880 19838 14938 9600 8516 5958 3818 12401 10939
15125A0939J148n212r725k89L723k655m259l475L017P330J370N108l196L78J410
$$ 10939 12087 6875 -2850 -3139 584 -2071 -6330 -9805 -6788 542 1912 7020 3824 4202 5612
15110E612j0865n915o446P729M344l265j259J4385Q87l529O9K014l374j800J1896
$$ 5612 -5253 -11168 -17614 -9885 -5541 -8806 -10065 4320 5207 1678 1747 3761 387 -1413 10483
15095A0483O251p262o593m235J1188j279o098l537N377k139j143N217J299Q11
$$ 10483 16734 9472 2879 -1356 9832 8553 2455 -1082 4295 2156 1013 6230 7529 8340
15081H340l045L779p097j562J1559M461r228J445N277k242L089m070j2993j171
$$ 8340 5295 9074 1977 415 11974 16435 7207 8652 13929 11687 14776 10706 -2287 -3458
15067c458J1343M159n587j954m636k316J126K779n60J674l270M461j9M322l367
$$ -3458 7885 12044 6457 4503 -133 -2449 -1323 1456 896 2570 -700 3761 3742 8064 4697
15052D697R2n51L648l836n789j379k188j990J651j456j23j965K568n325K580N455
$$ 4697 4789 4238 7886 4050 -1739 -3118 -5306 -7296 -5645 -7101 -7224 -9189 -6621 -11946 -9366 -3911
15036c911P495J658o968m103l151j1056o603J0748P624R602N337q733n066R709
$$ -3911 3584 5242 -1726 -5829 -8980 -20036 -26639 -15891 -8267 1335 6672 -2061 -7127 2582
15022B582Q759l605l069J773j077j5968m834O84Q783N026k187K037J775M700L543
$$ 2582 11341 7736 4667 6440 5363 -10605 -15439 -14755 -5972 -946 -3133 -1096 679 5379 8922
15007H922j0345k608M629M242P652k01p350j3214K375O253M415Q384N93J687m979
$$ 8922 -1423 -4031 598 4840 12492 12291 4941 -8273 -5898 355 4770 13154 13747 15434 10455
14992A0455J1859j154j2653m210q62n9M747q353p916R3P750J0209k505p138K430
$$ 10455 22314 21160 8507 4297 3435 3376 8123 -230 -8146 -8053 -303 9906 7401 263 2693
14977B693M267J938l510p004M074M974m186n127P323Q181N77j491J237K818N11
$$ 2693 6960 8898 5388 -1616 2458 7432 3246 -1881 5442 13623 14200 12709 13946 16764 17275
14962A7275k327l34k085K651l572j1290p205J937O610l711o161r422r656j416
$$ 17275 14948 14614 12529 15180 11608 318 -6887 -4950 1660 -2051 -8212 -17634 -27290 -28706
14948b8706Q645L814J2904P369q86n662k77P371P677P70L557M248O956p9P237
$$ -28706 -20061 -16247 -3343 4026 3140 -2522 -2799 4572 12249 13019 16576 20824 27780 27701 34938
14933C4938J864k515k5094j2496O753o26K831p264j506J625O623L037K138K658
$$ 34938 36802 34287 9193 -3303 3450 2824 5655 -1609 -3115 -1490 5133 8170 10308 12966
14919A2966p051K476o084r984J2736L830M294K322l641r018p044J554R253K7O428
$$ 12966 5915 8391 2307 -7677 5059 8889 13183 15505 11864 2846 -4198 -2644 6609 6636 13064
14904A3064N912M926r152k590p583R587M450J643O134j1160p163q743J117l32
$$ 13064 18976 23902 14750 12160 4577 14164 18614 20257 26391 15231 8068 -675 442 110
14890A10q113j379j305R540Q728o1r80K075l010o475m585J0N522r494p500N387
$$ 110 -8003 -9382 -10687 -1147 7581 7520 6540 8615 5605 -870 -5455 -5445 77 -9417 -16917 -11530
14874a1530O876M536Q025k906p191N07n029k231l093N257M680l886J238m154o22
$$ -11530 -4654 -118 7907 5001 -2190 -1683 -6712 -8943 -12036 -6779 -2099 -5985 -4747 -8901 -9523
14859i523J174l351M281J1738R969J706k239o73N16l734j599m005o916J922K49
$$ -9523 -8349 -11700 -7419 4319 14288 15994 13755 13082 13598 9864 8265 4260 -2656 -734 -485
14844d85k303N062j678L367N513k554L239o800n691l828K01K858K421M523K554
$$ -485 -2788 2274 596 3963 9476 6922 10161 3361 -2330 -6158 -5957 -3099 -678 3845 6399
14829F399o899J3128L250j2395l584Q473M049P84p404j757N192j272m769j411
$$ 6399 -500 12628 15878 3483 -101 8372 12421 13205 5801 4044 9236 7964 3195 1784
14815A784O161M61n07L34j0510M68N57j0139M413R660l085l069o061o90J225J0
$$ 1784 7945 8406 7899 8233 -2277 -1809 -1252 -11391 -6978 2682 -403 -3472 -9533 -10223 -8998 -8988
14799h988J779J1974Q1m959p772L866N46q061J143Q849K92J717J1517m05r982
$$ -8988 -7209 4765 4846 -113 -7885 -4019 -3473 -11534 -10391 -1542 -1250 467 11984 11579 1597
14784A597J587k352n203K231M220k528l39Q231O414J275n768O5J308L520m386
$$ 1597 3184 832 -4371 -2140 2080 -448 -787 7444 13858 15133 9365 9430 10738 14258 9872
14769I872K083J97k370L669p925n473Q9L360M081l275n113k381M313Q002r32m290
$$ 9872 11955 12152 9782 13451 5526 53 142 3502 7583 4308 -805 -3186 1127 9129 8197 3907
14753C907j973J612O121j33Q06l35M651K912j3994j4407J188N908j1n208L363
$$ 3907 1934 3546 9667 9534 10340 10005 14656 17568 3574 -10833 -9645 -3737 -3748 -8956 -5593
14738e593M693J3515k336n532l925R845L008q958L988J060K69l791M005O548j311
$$ -5593 -900 12615 10279 4747 822 10667 13675 4717 8705 9765 10034 6243 10248 16796 15485
14723A5485l896n8m632l483k377Q692N209K397O22m262L126R84j850J101r905
$$ 15485 11589 11531 6899 3416 1039 9731 14940 17337 17959 13697 16823 17807 15957 17058 7153
14708G153J551P706M159J476m881r45o094L311M372j0144o877J834k44J085Q223
$$ 7153 8704 16410 20569 22045 17164 16219 10125 13436 17808 7664 787 2621 2377 3462 11685
14693A1685K916l964j1975J177J523j566P537M213r291Q54Q814J340j150k098
$$ 11685 14601 10637 -1338 -161 1362 -204 7333 11546 2255 3109 11923 13263 12113 10015
14679A0015L385j456M172k356o518M081J0249Q732N885M358m02J705N828l63m24
$$ 10015 13400 11944 16116 13760 7242 11323 21572 30304 36189 40547 40145 41850 47678 47315 46891
14664D6891N103O287J065L0633M3154N9655O5778N4382L6454q478j5481l3573
$$ 46891 51994 58281 59346 89979 133133 192788 258566 312948 349402 340924 325443 291870
14652B91870n0071n5196n1060m2380k3730j0921J621q44r626j5850o679r112O99
$$ 291870 241799 186603 135543 93163 69433 58512 60133 59289 49663 33813 27134 18022 18721
14639A8721k286j74L04L29J911n859q723j406k177M451J1227K927m69J224j570
$$ 18721 16435 16261 16565 16894 18805 12946 4223 2817 640 5091 16318 19245 18776 20000 18430
14624A8430m038l771m881P040M721r115l101O501R214O758j0048j97k061n727
$$ 18430 14392 10621 5740 12780 17501 8386 5285 11786 21000 27758 17710 17513 15452 9725
14610I725J2733j0629m026N854P033p054n060j800k012J353J7N051J001m473k17
$$ 9725 22458 11829 7803 13657 20690 13636 8576 6776 4764 6117 6134 11185 12186 7713 7496
14595G496r280j0697R515O605o842L614M441K426K531n05R430J0090k220l260
$$ 7496 -1784 -12481 -2966 3639 -3203 411 4852 7278 9809 9304 18734 28824 26604 23344
14581B3344r222K402R709m900o787n230p12M722K090M655n909J680M04J4429O141
$$ 23344 14122 16524 26233 21333 14546 9316 8604 13326 15416 20071 14162 15842 16246 30675 36816
14566C6816p312j4237J597J684k877Q158k46L972N053K383r473p161q322m990
$$ 36816 29504 15267 16864 18548 15671 23829 23583 27555 32608 34991 25518 18357 10035 5045
14552E045o5q352j046K875J030L043l521R485m41m580r61M340N730m993l962k828
$$ 5045 4980 -3372 -4418 -1543 -513 2530 -991 8494 8053 3473 2512 6852 12582 7589 3627 799
14536G99K332O685j232o320k18L837m023o372Q861J809K474O589K865j329j628
$$ 799 3131 9816 8584 2264 2046 5883 1860 -4512 4349 6158 8632 15221 18086 16757 15129
14521A5129p140K392l36l185J386J3876R288n537l666o393M318j036k730k272
$$ 15129 7989 10381 10045 6860 8246 22122 31410 25873 22207 15814 20132 19096 16366 14094
14507A4094Q32j859N549K353M088m350L793J667j0328p810k037N480J2486l744
$$ 14094 14926 13067 18616 20969 25057 20707 24500 26167 15839 8029 5992 11472 23958 20214
14493B0214j0398j20K124Q649M715k301j935N899j431j2046r0j934Q300R52l092
$$ 20214 9816 9696 11820 20469 25184 22883 20948 26847 25416 13370 13280 11346 19646 20598 17506
14478A7506O130k352o063N700k927l413J2422M555n794K680q176L165R981L322
$$ 17506 23636 21284 15221 20921 17994 14581 27003 31558 25764 28444 20268 23433 33414 36736
14464C6736K29q043k476J130n718j1430j2914k826l84J120Q878N292P852K627
$$ 36736 36965 28922 26446 27576 21858 10428 -2486 -5312 -5696 -4576 4302 9594 17446 20073
14450B0073l676K669P422p46L05L64m069j0252o743O315Q409N950l355L38J327
$$ 20073 16397 19066 26488 25742 26047 26411 22342 12090 5347 11662 20071 26021 22666 23004 24331
14435B4331j223m916k05N551l394J33n828J0410J5802M36n230k73L361p963k047
$$ 24331 23108 18192 17987 23538 20144 20277 14449 24859 40661 41097 35867 35594 38955 30992 28945
14420B8945l180M84n616o710N636N347k301K276L239j807o406j3202j247R937
$$ 28945 25765 26249 20633 13923 19559 24906 22605 24881 28120 26313 19907 6705 5458 15395
14406A5395k240P173J453p771n946J645J0922R797k878J275P48k065K638J5252
$$ 15395 13155 20328 21781 14010 8064 9709 20631 30428 27550 28825 29573 27508 30146 45398
14392D5398J0338J1261q207J59P573J2185P803J0929K1836J8474L0390L5380L7030
$$ 45398 55736 66997 58790 58949 66522 78707 86510 97439 119275 137749 168139 203519 240549
14379B40549K4300J7547J4624K143o630j3402k3190k8521l5464m2696k3094l530
$$ 240549 264849 282396 297020 299163 292533 279131 255941 227420 191956 149260 126166 122636
14367A22636o548m561m909j5312J676m80J564l700O988O20l650J520O658K445
$$ 122636 116088 111527 106618 91306 92982 92502 94066 90366 97354 97974 94324 95844 102502 104947
14353A04947o926K194J3653n80K626J2399K7009K2004K2114K8640L1265K8023
$$ 104947 98021 100215 113868 113288 115914 128313 155322 177326 199440 228080 259345 287368
14341B87368Q006Q075O233j6406k1407m2610l5924l4288j7470j8635j8100r557
$$ 287368 295374 303449 309682 293276 271869 229259 193335 159047 141577 122942 104842 95285
14329I5285j6432j1856R98L054p316p471J846N83n948m621j987j242j326j097
$$ 95285 78853 66997 67995 71049 63733 56262 58108 58691 52743 48122 46135 44893 43567 42470
14315D2470l740N120K549P82k726m117j2011j983k347J3956J4657M04j1365j1609
$$ 42470 38730 43850 46399 47181 44455 40338 28327 26344 23997 37953 52610 53014 41649 30040
14301C0040j794J0470R263o559L187L61j175j3507j595K739J0793O690m203k431
$$ 30040 28246 38716 47979 41420 44607 44968 43793 30286 28691 31430 42223 48913 44710 42279
14287D2279O7k786j54L380L448P10K718O735k547J3106J061l501O593n05N640
$$ 42279 42346 39560 39406 42786 46234 46944 49662 56397 53850 66956 68017 64516 71109 70604 76244
14272G6244j177j0045j4638k11J0109j050q07l165n358K70m252r101P54l423J149
$$ 76244 75067 65022 50384 50173 60282 59232 58425 55260 49902 50172 45920 36819 37573 34150 35299
14257C5299l506j1526O7N766L375m27k777j167p319J050P631O052L951m835m110
$$ 35299 31793 20267 20334 26100 29475 29048 26271 25104 17785 18835 26466 32518 36469 31634 27524
14242B7524N883J4018M384p619j648R70N317l209k502M687m78k294P014K415o556
$$ 27524 33407 47425 51809 44190 42542 43512 48829 45620 43118 47805 47327 45033 52047 54462 47906
14227D7906R508r25p051j595q5J8526m982j1356K505K56q362o416P521M753o058
$$ 47906 57414 56489 49438 47843 47758 66284 61302 49946 52451 52707 44345 37929 45450 50203 44145
14212D4145k530R14Q582N42k640o155O365O346q750l139l015l644N141P26o527
$$ 44145 41615 42529 51111 51653 49013 42858 49223 55569 46819 43680 40665 37021 42162 42888 36361
14197C6361O810R201N243N742k964r775n590M546M745P851l239L999J0548l85
$$ 36361 43171 52372 57615 63357 60393 50618 45028 49574 54319 62170 58931 62930 73478 73093
14183G3093K010M0N45q648Q856L168m861m726q652j2148Q31Q700J416j3741l461
$$ 73093 75103 75143 75688 67040 75896 79064 74203 69477 60825 48677 49508 58208 59624 45883 42422
14168D2422J2898J3570O0o972n426J836L323K022M281m807j788J2986L983l676
$$ 42422 55320 68890 68950 61978 56552 58388 61711 63733 68014 63207 61419 74405 78388 74712
14154G4712o378l492q509l33J3123N081k589M81M438J050L530O8P525Q104k719
$$ 74712 68334 64842 56333 56000 69123 74204 71615 72096 76534 77584 81114 81182 88707 96811 94092
14139I4092j1501j2051P412L087k0882j6840O073M3R886O022k711k63P326L250
$$ 94092 82591 70540 77952 81039 60157 43317 49390 49433 59319 65341 62630 62367 69693 72943
14125G2943q41k473L292R2r688J49P361J0096L814J686l456J182R314j835j697
$$ 72943 72102 69629 72921 73013 63325 63474 70835 80931 84745 86431 82975 84157 93471 91636 89939
14110H9939l603p975j1689P60M009j179K495m279k877n059j609m49l319M22j651
$$ 89939 86336 78361 66672 67432 71441 70262 72757 68478 65601 60542 58933 58484 55165 55587 53936
14095E3936J810J336P477L411o848n54N547Q524J1404M306J1212J104k640N353
$$ 53936 55746 57082 64559 67970 61122 60568 66115 74639 86043 90349 101561 102665 100025 105378
14081A05378L673j689l539q745O166K14j0418L382M302l641p735N034L470K728
$$ 105378 109051 107362 103823 95078 101244 101458 91040 94422 98724 95083 87348 92382 95852 98580
14067I8580n718L638J2435K436O04O21l437j0143O486K440m220N621o346j0145
$$ 98580 92862 96500 108935 111371 111975 112596 109159 99016 105502 107942 103722 109343 102997 92852
14053I2852j887j0761j5097J864N422n386j366R584J3165J4269m710o030L397
$$ 92852 90965 80204 65107 66971 72393 67007 65641 75225 88390 102659 97949 91919 95316
14040I5316r96j811J777N778J1645k799N795J0221j2O233M420L5L364O579k524
$$ 95316 94320 92509 94286 100064 111709 108910 114705 124926 124914 131147 135567 135602 138966 145545 143021
14025A43021l713L679P157P125J1467J89J298l710j7945o795n270n019q741M501
$$ 143021 139308 142987 150144 157269 168736 168925 170223 166513 148568 141773 136503 131484 122743 127244
14011A27244J3347J4103L081K779J8071J1229M485j348M414N073K695N771J1948
$$ 127244 140591 154694 157775 160554 178625 189854 194339 192991 197405 202478 205173 210944 222892
13998B22892J3719j324P160J0942L182J4016J6096J3681O119J3948J5041J4974
$$ 222892 236611 235287 242447 253389 256571 270587 286683 300364 306483 320431 335472 350446
13986C50446J8250J8298K3705M5455O1526N9320P0063O8649O8281N2893J6557
$$ 350446 368696 386994 410699 456154 517680 577000 647063 715712 783993 836886 853443
13975H53443q503k5050m0165l4381l6870k4508q040K538L133R461R949P402J4168
$$ 853443 844940 819890 779725 745344 708474 683966 675926 678464 681597 691058 701007 708409 722577
13962G22577K8466L5410L8361L0231M2334K9112L9806N5552O8111P7009Q5365
$$ 722577 751043 786453 824814 855045 897379 926491 966297 1021849 1089960 1166969 1252334
13951A252334R1477J12413J43377J68556J92947K25013K52526L08012L54197M24810
$$ 1252334 1343811 1456224 1599601 1768157 1961104 2186117 2438643 2746655 3100852 3525662
13941C525662M95534N51108O35016P29260Q57906J029673J285171J646007K165063
$$ 3525662 4021196 4572304 5207320 5936580 6794486 7824159 9109330 10755337 12920400
13932A2920400K847908L753935M868422N983077O712374O604307N477636L520473
$$ 12920400 15768308 19522243 24390665 30373742 37086116 43690423 49168059 52688532
13924E2688532J043548j586572l797774n141407n567679n262896m550428l748848
$$ 52688532 53732080 52145508 48347734 43206327 37638648 32375752 27825324 24076476
13916B4076476l018213k398075j879889j495099j189641r48016p59659n77568
$$ 24076476 21058263 18660188 16780299 15285200 14095559 13147543 12387884 11810316
13908A1810316m27297k93486j40985N253J52022K92103M50923O22781Q03739J021285
$$ 11810316 11383019 11089533 10948548 10953801 11105823 11397926 11848849 12471630 13275369 14296654
13898A4296654J298700J626050K063699K656564L452474M389229N364606O057467
$$ 14296654 15595354 17221404 19285103 21941667 25394141 29783370 35147976 41205443
13890D1205443N973414M851837K852046L41520k322653m629316o105047o579704
$$ 41205443 47178857 52030694 54882740 55224260 52901607 48272291 42167244 35587540
13882C5587540o200547n352257m358590l446816k696385k120066j683468j353940
$$ 35587540 29386993 24034736 19676146 16229330 13532945 11412879 9729411 8375471
13874H375471j102485r36805p82047o61765n59038m67588l99522l33089k75055
$$ 8375471 7272986 6336181 5554134 4892369 4333331 3865743 3466221 3133132 2858077
13865B858077k42791k09843j87089j74044j48338j26682j27338j05132j01659
$$ 2858077 2615286 2405443 2218354 2044310 1895972 1769290 1641952 1536820 1435161
13856A435161j07253j04586q7612p1700p6851q4603o4655o1679o2856n0961m4136
$$ 1435161 1327908 1223322 1135710 1064010 987159 902556 837901 776222 713366 662405 618269
13845F18269m4986l6649k4818k6213l9163l3101j7073j6573j6843p790n686j6932
$$ 618269 573283 536634 511816 485603 446440 413339 396266 379693 362850 355060 349374 332442
13833C32442j6137j8618j9936n088j697n208j1939j2808j6199o692j0823j8090
$$ 332442 316305 297687 277751 272663 270966 265758 253819 241011 224812 218120 207297 189207
13821A89207j4564j2428j0197j358K708m677o37R990M702j1202j8920j2955O711
$$ 189207 174643 162215 152018 150660 153368 148691 148054 158044 162746 151544 132624 119669 126380
13808A26380J1705K994K794Q958M867M989o849J797P27m530l512j2512j1861j2596
$$ 126380 138085 141079 143873 152831 157698 162687 155838 157635 158362 153832 150320 137808 125947 113351
13794A13351n949r062q041l234m984m667m311r465m2R283R954O499l207j1395
$$ 113351 107402 98340 90299 87065 82081 77414 73103 63638 63596 72879 82833 89332 86125 74730
13780G4730m157P438k361j0533n925L693R936O795N205m574k26L333l68K757k138
$$ 74730 70573 78011 75650 65117 59192 62885 72821 79616 84821 80247 80021 83354 82986 85743 83605
13765H3605k866l654M969j2400l469Q315k14j1848m556n685R58k433k710j3539
$$ 83605 80739 77085 82054 69654 66185 74500 74286 62438 57882 52197 53155 50722 48012 34473
13751C4473j3742n049J200L302j606k156j278k054j500L260J736l638j6826m776
$$ 34473 20731 15682 16882 20184 18578 16422 15144 13090 11590 14850 16586 12948 -3878 -8654
13737h654O595O404O798Q59n975N815J0962R287L38q93q398m90K596l226J326
$$ -8654 -2059 4345 11143 12002 6027 11842 22804 32091 32429 31536 23138 22648 25244 22018 23344
13722B3344j726N173J0496R62n095n023m225R301L166q027p255m210P687l553
$$ 23344 21618 26791 37287 38249 33154 28131 23906 33207 36373 28346 21091 16881 24568 21015
13708B1015l369R28k394n714j4007l884O082r103k483m516n442J5917Q582m524
$$ 21015 17646 18574 16180 10466 -3541 -7425 -1343 -10446 -12929 -17445 -22887 -6970 1612 -2912
13694b912o442M821J0693P767P595J77l010j0488p868J0296J4522K993k831j112
$$ -2912 -9354 -4533 6160 13927 21522 21699 18689 8201 333 10629 25151 28144 25313 24201
13680B4201k129J642K323p844k190o001O973J263j0349n436J1303k002j501j001
$$ 24201 22072 23714 26037 18193 16003 10002 16975 18238 7889 2453 13756 11754 10253 9252
13666I252K347k50J530p273L757K27l557q5L225O918k743l250j1352k786Q031
$$ 9252 11599 11349 12879 5606 9363 9590 6033 5948 9173 16091 13348 10098 -1254 -4040 3991
13651C991j602L739j329j0029n144P464R579R391k270k632M821p801m495J405
$$ 3991 2389 6128 4799 -5230 -10374 -2910 6669 16060 13790 11158 15979 8178 3683 5088
13637E088P171R706k929M422J0164N336M819L53p828l022m326p96o004k229k359
$$ 5088 12259 21965 19036 23458 33622 38958 43777 44130 36302 33280 28954 28158 22154 19925 17566
13622A7566K13j0698j1820j710M725n286J0629J9864k025l426M21l05o104n730
$$ 17566 17779 7081 -4739 -6449 -1724 -7010 3619 23483 21458 18032 18453 18148 12044 6314
13608F314j078p207O119R897N068j522J069j320q098p3O081N177J0509L517M714
$$ 6314 5236 -1971 4148 14045 19113 17591 18660 17340 9242 9169 15250 20427 30936 34453 39167
13593C9167k793j4640r598L583K561K057p263j539n933j5464n878O299M897N335
$$ 39167 36374 21734 12136 15719 18280 20337 13074 11535 5602 -9862 -15740 -9441 -4544 791
13579G91N702o157j3476P135Q161Q261j37m065J342O15j2765j3431M518R901L944
$$ 791 6493 336 -13140 -6005 2156 10417 10280 6215 7557 8172 -4593 -18024 -13506 -3605 339
13564C39L539R884M655J310o271r502K588M416l558q50P510K503O77k325Q20L321
$$ 339 3878 13762 18417 19727 13456 3954 6542 10958 7400 6550 14060 16563 17240 14915 15735 19056
13548A9056M112j1381l716L544k986j3810j136J0344k087L304m767n286n819K011
$$ 19056 23168 11787 8071 11615 8629 -5181 -6317 4027 1940 5244 477 -4809 -10628 -8617
13534h617J462M285L89p956J0521J0748L560j0577K279J0767J967r719l573J600
$$ -8617 -7155 -2870 -2481 -10437 84 10832 14392 3815 6094 16861 18828 9109 5536 7136
13520G136L091k853P607j239K808j526q326M379M706k137L049J0112L050n937
$$ 7136 10227 7374 14981 13742 16550 15024 6698 11077 15783 13646 16695 26807 29857 23920
13506B3920l794p091r368q93L355J895J737n282n754N914K659R92P781Q307J364
$$ 23920 20126 13035 3667 2774 6129 8024 9761 4479 -1275 4639 7298 8290 16071 24378 25742
13491B5742j679j2091L51J502n372L240K0449J0160l211m194O746j42N742K376
$$ 25742 24063 11972 12323 13825 8453 11693 32142 42302 39091 34897 41643 41501 47243 49619
13477D9619k573J1844L056J4368P606K2810L3192L1970M0794L7248L0162K1995
$$ 49619 47046 58890 61946 76314 83920 106730 139922 171892 212686 249934 280096 302091
13465C02091N725r571k6955k9633k6844k4100k6238j2594p108k4717j4843p84
$$ 302091 307816 298245 271290 241657 214813 190713 164475 151881 144773 120056 105213 104429
13453A04429j7094j6355J137N441P2N032j0018m738J6548j710n411LL540P001
$$ 104429 87335 70980 72117 77558 77630 82662 72644 67906 84454 82744 77333 77336 80876 87877
13439H7877Q461k177J1797J5050J1216K5640K7989L4819K7877K3580J7143P145
$$ 87877 96338 94161 105958 121008 132224 157864 185853 220672 248549 272129 289272 296417
13427B96417k215j2065l0427l1868k4515k8979l1223k3764j6192n349m579o888
$$ 296417 294202 282137 251710 219842 195327 166348 135125 111361 95169 89820 85241 78353
13415G8353j4464m192j4308j2770K87j0860p383p187O623P259j053o582J51P759
$$ 78353 63889 59697 45389 32619 32906 22046 14663 7476 14099 21358 20305 13723 13874 21633
13401B1633N848o029l345j250N27m160M60P464r58K7o472j612Q907P053m193o907
$$ 21633 27481 21452 18107 16857 17384 13224 13684 21148 20190 20217 13745 12133 21040 28093 23900 16993
13385A6993n353M260O797j212J4o548R140j896M877N7m414K933p478m113l44J189
$$ 16993 11640 15900 22697 21485 21499 14951 24091 22195 27072 27129 22715 25648 18170 14057 13713 14902
13369A4902R587N088k867q912j1282l613k925k292p416k629J2809J1293K45J00
$$ 14902 24489 29577 26710 17798 6516 2903 -22 -2314 -9730 -12359 450 11743 11988 12088
13355A2088j215n512N837k434m292J7552n619j3104Q99O705M669j3859m134k581
$$ 12088 10873 5361 11198 8764 4472 22024 16405 3301 4200 10905 15574 1715 -2419 -5000
13341e000P368j585l4O402Q421m079r921L712l812L024N62J054J0960p30j4153
$$ -5000 2368 783 749 7151 15572 11493 1572 5284 1472 4496 5058 6112 17072 16342 2189
13326B189k452O071Q536j454k452R162N1k093o332O235J061o379M158N732r094
$$ 2189 -263 5808 14344 12890 10438 19600 19651 17558 11226 17461 18522 12143 16301 22033 12939
13311A2939j1110o367M274J7l34P803M043r81k075O727M404n514q078m598o051
$$ 12939 1829 -4538 -264 -247 -581 7222 11265 10284 8209 14936 19340 13826 5748 1150 -4901
13296d901p01J0566L658M745l62m345Q08J668L428m835o293j11J2484J787L883
$$ -4901 -5602 4964 8622 13367 13005 8660 9468 11136 14564 9729 3436 3325 15809 17596 21479
13281B1479q58L114k475L828m840j5548K989P046R975m743k483k981m996M984
$$ 21479 20621 23735 21260 25088 20248 4700 7689 14735 24710 19967 17484 14503 9507 14491
13267A4491J6265J2208n907j5999o874m969K407k355p959K641K823N881O608Q534
$$ 14491 30756 42964 37057 21058 14184 9215 11622 9267 1308 3949 6772 12653 19261 27795
13253B7795p640j223Q898K936o084q186M575l227o942p840k288o841k796J248
$$ 27795 20155 18932 27830 30766 24682 16496 21071 17844 10902 3062 774 -6067 -8863 -7615
13239g615R812M709R049J100M19o252l302r63k711J285m012K41P26k163J739J453
$$ -7615 2197 6906 15955 17055 17474 11222 7920 6957 4246 5531 1519 1760 2486 323 2062 3515
13223C515j441P700L402J903M733m781q945O464J1209P001Q574m110j2081M152
$$ 3515 2074 9774 13176 15079 19812 15031 6086 12550 23759 30760 39334 35224 23143 27295
13209B7295N330k2740m899J0509K596N088Q562o553Q50l131M781Q894Q7N817Q6
$$ 27295 32625 9885 4986 15495 18091 23179 31741 25188 26038 22907 27688 36582 36669 42486 42572
13194D2572n501o885J150M245J2206M849q093m094J0M667J4255K4059J3851J2075
$$ 42572 37071 30186 31336 35581 47787 52636 44543 40449 40459 45126 59381 83440 97291 109366
13180A09366j892j0347j813m764k1428j3695j7282j1043m494K49r477M412J0755
$$ 109366 107474 97127 95314 90550 69122 55427 38145 27102 22608 22857 13380 17792 28547
13167B8547P23q655N295M255k838q857L966P12L239k930j147M932J3688K237Q507
$$ 28547 29270 20615 25910 30165 27327 18470 22436 23148 26387 23457 22310 27242 40930 43167 51674
13152E1674R515P915Q334j292j5991o909n337K591Q954Q493K0910J9791J6558
$$ 51674 61189 69104 77438 76146 60155 53246 47909 50500 59454 67947 88857 108648 125206
13139A25206L4093O0331O3061M0102N320l1276m6286m1358l8176k3116r395j602
$$ 125206 159299 219630 282691 322793 328113 296837 250551 209193 171017 147901 138506 136904
13127A36904j0027N746K5969L8896K5793M6851P3344J25630K22484L59234L95208
$$ 136904 126877 132623 158592 197488 223281 270132 343476 469106 691590 1050824 1446032
13116A446032J37025j46006k82293l09022k39304j58027j05788o0594l9375m3085
$$ 1446032 1583057 1437051 1154758 845736 606432 448405 342617 282023 242648 199563
13106A99563l0835k3135j2276j5985j2029q914n894N725K268l024J8636K8746
$$ 199563 168728 145593 133317 117332 105303 96389 90495 96220 98488 95464 114100 142846
13094A42846M1686N3396O0890M8352J6813k6834n8315n8680n5747l3342j9280
$$ 142846 184532 237928 298818 347170 363983 337149 278834 220154 164407 131065 111785
13083A11785n405j9277q112l318R22M45o171k441l940n820N448k971q24R964j2752
$$ 111785 106380 87103 78991 75673 76595 77040 70869 68428 64488 58668 64116 61145 60321 70285 57533
13068E7533p821K1r07n091q356M860K019q35J0105M634o028q273J253O430R581
$$ 57533 49712 49733 48826 43735 35379 40239 42258 41423 51528 56162 50134 41861 43114 49544 59125
13053E9125N330l434m279J154J1439J7040L3521J5545M297m203r680q270j8237
$$ 59125 64455 61021 56742 57896 69335 86375 119896 135441 139738 135535 125855 117585 99348
13040I9348j6926j1819n790n558m861K876J2383q286q615j278J393R919m810q077
$$ 99348 82422 70603 64813 59255 54394 57270 69653 61367 52752 51474 52867 62786 57976 49899
13026D9899p157N223q47n927n158L047J0545p35j2329p312p031J6383R661o043
$$ 49899 42742 47965 47118 41191 36033 39080 49625 48890 36561 29249 22218 38601 48262 42219
13012D2219p248N742P122J109K623o054r807n140k678K528L369K239j02j950J854
$$ 42219 34971 40713 47835 48944 51567 45513 35706 30566 27888 30416 33785 36024 35922 33972 35826
12997C5826N237O186R67J0342N312N764O033n407M444j5576j5924p549j555J5656
$$ 35826 41063 47249 48216 58558 63870 69634 75667 70260 74704 59128 43204 35655 34100 49756
12983D9756J1332J517L676N353m541O26m637L924k227j817n599K103r98j124l283
$$ 49756 61088 62605 66281 71634 67093 67719 63082 67006 64779 62962 57363 59466 58468 57344 54061
12968E4061j2691k807O510R04l765Q413J0799J0311o67o316K90l640k086j044
$$ 54061 41370 38563 45073 45977 42212 50625 61424 71735 71068 64752 65042 61402 59316 58272
12954E8272L374N719K005P698l78Q218R401K55j2844j3564J804M339N76m166l412
$$ 58272 61646 67365 69370 77068 76690 84908 94309 94564 81720 68156 69960 74299 74875 70709 67297
12939F7297L898J1062J5910J0820P957J7582L0159J8352N339J6275r73j7177k2344
$$ 67297 71195 82257 98167 108987 116944 134526 164685 183037 188376 204651 203678 186501 164157
12926A64157l1321l0687k6405m343j0227k76N319K760K773j302l702Q482P604
$$ 164157 132836 102149 75744 71401 61174 60898 66217 68977 71750 70448 66746 75228 82832
12913H2832M501n256j0271N061R256J858M575o830Q56o733j2209J891K406R477
$$ 82832 87333 82077 71806 76867 86123 87981 92556 85726 86582 79849 67640 69531 71937 81414
12899H1414N963L449r032o146K300O676K068N626k436K639m847j2069l032O31
$$ 81414 87377 90826 81794 75648 77948 84624 86692 92318 89882 92521 87674 75605 72573 73204
12885G3204p435J346P159J6211J0902l042P499o952j4743j0873q084R74O145J0162
$$ 73204 65769 67115 74274 90485 101387 98345 105844 98892 84149 73276 65192 66166 72311 82473
12871H2473J1345J4043M0901L6507L1619J5069o177k0737k0845k5591k3449r641
$$ 82473 93818 107861 148762 185269 216888 231957 225780 205043 184198 158607 135158 125517
12859A25517o981m786k4P450M793O84o842p548j1052j1255p161k711R068J0790
$$ 125517 118536 113750 113726 121176 125969 126653 119811 112263 101211 89956 82795 80084 89152 99942
12845I9942R035K808L581J34P113J4524N693p62P492M928l856j0217r101q141
$$ 99942 108977 111785 115366 115500 122613 137137 142830 142068 149560 154488 150632 140415 131314 123173
12831A23173K565N786Q168K773Q503J15j2853O211J7704J3383O484J568M502j191
$$ 123173 125738 131524 139692 142465 150968 151083 138230 144441 162145 175528 182012 183580 188082 186891
12817A86891m412O916J0630J2132M979J1451k093P720R518j691j0250k0127n7856
$$ 186891 182479 189395 200025 212157 217136 228587 226494 234214 243732 242041 231791 211664 153808
12804A53808q8401o4915k8343K1169K6477L5574K2961m587J6062J4475J3019P677
$$ 153808 65407 492 -27851 -6682 19795 55369 78330 73743 89805 104280 117299 124976
12792A24976Q871M974n146k840J0655J6534J3177K297J7247K0122L210O845J2670
$$ 124976 133847 138821 133675 130835 141490 158024 171201 173498 190745 210867 214077 220922 233592
12779B33592R327M847J9967K8642J7871J6949K0405K1885K2614K7170L7896P4608
$$ 233592 242919 247766 267733 296375 314246 331195 351600 373485 396099 423269 461165 535773
12767E35773J33342K24971L90658N51341N32369K12729j96147m14356m39273l60338
$$ 535773 669115 894086 1284744 1836085 2368454 2581183 2385036 1970680 1531407 1171069
12757A171069k33935j40540r5714p1710m9532j4206j2728n745K823k599N08N208
$$ 1171069 937134 796594 700880 629170 579638 565432 552704 546959 549782 547183 547691 552899
12745E52899L932J3928K778r295K794J1465J0584k92j3920j2865o503j753K855
$$ 552899 556831 570759 573537 564242 567036 578501 589085 588793 574873 562008 555505 553752 556607
12732E56607J4349Q890J8509L7588N2238N1088L8411L4404L2440K1731J1202n80
$$ 556607 570956 579846 598355 635943 688181 739269 777680 812084 844524 866255 877457 876877
12720H76877J528L5381P2138R3876R6701P7111P1927R3217J55859K19822J59867
$$ 876877 878405 913786 985924 1079800 1176501 1253612 1325539 1418756 1574615 1794437 1954304
12709A954304K1254m8167q4595o1889J3005O8972J15302J48410J82745K13428
$$ 1954304 1975558 1927391 1842796 1780907 1793912 1862884 1978186 2126596 2309341 2522769
12699B522769K61850L11520L39519L79639M08459M55314N59291P27009R28676
$$ 2522769 2784619 3096139 3435658 3815297 4223756 4679070 5238361 5965370 6894046
12690F894046J131303J343012J582476J935524K568767L580787N046781O961483
$$ 6894046 8025349 9368361 10950837 12886361 15455128 19035915 24082696 31044179
12682C1044179R813258J5138710K5373670M4470914P2874655Q2970948L4349900
$$ 31044179 40857437 55996147 81369817 125840731 198715386 281686334 316036234
12675C16036234k7557952n7638852o3451894n1213341l3829837k1093746j3875792
$$ 316036234 288478282 230839430 167387536 116174195 82344358 61250612 47374820
12668D7374820r931646p443085n706975m355290l298103k507518j896822j475502
$$ 47374820 37443174 30000089 24293114 19937824 16639721 14132203 12235381 10759879
12660A0759879j216043j028817q95556p55886o13043m90431l94101l10630k68268
$$ 10759879 9543836 8515019 7619463 6863577 6250534 5760103 5366002 5055372 4787104
12651D787104k54809k62987k34708k20460k35354k49954k30548k08889j96357
$$ 4787104 4532295 4269308 4034600 3814140 3578786 3328832 3098284 2889395 2693038
12642B693038k07072k11118k04347j99748j99890j76867j37135r9348p4989p5874
$$ 2693038 2485966 2274848 2070501 1870753 1670863 1493996 1356861 1257513 1182524 1106650
12632A106650q6562r6668r5664r3916o5178m5787k5930j0323r247j4443n800j5833
$$ 1106650 1020088 923420 827756 733840 668662 622875 596945 586622 577375 562932 557132 541299
12620E41299j7375j1651j4495j6260k1616l2331l8921l4561j7758k0401l0307
$$ 541299 523924 512273 497778 481518 459902 427571 388650 354089 336331 315930 285623
12609B85623l1605k9336k0178k1543o297P327O356J768O683J6501k526j5288j0594
$$ 285623 254018 224682 204504 182961 176664 183991 190347 192115 198798 215299 212773 197485 186891
12596A86891K943N774P850L848J0527O141N996K370p258l676j0185j0356m978
$$ 186891 189834 195608 203458 207306 217833 223974 229970 232340 225082 221406 211221 200865 195887
12583A95887q997j9479k1647j4319j6902m213q03J1781L723m137L976K417p345
$$ 195887 186890 167411 145764 131445 114543 110330 109527 121308 125031 120894 124870 127287 119942
12570A19942J183N660J0456J1884k688k697m640R816k519k364m16j631J110O529
$$ 119942 121125 126785 137241 149125 146437 143740 139100 148916 146397 144033 143617 141986 143096 149625
12556A49625O289Q716j485M695L6501O3149O2699J4343o7300q8903o3217m8875
$$ 149625 155914 164630 163145 167840 204341 267490 330189 344532 277232 188329 125112 76237
12544G6237l2910j6085j5630k0947O115O575M747R471R224J494m362j5194j743
$$ 76237 43327 27242 11612 -9335 -3220 3355 8102 17573 26797 28291 23929 8735 6992
12531F992L253j0750N011J5000J6993J371k3987q27J1578M471Q812J320j1138
$$ 6992 10245 -505 4506 19506 36499 37870 13883 13056 24634 29105 37917 39237 28099
12518B8099j3968p930K644o732r751Q268J3193J7327J0890L934O924Q736L112
$$ 28099 14131 6201 8845 2113 -7638 630 13823 31150 42040 45974 52898 61634 64746
12505F4746r371Q45l74j2635k1700j3449m770j111N732l913L046k062p305o117
$$ 64746 55375 56220 55846 43211 21511 8062 3292 2181 7913 4000 7046 4984 -2321 -8438
12491h438p655l2844k3791j1402j9237j6053K925L2175L6779L7337L2592K3354
$$ -8438 -16093 -48937 -72728 -84130 -103367 -119420 -116495 -84320 -47541 -10204 22388 45742
12479D5742O960r727l998j0510p865l737K140l465j2225L938P326k02P993P10
$$ 45742 52702 42975 38977 28467 20602 16865 19005 15540 3315 7253 14579 14377 22370 23080
12465B3080P6j0774p329j3091q90O202N08N6Q400P219M810K120J47J643J776r579
$$ 23080 23156 12382 5053 -8038 -8928 -2726 -2218 -2162 6238 13457 18267 20387 20534 22177 23953 14374
12449A4374j5823j6590q969k145Q925Q968O639J169j1697q858M568r13J377J2508
$$ 14374 -1449 -18039 -27008 -29153 -20228 -11260 -4621 -3452 -15149 -24007 -19439 -20352 -18975 -6467
12435f467O134J2181K475M319J7320O291n637O915q041j3134l754N20m452P167
$$ -6467 -333 11848 14323 18642 35962 42253 36616 43531 35490 22356 18602 19122 14670 21837
12421B1837N471l217J405J3717q28l99M528j3287j1583r148p597l008k4l97M741
$$ 21837 27308 24091 25496 39213 38385 37986 42514 29227 17644 8496 899 -2109 -2133 -2530 2211
12406B211J331j2979q430N100P865O538m99o359p450j0405k359o29M045J0967
$$ 2211 3542 -9437 -17867 -12767 -4902 1636 1137 -5222 -12672 -23077 -25436 -26065 -22020 -11053
12392a1053N897K281P138n37j4450m958J012Q525N332k414q087K159J4151Q99
$$ -11053 -5156 -2875 4263 3726 -10724 -15682 -14670 -6145 -813 -3227 -11314 -9155 4996 5895
12378E895Q077p58n175K001j2546o636j260P061P679K623K125o31K851q109j3443
$$ 5895 13972 13214 8039 10040 -2506 -9142 -10402 -3341 4338 6961 9086 8455 11306 3197 -10246
12363a0246j875K74o36j638l11k838K014R52N977M122J047M862j2372n6J673O284
$$ -10246 -12121 -11847 -12483 -14121 -14432 -17270 -15256 -14304 -8327 -4205 -3158 1704 -10668 -10724 -9051 -2767
12347b767L796L4r999o118j217k103M069J2185M222k245o085o214Q103l886j0233
$$ -2767 1029 1063 -8936 -15054 -16271 -18374 -14305 -2120 2102 -143 -6228 -12442 -4339 -8225 -18458
12332a8458l966m213J257J3473J005n648j258K526J3299M165k86p912j2297J245
$$ -18458 -22424 -26637 -25380 -11907 -10902 -16550 -17808 -15282 -1983 2182 1896 -6016 -18313 -17068
12318a7068O222M529L683o94k881N735L167n384n535j752Q591l254P129J6097
$$ -17068 -10846 -6317 -2634 -3328 -6209 -474 2693 -2691 -8226 -9978 -1387 -4641 2488 18585
12304A8585m82r045J784l802o983p43j209l409j022p654o817L064l069J238J771
$$ 18585 18103 9058 10842 7040 57 -686 -1895 -5304 -6326 -13980 -20797 -17733 -20802 -19564 -17793
12289a7793Q163m196l539J30M10q780o795L093K644N681J0664j07N074N08k131
$$ -17793 -9630 -13826 -17365 -17235 -16825 -25605 -32400 -29307 -26663 -20982 -10318 -10425 -5351 -4843 -6974
12274f974l824j0021j77J1648J0438J783K905L491r31q461r637K157J585p00R67
$$ -6974 -10798 -20819 -20996 -9348 1090 2873 5778 9269 8338 -123 -9760 -7603 -6018 -6718 -5751
12259e751k35n058p402J347K254j322p42P526J0760J0814R030l012J909J1951
$$ -5751 -5986 -11044 -18446 -17099 -14845 -16167 -16909 -9383 1377 12191 21221 18209 20118 32069
12245C2069N09n514m852O876L790J3231K0977K4380K9557L1847N0968O5346J20809
$$ 32069 32578 27064 22212 29088 32878 46109 67086 91466 121023 152870 203838 269184 389993
12232C89993K28273L58243L96905J64779j30125k82787l07243k38402j68956j11662
$$ 389993 618266 976509 1373414 1538193 1408068 1125281 818038 579636 410680 299018
12222B99018p6362m5207l6690l2844k5417j4001j6218r944o705q293L846q544
$$ 299018 222656 177449 140759 107915 82498 68497 52279 42335 35630 27337 31183 22639
12210B2639p578m185m963j096M314K626q11m26J084l368j3652k3564j609R361
$$ 22639 15061 10876 5913 4817 9131 11757 10946 10520 11604 8236 -5416 -28980 -30589 -21228
12196b1228R380J091m15l070O82j0436l200j644j422J0095Q034k432O113M411
$$ -21228 -11848 -10757 -11172 -14242 -13560 -23996 -27196 -28840 -30262 -20167 -12133 -14565 -8452 -4041
12182d041K040L29k634j367K73m740M318M351j06l145j382N423l267j615j2m258
$$ -4041 -2001 -1672 -4306 -5673 -5400 -10140 -5822 -1471 -1577 -4722 -6104 -681 -3948 -5563 -5575 -9833
12166i833j3059l094N776J708J0311K168O896m203J181O025M101j202j510n717
$$ -9833 -22892 -25986 -20210 -18502 -8191 -6023 873 -3330 -2149 3876 7977 6775 5265 -452
12152d52J999l554n122J15J997R236O504j156q828n512j1707k865M136L052O333
$$ -452 1547 -2007 -7129 -7014 -5017 4219 10723 9567 739 -4773 -16480 -19345 -15209 -12157 -5824
12137e824o77j367k036q322M45J548L821m94P522n376j0190j605M307J0503l546
$$ -5824 -6501 -7868 -9904 -18226 -17781 -16233 -12412 -12906 -5384 -10760 -20950 -22555 -18248 -7745 -11291
12122a1291m280r97n761o872j0692j915J0512P267L204O839Q473j317P00P496
$$ -11291 -15571 -16568 -22329 -29201 -39893 -41808 -31296 -24029 -20825 -13986 -5513 -6830 -6130 1366
12108A366M245l815j5696o47J1633M03J765j1842m069J196l295K289l075m58M46
$$ 1366 5611 1796 -13900 -14547 -2914 -2511 -746 -12588 -16657 -15461 -18756 -16467 -19542 -20000 -19554
12093a9554L940J0030j0089K1p830J025K562q51K59l672M244Q015L238o220j1879
$$ -19554 -15614 -5584 -15673 -15652 -23482 -22457 -19895 -20746 -20487 -24159 -19915 -11900 -8662 -14882 -26761
12078b6761J0119K836n406o115j145J430m333J707M471J4739k947L642p679j619
$$ -26761 -16642 -13806 -19212 -25327 -26472 -25042 -29375 -27668 -23197 -8458 -11405 -7763 -15442 -17061
12064a7061P250K688J425N251K480k943R78m101k346k816K09O335K188q422l201
$$ -17061 -9811 -7123 -5698 -447 2033 -910 68 -4033 -6379 -9195 -8986 -2651 -463 -8885 -12086
12049a2086j962M179N941n34r7r690j0494k063K594J754M726P604J0528M106O725
$$ -12086 -14048 -9869 -3928 -4462 -4559 -14249 -24743 -26806 -24212 -22458 -17732 -10128 400 4506 11231
12034A1231N363l854j684j5549j899n286n554k622m388N423J2641Q58m296L41
$$ 11231 16594 12740 11056 -4493 -6392 -11678 -17232 -19854 -24242 -18819 -6178 -5320 -9616 -9275
12020i275J792q02r39L158J705N68J0199L946o995j0871j0248P131k522J1075
$$ -9275 -7483 -8285 -9224 -6066 -4361 -3793 6406 10352 3357 -7514 -17762 -10631 -13153 -2078
12006b078Q199O619o88n960m447K749M141J804o7N110J85M710n877l599o341n883
$$ -2078 6121 12740 12052 6092 1645 4394 8535 10339 10272 15382 15567 20277 14400 10801 4460 -1423
11990a423J718J326j1442q743O002J0890Q37j904o79q41K9L825J445m024J2959
$$ -1423 295 1621 -9821 -18564 -12562 -1672 -835 -2739 -3418 -4259 -4230 -405 1040 -2984 9975
11975I975K00r831M02J599j24P976m128J227m025j1271L035l679R74L044o631
$$ 9975 10175 344 746 2345 2221 10197 6069 7296 3271 -8000 -4965 -8644 -7670 -4626 -11257
11960a1257j7537r47J1441Q229K2860L214p777J552o374m582j500o946k820J921
$$ -11257 -28794 -29741 -18300 -10071 12789 16003 8226 9778 3404 -1178 -2678 -9624 -12444 -10523
11946a0523J0877j344M700M789m40K224o944q505Q21J823n674k212l366N189m518
$$ -10523 354 -990 3710 8499 8059 10283 3339 -5166 -4345 -2522 -8196 -10408 -13774 -8585 -13103
11931a3103j0105M779O264O214l834N101l416j520k084m235J1691O171o304l17
$$ -13103 -23208 -18429 -12165 -5951 -9785 -4684 -8100 -9620 -11704 -15939 -4248 1923 -4381 -4698
11917d698j444N429P76k441j119O375k301n249n532J1386L366j513r832L352P659
$$ -4698 -6142 -713 63 -2378 -3497 2878 577 -4672 -10204 1182 4548 3035 -6797 -3445 4214
11902D214j131J488J327n363O531k212j1941N090R883j0362l600p67K646m157
$$ 4214 3083 4571 5898 535 7066 4854 -7087 -1997 7886 -2476 -6076 -6843 -4197 -8354
11888h354k444j868K883K756k353J772o030j2754K261P191J706j069n281J1706
$$ -8354 -10798 -12666 -9783 -7027 -9380 -7608 -13638 -26392 -24131 -16940 -15234 -16303 -21584 -9878
11874i878R1j153p59o453K868N689L338N72P369l363j0331L053O208J500M638
$$ -9878 -9787 -10940 -11699 -18152 -15284 -9595 -6257 -5685 1684 -1679 -12010 -8957 -2749 -1249 3389
11859C389K283q911j115p498l014o657J975K689R071N077l11O866j4418j3496
$$ 3389 5672 -3239 -4354 -11852 -14866 -21523 -19548 -16859 -7788 -2711 -3022 3844 -10574 -24070
11845b4070k918O186J4987j594l566k138J54q338j534N624K174Q510J286m106
$$ -24070 -26988 -20802 -5815 -7409 -10975 -13113 -12959 -21297 -22831 -17207 -15033 -6523 -5237 -9343
11831i343p159o885l087l676P807R868J6338l059p570R02j2120J146R899j893
$$ -9343 -16502 -23387 -26474 -30150 -22343 -12475 3863 804 -6766 -5864 -17984 -16838 -6939 -8832
11817h832m34L46o114k862l511Q377l677L845Q199J743M07j154M443j311j796
$$ -8832 -9266 -8920 -15034 -17896 -21407 -13030 -16707 -12862 -4663 -2920 -2513 -3667 776 -535 -2331
11802b331o672j0824m341L418R678l57M782J7223j472r835m52p184p378N882j967
$$ -2331 -9003 -19827 -24168 -20750 -11072 -11429 -6647 10576 9104 -731 -1183 -8367 -15745 -9863 -11830
11787a1830J894n386L450r235l565O665N132q38M549K830n571J047K270J002j3441
$$ -11830 -9936 -15322 -11872 -21107 -24672 -18007 -12875 -13713 -9164 -6334 -11905 -10858 -8588 -7586 -21027
11772b1027l277P292l85J411O39J134j232j253J465P177J0474j781j0975n37j056
$$ -21027 -24304 -17012 -17397 -15986 -15347 -14213 -15445 -16698 -15233 -8056 2418 637 -10338 -10875 -11931
11757a1931j934r039l279O057J1773L725j1788K821j320J742L090k627M823j309
$$ -11931 -13865 -22904 -26183 -20126 -8353 -4628 -16416 -13595 -14915 -13173 -10083 -12710 -7887 -9196
11743i196K582J0963K469j794j1506j3001R073O29r62Q32k434l234j348k011J3050
$$ -9196 -6614 4349 6818 5024 -6482 -19483 -10410 -9781 -10743 -9911 -12345 -15579 -16927 -18938 -5888
11728e888K495O09J517O712K130j1433j2299m13R642k162j388J0068K500r649
$$ -5888 -3393 -2784 -1267 5445 7575 -3858 -16157 -16570 -6928 -9090 -10478 -410 2090 -7559
11714g559l681j658k14rm01J0624O078k081o615M254Q989J1228j2345j5388m91
$$ -7559 -11240 -12898 -13112 -13121 -13522 -2898 3180 1099 -5516 -1262 7727 18955 6610 -8778 -9269
11699i269R571o945n887J4464l928k549M066j46K823J1167j1520j2503j949j058
$$ -9269 302 -6643 -12530 1934 -1994 -4543 -477 -623 2200 13367 1847 -10656 -12605 -13663
11685a3663j2876L996J3159K694O108M456o796j0481j015R127J1208L025L3j376
$$ -13663 -26539 -22543 -9384 -6690 -582 3874 -2922 -13403 -14418 -5291 5917 8942 8975 7599
11671G599r553j2428l303K454J445P200P924J5772P745l671O018n023k090j2017
$$ 7599 -1954 -14382 -17685 -15231 -13786 -6586 1338 17110 24855 21184 27202 22179 20089 8072
11657H072j534O514j73j2669l097K915k315l305k345p245k922L806K918n296j740
$$ 8072 6538 13052 12879 210 -2887 28 -2287 -5592 -7937 -15182 -18104 -14298 -11380 -16676 -18416
11642a8416k249l25J030J490J1580o345l517O518R13J3940R775J1325j2002j677
$$ -18416 -20665 -20990 -19960 -18470 -6890 -13235 -16752 -10234 -9321 4619 14394 25719 13717 12040
11628A2040J23j590r469l34N186l543L822m843j900K220J186L505p003q205N711
$$ 12040 12163 10573 1104 770 5956 2413 6235 1392 -508 1712 2898 6403 -600 -8805 -3094
11613c094k247r81Q805M672j397l241j1389m928Q030P874k559K864j239q574J4136
$$ -3094 -5341 -6322 2483 7155 5758 2517 -8872 -13800 -5770 2104 -455 2409 1170 -7404 6732
11598F732O565n279L942Q784p439j0464M665J67m657j1484n260N554J570M623
$$ 6732 13297 8018 11960 20744 13305 2841 7506 7673 3016 -8468 -13728 -8174 -6604 -1981
11584a981j372q103J576k008j894J3558K664L628l691j2859m573M591n86j197
$$ -1981 -3353 -11456 -9880 -11888 -13782 -224 2440 6068 2377 -10482 -15055 -10464 -11050 -12247
11570a2247k429l78Q959R485o51M808O700o71r807p264L734R486J370N527o879
$$ -12247 -14676 -15054 -6095 3390 2739 7547 14247 13576 3769 -3495 239 9725 11095 16622 9743
11555I743j0572m789j1360m870J0228J897m029L73m564J902L333m263O31P9J838
$$ 9743 -829 -5618 -16978 -21848 -11620 -9723 -13752 -13379 -17943 -16041 -12708 -16971 -16340 -16261 -14423
11540a4423j110N172J364m993j809O130k761o496p511p96O476J0290R988O973
$$ -14423 -15533 -10361 -8997 -13990 -15799 -9669 -12430 -18926 -26437 -27233 -20757 -10467 -479 6494
11526F494J590K625q466o946O66n724j2529R950L542k83k241L535n090N620L104
$$ 6494 8084 10709 2243 -4703 -4037 -9761 -22290 -12340 -8798 -9081 -11322 -7787 -12877 -7257 -4153
11511d153j494p906o788J829K55J3276M453j515o223n877j05k611k288J266n139
$$ -4153 -5647 -13553 -20341 -18512 -18257 -4981 -528 -2043 -8266 -14143 -14248 -16859 -19147 -17881 -23020
11496b3020Q73P339R480R887K064q178k053K231R201K208m509k959r328L759R204
$$ -23020 -22147 -14808 -5328 4559 6623 -1555 -3608 -1377 7824 10032 5523 2564 -6764 -3005 6199
11481F199K566o848k834m159r347o789Q076O570j0806l911K094L472P939m5O616
$$ 6199 8765 1917 -917 -5076 -14423 -21212 -13136 -6566 -17372 -21283 -19189 -15717 -7778 -7823 -1207
11466a207J2731P518J60p247p947L02k73J2127J1797k706j9150j2145N590O92
$$ -1207 11524 19042 19202 11955 4008 4310 4037 16164 27961 25255 6105 -6040 -450 242
11452B42j474M838n92K55L70j2886M671J9662N894m805r721j915m503n407n366
$$ 242 -1232 3606 3014 3269 3639 -9247 -4576 15086 20980 16175 6454 4539 36 -5371 -10737
11437a0737l562K342R904N311n083p64Q092J1959m629J329P835n35m641o371l482
$$ -10737 -14299 -11957 -2053 3258 -1825 -2589 5503 17462 12833 14162 21997 21462 16821 10450 6968
11422F968n661O18L753M518m495j0134j3776q409J1710J2236j393k386o775j91
$$ 6968 1307 1925 5678 10196 5701 -4433 -18209 -26618 -14908 -2672 -4065 -6451 -13226 -13417
11408a3417Q582M989M400k294n69K623q67j1384K731O230M441l480p677o616K620
$$ -13417 -4835 154 4554 2260 1691 4314 3447 -7937 -5206 1024 5465 1985 -5692 -12308 -9688
11393i688j291N8M811O860J2746P08m233j914j590p401n098p949J959k861j834
$$ -9688 -10979 -10921 -6110 750 13496 14204 9971 8057 6467 -934 -6032 -13981 -12022 -14883 -16717
11378a6717M069J252Q174N730O173L317m93n861j8000L750q67K160R52M534o963
$$ -16717 -12648 -11396 -3222 2508 8681 11998 11505 5644 -12356 -8606 -9473 -7313 -6361 -1827 -8790
11363h790q213J3264l746K14q9q40K08N514k420j837J3726N371L237n05n514j928
$$ -8790 -17003 -3739 -7485 -7271 -7360 -8200 -7992 -2478 -4898 -6735 6991 12362 15599 15094 9580 7652
11347G652j0641j4630N14P300O923R90L98n458l32J0019j963j978R73M363l304
$$ 7652 -2989 -17619 -17105 -9805 -2882 -1892 -1494 -6952 -7284 2735 772 -1206 -233 4130 826
11332H26p543Pl919J1584M163J74o062J153J1801L599j713j0413r088p880J0631
$$ 826 -6717 -6710 -10629 955 5118 5292 -770 383 12184 15783 14070 3657 -5431 -13311 -2680
11317b680L757L744O864N520m058K753p661N766j836N123N647p619n532K101K582
$$ -2680 1077 4821 11685 17205 13147 15900 8239 14005 12169 17292 22939 15320 9788 11889 14471
11302A4471n278o192j345p59N612N422J256j008k34j860o116k564L774L815q406
$$ 14471 9193 3001 1656 897 6509 11931 13187 12179 11945 10085 3969 1405 5179 8994 588
11287E88l313L514J4887l402k966n389n782L710J6085j31j1751k686L327l294
$$ 588 -2725 789 15676 12274 9308 3919 -1863 1847 17932 17801 6050 3364 6691 3397
11273C397l283J271J687k267o894j0185K175Q491K335j425O962J5521M004j8116
$$ 3397 114 1385 3072 805 -6089 -16274 -14099 -5608 -3273 -4698 2264 17785 21789 3673
11259C673r468P779L883p804j0036M805J782m271m03j486L925j351o312J1377
$$ 3673 -5795 1984 5867 -1937 -11973 -7168 -5386 -9657 -10060 -11546 -7621 -8972 -15284 -3907
11245c907N187k650N820K868m542k103P644R246K549O79R57o351K205N735j990
$$ -3907 1280 -1370 4450 7318 2776 673 8317 17563 20112 20791 21748 15397 17602 23337 21347
11230B1347J847o861m20K096J96j0498l483P121O989N69j1452O60M279N870k607
$$ 21347 23194 16333 15913 18009 18205 7707 4224 11345 18334 18903 7451 8111 12390 18260 15653
11215A5653j6816l113L944K267O961K845l54j942k349O072O563J916M609L860
$$ 15653 -1163 -4276 -332 1935 8896 11741 11387 9445 7096 13168 19731 21647 26256 30116
11201C0116J483j9718j3826k343N299J1375m024K970R102L826p795j586R17R919
$$ 30116 31599 11881 -1945 -4288 1011 12386 8362 11332 20434 24260 16465 14879 15796 25715
11187B5715N103o789L108P977M690m868r567N076j103j779l247o878J816K469
$$ 25715 30818 24029 27137 35114 39804 34936 25369 30445 29342 27563 24316 17438 19254 21723
11173B1723k783P436l399k272q562o067O50Q470N251P108j1152q071N641j159
$$ 21723 18940 26376 22977 20705 12143 6076 6726 15196 20447 27555 16403 8332 13973 12814
11159A2814j0190k054l385J0774Q493K63p981M136M981j977j522m828n274K706
$$ 12814 2624 570 -2815 7959 16452 16715 8734 12870 17851 15874 14352 9524 4250 6956
11145F956J5261Q782M854R896r065o349l593j0061j2221L289Q376N865J485j0485
$$ 6956 22217 30999 35853 45749 36684 30335 26742 16681 4460 7749 16125 21990 23475 12990
11131A2990m948J765P183M196M064J0432L218n818q615q405o733J09N810o862
$$ 12990 8042 9807 16990 21186 25250 35682 38900 33082 24467 16062 9329 9438 15248 8386
11117H386K966J1609M127N462r80k163m440K67m674o347J1150R237N5n143n322
$$ 8386 11352 22961 27088 32550 31570 29407 24967 25234 20560 14213 25363 34600 34655 29512 24190
11102B4190l260m984k524O736m83R835l196q318l886l34Q47m29K880l634q520
$$ 24190 20930 15946 13422 20158 19675 29510 26314 17996 14110 13776 14623 14194 17074 13440 4920
11087D920n097P053J2520J3524L313j0348m416P892L751l201q06L03J846P389
$$ 4920 -177 6876 19396 32920 36233 25885 21469 29361 33112 29911 29105 29408 31254 38643
11073C8643J1329L958O810k851j3209o995J257J97j860j061N905n237p213p94
$$ 38643 49972 53930 60740 57889 44680 37685 38942 39139 37279 36218 42123 36886 29673 28879
11059B8879P553J291q706j0555r354P063N597Q027l951J485L302K198K988K288
$$ 28879 36432 37723 29017 18462 9108 16171 21768 29795 25844 27329 30631 32829 35817 38105
11045C8105m18j940L573J931M002O837O978P885q398J290j045q789o811l849J336
$$ 38105 37687 35747 39320 41251 45253 52090 59068 66953 58555 59845 58800 50011 43200 39351 40687
11030D0687j583K586J6057K615j0580p033N085Q215J130k075Q440o91m102p689
$$ 40687 39104 41690 57747 60362 49782 42749 47834 56049 57179 55104 63544 62853 58751 51062
11016E1062L399M622k364k521m443k42L348Q853m19j319j217K761M502p98O086
$$ 51062 54461 59083 56719 54198 49755 49513 52861 61714 61295 59976 58759 61520 66022 65224 71310
11001G1310m999q319O728o172j699O311J0065L138O434j623l87O348J1681L337
$$ 71310 66311 57992 64720 58548 56849 63160 73225 76363 82797 81174 80787 87135 98816 102153
10987A02153M098K05N671M775p926r32N438N354l257j730N25P589k917R586M926
$$ 102153 106251 106456 112127 116902 108976 108044 113482 118836 115579 113849 114374 121963 119046 128632 133558
10972A33558J5049J6084P269l578M378J2392M523M713Q443N188J4943J3097M682
$$ 133558 148607 164691 171960 168382 172760 185152 189675 194388 202831 208019 222962 236059 240741
10959B40741J1351J8010J0668J2095J1730K0254K7605K4698K3985K9908M6438
$$ 240741 252092 270102 280770 292865 304595 324849 352454 377152 401137 431045 477483
10948D77483L9836K9290M1025N9673O9549P5845R1188J14606J32067J58060J84425
$$ 477483 517319 546609 587634 647307 716856 792701 883889 998495 1130562 1288622 1473047
10937A473047K11961K64834L27782M15908N02706O25503Q03558J006090J211550
$$ 1473047 1685008 1949842 2277624 2693532 3196238 3821741 4625299 5631389 6842939
10928F842939J399107J505733J414201J054052M81137j44249o79171r91062j116615
$$ 6842939 8242046 9747779 11161980 12216032 12697169 12552920 11873749 10882687 9766072
10919I766072j114476j006279q56179p18712n95100m71879l98491l16672k51151
$$ 9766072 8651596 7645317 6789138 6070426 5475326 5003447 4604956 4288284 4037133
10910D037133j99832j35106r0608m8804j2592J7531O5786J15081J86799K41044
$$ 4037133 3837301 3702195 3611587 3562783 3550191 3567722 3633508 3748589 3935388 4176432
10900D176432L04465M01217N11994O34485Q18225J072650J417495J872415K461469
$$ 4176432 4480897 4882114 5394108 6028593 6846818 7919468 9336963 11209378 13670847
10891A3670847L198479L924810M281073L761012K119639j65319k216764l480265
$$ 13670847 16869326 20794136 25075209 28836221 30955860 30790541 28573777 25093512
10883B5093512l875711l607280l037030k418394j894169j483498j154150r10536
$$ 25093512 21217801 17610521 14573491 12155097 10260928 8777430 7623280 6712744
10875F712744p35537n91457m68088l60329k89070k16628j82434j25552p8463l0515
$$ 6712744 5977207 5385750 4917662 4557333 4268263 4051635 3869201 3743649 3665186 3634671
10865C634671J7024O0874R3620J35719J94264K61881L39495M30576N32479O67162
$$ 3634671 3651695 3712569 3806189 3941908 4136172 4398053 4737548 5168124 5700603 6367765
10855F367765Q21344R84842J122260J169539J034403O84945J45291m62885r54833
$$ 6367765 7189109 8173951 9296211 10465750 11500153 12185098 12330389 11867504 10912671
10846A0912671j260805j370349j298315j139326r54414p82285o23524n09029m19004
$$ 10912671 9651866 8281517 6983202 5843876 4889462 4107177 3483653 2974624 2555620
10837B555620l56877k87350k30878j88036j62399j46623j05919j11946j09946
$$ 2555620 2198743 1911393 1680515 1492479 1330080 1183457 1077538 965592 855646
10828H55646q0212o3580n6814n1412m3652l1666l1302k5008k9037k2672k1994
$$ 855646 775434 711854 655040 603628 559976 528310 497008 472000 442963 420291 398297
10817C98297l2432j6677j3914j5967j6315j1466k0086j6375j292j704j7447j4493
$$ 398297 365865 349188 335274 319307 302992 291526 271440 255065 253773 252069 234622 220129
10805B20129k6500k3217j0103p153q834r887j5687r33k431k231J68r621R5Q181
$$ 220129 193629 170412 160309 153156 144322 134435 118748 117815 115384 113153 113321 103700 103795 111976
10791A11976o33o597j4300j5227j3448j420N602j407p667M755J0399J1332J3769
$$ 111976 111343 104746 90446 75219 61771 60351 65953 64546 56879 61634 72033 83365 97134
10778I7134q822r515J53K846K414K337k146o013p756j2246m507R497Q780j3556
$$ 97134 88312 78797 78950 81796 84210 86547 84401 78388 70632 58386 53879 63376 72156 58600
10764E8600j3449K938P609J0324o659j1879r789j3160j889J987P080r708k157
$$ 58600 45151 48089 55698 66022 59363 47484 37695 24535 22646 24633 31713 22005 19848
10751A9848P782P700j215j1382r380K791o813m58p459r553J0188K533L434N986
$$ 19848 27630 35330 34115 22733 13353 16144 9331 8873 1414 -8139 2049 4582 8016 14002
10737A4002K155N15j2077j4327k342L877J4115J5111q29q612r404k662l010l095
$$ 14002 16157 16672 4595 -9732 -12074 -8197 5918 21029 20200 11588 2184 -478 -3488 -6583
10723f583P501J0465k917J93r921k589N851K99l803m788Q032m916k702K926r60
$$ -6583 918 11383 8466 8659 -1262 -3851 2000 2299 -1504 -6292 1740 -3176 -5878 -2952 -3912
10708c912N742Q840R793j0735j4646K688L5o628n337m240L681l409p738J5853
$$ -3912 1830 10670 20463 9728 -4918 -2230 -2195 -8823 -14160 -18400 -14719 -18128 -25866 -10013
10694a0013J34M144L900M716J235o78l250r087O678Q194N610j893q343j1033r32
$$ -10013 -9879 -5735 -1835 2881 4116 3438 188 -8899 -2221 5973 11583 9690 1347 -9686 -10618
10679a0618O209k127J938Q310N845P63p565p95l025N966J0739j1625r964m192
$$ -10618 -4409 -6536 -4598 3712 9557 10320 2755 1960 -1065 4901 15640 4015 -5949 -10141
10665a0141j99K217j28L420p429o010j236j315P038J196M006j19l602N930K15
$$ -10141 -10340 -8123 -8251 -4831 -12260 -18270 -19506 -20821 -13783 -12587 -8581 -8700 -12302 -6372 -6157
10650f157l599p901m621L296n50Q371J0812N68l305n093Q438J2756o122j947K434
$$ -6157 -9756 -17657 -22278 -18982 -19532 -11161 -349 219 -3086 -8179 259 13015 6893 4946 7380
10635G380r85r54m440j877O043L512k256J585K698P53k059j0048n070L736J854
$$ 7380 6395 5441 1001 -876 5167 8679 6423 8008 10706 11459 9400 -648 -5718 -1982 -128
10620a28o460K273P287n41n069J0290L08j0209L570j2921n314L21R701J263l280
$$ -128 -6588 -4315 2972 2431 -2638 7652 7960 -2249 1321 -11600 -16914 -16593 -6892 -5629 -8909
10605h909j607Q71l445N507L872K966K024P817P054L348k381K951l377m129j0928
$$ -8909 -10516 -9645 -13090 -7583 -3711 -745 1279 9096 16150 19498 17117 20068 16691 12562 1634
10590A634j8553M030r97L465J549o487l6L600k00l354J112K822O453M662O252
$$ 1634 -16919 -12889 -13886 -10421 -8872 -15359 -15395 -11795 -11995 -15349 -14237 -11415 -4962 -300 5952
10575E952o440k737P013o27q701j481N9J4949p65p288r352m718R515N956N569
$$ 5952 -488 -3225 3788 3161 -5540 -7021 -6962 7987 7222 -66 -9418 -14136 -4621 1335 6904
10560F904n48j2695n416J99J7434O947r436M251O032J1444j1444j5402j270P542
$$ 6904 6356 -6339 -11755 -11556 5878 12825 3389 7640 13672 25116 13672 -1730 -3000 4542
10546D542K455N472k452q043o57J0654o577j0432R06O462M362k931j08L954J514
$$ 4542 6997 12469 10017 1974 1317 11971 5394 -5038 -4132 2330 6692 3761 3653 7607 9121
10531I121j1425n577k019J1086Q156N346n119j0088l064n051L723J84p013j943
$$ 9121 -2304 -7881 -9900 1186 9342 14688 9569 -519 -3583 -8634 -4911 -4727 -11740 -13683
10517a3683J2071K876l84j0484j582K290j0295O455J6799P659o956j3655P144
$$ -13683 -1612 1264 880 -9604 -11186 -8896 -19191 -12736 4063 11722 4766 -8889 -1745
10504a745j881J005N713M587k791k374q407m077n678J425Q900M204p386j994N614
$$ -1745 -3626 -2621 3092 7679 4888 2514 -5893 -9970 -15648 -14223 -5323 -1119 -8505 -10499 -4885
10489d885n286m702K63P519N954M218j260q346m425M688J020r471L263N769L050
$$ -4885 -10171 -14873 -14610 -7091 -1137 3081 1821 -6525 -10950 -6262 -5242 -14713 -11450 -5681 -2631
10474b631K389n044K709O666j1787K67o627j0092m45J3420L923J1283n25k957
$$ -2631 -242 -5286 -2577 4089 -7698 -7431 -14058 -24150 -24595 -11175 -7252 4031 3506 549
10460E49l375J0657l27j1545r78l083J0645O425J200L570N104o889j073m028K894
$$ 549 -2826 7831 7504 -4041 -5019 -8102 2543 8968 10168 13738 18842 11953 10880 6852 9746
10445I746k558j5267O67Q870M625k618p182l70P130L665j296L7q017l911o96j689
$$ 9746 7188 -8079 -7412 1458 6083 3465 -3717 -4087 3043 6708 5412 5449 -2568 -6479 -7175 -8864
10429h864p679K331J185j42J331N102M482J365p147q401k096Q845m94m990m449
$$ -8864 -16543 -14212 -13027 -13169 -11838 -6736 -2254 -889 -8036 -16437 -18533 -9688 -10182 -15172 -19621
10414a9621K689J953r039k135N663L140J0210J1029O762J301o440j0482p128R92
$$ -19621 -16932 -14979 -24018 -26153 -20490 -17350 -7140 3889 10651 11952 5512 -4970 -12098 -11106
10400a1106R126P910k886O687M108j3133p599Q689L757M94P404M009J565l393
$$ -11106 -1980 5930 3044 9731 13839 706 -6893 1796 5553 6047 13451 17460 19025 15632
10386A5632j1317r718k879p44J242N114K887m85k900l926m805k07J305N41N722
$$ 15632 4315 -5403 -8282 -9026 -7784 -2670 217 -268 -3168 -7094 -11899 -12106 -10801 -10260 -4538
10371d538K873N243M388m60k841Q505J61n259j828J4R507n532j427Q174L462J3068
$$ -4538 -1665 3578 7966 7506 4665 13170 13331 8072 6244 6258 15765 10233 8806 16980 20442 33510
10355C3510o205J09l789M013L543J5764K0349O307O693P198R864o66k669n429
$$ 33510 27305 27414 23625 27638 31181 46945 67294 73601 80294 87492 97356 96690 94021 88592
10341H8592q201j9318j1897k575j5952r942k796K755j800N605N802M04j2980q456
$$ 88592 80391 61073 49176 46601 30649 20707 17911 20666 18866 24471 30273 30677 17697 9241
10327I241j312r392O74P330J802k558K578J1392L695j708M268P648J6910J3511
$$ 9241 7929 -1463 -789 6541 8343 5785 8363 19755 23450 21742 26010 33658 50568 64079
10313F4079O226J8765L1910L1426L0822J5106O623k890p955j3324l3989k5115
$$ 64079 70305 89070 120980 152406 183228 198334 204957 202067 194112 180788 146799 121684
10301A21684j4929j6170j9640j2504m372j1201m431K358q79j2179j0140j363j582
$$ 121684 106755 90585 70945 58441 54069 42868 38437 40795 39916 27737 17597 16234 14652
10288A4652o033j053N438O485m374n765J1227L493k152q373L067J6423L739m690
$$ 14652 8619 7566 13004 19489 15115 9350 20577 24070 21918 13545 16612 33035 36774 32084
10274C2084J4748J0476J4366K2320J0682P14j4533k2016n407m445j4987j973M133
$$ 32084 46832 57308 71674 93994 104676 105390 90857 68841 63434 58989 44002 42029 46162
10261D6162o233j5653j5286m465P844O43m441J123L728Q29m596k519K692P714
$$ 46162 39929 24276 8990 4525 12369 13012 8571 9694 13422 14251 9655 7136 9828 17542
10247A7542J349p084j4462q55M414o185Q984R262k612m900O6m2j220N609M88L998
$$ 17542 18891 11807 -2655 -3510 904 -5281 3703 12965 10353 5453 5519 5477 4257 9866 10354 14352
10231A4352r064p556p124m790L098o911M872J1189N119m026l574R296j617j1960
$$ 14352 5288 -2268 -9392 -14182 -11084 -17995 -13123 -1934 3185 -841 -4415 4881 3264 -8696
10217h696r437L712Q796J17L065m195K879n705k237N165M03P875N928N511l818
$$ -8696 -18133 -14421 -5625 -5508 -2443 -6638 -3759 -9464 -11701 -6536 -6133 1742 7670 13181 9363
10202I363r735j803o327j636Q654N174o331n573K446r156k257Q496P059l835j584
$$ 9363 -372 -2175 -8502 -10138 -1484 3690 -2641 -8214 -5768 -14924 -17181 -8685 -1626 -5461 -7045
10187g045m457n370p314K805R537P677O204j786J774l441j46L187r441P35J397
$$ -7045 -11502 -16872 -24186 -21381 -11844 -4167 2037 251 2025 -1416 -1562 1625 -7816 -7081 -5684
10172e684m21p27M13J1243Q715l319m300l491R04k24m771P006Q406k84l490L912
$$ -5684 -6105 -6832 -6419 4824 13539 10220 5920 2429 3333 3109 -1662 5344 13750 13466 9976 13888
10156A3888j525j421L940j0037k425n698j378R67J1606L577j2188j0138K003J0765
$$ 13888 12363 10942 14882 4845 2420 -3278 -4656 -3689 7917 11494 -694 -10832 -8829 1936
10142A936J974j5289P283J0915R78p873p085l993o142k436Q212K606O560N049
$$ 1936 3910 -11379 -4096 6819 7797 -76 -7161 -11154 -17296 -19732 -11520 -8914 -2354 2695
10128B695K39r258q59L101n08j1751k240J1483J1575L075l332j360o435R58J888
$$ 2695 2934 -6324 -7183 -4082 -4590 -16341 -18581 -7098 4477 7552 4220 2860 -3575 -2617 -729
10113g29l240J494p080q500q709K278Q117p72K843J49K372j158J020P695K28J575
$$ -729 -3969 -2475 -9555 -18055 -26764 -24486 -16369 -17141 -14298 -14149 -11777 -12935 -11915 -4220 -3992 -2417
10097b417k680m814n118P760K706M390P67p300N416J289n77K364o859l772P38
$$ -2417 -5097 -9911 -15029 -7269 -4563 -173 594 -6706 -1290 -1 -578 1786 -5073 -8845 -8107
10082h107p344m315N22J2685K790q50K121R798k592k893K595L868o260p444j628
$$ -8107 -15451 -19766 -19244 -6559 -3769 -4619 -2498 7300 4708 1815 4410 8278 2018 -5426 -7054
10067g054J3506J0463n054k1j419l814j129m522m606P311L810Q188p79j3656j620
$$ -7054 6452 16915 11861 11840 10421 6607 5478 956 -3650 3661 7471 15659 14880 1224 -396
10052c96Q73J3923L644K063J582O586N571j0837q633J3472N843j19r432j182N639
$$ -396 477 14400 18044 20107 21689 28275 33846 23009 14376 27848 33691 33572 24140 22958 28597
10037B8597O631M963N099k228J2439K6515M6346M9093P3501J24372K39124M93635
$$ 28597 35228 40191 45290 43062 55501 82016 128362 177455 250956 375328 614452 1108087
10025A108087P16013K67218k83695m48883m50667l20511j90933j12429p7256m3327
$$ 1108087 1824100 2091318 1807623 1358740 908073 587562 396629 284200 206944 163617
10015A63617l8350k6263k2239q748m180j698p435r965J254P915M84o102j4059
$$ 163617 125267 99004 76765 68017 63837 62139 54704 44739 45993 53908 54392 48290 34231
10002C4231j6855r342L827O640M385n874r393l837r574k369Q766q35O915P882
$$ 34231 17376 8034 11861 18501 22886 17012 7619 3782 -5792 -8161 605 -230 6685 14567
9988A4567N015k848r38M97R52q208j1116n298P00N218M562l887N926j253j028
$$ 14567 19582 16734 15796 16293 17245 9037 -2079 -7377 -6677 -1459 3103 -784 5142 3889 2861
9973B861l080J189j394j1732r217k890J1728J0439j11J76J624n938p28N681K314
$$ 2861 -219 970 -424 -12156 -21373 -24263 -12535 -2096 -2207 -2031 -407 -6345 -7073 -1392 922
9958I22J2354l06q649r6O71p008m135j699n97M973J0787P892j240n985n358N60
$$ 922 13276 12970 4321 4225 4896 -2112 -6247 -7946 -8543 -3570 7217 15109 13869 7884 2526 3086
9942C086p40L564j232J459m624j849L575L360N910P113L728N815L679K071M717
$$ 3086 2346 5910 4678 6137 1513 -336 3239 6599 12509 19622 23350 29165 32844 34915 39632
9927C9632j517K356O115P594J6084K1191M5840O1132J00229J72122J66095M2202
$$ 39632 38115 40471 46586 54180 70264 91455 137295 198427 298656 470778 636873 679075
9915F79075q1561j35698j46066j08696o7883l0660j7383l1254j7047p144l297
$$ 679075 597514 461816 315750 207054 139171 108511 91128 59874 42827 35683 32386
9904C2386N62l242r483q192n362J424m272J933O329O433P908L843K683j1403j96
$$ 32386 32948 29706 20223 12031 6669 8093 3821 5754 12083 18516 26424 30267 32950 21547 21351
9889B1351n092l962j846n249q58j1202M217J3613J050k048n957r535m480P176
$$ 21351 16259 12297 10451 5202 4344 -6858 -2641 10972 12022 9974 4017 -5518 -9998 -2822
9875b822p963J865J5811J0460o841J565J3727n999L510k326m823j1278J056O91
$$ -2822 -10785 -8920 6891 17351 10510 12075 25802 19803 23313 20987 16164 4886 5942 6633
9861F633m6p569K603m146j28M330O732P169l120m908K229J0787R185O563n930
$$ 6633 6587 -982 1621 -2525 -2653 1677 8409 15578 12458 7550 9779 20566 29751 36314 30384
9846C0384m209J0254J4287M09L363K275J554J4367K4846M0813N5305J03967K13569
$$ 30384 26175 36429 50716 51125 54488 56763 58317 72684 97530 138343 193648 297615 511184
9833E11184L14543L36843J77323q3997k61155k86700k33166j54291r8602o1027
$$ 511184 825727 1162570 1339893 1255896 994741 708041 474875 320584 221982 160955
9823A60955m1710k1850j4271r258l329j4523j5155j0719Q5l477L885K817o052
$$ 160955 119245 97395 83124 73866 70537 56014 40859 30140 30225 26748 30633 33450 27398
9810B7398n870R15k622n115j733O731K123L244J718k481j3031n756K014j805M144
$$ 27398 21528 22443 19821 14706 12973 19704 21827 25071 26789 24308 11277 5521 7535 5730 9874
9795I874r70j893N301l105j673l84n493q366q985k16M691L902m72J111o62l50
$$ 9874 8904 7011 12312 9207 7534 7150 1657 -6709 -15694 -15910 -11219 -7317 -7789 -6678 -7340 -7690
9779g690L599N92l12P266K070k044l481J645J0241k571j2514o26k972R15K307
$$ -7690 -4091 -3499 -3811 3455 5525 3481 0 1645 11886 9315 -3199 -3825 -6797 -5882 -3575
9764c575N052k437l253J3698j2981l068P073k237M120J088J0848j053o791k059
$$ -3575 1477 -960 -4213 9485 -3496 -6564 509 -1728 2392 3480 14328 13275 6484 4425
9750D425n067J321O144L995O008L015j0512l584j535N981k745n751J160M479j0483
$$ 4425 -642 679 6823 10818 16826 19841 9329 5745 4210 10191 7446 1695 2855 7334 -3149
9735c149k154K461p327l522k39J0085J0749K02O235L286j982P988j026K368K187
$$ -3149 -5303 -2842 -10169 -13691 -13930 -3845 6904 7106 13341 16627 14645 22633 21607 23975 26162
9720B6162m888m845j2950o353j815M638M650k49j1765k410k900Q214M976O007
$$ 26162 21274 16429 3479 -2874 -4689 -51 4599 4350 -7415 -9825 -12725 -4511 465 6472
9706F472O539N838n472o736r206J626L612l402k339K678P719Q294n444L935m211
$$ 6472 13011 18849 13377 6641 -2565 -939 2673 -729 -3068 -390 7329 15623 10179 14114 9903
9691I903j0836m673P35M278m27k634Q969J5482L393p772J061m168k121R55J569
$$ 9903 -933 -5606 -4871 -593 -1020 -3654 5315 20797 24190 16418 17479 13311 11190 12145 13714
9676A3714n029L592J054M256L562j5752p33R709q645J356P893j920k546L036p558
$$ 13714 8685 12277 13331 17587 21149 5397 4664 14373 5728 7084 14977 13057 10511 13547 5989
9661E989q882m8L943j629l719M980P954l058j25O99j1436K114J0560j510p068
$$ 5989 -2893 -2941 1002 -627 -4346 634 8588 5530 5405 6104 -5332 -3218 7342 5832 -1236
9646a236M970n329l679Q621P613j0376J674Q240J2235j813l794m564J526K311
$$ -1236 3734 -1595 -5274 3347 10960 584 2258 10498 22733 20920 17126 12562 14088 16399
9632A6399O154L289j695m289r328N96N509J921P723K746m710J833P599o408j4966
$$ 16399 22553 25842 24147 19858 10530 11126 16635 18556 26279 29025 24315 26148 33747 27339 12373
9617A2373P288J8120R963N528j3132j2149k138N669N040k121J94P829j468L555
$$ 12373 19661 37781 47744 53272 40140 27991 25853 31522 36562 34441 34635 42464 40996 44551
9603D4551l553O627J6132J8353P318J158K846J8872J4278L811J0291R632J3011
$$ 44551 40998 47625 63757 82110 89428 90586 93432 112304 126582 130393 140684 150316 163327
9590A63327J0909J9199J7613L4614N2066N4256N3420O8746Q7634R7316J22571
$$ 163327 174236 193435 211048 245662 297728 351984 405404 474150 561784 659100 781671
9579G81671J54183J74378J78207J68551J16695L6978k9091q9333j36037j62891
$$ 781671 935854 1110232 1288439 1456990 1573685 1610663 1581572 1492239 1356202 1193311
9569A193311j67465j57300j28004j12730r6541p3315m6730n6073n5311m3122j7478
$$ 1193311 1025846 868546 740542 627812 531271 457956 411226 355153 299842 256720 239242
9558B39242j4392j6872k0651k0565q685o391j2239j1790j2684j4147j3246p506
$$ 239242 224850 207978 187327 166762 158077 151686 139447 127657 114973 100826 87580 80074
9546H0074n072n081J393k861m406m689K576q193j4463K502j53m010o556l053L509
$$ 80074 75002 69921 71314 68453 64047 59358 61934 53741 39278 41780 41627 37617 31061 28008 31517
9531C1517K910L890m840j3256K198q890j634q75p500J2120O631r392L887k172
$$ 31517 34427 38317 33477 20221 22419 13529 11895 11020 3520 15640 22271 12879 16766 14594
9517A4594L296k126L21p045j0394J00L308k288n52N193P165j0509m901j791J3621
$$ 14594 17890 15764 16085 9040 -1354 -1254 2054 -234 -786 4407 11572 1063 -3838 -5629 7992
9502G992O203m039p995k656o6J647Q487M241l215m770K578R77l511J443R809k023
$$ 7992 14195 10156 2161 -495 -561 1086 9573 13814 10599 5829 8407 9384 5873 7316 17125 15102
9486A5102r385m838J328J817r57M469K186m033j1583l255R093o341m35Q726J1596
$$ 15102 5717 879 2207 4024 3067 7536 9722 5689 -5894 -9149 -56 -6397 -6832 1894 13490
9471A3490L597N221j134o352j3593k862L779n527M547K496L041J436l909p770
$$ 13490 17087 22308 21174 14822 1229 -1633 2146 -3381 1166 3662 6703 8139 4230 -3540
9457c540j05J0095j762j5211k692R350L515o062k791M492Q72M10q88M633n586
$$ -3540 -3645 6450 4688 -10523 -13215 -3865 -350 -6412 -9203 -4711 -3839 -3429 -4317 316 -5270
9442e270l073k919J89M941o128L928N366n017N133j421O958K369L79N14o343j5027
$$ -5270 -8343 -11262 -11073 -6132 -12260 -8332 -2966 -7983 -2850 -4271 2687 5056 5435 5949 -394 -15421
9426a5421j246J0201Q104Q46l571M83M975n41N256p09j9057k920J17o079K032
$$ -15421 -16667 -6466 1638 2484 -1087 -604 4371 3830 9086 8377 -10680 -13600 -13483 -19562 -17530
9411a7530M700r115P527J1232Q699M776m77q06L186L786k0158p629O846Q152k234
$$ -17530 -12830 -21945 -14418 -3186 5513 10289 9812 9006 12192 15978 -4180 -11809 -4963 3189 955
9396I55m239j864n868p814l96P905J3445j690k487j718l782N724J606K253j729
$$ 955 -3284 -5148 -11016 -18830 -19226 -11321 2124 434 -2053 -3771 -7553 -1829 -223 2030 301
9381C01q617m573P639Q443K220j0028m29l443j049l594J232J277j953K410Q984
$$ 301 -8316 -12889 -5250 3193 5413 -4615 -5044 -8487 -9536 -13130 -11898 -10621 -12574 -10164 -1180
9366a180M712J447K937L012j0075j3695r790Q015P455r354O672K112n310p04R259
$$ -1180 3532 4979 7916 10928 853 -12842 -22632 -14617 -7162 -16516 -9844 -7732 -13042 -13746 -4487
9351d487o958L68R101N043M731Q381k208q774j0706l562q006q32M201Q42j531
$$ -4487 -11445 -11077 -1976 3067 7798 16179 13971 5197 -5509 -9071 -17077 -17909 -13708 -12866 -14397
9336a4397L548J4059M970p4n023j271n090K241J401k375L601K824n04M918L594
$$ -14397 -10849 3210 8180 8106 3083 1812 -3278 -1037 364 -2011 1590 4414 3910 8828 12422
9321A2422p735n820L132l981k048N95N59o40O38L419n554K69k560o87k672L649
$$ 12422 4687 -1133 1999 -1982 -4030 -3435 -2876 -3516 -2878 541 -5013 -4744 -7304 -7991 -10663 -7014
9305g014J093o889k453O654M823M849p159O006P229j672q050J416R713K791k632
$$ -7014 -5921 -12810 -15263 -8609 -3786 1063 -6096 -90 7139 5467 -2583 -1167 8546 11337 8705
9290H705l863M54n581m406K552M829K303L19om863j142M583J752p91L58L187p309
$$ 8705 4842 5296 -285 -4691 -2139 2690 4993 5312 5306 443 -699 3884 5636 4845 5203 8390 1081
9273A081K506O293N324m159k894J621N825L12k694n445P204K460N838j073p074
$$ 1081 3587 9880 15204 11045 8151 9772 15597 15909 13215 7770 14974 17434 23272 22199 15125
9258A5125q101l056M512L434J908N091j1423j2709p814K713Q485j135m288K194
$$ 15125 7024 3968 8480 11914 13822 18913 7490 -5219 -13033 -10320 -1835 -2970 -7258 -5064
9244e064Q986n225j5579O95J3456l147n046P167N869O051K971L623Jq703j3951
$$ -5064 3922 -1303 -16882 -16187 -2731 -5878 -10924 -3757 2112 8163 11134 14757 14758 6055 -7896
9229g896n812N921R153J7192k617j1971r688J377k040L422L534l49l186j1746
$$ -7896 -13708 -7787 1366 18558 15941 3970 -5718 -4341 -6381 -2959 575 226 -2960 -14706
9215a4706L621J3857k098l156K321n679p075p91J720L145J1103J190r52N102L330
$$ -14706 -11085 2772 674 -2482 -161 -5840 -12915 -13706 -11986 -8841 2262 3452 2500 7602 10932
9200A0932l599q29r683J191Q273R780K861N144o444j0823j0034Q078J195r696
$$ 10932 7333 6504 -3179 -1988 6285 16065 18926 24070 17626 6803 -3231 4847 6042 -3654
9186c654m713k862K756j4M6N093M328M558O693P445m439q373K337P634o453N324
$$ -3654 -8367 -11229 -8473 -8487 -8441 -3348 980 5538 12231 19676 15237 6864 9201 16835 10382 15706
9170A5706j339n474M932n477l945K099P764n756n541J571o588k120J3732j552
$$ 15706 14367 8893 13825 8348 4403 6502 14266 8510 2969 4540 -2048 -4168 9564 8012
9156H012n505l252M992J1111k471j306O076l434j753k431k029K211l96r879R369
$$ 8012 2507 -745 4247 15358 12887 11581 17657 14223 12470 10039 8010 10221 9825 -54 9315
9141I315k76p045m954r358J2300l348o192Q252L875Q426o262j3195m355j316R766
$$ 9315 9039 1994 -2960 -12318 -18 -3366 -9558 -1306 2569 10995 4733 -8462 -12817 -14133 -4367
9126d367L528n801l166N294N224J24p049L058P074o465K449m56O266Q647j964
$$ -4367 -839 -6640 -9806 -4512 712 836 -6213 -3155 3919 -2546 -97 -553 5713 14360 12396
9111A2396R229j1844q78J956n204p282r292m415N669P211M656o0N505j020k919
$$ 12396 21625 9781 8903 10859 5655 -1627 -10919 -15334 -9665 -2454 2202 2142 7647 6627 3708
9096C708J2631j0006j7457m008J1992K119K126M947o87o18r57p576P233O340L477
$$ 3708 16339 6333 -11124 -15132 -3140 -1021 1105 6052 5365 4747 3790 -3786 3447 9787 13264
9081A3264r064k181k625O665L115j2691L744R997m819m534l222o105l892Q135
$$ 13264 4200 2019 -606 6059 9174 -3517 227 10224 5405 871 -2351 -8456 -12348 -4213
9067d213p98K129P2m788p281R106J1195J37m51O473L798j0753q061M52p561q558
$$ -4213 -5011 -2882 -2810 -7598 -14879 -5773 5422 5559 5108 11581 15379 4626 -3435 -2983 -10544 -19102
9051a9102J598j827Q063R844K465N906L12k230P014k855j841O242r61k608q90
$$ -19102 -17504 -19331 -11268 -1424 1041 6947 7259 5029 12043 9188 7347 13589 12628 10020 9130
9036I130o340m167n435N855J3115J044q136p805K401N476j851j0343N377O721
$$ 9130 2790 -1377 -6812 -957 12158 13202 5066 -2739 -338 5138 3287 -7056 -1679 5042
9022E042P877M156k00m450p321r90J4812L66j5009J899J1247R699r203j1596m865
$$ 5042 12919 17075 16875 12425 5104 4114 18926 19292 4283 6182 17429 27128 17925 6329 1464
9007A464N396n883q576K534J2366j880n726k25p94O215m974n859r93L008R70R987
$$ 1464 6860 977 -7599 -5065 7301 5421 -305 -530 -1324 4891 -83 -5942 -6935 -3927 -2957 7030
8991G030Q37p45j1493l760k55k70L588J1453O988n142r175j4960J199Q495J0624
$$ 7030 7867 7122 -4371 -8131 -8386 -8656 -5068 6385 13373 8231 -944 -15904 -14705 -6210 4414
8976D414R230K950J86r182j7171j1878J1013K294k221O837Q848O547o784k385
$$ 4414 13644 16594 16780 7598 -9573 -21451 -10438 -8144 -10365 -3528 5320 11867 5083 2698
8962B698j144P51K647j038L767O442n509q500P979O355m319m684m881l032l889
$$ 2698 1554 2305 4952 3914 7681 14123 8614 114 8093 14448 10129 5445 564 -2468 -6357
8947f357Q0k578n472M421K343N998j923L691K625O590k276K335O257K235k221
$$ -6357 -6277 -8855 -14327 -9906 -7563 -1565 -3488 203 2828 9418 7142 9477 15734 17969 15748
8932A5748k156j1417q135k882j748L008O348L14j383J545q21l96l451L31R291
$$ 15748 13592 2175 -5960 -8842 -10590 -7582 -1234 -920 -2303 -758 -1579 -1975 -5426 -5095 4196
8917D196l04j0666M172L748L307r099j1659M231N437O614O373J937R10k474M47
$$ 4196 3892 -6774 -2602 1146 4453 -4646 -16305 -12074 -6637 -23 6350 8287 9197 6723 7170
8902G170n525q929l0J1618L817J821K582l698n281l711M613k288L956k761r64
$$ 7170 1645 -7284 -7314 4304 8121 9942 12524 8826 3545 -166 4447 2159 6115 3354 2390
8887B390P391N394J309p160p121M27L92q87N701p535M109P450o429k162R333J4069
$$ 2390 9781 15175 16484 9324 2203 2630 3022 2135 7836 301 4410 11860 5431 3269 12602 26671
8871B6671J2626J2270k156k1363j872P778j0561M397O307j4969r411j1293n911
$$ 26671 39297 51567 49411 28048 26176 33954 23393 27790 34097 19128 9717 -1576 -7487
8858g487M978J1514J2403l083p193m095m68n994l270l387P18m08Q517J646l350
$$ -7487 -2509 9005 21408 18325 11132 7037 6569 575 -2695 -6082 -5364 -5772 2745 4391 1041
8843A041r799l523L992k479J134l582J04L952J1146L419m223r224j0236R337J0827
$$ 1041 -8758 -12281 -8289 -10768 -9634 -13216 -13112 -9160 1986 5405 1182 -8042 -18278 -8941 1886
8828A886O780M291M116q208r849J475M977j0963p986N110M525Q528J829R45l660
$$ 1886 8666 12957 17073 8865 -984 491 5468 -5495 -13481 -8371 -3846 4682 6511 7456 3796
8813C796m822k102j578l13j4063m012O819Q325N59j1120J832M569R132K459K442
$$ 3796 -1026 -3128 -4706 -5019 -19082 -23094 -16275 -7950 -7391 -18511 -16679 -12110 -2978 -519 1923
8798A923J2992j563p736J87K63N285q110n325K999r307o611N573K467k422L849
$$ 1923 14915 13352 5616 5803 6066 11351 3241 -2084 915 -8392 -15003 -9430 -6963 -9385 -5536
8783e536L119j894n038j642o455Q075O577m813K645P959J769r49N125n371K229
$$ -5536 -2417 -4311 -9349 -10991 -17446 -9371 -2794 -7607 -4962 2997 4766 3817 8942 3571 5800
8768E800J1771k50o367k256P30M702k905o859o832K713r93q05O317k952l592o722
$$ 5800 17571 17321 10954 8698 9428 14130 11225 4366 -2466 247 -746 -1551 4766 1814 -1778 -8500
8752h500l021M949N000p99P188K351n684m996L505n648k401m061k103J6367O170
$$ -8500 -11521 -6572 -1572 -2371 4817 7168 1484 -3512 -7 -5655 -8056 -12117 -14220 2147 8317
8737H317m345J4711R752j717p861j3253j3012j312K833J4506R95j2973Q533L57
$$ 8317 3972 18683 28435 26718 18857 5604 -7408 -8720 -5887 8619 9614 -3359 5174 5531
8723E531p259N05R951m242o071P519J1287O997J0734j32n933j3236K900J023l789
$$ 5531 -1728 -1223 8728 4486 -1585 5934 17221 24218 34952 34820 28887 15651 18551 19574 15785
8708A5785l592j643p807l854J933o87K649L753q865k730Q579k897q147j51O0J0533
$$ 15785 12193 10550 2743 -1111 822 135 2784 6537 -2328 -5058 3521 624 -7523 -7674 -7614 2919
8692B919N105J421m715m133N29L826M055n787o205M754J705O50J153j896R010
$$ 2919 8024 9445 4730 597 1126 4952 9007 3220 -2985 1769 3474 4124 5277 3381 12391
8677A2391R690j958j0817r374N310O582P615j4349p394N144N897k982K059j190
$$ 12391 22081 20123 9306 -68 5242 11824 19439 5090 -2304 2840 8737 5755 7814 6624
8663F624r61O97M154K201L218j0636j940J0925k209p382q811k288O341n262M765
$$ 6624 5663 6360 10514 12715 15933 5297 3357 14282 12073 4691 -4120 -6408 -67 -5329 -564
8648e64K1418O757l334r876O932j239J58P626N670m105J2061K7396N0608R4194
$$ -564 20854 27611 24277 14401 21333 20094 20252 27878 33548 29443 41504 68900 119508 213702
8634B13702J16902N2390m6015q6667p1613o1753l0451k6647j1552l157p35p34
$$ 213702 330604 382994 336979 250312 178699 116946 86495 59848 48296 45139 44404 43670
8622D3670m249r514o406k528L068N091J3683k818j6318L038k838L83J964k003
$$ 43670 39421 29907 23501 20973 24041 29132 42815 39997 23679 26717 23879 24262 26226 24223
8608B4223K870l317J0093L824K11M121P326J9024N429p680l852R511J0073O938
$$ 24223 27093 23776 33869 37693 37904 42025 49351 68375 73804 66124 62272 71783 81856 88794
8594H8794J8425K7020M3997P9084J41143K04832J24301m4795j32498j44808j26000
$$ 88794 107219 134239 178236 257320 398463 603295 727596 682801 550303 405495 279495
8583B79495p9469n2687k9982j6659k4613q995j2673j0510k235N265j742j3642
$$ 279495 200026 147339 117357 100698 76085 67090 54417 43907 41672 46937 45195 31553
8571C1553J9N48j1090j2524O058l647j392Q977J349p545k416l518J1273Q654J257
$$ 31553 31572 32120 21030 8506 14564 10917 9525 18502 19851 12306 9890 6372 17645 26299 27556
8556B7556l657j100K811O976Q982P49J275m969J4269K4290L4163N4367Q9087P6954
$$ 27556 23899 22799 25610 32586 41568 42317 43592 38623 52892 77182 111345 165712 254799 331753
8542C31753O42n4513p9077o1690m6889l1123j5912l621n797N36l769j3351m789
$$ 331753 332395 277882 198805 137115 90226 59103 43191 39570 33773 34309 30540 17189 12400
8529A2400O236j24p004j9915j7779k454J6691J0422P248O510l384L552M852p802
$$ 12400 18636 18512 11508 -8407 -26186 -28640 -11949 -1527 5721 12231 8847 12399 17251 9449
8515I449o814q3O7k983k741L782O052q923j0428L848j497q384J1298O166P153
$$ 9449 2635 2552 2619 -364 -3105 677 6729 -2194 -12622 -8774 -10271 -18655 -7357 -1191 5962
8500E962K644q956r758P587J525k74N40m197K683O817N299j0511o372O983O414
$$ 5962 8606 -350 -10108 -2521 -996 -1270 -730 -4927 -2244 4573 9872 -639 -7011 -28 6386
8485F386m277k100O596J117k764m363q720O00Q87K290N781J766L572j467p895
$$ 6386 2109 9 6605 7722 4958 595 -8125 -7525 -6638 -4348 1433 3199 6771 5304 -2591
8470b591n311r33O462J1525Q146p528p657o893R282k199m757n334M084n6M549
$$ -2591 -7902 -8835 -2373 9152 17298 9770 2113 -4780 4502 2303 -2454 -7788 -3704 -3760 789
8455G89k46k764j0950n475O381J3062J0244J0438k364n638O25J0p607q36r87N005
$$ 789 543 -2221 -13171 -18646 -12265 797 11041 21479 19115 13477 14102 14112 6505 5669 4682 9687
8439I687N977o326p108m099k753K526O172Q681l717j0964n82n887J246j12O861
$$ 9687 15664 9338 2230 -1869 -4622 -2096 4076 12757 9040 -1924 -2506 -8393 -7147 -7259 -398
8424c98R716n750m997J479k555O910J1915j0207r144j400n365n376J641R278n823
$$ -398 9318 3568 -1429 50 -2505 4405 16320 6113 -3031 -4431 -9796 -15172 -13531 -4253 -10076
8409a0076o971M329n542J285N987O891L260n792l321P378P84q04J612K007M129
$$ -10076 -17047 -12718 -18260 -16975 -10988 -4097 -837 -6629 -9950 -2572 -1788 -2592 -980 1027 5156
8394E156k292r34J2631M09l488m527n542L312K469m826q038P421O669m803p58
$$ 5156 2864 1930 14561 14970 11482 6955 1413 4725 7194 2368 -5670 1751 8420 3617 2859
8379B859k466K928K581r132J474M193m219o186L390Q821J784j081j201Q20R955
$$ 2859 393 3321 5902 -3230 -1756 2437 -1782 -7968 -4578 4243 6027 4946 3745 4565 14520
8364A4520M087M034k23p820r964m594P734O930l016o677m037p85l072j471K695
$$ 14520 18607 22641 22418 14598 4634 40 7774 14704 11688 5011 974 189 -2883 -4354 -1659
8349a659k29n550J1560J5259P30r361j7437q419O263J5502O816n460p277o156
$$ -1659 -1888 -7438 4122 19381 20111 10750 -6687 -15106 -8843 6659 13475 8015 738 -5418
8335e418K996L443n91q092J637q28J05O257j651n93R63r99K064Q352L772k45k074
$$ -5418 -2422 1021 430 -7662 -6025 -6853 -6748 -491 -2142 -2735 -1772 -2771 -707 7645 11417 11172 9098
8318I098N47l434q087p617j812M420J4176j384J398L01k071L781J589p902n29
$$ 9098 9645 6211 -1876 -9493 -11305 -6885 7291 5907 7305 7606 5535 9316 10905 3003 2474
8303B474j2074l655O396j076J0386M906L399q541m912N472L159J0178n172j8335
$$ 2474 -9600 -13255 -6859 -7935 2451 7357 10756 2215 -2697 2775 5934 16112 10940 -7395
8289g395j873o012M33K970l795Q926j584L718J380K44L4M639N926j787j692j5710
$$ -7395 -9268 -15280 -14847 -11877 -15672 -6746 -8330 -4612 -3232 -2988 -2954 1685 7611 5824 4132 -11578
8273a1578o194j851P227O613J443M9J0597j796o298K352q286j331Q791m825j179
$$ -11578 -17772 -19623 -12396 -5783 -4340 -4291 6306 4510 -1788 564 -7722 -9053 -262 -5087 -6266
8258f266J526l760j592L363R293M178m097l593K867N819Q14p097k798J701O159
$$ -6266 -4740 -8500 -10092 -6729 2564 6742 2645 -948 1919 7738 8552 1455 -1343 358 6517
8243F517P83N261K121j620j933L532k246j2209N796R544N268K308p09n83n023
$$ 6517 7300 12561 14682 13062 11129 14661 12415 206 6002 15546 20814 23122 22413 21830 16807
8228A6807n539N63j594K263p560l423O458Q309n846m48Q884K952K854n317j768
$$ 16807 11268 11831 10237 12500 4940 1517 7975 16284 10438 9990 18874 21826 24680 19363 17595
8213A7595l554n171q213p202P974N998O430L737n860R55r849Q230l576m979K312
$$ 17595 14041 8870 657 -6545 1429 7427 13857 17594 11734 12689 2840 11070 7494 2515 4827
8198D827L384L222M839j634n362k183n887R065L659o299o489m04N208M327k812
$$ 4827 8211 11433 16272 14638 9276 7093 1206 10271 13930 7631 1142 738 5946 10273 7461
8183G461K045Q348J864L969k680q083j278l081j5167P079M535P362J3537P223
$$ 7461 9506 17854 19718 23687 21007 12924 11646 8565 -6602 477 5012 12374 25911 33134
8169C3134M792L246K27q554k2507q216J010J0261K175q838n374q03N285M848Q928
$$ 33134 37926 41172 41399 32845 10338 2122 3132 13393 15568 6730 1356 553 5838 10686 19614
8154A9614K385m055l152l090k08J3536J041J193m30j0038k044M614J0448J7491
$$ 19614 21999 17944 14792 11702 11494 25030 26071 27264 26834 16796 14752 19366 29814 47305
8140D7305J1457M527N616J2512J6140k980k798q569j0047j8930j9021k727l607
$$ 47305 58762 63289 68905 81417 97557 94577 91779 83210 73163 54233 35212 32485 28878
8127B8878N641O357Q487L276l890j3475r557j0221m024O504L443k820L736o652
$$ 28878 34519 40876 49363 52639 48749 35274 25717 15496 11472 17976 21419 18599 22335 15683
8113A5683J872J410K366p109M519J2236P224J742J213J739j399k007N264o434
$$ 15683 17555 18965 21331 14222 18741 30977 38201 39943 41156 42895 41496 39489 44753 38319
8099C8319n555j849K471o36j1547r780R050Q354R90M945r26n657k560n168L647
$$ 38319 32764 30915 33386 32750 21203 11423 20473 28827 29817 34762 33836 28179 25619 20451 24098
8084B4098M454j6930j2626J2853J6557J199m719k725P030Q405j7218j2278O985
$$ 24098 28552 11622 -1004 11849 28406 29605 24886 22161 29191 37596 20378 8100 15085
8071A5085o119P01k056j5339o431K705J0448Q899l831M710R007l848k262k062
$$ 15085 8966 9667 7611 -7728 -14159 -11454 -1006 7893 4062 8772 17779 13931 11669 9607
8057I607J1304J1958j634l06j839l498n90n617j0895Q812Q283K081m249j4288
$$ 9607 20911 32869 31235 30929 29090 25592 25002 19385 8490 17302 25585 27666 23417 9129
8043I129K385J0276m692n388J32J244k36j1434p467L842P227J094l734j2156J53
$$ 9129 11514 21790 17098 11710 11842 13086 12850 1416 -6051 -2209 5018 6112 2378 -9778 -9625
8028i625J3454J4110j4248o053l674r18o13L876k343K232Q7Q516N955l349o142
$$ -9625 3829 17939 3691 -2362 -6036 -6954 -7567 -3691 -6034 -3802 -3715 4801 10756 7407 1265
8013A265j564R194R85q30k385P78J2761R163m059l80m442m142j3166n351K893
$$ 1265 -299 8895 9880 9050 6665 7443 20204 29367 25308 24928 20486 16344 3178 -2173 720
7998G20J0948Q400r2r04J0824k179j2950j971Q353M679j6522o71J371p622m824
$$ 720 11668 20068 19976 19072 29896 27717 14767 12796 21149 25828 9306 8635 10006 2384 -2440
7983b440N405J0310K353o074l543R8J0868J4119O60q25O0l849k038l172l500m635
$$ -2440 2965 13275 15628 9554 6011 6109 16977 31096 31756 30931 30991 27142 25104 21932 18432 13797
7967A3797j371N633N514r525k141J900L861K025K156k944N790N126k352P716R409
$$ 13797 12426 18059 23573 14048 11907 13807 17668 19693 21849 18905 24695 29821 27469 35185 44594
7952D4594p354j5575k855Q88k536M875M480k98L152n680n427l318n47J486l167
$$ 44594 37240 21665 18810 19698 17162 22037 26517 26219 29371 23691 18264 14946 14399 15885 12718
7937A2718j271k957K578j153M280M022M126K029n208K045Q504M141j4259l674
$$ 12718 11447 8490 11068 9915 14195 18217 22343 24372 19164 21209 29713 33854 19595 15921
7923A5921j1866r321J3673M787L552O255P18j214k791J380N533o145k132K395
$$ 15921 4055 -5266 8407 13194 16746 23001 23719 22505 19714 21094 26627 20482 18350 20745
7909B0745o028L917M397m342N22N276o788r10J732O142k489m595M739o278o030
$$ 20745 14717 18634 23031 18689 19211 24487 17699 16789 18521 24663 22174 17579 22318 16040 10010
7894A0010o600l014q017LJ1850R533j631n261k004n384m363K854K956p401M023
$$ 10010 3410 396 -7621 -7618 4232 13765 12134 6873 4869 -515 -4878 -2024 932 -6469 -2446
7879b446J705J2081N553P663j504p881n626m64m72k096M787R161O493M652k854
$$ -2446 -741 11340 16893 24556 23052 15171 9545 9081 8609 6513 11300 20461 26954 31606 28752
7864B8752j0936p637k862j731M684O298o346l366j262O608L346J242m766k023
$$ 28752 17816 10179 7317 5586 10270 16568 10222 6856 5594 12202 15548 16790 12024 10001
7850A0001J087J534j4146m576K686N952K534l81j469m128l01O712n480j1840J753
$$ 10001 11088 12622 -1524 -6100 -3414 2538 5072 4691 3222 -906 -1207 5505 25 -11815 -10062
7835a0062J471j929Q44M840M520j1518k471J317m061L535R475K270J476k906q41
$$ -10062 -8591 -10520 -9676 -4836 -316 -11834 -14305 -12988 -17049 -13514 -4039 -1769 -293 -3199 -4040
7820d040j584P211R432k264k078J803m552p352n864J4002m717r997L432P158n497
$$ -4040 -5624 1587 11019 8755 6677 8480 3928 -3424 -9288 4714 -3 -10000 -6568 590 -4907
7805d907p69r565M524J0287m622P239Q80m029j902J343O266M884J905j4295n046
$$ -4907 -5676 -15241 -10717 -430 -5052 2187 3067 -962 -2864 -1521 4745 9629 11534 -2761 -7807
7790g807n569J372M333O91K263P860J019j144k872p786r967P864lK258k031L41
$$ -7807 -13376 -12004 -7671 -6980 -4717 3143 4162 3018 146 -7640 -17607 -9743 -9746 -7488 -9519 -9178
7774i178l37Q626L790j203L217K113p546l589K007l12k944n31N629J0130l968
$$ -9178 -9515 -889 2901 1698 4915 7028 -518 -4107 -2100 -2412 -5356 -5887 -258 9872 5904
7759E904j3505m078J0350Q695q764m400p618K583j363L18N555P19Q406Q301J76
$$ 5904 -7601 -11679 -1329 7366 -1398 -5798 -13416 -10833 -12196 -11878 -6323 -5604 2802 11103 11279
7744A1279o39n197L250l810o700r799m915K586m246L893m089R076J042m364P715
$$ 11279 10640 5443 8693 4883 -1817 -11616 -16531 -13945 -18191 -14298 -18387 -9311 -8269 -12633 -4918
7729d918k179L504k356k170n050o973L154P971P057j831n456j614N444P790o792
$$ -4918 -7097 -3593 -5949 -8119 -13169 -20142 -16988 -9017 -1960 -3791 -9247 -10861 -5417 2373 -4419
7714d419o749j891J097R661p04M47L00o974k653M965j467q012K930N859M360o03
$$ -4419 -11168 -13059 -11962 -2301 -3005 -2558 -2258 -9232 -11885 -6920 -8387 -16399 -13469 -7610 -3250 -3853
7698c853q762k028k366J154O266K844J210K939p942J810K918J20O826O690n799
$$ -3853 -12615 -14643 -17009 -15855 -9589 -6745 -5535 -2596 -10538 -8728 -5810 -5690 1136 7826 2027
7683B027n847M819N184q006k059k501O92J293m866j2923N237L162n158O830j350
$$ 2027 -3820 999 6183 -1823 -3882 -6383 -5691 -4398 -9264 -22187 -16950 -13788 -18946 -12116 -13466
7668a3466N79j89P747M319l855n802L147r645L326j234J317J0288J6859L135l649
$$ -13466 -12887 -13076 -5329 -1010 -4865 -10667 -7520 -17165 -13839 -15073 -13756 -3468 13391 16526 12877
7653A2877l611j83K727j1207j3087k810Q695L241K81P508P567K48k379N082j2431
$$ 12877 9266 9083 11810 603 -12484 -15294 -6599 -3358 -3077 4431 11998 12246 9867 14949 2518
7638B518l360L955K167q685M68R545m204q205m416P781P695j1026j1673O894L783
$$ 2518 -842 3113 5280 -3405 -2937 6608 2404 -5801 -10217 -2436 5259 -5767 -17440 -10546 -6763
7623f763q215M733R42O054J1764m874n846M33l999j866M532j761K036Q707n89
$$ -6763 -14978 -10245 -9303 -3249 8515 3641 -2205 -1772 -5771 -7637 -3105 -4866 -2830 5877 5288
7608E288m868m16O575L178o461j4391o818n387O012J0664l742o644P486J4339
$$ 5288 420 4 6579 9757 3296 -11095 -17913 -23300 -17288 -6624 -10366 -17010 -9524 4815
7594D815J0060o08K64m720k961M754J0383R335j0177k0757r044n477N689Q443
$$ 4815 14875 14267 14531 9811 6850 11604 21987 31322 21145 388 -8656 -14133 -8444 -1
7580aK683m639O45N805o665Q665M259m431j778J625J458N09k090L908j163o992
$$ -1 2682 -1957 -1312 4493 -2172 6493 10752 6321 4543 6168 7626 8135 6045 9953 8790 1798
7564A798n561o403k766J0152M922K69p411r091p641n230L868O415J0725J4009
$$ 1798 -3763 -10166 -12932 -2780 2142 2411 -5000 -14091 -21732 -26962 -23094 -16679 -5954 8055
7550H055L608N848l116j1726q810j4272j675J7365P416m195o650L729n290l953
$$ 8055 11663 17511 14395 2669 -6141 -20413 -22088 -4723 2693 -1502 -8152 -4423 -9713 -13666
7536a3666l15Q361R671N86k008q470o482M138M414J264K916j72n708K087k622
$$ -13666 -13981 -5620 4051 4637 2629 -5841 -12323 -8185 -3771 -2507 409 237 -5471 -3384 -6006
7521f006j2978M919R726L398l213K64k793N73Q644Q292O25k735r783n589M121
$$ -6006 -18984 -14065 -4339 -941 -4154 -3890 -6683 -6110 2534 10826 11451 8716 -1067 -6656 -2535
7506b535L505M353L451j990j791k859J830k22M887j303n603q394k677L855N299
$$ -2535 970 5323 8774 6784 4993 2134 3964 3742 8629 7326 1723 -6671 -9348 -5493 -194
7491a94K03O901l309p287n031L863L280M21K441P326O180r769L667P555o22r210
$$ -194 9 6910 3601 -3686 -8717 -4854 -1574 -1153 1288 8614 14794 5025 8692 16247 15625 6415
7475F415j1450J253P588K038K45k971k67n121j0237J93N804M418L15M888j71j2885
$$ 6415 -5035 -3782 3806 5844 6089 3118 2851 -2270 -12507 -12314 -6510 -2092 -1777 3111 2940 -9945
7459i945n186L921M459O525J3086r05Q781n971j8267m044R965O843L299j700n35
$$ -9945 -15131 -11210 -6751 -226 12860 11955 20736 14765 -3502 -7546 2419 9262 12561 10861 10326
7444A0326Q091L885m609M646p885n304J345M041l121J951n360k843N118K198p200
$$ 10326 18417 22302 17693 22339 14454 9150 10495 14536 11415 13366 8006 5163 10281 12479 5279
7429E279j5242n082J0290R196L940K767L3k307k410J795L475K298n753q954l280
$$ 5279 -9963 -15045 -4755 4441 8381 11148 11181 8874 6464 8259 11734 14032 8279 -675 -3955
7414c955m93k64O141k827J867K526j884j4965l671J4929J3707l457q119r17J691
$$ -3955 -4448 -4712 1429 -1398 469 2995 1111 -13854 -17525 -2596 11111 7654 -465 -1382 309
7399C09J42P044K22j0009l036M304J021k829m092J793j89J86Q34J1631N253r385
$$ 309 451 7495 7717 -2292 -5328 -1024 -3 -2832 -6924 -5131 -5320 -5134 -4300 7331 12584 3199
7383C199j9008J531J0386J3166J493j0521j0278l497L692M64p22o692K722P071
$$ 3199 -15809 -14278 -3892 9274 10767 246 -10032 -13529 -9837 -9373 -10095 -16787 -14065 -6994
7369f994K182J4680J1538J028j361r190l885k467N041Q482Q330l696n204m55j760
$$ -6994 -4812 9868 21406 22434 21073 11883 7998 5531 10572 19054 27384 23688 18484 18029 16269
7354A6269j1602o891K425O76R053N709o027q274q460q154n783K693P515p35k37
$$ 16269 4667 -2224 201 877 9930 15639 9612 1338 -7122 -15276 -21059 -18366 -10851 -11586 -11823
7339a1823O839p390o684O806J0707R149k564j0374J125q491Q465N802N488J113
$$ -11823 -4984 -12374 -19058 -12252 -1545 7604 5040 -5334 -4209 -12700 -4235 1567 7055 8168
7325H168n810n123n989L472l13N080j225l55J7420j612q307j0836l299R3j71k03
$$ 8168 2358 -2765 -8754 -5282 -5595 -515 -1740 -2095 15325 13713 5406 -5430 -8729 -8636 -8807 -9010
7309i010L429R376J31j7604l127L618q77m897l45J8719J1850j4089n154j664M037
$$ -9010 -5581 3795 3926 -13678 -16805 -13187 -14064 -18961 -19306 -587 11263 -2826 -7980 -9644 -5607
7294e607P495J1607J087l845J0223l549q798k367m359r293j644P954P509n591
$$ -5607 1888 13495 14582 10737 20960 17411 8613 6246 1887 -7406 -9050 -1096 6413 822
7280H22r040J752R76p445J0010k562l421Q490M142o256j0293p577J6506l027k514
$$ 822 -8218 -6466 -5490 -12935 -2925 -5487 -8908 -418 3724 -2532 -12825 -20402 -3896 -6923 -9437
7265i437O13O75n904o989m363R691J4560m889n923j713N637N316P786q031p045
$$ -9437 -8824 -8149 -14053 -21042 -25405 -15714 -1154 -6043 -11966 -13679 -8042 -2726 5060 -2971 -10016
7250a0016J27P116R179K951l53l532M015l647O194L378l251p538n454n290K830
$$ -10016 -9889 -2773 6406 9357 9004 5472 9487 5840 12034 15412 12161 4623 -831 -6121 -3291
7235c291J666q310m138O340M795l511J646P972k799j3132o887R266M917K872Q429
$$ -3291 -1625 -9935 -14073 -7733 -2938 -6449 -4803 3169 370 -12762 -19649 -10383 -5466 -2594 5835
7220E835k635j378p448n575m278l685J1536N969l387L788P757n57k970j2488n68
$$ 5835 3200 1822 -5626 -11201 -15479 -19164 -7628 -1659 -5046 -1258 6499 5942 2972 -9516 -10084
7205a0084o524l033J1266M957O972J451J200p159j0505m284J1786Q167J678Q666
$$ -10084 -16608 -19641 -8375 -3418 3554 5005 6205 -954 -11459 -15743 -3957 4210 5888 14554
7191A4554M215J892n934L649r219o840O68k195K319O05k538o194J0116J434j3168
$$ 14554 18769 20661 14727 18376 9157 2317 2985 790 3109 3714 1176 -5018 5098 6532 -6636
7176f636K923L305L150M120R899j86r308l072P4n36q110r812M912K99M804M242
$$ -6636 -3713 -408 2742 6862 16761 16575 7267 4195 4269 3733 -4377 -14189 -9277 -8978 -4174 68
7160F8l657K493m9L936M059M025n2p652j0094J568O241j102r94p979J98J2812
$$ 68 -3589 -1096 -1145 2791 6850 10875 10823 3171 -6923 -5355 886 -216 -1210 -9189 -8991 3821
7144C821J135p122PK499k847K038p585j2116k200J583J1390J2196p889j3250K739
$$ 3821 4956 -2166 -2159 340 -2507 -469 -8054 -20170 -22370 -20787 -9397 2799 -5090 -18340 -15601
7129a5601P531j146o96P191K0r037n410M526L982m213j3597M963J2174J745Q831
$$ -15601 -8070 -9216 -9912 -2721 -2701 -11738 -17148 -12622 -8640 -12853 -26450 -21487 -9313 -7568 1263
7114A263j53p707R523n893N195o038j578P07k058L585n02K153p327j3046JO707
$$ 1263 1110 -6597 2926 -2967 2228 -3810 -5388 -4681 -6739 -3154 -3656 -1503 -8830 -21876 -21875 -15168
7098a5168M996M355N646k982k481O530J962l75J488m031r984m014m32l738J994
$$ -15168 -10172 -5817 -171 -3153 -5634 896 2858 2483 3971 -60 -10044 -14058 -14490 -18228 -16234
7083a6234p85j32J842R88K010J4655K154j587P327N93l837m27j439J018N648n070
$$ -16234 -17019 -17151 -15309 -14321 -12311 2344 4498 2911 10238 10831 6994 6567 5128 6146 11794 6724
7067F724o018J578L873p020K156O922k385l427O51L053Q77p363j78L201Q996o544
$$ 6724 706 2284 6157 -863 1293 8215 5830 2403 3054 6107 6984 -379 -557 2644 11640 5096
7051E096n013M461L611k10L093O913J736j0710j4485K2M988L743N747L913P76
$$ 5096 83 4544 8155 7945 11038 17951 19687 8977 -5508 -5486 -498 3245 8992 12905 13681
7036A3681p561j0489j459L667M825n872p978j0363m42L297K091J694j789N459
$$ 13681 6120 -4369 -5828 -2161 2664 -3208 -11186 -21549 -21991 -18694 -16603 -14909 -16698 -11239
7022a1239J7251M844k831j787p475K816J346l392L430m739j2035L430O204R374
$$ -11239 6012 10856 8025 6238 -1237 1579 2925 -467 2963 -1776 -13811 -10381 -4177 5197
7008E197J0082j0897j5905n90n852O60k86j015M486J07m057J2156K853j3657j555
$$ 5197 15279 4382 -11523 -12113 -17965 -17305 -17591 -18606 -14120 -14013 -18070 -5914 -3061 -16718 -18273
6993a8273J7612M014l342K885N423p38l539n560j52n148L12L642p26l736p525
$$ -18273 -661 3353 11 2896 8319 7581 4042 -1518 -1670 -6818 -6506 -2864 -3590 -7326 -14851
6978a4851J1251P435l382o237L155K420N066r753r529M783J0339L095k173m06
$$ -14851 -3600 3835 453 -5784 -2629 -209 4857 -4896 -14425 -9642 697 3792 1619 1213
6964A213o553p116k945L882l614m012j235M432r40Q031L990M321L393L240j225
$$ 1213 -5340 -12456 -15401 -11519 -15133 -19145 -20380 -15948 -16888 -8857 -4867 -546 2847 6087 4862
6949D862j0505k701L975o46J359L174M125N437p748n168j486p077k865L974l736
$$ 4862 -5643 -8344 -4369 -5015 -3656 -482 3643 9080 1332 -3836 -5322 -12399 -15264 -11290 -15026
6934a5026P420M105k206n083L105o748r378Q112J4311P868q070n564O018l573
$$ -15026 -7606 -3501 -5707 -10790 -7685 -14433 -23811 -15699 -1388 6480 -1590 -7154 -1136 -4709
6920d709n733M182Q236O491j842q910k454O021L877p02J904j640M249K479j76
$$ -4709 -10442 -6260 1976 8467 6625 -2285 -4739 1282 5159 4457 6361 4721 8970 11449 11273
6905A1273o129n900n265k994q536M161J3604n289K689K357K061J3612n712j0593
$$ 11273 5144 -756 -6021 -9015 -17551 -13390 214 -5075 -2386 -29 2032 15644 9932 -661
6891f61q704J667M133R818N020j015m196m250q204l109L702j4806n558O027J0833
$$ -661 -9365 -7698 -3565 6253 11273 10258 6062 1812 -6392 -9501 -5799 -20605 -26163 -20136 -9303
6876i303Q853l392q532Q855N558m416k196J173N36j296j537N797k669k163Q435
$$ -9303 -450 -3842 -12374 -3519 2039 -2377 -4573 -3400 -2864 -4160 -5697 100 -2569 -4732 3703
6861C703M793P213O750l391r038o286L252q66r804J0636M47o598j0779j23J1504
$$ 3703 8496 15709 22459 19068 10030 3744 6996 6130 -3674 6962 7409 811 -9968 -10091 1413
6846A413L338q311q609L482N621L372J814p61l997l649r20R785O784p186M25n494
$$ 1413 4751 -3560 -12169 -8687 -3066 306 2120 1359 -2638 -6287 -7207 2578 9362 2176 2601 -2893
6830b893q432K344P932J466J816n676N201R507o364r827J475J0690O376p4L077
$$ -2893 -11325 -8981 -1049 417 2233 -3443 1758 11265 4901 -4926 -3451 7239 13615 13541 16618
6815A6618M424n081J236l229l968l426k85K899j532j2754j051k873J001N118q648
$$ 16618 21042 15961 17197 13968 10000 6574 6289 9188 7656 -5098 -6149 -9022 -8021 -2903 -11551
6800a1551J789J4671J0156L021l864L085o686k0431p341J649j824R340Q016M705
$$ -11551 -9762 4909 15065 18086 14222 17307 10621 -9810 -17151 -15502 -17326 -7986 30 4735
6786D735n383n237M96j7l178q213n048R747l62L393q58r068M894J1288L682J365
$$ 4735 -648 -5885 -5389 -5406 -8584 -16797 -21845 -12098 -12460 -9067 -9925 -18993 -14099 -2811 871 2236
6770B236k974l380r668M147M636j229o217m17P688K42M303o50n041k23L548O485
$$ 2236 -738 -4118 -13786 -9639 -5003 -6232 -12449 -12866 -5178 -4936 -633 -1283 -6324 -6547 -2999 3486
6754C486M992m320O45k849m600k182J96J0146J0090k219M722K646n593l353j175
$$ 3486 8478 4158 4803 1954 -2646 -4828 -4632 5514 15604 13385 18107 20753 15160 11807 10632
6739A0632p550J816P156J399M749j624k527l841j1942Q809J1506L956p57J0387
$$ 10632 3082 4898 12054 13453 18202 16578 14051 10210 -1732 7077 18583 22539 21782 32169
6725C2169l874M258K2736L6157K9460K282j5168k0454k9299j9672k770L590j6649
$$ 32169 28295 32553 55289 91446 120906 123188 108020 87566 58267 38595 35825 39415 22766
6712B2766n650k126l077q92l93q312l962j113N484J378n803J675J2780J192j3712
$$ 22766 17116 14990 11913 11021 10628 2316 -1646 -2759 2725 4103 -1700 -25 12755 13947 235
6697B35j3030j566P092P467Q847O034J608k264j123j293l439r043k718l383m860
$$ 235 -12795 -14361 -7269 198 9045 15079 16687 14423 13300 12007 8568 -475 -3193 -6576 -11436
6682a1436J3003R344K009L255o380j1635k696K4P284j0730N208N50m709m763K558
$$ -11436 1567 10911 12920 16175 9795 -1840 -4536 -4512 2772 -7958 -2750 -2200 -6909 -11672 -9114
6667i114m28m738n662J4194R311k931m052K493J4457o62o21j0827r334n872m685
$$ -9114 -9542 -14280 -19942 -5748 3563 632 -3420 -927 13530 12868 12247 1420 -7914 -13786 -18471
6652a8471j742N66j159m806M41R213k789k783M334M313J133J349m815L759J3732
$$ -18471 -20213 -19647 -20806 -25612 -25171 -15958 -18747 -21530 -17196 -12883 -11750 -10401 -15216 -11457 2275
6637B275Q816j0307r84q73J673j761p184O144P888m281k835J366r067k436K933
$$ 2275 11091 784 -200 -1073 600 -1161 -8345 -2201 5687 1406 -1429 -63 -9130 -11566 -8633
6622h633n516J93N784K390J350l273Q045N539m488J0362O675j1053N983p314k004
$$ -8633 -14149 -13956 -8172 -5782 -4432 -7705 340 5879 1391 11753 18428 7375 13358 6044 4040
6607D040o238m722m44l5k964O030j102o355o125J788J4095K610n525m909l314
$$ 4040 -2198 -6920 -7364 -7399 -10363 -4333 -5435 -11790 -17915 -16127 -2032 578 -4947 -9856 -13170
6592a3170n053L127M303L509r944r457O477N937M403N992j0616j704N603O783
$$ -13170 -18223 -15096 -10793 -7284 -17228 -26685 -20208 -14271 -9868 -3876 -14492 -16196 -10593 -3810
6578c810m12J883R120k036J211K067q363j0150K869M830k311J587j038j767p25
$$ -3810 -4222 -2339 6781 4745 5956 8023 -340 -10490 -7621 -2791 -5102 -3515 -4553 -6320 -7045
6563g045P610N947l301L492N272L065L698o601j0983l217p891o613J96j327O092
$$ -7045 565 6512 3211 6703 11975 15040 18738 12137 1154 -2063 -9954 -16567 -16371 -17698 -11606
6548a1606O040j1215j551J1025J256j254O096M553n989j592J056Q647m444J479
$$ -11606 -5566 -16781 -18332 -7307 -6051 -7305 -1209 3344 -2645 -4237 -3181 5466 1022 2501
6534B501k814j255R17K787m642P734j218J509O667j58j3432p901l942o80L536
$$ 2501 -313 -1568 -651 2136 -2506 5228 4010 5519 12186 12028 -1404 -9305 -13247 -13927 -10391
6519a0391R694P705J916n987q255k933j232J1094K561r993j55N913M333r067m221
$$ -10391 -697 7008 8924 2937 -5318 -8251 -9483 1611 4172 -5821 -5976 -63 4270 -4797 -9018
6504i018j645R738J1820l920o063K596j979n161P055P323P767l72J140k589K140
$$ -9018 -10663 -925 10895 6975 912 3508 1529 -3632 3423 10746 18513 18141 19281 16692 18832
6489A8832p255j6792l754r063R182P656m276K116R727M359l516j0715k049P735
$$ 18832 11577 -5215 -8969 -18032 -8850 -1194 -5470 -3354 6373 10732 7216 -3499 -5548 2187
6475B187J4075l802j3704P123J74j0133k370K64O852k216J68o272j3910J5908
$$ 2187 16262 12460 -1244 5879 6053 -4080 -6450 -6186 666 -1550 -1382 -7654 -21564 -5656
6461e656J9296M845m306p831k787J375j567p023k491M100N434N859l570l638k046
$$ -5656 13640 18485 14179 6348 3561 4936 3369 -3654 -6145 -2045 3389 9248 5678 2040 -6
6446fk793j820k32M722j904J781J196K992O697m815O27n805o306K341q514K757
$$ -6 -2799 -4619 -4851 -129 -2033 -252 944 3936 10633 5818 6445 640 -5666 -3325 -11839 -9082
6430i082M955O10j0292P240J2846j284p696o757j835j782J2085Q507K107q800
$$ -9082 -4127 -3517 -13809 -6569 6277 4993 -2703 -9460 -11295 -13077 -992 7515 9622 822
6416H22M237K850k718J72K654j285p165J3J914oK169j1709p192P922j0636l373
$$ 822 5059 7909 5191 5363 8017 6732 -433 -420 1494 1488 3657 -8052 -15244 -7322 -17958 -21331
6400b1331N664K201Q109N918J934j93p28M892Q25q5o655K426m482q277n971J0963
$$ -21331 -15667 -13466 -5357 561 2495 2302 1574 6466 7291 7206 551 2977 -1505 -9782 -15753 -4790
6384d790P257M56M724l487k089L696M437R770o14J20R03l239j0237m962k813j002
$$ -4790 2467 2923 7647 4160 2071 5767 10204 19974 19360 19480 20383 17144 6907 1945 -868 -1870
6368a870L963k419n513O443J013k502n428l948M052L404O544J397j809j824R0
$$ -1870 2093 -326 -5839 604 1617 -885 -6313 -10261 -6209 -2805 3739 5136 3327 1503 1593
6353A593l999J703Q034q909p420J1485K954J981n862j061p631j0438l552L505
$$ 1593 -2406 -703 7331 -1578 -8998 2487 5441 7422 1560 499 -7132 -17570 -21122 -17617
6339a7617Q335Q830L419o874j197m106o93M186O479M1P257j903m304O198j657
$$ -17617 -9282 -452 2967 -3907 -5104 -9210 -9903 -5717 762 803 8060 6157 1853 8051 6394
6324F394o982p45K70P13m40j0494m338J0040M137r92q02M73o438q590J92O746
$$ 6394 -588 -1333 -1063 -350 -790 -11284 -15622 -5582 -1445 -2437 -3239 -2766 -9204 -17794 -17602 -10856
6308a0856O396k983M09o443N576Q767J91q668N346m900M093o36k692n959l604
$$ -10856 -4460 -7443 -7034 -13477 -7901 866 1057 -7611 -2265 -7165 -3072 -3708 -6400 -12359 -15963
6293a5963j691M684J1844Q152K144j0706p615p24R570P372j3158n246N978J148
$$ -15963 -17654 -12970 -1126 7026 9170 -1536 -9151 -9875 -305 7067 -6091 -11337 -5359 -4211
6279d211N539N992p393n299o732K272Q838P265q62m624R480K786l240j735l250
$$ -4211 1328 7320 -73 -5372 -12104 -9832 -994 6271 5409 785 10265 13051 9811 8076 4826
6264D826j280J086L767o569j0711j1620j520p87l035J028Q547N028N881K138q702
$$ 4826 3546 4632 8399 1830 -8881 -20501 -22021 -22808 -25843 -24815 -16268 -11240 -5359 -3221 -11923
6249a1923O633K799l048j2885o302O649J0757J5788l509q324Q441M686r889j0599
$$ -11923 -5290 -2491 -5539 -18424 -24726 -18077 -7320 8468 4959 -3365 5076 9762 -127 -10726
6235a0726n255P673K254r72m103J215M178J116J945O84m649m892R918J222n26
$$ -10726 -15981 -8308 -6054 -7026 -11129 -9914 -5736 -4620 -2675 -1991 -6640 -11532 -1614 -392 -918
6220i18n029m540P329J1752K122q29J779L795l440m473Q571J054l473k879r307
$$ -918 -5947 -10487 -3158 8594 10716 9887 11666 15461 12021 7548 16119 17173 13700 10821 1514
6205A514l772R854M82J184L718m602l624J230L339l509m51N03j761n694j464l131
$$ 1514 -2258 7596 8078 9262 12980 8378 4754 5984 9323 5814 5363 5866 4105 -1589 -3053 -6184
6189f184L768J1985o274p837Q312L249j1521M12j909o050j682P449n500l020K956
$$ -6184 -2416 9569 3295 -4542 3770 7019 -4502 -4090 -5999 -12049 -13731 -6282 -11782 -14802 -11846
6174a1846k069l517l993k212M564M576o986M285J3898M924q470j492l216L787
$$ -11846 -13915 -17432 -21425 -23637 -19073 -14497 -21483 -17198 -3300 1624 -6846 -8338 -11554 -7767
6160g767L877j887j640N007L250q323k892j051K080O253M914k464J1098q02j721
$$ -7767 -3890 -5777 -7417 -2410 840 -7483 -10375 -11426 -9346 -3093 1821 -643 10455 9653 7932
6145G932n98p467j1592l005R40n263N36L511k921k60L056K040Q354m616k449R767
$$ 7932 7334 -133 -11725 -14730 -13790 -19053 -18517 -15006 -17927 -18187 -15131 -13091 -4737 -9353 -11802 -2035
6129b035K709l100L988N342n508K661K917q078j3564m984R05L939m315Q005M726
$$ -2035 674 -2426 1562 6904 1396 4057 6974 -1104 -14668 -19652 -18747 -14808 -19123 -11118 -6392
6114f392j1169n539M639O004Q850j124m731R13L762J206j506l846n065L389P756
$$ -6392 -17561 -23100 -18461 -12457 -3607 -4731 -9462 -8549 -4787 -3581 -5087 -8933 -13998 -10609 -2853
6099b853K558K523l600p007n56L869j131J192Q929J222n798m385m521K918j0924
$$ -2853 -295 2228 -1372 -8379 -8935 -5066 -6197 -5005 3924 5146 -652 -5037 -9558 -6640 -17564
6084a7564j614P674m596j698L548L574J1517k222l009J174P775k332j740q377
$$ -17564 -19178 -11504 -16100 -17798 -14250 -10676 841 -1381 -4390 -3216 4559 2227 487 -7890
6070g890J858J2306j811o374n069n34n225k336L02R005P119j879o578n585Q282
$$ -7890 -6032 6274 4463 -1911 -6980 -7514 -12739 -15075 -14773 -5768 1351 -528 -7106 -12691 -4409
6055d409O074l731K531k054l927n744K32n91L241J008j18L385K270q60L579m966
$$ -4409 1665 -2066 465 -1589 -5516 -11260 -11028 -11619 -8378 -7370 -7488 -4103 -1833 -2693 886 -4080
6039d080m618n161O794J5567K700l788r528j390k158n701N757k075J154J5299
$$ -4080 -8698 -13859 -7065 8502 11202 7414 -2114 -3504 -5662 -11363 -5606 -7681 -6527 8772
6025H772K660p825k586m054L84m60O319j2129j587L498J997O375P57N925j442
$$ 8772 11432 3607 1021 -3033 -2649 -3109 3210 -8919 -10506 -7008 -5011 1364 2121 8046 6604
6010F604r497M113m272j637r56M086J028k03j5466p695J496O850R813j028M329
$$ 6604 -2893 1220 -3052 -4689 -5645 -1559 -531 -734 -16200 -23895 -22399 -15549 -5736 -6764 -2435
5995b435K180j158N350n966r207q691J581N72K712k167n220N320J1628R281M04
$$ -2435 -255 -1413 3937 -2029 -11236 -19927 -18346 -17774 -15062 -17229 -22449 -17129 -5501 3780 4184
5980D184r861J278M926M847P646l059J657k861q904j1346Q180M828p682j997K719
$$ 4184 -5677 -4399 527 5374 13020 9961 11618 8757 -147 -11493 -3313 1515 -6167 -8164 -5445
$$ [...]
##END NTUPLES=NMR SPECTRUM
##END=
