##TITLE=Analysis number 314598
Compound Code cc 47223
Book Reference 437/44/2
Project Code adrs
Chemist Name wendyb
##JCAMPDX= 6.0         $$ Bruker NMR JCAMP-DX V2.0
##DATA TYPE= NMR SPECTRUM
##DATA CLASS= NTUPLES
##ORIGIN= Bruker BioSpin GmbH
##OWNER= NMR
$$ XWIN-NMR		Version 3.5
$$ Fri Oct 21 08:14:34 2005 GMT Daylight Time (UT+1h)  MAYBRIDGE\NMR@NMR_250MHZ
##.OBSERVE FREQUENCY= 250.131544655141
##.OBSERVE NUCLEUS= ^1H
##.ACQUISITION MODE= SIMULTANEOUS (DQD)
##.ACQUISITION SCHEME= undefined
##.AVERAGES= 16
##.DIGITISER RES= 18
##SPECTROMETER/DATA SYSTEM= dpx250
##.PULSE SEQUENCE= zg30
##.SOLVENT NAME= CDCl3
##.SHIFT REFERENCE= (INTERNAL, CDCl3, 0, 16.4488)
##AUDIT TRAIL= $$ (NUMBER, WHEN, WHO, WHERE, WHAT)
$$ ##TITLE= Audit trail, XWIN-NMR		Version 3.5
$$ ##JCAMPDX= 5.01
$$ ##ORIGIN= Bruker BioSpin GmbH
$$ ##OWNER= NMR
$$ C:\u/data/dgb/nmr/ADRS/11140/pdata/1/auditp.txt
$$ ##AUDIT TRAIL=  $$ (NUMBER, WHEN, WHO, WHERE, WHAT)
(   1,<2005-10-21 08:14:08.46 +100>,<MAYBRIDGE\NMR>,<NMR_250MHZ>,
      <created by zg, POWCHK disabled, PULCHK disabled
       configuration hash MD5:
       62 19 C7 07 E1 42 D1 B7 37 6C 3D D0 77 39 F9 E6
       data hash MD5: 64K
       CA 94 CD CB C8 FC 60 2A 9C DC 94 B7 0A 7E 49 05>)
(   2,<2005-10-21 08:14:22.33 +100>,<MAYBRIDGE\NMR>,<NMR_250MHZ>,
      <Start of raw data processing
       ef LB = 0.3 FT_mod = 6 PKNL = 1 SI = 32K 
       data hash MD5: 32K
       E1 09 5D 9D D2 C6 74 C9 1B 39 11 73 71 A9 20 F1>)
(   3,<2005-10-21 08:14:24.32 +100>,<MAYBRIDGE\NMR>,<NMR_250MHZ>,
      <apk 
       data hash MD5: 32K
       46 32 59 C4 E6 7A 0E 8D 97 A2 B9 DA 98 9E E0 9A>)
(   4,<2005-10-21 08:14:25.10 +100>,<MAYBRIDGE\NMR>,<NMR_250MHZ>,
      <abs ABSG = 5 
       data hash MD5: 32K
       A4 9A 60 C2 FF 67 18 34 32 CC 14 1B 15 6A A4 81>)
$$ ##END=
$$ 
$$ hash MD5
$$ B3 50 A7 1D 3C 57 DC 57 49 43 AE BE 10 67 AA 35
##$RELAX= 
##$RELAX= 
##$RELAX= 
##$RELAX= 
##$RELAX= 
##$RELAX= 
##$RELAX= 
$$ Bruker specific parameters
$$ --------------------------
##$DU= <C:\u>
##$EXPNO= 11140
##$NAME= <ADRS>
##$PROCNO= 1
##$TYPE= <nmr>
##$USER= <dgb>
##$AMP= (0..31)
100 100 100 100 100 100 100 100 100 100 100 100 100 100 100 100 100 100 
100 100 100 100 100 100 100 100 100 100 100 100 100 100 
##$AQSEQ= 0
##$AQ_mod= 3
##$AUNM= <au_zg>
##$AUTOPOS= <1 >
##$BF1= 250.13
##$BF2= 250.13
##$BF3= 250.13
##$BF4= 250.13
##$BF5= 500.13
##$BF6= 500.13
##$BF7= 500.13
##$BF8= 500.13
##$BYTORDA= 1
##$CFDGTYP= 0
##$CFRGTYP= 5
##$CHEMSTR= <none>
##$CNST= (0..31)
1 1 145 1 1 1 1 1 1 1 1 1 1 1 1 1 1 1 1 1 1 1 1 1 1 1 1 1 1 1 1 1 
##$CPDPRG= <>
##$CPDPRG1= <>
##$CPDPRG2= <>
##$CPDPRG3= <>
##$CPDPRG4= <mlev>
##$CPDPRG5= <mlev>
##$CPDPRG6= <mlev>
##$CPDPRG7= <mlev>
##$CPDPRG8= <mlev>
##$CPDPRGB= <>
##$CPDPRGT= <>
##$D= (0..31)
0 1 0 0 0 0 0 0 0 0.06 0 0 0 0 0 0 0.0002 0 0 0 0 0 0 0 0 0 0 0 0 0 0 
0 
##$DATE= 1129878847
##$DBL= (0..7)
120 120 120 120 120 120 120 120 
##$DBP= (0..7)
150 150 150 150 150 150 150 150 
##$DBP07= 0
##$DBPNAM0= <>
##$DBPNAM1= <>
$$ [...]
##$SUBNAM7= <"">
##$SUBNAM8= <"">
##$SUBNAM9= <"">
##$SW= 20.6930455092707
##$SWIBOX= (0..15)
0 0 3 0 0 0 0 0 0 0 0 0 0 0 0 0 
##$SW_h= 5175.983436853
##$TD= 65536
##$TD0= 1
##$TE= 295.16
##$TE2= 300
##$TE3= 300
##$TEG= 300
##$TL= (0..7)
0 120 120 120 120 120 120 120 
##$TP= (0..7)
150 150 150 150 150 150 150 150 
##$TP07= 0
##$TPNAME0= <>
##$TPNAME1= <>
##$TPNAME2= <>
##$TPNAME3= <>
##$TPNAME4= <>
##$TPNAME5= <>
##$TPNAME6= <>
##$TPNAME7= <>
##$TPOAL= (0..7)
0.5 0.5 0.5 0.5 0.5 0.5 0.5 0.5 
##$TPOFFS= (0..7)
0 0 0 0 0 0 0 0 
##$TUNHIN= 0
##$TUNHOUT= 0
##$TUNXOUT= 0
##$USERA1= <user>
##$USERA2= <user>
##$USERA3= <user>
##$USERA4= <user>
##$USERA5= <user>
##$V9= 5
##$VALIST= <valist>
##$VCLIST= <CCCCCCCCCCCCCCC>
##$VD= 0
##$VDLIST= <DDDDDDDDDDDDDDD>
##$VPLIST= <PPPPPPPPPPPPPPP>
##$VTLIST= <TTTTTTTTTTTTTTT>
##$WBST= 1024
##$WBSW= 4
##$XGAIN= (0..3)
0 0 0 0 
##$XL= 0
##$YL= 0
##$YMAX_a= 393857
##$YMIN_a= -331899
##$ZGOPTNS= <>
##$ZL1= 120
##$ZL2= 120
##$ZL3= 120
##$ZL4= 120
##$ABSF1= 16.44882
##$ABSF2= -4.244352
##$ABSG= 5
##$ABSL= 3
##$ALPHA= 0
##$AQORDER= 0
##$ASSFAC= 0
##$ASSFACI= 0
##$ASSFACX= 0
##$ASSWID= 0
##$AUNMP= <proc_1d>
##$AZFE= 0.1
##$AZFW= 0.1
##$BCFW= 0
##$BC_mod= 0
##$BYTORDP= 0
##$COROFFS= 0
##$CY= 12.5
##$DATMOD= 1
##$DC= 0
##$DFILT= <>
##$DTYPP= 0
##$F1P= 14.0000005364418
##$F2P= -0.99999901652339
##$FCOR= 0.5
##$FTSIZE= 32768
##$FT_mod= 6
##$GAMMA= 0
##$GB= 0
##$INTBC= 1
##$INTSCL= 1
##$ISEN= 128
##$LB= 0.3
##$LEV0= 0
##$LPBIN= 0
##$MAXI= 10000
##$MC2= 0
##$MEAN= 0
##$ME_mod= 0
##$MI= 0
##$NCOEF= 0
##$NC_proc= -3
##$NLEV= 6
##$NOISF1= 0
##$NOISF2= 0
##$NSP= 0
##$NTH_PI= 0
##$NZP= 0
##$OFFSET= 16.44882
##$PC= 1
##$PHC0= -67.57164
##$PHC1= 11.26806
##$PH_mod= 1
##$PKNL= yes
##$PPARMOD= 0
##$PSCAL= 4
##$PSIGN= 0
##$REVERSE= no
##$SF= 250.130018303788
##$SI= 32768
##$SIGF1= 0
##$SIGF2= 0
##$SINO= 400
##$SIOLD= 32768
##$SREGLST= <1H.CDCl3>
##$SSB= 0
##$STSI= 32768
##$STSR= 0
##$SW_p= 5175.98343685301
##$SYMM= 0
##$S_DEV= 0
##$TDeff= 65536
##$TDoff= 0
##$TI= <Analysis number 999999
Compound Code 99
Book Reference 9
Project Code 9>
##$TILT= no
##$TM1= 0
##$TM2= 0
##$TOPLEV= 0
##$USERP1= <user>
##$USERP2= <user>
##$USERP3= <user>
##$USERP4= <user>
##$USERP5= <user>
##$WDW= 1
##$XDIM= 32768
##$YMAX_p= 331780935
##$YMIN_p= -192059
$$ End of Bruker specific parameters
$$ ---------------------------------
##NTUPLES= NMR SPECTRUM
##VAR_NAME=  FREQUENCY,     SPECTRUM/REAL,   SPECTRUM/IMAG
##SYMBOL=    X,             R,               I
##VAR_TYPE=  INDEPENDENT,   DEPENDENT,       DEPENDENT
##VAR_FORM=  AFFN,          ASDF,            ASDF
##VAR_DIM=   32768,         32768,           32768
##UNITS=     HZ,            ARBITRARY UNITS, ARBITRARY UNITS
##FACTOR=    0.157963299565203, 1,           1
##FIRST=     4114.34367622449, 0,            0
##LAST=      -1061.63976062852, 0,           0
##MIN=       -1061.63976062852, -192059,     0
##MAX=       4114.34367622449, 331780935,    0
$$ Real data points
##PAGE= N=1
##DATA TABLE= (X++(R..R)), XYDATA
$$ [...]
18898A6331l217J737J2874j0987J7565L0685k9886j7623o948K1348m14k8349j1704
18885h588J7718n467r112K2284K4205m4140o9623N0351L0404m1137m1794j6692
18873i1591M7331K3083J8195N752K6846Q01o08p4346k2808O3752J4729J5072P342
18860C3550L1873j3216m4364K247j1958K1087L2976N3377m2211o0321L4305L7044
18848G4389j7474l8883l0799j4593M2246j1635P051J6695m1826l6493j0348M8958
18836a2712R373J6811q108l4357j6727K7059K9821q617l0439k20K8933n54O1110
18823F1373L5293l3495O954k169k800k5454p31M1463J7284j9638m507k025m9591
18810B1957r279J5490K5979r426l6683J9598K6605M076j5945j6066L6169J6503
$$ plain form
18898 16331 13114 14851 27725 16738 34303 64988 35102 17479 10531 31879 31465 3116 -8588
18885 -8588 9130 3663 -5449 16835 41040 -3100 -72723 -22372 8032 -33105 -74899 -91591
18873 -91591 -44260 -21177 -2982 2770 29616 30417 29809 -44537 -67345 -3593 11136 26208 33550
18860 33550 65423 52207 7843 10090 -1868 19219 52195 105572 63361 3040 37345 74389
18848 74389 56915 18032 -12767 -27360 14886 3251 10302 26997 -14829 -51322 -61670 -12712
18836 -12712 -3339 13472 5364 -28993 -45720 -18661 11160 2543 -27896 -28116 817 263 61373
18823 61373 96666 63171 70125 67956 65156 39702 38971 80434 97718 78080 73573 71548 21957
18810 21957 12678 28168 54147 44721 8038 27636 54241 58317 42372 26306 62475 78978
18798G8978j234p01M094m1358m9754J6686N0662K0520J9726j985j5844o9028Q318
18785A9080L0400K6664j6325k7062l3742K9772j911J691L8569K7719J4830l717
18773A05968N0656p256l205o764Q8437J59396J29696N6213j52812j24788q7850
18762B07691j8979j4936Q962n1908q069L1131n551n2348Q442J591l6040k381N5336
18749A22941L2792r593o16O6569L2866J603L0523j8986j4554J3387J3931j3542
18737B57321n1190l3437l5841k4384p560n287J7641K6599Ok7480J8794P0003Q548
18724B13733J1731N4443L825j255M8499m86l7444j4338J9386K9723J8123N665
18712C51605J0153k5648n9710m8894k3144J6503J7751J0491N6205J1784l0752
$$ plain form
18798 78978 77744 77043 81137 39779 -9975 6711 57373 77893 97619 95634 79790 10762 19080
18785 19080 49480 76144 59819 32757 -985 28787 26876 28567 67136 94855 109685 105968
18773 105968 156624 149368 146163 139399 227836 387232 516928 573141 420329 295541 207691
18762 207691 188712 173776 182738 130830 122761 153892 148341 95993 104435 106026 69986 67605 122941
18749 122941 155733 146140 145524 212093 244959 246562 277085 258099 243545 256932 270863 257321
18737 257321 206131 172694 136853 112469 104909 99622 117263 143862 143868 116388 135182 205185 213733
18724 213733 225464 279907 283732 282477 330976 330490 293046 278708 298094 327817 345940 351605
18712 351605 361758 336110 276400 227506 204362 220865 238616 249107 305312 317096 286344
18701B86344r6236m4831m7254N751M3280m7984n2108K1248J5865P0092K6821j0893
18689A70095M392J3668j793l6115J8436n993l5269q081K2815J6873J648j0356
18677A50320o7234K8340J215k6879N7992P5917K872k018l7935j8132k7970m6214
18665I0274l1359r136j2883J1413j0430j5321P450K8321L1764k2603M961N445
18653G7896R43L06k847l522n2354Q6129m768k5970K8087L3415l5461l9835M396
18640F6415R045j2510l5274R302M2042k4214n5082K1910N7392K4050l6947k2798
18628D3331J3008J7028q604j1730M6376r889M0665Q7159O3037k7089l042m7513
18616B02737J1624j8046l475O2013O0823J4450k4582q8177l4885l7672j6340K0639
$$ plain form
18701 286344 190108 145277 98023 103774 147054 99070 46962 68210 84075 154167 180988 170095
18689 170095 174487 188155 186362 150247 168683 162690 127421 119340 142155 159028 160676 150320
18677 150320 83086 111426 112641 85762 143754 219671 222543 220525 182590 164458 136488 90274
18665 90274 58915 49779 36896 48309 37879 22558 30008 58329 90093 67490 72451 77896
18653 77896 78839 79145 76298 72776 20422 106551 101783 75813 103900 137315 101854 62019 66415
18640 66415 75460 62950 27676 36978 79020 54806 -276 21634 79026 103076 66129 43331
18628 43331 56339 73367 64763 53033 99409 89520 130185 217344 280381 253292 250250 202737
18616 202737 214361 196315 192840 254853 315676 330126 305544 217367 182482 144810 128470 149109
18604A49109K0985O4204J43911M9585o0951m2443R073K309p326Q281Q549N5492
18592D00778l9785j22570p9702k1934k3836j1427J7106q362M4349O433L654j7569
18580A47135m4993j4367L0865J8494k3551l6570q342L270n4643j6937J5976J6969
18568C3306N4321K6376l2097k1238p535J4118j8953j0800o057M2048L3242K9130
18556A35861M395j0914K0782j1458p7140m7400p364O66j9495J0140K6077l7038
18544a2888O244M0280l4712n1518J3997M8609M8186j1205j817j0597R980O404
18532E0963N163J6179J6782j9651l7584j1259o276k2789K5642m619M5180M521
18520F2252l4147K2842K0065j4925m6613L912K9117K3006j1782n911m1297K4957
$$ plain form
18604 149109 170094 234298 378209 427794 366843 324400 333473 335782 328456 336737 345286 400778
18592 400778 360993 238423 158721 136787 112951 101524 118630 110268 154617 161050 164704 147135
18580 147135 102142 87775 118640 137134 113583 77013 68671 71941 17298 361 16337 33306
18568 33306 87627 114003 81906 60668 53133 67251 48298 37498 31441 73489 106731 135861
18556 135861 140256 129342 150124 138666 61526 14126 6762 7428 -12067 -1927 24150 -12888
18544 -12888 -6644 33636 -1076 -52594 -38597 10012 58198 46993 45176 34579 44559 50963
18532 50963 56126 72305 89087 69436 31852 20593 14317 -8472 17170 12551 57731 62252
18520 62252 28105 50947 71012 56087 9474 13386 42503 65509 53727 47816 6519 31476
18508C1476M8317l491k2029M4390k5024L0832j9764J156j11k6830n2932j2419
18496f429M2690r671M2091K1603j9923K685K596Q840j2515l2073l4099K9665O3526
18483I8986P776j3112k9134M967M906j4849L2245l9446l6398J20531J4167k4450
18471A26189j3256R422J2086N721l5578l0374Q972K1646j0736l339L9863R39K5143
18458A56698o134m5296l6473M6702L7774l757o327L4106j3825k5019l4830R982
18446A13601N884k8348M768J10059J3754J0840M8775k2347p1753k0092P1296N8327
18434B94764j7425j1483m2527j8630j7292K1336M9188J6149l7820o3190k757m540
18422A65773m7138L634O1513j6285L7254O0972N901l2105J3712o744K520N177
$$ plain form
18508 31476 79793 76302 54273 98663 73639 104471 84707 85863 85752 58922 5990 -6429
18496 -6429 36261 26590 68681 90284 70361 73046 75642 84482 71967 39894 5795 35460 98986
18483 98986 106762 93650 64516 69483 74389 59540 91785 52339 15941 136472 150639 126189
18471 126189 112933 122355 134441 140162 104584 74210 83182 104828 94092 90753 130616 131555 156698
18458 156698 150564 105268 68795 115497 153271 149514 143187 177293 163468 138449 103619 113601
18446 113601 119485 91137 95905 205964 219718 230558 279333 256986 185233 165141 236437 294764
18434 294764 277339 265856 223329 204699 187407 208743 257931 274080 236260 173070 170313 165773
18422 165773 118635 122269 183782 167497 204751 265723 271624 239519 253231 246487 249007 254184
18410B54184k024K6203k9126k9258L2727M0633N2919N2407j5894q4493n0864K3142
18398B70556L6208Q3362J00771R2839O024j02019q0647n7458l4572k2884l1882
18387B60298K6716q196k6033k9109k7518K3305M0954K6204m4580l0902l4037n837
18375A71265N284N054k287k8515K4467k5322k14m0807k1910L6550N301J3279M2169
18362A84314J3884J0900r911l761l884K7642l421q991l8191p6994J1096N7003
18350A59686K9753K9357J693K254J9029Q9324K4756Q208J337k7895k9721r034
18338B98747n2884o6549p4209N7051M4634L9327M739m1344p2604K7268Q9R279
18326A73544M8796p864J4305K6658P9496R2162j1673p5728m4830l7802K8489L5080
$$ plain form
18410 254184 252160 278363 249237 219979 252706 293339 346258 398665 382771 298278 247414 270556
18398 270556 306764 390126 490897 583736 589760 487741 407094 349636 315064 292180 260298
18387 260298 287014 278818 252785 223676 196158 219463 260417 286621 242041 211139 177102 171265
18375 171265 176549 181603 179316 150801 175268 149946 149732 108925 87015 123565 128866 142145 184314
18362 184314 198198 209098 199187 195426 191542 219184 215763 206772 168581 91587 102683 159686
18350 159686 189439 218796 220489 222743 241772 331096 355852 364060 365397 337502 307781 298747
18338 298747 245863 179314 105105 162156 206790 246117 250856 209512 136908 164176 164265 173544
18326 173544 222340 214476 228781 255439 334935 427097 415424 339696 294866 257064 285553 320633
18314C20633J5458L8323p487m5738j8341j0686L9344N159J1515K8305k9007p417
18302C40061k8690k3782J1121j7809N931O5588r659k7377J7102M3159N9864R8948
18290E34457N9400N9628K0363k1941R2982Q9988L1823j0446M7526P7582r5095
18279H86267j96515j48844l5129K6257j0023k8569k1107J2671j0411J7007N4628
18268E46232J3632J8757K0700P598l4264m1498p372o378j9777L5245K6988M3437
18256F03300J15404J61260N1816Q216l3907m0820M0822J1344L7398K6821j9920
18245I61734j1958L8697N1400R6031J27262J74287J22166J06881J70255K47318
18235B084073L41511L23070K63364L24446L54165M48180N91916Q04849J075825
$$ plain form
18314 320633 336091 374414 366927 321189 302848 292162 331506 336665 348180 376485 347478 340061
18302 340061 311371 287589 298710 280901 286832 352420 342761 315384 332486 375645 435509 534457
18290 534457 593857 653485 673848 651907 744889 834877 866700 856254 903780 981362 886267
18279 886267 689752 540908 505779 532036 522013 493444 472337 485008 474597 491604 546232
18268 546232 559864 578621 599321 606919 572655 531157 523785 517407 497630 532875 559863 603300
18256 603300 718704 879964 931780 939996 906089 865269 906091 917435 954833 981654 961734
18245 961734 949776 988473 1039873 1135904 1263166 1437453 1559619 1666500 1836755 2084073
18235 2084073 2425584 2748654 3012018 3336464 3690629 4138809 4730725 5535574 6611399
18226F611399J610613K501360L972964N590326N833551K433369l377058m846455
18218B0330069j987043J101315L936474N708669M220399j963122p432665o209779
18210A7704317l392272j696494q13327l77931O6669M59399R02371J658305K917146
18201A7428183M810018O378154N316432o0694n616974m825328j223764K011716
18193B4217743M857082N670939K000875n557069q667402o122361l473890k046235
18185A0879682j358204r27828o74098n87286n52514n21206m26455l03868k41863
18176E286360k88997m20572m42376m22823l39384k56187k35506k28242k45941
18167B406332k33797j29595m8561j39183j15135r0198l8887J0162j2159m6890
$$ plain form
18226 6611399 8222012 10723372 14696336 20286662 26120213 28553582 25176524 20330069
18218 20330069 18343026 19444341 23380815 29089484 33309883 31346761 23914096 17704317
18210 17704317 14312045 12615551 11802224 11424293 11490962 11950361 12852732 14511037 17428183
18201 17428183 22238201 28616355 33932787 33872093 28255119 23429791 22206027 24217743
18193 24217743 29074825 34745764 36746639 31189570 22522168 16399807 12925917 10879682
18185 10879682 9521478 8593650 7919552 7332266 6779752 6258546 5832091 5528223 5286360
18176 5286360 4997363 4576791 4134415 3711592 3372208 3116021 2880515 2652273 2406332
18167 2406332 2172535 2042940 1994379 1855196 1740061 1649863 1610976 1621138 1608979 1562089
18157A562089k7975o0919o5887J8200j5562K1591N8287J1840M46J4529J4036K4290
18145A554965J01448J81930J40334J32721K32317K83412L65394L68964M16269
18136C777754N04434O29561Q44491J208604J786856K755258M372414O291876O567031
18127B8738279K745504m237718n495147k218682P70126L370278N037550L838230
18119C2548420j655010o051071m093142j394807M37912J904816L795511O583063
18111C2075692J1558263J8887419K1237052R411421k0044249k5453955j3515165
18104C4156478o847422l787036k073943p51603M69222J848564L924117O519865
18096C3458242P732284M380072m295882q265274m897024j169084J852432M087022
$$ plain form
18157 1562089 1534114 1473195 1407308 1425508 1409946 1431537 1489824 1501664 1502110 1516639 1530675 1554965
18145 1554965 1656413 1838343 1978677 2111398 2343715 2627127 2992521 3361485 3777754
18136 3777754 4282188 4911749 5756240 6964844 8751700 11506958 15879372 22171248 28738279
18127 28738279 31483783 27246065 21750918 19532236 20302362 23672640 28710190 32548420
18119 32548420 30893410 24842339 20749197 19354390 19792302 21697118 25492629 32075692
18111 32075692 43633955 62521374 83758426 93169847 73125598 47671643 34156478
18104 34156478 27309056 23522020 21448077 20696474 21165696 23014260 26938377 33458242
18096 33458242 41190526 45570598 41274716 33009442 28112418 26943334 28795766 32882788
18088C2882788L586991j770659q086385p271891m284877k432287j574097j114193
18080I935390q71689p81885p46278n88488n61897m95751l94861k87963l66454
18071D840124l75274m44357m41113m12381l31619k45940k61458k79722j88576
18062A859684j98467j57515r5749o1674j03773j53442j11498j30179j05836j7156
18052G24395j5970o9292m5736k2223J833r785j9334m8016j8950n6575j7316l9415
18040C63616m1440m9361j5016k1325j1074L7294L2789M4429l4215q9538j0081
18029B06078K7007M85N2746J8172n4586o6811m6776K521j0956K3715P9425K3268
18017B54288m0009p2991k6343j1182M889P469L9539M3164n9425j2026j9435L4752
$$ plain form
18088 32882788 36469779 34699120 26612735 19340844 15055967 12623680 11049583 9935390
18080 9935390 9063701 8281816 7535538 6947050 6385153 5889402 5494541 5206578 4840124
18071 4840124 4464850 4020493 3579380 3166999 2835380 2589440 2327982 2048260 1859684
18062 1859684 1661217 1503702 1407953 1346279 1242506 1089064 977566 847387 741551 724395
18052 724395 708425 639133 593397 571174 573007 563222 543888 495872 476922 420347 403031 363616
18040 363616 322176 272815 257799 236474 225400 262694 295483 339912 305697 216159 206078
18029 206078 233085 233570 286316 304488 249902 183091 136315 138836 127880 151595 231020 254288
18017 254288 214279 141288 114945 103763 108652 116121 155660 198824 139399 127373 107938 142690
18005A42690K0953m1354l9208l1598J7533J8233j5557k68J0103J002j6501N705
17993G1733M3439K4306k851L950J6134q6302o5414N75j0588L4274P1663M1748
17981A42667L2403j3228n0678O089k2412J5564Q188j736p527j0877j7283L389
17969H4559Q4344k4661k906O904Q594M8831j0139O597q281r421j059Q058l0304
17956A61116k189K1016J516O44N6651J1960m4260n0516L5869k6273k8395k8423
17944A08716j1656J8632J681O534k7977J1493J7592J0846M4866k1914m0851J5496
17932A33458M0946L5522n5977j6401L1788K0481k947j6929n5946n2648k3044L3200
17920G1503k2365M8015N1234M6169k9252Q198m1807j2458J2150K5034J0130K8246
$$ plain form
18005 142690 163643 122289 83081 51483 69016 87249 71692 71424 81527 82529 66028 71733
17993 71733 115172 139478 136627 140577 156711 70409 4995 5570 -5018 29256 100919 142667
17981 142667 175070 161842 111164 117253 94841 110405 118593 116857 109330 98453 81170 84559
17969 84559 168903 144242 141336 148240 156834 205665 195526 202123 193842 184421 183362 191420 161116
17956 161116 158927 179943 181459 182103 238754 250714 206454 155938 191807 165534 137139 108716
17944 108716 97060 115692 117373 123907 95930 107423 125015 135861 180727 158813 117962 133458
17932 133458 174404 209926 153949 137548 169336 189817 186870 169941 113995 61347 38303 71503
17920 71503 49138 97153 148387 194556 165304 173502 131695 119237 131387 156421 166551 194797
17908A94797M9222j9711k435n7171m2345k2404L4912R5996j0846m2116k0581M5217
17896B02535l1180l3609J0643P590n4199m0847M9093M463k2060J790M1011J2278
17884A47508l100o305m5382j2185k0313M6665j9173K3011J0166K3523J1860l006
17872A53269k2459Q827n862R451O3207m8313j5820L6140k8344J6148N2113L9317
17860B57674j0643j6180L9494l9302l970J4792k1493k700J6850P6865N2602j5486
17848C48503K2827M2164P4146L4507P311O0341n638m9398k5694L311L4816K3864
17836E71060M5520J00104N6984Q5253J51401J14400J04094J62854R1610P1006
17826A554286J82739K27241K43524K65731L93257M89018N56511P04994R26184
$$ plain form
17908 194797 244019 224308 221873 164702 122357 99953 134865 230861 220015 177899 157318 202535
17896 202535 171355 137746 148389 155979 101780 60933 110026 114489 92429 94219 135230 147508
17884 147508 144408 138103 92721 80536 60223 106888 87715 110726 120892 144415 156275 153269
17872 153269 130810 139637 133775 143226 206433 158120 142300 178440 150096 166244 218357 257674
17860 257674 247031 230851 270345 231043 227073 241865 220372 217672 234522 311387 363989 348503
17848 348503 371330 413494 487640 522147 529458 589799 584161 534763 509069 512380 547196 571060
17836 571060 616580 716684 773668 858921 1010322 1124722 1228816 1391670 1483280 1554286
17826 1554286 1737025 1964266 2207790 2473521 2866778 3355796 3912307 4617301 5543485
17817E543485J405578K294723L724307N950382P941960O386861j315766r229976
17809B2701554p303114l993267k266545j337321q57180n41721k76662j11598M4166
17800F058312K25032L24112M24049N79188O66612Q66831J309238K232751L833782
17791A6519907O004812O933869L856060m280779p911503m748092j958648j42571
17783A4273055J570764L626432N556209N195303K93065o966994o738720l797483
17775A3011631k095063j368262j000404p58911n66487m12107k83477j86160K1758
17766F362518J44623J92861L15067M90132Q38506J545434K654068M439683N647508
17757B2630400L835013k532926p356240n178513k840983j627732j040795o98337
$$ plain form
17817 5543485 6949063 9243786 12968093 18918475 26860435 33247296 31931530 22701554
17809 22701554 15398440 11405173 9138628 7801307 6944127 6402406 6125744 6014146 6058312
17800 6058312 6283344 6607456 7031505 7610693 8277305 9144136 10453374 12686125 16519907
17791 16519907 22524719 29458588 33314648 29033869 21122366 16374274 14415626 14273055
17783 14273055 15843819 19470251 25026460 30221763 30514828 23547834 16809114 13011631
17775 13011631 10916568 9548306 8547902 7788991 7222504 6810397 6526920 6340760 6362518
17766 6362518 6507141 6700002 7015069 7505201 8343707 9889141 12543209 16982892 22630400
17757 22630400 26465413 23932487 16576247 11397734 8556751 6929019 5888224 5189887
17749E189887m57407l44805k54585j90364j25340n7000O8126l3217j39781j29672
17739C525842o7162m6040J21104J31783P3579Q7625J11562K09655L17553M56998
17729D922499N81234P16002P99391P62753Q30534J118942J550950K108000L091801
17720A6482106M498507P032881J1290843J8114937K5189481K3550299L626240
17713A09785294k5339228k8728309j7385017r798692n851798l807941k551019
17706A6323290j687081j163545q04441m59545j51721K11538J05743n25903j137893
17697A0710442j376574j297643j091986q14743o38896n15731l83156m65815n09561
17688C616337l78636k21774l18753l13329k08411j43164j43391j09324j46475
$$ plain form
17749 5189887 4732480 4387675 4133090 3942726 3817386 3760386 3828512 3795295 3655514 3525842
17739 3525842 3458680 3412640 3533744 3665527 3739106 3826731 3938293 4147948 4465501 4922499
17729 4922499 5503733 6219735 7019126 7781879 8612413 9731355 11282305 13390305 16482106
17720 16482106 20980613 28013494 39304337 57419274 82608755 106159054 109785294
17713 109785294 84446066 55717757 38332740 28534048 22682250 18874309 16323290
17706 16323290 14636209 13472664 12668223 12208678 12056957 12268495 12374238 11848335 10710442
17697 10710442 9333868 8036225 6944239 6129496 5490600 4974869 4591713 4125898 3616337
17688 3616337 3237701 3015927 2697174 2383845 2175434 2032270 1888879 1779555 1633080
17679A633080j75483j73599j06321j13783j28917m4247p8367m8433p7596j11255
17669E75079L462k0500o8322k5774j3209l1143l9640L077l2227j5237J4321J154
17657C51041l9193q0324l9367j2274k1333J2877K212r323K044j1382m6888l9846
17645F8244J2687j6381K1711L2218p487k1178L4724L1437K1869N715n4596l9678
17633H9285M276n467L6084J2374j6706L2205J9263k7342n7889J2521R612J968
17621A10184j3846m1472J608k5118N1423n113k9991N6709J0727m0206j7820m6694
17609A0391l0122K148k2491L204j1369J433K6785m053j8198j3655L2990j3807
17597c6744l2658l766O5664M1845J2784L8128J8286K2531J5191L5586k1147p479
$$ plain form
17679 1633080 1457597 1283998 1177677 1063894 934977 890730 812363 763930 686334 575079
17669 575079 578541 558041 489719 463945 450736 419593 379953 383030 350803 335566 349887 351041
17657 351041 311848 231524 192157 179883 158550 171427 173639 164316 166360 154978 108090 68244
17645 68244 80931 64550 86261 118479 110992 89814 124538 155975 177844 183559 128963 89285
17633 89285 93561 88094 124178 136552 119846 152051 171314 143972 86083 98604 108216 110184
17621 110184 96338 54866 56474 31356 82779 77666 47675 104384 115111 74905 57085 10391
17609 10391 -19731 -17583 -40074 -36870 -48239 -46806 -20021 -24074 -42272 -55927 -22937 -36744
17597 -36744 -69402 -73168 -7504 34341 47125 85253 103539 126070 141261 176847 155700 148221
17585A48221K1485l9270l7703l127r158j3865L647n0781j5191m1999j0576O2245
17573A3928L0289K6693k6557K677j1758j3539q71k954l6538M0828j877m1701M3747
17560B2367L0002j0590j8788j2543m036k4190K6929L6228n5358o0974J4620O7313
17548A0980N7005J298n4039k2653K8268J7643l1224k9910M1434P8537k6948n0918
17536A9473k2817L019N8841L9758j9683o46j0789O952k171j1648k1158K4235J7299
17523H0665l7873l0945j0741O627j7015J9355O1242n6131k8474O5168J6715j873
17511F6720L2778k2890k5018k9218l7976r497j827R444N0359J870j7819k3851
17499f925J5645k8850l191K7115M8848K563j3715O079n7574K706J6389K8952l2273
$$ plain form
17585 148221 169706 130436 92733 89606 80448 66583 70230 19449 4258 -37741 -48317 13928
17573 13928 44217 70910 44353 47030 35272 21733 20862 17908 -18630 22198 20321 -21380 22367
17560 22367 52369 41779 22991 10448 6412 -17778 9151 45379 -9979 -70953 -56333 10980
17548 10980 67985 69283 15244 -7409 20859 38502 7278 -22632 18802 97339 70391 19473
17536 19473 -3344 -325 58516 98274 78591 77945 67156 74108 71937 60289 39131 63366 80665
17523 80665 42792 11847 1106 7733 -9282 10073 71315 15184 -13290 51878 68593 66720
17511 66720 99498 76608 51590 22372 -15604 -25101 -26928 -17484 32875 34745 16926 -6925
17499 -6925 8720 -20130 -23321 3794 52642 55205 41490 47569 -10005 -7299 9090 38042 5769
17486E769l2492m2398k1256j4782M3784M4797K5102j8578p295N1603J2362k2743
17474B3873l3029k1994K2923K2244J2174n883m799O982k4407k6901k4371K6374
17462b6814M9406K9125k6415K77L6400m4165n3966l2478o880M4962M101n554l2306
17449f4307J3111L3781J0396m243O8337J34205J02389L0496k3311o3352p9942
17438A57560q9937l7745l0436k0286j672L0696L9422q231o109M5186L1750J7008
17426A27206M398o6532j1610k1497n197o930q291j8814L5538l6014L3806J7933
17414D3996m9234m3129K6911L0824l2563j2162j6526p33O9587k836K2944k7620
17402I459j5956O195J2048l0906j8692M8314m9143J9280L625n882P194l914l8483
$$ plain form
17486 5769 -26723 -69121 -90377 -105159 -61375 -16578 8524 -10054 -17349 34254 46616 23873
17474 23873 -9156 -31150 -8227 14017 26191 20308 15509 22491 -1916 -28817 -53188 -26814
17462 -26814 22592 51717 25302 25579 61979 17814 -36152 -68630 -75510 -30548 -26447 -32001 -64307
17449 -64307 -51196 -17415 -7019 -11262 57075 191280 293669 324165 300854 237502 157560
17438 157560 67623 29878 -558 -20844 -22516 8180 47602 39371 33262 78448 110198 127206
17426 127206 131604 65072 53462 31965 26768 19838 11547 -7267 28271 -7743 26063 43996
17414 43996 -5238 -48367 -21456 9368 -23195 -35357 -51883 -52616 16971 14135 37079 9459
17402 9459 -6497 -302 11746 -19160 -37852 10462 -38681 -19401 -15776 -21658 -14464 -18378 -56861
17389e6861k6207M8530K9482J3931k479m217m939j2498n4264j149R821J1504R820
17376c9526N0201K8251k296m9566m617L8024j5666l8592l8772K9273K2062j1880
17364c3104q709N22J3434L0649L079k5013j7030P6676K3300k3819j1127r872j6920
17351B066L077J1103J1998j6590q086k1763m4446n5725K6336J4698L0303K3994
17339b3035Q749k5182K0516M1431j2200o2919m3504j6614M9979O5804J8420k0490
17327I55j2064k7094k097M6730r905L801o358l4998p1686l427j641K703L4986
17314h0095l4464j1352J3383M3567R4469J8484J1099k0392l389m3067m8218J1354
17302d8621o724l0922K9699j3264M6362k3045l2641k8460P653P2714M6989K1811
$$ plain form
17389 -56861 -83068 -34538 -5056 8875 6396 2179 -2760 -15258 -69522 -70671 -60850 -49346 -39526
17376 -39526 10675 38926 36630 -12936 -17553 20471 4805 -33787 -72559 -43286 -21224 -33104
17364 -33104 -41813 -41291 -27857 2792 5871 -19142 -36172 40504 63804 39985 28858 18986 2066
17351 2066 5143 16246 28244 11654 3568 -18195 -62641 -118366 -92030 -77332 -47029 -23035
17339 -23035 -14286 -39468 -18952 22479 10279 -52640 -96144 -112758 -62779 3025 21445 955
17327 955 -11109 -38203 -40300 6430 -3475 326 -6032 -41030 -112716 -116143 -117784 -115081 -80095
17314 -80095 -114559 -125911 -112528 -68961 25508 43992 55091 34699 31310 -11757 -59975 -48621
17302 -48621 -55345 -86267 -56568 -69832 -23470 -46515 -79156 -107616 -99963 -27249 19740 41551
17290D1551l2879n0185J1541K0780L244n6468j3588L2664L5469N9037k083O6517
17278A15600M1411o4512l2454J4470m4703l9204j8356J4842L601l7472j2188l67
17266e9332k795K153M3411R593j3656J1276L243M249P4358Q7868J1243J74l4902
17253A36883m0016k3093L508J5320j1687L1053N5760L3340r894P370j5327n437
17241A77780o3432n6356l4736j4201k967k2095o898K3927J6892k263Q293K3704
17229D7648m244l0857j7387J7900J3838Q4060R9742O68p4675q9539l0919J4493
17217C0728R785K5057l5788j4283n8033r050j720K2965M2303j1140L250O821L0068
17204D0963j5193m650J2502j3874l2724k9668m110j5449K1359n7035M1399M0266
$$ plain form
17290 41551 8672 -41513 -29972 -9192 -5948 -62416 -76004 -43340 -7871 51166 49083 115600
17278 115600 157011 92499 60045 74515 29812 -9392 -27748 -12906 -9305 -46777 -58965 -59332
17266 -59332 -62127 -59974 -16563 -6970 -20626 -9350 -6107 -1858 72500 160368 171611 171785 136883
17253 136883 96867 73774 77282 92602 80915 111968 167728 201068 191174 198544 183217 177780
17241 177780 114348 57992 23256 9055 6088 -16007 -22905 1022 17914 15651 23944 47648
17229 47648 43404 12547 -4840 13060 26898 110958 210700 211368 136693 47154 16235 30728
17217 30728 40513 65570 29782 15499 -42534 -51584 -53304 -30339 11964 824 4074 10895 40963
17204 40963 25770 21120 33622 19748 -12976 -42644 -46754 -62203 -40844 -97879 -56480 -16214
17192a6214O3597k3462K0595j353j5217o3077k8240N922J8053O1744K7650m6938
17180C060k2738n228J8930K1621k2396r750k5925N170Q194j0157N2137L9735l0010
17167B2643l3711j6442N6633K5607j8743J2462j8931l4911k6596Q686L1577J7560
17155B5834K0139M252L5787O068J577k5082o8838K2410L4031P5223J12685Q7123
17143C31209M1349J30129L3822j13426r8019n3627k6740j39351r0750j8684J1846
17132G758k09M1368o455R505l4756j7946P964k7778l271P217M3187j4011j921
17119A0652J6283L3788J8086k6143n857K7769J8943L571k3867k8291m2655J1335
17107A3614n0806Q369J9312n4924k0947N9402J4921L99p969P84j1587j1199L2475
$$ plain form
17192 -16214 47383 23921 44516 43163 27946 -35131 -63371 -57449 -39396 22348 49998 3060
17180 3060 -19678 -24906 -5976 15645 -6751 -16501 -42426 -37256 -29062 -39219 12918 52653 22643
17167 22643 -11068 -27510 29123 54730 35987 48449 29518 -5393 -31989 -23303 8274 25834
17155 25834 45973 50225 86012 92080 93657 68575 -263 22147 56178 131401 244086 331209
17143 331209 372558 502687 536509 423083 325064 271437 244697 105346 14596 -4088 7758
17132 7758 7549 48917 42462 51967 17211 -735 7229 -20549 -23820 -16603 26584 12573 10652
17119 10652 26935 60723 78809 52666 46809 74578 93521 97092 73225 44934 2279 13614
17107 13614 -37192 -28823 -9511 -64435 -85382 -25980 -11059 -10660 -18629 -17845 -29432 -40631 -8156
17094h156L8048K1477K9544L490m4353n2286j380o3140P524N4973L0748l5641
17082a9152q545L7283m3863o934J1167q964l8251J2052K7682k224k8297O658K9977
17069c1411O2044j0845o0679n6605K3266M9014K196k7331k9295l3501L641O5306
17057d4200J093j2847r625O2028K3921k7132k5654q0176n3430j9546N4307R7263
17045c3998O8308m698n1021k5368m1210l9719N2543Q8850J7468n9632j9557J8825
17033b9209j2168K3310P020m1424k3322K3618N823l5393j5072k3008j8294M7554
17021i0565o752k9571K0104J0573P560K0572K6499K8240l434o4398j6543P325
17009i0390k408R746j6943l354K2440m25J8373m725j8649L3321j0049n6311K8611
$$ plain form
17094 -8156 29892 51369 80913 84403 40050 -12236 -13616 -76756 -69232 -14259 16489 -19152
17082 -19152 -27697 9586 -34277 -41211 -30044 -39008 -77259 -65207 -37525 -39749 -68046 -61388 -31411
17069 -31411 30633 19788 -40891 -97496 -74230 -25216 -23020 -50351 -79646 -113147 -109506 -44200
17057 -44200 -43107 -55954 -65579 -3551 20370 -6762 -32416 -112592 -166022 -185568 -131261 -33998
17045 -33998 34310 29612 -21409 -46777 -87987 -127706 -75163 13687 31155 -28477 -48034 -29209
17033 -29209 -41377 -18067 -11047 -52471 -75793 -52175 -46352 -81745 -96817 -119825 -138119 -90565
17021 -90565 -97317 -126888 -106784 -96211 -88651 -68079 -41580 -13340 -16774 -81172 -97715 -90390
17009 -90390 -92798 -83052 -99995 -103349 -80909 -81334 -62961 -67686 -86335 -53014 -63063 -119374 -90763
16996i0763K1119j2368J5334O3639L4055n5476m4203J0458J5110k3085k0683J3823
16984g3040L5677O125L9009N6432l75k8265k9414M9003J5460m8586l8396J362
16972a5008j7520P497J1184J3039L7847L373m6779l0147L0258N163J514l0042
16960b9621j9425n774L1215K9645p321q913l5218J4722J1117M028k9353K5683
16948a9215n532O797j5488J0611K1978l0987l7074j7705J4718J3082J4938j3546
16936e7423J2887N3612M9991J7245l0940l2853K0587j6202l4355J4569P622L107
16924G847K071M7206m0343K3876J1667J5128K2746J9571k4640p9970r2112l5289
16912a22242N1251J6710J9250j1775l9675L0996k2632j2805K5054k9257k8447
$$ plain form
16996 -90763 -69644 -82012 -66678 -3039 31016 -24460 -68663 -58205 -43095 -66180 -86863 -73040
16984 -73040 -37363 -31238 7771 64203 63828 35563 6149 55152 70612 22026 -16370 -15008
16972 -15008 -32528 -25031 -13847 -808 37039 40412 -6367 -36514 -6256 -1093 421 -29621
16960 -29621 -49046 -54820 -23605 6040 -1281 -10194 -45412 -30690 -19573 -15545 -44898 -19215
16948 -19215 -24747 -17950 -33438 -22827 -849 -31836 -68910 -86615 -71897 -58815 -43877 -57423
16936 -57423 -44536 9076 59067 76312 45372 12519 33106 16904 -17451 -2882 4740 7847
16924 7847 9918 57124 16781 40657 52324 67452 90198 109769 85129 5159 -86953 -122242
16912 -122242 -70991 -54281 -35031 -46806 -86481 -55485 -78117 -90922 -65868 -95125 -123572
16901a23572L8893M605k3942K3346L7137L3499Q770l076r304m746l2749j803K7636
16888b5306J7840j5654K4336j4589l1741l9621L3906M4399m0867k0130j8960N0892
16876c5495L3322j6241k8091k1274J6813M2879O0721l4492l9546j3402M2525L2188
16864C9907j2481j249K3372j3281J1670l8638m4444J2165K7733K3363M9330j2226
16852F5221l4340L6729J0268j1281m1325K2075P445j0544n2706k0703R354L390
16840a6417l6432j6741K2344p288M3225L9116o714J3069j8889J478j6001J3458
16828A4208l624q5659m3857L7362L4754R977R571K8044j5015k9622L5123o110
16816a4848j8937j8117M390J9786P081l7002Q387N4608J8584n118l8666k624k3681
$$ plain form
16901 -123572 -84679 -80074 -104016 -80670 -43533 -10034 -1264 -4340 -13644 -18390 -51139 -52942 -25306
16888 -25306 -7466 -23120 1216 -13373 -45114 -84735 -50829 -6430 -47297 -67427 -86387 -35495
16876 -35495 -2173 -18414 -46505 -67779 -50966 -8087 52634 18142 -21404 -34806 7719 39907
16864 39907 27426 26177 49549 36268 47938 9300 -35144 -22979 4754 28117 77447 65221
16852 65221 30881 67610 77878 66597 25272 47347 54792 44248 -8458 -29161 -19807 -16417
16840 -16417 -52849 -69590 -47246 -54534 -11309 27807 21093 34162 15273 16751 750 14208
16828 14208 10584 -75075 -118932 -81570 -46816 -36839 -27268 776 -14239 -43861 -8738 -14848
16816 -14848 -33785 -51902 -47512 -27726 -20645 -57647 -49260 5348 23932 18814 -19852 -22476 -46157
16803d6157K4463J2452n748J875J0075k3289m7227j446K6118L2505L939k3761
16791c6201l5863j905O290J754L2518j0550M0760K003P949R676l113j6517j3952
16778a7151K4468j9498P585L6287n3269o831K2972k302l1768k4617M1387j7350
16766d0087l1341k7593Q174L8254M3076m1367k560R298M5068m2107l4526j232
16754g6943O1523M02m0556j8622R396o319M2389m255j3735J2585J6136j8216k3933
16741f0148O542l0388n709M230j086L9333K6799K8683j109k0839Q95L7493J8222
16728D2918k0291K2114n999k6313p663l524j7085j3707L6284J1943n4185m3638
16716g9146L8601N2868N636l2528j4640l1025l600k2765J3190L8591j0880N872
$$ plain form
16803 -46157 -21694 -9242 -14990 -13115 -3040 -26329 -73556 -75002 -48884 -16379 -12440 -36201
16791 -36201 -72064 -73969 -67679 -65925 -33407 -43957 -3197 -1194 6755 16431 13318 -3199 -17151
16778 -17151 7317 -12181 -4596 31691 -21578 -28409 -5437 -7739 -39507 -64124 -22737 -40087
16766 -40087 -71428 -99021 -90847 -52593 -9517 -50884 -53444 -44146 922 -41185 -75711 -76943
16754 -76943 -15420 -15018 -55574 -74196 -64800 -71119 -28730 -32985 -46720 -34135 -17999 -36215 -60148
16741 -60148 -53606 -83994 -89703 -85473 -86559 -47226 -20427 8256 7147 -13692 -12797 24696 42918
16728 42918 22627 44741 38742 12429 4766 1242 -15843 -29550 6734 18677 -35508 -79146
16716 -79146 -40545 12323 17959 -14569 -29209 -60234 -63834 -86599 -73409 -34818 -45698 -39826
16704c9826J0554k274J6838P120k4948n5587N5034K7717j1425L1476N5720L6783
16692A07182j2353m9426l5306k3321k0565J1607r893j1194K5374J3936l8973o7466
16680a10398J7208O5942j3321p22o740k6144q521K3839j9356K0050M0088K9565
16668A1490l4488J6019N3311J2921o3074n6092J832j7995J4846J1465L327K8047
16656a8391j9827l3548J2467M9406K5917L7842p736l7431k1299q369P831M816
16644h322k3653J0788K8081L0065j5820l8566l0246K5154O5488J6084l0337J0331
16632C9047J848K175o0327K3374O1920k0352r2869n6390M2156Q2471l1624l3062
16620d1633m396K0270j0758K5841J5357J3453P911k6427j0015m5653M1217N7878
$$ plain form
16704 -39826 -29272 -31546 -14708 -7588 -32536 -88123 -33089 -5372 -16797 14679 70399 107182
16692 107182 94829 45403 10097 -13224 -33789 -22182 -32075 -43269 -17895 -3959 -42932 -110398
16680 -110398 -93190 -27248 -40569 -41291 -48031 -74175 -82696 -58857 -78213 -58163 -18075 11490
16668 11490 -22998 -6979 46332 59253 -3821 -59913 -58081 -76076 -61230 -49765 -46438 -18391
16656 -18391 -38218 -71766 -59299 -9893 16024 53866 46130 8699 -12600 -20969 -13138 -8322
16644 -8322 -31975 -21187 6894 36959 21139 -17427 -47673 -22519 42969 59053 28716 39047
16632 39047 40895 43070 -17257 6117 68037 47685 -45184 -101574 -59418 23053 -8571 -41633
16620 -41633 -46029 -25759 -36517 -10676 4681 18134 26045 -382 -10397 -56050 -14833 43045
16608D3045k3682O121n8476l8165K8353j5823m0099j2940L2087L2185J876j3965
16596e9483k4264Q035M3855q264l3772J2616K7193K5490M3787L357m2400K6129
16584B2279J7640J9806K1571j2016n9496R81J9124L5216j2374p3930k7823L4678
16572a4344l5257j1431l0485j1025L6586M0833K6465J264m74O4105L22o4374q360
16559f175K5672n3167k3155k7308j075l0513K7887M9553n460K2103M6853k792
16547B2423k9311J7107r37j4914J2317o3606j2863L1190P2498J4472q528P947
16535D7795k1129J0652R608k6093o7628O767k585K6272j949n8930j9980M8917
16523d8283N1733n661m3538o5387l34j3088J5162K8002L8414J4090L240K6565
$$ plain form
16608 43045 19363 25484 -32992 -71157 -42804 -58627 -98726 -111666 -79579 -47394 -45518 -59483
16596 -59483 -83747 -75712 -31857 -40121 -73893 -61277 -34084 -8594 35193 38550 -3850 22279
16584 22279 39919 59725 81296 69280 9784 10765 29889 65105 52731 -21199 -49022 -14344
16572 -14344 -49601 -61032 -91517 -102542 -65956 -25123 1342 2606 2132 66237 66559 2185 -6175
16559 -6175 19497 -33670 -56825 -84133 -85208 -115721 -87834 -38281 -43741 -21638 25215 22423
16547 22423 -6888 10219 9282 -5632 6685 -56921 -69784 -38594 33904 48376 39848 47795
16535 47795 26666 37318 46926 20833 -46795 -40028 -42613 -16341 -18290 -77220 -97200 -48283
16523 -48283 3450 -2211 -45749 -111136 -111470 -124558 -109396 -81394 -42980 -28890 -25650 915
16511I15k0841p0952j3164j2923P928L6367O2935N613m3529k8318J6328N269k7375
16498h1747l1265J6179N1271J6685q307K2841K4201j8792j3482o269J6336L4630
16486B2281K9829n346j249k3412o9592K147R259r429j0103j0990K5211k4924n5607
16473a21925L4336N4194K8396m449J7977J7685J4129O2146O34k0604K0342k4401
16461G8460m2484m3069k7380k6671j6797K2027N1624P959q566k2855q201k2156
16449e8109n8592O3137L2379k1292m9204M1100P9018L5485k7347l2675J6881J9394
16437D0175L2846J0343l9782m8329Q818K1759m9926K3678Q430m9823n4185J6609
16425g9387O3016J5807m0430o4312o573K6013P2892M0793j4183m0568l0448L7101
$$ plain form
16511 915 -19926 -90878 -104042 -116965 -109037 -72670 -9735 -4122 -47651 -75969 -59641 -54372 -81747
16498 -81747 -113012 -96833 -45562 -28877 -37184 -14343 9858 -8934 -22416 -28685 -12349 22281
16486 22281 52110 46764 45515 22103 -47489 -45342 -36083 -45512 -55615 -66605 -41394 -66318 -121925
16473 -121925 -87589 -33395 -4999 -9448 8529 26214 40343 102489 103123 82519 102861 78460
16461 78460 35976 -7093 -34473 -61144 -77941 -55914 -4290 3669 -4897 -27752 -35953 -58109
16449 -58109 -116701 -53564 -21185 -42477 -91681 -50581 28437 63922 36575 3900 20781 40175
16437 40175 73021 83364 43582 -4747 4071 25830 -24096 -418 8012 -41811 -95996 -79387
16425 -79387 -16371 -564 -40994 -105306 -111879 -85866 -12974 27819 13636 -26932 -57380 -20279
16413b0279J3147k4790k533j2180L5296L0063r29k3719j8576L5278j6881o2227
16401f8330k915k868k0277o611O8377Q0683j989l8458P19J2315l224j4573n75
16388B274p0655N4473L3118J327j9622m4388N700M1562l6696j3248q571k13J2788
16375d2151M6736L6231k8301m9857J978O551K2056k6467m5853K4616N4837L0069
16363C0445J6342l5703n2308J0302J3571j9750J44p395K1398j9431K7960K7191
16351A2766l3121Q867M8015R0883l3463l0076n2829k3696L7532J7285q188K0525
16339E4500J5127k1498N900L0994R872K926p187k3225j8229J6619k8538l5535
16327A726m1271k5482k0396J375l037M8205l7708k5135M1293K3854M4724j3101
$$ plain form
16413 -20279 -7132 -31922 -34455 -46635 -11339 18724 17795 -5924 -24500 10778 -6103 -68330
16401 -68330 -71245 -74113 -94390 -101001 -32624 48059 46070 7612 8331 20646 17422 2849 2274
16388 2274 -68381 -13908 19210 20537 915 -43473 -37773 3789 -32907 -46155 -54726 -54939 -42151
16375 -42151 4585 40816 12515 -37342 -35364 -28813 -6757 -33224 -79077 -54461 376 30445
16363 30445 46787 11084 -41224 -30922 -17351 -37101 -36957 -44352 -22954 -42385 -14425 12766
16351 12766 -20355 -11488 36527 127410 93947 63871 11042 -12654 24878 42163 33975 54500
16339 54500 69627 48129 54029 85023 94895 97821 90634 67409 49180 65799 37261 1726
16327 1726 -39545 -65027 -85423 -84048 -87085 -38880 -76588 -101723 -60430 -36576 8148 -4953
16315d953m7291k0012M7440M4851L4989q257m7055m8151l8844Q951O0873M0729
16303B3270J6083l5628n0218J3142L1659J362j3699k4587L7194N687n486q178
16291i399J9661j9619O171l2192j3681j0297K8299J3289K6085j1813J7486K2929
16279C6919Q983m744m4541J9795M3356j4438m0875K298L8481L820j7837j8895
16267A2322k9496J0316n5560k2034j8035j3K1126M2383M0630M6359j5894k6352
16255E752J5823l8074j651j3420J1183J0918K5662J7286k474j0783k6867L1846
16243B5201k2758k443l0395n3219L36J4892J5475n486M832L7576J1719J3655m405
16230D980n880J5121J0938j4124j2825N4756p861j5107j8311l9247k582J4487
$$ plain form
16315 -4953 -52244 -72256 -24816 20035 55024 46767 -288 -48439 -87283 -78332 -17459 23270
16303 23270 39353 3725 -46493 -33351 -1692 -330 -14029 -38616 -1422 4265 -1221 -9399
16291 -9399 10262 -9357 -3186 -35378 -49059 -59356 -31057 -17768 8317 -3496 13990 36919
16279 36919 45902 41158 -3383 16412 59768 45330 4455 6753 45234 49054 31217 12322
16267 12322 -17174 -6858 -62418 -84452 -102487 -102500 -81374 -38991 1639 47998 32104 5752
16255 5752 21575 -16499 -18150 -31570 -20387 -9469 16193 33479 31005 20222 -6645 25201
16243 25201 2443 0 -30395 -83614 -83278 -68386 -52911 -58397 -53565 -15989 -4270 9385 4980
16230 4980 -900 14221 25159 11035 -1790 52966 45105 29998 11687 -27560 -30142 -15655
16218a5655j9002K9820L1411J7375j0819o285k9155k5829j1087J602p948k4244
16206f9816N9465M8591m6075k4053l5615J6686J1638M2124J1201r068j4589N976
16194c535J3004N422k157l934l1482r5106P544K7692M9930M4630K719k8842r74
16181a5089M2537n559K0915M3469K572n1780l3203o893K0432k4256l2301K4289
16169a4867L0481j5494k7992k3525K8901O790J7837L8679N414j5216l1577J9620
16157A9051j404J6907m6049P153K0258m6113n3043L0812L8160J1421l162m4064
16145e0073p3470M9147J2414O184M120L9586N1879k4705n0162j454k897l3455
16133g2886k9276L8143K6857R440M2248K3045K053o2490M1359K1976m94l3126
$$ plain form
16218 -15655 -34657 -4837 26574 43949 33130 26845 -2310 -28139 -39226 -37624 -45572 -69816
16206 -69816 -10351 38240 -7835 -31888 -67503 -50817 -39179 2945 14146 5078 -9511 -3535
16194 -3535 9469 14891 12734 8800 -22682 -117788 -110244 -82552 -32622 12008 14727 -14115 -15089
16181 -15089 27448 21889 42804 86273 88845 37065 3862 -3031 17401 -6855 -39156 -14867
16169 -14867 15614 120 -27872 -51397 -22496 -15706 2131 40810 46224 31008 -569 19051
16157 19051 17647 34554 -11495 -4342 15916 -30197 -83240 -52428 -14268 -2847 -6009 -50073
16145 -50073 -123543 -74396 -61982 -55798 -51678 -12092 39787 15082 -35080 -36534 -39431 -72886
16133 -72886 -102162 -64019 -37162 -27722 14526 37571 39624 -22866 18493 40469 39975 6849
16121F849k6935k2999P1319N4642l570k8474m7098m1660J6553l4575n7232N5958
16109e7222L4953O1302L8264K2792n9716l7860J496Q686k9701j7033n364K4692
16097a4711M1094N575L4279K6986o314k7169k1382l2026k5941N2440K6054j3612
16085D5273p0280n5633J8408P1105L9804j0920l5169n539O986J2281l2756j7789
16073c4229j6799o711k6547k3239l2343L4423K6672m2606L6818L9407J8215N671
16061b1268j34L6076j8158p060N8409j521j8484K0043M7198j8250q1441m4345
16049d8935J803K1605K5658N3107k4948m8029j1812j7669K7860P999k0391k9138
16037f2890K5036J1277q510J3068M0789K6802k5916o9047k2047k384K4739N389
$$ plain form
16121 6849 -20086 -43085 28234 82876 79306 50832 3734 -37926 -21373 -55948 -113180 -57222
16109 -57222 -22269 39033 77297 100089 40373 2513 4009 12695 -17006 -34039 -39403 -14711
16097 -14711 26383 31958 66237 93223 86909 59740 38358 6332 -19609 32831 58885 45273
16085 45273 -25007 -80640 -62232 8873 48677 37757 2588 -2951 4035 16316 -16440 -34229
16073 -34229 -51028 -57739 -84286 -107525 -139868 -105445 -78773 -121379 -84561 -45154 -26939 -21268
16061 -21268 -21402 14674 -3484 -10544 47865 46344 27860 47903 95101 76851 -4590 -48935
16049 -48935 -47132 -25527 131 53238 28290 -19739 -31551 -49220 -21360 -13361 -33752 -62890
16037 -62890 -37854 -26577 -35087 -22019 18770 45572 19656 -49391 -71438 -73822 -49083 -43694
16025d3694q821l2840M4811M6907M671k860N90L2181p0679o2562m1794l839J7814
16012a20115l0259O4292N1591l715L7699L5313k5481j9475R068J3591J3570P154
16000C3233L041r322n7869o7N5058J3006O230l7368r150j8987j0099L706j385
15987b9973K0784k5090M5336N9564q104k8018l1964L4667k5271r172J5921N7573
15975G6253j1734n5651k6070L980J4326j0656J8765L5991k0446J48j2892k1857
15963i843m7559R306J5753M1940p017k987k7349k5536L1232M810J1544L7038J7260
15950D8592j5589k775P80m5445j7799L9297K2889l574j9717J457K5093L3561L2851
15937I9621k3957R601m3592j6419J045m4676p617J0621k8633K4399M3926j9132
$$ plain form
16025 -43694 -52515 -85355 -40544 6363 11034 8174 8764 40945 -29734 -92296 -134090 -137929 -120115
16012 -120115 -150374 -86082 -34491 -38206 -507 34806 9325 -10150 -1082 12509 26079 33233
16000 33233 36274 26952 -30917 -30984 24074 37080 43310 5942 -3208 -22195 -32294 -28588 -29973
15987 -29973 -9189 -34279 11057 70621 62517 34499 2535 37202 11931 2759 18680 76253
15975 76253 64519 8868 -17202 -13222 1104 -9552 9213 45204 24758 24906 12014 -9843
15963 -9843 -57402 -48096 -32343 9597 2580 -407 -27756 -53292 -22060 -17250 -5706 31332 48592
15950 48592 33003 30228 31008 -14437 -32236 7061 29950 26376 6659 8116 33209 66770 99621
15937 99621 75664 85265 41673 25254 26299 -18377 -25994 -15373 -44006 -19607 24319 5187
15925E187l2251O571J3327l6615n8331L1431O5110l664j6893K4048l0995j5136
15913d8211L0400r695l1493L0412J886j8707L3483L1979M434N377K0383k8963
15901B1285p2909j9739k0392K71K5704N7291J0946q908K1561j3902P987k387q060
15888a252j7810j1640Q606j0072n8342o454L1321J0055m1441L1763K0845J0509
15876c3912M6489k518j4237K8551j00m6356N809M654L2846k1397l4066l838n229
15863d3304K6751K3756k4226M5265L6874K2702k1663M240j156l8204j5354j8822
15851c141L4005M2697J2907n781J1134J8885m8849j6183N207o4k5416l2811R995
15838B585k8138J5954M1308j5512L3401K448J9875j2333j2458K6122m5152l7899
$$ plain form
15925 5187 -27064 -20493 -7166 -43781 -102112 -70681 -5571 -9235 -26128 -2080 -33075 -48211
15913 -48211 -17811 -27506 -58999 -28587 -26701 -45408 -11925 20054 24488 29865 50248 21285
15901 21285 -51624 -71363 -91755 -91484 -65780 -8489 2457 -6451 15110 1208 9195 6808 -1252
15888 -1252 -19062 -30702 -22096 -32168 -90510 -96964 -65643 -55588 -97029 -65266 -44421 -33912
15876 -33912 12577 10059 -4178 24373 24273 -22083 -16274 -11620 21226 -171 -34237 -38075 -43304
15863 -43304 -16553 7203 -17023 28242 65116 87818 66155 70395 69239 31035 15681 -3141
15851 -3141 30864 73561 86468 80687 91821 110706 61857 45674 50881 50817 25401 -7410 2585
15838 2585 -25553 -9599 31709 16197 49598 52046 71921 59588 47130 73252 28100 -9799
15826i799j2136k2829L8615l5567J7981k730O852L1625n478j7017J053K8118L0464
15813D9152L5782n7865n5511K5375N4804k5853l3082j7796p352K2881J3294K6784
15801C0613L0720N3303k0725q95K0251j4406q1634n0562J7192l1541K4634J9319
15789c731J5635k233M3282J6039k2916l5725j8858M6645r390l6913j0773J0249
15777h689L2491j3085K3858j2586L6223m4574k3314J821K1766j8633L2676M1352
15765F9306k4924o7445o23j0188K3171M8714J5841l4098K1653J9562o813k1114
15753C3042q400j2864L1599K1846j2976o075J5492k3459j4384j0153n0082M389
15741c2025J8405k8867P956O057n9967N9802Q3482k6254m056r105L1681J7147
$$ plain form
15826 -9799 -21935 -44764 -6149 -41716 -23735 -26465 -19613 12012 6534 -10483 -9430 18688 49152
15813 49152 84934 27069 -28442 -3067 51737 25884 -7198 -24994 -32346 -9465 3829 30613
15801 30613 61333 114636 93911 93016 113267 98861 17227 -33335 -16143 -47684 -23050 -3731
15789 -3731 11904 9671 52953 68992 46076 10351 -8507 38138 28748 -8165 -18938 -8689
15777 -8689 23802 10717 34575 21989 58212 13638 -9676 -7855 13911 -4722 27954 69306
15765 69306 44382 -23063 -23686 -33874 -10703 38011 53852 19754 41407 60969 54156 33042
15753 33042 24642 11778 43377 65223 52247 46172 61664 38205 23821 13668 -36414 -32025
15741 -32025 -13620 -42487 -34531 -28474 -88441 -28639 54843 28589 24533 15428 47109 64256
15729F4256l6121k2271l1810q328M1415P0960K737k2719k8428k6431K960q697
15717b477k8227J2399l1511j7856P0169R8452K3168m7888o9470m1923r984J2358
15705c2790L2103r452k7391J013m6765o1178L5144J1180j7777j8234M0753O9247
15693b4147q457J5426L9054J4940l9986J773l5224m4534j6330N0878M2414j3628
15681a7821l3583M2614J1934J7448M3295L2215J3985n3525l5249N9085n346J277
15669G6329m1675p0728l975L4323j570j2291O333n512k899o1n0191K2859p967
15656e7025K4913J2010q453P067L2652j29J0818l143k2030m2793j6696M2610K066
15643a8133q973J9774j6031o89K2131K4334k0699n791M338k4325m0612q570L7274
$$ plain form
15729 64256 28135 5864 -25946 -34274 7141 78101 80838 58119 29691 3260 6220 -2477
15717 -2477 -30704 -18305 -49816 -67672 2497 100949 124117 76229 6759 -35164 -45148 -32790
15705 -32790 -687 -10139 -37530 -36517 -83282 -144460 -109316 -98136 -115913 -134147 -93394 -24147
15693 -24147 -32604 -17178 21876 36816 -3170 -1397 -36621 -81155 -97485 -46607 -4193 -17821
15681 -17821 -51404 -8790 3144 20592 63887 96102 110087 56562 21313 80398 75052 76329
15669 76329 34654 -36074 -40049 -5726 -7296 -19587 -13254 -18766 -21665 -21726 -71917 -49058 -57025
15656 -57025 -32112 -20102 -28555 -21488 11164 11035 21853 18710 -3320 -46113 -62809 -20199 -18133
15643 -18133 -27106 -7332 -23363 -24052 -1921 22413 1714 -4077 261 -24064 -64676 -73246 -35972
15630c5972J821Q021K1391j214k6461N2436J6467k5691P421j5961k469p545K0189
15617A2433l2296j1466k8399M715l476l1040L8175K7429J1175q554m937J9679
15605f562L0278p708L5646r966k5837M3030N1974j8615j444k1795k8400R347J5331
15592F5279k7452o1292o8784K1101o383M1396L2147N4447o008k2856K754N532
15580B9881k3906L4532K1630p332n0817r658L120K4479L966m189m3800j957K2060
15567a991J5296l4459n126M9551J293j8438l1258j6481j3769J4176k6214j8975
15555h6395M462K7315j2038R609k9997l9922L5165L6127K6888J5996Q059R112
15543D381N5567K1610J1369n9433j2391j8370L312K885k3338J2717J8058l2835
$$ plain form
15630 -35972 -34151 -26130 -4739 -5953 -32414 20022 36489 10798 18219 2258 -211 -7756 12433
15617 12433 -19863 -31329 -59728 -55013 -58489 -89529 -51354 -23925 -12750 -21304 -26241 -6562
15605 -6562 23716 16008 51654 41688 15851 58881 110855 92240 90796 69001 40601 49948 65279
15592 65279 37827 -23465 -92249 -71148 -77531 -36135 -3988 50459 44451 21595 24349 29881
15580 29881 5975 40507 62137 54805 3988 -5670 -2550 21929 25895 21706 -22094 -24051 -1991
15567 -1991 13305 -21154 -26280 23271 24564 6126 -25132 -41613 -55382 -41206 -67420 -86395
15555 -86395 -81933 -54618 -66656 -57047 -87044 -126966 -91801 -55674 -28786 -12790 -4731 4381
15543 4381 59948 81558 92927 33494 21103 2733 6045 8930 -14408 -1691 16367 -16468
15531a6468j7138P864P725J356k1339j3999k20L041L3173N6623K2632k7268m3182
15518g200K0096k0529o4345J0446j2031L003L0632J6621o3321k828O7803N2968
15506C1315L2497K2507k9225m5442k4439m887k2935P528L1065K8157N1796l6794
15494D1143l1534j8811j7306M1287j4846k0427j8435J2988K4201K8710q368L645
15482B2247M3859k7567n8621N743K9458L3710N6440K2992n5459l2723j0218j4752
15470A5109m7046K6655K9500p788o0088p259N2727l716n662m3748j9627K6105
15458d4838K6886j6626m5067o729k770M8301J1872k7267J1013J5229J9642K3371
15446A3017m7127j0472M9973Q5606J0278k7353o3428p6051J1015L7810j8624k7443
$$ plain form
15531 -16468 -33606 -25742 -18017 -16661 -38000 -51999 -52219 -49178 -16005 40618 63250 35982 -7200
15518 -7200 12896 -7633 -71978 -61532 -73563 -70560 -39928 -23307 -86628 -89456 -21653 31315
15506 31315 63812 86319 57094 11652 -12787 -17674 -40609 -33081 -2016 26141 77937 41143
15494 41143 9609 -9202 -26508 14779 -67 -20494 -38929 -25941 -1740 26970 18602 22247
15482 22247 66106 38539 -20082 -14339 15119 48829 105269 128261 72802 40079 29861 15109
15470 15109 -31937 -5282 24218 16430 -43658 -50917 1810 -1906 -7568 -51316 -70943 -44838
15458 -44838 -17952 -34578 -79645 -86374 -89144 -40843 -28971 -56238 -45225 -29996 -10354 13017
15446 13017 -34110 -44582 5391 90997 101275 73922 10494 -65557 -54542 -16732 -35356 -62799
15434f2799M1218j6983l7778k0470J0548K5045L9738j8952l1759o738L0996M3704
15422d230P332k2858k4914m3369l6511j4868P036M8716L6458l713l6567J7493
15410f9995O8468j7725k4622k6231J6505R5177L9367l0356n3739L567n0520J6618
15398c3486O9984K8015l409R223J7598l6865o984M5802j9723o8638m4027l5500
15386g8010j5467K9521K7746j7436N7885M8587J1868K0591j6585Q494j3548p1867
15374h221k044k3687p172O3440K3878k2029r1154j2464N2598J039K176N6764R994
15361D3118l9032n3248K0074j5518k1499N877p330J5133L9542M3717j2916n1288
15349c3370K026k3694l4641J8071J7746O7928P3672l0915o1827l1729j349L0743
$$ plain form
15434 -62799 -21581 -38564 -76342 -96812 -86264 -61219 -21481 -40433 -72192 -78930 -47934 -4230
15422 -4230 3102 -19756 -44670 -88039 -124550 -139418 -132382 -83666 -47208 -50921 -87488 -69995
15410 -69995 -1527 -19252 -43874 -70105 -53600 41577 80944 50588 -3151 416 -50104 -33486
15398 -33486 36498 64513 61104 70327 87925 51060 44076 89878 70155 1517 -42510 -78010
15386 -78010 -93477 -63956 -36210 -53646 4239 52826 64694 85285 68700 77194 63646 -8221
15374 -8221 -10265 -33952 -41124 22316 46194 24165 -66989 -79453 -26855 -25816 -23640 33124 43118
15361 43118 4086 -49162 -29088 -44606 -66105 -60228 -67558 -52425 -12883 30834 17918 -33370
15349 -33370 -31344 -55038 -89679 -71608 -53862 14066 87738 56823 -5004 -36733 -38082 -7339
15337g339J1323o6375k8306l2954k4641N919O9923N0523P663K7605K4333n2605
15325a4931J1337j4775l3581k25l554N1280K8795l6133l5367J8773J3164p631
15313b2848k1112J1883K8768L8061m952K8114k009L1938p814j6799l632k911j0164
15300D6523k5538J380M2395k0138n9277K2392L9310k0516m2054j6384k8332N8863
15288a376K6334K8420k1578j6656K182N1240j8497k0432M1728N2115l126n010
15276A15344k0206l4751m7896L128J1752J7667J8704R54r932m0777m4879J7784
15264a3108M4432j8774J581M074m1478k7173J5707L7468K4118L4087l143n3626
15252D165k690K6254K1855m4056k0985L3943k2748J6352k1901R253Q3248J5769
$$ plain form
15337 -7339 3984 -62391 -90697 -123651 -148292 -142373 -72450 -21927 -14264 13341 37674 -14931
15325 -14931 -3594 -18369 -51950 -52175 -55729 -4449 24346 -11787 -47154 -28381 -15217 -22848
15313 -22848 -43960 -32077 -3309 34752 29800 57914 55905 87843 80029 63230 59598 56687 46523
15300 46523 20985 22365 64760 44622 -14655 7737 47047 26531 -15523 -31907 -60239 -1376
15288 -1376 24958 53378 31800 15144 17326 68566 50069 29637 71365 123480 120354 115344
15276 115344 95138 60387 12491 15619 27371 45038 63742 64696 54764 13987 -30892 -13108
15264 -13108 31324 12550 14131 18205 -23273 -50446 -34739 2729 26847 60934 57791 4165
15252 4165 1475 27729 49584 5528 -15457 18486 -4262 12090 -9811 -558 82690 98459
15240I8459m8165k3001n0042k8811K3866n972j9063J9952j0052l6573M2647K4566
15228a2189l069K4563K5166J0578l0723j3793M90j6068J1474K9081K3611o2833
15216a3712p1580J7490J320k8389K6005j0095L1225j0492n5900M2044N5670j50
15204a6564P415K0226K1289p792K851m8710J5972N3020L195q727j9176m7014l3600
15191e7615j1130R63K2584O183J9092r056n657P365L4520N1193K274l6281j4485
15178I950j1294J8433K1650l0055k0558l5184k40L4277N438O22M1050K8636K305
15165F5030k5488j3460j6222L4664L131J4410l6992m0179l235k0873l355K4308
15153a8261n3299J047J5411j9320J8619M5839N043o151j6073L4830M4981J9953
$$ plain form
15240 98459 50294 27293 -22749 -51560 -27694 -33666 -52729 -32777 -42829 -79402 -36755 -12189
15228 -12189 -15258 9305 34471 45049 14326 533 1023 -15045 -3571 25510 49121 -13712
15216 -13712 -85292 -67802 -66482 -94871 -68866 -78961 -47736 -58228 -114128 -72084 -16414 -16564
15204 -16564 -9149 11077 32366 24574 27425 -21285 -5313 47707 50902 42175 22999 -24015 -57615
15191 -57615 -68745 -67782 -45198 -39015 -19923 -28979 -34636 -27271 7249 58442 60716 24435 9950
15178 9950 -1344 17089 38739 8684 -11874 -47058 -47298 -13021 -7583 -6961 34089 62725 65030
15165 65030 39542 26082 9860 44524 47655 62065 25073 -15106 -18341 -39214 -42569 -18261
15153 -18261 -71560 -70513 -55102 -74422 -55803 -9964 -4921 -11072 -27145 7685 52666 72619
15141G2619j6607l4494j4665J7351J0193m837L026l2954J9896L7975J1495j1907
15129E7091k5327Q595M0126l1172k0089j1555o666m902P646K8387J7231J5721
15117G5086n31M6017j3277l1783K7024l3772m2649l3196k2L7007j8715j7736l7520
15104d4067k6177k5906J8905K4362K457M795k0452J1550R0915M1323o6436m2550
15092c1281l7579o8440J9326N6881M2235n720l3197K5303N5738o562j1711l9007
15080c4014o071K6679J2974p264J3712M5592K5136r853j4475k2464R504l8720
15068G36l0784J2173L6879k0720k0950K9111P1442L0610k0377j0614j202l9707
15056C6597j2647k3929k8843j5328K5001K8431l7485j3527P918p734k3266O3208
$$ plain form
15141 72619 56012 21518 6853 24204 34397 29560 32586 -368 19528 57503 68998 57091
15129 57091 31764 40359 80485 49313 29224 17669 11003 6101 13747 42134 59365 75086
15117 75086 74555 120572 107295 75512 102536 68764 26115 -7081 -7103 29904 11189 -6547 -44067
15104 -44067 -70244 -96150 -77245 -52883 -50426 -45631 -66083 -54533 36382 77705 11269 -31281
15092 -31281 -68860 -137300 -117974 -61093 -18858 -24578 -57775 -32472 23266 16704 4993 -34014
15080 -34014 -40085 -13406 -432 -7696 6016 51608 76744 66891 52416 29952 39456 736
15068 736 -30048 -17875 19004 -1716 -22666 6445 77887 108497 88120 77506 76304 36597
15056 36597 23950 21 -28822 -44150 -19149 9282 -28203 -41730 -33812 -41546 -64812 -1604
15044a604L2163J2539J9913k6706J3370M354P567j7671n3596k6032K0720J8123
15032C140l764k1423L0109J9694R338K5747n745N553k1603o8928j8184N0293K0201
15019B4428k7596j3007J236k4479K3093O205N341l436r068J9129k801j6764j4350
15006c2069N8928j9263l3799j7632l0790p593P450L1375n53K6177l1061J2607
14994c6223J8797O994L3412M2429p277l3046l476Q236J4258k2367L180l3516k7890
14981c6489Q269K7876k2599R010j1821K8974L1762P502q6852J3649N0142k5379
14969e956k2348K9484k5358k6536L8068P9926O091o7842m7430J3324J4667J3744
14957a66l2643K0498J5896k9101J6369l6245j51L9667J2025j4290j3394Q3034
$$ plain form
15044 -1604 30559 43098 63011 36305 49675 54029 61596 43925 -9671 -35703 -14983 3140
15032 3140 -624 -22047 8062 27756 37094 62841 57096 62649 41046 -27882 -46066 4227 24428
15019 24428 -3168 -16175 -14939 -39418 -16325 -10120 -4779 -8215 -17283 1846 -955 -17719 -32069
15006 -32069 26859 7596 -26203 -43835 -74625 -82218 -74768 -43393 -43946 -17769 -48830 -36223
14994 -36223 -17426 -10432 22980 65409 58132 25086 21610 29846 44104 21737 24917 -8599 -36489
14981 -36489 -28220 -344 -22943 -13933 -25754 3220 34982 42484 -44368 -30719 19423 -5956
14969 -5956 -28304 1180 -24178 -50714 -12646 67280 73371 5529 -41901 -28577 -13910 -166
14957 -166 -32809 -12311 3585 -25516 -9147 -45392 -45543 -5876 6149 -8141 -21535 61499
14945F1499R8759l4402q8142k8555k9183J9234j4689L3394n414j8636k2065L5432
14933G232N1369m530J0753k4581K4442L1348k8822l0388j6618j2893l4313J1095
14921a5906J0757k73J8525K155k2497K816N5750k8687j02297K676J03948L4131
14909F1098p3336k0811J4217l1627j1455L1346K3703j1398l0313P5101L0154j5680
14897D0999k0001J0818n0957k9610N4148L255r709P621P058n009j0259J592k3461
14884b3515K5707M088J1328K4421K3514j7593m0577J2024N4161n0404k4257J6595
14872A5492P213N1299k5829l1040J4822M0911k9082L734K141l701j4687k9562
14860A711k490J4732J3546J691J126J0763k4170m1112M258J9325J8354J298p386
$$ plain form
14945 61499 160258 125856 37714 9159 -20024 -790 -15479 17915 12501 -6135 -28200 7232
14933 7232 58601 54071 64824 40243 64685 96033 67211 36823 20205 7312 -27001 -15906
14921 -15906 -5149 -5422 13103 15258 -7239 -4423 51327 22640 -79657 -76981 26967 61098
14909 61098 -12238 -33049 -18832 -50459 -61914 -30568 -6865 -18263 -48576 26525 56679 40999
14897 40999 20998 31816 -19141 -48751 5397 8652 -1057 6564 13622 8613 -1646 -54 -23515
14884 -23515 2192 6280 17608 42029 65543 47950 7373 19397 73558 23154 -1103 15492
14872 15492 22705 74004 48175 17135 31957 72868 43786 47520 49661 45960 31273 1711
14860 1711 -779 13953 27499 29190 30316 41079 16909 -24203 -19945 -620 17734 19032 11646
14847A1646j5353l4263m984L1865M8958L036m1944k7634L2105p593k2497k7448
14835e4106K7573M2562J7372k7564J8546K346j6046j9987M0687l468l9191j5901
14823b7177k135P3220N20j4777m8596L6181k4556p2077K736M6018K0401l7108
14811d7350K331L9904K9683J2185n3213o4658j1941K8841L7387O457L4303N0916
14799F4845m070M305O335k5119m1598L307j9806j8489J8558k4596N226J7765j3973
14786b7310j6111n511L3956K6581j5996k7534P76J4001j189j0956P3429R417k3075
14773C0478m2983m4616K9361J4871K0082L6608j0382j0972l6437J5344L6757o780
14761C1331j0083n060L527J624J6207J482J4176m0118M834L2543j0844j5078K5796
$$ plain form
14847 11646 -3707 -37970 -42954 -11089 37869 40905 -1039 -28673 3432 -4161 -26658 -54106
14835 -54106 -26533 16029 33401 5837 24383 26729 10683 -9304 31383 27915 -11276 -27177
14823 -27177 -29312 43908 44428 29651 -18945 17236 -7320 -79397 -76661 -30643 -10242 -47350
14811 -47350 -45019 -5115 24568 36753 -16460 -81118 -93059 -64218 -26831 -20374 13929 64845
14799 64845 60775 65080 71415 46296 4698 8005 -11801 -30290 -11732 -36328 -31102 -13337 -27310
14786 -27310 -43421 -48932 -14976 11605 -4391 -31925 -31149 -17148 -18337 -29293 44136 53553 30478
14773 30478 -12505 -57121 -27760 -12889 7193 43801 33419 22447 -13990 1354 38111 31331
14761 31331 21248 16188 19715 21339 37546 39028 53204 13086 17920 50463 39619 24541 50337
14748E0337q320P678J3033m6494J7499m6055m9960m0253Q3037K060M801N923k1262
14735b7976p975K9769J6172J5965l1860j8312m1817l1687L1432N7293O5186O8460
14723A24650K573n7082m7315m3579K5029p654n318r590M4805k355j3510k9999
14711a9345j110j2038L134M5626j7122o00K4223R422K440j8328k2535N3666K3640
14698G1073n9608l7046k9511M5573J1668l2832J349K2091M6772k0902j3746m7262
14686d2381k1534k42l033M9591N4249J1191L6628m891q7466M738K7692L5699L6772
14673I7013l4621o3887l997K4833L9565k4200o4648n0485K9359k228M6936M5001
14661C8641n108m8146l6455j5184K2513O043r738l356J7534r605K9281P1363j4744
$$ plain form
14748 50337 42017 49695 62728 16234 33733 -12322 -62282 -102535 -19498 -17438 -12637 -6714 -27976
14735 -27976 -35951 -6182 9990 25955 -5905 -24217 -66034 -97721 -66289 -8996 56190 124650
14723 124650 127223 70141 22826 -20753 4276 -3378 -8696 -18286 26519 24164 10654 -19345
14711 -19345 -20455 -32493 -29359 16267 -855 -1455 22768 32190 34630 16302 -6233 47433 71073
14698 71073 11465 -25581 -55092 -9519 2149 -30683 -29334 -7243 39529 18627 4881 -42381
14686 -42381 -63915 -64157 -67190 -17599 36650 47841 84469 79578 -7888 -3150 24542 60241 97013
14673 97013 62392 -1495 -5492 19341 58906 34706 -29942 -80427 -51068 -53296 -6360 38641
14661 38641 33533 -14613 -51068 -66252 -43739 -37696 -47434 -50790 -33256 -42861 -13580 57783 43039
14648D3039k8118J6587l9276m3228k6620J0126N9637L8887R742N076k2282l0724
14636g154m0724o85l88r586m29j4992N9239L4546n7885K7407K8470N601k0340
14623C080l3593j3666j3538K0043M477K7431M714k4259k9578k913L4433N5901
14611C2532Q7128k2720l7057l8239N067K8598N921m8218n8639K9373K8604M1562
14599E3912J3646l1752k5641k0843m523J2253J1603R654N044J5732N164K9463
14587G3712m6430k1192J9872j4328k6388l4403j0312M4950N0074N033n2599l9273
14575e1284K2933L4976k0520L8359L3842l9815m0732l8739K4416M2624J8613O485
14563C1158j5166L7862N4147k0770k9091m6329j6635P623L2628k2820K5068L0645
$$ plain form
14648 43039 14921 31508 -7768 -50996 -77616 -67490 -7853 31034 40776 45852 23570 -7154
14636 -7154 -47878 -48563 -48951 -58537 -58966 -73958 -14719 19827 -38058 -10651 17819 23420 3080
14623 3080 -30513 -44179 -57717 -37674 -33197 -5766 -1052 -25311 -54889 -57802 -23369 32532
14611 32532 119660 96940 59883 21644 26711 55309 61230 13012 -45627 -16254 12350 53912
14599 53912 67558 35806 10165 -10678 -15201 -2948 8655 18309 23353 39085 44249 73712
14587 73712 27282 6090 25962 11634 -14754 -49157 -59469 -14519 35555 40588 -12011 -51284
14575 -51284 -28351 6625 -13895 24464 58306 18491 -22241 -60980 -36564 6060 24673 31158
14563 31158 15992 53854 108001 87231 58140 11811 -4824 2799 35427 12607 37675 68320
14551F8320P639P490P10l2632k1345J5731o974m57l8278L9497K3944k2261l2778
14538H606L2266J1477P639l1499l0567K3978k5080k1779O2261M9884j1059o2939
14526A3188k0632j3821M3582L7214o755k8155l5809j689M13L5705K817N2752M0230
14513A19040J2599n4401m755J407Q702J9835k6692q415J4370M0672j5340n424
14501A01598N214j5950l5922o748k5571o054j8264k5525J5704N7321N4525j7874
14489H2454o9715j6163L3963o473O941j1483k1740L7274L7770j5532k4921Q38
14477C3213R211k5237m2716j7109j4593L7678j4025j0272J3623L9J759j8967N9126
14464A1730M2709p919n5718k6827J1789K2093K1795J6213k5885n2877L5158p755
$$ plain form
14551 68320 75959 83449 84159 51527 30182 45913 38939 38482 204 39701 63645 41384 8606
14538 8606 40872 52349 59988 28489 -2078 21900 -3180 -24959 37302 87186 76127 13188
14526 13188 -7444 -21265 22317 59531 52776 24621 -11188 -12877 -12464 23241 26058 78810 119040
14513 119040 131639 77238 72483 73890 82592 102427 75735 67320 81690 122362 107022 101598
14501 101598 106812 90862 54940 48192 22621 16567 -1697 -27222 -11518 45803 100328 82454
14489 82454 12739 -3424 30539 24066 31007 19524 -2216 35058 72828 57296 32375 33213
14477 33213 42424 17187 -25529 -42638 -57231 -19553 -33578 -43850 -30227 -30188 -28429 -47396 11730
14464 11730 54439 46520 -9198 -36025 -24236 -2143 19652 35865 9980 -42897 -7739 -15494
14452a5494J8301l1744J9733l2301j9527L7929j0400m423p567k1931J9525p286
14440e5185l641M403k101O699l7811j7505N0195L7239j1470l9576k477K9108O0865
14427A8743N5283Q288j2850P097n5798o8l96K0126q130L3333J969k6102L4214
14414G5709m690k3912p1875n9094N5400P5501k9730p7210p454J8196K7707M0945
14402A9493j7705j8598K7331N19k3841k6835N6605L525Q112k4918p55l8904l8276
14389g4247L0799J3038j2289P2961j7070n0265J8954L2196j6857L356j3195L9682
14377B7063K1481k164j2278p1172j0297M9861j4815j0216J7737K6625m2053m6385
14365f6613K8592J1226J0722N4671L3458P71m0446k8094L2455L6233k7247j7126
$$ plain form
14452 -15494 2807 -28937 -9204 -41505 -61032 -23103 -33503 -37926 -45493 -67424 -47899 -55185
14440 -55185 -58826 -54423 -56524 -49825 -87636 -105141 -54946 -17707 -29177 -68753 -71230 -42122 18743
14427 18743 74026 82314 69464 76561 20763 20695 20299 40425 32295 65628 67597 41495 75709
14414 75709 71019 47107 -24768 -83862 -28462 47039 17309 -59901 -67355 -49159 -21452 19493
14402 19493 1788 -16810 10521 11040 -12801 -39636 16969 20494 28606 3688 2933 -35971 -74247
14389 -74247 -43448 -30410 -42699 30262 13192 -37073 -18119 14077 -2780 576 -12619 27063
14377 27063 48544 46380 34102 -37070 -47367 2494 -12321 -22537 -4800 21825 -20228 -66613
14365 -66613 -38021 -26795 -16073 38598 72056 72827 32381 4287 36742 72975 45728 28602
14353B8602J0270l2906K7292M8743j3691n7456n1836n3086J0718M8217K085J5420
14341a7628M5651J0457r575o5443j1453J0959p942O290M0631M3281j4879K4187
14329E4536J9201j2115m9557k0356j0267j1169N6366k3585j0141j8906N337O8824
14317D8168k1358p013j5007o5058k2453R3453N601j4957l9496K400K6727K5813
14305A6820L9539L1183j2572j7977o885J4133P942m2526l6849m0936k7757Q1867
14293E982K2380m7634K2085M0436j4273m756K3012j6491L9435K7219J7622l153
14281A11864k2653k3546k1864J3833M0596m9968l6689k8175q4180L5729O3835
14270a218P7896J1250j0518j4030K587k3252l1488k9270l6134n072j034J0524
$$ plain form
14353 28602 38872 5966 33258 82001 68310 10854 -40982 -94068 -83350 -35133 -33048 -17628
14341 -17628 28023 38480 28905 -36538 -47991 -37032 -44974 -38684 1947 45228 30349 54536
14329 54536 73737 61622 12065 -8291 -18558 -29727 26639 3054 -7087 -25993 -20656 48168
14317 48168 26810 19797 4790 -60268 -82721 10732 16333 1376 -38120 -35720 -8993 16820
14305 16820 56359 87542 74970 56993 50108 64241 72183 29657 -7192 -48128 -75885 5982
14293 5982 28362 -19272 2813 43249 28976 24220 47232 30741 70176 97395 115017 111864
14281 111864 89211 65665 43801 57634 98230 48262 11573 -16602 -100782 -65053 -1218
14270 -1218 76678 87928 77410 63380 65967 42715 11227 -18043 -54177 -59249 -60283 -49759
14258d9759j0883N8941J0864l4772K3916L5734J8787o2186J5722q2p5359k5727
14246i4804p847K0916k839j8593L7527L5221P5255n967J7698o055m4879J816j50
14233G299K1427k5460o4813L6805K603j512N738J4183m574L2328J8705J7030m3280
14220A6479k9468k8926k5389o159L1772N2585N447J2137j9738L0498L3196k4355
14208D8079j3941p978m8503l9667j3155j7085J1690M8000K5376j629k311o484
14196a7608k734L7094K8858j8775K3301L1162J2196l0710p7754r951L5597k6438
14184a5762l1849j0438J5304L5235j8417L0158M0078k5856m5893N535k6641r926
14172e8472L1606J293P790M2770n387k3740J4129N4503j8851N998K0388k7715
$$ plain form
14258 -49759 -60642 -1701 9163 -25609 -1693 34041 52828 -9358 6364 6282 -69077 -94804
14246 -94804 -102651 -81735 -84574 -103167 -65640 -30419 44836 38869 56567 50512 5633 7449 7299
14233 7299 28726 3266 -61547 -24742 -22139 -23651 -17913 -3730 -8304 24024 42729 59759 16479
14220 16479 -12989 -41915 -67304 -73463 -41691 10894 16341 28478 8740 39238 72434 48079
14208 48079 34138 26160 -22343 -62010 -75165 -92250 -80560 -32560 -7184 -8813 -11124 -17608
14196 -17608 -20342 16752 45610 26835 50136 81298 93494 62784 -14970 -24921 10676 -15762
14184 -15762 -47611 -58049 -42745 -7510 -25927 4231 44309 18453 -27440 -21905 -48546 -58472
14172 -58472 -26866 -25573 -17783 24987 19600 -4140 9989 64492 45641 51639 72027 44312
14160D4312n7432m7260P1511Q9584J9460q1845j00362k1357N2131N4719m3246
14149a9785k4275O4499L4801O972K9989j3516n7965k4939O1401m6763o3259K8211
14137b4629l3816k3346k7162K0503P9091L7753n1524m2195J8100J6538j3121J7422
14125b6386J0593J1186K8897O918J7969l7445j2029N716K5631M9699K3913j2902
14113I1760m5197r553J7899l2857l4761j5214J1596K5792J494J1226N3061K319
14101G7565k3363M393N546l1616K700N55n2192j7585k515K8214j4480K5623L8146
14088D0991L6077n568p2528n4703K7983M5518M1972O342k0247q175J4279q964
14076D2977j967n463k2091K112K2885J5233l576m7345K3239k3897N705J575M695
$$ plain form
14160 44312 -13120 -60380 11131 100715 120175 38330 -62032 -83389 -31258 23461 -19785
14149 -19785 -44060 20439 55240 62212 92201 78685 20720 -4219 57182 10419 -52840 -24629
14137 -24629 -58445 -81791 -108953 -88450 -9359 28394 -23130 -65325 -47225 -30687 -43808 -26386
14125 -26386 -15793 -4607 24290 31208 49177 11732 -297 5419 31050 80749 104662 91760
14113 91760 46563 37010 54909 22052 -12709 -27923 -16327 9465 10959 22185 75246 77565
14101 77565 54202 58595 64141 32525 35225 35780 -16412 -33997 -36512 -8298 -22778 2845 40991
14088 40991 77068 71500 -1028 -55731 -27748 17770 59742 66084 45837 37662 51941 42977
14076 42977 41010 35547 13456 15568 38453 53686 50110 2765 26004 2107 7812 9387 14082
14063A4082K0984P3378L9755L7542l4863j1748O048p9534l0597l2830L4090J2488
14051D8795K5198N4625m7310m1296n0592m6197N0300N7773K5011k3760m3784j615
14039G148O3192N3900L2878j6979l972J3346l2194j3628j00664k7128K3565J5768
14027A5232L923L331M3110N9274N2267j6754k726J9118O5987M8314M78P0942K4173
14014C86669r5440o7498o2201n9556j2390j7431L0555R449j4530j6611l308m182
14002G3526N5855j782l5660l4450j1737j9174k008Q017l7423l5073L6837N3656
13990E0584J8316L8568p17n8126k4441k2937r496M145K3227L4011L5005M1503
13978A29642k2609k6221J0211J4138K7066R076N7187Q4007L3135J471n3081n1484
$$ plain form
14063 14082 35066 108444 148199 185741 150878 139130 145178 65644 35047 2217 36307 48795
14051 48795 73993 128618 81308 40012 -10580 -56777 -6477 51296 76307 52547 8763 7148
14039 7148 70340 124240 157118 140139 136167 149513 117319 103691 3027 -24101 -536 15232
14027 15232 19155 22486 65596 124870 177137 160383 157657 176775 242762 291076 291554 362496 386669
14014 386669 291229 223731 161530 101974 89584 72153 102708 112157 97627 81016 77708 73526
14002 73526 129381 127599 91939 57489 45752 26578 24570 32587 -4836 -39909 -3072 50584
13990 50584 68900 107468 106751 48625 24184 1247 -8249 -4104 19123 53134 88139 129642
13978 129642 107033 80812 91023 105161 132227 141303 198490 282497 315632 317103 264022 212538
13966B12538n2719m7037p115K5967m7372l3892k2114K6215J3876M5016p270l2298
13954G3795k4636n6934l4463N4560J8543k8630k8502M3092q672K7145j2942n8890
13942c6534j4405m0262n380M1279O3652L4340j4621J7722K834o143k4561L069
13930B0990P633K3185L6110K3007k155j0320K909n945k9504J5268L8064k0688
13918I8554k1849j1906N486k8363K2420J0188m9227M644R654o450L494j1414j6303
13905H928n853P4181M7448K1123j943l8370l5841l038q7869n5370K9382L3783
13893a3439L2428j3137j0158k9538J8826K4249O2820L0247l5278j034N5439J3420
13881A34845r825k1438n1637j1925q4004m3627M1247R0250J3112l2141r065J7546
$$ plain form
13966 212538 159819 112782 105667 131634 84262 50370 28256 54471 68347 113363 106093 73795
13954 73795 49159 -7775 -42238 12322 30865 2235 -26267 16825 8153 35298 22356 -36534
13942 -36534 -50939 -91201 -96581 -55302 8350 42690 28069 45791 48625 42482 17921 20990
13930 20990 28623 51808 87918 110925 108770 98450 101359 95414 65910 81178 119242 98554
13918 98554 76705 64799 70285 41922 64342 74530 25303 29947 39601 33151 36645 25231 8928
13905 8928 3075 77256 124704 145827 143884 105514 69673 66635 -21234 -76604 -47222 -13439
13893 -13439 18989 5852 -4306 -33844 -15018 9231 72051 102298 67020 65986 121425 134845
13881 134845 125020 103582 51945 40020 -43984 -87611 -46364 43886 56998 24857 15792 33338
13869C3338L9292j9187m9655K4298J51j394K3740Q822n8959j1118J9081p080R388
13856A0717N4196p453p4084J2727K3844j1042M5697M0191l4663k733k6122M086
13844C5361m125q765j369m7168k1161K1234R740l114J4030K7994N7790K0527m2379
13831E8595J7027M3388N4933l0339J5102k6061j07516o515K4618M840j35P8980
13819A26917P606q468j3504K3461J1268j2066k2881J7852j0149l9727n8677m2444
13807b0812l6962N6059O9197O4728J5484n0578n520k4301m2348N079O4186M3524
13795A37736l1262l0458m9389P904n59j6700K3577M9110O1925k5119m0185l8678
13783D7902j2867k2118J6884R48N0758O2511R116n7633n2902l4176r905K4991
$$ plain form
13869 33338 72630 53443 3788 28086 28237 26843 50583 59405 446 -10672 8409 1329 10717
13856 10717 64913 57460 -16624 -3897 19947 8905 54602 94793 60130 57397 31275 35361
13844 35361 31236 22471 21102 -26066 -47227 -25993 -16253 -19367 -5337 22657 80447 100974 58595
13831 58595 75622 119010 173943 143604 158706 132645 25129 18614 43232 48072 47937 126917
13819 126917 134523 126055 112551 136012 147280 135214 112333 130185 120036 80309 21632 -20812
13807 -20812 -57774 -1715 67482 132210 147694 97116 91596 67295 24947 30026 94212 137736
13795 137736 106474 76016 26627 34531 33972 17272 40849 89959 151884 126765 86580 47902
13783 47902 35035 12917 29801 30749 81507 144018 153134 95501 42599 8423 -1482 23509
13771B3509j9452k7523k0751j3815L4951N8191J0401m02M820K3772k0160n6107
13759b566o51J7788k304j7107M935N1604L8022k5217l9864K7781L577Q973l1488
13746C3483M9336P2823J8650m4902j0427k3103j1777q380j2010k6259K5766o242
13734E6958k003L816m9546J413N7037L6678M0601K7009m669j273j9787n6069P355
13721I7520O1361k686k6357L5685M0677Q867O880o983N9100K6963K8514O8726
13709C98267J45411K38361K83152L62946L42634j100m19853m39954k76100j20024
13699E13740o6724p6625k3719R678j7925k6428j8003j1630L403o312K7074P34
13687C07263m1162o7614q610k7560j9843O4788L5913m4644p6797k6739K8842J8998
$$ plain form
13771 23509 4057 -23466 -44217 -58032 -23081 35110 45511 45109 49929 73701 53541 -2566
13759 -2566 -3217 14571 12267 -4840 95 51699 89721 64504 24640 52421 55998 64971 33483
13746 33483 82819 155642 174292 129390 118963 95860 84083 75703 63693 37434 63200 56958
13734 56958 54955 58771 9225 10638 67675 104353 144954 171963 167294 166021 146234 90165 97520
13721 97520 158881 156195 129838 165523 206200 215067 221947 214964 274064 301027 329541 398267
13709 398267 543678 782039 1065191 1428137 1770771 1769671 1349818 909864 633764 513740
13699 513740 447016 370391 346672 356350 338425 311997 293994 282364 285767 279455 306529 307263
13687 307263 266101 198487 189877 162317 142474 207262 243175 198531 121734 94995 123837 142835
13675A42835J0990l2529m2054N9609j6740K2728M1138L0518l3447n2672m5596
13664H4780k7068j7118l4309J8837R4842L5531j3075M2201J5325n4776m2591K9456
13652A32035j4082R495K065L4352K226k3892L5855j5664j166O3768K3314N3203
13640C01509P7867M5248n0617n5772l1913l976j2088J2594L7092n2886k1888L5858
13628B81028k2349L0554J4665m972Q3249j873n403J5527p935K9940Q0053P4740
13616E67224J18301R3552J07863J25782J30565J52756J97124K79939K61407L61284
13606B395797M08607L57988M68761O87662J011844J475885K232795L306651M478381
13597A6824371M559363K177832k198773m880263m274864k912488j862742j163988
$$ plain form
13675 142835 153825 121296 79242 138851 122111 144839 185977 216495 183048 130376 84780
13664 84780 57712 40594 6285 25122 119964 155495 142420 184621 199946 145170 102579 132035
13652 132035 117953 127448 129513 163865 166091 142199 178054 162390 161224 224992 248306 301509
13640 301509 379376 424624 374007 318235 286322 282346 270258 282852 319944 267058 245170 281028
13628 281028 258679 289233 303898 298926 382175 380302 374899 390426 382491 412431 492484 567224
13616 567224 685525 779077 886940 1012722 1143287 1296043 1493167 1773106 2034513 2395797
13606 2395797 2804404 3162392 3631153 4318815 5330659 6806544 9039339 12345990 16824371
13597 16824371 21383734 23561566 21362793 16482530 12207666 9295178 7432436 6268448
13589F268448p70569n61746l40536j97319j95710k05881j52662j34654j43190
13580C566181j60347j97502k07908j99788j02712n6756l5627K4076O0068J13612
13570B803297J93441K04999K59550L45444M20393N09555O05527O98065Q95396
13561F935667J079297J276385J488283K016716K827865M114584O154327R357883
13553C5251007J3445916J5447644J0290087m058378j6913785j5446415r740523
13546B8275553n981423l830115k558583j709827j194639q62037p26746o14333
13538A0797850m46675k82549l69277n80750o78067p83706p71252o33804m82987
13529E768783l24415k69096k13077j78216l8197N2884J70522J72443L32183M02544
$$ plain form
13589 6268448 5497879 4936133 4595597 4398278 4202568 3996687 3844025 3709371 3566181
13580 3566181 3405834 3208332 3000424 2800636 2697924 2641168 2605541 2629617 2689685 2803297
13570 2803297 2996738 3201737 3461287 3806731 4227124 4736679 5342206 6040271 6935667
13561 6935667 8014964 9291349 10779632 12796348 15624213 19738797 25893124 35251007
13553 35251007 48696923 64144567 74434654 70376276 53462491 38016076 28275553
13546 28275553 22294130 18464015 15905432 14195605 13000966 12138929 11412183 10797850
13538 10797850 10351175 10068626 9699349 9118599 8440532 7656826 6885574 6251770 5768783
13529 5768783 5444368 5175272 4962195 4783979 4745782 4798666 4969188 5141631 5473814 5876358
13519E876358N32574O70444Q09690R98292J232894J500046J911223K595093L762858
13510A9889472N704277Q711200J2869064J5720399J2159004r68508j6152653j6956747
13502D0975508j1010776o656903m273213k754288j808415j292626r50773p81611
13494A1446903o86782n63515l91413l89143n41871p50302p82008p32775o70822
13485E938272n73725m63589l96734l03075k73534k51092j54104j05806q5667p4073
13475C256873J4617J46007J58341J47125K89153L34477M61789O09650Q36613J171818
13465G426463J766014K739731L945124M810566L879773J28959m382834n342417
13457A4971379l826138k457034j574767j069960p39036n04116l42119l03016k75722
$$ plain form
13519 5876358 6408932 7079376 7889066 8887358 10120252 11620298 13531521 16126614 19889472
13510 19889472 25593749 34304949 47174013 62894412 75053416 74084908 57932255 40975508
13502 40975508 29964732 23307829 19034616 16280328 14471913 13179287 12228514 11446903
13494 11446903 10760121 10196606 9805193 9416050 8874179 8123877 7341869 6609094 5938272
13485 5938272 5364547 4900958 4504224 4201149 3927615 3676523 3522419 3416613 3330946 3256873
13475 3256873 3271490 3417497 3575838 3722963 4012116 4346593 4808382 5418032 6254645 7426463
13465 7426463 9192477 11932208 15877332 20687898 24567671 24696630 20313796 14971379
13457 14971379 11145241 8688207 7113440 6043480 5304444 4800328 4458209 4155193 3879471
13448C879471j90557j23183j63753j88399k44018k44966k86818k62660k13408
13439A961709j99438j74881j29443j68201j45298j19109j53359j18270n3097n6342
13429F44271L1637J0280l1482j09738k4535j8589j5683o6407L3363J5361p3987
13418C94491n361N8568L756r8155p1326o2022j2194m3759j8354J2022K7749j9447
13406A65968k4780J8013K5844K1932L0867L8790m490o928Q135P733J8629K0871
13394C20584k7795m3212O057k3710l9565J6582J7620J5773K9019K4073L5793N1421
13382C82640J6925J1572j9240q592j4033n3260p9175p441J5743o85n522O44J8170
13369B57746L8288M9065K2893n530J3801O329K6357k267n0086N80J5458L3610
$$ plain form
13448 3879471 3688914 3565731 3401978 3213579 2969561 2724595 2437777 2175117 1961709
13439 1961709 1762271 1587390 1457947 1289746 1144448 1025339 871980 753710 700613 644271
13429 644271 675908 686188 654706 544968 520433 501844 486161 419754 453117 468478 394491
13418 394491 389130 447698 451454 353299 281973 219951 207757 163998 145644 157666 185415 165968
13406 165968 141188 159201 185045 206977 237844 276634 272144 265216 273351 281084 299713 320584
13394 320584 292789 249577 255634 231924 192359 208941 226561 242334 271353 295426 331219 382640
13382 382640 399565 411137 391897 383305 369272 316012 236837 229396 245139 244454 238932 239576 257746
13369 257746 296034 345099 367992 362462 376263 382592 408949 406682 356596 357176 372634 406244
13357D06244J727k7264m5024j9757K3788M1311O1219j2066l7068J8203O65K2405
13345D34383K354p914j5403m9654Q909J0215j6062J2402m3424l4097K6342J9147
13333C47198n7259J1550P3341j13j3458J4010m974J4612Q4992j4819k4492K0917
13321D51505K3285m8681K361O3057N1108M1765N0645N3021P9384N0434K5757N2072
13309H95713K831J4859l653L7061O4421K3998L4026K1549K4431J0226q599j768
13297A115095L7849J40798J48074Q8962P0275Q3558R3317P4910R8850J51780K13323
13286B316791K23917L00687L46197M34516N54786O10753O72437Q64221R93822
13277G318127J214819J377447J645132J969686K396918K864845L452472M036918
$$ plain form
13357 406244 407971 380707 335683 315926 339714 381025 442244 430178 393110 411313 411978 434383
13345 434383 436737 428823 413420 363766 372675 382890 366828 379230 335806 301709 328051 347198
13333 347198 289939 301489 374830 374717 361259 375269 370295 384907 469899 455080 430588 451505
13321 451505 474790 426109 428470 491527 542635 584400 635045 688066 767450 817884 843641 895713
13309 895713 898544 913403 909750 946811 1011232 1035230 1069256 1090805 1115236 1125462 1116863 1115095
13297 1115095 1152944 1293742 1441816 1530778 1601053 1684611 1777928 1852838 1951688 2103468 2316791
13286 2316791 2540708 2841395 3187592 3622108 4176894 4787647 5460084 6324305 7318127
13277 7318127 8532946 9910393 11555525 13525211 15922129 18786974 22239446 26276364
13269B6276364M594695N196894O946659R795560J3984301K0837346L3267130N4584736
13261A75483685P6532291P0469566R295393p9894732q4047340m9676408k7797332
13254I0365123j6852587j1419865q304337o177317m613308l234026k200945j328640
13246C6234098o74859q37433j858647k842335l243051l358484k988779k601953
13238A7828557k126703j719961j497325j264380j090916j001689q26672p13580
13230G587331o93313o40114n31295m95856m14261l56041l50323l34859k92894
13221C478375k40352k70638k91929k10691j88122j71625j72557k14733j71068
13212A546660q4652p5545j48731q0016q0936p7694q5506p2094m9933l2890r372
$$ plain form
13269 26276364 30871059 36067953 43014612 52810172 66794473 87631819 120898949 175483685
13261 175483685 252015976 322485542 331780935 251886203 167838863 118162455 90365123
13254 90365123 73512536 62092671 53788334 47611017 42997709 39763683 37562738 36234098
13246 36234098 35559239 34721806 32863159 30020824 26777773 23419289 20430510 17828557
13238 17828557 15701854 13981893 12484568 11220188 10129272 9127583 8300911 7587331
13230 7587331 6894018 6253904 5722609 5226753 4812492 4456451 4106128 3771269 3478375
13221 3478375 3238023 2967385 2675456 2464765 2276643 2105018 1932461 1717728 1546660
13212 1546660 1462008 1386463 1237732 1157716 1076780 999086 913580 841486 791553 758663 749291
13201G49291l1635o747n9424m162N188j009p751j1178K4946j5184m1533k3435
13189E77367j9451k1998j8177k1021P827K0597Q543k3755n7692q111m3655k2799
13177C77675j938J438O591m1653k2058O3059n1726m6989J5759M874K794k2443
13165B85383j2353o253L3013l9956O423K7693q278k0020j1805m9677P107k5575
13153A85702m4364K2094L9089M2494J6050J1626J9427j9140l7200K3265K1668
13142B80711l7476r277n8071o433l4184l5302K1227J12392J38409J04461M086
13131D80543k3183o4540n3016j915o905M307j015j1370j3888K7652k2394j0078
13119C04198o220k5093l1040J9565J2940J7900N1441j586K257K3004K292m1835
$$ plain form
13201 749291 717656 710909 651485 647323 652511 651502 643751 632573 657519 642335 600802 577367
13189 577367 557916 535918 517741 496720 504547 525144 533687 509932 452240 444129 400474 377675
13177 377675 375737 377175 383766 342113 320055 383114 331388 284399 300158 305032 307826 285383
13165 285383 273030 266777 299790 259834 266257 293950 285672 265652 253847 204170 211277 185702
13153 185702 141338 163432 202521 245015 261065 272691 292118 272978 235778 259043 280711
13142 280711 243235 233958 175887 169454 135270 99968 121195 233587 371996 476457 480543
13131 480543 457360 392820 339804 337889 330984 335291 334276 322906 309018 336670 314276 304198
13119 304198 297978 272885 241845 261410 274350 292250 343691 342105 344362 367366 369658 327823
13107C27823k1955M5301o0266o3098l5442r1m9244M603q786J0097K6703K8883
13095B04528K0064J5176q17J968j8796l2991j2695L8907M8473l5878l2088M2386
13083B38237n7512n985M5198M359P4751N8113L3359k5705n0881o8334p8740k8240
13071A38620k0949l0038j3538J0552P8845j8676n2978O354N9546m5379o1029K2913
13059G4243J6738K6413q2648m9356K7298O405J5354J2000K581L5126L2011J842
13047A18007k2030l209K5731M2247N4366m2127k1162N214n664k3320O810O1439
13035A96302J02787J28681N5843L4250j04899j30169m6309L7732K5420J13P7346
13024C77097R3710M643p5439o9074j8159k4399j8520k7054j2241m3207m8086l7148
$$ plain form
13107 327823 305868 351169 290903 227805 192363 192272 143028 147631 138845 148942 175645 204528
13095 204528 224592 239768 238951 240919 222123 189132 176437 215344 263817 227939 195851 238237
13083 238237 180725 174740 219938 224297 299048 357161 390520 364815 313934 245600 166860 138620
13071 138620 117671 87633 74095 84647 163492 144816 91838 98192 157738 112359 51330 74243
13059 74243 90981 117394 34746 -14610 12688 19093 34447 46447 49028 84154 116165 118007
13047 118007 95977 92768 118499 160746 215112 172985 151823 157037 151373 128053 134863 196302
13035 196302 299089 427770 483613 517863 412964 282795 236486 274218 299638 299751 377097
13024 377097 470807 475450 400011 330937 312778 288379 269859 242805 230564 187357 139271 102123
13012A02123Q072j5432j2978L966k2559k8058K6366l0117k270k1807N6888N0574
13000A14768M4534L142m5203l5333k8151k7352M694N0418M3905j6732l4733N6105
12988A30062J8509j6934J1971n998o0770k4988m314P47J1919j8947k1665J6637
12976C6229Q676j5566k7101k6933L4196O7239M4109p76j1570n7887l5450k6097
12964a0931k636M4911k4963m1803k2123R182K6101M9673q057L526k9575J3885
12952G190K4352j4690M6333m812J9169K5330k9261m6541K1180r488p614k263j5850
12939A3035j7101J0609O712j6529o8368j3172j076N4679K0740J467n285k7821
12927d2110Q106K8917k8515L989j6413K144L8294J1428K2532l849l304R755M3536
$$ plain form
13012 102123 110195 94763 81785 85751 63192 35134 61500 31383 29113 7306 64194 114768
13000 114768 159302 162444 117241 81908 53757 26405 31099 81517 125422 108690 73957 130062
12988 130062 148571 131637 143608 137610 76840 51852 47538 48285 60204 41257 19592 36229
12976 36229 44905 29339 2238 -24695 9501 76740 120849 120073 108503 50616 15166 -10931
12964 -10931 -13567 31344 6381 -35422 -57545 -48363 -22262 27411 19354 22880 -6695 7190
12952 7190 31542 16852 63185 58373 77542 102872 73611 27070 48250 38762 31148 28885 13035
12939 13035 -4066 6543 13255 -3274 -71642 -84814 -85890 -31211 -10471 -9004 -14289 -42110
12927 -42110 -34004 -5087 -33602 -29613 -46026 -43882 -5588 5840 28372 24523 21219 30974 74510
12914G4510j4772j7428J1580K623j4154j3918J1672m45K268l8923n6725R169j8927
12901f3470K3537L5638j8515J7393M095K6928L5457k4103J6327k5044J0893O92
12889C9828R864l044k4058o1053l7562P0716M7135L4071j3656p747l9105k96L6277
12876E1370J2992j6648K4772J6545n0811m258j8112o372M5719K0900R461R302
12864I4860j7176l6110k2108j2256L222m9899m1988J8454K9906j9904J6459L8499
12852A959j0274J2717J3195n2867K2977O6368Q706n3178k4044q213J0339j3981
12840b6296K7142k8717m3866P349J1422K658q701M4815K4582j8234j9587M6765
12828A9332K5952n1999M565k2471K1191J298M1631K3462K4178N5128J85L4151
$$ plain form
12914 74510 59738 42310 53890 56513 42359 28441 40113 39668 41936 3013 -53712 -44543 -63470
12901 -63470 -39933 -4295 -22810 -5417 -1322 25606 61063 36960 53287 28243 39136 39828
12889 39828 49692 46648 22590 -38463 -76025 -5309 41826 75897 62241 54494 15389 15093 51370
12876 51370 64362 47714 72486 89031 38220 33962 15850 9478 55197 76097 85558 94860
12864 94860 77684 41574 19466 7210 10432 -39467 -81455 -63001 -33095 -52999 -36540 1959
12852 1959 -8315 4402 17597 -35270 -12293 54075 62781 9603 -14441 -22654 -12315 -26296
12840 -26296 846 -27871 -71737 -64388 -52966 -50308 -59009 -14194 10388 -7846 -27433 19332
12828 19332 45284 -6715 -2150 -24621 -3430 -2132 39499 62961 87139 142267 142452 176603
12816A76603L0043K2779K1153Q0879J07796J79417K63176L99047L81586J12296
12806A774775l53163m62891k38348j41402o3442J2888K1529k8258p8657l0751
12796D12280o2192o0089k4906L4087J6568q1545l4870p3348j2730L5929L6488
12785A85672j4061k9174m3393J1305j543l0102j5360N6696N3358j1437o489j0682
12773A44790l6232l3858L7447j0917m9280m4008L0557L0362j1672m6867p709Q356
12761A0969m1628K8426N408K399J1154L1792K8282k9470p717j3310J5213p3486
12749c1968j3706L4691l268Q482K822M1594K5793P850K9621j4085o4442k3893
12737e09j5453j6758J2439j0181l5932K6555M7952K7869L0867j6351n2649J9793
$$ plain form
12816 176603 206646 229425 250578 331457 439253 618670 881846 1280893 1662479 1774775
12806 1774775 1421612 958721 720373 578971 515529 528417 549946 521688 443031 412280
12796 412280 350088 289999 265093 299180 315748 234203 199333 125985 113255 149184 185672
12785 185672 171611 142437 99044 110349 108806 78704 63344 120040 173398 161961 155472 144790
12773 144790 108558 74700 112147 101230 51950 7942 38499 68861 57189 10322 2613 10969
12761 10969 -30659 -2233 3175 5574 16728 48520 76802 47332 39615 26305 41518 -31968
12749 -31968 -45674 -10983 -14251 -5769 -2947 38647 64440 72290 101911 87826 23384 -509
12737 -509 -15962 -32720 -20281 -30462 -66394 -39839 8113 35982 66849 50498 -2151 17642
12725A7642o664l1606L9138M772j6554M4814K9693R428m3204r325K6534K1121
12713H5789l0621r0713J2588N4133m706k3693J9448K276M7931K31n4382J234L9352
12700E8867j5061m0627m8243l6714M2345M9695R7767J1000n5946l2964J5194L17
12688D5630m0512J5013M8863M8234J0958p4507m0546l2677K2038J6778O8082K010
12676H9364j7767m591o2994j7385l449Q230L0108j9155k4213J2459N227k307j1572
12663a8045j1919q044J3723N0852j1473k9642k3114l7271m6320N0063L4294m844
12651d1740K2715O6718N0616k2624r657j3868o9089l7892O410q605k8975J3227
12639g2764L2567P0204Q0558J5307l7308p0594K9777P2087L5287k1833l3565r7038
$$ plain form
12725 17642 10978 -20628 18510 23282 6728 51542 81235 90663 47459 38134 64668 85789
12713 85789 55168 -35545 -22957 31176 26470 2777 22225 24501 72432 72663 18281 19515 58867
12700 58867 43806 3179 -45064 -81778 -39433 10262 108029 119029 63083 30119 45313 45630
12688 45630 5118 20131 68994 117228 128186 53679 13133 -19544 2494 19272 87354 89364
12676 89364 71597 67006 4012 -13373 -16822 -8592 21516 2361 -21852 -9393 -4166 -6473 -18045
12663 -18045 -29964 -38008 -24285 26567 15094 -14548 -37662 -74933 -121253 -71190 -36896 -41740
12651 -41740 -19025 47693 98309 75685 66028 52160 -16929 -54821 -48411 -57016 -85991 -72764
12639 -72764 -40197 30007 110565 125872 88564 17970 47747 119834 155121 133288 99723 2685
12627B685k3527K3671J6938M898M0445k4572O479J5476j8234L608l4112j9630
12615e875l1554K9526M8806j820o3714Q271M1056K5909j3795q056K3304k92k6462
12602B5304p2853L0596K9022J6694k6991j6471J888L725J0994P1700j7356m570
12590E1682m1837j0200j5476n0753K4916L7799K3062J9553j8356l5393j3122K2050
12578f075O3210K9609K0840m0087k8029m2329m1880P1099L8835p592k7473n1320
12566b1192K0534O491j7366O932N6989o883l1772L469k1136K1548L4756j1999
12554D0371k1234n609j8410j7996L5683L5935l6064J2100K8131j8710n643k3020
12542E534q911J4883K1603n4797j9410N1454M3604j1906M581M2487Q85j8760k3237
$$ plain form
12627 2685 -20842 2829 19767 24665 65110 40538 47017 62493 44259 47867 13755 -5875
12615 -5875 -37429 -7903 40903 39083 -24631 -16360 24696 50605 36810 28754 52058 51766 25304
12602 25304 -47549 -16953 12069 28763 1772 -14699 -12811 -9086 1908 73608 56252 51682
12590 51682 9845 -355 -15831 -66584 -41668 -3869 19193 38746 20390 -15003 -28125 -6075
12578 -6075 57135 86744 107584 67497 39468 -2861 -44741 26358 65193 57601 30128 -21192
12566 -21192 -658 5833 -11533 -4601 52388 45505 13733 17202 -3934 17614 52370 40371
12554 40371 19137 13528 -4882 -22878 12805 48740 12676 24776 52907 34197 28554 5534
12542 5534 -3377 11506 33109 -21688 -41098 10356 53960 42054 46635 89122 90007 71247 48010
12529D8010l3263k6433j5136J0138j7354M3395K5162R22L9393l760l2625r4937
12517e6488l5877l202J9842M6255L5312J6027J6504k2092l3970j3160j1087L0890
12505a1046k0063m69n234O751l5752r307M2361L3633N3406L7037p679K338J5085
12492A01061o453n516L0538n2735m0309N6778K0965j3409k9805l2020k7835J7684
12480A8944q66j8400J3957j4267j5298j4313l9132r479N7684L6959q942j121K0561
12467B6287K4658n9793m1889O7289j201J575J8388P3067m3504j3757K1740J5667
12455H8527k5955k6243R172l9812n988k9457l0430M0751K6955r742k8424o685
12443c7331L9284O4797Q730K3611j7280j7635l053j439K0310m964L749o815P068
$$ plain form
12529 48010 14747 -11686 -26822 -16684 -34038 9357 34519 35441 74834 71074 38449 -56488
12517 -56488 -92365 -95567 -75725 -29470 5842 21869 38373 16281 -17689 -30849 -41936 -11046
12505 -11046 -31109 -31578 -36812 -30061 -65813 -75120 -32759 874 54280 91317 83638 85976 101061
12492 101061 94608 89092 119630 66895 26586 83364 104329 90920 61115 29095 1260 18944
12480 18944 18078 -322 13635 -632 -15930 -30243 -69375 -78854 -21170 15789 6847 5726 26287
12467 26287 50945 -8848 -50737 16552 15351 16926 35314 108381 64877 51120 72860 88527
12455 88527 62572 36329 45501 5689 -299 -29756 -60186 -19435 7520 -2222 -30646 -37331
12443 -37331 1953 66750 75480 99091 81811 64176 61123 59684 79994 75030 78779 71964 79032
12430G9032n3252n201K5914J2772M7634p918p303n3412n5662J2973l5334P3465
12418C3708J4932j6537n559K160l4318k5992J5391j1593j8492r117j9830K8683
12406d6564j5675k1072K1088J9741q200j0422n689J8511M0223O999k616L3796
12394C0120M727k1651l9710K0324J2320m045l9045r228P2671N0694j5930o7847
12382f600m8319N741j9812j8232N6847R0889K7881l9387m3506k2504L1819J5509
12370C0326K863p918K2200L489L0206j8145k1183n6945k8308J1463J924N0017
12358A9989j0271q8642L1375L3454k9686R572L0530K4038j1256j8688L8072N105
12346C3592j9104K3120M561p732j4516k9850k9859k6320L9052N1550Q7511M08
$$ plain form
12430 79032 25780 20579 46493 59265 106899 98981 91678 38266 -17396 -4423 -39757 33708
12418 33708 48640 32103 26544 28704 -5614 -31606 -16215 -27808 -46300 -55417 -75247 -46564
12406 -46564 -62239 -83311 -62223 -42482 -50682 -61104 -66793 -48282 -8059 -1060 -3676 30120
12394 30120 34847 13196 -26514 -6190 6130 2085 -36960 -46188 26483 77177 61247 -6600
12382 -6600 -54919 -49178 -68990 -87222 -30375 60514 88395 49008 5502 -17002 14817 30326
12370 30326 33189 25271 47471 50960 81166 63021 41838 -15107 -43415 -31952 -30028 19989
12358 19989 9718 -78924 -47549 -14095 -43781 -34209 -3679 20359 9103 -9585 28487 33592
12346 33592 14488 37608 42169 34437 19921 -9929 -39788 -66108 -27056 24494 112005 112413
12334A12413k0813k7204K0504K040m6862K844O2443l7510m1217k2965l5311k4607
12322e6245l0169K3129Q110J2379M5825M4405M4758j1134r687p3146m3782J0723
12310c4834m491M7577j985l3898j7798m226M4618M1887l7489o808M3548q290k4119
12297C692J7433l6469K5275l1763n4282K9962n800k5407l0213J5829N2580K8789
12285a0374j524l9161j7882j0826O054L9703k660N5417J8172K0690J8059K1628
12273I7296k9501R860n4986k9013L9343j0585l1928Q518k4787q5583K0017L9896
12261e1453L1751m0072R186k1047m1252L9542L2729j6002K3048K3198n066n1780
12249f7218J4917O1082N6415m5493k3897n424M9196L0709J772m2148L6959K8240
$$ plain form
12334 112413 91600 64396 84900 86940 40078 42922 105365 67855 26638 3673 -31638 -56245
12322 -56245 -86414 -63285 -55175 -42796 3029 47434 92192 81058 71371 -1775 -45557 -34834
12310 -34834 -39325 8252 6267 -27631 -45429 -49655 -5037 36850 -639 -7447 36101 27811 3692
12297 3692 21125 -15344 9931 -21832 -76114 -46152 -51952 -77359 -107572 -91743 -39163 -10374
12285 -10374 -11898 -51059 -68941 -79767 -73713 -34010 -36670 18747 36919 57609 75668 97296
12273 97296 67795 77655 22669 -6344 32999 22414 -9514 -996 -25783 -111366 -91349 -51453
12261 -51453 -19702 -59774 -50588 -71635 -112887 -73345 -40616 -56618 -33570 -10372 -15438 -67218
12249 -67218 -52301 8781 65196 19703 -4194 -9618 39578 70287 72059 29911 66870 95110
12237I5110L0223n5494k2627Q084n8452Q502P280p149M8855K427k0632o1552M608
12224b0817L5717J8715m4235l0641j9286K5576q074j7773j7309K0587M7603J5711
12212E774k6211j9454j4499j091N880K4224L7958J7088n057J1275k3332l3027
12200b0472j510n725q6306k3379Q1206K5623j9579k0728J6962j6313n6412K373
12188a24260Q079n792O2044M4664j4544Q964N090J5010k278j1236J3103K4168
12176B3012Q655m464J805k2718p3136J7632N1636K7439J4889l8217M234K6790
12164C7557p3326j780K5236K209p1127j6230N2499N8103l4524l8228K116M212
12152e3283K1500J7104N4217k7329k9667p435O7451k1611m7989K2330k3579R815
$$ plain form
12237 95110 125333 69839 47212 55296 -3156 5346 12626 5477 54332 56759 36127 -25425 -20817
12224 -20817 14900 33615 -10620 -41261 -60547 -34971 -43045 -60818 -78127 -57540 -9937 5774
12212 5774 -20437 -39891 -54390 -55481 -49601 -25377 12581 29669 24612 35887 12555 -20472
12200 -20472 -21982 -27707 -114013 -137392 -56186 -30563 -50142 -70870 -53908 -70221 -126633 -124260
12188 -124260 -116181 -121973 -59929 -15265 -29809 -20845 -15755 -745 -3023 -14259 -1156 23012
12176 23012 31667 27203 29008 6290 -66846 -49214 2422 29861 44750 6533 10767 37557
12164 37557 -35769 -37549 -12313 -10104 -81231 -97461 -44962 13141 -21383 -59611 -57495 -53283
12152 -53283 -31783 -14679 39538 12209 -17458 -24893 42558 20947 -27042 -4712 -28291 -18476
12140a8476N1780K6785l9171p1974L2602J919k0151q626K0890k860m2677P942
12128f2017R3344K6213l9960j02397M100O1775L7994k1023k9464q496m0074k2873
12116a02878K4745J2657N2550O2435l7943o0976J158k1975j4358J4566J3170J8428
12104c8421K8805L5383K6644l7164k4932l983l5643m6812K0370O5079l6058k5919
12092g2651P588M164L7438R157K487L3697L0547j6100l3027J651m180K1453N0191
12079G2415j9375o7012J1823J5843k1016q702K5261K1483l3408k3442P338K0791
12067A999L6074P1910K3581k0680k3460k8463m9196n4905P368K3575k51n830P1490
12054E3212j5097k767m3993m7655K7062K3521K4727J0374K3449j8546l3076k9453
$$ plain form
12140 -18476 33304 60089 20918 -51056 -18454 -16535 -36686 -45312 -24422 -27282 -69959 -62017
12128 -62017 31327 57540 17580 -84817 -80717 -18942 19052 -1971 -31435 -39931 -80005 -102878
12116 -102878 -78133 -65476 -12926 49509 11566 -49410 -48252 -70227 -84585 -70019 -56849 -38421
12104 -38421 -9616 25767 52411 15247 -9685 -13668 -49311 -96123 -75753 -10674 -46732 -72651
12092 -72651 -65063 -60899 -23461 -14304 -11817 21880 52427 36327 3300 4951 771 22224 72415
12079 72415 53040 -13972 -2149 13694 -7322 -16024 9237 30720 -2688 -26130 -18792 1999
12067 1999 38073 109983 133564 112884 89424 60961 11765 -43140 -35772 -12197 -12448 -18278 53212
12054 53212 38115 35348 -8645 -56300 -29238 -5717 19010 29384 52833 34287 1211 -28242
12042b8242k3372N688M0523k427N4K0436j8341K8186k3530l9481M647j2724l6428
12029h5011k1603L4236M4262j1706K4755P8160j2606m019j9164j7234k7162l8049
12017e5141k685M3542O1573l7479l945k520R739J7872N9240K6727J9172j1399
12005A24696p7673o0857q502J0745N05J3494L921k5810k1716L9298J1724P894
11993A7719p422J3773l5432k4794K5564K0198l891p125j3602K5553k7334M635
11981a2158j31P755j9283n1205K9334M0693O82k7912j3826j1771R673k8874O662
11968g0361Q668K9557l766j2781L1954M3207J9747n6479j4554n313J0518k3277
11956d2880M2955M7205k342p946j1358M5986o3545k2504k4271N9256L7063J2587
$$ plain form
12042 -28242 -51614 -45926 -5403 -7830 -7776 12660 -5681 22505 -1025 -40506 -35859 -48583 -85011
12029 -85011 -106614 -72378 -28116 -39822 -15067 63093 50487 46468 27304 10070 -17092 -55141
12017 -55141 -57826 -14284 47289 9810 5865 3345 13084 30956 90196 116923 136095 124696
12005 124696 47023 -13834 -22336 -11591 -11086 2408 6329 -19481 -41197 -1899 9825 17719
11993 17719 10297 24070 -11362 -36156 -10592 9606 5715 -1410 -15012 10541 -16793 -12158
11981 -12158 -12289 -4534 -23817 -75022 -45688 -4995 -4313 -32225 -46051 -57822 -48149 -77023 -70361
11968 -70361 -61693 -32136 -35902 -48683 -16729 26478 46225 -10254 -24808 -30121 -19603 -42880
11956 -42880 75 47280 44938 36992 25634 71620 8075 -14429 -38700 20556 57619 70206
11944G0206K3039k1194J7157k4304k326M0760K0266j1422L101l4575P829k2220
11932F6317m3534j9662P216k3298n099J2927L7879J7377n330M6209N132j9968
11920G6166k9462j245L722j9576J1934J8858L331J0565n98N299m6267k1469j51
11907A1107R982o3220j3005q351j032j3436J1073N1037K3116p095l1717K1811
11895i730J9036N418L0423j39q0762l1043L8797N6892N289J7330l2714k0087k6144
11882b7434l2849j7996M0646Q697P6792J6698m3327n7207P259K5699L4684r560
11870B2102j2638M077R28n797l950j0393l5199l0255L8276m10l4038l6720m827
11857a08844j354Q0281N9971L4429k3252k3357K5147q71l514j2172j5403J093
$$ plain form
11944 70206 93245 72051 89208 64904 62578 103338 123604 112182 115283 80708 88537 66317
11932 66317 22783 3121 10337 -12961 -18060 -5133 32746 50123 44793 91002 96134 76166
11920 76166 46704 45459 49181 29605 41539 60397 63728 74293 73695 78994 32727 11258 11107
11907 11107 21089 -42131 -55136 -63487 -64519 -77955 -66882 -15845 7271 176 -31541 -9730
11895 -9730 9306 14724 45147 45008 -35754 -66797 -28000 28892 34181 51511 18797 -1290 -27434
11882 -27434 -60283 -78279 -37633 -28936 47856 64554 21227 -35980 -28721 -3022 31662 22102
11870 22102 9464 13541 14469 8672 4722 -5671 -40870 -71125 -32849 -33259 -67297 -104017 -108844
11857 -108844 -110198 -29917 30054 64483 41231 17874 43021 42150 38636 26464 11061 12154
11845A2154J302j089K7592j8208k1633L1102k0195r948J1776K971K6240j3626
11833B8438L4230l2662o928p167k1516m8324K5494j3573K2665N0031J8766m4160
11821E294K6679N426r100l2822k0373j2211M6966L3816m5108n0766O021L3847
11809a2331J9682j5007R285P760M318K2807K1398N9993j2543n6625l2004J3158
11797B9891j1479J4695l5811q0396J7000K1562O6964k2395J7896j6052m4491j1788
11785e4404J6692M5969R550j703n411l8645N4299J905R035n9262m5236l606m661
11772g5478K0489j6945k5841K1154M6863J2843k4224Q691K9829J1965J8591l607
11760B4330m1307k2950j8212K8752K0973k8148j6417L9013J8752L5595Q347n168
$$ plain form
11845 12154 13456 12367 39959 21751 118 31220 11025 1077 12853 15824 42064 28438
11833 28438 62668 30006 23078 15911 -5605 -53929 -28435 -42008 -19343 30688 49454 5294
11821 5294 31973 37399 28299 -4523 -24896 -37107 9859 43675 -1433 -52199 -46178 -12331
11809 -12331 7351 -7656 1629 9389 13707 36514 57912 117905 105362 48737 16733 29891
11797 29891 18412 33107 -2704 -83100 -66100 -44538 22426 31 17927 1875 -42616 -54404
11785 -54404 -37712 8257 17807 16104 10693 -27952 26347 28252 37287 -21975 -67211 -70817 -75478
11772 -75478 -54989 -71934 -97775 -76621 -29758 -16915 -41139 -32448 -2619 9346 27937 24330
11760 24330 -16977 -39927 -58139 -29387 -8414 -36562 -52979 -13966 4786 40381 48728 43560
11748D3560j0364l5231k2950L86Q807J3585L8182M3546k7821j021k1893k8687
11736I9M0805K7279J9848O647m7842n2681m8201J0434K2079j3743N272n078J4891
11723b0191N2409L3546J4126n8707p0539j044J4867J4583L4313O8263q6j0810
11711G0730K2630k4769k744L2148o9196q5568L3155M6390M1601o8438l6611M9527
11699H855n759j1848j115j3134R591K0543J1764N3381l1065l7304Q324N4995k1420
11686D5808L432l0885P837L5631l8149l6979L481L5900L8973N127K2078J6293
11674A08547J0058k9416l257p0689n5769M303p1537p40M4305K3245K4332j6707
11662c3325k4105K4072j3032P426K4781r824n7029o744J1192K0224m950J3952
$$ plain form
11748 43560 33196 -2035 -24985 -24599 -15792 -2207 35975 79521 51700 50679 28786 99
11736 99 40904 68183 88031 94678 46836 -5845 -54046 -43612 -21533 -35276 -30004 -35082 -20191
11723 -20191 32218 65764 79890 21183 -49356 -50400 -35533 -20950 13363 81626 81540 70730
11711 70730 93360 68591 65847 97995 28799 -56769 -23614 22776 64377 -4061 -40672 8855
11699 8855 3096 -8752 -9867 -23001 -13410 7133 18897 72278 41213 3909 12233 67228 45808
11686 45808 49240 18355 26192 61823 23674 -13305 -9824 26076 65049 70176 92254 108547
11674 108547 118605 89189 85932 15243 -40526 -36223 -107760 -108500 -64195 -40950 -16618 -33325
11662 -33325 -57430 -33358 -46390 -38964 -14183 -24007 -81036 -87780 -76588 -56364 -61314 -47362
11650d7362M2420m208M3498J3977r701m6721J4683m97Q378k5319J8777L489j3191
11637a777p995J2995j012O150m453K3296J8748l0678k7802J0024J7145K6063p29
11624C9975n235K2326j3766K6025j5117K830j1214m2609J0247N139J2068r383
11612B1286P721l078m3471j7577j0575L6026M981L2804J5335o206k1390l4029
11600a8173k2929J9516K8271K229o398p181j2020j0663P394N2686K0043k2888
11588B9887o1751M107J6191k7181R779K2097K1452k4897K2420J5879p15l5233
11576g965J5821J509j736q3251j0649L9413M1202K166k9625k8573j3358M0152
11564c4894j9620J6544J0984K6626J9157J9898J7648j5543k7239J9277l9996K5101
$$ plain form
11650 -47362 -4942 -9150 34348 48325 38624 -8097 6586 6089 14467 -10852 7925 11414 -1777
11637 -1777 -9772 3223 2211 8361 3908 27204 45952 15274 -12528 -2504 14641 40704 39975
11624 39975 34740 57066 43300 69325 54208 57038 45824 3215 13462 18601 30669 21286
11612 21286 29007 25929 -17542 -35119 -45694 -9668 -4687 28117 43452 37246 15856 -18173
11600 -18173 -41102 -21586 6685 8914 2516 -4665 -16685 -27348 -19954 32732 52775 29887
11588 29887 -31864 -27757 -11566 -38747 -28968 -6871 14581 -10316 12104 27983 27268 -7965
11576 -7965 7856 9365 7629 -75622 -86271 -46858 -5656 -3490 -33115 -61688 -75046 -34894
11564 -34894 -54514 -37970 -26986 -360 18797 38695 56343 40800 13561 32838 -7158 17943
11552A7943J5971K2300L2736j0751m7138N034k261n2708m5207k7101O5288N0544
11540B4650j8242k1104R191j6744m4707r888N9542j4639j6099M0107O4752m5199
11528A1620k363p755n0309K0737M115J7438j6567o0898l9972L5579R720J6558
11516f2097m7666N117j606M584N022K5557J5553M5574o0063m1832P5355J8728
11504a7774L1511j9999j6838J1185J7548K0402l407L9989K2963k9942m8342J9582
11492B6878m0044n57p464j7242R709M1786l2216l4287J4994K1456K4927J0472
11480A8412N4536L511j4187K016k7315l551N03K2299L4665k375o5783l0053l8247
11467d5569K3807j399k3722L579k1386Q631J7870J6567L4079l0786p674o347M5545
$$ plain form
11552 17943 33914 56214 88950 78199 31061 36095 33834 -18874 -64081 -91182 -25894 24650
11540 24650 6408 -14696 -5505 -22249 -66956 -76844 -17302 -31941 -48040 -7933 56819 11620
11528 11620 9257 1502 -48807 -28070 -23955 -6517 -23084 -83982 -123954 -88375 -78655 -62097
11516 -62097 -109763 -104646 -106252 -101668 -96646 -71089 -55536 -9962 -70025 -111857 -36502 -17774
11504 -17774 13737 -6262 -23100 -11915 5633 26035 22628 62617 85580 55638 7296 26878
11492 26878 -13166 -13723 -21187 -38429 -28720 13066 -19150 -53437 -38443 -16987 7940 18412
11480 18412 72948 76459 62272 64288 36973 33422 33925 56224 90889 88514 22731 -7322 -45569
11467 -45569 -21762 -23161 -46883 -43304 -64690 -56059 -38189 -21622 12457 -18329 -26003 -32350 13195
11454A3195K125q8187J0864O513J0741R885K2709M2504j4020n4897J1113J5108
11442a2347J9522l565k4546o245R088l874l522J6785q0245l2084L6829k0462J4160
11429i0506N5542M6966r105m3555N8176M4246J6159O581j178p1150o6430K1302
11417c2952m34J5555K0896J4923L2514M6648J3169j6709l6958p655l8558r574
11405H65L0054K725m2216J2088j7945O517N239M0147p310j7572K9492o587K8624
11392F4121K5718l0697m8940o4067M0441M1306k8252l1704Q800N534K5091L5804
11380D3155K3682l8842n9383r635k1367k8632P4134K4012m2689k7281K4377p440
11368d5909K2193K8355j9656k0288K2055P4733L6702l1972k4720l3585k4018k5722
$$ plain form
11454 13195 15320 -72867 -62003 -55490 -44749 -34864 -12155 30349 16329 -38568 -27455 -12347
11442 -12347 7175 3610 -20936 -27181 -18093 -21967 -25489 -8704 -88949 -121033 -84204 -104666 -90506
11429 -90506 -34964 12002 2897 -40658 17518 61764 77923 84504 83326 12176 -54254 -32952
11417 -32952 -33386 -17831 3065 17988 50502 97150 110319 93610 56652 48997 10439 865
11405 865 30919 33644 -8572 3516 -14429 -7912 -2673 37474 30164 12592 42084 35497 64121
11392 64121 89839 59142 10202 -53865 -13424 27882 -370 -32074 -23274 -17740 7351 43155
11380 43155 66837 27995 -31388 -41023 -62390 -91022 -16888 7124 -35565 -62846 -38469 -45909
11368 -45909 -23716 4639 -15017 -35305 -13250 61483 98185 66213 41493 7908 -16110 -41832
11356d1832o302q968j249M6712N9254m2023p2244j1201M5258J4716J5660J2995
11344A0776n68n9816k637l398L0087k1590n5028l7424l090M5168L1648K4926R0270
11331D9324N7425j6383o3089j3735P1667l527k070l8177n1830j6019J522m689
11319b9581J0524k18j7578l6889j4772J2732m507R872K4038K6820j3114k6997
11307e9670j4717j3649k2138J5724j2647J6343M3640K466k6100m726J0957L7216
11295b7301L2276j9132q842l2444j8000K1702K1528K4915j0244J2983m882J0164
11283B723K022m821n2315L107J6151n960k7669l437m888K8960K9465j3209J0920
11270a8951n465p136O799P5042K4450l2454n4517n2034j397M2033j6501P992k624
$$ plain form
11356 -41832 -48134 -57102 -58351 -11639 47615 5592 -66652 -77853 -32595 -17879 -2219 10776
11344 10776 10208 -49608 -52245 -55643 -25556 -47146 -102174 -139598 -142688 -97520 -65872 -40946 49324
11331 49324 106749 90366 27277 13542 85209 81682 79612 41435 -10395 -26414 -24892 -29581
11319 -29581 -19057 -19275 -36853 -73742 -88514 -75782 -80289 -70417 -46379 -19559 -32673 -59670
11307 -59670 -74387 -88036 -110174 -94450 -107097 -90754 -47114 -44648 -70748 -75474 -64517 -27301
11295 -27301 4975 -14157 -22999 -55443 -73443 -51741 -30213 -5298 -15542 -2559 -7441 2723
11283 2723 4745 -76 -52391 -49284 -33133 -39093 -66762 -70199 -75087 -46127 -16662 -29871 -18951
11270 -18951 -24416 -31552 -24753 50289 74739 42285 -12232 -64266 -65663 -23630 -40131 -32139 -34763
11257c4763k465K0239L1898K061L975J9598N129J1037l1793k0382J7568L1194
11245E3296m3194k2209L1023K3067j4394p815p229P122o84R063r960j9975L2845
11232C0956O54r532j2164k9752k9067j6697l0422J542J7570K1210N0014K3131
11220A7443j3472l1325L1847J973j4523k7702P146P1872K7879L117L8550J9418
11208A32223o1099k9269J2447K1280l4304l9142P906j0899k6918L4933k6548k0654
11196d0044L4839M4865j2909j8406j7233j0891K2365L1995j0605J1818l1418Q101
11184A2477P051O9753j6662p4479k270k465l5045k953P0180J736n0473j1169J5447
11171a8872k5686k2815k7592k4759R6113O5920r550R969k6648j5457o251l63K8
$$ plain form
11257 -34763 -37228 -16989 14909 16970 20945 40543 45672 56709 24916 4534 22102 53296
11245 53296 10102 -12107 18916 41983 27589 19774 12545 19667 18983 28046 18086 -1889 30956
11232 30956 31610 22078 9914 -19838 -48905 -65602 -96024 -94482 -76912 -55702 -5688 17443
11220 17443 3971 -27354 4493 6466 -8057 -35759 -28613 43259 71138 74255 112805 132223
11208 132223 71124 41855 54302 75582 41278 2136 10042 -857 -27775 7158 -19390 -40044
11196 -40044 -5205 39660 26751 8345 -8888 -19779 2586 34581 23976 35794 4376 12477
11184 12477 19528 89281 72619 -1860 -4130 -6595 -41640 -44593 25587 27323 -23150 -34319 -18872
11171 -18872 -44558 -67373 -94965 -119724 -23611 42309 32759 42728 16080 623 -5628 -5991 -5963
11158e963j6382l7660p455O665m4493N1959m681J9697L4609k166n6120J3169L5873
11145a2948P708l8593k9403K6557K0180K4024p647k857n646J4081m436J6617L1155
11132C8792O663n9358m9503J884L1889N5899J9606L647L578n9045p1161k3489
11120a00598O528K1134M801L6639J9431L0239J8317k6928k3857p184l2443L079
11108e0842N5093k9577n172j5455k0110K0959M172j0875L9332J5141P558q212
11096B012K1774K378m8427J584J1420l236K3312M37L396K3937K5346m4185l0238
11083a0490l2574l074Q258K6811N1014J238l3176k2172m4766k8571J3151J7396
11071e6955l9996j1908l891K5289J3576K0230n1567K0105Q6070J6502n3721m4960
$$ plain form
11158 -5963 -22345 -60005 -67460 -60795 -105288 -53329 -58010 -38313 -3704 -5870 -61990 -48821 -12948
11145 -12948 -5240 -43833 -73236 -46679 -26499 -2475 -10122 -12979 -18625 -4544 -8980 7637 38792
11132 38792 45455 -13903 -63406 -61522 -29633 26266 45872 49519 53097 -5948 -77109 -100598
11120 -100598 -94070 -72936 -68135 -31496 -12065 18174 36491 9563 -14294 -21478 -53921 -50842
11108 -50842 4251 -25326 -30498 -45953 -66063 -45104 -40932 -51807 -12475 2666 10224 2012
11096 2012 23786 26164 -22263 -20679 -9259 -12495 10817 11254 14650 38587 63933 19748 -10490
11083 -10490 -43064 -46138 -37880 -11069 39945 41183 8007 -14165 -58931 -87502 -74351 -56955
11071 -56955 -96951 -108859 -112750 -87461 -73885 -53655 -105222 -85117 953 17455 -36266 -81226
11059h1226J9789j4454K8496M2306k371Q740J4865J9892L7026O877k4055l7574
11047A8311j2051K1607n888l5443n6116j4137L6034L2409K3460k2954k3495k3433
11035f1696j9334k7016N488R4448L0075L4663K6748p1304q472j2079J459K436
11023d584j2245N461j8193k2379K2564O784k794L9887j1399N3949L4031k4316
11011F6766q637k9068K7614j3605L1350K978n8422k8496J3818J3814j4305M6611
10999E0418M280m9261l6817j2131j2509o832L1036j6133j630O589L9172J5040
10987A1222m3119j5313l1895j845N8160L2716j0647j825K1110m1681l8719P4653
10975A2817K107n883M80K2337J9911M4670l4317j3977k6380m1447o725k2305L3547
$$ plain form
11059 -81226 -61437 -75891 -47395 -5089 -7460 1280 16145 36037 73063 79940 55885 18311
11047 18311 6260 27867 21979 -13464 -69580 -83717 -47683 -15274 8186 -14768 -38263 -61696
11035 -61696 -81030 -108046 -102558 -8110 21965 56628 83376 12072 3600 -8479 -7020 -4584
11023 -4584 -16829 -11368 -29561 -51940 -29376 -22592 -25386 14501 3102 57051 91082 66766
11011 66766 58129 29061 56675 43070 74420 77398 18976 -9520 4298 18112 3807 50418
10999 50418 54698 5437 -31380 -43511 -56020 -62852 -31816 -47949 -49579 -42990 -3818 11222
10987 11222 -31897 -47210 -79105 -80950 -22790 9926 -721 -2546 18564 -23117 -61836 12817
10975 12817 14924 9041 9521 31858 51769 96439 62122 48145 21765 -19682 -26407 -48712 -15165
10962a5165M4248k9354n731L7788k3656L203L7969k0128l7113q833J2783l6233
10950d0222o0844M4059K5885J2144j774J8872J8293J5937N3176O629l5877k3419
10938C2859n0603q7811M140P6926M1290l469m6418o0619j5314L546j553M9822
10926e7204L8010r307Q581j1412J7705R009J6239O199p403m0595L387K3965k5932
10913b8758m5646m583Q274M0060N9580j1128j9563K6593p66l3509j7375k0666
10901d7487k2141J7990j9214k2363J01865Q5258P426k9212j2544r028l2581m2698
10889b4729n2813K0255N2297n362o595k2994n6512J5080k226K5526J9899J154
10877c7020K9202k5994J556j6137K5244m570k1106J2439K1254J8910K9333L5447
$$ plain form
10962 -15165 29083 -271 -6002 31786 8130 11333 49302 29174 -7939 -16772 -3989 -40222
10950 -40222 -101066 -57007 -31122 -18978 -20752 -1880 16413 32350 85526 92155 56278 32859
10938 32859 -17744 -105555 -101415 -24489 16801 13332 -33086 -93705 -109019 -105473 -107026 -57204
10926 -57204 -19194 -28501 -19920 -31332 -13627 -4618 11621 17820 10417 -30178 -26791 -2826 -28758
10913 -28758 -74404 -78987 -70713 -30653 28927 17799 -1764 24829 24063 -9446 -26821 -47487
10901 -47487 -69628 -51638 -70852 -93215 8650 93908 101334 72122 59578 50550 17969 -24729
10889 -24729 -77542 -57287 -4990 -10352 -16947 -39941 -96453 -81373 -83599 -58073 -38174 -37020
10877 -37020 -7818 -33812 -32256 -48393 -23149 -27719 -48825 -36386 -15132 3778 33111 68558
10865F8558n5471q8795M5961P5764k3955k2472j735Q997k0437k1716m6460K7088
10853e4673J7023O1377P456L4184M4660j2870n6195r191J6271L2811k3585n194
10841E2074r388j3293k7345o2641m86M2759J0959M140p451N900j1838o2456J5311
10828f3755p539M9760L2502k0308l112k2434p210K8228K1315o5116J7007N3241
10816A2579m1055m5774O4774Jn3716l533k979j8194M9291O9206l5413j5669Q321
10803a2161N496k7585K4763K0058l555m9607O066R1449Q980Q605J371n53m4112
10790B9215j537J1607k5332k2393Q0494j5203p9358j3878L8795N1165L7702J1535
10778A02812l4389p8796o0630m8647K5772L1176M6956J8562J2773l5741q305m9157
$$ plain form
10865 68558 13087 -75708 -29747 46017 22062 -410 -2145 6852 -13585 -35301 -81761 -54673
10853 -54673 -37650 23727 31183 65367 110027 97157 40962 31771 48042 80853 57268 52074
10841 52074 42686 29393 2048 -60593 -61079 -18320 -7361 -3221 -10672 -4772 -16610 -79066 -63755
10828 -63755 -71294 -21534 10968 -9340 -12452 -34886 -42096 -13868 7447 -57669 -40662 12579
10816 12579 -28476 -74250 -9476 -9475 -63191 -66724 -69703 -87897 -38606 30600 -4813 -20482 -12161
10803 -12161 -6665 -34250 -9487 10571 7016 -42591 -36525 54924 63904 72509 73880 73327 29215
10790 29215 27678 39285 13953 -8440 72054 56851 -22507 -36385 2410 53575 91277 102812
10778 102812 68423 -10373 -71003 -119650 -93878 -62702 -15746 2816 15589 -20152 -28457 -77614
10766g7614l1991J3742L8849O5266p000o8791j5425N6112K0936K0228J0310J1801
10754C6423k650j6982M0863J484l259j128m5460k2863J8508Q083q601q099r689
10741a3370Q71k2301k1613N094k6692m310N0909L8687l6466j4120L53L105J1173
10728b8680J2776k6655k4159L6269Q548q725K2669m395p630K1895j2815l2906
10716d3808l971l0033M2137L6920l9178K3421M4090J2386M892P576O690j980p071
10703E2071o534k3803j9924k547J8055J3483m0505k5370N1048N7239K9054Q4024
10691A86291N5472J19286J29562R4119n5803j94719q9896p456n7511m0891l227
10680A35227j0137J0623K2628L1774l5277o7542Q886J4830l8268j2635K7474N690
$$ plain form
10766 -77614 -109605 -95863 -57014 8252 1252 -67539 -82964 -26852 -5916 14312 24622 36423
10754 36423 33773 16791 57654 59138 55879 54751 9291 -13572 4936 13019 4418 -3681 -13370
10741 -13370 -12499 -34800 -56413 -51319 -78011 -82321 -31412 7275 -29191 -43311 -42958 -39853 -28680
10728 -28680 -15904 -42559 -66718 -30449 -21901 -30626 -7957 -12352 -19982 1913 -10902 -43808
10716 -43808 -47779 -77812 -35675 1245 -37933 -14512 29578 41964 46856 54432 61122 59142 52071
10703 52071 45537 21734 1810 -737 17318 30801 -9704 -35074 15974 73213 102267 186291
10691 186291 241763 361049 490611 584730 528927 334208 244312 236856 179345 138454 135227
10680 135227 125090 135713 158341 190115 154838 87296 96182 111012 72744 60109 87583 93273
10668I3273L9133P058j668o1197j064o438m1020m2090L5396N02l3486m840j6675
10655c3116l7360M6586M2603K4666N4474J0765m389J0553n8851o9784l1741R959
10643c5635J1989L9493j1672j3043L774R885k9916k7799J3279K8164j9467L7472
10631F524m021j04j8737m8483j7909O2511Q7629P1484N458q0220k5711m1072m4868
10618d7519n546j0409K0168l5498L5182J5356o4878j199N7105K6740r793J9067
10606a224K8739K3479N073l3252j8612q192l7425K3899J2516m509M1410L1232
10594F3134K5682K0210K6009J6030k0663K8218L0415k6190l5018l1609l6542k270
10582E7406m5842j6052l6626N4547j9211n1146j6753K9882N7175k7062j1298j8602
$$ plain form
10668 93273 132406 139464 137796 76599 75535 69097 28077 -14013 21383 21885 -11601 -16441 -33116
10655 -33116 -70476 -23890 18713 43379 97853 108618 104229 114782 55931 -13853 -45594 -35635
10643 -35635 -23646 15847 4175 -8868 -5094 4791 -25125 -52924 -39645 -11481 -30948 6524
10631 6524 2503 2399 -16338 -64821 -82730 -20219 67410 138894 144352 64132 38421 -2651 -47519
10618 -47519 -53065 -63474 -43306 -78804 -43622 -28266 -93144 -94343 -37238 -10498 -20291 -1224
10606 -1224 27515 50994 56067 22815 4203 -3989 -41414 -17515 -4999 -9508 31902 63134
10594 63134 88816 109026 135035 151065 130402 158620 189035 162845 127827 96218 59676 57406
10582 57406 11564 -4488 -41114 13433 -5778 -56924 -73677 -43795 13380 -13682 -24980 -43582
10570d3582M27J8253J008j216l1K3642L3161J23Q87m660N1254r385j00981j821
10556c2921J9995O8181M493J5260q571Q746j5103k2504k4754m980Q616L2991m2510
10543F939n1054j6288L7020M7002k3221l064L893M5587j5621m5543k0204M1339
10531F785L0259Q199j2281l2202K8880J872l0752n6349m212K7592Q579K9821K5205
10518C1396L3582J7631l2077M210l5152k3688l7163P641Q88K2741Q6842j6738
10506F0113N4738n42m0976k2388K2739j5868m4137n3777L2174M3491k2855k7258
10494a4546l798k9706j7654o431n4575J2335J09393N5506j729k9364k334l0444
10482a3347j2615M1061N1264j6095J4601o0963J0598L2707M569n6052k3746K0942
$$ plain form
10570 -43582 -43155 -24902 -23894 -25110 -25141 -1499 31662 31785 32672 28012 79266 69881 -31100 -32921
10556 -32921 -12926 55255 59748 75008 66437 75183 60080 37576 12822 7842 16458 49449 6939
10543 6939 -44115 -60403 -23383 23619 398 -2666 1227 46814 31193 -14350 -34554 6785
10531 6785 37044 45243 32962 760 29640 31512 760 -55589 -59801 -32209 -23630 6191 31396
10518 31396 64978 82609 50532 54742 19590 -4098 -41261 -33620 -32732 -9991 76851 60113
10506 60113 114851 114309 73333 50945 73684 57816 13679 -40098 -7924 35567 12712 -14546
10494 -14546 -18344 -48050 -65704 -72135 -126710 -114375 -4982 50524 48795 19431 17097 -13347
10482 -13347 -25962 15099 66363 50268 64869 3906 14504 47211 51780 -4272 -28018 -7076
10470g076J1449j4615K300J7232L2287K1663j9019k0310n569J1704K6917M1380
10458I8343l6173q9903l3784j6330m0210m6755L6647P2364R210M1020m32p2640
10446g8643J1119O6904k4384L1798J1150j0112l6746q9052k7944K1761L6651Q4258
10434c240K1164j9661L1593l8425l8211o508L7373J3280J1647m6033N346O9360
10422C7685M206o2985K5583p58m1221m6236L470k2793m149M0098j9443k8701N6121
10409e9123O3652L6223m031j6499P258l8699l5952j3956l2263K7691K2520k0894
10397f4073j3629n805N6432K7212l5802J4876L0765r515K1197k3119m4228J7784
10385b7905O332k2651J2455O870j0745O7337N5101j17225n9789j3982K5701M0769
$$ plain form
10470 -7076 4373 -10242 -7942 9290 41577 63240 44221 23911 18342 30046 56963 98343
10458 98343 62170 -27733 -61517 -77847 -118057 -164812 -128165 -55801 -46591 -5571 -6003 -78643
10446 -78643 -67524 -620 -25004 6794 17944 7832 -28914 -117966 -145910 -124149 -87498 -3240
10434 -3240 17924 -1737 29856 -8569 -46780 -53288 -15915 -2635 9012 -37021 -31675 37685
10422 37685 41891 -21094 4489 3731 -37490 -83726 -80256 -103049 -107198 -67100 -86543 -115244 -59123
10409 -59123 4529 40752 36721 20222 27480 -11219 -47171 -61127 -93390 -65699 -43179 -64073
10397 -64073 -77702 -83507 -27075 137 -35665 -20789 9976 461 21658 -1461 -45689 -27905
10385 -27905 -21573 -44224 -31769 -24899 -35644 31693 86794 -30431 -90220 -104202 -78501 -37732
10373c7732O6347J3325j8060k5797j5727l4584k1828N1013N1529K2417l4400K2297
10361C8800K5180n8357p3613n1155N2963O8651p455j5467L589j5880j4404k3482
10349g0630m37L245L4506J0973K7752Q577l0206o0107m3799K6278R4089J9609
10337A9850q9429M8995j5820p6140K1916O3591K7614j7942J8805O468k2471J2601
10325a962m419k6796K382l7082j8318K9066N5845L3414p509J6977k231n090J4165
10312D8442j5484l1812J9171l3446m9688J9184M0911L2279j5144k869j3918J2098
10300I724k5510K2851n646j6286m2764J0321j7012K6104J1125l4538n6085K5910
10288i1806L0800K6088M9888N583j0334N1629K0248J568m4528l9862n1094J932
$$ plain form
10373 -37732 28615 41940 23880 -1917 -17644 -52228 -74056 -23043 28486 50903 16503 38800
10361 38800 63980 5623 -67990 -119145 -66182 2469 -4986 -20453 -16864 -32744 -47148 -70630
10349 -70630 -71067 -67822 -33316 -22343 5409 13986 -16220 -76327 -120126 -93848 241 19850
10337 19850 -69579 -20584 -36404 -112544 -90628 -27037 577 -17365 1440 7908 -14563 -1962
10325 -1962 -6381 -33177 -30795 -67877 -86195 -57129 -1284 32130 24621 41598 39367 34277 48442
10312 48442 32958 1146 20317 -13129 -62817 -43633 -2722 29557 14413 11544 -2374 9724
10300 9724 -15786 7065 1419 -14867 -57631 -47310 -64322 -38218 -27093 -61631 -117716 -91806
10288 -91806 -61006 -34918 14970 20553 10219 61848 82096 83664 39136 -726 -51820 -49888
10276d9888j5954p219O1573N0768N3076K687p543j1525l9492j2282R522j5617
10264A8106m8894N5722K2732m2466L766l8575k7859L8890J288k892p999j2853
10252d1034P075M294P796J8228k4072K5105R444k2476m5385J0734K0343L0221
10240B73L1542l4922p052L8432o685k4496L7622N0940J1851j3488O76J1164J3432
10227A09289k2961k0030L1829J778k1438J1584l250k6482n0837j4890M0030R31
10215C5553J3011k3707l46q3225j3764L3742N2774r217m2454o233j0153K0513
10203c3506L6918n98O222N479l7777n014J8690m2095R590j324q137M100M3178
10190d274K3222K82L874K4937R634m9695l9916N157J5719k8842j3326K4098M0563
$$ plain form
10276 -49888 -65842 -73061 -11488 39280 92356 95043 87500 75975 36483 24201 33723 18106
10264 18106 -30788 24934 47666 5200 8966 -29609 -57468 -18578 -17290 -20182 -28181 -41034
10252 -41034 -33959 -29665 -21869 -3641 -27713 -2608 6836 -15640 -61025 -50291 -29948 273
10240 273 31815 -3107 -10159 28273 21588 -2908 34714 85654 97505 84017 84693 95857 109289
10227 109289 86328 66298 98127 99905 78467 90051 86801 60319 9482 -5408 34622 35553
10215 35553 48564 24857 24511 -58714 -72478 -38736 14038 4821 -37633 -43866 -54019 -33506
10203 -33506 3412 2814 9036 14515 -23262 -28276 -9586 -51681 -42091 -43415 -51552 -47452 -4274
10190 -4274 18948 19230 23104 48041 57675 7980 -31936 -26779 -11060 -39902 -53228 -29130 11433
10177A1433L6653J6108l5270m539k7935N7459M5883o2915q1959j6993M9411K8442
10165A5778J054j0981k6725n692K0312l2124K350n346l5597j1222L542J1935j2208
10152h4924L8735M2084K7916o5310l7832N6287L2643j9809k2496k5637K1080Q2405
10140D5142N7955m9080R244K6481K2300n0800l1315m8373k7223k2738o693Q5617
10128A0517j155n7219m1792J3160J5562N1345J2507J3248l4117J0853N0176L9105
10116H2190m398r018k7046m0335m8755m9367J7199K5536N8881O7622j3949n1664
10104F896J7289L3082J2522m6800M5095M5900n0566n8579k5941L4572N2424j2927
10092E2967k1832k8429K0951o09M6291J5626J0556K1627k4690r779m0984o1835
$$ plain form
10177 11433 48086 64194 28924 24385 -3550 53909 99792 36877 -45082 -62075 -12664 15778
10165 15778 16832 5851 -20874 -26566 -6254 -38378 -36028 -41374 -76971 -88193 -84651 -72716 -84924
10152 -84924 -46189 -4105 23811 -41499 -79331 -23044 9599 -10210 -32706 -58343 -37263 45142
10140 45142 103097 54017 63261 89742 112042 61242 29927 -18446 -45669 -68407 -75100 10517
10128 10517 9362 -47857 -89649 -76489 -60927 -9582 2925 16173 -17944 -7091 43085 82190
10116 82190 77792 68774 41728 1393 -47362 -96729 -79530 -53994 4887 72509 58560 6896
10104 6896 24185 57267 69789 22989 68084 113984 63418 4839 -21102 13470 65894 52967
10092 52967 31135 2706 23657 23048 69339 84965 95521 117148 92458 82679 41695 -20140
10080b0140j6259K5836J5846K3430N930L7918k5685k4575J2512j5690k1682n1827
10068e4386L053J2128Q317J7423p564r304K515N134L7628K042K3538K0289J9036
10055G9849q5501j9771L3764P043j5948l718J646m9588k8908m6391K4701P0897
10043c1925k2351m5263J1962j2203K7911O3821p690l3447R894M4366M797j0493
10031f21j3185p897K7350L1633m4880Q947Q581J835R427l1830M169L8280L1963
10018F3772n7191n4939q554Q701J711m4394j7503L5575O751M8913L6303J5587
10006C4732L5569N625N034n0353k7700k9396j1677P454k145J5067M1424Q000n4608
9993b2974M017N7542L1770k4861J7273j5525j7132m284O918l6304M8934j5377
$$ plain form
10080 -20140 -36399 -10563 5283 28713 34643 72561 46876 22301 34813 19123 -2559 -54386
10068 -54386 -51333 -39205 -30888 -13465 -21029 -30333 -27818 -22684 14944 16986 40524 60813 79849
10055 79849 -5652 -25423 8341 15384 -564 -4282 -2636 -52224 -81132 -127523 -102822 -31925
10043 -31925 -54276 -99539 -87577 -99780 -71869 -8048 -15738 -49185 -39291 5075 9872 -621
10031 -621 -13806 -21703 5647 37280 -7600 1347 9928 11763 21190 -10640 -6471 31809 63772
10018 63772 6581 -48358 -56912 -48211 -46500 -90894 -108397 -72822 -66071 -17158 19145 34732
10006 34732 70301 75926 80960 30607 2907 -26489 -38166 -30712 -32857 -17790 23634 31634 -22974
9993 -22974 -18957 38585 70355 45494 62767 47242 30110 25826 32744 -3560 45374 29997
9981B9997k2308j4163J4373j8709m893L8574m3279m6448M839J7685j3480K7762
9969c0050J086J4867k4974J7825J0646M0374l5890n9163J0850K664J1264K371
9957c8130j080J944K7406K3099k9267M4945K3458m0955J3232J128r404R279o865
9944A8790m83M1755r970k8711K8734q700p211L533m1753J624K312n8662k7340
9931h6082r442R577O8200N4316J0421J7076n091l5647n9520k9960M8168M2118
9919B4134N446l3030m8421Q84L9375L9777J7675n1970l3924K2302j4297q21J9344
9906a3526J107j6125r148Q460J4896J212L6344K4829j7885J7140J8361q971l7241
9893A9453N2649K0195l9354p7812m8961n604K2532L9176J7380K3434J057m8300
$$ plain form
9981 29997 7689 -6474 7899 -10810 -15703 22871 -20408 -66856 -62017 -44332 -57812 -30050
9969 -30050 -28964 -14097 -39071 -21246 -10600 29774 -6116 -65279 -54429 -51765 -40501 -38130
9957 -38130 -39210 -37266 -9860 13239 -16028 28917 52375 11420 24652 25780 16376 25655 18790
9944 18790 18307 60062 50092 21381 50115 41415 34204 37737 -4016 -2392 -80 -58742 -86082
9931 -86082 -95524 -85947 -17747 36569 46990 64066 58975 23328 -36192 -66152 -17984 24134
9919 24134 29580 -3450 -51871 -50987 -11612 28165 45840 -6130 -40054 -17752 -32049 -32870 -13526
9906 -13526 -12419 -28544 -37692 -29232 -14336 -13124 23220 48049 30164 47304 65665 56694 19453
9893 19453 72102 92297 52943 -24869 -73830 -79434 -56902 -17726 -346 23088 24145 -24155
9881b4155q833M5254L8960l1591q0180J2372R3553L7389k8083m5454J741P242
9869A8215M0947j9686K1347j6289n9996j3376L1178N8965k2157P040k8464k8877
9857a1153o4908o6365M1494M7151M5120K1157j8600K8626L6911r188m6670k4879
9845b1304Q281M4175K1238o4048k0630K7628K4284j9875k7254K5201O432k0228
9833a6100N1991r041k4115J5986N2169P017k6176k3937L4566j5651J6660J4360
9821G7729J585k0757l8016M5576j1475k4245j2896r021l4229Q803j6294n4493
9809h7733m6295P45o918L3225O4018j7693K0762N0335K3641k4399m8480j7658
9797e6450K3550O704n756k3809P979P409j8059M8999K0072N0621L3376m3420q1143
$$ plain form
9881 -24155 -32988 12266 51226 19635 -60545 -48173 45380 82769 54686 9232 10973 18215
9869 18215 59162 39476 60823 44534 -15462 -28838 2340 61305 39148 46188 17724 -11153
9857 -11153 -76061 -142426 -100932 -53781 -8661 12496 -6104 22522 59433 50245 3575 -21304
9845 -21304 -13023 31152 52390 -11658 -32288 -4660 19624 -251 -27505 -2304 4128 -16100
9833 -16100 35891 26850 2735 18721 70890 77907 51731 27794 62360 46709 63369 77729
9821 77729 79314 58557 20541 66117 54642 30397 17501 8480 -25749 -16946 -33240 -87733
9809 -87733 -134028 -133283 -140201 -106976 -42958 -60651 -39889 10446 34087 9688 -38792 -56450
9797 -56450 -32900 -26196 -31952 -55761 -47782 -40373 -58432 -9433 10639 61260 94636 51216 -29927
9784b9927j8788K7889K0428j7232J1016m4463j1446K5284N2074P575J6318l1661
9772G067l4714L9888L7140o188n2957l2125J6008k4448o5733K2596L8665j1519
9760f6320K9531K6269J5606Q340k3778J4243j6471l8986m859p60j0819J9115O3534
9747A4645r878j7370J837k7477j7127j885L8970J5133m3357j9760J79L7370M6321
9734A7601m532J6849O847r461q447J252L9733J4072j0579j2202j3479j6471l0342
9721i159J7733j059j5015J3602m2530P763k3154k7408J7372R743L5609L216K6617
9708A3330K153M2934l3341j5636o457K377l24K4513J7576k0370j1992n9019j0184
9695e4440M0223n515K3232j1335j1622l437j4580j8349k2530j8877K8671J0404
$$ plain form
9784 -29927 -48715 -20826 -398 -17630 -6614 -51077 -62523 -37239 14835 22410 38728 7067
9772 7067 -27647 12241 49381 43193 -9764 -41889 -25881 -50329 -116062 -93466 -54801 -66320
9760 -66320 -36789 -10520 5086 13426 -10352 3891 -12580 -51566 -56425 -57185 -68004 -48889 14645
9747 14645 4767 -12603 -10766 -38243 -55370 -57255 -18285 -3152 -46509 -66269 -66090 -28720 17601
9734 17601 13069 29918 36765 27304 18857 20109 59842 73914 63335 51133 37654 21183 -9159
9721 -9159 8574 7515 -7500 6102 -36428 -28665 -51819 -79227 -61855 -52112 -16503 -13287 13330
9708 13330 15483 58417 25076 9440 2983 5360 5036 29549 47125 26755 14763 -44256 -54440
9695 -54440 -14217 -19732 3500 -7835 -19457 -22894 -37474 -55823 -78353 -97230 -68559 -58155
9683e8155L4501K3188R360q698K6737o613K4220L946j5198p596k5112m1450K1474
9670a9396P237m2596j1568k0444l76L190j5829J8300O1926k963n6617J3263L3688
9657c2185l4660r661J2602j5494k8078J0694L7223M19K1474K0558J8837Q568n6378
9644d6081L8502K5542J6986k3691n9712J7637N4086L6129Q644l9346K0254J5754
9632F4704m7524l7259m985K4917Q425l3184l5461j1605M9872K4207M0665J9894
9620F2666m1473n3991r8632k4549O509O0588K9459j3179N2441p72m754K3959J3728
9607A2000l0972o642K3940J453j075k5251L1823L478k1763R490M459k4601q191
9594c1852J1791K6870K3886j9400m0871K6239J2433j3337l5402P778k2612l2117
$$ plain form
9683 -58155 -23654 -466 8894 196 26933 20320 44540 48486 33288 25692 580 -40870 -19396
9670 -19396 -12159 -54755 -66323 -86767 -87143 -83953 -99782 -81482 -19556 -22519 -79136 -65873 -32185
9657 -32185 -66845 -76506 -63904 -79398 -107476 -96782 -59559 -59140 -37666 -17108 1729 10297 -46081
9644 -46081 -7579 17963 34949 11258 -48454 -30817 23269 59398 68042 28696 48950 64704
9632 64704 17180 -20079 -25064 -147 8278 -24906 -60367 -71972 -22100 2107 42772 62666
9620 62666 21193 -32798 -131430 -155979 -149470 -88882 -59423 -72602 -20161 -20933 -25687 -1728 12000
9607 12000 -18972 -25614 -1674 -221 -1296 -26547 5276 8754 -13009 -3519 940 -23661 -31852
9594 -31852 -20061 6809 30695 11295 -29576 -3337 9096 -4241 -39643 -31865 -54477 -86594
9582h6594M759j0371L3584j3018P933J2911j6997J2230l48M2691L9602Q444j4280
9569B0546l4245o6045m4299K2491M7788N874l7516o847L7983K5850p396O104J8181
9556a1531J1880J8587o06j5287M334l1632k0051l935L2405K1508n9860k4079J7859
9543f0408K4969m891k4019K0153J4956k2295J9807N2796O059m7331L590k4230
9531d0844J0076r432n930J5639N879K100k3718l123M6429J9771k4992l3355M8925
9518G425L7141p381l0219l1525K5062L3874k9023n2195k0889Q108N5258J2918
9506H554j2189N9154P0398j4729o4861k4173k3762l738L0809J4274J8006k5628
9494C2115j5909l9300j5233J5767l5154n855j6721k3807K9213K6138n123l7737
$$ plain form
9582 -86594 -81835 -92206 -58622 -71640 -63707 -50796 -67793 -55563 -55911 -13220 26382 34826 20546
9569 20546 -13699 -79744 -124043 -101552 -53764 -47890 -85406 -92253 -54270 -28420 -35816 -29712 -11531
9556 -11531 349 18936 18330 3043 7377 -24255 -44306 -48241 -15836 5672 -54188 -78267 -60408
9543 -60408 -35439 -40330 -64349 -44196 -29240 -51535 -31728 21068 27127 -20204 -16614 -40844
9531 -40844 -30768 -40200 -46130 -30491 -24612 -22512 -46230 -49353 -2924 16847 -8145 -41500 7425
9518 7425 44566 37185 6966 -24559 503 34377 5354 -46841 -67730 -59622 -4364 8554
9506 8554 -3635 55519 125917 111188 46327 22154 -1608 -5346 25463 39737 57743 32115
9494 32115 16206 -23094 -38327 -22560 -57714 -63569 -80290 -104097 -74884 -48746 -53869 -91606
9482i1606J7045L0395K6918p631k5624O497J2136k3344J2605J226l7312P320N0530
9469b0845O94K0903p843L463o90O326l6440L0062o075j8654L5418K6475L7692
9456G0486L5248o0367m2222J7345K9177q736J5241q486O657O578k4440p2503k1988
9443e8010j2966P009N394N9120j942p0629N5K1224J7862J5716m293M3569K9161
9430E1270q8985l4860J2529L6357L4756p232j9704O869K7821Q422J0949M4476
9418H2668L6812n3379o2342l9547J1042J1534K4322m6030m4815p827K7278K389
9406e7895l7620n2088L2842O0412L9227J892p860J9638k2766N900l3046q290J0039
9393d9615j2896k5863L375j5211M684K9544L1284k6470l9674J7235N538K6873
$$ plain form
9482 -91606 -74561 -44166 -17248 -24879 -50503 -44006 -31870 -55214 -42609 -41383 -78695 -71375 -20845
9469 -20845 -20151 752 -7091 -3628 -4318 2008 -34432 -4370 -10445 -29099 6319 32794 70486
9456 70486 105734 45367 3145 20490 49667 40931 56172 47686 54343 60921 36481 -36022 -58010
9443 -58010 -70976 -63967 -58573 547 -1395 -72024 -71969 -50745 -32883 -17167 -21460 22109 51270
9430 51270 -37715 -72575 -60046 -23689 11067 3835 -15869 -9000 18821 27243 38192 82668
9418 82668 119480 66101 3759 -35788 -24746 -13212 11110 -34920 -79735 -87562 -60284 -57895
9406 -57895 -95515 -147603 -114761 -54349 -15122 -13230 -21090 -1452 -24218 -18318 -51364 -59654 -49615
9393 -49615 -62511 -88374 -84999 -100210 -95526 -65982 -34698 -61168 -100842 -83607 -78069 -51196
9381e1196Q330K0388L4772M0498j0561p2652o1608O061O0084O5928N5783j6583
9369G9244m4206K3573K8190r2927l3003q71l2167K4857K8288N0796P71p225k202
9356B3118k1269j9686J655k0278n567M6459M6025k8766m8962J5271k6234K9002
9344i232j0392j8994k9339k0444K5314L9630K5066J818r35K9261J5861J541k7471
9331B1684l7118K5825j3197M778M6579m3007k0250L2043q384j7084N755J3009
9319A0633m2957m956k4980l8999K337m831P4796K1034k7787j9481k6352J9764
9307f1779M1063j664J2617L4090O81K5910K6062p684J5323K5434K3695k7200l5219
9294G1329j5144k2132N4618k3829m1513L6334o298J5885L4612J7371j1839K6491
$$ plain form
9381 -51196 -42866 -22478 12294 52792 42231 -30421 -92029 -85968 -25884 40044 95827 79244
9369 79244 35038 58611 86801 -6126 -39129 -40000 -72167 -47310 -19022 31774 32545 25320 23118
9356 23118 1849 -17837 -16182 -36460 -42027 4432 50457 21691 -27271 -12000 -38234 -9232
9344 -9232 -19624 -38618 -67957 -88401 -63087 -23457 1609 3427 2492 31753 47614 49155 21684
9331 21684 -15434 10391 -2806 1972 48551 5544 -14706 17337 8953 -8131 -2376 10633
9319 10633 -32324 -37280 -62260 -101259 -98922 -103753 -28957 -7923 -35710 -55191 -81543 -61779
9307 -61779 -20716 -22380 -9763 24327 25008 50918 76980 69296 84619 110053 133748 106548 71329
9294 71329 56185 34053 88671 64842 23329 59663 53365 69250 103862 121233 109394 135885
9282A35885j1373L83K8721O7541J05447M8544p5948j30997k4527m77l0465l2927
9270G9807j0161q133L7363L6339k7202q7800j3096J1819J2958L0609j2915m7017
9258B571k5704L1938M8475R700j9154J9344n772j8435O186k9036m4238j0880M8327
9245A3322L6043k354l2414K4307J8228J7181M8515O0863J01099J35640J76990
9234E97420J10341J31545M0509j26414k13170j64651j09141q7160m4244j3047
9224A21988Q691j1748K7028l4405n4194j1818N3417k712K718j7693m1610j7789
9212B1873k3428K0680k843K065O5084k5147O786j5501O895j9561J4143J6500P52
9199F8298L6448N1514J9854l3483k5980R787l3301J4271M827O3498J15097P6675
$$ plain form
9282 135885 124512 124895 153616 221157 326604 375148 299200 168203 143676 143199 112734 79807
9270 79807 69646 61513 98876 135215 108013 20213 7117 18936 31894 62503 49588 2571
9258 2571 -23133 8805 57280 66980 47826 67170 61398 42963 49149 20113 -24125 -35005 13322
9245 13322 49365 47011 14597 38904 57132 74313 122828 183691 284790 420430 597420
9234 597420 707761 839306 879815 753401 540231 375580 266439 179279 135035 121988
9224 121988 130679 118931 145959 111554 57360 45542 98959 96247 98965 81272 39662 21873
9212 21873 -1555 19125 16282 18347 83431 58284 65070 49569 56464 36903 51046 67546 68298
9199 68298 104746 156260 176114 142631 116651 126438 93137 107408 112235 175733 290830 367505
9187C67505M797o6334o2946o2888l5002j6244n1062p02L896k3524q966O1847O248
9174A16625k1433l8357j4954J7805R459j8413J1598k2126j7079L86j2740r743
9162A028K8328m873j8597O3559R089k9567l9565j6113M2822K6094O077j9254J1370
9149F0398J4400J4971m645J8387K6330L1242K1814k2677N445O978n571o1735K8939
9136A34276j0139m2420O0508N3513J4128l0141N273J7864Q344k110L6505O9636
9124C15237N2660M485N9123M8572J11908R3420J0380N2682J17955J57966J28905
9113A153293J40413J91518K56333K95709L93798N84562P21516R10317J410447
9104F057906K170205L009850L697778L008126K02806l061993l795669k821769
$$ plain form
9187 367505 372302 305968 243022 180134 145132 128888 77826 77124 81020 57496 48530 110377 116625
9174 116625 95192 56835 41881 59686 69145 50732 62330 40204 23125 23511 10771 1028
9162 1028 29356 24483 5886 69445 78534 48967 9402 -6711 36111 62205 68282 49028 60398
9149 60398 74798 89769 85124 103511 129841 161083 182897 160220 165665 172643 167072 105337 134276
9136 134276 124137 81717 142225 195738 209866 179725 184998 202862 211206 209096 245601 315237
9124 315237 367897 372382 431505 480077 591985 685405 695785 748467 866422 1024388 1153293
9113 1153293 1293706 1485224 1741557 2037266 2431064 3015626 3737142 4647459 6057906
9104 6057906 8228111 11237961 14935739 17943865 18146671 15084678 11289009 8467240
9096H467240j864990j227542q34020n59860m34184l41277k75327j54108j09531
9087B666401n6251p2412j62384k11691k11262k19881k50054j41123j29329j79632
9077A032382j31681l0791j8185j13178q4093J0741l7096r4143n1675k8284j309
9066D52688n8711j2191J0388k3279O027k4456n4882N193k876p0620l5253J4320
9054B06348L4110j4334n3385m1942j8409j9327L8548M9666j6956J223k3079K5062
9042A67525j3238Q189l579k784K202J6804P99n6376m2142j0060j1705l9582j2062
9029C991P836k8115L976K3944J8841M2607K8966J7001p936l7454l448N4495K4813
9016A49517J6794q577o7715Q317L6825j0311L1414k8132r4312m4880J9052N1690
$$ plain form
9096 8467240 6602250 5374708 4540688 3980828 3546644 3205367 2930040 2775932 2666401
9087 2666401 2610150 2537738 2375354 2163663 1952401 1732520 1482466 1341343 1212014 1032382
9077 1032382 900701 869910 851725 738547 654454 665195 628099 533956 482281 453997 452688
9066 452688 393977 381786 392174 368895 374922 350466 295584 300777 297901 227281 192028 206348
9054 206348 240458 226124 172739 130797 112388 93061 131609 181275 164319 165542 142463 167525
9042 167525 154287 162476 158897 156113 158315 175119 175918 119542 77400 67340 55635 16053 3991
9029 3991 11827 -16288 -12312 11632 30473 73080 102046 119047 111111 73657 70209 124704 149517
9016 149517 166311 157734 90019 98336 135161 124850 156264 128132 33820 -11060 7992 59682
9004E9682j681k5463K3449J7307J1857j700l4559k3816K5963M4658J0445q757
8992I7385m36k1043P748n598l9192o997L3229j3723m2228Q77O236N5083K4234
8979I5575O158K6369K609o1626m0834j5160k7718K5974L3425p144k385J8238J4627
8966F8108L3384l3425m1065N267j5637J6968O50L8787N3591N0785l6681Q302J7426
8953A66460q645m3835j0201k3132K6788m6156k9117M4975N4283Q3314L556l0149
8941A88141k1231n604J2604J7096l6058j7089M5920K4116m6324j5403L5144M5876
8929B27188k1935n6495L0699K6025J4982Q046K3530L7705j7128k1018O2443L0655
8917C44697K3392j3628r365J4474L9525j0333j8694L4618P7394K1266Q0305P0268
$$ plain form
9004 59682 58001 32538 55987 73294 85151 83451 48892 25076 51039 95697 106142 97385
8992 97385 96949 75906 83654 78056 38864 31867 65096 51373 9145 10022 16258 71341 95575
8979 95575 101733 128102 130711 69085 28251 13091 -14627 11347 44772 37628 35243 53481 68108
8966 68108 101492 68067 27002 32269 16632 33600 34250 73037 126628 177413 140732 149034 166460
8953 166460 157815 113980 103779 80647 107435 61279 32162 77137 131420 214734 218290 188141
8941 188141 166910 161306 173910 191006 154948 137859 183779 207895 161571 146168 181312 227188
8929 227188 205253 148758 179457 205482 220464 228510 252040 289745 272617 251599 314042 344697
8917 344697 368089 354461 345096 359570 399095 388762 370068 404686 482080 503346 583651 653919
8905F53919P1673R7255P6549N4168M2887J09258K17202K06650K38319K93408L39736
8894B401024M40114N88358N97033O61873O78558P06222P94625J131311J442986
8885I442104J993581K788232L974538N953894R267502J3759310J6812032J2902318
8877G6893511j357125j6167485j6790865j1146961o948941m494331k994958k071537
8869A4921308j458722j019763p20186n23566l26253j84220j88043m11792o54290
8860I434473p89958p53095o70407n12674l21667k09667j11960J3419J41464K74203
8850F494131M46223O40003Q37229J036753J085512J070007J154002J422399J834151
8841A6020410K540830L457860M837680P112624J0761476J6850273K6391584L5253180
$$ plain form
8905 653919 725592 822847 899396 953564 996451 1105709 1322911 1529561 1767880 2061288 2401024
8894 2401024 2841138 3429496 4026529 4688402 5366960 6073182 6867807 7999118 9442104
8885 9442104 11435685 14223917 18198455 24152349 33419851 47179161 63991193 76893511
8877 76893511 75536386 59368901 42578036 31431075 24482134 19987803 16992845 14921308
8869 14921308 13462586 12442823 11722637 11199071 10872818 10688598 10500555 10088763 9434473
8860 9434473 8644515 7891420 7221013 6708339 6386672 6177005 6065045 6078464 6219928 6494131
8850 6494131 6940354 7580357 8417586 9454339 10539851 11609858 12763860 14186259 16020410
8841 16020410 18561240 22019100 26856780 33969404 44730880 61581153 87972737 123225917
8833A23225917L1171526L187713l3610822l6790289k4229622j4621524r261976
8826C9070923o217596m322972l101691k169390j546974j066231o07355k78437
8818A9760277l43415q60767j425969j725354j759144j523337j235455r96771q33699
8809I056366o58740m57247l37479j93415q6632J7326J49790K29912K92522L04809
8799H317212L53202N17700P55131J104139J580108K212352L200738M841425P413578
8790C0295585J1291085J5270060J4684400M586051j1795078j7737441j3001361
8783C3593301p991693n040511l366031k362299j618702j172566q56839o47626
8775A0537034m43974j79746j98704l99622o51117q74421r00979q26175p00427
$$ plain form
8833 123225917 154397443 157585156 123974334 87184045 62954423 48332899 39070923
8826 39070923 32853327 28530355 25428664 23259274 21712300 20646069 20038714 19760277
8818 19760277 19416862 18556095 17130126 15404772 13645628 12122291 10886836 9890065 9056366
8809 9056366 8397626 7940379 7602900 7409485 7322853 7340179 7489969 7719881 8012403 8317212
8799 8317212 8670414 9188114 9943245 11047384 12627492 14839844 18040582 22882007 30295585
8790 30295585 41586670 56856730 71541130 76127181 64332103 46594662 33593301
8783 33593301 25601608 20561097 17195066 14832767 13214065 12041499 11184660 10537034
8775 10537034 10093060 9913314 9714610 9314988 8663871 7789450 6888471 6062296 5361869
8766E361869n67214m85440l65080l53642l19664k72022k26486k01572q7064j55957
8756B327728j62513j66154j70661j13823n1747n7951m7599j09332q7564j17569
8746A242815r6378m7843p0914j31441n8154j9177K031j4898j346n3157k2708j4794
8734G14036n6596o6213K4662L1153q71K8351l2148j4209k1896k2935J1160K8831
8722F23325o756k2561l7871k6649k2328r313k9428N314J1397J74n855J0638o76
8709D89411n9161l4075O0438N1821J6894J8558k3129m7247n3174n1596j4401l1519
8697C22820M2393M8666k6663m1626j8329K9981O1127k0233J8770K5523L2443R32
8685D75804k5217j9416l8227j6210P801j977l775o771l5575j7982j147L1399L9999
$$ plain form
8766 5361869 4794655 4309215 3944135 3590493 3270829 2998807 2772321 2570749 2483685 2327728
8756 2327728 2165215 1999061 1828400 1714577 1662830 1604879 1557280 1447948 1360384 1242815
8746 1242815 1146437 1098594 1027680 896239 838085 818908 820939 806041 804695 751538 728830 714036
8734 714036 657440 591227 615889 647042 646171 674522 642374 628165 606269 583334 594494 623325
8722 623325 616569 594008 556137 529488 507160 497847 468419 473733 485130 485304 479449 490087 489411
8709 489411 430250 396175 456613 508434 525328 543886 520757 473510 420336 368740 354339 322820
8697 322820 365213 413879 387216 345590 327261 357242 418369 398136 416906 442429 474872 475804
8685 475804 450587 431171 392944 376734 384535 382558 378783 372012 336437 318455 317308 348707 388706
8672C88706m6383r120j8586k0073k1263L5464M2302K5475Q148K8834p3910P093
8660C46687P4656J0370m0231m635L5426k2n0732n9518o1498J8369M7070J7935
8648C33877k7402K0545l152K5740k3384k2106k3271K4722K0367K9136J4322J4772
8636C84166O302J9750l0218L739l2788j7993m2199j9379M4382J7132K8818j7539
8624C44173N2443K1209L7014L6631K72j2460r559K5443K4275L3331o842P384K1448
8611E74762j29L0787k0171m6352N603J2955N2722L3682k152M6782M4131L4667
8599G67287q027L7426K9400J04302L5517q8707m8421m2898o5122j01179o3816
8588E55762l7541l2879l2346j538K9934k1528L1219J5015N127j3965k6766k8678
$$ plain form
8672 388706 342323 333203 314617 294544 273281 308745 351047 376522 384670 413504 339594 346687
8660 346687 421343 431713 391482 386847 422273 422251 371519 312001 250503 268872 315942 333877
8648 333877 306475 327020 323868 349608 326224 304118 280847 305569 325936 355072 369394 384166
8636 384166 390468 410218 380000 383739 350951 332958 290759 271380 315762 332894 361712 344173
8624 344173 396616 417825 454839 491470 491742 479282 469723 495166 519441 552772 545930 553314 574762
8611 574762 574633 605420 585249 538897 544500 557455 610177 643859 641707 688489 732620 767287
8599 767287 759260 796686 826086 930388 965905 877198 828777 785879 720757 619578 555762
8588 555762 518221 485342 452996 451458 481392 459864 491083 506098 511225 497260 470494 441816
8576D41816o0519o3895k2343l4784K1231j9001j9254j7664m7873m5515J1400M2914
8564A86513l472J1005M5358M5810M5649N7126n6163n7754n8990j5298M2799J1990
8552B54573q338O230K8183J7054n508j5489j2111n235o5503L107N8497n020O316
8539B56756k893k2395j1607j9402o8509L209K1495q417O195M8433J5073m0120
8527A77818n9608L0411M3404l0404l4989K9869j1190n1153J0525j2250M84J4913
8515A07830J6378K7302L7802K3189k0334m8458n0666M735J6904N189K7022l9505
8503A07388j3206k3887J0791K7056j6342J5670M7730M4072k5928o5846O948J5345
8491A29791J456r693J3468r560p178K8073n985K4132L2938l0951O541L1747M5261
$$ plain form
8576 441816 381297 317402 295059 260275 281506 262505 243251 225587 177714 132199 143599 186513
8564 186513 183041 194046 239404 285214 330863 387989 331826 274072 215082 199784 242583 254573
8552 254573 246235 252465 280648 297702 292194 276705 264594 259359 193856 196963 255460 250440 256756
8539 256756 253863 231468 219861 200459 131950 135159 156654 148237 154432 202865 217938 177818
8527 177818 118210 148621 192025 161621 126632 156501 145311 94158 104683 92433 92917 107830
8515 107830 124208 151510 189312 212501 192167 143709 93043 97778 114682 119871 146893 107388
8503 107388 94182 70295 81086 108142 91800 107470 155200 199272 173344 107498 114446 129791
8491 129791 131247 121554 135022 125462 118284 146357 140372 164504 197442 166491 173032 204779 250040
8478B50040J5751k3461K6254M8627O912J09897N5068m1247p4504j08093p9139
8467A86105n5539N6539J2064k9094j335J006k8012M93k2154L93K0221N0207o4751
8454A26143j0624K1190L9344K0240k8151L597J255p495M998o810o0735l5372L0379
8441I7959L0086J1137k4873J416L0973L946M3932L4389l432q073R2556J68442
8429D78458J76210J38826J46118n5609k13887j42118j00024p3227o2130l0963
8419B61654n1979J2330j4227J0127N6553l3219n2081l5066J6646l8642l2475k3428
8407G6193M4684L5888K3741k5059L1996l648k5181k0128J4982L6985j4720K1205
8395A96938j5294K4780m271o4835j3686N6423K2224j9825q543O9296J03070P0558
$$ plain form
8478 250040 265791 242330 268584 317211 324123 434020 489088 447841 373337 265244 186105
8467 186105 130566 187105 199169 170075 168740 169746 141734 142227 120073 120466 140687 190894 126143
8454 126143 115519 136709 176053 196293 168142 171739 172994 165499 170497 163687 102952 67580 97959
8441 97959 128045 139182 114309 115725 146698 150644 194576 228965 225533 217460 310016 478458
8429 478458 654668 793494 939612 884003 670116 527998 427974 354747 292617 261654
8419 261654 209675 222005 207778 217905 274458 241239 189158 154092 170738 132096 99621 76193
8407 76193 120877 156765 180506 155447 187443 183795 158614 138486 153468 190453 175733 196938
8395 196938 181644 206424 202153 137318 123632 180055 202279 182454 173911 243207 346277 416835
8383D16835M0562L8692O514k8685p9242o5215n0048k9428j2129R675m5481l2283
8371A69767j5847l413J8932m286J333l0868k76L6214l85l4426R926J5791o444
8358A56018n4674m2364N5575N4058p1132o8665J6835K9177J3473q944j4581j2762
8346E2014M2153j9009L528j1271j6230j4735M8867K3885K0904K8413m268k7658
8334A26593n0071k0478N434l6024j5168M6671Q0526k4603m1246l0492K2935K4776
8322H8853K1182p309k2847j3070j5446K1388l6190j7891K3632R067j3175j8962
8310A9232M8461K2777l0890l2263j5497N0529j0453m5433K0026K8328m956n0242
8298c81L84M6523J5576M4437n7733l318J0169M053K1349m67k5093J5698p193K3800
$$ plain form
8383 416835 457397 496089 502603 473918 394676 329461 279413 249985 237856 247531 202050 169767
8371 169767 153920 150507 169439 165153 166486 135618 135342 171556 171171 136745 146671 162462 156018
8358 156018 101344 58980 114555 168613 97481 28816 45651 74828 88301 79357 64776 52014
8346 52014 94167 75158 78686 67415 51185 36450 85317 109202 130106 158519 154251 126593
8334 126593 76522 56044 61478 25454 10286 56957 137483 112880 71634 41142 64077 88853
8322 88853 110035 102726 79879 66809 51363 72751 36561 18670 42302 51369 38194 19232
8310 19232 67693 90470 59580 27317 11820 62349 51896 6463 26489 54817 49861 -381
8298 -381 3 46526 62102 106539 48806 45488 55657 59710 81059 80592 55499 71197 64004 87804
8284H7804L9852k4548k5549m4007K3949M1656k4923R685j0629J6100L619Q003
8272A01012N872n979k1654K8153k4763j0084l7649N926Q591m1025q893K8902k8322
8259H7j7673L1307k487k3358O6397J7800j5262J280k190K630J8763o533M7055
8246A17816M628j3160P2785k719m1097n0163r067k083J837J7984J9821l7588j3803
8233F5191M0467N12n1732l93K5750m7524Q153N0756J9218R401o1127L2007M9613
8220A40292k4293q5783J605J824K7229L9538n0360k5983L625L988L5351M893l4254
8207C7672j3625R628L0247n541K9232L2243J8478Q616l3887n5197J553L9914M0522
8194A39855K4011m3999p698o467n577K2978M2501n7903k5054l7490k4678N2358
$$ plain form
8284 87804 127656 103108 77559 33552 57501 99157 74234 83919 73290 89390 93009 101012
8272 101012 106884 100905 79251 107404 82641 72557 34908 40834 49425 8400 -493 28409 87
8259 87 -17586 13721 11234 -12124 54273 72073 56811 58091 55901 58531 77294 70761 117816
8246 117816 122444 109284 182069 179350 138253 88090 79023 76940 78777 96761 116582 78994 65191
8233 65191 105658 106170 54438 54045 79795 32271 40424 91180 110398 119799 58672 90679 140292
8220 140292 115999 30216 31821 33645 60874 100412 50052 24069 27694 31682 67033 71926 37672
8207 37672 24047 33675 63922 58381 87613 119856 138334 146950 113063 57866 59419 99333 139855
8194 139855 163866 119867 112169 105702 100125 123103 165604 107701 82647 45157 20479 72837
8182G2837K2110o1693n2325K6824J1150Q259O2368P8679M0468k633q0182o4538
8170F1324k5490k8613r724R7104N1285j1190k6699k509k0494p466J9056J1972
8158A08556l4923k5565J0065p61L818n693J0621l8309J2153K4911M1561K2270
8146A28704Q072o3105j1330q61j2145p3161k1905n126J09292N5869k0301K3947
8134A17950j6074j9873q534m254j3720L4293K8327o298p941l6747K2782K9191
8122A19102N475j9999R439J584l3983k623K7562J6698k1843k1917m0594l8845
8110E6K3000J546k092N6998J8293p8911J3218r178J060m9521o801R460J7070O800
8096I98p273k873N619J2844N5602K5674q535J2045M1821q267j5145k4224K3215
$$ plain form
8182 72837 94947 33254 -19071 7753 18903 27162 89530 168209 208677 206044 125862 61324
8170 61324 35834 7221 -2503 94601 145886 134696 107997 105488 84994 77528 96584 108556
8158 108556 73633 48068 58133 57372 61190 55497 66118 27809 39962 64873 106434 128704
8146 128704 136776 73671 62341 61480 49335 -23826 -45731 -50857 58435 114304 94003 117950
8134 117950 101876 82003 73469 69215 55495 89788 118115 111817 103876 67129 89911 119102
8122 119102 124577 104578 114017 115601 81618 78995 106557 123255 101412 79495 38901 56
8110 56 23056 24602 22510 79508 97801 18890 32108 22930 23990 -25531 -32332 -22872 -5802 998
8096 998 -6275 -9148 -3529 9315 64917 90591 82056 94101 135922 127655 112510 88286 111501
8083A11501m534l7791L2095j4900k7024j1993n17k3398N534L9114J509j7901M845
8070E6540l3920o0436J6033N4788P2958K3893j6214k2341M766L433J4990n786
8058A08704q759J7579k704j3449k3507J5274K932j9681P341R784o189O7976L966
8045A59267J2692L0249p750K6401J2602k0354K5903O029l3754p6699n1110N1847
8033A35323M7913j9588K7914l5193J5697N0711J5046J919k3957k3951J3512O496
8021B11842J36572J24228N2647l410m7594j04179m6565J4095m0275k7612n6012
8010B13737K147M6318M6645l2894q537K7939J1872Q509k474q146m4838j6504J8893
7997B62667K852l5307J2217Q938K2306L4684m9310p1180J5093L3926l7971q0543
$$ plain form
8083 111501 106967 69176 101271 86371 59347 47354 46837 23439 28973 68087 69596 51695 56540
8070 56540 22620 -37816 -21783 33005 105963 129856 113642 91301 96067 99500 114490 108704
8058 108704 99945 117524 114820 101371 77864 93138 96070 76389 83730 93514 87325 155301 159267
8045 159267 171959 202208 194458 220859 233461 213107 239010 245039 211285 134586 83476 135323
8033 135323 183236 163648 191562 156369 172066 222777 237823 239742 215785 191834 205346 211842
8021 211842 348414 472642 525289 521879 474285 370106 323541 337636 297361 269749 213737
8010 213737 215884 262202 308847 275953 267416 295355 307227 315736 313262 305116 260278 243774 262667
7997 262667 265519 230212 242429 251367 273673 308357 259047 187867 202960 236886 198915 118372
7985A18372k3573J7925M782o254P6304O8853o421J7666j712J1277j5015m7839
7973B14365k3130j7736L1768O1710k8990K491J1252M9206K4187K6050j4994J4036
7961C50215N6890l7615l3343K5509J3559K8589j9161l4873q71K0930M651K1960
7949C96440R114K0393l2307k4404j6496l3480m5585k4675J8102J0866J2555J0049
7937C00572K5795k2615L215K1600J094K6644K6898j902r974L4963k24P3627m3552
7924D36141m6624L4831n8188m7266k5779L2052O8589k3931n4491r993L4126n4911
7912B84556q425k4820J3284N1566L4174n2435j9440L6017q116j1352j6740o358
7900B71911j2112l7696K9986p396M4227M9696L961n5930l9127j6379n774j4834
$$ plain form
7985 118372 94799 112724 117506 111252 187556 256409 249988 267654 265942 277219 262204 214365
7973 214365 191235 173499 205267 266977 237987 240478 251730 300936 325123 351173 336179 350215
7961 350215 407105 369490 336147 361656 375215 403804 384643 349770 348899 369829 374480 396440
7949 396440 405554 425947 393640 369236 352740 319260 273675 249000 267102 277968 290523 300572
7937 300572 326367 303752 306967 328567 329661 356305 383203 381301 371327 406290 406066 479693 436141
7924 436141 389517 424348 366160 318894 293115 325167 393756 369825 315334 305341 339467 284556
7912 284556 276131 251311 264595 316161 350335 297900 278460 314477 306361 295009 278269 271911
7900 271911 259799 222103 252089 244693 288920 338616 342577 286647 247520 231141 225367 210533
7888B10533k7608PO415L0420o833L7648M4542K7197k776n9593k8513n357k3610
7875B02472p561q088k4238j4357J4094k5638m8916O838P9054L8841J4892k8541
7863A98852n0759M3142J7544k3840l571Q208k0395o1073R981K027j742J8292l3278
7850A03388J39O0693r639m2235k4270L0240J8468j7177q551o347n801l0245j6970
7837E1693J2806L0139k6020P2453K0267k4057o9405l2613j2692j0627l7032K7946
7825B858N5865m711m9137r81k1592L1870L3814K6919Q880n1588n9453n0363L3897
7812d3722K9241J3027L2753J5928L2242k376L146j2673r843l2599m9344j2439
7800c6659j6884J2504j712K6508M9271l1263k2330K9174o13l736m6011j2069N4172
$$ plain form
7888 210533 182925 182932 189347 219767 212934 250582 295124 322321 319545 259952 231439 226082 202472
7875 202472 194911 186823 162585 148228 162322 136684 87768 94606 173660 212501 227393 198852
7863 198852 148093 191235 208779 184939 181368 189576 169181 108108 118089 120116 118374 136666 103388
7850 103388 103527 164220 154581 112346 88076 118316 136784 119607 111056 104709 98908 68663 51693
7837 51693 64499 94638 68618 141071 161338 137281 67876 35263 22571 11944 -25088 2858
7825 2858 58723 54012 4875 3894 -17698 14172 47986 74905 83785 32197 -27256 -77619 -43722
7812 -43722 -14481 -1454 31299 47227 79469 77093 80239 67566 57723 25124 -24220 -36659
7800 -36659 -53543 -41039 -42751 -16243 33028 1765 -20565 8609 7996 4260 -41751 -53820 352
7787C52L1002M9268J6236K536l0163o9048J1605O4465J199o8604R577J1038j4256
7774A5207n0357j2847L0493L8094L598j1185M6085K0943j2324N92k2779l1192
7762A4328K802J011K05o914K7963K9378o1073Q908j3096R459j0877j6031k5477
7749c9414J7797L3518J3204q7456r157L9389N245N0829m1080k5821J1412O6878
7737C5344K7372k6713K5489l938J0502k0058K0691l5362k561l049j475J3601l2670
7724G173n8435M50O9350J6132m9447o6911j581P535L3289M300l057p735J0614
7711c8323K4722j2918j3858j1651K6281L2004N9202Q653J2228J4291m929j4118
7699H1584o573k1382k4993N424J5797l619J0737j6932n3777O28M4818L7327o3454
$$ plain form
7787 352 31354 80622 96858 99394 69231 183 11788 76253 77452 8848 18425 29463 15207
7774 15207 -35150 -47997 -17504 20590 24188 13003 59088 80031 67707 68299 45520 14328
7762 14328 17130 18141 18346 11432 39395 68773 7700 16608 3512 12971 2094 -13937 -39414
7749 -39414 -21617 11901 25105 -62351 -71508 -32119 -26874 23955 -17125 -42946 -31534 35344
7737 35344 62716 36003 61492 57554 68056 47998 68689 33327 30766 27717 26242 39843 7173
7724 7173 -51262 -50812 18538 34670 -14777 -81688 -83269 -75734 -42445 -38145 -41202 -48937 -38323
7711 -38323 -13601 -26519 -40377 -52028 -25747 6257 65459 74112 86340 100631 95702 81584
7699 81584 75011 53629 28636 34060 49857 46238 56975 40043 -13734 -13106 31712 69039 5585
7686E585l5820L8879L6164m340K407l3396j5679k3262j5340K1217J9252J7561
7674A3228k988k0555r611N2695K4717o2462o8504m1695q457J9046L4215O1676
7662h695L8489K3953M6416j5062l6784R845q929o364K7223J589n1615m7435J1232
7649a6137K0721N4002J2415k7072n1271N802K6337K8326k2006j8826K0666o506
7637B6451l4895J4456J9956q018J254l0157k3328P78L0133N6999J8436r377J2010
7624G4698L9481j5712k8059K4103L443q235J2175j7633k457m8315j684O0489m5331
7611D6963j2458m779o9268m2968J0030m504N7571J7081l7474L9319N3433L828
7599E6774l1932J0340n939l1134J332m4627j0081K2441M0460l2690k6165j0809
$$ plain form
7686 5585 -30235 8644 44808 40468 42875 9479 -6200 -29462 -44802 -23585 -4333 13228
7674 13228 10240 -10315 -19926 32769 57486 -4976 -73480 -115175 -123632 -104586 -70371 -8695
7662 -8695 29794 53747 100163 85101 48317 58162 49233 42869 70092 71681 20066 -27369 -16137
7649 -16137 4584 58586 71001 43929 -7342 -1540 24797 53123 31117 12291 32957 26451
7637 26451 -8444 6012 25968 17950 19204 -10953 -34281 -33503 -3370 53629 72065 62688 74698
7624 74698 114179 98467 70408 94511 97954 89719 101894 84261 81804 33489 31805 92294 46963
7611 46963 34505 29726 -39542 -82510 -72480 -76984 -19413 -2332 -39806 -487 52946 56774
7599 56774 24842 35182 29243 -1891 -559 -45186 -55267 -32826 7634 -25056 -51221 -62030
7587f2030M2685n298K5027O1118Q717l5985J3218O302J7538l108r065j877n603
7574E1639n8163o5904J9173M4549P730k2775j5505o936J5506Q182J2640Q4956
7562G5092K7437M303p4151m9604J2684P4639m196l5568l2159J8939J1151k0738
7550G829J5068j263m6050m2904j2274N907o191n201R580J9728J2065k2675j7183
7537h3564m526O6519J3415O186l381n134k39j8606k913K9873L4977J8947l5802
7524A5752J1424l2463K529N1601j9626p1853K8067K2065m632r993L7598m9087
7512a8618m0372j3105L8256q778M0533l4885K6732M6745M9295n379r357k3828
7500D7239J3006L4563K7829j924j5236J9583k3781J192J4316J2759j3265o5885
$$ plain form
7587 -62030 -19345 -24643 384 61502 70219 34234 47452 53754 71292 68184 59119 57242 51639
7574 51639 -6524 -72428 -53255 -8706 -976 -23751 -39256 -46192 -30686 -22504 -9864 75092
7562 75092 102529 106832 32681 -16923 -4239 70400 66204 30636 -1523 17416 28567 7829
7550 7829 22897 21634 -24416 -67320 -79594 -73687 -79878 -85079 -75499 -55771 -43706 -66381 -83564
7537 -83564 -88090 -21571 -8156 -1970 -5351 -10485 -10724 -29330 -32243 -2370 32607 51554 15752
7524 15752 27176 -5287 -2758 48843 29217 -42636 -14569 7496 2864 -7129 30469 -18618
7512 -18618 -58990 -72095 -33839 -42617 -2084 -36969 -10237 36508 85803 80424 71067 47239
7500 47239 60245 94808 122637 120713 105477 125060 101279 102471 116787 129546 116281 50396
7488E0396l8965o4131n62J6950L5156K2122L9634j5521j5040l1657J424K9699
7476B9505P0562L0847k2622l3368j1876k0437p288l9501j2615J7037L0788l662
7464B7370q840r034K1179L7505Q802K6668m81J070l9922l4875L4766L6411J55
$$ plain form
7488 50396 11431 -52700 -53262 -36312 -1156 20966 60600 45079 30039 -1618 -194 29505
7476 29505 100067 130914 108292 74924 63048 42611 35323 -4178 -16793 244 31032 27370
7464 27370 18530 9496 30675 68180 76982 103650 103169 104239 64317 29442 64208 100619 100774
$$ [...]
##END NTUPLES=NMR SPECTRUM
##END=
