##TITLE=Analysis number 318315
Compound Code cc 47224
Book Reference 437/70
Project Code adrs
Chemist Name wendyb
##JCAMPDX= 6.0         $$ Bruker NMR JCAMP-DX V2.0
##DATA TYPE= NMR SPECTRUM
##DATA CLASS= NTUPLES
##ORIGIN= Bruker BioSpin GmbH
##OWNER= nmr
$$ XWIN-NMR		Version 3.5
$$ Thu Mar 23 09:10:34 2006 GMT Standard Time (UT+0h)  MAYBRIDGE\nmr@NMR_250MHZ
##.OBSERVE FREQUENCY= 250.131544655141
##.OBSERVE NUCLEUS= ^1H
##.ACQUISITION MODE= SIMULTANEOUS (DQD)
##.ACQUISITION SCHEME= undefined
##.AVERAGES= 16
##.DIGITISER RES= 18
##SPECTROMETER/DATA SYSTEM= dpx250
##.PULSE SEQUENCE= zg30
##.SOLVENT NAME= CDCl3
##.SHIFT REFERENCE= (INTERNAL, CDCl3, 0, 16.522)
##AUDIT TRAIL= $$ (NUMBER, WHEN, WHO, WHERE, WHAT)
$$ ##TITLE= Audit trail, XWIN-NMR		Version 3.5
$$ ##JCAMPDX= 5.01
$$ ##ORIGIN= Bruker BioSpin GmbH
$$ ##OWNER= nmr
$$ C:\u/data/dgb/nmr/ADRS/1290/pdata/1/auditp.txt
$$ ##AUDIT TRAIL=  $$ (NUMBER, WHEN, WHO, WHERE, WHAT)
(   1,<2006-03-23 09:09:14.13 +000>,<MAYBRIDGE\nmr>,<NMR_250MHZ>,
      <created by zg, POWCHK disabled, PULCHK disabled
       configuration hash MD5:
       84 BC 41 DB A1 6E 1D 46 DA 25 12 A5 C1 ED C5 3A
       data hash MD5: 64K
       A8 7F 60 2E 0C 53 98 50 52 F2 0D 65 AC B7 14 D7>)
(   2,<2006-03-23 09:09:37.87 +000>,<MAYBRIDGE\nmr>,<NMR_250MHZ>,
      <Start of raw data processing
       ef LB = 0.3 FT_mod = 6 PKNL = 1 SI = 32K 
       data hash MD5: 32K
       C9 2A E8 95 9A D5 2C A6 5D F3 A7 E6 5D 6F 87 3C>)
(   3,<2006-03-23 09:09:45.51 +000>,<MAYBRIDGE\nmr>,<NMR_250MHZ>,
      <apk 
       data hash MD5: 32K
       2F B3 D1 2E 37 A0 06 84 4A E9 F8 C0 B9 D8 68 5A>)
(   4,<2006-03-23 09:09:48.85 +000>,<MAYBRIDGE\nmr>,<NMR_250MHZ>,
      <abs ABSG = 5 
       data hash MD5: 32K
       F5 27 DB D4 D4 26 81 DB 9B BE BF D4 B7 A5 BD 0A>)
$$ ##END=
$$ 
$$ hash MD5
$$ 60 FC 7B 98 82 78 4B 67 F1 3C AC 5E 1E 71 B5 22
##$RELAX= 
##$RELAX= 
##$RELAX= 
##$RELAX= 
##$RELAX= 
##$RELAX= 
##$RELAX= 
$$ Bruker specific parameters
$$ --------------------------
##$DU= <C:\u>
##$EXPNO= 1290
##$NAME= <ADRS>
##$PROCNO= 1
##$TYPE= <nmr>
##$USER= <dgb>
##$AMP= (0..31)
100 100 100 100 100 100 100 100 100 100 100 100 100 100 100 100 100 100 
100 100 100 100 100 100 100 100 100 100 100 100 100 100 
##$AQSEQ= 0
##$AQ_mod= 3
##$AUNM= <au_zg>
##$AUTOPOS= <3 >
##$BF1= 250.13
##$BF2= 250.13
##$BF3= 250.13
##$BF4= 250.13
##$BF5= 500.13
##$BF6= 500.13
##$BF7= 500.13
##$BF8= 500.13
##$BYTORDA= 1
##$CFDGTYP= 0
##$CFRGTYP= 5
##$CHEMSTR= <none>
##$CNST= (0..31)
1 1 145 1 1 1 1 1 1 1 1 1 1 1 1 1 1 1 1 1 1 1 1 1 1 1 1 1 1 1 1 1 
##$CPDPRG= <>
##$CPDPRG1= <>
##$CPDPRG2= <>
##$CPDPRG3= <>
##$CPDPRG4= <mlev>
##$CPDPRG5= <mlev>
##$CPDPRG6= <mlev>
##$CPDPRG7= <mlev>
##$CPDPRG8= <mlev>
##$CPDPRGB= <>
##$CPDPRGT= <>
##$D= (0..31)
0 1 0 0 0 0 0 0 0 0.06 0 0 0 0 0 0 0.0002 0 0 0 0 0 0 0 0 0 0 0 0 0 0 
0 
##$DATE= 1143104950
##$DBL= (0..7)
120 120 120 120 120 120 120 120 
##$DBP= (0..7)
150 150 150 150 150 150 150 150 
##$DBP07= 0
##$DBPNAM0= <>
##$DBPNAM1= <>
$$ [...]
##$SUBNAM7= <"">
##$SUBNAM8= <"">
##$SUBNAM9= <"">
##$SW= 20.6930455092707
##$SWIBOX= (0..15)
0 0 3 0 0 0 0 0 0 0 0 0 0 0 0 0 
##$SW_h= 5175.983436853
##$TD= 65536
##$TD0= 1
##$TE= 294.16
##$TE2= 300
##$TE3= 300
##$TEG= 300
##$TL= (0..7)
0 120 120 120 120 120 120 120 
##$TP= (0..7)
150 150 150 150 150 150 150 150 
##$TP07= 0
##$TPNAME0= <>
##$TPNAME1= <>
##$TPNAME2= <>
##$TPNAME3= <>
##$TPNAME4= <>
##$TPNAME5= <>
##$TPNAME6= <>
##$TPNAME7= <>
##$TPOAL= (0..7)
0.5 0.5 0.5 0.5 0.5 0.5 0.5 0.5 
##$TPOFFS= (0..7)
0 0 0 0 0 0 0 0 
##$TUNHIN= 0
##$TUNHOUT= 0
##$TUNXOUT= 0
##$USERA1= <user>
##$USERA2= <user>
##$USERA3= <user>
##$USERA4= <user>
##$USERA5= <user>
##$V9= 5
##$VALIST= <valist>
##$VCLIST= <CCCCCCCCCCCCCCC>
##$VD= 0
##$VDLIST= <DDDDDDDDDDDDDDD>
##$VPLIST= <PPPPPPPPPPPPPPP>
##$VTLIST= <TTTTTTTTTTTTTTT>
##$WBST= 1024
##$WBSW= 4
##$XGAIN= (0..3)
0 0 0 0 
##$XL= 0
##$YL= 0
##$YMAX_a= 257844
##$YMIN_a= -375449
##$ZGOPTNS= <>
##$ZL1= 120
##$ZL2= 120
##$ZL3= 120
##$ZL4= 120
##$ABSF1= 16.522
##$ABSF2= -4.171173
##$ABSG= 5
##$ABSL= 3
##$ALPHA= 0
##$AQORDER= 0
##$ASSFAC= 0
##$ASSFACI= 0
##$ASSFACX= 0
##$ASSWID= 0
##$AUNMP= <proc_1d>
##$AZFE= 0.1
##$AZFW= 0.1
##$BCFW= 0
##$BC_mod= 0
##$BYTORDP= 0
##$COROFFS= 0
##$CY= 12.5
##$DATMOD= 1
##$DC= 0
##$DFILT= <>
##$DTYPP= 0
##$F1P= 14.0000005364418
##$F2P= -0.99999901652339
##$FCOR= 0.5
##$FTSIZE= 32768
##$FT_mod= 6
##$GAMMA= 0
##$GB= 0
##$INTBC= 1
##$INTSCL= 1
##$ISEN= 128
##$LB= 0.3
##$LEV0= 0
##$LPBIN= 0
##$MAXI= 10000
##$MC2= 0
##$MEAN= 0
##$ME_mod= 0
##$MI= 0
##$NCOEF= 0
##$NC_proc= -3
##$NLEV= 6
##$NOISF1= 0
##$NOISF2= 0
##$NSP= 0
##$NTH_PI= 0
##$NZP= 0
##$OFFSET= 16.522
##$PC= 1
##$PHC0= 176.2521
##$PHC1= 11.54142
##$PH_mod= 1
##$PKNL= yes
##$PPARMOD= 0
##$PSCAL= 4
##$PSIGN= 0
##$REVERSE= no
##$SF= 250.13
##$SI= 32768
##$SIGF1= 0
##$SIGF2= 0
##$SINO= 400
##$SIOLD= 32768
##$SREGLST= <1H.CDCl3>
##$SSB= 0
##$STSI= 32768
##$STSR= 0
##$SW_p= 5175.98343685301
##$SYMM= 0
##$S_DEV= 0
##$TDeff= 65536
##$TDoff= 0
##$TI= <Analysis number 999999
Compound Code 99
Book Reference 9
Project Code 9>
##$TILT= no
##$TM1= 0
##$TM2= 0
##$TOPLEV= 0
##$USERP1= <user>
##$USERP2= <user>
##$USERP3= <user>
##$USERP4= <user>
##$USERP5= <user>
##$WDW= 1
##$XDIM= 32768
##$YMAX_p= 362026925
##$YMIN_p= -219572
$$ End of Bruker specific parameters
$$ ---------------------------------
##NTUPLES= NMR SPECTRUM
##VAR_NAME=  FREQUENCY,     SPECTRUM/REAL,   SPECTRUM/IMAG
##SYMBOL=    X,             R,               I
##VAR_TYPE=  INDEPENDENT,   DEPENDENT,       DEPENDENT
##VAR_FORM=  AFFN,          ASDF,            ASDF
##VAR_DIM=   32768,         32768,           32768
##UNITS=     HZ,            ARBITRARY UNITS, ARBITRARY UNITS
##FACTOR=    0.157963299565203, 1,           1
##FIRST=     4132.6476996994, 0,             0
##LAST=      -1043.33573715361, 0,           0
##MIN=       -1043.33573715361, -219572,     0
##MAX=       4132.6476996994, 362026925,     0
$$ Real data points
##PAGE= N=1
##DATA TABLE= (X++(R..R)), XYDATA
$$ [...]
18470B0962P081m710j6146p097L0650m472K1811k880l4477L3150l5246K9471J2606
18457E0703n5063n7509m0296J0399L7991O1602L723m0571j4085M4113M2573L45
18445D3925k7261M938M2781o91j1715J3514j7073l3442K3787L3401K0882j1290
18433H1756N0679P305l392n8490q9971j1955P550N612J100k8674N041J6204K9732
18420A2497j0684L0024L1317k6910L347M414j4198l595l0395j3276L5682K6129
18408D4352k433J6364J4507K0058q404j529k7382j8947L4013P0806K9561k8411
18396A42555m7485J1076J6951o681o2637n321N339O5542K9054k1789j6846m5771
18384F3987j8660K8341n1531l68Q63J4136J9933R432l0065J5521O1581J8149J4464
$$ y = [20962, 28043, 23333, 7187, 90, 30740, 26268, 48079, 45199, 10722, 43872, 8626, 38097, 50703, -4360, -61869, -102165, -91766, -53775, 7827, 11550, -29021, -43106, 1007, 43580, 43925, 16664, 21602, 64383, 63692, 51977, 65491, 48418, 14976, 38763, 72164, 93046, 81756, 132435, 139740, 136348, 77858, -12113, -24068, -16518, -10906, -9806, -38480, -33439, -17235, 12497, 1813, 31837, 63154, 36244, 39591, 44005, 29807, 26212, -4183, -17459, 18223, 44352, 41919, 58283, 72790, 92848, 84444, 82915, 55533, 36586, 70599, 141405, 170966, 142555, 95070, 106146, 123097, 116416, 53779, 48458, 53797, 119339, 148393, 126604, 109758, 63987, 45327, 73668, 22137, 21769, 22632, 36768, 56701, 66133, 36068, 51589, 113170, 131319, 145783]
18371A45783n2384j6627K2502J2799P6582Q9644J7786m0159j3718k939k6761l2638
18359A79870P322P027k6560l6566j5664O52J188J1593n2144l8217M6299L2526
18347A17326J3353l1886j3123L436j2457q0386l0353N5283N6118q845j4581M390
18335E8275N7781K0982j3168j676Q907m0125j6772N352K1947k2171J1061L4667
18323A25060N1795k1421l2152j8248J6024N456k7721n623K1147K3584N8347j2059
18311A84189p3152l7200J6922K7241L2218K2848j0855R135J9498P729j7694j0467
18299A70412k23o180m4718n8662P9363P6995n826K092J3912L4764N0171J0702
18287C22802m0028q3861m8675L8147L1716o842M6254Q2293R843k5999o4012N96
$$ y = [145783, 93399, 76772, 99274, 112073, 188655, 278299, 296085, 255926, 242208, 239269, 212508, 179870, 187192, 194219, 167659, 131093, 115429, 116081, 117269, 128862, 76718, 38501, 84800, 117326, 130679, 98793, 85670, 89106, 76649, -3737, -34090, 21193, 77311, 68466, 53885, 58275, 116056, 137038, 123870, 122194, 131101, 90976, 74204, 79556, 101503, 79332, 90393, 125060, 176855, 155434, 123282, 105034, 121058, 126514, 98793, 93170, 114317, 137901, 196248, 184189, 111037, 73837, 90759, 118000, 150218, 173066, 162211, 171346, 190844, 198573, 180879, 170412, 170189, 164009, 119291, 60629, 139992, 216987, 211161, 213253, 227165, 261929, 312100, 322802, 282774, 198913, 150238, 188385, 220101, 213259, 259513, 341806, 351649, 325650, 261638, 262234]
18275B62234j8911k5229Q586j3633N627M8174k4876m3526R154M7008K3920K693
18263B81221p364J0106K8857N4595K3797K332N617J5748l3331p3255j8940m1356
18251B48027l8118m6307j2601J9766N6970k5949k0999M1651M222l4835m4781l67
18239A46679K7449K117N2930N4047O8093J5874n0990n0182m080Q966k661l0207
18227B38035J8375K6011K4207K2554J2336K1165R458j684M437p7752k9599j3968
18215B53575r241J4502M067N7033Q898p0754J8652R7025O0940M9144j5363m385
18203D64093m4105l7380K7289M7343L4024k016l7587M9418m6133n7045J1415K8943
18191D38259Q4738K267M7142K7090k4398R481k0894P977L4977L6422Q0398R4071
$$ y = [262234, 243323, 218094, 226680, 213047, 218674, 266848, 241972, 198446, 207600, 254608, 278528, 281221, 273857, 283963, 312820, 367415, 391212, 393544, 399161, 414909, 381578, 308323, 289383, 248027, 209909, 163602, 151001, 170767, 227737, 201788, 180789, 222440, 226662, 191827, 147046, 146679, 174128, 176245, 229175, 283222, 351315, 367189, 316199, 266017, 261937, 270903, 268242, 238035, 256410, 282421, 306628, 329182, 341518, 362683, 372141, 370457, 374894, 297142, 267543, 253575, 244334, 258836, 262903, 319936, 328834, 258080, 276732, 373757, 434697, 483841, 468478, 464093, 419988, 382608, 409897, 457240, 491264, 489248, 451661, 501079, 454946, 397901, 409316, 438259, 522997, 525264, 572406, 599496, 575098, 584579, 563685, 571662, 606639, 643061, 723459, 817530]
18179H17530j2423j2141M0348K7142J7245K4073O2871M9220M1735O5906J9441
18168A140947m2448N0276Q7964N7118J41679J42823J23690R7107J50988K43557
18158B193701K91112L50835M09339M33885M85486P25261R81313J350262K060529
18149I281723L021448M499948N412303M569687K931983K02960l638951l067008
18141B3214093O19240L789317M500931K991884N28317m687436q104649n831596
18133A7020101k971733j402285n58638J6279O80303J417609K363354L807802N378314
18124B5751106N730733M309538K147341k086758m593903j710464K695646N270324
18116C7513563M697496K598170j300027p109795p471548l705120l85182K250220
$$ y = [817530, 805107, 792966, 833314, 860456, 877701, 901774, 964645, 1013865, 1055600, 1121506, 1140947, 1098499, 1148775, 1236739, 1293857, 1435536, 1578359, 1702049, 1799156, 1950144, 2193701, 2484813, 2835648, 3244987, 3678872, 4164358, 4889619, 5870932, 7221194, 9281723, 12303171, 16803119, 22215422, 26785109, 29717092, 29920052, 26281101, 23214093, 23833333, 27622650, 32123581, 35115465, 35643782, 30956346, 22851697, 17020101, 14048368, 12646083, 12087445, 12103724, 12784027, 14201636, 16564990, 20372792, 25751106, 31481839, 35791377, 37938718, 35851960, 31258057, 29547593, 32243239, 37513563, 42211059, 44809229, 43509202, 36399407, 28927859, 25222739, 24837557, 27087777]
18108B7087777N453658J0086637J3461933J0221017N599357j765958j8634895
18101E1509526j7650872r082949m777154k953294j977513j266999q13451m80860
18093A2506434k54336p4653J92004M06730Q85035J645551K690452M387437N869647
18084B8254301N271427L467933O86038m876499n795511j992225J428630K768543
18076B9212637J815094L61727l350128p034894n520189l125973j783644j129701
18068I444929p70197n30717l80886k21882r3544R7831K33831M47514N26038O13472
18058I366389Q80653J430512K183509L357619N195705P181826P021156M697324
18050D1314693J935875m556720p763497l610791R42672L222788K498985Q29136
$$ y = [27087777, 32541435, 42628072, 56090005, 66311022, 71910379, 70144421, 51509526, 33858654, 24775705, 19998551, 17045257, 15067744, 13800745, 12987294, 12506434, 12252098, 12177445, 12369449, 12776179, 13661214, 15306765, 17997217, 22384654, 28254301, 33525728, 36993661, 37679699, 32803200, 27007689, 25015464, 26444094, 29212637, 31027731, 31389458, 28039330, 21004436, 15484247, 12358274, 10574630, 9444929, 8674732, 8144015, 7763129, 7541247, 7447703, 7545534, 7779365, 8226879, 8752917, 9366389, 10247042, 11677554, 13861063, 17218682, 22414387, 29596213, 36617369, 41314693, 43250568, 38693848, 30930351, 27319560, 28262232, 31485020, 33984005, 34813141]
18042C4813141k590308p743800p163441m189446k418887j496381j023381p88927
18034G398570o21161m37709m32965l63604k15122j25838j93605k08883k18788
18025D580895j92554k17897j82404n6360j35730k14051j91120j31337j40813j24242
18015B994387j65773k29894k21729j95530j80915j82703j55264q1768m283q0713
18005A495815j32351m5862l3987k6073m9522r7703j3494k3134m4034M0768l6068
17994A034355o1805p2595m7637n6810p0578O311J1106K921q669J9261O655o851
17982G55664p2416m5150l8660K1306j1001r8726m3736J9500l2717p6562l4009
17971C43493k6883P453l847l056n5265j0734P1675M2324N4122K4575n6748o8622
$$ y = [34813141, 32222833, 24479033, 17315592, 13126146, 10707259, 9210878, 8187497, 7398570, 6777409, 6339700, 5906735, 5543131, 5328009, 5202171, 5008566, 4799683, 4580895, 4388341, 4170444, 3988040, 3931680, 3795950, 3581899, 3390779, 3259442, 3118629, 2994387, 2828614, 2598720, 2376991, 2181461, 2000546, 1817843, 1662579, 1580811, 1576528, 1495815, 1363464, 1317602, 1283615, 1257542, 1208020, 1110317, 1096823, 1073689, 1029655, 1070423, 1034355, 972550, 899955, 852318, 795508, 724930, 731241, 742347, 745268, 736599, 755860, 762515, 755664, 683248, 638098, 599438, 620744, 609743, 511017, 467281, 486781, 454064, 377502, 343493, 316610, 324063, 320216, 317160, 261895, 251161, 322836, 365160, 419282, 443857, 387109, 318487]
17959C18487m1144j2256L705r188k4999k0181N994L5641K9271p623j3674j1552
17947B52481j8475r1161l1897M7591N8701m5087j4359J3063K0564L4675L1496
17936B57592l494O130J0705q983p5730O642K7354j2726K028K3101j7643J022N1293
17923B67291O912j8554O346J9687P323j310l3677l2479l4693k546j2619R423l026
17910A78078p594j0223l355j7294M4353P2894P47o7722m4412k3954l933N1879
17898A69464j1563Q455K3827J9842O160M3552j7048O123K7608j838j1795J0975
17886B73762L5394j899L0499m7077n500K9811o751l1421l1283j3779p751R792
17874B33797o6717m2021n969P5192J9220r301j0333L7847N7726l257j8018j790
$$ y = [318487, 277343, 265087, 268792, 259604, 234605, 214424, 220418, 256059, 285330, 277707, 264033, 252481, 234006, 142845, 110948, 158539, 217240, 172153, 157794, 170857, 191421, 226096, 257592, 254098, 260228, 270933, 261950, 186220, 192862, 220216, 207490, 209518, 232619, 214976, 215998, 267291, 274203, 255649, 261995, 281682, 289005, 287695, 254018, 221539, 186846, 184300, 171681, 181104, 178078, 170484, 160261, 156906, 139612, 183965, 256859, 257606, 189884, 145472, 121518, 117585, 169464, 157901, 166356, 190183, 210025, 216185, 259737, 242689, 248812, 276420, 274582, 262787, 273762, 309156, 307257, 337756, 290679, 285179, 314990, 308239, 276818, 245535, 231756, 224005, 233797, 167080, 125059, 119090, 194282, 213502, 204201, 193868, 231715, 289441, 286184, 268166, 266376]
17862B66376q248j3080k3905K5105l0916o4209J9742Q7780j4129J0155J264O109
17850B62044m0836j5911m6403N1222P0999n7198J4383J919j1631J0747Q536J980
17838B49851L2430J8979r291l2900R557J6551k570K0726K6096j2489k6679m2634
17826B47627k0544M6821L9319J4023j4206n3933R955M1223O4489O7947K7227m2945
17814D27003L6048L2986M3920J4837L4677J4795j4748J6965K0115P3725N8083
17803G58406M4291N0947M9036O9361N2123O1182J27019R1788J73136K42639K76873
17792A996801M01806M82967O35527P94467J011382J400046K044501L166795M924557
17783A6858849O906171O606206M001848J190506o085831r712997o170282l268978
$$ y = [266376, 258128, 245048, 221143, 246248, 215332, 151123, 170865, 258645, 244516, 254671, 255935, 262044, 221208, 205297, 158894, 210116, 281115, 223917, 238300, 240219, 228588, 239335, 247871, 249851, 282281, 301260, 291969, 259069, 268626, 285177, 282607, 303333, 329429, 316940, 290261, 247627, 227083, 273904, 313223, 327246, 313040, 259107, 269062, 310285, 374774, 442721, 469948, 427003, 463051, 496037, 539957, 554794, 589471, 604266, 589518, 606483, 626598, 700323, 758406, 802697, 853644, 902680, 972041, 1024164, 1085346, 1212365, 1304153, 1477289, 1719928, 1996801, 2398607, 2881574, 3517101, 4311568, 5322950, 6722996, 8767497, 11934292, 16858849, 23765020, 30371226, 34373074, 35563580, 29477749, 19764752, 13594470, 10325492]
17775A0325492j862909j099980p17836m89329k94922r0098J36707L07712M89864
17766F704701P16757J100998J557244K261554L411209N230972O401511N055773
17758C2440719K952465r65218p341568o538293k784813q4528K205246M296176
17750B4180186M839274K999648J128127l779265q220849o036309l324024j824491
17742I962297j116970p42254n57393l88974k44091j24923N4518K03222L28642
17733G374074N36185Q97609J458264K325437L747686M989470M194379K284858
17725B7807962k34031n950777p053857m124682k224419j320613r38881o35921
17717E324781n38732n25690m51300l40267k17639r8754q8199j67642j45162j01022
$$ y = [10325492, 8462583, 7362603, 6644767, 6155438, 5860516, 5770418, 5907125, 6214837, 6704701, 7421458, 8522456, 10079700, 12341254, 15752463, 20983435, 27384946, 32440719, 35393184, 34427966, 27086398, 20548105, 17763292, 17678764, 19884010, 24180186, 29019460, 32019108, 33147235, 29367970, 21147121, 15110812, 11786788, 9962297, 8845327, 8103073, 7545680, 7156706, 6912615, 6787692, 6842210, 7045432, 7374074, 7910259, 8807868, 10266132, 12591569, 16339255, 21328725, 25523104, 27807962, 27573931, 21623154, 14569297, 10444615, 8220196, 6899583, 5960702, 5324781, 4786049, 4260359, 3809059, 3468792, 3251153, 3152399, 3064200, 2896558, 2751396, 2650374]
17707B650374l8072m6330o5411p6818j33398j11260j55607j57951j46300p2750
17697A646477n5076p2617o6350j29252j42628j09234l3800j06973p2449k1271
17687H36827m0887j6999m9907m7188m5153j9311p233m971l4945p383N577k251
17675E66176o2863j1354k9128o6131o1511J7188L349k4698j8155m1928K6849K2074
17663C19868L1611o6978k8175j0201m6982l0578K3861K2376K1431L5084N9096
17652C30413J5132n8154m6208l9768J9454k2524N090n1032j5272p704j7673k526
17640A09228J1008M2242M4284J768M092n0454r250N4401n7504m9741K8695M1866
17628A70635L0322j6151n9102m3673m467N066L556n58m6104L1333K7014N8651
$$ y = [2650374, 2612302, 2565972, 2500561, 2423743, 2290345, 2179085, 2023478, 1865527, 1719227, 1646477, 1591401, 1518784, 1452434, 1323182, 1180554, 1071320, 1037520, 930547, 858098, 836827, 795940, 778941, 729034, 681846, 636693, 617382, 610149, 605178, 570233, 562850, 568427, 566176, 503313, 491959, 462831, 396700, 335189, 352377, 355726, 331028, 312873, 270945, 297794, 319868, 351479, 284501, 256326, 246125, 199143, 168565, 192426, 214802, 236233, 271317, 330413, 345545, 287391, 241183, 201415, 220869, 198345, 203435, 152403, 137131, 129427, 111754, 109228, 120236, 162478, 206762, 208530, 212622, 162168, 152918, 207319, 149815, 100074, 128769, 170635, 200957, 184806, 125704, 82031, 77564, 82630, 86186, 85628, 39524, 70857, 97871, 156522]
17616A56522P6527J5212K1574q129n6870K3413j67K6957N5658l6874m1547P093
17604B39369l2046l3392K632j8737o0262l3343k3863K1617N0885p674N4922L5346
17592A95454J2217J5397q721p717o326J3372J4551J8861k2415K5257n1514p5874
17580A22542k7355m0722L52N2181O8331l9806l895k9191K9376l0353l1109j8771
17568E1580m2883l802j1278O0081N3516L5696J3223r1458q2379j9080M3671k2305
17556a5418J949L8379p3726K5341O4850K0045J6782K7228J1818j7276Q875k4565
17544H4282k6262K0033k9612j6497l2905l2404m8354J3603J358J9340n586l4716
17532h7720M651K0252j7201J4814M4900O2365K2103l1422j6358j4580R120R773
$$ y = [156522, 233049, 248261, 269835, 261706, 204836, 228249, 228082, 255039, 310697, 273823, 232276, 239369, 207323, 173931, 176563, 157826, 97564, 64221, 40358, 61975, 112860, 105186, 160108, 195454, 207671, 223068, 214347, 206630, 200304, 213676, 228227, 247088, 224673, 249930, 198416, 122542, 95187, 54465, 54817, 106998, 175329, 135523, 131628, 102437, 131813, 101460, 70351, 51580, 8697, 4895, -6383, 53698, 107214, 142910, 156133, 64675, -17704, -36784, 6887, -15418, -13469, 24910, -48816, -23475, 41375, 61420, 78202, 105430, 117248, 99972, 108847, 84282, 58020, 78053, 48441, 31944, -961, -33365, -81719, -68116, -66758, -47418, -53004, -87720, -83069, -62817, -80018, -65204, -20304, 42061, 64164, 32742, 16384, 1804, 10924, 20697]
17520B0697L707j4461k1881k9981r029N761L9175J8586M9377J332l8154K1194
17508D6323K3152j8758n1026J3944k9255k2197M0115N462Q176J8692n26J9061
17496E3163R396M1909j7303M545J2366J9292m1255K2963L8308K7923m2645L1768
17484A60430M6486M4240N938n4653k6729k4872j6512l4391n7453J2071K9107l995
17472G9667J5655k6028r729j4705o143l8281L6792J1083j6738J0284O2926J6369
17460A21152J573K4N1280M532J6206P579k6218k7593J7049j6529J2875P2521M1118
17447B75569j5397P570m215o2197l2045j6989L9686J03289O7399Q5923N8303j04422
17435D02474j28701j4436M9464O4542K5586J01526J15019J1050K0118l2324j06219
$$ y = [20697, 24404, 9943, -11938, -41919, -50948, -45187, -6012, 12574, 61951, 63283, 25129, 46323, 69475, 50717, -309, 13635, -15620, -37817, 2298, 7760, 15936, 34628, 34102, 53163, 62559, 104468, 87165, 91710, 104076, 123368, 82113, 105076, 143384, 171307, 128662, 160430, 206916, 251156, 257094, 202441, 175712, 150840, 134328, 99937, 42484, 54555, 83662, 79667, 95322, 69294, 59565, 44860, 38717, 436, 37228, 48311, 31573, 41857, 104783, 121152, 122725, 122749, 174029, 178561, 194767, 202346, 176128, 148535, 165584, 149055, 161930, 234451, 275569, 260172, 267742, 263527, 201330, 169285, 152296, 191982, 295271, 362670, 448593, 506896, 402474, 273773, 259337, 308801, 373343, 398929, 500455, 615474, 626524, 646642, 614318, 508099]
17424E08099q7687q7544j05395o0565m5934m435j4342j0798O787K7857j5397j7760
17412I2886k1544l0761L2617N1045J3924o1416j0094o797M268k7626j522k4605
17400A0375p734J5374R021K0866J9762O6574N8169J6182l6154n7657n7162j0343
17388D7273O76o0992j11J010j810k1701l990J1971k4507J9260m822k8494K1128
17375d5109K3709J2306O2085P3608m912j3510l3026j3651o067L177P0406M6734
17363A75750j2341l4368j7625k9360k3484O103K844K497J228l1555p2093o9743
17351a02147L8485O5184m1721L5506r904j8138p026O572l569K1647Q0820l5681
17339C0028j5834J5001M8358j2793k2307m5166r202L2866K3791k5319O264q4885
$$ y = [508099, 420412, 332868, 227473, 166908, 120974, 116539, 102197, 91399, 98186, 126043, 110646, 92886, 71342, 40581, 73198, 124243, 138167, 76751, 66657, 59860, 64128, 36502, 34980, 10375, 2641, 18015, 27036, 47902, 67664, 134238, 192407, 208589, 172435, 114778, 57616, 47273, 47949, -13043, -13154, -12144, -13954, -35655, -39645, -27674, -52181, -32921, -37743, -66237, -45109, -21400, -9094, 52991, 126599, 121687, 108177, 75151, 61500, 55433, 58610, 129016, 175750, 163409, 129041, 111416, 82056, 58572, 64675, 67519, 70016, 71244, 39689, -32404, -102147, -63662, 1522, -40199, -4693, -14597, -32735, -39761, -33189, -36758, -15111, 65709, 30028, 14194, 29195, 77553, 64760, 42453, -2713, -11915, 20951, 44742, 19423, 25687, -59198]
17327e9198m7898Q033J8843L3040J3351J6840j69l587K0809O390n009L9077J3451
17314E3973j7280K8388L2539o287k2830Q782k742j8608k2696j9454K4499L2303
17302G0587l6062M0751M3424j6755q4536j0300N5564k110m7630j5642N747m4974
17290d1936j8005L9437K6418m4580k3040L5646L5832R379J6848K3602k0678Q2705
17278A21628J0817k4047M130N323r364j1339l7890J7086M8517l7428p4828k6276
17266a3671M725l528O16q099K6512K6563P507K2143M8796n7284q4959N8815P5223
17253A03359J1092J0629l1774K0893j2825P1373O4977n9895l075n5637k8996k7503
17241F2618n2647n6749l9M6576K0196K2292o684K785J443k5843k805j2208J8880
$$ y = [-59198, -107096, -99063, -80220, -47180, -33829, -16989, -17158, -20745, 64, 6454, 1445, 40522, 53973, 36693, 65081, 97620, 91333, 68503, 77285, 74543, 55935, 33239, 13785, 38284, 70587, 34525, 75276, 118700, 101945, 17409, 7109, 62673, 60563, 12933, -2709, 3038, -41936, -59941, -20504, 5914, -38666, -61706, -26060, 9772, 19151, 35999, 59601, 38923, 121628, 132445, 108398, 112528, 117851, 108487, 97148, 59258, 76344, 124861, 87433, 12605, -13671, -8946, -12474, -11858, -19957, 6555, 33118, 40625, 62768, 111564, 54280, -30679, 28136, 103359, 114451, 125080, 93306, 114199, 101374, 172747, 237724, 177829, 174754, 119117, 90121, 62618, 9971, -46778, -46817, -241, 19955, 42247, 35563, 38348, 39791, 13948, 11143, -1065, 17815]
17228A7815N3946J1856J5798L8678L3113J9870n9257q3959p396M3539K6427J5659
17216A26089K1967K6005K4959Q977o9685p6182l5183m3651o399K1777N935J7747
17204B2356N1873O4331o559p4503l6242J3410K5002M7801m7846m2011Q0271M6933
17192A44816M0582p781j06698j9259J0388l8866M995R713J3011P4684M676m4531
17180H5730m1044k9375l5375J0451N1011o584m1820R652L2305J7274J895j0651
17168D3469N576Q564L4762l0618l4004o78k7707j3061J8118n3737l0621j597N177
17155g6357R376n289O720K7217l526j94o20K5355Q7905Q525p8802M8099O167n9011
17141d435Q654K0576M5361K8074p099j1941k2623j8221O5202L1133l906K152J0256
$$ y = [17815, 71761, 83617, 99415, 138093, 171206, 191076, 131819, 47860, 40464, 84003, 110430, 126089, 148056, 174061, 199020, 207997, 138312, 62130, 26947, -16704, -23103, -1326, 4609, 22356, 74229, 138560, 132001, 57498, 21256, 34666, 59668, 107469, 59623, 17612, 97883, 144816, 185398, 177617, 70919, 51660, 62048, 23182, 28177, 37890, 50901, 125585, 130261, 85730, 44686, 15311, -20064, -9613, 41398, 34814, -7006, 2646, 34951, 52225, 54120, 43469, 49045, 57609, 92371, 61753, 27749, 27071, -636, -13697, 4421, -49316, -79937, -81534, -76357, -66981, -72270, -65550, -38333, -41859, -42053, -42673, -17318, 70587, 79112, 310, 48409, 54576, -4435, 4219, 24795, 70156, 98230, 91131, 79190, 56567, 38346, 103548, 134681, 130775, 132927, 143183]
17128A43183k9600n276K2796l6653j198N657m6987l3597J6314J0710R172l5258
17116A9263J3385j9609k3876N800r850j3253l4012l7235N3228L6106J1812L3568
17104C5327j1407m398O766l6553j9205m047K3187N0433K0172k4698K8480m909
17092E9148m3922k3264j1113J3707R833O583q948j8517L116k9770j6815O5942
17080E980M4927j437J5265m649m7752l4736m041J2091k0939K525N3504J451k5120
17067b931Q245l1074n3434J7447R546n677O323L6743P625q88n4648l2336j1733
17054a06792M5488K8782j1239j5656L2658R891K3253L4202J3068N92k344n1897
17042Fp0414J5991L6318k5899k3018J5073K5330l9991J2066N5869O444l5935n800
$$ y = [143183, 113583, 108307, 131103, 94450, 93252, 98909, 51922, 18325, 34639, 45349, 54521, 19263, 32648, 13039, -10837, -5037, -14887, -28140, -62152, -99387, -46159, -10053, 1759, 35327, 23920, 19522, 26288, -10265, -29470, -33517, -10330, 40103, 60275, 35577, 64057, 59148, 15226, -8038, -19151, -5444, 4389, 10972, 2024, -16493, -13377, -43147, -59962, 5980, 50907, 49470, 64735, 60086, 12334, -22402, -26443, -14352, -35291, -32766, 20738, 22189, -2931, 5314, -25760, -79194, -61747, -52201, -57878, -51555, -14812, -7187, -8075, -62723, -95059, -106792, -61304, -32522, -43761, -59417, -26759, -16868, 6385, 40587, 53655, 54247, 51903, 6, -70408, -54417, -18099, -43998, -67016, -51943, -26613, -66604, -54538, 1331, 7775, -28160, -33960]
17029c3960j5341L6515O7028o0895k0588J5714N2870R060M4615J0714m2296k0653
17017D2783K202K860L0969P2509J507k4874j3062n0629j8268j3386k8055M0545
17005D5101O3977K2846P6282K1460n0237l3332j9633L842j2862l1181J230K4647
16993A12140q446k3985n8029m833K1862o322N125k2657m1412l119J4009j0942
16981b6609P8013R4605J2960o2269m2879N186n127m943J6136L2236J78P333L2817
16968A37637l981J6733O749M079M5035l5775n4206N631j4323R466j2451l7862
16956F6732L6567N6686j338n312K1376r987j91K1745j778j745l9856p2168J8511
16943H9242O7389O5671q324K3451K0947m8498k8504j762L2452M1451N8522n385
$$ y = [-33960, -49301, -12786, 54242, -6653, -27241, -11527, 41343, 50403, 95018, 105732, 63436, 42783, 44985, 47845, 78814, 151323, 152830, 127956, 114894, 64265, 45997, 32611, 4556, 45101, 109078, 131924, 208206, 229666, 179429, 146097, 126464, 130306, 117444, 86263, 87493, 112140, 103694, 79709, 21680, 16847, 38709, 32387, 37512, 14855, -26557, -29676, -15667, -26609, 51404, 146009, 158969, 96700, 53821, 59007, 53880, 48937, 65073, 97309, 97487, 104820, 137637, 133656, 150389, 157138, 161217, 206252, 170477, 116271, 121902, 107579, 117045, 104594, 66732, 103299, 159985, 158647, 153335, 174711, 164724, 164533, 186278, 184500, 182755, 142899, 70731, 89242, 156631, 222302, 213978, 237429, 258376, 209878, 181374, 179612, 212064, 253515, 312037, 306652]
16931C06652j2616L529K3354n0663q348k4532k5150P2430k911O763L8333K5537
16919C52378k0048n975k366n2619J6964L6637K2803j0736k1825L9318J9788J2680
16907C86999J01124N7286J7653K4669R9710P0478Q0326N6912R3830J91604J77051
16896A357642K06673J78894J30475N3878J22079J29917K68535L65394M92945O30868
16886C937300P53104R61455J158758J441685J956849K611420L491913N020398
16878B1332882P276582J0054318J2339266J4191806J4297188R323609L580787
16871I2396438j955713j1406294j4914643j3494371j2612030r765428o291338
16864B1956621l952815k717081j880652j362850j014899p93843o63255n71786
$$ y = [306652, 294036, 297565, 320919, 270256, 261908, 237376, 212226, 284656, 281745, 288508, 326841, 352378, 332330, 326355, 323989, 271370, 288334, 324971, 347774, 337038, 315213, 354531, 374319, 386999, 488123, 545409, 563062, 587731, 687441, 757919, 838245, 895157, 988987, 1180591, 1357642, 1564315, 1743209, 1873684, 1927562, 2049641, 2179558, 2448093, 2813487, 3306432, 3937300, 4690404, 5651859, 6810617, 8252302, 10209151, 12820571, 16312484, 21332882, 28609464, 38663782, 51003048, 65194854, 79492042, 88815651, 92396438, 90440725, 79034431, 64119788, 50625417, 38013387, 28247959, 21956621, 18003806, 15286725, 13406073, 12043223, 11028324, 10234481, 9571226, 8999440]
16856H999440m25809l49255k86181k90324k20653j33877j45905k40107k99311
16847F608018l06722l70099m06485m35578m13920m05701l61581l49152l54702
16838C204078k86470k12784j44410j92456j61490j26891j01464j28274j07704
16829A742135p7999j38297j16662j24099q5097q3900r9626l5331k0663r0401o9319
16818H00741k5233n3313J9575N7046o391k0205K6697L7468P367K0549k3020q3865
16806G57416j22543m9713m4095n886p854j3884L5385p260j0392K4101L861n3780
16794E05356j17977p9354o4250m8633P640N473p225L6677J4432j7636k471J9798
16782B51830l1656J8423k5955m4724j2892k070n501j2507M9937j6447J8070K2119
$$ y = [8999440, 8573631, 8224376, 7938195, 7647871, 7427218, 7293341, 7147436, 6907329, 6608018, 6301296, 5931197, 5524712, 5089134, 4675214, 4269513, 3907932, 3558780, 3204078, 2917608, 2704824, 2560414, 2367958, 2206468, 2079577, 1978113, 1849839, 1742135, 1664136, 1525839, 1409177, 1285078, 1199981, 1116081, 1016455, 981124, 960461, 870060, 800741, 775508, 722195, 741770, 798816, 792425, 772220, 798917, 836385, 843752, 864301, 841281, 757416, 634873, 585160, 541065, 535179, 527325, 513441, 548826, 541566, 531174, 555275, 559136, 505356, 387379, 308025, 243775, 195142, 202782, 208255, 201030, 237707, 252139, 234503, 232032, 251830, 220174, 238597, 212642, 167918, 155026, 152956, 147455, 134948, 184885, 168438, 186508, 208627]
16770B08627N155n2740n5714n6875L356P473K1239L2735k7174k0879R224j3882
16758F0545K4879L9004J2580l0653k6503o697M118J8412j7472K6248K9890j0756
16746A23595q127M1795j1878k5912n295j5321k7162L1904K4852m2533K591m6204
16734D2305m1149P436l5764j5051K7296P0830q874n9890R8601L2772n5711m3899
16722A8902J8019j936M473n2511j8085J1086L6332n1j4023L2770J8532r195L9832
16709H4145K8146m016O0790j290k2069K5559J4410O1583L2607l3378n5289m1954
16697A49244J4k651J1297l3975l1279k4252j4464k2448K6984L1095j5716k9028
16685D4821K4992k5749M289J8669K2955m272j5967K4786R2881O7096Q67j512K0840
$$ y = [208627, 213782, 161042, 105328, 48453, 51809, 59282, 80521, 113256, 86082, 65203, 74427, 60545, 85424, 124428, 137008, 106355, 79852, 73155, 77273, 95685, 78213, 104461, 134351, 123595, 115468, 157263, 145385, 119473, 114178, 98857, 71695, 103599, 128451, 85918, 88509, 42305, 1156, 8592, -27172, -42223, -14927, 55903, 47029, -12861, 85740, 118512, 62801, 18902, 36921, 34985, 39458, -13053, -31138, -20052, 16280, 16229, 2206, 34976, 53508, 44313, 84145, 112291, 108275, 169065, 167775, 145706, 171265, 185675, 247258, 279865, 246487, 191198, 149244, 149258, 146607, 157904, 123929, 92650, 68398, 53934, 31486, 58470, 89565, 73849, 44821, 69813, 44064, 48353, 67022, 89977, 85705, 69738, 94524, 187405, 254501, 255368, 253856, 274696]
16672B74696n1463P922P798j8828L5584q94q3745l6384m608l5027m4426l5395
16660A5230M848J7650r119J3106L4507j1126k2645j4558n2838n2398k104L9519
16648c9928K3876j0227L1914J9120o228K6731M2243n199N126n8327l3929k0393
16636b5221p7089j5429R0876M1020j3368L5061N8802j9902l8184n460j3747k1632
16624d273n2094J1883k2076J1124M9824N7568J1475k5819m6335m4711N60j0941
16612f3815K141K8860k0260k2974J1580j5176M462M722K2546K8537L954l8906
16600e4329K6727O753M651L6842J1434j4588J941k9234m7502M3034L5898Q3168
16588A04795M2324j4266l3843l5973L515J1250k4627k4444k1210j02329J9451
$$ y = [274696, 223233, 231155, 238953, 220125, 255709, 254815, 171070, 134686, 130078, 95051, 50625, 15230, 20078, 37728, 28609, 41715, 76222, 65096, 42451, 27893, -24945, -77343, -79447, -39928, -16052, -26279, 5635, 24755, 18527, 45258, 87501, 82302, 87428, 29101, -4828, -25221, -102310, -117739, -26863, 14157, 789, 35850, 94652, 74750, 36566, 31106, 17359, -4273, -56367, -44484, -66560, -55436, -5612, 51956, 63431, 37612, -8723, -53434, -52874, -63815, -61674, -32814, -53074, -76048, -64468, -79644, -75182, -70460, -47914, -19377, -15423, -54329, -27602, -20849, -16198, 20644, 32078, 17490, 19431, -9803, -57305, -14271, 21627, 104795, 147119, 132853, 99010, 63037, 66552, 77802, 53175, 28731, 7521, -94808, -75357]
16577g5357M0915j8282K049Q7432K6737k2498M1259O1402K1220l2615n7197n5053
16565B0012k1420O2336j3389J7276N1427K354j3095o3882k7964l4247J3206J0050
16553B664Q86l8836R613J1512j0918M2595L5938j8927l5727n2698J8438J6921
16541a8539L5666L2516K943o0961k2677k083L3517K7631o7188p6953K2770M5201
16529d8157K4024J9102o2849l4794P5176K0874k0867k2517O416J0280n6787P507
16517h2592L2169K8902L9249K8000N107k4929l9232M3701M9879K3542k0006n0562
16505C3228K9700M0919m4363m9767J9766R563k4169q599n664r916N0053J8563
16493E9314N1281o3936k9069M2265J59Q470J5228N172J4943k9690l9603J551K059
$$ y = [-75357, -34442, -52724, -50675, 36757, 63494, 40996, 82255, 143657, 164877, 132262, 75065, 20012, -1408, 60928, 47539, 64815, 116242, 118596, 105501, 41619, 13655, -20592, -7386, 2664, 3550, -35286, -25673, -14161, -25079, 17516, 53454, 34527, -1200, -53898, -35460, -18539, 17127, 49643, 52586, -8375, -31052, -33135, 382, 28013, -39175, -116128, -93358, -48157, -24133, -5031, -67880, -102674, -27498, -6624, -27491, -50008, -43592, -33312, -90099, -82592, -50423, -21521, 17728, 45728, 50835, 25906, -13326, 30375, 80254, 103796, 83790, 33228, 62928, 103847, 59484, 9717, 29483, 39046, 14877, 6278, 614, -9302, 40751, 59314, 110595, 46659, 17590, 59855, 60014, 68484, 83712, 88884, 103827, 74137, 34534, 36085, 38144]
16480C8144k8857m2727q384j385M4238m9875J5920o904j5546J719q544P2024L5766
16467D5589k0319k2714k9409k3449k1452O9658J7312L041j4602M909j0184j5466
16455a7086j5498q774K1292j1594k0580O8249L2326J7063J4028o8402p7058l3454
16443i9488M3313L6722L1449k0603k1300R451o857J3811K3628L9529N1456k6474
16431G4637j0203q314J2444L7778L625l4160J3542k978K0639J0934l2468m6606
16419C8870k6604M3838J7599j9175J3675o786j4566K2509K8603J1927k1594l2586
16407E5710k0581k7664O6483N3727r846n3539n363L678O2502k1984o397M8325
16395A45051l3629k5134m6527p585M0768n7814o655M3669J9879L159J9600m9029
$$ y = [38144, 9287, -33440, -41824, -43209, 1029, -48846, -32926, -39830, -55376, -53657, -62201, 9823, 45589, 25270, 2556, -26853, -50302, -71754, -2096, 15216, 18257, 3655, 8564, -1620, -17086, -32584, -41358, -20066, -31660, -52240, 16009, 48335, 65398, 79426, 11024, -66034, -99488, -56175, -19453, 11996, -8607, -29907, -20456, -27313, -13502, 10126, 49655, 101111, 74637, 64434, 56120, 68564, 106342, 109967, 75807, 89349, 86371, 107010, 117944, 85476, 38870, 12266, 56104, 73703, 54528, 68203, 61417, 46851, 69360, 97963, 109890, 88296, 55710, 35129, 7465, 73948, 127675, 117829, 64290, 58927, 62605, 125107, 103123, 96726, 145051, 111422, 86288, 39761, 32176, 72944, 15130, 8475, 52144, 72023, 75182, 94782, 45753]
16383D5753q1432n3341K190L0506M6141K4258J5228k863j6482j7231J3699M3254
16371D9680j7944l3951o5496p446K9151l9438O858q163k3218O5515P1971K3663
16359E1182J8904l7255l2479K8839j5864l3011M724m7518j9029k7641O492M0575
16347f2081J4413L120j4955M2047J7715r860k2193K9564O1128j1006j8366k1579
16335G947k4655N141N2400M4188O403k2734o3736j8433O1496j0419K9402k2527
16323D4473K0360L2867J4922j399J5194L6242N585m824k3445P6115J01674Q4575
16311D02339O9664j4443L1468m5903o9886p6194r5231m2372l1201k5831k0695
16300H1715k7997n7712J424k9752j298j1056J3079L7200K3254P304k5023j5978
$$ y = [45753, -35679, -89020, -86830, -56324, -10183, 14075, 29303, 26440, 9958, -7273, 6426, 49680, 31736, -2215, -67711, -75157, -46006, -85444, -78586, -86749, -109967, -44452, 27519, 51182, 70086, 32831, 352, 29191, 13327, -19684, -14960, -62478, -81507, -109148, -102656, -62081, -47668, -44548, -59503, -17456, 259, -9601, -31794, -2230, 58898, 47892, 29526, 7947, -16708, -11567, 40833, 85021, 91424, 68690, 4954, -13479, 48017, 37598, 67000, 44473, 64833, 97700, 112622, 111223, 126417, 162659, 168244, 163420, 139975, 216090, 317764, 402339, 472003, 457560, 489028, 443125, 373239, 297045, 201814, 159442, 128241, 102410, 81715, 53718, -3994, -2570, -32322, -33620, -44676, -31597, 5603, 28857, 36161, 11138, -4840]
16288d840j6790j8465L3678p990l026L6620K5129P40j6027m6413m2007o91j4513
16275g4595r22J4407N0212R604J9664Q941j8689o5364N756N4799J3158J0185m9275
16262b2119k3795l8922J2571L5231K8544L5752J3866j026l2087l340j0418J2365
16250F622K8017K9013j2346j0948P091J1621j4410j7705N618J9060J3545M072
16238F9250l3377k8470J6158N0865L0433k4611m7219L963O155l2965K0643K4838
16226E5663J9032j6620o6842k4743J8148K6022L0070l145n5035K266N2214M090
16214D1120r466k8928O234k028K1143N2210m2096j03749J6288K0122O3570J7189
16202E1609m8664L461J9177m6771k6879L4572J97m2382p716j4359j9883M0758
$$ y = [-4840, -21630, -40095, -6417, -14407, -17433, 19187, 44316, 45056, 29029, -17384, -59391, -60082, -74595, -75517, -61110, -10898, -1294, 18370, 27311, 8622, -56742, -50986, 3813, 16971, 27156, -22119, -45914, -84836, -72265, -37034, -8490, 27262, 41128, 40102, 8015, 4675, -5743, 6622, 34639, 63652, 51306, 40358, 47449, 59070, 44660, 26955, 32573, 51633, 65178, 69250, 35873, 7403, 23561, 74426, 104859, 80248, 33029, 36992, 43147, 10182, 30825, 55663, 74695, 58075, -8767, -33510, -15362, 10660, 40730, 37585, -17450, -15184, 37030, 41120, 31654, 2726, 8960, 6932, 28075, 80285, 38189, -65560, -49272, -29150, 34420, 51609, 2945, 6406, 25583, -21188, -48067, -13495, -13298, -55680, -63396, -77755, -97638, -56880]
16190e6880M8698J1268l1600J0563L2720J0618N5200N7982K3449N2063M8338M651
16178B67070M513L1246l178J3929k0132o0783l0245l2169j6957l0017l015k7999
16166I2263j8143L6862n2179n4819j3382M874n5231K5693O4335J7757J5388K4878
16154H8296l8877m4501j149O686J7633M5225j9642p8223n879q178j3159K114J5503
16141c4151J6946R839l6955k300M6760J9151o8150q114L0612q986j9813j5347
16129g0508M8261p60m2119K8333L0382J315P123l34O809J094l7205n309K2069
16116a0849j4364J6740P1580j0442n2665j7646n12k2603k5412P2143L0864m4784
16104g950J595l9277p299O8646J3904k7786l653k9168m720P374n4076m3313K5007
$$ y = [-56880, -8182, 3086, -28514, -17951, 14769, 25387, 80587, 138569, 162018, 214081, 262419, 267070, 271583, 302829, 299651, 313580, 293448, 232665, 202420, 170251, 153294, 123277, 120262, 92263, 74120, 110982, 58803, 3984, -9398, -4524, -59755, -34062, 30273, 48030, 63418, 88296, 49419, 4918, 3769, 10455, 28088, 73313, 53671, -24552, -30431, -38609, -51768, -49654, -34151, -17205, -7366, -44321, -46621, 139, 19290, -48860, -56974, -26362, -35348, -55161, -70508, -22247, -23007, -65126, -36793, -6411, -5096, 2027, 1693, 8502, 9596, -27609, -32918, -10849, -25213, -8473, 63107, 52665, 0, -17646, -18158, -40761, -66173, 5970, 36834, -7950, -6355, -45632, -52931, 15715, 29619, 1833, -1820, -30988, -35708, -28334, -82410, -125723, -100716]
16091a00716J6107N2252J5145L1597M6762n0538m0150K3567m5786k4616L6984
16080c9392k102j1790L7923M5316l1913j1095m657O021L2267K8994Q912j2178
16068D6306k7306N1727j9903k1543j2575P78L0251m7967O501L5602k8059j5128
16056a316M9733O422k7297n1271o3131J7926P1878m651j7123K4074M9466K0065
16044G4775k9538l5337o4346k9225n3R255L4677N1472J4902m8126j3436K2520
16032a2460n5958K7229M9924L5499p297o1947k0305M8271L2461j8227l2850J566
16020a4094l4403J5703L5103k5922m4389n2580K7709N1506j0066K7504J0237K2673
16008H981j9826o2629L9961O1531L6736m2133p2413j1914j4488r8023L0398R3276
$$ y = [-100716, -84609, -32357, -17212, 14385, 61147, 10609, -29541, -5974, -51760, -76376, -39392, -41494, -53284, -15361, 29955, -1958, -13053, -17710, -11689, 20578, 49572, 58484, 46306, 19000, 70727, 50824, 29281, 16706, 17484, 47735, -232, 6269, 41871, 13812, -1316, 48417, 54839, 27542, -23729, -86860, -68934, 2944, -1707, -18830, 5244, 54710, 74775, 45237, 9900, -54446, -83671, -83724, -74469, -39792, 11680, 26582, -21544, -34980, -12460, -68418, -41189, 8735, 44234, 36937, -25010, -45315, 2956, 35417, 17190, -15660, -14094, -48497, -32794, 2309, -23613, -68002, -120582, -92873, -41367, -51433, -23929, -13692, 8981, -10845, -73474, -33513, 28018, 64754, 22621, -49792, -61706, -76194, -174217, -143819, -50543]
15996e0543K7725j3285M2101N375j5083j926J8106p8482k4160K0188j8027j711
15984h9722K7486K2103r564K9667m539j5757N9663m0783j5498k945J7084m9168
15972g1973j8078m0254j0903O1711K0859J9304j5416M091N4851k0846o2908j0075
15960h9637Q207J2916L5562N934R854k485k8347K2645k3123K29q310j3279L8214
15947c1620K6928R144k7979j039k8025j7984K6418N489K4375K4291J8216l4259
15935f045j0623l9900j2602J5819N7795K6290l6121q3341J1260M2980k91j3115
15923d7894J0965j2641l2785p133K9016j8742K3506N4636N9881l3571n1715k9994
15911e6471m174k1106n9333k2241K5360O0703L4454k3097N123L4067L7934M4570
$$ y = [-50543, -22818, -36103, 5998, 11373, -3710, -5636, 12470, -66012, -90172, -69984, -88011, -89722, -62236, -40133, -49697, -20030, -24569, -40326, 19337, -21446, -36944, -39889, -22805, -71973, -90051, -130305, -141208, -79497, -58638, -39334, -54750, -50659, 4192, -16654, -79562, -89637, -81430, -68514, -32952, -27018, -17164, -19649, -47996, -25351, -48474, -48245, -56555, -69834, -31620, -4692, 4452, -23527, -24566, -52591, -70575, -44157, -38668, -14293, 9998, 28214, -6045, -16668, -56568, -69170, -53351, 4444, 30734, -5387, -88728, -77468, -34488, -34779, -47894, -36929, -49570, -82355, -89488, -60472, -79214, -55708, -1072, 58809, 25238, -26477, -56471, -60645, -81751, -141084, -163325, -137965, -77262, -42808, -65905, -60782, -26715, 11219, 55789]
15899E5789J3760N1874O255k0879p4124m7200o638L9430l9277n8679k5743R205
15887i6227M4774M4098L9083k5799n6700j2946L4029Q5190N356N3895o5955p124
15875D1674K5021K4151j563k754k2707K3495j2647l5627j3703K5963M874l1108
15863B5069j4607p759l5453r759J2148N4177J9299K30m5286l2017q236P600j0194
15850d4788K1850L4925k1078J2739L9011J2156k2603o0526l1193O452R331m427
15838d8151k9085K5720r411o779O034J7309l944J084J4238L9897k6336p3715K7338
15825f5801N1717m1814l508M5745K6429J844j4488J0699M2064r250k2867j4242
15813F528m056j8028k6367l6927L8285L7588l7531j8482j7135K3191M732j9211
$$ y = [55789, 69549, 121423, 127678, 106799, 32675, -14525, -21163, 18267, -21010, -79689, -105432, -96227, -51453, -7355, 31728, 5929, -50771, -63717, -29688, 55502, 60858, 114753, 48798, 41674, 66695, 90846, 89283, 86529, 63822, 87317, 74670, 39043, 25340, 51303, 56177, 25069, 10462, 2703, -32750, -42509, -30361, 23816, 43115, 43345, -1941, -33958, -42194, -34594, -44788, -22938, 11987, -9091, 3648, 42659, 54815, 32212, -28314, -59507, -53055, -43724, -48151, -77236, -51516, -60927, -67706, -61672, -44363, -48307, -47223, -32985, 6912, -19424, -93139, -65801, -14084, -55898, -59406, -13661, 12768, 14612, 124, 10823, 52887, 43637, 20770, 6528, 2472, -15556, -41923, -78850, -40565, -2977, -40508, -58990, -76125, -52934, -48202, -67413]
15801f7413M5410K8664n9599j955J6644k014p369n3079M0641K6824M069k3520
15789e2697J3548L9468k7704l7460J2792J3635k8142j6106M2238K9967j1764l8812
15777f1037m557l9840j4866j290j1377N2622L6106k021r522k1813L8124J3241
15765b6230l0766n9061j2631J9217Q3770L6506j0912p809J0262l593m2778J8067
15753b5958k4696j2518n6804K1725N4211K9622O93Q147n0407J4649N0946N9790
15741F9400J7877J6992J0039l9659q0198L1907L1029L249l4102n4390l0524l0337
15729h8717J8190L1771j9375K0699M3242k8672K390K6795M2993j8200l360n5672
15717b7916Q703M534j3273K5634L7933p4252p288n765K6050Q766j9907k3652r365
$$ y = [-67413, -22003, 6661, -52938, -54893, -38249, -40263, -47632, -100711, -60070, -33246, -29177, -52697, -39149, 319, -27385, -64845, -52053, -38418, -66560, -82666, -40428, -10461, -22225, -61037, -65594, -105434, -120300, -121590, -132967, -80345, -44239, -46260, -55782, -77595, -39471, -26230, -56996, -116057, -128688, -109471, -25701, 10805, -107, -7916, 2346, -1247, -44025, -25958, -50654, -63172, -119976, -98251, -44040, -14418, -13725, -5578, -55985, -41336, 9610, 69400, 87277, 104269, 114308, 74649, -5549, 26358, 57387, 60636, 26534, -27856, -58380, -88717, -70527, -38756, -58131, -37432, 5810, -22862, -20472, 6323, 49316, 31116, 27756, -27916, -19213, -14679, -27952, -2318, 35615, -38637, -45925, -51690, -25640, -16874, -36781, -60433, -69798]
15704f9798O6784K5164r341L4120Q049L1578q296n7488k4915K1961J2906k6902
15692C822k6575K1914j7839j3753L7861J0376k7364l4424L6038M9515j3409j7945
15680H217p902J7981o6426O050O4620n5948m4258K4924M269j5675o246M0305P9854
15667D9765K0514j101m7642o8487L546j1790k4259j0353N4117J6455P524p230
15655a8941j0987J031l3035j9370J0146O5091P4920K9602q2934k6240N0610N4262
15643I4155o5002o745r965k8366q531K3600J8131k0868l1610m6923Q113j5290
15631h9301N6711J2655O8709K2637k4358k9829k2301o6834J0472O4660K9417k5736
15619F902k1449j172L7191K8773P160o0878k9818P572k8853K6582J2836o108L6450
$$ y = [-69798, -3014, 22150, 12809, 46929, 54978, 86556, 78260, 20772, -4143, 17818, 30724, 3822, -22753, -839, -18678, -32431, 5430, 15806, -11558, -45982, -9944, 39571, 26162, 8217, 315, 18296, -48130, -42080, 22540, -33408, -77666, -52742, -48473, -64148, -70394, -30089, 49765, 70279, 69178, 21536, -46951, -43405, -55195, -79454, -89807, -35690, -19235, -11711, -18941, -29928, -28897, -61932, -81302, -71156, -6065, 68855, 98457, 15523, -10717, 39893, 94155, 29153, 22408, 12443, -15923, -24454, -854, 17277, -3591, -35201, -82124, -74011, -89301, -32590, -19935, 48774, 71411, 47053, 17224, -5077, -71911, -61439, 3221, 32638, 6902, -14547, -15719, 21472, 50245, 57405, -3473, -33291, -25719, -54572, -27990, -15154, -21262, 15188]
15606A5188K2978k0333Q111k9296l9329N928J5270M0194L2184K1780n7823l0968
15594a6116M188q127o590M0236k5337m2830O071L8215P754m8456Q974L5414J5919
15581I315o048j9374j4531J2535N559K4285K8599j8405j2421j8353P278L7410
15569C5849l9647o472k8836n9919j1470M7697M4251j1571j7047L208R323K8439
15557f195J0552o409k4831K5804P183r713n363k9723M2278M6914l8416K1443L291
15544C6815j0064l8319o34L6548l8665o488M8629l537N044O1260p1Q170k1322
15531G7366j9491k7421K843N433k4642l7160n3029j3049J7319L9434r832J5469
15519b6760K2313K1846K1620j6261Q119L627N0042J5426j01171l0201K0901m9368
$$ y = [15188, 38166, 17833, 25944, -3352, -42681, -36753, -21483, 18711, 50895, 72675, 14852, -16116, -11928, -20055, -26645, 13591, -11746, -54576, -48505, -10290, -2536, -50992, -42018, -6604, 9315, 3267, -16107, -30638, -18103, -12544, 11741, 40340, 21935, 9514, -8839, -1561, 35849, -3798, -10270, -39106, -99025, -110495, -62798, -18547, -30118, -47165, -43957, -34634, -6195, 4357, -2052, -26883, -1079, 6104, -3609, -8972, -38695, 3583, 50497, 12081, 33524, 36815, 26751, -11568, -12202, 24346, -14319, -20807, 27822, 24285, 29329, 90589, 90518, 98688, 77366, 57875, 30454, 33297, 38730, 14088, -23072, -76101, -89150, -71831, -32397, -42229, -26760, -4447, 17399, 39019, 22758, 30877, 34504, 84546, 99972, -1199, -31400, -10499, -59867]
15507e9867j7922k0885N984p871O52M9342K4830J2820J1858j8678P938q501m963
15494b5263M5541o035j0724k783k2734k8757J9518L4697K3614o0620n1726j0974
15482i6246J3825K5004j4990J9551N9517j2608m1480J9197n780K5382k302n0611
15470f1541m5168N3777N3811m2685R876J6729j4329p4095P710L8213K0308L2243
15458e151o4297q1184o8940J7116O6549J0257n791M1365L0245R492K7215k3326
15446d6450j2082J8563N6992j3861n2301J5243o442k4241J4506J1494J2839J8739
15434g001J4339k1568j8286l3493O60J3465j1889L1652N1022J7890m355j6400
15422A6036l5803K4728J169k8176N057l820j9376q804L4184K7071k1285k6230
$$ y = [-59867, -77789, -98674, -92690, -100561, -99909, -50567, -25737, -12917, -1059, -19737, -11799, -20300, -25263, 20278, 14243, 3519, 736, -21998, -50755, -31237, 3460, 27074, -33546, -85272, -96246, -82421, -57417, -72407, -52856, 6661, -5947, -47427, -28230, -34010, -8628, -10930, -61541, -106709, -52932, 879, -41806, -31930, -15201, -29530, -103625, -95915, -57702, -37394, -5151, -69448, -150632, -219572, -202456, -135907, -125650, -131441, -90076, -59831, -50339, -23124, -46450, -58532, -39969, 17023, 3162, -49139, -33896, -40338, -64579, -50073, -38579, -25740, -7001, 7338, -14230, -32516, -66009, -65349, -51884, -63773, -32121, 18901, 36791, 32436, 16036, -19767, 4961, 6130, -22046, -16989, -20809, -40185, -48989, -14805, 12266, -9019, -35249]
15410c5249m2196J4995L3623J1747K5508K9999j0507n9362k5239K0425j4658K1886
15398b9028N2178o114j8068k381j6377r312L6861K9743O0513k5598r0499j8035
15386c6117l1383j437J7066k861J000M2078K0981k6684p47N2171L0423m3823k0670
15373ck2119J8732K8684j1283r302J1110j2093L1425n183l4432R118Q767l5034
15360b1613n814j8723m167k7551J6967j6310P7145K2955L1685K7441n0685l1856
15348e26k1118L2084L510l6568L8226M60l4251K0354Q192k8802P021M1079K995
15335C2656j2393J3256N779m865l3570K857l6897P732M0463J49q3401j5673J7818
15322f6089r245L0806l3922M9559j6396o0904L4290L7455J6914l0688l1974J6415
$$ y = [-35249, -77445, -62450, -28827, -17080, 8428, 38427, 27920, -31442, -56681, -36256, -50914, -29028, 23150, 17036, -1032, -3413, -19790, -29102, 7759, 37502, 98015, 72417, -18082, -36117, -67500, -68937, -51871, -54732, -53732, -11654, 9327, -17357, -18104, 34067, 64490, 20667, -3, -22122, -3390, 25294, 14011, 4709, 15819, 3726, 35151, 29968, -4464, 4654, 13421, -21613, -27427, -46150, -50317, -77868, -60901, -77211, -66, 22889, 54574, 82015, 31330, -526, -21644, 10440, 13950, -22618, 15608, 16068, -18183, 2171, 10363, -18439, -11418, 29661, 32656, 20263, 33519, 39298, 34433, 863, 3720, -33177, -25445, 15018, 15167, -68234, -83907, -66089, -75334, -44528, -78450, -28891, -45287, -106191, -71901, -34446, -17532, -48220, -80194, -63779]
15310f3779k4926q369J5445L3579j115m0462L2174K1035J0782J9688k5289j2754
15298d3991l2082j8344L2548r036J2989L0360K5775J4580K3351r191j0365k4076
15286g482j6818k553M633o131j67K3102K1605m9275k7668M5831K0675M8090l4823
15273A9019o6589j9182Q62j4476M8976L1334k3019J3836K0077m1057M5412L9348
15261E4541r328k0598j4164j6020j1830n107m266l489Q954K5462j333K3121j6783
15248I160n2952q0201j0987K1885N6721k5463k5441l6433q62L8367L0811J5914
15236e9481J2131k249K710J0204J4767J1400j2552n1207J1160M0019J6222K215
15224d661J3831l5925k1146M5078M9445m3383k7246k4419l7417k3396O44P9940
$$ y = [-63779, -88705, -97074, -81629, -48050, -49165, -89627, -57453, -36418, -25636, -5948, -31237, -43991, -76073, -94417, -61869, -70905, -57916, -27556, -1781, 12799, 36150, 26959, 16594, -7482, -24300, -26853, -22220, -28351, -28518, -5416, 16189, -33086, -60754, -14923, 5752, 53842, 19019, -47570, -66752, -65890, -80366, -31390, -56, -23075, -9239, 10838, -30219, 15193, 54541, 45213, 24615, 10451, -5569, -17399, -22506, -26772, -30261, -21307, 4155, 2822, 25943, 9160, -43792, -123993, -134980, -113095, -56374, -81837, -107278, -143711, -144573, -106206, -75395, -59481, -47350, -49599, -46889, -36685, -21918, -10518, -23070, -74277, -63117, -23098, -6876, -4661, 9170, -26755, -47901, -2823, 46622, 3239, -24007, -48426, -85843, -109239, -108595, -28655]
15212b8655K44K786n278K5986Q538k5407J4711j4102r936K4246O052k6096n0422
15199g7333m2254J7035N5157L1118O641N5195L2639j7258j7302l7358k5256k7991
15187d6967n841l8194P0464J6680M0212p532R167p893q961P448L9829L5720j4188
15174H9944n5549K9171L9983l6435j7113j6361k3160j7061L5240Q622K2013J7985
15162G7279p342l6479p876L657r580O773n519m5230Q679M8875k228m6050p1316
15149h6357p858M2664Q7502j6732k9382J8383k9981q939K6137J8842l9146M6518
15137B1651K5863L0852n3007j8760j8183J8318j4572O362L7582j5741Q382k7833
15125I14n0576J1530N915J9734n469M6128K1494P969k406k2142o068j0924O59
$$ y = [-28655, -28411, -25625, -30903, -4917, 3621, -21786, -7075, -21177, -31113, -6867, -815, -26911, -77333, -119587, -102552, -47395, -16277, -9636, 45559, 78198, 60940, 43638, 6280, -18976, -46967, -52808, -91002, -20538, -3858, 36354, 28822, 37989, 30096, 21135, 28583, 68412, 104132, 89944, 34395, 63566, 103549, 67114, 50001, 33640, 10480, -6581, 28659, 37281, 59294, 77279, 69937, 33458, 25582, 29239, 19659, 26432, 20913, -24317, -15638, 33237, 31009, -15041, -86357, -94215, -51551, 35951, 19219, -10163, 8220, -21761, -30700, -4563, 14279, -24867, 21651, 47514, 78366, 25359, 6599, -11584, 6734, -7838, -1476, 36106, 20365, 28747, 914, -49662, -38132, -32217, -12483, -17952, 28176, 49670, 57639, 55233, 33091, 27023, 16099, 16758]
15112A6758m0006K7382M5225P129l9661n0919J3663J5956o0330K7089L8512L0112
15100C0910L3549n0486K9951n538k5127K9509j9258n4937n2094o1069L8710M7051
15088e8829m757O609K0418K2806k9027K7157L2327o7641j6937N1959M9925K7646
15076F1656m3796j1364K3777k7095o8241l0797K3573J0840l5042O1516L5256j2421
15064a2138l8792n106J5466N9484J0049r996O072j2317K7669o533J399k3152J1719
15051B3824j3812K5141K0994k3815n7418j9334j4281k109Q16j8918Q545P324o3306
15038a26349l274L9145M9475J7183L1164J345n6050L5666k143j8379j6163P14
15026d7666j7082M941l8767p517J4386o48M2729J3961L360L420j9500O489N2043
$$ y = [16758, -23248, 4134, 49359, 56488, 16827, -34092, -20429, -4473, -64803, -37714, 798, 30910, 64459, 13973, 43924, 38386, 13259, 42768, 23510, -31427, -83521, -144590, -105880, -58829, -63586, -56977, -36559, -13753, -42780, -15623, 16704, -50937, -67874, -15915, 34010, 61656, 17860, 6496, 30273, 3178, -65063, -95860, -72287, -61447, -96489, -34973, 283, -12138, -50930, -56036, -40570, 18914, 28963, 18967, 25039, 12722, 40391, 33858, 35257, 12105, 23824, 10012, 35153, 56147, 32332, -25086, -44420, -58701, -60810, -59994, -78912, -70367, -63043, -126349, -129623, -90478, -41003, -23820, 7344, 8689, -47361, -11695, -13838, -32217, -48380, -47666, -64748, -59807, -98574, -106091, -91705, -92353, -49624, -35663, -32303, -28883, -48383, -41894, 10149]
15013A0149K1275n295j4076J6640K1786j4094k3206k7202j6293L1244l570l8471
15001d1113n719q602L7664j7269l102l0484n2877j4788M3073O4475j9357r135
14989e7234o277J6602O692l6034N264P4146K1532j283j3935k0774r448L0458K8955
14976C8664l0061j880M751P780j4701j5053M839j4024R492L4093k0824l9313k8449
14963f4686M3028L0963k1613k2063J1251R555J8480J7026j2757j1008O659k1752
14951a6917K8116K0865r207o3543m755j8440L8210j9280J261O4791k9838J2955
14939D218Q0479j8973n7237R161P8949j4468m0316k7427R057m3127J3697N938
14927d9j3704k9784L109K4826O5674j4246J1340J7637m612k7711J4777K2570n542
$$ y = [10149, 31424, 26129, 12053, 28693, 50479, 36385, 13179, -14023, -30316, 928, -2642, -41113, -46832, -55434, -17770, -35039, -38141, -68625, -121502, -136290, -93217, -28742, -48099, -57234, -63511, -46909, -40217, -76251, -70987, 3159, 24691, 23408, 9473, -11301, -20749, 9709, 38664, 8603, 6723, 11474, 19254, 4553, -10500, -5661, -19685, -10193, 23900, 3076, -36237, -64686, -21658, 9305, -12308, -34371, -23120, -13565, 4915, 21941, 9184, -1824, 4835, -16917, 11199, 32064, 22857, -40686, -45441, -63881, -25671, -44951, -43690, 21101, -8737, 4218, 84697, 65724, 8487, 17648, 96597, 82129, 41813, 14386, 23443, -19684, -5987, -49, -13753, -43537, -40428, -15602, 50072, 35826, 47166, 64803, 60191, 32480, 47257, 69827, 64285]
14914F4285l5706J289k2428p5944K9162K1278J0606J453q593j737M8854l8538
14902f019J0560J7758l8378K4784O2242P7920k3819o4267k9597k0949j6931k529
14890i225k8759J5705L5190j3472l2696l605j0247J0235J5493K4354J113m667
14878e81m1525l3780l3880L2427P9150J4574m1422J3286Q15p555L5695K5708j0057
14865C2855P250m7164k4137L748l3177j7179J5361K491j3382K080J3274J5043
14853d2937k3945o1795p023M9507K0834O597L9076J7479q714m2594j7517p683
14841g8715K0683K2080K3289m5446q0422K2445O6653k685l6671j0536L126K7525
14829f8674q432K1869N9349M0459K6134k5782m1224j1374L6923J696r36L0083
$$ y = [64285, 28579, 29868, 7440, -68504, -39342, -18064, -7458, -6005, -14598, -16335, 32519, -6019, 4541, 22299, -16079, 8705, 70947, 148867, 125048, 60781, 31184, 10235, -6696, -9225, -37984, -22279, 12911, -561, -33257, -36862, -47109, -36874, -21381, 2973, 4086, -581, -42106, -75886, -109766, -77339, 1811, 16385, -25037, -11751, -10936, -18491, 17204, 42912, 32855, 40105, -7059, -31196, -27448, -60625, -77804, -62443, -59952, -73334, -71254, -57980, -42937, -66882, -128677, -135700, -86193, -65359, -58762, -19686, -2207, -10921, -53515, -71032, -78715, -58032, -35952, -12663, -58109, -138531, -116086, -49433, -52118, -88789, -99325, -96199, -68674, -77106, -55237, 4112, 44571, 70705, 44923, 3699, -7675, 29248, 30944, 30008, 60091]
14817F0091P663o7131M0542K2647o280n7889m2764M9490j9985L2492J4116L5926
14805F8918m311o103J3087j4764o5411j0084n7308K4216M3810j2228k945L780
14793a9343j2535r674J1906L1243l4814l3996j6041k4061K7177L4295N8291L714
14781A6162j2930K078J6271k613p8923k1453N3455J8145o427k5433K2015J9265
14769c88N1409M0437L7397n1638j3705j1699k7648q5801n3088K0993m823J29K8961
14756f9464M4909J6520m9355R724j027k7962K6444O6677K0052k2634l7135L577
14744a9674m9850K485L2124K5435k1296J025J9727J2694K6510L0476j0098p5595
14732b6037j6929q5k8004L3944l9776k6069M7445o008K1049R564L1619M7612n13
$$ y = [60091, 67754, 623, 41165, 63812, 57532, -357, -43121, 6369, -13616, 18876, 32992, 68918, 64607, 58504, 71591, 56827, -8584, -18668, -75976, -51760, -7950, -20178, -23123, -19343, -31878, -41552, -29646, 1597, -33217, -67213, -83254, -107315, -80138, -45843, 12448, 16162, 3232, 5310, 21581, 18968, -59955, -81408, -27953, -9808, -16235, -41668, -19653, -388, 51021, 91458, 128855, 77217, 63512, 51813, 24165, -61636, -114724, -93731, -98554, -98425, -69464, -24555, -8035, -57390, -47666, -48693, -76655, -50211, 16466, 36518, 13884, -23251, -19674, -69524, -67039, -34915, -9480, -30776, -29751, -10024, 2670, 29180, 59656, 49558, -26037, -42966, -43051, -71055, -37111, -76887, -102956, -55511, -61519, -40470, -30906, 713, 48325, 47812]
14719D7812l4106l685K7527j2119l0848l8192o533J636j7904M4145Q6194K8898
14707I2825m6888k3500n1477j484K0343K712m1238k5668r441j0578P82k987L215
14694i3384L1186J1893p388j0151j1737K4201m803n9340k9509R0709L8496L1000
14682A1173L1099l3564q86l3609r59M4339O1182K2795o6041l9180P930j1978j3750
14669b1449l0851l823O622M9055K0328J2779l4389K469L6620N4786k5718n5538
14657A0891n1774L4013K4589n5278m306k6322l6944L337j0405O0019M2999k6212
14645c5393l7856K5433N7915k7579J4485j1695l4873L794K64J5984M5981L1579
14633D8039j396l4577j5040k4755j0445j2180L3360J9926l0061l8652j6161M6464
$$ y = [47812, 13706, 10021, 37548, 25429, -5419, -43611, -50144, -48508, -66412, -22267, 63927, 92825, 45937, 22437, -29040, -30524, -10181, -7469, -48707, -74375, -83816, -94394, -93612, -96599, -93384, -62198, -50305, -57693, -67844, -79581, -55380, -60183, -119523, -149032, -58323, -19827, 11173, 42272, 8708, 7822, -25787, -26746, 17593, 78775, 101570, 35529, -3651, 4279, -7699, -21449, -52300, -56123, -49501, -446, 19882, 32661, -1728, 741, 37361, 92147, 66429, 10891, -40883, -6870, 17719, -37559, -41865, -68187, -105131, -101794, -112199, -52180, -9181, -35393, -73249, -47816, 10099, -17480, -2995, -14690, -49563, -45769, -45505, -29521, 16460, 48039, 46643, 12066, -2974, -27729, -38174, -50354, -16994, 2932, -27129, -65781, -81942, -35478]
14621c5478N4812q07K9546K9099l3684l6747R63p702j497L8280k5022K6050J6403
14608E4216k0236L1930p920j6596l1191j1005l7545J8864R474L8252R670p7046
14596c9133j8768N5370Q856p22m2778m6383n1845M2353N5868L6834M5563p438
14584C7777l3434k5580N8777J0957l3085m7535k1989K4812K7651m9045l2964L0637
14572e3021L6003K8502j5891J6587L184K421M4992P935n4452m1968q117r328K1012
14559b2141L3027n6082R943R263Q707n959J9028L4066L6283L8382m0702r3239
14547b9424j9336j3407k9648L4963m5254K6685M2751l296k7546o560P4471K3428
14535B7827j2217J092j1734l4838j0293L5247J7975R797J7227Q675m1732J4529
$$ y = [-35478, 19334, 18527, 48073, 77172, 43488, 6741, 7704, 2, -1495, 36785, 11763, 37813, 54216, 33980, 65910, 57990, 41394, 10203, -802, -38347, -19483, -10009, 28243, 37913, -39133, -57901, -2531, 6325, 5603, -37175, -83558, -135403, -93050, -37182, -348, 45215, 37777, 4343, -21237, 37540, 48497, 15412, -32123, -54112, -29300, -1649, -50694, -83658, -53021, -17018, 11484, -4407, 12180, 15364, 17785, 62777, 70712, 16260, -25708, -33825, -43153, -22141, 10886, -45196, -35253, -25990, -17283, -23242, -4214, 29852, 66135, 104517, 63815, -29424, -48760, -62167, -91815, -56852, -102106, -75421, -32670, -35966, -63512, -70072, 4399, 27827, 15610, 16702, 4968, -29870, -40163, -4916, 13059, 22856, 40083, 48758, 7026, 21555]
14523B1555l1186o2656k0432P7141K5770k3041N008j2143n964L7035K710J0625
14511B4422l3142m6544k4401j9597p899N3620r988J0754j1451j1449k2882k2063
14499a20620L9429J2496j0634L8851N5441P448N903m6626J0279l9200j5585N7506
14487e312j1033m0244M1199K0694J0047K5236O460J379k024l5538k261K7877R092
14474D5572n1032l6081N4000M6919o5645j1848N1840P3854K93k6222o0572j0301
14462A0777J1820K1432k167O7466Q614o4058l4396k3371K493j2288n2558k7248
14450i3484K8512J8534l5244j7651n514M5154J111j3078k8449P377J6087L0653
14438d5992J7355N112J3080j7330l25l5600M246M4597j4326q6900K076R6058L2573
$$ y = [21555, -9631, -72287, -92719, -15578, 10192, -12849, -7841, -19984, -25948, 11087, 13797, 24422, -8720, -55264, -79665, -99262, -107161, -53541, -63529, -52775, -64226, -75675, -98557, -120620, -81191, -68695, -79329, -40478, 14963, 22411, 28314, -18312, -8033, -47233, -62818, -5312, -16345, -56589, -15390, 5304, 15351, 40587, 47047, 48426, 46402, 10864, 8603, 36480, 45572, -5460, -41541, 12459, 59378, -6267, -18115, 33725, 107579, 107872, 81650, 21078, 10777, 22597, 44029, 41862, 109328, 117942, 53884, 19488, -3883, -1390, -13678, -66236, -93484, -64972, -46438, -81682, -99333, -104847, -59693, -58582, -71660, -100109, -92732, -76645, -45992, -28637, -23525, -10445, -27775, -28100, -63700, -59454, -14857, -29183, -116083, -114007, -17949, 14624]
14425A4624l7592m4153P203M6123O2237m3493p5402m0117L0714L5253J7959N525
14413b1119K2678p708l9397K5090J8653K261k5665n095M5607l7811n3663J6887
14401e9282L9644K7871n8676k071L9694J1037K1342m6892J9273M2513k5621J7545
14389B6377N1570k5704k1329N2298M2129K1827M7977Q2651J14678J25796K18426
14378G36696J82788J42798l1845p1547j05882j06641j83171j43262q5215o9640
14368B65079o9648k4275J642K2990k1976p886q263j142j5400l094n9406o0396
14356A8225k9219L3572J3454n4703j6520J79M6142K6744q6284j4383j263K0634
14344d3422J8686J2114O190l4127N0555n4968J296J9907L6715Q425l638K433l7564
$$ y = [14624, -22968, -67121, -59918, -13795, 48442, 4949, -70453, -110570, -79856, -44603, -26644, -21119, 1559, -6149, -45546, -20456, -1803, 458, -25207, -30302, 15305, -22506, -76169, -59282, -19638, 8233, -50443, -52514, -12820, -1783, 19559, -27333, -8060, 34453, 8832, 26377, 77947, 52243, 30914, 83212, 125341, 147168, 195145, 277796, 392474, 518270, 736696, 919484, 1062282, 1030437, 958890, 853008, 746367, 563196, 419934, 334719, 265079, 195431, 171156, 172798, 195788, 173812, 165926, 157663, 156521, 141121, 138027, 78621, 18225, -10994, 22578, 36032, -18671, -35191, -35012, 11130, 37874, -48410, -62793, -64056, -43422, -24736, -12622, -6432, -40559, 9996, -44972, -43676, -23769, 12946, 21371, 17733, 20166, -17398]
14331a7398n4332N4675P6287M9097o7088l4580M9J7453o273Q278j080k8777j4281
14318a7970J7422m022k5596l2810j9369p542L6029J2654O523j4553J7216L7553
14306E535K2110r509J9274K7262k7265p067J0749j747J8768m266J0590m0211l8303
14293a4080m336n280p525O810n4903P16M0338L1860J6312M8156l991j2174L5098
14280G7001n6671j37k2545k9503L142j1579M3265K2836k846j843K4071k0374l9215
14267a4398J3481J7530K5304K60l1400l9287M3618K1668j5221l5774L8975M0924
14255F5680k0974l6133o6928j5175N8564L4510R364k2365j8626J2341J586K3032
14243B4876K9545j6301M165k7812K883l6730j1382j0539J6410J1010q226J4994
$$ y = [-17398, -71730, -17055, 59232, 108329, 41241, 6661, 6710, 24163, 17890, 26168, 25088, -3689, -17970, -548, -4570, -30166, -62976, -82345, -89887, -53858, -41204, -34681, -49234, -32018, 5535, 27645, 18136, 37410, 64672, 37407, 30340, 41089, 39342, 58110, 53844, 64434, 24223, -14080, -18416, -23696, -31221, -24411, -79314, -78598, -38260, -6400, 9912, 58068, 54077, 41903, 77001, 20330, 20193, -2352, -31855, -28713, -40292, 2973, 25809, 22963, 21120, 45191, 24817, -14398, -917, 16613, 41917, 42177, 10777, -28510, 15108, 36776, 21555, -14219, 24756, 65680, 44706, 8573, -58355, -73530, -14966, 19544, 28908, 6543, -12083, 258, 1844, 24876, 54421, 38120, 42285, 14473, 17356, -19374, -30756, -41295, -24885, -13875, -22101, -7107]
14231g107J5569J7533M0005K5244j9329n6393p0510L306R838M4701M5582O1041
14219A09480j336j20431p3013J4586M9423k4871k1588N5961K2776n1434K962O8054
14207C0569k7842p2502J195J5382j2917N762M5165L8806o1814l8329Q898Q2493
14195A4866N4360L0389k3808m5769j8015k9050M4980m878k6303l1212j0373M2006
14183b807K2595r977m576k9777M6248j7512j8791L9837m4429O828j371K3944K8903
14170C9115J7087O050N1263j4874n9941q067L8287K2408M5968K7897L4684M6302
14158B46179m6769k5419j7938N1917J7598j8074M141m5635k7739L9988l9038m5010
14146I4201J1940p156n384k859n9559o0637J4800J0051j821Q939j545j3697P564
$$ y = [-7107, 8462, 25995, 66000, 91244, 71915, 15522, -54988, -51682, -41844, 2857, 48439, 109480, 108144, -12287, -85300, -70714, -21291, -46162, -67750, -11789, 10987, -40447, -37485, 30569, 2727, -69775, -68580, -53198, -66115, -60353, -15188, 23618, -38196, -76525, -67627, 14866, 69226, 99615, 75807, 30038, 12023, -17027, 27953, 23075, -3228, -34440, -44813, -2807, 19788, 9811, 5235, -24542, 21706, 4194, -14597, 25240, -19189, -12361, -13732, 10212, 39115, 56202, 62252, 113515, 98641, 38700, 30633, 68920, 91328, 137296, 165193, 199877, 246179, 199410, 173991, 156053, 207970, 225568, 207494, 211635, 166000, 138261, 178249, 139211, 94201, 106141, 98985, 93601, 90742, 31183, -29454, -14654, -4603, -6424, 2515, 970, -12727, -5163]
14133e163k1241p0825j9811P0807J7357j4913l1825J5185N3305J8167L7801K8998
14121G7842k1275j0744R139l0005m802L1148J5464n6509j9102K6958K9223L2849
14109H0186j8993l242K0640K5066m8102j42j8966n1669o1848N588o360K6050M7315
14096d477k0929m3470l1722k9426K8285M1842j0548r674m1651K9538N0219K3090
14084a8923J6691j5106o271m8468k4453Q4187K4539K0996K3601l9525l0072M3351
14072C0547K6286K8619q378m6721m2518l756M0913P133j2216J5450l1251l4092
14060b9984L5229K1646o118R396k4361n8048M9226N9064Q6693m4481l6283j9062
14048D2917k063r702M2165N0042o735N7113L8490n6075p815N575k1730J0323K4481
$$ y = [-5163, -26404, -97229, -117040, -46233, -28876, -43789, -75614, -60429, -7124, 11043, 48844, 77842, 56567, 45823, 54962, 24957, 20155, 51303, 66767, 10258, -8844, 18114, 47337, 80186, 61193, 57951, 78591, 103657, 55555, 55413, 36447, -15222, -77070, -71482, -77842, -51792, -4477, -25406, -68876, -100598, -130024, -101739, -59897, -70445, -80119, -121770, -92232, -42013, -18923, -2232, -17338, -23609, -72077, -96530, -12343, 12196, 33192, 56793, 17268, -12804, 30547, 56833, 85452, 77074, 30353, -12165, -15921, 24992, 32125, 19909, 35359, 4108, -29984, 5245, 26891, 20773, 30169, 5808, -52240, -3014, 56050, 142743, 98262, 61979, 42917, 40854, 31152, 73317, 123359, 116624, 173737, 212227, 156152, 148337, 153912, 132182, 142505, 166986]
14035A66986P500n2353n5967m4505M4231K1605O5915M3633R624k771L8999j8201
14023B24696k3976k812Q513l7137o1591P598K3310r5989m0485P3891N3071j1596
14011A17493k7488j546q445n4488p654j7152Q674K2547L7716M9040J64m1074J2716
13998I0503l1888k2702L6505P0126J1499o493K222M1982K0701k0414M820L679
13986B00540l6181o1671M6399N5107M8545P1539Q250l5858k4377R673k2345k48
13974B59373K5359M0480o072q4312m5891l1748L7509R3219j536j5290R655L2265
13962C13011M5817m3220K2723M274O7168P9786N9539N7886j1200p5729p4495K882
13950D48442J8913n719J9935M5000j3549k1614K2625J4061l7322k1173j86J4204
$$ y = [166986, 174486, 122133, 66166, 21661, 65892, 87497, 153412, 197045, 206669, 203898, 242897, 224696, 200720, 197908, 206421, 169284, 107693, 115291, 138601, 42612, 2127, 76018, 129089, 117493, 90005, 88459, 80014, 25526, 17872, 720, 9394, 31941, 69657, 118697, 118861, 77787, 90503, 58615, 35913, 72418, 142544, 154043, 147550, 149772, 191754, 212455, 192041, 196861, 200540, 164359, 102688, 149087, 204194, 252739, 324278, 332528, 296670, 272293, 281966, 259621, 259373, 284732, 325212, 319140, 234828, 188937, 157189, 194698, 287917, 286381, 271091, 280746, 313011, 358828, 315608, 338331, 342605, 409773, 489559, 549098, 606984, 595784, 520055, 445560, 448442, 467355, 461636, 481571, 526571, 513022, 491408, 514033, 528094, 490772, 469599, 469413, 483617]
13938D83617O0684J3411j3348N8669K4126j1282O5781J17473J04622O9154M6181
13927A019088N0485Q6845J14048J83311J75870K00563K11708L40567L78609L18352
13917C079446L25072L20769L61477N76188Q46023J184544J489363J848302K148185
13908A2179369K458169K948947L621864M754390O466545R011584J3056673J9552120
13900G4049661K7975287L3245481L2429041K8627292Q907276j6049070k2986658
13893A66198310l4007375l8036395k6171317j5463137r573368o409705m512066
13886C2024947l398522k575015k147891j747137j474463j366374j190499j004345
13878A7120701q49040n77804m13817l90486m51418n68794o87905q43414q78591
$$ y = [483617, 544301, 557712, 544364, 603033, 627159, 615877, 681658, 799131, 903753, 972907, 1019088, 1069573, 1156418, 1270466, 1453777, 1629647, 1830210, 2041918, 2382485, 2761094, 3079446, 3404518, 3725287, 4086764, 4662952, 5508975, 6693519, 8182882, 10031184, 12179369, 14637538, 17586485, 21208349, 25962739, 32429284, 41440868, 54497541, 74049661, 102024948, 135270429, 167699470, 196326762, 205234038, 189184968, 166198310, 132190935, 94154540, 67983223, 52520086, 42946718, 36537013, 32024947, 28626425, 26051410, 23903519, 22156382, 20681919, 19315545, 18125046, 17120701, 16271661, 15693857, 15280040, 14889554, 14438136, 13869342, 13181437, 12338023, 11459432]
13869A1459432r03222q15363p44554o69475o39732n35581n05781m81520m77852
13860E686352m00000l88642l32352k29733k22386k21880k52755k06745j45189
13851C286670j84738k02212j42562j65129j51135j04521k04441j53285p9306r7792
13841A801549p2427n6934o3743j48945j03219m5915p8918n7091n119j5593m9812
13830A103833o4191K564q194p4964p2258m2405l8041j5622m3886n8819L736j1193
13818F80560J090j8497r397p8248P678j169j14205o0948M2299q017n3006k0084
13806C68056L4882k5762o0294m4826m0467L9596M7835J3377R119K9237o2059n0088
13794B58606j4836k8854m0623M8103J5009L6836M7916N0152J6649K6277K0150
$$ y = [11459432, 10556210, 9740847, 8996293, 8326818, 7687086, 7151505, 6645724, 6164204, 5686352, 5286352, 4897710, 4565358, 4335625, 4113239, 3891359, 3638604, 3431859, 3286670, 3101932, 2899720, 2757158, 2592029, 2440894, 2336373, 2131932, 1978647, 1899341, 1801549, 1729122, 1672188, 1608445, 1459500, 1356281, 1310366, 1231448, 1174357, 1169238, 1153645, 1103833, 1039642, 1042206, 1034012, 959048, 886790, 844385, 806344, 790722, 746836, 688017, 691753, 680560, 681650, 663153, 653756, 575508, 583186, 582017, 467812, 406864, 449163, 441146, 388140, 368056, 402938, 377176, 316882, 272056, 231589, 271185, 319020, 332397, 341516, 370753, 308694, 258606, 243770, 214916, 174293, 222396, 237405, 274241, 322157, 372309, 388958, 415235, 435385]
13783D35385M8417K2731L4859L9671P9658R6888N9137N9928k3288p8605j93434
13772E81347j32627m3956l7645j1519j4924l6795n391m340M580L4271J0297q847
13760C34451P349m2063R659Q9044P4049j8475r3764J1804N2731P5337J46292J83504
13748H29918J75003O9107n4523j64189j56096j37978o1577p5234m2431k704J0060
13737C89356R20p3287J0209n102l452J0972J9557R362O2371M0862m6446l1196
13725C84126k4045l2910m4326q1061k5173K5592R700j857m140j8130Q199q48j4640
13712A80487j1784j4337J8062J5515M9123K4076K8520m5285p7402n1558j373K6395
13700A40439J5384N7324M8074J7336j8047m6874n344l4616j2062m4397n007L6919
$$ y = [435385, 483802, 506533, 541392, 581063, 660721, 757609, 816746, 876674, 853386, 774781, 581347, 448720, 404764, 367119, 355600, 340676, 303881, 298490, 294150, 298730, 333001, 343298, 334451, 341800, 299737, 309396, 398440, 472489, 454014, 360250, 372054, 424785, 500122, 646414, 829918, 1004921, 1074028, 1019505, 855316, 699220, 561242, 499665, 424431, 382000, 379296, 389356, 390276, 316989, 327198, 322096, 318644, 329616, 349173, 358535, 420906, 461768, 415322, 384126, 360081, 327171, 282845, 201784, 176611, 202203, 211903, 210046, 205906, 187776, 195975, 195127, 180487, 168703, 154366, 172428, 187943, 237066, 261142, 289662, 244377, 166975, 115417, 114044, 140439, 155823, 213147, 261221, 278557, 260510, 213636, 208292, 173676, 161614, 117217, 112210, 149129]
13688A49129j3923l3540n9785M9691K2688J9599k4776m6313p4542K2669O5411
13677G6308J89q0900o4293K8657O0841K422N2106J3600J7889l7012m1147k3495
13665E165L6361M7193K7638j9250j8594M3293K2410k9567K6122K173r161o5626
13653F8157m9313L3889K1609K7009K9964j4394p9373k2550L3276M241l7977O358
13641B0896N83K0715l9352J6707K9213j2227N6621p116o7054j2084j6723N2685
13629D2864P255l5551J549R591M5248K5456K9868n6452k5505j1512L7965k7206
13617D3570m1759l6378k8382l7069K4907k4295L6748N739r632N3596J6412j5909
13605a2452J2731J8511L897L9506J3385o6768k4779j1331K7170Q986K5757J0258
$$ y = [149129, 135206, 101666, 41881, 91572, 114260, 133859, 109083, 62770, -11772, 10897, 76308, 76497, -4403, -68696, -40039, 20802, 23224, 75330, 88930, 106819, 69807, 28660, 5165, 41526, 88719, 116357, 97107, 78513, 121806, 144216, 114649, 140771, 142944, 133783, 68157, 18844, 52733, 74342, 101351, 131315, 116921, 37548, 14998, 48274, 52515, 14538, 20896, 21479, 42194, 2842, 19549, 48762, 36535, 93156, 86040, 18986, 6902, -9821, 42864, 50119, 14568, 16117, 25708, 70956, 96412, 126280, 69828, 44323, 32811, 70776, 43570, 1811, -34567, -62949, -100018, -75111, -99406, -62658, -56919, -66551, -12955, 3457, -12452, 279, 18790, 22687, 62193, 75578, 8810, -15969, -27300, -130, 8856, 34613, 44871]
13593D4871K4548o4638l9366K7929P201l1001M2175M8305q061l6197j4451Q741
13581A0056M5409L3948j4035j2321K9109l0047j5087L3641M9044L4965j8365j7257
13569A29060j2880l1977o5182r7202L845K8672K7023L4183j4607L0150L4335j0629
13557E4791n49j9098j787k1491K3078o266k8091M538K4953O601Q345k7715J7924
13544C5233P488j8127K8408J3733n2754l2919m769P097J7728K2220N3076M9506
13532A25920k644o8788j7645L7574o409l3946p574J9623L3417J8460p1254j9330
13520G404L4070j6306l3270p670O6812P4007j3571p5084o1326j7662M1537J240
13508A81L1965J2467o23j0536J179k8107K2285l0118l6653O834o116L1368J7497
$$ y = [44871, 69419, 4781, -34585, -6656, 545, -30456, 11719, 60024, 51963, 15766, 1315, 10056, 55465, 89413, 75378, 63057, 92166, 62119, 47032, 80673, 129717, 164682, 146317, 129060, 116180, 84203, 19021, -78181, -74336, -45664, -18641, 15542, 935, 31085, 65420, 54791, 54242, 35144, 33357, 11866, 34944, 28678, 587, 5125, 30078, 36679, 45024, 17309, 35233, 42721, 24594, 53002, 66735, 13981, -18938, -23707, -16610, 1118, 23338, 76414, 125920, 123276, 54488, 36843, 74417, 68008, 34062, 26488, 46111, 79528, 97988, 26734, 7404, 41474, 25168, -8102, -15772, 51040, 125047, 111476, 36392, -24934, -42596, -1059, 181, 32146, 44613, 43990, 33454, 34633, 6526, 28811, -1307, -37960, -31126, -37242, -5874, 11623]
13495A1623m568r815l57K8375L9918l3568j4926p799j5696k6800j3020k1785k4216
13482i2634K1507L1177k6580j0257M2547k796N3658L6573K7851p765j8930j2022
13470D2329k4219J184q329J189P496j9497j3988J5236K2719L3998M6736l2313
13458G2541m4013q669K368p296j0694k5619j9180j9326J9861M4714o045l7201
13446c8559P514L9701M5866q747M875L3654j6894N804j0167o8096k0495Q285J0232
13433g027R399M8591L0701L1146l256j2787N474J6770r768K0374L724j557R828
13420A41612j82k3989R390m392N1873R8405J23127J45594J44650J25919J12476
13409I24483J12742k2707r7830j19692k53083j99389r2247o9311L1391J4747l8937
$$ y = [11623, 7055, -2760, -3117, 25258, 65176, 31608, 16682, 8883, -6813, -33613, -46633, -68418, -92634, -71127, -39950, -66530, -76787, -34240, -37036, 16622, 53195, 81046, 73281, 54351, 42329, 18110, 19294, 10965, 12154, 19650, 153, -13835, 1401, 24120, 58118, 104854, 72541, 28528, 19859, 22227, 14931, 4237, -21382, -40562, -59888, -40027, 4687, -1358, -38559, -31045, 8656, 54522, 45775, 50650, 84304, 67410, 73214, 63047, -5049, -25544, -17259, -7027, 2372, 50963, 81664, 112810, 109554, 96767, 102241, 119011, 109243, 129617, 133341, 131784, 141612, 141430, 117441, 126831, 122439, 174312, 272717, 395844, 541438, 686088, 812007, 924483, 1037225, 1014518, 916688, 796996, 543913, 344524, 252277, 182966, 214357, 229104, 190167]
13398A90167o0767l6835M582n5950r746L9142K3516L6500J9374q396k538j7090
13386A21959J3916o4944k0101l3191K9685j5527j512k8575L033k4015m5334m6798
13374a11404L9653O6871O7009o480N740k1863k5293J1493k4307L2588o919O93
13362B7781j3501m1844J2495L0780K0211n976l92L9259J694k4071r080m5416m9702
13349e7762M8133L8305l4184o1715L8939J03369P8416L235n1334l6690l1388k259
13337C5065j354M7453L5869K6750l0352O974m4370m9434o071n4R176J3597L0504
13324G3753j3447p278K0000J169K2674K2620K4552L4222m772j9769J1592Q722
13312A74038N4868j0481l7941j450l7070k3220o0511l4128R7q060K430L5231N4356
$$ y = [190167, 129400, 92565, 97147, 41197, 31451, 70593, 94109, 130609, 149983, 141587, 139049, 121959, 135875, 70931, 50830, 17639, 47324, 31797, 30285, 1710, 4743, -19272, -64606, -111404, -71751, -4880, 62129, 55649, 61389, 39526, 14233, 25726, 1419, 34007, 27088, 27781, 14280, -27564, -15069, 15711, 35922, 29946, 29554, 68813, 70507, 46436, 37356, -8060, -57762, -9629, 28676, -5508, -67223, -28284, 75085, 153501, 156736, 105402, 68712, 37324, 35065, 33711, 81164, 117033, 143783, 113431, 120405, 76035, 26601, 20530, 20476, 29652, 43249, 73753, 60306, 53028, 73028, 74197, 96871, 119491, 144043, 178265, 173493, 153724, 165316, 174038, 228906, 218425, 180484, 179034, 141964, 118744, 58233, 24105, 24202, 16142, 18572, 53803, 108159]
13299A08159N409P534J1829K3232l4116l4288j325o825L219J8606K7350N7676
13287A86460J1735J8585J03626L3267J43563K35639K51515L33359L25719K02019
13277A845487q8902m82730m43578k32299j18133r2738k0328j9477k1280k3506
13267C02516n7348n8885l9708m3096o0875j553j4462N446O1845M42J5442J5652
13255A25416k8180k4587N7885K387k8923k0583l038j8552k1622p2281K9678J1750
13243I350K5469M1667J3505k5446j6057j8883l3365p164k9814o947k5002L815
13231f8872O247P7267K7443M6985K3023k2017k9322J3908j503m1001l3389J6108
13219A4877M2638q81l3436q385J8997l697r879n7443k99n251p641J3619L7975
$$ y = [108159, 113568, 121102, 132931, 156163, 122047, 87759, 86434, 79609, 82828, 101434, 128784, 186460, 198195, 216780, 320406, 353673, 497236, 732875, 984390, 1317749, 1643468, 1845487, 1756585, 1273855, 830277, 597978, 479845, 387107, 366779, 347302, 326022, 302516, 245168, 186283, 146575, 103479, 42604, 41051, 26589, 32035, 93880, 94322, 109764, 125416, 97236, 72649, 130534, 132921, 103998, 83415, 80377, 61825, 40203, -32078, -2400, 9350, 34819, 76486, 89991, 64545, 48488, 29605, -3760, -10924, -40738, -47685, -72687, -68872, -62625, 14642, 42085, 89070, 112093, 90076, 60754, 74662, 73159, 32158, -1231, 14877, 57515, 56634, 23198, 14813, 33810, 30113, 20234, -37209, -37508, -42759, -50400, -36781, 1194]
13206A194k5411J6453L1021k3225L0568N5346K4219M1393N5569j7233m6196K8086
13194A71784M4422L1838j9492k5540n246k6979K4999N227m690J8335o038r6949
13182A11671m5583o447J6069k20m5666j7319J2636K2468K857j4635R979j3940
13170C1870l1380L2028n3851k4463L7265J0567L6877M2304o8525n0012N746N2007
13158B0433K3789N2437O144J8462J7441l2177n769L8709k160j2000l3932o2217
13146B9160k5523j2999l2524N067J6512N1449O6839j0125j6841m9747j1156j4153
13134d041n372J1121J3982k7754o155J9217l2850J6478O4808N790j6109j0034
13122B9081j4000R445M5466n970j1494k7477m7582o42M4886P3241K6865J2375
$$ y = [1194, -24217, -7764, 23257, 32, 30600, 85946, 110165, 151558, 207127, 189894, 143698, 171784, 216206, 248044, 228552, 203012, 197766, 170787, 195786, 201013, 196323, 214658, 208620, 111671, 66088, 59641, 75710, 75490, 29824, 12505, 25141, 47609, 50466, 35831, 45810, 31870, 490, 32518, -21333, -45796, -8531, 2036, 38913, 81217, 12692, -37320, -31574, 20433, 44222, 96659, 102803, 121265, 138706, 106529, 100760, 139469, 137309, 125309, 91377, 29160, 3637, -9362, -41886, -36819, -20307, 31142, 97981, 87856, 71015, 21268, 10112, -4041, -9413, 1708, 15690, -12064, -18219, 998, -31852, -15374, 49434, 55224, 39115, 29081, 15081, 24526, 69992, 64022, 52528, 25051, -22531, -23173, 21713, 94954, 121819, 134194]
13110A34194J8554j1725m3267o9806O326J4837L9676P9136J7172J1182J7265k6255
13098A87289j6696j336K1798N0802Q6005l4445l1261K1307k069L5134o109o3636
13086B46783n1257o8786j1470N0267n7981p4597m8502l1679p58l4666M8205J6372
13074a8069p4979K8389N1121P648L3423L0683k7887j5801j4083M1611J4267j9572
13062C6751k5474l5673j0989l8351K9188N6008L0520L075J3623l6008J969K7449
13050E2088N3669o2834m2494L3000j491l3427M2549L4217l023n71k5352p0252
13038b3921p2256M4822J2751j9310r203j259Q241k6308j3324L2498M6585L860
13026a6824R824P664M4465j6677p8419L1549M181K412k4325j7015K5084J4453
$$ y = [134194, 152748, 141023, 97756, 27950, 34276, 49113, 88789, 167925, 185097, 196279, 213544, 187289, 170593, 169257, 191055, 241857, 327862, 293417, 262156, 283463, 281394, 316528, 310419, 246783, 195526, 126740, 115270, 165537, 107556, 32959, -15543, -47222, -47980, -82646, -34441, -18069, -93048, -64659, -13538, -5890, 27533, 58216, 30329, 14528, 445, 42056, 56323, 36751, 11277, -24396, -35385, -73736, -44548, 11460, 41980, 45055, 58678, 22670, 24639, 52088, 105757, 42923, 429, 33429, 31938, -1489, 41060, 75277, 72254, 71683, 46331, -23921, -96177, -51355, -38604, -57914, -67117, -68376, -60135, -86443, -99767, -67269, -20684, -16824, -7000, 664, 45129, 28452, -49967, -18418, -14237, -11825, -36150, -53165, -28081, -13628]
13014a3628J6193J8901K8572k7187mk5763o5164l2086q539L3160M5323M7208M8503
13001F5489j2503m6158n4928K1386q889M7859P3132k0568m906O9766L8249M0512
12989B08441k1621p0434q3093k5248P373N2704k5659N8923O756L7401M5125L489
12977A94157k3928r137k5692m16Q0837Q5617N7775N5109J9811k998k453N81j08588
12964C20675m1866l2222k426m5102r7161o7813o6072J7380J02106M2839L2294
12953A62632P999p737o4525r138j7837j0891M3490M1665M8898J01585P1951P7376
12941D45468J04668J02203K17956L01585K75861J92073P0166j21181l16633l17285
12931I54881j46983j46837q7196m9487p564l5368l091K7842k7585m6387K6193
$$ y = [-13628, 2565, 21466, 50038, 22851, 22847, -2916, -68080, -100166, -108705, -75545, -30222, 16986, 65489, 52986, 6828, -48100, -26714, -35603, 12256, 85388, 64820, 59914, 129680, 167929, 208441, 186820, 116386, 33293, 8045, 15418, 68122, 42463, 101386, 108142, 145543, 190668, 194157, 170229, 161092, 135400, 134984, 215821, 301438, 359213, 414322, 434133, 431135, 428682, 429263, 320675, 278809, 246587, 244161, 199059, 101898, 34085, -31987, -14607, 87499, 130338, 162632, 170631, 162894, 98369, 89231, 71394, 60503, 103993, 145658, 194556, 296141, 368092, 445468, 550136, 652339, 870295, 1171880, 1447741, 1639814, 1709980, 1588799, 1272166, 954881, 807898, 661061, 573865, 524378, 516814, 481446, 478355, 506197, 478612, 432225, 458418]
12920D58418J0927L9730j0998q437J9986j9849n082L1646l3223N845j5972k2930
12908D50061J9428j3681j1988j2889O689L3464k1181Q918o032N9868L9770O3002
12896F15429N2215M4024N0345K037l17P348N0074j1147L1711j63q029r411l4731
12883G89385J2751K3365Q2236P6698L6255O5619J11056R2750P9785O5481O0482
12872A495863R4750J01881J07411P0815Q7958J23531J86157K75147K30135K03668
12862B977316J24130J27481J84747L25352L92411N50269P14548R14783J143366
12853G454403J407338J733103K209803K852920L687895M832093O234022Q096502
12845C8508079J0450595J3936359J9587004K8930690M5245998O6137624P0321014
$$ y = [458418, 469345, 509075, 498077, 489640, 509626, 489777, 484695, 516341, 483118, 488963, 472991, 450061, 469489, 455808, 443820, 430931, 437620, 471084, 449903, 458821, 452789, 512657, 552427, 615429, 667644, 711668, 762013, 764050, 763733, 771081, 821155, 810008, 841719, 841556, 833527, 824116, 789385, 802136, 825501, 907737, 984435, 1020690, 1086309, 1197365, 1290115, 1369900, 1435381, 1495863, 1590613, 1692494, 1799905, 1870720, 1958678, 2082209, 2268366, 2543513, 2773648, 2977316, 3101446, 3228927, 3413674, 3739026, 4131437, 4681706, 5396254, 6311037, 7454403, 8861741, 10594844, 12804647, 15657567, 19345462, 24177555, 30411577, 38508079, 48958674, 62895033, 82482037, 111412727, 156658725, 222796349, 293117363]
12838B93117363M7833639K1075923m1107478r8028383p5686572m1199177k3193147
12831H2812168j4768789j0282052p919749o360203m948150l835058l006528k351927
12823B9339712j953485j631377j268798r27212p06992m27956j92403j81523p40526
12814B1309440j250868j371342j348710j360811j216908j046156r39313r25853
12806A1849479p99953o92361o17865m82140m57088n14408n66794n40525o04811
12797F573534n20822l87263k98228l15671k80897k28582k55838k91353k48226
12788C746654k15072j86057k12018j30919j07618j29205j39302j31140j07632
12779B387691j26398o7487r6476j48925r1598m5203p1312k4313o2264j34931p5983
$$ y = [293117363, 340951002, 362026925, 320919447, 222891064, 147204492, 106005315, 82812168, 68043379, 57761327, 49841578, 43481375, 38533225, 34698167, 31691639, 29339712, 27386227, 25754850, 24486052, 23558840, 22851848, 22423892, 22231489, 22049966, 21309440, 20058572, 18687230, 17338520, 15977709, 14760801, 13714645, 12775332, 11849479, 11049526, 10357165, 9739300, 9257160, 8800072, 8285664, 7718870, 7178345, 6573534, 6052712, 5665449, 5367221, 5051550, 4770653, 4542071, 4286233, 3994880, 3746654, 3531582, 3345525, 3133507, 3002588, 2894970, 2765765, 2626463, 2495323, 2387691, 2261293, 2193806, 2097330, 1948405, 1856807, 1811604, 1740292, 1715979, 1653715, 1518784, 1442801]
12768A442801j4873j5867j4136m5420n2370n8789l0204j05179k8474M356o3569
12757A018276j0308L9644J1776m1689J6150R1532R8079J11407J22545Q0281l704
12746A533989j41249k07639j96203j18665r9021L010j3103n6125l3076n7913p7352
12735E36653j2141j4028p250L4211L5894j5637N466j9139k7481L7261O3820K0683
12723F38312J3541J935M5351Q2157Q0872R0356J58133J80205J83345J63018J45123
12712A782348P6347m1366k83050k83808k50618k24153r1097n8726p6925m2314
12702E06638l0039k4302j0281R335m970o5687n8654L3116K7446K4554l5653p518
12690C63985m0060k1671J4565k1042k0138r103l2246K8630R1920N6395M3370O5995
$$ y = [1442801, 1427928, 1412061, 1397925, 1352505, 1300135, 1241346, 1211142, 1105963, 1077489, 1081845, 1018276, 1007968, 1047612, 1059388, 1017699, 1033849, 1125381, 1223460, 1334867, 1457412, 1537693, 1533989, 1392740, 1185101, 988898, 870233, 771212, 774222, 761119, 704994, 671918, 614005, 536653, 524512, 510484, 503234, 537445, 573339, 557702, 563168, 544029, 516548, 553809, 617629, 638312, 651853, 653788, 699139, 781296, 862168, 952524, 1110657, 1290862, 1474207, 1637225, 1782348, 1858695, 1817329, 1534279, 1250471, 999853, 775700, 684603, 625877, 548952, 506638, 476599, 452297, 442016, 451351, 446381, 380694, 322040, 355156, 382602, 407156, 371503, 363985, 323925, 302254, 316819, 295777, 275639, 266536, 234290, 262920, 354840, 411235, 454605, 520600]
12678E20600K495j013J585j5941J7825M926L54l5315k4930l0358o4284R553J3904
12665C99401n1379r1154J4007K9007M7180p305l1932L9154l348p8494j7700K6619
12653B74056l4404n000J6931L0683M0934O1670Q739l025m7539q69J0435K7540
12641C80151J2540l0478K4831L5929l2613m6976p211j2717p4216J6175K0046L3895
12629C19356K9456P0355N5895O8884R9025J37611M1617O7969p3323j87701j42046
12618D87098n0461p2532k9986j7709Q673m6554o2153R780q299j916K8900L8860
12606B83701M8791N4052L0994N4036N8402O4877k8696o9607n8202k4699r615j0940
12594C93094l3566n6057m8885l9684k3028O7550N3958o8284m3916K5369P354m1628
$$ y = [520600, 523095, 522082, 523667, 507726, 525551, 530477, 530831, 495516, 470586, 440228, 375944, 385497, 399401, 348022, 256868, 270875, 299882, 347062, 339757, 307825, 346979, 343631, 265137, 247437, 274056, 239652, 234652, 251583, 282266, 323200, 384870, 393609, 390584, 343045, 342176, 352611, 380151, 392691, 362213, 387044, 422973, 390360, 343384, 336173, 323456, 249240, 265415, 285461, 319356, 348812, 419167, 475062, 543946, 642971, 780582, 822199, 890168, 816845, 629144, 487098, 436637, 364105, 334119, 316410, 325083, 278529, 216376, 226156, 217857, 215941, 244841, 283701, 332492, 386544, 417538, 471574, 529976, 594853, 566157, 496550, 438348, 413649, 404034, 393094, 359528, 303471, 254586, 214902, 191874, 259424, 313382, 245098, 201182, 226551, 233905, 192277]
12582A92277l5826l8638p437M0933K7784k9450k6345K7110j1223n4456O347R141
12570A00217q47P217L6960j1123j0569P252P7798j5964p8783l9648J54J1862p737
12557G6789N4019j1363K728J7101L3174O835L1005j2710k7720l1283l5792l0577
12545G2206P334N5134J062j7137K0106J15l3425o4286k5950N1998K2591L1259
12533A21007N2478k2309m5512r195k7287l3719j1060l0145L8171N4704q231m6804
12521C2098l7665M2612k9086J4857K0776k6674N1403N3034j214l359n60j878l703
12508A10641p3442k1167l37N6568J5199o921J2662N181J1653n0121l9798R120
12496B9238L6999L0146n461M9261M1507m2646m4423R546N3254n008k6263M720
$$ y = [192277, 156451, 117813, 110376, 151309, 179093, 149643, 123298, 150408, 139185, 84729, 91076, 100217, 99370, 106587, 143547, 132424, 121855, 129107, 206905, 190941, 112158, 72510, 72664, 84526, 76789, 130808, 119445, 122173, 139274, 172448, 179283, 210288, 197578, 169858, 138575, 102783, 72206, 79540, 134674, 135736, 118599, 138705, 138820, 105395, 41109, 15159, 67157, 89748, 121007, 173485, 151176, 105664, 96469, 69182, 35463, 24403, -5742, 32429, 87133, 78902, 32098, -5567, 37045, 7959, 22816, 43592, 16918, 68321, 121355, 120141, 116782, 116222, 114344, 110641, 37199, 16032, 15695, 72263, 87462, 80541, 93203, 98384, 110037, 59916, 20118, 29238, 66237, 96383, 90922, 140183, 181690, 139044, 94621, 104167, 157421, 152413, 126150, 130870]
12484A30870j9395m4617l6841J0399J0131R827j8933n0784k2836O5540P7707N901
12472A16969M411j4734j5858L6681j1346N637J4796p871j5445J8430j4566m6772
12460G0332Q669K392o468J8439J8400k6715N379K6915M962N1414k8107l8379j5775
12447I1458k227j5064J6380J4336N709j5473q848k0727N377j0111J2555R669m3001
12434D0033L2422L2846n974O186j4332K54J2257J931K9986J8092p704l9661r9972
12421F364p3830o311L4733M9810K9919M6828L7924k7064n3876j134K0805J5626
12409G9794P7392L1706k0210l269m5333j671J6310K5957M0303N1329J9494K5584
12397B97386O8499O9118P8396J52433K21298L31279L65772J82037n8361l95823
$$ y = [130870, 111475, 66858, 30017, 40416, 50547, 60374, 41441, -9343, -32179, 33361, 111068, 116969, 121380, 106646, 90788, 127469, 116123, 121760, 136556, 128685, 113240, 131670, 117104, 70332, 79001, 81393, 74925, 93364, 111764, 85049, 90428, 117343, 122305, 173719, 145612, 107233, 91458, 89231, 74167, 90547, 104883, 110592, 95119, 86271, 65544, 70921, 60810, 73365, 83034, 40033, 72455, 105301, 99327, 105513, 91181, 91435, 103692, 105623, 135609, 153701, 145997, 106336, 6364, -67466, -73777, -39044, 10766, 40685, 87513, 125437, 98373, 44497, 43363, 64168, 79794, 157186, 188892, 168682, 165413, 120080, 118409, 134719, 160676, 200979, 252308, 271802, 297386, 365885, 435003, 513399, 665832, 887130, 1218409, 1584181, 1766218, 1707857, 1312034]
12387A312034m42939k42115j20671m1172m6173n8789j12724m2820J1797k9871
12377A86557m6473o965O413M203l3226L2744P5118N272k2221J7876o5521r287
12365A44490j3921j7300K9941m0692j6598J3387J9932r369o533O739J6796O071
12353A32943j9377P372j3m0722R934m7673j6683K4912O3495J6965l868n0619p3162
12340C504J3579J5128L0551J4658j0877p293J824l0513k8273N1173k0826J26k0954
12327A1807k5943K6978L2816K8096m391k8910K0905j1945l5192l7594j1400R456
12315b5317N5934M3601j9448K6348O4159K9080l9404n9797m1342N059L1684k1611
12303D8946j2729J035J8932k0321o574n152J8193J3393n553j0300k0283m7146
$$ y = [1312034, 869095, 626980, 506309, 465137, 418964, 360175, 247451, 204631, 216428, 186557, 140084, 133119, 139532, 143735, 110509, 143253, 218371, 223643, 201422, 219298, 153777, 144490, 130569, 113269, 143210, 102518, 85920, 99307, 119239, 109870, 103337, 110076, 126872, 132943, 113566, 120938, 120925, 80203, 90137, 42464, 25781, 50693, 114188, 131153, 127285, 76666, 3504, 17083, 32211, 62762, 77420, 66543, 59250, 61074, 30561, 2288, 53461, 32635, 32761, 11807, -14136, 12842, 45658, 73754, 69363, 40453, 61358, 49413, 14221, -23373, -34773, -25317, 30617, 74218, 54770, 81118, 145277, 174357, 134953, 75156, 33814, 38873, 70557, 48946, 36217, 37252, 56184, 35863, 29289, 24137, 42330, 55723, 50170, 39870, 19587, -27559]
12291b7559M9932N1979j1233q955j0943k3058N2659L5660k6688j7125m6322k8884
12279a0537L9244l683L395K58J6484J083K1952N026k2372l1641K6970J1854p914
12266E0119L3483j3857k4138M3296L3315l2978q7782m1381O4465K4611j8215J9427
12254E0365n563p2654J0850L5511L0440K0772L1804K1468m789n837l5979o537
12242F9851j9233k0974o2086l6708K1815K3560Q737O3032M777m2843J2675l071
12230A9532N922m2504m7029k427K6764K3314n1N3513j3149j5724K1274k2241K5715
12217C2909N5696o124m0240k1934K1830L564M522L2728j2062p1529L4542L5550
12205F9452k6886j9967L6386N0313m2798n4689l520k2703j6241M4207K0375q682
$$ y = [-27559, 22373, 74352, 63119, 54164, 43221, 20163, 72822, 108482, 81794, 64669, 18347, -10537, 28707, 25024, 28419, 28677, 45161, 46244, 68196, 73222, 50850, 19209, 46179, 58033, 50119, 83602, 69745, 45607, 88903, 122218, 89240, 1458, -39923, 24542, 49153, 30938, 50365, 44802, -27852, -17002, 18509, 48949, 69721, 101525, 122993, 118204, 112367, 76388, 69851, 50618, 29644, -32442, -69150, -47335, -23775, -15038, 47994, 52771, 9928, 22603, 19532, 25454, -17050, -64079, -66506, -39742, -16428, -16479, 37034, 23885, 8161, 29435, 7194, 32909, 88605, 82481, 42241, 20307, 42137, 45701, 50223, 82951, 70889, -640, 33902, 69452, 42566, 22599, 58985, 109298, 66500, 11811, 8291, -14412, -30653, 13554, 33929, 25247]
12193B5247J6707Q696M766o2159P05J9314R733P708M3851L8568k8507n1253K9171
12180F2547P1848k924k1073O648l4904J523L2987J1721O379L504l4333o4166k1607
12167A8150jn87n261K0640J2554L0174l4674P477M425m7459M257j5113K3052L7623
12153E5257K4803p3240l5605P596n229p004K2569L7025P3605J9979J357p2223
12141D8890j4530K7875l7705L8054o5766l2374K2323n857k6593J2364k9906j4232
12129g7457L1813M6914M5691J395k2731J1130N0037O408p2790j6977r181K7169
12117B1421K9766p106L889j381n4521j3286n938L8903N4150j2029l8166L2702
12105D8404L2642l1041m2661N568n958J372k4424M203L7706K6661l233K406j5870
$$ y = [25247, 41954, 50650, 55416, -6743, -6038, 13276, 23009, 30717, 74568, 113136, 84629, 33376, 62547, 134395, 131471, 110398, 117046, 82142, 83665, 116652, 128373, 134752, 138256, 103923, 39757, 18150, 18149, 17562, 12301, 32941, 45495, 75669, 40995, 48472, 52897, 5438, 9695, -5418, 17634, 55257, 80060, 6820, -28785, -21189, -26418, -33422, -10853, 26172, 99777, 119756, 121113, 48890, 34360, 62235, 24530, 62584, -3182, -35556, -13233, -19090, -45683, -33319, -63225, -77457, -45644, 1270, 46961, 48356, 25625, 36755, 86792, 93200, 20410, 3433, -5748, 21421, 51187, 44081, 47970, 46589, -7932, -21218, -27156, 11747, 65897, 53868, 15702, 48404, 81046, 50005, 7344, 12912, 6954, 8326, -16098, -11895, 25811, 52472, 49239, 51645, 35775]
12092C5775N13l7862o816M9937k5675k492P244O165k1853L099k388L531k9054
12079a9876P578J5660M5345O0603r713p6630o0201N933J8559J8700k784n5706
12067e2532r047j3420J554J8727J0852n673M321P0262k055l0138k2242L0931k6892
12054b5352o3709l7622O52K8314L5249L6672l964L7594M4705j4341j9526L4626
12042E3298j2461k4346l2879k030K0309L0276K7326j2038m5866q6621N5005P171
12030b2856O245J9445j7556J91l4591J7115L3800N9219O777m2304o5722k9350
12018f9587N4921M4126l1250k5885m0240K2538O9568R304M306j618j6766l2053
12006a2636j0624k4648N708M3258N4658J1074q1047r176K336n1192M5124M347
$$ y = [35775, 36288, -1574, -8390, 41547, 15872, 13380, 20624, 26789, 4936, 8035, 5647, 9178, -19876, -12298, 3362, 48707, 109310, 99597, 22967, -37234, -31301, -12742, 5958, 3174, -52532, -61579, -74999, -73445, -54718, -43866, -49539, -45218, 25044, 22989, -7149, -29391, 1540, -25352, -89061, -126683, -126031, -97717, -62468, -25796, -29760, 7834, 52539, 38198, 18672, 53298, 40837, 16491, -16388, -18418, 1891, 32167, 59493, 47455, 1589, -85032, -30027, -22856, -16611, 2834, -14722, -14531, -49122, -32007, 1793, 61012, 67789, 25485, -40237, -69587, -14666, 29460, -1790, -27675, -67915, -45377, 24191, 33495, 37801, 36183, 19417, -12636, -23260, -47908, -42200, 1058, 55716, 66790, -14257, -23433, -21097, -72289, -27165, -22818]
11994b2818j7525p438L4424q636P981k1450j5840j5508k0448j8561K7030L1621
11982d7168L3441M5761Q242k3372R056j8168L01j8888n1244j3567O1957O6062
11970E2413l3352k0349l461m0595l3142J72N8365M5478k7533n4890k2148m3959
11958a23001L3137K8808N0447L2596m1837m0940J1846j55N3547l705k8640k8238
11946e6135L0467K2240J8597L8327j9464j9798K2259J4496O2440k2183r436o902
11934G4908l685m4231j0426K109l7383j915P3141M0939n6320n3573l1826J1096
11922c7166P5444M9194L971k8098M155K2447J3951l9812k0541j2373L178Q957
11910D3307o6604l288L4408J4965K7444K4506K7072J5673L401m1057n88l6313
$$ y = [-22818, -40343, -47781, -13357, -21993, -14012, -35462, -51302, -66810, -87258, -105819, -78789, -47168, -13727, 32034, 40276, 16904, 25960, 7792, 8093, -10795, -62039, -75606, -13649, 52413, 19061, -1288, -4749, -45344, -78486, -78314, -19949, 25529, -2004, -56894, -79042, -123001, -89864, -61056, -10609, 21987, -19850, -60790, -48944, -49099, 4448, 743, -27897, -56135, -25668, -3428, 15169, 53496, 34032, 14234, 36493, 50989, 113429, 91246, 81810, 74908, 71223, 26992, 16566, 18675, -18708, -20623, 52518, 93457, 37137, -16436, -48262, -37166, 38278, 87472, 91443, 63345, 67500, 89947, 103898, 64086, 43545, 31172, 34350, 43307, -23297, -26585, 7823, 22788, 50232, 74738, 101810, 117483, 120884, 79827, 79239, 42926]
11898D2926l7260N305o3738m5407K2350L3412k3647N0792L9669o320r196m1973
11886c3087m7396N1985L830k7210K9013J4100k7150k3242L7962J2171j6625k4605
11874e0254O591N327j2645p898N8025L6039j1628L3380j3740o1595j6778m4405
11862g9581M262K9148J8966j7859L6726K12j7965K3631J9045l5197L799K2249
11850G436k7003M203m2335o0361L8544p055J4444K9685N5113J4219k7296l3818
11838c4224q072K8430r625K729L3455L3167J2627o4095K1844N5919m4590p3793
11826d6228k5162O863Q813L1776J6146P6224J5098n9720J5829j5475l8626n624
11814b0086K8448J0618N5423J4038k0687Q332j5936K542j3282j8833M5611q785
$$ y = [42926, 5666, 10971, -52767, -98174, -75824, -42412, -66059, -15267, 24402, 18082, 8886, -33087, -80483, -28498, -24668, -51878, -22865, -8765, -35915, -59157, -21195, -9024, -25649, -50254, -43663, -38336, -50981, -58879, -854, 35185, 23557, 56937, 43197, -18398, -35176, -79581, -75319, -46171, -27205, -45064, -8338, -8126, -26091, -2460, 16585, -18612, -14813, 7436, -19567, -15364, -57699, -118060, -79516, -86571, -72127, -42442, 12671, 26890, -406, -34224, -42296, -13866, -23491, -20762, 12693, 45860, 58487, -5608, 16236, 72155, 27565, -46228, -71390, -64527, -55714, -23938, -7792, 68432, 83530, 23810, 39639, 24164, -14462, -20086, 8362, 18980, 74403, 88441, 67754, 76086, 60150, 62692, 49410, 30577, 76188, 67403]
11802F7403k9394m5139n2484J0839M6919m382N1149O891r5249j8149j1032J2627
11790f0001J4063Q406J3672L117L5410l3906m32k6330K4807L9780Q5427N2624
11778A56637n0o1898k8409m3512m2511K9474K3615K8180M989l6497o349j7941
11766E728j1285k3399l2688j5866K3740O4639j8397q0789N7017k4742j4338K4821
11754d5559M9262M6689l30o1272n2486k358J5429k9090K9863J1880J2188O4418
11742C8634J3563m7650j5066K867M4580K4455N833l9601k5420M1992P7J1535p337
11729D8462k8102J1978L9914k4415k5363j8460m583k0988M6325K7231k6317n4188
11717b8506r188j2932P458O0857L1853j3582K2568L9768L141p683k4787l340K2345
$$ y = [67403, 38009, -7130, -59614, -48775, -1856, -6238, 44911, 51802, -43447, -61596, -72628, -60001, -45938, -37532, -23860, -20743, 14667, -19239, -19671, -46001, -21194, 18586, 104013, 156637, 156587, 94689, 66280, 22768, -19743, 9731, 33346, 61526, 66515, 30018, 23669, 5728, -5557, -28956, -61644, -77510, -53770, 10869, -7528, -88317, -31300, -56042, -70380, -45559, 3703, 50392, 50062, -11210, -63696, -66054, -50625, -79715, -49852, -37972, -25784, 38634, 52197, 4547, -10519, -7652, 36928, 61383, 67216, 27615, 2195, 44187, 44264, 55799, 48462, 20360, 32338, 72252, 47837, 22474, 4014, -569, -21557, 24768, 51999, 25682, -28506, -37694, -50626, -43168, 17689, 49542, 35960, 58528, 98296, 101437, 93754, 68967, 65627, 87972]
11704H7972k2471q3638l3492k3680j7339k2258O192N4270k103K985L0902M7250
11692B4590L7340n026j7001m2926j4478K3552M2862J4627j4865l5100Q49j8659
11680d235n8720r157J4443j9098k2176L515K3888n317l4825K0684K3290K6316
11668d1392M5640L0103L4770n1985n8552k7961L7626p74J5442K9219N735o645
11656A1226L932m9095j7345N6875R328j804J1485p9781l1443k2817j0162M6026
11644g3575J8840M6605k0555j8400N7177K0745j537k3074k1084J0492k6933m0634
11632g1933M404K0480M4156N1877k7570p2601k942J7552j1852k897J2679N494
11620c3153J6509l1049K7404j2189p180N6866R647K243L0632l2027o5691N430
$$ y = [87972, 65501, -18137, -51629, -75309, -92648, -114906, -108714, -54444, -56547, -53562, -22660, 24590, 61930, 56904, 39903, -3023, -17501, 6051, 48913, 63540, 48675, 13575, 14424, -4235, -62955, -72112, -57669, -76767, -98943, -95428, -71540, -76857, -111682, -90998, -67708, -41392, 4248, 34351, 69121, 17136, -41416, -69377, -31751, -32525, -17083, 12136, 17871, 11226, 15158, -33937, -51282, 5593, 14921, 13117, 24602, -55179, -86622, -109439, -119601, -73575, -54735, -8130, -28685, -47085, 10092, 30837, 29300, 6226, -14858, -4366, -31299, -71933, -67529, -47049, -2893, 48984, 21414, -51187, -54129, -36577, -48429, -51326, -38647, -33153, -16644, -47693, -20289, -32478, -39658, 17208, 26855, 29098, 59730, 27703, -37988, -32558]
11608c2558N2183K8430o0449j4227q452J7346l9141O647K4390J1293R078J8436
11596A2976L850j2003n5123K9712M6252j7424k0026K1832k044J0589O1369O854
11584H6814k4468k4601k6877j4774n491N500j554m002j0548M648r670n0415n853
11571h1291P0602m336o423J1047k3263r865K508l4961M3949L9849m4196l5288
11559g1668J7097P5009j0555l3968k2662K9544Q1804l569l5338k0397k837Q309
11547A0769k7746l1792k7429J9467j1302L4146O049K790J5019k7114k918J2460
11535b7601N1067K711l0580o855k9756l0399N3523O7346k4608o3137n9345K2203
11523g5431J0106n0184J9563J1535P2046J0537l0741j3558N918n153L8040o134
$$ y = [-32558, 19625, 48055, -12394, -26621, -35073, -17727, -56868, -50221, -25831, -14538, -5460, 12976, 16826, 4823, -50300, -20588, 25664, 8240, -11786, 10046, 8002, 18591, 79960, 86814, 62346, 37745, 10868, -3906, -9397, -3897, -5451, -9453, -20001, -15353, -25023, -75438, -81291, -10689, -15025, -21448, -10401, -33664, -43529, -41021, -75982, -32033, 7816, -36380, -71668, -54571, 20438, 9883, -24085, -46747, -17203, 64601, 61032, 25694, 5297, 2460, 10769, -16977, -48769, -76198, -56731, -68033, -33887, -27838, -25048, -10029, -37143, -40061, -27601, 23466, 26177, -4403, -11258, -41014, -71413, -17890, 49456, 24848, -38289, -97634, -75431, -65325, -115509, -95946, -84411, -12365, -1828, -32569, -46127, -40209, -45362, -7322, -13456]
11511a3456J2531K1025R245P350l4500N069J9454J3432p822J4617J265k874k2773
11498B2563j8837k3627L4050j0894K1129J0310l066j5980o994p341K0349M1323
11486F2985m163l1759N570j6994m3608K9190R102p230J9211m875p902j8185J7693
11473I035m761r04M1208K0843R183n5453P780K4307J845o9219n6919J0788M1522
11460b0745J4756O231J3059O944n4235k2022M2462j252j4345J4480L4491l0518
11448a0694j7326j1147k2315K1689O5091o815k6182O408P612K1504L5380k7953
11436C5252q4473L2515N0729m9936m1098K6182O447J1496J2331L8525j991l8342
11424b363K8148L0801o956m4580K293J623j3462k0450L1719k2533k3476M133L0552
$$ y = [-13456, -925, 20100, 29345, 36695, 2195, 7264, 26718, 40150, 32328, 46945, 48210, 45336, 22563, 3726, -19901, 14149, 3255, 24384, 34694, 31628, 15648, 8654, 1313, 21662, 62985, 58822, 27063, 32633, 15639, -27969, 1221, 10323, 3093, 22304, 17429, 9527, -8658, 9035, 4274, 3370, 44578, 65421, 74604, 19151, 26931, 51238, 53083, -16136, -73055, -62267, -20745, -5989, 242, 13301, 20245, -33990, -56012, -13550, -14802, -29147, -14667, 19824, -10694, -28020, -39167, -61482, -39793, 25298, 18483, -7699, -1291, 6321, 27825, 63205, 35252, -49221, -16706, 34023, -15913, -57011, -30829, -24382, -12886, -555, 37970, 35979, -2363, 25785, 56586, 49630, 5050, 7343, 8966, -4496, -24946, 6773, -15760, -39236, -35103, -4551]
11411d551k7878r270R580K357j6282j866k3976m2062P2773j0026j5763M5184J0394
11398a1386j1009j9172j8725J4480Q708p509K8867O1061P88q0607j7221M9724
11386b001j0015J6622n61j6947J9700K9661l2272k8655M0525P0082j9273q9522
11374b2656L4J0587Q230J2249J0883j5179l3785K4446P2303M804n1348K544K4643
11361D7755P662m615l0066m7017j3602L2075M8669j1894j9339O703k4610k8636
11349c6915K5474o531J4094k1058l6567m730J373j4219P059N7266l3732k3816
11337g2302J3196L8351L5773L410J0026k6319k0190N5332J2040m6763k2438K8377
11325H493L6638K2004M337l4326o0850J6515N8102N965l8157m9021j4781J0870
$$ y = [-4551, -32429, -41699, -32119, -29762, -46044, -47910, -71886, -113948, -41175, -51201, -66964, -21780, -11386, -22395, -41567, -60292, -45812, -37104, -44613, -15746, 45315, 46103, -34504, -51725, -2001, -12016, 4606, 4045, -12902, 6798, 36459, 4187, -24468, 16057, 86139, 66866, -22656, -22622, -12035, -3805, 8444, 19327, 4148, -29637, -5191, 67112, 71916, 20568, 23112, 47755, 55417, 50802, 20736, -26281, -39883, -7808, 40861, 28967, 9628, 16331, -8279, -36915, -11441, -17972, -3878, -24936, -61503, -66233, -64860, -79079, -72020, -14754, -48486, -72302, -59106, -20755, 15018, 18428, 28454, 2135, -18055, 37277, 49317, 2554, -19884, 8493, 45131, 67135, 71472, 37146, -23704, -7189, 50913, 56878, 18721, -30300, -45081, -34211]
11313c4211L6964k8071l2332J7285L2937Q543O807j4102O850r1865n5316L578
11301a42933P4111N2798l1599K1529N7282L7985k37m2444j1194m4096l0636L6760
11289b2674j3358k9867n093l4645O5747M1440L9011l5302J0004n2261k473M1784
11277B313m45m0991L8849r212J9300L6974k4389p9985m214j0718m3150J9108N7601
11264c8959K5849n47r224J3747m415N3905M2620k3214o3808m1912k6411j4775
11252h7144l3404n7703N0355O9964M4102M0960l9264n4371L7506M3897J1170j2871
11240A3197l9197m4961L8864J3583o807j5867o202K3758p975J4085j8747O149
11228c0120O3436J1376M304m2656J0837J6251J1157j1567n2360Q892Q166K1807
$$ y = [-34211, 2753, -25318, -57650, -40365, -7428, 1115, 7922, -6180, 670, -91195, -146511, -142933, -68822, -16024, -47623, -26094, 31188, 69173, 68936, 26492, 15298, -28798, -59434, -22674, -36032, -65899, -70992, -105637, -39890, 1550, 40561, 5259, 15263, -36998, -39471, 2313, 1868, -39123, -274, -9486, 9814, 46788, 22399, -57586, -61800, -72518, -115668, -96560, -38959, -13110, -13657, -22881, -9134, -13549, 40356, 82976, 59762, -4046, -45958, -72369, -87144, -120548, -178251, -127896, -57932, -13830, 27130, -12134, -66505, -28999, 14898, 26068, 13197, -26000, -70961, -32097, -18514, -25321, -41188, -47390, -23632, -31607, -17522, -36269, -30120, 33316, 44692, 48996, 6340, 17177, 33428, 44585, 33018, -19342, -10450, -2284, 19523]
11216A9523K7812k6128j0074l4558o2153O157O0754K4795L675J0834m428j6541
11204c32J2324l1522n756J7758L7036m4652o4857J7778J5985M9949k2920l0772
11192d9981P08L6034K9006m823R741P861m0994m7062J1630O142l8372j7864o853
11179a04827L6741J8362K1808J4705j7509n4716K0451M9281Q950K5028L3211Q891
11167F0376j5619N851J0923j2296k1137k2414k3804K9172k0709K8376K8701j480
11155D5940L3585m7409l0248k0108k4535J3642K1075K1657j3262m6511n2071j0280
11143a08525M5377l496m942j0498q885N0336L0125m472J8204J5718l1574j7203
11131b9835M6760m545j1396l3193n7755n9707J2932L8692j7529j8602Q8498P7988
$$ y = [19523, 47335, 21207, 11133, -23425, -85578, -79421, -18667, 6128, 9803, 20637, 16209, -332, 11992, -19530, -25286, -7528, 29508, -15144, -80001, -62223, -46238, 3711, -19209, -49981, -49273, -13239, 15767, 10944, 20685, 28546, -12448, -59510, -47880, -41738, -80110, -97974, -104827, -68086, -49724, -27916, -13211, -30720, -85436, -64985, -15704, -6754, 18274, 51485, 60376, 44757, 50608, 61531, 49235, 28098, 5684, -18120, 11052, -9657, 18719, 47420, 45940, 79525, 32116, 1868, -18240, -42775, -29133, -8058, 13599, 337, -46174, -98245, -108525, -63148, -66644, -71586, -82084, -90969, -40633, -10508, -14980, 3224, 18942, -12632, -29835, 16925, 12380, 984, -32209, -89964, -149671, -136739, -98047, -115576, -134178, -45680, 32308]
11119C2308M249j6068M1472J5745o4632l3239j5289j4106L5500L2172j05625l3669
11107a21182J00654O5243k7895l7446l109P03J0310n1101L7416M139l8517o5236
11095a26021O228N5983N3671L4587L9665N2180k3038k3746m6117k0253J3216k101
11083A4254m5703J3563M2714P888n99k125l8984L2304K6639m2927o3403o875P193
11070e6061l4456m2255l51M3335N9266M9405K9536k0816J7674n4260L924L5238
11058C0179J9427o9144m5088m5448L6702N081J5341j5448K6644J6859m084L3595
11046D616m288j0733m2438O621k69l7180K5248K5769K5962l8489j2688J7989j564
11033d1444j5864j3014Q363k5323P1074N5514k8541K3010L6297j905p9009m1353
$$ y = [32308, 36557, 20489, 61961, 77706, 13074, -20165, -35454, -49560, -14060, 18112, -87513, -121182, -20528, 44715, 16820, -20626, -23735, -23032, -12722, -63823, -26407, -22268, -60785, -126021, -119793, -63810, -10139, 24448, 64113, 116293, 93255, 69509, 23392, 3139, 16355, 14254, -31449, -17886, 24828, 32716, 32117, 29992, -8992, 23312, 49951, 7024, -56379, -63254, -56061, -90517, -132772, -133123, -89788, -30522, 18883, 48419, 27603, 45277, -8983, -5059, 30179, 49606, -19538, -64626, -110074, -73372, -68291, -52950, -68398, -41754, -24895, -28979, 4616, 328, -10405, -52843, -46222, -46491, -83671, -58423, -32654, -6692, -45181, -57869, -39880, -41444, -57308, -70322, -61959, -87282, -16208, 39306, 10765, 33775, 70072, 68167, -10842, -52195]
11021e2195K2293K4156k3110k8552L6204L3304N6524n1056m4414K3343J3665L1010
11009D1172L7675J2079k6519m0534j4408N602N9181M615j8544j8134l3776m6650
10997c8241l8908L3056L1216P007l9735o1448L6002L8986L7392j8341m5272J3889
10985d4397K2247L5874j7865l0922L5283N1805l8917k0307N877q179j1414j6515
10973c7430K9122K603n9257k0097K386J1927M5756L0846J0594J7969j6909k6428
10961h918l0759J1146K329L0616P884M0786j0900j0633L6117k3166j6744n696
10949B2062l352N2219M712r695j2278o5127k7522K189K1252K010k5194K889l820
10936c9655k8557K0311M7679N5331m0843k8194j1971P917Q001j8647l5869l9327
$$ y = [-52195, -29902, -5746, -28856, -57408, -21204, 12100, 68624, 17568, -26846, -3503, 10162, 41172, 78847, 90926, 64407, 23873, 9465, 15067, 74248, 78863, 60319, 42185, 8409, -38241, -77149, -44093, -12877, -5870, -45605, -107053, -71051, -32065, 5327, -13014, -58286, -44397, -22150, 13724, -4141, -35063, 220, 52025, 13108, -7199, -1322, -9501, -20915, -37430, -8308, -5705, -64962, -85059, -82673, -70746, -24990, 5856, 16450, 34419, 17510, -8918, -39677, -28531, -26202, 4414, 12298, 53084, 42184, 31551, 67668, 44502, 27758, 22062, 18710, 70929, 75641, 65946, 53668, -11459, -38981, -36792, -15540, -13530, -38724, -35835, -39655, -68212, -47901, -222, 55109, 14266, -13928, -25899, -17982, -9981, -28628, -64497, -103824]
10924a03824Q465O6761m78K619N6166M0146p0471m5334l3358L1371N1474O1252
10912F4789O4430l3019q745o590m7675n1377J4617L7767r584j7577O890j7799
10900c873k5238K2854J4576l6512L4925M5923n8270j8804M2464J7959l5972m1421
10888d1389j2991q811j2173L2343J9421N355P66m0941J463L5022k966R31q381
10875c2351J1301j3175o6348k957M878m984M1693N1557m7124M455P809J3302j1115
10862d3059M952j8156J3549L9630p708l5453k501R73k6720L170R386J7817l0780
10849g4900J6557M0118k9444j203O9154Q270J3135N0199K3222o2509K7070p380
10837G2289m7702k3877Q867m8685j2522K6243j649k4829k5659o573L785L2363
$$ y = [-103824, -95359, -28598, -29076, -26457, 29709, 69855, -616, -45950, -79308, -47937, 3537, 64789, 129219, 96200, 87455, 80865, 33190, -18187, -3570, 34197, 24613, 7036, 13926, -3873, -29111, -6257, 8319, -28193, 6732, 52655, -5615, -24419, 18045, 36004, 32, -41389, -54380, -63191, -75364, -43021, -23600, -18245, -17479, -58420, -56957, -21935, -24901, -23970, -32351, -21050, -34225, -100573, -103530, -98652, -103636, -61943, -10386, -57510, -53055, -45246, -31944, -43059, -38107, -56263, -42714, -3084, -10792, -46245, -48746, -47773, -74493, -71323, -61937, -44120, -74900, -58343, -18225, -47669, -48872, 20282, 28552, 41687, 91886, 115108, 52599, 79669, 72289, 24587, 710, 9577, -39108, -51630, -25387, -27036, -51865, -77524, -84097, -80312, -47949]
10825d7949J2391J9314L9973l2857k4224j829J7974n23K631J6279O3884J6664
10813H1728j9969q650k3189n3689m2578J4498l944l3623l3484O31N5287k0287
10801h7269M5090L9546K0993K729J772J4422n240l5063j4653J2637J892J122j125
10788c147o461m2031P595l5787q853P676j898J9363R537J4939L7611L7366j9763
10775A6147k1513m9082l0689J9965L7353j413J6252j3108j271j7754l7278M536
10763g7855J7337M7475p93L228J2260R528n2839p3562q488L4106K8235J9124o7586
10750a09830m04M6328P7026N6649k5659m4600O720k2234k335J7922k0513m5066
10738f5996j7139L8691O4138J7297o5772m9935O6284J6061k605J5149p570l0451
$$ y = [-47949, -35558, -16244, 23729, -9128, -33352, -35181, -17207, -17730, -15099, 1180, 65064, 81728, 61759, 53109, 29920, -23769, -66347, -51849, -55793, -89416, -122900, -122269, -66982, -87269, -42179, -2633, 18360, 21089, 22861, 37283, 32043, -3020, -17673, -5036, -3144, -2022, -3147, -9608, -51639, -44044, -79831, -88684, -81008, -82906, -63543, -54006, -39067, -1456, 35910, 16147, -5366, -54448, -85137, -65172, -27819, -29232, -12980, -26088, -27359, -45113, -82391, -77855, -60518, -13043, -13836, -10608, 1652, 11180, -41659, -115221, -123709, -89603, -61368, -42244, -109830, -110234, -63906, 13120, 69769, 44110, -490, 6230, -16004, -18339, -417, -20930, -65996, -83135, -44444, 19694, 36991, -28781, -78716, -12432, 3629, 1024, 16173, 8603, -21848]
10726b1848N18N061k1232L5756J6757l1007p720K2154o044K489L760M6450r324
10713C5770j6921K5966L0064o1878m1125j4086J9140j6403K1173J3737K5033K6272
10701D6742J1612k6725n9078l5162L996L5915J4750K2612j2009R041p636j555
10689B503k229M3217j0373J5958k1283k2015L5681l9942n4906j6590O1968o419
10677a4430K0300J3068o746m7778K5665j5690L3538m2418k4530N1689J9917K2005
10665C4590M1176k6472q6228n3460k1441P1010N8439K6577k9509R574r831O951
10653B1376L4223K1681o014k6315p4659k0374J3785j0113n2749j4121L2422J01730
10641B0872k270o2050j7169M5132K5475j6203N290j3276L4070p214p6419j3299
$$ y = [-21848, -21330, -16269, -37501, -1745, 15012, -15995, -23715, -1561, -7605, -5116, -1356, 45094, 35770, 18849, 44815, 74879, 13001, -28124, -42210, -23070, -39473, -18300, -4563, 20470, 46742, 58354, 31629, -27449, -62611, -58615, -22700, -7950, 14662, 2653, 11694, 4058, 2503, 274, 43491, 33118, 49076, 27793, 5778, 41459, 1517, -53389, -69979, -8011, -14430, 5870, 18938, 12192, -35586, -9921, -25611, 7927, -34491, -59021, -7332, 12585, 34590, 75766, 49294, -36934, -90394, -111835, -40825, 17614, 44191, 14682, 24256, 14425, 21376, 55599, 77280, 71266, 44951, -29708, -50082, -36297, -46410, -99159, -113280, -80858, 20872, 18602, -43448, -60617, -15485, 9990, -6213, -923, -14199, 19871, 12657, -63762, -77061]
10629g7061K2464J0740r405K0507r844m3867L7403m763k3960k7943k22J4909J5453
10616g5589L6605M1436J3786j1026k2629P305j7540J9350o7359j0581O4422K4463
10604B643L7327n080j8545K328J8523J1272k9611j584l36n9390k2662J7595K911
10591d4609J592j1826J064J8416N3543J7862k5316k0762r253P864L0498j118j9023
10578a068j0765l8668M1716M7485K2861J8787l1689l5392l4219j5550J3347L5434
10566A2279M389O942N0994k8124J4063l0146j2036j5233l8206k5125K2762K5560
10554a1881L3290j4829l4131q090R747r031n0421p890j4768N3218M0712j545l240
10541a8859K2801M4461J0600l8901O758o6487m1766L9788o77l1787j159O1426
$$ y = [-77061, -54597, -43857, -53262, -32755, -42599, -86466, -49063, -53826, -77786, -105729, -105951, -91042, -75589, -38984, 2452, 16238, 5212, -17417, -10112, -27652, -8302, -75661, -86242, -21820, 2643, 39970, 34890, 16345, 18673, 37196, 48468, 18857, 17273, 16937, -42453, -65115, -47520, -44609, -43017, -54843, -53779, -35363, 18180, 36042, 10726, -10036, -19289, -11425, 19073, 17955, -1068, -11833, -50501, -8785, 38700, 61561, 80348, 48659, 13267, -20952, -36502, -23155, 12279, 16668, 23610, 74604, 46480, 60543, 30397, 18361, 3128, -35078, -60203, -37441, -11881, 21409, 6580, -27551, -35641, -25894, -34925, -85346, -93236, -108004, -54786, -14074, -15619, -18859, 3942, 48403, 59003, 20102, 26860, -39627, -81393, -41605, -42282, -74069, -75228, -13802]
10529a3802M5612J2551K0530q093p8194l6621M6283N3454n9321K5186M8762n8657
10517b310m929k30n637K706m1059m8726j5005n192N9671Q0852K7629n750j2222
10504B9798j8303J1340K4414p461n8156j0921j0389M121K908m094N934L3401M4975
10491D7567n1062l1948L7156N3719k2608P502k4171R63l5408o2691j9061J9594
10479h0448P3121L3822R16L0115M9139o6987o8966l1415K946K4093Q9428p792
10467D7972n3212n4742l9880L9728Q8271J5999J7202K2797j3336m9612j7817j2731
10455i361Q035M3070J5173n929K3817k723q0758k7453j8375J5945K8972K6248
10443A6661m099j6044k1399R09j7525r239O7002M6989o2228j7696M0560J6199
$$ y = [-13802, 31810, 44361, 64891, 56798, -21396, -58017, -11734, 41720, -17601, 7585, 56347, -2310, -7239, -7469, -13106, -10400, -51459, -100185, -115190, -120382, -60711, 20141, 47770, 42020, 29798, 11495, 22835, 47249, 39788, -18368, -29289, -39678, -35557, -32649, -36743, -30809, 2592, 47567, -3495, -35443, 1713, 55432, 32824, 40326, 16155, 17118, -18290, -80981, -100042, -80448, -7327, 26495, 27411, 57526, 106665, 39678, -29288, -60703, -57757, -33664, 55764, 47972, -5240, -59982, -99862, -60134, 28137, 44136, 61338, 84135, 70799, 21187, 3370, -9361, -1326, 41744, 56917, 50988, 74805, 72082, -8676, -36129, -54504, -38559, -9587, 16661, 12562, -3482, -24881, -23972, -41497, -50736, 16266, 63255, 1027, -16669, 23891, 40090]
10431D0090O851j1962k2317r514m0690l0084N5866N2982K6413P021m9598n9475
10419c4417l0802P440P0644O2496J2940l4059l3687o458n693J5715K4853m6406
10407B566K2696N1428l4724j00435o2101j0362P442N3131L9508R189M3058K5379
10395D6775K7326m6101o8314k2322K665j2290R713M358R827j2046K6273K4367
10383i769P890r529j1401m445J6199K7729L8314K4555l3846n327k1575o9877n490
10370e6572m290q362J8398L2678M9508j8043l5171k2529N994l0462L7914L8113
10358G176M352L209l5156n1988k2086J1854N4092j0084M1613M3670N578m892j2205
10345C5133m0079K7678O0834k8756m4006j7659K8644n121M6577o1445k2996J9028
$$ y = [40090, 46941, 34979, 12662, 3148, -37542, -67626, -11760, 41222, 67635, 74656, 25058, -34417, -65219, -57779, 12865, 75361, 88301, 54242, 20555, 14097, 8404, 24119, 48972, 2566, 25262, 76690, 41966, -58469, -120570, -130932, -123490, -70359, -30851, -21662, 21396, 46775, 74101, 28000, -40314, -62636, -59971, -72261, -62548, -58190, -48363, -60409, -34136, -9769, -1879, -11408, -22809, -27254, -11055, 16674, 54988, 79543, 45697, 40370, 18795, -51082, -56572, -60862, -69224, -50826, -18148, 31360, 13317, -21854, -44383, -38389, -68851, -30937, 7176, 11528, 14737, -20419, -72407, -94493, -82639, -28547, -38631, 2982, 46652, 52230, 47338, 35133, -4946, 22732, 83566, 54810, 10804, -6855, 21789, 16668, 63245, 1800, -21196, -2168]
10333b168l8219L9449K6734k1060K1044J2867q98l457l0097J4416J1721k023n9304
10320c0995k200N2142j7145m8845l1606O954p975K0209l4578K5892R1939K0183
10308D3975j6054L3640q740k2078J9526o9152o0903R883L1125M1679L7658k1230
10296A9329n9891j2514k5933O9717j1968K8485N8925j2847m5768P539n0886l134
10284c8946K296M1959J6668m4984j7989j0595L018J0807l2412j7403K4499J860
10272f1222M0959K6798n223M4595N7503o2622j4639L0917K3817j8655m2212n4518
10260c4502l416j915R26l4355K6149P7889L8283j8224J2899j3139J9333n6327
10248A3601l4688j6682l552J5949L0241n0665j5596L8250M5323o2200n2661k5233
$$ y = [-2168, -40387, -938, 25796, 4736, 25780, 38647, 37749, 34292, 4195, 18611, 30332, 28309, -30995, -33195, 18947, 1802, -47043, -78649, -71695, -79670, -59461, -94039, -68147, 23792, 43975, 27921, 61561, 52821, 30743, 50269, -18883, -79786, -69903, -38778, 2901, 40559, 19329, -40562, -53076, -79009, -9292, -21260, 7225, 66150, 53303, 7535, 15074, -35812, -38946, -36650, 5309, 21977, -23007, -40996, -51591, -48573, -37766, -70178, -87581, -63082, -61222, -20263, 6535, 1312, 45907, 103410, 40788, 26149, 57066, 80883, 62228, 20016, -34502, -37918, -39833, -38907, -73262, -47113, 30776, 69059, 50835, 63734, 50595, 69928, 13601, -21087, -37769, -41321, -25372, 4869, -45796, -61392, -23142, 22181, -40019, -92680, -117913]
10236a17913N5638N5324n6833o800O621l0904O6559L3331j0864J0430L465j0216
10224b162j9746K5607L0145k2145J828n0560N523K8640j9796q862k0451L0109
10212b1870L7535q727Q2081O4638l1674p6175m6220J9915m5892l5575j3014J4180
10200f0798M8924O2075J4175J3576N636l885j6558k0617j7893l2415k5048k2763
10188e5591M8761M0896j3994L0288J0389o8982j946K153j9430J5161J1149j8367
10176a9513O6952K2635m7246K0968J1064j3444k1877l2378M2875K3830M392j7198
10164D1060k4031k321n2177o7265K7250K7068P9687R665l4130n182M8365l983
10152D4006k9859k9081n7349L73M9795j8082L014L0256k4000L7309j1743J3309
$$ y = [-117913, -62275, -6951, -63784, -70584, -63963, -94867, -28308, 5023, -5841, 4589, 8054, -2162, -21908, 3699, 33844, 11699, 13527, -37033, -31510, -2870, -22666, -31528, -51979, -21870, 15665, 6938, 89019, 153657, 121983, 45808, -412, 19503, -26389, -61964, -74978, -60798, -11874, 50201, 64376, 77952, 83588, 79703, 63145, 42528, 24635, -7780, -32828, -55591, -6830, 34066, 20072, 50360, 60749, -8233, -10179, -8026, -27456, -12295, -1146, -19513, 47439, 70074, 22828, 43796, 54860, 41416, 19539, -12839, 30036, 53866, 58258, 41060, 17029, 14708, -37469, -104734, -77484, -50416, 29271, 38936, 4806, -376, 47989, 44006, 14147, -14934, -72283, -71910, -22115, -40197, -37183, -6927, -30927, 6382, -5361, 7948]
10140G948j5770K2477N1687j4995o1921L1693O4839K9957o5479k9858J2048N0490
10128H3116j1124k5012k2467k8167R927K1530j0371M21k6867j9462L2333R6786
10116A00643K1350j0379M412l9035l0872m1697J6276k7062O773k0396l2774j8005
10104g0766P1128K0859n0394l925o201K0649L6501n5122J7527P3930K4218j8079
10092F0325K6671K5039j3554n7003k1237j2667p1873l4887N111J0938L2720J0113
10080d0304n08r40J4835j7950L5433j6116p619K4454K4044k6170j695J5053k237
10067B80l7169N731J8456k0503q6111l3516K528N266O7907O7124J9986j0925M2740
10054D1794N7223O0791J30817J44093J49789J80456J47400Q2811j21345k91446
$$ y = [7948, -7822, 14655, 66342, 51347, -10574, 21119, 85958, 115915, 50436, 20578, 32626, 83116, 71992, 46980, 24513, -3654, 6273, 27803, 17432, 17853, -9014, -28476, 3857, 100643, 121993, 111614, 116026, 76991, 46119, 4422, 20698, -6364, 409, -19987, -52761, -70766, 362, 21221, -29173, -33098, -39299, -18650, 17851, -37271, -19744, 54186, 78404, 60325, 86996, 112035, 98481, 41478, 20241, 7574, -64299, -99186, -94075, -83137, -50417, -40304, -40812, -41752, -26917, -44867, -9434, -25550, -33169, -8715, 15329, -10841, -12536, 2517, 280, -36889, -31158, -12702, -33205, -119316, -152832, -150304, -145038, -77131, -10007, 9979, -946, 41794, 99017, 159808, 290625, 434718, 584507, 764963, 912363, 995174, 873829, 582383]
10044E82383j95971j04654n1094l0032l3787p6810K0187J97j437j1892l5581K0723
10032H2232n373o644J5360K6068K6670n8527n9719l3019J1755o804M5371k5249
10020A2121L227M5177L5938k9260j4178k7106j0941j672J7683k1149J6928J2309
10008C9077K8639J482j2485l278l3670j6462M7625l9301k5125k390j2687j0372
9996c8947k101M6560L9530Q734m8633n5037K0573N0946m0700j1874J7354M2806
9984B9211M5192j2389k9114J7367R852J5092j0415m6764o3133o3949L8854P0339
9972A43M21l7511k3142p693l701M3184j6957K7536K5013N8292L2575m680L6325
9959A29805o7l6954m4906j8403r09n4487j729K9354L1550J7728l3600n923M6484
$$ y = [582383, 386412, 281758, 230664, 200632, 166845, 90035, 110222, 110419, 108982, 97090, 61509, 82232, 76859, 70215, 85575, 111643, 138313, 79786, 20067, -12952, -1197, -8001, 37370, 12121, 15348, 60525, 96463, 67203, 53025, 25919, 14978, 13306, 30989, 9840, 26768, 39077, 67716, 69198, 56713, 53435, 19765, 3303, 50928, 11627, -13498, -15888, -28575, -38947, -41048, 5512, 45042, 53776, 5143, -49894, -29321, 21625, -19075, -30949, -13595, 29211, 74403, 62014, 32900, 50267, 60119, 75211, 64796, 18032, -45101, -109050, -70196, 143, 564, -36947, -60089, -67782, -71483, -28299, -45256, -17720, 7293, 65585, 98160, 93480, 129805, 129738, 92784, 47878, 29475, 28566, -25921, -27650, 1704, 33254, 50982, 17382, 11459, 57943]
9946E7943m239K1634l8774L177K8121k2810m043K8216J9379J8461k3193l9245
9934D4627K2041L630l4878n0398k244o651O9673O435q2583j8138k3191L6378Q0158
9921D4859M6879K9928j1208m498l0443l2990J6411k0390k4764P965J9108L669
9909D4526k3884j7483J6678o875J5775K8702l967l6225P940J3056r846l6089k6809
9896c4501O2860K74j1677J6287m144K9489J3052k2273J2804j6699j2819l9505
9884f852Q455K0974l1720J2636L1924K8015N168k2154j250J2842k8322j5515r571
9871D630j4934R801l828K412L410J2893M0118n224J1707L0856J4333l965r975
9858I2234j8419j5368k5340J853K3503J464o783l2124n6333J4888L2816j3794
$$ y = [57943, 53704, 75338, 36564, 39741, 67862, 45052, 41009, 69225, 88604, 107065, 83872, 44627, 66668, 70298, 35420, -14978, -17222, -23873, 45800, 52235, -30348, -48486, -71677, -35299, 44859, 91738, 121666, 110458, 105960, 75517, 42527, 58938, 38548, 13784, 21749, 40857, 44526, 20642, 3159, 19837, 12962, 28737, 57439, 53472, 17247, 25187, 38243, 28397, -7692, -34501, 28359, 28633, 16956, 33243, 29099, 58588, 71640, 49367, 62171, 45472, 32653, -6852, 1603, 22577, -9143, 3493, 35417, 63432, 68600, 46446, 45196, 58038, 29716, 14201, 4630, -10304, -503, -4331, -1919, 1491, 14384, 54502, 49278, 60985, 91841, 106174, 102209, 92234, 73815, 58447, 33107, 34960, 58463, 59927, 53144, 21020, -35313, -20425, 12391, -1403]
9846a403N6370J61n3498J0252K9258k6961j3152K8655k1099r302K6706J9263j9998
9833B5252m2491p591K6249l3534o5752J5548M7043L3784J9057K587k734L0268
9821D7686L7951j8346R562L2602l8583n0069L0099N4814J1720n6085m3456k1386
9809c491N119J3950L6539j5469k8646J8052j1615j9236k5811J7038N4193L1292
9797G1915P160k1418L0575k430L409K7416n15o0910K482M136L104K8012k583o4106
9783B6247m0346M488J7183M8745J4147q211K5377k318m7493l3726m952k7666o98
9770b9223J8665Q06M0935N5913k0598M487r350k7607M0265J8485o734m2018j6339
9757B7687k6054J552J3939J5544j580l2591N6179M3763l0341o4117K3768K9511
$$ y = [-1403, 54967, 55128, 1630, 11882, 41140, 14179, 1027, 29682, 8583, -719, 25987, 45250, 25252, -17239, -24830, 1419, -32115, -97867, -82319, -35276, -1492, 17565, 20152, 17418, 47686, 85637, 67291, 76853, 109455, 70872, 20803, 50902, 105716, 117436, 61351, 17895, -3491, 1628, 15578, 52117, 36648, 8002, 26054, 14439, -4797, -30608, -13570, 40623, 71915, 79075, 57657, 88232, 85802, 89211, 116627, 116112, 55202, 57684, 61820, 64924, 92936, 90353, 26247, -14099, -9611, 7572, 56317, 70464, 62253, 87630, 85312, 37819, 4093, -859, -28525, -29223, -10558, -9752, 31183, 87096, 66498, 70985, 61635, 34028, 74293, 92778, 86044, 44026, 27687, 1633, 3185, 17124, 32668, 31088, -1503, 54676, 98439, 68098, 3981, 27749, 57260]
9745E7260J1973K8139n527l5592L4130J1799R306l9291j9956L8180m5219N094
9733E0296N893J1530j3200L2074O3301r607R843K4453j8916o4902k3088K0722
9721H8399j3859j5023o4578n1958J2397K5636J6854N1470L2146K0644r868l0647
9709F1613o4866j3995L8368Q8107K3399m1869L915M604l220m0360n05J5184L3707
9696A04082N5911J0272o1668l5746j2142K1143j5202J8209l8565K1870j5777j6371
9684C6016J6660P202K27l2059j3948K0011l7457l8844K5928L8088Q688l0464j171
9671a123N9268J5838k4047j8192M4531M0581k9262M0624N941K3685j2224m1088
9659A04532l5049K3019N6123J0718n701K7367P106m2109M0589L5605n406m2073
$$ y = [57260, 69233, 97372, 91845, 56253, 90383, 102182, 111488, 72197, 52241, 90421, 45202, 50296, 56189, 67719, 54519, 86593, 149894, 140287, 150130, 174583, 155667, 90765, 67677, 88399, 74540, 59517, -5061, -57019, -44622, -18986, -2132, 49338, 81484, 102128, 92260, 61613, -3253, -17248, 21120, 109227, 132626, 90757, 94672, 99276, 96056, 55696, 55191, 70375, 104082, 159993, 170265, 108597, 72851, 60709, 81852, 66650, 84859, 46294, 68164, 52387, 36016, 52676, 59878, 60105, 28046, 14098, 34109, -3348, -42192, -16264, 21824, 30512, 48, -1123, 58145, 73983, 49936, 31744, 76275, 116856, 87594, 128218, 134159, 157844, 145620, 104532, 69483, 92502, 148625, 159343, 153642, 181009, 188115, 146006, 186595, 222200, 216794, 174721]
9647A74721R656l0821n7499p677N2089N9792l7770m3180l2420j3773J4683k1013
9635F6788J874k1417K6284r955P790J4638m1010j931L8162K0701o024L1880O1660
9622A89440l8196k891m895m4106K730Q979o3425R493j5090r23O6345m676k9204
9609G3581m375j5972J6329p626p106M4167m4782M8960N7513q635n2682J516M8123
9596A49011j3134l5007l4019j4572j9423O8914M7505n383K217l4350R171J5256
9584A36186J2824K140J4050o949k7647J2870n4552k639J140M2263O6141j6511
9572A79316l1069J0537Q313k6189m1176J4715K4108P549j0360k1938R018M7088
9560A69912j0590o5745J4489J2732K0225K7960Q443r502q2278l9554j7105k1951
$$ y = [174721, 184377, 153556, 96057, 88380, 140469, 200261, 162491, 119311, 86891, 73118, 87801, 66788, 68662, 47245, 73529, 63574, 71364, 86002, 44992, 43061, 81223, 101924, 95900, 127780, 189440, 151244, 148353, 143458, 99352, 102082, 111061, 47636, 57129, 42039, 41116, 107461, 102785, 73581, 69206, 53234, 69563, 61937, 54831, 98998, 54216, 103176, 160689, 152054, 99372, 100888, 149011, 135877, 100870, 66851, 52279, 32856, 101770, 149275, 143892, 146109, 111759, 120930, 136186, 149010, 151150, 165200, 158251, 130604, 143474, 88922, 86283, 87423, 129686, 195827, 179316, 148247, 158784, 167097, 140908, 99732, 114447, 138555, 146104, 135744, 113806, 122824, 169912, 159322, 93577, 108066, 120798, 141023, 168983, 177426, 167924, 85646, 46092, 28987, 7036]
9548G036K0417K7936N7419N0610o242r689k1595l9048j9521L7658p919O0384O2197
9535B19643j7079l9397J2685J3805r7669K371P441O3339O1411r352J2105J27q2525
9522A46905j3216R885j0272J1262L4451K4186K8795K6725J2628k3832m0248j1429
9510A95840k3943l447L3221P866k1844k8619N8249M0098j3415j4213m3042k3206
9498A63545M1134J4361k7777j0083K2758Q620L6181R724M0050n953m2055L372
9486B53877n2182R206j3082l0567j4249j4105k1968J497J04057n516p7895M4759
9474A83832L5442L4344j7073n755L1766m535J6425K1254J4005k8551m1916m2876
9462A96362m6604K4390j7089J2309N1367o13J0478J1977L9978J2293k8492R62
$$ y = [7036, 27453, 55389, 112808, 163418, 157176, 147487, 125892, 86844, 67323, 104981, 97062, 157446, 219643, 202564, 163167, 175852, 189657, 91988, 94359, 101800, 165139, 226550, 217198, 229303, 229430, 146905, 133689, 143574, 133302, 144564, 179015, 203201, 231996, 258721, 271349, 247517, 207269, 195840, 171897, 168450, 201671, 209537, 187693, 159074, 217323, 257421, 244006, 229793, 186751, 163545, 204679, 219040, 191263, 181180, 203938, 212558, 248739, 258463, 298513, 292560, 250505, 253877, 201695, 210901, 197819, 167252, 153003, 138898, 116930, 118427, 222484, 216968, 139073, 183832, 219274, 253618, 236545, 230790, 262556, 258021, 274446, 295700, 309705, 281154, 239238, 196362, 149758, 174148, 157059, 169368, 220735, 220122, 230600, 242577, 282555, 294848, 266356, 267318]
9450B67318m4789k3147N3794j60j7535o575L2458J7448L8811j1565j9532r5064
9438A91462L4770M0760m8765Q553L3934K7063j0331m3703J3440o409L404K6551
9426B70729r567k3918O2354J1318l1669J447j5903M6109k765Q122j8894K4119
9414C21482l5487M820J723K6268l0692m2527l0673R40K0251l5188l3115m9302
9402A18500j2399P8472N3477J6181J215o785J2186j8025m350L8183K1844K6677
9390C25176J6585j66o0589j8272r695k1692k9571L3244j3028p3600p1796K9370
9378A05966N4104L5693k4562M250J1523P3807J1953M5216l4007j06171m6146l377
9366A28249M1017L6327M5748M9368l7208m6474k9124j6917P5160M1104J5892m0575
$$ y = [267318, 222529, 199382, 253176, 253016, 235481, 228906, 261364, 278812, 317623, 306058, 286526, 191462, 226232, 266992, 218227, 226780, 260714, 287777, 277446, 233743, 247183, 240774, 244178, 270729, 261162, 237244, 299598, 310916, 279247, 280694, 264791, 310900, 308135, 316257, 297363, 321482, 285995, 290815, 292538, 318806, 288114, 245587, 214914, 215854, 236105, 200917, 167802, 118500, 106101, 184573, 238050, 254231, 255446, 248661, 260847, 242822, 238472, 276655, 298499, 325176, 341761, 341595, 281006, 262734, 253039, 231347, 201776, 235020, 221992, 148392, 76596, 105966, 160070, 195763, 171201, 175451, 186974, 260781, 272734, 317950, 283943, 177772, 131626, 128249, 169266, 205593, 251341, 300709, 263501, 217027, 187903, 170986, 246146, 287250, 303142, 262567]
9354B62567j8525k2464o000k7964l6382k0103k1320L3385L4695L3635k468K3423
9342B32479K1598m9033k0784Q926q123n0560l8507L9405N714k8028Q321l270K6045
9329A44183j1642n885j224L9980N1889J4955k2689l8349j257N7770j1919l1612
9317A84200k9307J1289k2699N8342O1695o6090m1533l1951M4179j9545N209L584
9305A57373k3024M5232L9922j8477j1765k9913l7785k4684J0454M3015j0348K345
9293A42345j853n1087O30j3742k065L7699L6781o276L5295L7716m2975n1404K6282
9280A47346Q80j5708J6641O97j2713j4100J3093N2103q684N348l5387m470j0659
9267A34387m1517J7144K242K2033M1107P367k1167l7066k182K627n135k0144J225
$$ y = [262567, 244042, 221578, 215578, 187614, 151232, 131129, 109809, 143194, 177889, 211524, 209056, 232479, 254077, 205044, 184260, 193186, 185063, 134503, 95996, 135401, 141115, 113087, 121408, 118138, 144183, 132541, 126656, 125432, 165412, 217301, 232256, 209567, 171218, 169961, 227731, 215812, 184200, 154893, 166182, 143483, 201825, 263520, 197430, 155897, 123946, 168125, 148580, 153789, 157373, 134349, 179581, 219503, 201026, 189261, 159348, 121563, 96879, 107333, 150348, 140000, 142345, 140492, 89405, 90035, 76293, 74228, 111927, 148708, 142432, 177727, 215443, 172468, 121064, 147346, 148226, 132518, 149159, 149856, 137143, 123043, 136136, 188239, 179555, 184903, 149516, 145046, 134387, 92870, 110014, 112256, 134289, 175396, 182763, 161596, 124530, 122348, 124975, 119840, 99696, 100921]
9254A00921M6346l0718l9793J7779K7032n7589O533N588O375L3225O1940K3422
9242B01061l324k008j3823l5445o4909l3448K1081K4614J4772q755n7232k8183
9230A4401M9558P1498K3819k8410J0871L3365j9359p0367K330K0892L8277j2298
9218A34577l1747r212k9993L7590M0901r944k2462j2391Q834O3040l728j9762
9206A45703l1801q082o706k3674j8402J02873j5596l8840j256O6480J4748K6950
9194B12397l26l3448k9059K8184n277K438k4511k0668L4903L1106o5797l4765
9182I5177J7976n203k568n002K403m169r049k9947r07n9029O355N3862m4788k5738
9168a0627K062Q535j0959L5304L4572r366j8686K8277L9119L667M825j4031m4863
$$ y = [100921, 147267, 116549, 76756, 94535, 121567, 63978, 70511, 76099, 82474, 115699, 177639, 201061, 197737, 195729, 181906, 146461, 81552, 48104, 69185, 93799, 108571, 99816, 42584, 14401, 63959, 135457, 159276, 130866, 141737, 175102, 155743, 85376, 87706, 108598, 146875, 134577, 102830, 93618, 63625, 101215, 142116, 132172, 109710, 97319, 106153, 169193, 165465, 145703, 113902, 105820, 99114, 75440, 57038, 159911, 144315, 105475, 104219, 170699, 185447, 212397, 212071, 178623, 149564, 177748, 172471, 174909, 150398, 129730, 164633, 195739, 129942, 95177, 113153, 107950, 105382, 100380, 102783, 98614, 89565, 59618, 58711, -318, 6037, 59899, 15111, -10627, -8565, -30, -10989, 24315, 58887, 49521, 30835, 59112, 98231, 101898, 106723, 92692, 47829]
9155D7829L8964M1098o689M5394J4479k4703J7311n2769n6634k7897j4089K2293
9143D4587J098K2144q966k3316n216j4877N13O892N4983k3656M74m028j0717J568
9129D1483m9281q690O9056Q56k680O0891K0290M960k2642k0437L826R245K937
9116A09814j06265r513O2581j230j0231J7728L6117k0231k6352m1037Q358L0233
9104D9972n1108J4889M5506m7256J783P5600o324l0344q9K8762J3454k2422p4974
9091b551j4774K8622L2755J5623N1109M6877o3437n8350J6266n328l7514J6758
9079B6056L4952j1575k1917j2216q631P072K0374J6700l2904n3310l220L0729
9067g890J1253j1145J6360K8462K6768n5496J8754r563n0042k9059O7491J6417
$$ y = [47829, 86793, 127891, 121202, 166596, 181075, 156372, 173683, 120914, 64280, 36383, 22294, 44587, 45685, 67829, 58863, 35547, 30331, 15454, 15967, 22859, 77842, 54186, 54660, 50632, 39915, 41483, -7798, -16488, 52568, 53424, 50744, 111635, 131925, 136885, 114243, 93806, 97632, 106877, 109814, 3549, -5964, 56617, 55387, 45156, 62884, 99001, 78770, 52418, 11381, 19739, 49972, -1136, 13753, 59259, 12003, 13786, 89386, 83062, 52718, 52629, 81391, 94845, 72423, -2551, -17325, 11297, 44052, 59675, 110784, 157661, 94224, 35874, 52140, 46812, 9298, 26056, 61008, 49433, 27516, 15300, 6669, 13741, 34115, 50815, 17911, -35399, -38619, -7890, 3363, -7782, 8578, 37040, 63808, 8312, 27066, 17503, -32539, -61598, 5893, 22310]
9055B2310J75n072k0210L291l0932K1721J4813j0072J0613n6794L434N2868L943
9042A0088q678J6062j269m811p443m995J7983K7061M1857q2860m6994K8264Q366
9029g369N9649M5032j7531n0895n7867N7004J1853l7899l469K9351j6610N6233
9017F7482P7217m3212o357m0110k6997k3494N398N1958P947j5146O9729l4663
9005H9752m9102k1686K448k4947K7024M0085l6818J1181K6964M94k6137l6091
8993C167L5820M6197q227o0862j765L1197K1868l2538p363n2237J237L7060Q057
8980B1611p945J2762L5629l2772k4985K2056l6823r257k45l1772K5411J1731J2598
8967b001J6440R189k346N2397O3671k4083l6426l1591j0721J5669J444k7039r654
$$ y = [22310, 22485, 17413, -2797, 494, -30438, -8717, 6096, -3976, 6637, -50157, -46723, 6145, 10088, 1410, 17472, 16203, 11392, 3949, -1046, 16937, 43998, 85855, 2995, -43999, -15735, -7369, 52280, 97312, 79781, 28886, -28981, 28023, 39876, 1977, -1492, 27859, 11249, 67482, 144699, 101487, 95130, 55020, 28023, 4529, 9927, 61885, 69832, 54686, 124415, 89752, 40650, 18964, 21412, -3535, 23489, 63574, 26756, 37937, 64901, 65395, 39258, 3167, 38987, 85184, 76957, 16095, 14330, 45527, 67395, 34857, 27494, -24743, -23506, 13554, 21611, 13666, 26428, 62057, 29285, 4300, 26356, -10467, -19724, -19969, -51741, -26330, -14599, -2001, 14439, 23628, 21282, 73679, 137350, 113267, 76841, 45250, 34529, 50198, 51642, 24603, 14949]
8954A4949L5590Q428O016J4440m3340j3127j9625l7945j2964N5864L7545l0714
8942A5117j1085j4807K5676k7476P6284K1540j0942m3842r2558m079N6620P0143
8930F0591j3407o7995J0555N8670K8200j4976q0431m4693J0875o906J3869N6955
8918A1307o115k411m688l171j4254k2707L116J9659n186K0133N2975j7788j4984
8905A5886l1186o4138K611M1291N6424K3443N201J3829m632l6839m3644J0288
8893a1466m223J5518M7623j5706l6268l5785k8576J1511J359N9154L8023m539
8881C6625N97J4575k3756j0161P6766K2902K225j688j8872m8071k9813P127m086
8868B4370L8973k3116r844m4501j1191l8066J1885J9201l2002J2376M4850J8406
$$ y = [14949, 50539, 58967, 64983, 79423, 36083, 22956, 3331, -34614, -47578, 8286, 45831, 15117, 4032, -10775, 14901, -12575, 63709, 85249, 74307, 30465, -62093, -66172, -9552, 60591, 47184, -20811, -10256, 48414, 76614, 61638, -18793, -63486, -52611, -59517, -45648, 11307, 5192, 2781, -1907, -5078, -19332, -42039, -38923, -19264, -24450, -4317, 48658, 30870, 15886, -15300, -79438, -76827, -35536, 20888, 44331, 49532, 63361, 58729, 21890, -21754, -11466, -15689, -171, 47452, 31746, -4522, -40307, -68883, -57372, -56013, 3141, 41164, 36625, 37222, 51797, 28041, 17880, 94646, 117548, 119773, 118085, 99213, 51142, 21329, 28456, 24370, 63343, 40227, 30383, -14118, -25309, -63375, -51490, -32289, -64291, -51915, -7065, 11341]
8856A1341j0931J5089k0426K7309J75o1544J9675L2833j219j5825j1052j3124
8844b7699J4768k2646l447J4431j5545k3544j5735L3906J1639N6392K5957R811
8832E8288K5997L2733j3243m5016o0109k3756r402M7679K4805n842n612n445O830
8819B7907m247K654L1131l6591M393K6891j7364o5753K257J6943J5767j7769J2181
8806a600k5718k5532O372K0039K9317J1411j904N639k921O356j1215K76j4016
8793c496P5641K1057n8274k7127L2892L9835K7659m4773j6263K5750P282n7291
8781B2892p7753l6556J5497N2709N2315o610o6661r5251O8081P4727J3792J3570
8769C0752K3928L2659k0697q371R514K7125M9022k687m6811j0992O2763k3360
$$ y = [11341, 410, 15499, -4927, 22382, 22557, -38987, -19312, 13521, 12302, -3523, -14575, -27699, -12931, -35577, -39024, -24593, -40138, -63682, -79417, -45511, -33872, 22520, 48477, 58288, 84285, 117018, 103775, 58759, -1350, -25106, -34508, 13171, 37976, 32134, 26522, 21077, 27907, 23660, 26314, 57445, 20854, 25247, 52138, 34774, -30979, -28722, -11779, 3988, -13781, -1600, -27318, -52850, -46478, -26439, 2878, 14289, 12385, 18024, 15103, 21459, 10244, 10520, -3496, 72145, 93202, 34928, 7801, 40693, 80528, 108187, 63414, 47151, 72901, 80183, 22892, -54861, -91417, -75920, -23211, 29104, 22494, -44167, -139418, -71337, 3390, 17182, 30752, 54680, 87339, 66642, 58271, 67785, 94910, 143932, 141245, 94434, 83442, 146205, 122845]
8757A22845j14908m1759l3805l2528M274L1882K1696j9089j7085L7604K2761k5874
8745d3986Q513O0062L2261O93n2505P872N1396k0722j9952n169J1187l4590L198
8732a742K9033k0046J5663K1081N515l0122R497J5999n4206J2409l6432m5246
8720g8597N5757L4134m3710l2116N044K5743J01005K0258k4996k7727O923l3051
8708H667O706R991l9051M7232L1481K140j5933K333K1374N4512J7540r9381l0334
8695A7277k596n182J0180P036m9196p477L9992r67k2568j5531M3466j5537K590
8682A487M6610p990L1478j2382k9806q747l857J9230n50J7860K7849k0833l9429
8669B0920K9525l5664k5383k1830q788J6758j0686L1938R034O656L9136K1275
$$ y = [122845, 7937, -33822, -67627, -100155, -95881, -63999, -42303, -61392, -78477, -40873, -18112, -43986, -35473, 24589, 56850, 57543, 5038, 12910, 64306, 43584, 23632, 18463, 29650, -4940, -1742, 27291, 7245, 22908, 43989, 49504, 19382, 28879, 44878, -9328, 3081, -33351, -78597, -22840, 11294, -32416, -64532, -59488, -33745, 67260, 87518, 62522, 34795, 41718, 8667, 15373, 25364, -13687, 33545, 65026, 67166, 51233, 53566, 74940, 129452, 146992, 47611, 17277, 14681, 9499, 19679, 26715, -22481, -29958, 10034, 9067, -13501, -29032, 14434, -1103, 1487, 48097, 40107, 71585, 59203, 29397, 20650, 16793, 36023, 35473, 53333, 81182, 60349, 20920, 50445, 14781, -10602, -32432, -41220, -24462, -35148, -3210, 5824, 12480, 51616, 72891]
8657G2891m1307k4587m1188l3544K6998M4722J6476J3203q413K495j550k5154
8645A042j3538J4165J7409R507K8147K0890K1101O324m3143J104l0676l2438L8588
8632C8482p352J4287N0755q704o151K9708j8129J8465L4081m9544l0784J1861
8620G6975L9070L269k8195l5422p1080J0359o630l25N814o46J3528j0732p804
8607a1819k4907P220K6684L7763K6890o149k5426k7511K1871l050l50O8544L0543
8594A20303M713l0555l494M2871O642k7951k4435j1510j043J4145K3744k6592
8582H6838m3386k2007k6565k6535J8715K0752L9947J9426k7675n5324n2166j5933
8570h3913l3768J9116O7169M6831k2742n10k0355j6501J1137K6404K1379L0076
$$ y = [72891, 31584, 6997, -34191, -67735, -40737, 3985, 20461, 33664, 25251, 27746, 26196, 1042, -12496, 1669, 19078, 28585, 56732, 77622, 98723, 105047, 61904, 63008, 32332, -106, 38482, 31130, 45417, 96172, 87468, 81317, 111025, 92896, 111361, 145442, 95898, 65114, 76975, 116045, 119314, 91119, 55697, -15383, -5024, -11654, -11979, -6165, -6811, 6717, -4015, -11819, -36726, -29506, -2822, 34941, 61831, 55682, 30256, 2745, 24616, 21566, 21216, 89760, 120303, 125016, 94461, 90967, 133838, 140480, 112529, 88094, 76584, 75541, 89686, 113430, 86838, 43452, 21445, -5120, -31655, -12940, 7812, 47759, 67185, 39510, -15814, -67980, -83913, -117681, -98565, -31396, 15435, -7307, -7817, -28172, -44673, -33536, -7132, 14247, 44323]
8558D4323J1670l8522R965m763K5944L6222J2796k1304p104J1016m8873o0857
8546b9487J2487M527L8583J4489R692k3782J5093m7842k4789L2994J6279K6946
8534D5190Q705P568N773k2413J9831l2463n2316l2039M0610p610k8920N6931O620
8521A5467J8268l3916o1887L7951L1135J367J4719J8748p2043j3922R4196M9883
8509I9966N655k4538k2685q3525j6277J7044K7466R830J2459P0388R283j12943
8497g877L301K9799L063m5502K8982L6100m556l496L4289J47l2090n652R403K509
8483D8420l1089J8289r272m0348n5366K3062P8766L8295K5378l5514N0900k0766
8471I0755l3481J0953M215l1034o737J6498m9103l8693K4821k57j7221k3922r973
$$ y = [44323, 55993, 17471, 27436, 22673, 48617, 84839, 97635, 76331, 69227, 80243, 31370, -29487, -17000, -12473, 26110, 40599, 50291, 26509, 41602, -6240, -31029, 1965, 18244, 45190, 53895, 61463, 67236, 44823, 64654, 32191, -20125, -52164, -11554, -19164, -48084, 8847, 15467, 33735, -181, -62068, -24117, 7018, 8385, 23104, 41852, -30191, -44113, 50083, 99966, 105621, 81083, 58398, -25127, -41404, -24360, 3106, 12936, 25395, 95783, 105066, -7877, -4576, 25223, 28286, -17216, 11766, 47866, 43310, 39814, 74103, 74250, 42160, 36508, 45911, 48420, 17331, 35620, 26348, -14000, -69366, -46304, 32462, 70757, 96135, 60621, 111521, 90755, 57274, 68227, 72442, 41408, 34671, 51169, 2066, -36627, -11806, -12063, -29284, -53206, -63179]
8458f3179m332k5269J9309K9283J1899M699k0206Q848j2920K0312Q6N153n360
8445c1677L5136K167m171L81R627K1642l3896j6918j8281j5296n467N7662M0872
8432D1781J7142l2260n6838m7426P7137M3236l59n8819J3456j4675l2269m2007
8420i1901J1801N4999K4942m8118k5425K5047j2913l0073K8185L8598N1728m5994
8408a9124p204J6149L2448K8875N4184j4731p1651p065j3008l0596Q8898Q8414
8396A45589N3924N3319M8926N6383P609l0220q652l2039j6906l2403p051j8153
8384B20326p8768j8436l9787Q315O819M0031j1627m0487M1995K3257j2327q803
8372A30508o7351k0408N5007K5126m9229j5504L0297O470K4797L7284j8612O5985
$$ y = [-63179, -67511, -92780, -73471, -44188, -32289, -27590, -47796, -38948, -51868, -31556, -31470, -26317, -31677, 3459, 5626, 1455, 1836, 11463, 33105, -791, -17709, -35990, -51286, -56753, 909, 41781, 58923, 26663, -30175, -77601, -464, 42772, 42413, -16406, -2950, -17625, -49894, -91901, -80100, -25101, -159, -48277, -73702, -48655, -61568, -91641, -63456, -24858, 26870, -19124, -26328, -10179, 22269, 51144, 105328, 90597, 18946, 11881, -1127, -31723, 57175, 145589, 199513, 252832, 301758, 358141, 365750, 335530, 326878, 294839, 277933, 245530, 238479, 220326, 141558, 123122, 83335, 91650, 98469, 138500, 126873, 86386, 128381, 151638, 139311, 130508, 63157, 42749, 97756, 122882, 73653, 58149, 88446, 94916, 119713, 156997, 138385, 204370]
8360B04370O1242J6564j2M2930L5327L4445n6982j20326p0921n9259n9850j002
8348B6526O5031N4004j2247k9260j0302j0990m0584k2859l5570j4724K6127L7779
8336C2931M0977k8534Q42J5293k5610l2418N9178J7189k9849k8006K6817o7899
8324a9089J1598J1789k7019N81k6393j927O588M2337J7033P46n3311J0698J8609
8311g760m1664k4321n344p019L3108P1709K8435j5966n4221J7587k8667k7359
8299f1482N3070L5267J7872K891j8943l5997N3080J7855j0210k706k0677k4452
8287E568R926J3572j2914k1367k5353k200m4328J3214J6744J1395j2861M5077
8275c527l640L4400k5939n0736l7790N825K3938J2876n3714o262N4478N7610k6702
$$ y = [204370, 265612, 282176, 282164, 325094, 360421, 394866, 337884, 217558, 146637, 87378, 27528, 26526, 91557, 145561, 133314, 104054, 93752, 82762, 42178, 19319, -16251, -30975, -4848, 32931, 73908, 45374, 46216, 61509, 35899, 3481, 62659, 79848, 49999, 21993, 48810, -19089, -7491, 4298, -22721, -22140, -48533, -50460, -43872, -1535, 15498, 16244, -37067, -26369, -7760, -49424, -73745, -79089, -86108, -53000, 18709, 47144, 31178, -23043, -5456, -34123, -61482, -8412, 26855, 44727, 47618, 28675, -7322, 45758, 63613, 53403, 50697, 30020, 5568, 15494, 29066, 16152, -5215, -30568, -32768, -77096, -63882, -47138, -35743, -48604, -3527, -7167, 27233, 1294, -49442, -87232, -81407, -57469, -44593, -98307, -104569, -50091, 7519, -19183]
8262a9183J016N589j4182n377o489J5782K7612j8324J6428M1523j0959l5634r523
8249a1721M5697k2768Q2288J6475k2804n0723p1630l6410k5268J9666q394m509
8237i0101M8618j8800J1986j792L5762k3059N3753K2072n1286m4257N1100P3702
8225F7698N359k34J4370o8927n3441J6478L2184K9595k9994k4066N621j4256j998
8212b1611j2479j7013K5667j1441K2450K5897K825j0310J1626O7608J1763k2894
8200G2088j7362k8630n4631J3059J7657m5110m0973j163j033M977K4905K4296
8188c1920L8024P4624j2003o0752k5045k3026L2582K8514p899J7595k8049l1523
8176b8878K822K926K3975J6696J406k4276m2913J2543P2454N4556J3232q418n0426
$$ y = [-19183, -18167, -12578, -26760, -32137, -38626, -22844, 4768, -13556, 2872, 44395, 33436, -2198, -11721, 33976, 11208, 93496, 109971, 87167, 36444, -35186, -71596, -96864, -77198, -85592, -90101, -41483, -60283, -48297, -50089, -14327, -37386, 16367, 38439, -12847, -57104, -6004, 67698, 73057, 72823, 87193, 18266, -35175, -18697, 13487, 43082, 13088, -10978, -5357, -19613, -21611, -34090, -51103, -25436, -36877, -14427, 11470, 14295, 3985, 15611, 83219, 94982, 72088, 54726, 26096, -28535, -15476, 2181, -42929, -83902, -85065, -86098, -81121, -56216, -31920, 6104, 80728, 68725, 7973, -17072, -40098, -7516, 20998, 13099, 30694, 2645, -28878, -26056, -23130, 845, 17541, 18947, -5329, -48242, -35699, 36755, 91311, 104543, 96125, 45699]
8163D5699o284K7617k4306j2277J678j7892K2987N2788o2562q6476k8375M4263
8151d3140N0192r027k1913l8688o776L3363K6006m5079k6809p81K0047L304J1118
8138d8183L1497n8892l088k5837m6246P3195Q6071J5044l4365n2082L0706Q9l4862
8125f6953P864Q849J1104O6525L293m8408r750M3159k2545j4835K2183K2666j6491
8112F661j6652o89r013M5769K9087j4556j1718j3069r7197K7450N3911l0823L9618
8099H779O811k605o229j5535l4610L7634L3894m9179Q773P0432n2721J2887K6976
8086D5307J8675n5139n5922m344O9878M1407l4633r122P1904Q143O208K806m3932
8073F1236j6082J7585L1415p941J4288j777O6189Q0569N4441J04579J16871K69959
$$ y = [45699, 39415, 67032, 42726, 30449, 32127, 14235, 37222, 90010, 27448, -59028, -87403, -43140, 7052, -1975, -23888, -62576, -69352, -35989, -9983, -55062, -81871, -82652, -62605, -59301, -48183, -16686, -75578, -78666, -104503, -150749, -77554, 8517, 23561, -10804, -62886, -32180, -32091, -66953, -59089, -50240, -39136, 27389, 30682, -17726, -27476, 15683, -6862, -21697, 486, 23152, 6661, -9991, -10680, -19693, 26076, 55163, 40607, 28889, 15820, -81377, -53927, -16, -30839, 8779, 15590, 12985, 6756, -8779, -43389, -5755, 28139, -21040, -12267, 58165, 5444, 18331, 45307, 63982, 8843, -47079, -51423, 18455, 59862, 25229, 16107, 88011, 96154, 102362, 105168, 61236, 45154, 62739, 94154, 86213, 100501, 98724, 164913, 245482, 299923, 404502, 521373, 791332]
8061G91332L53552K12525J15867j65096l09639l07328k30293j43795k2623k9051
8051B65451k5310l8945m7288l6198L2152N034M9456m933j0164m490j4772k9594
8039A40399j9254k7412j1483L5060J9434J3971K0881N5535O5497N7735j7282n3680
8027B79401N8575J0626O5968J81045J61501K21415L04335M72612O12699P23602
8017C091779Q34843P08860K74677j94005p11393j084881r42826n92568k78814
8008A105672k10347j21116k5745o4236l5685m5081o6987J8952K4654P83m1773
7997E39091l1764q8395n7111K375K043o660m0357J8866K0657o6380r1799n4656
7985A45910l4233L1299K1527J7464j7719p8128j2371J9406L262J3301k186k6673
$$ y = [791332, 1144884, 1357409, 1473276, 1308180, 998541, 691213, 460920, 317125, 294502, 265451, 240141, 201196, 153908, 117710, 149862, 154896, 204352, 199419, 189255, 184765, 169993, 140399, 121145, 93733, 82250, 117310, 136744, 150715, 171596, 227131, 292628, 350363, 333081, 279401, 337976, 348602, 414570, 595615, 757116, 978531, 1282866, 1755478, 2368177, 3091779, 3926622, 4635482, 4910159, 4716154, 4004761, 2919880, 1977054, 1384486, 1105672, 895325, 774209, 748464, 684228, 648543, 603462, 536475, 555427, 580081, 580864, 539091, 507327, 418932, 361821, 364196, 366239, 359579, 319222, 338088, 358745, 292365, 200566, 145910, 111677, 142976, 164503, 181967, 164248, 86120, 73749, 93155, 96417, 109718, 107532, 80859]
7973H0859k297K5880N832L0587j2372l3696o4849j6018L9009j8481N732L2137
7961G2323J1086l000L8391j6184m2675m2881J5647l6969m8664L7705N6062K7717
7949F8558j6909R307J4188M136j5562p0442j5665O34l950O344K7158r336m174
7936e713j0584l267n122L792o8043m9796J9282N3951N0658M5332K6535o7131k6585
7923c6691k481J9389K046Q219J3501J5001Q3379K9494m2784m7153J2658J7987
7911G2565k0611J2050k1943k1607K7773L899r789o0152q4984n913P0592L7833
7899b87K6854j315P372k0416l8843n3565J8974M9212O1011l1413m5172j6814l794
7886d8196J6798j8258L4643K3569q143J7203k3824j00249l824P0814O2846l1479
$$ y = [80859, 78562, 104442, 110274, 140861, 128489, 94793, 29944, 13926, 52935, 34454, 40186, 72323, 83409, 80409, 118800, 102616, 59941, 17060, 32707, -4262, -52926, -15221, 40841, 68558, 51649, 60956, 75144, 79280, 63718, -6724, -22389, -21755, -25705, -19361, 7797, -1539, -5713, -16297, -19564, -24686, -20894, -88937, -138733, -119451, -65500, -14842, 30490, 57025, -10106, -36691, -39172, -19783, -17737, -9518, 3983, 18984, 102363, 131857, 89073, 41920, 54578, 72565, 51954, 64004, 42061, 20454, 48227, 52126, 42337, -17815, -102799, -108712, -38120, -287, 26567, 25252, 32624, 12208, -26635, -80200, -61226, -12014, 48997, 17584, -27588, -44402, -48196, -31398, -49656, -15013, 8556, 413, 17616, -6208, -106457, -110281, -39467, 23379, -8100]
7874h100j3666k4394K1106M3195p426l323o3681k5781K5774K2538M5290o165m0184
7861c4817m3118n811K5730M9534q886k3159N2254O2423L031L9491q3293o7975
7849c4596k9129K3710M3865J2175j294J6992J3545l2093j6969K1823L9776l5887
7837B1918n4241l492r31L1284K1731O4538k8981k7988Q050M848o6391p794Q119
7824b9330Q396j1559J3944k3086n671N4766o474L58J6987K4634j7459m1596J4029
7811b061m6975j0648O8792K9196j1138k6738n4686L6482M3752l4062j2673j3489
7799c4248K7030J8319q233m1222M030J6977N591K8186M7293j449j1805q373k8635
7786A3461q3659J5183O8143P497l4215m5402L1107l5847j6786K362L4096L4597
$$ y = [-8100, -21766, -46160, -25054, 18141, 10715, 7392, -56289, -82070, -56296, -33758, 11532, 5367, -34817, -77935, -83746, -58016, -8482, -17368, -40527, 11727, 74150, 77181, 116672, 33379, -34596, -63725, -40015, 3850, 16025, 14731, 31723, 45268, 13175, -3794, 18029, 57805, 21918, -32323, -35815, -36746, -5462, 16269, 80807, 51826, 23838, 31888, 36736, -29655, -37449, -29330, -20934, -32493, -18549, -41635, -47306, 7460, 986, 1344, 18331, 42965, 25506, -16090, -2061, -49036, -59684, 9108, 38304, 27166, 428, -54258, -17776, 25976, -8086, -20759, -34248, -7218, 11101, 2868, -38354, -34324, -17347, -11756, 16430, 63723, 62274, 50469, 42096, 13461, -70198, -55015, 13128, 20625, -13590, -58992, -27885, -63732, -80518, -78156, -44060, -9463]
7774i463m3738n251J9691P597K5001r536J3488j0173j6981N5223j2319o723N3574
7761F0390J6792l0957j8215J310n3351j2765L5358J7573k5392o2959J9528R0004
7749C7316L5960n609J4723J783q899r1652q7796l1478J0089K3999M7848o498K9208
7736c1006L2944K8857r612l3837n8394l3076J0859J7144P8088L4514J3211n3481
7724c789o1962m731N1641M5977j9402m7468N3481j6393l7998K5932K8097j3751
7712c66L8788N4469m1829o9112k8919L1877Q203K3774k3365R216j9529n407j0233
7699c2433n7690L9323R501o5100O036M4677N4471O962k8824K0133K900j7094r275
7686b6413K9026l4606o105j4197k0911J9966O0821J2646J5151k3011p6490j0288
$$ y = [-9463, -53201, -58452, -38761, -31164, -6163, -15699, -2211, -12384, -29365, 25858, 13539, 6816, 60390, 77182, 46225, 28010, 29320, -24031, -36796, -1438, 16135, -9257, -72216, -52688, 37316, 73276, 67667, 82390, 84173, 75274, -16378, -104174, -135652, -125563, -101564, -53716, -60214, -31006, 1938, 30795, 21183, -12654, -71048, -104124, -93265, -76121, 1967, 36481, 49692, -3789, -65751, -70482, -18841, 27136, 7734, -39734, 13747, -2646, -40644, -14712, 13385, -366, 38422, 92891, 51062, -18050, -46969, -15092, -6889, 16885, -6480, 2736, -16793, -22200, -32433, -90123, -50800, -41299, -106399, -100363, -55686, -1215, 5747, -23077, -2944, -44, -17138, -26413, 2613, -31993, -38098, -52295, -73206, -53240, 7581, 20227, 35378, 12367, -64123, -74411]
7674g4411M7504L5661k3290M2219K1151m7795j4038k4325k5794M1536L8937l6324
7662a8969L5642N1484j9399k1482m8779J6711j5168k9839j2436L4784J0708M2940
7650B6197J5078l1050k4201K2307J188o2643k7725O9888L0270j1867l9275l0271
7638f2104N3069K8644m183l1352m5853l815k2506o573R0495M1185j8638k1557
7626c188L884L0696L0269L0073j3832J487J908J7421l3829n0098p0929n7574L4167
7613g9545N9834K2597k9409j0197J6821q2326m217L4160M0629M3290l837J4868
7601B2668j8045k689l2342j5743l4347l9652l4144j3976L1370j649R5094N0610
7589G155j0319k3319j0360j9576N506m9791J0903J4218P7922K3401K0239l2759
$$ y = [-74411, -26907, 8754, -14536, 27683, 48834, 1039, -12999, -37324, -63118, -21582, 17355, -18969, 16673, 68157, 48758, 27276, -21503, -4792, -19960, -49799, -62235, -27451, -16743, 26197, 41275, 10225, -13976, 8331, 9519, -53124, -80849, -10961, 19309, 7442, -31833, -62104, -9035, 19609, 15426, -15926, -61779, -65594, -88100, -94673, -4178, 37007, 18369, -3188, 696, 31392, 61661, 91734, 77902, 79389, 81297, 98718, 64889, 14791, -56138, -113712, -79545, -19711, 2886, -26523, -36720, -19899, -102225, -106442, -72282, -31653, 11637, 7800, 22668, 4623, 1934, -30408, -46151, -80498, -120150, -154294, -168270, -136900, -138549, -43455, 7155, -3164, -26483, -36843, -56419, -50913, -100704, -89801, -75583, 2339, 25740, 45979, 13220]
7577A3220n8057M805L7817K8785k9878J6016R5325P243m221j7678o6701l4748
7565h072J4239J1295M2354j0669J5394j9714m0951l7412J3877J4104m4783K1636
7553b8702L0246m504k2566J2822j6723j2239J1091J1748M9300L9984M657J4628
7541H9742j4992K8617j7357l9516L1839J5108J804k5899n0976J0328o292k7404
7529d998j0996Q694K2944K190o1720n6043K3080K0731j9534n3381J2730M0597
7517g5706M0997L9333K9062k6458l1866k0639J1212j2235O975J6368N734o3312
7505h0535K0491K8157j4839J5566J7217J741k8016O268L4341J6575p922n653p1776
7492f8385N958J7524L0109k1608J4728N2541j2367K1118l059K1405m107o6403
$$ y = [13220, -44837, -40032, -2215, 26570, -3308, 12708, 108033, 115276, 111055, 93377, 26676, -8072, 6167, 17462, 59816, 49147, 64541, 44827, 3876, -33536, -19659, -5555, -50338, -28702, 1544, -2960, -25526, -12704, -29427, -41666, -30575, -18827, 30473, 70457, 75114, 89742, 74750, 103367, 86010, 46494, 78333, 93441, 95245, 69346, 18370, 28698, 22406, -4998, -15994, -7300, 15644, 17834, -43886, -99929, -76849, -56118, -75652, -129033, -116303, -75706, -34709, 4624, 33686, 7228, -24638, -45277, -34065, -46300, -39325, -22957, -17223, -80535, -60044, -31887, -46726, -31160, -13943, -12202, -40218, -33950, 391, 16966, 9044, 3391, -68385, -62427, -44903, -14794, -36402, -21674, 30867, 18500, 39618, 36559, 57964, 53857, -12546]
7480a2546m5429N817K2595j7031J8755R937j4392K1012N9343k3578o5351k543
7468d3411L7628K2173j5276P199q05k4347m9163k0763M5682N7801k441n390m7577
7455c8690J3807L5365l381K0285j8145j3414J0105K6959L325j8730m6331R491
7443a9354O3653j8082J7807p233o1194m9914k6760J2108M8740L6804m7268K6178
7431b4515N7808m293j9182m0127K1962L2921M145J7383K4742j1200j6817o7695
7419b4868l5765J2087k1925j2552J8712J4936O1866j8303q891j2506K6422L2745
7407C1958O381k9872k9167k4242Q8772J6296n6198P383O858J0766j2096J0255
7395B7094J5258M3596L7796m2823J9534k9717o2935n3910o16K1211p070R80J2327
$$ y = [-12546, -57975, -52158, -29563, -46594, -27839, -17902, -32294, -11282, 48061, 24483, -40868, -43411, -5783, 16390, 1114, 8313, 7508, -16839, -66002, -86765, -41083, 16718, 14277, 8887, -38690, -24883, 10482, 7101, 27386, 9241, -4173, 5932, 32891, 36216, 17486, -28845, -19354, 44299, 26217, 44024, 36791, -24403, -74317, -101077, -88969, -40229, -3425, -50693, -24515, 33293, 29000, 9818, -30309, -8347, 24574, 28719, 46102, 70844, 59644, 42827, -24868, -60633, -48546, -70471, -83023, -64311, -49375, 12491, -5812, -14703, -27209, -787, 31958, 38339, 8467, -20700, -44942, 43830, 60126, 3928, 11311, 18169, 28935, 16839, 27094, 42352, 85948, 123744, 80921, 100455, 70738, 7803, -46107, -46723, -25512, -32582, -31602, -19275]
7382a9275K9844k7686j9323K1756J2374K6940r044l5167m2448k9601K2892M7644
7370b1094o533j196n168k193K8600K9467j4413L2910j9941k6654k4415k6408K1924
7357c5114N234J7449N2015l6689k9008N933j8720n9585M344M4382K6129j0080
7345c3710O525J7694J9550j7965J1227l4077k8228J7665J2841L1574M4844j8130
7333B9810p414K4701p268m9987p413k676j0350Q364M704k6787n9023J2355l614
7320i4598k8240L8555q891M8450K7970k2928J8122L6457m2167J6762J5015J2238
7308A6745o7256j6141K5577l3045N8428J4361K2213j2709L945M4476l696l6159
7296A6739j9615K2777m372m6397J2981J2927J5087m2387j2326N3557J6346K133
$$ y = [-19275, 10569, -17117, -36440, -14684, -2310, 24630, 15586, -19581, -62029, -91630, -68738, -21094, -27627, -28823, -33991, -36184, -7584, 21883, 7470, 40380, 20439, -6215, -30630, -57038, -35114, -29880, -12431, 39584, 2895, -26113, -20180, -38900, -98485, -94141, -49759, -23630, -33710, -27185, -9491, 10059, -7906, 3321, -30756, -58984, -41319, -28478, 3096, 47940, 29810, 22396, 47097, 39829, -10158, -17571, -20247, -30597, -22233, -17529, -44316, -103339, -90984, -94598, -122838, -84283, -93174, -44724, -16754, -39682, -21560, 14897, -27270, -10508, 4507, 16745, -50511, -66652, -41075, -74120, -15692, -1331, 20882, 8173, 12118, 56594, 52898, 16739, -2876, 19901, 15529, -30868, -17887, -4960, 10127, -32260, -44586, 8971, 25317, 27450]
7284B7450J3261k2281k3518k9966n689M7349P1781J5989l9686j10578l3549P3067
7272a6370O9449l5418R67p2649p7071n6857N8854R6465K213Q874R153j0530n4226
7259g7146k4172J0692p553k7362j5514m570n7756K0985O5531J8896K3887M9209
7247b4873P19j3297l0387k6131N9445N3068m961l1357k131L02N989L5017M3655
7234F5058J1764p3014m1938P7884l126o607J5331j7919r460k9630K9102J1775
7222B9220L3808o8601m0532j3303o7622K3503O0946M976L599k8562P889M6675
7210h004J7917k3410j5194r079K3097n1394L5705L5465o9873k5396K7491J9203
7198d3472k300P539J00308K1755l2934n8440R533K602n609r145J1556l67j7261
$$ y = [27450, 40711, 18430, -5088, -35054, -40743, 6606, 78387, 94376, 54690, -55888, -89437, -16370, 53079, 17661, 18628, -54021, -131092, -187949, -129095, -32630, -30417, -21543, -12390, -22920, -77146, -101318, -90626, -98179, -125541, -141055, -145625, -203381, -182396, -116865, -97969, -74082, -24873, -24154, -37451, -67838, -93969, -34524, 18544, 13583, -17774, -19905, -19603, -13614, 21403, 65058, 76822, 3808, -38130, 39754, 36628, 30021, 45352, 27433, 17973, -11657, 17445, 29220, 63028, -5573, -46105, -59408, -127030, -103527, -42581, -37605, -34006, -62568, -54679, -8004, 9913, -13497, -28691, -37770, -14673, -66067, -30362, 5103, -64770, -90166, -62675, -43472, -45772, -38233, 62075, 83830, 50896, -7544, 1989, 4591, -1018, -10163, 1393, 1026, -16235]
7185a6235j298l445l227O0173K4111r214n0699m0224j417N7657N034m8817m6886
7172g4487M9021J1591J3702l6682k6376j308r091l3391M8038j1299q545n972K2261
7159f2538O1488n658M4719L9570l1811j7104k6158l125j0103k1817o6438K429
7147i6546M5595q111K4293m1433n0093N9564M4850k8167l5263O3357L8995j0350
7135F691K3258j4276k9666P646k051r876N0130L8115o8104k5749p528M183J6959
7122a0268l1160K4965K2149R2436j3380p8480k1180L0435k3881L1701o285P972
7110B5024j3642R602j9160r858n982j6888k1369p562k0981M4086l777j3597k3153
7097g7257j7011J881O9901j750n4238o42R1222P804l5416l1550k156L3488l5275
$$ y = [-16235, -17533, -20978, -24205, 35968, 60079, 50865, 166, -40058, -41475, 16182, 21216, -27601, -74487, -25466, -13875, -173, -36855, -63231, -64539, -73630, -107021, -58983, -70282, -78827, -84799, -62538, -1050, -6708, 38011, 77581, 45770, 28666, 2508, -617, -10720, -32537, -98975, -96546, -50951, -59062, -34769, -76202, -126295, -66731, -21881, -50048, -85311, -21954, 17041, 6691, 29949, 15673, -13993, -6347, -8398, -18274, 31856, 69971, 1867, -23882, -31410, -27227, -10268, -41428, -16463, 5686, 98122, 84742, 6262, -14918, 15517, -8364, 23337, 17052, 25024, 11382, 20984, 1824, -8034, -14016, -30904, -52273, -59835, -80816, -36730, -40507, -54104, -77257, -94268, -92387, -22486, -24236, -78474, -79116, 12106, 19910, -15506, -47056, -49212, -15724, -50999]
7084e0999k0779M856N3672N556k5455j4403J7115M1841k1797M580L6983m308p442
7071A9420l1807M0630N737R632L0916K0326q4108o6937J7792n511M7925L1666
7059C5681o4124n4002q180J2429P5304K8991j6169l5547M45m1194l4234L4290
7047f6310j4556O439J913Q930k6434k6916Q15M439N6034K2818K1884j1542n0328
7034g2814k6473O828M8263R972K5717j803l51k1239J1361J3295l1141K8518o481
7021a6348m400j3049J9734M5843l0361p874M2294L2257j29k2439n9320K0979K6796
7008C3983j5794n2675L9011L2516j4141p762J6510j446K7207N684n1539m1774
6996c0220k4053L73J7137n4279o103Q6771J180l0348l2053k679O9512N4914k8572
$$ y = [-50999, -71778, -66922, -13250, -7694, -33149, -47552, -30437, 11404, -10393, -5813, 31170, 26862, 19420, -12387, 28243, 33980, 43612, 74528, 94854, 10746, -56191, -38399, -43910, 4015, 35681, -28443, -82445, -90625, -78196, -2892, 26099, 9930, -25617, -25172, -66366, -100600, -66310, -80866, -74427, -72514, -63584, -90018, -116934, -116119, -111680, -55646, -32828, -10944, -22486, -72814, -99287, -92459, -44196, -34224, -8507, -10310, -10661, -31900, -20539, -7244, -38385, -9867, -16348, -20748, -33797, -14063, 31780, 1419, -6455, 35839, 68096, 67967, 45528, -13792, 7187, 33983, 18189, -34486, 4525, 37041, 22900, 15138, 31648, 30202, 57409, 63093, 11554, -30220, -54273, -53900, -36763, -91042, -97145, -10374, -9194, -39542, -71595, -74274, -4762, 50152, 21580]
6983B1580p7242m7372K2634R4169N1155L3447k1523j2874K460l5385k4211k0248
6971a3410n9893k2653P1276M1857M591k4050n5765m4943K5995q917j7296K5571
$$ y = [21580, -55662, -103034, -80400, 13769, 64924, 98371, 76848, 63974, 66434, 31049, 6838, -13410, -73303, -95956, -24680, 17177, 21768, -2282, -58047, -102990, -76995, -85912, -103208, -77637]
$$ [...]
##END NTUPLES=NMR SPECTRUM
##END=
