##TITLE=Analysis number 319409
Compound Code cc 47409
Book Reference 486/6
Project Code adrs
Chemist Name simons
##JCAMPDX= 6.0         $$ Bruker NMR JCAMP-DX V2.0
##DATA TYPE= NMR SPECTRUM
##DATA CLASS= NTUPLES
##ORIGIN= Bruker BioSpin GmbH
##OWNER= nmr
$$ XWIN-NMR		Version 3.5
$$ Mon May 15 08:25:16 2006 GMT Daylight Time (UT+1h)  MAYBRIDGE\nmr@NMR_250MHZ
##.OBSERVE FREQUENCY= 250.131544655141
##.OBSERVE NUCLEUS= ^1H
##.ACQUISITION MODE= SIMULTANEOUS (DQD)
##.ACQUISITION SCHEME= undefined
##.AVERAGES= 16
##.DIGITISER RES= 18
##SPECTROMETER/DATA SYSTEM= dpx250
##.PULSE SEQUENCE= zg30
##.SOLVENT NAME= CDCl3
##.SHIFT REFERENCE= (INTERNAL, CDCl3, 0, 16.4561)
##AUDIT TRAIL= $$ (NUMBER, WHEN, WHO, WHERE, WHAT)
$$ ##TITLE= Audit trail, XWIN-NMR		Version 3.5
$$ ##JCAMPDX= 5.01
$$ ##ORIGIN= Bruker BioSpin GmbH
$$ ##OWNER= nmr
$$ C:\u/data/dgb/nmr/ADRS/4240/pdata/1/auditp.txt
$$ ##AUDIT TRAIL=  $$ (NUMBER, WHEN, WHO, WHERE, WHAT)
(   1,<2006-05-15 08:24:51.39 +100>,<MAYBRIDGE\nmr>,<NMR_250MHZ>,
      <created by zg, POWCHK disabled, PULCHK disabled
       configuration hash MD5:
       84 BC 41 DB A1 6E 1D 46 DA 25 12 A5 C1 ED C5 3A
       data hash MD5: 64K
       78 C4 42 E7 8E EB 12 51 FD EC 35 EE 21 94 E5 9E>)
(   2,<2006-05-15 08:25:06.74 +100>,<MAYBRIDGE\nmr>,<NMR_250MHZ>,
      <Start of raw data processing
       ef LB = 0.3 FT_mod = 6 PKNL = 1 SI = 32K 
       data hash MD5: 32K
       31 27 01 19 EE 59 89 89 E4 6B 21 98 08 87 53 EA>)
(   3,<2006-05-15 08:25:08.39 +100>,<MAYBRIDGE\nmr>,<NMR_250MHZ>,
      <apk 
       data hash MD5: 32K
       E0 7B B2 5D 5A 1E C8 F6 41 1D 18 D4 67 4D 82 E4>)
(   4,<2006-05-15 08:25:09.09 +100>,<MAYBRIDGE\nmr>,<NMR_250MHZ>,
      <abs ABSG = 5 
       data hash MD5: 32K
       A2 D2 64 BE F3 21 33 96 97 ED B7 08 EC 1F 4D 3D>)
$$ ##END=
$$ 
$$ hash MD5
$$ B3 01 0E FE DD C0 8E 4F A8 25 D7 D1 8E 82 84 1E
##$RELAX= 
##$RELAX= 
##$RELAX= 
##$RELAX= 
##$RELAX= 
##$RELAX= 
##$RELAX= 
$$ Bruker specific parameters
$$ --------------------------
##$DU= <C:\u>
##$EXPNO= 4240
##$NAME= <ADRS>
##$PROCNO= 1
##$TYPE= <nmr>
##$USER= <dgb>
##$AMP= (0..31)
100 100 100 100 100 100 100 100 100 100 100 100 100 100 100 100 100 100 
100 100 100 100 100 100 100 100 100 100 100 100 100 100 
##$AQSEQ= 0
##$AQ_mod= 3
##$AUNM= <au_zg>
##$AUTOPOS= <1 >
##$BF1= 250.13
##$BF2= 250.13
##$BF3= 250.13
##$BF4= 250.13
##$BF5= 500.13
##$BF6= 500.13
##$BF7= 500.13
##$BF8= 500.13
##$BYTORDA= 1
##$CFDGTYP= 0
##$CFRGTYP= 5
##$CHEMSTR= <none>
##$CNST= (0..31)
1 1 145 1 1 1 1 1 1 1 1 1 1 1 1 1 1 1 1 1 1 1 1 1 1 1 1 1 1 1 1 1 
##$CPDPRG= <>
##$CPDPRG1= <>
##$CPDPRG2= <>
##$CPDPRG3= <>
##$CPDPRG4= <mlev>
##$CPDPRG5= <mlev>
##$CPDPRG6= <mlev>
##$CPDPRG7= <mlev>
##$CPDPRG8= <mlev>
##$CPDPRGB= <>
##$CPDPRGT= <>
##$D= (0..31)
0 1 0 0 0 0 0 0 0 0.06 0 0 0 0 0 0 0.0002 0 0 0 0 0 0 0 0 0 0 0 0 0 0 
0 
##$DATE= 1147677890
##$DBL= (0..7)
120 120 120 120 120 120 120 120 
##$DBP= (0..7)
150 150 150 150 150 150 150 150 
##$DBP07= 0
##$DBPNAM0= <>
##$DBPNAM1= <>
$$ [...]
##$SUBNAM7= <"">
##$SUBNAM8= <"">
##$SUBNAM9= <"">
##$SW= 20.6930455092707
##$SWIBOX= (0..15)
0 0 3 0 0 0 0 0 0 0 0 0 0 0 0 0 
##$SW_h= 5175.983436853
##$TD= 65536
##$TD0= 1
##$TE= 295.16
##$TE2= 300
##$TE3= 300
##$TEG= 300
##$TL= (0..7)
0 120 120 120 120 120 120 120 
##$TP= (0..7)
150 150 150 150 150 150 150 150 
##$TP07= 0
##$TPNAME0= <>
##$TPNAME1= <>
##$TPNAME2= <>
##$TPNAME3= <>
##$TPNAME4= <>
##$TPNAME5= <>
##$TPNAME6= <>
##$TPNAME7= <>
##$TPOAL= (0..7)
0.5 0.5 0.5 0.5 0.5 0.5 0.5 0.5 
##$TPOFFS= (0..7)
0 0 0 0 0 0 0 0 
##$TUNHIN= 0
##$TUNHOUT= 0
##$TUNXOUT= 0
##$USERA1= <user>
##$USERA2= <user>
##$USERA3= <user>
##$USERA4= <user>
##$USERA5= <user>
##$V9= 5
##$VALIST= <valist>
##$VCLIST= <CCCCCCCCCCCCCCC>
##$VD= 0
##$VDLIST= <DDDDDDDDDDDDDDD>
##$VPLIST= <PPPPPPPPPPPPPPP>
##$VTLIST= <TTTTTTTTTTTTTTT>
##$WBST= 1024
##$WBSW= 4
##$XGAIN= (0..3)
0 0 0 0 
##$XL= 0
##$YL= 0
##$YMAX_a= 395751
##$YMIN_a= -633390
##$ZGOPTNS= <>
##$ZL1= 120
##$ZL2= 120
##$ZL3= 120
##$ZL4= 120
##$ABSF1= 16.4561
##$ABSF2= -4.237072
##$ABSG= 5
##$ABSL= 3
##$ALPHA= 0
##$AQORDER= 0
##$ASSFAC= 0
##$ASSFACI= 0
##$ASSFACX= 0
##$ASSWID= 0
##$AUNMP= <proc_1d>
##$AZFE= 0.1
##$AZFW= 0.1
##$BCFW= 0
##$BC_mod= 0
##$BYTORDP= 0
##$COROFFS= 0
##$CY= 12.5
##$DATMOD= 1
##$DC= 0
##$DFILT= <>
##$DTYPP= 0
##$F1P= 14.0000005364418
##$F2P= -0.99999901652339
##$FCOR= 0.5
##$FTSIZE= 32768
##$FT_mod= 6
##$GAMMA= 0
##$GB= 0
##$INTBC= 1
##$INTSCL= 1
##$ISEN= 128
##$LB= 0.3
##$LEV0= 0
##$LPBIN= 0
##$MAXI= 10000
##$MC2= 0
##$MEAN= 0
##$ME_mod= 0
##$MI= 0
##$NCOEF= 0
##$NC_proc= -4
##$NLEV= 6
##$NOISF1= 0
##$NOISF2= 0
##$NSP= 0
##$NTH_PI= 0
##$NZP= 0
##$OFFSET= 16.4561
##$PC= 1
##$PHC0= 168.0332
##$PHC1= 5.138567
##$PH_mod= 1
##$PKNL= yes
##$PPARMOD= 0
##$PSCAL= 4
##$PSIGN= 0
##$REVERSE= no
##$SF= 250.130016481404
##$SI= 32768
##$SIGF1= 0
##$SIGF2= 0
##$SINO= 400
##$SIOLD= 32768
##$SREGLST= <1H.CDCl3>
##$SSB= 0
##$STSI= 32768
##$STSR= 0
##$SW_p= 5175.98343685301
##$SYMM= 0
##$S_DEV= 0
##$TDeff= 65536
##$TDoff= 0
##$TI= <Analysis number 999999
Compound Code 99
Book Reference 9
Project Code 9>
##$TILT= no
##$TM1= 0
##$TM2= 0
##$TOPLEV= 0
##$USERP1= <user>
##$USERP2= <user>
##$USERP3= <user>
##$USERP4= <user>
##$USERP5= <user>
##$WDW= 1
##$XDIM= 32768
##$YMAX_p= 400599797
##$YMIN_p= -255997
$$ End of Bruker specific parameters
$$ ---------------------------------
##NTUPLES= NMR SPECTRUM
##VAR_NAME=  FREQUENCY,     SPECTRUM/REAL,   SPECTRUM/IMAG
##SYMBOL=    X,             R,               I
##VAR_TYPE=  INDEPENDENT,   DEPENDENT,       DEPENDENT
##VAR_FORM=  AFFN,          ASDF,            ASDF
##VAR_DIM=   32768,         32768,           32768
##UNITS=     HZ,            ARBITRARY UNITS, ARBITRARY UNITS
##FACTOR=    0.157963299565203, 1,           1
##FIRST=     4116.16468024674, 0,            0
##LAST=      -1059.81875660627, 0,           0
##MIN=       -1059.81875660627, -255997,     0
##MAX=       4116.16468024674, 400599797,    0
$$ Real data points
##PAGE= N=1
##DATA TABLE= (X++(R..R)), XYDATA
$$ [...]
$$ plain form
15576 -2627 -2642 -31581 -48603 2628 -903 2243 -14369 -6126 -2894 4842 -8512 -2342 30441 27037
15562 27037 2622 -43788 -51889 -22398 -39341 -22578 -35626 32394 76145 71001 56404 78150
15550 78150 64818 59201 1935 -3148 -35516 -95051 -21935 12121 15637 52224 80801 41916
15538 41916 -8619 21952 103182 139840 105019 60056 12452 -5261 -30640 -39954 -45138 -47380
15526 -47380 -40799 -50867 37231 -80 -72858 -136515 -100202 -90019 -12773 -2319 -56776 -98727
15514 -98727 -113714 -73767 -16919 41335 79143 58694 29079 -84559 -52940 -49487 -86985 -59598
15502 -59598 16079 45053 12330 53740 81323 109094 71493 38874 45157 57062 61874 32327
15490 32327 12444 -33305 -46968 -12446 1060 -33763 -62350 -10859 15920 -6345 -12439 -22155
$$ packed form
15576b627j5k8939j7022N1231l531L146j6612Q243L232P736j3354O170L2783l404
15562B7037k4415m6410q101K9491j6943J6763j3048O8020M3751n144j4597K1746
15550G8150j3332n617n7266n083l2368n9535P3116L4056L516L6587K8577l8885
15538D1916n0535L0571Q1230L6658l4821m4963m7604j7713k5379r314n184k242
15526d7380O581j0068Q8098l7311p2778o3657L6313J0183P7246J0454n4457m1951
15514i8727j4987L9947N6848N8254L7808k0449k9615j13638L1619L453l7498K7387
15502e9598P5677K8974l2723M1410K7583K7771l7601l2619O283J1905M812k9547
15490C2327j9883m5749j3663L4522J3506l4823k8587N1491K6779k2265o094r716
$$ plain form
15478 -22155 -15581 43410 49748 17594 -16808 -30768 -28068 -67492 -126282 -117968 -85864 -76727 -47131
15465 -47131 2013 23650 28982 75988 78590 16502 16146 87996 96387 55177 36437 277 12904
15452 12904 -11494 -82917 -55246 -4064 19889 2494 -17469 -61439 -23964 29397 44829 25280
15440 25280 9851 36719 77513 44206 -4829 -25327 -56225 -11999 -45562 -109226 -71088 -34059
15428 -34059 -19236 -16396 -3720 -24914 -31416 -60687 -25642 14486 -28382 -63652 -83361 -99185
15416 -99185 -49168 -626 20432 -37801 -90597 -95195 -67135 -43332 -64236 -41367 743 -5372
15404 -5372 -18587 -6408 -12707 -7145 1717 -17251 28861 16554 -32883 -29798 3986 76302 99019
15391 99019 43419 -692 23011 26813 35765 -3207 -181 -8632 -18605 -12556 -5491 -15623 -13461
$$ packed form
15478b2155O574N8991O338l2154l4402j3960K700l9424n8790Q314L2104R137K9596
15465d7131M9144K1637N332M7006K602o2088l56P1850Q391m1210j8740l6160J2627
15452A2904k4398p1423K7671N1182K3953j7395j9963m3970L7475N3361J5432j9549
15440B5280j5429K6868M0794l3307m9035k0498l0898M4226l3563o3664L8138L7029
15428c4059J4823K840J2676k1194o502k9271L5045M0128m2868l5270j9709j5824
15416i9185N0017M8542K1058n8233n2796m598K8060K3803k0904K2869M2110o115
15404e372j3215J2179o299N562Q862j8968M6112j2307m9437L085L3784P2316K2717
15391I9019n5600m4111K3703L802Q952l8972L026q451r973O049P065j0132K162
$$ plain form
15378 -13461 27663 -294 -98013 -43654 -36247 -81481 -62203 -20407 -28815 -33317 9036 39124
15366 39124 320 -94937 -148779 -114992 -97790 -75266 -32839 -7726 -46122 -7657 -8454 -11043
15354 -11043 27573 8961 -10557 -5556 -22510 -58792 -68138 -66261 -36591 -19339 -41552 -36886
15342 -36886 -76439 -17987 76942 53465 43870 -7982 -37180 -10367 -24801 -14306 26566 56927
15330 56927 -1281 -27908 -59872 -41231 -43603 -93620 -107055 -121528 -128009 -65025 -4253 89715
15318 89715 100749 51198 45685 4330 -3734 -28793 -32683 7338 6889 -5542 30312 -3889 -28513
15305 -28513 -30600 7493 -2988 8344 5161 13886 31364 60951 18665 -4062 -52773 -27308
15293 -27308 4084 8466 -33413 -2090 31090 73730 32535 -26265 -85663 -85635 -57091 -35571
$$ packed form
15378a3461M1124k7957r7719N4359P407m5234J9278M1796q408m502M2353L0088
15366C9124l8804r5257n3842L3787J7202K2524M2427K5113l8396L8465p97k589
15354a1043L8616j8612j9518N001j6954l6282r346J877K9670J7252k2213M666
15342c6886l9553N8452R4929k3477r595n1852k9198K6813j4434J0495M0872L0361
15330E6927n8208k6627l1964J8641k372n0017j3435j4473o481O2984O0772R3968
15318H9715J1034m9551n513m1355q064k5059l890M0021m49j2431L5854l4201k4624
15305b8513k087L8093j0481J1332l183Q725J7478K9587m2286k2727m8711K5465
15293b7308L1392M382m1879L1323L3180M2640m1195n8800n9398K8K8544K1520
$$ plain form
15281 -35571 28855 28609 15318 53272 40820 -10639 227 406 -29248 -25677 -45269 -24217 -33010
15268 -33010 -79159 -96977 -82377 -53483 -53376 -66717 -26433 -22510 30679 73240 78940 -8422
15256 -8422 -32585 -13769 1471 -22878 -53297 -40358 -17083 -63393 -102725 -59696 4994 29891
15244 29891 43318 27161 8895 45545 28718 -7957 -42532 -69048 -78257 -82117 -11671 -3611
15232 -3611 10279 12943 7047 -3008 46750 9307 -64976 -70393 -55990 -101606 -60255 -54536 -45100
15219 -45100 -56663 -44212 -28686 -48737 -18199 -25774 -67005 -80952 -53264 -16275 -42242 -69404
15207 -69404 -45955 -31961 10600 58437 25826 40157 68736 70192 20009 -37193 -58802 -62873
15195 -62873 -89514 -111024 -112367 8293 46961 7655 53799 49386 16258 -14786 -35795 -58727
$$ packed form
15281c5571O4426k46j3291L7954j2452n1459J0866J79k9654L571j9592K1052q793
15268c3010m6149j7818J4600K8894J07j3341M0284L923N3189M2561N700q7362
15256h422k4163J8816J5240k4349l0419J2939K3275m6310l9332M3029O4690K4897
15244B9891J3427j6157j8266L6650j6827l6675l4575k6516r209l860P0446Q060
15232c611J3890K664n896j0055M9758l7443p4283n417J4403m5616M1351N719R436
15219d5100j1563J2451J5526k0051L0538p575m1231j3947K7688L6989k5967k7162
15207f9404K3449J3994M2561M7837l2611J4331K8579J456n0183n7202k1609m071
15195f2873k6641k1510j343J20660L8668l9306M6144m413l3128l1044k1009k2932
$$ plain form
15183 -58727 -85194 -98023 -91253 -95296 -53606 18169 -11061 -44703 -84540 -53027 -55369 -38980
15171 -38980 -25214 -63317 -77336 -80003 -63320 -74197 -85190 -21686 -13040 14246 60258 73680
15159 73680 75919 19979 -13681 -6433 29599 8883 21690 18248 38457 25307 -5711 10526
15147 10526 20864 43898 44893 50770 67266 81203 55875 72319 25032 38440 25785 7759
15135 7759 28000 63374 128288 77415 -847 -24159 -39547 -42668 -26053 28742 43529 26980
15123 26980 -6967 -58039 -78712 -33217 9101 37743 6458 8166 -14608 -72953 -108843 -110001
15111 -110001 -99655 -106971 -114817 -58654 -39658 -55309 -55489 21354 38547 -7411 -3597 656 48777
15098 48777 62977 36355 -9784 -79418 -54632 -64262 -42981 -10080 -35961 -53899 -25897 41131
$$ packed form
15183e8727k6467j2829O770m043M1690P1775k9230l3642l9837L1513k342J6389
15171c8980J3766l8103j4019k667J6683j0877j0993O3504Q646K7286M6012J3422
15159G3680K239n5940l3660P248L6032k0716J2807l442K0209j3150l1018J6237
15147A0526J0338K3034R95N877J6496J3937k5328J6444m7287J3408j2655j8026
15135G759K0241L5374O4914n0873p8262k3312j5388l121J6615N4795J4787j6549
15123B6980l3947n1072k0673M5495M2318K8642l1285J708k2774n8345l5890j158
15111a10001J0346p316p846N6163J8996j5651j80P6843J7193m5958L814M253M8121
15098D8777J4200k6622m6139o9634K4786r630K1281L2901k5881j7938K8002O7028
$$ plain form
15086 41131 26572 32594 25337 33835 60930 63258 29545 11741 -20903 -53740 -78545 -89223
15074 -89223 -94342 -27995 73952 87988 18131 -13030 -22350 -62404 -55911 -54593 -13628 -5777
15062 -5777 6323 30240 -10215 -69924 -63189 -21957 15029 32224 7841 1630 -10286 27173
15050 27173 43389 83554 91663 51694 11748 71317 68469 64049 91864 116300 177280 158001
15038 158001 144717 47146 -20128 -13705 -67844 -56667 -70224 -58180 -32942 -17062 -55930 -52824
15026 -52824 -59136 -79381 -65901 14799 8536 -17177 -13001 -26446 -29820 -13666 -1185 50248
15014 50248 31842 -37384 -28779 -35651 19481 4074 21705 31223 44889 10788 -42798 -80200
15002 -80200 -86896 -125131 -72469 -46022 -28297 -25781 -67329 -51683 32453 63277 64070 7637
$$ packed form
15086D1131j4559O022p257Q498K7095K328l3713j7804l2644l2837k4805j0678
15074h9223n119O6347J01947J4036o9857l1161r320m0054O493J318M0965P851
15062e777J2100K3917m0455n9709O735M1232L6986J7195k4383o211j1916L7459
15050B7173J6216M0165Q109l9969l9946N9569k848m420K7815K4436O0980j9279
15038A58001j3284r7571o7274O423n4139J1177j3557J2044K5238J5880l8868L106
15026e2824o312k0245J3480Q0700o263k5713M176j3445l374J6154J2481N1433
15014E0248j8406o9226Q605o872N5132j5407J7631R518J3666l4101n3586l7402
15002h0200o696l8235N2662K6447J7725K516m1548J5646Q4136L0824P93n6433
$$ plain form
14990 7637 -43059 -41159 -3909 44746 49667 23313 7481 1226 -43409 -63450 -40885 22030
14978 22030 72866 64809 31676 52700 86608 83792 69428 35757 8562 4038 -19284 -16465
14966 -16465 -5920 -7282 -20173 19273 59690 78099 66875 50850 54142 22151 -10779 -52911
14954 -52911 -63212 -35190 -54130 -77262 -50741 21726 57972 34537 104398 68622 -17619 -25894
14942 -25894 5479 27366 29181 15717 7427 -24 52227 29642 -21143 -80686 -128761 -158961
14930 -158961 -179383 -139771 -126543 -140627 -78960 -34655 -83618 -86006 -60794 -27146 -17806 -15729
14918 -15729 -30869 13518 43110 47090 -46595 -45953 -19926 8133 35430 61777 38521 37303
14906 37303 -7079 -27100 41603 59228 55045 14966 43567 38174 13039 -28856 -18442 -50923
$$ packed form
14990G637n0696J900L7250M8655M921k6354j5832o255m4635k0041K2565O2915
14978B2030N0836q057l3133K1024L3908k816j4364l3671k7195m524k3322K819
14966a6465J0545j362j2891L9446M0417J8409j1224j6025L292l1991l2930m2132
14954e2911j0301K8022j8940k3132K6521P2467L6246k3435O9861l5776q6241q275
14942b5894L1373K1887J815j3464q290p451N2251k2585n0785n9543m8075l0200
14930a58961k0422L9612J3228j4084O1667M4305m8963k388K5212L3648R340K077
14918a5729j5140M4387K9592L980r3685O42K6027K8059K7297K6347k3256j218
14906C7303m4382k0021O8703J7625m183m0079K8601n393k5135m1895J0414l2481
$$ plain form
14894 -50923 -84799 -424 23335 -23438 -38306 -64556 -71972 -22317 -25697 -65139 -50945 -31495
14882 -31495 26192 33182 -29049 -73375 -77840 -65680 -92597 -73667 -4301 30742 59233 49918
14870 49918 -5582 -58144 -64818 -111260 -116656 -96215 -93952 -110117 -81757 -73261 -61290 -37015
14858 -37015 -28948 -20935 10936 6597 20090 27001 14369 -2136 -8227 40634 18132 5862 -1134
14845 -1134 -12110 -22226 -33062 -33903 -10065 -5785 -45092 -70464 -49229 -25330 -52715 -23750
14833 -23750 38243 61437 80548 42722 42577 902 -59942 -41419 -10903 -22423 -34553 -73371
14821 -73371 -118756 -93544 -21625 -30710 -60397 -100701 -106618 -102720 -47338 -3903 -3015 -11945 -9710
14808 -9710 -52619 4301 32737 -9501 -32634 -8620 -10424 -2388 21268 -39709 -72817 -58815
$$ packed form
14894e0923l3876Q4375K3759m6773j4868k6250p416M9655l380l9442J4194J9450
14882c1495N7687O990o2231m4326m465J2160k6917J8930O9366L5043K8491r315
14870D9918n5500n2562o674m6442n396K0441K263j6165K8360Q496J1971K4275
14858c7015Q067Q013L1871m339J3493O911j2632j6505o091M8861k2502j2270o996
14845a134j0976j0116j0836q41K3838M280l9307k5372K1235K3899k7385K8965
14833b3750O1993K3194J9111l7826j45m1675o0844J8523L0516j1520j2130l8818
14821g3371m5385K5212P1919r085k9687m0304n917L898N5382M3435Q88q930K235
14808i710m2909N6920K8436m2238k3133K4014j804Q036K3656o0977l3108J4002
$$ plain form
14796 -58815 -50607 18592 63649 -10167 -44693 43827 56638 22228 15189 30276 26062 19168
14784 19168 -6318 37905 96599 79409 67432 88235 61320 3729 -23878 -51278 -31147 -13948
14772 -13948 -17089 30241 26801 14829 33570 -33673 -39280 -33389 3560 14328 -9345 -65487
14760 -65487 -78150 -72860 -91048 -104648 -93741 -157145 -119300 -74274 -26629 9140 10112 -64
14748 -64 -23140 -55707 -34992 -32808 29550 -5502 1031 -7896 -2656 85830 129908 90902 68925
14735 68925 25147 11775 -26473 712 -46547 -91776 -66084 -54444 -13135 -8694 -30529 7786
14723 7786 33516 -32725 3685 50149 59804 33349 -12875 -26650 46858 83962 93271 66860
14711 66860 103101 166745 67354 37520 9831 -30812 -30030 -63374 -50779 -591 27340 -27425
$$ packed form
14796e8815Q208O9199M5057p3816l4526Q8520J2811l4410p039J5087m214o894
14784A9168k5486M4223N8694j7190j1977K0803k6915n7591k7607k7400K0131J7199
14772a3948l141M7330l440j1972J8741o7243n607N891L6949J0768k3673n6142
14760f5487j2663N290j8188j3600J0907o3404L7845M5026M7645L5769R72j0176
14748f4k3076l2567K0715K184O2358l5052O533q927N240Q8486M4078l9006k1977
14735F8925m3778j3372l8248K7185m7259m5229K5692J1640M1309M441k1835L8315
14723G786K5730o6241L6410M6464R655k6455m6224j3775P3508L7104R309k6411
14711F6860L6241O3644r9391k9834k7689m0643P82l3344J2595N0188K7931n4765
$$ plain form
14699 -27425 -53779 -13438 70892 39629 6437 -18940 -23165 -16869 -40817 -20889 67244 62601
14687 62601 5086 1790 -20996 -68947 -11466 14626 26625 29749 19038 19901 18339 69380 71347
14674 71347 26333 -16062 -47444 -20744 -36303 -4333 -204 -38914 -61138 -44447 13020 14089
14662 14089 -21712 -48883 -85969 -94888 -34614 -14321 44292 46089 8317 -9349 21494 -19728
14650 -19728 -48849 -14171 -37410 28220 31061 -23031 -34315 -43899 -81237 -109771 -111206 -82576
14638 -82576 -15584 -7790 56918 118749 41593 24774 63652 49016 13176 42156 80963 47280
14626 47280 10373 31500 74172 77868 102363 45890 32017 43231 73561 70974 111544 98132
14614 98132 16263 -24651 21503 4199 -58574 -57245 7014 36913 10348 -36514 -51416 -28814
$$ packed form
14699b7425k6354M0341Q4330l1263l3192k5377m225O296k3948J9928Q8133m643
14687F2601n7515l296k2786m7951N7481K6092J1999L124j0711Q63j562N1041J967
14674G1347m5014m2395l1382K6700j5559L1970M129l8710k2224J6691N7467J069
14662A4089l5801k7171l7086q919O0274K0293N8613J797l7772j7666L0843m1222
14650a9728k9121L4678k3239O5630K841n4092j1284r584l7338k8534j435K8630
14638h2576O6992P794O4708O1831p7156j6819L8878j4636l5840K8980L8807l3683
14626D7280l6907K1127M2672L696K4495n6473j3873J1214L0330k587M0570j3412
14614I8132q1869m0914M6154j7304o2773J329O4259K9899k6565m6862j4902K2602
$$ plain form
14602 -28814 12373 11990 -34891 -72629 -77953 -46968 -8847 -9945 -14118 11393 -254 2627 21321
14589 21321 10343 34747 28559 -1049 -59892 -40062 47453 18874 9150 49775 35936 14228
14577 14228 31577 -2302 -81510 -164123 -84219 23279 38313 63650 55763 61155 56364 69864
14565 69864 52484 13833 28717 39696 12294 20048 4111 -10751 -10398 1817 52183 84067
14553 84067 55335 61675 63269 28183 34838 54415 27953 -15267 34334 68400 23432 -30519
14541 -30519 19099 33413 -4641 14666 10414 -8860 -10015 3046 19787 19186 3906 -14115
14529 -14115 26279 67335 64399 80020 109898 90540 32932 59459 97406 73795 11422 36815
14517 36815 47109 71348 22532 -24840 -42191 -57638 -10453 57956 57947 17263 50640 85502
$$ packed form
14602b8814M1187l83m6881l7738n324L0985L8121j098m173K5511j1647K881J8694
14589B1321j0978K4404o188k9608n8843J9830Q7515k8579r724M0625j3839k1708
14577A4228J7349l3879p9208q2613P9904J07498J5034K5337p887N392m791J3500
14565F9864j7380l8651J4884J0979k7402P754j5937j4862L53J2215N0366L1884
14553H4067k8732O340J594l5086O655J9577k6462m3220M9601L4066m4968n3951
14541c0519M9618J4314l8054J9307m252j9274j155J3061J6741o01j5280j8021
14529a4115M0394M1056k936J5621K9878j9358n7608K6527L7947k3611o2373K5393
14517C6815J0294K4239m8816m7372j7351j5447M7185O8409rm0684L3377L4862
$$ plain form
14505 85502 -13043 30884 38629 27683 -5166 -3934 -23020 30237 56294 98682 75649 45866
14493 45866 48327 89759 135662 89480 77821 123062 121437 100617 62866 33471 -3509 -10671
14481 -10671 199 4419 3243 20434 26099 74459 99148 79750 52350 -12080 10711 94605
14469 94605 63920 34578 26156 34092 -16109 -22778 -21160 11056 -28572 -55802 -18784 -42687
14457 -42687 -64055 -37979 -43992 -41012 -73546 -63798 -60947 -35272 -104405 -108899 -80793 -73585 -35739
14444 -35739 -48730 -82520 -92926 -128332 -57375 13306 47309 85806 62966 21226 -24105 -62507
14432 -62507 -50201 417 33453 3726 -888 -41824 -97424 -63647 -64560 -29991 -9890 1291
14420 1291 27780 64648 80682 145171 160898 144587 141850 106259 40794 52535 31579 -11279
$$ packed form
14505H5502r8545M3927P745j0946l2849J232j9086N3257K6057M2388k3033k9783
14493D5866K461M1432M5903m6182j1659M5241j625k0820l7751k9395l6980p162
14481a0671J0870M220j176J7191N665M8360K4689j9398k7400o4430K2791Q3894
14469I4605l0685k9342q422P936n0201o669J618L2216l9628k7230L7018k3903
14457d2687k1368K6076o013K980l2534R748K851K5675o9133m494K8106P208L7846
14444c5739j2991l3790j0406l5406P0957P0681L4003L8497k2840m1740m5331l8402
14432f2507J2306N0618L3036k9727m614m0936n5600L3777r13L4569K0101J1181
14420A291K6489L6868J6034O4489J5727j6311k737l5591o5465J1741k0956m2858
$$ plain form
14408 -11279 -16377 5439 29343 -63483 -90285 -122867 -102051 -105407 -120156 -115654 -12348 43155
14396 43155 8990 23555 29907 26256 -11447 -3078 36485 -3356 -52428 -61716 -48795 -39547 -36694
14383 -36694 -13632 -8423 -11572 30566 -11979 73111 152968 95947 16359 -30325 -34249 -28593
14371 -28593 -5737 45712 47662 55511 88396 97967 41584 -23263 -27581 -38362 -9099 52658
14359 52658 122714 169669 177994 166827 129697 78807 121079 152634 136180 107559 105472 142745
14347 142745 212798 209803 173372 205746 184580 144325 206435 229732 212184 242890 287716 292552
14335 292552 281246 338871 356915 403094 466855 482650 497496 536771 539237 493177 471563 417073
14323 417073 379206 394010 375937 368352 355706 310852 246659 242431 257172 297663 300509 298735
$$ packed form
14408a1279n098K1816K3904r2826k6802l2582K0816l356j4749M502J03306N5503
14396D3155l4165J4565O352l651l7703Q369L9563l9841m9072r288J2921R248K853
14383c6694K3062N209l149M2138m2545Q5090P9857n7021p9588m6684l924N656
14371b8593K2856N1449J950P849L2885R571n6383o4847m318j0781K9263O1757
14359E2658P0056M6955Q325j1167l7130n0890M2272L1555j6454k8621k087L7273
14347A42745P0053k995l6431L2374k1166m0255O2110K3297j7548L0706M4826M836
14335B92552j1306N7625J8044M6179O3761J5795J4846L9275K466m6060k1614n4490
14323D17073l7867J4804j8073p585j2646m4854o4193m228J4741M0491K846j774
$$ plain form
14311 298735 297141 305559 334785 296784 251221 225077 226952 232912 220175 194302 233346 253934
14299 253934 173886 162420 144424 185351 186046 153472 130167 131686 111800 100557 138730 110898
14287 110898 94158 119147 146457 133853 67730 36332 69740 120730 133067 102751 98016 108407
14275 108407 68600 64592 139165 131192 124812 128342 167443 136201 16120 20707 77391 136531
14263 136531 127815 73082 99061 91228 102951 125221 88554 44281 89779 135630 116756 75435
14251 75435 79983 101424 70855 139710 220094 201165 163646 134938 130853 87450 107019 105936
14239 105936 108721 90111 36648 75240 111185 122029 134869 123783 97405 69432 75154 149347
14227 149347 136222 131767 143031 84311 65859 103001 118659 108032 57015 40567 28182 63874
$$ packed form
14311B98735j594Q418K9226l8001m5563k6144J875N960j2737k5873L9044K0588
14299B53934q0048j1466j7996M0927O95l2574k3305J519j9886j1243L8173k7832
14287A10898j6740K4989K7310j2604o6123l1398L3408N0990J2337l0316m735J0391
14275A08407l9807m008P4573p973o380L530L9101l1242j20081M587N6684N9140
14263A36531q716n4733K5979p833J1723K2270l6667m4273M5498M5851j8874m1321
14251G5435M548K1441l0569O8855Q0384j8929l7519k8708m085m3403J9569j083
14239A05936K785j8610n3463L8592L5945J0844J2840j1086k6378k7973N722P4193
14227A49347j3125m455J1264n8720j8452L7142J5658j0627n1017j6448j2385L5692
$$ plain form
14215 63874 53116 39193 29902 95475 123974 107733 62289 66347 135914 112987 30449 -38377
14203 -38377 -48207 2960 79555 148513 129308 121246 72125 9294 65086 118507 90072 67671
14191 67671 -1328 10102 36103 42944 65530 62361 -10759 -12846 58348 38688 8787 23674
14179 23674 24882 42373 16119 40450 89116 82400 98050 52398 -13665 -3042 3956 -25586
14167 -25586 -23915 67221 96906 79200 57503 60598 62914 74705 12176 17673 91352 108678
14155 108678 106345 73493 54104 13686 646 19734 18832 56298 41121 25314 -112 29901
14143 29901 78259 105617 59836 88640 121400 149779 118307 58055 79496 154807 152218 106851
14131 106851 95225 105376 97665 138896 101206 69652 48811 79485 178048 206250 202363 143850
$$ packed form
14215F3874j0758j3923r291O5573K8499j6241m5444M058O9567k2927q2538o8826
14203c8377r830N1167P6595O8958j9205q062m9121o2831N5792N3421k8435k2401
14191F7671o8999J1430K6001O841K2586l169p3120k087P1194j9660k9901J4887
14179B3674J208J7491k6254K4331M8666o716J5650m5652o6063J0623O998k9542
14167b5586J671R1136K9685j7706k1697L095K316J1791o2529N497P3679J7326
14155A08678k333l2852j9389m0418j3040J9088r02L7466j5177j5807k5426L0013
14143B9901M8358K7358m5781K8804L2760K8379l1472o0252K1441P5311k589m5367
14131A06851j1626J0151p711M1231l7690l1554k0841L0674R8563K8202l887n8513
$$ plain form
14119 143850 116463 65065 -6372 -28970 84584 150585 156389 188582 194003 185212 188116 227413
14107 227413 195649 158217 97614 63159 57298 91766 96419 125754 139714 95623 68697 130458
14095 130458 159427 190057 211058 148839 111076 131891 141396 110794 126131 110967 53449 67920
14083 67920 142412 160582 148576 152237 177818 199031 200536 196886 207757 204019 214949 204180
14071 204180 194144 128461 114146 117228 87539 61899 46725 62795 37494 29858 -9650 53043
14059 53043 74782 73754 44862 39605 -2341 29537 100393 139504 143565 168195 172636 90383
14047 90383 95767 160600 190625 173102 144739 81779 80373 110672 158157 228475 229254 223993 182895
14034 182895 173078 225200 221820 203502 187436 179451 279348 372853 342214 295495 289674 306545
$$ packed form
14119A43850k7387n1398p1437k2598J13554O6001N804L2193N421q791K904L9297
14107B27413l1764l7432o0603l4455n861L4468M653K9335J3960m4091k6926O1761
14095A30458K8969L0630K1001o2219l7763K0815R505l0602J5337j5164n7518J4471
14083F7920P4492J8170j2006L661K5581K1213J505l650J0871l738J0930j0769
14071B04180j0036o5683j4315L082k9689k5640j5174J6070k5301p636l9508O2693
14059E3043K1739j028k8892n257m1946L1878P0856L9111M061K4630M441q2253
14047I0383N384O4833L0025j7523k8363o2960j406L0299M7485P0318P79n261m1098
14034A82895r817N2122l380j8318j6066p985R9897R3505l0639m6719n821J6871
$$ plain form
14022 306545 292624 257236 241087 294546 286993 333609 380917 360277 377974 361236 329272 355010
14010 355010 325257 330432 376862 386853 353279 359742 343193 359665 385513 433920 410101 387976
13998 387976 387055 348137 342649 365592 390066 387957 419263 469046 464006 522387 569754 513636
13986 513636 437060 509476 512609 516752 580107 568069 569580 527658 542789 627812 668289 667965
13974 667965 647633 706947 767973 763483 742038 763440 801290 820117 842860 922553 922773 914850
13962 914850 935521 942364 990872 1034202 1105574 1138493 1193123 1225438 1207372 1227688 1345061
13951 1345061 1448881 1455382 1475198 1511040 1578930 1652617 1755164 1861959 1943810 1952396 2102624
13940 2102624 2265109 2345868 2411587 2526228 2636978 2729458 2815873 2978560 3176813 3394772
$$ packed form
14022C06545j3921l5388j6149N3459p553M6616M7308k0640J7697j6738l1964K5738
14010C55010k9753N175M6430R991l3574O463j6549J6472K5848M8407k3819k2125
13998C87976r21l8918n488K2943K4474k109L1306M9783n040N8381M7367n6118
13986E13636p6576P2416L133M143O3355j2038J511m1922J5131Q5023M0477l24
13974F67965k0332N9314O1026m490k1445K1402L7850J8827K2743P9693K20p923
13962I14850K0671O843M8508M3330P1372L2919N4630L2315j8066K0316J17373
13951A345061J03820O501J9816L5842O7890P3687J02547J06795Q1851Q586J50228
13940B102624J62485Q0759O5719J14641J10750R2480Q6415J62687J98253K17959
$$ plain form
13930 3394772 3623121 3822682 4079212 4341370 4596821 4855815 5179535 5574475 5987514
13921 5987514 6383876 6819187 7308383 7814189 8369435 9035588 9746320 10482766 11299544
13912 11299544 12221823 13277634 14380143 15548983 16825776 18258101 19839736 21617438
13904 21617438 23535061 25569814 27740960 30186431 32863596 35749897 38838548 42188897
13896 42188897 45814182 49638358 53619596 57755179 61996449 66253521 70411209 74401295
13888 74401295 78202426 81545188 84352239 86453669 87930478 88722870 88680651 87882254 86534966
13879 86534966 84583851 82121449 79335749 76234324 72894011 69555177 66291007 62972761
13871 62972761 59732246 56639839 53613366 50721806 48072914 45570727 43175786 40936693
$$ packed form
13930C394772K28349J99561K56530K62158K55451K58994L23720L94940M13039
13921E987514L96362M35311M89196N05806N55246O66153P10732P36446Q16778
13912A1299544R22279J055811J102509J168840J276793J432325J581635J777702
13904B1617438J917623K034753K171146K445471K677165K886301L088651L350349
13896D2188897L625285L824176L981238M135583M241270M257072M157688L990086
13888G4401295L801131L342762K807051K101430J476809P92392m2219p98397j347288
13879H6534966j951115k462402k785700l101425l340313l338834l264170l318246
13871F2972761l240515l092407l026473k891560k648892k502187k394941k239093
$$ plain form
13863 40936693 38854590 36933758 35106639 33414560 31907802 30463877 29068351 27831331
13855 27831331 26609388 25509915 24520571 23491742 22602584 21784111 21007931 20285397 19579662
13846 19579662 18891340 18187992 17535180 16973568 16459648 15946805 15417601 14947622 14512555
13837 14512555 14066038 13670016 13318298 12924766 12507560 12140453 11752884 11472848 11176510
13828 11176510 10889984 10612187 10313158 10040698 9783816 9536909 9273782 9017579 8760941
13819 8760941 8559637 8297427 8000089 7803430 7603800 7462928 7304586 7086792 6912076
13810 6912076 6766534 6596922 6519747 6412046 6299355 6179148 6010318 5852376 5740939 5617707
13800 5617707 5462475 5317551 5183135 5091996 5003856 4929031 4841631 4691631 4546036 4431451
$$ packed form
13863D0936693k082103j920832j827119j692079j506758j443925j395526j237020
13855B7831331j221943j099473r89344j028829q89158q18473p76180p22534p05735
13846A9579662o88322p03348o52812n61612n13920n12843n29204m69979m35067
13837A4512555m46517l96022l51718l93532m17206l67107l87569k80036k96338
13828A1176510k86526k77797k99029k72460k56882k46907k63127k56203k56638
13819H760941k01304k62210k97338j96659j99630j40872j58342k17794j74716
13810F912076j45542j69612p7175j07701j12691j20207j68830j57942j11437j23232
13800E617707j55232j44924j34416r1139q8140p4825q7400j50000j45595j14585
$$ plain form
13790 4431451 4335915 4224646 4149462 4079150 4010995 3901315 3831071 3803634 3753422 3610053 3526237
13779 3526237 3394049 3309596 3272260 3236530 3138180 3042633 2988240 2948770 2821512 2741313 2699760
13768 2699760 2623080 2515244 2500115 2497708 2489878 2440761 2332322 2246172 2228858 2260764 2264383
13757 2264383 2260026 2207284 2135056 2104824 1981712 1940826 1848503 1815370 1784330 1826430 1751573
13746 1751573 1664728 1622526 1579847 1534957 1433298 1431800 1469762 1512116 1495523 1429966 1335690
13735 1335690 1303505 1326019 1254979 1181376 1115943 1106086 1078688 1028766 1015484 1022737 1011156 920296
13723 920296 870463 899337 906488 863856 799359 752947 772174 802494 798258 780319 771969 695116
13711 695116 653067 623286 598961 600981 584530 581844 580835 514967 453700 477697 519513 521633
$$ packed form
13790D431451r5536j11269p5184p0312o8155j09680p0244k7437n0212j43369q3816
13779C526237j32188q4453l7336l5730r8350r5547n4393l9470j27258q0199m1553
13768B699760p6680j07836j5129k407p830m9117j08439q6150j7314L1906L619
13757B264383m357n2742p2228l0232j23112m0886r2323l3133l1040M2100p4857
13746A751573q6845m2202m2679m4890j01659j498L7962M2354j6593o5557r4276
13735A335690l2185K2514p1040p3603o5433r857k7398m9922j3282P253j1581r0860
13723I20296m9833K8874P151m2632o4497m6412J9227L0320m236j7939q350p6853
13711F95116m2049k9781k4325K020j6451k686j009o5868o1267K3997M1816K120
$$ plain form
13699 521633 519860 542570 513617 452544 448652 397476 355644 361314 363345 352394 330169 350188
13687 350188 359789 337303 272937 235590 299187 345937 394247 384612 314640 279136 275391 265272
13675 265272 249702 208597 210040 222937 258624 294747 273646 326579 406247 419880 399167 336054
13663 336054 245887 204797 196360 223258 268257 314200 334463 307647 278634 269289 243727 245302
13651 245302 251689 292949 279121 265168 233126 228189 276621 292101 270337 240378 252964 276599
13639 276599 236692 193358 179423 169715 188072 195307 235198 275695 235877 204203 176447 155796
13627 155796 186880 213065 172137 113817 97039 193884 282964 308182 346689 358968 273037
13616 273037 218754 185504 172645 177708 127829 120201 144093 165100 177671 197450 179661 175141
$$ packed form
13699E21633j773K2710k8953o1073l892n1176m1832N670K031j0951k2225K0019
13687C50188R601k2486o4366l7347O3597M6750M8310r635o9972l5504l745j0119
13675B65272j5570m1105J443J2897L5687L6123k1101N2933P9668J3633k0713o3113
13663C36054r0167m1090q437K6898M4999M5943K0263k6816k9013r345k5562J575
13651B45302O387M1260j3828j3953l2042m937M8432J5480k1764k9959J2586K3635
13639B76599l9907m3334j3935r708J8357P235L9891M0497l9818l1674k7756k0651
13627A55796L1084K6185m0928n8320j6778R6845Q9080K5218L8507J2279q5931
13616B73037n4283l3250j2859N063m9879p628K3892K1007J2571J9779j7789m520
$$ plain form
13604 175141 172158 160285 112853 120990 134379 136768 214057 199206 131492 100967 86450 121687
13592 121687 165884 195263 171577 91459 82859 96790 133156 134900 56848 87150 88180 41880
13580 41880 42833 43858 59959 74450 71263 81428 115104 129986 106675 94269 102725 94253 95047
13567 95047 52237 -19710 26348 107478 94743 51131 63015 83454 55488 30024 43076 42714
13555 42714 60252 84993 45398 -5994 -28719 -37776 -34196 12732 68490 118283 122026 73713
13543 73713 73993 102033 143207 145528 74297 20705 19222 57241 87347 102570 87160 64868
13531 64868 79590 112511 107642 72882 51104 59608 70182 36646 43682 96331 96922 75299 68818
13518 68818 105829 146448 123654 77657 110651 114366 98817 68612 88063 22707 -7499 -19975
$$ packed form
13604A75141k983j1873m7432Q137J3389K389P7289j4851o7714l0525j4517L5237
13592A21687M4197K9379k3686q0118q600J3931L6366J744p8052L0302J030m6300
13580D1880R53J025J6101J4491l187J0165L3676J4882k3311j2406Q456q472P94
13567I5047m2810p1947M6058Q1130j2735m3612J1884K0439k7966k5464J3052l62
13555D2714J7538K4741l9595n1392k2725r057L580M6928N5758M9793L743m8313
13543G3713K80K8040M1174K321p1231n3592j483L8019L0106J5223j5410k2292
13531F4868J4722L2921m869l4760k1778Q504J0574l3536P036N2649N91k1623o481
13518F8818L7011M0619k2794m5997L2994L715j5549l0205J9451o5356l0206j2476
$$ plain form
13506 -19975 -5043 12250 44396 23004 -1263 -10830 -18360 4307 10091 80034 89295 59414
13494 59414 49273 67402 76860 138117 142962 107864 143184 172464 187188 184390 106832 109361
13482 109361 67013 66367 42176 54690 66728 94694 79973 65895 113278 193471 150120 114652
13470 114652 103028 118389 118479 80052 61781 109567 135807 81873 52148 74951 104369 99498
13458 99498 103759 64614 44050 40502 24138 54708 128628 133621 121551 141525 147101 168544
13446 168544 215426 282292 317634 338658 350608 384365 388752 406594 442090 384399 312747 332859
13434 332859 398374 385527 408457 454733 453726 464994 472726 462100 391405 306028 287501 293886
13422 293886 306875 292290 330831 278300 263732 259282 241264 222300 237454 211382 213852 219497
$$ packed form
13506a9975J4932J7293L2146k1392k4267r567p530K2667N784O9943R261k9881
13494E9414j0141J8129R458O1257M845l5098L5320K9280J4724k798p7558K529
13482A09361m2348o46k4191J2514J2038K7966j4721j4078M7383Q0193m3351l5468
13470A14652j1624J5361R0l8427j8271M7786K6240n3934k9725K2803K9418m871
13458I9498M261l9145k0564l548j6364L0570P3920M993j2070J9974N576K1443
13446A68544M6882O6866L5342K1024J1950L3757M387J7842L5496n7691p1652K0112
13434C32859O5515j2847K2930M6276j007J1268P732j0626p0695q5377j8527O385
13422B93886J2989j4585L8541n2531j4568m450j8018j8964J5154k6072K470N645
$$ plain form
13410 219497 227456 236768 261262 277325 303527 264189 235406 245671 204746 188485 199644 181642
13398 181642 190722 226239 172781 164975 167887 126028 102788 81833 120205 160408 148827 168569
13386 168569 169497 139829 123033 150745 147157 126251 157557 109618 23727 -32587 -28971 22002
13374 22002 25022 -20345 7684 41695 70646 97575 144938 154441 91575 58323 64749 46318
13362 46318 87653 170899 179821 110081 57148 31131 -61702 -44246 66040 129700 112292 68774
13350 68774 89640 116451 142806 172415 222908 235648 195335 182453 183734 184621 145862 99674
13338 99674 109007 126497 135095 108110 53782 45226 45968 -2111 30427 46935 59105 30171 7939
13325 7939 18106 97614 108437 97781 141843 77216 84344 40260 84157 126370 166708 114090
$$ packed form
13410B19497P959R312K4494J6063K6202l9338k8783J0265m0925j6261J1159j8002
13398A81642R080L5517n3458p806K912m1859k3240k0955L8372M0203j1581J9742
13386A68569R28k9668j6796K7712l588k0906L1306m7939q5891n6314L616N0973
13374B2002L020m5367K8029L4011K8951K6929M7363R503o2866l3252O426j8431
13362D6318M1335Q3246Q922o9740n2933k6017r2833J7456J10286O3660j7408m3518
13350F8774K0866K6811K6355K9609N0493J2740m0313j2882J281Q87l8759m6188
13338I9674R333J7490Q598k6985n4328q556P42m8079L2538J6508J2170k8934k2232
13325G939J0167P9508J0823j0656M4062o4627P128m4084M3897M2213M0338n2618
$$ plain form
13313 114090 86159 149705 193093 227125 229249 168673 132148 223935 252222 188478 156282 99491
13301 99491 84544 101943 102730 79658 44848 63000 81324 49055 79134 83958 103550 98676
13289 98676 119813 112286 99497 62893 92200 108164 89514 82339 18084 -5386 20192 17490
13277 17490 29803 89376 117660 148787 93034 38117 25611 75964 101539 14211 19754 69911
13265 69911 24451 8694 76537 128884 147740 79479 28191 27508 23703 66852 80749 80055 59802
13252 59802 36858 26674 27002 12247 32154 84690 72209 47517 71503 32342 55740 79157
13240 79157 105429 86186 67034 -1909 -4851 65887 45220 -31531 -74201 -72490 -79313 9907
13228 9907 78876 91980 134672 116793 64764 63955 51246 84146 111580 88570 31746 14885
$$ packed form
13313A14090k7931O3546M3388L4032K124o0576l6525R1787K8287o3744l2196n6791
13301I9491j4947J7399P87k3072l4810J8152J8324l2269L0079M824J9592m874
13289I8676K1137p527j2789l6604K9307J5964j8650p175o4255k3470K5578k702
13277A7490J2313N9573K8284L1127n5753n4917j2506N0353K5575q7328N543N0157
13265F9911m5460j5757O7843N2347J8856o8261n1288o83l805M3149J3897o94k0253
13252E9802k2944j0184L28j4755J9907N2536j2481k4692K3986l9161K3398K3417
13240G9157K6272j9243j9152o8943k942P0738k0667p6751m2670J711o823Q9220
13228I907O8969J3104M2692j7879n2029q09j2709L2900K7434k3010n6824j6861
$$ plain form
13216 14885 51234 90929 163339 211527 101520 71572 66164 92347 25307 -21 -9006 -17288
13204 -17288 -40326 -27517 809 34677 59752 92173 111302 76339 71136 54114 81354 120119
13192 120119 102795 106029 107774 99902 52437 -6864 -50941 -36413 -11053 -28020 -56786 -10570
13180 -10570 73421 88953 100723 132573 63505 32121 57994 114494 68943 50064 74745 113049
13168 113049 122907 93851 19836 57846 55582 33024 77034 151630 118044 111410 126081 97148
13156 97148 79749 11700 34265 32596 -1119 53442 21516 -52408 -40010 21556 66264 81563
13144 81563 109950 40904 18156 28428 34293 47721 98962 154258 148279 114639 57184 10210
13132 10210 -28700 -44976 -61409 -38538 4492 340 -11952 47316 72518 111994 117622 125952
$$ packed form
13216A4885L6349L9695P2410M8188j10007k9948n408K6183o7040k5328q985q282
13204a7288k3038J2809K8326L3868K5075L2421J9129l4963n203j7022K7240L8765
13192A20119j7324L234J745p872m7465n9301m4077J4528K5360j6967k8766M6216
13180a0570Q3991J5532J1770L1850o9068l1384K5873N6500m5551j8879K4681L8304
13168A13049R858k9056p4015L8010k264k2558M4010P4596l3586o634J4671k8933
13156I7148j7399o8049K2565j669l3715N4561l1926p3924J2398O1566M4708J5299
13144H1563K8387o9046k2748J0272N865J3428N1241N5296n979l3640n7455m6974
13132A0210l8910j6276j6433K2871M3030m152j2292N9268K5202L9476N628Q330
$$ plain form
13120 125952 115741 60799 45660 45860 76377 102872 34557 -21232 48654 88271 47637 5472
13108 5472 8430 31072 108785 138142 180631 128868 72165 16083 -28709 -664 64968 85908
13096 85908 106076 12208 -72514 -71245 -25489 22835 26518 12883 10437 -13520 3907 60120
13084 60120 122446 124936 136918 161714 167110 179182 195612 90977 39354 33496 95428 126734
13072 126734 121686 146700 102366 56959 39376 10373 -1570 33732 68473 87110 146145 158373
13060 158373 138534 103046 97058 148107 117010 99173 122997 155185 189010 128997 73697 63430
13048 63430 73393 -1777 -41565 12261 70251 132934 132926 105596 84803 31606 20134 -9074 32230
13035 32230 64659 51205 30340 27278 75585 94760 131317 133985 64050 36471 18166 16615
$$ packed form
13120A25952j0211n4942j5139K00L0517K6495o8315n5789O9886L9617m0634m2165
13108E472K958K2642P7713K9357M2489n1763n6703n6082m4792K8045O5632K0940
13096H5908K0168r3868q4722J269M5756M8324L683j3635k446k3957J7427N6213
13084F0120O2326K490J1982K4796N396J2072J6430j04635n1623n858O1932L1306
13072A26734n048K5014m4334m5407j7583k9003j1943L5302L4741J8637N9035J2228
13060A58373j9839l5488n988N1049l1097j7837K3824L2188L3825o0013n5300j0267
13048F3430R963p5170l9788N3826N7990O2683qk7330k0793n3197j1472k9208M1304
13035C2230L2429j3454k0865l062M8307J9175L6557K668o9935k7579j8305j551
$$ plain form
13023 16615 43023 133955 139178 114119 73482 23562 28563 -21771 29380 58975 51360 29843
13011 29843 32935 30647 24753 37150 41499 40855 -16018 -55574 27392 84466 42482 13194 -6780
12998 -6780 32483 26321 22861 44003 26076 38830 74095 79800 71413 41565 78147 118451 111861
12985 111861 32668 31089 33742 75735 98713 55705 95836 40209 -38018 53935 75956 60327
12973 60327 57275 70634 61461 130017 178190 181175 163693 125666 139851 114496 106569 73707
12961 73707 104113 104780 123381 139648 121073 133968 169974 138119 113908 85731 82727 91691
12949 91691 42728 115724 130211 131663 143790 107305 87360 122474 107592 111698 108948 71752
12937 71752 61766 45200 39425 3335 74169 170739 130375 110659 107133 84090 88028 151537
$$ packed form
13023A6615K6408R0932N223k5059m0637m9920N001n0334N1151K9595p615k1517
13011B9843L092k288n894J2397M349o44n6873l9556Q2966N7074m1984k9288j9974
12998f780L9263o162l460K1142j7927J2754L5265N705q387k9848L6582M0304o590
12985A11861p9193j579K653M1993K2978m3008M0131n5627p8227R1953K2021j5629
12973F0327l052J3359r173O8556M8173K985j7482l8027J4185k5355p927l2862
12961G3707L0406O67J8601J6267j8575J2895L6006l1855k4211k8177l004Q964
12949I1691m8963P2996J4487J452J2127l6485j9945L5114j4882M106k750l7196
12937G1752r986j6566n775l6090P0834R6570m0364j9716l526k3043L938O3509
$$ plain form
12925 151537 140510 108025 100936 161110 121287 75473 113083 123971 118109 77382 24555 -44525
12913 -44525 -116337 -104561 -82362 -36925 18459 -8330 4196 7020 49296 82373 19545 60076
12901 60076 49037 87778 115206 114820 54375 93160 99386 107121 71420 91953 60009 87737
12889 87737 84426 40270 -12677 18113 55016 17150 59499 126439 130313 135801 116340 90042
12877 90042 65356 53398 49184 32109 31863 86771 130695 155206 108136 116573 86809 9100
12865 9100 19039 33162 45786 -12606 -10138 62294 112743 109589 16195 29469 65096 19128
12853 19128 48845 78999 63164 88272 78529 93998 17709 35361 89190 71641 46241 49904
12841 49904 108387 198427 255663 206544 151968 100085 89206 101022 139878 115169 101703 110468
$$ packed form
12925A51537j1027l2485p089O0174l9823m5814L7610J0888n862m0727n2827o9080
12913d4525p1812J1776K2199M5437N5384k6789J2526K824M2276L3077o2828M0531
12901F0076j1039L8741K7428l86o0445L8785O226P735l5701K0533l1944K7728
12889H7737l311m4156n2947L0790L6903l7866M2349O6940L874N488j9461k6298
12877I0042k4686j1958m214j7075k46N4908M3924K4511m7070Q437k9764p7709
12865I100R939J4123J2624n8392K468P2432N0449l154r3394J3274L5627m5968
12853A9128K9717L0154j5835K5108r743J5469p6289J7652N3829j7549k5400L663
12841D9904N8483R0040N7236m9119n4576n1883j0879J1816L8856k4709j3466Q765
$$ plain form
12829 110468 74219 55015 52522 58156 97215 116319 82410 53972 55066 95459 112414 70500
12817 70500 61543 74836 71097 143234 155004 130975 131300 162902 157184 114539 105641 127478 112529
12804 112529 148427 107794 88356 127880 146285 147805 192077 197483 185909 213811 260676 319792
12792 319792 383807 347210 405010 460675 429295 370355 342315 288005 229243 188320 209082
12781 209082 171230 120415 148891 194638 210197 233417 262146 229437 188286 118544 43449
12770 43449 31987 63606 121025 191121 249228 220716 226352 264316 231994 199477 208652 256469
12758 256469 287073 366140 377107 460238 575243 636113 691278 823560 947402 1027220 1183699
12747 1183699 1260339 1217174 1113227 971422 933361 831081 690865 568764 524204 520187
$$ packed form
12829A10468l6249j9204k493N634L9059J9104l3909k8438J094M0393J6955m1914
12817G0500q957J3293l739P2137J1770k4029L25L1602n718m2645q898K1837j4949
12804A12529L5898m0633j9438L9524J8405J520M4272N406j1574K7902M6865N9116
12792C19792O4015l6597N7800N5665l1380n8940k8040n4310n8762m0923K0762
12781B09082l7852n0815K8476M5747J5559K3220K8729l2709m1151o9742p5095
12770D3449j1462L1619N7419P0096N8107k8512N636L7964l2322l2517R175M7817
12758B56469L0604P9067J0967Q3131J15005O0870N5165J32282J23842P9818J56479
12747A183699P6640m3165j03947j41805l8061j02280j40216j22101m4560m017
$$ plain form
12737 520187 504848 469388 370344 298176 273222 314274 336832 355570 306867 217015 225906 246607
12725 246607 237124 250023 270642 315271 359023 385286 378771 352253 342836 368464 408788 423866
12713 423866 441067 484084 480672 476094 501650 476320 490716 480431 479467 512310 405759 365989
12701 365989 355556 338668 315173 221462 185783 226277 248159 261456 249940 294136 318328
12690 318328 293209 239058 220942 216511 269356 287397 196594 217033 262796 276773 231143 207114
12678 207114 220431 197817 225845 260636 253540 281891 281333 235251 236351 198516 170143 145107
12666 145107 176310 129199 57842 97126 116326 170102 175575 203416 232566 185335 175247 220059
12654 220059 218591 185387 145096 123336 81718 38880 64295 38786 78011 62364 77790 106525
$$ packed form
12737E20187j5339l5460r9044p2168k4954M1052K2558J8738m8703q9852Q891K0701
12725B46607r483J2899K0619M4629M3752K6263o515k6518r417K5628M0324J5078
12713D23866J7201M3017l412m578K5556k5330J4396j0285r64L2843j06551l9770
12701C65989j0433j6888k3495r3711l5679M0494K1882J3297j1516M4196K4192
12690C18328k5119n4151j8116m431N2845J8041r0803K0439M5763J3977m5630k4029
12678B07114J3317k2614K8028L4791p096K8351n58m6082J100l7835k8373k5036
12666A45107L1203m7111p1357L9284J9200N3776N473K7841K9150m7231j0088M4812
12654B20059j468l3204m0291k1760m1618m2838K5415k5509L9225j5647J5426K8735
$$ plain form
12642 106525 120113 165553 170159 123295 140330 171024 189046 199536 205086 216938 183228 143501
12630 143501 140751 124271 146330 144049 123439 94765 107346 138333 158098 165961 170731 186023
12618 186023 239707 241088 293697 342260 332625 264749 268763 270326 216141 188118 156335 137647
12606 137647 191436 208526 198716 251328 253939 199129 207286 249536 263542 171320 116567 182968
12594 182968 272033 330637 298463 208050 215152 197828 184619 232631 201863 235975 264778 334813
12582 334813 378023 329054 281231 216353 218100 245775 173641 141478 183164 211643 258211 277702
12570 277702 289681 269937 319109 315010 231777 213719 283401 275710 255544 212482 184684 183399
12558 183399 174145 141605 118054 216414 183851 85258 72768 49837 83622 44652 43713 75671
$$ packed form
12642A06525J3588M5440M606m6864J7035L0694J8022J0490N550J1852l3710l9727
12630A43501k750j6480K2059k281k0610k8674J2581L0987J9765P863M770J5292
12618A86023N3684J381N2609M8563r635o7876M014J563n4185k8023l1783j8688
12606A37647N3789J7090r810N2612K611n4810Q157M2250J4006r2222n4753O6401
12594A82968Q9065N8604l2174r0413P102j7324j3209M8012l0768L4112K8803P0035
12582C34813M3210m8969m7823o4878J747K7675p2134l2163M1686K8479M6568J9491
12570B77702J1979j9744M9172m099q3233j8058O9682p691k0166m3062k7798j285
12558A83399r254l2540k3551R8360l2563r8593j2490k2931L3785l8970r39L1958
$$ plain form
12546 75671 110136 142980 133934 125825 150192 181745 122108 75889 14246 89523 139758 160431
12534 160431 185306 212963 202337 123438 116286 140469 120864 156220 181081 121410 142569 131396
12522 131396 147632 169251 123898 112705 198120 168976 121883 114671 156047 211325 276347 279854
12510 279854 218482 173143 146026 173636 197749 273933 258968 251677 300560 327021 295340 287911
12498 287911 249795 285894 286278 367260 405021 388702 352277 449328 488879 554880 614869 730692
12486 730692 927141 1151062 1340910 1546477 1749352 2062452 2353559 2558159 2611786 2588740
12476 2588740 2531862 2360801 2158711 1934242 1721950 1483582 1317021 1182422 1047965 948655
12466 948655 893740 905492 872373 813248 742158 721553 734872 671702 632486 722521 809922
$$ packed form
12546G5671L4465L2844r046q109K4367L1553n9637m6219o1643P5277N0235K0673
12534A60431K4875K7657j0626p8899p152K4183j9605L5356K4861n9671K1159j1173
12522A31396J6236K1619m5353j1193Q5415k9144m7093p212M1376N5278O5022L507
12510B79854o1372m5339k7117K7610K4113P6184j4965p291M8883K6461l1681p429
12498B87911l8116L6099L84Q0982L7761j6319l6425R7051L9551O6001N9989J15823
12486G30692J96449K23921J89848K05567K02875L13100K91107K04600N3627k3046
12476B588740n6878j71061k02090k24469k12292k38368j66561j34599j34457r9310
12466I48655n4915J1752l3119n9125p1090k0605J3319o3170l9216R0035Q7401
$$ plain form
12455 809922 856834 875115 835950 816396 798515 713289 618950 612809 564510 539163 577455 641488
12443 641488 604026 525758 575111 672474 653936 579846 612255 658759 623487 680970 752287
12432 752287 720243 634820 576953 564657 577986 578934 479263 466140 515505 557668 575791 635575
12420 635575 639537 675393 711612 684509 655684 633165 647482 645698 680441 700683 663370 651316
12408 651316 691887 678199 680277 740101 817028 868310 903128 900043 894785 884483 877971 876910
12396 876910 898598 921376 938035 964956 956892 967628 1035053 1084740 1107899 1125279 1192670 1212727
12384 1212727 1223567 1238770 1248251 1262998 1274358 1284164 1296057 1329491 1411181 1442321 1481014 1510441
12372 1510441 1526130 1575440 1604696 1636736 1704444 1766391 1784331 1834084 1928916 2118879 2229774
$$ packed form
12455H09922M6912J8281l9165j9554j7881q5226r4339o141m8299k5347L8292O4033
12443F41488l7462p8268M9353R7363j8538p4090L2409M6504l5272N7483P1317
12432G52287l2044q5423n7867j2296J3329R48r9671j3123M9365M2163J8123N9784
12420F35575L962L5856L6219k7103k8825k2519J4317j784L4743K0242l7313j2054
12408F51316M0571j3688K078N9824P6927N1282L4818l085n258j0302o512j061
12396H76910K1688K2778J6659K6921q064J0736O7425M9687K3159J7380O7391K0057
12384A212727J0840J5203R481J4747J1360R806J1893L3434Q1690L1140L8693K9427
12372A510441J5689M9310K9256L2040O7708O1947J7940M9753R4832J89963J10895
$$ plain form
12361 2229774 2333920 2448850 2551717 2687354 2885813 3075052 3326892 3642678 3982792
12352 3982792 4350852 4826541 5390278 6002242 6774305 7764335 8970249 10433703 12049257
12343 12049257 13766131 15509208 17194560 18882894 20693114 23153042 26745642 32134016
12335 32134016 40290755 52563889 70550521 95644092 127708904 163738656 197425803
12328 197425803 220723103 227635024 217074916 193429905 164132121 135752840 111915603
12321 111915603 93316587 79115319 68361836 60398004 54579012 50141481 46584554
12314 46584554 43646440 41061492 38577715 36129201 33816698 31597225 29589094 27847734
12306 27847734 26381443 25081742 23911188 22997812 22270765 21604141 20882476 20225277 19646318
$$ packed form
12361B229774J04146J14930J02867J35637J98459J89239K51840L15786L40114
12352C982792L68060M75689N63737O11964P72063R90030J205914J463454J615554
12343A2049257J716874J743077J685352J688334J810220K459928L592600N388374
12335C2134016Q156739J2273134J7986632K5093571L2064812L6029752L3687147
12328A97425803K3297300O911921j0560108k3645011k9297784k8379281k3837237
12321A11915603j8599016j4201268j0753483p963832n818992m437531l556927
12314D6584554k938114k584948k483777k448514k312503k219473k008131j741360
12306B7847734j466291j299701j170554r13376p27047o66624p21665o57199n78959
$$ plain form
12297 19646318 19041982 18431574 17778502 17148592 16604616 16042186 15559508 15181511 14868110
12288 14868110 14570073 14356620 14102527 13901485 13658264 13400348 13113850 12833358 12523755
12279 12523755 12141619 11788363 11492418 11200333 10938479 10623402 10277525 9975575 9741739
12270 9741739 9451756 9176261 8903109 8665997 8425810 8221015 8021367 7835850 7694101
12261 7694101 7543154 7352279 7146007 6932543 6763347 6617947 6544524 6521101 6411751 6242972
12251 6242972 6127587 6036602 5942957 5910514 5930816 5888671 5698751 5491318 5384019 5297412
12241 5297412 5227935 5111502 5008223 4918076 4858305 4762647 4711047 4607588 4466189 4286012
12231 4286012 4165972 4151699 4035676 3898280 3894474 3800951 3706850 3630297 3628791 3540435 3445025
$$ packed form
12297A9646318o04336o10408o53072o29910n43976n62430m82678l77997l13401
12288A4868110k98037k13453k54093k01042k43221k57916k86498k80492l09603
12279A2523755l82136l53256k95945k92085k61854l15077l45877l01950k33836
12270I741739k89983k75495k73152k37112k40187k04795j99648j85517j41749
12261G694101j50947j90875k06272k13464j69196j45400p3423k3423j09350j68779
12251F242972j15385r0985r3645l2443K0302m2145j89920k07433j07299q6607
12241E297412o9477j16433j03279r0147n9771r5658n1600j03459j41399j80177
12231D286012j20040j4273j16023j37396l806r3523r4101p6553j506q8356r5410
$$ plain form
12220 3445025 3412563 3371452 3277110 3148657 3082573 2997154 2873632 2811400 2759319 2705047 2692933
12209 2692933 2663245 2594502 2604203 2559407 2482989 2443576 2458080 2391814 2318150 2276802 2205227
12198 2205227 2152441 2044719 1973397 1933952 1878180 1835960 1805840 1802516 1846274 1856676 1816701
12187 1816701 1840129 1768402 1777834 1743245 1665329 1661918 1745875 1810384 1827748 1886717 1913588 2014576
12175 2014576 2075988 2067190 2103709 2042437 1912902 1825852 1732962 1677583 1652081 1540086 1521181
12164 1521181 1517127 1468473 1447952 1407350 1463589 1492981 1530051 1621220 1656129 1651920 1542819
12153 1542819 1435733 1399393 1291978 1158761 1045133 938292 919973 845326 790720 795002
12143 795002 871854 867336 823297 816626 788022 782762 775794 724923 718168 732336 765910 726583
$$ packed form
12220C445025l2462m1111r4342j28453o6084q5419j23522o2232n2081n4272j2114
12209B692933k9688o8743R701m4796p6418l9413J4504o6266p3664m1348p1575
12198B205227n2786j07722p1322l9445n5772m2220l0120l324M3758J0402l9975
12187A816701K3428p1727R432l4589p7916l411Q3957O4509J7364N8969K6871J00988
12175B014576O1412q798L6519o1272j29535q7050r2890n5379k5502j11995j8905
12164A521181m054m8654k0521m0602N6239K9392L7070R1169L4909m209j09101
12153A542819j07086l6340j07415j33217j13628j06841j8319p4647n4606M282
12143G95002P6852m518m4039o671k8604n260o968n0871o755J4168L3574l9327
$$ plain form
12131 726583 695058 800279 813131 757656 721163 678298 670136 682943 682778 737725 735031 722212
12119 722212 773002 703475 660822 672737 687081 707326 717604 761664 672633 605698 640686
12108 640686 653610 602479 604704 646283 649666 644660 647724 659087 680842 705338 726445 713345
12096 713345 738520 659050 610321 627108 637996 695006 672441 605603 604777 595359 567918 604352
12084 604352 595055 546803 522563 518400 512691 486887 520984 632294 623936 531439 495324 516519
12072 516519 525562 535530 501253 448486 427311 465418 465354 434568 462525 516843 517635 509970 506460
12059 506460 529537 571967 535655 533561 561615 531790 542446 590495 627034 596727 571996 625996
12047 625996 627713 650520 678440 664624 702382 732103 692991 638471 638276 619736 621140 615481
$$ packed form
12131G26583l1525J05221J2852n5475l6493m2865q162J2807j65N4947k694j2819
12119G22212N0790o9527m2653J1915J4344K0245J0278M4060q9031o6935L4988
12108F40686J2924n1131K225M1579L383n006L064J1363K1755K4496K1107j3100
12096G13345K5175p9470m8729J6787J0888N7010k2565o6838q26r418k7441L6434
12084F04352r297m8252k4240m163n709k5804L4097J11310q358r2497l6115K1195
12072E16519R043R968l4277n2767k1175L8107o4l0786K7957N4318P92p665l510
12059E06460K3077M2430l6312k094K8054k9825J0656M8049L6539l0307k4731N4000
12047F25996J717K2807K7920j3816L7758K9721l9112n4520j95j8540J404n659
$$ plain form
12035 615481 589909 508060 457030 459081 478782 510925 522718 547216 509488 490482 502070 481626
12023 481626 434593 488221 523666 530492 544609 486586 434854 426768 333270 314551 307337 303424
12011 303424 319147 288264 344784 397532 363369 382397 365439 333750 313845 306716 325991 310118
11999 310118 305945 312419 331533 367866 378983 287633 256849 255940 303734 334559 286586 244018
11987 244018 231557 312169 328053 387140 392069 402194 403477 395198 397147 416136 384214 396690
11975 396690 419380 431548 350697 299545 344981 371744 339956 377398 458232 499423 547213
11964 547213 544115 549027 511591 517949 444760 402874 377794 389345 447601 425520 463207 424450
11952 424450 438341 467095 448479 431538 408678 424063 471480 473937 395263 349644 357178 309505
$$ packed form
12035F15481k5572q1849n1030K051J9701L2143J1793K4498l7728j9006J1588k0444
12023D81626m7033N3628L5445O826J4117n8023n1732q086r3498j8719p214l913
12011C03424J5723l0883N6520N2748l4163J9028j6958l1689j9905p129J9275j5873
11999C10118m173O474J9114L6333J1117r1350l0784r09M7794L0825m7973m2568
11987B44018j2461Q0612J5884N9087M929J0125J283q279J949J8989l1922J2476
11975C96690K2690J2168q0851n1152M5436K6763l1788L7442Q0834M1191M7790
11964E47213l098M912l7436O358p3189m1886k5080J1551N8256k2081L7687l8757
11952D24450J3891K8754j8616j6941k2860J5385M7417K457p8674m5619P534m7673
$$ plain form
11940 309505 293723 295122 314239 321019 351293 332313 338697 303774 249693 214659 254796 348806
11928 348806 391864 407534 432285 402683 377305 362866 301187 305065 433702 475365 411050
11917 411050 414178 489761 529892 518044 489680 461157 522915 564662 609690 668001 767265 847779
11905 847779 988559 1193080 1370328 1465695 1483946 1398230 1342638 1238412 1132949 967634
11895 967634 861097 782750 710665 646066 621853 586242 605461 598632 585166 550428 507138
11884 507138 467244 431929 449941 436589 371456 362829 385562 395622 423893 456584 474014 483764
11872 483764 499481 485872 406691 396851 428083 407465 460426 471193 450489 393010 380358 378444
11860 378444 391241 421201 420541 402387 402579 439599 495292 485332 439484 450271 491844 535759
$$ packed form
11940C09505j5782J399J9117O780L0274j8980O384l4923n4081l5034M0137R4010
11928C48806M3058J5670K4751k9602k5378j4439o1679L878J28637M1663o4315
11917D11050L128P5583M0131j1848k8364k8523O1758M1747M5028N8311R9264Q0514
11905H47779J40780K04521J77248R5367J8251q5716n5592j04226j05463j65315
11895I67634j06537p8347p2085o4599k4213l5611J9219o829j3466l4738m3290
11884E07138l9894l5315J8012j3352o5133q627K2733J0060K8271L2691J7430R750
11872D83764J5717j3609p9181r840L1232k0618N2961J0767k0704n7479j2652j914
11860C78444J2797K9960o60j8154J92L7020N5693r960m5848J0787M1573M3915
$$ plain form
11848 535759 557437 491166 472409 504795 458491 422365 408787 392563 368168 333678 319979
11837 319979 320275 363762 456688 512886 541037 522830 516653 502855 475660 447148 394746 398938
11825 398938 377564 383422 384891 391109 411390 401520 400919 457545 427392 444607 468839 476115 485758
11812 485758 468201 431502 423646 432472 440819 411087 431790 441991 418662 415824 376123 438257
11800 438257 479938 502518 520846 511772 433062 365086 393034 369289 360779 402338 459949 520877
11788 520877 520479 524025 517480 470194 491116 468192 457408 495541 538414 547145 515125 483202
11776 483202 549129 644712 631686 577233 603911 619916 649279 709635 681618 612339 579774
11765 579774 611390 617460 548089 530565 533630 562875 640056 623044 608250 523102 443777 409361
$$ packed form
11848E35759K1678o6271j8757L2386m6304l6126j3578j6224k4395l4490j3699
11837C19979K96M3487R2926N6198K8151j8207o177j3798k7195k8512n2402M192
11825C98938k1374N858J469O218K0281r870o01N6626l0153J7215K4232P276R643
11812D85758j7557l6699p856Q826Q347k9732K0703J0201k3329k838l9701O2134
11800D38257M1681K2580J8328r074p8710o7976K7948k3745q510M1559N7611O0928
11788E20877l98L546o545m7286K0922k2924j0784L8133M2873Q731l2020l1923
11776D83202O5927R5583j3026n4453K6678J6005K9363O0356k8017o9279l2565
11765E79774L1616O070o9371j7524L065K9245P7181j7012j4794q5148p9325l4416
$$ plain form
11753 409361 405114 397181 416815 484810 527736 522515 582551 535580 498139 521429 544925 541574
11741 541574 531301 506402 517656 566507 626583 668577 643296 662857 694230 665976 646028
11730 646028 617406 522322 498962 489859 522121 550210 536298 513132 589003 610822 571811 555703
11718 555703 574592 539100 538463 570422 539645 526394 492909 494845 528108 548540 558983 545309
11706 545309 544508 543843 524865 544370 479506 550456 611088 624671 632368 643933 591825 562483
11694 562483 574165 490843 489728 569251 622387 650357 682263 681978 660421 618108 540918 584998
11682 584998 597348 563287 551801 566509 618196 616557 656889 662918 624019 646306 699464 720808
11670 720808 718631 698813 716852 677849 603512 642515 688013 606004 566990 580215 556825 597215
$$ packed form
11753D09361m247p933J9634O7995M2926n221O0036m6971l7441K3290K3496l351
11741E41574j0273k4899J1254M8851O0076M1994k5281J9561L1373k8254j9948
11730F46028k8622r5084k3360r103L2262K8089j3912k3166P5871K1819l9011j6108
11718E55703J8889l5492o37L1959l0777j3251l3485J936L3263K0432J0443j3674
11706E45309q01o65j8978J9505o4864P0950O0632J3583P697J1565n2108k9342
11694E62483J1682q3322j115P9523N3136K7970L1906k85k1557m2313p7190M4080
11682E84998J2350l4061j1486J4708N1687j639M0332O029l8899K2287N3158K1344
11670G20808k177j9818J8039l9003p4337L9003M5498q2009l9014J3225k3390M0390
$$ plain form
11658 597215 640674 674628 671355 648585 625191 652629 724687 811956 810669 772214 722975 757020
11646 757020 765429 775418 766783 727118 661661 618522 615301 632311 616961 614116 609002 635786 668071
11633 668071 669897 682877 632777 582454 609952 621318 697079 728650 761953 776440 725089 739195
11621 739195 718278 692762 689078 701425 691401 682113 665587 631467 629334 624298 646706 687927
11609 687927 692091 680119 737546 813948 846488 843180 790377 759846 706790 662428 656896 714070
11597 714070 705787 711982 675195 657574 702541 767747 785724 751353 747015 796773 792001 780137
11585 780137 747718 739003 714415 745801 766861 804996 832078 833082 755357 741391 700767 652690
11573 652690 659440 700403 779283 781847 817560 820427 800724 798445 834522 779202 766213 784022
$$ packed form
11658E97215M3459L3954l273k2770k3394K7438P2058Q7269j287l8455m9239L4045
11646G57020Q409R989q635l9665o5457m3139l221J7010j5350k845n114K6784L2285
11633F68071J826J2980n0100n0323K7498J1366P5761L1571L3303J4487n1351J4106
11621G39195k0917k5516l684J2347j0024r288j6526l4120k133n036K2408M1221
11609F87927M164j1972N7427P6402L2540l308n2803l0531n3056m4362n532N7174
11597G14070q283O195l6787j7621M4967O5206J7977l4371m338M9758m772j1864
11585G80137l2419q715k4588L1386K1060L8135K7082J004p7725j3966m0624m8077
11573F52690O750M0963P8880K564L5713K867j9703k279L6077n5320j2989J7809
$$ plain form
11561 784022 775092 820703 888289 923521 914364 923865 887858 870708 849408 854335 897807 890945
11549 890945 865944 832871 858881 854376 801558 825050 879493 905988 919906 929545 924736 918004
11537 918004 906672 924046 928750 909989 913984 895225 932536 1009501 1009045 968130 995315 1027733
11525 1027733 963686 917079 904774 873089 902708 974791 1055299 1012196 966101 962691 1016769
11514 1016769 1045923 1026459 997260 925574 923629 932250 956167 960789 947391 946042 943328 893145
11502 893145 845722 876142 849308 837950 860271 927861 1029406 1075448 1056272 999684 1002221
11491 1002221 1022664 1012226 1047276 1003164 988387 989425 950347 968972 1006802 1035746 1022469
11480 1022469 985976 1036867 1118116 1174542 1233223 1184959 1104097 1029277 1027229 1037699 1038493 1080802
$$ packed form
11561G84022q930M5611O7586L5232r157R501l6007j7150k1300M927M3472o862
11549H90945k5001l3073K6010m505n2818K3492N4443K6495J3918R639m809o732
11537I18004j1332J7374M704j8761L995j8759L7311P6965m56m0915K7185L2418
11525A027733o4047m6607j2305l1685K9619P2083Q0508m3103m6095l410N4078
11514A016769K9154j9464k9199p1686j945Q621K3917M622j3398j349k714n0183
11502H93145m7423L0420k6834j1358K2321O7590J01545M6042j9176n6588K537
11491A002221K0443j0438L5050m4112j4777J038l9078J8625L7830K8944j3277
11480A022469l6493N0891Q1249N6426N8681m8264q0862p4820k048J0470P94M2309
$$ plain form
11468 1080802 1175228 1196429 1186833 1144646 1170039 1193610 1202652 1135977 1109748 1171665 1196373 1147547
11456 1147547 1135781 1216666 1188526 1162577 1172540 1151177 1207690 1197386 1175029 1204579 1248411
11445 1248411 1309342 1313210 1288525 1264067 1230910 1263979 1281502 1289105 1295971 1289375 1265039 1271015
11433 1271015 1380035 1426301 1399712 1397591 1362707 1339244 1349525 1346614 1318769 1301542 1321266
11422 1321266 1278580 1240807 1210137 1275529 1314660 1278272 1338421 1345837 1321562 1309780 1359762
11411 1359762 1341545 1341233 1360084 1327929 1348572 1315167 1322102 1352230 1335289 1402498 1415470 1438991
11399 1438991 1437066 1450332 1450866 1411366 1415146 1425151 1436993 1451757 1413053 1467324 1470670 1534023
11387 1534023 1545667 1513111 1491476 1472374 1488456 1515123 1513595 1510724 1538809 1570080 1583800 1529506
$$ packed form
11468A080802R4426K1201r596m2187K5393K3571R042o6675k6229O1917K4708m8826
11456A147547j1766Q0885k8140k5949R963k1363N6513j0304k2357K9550M3832
11445A248411O0931L868k4685k4458l3157L3069J7523P603O866o596k4336N976
11433A271015J09020M6266k6589k121l4884k3463J0281k911k7845j7227J9724
11422A321266m2686l7773l0670O5392L9131l6388O0149P416k4275j1782M9982
11411A359762j8217l12J8851l2155K0643l3405O935L0128j6941O7209J2972K3521
11399A438991j925J3266N34l9500L780J0005J1842J4764l8704N4271L346O3353
11387A534023J1644l2556k1635j9102J6082K6667j528k871K8085L1271J3720n4294
$$ plain form
11375 1529506 1470255 1509956 1551455 1529430 1519044 1553547 1560884 1631469 1672062 1692484 1678088
11364 1678088 1691883 1697233 1673102 1632642 1594348 1604764 1626633 1593003 1568837 1571956 1605795 1663980
11352 1663980 1693362 1663457 1659606 1712061 1715002 1684219 1654060 1666069 1710880 1735884 1769431 1834552
11340 1834552 1844864 1820838 1752704 1735806 1745051 1801230 1755334 1753974 1750083 1774804 1765195 1830164
11328 1830164 1851156 1842980 1871462 1862100 1850421 1845680 1856005 1883268 1870455 1891995 1843054 1881079
11316 1881079 1919962 1975742 1950332 1860076 1885585 1909368 1905319 1936401 1913847 1881004 1898962
11305 1898962 1901963 1975000 1988537 2041468 2119165 2146866 2162330 2154352 2154946 2132732 2102680 2092561
11293 2092561 2115743 2063310 2028863 2083622 2121395 2141316 2101120 2128081 2168375 2161810 2132359
$$ packed form
11375A529506n9251L9701M1499k2025j0386L4503P337P0585M0593K0422j4396
11364A678088J3795N350k4131m0460l8294J0416K1869l3630k4166L119L3839N8185
11352A663980K9382k9905l851N2455K941l0783l0159J2009M4811K5004L3547O5121
11340A834552J0312k4026o8134j6898R245N6179m5896j360l891K4721r609O4969
11328A830164K0992q176K8482r362j1679m741J0325K7263j2813K1540m8941L8025
11316A881079L8883N5780k5410r0256K5509K3783m049L1082k2554l2843J7958
11305A898962L001P3037J3537N2931P7697K7701J5464p978N94k2214l0052j0119
11293B092561K3182n2433l4447N4759L7773J9921m0196K6961M0294o565k9451
$$ plain form
11282 2132359 2170991 2177339 2149123 2152212 2175397 2155421 2164979 2184922 2209504 2263565 2233497 2212575
11270 2212575 2222845 2234529 2314040 2378993 2400518 2375218 2387045 2439283 2422798 2425064 2479509
11259 2479509 2457648 2421720 2456627 2502011 2451428 2448398 2449328 2440864 2456960 2537710 2602718 2550895
11247 2550895 2535003 2517895 2514404 2536076 2500134 2535204 2550967 2559429 2550817 2561154 2621072 2682085
11235 2682085 2652270 2639201 2655395 2686222 2695867 2678690 2717511 2746858 2742830 2741868 2754062 2753407
11223 2753407 2755730 2802491 2813425 2815592 2856083 2873245 2837733 2850927 2883539 2890639 2942313 3008408
11211 3008408 3004789 2996836 2975603 3001799 3007386 2925178 2912218 2946181 2975812 3036485 3091424 3102828
11199 3102828 3068280 3092819 3138904 3169974 3114154 3099300 3130535 3114129 3051265 3045690 3129909
$$ packed form
11282B132359L8632O348k8216L089K3185j9976R558J9943K4582N4061l0068k0922
11270B212575J0270J1684P9511O4953K1525k5300J1827N2238j6485K266N4445
11259B479509k1861l5928L4907M5384n0583l030R30q464J6096Q0750O5008n1823
11247B550895j5892j7108l491K1672l5942L5070J5763Q462q612J0337N9918O1013
11235B682085k9815j3069J6194L0827R645j7177L8821K9347m028r62J2194o55
11223B753407K323M6761J0934K167M0491J7162l5512J3194L2612P100N1674O6095
11211C008408l619p953k1233K6196N587q2208j2960L3963K9631O0673N4939J1404
11199C102828l4548K4539M6085L1070n5820j4854L1235j6406o2864n575Q4219
$$ plain form
11188 3129909 3170698 3149784 3185714 3251661 3285374 3230625 3232289 3191636 3169850 3218195 3322971
11177 3322971 3314955 3312407 3344773 3371124 3328085 3326833 3377521 3444257 3430833 3436172 3480242 3483572
11165 3483572 3476453 3499673 3496682 3488476 3528108 3540697 3571820 3589257 3553344 3533042 3613861 3657774
11153 3657774 3705071 3739011 3711030 3700886 3734752 3789322 3788784 3793838 3755927 3761365 3818913 3810701
11141 3810701 3797514 3787717 3795156 3808114 3878890 3931310 3913454 3928799 3951682 3987874 4026223 4050916
11129 4050916 4069898 4099037 4086132 4083399 4080988 4098399 4100920 4093042 4136361 4146314 4172903 4244008
11117 4244008 4261931 4270851 4326692 4343121 4363909 4337828 4257219 4304833 4317871 4347670 4353059 4368709
11105 4368709 4418334 4438988 4435498 4456010 4468669 4477266 4459623 4458479 4487418 4495113 4543292 4552400
$$ packed form
11188C129909M0789k0914L5930O5947L3713n4749J664m0653k1786M8345J04776
11177C322971q016k548L2366K6351m3039j252N0688O6736j3424N339M4070L330
11165C483572p119K3220k991q206L9632J2589L1123J7437l5913k0302Q0819M3913
11153C657774M7297L3940k7981j0144L3866N4570n38N054l7911N438N7548q212
11141C810701j3187r797P439J2958P0776N2420j7856J5345K2883L6192L8349K4693
11129D050916J8982K9139j2905k733k411J7411K521p878M3319R953K6589P1105
11117D244008J7923Q920N5841J6429K0788k6081q0609M7614J3038K9799N389J5650
11105D368709M9625K0654l490K0512J2659Q597j7643j144K8939P695M8179R108
$$ plain form
11093 4552400 4570329 4596562 4615406 4640561 4665779 4720658 4793325 4834692 4878051 4871131 4918799
11082 4918799 4943719 4910005 4886300 4913964 4943795 4971997 4980929 4981802 4998240 5031246 5093623 5088561
11070 5088561 5113327 5111027 5064634 5055634 5132843 5226784 5267048 5256161 5216056 5222151 5306003 5341737
11058 5341737 5347914 5378127 5398581 5384707 5426033 5470998 5429718 5444681 5529866 5517164 5558268
11047 5558268 5595752 5552512 5561972 5592582 5663762 5680418 5679260 5729922 5780664 5779998 5793521 5811675
11035 5811675 5813193 5841597 5846180 5882244 5896767 5887038 5852923 5858976 5890740 5949281 6028902 6097827
11023 6097827 6203128 6209723 6220376 6247341 6284344 6302835 6301654 6374688 6482653 6479396 6467950
11012 6467950 6462487 6494431 6532109 6569939 6583152 6620240 6614726 6599739 6607625 6656073 6679985 6701864
$$ packed form
11093D552400J7929K6233J8844K5155K5218N4879P2667M1367M3359o920M7668
11082D918799K4920l3714k3705K7664K9831K8202Q932Q73J6438L3006O2377n062
11070E088561K4766k300m6393r000P7209R3941M0264j0887m0105O095Q3852L5734
11058E341737O177L0213K0454j3874M1326M4965m1280J4963Q5185j2702M1104
11047E558268L7484m3240R460L0610P1180J6656j158N0662N0742o66J3523J8154
11035E811675J518K8404M583L6064J4523r729l4115O053L1764N8541P9621O8925
11023F097827J05301O595J0653K6965L7003J8491j181P3034J07965l257j1446
11012F467950n463L1944L7678L7830J3213L7088n514j4987P886M8448K3912K1879
$$ plain form
11000 6701864 6695347 6723657 6741969 6715855 6801732 6852730 6913810 6977365 7020329 6996759 6950092
10989 6950092 6981002 6969285 7028250 7063346 7113023 7146431 7165899 7202280 7256447 7351853 7319365
10978 7319365 7256851 7239301 7292095 7343146 7416442 7483104 7524940 7580515 7603515 7636106 7666637
10967 7666637 7692447 7696706 7715346 7791201 7827011 7868451 7878640 7934252 7957735 7950938 7922391 7939405
10955 7939405 7993784 8103444 8180917 8222154 8204584 8205679 8311375 8317098 8249988 8265292 8334411
10944 8334411 8392229 8438632 8453003 8477853 8509358 8577762 8600225 8606888 8646808 8749984 8752638
10933 8752638 8710129 8734466 8769439 8812174 8872552 8927567 8945167 8976006 9089387 9154584 9156060
10922 9156060 9102257 9128685 9205531 9251417 9278467 9303090 9359470 9442939 9520836 9578801 9571983
$$ packed form
11000F701864o517K8310J8312k6114Q5877N0998O1080O3555M2964k3570m6667
10989F950092L0910j1717N8965L5096M9677L3408J9468L6381N4167R5406l2488
10978G319365o2514j7550N2794N1051P3296O6662M1836N5575K3000L2591L0531
10967G666637K5810M259J8640P5855L5810M1440J0189N5612K3483o797k8547J7014
10955G939405N4379J09660P7473M1237j7570J095J05696N723o7110J5304O9119
10944H334411N7818M6403J4371K4850L1505O8404K2463O663L9920J03176K654
10933H752638m2509K4337L4973M2735O0378N5015J7600L0839J13381O5197J476
10922I156060n3803K6428P6846M5886K7050K4623N6380Q3469P7897N7965o818
$$ plain form
10911 9571983 9543906 9583532 9579944 9573629 9627102 9686073 9772646 9845231 9858867 9892151 9912376 9979479
10899 9979479 10059042 10029076 10027109 10077369 10102938 10079174 10076304 10133441 10191153 10231512 10298488 10331760
10887 10331760 10317953 10343372 10446913 10436890 10459755 10574939 10687896 10738382 10719444 10754967
10877 10754967 10788678 10803870 10861435 10890276 10918322 10990661 11054334 11088992 11118880 11142631 11199875
10866 11199875 11234709 11251040 11331730 11348288 11360399 11370691 11401924 11434998 11431882 11432394 11486434 11553729
10854 11553729 11594512 11617713 11685884 11698831 11681985 11741760 11859285 11969580 11989306 12081663 12121640
10843 12121640 12144167 12164704 12223291 12253716 12278017 12304047 12310811 12361286 12429679 12525554 12592951
10832 12592951 12540219 12541319 12621720 12750644 12767968 12767377 12835921 12831835 12847469 12880160 12895020 13001841
$$ packed form
10911I571983k8077L9626l588o315N3473N8971Q6573P2585J3636L3284K0225O7103
10899I979479P9563k9966j967N0260K5569k3764k870N7137N7712M0359O6976L3272
10887A0331760j3807K5419J03541j0023K2865J15184J12957N0486j8938L5523
10877A0754967L3711J5192N7565K8841K8046P2339O3673L4658K9888K3751N7244
10866A1199875L4834J6331Q0690J6558J2111J0292L1233L3074l116N12N4040O7295
10854A1553729M0783K3201O8171J2947j6846N9775J17525J10295J9726R2357L9977
10843A2121640K2527K0537N8587L0425K4301K6030O764N0475O8393R5875O7397
10832A2592951n2732J100Q0401J28924J7324n91O8544m086J5634L2691J4860J06821
$$ plain form
10820 13001841 13033582 13052333 13162080 13259727 13270189 13287970 13319297 13328748 13349724 13414907 13485261
10809 13485261 13486931 13484425 13549688 13639551 13674992 13714975 13775296 13814931 13812629 13772296 13804687 13899658
10797 13899658 13994359 14026901 14046652 14056074 14093262 14122302 14112573 14153930 14183840 14277536 14372178
10786 14372178 14386778 14447890 14484621 14551362 14613196 14645396 14634366 14656250 14700095 14697952 14681367
10775 14681367 14701734 14765488 14805176 14857739 14835047 14827068 14851779 14939862 15045165 15103634 15184868
10764 15184868 15265955 15273683 15332849 15400728 15443218 15455039 15396282 15361152 15435057 15511347 15583236
10753 15583236 15603435 15608943 15681553 15734107 15799301 15800267 15829996 15807813 15852091 15863985 15891807 15948092
10741 15948092 16020167 16031383 15989969 15997962 15946673 15977659 16072653 16152446 16165766 16230053 16294342
$$ packed form
10820A3001841L1741J8751J09747R7647J0462J7781L1327R451K0976O5183P0354
10809A3485261J670k506O5263Q9863L5441L9983O0321L9635k302m0333L2391R4971
10797A3899658R4701L2542J9751R422L7188K9040r729M1357K9910R3696R4642
10786A4372178J4600O1112L6731O6741O1834L2200j1030K1884M3845k143j6585
10775A4681367K0367O3754L9688N2563k2692p979K4711Q8083J05303N8469Q1234
10764A5184868Q1087P728N9166O7879M2490J1821n8757l5130P3905P6290P1889
10753A5583236K0199N508P2610N2554O5194R66K9729k2183M4278J1894K7822N6285
10741A5948092P2075J1216m1414P993n1289L0986R4994P9793J3320O4287O4289
$$ plain form
10730 16294342 16345264 16404777 16410970 16488668 16559510 16600931 16581999 16548895 16580155 16613854 16631984
10719 16631984 16702779 16763111 16813319 16895285 16879612 16842145 16823672 16913541 16962874 16974642 16987493
10708 16987493 16962495 16994401 17072583 17190187 17194599 17165434 17169800 17196099 17269716 17395273 17475636
10697 17475636 17452217 17463850 17495171 17517445 17537889 17517586 17542955 17607745 17637312 17698904 17732713
10686 17732713 17749576 17733553 17757411 17797730 17850012 17937675 17948486 17904034 17925654 18035592 18092387
10675 18092387 18102610 18086255 18070723 18149524 18179630 18203824 18250972 18195331 18193384 18252814 18306886
10664 18306886 18345710 18323609 18309990 18282141 18294162 18343000 18391761 18455193 18532901 18554110 18554721
10653 18554721 18555389 18565981 18532077 18604230 18673215 18706517 18681403 18698146 18683633 18691098 18713923 18796892
$$ packed form
10730A6294342N0922N9513O193P7698P0842M1421j8932l3104L1260L3699J8130
10719A6631984P0795O0332N0208Q1966j5673l7467j8473Q9869M9333J1768J2851
10708A6987493k4998L1906P8182J17604M412k9165M366K6299P3617J25557Q0363
10697A7475636k3419J1633L1321K2274K0444k0303K5369O4790K9567O1592L3809
10686A7732713J6863j6023K3858M0319N2282Q7663J0811m4452K1620J09938N6795
10675A8092387J0223j6355j5532P8801L0106K4194M7148n5641j947N9430N4072
10664A8306886L8824k2101j3619k7849J2021M8838M8761O3432P7708K1209O11
10653A8554721O68J0592l3904P2153O8985L3302k5114J6743j4513P465K2825Q2969
$$ plain form
10641 18796892 18845905 18817547 18867606 18930601 18964897 18929595 18887797 18871662 18865488 18872326 18916021
10630 18916021 18953337 18889236 18896484 18984493 19004322 18931372 18924227 18945510 18950952 18943167 18968030 18989402
10618 18989402 19079596 19198097 19217502 19199197 19146473 19193493 19245936 19238425 19250060 19244239 19262445
10607 19262445 19264223 19293401 19356377 19420009 19542720 19768117 20030560 20295474 20610113 20879344
10597 20879344 21050396 20934515 20723051 20465219 20119650 19918580 19824572 19751816 19640287 19609199
10587 19609199 19670225 19577941 19598338 19618381 19576261 19495069 19466963 19474333 19497963 19442234 19384465
10576 19384465 19346639 19307125 19304508 19335946 19273419 19234220 19253431 19271267 19330052 19406739 19399238
10565 19399238 19307256 19241632 19198422 19190297 19177437 19209763 19190689 19155996 19171057 19247222 19257455
$$ packed form
10641A8796892M9013k8358N0059O2995L4296l5302m1798j6135o174O838M3695
10630A8916021L7316o4101P248Q8009J9829p2950p145K1283N442p785K4863K1372
10618A8989402R0194J18501J9405j8305n2724M7020N2443p511J1635n821J8206
10607A9262445J778K9178O2976O3632J22711K25397K62443K64914L14639K69231
10597B0879344J71052j15881k11464k57832l45569k01070r4008p2756j11529l1088
10587A9609199O1026r2284K0397K0043m2120q1192k8106P370K3630n5729n7769
10576A9384465l7826l9514k617L1438o2527l9199J9211J7836N8785P6687p501
10565A9399238r1982o5624m3210q125j2860L2326j9074l4693J5061P6165J0233
$$ plain form
10554 19257455 19238053 19212846 19214193 19171015 19111188 19130696 19114599 19111831 19112126 19092482 19046710 18956725
10542 18956725 18960953 19005980 19043433 19032845 19101626 19162679 19186052 19140585 19086608 19033930 19036070
10531 19036070 19098893 19095752 19057464 19011470 18948979 18940892 18962910 18973917 19025273 19035115 18989048 18996174
10519 18996174 18985570 19003317 18935475 18841152 18876946 18903016 18912055 18882130 18870613 18821910 18807823
10508 18807823 18769207 18745644 18741611 18730293 18732738 18796346 18838604 18869522 18856311 18801850 18786107
10497 18786107 18731762 18708114 18635162 18596520 18614692 18664467 18668354 18627925 18591367 18571351 18503492
10486 18503492 18507078 18444756 18401173 18402564 18426263 18392433 18331329 18312641 18323746 18353140 18355712 18364697
10474 18364697 18335999 18334660 18303672 18244288 18181281 18148450 18200966 18169417 18196635 18232686 18294972
$$ packed form
10554A9257455j9402k5207J347m3178n9827J9508j6097k768K95j9644m5772q9985
10542A8956725M228M5027L7453j0588O8781O1053K3373m5467n3977n2678K140
10531A9036070O2823l141l8288m5994o2491q087K2018J1007N1356R842m6067P126
10519A8996174j0604J7747o7842r4323L5794K6070R039k9925j1517m8703j4087
10508A8807823l8616k3563m033j1318K445O3608M2258L0918j3211n4461j5743
10497A8786107n4345k3648p2952l8642J8172M9775L887m0429l6558k0016o7859
10486A8503492L586o2322m3583J391K3699l3830o1104j8688J1105K9394K572Q985
10474A8364697k8698j339l0988n9384o3007l2831N2516l1549K7218L6051O2286
$$ plain form
10463 18294972 18259374 18189172 18156967 18137780 18172448 18245366 18247107 18250959 18307871 18351140 18407724
10452 18407724 18500087 18559180 18511123 18423016 18385636 18310511 18176744 18024328 17894889 17821281
10442 17821281 17786361 17748209 17698777 17637697 17607736 17626117 17624108 17586874 17612187 17597918 17589993
10431 17589993 17512375 17484742 17497023 17442082 17361222 17213574 17206102 17182768 17126690 17125470 16986078
10420 16986078 16942401 16937383 16950626 16944288 16938362 16939385 16984802 16956326 16831768 16757069 16752311 16758505
10408 16758505 16733576 16640040 16593586 16514029 16458938 16407878 16418967 16398105 16334107 16293893 16317699
10397 16317699 16302496 16329745 16308089 16280650 16244966 16184242 16129639 16126683 16149582 16128689 16110471
10386 16110471 15988701 15923670 15902025 15854438 15803298 15809689 15842311 15824258 15833973 15790482 15670771
$$ packed form
10463A8294972l5598p0202l2205j9187L4668P2918J741L852N6912M3269N6584
10452A8407724R2363N9093m8057q8107l7380p5125j33767j52416j29439p3608
10442A7821281l4920l8152m9432o1080k9961J8381k009l7234K5313j4269p925
10431A7589993p7618k7633J2281n4941q0860j47648p472k3334n6078j220j39392
10420A6986078m3677n018J3243o338n926J023M5417k8476j24558p4699m758O194
10408A6758505k4929r3536m6454p9557n5091n1060J1089k0862o3998m0214K3806
10397A6317699j5203K7249k1656k7439l5684o0724n4603k956K2899k0893j8218
10386A6110471j21770o5031k1645m7587n1140O391L2622j8053R715m3491j19711
$$ plain form
10375 15670771 15615938 15604170 15532249 15492341 15452464 15470312 15446153 15409720 15360425 15369000 15427477
10364 15427477 15435067 15399743 15334088 15255338 15238110 15292779 15321145 15314202 15240484 15188913 15206731
10353 15206731 15107456 15065028 15080891 15063315 15062355 15057723 15054975 14975823 14919082 14891425 14886496 14829699
10341 14829699 14767577 14749059 14770857 14724126 14676487 14656059 14584380 14540344 14559091 14642310 14687027
10330 14687027 14685476 14674780 14588297 14558497 14484827 14473649 14433483 14358005 14328547 14280425 14280132 14288369
10318 14288369 14303669 14312506 14290392 14334051 14264348 14215722 14218301 14241747 14221210 14276340 14325739
10307 14325739 14371136 14379906 14286761 14224460 14148570 14076818 14086982 14049334 14043017 14081491 14062529
10296 14062529 14017578 13905844 13828125 13765324 13769701 13720025 13726592 13745875 13767330 13758642 13714995
$$ packed form
10375A5670771n4833j1768p1921l9908l9877J7848k4159l6433m9295Q575N8477
10364A5427477P590l5324o5655p8750j7228N4669K8366o943p3718n1571J7818
10353A5206731r9275m2428J5863j7576r60m632k748p9152n6741k7657m929n6797
10341A4829699o2122j8518K1798m6731m7639k0428p1679m4036J8747Q3219M4717
10330A4687027j551j0696q6483k9800p3670j1178m0166p5478k9458m8122k93Q237
10318A4288369J5300Q837k2114M3659o9703m8626K579K3446k0537N5130M9399
10307A4325739M5397Q770r3145o2301p5890p1752J0164l7648o317L8474j8962
10296A4062529m4951j11734p7719o2801M377m9676O567J9283K1455q688m3647
$$ plain form
10285 13714995 13722307 13716286 13677907 13608686 13526296 13530044 13500109 13474322 13501416 13512538 13520751 13498216
10273 13498216 13551573 13570368 13525497 13504209 13479843 13515845 13577252 13583080 13590588 13629285 13660021
10262 13660021 13686624 13705260 13757775 13881941 14083396 14419174 14960179 15699437 16640832 17723927
10252 17723927 18503787 18587576 17893855 16995737 16232778 15730673 15371562 15031017 14840274
10243 14840274 14722619 14553091 14443545 14398186 14384050 14392266 14434218 14481467 14668806 15012367
10233 15012367 15365325 15688397 15975463 16111940 15991612 15674515 15404986 15182697 15055621
10224 15055621 14987218 14996479 15057311 15102940 15197112 15356855 15596637 15860766 16226679 16505301
10214 16505301 16594346 16443601 16324356 16222668 16170682 16194280 16301559 16501420 16822629 17318876
$$ packed form
10285A3714995P312o021l8379o9221q2390L748k9935k5787K7094J1122Q213k2535
10273A3498216N3357J8795m4871k1288k4366L6002O1407N828P508L8697L0736
10262A3660021K6603J8636N2515J24166K01455L35778N41005P39258R41395J083095
10252A7723927P79860Q3789o93721q98118p62959n02105l59111l40545j90743
10243A4840274j17655j69528j09546m5359j4136Q216M1952M7249J87339L43561
10233A5012367L52958L23072K87066J36477j20328l17097k69529k22289j27076
10224A5055621o8403R261O0832M5629R4172J59743K39782K64129L65913K78622
10214A6505301Q9045j50745j19245j01688n1986K3598J07279J99861L21209M96247
$$ plain form
10204 17318876 17996791 18750217 19575754 20429410 21370069 22496520 23926078 25518540 27130268
10195 27130268 28598360 30077985 31816626 33862406 36405690 39624811 44007815 50111610
10187 50111610 58673908 71056323 89434996 117081791 158182930 215954752 287094528
10180 287094528 356792808 400599797 395472658 346330053 285248480 232744785 191723802
10173 191723802 160101603 136057173 117822469 103882977 93054167 84564368 77880179
10166 77880179 72594902 68540174 65420928 62899459 60595611 58129482 55414486 52649353
10158 52649353 50113995 47951820 46152804 44622712 43247129 42133290 41111690 40205847
10150 40205847 39345541 38355700 37341013 36399513 35492575 34663558 33792418 33001640 32422222
$$ packed form
10204A7318876O77915P53426Q25537Q53656R40659J126451J429558J592462J611728
10195B7130268J468092J479625J738641K045780K543284L219121M383004O103795
10187E0111610Q562298J2382415J8378673K7646795M1101139N7771822P1139776
10180B87094528O9698280M3806989n127139m9142605o1081573n2503695m1020983
10173A91723802l1622199k4044430j8234704j3939492j0828810q489799o684189
10166G7880179n285277m054728l119246k521469k303848k466129k714996k765133
10158E2649353k535358k162175j799016j530092j375583j113839j021600r05843
10150D0205847q60306r89841j014687r41500r06938q29017q71140p90778n79418
$$ plain form
10141 32422222 31865864 31269379 30687782 30253053 29874229 29473700 29164026 28818650 28405550
10132 28405550 27891241 27360752 26910562 26425241 25924182 25436988 24999131 24496852 23986033
10123 23986033 23567674 23113045 22721680 22249121 21860440 21451243 21054663 20682565 20330864
10114 20330864 20027912 19767625 19498566 19213237 18883256 18602616 18369655 18110665 17881115
10105 17881115 17675956 17466817 17277512 17147144 16989232 16844990 16655750 16417525 16239847
10096 16239847 16099907 15960656 15740587 15518405 15325330 15151331 14988731 14815169 14615319
10087 14615319 14473237 14388629 14304774 14125872 13832025 13650303 13479047 13290714 13138647 13051092
10077 13051092 12984442 12894704 12780011 12659586 12532981 12411786 12256447 12095152 11944880 11854053
$$ packed form
10141C2422222n56358n96485n81597m34729l78824m00529l09674l45376m13100
10132B8405550n14309n30489m50190m85321n01059m87194m37857n02279n10819
10123B3986033m18359m54629l91365m72559l88681m09197l96580l72098l51701
10114B0330864l02952k60287k69059k85329l29981k80640k32961k58990k29550
10105A7881115k05159k09139j89305j30368j57912j44242j89240k38225j77678
10096A6239847j39940j39251k20069k22182j93075j73999j62600j73562j99850
10087A4615319j42082q4608q3855j78902k93847j81722j71256j88333j52067q7555
10077A3051092o6650q9738j14693j20425j26605j21195j55339j61295j50272r0827
$$ plain form
10067 11854053 11733763 11532275 11434156 11358631 11239680 11149309 11071064 10987700 10851508 10784540
10057 10784540 10748090 10679126 10570941 10415126 10278450 10180127 10152937 10149430 10034704 9865352
10047 9865352 9689966 9541189 9474654 9478060 9424166 9403555 9359130 9331168 9279793 9321394 9302442
10036 9302442 9183706 9119484 9126479 9108977 9051070 9064629 9022429 8919216 8748532 8646599 8591306
10025 8591306 8534643 8475537 8367466 8244922 8142412 8022046 7936064 7834696 7717121 7684552
10015 7684552 7645604 7639586 7626333 7580998 7497348 7476381 7488503 7409964 7356763 7294561 7199530
10004 7199530 7085271 7029696 7064557 7069303 7047621 6953468 6814868 6736945 6733018 6714452 6749090
9993 6749090 6708756 6700306 6709848 6657818 6608137 6602031 6568044 6517558 6500712 6481540 6443710 6467078
$$ packed form
10067A1854053j20290k01488r8119p5525j18951r0371p8245q3364j36192o6968
10057A0784540l6450o8964j08185j55815j36676r8323k7190l507j14726j69352
10047I865352j75386j48777o6535L406n3894k0611m4425k7962n1375M1601j8952
10036I302442j18736o4222O995j7502n7907J3559m2200j03213j70684j01933n5293
10025H591306n6663n9106j08071j22544j02510j20366q5982j01368j17575l2569
10015G684552l8948o018j3253m5335q3650k0967J2122p8539n3201o2202r5031
10004G199530j14259n5575L4861M746k1682r4153j38600p7923l927j8566L4638
9993F749090m0334q450R542n2030m9681o106l3987n0486j6846j9172l7830K3368
$$ plain form
9981 6467078 6437924 6412009 6407115 6342071 6277697 6215600 6189148 6230440 6244814 6237052 6165073 6134743
9969 6134743 6130517 6149718 6102244 6064469 6013057 5956251 5994024 6017267 5968327 5875143 5915011 5888972
9957 5888972 5821295 5877843 5898144 5822265 5807752 5839900 5805819 5764388 5725626 5728602 5641315 5556539
9945 5556539 5536565 5552132 5519715 5531574 5546274 5492920 5463659 5475327 5471370 5446139 5428607 5446699
9933 5446699 5451578 5497278 5510088 5479375 5486130 5412193 5376653 5388447 5351638 5300447 5191338 5185190
9921 5185190 5167801 5146900 5141715 5142917 5110962 5034744 4977847 4966025 4973528 4961915 4934837 4909165
9909 4909165 4933846 4952322 4898316 4882210 4892896 4833884 4791226 4784389 4843804 4824009 4824722 4801142
9897 4801142 4750924 4663597 4657515 4660023 4619617 4631461 4614573 4582426 4525179 4518066 4490466 4497410
$$ packed form
9981F467078k9154k5915m894o5044o4374o2097k6452M1292J4374p762p1979l0330
9969F134743m226J9201m7474l7775n1412n6806L7773K3243m8940r3184L9868k6039
9957E888972o7677N6548K0301p5879j4513L2148l4081m1431l8762K976q7287q4776
9945E556539j9974J5567l2417J1859J4700n3354k9261J1668l957k5231j7532J8092
9933E446699M879M5700J2810l0713O755p3937l5540J1794l6809n1191j09109o148
9921E185190j7389k0901n185J202l1955p6218n6897j1822P503j1613k7078k5672
9909D909165K4681J8476n4006j6106J0686n9012m2658o837N9415j9795P13k3580
9897D801142n0218q7327o082K508m0406J1844j6888l2147n7247p113k7600O944
$$ plain form
9885 4497410 4610713 4711643 4693890 4620413 4537980 4454267 4456903 4460694 4468410 4493412 4424346 4344789
9873 4344789 4335938 4430634 4354969 4270473 4250462 4232619 4186551 4157038 4170743 4184604 4132180 4123362
9861 4123362 4080481 4022610 3976876 3960977 3959311 3988389 4014782 3992336 4017816 4015227 3993623 3961757
9849 3961757 3948412 3961959 3959956 3892116 3938669 3971715 3905559 3819437 3749304 3741917 3686345 3665601
9837 3665601 3664750 3651786 3694839 3675314 3661831 3692044 3698401 3649596 3651694 3686327 3688286 3657918
9825 3657918 3580767 3516561 3529272 3543652 3552203 3550285 3531933 3455530 3385942 3443458 3422120 3386414
9813 3386414 3337529 3404618 3441578 3426511 3417873 3388237 3417400 3443264 3465963 3445856 3393043 3326977
9801 3326977 3346903 3358995 3364567 3379169 3291256 3273716 3265255 3210910 3207264 3263394 3283270 3255783
$$ packed form
9885D497410J13303J00930j7753p3477q2433q3713K636L791P716K5002o9066p9557
9873D344789q851R4696p5665q4496k0011j7843m6068k9513J3705J3861n2424q818
9861D123362m2881n7871m5734j5899j666K9078K6393k2446K5480k589k1604l1866
9849C961757j3345J3547k003o7840M6553L3046o6156q6122p0133p387n5572k0744
9837C665601q51j2964M3053j9525j3483L0213O357m8805K098L4633J959l0368
9825C657918p7151o4206J2711J4380Q551j918j8352p6403o9588N7516k1338l5706
9813C386414m8885O7089L6960j5067q638k9636K9163K5864K2699k0107n2813o6066
9801C326977J9926J2092N572J4602q7913j7540q461n4345l646N6130J9876k7487
$$ plain form
9789 3255783 3211426 3182788 3178022 3165658 3173721 3243162 3245267 3249747 3196708 3151248 3130578 3120455
9777 3120455 3127431 3122633 3078184 3107487 3131364 3152838 3085754 3105274 3181324 3187015 3203683 3246095
9765 3246095 3272695 3299467 3310457 3418779 3463008 3478784 3639088 3809940 4090275 4400705
9755 4400705 4655106 4747449 4756435 4569290 4261079 4008685 3801731 3626136 3506234 3427194
9745 3427194 3376134 3299665 3281140 3231392 3166006 3164932 3165252 3136796 3155198 3168106 3104874 3044057
9733 3044057 3076324 3070998 2979483 2888034 2877173 2929100 3008447 2915102 2826409 2818117 2806918 2797598
9721 2797598 2777175 2701670 2639984 2647504 2640264 2659057 2680951 2672484 2703361 2738012 2790818 2773924
9709 2773924 2751292 2760295 2804045 2791147 2772531 2727029 2764626 2747832 2734481 2786309 2752088 2745299
$$ packed form
9789C255783m4357k8638m766j2364Q063O9441K105M480n3039m5460k0670j0123
9777C120455O976m798m4449K9303K3877K1474o7084J9520P6050N691J6668M2412
9765C246095K6600K6772J0990J08322M4229J5776J60304J70852K80335L10430
9755D400705K54401R2343Q986j87145l08211k52394k06954j75595j19902p9040
9745C427194n1060p6469j8525m9748o5386j074L20k8456J8402J2908o3232o0817
9733C044057L2267n326r1515r1449j0861N1927P9347r3345q8693q292j1199r320
9721B797598k0423p5505o1686P520p240J8793K1894q467L0877L4651N2806j6894
9709B773924k2632R003M3750j2898j8616m5502L7597j6794j3351N1828l4221o789
$$ plain form
9697 2745299 2740864 2742906 2748558 2681648 2648227 2581247 2531754 2584052 2629095 2708653 2693662 2598407
9685 2598407 2587750 2587342 2614355 2622044 2639028 2595114 2566279 2565340 2544516 2566394 2601379 2606192 2585598
9672 2585598 2597327 2603252 2576325 2588099 2554124 2494701 2509656 2518122 2495687 2493718 2561181 2644866
9660 2644866 2654625 2603652 2533237 2484951 2451065 2485421 2524066 2576594 2586757 2547599 2580815 2591706
9648 2591706 2541145 2491841 2500435 2485318 2449585 2474430 2483894 2453350 2411258 2368749 2432157 2455098
9636 2455098 2486409 2523648 2505910 2464781 2410884 2396072 2380336 2418197 2469234 2493466 2519621
9625 2519621 2562430 2528114 2531274 2572009 2559030 2549818 2497051 2523610 2543003 2575644 2564221 2521809
9613 2521809 2516527 2530570 2553217 2592348 2653693 2619348 2550289 2616869 2609407 2567185 2557384 2533679
$$ packed form
9697B745299m435K042N652o6910l3421o6980m9493N2298M5043P9558j4991r5255
9685B598407j0657m08K7013P689J6984m3914k8835r39k0824K1878L4985M813k0594
9672B585598J1729N925k6927J1774l3975n9423J4955Q466k2435j969O7463Q3685
9660B644866R759n0973p0415m8286l3886L4356L8645N2528J0163l9158L3216J0891
9648B591706n0561m9304Q594j5117l5733K4845R464l0544m2092m2509O3408K2941
9636B455098L1311L7239j7738m1129n3897j4812j5736L7861N1037K4232K6155
9625B519621M2809l4316L160M0735j2979r212n2767K6559J9393L2641j1423m2412
9613B521809n282J4043K2647L9131O1345l4345o9059O6580p462m2222r801k3705
$$ plain form
9601 2533679 2523944 2565074 2590078 2626396 2611371 2531849 2515360 2515839 2565518 2605317 2637445 2672669
9589 2672669 2679351 2710447 2709700 2654266 2628340 2643716 2615806 2651688 2640041 2602594 2596011 2640434
9577 2640434 2662155 2740375 2719262 2670770 2722872 2738206 2745878 2753919 2694756 2663556 2695105 2690088
9565 2690088 2679326 2700678 2754233 2815074 2787337 2788348 2836794 2818398 2850007 2813797 2841944 2866918
9553 2866918 2848243 2828800 2828802 2840565 2863650 2897997 2923990 2927755 2932078 2941673 2950974 2944506 2899136
9540 2899136 2794512 2774488 2797869 2736318 2705106 2726191 2794161 2840108 2827740 2835210 2839635 2842071
9528 2842071 2820931 2743855 2715976 2720339 2782770 2849032 2876157 2821831 2755421 2785668 2854875 2902048
9516 2902048 2899077 2820189 2827806 2856497 2840466 2781478 2716308 2769441 2777994 2754006 2697155 2686009
$$ packed form
9601B533679r735M1130K5004L6318j5025p9522j6489M79M9679L9799L2128L5224
9589B672669O682L1096p47n5434k5926J5376k7910L5882j1647l7447o583M4423
9577B640434K1721P8220k1113m8492N2102J5334P672Q041n9163l1200L1549n017
9565B690088j0762K1352N3555O0841k7737J011M8446j8396L1609l6210K8147K4974
9553B866918j8675j9443KJ1763K3085L4347K5993L765M323R595R301o468m5370
9540B899136j04624k0024K3381o1551l1212K1085O7970M5947j2368P470M425K436
9528B842071k1140p7076k7879M363O2431O6262K7125n4326o6410L0247O9207M7173
9516B902048k971p8888P617K8691j6031n8988o5170N3133Q553k3988n6851j1146
$$ plain form
9504 2686009 2655331 2623393 2693745 2760596 2765689 2741559 2693018 2691576 2684514 2618945 2636310 2638801
9492 2638801 2682730 2663090 2624862 2559669 2485601 2486683 2468544 2522969 2549958 2571844 2560712 2503914
9480 2503914 2451148 2441991 2437696 2415871 2428946 2476962 2466953 2410547 2375871 2367440 2338799 2314180
9468 2314180 2340633 2376158 2379623 2335496 2285633 2245069 2210202 2201997 2270517 2308506 2248028 2188262
9456 2188262 2166715 2139979 2185245 2162537 2103915 2158638 2117280 2132790 2202646 2202273 2174408 2136584
9444 2136584 2059027 2055956 2030239 2001571 2000147 1989434 1960038 1994338 2031507 2052403 2067659 2056773
9432 2056773 2035446 2016790 1978566 1967437 1960346 2005309 1955248 1892397 1851801 1831774 1843464 1796223
9420 1796223 1768979 1771533 1775713 1770454 1747122 1711073 1680666 1687659 1737445 1706256 1662283 1631450
$$ packed form
9504B686009l0678l1938P0352O6851N093k4130m8541j442p062o5569J7365K491
9492B638801M3929j9640l8228o5193p4068J082j8139N4425K6989K1886j1132n6798
9480B503914n2766r157m295k1825J3075M8016j0009n6406l4676q431k8641k4619
9468B314180K6453L5525L465m4127m9863m0564l4867q205O8520L7989o0478n9766
9456B188262k1547k6736M5266k2708n8622N4723m1358J5510O9856l73k7865l7824
9444B136584p7557l071k5717k8668j424j0713k9396L4300L7169K0896J5256j0886
9432B056773k1327j8656l8224j1129p091M4963n0061o2851m0596k0027J1690m7241
9420A796223k7244K554M180n259k3332l6049l0407O993M9786l1189m3973l0833
$$ plain form
9408 1631450 1661392 1621937 1554343 1565814 1588862 1601523 1606106 1588214 1514635 1516422 1516681 1565263
9396 1565263 1596488 1537204 1492948 1435644 1412991 1402784 1409988 1442370 1476853 1485576 1405202 1388526
9384 1388526 1391825 1444861 1437366 1386800 1442501 1447668 1463442 1408164 1365396 1361091 1426849 1413620
9372 1413620 1346403 1288319 1292358 1323246 1350127 1323839 1328955 1382840 1418567 1384648 1376682 1332209
9360 1332209 1251863 1233334 1243379 1218805 1236845 1303376 1300090 1231432 1214829 1224780 1173472 1144097
9348 1144097 1164167 1159135 1145693 1097299 1071471 1053357 1118574 1069170 1065678 1108266 1105246 1112131
9336 1112131 1113774 1088849 1032149 986172 1014676 1113529 1132034 1168692 1178738 1105021 1064951 1052294
9324 1052294 986152 1019355 1021189 995999 1009505 1000293 994164 970609 928234 888043 838433 894918
$$ packed form
9408A631450K9942l9455o7594J1471K3048J2661M583j7892p3579J787K59M8582
9396A565263L1225n9284m4256n7304k2653j0207P204L2382L4483Q723q0374j6676
9384A388526L299N3036p495n0566N5701N167J5774n5278m2768m305O5758j3229
9372A413620o7217n8084M039L0888K6881k6288N116N3885L5727l3919p966m4473
9360A332209q0346j8529J0045k4574J8040O6531l286o8658j6603R951n1308k9375
9348A144097K0070n032j3442m8394k5828j8114O5217m9404l492M2588l020O885
9336A112131J643k4925n6700m5977K8504R8853J8505L6658J0046p3717m0070j2657
9324A052294o6142L3203J834k5190J3506r212o129k3555m2375m0191m9610N6485
$$ plain form
9312 894918 997889 978479 965113 969266 936093 964256 1013224 1091826 1063494 970631 964677 945871
9300 945871 938168 945579 901930 877660 885201 900477 891763 882569 863964 841569 793745 814631 797723
9287 797723 781038 788205 811832 822944 875353 859894 754104 759745 759404 727425 745438 749703
9275 749703 748399 765428 811561 875710 852713 856234 859342 808223 767752 761032 734740 684359
9263 684359 684589 634905 638757 691799 724074 697872 697965 699478 704146 694461 678614 696344 763360
9250 763360 718333 663538 658846 698101 768274 738743 675744 666351 701917 670700 621814 609731
9238 609731 632969 712588 756917 710019 684023 718162 713373 690308 696857 659685 616387 628737
9226 628737 610363 625169 633743 677145 687143 679861 677540 622143 621589 617666 673767 673128 632986
$$ packed form
9312H94918J02971j9410j3366M153l3173K8163M8968P8602k8332r2863n954j8806
9300I45871p703P411m3649k4270P541J5276q714r194j8605k2395m7824K0886j6908
9287G97723j6685P167K3627J1112N2409j5459j05790N641l41l1979J8013M265
9275G49703j304J7029M6133O4149k2997L521L108n1119m0471o720k6292n0381
9263F84359K30m9684L852N3042L2275k6202R3J513M668r685j5847J7730O7016
9250G63360m5027n4795m692L9255P0173k9531o2999r393L5566l1217m8886j2083
9238F09731K3238P9619M4329m6898k5996L4139m789k3065O549l7172m3298J2350
9226F28737j8374J4806Q574M3402R998p282k321n5397n54l923N6101o39m0142
$$ plain form
9213 632986 594664 584819 542403 549487 520368 515612 541117 539476 561173 596267 578954 610333
9201 610333 574710 555387 582846 542152 478140 499004 533400 555525 636003 701977 673351 651937
9189 651937 646266 617502 618484 588343 585644 594886 512238 480166 535514 487523 448018 478280 471762
9176 471762 474230 498972 563217 548548 529197 574971 608835 609903 628951 640032 646436 620666
9164 620666 544865 449843 488765 531175 590830 559347 532511 583153 613133 570778 588824 631508
9152 631508 622311 581941 573494 582065 639637 588783 490441 456415 490514 513362 545835 540562
9140 540562 487913 516930 571305 596994 619089 569784 582147 578161 572387 546127 526013 580679
9128 580679 571214 508246 496432 553980 559010 486512 440907 443337 507294 531008 529424 472539
$$ packed form
9213F32986l8322r845m2416P084k9119m756K5505j641K1697L5094j7313L1379
9201F10333l5623j9323K7459m0694o4012K0864L4396K2125Q0478O5974k8626k1414
9189F51937n671k8764R82l0141k699R242q2648l2072N5348m7991l9505L0262o518
9176D71762K468K4742O4245j4669j9351M5774L3864J068J9048J1081O404k5770
9164F20666p5801r5022L8922M2410N9655l1483k6836N0642K9980m2355J8046M2684
9152F31508r197m0370q447Q571N7572n0854r8342l4026L4099K2848L2473n273
9140E40562n2649K9017N4375K5689K2095m9305J2363l986n774k6260k0114N4666
9128E80679r465o2968j1814N7548N030p2498m5605K430O3957K3714j584n6885
$$ plain form
9116 472539 449363 434954 451584 476473 476988 512618 506056 450631 482181 499737 503622 449721
9104 449721 432713 452025 465090 475530 490140 495730 508061 558465 606522 582158 467775 416610
9092 416610 432572 478727 486395 455369 507934 551138 568716 489914 452707 514119 559026 552731
9080 552731 514908 475021 464203 466088 476387 511250 472432 394279 369416 431915 440650 438184
9068 438184 468720 473782 449222 462819 441831 474756 470978 507688 555270 513924 453424 421774
9056 421774 427582 400296 415105 387258 361997 363331 431379 403294 406026 433063 458494 468047
9044 468047 444416 468922 432288 382992 344956 443076 498636 479838 425810 378711 393104 431126
9032 431126 465898 437554 434681 412858 415317 413056 434448 485481 460635 416322 447908 512458
$$ packed form
9116D72539k3176j4409J6630K4889N15L5630o562n5425L1550J7556L885n3901
9104D49721j7008J9312J3065J0440J4610N590J2331N0404M8057k4364j14383n1165
9092D16610J5962M6155P668l1026N2565M3204J7578p8802l7207O1412M4907o295
9080E52731l7823l9887j0818J885J0299L4863l8818p8153k4863O2499Q735k466
9068D38184L0536N062k4560J3597k0988L2925l778L6710M7582m1346o0500l1650
9056D21774N808k7286J4809k7847k5261J334O8048k8085K732K7037K5431R553
9044D68047k3631K4506l6634m9296l8036R8120N5560j8798n4028m7099J4393L8022
9032D31126L4772k8344k873k1823K459k261K1392N1033k4846m4313L1586O4550
$$ plain form
9020 512458 534261 505621 453760 379693 386064 341403 296815 268934 243131 307249 325333 279767
9008 279767 267245 298889 319930 302400 347532 382512 394555 416918 448057 432122 406416 366786
8996 366786 376537 373396 342893 342898 343100 372453 389122 405924 438443 459281 466676 397656 352998
8983 352998 384522 378765 295031 261206 298769 287556 283013 317055 335742 285104 243504 242520
8971 242520 267410 273976 270770 307919 315364 311041 339932 301352 281464 314617 316186 364226 290575
8958 290575 328228 358775 323381 314449 318711 277384 264261 296722 331493 362485 383526 321625
8946 321625 315131 316438 322886 292441 319743 393180 360394 324889 344509 366709 317015 313182
8934 313182 312040 314710 361127 396249 366400 342740 356954 350223 382198 383569 388803 417337 448603
$$ packed form
9020E12458K1803k8640n1861p4067O371m4661m4588k7881k5803O4118J8084m5566
9008B79767j2522L1644K1041j7530M5132L4980J2043K2363L1139j5935k5706l9630
8996C66786R751l141l0503NK02K9353J6669J6802L2519K0838P395o9020m4658
8983C52998L1524n757q3734l3825L7563j1213m543L4042J8687n0638m1600r84
8971B42520K4890O566l206L7149P445m323K8891l8580j9888L3153J569M8040p3651
8958B90575L7653L0547l5394q932M262m1327j3123L2461L4771L0992K1041o1901
8946C21625o494J307O448l0445K7302P3437l2786l5505J9620K2200m9694l833
8934C13182j142K670M6417L5122k9849k3660J4214o731L1975J371N234K8534L1266
$$ plain form
8921 448603 442764 406925 334868 268040 265031 311209 355778 374954 417429 396216 383298 434427
8909 434427 410109 395731 431054 424074 439979 423559 433155 455394 443879 384161 342875 341613
8897 341613 353373 399924 489610 451611 424706 375401 307086 307604 295955 311831 347849 357589
8885 357589 366876 379622 446735 469169 448374 383881 374247 386190 445798 440614 489436 405528
8873 405528 360534 309308 332823 381630 402752 387076 335230 375556 445095 485816 423756 434688
8861 434688 433718 439526 499924 530964 493412 539376 518270 540091 529872 457474 405795 357578
8849 357578 392510 398510 364479 391496 462315 515595 568504 503827 432391 428994 414975 415873
8837 415873 424852 362887 258961 256451 265200 271217 314066 338358 374950 397572 401445 487464
$$ packed form
8921D48603n839l5839p2057o6828l009M6178M4569J9176M2475k1213j2918N1129
8909D34427k4318j4378L5323o980J5905j6420R596K2239j1515n9718m1286j262
8897C41613J1760M6551Q9686l7999k6905m9305o8315N18j1649J5876L6018R740
8885C57589R287J2746O7113K2434k0795o4493r634J1943N9608n184M8822q3908
8873D05528m4994n1226K3515M8807K1122j5676n1846M0326O9539M0721o2060J0932
8861D34688r70N808O0398L1040l7552M5964k1106K1821j0219p2398n1679m8217
8849C57578L4932O000l4031K7017P0819N3280N2909o4677p1436l397j4019Q98
8837D15873Q979o1965j03926k510Q749O017M2849K4292L6592K2622L873Q6019
$$ plain form
8825 487464 482022 458418 525547 553565 506695 509817 518866 492594 380473 348472 357683 336740
8813 336740 328049 339440 351888 419132 481113 453404 393447 435430 419065 381281 357562 365671
8801 365671 380867 351252 235512 219876 313587 357223 334882 307336 410308 455292 449727
8790 449727 461073 407848 369193 337815 308570 376561 421120 448044 430904 422295 451896 481659
8778 481659 533130 536866 473814 417276 367965 306305 364583 452679 416399 393843 351838 335398
8766 335398 274843 240512 302301 320173 290979 258537 262338 290166 276079 261520 293457 311897
8754 311897 375400 407679 353646 326797 327801 291801 325485 360532 403454 330323 306482 347836
8742 347836 365042 378896 377706 362958 344027 408404 423341 382344 358202 349284 319283 324106
$$ packed form
8825D87464n442k3604O7129K8018m6870L122R049k6272j12121l2001R211k0943
8813C36740q691J1391J2448O7244O1981k7709n9957M1983j6365l7784k3719Q109
8801C65671J5196k9615j15740j5636R3711M3636k2341k7546J02972M4984n565
8790D49727J1346n3225l8655l1378k9245O7991M4559K6924j7140q609K9601K9763
8778D81659N1471L736o3052n6538m9311o1660N8278Q8096l6280k2556m2005j6440
8766C35398o0555l4331O1789J7872k9194l2442L801K7828j4087j4559L1937J8440
8754C11897O3503L2279n4033k6849J004l6000L3684L5047M2922p3131k3841M1354
8742C47836J7206J3854j190j4748j8931O4377J4937m0997k4142q918l0001M823
$$ plain form
8730 324106 378365 405774 388109 392513 394777 413934 423253 417293 429279 461499 388654 329518
8718 329518 347104 320175 307758 368889 343636 374635 390062 355093 351552 338813 388588 365758
8706 365758 323800 296215 314374 392709 413778 347076 373197 368187 333542 364136 356980 335945
8694 335945 340689 347817 414822 421863 432708 442154 433921 473230 467495 464372 476523 459067 397560
8681 397560 342199 345892 409032 429298 442994 452096 442737 453615 518331 503259 490769 475459
8669 475459 493251 509511 470567 497649 541300 564750 536106 475680 441766 444552 457200 463275
8657 463275 470568 479073 484675 478677 480760 468713 431046 428996 350080 381103 457509 474659 451087
8644 451087 407404 424673 437565 458165 524290 525883 473008 474932 527421 475286 513979 515402
$$ packed form
8730C24106N4259K7409j7665M404K264J9157R319n960J1986L2220p2845n9136
8718C29518J7586k6929j2417O1131k5253L0999J5427l4969l541j2739M9775k2830
8706C65758m1958k7585J8159P8335K1069o6702K6121n010l4645L0594p156k1035
8694C35945M744P128O7005P041J0845R446q233L9309n735l123J2151j7456o1507
8681C97560n5361L693O3140K0266J3696R102r359J0878O4716j5072j2490j5310
8669D75459J7792J6260l8944K7082M3651K3450k8644o0426l3914K786J2648O075
8657D63275P293Q505N602n998K083j2047l7667k050p8916L1023P6406J7150k3572
8644D51087m3683J7269J2892K0600O6125J593n2875J924N2489n2135L8693J423
$$ plain form
8632 515402 506996 591913 646867 622285 529621 474869 474411 456015 470828 505574 530403 525258
8620 525258 519192 535413 503150 521586 508616 569888 557028 530229 533064 530621 544864 554636
8608 554636 572808 542475 526746 545661 570496 490335 450171 492426 556049 625682 596773 530563
8596 530563 512206 548302 607618 573623 588543 589289 588939 573348 579530 601801 582023 559867 583025
8583 583025 612126 580166 592187 525623 472850 456282 496636 478633 484800 459727 398781 437741
8571 437741 495363 454224 415852 381227 352821 403087 478209 512211 469127 466468 460453 505698
8559 505698 454731 430127 402779 397359 298871 262733 276787 301186 339180 345121 352935 330721
8547 330721 306241 250635 244530 221605 215966 195612 225215 273759 285030 243951 259758 255524
$$ packed form
8632E15402q406Q4917N4954k4582r2664n4752m58j8396J4813L4746K4829n145
8620E25258o066J6221l2263J8436j2970O1272j2860k6799K835k443J4243R772
8608E54636J8172l0333j5729J8915K4835q0161m0164M2255O3623O9633k8909o6210
8596E30563j8357L6096N9316l3995J4920P46l50j5591O182K2271j9778k2156K3158
8583E83025K9101l1960J2021o6564n2773j6568M0354j8003O167k5073o0946L8960
8571D37741N7622m1139l8372l4625k8406N0266P5122L4002m3084k659o015M5245
8559E05698n0967k4604k7348n420r8488l6138J4054K4399L7994N941P814k2214
8547C30721k4480n5606o105k2925n639k0354K9603M8544J1271m1079J5807m234
$$ plain form
8535 255524 234534 246642 309259 309784 307140 302094 325150 362507 335826 304978 264702 286540
8523 286540 322933 336234 290973 243687 215303 202428 215734 257267 308515 287776 211191 166489
8511 166489 176374 154818 132248 171729 203167 222649 234072 222365 140362 188889 203929 225356
8499 225356 188795 224013 224733 169119 126529 144051 184200 240270 189705 136482 188613 185289
8487 185289 268250 238561 191655 185208 195387 181464 112463 22767 21303 66827 61698 87373
8475 87373 135680 177657 161350 185950 199928 174609 132167 137515 139246 157087 208710 182604
8463 182604 166299 142748 76036 98822 152494 159458 113045 93021 110909 68942 66847 26414
8451 26414 42892 37743 109447 209643 247510 232710 180606 214433 211758 140469 69007 85511
$$ packed form
8535B55524k0990J2108O2617N25k644n046K3056L7357k6681l0848m0276K1838
8523B86540L6393J3301m5261m7286k8384j2875J3306M1533N1248k0739p6585m4702
8511A66489R885k1556k2570L9481L1438J9482J1423j1707q2003M8527J5040K1427
8499B25356l6561L5218P20n5614m2590J7522M0149N6070n0565n3223N2131l324
8487A85289Q2961k9689m6906o447J0179j3923o9001q9696j464M5524n129K5675
8475H7373M8307M1977j6307K4600J3978k5319m2442N348J731J7841N1623k6106
8463A82604j6305k3551o6712K2786N3672O964m6413k0024J7888m1967k095m0433
8451B6414J6478n149P1704J00196L7867j4800n2104L3827k675p1289p1462J6504
$$ plain form
8439 85511 90739 107604 138304 147411 155821 165644 149893 169984 182920 164883 118614 114688 92057
8426 92057 148825 186612 183174 212199 239443 237421 247049 254292 186597 150021 139286 180565 154386
8413 154386 155591 144157 172644 131892 126315 121894 106694 86580 110436 143765 91705 132378
8401 132378 106156 121069 174208 236087 247407 180466 109304 87403 106713 157727 124820 162705
8389 162705 158795 149415 180001 157444 111848 32830 15695 35010 59411 79631 71618 61192
8377 61192 89540 186396 229280 173419 152829 126239 112753 178462 202848 257449 217461 167206
8365 167206 186800 144840 79896 81448 114678 113803 97361 50980 30618 43212 39976 50902
8353 50902 48832 58539 61503 71817 121084 100610 81333 83819 121775 136366 192575 214286 151808
$$ packed form
8439H5511N228J6865L0700R107Q410R823j5751K0091J2936j8037m6269l926k2631
8426I2057N6768L7787l438K9025K7244k022R628P243o7695l6576j0735M1279k6179
8413A54386J205j1434K8487m0752n577m421j5200k0114K3856L3329n2060M0673
8401A32378k6222J4913N3139O1879J1320o6941p1162k1901J9310N1014l2907L7885
8389A62705l910r380L0586k2557m5596p9018j7135J9315K4401K0220q013j0426
8377F1192K8348R6856M2884n5861k0590k6590j3486O5709K4386N4601l9988n0255
8365A67206J9594m1960o4944J552L3230q75j6442m6381k0362J2594l236J0926
8353E0902k070R707K964J0314M9267k0474j9277K486L7956J4591N6209K1711o2478
$$ plain form
8340 151808 115874 19571 2975 93838 144054 119872 94262 99732 91256 75510 91907 105102
8328 105102 126226 158684 149643 94325 46441 85574 82667 105778 118635 99547 76899 -1385
8316 -1385 68406 140539 160944 175765 204218 196600 160790 204134 190523 143613 135888 153112
8304 153112 170495 179053 156059 163588 145657 144649 151737 165996 168406 114816 111256 63973 103682
8291 103682 108775 103499 125578 148821 128452 28886 56127 72574 87561 82377 113377 153009
8279 153009 142777 157579 187073 171932 150442 135359 117436 77336 44142 36263 29006 46322
8267 46322 59140 83017 81665 63715 68549 143203 172806 176355 223461 200751 184814 137840
8255 137840 112410 173855 204869 149800 103453 94234 83806 98117 136032 219852 239941 249312
$$ packed form
8340A51808l5934r6303j6596R0863N0216k4182k5610N470q476j5746J6397J3195
8328A05102K1124L2458r041n5318m7884L9133k907K3111J2857j9088k2648p8284
8316a385O9791P2133K0405J4821K8453p618l5810M3344j3611m6910p725J7224
8304A53112J7383Q558k2994P529j7931j008P088J4259K410n3590l560m7283L9709
8291A03682N093n276K2079K3243k0369r9566K7241J6447J4987n184L1000L9632
8279A53009j0232J4802K9494j5141k1490j5083j7923m0100l3194p879p257J7316
8267D6322J2818K3877j352j7950M834P4654K9603L549M7106k2710j5937m6974
8255A37840k5430O1445L1014n5069m6347r219j0428J4311L7915Q3820K0089R371
$$ plain form
8243 249312 245523 210671 206621 170289 160730 202820 241980 237292 237618 223367 243686 254907 98819
8230 98819 68751 164622 175160 177324 152458 175982 214190 241332 293374 330456 374225 370866
8218 370866 400562 471487 456415 384454 287402 269542 264203 208677 176876 190296 249880 237451
8206 237451 161955 148666 120133 98807 111941 147597 205028 155475 75851 78424 88559 95649
8194 95649 150084 134303 112781 122622 95797 181226 234354 252005 250283 232157 229464 216793
8182 216793 204026 147743 170876 269475 319075 317718 340256 433281 513420 574481 644635 680781
8170 680781 697908 570990 459938 408111 364929 386759 440261 404145 319400 268023 299182
8159 299182 316379 274578 247175 273754 316197 297802 275216 261178 243745 173275 195121 232269
$$ packed form
8243B49312l789l4852m050l6332r559M2090L9160m688L26j4251K0319J1221j56088
8230I8819l0068R5871J0538K164k4866K3524L8208K7142N2042L7082M3769l359
8218C70866K9696P0925j5072p1961r7052j7860n339n5526l1801J3420N9584j2429
8206B37451p5496j3289k8533k1326J3134L5656N7431m9553p9624K573J0135P090
8194I5649N4435j5781k1522R841k6825Q5429N3128J7651j722j8126k693j2671
8182B16793j2767n6283K3133R8599M9600j357K2538R3025Q0139O1061P0154L6146
8170F80781J7127j26918j11052n1827m3182K1830N3502l6116q4745n1377L1159
8159B99182J7197m1801k7403K6579M2443j8395k2586j4038j7433p0470K1846L7148
$$ plain form
8147 232269 231119 214871 223222 234402 209682 199047 186064 193500 203667 216155 250080 217649
8135 217649 254042 309147 300012 285639 228356 175221 145771 232357 379682 435204 459644 388991
8123 388991 356894 380151 358399 326322 291621 233659 211561 242006 180433 160934 164535 202368
8111 202368 218945 252334 309798 302568 247664 254901 247425 220236 192859 240218 275672 247761
8099 247761 270285 269298 256343 220702 165531 166493 221698 258250 243892 225850 222804 228065 196348
8086 196348 204986 200153 195441 180227 134539 177013 192464 181859 178059 170132 147119 219369 234900
8073 234900 268860 342750 354282 294189 271203 240811 286643 378378 446444 551951 539975
8062 539975 480993 453404 399288 350269 356236 361479 287369 241533 218476 227831 221981 230644 260404
$$ packed form
8147B32269j150j6248Q351J1180k4720j0635j2983P436J0167J2488L3925l2431
8135B17649L6393N5105r135j4373n7283n3135k9450Q6586J47325N5522K4440p0653
8123C88991l2097K3257k1752l2077l4701n7962k2098L0445o1573j9499L601L7833
8111B02368J6577L3389N7464p230n4904P237p476k7189k7377M7359L5454k7911
8099B47761K2524r87j2955l5641n5171R62N5205L6552j4358j8042l046N261l1717
8086A96348Q638m833m712j5214m5688M2474J5451j0605l800p927k3013P2250J5531
8073B34900L3960P3890J1532o0093k2986l0392M5832R1735O8066J05507j1976
8062E39975n8982k7589n4116m9019N967N243p4110m5836k3057R355n850Q663K9760
$$ plain form
8049 260404 309510 328553 315585 284856 288140 283049 233793 259877 231814 271404 263972 225203
8037 225203 308737 406024 463157 499932 444812 438813 558468 606414 578249 513138 448719 432290
8025 432290 426452 441672 524530 574210 665703 773130 847386 836518 781057 780995 727002 629988
8013 629988 569533 531945 546844 488020 403377 426050 462738 408414 391971 355422 356880 383591
8001 383591 460426 527421 546109 548218 571005 592567 578826 599985 546952 524107 437966 373131
7989 373131 410315 452068 484990 499925 530831 551155 561496 548922 551297 562176 572500 574887
7977 574887 564709 561515 575589 530825 490788 462707 492648 457740 469217 508531 529766 523166
7965 523166 458031 395474 441080 420156 361469 347970 308185 362433 415773 451325 434463 396366
$$ packed form
8049B60404M9106J9043j2968l0729L284n091m9256K6084k8063L9590p432l8769
8037B25203Q3534R7287N7133L6775n5120n999J19655M7946k8165o5111o4419j6429
8025D32290n838J5220Q2858M9680R1493J07427P4256j0868n5461o2n3993r7014
8013F29988o0455l7588J4899n8824q4643K2673L6688n4324j6443l6549J458K6711
8001C83591P6835O6995J8688K109K2787K1562j3741K1159n3033k2845q6141o4835
7989C73131L7184M1753L2922J4935L0906K0324J0341j2574K375J0879J0324K387
7977E74887j0178l194J4074m4764m0037k8081K9941l4908J1477L9314K1235o600
7965E23166o5135o2557M5606k0924n8687j3499l9785N4248N3340L5552j6862l8097
$$ plain form
7953 396366 405275 377471 362395 375715 433967 424468 405940 333260 376878 439409 430090 409148
7941 409148 369182 407166 389418 350417 393451 490591 501229 422952 393052 343693 287917 241253
7929 241253 205557 253754 298398 325650 325220 261643 190921 161285 201060 263644 262716 206144
7917 206144 178923 217881 232037 234603 301429 307266 233383 166525 234402 367177 342184 291016
7905 291016 288240 296010 305983 299459 240761 213019 234982 207386 227384 188790 198778 208952 180183
7892 180183 194401 178212 161171 90005 68485 118954 217198 236969 265216 284845 311087 301932
7880 301932 236576 288469 275368 209657 203965 219807 167157 175428 148487 151289 181730 231706
7868 231706 209403 263001 342419 368578 300973 227303 162429 113936 156925 156186 138910 131370
$$ packed form
7953C96366Q909k7804j5076J3320N8252r499j8528p2680M3618O2531r319k0942
7941D09148l9966L7984j7748l9001M3034R7140J0638p8277k9900m9359n5776m6664
7929B41253l5696M8197M4644K7252m30o3577p0722k9636L9775O2584r28n6572
7917B06144k7221L8958J4156K566O6826N837p3883o6858O7877J32775k4993n1168
7905B91016k776P770R973o524n8698k7742K1963k7596J9998l8594R988J0174k8769
7892A80183J4218j6189j7041p1166k1520N0469R8244J9771K8247J9629K6242r155
7880C01932o5356N1893j3101o5711n692J5842n2650Q271k6941K802L0441M9976
7868B31706k2303N3598P9418K6159o7605p3670o4874m8493M2989p39j7276p540
$$ plain form
7856 131370 102386 94410 115927 159791 155308 136840 135312 103946 89207 102800 95386 74129
7844 74129 90722 84581 46036 29015 70840 130906 124966 113723 144308 142440 75459 49464
7832 49464 115458 58801 33339 86636 144558 149831 90122 25404 50093 65726 35875 17432
7820 17432 98048 83847 103756 134855 105964 120018 142532 121942 120194 97297 83157 100865
7808 100865 143551 164927 160053 176080 151910 126364 108030 105264 61472 -3487 -60897 -77414
7796 -77414 -30185 64485 111612 44688 -29186 -46201 -13647 48929 62296 37997 46626 75680
7784 75680 78865 94180 68225 41439 78446 112455 137158 122961 48533 -13967 6108 41188
7772 41188 65811 82498 32703 73772 110707 88945 56874 87156 115604 105390 29446 682
$$ packed form
7856A31370k8984p976K1517M3864m483j8468j528l1366j4739J3593p414k1257
7844G4129J6593o141l8545j7021M1825O0066n940j1243L0585j868o6981k5995
7832D9464O5994n6657k5462N3297N7922N273n9709o4718K4689J5633k9851j8443
7820A7432Q0616j4201J9909L1099k8891J4054K2514k0590j748k2897j4140J7708
7808A00865M2686K1376m874J6027k4170k5546j8334k766m3792o4959n7410j6517
7796g7414M7229R4670M7127o6924p3874j7015L2554O2576J3367k4299Q629K9054
7784G5680L185J5315k5955k6786L7007L4009K4703j4197p4428o2500K0075L5080
7772D1188K4623J6687m9795M1069L6935k1762l2071L0282K8448j0214p5944k8764
$$ plain form
7760 682 111168 118016 70399 74736 50814 62525 143551 165656 107192 84749 171482 170439 128090
7747 128090 105236 57524 6635 -29166 28560 93926 119063 131185 75261 48274 60897 64396
7735 64396 87703 118647 125130 97735 38858 46380 100878 92936 86256 28307 8598 56887 79936
7722 79936 76109 56170 17025 -1158 55186 38971 9132 -33752 -18670 -9490 12316 18958
7710 18958 -7408 14023 20437 52014 55411 29962 32596 90414 138137 110609 68650 80922
7698 80922 99505 59402 12381 53152 7710 13504 44803 31959 45217 55115 51594 61200 39506
7685 39506 9075 -11043 8280 6665 -7130 -61359 -67007 -59013 -17839 -13167 11507 47669 19974
7672 19974 -4368 29927 46961 -8451 -40660 14716 43070 40043 27669 23362 46226 35877
$$ packed form
7760F82J10486O848m7617M337k3922J1711Q1026K2105n8464k2443Q6733j043m2349
7747A28090k2854m7712n0889l5801N7726O5366K5137J2122n5924k6987J2623L499
7735F4396K3307L0944O483k7395n8877P522N4498p942o680n7949j9709M8289K3049
7722G9936l827j9939l9145j8183N6344j6215k9839m2884J5082R180K1806O642
7710A8958k6366K1431O414L1577L397k5449K634N7818M7723k7528m1959J2272
7698H0922J8583m0103m7021M0771m5442N794L1299j2844J3258R898l521R606k1694
7685C9506l0431k0118J9323j615j3795n4229n648P994M1174M672K4674L6162k7695
7672A9974k4342L4295J7034n5412l2209N5376K8354l027j2374m307K2864j0349
$$ plain form
7660 35877 45377 19146 47486 56378 13593 -11468 -38524 -41338 -18202 7561 -35000 -65068
7648 -65068 -33584 -4664 21235 46692 102992 80008 36654 14037 34995 3500 -35769 -1135
7636 -1135 82477 103902 92483 45296 20130 66262 74486 61255 134144 167354 169107 135641
7624 135641 62421 26464 43376 44021 51277 49140 24761 -49384 -24905 -34116 -93901 -40326 17091
7611 17091 71968 73118 67817 31201 33298 72529 51040 -6494 -28987 -29061 -6351 -8135 9922
7598 9922 49796 94144 128572 99136 121252 122796 111637 99346 79564 44224 -8666 -40157
7586 -40157 -59545 -60978 -49938 -19229 29896 45468 18565 21697 61627 43966 -26936 -29186
7574 -29186 -23426 38284 84203 81481 125681 143312 101568 14226 -44148 -29657 -52720 -59288
$$ packed form
7660C5877R500k6231K8340Q892m2785k5061k7056k814K3136K5763m2561l0068
7648f5068L1484K8920K5899K5457N6300k2984m3354k2617K0958l1495l9269L4634
7636a135Q3612K1425j1419m7187k5166M6132Q224j3231P2889L3210J753l3466
7624A35641p3220l5957J6912O45P256k137k4379p4145K4479r211n9785N3575N7417
7611A7091N4877J150n301l6616K097L9231k1489n7534k2493p4K2710j784J8057
7598I922L9874M4348L4428k9436K2116J544j1159j2291j9782l5340n2890l1491
7586d0157j9388j433J1040L0709M9125J5572k6903L132L9930j7661p0902k250
7574b9186N760O1710M5919k722M4200J7631m1744q7342n8374J4491k3063o568
$$ plain form
7562 -59288 -29632 -29868 -9034 -30418 -28065 -8231 40386 1321 -38416 -13858 31411 65236
7550 65236 52230 26395 8346 -10046 -16643 6843 68243 62004 -8655 4207 -25116 -67923
7538 -67923 -76432 -24857 12133 31742 28228 5579 -49345 -62198 -13463 -20710 -4367 -84489
7526 -84489 -142221 -103399 -21457 -34905 -3742 38323 -12960 -102532 -47792 -40797 -28605 7367
7514 7367 73231 108876 132095 108855 98189 56674 -2308 36345 23616 -12618 -59792 -45983
7502 -45983 -25889 -34874 -61260 -60300 -20351 -18397 -1263 18476 15879 -10041 -15188 45411 18929
7489 18929 631 692 -15521 -30749 -12019 -20494 -51103 -17940 -33872 11243 53951 23167 -30035
7476 -30035 -44564 -34310 -65741 -46726 -24312 21867 74780 49927 67597 30222 33421 55155
$$ packed form
7562e9288K9656k36K0834k1384K353J9834M8617l9065l9737K4558M5269L3825
7550F5236j3006k5835j8049j8392o597K3486O1400o239p0659J2862k9323m2807
7538f7923q509N1575L6990J9609l514k2649n4924j2853M8735p247J6343q0122
7526h4489n7732L8822Q1942j3448L1163M2065n1283q9572N4740O995J2192L5972
7514G367O5864L5645K3219k3240j0666m1515n8982L8653j2729l6234m7174J3809
7502d5983K0094q985k6386R60L9949J954J7134J9739k597k5920n147O0599k6482
7489A8929j8298O1j6213j5228J8730q475l0609L3163j5932M5115M2708l0784n3202
7476c0035j4529J0254l1431J9015K2414M6179N2913k4853J7670l7375L199K1734
$$ plain form
7464 55155 39367 48910 33820 83048 82008 58519 68434 123743 106993 62439 31732 -48624
7452 -48624 -35260 29213 2628 -7907 29000 17612 15559 12746 -3907 -72100 -66111 -15029
7440 -15029 -16162 26186 67733 35891 -31268 -23244 24788 70055 80739 69619 64642 64671 97394
7427 97394 68199 -28791 -19176 1884 -3924 -19152 -40145 25215 80216 77366 71593 25391 -12751
7414 -12751 7513 -870 -4843 -25435 -34711 -86128 -105689 -79916 -51685 -10377 -29568 -34145 33136
7401 33136 85969 53866 95307 92033 81542 70487 70385 66054 35104 21501 44071 38610 -2159
7388 -2159 33776 52943 18967 16072 4381 -71579 -62582 12490 -23992 -59529 9742 79549
7376 79549 26188 -25029 -4592 9281 8874 39284 31880 1432 -46226 -33914 -40391 -22895 -41162
$$ packed form
7464E5155j5788R543j5090M9228j040k3489R915N5309j6750m4554l0707q0356
7452d8624J3364O4473k6585j0535L6907j1388k053k813j6653o8193N989N1082
7440a5029j133M2348M1547l1842o7159Q024M8032M5267J0684j1120m977K9L2723
7427I7394k9195r6990R615K1060n808j5228k0993O5360N5001k850n773m6202l8142
7414a2751K0264q383l973k0592r276n1417j9561K5773K8231M1308j9191m577O7281
7401C3136N2833l2103M1441l274j0491j1055j02m331l0950j3603K2570n461m0769
7388b159L5935J9167l3976k895j1691p5960Q997P5072l6482l5537O9271O9807
7376G9549n3361n1217K0437J3873m07L0410p404l0448m7658J2312o477J7496j8267
$$ plain form
7363 -41162 -57481 8324 25714 -6126 -52478 -48189 -25951 16022 -15711 -34938 6764 -51754
7351 -51754 -38876 -6378 -53012 -107089 -41982 421 -34462 -31639 -30983 -27832 14004 78743 71781
7338 71781 36322 66293 72502 1274 -55532 -33805 -27417 -49914 -28095 33717 55153 45106
7326 45106 53669 57557 63368 41151 37278 42573 8143 19510 37445 4018 -24835 -20560 -6171
7313 -6171 43500 67868 75213 64533 45263 12376 -6578 -50742 -86313 -52986 12623 -265
7301 -265 -40026 -28275 -49435 -53286 -13668 -31312 -42687 37611 40029 65770 130904 124512 69385
7288 69385 13830 33260 42074 -6579 -35008 1599 66229 45176 12331 -16066 -48774 -1285
7276 -1285 -5931 59398 17023 -31835 -41392 -87650 -70669 -82185 -96262 -70684 -35720 -12427
$$ packed form
7363d1162j6319O5805J7390l1840m6352M289K2238M1973l1733j9227M1702n8518
7351e1754J2878L2498m6634n4077O5107M2403l4883K823O56L151M1836O4739o962
7338G1781l5459K9971O209p1228n6806K1727O388k2497K1819O1812K1436j0047
7326D5106Q563L888N811k2217l873N295l4430J1367J7935l3427k8853M275J4389
7313f171M9671K4368P345j0680j9270l2887j8954m4164l5571L3327O5609j2888
7301b65l9761J1751k1160l851L9618j7644j1375Q0298K418K5741O5134o392n5127
7288F9385n5555J9430Q814m8653k8429L6607O4630k1053l2845k8397l2708M7489
7276a285m646O5329m2375m8858r557m6258J6981j1516j4077K5578L4964K3293
$$ plain form
7264 -12427 -54241 -14849 9430 39485 37537 46941 62764 71232 46821 26728 55785 52100 6138
7251 6138 -60223 -63425 -42863 -13220 18940 10077 36240 42665 5968 6728 12241 -24441 -5451
7238 -5451 7837 -4122 -29355 -50497 -115224 -135806 -94215 -31516 -8649 -78945 -115295 -97371
7226 -97371 -52164 21717 43909 2656 -22311 -77984 -93448 -69913 -124764 -34414 12460 4587
7214 4587 -28801 -34981 -73375 -33402 -29388 61319 76197 95000 108927 99455 119518 119900 51125
7201 51125 27285 -27207 -64520 -62267 -30378 -49248 -73791 -63877 -82096 -43619 44940 23669
7189 23669 -23537 31954 36864 -15874 -28828 -16698 30345 40786 36491 105809 105709 100715 67724
7176 67724 4428 -5763 19912 -156 -30566 -27368 4463 14459 30548 4307 4227 29284 10114
$$ packed form
7264a2427m1814L9392K4279L0055j948R404J5823Q468k4411k0093K9057l685m5962
7251F138o6361l202K0562K9643L2160q863K6163O425l6697P60N513l6682J8990
7238e451J3288j1959k5233k1142o4727k0582M1591O2699K2867p0296l6350J7924
7226i7371M5207P3881K2192m1253k4967n5673j5464K3535n4851R0350M6874p873
7214D587l3388o180l8394L9973M014R0707J4878J8803J3927r472K0063L82o8775
7201E1125k3840n4492l7313K253L1889j8870k4543R914j8219L8477Q8559k1271
7189B3669m7206N5491M910n2738j2954J2130M7043J0441m295O9318j00m994l2991
7176F7724o3296j0191K5675k0068l0410L198L1831R996J6089k6241q0K5057j9170
$$ plain form
7163 10114 22669 28856 -61233 -75210 -64792 -55881 -91804 -89050 -68335 -70813 -77610 -27685 -33112
7150 -33112 -72978 -140928 -117422 -69775 -483 12570 -49041 -51354 -41468 -1517 61414 63643
7138 63643 24276 60146 97178 40547 -16754 -3578 -10550 -15327 -9243 -18993 2448 45192 99358
7125 99358 120202 117901 60405 -1037 15833 71860 -8515 28764 83640 53115 33308 39155
7113 39155 9175 -11603 -17958 -35448 -67911 -86441 -137479 -107471 -30299 39439 44859 -18068
7101 -18068 -51914 -33269 25614 41918 -16681 -21971 -32154 -19759 -44687 122 4394 18087
7089 18087 764 -7240 -19652 -37278 -63351 -41808 -7356 1832 16907 -31775 43318 93764
7077 93764 135987 106846 15537 -47874 -55339 -50578 -28370 10131 18952 93124 84107 2619 -42131
$$ packed form
7163A0114J2555O187r0089j3977J0418Q911l5923K754K0715k478o797M9925n427
7150c3112l9866o7950K3506M7647O9292J3053o1611k313R886L9951O2931K229
7138F3643l9367L5870L7032n6631n7301J3176o972m777O084r750K1441M2744N4166
7125I9358K0844k301n7496o1442J6870N6027q0375L7279N4876l0525j9807N847
7113C9155k9980k0778o355j7490l2463j8530n1038L0008P7172O9738N420o2927
7101a8068l3846J8645N8883J6304n8599n290j0183J2395k4928M4809M272J3693
7089A8087j7323q004j2412j7626k6073K1543L4452R188J5075m8682P5093N0446
7077I3764M2223k9141r1309o3411p465M761K2208L8501Q821P4172r017q1488m4750
$$ plain form
7064 -42131 -18428 49562 107686 96704 85279 77623 112179 57865 9740 22564 -2903 -20034
7052 -20034 -38371 -52773 -86276 -108591 -76568 -50246 -16832 -253 -10122 -41829 -74633 -135669
7040 -135669 -107279 -20688 6560 -9911 -39197 -54421 -41313 -52983 1164 120673 135024
7029 135024 24180 4350 7317 11554 21053 -40467 -39515 -163 -13029 21486 11486 13523 -31951
7016 -31951 -62489 -27766 4977 -35240 -76998 -39960 -34162 -45570 -83997 -46605 -46386 -49355 8644
7003 8644 31539 26711 -38753 -53992 -20528 40166 -39421 -85776 -57336 -11098 -8613 4570
6991 4570 8273 22087 -8654 6464 27463 15322 -73057 -73050 -16902 6673 48275 -15350 -53454
6978 -53454 -60541 -46975 -37122 -92383 -93643 -39467 -30817 -33213 -38710 -34121 -14470 -9521 -15369 -28741
$$ packed form
7064d2131K3703O7990N8124j0982j1425p656L4556n4314m8125J2824k5467j7131
7052b0034j8337j4402l3503k2315L2023K6322L3414J6579r869l1707l2804o1036
7040a35669K8390Q6591K7248j6471k9286j5224J3108j1670N4147J19509J4351
7029A35024j10844j9830K967M237R499o1520R52L9352j2866L4515j0000K037m5474
7016c1951l0538L4723L2743m0217m1758L7038N798j1408l8427L7392K19k969N7999
7003H644K2895m828o5464j5239L3464O0694p9587m6355K8440M6238K485J3183
6991D570L703J3814l0741J5118K0999j2141q8379PN6148K3575M1602o3625l8104
6978e3454p087J3566R853n5261j260N4176Q650k396n497M589J9651M949n848j3372
$$ plain form
6964 -28741 5718 38448 51922 54214 -7237 -75007 -79661 -137649 -99817 -40360 -76629 -75584
6952 -75584 -46293 1465 28817 12484 36787 72106 57611 52191 19978 25352 -56948 -57601 13471
6939 13471 43668 33793 44275 7248 -17706 26690 17356 -9038 -779 -7626 -52168 -36904 -85070
6926 -85070 -127278 -57716 19605 43792 -21828 -73370 -41892 -4436 -10242 -35613 -70631 -74261
6914 -74261 -25866 -46122 -5421 9326 6920 11957 63532 118740 132036 77945 56369 28666
6902 28666 -251 -15696 -5851 9827 -44742 -8208 -8732 -12907 -22375 9650 14613 5896 8888
6889 8888 24244 -59972 -92692 -108568 -83670 -59774 -95092 -86894 -22555 40128 101150 126643
6877 126643 75625 98743 63828 64458 103295 44005 -25791 -53772 -119413 -114536 -77908 -60373
$$ packed form
6964b8741L4459L2730J3474K292o1451o7770m654n7988L7832N9457l6269J045
6952g5584K9291M7758K7352j6333K4303L5319j4495n420l2213N374q2300o53P1072
6939A3471L0197r875J0482l7027k4954M4396r334k6394Q259o847m4542J5264m8166
6926h5070m2208O9562P7321K4187o5620n1542L1478L7456n806k5371l5018l630
6914g4261M8395k0256M0701J4747k406N037N1575N5208J3296n4091k1576k7703
6902B8666k8917j5445R845J5678n4569L6534n24m175r468L2025M963q717K992
6889H888J5356q4216l2720j5876K4898K3896l5318Q198O4339O2683O1022K5493
6877A26643n1018K3118l4915O30L8837n9290o9796k7981o5641M877L6628J7535
$$ plain form
6865 -60373 -30516 34936 43924 34706 21873 46323 -12728 -60779 -103172 -50152 19416 23520
6853 23520 -22813 -16882 -18886 37731 78282 79465 30162 -8246 -21804 20129 35771 1164
6841 1164 17570 47048 28287 4515 1955 -30235 -25116 -27500 -79937 -85629 -34383 -63035 -24536
6828 -24536 -25757 -32806 -2935 19556 22156 60450 65474 23527 -55140 -19282 15597 -8955 -81155
6815 -81155 -99508 -52205 -30641 5107 18288 -617 9267 24090 13258 -11868 53574 82351
6803 82351 66634 40696 -15643 -47258 -17317 -5763 -6511 -44793 -16610 61006 74310 12762
6791 12762 -9899 -5436 23549 -47411 -115971 -77367 -59758 -34008 -48449 -7381 -34896 -1097
6779 -1097 821 -26631 7105 18830 -929 -6547 -39650 -46328 -57769 -55710 -20378 11953 55886
$$ packed form
6865f0373K9857O5452Q988r218j2833K4450n9051m8051m2393N3020O9568M104
6853B3520m6333N931k004N6617M0551J183m9303l8408j3558M1933J5642l4607
6841A164J6406K9478j8761k3772k560l2190N119k384n2437n692N1246k8652L8499
6828b4536j221p049K9871K2491K600L8294N024m1947p8667L5858L4879k4552p2200
6815h1155j8353M7303K1564L5748J3181j8905R884J4823j0832k5126O5442K8777
6803H2351j5717k5938n6339l1615K9941J1554p48l8282K8183P7616J3304o1548
6791A2762k2661M463K8985p0960o8560L8604J7609K5750j4441M1068k7515L3799
6779a097J918k7452L3736J1725j9759n618l3103o678j1441K059L5332L2331M3933
$$ plain form
6766 55886 81941 32300 28360 93755 103777 59946 45593 29893 12413 -26023 -35959 -43759
6754 -43759 -3836 26410 68359 78923 87169 86623 59762 14125 -8835 -52121 -89393 -113156
6742 -113156 -85925 -65872 -52616 -22435 -8445 19672 -1647 -4252 47237 109252 160068 147141
6730 147141 103541 107657 142807 104694 82597 44075 -12297 21196 83224 78513 90809 76391
6718 76391 87744 131837 214018 254428 351399 577327 810750 1000598 1202665 1207890 1016160
6707 1016160 825401 611831 482813 433637 300364 220957 203809 190505 142375 203647 193609
6696 193609 176566 220190 178463 86618 59412 98058 124349 124950 201535 215254 175272 95034
6684 95034 52778 71946 80111 119613 146513 192687 184097 162939 117852 63427 27442 56134
$$ packed form
6766E5886K6055m9641l940O5395J0022m3831j4353j5700j7480l8436r936p800
6754d3759L9923L0246M1949J0564Q246n46k6861m5637k2960m3286l7272k3763
6742a13156K7231K0053J3256L0181J3990K8117k1319k605N1489O2015N0816j2927
6730A47141m3600M116L5150l8113k2097l8522n6372L3493O2028m711J2296j4418
6718G6391J1353M4093Q2181M0410R6971K25928K33423J89848K02067N225j91730
6707A016160j90759k13570j29018m9176j33273p9407j7148j3304m8130O1272j0038
6696A93609j7043M3624m1727r1845k7206L8646K6291O01P6585J3719l9982q0238
6684I5034m2256J9168Q165L9502K6900M6174q590k1158m5087n4425l5985K8692
$$ plain form
6672 56134 79750 86091 93836 29532 86012 90238 78459 123480 98855 71279 46842 75638
6660 75638 122209 125427 88741 -1284 -39762 -35200 -4183 8542 38177 28573 4310 -34377
6648 -34377 -94138 -70196 -38119 -71933 -56767 12908 59397 51311 90973 96036 70200 40749
6636 40749 3151 -43768 -95606 -90851 -42969 -25425 -46157 -64686 -120944 -140106 -159384 -162375
6624 -162375 -80677 -26078 1877 27230 7364 -10275 -44601 -46688 -54384 -54243 -42574 6373
6612 6373 19093 8562 40603 28976 10403 -31274 -26928 -43294 -4002 42913 11049 23961
6600 23961 -4007 8061 -29824 -6708 -9786 -14826 47003 75242 21224 -32268 -43415 -27853
6588 -27853 34621 74275 21112 -11154 -12407 10089 33590 65237 96269 85506 45247 33865
$$ packed form
6672E6134K3616O341P745o4304N6480M226j1779M5021k4625k7576k4437K8796
6660G5638M6571L218l6686r0025l8478M562L1017J2725K9635r604k4263l8687
6648c4377n9761K3942L2077l3814J5166O9675M6489q086L9662N063k5836k9451
6636D0749l7598m6919n1838M755M7882J7544k0732j8529n6258j9162j9278k991
6624a62375Q1698N4599K7955K5353j9866j7639l4326k087p696J41J1669M8947
6612F373J2720j0531L2041j1627j8573m1677M346j6366L9292M6915l1864J2912
6600B3961k7968J2068l7885K3116l078n040O1829K8239n4018n3492j1147J5562
6588b7853O2474L9654n3163l2266j253K2496K3501L1647L1032j0763m0259j1382
$$ plain form
6576 33865 12261 -67859 -38492 -67623 -20012 22552 38002 -10097 12489 -33038 -80370 -98347
6564 -98347 -24946 7783 -24866 -51940 -10449 -30542 -98144 -67743 -18148 33061 23411 -72943
6552 -72943 -132309 -171722 -178174 -119048 -50023 -2899 214 -54834 -120487 -82365 -50648 -47597
6540 -47597 -57927 -1934 20689 -32484 -43367 -81344 -97940 -86379 -2780 65883 39377 6658
6528 6658 -25266 -59834 -82404 -58306 -54867 -60904 -104865 -93054 -66026 -84194 -47360 -15151
6516 -15151 -34932 -2417 -7688 -36356 -37653 -53815 -96790 -132852 -113224 -22777 33455 -7816
6504 -7816 13150 16794 -17595 -62099 -79098 -55619 -26767 -9466 12748 40757 45638 -1218
6492 -1218 -26919 -56034 -58797 -42507 23606 5869 -35967 -48410 -66817 -60225 1213 13727
$$ packed form
6576C3865k1604q0120K9367k9131M7611M2564J5450m8099K2586m5527m7332j7977
6564i8347P3401L2729l2649k7074M1491k0093o7602L0401M9595N1209r650r6354
6552g2943n9366l9413o452N9126O9025M7124L113n5048o5653L8122L1717L051
6540d7597j0330N5993K2623n3173j0883l7977j6596J1561Q3599O8663k6506l2719
6528F658l1924l4568k2570K4098L439o037m3961J1811K7028j8168L6834L2209
6516a5151j9781L2515n271k8668j297j6162m2975l6062J9628R0447N6232m1271
6504g816K0966L644l4389m4504j6999K3479K8852J7301K2214K8009M881m6856
6492a218k5701k9115k763J6290O6113j7737m1836j2443j8407O592O1438J2514
$$ plain form
6480 13727 2700 16706 2795 66432 39541 11557 70129 8542 49198 106038 115178 78723
6468 78723 10402 -25158 -77827 -38830 -33497 11664 23695 100703 61456 24499 15715 6194
6456 6194 5460 24793 26120 31828 51137 108447 134045 143209 102554 42733 -57895 -86230 -99456
6443 -99456 -74701 -41505 -30216 -7932 -10246 -2954 46088 68074 98091 104086 20515 -86378
6431 -86378 -139138 -91680 -26370 -41090 -13983 -3494 32358 12221 -26553 -45413 11662 59845
6419 59845 68700 958 -2278 20236 -76068 -101056 -93019 -39024 14571 -21321 -7335 11439
6407 11439 -14490 14954 431 891 -50096 -96903 -131206 -114109 -101437 -84007 -69490 -44354
6395 -44354 -29820 -16978 -11488 11105 -59951 -58832 -51033 -74982 -111632 -82245 -37060 -71784
$$ packed form
6480A3727j1027J4006j3911O3637k6891k7984N8572o1587M0656N6840R140l6455
6468G8723o8321l5560n2669L8997N333M5161J2031P7008l9247l6957q784r521
6456F194p34J9333J327N708J9309N7310K5598R164m0655n9821j00628k8335j3226
6443i9456K4755L3196J1289K2284k314P292M9042K1986L0017N995q3571j06893
6431h6378n2760M7458O5310j4720K7107J0489L5852k0137l8774j8860N7075M8183
6419E9845Q855o7742l236K2514r6304k4988Q037N3995N3595l5892J3986J8774
6407A1439k5929K9444j4523M60n0987m6807l4303J7097J2672J7430J4517K5136
6395d4354J4534J2842N490K2593p1056J119P799k3949l6650K9387M5185l4724
$$ plain form
6383 -71784 -65835 -16580 -40451 -39752 -59256 -48795 -47446 40678 54009 16024 -36801 -16176 28965
6370 28965 56993 61234 6453 -23756 -52469 -34264 60707 84917 52430 49734 -66623 -59648
6358 -59648 13832 -4512 13864 -589 10638 25025 -971 9564 43786 104875 89547 54077
6346 54077 1096 -24025 -18083 51903 22094 43862 43461 24018 59254 61987 1300 -2179 -12839
6333 -12839 -14188 -15361 -12741 -2919 -13931 -4354 13046 64537 11574 2247 674 -3806 14832
6320 14832 4383 -22877 -10612 -86553 -128437 -23897 -28773 -69855 -81317 -48013 -19908 818
6308 818 5299 7703 42427 74830 106251 68391 21238 -25549 -86979 -97164 -60908 -62164 -39483
6295 -39483 -13730 31488 62105 36177 -25709 -16276 -6375 -26652 -34296 -12081 49109 102039
$$ packed form
6383g1784N949M9255k3871O99j9504J0461J349Q8124J3331l7985n2825K0625M5141
6370B8965K8028M241n4781l0209k8713J8205R4971K4210l2487k696j16357O975
6358e9648P3480j8344J8376j4453J1227J4387k5996J0535L4222O1089j5328l5470
6346E4077n2981k5121N942O9986k9809K1768m01j9443L5236K733o0687l479j0660
6333a2839j349j173K620R822j1012R577J7400N1491n2963r327j573m480J8638
6320A4832j0449k7260J2265p5941m1884J04540m876m1082j1462L3304K8105K0726
6308H18M481K404L4724L2403L1421l7860m7153m6787o1430j0185L6256j256K2681
6295c9483K5753M5218L0617k5928o1886R433R901k0277p644K2215O1190N2930
$$ plain form
6283 102039 92065 33387 -51505 -75137 -19613 42669 111865 90945 55750 54293 31300 62398
6271 62398 46694 42047 16054 -39762 -34372 -11139 -24999 -29108 -21432 -65190 -91100 -154575 -143102
6258 -143102 -121605 -95399 -75452 -58747 -52899 -63006 -7819 35580 33698 52242 36232 36012
6246 36012 16211 -19901 -42703 -81886 -87629 -62468 -43354 -27385 26841 10290 -4017 3781
6234 3781 42610 38311 -23283 19433 5409 17398 39922 28642 -9046 10075 54416 5282
6222 5282 -34925 -22336 56370 75151 67308 66985 45571 40017 2918 -88249 -71511 -17997 43037
6209 43037 86016 27176 24397 34531 8697 27198 64881 53649 27194 22979 25262 56112
6197 56112 59529 24275 38780 7863 22885 -12671 -40125 -18583 -33945 -48839 -1297 6168
$$ packed form
6283A02039r974n8678q4892k3632N5524O2282O9196k0920l5195j457k2993L1098
6271F2398j5704m647k5993n5816N390K3233j3860m109P676m3758k5910o3475J1473
6258a43102K1497K6206J9947J6705N848j0107N5187M3399j882J8544j6010k20
6246C6012j9801l6112k2802l9183n743K5161J9114J5969N4226j6551j4307P798
6234C781L8829m299o1594M2716j4024J1989K2524j1280l7688J9121M4341m9134
6222E282m0207J2589P8706J8781p843l23k1414n554l7099r1167J6738N3514O1034
6209D3037M2979n8840k779J0134k5834J8501L7683j1232k6455m215K283L0850
6197E6112L417l5254J4505l0917J5022l5556k7454K1542j5362j4894M7542P465
$$ plain form
6185 6168 67260 48749 33960 -19268 -108303 -67103 -74769 -91981 -41099 30819 56579 44269
6173 44269 41270 27363 21626 12299 -8233 99315 141265 116288 49529 -729 3256 -37024
6161 -37024 -83517 -91630 -103265 -30365 -1979 32328 44271 1511 -40456 -37344 -70807 -72956
6149 -72956 -50014 2173 -29251 -75016 -48169 6362 -42325 -42690 20605 16028 44084 111765
6137 111765 50257 -322 -39762 -60668 -68095 -78979 -83026 -30498 24428 18116 -25362 -57112
6125 -57112 -89097 -67406 -40086 3005 4360 -39992 7180 -6240 42076 35276 51110 102219
6113 102219 110739 34983 -50837 -93764 -84450 -95572 -95340 -82544 -38109 -7047 -37300 -93278
6101 -93278 -121797 -66112 -7176 -12266 -25435 -61259 -89653 -98889 -98047 -119119 -122069 -93088 -30456
$$ packed form
6185F168O1092j8511j4789n3228q9035M1200p666j7212N0882P1918K5760j2310
6173D4269k999j3907n737r327k0532J07548M1950k4977o6759n0258L985m0280
6161c7024m6493q113j1635P2900K8386L4307J1943m2760m1967L112l3463k149
6149g2956K2942N2187l1424m5765K6847N4531m8687l65O3295m577K8056O7681
6137A11765o1508n0579l9440k0906p427j0884m047N2528N4926o312m3478l1750
6125e7112l1985K1691K7320M3091J355m4352M7172j3420M8316o800J5834N1109
6113A02219Q520p5756q5820m2927R314j1122K32J2796M4435L1062l0253n5978
6101i3278k8519N5685N8936n090j3169l5824k8394r236Q42k1072k950K8981O2632
$$ plain form
6088 -30456 7349 -22037 -15671 -44364 -52273 -22600 -60629 -21981 51961 84868 87465 58593
6076 58593 33152 -46401 -63893 10079 15021 -5101 -4309 73529 46340 -11704 -49598 -33276
6064 -33276 62545 41066 34759 40849 25369 -23506 -55920 -102773 -97420 -48522 -78919 -76913 -72085
6051 -72085 -83181 -13087 35125 27830 -8405 -62480 -55723 -8089 -24166 -5045 47059 14067
6039 14067 -22528 -61423 -48217 -4104 -30386 -85098 -86399 -68909 -17196 -16468 14888 65332
6027 65332 41015 13960 -15342 -82443 -95634 -56549 -30041 -7170 23787 -2883 -44592 -89737
6015 -89737 -78636 -65969 -41428 -55674 -84829 -51041 -12963 -1138 -25511 10220 23943 18959
6003 18959 50640 -29579 -58719 -63818 -64919 -83293 -49240 -24704 8246 43127 37904 21629
$$ packed form
6088c0456L7805k9386O366k8693p909K9673l8029L8648P3942L2907K597k8872
6076E8593k5441p9553j7492P3972M942k0122P92P7838k7189n8044l7894J6322
6064c3276R5821k1479o307O090j5480m8875l2414m6853N353M8898l0397K006M828
6051g2085j1096P0094M8212p295l6235n4075O757M7634j6077J9121N2104l2992
6039A4067l6595l8895J3206M4113k6282n4712j301J7490N1713P28L1356N0444
6027F5332k4317k7055k9302o7101j3191L9085K6508K2871L0957k6670m1709m5145
6015h9737J1101J2667K4541j4246k9155L3788L8078J1825k4373L5731J3723m984
6003A8959L1681q0219k9140n099j101j8374L4053K4536L2950L4881n223j6275
$$ plain form
5991 21629 -13546 2613 6968 49765 130485 112203 125292 154307 126438 58397 19965 77301
5979 77301 154676 78588 25131 33753 4279 -49283 -70897 -7799 41106 37846 -10338 -63162
5967 -63162 -41389 -65791 -47745 6600 -5748 -12746 12956 20217 -43762 -43664 -23587 13754 45018
5954 45018 6183 -13735 -7811 -18263 -34013 -15291 -19931 -37573 -21590 -73813 -102422 -103557
5942 -103557 -35656 -7088 -35753 -14561 10469 54738 31778 -42008 -90278 -98115 -70225 -75435
5930 -75435 4889 124762 147330 92960 75504 91739 104613 76924 40205 79421 94851 65941
5918 65941 59899 74314 -2863 -53631 -113258 -127066 -120869 -29853 31233 18872 13709 39948
5906 39948 -18729 -113487 -99391 -2185 -2157 -40689 -59498 -31962 -28293 1812 58467 70460 74130
$$ packed form
5991B1629l5175J6159M355M2797Q0720j8282J3089K9015k7869o8041l8432N7336
5979G7301P7375p6088n3457Q622k9474n3562k1614O3098M8905l260m8184n2824
5967f3162K1773k4402J8046N4345j2348o998K5702P261o3979R8K0077L7341L1264
5954D5018l8835j9918N924j0452j5750J8722m640j7642J5983n2223k8609j135
5942a03557O7901K8568k8665K1192K5030M4269k2960p3786m8270p837K7890n210
5930g5435Q0324J19873K2568n4370j7456J6235J2874k7689l6719L9216J5430k8910
5918F5941o042J4415p7177n0768n9627j3808O197R1016O1086j2361n163K6239
5906C9948n8677r4758J4096R7206K8l8532j8809K7536L669L0105N6655J1993L670
$$ plain form
5893 74130 92212 114005 62676 -44641 -96751 -71238 -113512 -128944 -163030 -169775 -108988 -111923
5881 -111923 -117360 -85427 -77894 -55987 -85834 -112290 -109030 -117714 -50636 19692 11428 -25244 -37025
5868 -37025 -38700 -28261 13208 42802 28150 32038 35008 18682 4144 27583 5777 -6130
5856 -6130 13479 -16627 -70265 -120600 -179191 -159004 -125583 -21305 71000 90541 102410 100789
5844 100789 32737 16086 23947 33347 25013 -84827 -92239 -68694 -89519 -142410 -133792 -116014
5832 -116014 -82326 -72995 -41429 2965 -12293 10426 49710 2101 -31947 5079 26040 -49911
5820 -49911 -95623 -78833 -108274 -101442 -55410 -21333 404 32381 65922 44479 29442 78115
5808 78115 97713 42202 14164 -3033 -9626 15803 26464 -6673 9393 67223 17751 3885
$$ packed form
5893G4130J8082K1793n1329j07317n2110K5513m2274j5432l4086o745O0787k935
5881a11923n437L1933P533K1907k9847k6456L260q684O7078P0328q264l6672j1781
5868c7025j675J0439M1469K9594j4652L888K970j6326j4538K3439k1806j1907
5856f130J9609l0106n3638n0335n8591K0187L3421J04278R2305J9541J1869j621
5844A00789o8052j6651P861R400q334j09840p412K3545k0825n2891Q618J7778
5832a16014L3688R331L1566M4394j5258K2719L9284m7609l4048L7026K0961p5951
5820d9911m5712J6790k9441O832M6032L4077K1737L1977L3541k1443j5037M8673
5808G8115J9598n5511k8038j7197o593K5429J0661l3137J6066N7830m9472j3866
$$ plain form
5796 3885 -11398 -45380 -43544 -29992 -49905 -15435 45402 39123 28432 14667 25187 26292 -15720
5783 -15720 -29794 -13476 -6099 12195 -59400 -98100 -45083 -23420 -33109 -22061 -47506 -61916
5771 -61916 -23287 14976 -7622 -56396 -33378 -21755 -51783 -13827 -10055 -4245 6956 -12765
5759 -12765 -53731 -70878 -110778 -78924 7366 19967 15352 -23766 -53662 -38679 -13383 11390
5747 11390 -3229 -38808 -63606 -85756 -124726 -131472 -34959 -16192 -45565 -80752 -57523 -58760
5735 -58760 -45711 -38072 -61406 -77387 -69374 -16876 33972 8655 -35350 -28880 -16023 -37033
5723 -37033 -41255 -59962 -88983 -62833 -7785 36215 14195 3369 48869 52517 49788 -35583
5711 -35583 -93254 -59792 -7040 -41513 -4034 24392 -10397 -36943 7992 -2414 -45293 -82303
$$ packed form
5796C885j5283l3982J836J3552j9913L4470O0837o279j0691j3765J0520J105m2012
5783a5720j4074J6318P377J8294p1595l8700N3017K1663r689J1048k5445j4410
5771f1916L8629L8263k2598m8774K3018J1623l0028L7956L772N810J1201j9721
5759a2765m0966j7147l9900L1854Q6290J2601m615l9118k9896J4983K5296K4773
5747A1390j4619l5579k4798k2150l8970o746R6513J8767k9373l5187K3229j237
5735e8760J3049P639k3334j5981Q013N2498N0848k5317m4005O470J2857k1010
5723c7033m222j8707k9021K6150N5048M4000k2020j0826M5500L648k729q5371
5711c5583n7671L3462N2752l4473L7479K8426l4789k6546M4935j0406m2879l7010
$$ plain form
5699 -82303 -90357 -52739 -48738 -42958 1750 27903 26135 -17791 -65376 -7232 -14808 -49424 -41646
5686 -41646 -30698 -67773 -38597 42677 73182 22172 -27809 -47135 -36675 -46027 -27494 -5848
5674 -5848 4559 3029 -4661 -65936 -103272 -102684 -16897 19457 -7707 -3854 -4556 21296 5784
5661 5784 41859 85211 84900 69310 66218 94846 36834 2931 22001 -15661 23030 -6261 -16956
5648 -16956 -30413 -25445 -34737 -18142 -15019 -54932 -76382 -22425 -9378 -43105 -85430 -59007
5636 -59007 -28462 -12299 5151 -33426 -20805 -30 29042 13894 -15362 -25843 -27593 -62032
5624 -62032 -92565 -17027 -16207 1817 -25012 -33632 -17117 -39380 -25482 4504 22757 12573
5612 12573 -14059 -2805 -15899 -96904 -128413 -137854 -99830 -71757 -56851 -18924 -48134 -81857
$$ packed form
5699h2303q054L7618M001N780M4708K6153j768m3926m7585N8144p576l4616P778
5686d1646J0948l7075K9176Q1274L0505n1010m9981j9326J0460r352J8533K1646
5674e848J0407j530p690o1275l7336N88Q5787L6354k7164L853p02K5852j5512
5661E784L6075M3352l11j5590l092K8628n8012l3903J9070l7662L8691k9291j0695
5648a6956j3457M968r292J6595L123l9913k1450N3957J3047l3727m2325K6423
5636e9007L0545J6163J7450l8577J2621K0775K9072j5148k9256j0481j750l4439
5624f2032l0533P5538Q20J8024k6829q620J6515k2263J3898K9986J8253j0184
5612A2573k6632J1254j3094q1005l1509r441L8024K8073J4906L7927k9210l3723
$$ plain form
5600 -81857 -54615 -43761 -7900 7393 -41 -22171 11850 51425 23280 -29435 -42637 -42575 -95173
5587 -95173 -55845 1566 -2444 22004 15112 35966 32010 -23566 -73820 -77923 -46771 -30227 -78950
5574 -78950 -78692 -22161 -6084 14971 7336 14951 -22967 -30160 -63162 -37844 -46699 -97985 -89855
5561 -89855 2583 -10184 258 72563 47908 -26223 -93959 -168042 -177918 -163096 -136091 -51595
5549 -51595 21800 29231 -66995 -98663 -73146 -46132 39055 41401 50208 24382 37529 53261
5537 53261 46765 66924 95028 61467 49295 -6382 -46063 -41052 22161 6563 -20999 26956
5525 26956 -22482 -46674 20782 68500 36341 22673 6538 -68203 -83491 -48587 25829 47048
5513 47048 47977 37373 25322 80386 114325 122861 90982 48309 83369 108611 33633 7340
$$ packed form
5600h1857K7242J0854L5861J5293p434k2130L4021L9575k8145n2715j3202O2n2598
5587i5173L9328N7411m010K4448o892K0854l956n5576n0254m103L1152J6544m8723
5574g8950K58N6531J6077K1055p635P615l7918p193l3002K5318q855n1286Q130
5561h9855R2438j2767J0442P2305k4655p4131o7736p4083r876J4822K7005Q4496
5549e1595P3395P431r6226l1668K5517K7014Q5187K346Q807k5826J3147J5732
5537E3261o496K0159K8104l3561j2172n5677l9681N011O3213j5598k7562M7955
5525B6956m9438k4192O7456M7718l2159j3668j6135p4741j5288L4904P4416K1219
5513D7048R29j0604j2051N5064L3939Q536l1879m2673L5060K5242p4978k6293
$$ plain form
5501 7340 79057 71819 42548 740 -7118 21820 32125 -3839 -18105 -76647 -41774 -67604
5489 -67604 -73940 -67988 -72944 -67279 -54900 -20401 62631 105738 88973 78439 -4638 -49518 -49026
5476 -49026 -88357 -83618 -70817 -45676 3586 27802 45204 104390 101001 16038 -19856 -65874
5464 -65874 -127531 -143483 -81929 -28254 -25799 -28352 -25184 -51933 -20804 6201 -15773 8166
5452 8166 49723 82356 96324 95840 37538 7873 44629 61429 20179 -24634 -42524 15685
5440 15685 39157 55668 65752 -8378 4168 24315 25155 -25490 -51590 -38042 -79170 -40654
5428 -40654 12603 66013 54777 72526 24032 19642 53043 80118 88591 80189 -4304 -70305
5416 -70305 -83102 -80542 -59421 -46280 -44824 -27380 -45168 -35270 5622 -11192 -36090 -23227
$$ packed form
5501G340P1717p238k9271m1808p858K8938J0305l5964j4266n8542L4873k5830
5489f7604o336N952m956N665J2379L4499Q3032M3107j6765j0534q3077m4880M92
5476d9026l9331M739J2801K5141M9262K4216J7402N9186l389q4963l5894m6018
5464f5874o1657j5952O1554N3675K455k553L168k6749L1129K7005k1974K3939
5452H166M1557L2633J3968m84n8302k9665L6756J6800m1250m4813j7890N8209
5440A5685K3472J6511J0084p4130J2546K0147Q40n0645k6100J3548m1128L8516
5428d0654N3257N3410j1236J7749m8494m390L3401K7075Q473q402q4493o6001
5416g0305j2797K560K1121J3141J456J7444j7788R898M0892j6814k4898J2863
$$ plain form
5404 -23227 -38997 -23952 26247 13099 -28649 -56039 -60267 -54734 -17346 -8909 65778 96256
5392 96256 97744 111991 69411 85203 15361 -68176 -49081 8569 -7903 -13734 6803 32833
5380 32833 69890 126591 63471 -26148 -50622 -27103 52255 85364 95562 105514 135796 110941
5368 110941 36857 644 55332 47783 70133 60243 58639 32682 57996 42096 -7132 40194
5356 40194 100174 96357 75277 18338 -11788 -9496 -35511 -41954 -11552 -16549 -74224 -41060 -398
5343 -398 23657 92820 101766 36145 3592 -22555 -38990 -29477 -51512 -11857 53673 -18337 -79830
5330 -79830 -24285 49892 27598 -16342 -8836 -40637 -29515 -29791 -10353 -21499 -38747 -24106
5318 -24106 11485 -41546 -59236 -908 44900 15313 -9711 14030 34374 5876 -1644 6932
$$ packed form
5404b3227j5770J5045N0199j3148m1748k7390m228N533L7388Q437P4687L0478
5392I6256J488J4247m2580J5792o9842q3537J9095N7650j6472n831K0537K6030
5380C2833L7057N6701o3120q9619k4474K3519P9358L3109J0198R952L0282k4855
5368A10941p4084l6213N4688p549K2350r890j604k5957K5314j5900m9228M7326
5356D0194N9980l817k1080n6939l0126K292k6015o443L0402m997n7675L3164M0662
5343c98K4055O9163Q946o5621l2553k6147j6435R513k2035L9655O5530p2010o1493
5330g9830N5545P4177k2294m3940P506l1801J1122k76J9438j1146j7248J4641
5318b4106L5591n3031j7690N8328M5808k9587k5024K3741K0344k8498p520Q576
$$ plain form
5306 6932 -60381 -66755 -91390 -58717 27348 5199 46090 31711 -64624 -31906 4391 11511
5294 11511 -49894 -121035 -24740 88709 85380 12344 -51216 -35151 8775 23582 -11025 -121
5282 -121 -46246 -57973 163 2151 -22057 -44434 -33541 -23768 -12765 8063 10635 23843 64551
5269 64551 54962 37822 -5808 -36695 -11160 -9041 -12996 6215 32595 67201 67787 131959 133281
5256 133281 69892 -23814 -44328 67996 91197 28347 28720 9719 -12043 -29280 -44526 -77060
5244 -77060 -24630 19630 11635 27239 33548 27894 12297 6994 -104278 -104720 -66909 -68648 -121017
5231 -121017 -132608 -85119 -118863 -98201 -54270 -101063 -102770 -82063 -76958 -60984 -53610 -54954
5219 -54954 -43424 -36444 23606 70957 74424 23797 41174 45877 14576 -6200 -24923 -97449
$$ packed form
5306F932o7313o374k4635L2673Q6065k2149M0891j4379r6335L2718L6297P120
5294A1511o1405p1141R6295J13449l329p3036o3560J6065M3926J4807l4607J0904
5282a21m6125j1727N8136J988k4208k2377J0893R773J1003K0828K572J3208M0708
5269F4551r589j7140m3630l0887K5535K119l955J9211K6380L4606N86O4172J322
5256A33281o3389r3706k0514J12324K3201o2850L73j9001k1762j7237j5246l2534
5244g7060N2430M4260p995J5604O309n654j5597n303j11272m42L7811j739n2369
5231a21017j1591M7489l3744K0662M3931m6793j707K0707N105J5974P374j344
5219e4954J1530O980O0050M7351L467n0627J7377M703l1301k0776j8723p2526
$$ plain form
5207 -97449 -115293 -107180 -64885 -50393 -50311 -6430 80238 16055 -41092 -39949 -85071 -38238 25865
5194 25865 44989 46711 23760 8286 -57582 -87608 -89240 -66167 -12209 24468 -8711 -20508
5182 -20508 -30016 -42922 -67971 -84176 -76974 -93842 -50876 -79589 -81870 -32452 -19235 9994
5170 9994 10003 6010 5063 27387 -13053 -30972 6321 19532 -25413 -131288 -180789 -104503 -52406
5157 -52406 -85778 -68780 -69558 -24425 25836 16985 -28203 -29671 -17953 -24748 -48888 -53392 -66126
5144 -66126 -59046 -63405 -46859 -68325 -76144 -12809 52664 95189 36008 -28775 33035 29565 43076
5131 43076 19556 3808 -51933 -46310 -12149 -68042 -101293 -60928 10543 27393 17660 30638
5119 30638 38693 20130 -23007 34928 41834 63215 44940 730 -80996 -119379 -92775 -94571
$$ packed form
5207i7449j7844Q113M2295J4492Q2M3881Q6668o4183n7147J143m5122M6833O4103
5194B5865J9124J722k2951j5474o5868l0026j632K3073N3958L6677l3179j1797
5182b0508r508j2906k5049j6205P202j6868M2966k8713k281M9418J3217K9229
5170I994Rl993r47K2324m0440j7919L7293J3211m4945j05875m9501P6286N2097
5157e2406l3372J6998p78M5133N0261q851m5188j468J1718o795k4140m504j2734
5144f6126P080m359J6546k1466p819O3335O5473M2525n9181o4783O1810l470J3511
5131D3076k3520j5748n5741N623L4161n5893l3251M0365P1471J6850r733J2978
5119C0638Q055j8563m3137N7935O906K1381j8275m4210q1726l8383K6604j796
$$ plain form
5107 -94571 -85377 -155150 -122196 -78763 -45508 22672 3113 -36706 -30161 -68235 -79864 -67142
5095 -67142 -47400 -20744 -62556 -105871 -65097 -38335 -53593 -59764 -67659 -31271 21219 29802
5083 29802 -19499 -49585 -21348 -88528 -176864 -154828 -73093 -1959 23362 -5139 -58317 -44280
5071 -44280 -10716 44059 -12460 -15794 -54527 -116923 -87788 -83837 7707 64510 48329 9431
5059 9431 13432 39923 53728 65310 79162 77444 44162 30188 87811 84764 79537 27641 -18656
5046 -18656 -19047 2924 -24565 -54467 2872 9322 -1934 -31082 4991 -17826 4790 31245
5034 31245 102769 53264 -35872 -100003 -84438 -81005 -107651 -91011 -75478 -69886 -101556 -117118
5022 -117118 -61957 14400 48422 64958 73692 63014 40426 -17043 -27890 -17221 -29828 -2250
$$ packed form
5107i4571R194o9773L2954M3433L3255O8180j9559l9819O545l8074j1629J2722
5095f7142J9742K6656m1812m3315M0774K6762j5258o171p895L6388N2490Q583
5083B9802m9301l0086K8237o7180q8336K2036Q1735P1134K5321k8501n3178J4037
5071d4280L3564N4775n6519l334l8733o2396K9135L951R1544N6803j6181l8898
5059I431M001K6491J3805J1582J3852j718l3282j3974N7623l047n227n1896m6297
5046a8656l91K1971k7489k9902N7339O450j1256k9148L6073k2817K2616K6455
5034C1245P1524m9505q9136o4131J5565L433k6646J6640J5533N592l1670j5562
5022a17118N5161P6357L4022J6536Q734j0678k2588n7469j0847J0669j2607K7578
$$ plain form
5010 -2250 -45138 -96313 -111233 -56281 -13079 19916 -9197 22147 25182 -2946 -29126 22654
4998 22654 41223 93929 81547 30355 36550 28159 61591 105415 59089 56045 29232 28435 32901
4985 32901 -6628 -2306 31964 34761 23233 30819 2007 -27244 -22833 -13537 -5373 -42791 -1618
4972 -1618 39943 11372 -26314 -39360 -39238 -44138 -48686 -64603 -50045 -11462 -5607 -29108 -24675
4959 -24675 -24464 -50056 -34256 49799 27081 -20306 -21748 -51550 -58186 -9224 -4963 -24644 27952
4946 27952 19818 -18482 29797 -11404 -54239 -53459 -24659 34065 37205 16530 -28380 -29832 -44569
4933 -44569 9767 34954 83950 69853 72168 98907 71912 -15889 -64533 -60562 13086 31353
4921 31353 -19213 10378 57155 78623 60694 20426 42859 41754 -38043 -64103 -57326 -116610
$$ packed form
5010b250m2888n1175j4920N4952M3202L2995k9113L1344L035k8128k6180N1780
4998B2654J8569N2706j2382n1192O195q391L3432M3824m6326l044k6813p97M466
4985C2901l9529M322L4270K797j1528P586k8812k9251M411R296Q164l7418M1173
4972a618M1561k8571l7686j3046J22m900m548j5917J4558L8583N855k3501M433
4959b4675K11k5592J5800Q4055k2718m7387j442k9802o636M8962M261j9681N2596
4946B7952q134l8300M8279m1201m2835P80K8800N8724L140k0675m4910j452j4737
4933d4569N4336K5187M8996j4097K315K6739k6995q7801m8644L971P3648J8267
4921C1353n0566K9591M6777K1468j7929m0268K2433j105p9797k6060O777n9284
$$ plain form
4909 -116610 -122346 -119947 -113846 -77905 -81884 -53890 -12501 -27192 23299 63049 27545 -46348
4897 -46348 -87452 -61653 -65386 -51483 10650 30553 21564 -1966 11049 17337 18148 -16617 -23833
4884 -23833 1036 25095 23776 34005 9663 -8619 -18789 -14396 3399 46269 104310 106740
4872 106740 24114 -19991 -38499 -71990 -67565 -52948 -36738 -71403 -84644 -80642 -75218 -42023
4860 -42023 -82026 -51881 24037 42040 63491 72539 1039 -48265 -21654 -11702 28017 39664
4848 39664 5130 19753 48923 53283 90103 6671 -5973 7747 31808 83829 71010 27806
4836 27806 -8075 -22407 -71734 -31356 2422 -35766 -40895 -25170 -62285 -68608 -59412 -26895
4824 -26895 -24217 -32907 -47672 -44667 -10376 -61930 1932 53575 31052 -14569 -44835 -20449
$$ packed form
4909a16610n736K399O101L5941l979K7994M1389j4691N0491L9750l5504p3893
4897d6348m1104K5799l733J3903O2133J9903q989k3530J3015O288Q11l4765p216
4884b3833K4869K4059j319J0229k4342j8282j0170M393J7795M2870N8041K430
4872A06740q2626m4105j8508l3491M425J4617J6210l4665j3241M002N424L3195
4860d2023m0003L0145P5918J8003K1451R048p1500m9304K6611R952L9719J1647
4848C9664l4534J4623K9170M360L6820q3432j2644J3720K4061N2021j2819m3204
4836B7806l5881j4332m9327M0378L3778l8188n129J5725l7115o323R196L2517
4824b6895K678q690j4765L005L4291n1554O3862N1643k2523m5621l0266K4386
$$ plain form
4812 -20449 -15155 20883 76650 69732 33640 36989 71960 71847 48851 89190 134041 139261 52325
4799 52325 16736 35884 19137 32385 57359 35940 29909 49921 60758 8994 24875 85855
4787 85855 169189 162523 63606 -23794 -37740 -23125 15990 22627 -7451 -48501 -3754 9510
4775 9510 -12453 -28152 -49972 -52131 -66773 -20603 62214 82578 119933 105842 98893 88798
4763 88798 43603 19175 94016 99283 105965 109861 93618 44916 -5829 9113 -38356 -33467 -12176
4750 -12176 -41874 -69279 -44567 -31562 12027 5522 -44687 -82511 -103614 -76645 -50895 -67522
4738 -67522 -36819 13091 18315 7418 -24409 -15244 -22356 -61590 -27692 -17713 40418 72387 65750
4725 65750 32416 8425 5903 -24377 -41434 -64514 -90953 -44959 30152 68048 37634 51751
$$ packed form
4812b0449N294L6038N5767o918l6092L349L4971j13k2996M0339M4851N220q6936
4799E2325l5589J9148j6747J3248K4974k1419o031K0012J0837n1764J5881O0980
4787H5855Q3334o666r8917q7400j3946J4615L9115O637l0078m1050M4747J3264
4775I510k1963j5699k1820k159j4642M6170Q2817K0364L7355j4091o949j0095
4763H8798m5195k4428P4841N267O682L896j6243m8702n0745J4942m7469M889K1291
4750a2176k9698k7405K4712J3005M3589o505n0209l7824k1103K6969K5750j6627
4738f7522L0703M9910N224j0897l1827R165p112l9234L3898R979N8131L1969o637
4725F5750l3334k3991k522l0280j7057k3080k6439M5994P5111L7896l0414J4117
$$ plain form
4713 51751 57024 -1012 -41048 -25322 -18942 -48338 -20056 14408 2211 -61445 -167647 -184872
4701 -184872 -114817 -11867 6521 -20738 7715 99771 96076 59931 20320 24955 75945 47330
4689 47330 73577 15303 -33718 -22346 -4049 59376 59907 51715 6464 -16013 27286 53511
4677 53511 80570 45142 22315 49912 79001 84196 76565 67004 94676 113925 45454 44071 38638
4664 38638 10393 -4137 43208 52216 -6944 -52709 -78875 -23369 13021 48826 59538 86408
4652 86408 65342 32616 41570 44384 9566 -43147 -63889 -41438 -32901 7102 43434 67516
4640 67516 62314 51280 47709 68071 68059 36266 -22173 -28213 2089 -11479 -26253 -40155 -55181
4627 -55181 -72944 -70435 -44408 -28109 -31663 -80676 -78455 -34572 -2932 -50555 -87672 -109435
$$ packed form
4713E1751N273n8036m0036J5726O380k9396K8282L4464j2197o3656j06202j7225
4701a84872P0055J02950J8388k7259K8453R2056l695l6145l9611M635N0990k8615
4689D7330K6247n8274m9021J1372J8297O3425N31q192m5251k2477M3299K6225
4677E3511K7059l5428k2827K7597K9089N195p631r561K7672J9249o8471j383n433
4664C8638k8245j4530M7345R008n9160m5765k6166N5506L6390L5805J0712K6870
4652H6408k1066l2726Q954K814l4818n2713k0742K2451Q537M0003L6332K4082
4640F7516n202j1034l571K0362j2l1793n8439o040L0302j3568j4774j3902j5026
4627e5181j7763K509K6027J6299l554m9013K221M3883L1640m7623l7117k1763
$$ plain form
4615 -109435 -74527 -17408 29128 78723 85763 27065 21312 -13873 -32558 -176 -15754 -50806
4603 -50806 -47015 -25366 5738 60580 46440 47735 26611 -7615 13566 17834 -63881 -57315 55527
4590 55527 84035 20367 13817 53277 85236 8504 -57010 -57802 -43039 -41471 -55032 14288 66017
4577 66017 55893 18441 39400 13941 -28776 -29455 -20730 -63920 -89172 -96346 -64686 -64962 -88094
4564 -88094 -61263 -13774 13620 -15718 -20928 6811 9541 40601 14515 40269 8322 -10338
4552 -10338 67627 69819 74226 57993 31427 26906 2657 -28855 -20868 -65939 -47089 9571 37136
4539 37136 91426 150589 143132 105699 31075 -10789 -52417 -119915 -145998 -106264 -82419 -64156
$$ packed form
4615a09435L4908N7119M6536M9595P040n8698n753l5185j8685L2382j5578l5052
4603e0806L791K1649L1104N4842j4140J295k1124l4226K1181M268q1715O566J12842
4590E5527K8508o3668o550L9460L1959p6732o5514p92J4763J568j3561O9320N1729
4577F6017j0124l7452K0959k5459m2717o79Q725m3190k5252p174L1660k76k3132
4564h8094K6831M7489K7394k9338n210K7739K730L1060k6086K5754l1947j8660
4552a0338P7965K192M407j6233k6566m521k4249l1512P987m5071J8850N6660K7565
4539C7136N4290N9163p457l7433p4624m1864m1628o7498k6083L9734K3845J8263
$$ [...]
##END NTUPLES=NMR SPECTRUM
##END=
