##TITLE=Analysis number 317646
Compound Code cc 47411
Book Reference 382/174
Project Code adrs
Chemist Name simons
##JCAMPDX= 6.0         $$ Bruker NMR JCAMP-DX V2.0
##DATA TYPE= NMR SPECTRUM
##DATA CLASS= NTUPLES
##ORIGIN= Bruker BioSpin GmbH
##OWNER= nmr
$$ XWIN-NMR		Version 3.5
$$ Tue Feb 28 11:00:26 2006 GMT Standard Time (UT+0h)  MAYBRIDGE\nmr@NMR_250MHZ
##.OBSERVE FREQUENCY= 250.131544655141
##.OBSERVE NUCLEUS= ^1H
##.ACQUISITION MODE= SIMULTANEOUS (DQD)
##.ACQUISITION SCHEME= undefined
##.AVERAGES= 16
##.DIGITISER RES= 18
##SPECTROMETER/DATA SYSTEM= dpx250
##.PULSE SEQUENCE= zg30
##.SOLVENT NAME= CDCl3
##.SHIFT REFERENCE= (INTERNAL, CDCl3, 0, 16.4561)
##AUDIT TRAIL= $$ (NUMBER, WHEN, WHO, WHERE, WHAT)
$$ ##TITLE= Audit trail, XWIN-NMR		Version 3.5
$$ ##JCAMPDX= 5.01
$$ ##ORIGIN= Bruker BioSpin GmbH
$$ ##OWNER= nmr
$$ C:\u/data/dgb/nmr/ADRS/17000/pdata/1/auditp.txt
$$ ##AUDIT TRAIL=  $$ (NUMBER, WHEN, WHO, WHERE, WHAT)
(   1,<2006-02-28 10:59:58.50 +000>,<MAYBRIDGE\nmr>,<NMR_250MHZ>,
      <created by zg, POWCHK disabled, PULCHK disabled
       configuration hash MD5:
       84 BC 41 DB A1 6E 1D 46 DA 25 12 A5 C1 ED C5 3A
       data hash MD5: 64K
       DF 5A 71 2D 74 A0 C0 E2 7E DD 27 B8 E6 B1 73 FB>)
(   2,<2006-02-28 11:00:16.83 +000>,<MAYBRIDGE\nmr>,<NMR_250MHZ>,
      <Start of raw data processing
       ef LB = 0.3 FT_mod = 6 PKNL = 1 SI = 32K 
       data hash MD5: 32K
       4B 12 79 C4 AC 13 13 05 11 68 1C A1 76 3F B1 36>)
(   3,<2006-02-28 11:00:19.17 +000>,<MAYBRIDGE\nmr>,<NMR_250MHZ>,
      <apk 
       data hash MD5: 32K
       65 36 EA A8 16 30 85 46 38 2D BC 6D 24 9F 88 24>)
(   4,<2006-02-28 11:00:19.89 +000>,<MAYBRIDGE\nmr>,<NMR_250MHZ>,
      <abs ABSG = 5 
       data hash MD5: 32K
       90 52 C5 B9 6D 18 1B BA 1B DD 02 F4 B7 02 74 91>)
$$ ##END=
$$ 
$$ hash MD5
$$ 11 1B AA D2 75 C6 AD 14 C8 2A EA D5 95 A0 E6 16
##$RELAX= 
##$RELAX= 
##$RELAX= 
##$RELAX= 
##$RELAX= 
##$RELAX= 
##$RELAX= 
$$ Bruker specific parameters
$$ --------------------------
##$DU= <C:\u>
##$EXPNO= 17000
##$NAME= <ADRS>
##$PROCNO= 1
##$TYPE= <nmr>
##$USER= <dgb>
##$AMP= (0..31)
100 100 100 100 100 100 100 100 100 100 100 100 100 100 100 100 100 100 
100 100 100 100 100 100 100 100 100 100 100 100 100 100 
##$AQSEQ= 0
##$AQ_mod= 3
##$AUNM= <au_zg>
##$AUTOPOS= <26 >
##$BF1= 250.13
##$BF2= 250.13
##$BF3= 250.13
##$BF4= 250.13
##$BF5= 500.13
##$BF6= 500.13
##$BF7= 500.13
##$BF8= 500.13
##$BYTORDA= 1
##$CFDGTYP= 0
##$CFRGTYP= 5
##$CHEMSTR= <none>
##$CNST= (0..31)
1 1 145 1 1 1 1 1 1 1 1 1 1 1 1 1 1 1 1 1 1 1 1 1 1 1 1 1 1 1 1 1 
##$CPDPRG= <>
##$CPDPRG1= <>
##$CPDPRG2= <>
##$CPDPRG3= <>
##$CPDPRG4= <mlev>
##$CPDPRG5= <mlev>
##$CPDPRG6= <mlev>
##$CPDPRG7= <mlev>
##$CPDPRG8= <mlev>
##$CPDPRGB= <>
##$CPDPRGT= <>
##$D= (0..31)
0 1 0 0 0 0 0 0 0 0.06 0 0 0 0 0 0 0.0002 0 0 0 0 0 0 0 0 0 0 0 0 0 0 
0 
##$DATE= 1141124396
##$DBL= (0..7)
120 120 120 120 120 120 120 120 
##$DBP= (0..7)
150 150 150 150 150 150 150 150 
##$DBP07= 0
##$DBPNAM0= <>
##$DBPNAM1= <>
$$ [...]
##$SUBNAM7= <"">
##$SUBNAM8= <"">
##$SUBNAM9= <"">
##$SW= 20.6930455092707
##$SWIBOX= (0..15)
0 0 3 0 0 0 0 0 0 0 0 0 0 0 0 0 
##$SW_h= 5175.983436853
##$TD= 65536
##$TD0= 1
##$TE= 293.16
##$TE2= 300
##$TE3= 300
##$TEG= 300
##$TL= (0..7)
0 120 120 120 120 120 120 120 
##$TP= (0..7)
150 150 150 150 150 150 150 150 
##$TP07= 0
##$TPNAME0= <>
##$TPNAME1= <>
##$TPNAME2= <>
##$TPNAME3= <>
##$TPNAME4= <>
##$TPNAME5= <>
##$TPNAME6= <>
##$TPNAME7= <>
##$TPOAL= (0..7)
0.5 0.5 0.5 0.5 0.5 0.5 0.5 0.5 
##$TPOFFS= (0..7)
0 0 0 0 0 0 0 0 
##$TUNHIN= 0
##$TUNHOUT= 0
##$TUNXOUT= 0
##$USERA1= <user>
##$USERA2= <user>
##$USERA3= <user>
##$USERA4= <user>
##$USERA5= <user>
##$V9= 5
##$VALIST= <valist>
##$VCLIST= <CCCCCCCCCCCCCCC>
##$VD= 0
##$VDLIST= <DDDDDDDDDDDDDDD>
##$VPLIST= <PPPPPPPPPPPPPPP>
##$VTLIST= <TTTTTTTTTTTTTTT>
##$WBST= 1024
##$WBSW= 4
##$XGAIN= (0..3)
0 0 0 0 
##$XL= 0
##$YL= 0
##$YMAX_a= 532660
##$YMIN_a= -581982
##$ZGOPTNS= <>
##$ZL1= 120
##$ZL2= 120
##$ZL3= 120
##$ZL4= 120
##$ABSF1= 16.45606
##$ABSF2= -4.237112
##$ABSG= 5
##$ABSL= 3
##$ALPHA= 0
##$AQORDER= 0
##$ASSFAC= 0
##$ASSFACI= 0
##$ASSFACX= 0
##$ASSWID= 0
##$AUNMP= <proc_1d>
##$AZFE= 0.1
##$AZFW= 0.1
##$BCFW= 0
##$BC_mod= 0
##$BYTORDP= 0
##$COROFFS= 0
##$CY= 12.5
##$DATMOD= 1
##$DC= 0
##$DFILT= <>
##$DTYPP= 0
##$F1P= 14.0000005364418
##$F2P= -0.99999901652339
##$FCOR= 0.5
##$FTSIZE= 32768
##$FT_mod= 6
##$GAMMA= 0
##$GB= 0
##$INTBC= 1
##$INTSCL= 1
##$ISEN= 128
##$LB= 0.3
##$LEV0= 0
##$LPBIN= 0
##$MAXI= 10000
##$MC2= 0
##$MEAN= 0
##$ME_mod= 0
##$MI= 0
##$NCOEF= 0
##$NC_proc= -3
##$NLEV= 6
##$NOISF1= 0
##$NOISF2= 0
##$NSP= 0
##$NTH_PI= 0
##$NZP= 0
##$OFFSET= 16.45606
##$PC= 1
##$PHC0= -113.2215
##$PHC1= 2.091053
##$PH_mod= 1
##$PKNL= yes
##$PPARMOD= 0
##$PSCAL= 4
##$PSIGN= 0
##$REVERSE= no
##$SF= 250.130016492202
##$SI= 32768
##$SIGF1= 0
##$SIGF2= 0
##$SINO= 400
##$SIOLD= 32768
##$SREGLST= <1H.CDCl3>
##$SSB= 0
##$STSI= 32768
##$STSR= 0
##$SW_p= 5175.98343685301
##$SYMM= 0
##$S_DEV= 0
##$TDeff= 65536
##$TDoff= 0
##$TI= <Analysis number 999999
Compound Code 99
Book Reference 9
Project Code 9>
##$TILT= no
##$TM1= 0
##$TM2= 0
##$TOPLEV= 0
##$USERP1= <user>
##$USERP2= <user>
##$USERP3= <user>
##$USERP4= <user>
##$USERP5= <user>
##$WDW= 1
##$XDIM= 32768
##$YMAX_p= 357530709
##$YMIN_p= -57549
$$ End of Bruker specific parameters
$$ ---------------------------------
##NTUPLES= NMR SPECTRUM
##VAR_NAME=  FREQUENCY,     SPECTRUM/REAL,   SPECTRUM/IMAG
##SYMBOL=    X,             R,               I
##VAR_TYPE=  INDEPENDENT,   DEPENDENT,       DEPENDENT
##VAR_FORM=  AFFN,          ASDF,            ASDF
##VAR_DIM=   32768,         32768,           32768
##UNITS=     HZ,            ARBITRARY UNITS, ARBITRARY UNITS
##FACTOR=    0.157963299565203, 1,           1
##FIRST=     4116.15466163639, 0,            0
##LAST=      -1059.82877521662, 0,           0
##MIN=       -1059.82877521662, -57549,      0
##MAX=       4116.15466163639, 357530709,    0
$$ Real data points
##PAGE= N=1
##DATA TABLE= (X++(R..R)), XYDATA
$$ [...]
16166g937N151m827o20j983l51J8642L053m45q969j9919J538J439n240o498k583
16151b9549R055l319Q928j941j739J1627J2019r806j9651q924J6745K2732j3148
16138f971p311J783r383M69P592K833R232N241q161K972J2220m754m826j8196
16124a7260K231K073m141k557j770j555J0475J4239O400j6065n126M682q725o998
16110b4097J4377r884m124k543K273O559J4369j931q273l245K717J078J4709j392
16096E93n262O310j0943J071o345j0388l883M960q75J3511J8458J2185l377q308
16082G707o692l883l172o285r508J292j176j07K2265n558o929K376M898l536j4535
16067b2843L794L164o080J555K0575N439q977j2340j2002k6k821K967N028j94
$$ plain form
16166 -7937 -2786 -7613 -8233 -10216 -10567 8075 11128 10683 1714 -18205 -16667 -15228 -20468 -26966 -29549
16151 -29549 -20494 -23813 -14885 -16826 -18565 -6938 5081 -4725 -24376 -33300 -16555 6177 -6971
16138 -6971 -14282 -12499 -21882 -21413 -13821 -10988 -1756 3485 -4676 -1704 10516 5762 936 -17260
16124 -17260 -15029 -12956 -17097 -19654 -21424 -22979 -12504 1735 8135 -7930 -13056 -8374 -17099 -24097
16110 -24097 -9720 -19604 -23728 -26271 -23998 -17439 -3070 -5001 -13274 -16519 -13802 -12724 1985 593
16096 593 -4669 1641 -9302 -8231 -14576 -24964 -28847 -23887 -24762 -11251 7207 19392 16015 7707
16082 7707 1015 -2868 -6040 -12325 -21833 -20541 -21717 -21824 441 -5117 -12046 -9670 -4772 -8308 -22843
16067 -22843 -19049 -15885 -21965 -20410 165 5604 -3373 -15713 -27715 -27741 -30562 -27595 -22567 -22761
16053b2761j4260L525J2767M431j4202J5573K0459j1852n061k020N002J7889n801
16040C689j5810p000J0459j816K23k413J1620P499j135k511j5374M507k392q477
16026a8931o46J3715J5262J707L768l666j2639k5516K755M300J1m742m42O664
16012a8400L562q604l937J0245K0981l639l598M712k705j756k309O697J595o850
15998d006o643k334K650O144q793J618J8258N01m086k765O172j210p979N779J130
15983D436p751p493r185K254n750J0518K505K587P64K432r082n772L275k80L828
15968a2714p398J372k710l692J9023j881n703N670R562j7621P249l421j436L892
15954i808k781n770J5832J7622l630K750R24K26k116o924r595j3939j217J0864
$$ plain form
16053 -22761 -37021 -33496 -20729 -16298 -30500 -14927 5532 -6320 -11381 -13401 -8399 9490 3689
16040 3689 -12121 -19121 -8662 -10478 -10255 -12668 -1048 6451 5316 2805 -12569 -8062 -10454 -18931
16026 -18931 -19577 -5862 9400 11107 14875 11209 -1430 -26946 -24191 -19891 -19880 -24622 -25064 -18400
16012 -18400 -14838 -23442 -27379 -17134 3847 208 -3390 1322 -1383 -3139 -5448 1249 2844 -4006
15998 -4006 -10649 -12983 -10333 -4189 -12982 -11364 6894 7395 3309 544 6716 5506 -2473 3306 4436
15983 4436 -3315 -10808 -19993 -17739 -23489 -12971 -10466 -7879 -7115 -4683 -13765 -19537 -16262 -16542 -12714
15968 -12714 -20112 -18740 -21450 -25142 -6119 -8000 -13703 -8033 1529 -16092 -8843 -12264 -13700 -9808
15954 -9808 -12589 -18359 -2527 15095 11465 14215 15139 15365 13249 6325 -3270 -17209 -18426 -7562
15940g562p73J506N422K101K87r887j8196P525J281J4415j3292q057P337J0495
15926g398J3159p531K26P617K441j1613n1K047P000j684L953k4203j0299N380
15912b0956N695N018K791O862j850k913j4816L209P672N638P668J4047o465l247
15898H353L153j9153q598K1915R131K632k571L858p503r416n417M783q143p428
15884a4404O966K348k018M577J528p348j8555J658J3329J8396J1040p809l798
15871E910p981n951p967j730J779J0833M84j5138K623L293j172j6130j143R09
15857c1381M007P511P739J447j2528L106J6319o517j8260O4j0537r01P540K893
15843b9498J521L9R436N2O300J590J551J2846J1991q467r4p905Q93J0586L275
$$ plain form
15940 -7562 -8335 -6829 -1407 694 981 -8906 -27102 -19577 -18296 -3881 -17173 -25230 -17893 -7398
15926 -7398 5761 -1770 -1544 6073 8514 -3099 -3150 -1103 5897 4213 8166 -16037 -26336 -20956
15912 -20956 -15261 -10243 -7452 -590 -2440 -5353 -20169 -16960 -9288 -3650 4018 18065 11600 8353
15898 8353 11506 -7647 -16245 5670 14801 17433 14862 18720 11217 1801 -3616 1167 -6976 -14404
15884 -14404 -7438 -5090 -7108 -2531 -1003 -8351 -26906 -25248 -11919 6477 17517 9708 5910
15871 5910 -2071 -8022 -15989 -17719 -15940 -5107 -4623 -19761 -17138 -13845 -15017 -31147 -32290 -31381
15857 -31381 -27374 -19863 -12124 -10677 -23205 -20099 -3780 -10297 -28557 -28493 -39030 -39931 -32391 -29498
15843 -29498 -27977 -27938 -18502 -18450 -12150 -10560 -9009 3837 15828 7361 7267 -638 255 10841 14116
15828A4116l770m330n086N076l018j5594o379r717J5309Q464J742J716J87j6577
15814a7861j0529r15l806j1597N920J2633r32m033J6875m686K620Q340J077O434
15800d60j112m678K357j0275o64M551j2444K713R355O609K348j268o236j981J2966
15785A781K335j5570o704J6070J2246n057k1483j1360K518M397r237J6643J3869
15772D48r992N801j478k0987j5010J232J5241J3267m008n95m593N039j0550J459
15758b4726k181N556N600n868l570r406q629J2170J4273p77j956J6838J0752l581
15744D495j1593j672n34l647O828K157m890R371n62o409p73N451P082j909k984
15729D11O630O911k1853j1851K885K323R906j0582N21o87j53Q889J5275Q77N623
$$ plain form
15828 14116 10346 6016 930 6006 2988 -12606 -18985 -28702 -13393 -4929 -3187 -1471 -1284 -17861
15814 -17861 -28390 -29305 -33111 -44708 -38788 -26155 -27087 -31120 -14245 -18931 -16311 -7971 -6894 -460
15800 -460 -1572 -6250 -3893 -14168 -14832 -10281 -22725 -20012 -10657 -4048 -1700 -2968 -9204 -11185 1781
15785 1781 4116 -11454 -18158 -2088 10158 5101 -16382 -27742 -25224 -20827 -30064 -13421 448
15772 448 -9544 -3743 -5221 -26208 -41218 -39986 -24745 -11478 -15486 -16081 -20674 -15635 -26185 -24726
15758 -24726 -26907 -21351 -15751 -21619 -25189 -34595 -43224 -31054 -16781 -17558 -19514 -2676 8076 4495
15744 4495 -7098 -8770 -9304 -12951 -6123 -3966 -8856 515 -47 -6456 -7229 -1778 5304 3395 411
15729 411 7041 13952 -7901 -19752 -16867 -14544 -4638 -15220 -14699 -15386 -15539 -6650 8625 9502 15125
15714A5125j671m277k534K735n45k511J9289j356j7058m437P985P662J7035o298
15700B9144j3524k0381p725L810O40K54j240j1066l624J1195J2800k048j747j158
15686d670m961O290Q085m16j2140j674J7990J745m595k258r404n451j1231m740
15672b7430m386J2617J9339k771M585O92l411J933o983j637p938J4222J4538L861
15658A7231k2343j0964J8497N328j2795q194j968k149R623K0478r2j4662j5202
15645a7212N608J7828N786j9002j5747Q132k617j795n733Q171N868O724o939r237
15631b0165j129J3538q837k0840N740Q415O795J8744P672M766q460o993J6597
15618A5843m26j1722j8411l382M639P64K464R350R6J001p913R599j497M962j223
$$ plain form
15714 15125 13454 9177 6643 9378 8833 6322 25611 24255 7197 2760 10745 18407 35442 29144
15700 29144 15620 -4761 -12486 -8676 -8036 -7782 -9022 -20088 -23712 -12517 283 -1765 -3512 -4670
15686 -4670 -9631 -3341 4744 4328 -7812 -9486 8504 10249 5654 3396 -6008 -11459 -22690 -27430
15672 -27430 -31816 -19199 140 -2631 1954 2646 -765 1168 -5815 -7452 -15390 -1168 13370 17231
15658 17231 -5112 -16076 2421 7749 -5046 -13240 -15208 -17357 -7734 12744 12652 -2010 -17212
15645 -17212 -11604 6224 12010 -6992 -22739 -14607 -17224 -19019 -24752 -16581 -10713 -3989 -10928 -20165
15631 -20165 -21294 -7756 -16593 -37433 -31693 -23278 -16483 2261 9933 14699 6239 -754 15843
15618 15843 15417 3695 -14716 -18098 -13459 -12695 -10231 -881 -785 216 -7697 1902 405 5367 4144
15603D144p914L107N356j736q265J3345R501k115j1902j5890l80J3676N719n218
15589A428J0004L012N653O336j7635j9448N02r54J0643M38j6987J964O555J3299
15575D810K176p916j7150j7956l329R732Q035o243R221Q467k8O404k2545k196
15561b8518P527N374P407o98l627R65R685j415p601m380M78k861j8695P928K277
15546b6154m330j565O084J0263K0596J1882M34r144Q80n469j8514J5513N378j153
15532D701j4110J019j725j1155q082Q007O895M695l285j227R991M444q85j8746
15518a9463r333N375O901J3512R125p082j3447M610k799k785N405L840m477J730
15504h888L091o678m182k210J3090n995j538j6308P45k966L397J0243K665P611
$$ plain form
15603 4144 -3770 -663 4693 2957 -5308 8037 17538 15423 3521 -12369 -12749 927 6646 1428
15589 1428 11432 14444 20097 26433 8798 -10650 -10148 -11102 -459 -21 -17008 -15044 -8489 4810
15575 4810 6986 -930 -18080 -36036 -39365 -29633 -21598 -27841 -18620 -10153 -10181 -3777 -26322 -28518
15561 -28518 -20991 -15617 -8210 -8908 -12535 -11570 -1885 -3300 -10901 -15281 -14803 -17664 -36359 -28431 -26154
15546 -26154 -30484 -32049 -25965 -15702 4894 16776 17210 8066 8946 3477 -15037 476 5854 4701
15532 4701 -9409 -8390 -10115 -21270 -29352 -21345 -14450 -9755 -13040 -14267 -4276 168 -717 -19463
15518 -19463 -28796 -23421 -16520 -3008 6117 -965 -14412 -9802 -12601 -15386 -9981 -6141 -10618 -8888
15504 -8888 -5797 -12475 -16657 -18867 -5777 -11772 -13310 -29618 -28873 -31839 -28442 -18199 -15534 -7923
15490g923j6M508J3032Q42j1656r450M791k91M659l687O094j265l113K0681J502
15475A8708j8411j9863J877K0774M109P692m070J282o00j2303r338j2788q236
15462c1167n104Q786K371L186J7266J769J112q580K452l898p32R99o674r557N921
15447b1850J9832K2572J602q324l178p508q355k834r908P762J440j401j1868j4650
15433c6668j1905P888M895P306M959K038J2347J0454j2990m257J8805r714j1929
15420a8771J022K96L315r97L938j518p968J1067J4633O152n943q275j2643P404
15406h288M194j890N337k040j1063j3404J1810J0969J0753j1757n381n719l232
15393a9711P392j0531j0J1951l875k404j04J801P162m802p617J243P764L141L119
$$ plain form
15490 -7923 -7939 -3431 9601 10443 -1213 -10663 -5872 -6163 -1504 -5191 903 -362 -3475 17206 18708
15475 18708 297 -19566 -17689 3085 7194 14886 10816 12098 11498 -805 -10143 -22931 -31167
15462 -31167 -36271 -27485 -25114 -21928 -4662 -2893 -1781 -10361 -7909 -11807 -12539 -11540 -18214 -27771 -21850
15447 -21850 -2018 20554 22156 13832 10654 3146 -5209 -8043 -17951 -10189 -8749 -10150 -22018 -36668
15433 -36668 -48573 -40685 -35790 -28484 -23525 -21487 -9140 1314 -11676 -15933 2872 -6842 -18771
15420 -18771 -17749 -17453 -14138 -15135 -11197 -12715 -20683 -9616 5017 11169 5226 -3049 -15692 -8288
15406 -8288 -4094 -5984 -647 -2687 -13750 -27154 -15344 -4375 6378 -5379 -10760 -16479 -19711
15393 -19711 -12319 -22850 -22860 -10909 -14784 -17188 -17292 -15491 -8329 -13131 -20748 -19505 -11741 -8600 -5481
15378e481j0545J1293N14q272O73J1656J1809N983q574q430r30r546K309n398
15364a2939L021n846k05K957O794Q636O734n899l58o429K480q802n863J0408J2034
15349F723l919r068r006p987n25K164k51l741J2139K2262J880r200j0650j443
15335a0622L92R073O002k5740j3085P551M63N126Q714j012j1816J043J2441J1419
15321e1n765n259l0L719L010m583L295R281m704r844o321K338J3745L481j272
15306A040p847K940K637j0362j5550j0836L83J1687m906K459j3068o657N662K13
15292d2205P353J4180J0989q825K725J5862q973j8984o30J1514N877j1k153q316
15278b1597k951K374J475P041O619J212k7250o382o486K3079J2482N100q35N769
$$ plain form
15378 -5481 -16026 -4733 -4219 -12491 -11818 -162 11647 17630 9056 626 -304 -9850 -7541 -12939
15364 -12939 -9918 -15764 -15969 -13012 -6218 2418 9152 3253 2895 -3534 -1054 -9856 -15719 -5311 6723
15349 6723 2804 -6264 -15270 -23257 -23782 -21618 -21869 -25610 -13471 8791 10671 1471 -9179 -10622
15335 -10622 -10230 -1157 4845 -20895 -33980 -26429 -25966 -20840 -12126 -13138 -24954 -23911 -11470 -51
15321 -51 -5816 -11075 -11105 -7386 -4376 -8959 -5664 3617 -1087 -10931 -17252 -14914 -1169 2312 1040
15306 1040 -6807 -3867 -1230 -11592 -27142 -37978 -37595 -25908 -30814 -28355 -41423 -48080 -42418 -42205
15292 -42205 -34852 -20672 -9683 -18508 -15783 79 -8894 -27878 -28508 -16994 -11117 -11128 -13281 -21597
15278 -21597 -24548 -22174 -20699 -13658 -7039 -5827 -33077 -39459 -45945 -22866 -10384 -5284 -6119 -350
15264c50J0777N508j692m312m111nR115M324K119o761j4052r471J300J41j639
15249i109M261M969O503j1852p316L59J893K924o916j632J4661m579J0061Q293
15235A2520j3262j0425N111j44L481J767p093j0158R422N755j3210l920M881p372
15221b2647J0747q926R65O234J2582J5870M823K1k77j6176j586j4122M221J7107
15207H836K87j2333j6191L656o825Q547J0237L655P125K791N913j8131p879R690
15193f22k577N086J1013o777j8479k2607q636p5J0554M135J1944J3548N470j7395
15179a5418r94j060o771j251J600R56J2833N081m071l294m119o11k271r121o76
15164b9187K3385K031j592l98L970n127k0098P73J9609J4747K213O619o96q776
$$ plain form
15264 -350 10427 15935 14243 9931 5820 5815 14930 19254 21373 14612 560 -8911 -7611 -7470 -9109
15249 -9109 -4848 121 6624 -5228 -12544 -12185 -10292 -7368 -14284 -15916 -1255 -5834 4227 12520
15235 12520 -742 -11167 -6056 -6200 -2719 -952 -8045 -18203 -8781 -3026 -16236 -20156 -15275 -22647
15221 -22647 -11900 -20826 -19861 -13627 -1045 14825 19648 19669 19392 3216 1630 -12492 -8271 8836
15207 8836 9123 -3210 -19401 -15745 -22570 -14023 -3786 -131 6994 9785 15698 -2433 -10312 -622
15193 -622 -3199 1887 12900 6123 -12356 -34963 -43599 -43674 -33120 -28985 -17041 -3493 1977 -15418
15179 -15418 -16412 -17472 -24243 -25494 -23894 -22938 -10105 -5024 -9095 -12389 -16508 -17119 -19390 -28511 -29187
15164 -29187 -5802 -3771 -5363 -5761 -1791 -6918 -27016 -26243 -6634 8113 10326 16945 16249 7473
15150G473m40j578J052l986r829j0325j1875l742M580R792J6499M267r121m050
15136a1283O547j112j3340J604P675o010K589O378P627n229k640L41N256m907
15122f504K651L433l395p173r844n084M805o133j4650J8388N097O467P74n302
15108a6470m513j194n128R721J3726N932j2951P088J1783k094m883l676k822o427
15094a1908Q150J5007Oj1877j5393r177p982R60J956N619M762l093j402n09P604
15079a7277j2082l731J5997O328O033o904o867K07J661p926k618P164R493P775
15065b747P781N958J453J27J14o113o971l956Q107P150M143q324j2189J0757J6438
15050B1728j62j7312n589R559L45j6854O874J128o731j6299J569r143J515O884
$$ plain form
15150 7473 7033 5455 6507 2521 -7308 -17633 -29508 -33250 -28670 -18878 -2379 1888 -7233 -11283
15136 -11283 -4736 -5848 -19188 -17584 -9909 -15919 -13330 -6952 675 -4554 -7194 -6853 -1597 -6504
15122 -6504 -3853 -420 -3815 -10988 -20832 -25916 -21111 -27244 -41894 -23506 -18409 -11942 -11168 -16470
15108 -16470 -20983 -22177 -27305 -17584 -3858 2074 -10877 -3789 7994 5900 1017 -2659 -5481 -11908
15094 -11908 -3758 11249 11255 -622 -16015 -25192 -33174 -32214 -30258 -24639 -19877 -22970 -24372 -24881 -17277
15079 -17277 -29359 -33090 -17093 -10765 -4732 -11636 -18503 -18296 -16635 -24561 -27179 -20015 -10522 -2747
15065 -2747 5034 10992 12445 12572 12686 6573 -398 -4354 3753 10903 15046 6722 -5467 5290 21728
15050 21728 21566 4254 -1335 8224 8569 -8285 -1411 -283 -7014 -23313 -21744 -30887 -29372 -22488
15036b2488R69k080O880J536O72N313J803o706J252J0695K720J6062q012p207
15022A409o149J0684Q552R055q335j5166l134N319j092j0386p18q334m439M171
15008a8563J378j634J3786K490n364J029J2236P053R212K954K116J498j6408j7689
14994e906j3318M743N834L884N018N031P530j5096o47K590k599j3085J2890K702
14980d29O501N752l954M226Q493Q612j9011j8035j911l839j0841m522P320K1418
14966b20O115K367J344n648N111K604j2415m29p87l871r040J859j5365M452J4760
14951i163K600o151j3103N564J863L562J2161l484N172K132K627j477j076j3675
14937a2448P773p714M021O846m65q866n867J0362J0611J0543L647j3241j9077
$$ plain form
15036 -22488 -21519 -23599 -16719 -15183 -14511 -9198 -7395 -14101 -12849 -2154 566 16628 8616 1409
15022 1409 -4740 5944 14496 23551 15216 50 -3084 2235 1143 -9243 -9961 -18295 -22734 -18563
15008 -18563 -17185 -18819 -5033 -2543 -7907 -6878 5358 12411 21623 24577 26693 28191 11783 -5906
14994 -5906 -19224 -14481 -8647 -4763 255 5286 12816 -2280 -2927 -337 -2936 -16021 -3131 -429
14980 -429 6072 11824 7870 12096 20589 29201 10190 -7845 -9756 -13595 -24436 -28958 -21638 -220
14966 -220 5895 8262 9606 3958 9069 11673 -742 -1171 -1958 -5829 -14869 -13010 -28375 -23923 -9163
14951 -9163 -6563 -12714 -25817 -20253 -18390 -14828 -2667 -6151 -979 1153 3780 2303 1227 -12448
14937 -12448 -4675 -12389 -8368 -1522 -1987 -10853 -16720 -6358 4253 14796 18443 5202 -13875
14924a3875n479L315p883K952K424o348k292J7778J4887K453k291K45K814j283
14910G417j2406j1476N290Q953P818n146R609j2392n721J2184r57m317m713RP329
14895A481n077J0539J4650q166j6251L76o650p207k210n142J305Q661J3565N56
14881D30q055k61J698j3105j412N762L640N298K679n673p078R140p653o721l073
14866b4384m067L85J7108R195R32P738J1048p167r335r829M29M491j1622O001
14852i077P430J4832Q49o576J2258O888m498L393J6049J0203j2795j8149J4825
14839C5632O147j0053m632r257j1052j0678O301k941q716K729Q160J0400P117
14826A9157J455j1302L591m999j4721q986J2543K713q501R1O426j969p117m262
$$ plain form
14924 -13875 -19354 -16039 -23922 -20970 -18546 -24894 -27186 -9408 5479 7932 5641 5886 8700 7417
14910 7417 -4989 -16465 -11175 -2222 5596 450 10059 -2333 -8054 4130 3173 -1144 -5857 -5848 1481
14895 1481 -3596 6943 21593 13427 -2824 -2448 -9098 -16305 -18515 -23657 -22352 -13691 -126 430
14881 430 -7625 -7886 -6188 -19293 -20705 -14943 -11303 -6005 -3326 -8999 -16077 -6937 -14590 -21311 -24384
14866 -24384 -28451 -28066 -10958 -1763 -831 6907 17955 10788 1453 -8376 -7947 -3456 -15078 -9077
14852 -9077 -1647 13185 14034 7458 19716 26604 22106 25499 41548 51751 38956 20807 35632
14839 35632 41779 31726 27094 17837 6785 -3893 2408 -533 -9249 -6520 1640 12040 19157
14826 19157 20612 9310 12901 7902 -6819 -15805 -3262 -549 -9050 -8959 -2533 -4502 -11619 -15881
14812a5881J344o279L6P511J3740j581M551K786k321o225l561m361j1155o994
14798b8390J4337J0013M713P446q948j4783j0755R401J0515M173m538P650K767
14785C601j3488k653P116K0239L913n239j5762k864j621O64L544p083J638O799
14771a196O231P646K952K094n356l297K270K63N471M562j0698p47J294j360j0880
14756g51J2244j896q732j672J0923k124j2609Q038J1981P427J4036M459J4143
14743E5467J2187J4391J5362K641j7190j969M3691N1431O4247J27054J44271J55720
14731F67303J67073J56683J26683N9823l7634j32309j94369k00646j70535j14563
14721C27509p0728k9638k7963l3153m1266k1503j7388q489K348R747J0381k2329
$$ plain form
14812 -15881 -14537 -20816 -20780 -13269 471 -1110 3441 6227 3906 -2319 -5880 -10241 -21396 -28390
14798 -28390 -14053 -4040 673 8119 -829 -15612 -26367 -16966 -6451 -2278 -6816 834 3601
14785 3601 -9887 -12540 -5424 14815 18728 13489 -2273 -5137 -6758 -6094 -2550 -9633 -7995 -1196
14771 -1196 5035 12681 15633 17727 12371 9074 11344 11607 17078 21640 10942 10195 11489 10129 -751
14756 -751 11493 9597 865 -807 10116 7992 -4617 3421 15402 22829 36865 41324 55467
14743 55467 67654 82045 97407 100048 82858 80889 124580 176011 240258 367312 511583 667303
14731 667303 834376 991059 1117742 1177565 1139931 1007622 813253 612607 442072 327509
14721 327509 256781 227143 199180 166027 124761 103258 85870 77381 79729 89476 99857 77528
14709G7528k1307k3568k759N39p168m318m774q821n247J4032J4415N715J953j3237
14695B2983j0372p901P609K2547J2688j5056j0597R59q229M12p80j5136n406l753
14681a0032J1194N727n050j2054j0569Q854O49J352L720L969Q813K432K849m965
14667F889j9204N571M459O748j1399l654O207n643J3223P680j1769k348o057J3654
14653D357J0484R967j1989r759J1880j0260j6910M194j027j1524J039J2676J0259
14640C387j1761J1438Q204l354r552L8l509o63j8333k781R313J540J0628L938
14626a467P492r512p782Q654M340l850J6953p598q687m962J0465q35o93J4157
14612A6675N781k732k0977q71J8573n437j5164r244p14l737k600J0968J3939l893
$$ plain form
14709 77528 56221 32653 29894 30433 23265 18947 14173 5352 105 14137 28552 34267 36220 22983
14695 22983 12611 4710 12319 34866 47554 32498 21901 22860 14631 15043 14263 -873 -6279 -10032
14681 -10032 1162 6889 1839 -10215 -20784 -11930 -11281 -9929 -6209 -2240 6573 9005 11854 6889
14667 6889 -12315 -6744 -2285 4463 -6936 -10590 -4383 -10026 3197 10877 -892 -3240 -9297 4357
14653 4357 14841 24808 12819 3060 14940 4680 -12230 -8036 -9063 -20587 -19548 -6872 3387
14640 3387 -8374 3064 11268 7914 -1638 -1600 -5109 -5772 -24105 -26886 -17573 -16033 -5405 -1467
14626 -1467 6025 -3487 -11269 -2615 1725 -2125 14828 7230 -1457 -6419 4046 3211 2518 16675
14612 16675 22456 19724 -1253 -2124 16449 11012 -4152 -13396 -14110 -17847 -20447 -9479 4460 567
14598E67p372J7070N646j1562j167j1282J857P140P797M11k439m382l680l705
14584e101J4654N497r96k965p39p565j3338J904N931j219k588O030J9880N707
14570B5092j1844j7225m040p026K817R521n262p508M635MJ4808K0000l907L880
14556B3945q722q917p68j1138j4008L105M454j904j2J2959p639q289m093l207
14542b4234P056J6199P586L005n255J682j0976M103J585j298J7769j2213m03m382
14528B24r327L171J447l814k601N481M862O73n012m302K000j0087L340q751J376
14513b1320O511M713J466j4161j9718P970J6064l79j6330R249J2521Q914j682
14500f182P353K864K522j814p171m900K102R709Q560N90k509M267o621J127p4
$$ plain form
14598 567 -6805 10265 15911 4349 3182 -8100 -6243 897 8694 9105 6666 2284 -1396 -5101
14584 -5101 9553 15050 14054 11089 10350 2785 -10553 -8649 -2718 -3937 -6525 -495 19385 25092
14570 25092 13248 -3977 -8017 -15043 -12226 -2705 -7967 -15475 -10840 -10836 3972 23972 20065 23945
14556 23945 15223 6306 5538 -5600 -19608 -16503 -12049 -13953 -13965 -1006 -8645 -16934 -21027 -24234
14542 -24234 -17178 -979 6607 9612 4357 6039 -4937 -834 751 -547 17222 5009 4606 224
14528 224 -9103 -5932 -4485 -8299 -10900 -5419 -557 116 -4896 -9198 -7198 -17285 -13945 -22696 -21320
14513 -21320 -14809 -10096 -8630 -22791 -42509 -34539 -18475 -18854 -35184 -25935 -13414 -4500 -6182
14500 -6182 1171 4035 6557 4743 -2428 -7328 -5226 4483 13043 13633 11124 15391 8770 9897 9823
14485I823r616j1408q777L399l920J1652N068j856p75J198J9496K967p660j923
14471G668J64n327l806m189J2229Q629J3487J4555l741j6066j9499m047r246l815
14457a3004M121j7599O285R519m155q915Q701K4820J0241r7j6277N199q241K254
14443B852M763q862n02r980j423O300o063R32K429P191n592k43R343r983m440
14428a3278L388J0490P191m1j3960N111K1380n531o009m803j4731p993P084m665
14414a6367j3168J645P976r12o457Q302J2072l032j5660J640K3191J5328O219
14401B0777q664r738k867j12L843o285o074J1505R135j3422n14P278N108l005
14387F965L2Q743r139p701O119Q6Q320j8954r706R989J7141Q148k586j043Q68
$$ plain form
14485 9823 207 -11201 -19978 -16579 -20499 -8847 -3779 -5635 -6410 -5212 14284 17251 9591 7668
14471 7668 7832 2505 -1301 -5490 6739 15368 28855 43410 39669 23603 4104 57 -9189 -13004
14457 -13004 -8883 -26482 -20197 -10678 -14833 -23748 -15047 9773 20014 19917 3640 8839 598 2852
14443 2852 7615 -1247 -1749 -11729 -13152 -6852 -12915 -11983 -9554 -2363 -7955 -8198 1145 -8838 -13278
14428 -13278 -9890 600 7791 7750 -6210 -1099 20281 14750 8741 3938 -10793 -18786 -11702 -16367
14414 -16367 -29535 -27890 -19914 -20826 -27283 -18981 -6909 -9941 -25601 -23961 -770 14558 20777
14401 20777 12113 2375 -492 -604 3239 -3046 -9120 2385 11520 -1902 -2416 4862 9970 6965
14387 6965 6997 15740 6601 -1100 5019 5105 13425 -5529 -15235 -5246 11895 20043 17457 16414 17282
14372A7282q813J1933Q743K055j62j794j0057j3787n851J5490l51K083R873L625
14358C0269j5541j0021Q46q102k492P04O96m787J1342R176K324l151N387k029
14344A4621L546K115n372O783m458m490j5329P608k400k540q605m207J0121j312
14330c919R701j0690J745J4333l53k616n58K530o457L944K559P53K11l956m252
14315B975j799p131R549m417m536o840J2656l456j1548L595r571r305R319K812
14301a7697J3345J5428R134r3q312n109L741O313J3326o397N270j072k3386j2234
14287g743r611q298j096J7480R282k3j4782Q038N303J6091Q445Q29p628k543M496
14272A8240o477j3092P10L518o91k861N011l176o262J820j979K152P110J168m694
$$ plain form
14372 17282 8469 20402 29145 31200 31038 29244 19187 5400 -451 15039 14688 16771 26644 30269
14358 30269 14728 4707 5553 -2549 -5041 -4337 -3641 -8428 2914 12090 14414 11263 16650 14621
14344 14621 18167 20282 14910 21693 17235 12745 -2584 5024 2624 84 -8521 -12728 -2607 -3919
14330 -3919 5782 -4908 -3163 11170 10817 8201 7643 10173 3716 7660 10219 10972 11183 7227 2975
14315 2975 1176 -5955 3594 -823 -5359 -12199 457 -2999 -14547 -10952 -20523 -29828 -20509 -17697
14301 -17697 -4352 11076 20210 20117 11805 6696 10437 16750 30076 23679 28949 27877 4491 -7743
14287 -7743 -17354 -25652 -26748 -9268 14 -9 -14791 -6753 -1450 14641 23086 23915 16287 13744 18240
14272 18240 11763 -1329 -619 2899 2208 -653 4358 1182 -5080 -3260 -5239 -3087 4023 5191 497
14257D97J0578O040K741r637j5680R186J1074K660P778k48p340j4135r808j338
14243g632J2822R407j151O396O136p198k087j2324m036n898O97j3570k527K940
14229a8025J0196K712q871k863J372n222m809J8367J6111p115N901j689l865j6709
14215a4509m470N512J0937Q23K169O906M682l697n307o699p00J406J615K799J738
14200C205n271O641J192j0147q453K739l326J2348M606N73j941R713K021q791
14186E109K170J0613N556J542j7037j3780r947j5835J25J7697J2789n327j0005
14173a6330J1965P620J1922r451j2661n425L453J792k713K21L603K80N361J999
14159A636j3534p29N525R722J8027j0285o973J6097L851M073j514j1532J426L376
$$ plain form
14257 497 11075 17115 19856 10219 -5461 3725 14799 17459 25237 24989 17649 3514 -6294 -7632
14243 -7632 5190 14597 13446 19842 25978 18780 16693 4369 333 -5565 -4868 -18438 -20965 -18025
14229 -18025 -7829 -5117 -13988 -16851 -15479 -20701 -25510 -7143 8968 1853 7754 6065 2200 -14509
14215 -14509 -18979 -13467 -2530 -1707 462 7368 12050 8353 3046 -3653 -4353 -2947 -1332 1467 3205
14200 3205 -2066 4575 5767 -4380 -12833 -10094 -13420 -1072 3534 4107 2166 11879 13900 5109
14186 5109 7279 17892 23448 24990 7953 -5827 -15774 -31609 -31484 -13787 -998 -6325 -16330
14173 -16330 -4365 3255 15177 5726 -6935 -12360 -8907 -7115 -9828 -9607 -6004 -5724 -363 1636
14159 1636 -11898 -12627 -7102 2620 20647 10362 3389 19486 23337 27410 25896 14364 15790 19166
14145A9166j3875j8771j1472j4468M419J1085Q794J9102k381j750k305q274R90
14132i740k15L909L353k704N952Q544l870n501p096l153J9762K1470m2j7902j6823
14117d056N625O094J0886q3J989j0438j0229N720J3848o711j416p25P969R643
14103B8116M238J314j4063n242m866k371J1555Q265j2760J297k1822j5729K4899
14090B831J7041R93k380K099K950j3634p64j153K786q691j3093O916P952n520
14076a667N539n143k732M378J8113J547j0565o010j383j973p037K3207N4q526
14062G802r549j2564J0834Q643N149n88J859J257K737Q616L825m123P399j4904
14048A6393L343K546k2061r339O640K944l539M597J624J141L484O951k321q139
$$ plain form
14145 19166 5291 -13480 -24952 -39420 -35001 -23916 -15122 3980 1599 -151 -2456 -10730 -9740
14132 -9740 -9955 -6046 -2693 -5397 555 9099 5229 -272 -7368 -10521 9241 30711 30669 12767 -4056
14117 -4056 1569 7663 18549 18466 20455 10017 -212 5508 19356 12645 11229 10504 18473 28116
14103 28116 32354 33668 19605 14363 9497 7126 18681 26946 14186 15483 -6339 -22068 2831
14090 2831 19872 20865 18485 20584 23534 9900 9136 7983 10769 2078 -11015 -4099 3853 -1667
14076 -1667 3872 -1271 -4003 375 18488 20035 9470 3460 2077 104 -6933 16274 16328 7802
14062 7802 -1747 -14311 -3477 5166 10315 9727 11586 12843 15580 24196 28021 23898 31297 16393
14048 16393 19736 22282 221 -9118 -2478 466 -3073 1524 3148 4289 7773 14724 12403 4264
14034D264J3581J7708n830n698R125J1627O35l234L812J0052l92Q67r815j2886
14020C3816r838j2354l077j902K994Q233N561M610k927j1690n936k738M317N846
14006A4915j1647j5105M092M244J0827j137j697P696K864J4863J536q589N87p552
13992A5897j1457k707j1434R248J9506J2614N385l007j874l290J2501O529q992
13979C8919l286J2980K1886K1596J3647L1764K6295J8164K6384J7427j1285m929
13967B09562l280j0263j2653k3924j5211k0692j2016j7997m472j4541Q21K407
13955G7741p009j7302l234J525O702j731j97k527r490j1375j1942J620P517J2281
13941D2579k90m153k122j1490o482p025J4780J7513O340m991k836J872l376n473
$$ plain form
14034 4264 17845 35553 29723 24025 33150 44777 45412 42178 45990 56042 55650 56517 46702 33816
14020 33816 23978 11624 8547 6645 9639 17872 23433 28043 25116 13426 7490 4752 9069 14915
14006 14915 3268 -11837 -7745 -3501 7326 6189 4492 12188 15052 29915 31451 22862 23449 15897
13992 15897 4440 1733 -9701 -453 19053 31667 37052 34045 32171 28881 41382 47911 38919
13979 38919 35633 48613 70499 92095 105742 137506 163801 181965 208349 225776 214491 209562
13967 209562 206282 196019 183366 159442 144231 123539 111523 93526 89054 74513 75334 77741
13955 77741 70732 53430 50196 51721 58423 56692 56495 53968 44478 33103 21161 22781 30298 42579
13941 42579 42289 38136 36014 24524 18042 11017 25797 43310 49650 44659 41823 43695 40319 34846
13927C4846m040l197p495j0690M681l420j894q167O980m362j767J6871M383j960
13913B0769r718q955k406o347N167J305K108M257J5873J6842r811k952P348k521
13899C0959J524k53q935j8810j334J6983J0404j9200j2709j331N782k513J1326
13886A1893J3840j3165k907m002j0805j4375o331K3641N986M604l477L382R665
13873A7949l663j1813j1338J5394Q511j0820n664N719M461K891k31j474j371J074
13859I625K903P280J1096q436n059n285j0022j491P760K4042M799l0491j8210
13846a1489m363J1297j890m56J2902J5105p89j906j59q958O988O608M958R263
13832C7111l994j0771K478p759O51J3642n523K85j0768j1521J0943J0358K233
$$ plain form
13927 34846 30806 27609 20114 9424 14105 10685 8791 624 7604 3242 1475 18346 22729 20769
13913 20769 11051 2096 -310 -6657 -1490 -185 1923 6180 22053 38895 29084 26132 33480 30959
13899 30959 32483 32230 23295 4485 3151 20134 30538 11338 -1371 -2702 3080 567 11893
13886 11893 25733 12568 9661 5659 -5146 -19521 -25852 -2211 3775 8379 4902 8284 17949
13873 17949 14286 2473 -8865 6529 15040 4220 -1444 4275 8736 11627 11396 9922 8551 9625
13859 9625 12528 19808 30904 22468 17409 12124 2102 611 8371 32413 37212 6721 -11489
13846 -11489 -15852 -4555 -6445 -6901 6001 21106 20317 18411 18252 9294 16282 22890 27848 37111
13832 37111 33117 22346 24824 17065 17716 31358 25835 26120 15352 3831 14774 25132 27365
13819B7365l598k551K485L946p561o359j588N054o414L781k493P79L733J1716
13805B8295J5931K258k137r788n976J250P767n944j5406m991j235K390P423P335
13791B7172M571l10n393j5765j2245M491R305N723j737L568J6337N942R028r426
13777D1261R84j6723q960r2j1886N312Q570k431j0085q459N927P04J0418R878
13763B4418p632j2852n939Q444K917J0565k018n068j337o343m986j4476m933M803
13749a4437r84J2601J8099J3005j713j8277q214m102p001Q214J6105m169j9182
13736a0055j912j2927J5181K4047Q571O41K870j1161m124N208k224j832m928J2784
13722B0139R430j6200r309j041J5835J177n823J024L572K514m15j5862O724J013
$$ plain form
13819 27365 23767 21216 23701 27647 20086 13727 12139 17193 10779 14560 12067 12846 16579 28295
13805 28295 44226 46484 44347 34559 28583 29833 37600 31656 16250 11259 10024 12414 19837 27172
13791 27172 31743 31433 26040 10275 -1970 2521 11826 17549 15812 19380 35717 41659 50687 41261
13777 41261 42245 25522 16562 16470 4584 9896 18466 16035 5950 -2509 3418 4122 14540 24418
13763 24418 16786 3934 -2005 6439 9356 19921 17903 12835 11498 5155 169 -14307 -19240 -14437
13749 -14437 -15421 -2820 15279 28284 26571 8294 80 -4022 -11023 -2809 13296 9127 -10055
13736 -10055 -11967 -24894 -9713 14334 22905 23546 26416 15255 11131 16339 14115 12283 7355 20139
13722 20139 29569 13369 4060 3019 18854 20031 14208 15232 18804 21318 20903 5041 11765 12778
13708A2778J315J8717k1646o29l462J1411K270n988l468J6930p066N063P642J2232
13694D6099N153J1879K1412K2163J8956r39L538l961o524n873n464m421P209K506
13680A11733k0171k2725j8832l156R981J264j2027o249J5918L840m636J491J225
13667E7656J1651J4252P162R44l286O228O637P913J0957J6839J3848K0804J5943
13654A87548J3231j3415j1728J980J1740k641j7859l2693k1252j6759j2085o577
13642G9490m426o052L867p054r377j1870j3100J1149K884L061j20j3105j0539
13629B4808p249P529J62n060N418N222L503j322j2965p817J5613M737q396j1957
13615A2226J0194Q846p746r969J046R715P977j2902P172N598l894j4180m880L800
$$ plain form
13708 12778 14093 32810 11164 10535 7073 18484 20754 14766 11298 28228 21162 26225 33867 46099
13694 46099 51252 63131 84543 106706 125662 124723 128261 124300 117776 111903 106439 102018 109227 111733
13680 111733 91562 68837 50005 46849 56830 58094 46067 39818 55736 59576 54940 56431 57656
13667 57656 69307 83559 90721 91665 88379 94607 101244 109157 120114 136953 150801 171605 187548
13654 187548 200779 187364 175636 177616 189356 186715 168856 136163 114911 98152 86067 79490
13642 79490 75064 69012 72879 65825 56448 44578 31478 42627 45511 48572 48452 35347 24808
13629 24808 17559 25088 25250 20190 25608 30830 34333 33011 20046 12229 27842 32579 24183 12226
13615 12226 22420 31266 23520 13551 14597 24312 32289 19387 26559 32157 28263 14083 9203 13003
13601A3003q424j113J5624J343r008j1028J0022M825k012k138j463l598L732J6242
13587B6007J0165J847O827K700j4795k535l682m146O621K853k361j972M677L193
13573C5399O27J7705m096J52m9j72J0670m235r957O919O188P854K1898R382J1871
13558A10156J4639J1335J520J5057N535l959j588j0059m582j8341k5717l3024
13546F0972j0569K937N114L641j4180k0631J169M782l662J0814R159n695j0095
13533C3756j0087J4364J5406o066l739L269P834J026q4M449k838n838J773n79
13519E2646J0722J0501J5346K2878J2423J6645L4198J7106J0406J4902O168p011
13507B16930M746r655r706p663k3487k5607j2991j117j5539j4315k3566j0767
$$ plain form
13601 13003 4579 3466 19090 20433 11425 397 10419 15244 13232 11094 9631 6033 9765 26007
13587 26007 36172 38019 44846 47546 32751 30216 26534 22388 29009 31862 29501 27529 32206 35399
13573 35399 36026 53731 49635 49787 49738 49566 60236 56001 46044 52963 59151 67005 88903 98285 110156
13558 110156 124795 136130 137650 152707 158242 154283 152695 142636 138054 119713 93996 60972
13546 60972 50403 53340 58454 62095 47915 27284 28453 33235 29573 40387 49546 43851 33756
13533 33756 23669 38033 53439 47373 43634 46903 54737 55763 55679 60128 57290 51452 53225 52646
13519 52646 63368 73869 89215 112093 124516 141161 175359 192465 202871 217773 223941 216930
13507 216930 221676 212021 202315 194652 171165 145558 132567 131450 115911 101596 78030 67263
13495F7263k549k436j3682n460k614Q366j442k056J2429r174j8586J845P268r99
13481C8173J351o037Q290r419o435o422o192j250K525q626l513J582P609P352
13467A8988p700M08l152J1280O261J43j5179k317k517j481J1728P885M792L545
13453C2684q036m551P283K815N53k185q924j709j052o784l262O300N597J901k796
13438A7834p557o913m185K844J1344Q232q805q249J9828J1117L499j0444l119
13425B5426O05J2303J0559m193j2200j4270j416o73P915Q864j192n81l29K04p4
13410C0948j1461K157J3129J1125j0647j6306k659o933K32n823l738j576P404
13397E852J9644M770j1757j1961P696N016O172q468m471P68l292K0834P90j0692
$$ plain form
13495 67263 64714 62278 48596 43136 40522 48888 47446 45390 57819 48645 30059 31904 39172 38173
13481 38173 39524 33487 41777 32358 25923 19501 13309 12059 14584 5958 2445 4027 11636 18988
13467 18988 11288 11696 8544 19824 26085 26228 11049 8732 6215 4734 16462 24347 29139 32684
13453 32684 24648 20097 27380 30195 30748 28563 19639 17930 16878 10094 6832 13132 18729 20630 17834
13438 17834 10277 3364 -821 2023 13367 21599 12794 4545 24373 35490 38989 28545 25426
13425 25426 26031 38334 48893 44700 32500 18230 16814 16141 24056 32920 31728 31147 30818 31022 30948
13410 30948 19487 21644 34773 45898 35251 18945 16286 9353 9585 3762 24 -1552 5852
13397 5852 25496 30266 18509 6548 14244 19260 25432 16964 12493 13261 9969 30803 31593 20901
13383B0901n079M332o746J3138j0015j531J734n722j294Q765p244n004j0302l421
13369g488o416k683j4974J0604K4542J1793o994j7434m98M451J2309l583P898
13356A1527J3671j5364J136O459J1666O539j682p716j0366r360J845P747J902
13343A8004r713J2626N679o31j0619k247J573j0711m811O995J0521J353j220k816
13329A3983K108N37N043j8753n004J0533q906o290p032m487N44J8841m63r236
13315h582M471K161Q33J2735J154j472J3647q97j0822m298Q966N940K568k933
13301B3471j1189j2597M95L848J437N904L960J430j490r191L605q05J0003J220
13287B0101r282Q2J862L072r164l966J3340N677J9622J2376m003k2673q862k811
$$ plain form
13383 20901 15822 20154 13408 26546 16531 15000 16734 11012 9718 18483 11239 6235 -4067 -7488
13369 -7488 -13904 -16587 -31561 -20957 3585 15378 8384 -9050 -9548 -5097 7212 3629 11527
13356 11527 25198 9834 10970 17429 29095 35634 33952 26236 15870 6510 8355 16102 18004
13343 18004 8291 20917 26596 25965 15346 13099 14672 3961 -850 6145 16666 18019 16799 13983
13329 13983 16091 16628 21671 2918 -2086 8447 -459 -6749 -13781 -18268 -17724 1117 654 -8582
13315 -8582 -4111 -1950 -1117 11618 12772 11300 24947 24050 13228 8930 17896 23836 26404 23471
13301 23471 12282 -315 180 4028 5465 11369 15329 16759 15269 6078 9683 8878 18881 20101
13287 20101 10819 10901 12763 15835 6671 2705 16045 21722 41344 53720 49717 27044 18182 15371
13273A5371o451J84m112p677O080K264J2968j448j7254M575N127Q578k239K80
13259A6246O898Q325Q18p096M288l65j979j1705j0616l109k418L946Q768L229
13245A5230N141J7218K689l007j4056N780m89O529j3355m549K642L19k470N542
13231B3164N695N0L150l436L742n204j3258k671M034l302J1223L795q532n426
13217A3024L071j769l09P388p689k1305q607J200P655J5525J1437Q785k728r596
13203A6082k394J2494O536l314J2235J2898l474j6408j4325j4154L047J1986J4647
13190C5856j247o459j773k0607n894J2784O104M175j6060j3402J4895K3700r322
13177B2750j5981k292J0210M195O699J0150P379j23n984o094l912n202m339o522
$$ plain form
13273 15371 8920 9104 4992 -2685 3395 5659 18627 17179 -75 4500 9627 18205 15966 16246
13259 16246 23144 31469 32287 25191 29479 29114 27135 15430 4814 1705 -713 3233 12001 15230
13245 15230 20371 37589 40278 37271 23215 28995 28506 35035 21680 17131 19773 20092 17622 23164
13231 23164 28859 28909 32059 28623 32365 27161 13903 11232 15266 11964 23187 26982 18450 13024
13217 13024 16095 14326 14017 21405 13716 -7589 -16196 -14996 -7341 8184 19621 28406 25678 16082
13203 16082 13688 26182 32718 29404 41639 54537 51063 34655 20330 6176 9223 21209 35856
13190 35856 34609 28150 26377 5770 -124 12660 18764 22939 6879 -6523 8372 32072 22750
13177 22750 6769 4477 14687 18882 25581 35731 43110 42987 37003 30909 26997 21795 17456 10934
13163A0934o354n220K1338O769m793j827O448K082J0104P034j1278j1630J879
13150B5486p758j8703J143J5853J358O899o05q435K2676K859p615r382m405Q426
13136B7797p290j0515N096L584J047R879k509l992r285m549P021j875R900O327
13122C0636k058r878l473p41o87J248l475J7742J8486J0971j9503k9021k0975
13109a0728J1919P907o72k251M066J7663L134L723k986P941K1388N72j061q338
13095E2277j1118p293K108J7845O08r521j0150l342j5205o822L161J0293J06l650
13081A9297q429M844J2666K576m814o59m792Q145M84J166k160p812j6220j4064
13067i772J5149M959p918j2471Q127J0755J3296Q169O936r441j3715J0152p94
$$ plain form
13163 10934 4580 -640 20698 27467 22674 20847 27295 29377 39481 46515 35237 23607 25486
13150 25486 17728 -975 168 16021 17379 24278 23673 15238 37914 40773 33158 23776 19371 27797
13136 27797 20507 9992 15088 18672 19719 29598 27089 23097 13812 9263 16284 14409 24309 30636
13122 30636 28578 18700 15227 14486 13799 15047 11572 29314 47800 58771 39268 10247 -10728
13109 -10728 1191 9098 8426 6175 10241 27904 31038 34761 31775 39716 61104 61676 60615 52277
13095 52277 41159 33866 35974 53819 54427 44906 34756 31414 16209 9387 12548 22841 22947 19297
13081 19297 10868 15712 28378 30954 26140 25481 20689 28834 29318 30484 28324 20512 4292 -9772
13067 -9772 5377 10336 2418 -10053 -1926 8829 22125 30294 37230 27789 14074 24226 23432
13054B3432J699Q882Q228l050n371j6790l278k232J0701j82j207J520P807O111
13040C6270M688N614M770j563j5479o904M926N012N373l522L694r576o579j3773
13026A2951j0686P54J1854K797m409M780Q517q009Q334R505O446M918n311j8036
13012B4405n020n720M021J4204N737J1722q895q139O583m97Q776P664l370j5830
12998C5641j868p743k514M127K255k680N709N136o745K332j5860N088K2168r750
12984C5296k0536q125M652J0929L950n542q89q32k318j0463R101J4727m84q133
12970B1333p374N607J3457M253l577j2091q854n487J241P647P533j2339r450J0824
12956A2723J8284p728q1L958q869K004p30R629P969k712k701L805Q835j020O852
$$ plain form
13054 23432 25131 34013 42241 39191 33820 17030 13752 11520 22221 22039 20832 22352 30159 36270
13040 36270 40958 46572 51342 49779 34300 27396 32322 37334 42707 39185 42879 33303 26724 12951
13026 12951 2265 3019 14873 17670 13261 18041 26558 18549 26883 36388 42834 47752 42441 24405
13012 24405 19385 13665 17686 31890 37627 49349 40454 32315 38898 38401 47177 54841 51471 35641
12998 35641 33773 26030 23516 27643 29898 27218 32927 38063 31318 33650 17790 22878 45046 35296
12984 35296 14760 6635 11287 22216 26166 20624 19735 18903 16585 6122 15223 29950 29466 21333
12970 21333 13959 19566 33023 37276 33699 21608 12754 7267 8508 16155 23688 11349 1899 12723
12956 12723 31007 23279 23198 27156 18287 20291 19561 29190 37159 34447 31746 35551 44386 43366 50218
12941E0218k173j0481l60P00m119K926N443N651l062o345J43L796P550j303j3159
12926C5425n682m396J311O681P197P639o16J5331j2287N941K902o400k642o742
12912D3662N559m402j3827J467p907n160j0546j2968j924N006Q331J1673j5J0873
12898B9822J0614K612n440M63J0822q065m803q351r763J3868J0791q638j919j7109
12884A4904l706J77J4047j659m864J3947j2020n452k363o950O758K5388K608j1116
12870B9699r975R559M124J0525J0164K720n149L713p479q160J5386L522p782j3223
12856C7644L867L963M221J672O662j0917L118m984j2213M557L068p03P912j1321
12842C6546J2246J2921l248j4271j2413O330n737j927L611M061L81L163O357q330
$$ plain form
12941 50218 48045 37564 37204 37904 33785 36711 42154 47805 44743 38398 38541 42337 49887 48584 35425
12926 35425 29743 25347 26658 33339 40536 48175 47559 62890 50603 56544 59446 53046 50404 43662
12912 43662 49221 44819 30992 32459 24552 19392 8846 -4122 -6046 -1040 7291 18964 18949 29822
12898 29822 40436 43048 37608 38071 48893 40828 36025 27674 17911 31779 42570 33932 32013 14904
12884 14904 11198 11375 25422 23763 18899 32846 20826 15374 13011 6061 12819 38207 40815 29699
12870 29699 19724 29283 33407 43932 54096 56816 51667 55380 47901 39741 55127 58649 50867 37644
12856 37644 41511 45474 49695 51367 58029 47112 50230 45246 33033 37590 40658 39955 47867 36546
12842 36546 48792 61713 58465 44194 31781 38111 32374 30447 34058 38119 38500 41663 48020 39690
12828C9690j5961J2527Q117P69m939k430P532k992M518m849n748O518N413m628
12814D3537m775N778K2831L302l67q106m693j0669o300m327q151k953J2100K8694
12800F5901m664p744n942L690o54k250p185M081J0266J4223N111m923L23k0204
12786E0029j2208k748R655J7937J0555j4024n347k742N522n888J473J883q953
12773D5144n850j700m496R379k904M53M358p372K505l044n705O814J2069J0704
12759F0355J2311p85p644r812m321J757r03R258N264k2295J0778J4247J143O938
12745G6291o732j2584j4386l581M113K2736J1505m738j5028J3477M043j2910k315
12732E9891L036p774P575k779K348L598m399N1k499K0699J6038J0659j802l282
$$ plain form
12828 39690 23729 36256 44373 45142 40203 37773 45305 42313 46831 41982 36234 42752 48165 43537
12814 43537 38762 44540 67371 70673 70306 62200 57507 46838 40538 36211 28060 25107 37207 65901
12800 65901 61237 53493 47551 51241 50587 48337 41152 45233 55499 69722 74833 69910 70233 50029
12786 50029 37821 35073 44728 62665 73220 59196 53849 51107 56629 50741 52214 54097 45144
12773 45144 39294 37594 33098 42477 39573 40026 44384 37012 39517 36473 30768 37582 49651 60355
12759 60355 72666 71881 64237 54425 50104 51861 50958 60216 65480 43185 53963 68210 69353 76291
12745 76291 69559 56975 42589 39008 43121 65857 77362 72624 57596 71073 75116 62206 59891
12732 59891 62927 55153 62728 59949 62297 65895 61496 61547 59048 79747 95785 106444 104642 101360
12718A01360k839P692O662m956j1580j2721r328P047j216j014J4404m310j4570
12705G4631r782j1083Q182J3155j344k0251O387Q927K473l329O799J2907J240
12692H8912j0216m878j210N487M437M103K9j3381j3203O664N805j345q91P213
12678G7526p903j883n095J0679N175l681k22n119m270J0008J101J3217J312j0994
12664G9851J657J3118n742J109O849k770o115J1911Q878o36K206Q033N670J963
12650A25982K441M716J30o612M243o867j5858o917O073r45J1564L277j2491k519
12636A06217N142j1446j3901L226J4893r084q401M614o848M465m31P246K335k469
12622I5558L835l406p418O670K1828J6668K2627J0484Q052J6005J1845K5482K0848
$$ plain form
12718 101360 98521 106213 112875 107919 96339 83618 74290 81337 80121 79107 93511 89201 74631
12705 74631 64849 53766 61948 75103 73759 53508 59895 68822 71295 67966 74765 87672 88912
12692 88912 78696 73818 72608 78095 82532 86635 86664 73283 60080 66744 72549 71204 70313 77526
12678 77526 69623 67740 62645 73324 78499 74818 74596 69477 65207 75215 76316 89533 90845 79851
12664 79851 81508 94626 88884 89993 96842 94072 87957 99868 108746 108110 110316 118349 124019 125982
12650 125982 128423 133139 133269 126657 130900 124033 108175 101258 107331 106386 117950 121227 108736 106217
12636 106217 111359 99913 86012 89238 104131 95047 86646 91260 84412 88877 88446 95692 98027 95558
12622 95558 99393 95987 88569 95239 117067 133735 156362 166846 174898 190903 202748 228230 249078
12609B49078M565K8315K2038K4388j868m295j1703p650m494j4691k5700k2542
12597B35441J0417J3193K5827K2764J7522L7454N3996P7881J08889R4605Q2129
12586G80118N7267N7815K8193k2807o1963r6297j07448j12608q7925p2460m4228
12575C17657l7820k8847j1594p177k5362j5161j343K677K262M547L678P87K401
12562B06705K572r113j1719q322j8585P607P423j4147k0499j4069J567k543L260
12549A30137K100r946j3421l525J3892M830l874L22n849l456P492N814L818r363
12535A18971K219P06J4517J1017q308j819n108r795j3369R745j981J810j3211
12522A05394j0823m41O207L121j4769r584L515O470P810p201k3836N460K3667
$$ plain form
12609 249078 253643 281958 303996 328384 326516 322221 310518 302868 298374 283683 257983 235441
12597 235441 245858 259051 284878 307642 325164 362618 416614 494495 603384 697989 780118
12586 780118 837385 895200 923393 900586 838623 742326 634878 522270 434345 361885 317657
12575 317657 279837 250990 239396 232219 206857 191696 190353 193030 195292 199839 203517 204304 206705
12562 206705 209277 200164 188445 180123 161538 169145 176568 162421 141922 127853 129420 126877 130137
12549 130137 132237 122291 108870 105345 119237 124067 120193 120515 114666 111210 118702 124516 128334 118971
12535 118971 121190 121896 136413 147430 139122 137303 132195 122400 109031 118776 116795 118605 105394
12522 105394 94571 94130 100337 103458 88689 79105 82620 89090 96900 89699 65863 71323 94990
12509I4990L424Q059J2193q805k82J3815o668j2796K7K859k925p447N610o832
12495I5222J219J1330K078n380J0663r318j4695p659Q452J2131N412O340M483
12482A20278j839r962l079R49m277r981K219K0689J7181J774j848P997K758J5667
12468A58526O484n188l317K84n546q259O695j4122p694n575J237M220o964J120
12454A21901L009N621J0808r50j2976j6057P468q233j166R315l562J1706L29R783
12440A36996M336j0518N389N169l472k401N414K922j0949j4664L522K8383N584
12427A55711j3051R807K8014K2592K5622K216o692j8630q264M67j0977j0070n425
12414A71320j1732p811k0618r624n674j1216O089M505N817M367Q019P660J0396
$$ plain form
12509 94990 98414 106473 118666 109861 109579 123394 116726 103930 103957 106816 103891 96444 102054 95222
12495 95222 96441 107771 109849 104469 115132 105814 91119 83460 91912 104043 109455 115795 120278
12482 120278 118439 108477 105398 106347 102070 92089 94308 114997 132178 133952 132104 140101 142859 158526
12468 158526 165010 159822 156505 156789 151243 142984 149679 135557 127863 122288 123525 127745 120781 121901
12454 121901 124910 130531 141339 140389 127413 111356 118824 110591 109425 118740 115178 126884 127213 136996
12440 136996 141332 130814 136203 141372 137900 135499 140913 143835 132886 118222 121744 150127 155711
12427 155711 142660 152467 180481 203073 228695 230911 224219 205589 197325 197792 186815 176745 171320
12414 171320 159588 151777 131159 121535 115861 104645 110734 115239 121056 125423 133442 141102 151498
12401A51498P883q235r606j4728L296L602m618K398L056l879J832q19p268N438
12387A29850O167J3405K507O42M145m009J0254r324q343j0154j0271R70p91L131
12373A28179O577J4270J0252p206J148J926n451j0678j129q72O73R442J864k633
12359A46362j742J8603Q430O776J534N2Q17P996N590j0060l552N771P063L061
12345A96701K941K590K966J5229J1250J3530J4986O543l821o862r164j7443o730
12332B22716N083J9944J9831J7282R925J0700m574Q963J3850J2735K8113M4228
12320D08796M1265L5924O1853Q8476Q7347Q7135R8410Q7620P7813P1296Q1789
12309A227724Q9531J41038J86544K62984M38059O46602Q47367J016969J102593
$$ plain form
12401 151498 159381 151146 141540 126812 130108 133710 129092 131490 134546 130667 132499 131680 124412 129850
12387 129850 136017 149422 151929 152571 156716 152707 162961 153637 145294 135140 124869 125839 125048 128179
12373 128179 134756 149026 159278 152072 153220 155146 149695 139017 137888 137016 137689 147131 148995 146362
12359 146362 144620 163223 171653 178429 179963 180015 180832 188828 194418 184358 180806 186577 193640 196701
12345 196701 199642 202232 205198 220427 231677 245207 260193 266736 262915 256053 246889 229446 222716
12332 222716 227799 247743 267574 284856 294781 305481 300907 309870 323720 336455 364568 408796
12320 408796 450061 485985 547838 636314 723661 810796 909206 996826 1074639 1145935 1227724
12309 1227724 1317255 1458293 1644837 1907821 2345880 2992482 3839849 4856818 5959411
12300E959411J095406R64333O78432L22538q7787m70426p95331j007432j102256
12291E556888j053107r19739p47429n50064l74323k36481j73103j41153j01750
12282A259739q5905r9548q1516n9045p0331n1815m3619m9698m1454l1692j4188
12271F30928j6278l56Nj1142j1212j3200j0438q69N399J281J8332J5309P854L772
12257F19385J5054J5578K2526K8180M5577K5333K6302K1554J3257J8898K0946
12246H72590J4478k151r541q304q831k7574j5900o438j1734j1570J370J2536J0403
12233H09334K1279O893j694R039K0624K6952L6943M3051N8224L8648L8824L5544
12221A143661L5102N3804N0937L7131M6999M4002L1633M1389K2110K9860M5943
$$ plain form
12300 5959411 7054817 8019150 8697582 9020120 8932333 8461907 7666576 6659144 5556888
12291 5556888 4503781 3584042 2836613 2286549 1912226 1675745 1502642 1361489 1259739
12282 1259739 1173834 1074286 992770 933725 863394 811579 767960 718262 676808 645116 630928
12271 630928 614650 614294 614299 603157 591945 578745 568307 567438 572837 574118 592450 607759 615613 619385
12257 619385 634439 650017 672543 700723 746300 771633 797935 819489 832746 851644 872590
12246 872590 887068 884917 875376 867072 858241 830667 814767 808329 796595 785025 786395 798931 809334
12233 809334 830613 837506 835812 844851 865475 892427 929370 972421 1030645 1069293 1108117 1143661
12221 1143661 1178763 1232567 1283504 1320635 1367634 1411636 1443269 1484658 1506768 1536628 1582571
12210A582571M5875M3969M3393M3925M3427M9386O0175P0281O9070P6017Q7393
12199B215482J12670J37661J56675J84733J90796K17582K85513L42843M34121
12190D278076N83003P56451R24344J105571J228622J335707J378774J324364J232286
12181A4147198J114586J057751J121491J440512K114874L343633N416571Q546773
12173C8303389J2571284J6531616J9647438K1168406K0635093J7580159J2035704
12166A58473089M637705l515989j1050962j6813613k0167550k0943999j9443995
12159G1174686j6234424j2383077q724545n909954m004813k799503k019890j563110
12151A7535370j368379j324979j380837j433806j414271j323337j171844j009324
$$ plain form
12210 1582571 1628446 1672415 1715808 1759733 1803160 1852546 1912721 1983002 2052072 2128089 2215482
12199 2215482 2328152 2465813 2622488 2807221 2998017 3215599 3501112 3843955 4278076
12190 4278076 4861079 5617530 6541874 7647445 8876067 10211774 11590548 12914912 14147198
12181 14147198 15261784 16319535 17441026 18881538 20996412 24340045 29756616 38303389
12173 38303389 50874673 67406289 87053727 108222133 128857226 146437385 158473089
12166 158473089 163110794 159594805 148543843 131730230 111562680 90618681 71174686
12159 71174686 54940262 42557185 33832640 27922686 23917873 21118370 19098480 17535370
12151 17535370 16166991 14842012 13461175 12027369 10613098 9289761 8117917 7108593
12143G108593q18634o45047n26003m34528l77089l24874k88195k47133k19703
12134C227387j97820j85021j56772j35719j24315j03513j23487j33383j22553
12125A944804j27109j18509j24377j04934q6306q0255r0362o3205n1958n3321
12115A044468n9048o2471o2277l9489n1299n0711j5816j0669j160k3692k4858
12104F42978k2109k0553r489r966k0359j7236k5056j8353r729k8221l9086l8917
12092C83904k2255M369M196q912k3027j6034J266k1933j5192j3836r119K568o93
12079B65302o179q208L59R503M748M345p475o304J0080m828N64J4416K3250N220
12065C04793k2627o847R43o915O476o402j5652k5551p977m417K387k276N211J7071
$$ plain form
12143 7108593 6289959 5644912 5118909 4684381 4307292 3982418 3694223 3447090 3227387
12134 3227387 3029567 2844546 2687774 2552055 2427740 2324227 2200740 2067357 1944804
12125 1944804 1817695 1699186 1574809 1469875 1383569 1303314 1212952 1149747 1097789 1044468
12115 1044468 985420 922949 860672 821183 769884 719173 703357 692688 691528 667836 642978
12104 642978 620869 600316 590827 580861 560502 543266 518210 499857 490128 461907 422821 383904
12092 383904 361649 366018 370214 361302 338275 322241 323507 301574 286382 272546 263427 265995 265302
12079 265302 259123 250915 251274 260777 265525 269870 262395 256091 266171 261343 261907 276323 299573 304793
12065 304793 282166 275319 276262 269347 275823 269421 253769 228218 220241 215824 218211 215935 221146 238217
12051B38217J2788j354o240O7l249j969l180l559O672k007J4901m350P863L938
12037B58538J0387j2749j763m176M419L162j8952m238o466r142n718q120j1185
12024A93997n497j0946l231O920O165m175r500o092Q391p671j754K4288K1630
12011B12525J0209P244O007k007P409J472j4435m110J7127J5380K6080M88K439
11998B85828J3353J8445R649L697R234J1134j4224j2255p059r017o657P675o67
11985C09136j6084j0845p928R90j6231q749j1272o620O166J3141K730j3213n591
11972B35630N047J9440J7652P341K673J4234J4070L197k817n661J2654Q791J2127
11959C44378J2394P841R403P841P828j6866k0052j4181p654j347j3544j8972j7745
$$ plain form
12051 238217 251005 249651 243411 243478 240229 238260 235080 231521 238193 236186 251087 246737 254600 258538
12037 258538 268925 256176 254413 250237 254656 257818 238866 234628 228162 219020 213302 205182 193997
12024 193997 188500 177554 174323 181243 187408 183233 173733 167641 176032 168361 166607 190895 212525
12011 212525 222734 229978 235985 233978 241387 242859 228424 224314 241441 256821 282901 283389 285828
11998 285828 299181 317626 327275 330972 340206 351340 337116 324861 317802 308785 302128 309803 309136
11985 309136 293052 282207 274279 275269 259038 250289 239017 232397 238563 251704 254434 241221 235630
11972 235630 240677 260117 277769 285110 287783 302017 316087 319284 316467 310806 323460 332251 344378
11959 344378 356772 364613 374016 381857 389685 372819 352767 338586 330932 329585 316041 297069 279324
11946B79324q720l290q612J149p33n727R8j0457l521q84n421L198k334N398K0437
11931B59905j050o779l919j33J672M151N376J033R306P802j3997O138J0286M249
11917B84040j4554l479p049j1077j8378l626j39K222N94k53n935O112p965q031
11903B12482j7702m109o722P354j279o425j226J116o472j776l255p090j4300m067
11889A46529P967J3879N790J9234M480p892J908j2173l361J1414R983L332P546
11876B08636R677k767N225J2762J0415R500J2576P950j4575k3078K229N388o336
11863B37602j2787l438N639J853j604N791J188L804J0064R638K1714M828J076
11850B85368j770N862L821j833J6234K3042N864J4949K557j4956j4245j954r64
$$ plain form
11946 279324 270604 267314 258702 259851 259118 253391 253489 243032 239511 238627 233206 236404 234070 239468 259905
11931 259905 258855 252076 248157 248024 249696 253847 259223 260256 269562 277364 263367 269505 279791 284040
11917 284040 269486 266007 258958 247881 229503 225877 225738 227960 228554 228301 222366 228478 220513 212482
11903 212482 194780 190671 183949 191303 190024 183599 182373 183489 177017 175241 171986 164896 150596 146529
11889 146529 154496 168375 174165 193399 197879 189987 191895 179722 176361 187775 197758 201090 208636
11876 208636 218313 215546 220771 233533 243948 253448 266024 273974 259399 236321 238550 243938 237602
11863 237602 224815 221377 227016 228869 227265 233056 234244 238048 248112 257750 279464 284292 285368
11850 285368 283598 289460 293281 291448 307682 330724 336588 351537 354094 339138 324893 322939 321975
11837C21975Q55l971j729P340k961j4520j5001q27K090Q829J404J2844P347m07
11823C23268J3839q945J631J3494K1127J7416M052K765N731K2131K6662J027m216
11810D39982n868j1038q650j4386j2555J1605O686R628k139p589j3792j0851k163
11797C78870m664j3673R143R019r096L039J5669R846O038L996J5850j160O795
11784D29672l474Q993J0282J2348J0218J709o260j607J0397l377j3972q954k711
11771D43264n636j461j1316m327m889K505r696n190j3482P888L0113K3934M269
11758D55976m59O359l260k493K040J3625K5109M192J8598L6646N0923P5694Q4898
11745G67848R2514Q9796P4997L6075K1841j5101n3854p9285r7552r4762r4652
$$ plain form
11837 321975 322830 318859 317130 324470 321509 306989 291988 291161 293251 302080 303484 316328 323675 323268
11823 323268 337107 328162 329793 343287 364414 381830 385882 388647 394378 416509 443171 444198 439982
11810 439982 434114 423076 414426 400040 387485 399090 405776 415404 413265 405676 391884 381033 378870
11797 378870 374206 360533 369676 378695 369599 372638 388307 398153 404191 408187 424037 422877 429672
11784 429672 426198 435191 445473 457821 468039 469748 463488 461881 472278 468901 454929 445975 443264
11771 443264 437628 436167 424851 420524 415635 418140 408444 403254 389772 397660 427773 451707 455976
11758 455976 455517 461876 458616 456123 458163 471788 496897 501089 519687 556333 607256 682950 767848
11745 767848 860362 950158 1025155 1061230 1083071 1067970 1014116 934831 837279 742517 647865
11734F47865p5098m7546j5803p409j8451j0531K059m223n451m544o537k4338j9204
11721D10789k9177k4836j0077j4661l881k0291k3211p269R325R245Q859K709J1911
11708C19435P547k986N404R338q129K398J4689J934n645n822j0454j0193k006
11695C15510r874m009o115k0245r260n282l863J4800M759j993O512k147j7356
11682B61437k5906J215J4677K473J4068j577j883O849Q226q51l809J3775J0192
11669B98886n909k673P136P273K0665K3610J3534r873j7042q391k0374k2866k1850
11656B62126K481j2865r802r250j7078j3471l153k292j0692j957P351N23j1098
11643A80823M431R570K094r110K406o201m232N225J4860K345r192n999j2817p684
$$ plain form
11734 647865 572767 525221 509418 502009 483558 473027 475086 470863 465412 460868 454331 429993 410789
11721 410789 381612 356776 346699 332038 328157 307866 284655 277386 286711 295956 304815 307524 319435
11708 319435 326982 323996 329400 338738 330609 333007 347696 349630 343985 338163 327709 317516 315510
11695 315510 305636 301627 295512 275267 266007 260725 256862 271662 276421 274428 280940 278793 261437
11682 261437 235531 236746 251423 253896 267964 266387 264504 271353 279579 278728 274919 288694 298886
11669 298886 292977 290304 297440 304713 325378 348988 362522 352649 335607 327216 306842 283976 262126
11656 262126 264607 251742 241940 232690 215612 202141 198988 196696 186004 184047 191398 191921 180823
11643 180823 185254 194824 196918 187808 190214 184013 179781 185006 199866 202211 193019 187020 174203 166519
11629A66519m560Q290J7074J3967J2679J3649Q864l398j8658l546M41j118j0531
11616A99672o098m756j6982J530n80N133J0217J7916r740j3429J290K722p32k454
11602A83709K959q888p809k872N685r07J862L234M363j798q339K741o54K510j944
11587A73852O076k757j331R310J9592O881n869j466p138O700K943o314p135l740
11573A89604J918j4708n645J1168J833O885m847J2056O894l25l055j09j0578j6339
11559A74752r414L364R305o324p556N741k208N191J1865p853k826J7Q699M144
11545A86897M062J6733m841k1847q693l422m058O461Q452j1555p480m434N845
11532A62120M311P496Q697L271M718O78oL155p80j3823o83p910j599P503J6093
$$ plain form
11629 166519 161959 170249 187323 201290 213969 227618 236482 233084 214426 210880 211321 210203 199672
11616 199672 193574 188818 171836 173366 172786 177919 188136 206052 196312 182883 184173 186895 186163 183709
11602 183709 186668 177780 169971 167099 172784 171877 173739 176973 181336 179538 171199 173940 173286 175796 173852
11587 173852 179928 177171 175840 185150 204742 211623 205754 204288 197150 203850 206793 200479 193344 189604
11573 189604 191522 176814 171169 182337 184170 191055 186208 198264 205158 204833 201778 201669 191091 174752
11559 174752 165338 168702 178007 171683 164127 169868 167660 172851 184716 176863 174037 174054 182753 186897
11545 186897 190959 207692 202851 181004 172311 168889 164831 171292 179744 168189 160709 156275 162120
11532 162120 166431 173927 182624 185895 190613 191291 191285 194440 193660 179837 179154 171244 169645 177148 193241
11517A93241J9779P640K973k912o743N777J3125m129N189r001k4398r056O820
11504A98305r01j2128P018N007n838O281q044j7810K868J3527Q605o792l641N99
11490A87056J7253k283j2732k817n641J912M579M058N439R20M30J068L121n046
11476A97317j774O328p804n763r059q977j260P870J0096P369K302J6142N312P682
11462B25781P422l033j0621N38k606R73O98P271m335r239K56q573p84N499j718
11447B07529R805K1943R774o925o793L74j697p854L748j81M455J067p019j1749
11433B16477j381Q906J784o083R30m767o036o665N250M571J547J4316k061K773
11419B29561j3253j065J1077J122q077P15k979J1362J2007R397J4420l068j4724
$$ plain form
11517 193241 213020 220660 223633 220721 213978 219755 232880 228751 233940 224939 200541 191485 198305
11504 198305 197404 185276 192294 197301 191463 197744 189700 171890 174758 188285 196890 190098 186457 187056
11490 187056 204309 202026 189294 186477 180836 182748 187327 191385 196824 197744 198174 199242 202363 197317
11476 197317 195543 201871 194067 188304 179245 170268 169008 176878 186974 194343 196645 212787 218099 225781
11462 225781 233203 230170 219549 220087 217481 218454 219152 226423 222088 212849 213105 204532 203748 209247 207529
11447 207529 217334 239277 249051 242126 235333 235707 234010 226156 229904 229723 234178 235245 228226 216477
11433 216477 215096 224002 225786 219703 220633 215866 209830 203165 208415 212986 214533 228849 226788 229561
11419 229561 216308 215243 226320 227442 219365 220080 217101 228463 240470 249867 264287 261219 246495
11406B46495j151j1888p723N949M085J0921j387M960O636O425p745m473M245P95
11392B56144j1660j279j324Q86l342j1511M162l11O90P812l94k06R552N527J6666
11377B71412R239m849M836j7137k6034J6251L2131o645n133K307Q865J6547J4327
11364C16117m891l202J327J1981J831j2183O99P561O370k70K314K2303J8857K421
11350C71235q738j1368K304q100j8927r876r635k999j0930J5583l407m72Pj962
11336C02715K519o824m030M917K356O880R727j780Q682m039p930J1547O16j8280
11322C07076j4553J3126J134J3263n627p457P652l975Q28J1237P413j870q836
11309C19411P634K0733N883m396j3573j6360k855N822J891J137R129J7119J5452
$$ plain form
11406 246495 245344 233456 225733 231682 235767 246688 245301 250261 256897 263322 255577 251104 255349 256144
11392 256144 244484 243205 241881 242767 239425 227914 232076 231765 232455 240267 239873 239667 249219 254746 271412
11377 271412 280651 275802 280638 263501 237467 253718 285849 279204 274071 276378 285243 301790 316117
11364 316117 311226 308024 309351 321332 323163 310980 311679 319240 325610 325340 327654 349957 368814 371235
11350 371235 362497 351129 353433 345333 326406 316530 306895 303896 292966 308549 305142 304670 304677 302715
11336 302715 305234 298410 294380 299297 301653 308533 318260 316480 325162 321123 313193 324740 325356 307076
11322 307076 292523 305649 306783 320046 314419 306962 314614 310639 311467 322704 330117 328247 319411
11309 319411 327045 347778 353661 349265 335692 319332 316477 322299 324190 325327 334456 351575 367027
11296C67027R259K3899K1062K3768M8531Q2198J05926Q6235M5483J3715l2024
11285G95079p0800p8410n9193n9901n3847k0352n076j5039j1102K422l27l123
11273D20331k970o827q247j4826o717N712P78q499Q942o580o29l06n095j840N180
11258C78407J18K368M107j6791j6684k484K7970J7065o327L313p475o74n844R928
11244C86997K3661R399P145k667m101K4958K6830J4502L3655N2137P1980Q8694
11232G33190J17255J54321J42558O3544m6251j30716j36472j18131r3063n4108
11222F32127l9185k9693j9414O120L737J7417M8809K0024j0442j1829j6324k2566
11210E78781o020k1440j8944l048l535k3630p948l307j5561j0918k1213p27N509
$$ plain form
11296 367027 376286 400185 421247 445015 493546 575744 681670 767905 813388 827103 795079
11285 795079 724279 645869 586676 526775 472928 452576 447500 432461 421359 423781 423454 420331
11273 420331 417361 410534 402287 387461 380744 386456 387234 378735 387677 381097 380468 380162 375067 373227 378407
11258 378407 378525 380893 385000 368209 351525 349041 377011 394076 387749 391062 383587 382913 377069 386997
11244 386997 410658 420057 427202 424535 420434 445392 472222 486724 520379 572516 644496 733190
11232 733190 850445 1004766 1147324 1210868 1164617 1033901 897429 779298 686235 632127
11222 632127 592942 563249 543835 549955 553692 571109 619918 639942 629500 617671 601347 578781
11210 578781 572761 551321 532377 529329 525794 502164 494216 490909 475348 464430 443217 442490 447999
11197D47999J8338R303Q874n805k006l372p726K574J0005P559J3259Q976J8253
11184E26231J2609J5820J7762K245m390k726N653N370J940j7536j4179o421j6069
11171E26309j8524r584m957J5247K802J0657N22R245M90J68l794J1448m592J130
11157E36567M363j479Q05K4005J8141o912R423L0598K456J1025K685K0413K4883
11144F76973L2192M7832P3965O9585L2608K636l0422n8190o7440n0272m0567k8912
11132F59988r155j1151L734l006o493p722j0815J8741J3610J5604l127p217J983
11119F54974J0955O257J4947L2697K7969L9529P6638Q8332Q8356P7297O0330K5447
11107A203728k987m2961o4706r2816p5899k4876k0925j9708k1980r10M550j1111
$$ plain form
11197 447999 466337 475640 484514 478709 476703 473331 465605 468179 478184 485743 499002 507978 526231
11184 526231 538840 554660 572422 574667 570277 567551 573204 578574 580514 562978 548799 542378 526309
11171 526309 507785 498201 493244 508491 511293 521950 522472 531717 532207 532375 528581 540029 535437 536567
11157 536567 540930 539451 540256 564261 582402 575490 584913 615511 617967 628992 631677 652090 676973
11144 676973 709165 756997 830962 900547 933155 935791 905369 847179 779739 729467 688900 659988
11132 659988 650833 639682 643416 640410 633917 626195 615380 634121 647731 663335 660208 652991 654974
11119 654974 665929 672186 687133 719830 747799 787328 863966 952298 1040654 1117951 1178281 1203728
11107 1203728 1200741 1157780 1093074 1000258 924359 899483 878558 858850 836870 835960 840510 829399
11095H29399j1922j0610j3409O47k3658j2726R604K870M567J7074J5260n265L131
11082H04962J5115j832l685j6635k697j644j05j0658o845K0171K3755J6108K106
11069H38116K354r899j1160O33N263Q399n212j610J5926J9344j0499l706j4684
11056H33265K915Q068m434n09K5709N759J772k371L057K2218k269k525M18p388
11042H83685Q206O267q27j7035m593L367N514Q460j5788j224o161R737K3463Q568
11028I11639m975J7295K0481M543j8012l2178k725O954n782l903L711J4232L143
11015I14423k729J568P909r326J7306J1467P995l653m687j918m50p475M354m676
11001I30108J3045q820j5316j0012K22M064J7165J1103M101J4416K630M530j760
$$ plain form
11095 829399 817477 806867 793458 794105 770447 757721 767325 770195 774762 791836 807096 801831 804962
11082 804962 820077 818245 814560 797925 795228 793584 793479 782821 775976 796147 819902 836010 838116
11069 838116 840470 830571 819411 820044 825307 833706 828494 826884 842810 862154 851655 847949 833265
11056 833265 836180 844248 839814 839305 865014 870773 872545 870174 873231 895449 893180 890655 891073 883685
11042 883685 891891 898158 897331 880296 875703 879070 884584 893044 877256 876032 869871 879608 903071 911639
11028 911639 906664 923959 944440 948983 930971 898793 896068 903022 897240 893337 897048 911280 914423
11015 914423 911694 913262 921171 911845 929151 940618 948613 944960 940273 938355 937905 930430 934784 930108
11001 930108 943153 934333 919017 909005 909227 913291 930456 941559 945660 960076 962706 967236 965476
10988I65476J2461J0563m116O642Q17Q380K4894O581n425m023j435J3144J4161
10975A048120o169L675L358N93m305p227j0818O338O538J1635K319L200K1613
10962A078870R799J062N887j1317N396Q980k298O691L775R505J3021J8393L892
10949A151656J0647J5004K2495m949o664L743K3099K6325K3580N884p990o501
10937A256329J3711Q735N126M852m14J1096R748J9641M392m009j534K919M361
10924A334953M748N644J3561J1747Q803L822j543N948K7308K5350Q123J320R928
10911A459712K7266R394j1329J3582K0199J5397N837J0464J0674K912P095Q509
10899A579712j0062K4430q046k7579k730K0963K318J7712J6312O855k205J0831
$$ plain form
10988 965476 977937 988500 984384 991026 991843 1000223 1025117 1031698 1026273 1022250 1020815 1033959 1048120
10975 1048120 1041951 1045626 1048984 1049577 1045272 1038045 1027227 1033565 1040103 1051738 1054057 1057257 1078870
10962 1078870 1088669 1089731 1095618 1084301 1089697 1098677 1096379 1103070 1106845 1116350 1129371 1147764 1151656
10949 1151656 1162303 1177307 1199802 1194853 1188189 1191932 1215031 1241356 1264936 1270820 1262830 1256329
10937 1256329 1270040 1278775 1283901 1288753 1288339 1299435 1309183 1328824 1333216 1329207 1327673 1330592 1334953
10924 1334953 1339701 1345345 1358906 1370653 1379456 1383278 1381735 1387683 1414991 1440341 1448464 1449784 1459712
10911 1459712 1486978 1496372 1485043 1498625 1518824 1534221 1540058 1550522 1561196 1564108 1571203 1579712
10899 1579712 1569650 1594080 1586034 1558455 1555725 1576688 1579006 1596718 1613030 1619885 1617680 1628511
10887A628511J3285O388J9233J566l777o453J2560J591m04J3095K0630Q652J0718
10874A725595O879J0763N166l994K4304J2776P461K0871O949K221l183J9490J3529
10861A848827n60R685J3125J6989J1402R796J2606K1507K3897L088P066J0450
10849A987878R56M539K3387J4535K6044J4271J6709J7053N422R536J5745K3580
10837B159655L2126K1047J0664J4588Q207K5635J7435J3586R594K002K4983J4718
10825B354240J6350L0651K8736K8529J4916J7909L1350K0156M715N524M1070J0552
10813B604698J0242K5433M1266K9329L8273L1061K9128J5162K2898K4397K7645
10802B899532L0835J5165J6278K2627M1083M6271K8180M3021L7997K9332L8280
$$ plain form
10887 1628511 1641796 1648184 1667417 1668983 1665206 1658753 1671313 1672904 1672500 1685595 1706225 1714877 1725595
10874 1725595 1732474 1743237 1748403 1744409 1768713 1781489 1788950 1809821 1816770 1818991 1815808 1835298 1848827
10861 1848827 1848267 1857952 1871077 1888066 1899468 1909264 1921870 1943377 1967274 1970362 1977428 1987878
10849 1987878 1988834 1993373 2016760 2031295 2057339 2071610 2088319 2105372 2110794 2120330 2136075 2159655
10837 2159655 2191781 2212828 2223492 2238080 2246287 2271922 2289357 2302943 2312537 2314539 2339522 2354240
10825 2354240 2370590 2401241 2429977 2458506 2473422 2491331 2522681 2542837 2547552 2553076 2594146 2604698
10813 2604698 2614940 2640373 2681639 2710968 2749241 2780302 2809430 2824592 2847490 2871887 2899532
10802 2899532 2930367 2945532 2961810 2984437 3025520 3071791 3099971 3142992 3180989 3210321 3248601
10791C248601M0874L8173L9749K3387L4259L5872M3278L3633M1091M1419M4930
10780C665266L3326M9017N0309M9168N0327M9137N7940O7807N1221M1468N5894
10769D220880M5342N5405M7651N4783N3243O4844O6784N8344O4637N0610O3764
10758D846287P4468P4629Q5378O9429P6022Q6852Q2870P8491Q6378Q2996P9319
10747E723119R9061Q4123Q9793J00539J06649J21196J11559J01959J19455J21344
10737F778797J25691J22559J20434J52106J45683J42275J28694J18968J37087
10728G972294J55415J54802J66021J66556J78484J96167J99295J88308J97194
10719I574536K10459K18431K12391K20342K37592K59013K66207K69062K74950
$$ plain form
10791 3248601 3289475 3327648 3367397 3390784 3425043 3460915 3504193 3537826 3578917 3620336 3665266
10780 3665266 3698592 3747609 3797918 3847086 3897413 3946550 4004490 4072297 4123518 4164986 4220880
10769 4220880 4266222 4321627 4369278 4424061 4477304 4542148 4608932 4667276 4731913 4782523 4846287
10758 4846287 4920755 4995384 5080762 5150191 5226213 5313065 5395935 5474426 5560804 5643800 5723119
10747 5723119 5822180 5906303 5996096 6096635 6203284 6324480 6436039 6537998 6657453 6778797
10737 6778797 6904488 7027047 7147481 7299587 7445270 7587545 7716239 7835207 7972294
10728 7972294 8127709 8282511 8448532 8615088 8793572 8989739 9189034 9377342 9574536
10719 9574536 9784995 10003426 10215817 10436159 10673751 10932764 11198971 11468033 11742983
10710A1742983K92917K94437K94138K92741L07338L25432L39967L44647L49627
10701A4584227L62725L71811L89699L96094M04747M13698M48866M64720M52434
10692A8289021M45629M51555M61722M87445M89201N03861N12122N18178N28083
10683B2686817N22460N19774N40697N33959N18090N04984N26182N23181N11567
10674B7387711N08306N17097M96505M87057M93818M95598M79098M64015M78680
10665C1807885M73375M52956M54107M53856M54330M56538M44621M39708M29442
10656C5866818M18612M10275L87321L87144M05757M13438L88043L79580L84096
10647C9441084M13972M55431M93944N27088M62819K71550L6494j51120k50227
$$ plain form
10710 11742983 12035900 12330337 12624475 12917216 13224554 13549986 13889953 14234600 14584227
10701 14584227 14946952 15318763 15708462 16104556 16509303 16923001 17371867 17836587 18289021
10692 18289021 18734650 19186205 19647927 20135372 20624573 21128434 21640556 22158734 22686817
10683 22686817 23209277 23729051 24269748 24803707 25321797 25826781 26352963 26876144 27387711
10674 27387711 27896017 28413114 28909619 29396676 29890494 30386092 30865190 31329205 31807885
10665 31807885 32281260 32734216 33188323 33642179 34096509 34553047 34997668 35437376 35866818
10656 35866818 36285430 36695705 37083026 37470170 37875927 38289365 38677408 39056988 39441084
10647 39441084 39855056 40310487 40804431 41331519 41794338 42065888 42102382 41951262 41701035
10638D1701035k51291k40930k02748j93456k18000k43450k60054k41413k67335
10629C9582358k80624k85223k97302k93405l21755l30741l31143l46158l41362
10620C6754645l48954l49341l60929l59168l64786l84020l97493m03096m12657
10611C3374201m15740m31885m24154m23441m65299m41505m35471m44098m46749
10602B9445859m34307m30252m23446m24107m23658m33548m24424m03877m02567
10593B5645673l77095l87162l83837l68694l34397l18783l24591l06942l04818
10584B2539354k97928k77232k52298k49676k40642k19401k13180k12091j99653
10575B0377253j86260j73142j70590j52769j47081j41833j18268r9574r0536p7163
$$ plain form
10638 41701035 41449744 41208814 41006066 40812610 40594610 40351160 40091106 39849693 39582358
10629 39582358 39301734 39016511 38719209 38425804 38104049 37773308 37442165 37096007 36754645
10620 36754645 36405691 36056350 35695421 35336253 34971467 34587447 34189954 33786858 33374201
10611 33374201 32958461 32526576 32102422 31678981 31213682 30772177 30336706 29892608 29445859
10602 29445859 29011552 28581300 28157854 27733747 27310089 26876541 26452117 26048240 25645673
10593 25645673 25268578 24881416 24497579 24128885 23794488 23475705 23151114 22844172 22539354
10584 22539354 22241426 21964194 21711896 21462220 21221578 21002177 20788997 20576906 20377253
10575 20377253 20190993 20017851 19847261 19694492 19547411 19405578 19287310 19187736 19097200 19020037
10565A9020037q8203p2388o0994p7445m9347l3366k2836l0755l2121j064L728
10554A8555246J1211L4916K6451K6088L2949M9898N4642P8462Q0206O9980Q0809
10543A9100858O9896Q5387J10666J07692J15800J19827J36528J41103J68273J84896
10533B0340926J87351J84803J80446J90030J93670J97079K08118K08249K26206
10524B2116878K26394K29398K32870K31727K47005K45735K32185K40631K45392
10515B4248215K57095K69074K66053K54593K61222K55361K67008K71385K54715
10506B6604721K41855K64538K37915K41958K47410K37446K27438K19086K13396
10497B8735763J99575J86826J69216J67431J65933J45766J41764J22697J08165
$$ plain form
10565 19020037 18931834 18859446 18798452 18721007 18671660 18638294 18615458 18584703 18552582 18551518 18555246
10554 18555246 18566457 18601373 18627824 18653912 18686861 18736759 18791401 18869863 18950069 19020049 19100858
10543 19100858 19170754 19256141 19366807 19474499 19590299 19710126 19846654 19987757 20156030 20340926
10533 20340926 20528277 20713080 20893526 21083556 21277226 21474305 21682423 21890672 22116878
10524 22116878 22343272 22572670 22805540 23037267 23284272 23530007 23762192 24002823 24248215
10515 24248215 24505310 24774384 25040437 25295030 25556252 25811613 26078621 26350006 26604721
10506 26604721 26846576 27111114 27349029 27590987 27838397 28075843 28303281 28522367 28735763
10497 28735763 28935338 29122164 29291380 29458811 29624744 29770510 29912274 30034971 30143136
10488C0143136J08522R3755R2201Q0172P5414O9096O3850N6521M4032J2539k2829
10477C0816409n3276o6728o8441q7033q9186q9006j02367q9418j04776j08200
10467B9957978r9156j20723j47499j59221j62174j66704j69049j87004j92649
10458B8553799j85293k09863k36749k29800k34731k60610k60617k71227k68687
10449B6396222k55850k79651k79498k67205k68721k79903k79475k70639k88305
10440B3926975k76071k77223l09076l13997l11799l13507l08282l08447l37064
10431B1171509l36983l05518l00414k77529k91294k85866k94817k98465k79729
10422A8500894k61782k51430k42282k50600k42351k34182k56466k70149k90437
$$ plain form
10488 30143136 30251658 30345413 30437614 30517786 30593200 30662296 30726146 30782667 30826699 30839238 30816409
10477 30816409 30763133 30696405 30627964 30540931 30451745 30362739 30260372 30170954 30066178 29957978
10467 29957978 29858822 29738099 29590600 29431379 29269205 29102501 28933452 28746448 28553799
10458 28553799 28368506 28158643 27921894 27692094 27457363 27196753 26936136 26664909 26396222
10449 26396222 26140372 25860721 25581223 25314018 25045297 24765394 24485919 24215280 23926975
10440 23926975 23650904 23373681 23064605 22750608 22438809 22125302 21817020 21508573 21171509
10431 21171509 20834526 20529008 20228594 19951065 19659771 19373905 19079088 18780623 18500894
10422 18500894 18239112 17987682 17745400 17494800 17252449 17018267 16761801 16491652 16201215
10413A6201215k72531k52978k54248k41803k32469k36205k27541k31543k23094
10404A4028803k20400k11060k18947k06471k11529k13203k00090k02109j93656
10395A2151338j71655j81729j70840j71734j65932j59309j65876j30058j43685
10386A0690520j77589j74604j71576j66269j77440j35907r9005q4020r5601j26424
10376I282085j42474j36606j41803j37809j34493j10819j05807j08358r5144r1284
10366H077488j06116r1714q7842r2373r1142j00497r3450r3449r3104r0959q8161
10355G048681p9671q0280q5243p8692q2026j10897r8949r2431j00986r8174q8004
10344F053328q9602p8463q7667r3289q7259o4971n9617m8248m7174m9847m9299
$$ plain form
10413 16201215 15928684 15675706 15421458 15179655 14947186 14710981 14483440 14251897 14028803
10404 14028803 13808403 13597343 13378396 13171925 12960396 12747193 12547103 12344994 12151338
10395 12151338 11979683 11797954 11627114 11455380 11289448 11130139 10964263 10834205 10690520
10386 10690520 10512931 10338327 10166751 10000482 9823042 9687135 9588130 9504110 9408509 9282085
10376 9282085 9139611 9003005 8861202 8723393 8588900 8478081 8372274 8263916 8168772 8077488
10366 8077488 7971372 7879658 7791816 7699443 7608301 7507804 7414354 7320905 7227801 7136842 7048681
10355 7048681 6969010 6888730 6803487 6724795 6642769 6531872 6432923 6340492 6239506 6141332 6053328
10344 6053328 5963726 5885263 5797596 5704307 5617048 5552077 5492460 5444212 5397038 5347191 5297892
10333E297892m2992n2894m0826m6824n5865o3288n9591m9399n4645l9392k7229
10322D764947k8570j9140n1018m8683o5431n9375l4393k8568l9483l5118l8515
10311D316653l2630m3226l6513k9854k7141n1812l7702k4976k3509j7008l653
10300C988629M625J6486L332j142r434l8521m7680n2292k6253n979j5339k4286
10288C792146j8435j4951j2322N39J8967L2522L8845K4700J5097J6675J1001R443
10276C914227L0849O3133Q3288R3885R6134J39252J46539R5074M6728J6887K4890
10265D750886O3147N8635N6243P3108Q5670R6976J23949J46999J60657K23413
10255E839683K60982K76892K88785K88063K99837L78273M90318O62616Q78429
$$ plain form
10333 5297892 5254900 5202006 5161180 5114356 5058491 4995203 4935612 4886213 4831568 4792176 4764947
10322 4764947 4736377 4717237 4666219 4617536 4552105 4492730 4458337 4429769 4390286 4355168 4316653
10311 4316653 4284023 4240797 4204284 4174430 4147289 4095477 4057775 4032799 4009290 3992282 3988629
10300 3988629 3993254 4009740 4013072 4011930 4002496 3963975 3916295 3864003 3837750 3831771 3816432 3792146
10288 3792146 3773711 3758760 3746438 3746977 3765944 3798466 3837311 3862011 3877108 3893783 3904784 3914227
10276 3914227 3945076 4008209 4091497 4185382 4281516 4420768 4567307 4662381 4709109 4725996 4750886
10265 4750886 4814033 4872668 4928911 5002019 5087689 5184665 5308614 5455613 5616270 5839683
10255 5839683 6100665 6377557 6666342 6954405 7254242 7632515 8122833 8785449 9663878
10246I663878J148394J465378J805577K016272J865844J328736Q17415O41310
10238B0752804R17180J613760K532393L609500N075411P161766J0313785J5171158
10230F7147757K2726568L4060824M9479993O6838733P2613101M4663733n135586
10223C52395123m8770371p0348681o3577430m5332005k9989720j9997012j3804517
10216F0575387r875856p257423n372928l983150l036132k517142k265042k069348
10208B4198366j973217k025656k054243j944136j697313j356349j090474r40002
10200A1116976q50024p80698o91268n82782m66879l52811k77176k76389l28700
10191F510249l63253l83085l39321k94673k68229k39504k27304k04328j80587
$$ plain form
10246 9663878 10812272 12277650 14083227 16099499 17965343 19294079 20111494 20752804
10238 20752804 21669984 23283744 25816137 29425637 34501048 41662814 51976599 67147757
10230 67147757 89874325 123935149 173415142 240253875 312866976 357530709 352395123
10223 352395123 303624752 233276071 169698641 124366636 94376916 74379904 60575387
10216 60575387 50699531 43442108 38069180 34086030 31049898 28532756 26267714 24198366
10208 24198366 22225149 20199493 18145250 16201114 14503801 13147452 12056978 11116976
10200 11116976 10266952 9486254 8794986 8212204 7745325 7392514 7115338 6838949 6510249
10191 6510249 6146996 5763911 5424590 5129917 4861688 4622184 4394880 4190552 4009965
10182D009965j61013j31902j22763j33508j22440j20601j09170r0543q8287j01824
10172B827914r0484r7628q3498p1509n5722m4347l8054k3184k6758l6108l1543
10161B229079l3820k6514k9761j3685r484j6790l0132m8624j8969l108K038J8959
10149B019189L4570N0918K5913o166m1869n2427o9280n6484n3019k9492l5132
10138A786721l5510k1364l3936n236J3666J632q53r712j1119j4424J1275Q424
10126A689564l672j1540q465m408k3564k6990m4585l6100j7385L006N106K465
10114A523432J8552J5887n923k6450j9246l2396k1209j4649k6281j2306p689j2569
10102A379153o095k0639l2431k8643o383K4386L7929K6553l7244m5752l6283k2101
$$ plain form
10182 4009965 3848952 3717050 3594287 3460779 3338339 3217738 3108568 3018025 2929738 2827914
10172 2827914 2737430 2639802 2556304 2484795 2429073 2384726 2346672 2323488 2296730 2260622 2229079
10161 2229079 2195259 2168745 2138984 2125299 2115815 2099025 2068893 2020269 2001300 1998192 2000230 2019189
10149 2019189 2053759 2104677 2130590 2124424 2082555 2030128 1960848 1904364 1851345 1821853 1786721
10138 1786721 1751211 1729847 1695911 1690675 1704341 1705973 1705120 1695408 1684289 1669865 1681140 1689564
10126 1689564 1685892 1674352 1665887 1661479 1637915 1610925 1566340 1530240 1512855 1515861 1520967 1523432
10114 1523432 1541984 1557871 1551948 1525498 1506252 1473856 1452647 1437998 1411717 1399411 1391722 1379153
10102 1379153 1373058 1352419 1319988 1291345 1284962 1309348 1347277 1373830 1336586 1290834 1254551 1232450
10090A232450m4154k8255k291j4845o220K959k364r884j5104j1893o918P2r579
10077A083974j7408j8366k2775j5745Q217J0996K2237M3792N2157K5607j0454
10066A162232k5856l7682k8363k7573j7042j6802m800j027O690J3365p956q622
10054A006564M427J8245J4109j5347k3759k1887j2652j6950k1231j8850o559j1223
10042H94887j1351K3076J130n612O694L57j0412j2268k4657n638o485j0420l808
10029H35493J0164K2583N691O207j5501j7920j6171r605P546K0748j1736j7287
10017H20212j3438l0513k2919o153j0638o607j6290j601m842l025M754L45K717
10004G12002O147K423L304K817n880J5253L5786L9121M3348N1336N7524L8630
$$ plain form
10090 1232450 1188296 1160041 1157750 1142905 1136685 1139644 1137280 1127396 1112292 1100399 1093481 1093553 1083974
10077 1083974 1066566 1048200 1025425 1009680 1017897 1028893 1051130 1094922 1147079 1172686 1162232
10066 1162232 1136376 1098694 1070331 1042758 1025716 1008914 1004114 1003087 1009777 1023142 1015186 1006564
10054 1006564 1010991 1029236 1043345 1027998 1004239 982352 969700 952750 931519 912669 906110 894887
10042 894887 883536 906612 907742 902130 908824 909181 898769 886501 861844 856206 849721 839301 835493
10029 835493 845657 868240 873931 880138 864637 846717 830546 820941 828487 849235 837499 820212
10017 820212 806774 776261 753342 747189 736551 729944 713654 712053 707211 704186 708940 709285 712002
10004 712002 718149 720572 723876 726693 720813 736066 771852 810973 854321 905657 963181 1001811
9992A001811Q394l4918o9092n8324n9766n6272m1611k1795j1709j8254k1856j6700
9980E99908Q082j0908L429N072k2669r931l642o559j6617k0307j9400j7012j0618
9967D78828o141J459K4386J2543k955j349j0529j5341j5813k3023j1016n60K139
9954D32628K812J639J0016R80q554m625J756N451m935j2542j4046R50r038j5J8457
9939D20934Q010m117p336j1927q349lj0273l121n060m284J2379j070M947k454
9925C88276j7644r499j517J4466j3189l7980l8981l717J8007K8515J0128O921
9913C43786K0356R076o838M142j0122n27p752j2815j3958O116N657j0553q310
9900C18258R994R613q810j2030R051K293J620j813o273j2478j2512m115K0524
$$ plain form
9992 1001811 1010205 975287 906195 847871 788105 731833 690222 668427 656718 638464 616608 599908
9980 599908 607990 597082 600511 605583 582914 572983 569341 562782 546165 525858 506458 489446 478828
9967 478828 472687 474146 498532 511075 508120 506771 496242 480901 465088 442065 431049 430489 432628
9954 432628 435440 437079 447095 448075 439521 434896 436652 442103 437168 424626 410580 411530 402492 402477 420934
9939 420934 428944 424827 417491 405564 397215 397212 386939 383818 378758 374474 386853 385783 390730 388276
9925 388276 370632 361133 359616 374082 360893 322913 283932 280215 298222 326737 336865 343786
9913 343786 364142 373218 366380 370522 360400 359873 352121 339306 325348 331464 337121 326568 318258
9900 318258 328252 337865 329055 317025 326076 328369 329989 328176 321903 309425 296913 292798 313322
9887C13322Q736j5348k5450j3386o113J9836L363q640K92K982R776J4024M543
9874C07937k130j6568j4249r85j0067K866k748p964L0900M32k0007o573K807L632
9860B67283k944k1836k5155n400R794n143l945m578J1576O919R755k206j4050
9847B20070K701K1791K8892N249r53r643j079J082r3O232m265k8353q591P676
9833B40716L240K409m753j2606j6501J3051J9453K243p212K114N315n234o56J873
9819B43452K959R885L3780J3357O226J3641J2335J9715J9069K5721M0267O3417
9807E03824Q3303J24644J83994K47426L05968K94571J62236m1084k13045k96873
9797A354964k87843k12491j46142j15694q8030n1785n0592k6813j5950j3837j4061
$$ plain form
9887 313322 322058 306710 281260 267874 261761 281597 284960 276320 276612 279594 289370 303394 307937
9874 307937 305807 289239 274990 274005 263938 266804 264056 256092 286992 287424 267417 260844 263651 267283
9860 267283 264339 242503 217348 211948 221742 216599 212654 208076 219652 226571 236326 234120 220070
9847 220070 222771 244562 273454 278703 277750 268107 267028 268110 268017 274249 269984 241631 233040 240716
9833 240716 243956 246365 241612 229006 212505 225556 245009 247252 240040 242154 247469 242235 241579 243452
9819 243452 246411 256296 290076 303433 309659 323300 335635 355350 374419 400140 440407 503824
9807 503824 587127 711771 895765 1143191 1449159 1743730 1905966 1864882 1651837 1354964
9797 1354964 1067121 854630 708488 592794 504764 452979 402387 375574 359624 345787 331726
9786C31726k0122p958J274j6515j5239j344j988q258k959j1081k1146j2951L708
9773B17147r002Q34J3969P318j7538j1034J4972l52q771j5393J1283K1642q077
9760B16998k1662j0792k122j0990K313L247k374o24k173q281N44j728m397k266
9746A55693K1325J3249J441q392r321o777M607N646N340M857j2758j7568r898
9733A47444n115j4920o999R238J4091R772J1742J39j139N520Q943j1708j6519
9720A50489j2135q894J1423J0862K714R19m366k230O749q751k1361k0615O604
9707A11408M184J546J7367n391K93L873M884l761P286K466r731j1617P812J699
9693A32318J1787o345q871j281J4359j4208q291M542J1985P689q277Q522j4599
$$ plain form
9786 331726 311604 303646 304920 288405 273166 271822 269834 261576 258617 247536 226390 213439 217147
9773 217147 208145 208979 222948 230266 212728 201694 216666 216314 207543 192150 203433 225075 216998
9760 216998 195336 184544 182422 171432 173745 176992 174618 173994 171821 163540 164084 162356 157959 155693
9746 155693 177018 190267 191708 183316 173995 167218 171825 177471 182811 187668 174910 157342 147444
9733 147444 142329 127409 120410 129648 143739 153511 165253 165392 164253 169773 178716 167008 150489
9720 150489 138354 129460 140883 151745 154459 155378 151012 148782 155531 146780 125419 104804 111408
9707 111408 115592 117138 134505 129114 129407 133280 138164 134403 141689 144155 134424 122807 130619 132318
9693 132318 144105 137760 128889 127608 141967 127759 119468 124010 135995 143684 135407 143929 129330
9680A29330k0771j0495J4492P785K914m816l157J224R811P29R164m556j5226o155
9666A10273M554K891R314N874K802J538O65j7011J814L539l752N784N038k005
9652A31318k910m778J925J0818l474r349Q583P181k565k066Q005r8j859K667q632
9637A34766q386J0700K87k807N070j3804o63O861M774O738M331P525J143K235
9623A58770M450m18J0914n643m963O707j7034j6462j9654j1299p343j958K211
9610I8278J0263P183m075L035P012k047j131N53m884j0759M008l492J0504K4123
9596A38571J6386m253r6Q786O52k0272j4752L395n64j1222K1728K4939J401j3715
9582A50984m806R764K2626J4009l138k902j0421o733r664q903P294J6578o765
$$ plain form
9680 129330 108559 98064 112556 120341 123255 118439 115282 116506 126317 127046 136210 131654 116428 110273
9666 110273 114827 117718 127032 132906 135708 137246 137911 120900 122714 126253 122501 128285 133323 131318
9652 131318 128408 123630 125555 136373 132899 123550 132133 139314 136749 134683 142688 142590 140731 143398 134766
9637 134766 126380 137080 137367 134560 139630 125826 125163 132024 136798 143536 147867 155392 156535 158770
9623 158770 163220 162802 173716 168073 163110 169817 152783 136321 116667 105368 98025 96067 98278
9610 98278 108541 115724 111649 114684 121696 119649 118518 119071 114187 103428 107436 103944 114448 138571
9596 138571 154957 150704 150608 159394 160046 139774 125022 128417 127853 116631 138359 163298 164699 150984
9582 150984 146178 155942 178568 192577 189439 186537 176116 169383 159719 150816 158110 174688 167923
9569A67923p043j0552q346m437m10j5586q511KJ032J6931K361r651L812k204p147
9554A18174J3541P163N045Q270J4066Q93q647j2040K754J0146J0351m104K192
9541A67804k080O282J1609q836j2818j3924n10R941j1966l128q172j1109p669
9528A15424L62P954O75M002J966P469J0774j1576j1032l599J015p21J3450J3817
9514A49980l072j301o669O29q18n516j2929K64M453N616o990q746O913k057o697
9499A13060N865J7277J688j0863L997L570O760r255r714j4223L194R679q054M487
9485A17468M211r979j7844q405n97j405q319P565M422K727J80J1583n297r387
9471H6923K471j163k1Q493k679N94r057Q713k44r727j4801l49l00r583l838K0185
$$ plain form
9569 167923 160880 150328 141982 137545 137135 121549 113038 113040 114072 131003 133364 123713 127525 125321 118174
9554 118174 131715 138878 143923 152193 166259 167152 158505 146465 149219 159365 169716 165612 167804
9541 167804 165724 172006 183615 174779 161961 148037 147527 157468 145502 142374 134202 123093 115424
9528 115424 115786 123740 124415 128417 130383 137852 148626 137050 126018 122419 123434 122713 136163 149980
9514 149980 146908 145607 138938 139567 138749 133233 120304 120568 125021 130637 123647 114901 121814 119757 113060
9499 113060 118925 136202 137890 127027 131024 134594 141354 132099 122385 108162 111356 121035 112981 117468
9485 117468 121679 111700 93856 85451 84854 83449 75130 82695 87117 89844 90024 101607 96310 86923
9471 86923 89394 88231 88210 96703 94024 94618 85561 94274 94030 84303 69502 69153 68853 59270 55432 75617
9455G5617J1406j1920r675j0192l346K624P045J4557R199J184R654q803j0867
9442G6483l890m175n800m309J4992N252j2354n153K157n981n758N199K893K139
9428F1695J8824K808q826M555J281J4326K747o48O538j04p02M078K104j8295J030
9413I1411R899R544J932J668K63q470K971O055Q343q278j871Q449n431K213k103
9398A16595l10K721j1086k1566l414O812J387K3079P51j9305M812P315J16r690
9384I8217m339M295O236J8855J4708k408o641j736o443N731J2j3562j878p281
9370A03766O254J1558J2200q608o086Q573r340q319j3218M648M858P328m017o498
9356A03099j5457K475J0136J4537M393M049J1603m392K605l759J293J2759M28
$$ plain form
9455 75617 87023 75103 65428 55236 51890 54514 61559 76116 85315 86499 96153 87350 76483
9442 76483 72593 68418 62618 58309 73301 78553 66199 61046 63203 57222 51464 56663 59556 61695
9428 61695 80519 83327 74501 79056 80337 94663 97410 96762 103300 103196 102494 106572 108676 90381 91411
9413 91411 101310 110854 112786 114454 114717 106247 109218 115273 123616 115338 113467 121916 116485 118698 116595
9398 116595 116285 119006 107920 86354 82940 89752 91139 114218 114969 95664 100476 107791 107907 98217
9384 98217 93878 98173 104409 123264 137972 135564 128923 127187 120744 126475 126487 112925 111047 103766
9370 103766 110020 121578 133778 125170 119084 127657 118317 109998 96780 101428 106286 113614 109597 103099
9356 103099 87642 90117 100253 114790 119183 123232 134835 130443 133048 129289 130582 143341 143769
9343A43769k515p068j2026k41K181R719k805j6465m507M420R018p948r236K472
9329A08768k795n151j1193J3504m726m919J0891O20q835j0675P199J0342J2584
9316A15614P418K680K848m130L680R86m204P129l525j4844l867K3810R486J505
9302A44586m758o463j499k666N241n591q379p168j8058K07N110J5669Q542O13
9288A25386l885j1600j1117j429k356r49J408r422r742K475J782J5073k56m055
9274I1313j4261j800Q763O169l026J2163Q595K0566N689q612j7195j5537j5486
9261G7341l426J3898J1232o872j0042L942J3354m00l94n203k371k927n828O374
9247H8678N809l347o897J045k238R957L12o759l616N579J3030N138m30R270m988
$$ plain form
9343 143769 141254 134186 122160 121919 124100 133819 131014 114549 110042 114462 123480 115532 106296 108768
9329 108768 105973 100822 89629 103133 98407 93488 104379 104999 96164 85489 92688 103030 115614
9316 115614 123032 125712 128560 124430 128110 129096 124892 132021 128496 113652 109785 133595 143081 144586
9302 144586 139828 133365 131866 129200 134441 128850 120471 113303 95245 95452 100562 116231 124773 125386
9288 125386 121501 109901 98784 97355 94999 94050 95458 86036 76294 78769 80551 95624 95368 91313
9274 91313 77052 75252 84015 90184 87158 99321 107916 128482 134171 125559 108364 92827 77341
9261 77341 73915 87813 99045 92173 82131 86073 99427 99027 98633 93430 91059 88132 82304 88678
9247 88678 94487 91140 84243 85288 83050 93007 93319 86560 82944 88523 101553 106691 106261 115531 110543
9232A10543r643j4853l29k318n14J731L940k019j4224O646N590k631l138r128
9218F9653r818L81j0273K614P081J4410R989J2403O050M261j683j1880j3785k635
9204G6768m458L077J733L961p966j5329N331J3503L838R91o252j4394m16o067
9190E4320m945R048N743J819r413J0425o17j939k119l675L715Q257o285p093J2087
9175F9328J7504Q254J3775J485j2861j1567p223l456M969O545M597L422p24o107
9161H7941q123o307O560q653l066L23J0608K0083J0039m480m939J0722J3305J4735
9147A38748j3262q090j179n887j8249p571m155j6854o464k923J379K3642O17J386
9133H1138m52n999L186r870j272N987J6974J549n324J115J1371l320m389M767
$$ plain form
9232 110543 100900 86047 85718 83400 82886 84617 88557 86538 72314 78960 84550 81919 78781 69653
9218 69653 59835 60216 49943 52557 59638 74048 84037 96440 102490 106751 105068 93188 79403 76768
9204 76768 72310 75387 77120 81081 73115 57786 63117 76620 80458 81449 75197 60803 60387 54320
9190 54320 49375 58423 64166 65985 56572 66997 66380 64441 62322 58647 62362 70619 64334 57241 69328
9175 69328 86832 95086 108861 110346 97485 85918 78695 75239 80208 86753 91350 94772 94048 87941
9161 87941 79818 73511 80071 71418 68352 68675 79283 99366 109405 104925 99986 110708 124013 138748
9147 138748 125486 117396 116217 110330 92081 84510 80355 63501 57037 54114 55493 79135 79752 81138
9133 81138 80686 74687 77873 68003 66731 72718 89692 91241 85917 87032 98403 95083 90694 95461
9119I5461R522k562j3577R742p688n164j1598M6L189J5975R744R345Q697N156
9105A26288p515j777m638j6984m097M881K594k1151n388J4037J0235L634o152
9092I3967l662P995K86O512m81o048l848j2626k282j534K195r333K270M417j988
9077G5840R777P196J7429l805j0715K084J2991j081j6137q318L456K244j5625
9064G5336J807Q335j8004j5666R9l242M937N936P678K137j843J6245J0169l754
9050I0170r212k1480k120J0540J1389J74k877o503N23r296M115M252N774j189
9036G4260K738J0888J5747K903O356K104j3501p650J3723J000l679j9485Q702
9023I4106J1684R524L596j3428j0268L161k199q324M49O24j9327j8537l518M118
$$ plain form
9119 95461 104983 102421 88844 98586 90898 85734 74136 74182 77371 93346 103090 112435 121132 126288
9105 126288 118773 116996 112358 95374 91277 96158 98752 77601 72213 86250 96485 100119 93967
9092 93967 90305 98300 98586 105098 104617 98569 94721 82095 79813 78279 80474 71141 73411 77828 75840
9077 75840 85617 92813 110242 106437 95722 97806 110797 109716 93579 85261 88717 90961 75336
9064 75336 77143 85478 67474 51808 51907 48665 53602 59538 67216 69353 67510 83755 93924 90170
9050 90170 80958 59478 57358 67898 79287 79461 76584 70081 70604 61308 65423 69675 75449 74260
9036 74260 76998 87886 103633 106536 112892 114996 101495 93845 107568 108568 104889 85404 94106
9023 94106 105790 115314 118910 105482 95214 98375 96176 87852 88301 88925 69598 51061 47543 51661
9009E1661J046N0J2283J0309Q737M736P44Q655M551n497Q406l981R15M328o771
8994A00172k2885j5501M839n280j1323K0294N270L270o398m277l323L316R410
8981G7584M439M943J1720M855m390j673j3986p000r562P790J7317l961n412j7509
8967F5155r56J2381K00M378n728j9215O196R167M608p568M413J9645K84k6542
8953F6418k884J1658P52K952r554r119k084k316L281p74j1873J512O257q126k012
8938D4088J0435J887O630L262m210N804k836q791m659Q805Q042j743q92R032Q54
8923G5708L730k605q494Q172J207j8923p186j094o683j7120J1627N443J3114m143
8909E2753l022N118L533J4977O970j2998j3602R374l044r471P417Q654J4593J2382
$$ plain form
9009 51661 52707 52757 65040 75349 84086 88822 89566 98221 102772 97275 105681 101700 102615 106943 100172
8994 100172 77287 61786 66625 61345 50022 70316 75586 78856 72458 68181 64858 68174 77584
8981 77584 82023 86966 98686 103541 99151 97478 83492 76492 66930 74720 92037 88076 82664 65155
8967 65155 64199 76580 76780 81158 75430 56215 62411 71578 76186 68618 73031 92676 92960 66418
8953 66418 63534 75192 75944 78896 69342 60223 58139 55823 59104 58330 46457 47969 54226 46100 44088
8938 44088 54523 56410 63040 66302 62092 67896 65060 56269 51610 60415 68457 66714 65822 74854 75708
8923 75708 79438 76833 68339 76511 77718 58795 51609 50515 43832 26712 38339 43782 56896 52753
8909 52753 49731 54849 58382 73359 80329 67331 53729 63103 60059 50588 58005 66659 81252 93634
8895I3634j267j0624r147n236l730o83j1957M565Q760n233L935J8534J9689O260
8881A07500q893M588P967J7958J071j2363j961j376J6283K0227O783n674k369
8868A49741K7052J7819J5871K5963L0557M1839M1857N5719Q4534R9321J40864
8857G31137K12932L25961M91092P91355J138572J219356O20598k53798r28494
8848D348711j158274r28257o08658l91808k57284j80773j48625r8860p4436o1358
8838D40378m8831l2701l1331k6420l3452l2545l5424k6771p122m941o196j1302
8826A43342j0657r36p990r385j142N464j0217q129M298O689j148r707j6933j335
8812H2214o733j6615q657j3182Q943l058j2673N337L478k082J066J2945R155M668
$$ plain form
8895 93634 92367 81743 72596 67360 63630 62947 50990 55555 64315 59082 63017 81551 101240 107500
8881 107500 98607 103195 111162 129120 130191 117828 115867 114491 130774 151001 157784 152110 149741
8868 149741 176793 194612 210483 236446 267003 308842 350699 406418 490952 590273 731137
8857 731137 944069 1270030 1761122 2552477 3691049 4910405 5531003 5277205 4348711
8848 4348711 3190437 2262180 1653522 1261714 1004430 823657 675032 576172 501736 440378
8838 440378 391547 358846 327515 301095 267643 235098 199674 172903 165781 160840 154644 143342
8826 143342 132685 131749 123759 114374 113232 118696 108479 100350 104648 111337 110189 100482 83549 82214
8812 82214 75481 58866 50209 37027 45970 42912 30239 35576 39054 36972 38038 50983 60138 64806
8798F4806j7210K451P329j4260k6078o469l648J2801N117J0143P990J0100J0476
8785F3548j230k874M732j8997K62r924q009k662k68k240O459m942j4702j6699
8771g546r08R797J0789J0002m956J922J2817R05K236M503Q419K100k200Q927J413
8756E8220r260j0417o768M558J5105n02p061P84j829j0880K768L954j1158q289
8742A9225L573Q900J171O441N543L114j209j655P47M498L15q884j2842N103J0307
8727D4347m439q739L93n857k099J4820P954J2771M988l98j36l918p608L486R733
8712F5298J2691J3489L254j2702K419l484n011K175N904J315j177j2958m023K548
8698F9738j05N902J85K327N595J3518n84j7297k3279J3843J3001M12N146Q315
$$ plain form
8798 64806 47596 50047 57376 43116 17038 10569 6921 19722 24839 34982 42972 53072 63548
8785 63548 62318 59444 64176 45179 45441 35517 27508 24846 24578 22338 28797 23855 9153 -7546
8771 -7546 -8454 1343 12132 22134 17178 19100 31917 32822 35058 39561 47980 50080 47880 56807 58220
8756 58220 48960 38543 31775 36333 51438 50936 43875 44659 42830 31950 34718 38672 27514 19225
8742 19225 22798 31698 32869 39310 44853 47967 46758 45103 45850 50348 50663 41779 28937 34040 44347
8727 44347 39908 31169 31562 25705 23606 38426 46380 59151 64139 63741 63605 59687 52079 55565 65298
8712 65298 77989 91478 94732 82030 84449 80965 75954 78129 84033 85348 84171 71213 67190 69738
8698 69738 69633 75535 75720 78047 83642 97160 96576 79279 56000 69843 82844 83256 88402 96717
8684I6717J4623M177M322J4688q330k444O762k465j1815J9291R536q967o080J589
8670A31604J696J438p862M605O879m241m977O228J500R454j0163j0161L835J1359
8656A41194M241o487J006J105m328M041N774P773o343r480J6042R538m59J5886
8642A79503J0335J7598J3312J1447J1758J1776m35l226l985L024K532j218o386
8629B46035j9462n185K574k465J0497J2164m861J5583K1364J6427J3352J4518
8617C20541M10P865K1262K9511K6467K1963M5702L5560J8692L3950L4102K2174
8605F18199K6677M674P868J2200J8373J0507N842P182r495j2651m70Q91r199j4043
8591F66555R49k031o348L700J0650N358J898N784n679l3858m5378m1333l6009
$$ plain form
8684 96717 111340 115517 119839 134527 126197 123753 130515 128050 116235 135526 145062 136095 130015 131604
8670 131604 133300 134738 126876 131481 138360 134119 129142 135370 136870 146324 136161 126000 129835 141194
8656 141194 145435 138948 139954 141059 136731 140772 146546 154319 147976 138496 154538 164076 163617 179503
8642 179503 189838 207436 220748 232195 243953 255729 255294 252068 248083 251107 253639 252421 246035
8629 246035 226573 221388 223962 221497 231994 244158 239297 254880 276244 292671 306023 320541
8617 320541 320951 328816 350078 379589 406056 428019 473721 509281 527973 561923 596025 618199
8605 618199 644876 649550 657418 669618 687991 698498 704340 711522 702027 689376 688906 689797 680598 666555
8591 666555 667504 665473 659125 662825 673475 678833 680731 686515 680836 646978 601600 560267 524258
8578E24258k1069l0121l4926m0069m3268k7089k8927l0706k4882k7876o948l683
8566B04694j767j5148j1501j5214l250J3139N64k1043n937K2373J3286n135k2458
8553A52603j1694k616O737r810j4401J237O49o055j2468n448j6192k8839r119
8540D4584O085P704J8226J7165M854j0189j0467o386J530M199o484R72m397O420
8526G3816p452Q832L579m315j5770o328M35J618r952K905K0860J0706j5151p667
8512E6116K185j1162o327L875l013P632k200j2519p065Q407J2109o15m377j9604
8498B3442J520R574Q369J1314J0997r262q474O725J6762P072n382l237n428j2403
8484E1589r229j2663k840J2691j0752j0921l44P818J7059J4183j3187n275k295
$$ plain form
8578 524258 503189 473068 438142 398073 354805 327716 298789 268083 243201 215325 208377 204694
8566 204694 202927 187779 176278 161064 157814 170953 171517 150474 144537 166910 180196 175061 152603
8553 152603 140909 138293 145030 135220 120819 122056 122705 116650 104182 98734 82542 53703 44584
8540 44584 50669 58373 76599 93764 98618 88429 77962 71576 73106 77305 70821 71793 67396 73816
8526 73816 66364 75196 78775 74460 58690 52362 52797 54415 44463 47368 68228 78934 63783 56116
8512 56116 58301 47139 40812 44687 41674 49306 47106 34587 27522 35929 48038 47423 43046 23442
8498 23442 24962 34536 42905 54219 65216 55954 47480 54205 70967 78039 72657 69420 63992 51589
8484 51589 42360 29697 26857 39548 28796 17875 17531 25349 42408 56591 43404 38129 35834
8471C5834m296q571j251o051J6170O00N303o101j2475r06O447J0931l593o421
8457B5620P493O790n517K769o938m443J8901K916K631J976N50r520P485L084k198
8442E1599m14o43r879j9222J0735P597r951j227J1293q186q066j3974Q062Q614
8428B6338J0192K623o147j2509O300O478q254l624K062O614M437N6k007j916Q427
8413C9070N716o789M503j2185q78n672K675p027j6499p517L617p248P520K1431
8399B0717L570O61j323o349J2362J976j1610O52Q383q18n868M100j674j4821j3535
8384c577l704J157l543J2156O150P521Q415K862J587L578n110M189p565j318N436
8369B8234O03K425j759M20J93K167o103q193r508p19R555J0249J2470M089Q124
$$ plain form
8471 35834 31538 22967 21716 15665 31835 32435 37738 31637 19162 18256 24703 35634 32041 25620
8457 25620 33113 39903 34386 37155 30217 25774 44675 47591 50222 52198 52748 43228 50713 53797 51599
8442 51599 51185 50542 40663 21441 32176 39773 29822 28595 39888 31702 23636 9662 17724 26338
8428 26338 36530 39153 33006 20497 26797 33275 25021 21397 23459 30073 34510 34566 32559 30643 39070
8413 39070 44786 37997 42500 30315 29437 23765 26440 19413 2914 -4603 -986 -8234 -714 20717
8399 20717 24287 24948 23625 17276 29638 31614 20004 20656 29039 28221 22353 26453 24779 9958 -3577
8384 -3577 -7281 -6124 -9667 2489 8639 16160 24575 27437 29024 32602 27492 31681 24116 22798 28234
8369 28234 28837 31262 29503 29923 30116 32283 26180 17987 8479 7760 17315 27564 40034 44123 52247
8354E2247M735q104j8328j6975Q204J6301L621j0228K056O351n505o126p755J061
8340B1555P035j9546m270R573l276n975L362J0265O006j6943O411M889k45L744
8326B2585L710Q691n868J0546J0961O074p771k069J5716J448q296l948R038L570
8312F4387p489j287l59j0626K497N934M241J5951J2984j6262k4164L094Q011J7390
8298G4302J0179j9069r116N511L327j4078O61J0524N642l73J2720J0392K0727
8285A11349K965J7948J87k4754j3244J91p136j2356k066o638j0055J557J0580
8272F8528N509J25j4355m786P189O1r163O854K224j0005o541K777m071o549j223
8257C6574L882O401o728m039j688o771l901P640J0531J2020J2942R502j7566n738
$$ plain form
8354 52247 56982 48878 30550 13575 21779 38080 41701 31473 33529 39880 34375 28249 20494 21555
8340 21555 28590 9044 4774 14347 11071 5096 8458 18723 24729 7786 14197 19086 18841 22585
8326 22585 26295 34986 29118 39664 50625 56699 48928 46859 62575 64023 55727 51779 60817 64387
8312 64387 56898 55611 55252 44626 47123 53057 57298 73249 86233 69971 45807 48901 56912 74302
8298 74302 84481 65412 56296 61807 65134 51056 51717 62241 67883 67510 80230 90622 111349
8285 111349 114314 132262 132449 107695 94451 94642 87506 75150 73084 66446 56391 57948 68528
8272 68528 74037 74162 59807 55021 62210 62271 53108 59962 62186 52181 45640 48417 44346 37797 36574
8257 36574 40456 46857 40129 36090 34402 27631 23730 31370 41901 53921 66863 76365 58799 53061
8243E3061j49p293J011J3724J0417j2620j740m055m008J6084N646j5313k6152
8230B8613J412N934j468J3972P129M317n202j270J0813L482q600m761P521M359
8216F6251K648j55N327j2720p821P032j9707n777R154Q803j780j3591N493l652
8202C9505j7559k805M149J0003J1900M938n486l455n202m42l451L579l190P879
8188D0363j261j5315o031n80j946J270O655Q564J172j1258j241q9R027j049k817
8173B5464L187j7477j5097R251J8801k189M910j323N386R35j2626l969P488K9553
8159E2294J2698m994p0j4353K112L377Q040J6888P366K5092O7721Q8211J39064
8146D03446K17321J75908Q981j22775j85308j58628j00172o7913k3837j5283j8574
$$ plain form
8243 53061 52912 45619 46630 60354 70771 58151 56411 52356 48348 64432 70078 54765 28613
8230 28613 30025 35959 34491 48463 55592 59909 54707 53437 64250 67732 59132 54371 61892 66251
8216 66251 68899 68744 74071 61351 53530 60562 40855 35078 44232 53035 51255 37664 43157 39505
8202 39505 21946 19141 23290 33293 45193 50131 44645 41190 35988 35546 32095 35674 32484 40363
8188 40363 39102 23787 17756 17176 15230 16500 23155 31719 32891 21633 20392 20303 29330 28281 25464
8173 25464 28651 11174 -3923 5328 24129 21940 26850 25527 30913 31848 19222 15253 22741 52294
8159 52294 64992 59998 59928 45575 47687 51064 59104 75992 83358 108450 176171 264382 403446
8146 403446 620767 796675 805656 682881 497573 338945 238773 170860 147023 131740 113166
8135A13166j2283l431j9552r875j1092o431j200K533p543k890j369M693J351O334
8121E2411J672N456j922m517o166j3689O261J2840J5663Q925O235K7583K7552
8108A38304M7328P9793J38866J72101J37553K3824q9011j57280j50019j02154
8098B39305p2832m4293k3181j8622j3882j7417l402Q41J0192l011K921r248M050
8085E1421j1602q866j88K307K274N328J0952O222j8597j7055J012Q634m897p946
8071A8999O507K102k462r659m264q01L668L267J0365O804J1413R219L846m37Q791
8056F7358m906L100R632Q752k006K890K0209o092j2849p95J6039K992m706K303
8042A01921K187J3097L1556K7836K6433K9726J0141K037N000L273N090L549q912
$$ plain form
8135 113166 100883 97452 77900 68025 56933 50502 49302 51835 44292 41402 40033 44726 46077 52411
8121 52411 54083 59539 57617 53100 46934 33245 39506 52346 68009 76934 83169 110752 138304
8108 138304 185632 265425 404291 576392 713945 737769 648758 491478 341459 239305
8098 239305 166473 122180 98999 80377 66495 49078 45676 46517 56709 53698 56619 47371 51421
8085 51421 39819 30953 30765 33072 35346 40674 51626 57848 39251 22196 23208 31842 26945 18999
8071 18999 25506 27608 25146 15487 11223 10422 14090 17357 27722 34526 45939 55158 59004 58567 67358
8056 67358 62452 65552 75184 83936 81930 84820 105029 98937 86088 85293 101332 104324 99618 101921
8042 101921 104108 117205 148761 176597 203030 232756 242897 244934 249934 253207 258297 261846 252934
8029B52934k24p370j2565o797n45J0418K583o640j4086j1756O641J3439j279m271
8015B20482k144j010k044J1925J1925p701p659J0303J6106K3310J7230J3411J0855
8002C14989J8477n263J2044K5160M0323N6512Q2400J27327J32699P1549j6391
7991H59826q0503j08242r1911p3688o3002n4616l8136j7655p226M100o29m159
7979C24159j0893k6740k2557j2098k1171l4591j2126j150Q313m218J645j0153
7967A78420j9287M602J3744J8462L4341L4556K0714k503j7459k3369j5557J7652
7955B44316K885J7912N6561L6004K1984K5072K0770J393j5404j8345k8584l3139
7943C31425l3439l1105j1056O597m474k6792l2176j6818k2855k3205j1129r231
$$ plain form
8029 252934 252710 245340 232775 225978 225433 235851 238434 231794 217708 205952 212593 226032 224753 220482
8015 220482 218338 217328 215284 227209 239134 231433 223774 234077 250183 273493 290723 304134 314989
8002 314989 333466 328203 340247 365407 405730 462242 544642 671969 804668 876217 859826
7991 859826 779323 671081 579170 505482 442480 387864 349728 332073 324847 328947 328318 324159
7979 324159 313266 286526 263969 251871 230700 196109 183983 182833 191146 186928 188573 178420
7967 178420 159133 163735 177479 195941 230282 264838 285552 283049 265590 242221 226664 244316
7955 244316 247201 265113 321674 357678 379662 404734 425504 426897 411493 393148 364564 331425
7943 331425 297986 266881 255825 262422 257948 231156 198980 182162 159307 136102 124973 115742
7931A15742j4338r395K044Q702j2621p338r560l504M025J287O913J3127J4083
7918A09167J246j7997q928M796j1572o29J2380L986l825J4699M180R282J98q54
7904A16129j7870j2107j9045L329m873j8891M204m668n837m62k911k0569m674
7891A1755n272Q997j935P005M522n183k998k393j00o162j4201l201L104Q837m913
7876b138p204r008J3821J6440j1681r594J2492k100J1753M506n804k501J4690
7863B3672M026r148j960P589J04j3970q977k2509Q822j673k041M275J4570j380
7849A400J156p745n690O045r733p09j1496r004L091J0324Q200Q419J8402Q388
7835B1048K926j4417j0519L758j604r701m328K732j991R32K884n307j526Q860
$$ plain form
7931 115742 101404 92009 94053 102755 90134 82796 73236 69732 73757 75044 81957 95084 109167
7918 109167 110413 92416 83488 88284 76712 76083 88463 92449 88624 103323 107503 116785 116983 116129
7904 116129 98259 86152 67107 70436 65563 46672 50876 46208 40371 39909 36998 16429 11755
7891 11755 6483 15480 13545 20550 25072 19889 16891 14498 14398 8236 -5965 -9166 -6062 2775 -2138
7876 -2138 -9342 -18350 -4529 11911 230 -9364 3128 1028 12781 17287 11483 8982 23672
7863 23672 27698 18550 16590 24179 24283 10313 1336 -21173 -12351 -14024 -16065 -11790 2780 1400
7849 1400 2556 -5189 -10879 -4834 -14567 -15276 -26772 -35776 -32685 -22361 -14161 -5742 12660 21048
7835 21048 23974 9557 -962 2796 1192 -8509 -12837 -10105 -12096 -11164 -8280 -13587 -15113 -6253
7821f253r432m109P190J3303J2138j4849j7735L256O303K221q15p355m258p128
7807b7523J430O814Q58k546R596P365o13k788R74M034j0698M939J7448j0696r179
7792a0585N296j054l649J798K946M213j4037j3342M263m128M568o531m871m563
7778c9676J7895J3624n698M910j1841j165J6665k941o320p385M996K94M168J1793
7764f81J3868j3320j4371j5516K653R641R915R015j0747L136L55k594J568J2146
7750E068j1881j2482j650J0534N065j0906J0048R012J0544j091k105j1652j0927
7737a2423r890Q926m19j734O922J4261m837q502j5349j2186r139J6264K0278l86
7723h214N482p463j5084q45P024l022k976J2723Q19J481K249R613J3122j6817
$$ plain form
7821 -6253 -15685 -19794 -12604 699 12837 -2012 -19747 -16491 -10188 -7967 -8782 -16137 -20395 -27523
7807 -27523 -26093 -19279 -18421 -20967 -11371 -4006 -4619 -7407 -6433 -2399 -13097 -8158 9290 -1406 -10585
7792 -10585 -5289 -6343 -9992 -8194 -5248 -1035 -15072 -28414 -24151 -28279 -23711 -30242 -35113 -39676
7778 -39676 -21781 -8157 -13855 -8945 -20786 -21951 -5286 -8227 -14547 -21932 -16936 -16642 -12474 -681
7764 -681 13187 -133 -14504 -30020 -27367 -17726 -7811 1204 -9543 -6407 -6052 -8646 -7078 5068
7750 5068 -6813 -19295 -20945 -10411 -5346 -16252 -6204 2808 13352 12261 10156 -1496 -12423
7737 -12423 -22313 -13387 -13806 -15540 -8618 5643 806 -7696 -23045 -35231 -44370 -28106 -7828 -8214
7723 -8214 -2732 -10195 -25279 -26124 -19100 -22122 -25098 -12375 -11556 -10075 -7826 1787 14909 -1908
7709a908j8488j569N222j6184m260L106J0129J0402m814o268n753M753R727J5877
7695b8o71l438Q121N093j3000j4662p013k204q711O222J7498J214j3796J2363
7681a3012J4439p411J122j317M974J7423J032p35j2253m720R78M390j4858J94
7667i754N991M274k709j3595p323R881O891L956j588o856l550J3559P487N64J216
7652H444q15q501l554L635K105j656j0831k503K036q731m754N968k713J1580K044
7637h246K32p833j941L272q75J417P956L026N716M005m857M731j5739j5267N984
7622a8419Q584j2611j4529R810M459K0275p812o879m017J660P613J3308M341o859
7608a076j3451J768L257J3058k674o845j0251j71O997J1670j365j5656J860K719
$$ plain form
7709 -1908 -20396 -21965 -16743 -32927 -37187 -34081 -23952 -13550 -18364 -24632 -30385 -25632 -15905 -28
7695 -28 -699 -4137 3984 9077 -3923 -18585 -25598 -27802 -36513 -30291 -12793 -11579 -25375 -13012
7681 -13012 1427 -5984 -4862 -6179 -1205 16218 17250 16515 4262 -458 520 4910 -9948 -9754
7667 -9754 -3763 511 -2198 -15793 -23116 -13235 -6344 -2388 -3976 -10832 -14382 -823 6664 7228 8444
7652 8444 7629 -872 -4426 -791 1314 -342 -11173 -13676 -11640 -20371 -25125 -19157 -21870 -10290 -8246
7637 -8246 -8014 -15847 -17788 -14516 -15391 -13974 -6018 -2992 2724 6729 1872 6603 -9136 -24403 -18419
7622 -18419 -9835 -22446 -36975 -27165 -22706 -2431 -10243 -17122 -21139 -19479 -11866 1442 5783 -1076
7608 -1076 -14527 -12759 -9502 3556 882 -5963 -16214 -16385 -9388 2282 917 -14739 -12879 -10160
7594a0160m472r634j0107J481O737j512J1105J051K623o332o121j2069m70J6479
7580b1401P44k955L527M300M708j015j214P816p805p377Q939J687q2J4262l379
7565G55j0909O075O480J3380j5025j6199p749j571Q034J3962m315m313K404J083
7551g908q730N481j0039k259M285l482Q579L151l090j865q242j6436j398J7020
7537b4933L438j4683J0208K0564q044l836j610P268m36o030o946J429r29L205
7523b1335k781n12J5428N380k35j3191k88J2864L685j306L092J556R16j41O616
7508I748J484N37J0l893j6216j1898J1598N810J3314J466j0864q978p688p827
7494b3397j061O073j937j0124Q433N743p324N239l447L194J5154J291k0311j9522
$$ plain form
7594 -10160 -14632 -24266 -34373 -32892 -26155 -27667 -16562 -15511 -12888 -19220 -25341 -37410 -37880 -21401
7580 -21401 -20657 -23612 -20085 -15785 -11077 -12092 -13306 -5490 -13295 -20672 -11733 -10046 -10128 4134 755
7565 755 -10154 -4079 2401 15781 756 -15443 -23192 -24763 -16729 -2767 -7082 -11395 -8991 -7908
7551 -7908 -16638 -11157 -21196 -23455 -19170 -22652 -14073 -10922 -14012 -15877 -24119 -40555 -41953 -24933
7537 -24933 -21495 -36178 -25970 -5406 -13450 -17286 -18896 -11628 -12064 -18094 -25040 -23611 -24540 -21335
7523 -21335 -24116 -24628 -9200 -3820 -4055 -17246 -17534 -4670 -985 -2291 801 2357 3273 3132 9748
7508 9748 11232 11769 11779 7886 -8330 -20228 -8630 -2820 10494 11960 1096 -7882 -15570 -23397
7494 -23397 -24458 -18385 -20322 -30446 -22013 -16270 -23594 -18355 -21802 -18608 -3454 -2163 -22474 -41996
7480d1996n753J3858J2434o724j6606N627N039L855K697N435N231M944J7068J572
7466F681J067q740j16m58r612J654J1559l712o834o382q442O344o364J0630k58
7451a2983q395K824J3600L712j0348j9492O094J6857k112j3567P129O426j589
7438a1844K603k640q670N782k302n693O065r22N455Q638j3834n142m232k317J1989
7423a7064J0849Q131j7556P81J3148M408r038l791m318J185J320j1291O497j015
7409a7754n909j101P579p093k428j2966O076J6120J803K800j0929o317m180J4783
7395a9516J6953j1274O359O405J023j4743P34j19L559p902o727M280K060J5233
7381c675J1777j2211k795O448K90r718L024N501J34r781J311n786r982J124j030
$$ plain form
7480 -41996 -47749 -33891 -21457 -28181 -44787 -39160 -34121 -30266 -27569 -22134 -16903 -11959 5109 6681
7466 6681 7748 -992 -1108 -1566 -11178 -9524 2035 -1677 -8511 -14893 -23335 -16991 -23355 -12725 -12983
7451 -12983 -21378 -18554 -4954 -1242 -11590 -31082 -24988 -8131 -10243 -23810 -16681 -10255 -11844
7438 -11844 -9241 -11881 -20551 -14769 -17071 -22764 -16699 -17621 -12166 -3528 -17362 -22504 -26736 -29053 -17064
7423 -17064 -6215 1916 -15640 -14859 -1711 2697 -6341 -10132 -14450 -13265 -11945 -23236 -16739 -17754
7409 -17754 -23663 -24764 -17185 -24278 -26706 -39672 -33596 -17476 -15673 -12873 -23802 -30119 -34299 -19516
7395 -19516 -2563 -13837 -7478 -1073 -50 -14793 -14059 -14178 -10619 -18521 -25248 -20968 -18908 -3675
7381 -3675 8102 -4109 -6904 -456 -166 -9884 -6860 -1359 -1225 -11006 -9695 -15481 -25463 -24339 -25369
7366b5369J6581J4444r00k664q87n876l123j132J9296N750q794l836k3983N00
7352a9993J4242J2678j6204j2533J265K638n566R923J5953J08j037j0597J6744
7339G621J5907k3285j7741J5000R442J453l756j32n217n33j1923k99L722O879
7325b862j4957j7874o194m158J4328k109O968R177J2330n911p332K789K295L652
7311i858M212N618J256m839r569J718m284K219k459k886O907N671O22q183n147
7296a9002L453n564M341P481J0136k502o519o906o574n047J1120l792R791j611
7282a1195R03N314O733q670o609n458j7979k327O585L229J8264J2783j469P10
7268H14j6354K697J5148J128o478N655O902k405m708p388j3558k706j4385n298
$$ plain form
7366 -25369 -8788 5656 4756 2092 1205 -4671 -7794 -8926 10370 16120 7326 3490 -20493 -19993
7352 -19993 -5751 6927 -9277 -21810 -20545 -17907 -23473 -13550 2403 2511 1474 -9123 7621
7339 7621 23528 243 -17498 -2498 6944 8397 4641 4509 -708 -1241 -13164 -13463 -9741 -2862
7325 -2862 -17819 -35693 -41887 -46045 -31717 -33826 -26858 -17681 -5351 -11262 -18594 -15805 -13510 -9858
7311 -9858 -5646 -28 1228 -3611 -13180 -11462 -15746 -13527 -15986 -18872 -11965 -6294 -5672 -13855 -19002
7296 -19002 -15549 -21113 -16772 -9291 845 -1657 -8176 -15082 -21656 -26703 -15583 -19375 -9584 -11195
7282 -11195 -10292 -4978 1755 -6915 -13524 -18982 -36961 -39288 -32703 -29474 -11210 1573 104 814
7268 814 -15540 -12843 2305 3433 -3045 2610 9512 7107 2399 -4989 -18547 -21253 -35638 -40936
7254d0936P029J9794p5L204Q150J5002M78j4527p919J0566J0168m160R642k94
7240A6122p715j4041j1356O734O190N923j6899m976O781J9039N170j1256r577
7227i861j0213K785O919l357k121R507n023o498P941P789j0438k876N842M243
7213e361O316l451j7686j0259N894M442N891J3335r716o160P470j883l795O836
7199h127K870M407L965j166n800l323n238j368J3363P843k160p074m391L645J4792
7184A2238r110K596j207N241j1511j3994j6874n0K8543J4354K920j0589o893n024
7170i360Q175j435q022P67l847Q870K648n155O381j3270J704J8100j5702m497
7156a4643M180r456p57J518J5532J0890j1308o969N62q08O435n286m636l889K641
$$ plain form
7254 -40936 -33907 -14113 -14188 -10984 -2834 12168 12646 -1881 -9800 766 10934 6774 16416 16122
7240 16122 8407 -5634 -16990 -10256 -4066 1857 -15042 -20018 -13237 5802 10972 -284 -9861
7227 -9861 -20074 -17289 -10370 -13727 -15848 -6341 -11364 -17862 -9921 -2132 -12570 -15446 -9604 -5361
7213 -5361 955 -2496 -20182 -30441 -24547 -20105 -14214 -879 -10595 -16755 -9285 -11168 -14963 -8127
7199 -8127 -5257 -850 3115 1949 -3851 -7174 -12412 -13780 -417 7426 5266 -1808 -6199 -2554 12238
7184 12238 3128 5724 4517 9758 -1753 -15747 -32621 -32671 -4128 10226 13146 2557 -4336 -9360
7170 -9360 -1185 -2620 -10642 -9875 -13722 -4852 -2204 -7359 -978 -14248 -12544 5556 -10146 -14643
7156 -14643 -10463 -19919 -20676 -19158 -3626 7264 -4044 -11013 -10451 -11259 -4824 -10110 -14746 -18635 -15994
7141a5994l893r636P89J1753J1058n139P802r482p39l82Q138R306K006k231l379
7126b3p734p150j2650J271J1333k652j1898j0125R797N876l677l02p86N006J7075
7111f639p964Q916J3452O19K165L502j313l381n812j552L872j5219j7974Q88R047
7096a7393J8541N449k939r492p329K807M898n541j3143N417R889K308Q08j1672
7082a7392m455J6577R883n024k718n624L96k244j032L168K816j0582J3477R410
7068F656j1696k227j0479N978Q772q041n453n293k968R611Q286r177L119J0914
7054a998M508o110j784P899r964j4101p563k549L153j2885j810J4333k014K3206
7040g679N847L186M970n326j7373n696O660j4486m488K590j708j570R296O407
$$ plain form
7141 -15994 -19887 -29523 -28734 -16981 -5923 -11062 -3260 -12742 -13481 -13863 -5725 3581 5587 3356 -23
7126 -23 -7757 -14907 -27557 -26286 -14953 -17605 -29503 -39628 -29831 -23955 -27632 -27934 -28720 -23714 -6639
7111 -6639 -14603 -5687 7765 8384 10549 14051 12738 9357 3545 1993 5865 -9354 -27328 -26440 -17393
7096 -17393 1148 6597 3658 -5834 -13163 -10356 -5458 -10999 -24142 -18725 -8836 -6528 -5720 -17392
7082 -17392 -21847 -5270 4613 -411 -3129 -8753 -8357 -10601 -11633 -8465 -5649 -16231 -2754 6656
7068 6656 -5040 -7267 -17746 -11768 -2996 -11037 -16490 -21783 -24751 -15140 -6854 -16031 -12912 -1998
7054 -1998 2510 -3600 -5384 2515 -7449 -21550 -29113 -31662 -28509 -41394 -43204 -28871 -30885 -7679
7040 -7679 -1832 1354 6324 998 -16375 -22071 -15411 -29897 -34385 -31795 -33503 -35073 -25777 -19370
7026a9370n12r72Q821J3554l272j8345K695J9916N123j1579j4197j3192J6954
7013a4376k155n161O556K719j4405j649R388J4563J2349j476j2800r321P385m743
6999a3126Q337m149j1350n198J9383L0262l249j7146r812j2622j3155J279Q426
6986b2120n148Q103J3126R210J3375L771m150p830j629k409n934j4002j262P950
6972h949j702m119O912M482m246O361N798p100r322p521j0505q84n747J1732K0494
6957d316R43n021J0446P260r054m875j5645L578O4J172n1k976l228m879L224k939
6941b6297p956j3277Q557K743N635P279J1768J1365k050j422J3243k494j0129
6928c035j9932j3834J9430L719o683k938j1993j2208K0002M666L910K503n722
$$ plain form
7026 -19370 -19882 -20854 -12033 1521 -1751 -20096 -17401 2515 7638 -3941 -18138 -31330 -14376
7013 -14376 -16531 -21692 -15136 -12417 -26822 -28471 -19083 -4520 7829 6353 -6447 -15768 -8383 -13126
6999 -13126 -4789 -8938 -20288 -25486 -6103 24159 20910 3764 -6048 -18670 -31825 -30546 -22120
6986 -22120 -27268 -19165 -6039 3171 16546 20317 16167 8337 6708 4299 -1635 -15637 -16899 -8949
6972 -8949 -10651 -14770 -7858 -3376 -7622 -1261 4537 -2563 -11885 -19406 -29911 -30795 -36542 -24810 -4316
6957 -4316 -3373 -8394 2052 9312 258 -4617 -20262 -16684 -16620 -15448 -15499 -18475 -21703 -26582 -23358 -26297
6941 -26297 -34253 -47530 -38973 -36230 -30595 -23316 -11548 -183 -2233 -3655 9588 7094 -3035
6928 -3035 -22967 -36801 -17371 -13652 -20335 -23273 -35266 -47474 -27472 -22806 -18896 -16393 -22115
6915b2115n396J1663J4710M014L871q69k0969j4957J3112J872J445n173L167o429
6901b2054m340N156K308N098j464j1376J4912J2502k441M873j4014j6698L013
6888b4525J2422R534j182P967L800m712j8722k1361l890J1686J1626L464J1715
6875b178J5991n247j7832l231J0095Jq678p958L880J0092J1012L054j1203K110
6861i2K710n802j1073J24J8189J262k276K595N495k151l563J2049l049q389n051
6846I78j6264L418Q039Q80J0799N551l840j2034M688P794q487j4936k464J1789
6832d089m015r376K958j5986O529J2256O6R62O497m972j566o244L993Q892J5490
6817A1395j3072o609m660J3935k541J97k42k3125o535N945M061j2211l146J8192
$$ plain form
6915 -22115 -27511 -15848 -1138 2876 6747 5878 -15091 -30048 -16936 -15064 -13619 -18792 -15625 -22054
6901 -22054 -26394 -21238 -18930 -13832 -15296 -26672 -11760 742 -1699 3174 -10840 -27538 -24525
6888 -24525 -12103 -2569 -3751 4216 8016 3304 -15418 -36779 -40669 -28983 -17357 -13893 -2178
6875 -2178 13813 8566 -9266 -12497 -2402 -2401 -11079 -19037 -15157 -5065 5947 9001 -2202 -92
6861 -92 2618 -3184 -14257 -14133 4056 5318 3042 5637 11132 8981 5418 17467 14418 6029 978
6846 978 -15286 -11868 -3829 -2949 7850 13401 9561 -2473 2215 10009 1522 -13414 -15878 -4089
6832 -4089 -8104 -17480 -14522 -30508 -23979 -11723 -11657 -10695 -4198 -9170 -10736 -16980 -12987 -4095 11395
6817 11395 -1677 -8286 -12946 989 -1552 -1355 -1597 -24722 -31257 -25312 -21251 -33462 -36608 -18416
6803a8416J3083J0509k418o085L205n863n644J2907m15M104J023o72o066J830
6789A082L73L560O528m683n431j7553j6975Q271Q220p083J0068L767J238J2208
6775C590K2891j3240j8870L530L750J1030P084l335n556j1646N673J6630P317
6762B8848l964j6718l617j3910q638J7365O998j34J0054L937k5584j2534k190
6749b0087P530K1701R527J333k761q924j0155j0704m228q40J7783J4511m547P870
6735A8009P378O894j6182o702O970L444J281p98O101m936p302p236N028J9255
6721C1204J1163J1164J4962J6697j553l73K2164M9537O0799Q4270R8262Q2618
6709D80914l598q0796j02080r5420n9574m1083m2272j8642j0523l692k182j0212
$$ plain form
6803 -18416 -5333 5176 2758 -3327 -122 -5985 -11629 1278 863 4967 5990 5318 -748 1082
6789 1082 1455 5015 11543 6860 1429 -16124 -33099 -24828 -16608 -23691 -13623 -9856 -8618 3590
6775 3590 26481 13241 -5629 -2099 1651 12681 19765 16430 10874 -772 4901 21531 28848
6762 28848 24884 8166 4549 -9361 -17999 -634 6364 6230 16284 20221 -5363 -17897 -20087
6749 -20087 -12557 9144 18671 20004 17243 8319 -1836 -12540 -16768 -17608 175 14686 10139 18009
6735 18009 25387 32281 16099 9397 16367 19811 21092 20294 26395 21459 14157 6921 11949 31204
6721 31204 42367 53531 68493 85190 83637 83264 105428 154965 215764 300034 398296 480914
6709 480914 477316 396520 294440 199020 139446 98363 56091 37449 26926 23234 21052 10840
6697A0840N734J0722m737l963J151J583j6742k356J0545j236O389P33q599k983
6683G081j304j1616j035R582K924r45L910j946J7588K6147n173J524p438k2271
6669A7028o869P82j5316q922J6972P522l209L358n797j3420N808J6319J710j937
6655A4029L655r942k0810k189K555J1380n520j1642L125O858l96k948N010M217
6641b618J0051J376j3260o993K2207l390P370j0411o476J97J5457Q690n589j1398
6627E213q560o132L096o604j2472K244M979P225n636M167O714K968L768k694q024
6612i748M483J2741J1499q918J112L034N060j553r265n412j0621O487J3546K347
6598A4792M666j0376J00r23J899m756j566M649j0235n623O3j1777j2825P680R864
$$ plain form
6697 10840 16574 27296 22559 18596 19747 21330 4588 2232 12777 11541 17930 18663 10064 7081
6683 7081 5777 -5839 -6874 2708 5632 4687 8597 6651 24239 50386 45213 46737 39299 17028
6669 17028 10159 10941 -4375 -13297 3675 11197 7988 11346 5549 -7871 -2063 14256 15966 14029
6655 14029 17684 7742 -13068 -15257 -12702 -1322 -6842 -18484 -15359 -8501 -8897 -11845 -6835 -2618
6641 -2618 7433 8809 -4451 -11444 10763 7373 14743 4332 -2144 -1947 13510 22200 16611 5213
6627 5213 -3347 -9479 -6383 -12987 -25459 -23215 -18236 -11011 -16647 -12480 -5766 -2798 970 -1724 -9748
6612 -9748 -5265 7476 18975 10057 11169 14203 19263 17710 8445 3033 -7588 -1101 12445 14792
6598 14792 19458 9082 9182 8259 10158 5402 3836 8485 -1750 -7373 -7310 -19087 -31912 -24232 -14368
6583a4368P977l084j0350r65j91K717j590N435J4918k81j2125K656j1626J542
6569a9335Q185J1987j42J1181K728R716r536j361j0719k816O343M664n001p641
6555a747o529M317P568p91j0468J783K403K146m788k771K761J2299K066L163J522
6540A2934j060j3424o576k018m391m599J0835L087R814q479M609L331p332o296
6526i565M36O211J8555J3770p89j7200j0483n837j2064j3892M640N951n004K290
6512b2981M811l365R853M558R798J94o117m109j6230n183n73Q386P248O299M613
6497b798k426n274n257R186J2113j0525m008o99L759r819j241M459p06J0575L322
6482F61j537N298q266l888L416m311J0859M354l102r153K785P369k948O563r131
$$ plain form
6583 -14368 -6391 -9475 -19825 -20790 -20981 -18264 -19854 -14419 499 218 -11907 -9251 -20877 -19335
6569 -19335 -11150 837 695 11876 14604 24320 14784 13423 2704 -112 6231 10895 5894 -1747
6555 -1747 -8276 -3959 3609 2818 -7650 -5867 -3464 -1318 -6106 -8877 -6116 6183 8249 11412 12934
6540 12934 11874 -1550 -8126 -10144 -14535 -19134 -8299 -5212 4602 -3877 732 4063 -3269 -9565
6526 -9565 -9129 -2918 15637 29407 28618 11418 935 -4902 -16966 -30858 -26218 -20267 -25271 -22981
6512 -22981 -18170 -21535 -11682 -7124 2674 2868 -3249 -7358 -23588 -28771 -29344 -20958 -13710 -7411 -2798
6497 -2798 -5224 -10498 -15755 -6569 5544 -4981 -8989 -9688 -5929 -15748 -16989 -12530 -13236 -2661 661
6482 661 -876 4422 -3844 -7732 -4316 -8627 2232 6586 3484 -5669 -2884 4485 1537 8100 -1031
6467a031K584M500r90J924r934M550o879J2344J1271n033M189k1638l453K8n696
6452a3264J301J3262l38k5185k178O604q453o920K3691J130k7412K148K001J4521
6438a9092J1811J4647m486j1776p382O386L200p095j433K581q037Q150J4376j1277
6424i427r198l984J161q041J364P88N293J598r284J635M175M123O208R160n288
6409i717k290j3568m624Q746J176k352L646o286k384l67L287L941o044R61P706
6394a8169J6169K306j021L811M017o830j0916n719j12j4466l239N128J3315J1812
6380c914m26j7937P604K0099l268m942m861L089K034K679l142o195l320M066J7728
6365I294o383j2168m484P09l059L436N272n900o610J810J8431L766O004j340j7591
$$ plain form
6467 -1031 1553 6053 5063 6987 -2947 1603 -5276 7068 18339 13306 17495 -4143 -7596 -7568 -13264
6452 -13264 -11963 1299 961 -24224 -26402 -19798 -28251 -35171 -11480 -10350 -37762 -35614 -33613 -19092
6438 -19092 -7281 7366 2880 -8896 -16278 -9892 -6692 -13787 -15220 -12639 -20676 -12526 1850 -9427
6424 -9427 -18625 -22609 -21448 -29489 -28125 -27337 -22044 -20446 -29730 -28095 -23920 -19797 -13589 -4429 -9717
6409 -9717 -12007 -25575 -30199 -21453 -20277 -22629 -18983 -25269 -27653 -28020 -24733 -20792 -26836 -25875 -18169
6394 -18169 -2000 306 -715 3096 7113 283 -10633 -16352 -16464 -30930 -34169 -29041 -15726 -3914
6380 -3914 -4340 -22277 -14673 5426 2158 -2784 -7645 -4556 -2522 157 -2985 -9180 -12500 -8434 9294
6365 9294 2911 -9257 -13741 -13032 -16091 -12655 -7383 -13283 -19893 -18083 348 4114 10118 8778 -8813
6350h813M181J3951l512j9404k4214j3206n110O84l02R473J1602J2985R051L792
6336h842O03j909N245j1089P46P697Q217l471M987J0227K400n886J358k735j3318
6321e770q713p085M071M675k36R987J037J7397M769j4649q192j09L254p380j7166
6306b4110L620M856n35q330Q117M702j200J2414L109r497j6627L40O304N455J6852
6291E470O615n905j1052n828L601J254j323q095R493m20k3M606n99m254l126L356
6275f230L083O4l205l151n08K2353m574j2256j1184k202J1666K258r861j0193
6261b3940j5719p231J9514J8926J0752M488q342j3118K343L231P55o224k426N743
6247a1248Q616k453j954j3845L446K0691M893r893J296j5468l850P276K71J1802
$$ plain form
6350 -8813 -4632 9319 5807 -13597 -37811 -51017 -56127 -55443 -55745 -46272 -34670 -21685 -12634 -8842
6336 -8842 -8239 -10148 -4903 -15992 -15246 -7549 668 -2803 2184 12411 14811 8925 10283 7548 -5770
6321 -5770 -14483 -21568 -17497 -12822 -13058 -3071 -2034 15363 20132 5483 -2709 -2818 436 -6944 -24110
6306 -24110 -20490 -15634 -16169 -24499 -16382 -11680 -12880 -466 2643 -6854 -23481 -23141 -16837 -11382 5470
6291 5470 12085 6180 -4872 -10700 -7099 -5845 -7168 -15263 -5770 -6190 -6213 -1607 -2206 -6460 -9586 -6230
6275 -6230 -3147 -3083 -6288 -9439 -9947 12406 7832 -4424 -15608 -17810 -6144 -3886 -13747 -23940
6261 -23940 -39659 -46890 -27376 -8450 2302 6790 -1552 -14670 -12327 -9096 -8341 -14565 -16991 -11248
6247 -11248 -2632 -5085 -7039 -20884 -17438 3253 8146 -1747 -451 -15919 -19769 -12493 -12222 -420
6233d20M395M473k594j1015j6658J328P826m34j0350j1209m442Q339J8338K934
6219i489R520J1335q865n022p033J1223p171n238L919j565k269l27J0557q670
6205i095j4330k561J0738j685Q930q54r552j8056J538J4486M233O751j888J563
6191i782N114O362k291R064l766n238k611J835p839j0130R183j0212j155J0026
6177a1440j012J2695J7459k736o716p185k3627j1252Q531k406J50n188L118L1029
6163A420N521J006j2163p089o26r036n211R988J0926j0215j491J3269J1135R341
6149A6775j5894o203p856m255P663J1202n36j9966j961n335J290O404L55R596
6135h721J2713J0140j962p484R902J6817l005k1307k344L641K987o34J9708O45
$$ plain form
6233 -420 3975 8448 5854 -5161 -21819 -20491 -12665 -13099 -23449 -34658 -39100 -30761 -12423 -9489
6219 -9489 31 11366 2501 -2521 -9554 1669 -5502 -10740 -6821 -8386 -10655 -10982 -425 -9095
6205 -9095 -23425 -25986 -15248 -16933 -8003 -8857 -18409 -36465 -34927 -20441 -16208 -9457 -11345 -9782
6191 -9782 -4668 1694 -597 8467 4701 -537 -3148 -1313 -9152 -19282 -10099 -20311 -21466 -11440
6177 -11440 -12452 243 17702 14966 8250 1065 -22562 -33814 -25283 -27689 -27539 -32727 -29609 1420
6163 1420 6941 7947 -4216 -11305 -11931 -20967 -26178 -16190 -5264 -15479 -16970 -3701 7434 16775
6149 16775 881 -5322 -13178 -17433 -9770 1432 896 -19070 -21031 -26366 -25076 -18672 -18317 -8721
6135 -8721 3992 14132 12170 4686 14588 31405 28400 7093 4749 8390 11377 10743 30451 31096
6121C1096j1845M28j3959j4391O16J73p916r968R463L726j4045R330K204J2218
6107b870j3489j3210K563Q297L530M843N106j51j202L146J060K926r450j675J3304
6092B728L068n031k135j168L308q388n128j470O9O641n652K681K811O301J0713
6077I348n352r053q186O653n607j2512j3897O063O697M765K605j40J123J813J1178
6062d502J3687O972j6230j7692O733J2395r09J982k849q826J98m455j0197R780
6048a3913J4570J6825k891J020j3155J1132p153j4055o006j2671m347p620J6678
6035b1586K892Q841K171j0709J2454J660j940M67J0530k353O380L95k7539j3225
6021c1562J9354O050K431J2064j688o288p363l843j2800o066O574J2495L42M949
$$ plain form
6121 31096 19251 19679 5720 -8671 -8055 -7882 -15798 -25766 -16303 -12577 -26622 -17292 -15088 -2870
6107 -2870 -16359 -29569 -27006 -18709 -15179 -10336 -5230 -5381 -6583 -3437 -2377 549 -8901 -10576 2728
6092 2728 5796 765 -1370 -2538 770 -7618 -12746 -14216 -14147 -7506 -13158 -10477 -7666 -1365 9348
6077 9348 3996 -5057 -13243 -6590 -12197 -24709 -38606 -32543 -25846 -21081 -18476 -18616 -17493 -15680 -4502
6062 -4502 9185 16157 -73 -17765 -11032 1363 454 2436 -413 -9239 -9041 -13496 -23693 -13913
6048 -13913 657 17482 14591 15611 2456 13588 6435 -7620 -13626 -26297 -30644 -38264 -21586
6035 -21586 -18694 -9853 -7682 -18391 -5937 -4277 -6217 -5750 4780 2427 8807 9202 -18337 -31562
6021 -31562 -12208 -6158 -3727 8337 6649 361 -7002 -10845 -23645 -29711 -23137 -10642 -10300 -5351
6007e351o067P916R237O49j284j3191p18j106J1849J1127l133j948l087j1981
5993g088j0317o651O967M170j0019M171K2052o482j4264M278n70o720M787o536
5979b2222o160q559J4657N461O906O771J837J013j0401M6P027O477n610n741l891
5964a2389M166J960q773j2016N928J8087J5551j0150j9158Q314M263n278N312
5951d183K42r229K96O786P678K559p21k002M188N872p172r90k2580j1982N259
5936b5979J3227K742O166J3125j744k81j3681O381J2928J5532j4860j2214k509
5923a167m439m81j0220k942M89J3039P186p14P718O799j5127O196J5053n251j3048
5908C091q338J7182J485O987J737o341j4011k348p88j610L889o282N79n436j1013
$$ plain form
6007 -5351 -11418 -3502 5735 6384 5100 -8091 -8809 -9915 1934 13061 9928 7980 4893 -7088
5993 -7088 -17405 -24056 -17089 -12919 -22938 -18767 3285 -3197 -17461 -13183 -13753 -20473 -15686 -22222
5979 -22222 -28382 -36941 -22284 -16823 -9917 -3146 -1309 -296 -10697 -10651 -3624 2853 -2757 -8498 -12389
5964 -12389 -8223 -6263 -15036 -27052 -21124 -3037 12514 2364 -16794 -8480 -4217 -9495 -4183
5951 -4183 -3941 -13170 -12874 -6088 1590 4149 3428 1426 5614 11486 4314 3324 -19256 -31238 -25979
5936 -25979 -12752 -10010 -3844 9281 7537 7256 -6425 -44 12884 28416 13556 1342 -1167
5923 -1167 -5606 -6087 -16307 -19249 -18760 -5721 1465 751 8469 15268 141 6337 21390 16139 3091
5908 3091 -5247 11935 13420 20407 22144 15803 1792 -556 -1344 -2954 935 -5347 -4768 -10204 -21217
5893b1217L920L01r056l082J827N036M836J768O185J1203m186j0069j560l094
5879a7188L549Q251n903r209K948K354L288l492N523K2722k980l626j0152Q8p708
5864a1535M886O203Q499q5m950m716k745q820m317j058m889o530K6181J7192K735
5849A6051j900o469l272K687L028q843j3990M85P616N755j094o96k620m79L88
5834c353q711n677j0770Q384J3943Q359p202n568m07p471M78Q53K172P477j759
5819i252j091p024J2841P123n431j0361J4706Q055J551m498p356j1267J233k829
5805a3600j2666r215J6517J4771J7992O48j8626j6788j3945p280J4203P565k422
5792b2846O561J246K198O885j246J769L417j6541m754Q36O309P701o366n831R46
$$ plain form
5893 -21217 -17297 -16996 -26052 -29134 -27307 -22271 -17435 -15667 -9482 1721 -2465 -12534 -14094 -17188
5879 -17188 -13639 -5388 -11291 -20500 -17552 -15198 -11910 -15402 -9879 12843 9863 6237 -3915 -3827 -11535
5864 -11535 -6649 -446 8053 7968 3018 -1698 -4443 -13263 -17580 -18638 -23527 -30057 -3876 13316 16051
5849 16051 14151 7682 4410 7097 10125 1282 -12708 -12223 -4607 1148 54 -642 -3262 -3741 -3353
5834 -3353 -12064 -17741 -28511 -20127 -6184 2175 -5027 -10595 -11002 -18473 -17995 -17142 -14970 -7493 -9252
5819 -9252 -10343 -17367 -4526 2597 -2834 -13195 1511 9566 11117 6619 -737 -12004 -10771 -13600
5805 -13600 -26266 -35481 -18964 -4193 13799 14447 -4179 -20967 -34912 -42192 -27989 -20424 -22846
5792 -22846 -16285 -15039 -12841 -5956 -7202 -5433 -2016 -18557 -23311 -22475 -16166 -8465 -14831 -20662 -19716
5777a9716J0357l474L73L139J2801J968R38J6776k066k302p811q311m308J943
5763C07j454m913q094N125n15M912J186n032r108J0697p42M89J408L847r140r329
5747b0356L922M814j09R690P035m39n742l597M227l944m33j2711J527O543J739
5732g834j573p400K313J1962J58J442J678R765m284l941m683J353L251R810J2428
5717B4445q645M984j662M565n171j0462j3937J282K556k4n742q069P597j325K632
5702f976J1065m882R99j352k411n944r663l156J6315P415L161O423q458l821o345
5687g630J0186k697K316M70K072J869n703m031k289l367n455k78K0418L963K874
5672A2718j2691k143P376j1099p755l923j3558L329J1481O027m22O15K564m82
$$ plain form
5777 -19716 -9359 -12833 -12460 -9321 3480 5448 6386 23162 21096 18794 10983 2672 -1636 307
5763 307 -1147 -6060 -14154 -9029 -9544 -4632 -3446 -8478 -17586 -6889 -7631 -7142 -5734 -1887 -11027 -20356
5747 -20356 -16434 -11620 -11729 -2039 4996 4557 -1185 -4782 -555 -4499 -4932 -17643 -16116 -9573 -7834
5732 -7834 -9407 -16807 -14494 -2532 -2374 -932 746 10511 6227 2286 -2397 -1044 2207 12017 24445
5717 24445 15800 20784 19122 23687 18516 8054 -5883 -4601 -2045 -2069 -7811 -15880 -8283 -9608 -6976
5702 -6976 4089 -793 206 -1146 -3557 -9501 -19164 -22320 -6005 1410 4571 10994 2536 -1285 -7630
5687 -7630 2556 -141 2175 2645 4717 6586 883 -3148 -5437 -8804 -14259 -14537 5881 9844 12718
5672 12718 27 -2116 5260 -5839 -13594 -17517 -31075 -27746 -16265 -10238 -10660 -10045 -7481 -7963
5658g963J2246m72q934o739J1773L180O198Q284p624j7025j5786q005k112J4874
5644a8105J1753l886m220R456L196j406p753n896N413O432N798N599N008M84p481
5629D392O09p254N860P563L499j6653o827l160o145Q75K90P380L573q879J8532
5614C655K76l384N131J1131K121j5872k06M993J97J2784j5372k7849J898P626
5600a2871o84l59m996Q727J0218r52L178L456j1405L472O369Q362P197p475j7438
5585e201j1268o341K85J0324J2959L173p43J1824J051J9L98J11j720k890j7739
5570e758o094j72J4370Q656p182q4p690K904k998n116j2281k52m74K342Q493M761
5554f575j284l336M39P013m510j1421R593J3833K562r199k883q529j1306J0143
$$ plain form
5658 -7963 4283 3811 -5123 -11862 -89 3091 9289 17573 9949 -7076 -22862 -30867 -32979 -18105
5644 -18105 -6352 -10238 -14458 -5002 -1806 -3212 -10965 -16861 -11448 -5016 782 6381 11389 11873 4392
5629 4392 5001 -2253 3607 11170 14669 -1984 -8811 -11971 -18116 -17241 -16951 -9571 -5998 -14877 3655
5614 3655 3931 547 5678 16809 18930 3058 2852 7845 8042 20826 5454 -22395 -20497 -12871
5600 -12871 -13555 -13914 -18910 -10183 35 -917 2261 5717 -5688 -2216 4153 12515 19712 12237 -5201
5585 -5201 -16469 -22810 -22525 -12201 758 3931 3188 15012 16063 16082 16480 16591 14871 11981 -5758
5570 -5758 -11852 -12024 2346 11002 3820 3736 -3954 -1050 -4048 -9164 -21445 -21697 -22171 -19829 -11336 -6575
5554 -6575 -7859 -11195 -10756 -3743 -8253 -19674 -10081 3752 6314 -2885 -5768 -14297 -25603 -15460
5540a5460J07O224J474j1349o7J3678J1414j1678q835K282J5049K626q098n502
5526h135N473N347j7096L682O165L539l107P705q540j1564K821j1743p857P730
5512b5580J2694L863k4m993N537N158m458P34J0692n423l762k687K557J0480q909
5497d121m538R553o207j2065j779K253Q280o078J993O775l973p849J647R791P6
5482f242r675j032O28J3395N270j613O841R66Q115r633j4782L83J727j2675M307
5467a4020Q275L074k717K69l81M196Q464p482J552J162j218n706k0342j290J2848
5452a3316J0658O876K45j529n757p40j352q126j5442j625J253J3098J3808j1816
5438a3765N894j2306P09K6731l605J3184j832j2920j5681j764l609O838O970k624
$$ plain form
5540 -15460 -15353 -9129 -7655 -19004 -19071 -5393 6021 -5657 -14492 -12210 2839 5465 -2633 -8135
5526 -8135 -2662 2685 -14411 -10729 -4564 -1025 -4132 3573 -4967 -16531 -13710 -25453 -33310 -25580
5512 -25580 -12886 -9023 -9047 -14040 -8503 -3345 -7803 -7069 3623 -1800 -5562 -8249 -5692 4788 -4121
5497 -4121 -8659 894 -5313 -17378 -19157 -16904 -8624 -14702 -12709 -5934 -9907 -17756 -16109 -6318 -6242
5482 -6242 -15917 -16949 -16321 -2926 2344 731 7572 8538 16653 7020 -7762 -7379 -5652 -18327 -14020
5467 -14020 -5745 -2671 -5388 -5119 -5500 -1304 7160 -322 1230 2392 1174 -4532 -24874 -26164 -13316
5452 -13316 -2658 4218 4463 2934 -2823 -3563 -4915 -13041 -28483 -30108 -28855 -15757 -1949 -13765
5438 -13765 -7871 -20177 -19468 7263 3658 16842 15010 2090 -13591 -15355 -18964 -12126 -5156 -7780
5424g780l217r601j20Q298O954o623J822O836O325J3887k855q251L178q745R709
5409I817J2067m12j3739k8137m811J5046m091N154p889m497K908J2519j530o815
5395a4410K816N371p183j0234m01K510j0343m607N724l460p949K1507J3161N302
5381b196r926j1549l566J960L813m476Q884P042o467N519j1290P898K2183r248
5367a419n260L204j1969L155j521n027P35P880j0031n647J3560n853P78L357O393
5352g665L5M405P851N900l827K469o407o19n929p648l965k169K1237q13j7783
5337a4928R015J7071M078p300p826j3110j068r048j310O031Q628O373n390M253
5323d531j2306m145L734M800k76J3634oK979P276P769J531K351j354j6750j0147
$$ plain form
5424 -7780 -10997 -20598 -20718 -12420 -5466 -12089 -10267 -3431 2894 16781 13926 5675 8853 108 9817
5409 9817 21884 21472 7733 -20404 -25215 -10169 -14260 -9106 -16995 -21492 -18584 -6065 -7595 -14410
5395 -14410 -11594 -6223 -13406 -23640 -24041 -21531 -31874 -36481 -30757 -34217 -42166 -20659 -7498 -2196
5381 -2196 -12122 -23671 -27237 -25277 -21464 -25940 -17056 -10014 -16481 -10962 -22252 -14354 7829 -1419
5367 -1419 -6679 -3475 -15444 -12289 -13810 -18837 -18102 -10222 -20253 -25900 -12340 -18193 -17415 -14058 -7665
5352 -7665 -7630 -3225 4626 10526 6699 9168 2761 2142 -3787 -11435 -15400 -17569 3668 2855 -14928
5337 -14928 -5913 11158 15236 7936 110 -13000 -14068 -23116 -24426 -18395 -9767 -3394 -8784 -4531
5323 -4531 -16837 -20982 -17248 -12448 -12724 910 904 3883 11159 18928 20459 22810 21456 4706 -5441
5308e441Q61j0469K579P705M27N022M299j0270M105J3112M205M113K217Q771j0728
5293B0508q053j6382m151j8827n915J9856L284R811k874M657K547M438n689N689
5279H899K2026q194r582j1265L203j2370q541J2577Q197r365O04L669Q424O028
5265A4310n945j0549l51J1002N286L464j1198j623k61r894k823j4993j5070O603
5251c2042J3467M491K563N3O861P720l4r582k1168l343J8896K1825l003o661O932
5236F975L04j3433J3488j299j150k628j2845O393J5615O171j7402l5332q702K8795
5222a5050J8021O765N786j0382j2259L641Q727O006M788q616K607m44m632j4148
5208i190M378l256r9j3411r294M684P549J6265M721k650K743j470j1521k739m560
$$ plain form
5308 -5441 -4580 -15049 -12470 -4765 -4338 684 4983 -5287 -1182 11930 16135 20248 22465 31236 20508
5293 20508 12455 -3927 -8078 -26905 -32820 -12964 -9680 131 -2743 1914 4461 8899 3210 8899
5279 8899 30925 22731 13149 1884 5087 -7283 -15824 -3247 4950 -4415 -3811 -142 8282 14310
5265 14310 8365 -2184 -2535 8467 13753 17217 6019 4396 4135 -5759 -8582 -23575 -38645 -32042
5251 -32042 -18575 -14084 -11521 -11468 -4607 3113 3079 -6503 -27671 -31014 -12118 9707 6704 43 6975
5236 6975 7279 -6154 7334 6035 4885 2257 -10588 -4195 11420 17591 189 -35143 -43845 -15050
5222 -15050 2971 9736 15522 5140 -7119 -3478 5249 11255 16043 7427 10034 9590 4958 -9190
5208 -9190 -4812 -8068 -8167 -21578 -30872 -26188 -18639 -2374 2347 -303 2440 970 -10551 -13290 -17850
5193a7850p67o216M206J425j3411j101Q371M546R510Q720O53P303M55j9852l909
5178a7917Q267j0766r648N206R199j895Q750n828R688J2369R401k209p805k905
5164C907L787J6046n203j3263m602O79M816n508j125J5670J0417N070J179o207
5150B5663j4400j1416L759n427j034k141j1911o37J2193N827k324O902P460k02
5136A2312r961j1475M913O618j1580j4889q344N156k050J4601J9810N722j2991
5123b158o848o360K523J8955J2341j0194j0931l616m408O676J219J0761P674L685
5109A9319j755r279j2456N02n314M894q211p508j385R785Q634J012J1368L207
5095A2813j4350m90n95j2423J349l927R006K044r35m559q514N101m389l188M470
$$ plain form
5193 -17850 -18617 -24833 -20627 -19202 -32613 -33714 -25343 -20797 -11287 -2567 -1914 5389 5844 -14008 -17917
5178 -17917 -9650 -20416 -30064 -24858 -15659 -17554 -8804 -14632 -4944 7425 16826 14617 6812 3907
5164 3907 7694 23740 18537 5274 672 1351 6167 659 -466 15204 25621 30691 31870 25663
5150 25663 11263 -153 3606 -1821 -2855 -4996 -16907 -17544 -5351 476 -1848 5054 12514 12312
5136 12312 2351 -9124 -4211 2407 -9173 -24062 -32406 -27250 -29300 -14699 5111 10833 -2158
5123 -2158 -9006 -15366 -12843 6112 18453 8259 -2672 -6288 -10696 -4020 -2801 7960 15634 19319
5109 19319 17564 8285 -4171 -3669 -8983 -4089 -12300 -19808 -21193 -11408 -2774 -1762 9606 12813
5095 12813 -1537 -2027 -2622 -15045 -13696 -17623 -8617 -6573 -7508 -12067 -20581 -15480 -19869 -23057 -18587
5080a8587L906R314n01j0735o755L396l931K665J2803J631J342M780J6085J1815
5066B7228J469q516r638m478J900K425j398r500M472q52O608J5739J112J142M783
5051C2496j1011r187r35n881j4373P422q842l669J3988o0j2676J639L787J937
5037e365R09O94J7601J3992p484J1122K429l94r066k2851j4556M559J2894j09
5023D375P804P25j4393J3952M859k1003j4381J904K759P74K934P270P547k309
5009B817o880O936k666K768M403j373j5128m311J8028N828n918m552m861l40j3577
4994a8826k621J1670J3350m302j74L987J5204q251r069j5101l4020J185J6575
4981c0393K366M9J0114J6401k531j3296J0455P42J0078j133j6238L671M650N746
$$ plain form
5080 -18587 -14681 -5367 -5868 -16603 -23358 -19962 -23893 -21228 -8425 -6794 -5452 -672 15413 27228
5066 27228 28697 20181 10543 6065 7965 10390 8992 -508 3964 3112 9720 25459 26571 27713 32496
5051 32496 21485 12298 11363 5482 -8891 -1469 -10311 -13980 8 -52 -12728 -11089 -7302 -5365
5037 -5365 -4456 -3762 13839 27831 20347 31469 33898 33504 24438 1587 -12969 -8410 4484 4375
5023 4375 12179 12904 -1489 12463 17322 -3681 -18062 -16158 -13399 -12625 -9691 -2421 5126 2817
5009 2817 -4063 2873 207 2975 7378 6005 -9123 -13434 4594 10422 4504 -48 -4909 -5249 -18826
4994 -18826 -21447 -9777 3573 -729 -903 3084 18288 10037 968 -14133 -48153 -46968 -30393
4981 -30393 -28027 -27978 -17864 -1463 -3994 -17290 -6835 -6093 3985 2852 -13386 -9715 -5065 681
4967F81k711O242j850P74M967o510m595n894l638Q126j677j8726J87P568N169
4952a1887n032J0087k604M340j346o080P738j853q256L777N456K097J0977Q801
4938A6215o218M471k49K263l344j6639K92J0024J6536p680m070k626j3060p615
4924a1700N335K8K252M281l007l672R45L137j0209k18m53J249o01N546P974Q476
4908I363J92p448j110J8447J9728o091p451p526j7603j4536k095N884J4884O686
4894A1324N812j4772n78K348n373j4127N307P438q339k870o699n257K0271J1781
4880F266j3827p320L321J3995J1487o709Or482j730J2898R240J969j369j7661
4866A084l792j0029m407l201M011k51J5362J1478m799n647j5982k10P655J0366
$$ plain form
4967 681 -2030 4212 2362 3136 8103 1593 -3002 -8896 -12534 -4408 -6085 -24811 -24624 -17056 -11887
4952 -11887 -16919 -6832 -9436 -5096 -6442 -12522 -4784 -6637 -14893 -11116 -5660 -3563 7414 16215
4938 16215 9997 14468 14219 16482 13138 -3501 -3209 6815 23351 15671 11601 8975 -4085 -11700
4924 -11700 -6365 -6337 -4085 196 -2811 -6483 -5538 -2401 -12610 -12828 -13281 -12032 -12633 -7087 887 9363
4908 9363 9555 2107 997 19444 39172 33081 25630 18104 501 -14035 -16130 -10246 4638 11324
4894 11324 17136 2364 1786 4134 -1239 -15366 -10059 -2621 -10960 -13830 -20529 -25786 -5515 6266
4880 6266 -7561 -14881 -11560 2435 13922 7213 7219 -2263 -3993 8905 18145 20114 18745 1084
4866 1084 -2708 -12737 -17144 -20345 -16334 -16585 -1223 10255 5456 -191 -16173 -16383 -8728 1638
4852A638Q757n432j0057k302N789J1853J078M47K444O058m278q160j4034q073
4838a4272O432M428q669j704l038N080O372j975P495m32J5370J080j5590n143
4824d566J2624K209j0311L723P548k1318m106J0072J6531n224P591L800P01R07
4810B0181J397j5192k189P928j507p08j2685q429J993J6974J2248K94j1937p593
4796G75n236n882l492m469N371J0420J3497q75k133j0771q076L689m537n95M060
4781h254l852K863R791l441M489k730j2890p555K030J8974M032j7371n872R499
4767a0287j3353l287O600K364k624J2285P708K951K248p402p321J2436O016k3539
4753a5205P211J1180j0881k957o69r424R5J2753O718J367r743J4151M12k605j7602
$$ plain form
4852 1638 10395 4963 -5094 -7396 -1607 10246 11324 11771 14215 20273 15995 7835 -6199 -14272
4838 -14272 -7840 -3412 -12081 -13785 -16823 -11743 -5371 -7346 149 -283 15087 16167 577 -4566
4824 -4566 8058 10267 -44 3679 11227 -10091 -14197 -4125 12406 7182 14773 18573 19274 20181
4810 20181 21578 6386 4197 12125 10618 9910 -2775 -11204 -9211 7763 20011 20305 8368 775
4796 775 -4461 -10343 -13835 -18304 -12933 -2513 10984 10109 7976 -2795 -10871 -7182 -11719 -12314 -8254
4781 -8254 -12106 -9243 548 -2893 1596 -1134 -14024 -21579 -19549 -575 3457 -13914 -19786 -10287
4767 -10287 -23640 -26927 -20327 -17963 -20587 -8302 -594 2357 4605 -2797 -10118 2318 8334 -15205
4753 -15205 -7994 3186 -7695 -10652 -11321 -20745 -20650 -7897 -1179 188 -9555 4596 5008 2403 -15199
4738a5199j0286j2685j387J3415K0965J0804o200j1397j3486P991M529q06M106
4725i636j5391K583N058O934Q173J353Q108j116j211m856L331M056n331n952n829
4710i726j408O449o516N157J0461m526j7687l86J1021L142m896J8791M008P559
4696B1443P26M541j0929j1040j3095R280J1349L385O142M443p393n653j0778j5277
4682a2856j730J2921M243R652J0615k144j388o639p313j1795q095K205M785n426
4668a2965r294j852L31P101m495J4110R121m406P273O476M745L307o389M708K65
4653A8036J03j2586L680k162o590r650O656J59j2043r977M148P581M643o968k845
4638a7815O256J4115o648n772r79N079O644J093j1794o29N585L010k693M308J2078
$$ plain form
4738 -15199 -25485 -38170 -39557 -26142 -5177 5627 -573 -11970 -25456 -17465 -12936 -13742 -9636
4725 -9636 -25027 -22444 -17386 -10452 -2279 -926 7182 6066 4855 -1 3330 7386 2055 -3897 -9726
4710 -9726 -11134 -4685 -11201 -6044 4417 -109 -17796 -18182 -7161 -4019 -8915 9876 13884 21443
4696 21443 22169 26710 15781 4741 -8354 926 12275 15660 21802 26245 18852 13199 2421 -12856
4682 -12856 -14586 -1665 2578 12230 22845 20701 19313 12674 5361 -6434 -14529 -12324 -7539 -12965
4668 -12965 -22259 -24111 -23780 -16679 -21174 -7064 2057 -2349 4924 11400 16145 19452 13063 17771 18036
4653 18036 18139 5553 9233 7071 481 -9169 -2513 -2354 -14397 -24374 -20226 -12645 -8002 -14970 -17815
4638 -17815 -11559 2556 -4092 -9864 -10843 -5764 880 1973 -9821 -10450 -4865 -1855 -4548 -240 11838
4623A1838J27j2086P142n268K683j3205K540o84N549N181p681r2q74Q00j4736
4608a8766j1010J958J7291j936M076Q053n771k520Q021j4897o165j104J278N105
4594a6387O865m232q4K422j081M617q489P341J5341N793j9409k0857m205J642
4580c0723M402Q388M403p47Q945K453R39J176q42N114M806K675l716L183J816
4565A2272K669l622o989O929J0487o665q517m036q079M081O321M127k010j3052
4551f084p461j4518J1014J0098O871M093N173r255J854m921j0590p720L554M609
4537a3283O222L538M731J0381p577n274n950n542l920P3K0442N563j0459J0737
4523I682K814k468n016R11J3362q556n491j3965j1447l980O051J4355K110q35
$$ plain form
4623 11838 11965 -121 7021 1753 4436 -8769 -6229 -6913 -1364 3817 -3864 -3956 -4830 -4030 -18766
4608 -18766 -29776 -27818 -10527 -12463 -8387 -334 -6105 -8625 -604 -15501 -21666 -22770 -21492 -16387
4594 -16387 -9522 -13754 -13838 -11416 -12497 -7880 -16369 -9028 6313 12106 -7303 -28160 -32365 -30723
4580 -30723 -26321 -17933 -13530 -14277 -5332 -2879 -1940 -764 -1606 3508 8314 10989 7273 10456 12272
4565 12272 14941 11319 4330 11259 21746 15081 6564 2528 -5551 -1470 4851 8978 6968 -6084
4551 -6084 -13545 -28063 -17049 -6951 -80 4013 9186 -69 1785 -3136 -13726 -21446 -17892 -13283
4537 -13283 -7061 -3523 1208 11589 4012 -1262 -7212 -12754 -16674 -16601 3841 9404 -1055 9682
4523 9682 12496 10028 5012 5923 19285 10729 5238 -8727 -20174 -24154 -18103 -3748 -1638 -2473
4509b473j685J0114n747j663J6559j2630m003l046m007j040n600l618J838j201
4495a8202L874N345R891J0304P454n358o734L923N457o938K5l899r601J9930K0986
4480C6457o180l482j1179n202j0701n397J1658O58j4312j37p484l809P565J2936
4466A391J5472l9M255m717p395j9509j3299J2530K209j198o876J584p758O613
4452a6737J0118J1223j549J0768O413L737j522j1291j4583r974r251N231J0813
4439f604r865j3088l39J9655K2021J1454o837o733L085J779K13M58m875Q288j0376
4424H236n194l416j8372r030L365R399Q534K1784K310l298m822r788K402j911
4410A99o226n527j996R842K7769R454k056M301m506j7756O412j585m999r206j7641
$$ plain form
4509 -2473 -4158 5956 209 -1454 15105 2475 -1528 -4574 -8581 -9621 -15221 -18839 -17001 -18202
4495 -18202 -14328 -8983 908 11212 18666 13308 6574 10497 15954 9016 9041 5142 -4459 15471 36457
4480 36457 30277 26795 15616 10414 -287 -5684 5974 6632 -7680 -7817 -15301 -19110 -11545 1391
4466 1391 16863 16824 21079 16362 8967 -10542 -23841 -11311 -9102 -10300 -17176 -15592 -23350 -16737
4452 -16737 -6619 4604 3055 13823 20236 23973 22451 11160 -3423 -13397 -22648 -17417 -6604
4439 -6604 -16469 -29557 -29896 -10241 11780 23234 16397 9664 12749 14528 14741 15199 10324 18612 8236
4424 8236 3042 -374 -18746 -27776 -24411 -15012 -6478 15306 17616 14318 9496 -292 2110 199
4410 199 -6027 -11554 -13550 -3708 24061 33515 31459 35760 31254 13498 19910 18325 13326 4120 -13521
4395a3521m749Q128j487K262K3245m093k305O022m620j2220l706J6943M387k146
4381A2140P92j9030o864J3229L671o544r894J2342J2846J405m403m824p35o290
4367b159L003J2471O550R66j5399k2730k2033Q824l461k628Q138J2963J0330L631
4353a534j2410J3991L512l733J5698j0470p540N874Q604O232J606k0056j2747
4340a2973p74m382M204J6490j448m967n811P162J0976N977j536J4096Q328q659
4326B6683o956j3391r359n305p318M271j1284o012P562O074q18J8199P587j6459
4312f526k086K779O047K510m579o777M800n412o495l593J3899J3994j75M856o03
4297A2639j2934j3242R710J1225J938k0247k996N199n222q009k64k204J3600K1285
$$ plain form
4395 -13521 -18270 -10142 -11629 -9367 13878 9785 7480 13502 8882 -3338 -7044 9899 14286 12140
4381 12140 12932 -6098 -12962 267 3938 -2606 -12500 -158 12688 14093 9690 4866 4131 -2159
4367 -2159 844 13315 19865 20831 5432 -17298 -39331 -30507 -33968 -36596 -28458 -15495 -5165 -1534
4353 -1534 -13944 47 3559 -174 15524 5054 -2486 3388 11992 18224 19830 -226 -12973
4340 -12973 -13747 -18129 -13925 2565 1117 -3850 -9661 -2499 8477 14454 12918 27014 35342 26683
4326 26683 19727 6336 -3023 -8328 -15646 -11375 -22659 -28671 -21109 -15035 -15853 2346 9933 -6526
4312 -6526 -8612 -5833 214 2724 -1855 -8632 -3832 -9244 -15739 -19332 -5433 8561 8386 13242 12639
4297 12639 -295 -13537 -3827 7398 9336 -10911 -13907 -8708 -13930 -21939 -22203 -24407 -10807 10478
4283A0478p90m704p540r888j761R378j862J6075k491l618J028K690P595L246j1266
4268F570k143R793p149m164J400o237j2285m011J2693J1912O777j187o129p022
4254a182m101M838m735p306L559o451J676O277q889k97J0161J1146k405l78m848
4239b935J01L120J1994Q685r861q587N301P069l341J594m723m23k03j7460m595
4224a4264Q349M528l228J2676J1370K949n021N215j827o544j82j3474k085K639
4210A101R308j3586o731K689m126l870qj449J0446R46Q77K2317K410q008p461
4195D855k0594J179J5882J4506J1047j8169k2502L060R149Q017m048q027O637
4182I92k198J5788J14Q238m219l329j0778j3645J0314Q690k105m721n655M69R196
$$ plain form
4283 10478 9688 4984 -2556 -12444 -14205 -4827 -6689 9386 6895 3277 4305 6995 14590 17836 6570
4268 6570 4427 14220 7071 2907 4307 -1930 -14215 -18226 -5533 6379 13156 11969 5840 -1182
4254 -1182 -5283 -445 -5180 -12486 -8927 -15378 -13702 -7425 -16314 -16611 -6450 4696 2291 1913 -2935
4239 -2935 -2834 286 12280 20965 11104 2517 7818 14887 11546 13140 8417 7994 7791 -9669 -14264
4224 -14264 -5915 -1387 -4615 8061 19431 22380 17359 22574 20747 14203 14021 547 -1538 1101
4210 1101 10409 -3177 -9908 -7219 -11345 -15215 -15223 -16672 -6226 -5280 -4403 17914 20324 12316 4855
4195 4855 -15739 -14560 1322 15828 26875 8706 -13796 -10736 -1587 6430 2382 -5645 992
4182 992 -1206 14582 14696 22934 18715 15386 4608 -9037 1277 9967 7862 3141 -2514 -2045 7151
4167G151k329L264j4827n813R736o783n822N598N775L651N903m597k356O287P198
4152A2036o634j0651J406P088j945M057O10k915Q434O428r290j2772M432K238
4138B522K381j243P544l39j2657n090L221J940k0017P949N612J983n233k631J1671
4123b387J1931n846n540n800J104J5104L080M808M496n607o599L669r206l829
4109f22j142k197N581J9915q870j5554J504P335j9742p637J4797K4661J5501k117
4095C1413j9439k4892m256M550j8543j767O954R917J8245P260k822K195j1053
4082b238Q640n500j295o04K0443o232n951r603P156M330q301l263J968M510j680
4067B380K358k425o969o283l222J4657J4995k509k096J798p474l738M825j382
$$ plain form
4167 7151 4822 8086 -6741 -12554 -2818 -9601 -15423 -9825 -4050 -399 5504 907 -1449 4838 12036
4152 12036 5402 -5249 -3843 3245 1300 5357 5967 3052 11486 17914 8624 -4148 284 2522
4138 2522 4903 3660 11204 10865 -1792 -6882 -3661 -1721 -21738 -13789 -8177 -6194 -11427 -14058 -2387
4123 -2387 9544 3698 -1842 -7642 -6538 8566 11646 16454 20950 15343 8744 12413 3207 -622
4109 -622 -1764 -3961 1620 21535 12665 -2889 -1385 5950 -13792 -21429 -6632 18029 33530 31413
4095 31413 11974 -12918 -17174 -12624 -31167 -32934 -25980 -16063 2182 9442 6620 8815 -2238
4082 -2238 6402 902 -393 -997 19446 13214 7263 -2340 4816 9146 845 -2418 -450 4060 2380
4067 2380 4738 2313 -4656 -10939 -14161 496 15491 12982 10886 12684 5210 1472 6297 4915
4053D915l340j33K250K001k399j3434K0601M944r411n422j4012L187Q090r26L736
4038F47J4257R378N51m646m784j3593q197J7770r09m714J2632L073q078k2748
4024i361l061K497M323P564q114j3945q637O572l212R55R687J2648l348M501n518
4009f449k74q926p513K550J0324j3508l525R602J1841O092l360r415J1756J6766
3995A5961P629R173m629q182r513m892n811k953L184J3480O15n415j1926j4939
3981a8218O702K604P907m711O87M307J8239o140n72J0098n595j968Q276J68l755
3966A8029j3608j2441r11N297O619N343r943k610R755O008j961j916j4021O225
3952a35N039p22j193O775L450J497r422j7584j0198R604l798r190R077K2536Q369
$$ plain form
4053 4915 1575 1442 3692 5693 3294 -10140 10461 15405 5994 572 -13440 -10253 -2163 -3089 647
4038 647 14904 24282 24833 20187 15403 1810 -6387 11383 10474 5760 18392 21465 13387 -9361
4024 -9361 -12422 -9925 -5602 1962 -6152 -20097 -28734 -22162 -25374 -24419 -14732 -2084 -5432 -931 -6449
4009 -6449 -6723 -15649 -23162 -20612 -10288 -23796 -27321 -17719 -5878 214 -3146 -12561 -805 15961
3995 15961 23590 32763 28134 19952 10439 5547 -264 -3217 -33 13447 14062 8647 -3279 -18218
3981 -18218 -11516 -8912 -1005 -5716 -5029 -722 17517 11377 10805 20903 15308 13340 21616 21784 18029
3966 18029 4421 -8020 -8931 -3634 2985 8328 -1615 -4225 5530 11538 9577 7661 -6360 -135
3952 -135 4904 4182 2989 9764 13214 14711 5289 -12295 -22493 -12889 -16687 -25877 -16800 5736 14105
3937A4105l521J774k612m917K482j595J319K320m849P711r107l852J7773Q590
3923B5621j744q808m995N039o271M356M962k59M005m44j0518l699j278q797j0128
3908a2958n379N324J0342J4278J1811M174n437j9752j1213k557L889P344J962
3895A828o771l476J5261N538m101L490j1393J378P74j4398j780L804J1588j0436
3881h694q14J2600J2867o400m374J5055p049k1028j1141J682J9104J2898n289
3868I417O706L469j4581J2067J5845p897O144J3127j3130l888j0276q981k64j0818
3854c060Q692Q852l456n279k576P586P377L878J0025j4587l1079p047J0537J613
3840h524J909N405J4417m898j241J1486k075j0208l468K30j4426n418P369j3047
$$ plain form
3937 14105 10584 12358 9746 4829 7311 5716 7035 9355 4506 12217 3110 -742 17031 25621
3923 25621 23877 15069 10074 15113 8842 13198 18160 17901 21906 21462 10944 7245 5967 -2830 -12958
3908 -12958 -18337 -13013 -2671 11607 23418 27592 22155 2403 -8810 -11367 -7478 -134 1828
3895 1828 -4943 -8419 6842 12380 8279 11769 376 1754 2528 -11870 -13650 -9846 1742 -8694
3881 -8694 -9508 3092 15959 9559 5185 20240 13191 -7837 -18978 -17296 1808 14706 9417
3868 9417 16123 19592 5011 17078 32923 25026 31170 44297 31167 27279 17003 8022 7758 -3060
3854 -3060 5632 14484 11028 5749 3173 10759 18136 22014 32039 17452 -13627 -20674 -10137 -8524
3840 -8524 -6615 -1210 13207 8309 7068 18554 16479 6271 2803 3033 -11393 -16811 -9442 -22489
$$ [...]
##END NTUPLES=NMR SPECTRUM
##END=
