##TITLE=Analysis number 317826
Compound Code cc 47413
Book Reference 382/184
Project Code adrs
Chemist Name simons
##JCAMPDX= 6.0         $$ Bruker NMR JCAMP-DX V2.0
##DATA TYPE= NMR SPECTRUM
##DATA CLASS= NTUPLES
##ORIGIN= Bruker BioSpin GmbH
##OWNER= nmr
$$ XWIN-NMR		Version 3.5
$$ Mon Mar  6 15:35:21 2006 GMT Standard Time (UT+0h)  MAYBRIDGE\nmr@NMR_250MHZ
##.OBSERVE FREQUENCY= 250.131544655141
##.OBSERVE NUCLEUS= ^1H
##.ACQUISITION MODE= SIMULTANEOUS (DQD)
##.ACQUISITION SCHEME= undefined
##.AVERAGES= 16
##.DIGITISER RES= 18
##SPECTROMETER/DATA SYSTEM= dpx250
##.PULSE SEQUENCE= zg30
##.SOLVENT NAME= CDCl3
##.SHIFT REFERENCE= (INTERNAL, CDCl3, 0, 16.522)
##AUDIT TRAIL= $$ (NUMBER, WHEN, WHO, WHERE, WHAT)
$$ ##TITLE= Audit trail, XWIN-NMR		Version 3.5
$$ ##JCAMPDX= 5.01
$$ ##ORIGIN= Bruker BioSpin GmbH
$$ ##OWNER= nmr
$$ C:\u/data/dgb/nmr/ADRS/110/pdata/1/auditp.txt
$$ ##AUDIT TRAIL=  $$ (NUMBER, WHEN, WHO, WHERE, WHAT)
(   1,<2006-03-06 15:34:55.56 +000>,<MAYBRIDGE\nmr>,<NMR_250MHZ>,
      <created by zg, POWCHK disabled, PULCHK disabled
       configuration hash MD5:
       84 BC 41 DB A1 6E 1D 46 DA 25 12 A5 C1 ED C5 3A
       data hash MD5: 64K
       DD 8B 5B 83 15 6F BF 53 81 AB C2 34 6F 38 33 BE>)
(   2,<2006-03-06 15:35:10.31 +000>,<MAYBRIDGE\nmr>,<NMR_250MHZ>,
      <Start of raw data processing
       ef LB = 0.3 FT_mod = 6 PKNL = 1 SI = 32K 
       data hash MD5: 32K
       D3 64 BB 78 D2 14 D6 E7 3A 9F 71 C9 71 A8 C7 DE>)
(   3,<2006-03-06 15:35:12.69 +000>,<MAYBRIDGE\nmr>,<NMR_250MHZ>,
      <apk 
       data hash MD5: 32K
       55 F2 1A FF 99 02 A6 A3 40 7B 85 6E 6B 12 4A 2A>)
(   4,<2006-03-06 15:35:13.54 +000>,<MAYBRIDGE\nmr>,<NMR_250MHZ>,
      <abs ABSG = 5 
       data hash MD5: 32K
       A0 23 70 82 66 D1 1A 24 44 B0 7C C5 9B 3C 9D BA>)
$$ ##END=
$$ 
$$ hash MD5
$$ AA 3E F9 BC 4E 17 63 41 E1 80 10 68 DA 2F 8C 3C
##$RELAX= 
##$RELAX= 
##$RELAX= 
##$RELAX= 
##$RELAX= 
##$RELAX= 
##$RELAX= 
$$ Bruker specific parameters
$$ --------------------------
##$DU= <C:\u>
##$EXPNO= 110
##$NAME= <ADRS>
##$PROCNO= 1
##$TYPE= <nmr>
##$USER= <dgb>
##$AMP= (0..31)
100 100 100 100 100 100 100 100 100 100 100 100 100 100 100 100 100 100 
100 100 100 100 100 100 100 100 100 100 100 100 100 100 
##$AQSEQ= 0
##$AQ_mod= 3
##$AUNM= <au_zg>
##$AUTOPOS= <60 >
##$BF1= 250.13
##$BF2= 250.13
##$BF3= 250.13
##$BF4= 250.13
##$BF5= 500.13
##$BF6= 500.13
##$BF7= 500.13
##$BF8= 500.13
##$BYTORDA= 1
##$CFDGTYP= 0
##$CFRGTYP= 5
##$CHEMSTR= <none>
##$CNST= (0..31)
1 1 145 1 1 1 1 1 1 1 1 1 1 1 1 1 1 1 1 1 1 1 1 1 1 1 1 1 1 1 1 1 
##$CPDPRG= <>
##$CPDPRG1= <>
##$CPDPRG2= <>
##$CPDPRG3= <>
##$CPDPRG4= <mlev>
##$CPDPRG5= <mlev>
##$CPDPRG6= <mlev>
##$CPDPRG7= <mlev>
##$CPDPRG8= <mlev>
##$CPDPRGB= <>
##$CPDPRGT= <>
##$D= (0..31)
0 1 0 0 0 0 0 0 0 0.06 0 0 0 0 0 0 0.0002 0 0 0 0 0 0 0 0 0 0 0 0 0 0 
0 
##$DATE= 1141659294
##$DBL= (0..7)
120 120 120 120 120 120 120 120 
##$DBP= (0..7)
150 150 150 150 150 150 150 150 
##$DBP07= 0
##$DBPNAM0= <>
##$DBPNAM1= <>
$$ [...]
##$SUBNAM6= <"">
##$SUBNAM7= <"">
##$SUBNAM8= <"">
##$SUBNAM9= <"">
##$SW= 20.6930455092707
##$SWIBOX= (0..15)
0 0 3 0 0 0 0 0 0 0 0 0 0 0 0 0 
##$SW_h= 5175.983436853
##$TD= 65536
##$TD0= 1
##$TE= 293.16
##$TE2= 300
##$TE3= 300
##$TEG= 300
##$TL= (0..7)
0 120 120 120 120 120 120 120 
##$TP= (0..7)
150 150 150 150 150 150 150 150 
##$TP07= 0
##$TPNAME0= <>
##$TPNAME1= <>
##$TPNAME2= <>
##$TPNAME3= <>
##$TPNAME4= <>
##$TPNAME5= <>
##$TPNAME6= <>
##$TPNAME7= <>
##$TPOAL= (0..7)
0.5 0.5 0.5 0.5 0.5 0.5 0.5 0.5 
##$TPOFFS= (0..7)
0 0 0 0 0 0 0 0 
##$TUNHIN= 0
##$TUNHOUT= 0
##$TUNXOUT= 0
##$USERA1= <user>
##$USERA2= <user>
##$USERA3= <user>
##$USERA4= <user>
##$USERA5= <user>
##$V9= 5
##$VALIST= <valist>
##$VCLIST= <CCCCCCCCCCCCCCC>
##$VD= 0
##$VDLIST= <DDDDDDDDDDDDDDD>
##$VPLIST= <PPPPPPPPPPPPPPP>
##$VTLIST= <TTTTTTTTTTTTTTT>
##$WBST= 1024
##$WBSW= 4
##$XGAIN= (0..3)
0 0 0 0 
##$XL= 0
##$YL= 0
##$YMAX_a= 455689
##$YMIN_a= -590848
##$ZGOPTNS= <>
##$ZL1= 120
##$ZL2= 120
##$ZL3= 120
##$ZL4= 120
##$ABSF1= 16.522
##$ABSF2= -4.171173
##$ABSG= 5
##$ABSL= 3
##$ALPHA= 0
##$AQORDER= 0
##$ASSFAC= 0
##$ASSFACI= 0
##$ASSFACX= 0
##$ASSWID= 0
##$AUNMP= <proc_1d>
##$AZFE= 0.1
##$AZFW= 0.1
##$BCFW= 0
##$BC_mod= 0
##$BYTORDP= 0
##$COROFFS= 0
##$CY= 12.5
##$DATMOD= 1
##$DC= 0
##$DFILT= <>
##$DTYPP= 0
##$F1P= 14.0000005364418
##$F2P= -0.99999901652339
##$FCOR= 0.5
##$FTSIZE= 32768
##$FT_mod= 6
##$GAMMA= 0
##$GB= 0
##$INTBC= 1
##$INTSCL= 1
##$ISEN= 128
##$LB= 0.3
##$LEV0= 0
##$LPBIN= 0
##$MAXI= 10000
##$MC2= 0
##$MEAN= 0
##$ME_mod= 0
##$MI= 0
##$NCOEF= 0
##$NC_proc= -3
##$NLEV= 6
##$NOISF1= 0
##$NOISF2= 0
##$NSP= 0
##$NTH_PI= 0
##$NZP= 0
##$OFFSET= 16.522
##$PC= 1
##$PHC0= -110.831
##$PHC1= 2.6471
##$PH_mod= 1
##$PKNL= yes
##$PPARMOD= 0
##$PSCAL= 4
##$PSIGN= 0
##$REVERSE= no
##$SF= 250.13
##$SI= 32768
##$SIGF1= 0
##$SIGF2= 0
##$SINO= 400
##$SIOLD= 32768
##$SREGLST= <1H.CDCl3>
##$SSB= 0
##$STSI= 32768
##$STSR= 0
##$SW_p= 5175.98343685301
##$SYMM= 0
##$S_DEV= 0
##$TDeff= 65536
##$TDoff= 0
##$TI= <Analysis number 999999
Compound Code 99
Book Reference 9
Project Code 9>
##$TILT= no
##$TM1= 0
##$TM2= 0
##$TOPLEV= 0
##$USERP1= <user>
##$USERP2= <user>
##$USERP3= <user>
##$USERP4= <user>
##$USERP5= <user>
##$WDW= 1
##$XDIM= 32768
##$YMAX_p= 293832217
##$YMIN_p= -114835
$$ End of Bruker specific parameters
$$ ---------------------------------
##NTUPLES= NMR SPECTRUM
##VAR_NAME=  FREQUENCY,     SPECTRUM/REAL,   SPECTRUM/IMAG
##SYMBOL=    X,             R,               I
##VAR_TYPE=  INDEPENDENT,   DEPENDENT,       DEPENDENT
##VAR_FORM=  AFFN,          ASDF,            ASDF
##VAR_DIM=   32768,         32768,           32768
##UNITS=     HZ,            ARBITRARY UNITS, ARBITRARY UNITS
##FACTOR=    0.157963299565203, 1,           1
##FIRST=     4132.6476996994, 0,             0
##LAST=      -1043.33573715361, 0,           0
##MIN=       -1043.33573715361, -114835,     0
##MAX=       4132.6476996994, 293832217,     0
$$ Real data points
##PAGE= N=1
##DATA TABLE= (X++(R..R)), XYDATA
$$ [...]
15877g101k422n599K9774J028j6148o298J4887K8909J4331j3951m9368q934k917
15864b3809N470K7173K0498K640j0314j1250J2957L238N352K088L7265J7971k1500
15851F7779m238O789q397l3409j1123k7969j7523p619K3471N7182J3858q102q540
15838D2159k6116k2847j6495N800K0825m303k3979k392J6812J9382L1370r480
15826C0736J798J5347N779l1183r13K8059L974p094M892O868k4307k5323k1491
15813a2858k2082Q885j4612K9137Q731L055j0772Q912m657k2447K4735P29l71
15800c615N202J967o519J4933J3221p895K864q235k7338j0697J0927J9140k7015
15787b3060j2457L5601J5088M532K0433K2572J668j2587k1967k2978j1573N134
$$ plain form
15877 -7101 -9523 -15122 14652 15680 -468 -6766 8121 37030 51361 37410 -11958 -20892 -23809
15864 -23809 -18339 8834 29332 31972 21658 10408 23365 26603 31955 34043 71308 89279 67779
15851 67779 63541 70330 61933 28524 17401 -10568 -28091 -35710 -12239 44943 58801 50699 42159
15838 42159 16043 -6804 -23299 -17499 3326 -977 -24956 -27348 -10536 8846 40216 30736
15826 30736 32534 47881 53660 22477 21564 49623 53597 46503 51395 58263 33956 8633 -12858
15813 -12858 -34940 -26055 -40667 -11530 -2799 256 -10516 -1604 -6261 -28708 -3973 -3244 -3615
15800 -3615 1587 3554 -2965 11968 25189 17294 20158 11923 -15415 -26112 -15185 3955 -23060
15787 -23060 -35517 84 15172 19704 40137 62709 64377 51790 29823 6845 -4728 406
15775D06M4907p963k4723J3832n210J8105l1611O088k1820k4546l026j5766J4553
15762c6774J7450L2434L8078j2923m6375k5750K288K2006p626M086j5606M151
15750b4561j4040J0364M0429K4479m205o253L175p387l6230Q306K999m3888k0895
15737f7707J2042K4856K5083p687l4753J2574J9899K3182J0877K5146r194m6416
15725a2098l4801J6362K6963J729J8610q098k3826k3662r114N096K9068l473K1744
15712D500k5293l4073K5807M2667J0320j9508j6425J2703p421p082k5266J624
15700c7447P971M6537L1761M114k3436k2547L0981O023m816j0408K610j9266q256
15687C821j1373N232K7564j0322J8789K4664K3536k2797n1954l5956M138P637
$$ plain form
15775 406 45313 37350 12627 26459 21249 39354 7743 13831 -7989 -32535 -35561 -51327 -36774
15762 -36774 -19324 13110 51188 38265 -8110 -33860 -31572 -9566 -17192 -13106 -28712 -24561
15750 -24561 -38601 -28237 12192 36671 32466 26213 29388 22001 -14229 -5923 -2924 -46812 -67707
15737 -67707 -55665 -30809 -5726 -13413 -48166 -35592 -15693 7489 18366 43512 34318 -12098
15725 -12098 -46899 -30537 -3574 -1845 16765 8667 -15159 -38821 -47935 -42839 -13771 -17244 4500
15712 4500 -20793 -54866 -29059 13608 23928 4420 -12005 698 -6723 -13805 -39071 -37447
15700 -37447 -29476 17061 48822 52936 29500 6953 37934 43957 39141 28733 31343 12077 3821
15687 3821 -7552 -2320 25244 14922 33711 58375 81911 59114 7160 -28796 -24658 -17021
15675a7021L8781K4069K776j6019p803K6414L15Q77j430r416j7291k7249j4562
15662a7559O803J1544K3407P718J590j7562m322L859J8298J641m053k3705j3836
15649f177J0241J1167J8150J6036l6971n432l4297l1188j0901P017J8333J147
15637d2875J298J1355J7537L1530j8002j5123j7143o221M2538L8753K5370J0365
15625G9382l4818l9453j6406J1259m261k1545k51J6602J3007k977J3328r021p664
15612b818J4880J2613j3161m319m848J4946j9316J7760J1562m9120q257K6582
15600c496o119j8994j0175q497j4750K3175N1405m740j3819L4215J0238k8052
15588A0391J8235M580M750j1173l043j5996l1136l065M291J4575K0562k6560j2125
$$ plain form
15675 -17021 21760 45829 48605 32586 24783 51197 51512 52389 50959 41543 24252 -2997 -17559
15662 -17559 -10756 788 24195 31913 33503 15941 11619 15478 33776 35417 31364 7659 -6177
15649 -6177 4064 15231 33381 49417 12446 7014 -27283 -58471 -69372 -62355 -44022 -42875
15637 -42875 -41577 -30222 -12685 18845 843 -14280 -31423 -37644 4894 43647 69017 79382
15625 79382 44564 5111 -11295 -36 -4297 -25842 -26093 -9491 3516 539 13867 4846 -2818
15612 -2818 12062 24675 11514 7195 2347 17293 -2023 15737 27299 -21821 -30078 -3496
15600 -3496 -9615 -28609 -38784 -47281 -62031 -38856 12549 7809 -6010 28205 38443 10391
15588 10391 28626 33206 37956 26783 23740 7744 -23392 -26457 -22166 -7591 12971 -13589 -25714
15575b5714J005J0350J9781j9802l7441m420K877M267K9171R03J086N1157J8352
15562E1572K9306K7245p310q158j3550k0163K445j2206m359q770o619m3809m767
15549a9143q523j389K4134M4873J7177k6019j0910j4449K037j187L599k103n640
15536B457J6862K107p684P765n002M189j6050j8280k3896j251J80p809L2324j1476
15522b5564p234M698J6949J6011r013R437j2601j6502L912j3887J9738O318J4251
15509F513M985K515j0722k414M6145r636m0913m2831j3721j7647L2037L4539L4419
15496B3269L444j8896J0261L772J3440l1790k539j2927k749j0112Q564L5883j2084
15483G536j8308L690J8352Q508k0031j5446n423r189J4160J859K1941K3193J1681
$$ plain form
15575 -25714 -24709 -14359 5422 -14380 -51821 -56241 -53364 -49097 -19926 -19023 -17937 33220 51572
15562 51572 80878 108123 100813 92655 79105 58942 61387 49181 44822 36052 29433 -14376 -19143
15549 -19143 -27666 -29055 -4921 39952 57129 31110 20200 5751 7788 6601 10200 8097 2457
15536 2457 19319 21426 13742 21507 16505 20694 4644 -13636 -37532 -38783 -38603 -46412 -14088 -25564
15522 -25564 -32798 -28100 -11151 4860 -4153 5284 -7317 -23819 -19907 -33794 -14056 -7738 6513
15509 6513 11498 14013 3291 877 47022 37386 -3527 -46358 -60079 -77726 -45689 -11150 23269
15496 23269 26713 7817 18078 21850 35290 3500 961 -11966 -14715 -24827 -16263 19620 7536
15483 7536 -10772 -7082 11270 19778 -253 -15699 -21122 -30311 -16151 -14292 7649 30842 42523
15470D2523O685j3883k3969k0521k212j1393q8N583R79J2903m059k4654p788J835
15456c8059K1567K5022L0050J3602k9764j375o26Q734j7462j1778J8931j085k5536
15443g779j8736r881K3330L5356p483j6043o478J6765J2011O31l2394l1763n200
15430d7664J7980J1243K8921K4922J6544k3267j3847m2092j2068L0634P194J659
15418A59l335J4059l321Q224o559r913k3493O604j0859K551J7951l3703j8590
15405f0225O718M933J5212J3228K4562R575m350n605K366R02J3375K550K2646
15392D5887k8044j9010j8398n47K3331m7675L688K3635k4086m269K0721l988N0055
15379B1300P966N023o661k8919J146J726J0619P720k408r949j5548j4025Q798
$$ plain form
15470 42523 49208 35325 11356 -9165 -11377 -22770 -22858 -17275 -16296 -3393 -7452 -32106 -39894 -38059
15456 -38059 -16492 8530 38580 52182 22418 21043 20417 29151 11689 -89 18842 17757 -7779
15443 -7779 -26515 -36396 -13066 22290 14807 -1236 -7714 9051 21062 21693 -10701 -42464 -47664
15430 -47664 -29684 -18441 10480 35402 51946 28679 14832 -27260 -39328 -8694 -1500 159
15418 159 -3176 10883 7562 15786 9227 -686 -24179 -17575 -28434 -25883 -7932 -41635 -60225
15405 -60225 -53507 -48574 -33362 -20134 4428 14003 9653 4048 6414 7316 20691 23241 45887
15392 45887 17843 -1167 -19565 -20112 3219 -44456 -40768 -17133 -41219 -45488 -24767 -28755 21300
15379 21300 29266 34289 27628 -1291 -145 1581 12200 19920 17512 7563 -7985 -22010 -13212
15366a3212R909K671K6636J5287k1798k5583k3096J0377J8749L0328O667k3833
15354A3102o368k41K2384K2766j8165j9409J3154j4864k2541L3496K1159J3569
15342E8042j4580k2523K3644j3634j5332r927k6077j111Q121o544j1536J424k0389
15329e0422l0848Q72K7492J8017m237N780K7174M4840J2713r921j1547L4603M1759
15316A06275l7623m9278p204K954j8444r322K6931K1504L038R441j2567l9153
15304c448p563J0254J1740o260m2965o319L9613K6505l4217l0703K815J1617j0083
15291c9014m746Q694L939J6710j7904k2102K1142J8595K4416L0561j8299l1495
15279i503J9326O636j7232O13J9931J7036o235l6700N541K716k965P509k9200
$$ plain form
15366 -13212 -3303 -632 26004 41291 19493 -6090 -29186 -18809 -60 30268 36935 13102
15354 13102 6734 6493 28877 51643 33478 14069 27223 12359 -10182 23314 44473 58042
15342 58042 43462 20939 44583 30949 15617 5690 -20387 -21498 -13377 -19921 -31457 -30033 -50422
15329 -50422 -81270 -80398 -52906 -34889 -39126 -33346 -6172 38668 51381 41460 29913 64516 106275
15316 106275 68652 19374 12170 15124 -3320 -12642 14289 35793 38831 48272 35705 -3448
15304 -3448 -11011 -757 10983 4723 -38242 -44561 -4948 21557 -12660 -43363 -40548 -28931 -39014
15291 -39014 -43760 -35066 -31127 -14417 -32321 -54423 -33281 -14686 9730 40291 21992 -9503
15279 -9503 9823 16459 -773 -160 19771 36807 30572 -6128 -587 2129 -836 6673 -22527
15266b2527j2036l597J0285K233O292j0112j0016L624J5670L9018J0014K0805
15254D9653r747l6894j7359M367J87K2484q977p617L2487j6377k2428M2415K0985
15241E3179n347j1655j5304j6645q780l9005k8825J9898L4337M3492o373m11j3387
15228E174l5548l46L4965J0005j48K889k653j2722l0814r64Q586K0145J9016j2025
15214E560j6582j6959k876K6804J2390l797j1768J8134J9945O519j6731k8913
15202h274j6213l224q71j778O854J1107Om218K5859l420m2651o981J3858J1466
15188a8480K7170J7957j8122o845j235j4770L769k6042j4149j1110J5786K0842
15176b5229L607K5683Q654o733J4303J4119l17j6115k4032N589M505J5630J704
$$ plain form
15266 -22527 -34563 -38160 -27875 -25642 -19350 -29462 -39478 -35854 -20184 18834 28848 49653
15254 49653 39906 3012 -14347 -9980 -9793 12691 3714 -3903 28584 12207 -10221 32194 53179
15241 53179 47832 36177 20873 4228 -4552 -43557 -72382 -52484 -18147 25345 18972 18561 5174
15228 5174 -30374 -30720 4245 14250 14102 16991 14338 1616 -29198 -30162 -21576 -1431 17585 5560
15214 5560 -11022 -27981 -30857 -4053 8337 4540 -7228 10906 30851 37370 20639 -8274
15202 -8274 -24487 -27711 -28582 -30360 -23506 -12399 -12393 -16611 9248 5828 -36823 -43804 -29946 -18480
15188 -18480 8690 26647 8525 1680 445 -14325 -10556 -36598 -50747 -61857 -46071 -25229
15176 -25229 -21622 4061 12715 5982 20285 34404 34087 17972 -6060 -471 4034 19664 21368
15163B1368k3731n651L2676K4767k3635n3220o507K2070j6364K8384K7827k2243
15151E741l4866k432m925R077J3607O387m453k5353j6527m292M60K1803J0112
15138b5661J540K788P649M863M5584L4665m342o3904l7067M0822m525m867J5616
15125A3161J9743M800l2711N993L502n408j3651L0425K2690k3416O716k2499m791
15112D554J9571J8453l6403l9620J6045o297J611O001j9412K642K8473K1124j4392
15099B350l5480j7949Q384L4J1435Q122N130k1161k7634j2908K5815M0649M687
15086h526P610K50K118j4608J0480k4260k7158p488J5612K4538K9648K2239J1074
15073D1529k6613j1409K1129j2604k7657k2081j5295Q201J2056K0915j0705j751
$$ plain form
15163 21368 -2363 -8014 24662 49429 25794 -27426 -33933 -11863 -28227 157 27984 5741
15151 5741 -29125 -31557 -36482 -27405 -13798 -7411 -11864 -37217 -53744 -58036 -57576 -35773 -25661
15138 -25661 -24121 -21333 -13684 -8821 36763 71428 67086 3182 -33885 6937 2412 -2455 13161
15125 13161 32904 37704 4993 10986 14488 9080 -4571 25854 48544 25128 31844 9345 4554
15112 4554 24125 42578 6175 -33445 -17400 -23697 -22086 -16085 -35497 -32855 -4382 16742 2350
15099 2350 -33130 -51079 -42695 -42661 -31226 -23104 -17974 -39135 -66769 -79677 -53862 -13213 -8526
15086 -8526 -916 -666 1452 -13156 -2676 -26936 -54094 -61582 -45970 -21432 8216 30455 41529
15073 41529 14916 3507 24636 12032 -15625 -37706 -53001 -44800 -32744 -11829 -22534 -24285
15061b4285K3987L8923J760k1744k7L023k1246q459l8214j0057K5215P382L506
15048b0236j4290K803L5265l654M893L104k9698j9413K1259n135l3877K1034q623
15035d6568k1139l822P211J267r02j1981k8133L9735O1464J437K371l963R088
15022F065J7111m1991m6317R846J5890J9963L6799K3352J9586j7845k8876Q152
15010B1735j2036K69N949n395J1714K058k227j3058j7415k9259R530K3810J2264
14997G939M157p177R648j4653l0741K771L0451K7745k919m8645J4331R415n071
14984b749r479k5188K0451M2958l0087j8407J7806J2031k3484L8292l1271R86
14972h141j1361K072J3492R988o095J3471k1261k075q345K325L0361J7787j1311
$$ plain form
15061 -24285 -298 38625 40385 18641 18614 21637 391 -8068 -46282 -56339 -31124 -23742 -20236
15048 -20236 -34526 -31723 3542 -112 4781 7885 -21813 -41226 -19967 -25102 -58979 -37945 -46568
15035 -46568 -67707 -71529 -64318 -63051 -63953 -75934 -104067 -64332 -2868 -1431 940 -3023 6065
15022 6065 23176 -18815 -65132 -55286 -39396 -19433 17366 40718 60304 42459 13583 21735
15010 21735 9699 9968 15917 10522 22236 24294 22067 9009 -8406 -37665 -28135 -4325 7939
14997 7939 12096 4919 14567 -86 -30827 -28056 2395 30140 27221 -21424 -7093 2322 -2749
14984 -2749 -12228 -37416 -16965 25993 -4094 -22501 -4695 7336 -16148 22144 -9127 -8141
14972 -8141 -19502 -17430 -3938 6050 -45 13426 -7835 -9910 -18255 -15930 14431 32218 20907
14959B0907L640O869k4545O799l304j5358j4529r945k047l356J4500K1062m496
14946c803R853l353k6455J75j3505K761j4636j353K6875K2789j3756J5982J0456
14933A2030r237k6552j710j4784P51J2700J5126J3074n715m490Q89Q585k2049
14920b1382j0057j0326L1714J3786J956k7736m8762r853J8725J0802K0024J9762
14908a1347k9099j2257L4649J1455L1350l184k9261k541j0070k5427L553J0187
14896c1992L225j884K2833k630K4972R891j8478j9261p764l1038K64K0976K0824
14883a0062j3874M3311J5772k1664p150l5563P444O250L2611J8896j2987N987
14871B8971k0484R392j5583n821R630k9354l935j9800o76L946l97m959M419L1475
$$ plain form
14959 20907 24547 31416 6871 13670 10366 -4992 -19521 -29466 -31513 -34869 -20369 693 -3803
14946 -3803 6050 2697 -23758 -23583 -37088 -34327 -48963 -50316 -23441 -652 -14408 1574 12030
14933 12030 2793 -23759 -25469 -40253 -39502 -26802 -11676 1398 -4317 -8807 -7918 667 -21382
14920 -21382 -31439 -41765 -10051 3735 5691 -22045 -70807 -80660 -61935 -51133 -31109 -11347
14908 -11347 -40446 -52703 -18054 -6599 24751 21567 -7694 -10235 -20305 -45732 -42179 -31992
14896 -31992 -28767 -30651 -7818 -10448 14524 24415 5937 -13324 -21088 -52126 -51862 -30886 -10062
14883 -10062 -23936 19375 35147 13483 6333 -29230 -21786 -15536 17075 35971 22984 28971
14871 28971 8487 17879 2296 -3525 6105 -23249 -27184 -46984 -47660 -43714 -44111 -49070 -44651 -13176
14857a3176K890j1866k2652L1972J2153L0513L644k4726k3523j1675l826J0072
14845b0200R022j4639J2643K5606k436j3543m1655O946L4373J8795J0816k0980
14833D748r487j3526m5012J1143N5384L2559p8l0557m594j440k0775J9199j1954
14820a4390k608J1983o688k1192n262K2619K8979J3847k8755j1139j7800j0985
14808d1391K9720J8720M274j4823K7383J3667l6590l200K0948p551k4876O725
14796f994J3845J5991l248J4453K0465R54j9347k2657l2849J975j3801o973L255
14783c4931K999m021N980K413k3176J3973J9590K502P614K9021J6122j2951j0844
14770A4291Q066j8626k8627J4071P45J1101m842J162N649J8289K6641L7913j8419
$$ plain form
14857 -13176 -10286 -22152 -44804 -12832 -679 29834 33478 8752 -14771 -26446 -30272 -20200
14845 -20200 -11178 -25817 -13174 12432 9996 -3547 -45202 -38256 -3883 14912 25728 4748
14833 4748 -4739 -18265 -63277 -52134 3250 35809 35731 5174 580 -860 -21635 -2436 -14390
14820 -14390 -16998 -5015 -11703 -32895 -38157 -15538 13441 27288 -1467 -12606 -30406 -41391
14808 -41391 -11671 7049 11323 -3500 23883 37550 960 -2240 18708 11157 -13719 -6994
14796 -6994 6851 22842 19594 34047 54512 55466 36119 13462 -19387 -17412 -31213 -38186 -34931
14783 -34931 -31932 -35953 -29973 -27560 -50736 -36763 -17173 -14671 -7057 21964 38086 25135 14291
14770 14291 22357 3731 -24896 -10825 -10080 1021 -3821 -2659 2990 21279 47920 85833 67414
14757F7414j5901j8687l1756k9718j7537j389J0717J5816O549q959j2068J3304
14745b2215R293j545l6938k015M3867O3537k0231m0431J0585k059m0900L3455
14733e597M7216Q23p2478j3894j46J1901L4413N871n033J4974P321j3271k634
14720I466r505P127j3279O067O514M8741K8748n5915k9438K6716k2924R227L22
14707A1867L659J3944K041k1056n865K636k156k981m023o510p265j6729O280j9008
14693d5166P15L3772j3997N800N181J6513p37j2585L2187K1929k3564k3861j0563
14680a4376N209J0114L3790o145k6397k275o768o027R865o905J4224J1131K3387
14667C8827j7296j7021K6403k315J2794j3066j0378m6529Q059K5597p600k4941
$$ plain form
14757 67414 51513 32826 1070 -28648 -46185 -47574 -36857 -21041 -14492 -23451 -35519 -22215
14745 -22215 -12922 -14467 -51405 -53420 -9553 53984 33753 -6678 3907 1848 -39052 -5597
14733 -5597 41619 42442 -30036 -43930 -44076 -32175 2238 8109 3076 18050 25371 12100 9466
14720 9466 -39 7088 -6191 -124 6390 55131 83879 27964 -1474 25242 2318 11545 11867
14707 11867 15526 29470 31511 10455 4590 7226 5070 2089 -1934 -8444 -15709 -32438 -26158 -45166
14693 -45166 -44451 -10679 -24676 -18876 -13695 2818 2081 -10504 21683 43612 20048 -3813 -14376
14680 -14376 -9167 947 34737 28592 2195 -80 -6848 -12875 -3010 -9915 4309 15440 38827
14667 38827 21531 4510 30913 28598 41392 28326 17948 -28581 -20522 5075 -2525 -27466
14655b7466L2028L900m3505n543J8353J2002K3153o351J4128J2000l1620l3407
14643c2328K452J2703O595J7886J3360N3281L3175p925K859p280j522k9501k1219
14630D2536o5846j1631K3480j041L5914J0245J440k5173p746K0700q256j4857
14618b35k1499j369K7731m17p863K4420J9471N193p064k5483k6925j2891K7636
14605G05K0320j856j615J6652J3739k3178m335l747j9453J6569J2269j0484k9736
14592a4150K23j647K57J108K9570J9728N601J3120R641k6980k8945L698J9804
14579C1028j3489m058j3412k748k7700q346K2797L0151j925l0649r00J3257J9025
14566A3031l0120L632l8616n999L4893N0277j1566j4971k4862J327R862k502q785
$$ plain form
14655 -27466 4562 8462 -35043 -40586 -22233 -10231 12922 6571 20699 32699 1079 -32328
14643 -32328 -29876 -17173 -10578 7308 20668 73949 107124 99199 102058 94778 93256 63755 42536
14630 42536 -23310 -34941 -11461 -12502 23412 33657 35097 9924 2178 22878 14622 -235
14618 -235 -21734 -23103 4628 4211 -3652 20768 40239 45432 38368 12885 -14040 -26931 705
14605 705 21025 19169 17554 34206 47945 24767 20432 16685 -2768 13801 26070 15586 -14150
14592 -14150 -13927 -15574 -15317 -14209 15361 35089 40690 53810 63451 36471 7526 11224 31028
14579 31028 17539 13481 69 -2679 -30379 -38725 -15928 14223 12298 -18351 -19251 -5994 13031
14566 13031 -17089 -13457 -52073 -58072 -23179 27098 15532 561 -24301 -22974 -13112 -15614 -24399
14553b4399J0344K7277J0290P934m5492k5328J5816m137N137J7179L1616o660
14541A9577q718J3351j0786o863J8760K7402O651J8175j2283j5773R292Q119l86
14528F6518L4727N0773L2448M2534N1276N3987K0923j0201K976j510n3049l2127
14516B59275J5142M2610L8083O752r01q336l0021j5688m4732n7031l9927m0498
14504A24728l2827J3739j6258j3009J2342j9277L172N683k5082m3143k1435n145
14492a6512q374l298l562Q414L4513J0362r319J3684J72J4032m383N915P404k3217
14478B5831J3525n328j320J5008l0339l5314j3334K0592R31r874J1861M3528k1087
14465A4680k2974J0845o290J9305j4381m661L5315K894m301l0922J6329m963k1570
$$ plain form
14553 -24399 -14055 13222 23512 31446 -14046 -39374 -23558 -27695 -22558 -5379 26237 19577
14541 19577 10859 24210 13424 6561 25321 52723 59374 77549 65266 49493 58785 66904 66518
14528 66518 101245 152018 184466 227000 278276 332263 353186 342985 345961 344451 291402 259275
14516 259275 274417 317027 355110 361862 360961 352625 322604 306916 262184 205153 165226 124728
14504 124728 91901 105640 89382 76373 88715 69438 72610 78293 53211 10068 -11367 -16512
14492 -16512 -24886 -28184 -31746 -23332 11181 21543 12224 25908 26080 40112 35729 41644 49048 25831
14478 25831 39356 34028 32708 47716 17377 -17937 -31271 -10679 -9748 -19622 -7761 35767 14680
14465 14680 -8294 2551 -3739 15566 1185 -3476 31839 34733 30432 -490 15839 10876 -10694
14452a0694J9146r847n222l0535P16j7852l472R419J6445J4890J9010k092l010
14439c098n443o55R412Q896M63J0975j2758j1420Q908K8646K5952k1411m0009
14426a542j3008Q347k5142k4857n920r657K9568k105j7033j6623K6116k527p666
14413f2049L242Q257N453K2515L1925j3295k1932K1891K608k6122k6977R940l023
14400d7567J4918J1330R560k4556k2594r538J9108J5238L2363K5176k9818j2849
14388a9229J0996J1756K254J3072O485k4738l085J4218K2066R753n859n321q453
14375B3915R793M303o750j4433j3596k3996j1158L177O499P132L6839J809k442
14362B1092k7528L931J325p259j4046J241Q604r25J3820K3113k4133l7108M7074
$$ plain form
14452 -10694 8452 -1395 -6617 -37152 -36436 -54288 -57760 -48341 -31896 -17006 2004 -88 -3098
14439 -3098 -8541 -9196 216 9112 9575 20550 7792 -3628 5280 33926 59878 38467 -1542
14426 -1542 -14550 -6203 -31345 -56202 -62122 -71779 -42211 -44316 -61349 -77972 -51856 -54383 -62049
14413 -62049 -58807 -50550 -45097 -22582 9343 -3952 -25884 -3993 -1385 -27507 -54484 -44544 -47567
14400 -47567 -32649 -21319 -11759 -36315 -58909 -68447 -49339 -34101 -1738 23438 -6380 -19229
14388 -19229 -8233 3523 5777 18849 25334 596 -2489 11729 33795 43548 37689 32368 23915
14375 23915 33708 38011 31261 16828 3232 -20764 -31922 -28745 -22246 -15114 21725 23534 21092
14362 21092 -6436 -2505 -1180 -8439 -22485 -21244 -12640 -13565 255 23368 -765 -37873 9201
14349I201J9292j516K296k4768Q163L1587L1914k2557j401J1988Q437L4892L3844
14336A41372J1079J0579j9501l1105j4565l0705k7016j8519n848r505L221J6940
14324B6427n215k1202L149M39K639J8956j0639P43J1598L399N170L902n502K1580
14310E5444M102Q877k4316l4706J8852K1208J8147n675k5615J906J0649m8073
14298H00n1012j0543K2183r9j1758j6609L7229J6344o33j6450Q122K3160L7348
14285C8082N640p083L0956j577j9977l2365k1596J8630k9639K2654K4420N290
14273C3435j739k0809j4581k197q329N895Q500n716R078J3955k3056k0820J7417
14260h967n591J0536r955J0644L1118l2718k7507r227M0550K0338k970J6137m950
$$ plain form
14349 9201 28493 26977 29273 4505 12668 44255 76169 53612 52211 64199 72636 107528 141372
14336 141372 152451 163030 143529 112424 97859 67154 40138 21619 15771 6266 9487 26427
14324 26427 21212 10 3159 3598 6237 25193 14554 15297 26895 30294 35464 39366 33864 55444
14310 55444 59546 68423 44107 9401 28253 49461 67608 61933 36318 38224 48873 800
14298 800 -50212 -60755 -38572 -38671 -50429 -67038 -29809 -13465 -14098 -30548 -22426 734 38082
14285 38082 43722 36639 67595 66018 46041 13676 -7920 10710 -18929 3725 28145 33435
14273 33435 31696 10887 -3694 -5891 -14220 -8325 175 -5541 3537 17492 -5564 -26384 -8967
14260 -8967 -14558 -4022 -13977 -3333 27785 -4933 -32440 -41667 -1117 19221 16251 32388 27438
14247B7438k3179l2597j7247J3225J5878J9915j4524j7973j356m109O424j1561
14235c9666J6094K0622m028J052p203k0769J6144O83q561K6523K0872m485M618
14222B1896K323k975K247l248N27K3147J5280m2471r735l5067j3973N1607K2566
14209C2124j7950J4774j7972O223J5869M869j2940l6418j1606K6201N462O14J2485
14196B1735r771j3882K4629J7492l1504N111K1136J6301k4070p782Q983O577j3633
14183B1322k663j116l541j2109J3698j3490m7723n753K2791M8674q988k8843L120
14170a4621M2391J1180r882L7682K662r573Q229n5836m0550j910L5928J1891k619
14157A4972N838N146r910l0487J5660K4850K8622o341l6607k6568L2323j8278
$$ plain form
14247 27438 4259 -28338 -45585 -32360 -16482 3433 -11091 -29064 -30420 -34529 -28105 -39666
14235 -39666 -23572 -2950 -6978 -5926 -13129 -33898 -17754 -17071 -25632 891 21763 17278 21896
14222 21896 24219 21244 23491 20243 20770 43917 59197 16726 6991 -28076 -42049 9558 32124
14209 32124 14174 28948 10976 17199 33068 37937 24997 -11421 -23027 3174 8636 9250 21735
14196 21735 11964 -1918 22711 40203 8699 13810 34946 51247 27177 19395 28378 34955 21322
14183 21322 18659 17543 14002 1893 15591 2101 -45622 -51375 -28584 20090 11102 -17741 -14621
14170 -14621 27770 38950 29068 66750 69412 59839 68068 12232 -28318 -30228 5700 17591 14972
14157 14972 20810 25956 16046 -14441 1219 26069 54691 48350 11743 -14825 17498 -780
14145g80L3531L6090k2j2013o781o295k0598J24M9549K1213o255M321M093j346
14131I4831r683j9879l2441k803J5998L6898q223J3136k9052j0966L0193N3217
14119A31226r746j7846J1162Q841K5461q143l1070j9774R510K4731K0309L28j5140
14106A29849m8141P532N487k854P556l0945l1984j1490J0417K6095K3304Q354
14094I3180j2550j3890k3678j41M54J8705J9515k7040j9755N34j9047P369k7866
14081d210q293L7007M6304L0242j7003k0919k0157j6699j4685o605k289l3604
14069c0911j128K2101J3160R727j0438K7429J6624m943q436J5010K0894p483l0879
14056C0727m3461k2655k1500P994L0832L9819o324l7535k273K2671M290J3462
$$ plain form
14145 -780 32751 68841 68819 56806 50025 43730 23132 23256 72805 94018 87763 92084 96177 94831
14131 94831 85148 65269 32828 30025 46023 82921 74698 87834 58782 47816 78009 131226
14119 131226 121480 103634 114796 123637 149098 140955 109885 90111 99621 124352 144661 144989 129849
14106 129849 81708 89240 94727 91873 99429 68484 36500 25010 35427 61522 84826 93180
14094 93180 80630 66740 43062 42921 43375 62080 81595 54555 34800 35334 16287 23656 -4210
14081 -4210 -12503 24504 70808 101050 84047 63128 42971 26272 11587 4982 2693 -30911
14069 -30911 -32039 -9938 3222 12949 2511 29940 46564 41621 33185 48195 69089 61606 30727
14056 30727 -12734 -35389 -56889 -48895 -18063 21756 15432 -22103 -24376 -1705 2585 16047
14044A6047J7098k2546l1750L212J3432R122K2353L4010p515j0716j6641m522
14032B1584n585j5527J4691J3655J1430j285L53k78j0370L223J0942p465j4639
14019B0729M736j8182l491R545K0376R015k6329l2764N500J0665l821l0576k1252
14006e5849l5923J6740M1994L3460K4656j6658N892R666L106j3388R033K4227
13994D6956M5271M0714N6080P4871Q7101L8428K2098k9269o6065q3285n4621k2444
13982A55835k5676k9991l2258j9327p015l1610Q29j6049j7993p323K4537L5510
13970B9469j995j546P728j2095j0009L876k1694k4535q753n109J1585O566M811
13957b1701n422K8513K8272l718K520M319k0917k0222j3094J5591n912k3235P48
$$ plain form
14044 16047 33145 10599 -21151 -17939 -4507 4615 26968 60978 53463 42747 26106 21584
14032 21584 15999 472 15163 28818 40248 38963 39316 39038 28668 31891 42833 35368 20729
14019 20729 25465 7283 3792 13337 33713 42728 16399 -16365 -10865 -200 -4021 -34597 -55849
14006 -55849 -91772 -75032 -33038 422 25078 8420 14312 23978 27084 13696 22729 46956
13994 46956 92227 132941 189021 263892 350993 389421 411519 382250 316185 232900 178279 155835
13982 155835 130159 100168 67910 48583 41568 9958 10787 -5262 -23255 -30578 -6041 29469
13970 29469 27474 25928 33656 21561 11552 15428 -6266 -30801 -39554 -44663 -33078 -26512 -21701
13957 -21701 -27123 1390 29662 25944 28464 32783 11866 -8356 -21450 -5859 -11771 -35006 -34258
13944c4258R100J518K2593J8819l7461k1213L7271J3055J0712r205Q812J8387
13932C8130r210j9604J3826K704j734j0762j5631R973j413j1532k8588j1277J0110
13919c5008K5497K3634L6680o730m3614P675J6425J084n428l564J1527K7657l971
13906E1864l5873l7990q59N597J5957j514l221j8625l786K3274J1527K2784m513
13893B4622l110k377N2561K5949P037J8372K3964J2652k428K0749m329K7494j1376
13880A89780l0980p2374l0435O9J7386K2405n8009l7963K956N662j1059j1742
13868a4304j949r67k6418l458L7484J2038q805l8508Q45L7472K7558J8852l588
13855C6252M90o574k171o339j2339j7713n065O145L1105q365l7650k0678q213
$$ plain form
13944 -34258 -25158 -23640 -1047 17772 -19689 -40902 -3631 9424 20136 10931 19743 38130
13932 38130 28920 9316 23142 25846 24112 13350 -2281 7692 6279 -5253 -33841 -45118 -35008
13919 -35008 -9511 14123 50803 44073 459 8134 24559 25643 20215 16651 28178 55835 51864
13906 51864 15991 -21999 -22858 -17261 -1304 -2818 -6039 -24664 -28450 -5176 6351 29135 24622
13893 24622 21512 19135 71696 97645 104682 123054 147018 159670 157242 177991 173662 201156 189780
13880 189780 158800 86426 55991 56060 73446 95851 37842 -121 2835 8497 -2562 -14304
13868 -14304 -16253 -17220 -43638 -47096 -9612 2426 -6379 -44887 -44042 -6570 20988 39840 36252
13855 36252 36742 30168 27997 21658 9319 -8394 -13459 -7314 23791 15426 -22224 -42902 -51115
13842e1115K9201M6110l1090k2249J6486j5127R356K4546l4426P185K6818j22
13830E573Q420J0254L5526N933k2777l8497j5730J6802N001O70L507K8J1820k7131
13816f01n2115k7645K9157J8129J8085p697j169j990J7168k9475j0479J2338k4790
13803f1084r449L3794K960J1027r37L9395N3727L6083l0513k5950L5019j3583
13791G0489q559N009l8445l1354j6106n208M2951M180j7310M85K1780j6187k2501
13778a0776J0739J0167k4406l5821Q522J0496K9933J6420M3332J0914k7071J1414
13766E3863k0538K8728J227q847j0125k6506j1625k71q985Q113J2113j9659j5659
13753a8171j2465K8759Q93K3453K1030j941K506j0098J5887K2352j1701k4306
$$ plain form
13842 -51115 -21914 24196 -6894 -29143 -12657 -27784 -18428 6118 -28308 -21123 5695 5573
13830 5573 13993 24247 59773 65706 42929 4432 -11298 5504 10505 11175 14682 14710 26530 -601
13816 -601 -52716 -80361 -51204 -33075 -14990 -22687 -23856 -25846 -8678 -38153 -48632 -36294 -61084
13803 -61084 -70533 -36739 -33779 -22752 -23689 15706 69433 105516 75003 49053 84072 70489
13791 70489 61930 66939 28494 -2860 -18966 -24174 18777 22957 5647 6132 27912 11725 -10776
13778 -10776 -37 10130 -14276 -50097 -41575 -31079 -1146 15274 58606 69520 42449 53863
13766 53863 33325 62053 63280 54433 44308 17802 6177 5906 -3079 5034 17147 -2512 -18171
13753 -18171 -30636 -1877 -984 22469 43499 41558 44064 33966 49853 72205 60504 36198
13741C6198k8248Q329m700M166M301m3111L334J4588j945L8795j4979j7665J981
13728A044J1396R572K4002K3405J487l9425j433K6476l5948m307J1495M765p498
13715B5031k0231j1751L1546J1909J0355O720l333n4497j3339N148J2747L2089
13703C2394J5050J4393M0903N0779J4939J5556N4494L2899K0410N1100L0774P0005
13691D43696N9233j052L778k796o6978r1276n5572m2148l4563k0744j2198m784
13679A74596o195l8105J4691J0944j6709m0357j911k0842l9203l597m788K2093
13667E0617N978J1535K62j2563L9029K3231J337L5908N2753M9890N8878O4252
13655C81107N3422P1161M4469k3886p8869p8102m3473k9666m8514l2872o2911
$$ plain form
13741 36198 7950 16279 11579 15745 20046 -23065 -19731 -5143 -7088 31707 16728 -937 1044
13728 1044 12440 22012 46014 69419 70906 31481 30048 56524 20576 16269 27764 32529 25031
13715 25031 4800 -6951 24595 36504 46859 53579 50246 -4251 -17590 -12442 305 32394
13703 32394 47444 61837 102740 153519 168458 184014 238508 271407 291817 342917 373691 443696
13691 443696 502929 501877 505655 502859 435881 344605 289033 246885 212322 191578 179380 174596
13679 174596 168401 130296 144987 155931 139222 98865 96954 76112 36909 33312 28524 50617
13667 50617 56595 68130 68392 55829 94858 118089 119426 155334 208087 257977 316855 381107
13655 381107 434529 505690 550159 526273 447404 369302 325829 296163 247649 214777 151866
13644A51866l2036K1550L662m168k1539j2312j621j6374M87k502j998n97N493
13631H9911j2551j4441P0126L0939K4069n976K1832P4677Q7715O2531L3393J9997
13619D82222L030k5939k7725k9068n2566m1770p2314k3734k6962m0927l9235m822
13607A00190k782Q702l4099j8293o755K306l034o115j7244l2420m78m566N223
13594i365K4235K3527r921m732K8581J6076j3359l734n9229m2663L3584L1688
13582A4688K3524r032j29L037j0749l8860k0819J0429J1764J4030P218j8141j1871
13569b4911K4922o13l913Q687j8747P17k0983r550K0722K0128J6115k921l098
13556F555r935k0613P16J0811m127k5979l1430L251M4186L4080K4274j5640j961
$$ plain form
13644 151866 119830 141380 145042 140874 119335 107023 105402 89028 89515 87013 85015 84418 89911
13631 89911 77360 62919 133045 163984 188053 182077 203909 278586 366301 428832 462225 482222
13619 482222 485252 459313 431588 402520 349954 308184 235870 212136 185174 144247 105012 100190
13607 100190 97408 106110 72011 53718 46963 49269 46235 40120 22876 -9544 -10022 -14588 -9365
13594 -9365 14870 38397 28476 23744 52325 68401 55042 51308 -7921 -50584 -17000 14688
13582 14688 38212 29180 29051 32088 21339 -17521 -38340 -27911 -16147 -2117 5101 -13040 -24911
13569 -24911 11 -602 -4515 4172 -14575 -13858 -34841 -44391 -23669 -3541 12574 9653 6555
13556 6555 -3380 -23993 -23277 -12466 -16593 -42572 -74002 -70751 -26565 7515 31789 16149 14188
13543A4188L2827j9147j5483N078l553j4747j4478j1293p805k7905J808P5396
13531A4886K9285K8715k4180r604j9155j3250q478J205o078j2560K437k3399j4101
13518e4277J2773J1009J3827K1824K5203j1965n557j2788j2498j6628j0336j5676
13506e5089J4003P290o540J0263j7095R944K1833K6234k2033j2520L5547R14k1181
13493h430l4242L0147L5750M1427k2723l008k2710j695N811K916M684J0941L794
13480D2662J0177j1424k954j3885k1560o06K3195R362j6637k5834K8381J3300
13468C4177m179j6262P372j4577K3901j460j7359k6630J989P887k9197q496J2338
13455c0496K3845j752J5564k481R044J3085m434k8749k8329r367K2788l682j6171
$$ plain form
13543 14188 47015 27868 12385 17463 13910 -837 -15315 -26608 -34413 -62318 -60510 14886
13531 14886 44171 72886 48706 39102 19947 6697 -1781 -576 -6654 -19214 -16777 -40176 -54277
13518 -54277 -41504 -30495 -16668 5156 30359 18394 12837 49 -12449 -29077 -39413 -55089
13506 -55089 -41086 -33796 -40336 -30073 -47168 -37224 -15391 10843 -11190 -23710 11837 12751 -8430
13493 -8430 -42672 -12525 23225 64652 41929 38921 16211 14516 20327 23243 27927 38868 42662
13480 42662 52839 41415 38461 24576 3016 2410 25605 34967 18330 -7504 20877 34177
13468 34177 29998 13736 21108 6531 30432 28972 11613 -15017 -13028 -5141 -34338 -42834 -30496
13455 -30496 -6651 -8403 7161 4680 13724 26809 22375 -6374 -34703 -44070 -21282 -24964 -41135
13442d1135M8283N6982J782l0203j9286p001j0125N610K1984J0029k9367j3432
13430e879N433J4584r151J1450L9538l147m4443j9996J268j5003k9720j1960n607
13417g2633M545J2406l375K8930L8671J8438j2517k8989J7736j9718O351J2867
13405B712Q039l8454k8090l053L751J2668j2269O788J1358J2053j1303r583J2343
13392c3040J2771O682r478j0286l2956l2369J6815L5768J722K4161L0030K0387
13380C0207P371j224l6648j0046k741J430L2035k887k6014l0276L9180J5090j1111
13367D366k4961K1743K4455J546p228m1381k5895J6239J1053l1696J2183O868
13355c2708j0073p121R248K6459J6951P253l341q047J912j2396m478k6858J0651
$$ plain form
13442 -41135 7148 64130 65912 35709 16423 9422 -703 4907 26891 36920 7553 -5879
13430 -5879 -446 14138 4987 16437 55975 52828 8385 -11611 -10343 -25346 -55066 -67026 -72633
13417 -72633 -68088 -55682 -59057 -30127 8544 26982 14465 -14524 3212 -16506 -10155 2712
13405 2712 10751 -27703 -55793 -58846 -55095 -42427 -54696 -47908 -36550 -24497 -35800 -45383 -33040
13392 -33040 -20269 -13587 -23065 -33351 -66307 -98676 -81861 -46093 -44371 -20210 9820 30207
13380 30207 37578 36354 -294 -10340 -13081 -11651 20384 17497 -8517 -38793 387 15477 4366
13367 4366 -20595 1148 25603 27149 19921 -21460 -47355 -31116 -20063 -51759 -39576 -32708
13355 -32708 -42781 -49902 -40654 -14195 2756 10009 6668 -1379 533 -11863 -16341 -43199 -32548
13342c2548j4016j0884L0978M5744J5832p018j8285n317P104Q092K195J8672K3665
13329F4214k5595K3183j3183l7295j9156Q184k051k6357J3344K269O813L065q054
13316a0619j9478k395K2623j3423l5855j0864l613L4945K8110J6779L393R14M388
13303A4905o454j3270l3484L976Q646K8353L0173m662J0876J0798j2428l218j6042
13290A8169l2079l60L0125J1226l2613O696J8505o922L011J2556q691O579j9233
13277F969J097r707k493L0521K2598n409j3508j818j676J3027j5942k0831j0410
13264g582j1307k508k1800l167m968L2806M3063L1091K135p558M331Q103o262
13251E6377l2136j4401J0608r392k5680J6504J5558o389M9J7959q025M6431J5872
$$ plain form
13342 -32548 -46564 -57448 -26470 19274 35106 28088 9803 4486 11590 19682 21877 40549 64214
13329 64214 38619 61802 48619 11324 -7832 352 -1699 -28056 -14712 -12443 -5630 -2565 -10619
13316 -10619 -30097 -32492 -9869 -23292 -59147 -70011 -73624 -38679 -10569 6210 9603 10517 14905
13303 14905 8451 -4819 -38303 -34327 -25681 2672 32845 28183 39059 49857 37429 34211 18169
13290 18169 -13910 -14270 15855 27081 -5532 1164 19669 12747 15758 28314 19623 26202 6969
13277 6969 8066 -1641 -4134 26387 48985 43576 30068 28250 26574 39601 23659 2828 -7582
13264 -7582 -18889 -21397 -43197 -46364 -51332 -18526 24537 55628 57763 50205 54536 62639 56377
13251 56377 24241 9840 20448 11056 -14624 1880 17438 11049 11098 29057 21032 67463 83335
13238H3335m6052n335M9515P576q168m6977Q660m106j4275J1448r414q102k1018
13225b913l7491l911k161J9270J8080J4940J1835n747k8607m405M117K402L0409
13212A5818J4653j3198j3559O348K539m653J3723K8339q291k5279j9499L4538
13200C1479O161j6275M6585L5300J406k6336Q914K1235L9113M9330o942k9821
13188A60149n3812l2017l357J3107l1782l6478P61m798p57J9465j6748o788j6106
13175i161j7847n258K1406Q762j4941J9161J5120Q517l0480R869k108k2510J0305
13162i165L6325J091j6920K65K4744O18k1054K3074l632j5930L2270N1362O1474
13149A64522J13128J52059J53723O7337n5106j44854j63147j22460n4527J479
$$ plain form
13238 83335 37283 31948 81463 89039 80871 33894 42554 38448 24173 35621 26207 18105 -2913
13225 -2913 -40404 -44315 -46476 -27206 -9126 5814 17649 11902 -16705 -21110 -16993 -14591 15818
13212 15818 30471 17273 3714 10062 12601 7948 21671 50010 41719 16440 -3059 31479
13200 31479 37640 21365 67950 103250 104656 78320 87234 108469 147582 196912 189970 160149
13188 160149 106337 74320 70963 84070 52288 15810 16571 11773 11016 30481 13733 6945 -9161
13175 -9161 -27008 -32266 -10860 -2098 -17039 2122 17242 25759 -4721 5148 3040 -19470 -9165
13162 -9165 27160 28251 11331 11596 36340 36958 15904 38978 35346 19416 51686 103048 164522
13149 164522 277650 429709 583432 650769 595663 450809 287662 165202 110675 112154
13139A12154m6769L003O052j2038J2855m743L727j9865l5261q172K3947M491r433
13126B9948k0777J1105J4765J2981p544k807P401K6421l4073j3677l4610k225
13114a3092P450m875P025L4737N135k8605m998L1375N1952P9247J18548J20951
13102D04850J54037Q8452k3953j20214j84648j33082p5294j7816J1006k9118j9127
13091E5093k7519l633m969q355j8284q068j150l488p989J6058J2336M573J7310
13078B1915J2672m621j2739J246J5281R49K731m420J3927j6640j8996J2989N6074
13065H0368M5321N0100J4186P906O7274J12007R2759J41562K01866J64328M7443
13054A025120m1170j42977j97304j45051j15662q8841m5173l6260m4615l8457
$$ plain form
13139 112154 65385 68388 74440 62402 75257 70514 74241 54376 19115 10943 34890 39381 29948
13126 29948 9171 20276 35041 48022 40478 37671 45072 71493 37420 23743 -10867 -13092
13114 -13092 -5642 -10517 -3492 31245 36380 7775 2777 34152 86104 165351 283899 404850
13102 404850 558887 647339 623386 503172 318524 185442 110148 92332 103338 74220 55093
13091 55093 27574 23941 18972 10617 -7667 -15735 -16885 -20373 -28362 -12304 32 4605 21915
13078 21915 34587 29966 17227 18473 33754 34703 37434 33014 46941 30301 11305 24294 80368
13065 80368 125689 175789 189975 197881 265155 377162 469921 611483 813349 977677 1025120
13054 1025120 983950 840973 643669 498618 382956 294115 248942 212682 168067 129610
13044A29610j8479J1855N603j8526n7153P274j3877o656j8710l0891N687K2589
13032A8326Q922L371j7253k5288L966K0991k2156j7816N662J8994J5040P318j2114
13019G963q620l602l351j453p306K7136J4572N767L660j2881l0439k4887K271
13006c1170J2732J2039k78M473J2571J8329L252j4150k4339Q036l5383j8972J6604
12993c6256M4041L1291l6765J2783Q610l568K0034k1413l0801J1087L2303K0482
12981E1828N967j6498m643K2374J2071l916k3638N31k946L8948K1029J3122L1062
12968A45291N0209O0752N2648M2618J5193m7218p5134m5974m6127o4725l4224
12957E3309l2201j2563j0645k5821j5070P147J6207L5297J5230J022l3026n105
$$ plain form
13044 129610 111131 122986 128589 110063 52910 60184 46307 39651 20941 -9950 -4263 18326
13032 18326 27248 30619 13366 -11922 -7956 13035 -9121 -26937 -21275 -2281 12759 20077 7963
13019 7963 -657 -4259 -7610 -9063 -16369 10767 25339 31106 34766 21885 -8554 -33441 -31170
13006 -31170 -18438 -6399 -6677 -2204 10367 28696 31948 17798 -6541 1495 -33888 -52860 -36256
12993 -36256 7785 39076 2311 15094 23704 20136 40170 18757 -12044 -957 31346 51828
12981 51828 57795 41297 36654 59028 71099 67183 43545 44076 41130 80078 101107 114229 145291
12968 145291 195500 256252 308900 351518 366711 319493 244359 198385 152258 87533 53309
12957 53309 21108 8545 -2100 -27921 -42991 -35844 -19637 15660 30890 31912 -1114 -6219
12945f219J5485Q156j9526l266j6386j3604N764L998j009p695L543p5J4555L4888
12931A8609J824m4983J8460J6290R611j3807j3014J235K6074J456O509k9733j2759
12918a4228J9012K593n477j7646Q48J5387K3696k9124j654N2755M3322k2873n1480
12905A5131r839K9391P879J0601m222j5674k4591l8851M919j3063J5026N1893
12893B8600J9050j8577k2566N732j1857J338Q56J2808J8845L2682J7373P58j6179
12880F8863l2081j8928L7144K3558j7339k2903l414j3986k1745J844O966k3355
12868a5376K4249K7816m375M855K4944j8356r942K9542P283n386j0183m165j9302
12855C1604K4829O606m655k3043m3867j5541P930J351j0429K7437P8N722K5225
$$ plain form
12945 -6219 9266 17422 -2104 -5370 -21756 -35360 -29596 -25598 -26607 -34302 -30759 -30834 -16279 18609
12931 18609 20433 -24550 -6090 10200 19811 6004 -7010 -5775 20299 21755 28264 -1469 -14228
12918 -14228 4784 7377 1900 -15746 -14898 489 24185 -4939 -6593 46162 89484 66611 15131
12905 15131 5292 34683 42562 53163 48941 33267 8676 -30175 -25256 -38319 -23293 28600
12893 28600 47650 29073 6507 12239 382 1720 2576 15384 34229 66911 84284 85042 68863
12880 68863 36782 17854 54998 78556 61217 38314 34900 20914 -831 1013 7979 -15376
12868 -15376 8873 36689 32314 37169 62113 43757 33815 63357 70640 65254 55071 50906 31604
12855 31604 56433 63039 58384 35341 -8526 -24067 -16137 -14786 -25215 2222 2300 8022 33247
12842C3247k6705k9260k1374J1045K3767J1885J7097Q978o065j7178K360J0019
12830A7816j6875m4025J2829N4417N4971J9602j8069m510k364M975L0674K4049
12818A33490m7983l2822j389J5705n171N185k9142k4054j7448q706k246J2843
12806a738K329n684K4053J5990j3696J012L5252L2906q2o099k39L089n689J5528
12792I6932M961L4354J1153M3122K9390k7910l0677k5517k3180m0731l475J2764
12780H1186k0645j2177P543K0753j3060j6671k2137j2444J0168K1927j206J3056
12768E6293J6392k746K8559K6232J4097q659m037r775J5288K3175J1997n626k8047
12755A33143k1252k1712R59k3574k4987P536O3749K8216N0753M8277N183K3388
$$ plain form
12842 33247 6542 -22718 -44092 -33047 -9280 2605 19702 28680 22615 5437 7797 17816
12830 17816 941 -43084 -30255 24162 79133 98735 80666 76156 73792 78767 109441 133490
12818 133490 85507 52685 51296 67001 61830 67015 37873 13819 -3629 -12335 -14581 -1738
12806 -1738 591 -5093 18960 34950 21254 22266 57518 90424 90342 84243 84004 87093 81404 96932
12792 96932 101893 136247 147400 190522 219912 192002 161325 135808 112628 71897 68422 81186
12780 81186 60541 48364 55907 76660 63600 46929 24792 12348 22516 44443 43237 56293
12768 56293 72685 69939 98498 124730 138827 130168 126131 116356 131644 154819 166816 161190 133143
12755 133143 111891 90179 91138 67564 42577 50113 113862 142078 192831 241108 246291 269679
12743B69679l2307o4573o825j7064j4502o81j8440m637k511J8772J1123Q500l2125
12730A14409l582P609J8411o976k1847j0853J536M6922L6004K1877J1904r693
12718B05721j6139L243k824L7862L4373q358J1048k4271K1562M447k0625K497
12706B48536K2954M3428p392k1668K0013N6031K935j7785P710M0856M5927J0283
12694D51828J6774p702l7431j6252J9296L431K949l553K4704K1244R781P313l497
12681D88885J9154K4865M3777L9320J5897K4458j5285k1452N462J6330J3381L6809
12669F91601P3811R0241Q5597Q1482Q7726N0037O2154Q5166N9828Q5561J41796
12658A595000J94329J97756K20205K64013L08373L30507M24367N20863O08059
$$ plain form
12743 269679 237372 172799 165974 148910 134408 133727 115287 110650 108139 126911 138034 146534 114409
12730 114409 110827 118436 136847 129871 108024 97171 98707 145629 181633 203510 215414 205721
12718 205721 189582 192825 190001 227863 262236 253878 264926 240655 262217 266664 246039 248536
12706 248536 271490 314918 307526 285858 305871 361902 364837 347052 354762 395618 441545 451828
12694 451828 468602 460900 423469 407217 426513 429944 432893 429340 454044 475288 485069 492382 488885
12681 488885 508039 532904 576681 616001 631898 656356 641071 619619 625081 641411 654792 691601
12669 691601 765412 855653 941250 1022732 1110458 1160495 1222649 1307815 1367643 1453204 1595000
12658 1595000 1789329 1987085 2207290 2471303 2779676 3110183 3534550 4055413 4663472
12649D663472O85809Q20437R53022J090434J161280J228590J405504J730105K299044
12640A6037697L226421M643348O801154J0059471J5020716K2073177L0112519
12633A07974503L4487941K7655682O991112j7805258l1986755l1698754k4502476
12626G1115995j7105438j1651523q072080n757576m212364l165921k409899j912074
12618A6829120j694612j550956j389921j212527j022764r15311q58632q25897
12610G358500p34991o45195n51456l98783l41849l08078k19327j88465j57240
12601C813116j18872j08318n6232k5532q9178j55353j96918k44547k53098k05291
12591B359777k11326j87042j35853j26136j11019p8373p0169n3429m7272p6762
$$ plain form
12649 4663472 5349281 6169718 7122740 8213174 9374454 10603044 12008548 13738653 16037697
12640 16037697 19264118 23907466 30708620 40768091 55788807 77861984 107974503
12633 107974503 142462444 170118126 177109238 159303980 127317225 95618471 71115995
12626 71115995 54010557 42359034 34286954 28529378 24317014 21151093 18741194 16829120
12618 16829120 15134508 13583552 12193631 10981104 9958340 9043029 8184397 7358500
12610 7358500 6623509 5978314 5426858 5028075 4686226 4378148 4158821 3970356 3813116
12601 3813116 3694244 3585926 3529694 3504162 3414984 3259631 3062713 2818166 2565068 2359777
12591 2359777 2148451 1961409 1825556 1699420 1588401 1510028 1439859 1386430 1339158 1262396
12581A262396o0542o1075m4574k2067j1415l3394j9563k9220k7834l9445l5562
12570H77705n1201p954k4091k3849j1903j6877l3547m2730n718k9856j8521O120
12558F17578k0873L7305q82m2038k3725J6201R352k5738l2184j5753r271L9782
12546E49754L9112l5489k262n72r356N043k5927l0711j6255J0219M2340N8601
12534E84497J33979Q7449k7744p7302r9994m4497k9796k0046J0877J5481n1680
12523D81224l2115K5840L6386O2408L5808M1561O204j5052l3989m7339l6471o8331
12511D56134m8127J355k0102m2216j472O43Q986q251l7312l986L1233L116r158
12498C30843j8609k198K3926L6358O725M0415J05982J65151K27737K07918o707
$$ plain form
12581 1262396 1201854 1140779 1096205 1074138 1062723 1029329 1009766 980546 952712 913267 877705
12570 877705 826504 818550 794459 770610 758707 741830 708283 665553 659835 629979 611458 617578
12558 617578 596705 634010 633128 591090 567365 583566 592918 567180 534996 519243 509972 549754
12546 549754 588866 553377 551115 550543 541187 546230 520303 489592 473337 483556 525896 584497
12534 584497 718476 805925 778181 700879 600885 556388 526592 506546 517423 532904 481224
12523 481224 449109 474949 511335 573743 609551 651112 657316 642264 608275 560936 524465 456134
12511 456134 408007 409362 389260 347044 345572 346215 355201 346950 309638 305652 336885 340001 330843
12498 330843 312234 310036 333962 370320 377045 417460 523442 688593 916330 1124248 1117541
12487A117541j97253k31408j50404r0301o3528q2567m7324l6164j2342l961k7273
12476A75016m4509l4004q287N8925L5443L0017M8225n121m0499k1027K4951p257
12464B11873m6299j0726j6586J9440O615J2373M8020J0867j7260j1348J571K3451
12452B31991K530P01K7155L2311N0155J03256J99810K44266J58225j32891k73016
12441F44493j85403q9959m6783n4490m2041j1519L2036N6612K0232M141j924n740
12429C19655j5942R934j9199l9277l4666J1240J3356j2107m6083k2995J2567M0659
12417B17142M4021l729k8082o338Q520L7859M1100K598k1749M330L437K6776J9636
12404C45521K8137k079K0378O4002K9166j7541m2090m5148m7744m0821k3665j9655
$$ plain form
12487 1117541 920288 688880 538476 448175 384647 302080 254756 218592 206250 202289 175016
12476 175016 130507 96503 88216 147141 182584 212601 260826 255705 215206 194179 219130 211873
12464 211873 165574 154848 138262 157702 164317 176690 224710 235577 218317 206969 208540 231991
12452 231991 234521 235222 262377 294688 344843 448099 647909 892175 1050400 917509 644493
12441 644493 459090 369131 322348 267858 225817 214298 246334 302946 323178 327319 325395 319655
12429 319655 303713 313647 294448 255171 220505 231745 245101 232994 186911 163916 176483 217142
12417 217142 261163 257434 229352 223014 231534 269393 310493 313091 291342 295672 299109 325885 345521
12404 345521 373658 371579 391957 455959 485125 467584 425494 380346 332602 291781 268116 248461
12392B48461l7656j89J571K11j1206k4187j2930R736j2436J0256J532R281j0956
12379A71488K1993K9184J5882P317M8404L8491N826K1926j2609n2549k0317q360
12367B66676p192J5247m872m1187l0449j5056j612K8287J9975J9157L9592Q158
12355B96724m3934k9032j758k2695K6839M8597J0488o355K8011j5584n5779J1505
12343B47027M5292J1840O593K3301P413J5675J637j8940k7341K7825m234l8464
12331B97624m3950k9968j1099M468L0049J4574N117K1970J1470m5981l1974J4470
12319B36770m881J4340J6156K5066q628l359L14J1281j1045K5255K3652R79K305
12306C28205K30j2311J061o1328j3557K0654M1813P1192L7615L4976O5163R2607
$$ plain form
12392 248461 210805 210616 212187 212398 201192 177005 164075 173811 161375 171631 173163 182444 171488
12379 171488 193481 222665 238547 245864 294268 332759 338585 360511 347902 295353 275036 266676
12367 266676 259484 274731 269859 228672 198223 183167 181555 209842 229817 248974 288566 296724
12355 296724 252790 223758 222000 199305 226144 274741 285229 278874 306885 291301 235522 247027
12343 247027 292319 304159 310752 334053 341466 357141 358778 339838 312497 340322 336088 297624
12331 297624 253674 223706 212607 217075 247124 261698 266815 288785 300255 254274 222300 236770
12319 236770 231889 246229 262385 287451 278823 275464 275778 287059 276014 301269 324921 325900 328205
12306 328205 328435 316124 317185 255857 242300 262954 304767 375959 413574 448550 513713 606320
12294F06320Q8602R4542M3095K778k7649o0087l927m2789m2500O015K4055N9166
12282G47621L9074K0511M2964K0004n5621l9906m5510l9975p6569j11175n4363
12271D47055j5154l0995o4891j4842Q592j8397k0478M3194J5604M112n003K3904
12259C72701k559k7775J4484o3L024r000j3361J3749J6821l3804M275J9838J4632
12246C72962K2249L088L312n3482m3889j2955J8880K0607K0000Q835M7462J5425
12234D22494K4243N1179L4215M4072R55L814L7523P309j3624M354L6995L7563
12222F91092K0032L5333K9974L1919O6749O8398Q5198J01456J02748R8822J19191
12211A450912R6072J35807K11227K60369K86763L52801L89659M61004N49986O55294
$$ plain form
12294 606320 694922 789464 832559 835337 807688 747601 743674 700885 658385 664400 688455 747621
12282 747621 786695 807206 850170 870174 814553 774647 729137 689162 612593 501418 447055
12271 447055 431901 400906 336015 321173 329765 311368 290890 334084 349688 353800 348797 372701
12259 372701 370142 342367 356851 356788 359812 350812 337451 351200 368021 334217 338492 358330 372962
12246 372962 395211 398299 401611 348129 304240 291285 310165 330772 350772 359607 407069 422494
12234 422494 446737 497916 532131 576203 577158 580972 618495 625804 612180 616534 653529 691092
12222 691092 711124 746457 776431 808350 875099 943497 1028695 1130151 1232899 1331721 1450912
12211 1450912 1546984 1682791 1894018 2154387 2441150 2793951 3183610 3644614 4194600 4849894
12201D849894O47249O87598Q49342J030990J136086J151998J002934R51325J054451
12192A3361867J460583K219705L368449N032514P455083J1106526J6637107K3982349
12184H4624183L0761284L1229407K1265155L115995j6978203k9963267l0802462
12177I3252092k4362030j7097909j1593499p889500n513046l916211k724732j857740
12169A8297425j273903j095773j083214j273601j431376j359322j266259j127225
12161H386752r46270p65026o41501n50883m52113l37233k78536k38242j71226
12152D005722k04911k26448k24990k22648j78060j71353j50002j42150j47668
12143B337492r8359o8018o1964p2754p2645l8333k1402l6152J9933N9341K7318
$$ plain form
12201 4849894 5497143 6184741 7034083 8065073 9201159 10353157 11356091 12307416 13361867
12192 13361867 14822450 17042155 20410604 25443118 32898201 44004727 60641834 84624183
12184 84624183 115385467 146614874 167880029 170996024 154017821 124054554 93252092
12177 93252092 68890062 51792153 40198654 32309154 26796108 22879897 20155165 18297425
12169 18297425 17023522 15927749 14844535 13570934 12139558 10780236 9513977 8386752
12161 8386752 7440482 6675456 6033955 5483072 5030959 4693726 4415190 4176948 4005722
12152 4005722 3800811 3574363 3349373 3126725 2948665 2777312 2627310 2485160 2337492
12143 2337492 2239133 2171115 2109151 2036397 1963752 1925419 1904017 1867865 1887798 1947139 1974457
12132A974457N6312J3442o2562j52346j57763j27451q3219q5149j14921r6513
12122A164287q1365m3861n0662m0674m0290j9925k8742l5851m2931m8289K3372
12111G55069L0715k714j0055O131o231K422p122l9467k9341p952l9532k9623J2675
12098F34975p18j4184j2560J4904N243K302R245O744J5838K9772L7756L0402K6065
12085G85784J9614k5659l2812n1552m1255k907l2542J8756j0982k4325k0791P362
12073E88691K2619k1857l7142k1737J021k3145j1458K1994K909j6412n7285M58
12061D48656M047J6860O268j4311j5143k6844j9353j1090k5890K3579n262n58
12049C80959l63M852m3000j0883j4054K2615M5779k5909j4493J5158j200J3241
$$ plain form
12132 1974457 2030769 2044211 1981649 1829303 1671540 1544089 1460870 1375721 1260800 1164287
12122 1164287 1082922 1039061 988399 947725 907435 887510 858768 822917 779986 731697 755069
12111 755069 785784 783070 773015 779146 772915 775337 768215 728748 699407 691455 651923 622300 634975
12098 634975 634257 620073 607513 622417 627660 629962 639207 645951 661789 691561 729317 759719 785784
12085 785784 805398 779739 746927 695375 654120 651213 618671 637427 626445 602120 581329 588691
12073 588691 611310 589453 552311 530574 531595 508450 496992 518986 521895 505483 448198 448656
12061 448656 452703 469563 475831 461520 446377 419533 400180 389090 363200 386779 381517 380959
12049 380959 380596 385448 342448 331565 317511 340126 385905 359996 345503 360661 359461 372702
12037C72702J0670j4494k7338k5707r279j1297K8846O361l9600l2753J361m958
12025B54514j5648k6292j1966N0610M8500K7093K7692r647k5655k3878j0670Q332
12013B92985j3627L7001L6444J3819L5967j1618j8156P393J4793L9311M1241J2488
12001D88041L7908O0756J07318N4757n8456j18541q9359q0185n0504m2737k4523
11990B84475m465O19j6902L266p054K4207L0249j4545k2816J6201N283j5972K251
11977B84797K3102J6880K869n1545j7855K563k327R427R131J0785P927n742R03
11964B90915J5139j0591k1037p811L4918J1905l9513n0955j7425K8514K7595L947
11952B65601j0783K5000L3259j9346R135N33k0241l3166J2914J3205j0056j5942
$$ plain form
12037 372702 383372 368878 341540 315833 306554 295257 324103 330464 290864 258111 259472 254514
12025 254514 238866 212574 200608 251218 299718 326811 354503 344856 319201 295323 284653 292985
12013 292985 279358 316359 352803 366622 402589 390971 372815 380208 395001 434312 475553 488041
12001 488041 525949 586705 694023 748780 690324 571783 482424 402239 351735 308998 284475
11990 284475 280010 280629 263727 266993 259939 284146 314395 299850 277034 293235 298518 282546 284797
11977 284797 307899 324779 327648 276103 258248 260811 258484 267911 277042 287827 295754 290012 290915
11964 290915 306054 295463 274426 266615 301533 313438 273925 222970 205545 234059 261654 265601
11952 265601 254818 279818 313077 293731 302866 303399 283158 249992 262906 276111 266055 250113
11940B50113K1577M018M124k2459k3753K8460K1278j2363J4839J4713L302j1338
11928B92511M507M3426J5475O42J7927O30n726J4442l198J5951m122j5909l0922
11915C45634j756N777p839j7430j3714K1l2317j5400j7462K34J2059J8052k1453
11902B54406k1235k1945L785J8527k607J461j5491j8832k2479o591J7370M181
11890A90550m472J3861K0162j3413k361L389L567K4870K7574J4366k240j7759
11878B58094l1652j6875K6971L479k2789l1952l4981K7472J8874P234k4272J1256
11866A90859K5430r317r466o930j8063J2578J2880L5829M4944J2940j9015m6301
11854B26368J486M6935K1159j9253l8502l3600q086j5438M11K789j7403n231N686
$$ plain form
11940 250113 271690 275708 279832 257373 233620 262080 283358 270995 285834 300547 303849 292511
11928 292511 297018 340444 355919 356561 374488 375118 369392 383834 380636 396587 392465 376556 345634
11915 345634 343878 349655 341816 324386 310672 310693 278376 262976 245514 245748 257807 275859 254406
11902 254406 233171 211226 215011 233538 230931 232392 216901 198069 175590 168999 186369 190550
11890 190550 186078 199939 220101 206688 204327 207716 211283 236153 263727 278093 275853 258094
11878 258094 226442 209567 236538 240017 217228 185276 150295 177767 196641 203875 179603 190859
11866 190859 216289 206972 197506 190576 172513 185091 197971 233800 278744 291684 272669 226368
11854 226368 227854 274789 295948 276695 238193 204593 196507 181069 181480 184269 166866 161635 167321
11841A67321K2172K9138l845k2362p330J3721p336p479M599K2284M839k4181K556
11828A94097J5237m6909J3306K5109K0694J8257p250k8956l3307J4695J7467m332
11816A98108k3822K3925P273l120J9661N233J6029N551k037m4148l8930K3242
11804A86965K9474l475j1933J4322J5895j1884j8611l2284K909J6001K3460n708
11792B05131k2844K0714o188p222J1725J2793k1181k6426j1013j0731M7428K7193
11780B19379Q606m21j2668P051K5037L2867k0299l202N0867L6221J8863J2877
11768C75178M8076O4947N7010N6456Q6092J20010J53466J06205L510p3104j15128
11757H82718j51065j20594j06124q6635n8008l5288l352m793J4039R225l1716
$$ plain form
11841 167321 189493 218631 214786 192424 185094 198815 191479 184000 188599 210883 215722 191541 194097
11828 194097 209334 162425 175731 200840 221534 239791 232541 203585 170278 184973 202440 198108
11816 198108 174286 198211 205484 202364 222025 227258 243287 248838 246801 202653 163723 186965
11804 186965 216439 212964 201031 215353 231248 219364 200753 168469 171378 187379 210839 205131
11792 205131 182287 203001 196813 189591 201316 214109 192928 166502 155489 144758 192186 219379
11780 219379 227985 227564 214896 221947 246984 279851 259552 256350 307217 343438 362301 375178
11768 375178 423254 488201 545211 601667 687759 807769 961235 1067440 1070950 997846 882718
11757 882718 731653 611059 504935 418300 360292 325004 321652 316859 330898 340123 308407
11746C08407k3729l2352k0782j1458K979J5941r129l0959j2313K6889Q673r968
11734B12199J9822K3678p595j2622Q234L454q761j2923J2592K8193j7011k7563
11722B21697l1248k1845K3618l440r839m773K0873l304o45m971q758P212K628
11709A87205p766l1648O857O890o385P740L252L6107L7201n448m470m695J0473
11696B35313j7210N515k549m675K4343L307j1604o515J0747j9802K1367M4853
11684B83090J2172k2067J0132R495k501k9697r063k1181j0728K9648L4361J9683
11672C03344l4603l3491k2928j4956J5674R377m22P994k8615j8452R719k0159
11660A72482o74J2290Q900K7132K361j3797k2027p815j3025Q123O639J0815J5786
$$ plain form
11746 308407 284678 252326 231544 220086 223065 239006 229877 198918 186605 213494 222167 212199
11734 212199 232021 255699 248104 235482 243716 247170 238409 225486 238078 266271 249260 221697
11722 221697 190449 168604 192222 188782 178943 174170 195043 191739 191094 186123 177365 184577 187205
11709 187205 179439 147791 154648 161538 155153 162893 166145 202252 239453 234005 229535 224840 235313
11696 235313 218103 223618 221069 216394 240737 244044 232440 225925 236672 216870 238237 283090
11684 283090 295262 273195 283327 292822 290321 260624 251561 230380 219652 249300 283661 303344
11672 303344 268741 235250 212322 197366 213040 222417 221995 229989 201374 182922 192641 172482
11660 172482 171808 184098 192998 220130 222491 208694 186667 178852 165827 173950 180589 191404 207190
11647B07190K6004J1474l2782K076J1132p852p601k0440q619P912j6576j4806
11635A57112K7211n047M0889j8486l9751K3201K1160J491j016k4220m6684J0857
11623A46717N2063K5022r601Q332J9892m561P281j0487J0385M976j4072k7577
11611B08370k5944N604K6023L3849j994K080j171k1124l963L750R90Q846j4972
11598B20344O21l696J0989K3464J6319k827k0996j4642J1334K7732J6696l1583
11586B53755k8639J0170L2321k2252o268M980j0269o943j510l6204J8797M1563
11574B49501L9300J1878J167l3342p347j1000m130J7940j3287Q039n686n278J2638
11561B60393P012L1387k343j1398k3659m808M033j1786K386J6748J2888l4872
$$ plain form
11647 207190 233194 244668 211886 213962 225094 217242 209641 189201 180582 188494 171918 157112
11635 157112 184323 179276 220165 201679 161928 185129 206289 207780 206764 182544 135860 146717
11623 146717 198780 223802 214201 222533 242425 237864 245145 234658 245043 250019 235947 208370
11611 208370 182426 188030 214053 247902 245908 247988 246817 225693 221730 225480 226470 235316 220344
11598 220344 220965 217269 228258 251722 268041 265214 244218 229576 240910 268642 285338 253755
11586 253755 225116 235286 267607 245355 239087 244067 233798 226855 225345 189141 207938 249501
11574 249501 288801 300679 301846 268504 261157 250157 246027 263967 250680 258719 253033 247755 260393
11561 260393 267405 298792 296449 285051 261392 256584 260617 248831 251217 267965 280853 245981
11549B45981Q26P493j9687J9229K4700m698J1092k8490n3991J3740L3571k502
11537B47264j0808K154p134j5495K7669J3785J289r029o872k002L8618j1162J191
11524B69468j9J2353m329l6656O990R102J8565J9171k4412j9613j745j460j3754
11511B33661j4145O828l037k6893N956J0778J4377K2720j315O76j258J3322j3741
11498B47929k3171J3035K6045k220J4378J6967K4361o887k3356j4599j8719p11
11486B53052j8688j3141Q364J6740L4601q30j406j1464j0956l9254J0958L4370
11474B62346L7892J7327P367J6799l2197j8015n078Q078K4363j4165l4703j1142
11462B58872P557j0529J7153J3111n210j581k0219K139J7587J968j427J6354J0579
$$ plain form
11549 245981 246807 254300 234613 253842 278542 273844 284936 256446 202455 216195 249766 247264
11537 247264 236456 238610 231476 215981 243650 257435 258724 249695 242823 240821 279439 268277 269468
11524 269468 269449 281802 277473 240817 247807 256909 275474 294645 270233 250620 248875 247415 233661
11511 233661 219516 226344 223307 196414 202370 213148 227525 250245 248930 249606 248348 261670 247929
11498 247929 224758 237793 263838 261618 275996 292963 317324 310437 287081 272482 253763 253052
11486 253052 234364 221223 229587 246327 280928 280098 278692 267228 256272 217018 227976 262346
11474 262346 300238 317565 324932 341731 309534 291519 286441 294519 318882 304717 270014 258872
11462 258872 266429 255900 273053 286164 280954 279373 259154 261293 278880 280848 279421 295775 306354
11449C06354k1168k5189o687l569Q686R662K3086K6539J2860k267J988m0547q016
11436B81732k0391n196J6996N188p384o402q698J5844O018P551J3175j0845j2664
11423B74924P818J6167j7982l4416J2698K0260q04O902Q336J6052J5177R45J3350
11410C39427L6832o291m803k5573k0423L0477R08k977J7202k9028n775l528j7699
11397C08749n734l367R078K5785O741o76K2061q829q664P186Q629P16l126j6392
11383C42157K9547L0081m4794p614J6051J868r549j7139R032j4105o1r553j2074
11370C13847J832J1078M945J8M179o897j6051J6708P205L740o084K5689J4074
11357C74283k4015m572J1216o991j4761K7978M4640l547l3351M730R193J7587
$$ plain form
11449 306354 285186 259997 253310 249741 258427 268089 291175 317714 330574 328307 330295 289748 281732
11436 281732 261341 256145 273141 278329 270945 264543 255845 271689 277707 285258 298433 287588 274924
11423 274924 282742 298909 280927 246511 259209 279469 278665 285567 293903 309955 325132 326077 339427
11410 339427 376259 369968 365165 339592 319169 349646 350554 347577 364779 335751 329976 326448 308749
11397 308749 303015 299648 308726 334511 341252 340576 362637 353808 345144 352330 360959 361675 358549 342157
11383 342157 371704 401785 356991 349377 365428 367296 357747 340608 349640 335535 335474 325921 313847
11370 313847 315679 326757 331702 331720 335899 329002 312951 329659 336864 340604 334520 360209 374283
11357 374283 350268 345696 356912 349921 335160 363138 407778 404231 370880 375610 384803 402390
11345D02390k0108o815p747l5484J0885K7924J0065L3853K2560k4870q160k9457
11333C75036J4357K8507J4094j1145L011R952j8879K608j9200L983L535K4360
11321D30219K4873p038q7j3971p934N680q88k1420l6481o855M8620J3910k120
11308D26508J3811k0024j5775j1006K1374J4157m638k1825j3243K8065K1089j4269
11296D24224J9768R707J3208r485l0757j7222M772j2534L540p539j9306L5290
11284D13666L8202p709q435q002M034L0422J5262q268K2915n501q356J3847l265
11271D88812j2806k8J2141O203j5593J0288N6905J2762q358l0984k0627k8351
11259D70364j8967j9795j236rL5085M213j4232J5698L0875k2472J3819K2907k0128
$$ plain form
11345 402390 382282 375467 367720 332236 343121 371045 381110 414963 437523 412653 404493 375036
11333 375036 389393 417900 431994 420849 423860 433812 414933 417541 398341 402324 405859 430219
11321 430219 455092 448054 447967 433996 426062 431742 430854 409434 372953 366098 414718 428628 426508
11308 426508 440319 420295 404520 393514 414888 429045 424407 402582 389339 417404 438493 424224
11296 424224 443992 453699 466907 457422 426665 409443 414215 401681 405221 397682 378376 413666
11284 413666 451868 444159 435724 427722 431756 462178 477440 469172 492087 486586 478230 492077 488812
11271 488812 476006 475978 488119 494322 478729 489017 545922 558684 550326 519342 498715 470364
11259 470364 451397 431602 430366 430357 465442 469655 455423 471121 501996 479524 493343 516250 496122
11246D96122j6701j7416L6431L0720n87k7945J5601J2754j0843P902n999l9474
11234D80565M948M1156J2207J9351j2100j0435o517L0246K3394M339j5262M343
11222E76235k45O039M2142L9321N8297J9875J7298K2652n0115q9376k8773m256
11210F09094k9201O039j4878j4964r955K2741J8394o465j8853N4735K3876q820
11198F31743l411J7440J5218K2445J4915k3927j432M0209M5611N3687L6165J1722
11186H60385K8919L3798o547m1487k5390l8943l9933J0390l6725j2980k4970Q300
11174G14817j6259l3459k6985j8790J9779M460q007k2957j7924M9852M1166L5905
11162G21598L9k940J3683M3898L5383K9025N912O781J733j3335k3507j6744M392
$$ plain form
11246 496122 479421 462005 498436 529156 528569 500624 516225 528979 518136 526038 520039 480565
11234 480565 485513 526669 538876 558227 546127 535692 529175 559421 582815 587154 571892 576235
11222 576235 575990 582029 624171 663492 721789 741664 758962 781614 731499 642123 613350 609094
11210 609094 579893 585932 571054 556090 546135 568876 587270 580805 561952 616687 640563 631743
11198 631743 628332 645772 660990 683435 698350 674423 672991 713200 758811 812498 848663 860385
11186 860385 889304 923102 916555 875068 849678 810735 770802 781192 744467 731487 706517 714817
11174 714817 698558 665099 638114 619324 639103 643563 635556 612599 594675 644527 685693 721598
11162 721598 721637 718697 732380 776278 811661 840686 846598 853379 855112 841777 818270 801526 805918
11149H05918k4134k2316j4983k4245Q292J907J656k7181k3079j0352J3175j5299
11137F69359J350J2430J6077R776k1173q040J5607K4733K4112P944j3802j2556
11125G25817k6298L6961M6210M213j7402j2618J2064j7055l2378k7774L0220L8746
11113G60706L2807J6498N412j3657j7731l7051k3232K2214J3779L1458N6436K575
11101H50214l2497k1444k8978N526L3752J6073k804J5044l614J327K96Q30q3j4963
11087H18679K43J9897L3764j0351L6516j1677l8125r420L882M2457J0978l838
11075H93005r845k0400j54q529O622J5622k1958k064k1141l124J8474J3116K9272
11062H88896M7470K6034o572K348J8192p109j4709j5395q952K2402L0002L335
$$ plain form
11149 805918 781784 759468 744485 720240 728532 730439 732095 704914 681835 671483 684658 669359
11137 669359 670709 683139 699216 708992 687819 679779 695386 720119 744231 752175 738373 725817
11125 725817 699519 736480 782690 786903 769501 756883 768947 751892 719514 691740 721960 760706
11113 760706 793513 810011 815423 801766 784035 746984 723752 745966 759745 791203 847639 850214
11101 850214 817717 796273 767295 772821 806573 822646 819842 834886 831272 832599 832895 833725 833642 818679
11087 818679 818922 838819 872583 862232 898748 887071 848946 839526 843408 885865 896843 893005
11075 893005 883160 862760 862606 854077 860699 876321 854363 852299 831158 828034 846508 859624 888896
11062 888896 936366 962400 955828 958176 976368 969259 954550 939155 930203 952605 982607 985942
11050I85942R860J6830j761k6159k6429k339L564K1877M279N497J1353K178K5475
11037A030167K1252k3475j6619J6335P051J8676J4748M623O486k7178l8745j2662
11025A000659K0059K298K871j30L0415k965L450R360K1577J9468N3389l5326j6182
11012A108943N4836J7622k9606m361k0454l6235J4851L3488j097P213K1965N435
11000A172600j5954j3746O85L3790O252Q825r287K5947M5275J0061j1279k6009
10988A227160K4271R727K3201K6061L3744o374l1755o301J2756J03Q171l27N988
10975A326425p968K554J2152j959k6922J264K4092J0662k498m517k871J4994L0594
10962A376002L6263J0942j4868j6541R567M7078L0504j5811j6720l905K3280L7422
$$ plain form
11050 985942 995802 1012632 1010871 984712 958283 955944 959508 981385 985664 991161 1002514 1004692 1030167
11037 1030167 1051419 1027944 1011325 1027660 1034711 1053387 1068135 1072758 1079244 1052066 1013321 1000659
11025 1000659 1020718 1023016 1025887 1025757 1056172 1053207 1056657 1066017 1087594 1107062 1160451 1125125 1108943
11012 1108943 1163779 1181401 1151795 1147434 1126980 1090745 1105596 1139084 1137987 1145200 1167165 1172600
11000 1172600 1156646 1142900 1143585 1177375 1183627 1192452 1183165 1209112 1254387 1264448 1253169 1227160
10988 1227160 1251431 1261158 1284359 1310420 1344164 1337790 1306035 1299734 1312490 1312593 1320764 1320437 1326425
10975 1326425 1318457 1321011 1333163 1331204 1304282 1305546 1329638 1340300 1337802 1333285 1330414 1345408 1376002
10962 1376002 1412265 1423207 1408339 1391798 1401365 1448443 1478947 1463136 1446416 1442511 1465791 1503213
10950A503213J3738k3606j4526J2372K7667K7674R147L2797L3761J2808l9932
10939A595113k4969r258K2769J1934m9157j0420o723l421K5687L8810k3542j3579
10927A553244L8072K3991P553j3876J340J9243N0288L1637r979k5256k2105J2114
10915A666266J9019R032j6872j0993L3946m659J7984J1668L1517J8318K1559K835
10903A799620L2408L9611o242q289K0631k0513m0874K248J2996q349m431J1068
10891A829884J3541K4409L3026k8300k3918K839J3716k418J5645M0200K4549J6974
10879A960147j5196l644o594P749K0024m777L1539J9489j4760K755M8163K4916
10867B069811K2743l269O192n898K0698M4021K0567q432j7627j4703M020K3132
$$ plain form
10950 1503213 1516951 1493345 1478819 1491191 1518858 1546532 1555679 1588476 1622237 1635045 1595113
10939 1595113 1570144 1560886 1583655 1595589 1546432 1536012 1529289 1525868 1551555 1590365 1566823 1553244
10927 1553244 1591316 1615307 1622860 1608984 1610324 1629567 1679855 1711492 1701513 1676257 1654152 1666266
10915 1666266 1685285 1694317 1677445 1666452 1700398 1695739 1713723 1725391 1756908 1775226 1796785 1799620
10903 1799620 1832028 1871639 1865397 1857108 1877739 1857226 1816352 1818600 1831596 1823247 1818816 1829884
10891 1829884 1843425 1867834 1900860 1872560 1848642 1851481 1865197 1862779 1878424 1918624 1943173 1960147
10879 1960147 1944951 1941307 1934713 1942462 1962486 1957709 1989248 2008737 1993977 1996732 2044895 2069811
10867 2069811 2092554 2089285 2095477 2089579 2110277 2154298 2174865 2166433 2148806 2134103 2138123 2161255
10855B161255K5961K5733r759J8313Q995L413J8461L1054K6754j2574L6899J8277
10843B352782J8714k9977j0176J2519j5408M751K9355K3452N110M2798J1076J7470
10831B462466L714O657K4810M9389n193o786j6070L3376L6291j5920P819M4554
10819B625107j064J2391J5598K7724K1531J4957J3452K1665N6334o393j075j7456
10807B782771k5972K0466J2641K6352J8394K682L10K6130M1350L0900L7922Q613
10795B982559M4852N2837J4856J2663J3605J6892J6058J8987L880J0020K0562
10784C207771J9928N597L3363R132M5158K1048m430K0408N7707K1483L5087K7005
10772C499257j8424L5105L6673L853O8720M7518j0481J3951J7291Q539M0478P035
$$ plain form
10855 2161255 2187216 2212949 2203190 2221503 2230498 2233911 2252372 2283426 2310180 2297606 2334505 2352782
10843 2352782 2371496 2341519 2331343 2343862 2328454 2333205 2362560 2386012 2391122 2433920 2444996 2462466
10831 2462466 2466180 2472837 2497647 2547036 2541843 2535057 2518987 2552363 2588654 2572734 2580553 2625107
10819 2625107 2624043 2636434 2652032 2679756 2701287 2716244 2729696 2751361 2807695 2801302 2800227 2782771
10807 2782771 2756799 2777265 2789906 2816258 2834652 2837334 2837644 2863774 2905124 2936024 2973946 2982559
10795 2982559 3027411 3080248 3095104 3107767 3121372 3138264 3154322 3173309 3177189 3187209 3207771
10784 3207771 3227699 3233296 3266659 3275791 3320949 3341997 3337567 3357975 3415682 3437165 3472252 3499257
10772 3499257 3480833 3515938 3552611 3556464 3625184 3672702 3662221 3676172 3693463 3702002 3742480 3749515
10760C749515j1265Q979L0980P1765N3546K7745L1113L9491P573K8305J5072M5530
10748D098349N4169K4394k200M869M3744L3554K2851K591K4771J0680Q448L7447
10736D363667L5924K3582P3650P2135L9114K3986j9774K2912M1068K5003K4554
10725D725821K7877O0433N0796N8745L3613K4895L9640N4748N2082M7082M0289
10714E216021K821J8118L2586L7518L2455L7267N4039N7189N0649L9278O4736
10703E642677O2286M5483K1940J9687N5142M2749O8599P3303O1909L4869Q548
10692F137192Q291M3683N0386L4600M4246N4070L4044O9311P3837M8587N1204
10681F649451K9977M3693J00201P6546N2480K4036N3712P5062M7831O0017Q9581
$$ plain form
10760 3749515 3738250 3747229 3778209 3849974 3903520 3931265 3962378 4001869 4009442 4037747 4052819 4098349
10748 4098349 4152518 4176912 4174712 4179581 4223325 4256879 4279730 4282321 4307092 4317772 4326220 4363667
10736 4363667 4399591 4423173 4496823 4568958 4608072 4632058 4612284 4635196 4676264 4701267 4725821
10725 4725821 4753698 4814131 4864927 4923672 4957285 4982180 5021820 5076568 5128650 5175732 5216021
10714 5216021 5218842 5236960 5269546 5307064 5339519 5376786 5430825 5488014 5538663 5577941 5642677
10703 5642677 5704963 5750446 5772386 5792073 5847215 5889964 5958563 6031866 6093775 6128644 6137192
10692 6137192 6145483 6189166 6239552 6274152 6318398 6372468 6406512 6475823 6549660 6598247 6649451
10681 6649451 6679428 6723121 6823322 6899868 6952348 6976384 7030096 7105158 7152989 7213006 7302587
10670G302587M0308L3728N1997O3789J02563O7063M7719L8860N7936Q0078R3079
10659G979707M5551N4426O3706P4723M5944O8305N5591O0081O3332O5049Q6426
10648H662841P3519O3903P0655J01555Q2823P3076O3157P8924Q9194R5080R6691
10637I551418N2633N7644J00727Q1773P6781N3214Q3559J14834Q7974O7178O8603
10626A0396338P0965N6709M4199J20622J18557R2479R4406N7364O5218Q4210P1907
10615A1272974R9908R1803P7592P0594J05541R3052O6968J01105J15858R8355
10605A2193750J09509J36015J33572J23320J48285J92113K46236K81176L14097
10596A3878073K80486J22827o8469j56862j28761l2412J4355J3768L088J3520
$$ plain form
10670 7302587 7342895 7376623 7428620 7492409 7594972 7662035 7709754 7748614 7806550 7886628 7979707
10659 7979707 8025258 8079684 8143390 8218113 8264057 8332362 8387953 8448034 8511366 8576415 8662841
10648 8662841 8736360 8800263 8870918 8972473 9055296 9128372 9191529 9270453 9359647 9454727 9551418
10637 9551418 9604051 9661695 9762422 9844195 9920976 9974190 10057749 10172583 10260557 10327735 10396338
10626 10396338 10467303 10524012 10568211 10688833 10807390 10899869 10994275 11051639 11116857 11201067 11272974
10615 11272974 11372882 11464685 11542277 11612871 11718412 11811464 11878432 11979537 12095395 12193750
10605 12193750 12303259 12439274 12572846 12696166 12844451 13036564 13282800 13563976 13878073
10596 13878073 14158559 14281386 14212917 14056055 13927294 13894882 13909237 13923005 13926093 13939613
10586A3939613M0030K2497L2075N0949Q4260O9166L1527N4473R0869R1109N0278
10575A4556846M2694N1333R8941N9965N6309Q3932N5549M7446O9881K8272K6175
10564A5177343O1544P8943N6990O2760N8697K6303M0250N6356K6928M4815L8359
10553A5729288O0938N6456L5696L1587M2191K4785M6613N3740k31J045L7718M972
10541A6124798J6835M0053L5963N5784L3142J81L3876L870P226K9020L0465P245
10529A6418458M464J0550l447k3630J0779J6472p884j0121j6143j0613J2839N1518
10517A6453242M6826j1875m5433J549j329k2520k8470j4859l6748l2913j8536
10506A6288934J9623P8j7669l2512n590q723N065j5058j7064l4713l1211O186
$$ plain form
10586 13939613 13979643 14002140 14034215 14085164 14169424 14238590 14270117 14324590 14415459 14506568 14556846
10575 14556846 14599540 14650873 14749814 14809779 14866088 14950020 15005569 15053015 15122896 15151168 15177343
10564 15177343 15238887 15317830 15374820 15437580 15496277 15522580 15562830 15619186 15646114 15690929 15729288
10553 15729288 15790226 15846682 15882378 15913965 15956156 15980941 16027554 16081294 16081063 16082108 16119826 16124798
10541 16124798 16141633 16181686 16217649 16273433 16306575 16306756 16340632 16344502 16351728 16380748 16411213 16418458
10529 16418458 16422922 16433472 16430025 16406395 16417174 16433646 16425762 16415641 16399498 16388885 16401724 16453242
10517 16453242 16500068 16488193 16442760 16444309 16442980 16420460 16391990 16377131 16340383 16307470 16288934
10506 16288934 16308557 16308635 16290966 16258454 16252864 16244141 16249206 16234148 16217084 16182371 16151160 16157346
10494A6157346k9127n0243l4155m8736l4121l5012P55n150k6463k7420j343l515
10482A5862816l8396l4764n4320k8917j1391j3582k528J684J4726k0341m6410
10471A5628577l8838m0798l7439P24k4162l1413n6528l908j8442j3305k8932m8463
10459A5287073j8362j4482O776J9405J3360l8515n4398m5074k4057m3184n0953
10448A5037589j4128m6405n6030k6290m928j6303j2417o4568k6335P367l8302
10437A4739250k6178r486J2808k9801j3356J9493k1116k2707q848k9450m0701
10426A4569908n1705n5051k6475P455j3961n1473n2954l965K3875L2785N4805
10415A4433244R7829O6388p1581j68269j59972o8434p5704p1745m7304m2600p3470
$$ plain form
10494 16157346 16128219 16077976 16043821 15995085 15960964 15925952 15926707 15921557 15895094 15867674 15866331 15862816
10482 15862816 15824420 15789656 15735336 15706419 15695028 15681446 15678918 15680602 15695328 15674987 15628577
10471 15628577 15589739 15548941 15511502 15512226 15488064 15456651 15400123 15396215 15377773 15364468 15335536 15287073
10459 15287073 15268711 15254229 15261005 15280410 15293770 15255255 15200857 15155783 15131726 15088542 15037589
10448 15037589 15023461 14977056 14921026 14894736 14889808 14873505 14861088 14796520 14770185 14777552 14739250
10437 14739250 14713072 14703586 14716394 14686593 14673237 14692730 14671614 14648907 14640059 14610609 14569908
10426 14569908 14518203 14463152 14436677 14444132 14430171 14378698 14325744 14321779 14345654 14378439 14433244
10415 14433244 14531073 14597461 14525880 14357611 14197639 14129205 14053501 13981756 13934452 13891852 13818382
10404A3818382l4593n851j9753j2391n2347p0298p6080n6484k6811m67k6555n1786
10392A3384966m4316m1996m0713k4620j0492J6328l5350o9683o7341j9812o662
10381A3040309k1981k4911k2945l2591r4209m9190n672m3745l0030k926M269k8690
10369A2687688k5849n4290o5438l4474m8479p0844p5946n8160p8981p5707m5531
10358A2053989o1592m1582k7609N444m2566o0241n1211j0547k84p4961n5768k4513
10346A1608559L143m3814p0138m0657n6442o5276m8745j1298n924n4556o1083
10335A1153769M926l795m1923o9731p1994j18229j05247o6746m6354l8917r3472
10324A0502287n0174o4889n5983p5111l7082n7337j9927l3441l8905k1027m8843
$$ plain form
10404 13818382 13783789 13777938 13758185 13745794 13693447 13623149 13547069 13490585 13463774 13463307 13436752 13384966
10392 13384966 13340650 13298654 13257941 13233321 13222829 13239157 13203807 13134124 13066783 13046971 13040309
10381 13040309 13018328 12993417 12970472 12937881 12843672 12794482 12788810 12745065 12715035 12712109 12716378 12687688
10369 12687688 12661839 12607549 12542111 12507637 12459158 12388314 12312368 12254208 12175227 12099520 12053989
10358 12053989 11992397 11950815 11923206 11928650 11886084 11825843 11774632 11764085 11763801 11688840 11633072 11608559
10346 11608559 11611702 11567888 11497750 11457093 11400651 11335375 11286630 11275332 11269408 11214852 11153769
10335 11153769 11158695 11154900 11112977 11043246 10971252 10853023 10747776 10681030 10634676 10595759 10502287
10324 10502287 10452113 10387224 10331241 10256130 10219048 10161711 10141784 10108343 10069438 10048411 9999568
10313I999568l6923m5777m7994k23m4618J2822M9414J0356k3504q5914j15404
10302I671803j19864r2837r8490o4531m0106m9694q3763q4806m9030l2326m4333
10291H912023k4015l3233m5087n7247m8732m0686m6447l6989n2874m7773m4439
10280H434501l1646l0276l8297o0564q9983o8591l3872n5931k8207k3352k7393
10269G946389n9072n5458m7590n5727p2575k9215k727j5459m7466l8318j0191
10258G512591O414m1140k9983k5125l8049n6790m8722K144k4726k4798O830n8864
10246G179782n1140k4377j0999l445q572k3968n6388l0982j2168m3432l1705j010
10234F881596K6595L9246M1807O5853O5449R5315J92201K31529K17231J95684
$$ plain form
10313 9999568 9962645 9916868 9868874 9868651 9824033 9836855 9886269 9896625 9873121 9787207 9671803
10302 9671803 9551939 9459102 9360612 9296081 9255975 9206281 9122518 9037712 8988682 8956356 8912023
10291 8912023 8888008 8854775 8809688 8752441 8703709 8663023 8616576 8579587 8526713 8478940 8434501
10280 8434501 8402855 8372579 8334282 8273718 8183735 8115144 8081272 8025341 7997134 7973782 7946389
10269 7946389 7887317 7831859 7784269 7728542 7655967 7626752 7624025 7608566 7561100 7522782 7512591
10258 7512591 7519005 7477865 7447882 7422757 7384708 7327918 7279196 7281340 7256614 7231816 7238646 7179782
10246 7179782 7128642 7104265 7093266 7089821 7081249 7057281 7000893 6969911 6957743 6914311 6882606 6881596
10234 6881596 6908191 6947437 6989244 7055097 7120546 7215861 7408062 7639591 7856822 8052506
10224H052506K71442L62899L62147J69108j97328l77003k97590k10765j45874
10215G989542l4532K2984N1794R7691J20398R4638M0632K7241N3784J47961K35488
10204H847621L33959L30744L98667M50436N69499P61728J056230J254976J167614
10195A5171474Q54591O79245O75356Q14537J159936J732674K445493L368980M457697
10186C1359983N908802Q128066J1616098J7047133K5687881L8748432N4579474
10179A93075869O1697925L9058423j2281915n1739395n7133690m4640226l0859137
10172I7177854k0874713j4493920j0479215p903130o061482m689622l696485k878218
10164B6101069k244233j648189j153481r78726j159866j425702j479429j334567
$$ plain form
10224 8052506 8323948 8686847 9048994 9218102 9020774 8643771 8346181 8135416 7989542
10215 7989542 7955010 7977994 8029788 8127479 8247877 8342515 8383147 8410388 8464172 8612133 8847621
10204 8847621 9181580 9512324 9910991 10361427 10930926 11692654 12748884 14003860 15171474
10195 15171474 16026065 16705310 17380666 18195203 19355139 21087813 23533306 26902286 31359983
10186 31359983 37268785 45396851 57012949 74060082 99747963 138496395 193075869
10179 193075869 254773794 293832217 281550302 229810907 172677217 128036991 97177854
10172 97177854 76303141 61809221 51330006 43426876 37365394 32675772 28979287 26101069
10164 26101069 23856836 22208647 21055166 20076440 18916574 17490872 16011443 14676876
10156A4676876j145424q95316p32262o15624n20971m10455l62500l69558l52970
10147I271796l26807l15869k91208k65118k63077j99331j98744k22332j96869
10138F992441j91950j90038j41927j07771j36874j68335j67257j44819j12379
10129E631091q4027q9353q8460o6530p6767n0930o9343m8214o5865p9414p1201
10118D840987l0948o9141r6665q7603o3057l6520j1301J5389J2258k4746o9798
10107D378855o6026n9161l8204k4628P899M954m8608n2548j230L6598k904L3288
10095D168285K2618M2169O840q312j5053n1050o6328j00047j12218m9679l6737
10084C800488n5515o1431N482L0720L7163l597m7249m7104p0175q3460l3561o616
$$ plain form
10156 14676876 13531452 12636136 11903874 11288250 10767279 10356824 9994324 9624766 9271796
10147 9271796 8944989 8629120 8337912 8072794 7809717 7610386 7411642 7189310 6992441
10138 6992441 6800491 6610453 6468526 6360755 6223881 6055546 5888289 5743470 5631091
10129 5631091 5547064 5457711 5369251 5302721 5225954 5175024 5105681 5057467 4991602 4912188 4840987
10118 4840987 4810039 4740898 4644233 4556630 4493573 4457053 4445752 4461141 4473399 4448653 4378855
10107 4378855 4312829 4253668 4215464 4190836 4198735 4203689 4155081 4102533 4101303 4137901 4134997 4168285
10095 4168285 4190903 4233072 4239912 4231600 4216547 4165497 4099169 3999122 3886904 3837225 3800488
10084 3800488 3744973 3683542 3689024 3719744 3756907 3753310 3706061 3658957 3588782 3505322 3471761 3465145
10072C465145j7391j9757m099o0069j3884j6433J934J514j9228J1606L0037j3582
10060C345793l8143k4971m0772o2833k8874m0289K98J1274l2626n9940m1840j9437
10048B967640j705j1832l5300K042J8199K9561O687N925j4326m0268n0542l3169
10036B842912k4241o803p587k8257l415q959m8850l2049l7853j8597k5513n1870
10024B548918m7587n0588l0817q708L6279K9716K1731J5188l6173j2289N0135
10013B515805N1821J7552k3459k839L4131P113O4119P9442N9401K6725o800m6026
10001B776985o9284o8972l7246l5412q301k6472q0421K561r374k6506o1170m0417
9989B315971j0969j8937m1809j4572q831L0228j787j2556M0488K3746j9329j2239
$$ plain form
10072 3465145 3447754 3427997 3423898 3363829 3349945 3333512 3335446 3336960 3317732 3329338 3359375 3345793
10060 3345793 3307650 3282679 3241907 3179074 3150200 3109911 3110209 3121483 3088857 3028917 2987077 2967640
10048 2967640 2965935 2954103 2918803 2920845 2939044 2968605 2975292 2981217 2966891 2926623 2876081 2842912
10036 2842912 2818671 2811868 2804281 2776024 2772609 2763650 2714800 2682751 2644898 2626301 2600788 2548918
10024 2548918 2501331 2450743 2419926 2411218 2447497 2477213 2498944 2514132 2477959 2465670 2515805
10013 2515805 2567626 2585178 2561719 2558880 2593011 2600124 2664243 2743685 2803086 2829811 2823011 2776985
10001 2776985 2707701 2638729 2601483 2566071 2557770 2531298 2450877 2453438 2444064 2417558 2356388 2315971
9989 2315971 2305002 2286065 2244256 2229684 2220853 2251081 2249294 2236738 2277226 2300972 2281643 2269404
9977B269404K751N005O11q434l1508L6237n503j2003r873m544p780j1545P00j1141
9963B212377p160m24J1905j2689j0548J3710K6708j680m9161k9664L0993r695
9951B174672j2063m2355l478n615n473P718J9439Q804j1537J6791K9255n536R394
9938B180016l4179j5995L6243J0300l4797l1756j444L3684K109J9027M439j6981
9926B150666l2233L1418M3870L1865K3478k109K2775R4177L8239P0246M0575j6039
9914B496928m0917m3240l8541k7987j0302l7795n1556j5974o3701m1532O558R652
9902B141593R421P771k601l3930o455m772K9563L8096J0307m1169n285O4854O1279
9889B268672j252j230J0355j7663J4473J9581J3027L7615K1796m273J9529J7869
$$ plain form
9977 2269404 2272155 2277160 2277771 2269337 2237829 2274066 2268563 2256560 2246687 2242143 2234363 2222818 2223518 2212377
9963 2212377 2205217 2204793 2216698 2204009 2193461 2207171 2233879 2232199 2183038 2153374 2184367 2174672
9951 2174672 2162609 2120254 2116776 2111161 2105688 2113406 2132845 2141649 2130112 2146903 2176158 2170622 2180016
9938 2180016 2145837 2129842 2166085 2176385 2141588 2109832 2108388 2142072 2144181 2163208 2167647 2150666
9926 2150666 2118433 2149851 2193721 2225586 2249064 2246955 2269730 2363907 2402146 2472392 2512967 2496928
9914 2496928 2456011 2412771 2374230 2346243 2335941 2298146 2246590 2230616 2166915 2125383 2131941 2141593
9902 2141593 2151014 2158785 2156184 2122254 2115799 2111027 2140590 2178686 2188993 2147824 2142539 2207393 2268672
9889 2268672 2267420 2266190 2276545 2258882 2273355 2292936 2305963 2343578 2365374 2361101 2380630 2398499
9877B398499J09j0147Q400N8272M4588N092O899K823k5540j3466j7722j5305J486
9864B443988J4640J2198m140r818q188K7425M3010M2327k989l0629j328k8449
9852B498047L5800O5121K2391K6448K2918K3714R7524J06532J40645K26985M25690
9841C691815P34598Q77903M95003k72069p61880p01629m39839k60599j19313n6555
9831C187435k2363J2104M764J2697P653M146K4188K3915P0380K1269J8897q43
9819C364242n983K3299M7527L7082M1530M8627P2607M8527N0736P8691O1509M1667
9807C910061N0847O8508R4468N6071O0954P0729N8845Q3015J11608P2488J06885
9796D744479J09808R0902J16317J12715Q1311Q4598J27348J11926J12529J53600
$$ plain form
9877 2398499 2398608 2388461 2396861 2455133 2499721 2504813 2511712 2514535 2488995 2475529 2457807 2442502 2443988
9864 2443988 2458628 2470826 2466686 2456868 2448680 2476105 2519115 2561442 2558453 2527824 2526496 2498047
9852 2498047 2533847 2598968 2621359 2647807 2670725 2694439 2791963 2898495 3039140 3266125 3691815
9841 3691815 4426413 5304316 5799319 5527250 4765370 4063741 3623902 3363303 3243990 3187435
9831 3187435 3165072 3177176 3181940 3194637 3202290 3206436 3230624 3254539 3324919 3346188 3365085 3364242
9819 3364242 3358259 3381558 3429085 3466167 3507697 3556324 3628931 3677458 3728194 3806885 3868394 3910061
9807 3910061 3960908 4029416 4123884 4179955 4240909 4311638 4370483 4453498 4565106 4637594 4744479
9796 4744479 4854287 4945189 5061506 5174221 5255532 5340130 5467478 5579404 5691933 5845533
9786E845533J26501J30009J22035J31723J36937J73165J81951K06538J57098J90174
9776G401664J83298K24389K28797K36522K37615K49967K82306K44861K57621K69790
9766I816830K93136L43661L34669L51502L88477L92766M47276M64349N09312O01688
9756A3943666O84925P00324O21120M87980L24725K61692L01754L21414L90432
9747A8038032M59821M51282M79571M66586M92049N06244M80568M61100M43901
9738B2279154M64595L97101L89263L74141L20754L02833K39043K15633J83172
9729B5165689J41261J15197J39568J36566J85174K22186J56876l4476l64614o33880
9719B5229547p69360p82554p35615o58469o06615n84443n51189n21738n37397
$$ plain form
9786 5845533 5972034 6102043 6224078 6355801 6492738 6665903 6847854 7054392 7211490 7401664
9776 7401664 7584962 7809351 8038148 8274670 8512285 8762252 9044558 9289419 9547040 9816830
9766 9816830 10109966 10453627 10788296 11139798 11528275 11921041 12368317 12832666 13341978 13943666
9756 13943666 14628591 15328915 15950035 16438015 16762740 17024432 17326186 17647600 18038032
9747 18038032 18497853 18949135 19428706 19895292 20387341 20893585 21374153 21835253 22279154
9738 22279154 22743749 23140850 23530113 23904254 24225008 24527841 24766884 24982517 25165689
9729 25165689 25306950 25422147 25561715 25698281 25883455 26105641 26262517 26228041 25863427 25229547
9719 25229547 24460187 23677633 22942018 22283549 21676934 21092491 20541302 20019564 19482167
9710A9482167n45815n52660n58830n32861m69821m68386m71619m75125m54935
9701A4952115m16364m31827m56333m36641l83553l62001l67987l84184l37561
9692A1375664l44230l33592k98046k88016l03550k93029k90045k65042k25516
9683H734598k16486k29064k30492k43905j91163j80456k01258j83897j78798k00737
9673F678342j80323j39551j38325j21447j17076j47220j45031r3419p5564j23670
9663E396716j30589j17018j05139j08598j33749r6149n9385q4394r2460q7507
9653D381728j09919r5306q4459m4345o4736j09905m5397p1752o0056q6351n1826
9642C557676q6079p7569P439J571p0833r1471r3730p7695m2383l9157o2970m8167
$$ plain form
9710 19482167 18936352 18383692 17824862 17292001 16822180 16353794 15882175 15407050 14952115
9701 14952115 14535751 14103924 13647591 13210950 12827397 12465396 12097409 11713225 11375664
9692 11375664 11031434 10697842 10399796 10111780 9808230 9515201 9225156 8960114 8734598
9683 8734598 8518112 8289048 8058556 7814651 7623488 7443032 7241774 7057877 6879079 6678342
9673 6678342 6498019 6358468 6220143 6098696 5981620 5834400 5689369 5595950 5520386 5396716
9663 5396716 5266127 5149109 5043970 4935372 4801623 4705474 4646089 4561695 4469235 4381728
9653 4381728 4271809 4176503 4092044 4047699 3982963 3873058 3827661 3755909 3695853 3609502 3557676
9642 3557676 3471597 3394028 3401467 3403038 3332205 3240734 3147004 3069309 3026926 2987769 2924799 2876632
9630B876632l0275j4087l1159m3099l0989m7704n6974l1623l6885m8668m2140
9619B463029j2807m4672j9628m8204o6801m2102l2959P609k67o431p667m7982
9607B141118j9433k1288J2907n1147o1242j2898j7711l4392k2177j6803q48N85
9595A896671n172k9886n2078l5491Q248j0473j9742m6756m1863k9063n785M713
9583A633323j7321Q874n8432k8808L750J0294j515J4272L5695l3765l2277n2057
9571A482033l6969k2554l198J4910J3130j4990j3613j296j6926m3347l3100j7126
9559A306954K5989K8861J6527k88j8917k7274k5013n419J0563p342n6863n032
9547A242746R165j9674J2221j4450j9326J2836J678k2519k7953J8363L7005M827
$$ plain form
9630 2876632 2846357 2832270 2801111 2758012 2727023 2679319 2622345 2590722 2553837 2505169 2463029
9619 2463029 2450222 2405550 2385922 2337718 2270917 2228815 2195856 2203465 2203198 2196767 2189100 2141118
9607 2141118 2121685 2100397 2113304 2062157 2000915 1988017 1970306 1935914 1913737 1896934 1896086 1896671
9595 1896671 1891499 1861613 1809535 1774044 1782292 1771819 1752077 1705321 1663458 1634395 1628610 1633323
9583 1633323 1616002 1624876 1566444 1537636 1541386 1551680 1550165 1564437 1600132 1566367 1534090 1482033
9571 1482033 1445064 1422510 1419312 1434222 1447352 1432362 1418749 1417453 1400527 1357180 1324080 1306954
9559 1306954 1332943 1361804 1378331 1378043 1359126 1331852 1306839 1301420 1311983 1304641 1247778 1242746
9547 1242746 1251911 1232237 1244458 1230008 1210682 1223518 1225196 1202677 1174724 1193087 1230092 1234919
9535A234919J3580J6042l3187j3105k8250n1475k9384k912j8583k2841j054k1084
9523A042666k6351J5724Q065j5043J1776L0728p589j781q625k3583P40L638P404
9510A037769j8n994m3762k7146m999M887j5782j8553R562j7433l038R964Q695
9497I34152M18J1132l334J6344j3942j0256N459m591r181n87j0136k4409k7440
9484H63629N50n144k9224q187o512M673L5979p010j8118k9421K1681L52m468p670
9470H11110J682J7886K5041j7918j3000N306L701m308r452p774k3234l2625k6140
9457G30275M365o570j9074P817J4523O364j322r06k0074L047n569R87J4241Q090
9443G36194J3556j0359r131o807j8205q676j0025j2481k2892R793p30n562j564
$$ plain form
9535 1234919 1248499 1264541 1231354 1218249 1189999 1138524 1109140 1106228 1087645 1064804 1063750 1042666
9523 1042666 1016315 1032039 1040104 1025061 1036837 1067565 1059976 1058195 1049570 1025987 1026727 1030365 1037769
9510 1037769 1037751 1031757 987995 960849 955850 960737 944955 926402 935964 918531 915493 925457 934152
9497 934152 934570 945702 942368 958712 944770 934514 939973 935382 926201 925614 915478 891069 863629
9484 863629 864179 859035 829811 821624 815112 819785 855764 848754 830636 801215 822896 823248 818780 811110
9470 811110 812792 830678 855719 837801 824801 830107 833808 829500 820048 812274 789040 756415 730275
9457 730275 734640 728070 708996 716813 731336 737700 736378 735472 715398 718445 712876 713863 728104 736194
9443 736194 749750 739391 730260 723453 705248 696572 686547 674066 651174 660967 660237 654675 653111
9430F53111J6138K3984l2901j3860K4245K1744M425l361J261K142k4552k7992
9418F44384j0986j314r870k070O705j0235l3P171k206o46P021J2808K2451k8862
9404F34318j244L835k9476l4262J3247R592J7788m5299p697J0704j5941j3315
9392E42250M0673K4650l021k3893j0689j1717K1688K2585k4460J5857J7145M323
9380F15391r449j8541j1764J4379L512J8489J4203M117k3257k9193k4255R77M367
9367E58976K26j0438q2l125K8187O757J4444k7111m4024p604l0641K5952L3215
9354E44732Q098j9813j2612J416O632n741O891J9934J689K2261j2857L529j0045
9341E54114n358j0427j8583l4295j8036M039J9393K1056j5170M4802K6312j964
$$ plain form
9430 653111 669249 693233 660332 646472 670717 692461 696886 693525 694786 696928 672376 644384
9418 644384 633398 632084 622214 620144 626849 616614 616581 623752 621546 620900 627921 640729 663180 634318
9404 634318 633074 636909 607433 573171 586418 596010 613798 568499 560802 571506 555565 542250
9392 542250 582923 607573 604552 580659 569970 558253 579941 602526 578066 593923 611068 615391
9380 615391 605942 587401 575637 590016 593528 612017 626220 630337 607080 577887 553632 554609 558976
9367 558976 559202 548764 548682 545557 573744 580501 594945 567834 523810 516206 485565 511517 544732
9354 544732 552830 533017 520405 521821 528453 522712 529603 549537 551226 573487 560630 564159 554114
9341 554114 548756 538329 519746 485451 467415 471454 490847 511903 496733 541535 567847 565883
9329E65883m783m0224k8744K3679L7727j5572m0215K4109K0528j2834k3925Q00
9317E06429m588K676l682J0952L4074J0717j8254l2053p475q791m576O28J1037
9304D97094j5973l3536K1933k1749J4499k7713k2997K3263l566k2480L161q928
9292D03008J3166l2608J4304J7794J6847K489R884p893j5204k318J0941O363j5984
9279D20789k0968j739n169j7179L1890J6257J3090k3894k3202j1728J6051L6040
9267D30238j378K296l698k2980P748J5966o284k0171k0842L587l164J843j114
9254C82047J9551l7552j1412K1879k1494N125J6715L0241k680l608M013n714l5694
9241C61417k0599K6724K9497J4899J074l8010J3331K559l0854J5228L2310r12
$$ plain form
9329 565883 561100 520876 492132 515811 553538 537966 497751 521860 542388 529554 505629 506429
9317 506429 501841 504517 500835 511787 545861 556578 538324 506271 498796 490005 485429 486057 497094
9304 497094 481121 447585 469518 447769 462268 434555 411558 434821 431255 408775 411936 403008
9292 403008 416174 383566 397870 415664 432511 435000 444884 436991 421787 419469 430410 436773 420789
9279 420789 399821 398082 392913 375734 407624 423881 436971 413077 389875 378147 394198 430238
9267 430238 428860 431156 427458 404478 412226 428192 421908 401737 380895 384482 381318 383161 382047
9254 382047 401598 364046 352634 374513 353019 358144 374859 405100 402420 398812 402825 397111 361417
9241 361417 340818 367542 397039 411938 413012 375002 388333 390892 360038 375266 407576 406664
9229D06664k4376p563L20j4536j6490J2193K4677J7757M348q264j4235o190K1061
9216C95366j1282n6971Q302m844M856L723J8000j535J5096J8282K4370n703l6044
9203C71616j326j4169m0238J2768K0668l4326j3703j487J5802K0970o22k1144
9191C14809o419K581P916J0591R365J8272J1705l2186k2488M5318K8553k8655
9179C59362r467K6172O831j1404m73l163q703M523M361k2784l0354m3067N867
9166B77701Q382K5411K5666L603n1285N284J9669j499k2142q22L4703P863p674
9153C24860n880q270n103p524j6913j5110m306M933K1774j89K2554j1230k8557
9140B71039r077n88P38Q631L3575K1248m725p727K9493l663m0798m2202K0494
$$ plain form
9229 406664 382288 374725 375045 360509 344019 356212 380889 398646 402994 394730 380495 374305 395366
9216 395366 384084 327113 335415 330571 335427 339150 357150 355615 370711 388993 413363 407660 371616
9203 371616 370290 356121 315883 328651 349319 314993 301290 299803 315605 336575 335953 314809
9191 314809 308390 310971 318887 329478 338843 357115 368820 336634 314146 359464 388017 359362
9179 359362 349895 376067 382898 371494 371021 367858 359155 363678 368039 345255 314901 271834 277701
9166 277701 286083 311494 337160 340763 289478 294762 314431 312932 290790 289968 324671 332534 324860
9153 324860 318980 310710 305607 298083 281170 266060 261754 266687 288461 288272 310826 299596 271039
9140 271039 261962 261374 262112 270743 304318 325566 320841 313114 342607 338944 298146 255944 276438
9127B76438L0706n91k3583k6177r650j4633k7849K7333L9900N919n661J3045p356
9114B77841N734L6739R189m1655j2069K7235N567M375j1368k2311o697L5137J1596
9101C19313J1482J8774j9334k0798j2896m871K1723M09k9252p483k7986j4566
9089B34515J195K8856r456k7486j76O644J793R487j0508m653j3674K8033K0443
9076B65013J2722L6135j4498J0797j3132l6806q139J2525J4595J2888j337j2965
9064B77798j8866k2012k1241J3838K3444j2245j2651O167p763j3479l094L4538
9052B44434J8622l322J0987k1692j9391l3552Q016P50K2568N3321l710L322k463
9039B77890k2604j7417l5288K5841K7481Q953J0971l947N864J647k3262j8138
$$ plain form
9127 276438 307144 306553 282970 256793 247143 232510 204661 231994 271894 277813 272152 285197 277841
9114 277841 283575 320314 329503 287848 275779 303014 308581 312956 301588 279277 272580 307717 319313
9101 319313 330795 349569 330235 309437 296541 291670 313393 313802 284550 277067 249081 234515
9089 234515 235710 264566 255110 227624 227448 234092 235885 245372 234864 230211 216537 244570 265013
9076 265013 277735 313870 299372 310169 297037 260231 252092 264617 279212 292100 290763 277798
9064 277798 258932 236920 215679 229517 252961 240716 228065 234232 226469 212990 209896 244434
9052 244434 263056 259734 270721 249029 229638 196086 204102 204852 227420 280741 277031 280353 277890
9039 277890 255286 237869 202581 228422 255903 264856 275827 271880 277744 279391 256129 237991
9027B37991P656K4440J1322j9172L518J8303L9136K7095K3534J687j7905j5681
9015C41924m8480K0294J2752l5415l2920p31j6819j6199K1614m47o060K6476K2823
9002B88812M228j3172L531k7497q01J7302N810J1204K6992j8936j2767j1736l2434
8989B40536J2758n565l942k0183l0466K4216J3251j1067r19j7858j6580j9419
8977A64762J7529J4815J0169L489K2806P378j4969q769n228n708j6658J0173M335
8964B04124m275J9612J184Q386J1088j0145O202O776R934m5919k2809K6217J2190
8951B22565J481r762L902m460l0520L864L538j7305K0388K2353j1871j564M13
8938B03022O774J116J0446J8251k4953k4782r022J0266j5542K4625L4955q681
$$ plain form
9027 237991 245647 270087 281409 262237 265755 284058 323194 350289 373823 375510 357605 341924
9015 341924 293444 313738 326490 291075 258155 257424 240605 224406 246020 245573 239513 265989 288812
9002 288812 293040 279868 283399 255902 255101 272403 278213 289417 316409 297473 284706 272970 240536
8989 240536 253294 247729 243787 223604 193138 217354 230605 219538 218619 200761 184181 164762
8977 164762 182291 197106 207275 210764 233570 240948 225979 217210 211982 206274 189616 199789 204124
8964 204124 199849 219461 220645 229031 240119 229974 236176 242952 252886 206967 184158 210375 222565
8951 222565 224046 214284 218186 213726 183206 187070 190608 173303 193691 216044 204173 202609 203022
8938 203022 209796 210912 221358 239609 214656 189874 180852 191118 175576 200201 235156 226475
8926B26475k447l658p702J8750P622k1456k8747K8759L0335p509k5210k0689q155
8913A86368K150J742r897K7119J6149k4515Q354K7709J1735l4007n0537P666m250
8900A65786L548j6032K0601J9126j410p26o902K630R134J2039j193k305j4410
8887A89886q261O54j3564J8872J3105K508J411Q363O255N843j3879K0531j0028
8874B21696M0305N2506M5692M0358P3123J13703J58142K49406L66065L09360J2929
8863A683285l01033l57747k85280j67380j03035p5040l4741j6910j3781L608J5270
8852C47216k9925k4992K3093k0019m4717j7307k5134j1357Q24k9316j7273J8462
8840A69555o985K0538K2997p885l4465O229M8648J141J933J5790l2709j8558o623
$$ plain form
8926 226475 224028 220370 212668 231418 239040 217584 188837 217596 247931 240422 215212 194523 186368
8913 186368 188518 190260 180363 207482 223631 199116 207470 235179 246914 212907 162370 170036 165786
8900 165786 169334 153302 173903 193029 191619 190893 183991 186621 195755 207794 206601 204296 189886
8887 189886 181625 182279 168715 187587 200692 203200 204611 212974 219229 225072 211193 231724 221696
8874 221696 262001 314507 360199 400557 473680 587383 745525 994931 1360996 1670356 1683285
8863 1683285 1382252 1024505 739225 571845 468810 393770 359029 342119 328338 331946 347216
8852 347216 317291 292299 315392 295373 250656 233349 208215 196858 197682 168366 151093 169555
8840 169555 162570 183108 206105 198220 163755 169984 218632 219773 221706 237496 204787 186229 179606
8827A79606k3180P684L8436r86l0930j011j2874J6909L0567K3100k1738k4184
8815A81399M854K4734P547j8929K898j8494k8903p028J5382k216J4212J1385q647
8802A78194j817N207j6042n795J8576J4888k1513l0988J0398K2980R520K5065
8790B08673j9560m9481J106K8679l076M130K2095J370j7085J0024Q414R512K0956
8777B25757J8j6321j537k7205k8403j5306J8710J5872M8553K6267k4719k477l3838
8764A85371n0329J9914M4924p251M556M861K81k7896j3160J9250k601N312k7867
8751A55365k0986O181q832K1386P180r785j1810L5412K7677n839j3339l6381j0156
8738A36073M579N744J4144j8009N452N392O966k1587K5221L9511N5k2826k9698
$$ plain form
8827 179606 156426 164110 202546 201560 170630 169619 156745 173654 204221 227321 205583 181399
8815 181399 186253 210987 218534 199605 202503 184009 155106 148078 163460 161244 175456 186841 178194
8802 178194 176377 181584 165542 159747 178323 193211 171698 140710 151108 174088 183608 208673
8790 208673 189113 139632 140738 169417 166341 170471 192566 193936 176851 186875 195289 204801 225757
8777 225757 225775 209454 207917 180712 152309 137003 155713 171585 220138 246405 221686 219209 185371
8764 185371 135042 154956 199880 192629 197185 202046 202327 174431 161271 180521 177920 183232 155365
8751 155365 134379 140560 131728 153114 160294 150509 138699 174111 201788 195949 182610 146229 136073
8738 136073 140652 146396 160540 142531 147983 153375 160341 138754 163975 203486 203541 180715 151017
8725A51017m411J345j4355r137L4704O108j1782P811l835j4219o533J3973k216
8712A48470j9262O483M623M887J5829K609J222j2525k1863j2574J9476J3466o800
8699A44041j4656Q40Q066k4888k2133K0305J6533j365k423l841L8829O388k0891
8686A44805k0988L2718L6589J154l9491r840q603k6646q914K9936P733r29L0321
8673A67845n117K557k4132k7410K1816J5069L5442j0018k2399q347L5689R395
8661A90390j0608J1025p253k2802K860Q948j9522j5197K5517M7510J8621n5424
8649A74065k7586J0414j2307K1382K0728J7554R173N6735Q4547J41512K00122
8638F96339K09605J9448j95610j78713j29836r5873m1482k5568l0965m942k1602
$$ plain form
8725 151017 146606 147951 133596 124459 159163 165271 153489 161300 157465 143246 136713 150686 148470
8712 148470 129208 135691 140314 145201 161030 163639 164861 152336 130473 117899 137375 150841 144041
8699 144041 129385 130225 138291 113403 91270 111575 128108 126743 124320 120479 159308 165696 144805
8686 144805 123817 156535 193124 194278 154787 144947 136344 109698 100784 130720 138453 137524 167845
8673 167845 162728 165285 141153 113743 135559 150628 186070 176052 153653 145306 180995 190390
8661 190390 179782 190807 183554 160752 163612 172560 153038 137841 163358 210868 229489 174065
8649 174065 146479 156893 144586 165968 186696 204250 213423 270158 354705 496217 696339
8638 696339 905944 925392 729782 551069 421233 325360 283878 258310 227345 222403 200801
8627B00801K6310m2135l2961j2581j5393q244J0075K8774J9789M1168j8464P85
8615A97924q726m186j9956L118K0135K5141j4794q326K6772M1757Q5844J81541
8603E26244J96854K62528J84016q5830k49976j73631k1592N0326K21602M28724
8593A339265M46474R8183l76673m27538k89568j81248n6337l8309j7899k5831
8583D70519k2433j5569o55R473j480o164p823k4903q1731m6928p470n277j8019
8570B41540J5788r972k880l454L500K0978K1114K8646R1794J14127J75071K99891
8558I96143N05640N15325P851m90514m83737k46070j38190o5184K4779J20697
8548G46740K26385J03552j35613k34656j75841j02986l2765J8732j8724l7017
$$ plain form
8627 200801 227111 184976 152015 139434 124041 115797 125872 154646 174435 215603 197139 197924
8615 197924 189198 185012 165056 168174 188309 213450 198656 190330 217102 258859 344703 526244
8603 526244 723098 985626 1169642 1083812 833836 660205 638613 688939 910541 1339265
8593 1339265 1785739 1883922 1507249 1079711 790143 608895 552558 514249 496350 470519
8583 470519 448086 432517 431862 441335 439855 433691 425868 400965 319234 272306 264836 259559 241540
8570 241540 257328 247356 244476 241022 244522 265500 286614 315260 407054 521181 696252 996143
8558 996143 1501783 2017108 2024959 1534445 1050708 804638 666448 601264 626043 746740
8548 746740 973125 1076677 941064 706408 530567 427581 394816 413548 394824 357807
8538C57807k7297l8582n2845j0453M333k7365l0549k7991n791K7515J2962l343
8526A78401l1844n79o800J2315J748J3084J4418J6237L1653K2099R1120J23729
8514D65581J51316K27949J81992j08957l00299j88236q8370o7571l5365k8514
8504B09526k0132k2942M181m99j5746j989n776m752R136J621k8871q146O350j019
8490A20942P493P438k0380k7550p805J9589n59j2463K1215J8834J9257K1471k1607
8477A45875J1690L305L311j873k4990Q828J0719k3068k7631j0003o368l366P719
8464I4148l264J891k964l5519J4098L2270k0316k2327l5968J7760J5611j1560
8452D3860P731M5285J7120j9723l054K0444J4525j0333M718k4053l533K142Q353
$$ plain form
8538 357807 330510 291928 239083 228630 232963 205598 175049 147058 141267 168782 181744 178401
8526 178401 146557 145978 139178 151493 153241 166325 180743 196980 228633 250732 341852 465581
8514 465581 616897 844846 1026838 917881 617582 429346 340976 273405 238040 209526
8504 209526 189394 166452 170633 170134 154388 152399 146623 141871 151007 152628 123757 115611 121961 120942
8490 120942 128435 135873 115493 87943 80138 99727 99168 86705 107920 126754 146011 167482 145875
8477 145875 157565 160870 164181 162308 137318 146146 156865 133797 106166 96163 89795 86429 94148
8464 94148 90884 92775 89811 54292 68390 100660 80344 58017 22049 39809 55420 43860
8452 43860 51591 96876 113996 94273 91219 111663 126188 115855 120573 96520 92987 95129 103482
8439A03482J4355j2851j923j675L2671L98k4055k8607k7792j2500L570N5778L2531
8426A33382L110j8105j2175q267j3068l362K6556L1934p465l6298q208j2218Q152
8413H3968J3605k1972J0591j4168N505Q087j0337n845k9005J8197J3876m408j4506
8400E3588o548K9477N176l2367J8861J7943k3518J27O421J9744J7412N757J2844
8387A24917J5730l9683r678K2616J5059l84j5254m602R99r179J5189J4529j8988
8374A11271r067J7040j9767P273J6446k976J3764Q73k4066l1541p325q302N803
8361F9426P941n362r498k001L5340J6282J1453J7744k659o682k050K2339k0650
8348A31623l0726J9140L0898l795M312j7265n626k1354M185r495l0872k7326M977
$$ plain form
8439 103482 117837 104986 103063 101388 134059 134457 110402 81795 54003 41503 45073 100851 133382
8426 133382 136492 118387 106212 97945 84877 81515 108071 140005 132540 96242 88034 75816 83968
8413 83968 97573 75601 86192 72024 77529 85616 75279 69434 40429 58626 72502 68094 53588
8400 53588 47040 76517 81693 49326 68187 86130 62612 62739 69160 88904 106316 112073 124917
8387 124917 140647 100964 91286 113902 128961 128577 113323 108721 109720 100541 115730 130259 111271
8374 111271 102204 119244 99477 106750 123196 120220 133984 134857 110791 79250 71925 63623 69426
8361 69426 77367 72005 62507 60506 95846 112128 123581 141325 138666 131984 129934 152273 131623
8348 131623 100897 120037 150935 147140 151452 134187 128561 107207 111392 101897 71025 43699 48676
8335D8676K2172K7566J5284Q194J2601r933l9270j5075k735J6620j0722l4905
8323C8473R511K8306j7485j2645J9902J0568J941k3347J1704k204L0796m62J1735
8310A06793o627p913j897j1116j9248o685q548N745R436J5716j305K3352k5989
8297G1714K5566J4771J2350l0384l52l111J3980Q422l7695k7689R182K9002K4467
8284A10223k9415Q727n940k5201k0316j5124J1237L6558P105j5324j1825j0379
8272D0326K749j8560k5961Q825K6475K6690K810J847j0722l297J7935K4849P072
8259A01038J0600O686j227k1232k2603l2767M732M543j725k2247K0472k5958K25
8246B0537K2766j1514K5080K0421J6280r761K1875L3367O278k0490l621j1440
$$ plain form
8335 48676 70848 98414 113698 121892 134493 124560 85290 70215 67480 84100 73378 38473
8323 38473 47984 76290 58805 46160 66062 76630 78571 55224 66928 64724 95520 95058 106793
8310 106793 100166 92253 90356 79240 59992 53307 44759 50504 59940 75656 74351 97703 71714
8297 71714 97280 112051 124401 94017 93665 90554 104534 112956 75261 47572 56754 85756 110223
8284 110223 80808 89535 83595 58394 38078 22954 34191 70749 77854 62530 50705 40326
8272 40326 43075 24515 -1446 7379 33854 60544 63354 65201 54479 51182 69117 93966 101038
8259 101038 111638 118324 117097 95865 73262 40495 45227 49770 48045 25798 46270 20312 20537
8246 20537 43303 31789 56869 77290 93570 83809 105684 139051 145329 124839 121218 109778
8234A09778Lj7977l3001m2613J682K2982j07n418J6279K1194R686K507j0087l6081
8220C8827J0280L8014k7377r423J086j1736J90K8182j9511p396k413j4748M3717
8207F7692K9217K639l2941k0612l3157K448L5096K5412l1633k2839J5520J5960
8195E2802K0049l508l0749J7486J1038O506P573J1951j5522k5571l1713M7820
8183F8162J4779k6243j4093K465j1555j3909J9000j0345O584J9297k1749k3296
8171I097l0319r67N2111L5374J2169k518j6600l298L816l013O268K9578k6073
8158F5625m430J8360J4386k897o756J1999l2382j3206J6446j7584N72J9719k969
8145F6883q285J0409k4110o500r346l413J3776J3065K4297K6879j0830l857j4613
$$ plain form
8234 109778 109781 91804 58803 16190 17872 40854 40747 35329 51608 72802 82488 84995 74908 38827
8220 38827 49107 87121 59744 50321 51407 39671 39861 68043 48532 41136 38723 23975 67692
8207 67692 96909 99548 66607 45995 12838 15286 50382 75794 44161 21322 36842 52802
8195 52802 72851 69343 38594 56080 67118 73624 81197 93148 77626 52055 20342 68162
8183 68162 82941 56698 42605 45070 33515 19606 38606 28261 34845 54142 32393 9097
8171 9097 -21222 -22189 29922 65296 77465 74947 58347 55049 58865 55852 62120 91698 65625
8158 65625 61195 79555 93941 91044 84288 96287 63905 50699 67145 49561 50133 69852 66883
8145 66883 58598 69007 44897 38397 29051 25638 39414 52479 76776 103655 92825 88968 74355
8132G4355o153K3576K8937L4714j191l552j1212M4532l1609j0057j2563k3214
8120A06563l72j5656k2488l3658j1508q527K3716M2440k1092J048J2276J0729
8108H3471J8218K3941k0161l4984K390P683j1924q897K3787K6320n358l7271q700
8095E8515l804K8933J3650N837j8813K3929O7348l3231j1964r177K7134L2083
8083A80440K2736j7431J4165j3353m0855n9481j5620J4438R420j7250N249J2643
8071I5101K8249J6838O722k0264o359j5153L407J0658L705m60Q319j7060l8694
8058G5009j2696k8485K0803K4279n955j432J3355q631n947o079K6368j3471K2981
8045A00099O593O322K8803j3346j4038J4754K0057q792o711j4604O855M2281k925
$$ plain form
8132 74355 68202 91778 120715 155429 154238 150686 139474 184006 152397 142340 129777 106563
8120 106563 106191 90535 68047 34389 22881 14354 38070 80510 59418 60466 72742 83471
8108 83471 101689 125630 105469 70485 72875 80558 68634 59737 83524 109844 104486 67215 58515
8095 58515 54711 83644 97294 103131 84318 108247 175595 142364 130400 121223 148357 180440
8083 180440 203176 185745 199910 186557 145702 86221 70601 85039 94459 77209 82458 95101
8071 95101 123350 140188 146910 126646 120287 105134 108541 119199 122904 122444 130763 113703 75009
8058 75009 62313 33828 54631 78910 72955 71523 84878 76247 70300 64221 90589 77118 100099
8045 100099 106692 113014 141817 128471 114433 129187 149244 140452 133741 119137 125992 168273 165348
8032A65348m6084j1300r396L249k7998j3878J7096J849r183j0432o574O629K8466
8019H7792R036j3721j3592m632m532J0481J068J0624j8797k6192K34K9424N2313
8006A19506k3099k4953j9282r680K6371K27P31J2587K8120K5279j3536r122l0899
7993H2250l8376K3767J9731N508L4354K9715P754k0835l9105m504K5582J1050
7981A36891m076O5M321j5871j0022j4674o392J75m956K6862K9213n117k351m958
7967A29110K288J4258k8832m3161k2380l093r863k2791M38J8420L2089J7400R124
7954I3007J5492p350J829P233l374K8352K917j3979k9669j3507J1186L0960q867
7941A14230n921k6841r903k466J5097M351Q92m2890j3736J3195K1385L0785P307
$$ plain form
8032 165348 119264 107964 98568 101817 73819 59941 77037 78886 69703 59271 52697 59326 87792
8019 87792 96828 83107 69515 64883 60351 70832 71900 82524 63727 37535 37769 67193 119506
8006 119506 96407 71454 52172 42492 68863 69090 69821 82408 110528 135807 122271 113149 82250
7993 82250 43874 67641 87372 92880 127234 156949 164703 143868 104763 100259 125841 136891
7981 136891 132815 132880 137201 121330 111308 96634 90242 90417 85461 112323 141536 136419 134068 129110
7967 129110 131398 145656 116824 73663 51283 48190 38327 15536 15974 34394 66483 83883 93007
7954 93007 108499 101149 102978 110211 106837 135189 138106 124127 94458 80951 92137 123097 114230
7941 114230 108309 81468 71565 69099 84196 88547 89439 46549 32813 46008 67393 98178 105485
7928A05485J971k648K3216L628p693K7805J1053l0253j3726m316j4645j4059j2733
7915G3085J0533L5649P156k6179j6336O545K181q63K1291K0168p525k4700j5342
7902H5663j084k4115q67K1611J5439j5321j5173j6112J153q831L489K7015J3720
7889H6587j185J6930k7710l6998n151J8705R631N62J7627J5202k5992N460J8569
7876I2237j588j6079L508j0829j4867k873Q879J9351K1795k7161l3153j0421K9648
7863E8447L5693k3067k9169P795Q080j1150j8774P028K3643Q497N962O705r613
7850G0077K0882L2207k9758j1637j2262J151k2750j0166R098N378J2772p332p542
7837E0118K741M277K706J9076J0757o919j5362k0154j3727k7284M655M6659j5072
$$ plain form
7928 105485 107456 104808 128024 131652 123959 151764 162817 132564 118838 114522 99877 85818 73085
7915 73085 83618 119267 126423 100244 83908 90453 92634 91771 113062 133230 125705 101005 85663
7902 85663 84579 60464 59597 81208 96647 81326 66153 50041 51194 42363 45852 72867 86587
7889 86587 85402 102332 74622 37624 32473 51178 60809 61371 78998 94200 68208 73668 92237
7876 92237 90649 74570 78078 67249 52382 49509 58388 77739 99534 72373 39220 28799 58447
7863 58447 94140 71073 41904 49699 57779 46629 27855 34883 58526 67023 72985 79690 70077
7850 70077 90959 123166 93408 81771 69509 70660 47910 37744 46842 52220 64992 57660 50118
7837 50118 52859 57136 59842 78918 89675 82756 67394 47240 33513 6229 10884 57543 42471
7824D2471o712j1842r398L2051J1380J0620J5824J9806L23n3010l5405J0492K0135
7811D6735k437J3622J8310k2177J0252P080L555l0752J2452J9098k7816m3137
7799D785n377N2061l90j331J1497k8416j8886J4958R118j2778R356Q296j0581
7786C2312j6733l624K9892J8254M261l681O383m71j2762J9807N392q29k6044l7651
7772A4506j3772M5964n558k7072J9434K0405q920p187k0416j6317j724J7172o83
7759A5832J2514j7853q409P101k6564M191K1719j1340j4499K8004L4264O430j9498
7746C1892k929j9982J397K44p257l373K6604K7240j5129OM22J6299j2745r723
7732C2966k5764K7708K3199r321J0575j3041J0979J3418J4919L56r304k5009p961
$$ plain form
7824 42471 35759 23917 14519 46570 57950 68570 84394 104200 104523 51513 16108 26600 46735
7811 46735 44298 57920 76230 54053 64305 71385 74940 44188 56640 75738 47922 4785
7799 4785 -592 51469 51079 49748 61245 32829 13943 28901 38019 25241 34597 42893 32312
7786 32312 15579 11955 41847 60101 64362 60681 67064 66593 53831 73638 79030 78201 52157 14506
7772 14506 734 46698 41140 14068 33502 53907 44987 37800 17384 1067 -657 16515 15832
7759 15832 28346 10493 2084 9185 -17379 -13188 8531 -2809 -17308 10696 44960 51390 31892
7746 31892 28963 8981 10378 10622 3365 -8 26596 53836 38707 38713 39135 55434 42689 32966
7732 32966 7202 34910 58109 48788 59363 46322 57301 70719 85638 85994 76690 51681 43720
7719D3720R467J8001k5924k0059j940j9082L176J3876j1519J4865J8751L9143
7707H2475l0221k2486J7909K5668L713m856J867k1372M242J3292k3503m8007J2797
7694A1518K5035K973m192j8406K0706L1803k8126M097J3747k406k0458r213J1884
7681C8962J7694J4389M786J4129j210j3917l3301J2683J0165j1303n286j8830
7669B8961o111J591j5450K4899J3689n758K235J049j0898n217o267J3589J7422
7656E3734k0934R626M834R633l4767l3743M1730o821l63j4996j1571L729L7464
7643C7555j7496j5373L513k9476J2739J8156M1929m2595k9559R182k6265M626
7631c3064Q696L4840Q730j3600j7280K6264K5797l348J0630J8534k2674K3530
$$ plain form
7719 43720 53187 71188 45264 25205 23265 4183 7359 21235 9716 24581 43332 82475
7707 82475 52254 29768 47677 73345 77058 72202 74069 52697 56939 70231 46728 -1279 11518
7694 11518 36553 39526 35334 16928 37634 69437 41311 45408 59155 56749 36291 27078 38962
7681 38962 56656 71045 75831 89960 88750 74833 41532 54215 64380 53077 47791 28961
7669 28961 22850 24441 8991 33890 47579 41821 44056 45105 34207 28990 22723 36312 53734
7656 53734 32800 42426 47260 56893 22126 -11617 30113 23292 22929 7933 -3638 91 37555
7643 37555 20059 4686 8199 -21277 -8538 9618 51547 8952 -20607 -11425 -37690 -33064
7631 -33064 -24368 10472 19202 5602 -11678 14586 40383 37035 47665 66199 43525 67055
7619F7055K7549J6786j9470k7093k2127M670l1784k6347N413K805K8009K4744
7607E0210j0378r688j0484L2330J0370J2148j1541k0898l867n405j9112l800J7335
7594B7220j3023J0777j7418j79K7050J0060l0976J1401q776k2721R541Q375j2851
7581a520J7062L6012J510n6017L596M544K123L3630p672J5383m129k4200j2577
7568G745n917J1487K7318K1435J2487J401j3587p955k3175k6903q714N1206j723
7555D5105j3370R354K8680l874l0192p184J2051K3087J88k2339n165q606q338
7542A9397j6126k7646M3041M2166l240M345o993j3024j0259j0881l1069K054J7242
7529I007l112k7984j052M944p131K1570J8501L3638o349j8442q220k00L701K3892
$$ plain form
7619 67055 94604 111390 91920 64827 42700 47370 15586 -10761 -5348 -2543 25466 50210
7607 50210 39832 30144 19660 51990 62360 74508 62967 42069 38202 32797 13685 9885 27220
7594 27220 14197 24974 7556 7377 34427 44487 13511 24912 16136 -6585 2956 11331 -1520
7581 -1520 15542 51554 53064 -2953 643 5187 7310 40940 33268 48651 44522 20322 7745
7568 7745 1828 13315 40633 62068 74555 75956 62369 54414 31239 4336 -4378 46828 45105
7555 45105 31735 41089 69769 65895 35703 28519 40570 63657 63845 41506 36341 27735 19397
7542 19397 3271 -24375 18666 60832 57592 61937 54944 41920 31661 20780 -10289 -8235 9007
7529 9007 5895 -22089 -23141 -18197 -25328 -3758 14743 48381 42032 23590 15370 15170 18871 42763
7515D2763l362j8483R749n214k1724K547L0661J1229J7165r472k3052M219J4178
7502E1204J0401k3604J76k552q284j7930k0011p326j4537r551K1226K8572J3636
7489B1420j0255j0668n200J8981K3242k4832j9231L1278K217O021k414j5880K640
7476A7319J3969M316k2614p597K0272K0109j2490K2811K1361J1885j018l8852
7464D9471j3956R124m076q618l152K1939j3419k3102R740K166m432k8837j2147
7451a9299K3418J6954J4856j4826L2739p758m1093J386M236m313J4960O634j0818
7438A7076j1570n191L4958k173r747M237j8576K3620L118q710o714L352p803J4466
7424C0343L2895m714p836k8985j7352K219K8092j9539J942q415P080l5059J247
$$ plain form
7515 42763 39401 20918 30667 25453 3729 6276 36937 48166 65331 55859 32807 37026 51204
7502 51204 61605 38001 38177 35625 27341 9411 -10600 -17926 -32463 -42014 -20788 7784 21420
7489 21420 11165 497 -4703 14278 37520 12688 -6543 24735 26952 32973 30559 14679 17319
7476 17319 31288 35604 12990 5393 25665 45774 33284 56095 77456 89341 88323 49471
7464 49471 35515 44639 40563 31945 28793 50732 37313 14211 23951 26117 21685 -7152 -19299
7451 -19299 4119 21073 35929 21103 53842 46084 4991 6377 10613 6300 21260 27894 17076
7438 17076 5506 315 35273 33100 23353 27590 9014 32634 35752 27042 20328 23680 15877 30343
7424 30343 63238 58524 50688 21703 4351 6570 34662 15123 17065 8650 15730 -19329 -18082
7411a8082K4743j1388m517K6241J6541R665j6511Q062M485L4680j3568k0189J3518
7398E3680K0881q738k0808K1573p766l0784l7450J0330K1789J1528j6068j8390
7386b23J2866L5395L650m6287l2632K0756L8404j7620j0641R949r518k8716J5571
7373i046M1499J9634K234j5929l9194j0280L9455L1323r066k2981l7256l0909
7361d0516K4204L8006K8849l780k3840J1987j0326k8098j8225K0591J6147K727
7349A7726j4575q600N495l1634J7805M1091J9065l9077q086Q462N757J2568J1700
7336C7697k8083n559J3402J4044N438j3731l7914J8116J090L4436K764o721q744
7323B6235j6747K2425J105J2673J219m2812l4519L2781K3100l0623k677K2015
$$ plain form
7411 -18082 6661 -4727 -9244 16997 33538 43203 26692 34754 39239 73919 60351 40162 53680
7398 53680 74561 65823 45015 66588 58822 28038 -9412 918 22707 34235 18167 -223
7386 -223 12643 48038 51688 5401 -27231 -6475 31929 14309 3668 13617 4099 -24617 -9046
7373 -9046 32453 52087 54321 38392 -802 -11082 28373 59696 50630 27649 -9607 -40516
7361 -40516 -16312 21694 50543 46763 22923 34910 24584 -3514 -21739 -1148 14999 17726
7349 17726 3151 -5449 46 -31588 -13783 27308 46373 7296 -790 7672 13429 25997 37697
7336 37697 9614 4055 17457 31501 36939 23208 -14706 3410 4500 38936 41700 34979 26235
7323 26235 9488 31913 33018 45691 46910 4098 -30421 2360 25460 -5163 -7840 14175
7311A4175M580j0665Q211J7339P153L1910j6858k4362j3786L6519J3151j5361
7299E2006k5403k7442l3769O190m227L5865M6630n478r086k1437k2423K681K8676
7286B2783P446K5093k0345k6236J5970L4281N916p155k0824k9158O632l3243j9066
7273c7906l898K5191j74J6445J6367J4754J1208k3234j0589j7515l5629K4896
7261b0084P903k9516N256K7140L7647K3095m1130m5975K2380M0020M7812j9502
7249E5046m1408j9395k2903L24R223J0422J5876p474J2311J8035j1612j2628j2528
7236f711p388m163j639K5630J9086J1941j3983m4341J2846J1216k324K1048j7751
7223C467j1331J5695l2076j0383k14K2255q019J7217M167j0274k4921j1333q875
$$ plain form
7311 14175 18755 8090 16301 33640 40793 72703 55845 31483 17697 54216 67367 52006
7299 52006 26603 -839 -34608 -28418 -32645 3220 49850 44372 35286 13849 -8574 -5893 22783
7286 22783 30229 55322 34977 8741 24711 58992 64908 57753 36929 7771 14403 -18840 -37906
7273 -37906 -41804 -16613 -16787 -342 16025 30779 41987 18753 8164 -9351 -44980 -20084
7261 -20084 -12181 -41697 -36441 -9301 28346 51441 10311 -35664 -13284 26736 74548 55046
7249 55046 13638 -5757 -28660 -28336 -19113 -8691 7185 -289 12022 30057 18445 5817 -6711
7236 -6711 -14099 -18262 -19901 5729 24815 36756 22773 -21568 -8722 2494 170 21218 3467
7223 3467 -7864 7831 -24245 -34628 -34842 -12587 -20606 -3389 778 -9496 -34417 -45750 -54625
7210e4625M457L4270J4304M52J9818J5643N015j4308j2034j2622J4719k2373m480
7197a1764J7621m063K1049K2881L681j3934j8100K3466k425k7152j2421j5064
7185a6225K6073M528R923K3147o889k6898J1568J2645n726j7566o847k5055l6439
7172e3761k4080J2416K062O2432L4383K0422k5902J6248k454N726l7944j4892
7160e344l913K7990l4281l020J6138l466K0114K7589k2429J3011K0132l963k2276
7147B6282r334K8522K3900J0988j0338J6718q144N814j1763K761k0123k7497K1044
7134D8830J9930N91k3248k3838j5018K4024J2537J4441j4039j7236k1653N59L2315
7121C8195J1720k3038k7021j3503p603k0305k7346P531K3950K21N035k5546L182
$$ plain form
7210 -54625 -50168 -15898 -1594 -1142 18676 34319 39334 25026 12992 370 15089 -7284 -11764
7197 -11764 5857 1794 22843 45724 49405 35471 17371 40837 38412 11260 -1161 -16225
7185 -16225 9848 14376 24299 47446 40557 13659 25227 37872 32146 14580 7733 -17322 -53761
7172 -53761 -77841 -65425 -63363 -931 33452 53874 27972 44220 41766 47492 9548 -5344
7160 -5344 -9257 18733 -15548 -18568 -2430 -5896 14218 41807 19378 32389 52521 48558 26282
7147 26282 16948 45470 69370 80358 70020 86738 78594 84408 72645 75406 55283 27786 48830
7134 48830 68760 69351 46103 22265 7247 31271 43808 58249 44210 26974 5321 5880 38195
7121 38195 49915 26877 -144 -13647 -21250 -41555 -68901 -61370 -37420 -37199 -32164 -57710 -54528
7108e4528L6603J0171P697K7918p137J358l3847j6401L655L9394N17j5144j8740
7095a8484m3274L814K3464P857L0562K1578J6064K497l6206k4855l45q119j6959
7082d2406L0263q04p183K1515k3747K928k618L76O116J6068o577J5124L5974j9480
7068B5549p996o380P902p986K1281r492p366n535J0154j3751j3783l1237J3007
7055b5633J9695R191N556J3231k689J4307Q709J9061L210o725q450k4727P450
7042C2186R25m253j0900K5914L0785p682j5106m167j6614j6985m491N874Q726
7029B4212K1402j1359r465N040r415k1332j6847K1494K8922m735k0559Q089L6842
7016E2289m898j5363l0781P267j1186r756j1927o202J3348m413l9300k104M0185
$$ plain form
7108 -54528 -17925 -7754 -57 27861 20724 22082 -11765 -28166 -24511 14883 15400 256 -18484
7095 -18484 -61758 -57944 -34480 -26623 3939 25517 41581 44078 7872 -16983 -17328 -25447 -42406
7082 -42406 -12143 -12947 -20130 1385 -22362 -19434 -22052 -21676 -15560 508 -6069 9055 45029 25549
7068 25549 17553 11173 19075 11089 32370 22878 15512 9977 20131 6380 -7403 -38640 -25633
7055 -25633 -5938 3253 8809 22040 19351 33658 42367 61428 64638 57913 49463 24736 32186
7042 32186 33111 28858 17958 43872 74657 66975 51869 47702 31088 14103 9612 15486 24212
7029 24212 45614 34255 24790 29830 20415 -917 -17764 3730 32652 27917 7358 15447 52289
7016 52289 47391 32028 1247 8514 -2672 -12428 -24355 -30557 -17209 -21622 -60922 -63026 -22841
7003b2841J2835J8322j1648j5104P685j4827k1351R084J6661J4031K4152N251
6991B2250k1151K817m595j1757J1300L3726r499l0621L6606L8589P669J3636j2218
6978G6752j9727l6336k6661K1852k9573l303l556k2635K7761K0015L7799J1577
6966E3965l3895Q744j1540R70N557O712k1024M808J9570P675j0053l3800j1283
6953a3594J8093M0860J5765K2201l650n8473n5964Q952M0924N513r507J0488J3908
6940C5516J7766K9443k7544m8278J919K1148j6138k6145k6020J5185L3139L5871
6928D5862L9799j2446l2834j5935j3445K5672J332k2964l1720j6149p212j9385
6916e9425q465P511K0533K8503K8195k4192j8355M3974K2219k782j9527M5281
$$ plain form
7003 -22841 -10006 8316 -3332 -18436 -10751 -25578 -46929 -37845 -21184 -7153 16999 22250
6991 22250 1099 3916 -679 -12436 -1136 32590 23091 -7530 29076 67665 75334 88970 76752
6978 76752 57025 20689 -5972 15880 -13693 -16996 -20552 -43187 -15426 4589 42388 53965
6966 53965 20070 28814 17274 18244 23801 30513 9489 14297 33867 41542 31489 -2311 -13594
6953 -13594 4499 45359 61124 83325 79675 21202 -34762 -25810 15114 20627 11120 21608 35516
6940 35516 53282 82725 55181 6903 8822 29970 13832 -12313 -38333 -23148 9991 45862
6928 45862 85661 73215 40381 24446 11001 36673 38005 15041 -16679 -32828 -40040 -59425
6916 -59425 -67890 -60379 -39846 -11343 16852 -7340 -25695 18279 40498 37716 18189 63470
6904F3470J2582l2373j0089j5702l9712M616K9085Q498p246n148L5779m061m4046
6891d347O407q44l745j6558l4542k463J4746M2231N978j1732K19p23r319K718
6877a1974J3843j5j2457j3331k5596J91M4379M6666q420j2575r060L0392J5205
6864E7248N573n289j7717m4485j4285K6002N8315p614J6185K1124J4956j7344
6852I2669k6000k976r817k2981M9619r899j0475l3910r548P984M154q117N009
6839B5712K2058p324k1116O099j1718j87q654M1830J4596l5681j1320q003J5736
6826B2028q932L057J7884J8314K8121r142j4798J3177r637k2990l3945j6048o244
6813a9155j3295J0264p685J2413r824M193L2704j3080K2844L2633J1088p171j6405
$$ plain form
6904 63470 76052 43679 33590 17888 -21824 -17208 11877 20375 13129 7981 43760 39699 -4347
6891 -4347 2060 1216 -2529 -19087 -53629 -56092 -41346 885 6863 -4869 -4650 -5373 -14692 -11974
6877 -11974 1869 1854 -10603 -23934 -49530 -49339 -4960 41706 33286 20711 11651 42043 57248
6864 57248 62821 57532 39815 -4670 -18955 7047 65362 57748 73933 95057 110013 92669
6852 92669 66669 63693 53876 30895 80514 70615 60140 26230 16682 24666 28820 20703 25712
6839 25712 47770 40446 19330 25429 13711 13524 4870 46700 61296 25615 14295 6292 22028
6826 22028 13096 16153 34037 52351 80472 71330 56532 69709 60072 37082 3137 -12911 -19155
6813 -19155 -32450 -22186 -29871 -17458 -27282 -23089 9615 -3465 19379 52012 63100 55929 39524
6800C9524j2268j2380J2064J9824k9817m2585J4000L3808J6812L770k6008k8341
6788a1597q347J5096K2790R902J5603q817l6940J2739n279M262J637M965j5134
6775H80K066q450j4271K1447M1803Q047j1929n533k5662k5874l730J604J6483
6762c119K6615Q224P254J5985n083j6520j2702j6920j1212J0465J2071l3702j3973
6749c2617j7148O515L1825J3823k245N921K7660O738Q820O016K1795k0262j9366
6736C7475j7812P745k371Q61j9634j0669M940J5000l4596k3030K1061J8024J1686
6723H680J1197p880r845K8045J1215n531l02k406J0379j0331K3732R554k1518
6710D4989K249K1435n914j2123j6297k7433L413j3440J7146Q049k4257k0669k374
$$ plain form
6800 39524 27256 14876 26940 46764 16947 -25638 -11638 22170 38982 42752 16744 -11597
6788 -11597 -19944 -4848 17942 27844 43447 34630 -2310 10429 5150 9412 11049 16014 880
6775 880 2946 -5504 -19775 1672 43475 51522 39593 34060 8398 -17476 -21206 -19602 -3119
6762 -3119 23496 31720 38974 54959 49876 33356 20654 3734 -7478 2987 15058 -18644 -32617
6749 -32617 -49765 -43250 -11425 2398 153 6074 33734 40472 49292 55308 77103 56841 37475
6736 37475 19663 27408 25037 25898 6264 -4405 535 15535 -19061 -42091 -21030 -3006 8680
6723 8680 19877 11997 2152 30197 41412 35881 35579 33173 43552 33221 56953 66507 44989
6710 44989 47238 68673 62759 50636 34339 6906 10319 -3121 14025 22074 -2183 -22852 -25226
6697b5226K4079J6864n533j1995J5229P141j6733Q515o700k002J5220J8174k20
6684C6813j4004o161J7923J4882K5047j6852J6699j6376k5799k8479P731p029
6672D395j7573j3687k7842J87J0107k0926P940L9238J255o528J5838M290p005
6659a0311m668M73J888J0548k2710k5118M119m955K2336K2172J9154j0090l4756
6646c1918j4690R134O651J4915O906J9649J3058j4901N879K6281O62m9232j7882
6633b5488K1037L5543j5856L323Q69k5970l1814K707L0152J6535J5476j3649J3536
6620B6401P851l3299M805k275j764R889k5296k2683j2909k673j3997K9559K5466
6607a0925J8099o709j8081k3738Q442J1097J6032M5256J4944k6697l0098l4524
$$ plain form
6697 -25226 -1147 15717 10184 -1811 13418 20559 3826 12341 5641 3639 18859 37033 36813
6684 36813 22809 16648 34571 49453 74500 57648 74347 57971 32172 3693 11424 4395
6672 4395 -13178 -26865 -54707 -54520 -44413 -65339 -57399 -18161 -16906 -23434 -7596 -3306 -10311
6659 -10311 -14979 -14506 -12618 -2070 -24780 -49898 -45779 -50734 -28398 -6226 12928 2838 -31918
6646 -31918 -46608 -37474 -30823 -15908 -9002 10647 23705 8804 14683 40964 41626 -7606 -25488
6633 -25488 -4451 31092 15236 18559 19428 -6542 -38356 -35649 -5497 11038 26514 12865 26401
6620 26401 34252 953 5758 3483 1719 11608 -13688 -36371 -49280 -51953 -65950 -36391 -10925
6607 -10925 7174 465 -17616 -41354 -32912 -21815 -5783 39473 54417 27720 -2378 -36902
6595c6902j3823K7273J8600K0950J6645j1620l8935P484k0859K3461J5343J1077
6583A8694L27M045m78j8336L1047k165l8096l6408J3643l354J3295J5029R889
6570G132N819O772k6576K4624l700j1862J4432j3539k0748P791j0946p625o453
6557c4879N408j6839J8829K0114P977J8153l1447k4436L6831J9762l4463o9n853
6544b0912L092L7115J6991P102k1200k7165N237J9654J8588m3486J2532R306p513
6531I341J9036j1529j0904l4334l0357l17J9654L3921L1859J5309j5994n855j2354
6518G476k80n866J0781p844J2507r863j5963k1240J2158n321j1408l411J3783
6505b4491J9203M8448J3271m8973p938j7532J689j7211J4651M1690j7928k3584
$$ plain form
6595 -36902 -50725 -23452 -4852 16098 32743 21123 -17812 -10328 -31187 -7726 7617 18694
6583 18694 19021 23066 22588 4252 35299 33134 -4962 -41370 -27727 -31081 -17786 -2757 7132
6570 7132 12951 19723 -6853 17771 14071 2209 16641 3102 -17646 -9855 -20801 -28426 -34879
6557 -34879 -29471 -46310 -27481 -7367 610 18763 -12684 -37120 -289 19473 -14990 -15059 -20912
6544 -20912 -17820 19295 36286 43388 22188 -4977 260 19914 38502 -4984 7548 16854 9341
6531 9341 28377 16848 5944 -28390 -58747 -59064 -39410 -5489 26370 41679 25685 19830 7476
6518 7476 7196 1330 12111 4267 16774 6911 -9052 -30292 -18134 -23455 -34863 -38274 -24491
6505 -24491 -5288 43160 56431 7458 -480 -18012 -16323 -33534 -18883 22807 4879 -18705
6493a8705m594J8403J3402k035M3m0862l922K1763K5058O127k308j1437q912J1943
6479C964J3605j9335n226k298J190j8117P138K3726K750K6526K9863K0453n144
6466G9095m1980q262j8839l816J6216J0976J0704m801L60L681n331R670j0221
6453C7452Q831M062p840l3172j7994k280o166M714K9795P400k958o886J3905M191
6439C3054j7307l3531J594q702Q798K4914M1652J6441k3872k5315j8694O207m393
6426H46l5533m0771k1542L443M6278L4361L0667K5128K0380p434J2959K2294j2279
6413G8797l1052o822j2719j3078l7761l700L0420k462j7479m475k0184j1102K5863
6400b5754K5309Q58J2009j9177l0302j88K1330K2802j9808k4811J1857L3851K5775
$$ plain form
6493 -18705 -23299 -4896 8506 6471 6514 -34348 -38270 -16507 8551 14678 12370 933 -7979 3964
6479 3964 17569 -1766 -6992 -9290 -8100 -26217 -19079 4647 7397 33923 63786 84239 79095
6466 79095 37115 28853 10014 6198 22414 33390 44094 39293 39653 43334 38003 47673 37452
6453 37452 46283 50345 42505 9333 -8661 -10941 -17107 -12393 17402 24802 21844 14958 28863 33054
6439 33054 15747 -17784 -16190 -24892 -16094 8820 50472 66913 43041 17726 -968 5239 846
6426 846 -34687 -75458 -97000 -93557 -47279 -12918 17749 42877 63257 55823 68782 91076 78797
6413 78797 47745 40923 28204 15126 -22635 -26335 4085 1623 -15856 -20331 -40515 -51617 -25754
6400 -25754 -445 413 12422 -6755 -37057 -37245 -15915 6887 -12921 -37732 -25875 7976 33751
6387C3751O665k9464l5348K52P003J296m461J1981j9352j1600J8809J2619q003
6374a5852O973J7114k6253L0917J1898N219j3552l371j176n86k5324J3815M961
6361D783P532J6492K2973j2956n9597j2687M1033J714M559P404j4771k0323K10
6348a3634L651J7066M324j2328k137j3947N228J4951K1630J9103k733k171m915
6335C4088j0394J161m435j1494j2072m005p053L132k5443O041L374j5730M66K2735
6321a9629K8197J948p553l0896r559P0854J8358Q534p985l4924j0191k1126J4577
6308F05K4633J4873n443m9279m1233J1381K0678p254k758R401J6535P298L734
6295C171J5973k3204n386j0098J1727O894q930m177k2960j1233j6714L348J5540
$$ plain form
6387 33751 40416 10952 -24396 -24144 -17141 -15845 -20306 -8325 -27677 -39277 -20468 -7849 -15852
6374 -15852 -8879 8235 -18018 12899 24797 30016 16464 13093 11917 11331 -13993 -178 4783
6361 4783 12315 28807 51780 38824 -20773 -33460 7573 9287 13846 21250 6479 -13844 -13634
6348 -13634 -9983 7083 11407 -921 -3058 -17005 -11777 3174 24804 43907 41174 39003 34088
6335 34088 23694 24855 20420 8926 -3146 -7151 -14204 -11072 -36515 -30474 -27100 -42830 -42364 -19629
6321 -19629 8568 10516 2963 -27933 -37492 33362 51720 60254 52269 17345 7154 -13972 605
6308 605 25238 40111 34668 -14611 -55844 -44463 -23785 -31039 -33797 -24396 -7861 -563 3171
6295 3171 19144 -4060 -9446 -19544 -7817 -923 -9853 -14030 -36990 -48223 -64937 -61589 -46049
6282d6049J3924J8657J9177M959k2142q965k8960L309K6086n679j667O7281L390
6269D3321j9581j7192j6469J2893J6723l2614j9542j269J4365k7442O534L810
6257c6463p473j6258K0148L756j4378P903l797j5566J0729J4315R114K297Q442
6244a7231L7233J3495l2006j0914O341k8373l330J2188R158J084N1n53J6548L913
6230G604O540j6105l5157m186l887m6999l587M2003M2147M48o60J2438m049l1655
6216c5105k1546P426K8983L7966J3533j9180j4919n185L2206J4188j3161m047
6204B1159m419j4681k3969J061J9230M489q206K387J7232J642p767L026l5647
6191b4463k893J2463J2445K1961j2078k903J0484J990L1243R218k3099k4777l0848
$$ plain form
6282 -46049 -32125 -13468 5709 10668 -11474 -20439 -49399 -46090 -20004 -25683 -27350 39931 43321
6269 43321 23740 6548 -9921 2972 19695 -12919 -32461 -33730 -19365 -46807 -40273 -36463
6257 -36463 -43936 -60194 -40046 -36290 -50668 -42765 -46562 -62128 -51399 -37084 -27970 -25673 -17231
6244 -17231 20002 33497 1491 -9423 -3082 -31455 -34785 -22597 -13439 -12355 -12304 -12857 3691 7604
6230 7604 14144 -1961 -37118 -41304 -45191 -92190 -95777 -53774 -11627 -11179 -11839 599 -3450 -35105
6216 -35105 -56651 -49225 -20242 17724 31257 12077 -2842 -8027 24179 38367 25206 21159
6204 21159 16740 2059 -21910 -20849 -1619 2870 -5336 -2949 14283 15925 8158 11184 -24463
6191 -24463 -27356 -14893 -2448 19513 7435 4532 15016 17006 48249 57467 34368 9591 -21257
6178b1257m554N982L7530L0940k6506j8999k735J0343K9671q725k1497P523N836
6165B3552l052m630k7534p666r369J4418j5829O692K7408K875L9266J790m1797
6152F124k976P194K0718j6041k5848k511K5086P326j3955l126j5043j6595R175
6139b0472j5874l923K9131L4294J606k6988j2369o774j6163J4011O946j8268j6331
6126e1174j4850k4592K3670K4799M057q122L4381L813p627J6875J2352j3405j5062
6113a4885J3003l381rK661O630j4029j7971K7227N7216j0610k1554m4032L928
6100a5806L0370j3147l31j3551N110m148p336L313J9835R439j0055Q046o418j4821
6086i500r014K0195P856n157j7442j6274K2424P600K6099J9899J4934K1861j8051
$$ plain form
6178 -21257 -25811 -19829 17701 48641 22135 3136 401 10744 40415 31690 10193 17716 23552
6165 23552 20500 15870 -11664 -19330 -28699 -14281 -30110 -23418 3990 6865 46131 47921 6124
6152 6124 3148 10342 31060 15019 -10829 -13340 11746 19072 5117 1991 -13052 -29647 -20472
6139 -20472 -36346 -40269 -11138 23156 24762 -2226 -14595 -21369 -37532 -23521 -16575 -34843 -51174
6126 -51174 -66024 -90616 -66946 -42147 -38090 -46212 -11831 -8018 -15645 1230 13582 177 -14885
6113 -14885 -1882 -5263 -5272 -2611 4019 -10010 -27981 -754 56462 45852 24298 -19734 -15806
6100 -15806 14564 1417 1086 -12465 -7355 -11503 -18839 -15526 4309 13748 3693 11739 5321 -9500
6086 -9500 -18514 1681 9537 4380 -13062 -29336 -6912 688 26787 46686 61620 83481 65430
6073F5430j3343p969l4451k6377o845R452R41J4664O47M559M128J1235J960o964
6059A7067l055P618k3037o856K3683o105j1431J0436J0610p818j336l739l924
6046B113p462j3030K305J5409j8613J9293M2147R104r79j5067j1555j5817k7194
6033a9346k6880P13L6580K0724n52j775R860j8500K701m4673J3884n028j777J0488
6019b3581j285L7355K1684j6872j563Q69J6975o256j9090L294l766j9568J8262
6006F458K0079r106J3081Q862m7668j7090j3065K0163J2226m0461R638K6220L7077
5993B6414L3358j4423k9657j1605p580j6494r733L938K8805o499N231k0561J3169
5980e637k273K2261L7673j9562l0204k0562J6261L0661j6941R13K7277R630N627
$$ plain form
6073 65430 52087 44118 9667 -16710 -23555 -14103 -13162 1502 2149 6708 10836 22071 24031 17067
6059 17067 14012 21630 -1407 -8263 15420 9315 -2116 8320 18930 11112 9776 6037 2113
6046 2113 -5349 -18379 -16074 -665 -19278 15 42162 51266 50287 35220 23665 7848 -19346
6033 -19346 -46226 -45513 -8933 11791 11239 9464 19324 824 3525 -41148 -27264 -32292 -34069 -23581
6019 -23581 -24866 12489 34173 17301 15738 16607 33582 27326 8236 11530 7764 -11804 6458
6006 6458 26537 17431 30512 39374 -8294 -25384 -38449 -18286 -6060 -46521 -36883 -10663 26414
5993 26414 59772 45349 15692 4087 -3493 -19987 -29720 -25782 3023 -3476 1755 -18806 -5637
5980 -5637 -7910 14351 52024 32462 2258 -18304 -2043 28618 11677 12590 39867 49497 55124
5967E5124j7259j2461M853L1299l3654l5186K3087P828k8063m3089M733K0048
5955b2740M2052L2724l4736l8386j2917k0338P522K0029K1610J3882k4608j5796
5943c1702K830K7747L413l7161M127M0024J1025k3575P628N409K1424q105K872
5930B5956m267l4892p60k383J555J9940k6819j5047J4467n546j7095j3770Q307
5917e0354L9393L630j4061K679M7203K1885j1405M264j5457k1675J1514N252j9513
5904C355j6259R654K8008k4893k3280k689k9320P714R173p846L057k5105m238
5891g2669L0877j510J281K2269L423j1171J0094K0129k1977M708K7705K2416m741
5878C0834k4172l1021l099P922m177P884J3371j528J2570O04J6899k2495j2489
$$ plain form
5967 55124 37865 25404 30257 61556 27902 -7284 15803 23631 -4432 -47521 -42788 -22740
5955 -22740 19312 52036 17300 -21086 -34003 -54341 -46819 -26790 -5180 8702 -15906 -31702
5943 -31702 -28872 -1125 2288 -34873 -30746 9278 20303 -3272 4356 9765 31189 23084 25956
5930 25956 21689 -13203 -13963 -16346 -14791 5149 -21670 -36717 -22250 -27796 -44891 -58661 -50354
5917 -50354 -10961 -7331 -21392 -18713 28490 50375 38970 43234 27777 6102 17616 22868 3355
5904 3355 -12904 -3250 24758 -135 -23415 -26104 -55424 -47710 -38537 -46383 -43326 -68431 -72669
5891 -72669 -41792 -43302 -42021 -19752 -16329 -27500 -17406 2723 -19254 -14546 13159 35575 30834
5878 30834 6662 -24359 -27458 -19536 -23713 -15829 -2458 -3986 8584 9188 26087 3592 -8897
5865h897k527j4654K1020J1349j2191O387K4353k0752k7831j7857o860j4796O489
5852e6767k476K6920R296P576j920K529M503k6115j8482J1346r251O906K0339
5839b5596R333r157J2664R289l063p524J1897J8537K2612j9086K737J3869J2014
5826D8526j1092K082j6947j351J0862r472q135k7673j4995J975N7755K4788o644
5813D9679k5773m442J7687K5410j77j2079k4930q474J0293J9570J89l2175p175
5800G603m050l6118j6221L438p74k6994j3564K2990M9901J0026k2080J3685J6947
5787D789j862P452k0534m951K3991K1212K0773k1789m685K0809M148m6075j5601
5774a2323K6060l4904m7623j707N3047J0344j8420j9423J9528K8183N97j9618
$$ plain form
5865 -8897 -11424 -26078 -5058 6291 -5900 487 24840 4088 -23743 -41600 -48460 -63256 -56767
5852 -56767 -59243 -32323 -23027 -15451 -17371 -14842 -10339 -36454 -54936 -43590 -52841 -45935 -25596
5839 -25596 -16263 -25420 -12756 -3467 -6530 -14054 -2157 16380 38992 19906 22643 36512 48526
5826 48526 37434 39516 22569 21218 32080 22608 14473 -13200 -28195 -26220 31535 56323 49679
5813 49679 23906 19464 37151 62561 62384 50305 25375 16901 27194 46764 46953 14778 7603
5800 7603 3553 -32565 -48786 -45348 -46122 -73116 -86680 -63690 -13789 -3763 -25843 -12158 4789
5787 4789 2927 10379 -10155 -15106 8885 30097 50870 29081 24396 45205 49353 3278 -12323
5774 -12323 13737 -21167 -68790 -70497 -17450 -7106 -25526 -44949 -25421 2762 3359 -16259
5762a6259l0903r925K6791k145j1913K0089J2775R56j0425J658k2942K1983J7566
5749b694j1373m563J6140j1083K1230K3531j7558p884Q704J8293k7078j2430L0746
5736B3981M7090R749k7524k6834Q819J3842k3737k0567K8432n91Q84q388j2514
5723A2642k3487J6440j5296k6346R4N733j2550J7482K435M196K9432O068n283
5710A1560r721j2002p472p828M028J1239K1754R992O481N29o89J7704L507l4314
5696A4768j9621k6251j6520K2632M4579J7702j5761k6744p377O999J7996J9181
5684C1583J454l1470J750J1175r177m4224L877J8367j3874j5756M209K2866l541
5671b2761q598K4955K2819k765j4191J3384k8223l2715m61K2684K9665j9472k3936
$$ plain form
5762 -16259 -47162 -57087 -30296 -32441 -44354 -24265 -11490 -10534 -20959 -19301 -42243 -20260 -2694
5749 -2694 -14067 -18630 -2490 -13573 7657 31188 13630 5746 14450 32743 5665 -6765 23981
5736 23981 71071 80820 53296 26462 35281 49123 25386 4819 33251 32660 33544 25156 12642
5723 12642 -10845 5595 -9701 -36047 -35953 -30220 -42770 -25288 -22853 -18657 10775 16843 11560
5710 11560 1839 -10163 -17635 -25463 -21435 -10196 11558 21550 28031 28560 27871 45575 49082 14768
5696 14768 -4853 -31104 -47624 -24992 19587 37289 21528 -5216 -12593 -5594 12402 31583
5684 31583 33037 1567 3317 14492 5315 -38909 -35032 -16665 -30539 -46295 -42086 -19220 -22761
5671 -22761 -31359 -6404 16415 13650 -541 12843 -15380 -48095 -48556 -25872 3793 -15679 -39615
5658c9615J3302P540j3635J8335K7213k818l5142k3629J5309K3545M055j4634
5646b0174l3424j5485j709J0238O432J0799j7363m1715R561Q1940L8128k8446
5634a218l1614o513l795J2721L737J3011M909L983O387k5011K917J7056Q770l5032
5620b9692l6762j6363J825j2299j8325L2356M4194K3373K2470l978j9888j604
5608a4693R100j1760J1675L393J0894l047J8153k9940k2772L340n207R375k2810
5595d4299J6144K761M485O2762L3277k3528l2496j7557J1979K5530k704l4207
5583B147j8710J2476k102J92L5358L1643n44j2406k5377n2013n738K5005K8239
5570A8170j6107k8246Q836N606m197r636M4130J9030j1965K62Q887k7573K818
$$ plain form
5658 -39615 -26313 -18773 -32408 -14073 13140 10322 -24820 -48449 -33140 -9595 -5540 -20174
5646 -20174 -53598 -69083 -70792 -60554 -54122 -43323 -60686 -102401 -92840 -10900 27228 -1218
5634 -1218 -32832 -39345 -43140 -30419 -26682 -13671 -8762 -4779 1608 -23403 -20486 -3430 5340 -29692
5620 -29692 -66454 -82817 -80992 -93291 -111616 -79260 -35066 -11693 10777 6799 -13089 -14693
5608 -14693 -5593 -17353 -5678 -2285 8609 5562 23715 -6225 -28997 -25657 -30864 -21489 -44299
5595 -44299 -28155 -25394 -20909 41853 75130 51602 19106 1549 13528 39058 36354 2147
5583 2147 -16563 -4087 -6189 -5997 29361 61004 60460 48054 22677 -29336 -35074 -10069 18170
5570 18170 2063 -26183 -17347 -11741 -15938 -25574 18556 37586 25621 25883 34770 7197 10015
5557A0015j8433k1659J1956K423k9650J8864L7210J3899k1714J0243J3920p056
5545B0018J7214J0077k796J5670j7319j4710k5446j2925L0517j1891j1502j4357
5533a7450q63J271J5354J7653L437N2n035K7560P73r148J1427j4863j3072l44
5519A6752J2169O016k1287j6669k7848P648L5001J8410J5310K805j9627k1954
5507F726j5791l254J3794M7644L372k0071J7165q492P979m7292o059m950k8030
5494c7259R223p825M2616m3164m0500K9729J3110J3721L2101J2759j5190R691
5482A9012L871J0374j5017k8532k5080L490J1692J9812j5818l6612j2601R988
5470e5421J1082K5440J4503k0540J381l7q005M6313J9494m2570l0938l560o359
$$ plain form
5557 10015 -8418 -30077 -18121 -15698 -45348 -26484 10726 24625 2911 13154 27074 20018
5545 20018 37232 47309 44513 60183 42864 28154 2708 -10217 20300 8409 -3093 -17450
5533 -17450 -18313 -17042 -1688 15965 19402 19454 14419 41979 42752 33604 45031 30168 17096 16752
5519 16752 28921 34937 13650 -3019 -30867 -23219 11782 30192 45502 48307 28680 6726
5507 6726 -9065 -12319 1475 49119 52491 32420 49585 41093 49072 1780 -4279 -9229 -37259
5494 -37259 -28036 -35861 6755 -36409 -76909 -47180 -34070 -20349 11752 24511 9321 19012
5482 19012 22883 33257 18240 -10292 -35372 -31882 -20190 -378 -16196 -52808 -65409 -55421
5470 -55421 -44339 -18899 -4396 -24936 -23555 -23592 -31597 14716 34210 -8360 -39298 -42858 -49217
5457d9217J8344R428M671L0420J5141l9241l0870j2469P627K596K4804J4830K2567
5444A8631K1928J9004l0501k5886k638n295J3830J6178j6936J466k5204K7847
5432A2424N347l9587k504P571P71J493k108k5194o944L9549M2822k3277n6469
5419d6106l0345J5318J5210J6687J1478L692J0043R367k2692o263K0429r795m8825
5406f1802p786k1029K3263K7972J4309q555Q482P866J6026J1372J4658P164J7234
5393D9174k2956P673R25l140k021J3937j8923m4473j3972J1712J9301K1739l4278
5380a5302R674j672j3738j0122m289l99K3686J0668k523M10j9911J8272P485m3515
5366d1276L448O060K9795M866Q512J2648j1285N790J7942k164N706m076K2780
$$ plain form
5457 -49217 -30873 -21445 -16774 13646 28787 -10454 -41324 -53793 -46166 -43570 -18766 -3936 18631
5444 18631 40559 59563 29062 3176 538 -4757 9073 25251 8315 9781 -15423 12424
5432 12424 17771 -21816 -24320 -16749 -15978 -14485 -16593 -41787 -48731 -9182 33640 10363 -46106
5419 -46106 -76451 -61133 -45923 -29236 -17758 -14066 -4023 5344 -17348 -23611 -3182 -12977 -61802
5406 -61802 -69588 -90617 -67354 -39382 -25073 -33628 -25146 -17280 -1254 10118 24776 31940 49174
5393 49174 26218 33891 34816 31676 29655 43592 24669 -19804 -33776 -22064 -2763 18976 -15302
5380 -15302 -5628 -7300 -21038 -31160 -35449 -35848 -12162 -1494 -4017 -3607 -23518 -5246 2239 -41276
5366 -41276 -37828 -31768 -1973 2893 11405 24053 12768 18558 36500 34336 40042 35966 58746
5353E8746j9813m1424k215j388j0496k8249k6117J2935P084N923l744K2809o57
5340b6606K0882L2272K3923j4713k7469j5366j4827j0230K9525L4462M539k2190
5328A4202l0222l1444k7262J6203K9904K3632P972r463J2127L9371K628n3023
5316e375J2355R858M649J0446Q951p925j5222j1688j9416j4438J05J3063K2433
5303G796p940j7595J7070k5231J1640M797j1125L268K2277j8451L919R533k135
5290b177M224l29Q795j5388n558j7402N720P392q0K0521j4649m794j0413J1133
5276a3005j9017J3612L5500j0814q636j1148l764m456j0612k133p545J2129K1361
5263h528M7907K883k2815j9336j3985J2485L471j4718j1081K1647K8673np607
$$ plain form
5353 58746 38933 -2491 -4706 -6094 -16590 -44839 -70956 -58021 -50937 -45014 -48758 -25949 -26606
5340 -26606 -5724 26548 50471 35758 8289 -7077 -21904 -32134 -2609 31853 36392 14202
5328 14202 -16020 -47464 -74726 -58523 -28619 -4987 2985 -6478 5649 45020 47648 -5375
5316 -5375 6980 16838 21487 31933 40884 32959 17737 6049 -13367 -27805 -27700 -14637 7796
5303 7796 -144 -17739 -669 -25900 -14260 -9463 -20588 -17320 4957 -13494 -9575 -42 -2177
5290 -2177 2047 1718 10513 -4875 -10433 -27835 -22115 -14723 -14803 5718 -8931 -13725 -24138 -13005
5276 -13005 -32022 -18410 17090 6276 -2360 -13508 -17272 -21728 -32340 -34473 -42018 -29889 -8528
5263 -8528 39379 42262 19447 111 -13874 -1389 2082 -12636 -23717 -2070 26603 26598 18991
5250A8991j0361J450J0324L1851K57j7872k2894k9007l1842k4275K6834L3387
5238a3157j6904j6094R237R984K9988O982J1309M606r335k6489j762L778J0433
5225B576L5332q311k0326l7243J049J2056J0352P411J3661K1532o627j7371j1443
5212B648l272j1258k9423r809K1745K6474N028o513O974O686J9250K0326l7184
5199A1672m5954k880K4331M2385L0852m1179M949J3164l3512l4076J7220j0346
5187b3374j3796p84J5627o205J0624j9187j9586Q690J359R186K1090R833k776
5174i299m498J1302j4911k7869o913k4068K32J9060j5451p21K4927L8799j854
5161a1264j1418N9769J771j037k5295j153J2964J508L594j1787k7678p54K2559
$$ plain form
5250 18991 8630 10080 20404 52255 52512 34640 11746 -17261 -49103 -73378 -46544 -13157
5238 -13157 -30061 -46155 -36918 -26934 3054 10036 21345 25951 16616 -9873 -11635 -7857 2576
5225 2576 37908 29597 9271 -27972 -26923 -14867 -4515 2896 16557 38089 31462 14091 2648
5212 2648 -624 -11882 -41305 -51114 -29369 -2895 2133 -4380 2594 9280 28530 48856 11672
5199 11672 -34282 -37162 -12831 29554 60406 19227 24176 37340 3828 -30248 -13028 -23374
5187 -23374 -37170 -37954 -22327 -28532 -17908 -37095 -56681 -47991 -46632 -37446 -16356 -6523 -9299
5174 -9299 -13797 -2495 -17406 -45275 -52188 -76256 -76024 -56964 -72415 -73136 -48209 -9410 -11264
5161 -11264 -22682 37087 38858 37821 12526 11373 24337 25845 29439 17652 -10026 -10780 11779
5148A1779K1862p368k7472p847N5818q963l6584L4022J4631k9905o305o744P091
5135A4015j9007j4045J752l614K3617M747q070j0317Q080J9280j1409l3918K6276
5122b613J6511k2946J89L3376J038k8051k5988L02k1595r42Q222O565k48l9485
5108g5665l3785N2081L3169J74J3134J3288R611j072P889J1987J9566P447j2691
5095D5133J433K6960j6938l7022k1229l701l029o177Q664J5950O863j486k510
5082A2911K3889j1888J0113p817J9824k11j958j2700j8037M118N800j7471K468
5069I041j0538j2976k401j5431q526r72k485L4307J2868j6353J9300K8067l6118
5056b217j0724J97j374K1055k0444L5434K8888M56l0919j9272m825J1119K8843
$$ plain form
5148 11779 33641 26273 -1199 -9046 46772 37809 1225 35247 49878 19973 13668 6924 14015
5135 14015 -4992 -19037 -17285 -20899 2718 7465 -605 -10922 -2842 16438 5029 -28889 -2613
5122 -2613 13898 -9048 -8859 24517 25555 -2496 -28484 -28182 -49777 -50719 -42497 -35932 -36180 -75665
5108 -75665 -109450 -57369 -24200 -24026 -10892 2396 12007 10935 18824 30811 50377 57824 45133
5095 45133 46566 73526 56588 19566 -1663 -5364 -8393 -14570 -5906 10044 16907 15421 12911
5082 12911 36800 24912 35025 27208 47032 46821 44863 32163 14126 18244 24044 6573 9041
5069 9041 -1497 -14473 -16874 -32305 -40831 -41803 -44288 -9981 2887 -13466 5834 33901 -2217
5056 -2217 -12941 -12744 -14118 6937 -13507 21927 50815 51271 20352 1080 -3745 7374 36217
5043C6217m910k8254j8642L439K9067j2568l2709l8206K129L5601J7388M837j8877
5030b5488j3320J4415L4336O504j1391l5007o115K0300o006q996L4851K96q869
5017d490j1252r201l805o611J8336K4039j7587O622j1195n000q014J0071l889
5004b1976k1203j6480j0397J7963J33R135L0021J2077J0918P123j7974J3558k7249
4991a4351N810L5646j9374l0305J0717k351J107K4618j2552l1927j1941n8902
4979a03805o131K7786L3512Q889K6569J6615J4143J472m6781j890J9634J4680
4967D693O953j1715K323p875m353j0252N143J6196m878k673p921L595K071K5970
4953A7277J0880j6737r416K4308p185j2057Q965k4845K127L3890p850j2192j577
$$ plain form
5043 36217 31307 3053 -15589 -12150 16917 4349 -28360 -66566 -64437 -28836 -11448 -6611 -25488
5030 -25488 -38808 -24393 9943 16447 5056 -29951 -36066 -15766 -21772 -30768 4083 4379 -4490
5017 -4490 -15742 -24943 -28748 -35359 -17023 7016 -10571 -3949 -15144 -20144 -28158 -18087 -21976
5004 -21976 -43179 -59659 -70056 -52093 -51960 -42825 -12804 -727 10191 17314 -660 12898 -14351
4991 -14351 -8541 27105 7731 -22574 -11857 -14208 -13101 11517 -1035 -32962 -44903 -103805
4979 -103805 -109936 -82150 -48638 -39749 -13180 3435 17578 19050 -27731 -29621 -9987 4693
4967 4693 11646 -69 2254 -5621 -9974 -20226 -15083 1113 -3765 -6438 -14359 -10764 -8693 17277
4953 17277 28157 11420 2004 26312 19127 7070 16035 -8810 -6683 27207 19357 7165 5588
4940E588j2222K2099m76p636J402k5557l9669L819K2132l19j0709j58K5192o036
4926b2550n567k273P538K8712j7207m8707J2441L3534M7340n413R701k859n901
4913B8789j7297r30k0059K265L4790J1476j0088j1157L7485p843j9444j5273Q335
4900B1049J5056k0821L047J7150k6493j4279J3191n428j6016q850k703L1069K1528
4887B7500L11j1328j7032O200K4163k6389j6574J639Q581K7693L8460j1476m4273
4874G475k3320j4741m1j4262l611j0744K8887K9685N013l294j9119j9258J8257
4861a9073k701m100r159J4817j9576k2615k896L2613M0265K5992o436k2216P130
4848A2045J9656k0305k7751j0248N183n174j6863J4004O315M670J7235J1438R023
$$ plain form
4940 5588 -6634 15465 14989 7353 8755 -16802 -56471 -52652 -30520 -30839 -41548 -41706 -16514 -22550
4926 -22550 -28117 -30390 -22852 5860 -11347 -60054 -47613 -14079 33261 27848 37549 34690 28789
4913 28789 11492 10562 -9497 -7232 27558 39034 28946 17789 55274 47431 27987 12714 21049
4900 21049 36105 15284 18331 35481 8988 -5291 7900 2472 -13544 -22394 -25097 5972 27500
4887 27500 27811 16483 -549 5651 29814 3425 -13149 -11510 -2929 24764 63224 51748 7475
4874 7475 -15845 -30586 -30627 -44889 -48500 -59244 -30357 -672 4341 1047 -18072 -37330 -19073
4861 -19073 -21774 -25874 -35033 -20216 -39792 -62407 -65303 -32690 7575 33567 27131 4915 12045
4848 12045 31701 11396 -16355 -26603 -21420 -26594 -43457 -29453 -23138 -18468 -1233 10205 19228
4835A9228J1687m0427l3028p665l855J9776R768K6260O76j3923K690o893j2660
4822b8366m653j3199l523J7774K4122m86n1272m033K5185J2677M158l5547n7672
4809a14835O088L7546K4860K2678k281J2696O632k2976J4528L5742K5307J4147
4797F0132K259j0422k691J934j6422l9959l1730j7585k264M3018P551j2514L591
4784a5102n6008j9652P052J9483J6854M1392J287k2606j1849Q066K3594R503j838
4771A76R110k0603o534l288J2095O30k6916K6781L5222j5689j8423L3828L087
4758B9476P899K70K557k0849m4831P455q182m573N6364L2921j4899k3758j1866
4745G984j3460j1810L6999J6291n0282j5087j2237k3771J3821K4444J7465j9802
$$ plain form
4835 19228 30915 -9512 -42540 -50205 -54060 -34284 -24516 1744 2420 -11503 -8813 -15706 -28366
4822 -28366 -33019 -46218 -49741 -31967 -7845 -8331 -59603 -63636 -38451 -25774 -21616 -57163 -114835
4809 -114835 -108747 -71201 -46341 -23663 -25944 -13248 -6616 -29592 -15064 20678 45985 60132
4797 60132 62391 51969 49278 51212 34790 -5169 -36899 -54484 -56748 -13730 -6179 -18693 -15102
4784 -15102 -71110 -90762 -83710 -64227 -47373 -5981 -4694 -27300 -39149 -31083 -7489 2014 176
4771 176 9286 -11317 -17851 -21139 -9044 -8414 -35330 -8549 26673 10984 -7439 26389 29476
4758 29476 37375 37645 40202 19353 -25478 -18023 -26205 -30778 25586 58507 43608 19850 7984
4745 7984 -5476 -17286 19713 36004 -14278 -29365 -41602 -65373 -51552 -27108 -9643 -29445
4733b9445m9428P544L1479N357j0841k0526J7143J686j4720K5065N498J5558J1124
4720d506K9910J0691k8548j8900k6070K2866R872k4013K0652L6164o837j8107
4708C174J7786J0804Q186j5617J920k801k1095l2828k3516P554K2881J7539L760
4695b253o711J6723J2909K1696q404k1807k0928J0938n764n459J4591j1607R63
4682e113J9958R158m440p710n508k2418J447K5430J3211J6363l0101K385R834
4669B2496k5498j3839j4567J8117J1813n707J8791J3034k932n9673K6151J84k1610
4656c3240l011l584K2314K9262l2882l1665J7292R019r388J5012n256J0939m694
4643a9882n602K7723J9848k1067j2487k609p7J3261Q048p005n815q436l726Q643
$$ plain form
4733 -29445 -78873 -71329 -39850 -34493 -45334 -65860 -48717 -47031 -61751 -36686 -31188 -15630 -4506
4720 -4506 25404 36095 7547 -11353 -37423 -14557 -4685 -28698 -8046 28118 21281 3174
4708 3174 20960 31764 39950 24333 26253 23452 2357 -30471 -53987 -46433 -23552 -6013 -2253
4695 -2253 -8964 7759 20668 42364 33960 12153 -8775 2163 -3601 -9060 5531 -6076 -5113
4682 -5113 14845 24003 19563 11853 6345 -16073 -14626 10804 24015 40378 10277 12662 22496
4669 22496 -3002 -16841 -31408 -13291 -1478 -7185 11606 24640 21708 -37965 -11814 -11630 -33240
4656 -33240 -36251 -39835 -17521 11741 -21141 -52806 -35514 -26495 -35883 -20871 -26127 -15188 -19882
4643 -19882 -25484 2239 22087 1020 -11467 -14076 -14153 -892 7156 151 -5664 -14100 -17826 -9183
4629i183j2539j0623J2309j482K3491k411q587J3615L8062r348m5112k9541J8310
4616b3039q432M140K197p723K9253m7426j1533K5407K0897R093J060N900l9125
4603c9331n623J8185J9420l79n466R676N683k3557j5905O020J3645j8026k7911
4590f3569M8523O858P271J2365J58q396k7054p494L355j7675J4979L5425M0965
4577D5711K2640j0374k1879O469l8045k1383M382J4011j6479n32j7456j2801L2896
4564a2840J3318J3099r240j5090K3740P680J0484j7066K792k53O464k4994k3915
4551b5821R00K2673k1868l794K6128K9923J2931Q031k2401r151n2185J1114K4885
4538A365m152J9312k7863n9542P209P3240L1846r849l8066k0294K9910K8437l2816
$$ plain form
4629 -9183 -21722 -32345 -20036 -21518 1973 -438 -9025 4590 42652 33304 -11808 -41349 -23039
4616 -23039 -31471 -27331 -25134 -32857 -3604 -51030 -62563 -37156 -16259 -7166 -6106 -206 -39331
4603 -39331 -44954 -26769 -7349 -7728 -13194 -3518 2165 -21392 -37297 -31277 -17632 -35658 -63569
4590 -63569 -15046 -8188 -917 11448 11606 3210 -23844 -31338 -27983 -45658 -30679 4746 45711
4577 45711 68351 57977 36098 42567 4522 -16861 -12479 1532 -14947 -15479 -32935 -45736 -12840
4564 -12840 478 13577 4337 -10753 12987 20667 31151 14085 16877 16624 23088 -1906 -25821
4551 -25821 -24921 -2248 -24116 -27910 -1782 28141 41072 49103 26702 17551 -34634 -23520 1365
4538 1365 -2787 16525 -11338 -70880 -63671 9569 41415 31566 -6500 -26794 3116 31553 -1263
4525a263k5786j0121N603Q134J1399P02R189k3400l6292K9166L2443q975N200
4512d001J5193j0845O226o607j536N557j3182j7857j3531j9522J8553J6303J8965
4499f284m809m288j3836n727j639J0121K5723K0118R663m341k1899k502J9437
4486A9737k020k7133j4710P269Q31j2667J0710K5692J9108k3240l2865J2691J8582
4473A985o443j6538j9154k4205M597m33J6381J2564L0859J7622j7376l2212n897
4460c8250M5518J7401j8726j3507l1891n296L5478P390j3214j8091J9417m869
4448a8640r031l7946l016J6503M0543L4383j3365J3626k0303J4965M075k1410
4436C84J5340j2507J5075K822j4177j2996K786K4067P902K3851J2555k5586j1878
$$ plain form
4525 -1263 -27049 -37170 -31567 -23433 -12034 -11332 -2143 -25543 -61835 -32669 -226 -9201 -4001
4512 -4001 11192 347 6573 -34 -1570 3987 -9195 -27052 -40583 -60105 -41552 -25249 -6284
4499 -6284 -11093 -15381 -29217 -34944 -36583 -26462 -739 19379 29042 24701 2802 300 19737
4486 19737 17717 -9416 -24126 -16857 -16026 -28693 -17983 7709 26817 3577 -29288 -16597 1985
4473 1985 -4458 -20996 -40150 -64355 -59758 -60191 -43810 -31246 -387 17235 -141 -32353 -38250
4460 -38250 7268 24669 5943 -7564 -39455 -44751 -9273 -1883 -15097 -33188 -13771 -18640
4448 -18640 -27671 -65617 -68633 -52130 -11587 22796 9431 23057 2754 17719 21794 384
4436 384 15724 3217 18292 21114 6937 -6059 -3273 20794 28696 52547 65102 39516 27638
4423B7638o88k8394k9188J3416o440L2944J8942m375J3871l8956j8996m3n980
4410b6249J2151M1071N201j7691j9110K3494R734m25J8407r426n762j3106j3330
4397D959j9556o093J6210J8042L077j0041j1798k5500k4104K295J9448J7726j9102
4384c4437j8386O331K4561L1349o346p698j2253k5691R197M4051j9434m8864O060
4371e1560N4159J0715l6198L030k7603k925L416J2964J3583L2352K1459K739k2977
4358A3154k4126j5440J9715j3715j5999J763M3951j1620j8036P577k888j9951
4346c5615J585j119K8118R177J0729j8956L690K5271P701k4405r777K9076L246
4333B8721j9272m4672J5267M0031P283j484N694M807J1155m016j0291l1393k4474
$$ plain form
4423 27638 26950 -1444 -30632 -17216 -23656 9288 28230 23855 37726 -1230 -20226 -20269 -26249
4410 -26249 -14098 26973 32174 14483 -4627 18867 28601 28176 46583 37157 31395 18289 4959
4397 4959 -14597 -20690 -4480 13562 16639 6598 -5200 -30700 -54804 -52509 -33061 -15335 -34437
4384 -34437 -52823 -46492 -21931 9418 3072 -4626 -16879 -42570 -33373 10678 -8756 -57620 -51560
4371 -51560 2599 13314 -22884 -19854 -47457 -50382 -46966 -34002 -20419 11933 33392 36131 13154
4358 13154 -10972 -26412 -6697 -20412 -36411 -34648 9303 -2317 -20353 -12776 -15664 -35615
4346 -35615 -34030 -35149 -7031 2146 12875 -6081 -2391 22880 30581 6176 -3601 25475 28721
4333 28721 9449 -35223 -19956 20075 27358 25874 31568 36375 47530 43514 33223 1830 -22644
4320b2644j0987Q870K6817K0856J4719k7919k127J3698N753k1237j0150M678M882
4307E209O532k3371L1298j2902k7580j3563L7416Q387j0879n539k5343m15q041
4294c8791j2948J6755L9532O762J3530r643j6550j1120k4860K1732J5742J2055
4282A2196O075k0617J0886j0868k866q82N639L3153j8358n3952l1353Q263O770
$$ plain form
4320 -22644 -33631 -24761 2056 22912 37631 9712 7585 21283 27036 5799 -4351 327 5209
4307 5209 11741 -11630 19668 6766 -20814 -34377 3039 11426 547 -4992 -30335 -30750 -38791
4294 -38791 -51739 -34984 4548 11310 24840 15197 -1353 -12473 -37333 -15601 141 12196
4282 12196 18271 -2346 8540 -2328 -5194 -6076 -437 32716 14358 -39594 -70947 -62684 -55914
$$ [...]
##END NTUPLES=NMR SPECTRUM
##END=
