##TITLE=Analysis number 317508
Compound Code cc 47414
Book Reference 382/176
Project Code qc-cat
Chemist Name simons
##JCAMPDX= 6.0         $$ Bruker NMR JCAMP-DX V2.0
##DATA TYPE= NMR SPECTRUM
##DATA CLASS= NTUPLES
##ORIGIN= Bruker BioSpin GmbH
##OWNER= nmr
$$ XWIN-NMR		Version 3.5
$$ Wed Feb 22 10:47:09 2006 GMT Standard Time (UT+0h)  MAYBRIDGE\nmr@NMR_250MHZ
##.OBSERVE FREQUENCY= 250.131544655141
##.OBSERVE NUCLEUS= ^1H
##.ACQUISITION MODE= SIMULTANEOUS (DQD)
##.ACQUISITION SCHEME= undefined
##.AVERAGES= 16
##.DIGITISER RES= 18
##SPECTROMETER/DATA SYSTEM= dpx250
##.PULSE SEQUENCE= zg30
##.SOLVENT NAME= CDCl3
##.SHIFT REFERENCE= (INTERNAL, CDCl3, 0, 16.522)
##AUDIT TRAIL= $$ (NUMBER, WHEN, WHO, WHERE, WHAT)
$$ ##TITLE= Audit trail, XWIN-NMR		Version 3.5
$$ ##JCAMPDX= 5.01
$$ ##ORIGIN= Bruker BioSpin GmbH
$$ ##OWNER= nmr
$$ C:\u/data/dgb/nmr/ADRS/16620/pdata/1/auditp.txt
$$ ##AUDIT TRAIL=  $$ (NUMBER, WHEN, WHO, WHERE, WHAT)
(   1,<2006-02-22 10:46:15.70 +000>,<MAYBRIDGE\nmr>,<NMR_250MHZ>,
      <created by zg, POWCHK disabled, PULCHK disabled
       configuration hash MD5:
       84 BC 41 DB A1 6E 1D 46 DA 25 12 A5 C1 ED C5 3A
       data hash MD5: 64K
       60 9D DB 70 1F CE CE 6B B6 4C 73 D4 A5 55 C7 EC>)
(   2,<2006-02-22 10:46:43.93 +000>,<MAYBRIDGE\nmr>,<NMR_250MHZ>,
      <Start of raw data processing
       ef LB = 0.3 FT_mod = 6 PKNL = 1 SI = 32K 
       data hash MD5: 32K
       EC E0 70 E0 EF CD 08 E8 F6 02 68 ED 3D A8 4E 35>)
(   3,<2006-02-22 10:46:47.46 +000>,<MAYBRIDGE\nmr>,<NMR_250MHZ>,
      <apk 
       data hash MD5: 32K
       A9 AA 7B 62 96 17 D1 0C A8 FB FF C0 0C 3B D8 50>)
(   4,<2006-02-22 10:46:48.48 +000>,<MAYBRIDGE\nmr>,<NMR_250MHZ>,
      <abs ABSG = 5 
       data hash MD5: 32K
       20 F7 08 99 8E F0 26 AE 32 E1 B2 F2 F5 1E 0F 02>)
$$ ##END=
$$ 
$$ hash MD5
$$ D8 28 8A CA 30 1A FC A0 8B 52 AE FE DB 53 95 5D
##$RELAX= 
##$RELAX= 
##$RELAX= 
##$RELAX= 
##$RELAX= 
##$RELAX= 
##$RELAX= 
$$ Bruker specific parameters
$$ --------------------------
##$DU= <C:\u>
##$EXPNO= 16620
##$NAME= <ADRS>
##$PROCNO= 1
##$TYPE= <nmr>
##$USER= <dgb>
##$AMP= (0..31)
100 100 100 100 100 100 100 100 100 100 100 100 100 100 100 100 100 100 
100 100 100 100 100 100 100 100 100 100 100 100 100 100 
##$AQSEQ= 0
##$AQ_mod= 3
##$AUNM= <au_zg>
##$AUTOPOS= <14 >
##$BF1= 250.13
##$BF2= 250.13
##$BF3= 250.13
##$BF4= 250.13
##$BF5= 500.13
##$BF6= 500.13
##$BF7= 500.13
##$BF8= 500.13
##$BYTORDA= 1
##$CFDGTYP= 0
##$CFRGTYP= 5
##$CHEMSTR= <none>
##$CNST= (0..31)
1 1 145 1 1 1 1 1 1 1 1 1 1 1 1 1 1 1 1 1 1 1 1 1 1 1 1 1 1 1 1 1 
##$CPDPRG= <>
##$CPDPRG1= <>
##$CPDPRG2= <>
##$CPDPRG3= <>
##$CPDPRG4= <mlev>
##$CPDPRG5= <mlev>
##$CPDPRG6= <mlev>
##$CPDPRG7= <mlev>
##$CPDPRG8= <mlev>
##$CPDPRGB= <>
##$CPDPRGT= <>
##$D= (0..31)
0 1 0 0 0 0 0 0 0 0.06 0 0 0 0 0 0 0.0002 0 0 0 0 0 0 0 0 0 0 0 0 0 0 
0 
##$DATE= 1140605173
##$DBL= (0..7)
120 120 120 120 120 120 120 120 
##$DBP= (0..7)
150 150 150 150 150 150 150 150 
##$DBP07= 0
##$DBPNAM0= <>
##$DBPNAM1= <>
$$ [...]
##$SUBNAM7= <"">
##$SUBNAM8= <"">
##$SUBNAM9= <"">
##$SW= 20.6930455092707
##$SWIBOX= (0..15)
0 0 3 0 0 0 0 0 0 0 0 0 0 0 0 0 
##$SW_h= 5175.983436853
##$TD= 65536
##$TD0= 1
##$TE= 293.16
##$TE2= 300
##$TE3= 300
##$TEG= 300
##$TL= (0..7)
0 120 120 120 120 120 120 120 
##$TP= (0..7)
150 150 150 150 150 150 150 150 
##$TP07= 0
##$TPNAME0= <>
##$TPNAME1= <>
##$TPNAME2= <>
##$TPNAME3= <>
##$TPNAME4= <>
##$TPNAME5= <>
##$TPNAME6= <>
##$TPNAME7= <>
##$TPOAL= (0..7)
0.5 0.5 0.5 0.5 0.5 0.5 0.5 0.5 
##$TPOFFS= (0..7)
0 0 0 0 0 0 0 0 
##$TUNHIN= 0
##$TUNHOUT= 0
##$TUNXOUT= 0
##$USERA1= <user>
##$USERA2= <user>
##$USERA3= <user>
##$USERA4= <user>
##$USERA5= <user>
##$V9= 5
##$VALIST= <valist>
##$VCLIST= <CCCCCCCCCCCCCCC>
##$VD= 0
##$VDLIST= <DDDDDDDDDDDDDDD>
##$VPLIST= <PPPPPPPPPPPPPPP>
##$VTLIST= <TTTTTTTTTTTTTTT>
##$WBST= 1024
##$WBSW= 4
##$XGAIN= (0..3)
0 0 0 0 
##$XL= 0
##$YL= 0
##$YMAX_a= 366602
##$YMIN_a= -542084
##$ZGOPTNS= <>
##$ZL1= 120
##$ZL2= 120
##$ZL3= 120
##$ZL4= 120
##$ABSF1= 16.522
##$ABSF2= -4.171173
##$ABSG= 5
##$ABSL= 3
##$ALPHA= 0
##$AQORDER= 0
##$ASSFAC= 0
##$ASSFACI= 0
##$ASSFACX= 0
##$ASSWID= 0
##$AUNMP= <proc_1d>
##$AZFE= 0.1
##$AZFW= 0.1
##$BCFW= 0
##$BC_mod= 0
##$BYTORDP= 0
##$COROFFS= 0
##$CY= 12.5
##$DATMOD= 1
##$DC= 0
##$DFILT= <>
##$DTYPP= 0
##$F1P= 14.0000005364418
##$F2P= -0.99999901652339
##$FCOR= 0.5
##$FTSIZE= 32768
##$FT_mod= 6
##$GAMMA= 0
##$GB= 0
##$INTBC= 1
##$INTSCL= 1
##$ISEN= 128
##$LB= 0.3
##$LEV0= 0
##$LPBIN= 0
##$MAXI= 10000
##$MC2= 0
##$MEAN= 0
##$ME_mod= 0
##$MI= 0
##$NCOEF= 0
##$NC_proc= -4
##$NLEV= 6
##$NOISF1= 0
##$NOISF2= 0
##$NSP= 0
##$NTH_PI= 0
##$NZP= 0
##$OFFSET= 16.522
##$PC= 1
##$PHC0= 242.0957
##$PHC1= 11.37459
##$PH_mod= 1
##$PKNL= yes
##$PPARMOD= 0
##$PSCAL= 4
##$PSIGN= 0
##$REVERSE= no
##$SF= 250.13
##$SI= 32768
##$SIGF1= 0
##$SIGF2= 0
##$SINO= 400
##$SIOLD= 32768
##$SREGLST= <1H.CDCl3>
##$SSB= 0
##$STSI= 32768
##$STSR= 0
##$SW_p= 5175.98343685301
##$SYMM= 0
##$S_DEV= 0
##$TDeff= 65536
##$TDoff= 0
##$TI= <Analysis number 999999
Compound Code 99
Book Reference 9
Project Code 9>
##$TILT= no
##$TM1= 0
##$TM2= 0
##$TOPLEV= 0
##$USERP1= <user>
##$USERP2= <user>
##$USERP3= <user>
##$USERP4= <user>
##$USERP5= <user>
##$WDW= 1
##$XDIM= 32768
##$YMAX_p= 551532522
##$YMIN_p= -289189
$$ End of Bruker specific parameters
$$ ---------------------------------
##NTUPLES= NMR SPECTRUM
##VAR_NAME=  FREQUENCY,     SPECTRUM/REAL,   SPECTRUM/IMAG
##SYMBOL=    X,             R,               I
##VAR_TYPE=  INDEPENDENT,   DEPENDENT,       DEPENDENT
##VAR_FORM=  AFFN,          ASDF,            ASDF
##VAR_DIM=   32768,         32768,           32768
##UNITS=     HZ,            ARBITRARY UNITS, ARBITRARY UNITS
##FACTOR=    0.157963299565203, 1,           1
##FIRST=     4132.6476996994, 0,             0
##LAST=      -1043.33573715361, 0,           0
##MIN=       -1043.33573715361, -289189,     0
##MAX=       4132.6476996994, 551532522,     0
$$ Real data points
##PAGE= N=1
##DATA TABLE= (X++(R..R)), XYDATA
$$ [...]
15656i844p93j6165O742J9819j4097o262j5868k3227J9808r523q733L5408K7217
15643D482J8526q935O341M06n0051r211P599L7770l130j1585o4497j7399P34K1659
15629f7291L4707K0549O912J3029k7030j5660K011J7367j6464j4919K9307j0579
15617b8061M5013O164o0125M5882P068m0101n807l7816K4183j4697J1160K1216
15605b5921L0749J7961m6803k8510k3852m062l651k1338K2342R1l860L0189J8484
15592c8181l1507J8232j4883K3062l153J0600K4756j3670l3288j5327L9439L9141
15580E221K5399l1156L967L0396m9959J725j4146j724J49l5473K4174R961N557
15567b5909k6976j0937J1766M2628p273K0261J7459O384N819K2235R009p500n5010
$$ plain form
15656 -9844 -10637 -26802 -20060 -241 -14338 -20600 -36468 -59695 -39887 -49410 -58143 -22735 4482
15643 4482 23008 14073 20414 20820 -29231 -38442 -30843 6927 3797 -7788 -72285 -89684 -88950 -67291
15629 -67291 -32584 -12035 -5123 7906 -19124 -34784 -32773 -15406 -31870 -46789 -17482 -28061
15617 -28061 16952 23116 -37009 8873 15941 -24160 -29967 -67783 -43600 -58297 -47137 -25921
15605 -25921 4828 22789 -24014 -52524 -76376 -80438 -84089 -105427 -83085 -82994 -86854 -56665 -38181
15592 -38181 -69688 -51456 -66339 -43277 -46430 -35830 -11074 -24744 -58032 -73359 -33920 5221
15580 5221 30620 -536 3431 33827 -16132 -14407 -28553 -30277 -30128 -65601 -41427 -31466 -25909
15567 -25909 -52885 -63822 -52056 -9428 -16701 3560 21019 27403 33222 55457 64466 56966 1956
15554A956m14J1646L7754J8174p718j5602j5396j7995m9998M0131M8298l0803
15542B0033q19l8109l8040l728j4312K3946J2684m120m628K9144q620J0445K1982
15529E858l7278j2349L581N1071r844k8692k343k4240k3573r435K5994j6077N19
15516g6808O818k9956K377j6365l453K6842K7578j661K1640N7832M159l1310j1400
15503b3707j4195J3791j2320P264J5334j1985M711k2732J0485K4004j6115n206
15491c0671j8372K3503n44r174q50M150l4380l1100p029M0979K4312K1005j821
15478a9992n380k661m9118J6479O8543q322n249K2109q943Q739O8365k576m8641
15465C3353l4266r552K0286k2520J8876N16l3717M96L4356N259n9142j3184N9334
$$ plain form
15554 1956 1542 13188 50942 69116 61398 45796 30400 12405 -37593 2538 50836 20033
15542 20033 19214 -18895 -56935 -60663 -74975 -51029 -38345 -42465 -47093 -17949 -26569 -16124 5858
15529 5858 -31420 -43769 -40188 10883 1039 -27653 -29996 -54236 -77809 -87244 -61250 -77327 -76808
15516 -76808 -69990 -99946 -97569 -113934 -117387 -90545 -62967 -64628 -42988 14844 19003 -12307 -23707
15503 -23707 -37902 -24111 -36431 -29167 -13833 -25818 -21107 -43839 -33354 -9350 -25465 -30671
15491 -30671 -49043 -25540 -26084 -35258 -36108 -31958 -66338 -97438 -104467 -63488 -39176 -18171 -19992
15478 -19992 -25372 -28033 -77151 -60672 7871 -451 -5700 16409 7466 16205 84570 81994 33353
15465 33353 -913 -10465 9821 -12699 6177 6693 -27024 -26528 7828 13087 -46055 -59239 95
15452I5R918r675k870j0453k8098j2741j2322j0430J8644j692L9940M7078r198
15439A8196l0734m7581p471L8988J9858j9808m4551r934k7J6062R756L1110L2891
15426F755K7747o912P839r047n1290J7411k7108k0714K0220K1480J0437k873K415
15413c640q911M01p882m2763l218M8784J0295j5983K3236J7792j4226l9751k3867
15400e9733m220P786L73L4547J649M7596J6306k2597k1915Q884j3796J3188j3775
15387e707m6549K2081M2133k1744j6929K320J5889q047k3261J2481L0848k3491
15375a9976j2780R465k4368m9775R094M6590L9417l1010k1394J2617K4887N382
15363a1851m4754k4325J8987J5223J6341l5562J436J8785l0907j825J9984k4178
$$ plain form
15452 95 10013 338 -2532 -12985 -41083 -53824 -66146 -76576 -57932 -59624 -19684 27394 18196
15439 18196 -12538 -60119 -67590 -28602 -8744 -28552 -73103 -83037 -83064 -67002 -57246 -26136 6755
15426 6755 34502 27590 35429 26382 -24908 -7497 -34605 -55319 -35099 -13619 -3182 -6055 -3640
15413 -3640 -12551 -12150 -20032 -62795 -66013 -17229 -6934 -22917 319 18111 3885 -35866 -59733
15400 -59733 -63953 -56167 -55794 -21247 -19598 27998 44304 21707 -208 8676 -5120 8068 -5707
15387 -5707 -52256 -30175 11958 -9786 -26715 -24395 -8506 -16553 -39814 -27333 3515 -19976
15375 -19976 -32756 -23291 -47659 -97434 -88340 -41750 -2333 -33343 -54737 -42120 -17233 -11851
15363 -11851 -56605 -80930 -61943 -46720 -30379 -65941 -64505 -45720 -76627 -78452 -58468 -82646
15351h2646q122L1632J960M536L5060l027j3461l1573j9885l137L0110K3975J5452
15338a9126j4044M4288m2853J52M1577K5550j723k0433k5662P871j8751n304o547
15325c5005J2101Q0344j9374k2754j1727j4568m2495K1634L3542M0016l750l6270
15313A694k9782M537M4861l1200o3228J1244J8827j171J2191J4768J0996j2438
15301a8701n685k7677J4058K3051j5735J0375j6411q489K0962R680n6153k9970
15289a00695J8693q565j4001K4961L4399L0623k081J5908K3885j967P142J0011
15277C8313O275M781n9016k7599m235j9899p8L5133K296k4516J5058j0149r510
15264e3146J1141K761P582K3237J9723j9883O370J8152p464l4317l9760k5406
$$ plain form
15351 -82646 -90768 -59136 -57176 -52640 -17580 -20607 -34068 -65641 -85526 -88663 -58553 -34578 -19126
15338 -19126 -33170 11118 -31735 -31583 9994 35544 33821 13388 -12274 -4403 -23154 -28458 -35005
15325 -35005 -22904 57440 38066 15312 3585 -10983 -53478 -31844 1698 41714 37964 1694
15313 1694 -28088 -23551 21310 -9890 -73118 -61874 -43047 -44218 -32027 -17259 -6263 -18701
15301 -18701 -24386 -52063 -38005 -14954 -30689 -20314 -36725 -45214 -24252 -14572 -70725 -100695
15289 -100695 -82002 -90567 -104568 -79607 -45208 -14585 -16666 -758 23127 21160 28302 38313
15277 38313 44588 49369 -9647 -37246 -41481 -61380 -61458 -26325 -24029 -48545 -33487 -43636 -53146
15264 -53146 -42005 -39244 -31662 -8425 11298 -8585 -2215 15937 8473 -25844 -65604 -91010
15252i1010J382M4378L7785l2155K3490O292j5342j0533J8001K2162l8718j6291
15240e0559P869J8287Q347p646J4447k074n044O293j5911l3362J2647K2848n491
15227b9349p462L442p348K0033J454J1279M6218K9294j7834K2354r843m1714L829
15214B4353J2847K0780j4156n0775m2722j0287k4723K2766L6957L5069j1351j0356
15202a1598J0909P203J2831K6174P651l6228l2222K3036K6561k4251k5077l784
15190a8795J1768J5141k000l5035K658N2086k820q208l187j9254N438j5112M685
15177a2635j2565j8510L2277N4254K9419q2060m0523N057M580J436j6965m6111
15165a02346J4024m766K9785O0364J4460j7371j8600K087m167m4389k3173K0217
$$ plain form
15252 -91010 -89628 -45250 -7465 -39620 -16130 -9838 -25180 -35713 -17712 4450 -34268 -50559
15240 -50559 -42690 -24403 -16056 -23702 -9255 -11329 -16373 -10080 -25991 -59353 -46706 -23858 -29349
15227 -29349 -36811 -33369 -40717 -20684 -19230 -7951 38267 67561 49727 72081 62238 20524 24353
15214 24353 37200 57980 43824 -6951 -49673 -59960 -84683 -61917 -24960 10109 -1242 -11598
15202 -11598 -689 6514 19345 45519 53170 16942 -15280 7756 34317 10066 -15011 -18795
15190 -18795 -7027 8114 6114 -28921 -26263 25823 23003 14795 11608 -7646 -2208 -17320 -12635
15177 -12635 -25200 -43710 -11433 42821 72240 -9820 -50343 -45286 -40706 -39270 -56235 -102346
15165 -102346 -88322 -93088 -63303 -2939 11521 -5850 -24450 -22363 -26530 -70919 -94092 -73875
15153g3875K7079L5975j7222l7089l7863N8776j1433j6952p151L25L8449K6457
15141a4524K5674r836K3257K9800m0895m974N104r939o126j0728k6195K1845K0700
15128C163r300N703O516k3024m8538l2599R08O873L347M8030J4591Q946j882j8635
15114c5901p026J1117L4058L9162p376j4404q268j7229m2590K621M3990J3939
15102A2093p3k1693m0155N605J373j8599N955J3287j7290q62L4933J9666K0742
15089A4982q093J4977j2377J7726L4861j4701j5666Q709j7059j2589J3408r878
15077A4300q2903l6393M2050K6843L1658L6297K0809j2397n9929l6157J4626M2698
15065A502k23L0951J2840n3798p796K2127L9842J7929j6246k9970m403J3607L1289
$$ plain form
15153 -73875 -46796 -10821 -28043 -65132 -102995 -44219 -55652 -72604 -79755 -79430 -40981 -14524
15141 -14524 11150 1314 24571 54371 13476 8502 13606 3667 -2459 -13187 -39382 -17537 3163
15128 3163 -6137 -434 6082 -16942 -65480 -98079 -97171 -90298 -86951 -38921 -24330 -15384 -17266 -35901
15114 -35901 -42927 -31810 2248 41410 34034 19630 11362 -5867 -48457 -45836 -1846 12093
15102 12093 12020 -9673 -49828 -44223 -42850 -61449 -55494 -42207 -59497 -60359 -25426 -5760 14982
15089 14982 6889 21866 9489 27215 62076 47375 31709 40418 23359 10770 24178 14300
15077 14300 -68603 -104996 -62946 -36103 -4445 31852 52661 40264 -19665 -55822 -41196 1502
15065 1502 1279 32230 45070 -8728 -16524 5603 45445 63374 47128 17158 12755 26362 57651
15052E7651j614k854q6066n5299P728K7332J3994K2038L6963L6063R132l8577
15040B6491n0789L9663K2888K0445q477j6332Q720J5033K0047m6095k8925K5213
15028B7882Q765l6591l213j0646K5068k4179K1363q761o443j9793L4703J0595
15016A8750k1572l0184l7173O455k2561k5997M7398Q649L52q317K3283L2940k0104
15003b8081j019k788l4678L3945K3593n065R557j1010J1262J7981L961j8316l3792
14990c4450j8209L4977K3027L141r919j1028J5361J7154n605l6313J0845J4199
14978C180N639J0350K8823j3882L0391J1142o2857j4500j129k3327m039J5053
14966a5156L858K3398J5461p495N518L1538l9916K173L1703l4753k464J8139k6705
$$ plain form
15052 57651 56037 53183 -32883 -88182 -80454 -53122 -39128 -17090 19873 55936 65068 26491
15040 26491 -24298 15365 38253 58698 50221 33889 42609 57642 77689 31594 2669 27882
15028 27882 36647 56 -3157 -13803 11265 -12914 8449 -312 -6755 -26548 8155 18750
15016 18750 -2822 -33006 -70179 -63724 -86285 -112282 -64884 -56235 -55883 -64200 -40917 -7977 -28081
15003 -28081 -29100 -31888 -66566 -32621 -9028 -14093 -4536 -15546 -4284 13697 17658 -658 -34450
14990 -34450 -52659 -17682 5345 8486 -1433 -12461 2900 20054 14449 -21864 -11019 3180
14978 3180 8819 19169 47992 34110 64501 75643 12786 -1714 -2843 -26170 -30209 -15156
14966 -15156 -11298 12100 27561 20066 25584 57122 17206 19379 51082 16329 13865 32004 5299
14953E299r366N325l3921J5930J0467k3289K897J5386k165K3055k0586k7644M1552
14940B940L6683q968k5023k0193K3902K0939j0337o405j7405K6252L6913o938
14928E2360o0597o279M065q405p254o856n237J5587m0916l350J7089n676J7774
14915c7695M9770R242k2277K1507l0215O177M7798k1617K5841J5558m8899k3361
14903h171R724K7371J7828m000j3516k3454l1637l8675j4544J0067Q513K4363
14891c6131N171k0467q893J2308P970J9484J8042K0066r309j0330M2777J7274
14879E7962r261j6214j0121j2633J848l2100k4640N576J9016K324p37k8184k2502
14866f9666k6264K2408M8045K7085L952r919j2323j160k2347q34K0382K4523K3912
$$ plain form
14953 5299 -4067 1258 -32663 -16733 -6266 -29555 -26658 -11272 -13437 9618 -10968 -38612 2940
14940 2940 39623 30655 5632 -14561 9341 30280 19943 13538 -3867 22385 59298 52360
14928 52360 -8237 -14516 -10451 -18856 -26110 -32966 -38203 -22616 -63532 -66882 -49793 -55469 -37695
14915 -37695 12075 21317 -960 20547 -9668 -3491 44307 22690 48531 64089 15190 -8171
14903 -8171 1553 28924 46752 42752 29236 5782 -25855 -64530 -79074 -69007 -60494 -36131
14891 -36131 -30960 -51427 -60320 -48012 -40042 -20558 -2516 17550 8241 -2089 40688 57962
14879 57962 48701 32487 22366 9733 11581 -20519 -45159 -39583 -20567 -18243 -18980 -47164 -69666
14866 -69666 -95930 -73522 -25477 1608 5560 -4359 -16682 -17842 -40189 -41023 -20641 3882 27794
14853B7794N528J8516L4583K5614K1078m07l4986P853l574J0151j5090j2623J474
14840H5911n1339j8841M4005l6947k3099K0918k0011j6842P763j2390m379N5450
14828C0199J8171k7466m8786m9125M0543K7593o754L8000o917l0845M8419L1258
14816F4290l8350M2729M1381k366k8803l0236K05p248l6787o872J3015J4823m767
14803B1014M0330r979q616j6344k099J7026k0633O566k4611k0360K1969J4568
14791A8831k4972K2510N769J8134n791N158j5835m316M2429j2732q903Q340J1502
14778F0124j5704K4445j6102L864J7381m894m4055K801j4558l6033J2604l079
14766a3206L426N5506n346N302J8580J5885j1883l8758l8750j5079K3727J3032
$$ plain form
14853 27794 33322 51838 86421 112035 133113 132706 97720 105573 101999 112150 97060 84437 85911
14840 85911 34572 15731 59736 22789 -310 20608 597 -16245 -8482 -20872 -25251 30199
14828 30199 48370 20904 -27882 -77007 -36464 -8871 -15625 22375 15458 -15387 33032 64290
14816 64290 25940 68669 110050 107684 78881 48645 48850 41602 4815 -2057 10958 25781 21014
14803 21014 61344 51365 42749 26405 24306 41332 20699 27265 2654 -17706 4263 18831
14791 18831 -6141 16369 22138 40272 34481 39639 23804 19488 61917 49185 40282 48622 60124
14778 60124 44420 68865 52763 56627 74008 69114 25059 27860 13302 -22731 -10127 -13206
14766 -13206 -9780 45726 40380 45682 64262 80147 68264 29506 -9244 -24323 -596 12436
14754A2436K996O015j5541k5525N5258M5225n1565l9472l4463J8184K0947N7103
14742E1598M124l5947O759Q946J6180M2951J5639k3970j0099O732R304l2301m907
14729E5009O61r68q323P77j6434K6454k9048j818j6158K4561K2886J3879j7944
14716E3534J3755L3898K7546m9358m9406N518J4634J0459j1833k3291K4969K0800
14704G1225O961L2326N763J494r962J3650l6006O104P365J1506m7764j1792j457
14691D9413j5083j8208M8737M0182O065l7557m1704j4119r641J9629j2721P475
14679B2468j7376L917n652j7253L9433L8894K7131P317l6148k475L2781K4971
14667A18008J01J2823J0149m9577j5747K438p287J718L0877K7170m0953J395K1098
$$ plain form
14754 12436 15432 21447 5906 -19619 35639 80864 29299 -10173 -44636 -26452 -5505 51598
14742 51598 55722 19775 26534 35480 51660 94611 110250 86280 76181 82913 92217 59916 55009
14729 55009 55670 54702 46379 47156 30722 57176 28128 26310 10152 34713 57599 71478 53534
14716 53534 67289 101187 128733 79375 29969 35487 50121 60580 48747 25456 50425 71225
14704 71225 78186 110512 116275 117769 107807 121457 85451 91555 98920 110426 62662 50870 49413
14691 49413 34330 16122 64859 105041 111106 73549 31845 17726 8085 27714 14993 22468
14679 22468 5092 9009 3357 -13896 25537 64431 91562 98879 62731 60256 93037 118008
14667 118008 118109 130932 141081 91504 75757 78195 70908 72626 103503 130673 89720 91115 112213
14654A12213L1527j3002j5680J5284p950j5403m718j1448K0925j3641k5327R135
14642H1915K777k479J2332J4114j1074j4425j7933P606L0636p512q072L274J1194
14629A02353M930J0200K3537j3333k9810n8023k1186j7333J9195P029K2236K2331
14617G2126j594J4074J0041k018k1883J7313K7193J2888N260j6675n7502P276
14605F6499J5196j1526r000J5761K4851J5702J1170n649k585q870l8734n1299
14593B1516M7013N8171J8982k1038n9895K2407L4733P746J115M0535l7704k2497
14581A11084J573k5498j3734K4600L2117K4002k8359k4116k5491j0907K766q77
14569F7160m5703N32K0626O0088K2195n529P166J5543n655k9274n008N812K8162
$$ plain form
14654 112213 143740 130738 115058 130342 122392 106989 102271 90823 111748 98107 72780 81915
14642 81915 84692 82213 94545 108659 97585 83160 65227 72833 103469 95957 87885 91159 102353
14629 102353 107283 117483 141020 127687 97877 39854 18668 1335 20530 27559 49795 72126
14617 72126 70532 84606 94647 92629 70746 88059 115252 128140 133400 116725 59223 66499
14605 66499 81695 70169 61169 76930 101781 117483 128653 123004 120419 111549 72815 21516
14593 21516 68529 126700 145682 124644 64749 87156 121889 129635 130750 171285 133581 111084
14581 111084 112657 87159 73425 98025 130142 154144 125785 101669 76178 65271 68037 67160
14569 67160 21457 21989 42615 102703 124898 119369 126535 142078 136423 107149 102141 107953 136115
14556A36115j1266j0252J1543L4624j4117l5802k1494J1874k9060K7818L9828
14545A39811p685k1988r88K302K9554J2684L213J82j5864J2039K0936L2768n051
14532B01913l7921j0761j9193o994q62J5743K6033K0196n2266j4075K2161k947
14520A41027J6033K993j0000L5603J2597j8477k4858K6710J4591o285p883j5269
14508A66782J4805O182J1525j1654N848j0366L471M1184K5566J2340r738L012
14496B58957k6763r242J0866K3121R842l1588j7681n137J4700N4605P885k7979
14484B61586n1267l083j9309K2949K0173J6644p211K734L7039j0824j7109J7171
14472B69493n444l4107j4944J4995L3949L5758K4556n1980l3668K9898L9843j3267
$$ plain form
14556 136115 124849 114597 126140 160764 146647 110845 89351 101225 72165 99983 139811
14545 139811 132126 110138 109150 111452 141006 153690 156903 157085 141221 153260 174196 206964 201913
14532 201913 163992 153231 134038 127044 126182 141925 167958 188154 135888 121813 143974 141027
14520 141027 157060 160053 150053 185656 198253 179776 154918 181628 196219 189934 182051 166782
14508 166782 181587 187769 199294 187640 193488 183122 186593 227777 253343 265683 255945 258957
14496 258957 232194 222952 233818 256939 266781 235193 217512 212375 227075 281680 289565 261586
14484 261586 210319 207236 187927 210876 231049 247693 240482 243216 280255 269431 252322 269493
14472 269493 264049 229942 214998 229993 263942 299700 324256 272276 238608 268506 308349 295082
14460B95082j5683L4210o183J5300M6255O209j4456j3705l5692k1302Q897P50
14448B99682k264j945K5092r260J1018P521o073j0290N462L3649M5849l3993p988
14435C56460R284L0591r982J792q760j1743J5753j9817J6838M0398K8528o204
14423D43138j3578j3654m402P576L3930k6553m1713n942L0541j7531M192N6035
14411D52039P275l9762k727Q284j4795M4237O676r857J190K9744K6748O486m7625
14398D67913P127J3043j1955L3126O0616J4203K4799r126n804p474q270K9258
14386F07456L5620L9038J0069m8028k2851K9376N5661L331M999j1530j4960j1334
14374F76847J0034j7558j3399R718o633M774k5476k5046M0084R208j1212L548
$$ plain form
14460 295082 279399 313609 307426 322726 368981 375190 360734 347029 311337 290035 298932 299682
14448 299682 297418 295473 320565 311305 322323 329844 323771 313481 318943 352592 398441 364448 356460
14435 356460 365744 396335 386353 388145 379385 367642 383395 363578 380416 420814 449342 443138
14423 443138 429560 415906 411504 419080 453010 426457 384744 378802 409343 391812 396004 452039
14411 452039 459314 419552 416825 425109 410314 454551 461227 451370 452560 482304 509052 515538 467913
14398 467913 475040 488083 476128 509254 569870 584073 608872 599746 593942 586468 578198 607456
14386 607456 643076 682114 692183 644155 621304 650680 706341 709672 714671 703141 688181 676847
14374 676847 686881 669323 655924 665642 659009 663783 638307 613261 653345 662553 651341 654889
14362F54889L2008L549j9929k0680k4398j0736k1663M3691p207L4709M5840j1744
14350F98329J3228L6696q926j6434p4L4481M9557k1374j8620K602M059N248K289
14337G81061K260O594m787r82k9947K1384r794j4569O6718M8286L9432J0339k4086
14324H91909N287J9158J9540m747L957k881k5742K0231N4283M2753o5676n1503
14312I06569M5911M3909q185M5034K1574q151j8821L0669o171R413Q914K6434
14300A097099J5282K7519K1916M1997R737l922M8255K3857N116M0697p984L719
14288A323288q463L0236J8542j5678M8735O6801K0918L5132L2345J4788K8121
14277A594765L4481J2516o428M2746J1275L3237R8227P3261M2810j823L547L0724
$$ plain form
14362 654889 686897 690446 670517 649837 625439 614703 593040 636731 629524 664233 710073 698329
14350 698329 711557 748253 739327 722893 722819 757300 806857 785483 766863 769465 773524 778772 781061
14337 781061 783321 789915 785128 784146 754199 775583 765789 751220 817938 866224 905656 915995 891909
14324 891909 897196 916354 935894 931147 935104 932223 906481 926712 980995 1023748 958072 906569
14312 906569 952480 996389 988204 1033238 1054812 1046661 1027840 1058509 1052338 1061751 1070665 1097099
14300 1097099 1112381 1139900 1161816 1203813 1213550 1209628 1257883 1281740 1286856 1327553 1319569 1323288
14288 1323288 1314825 1345061 1363603 1347925 1396660 1463461 1484379 1519511 1551856 1566644 1594765
14277 1594765 1629246 1641762 1635334 1678080 1689355 1722592 1820819 1894080 1936890 1935067 1938614 1969338
14265A969338M9368N0711N7041K1440K0594M0675k8292j6988L0359L0790N7160
14254B282196L1536L2769J9292N075M2946J7070L9890R3264L7240L4774M3944
14243B679996N6437Q0788N3016J8473K6728L7199P5999N8982Q8545N8892K1952
14232C257007N9078N4852N7134O3526M1833P9145N4942R7469J07545J23777O7723
14221D064031P2709J00630J02162Q9649Q9846J52983J12195P6517Q4609J28750
14211E074081J13726R7085J46659J69367R8735J37206J59139J95560J25417Q4282
14201F401257J52434K02356K00426J83136K02404J88741J84992K02245K54589
14192H172580K11804K23364K37414K69573K51664K89060L00902K83977L32744
$$ plain form
14265 1969338 2018706 2069417 2126458 2147898 2168492 2209167 2180875 2163887 2194246 2225036 2282196
14254 2282196 2313732 2346501 2365793 2370868 2413814 2430884 2470774 2564038 2601278 2636052 2679996
14243 2679996 2736433 2817221 2870237 2888710 2915438 2952637 3028636 3087618 3176163 3235055 3257007
14232 3257007 3316085 3370937 3428071 3491597 3533430 3612575 3667517 3764986 3872531 3996308 4064031
14221 4064031 4136740 4237370 4339532 4429181 4519027 4672010 4784205 4860722 4945331 5074081
14211 5074081 5187807 5284892 5431551 5600918 5699653 5836859 5995998 6191558 6316975 6401257
14201 6401257 6553691 6756047 6956473 7139609 7342013 7530754 7715746 7917991 8172580
14192 8172580 8384384 8607748 8845162 9114735 9366399 9655459 9956361 10240338 10573082
14183A0573082L25641K94491L03110L48700L69562L93641L96386M07839M53211
14174A3865663M71639M44740M88740N05155M86713N41962N37631N49779N82311
14165A8474333O52245O49126O78764O46011O42801O71585P08074P29326Q03088
14156B4655353Q17338Q41888Q08294Q12216P72682Q05993Q03236Q63755Q40888
14147C2021643Q29054P93661P54186P17900P06285O39279N63050N18663N02106
14138C8045827M31181L21196K96542K52938J92727R2985J2057q3551j43595k30013
14128C9188294l35057l71589m35333m58093n57950n95550o47384o34068o89562
14119C4463708p24989p79520p81801p64651p96253p66886p48104p70950q32276
$$ plain form
14183 10573082 10898723 11193214 11496324 11845024 12214586 12608227 13004613 13412452 13865663
14174 13865663 14337302 14782042 15270782 15775937 16262650 16804612 17342243 17892022 18474333
14165 18474333 19126578 19775704 20454468 21100479 21743280 22414865 23122939 23852265 24655353
14156 24655353 25472691 26314579 27122873 27935089 28707771 29513764 30317000 31180755 32021643
14147 32021643 32850697 33644358 34398544 35116444 35822729 36462008 37025058 37543721 38045827
14138 38045827 38477008 38798204 39094746 39347684 39540411 39633396 39645453 39561902 39418307 39188294
14128 39188294 38853237 38481648 38046315 37588222 37030272 36434722 35787338 35153270 34463708
14119 34463708 33738719 32959199 32177398 31412747 30616494 29849608 29101504 28330554 27498278
14110B7498278p90408p77483p57207p38918p19278o10257o08001p30530p10199
14101B1055997n86612o23732o26629n82527n67643n45678n29384m77234n06622
14092A6009936m63966m21984m38780m46528l57458m10015m25460l28638l30988
14083A2386119l55548l24989l21567l34872k88419l08682l11285k90061k08209
14074I642487k44239k18386k01209k26898k02328j88948k21830k05274j86519
14065G746856j97769k03316j85395j33208r3394j42836j92679j74893j66752j22029
14055F134585j14463o3340j48593j12263j30270j43132j29158j47065p5866m1066
14045E029369q1692j19680q6773p2496o9755j00479p4250r2789p7925o8382n6758
$$ plain form
14110 27498278 26707870 25930387 25173180 24434262 23714984 23104727 22496726 21766196 21055997
14101 21055997 20469385 19845653 19219024 18636497 18068854 17523176 16993792 16516558 16009936
14092 16009936 15545970 15123986 14685206 14238678 13881220 13471205 13045745 12717107 12386119
14083 12386119 12030571 11705582 11384015 11049143 10760724 10452042 10140757 9850696 9642487
14074 9642487 9398248 9179862 8978653 8751755 8549427 8360479 8138649 7933375 7746856
14065 7746856 7549087 7345771 7160376 7027168 6933774 6790938 6598259 6423366 6256614 6134585
14055 6134585 6020122 5956782 5808189 5695926 5565656 5422524 5293366 5146301 5070435 5029369
14045 5029369 4947677 4827997 4741224 4668728 4598973 4498494 4424244 4331455 4253530 4185148 4128390
14034D128390m5933n5071r2386p0446r0929p5119o5049r3546n4093q5542n9970
14023C340306l9813k6103n1892k8336k3747m5132n9109o5006m1312k9058m985
14012B925813k1942n7136j6750l7249n5502q0676q2815l9605L137k7906j8133
14001B491236P472M4995N8854J07533P2765J4785L0266k1332m7787n3006p5351
13990B630430j15216j27263q0537p7448m1821n2498q1991o3576m323K1734m6272
13979A961219l380m2757r1093k8535L265P47k4320j7185k9866m3867m8626l0728
13967A604874K9075l0818l5849j5112j4598l1069p802M5220j6172k3417m3841
13956A460491j0143p794j5549L7614N647k7167k9414l4851j9669O120m16n1388
$$ plain form
14034 4128390 4082457 4027386 3935000 3864554 3773625 3698506 3633457 3539911 3485818 3400276 3340306
14023 3340306 3300493 3274390 3222498 3194162 3170415 3125283 3066174 3001168 2959856 2930798 2925813
14012 2925813 2903871 2846735 2829985 2792736 2737234 2656558 2573743 2534138 2537275 2509369 2491236
14001 2491236 2498708 2543703 2602557 2710090 2782855 2797640 2827906 2806574 2758787 2705781 2630430
13990 2630430 2515214 2387951 2307414 2229966 2188145 2135647 2053656 1990080 1985757 2007491 1961219
13979 1961219 1957839 1915082 1823989 1795454 1798719 1799466 1775146 1757961 1728095 1684228 1635602 1604874
13967 1604874 1633949 1603131 1567282 1552170 1537572 1506503 1498701 1543921 1527749 1504332 1460491
13956 1460491 1450348 1442554 1427005 1464619 1470266 1443099 1413685 1378834 1359165 1365285 1364869 1313481
13944A313481j3854k1151k6380l7315l6976j8337N6430J1612j1818p967m4597
13933A163128k7360k6035K628j929r380o995j5286l9439R140L3930k5696l6605
13921A020101N486j9915l0460n269L0273K4221J3711M816p430l1617m6697J5389
13909I72609j0860k5202j2871l5283L4070l5227n220J3885J1182P834J7014N714
13897I37645r455m3134m0984M2127J3070j0391O788k612L2658k7652m3166j8454
13885H36440l089L7910M618k42j9110K5419l0421j3051j8716m5134k2707l3585
13873G18332N773J7672K7547j4754j9459m8085k9336R915j5234L2743M457J3493
13861G03064J9342n5958l8765j6140j200K7376M4377p119n5982k2374L1622k8117
$$ plain form
13944 1313481 1299627 1278476 1252096 1214781 1177805 1159468 1215898 1227510 1215692 1207725 1163128
13933 1163128 1135768 1109733 1112361 1110432 1101052 1094057 1078771 1039332 1048472 1082402 1056706 1020101
13921 1020101 1025587 1005672 975212 969943 1000216 1024437 1038148 1042964 1035534 1003917 957220 972609
13909 972609 961749 936547 923676 888393 922463 887236 882016 895901 907083 914917 931931 937645
13897 937645 928190 885056 844072 886199 899269 888878 895666 893054 925712 898060 854894 836440
13885 836440 833351 871261 875879 875637 856527 881946 851525 838474 819758 774624 751917 718332
13873 718332 724105 741777 769324 754570 735111 687026 657690 667605 652371 685114 689571 703064
13861 703064 722406 666448 627683 611543 610343 637719 682096 674977 618995 596621 628243 600126
13849F00126k0554J0917K9304J8053J814j9032j7763L4506J3241j4574J1790L1340
13837F79168k2400m5628J1667M1351Q98k568l5814l517m874m7578n5322K843k1679
13824D96547l77J0747l2222o182K8437l1371j0203l877j135J5893J3201m215K0969
13811D96212k361K0632L1436j119l512J0346l0387k6214j516K7945K0447K9572
13799E71481J795J2059k6922m0355l1423K114J0332J549k9460l357k0002l9730
13787D08081j6278m582j4239L4618K8489r252l017K3185k0705p4926j1600L8656
13775C78430K3532J6249L4115k991k7486l4590L7892L5676J3041l8063J4399L5749
13763D85953L1493L6573J2396j1710l4629j0298l6485k7015j612m546J8855k4468
$$ plain form
13849 600126 579572 590489 619793 637846 639660 620628 602865 637371 650612 636038 647828 679168
13837 679168 656768 611140 622807 664158 665056 662488 626674 623157 618283 570705 515383 518226 496547
13824 496547 496170 506917 474695 468513 496950 465579 455376 451499 450364 466257 479458 475243 496212
13811 496212 493851 514483 545919 544800 541288 551634 521247 495033 493517 521462 541909 571481
13799 571481 573276 585335 558413 518058 486635 488749 499081 500630 471170 467813 447811 408081
13787 408081 391803 387221 372982 407600 436089 426837 423820 447005 426300 351374 339774 378430
13775 378430 401962 418211 452326 449335 421849 387259 425151 460827 473868 435805 450204 485953
13763 485953 517446 554019 566415 554705 520076 509778 473293 446278 444666 440120 458975 434507
13751D34507j171N243M783J8492k3801K054M3903K4354l5538q472L486Q0066M0079
13738E87985J3922q070n126p076J3644m306J7748J4757K480m9840k5784m091j5402
13725E30841k8712l0273O461k5823j5757k8298k5236k1852n766K7134J6619K4044
13713D23382J8032K383q796l4830k9192k817M4098J0021N599J250J6249J7642
13701D63021j7892L883K2959J0014k8163k7031J5442j7420m3207k5707J5362J8311
13689C89572J0844m7069l3281J0476k822J1237j1353n2269K1859K6729p855K2669
13677C38737k2910j4012l2599j7073k2355n798j5489Q405O124N599J6969j9740
13665B25858l771L8393L3205j3549k5652J164l7392J0209j5439l0947J5823L2357
$$ plain form
13751 434507 433336 438579 443362 461854 438053 440107 484010 508364 472826 464354 467840 547906 587985
13738 587985 601907 593837 588711 581635 595279 590973 608721 623478 625958 576118 550334 546243 530841
13725 530841 502129 471856 478317 452494 436737 408439 383203 361351 355585 382719 399338 423382
13713 423382 441414 443797 435001 400171 370979 368162 412260 422281 427880 429130 445379 463021
13701 463021 445129 449012 471971 481985 453822 426791 442233 424813 381606 355899 371261 389572
13689 389572 400416 353347 320066 330542 327720 338957 327604 275335 297194 323923 316068 338737
13677 338737 315827 301815 269216 252143 229788 223990 208501 216906 223030 228629 245598 225858
13665 225858 222087 260480 293685 280136 254484 255648 218256 228465 213026 182079 197902 230259
13653B30259K6279J3597J9367R235p023L0720m2998l7418q864r390j7386J3956
13641B20334O195K2530k4933n097j2094r451k2953l553M2564q497k2473J6594
13629A99166L8245l3651l3985J5337O755k0561k3605l257M0580N494k9843o667
13617A54008M0856K5425q48J2089j9802R370K3501j8364l5109k5451J2208K397
13605A80280k426l0418P38q84L2208J685j0341j8747J494k140j926l081J2221
13592A58663L407j6180k184j6142J1894k1725k5264O335k0431r632Q103J5469
13580I2313K7162j5344J3682o660j1526L224L3403J8554K9955j1551j9119l4138
13568A19955j8174L0715K5908j1582k567K632j6343n2728J2394K953J1653r196
$$ plain form
13653 230259 256538 270135 289502 298737 291714 322434 279436 242018 233154 223764 206378 220334
13641 220334 226529 249059 224126 219029 206935 197484 174531 170978 213542 205045 182572 199166
13629 199166 237411 203760 169775 185112 191867 171306 147701 144444 185024 190518 160675 154008
13617 154008 194864 220289 219441 231530 211728 221098 244599 226235 191126 165675 177883 180280
13605 180280 177854 147436 148174 147290 179498 181183 170842 152095 153589 151449 149523 146442 158663
13592 158663 162070 145890 143706 127564 139458 117733 92469 98804 78373 68741 76844 92313
13580 92313 119475 104131 117813 111153 99627 102851 136254 154808 184763 173212 154093 119955
13568 119955 101781 132496 158404 146822 144255 146887 130544 77816 90210 93163 104816 95620
13556I5620N337J6999q02j6685M4162O396l5558j8473R838J7457n434K2656j9122
13543A22391j7966j9779N272K4726L7351K505o5197K717N1708K1763j0787n0185
13531A04519P467J5857r868j5307l6368j1135L718K3522N593K396J9757M1393
13519A51544J3971j7593o1496M222L4831K127m1904j5508L4490O958j3613j5320
13507H2709L8766M1090J6449q512p204j6596j0107l137R440L3263k8198l0951
13495A17012Q658o734M2057J4447J6166J9744k6184m8068l3601L3506J6317m0046
13483A13274m9311O446K7488n855L093M2565l1544k4246K9872J9100j1299k2531
13471I7052j0090J8645L6494j414J160J7322L602J9125J5722m3129l1587j4375
$$ plain form
13556 95620 100957 117956 117154 100469 144631 151027 115469 96996 106834 124291 118857 141513 122391
13543 122391 104425 84646 89918 114644 151995 154500 89303 92020 143728 165491 154704 104519
13531 104519 111986 127843 117975 102668 66300 55165 58883 82405 87998 90394 110151 151544
13519 151544 165515 147922 86426 90648 125479 127606 85702 70194 104684 111642 98029 82709
13507 82709 121475 162565 179014 170502 163298 146702 136595 133458 142898 176161 147963 117012
13495 117012 125670 118936 160993 175440 191606 211350 185166 137098 103497 137003 153320 113274
13483 113274 63963 70409 97897 92042 95135 137700 106156 81910 111782 130882 119583 97052
13471 97052 86962 105607 142101 140687 141847 159169 162771 181896 197618 154489 122902 108527
13459A08527p709J9054l59P1615N6635m872o907L2934M050m5749m3663o3077l8111
13446H2368j6417K2987L1499L852k3454L8438L5208R491l2298l128K3870r233
13434A63183j6418M994l1477l2610r068O247J6465L8208j092k2929l027l8302
13422G4174l1464K9738M0641J3426P010k2708k6344N110J902p221k698J1290J6653
13409A09509j2581m6902p769J2397m207N51J8655K6329K9136m880K9070j2153
13397A37155L114N006m7198k2679N715O465K886P612J6918K6597l3087l5781J9576
13384I2299L0184J6637l5213R697K1642q660j7827o679k5768Q7k6540L133K1191
13371G4183K0587R16M894O345j5582l1671M442J8966R004j030K5405K6379j8937
$$ plain form
13459 108527 100818 119872 119513 191128 247763 242891 235984 268918 272968 227219 183556 120479 82368
13446 82368 65951 88938 120437 124289 100835 139273 174481 183972 151674 148546 172416 163183
13434 163183 146765 151759 120282 87672 78604 84851 101316 139524 138432 115503 112476 74174
13422 74174 42710 72448 113089 126515 133525 110817 84473 89583 91485 84264 81566 92856 109509
13409 109509 96928 50026 42257 54654 50447 50998 69653 95982 125118 120238 149308 137155
13397 137155 140269 145275 98077 75398 81113 87578 90464 98076 114994 141591 108504 72723 92299
13384 92299 122483 139120 103907 113604 135246 126586 108759 102080 76312 76399 49859 52992 74183
13371 74183 94770 95686 100580 106925 91343 59672 64114 83080 92084 91054 116459 142838 123901
13358A23901M123M3255j313j1484j0907j9647J7863l290J4367P350l0374K956
13346A36800J135K549M1071J0449M5205L4199j0299k2727N1J4377K8100J5160
13334B96070k9493m2416k975j2224k6454K6651L2418K0802L037j901k1845l087
13322B38583N1307K8368Q438j3686K8616O0709K2965M1658J4640J7594Q9905R1294
13310F80391R1676J18430J17340R0406J15372J39084J63356J41165J08963Q3286
13300A849469M4492k8395k9082l3229n8914j15887q7793o0593j05176r1584q5116
13289A198192p7353o6651k7387n954q764l1099Q179O215m833K2032M4105J8684
13277A075366N6661Q6606R0847J18951J14989L5321O2660J02884j0230k4090K9720
$$ plain form
13358 123901 128024 171279 169966 158482 147575 127928 145791 142501 156868 164218 133844 136800
13346 136800 137935 140484 181555 192004 237209 271408 261109 238382 238433 252810 280910 296070
13334 296070 266577 224161 221186 208962 182508 209159 241577 262379 265416 263515 241670 238583
13322 238583 289890 318258 326696 313010 341626 402335 425300 466958 481598 499192 589097 680391
13310 680391 772067 890497 1007837 1098243 1213615 1352699 1516055 1657220 1766183 1849469
13300 1849469 1893961 1865566 1836484 1803255 1744341 1628454 1540661 1480068 1374892 1283308 1198192
13289 1198192 1120839 1054188 1026801 1020847 1012083 980984 989163 995378 990545 1012577 1056682 1075366
13277 1075366 1132027 1218633 1309480 1428431 1543420 1578741 1641401 1744285 1734055 1709965 1739685
13266A739685k6576r2901j20804j32013r9415j26666j24183j05616j04875o6964
13256G39672m8753o1553q5278r7618n4491K833R97j4068k9545m4937l4512L598
13244B76345J5502J8801r751l8750k1271n764j6421L134k1138l570l959j181l7712
13231A54265k5279m6471M168M8772J2673Q696j7286l8901J1463J2814p158J449
13219A19205k0352K964L0360J3638J1277K8601J518j814j1701j9245K2846l1719
13207A45578N934k6349l915K081L0737k4982l1473M0334J6176k7196o7765l0271
13195B8889L2265LJ9429M8202k8358l2761j2380J0352K6767J6244N1665k5479
13183A34838m5799l8038K6588k0908j8658o811J5582K0143L4913K8259J2980k4601
$$ plain form
13266 1739685 1713109 1620208 1499404 1367391 1267976 1141310 1017127 911511 806636 739672
13256 739672 690919 629366 544088 446470 391979 394812 395809 381741 352196 307259 272747 276345
13244 276345 291847 310648 300897 262147 240876 235112 218691 221825 200687 197117 193158 191977 154265
13231 154265 128986 82515 86683 135455 148128 156824 139538 100637 112100 124914 117756 119205
13219 119205 98853 101817 132177 145815 157092 185693 187211 185397 173696 154451 177297 145578
13207 145578 151512 125163 121248 123329 154066 129084 97611 137945 154121 126925 59160 28889
13195 28889 61154 61157 80586 128788 100430 67669 55289 65641 92408 108652 160317 134838
13183 134838 89039 51001 77589 56681 38023 31212 46794 66937 101850 130109 143089 118488
13171A18488k0558p729N065k9658Q82q47j9910K3032J2507K1184j0251J4870P120
13158A14195j1722J2102R752m2491j8203M7887K1484j1457J197m5041r597J8619
13146H6725k78M0874L0575J6125l5387j637J1515K5118M14K9748L7744J755j8483
13133B24808j9936J3829K6185k2361j4958J7670M661l3405k0718K3634m128K909
13121A98190j0170k7842K2203K5258J3129K2360k7092J8694K0610j844j2117n0357
13109A91022j1638K3412J791L8071K9023K7413N4367J4232l6956J5637Q205l3824
13097C20755k7755K2695N0883M9995M9084N523J9045o019J5689n444k283N7413
13085E49581M6708j2395J1549P5075J06234N4136J9898N685R109O5434O9741K6158
$$ plain form
13171 118488 97930 90201 95266 65608 66490 65643 45733 68765 81272 102456 92205 107075 114195
13158 114195 102473 114575 124327 81836 63633 111520 133004 121547 122744 77703 68106 86725
13146 86725 86447 127321 157896 174021 138634 136997 148512 173630 174044 203792 241536 243291 224808
13133 224808 204872 218701 244886 222525 207567 225237 229898 196493 175775 199409 195281 198190
13121 198190 188020 160178 182381 207639 220768 243128 216036 234730 255340 253496 241379 191022
13109 191022 179384 202796 204587 242658 271681 299094 353461 367693 330737 346374 354579 320755
13097 320755 293000 315695 366578 416573 465657 471180 490225 484206 499895 494451 492168 549581
13085 549581 596289 583894 595443 670518 776752 830888 850786 856471 865580 931014 1000755 1026913
13073A026913J5966P0982N0433J2453J7677J5117L1952L5440j3384k3402k5649
13062A214498j4377J1022m3621j3461L4843M894q2709j02516k2313l1127p2186
13051H82947n3247Q288l1875n7024l1635j9878l9556j8888r533n2626l2692o255
13039E38026j7954l3000k5509j7233m2968p701j3962k2129j4579l2076p959q907
13027B94049j7900q231r48J0354k6890p205k4602n88J6953l4003r594l4860J7366
13014A73901j9437l1585R774M8653j1952k0265K506j3350J6897k430r641Q199
13002A51270J0689M523k1459l9095K0573m000m0404K0968K1993J8248n475k9374
12990A08457n15l431j068m4682O239N0653Q520k0979J9336K2625J8875K3364l0225
$$ plain form
13073 1026913 1042879 1113861 1164294 1176747 1194424 1209541 1241493 1276933 1263549 1240147 1214498
13062 1214498 1200121 1211143 1167522 1154061 1188904 1193798 1111089 1008573 986260 955133 882947
13051 882947 829700 837988 806113 749089 717454 697576 658020 639132 629599 576973 544281 538026
13039 538026 520072 487072 461563 444330 401362 393661 379699 357570 342991 310915 302956 294049
13027 294049 276149 267918 266970 277324 250434 243229 218627 218039 234992 200989 191395 156535 173901
13014 173901 154464 122879 132653 181306 169354 149089 151595 138245 155142 152712 143071 151270
13002 151270 161959 166482 145023 105928 126501 122501 82097 103065 125058 143306 137831 108457
12990 108457 107942 104511 103443 58761 65000 115653 124173 103194 122530 145155 164030 187394 157169
12977A57169o9771P019M8318N337k7438k0156L2742J3324l8998l7061m631j1507
12965E4347J248K7478j1100J5815k4793k5884j3247j1349l8412L9905N8877J7775
12953I0660j5563k7274j0801m14J244n735j9809k8288k8183J9251P1306L4833
12941H1227K4332o235m5675j2675J65k5845k6860j6421L7827L650k090J6465J2438
12928D0303l844M347P244r333k3414J9583K5447L3092l0001k9615K9502K1981
12916H5292m7678m74L4614k8089k8530l1713P9243K5840J2008l332j853k2164
12904G3164j1816K3195L3285j5019n51p310j7658o295J7189O932k3161p743j5549
12891D8663l5501k6299J3378P151K0066R026k4281j3333M4957N1895K3518N86
$$ plain form
12977 157169 87398 94417 142735 148072 120634 100478 133220 146544 107546 70485 65854 54347
12965 54347 55595 83073 71973 87788 62995 37111 23864 12515 -25897 14008 72885 90660
12953 90660 75097 47823 37022 36608 37852 32117 12308 -15980 -44163 -24912 46394 81227
12941 81227 105559 99324 53649 40974 41139 15294 -11566 -27987 9840 13490 11400 27865 40303
12928 40303 36459 40806 48050 38717 15303 34886 60333 93425 63424 33809 63311 85292
12916 85292 37614 37140 71754 43665 15135 -16578 62665 88505 100513 97181 95328 73164
12904 73164 61348 84543 117828 102809 102258 94948 77290 70995 88184 95116 71955 64212 48663
12891 48663 13162 -13137 241 7392 27458 36484 12203 -1130 43827 95722 119240 119826
12879A19826J0947J8225p16J1508K9950n334m2186o0457r008K215K8831N5779
12867A59580l5433k9004P490N591k7991k9253m323L4250k788n2850k2086J5467
12855A8650K6658j8108m75j5022n83K7691J2611k4981N279k8667M792J7326n977
12842A9194J011K1781q170R927J6745Q073m6725p201L3318l2738k9807p513J5076
12829g029J0320O567N7439J0393k9367n0086N82M7700Q515l8879N385j8911n350
12816b721J1688q886K4404p383l429K2044k7675J2043J7850r469N109l917k4853
12803D805j4302J4282q578L0710P803P927K2682J2011J1240J896m4275J1907K1748
12790G9856p437J0382M8250k2647n5417o475j8562l6426J4043K8420J0330j2076
$$ plain form
12879 119826 130773 148998 148282 159790 189740 184406 142220 81763 72755 74970 103801 159580
12867 159580 124147 95143 102633 108224 80233 50980 46657 80907 78119 25269 3183 18650
12855 18650 45308 27200 26725 11703 11120 38811 51422 26441 31720 3053 7845 25171 19194
12842 19194 20205 41986 33816 43743 60488 68561 21836 14635 47953 15215 -14592 -22105 -7029
12829 -7029 3291 9858 67297 77690 48323 -1763 -1181 46519 55034 16155 21540 2629 -2721
12816 -2721 8967 81 24485 17102 13673 35717 8042 20085 37935 28466 33575 29658 4805
12803 4805 -9497 4785 -3793 26917 34720 42647 65329 77340 88580 90476 46201 58108 79856
12790 79856 72419 82801 131051 108404 52987 46512 27950 -8476 5567 33987 44317 32241
12778C2241k0593m040Q084L659N04L2044J1964k63k2786l0978n117K6440K3027
12765E4186M986L9093J7007n1292l9055o339j3820j1420M0002K8285j9493l018
12753C9122L6799m951q743K0312k7046l1950J3986j6313m227j8990K0220N1591
12741F9810J9143l1599N898J0681J1670m5545N28J6340j0657M677K4813j3436
12729F2323m1246l137q861K0375J7886O046K1305L7734j0243P473k7560j8733
12717F3362J7277J9845l3367m3671J2034m583J1119j6564p639K4122K1291J8003
12705H1229j7126m4841K2861O567J3991k2949L821K9457J5206m0032j6135j2098
12693A9951j1381l202l0235L3670J4492p1576j3347K006r361M5022j1260J1116
$$ plain form
12778 32241 11648 7608 15692 19351 19855 51899 63863 63600 40814 9836 4719 31159 54186
12765 54186 59172 98265 115272 63980 24925 18586 4766 -6654 33348 61633 42140 39122
12753 39122 75921 70970 62227 82539 55493 23543 37529 21216 16989 -2001 18219 69810
12741 69810 88953 57354 63252 73933 85603 40058 40586 56926 46269 50946 75759 62323
12729 62323 21077 17940 9079 29454 47340 53386 74691 112425 102182 109655 82095 63362
12717 63362 80639 100484 67117 23446 35480 30897 42016 25452 17813 41935 63226 81229
12705 81229 64103 19262 42123 48690 62681 39732 43553 73010 88216 48184 32049 19951
12693 19951 8570 5368 -24867 8803 23295 -48281 -61628 -59622 -68983 -23961 -35221 -24105
12681b4105N0147K2367k5516m271K4090J0508m393J5704k0337P013J6270j1742
12669E5735L0816N9978k7391l4455j8308J4065l4200k5474l3117O1773M2543j2053
12657G9912j7278k7811r149L977K9479J3832K8051m501l3648J3423L5274O358
12645A17919J73l3111m8413q207K1609m30k1549k3649K543K7663L208M308K017
12632D4081K4519R224m4272k1049m419l4279J7046L9874j2846r927l3185K3074
12620b159K4250P387M0355Q898m0162Q29N670j7928l6220J4195K1897M1317K6641
12607I4970J7499j1782k0609L0691K3168j2763j2635K1542N2762J3096q868j6491
12595A70580o300K8839L9891L1401M2903P3947J18963J30060J88331J90880J92389
$$ plain form
12681 -24105 26042 48409 22893 18622 42712 53220 48827 64531 44194 51207 67477 55735
12669 55735 86551 146529 119138 84683 66375 80440 46240 20766 -12351 49422 91965 79912
12657 79912 62634 34823 25674 29651 59130 72962 101013 96512 62864 76287 111561 117919
12645 117919 118092 84981 36568 28361 49970 49540 27991 4342 6885 34548 37756 42064 44081
12632 44081 68600 77824 33552 12503 8084 -26195 -9149 30725 17879 7952 -25233 -2159
12620 -2159 22091 29478 69833 78731 38569 39398 45068 27140 -9080 5115 27012 68329 94970
12607 94970 112469 100687 80078 110769 133937 121174 108539 130081 182843 195939 187071 170580
12595 170580 164280 193119 233010 264411 307314 381261 500224 630284 818615 1009495 1201884
12584A201884J55827J30932J11018j6908n7035o5221j48887j89751j47144j29972
12574H44743j13882p9463q7510r6898m4794l2790m5202n2902m6816J0880j3282
12563B42084n6032k8198r149k0042l6089q022j4763J797R989j8329K2343J2537
12551I8126l092J4602l3074k2677P93J6076k153j7836J7745j890m9927j2336P577
12538A1934K7800K405K0282K5192k3722p0920j1908J8575N87q042M728J7817J0680
12525B5408k102j6319J1693J3163J5047r69o287K9146K9841j8819k701R374m6268
12512D0207l4718ML342L021J6098L3228K2835J6113J1090O022j6753m5021l5759
12499A9709j4570L0039K5718k644m9504N477j853k3864Q885K3826L6651m1929
$$ plain form
12584 1201884 1357711 1488643 1599661 1582753 1525718 1460497 1311610 1121859 974715 844743
12574 844743 730861 651398 563888 466990 422196 389406 344204 291302 244486 255366 242084
12563 242084 186052 157854 148705 128663 92574 84552 69789 71586 81575 63246 85589 98126
12551 98126 95034 109636 76562 53885 54678 70754 68601 50765 68510 66620 16693 4357 11934
12538 11934 39734 42139 62421 87613 63891 -7029 -18937 -362 225 -7817 -3089 14728 25408
12525 25408 23306 6987 18680 31843 46890 45921 39634 68780 98621 79802 77101 86475 40207
12512 40207 5489 5493 8835 11856 27954 61182 84017 100130 111220 117242 100489 55468 19709
12499 19709 5139 35178 60896 58252 8748 14225 12372 -11492 -2607 21219 57870 15941
12487A5941l824M7835l13l7311r227L1844N0349L9577j7605l7567p864k159j7139
12474E2537n887J5168K3155O1277j9034j18823o9089J4300N5661N5359Q587j4217
12462E8994p304J5421k0129k1282k7433j3Q328K0470j6871M9051M4968k7422j6235
12449F0543K6289l1729q911L9479p25j3997O947Q892l4781k8706l9013j6899j4303
12436d6914M9107M6872r036K0738j4376l0882r575k1933K66k3501K5500M1536
12424B7802K1544L0318J0842j2661M4817J8651O0659M4438l0423m3263j0364K4884
12412A87244M1195m7305k5141J598j4395o1054L075m977N360k2898j8709J6194
12400F0187l945J449r236K6795L1630J3833j0163k459J4483p719k0457J4309p502
$$ plain form
12487 15941 12117 59952 59639 22328 13101 44945 95294 134871 117266 79699 71835 69676 52537
12474 52537 46650 61818 84973 146250 127216 8393 -60696 -46396 9265 64624 73211 58994
12462 58994 51690 67111 46982 25700 -1733 -1746 6582 27052 10181 59232 104200 76778 60543
12449 60543 86832 55103 46192 85671 84946 70949 77896 86788 52007 23301 -15712 -32611 -46914
12436 -46914 2193 49065 40029 60767 46391 15509 5934 -15999 -15733 -39234 -13734 27802
12424 27802 49346 79664 90506 77845 122662 141313 201972 246410 215987 172724 162360 187244
12412 187244 228439 181134 155993 157591 143196 82142 85217 80240 85600 62702 43993 60187
12400 60187 56242 57691 48455 75250 106880 120713 110550 108091 122574 114855 94398 108707 101205
12387A01205N13j9318j2629L1541P746J9822j2447R657m756n352K0195j1174m0934
12374H4069j9018N516j673Q95K1116Q336j91j6912j8012J5984j2300m985n9747
12361C078m0346o2607q681o545n6751o8727k6514k2096M4194N0009O1113O7470
12349f6403P3653J16997J13298J30760R2601P9389J16063O6021M100r1204r1336
12338E43939o3175r4886q8947m8921l1593k7466J5359k0694K2795K173l7118N041
12326A76507J8104J8149l7380o1733K1778J0455L239j5620K6398k6446m4525j4800
12314G4126j7187J1068k4248l0501K0656K4368K0169j6387j759J2914j122J7276
12302H9373l6999r87J0354k12K4530M2001J8097k0100K2970M9839m303j2589K2104
$$ plain form
12387 101205 101718 82400 69771 101312 109058 128880 116433 126090 121334 115982 136177 125003 84069
12374 84069 65051 70567 68894 69789 90905 99241 99050 82138 64126 80110 67810 62825 3078
12361 3078 -37268 -99875 -108556 -115101 -171852 -240579 -267093 -289189 -244995 -194986 -133873 -66403
12349 -66403 7250 124247 237545 368305 460906 540295 656358 722379 726479 635275 543939
12338 543939 480764 385878 296931 248010 216417 188951 204310 183616 206411 208584 171466 176507
12326 176507 194611 212760 175380 113647 135425 145880 149119 133499 159897 133451 88926 74126
12314 74126 56939 68007 43759 13258 33914 58282 78451 62064 60305 73219 72097 89373
12302 89373 52374 51387 61741 61529 86059 128060 146157 126057 149027 198866 194563 181974 204078
12289B04078M3922m3530j1961l6159K2059J5181j8608n4551m4464j0994O387L2455
12277A03815J2137J2724l945J7115Q503R00L2299j5111j9645L4433k8503o0929
12265I3793l3480o972j2130l2892K6305J3695J998L4401k6142j8004J8773O4861
12253A24206K078j8158J8582L5707M5774K6734k7669J2719L0124J908R375M8212
12241C09592J1988J4958q23j766l875k9092P659M89n0896k792m499J1068N0560
12228C12571K0205n756K0774L7161R070j2592K0806j7137J4826Q7896N5057K8677
12216E71558N9033L8181R5357L8125K0372J7473L1827N6283L6680J4380M9388
12205A028657M9172N7417P6582J54978J53856J39789J61899J78097J49596J79769
$$ plain form
12289 204078 248000 204470 192509 156350 178409 193590 174982 120431 75967 64973 71360 103815
12277 103815 115952 128676 124731 141846 150349 151249 183548 168437 148792 183225 154722 93793
12265 93793 60313 53341 41211 8319 34624 48319 50317 84718 58576 40572 59345 124206
12253 124206 126284 108126 126708 162415 208189 234923 207254 219973 250097 252005 261380 309592
12241 309592 321580 336538 335715 333949 330074 300982 308641 309130 258234 255442 250943 262011 312571
12228 312571 332776 327020 347794 384955 394025 381433 402239 385102 399928 487824 542881 571558
12216 571558 630591 668772 764129 802254 822626 840099 871926 928209 964889 979269 1028657
12205 1028657 1077829 1135246 1211828 1366806 1520662 1660451 1822350 2000447 2150043 2329812
12195B329812K34431K34138K76476L18394M20237N11800N74380P24353R10172
12186F534193J076101J315119J578658J737957J876253J968326K105054K265634
12178B0457295K569919L168727M356312O417429R728285J4785134K1248470K7784397
12170A10515968L3046247L5402167L3597629K7554171J8333461P122191n131484
12163B60440350j6759704k5943655l1652581l3263963l0826806k5752577j9735354
12156G6505710j4162368r730494o639614m721832l622136l069254k785364k756955
12148B9017693k808067k853605k756035k497351k138865j736260j377814j129582
12140A1720114q91776p27625o04247n46189m53002m56445m42774m18103l76203
$$ plain form
12195 2329812 2564243 2798381 3074857 3393251 3813488 4325288 4899668 5624021 6534193
12186 6534193 7610294 8925413 10504071 12242028 14118281 16086607 18191661 20457295
12178 20457295 23027214 26195941 30552253 36969682 46697967 61483101 82731571 110515968
12170 110515968 143562215 178964382 212562011 240116182 258449643 265571834 260440350
12163 260440350 243680646 217736991 186084410 152820447 121993641 96241064 76505710
12156 76505710 62343342 52612848 45973234 41251402 37629266 34560012 31774648 29017693
12148 29017693 26209626 23356021 20599986 18102635 15963770 14227510 12849696 11720114
12140 11720114 10828338 10100713 9496466 8950277 8497275 8040830 7598056 7179953 6803750
12131F803750l91163l90384l68631l15907k81354k58383l08304k62771k77193
12122C949660k40577k65501k66845k13434j67858j42574j12050r9897p7678j14192
12112B249054o5059m4250l5866q9703p4029p7024r6786j9332j5861l5401o9074
12101A626669o1907n9401N329l0491l9257l6257q185m9412J1070O884p847J1289
12089A368484j3781r53R961n349L4361R59n3366l9549n9376n8265k9058k9437
12077A124631n0219j7521l8221n0078N074l794O505j08r770j7556L573k8403k8727
12064H95386k0812j6790k6753J149k1901m1380n3731k824M3228k3843m7055J2154
12052F96828J0679j6543m3941k3302N1194K2442k5932j1077k909l25r630m3597
$$ plain form
12131 6803750 6412587 6022203 5653572 5337665 5056311 4797928 4489624 4226853 3949660
12122 3949660 3709083 3443582 3176737 2963303 2795445 2652871 2540821 2440924 2363246 2249054
12112 2249054 2183995 2139745 2103879 2014176 1940147 1863123 1766337 1747005 1731144 1695743 1626669
12101 1626669 1564762 1505361 1510690 1480199 1440942 1404685 1396500 1347088 1358158 1365042 1357195 1368484
12089 1368484 1354703 1353750 1363711 1358362 1392723 1393682 1340316 1300767 1241391 1183126 1154068 1124631
12077 1124631 1074412 1056891 1018670 968592 973666 969872 976377 976269 966499 948943 952516 924113 895386
12064 895386 874574 857784 831031 832180 810279 768899 715168 712344 755572 731729 684674 696828
12052 696828 707507 690964 647023 623721 674915 697357 671425 660348 657439 657114 647484 603887
12040F03887j7973M759l7957N123J6291j9664o3596k1902J946L7389N855j2031
12028E02127M22L5548L2867r129n071N806L3674R099k9426j7561l597J2176m568
12015E62367j1219j9255J6547l119l5988k1902m0393o2385k2405K0776N737j9822
12003C68939K736M740L5217L2673J7799N3255j1559j3635k652n409m0640K4700
11991D66164L3237K2878O876J4695K3017l750j0473M7107N1132Q1566J02287N2895
11979H87631L4332L5042R294K5556o22J44m546p6411j04879n8041l0447o1174
11967F55879p1715l2912r120m3491p5614N8100J7655k2984k6249O768O9155N4370
11955E79842L7682L769N363j0558m1941o5235l3824l7091J7498k7940n1701j9450
$$ plain form
12040 603887 585914 590673 552716 557839 574130 554466 490870 468968 470914 508303 514158 502127
12028 502127 502549 538097 570964 561835 556764 562570 596244 605343 575917 558356 554759 566935 562367
12015 562367 551148 531893 548440 545321 509333 487431 447038 384653 362248 383024 388761 368939
12003 368939 371675 376415 411632 444305 462104 515359 503800 490165 487513 482104 441464 466164
11991 466164 499401 522279 529155 543850 566867 563117 552644 599751 650883 732449 834736 887631
11979 887631 921963 957005 966299 991855 991233 991377 986831 910420 805541 747500 717053 655879
11967 655879 584164 551252 542132 498641 423027 481127 498782 475798 449549 456317 525472 579842
11955 579842 617524 621293 626656 616098 574157 508922 475098 438007 455505 427565 375864 356414
11943C56414j4699J4998N9370O431n381J117P097R027k5894l2218K3432J5030
11931D14724n3910l6275J9459j0370k4784J0843r171L9246L0683l3204N172k0629
11919C31784K1379j2499L218J70j7129k768K6768j0295m852Q776j3464k0036J3985
11906C25037k7189m5616J1555L2822K440N249L4757J8325j3660k8206O08l8532
11894B77590O244K6083j3696L324J1197k1778l5359m723J5762J6609n764l4145
11882B41344l0343K0952K3622K969O095J8919j9564M51L7225K9963m2614n812
11870B83207K571j8431k517k616j4959P703J1727J0372j6313k5238J633k463K6716
11857B61392L8028L3148j8360n392K6646J3934J8877l2605k4572j598j4724j2787
$$ plain form
11943 356414 341715 356713 416083 422514 417133 418250 425347 434374 408480 376262 399694 414724
11931 414724 360814 324539 343998 333628 308844 319687 310516 349762 380445 347241 352413 331784
11919 331784 353163 340664 343882 344052 326923 324155 350923 340628 335776 344552 331088 311052 325037
11906 325037 297848 252232 263787 296609 299049 304298 339055 357380 343720 315514 316122 277590
11894 277590 283834 309917 296221 299545 310742 288964 253605 248882 264644 281253 275489 241344
11882 241344 211001 231953 255575 258544 264639 283558 263994 264445 301670 331633 289019 283207
11870 283207 285778 267347 264830 262214 247255 254958 266685 277057 260744 235506 237139 234676 261392
11857 261392 299420 332568 314208 308816 335462 349396 368273 335668 311096 309498 294774 281987
11845B81987q278J9709L2216L6756j7597j40J9256m2036n7088l90j3927L0771
11833B81239j1292j3635J8504J8269j2142j4118n863j490N665J1934k16k574j7923
11820B56358m054M0580l994m0321M946N2155Q177J233l8094l411L5949L629l1127
11807B82026J8950j685j4235k5029K1320K0285L0161p699q210k3445k8009k2463
11795B41967K5352L8636m3200K0775M7327k7470l0437L8055R311Q941k9530K781
11783C02508k441K6806J3325m0671j2035L021J3846K8855j201J4832J5353L2495
11771C94693r670l7735Q077j6951l2060J4613M0476n637L9614J1989j458n596
11759D00355L291N5408l6624l4630K3990M6134R6366O2083O7230K4570Q2580J44930
$$ plain form
11845 281987 273709 293418 325634 362390 344793 344653 363909 321873 264785 264395 250468 281239
11833 281239 269947 256312 274816 293085 280943 266825 260962 259472 265137 277071 276855 274281 256358
11820 256358 252304 292884 288890 248569 253515 305670 313847 315080 276986 273575 309524 313153 282026
11807 282026 300976 299291 285056 260027 281347 301632 331793 324094 315884 292439 264430 241967
11795 241967 267319 305955 262755 283530 330857 303387 272950 311005 320316 329257 299727 302508
11783 302508 300067 326873 340198 299527 287492 290513 304359 333214 332013 346845 362198 394693
11771 394693 385023 347288 355365 338414 306354 320967 361443 355806 395420 407409 405951 400355
11759 400355 403646 459054 422430 387800 411790 457924 554290 616373 683603 708173 790753 935683
11747I35683J63992J84080J70000J03471O7864m448o7159j15740j20145j51352
11737A166246j53789j39916j32024m9455k9106k0918l6569m7027j9385l2608p9586
11726D25863K8296P790l2196m2131P579j9460K1435K6897p836p2282k5721n579
11714C12655j8566J0243J5240L325j5249K1957j1581m0116k3189j0665R845p319
11702B46580o464N361j225r41j6299j4898K0544M3635p126j936q236j3303J9944
11689B65636O6838L7733l5597o1385q211P222Q091J3132L4073J6948m0577l6863
11677B67040j7881j2535j5508K8869K5883N694O676L3452J0802K4927q495j4380
11665C34544n028J6558j9322R437J2089k5687q564k4068j0760J511k0214J415
$$ plain form
11747 935683 1099675 1283755 1453755 1557226 1625090 1620642 1553483 1437743 1317598 1166246
11737 1166246 1012457 872541 740517 691062 661956 641038 604469 557442 538057 505449 425863
11726 425863 454159 461949 429753 387622 395201 375741 397176 424073 416237 343955 318234 312655
11714 312655 294089 304332 319572 322897 307648 329605 318024 277908 254719 244054 253899 246580
11702 246580 240116 245477 244252 243311 227012 212114 232658 276293 269167 267231 258995 245692 265636
11689 265636 332474 370207 334610 273225 265014 272236 280327 293459 327532 344480 303903 267040
11677 267040 249159 236624 221116 249985 275868 281562 288238 321690 332492 357419 348924 334544
11665 334544 329516 346074 326752 336189 348278 322591 314027 289959 279199 280710 260496 261911
11653B61911Q784J4229J4281j1093k9951k746j3428m385L2015L690k749L3454
11641C04012O4849K6843l5906l5828p69J5145J2255k3073L487J7578K4056j9225
11629C53424j5025M3484M3537p550l1387J220j3813l6201J0239P045j1085l434
11617C40454r53P471j0678k4532J2377q511j6042N325M1950L6368l0094j1380
11605C41755j1540r885l6441L2990N646J4461n412L6139j1767K1462N217L4082
11593D16707r30l4961j8468k8444j9388j9626k0342R722L6043J4328m0015J4785
11581C09411k3558J2027L6164J1100J0891L1259M2665j1680k9902l43j8349o068
11569C63617j974n593k6089J523M936j9019m4553k4608L4511L7548l7680l7312
$$ plain form
11653 261911 270695 284924 299205 288112 258161 255415 241987 237602 269617 273307 270558 304012
11641 304012 368861 395704 359798 323970 323201 338346 350601 327528 331015 348593 372649 353424
11629 353424 338399 381883 425420 417870 386483 387703 373890 337689 347928 354973 343888 340454
11617 340454 339501 346972 336294 311762 324139 315628 299586 304911 346861 383229 353135 341755
11605 341755 330215 320330 283889 316879 322525 336986 331574 367713 355946 377408 382625 416707
11593 416707 415777 380816 362348 333904 314516 294890 274548 284270 320313 334641 294626 309411
11581 309411 285853 297880 334044 345144 356035 387294 429959 418279 388377 388034 369685 363617
11569 363617 361643 356050 329961 331484 336420 317401 272848 248240 282751 320299 282619 245307
11557B45307J2937m7934k0745P4194L7672J82o759l8552N510M6999j7662j2794
11545B78355K1179K2521j7903m8582m1015N683j1356O5837L2567k706R27L6846
11533C42353O622p7729n2627R5483N0472q086j4510l2636l259K9387j7641j7553
11521C00276M856j1959J5097K8570J346L643N350K885K0762J0565l0943n3293
11509B97155j9074K1985Q603J6095L64K2548K4580l6616k4306L2974k4698k4519
11497B95091K488M6677L346o447o062K4701J881m2805M855j3357k1779P524J0578
11484C06691K9674J0591n425J0770J8756L9335l5550m1255j5384O222n918J218
11472C19725k4445L0700M2536j7455n715m832o025L2063M0384j3295l7307J0262
$$ plain form
11557 245307 258244 210310 189565 263759 301431 301613 294854 256302 261812 308811 291149 278355
11545 278355 299534 322055 304152 255570 214555 220238 208882 274719 307286 304580 305507 342353
11533 342353 348975 271246 218619 314102 364574 356488 341978 309342 306083 335470 317829 300276
11521 300276 305132 293173 308270 336840 338186 341829 347179 350064 370826 381391 350448 297155
11509 297155 278081 300066 308669 324764 325128 347676 372256 335640 311334 344308 319610 295091
11497 295091 297579 344256 347602 341155 335093 359794 361675 318870 323725 310368 288589 296113 306691
11484 306691 336365 346956 341531 352301 371057 410392 374842 333587 318203 324425 318507 319725
11472 319725 295280 325980 368516 351061 345346 340514 334489 366552 406936 393641 356334 366596
11460C66596J6881j2252o4747L0578J7439J0029r027m321K214L4217K304j8995
11448C70916J5187l2459j3611K2419R391m04k1727J1213J1189K9926k0716L646
11436C84970m171K6761L347k756k2833l4056m3171r920K1561K0093J477k8804
11424C12498L2101l071r20K0328K4536k2267O686L0519j8078J1178j8327R131
11412C84314r902J2463N022j3204J3647O061j6909K278J6286J3250Q901j1070
11400D11137k9973l4310M3767q172n330j2062m569K6992k2948r876O0545J7966
11388D33167o2628m4712Q754j4093k818J7825J7968K5339L5339K4620J8642J7945
11376D75348L2590O412l9525l5536N884J3320n0239J0419K516J7138J9057J1254
$$ plain form
11460 366596 383477 371225 306478 337056 354495 364524 355497 351176 353390 387607 389911 370916
11448 370916 386103 353644 340033 362452 371843 371439 349712 360925 372114 402040 381324 384970
11436 384970 380799 407560 410907 408151 385318 351262 308091 298171 319732 339825 341302 312498
11424 312498 344599 341528 340608 360936 385472 363205 369891 400410 382332 393510 375183 384314
11412 384314 374412 386875 391897 378693 392340 398401 381492 383770 400056 413306 422207 411137
11400 411137 381164 346854 390621 382449 377119 365057 360488 387480 364532 354656 415201 433167
11388 433167 370539 325827 334581 320488 317670 335495 353463 378802 414141 438761 457403 475348
11376 475348 507938 514350 474825 439289 445173 458493 408254 418673 421189 438327 457384 468638
11364D68638J0110l6936j1140N1193K6189k2118j3881l014j5104J4757J8073L614
11352D90381j0260j2952j5852j7891m796J1089Q43K2228j0004N127l685l3720
11340D20508L7964K1731O821j5405k8673J2836L020J5391J5069j0297m1742L6067
11328D73290M2896m4350r70L6974L5586K0097k0146j1251l2290l923L7314J6527
11316E49754r888Q388j3268M3428p937l9529p59j4447p1585k0117r68J7248L7980
11303D78300J3876M3747L6875k35j4077k8809j7269J2458k6758J5755j3756j4210
11291D85897P700O2520L5709j7161l1608Q460K1951K4928k7973k356L6118K2345
11279F26530j2625K3987q410m5380j9077j716K3251L6168O567m7966K777J779
$$ plain form
11364 468638 478748 441812 430672 481865 508054 485936 472055 469041 453937 468694 486767 490381
11352 490381 480121 467169 451317 433426 428630 439719 440562 462790 452786 457913 454228 420508
11340 420508 458472 480203 487024 471619 442946 455782 458802 474193 489262 478965 437223 473290
11328 473290 516186 471836 470866 507840 543426 563523 543377 532126 499836 495913 533227 549754
11316 549754 539866 548254 534986 578414 570477 530948 530189 515742 444157 424040 423072 440320 478300
11303 478300 492176 535923 572798 572563 558486 529677 512408 524866 498108 513863 500107 485897
11291 485897 493597 556117 591826 574665 543057 551517 573468 598396 570423 568067 604185 626530
11279 626530 613905 637892 629482 584102 565025 563309 586560 622728 629295 581329 584106 585885
11267E85885R821j6314K2729O4032J6815j5903M7849O9283J03028J42022O5962
11256A095209N781n5520k6150n1830o6614r0002m5794n2254k7659P825p140k7581
11244F58271K0041J8250j4454k5618m4J5942R546k0868J2673L1615M7176K0873
11232G73403j2294l288J5203L0721K9461N4388J2897J9088N502N348j6426n6549
11220H57454l4357k8661l9270j1215l0602j3786Q868J4824k5221l2596r770q090
11208F47578k2180L1619L9538J961j2196P871K5747J2771K0415M501l3239K008
11196G26394L1942J3066J073o921j2322M505M3103r007J5303l0191K1593l874
11184G94664l8465l4222K1735M0524J4457L2688K5308n6030k2415K1165J6552
$$ plain form
11267 585885 595706 579392 602121 666153 682968 667065 714914 784197 887225 1029247 1095209
11256 1095209 1100990 1045470 1019320 967490 900876 810874 765080 712826 685167 692992 685852 658271
11244 658271 678312 696562 682108 656490 656446 672388 681934 661066 673739 705354 752530 773403
11232 773403 761109 757821 773024 803745 833206 887594 900491 919579 925081 930429 914003 857454
11220 857454 823097 794436 755166 743951 713349 699563 708431 723255 698034 665438 655668 647578
11208 647578 625398 657017 696555 698516 686320 694191 719938 732709 753124 757625 724386 726394
11196 726394 758336 771402 772475 765554 753232 757737 800840 791833 807136 776945 798538 794664
11184 794664 756199 721977 743712 784236 798693 831381 856689 800659 778244 799409 815961
11173H15961N5588K7197k4143k0818j9992J3157p584o728J5985N5947J0030p78
11161I13822L128k1978n851P2967K7490j3699J1939K172q553k0970L4448K9901
11149A024816k2391k1993l4771L7179L0472K0245L3683j096o5632p9393r791J4499
11137I25827J8009K0965j8936j2288m090K7485K3338P051L2953K1926j9650J8034
11125A040624K8066L3177M1152K4973j6086k712l5364J2007L3807j3952n92n378
11113A139722j1286r720j1712l9178l4146J3479M2368k8956k1525N976O861k6280
11101A025603k2894J7568N0317K279J9370r655J723K5580L040N568L8703j521
11089A155681J9676l6220k5919L488j2801Q791m682q544J669R284j3375m3695
$$ plain form
11173 815961 871549 898746 874603 853785 833793 846950 839366 832638 848623 904570 914600 913822
11161 913822 916950 894972 889121 962088 989578 975879 987818 989990 981437 960467 994915 1024816
11149 1024816 1002425 980432 945661 982840 1013312 1033557 1067240 1066144 1000512 921119 911328 925827
11137 925827 943836 964801 945865 933577 929487 956972 980310 987361 1020314 1042240 1022590 1040624
11125 1040624 1068690 1101867 1143019 1167992 1151906 1149194 1113830 1125837 1159644 1145692 1145100 1139722
11113 1139722 1128436 1118716 1107004 1067826 1033680 1047159 1089527 1060571 1039046 1045022 1051883 1025603
11101 1025603 1002709 1020277 1070594 1072873 1092243 1082588 1084311 1109891 1112931 1118499 1157202 1155681
11089 1155681 1175357 1139137 1113218 1116706 1103905 1112696 1108014 1099470 1101139 1110423 1097048 1053353
11077A053353m553j1740K5610N827Q151L1225M9965J2427m9900l1398j0475k71
11065A078221O141K3190J8354J8370J1446j1107k1798k178r121K5367L7259M1652
11053A215796l2141R582K047K0556l160P451j8365l758j6907o388J7964L8763
11041A231440L2336J8087J0590J084k0289j0734K2589r517j6777k746K8826K2570
11029A307459J4356j2348l2934J9261r734J6473K6219j2476L875L0050L62l0916
11017A319647R907K8480L7496l3796K1903N9729j2647m4795J1081K0019j9232
11006A397792J852L5374N0682Q907j2936Q594K563k0448J5582J0469L2569J5858
10994A546858N334l1174o034J5559K9947P4453M5956J8810j9654k8016k3571o7467
$$ plain form
11077 1053353 1048800 1037060 1062670 1068497 1076648 1107873 1157838 1170265 1120365 1088967 1078492 1078221
11065 1078221 1084362 1107552 1125906 1144276 1155722 1144615 1122817 1120639 1111518 1136885 1174144 1215796
11053 1215796 1183655 1193237 1195284 1215840 1212680 1220131 1201766 1198008 1181101 1174713 1192677 1231440
11041 1231440 1263776 1281863 1292453 1293537 1273248 1262514 1285103 1275586 1258809 1256063 1284889 1307459
11029 1307459 1321815 1309467 1276533 1295794 1286060 1302533 1328752 1316276 1320151 1350201 1350563 1319647
11017 1319647 1329554 1358034 1395530 1361734 1383637 1443366 1430719 1385924 1397005 1417024 1397792
11006 1397792 1399644 1435018 1485700 1494607 1481671 1490265 1492828 1472380 1487962 1498431 1531000 1546858
10994 1546858 1552192 1521018 1514984 1530543 1560490 1634943 1680899 1699709 1680055 1652039 1628468 1561001
10982A561001l1902Q303N5362O5141N6199K0045l3053K9308M9727L8995L2488
10971A851614P9392K8373j6612l5604m5158k0404m2261k9790J9464L9261L6207
10960A864482j9038k4975k872R171j0014M266J3860k076J1287k6193M679J1749
10948A834326K9664O259K497K6278J3681Q498k0174J3212M2130k521j235k9539
10936A923076j0726N6466J3285J3447K9980N0204L8906j4251M932j0619j2297
10925B082403J9323N011k733J0626L5369j0482J5868N3151M531l7954o070K1509
10913B190552j2054k439j778k8851K2571L2697k143J2776K6703J5465K1442O211
10901B281152O194j622J4314K5619l0005M929M8127K4912k8520j1451L7947L1072
$$ plain form
10982 1561001 1529099 1537402 1592764 1657905 1714104 1734149 1701096 1730404 1780131 1819126 1851614
10971 1851614 1931006 1959379 1942767 1907163 1862005 1841601 1799340 1769550 1789014 1828275 1864482
10960 1864482 1845444 1820469 1817597 1826768 1816754 1821020 1834880 1832804 1844091 1817898 1822577 1834326
10948 1834326 1863990 1870249 1872746 1899024 1912705 1921203 1901029 1914241 1956371 1953850 1952615 1923076
10936 1923076 1912350 1968816 1982101 1995548 2025528 2075732 2114638 2100387 2105319 2094700 2082403
10925 2082403 2101726 2106737 2104004 2114630 2149999 2139517 2155385 2208536 2213067 2175113 2169043 2190552
10913 2190552 2178498 2176059 2174281 2145430 2168001 2200698 2198555 2211331 2238034 2253499 2274941 2281152
10901 2281152 2287346 2285724 2300038 2325657 2295652 2300581 2348708 2373620 2345100 2333649 2371596 2402668
10889B402668K9974J9561J145K2054K1068J0967P886j0696K6090M5273P643k1547
10877B562086k2690N640L8842L5629l799j8502J3561L3663j9739J3315J0678M2910
10865B691594M2303m4909m8682n4302P390L9626M7381M1595m023K1505M2788J3111
10853B795377j4962J2105M8577J5251k9013j0442Q044L0092J0443K4053M0843
10842B930368M8869L4309L3747L7911k5564K7679N128L3663M726J9450L4273J0888
10830C195447P146k3294k4878m749L1581L3720M1881K4693n12j1570K3797M8836
10818C342098Q958M9253r082J0155L3855N6611L48k8409m441k0224J7302M8239
10806C504663l290O890L7785J6784J8373M4354N3067M0237L0043M8199K5727p562
$$ plain form
10889 2402668 2432642 2452203 2453348 2475402 2496470 2507437 2515323 2504627 2530717 2575990 2583633 2562086
10877 2562086 2539396 2545036 2583878 2619507 2615708 2597206 2610767 2644430 2624691 2638006 2648684 2691594
10865 2691594 2733897 2688988 2640306 2586004 2593394 2633020 2680401 2721996 2717973 2739478 2782266 2795377
10853 2795377 2780415 2792520 2841097 2856348 2827335 2816893 2824937 2855029 2865472 2889525 2930368
10842 2930368 2979237 3013546 3047293 3085204 3059640 3087319 3092447 3126110 3130836 3150286 3184559 3195447
10830 3195447 3202593 3179299 3154421 3149672 3181253 3214973 3256854 3281547 3281035 3269465 3293262 3342098
10818 3342098 3351056 3400309 3391227 3401382 3435237 3491848 3492196 3463787 3459346 3439122 3456424 3504663
10806 3504663 3501373 3508263 3546048 3562832 3581205 3625559 3678626 3718863 3748906 3797105 3822832 3815270
10794C815270k0648k0510N0661K7669l705L4043l410j0385O0891O8661N151l3277
10782C970411m2L6828N0929L1169M6734K1744L5935L4221M6941L5721J6206P45
10770D327542K5652R110J9025J5609N5703N3041j260l567J5393L1022M1984O1085
10758D650339K5229K3906M3019N0659N297K6945M2437K0775R217N4168L0960O0742
10746E043693J17158J39747J21372L2494j575l6846o0738k6708N037n986K0164
10735E347812L1124M1127O2850m734j6703N2929P8545J5170L8075N8291K9973
10724E734459N0924M4243N7991J00933O9930R806J5977J0283K8747P0191K1484
10713F214968L5457L7976M6041N0184Q668K5298P8394N3045P7803N0847N1996
$$ plain form
10794 3815270 3794622 3774112 3824773 3852442 3848737 3882780 3879370 3868985 3929876 3998537 4003688 3970411
10782 3970411 3970369 4007197 4058126 4089295 4136029 4157773 4193708 4227929 4274870 4310591 4326797 4327542
10770 4327542 4353194 4362304 4381329 4396938 4452641 4505682 4504422 4500855 4516248 4547270 4589254 4650339
10758 4650339 4675568 4699474 4742493 4793152 4798449 4825394 4867831 4888606 4897823 4951991 4982951 5043693
10746 5043693 5160851 5300598 5421970 5454464 5452889 5416043 5355305 5328597 5333634 5327648 5347812
10735 5347812 5378936 5420063 5482913 5478179 5461476 5514405 5592950 5608120 5646195 5704486 5734459
10724 5734459 5785383 5829626 5887617 5988550 6058480 6068286 6084263 6094546 6123293 6193484 6214968
10713 6214968 6250425 6288401 6334442 6384626 6393294 6418592 6496986 6550031 6627834 6678681 6730677
10702F730677N0283M6005Q5708M4412N5250M907J5929Q3389R2201L5019J6892
10691G260672N1931M8307M7477O6130Q8571R3415R8875M7930L2987N3308Q7699
10680G977302R8421J15985N1827P9952P5448M3862K1459M204O1966Q4669J05291
10669H720386O3989M2259L9479P9549O5396R4623Q5725P7037J08936R7722O7026
10658I542127O1123Q9287J42324J20545J09335Q7079Q3072R3666J11567O9962
10648A0510087R5399J03854J30505R7636R6545J06744J23171J30833J59992J64047
10638A1718813J56253J59982J87613K40975L16766M36876N52178N85653N34060
10629A4889169K82111L2191j68074k75059l04215j83859p5742p362p036Q994N0919
$$ plain form
10702 6730677 6780960 6826965 6912673 6957085 7012335 7017242 7033171 7116560 7208761 7243780 7260672
10691 7260672 7312603 7360910 7408387 7474517 7563088 7656503 7755378 7803308 7836295 7889603 7977302
10680 7977302 8075723 8191708 8243535 8323487 8398935 8442797 8464256 8468460 8530426 8615095 8720386
10669 8720386 8784375 8826634 8866113 8945662 9011058 9105681 9191406 9268443 9377379 9475101 9542127
10658 9542127 9603250 9692537 9834861 9955406 10064741 10151820 10234892 10328558 10440125 10510087
10648 10510087 10605486 10709340 10839845 10937481 11034026 11140770 11263941 11394774 11554766 11718813
10638 11718813 11875066 12035048 12222661 12463636 12780402 13217278 13769456 14355109 14889169
10629 14889169 15171280 15203471 15035397 14760338 14456123 14272264 14196522 14189160 14182124 14191118 14242037
10618A4242037J15985J19046N8619J40941J36489J23862J66223J59544J70933
10609A5433679J27166R7029J43892J48510J74408J86467J70230J36470J20875
10600A6738726J67381J81163K22040J64935J41484J90289K15660J82201J43278
10591A8347157K22199K24576K25817K14391K05089J85195K14716K24220K62618
10582B0325978K36804K02127K12419K28110K08825J84800K86636K62502K12448
10573B2360649K47788K53776K32510K21485K55979K69187K62528K85886K77036
10564B4666824K78518K73660K62972K26225K65886K81119K81230K76009K98532
10555B7110975L04727K80859K85110K84411K88908L00741L17008K96913L20342
$$ plain form
10618 14242037 14358022 14477068 14535687 14676628 14813117 14936979 15103202 15262746 15433679
10609 15433679 15560845 15657874 15801766 15950276 16124684 16311151 16481381 16617851 16738726
10600 16738726 16906107 17087270 17309310 17474245 17615729 17806018 18021678 18203879 18347157
10591 18347157 18569356 18793932 19019749 19234140 19439229 19624424 19839140 20063360 20325978
10582 20325978 20562782 20764909 20977328 21205438 21414263 21599063 21885699 22148201 22360649
10573 22360649 22608437 22862213 23094723 23316208 23572187 23841374 24103902 24389788 24666824
10564 24666824 24945342 25219002 25481974 25708199 25974085 26255204 26536434 26812443 27110975
10555 27110975 27415702 27696561 27981671 28266082 28554990 28855731 29172739 29469652 29789994
10546B9789994K92134K80615K94313K85286L06214L16193L05257L28928L32884
10537C2531818L14671L03273K86252L69271L14558K86796L13413L29719L24464
10528C5374235K86305L00762K73948K86983L58503L15272K98052L12612K67009
10519C8073681K71981K78326L12654L26759L19627L13716K67787K81702L09012
10510D0755245L24108L01129K32849K57569K87118K83709K67203K51379K35437
10501D3195746K42723K21487K15024K14601J84907K01091K41262K42613K00219
10492D5159673J85428K11163J90953K04974K30772K22106J64725K04542K63367
10483D7037703K80778L26902K87999K03970J08277J5273k3260Q759J7200K4200
$$ plain form
10546 29789994 30082128 30362743 30657056 30942342 31248556 31564749 31870006 32198934 32531818
10537 32531818 32846489 33149762 33436014 33805285 34119843 34406639 34720052 35049771 35374235
10528 35374235 35660540 35961302 36235250 36522233 36880736 37196008 37494060 37806672 38073681
10519 38073681 38345662 38623988 38936642 39263401 39583028 39896744 40164531 40446233 40755245
10510 40755245 41079353 41380482 41613331 41870900 42158018 42441727 42708930 42960309 43195746
10501 43195746 43438469 43659956 43874980 44089581 44274488 44475579 44716841 44959454 45159673
10492 45159673 45345101 45556264 45747217 45952191 46182963 46405069 46569794 46774336 47037703
10483 47037703 47318481 47645383 47933382 48137352 48245629 48260902 48237642 48246401 48263601 48287801
10473D8287801J3874N3975J22196Q7692Q7644Q0144M5359J421N2793L7683P7742
10462D8948324J00313K4604k0530q0051p1370r7906p7130l7908l50o1221m4178
10451D8582597r6497r7533m7067m2804q7325q5503j00513o0689q9624j38424j57074
10440D7579544j23013q9247j07852j49059j30424j27285j76671j66314j45821
10431D6363858j71854j67560j56307k24723j96541j97447j19998j55486k00071
10422D4773871k22023k19420k17290j66679j74442k27917k01667k07396k25243
10413D2911794k14535k51171k54103k38090k56221k65453k91976k87511l15758
10404D0536976l46309l57995l96357m38667l02679k13068j45235p3574j22954
$$ plain form
10473 48287801 48301675 48355650 48477846 48565538 48653182 48733326 48778685 48780106 48832899 48870582 48948324
10462 48948324 49048637 49073241 49052711 48972660 48901290 48803384 48726254 48688346 48687996 48626775 48582597
10451 48582597 48486100 48388567 48341500 48298696 48211371 48125868 48025355 47964666 47875042 47736618 47579544
10440 47579544 47456531 47367284 47259432 47110373 46979949 46852664 46675993 46509679 46363858
10431 46363858 46192004 46024444 45868137 45643414 45446873 45249426 45129428 44973942 44773871
10422 44773871 44551848 44332428 44115138 43948459 43774017 43546100 43344433 43137037 42911794
10413 42911794 42697259 42446088 42191985 41953895 41697674 41432221 41140245 40852734 40536976
10404 40536976 40190667 39832672 39436315 38997648 38694969 38481901 38336666 38263092 38140138
10395C8140138j99145k15927j91297k15920k11733k60776k55438k27441k28942
10386C6133519k26510k81537k78591k74414k70118k23906k04516k15618k28604
10377C3929705k37117k22565k18317j98943k20649k01031k73092k83897k23855
10368C1850239k41746k52984l14574l26072k69821k68279k52608k51354k73425
10359B9399376k41186k58751k56043k59005j91571k03564k40880k43878k09569
10350B7294929j57355k22913k30553k15116j68035j82763k44388k31363j90107
10341B5452336k20511k41119j57006j52580j59235k14581k27580k02412k64031
10332B3613281k74125k64186j95542j96933k17449j63286j57322k06855k24656
$$ plain form
10395 38140138 37940993 37725066 37533769 37317849 37106116 36845340 36589902 36362461 36133519
10386 36133519 35907009 35625472 35346881 35072467 34802349 34578443 34373927 34158309 33929705
10377 33929705 33692588 33470023 33251706 33052763 32832114 32631083 32357991 32074094 31850239
10368 31850239 31608493 31355509 31040935 30714863 30445042 30176763 29924155 29672801 29399376
10359 29399376 29158190 28899439 28643396 28384391 28192820 27989256 27748376 27504498 27294929
10350 27294929 27137574 26914661 26684108 26468992 26300957 26118194 25873806 25642443 25452336
10341 25452336 25231825 24990706 24833700 24681120 24521885 24307304 24079724 23877312 23613281
10332 23613281 23339156 23074970 22879428 22682495 22465046 22301760 22144438 21937583 21712927
10323B1712927j72248j94575k02303j82388j98130j65736j72828k02907j65987
10314B0055825j80231j74554j92350j90922k05878j63599j60769j54982j56853
10305A8475687j20255j27344j66965j26691j62067j67786j68432j49969j20200
10296A7165978j12986j32441j40545j59999j28599j04810j06775m3313p8635q0632
10286A6077243j09544j27786q9372j06619j41024q8160r8684p3445r6252j39825
10276A5006532j70522j91420j35662j22393o1609p6148j09021q2327r1995l2009
10266A3933426l2271l0854k9682p2628k3453J7038L1091K7246k3878p0598q3827
10255A3641610j11557r2529j17844q4208j3131J0469J6406M1691J08271J39834
$$ plain form
10323 21712927 21540679 21346104 21143801 20961413 20763283 20597547 20424719 20221812 20055825
10314 20055825 19875594 19701040 19508690 19317768 19111890 18948291 18787522 18632540 18475687
10305 18475687 18355432 18228088 18061123 17934432 17772365 17604579 17436147 17286178 17165978
10296 17165978 17052992 16920551 16780006 16620007 16491408 16386598 16279823 16236510 16157875 16077243
10286 16077243 15967699 15839913 15750541 15643922 15502898 15414738 15316054 15242609 15146357 15006532
10276 15006532 14836010 14644590 14508928 14386535 14324926 14248778 14139757 14057430 13965435 13933426
10266 13933426 13901155 13870301 13840619 13767991 13744538 13761576 13792667 13819913 13796035 13725437 13641610
10255 13641610 13530053 13437524 13319680 13235472 13222341 13232810 13249216 13290907 13399178 13539012
10245A3539012Q6082J11918J48741J77586K23080K28502L18587M03696M89047
10236A5726251N78551P12028Q75402J044949J312023J674911J916705J937699
10228B5778519J599478J322182J392533J825151K546878L629624N168638P144377
10220E0407380R844899J3984877K0534161L0971258M7665310P3504433J04955005
10213C51867323J16235520P5607262P822417m9545201q5766521r5008515q0387872
10206B40824413n8210523l9991780k7630424j9576590j4329672j0668929q042152
10199F2374343o104612m701975l620992k879925k565319k733125k925111l004953
10191C3838331k879264k498245k073718j739587j398634j224740j030656r19676
$$ plain form
10245 13539012 13625094 13737012 13885753 14063339 14286419 14514921 14833508 15237204 15726251
10236 15726251 16304802 17016830 17892232 18937181 20249204 21924115 23840820 25778519
10228 25778519 27377997 28700179 30092712 31917863 34464741 38094365 43263003 50407380
10220 50407380 60252279 74237156 94771317 125742575 173407885 246912318 351867323
10213 351867323 468102843 543710105 551532522 501987321 416220800 321212285 240824413
10206 240824413 182613890 142622110 114991686 95415096 81085424 70416495 62374343
10199 62374343 56269731 51567756 47946764 45066839 42501520 39768395 36843284 33838331
10191 33838331 30959067 28460822 26387104 24647517 23248883 22024143 20993487 20073811
10183B0073811q21499p34320o32935o21234n16900m71934m42177m04468l74507
10174A5053837l76290l52783m22085m18265m30057m34776l81178m01687l38995
10165A1497721k99796k26344k13941k32268k13069j89620j54733j77888j55553
10156I634509j38243j31965j09352j26657j20628j18907j33722j10889p6468j03926
10146H463752q1662r6035j28873j16325j16692j02237m7785n7984q1032q9610
10136G545517n8073J3984m1172q7760p4045l8725k0149n0896p4665m1421l2265
10125G040330l2368l0432k3718l6131n0729n4530p2651m8579k3073o197J4474
10114F676396m7652k6125m8612n0816j4901m5962q3371k3861k9033l6868J8745
$$ plain form
10183 20073811 19252312 18517992 17885057 17263823 16746923 16274989 15832812 15428344 15053837
10174 15053837 14677547 14324764 13902679 13484414 13054357 12619581 12238403 11836716 11497721
10165 11497721 11197925 10971581 10757640 10525372 10312303 10122683 9967950 9790062 9634509
10156 9634509 9496266 9364301 9254949 9128292 9007664 8888757 8755035 8644146 8567678 8463752
10146 8463752 8382090 8286055 8157182 8040857 7924165 7821928 7774143 7716159 7635127 7545517
10136 7545517 7487444 7501428 7460256 7372496 7298451 7259726 7239577 7188681 7114016 7072595 7040330
10125 7040330 7007962 6977530 6953812 6917681 6866952 6812422 6739771 6691192 6668119 6661922 6676396
10114 6676396 6628744 6602619 6554007 6503191 6488290 6442328 6358957 6335096 6306063 6269195 6287940
10103F287940O1769P7872J45564J82468J36701K4705n4533q0531j54458j92987
10093F434510j81818j40321j31613j30480q9284p9066j8733n7996o0193l6025
10083E508981l7509O557N0658O129j4664L5386J7354K1979R906L8819M5877L9569
10071E729042J19548J64149K01322K34559L53373M98401P12150R57562J271130
10062A0241236J453047J122942N06742k93387q56742j157560j113704q62418n80111
10053H460045l27216n3028K82387P58878J687326L533602N602994L187913l48419
10044B2784482k375854l711551l797721k566691j522390r31458o15475m66991
10036F796351l84113l11141k27022j75111j23924j14700j00353o8999l2353J821
$$ plain form
10103 6287940 6349709 6427581 6573145 6755613 6892314 6917019 6862486 6781955 6627497 6434510
10093 6434510 6252692 6112371 5980758 5850278 5760994 5681928 5663195 5605199 5545006 5508981
10083 5508981 5471472 5478029 5528687 5534816 5520152 5555538 5572892 5594871 5604777 5643596 5689473 5729042
10071 5729042 5848590 6012739 6214061 6448620 6801993 7300394 8012544 8970106 10241236
10062 10241236 11694283 12817225 13323967 13030580 12173838 11016278 9902574 9040156 8460045
10053 8460045 8132829 8079801 8362188 9121066 10808392 14341994 19944988 23132901 22784482
10044 22784482 20408628 16697077 12899356 10332665 8810275 7878817 7263342 6796351
10036 6796351 6412238 6101097 5874075 5698964 5575040 5460340 5359987 5290988 5258635 5260456
10026E260456L1690Q3311Q5000O808q4230j30033j96279j94624j53958j27838
10016D580303j21908j04012q0676k9257m5940k2495l2357p0941l3182l8160j0556
10005C990819k8088k0182L1582k2587m1015m4569n128j0308l0983m4776l0011
9994C744754l0237q585l6797k6568m1409o7495k9337l221k1966m1465K1731K329
9982C461734L979l3261l791J3721m828k3042k1951k8867k7761l8132k2641L5794
9970C310954N9438r578l768n5160o4035n4944q853J0769J615j1201k4252J0750
9958C161735o788J0187o910l7005j3301n849J9070j9676P207o7115j4512k4703
9946C002340l1492k9068O827n217l7876k8830j0383L1140K7227n5646l3418K1602
$$ plain form
10026 5260456 5292146 5375457 5460457 5467265 5383035 5253002 5056723 4862099 4708141 4580303
10016 4580303 4458395 4354383 4273707 4244450 4198510 4176015 4143658 4072717 4039535 4001375 3990819
10005 3990819 3962731 3942549 3974131 3951544 3910529 3865960 3860832 3850524 3819541 3774765 3744754
9994 3744754 3714517 3705932 3669135 3642567 3601158 3533663 3504326 3501105 3479139 3437674 3459405 3461734
9982 3461734 3465713 3432452 3428661 3442382 3437554 3414512 3392561 3363694 3335933 3297801 3275160 3310954
9970 3310954 3370392 3360814 3357046 3301886 3237851 3182907 3174054 3184823 3186438 3175237 3150985 3161735
9958 3161735 3154947 3165134 3158224 3121219 3107918 3102069 3121139 3101463 3108670 3041555 3027043 3002340
9946 3002340 2970848 2941780 2948607 2943390 2905514 2876684 2866301 2897441 2924668 2869022 2835604 2857206
9934B857206K1582j2887M711Q705j8997l8572o2613j7532L6211j0673j6402j9687
9922B731052k9784M699j5384J2413q60j0949l994j736j1617l2935l3702K2195
9910B629398M0002J0533L172j5712k9181j1972m4804l6399j7373k2661l4410j7360
9898B453233Q536J7987m604j6393P870K9357n6568l3885M211P623K229k0037r315
9885B390244J1677L0823P594k5701q19J0628l9430j3240m6359K3258Q09k9737
9873B319747Q42n24m406J8933J4771j571n1194J123k8532j4399l1191m956K8879
9860B247522j4603j2141p478J8749l076L8343M6150m8690k5279o769k0863q38
9848B211027K6688k0140k1429j9213m3314q16N648l1844j791J0047J3065K3836
$$ plain form
9934 2857206 2878788 2865901 2870612 2879317 2860320 2821748 2759135 2741603 2777814 2767141 2750739 2731052
9922 2731052 2701268 2705967 2690583 2702996 2702136 2691187 2687193 2685457 2673840 2640905 2607203 2629398
9910 2629398 2669400 2679933 2683105 2667393 2638212 2626240 2581436 2545037 2527664 2505003 2470593 2453233
9898 2453233 2461769 2479756 2475152 2458759 2466629 2495986 2439418 2405533 2409744 2417367 2419596 2399559 2390244
9885 2390244 2401921 2432744 2440338 2414637 2413818 2424446 2385016 2371776 2325417 2348675 2349484 2319747
9873 2319747 2320589 2320065 2315659 2334592 2349363 2347792 2296598 2297721 2269189 2254790 2223599 2218643 2247522
9860 2247522 2232919 2220778 2213300 2232049 2228973 2267316 2313466 2264776 2239497 2232728 2211865 2211027
9848 2211027 2237715 2217575 2196146 2176933 2133619 2132803 2138451 2106607 2104816 2114863 2127928 2151764
9836B151764k3607k1582J5097R203j125K458O076m224p600L279K2489k3341m6437
9823B082450l7625J1153r302j9744j3737q596L5139p801m9298k8418L560L6075
9811A993856M772J3191j9435j296K5979N2191NJ6354L8768K7212m811j7260K1081
9798B150607J0958p343M6209P7805J54696J77766K39913L01336M04611N18328
9788D074886L22945N0975k31188l52565m11432m19627k96466j94622j62134j07928
9778B272844p1362m1858l4002m3419m1686m8221l2521k5415J1920k2635l6287
9767A887358L1005k1434l3115l6045K028j3045J155j3310J3750R363k0034j7496
9755A790180k5300l2241o1230n640K3281K9421J3643k8738k6585k8561m6831j9638
$$ plain form
9836 2151764 2128157 2106575 2121672 2130875 2129750 2132208 2138284 2134060 2126460 2129739 2152228 2128887 2082450
9823 2082450 2044825 2055978 2046676 2026932 2013195 2004599 2039738 2031937 1982639 1954221 1957781 1993856
9811 1993856 1998628 2011819 1992384 1991088 2017067 2069258 2069263 2085617 2124385 2151597 2146786 2129526 2150607
9798 2150607 2161565 2154222 2200431 2278236 2432932 2610698 2850611 3151947 3556558 4074886
9788 4074886 4397831 4448806 4217618 3865053 3453621 3033994 2737528 2542906 2380772 2272844
9778 2272844 2201482 2159624 2125622 2082203 2040517 1992296 1959775 1934360 1946280 1923645 1887358
9767 1887358 1918363 1896929 1863814 1827769 1829797 1816752 1817907 1804597 1818347 1827710 1807676 1790180
9755 1790180 1764880 1732639 1671409 1665769 1689050 1718471 1732114 1703376 1676791 1648230 1601399 1581761
9743A581761k951O322J5364J5582N9937m683j3874j9156l9139N724J0639K0355
9731A635881j5471l2626j983N164j6327m282K9872k141n3474J1015K0855j4364
9719A562119L192J3302k139k758l6206L629k046J9337j0378j9273N87q65K4227
9706A552728k784n2314j9290o820K7864j0138j3616j8693J0303L4486M0036k3448
9694A518314l5374k2501k2209j7810L7044L5484L6075J4363j2631l1932j6699
9683A482124l3722k6667K3981K3478o59l7671o520Q102J7094n3973j0016p489
9671A378062q24j4344J4392J2922K2662J5986o3075j1494J2113L5520J0115m0965
9659A371070k2670j3725M943o624k2189p888o868j8256l819j0592M274K2113k0928
$$ plain form
9743 1581761 1578810 1585132 1600496 1616078 1676015 1671332 1657458 1638302 1599163 1604887 1615526 1635881
9731 1635881 1620410 1587784 1585801 1590965 1574638 1570356 1600228 1598087 1544613 1555628 1576483 1562119
9719 1562119 1565311 1578613 1576474 1573716 1537510 1541139 1539093 1558430 1548052 1528779 1529366 1528501 1552728
9706 1552728 1549944 1497630 1478340 1471520 1499384 1489246 1475630 1456937 1467240 1501726 1541762 1518314
9694 1518314 1482940 1460439 1438230 1420420 1457464 1492948 1529023 1543386 1530755 1498823 1482124
9683 1482124 1448402 1421735 1445716 1469194 1468535 1430864 1424344 1432446 1449540 1395567 1385551 1378062
9671 1378062 1377238 1362894 1377286 1390208 1412870 1428856 1365781 1354287 1366400 1401920 1412035 1371070
9659 1371070 1348400 1334675 1339618 1332994 1310805 1302917 1296049 1277793 1273974 1263382 1267656 1289769 1268841
9646A268841l432L4960K6864M240l6866J0202M1578P672L060L056k8502k0735
9634A310938k9414l0659l253K0289J4828j3797j9501k4106K9521K3067n7053M003
9622A224863L5878r892j280J4574r033J849n8860n7414R507M2313O7058J3265
9610A272828K096j5435m6693j0899M3179K8598j4859k0523k6217j1962K8938J2908
9598A241959o355l4157J4315J5054M9011j2665J4954J1260m3317n4336q071r694
9586A177958j0583n442J1346o4831l6598q323j0447j1999J3309L2455M085l791
9574A087139r706K347m764J9451K3470j3054m5374K1609J6019q891N006K6474
9562A119726k9435J0422k817M838j366K261k5298l0469k3818K9405L0360J9911
$$ plain form
9646 1268841 1265409 1300369 1327233 1331473 1294607 1304809 1346387 1354059 1357119 1360175 1331673 1310938
9634 1310938 1281524 1250865 1247612 1267901 1282729 1268932 1249431 1225325 1254846 1277913 1220860 1224863
9622 1224863 1260741 1250849 1249569 1264143 1255110 1256959 1198099 1140685 1150192 1192505 1259563 1272828
9610 1272828 1274924 1259489 1212796 1201897 1245076 1273674 1258815 1238292 1212075 1200113 1229051 1241959
9598 1241959 1235604 1201447 1215762 1230816 1279827 1267162 1282116 1293376 1250059 1195723 1187652 1177958
9586 1177958 1167375 1161933 1173279 1108448 1071850 1063527 1053080 1041081 1054390 1086845 1090930 1087139
9574 1087139 1077433 1079780 1075016 1094467 1117937 1104883 1059509 1081118 1097137 1088246 1093252 1119726
9562 1119726 1090291 1100713 1097896 1102734 1101368 1103629 1078331 1047862 1024044 1053449 1083809 1103720
9550A103720P468j3339j1325L0356k3071n345k0417k4341k4856o7519K2446L5549
9538A009326j2546k1318k818J8388R0432K2469l2167k4808j5626j1702j1642J645
9526A009633J55p38n6837r563j4130J468L891P711J0097J8664m67m144O532R396
9512I81668K4868j0375L649J316K9729J2661Q913j9685k9157M489J9768m3466
9500I84378n8490l3532L2304L8269p873j2883R145n702m642k9266n303q852m676
9487H92877q625j7428j0522J8680M4402k3251j1584p94k5662k1883J5461M912
9475H56583N683K4820m0645j7233N6667K1011J9423n773j3278j6613j7345j0780
9463H62520l1941Q095J671N065j4863n3250J778P1544M9794J5322j7010o1534
$$ plain form
9550 1103720 1111188 1097849 1086524 1116880 1093809 1088464 1068047 1043706 1018850 951331 973777 1009326
9538 1009326 996780 975462 972644 991032 1081464 1103933 1071766 1046958 1031332 1019630 1007988 1009633
9526 1009633 1009788 1009050 952213 942650 928520 929988 933879 941590 951687 970351 969884 965740 972272 981668
9512 981668 1006536 996161 999810 1001126 1030855 1043516 1052429 1032744 1003587 1008076 1027844 984378
9500 984378 925888 892356 924660 962929 955056 942173 951318 945616 940974 911708 906405 897553 892877
9487 892877 884252 866824 856302 874982 919384 896133 884549 883755 858093 836210 851671 856583
9475 856583 862266 887086 846441 829208 885875 906886 926309 920536 907258 890645 873300 862520
9463 862520 830579 838674 840345 845410 830547 777297 779075 850619 900413 915735 898725 837191
9451H37191j5333Q18j3896j149k9084M3799L7824o885Q133n126J6269k1644o1868
9438G89049J7022M5925J6180l1114J0634k3215N512J7112N5787K6078l0000p7126
9426H21844o3423k2036o836J4388L4827K1831R876L897j4311m2883J391N326K3700
9413G87591k2558j0291m2036l7826K3731L897O50j1855J110J4667j097L5206L7923
9400G79112L9794K0274K8160n819m2238j8298j2171n146l3016j257L080K1844
9388G74319j523n6537J2663L3473J8219l4355k2437q232K1478K0842J8290p810
9376G68390m4174m590j004K1419L1992k9827N373J2973k1830L613K6347Q875m888
9363G72669K0054k7855j1429j7441l2024j8303J375J5627J7951P735J1920K5074
$$ plain form
9451 837191 821858 822676 808780 807631 778547 822346 860170 853285 861418 856292 872561 850917 789049
9438 789049 806071 851996 868176 837062 847696 824481 829993 847105 902892 928970 898970 821844
9426 821844 758421 736385 729549 743937 778764 800595 810471 814368 800057 757174 758565 763891 787591
9413 787591 765033 754742 712706 674880 698611 702508 703158 691303 692413 707080 705983 741189 779112
9400 779112 818906 839180 867340 861521 819283 800985 788814 783668 750652 749395 752475 774319
9388 774319 772796 716259 728922 762395 780614 746259 723822 715590 737068 757910 776200 768390
9376 768390 724216 719626 718622 740041 772033 742206 747579 760552 738722 742335 768682 777557 772669
9363 772669 792723 764868 753439 735998 703974 685671 687046 702673 720624 728359 740279 765353
9351G65353M8691j1517l8294p016L33M552m6331l5611J7848p689K3838Q804l021
9338G19940p907L6571j8194K429J7435J4517o3637L787j0801l3479j4327J856
9326F48190q71k237k915J9568L6347J4006k6412m6611q905J3183K8038K0311j5606
9313F76086j986N9851j3838m7841k6401l208J6005O757L0952j3535k1278m2829
9301F18735k0775K326L6364l122r4N6739l3384n2686k7495K8592L4876L6415l1042
9288F45449K0774K0068J9236j2300l5301p9712k3136J7055N6490K7103k409m4558
9276F08759K0832k2092M358j1483J4402J2213J6848P835o682r242j959j5601k4161
9263E94027j2401o559o24O517N7656j562m0529L4250K6530J0193r167j7493l2061
$$ plain form
9351 765353 814044 802527 764233 757217 757550 762102 715771 680160 698008 690319 714157 722961 719940
9338 719940 712033 748604 730410 732839 750274 764791 701154 704941 694140 660661 646334 648190
9326 648190 647319 645082 642167 661735 698082 712088 685676 639065 630160 643343 671381 691692 676086
9313 676086 674100 733951 720113 672272 645871 642663 658668 665425 696377 682842 661564 618735
9301 618735 597960 600286 636650 633528 633434 690173 656789 604103 576608 605200 640076 676491 645449
9288 645449 666223 686291 705527 693227 657926 578214 555078 572133 628623 655726 653317 608759
9276 608759 629591 607499 611857 600374 614776 626989 643837 651672 644990 635748 633789 618188 594027
9263 594027 581626 575067 574443 580960 638616 637054 596525 630775 657305 667498 658331 640838 608777
9250F08777k2784J4715L6366M0458n912n5142k8756l908o200Q10M084K9949M9450
9237F61907L6510p724n2479k3166l1435k1825l23K2134R36J5385o064K3586m563
9224F12879j931q872m4459J0904J576k4581J8853J5450q405J801n675k0481K7681
9211E74740K7883k8380l4797j2483k6860P194N9416r180j8838P302k0421m8218
9199D77358L096O6942K5711J622N641j0343J6361l3189j5083Q266K8847N913m7816
9186E33326M0393M357k4335J6319L0389k1156l3298L335N805l0194k9691N2759
9174E48009J4673j8114M954P086R022o972o628q11L4785K4311o52M861j7123k9529
9160E67872j5830L3081m8032m0500k535n192K2120N7842L541K300l8142L073j8955
$$ plain form
9250 608777 585993 600708 637074 677532 671620 616478 587722 583814 577614 578424 582508 612457 661907
9237 661907 698417 690693 638214 615048 583613 561788 561465 583599 584535 599920 593856 617442 612879
9224 612879 610948 602076 557617 568521 570097 545516 564369 579819 571414 573215 567540 547059 574740
9211 574740 602623 574243 539446 526963 500103 507297 566713 557533 538695 545997 525576 477358
9199 477358 480454 547396 573107 574729 580370 570027 586388 553199 538116 546382 575229 581142 533326
9186 533326 573719 578076 553741 570060 600449 579293 545995 549330 555135 524941 495250 548009
9174 548009 562682 544568 549522 556608 565630 558658 552030 551219 586004 610315 609663 614524 597401 567872
9160 567872 552042 585123 537091 496591 494056 488864 510984 568826 572367 574667 536525 539598 520643
9147E20643K2964j393l6251P916M5415k3288n1439M2902O505J2082K5935n358
9135E66633p9553k451M8406q435L412L6137k4004j0239L1260o672k3154K981L5627
9122E69948J1258p3829m5857k7756K5729N8200L6064k729j1641l4612j1623L1088
9110E24240k197o727j8672k4786p258L6444J9598L8358J4320K2084p795l2865
9098E54744J2505j773o926o481k6544j9113K1719l969L83M5671J1811M403j5218
9085E71212k6856J0258j1171j9651J0047Q59j3888R719J008m230K3193J9566M01
9072E70467k3314O939N7052J1694k4441l2904l4342k5419l1941K1809k1089k3141
9060D51370M483N2166j317k8357n148R093q629l2801Q394K9879j8335o607K4216
$$ plain form
9147 520643 543607 542214 505963 513879 559294 536006 484567 527469 533974 546056 571991 566633
9135 566633 487080 484629 533035 524600 528012 564149 540145 529906 561166 554494 531340 534321 569948
9122 569948 581206 507377 461520 433764 459493 517693 553757 551028 539387 504775 493152 524240
9110 524240 522043 515316 496644 471858 464600 501044 520642 559000 573320 595404 587609 554744
9098 554744 567249 565476 558550 552069 525525 506412 528131 524162 524545 570216 582027 586430 571212
9085 571212 544356 554614 543443 523792 533839 534698 520810 530529 531537 527307 550500 570066 570467
9072 570467 547153 554092 611144 622838 598397 565493 531151 505732 473791 495600 474511 451370
9060 451370 455853 508019 506702 478345 473197 482290 473661 440860 449254 479133 460798 454191 478407
9047D78407M6618l1661k6436L1499K4517l0049q78M3849K0727m1513m2033r147
9035D63900O4101K9653L2162N4790p620m7557m5027K401m0572r717r575L202j4787
9022D75354n5220k0094L2543j3992l5851M6484N9113J7655j6038m8552l8638l2559
9010C70205L0956M7772k4211l6157o225K5760L9591K1039k4909k7040j5114K1226
8998D22893j2149m125L4941K4629Q910k6507l9414K2585l4866J5392K2030k7972
8986D06347k2248J5721J8517J0327j0223k4022J0710l98k3584J6934M472q474
8974C94079k3496R03K7835k3162J3522k6188J0834j5134J2732J0717L4923j9516
8962C98049L68J1481m650j250M9918n857l6899J7817K6828m1447m500k347o259
$$ plain form
9047 478407 525025 493364 466928 498427 522944 492895 492017 535866 556593 515080 473047 463900
9035 463900 528001 557654 589816 644606 636986 589429 544402 546803 506231 496514 486939 490141 475354
9022 475354 420134 400040 432583 418591 382740 429224 488337 505992 489954 441402 402764 370205
9010 370205 401161 448933 424722 388565 382340 408100 447691 468730 443821 416781 401667 422893
8998 422893 410744 406619 441560 466189 475099 448592 409178 431763 396897 412289 434319 406347
8986 406347 384099 399820 418337 428664 418441 394419 405129 404731 381147 398081 402553 394079
8974 394079 370583 371486 399321 376159 389681 363493 374327 359193 371925 382642 417565 398049
8962 398049 398417 409898 405248 403998 453916 448059 411160 428977 455805 414358 409858 407511 401252
8949D01252n5044K161N9815j717j3054P577P454m6893M9513M4895M2218k2458
8937D75719k2437k6221j5105k3131k5904P998J2102K1721m0934j8152L4471M1966
8925D22093K157j436j1341k8046J6452J9345m680L2500K3985p5358k2749J3687
8913C86609J5489k0054m1977M1690M5929K7217k5440k1496J6285K6312N113L2973
8901D88650k047j1946J72r009m7938m0972j822j18j2805l778O125l661n704N7021
8887D12168k1373k9415P352m2053l5712k3188K1533P5432N6452j0829j8959J88
8875C91596K5198P1300N1832R63j5956O4894O6520J05729J88612L05993M08382
8864A665063M57019K99885j4408k80887m44321l33903k65226j99901j30154j00365
$$ plain form
8949 401252 346208 348369 408184 406467 393413 400990 408444 361551 411064 455959 498177 475719
8937 475719 453282 427061 411956 388825 362921 370919 383021 404742 363808 345656 380127 422093
8925 422093 424250 422814 411473 383427 399879 419224 414544 447044 471029 395671 372922 386609
8913 386609 402098 382044 340067 381757 427686 454903 429463 407967 424252 450564 455677 488650
8901 488650 486603 474657 474829 465820 417882 376910 375088 374970 362165 358387 364512 360851 355147 412168
8887 412168 390795 361380 368732 326679 290967 267779 289312 364744 421196 410367 391408 391596
8875 391596 416794 488094 539926 540889 524933 589827 656347 762076 950688 1256681 1665063
8864 1665063 2122082 2421967 2407559 2126672 1682351 1348448 1083222 883321 753167 652802
8854F52802j9015k0430p0005q1910j5347K166J0555K232J8333j2052n2140K6061
8842D41250N431j1834l4642l2650J5326J0879k1138m92j338N4123n181n4418j8767
8829C46549J9597J1364l1694j2107J487j1126M376n748j1655Q799l3006J1206
8817B98042R999J0602Q683j7320L847N684j0772o474M1621J114K1109j8353l5449
8804C12333j5574J7960K5730J6049n551J24M497q033j1398k3093K1829K2280j2953
8791C44200j8575M801M2397K5543N370P10j7371P65k4102m6527k8378J4794J9393
8778C23020J0472j0247M3784K3803K4165j2811k5320j7418k8021P235K4449J9368
8766C82479l2694m1218l1351j8421l0041N9410L2015L0789K8162N981j2358k3929
$$ plain form
8854 652802 633787 613357 543352 461442 446095 448261 458816 461048 479381 467329 415189 441250
8842 441250 446681 434847 400205 367555 382881 393760 372622 372130 370792 424915 419734 365316 346549
8829 346549 366146 377510 345816 333709 335196 324070 328446 322698 311043 319842 286836 298042
8817 298042 308041 318643 327326 310006 313853 319537 308765 302291 343912 345026 366135 347782 312333
8804 312333 296759 314719 340449 356498 350947 351071 355568 347535 336137 313044 334873 357153 344200
8791 344200 325625 330426 372823 398366 403736 404446 387075 387840 363738 317211 288833 303627 323020
8778 323020 333492 323245 367029 390832 414997 402186 376866 359448 331427 338662 363111 382479
8766 382479 349785 308567 277216 258795 228754 288164 320179 350968 379130 385111 372753 348824
8754C48824j2401J5800j9154k863M1557j2620m8495k222r513J3339L8063K2061
8742C72376j6040n094M688k4731o575N7436L6241q870r435J402j3897P996k508
8729C92989N6915K539l453J1781J8722j4735j2805k931n519j4005K043J3092k505
8716D42128O685L1946j6325j6544J1136j9361j3459K6608M638j8899l317L5121
8704D70357M36o2264l9868K0131q650n632K3491j4526j8621K8513K0602p018K4927
8691D31878J2791p131k1210m345J6931L5059k5749K0372j3283K7910L2354k2388
8679D83189j2898J7057l6648j0693L639J209J7761m2891L2760O0511K5639n085
8667E33550p215j1712j2136r624k5633k4732O148j644q022M0707M2079p162m6429
$$ plain form
8754 348824 336423 352223 333069 330206 371763 359143 310648 308426 298913 312252 350315 372376
8742 372376 356336 351242 355930 331199 324624 382060 418301 409431 399996 401398 387501 395497 392989
8729 392989 449904 452443 448990 460771 479493 464758 451953 449022 443503 429498 431541 444633 442128
8716 442128 448813 480759 464434 447890 459026 439665 426206 452814 457452 438553 435236 470357
8704 470357 470793 408529 368661 388792 380142 374510 398001 383475 364854 393367 413969 406951 431878
8691 431878 444669 437538 416328 411983 428914 463973 438224 458596 445313 473223 505577 483189
8679 483189 470291 487348 450700 440007 443646 444855 462616 419725 452485 512996 538635 533550
8667 533550 526335 514623 502487 492863 467230 442498 448646 447002 438980 479687 521766 514604 468175
8654D68175j7543L5696J2065J8365O5087K9625K3940J2381k960J9315M1074K8143
8642G33363j5056l5742j9940j5297J5035k407j533j4563k2021L9520M4573R772
8630G15704j8969k3719N3208P0567P7940O4666L7261N5766M0996N4662M8229j7960
8618A158351O0765M6524M8496L579j2831j0347M6493L4369J2029k2018m1316l0745
8606A293349Q456M628p3678n0401j3239j7015o3291k9781J9922L2767p354P648
8594A112011m7088n3199r169q719k3742n803o0058r7481o2761k6698l1903k3394
8582F61996p0391l9022m8212k2937N837J5729R024m4987l3302k2163j1991J2393
8570D11974L560L1920N939j7857j0690j2961j0911J2210J2717L702J9346r556
$$ plain form
8654 468175 450632 486328 498393 516758 581845 611470 635410 647791 644831 664146 705220 733363
8642 733363 718307 682565 662625 647328 662363 659956 658423 643860 621839 661359 705932 715704
8630 715704 696735 673016 726224 796791 874731 939397 976658 1032424 1073420 1128082 1176311 1158351
8618 1158351 1219116 1265640 1314136 1317715 1304884 1294537 1341030 1375399 1387428 1365410 1324094 1293349
8606 1293349 1301805 1306433 1232755 1182354 1169115 1152100 1088809 1059028 1078950 1111717 1104363 1112011
8594 1112011 1064923 1011724 1002555 993836 970094 964291 904233 806752 743991 717293 685390 661996
8582 661996 591605 552583 504371 481434 487271 503000 512024 467037 433735 411572 399581 411974
8570 411974 415534 447454 453393 435536 424846 411885 400974 413184 425901 429603 448949 439393
8558D39393k1483O97J6037l3k9118k3559k0447J5597k9137R438N3360R067l0966
8545C88846K0087j63k3052k4665l667m041m7485k1552J4873m288j9813k6515J432
8532B49997L8750L849p323J1779L156J3232J4091N37p494K5627n112l8504k7068
8519B75517L2214n359l5850l593K3982P309r78k2608M7196L4920l8123l054j0851
8506C00722k1162q538K6004L1538J2369r001M0886j4235n0524n1049J1538N4236
8494C22784J0150l5712O450m854k0001n8191J1540K6232k4158Q80K6928R027L618
8481B74693k4854l9038L8397L6547j3598l7522j8829j4815K0021Q439J3159R013
8469B51613J0868m9091n406N725L5582l1263Q366J8116k0854r254j1662j0143
$$ plain form
8558 439393 417910 418607 434644 434611 405493 381934 361487 377084 347947 357385 410745 419812 388846
8545 388846 408933 408770 385718 361053 357386 353345 305860 284308 299181 294893 275080 248565 249997
8532 249997 288747 292596 285273 297052 300208 313440 327531 328068 320574 346201 341089 302585 275517
8519 275517 307731 302372 266522 262929 286911 294220 293242 270634 317830 352750 314627 311573 300722
8506 300722 279560 271022 297026 328564 340933 331932 372818 358583 308059 257010 268548 322784
8494 322784 332934 297222 303672 298818 278817 220626 232166 258398 234240 235120 262048 271075 274693
8481 274693 249839 210801 249198 285745 272147 234625 215796 200981 221002 229441 242600 251613
8469 251613 262481 213390 207984 213709 249291 218028 226394 244510 223656 214402 202740 192597
8457A92597K6462L4210K4916l7598O935J6424K0995K3996r961k9724q812k6890
8445B33550P948J8889j5531j9071j0972l641n3008k237L0018L5326N0593p45J1129
8432B82248J5867J3666l0272j7312K1320Q58K5975J6361j2888k5515l4130P197
8420B63375L991J1985o664k9709n916J2620K1627N889j4600K273K0931R865j0028
8407B85639k8298K3965J0944k507j4451J9074n2833k4544j2633O779j7416K5827
8395B19546m394l0949n981j324K9673o209P879J6793R849K7248m25L2482J9975
8382C14163l7140J5734J6057k8081q019N854j3779k243l0094M329J0753l3256
8370B14278n59J5022N411K3508L9902k6759k0015k250N723j5029l8252N676j9618
$$ plain form
8457 192597 219059 253269 278185 240587 247522 263946 284941 308937 298976 269252 260440 233550
8445 233550 241498 260387 244856 225785 214813 211172 158164 155927 185945 221271 271864 271119 282248
8432 282248 298115 311781 281509 264197 285517 286375 312350 328711 315823 290308 256178 263375
8420 263375 267366 279351 272687 242978 237062 249682 271309 277198 262598 264871 285802 295667 285639
8407 285639 257341 281306 292250 289743 275292 294366 241533 216989 204356 211135 193719 219546
8395 219546 215152 184203 178222 176898 206571 200362 208241 225034 234883 262131 261706 294188 314163
8382 314163 277023 292757 308814 280733 272714 278568 264789 262546 232452 236781 247534 214278
8370 214278 213719 228741 234152 257660 297562 270803 250788 248538 254261 239232 200980 206656 187038
8357A87038k3859K3028N232K0605j3567k8526j6039K7096L0332J955j7199J0727
8345B06823M0123J657M490j2005j2284l001l2416N1115N5045l6167l4147J1271
8333B40504j5625P864j1066K7523J2741P826l3837l250J3621p022m957l4996k0278
8320A79048J8940l44o340K7087J3847M74p136j8887j570m298m4037p231j7777
8307A31776K1763K2193K9004M1694p218k0564O132Q958j6110R193Q804K6695j3895
8294B48425j8821P277O238J6406l0253o648J9534j5173k4610o131J1610k536J249
8281B06567Q855q012m9539J8222L0562j5829J0957J0650j6415K894l7062o078
8269A55772K0708K4017K0871l6832K4028M0409J0171O663J8665M4935L5294L3847
$$ plain form
8357 187038 163179 186207 191439 212044 198477 169951 153912 181008 211340 213295 196096 206823
8345 206823 246946 248603 253093 241088 228804 225803 193387 244502 299547 263380 229233 240504
8333 240504 224879 232743 221677 249200 261941 269767 235930 232680 246301 239279 234322 199326 179048
8320 179048 197988 197644 191304 218391 232238 232712 225576 206689 205119 200821 156784 149553 131776
8307 131776 153539 175732 204736 246430 239212 218648 224780 233738 217628 226821 235625 262320 248425
8294 248425 229604 236881 243119 259525 229272 222624 242158 226985 202375 196244 207854 205318 206567
8281 206567 215422 207410 157871 176093 206655 190826 201783 212433 196018 198912 161850 155772
8269 155772 176480 200497 221368 184536 208564 248973 259144 265807 284472 329407 364701 398548
8257C98548k2629k6284l8572p561j078p7181m6038j1250p06l5772j3843J3530
8245A31164M3275J7907P079J6346R518j489m645J3447K2784Q919k47j3076m1964
8232B09018M225J5215k7864k1491L402J6297j2403j7347l935K0300L2291k3138
8220A94570j3050k1630m1123k085L1118J0079J8520M7099M019n636o35k9050k2215
8207A69981K8401J4857M454k2699k0216j038r92k1988O954j3519L7927L1483J1708
8194B25313k6359m0204J8953J1680j1390l7835j8566J0183M984L325J391J1057
8182A52532K7343K1132L864J0158m817q457j7141j7929K0013O980j0185p180r092
8169A67221j1976J9313J8197m530K1602J299J8229k2336N4522Q5963J36470J57747
$$ plain form
8257 398548 375919 349635 311063 303502 302424 225243 179205 167955 167249 131477 117634 131164
8245 131164 174439 192346 199425 215771 225289 223800 219155 232602 255386 264305 264058 250982 209018
8232 209018 213243 228458 200594 179103 182505 198802 186399 169052 165117 185417 217708 194570
8220 194570 181520 159890 118767 116682 147800 157879 176399 223498 227517 221881 221246 192196 169981
8207 169981 198382 213239 217693 194994 174778 173740 172748 150760 157714 144195 182122 213605 225313
8194 225313 198954 158750 177703 189383 177993 140158 121592 131775 136759 140084 141475 152532
8182 152532 179875 201007 204871 215029 210212 201755 184614 166685 186698 193678 183493 176313 167221
8169 167221 155245 174558 192755 188225 209827 211126 229355 207019 261541 347504 483974 641721
8157F41721J35958Q6512p067j00332j55918j23469q7089q8329n7610k8491L344
8146B19230K6821M793o13l5871m3760l6284P496K720L890j1912K061r195K4252
8133A53628J2380j1896K1734J6406O472N128l3888q082J642K2370L0903J5051
8121B31848L0004J3414L9814Q9264J47939J42735N6509M015q3511p8492r5359
8110D98180q8999o5107o6790m4341K619K1494l5365j6405R350K6326K9668j7128
8098B53502N7823J2848m6392l8046o8597j6622Q668K0130J8652J7435K8647j0820
8086B37228k6295n8952n2513j3310M3952l660M639R500n1413K0325N2143K3496
8074A85140J6253K1872k3054l5351L7629l095l6119m053K3958J7121J0649K0975
$$ plain form
8157 641721 777679 864191 857124 756792 600874 477405 390316 301987 244377 215886 219230
8146 219230 246051 250844 250231 214360 170600 134316 141812 144532 148422 136510 138571 129376 153628
8133 153628 166008 154112 175846 192252 198724 203852 169964 161882 163524 185894 216797 231848
8121 231848 261852 275266 315080 404344 552283 695018 751527 755542 672031 593539 498180
8110 498180 409181 344074 277284 232943 235562 257056 221691 205286 214636 240962 270630 253502
8098 253502 311325 324173 277781 239735 171138 154516 163184 183314 201966 219401 248048 237228
8086 237228 210933 151981 99468 86158 130110 126450 131089 140589 89176 109501 161644 185140
8074 185140 201393 223265 200211 164860 202489 199394 163275 159222 183180 200301 210950 231925
8062B31925j5443m3640K1423M5601J2077P913M0286N1354M7094K0358j8340k1365
8050C79243k6045K5937M1297N4266J2511L0469J5494k9290P504J4043j0603J1345
8038E26171J9821J9852J6367n287l2932p569j6044r077l3062R77M678k3998j4875
8025D45022j245k739R005K41j7086j0854L0553k0230L2995K1306j2121J0688N4385
8012E39920N1131M2675P6848J25265J89386J79798K29485K48910Q3805n8660j86308
8001A522255k20297j89756j46238r3645n6157P523P6462J42499J61638P4312j2045
7990A266551j34965j61884j40028j23001j17642o3703o861k9126l2300k8856k0674
7979D07511l9589l5967J1893J433K5289L4922N1009L1945L6384J2050R776r072
$$ plain form
8062 231925 216482 172842 194265 239866 251943 259856 300142 351496 398590 418948 400608 379243
8050 379243 353198 379135 420432 474698 487209 517678 533172 503882 511386 525429 514826 526171
8038 526171 545992 565844 582211 576924 543992 536423 520379 511302 478240 479217 483895 459897 445022
8025 445022 443777 441038 450043 450284 433198 422344 452897 432667 465662 486968 474847 485535 539920
8012 539920 591051 633726 710574 835839 1025225 1205023 1434508 1683418 1767223 1708563 1522255
8001 1522255 1301958 1112202 965964 872319 816162 823685 900147 1042646 1204284 1278596 1266551
7990 1266551 1131586 969702 829674 706673 589031 525328 518467 489341 457041 428185 407511
7979 407511 367922 331955 343848 345281 370570 405492 456501 488446 524830 536880 546656 537584
7967E37584K8420O4536R2637J15624J01980J08710R6279M5237K552m9011j04990
7956A039558j09400n3980o209K8743R6631R9273L0728j6874r5223j23462j47985
7945G41800j19707p2677n0945k5149l1832l2233n0667j8352k4779Q643j7718l8342
7933B68042l9933q540N5339K5093q750k5243Q231J7536N4128K3045L656N836M9284
7920D27724O7931N4404j2581P110q741m9925l4788k1047l8316l5306k3012P702
7908C41155M1698N816o6729o3978m4610j6121j8871l3481l7970J3983J7492K2091
7896A60475K9189j9837l8604j2110M4645M2458N64l6779k5502k7653j5410L2686
7884A34122K4857k4798l6974k2405l689J395K0653K1830J5301J5228O251J2758
$$ plain form
7967 537584 566004 630540 723177 838801 940781 1049491 1145770 1191007 1193559 1144548 1039558
7956 1039558 930158 876178 869969 898712 995343 1094616 1125344 1108470 1013247 889785 741800
7945 741800 622093 549416 498471 473322 441490 409257 358590 340238 315459 324102 306384 268042
7933 268042 228109 219569 274908 300001 291251 266008 274239 291775 345903 368948 372604 378440 427724
7920 427724 495655 550059 537478 544588 535847 485922 451134 430087 391771 356465 333453 341155
7908 341155 382853 388669 321940 257962 213352 197231 178360 144879 106909 120892 138384 160475
7896 160475 189664 169827 131223 119113 163758 206216 206780 170001 144499 116846 101436 134122
7884 134122 158979 134181 97207 74802 71113 72508 93161 114991 130292 145520 151771 164529
7872A64529O641J5382k7337l6258l0129m7791j8998j3098r577M1837M2906J8861
7860A06968J4846j674k7704P565L3198m9431k9697j5211J5092N655J0259J1482
7848H1348K97P044N388l1087n3733j2515O4176L0869l9215r486o011J8156k0747
7835C4484Q282L4498M183N399p288j9620J4707j2937n2345J1632L0810L9599K6392
7822A17796o988j5577k7394N973J6333l542k2820J4185K5155J1276j405j1567
7810A01425k2914K4801k441o7514j6041J4704M1256O4886l885k314j4401q028
7798A09534q059j0458j5853j0948L8365K9650q340o803J0480M817J5635N402l5092
7785A18330p952p176r329k5035j2579J3400L8318N113l69J9614M766k6547R258
$$ plain form
7872 164529 171170 186552 159215 122957 92828 45037 26039 12941 3364 45201 88107 106968
7860 106968 121814 120140 92436 100001 133199 83768 54071 38860 53952 59607 69866 81348
7848 81348 81645 88689 94077 62990 9257 -3258 60918 91787 52572 43086 37075 55231 34484
7835 34484 42766 77264 81447 86846 79558 59938 74645 61708 9363 20995 51805 91404 117796
7822 117796 110808 95231 67837 73810 90143 86601 63781 77966 103121 114397 112992 101425
7810 101425 78511 103312 100871 33357 17316 32020 73276 138162 134277 131963 117562 109534
7798 109534 101475 91017 75164 64216 102581 132231 123891 117088 127568 132385 148020 153422 118330
7785 118330 110378 103202 93873 68838 56259 69659 107977 113090 112721 132335 137101 110554 119812
7772A19812m8684l9872K2632N5821L0261j9677k9230j6239K7459J2168R128j5696
7760A07883O014R568k9003m1596j295K8084J9206j176k6745j0166K6000R044m8838
7747D6980k228r006K8424K2448p481J7525R575L832q619k2129m6479J277p020
7734B7099L1527L7722K4724j3793l0243L483j5128l6520J8142k880K1005Q007
7722G3145m1306O217K9030K9090K2905l849k6600K136K7395J4527l2992k135Q302
7709A05865j9528P147M02j729r589J7012K5593j7752j6230j6447L730k4020j7801
7696C6653m4463J1573L4718J0047K2188j131J3849r549j9580j5189K8023L4500
7684A01639m454J2084m619j7765J55J5379N4450j5806l2534k1611M201K0742J2327
$$ plain form
7772 119812 71128 31256 53888 109709 139970 120293 91063 74824 102283 114451 123579 107883
7760 107883 113897 123465 94462 52866 51571 79655 98861 97685 70940 60774 86774 95818 46980
7747 46980 44752 35746 64170 86618 79137 96662 106237 110069 101450 79321 32842 34119 27099
7734 27099 58626 96348 121072 107279 77036 80519 65391 28871 47013 44133 65138 73145
7722 73145 31839 38056 67086 96176 119081 115232 88632 90768 118163 132690 99698 97563 105865
7709 105865 86337 93484 93886 92157 82568 99580 125173 107421 91191 74744 78474 54454 36653
7696 36653 -7810 3763 38481 48528 70716 69585 83434 73885 54305 39116 67139 101639
7684 101639 97185 109269 104650 86885 87040 102419 156869 141063 108529 86918 91119 111861 124188
7671A24188K97k6477J1754L2832m4109k1530O496M1245M415l9222j3465J4537
7659I0961M356K5570o150r640K9028J3658k3701L828O199k2903P846l0304n5145
7646C3603p014j0961J7825N913J8066k2881k2896J5894K3782R009L172K041K9011
7633I4564L972N332k4718m051j2622l1989J098J37K7037J3086k6408J6328j3262
7620D8504R394q868k387L1982R27Q838k6992p390o155K5822P363k5605k4489k3171
7606G773P606J5667J6989L2104J1441l2354k4305M40J0985J5570K803K7805J0075
7593A02599J6022J458J855k3998m9738n0040L4551K2058j7744o262J1558P874
7581E0193q435J7608Q436K0971J8962J0149P27L609j8720J6673J578l146j081
$$ plain form
7671 124188 124485 98008 109762 142594 98485 76955 83451 124696 129111 89889 76424 90961
7659 90961 95317 120887 114737 105097 134125 147783 124082 127910 134109 111206 119052 88748 33603
7646 33603 26589 15628 33453 39366 57432 34551 11655 27549 51331 60340 63512 65553 94564
7633 94564 98536 103868 79150 75099 62477 30488 31586 31723 58760 71846 45438 61766 48504
7620 48504 57898 49030 46643 78625 79552 88390 61398 54008 47853 73675 81038 55433 30944 7773
7606 7773 15379 31046 48035 80139 91580 59226 34921 35361 46346 61916 64719 92524 102599
7593 102599 118621 120079 121934 97936 48198 -1842 32709 54767 37023 30761 42319 50193
7581 50193 41758 59366 67802 88773 107735 117884 118611 122220 103500 120173 121751 118605 117524
7568A17524k4439P005R598o2241j1002K3568M5859L987l7877l2963o276N036K577
7555D0356o837l9683J5247L1577K3812M7873K4016M415k8087k9800J1575K7427
7543A21891j2741K085j7002k2557J4910l4620n044k1717l0900R604K2887L2211
7531E9007O999l0237J598q762M647L7643P355j5893j9531p035J9854n80j1319
7518D3746J4468O747L0631n628j9699J7428j3070j7179J661J3393m116k0843m7597
7505e8o382K6454L1199O414r485K0158J7539o975l39j9648K3985K3413k0608k1066
7491F4601n23j7717K2460J0596L6911L0195m3005m5458n693L289m229J0371K9227
7478I1025K3154j2439k4737K730K1302k3104k849m2780k4987k433L3425O541n261
$$ plain form
7568 117524 93085 100090 109688 47447 36445 60013 105872 109859 71982 39019 32743 37779 40356
7555 40356 33519 -6164 9083 40660 64472 112345 136361 140776 112689 82889 94464 121891
7543 121891 109150 111235 94233 71676 86586 51966 46922 25205 -5695 3909 26796 59007
7531 59007 66006 35769 37367 28605 33252 70895 78250 62357 42826 35791 55645 55065 43746
7518 43746 58214 64961 95592 89964 70265 87693 74623 57444 59105 72498 68382 47539 -58
7505 -58 -6440 20014 51213 57627 48142 68300 85839 78864 78525 58877 82862 106275 85667 64601
7491 64601 64078 46361 68821 79417 116328 146523 103518 58060 52367 55656 51427 61798 91025
7478 91025 114179 101740 77003 79733 101035 77931 75082 32302 7315 4882 38307 44848 39587
7465C9587M7263K2659j282j2243l184k5997q905m0578n58L9029M1188R749l930
7452A02798n479p726k3960P098k7705K7940o583k5166L8079K5992j6498j8788
7440G0002j303j3002k100L8357k381R85J8524k0478m5237n86L7411j8132l4463
7427B7597j5065J9489n129N381l624J5152j426q387L923J8205K624J4958k7105
7414D6593J7130J6498l4062M626J7610J1135p865j2836K5938n672l1601R862K4216
7401H1572J3313J5495m1002l2503J4501J4535r047j5236K7794k5321j5397r42
7389B7762K4809K5012O158k7818k1496J8327J4913M842q356N172K6990r833Q419
7376I4901o444k9076R904L0183j7489n927P024J3163L7363j4613n9075k1073K878
$$ plain form
7465 39587 86850 109509 108227 95984 92800 66803 57898 17320 16762 55791 96979 106728 102798
7452 102798 97319 89593 65633 72731 45026 72966 66383 41217 79296 105288 88790 70002
7440 70002 68699 55697 53597 91954 89573 90558 109082 88604 43367 42781 80192 62060 27597
7427 27597 12532 32021 26892 32273 28649 43801 42375 33988 37911 56116 58740 73698 46593
7414 46593 63723 80221 46159 50785 68395 79530 71665 58829 84767 79095 47494 57356 81572
7401 81572 94885 110380 69378 36875 51376 65911 56864 41628 69422 44101 28704 27762
7389 27762 52571 77583 83741 55923 34427 52754 67667 72509 64153 69325 96315 86482 94901
7376 94901 88457 59381 69285 99468 81979 76052 83076 96239 133602 118989 59914 38841 41719
7363D1719J2235n741l9648k0084M2969L8303K2009k1869m4971L1038J1879n5984
7351A1855j6594K6389k1939j5500o704K5763J8366L8187K3435J4065m808l0670
7339F1845R761K7862K366n9683k9134M446O2585O022j9803j1949n3312R516L7410
7326D7932n686j2141k0775L4169L2728m133N582j1420k2443n9716m3350K1370
7314c7883J4565K7098o851K5461M8408N367m4167n930J6712J2702j3524l0501
7302A1457m1709j3067R900J2911K0014j2683J3899M6031O684j7142j6393K2830
7290D2732K6554j2698j9175M439p198r559O512j9164O116J4713o109j3122L9931
7277E3972P127k4316J8496K414m6657j4379K1290j44K5501O657j6122K2709J0475
$$ plain form
7363 41719 53954 48213 8565 -11519 31450 69753 91762 69893 24922 55960 67839 11855
7351 11855 -4739 21650 -289 -15789 -22493 3270 21636 59823 83258 97323 92515 61845
7339 61845 71606 99468 101834 42151 13017 17463 80048 86070 66267 54318 1006 10522 47932
7326 47932 42246 30105 9330 43499 76227 72094 77676 66256 43813 -15903 -59253 -37883
7314 -37883 -23318 3780 -3071 22390 70798 76165 31998 26068 42780 55482 41958 11457
7302 11457 -30252 -43319 -33419 -20508 -494 -13177 722 46753 53437 36295 19902 42732
7290 42732 69286 56588 37413 41852 34654 25095 31607 12443 18559 33272 27163 14041 53972
7277 53972 61099 36783 55279 57693 11036 -3343 17947 17803 43304 49961 33839 56548 67023
7264F7023j0540k6895P435O964J1599K547J1706J703r465m0012N072M66j0089
7251A7514q722k591M283J3469K0639Q418L945j1417J8155J8474q283k3831j5371
7238C4682l582N40O367K2555l3702J137K5715j7603j9738J1425J0873K0864l2759
7225B6774l5915J0994j187k1568J0087L0115K894N524M2636l3324k7543j0612
7213a125R40n350J588N26K0514K3602J3789k0369R392K9454j654l2458m2167k2519
7199b5837J2265L5422K1547j9977l8769K0072M5329K3511N144j2180j5070P37
7187E2194J0926L3800j8911k6572K848K17m4205k2897N414M267L7798M3406L3287
7174A11572m664k9000j5115l8065j360K1964J0494Q619O275m558j8127p511K9268
$$ plain form
7264 67023 56483 29588 37023 43987 55586 58133 69839 71542 62077 22065 27137 27603 17514
7251 17514 8792 6201 10484 23953 44592 53010 56955 45538 63693 82167 73884 50053 34682
7238 34682 31100 31640 38007 60562 26860 27997 53712 36109 16371 27796 38669 59533 26774
7225 26774 -9141 1853 666 -20902 -10815 19300 22194 27718 70354 37030 9487 -1125
7213 -1125 -185 -5535 -3947 -3421 17093 40695 54484 34115 43507 72961 71307 38849 -3318 -25837
7199 -25837 -13572 21850 43397 23420 -15349 4723 50052 73563 78707 66527 51457 52194
7187 52194 63120 96920 78009 51437 54285 54502 10297 -12600 -7186 -2919 34879 78285 111572
7174 111572 106908 77908 62793 24728 23368 45332 55826 64445 70720 66162 48035 40524 69792
7161F9792j8342o5096o4380j3189M5148N2340J1479k16j5678L0712j3578P160
7149B6152J6396L8093k6947n895L3199m3751k6497J29o11N368K1411J9071J1491
7136F7609o767k0633l0943M9247l231n5310k8674K5771J8798K8787J0392O453
7124F1499j7389l2305p580j9803K5165K4178J1193J4185j1149k1715L126j9446
7112I959k5513Q975L7859M1932j1839m6814j234K8013L5826j105k7485k8266k2802
7099b494K658k3694J8443O4415J6179k2025Q448n705j6071k497K283R987K6521
7086G6448j5542j4869r662k029j484m9485J915K2392P107P752K5802J0200k4910
7073C3635K3562J8097M807J0036j0141m5338J152k8882j0791J4213N2812j4577
$$ plain form
7161 69792 51450 -13646 -78026 -91215 -46067 6273 17752 17536 1858 32570 18992 26152
7149 26152 42548 80641 53694 47799 80998 37247 10750 10879 10268 15636 37047 56118 67609
7136 67609 60842 40209 9266 58513 55282 -28 -28702 -2931 15867 44654 55046 61499
7124 61499 44110 11805 4225 -15578 9587 33765 44958 59143 47994 26279 29405 9959
7112 9959 -15554 -6579 31280 73212 61373 14559 13325 41338 77164 76059 48574 20308 -2494
7099 -2494 164 -23530 -5087 59328 75507 53482 61930 56225 40154 37657 39940 49927 76448
7086 76448 60906 46037 36375 34346 32862 -16623 -14708 7684 14791 22543 48345 58545 33635
7073 33635 57197 75294 80101 90137 79996 34658 35810 6928 -3863 10350 63162 48585
7061D8585m1528k5802L0029j1825J5586j5331k0603P99J7438j9882M1858K1708
7049D1032n316k6573q500q500O107K5029J2071r872l0256K3670j0699j1225q842
7036a1874l498M6812M0611N80k6212j2872n5394K5940L9872q129l3651O235o069
7023B351J5707J4719k9113r521j41j4109J2765K0396J0485j9401p812o238j3073
7010b2985J0462J3327L0658j0567j9818N2426K1612K0214J2232o0776o0070N968
6998g317L9206K6088o0526n5819r609M4001L9584L6378k3185K1781k874k0875
6986B6833k2061k6185K925j0249K9813K6100k1322k5377j3506l9905m4930J2349
6974a05515P8176K8041l417l5533l623L7446N1265k2677j4423J8699J6233k4237
$$ plain form
7061 48585 7057 -18745 11284 -541 15045 -286 -20889 -20090 -2652 -22534 19324 41032
7049 41032 35716 9143 643 -7857 -1750 23279 35350 25478 -4778 18892 8193 -3032 -11874
7036 -11874 -15372 31440 72051 72631 46419 33547 -21847 4093 43965 35836 2185 8420 2351
7023 2351 18058 32777 3664 -5857 -5998 -20107 -7342 13054 23539 4138 -3674 -9912 -22985
7010 -22985 -12523 804 31462 20895 1077 53503 75115 95329 107561 46785 -13285 -7317
6998 -7317 31889 57977 -2549 -58368 -67977 -23976 15608 51986 28801 50582 47708 26833
6986 26833 4772 -21413 -18488 -28737 1076 27176 5854 -19523 -33029 -72934 -117864 -105515
6974 -105515 -27339 702 -2715 -38248 -41871 -4425 46840 24163 9740 28439 44672 20435
6962B0435l1679r730M255L5Q619K5110K4006l2344J8454K7809j4482J0039j5186
6949C5341j7302J999j8044j7149J3060L0170L06n700l3409j1187M667K6531j5506
6936f223Q033M7529N7318k3819j3815k9570l8745j6529m8668Q675Q5720J9630
6924D9536j6500l1519j612L6276M457l1047M625k4586N593J5505k8064m7404k6450
6911i1190n657N671L3042J3384K6635J4065k7198j5109J4090r953M5389J6954
6899B0123j9707J4147o3891R645K5525J0501j1074m06R931l5783K6854L158J8083
6886G106N3486L1668l5568l4109m342J445j5470o950L2044L9672p910j5568l7584
6873G920O374o880l5650m0872M0561N1161L688j3355L517Q537P640j2526q285
$$ plain form
6962 20435 -11244 -20974 -16719 -16684 -8065 17045 41051 8707 27161 54970 40488 50527 35341
6949 35341 18039 20038 1994 -15155 -2095 28075 28381 22681 -10728 -21915 -17248 9283 -6223
6936 -6223 1810 49339 106657 82838 69023 39453 708 -15821 -64489 -55814 29906 49536
6924 49536 33036 1517 -95 36181 40638 9591 14216 -10370 -4777 10728 -17336 -64740 -91190
6911 -91190 -96847 -91176 -58134 -44750 -18115 -4050 -31248 -46357 -32267 -42220 3169 20123
6899 20123 416 14563 -49328 -39683 -14158 -3657 -14731 -15137 -5206 -40989 -14135 -10977 7106
6886 7106 60592 92260 56692 22583 18241 19686 4216 -2734 29310 68982 61072 45504 7920
6873 7920 14294 7414 -28236 -69108 -28547 22614 26302 12947 16464 25001 32641 20115 11830
6860A1830K1503J4794L6849o279k3293J2436j9721j8264m1685K4845j5451l4730
6848c7166j4653K5016m442L223K0640R58j0760j6983R110P333L6150p813J1458
6835B2071l156L3087O6322n974l2857k3161J5612L91L868o8172k6118k7532J2675
6822c2944K7585L6564j880P637N078j4369P881n055J4808l139n827k8838J2743
6809B0244J9422L8610J568j9955n766P468K1593k4918l1482k5909n995l5581j546
6796d2247N7624M4059m0856J0103J7461K547k9451j0992L5598j944J9329J11m4994
6783A6348R792J8938j3932J3481j6514l4333q605J7183L62J1855J3138N601K6038
6770E9352j1457l7262k6449m545j1248l4276K1283J2712p148L4996L743M996L9258
$$ plain form
6860 11830 33333 48127 84976 78697 55404 67840 48119 29855 -11830 13015 -2436 -37166
6848 -37166 -51819 -26803 -31245 -28022 -7382 -6424 -17184 -34167 -25057 -17724 18426 10613 22071
6835 22071 18915 52002 118324 112350 79493 56332 71944 72335 76203 8031 -18087 -45619 -32944
6822 -32944 -5359 31205 29325 36962 42040 27671 35552 30497 45305 42166 36339 7501 20244
6809 20244 39666 78276 79844 59889 54123 61591 83184 58266 26784 875 -5120 -40701 -42247
6796 -42247 15377 59436 18580 28683 46144 48691 19240 8248 43846 41902 61231 61342 16348
6783 16348 26140 45078 31146 44627 28113 -6220 -14825 2358 2720 14575 27713 33314 59352
6770 59352 47895 10633 -15816 -20361 -31609 -65885 -44602 -31890 -39038 -4042 -299 4697 43955
6757D3955j675m5938o773J6746J3454M168J1327j0456o336Q69J2583k46j2744
6744A8934l0187L8452P054l892k7843M8595Q985j4819o815k4505j0003J0333K5935
6731D0224l985p645k1298j3505k6254J0809M3403L2001L4681R784j8403R971K2638
6718A12421M919j3001K25O825p643m1369l5123J5679N110K4638j7286k8212J3788
6705D0971K4094M693j5844l3587L0054K3360l7539k9540k1810K0918M2468O1818
6693A10056Q020k173l410P10k5961k9823K901j8662k9322J5158N3655J308O664
6680H9121j5212k8433l2453J4696Q137J4505N9227K297m3175l6745j0204p161
6668A4600J3487l3470J9839K7400q632m471K1006J8909n8586P966K1454K795k1917
$$ plain form
6757 43955 42280 -3658 -10431 6315 19769 23937 35264 24808 18472 19341 31924 31678 18934
6744 18934 -11253 27199 34253 30361 2518 51113 60098 45279 38464 13959 3956 14289 40224
6731 40224 36239 28594 7296 -6209 -32463 -21654 21749 53750 88431 98215 79812 89783 112421
6718 112421 117340 104339 104564 111389 103746 62377 27254 42933 48043 72681 55395 27183 40971
6705 40971 65065 69758 53914 20327 50381 73741 36202 6662 -15148 5770 48238 110056
6693 110056 118076 115903 112493 113203 87242 57419 60320 41658 12336 27494 81149 82457 89121
6680 89121 73909 45476 13023 27719 35856 50361 109588 111885 68710 31965 21761 14600
6668 14600 28087 -5383 14456 41856 33224 28753 49759 68668 10082 18048 39502 42297 20380
6655B0380K003J2114l6717j7268J922J7847L989M535J4849N967Q571L8199j6578
6642E9813m6002M968K3080O722k7458L052K6778n414k6213n341K6084J6396k4191
6629C2274j4750O4129r139j9123k2644j7276k0011M36J7901K5551m1065k3974
6617b7691K5640J05o341j7116J1499K690L534J9963n812K4473p966J3226k4991
6604A1213l568K7007J0958j0790J2555k5933K645J2127l3550K454K3026K5763
6592E3907L3948j533l3476k0053r853j5437K8560J2658K588q064j7266k5798l3164
6579c2983J1068P411J4499R746K3330L4901j3938l352J0990Q928N027j5092k9203
6566C1332l9114m2503J2797L3414N2709N6281j2526m8646n171J8276j8198n284
$$ plain form
6655 20380 22383 34497 -2220 -19488 -17566 281 4270 8805 23654 29621 38192 76391 59813
6642 59813 13811 18779 41859 48581 21123 24175 50953 45539 19326 13985 40069 56465 32274
6629 32274 17524 81653 72514 53391 30747 13471 -6540 -6104 11797 37348 -3717 -27691
6617 -27691 -2051 -1946 -8287 -25403 -13904 -11214 -7680 12283 6471 30944 22978 36204 11213
6604 11213 7645 34652 45610 34820 47375 21442 24087 36214 2664 5118 28144 53907
6592 53907 87855 86322 52846 32793 22940 7503 36063 48721 51309 43245 25979 181 -32983
6579 -32983 -21915 -14504 -5 9741 33071 67972 54034 50682 61672 70600 75627 60535 31332
6566 31332 -7782 -50285 -37488 -4074 48635 104916 92390 43744 38573 56849 38651 33367
6554C3367M3679K3857l8626m3493L0010k8769j5811M5447K8079m4816N56J3458
6542D6938k797J411N976j6685k8572J7019n809J0885L7068m943k3782R449j3485
6529C2673l0372j0035J8170l7141J833N5981J7765J8290O332l7688L1128J7186
6517H4122m8559j5624J0274Q033k2003K4890K026k6307N3445k2765k4965k5465
6505b898O475K5406L4257K2686J7169k5109j8424l175j526O076k9780r750k943
6492A8464M2778j73k3084J3403q780j5569K7683m195l487k1846j1817M180j4459
6479C098j94j7079k0346l0114N261r45N2374K0286k4501K9438J7205J9135L2969
6466H6587j3598P38j6290K499j9826m6031K447J0430m416k6616K585L5698J2920
$$ plain form
6554 33367 77046 100903 62277 18784 48794 20025 4214 49661 77740 32924 33480 46938
6542 46938 44141 45552 51528 34843 6271 23290 17481 28366 65434 60491 36709 46158 32673
6529 32673 2301 -7734 10436 -26705 -24872 31109 48874 67164 73496 35808 66936 84122
6517 84122 35563 19939 30213 38246 16243 41133 43159 16852 70297 47532 22567 -2898
6505 -2898 3577 28983 63240 85926 103095 77986 59562 56387 54861 60937 31157 21407 18464
6492 18464 61242 61069 37985 51388 42608 27039 54722 50527 47040 25194 13377 17557 3098
6479 3098 2904 -14175 -34521 -64635 -59374 -60319 -7945 12341 -12160 17278 34483 53618 86587
6466 86587 72989 73727 57437 59936 40110 -5921 -3474 6956 2540 -24076 -21491 14207 27127
6453B7127j2342j1962k8160n48J7566M81L6361k3812q644Q248j2051j7719M425
6440b1030L577O2214k9888n5190M1186N2134K7924K9532o6019l8424k2924Q438
6428h470K701k0489N6889N9308j6132k3587R006J2732p264J8533p821k2648K1787
6415G4545P669m0096k3014J4072k5492k2328Q627n524j1499Q047n243K5134j0775
6402e877m1771J3898j7883K295K6908J5922O120j08m1623K487J8146J9840K0742
6389A9096k1375L417J9451k4121j6510K3992J9648k8981J1922L482J7077K4007
6377E1105L2419L1514l7265n4386Q50K600r818m1988Q244J4444J0867L9150L846
6364E1582l4282o1N192k8969J9763J5931m7312J0878J93J9018P975J4790M5246
$$ plain form
6453 27127 14785 2823 -25337 -25885 -8319 -7838 28523 4711 -3933 4315 -7736 -25455 -21030
6440 -21030 -17453 44761 14873 -40317 869 53003 80927 110459 44440 6016 -16908 -8470
6428 -8470 -5769 -26258 30631 89939 73807 50220 59226 71958 64694 83227 75406 52758 74545
6415 74545 82214 42118 19104 33176 7684 -14644 -6017 -11541 -23040 -14993 -20236 4898 -5877
6402 -5877 -47648 -33750 -51633 -49338 -22430 -6508 -388 -496 -42119 -39632 -21486 -1646 19096
6389 19096 -2279 1138 20589 -3532 -20042 3950 23598 -5383 6539 10021 27098 51105
6377 51105 83524 115038 77773 23387 24237 26837 17019 -24969 -16725 -2281 8586 47736 51582
6364 51582 17300 17239 22431 -6538 13225 29156 -18156 -7278 -7085 11933 19908 34698 79944
6351G9944Q423k8741k4430J4550o598K681m4718l2852L3946N854k2549R79L6319
6338B2808Q091Q236j5641j0328r814L152O735k4297k3099L1251M7743O38j7095
6325B8380L0615l3640k7401K0436K7889L466l234n8261l450L2011M676J8459R138
6312D9084j710l8840l0485j931j0478k0245k6626J4452K0709r335k8454J3451
6300g0408N268L0333N1115m949j9925q492o758J4981J9678j238J6448k1727m0487
6287c6161J687K7116l124l7693J8183j777J6836N5918J0880l7593k0979n912J2384
6274b35N2296p120P109K7969O652m5353l7344j8769L3004j492j7104J4787j4895
6261d95l28L9573j8390k3825j5387J5731K7081J1157J3523J5982l7022k0284j7858
$$ plain form
6351 79944 88367 59626 35196 49746 43148 45829 1111 -31741 2205 8059 -14490 -13511 22808
6338 22808 30899 39135 23494 13166 3352 6504 13239 -11058 -34157 -2906 44837 45475 28380
6325 28380 58995 25355 -2046 18390 46279 49745 46511 -11750 -15200 16811 21487 39946 49084
6312 49084 47374 8534 -21951 -23882 -34360 -54605 -81231 -66779 -46070 -55405 -83859 -70408
6300 -70408 -65140 -34807 16308 11359 -8566 -17058 -23816 -8835 10843 9605 26053 4326 -36161
6287 -36161 -34474 -7358 -10482 -48175 -29992 -31769 -14933 40985 51865 14272 -6707 -12619 -235
6274 -235 52061 44941 52050 80019 86671 41318 3974 -14795 18209 16717 -387 14400 -495
6261 -495 -823 38750 20360 -3465 -18852 -3121 23960 35117 48640 64622 27600 7316 -10542
6248a0542j9183j2315J0588J9809j1639L1701L32J8847m708j3233j5034q805p024
6235b1206L3795K5238k0796k3785J6232j2487j2710J6092r661k387K425l661n540
6222a8451j0092j0419J3606J4928M6299P141l314j6927l0812J822J2050J4344
6210B0175L191N505j4836J7490j161K1531J6485k4899n0738m0520k8678K779K4402
6197d9274L9339K9222l2621J4031l067J0360K2300k5849J4077O965j7542J1071
6185A9012R998K507j8683j3970k6827j212K5965K6386j1551j4707Q103p541k7174
6172b9694m356L8142K4976J0327L178m057r761r577K7471J2892j7793j2545J4167
6159D3370L2988L539K273j2685l6858p736M3544j8623J1385j5160k3437J3016
$$ plain form
6248 -10542 -29725 -42040 -31452 -11643 -23282 8419 8751 27598 22890 9657 -5377 -14182 -21206
6235 -21206 12589 37827 17031 -6754 9478 -3009 -15719 373 -9288 -11675 -9250 -12911 -18451
6222 -18451 -28543 -38962 -25356 -10428 35871 43012 39698 22771 -8041 -6219 5831 20175
6210 20175 23366 28871 14035 31525 30364 51895 68380 43481 -7257 -47777 -76455 -73676 -49274
6197 -49274 -9935 19287 -13334 697 -2370 7990 30290 4441 18518 25483 7941 19012
6185 19012 29010 31517 12834 -1136 -27963 -29175 -3210 23176 11625 -3082 5021 -2520 -29694
6172 -29694 -34050 4092 29068 39395 42573 38516 28755 19178 46649 59541 41748 29203 43370
6159 43370 76358 79897 82170 69485 32627 24891 68435 49812 61197 46037 22600 35616
6147C5616K3795m739l0826P623N31K749K3214j8088n0053j1416J9388o892l8718
6134d7816J9565L7665j7462j3664P672l4246j204J21J8315k6492L353L740j5334
6121f5787K0338J0719l1298k6837l3462K6326J0937K4992N4089K9822j1779k4490
6109a6430l900r960J0102M8002J9621N922o1178j4577N3515M6686k7285n8701
6097h183j0359q887L4989K7649l7328l9602J8486L0727M6795J9436L7009k3123
6085H7609m7145k4912J0348J4128o848l3254l5132K6440J3281k2229J5908j7337
6073a9143l821K2032L2139j0830m1349N031P0375J3549p793k4159k6272j0305
6061e46K3147L242q043R97n0019m4108N841L7008K9441k1938j2402N6630L9657
$$ plain form
6147 35616 59411 54672 23846 31469 32000 34749 57963 39875 -10178 -21594 -2206 -9098 -47816
6134 -47816 -28251 9414 -8048 -21712 -14040 -48286 -49490 -49369 -31054 -57546 -54193 -50453 -65787
6121 -65787 -45449 -34730 -66028 -92865 -126327 -100001 -89064 -64072 -9983 19839 8060 -16430
6109 -16430 -20330 -30290 -20188 27814 47435 53357 -7821 -22398 31117 77803 50518 -8183
6097 -8183 -18542 -27429 7560 35209 -2119 -41721 -23235 7492 54287 73723 110732 87609
6085 87609 40464 15552 25900 40028 33180 -74 -35206 -8766 4515 -17714 -1806 -19143
6073 -19143 -22964 -932 31207 20377 -20972 -15941 54434 67983 60190 36031 9759 -546
6061 -546 22601 25843 17800 18797 -31222 -75330 -69489 -32481 -3040 -24978 -37380 19250 58907
6048E8907j3098k6870K707k385k1718k1031J8173n95K1522K2755p970l4529l0203
6035c4335K2989L535j2129k856K5569P480j4858j6249J0511K7389l5754J4735
6023c973M8783P279m1059j125K2628J7617k4009k8857k8764p505j5863P0559K1030
6010C6741j0772l6596r780j5085O982L8417K9313k711k9701k926K7470q773p757
5997A4822q888j2161j784O889K839j1788m539K5580k136j0725J7486M1495J4479
5984G1569j54l5669n1448N182M7935J2683L2476J764k8127j0010n663m0333q499
5971h294o61J6628L3163J5335J0634m966l4397N846j0144K3733L352Q222k0952
5958C7499L6146L0536m9935j2415j3371O038j0922M79Q789j2581l2767k630O138
$$ plain form
6048 58907 45809 18939 21646 19261 -2457 -23488 -5315 -5910 15612 38367 30397 -4132 -34335
6035 -34335 -11346 -7811 -19940 -22796 2773 10253 -4605 -20854 -10343 17046 -18708 -3973
6023 -3973 44810 52089 11030 9905 32533 50150 26141 -2716 -31480 -38985 -54848 15711 36741
6010 36741 25969 -10627 -20407 -35492 -28510 9907 39220 36509 6808 3882 31352 22579 14822
5997 14822 5934 -6227 -8011 -1122 1717 -10071 -14610 10970 8834 -1891 15595 57090 71569
5984 71569 71415 35746 -15702 -10520 37415 50098 82574 84338 56211 46201 40538 205 -8294
5971 -8294 -8955 7673 40836 56171 66805 61839 27442 33288 23144 46877 50229 58451 37499
5958 37499 73645 104181 54246 41831 28460 34498 23576 24055 32844 20263 -12504 -15134 -8996
5945h996K4951M95l0485j5324k8328l581l2340M990K2342N2461J0553j9971k2544
5932d5777k0653k616m1405o843L4157J5334M8536J3949j716N69K3499k7254l8117
5919d8337p550L3931J8822k1167K3950N453k1530k993r425j4271J4355J1283m728
5906b2207j2180K1013K3006J6891j2738P42L4664K7789J8516k8394l9213j826
5894B6063j6993l1124j1442O892K52M759l082L77j9105l043M8171K4238j3277
5881A2686m1600K587M6j9662p878J5196K3810M356L0246Q605j9290k887K9636
5868C5851O862k9481l9416j0844k0295J5297K4933m6203J504K7819L2207K2018
5856B0252N809m6019k1391j9380l4344M4635K8094J9038K668K6945P974l654J0179
$$ plain form
5945 -8996 15955 16450 -14035 -29359 -57687 -61268 -93608 -88618 -66276 -13815 -3262 -23233 -45777
5932 -45777 -66430 -69046 -110451 -117294 -83137 -67803 -19267 -5318 -7034 -6465 17034 -10220 -48337
5919 -48337 -55887 -21956 -3134 -24301 -351 5102 -16428 -19421 -28846 -43117 -28762 -17479 -22207
5906 -22207 -34387 -13374 9632 26523 13785 14527 49191 76980 95496 67102 27889 26063
5894 26063 9070 -22054 -33496 -26604 -26352 -21593 -24675 -24298 -43403 -46446 1725 25963 12686
5881 12686 -28914 -26327 -26281 -45943 -53821 -38625 -14815 -10459 19787 28392 9102 6215 35851
5868 35851 42713 13232 -26184 -37028 -57323 -42026 -17093 -63296 -61792 -33973 -1766 20252
5856 20252 26061 -19958 -41349 -60729 -95073 -50438 -22344 -3306 -638 26307 34281 30627 40806
5843D0806K2416r482j088k2963n875p333k742l515j1617l3915n162L8626M789
5830B945m1951k2539o607K4035j2491K9513l049j8480m557J4536J0629J6869J1513
5817C66q049j3938K2866J707n0947J5977K9469Q911k765k2371K0727o317J4013
5804I649J5978k7141K041j0102M1044M5373J1734k0962k2785o5676n9414L1952
5792d8309K9645O379o413j6857J7071J5576l457J891k3317J954J2785K6454p827
5779E575k3620k8339K263J1424N857j8045r168M024M215K040J1571J1607N183
5766a5413k3797K3643J5699l761l7677k704L3949K077j8192M1186K5937j519m3442
5753d014k1477j3211K0400R374K3603K7487l6607m4487j284K8669J2562k140j3442
$$ plain form
5843 40806 63222 53740 52652 29689 23814 16481 13739 10224 -1393 -35308 -40470 -1844 2945
5830 2945 -39006 -61545 -68152 -44117 -56608 -27095 -30144 -48624 -53181 -38645 -28016 -11147 366
5817 366 -7683 -21621 1245 2952 -47995 -32018 -2549 6362 3597 -18774 1953 -4364 9649
5804 9649 25627 -1514 527 -9575 31469 76842 88576 67614 44829 -20847 -80261 -48309
5792 -48309 -18664 -12285 -18698 -35555 -18484 -2908 -6365 -4474 -27791 -25837 -13052 13402 5575
5779 5575 -18045 -46384 -44121 -32697 -26840 -44885 -54053 -50029 -45814 -43774 -32203 -20596 -15413
5766 -15413 -39210 -15567 132 -3629 -41306 -44010 -10061 -7984 -26176 15010 40947 39428 -4014
5753 -4014 -25491 -38702 -18302 -8928 14675 42162 5555 -38932 -40216 -11547 1015 -1125 -14567
5740a4567j3522M3230J595k7423O004j8585J2823q60L3907L0538L954P2m1686
5727A5480k2787j2326Q790K2914K7542J0531j387r897l7259j6008j667n198R647
5714a1625l207q455M8749J1520k7273l4211k7783p869L3353j6616k8047J0900
5702f0564k813k417N897N1192M858J3372O354J8774q523k5204K709l0369N811
5689b0923K5066m156j541j1890P77L1145K6234k775O240j3581l5222j3733J8019
5676C660J7875l1985j1375n521M5709L5814K9629p519m3925n5663n2375q475M0794
5663d3357M811q014L9062M952r933k6141J0974J2717N359l865Q765P624R852j3662
5649h56n522k3382k8322J8706J5740k8185M344L2860J7109l0820l4582J335M1580
$$ plain form
5740 -14567 -28089 15141 16736 -10687 -4683 -23268 -10445 -11305 22602 53140 57094 57166 15480
5727 15480 -7307 -19633 -10843 12071 39613 50144 48757 38860 1601 -14407 -16074 -21272 -11625
5714 -11625 -14832 -23287 25462 36982 9709 -24502 -52285 -60154 -26801 -43417 -71464 -60564
5702 -60564 -63377 -65794 -59897 -8705 -3847 9525 15879 34653 26130 926 3635 -26734 -20923
5689 -20923 4143 -13 -1554 -13444 -12667 18478 44712 41937 48177 34596 -626 -14359 3660
5676 3660 21535 -10450 -21825 -27346 18363 54177 83806 76287 32362 -23301 -75676 -84151 -43357
5663 -43357 -38546 -46560 -7498 -2546 -12479 -38620 -27646 -14929 -9570 -13435 -4670 2954 12806 -856
5649 -856 -6378 -29760 -58082 -39376 -23636 -51821 -47477 -14617 2492 -28328 -62910 -61575 -19995
5636a9995K0657P638l5374K2693P624j9533J4453K9697j4829o099j0580J186r409
5623a1871j8571J128J3133O587l489O461K910j597r476J7723J3943K1139J0556
5610D8576k3148p8843o3940J2969N5421r297K5109K6348l6805l837L2929J0184
5598d334j5200J9102R698k9337J8188L0399k9203r374k1978j1134P221Q352M4179
5585A6579k7544m9629J2264M2640K0329L3043P069k0906O091J5306k3732l2214
5573g04J1658J4346k8980l3246L5574L1543l7912j9478N1882J4844l0476K9609
5561C8660O279o6327J8908K2973k5043j8641M628K459l6782K972J9526J6359o252
5548b0281J5763k767j4504j9878R189L6808J6617J2313J1527l1502r314l0567
$$ plain form
5636 -19995 662 8300 -27074 -4381 3243 -16290 -1837 27860 13031 6932 -3648 -2462 -11871
5623 -11871 -30442 -29314 -16181 -9594 -13083 -6622 -3712 -5309 -14785 2938 16881 38020 48576
5610 48576 25428 -53415 -117355 -104386 -48965 -58262 -33153 -6805 -43610 -47447 -14518 -4334
5598 -4334 -19534 -432 9266 -20071 -1883 28516 -687 -10061 -32039 -43173 -35952 -27600 16579
5585 16579 -10965 -60594 -48330 -5690 14639 47682 54751 33845 39936 55242 31510 -704
5573 -704 10954 25300 -3680 -36926 -1352 30191 -7721 -27199 24683 39527 9051 38660
5561 38660 44939 -21388 -2480 20493 -4550 -23191 -18563 -16104 -52886 -49914 -30388 -14029 -20281
5548 -20281 -4518 -7285 -21789 -41667 -32478 4330 20947 33260 44787 13285 3971 -26596
5536b6596P071l1570k0308L4274N9294L3579K937k1174l5386N494L4966j2565
5524C0016K2378l6787K2384N842O924L486N815l7396k5447N290l353k1039J2135
5511i752o109L274K570K9351j582k8908J7629q991R996K6607L767k3956K0294
5498C4190m1155m3897j0125M161J6375J2057K1131L7603j0469l6567p211j2912
5486c6819N82l528j4682k3056k0102J7437J2584p034q656M2364K6077K6433K4614
5473C6214J926m0969j3527o157j1365J4155J6762j2321k4199M7405j7935k4160
5461c4171l319L5126p21k5201j2356j405K2577L4731k316l4598j6009j086l2548
5448g1296J4114K0266Q123k4043P818K234k8048k6821N3440J9945K36K7239J0926
$$ plain form
5536 -26596 -19525 -51095 -71403 -37129 22165 55744 58681 37507 2121 7615 42581 30016
5524 30016 52394 15607 37991 43833 50757 54243 60058 22662 -2785 2505 -848 -21887 -9752
5511 -9752 -15861 -12587 -10017 19334 17752 -11156 6473 -2518 7478 34085 37852 13896 34190
5498 34190 -6965 -50862 -60987 -56826 -40451 -28394 -7263 30340 19871 -16696 -23907 -36819
5486 -36819 -36237 -39765 -54447 -77503 -97605 -80168 -67584 -74618 -83274 -40910 -14833 11600 36214
5473 36214 38140 -2829 -16356 -22513 -33878 -19723 -2961 -15282 -39481 7924 -10011 -34171
5461 -34171 -37490 -2364 -3085 -28286 -40642 -42047 -19470 15261 12945 -21653 -37662 -38748 -71296
5448 -71296 -57182 -36916 -28793 -52836 -45018 -42784 -70832 -97653 -44213 -24268 -24032 3207 14133
5435A4133J9776J0330l0269k5369m982L1879J988J4211O384j6727m666k1393l1657
5422c6362M6259M0872K8130l0742n9377k8250L4466J9846j4600m3610L705M298
5410c5365r206j5570J7165L3041K0365j5567l7326K5234M4848m0905k7643J4181
5398b6748L5411O540k1399l767J1002J0058M901j2008j1090j7999J0026O685j9836
5385b8224j5505m529o99l5383l7251L3395M1463K8964l3218K8438N4883k0394
5373A1940l2097l7848J4782K5952J9271j748M900O607J5429J6717j4142k2788
5361F975l1450l5013n07J6512J4833J1122j311o6027n6237J4224K1973M2294L4954
5348b7658J7599l5022j3903K1940n481J2687j6237J3342J2612k672m656K3592
$$ plain form
5435 14133 33909 44239 13970 -11399 -16381 15498 17486 31697 38081 21354 16688 -4705 -36362
5422 -36362 9897 50769 78899 48157 -11220 -39470 -5004 14842 242 -43368 -39663 -35365
5410 -35365 -44571 -60141 -42976 -9935 10430 -5137 -42463 -17229 27619 -13286 -40929 -26748
5398 -26748 8663 15203 -6196 -9963 1039 11097 15998 3990 -7100 -25099 -15073 -8388 -28224
5385 -28224 -43729 -48258 -48957 -84340 -121591 -88196 -46733 -17769 -50987 -22549 32334 11940
5373 11940 -20157 -58005 -43223 -17271 2000 252 5152 11759 27188 43905 29763 6975
5361 6975 -24475 -59488 -59995 -43483 -28650 -17528 -18839 -84866 -141103 -126879 -104906 -62612 -27658
5348 -27658 -10059 -45081 -58984 -37044 -42525 -29838 -46075 -32733 -20121 -22793 -27449 -3857
5336c857R059k0828l8051l0692R409J4095J9527r365Q302L7131J7745k6557R813
5323d269R173R992n608m3622O171L2102N164m0336k6777j0392l477L1767O912
5310c3200K6581J9893J7607j8479k8137k8558j9260l4300L3785M4856L5974K3480
5298D0242J6621k950k074k2368k0865k5167L466m499N444N927l977M1018j1328
5285A9490m1781Q296k020K4542o07j6551J362j3959J7179K2292j7758q704l5537
5272d3756j7341J8832K0335K6771j0247J4828k660K2732k819k2060k4127m0321
5260e9833K0838J2639Q795j8085m5238j0852P0581K6026m0592N26J2643L1535
5248H983m5432m689L2335K5784j174L8855L513k6579J3502j5506O552k2096k9211
$$ plain form
5336 -3857 5202 -15626 -53677 -84369 -74960 -60865 -41338 -50703 -42401 -5270 12475 -14082 -4269
5323 -4269 4904 14896 9288 -34334 -28163 3939 9103 -31233 -58010 -68402 -71879 -40112 -33200
5310 -33200 -6619 13274 30881 12402 -15735 -44293 -63553 -97853 -64068 -19212 16762 40242
5298 40242 56863 53913 51839 29471 8606 -16561 -13095 -17594 -12150 -6223 -10200 30818 19490
5285 19490 -22291 -13995 -16015 8527 7920 -8631 -7269 -21228 -4049 18243 485 -8219 -43756
5272 -43756 -61097 -42265 -21930 4841 -5406 9422 6762 29494 26675 4615 -19512 -59833
5260 -59833 -38995 -26356 -17561 -35646 -80884 -91736 -21155 4871 -35721 -35195 -22552 8983
5248 8983 -36449 -41138 -8803 16981 15807 54662 58175 31596 45098 29592 36144 14048 -15163
5235a5163K305J634N2953r471p485p679L856j8525j2510j4676k56j015M12k1936
5221d7556K5966L5168j6785j7494K9671j6589m1224l975o67o761o013J7484L0377
5208a8398o515J263J1089L3226j6695m5194J6759J8241K5135k5105l4562L2876
5196g880J0274m562j8943P725J7233o193Q30l5126j4732J0664J7372M6529J3989
5183C7180l8249L0147O941n4017n3784j2723j1020P0020N7142J1886r174m1522
5171g173j3245K3861K2258l1356k411r118p778j1710K3767p71o146r641j2695
5158d2158k906J3746j0023k5402o668K0851j2675J069K6841L9160O208R727L58
5145A8128L0083K1588n8298k5862P887J9985K3318M1827m1058o8186k4156K5030
$$ plain form
5235 -15163 -12858 -11224 41729 32258 24773 17094 20950 2425 -10085 -24761 -25017 -26032 -25620 -47556
5221 -47556 -21590 13578 -3207 -20701 8970 -7619 -48843 -52818 -53485 -60246 -66259 -48775 -18398
5208 -18398 -24913 -23650 -12561 20665 3970 -41224 -24465 -6224 18911 -6194 -40756 -7880
5196 -7880 2394 -2168 -21111 -13386 3847 -2346 -1516 -36642 -51374 -40710 -23338 23191 37180
5183 37180 -1069 29078 36019 -17998 -71782 -84505 -95525 -25505 31637 43523 34349 -7173
5171 -7173 -20418 3443 25701 -5655 -8066 -17184 -24962 -36672 -12905 -13676 -19822 -29463 -42158
5158 -42158 -45064 -31318 -41341 -66743 -73411 -52560 -65235 -64166 -37325 1835 8043 17770 18128
5145 18128 48211 69799 11501 -14361 -6474 13511 36829 78656 37598 -30588 -54744 -29714
5133b9714o446K23j5392r009J1747K2408J5674J4316L5421l5985l849J2482n370
5120F506k1230q58o882j5441n5685L1934L2191J1869K2505p874k7210r974j3665
5107e3814J0013j2121Q077k5248k8477K8665Q774K8352L1348J813P827k5207r262
5094b9260L4360k723m7747l9629R933K4422L8250M7711K7050k3263n6302l1569
5082d8767l3164R386N8145L9426J889J0549l3306k1454Q68l5441J743L8587R575
5069a964k2851j1147L1310L3753K484j1929k7924l578K3804N065l7672m2269J9352
5056d3566K8632J839K7081k4671n2887J3900J1695j0169M361R501J7741O1780
5044D5237M7059o3413l9916j7967r302j58j738j2916n527R239l06M8641L7186
$$ plain form
5133 -29714 -36160 -35937 -51329 -60338 -48591 -26183 -10509 3807 39228 3243 -606 11876 6506
5120 6506 -14724 -15582 -22464 -37905 -93590 -61656 -29465 -17596 4909 -2965 -30175 -40149 -53814
5107 -53814 -43801 -55922 -47845 -73093 -101570 -72905 -64131 -35779 -4431 -2618 5209 -19998 -29260
5094 -29260 5100 2377 -45370 -84999 -75066 -50644 -12394 35317 62367 39104 -17198 -48767
5082 -48767 -81931 -72545 -14400 25026 26915 37464 4158 -17296 -16428 -51869 -50126 -11539 -1964
5069 -1964 -24815 -35962 -4652 29101 31585 19656 -8268 -11846 11958 17023 -20649 -62918 -43566
5056 -43566 -14934 -13095 13986 -10685 -63572 -49672 -37977 -48146 -43785 -34284 -16543 45237
5044 45237 92296 28883 -11033 -29000 -38302 -38460 -40198 -53114 -58641 -49402 -49708 -1067 36119
5031C6119J4451j6831O604n0094l2892R304Q838J393J576M8506j4493J7394k2104
5018G771o2953j2721M364L0930J8943K1944k0918k8683K68n8128j4980K0296N8082
5005c5785K9365l0940k5400L207M8660k678j0077L0398Q66k7080M027q311q19
4992b4567k5154o997M436L4404J9998K786n067J9429p290J3973k0294k2631K4557
4979G583L4099j7531n768j694K924k1638k539L711J1948j9581j1869L3568Q700
4966B1913K7784J0229j768r929k2219n0896L1194L3285j730m3852r672J5722Q473
4953H534k870P9j1255q756J6196J8774k3929J320L2339P986k4789m5982J7766
4940a4587n803J2672J9144r855j1105q701k1297J8893K9488j8485j2119M352j0971
$$ plain form
5031 36119 50570 33739 40343 -9751 -42643 -33339 -24501 -23108 -21532 26974 12481 29875 7771
5018 7771 -55182 -67903 -63539 -32609 -13666 8278 -12640 -41323 -41055 -99183 -114163 -93867 -35785
5005 -35785 -6420 -37360 -62760 -59553 -10893 -13571 -23648 6750 7616 -19464 -15437 -23748 -24567
4992 -24567 -49721 -56718 -52282 -17878 2120 4906 -161 19268 11978 25951 5657 -16974 7583
4979 7583 41682 24151 18383 16689 19613 -2025 -4564 -853 11095 -8486 -20355 13213 21913
4966 21913 49697 59926 58158 48229 26010 -24886 6308 39593 37863 -5989 -15661 61 8534
4953 8534 5664 5743 -5512 -14268 1928 20702 -3227 -1907 30432 38418 13629 -32353 -14587
4940 -14587 -20390 -7718 11426 1571 -9534 -18235 -39532 -20639 8849 -9636 -21755 -17403 -28374
4927b8374J2257l4358l900r022M14k562l2626j7359J6783O6497K4230j1967j7676
4914c7663L731j0351k1699J8613K5009l340Q74L2373j5374l2220l400l1041l2299
4901a06787J2754J0128N161M2725O4928m322O085k3223k0585J0522J4645k6620
4889a4589j5823K6844J6197J0977k2023K820m4066m7418j9693M0844M6179L2576
4877A2825j7160l8008j960l1112l284J2373K9282j0848j8221J5101M2236J393
4865g383K535j4758r386K194J0707m1501j8231L9198M0389p2355j9997j9205J2927
4852i4866L6890K9326L1153M665K9399l914K7449k2959l6819J9188O470J1070
4840C7052L8885J9775j5638l3883j1174n607j2432l0565J413K5205o434m1592
$$ plain form
4927 -28374 -16117 -50475 -54375 -63397 -62983 -65545 -98171 -115530 -98747 -32250 -8020 -19987 -37663
4914 -37663 -33932 -44283 -65982 -47369 -22360 -25700 -24826 7547 -7827 -40047 -43447 -74488 -106787
4901 -106787 -94033 -83905 -78744 -36019 28909 24587 30672 7449 -13136 -2614 12031 -14589
4889 -14589 -30412 -3568 12629 23606 1583 4403 -39663 -87081 -106774 -65930 -19751 12825
4877 12825 -4335 -42343 -44303 -75415 -78699 -66326 -37044 -47892 -66113 -51012 -8776 -7383
4865 -7383 -4848 -19606 -28992 -26798 -16091 -57592 -75823 -36625 3764 -68591 -88588 -107793 -94866
4852 -94866 -57976 -28650 2503 7168 36567 32653 60102 37143 324 19512 25982 37052
4840 37052 75937 95712 80074 46191 35017 29410 16978 -13587 -12174 13031 6597 -34995
4828c4995k1476L6355J948r855J4711N697Q017L496k0766J3675J7129K844L402
4815B0182K0278J0461k2096l137l2497j6769J3606N6116l248m2743k8026P292
4803b0581J0755K4696j9217m6710m965L1084q344J8382l3307l0773L6286M0869
4791a825O602l2882J745L40o203j5942K5001M1849k2521k8332J1933K2576r861
4778g520k4550k1343j6383j1224K3445L7885L909k6089k3267L501k2918J1563
4766g2991J1481J7595l612k9542L01N4425k432k963K4159L7k6472J3311j9515
4753c6218p536J4919j0282J0756K2599k7404J352P521J7333j0847m9774k2119
4741h9700N5439L0998K5015j1666k2021K1714N3545k9504m4063j2845M0432K6974
$$ plain form
4828 -34995 -56471 -20116 -18168 -28023 -13312 -7615 402 3898 -16868 -3193 13936 16780 20182
4815 20182 40460 50921 28825 25688 -6809 -23578 -9972 46144 42896 153 -27873 -20581
4803 -20581 -9826 14870 -4347 -51057 -56022 -24938 -33282 -14900 -48207 -78980 -42694 -1825
4791 -1825 4777 -28105 -26360 -26020 -32223 -48165 -23164 18685 -3836 -32168 -20235 2341 -7520
4778 -7520 -32070 -53413 -69796 -81020 -57575 -19690 -15781 -41870 -65137 -61636 -84554 -72991
4766 -72991 -61510 -43915 -47527 -77069 -76768 -22343 -24775 -27738 -3579 -3542 -30014 -16703 -36218
4753 -36218 -43754 -28835 -39117 -28361 -5762 -33166 -31814 -24293 -6960 -17807 -67581 -89700
4741 -89700 -34261 -3263 21752 10086 -11935 9779 63324 33820 -10243 -23088 17344 44318
4729D4318l886k7618j5393k3075k4584j3602M981L4697K5535q540P609M6907J0383
4716E7732j0717n8058k9784N9454j6043k0551K709q809L0140M5199J3613k4977
4704C9908k2111k8366R372J0267K7911k9475n4995q3L2214J3332k4467j6679J2556
4691c0616R327P694J4834j7867j0536J4995J6316J8971k9320J9978L8589l3309
4679A9056k511m3040l6928K4538k6469J1250j0630j9634L5639J8790k374L0287
4667b026M1283j3208q771L0372n5243n5478K2161K6855J0207k822k7937L9009
4655D402K9690k7487j148l8290l8159o121M5406J9975j4982L6719K702o436m5150
4642c8879L2342L2209j8099l1370J2815K6773J6460l4151j0406p398k1144J787
$$ plain form
4729 44318 40432 12814 -2579 -25654 -50238 -63840 -58859 -24162 1373 -7167 442 47349 57732
4716 57732 47015 -11043 -40827 18627 2584 -17967 -15258 -24067 6073 51272 64885 39908
4704 39908 17797 -10569 -1197 9070 36981 7506 -47489 -47572 -15358 -2026 -26493 -43172 -30616
4691 -30616 -21289 -13595 1239 -16628 -27164 -12169 4147 23118 -6202 13776 52365 19056
4679 19056 16545 -26495 -63423 -38885 -65354 -54104 -64734 -84368 -48729 -29939 -32313 -2026
4667 -2026 39257 26049 17278 47650 -7593 -63071 -40910 -14055 -3848 -6670 -34607 4402
4655 4402 34092 6605 5457 -32833 -70992 -77113 -31707 -11732 -26714 10005 12707 6271 -38879
4642 -38879 -6537 25672 7573 -23797 -10982 15791 32251 -1900 -12306 -19704 -40848 -39061
4630c9061L4574j1373k8652k4390P219R384k134N041M4805J5703j8589k1600l1206
4617f0279l3815Q33R657L0712l83K2480M5263K0218l6016n037l4534r196L5605
4604a4492R332P989j2715k0036J8225J0575J2427R702J4827k2876l7680J5524
4592i198K2083n818k2909k994p724k4578J8920J7476M6919l4504j8597n721j0906
4579c7551j9705J6127K4192J7200k9657l431j1744J3098K2096k1761r301M788
4567c5649l3656J9483M9495p52k6832k1835L3262R155J982q87j2568K7371q045
4554E24L4878M338l0134M256P495q417j2619L3350O856j1516q431j4416l6779
4541c0615m740j4433k9756j4054L1213J1554J1971j0723M1818L3620o265O987
$$ plain form
4630 -39061 -4487 -15860 -44512 -68902 -61683 -52299 -54433 -49392 -4587 11116 -7473 -29073 -60279
4617 -60279 -94094 -93261 -83604 -52892 -53275 -30795 14468 34686 -1330 -6367 -40901 -50097 -14492
4604 -14492 -5160 2829 -9886 -29922 -11697 -1122 11305 21007 35834 12958 -24722 -9198
4592 -9198 12885 7067 -15842 -18836 -26560 -51138 -32218 -14742 32177 -2327 -20924 -26645 -37551
4579 -37551 -57256 -41129 -16937 263 -29394 -32825 -44569 -31471 -9375 -31136 -40437 -35649
4567 -35649 -69305 -49822 -327 -1079 -27911 -49746 -16484 -7329 -5347 -6234 -18802 8569 524
4554 524 35402 39740 9606 13862 21357 12940 321 33671 40527 29011 20580 6164 -30615
4541 -30615 -35355 -49788 -79544 -93598 -62385 -50831 -38860 -49583 -7765 25855 19590 26577
4529B6577j7892J1047P736R096m2699P64J9143l8865J0325L6930k4175K6400K9541
4516E3928K5981n2756j8169j6251l573j5943j1382N4994N9851j6653l6700j7581
4504E746k2293j0324J2086J5263o758j4953J6719j4575j4187K5704k0806O856
4492b1522K5176K8603j6721m0445j5171K8647L087j9521J3943j346l7262o1392
4480a13924M303J1028L778J4364n319k9177K5366P867R031L3464m978J2932J0064
4467b1201q209J0740k768l4538j1468N2973M4118m656j8231j6373K544J3462N059
4454A1452l963L137M3724j0153j6297r25Q937K4877m0715m3049k0587J9900K2626
4441a036O966m7904J2659K1321q191N187k3759k819k2523K9142K7245N678j2236
$$ plain form
4529 26577 8685 19732 27468 36564 -6135 -5371 13772 -25093 -14768 22162 -2013 24387 53928
4516 53928 79909 27153 8984 -7267 -10840 -26783 -38165 16829 76680 60027 23327 5746
4504 5746 -16547 -26871 -14785 478 -6280 -21233 -4514 -19089 -33276 -7572 -28378 -21522
4492 -21522 3654 32257 15536 -24909 -40080 -11433 -8346 -27867 -13924 -15270 -52532 -113924
4480 -113924 -109621 -98593 -94815 -80451 -85770 -114947 -89581 -81714 -72683 -39219 -44197 -31265 -21201
4467 -21201 -29410 -18670 -21438 -55976 -67444 -14471 29647 24991 6760 -9613 -7069 6393 11452
4454 11452 7489 10626 54350 44197 27900 26975 35912 60789 20074 -22975 -43562 -23662 -1036
4441 -1036 5930 -41974 -29315 -7994 -16185 -10998 -34757 -37576 -60099 -30957 -3712 1966 -10270
4428a0270o829K5474p796K3727l984k2133J2748J751k020Q142M4192k9006m9029
$$ plain form
4428 -10270 -17099 8375 579 24306 20322 -1811 10937 12688 10668 18810 63002 33996 -15033
$$ [...]
##END NTUPLES=NMR SPECTRUM
##END=
