##TITLE=Analysis number 317509
Compound Code cc 47416
Book Reference 382/170
Project Code qc-cat
Chemist Name simons
##JCAMPDX= 6.0         $$ Bruker NMR JCAMP-DX V2.0
##DATA TYPE= NMR SPECTRUM
##DATA CLASS= NTUPLES
##ORIGIN= Bruker BioSpin GmbH
##OWNER= nmr
$$ XWIN-NMR		Version 3.5
$$ Wed Feb 22 10:54:59 2006 GMT Standard Time (UT+0h)  MAYBRIDGE\nmr@NMR_250MHZ
##.OBSERVE FREQUENCY= 250.131544655141
##.OBSERVE NUCLEUS= ^1H
##.ACQUISITION MODE= SIMULTANEOUS (DQD)
##.ACQUISITION SCHEME= undefined
##.AVERAGES= 16
##.DIGITISER RES= 18
##SPECTROMETER/DATA SYSTEM= dpx250
##.PULSE SEQUENCE= zg30
##.SOLVENT NAME= CDCl3
##.SHIFT REFERENCE= (INTERNAL, CDCl3, 0, 16.4611)
##AUDIT TRAIL= $$ (NUMBER, WHEN, WHO, WHERE, WHAT)
$$ ##TITLE= Audit trail, XWIN-NMR		Version 3.5
$$ ##JCAMPDX= 5.01
$$ ##ORIGIN= Bruker BioSpin GmbH
$$ ##OWNER= nmr
$$ C:\u/data/dgb/nmr/ADRS/16630/pdata/1/auditp.txt
$$ ##AUDIT TRAIL=  $$ (NUMBER, WHEN, WHO, WHERE, WHAT)
(   1,<2006-02-22 10:54:19.10 +000>,<MAYBRIDGE\nmr>,<NMR_250MHZ>,
      <created by zg, POWCHK disabled, PULCHK disabled
       configuration hash MD5:
       84 BC 41 DB A1 6E 1D 46 DA 25 12 A5 C1 ED C5 3A
       data hash MD5: 64K
       2D 00 3B 49 47 04 3F E0 AE D4 9B A5 82 79 1D F9>)
(   2,<2006-02-22 10:54:37.73 +000>,<MAYBRIDGE\nmr>,<NMR_250MHZ>,
      <Start of raw data processing
       ef LB = 0.3 FT_mod = 6 PKNL = 1 SI = 32K 
       data hash MD5: 32K
       3D 89 6E 87 97 07 C9 ED FC A6 F2 85 39 02 C6 FD>)
(   3,<2006-02-22 10:54:42.10 +000>,<MAYBRIDGE\nmr>,<NMR_250MHZ>,
      <apk 
       data hash MD5: 32K
       53 5F 1E 8B 45 3B AD 66 4A 2A 8F A3 8D 74 71 54>)
(   4,<2006-02-22 10:54:43.54 +000>,<MAYBRIDGE\nmr>,<NMR_250MHZ>,
      <abs ABSG = 5 
       data hash MD5: 32K
       09 36 C0 47 54 54 02 B6 B5 87 4F 20 10 98 53 A8>)
$$ ##END=
$$ 
$$ hash MD5
$$ 39 DA 0E 38 66 82 3B B0 87 C3 B7 AB 12 F2 67 A1
##$RELAX= 
##$RELAX= 
##$RELAX= 
##$RELAX= 
##$RELAX= 
##$RELAX= 
##$RELAX= 
$$ Bruker specific parameters
$$ --------------------------
##$DU= <C:\u>
##$EXPNO= 16630
##$NAME= <ADRS>
##$PROCNO= 1
##$TYPE= <nmr>
##$USER= <dgb>
##$AMP= (0..31)
100 100 100 100 100 100 100 100 100 100 100 100 100 100 100 100 100 100 
100 100 100 100 100 100 100 100 100 100 100 100 100 100 
##$AQSEQ= 0
##$AQ_mod= 3
##$AUNM= <au_zg>
##$AUTOPOS= <15 >
##$BF1= 250.13
##$BF2= 250.13
##$BF3= 250.13
##$BF4= 250.13
##$BF5= 500.13
##$BF6= 500.13
##$BF7= 500.13
##$BF8= 500.13
##$BYTORDA= 1
##$CFDGTYP= 0
##$CFRGTYP= 5
##$CHEMSTR= <none>
##$CNST= (0..31)
1 1 145 1 1 1 1 1 1 1 1 1 1 1 1 1 1 1 1 1 1 1 1 1 1 1 1 1 1 1 1 1 
##$CPDPRG= <>
##$CPDPRG1= <>
##$CPDPRG2= <>
##$CPDPRG3= <>
##$CPDPRG4= <mlev>
##$CPDPRG5= <mlev>
##$CPDPRG6= <mlev>
##$CPDPRG7= <mlev>
##$CPDPRG8= <mlev>
##$CPDPRGB= <>
##$CPDPRGT= <>
##$D= (0..31)
0 1 0 0 0 0 0 0 0 0.06 0 0 0 0 0 0 0.0002 0 0 0 0 0 0 0 0 0 0 0 0 0 0 
0 
##$DATE= 1140605657
##$DBL= (0..7)
120 120 120 120 120 120 120 120 
##$DBP= (0..7)
150 150 150 150 150 150 150 150 
##$DBP07= 0
##$DBPNAM0= <>
##$DBPNAM1= <>
$$ [...]
##$SUBNAM7= <"">
##$SUBNAM8= <"">
##$SUBNAM9= <"">
##$SW= 20.6930455092707
##$SWIBOX= (0..15)
0 0 3 0 0 0 0 0 0 0 0 0 0 0 0 0 
##$SW_h= 5175.983436853
##$TD= 65536
##$TD0= 1
##$TE= 293.16
##$TE2= 300
##$TE3= 300
##$TEG= 300
##$TL= (0..7)
0 120 120 120 120 120 120 120 
##$TP= (0..7)
150 150 150 150 150 150 150 150 
##$TP07= 0
##$TPNAME0= <>
##$TPNAME1= <>
##$TPNAME2= <>
##$TPNAME3= <>
##$TPNAME4= <>
##$TPNAME5= <>
##$TPNAME6= <>
##$TPNAME7= <>
##$TPOAL= (0..7)
0.5 0.5 0.5 0.5 0.5 0.5 0.5 0.5 
##$TPOFFS= (0..7)
0 0 0 0 0 0 0 0 
##$TUNHIN= 0
##$TUNHOUT= 0
##$TUNXOUT= 0
##$USERA1= <user>
##$USERA2= <user>
##$USERA3= <user>
##$USERA4= <user>
##$USERA5= <user>
##$V9= 5
##$VALIST= <valist>
##$VCLIST= <CCCCCCCCCCCCCCC>
##$VD= 0
##$VDLIST= <DDDDDDDDDDDDDDD>
##$VPLIST= <PPPPPPPPPPPPPPP>
##$VTLIST= <TTTTTTTTTTTTTTT>
##$WBST= 1024
##$WBSW= 4
##$XGAIN= (0..3)
0 0 0 0 
##$XL= 0
##$YL= 0
##$YMAX_a= 419987
##$YMIN_a= -484520
##$ZGOPTNS= <>
##$ZL1= 120
##$ZL2= 120
##$ZL3= 120
##$ZL4= 120
##$ABSF1= 16.46111
##$ABSF2= -4.232063
##$ABSG= 5
##$ABSL= 3
##$ALPHA= 0
##$AQORDER= 0
##$ASSFAC= 0
##$ASSFACI= 0
##$ASSFACX= 0
##$ASSWID= 0
##$AUNMP= <proc_1d>
##$AZFE= 0.1
##$AZFW= 0.1
##$BCFW= 0
##$BC_mod= 0
##$BYTORDP= 0
##$COROFFS= 0
##$CY= 12.5
##$DATMOD= 1
##$DC= 0
##$DFILT= <>
##$DTYPP= 0
##$F1P= 14.0000005364418
##$F2P= -0.99999901652339
##$FCOR= 0.5
##$FTSIZE= 32768
##$FT_mod= 6
##$GAMMA= 0
##$GB= 0
##$INTBC= 1
##$INTSCL= 1
##$ISEN= 128
##$LB= 0.3
##$LEV0= 0
##$LPBIN= 0
##$MAXI= 10000
##$MC2= 0
##$MEAN= 0
##$ME_mod= 0
##$MI= 0
##$NCOEF= 0
##$NC_proc= -3
##$NLEV= 6
##$NOISF1= 0
##$NOISF2= 0
##$NSP= 0
##$NTH_PI= 0
##$NZP= 0
##$OFFSET= 16.46111
##$PC= 1
##$PHC0= 244.2182
##$PHC1= 5.094228
##$PH_mod= 1
##$PKNL= yes
##$PPARMOD= 0
##$PSCAL= 4
##$PSIGN= 0
##$REVERSE= no
##$SF= 250.130015230076
##$SI= 32768
##$SIGF1= 0
##$SIGF2= 0
##$SINO= 400
##$SIOLD= 32768
##$SREGLST= <1H.CDCl3>
##$SSB= 0
##$STSI= 32768
##$STSR= 0
##$SW_p= 5175.98343685301
##$SYMM= 0
##$S_DEV= 0
##$TDeff= 65536
##$TDoff= 0
##$TI= <Analysis number 999999
Compound Code 99
Book Reference 9
Project Code 9>
##$TILT= no
##$TM1= 0
##$TM2= 0
##$TOPLEV= 0
##$USERP1= <user>
##$USERP2= <user>
##$USERP3= <user>
##$USERP4= <user>
##$USERP5= <user>
##$WDW= 1
##$XDIM= 32768
##$YMAX_p= 315298987
##$YMIN_p= -77330
$$ End of Bruker specific parameters
$$ ---------------------------------
##NTUPLES= NMR SPECTRUM
##VAR_NAME=  FREQUENCY,     SPECTRUM/REAL,   SPECTRUM/IMAG
##SYMBOL=    X,             R,               I
##VAR_TYPE=  INDEPENDENT,   DEPENDENT,       DEPENDENT
##VAR_FORM=  AFFN,          ASDF,            ASDF
##VAR_DIM=   32768,         32768,           32768
##UNITS=     HZ,            ARBITRARY UNITS, ARBITRARY UNITS
##FACTOR=    0.157963299565203, 1,           1
##FIRST=     4117.41748523916, 0,            0
##LAST=      -1058.56595161385, 0,           0
##MIN=       -1058.56595161385, -77330,      0
##MAX=       4117.41748523916, 315298987,    0
$$ Real data points
##PAGE= N=1
##DATA TABLE= (X++(R..R)), XYDATA
$$ [...]
20508 28644 6535 5616 19654 20650 20997 31513 34908 28799 3561 -3388 3402 9381 21390 18670
20494 18670 10 1586 786 -14633 -11834 -26226 -27721 -5373 9843 15921 186 -7828 6036
20481 6036 12202 24965 27191 14775 7211 9446 -1489 -9639 -4307 -11398 -11211 -9657 -23969 -17928
20467 -17928 4086 7611 3904 -9534 -6336 -16919 -25058 -17818 -16573 1874 20792 185 -10167
20454 -10167 -10958 -13598 -5329 -2321 7740 6290 7906 15648 2736 -17287 -7081 9963 20823
20441 20823 22893 2965 -7818 -22619 -33055 -35666 -7778 -13295 -8877 3047 24997 44435
20429 44435 34755 11874 18249 30962 29957 29930 17340 20279 1028 -4959 -955 -13093 4719
20416 4719 8891 5339 3729 3009 -10332 1516 4168 6951 -8220 -20570 -29256 -33721 -27092 -540
20402 -540 10391 5357 -13163 -14672 -9213 -7439 8475 6851 -8793 12910 26950 27622 7402
20389 7402 3988 -10798 -22763 -7799 -10961 -23995 -29129 -16984 -2451 16047 -5673 -10282 -14318
20376 -14318 -3367 36541 46965 12735 -1238 5837 -6259 -12417 -5883 9059 2988 19741
20364 19741 20840 16229 -8064 -17749 889 8692 13180 -1893 1173 -10506 -5120 14592 18483
20351 18483 25923 22216 8631 -3248 -2669 5654 7869 -1308 -3968 17066 11861 -1419 -31200
20338 -31200 -10607 9667 14525 -2195 10180 -3349 1206 15058 6004 -1925 8633 27918
20326 27918 25090 19231 -6576 -4950 -17538 -14233 -15176 -17364 -3358 6956 3245 -276 -978 1497
20312 1497 -11246 -8784 -16549 -32728 -49591 -46551 -30367 -27740 -11368 -6050 -6987 8330 12437
20299 12437 6386 -19548 -25892 -23289 -14951 -23411 -23188 -24479 -1596 4787 -2261 -15148 -35904 -34752
20285 -34752 -30845 -14732 -13691 -18375 -11187 -2510 -8584 -27459 -45603 -34079 -24418 -12711 7214
20272 7214 -904 -12952 -27484 -23466 -14920 -23325 -12939 -2985 19950 12380 -10526 -7953 -6322
20259 -6322 105 -5436 -8719 -21497 -21038 -11206 -11923 -28252 -38336 -18467 -6273 -4164 1689 1607
20245 1607 -7593 -18080 -13004 -4388 -12331 -22471 -20266 -32444 -17993 25284 32031 14352 15385
20232 15385 7213 -22864 -13309 -6489 15798 14529 3289 7510 11158 4395 -7217 -1268 4324
20219 4324 22248 41899 31472 2002 918 5276 -3279 13584 26918 27603 22618 18680 -2753
20206 -2753 -29820 -27009 -22277 -18637 -13911 -4181 -16664 -7166 -14750 1898 13798 8118 -707 1519
20192 1519 7259 395 13765 28151 20742 12824 -9759 -29012 -8121 15642 7251 1383 -3075
20179 -3075 5796 17393 10766 -6733 -13741 -20762 -16149 -17187 -27507 -33902 -17325 -9862 -3963 1730
20165 1730 -2805 -7206 -4762 7227 -5491 -16252 -20517 -28314 -24151 -420 -7253 -9987 -6494 13723
20151 13723 14628 -2941 -17053 -23160 -21017 -15256 -9624 -5258 -10619 759 -7635 -17023 -1464 12404
20137 12404 38126 22972 8079 7671 23994 22219 -11483 -40494 -24127 -8471 -1556 -2083 13261
20124 13261 28180 16668 -7034 -18130 -25161 -9577 19236 17539 21011 11647 -5887 -27241
20112 -27241 -23442 3330 18019 20085 14167 1000 -4912 -4049 -3612 -26764 -39573 -16129 -6956
20099 -6956 -23556 -48186 -48095 -52133 -39493 -18336 -12839 -6201 5208 3424 25479 44948 48903
20086 48903 26782 13162 23973 19136 11318 -294 10231 14076 837 888 7562 1115 -3395
20073 -3395 -4572 13701 16206 8817 31512 25523 15153 4148 5546 18867 4319 -4247 -13997
20060 -13997 -13912 -11599 -3467 -4371 -13630 -2512 784 2924 410 -19862 -25427 -209 7439 9271
20046 9271 -597 8546 25619 1664 -26969 -16115 4046 1638 -7690 -17739 -28657 -20228 -18462
20033 -18462 -11488 2646 26467 11109 -3 -7132 7297 13658 8136 12825 6286 7921 11563
20020 11563 22789 30199 35049 20516 8702 10746 13545 7681 -17990 -27300 -17097 -15076 10849
20007 10849 13213 7255 -10515 -38558 -37284 -8619 -21861 -18674 14473 30057 15917 5053
19995 5053 -23378 -26415 -34697 -31856 -26543 -11109 1326 1532 11255 -7825 -12886 -17354 -18431 -1133
19981 -1133 -5047 -14970 -20767 -14164 -5625 -20549 -24519 -45362 -39716 -34006 -32884 -20101 -24852 -8360
19967 -8360 -8677 -37520 -50777 -48242 -39926 -20397 5568 -2133 2803 21694 23621 6880 2917
19954 2917 -5160 -10916 -14390 -1201 -14660 -8692 758 11803 16099 845 -1313 -8745 -6436 10388
19940 10388 -2880 -12640 -14408 -8614 -4595 -12721 -4566 2257 6207 -1473 2633 28025 29529 16790
19926 16790 19988 16260 15625 -4906 -13067 -13783 -21023 -14385 -19991 -9104 25131 15333 -1036 -9230
19912 -9230 -17859 -25507 -43091 -37349 -14018 4254 6738 9322 22650 16569 2807 -863 -22594
19899 -22594 -6867 -1292 -18986 -14374 -19109 -15671 -11497 -3665 2574 1839 -4472 -1188 -18270 -23157
19885 -23157 -28855 -24808 -23594 -22223 -26072 -29347 -21556 -44204 -40439 -15676 10724 26825 15494
19872 15494 2319 8351 21076 15445 -1916 -16805 -13724 -21910 -37162 -38080 -46211 -43647 -5650
19859 -5650 7421 35643 39719 12848 7713 -10295 -13704 -5354 2588 9344 -8620 -16346 3140
19846 3140 -1138 4238 13428 17645 4234 -696 11984 626 6778 -5677 -20221 -19270 -14026 -6830
19832 -6830 -4815 10609 14807 -5158 -14396 -1351 -16203 -8778 -27465 -39625 -19462 -1868 -954
19819 -954 2224 941 4761 9558 -7121 -5367 8919 9114 -10031 -20112 -16018 -13140 -12353 -12354 -7401
19804 -7401 -8825 -22601 -20507 -18459 -12670 -20099 -33228 -40461 -24645 3373 3199 4832 -19861 -23766
19790 -23766 -12657 -9149 -11702 2241 11021 -372 -29202 -29148 -8728 -5434 -8172 -17849 -27769 -29629
19776 -29629 -7794 10150 -6261 -17987 -20450 -23071 -17406 -5770 -1180 9010 17925 39881 28340
19763 28340 23090 25914 24639 22768 27702 13097 -650 -5313 7290 7228 8302 -3901 -20160 -43927
19749 -43927 -32373 -23416 -28906 -23360 -6062 19102 20533 15119 -994 -20963 -17289 -6433 -2256
19736 -2256 -19918 -24651 -23908 -16087 -27 10432 3016 -13767 -10178 2411 13353 21486 23628
19723 23628 11065 -2373 -13114 -26033 -20465 -791 -13149 -28107 -21866 -1508 832 -2960
19711 -2960 -7857 -116 -11007 -21715 -1329 -1293 -14925 -17298 -1165 8118 9467 -4511 -25879
19698 -25879 -28959 -21370 -24979 -22096 -4650 6486 -366 -6976 -3182 -5089 -17444 -21346 -10540
19685 -10540 12367 15353 15558 10366 7385 11801 19061 26361 20235 7979 1685 -8648 -6331 -9067
19671 -9067 -15214 -23401 -30524 -30042 -27666 -29999 -27994 -9386 4150 8751 3230 -3183 -3408 950 5577
19656 5577 10740 -11143 -16516 4250 -7857 -18225 -18624 6292 18344 -2673 -33555 -38802 -19046
19643 -19046 5554 19169 17473 -9932 -3394 -20752 -14542 -13684 -34689 -45036 -24265 -9904 -9276
19630 -9276 -18945 -12075 -2311 11663 21416 28906 26766 6947 -9461 -20936 -17050 -3963 29281
19617 29281 30326 17923 -3602 -3309 -9106 5309 -59 -12518 -14237 -6847 -13855 -2366 -3670
19604 -3670 -22366 -35818 -41266 -24437 -7439 13345 12853 -3197 2144 16596 22111 37370 30384
19591 30384 4271 1646 13849 11175 -1286 -5116 -1164 12009 1670 -9500 -14019 -8767 -10206
19578 -10206 -20619 3919 20668 28182 16585 14733 8477 -23212 -41129 -18303 13414 21693
19566 21693 24105 22327 19919 6095 -106 2687 8344 10874 11359 3196 -26717 -16065 -543 8709
19552 8709 14923 13799 2430 5151 10534 11056 13379 8399 9866 11922 -11583 -27435 -9944 -165
19538 -165 -5878 17352 132 -20815 -17737 -6587 -5010 -10490 -18044 -26790 -27649 -14564 -11227 -11315
19524 -11315 -10082 -2707 3024 -12961 -26726 -12869 6690 -6740 -19982 -13368 -12847 11801 32197
19511 32197 3578 -8560 6067 735 -37328 -42194 -40436 -24128 -6929 -228 12059 14613 15648
19498 15648 8295 7821 6782 2240 -16673 -33266 -14552 1494 30439 30307 15632 10551 -8056
19485 -8056 -12220 -1531 1738 6614 9165 16366 14053 12689 32343 37989 16628 -3505 17025
19472 17025 32489 28734 9618 16820 38983 20329 -14488 -26480 -23959 723 6334 12352 16673
19459 16673 22757 19613 3088 -421 2094 45 -1104 -9359 -16667 -21120 -11753 5023 -3856 -1684
19445 -1684 -4717 -1273 16537 18452 -6468 -8829 4541 7112 3887 23559 63557 73041 46222
19432 46222 47588 60746 53790 17955 -7084 -14596 -18301 -19302 -9484 1801 -16820 -3790 8144
19419 8144 10565 -5129 -15055 -19929 -2524 11440 21957 19520 15616 21644 31552 52562 59391
19406 59391 49128 32498 22446 984 -5000 7105 -7980 -20767 -10399 -18425 -8672 -1816
19394 -1816 -10132 -20444 -31091 -36874 -21840 -12600 -9982 -17096 -14502 -14280 -8286 -1905 -5068 -14141
19380 -14141 -19233 -16288 -20178 -23062 -15571 7315 8951 17320 27774 16531 22849 19523 19558 18549
19366 18549 -1510 -1644 -1993 7341 17807 15342 21706 28182 22267 11449 320 -3967 11998 26935
19352 26935 25337 6778 3058 2796 -1280 4234 7725 17781 17738 16123 2652 -21499 -26555 -22840
19338 -22840 -345 21156 43407 14866 31695 43428 21905 3876 -8559 -10181 -12239 -24806
19326 -24806 -36147 -15174 4613 10491 20416 27793 27922 22860 22536 12315 9442 15356 31474 35961
19312 35961 42214 37661 47194 37977 34559 36700 34627 34769 28343 27239 19949 3296 -6110 -13944
19298 -13944 -17187 -8978 -10620 11791 16429 -11092 -6774 -4408 -11610 -6789 -6004 -2567 16503 31552
19284 31552 3301 -117 4691 -3688 -6606 3638 8626 17479 12129 -8251 -10646 -8380 -16612 -16269
19270 -16269 -29764 -30727 -17317 -10305 -1905 12698 22158 35599 50170 45836 25716 22888 24280
19257 24280 29108 11772 15663 29652 12362 -3197 -6272 -9283 -4249 22661 41165 55097 77077
19244 77077 103587 112491 116109 123664 142236 159552 153839 141511 148019 129272 119868 115865 90995
19231 90995 78272 54431 43058 44741 41664 29648 28560 16954 12750 17896 13453 13467 11371 17834
19217 17834 10829 14906 20410 31996 31896 3809 1223 7250 9853 17885 39412 57202 41045
19204 41045 20054 19644 16540 10607 22327 27170 54711 76751 93468 125940 143020 143936 153182
19191 153182 153004 141461 155972 169175 150431 122246 121025 132013 128947 107769 95397 70391
19179 70391 34535 12490 14622 17462 11272 3708 -464 2117 -9219 -5995 19751 6330 3170
19166 3170 8973 10697 -5036 -11473 2634 2545 -27659 -33755 -14598 7364 7921 17505 21949 30426
19152 30426 16879 9679 1369 -22102 -16478 10609 14460 5860 7710 1198 2293 -1178 8821 23762
19138 23762 27266 46889 42546 20962 8181 2469 7878 -6451 -15362 -22672 -14583 -963 9621
19125 9621 21499 11622 22212 49343 26789 1876 -5217 -5881 5785 19809 41331 57925 45289
19112 45289 32929 37558 45913 44196 36938 50208 71919 57272 45267 56183 75460 90393
19100 90393 88780 82084 67864 67702 96041 88676 62803 52588 68372 76019 66336 51394 38744
19087 38744 17169 19758 32790 50136 49386 35742 27435 12918 -4376 -2943 1994 25445 21496
19074 21496 24953 34544 41294 56571 41831 24973 36020 40256 41997 67455 79027 80900 106061
19061 106061 146607 172277 178584 181002 186262 219788 250638 262104 275210 277770 276685 249201
19049 249201 212950 183033 171346 155335 151156 175024 180248 153361 132241 100258 86352 89738
19037 89738 73311 68249 77797 60242 49302 41313 45664 41829 45923 46063 41479 56538 67534
19024 67534 67404 85298 109219 118065 116985 120393 112759 122263 134693 137835 132527 124488 121069 135162
19010 135162 174459 202770 217785 230536 238428 259777 257133 252316 226826 202014 174416 165801
18998 165801 166951 171873 157614 130124 117864 132173 129363 108203 103337 95588 80105 63844
18986 63844 53417 40957 47479 64213 80409 72443 58160 56477 52581 36915 24987 19925 37187
18973 37187 53693 60677 60817 57555 43312 36654 36711 12095 -12055 3499 36540 39797 49368 48921
18959 48921 39437 37825 42305 32290 28290 15337 25425 19724 23191 30342 42268 39300 31779
18946 31779 23789 25383 37343 44328 52941 45432 30085 31500 41340 43191 66225 66920 59687 62343
18932 62343 60165 53740 68499 82147 69553 77763 80099 74000 72998 72424 71555 62298 57717 63952
18918 63952 53648 49082 51213 46502 17197 18139 22164 54865 50850 61036 67862 45381 41433
18905 41433 46718 54870 46096 27709 44207 70987 68976 37322 22405 22629 14321 15435 24524
18892 24524 37289 30629 42702 56228 54420 50121 56861 58055 50867 47120 54631 89122 85943
18879 85943 64758 65578 75335 57571 40353 47229 69681 60373 58338 80520 96677 78185 45375
18866 45375 35346 51004 47822 41419 53905 63978 44452 39252 38968 28305 15208 8038 13313
18853 13313 32517 26168 5762 -5573 -6028 -3811 31272 67728 74858 73076 61130 40978 42445
18840 42445 53915 63345 56796 47216 48596 70395 80164 80429 77514 84028 90547 75483 53574 56683
18826 56683 53059 69607 80627 83962 80360 102319 127149 137006 125141 116049 116826 135014 138736
18813 138736 132300 110568 107659 95987 107142 120822 114358 109133 141954 152353 145163 152742 165365
18800 165365 176461 181216 175839 178569 174482 168072 167780 156844 146518 141970 146939 147106 159560 151221
18786 151221 161848 174848 171877 182280 182113 193855 209223 215701 193699 203742 209438 225800
18774 225800 221283 237589 233468 220589 218959 247157 267976 283733 321810 372768 452736 465488
18762 465488 421375 372298 356781 352617 380427 422428 445213 466215 489195 516189 541140 575815
18750 575815 607370 614739 637711 677394 724080 763876 823473 854486 889028 959027 1040011 1130572
18738 1130572 1244067 1381401 1544306 1776956 2104160 2545041 3227206 4320877 6089989
18729 6089989 8620459 11729823 14708130 16822869 18197352 19314540 20556809 21991512
18721 21991512 23451226 24850855 25511751 24873517 23511355 22240720 21399240 20447018 18573121
18712 18573121 15872425 12709363 9747209 7422260 5810607 4783174 4144152 3699992
18704 3699992 3362906 3088114 2881404 2728625 2627499 2540988 2458330 2376984 2276887 2164882
18694 2164882 2083437 2068521 2085861 2111751 2163403 2244700 2347001 2470043 2695653 3073582
18684 3073582 3691800 4705421 6312226 8779157 12087811 15626816 18364510 19897572
18676 19897572 20929407 22639453 26101800 31003277 34973813 35596261 33202508 29415266
18668 29415266 26205089 24677976 24176125 23043946 20528977 16962663 13123926 9801587
18660 9801587 7354641 5736134 4676122 3974295 3501422 3144012 2846084 2584999 2374888
18651 2374888 2167558 1964802 1780334 1617413 1480754 1377128 1284771 1169258 1048894 982607
18641 982607 914949 852681 812022 772552 758072 731046 701412 669204 623062 579653 560829
18630 560829 547617 551194 550305 555869 551063 528751 503425 498707 522610 528397 512334 502644 499833
18617 499833 505514 525764 542619 570402 595123 649466 720542 868995 1137498 1564274 2181690
18606 2181690 2893107 3324203 3279657 2926405 2466778 2119955 2055123 2307360 2753846 2997921
18596 2997921 2845045 2456257 1980503 1573771 1285171 1108455 1026156 1005002 964420 938364
18586 938364 924348 891373 866401 880136 919619 953699 1004911 1069869 1117060 1160576 1164014 1163817
18574 1163817 1203865 1255848 1353675 1503378 1674330 1845282 2013017 2167929 2391467 2664004
18564 2664004 3034769 3525668 4265280 5386127 7146489 9923530 14202950 19826419 24816704
18555 24816704 26615600 25324973 22518385 19803208 18889799 20749136 25287754 30273681
18547 30273681 32391883 31590616 29649802 27916027 27630959 29121370 31322496 33082509
18539 33082509 34485655 35337891 35435913 34231124 31456787 27927560 24028329 20298606
18531 20298606 17372555 15405151 14353431 14149997 14793819 16409466 19526315 25297022
18523 25297022 35449468 50906557 67502575 76560870 75706569 69297614 62830984 61952158
18515 61952158 67798941 73361390 70506499 60338606 46882219 33780309 24066445 17956418
18507 17956418 14205652 11764239 10037555 8718159 7667399 6854981 6252526 5798422
18499 5798422 5474558 5227871 5035486 4962951 5043116 5289241 5672753 6111462 6392772 6497097
18489 6497097 6484027 6370431 6147752 5701898 5109694 4458053 3748362 3098078 2535046 2099332
18479 2099332 1788256 1558615 1383527 1244783 1163806 1087109 1003729 947555 904112 879221
18469 879221 841798 807156 789134 765396 737709 716543 693517 625081 545777 495683 465308
18458 465308 430784 394802 378005 381162 367372 367393 362848 354113 364743 361392 347242 332915 337000
18445 337000 336148 310352 273510 260390 246808 228261 190814 191586 175000 165725 179358 171618 155778
18432 155778 170999 175630 155899 155846 181674 203141 192422 176984 181041 188868 195556 189829 199399
18419 199399 181404 158963 143701 130825 145461 141181 152508 180662 168522 177018 185679 185211
18407 185211 149106 120789 116448 110692 97732 108458 99392 85184 80779 80348 96306 107370 113414
18394 113414 115245 128356 148573 159713 147642 145574 153181 127529 135312 147127 144829 113539
18382 113539 100568 87644 88624 114416 110556 96302 117358 136514 136637 118874 100405 72354
18370 72354 84777 91280 81129 84721 99709 112312 127713 149004 162116 154979 161471 160504 163289
18357 163289 147185 147907 149378 165731 182062 173753 172640 159436 146906 154178 146717 120676 112849
18344 112849 111882 118683 130729 162571 169035 174748 173823 174657 188845 187597 176288 163060 150825
18331 150825 156283 162504 175192 177856 180086 191781 199462 193292 200064 219054 197884 190593 187582
18318 187582 214031 219474 238959 279622 325462 365911 405138 450422 520436 633327 808458
18307 808458 1129238 1655029 2313558 2830129 2889957 2572167 2066672 1568428 1216943 980741
18297 980741 838010 768043 733995 710658 677453 667673 685766 715395 758948 825316 907102
18286 907102 1012573 1169013 1384106 1690930 2156732 2849691 3894609 5462762 7619357
18277 7619357 10124696 12763341 15091116 16070680 15622620 14172681 11903768 9421898
18269 9421898 7273094 5584420 4419475 3684344 3207494 2925856 2775665 2749521 2853915
18260 2853915 3139675 3665966 4589174 6130523 8621395 12212036 15906270 17640076 16801236
18251 16801236 14334330 11252310 8624657 6964931 6291876 6401181 6929028 7425391 7802896
18242 7802896 8327627 9272471 10351521 10664801 10204684 9484482 8755646 8167169 7584603
18233 7584603 7087919 6834403 7084082 8059983 9647786 11573035 13637412 15164350 15620521
18224 15620521 15414690 14838992 14245206 13981164 14165194 14501888 14210849 13238190 11780063
18215 11780063 9889203 8011640 6457888 5295395 4575351 4245283 4255087 4625224 5494898
18206 5494898 7102693 9605071 12263850 13533650 13018842 11462691 9630749 8329860
18198 8329860 7764418 7538925 7511193 7795268 8512182 9365608 9527978 9019892 8285406 7528984
18188 7528984 6840799 6039387 5165687 4327161 3614690 3093058 2735800 2519158 2397904
18179 2397904 2350439 2399884 2575248 2939956 3603373 4627052 5905371 7294489 8675406
18170 8675406 9522399 9416988 8670600 7405351 5874227 4488389 3356936 2506393 1932961
18161 1932961 1568628 1320372 1140705 1000602 899534 824771 772797 722961 695686 693929
18151 693929 699051 701139 740826 818941 885746 950842 1008906 1089053 1163853 1180702 1134383 1021613
18139 1021613 913258 836165 765876 670260 573757 478632 418795 398884 373517 347264 353735
18128 353735 374455 374223 385438 393101 408624 443201 463204 484798 506830 565247 682241 816641
18116 816641 971924 1157791 1409050 1742398 2211659 2970684 4224890 6461654 10722546
18107 10722546 18947825 30675901 36238693 32784729 26146146 17583816 10734427 6847889
18099 6847889 4810767 3664418 2903369 2360174 1963053 1668334 1432953 1264110 1148626
18090 1148626 1021543 907951 814792 717010 641642 584397 517538 467563 419790 376009 345413
18079 345413 336396 326933 326420 326223 307282 286106 286722 282703 259304 247783 258451 256771 250962 243140
18065 243140 238209 245078 253509 213800 175778 152191 134094 121675 112936 112182 105526 97426 86092
18052 86092 106671 118177 100663 95571 77871 80754 94246 107066 111901 93431 86128 90384 79365
18039 79365 89609 116394 143491 159451 159027 163790 188319 192657 208659 212705 212651 230738 252127
18026 252127 283592 321317 320126 279656 249660 233811 217501 208978 215333 210807 209575 182891
18014 182891 150671 132510 113405 104227 102339 107625 105449 89687 58240 43111 58582 45115
18002 45115 25541 21555 22279 40050 22818 22746 30631 30895 30749 36959 33042 37622 43135 41098 42275
17987 42275 52344 77673 110520 115747 124110 126561 137358 150866 149534 163502 197644 193438 173735
17974 173735 168165 150579 140819 132323 121064 118840 108644 88131 73502 58170 44869 43037
17962 43037 39142 44019 37600 25133 30567 25475 18257 10927 17616 25397 22443 3708 -3945 2441
17948 2441 2296 25858 14540 18023 21357 9978 -5951 -10352 -4119 -9765 -14278 -6871 2778 7690
17934 7690 12956 21887 22766 9546 17766 32745 18055 4124 5586 22519 24896 11669 1716
17921 1716 -7084 -3681 -7861 21184 27799 22647 -668 -14551 -11469 8487 10470 26948 17452
17908 17452 6268 20499 21832 20332 23777 11628 -17660 -15807 1437 8637 20608 17507 10131
17895 10131 3593 -2963 -18264 -7985 -19448 -26978 -12370 7235 11207 -3607 -26954 -28880 -18926
17882 -18926 -8558 -6012 5541 21915 14661 5416 -574 -16458 -42697 -57793 -31875 -17859
17870 -17859 -21524 -26396 -11407 -1861 -2811 4274 7489 30 -18598 -31958 -44039 -39558 -41980 -40666
17856 -40666 -18402 -16285 -7547 7808 5314 -768 12080 15034 -3503 1391 8512 574 2003
17843 2003 8568 10268 14204 17990 21472 15121 -731 8319 2106 -1369 6782 8014 25492 18416
17829 18416 11969 18437 18522 17450 29505 25259 23561 41533 5809 -23645 -28432 -22350 -30302 -26768
17815 -26768 -13546 6598 3005 -5732 1869 16857 -2749 2049 12721 10162 9296 8414 -2953
17802 -2953 -17172 -15738 -5155 -11106 -18134 -27882 -33322 -26651 1386 801 8703 11469 8249 15944
17788 15944 7913 10881 9026 10881 26084 13631 9432 -10223 -15804 9392 2087 -7838 -3942
17775 -3942 2635 29132 39128 25759 11574 23624 22364 9248 18021 22806 38108 48805 46183
17762 46183 52003 52093 34137 35988 42225 68058 82006 89512 83796 69070 71121 70364 69650 48368
17748 48368 22353 12642 28601 43317 36089 28980 41565 54596 78709 80380 83279 88931 74538
17735 74538 50044 26700 29345 38926 39090 24448 29988 20669 33138 28115 30111 32378 12837
17722 12837 -9546 -15163 -4737 27789 45603 43493 46472 45439 63340 70405 66375 52950 60010
17709 60010 71747 77014 90659 106671 95720 85912 83388 80220 61948 57972 66256 67174 52256
17696 52256 37760 18767 25117 28613 38280 85186 102742 97906 101192 86378 56726 32071 49129
17683 49129 62170 36218 3640 -10222 6535 12009 12841 19567 27455 30168 18350 15514 30468
17670 30468 36118 41121 47631 49544 40658 34984 45376 48154 31555 17243 6850 28279 52079
17657 52079 53527 38313 39209 44385 64773 53761 39077 43587 47497 54386 35985 41218 46874
17644 46874 36626 37610 34226 27001 11496 -720 969 12192 9342 12408 9555 -4769 7371
17631 7371 627 -19932 -18035 -9058 -16577 -28823 -46389 -40414 -21917 -3973 -15168 -28597 -20584
17618 -20584 -26625 -30998 -44187 -37476 -22578 -24511 -24007 -15348 -15043 -4319 -3468 -12815 -1475 -8203
17604 -8203 -4857 -2213 -14004 8919 10626 6533 10532 -809 -18383 -35219 -27747 -15615 -7703
17591 -7703 -18216 -24325 -22178 -30695 -31449 -8583 13513 14485 22343 37317 31073 13285 2282 26770
17577 26770 31223 22975 7763 -15080 -2399 14058 16222 3708 -4869 -8591 -5089 -17336 -21110
17564 -21110 -5655 10475 10536 3468 4698 7209 -6608 -20139 -23980 -7232 3364 19677 46455
17551 46455 50161 18329 -3600 2173 4185 10982 11342 27482 37078 22084 22413 36916 12157
17538 12157 18851 -3432 -14148 -8167 7728 12999 6552 20755 29111 30001 21946 489 -25705
17525 -25705 -14233 -10238 5494 -788 2053 8972 54 -1736 -1548 14468 -7614 -31343 -33604
17512 -33604 -17652 -7973 -1479 22144 37847 37851 21567 11188 6300 -6849 1550 17954 27566
17499 27566 16304 -2719 -25584 -37074 -15814 -3603 -6816 -5504 -11876 13243 28397 27927 20574
17486 20574 -4184 7229 5161 8900 10030 -7102 -18467 -29553 -16872 -25340 -22282 -10304 -94
17473 -94 5347 -12391 -7709 17885 26064 25310 18495 1781 -7513 -11189 -8311 -16876 -21545 -30917 -26179
17458 -26179 -31834 -26726 -13674 -3404 3949 4871 -6819 -21098 -33393 -25257 -2417 6287 -872
17445 -872 -98 -2221 18714 51919 71286 119930 162362 158237 118049 87044 66375 41395 31072
17432 31072 20774 8669 625 2681 10634 6736 12554 -15211 -27597 -36936 -31677 -12357 -7935
17419 -7935 -19491 -922 -9954 -36514 -41433 -20416 -8033 -12949 -21032 -23800 -15741 -5216 -9076
17406 -9076 -22476 775 22474 6654 5623 -11332 -20066 -14923 -7800 -2183 -394 -1889 -7300
17393 -7300 -2458 908 1708 -3033 -9103 -1708 -6908 -20122 -14804 -24993 -24133 17369 34008 13929
17379 13929 12626 3719 -14348 -12933 -10271 -3497 -4255 -7766 -11948 -14305 -29032 -23284 -31117 -27375
17365 -27375 -34519 -39853 -13758 5133 5861 1619 4820 6520 10530 17820 14424 21931 40169 35179
17351 35179 14301 -1363 13712 8892 -9092 -4369 -2497 8242 9962 -9249 -22182 -10928
17339 -10928 -17572 -18471 -8165 -9337 -30039 -18067 -10901 -2614 7160 8500 19202 21647 17226 -377
17325 -377 -19411 -27624 -38381 -33524 -11904 -13391 -17925 -6997 495 -5083 -4451 942 -2324 2792
17311 2792 3764 -3885 -17405 -21081 1706 6382 -3052 2987 11010 22200 880 -28721 -37846 -8900
17297 -8900 18559 31197 351 -4370 13109 22297 26179 36689 15271 3295 25351 10262
17285 10262 -1887 -13646 -29640 -47150 -30895 -9384 -3719 -20110 -2791 -14484 -12986 5364
17273 5364 -2077 -28448 -34223 -25232 -20159 -16037 3882 5180 1577 2933 1396 9536 -2820 -11925
17259 -11925 -4226 -26459 -21833 -11367 3 -4676 -16028 -18431 -30091 -34862 -32913 -30728 -22107
17246 -22107 -30624 -28101 -31117 -23708 -16540 -19155 1947 2094 3915 6596 15137 -16947 -40020 -23757
17232 -23757 -7619 -13271 -16482 -10516 1114 8352 -5340 -6527 -7941 -10259 -13085 -27709 -15644
17219 -15644 -18749 -28827 -26174 -8918 -10303 -17906 -27784 -51871 -37129 -20923 -27771 -18252 -4829
17206 -4829 -14239 -14280 -12328 -8363 348 10859 2652 -22907 -23902 -10223 3398 -1070 -20751 -40369
17192 -40369 -38923 -23757 -8513 1943 26695 23165 6889 -4439 -16347 -17171 -1844 9839
17180 9839 34911 23973 16838 7119 -941 6027 10871 -11486 -9283 -7752 -16128 -28180 -33031 -34238
17166 -34238 -26779 -29293 -47274 -49729 -48393 -19636 -15485 -18928 -9954 -21324 -27105 3554 11305
17153 11305 10320 16717 17125 1789 -12024 -24050 -38256 -22645 -5535 -20975 -7964 1365 -21011
17140 -21011 -24547 -9785 2542 10285 26595 10219 -6617 -38063 -38940 -21250 -17465 -11317 1237
17127 1237 -11660 -22289 -27668 -24217 -23815 -17551 -8248 -16671 -39671 -31511 -5501 9966 -3576
17114 -3576 9046 31013 25731 7293 -13687 -2451 1615 7948 13769 -15331 -32887 -6918 -11686
17101 -11686 -14633 -17360 -32758 -38702 -46300 -29814 -27482 -32517 -26154 -25668 -13301 1277 -8942
17088 -8942 -29227 -43120 -60380 -55297 -44218 -36499 -23438 1564 -2429 -15444 -16135 -13117 -11754
17075 -11754 -13425 -1019 7658 4326 -3733 -5497 -8540 -18366 -26716 -27996 -9277 4970 -3732 15276
17061 15276 13428 1160 -12656 902 18264 15965 24479 32710 4784 -4437 25587 22282 25980
17048 25980 25539 19496 24777 30811 25037 18623 -4899 -7114 6268 20144 21822 9174 1296 -10166
17034 -10166 -17530 -24022 -28444 -18363 -40782 -39779 -20635 -11177 -4505 8095 22004 21908 39989
17021 39989 43635 17056 -4863 -12823 -22000 -23839 -11700 -21219 -19827 -14805 -25716 -22085 -19484
17008 -19484 -34536 -26547 -6682 4620 18582 6400 -27297 -25107 -4259 -14934 13477 19170
16996 19170 14521 1896 -27446 -27670 -25976 -25771 -24149 -4924 -8477 5474 24479 31889 27790 14257
16982 14257 8567 16229 29638 6173 2381 8425 15379 17183 -4656 -4329 4072 7029 -3404 1226
16968 1226 5647 11122 13198 17907 4210 -14473 -11005 -18272 7068 34513 25824 13689 -2471
16955 -2471 -3895 -214 3577 24373 38550 24515 3895 -7407 -31519 -40205 -25139 -17075 -10196
16942 -10196 -18711 -8896 -14387 -25935 -19586 -41685 -33111 -17681 -20536 -23070 -17252 -19038 -15791 -4131
16928 -4131 8644 5013 -3761 -7435 -10657 -1565 7398 -851 -20965 -32765 -27879 -4039 13363
16915 13363 5667 17216 19642 28804 30021 13575 3116 -8926 -7983 -11872 1057 24093 35260
16902 35260 19422 7600 2454 -7502 -1090 5919 447 2648 -7922 -7449 -17116 -8625 6526 -2194
16888 -2194 -8520 19517 19794 15657 16233 8089 1146 10542 16257 22891 18106 -2726 -22648 -27034
16874 -27034 -20101 -6592 -17861 -23031 -25091 -38359 -35690 -7310 -4881 -2246 4409 -5123 10486
16861 10486 8814 -4464 15398 1462 -3383 6184 6785 7101 -1008 -13846 6586 24572 42634
16848 42634 42517 25667 16643 7515 -584 -9191 -25856 -19284 -11373 -13520 1821 6594 10797 10215
16834 10215 4916 22104 49402 46855 46449 47918 55063 52689 44496 56216 52737 54910 46862 23542
16820 23542 -11797 -10859 -3054 -15809 -13677 -12609 -16411 1844 -8 -2298 -14467 -16432 1939
16807 1939 -2463 -1778 -9483 -2178 -7973 -9105 -13033 -8779 -3803 1986 4743 -2331 -337 -355 -15841
16792 -15841 -8731 -2816 15075 28566 40349 41345 29189 11957 22766 30249 35767 39651 23035
16779 23035 15263 16914 -7231 -27298 -9557 6532 7859 398 16005 27053 28907 37722 47080
16766 47080 27051 2367 17936 30526 19171 1931 -7668 -8447 3886 -11688 -1479 -805 -8307
16753 -8307 -11215 -3659 -1825 326 18584 15635 -312 -10210 -1080 14272 11331 12873 -4884 -13219
16739 -13219 2151 17924 26587 21120 11446 11666 17599 4948 5788 11997 23132 30647 40121 36610
16725 36610 18726 -9008 -20658 -36341 -27544 -13497 -10110 -9697 -3948 -6085 -1792 -16698 -17733
16712 -17733 -4315 -8831 -5919 -3026 -17744 -18088 -16180 -14448 -12668 -16276 -15242 -20220 -36457 -48520
16698 -48520 -41011 -26607 -18296 5562 20544 27914 4122 7544 27738 40517 26174 -5301
16686 -5301 -18105 -7436 -16757 -25878 -25902 -25190 -9592 4153 5120 59 -2322 -4668 25092 26894
16672 26894 -12910 -27731 -2650 8964 2870 -9585 4 -987 -11965 -7712 4644 16024 17214
16659 17214 -8984 -28629 -30701 -22985 -13600 -4403 25283 18306 25497 8275 -2503 -2895 2382
16646 2382 -4553 -25808 -44193 -58975 -43222 -13954 -4641 4120 3766 3389 11012 -3149 -14568
16633 -14568 -29051 -28727 -12458 -3681 -4733 12555 19689 4889 -6628 -941 7130 -2282 8380
16620 8380 11236 5288 3937 12703 -3150 2266 14056 -5498 -28029 -21889 960 3431 -3994
16607 -3994 -10626 5358 8096 6604 7530 2733 20189 7884 6316 -6245 -7772 9808 3486 -12021
16593 -12021 3592 259 -4551 -3631 -1202 2286 -16011 -27097 -17579 -4075 7340 690 -3090
16580 -3090 -15671 -38236 -40140 -19317 -21327 -10646 9139 17084 7926 -16192 -30849 -27087 -22943
16567 -22943 -22026 7564 18682 -4537 -19089 -20317 8800 -2215 -6542 14314 30543 32429 24183
16554 24183 5589 -4439 -19048 -18471 -20791 -29695 -21552 -27503 -25730 -16866 -25466 -19896 -15284 -26756
16540 -26756 -38577 -34608 -31939 -32801 -32246 -39349 -30517 3098 34741 47058 24918 3981 -18789
16527 -18789 -25335 -16636 -24030 -22695 -9546 -6337 -7800 13888 -1801 -5278 7310 27856 25487
16514 25487 14029 5027 6811 3537 -2842 -12620 -7467 -15601 -13696 -25244 -25245 -19366 1515 -17354
16500 -17354 -31381 -22318 -12713 3426 24119 29145 9249 -12727 -50211 -47874 -36948 -2541
16488 -2541 955 4164 22081 37607 27294 6074 -23240 -27307 -9029 10070 2423 838 2773
16475 2773 16417 17597 9123 6433 35 -10999 -11028 1365 1800 -11624 4051 9753 -15435 -31779
16461 -31779 -22277 -12944 -7027 -5335 5890 9554 10413 -7417 -21636 -27495 -23401 -23073 -15208 -20956
16447 -20956 -36757 -29828 -37393 -24942 -6995 -19071 -8768 -11744 -36803 -38053 -31206 -15943 -16498
16434 -16498 -10091 5650 -7271 -11271 -28402 -27871 -12482 -19389 -31023 -24630 -7962 -6181 3006
16421 3006 2705 9406 4371 4874 1584 -4956 -2208 4736 6982 -21227 -6371 -6476 -25909 -46022
16407 -46022 -41135 -26268 -36971 -30872 -20927 5425 -4770 -13963 -37109 -28494 1741 9545 -3086
16394 -3086 -38621 -48211 -37826 -26339 -22824 -53656 -65394 -57569 -47754 -36118 -9032 1265 -14728
16381 -14728 -31230 -32235 -41634 -51304 -54413 -42342 -32733 -35210 -54849 -51796 -49446 -43996 -33759
16368 -33759 -26234 -13296 -12121 -6031 -5437 -8261 -16066 -21402 -13489 -27532 -36204 -36966 -35224 -30995
16354 -30995 -1791 17619 3090 -10003 -12309 -17437 5555 15698 -1224 -17514 -22205 -25594
16342 -25594 -13539 -17777 -1835 2790 -10611 -5565 -10338 -13583 -5911 -3452 -17352 -20865 -18694
16329 -18694 -10812 -15501 -22721 2988 -180 2541 -11660 -25431 -24924 -14334 7992 20448 6273
16316 6273 -6868 -26554 -37306 -19062 -4770 -16009 -25569 -30863 -4445 -3567 -281 19887 16439
16303 16439 -4254 10823 15566 525 -922 1195 -2686 -14286 -20233 -11291 -27579 -32971 -47257
16290 -47257 -36446 -17231 -21697 -29649 -41333 -50854 -52926 -31686 -25668 -36223 -32896 -43852 -67845
16277 -67845 -77330 -58821 -21358 3149 -6156 3451 20757 -101 13251 5789 8980 24579 12185
16264 12185 709 11941 3662 -25773 -11818 -18521 -30426 -34164 -17139 7848 21744 15659
16252 15659 -5120 -15337 -2125 -9451 -27457 -36336 -39854 -14631 -4762 9552 13863 -10317 -16323
16239 -16323 -7434 -10758 10378 20352 10783 5397 -11956 -22788 -22991 -24261 -30879 -34449 -10551 951
16225 951 6334 10801 17759 10999 -3327 -10278 -15157 -25656 -38132 -50759 -39992 -35173 -36999 -33626
16211 -33626 -32734 -29708 -27101 -20486 -21316 -38322 -42486 -40496 -16306 16063 5034 2347 8361 15845
16197 15845 30599 32456 23944 23845 15084 5640 -17119 -20859 -13653 -16715 -14116 -15238 -19489 -18683 -31426
16182 -31426 -27063 -34691 -34104 -20349 -27672 -26784 -12893 -1742 6689 16188 -4083 -7614 -9996 -5602
16168 -5602 12389 25508 -103 -10140 -9937 -30898 -34762 -32572 -28850 -26087 -26342 -30266 -51594 -49698
16154 -49698 -12892 12055 9960 -14140 -5827 -8464 -28135 -32038 -35773 -14817 -19581 -35148 -34375
16141 -34375 -16773 -19555 -15432 -21305 -22424 -21085 -10165 10113 16776 14892 10267 11037 7017 4218
16127 4218 -2346 -2981 -8480 -15916 -17697 -8633 -4999 1118 4278 12674 6975 1091 21509 33599
16113 33599 20503 -623 -22913 -11696 13309 25390 12945 667 -9014 -8462 -13916 -18627 -15416
16100 -15416 -27059 -23591 -10136 -4084 -17404 -26324 -32730 -23470 2676 11680 -402 -1063 17771
16087 17771 -1608 -13761 -34899 -53604 -25504 11352 7751 -24158 -16244 -4651 -8214 -2245
16075 -2245 2089 9408 -3094 6061 -18458 -27801 -32145 -26176 -11190 -5366 11365 -4206 -12302
16062 -12302 -28001 -22828 -15223 -20019 -25261 -22759 -19316 -15048 2819 21449 21058 11840 -12070 -28146
16048 -28146 -41095 -42977 -30144 -8529 5453 18011 30222 33232 30416 11433 -758 12549
16036 12549 22671 12803 10012 -539 -4645 5055 11722 8412 2657 12595 11533 -486 3934 16071
16022 16071 15533 18393 21902 15492 13206 3848 -5987 -31657 -47573 -33981 -27229 -28685 -25747 -9853
16008 -9853 7476 12521 3162 7103 22052 1470 -14541 -9204 -25388 -28760 -30337 -24592 -32227
15995 -32227 -29940 -28932 -43311 -30251 -14078 7159 9013 21223 12305 5889 -4338 5697 28054
15982 28054 26796 23974 8829 -5977 -31018 -44572 -25880 -1686 3388 -2065 -6379 -2702 4768
15969 4768 9921 6708 -3592 1900 15820 23273 33471 28732 17659 10146 22469 34425 41045
15956 41045 32436 22554 16302 17264 17367 -7971 -19082 -34795 -28374 -30334 -31941 -41235 -41504 -22504
15942 -22504 -32737 -26023 -14987 4939 5674 1107 22473 28153 17809 13073 26823 5972 -3505
15929 -3505 1818 -8461 4493 20762 23564 8917 13207 20680 39439 59353 36379 1292 -9647
15916 -9647 -3752 12854 -252 -17618 -16825 -12070 -17506 -24963 -46446 -39087 -15554 -10288 -11485 1724
15902 1724 10576 1808 -180 14216 11915 14898 29830 23699 9720 -3178 -8440 200 -15538
15889 -15538 -30429 -21664 -8588 -8588 -16802 -9580 -14229 -19843 -21124 -25375 -43921 -43805 -42992 -28598 -1572
15874 -1572 30377 47421 42503 30344 27511 2058 -6908 -4965 -12911 -11780 395 -8412 -36404
15861 -36404 -37168 -28651 -20476 -14300 -9342 -18542 -20379 -23735 -25381 5871 18965 -17560 -27740 -3009
15847 -3009 -10105 -36258 -32416 -25149 -32563 -27708 -22838 -9058 -4173 -2370 3429 18986 15046 890
15833 890 -4677 4667 4877 13407 9716 -15009 -41596 -54242 -42036 -26302 -17872 -1126 -4365 -3209
15819 -3209 1621 2358 23671 28947 6368 -3219 3038 1889 -9315 3081 1036 -11470 -27380
15806 -27380 -30377 -39855 -35966 -17724 -15692 3036 10124 9739 13646 8559 18519 1688 4404 16712
15792 16712 8975 1261 476 9034 5695 -4503 -147 22849 26158 7831 -18035 -17460 -7135 -16507
15778 -16507 -325 -1558 -5858 -844 -8654 -15496 -24492 -12158 -3468 -11998 -22159 -9169 -7445
15765 -7445 -15654 -13711 -17372 -26363 -31894 -23114 -8970 -29400 -28649 -26026 -21819 -14932 2212 34858
15751 34858 33542 23071 20725 13341 5817 -5520 -17438 -11890 -3181 -2626 1450 2736 15076 22804
15737 22804 21277 6814 3726 -17341 -17330 -15044 -30637 -26185 -23838 -15571 -15631 -22352 -19772 -19572 -25584
15722 -25584 -32563 -35055 -14295 11819 19991 24126 10085 4188 -13974 -27793 -28822 -30330 -7061
15709 -7061 -1054 -7979 -29320 -19140 3606 -875 62 9399 -2758 -27331 -19247 -12758 -10608 -10955
15695 -10955 -6562 -14183 -16280 -25758 -39473 -21606 -18946 -24463 1863 8447 -5816 -5722 -7361 2624
15681 2624 26429 40753 43838 34395 28997 24043 19602 18362 15296 -12809 1770 26116 24161
15668 24161 7962 -41 -15639 -20741 -7277 -9259 -3992 -53 -19393 -15651 -335 -26484 -20342
15655 -20342 -20812 -19567 -9010 4386 -21072 -33544 -28285 -11900 -14310 -25409 -20772 1704 2160
15642 2160 1031 7960 17391 26037 24378 20830 16871 10521 7121 25734 26165 21568 25582 15418
15628 15418 14488 13181 30402 50875 43366 17877 -19279 -17198 716 7886 1405 4880 4343 -1740
15614 -1740 14848 18011 -4442 -39714 -47094 -30468 -25219 -8789 11421 -9356 -37008 -32049 -9212
15601 -9212 -5073 6260 -545 7109 -8963 -7464 -12537 -45085 -29583 -15976 -12227 -35333 -25980
15588 -25980 -7782 -26828 -29024 -24173 -24018 -29044 -14611 -5360 8545 19565 16062 -5224 -15631
15575 -15631 -14620 10559 22506 29176 14636 -1795 -11962 -15532 -22153 -15107 859 896 2641
15562 2641 -20003 -18136 3605 5483 576 3509 556 19336 44407 18941 -2141 11192 36145
15549 36145 62384 81554 83669 99185 134336 127494 107554 63660 32078 13993 -1958 -8817
15537 -8817 -12822 -20806 -17230 -14433 -10206 -1017 -626 -1291 6106 4264 -4383 -2614 5581 27406 35321
15522 35321 33422 26679 10345 3972 2028 3085 489 3476 -9488 -1050 -9895 -29132 -24241 -3109
15508 -3109 -4201 -19069 -6125 4757 -745 -11661 -18407 -22367 -16801 -17733 -18938 -23198 -21875 -8914
15494 -8914 -8250 -26842 -29167 -34993 -43129 -28766 1741 7181 4443 -5614 -11223 -18631 -11295 11643
15480 11643 11042 -11638 -29301 -23987 -16721 -23468 -19451 -5575 5506 9346 3913 -14033 -10087
15467 -10087 -14653 -23959 -23431 -13923 -37266 -28889 -11810 -18135 -24164 -40138 -14959 -13989 -19086 -5885
15453 -5885 3523 23150 44138 20633 -12262 -20763 -13670 -1881 11238 13392 3937 7484 5073
15440 5073 4937 28329 34290 12283 89 -18341 -9989 -10941 -11303 -18835 -22812 -8064 13673 23351
15426 23351 16645 22105 17233 10122 7190 -16072 -23044 -19228 -24027 -40759 -47779 -52282 -47848 -39159
15412 -39159 -20462 -5304 -9024 -19190 -16500 17060 26524 11479 -5711 3744 18160 11099 -1575
15399 -1575 -26988 -33025 -28964 -9414 -5217 -25513 -20855 -36935 -38393 -20531 -20187 -25141 -30477 -28446
15385 -28446 -29870 -35875 -32617 -17790 -6996 -4467 11855 11282 398 1526 -3821 -11327 -11725 -891
15371 -891 6878 2071 6050 3624 -853 -14035 -9823 -6560 -12675 -21923 -20974 -33923 -27438 -3157
15357 -3157 7005 6404 18274 20507 20476 17922 18680 17133 13367 10960 5084 4312 10486 3056 -3524
15342 -3524 13079 22727 20751 25292 11159 7451 -4579 -14857 -14407 -23030 -8384 5793 12696
15329 12696 -1354 -7929 -624 15777 33910 26242 31040 26676 19052 7171 -10668 -27282 -20101
15316 -20101 -23295 -15985 -11407 -10546 -17618 -2158 7271 14306 19711 20593 27991 28590 35579 13408 -7741
15301 -7741 -34078 -32649 -27183 -17337 9721 1479 13547 20314 27726 17272 8387 30788 34100
15288 34100 22759 4441 -8930 18578 18159 -15082 -25760 -26208 -16453 -15686 -8400 5331 10063
15275 10063 7916 10820 -5233 -13645 -5876 2894 17733 18239 -13650 -15879 11885 15640 8941 4359
15261 4359 -7397 -9140 -1219 2040 10740 12852 -1003 9171 5839 -1940 4131 7304 9380 3163
15247 3163 -18843 -33876 -45357 -16198 3552 22748 24309 30534 13822 13737 -1954 -16609 -30649
15234 -30649 -3717 3040 1357 15232 8637 12812 11451 21310 19833 7420 1088 7189 8710 -6548
15220 -6548 -18568 -6759 -2780 5922 -3027 -30600 -44292 -21737 1546 13035 7081 15761 17526
15207 17526 15424 11250 1085 6459 10702 18732 24586 29923 15397 19483 30264 19934 11570
15194 11570 12109 -10330 -22451 -22274 -7642 1913 -5963 -6287 -16589 -36686 -26942 -8133 -13434 -21558
15180 -21558 -4261 5147 -5369 -17201 -25360 -3803 32346 45887 27949 18844 22443 15891 12733
15167 12733 18358 20027 27460 26220 20426 3938 -8020 4036 -3291 -10163 -11090 -11152 7571 11919
15153 11919 -27764 -49143 -42825 -38889 -23612 1490 7238 -2777 -6371 -7833 -2079 -17238 -15272
15140 -15272 -18662 -5179 15400 13577 9288 15652 3394 5976 2546 -6618 -1301 26503 32713
15127 32713 23447 31440 9267 -974 2231 -2821 8786 -3773 -15031 -27520 -27748 -12029 -13425
15114 -13425 -12232 277 21599 31950 31769 17701 -6744 -19331 -4566 3549 11402 25802 20789
15101 20789 15186 1627 1931 -9755 -13877 -1788 -5305 -11967 -10376 -14377 -22214 -27797 -15809 -2011
15087 -2011 -16143 -21651 -25025 -7891 -8085 -12780 -671 15080 7917 26808 39952 30902 15924
15074 15924 514 3942 20965 20951 14719 1989 2093 15918 21288 3044 -7500 11060 16928
15061 16928 -4902 -14221 -1986 4574 -601 10146 16560 28725 41438 15838 3175 9048 15249
15048 15249 13519 42508 58690 46718 27446 42910 50440 46244 43303 38871 32922 26958 37433
15035 37433 31722 17339 29505 37801 50049 41566 42224 43563 38747 38892 49540 71283 80937 82888
15021 82888 110933 111866 118171 130689 145601 145897 133850 126082 126559 142356 155269 163183 162281 156976
15007 156976 150281 177794 206123 227493 253488 292026 386457 513374 647968 800254 972379
14996 972379 1204668 1502883 1913987 2584763 3743695 5908424 10213697 17809805 24845060
14987 24845060 24763307 20873970 15224054 9472019 5814292 3870812 2833608 2200010
14979 2200010 1756691 1441624 1188354 1016662 897041 798621 718178 650818 588637 513576
14969 513576 439919 392777 346370 309886 282210 236775 212574 211071 211178 182682 146556 136126
14957 136126 101798 103960 118606 121434 84636 65531 73970 89313 78016 76189 73456 76070 74590
14944 74590 74314 69826 61899 50199 49109 65248 60051 47216 33962 10699 15353 9085 -8200
14931 -8200 -19845 -28305 -14213 5903 -957 -6685 -16748 -20819 3786 38832 27150 7607 4492
14918 4492 8377 7365 10762 24906 36486 45038 39185 6050 17070 38001 30138 20333 4024
14905 4024 -11425 -8246 -18967 -25560 -6724 -3177 8240 31447 36647 37874 30395 15093 21457
14892 21457 22574 14372 1819 18 -13559 -26441 -34260 -24531 -11803 -10414 -524 -10412 -183
14879 -183 18870 9614 14180 8165 -3796 -7895 -5138 -1468 -21943 -34632 -34798 -19099 1766 -2188
14865 -2188 -24136 -22615 -19904 -14893 4886 11764 -74 -17649 -26386 -20190 -439 2577 -11970
14852 -11970 -7326 -13497 -43189 -38322 -30699 -19829 155 9332 10915 7692 -11894 -31389 -22632
14839 -22632 -4397 -3362 -13002 -11301 -17660 -4164 -13809 -21905 -14799 -2597 20805 10710 -11175
14826 -11175 -8450 -1302 -1342 -2146 2976 19454 38720 22854 17894 22619 20028 26288 15144 11650
14812 11650 12733 13474 39226 49378 24434 10090 -3673 1027 -4878 -6868 3282 -284 -14817
14799 -14817 -7258 3897 -188 21690 14467 -16961 -35338 -33731 -18434 -7927 -12750 -19188 -9450
14786 -9450 1701 9915 7129 23649 26199 737 -5829 -7080 -7296 8658 3395 18806 8683
14773 8683 -127 13686 17608 2248 -7610 9848 14068 26473 10176 8140 10078 -3899 974
14760 974 594 -9049 -11574 -7432 -11878 -9480 -13888 12015 29602 53949 50509 38606 9576 -3173
14746 -3173 14923 20878 22003 26287 19644 -1076 -21505 -4348 10287 1965 130 -19417 -12942
14733 -12942 14700 56510 61467 60776 45615 32280 12462 13363 -5790 -35440 -39242 -40664 -19538
14720 -19538 -21504 -24018 6813 39655 31526 19382 18299 4292 -8821 -19764 -10874 -26525 -19302
14707 -19302 -9542 -20498 -15199 -20569 -21499 -12060 -11550 -1040 8072 17442 4953 2639 19713 31809
14693 31809 22710 3714 -17428 -14436 -23725 -20086 2300 10267 -12303 -23206 -44325 -32648 -16787
14680 -16787 -9022 -11222 -3844 5392 15386 21059 33541 34569 10219 -7205 -3043 1800 -4299 -2968
14666 -2968 -13199 484 7610 18733 7310 -10889 9796 22364 19061 21700 13390 -5311 -27322
14653 -27322 -33795 -23543 -8544 4150 29360 15456 2973 3241 -6603 -12653 2855 19021 2565
14640 2565 -13926 -13996 -10701 -8405 -9577 -14346 11 3344 9275 -2591 -15063 -20305 -10224 9326
14626 9326 10213 17931 33082 42095 38848 18944 1778 -9151 -21925 -20971 -27021 -25936 -11059 -12881
14612 -12881 -27282 -27463 -17750 -16065 -16204 -10703 -20529 -43458 -43431 -52405 -30805 -9840 18103 11895
14598 11895 -2630 -5280 8198 -12422 -22472 -12012 68 5401 15017 8746 1751 23660 28083
14585 28083 11820 -24592 -38086 -38761 -16313 -11522 -9421 -14077 -10348 -11416 -11269 -14412 -20577 -15770
14571 -15770 -11346 -11675 2965 14306 22717 7956 12383 13741 17014 22142 6938 2845 7607 15650
14557 15650 12822 3509 3630 -3990 3307 25878 16129 425 -5657 -738 27382 23939 537 -16692
14543 -16692 -12767 16748 22388 37947 42639 24130 14768 13124 29856 17884 23041 23356 14166
14530 14166 3763 5747 -132 -3367 13 -16491 -3954 8767 8601 8764 3011 6224 1267 9859
14516 9859 993 -10443 8583 11257 3703 -9065 -13712 -1230 -538 -12718 2690 969 -7769
14503 -7769 -14479 -18762 -20610 -18111 -1578 -3991 -15125 10100 16928 -3314 -11635 -20220 -23719 -19211
14489 -19211 -12952 -22121 -29550 -28691 -29331 -29433 -8659 -2590 1285 14346 24644 29990 25537 25489 21929
14474 21929 -3628 -20363 -5096 -4024 -2839 -6326 14262 34561 38426 15870 11265 20137 24047
14461 24047 20716 9354 108 -10511 -9992 10082 466 -15087 -2116 2369 -186 8207 12828
14448 12828 18427 18284 -1343 -18108 -26897 -5755 14070 15874 15149 11112 13125 4671 -4048 15409
14434 15409 24385 25114 31289 28210 21520 13280 6264 7391 26216 41488 54054 77760 122387
14421 122387 126743 104943 88078 50234 2946 3193 14634 34781 41567 36675 39710 37559 25497
14408 25497 24463 -2032 -3261 8022 738 -12151 -9564 -7862 -14126 -33343 -38376 -23748 -22011
14395 -22011 -11738 -7926 -2222 2117 9405 10156 19037 35015 35886 27553 27389 19825 15398 11681 12882
14380 12882 27424 44988 53696 50482 76804 99312 85843 73592 52297 41815 28598 28431
14368 28431 23127 15516 14809 13855 8598 430 -14122 23814 11688 -937 8070 12995 10865 34213
14354 34213 29894 -1183 -2205 -8128 -13441 -4040 -3388 -12605 7827 13001 3708 -9934 -29547 -35667
14340 -35667 -29512 -11322 -230 -17522 -24567 3256 16013 -4180 -8337 -6569 -16607 -19120 -3425
14327 -3425 18102 31754 29580 24930 34346 35638 17396 510 22561 -2279 -3490 19975 23402
14314 23402 18866 15007 10497 23422 21125 17184 543 -9338 23109 35796 23657 18736 4110
14301 4110 2683 4840 18082 47553 27781 23274 19403 9430 14833 15607 -18463 -54256 -47624 -26990
14287 -26990 -22137 -5179 4220 20103 9003 11173 7689 -5964 -18153 -12146 489 16825 20531
14274 20531 22872 18523 3329 -11182 11441 8238 2065 -7155 1050 21394 32500 16424 5022
14261 5022 368 -6148 -8698 -3960 8416 9581 2417 -14412 -19781 -19722 1386 13315 26243 7600
14247 7600 2939 27243 11901 1037 17272 17050 15635 4570 2935 2169 16831 11706 10375 2765
14233 2765 13373 33111 41789 39571 45199 40365 34316 14660 -4059 -8630 16776 15885 4928
14220 4928 2999 6276 3773 -3591 -2486 -13032 5635 4193 -7901 -1938 -140 -3817 -372 24052
14206 24052 19306 -13846 -13945 401 23622 40876 32114 24904 28615 22237 19528 3325 5156 13949
14192 13949 5608 10607 34072 33353 8780 -14250 -8908 667 16992 679 5965 -524 3882
14179 3882 11047 9689 16646 22553 22238 21136 24874 27335 14586 -7664 -5079 742 -2084 11205
14165 11205 5862 -2535 -5670 4825 -8198 -7936 -17167 -19421 -39992 -39326 -11492 8670 18808
14152 18808 18397 -41 6304 25695 25225 29643 26215 25666 13906 11557 3054 -22792 -25659 -14152
14138 -14152 -3208 15364 18023 28917 34593 36128 20241 29450 23965 -819 -5436 -11384 -13562
14125 -13562 -17049 324 15898 17747 5688 3169 3987 18442 -2205 -18018 -28393 -14632 -16284
14112 -16284 -17831 -3800 2380 9308 17374 28813 22347 -3476 -3988 -2877 1935 11408 -9216 -16034
14098 -16034 -26101 -28493 -24099 2169 13392 13637 -7342 -7587 -21288 -31167 -30040 -23781 -28968 -14011
14084 -14011 -983 2397 -11199 -32628 -11767 18870 28850 33502 16384 16631 22705 23800 10436
14071 10436 12137 9310 10180 2601 -6402 -20738 -36077 -38024 -27811 -20701 -10981 -2012 6846 34812
14057 34812 24151 773 6112 -6683 -25216 -15661 -14361 -24181 -15217 -12595 -25331 -26664 -11519
14044 -11519 -1357 2208 -15445 -15489 -23438 -15254 -11595 -13708 -10234 -10765 2699 13551 268 21829
14030 21829 32975 19324 -5576 10893 20504 17488 -2119 20636 40921 31000 23959 13914
14018 13914 -14548 -9235 -1378 17394 22989 20550 39354 51328 50163 39942 21780 9005 7722
14005 7722 24732 23468 17586 3549 12740 44519 40584 34790 28954 26374 9195 -15124 -18485
13992 -18485 -20195 -11225 2498 12972 15132 20452 38943 37572 11354 -1692 -11167 -4647 11102
13979 11102 27450 29293 11243 2424 5182 -1892 -6771 -6461 -5930 11989 6416 27065 64919 77556
13965 77556 72692 70577 59666 54362 72409 74262 72894 63028 54918 35087 27622 20944 8960
13952 8960 3774 3759 15581 21881 9864 21149 23681 14507 7236 11358 20426 11682 5527 1677
13938 1677 -6140 -9353 -7871 -3053 -4846 -10441 -13728 -5435 6088 10475 3925 3872 291 -14012 -4055
13923 -4055 5890 -579 -8384 -2719 -2810 -25014 -23266 -28822 -15838 9055 1816 -30876 -20381 -22851
13909 -22851 -23183 -19443 -29005 -23071 -11882 4529 7639 -9410 -7895 -9789 -541 13116 -3990
13896 -3990 -16904 -7527 2356 15541 -3081 -3748 8234 627 1638 -3206 -3263 -26020 -38430 -21193
13882 -21193 -2828 22077 30141 23433 12658 3620 3102 -20138 -15229 12613 1644 -8646 -9079
13869 -9079 -13408 -12017 -5546 13482 5072 13976 39932 49949 47149 46390 47514 30570 33430 21381
13855 21381 32846 15211 14318 -326 -7507 3190 2215 5124 12343 13462 20133 23785 27098 31232
13841 31232 25502 11429 3588 -5175 -15048 -14496 -4069 7935 18696 4179 7143 8995 6987
13828 6987 7730 7489 -16929 -38638 -47271 -34740 -18625 -13089 -24215 -10741 -12689 6945 26242
13815 26242 29470 14238 4722 -10966 -19350 -25852 -27313 -23223 -11285 -20214 -14072 -15421 -10526 -23092
13801 -23092 -21706 -16279 -17541 -23585 -12601 11329 38048 51781 16190 -21918 -26728 -16344 -8708
13788 -8708 -17190 -6861 12488 17759 14699 6802 5546 12268 10982 4879 9656 17662 14102 6508
13774 6508 10644 14850 1613 15167 3471 -1184 -1862 1607 -9362 -15713 -11941 7948 17630 14194
13760 14194 9620 23178 28141 3640 3806 3370 -12391 -10204 2221 7915 13523 -617 -11504
13747 -11504 -5661 4593 8002 26415 16277 -1647 -15174 -8793 -6798 -1138 299 9578 7279
13734 7279 3844 -8938 5291 9714 14156 16770 17566 14154 10648 13503 27075 25730 27857 29125
13720 29125 1534 -9295 20208 24158 17286 5102 14739 6858 -10749 -8741 4565 -8220 -13845
13707 -13845 -23647 -28734 -23240 -18347 3057 15436 14656 11272 8784 13294 7534 18971 20405 36957
13693 36957 40406 21755 20588 21477 13601 3603 -1428 10779 22889 34832 40692 16614 -8272
13680 -8272 -8534 14000 39882 23988 14910 20766 31866 11828 16819 17377 6012 -2384 -21965
13667 -21965 -23568 -30695 -25426 2513 21858 22151 32742 36248 29318 25039 22939 28516 18369 15303
13653 15303 16185 -1510 -10464 -3775 -12167 -20409 -19717 -29020 -37809 -14928 3891 -407 -11057 -21542
13639 -21542 -28046 -21638 -6238 -3435 -7765 -8722 187 3415 4983 8576 9319 -6475 -14480 -6915
13625 -6915 -27433 -39101 -36903 -35909 -15743 9112 26228 40303 32090 11769 1077 10558 17045
13612 17045 18779 14888 14954 24032 31672 17196 -550 -12369 1263 -710 338 -9762 -8896 1086
13598 1086 12429 6114 9101 -3850 -15747 -1569 13784 30517 12312 -17159 -16002 -19872 -43611
13585 -43611 -47409 -11079 -12693 -19784 -11215 -1320 19143 14223 11404 15639 12849 9171 14873 32692
13571 32692 34240 7603 1628 -2719 -29205 -45710 -31300 -24366 -12646 1989 8453 24651 26601
13558 26601 14369 24848 34717 37447 40374 26773 7239 -6898 -1358 4498 1491 -2714 7016
13545 7016 3964 -12598 -8605 -13990 -15528 -4874 -5239 -11493 -14821 11001 16977 30797 38903 30916
13531 30916 31244 12370 6307 -10537 -17306 -1033 14079 16535 12349 -7299 -9719 -11684 3542
13518 3542 26981 21861 10753 -3022 -8432 -7948 2722 14080 4285 11091 10010 17138 14851 10730
13504 10730 -2203 2533 -8818 -15444 90 4379 17403 27860 25852 7366 21791 31580 29596
13491 29596 11436 20435 41552 45827 22041 8720 24201 35997 39631 40041 32452 34210 39161
13478 39161 34388 37065 52132 45479 17392 -1675 -11858 -1038 15281 556 13314 10497
13466 10497 9839 23193 7164 -2570 5237 21072 16958 13710 27231 32666 2178 -6199 -18880
13453 -18880 -4449 1606 2811 14290 -4088 -816 12610 8062 -8168 4577 12759 3595 3005
13440 3005 11296 7274 10939 4024 -6093 -5398 -8917 -31523 -31074 -24525 -13863 -4278 -13038 -1544
13426 -1544 27380 16263 -5144 3275 8475 -10787 -16505 -606 10043 28681 34411 37885 8896
13413 8896 9265 23296 14561 15228 22622 6248 7340 14661 768 3370 -3460 -3303 -8664 -9455 -19065
13398 -19065 -17462 -11637 -6013 14677 17458 13527 14533 15580 17965 12608 29395 28720 29045 26783
13384 26783 22003 25943 41206 45450 28984 25052 11928 -7098 1234 372 3900 -1072 -4398 -7020
13370 -7020 -10773 -5754 10053 24842 21165 16192 7478 11954 5133 8438 20319 25048 14951 11315
13356 11315 7684 8475 18345 22457 16001 7880 -8900 -3288 23965 39129 46296 46799 56074 33030
13342 33030 32969 49909 50496 35507 27839 9868 -4401 -377 -5317 5816 -934 -9032 -2330 32308
13328 32308 42309 21707 14945 29131 30949 12527 9861 595 -8182 -13 2111 -2173 3760
13315 3760 4246 -11011 -7964 -14321 -5450 9639 17250 21661 20182 3800 -21788 -7414 12865
13302 12865 20716 9918 15181 11417 21402 23771 17503 19906 8213 4652 -2309 -11034 -14765 -14212
13288 -14212 27839 61074 52902 43533 32704 15110 24273 26504 14303 -267 -10748 -13707 -12895
13275 -12895 -17726 -15648 -6955 29140 43269 18143 17183 18833 43085 53598 61052 60232 43319
13262 43319 18949 16685 20775 2839 4732 20669 14579 31398 32927 44846 35903 10559 1367
13249 1367 1465 13343 9887 20382 29098 20223 33805 43141 30579 8653 21190 16501 1776
13236 1776 -20661 -10451 16007 7995 16921 6812 -6576 7580 10282 8409 -17967 -30952 -23259
13223 -23259 -4061 -2740 -7893 8944 4075 -6993 -5395 -2351 -3140 -5917 21051 30905 2746
13210 2746 -19405 -4693 11211 33458 6296 -12828 19782 25750 5559 8752 18336 13725 8437
13197 8437 19592 34326 33630 38011 37811 52634 40207 35614 41657 32339 12294 10141 6188 9184
13183 9184 16608 -883 916 21340 31451 25344 -2218 -12041 -5379 2137 36252 43665 37078
13170 37078 37270 27739 21439 20747 20790 29957 33634 16453 9610 21882 40797 36712 28719 24344 21012
13155 21012 17654 35861 32630 9205 -11319 -3688 11067 17960 27636 14447 -8974 -30037 -41433
13142 -41433 -19011 -2531 -4313 1492 9159 29161 32234 21355 -1432 -9576 -20281 -22807 -4358
13129 -4358 23196 15293 -2938 23076 27763 20694 22086 16487 -1688 -7967 2330 -1941 -270
13116 -270 6305 -6527 -6108 25497 53686 42516 36742 16988 -3102 -14361 -16762 -12687 -14435
13103 -14435 -6754 7586 -7040 -31191 -21890 -4088 11505 11864 10763 10314 967 12216 24415
13090 24415 21370 17551 9843 13772 15547 11588 14291 32733 43382 37037 23916 16313 10498 2377
13076 2377 11463 30738 38926 31068 16697 -9764 -29067 -28008 -15394 -3565 -2456 -14261 -19521
13063 -19521 822 19244 20232 13613 11644 9570 -14508 -17 9196 4141 8954 6858 11729 1156
13049 1156 -7527 19843 34809 29849 12850 14164 19285 9696 11409 11914 9834 10562 7658 -7097
13035 -7097 -23653 -24236 -4907 44142 38809 30931 25082 12191 -3726 -19233 -22089 -28925 -26950
13022 -26950 -17677 -4709 -5540 -3937 18337 17393 26504 18449 -1716 -22668 -14482 -2027 -3105 20129
13008 20129 50223 26616 14931 10788 4952 22283 25756 20855 33435 35617 37497 22134 15707
12995 15707 21038 25133 23476 33545 39277 9986 9134 15402 16523 16878 2014 29020 28288 34630
12981 34630 22032 13314 23433 38994 31868 23465 20317 40015 34886 28702 43551 46474 16859
12968 16859 14256 13184 11710 5449 21163 30556 37122 52158 51018 46069 27765 11521 16988
12955 16988 25146 27468 41965 53011 31059 13102 9468 17297 36987 39656 36829 24763 26631
12942 26631 21322 26582 42712 48111 45231 30903 24291 21960 4301 -2421 -1289 -14742 1877
12929 1877 28719 45130 39812 13966 17578 16890 -687 11432 15135 42560 36516 21242 31267
12916 31267 24573 -500 11893 26040 36768 33452 31623 15430 394 7632 21296 23161 20236
12903 20236 34809 38734 40856 50261 68217 69767 56763 76525 89333 88676 102520 122755 123482
12890 123482 149610 208741 259347 329836 452179 585476 713565 821346 886545 852647 788691
12879 788691 705219 576616 460688 385659 293617 211872 157387 145278 152014 143837 123980
12868 123980 114535 91663 78060 73624 76622 79754 62785 51733 43075 34357 49360 65907 64860
12855 64860 62745 54477 70073 74173 51309 44897 60351 76038 97116 99505 88681 77954 64964
12842 64964 64786 56976 52816 53541 45973 33369 34958 41676 33122 24025 36229 42562 39802 40719 36139
12827 36139 44251 72174 76377 76292 70677 62927 47634 44956 55829 74607 64648 52571 59412 54789
12813 54789 43406 38679 32592 55576 54276 55984 63820 54811 50219 48811 29412 25201 29844 37929
12799 37929 56648 59717 75708 78185 71239 83005 80551 71086 53255 52252 59066 64017 58464
12786 58464 53324 48433 57349 55653 42189 32292 33075 55645 72960 67949 69702 52563 36109
12773 36109 35580 52019 56409 71896 65851 55595 63977 76678 93802 85098 75138 59079 57550
12760 57550 69885 79110 78102 77919 56442 52096 63087 77540 59577 42896 37712 54761 60853
12747 60853 56289 65921 85376 85419 88535 87338 67581 63681 58664 52214 66823 83895 85242 92223
12733 92223 77599 61451 63440 82870 88417 89992 82050 97868 112730 118004 113263 90930 90496
12720 90496 122466 139072 139636 167658 167209 144046 121907 106071 98724 110790 115179 88167 68218
12707 68218 80763 86148 78142 82555 83153 87761 95998 76561 56500 60956 68283 79051 91926
12694 91926 93910 88286 112781 118365 110170 110271 107129 113179 126672 109804 107961 112062 101052 92967
12680 92967 106701 89536 80871 71241 93654 101186 105494 96214 62483 46122 48054 42240 30055
12667 30055 41598 40684 50368 57914 55136 58349 57489 63376 79547 94499 96562 100384 102723 100168
12653 100168 89400 74274 54335 39072 18922 1774 -2943 614 22248 36780 42924 28525
12641 28525 21734 38175 35109 20573 9833 18651 6801 18403 33833 44898 55802 41095
12629 41095 27540 43053 58518 62063 55513 52543 49987 67751 87508 88345 104819 136156 166440
12616 166440 171305 164798 148635 146735 148346 148065 149852 136751 119006 125215 146204 126737 105714
12603 105714 104613 99826 92053 84600 82338 58471 49583 37852 31851 1033 -27316 -1031 50019
12590 50019 72333 92073 119004 144577 161344 180829 184476 178036 187648 192987 188701 207406 216353
12577 216353 229179 216376 209744 187526 166160 167623 185960 192107 215205 223502 219705 203552
12565 203552 196357 186917 169119 182464 206812 209090 200911 191389 206500 197388 204660 214432 219009
12552 219009 204337 205858 224466 254517 261182 262496 259418 256488 247731 250426 242433 231445 245267
12539 245267 253270 256047 258652 268155 265929 273601 290146 306801 317965 319996 317244 341033 360253
12526 360253 379341 411419 429948 448336 487138 525009 548760 565031 603899 605875 602143 605831
12514 605831 629003 659196 670514 674791 686137 728793 756825 770443 811720 842790 864151 878671
12502 878671 915648 966515 1054735 1132562 1203699 1289385 1408316 1520663 1629113 1717083 1810758
12491 1810758 1913864 2022712 2161398 2349570 2568956 2821129 3093992 3447226 3918416
12482 3918416 4560670 5419793 6437595 7620841 8882256 10137639 11312888 12453218
12474 12453218 13725326 15364634 17733507 21382431 27108868 36217011 50639933 72377293
12466 72377293 101239901 132562407 158491487 172453794 172334997 160321115 140613166
12459 140613166 117202168 93303491 71753152 54152169 40905757 31665856 25538921
12452 25538921 21570663 18982126 17199968 15822662 14555603 13266008 11945981 10638005
12444 10638005 9342566 8120843 7024139 6090190 5300063 4664626 4166196 3768253 3436610
12435 3436610 3139276 2866890 2633995 2426828 2252141 2109602 1978843 1863347 1769513 1714004
12425 1714004 1628492 1523119 1421687 1325320 1213653 1121829 1022970 932558 885329 844504 807182
12414 807182 792701 772475 722265 690814 655533 608600 578518 549444 527390 508724 480829
12403 480829 462923 441507 439094 436337 461097 472993 468036 463803 441432 418753 389173 352585
12391 352585 294840 298863 303688 296648 301359 285103 266025 273634 288921 297571 272121 255689 256397
12378 256397 241212 218558 199733 202127 188554 215934 223532 236169 238949 249011 246944 235478
12366 235478 219934 221606 215761 197364 172972 157928 148188 144075 143510 137523 126529 111397 126342
12353 126342 131538 115558 105635 103652 101442 94366 77006 75929 69943 60317 58645 65810 58921 52985
12339 52985 90602 119297 153929 190012 251296 273451 269361 257486 224725 193741 181534 173201
12327 173201 172029 142656 125959 125629 109138 105185 98678 69830 59023 51368 54678 62742 50466
12314 50466 31377 25835 18816 14023 16197 19899 44247 78310 97827 99056 109448 103727 103685 115767
12300 115767 118645 112758 126543 142641 133611 128278 136322 142362 138607 155596 164197 162019 136048
12287 136048 142765 143781 150175 156635 139814 112024 113331 127267 126732 113876 88667 107265 129115
12274 129115 133103 125934 107009 97686 93040 68355 41624 28947 55602 82746 83767 92180 91313
12261 91313 86875 100950 103326 77147 66272 57231 39878 51054 53343 41514 40492 54716 65486
12248 65486 75959 57161 43396 65212 68882 77430 98366 100428 93806 87315 76195 76361 86159
12235 86159 90476 91836 84604 90442 86100 83648 86376 95845 114432 110545 105730 107276 98781 106421
12221 106421 103170 99759 98945 83811 90218 111110 101927 96944 94159 98693 95737 97047 111895 109133
12207 109133 108191 128479 125891 98402 79079 83980 107206 115579 104463 102033 93266 98849 104937
12194 104937 95367 94646 100824 114268 120409 136753 124116 111963 115714 108464 102345 103746 94099
12181 94099 74374 80552 98227 108094 84469 85637 88887 73623 81118 82636 91290 107593 104328
12168 104328 109197 101768 82264 63751 52871 52360 61605 62276 78347 83825 73816 81504 80477
12155 80477 77874 91658 100165 85065 70137 78763 89442 86044 79839 68902 75898 61361 68576
12142 68576 75088 63757 61713 46773 47494 57548 69520 75169 90077 78040 68531 76610 86588
12129 86588 89420 65107 43407 40332 52763 67314 45303 49483 61813 71165 71517 47563 52242
12116 52242 49215 40989 46670 59245 69999 69588 101858 162173 178732 192825 168849 131641 99240
12103 99240 63314 42869 47796 42052 42704 49719 53182 52902 38469 26893 35045 27689 29533 56399
12089 56399 79195 78713 72995 59442 60249 68012 68418 72097 71681 54514 31883 40736 51025 44311
12075 44311 59911 67549 55545 54704 40249 34069 53325 48560 51245 52638 56743 73851 79910
12062 79910 88121 75112 60885 76939 89046 82732 97771 100624 101057 96722 94387 96511 120896
12049 120896 148478 162599 184613 202581 219913 235935 303541 384283 480009 581425 711272
12038 711272 827837 894954 878427 816401 716410 616808 517938 424948 339728 274101 234392
12027 234392 203361 173662 165742 171186 174941 156114 130402 123866 101493 75861 75513 106635 104150
12014 104150 107769 98063 75360 85366 91014 71476 62482 46414 61162 68271 54584 65421
12002 65421 78012 94624 99872 90538 82920 63852 44321 44017 42116 45260 74383 96952 88407
11989 88407 87531 64882 54340 60476 60839 45244 52805 33775 29130 46636 43933 35142 40116 42655
11975 42655 32488 31645 39384 44483 52815 52754 51744 61652 70646 64672 46104 57392 66036 80939
11961 80939 70359 50777 43317 47505 46473 66811 71519 53750 40654 42928 53397 63812 71911
11948 71911 80558 64325 60989 70997 68285 60400 62893 71656 77208 76077 74613 75521 62127 37161
11934 37161 36789 40825 44282 47763 37761 28499 49131 55192 64037 53995 43266 49314 56808 56347
11920 56347 45196 44966 36888 23744 24778 50849 54412 49175 49064 46734 56473 63645 55481 54522
11906 54522 64958 66242 44399 45811 63005 62666 47483 55753 67499 64028 72583 63439 67156
11893 67156 57101 50962 52804 47056 56742 63284 58283 67123 48056 35297 49956 54472 70119
11880 70119 63199 49162 44378 47632 43852 38592 29464 20330 26315 46916 48012 35443 31700 32147
11866 32147 58972 77044 70009 60886 47211 13812 11177 44486 80471 100681 90701 80923 78625
11853 78625 69485 66466 46703 30333 34658 51096 52038 55371 45067 41788 47321 44729 47892 60846
11839 60846 76144 89184 92480 72469 67454 55772 50772 42337 50118 57642 69453 59018 54260
11826 54260 62611 64442 60482 68272 70014 68177 77718 96008 81160 52537 35557 39079 52633
11813 52633 42748 25337 23897 31284 29919 31341 53244 88688 87502 78017 71523 84311 94875
11800 94875 100614 88515 75433 76962 70914 79442 84378 82388 72650 67954 86757 90234 98244 102008
11786 102008 87243 71922 71474 73810 82278 72383 74234 64724 63284 62795 81264 94830 85209 74632
11772 74632 78873 84846 84589 83126 72966 69256 57857 59598 80189 88888 86140 77681 76585 86410
11758 86410 112686 114171 69140 38425 32888 48025 43568 29500 18716 23164 24894 21973 19042
11745 19042 60200 63905 53953 61550 63141 60301 70161 59813 66397 67695 51576 64644 60264
11732 60264 48129 60911 67291 88696 96322 83552 96632 120280 106680 73156 58580 71957
11720 71957 76382 92993 80030 84463 67271 70634 74295 69106 82296 70221 57398 44858 53108
11707 53108 63648 69304 80914 94803 85713 66217 66615 72373 72784 86616 99427 98493 96112 91659
11693 91659 85562 79825 79290 91070 102817 97048 93647 101962 88122 59784 80519 103506 107283
11680 107283 85872 88685 80091 87826 86782 98669 104139 99690 95783 83615 61829 72434 62986
11667 62986 72495 80558 80578 85504 91712 82825 73473 76958 66864 63881 69440 71105 69970 81764
11653 81764 76754 86465 96719 98300 89789 68418 62723 58445 67154 89460 104791 117930 124811
11640 124811 126279 127398 129191 115046 93256 76326 89946 84230 72882 88129 98040 92956 100899
11627 100899 100269 87950 86926 102725 121570 116754 107851 115076 105730 94677 77979 76858 64555
11614 64555 66378 76465 88022 91278 93915 87318 98521 109322 108555 99317 102703 105558 98082 81607
11600 81607 64252 69998 87824 98768 118100 111587 107506 119743 125329 112196 108302 116755 115334
11587 115334 110816 102049 114343 126167 127250 121184 109935 114408 111087 110658 110448 114352 99926 112205
11573 112205 119226 113947 106416 99650 107533 132766 125676 105286 109604 123559 123403 106479 90735
11560 90735 93397 82323 65009 80859 90544 96891 105018 108662 94698 79906 87493 111245 121218
11547 121218 122664 113156 117792 128498 115920 100882 102538 102262 96877 103932 97676 101772 123339
11534 123339 129747 107281 97733 99716 98559 84491 67305 68460 89666 94973 82639 98376 110141
11521 110141 104003 83560 66835 84892 110658 118440 118248 141491 116278 100275 96478 103039 104459
11508 104459 91749 88666 101431 125770 134665 125451 156339 170672 182439 161422 146443 140393
11496 140393 133731 146028 133104 112101 115000 105579 98725 106678 109514 119563 143621 150294 153037
11483 153037 142857 146714 164625 160701 140886 129630 141676 125260 123061 128276 151028 147962
11471 147962 148611 120662 117420 129778 122307 113589 118015 104847 95499 92475 104149 118363 127995
11458 127995 119690 117777 130002 132331 134521 140690 135034 131826 135543 141192 155772 148777 155292 151903
11444 151903 126956 113138 122831 134355 131178 134933 147515 135044 118581 127978 135655 147733
11432 147733 156115 159184 150418 151221 164147 157104 143915 163843 161319 142318 135963 145554 146711
11419 146711 157867 150773 147320 158111 142057 148576 152158 132605 129330 130728 142255 167272 174267
11406 174267 155868 152929 161404 181691 164312 165696 168284 149868 143288 145657 128059 123535 127803
11393 127803 144190 133868 123776 128093 120747 110199 101976 104278 96033 107641 152978 159834 157496
11380 157496 165810 150624 116249 107817 104105 124471 151881 163993 170788 155738 144821 151325
11368 151325 158840 151292 152822 153476 168274 163695 154814 153819 159165 164163 170201 176754 181847 165846
11354 165846 175633 200219 201775 183829 173255 151918 152346 165512 163783 150898 157235 149787 151903
11341 151903 152741 170974 174219 165921 167630 162721 161875 163169 165877 153966 156378 169962 174138 168249
11327 168249 186016 195855 196559 202450 199200 191030 165917 168490 172753 187365 199911 192284 204889
11314 204889 227256 235413 213841 192954 192595 200657 195371 187921 192975 193894 191557 219668 230368
11301 230368 209730 197847 180153 164881 169193 184897 200098 215956 219798 217893 213718 212297
11289 212297 203016 184784 164011 175725 183482 173010 173804 179536 202305 214927 224983 209775
11277 209775 207583 212939 207393 210595 202335 194953 214536 225530 213517 192618 179298 184009 164170
11264 164170 159993 180829 197216 199539 196733 205760 209936 206936 199920 200754 196806 189043 188583 195760
11250 195760 224067 251129 264094 250814 251025 251039 239199 215017 224331 243265 235050 226591 230978
11237 230978 219703 217112 232453 227440 222065 220569 236912 239320 255504 282449 300604 295309 275755
11224 275755 255563 247579 248764 234008 234628 226641 230434 243756 251705 243112 235251 251812 255602
11211 255602 235637 231963 249197 260329 274163 289102 286926 266088 281423 299423 292129 281904
11199 281904 286892 288662 300835 300730 309376 303236 291285 273701 244957 257134 256491 263190 282841
11186 282841 297153 313682 320334 293073 293703 323848 340344 332155 325354 330167 346759 351207 346468
11173 346468 321088 323144 334220 327023 331114 353423 346017 330895 327281 318751 306570 305580 294954
11160 294954 306802 316685 321891 314150 322355 318373 314084 312152 318582 338286 344249 336005 315786
11147 315786 318710 320264 316371 327687 340801 350374 361584 346497 355286 369471 373942 369325 355280
11134 355280 341494 348693 347166 359801 357976 347357 361545 359663 356156 358543 369287 374860 370596
11121 370596 374753 400695 407834 387831 382346 377990 386546 393804 391756 394352 386940 380165 364464
11108 364464 354694 378739 404701 403123 406304 409317 406739 409213 402082 404869 423299 441998 437373
11095 437373 439544 445069 436245 443867 474282 485038 473278 475123 499439 507014 502907 502129 508967
11082 508967 521024 528710 529476 521765 514717 499296 530013 549318 538237 538433 555327 551927 542607
11069 542607 533915 534125 553994 563519 556682 547028 550376 554187 572651 589006 601272 645924 708204
11056 708204 745463 789138 806967 819390 802989 758618 712342 672695 640133 630807 627191 620459
11044 620459 621813 640481 643976 662882 660847 653856 659878 643159 626767 630157 631951 633786 625634
11031 625634 632437 640478 653092 665272 643604 630466 631494 643604 631493 634112 641274 646173 646503
11018 646503 640108 620117 610868 617213 609620 615786 625124 626128 628367 628307 634831 640511 645429 632855
11004 632855 630491 629240 636554 652301 643590 638796 648028 663948 652008 646627 655047 654322 645258 656535
10990 656535 653861 649209 662828 673105 662267 657717 657534 648322 654129 639203 630000 642042 663784
10977 663784 669023 677950 686061 669478 656729 656754 677015 696735 704228 699256 685579 688756 709797
10964 709797 718434 733027 740493 748304 744078 740463 735098 726988 728619 733985 732839 739936 733040 749848
10950 749848 758775 762288 776173 774855 771555 783551 786378 790345 792963 796314 801174 799483 802932 797736
10936 797736 798479 793349 779680 781207 808724 823767 852224 870295 900958 916797 908499 908056 909930
10923 909930 911193 902350 895884 884011 877305 884735 900074 918989 909906 909929 924065 947214 937289
10910 937289 943025 973753 968226 965126 955226 962435 971585 997910 1006069 1003170 1007116 1037173 1057507
10897 1057507 1044193 1044205 1074250 1066197 1056455 1057484 1085302 1100162 1084618 1075239 1090430 1106727 1086842
10884 1086842 1102701 1110696 1118404 1124317 1141265 1142519 1150972 1162605 1173212 1195062 1205425 1210997
10872 1210997 1221147 1226402 1224303 1244158 1240026 1249844 1256244 1241721 1220917 1220565 1243812 1261892 1281786
10859 1281786 1299378 1310019 1325604 1313382 1307644 1335478 1373777 1371061 1371833 1382790 1382783 1387843 1400396
10846 1400396 1396236 1379554 1390544 1423656 1433745 1435512 1441805 1442598 1426923 1431993 1439022 1450970 1463054
10833 1463054 1477654 1501826 1516342 1516056 1520355 1526493 1542663 1545463 1562650 1573027 1589339 1603647
10821 1603647 1614813 1636958 1665611 1670683 1671530 1686430 1688016 1705105 1702300 1726717 1737796 1728279
10809 1728279 1724754 1727968 1747426 1785819 1821521 1840975 1858491 1864693 1882203 1916727 1943207 1959685
10797 1959685 1961269 1982995 2005058 2032858 2054651 2062053 2058197 2086330 2105036 2143864 2172402 2186539
10785 2186539 2210132 2206836 2234579 2268586 2300771 2316531 2344397 2371438 2401975 2417488 2460020
10774 2460020 2494623 2529068 2564613 2583141 2584714 2602408 2638338 2660788 2676966 2705688 2748022
10763 2748022 2803849 2850312 2879686 2903881 2963215 3024301 3059622 3083806 3123857 3180300 3229792
10752 3229792 3254143 3282963 3342548 3401378 3451971 3508349 3555026 3614186 3649474 3691245 3750047
10741 3750047 3806561 3879943 3942228 3998594 4060208 4119021 4166259 4217549 4284045 4354857 4423495
10730 4423495 4507181 4583544 4656903 4742128 4845108 4938015 5043449 5146571 5243620 5351592
10720 5351592 5444976 5536371 5630218 5745555 5868818 5997968 6132700 6283684 6403907 6499094
10710 6499094 6626018 6772983 6918485 7090005 7276014 7444600 7586180 7747947 7934574
10701 7934574 8117181 8301016 8517699 8747544 8975791 9190885 9412491 9662144 9920808
10692 9920808 10187342 10459463 10736626 11039983 11367227 11695214 12041670 12408165 12768490
10683 12768490 13119184 13492787 13896437 14315895 14740259 15164229 15614940 16074541 16523287
10674 16523287 16970475 17420086 17886026 18372343 18865375 19373092 19874932 20399846 20926986
10665 20926986 21432067 21922516 22403695 22895175 23397557 23875888 24353336 24824310 25295515
10656 25295515 25770287 26219350 26669565 27125577 27584483 28025841 28457330 28892782 29343104
10647 29343104 29792238 30251875 30685046 31086567 31496875 31926397 32341528 32747123 33133839
10638 33133839 33506438 33874767 34240739 34588780 34945200 35300393 35718840 36156247 36609178
10629 36609178 36987271 37171131 37151073 37009979 36799093 36610572 36440167 36267823 36109374
10620 36109374 35955632 35810742 35673687 35504087 35327396 35147127 34976434 34764745 34530354
10611 34530354 34289291 34036092 33782920 33538752 33280801 32973658 32687406 32386925 32067117
10602 32067117 31730613 31401986 31030210 30635605 30239881 29858429 29485703 29065705 28608627
10593 28608627 28163929 27717126 27299930 26882604 26438493 25995721 25544063 25121619 24702974
10584 24702974 24270915 23834334 23408457 23031620 22657379 22292369 21935755 21582509 21270830
10575 21270830 20947057 20601198 20304285 20036814 19778770 19520814 19279202 19050580 18815219
10566 18815219 18592022 18396574 18206364 18036784 17886139 17727546 17586171 17476809 17344912
10557 17344912 17223049 17131694 17044172 16982516 16928462 16872924 16801642 16750592 16737786 16739756 16718181
10546 16718181 16694603 16710650 16730105 16741697 16758522 16774230 16806776 16863257 16928457 16999495 17075491
10535 17075491 17147445 17220477 17300206 17392917 17494058 17599236 17713311 17845842 17978797 18111084
10525 18111084 18242190 18375965 18545936 18723150 18906071 19080716 19266393 19465186 19662510
10516 19662510 19863123 20057968 20260998 20477971 20698532 20921436 21152871 21358894 21552797
10507 21552797 21772075 21988886 22201716 22420316 22650741 22867957 23063075 23273060 23488005
10498 23488005 23696093 23896112 24108348 24307376 24489293 24658315 24807021 24956115 25096728
10489 25096728 25240373 25370514 25476774 25601798 25726772 25809489 25883519 25964256 26034275 26067316
10479 26067316 26100804 26124004 26143683 26162369 26190642 26189728 26159969 26126381 26110744 26098635 26069306
10468 26069306 26006825 25963853 25906541 25805641 25678654 25543363 25400197 25233099 25078023 24924376
10458 24924376 24774647 24638892 24493746 24312574 24142076 23992887 23806410 23591980 23376250
10449 23376250 23154914 22942000 22722551 22501468 22270564 22024983 21769452 21520730 21265383
10440 21265383 20997615 20723303 20452177 20174747 19904376 19673735 19438295 19177452 18915496
10431 18915496 18640346 18373569 18112225 17837394 17561135 17280636 17010631 16742798 16475559
10422 16475559 16218714 15954124 15669002 15405893 15169261 14927050 14676225 14423171 14165873
10413 14165873 13889765 13614955 13382280 13172504 12958853 12735235 12515165 12306735 12091178
10404 12091178 11892569 11690566 11469909 11257225 11026569 10816239 10582062 10363688 10161808
10395 10161808 9985090 9812287 9638286 9458523 9304371 9123511 8963283 8818102 8671086
10386 8671086 8532224 8377963 8222940 8085304 7962872 7854173 7743143 7605763 7476068
10377 7476068 7335560 7190999 7073472 6966683 6845931 6738521 6640188 6546369 6456216 6389167
10367 6389167 6338994 6270552 6198707 6135184 6054780 5969182 5885107 5778730 5691024 5609825 5531044
10356 5531044 5455485 5367032 5292191 5211624 5125386 5035424 4934847 4839670 4754492 4671837 4602970
10345 4602970 4540138 4444859 4367137 4284625 4189695 4116506 4069489 4054365 4085203 4107048 4090286
10334 4090286 4063267 4045138 3996318 3943877 3888391 3880150 3875479 3836216 3785360 3723413 3690117 3654511
10322 3654511 3606382 3541792 3479671 3444629 3417952 3374911 3351026 3321987 3286416 3241729 3193488
10311 3193488 3147697 3129440 3106651 3062615 3022864 2997605 2967189 2939664 2912680 2891773 2857526
10300 2857526 2849735 2836417 2819139 2820115 2831454 2806934 2782926 2765755 2747073 2724321 2700412 2695731
10288 2695731 2687677 2677042 2650353 2629332 2626782 2599836 2580770 2584906 2581518 2568268 2541006 2538616
10276 2538616 2524746 2506867 2501376 2520392 2562780 2603406 2631238 2639970 2637148 2654540 2648532 2658701
10264 2658701 2674278 2688370 2721302 2762139 2797839 2819237 2839498 2869452 2911629 2951055 3011136
10253 3011136 3069269 3134927 3183300 3220218 3278322 3357220 3485661 3657109 3799963 3952319
10243 3952319 4113157 4272480 4389494 4490232 4642467 4857197 5151696 5524074 5953988
10234 5953988 6437647 6979370 7569282 8268285 9171915 10302453 11411882 12301794 13059802
10225 13059802 13938932 15156749 16898911 19341635 22619885 26942484 32825772 41059150
10217 41059150 53030370 71137789 99365501 143169443 205693368 274523089 315298987
10210 315298987 308798986 267883917 209924296 153306708 110279739 81391566 62443281
10203 62443281 49614277 40535153 33901151 28921210 25158785 22339231 20241290 18733518
10195 18733518 17632665 16664536 15512688 14159006 12691375 11252960 9957531 8898697
10187 8898697 8042655 7342062 6819908 6399731 5974982 5562416 5177517 4823837 4529875
10178 4529875 4290779 4108542 3949774 3803854 3651204 3501270 3343516 3162947 3012612
10169 3012612 2843037 2697978 2573264 2444853 2344300 2256692 2176451 2102025 2051312 2013259
10159 2013259 1985190 1944494 1923919 1892290 1823443 1749412 1689196 1665865 1635055 1605029 1554974
10148 1554974 1540541 1557046 1556954 1528490 1491086 1439246 1402870 1394110 1392182 1372821 1357484 1334248
10136 1334248 1305233 1263858 1236788 1208483 1191839 1181147 1151091 1111418 1094577 1083985 1056291
10125 1056291 1047919 1048631 1048280 1065469 1055063 1045747 1028618 1016787 1014202 1004839 995816 968974 938617
10112 938617 939118 947445 938714 932871 923354 891004 873841 852261 819885 801160 803705 800246 795752
10099 795752 788527 784417 797330 783744 783421 763475 748970 741350 739243 719848 690469 685231 712066
10086 712066 760119 837888 953189 1075548 1112567 1094501 1046298 988446 915793 882090 869570
10075 869570 855529 828089 798774 799710 783223 761364 756427 756884 754009 743116 738224 721992 703126
10062 703126 681385 680946 690837 690211 682206 674389 683848 738460 801753 847948 865238 880577 893478
10049 893478 897248 922659 974287 1026180 1077816 1147820 1251828 1404648 1622837 2004403 2686305
10038 2686305 3962355 6499244 10397872 12565979 11524646 9427915 6612774 4280571
10030 4280571 2949461 2260707 1855095 1602148 1424022 1290535 1210856 1116247 1016448 944260
10020 944260 898800 863250 838049 789610 760557 741849 730432 701774 683933 681928 693977 694650
10008 694650 678791 656992 634368 599274 584330 582032 570417 549857 543610 526940 521581 535153
9996 535153 531397 524993 514723 489640 483223 476184 453150 466463 488084 508720 513389 490693 472368
9983 472368 466376 452271 459090 452186 439768 437777 425981 425169 426694 399617 371216 391406 416996
9970 416996 414630 411705 412015 421863 429571 424501 411837 416781 398278 384148 394166 413920 427556
9957 427556 411817 401947 390256 367837 337988 320595 319608 342252 363013 353952 356260 358798 347976
9944 347976 332977 319754 322457 322966 339066 356902 344274 346430 353353 345183 335671 332405 334844
9931 334844 310832 308457 326234 325822 320247 298218 322868 317138 315135 318692 314126 295758 281168
9918 281168 288632 306752 318175 312210 298474 297477 286618 271956 299821 319748 319918 294447 280456
9905 280456 264459 258102 264681 282894 290725 311653 329147 324891 314108 313660 311516 300133 284121
9892 284121 282840 289094 297706 317284 293193 292356 282829 302382 295991 278528 286882 276085 260063
9879 260063 274362 271921 263454 243994 235050 257915 277814 273434 269570 267494 277324 280274 276132
9866 276132 269829 277058 281832 280410 271533 267533 248967 254070 249329 248048 247196 251362 249598 239453
9852 239453 240665 245749 240417 221594 214300 219466 221139 212796 209224 197102 181720 190603 186269 196928
9838 196928 204396 213849 237601 243927 221048 222623 234493 221514 233897 228686 219747 216885 205240
9825 205240 213086 230648 214778 217320 231579 225026 228738 228630 236680 235871 236933 238473 252915 247004
9811 247004 236271 213402 220852 221702 246455 274061 265741 255698 289726 307630 307973 293276 290478
9798 290478 298231 315869 375552 419560 453103 508114 600913 750011 949584 1222212 1516341
9787 1516341 1718134 1742003 1567359 1302664 1052513 886334 788904 754634 765407 706440
9777 706440 610555 545681 489507 435150 396250 378205 360689 350250 325841 336119 329399 328549
9765 328549 290184 279357 291341 286410 285864 282011 271801 271823 279847 273668 286932 303636 327219
9752 327219 327305 318315 312686 323091 323657 322390 321535 326955 318177 327057 318810 322397 342965 354854 358765
9737 358765 337870 338912 347624 363089 377306 391123 403249 418335 422024 423696 425583 457095 491544
9724 491544 520160 537980 561599 579166 605201 634354 670274 715272 758622 806344 875008 950025
9712 950025 1017639 1071359 1150652 1255285 1373844 1516687 1669582 1821386 1993927 2162348
9702 2162348 2350411 2520252 2687119 2870150 2996261 3056387 3102134 3113433 3051695 2940021
9692 2940021 2788139 2620422 2453272 2275308 2089630 1894148 1729074 1581178 1451105 1341533
9682 1341533 1235187 1135965 1056656 973536 906278 849791 790035 734914 680524 622709 572165
9671 572165 542015 523727 507741 511048 496541 466244 423640 415184 417167 378471 360900 353844
9659 353844 337501 303467 294984 307103 307997 285004 279139 276302 274362 260162 253291 247669 251398
9646 251398 257931 241122 233004 233991 205517 194474 189499 200829 208440 207078 213734 232560 230195
9633 230195 239964 260232 266001 244769 229010 201628 190013 185941 177916 177319 174939 182756 174338
9620 174338 168340 180374 181145 180383 181903 187344 174167 164540 152334 143134 142666 131157 120073 131885
9606 131885 125714 136212 162213 152851 128234 136159 155069 125430 109392 124498 134234 137196 139854
9593 139854 136843 134353 119503 101352 112945 140607 131362 132540 152174 139062 132317 124551 135389
9580 135389 136078 131572 120537 111083 118211 129723 119375 105914 98910 109834 124487 125219 115472
9567 115472 103161 103003 94178 103581 114466 112935 110769 122764 116774 94438 87347 97955 106884
9554 106884 101779 87964 57365 61339 78872 75895 82833 93357 103573 104970 100986 114041 82716
9541 82716 64077 93375 103945 117263 119599 118123 120947 124309 111794 106881 109104 100663 85983
9528 85983 90609 87454 62102 67375 73309 79098 83839 75050 83337 97224 113588 134991 115405
9515 115405 103708 89836 82981 103064 98677 80301 89038 99999 85527 72785 77651 85168 68473
9502 68473 72683 79812 92027 86731 91001 93610 90391 80679 98686 99949 98131 82869 91565 96221
9488 96221 100099 98456 77601 68119 75052 88815 86751 79501 75925 79637 84305 81283 80640 71930
9474 71930 85738 79012 70446 61980 71679 81922 100406 85956 67974 50538 58047 53459 56897
9461 56897 66620 80688 85141 98171 92364 94521 116238 92513 64257 46933 54014 40035 47620
9448 47620 39788 46199 63589 51369 60134 76913 76150 62262 28494 25576 34019 36724 47968
9435 47968 64659 75105 79783 67786 47149 53737 47808 43687 28573 33826 34223 44690 46693
9422 46693 45833 65790 63653 59139 65209 79903 78866 67638 75136 85827 71919 51579 57692
9409 57692 61251 63538 74164 90228 88229 80420 52912 38951 63160 70907 66741 48789 43567
9396 43567 35972 33501 50498 81769 74214 30853 14976 28577 63197 56085 38973 64390 86008
9383 86008 79284 68077 67633 81774 89997 91410 84183 53612 42686 41215 56071 65223 76318
9370 76318 59036 54562 49338 45761 40077 20378 19237 47721 56780 49133 52852 62492 54220 69700
9356 69700 62254 33120 27183 30520 55853 43539 32409 34616 27569 19204 28464 27019 20539 23353
9342 23353 32808 47884 49988 52218 27422 33082 56820 73064 61696 58338 54483 45298 46673
9329 46673 46386 51510 62685 59036 53624 41755 32768 34244 50698 50821 60197 60311 74055 74398 74897
9314 74897 76815 76476 50288 39931 31781 30235 33817 30149 32026 39508 61830 70979 73123 82229
9300 82229 72919 75313 76879 73796 62416 64631 52527 73967 82983 86546 71045 67254 68099 58802
9286 58802 64347 74749 74276 32699 31455 29881 34426 31561 44812 42465 45690 43518 28629 31358
9272 31358 26538 19580 15189 19146 18888 31564 50692 73474 69504 56462 37950 27678 21627
9259 21627 23891 39604 46044 49132 34779 25495 35793 42979 46428 37244 34891 36984 41604 22738
9245 22738 16202 39728 37756 39970 23450 15536 12106 11848 22342 26842 18489 50555 57910 57662
9231 57662 52100 62843 72044 61080 60125 61467 56204 42945 57348 84042 73701 44323 38724
9218 38724 20100 -13644 10089 38508 40026 39617 44778 50899 44539 44473 35753 45521 29320 29829
9204 29829 25247 10260 10559 30318 37921 49833 55995 44220 17852 8098 24083 30534 29794 25466
9190 25466 18483 14770 5080 27819 21564 26772 26412 30490 37588 46521 61094 65866 56426 39117
9176 39117 48118 43092 22111 41728 42357 20390 12203 31201 35304 42563 52211 39393 22458
9163 22458 16349 14937 1855 -10208 -13237 -5740 18250 35386 42686 33694 27084 48104 54183
9150 54183 46509 43302 55758 59680 56690 72944 77024 50570 35554 29809 24663 46671 33305
9137 33305 14263 21375 35261 57177 51773 51528 61421 74223 53669 32394 41117 41241 52302
9124 52302 42584 39307 49867 40229 17377 17657 27492 26132 38325 48329 54068 56866 70683 51927
9110 51927 29664 30839 37726 26167 28207 41954 49789 40616 36993 32496 46785 42363 38443 30995
9096 30995 27040 38711 21932 8694 2864 -117 13114 36821 41844 50281 34934 14681 -15615
9083 -15615 1058 31139 40056 32428 25960 41497 35201 40518 25656 3330 10687 36191 6227
9070 6227 3069 20737 41214 46362 28807 -1733 9690 22099 22089 30318 41337 48581 51033 58743
9056 58743 47793 88494 101904 96679 79563 56088 38816 44037 35151 12753 12852 24769 23239
9043 23239 23343 39760 39916 54964 39563 39896 58083 61192 42689 42803 29589 32283 41867 51600
9029 51600 47084 36169 42347 53306 28505 17951 35375 34429 16268 25593 10354 -6240 -13470
9016 -13470 -22927 -2572 4224 8106 14675 16790 10584 24999 41088 29799 29598 15283 18848 21938
9002 21938 21245 23804 29125 27990 29498 17938 18569 43419 40319 42168 53691 29719 33967 45845
8988 45845 32383 30385 51459 54351 41670 51892 36132 -4190 2248 24984 40769 38051 25603
8975 25603 20316 4479 10853 23977 1470 -15353 4789 23641 22328 12989 11559 23008 36071
8962 36071 37142 40940 36279 34596 43378 23420 12927 7496 -3226 3147 8862 -2007 -22084
8949 -22084 -25593 -1711 21609 23136 30968 36273 31143 22148 35956 34805 12654 -3517 5134
8936 5134 14498 15374 24655 -3293 -5931 4026 21332 15801 -78 -17992 -33149 -12134 -7275 6204
8922 6204 2264 -7264 -8665 17441 36756 50476 48809 40472 26460 3296 5034 -109 4060 3245
8908 3245 14547 32518 37412 35252 31797 39213 16271 -6281 -2645 12005 11353 13355 8408 22819
8894 22819 23700 13873 24872 18541 18901 1439 -22531 -3957 5966 17904 21718 29901 28731 24246
8880 24246 15324 15855 11961 16741 24950 16204 12022 17181 32965 45013 35445 34991 24648 26769
8866 26769 32081 27340 13725 20671 11518 20844 49652 82612 109528 136038 140126 112835 70518
8853 70518 40599 32104 30205 46993 37548 37535 42321 16124 245 15137 14114 26630 34479 18232
8839 18232 17903 14304 7598 28532 40221 25778 14103 19003 21985 14372 17707 23682 28928 23605
8825 23605 13472 5583 3474 24960 38521 28860 30037 23710 29703 40812 31913 29508 40041
8812 40041 37157 21077 15974 21678 5649 -1746 14829 4935 2730 11987 5265 863 13043 21594
8798 21594 27765 14771 7072 -8344 -15182 -7122 1378 26010 34855 37449 32428 30084 22786 19742
8784 19742 18372 33848 44475 31490 31122 18786 18884 15895 21228 6246 -1154 10010 17865 28256
8770 28256 32652 16851 384 1049 16559 20294 -3210 -10460 4224 14696 37426 32458 21251
8757 21251 16246 21493 31645 9692 5157 14555 16467 16655 25829 22236 17053 31971 33511 24622
8743 24622 39595 40323 41937 36597 47424 62594 52851 38857 30115 22722 27171 34419 36629 58380
8729 58380 49446 25277 15801 16941 32130 35115 36279 29989 20321 25114 27930 32145 42310 36776
8715 36776 22222 9872 14673 10105 11792 4727 -5407 -1476 2801 9518 28441 24967 -2242
8702 -2242 -8094 6801 16656 11751 25630 31914 37151 30273 -1111 929 14164 8582 -18633 -13912
8688 -13912 -1075 8671 31949 33917 8915 -7065 -8651 -4583 13180 15018 3052 16805 31097
8675 31097 32017 35688 42340 40793 20329 8205 21462 36528 47330 59761 54001 31361 20112
8662 20112 7182 4830 25492 57991 68982 54699 43374 31689 31091 37812 39570 22604 20321
8649 20321 21122 8673 167 -1213 2789 2042 -3406 -1852 36792 51366 57646 62161 35834 8684
8635 8684 23052 49996 56231 57642 52759 40888 33548 25713 21892 40851 46133 40119 42369 57705
8621 57705 77013 106034 122139 150070 140756 122151 107530 74465 45778 41588 32403 30641 51992
8608 51992 50470 33036 48512 62409 56756 62414 45976 41686 41389 51249 49551 52597 54337 46823
8594 46823 22209 32969 45896 52168 74362 92386 92233 87373 88493 83261 83358 87347 97887 135665
8580 135665 172189 190764 186809 186296 157507 141169 145671 148106 131325 126469 111584 93173 91000
8567 91000 113049 118799 113794 101115 90656 59565 40457 37251 49655 77295 68019 36249 45925
8554 45925 42024 65268 77776 57574 35911 42733 42106 41169 51243 51688 57268 48372 24227 14113
8540 14113 17373 24079 35757 39164 37505 30269 4973 21399 38653 26241 6228 13505 31453
8527 31453 57821 76797 73516 68530 46993 13533 20574 34412 35950 33052 26420 26988 38566
8514 38566 48052 17449 10589 22577 26487 21773 11757 1533 23150 22361 19807 20599 32383 31995
8500 31995 28098 4193 -4712 -15622 -2265 14373 9278 12764 12570 23141 13716 17283 9914 14394
8486 14394 13819 -11161 -8244 13333 8033 12850 9711 8077 28509 40573 25901 16243 5081
8473 5081 10672 10388 6049 15908 31506 25335 26426 9205 12526 34784 27206 22002 18983 5517
8459 5517 1411 -8422 -17992 -19340 -9980 -2250 -10611 -2928 -917 -2676 847 -14651 -18150 -11369 -1140
8444 -1140 -5410 -2704 12226 18493 15583 19497 16576 7295 7868 12375 19928 -2089 -17261 -20459
8430 -20459 -8096 913 -3395 -13886 -14453 14192 25709 35188 30443 11337 -13731 -22081 -16577
8417 -16577 -14971 6352 24701 23213 7976 4406 11913 14214 17134 18155 17294 21177 4491 6014
8403 6014 17563 14804 5099 -11642 -29243 -5869 3404 3320 32805 40117 26404 9615 14814 5126
8389 5126 715 326 10216 2360 -8632 -18463 -38221 -35101 -31522 -19447 -8949 -4367 2264 -1532
8375 -1532 9814 -1737 -25723 -38708 -46704 -30949 6207 10772 -5108 -3890 10445 10897 -11454
8362 -11454 -4307 2322 -3241 2279 11055 -1471 -10768 2718 12176 14444 8134 3345 -628 5168
8348 5168 10546 -13702 -18216 -12076 -28423 -29610 -22832 8766 26886 16919 4584 -3264 11935
8335 11935 12451 13475 -758 -7372 5429 18937 33659 22538 12986 -10625 -12777 9268 36071
8322 36071 42172 9818 -3086 -1829 -5162 -6068 11263 14076 10607 9297 4674 -1903 -1427 6843
8308 6843 23484 982 -13283 -8119 -20773 -24899 -37334 -51612 -51815 -41020 -15610 19521 7606
8295 7606 -20371 -25653 -21804 -4156 -5988 -14590 -992 498 -1286 4660 5656 9549 18360 47734
8281 47734 42082 31903 29696 30356 16577 -4003 2508 8103 5740 1309 -3995 -4801 10432 10654
8267 10654 5258 19841 9441 15328 15871 23427 26181 7171 -4884 12558 28877 29384 26917 28130
8253 28130 22697 10738 4298 -7255 -11749 -11386 11159 7889 13312 17479 18008 25066 12720 -9515
8239 -9515 -6370 -763 -17720 -10827 -356 8315 7674 -3094 5775 17546 37085 34699 16833 5364
8225 5364 1090 2075 -4692 -11560 -13594 6525 28736 24236 7934 -2185 -2381 91 -8022 -22439
8211 -22439 -24593 -26035 -30119 -20111 -24127 -25548 -22451 -9429 6104 15843 26136 13169 20960
8198 20960 28438 35770 35881 27700 14940 -8331 -12650 -30924 -13683 38530 48923 29046 16050
8185 16050 -13299 3208 30964 41846 46294 34896 13022 39 5817 4825 -18983 -26812 -17649
8172 -17649 -11351 9294 16649 33205 33718 21460 14113 -2100 -775 12188 8745 9620 22599 17294
8158 17294 11994 19295 33865 33752 14127 -366 -13655 1382 18476 17966 4254 -1555 1796
8145 1796 1780 1418 3485 -2346 1755 6903 8134 9847 -3315 1172 32438 19368 841 10519 17523
8130 17523 19273 8032 -24803 -13565 2955 -4534 -12373 -17069 -3462 821 -2375 -7170 -21609
8117 -21609 -21633 -29450 -28097 -21500 -1110 15548 14064 21804 12046 4358 15494 33897 37819 24233
8103 24233 -77 -16824 -13536 48 12984 6931 -10991 -7334 6913 38978 41771 36549 51891
8090 51891 50178 48847 29883 8133 -3498 -26655 -24083 -11547 -7037 -2879 11922 844 -484
8077 -484 13169 13029 10703 7443 7237 26594 35104 29277 10836 -7747 -28870 -35551 -32393 -18752
8063 -18752 18847 27812 11020 17598 25483 33172 24579 17301 11833 4882 -3154 -5295 -7783 5410
8049 5410 -526 -3763 -7600 6748 21421 23315 25865 26332 23388 17162 -6533 -4042 -319 -8133
8035 -8133 -8999 -2720 14418 27675 19832 18433 22468 34442 31055 2666 1037 20586 11107 7
8021 7 26110 49160 38655 33409 48384 59312 49078 54254 42610 28011 16248 33378 34543
8008 34543 29051 14954 22345 28257 12479 -5442 5586 24078 21027 33464 45804 29026 10257
7995 10257 11816 4905 11967 12239 17683 18297 4648 4518 11659 18538 45289 47803 33980 19638
7981 19638 14977 27950 19100 5157 12618 12230 25419 22393 15600 10110 502 17260 20472 29416
7967 29416 36991 51246 51928 60730 66974 68888 97439 116126 122278 112357 82114 43399 27313
7954 27313 6650 -19330 -12693 15029 11778 15131 26474 25605 28698 28178 25558 44258 68094 47376
7940 47376 32205 21784 30550 29487 33271 46655 40045 16293 18131 29557 44659 56256 55763
7927 55763 38013 24699 13493 7116 -3387 5426 8543 10090 15397 15866 11579 8925 19368 18453
7913 18453 21932 27988 5116 14526 30937 39186 33118 15501 24637 30397 16284 17778 31162
7900 31162 27446 41295 61440 43974 17614 2348 -1350 -11908 -8340 5165 -974 1225 14776
7887 14776 11374 4436 4742 16417 24045 29777 29596 31268 21619 12932 13803 -2442 -11048 -3434 12777
7872 12777 7443 -5789 -25466 -24452 -9048 483 12473 17463 8993 7277 11356 1469 6511 19885
7858 19885 29308 21211 11414 14184 24832 14315 6449 21601 33645 -362 -14155 1521 6067
7845 6067 17086 30327 16922 -1002 -6056 -911 -8748 -3886 1318 -1346 -7919 3320 -3589 -7343
7831 -7343 -7268 -8468 4951 18932 7124 2672 9505 26079 37927 18534 -8457 -13643 -14450 -21197
7817 -21197 -14255 -4486 1514 7927 18525 24868 4078 -11666 -29060 -22388 -6688 -26473 -26826
7804 -26826 -17276 -6949 -13900 -12157 -13388 -8004 -7728 -6436 -605 8784 33722 16078 2632 2077
7790 2077 13336 30219 -3539 -19470 -6849 -14725 -18699 -12229 -684 17393 3019 -14759 -21326
7777 -21326 -19302 -28106 -29460 -9907 4129 12270 14819 5570 5533 4322 -5556 -16174 -17145 -10367 2941
7762 2941 -10656 -13801 -5410 -13726 -11621 -7083 -14518 -14406 -8709 -9869 -6824 4806 -2474 -23571
7748 -23571 -21010 -649 6292 -1580 296 -873 6391 19825 28057 15174 13004 11935 10163 31615
7734 31615 28979 14611 1600 5685 -8134 13290 12116 15385 16058 2343 6630 7225 -5332 -15905
7720 -15905 -3910 -3010 -18452 -32187 -15477 -13673 -23845 -38545 -37836 -19168 -11748 -11272 -2820 -8730
7706 -8730 -21137 9282 25328 20595 -11554 -31576 -20016 -10852 396 14318 12209 -5956 -16446
7693 -16446 -21154 -6202 -4891 -479 32520 22025 25407 31580 22743 16557 1644 -1565 11692
7680 11692 21197 30677 24578 14216 28261 17640 -9358 -13742 -2854 14478 31944 36432 12107
7667 12107 -3350 -6674 4289 8899 10469 -8879 -24621 -20225 -11098 -11879 -14810 -20636 -31773 -14937
7653 -14937 -11690 -10918 -12515 -33771 -33948 -26987 -18757 -10330 -3127 9973 10054 -4987 -13180 -23589 -12440
7638 -12440 6510 -10239 -9248 -5669 -6301 18647 34423 23081 8238 -9917 -9636 -7748 1937 -3908
7624 -3908 15144 6678 6249 12917 2754 -13375 -23727 -22002 -12557 -2105 859 -16028 -18745 -4041
7610 -4041 -5166 -6924 6581 1168 -1224 -16325 -10365 -5302 -8793 -9539 -17861 -21855 -14078 -23090 -15497
7595 -15497 -1163 2804 -3986 14313 10747 -9983 -10100 13329 15475 23372 18193 25358 20792 20597
7581 20597 39447 31141 27993 30667 11952 17784 10510 836 -4063 -21797 -12081 -8747 8923 31250
7567 31250 33574 12243 1551 12797 6526 -6765 -20937 -35063 -35000 -40980 -27668 219 12760
7554 12760 -13892 -20979 -4714 1582 -6737 -27654 -27087 -20523 -23985 -18674 -1720 5588 9705 13437
7540 13437 -1284 -12245 -14846 -27639 -30422 -28192 -41270 -29449 -7991 14357 36717 34397 14068
7527 14068 -19525 -19498 -5374 -13950 -32417 -38942 -28736 -42784 -36396 -35961 -32536 -36844 -20148 -23529
7513 -23529 -13811 -14423 -14869 -15203 -19304 -17277 -2922 5799 12786 13926 24074 14902 17999 13163 -10699
7498 -10699 -19477 -36806 -28401 -28149 -37639 -51771 -42753 -31369 -12446 2613 -5242 -18890 -14222
7485 -14222 -21077 -26464 -20505 -9424 -3708 21369 35281 21743 20362 -1913 -9371 -194 2142
7472 2142 -3242 -15167 -30886 -36060 -37127 -41436 -28997 -10313 -25602 -20570 -29642 -24100 -12383
7459 -12383 -11341 -14387 -18973 873 4124 -8383 -16449 3673 10495 4305 -5713 -16286 -19918
7446 -19918 -18506 -8761 -5113 -4585 -238 -3769 -10581 5998 4249 3872 93 -8518 -16259 -42379 -28541
7431 -28541 -3757 -3070 5208 509 -5844 2421 -10213 -11030 12496 6890 -1740 -1273 1146 -2800 1114
7416 1114 17471 8380 -20538 -17355 -15656 -15638 1155 5165 12688 16197 -981 -12603 -15682 -23731
7402 -23731 -17049 3956 26055 24237 9091 -7960 -21800 -34148 -17937 468 14885 13244
7390 13244 16521 11463 15185 2302 -23004 -23194 -10335 -9799 -8134 2024 -5839 -10393 -2456 18281
7376 18281 12077 24054 37391 30364 17556 444 -22412 -5655 13516 19398 2565 14039
7364 14039 41083 42153 16001 11983 3614 -2314 -315 -15530 -13258 -417 -7826 -16108 -39987
7351 -39987 -41666 -30379 -9178 -3293 13586 23391 15807 -1534 16074 3743 -3862 -6277 -17373
7338 -17373 -25453 -28711 -38467 -35464 -4225 -2806 2135 17553 11951 18300 9636 -11530 -14426 -15965
7324 -15965 -18268 -6072 -10710 1383 -809 -5178 -2490 -908 5324 11638 35140 41753 28526 4693
7310 4693 2174 -12725 -11546 -18159 -24985 -35201 -27109 1658 20900 31498 18608 8465 16878
7297 16878 13633 15917 23789 28335 19185 8056 -1474 -8251 -19456 -23518 -22622 -24119 -18007 331
7283 331 10471 7853 -1698 830 -1459 818 9059 10959 1126 -5963 -5825 5970 18439 18524 15312
7268 15312 2122 -6533 2265 10382 2862 -1341 16537 25776 1597 -11951 -12443 -15373 -10779 -26446
7254 -26446 -40276 -30301 -18235 -21690 -16148 -15656 -8488 -5277 -998 4446 5713 -1413 -9338 -13352
7240 -13352 -6701 -20567 -18806 -12335 -4179 -2730 -12286 -20483 -4286 2091 6252 16927 14153 7500
7226 7500 1911 -10839 9869 24098 1620 -6394 -7907 -4803 -6708 -5868 -1172 -14202 -15256 -3387
7212 -3387 -10063 -5684 -8518 -8454 -26812 -29520 -582 9219 -7896 -2087 7861 10459 3806 -9812
7198 -9812 3646 9684 8241 -6536 -6144 -13456 -10176 -22172 -25845 -16673 -26232 -32131 -44902 -27673
7184 -27673 -16145 -30216 -31338 -10255 -7571 -20915 -3825 15596 24565 -11230 -40225 -28254
7172 -28254 16 9669 -3788 9649 33360 31254 27320 10255 -4996 -2783 -12157 -17190 -6951
7159 -6951 23214 27587 563 -1816 -16894 -29515 -16388 -1595 10746 -6837 -36591 -54533
7147 -54533 -45215 -31680 -25421 -22000 -11199 -17932 -24365 -33061 -13295 -7855 -15719 -42830 -34358 -41532
7133 -41532 -21481 -18028 -18090 -1403 8 -4401 -2113 13377 16214 2280 -20568 -28594 -21911 -6298
7119 -6298 -6433 -6195 -15833 -11102 5731 6104 9813 22139 22438 4590 -16858 -20059 -13385 -6290 -19718
7104 -19718 -22288 310 -3207 -6453 -1755 19614 20130 13041 -1446 -16510 -16614 609 20992 20789
7090 20789 25288 41571 57333 39897 14051 -10043 -4235 18430 29171 19858 27151 33167 20188
7077 20188 7000 -18949 -15380 -9628 -1453 1778 7145 27136 26969 9755 1443 -5956 -17485 -12709
7063 -12709 -9197 -8040 -8160 -3141 -7031 -19741 -19135 -14797 -15441 -1880 5374 263 -10615 3556
7049 3556 5694 -5532 -3500 -8455 -20290 -28018 -25459 -16398 -33154 -18209 -5760 -6164 -2454 2560
7035 2560 13643 -4720 2378 11018 11073 7763 3838 1151 1180 -4780 -6995 -12271 -11467 -27013 -10834
7020 -10834 17625 33683 23620 12989 -9565 -6441 7971 7349 3751 336 -5081 -20071 -16201
7007 -16201 -6748 -13009 -14505 -8846 6669 13539 22981 10724 1164 3957 5327 7547 -3791 -10301
6993 -10301 -11505 7313 2845 8552 5632 -10418 -3599 -3748 10842 3665 -3013 -13229 -13185 -1907
6979 -1907 11522 15523 9873 6846 9115 12188 -4343 -10760 -9906 -7311 -10036 -5758 10968 31350
6965 31350 37425 25375 13218 20121 -2633 -19408 -16674 -14955 -15519 -8661 -7568 -5384 -266 -6054
6951 -6054 -13362 -11565 -28702 -27744 -22594 -21293 -24275 -30213 -25158 -27560 -35412 -26010 -9808 -13649 -17084
6936 -17084 -31452 -39836 -43435 -38504 -26663 -27946 -24935 3839 11785 8219 5233 5133 -18736 -26745
6922 -26745 -43884 -50679 -47777 -13565 12719 -6246 -17675 -13138 -37769 -24290 -16136 -12157 -28190
6909 -28190 -46263 -39153 -22019 -13462 -27114 -39223 -35577 -29975 -27012 -41388 -27022 -18823 -45469
6896 -45469 -31421 209 20403 15686 3731 -17635 -5309 9926 10929 14510 -8973 -29749
6884 -29749 -15290 -11925 1669 2810 -3350 -14421 -11821 -10256 -5241 -1555 -6631 -14184 -12649 -13364
6870 -13364 -14092 -311 -3885 -28717 -38461 -30311 -12325 -3656 -18215 -30038 -27195 -20555 -36016
6857 -36016 -31856 -20646 -20550 -5323 7492 18817 21837 39342 35021 42096 33898 -4187 -23266
6844 -23266 -9537 -15216 -11225 -3105 995 -1791 1267 7703 17923 26659 29322 13384 -1640 -26372
6830 -26372 -35157 -39527 -11427 8443 13108 12234 -2128 -1541 -6512 -5897 6593 9036 -17776 -10851
6816 -10851 -186 -5608 -8253 10767 18059 31636 29369 17159 18375 9300 9293 16514 24249 22273
6802 22273 16419 11192 4508 -3325 8317 6934 -3534 4562 6861 1520 2510 -469 -7332 -2433
6788 -2433 4009 20772 11993 -1171 -8335 -1932 4612 -4164 -22124 -15675 -822 5963 -461 13044
6774 13044 7102 1864 -22028 -16173 -19725 -21858 -29129 -25417 -15373 -3712 46 -944 -157 10651
6760 10651 3674 -9208 -6021 -14008 -11672 -666 4697 25595 32301 15867 15468 19661 22210 14087
6746 14087 2277 8395 5773 31619 42072 41381 28212 38108 27291 23835 28832 21252 5033
6733 5033 4384 17586 2368 -17212 -6270 21256 27155 27128 26092 34958 19593 2080 17403 23369
6719 23369 16344 23498 22317 31473 27822 21966 30324 22541 17820 31006 56513 91811 141199 190953
6705 190953 277846 409065 567503 700916 693688 595674 444254 295015 208683 146160 117714
6694 117714 85156 66546 51949 48301 45816 34721 45746 43704 44704 39970 45621 41690 24903
6681 24903 19252 20056 8848 7569 -2958 -4601 1139 11482 2493 -5793 17 -18399 -13078 -9563
6667 -9563 -850 -11037 1385 -1653 -11165 3442 3338 2817 -20888 -26461 -9996 -18396 -13169 -10955
6653 -10955 -5835 12804 13283 13146 13204 18057 603 826 13253 11396 3303 -3594 -5888 -10785 3517
6638 3517 6085 515 -21629 -28765 -30426 -24928 -20458 -31225 -21028 -6318 -11663 -14290 4242 -7506
6624 -7506 -21925 -19874 -20757 603 -879 -6464 -2055 -3028 -28522 -36607 -49351 -43157 -40898 -37630
6610 -37630 -22525 -21199 -17286 -4804 -195 -3039 -6501 -2367 3161 4869 2428 1155 -14929 -13123
6596 -13123 -5619 -14652 -29388 -40915 -42607 -34888 -37238 -34377 -32792 -45545 -35572 -31724 -32737 -35891
6582 -35891 -27569 -22064 -27498 -16089 -6898 8511 25012 37730 54815 41622 21280 11540 3764
6569 3764 6469 16762 -12999 -11083 -5087 5001 -18191 -29844 -13367 -1243 10974 5086 -358
6556 -358 4476 6291 3667 9731 11509 -1988 -5391 -7588 491 16694 16732 2092 -4576 -13519 -29821
6541 -29821 -35900 -42812 -38787 -30404 -17400 -11240 -23095 -24651 -8792 4045 8138 -6939 -21910
6528 -21910 -12679 -20164 -22433 -9540 -18944 -27469 -28272 -20887 -17319 -19277 -13543 -25078 -30457 -42642
6514 -42642 -41020 -1809 9255 31826 29580 18023 6403 -3134 -12748 -11219 -36860 -29738 -31753
6501 -31753 -5176 2845 6715 -5124 -8574 -10160 -5266 -11920 -21417 -18960 -23422 -29149 -22937 -24056
6487 -24056 -39809 -34190 -21105 -14923 -8615 591 5408 13164 10141 1332 7574 1728 -1657 3889
6473 3889 6424 -2313 -20216 -44333 -59981 -34555 -18356 -5397 2698 7660 3263 -107 3824
6460 3824 5369 8948 28447 41455 34736 22970 9108 11295 8781 -6008 -9628 -6203 -10724 -27082
6446 -27082 -18343 13593 1906 -10242 9054 4311 -8344 -29707 -26145 -19497 -21095 -21793 -19220
6433 -19220 -23348 -26231 -9674 -4185 -13104 2613 5999 -5443 -6705 -282 23561 37929 48200
6420 48200 36188 609 -23386 -24228 -3600 4240 -3558 -4693 11967 4787 -18641 -13190 -15113
6407 -15113 -22691 -17069 -13227 2112 11635 624 8191 11786 -2577 -19202 -36793 -24766 -20215
6394 -20215 -25079 -36578 -28940 -35051 -23689 12932 47158 40432 27770 1154 -13491 -12384 -5359
6381 -5359 -16479 -13771 -17249 -16563 -13761 -23228 -20094 106 2732 -7312 -5662 -18380 -6113 16004
6367 16004 17278 -6047 -13346 -15531 -14525 -19274 -26979 -38330 -25562 -21128 -42329 -30168 -20908
6354 -20908 -8503 4904 25916 16982 -5462 -10902 -7160 3427 -2214 -10041 -9150 -2742 -8563 -15918
6340 -15918 -10517 -18967 -28760 -31152 -39201 -52291 -45135 -30255 -12379 -13930 -7093 5874 3528 3232
6326 3232 -10315 -8139 -8456 -9011 -13356 -3422 3327 9944 7143 5951 16085 -9976 -7104 21654
6312 21654 11632 -17842 -29259 -12677 5402 -1416 -4700 -4440 -30684 -6890 -7 852 19003
6299 19003 17966 -13204 -22723 -897 7531 6461 1533 -4770 -15178 -15581 -10257 -27904 -31209 -36457
6285 -36457 -24315 -3728 -24069 -15164 -6934 -7988 -3330 -3054 5759 8023 -4740 -25772 -20550 -1267
6271 -1267 19679 19254 5423 11924 18649 15946 14198 6338 -14361 -19535 -11391 -1639 -6983 -10242
6257 -10242 -4099 -9001 -8275 -2502 4375 12915 20891 30508 31431 17845 24379 14368 440 2027
6243 2027 16050 -1433 -6834 8737 5106 11384 14994 20332 35680 49115 40428 26556 17821
6230 17821 23063 14589 12558 -2691 -4649 9222 20075 20741 22260 4998 2485 9075 2956 -10377
6216 -10377 -10587 7973 30433 35061 23885 9151 -4035 -6616 12968 16243 2451 -8647 1347
6203 1347 -10222 -9985 15113 24744 14828 13591 9711 4840 -13839 -7519 1766 -13532 -14911 -4687
6189 -4687 -7799 -20297 -36853 -43344 -28567 -10947 9529 -4964 -20590 -24854 -14829 -14466 3198
6176 3198 12144 -1694 332 9885 -2760 -23524 -37005 -23608 -5205 -3381 -10813 -8230 -8559 -29784
6162 -29784 -33864 -27246 -19164 -26114 -31100 -39999 -26379 1163 13134 8701 -13709 -7125 3827
6149 3827 6921 16312 1222 -9642 -7683 -5522 13883 27745 -685 -3876 4831 23966 15825
6136 15825 4383 8623 10542 20775 24440 -1972 1587 17566 9031 -8809 -31565 -22455 -16812
6123 -16812 -29965 -38413 -24384 -14116 -3359 10645 12060 -2328 -13709 -27950 -29166 -16638
6111 -16638 -1934 -3481 -12224 -11098 -15610 -14719 -28488 -26806 -9758 6295 -1782 -20816 -25402 -6221
6097 -6221 -13493 -26779 -29659 -28882 -16702 -5826 -11156 -10297 -14541 -5440 -11257 -29578 -29709 -513
6083 -513 10762 4187 6495 5382 -4356 -9464 -11357 -2537 -16581 -28945 -24760 -22646 -37971 -37717
6069 -37717 -35291 -28779 -25143 -18327 10129 11458 -6010 -16135 -19409 -2009 12956 14814 9552
6056 9552 -6839 -22038 -20769 -27804 -37186 -36967 -24515 -30365 -2624 16230 21838 27090 17792 5965
6042 5965 -6575 -129 -7836 -25421 -22731 -25206 -16222 1324 6895 9167 17140 14815 1264 -2868
6028 -2868 -26280 -20964 -1151 2221 22155 19086 -2519 -10107 -11251 -24562 -34812 -4221 -6243
6015 -6243 -19886 -7903 -9655 -15902 -7548 -7408 -22786 -24123 -3205 10876 -1352 -5373 -18993
6002 -18993 -7058 1571 4606 1331 586 530 -2790 -1741 12642 13813 -22327 -38901 -25454 -5971
5988 -5971 9785 -7357 -18502 3938 2107 -1301 7715 -1676 -2220 -1191 -1400 -6711 -23301 -6768
5974 -6768 12782 15087 21391 17081 3426 -17923 -24680 -22538 -15815 -2300 12459 6498 1064 303
5960 303 4183 6606 -18473 -15616 -15667 -9771 -10575 -17978 -7562 -3040 7551 3460 -5808 -3180 -6334
5945 -6334 2783 18202 15238 17983 9429 12471 9208 17445 21685 9494 -18 -9839 237 15734
5931 15734 2085 -8980 -10828 -13005 -31191 -23218 -18172 -19661 -23910 -23672 -2266 11535 10623 15312
5917 15312 20121 10811 -5682 -22182 -32026 -26252 4557 5335 -6423 -10949 -21551 -26305 -8111
5904 -8111 9528 23394 21343 17132 -4733 -36918 -47766 -35459 -20014 -16056 -8082 -623 8861
5891 8861 -3337 -11207 -13457 -10918 -18497 -30537 -13548 -19424 -21147 -13006 3359 -4405 -17251 -949
5877 -949 262 -15389 -4430 15384 -5153 -14267 -2455 14535 -68 -13345 1996 6757 -5448
5864 -5448 -13227 -1532 4633 8349 18006 -5906 -12586 -15662 -40637 -47623 -35807 -27091 -10763 -1651
5850 -1651 -11050 -17124 -12944 -20163 -14281 1856 10747 15772 3974 3188 12370 -2245 -16090 -25943
5836 -25943 -15832 -1515 4852 18654 18516 15217 18401 12073 11998 -4217 -24311 -7086 4807 -13653
5822 -13653 -18502 -3769 -4472 -6357 13864 10670 8591 -7938 -19643 -23630 -778 15944 11477
5809 11477 11072 10565 3551 1968 25760 11852 -4620 -13014 -21047 -9284 -10962 2107 -3741 8363
5795 8363 28930 23878 -1907 -8141 5498 7066 9912 10277 -6887 -23426 -10581 -4714 1700 -12196
5781 -12196 -25817 -22898 -9195 -8978 -6639 13721 2925 -13046 -19301 -33778 -43449 -40739 -24321
5768 -24321 5082 29212 34597 41280 32787 30664 22580 1219 -23677 -36625 -32833 -34661 -6992
5755 -6992 20940 9425 -4743 2469 770 -11581 -6761 -17335 -24777 -24591 -37250 -40680 -5522
5742 -5522 -11489 -9004 6645 248 -19044 -6338 -6209 -5100 80 7095 -2730 -19666 -11366 -12501
5728 -12501 -17765 -17242 -19819 -4174 -5041 -5523 2987 2577 -18673 -20372 -6583 -8619 -14843 -17636 -14843
5713 -14843 -28035 -27751 -16389 -5314 -10406 -25036 -27522 -33611 -37310 -27143 -18402 -13692 -6147 -5887
5699 -5887 2073 -3217 3347 -2520 3256 13068 16776 12731 24488 38137 30684 34977 27063 17144
5685 17144 -7940 -14707 -14099 -33889 -28052 -26450 -27725 -23959 -25009 -14235 3352 14414 2143
5672 2143 -7023 -7066 -21308 -5902 -20586 -26045 -24956 -19300 -31294 -44645 -32184 -23152 -30102 -21867
5658 -21867 -8801 -4579 -15848 -16387 -3999 6568 -11250 -19422 -11743 -15251 -13431 -33844 -35287
5645 -35287 -22644 -21331 -21562 -27264 -21747 -16974 -20820 -11948 4751 -564 -27157 -26646 -22086 -24654
5631 -24654 -11808 6913 14110 8198 21151 10203 -15721 -40960 -44799 -22981 -10304 -7008 6217
5618 6217 8511 -2066 3746 18004 11169 18142 18756 -3068 -16735 5102 10462 -3497 9582
5605 9582 4085 -4756 -1923 -14397 -32600 -23697 -15746 -17037 -17691 -1511 13556 11781 -2129 -25345
5591 -25345 -21206 -1148 13583 12516 8689 8940 8643 3112 -14453 -21289 4042 7722 22948 21311
5577 21311 -6889 -3321 -2916 1054 27895 48215 51876 39627 22731 10757 4631 9339 16992
5564 16992 8113 -1210 -2407 17387 34180 11796 -1199 -8164 8244 30020 25673 25373 35294
5551 35294 44914 57007 36631 19162 15692 10428 -4141 615 8629 4318 5262 3780 -3238 -7565
5537 -7565 -2768 2561 -2544 -1070 -18527 -26495 -22807 -3505 -1941 2328 -4164 -11317 -13295 -9704
5523 -9704 -17873 -16133 -1007 19115 37138 31157 27102 15696 -7056 -16322 -20933 -17156 -20375 -22344
5509 -22344 -19429 -6254 1900 -8600 -83 4920 12074 3077 4180 2126 -8394 -8819 -2187 -1
5495 -1 -19590 -24196 -14700 9834 8430 -11469 -2738 2996 -5578 -9757 -5700 -12939 -17112 -14780 7232
5480 7232 1329 3191 -6640 -2298 -8490 -21081 -20182 -3987 2717 -11028 10114 4549 -5787 10072
5466 10072 6840 -1850 -13843 -20228 -23498 -19628 -8493 -9517 -8714 3716 -7355 -9107 -28839 -15728
5452 -15728 -5217 2916 -2817 -9331 -6299 8689 6803 -3859 -21925 -26760 -17103 -5567 3123
5439 3123 5325 18092 35730 21208 43866 55878 41247 12647 -15242 -30810 -25965 -12589
5427 -12589 -24825 -25296 -38893 -44986 -15960 -9664 -35598 -39664 -22133 9336 19246 17836 6201
5414 6201 5654 22987 10340 6238 2951 7645 8654 10327 8865 18455 30984 38987 53494 43009
5400 43009 18016 1365 653 13725 5836 4668 -6573 -16962 -12491 -12118 -9337 -9261 -3297 -6737
5386 -6737 -3275 -13071 -25642 -25514 -19857 -26556 -34926 -31065 -21198 2661 14062 30947 30301 2363
5372 2363 -19441 -14803 -6700 -10980 -19334 -5047 15313 33223 36190 18441 -4342 -16925 -29902
5359 -29902 -22579 -20008 593 12317 26915 38563 22570 1405 -23729 -29046 -17687 -20183 -18987
5346 -18987 -25645 -19357 -8966 1132 8122 13538 11412 -3257 1345 2712 3113 -4490 -12673 -6073
5332 -6073 -11252 -2615 -13839 -14144 -1896 20982 5864 4024 -23996 -35054 -27151 -32571 -9822
5319 -9822 6473 8406 28854 22067 4239 11406 5069 -1380 -19557 -3298 4838 -2923 -27852
5306 -27852 -42023 -41519 -37541 -12502 4584 1972 1823 -1855 2841 -4781 11147 14538 19955 7310
5292 7310 -11818 -3428 8986 6100 3373 -12593 -17017 -7720 9962 8806 -711 -8446 -17014 -22022
5278 -22022 -20049 -21544 -3575 -11361 -17544 -6698 -8270 12785 2417 5261 17910 13553 11934
5265 11934 11109 1584 -3391 -16388 -23974 -18817 1288 2166 -10599 -13793 -21202 -31929 -26235 -12996
5251 -12996 -379 7702 -1749 -2743 -3175 326 5196 19510 10959 -357 -11853 -11674 -13146 -5778
5237 -5778 -15207 -25817 -23125 -16484 -10912 -13602 9548 3778 -8020 -33918 -32581 -29919 -22486 -15157
5223 -15157 -13446 -9823 -10594 832 -30095 -43611 -45837 -24161 -4617 -11145 -15542 -21474 -27296 -30119
5209 -30119 -45200 -40287 -40830 -33158 -12324 -4186 -17534 -14284 -31419 -34698 -13354 -12054 -13319 -1300
5195 -1300 -12840 -10092 -23343 -30053 -8414 -3844 5324 -3809 -25808 -36463 -10343 -7402 -11784
5182 -11784 -24006 -30194 -24863 -5666 838 -17266 -19146 -12347 4316 10889 6854 12245 10252 16727
5168 16727 24705 22341 10919 -5581 -3507 -8469 -13396 -7002 -9927 -782 21443 25614 10708 7869
5154 7869 1455 4700 -382 -4888 6888 14595 15521 1685 2181 3055 2125 -1923 -11032 -14446 10233
5139 10233 24117 21903 20701 7164 -15809 -24483 -10200 10710 6977 -9358 -12879 -16313 8740
5126 8740 -1357 -33197 -55478 -58123 -37616 -36770 -38851 -24272 -6677 -15989 -13550 5709 14818
5113 14818 1225 -405 11280 14827 23659 16536 21620 27318 31159 15872 5681 -21536 -29358
5100 -29358 -25014 -11503 -2034 -12476 -18290 -14774 4143 17753 11110 11628 13542 20300 22287 8106
5086 8106 9720 7119 -5803 -7304 -6004 -9304 -973 4824 17612 21321 15239 -1751 -6575 1499
5072 1499 590 -1540 383 -8031 -14032 -13566 -10491 5013 13714 4288 6177 -8938 -24416 -17301 -7743
5057 -7743 -172 6943 -7783 -5531 2816 -2466 -4330 3819 6028 6720 25180 24641 4486 -17966
5043 -17966 -14198 7657 24175 21518 19651 5551 -13433 -15990 -15870 -18096 5283 38601 27390
5030 27390 5492 381 -194 -11309 -7689 14968 17017 20403 5850 -1120 -5066 -6515 -6410 11875
5016 11875 5640 -19404 -32143 -34904 -14069 -18996 -12539 -12117 -13375 -5292 17303 29043 15697
5003 15697 12312 16057 23961 12543 -17833 -42963 -21893 984 -20457 -40054 -22662 -17416 -29767
4990 -29767 -33845 -15027 -2755 -3823 2633 5678 -6866 -20563 -27894 -21894 -11771 23 13462
4977 13462 14776 16067 7340 15448 14431 -5674 5288 8730 -19030 -7683 -2057 -2301 16901 23945
4963 23945 17985 10771 14163 11017 -5303 -17894 -31850 -13143 3763 3138 -8134 1721 19762
4950 19762 27126 -8587 -20781 -10524 -5419 3687 11000 11403 8257 11280 1963 -11982 -26919 -25329
4936 -25329 -4553 21178 19859 12788 11582 -10620 -25694 -33802 -26295 -13610 11159 32254 26452
4923 26452 9343 6415 8012 15175 21823 26611 36030 13665 -16670 -10336 503 6460 3639 15529
4909 15529 3215 -5831 9308 1662 -9692 -4107 -11409 -23442 -12237 -16631 -29335 -32838 -27559
4896 -27559 -21730 -3442 14509 12707 5696 14457 16717 15037 -129 -18219 -29619 -30592 -15134
4883 -15134 -10291 -26891 -12106 -15278 -19959 -29105 7618 33469 26917 15577 -10086 -16141 -22303
4870 -22303 -30832 -8717 1576 -5855 -6305 -13511 -18110 -25080 -19018 -20741 -9449 8520 14142 6683
4856 6683 -9897 -26538 -15806 597 22534 12359 -14496 -31943 -4656 26118 21610 7311
4844 7311 1780 4430 2117 11757 2399 -3136 -4475 -5890 -4124 -5548 -17456 -29546 -25180 -22718
4830 -22718 -18802 -18314 -11708 -12246 -8166 -8831 12804 40480 49033 48138 17912 -1370 7254 11285 -6932
4815 -6932 -8050 11859 18733 5726 9776 -12849 -5770 4989 5234 1225 -13338 -22546 -22300 -3204
4801 -3204 -3774 -23812 -30128 -25048 313 10380 2336 12263 1751 1488 18062 27017 31031 25112
4787 25112 8839 1392 -3137 -25697 -37973 -26580 -18831 3372 31919 48002 20789 -5098
4775 -5098 2517 12334 4512 10345 27506 20579 -10939 -44524 -38433 -19655 -11801 -19467 -28502 -19419
4761 -19419 -6776 -16505 -20574 8016 21464 39651 41217 16775 -4271 -12026 6236 -1926 -19377
4748 -19377 -19508 6412 9272 3798 -11019 -7161 -7616 -12258 -21525 -17220 -33663 -30666 -14518 -18158
4734 -18158 -22097 -25980 -34593 -30232 -36630 -49088 -41033 -17751 -9689 -28473 -1049 21088 12039
4721 12039 1806 20640 31127 15025 18642 26898 16872 20468 4477 -2698 -11482 -11914 -11199 -18453
4707 -18453 -25145 -38007 -41624 -19557 -12026 -6856 -2382 10057 4931 11492 18399 16173 7214 2559
4693 2559 2208 3480 13394 5936 -5957 -20199 -26385 -28366 -23540 -15174 802 -9744 -22440 -40726
4679 -40726 -48464 -36474 -12153 5877 -14300 -37885 -21118 -2050 -3707 -2551 -10233 -22930 -26603
4666 -26603 -25780 -9115 -3351 -13527 -39198 -27473 -14950 1209 9088 5152 9839 -20958 -32747
4653 -32747 -26065 -25798 -24928 -12679 -26355 -34402 -41289 -12815 -14171 -23487 -14881 7649 21738 17812
4639 17812 -4097 -6103 -9019 165 23387 -3939 -19839 -7786 -1197 6165 3774 12897 38329
4626 38329 42230 43863 32094 9980 3902 8093 4354 -6170 -20827 -18324 -21528 -31003 -22265 -11123
4612 -11123 -14564 -30089 -29165 -32752 -31404 -32964 -15419 -4219 7269 21544 17888 19002 13765 23460
4598 23460 24364 24201 30423 18387 8228 19591 48553 36485 2823 -6879 -10500 -22436 -25004
4585 -25004 6302 39123 46653 45159 39786 31402 14789 13579 12864 -2299 -15325 -10479 -11819 -20922
4571 -20922 -31230 -22041 -16405 -9234 -8258 -5122 -5362 -13195 -23428 -22035 -12027 -1239 10079 -6614
4557 -6614 -13219 -3544 -1009 11513 14867 -10145 -1765 -13731 -31107 -24133 -18461 -15261 -12445 -30257
4543 -30257 -35171 -24371 -12635 -905 -10059 -7153 -5000 -8598 2163 4161 -16153 -15641 -15617 -16021
4529 -16021 -8640 -6812 15715 27160 15453 -12365 -13232 10956 20738 5131 -3102 2107 4433
4516 4433 8119 -14477 -24032 -20827 -20171 -16653 -3853 -7144 -25663 -29001 -14118 -2689 15033 20294
4502 20294 9220 -4338 -13868 -8236 -2508 -28799 -35209 -32903 -31159 -45929 -41484 -24656 -4065
4489 -4065 8930 2240 -4032 -1230 -5591 -17241 -12108 -13254 -9801 -4432 -12578 -2833 7710 5296
4475 5296 -10324 -6855 -14942 -23378 -11029 -3745 -20830 -30222 -30881 -27935 -40771 -35546 -13277 -9606
4461 -9606 -13711 -17308 -12891 -10372 -2463 3420 13587 19192 21144 15729 13736 20393 12667 -5141
4447 -5141 -26458 -34799 -43555 -22341 -10600 -18015 -8532 -15572 -23834 -26907 -22563 -16532 -18282 11676
4433 11676 9695 -10004 -11118 3975 23555 11670 -4450 -7990 -10968 -5114 10384 13247 8896
4420 8896 -1424 -1109 11142 11295 897 -12150 -19211 -7585 -8628 -26895 -23813 -4304 10603
4407 10603 21740 16221 13666 -13281 -34542 -28669 -30275 -31802 -11517 -3809 -6279 -20275 -31126
4394 -31126 -33305 -19103 -23500 -19367 -14508 -10081 -3130 -12493 -7863 11921 33338 29401 19465 18920
4380 18920 -4410 -30844 -46256 -27163 -5286 5161 15287 14033 477 -9818 -24028 -19807
4368 -19807 -19681 -27986 -19345 -5385 -19084 -10060 -22468 -7078 843 -3157 4395 21860 24685 10758
4354 10758 519 -4702 5854 9714 2896 5560 -3773 -19041 -27431 -24115 -33637 -36663 -33801 -28878
4340 -28878 -21048 -18519 -7062 2230 -2117 -15474 -22894 -17659 -10447 -7161 -582 13505 3945 -1625
4326 -1625 7971 9837 -3219 -25671 -13959 10584 19042 7212 6388 -5218 -17017 -26486 -50760
4313 -50760 -69978 -33202 -5666 -8759 -21771 -17825 -19487 -20560 -20426 -19918 -17245 -26 -5457 -16069
4299 -16069 791 22586 11736 7547 1484 -16078 -15754 4535 525 -6833 -33291 -34853 -35637 -22915
4285 -22915 -1795 3166 691 -1322 -6146 -15415 -14481 -30338 -44148 -48431 -37388 -22360 -142
4272 -142 -3439 -10991 -29474 -41546 -40359 -30956 -8505 657 -4882 -23230 -23647 -7564 24982 26278
4258 26278 7687 -10923 551 2687 -5465 -11070 -24252 -17508 -7879 13461 38157 30629 10912
4245 10912 13940 15781 23066 -5423 -23352 -24097 -30104 -32449 -33980 -21848 16682 15574 -1522 4082
4231 4082 -12669 -23622 -15318 -34475 -24151 5029 12533 -1584 -2298 18134 28936 13762 -8183
4218 -8183 -22102 -3533 -1461 -3094 -10588 -8531 -25016 -42036 -40312 -22816 -21163 -12336 -10049 4280
4204 4280 4892 9382 2811 5948 -6109 -454 19664 22918 28598 24406 11662 10926 28127 34934
4190 34934 33134 25540 -1442 -14974 -25597 -34858 -29474 -13327 -10616 -16887 4380 14227 23565
4177 23565 17239 29906 34055 37527 35295 27723 11686 -3807 -3399 4134 17564 37736 17180
4164 17180 29406 39209 28862 34370 28258 23424 36702 29264 4515 3094 17076 6502 -5453
4151 -5453 -14439 1972 17048 9830 -12070 -3455 23106 20556 2905 -3802 -2288 -2077 -10170 -1398
4137 -1398 -18360 -18070 -12995 4709 -2044 -12112 -7770 -10331 6620 11520 15777 -3378 -23644 -24513
4123 -24513 -12773 -6498 -1643 9082 13842 10890 -2132 -13738 -14238 8205 29307 13719 23508
4110 23508 12201 -233 5370 9716 5257 536 -4007 -10778 -5794 -5746 -25258 -23935 -17323 -19309
4096 -19309 -28881 -28252 -13929 -10653 13447 19830 19196 24686 30288 14633 2621 -2800 -18794 -21968
4082 -21968 -20481 -29275 -30859 -12668 -11223 10722 -3379 -8123 -25520 -45624 -36222 -19939 108
4069 108 5941 16114 20814 7233 10012 -3102 -3406 8925 -11190 -16456 -22380 -27232 -19541 -9133
4055 -9133 -28310 -38077 -31256 -28663 -35110 -35039 -31123 -5756 13896 20141 17373 20627 20008 11916 18166
4040 18166 5842 -1108 9670 15453 14823 8578 5687 9773 15297 17583 10149 -1357 -5955 16461
4026 16461 7647 -6544 -19143 -17455 1234 4183 14746 37555 20597 15639 25093 19243 4249
4013 4249 14233 31402 16949 4358 -5645 3616 27454 25890 37364 47284 42372 38564 47618
4000 47618 42899 16953 -4015 -11757 -7719 -11921 -7961 -17986 -8213 16979 20200 16377 8370 575
3986 575 9259 23857 9291 12526 10391 -1378 4278 17202 16336 6794 1793 6356 3679 6882
3972 6882 9224 10828 16520 -3027 -9356 -5966 -4843 -1259 -8494 -12038 8581 20808 22687 30555
3958 30555 26527 -232 -1648 -11800 -26698 -12730 -9026 -1142 2057 -1998 -126 -6710 -9105 -18715
3944 -18715 -22413 -25511 8663 27450 24995 22015 60255 57399 25682 -7039 -7758 -12886 -12289 15008
3930 15008 35402 43434 46755 30772 10423 3436 5115 6406 -2864 -9587 -13414 -20587 -27259 -43938
3916 -43938 -23196 -16925 -19255 -3264 -7241 -9011 -9258 -7335 -7428 -27166 -15209 -6275 -2346 -12326
3902 -12326 -22585 -8012 -15555 -12633 -9501 7407 549 -805 -9188 -17155 -28288 -41644 -28551
3889 -28551 -20051 -15440 -17852 -22459 -25543 1172 22675 22516 34360 30407 18917 16138 19217 -2969
3875 -2969 7604 -3524 -13478 -25399 -24368 -27197 -15541 3031 16155 41125 35677 36689 37187
3862 37187 34643 26563 31814 9724 8306 17386 12647 7111 -10013 -28436 -25982 -24835 -6722 12980
3848 12980 13897 13299 7744 -5605 -32198 -46850 -40713 -40309 -35115 -34574 -30341 -10176 6307 9369
3834 9369 -7892 -3555 3803 17821 19078 10166 -9596 -3417 14990 12268 4397 6805 1168 -3237
3820 -3237 7240 2303 -13634 -5154 13821 1892 2790 -15278 -22402 -6216 -7857 -22569 -22710 -21215
3806 -21215 -13626 5567 14747 23037 18308 3093 -12141 -1523 436 -21490 -29776 -30418 -40953
3793 -40953 -17091 -293 8061 9202 14406 23349 3983 12431 6985 9111 5810 -3179 -14699 -24096
3779 -24096 -27895 -17961 -21732 -24888 -38886 -55136 -49358 -36921 -15385 -23723 -24961 -43432 -44417 -22705
3765 -22705 443 8311 16169 25260 3780 -13590 -7996 -4854 -8850 5370 -1688 -3521 -3693 4574
3751 4574 -558 1658 3480 4515 -11862 -20277 -17690 -26351 -11746 -5380 -16611 -27565 -20155 -24799
3737 -24799 -22126 -16368 3389 2030 -306 -6694 -2939 1441 -696 -7528 -13401 -174 15439 33618
3723 33618 27433 17686 9565 6686 3069 10740 46643 40306 20225 -705 -8007 1787 -5144 -5518
3709 -5518 -11770 -18304 -30331 -36383 -4857 32520 20652 -17075 -29802 -19002 14236 31245 28307
3696 28307 23758 13418 16229 5660 -4903 -4614 1321 3308 7217 -3209 -16473 1233 6483
3683 6483 8915 27 -28396 -32210 -22378 -20482 -34192 -31760 -19307 15033 15961 -2901 741 -14901
3669 -14901 -26165 -33174 -26035 -4212 17035 9561 -1236 -4614 -10445 -1682 7111 34228 31110
3656 31110 30332 4462 -16858 -20366 -3044 6732 3769 14244 -2358 6143 17344 8117 -12289
3643 -12289 -23535 -22072 -34832 -53877 -43855 -22303 22415 53063 43673 13654 17822 3324
3631 3324 -7921 -3446 4483 8359 3472 5357 6204 15283 19122 22973 26761 21378 20734 1082 -3778
3616 -3778 19583 33868 30318 12568 -10028 -23220 -12878 -10999 -3146 -4226 -15324 -1093 31043
3603 31043 9839 -571 4288 17249 3458 8217 5551 -14061 -2642 4159 9914 4813 -2658
3590 -2658 12343 23781 36936 23343 7372 13441 16877 4216 -10128 -18811 -5115 6179 16013
3577 16013 13313 13701 5890 -11796 -20511 -20926 -18877 -14217 -13124 -4616 4165 5939 18291 21716 1081
3562 1081 9577 19241 16835 32278 17782 959 9741 10909 7023 4737 11856 19748 24160 15029
3548 15029 8105 16886 14200 -2769 -32579 -28733 -19817 -11554 -462 -7259 -8107 -8459 -11349 -10022
3534 -10022 -8587 -1268 3053 22653 21844 5793 -2105 2924 17399 14707 12763 25857 10768 10397
3520 10397 992 -22912 -23433 -16239 -10014 -5093 -20341 -34319 -37488 -18562 4741 20906 3972
3507 3972 -3400 -10326 -16131 -5700 -4982 -11531 -18178 -32781 -54837 -52086 -28411 -14936 -13416 -12080
3493 -12080 -2081 82 -11838 -9142 1380 7417 -7364 -3887 -23876 -37035 -36705 -29961 -33808 -5802
3479 -5802 -8348 -13413 -23359 -21492 2500 -9804 -16015 -14821 -8957 -6148 4886 1950 13010 23294
3465 23294 6975 -1319 -14409 -5129 6095 18422 13117 15320 14630 33605 36372 37644 40519 31011
3451 31011 14126 5659 5172 -9595 -1313 3777 845 -5801 -10486 3983 -7021 -8820 -6571 -3698
3437 -3698 8576 -959 13418 15089 19305 36293 18524 -15086 -16991 -1392 763 11398 8765
3424 8765 335 -6383 -32349 -47503 -42834 -53306 -42675 -43867 -51567 -35877 -20165 -33160 -30578
3411 -30578 -10144 -859 1939 -9114 -3762 21601 16956 3463 -7504 -24123 -39509 -35684 -36907
3398 -36907 -18204 -12752 -15749 -21157 -25543 -11668 -14732 -15975 -15759 -4013 -12786 -6466 10066 -1139
3384 -1139 -12723 -776 1478 7074 -6185 -13687 3781 25116 13721 13099 6547 1320 14240
3371 14240 15227 7904 6283 5830 9083 21131 22715 19904 25766 10016 7162 -12 -11039 -8295
3357 -8295 -90 14573 21141 9064 17312 8977 18035 4328 -4176 -14404 -20007 -20806 -23089 -32459
3343 -32459 -20799 -14754 -33636 -26318 -16113 -6891 -9003 -13622 4566 14377 9108 7921 6412 -508
3329 -508 -6586 -7802 1246 -6425 -11059 -4463 19383 14690 -2034 10650 6629 5867 21128 16734
3315 16734 -6309 -2825 2170 -15339 -13988 1911 16345 6068 9344 29172 28559 25842 17850
3302 17850 8667 -7817 -7620 -15988 -39822 -22640 -23172 -36142 -16772 2326 8367 11220 7911 2478
3288 2478 -24450 -27820 -23524 -27599 1286 15752 15827 35934 43758 22907 10966 18412 16423 20686
3274 20686 30718 25512 20802 17238 22831 20515 -1344 3185 1365 301 5492 18603 10656 9988
3260 9988 16363 19750 2231 4817 4530 -11633 -11352 -8771 -2661 -6436 -4285 -6045 5489 2510 8517
3245 8517 -2304 -10633 6376 -9579 -28116 -26464 -4460 13787 14292 9929 -2669 -2460 179 57
3231 57 2464 8627 8277 7429 14600 22745 32619 19947 3091 -4161 -20867 8749 19650 4688
3217 4688 829 6244 17410 19883 19542 10221 10288 2470 -6608 -7692 566 1293 -10349 -35291 -22303
3202 -22303 -30600 -48258 -41749 -30367 -30378 -15414 -3921 -7016 -9717 5931 10467 7176 5088 1976
3188 1976 -1978 -2998 -6312 22539 22710 21916 20170 30670 20140 -10945 -22237 -20157 -11974 8570
3174 8570 13616 8709 19055 12363 -11840 -10112 -6506 4670 6832 -8891 -14613 -6052 3919 1821
3160 1821 3413 9499 3766 8748 7580 -5885 -25235 -22491 -27860 -17049 7186 9750 11282 7648
3146 7648 12286 -11482 -41586 -30641 -13487 -1108 6502 2982 -4488 -7675 6257 6981 6730 9608
3132 9608 -14957 -18800 -26 14098 37730 34703 9102 -2598 10347 23158 10451 9921 8281
3119 8281 -549 -5967 -2402 4640 -3144 -9481 11798 20379 8389 -11708 -15864 -21180 -9071 4394
3105 4394 -5326 874 -1311 -4295 7158 4408 -20501 -22567 -2484 -13025 -4698 13757 8718 -18020
3091 -18020 -31229 -28363 -21615 -895 13669 14341 -958 -8996 -10670 -10213 -2497 -4506 -9790 -5678
3077 -5678 4910 -2586 10313 15906 23698 23083 805 -3731 5044 7988 5434 -17257 -3199 21460
3063 21460 17496 -1698 -5883 -31726 -34029 -18792 -3018 790 -3629 -617 -4902 639 12276
3050 12276 9709 -1297 1827 7923 13120 11082 15174 10942 4661 10514 1822 -3998 -24557 -13356
3036 -13356 16792 8501 -1471 2881 15471 6524 20274 28169 25061 14443 14405 19871 13847 -5198
3022 -5198 -11872 -11820 2986 7857 4954 4583 18490 1477 -30623 -36336 -27239 -25093 -20877 -9096
3008 -9096 13214 9847 -4806 -11513 -24932 -32953 -45947 -24956 5091 16843 -4541 -22483 -35385
2995 -35385 -35722 -13438 -28624 -46861 -40000 -28828 -19189 -20452 -26842 -26856 -32074 -29908 -24107 -24264 -33933
2980 -33933 -40575 -25110 -13260 -24514 -20302 -19420 8850 24512 30741 12416 6475 9608 11744
2967 11744 5149 13666 -711 -29932 -29715 -4392 25961 25173 19480 19376 13458 -3535 -18871 -10850
2953 -10850 -4156 -15074 -10051 4547 11329 6720 -10070 -19367 -12632 -1298 11940 11347 5698 -4882
2939 -4882 -8862 6267 7733 1774 -5829 -14023 -15135 -13454 -5078 7712 20486 7729 4443 12648
2925 12648 19233 23194 20991 34425 41780 34437 12584 -911 -5823 -6040 -1370 -6033 918 -4684
2911 -4684 -3612 5966 -4637 1391 -8743 -3533 -5648 -21779 -7193 2750 -15610 -28728 -15668
2898 -15668 -16398 -16271 -21382 1173 21685 8799 -4692 4820 11809 19607 365 -24518 -25165 -33141
2884 -33141 -32511 -20417 17839 57671 66625 43181 14545 9899 -8011 -8186 -6930 -16937 -15877
2871 -15877 -8057 -9217 -26153 -45630 -36329 -4713 7339 -10168 -23596 -27254 -25150 -32870 -26223
2858 -26223 -413 20152 1279 -7467 -9293 6482 28454 27847 6041 -1782 3044 22553 37651
2845 37651 34033 13035 19263 43984 44221 22728 7889 -19540 -30184 -28917 -20454 -14243 -8099
2832 -8099 -3954 -5664 20042 8708 8268 2495 -21297 -23735 -19558 -10173 -9301 -25668 -21166 1188
2818 1188 3197 9579 21218 13940 10193 33927 23774 8687 -7260 -2741 8269 -5354 -13235
2805 -13235 -4669 -4902 9025 19306 1835 -11476 -22089 -29716 -24199 -5677 12827 5080 17755
2792 17755 38263 28063 19108 2819 11078 9065 10830 37040 44503 22194 -8737 -19863 -9086
2779 -9086 -1309 7274 4227 -4385 -3956 1499 25971 26038 7003 17026 11807 -7106 5619 23190
2765 23190 25717 10977 9029 15496 10697 -12589 -8566 -12514 -16454 -9264 -5673 -11170 -1336 -6370
2751 -6370 -15337 14173 22403 23739 36326 42194 40593 19939 -3361 -1700 -2525 -8853 -10922 -11347
2737 -11347 9016 33092 23992 7421 23033 25227 35259 44445 26511 9801 -5241 4781
2725 4781 10695 16277 9766 9815 -6447 -19530 -289 -10581 -33117 -19017 -2880 18029 10229
2712 10229 -4279 -18800 -21458 -23626 -29394 -33858 -46228 -30178 -18611 -14812 -16931 -12630 -11139
2699 -11139 -17066 -16075 -20238 -21678 -25216 -27893 -36077 -22111 -11552 -9712 -8221 5141 -1950 1455
2685 1455 15187 10740 9431 11503 8966 37265 8704 -20722 -19392 -12525 -6986 -7704 -2299 -3214
2671 -3214 -11551 5247 -3279 -14081 -24830 -33671 -11563 -2969 2008 4637 3838 -15104 -825 9064
2657 9064 22775 23742 3207 -8757 -5740 -2133 -6734 -18608 -19557 -38858 -44430 -30320 -14689 -14810
2643 -14810 9227 24688 15856 5610 21103 14114 17710 14464 11406 6008 4977 -1900 -4468 -22346
2629 -22346 -27539 -16340 12668 293 11153 13804 21544 20210 17801 17279 14089 13771 -23793 -45628
2615 -45628 -22267 14481 18250 19638 32159 26837 10885 -2907 5096 16213 4017 -1142 6940
2602 6940 4949 -9161 -3208 -10124 -23230 -3431 10727 -1358 -9584 -766 2384 -23859 -35370
2589 -35370 -59933 -50960 -28168 -19757 -11253 -18394 -30154 -26926 -20488 -17272 -19248 -35581 -19654
2576 -19654 -298 12935 7378 7964 6551 17431 4085 -8089 -6051 12881 7389 4117 4017 18726
2562 18726 40877 8109 11334 6413 9171 4783 3923 3938 584 -11377 -7354 -12683 -5914 2690 14993
2547 14993 27052 26883 13139 6905 18720 21000 6462 -7014 -31089 -21335 0 9214 448
2534 448 -12180 6338 20761 4155 5612 -3059 -18979 -10754 -10398 6483 -3511 -10135 4414 14882
2520 14882 21131 21509 19213 9230 19289 29264 23150 27203 46344 62467 60335 19432 -7062 -12860
2506 -12860 -15844 -24565 -39005 -37213 -36786 -11951 -11963 -4249 3680 -13607 -15224 -36240 -51074 -21899
2492 -21899 -19244 -4979 -6530 14437 38535 13441 9281 22681 12835 -460 2998 3794 -9014
2479 -9014 -23861 -27444 -14130 -18125 -24487 -1369 12533 -10449 -8393 -7427 -16314 -30549 -33580 -36874
2465 -36874 -34350 -17158 -20106 -24711 -20572 -7330 27414 47490 30926 7385 4434 17686 15072
2452 15072 23174 15810 13288 35843 42658 17823 -2615 -18067 -16169 1949 14155 -1030 5724
2439 5724 28672 37841 48151 30513 15127 10577 11460 5333 4499 13009 -1426 -23600 -33740 -40984
2425 -40984 -26645 -12023 1171 12347 14385 1226 -22621 -20192 -12126 -32220 -21128 -14472 -26908
2412 -26908 -8766 8229 7963 -6917 -22975 -34098 -34790 -29090 -2981 -2027 -11040 -9605 -11973 -18576
2398 -18576 -9540 -6829 -2306 -1770 -5656 -3503 14812 -1231 -6786 -4867 7489 1717 -9931 -10587
2384 -10587 -5303 -13876 -6494 12526 17255 25312 18995 -6967 -5444 1271 10946 -332 -10300 -17341
2370 -17341 -29870 -27028 -14240 4143 40300 39150 10457 -14218 -7866 6304 5275 4537 7163
2357 7163 8771 22447 39028 34370 11443 11727 11167 8481 6782 20056 6692 8052 18780 8706
2343 8706 -5118 -12255 4225 -158 -9322 5828 15447 -1491 -21962 4361 19429 25817 16110
2330 16110 -7582 -11744 8025 23941 23712 34061 30289 -2366 -32425 -19233 -4398 -6937 3015
2317 3015 13295 31541 30869 22718 -2972 -12688 84 12491 -328 -15580 -16233 -9210 -5250 -5516
2303 -5516 -2610 12351 5557 -5670 -7507 -2666 2423 3746 -17191 -29757 -16012 -1379 2663
2290 2663 306 -14604 -9570 -11086 -1150 8818 19333 2851 9102 25393 31667 14913 10367 -1658
2276 -1658 18363 39894 22662 11469 15667 17070 7078 9993 -109 -20786 -2902 -8927 -5065
2263 -5065 -2175 3076 5380 -5197 2441 -13055 -22601 -6004 -9852 -8707 11157 7934 -5244 -2878
2249 -2878 618 -468 7595 -18771 -19642 -25959 -43407 -38062 -12997 -12238 -14096 -7339 3181 1361
2235 1361 -7923 -6115 -4583 -2993 1900 14392 35880 31114 2713 -17522 -17203 -28290 -22340 -5333
2221 -5333 -110 1956 -41934 -47479 -26588 493 18235 10761 -11645 -23501 -31991 -33638 -25592
2208 -25592 -7761 3324 22652 36520 21481 -4876 -7176 -6469 10428 22482 25084 -4 -3600
2195 -3600 -672 3668 1221 7329 -1794 16972 23313 25893 35493 33122 21187 23936 27579 27881 18491
2180 18491 8060 23650 12001 20541 31619 6075 6950 977 -2129 -6418 1717 -8209 3278
2167 3278 3007 -13918 -8358 -1804 6012 13257 9711 -7747 -33764 -26454 -10378 -530 12258 15878
2153 15878 10323 -38 -11685 -10642 -8985 -9884 12581 16794 19762 16963 6577 2582 6465 560
2139 560 -20628 -39004 -14711 5510 13192 9097 -1810 -18608 -11299 9791 33495 27143 -3073
2126 -3073 -7215 5965 1715 -4676 11359 25467 37030 35868 18942 4747 -796 -8819 -10595
2113 -10595 -15530 -6481 -1971 -3226 12947 19536 4920 230 -17653 -23268 -26123 -3217 35918
2100 35918 37959 13664 3789 1276 13515 7453 -18252 -20366 -7211 6909 9997 5961 14408
2087 14408 25437 28807 26042 28640 11595 -14124 -9023 -2141 1326 -770 417 12866 23283
2074 23283 25286 3619 -8704 -12623 3837 8695 15260 -6656 -2884 14093 10849 9528 -12875
2061 -12875 -13272 -22133 -30293 -48713 -37999 -30812 -28396 -11507 7502 17460 18209 19944 -2637 -22852
2047 -22852 -10623 1089 1545 -8459 -5682 -4885 1811 -4521 -16901 -10985 -8360 -11858 -21342 -25039
2033 -25039 -18113 -32654 -41253 -26424 -4581 13270 7400 -3777 -12011 -10390 -5054 9297 19465
2020 19465 21756 11878 7885 13002 11330 15056 16304 3421 -6051 -10496 -17059 -21546 -12002 -7524
2006 -7524 -11002 1228 821 -8032 -10609 -15171 -93 -11308 -11995 -20049 -2228 3871 -858 -3576
1992 -3576 13932 23516 19252 24914 25036 32840 30269 8051 -10686 -9084 732 4194 -14493 -38041
1978 -38041 -30360 -17888 -3677 6607 -3191 -8233 12444 12381 893 7969 18911 -990 -9162
1965 -9162 -614 28009 50783 32125 11654 9383 16219 40759 45131 32254 24685 9946 -22007
1952 -22007 -17099 -1402 2010 -17230 6093 5200 9908 8779 5611 16794 22628 3020 -8556
1939 -8556 -17713 -19838 -26140 -10560 8655 -5204 -34936 -51351 -39076 -1881 20382 18291 7862
1926 7862 5307 23453 8302 -8569 1240 -2838 -4482 910 3739 -3341 -4267 21244 38542 35954
1912 35954 31384 35255 30624 19222 17757 26853 30470 16866 23224 43308 59260 54932 39129
1899 39129 6099 -25367 -23209 -12065 -3450 -9150 -17857 -592 15329 14529 5702 -12237 -21445
1886 -21445 -8451 -9486 -19210 -36426 -20975 -7663 -33073 -50167 -55154 -40234 -29188 -13802
1874 -13802 3880 5343 -3342 1122 11654 28558 16413 -3057 1715 14095 16949 11169 -4584
1861 -4584 -2390 -2339 10469 24065 -7957 -30182 -25559 -12506 15141 32675 26044 13176 -884
1848 -884 348 4886 10134 5232 -166 5640 8475 16987 4821 9823 17 5400 -2997 6540 -13922
1833 -13922 -31431 -30097 -23656 -7033 -10461 -16182 -30962 -10506 9484 683 -4685 9159 11055
1820 11055 8749 38504 47118 32632 19565 -8193 -9514 21740 27394 12808 29584 16861 -10880
1807 -10880 -13868 -16607 -17645 -12018 -2078 22657 33867 33109 28677 17266 6832 7821 7942 3843
1793 3843 -2591 4935 3594 13166 -5749 -6153 5808 -13518 -23208 -14770 -16180 -7634 12548 40830
1779 40830 47546 38290 18816 -26942 -32541 -23257 -22131 -3886 20804 36701 9496 6220 -1180
1766 -1180 -6172 -16581 -8155 -9925 -5795 -1274 -3248 3147 18503 32933 40422 13721 -4890 15126
1752 15126 25560 8958 11199 20681 14730 -105 600 10745 21368 23014 16442 15811 12395 11073
1738 11073 2811 14209 18086 21036 32724 28853 13858 8558 -8943 -21724 -9483 14083 21978
1725 21978 15260 -2267 -239 34724 27163 9458 -1640 -13563 -12318 -5479 -361 4225 -22856
1712 -22856 -17881 -2109 9665 10119 -32623 -36224 -3749 5061 -7603 -1083 24 -8844 9839
1699 9839 10184 17981 16695 12002 5469 19737 23464 21338 4075 -21245 -48409 -40051 -21468 50
1685 50 2973 -144 -7880 4377 12675 13515 -3289 -11183 -1377 -564 11954 -4956 -10863 -13225 -11794
1670 -11794 -9846 365 2135 -6792 -4898 -3943 4985 10019 14005 19838 22404 11368 -7651 -11658
1656 -11658 -7303 -10038 -33342 -30405 -16081 -7423 -5706 -496 -3782 -3814 9714 15245 8019 10724
1642 10724 21334 17188 8256 4164 3143 14695 12675 9166 12984 13493 -6996 -23773 -12083 1863
1628 1863 4195 1958 -8871 -15668 -5987 -3417 -1034 -13026 -23337 6445 32953 40589 40744 28655
1614 28655 15061 16297 3209 6960 7476 -7163 5699 11565 22425 24833 19184 9301 -8816
1601 -8816 3481 9390 12900 22215 11505 4250 6484 -4941 -6701 -13436 -18789 -13027 3976 12457
1587 12457 13626 24089 33865 13324 -15798 -16285 -17765 5013 17669 29039 35876 39100 36224
1574 36224 20834 1723 725 -2310 7198 6033 11735 6115 25623 20227 20977 35316 39280 27753
1560 27753 28758 24224 8285 9603 -7920 -7798 6931 13495 9522 23846 37108 37325 25428 16609
1546 16609 29653 26039 19370 25394 26288 46583 58143 63776 44389 10963 -12893 -28368 -31833
1533 -31833 -32924 -10390 7963 -3402 13397 19509 14233 13015 9638 666 5511 19609 19710 2451
1519 2451 -40 11895 2876 -3577 -8196 13248 16780 7745 16119 44017 47275 24131 7943 -15381
1505 -15381 -34603 -27346 -19755 -22185 -11263 -2658 -3758 5842 5671 5414 470 -14763 -2212 3759
1491 3759 13945 30408 37862 40464 45399 25807 23106 20087 15987 9385 -4457 -28517 -12403
1478 -12403 10502 6651 -4899 7619 21572 21722 7102 12305 9551 6303 4646 2692 10507 8116
1464 8116 12235 25444 13677 1226 -3653 -27057 -18536 25679 35937 36465 26812 23087 38581
1451 38581 39324 14672 -8947 -11358 -8265 1734 -2534 -22920 -24875 -30378 -18681 -16946 -26382 -25662
1437 -25662 -12734 12583 13468 7258 15803 10262 -7477 -18239 -10549 -9658 -10295 2169 23543 38190
1423 38190 39715 11098 -4310 -14454 -23021 -7794 3941 6562 -14261 -30496 -10229 -11789 -33503
1410 -33503 -13443 17156 25903 18964 28702 36627 6584 13116 37029 49139 37487 19734 -983
1397 -983 11123 6856 -11254 -4763 2145 12106 6431 6434 5104 -1710 4771 8153 -263 -1382 8576
1382 8576 20714 17438 3751 -6605 -2825 16660 21201 37286 31226 21060 5084 -6821 -405
1369 -405 6244 13960 6351 10592 -12759 -18962 -13063 3095 17758 21274 27470 14335 -6008 7806
1355 7806 29239 14331 8380 23263 13902 -8243 -1827 8345 16646 793 -2766 1752 -4241
1342 -4241 -916 -8299 -4539 6145 -3730 -17974 -30813 -24948 -6024 8711 -5767 -8461 7625
1329 7625 5713 9030 10269 9535 -4767 -1185 3015 -21134 -31139 -8656 17460 28679 20254 22330
1315 22330 23827 11273 -945 -6440 -11200 -17080 -12252 -19109 -22196 -16442 -16007 -24566 -22491 -8196
1301 -8196 4829 3629 2839 5267 12931 20348 18189 -79 1335 1723 14625 28017 34836 17735
1287 17735 -2251 4672 11071 9596 23652 23094 11876 19771 8642 11604 19806 2796 -7032 -15354
1273 -15354 -16623 -21651 -18201 -30806 -18475 -15323 -6667 -19964 -22880 -11518 7134 30702 39043
1260 39043 26820 22168 27133 38842 30642 9147 -3879 662 -4008 -900 3786 -4809 10337
1247 10337 33108 20366 12439 2273 13677 24040 10972 18673 21741 40812 30843 19617 26690
1234 26690 18776 11485 -3920 -2234 -8970 -4655 -10655 -13791 -24145 -14311 -5106 -8604 -27314 -22481
1220 -22481 -12996 -13739 -12713 2858 11309 15735 24096 8607 6849 -11334 -19253 -22078 -3375 13410
1206 13410 16615 -1905 -3098 -8003 -1843 18100 16824 16833 18536 20071 2842 1902 2095 -6091 5725
1191 5725 14075 2720 -5232 2357 9339 19595 21984 4870 -12414 -17605 -20234 -26991 -20624 -21021
1177 -21021 -29077 -10162 18838 12014 -10052 -13005 -9641 -3233 3789 3983 6256 -7753 -8878 -1436
1163 -1436 -15679 -1050 -3266 -12846 -8741 -1555 -1799 -11883 -11214 -19457 3386 19004 9142 1052
1149 1052 1384 -4523 -7060 2742 4940 -3886 -11658 -2443 -6862 -15810 -13370 -7763 -5648 3272 -19122
1134 -19122 -22214 10293 4585 3648 75 -307 -76 4161 -4334 -15703 1235 8258 13850 7108 5994
1119 5994 5410 2663 7711 23215 21186 15129 12748 8665 75 -2292 -6109 4734 3715 -4298 12259
1104 12259 24349 7881 -5446 7937 25830 29220 28458 38660 39984 31226 28228 41115 43481
1091 43481 36036 38053 21297 25325 30884 34521 25773 17661 -8339 -20951 -5694 327 12282
1078 12282 21444 5504 7188 9079 -13971 -18430 -30745 -37765 -25685 -15895 2168 23625 13158
1065 13158 -555 8556 19881 29693 42083 37019 33397 55230 43406 21345 6971 -12331 -6478
1052 -6478 2093 14427 6710 8992 22195 32485 10561 -11422 -24325 -27568 -24885 -7787 -1869
1039 -1869 -181 -7550 -25720 -29837 -43920 -29779 -14777 2990 13972 -587 3031 3757 9924
1026 9924 7081 3477 6912 18987 16175 8793 502 15613 12767 3293 9030 23024 18817 -8489
1012 -8489 -38880 -34317 -7135 -7379 -29114 -25412 -8984 -15288 -8433 1201 12065 6512 -5392 -13541
998 -13541 -7687 9884 25132 12651 12421 1350 -6465 -16663 -8980 2444 1566 8736 971 -10707
984 -10707 -16187 -11521 -17186 1299 24021 26483 24188 49041 62268 49802 46778 54164 44180 25639
970 25639 28491 24347 5847 2116 12071 -7712 -28033 -21201 -24423 -10783 -11729 -22634 -10611 2724
956 2724 -5115 -19081 -13668 7507 20170 8846 -10475 1088 1038 -5765 -20561 -18469 -5035 7737
942 7737 11136 12974 4813 -10607 -11006 -3062 109 13851 -1684 -6224 -2036 -9156 10750 7916
928 7916 3821 -8321 -30712 -34579 -16412 -6862 10206 7066 -13933 -748 8187 -3411 -7106
915 -7106 -20402 -7409 3065 16252 11857 -9318 -33267 -17717 -8393 -4077 -1119 -6129 -3128
902 -3128 5246 11010 11637 2549 338 -31710 -28289 -8325 -9565 -13131 5162 16236 11395 14274
888 14274 21734 7886 -16254 -19278 -16029 5865 41674 44308 14709 -490 5694 2673 3541 6254
874 6254 20873 28715 30359 18232 9927 13947 21803 23117 10016 -16208 -22042 -14018 3013 8660
860 8660 10677 2746 2399 11152 9491 7349 19807 13210 -5171 -16622 -12548 -10647 112 14234
846 14234 22062 20186 16546 9328 18619 13499 13536 -120 24475 39075 46610 43607 26820 11741
832 11741 10374 8789 2546 13211 20060 14241 19678 5206 2955 3469 -243 -2417 -15767 -24690
818 -24690 2509 37129 38940 3463 58 5297 -3072 -4964 -8 -3339 -5661 -5046 -15063 -19452
804 -19452 -15979 -27369 -35824 -24361 1604 8734 14379 28156 40503 40116 16557 9844 19079 1693
790 1693 -7780 -15386 -9603 -20385 -32079 -23495 -9811 -7317 -6234 -3174 2578 7457 -7352 -20003
776 -20003 -5356 6769 -11626 -16204 -22856 -41222 -44427 -38978 -31488 -8914 12625 -591 -13644
763 -13644 -16364 -334 12641 26857 39360 15990 7257 11159 1959 2924 -5722 -16391 3082
750 3082 16157 10462 7470 6884 -14836 -29145 -7988 -7049 1094 -2453 2999 6282 -6019 -17356
736 -17356 -22395 -11573 -17413 -10502 -704 3651 2180 17770 8031 9098 9702 11790 -4932 -12549
722 -12549 -7783 3110 -2496 -12239 -12557 -3886 678 -8595 -7034 -18069 -10149 11992 9444 -2657
708 -2657 13215 20599 5891 -20861 -22825 -16211 -712 13871 -11840 -19842 -15647 -13017 2290
695 2290 6694 6352 7119 -1319 -6014 730 4979 6015 6341 -875 -4568 17694 -1594 -11652 -15103
680 -15103 -17027 -12481 -24733 -19806 -17873 -22493 -32795 -33759 -30499 -27297 -11243 -8035 -14911 -8990
666 -8990 6963 13684 -3013 3289 531 -9108 -17841 -19226 -10259 11358 7688 2384 6870 6115 -19400
651 -19400 -19263 1759 5551 -5426 -1620 20589 12495 24720 30212 25322 -794 -7586 -7701 -2824
637 -2824 -3351 -2533 -21656 -33916 -16571 -30632 -41534 -34071 -18973 -32442 -34790 -44568 -24580 5516
623 5516 8900 -19648 -40585 -31411 -6389 -2570 -5984 -5192 2704 8087 7369 -3005 -24189 -23746 -19671
608 -19671 -28540 -30617 -19279 -10856 -22747 -25789 -39647 -39790 -15724 5678 21533 18660 1743
595 1743 6329 28259 19193 22645 13728 8225 19533 28866 38789 38516 31684 31796 38218 62609 44339
580 44339 34334 31841 21487 14738 24997 24095 9016 14059 13502 19547 20451 8375 -5141 -7903
566 -7903 -30970 -21367 -17508 -19018 -19107 -3605 -13109 -27051 -15026 -7648 8719 18014 17960 13865 2963
551 2963 -523 2240 8426 -929 -4119 -5507 -8575 -11817 -3516 -16134 -14572 -4348 -2848 11480
537 11480 12444 17251 4710 -8398 -6771 -10930 -23812 -24542 -24773 184 19266 35986 40868 42141
523 42141 32218 10099 12538 -4857 -16468 -13489 -16157 -25462 -17654 -6227 -6983 -21935 -26716 -46240
509 -46240 -19848 1507 2324 -3142 -5582 -25778 -34308 -17463 -12759 5456 13520 -21467 -27384 -32696
495 -32696 -49956 -42497 -6392 -1664 -14077 -15018 -11295 -20271 -18053 -18615 -12054 -16454 -33938 -52914
481 -52914 -54497 -42767 -33936 -30281 -27804 -7637 3549 24041 18055 4820 580 -3857 -1782 -11537
467 -11537 -18162 -9230 6033 4565 -1082 12716 18091 35548 43382 24434 6114 8278 7415 18105
453 18105 28627 20340 -3324 12322 16824 12947 74 -742 8500 21159 12941 4189 -2711 -14552
439 -14552 -14683 -1567 -1217 -5749 -4184 4647 -1362 -2567 -9497 -19514 -30253 -21994 -23686 -18307 -3408
424 -3408 1476 4617 -9489 -9239 -5545 -10607 9441 8474 -16292 -25158 -25935 -21152 404 3567 -10722
409 -10722 -18244 -16132 -973 6256 13266 32 -9675 -11086 -8327 9500 3666 -8487 -7997 -1572
395 -1572 -3876 3204 3722 3650 -2755 -19392 4646 16491 12442 5523 -8291 -6338 1213 -4393 -2809
380 -2809 -132 2044 6357 20674 16037 -2167 -12839 1108 11193 908 -11729 -13319 -5573
367 -5573 -1771 -11184 -19967 5769 5380 -8233 -5610 -1213 -5816 3773 1963 -6464 -588 -5742 -29564
352 -29564 -28812 -22545 -14839 -10521 -25904 -18301 -17732 3645 -3759 -20432 -21961 -9300 -15197 -9426
338 -9426 -12125 -18073 -19537 -14160 -10944 -9509 -6488 -8865 -12897 -18403 -36912 -56344 -58184 -35605
324 -35605 -28416 -27119 -26149 -21528 -12551 -11302 -19677 -24834 -3471 6178 11297 888 -8708 -11095 -7819
309 -7819 -267 5392 8398 -15574 -19607 -24576 -19175 -8444 2115 7151 13934 21554 18661 21856
295 21856 -3962 -6484 -4037 -4986 -9529 -19835 -31460 -25372 -19711 -1598 1782 7365 6458 5879 1585
280 1585 2011 -1598 -18453 -25446 -29567 -29860 -24851 -25938 -19837 -14408 -8558 -14158 -8888 -11085 -11890 3816
264 3816 19849 13738 24802 17704 14260 1388 -5712 -7022 -7764 -28130 -17253 -13379 -13435 -12891 -8466
249 -8466 19139 23618 5657 -8356 -16056 -19488 -7349 -15288 -30193 -20840 -14179 -20553 -19983 -17335
235 -17335 -12135 -1530 6659 5976 14365 32522 23964 6687 -2109 -4206 -8025 4648 -6959 -26189
221 -26189 -16170 -2112 5752 4590 4641 5746 -13543 -30936 -34432 -14098 -2527 -12716 -22571 -14341
207 -14341 -7723 -2709 17097 17862 13430 21969 9739 -5950 4426 9465 -548 12162 22318
194 22318 20262 29200 13981 -531 4890 -2331 -10296 -15028 -10613 -9435 -21821 -26074 -21064 -20915
180 -20915 -23955 -21467 -23310 -20896 -24664 -4837 10351 12566 -7821 -9545 -7523 -3709 19326 30382
166 30382 28216 18424 11327 2620 9886 6247 560 8512 22933 22479 22298 21037 23330 27357 16098
151 16098 7659 -3578 -14292 -21656 -18740 -21995 -12669 -2315 -11433 -11220 -10456 -21558 -8331 2318
137 2318 -1301 -8816 -12362 -10215 -3988 -3965 -285 5902 5453 1342 -17272 -23082 -11085 -1547 2633
122 2633 -2540 -3127 23448 18335 12403 7747 5968 6071 8738 3666 1616 -648 -8323 -1894 -2658 -18141
106 -18141 -27067 -18835 -16653 -21458 -15110 -18175 -18671 -1655 9055 15265 20738 17647 12387 2080
92 2080 -16448 -19764 -25833 -16432 -14521 -22647 -18934 4144 14323 -2618 -6561 -9811 -25832 -31078
78 -31078 -26953 -13252 -1181 -5474 -13187 -11986 -7727 -2830 -15538 -29327 -20194 -18988 -32241 -35059
64 -35059 -43346 -34820 -19935 -26542 -26801 -28364 -23378 -28140 -28639 -13101 8716 12938 11015 8791 440
49 440 -17557 -35766 -37583 -33077 -25153 -18996 -15500 -20309 -27835 -28993 -25674 -18381 -6865 3107 9278
34 9278 5481 3400 -12760 -13291 -15725 -16383 -28271 -28919 -18891 -16235 320 -1070 6378 10293 16099
19 16099 20370 14855 1925 -773 6964 15353 785 -4266 -2443 -2757 -265 4210 2179 8556 7343
4 7343 13118 12324 9045 9920
0 9920
$$ Imaginary data points
##PAGE= N=2
##DATA TABLE= (X++(I..I)), XYDATA
32767 44426 42987 60772 64139 58285 55535 57478 58167 56967 52750 62431 73630 68642 70665 87915
32753 87915 92300 83374 70065 62862 67403 66344 76564 82433 84536 92047 90855 88728 64937 69679
32739 69679 82928 85803 85930 89939 85640 78276 75973 86969 86064 96940 93678 90366 89544 80405
32725 80405 80856 77834 74401 67320 79925 95471 102358 103302 104048 111324 111238 100339 89476 90542 106579
32710 106579 119190 134592 120341 115204 110531 93695 83873 96465 107022 114174 122291 119640 120127
32697 120127 126773 123016 131122 125818 131906 125176 112710 123070 129937 136862 122707 121045 112739
32684 112739 105792 113019 113654 111320 118064 126937 128503 133972 133482 139493 145633 147105 154053 155195 146864
32669 146864 130491 135764 147249 154452 151634 144775 147936 146063 144240 138154 144862 156502 156399 149525
32655 149525 146954 143758 140462 133997 145828 157857 170972 174058 170498 159138 173959 176353 170053
32642 170053 174430 176222 184928 181967 176694 172028 168145 172963 173567 164767 164839 176296 191386 184618
32628 184618 192746 204078 197864 182167 189452 189561 171099 173682 180968 180684 187654 196881 193769 184735
32614 184735 186213 206727 198628 186417 182285 186467 189960 198882 193318 185696 191571 185841 187736 191173
32600 191173 202372 214657 208907 193878 194043 190849 182474 181189 194000 216336 222683 217475 203921
32587 203921 192230 191815 182124 197536 208456 209421 209682 210476 207477 211037 220660 227741 225073 222249
32573 222249 233265 242061 240829 242004 230899 220642 212548 195567 194310 212447 249471 249171 246422
32560 246422 250880 246523 243301 236352 232612 248679 245054 233186 242667 250533 249751 251801 246309 251196
32546 251196 252517 259086 266347 274205 263219 240965 231181 223672 207260 222931 229546 236264 242740
32533 242740 237849 217976 189128 198914 205650 217392 232552 219139 222032 232978 247779 248047 222603
32520 222603 206698 231832 245284 251752 268225 269371 267762 272971 271655 267650 247789 236398 247955
32507 247955 247188 245288 257369 264117 277441 266553 247396 234783 244240 254595 251062 238762 235098
32494 235098 249460 265306 270589 247921 255957 257418 252491 254589 251681 259153 250652 250512 249521 249489
32480 249489 244686 249205 249875 256256 254636 258668 265131 285502 278356 266939 256205 274657 281379
32467 281379 271510 284037 284480 274279 283442 291431 296429 291702 275046 277434 288164 289611 297644
32454 297644 318433 312179 283981 272735 267104 272630 266446 252085 285813 305241 307231 289325
32442 289325 281563 285982 315551 304200 286404 280053 289019 293536 289676 297787 303458 307379 309525
32429 309525 307324 292415 285325 290494 296377 288634 300381 310264 306637 304176 308214 305120 308938 304640
32415 304640 305375 310884 302162 288039 295088 310421 294626 291725 307665 305321 297776 298882 301003
32402 301003 296993 302141 305799 299667 301019 307921 301859 301614 300346 308317 315311 308450 313014 312560 309802
32387 309802 315361 328154 343034 327347 322387 320699 306819 298409 294255 296318 279212 273878 299919
32374 299919 307192 294123 304591 300779 290938 286509 284218 296250 293731 294122 318913 332108 321063
32361 321063 316040 322923 342898 335000 329357 338747 331827 340982 342101 344349 345069 345736 348666 351388
32347 351388 333569 313591 316356 319298 330214 323553 322632 319337 298888 291530 297576 330724 336363
32334 336363 328517 317673 312923 317097 331034 329135 319213 322107 314049 310731 312027 309437 300927 311300
32320 311300 315727 302675 313282 304331 304186 304652 279214 267560 279668 308614 338265 333769 305958
32307 305958 314093 324126 317329 328099 334472 329829 335059 340022 325380 318202 313766 313172 323168 335876
32293 335876 348341 366765 363277 329144 315005 318488 337433 352322 364812 370198 374786 370646
32281 370646 354351 338440 310585 314659 334702 321953 338088 334684 346096 359799 371769 365310
32269 365310 362763 361325 340061 333561 351238 363197 354854 332072 345690 365772 342243 334777
32257 334777 347841 352992 337010 317706 329940 316645 302986 334869 360239 365266 342012 334958
32245 334958 342453 349621 346922 341307 337470 337018 347840 361814 372836 358713 356435 350853 347639
32232 347639 366753 371887 356273 356562 349889 347838 342622 334424 330279 341287 334379 320629 317320
32219 317320 320925 328905 350552 350849 345081 334009 319899 325408 329026 327907 324178 322680 320712 332223
32205 332223 339597 333569 335747 353901 357346 348841 351546 348007 328961 336643 350709 338536 353653
32192 353653 359679 339863 344125 339382 343846 355747 337265 311549 307091 324065 328395 328196 329814
32179 329814 348973 341148 319450 315640 341202 345515 337048 342509 355404 365589 368185 368337 348364
32166 348364 351787 341988 341027 350818 352723 358606 379090 372716 367258 369891 380713 368998 344848
32153 344848 341416 366532 352764 326089 326148 337749 331063 341815 334404 333135 350323 344839 354107
32140 354107 356877 361478 368568 368377 365840 358303 365516 360263 343945 344618 358314 355183 327024 326825
32126 326825 323367 335833 345635 358673 370462 386898 378026 366001 342161 335294 349181 323523
32114 323523 314603 314555 317965 323680 337648 349703 342149 321178 307570 295294 300285 325138 350821
32101 350821 340348 330256 312119 303073 338195 348773 346442 354745 368448 389530 405643 403384
32089 403384 382553 356844 340841 323874 326037 324763 337472 347593 356810 344355 341225 338803
32077 338803 345355 340846 327518 331745 360042 367751 369299 377338 387217 389551 375774 369873 358414
32064 358414 344362 341569 331242 344885 354580 374553 372971 356872 342801 354332 360049 345029
32052 345029 332404 312059 311485 331848 350994 360451 352338 332409 325576 323299 332940 343461 355710
32039 355710 352342 353340 333258 334700 324102 324109 334365 352098 372450 374459 364535 350755 335171
$$ [...]
##END NTUPLES=NMR SPECTRUM
##END=
