##TITLE=Analysis number 315309
Compound Code cc 47802
Book Reference 458/16
Project Code adrs
Chemist Name stevem
##JCAMPDX= 6.0         $$ Bruker NMR JCAMP-DX V2.0
##DATA TYPE= NMR SPECTRUM
##DATA CLASS= NTUPLES
##ORIGIN= Bruker BioSpin GmbH
##OWNER= NMR
$$ XWIN-NMR		Version 3.5
$$ Mon Nov 14 15:53:47 2005 GMT Standard Time (UT+0h)  MAYBRIDGE\NMR@NMR_250MHZ
##.OBSERVE FREQUENCY= 250.131544655141
##.OBSERVE NUCLEUS= ^1H
##.ACQUISITION MODE= SIMULTANEOUS (DQD)
##.ACQUISITION SCHEME= undefined
##.AVERAGES= 16
##.DIGITISER RES= 18
##SPECTROMETER/DATA SYSTEM= dpx250
##.PULSE SEQUENCE= zg30
##.SOLVENT NAME= CDCl3
##.SHIFT REFERENCE= (INTERNAL, CDCl3, 0, 16.522)
##AUDIT TRAIL= $$ (NUMBER, WHEN, WHO, WHERE, WHAT)
$$ ##TITLE= Audit trail, XWIN-NMR		Version 3.5
$$ ##JCAMPDX= 5.01
$$ ##ORIGIN= Bruker BioSpin GmbH
$$ ##OWNER= NMR
$$ C:\u/data/dgb/nmr/ADRS/12280/pdata/1/auditp.txt
$$ ##AUDIT TRAIL=  $$ (NUMBER, WHEN, WHO, WHERE, WHAT)
(   1,<2005-11-14 15:53:02.54 +000>,<MAYBRIDGE\NMR>,<NMR_250MHZ>,
      <created by zg, POWCHK disabled, PULCHK disabled
       configuration hash MD5:
       62 19 C7 07 E1 42 D1 B7 37 6C 3D D0 77 39 F9 E6
       data hash MD5: 64K
       04 69 8E B7 98 65 CC E2 77 9B 8E 4D BB C2 EB 56>)
(   2,<2005-11-14 15:53:23.82 +000>,<MAYBRIDGE\NMR>,<NMR_250MHZ>,
      <Start of raw data processing
       ef LB = 0.3 FT_mod = 6 PKNL = 1 SI = 32K 
       data hash MD5: 32K
       CD 8C D1 09 0A 4F 6F F7 CD E1 2F B5 6A 7E 21 8A>)
(   3,<2005-11-14 15:53:27.10 +000>,<MAYBRIDGE\NMR>,<NMR_250MHZ>,
      <apk 
       data hash MD5: 32K
       53 71 87 FB E1 27 71 0B 9A A8 6A EB 60 63 49 23>)
(   4,<2005-11-14 15:53:28.40 +000>,<MAYBRIDGE\NMR>,<NMR_250MHZ>,
      <abs ABSG = 5 
       data hash MD5: 32K
       4B 43 90 31 BF 8C EA 3A 67 58 AA 4E F9 E8 3A 94>)
$$ ##END=
$$ 
$$ hash MD5
$$ 1A E1 48 40 91 29 5C 67 B3 D8 42 EE 28 6C F6 12
##$RELAX= 
##$RELAX= 
##$RELAX= 
##$RELAX= 
##$RELAX= 
##$RELAX= 
##$RELAX= 
$$ Bruker specific parameters
$$ --------------------------
##$DU= <C:\u>
##$EXPNO= 12280
##$NAME= <ADRS>
##$PROCNO= 1
##$TYPE= <nmr>
##$USER= <dgb>
##$AMP= (0..31)
100 100 100 100 100 100 100 100 100 100 100 100 100 100 100 100 100 100 
100 100 100 100 100 100 100 100 100 100 100 100 100 100 
##$AQSEQ= 0
##$AQ_mod= 3
##$AUNM= <au_zg>
##$AUTOPOS= <52 >
##$BF1= 250.13
##$BF2= 250.13
##$BF3= 250.13
##$BF4= 250.13
##$BF5= 500.13
##$BF6= 500.13
##$BF7= 500.13
##$BF8= 500.13
##$BYTORDA= 1
##$CFDGTYP= 0
##$CFRGTYP= 5
##$CHEMSTR= <none>
##$CNST= (0..31)
1 1 145 1 1 1 1 1 1 1 1 1 1 1 1 1 1 1 1 1 1 1 1 1 1 1 1 1 1 1 1 1 
##$CPDPRG= <>
##$CPDPRG1= <>
##$CPDPRG2= <>
##$CPDPRG3= <>
##$CPDPRG4= <mlev>
##$CPDPRG5= <mlev>
##$CPDPRG6= <mlev>
##$CPDPRG7= <mlev>
##$CPDPRG8= <mlev>
##$CPDPRGB= <>
##$CPDPRGT= <>
##$D= (0..31)
0 1 0 0 0 0 0 0 0 0.06 0 0 0 0 0 0 0.0002 0 0 0 0 0 0 0 0 0 0 0 0 0 0 
0 
##$DATE= 1131983578
##$DBL= (0..7)
120 120 120 120 120 120 120 120 
##$DBP= (0..7)
150 150 150 150 150 150 150 150 
##$DBP07= 0
##$DBPNAM0= <>
##$DBPNAM1= <>
$$ [...]
##$SUBNAM7= <"">
##$SUBNAM8= <"">
##$SUBNAM9= <"">
##$SW= 20.6930455092707
##$SWIBOX= (0..15)
0 0 3 0 0 0 0 0 0 0 0 0 0 0 0 0 
##$SW_h= 5175.983436853
##$TD= 65536
##$TD0= 1
##$TE= 294.16
##$TE2= 300
##$TE3= 300
##$TEG= 300
##$TL= (0..7)
0 120 120 120 120 120 120 120 
##$TP= (0..7)
150 150 150 150 150 150 150 150 
##$TP07= 0
##$TPNAME0= <>
##$TPNAME1= <>
##$TPNAME2= <>
##$TPNAME3= <>
##$TPNAME4= <>
##$TPNAME5= <>
##$TPNAME6= <>
##$TPNAME7= <>
##$TPOAL= (0..7)
0.5 0.5 0.5 0.5 0.5 0.5 0.5 0.5 
##$TPOFFS= (0..7)
0 0 0 0 0 0 0 0 
##$TUNHIN= 0
##$TUNHOUT= 0
##$TUNXOUT= 0
##$USERA1= <user>
##$USERA2= <user>
##$USERA3= <user>
##$USERA4= <user>
##$USERA5= <user>
##$V9= 5
##$VALIST= <valist>
##$VCLIST= <CCCCCCCCCCCCCCC>
##$VD= 0
##$VDLIST= <DDDDDDDDDDDDDDD>
##$VPLIST= <PPPPPPPPPPPPPPP>
##$VTLIST= <TTTTTTTTTTTTTTT>
##$WBST= 1024
##$WBSW= 4
##$XGAIN= (0..3)
0 0 0 0 
##$XL= 0
##$YL= 0
##$YMAX_a= 393686
##$YMIN_a= -299482
##$ZGOPTNS= <>
##$ZL1= 120
##$ZL2= 120
##$ZL3= 120
##$ZL4= 120
##$ABSF1= 16.522
##$ABSF2= -4.171173
##$ABSG= 5
##$ABSL= 3
##$ALPHA= 0
##$AQORDER= 0
##$ASSFAC= 0
##$ASSFACI= 0
##$ASSFACX= 0
##$ASSWID= 0
##$AUNMP= <proc_1d>
##$AZFE= 0.1
##$AZFW= 0.1
##$BCFW= 0
##$BC_mod= 0
##$BYTORDP= 0
##$COROFFS= 0
##$CY= 12.5
##$DATMOD= 1
##$DC= 0
##$DFILT= <>
##$DTYPP= 0
##$F1P= 14.0000005364418
##$F2P= -0.99999901652339
##$FCOR= 0.5
##$FTSIZE= 32768
##$FT_mod= 6
##$GAMMA= 0
##$GB= 0
##$INTBC= 1
##$INTSCL= 1
##$ISEN= 128
##$LB= 0.3
##$LEV0= 0
##$LPBIN= 0
##$MAXI= 10000
##$MC2= 0
##$MEAN= 0
##$ME_mod= 0
##$MI= 0
##$NCOEF= 0
##$NC_proc= -4
##$NLEV= 6
##$NOISF1= 0
##$NOISF2= 0
##$NSP= 0
##$NTH_PI= 0
##$NZP= 0
##$OFFSET= 16.522
##$PC= 1
##$PHC0= 87.87221
##$PHC1= 2.471695
##$PH_mod= 1
##$PKNL= yes
##$PPARMOD= 0
##$PSCAL= 4
##$PSIGN= 0
##$REVERSE= no
##$SF= 250.13
##$SI= 32768
##$SIGF1= 0
##$SIGF2= 0
##$SINO= 400
##$SIOLD= 32768
##$SREGLST= <1H.CDCl3>
##$SSB= 0
##$STSI= 32768
##$STSR= 0
##$SW_p= 5175.98343685301
##$SYMM= 0
##$S_DEV= 0
##$TDeff= 65536
##$TDoff= 0
##$TI= <Analysis number 999999
Compound Code 99
Book Reference 9
Project Code 9>
##$TILT= no
##$TM1= 0
##$TM2= 0
##$TOPLEV= 0
##$USERP1= <user>
##$USERP2= <user>
##$USERP3= <user>
##$USERP4= <user>
##$USERP5= <user>
##$WDW= 1
##$XDIM= 32768
##$YMAX_p= 447268299
##$YMIN_p= -544880
$$ End of Bruker specific parameters
$$ ---------------------------------
##NTUPLES= NMR SPECTRUM
##VAR_NAME=  FREQUENCY,     SPECTRUM/REAL,   SPECTRUM/IMAG
##SYMBOL=    X,             R,               I
##VAR_TYPE=  INDEPENDENT,   DEPENDENT,       DEPENDENT
##VAR_FORM=  AFFN,          ASDF,            ASDF
##VAR_DIM=   32768,         32768,           32768
##UNITS=     HZ,            ARBITRARY UNITS, ARBITRARY UNITS
##FACTOR=    0.157963299565203, 1,           1
##FIRST=     4132.6476996994, 0,             0
##LAST=      -1043.33573715361, 0,           0
##MIN=       -1043.33573715361, -544880,     0
##MAX=       4132.6476996994, 447268299,     0
$$ Real data points
##PAGE= N=1
##DATA TABLE= (X++(R..R)), XYDATA
$$ [...]
22830a20825J11428J08917L8440J9249k6785q8762k9256N4112J26355K4233j13610
22819A03496j25217j28644j05113Q5890J17279J96687K7003j16593q7057p8209
22809a10478J6873r8343o5623K27707k5562o353P5938J24470L4341j3197j40055
22798A9718k0774J5953O9863L7046l6824p2460N716m201M6661j91803J5191O6011
22786d9903j71449o8954O9038P2228O9168N6343J06394j4542K2194O618r095L0781
22774A18821p2385K8914O5498j9826k24391j11080m8564R6602P8924q3095J9511
22763a51071l1426L6120P7358M1292o1081j0488L2061r813j1234J33944Q9077
22752A34739P6930O988j25858k07648k5190J5002J8996J7471r106p0138n9665
$$ y = [-120825, -9397, 99520, 137960, 157209, 130424, 41662, 12406, 66518, 192873, 217106, 103496, -21721, -150365, -255478, -169588, -52309, 144378, 171381, 54788, -32269, -110478, -93605, -191948, -257571, -29864, -55426, -61779, 14159, 138629, 172970, 159773, 19718, -1056, 14897, 84760, 121806, 84982, 12522, 18238, 14037, 60698, -131105, -115914, -49903, -221352, -290306, -221268, -149040, -79872, -23529, 82865, 68323, 90517, 97135, 88040, 118821, 46436, 75350, 140848, 121022, -103369, -214449, -263013, -166411, -87487, -170582, -151071, -182497, -146377, -69019, -27727, -88808, -99296, -67235, -77048, -88282, 45662, 134739, 211669, 218657, 92799, -114849, -140039, -125037, -106041, -88570, -97676, -167814, -227479]
22741b27479J37269K514o6305K0884P2221j6319K9658j4221l8620N4369Q2558
22730C6529Q2952J4909N7811j17256K4385M0955j72824j43004M5100m6968M9655
22719a27756J47314M0608n2847J15103J11845j15473j82297n6480M6896r6256
22709a69343k7137l371O0029R3408K0881j7525j9978O9965J057j87202o2989O3877
22697a78328J09501k2279J38999K8471j04402m2933J53966n1525P2206R9892j71279
22686C2289j22646l7633n2755l3077J7200P3688k61806n0390K03449P4144l0738
22675a88275P7469J35863P5149J7032R702L6156j7565l0630j07389j31437O0348
22664f3577J39453L0134j03873j63726O9377P7823k6757p2660k3499J13518M6646
$$ y = [-227479, -90210, -87696, -154001, -133117, -60896, -77215, -47557, -61778, -100398, -46029, 36529, 119481, 134390, 192201, 74945, 99330, 140285, -32539, -175543, -130443, -177411, -127756, 19558, 60166, 7319, 122422, 234267, 118794, -63503, -119983, -73087, -169343, -196480, -199851, -139822, -46414, -25533, -43058, -63036, 6929, 7986, -179216, -242205, -178328, -68827, -91106, 47893, 76364, -28038, -70971, 82995, 31470, 103676, 203568, 32289, -90357, -127990, -180745, -213822, -196622, -122934, -384740, -435130, -231681, -157537, -188275, -110806, 25057, 100206, 117238, 126940, 163096, 145531, 114901, 7512, -123925, -63577, 75876, 106010, 2137, -161589, -92212, -14389, -41146, -113806, -137305, -23787, 22859]
22653B2859n0680o811K3002m2322n1480J0065P9551J9474j866l8435k63852n6110
22641c56605L0888M2532L1767J03278J52031Q6289l3044k6847l1497j79322j19702
22630c00232J70069N9854Q484Q2378m841R162K7558M6333k7880j34984k1387R8675
22618A3189j0726Q9830N3203j79705l5140K829P207m9831p7586l936j07300k5397
22606c23363Q0075Q0144m560O1054J7846r108J55201l491j71417K0226R9024k860
22594a229J2259O1296q1204o7996k0445J42100J11919j4471j3721j39576j74001
22583a85069J9940J1338p9650o0735P1430J66566L0558l6795P0778J75114N9878
22572B43353O4359j71827q3565J15226p3978n0872R739j26483k7256P7478j0302
$$ y = [22859, -27821, -34632, -11630, -53952, -105432, -95367, -15816, 3658, 1792, -36643, -300495, -356605, -325717, -283185, -251418, -148140, 3891, 90180, 57136, 30289, -1208, -180530, -300232, -130163, -70309, -61825, 20553, 15712, 24874, 52432, 98765, 70885, -64099, -85486, 13189, 2463, 92293, 145496, -34209, -69349, -66520, -59313, -109144, -186730, -190666, -297966, -323363, -243288, -163144, -167704, -106650, -88804, -97912, 57289, 53798, -117619, -97393, 1631, -1229, 11030, 72326, -8878, -76874, -97319, 44781, 156700, 142229, 128508, -11068, -185069, -165129, -153791, -233441, -294176, -222746, -56180, -25622, -62417, 8361, 183475, 243353, 307712, 135885, 52320, 167546, 93568, 42696, 52435, -74048, -101304, -23826, -34128]
22561c4128m7566L7474J13486Q0914J07082j7112j34941j53010j9649R5269M1849
22550F9668J1327q189j9481J5988J17056n0749q7908j55618k006n6570o771J72815
22538d38J01937j35174O6832k3319j03025P6271j2252p6305P1042m921o0570L3179
22526f6743q1467L3251J46647L9604o0186k2401O734K1951l3809J06674r3882
22515c627l0739k2961P9045l2224J71981P9709N8401j440r2488j32358l2859j12122
22503g1682k7847J3463j5318L4957O0496o5801J00362O117q1376k4353K587j4900
22491h3295j4366N6126K6111J13890P4024L5153m8115J4269n8118q7031k6327
22480B321j5047k2020m0781J53351Q0490k4661j2142k1053k11030o7314J57153
$$ y = [-34128, -81694, -44220, 69266, 150180, 257262, 240150, 105209, -47801, -67450, 27819, 69668, 80995, 72806, 53325, 69313, 186369, 135620, 47712, -107906, -109912, -166482, -173253, -438, 101499, -33675, 33157, 9838, -93187, -16916, -29168, -105473, -34431, -39352, -99922, -66743, -148210, -114959, 31688, 71292, 11106, -11295, -4561, 17390, -16419, 90255, -3627, -34366, -57327, 21718, -10506, 161475, 241184, 299585, 298145, 205657, 73299, 40440, -71682, -99529, -86066, -101384, -66427, -5931, -71732, 28630, 34747, -46629, -70982, -68395, -83295, -97661, -41535, -15424, 98466, 172490, 207643, 159528, 173797, 115679, 28648, 2321, -12726, -34746, -75527, 77824, 158314, 133653, 121511, 100458, -110572, -177886, -20733]
22469b0733J21353m6029k7760J98092R2576j36580r9277L4961l4541k2398k9832
22458B9832R6991L3700j32339k0064Q9529m2372j78799j19150Q6191J32753M6134
22447B2406k5008q3898j8861P4450J27586P6962o1197L8063J6437j20136n5993
22436i189r8721J9263J87075m2018k3130j8273L9259q4462K4397p0135R6203O6663
22424H6932p8978k1956R2759J00928j06716j83982L4799J41435J04545J5528j36652
22413D8642n2549k5796j88407J3102K0341P0497M2278O0126R5679J71533j8757
22402B36689n8312m3391J25881j18999k29457j60698l7125j5024J48402J90017
22392C7983O9677j55398q5001J09775m5614p4743O866K07158M502j72471r196
$$ y = [-20733, 100620, 54591, 26831, 224923, 317499, 180919, 81642, 116603, 82062, 59664, 29832, 126823, 160523, 28184, 8120, 97649, 55277, -123522, -242672, -156481, -23728, 22406, -2602, -86500, -105361, -30911, 96675, 173637, 112440, 150503, 166940, 46804, -9189, -107910, -88647, 98428, 56410, 33280, 15007, 54266, -30196, -5799, -75934, 20269, 86932, 7954, -14002, 78757, 179685, 72969, -111013, -76214, 65221, 169766, 185294, 48642, -3907, -29703, -218110, -205008, -184667, -114170, -71892, -11766, 83913, 255446, 236689, 178377, 134986, 260867, 141868, -87589, -248287, -285412, -300436, -152034, 37983, 107660, -47738, -132739, -22964, -68578, -143321, -136455, 70703, 75205, -97266, -106462]
22381a06462K05857K7879m543j19971p8889P1668K56649Q8907j78840j69331L6083
22370B9007l553j6011l2445J8467r228r1107K16587K10073j13295k31118j02320
22359a24943J24304K2655M4521K9486j00314j50607r7055J8063J01804J43508
22349A1422J21914l3195k3906j709r1864m3980j12179Q9706K06714J86577j67646
22338A41854k12145j28810M2222N8514j5550l3021J31062Q2331P1942r9666j2713
22327B6020J14540J3333k4129R257K3739J5542p0050r3400o392J1505J15932R8368
22315B34265J27725R429r8189l0452n1515p8272j19248n7081R1924J15725n7168
22304H7143j27799K9542J44573M463P4086l5103j05509m5625m8240j82245J16444
$$ y = [-106462, 99395, 127274, 122731, 2760, -76129, -4461, 252188, 341095, 162255, -7076, 29007, 25454, 9443, -23002, -4535, -13763, -104870, 111717, 321790, 208495, -22623, -124943, -639, 22016, 66537, 96023, -4291, -154898, -251953, -233890, -132086, 11422, 133336, 100141, 76235, 74526, -17338, -61318, -173497, -83791, 122923, 309500, 141854, -70291, -199101, -156879, -98365, -113915, -146936, -15874, 66457, 138399, 38733, 26020, 140560, 153893, 129764, 139021, 162760, 178302, 108252, 14852, 8460, 19965, 135897, 234265, 361990, 371419, 273230, 242778, 191263, 112991, -6257, -63338, 28586, 144311, 87143, -40656, -11114, 133459, 137922, 212008, 176905, 71396, 25771, -22469, -204714, -88270]
22293h8270R0839p4710J22491M5352J4404L9270j8515o2753L8407K0954k4240
22282A03229K8497p5285j08908O0216P0136K6829l483l1294P1995J22144r7542
22271A66534k5719r2994M0542K6136q7417p993j6305p8946J0633m8774K2726L6821
22259e4756j27319M5070J7978J3568J36848k6104j83962m630J18703J38737r9517
22248b5384j06194j0346o2311r9664J7964J77083K8037l2910M5067Q3219n2175
22237c7614M3599J23146q2095q8653l617m3589J15808l2658k7843p217n6226p5901
22225a72860j75286q9356R8350K26423L6220k1663N5773j2568M2915J17486j10477
22214e043p234j1292K8452p0832j43509j10075L9165N0262J21484P5008j8976
$$ y = [-88270, 2569, -72141, 50350, 95702, 110106, 149376, 130861, 68108, 106515, 127469, 103229, 131726, 56441, -52467, 7749, 77885, 104714, 101231, 69937, 141932, 264076, 166534, 140815, 47821, 88363, 114499, 27082, 19089, 2784, -76162, -65529, -114303, -91577, -54756, -182075, -137005, -119027, -105459, 31389, 5285, -178677, -183307, -64604, 74133, -25384, -131578, -141924, -204235, -303899, -285935, -108852, -80815, -113725, -68658, 14561, -37614, 5985, 129131, 47036, -41617, -45234, -88823, 26985, -5673, -33516, -40733, -96959, -172860, -348146, -437502, -339152, -112729, -76509, -98172, -42399, -54967, -12052, 105434, -5043, -12277, -23569, 4883, -65949, -209458, -319533, -280368, -230106, -108622, -33614, -52590]
22203e2590R0779j7653M7385l6122R097r956R423k7003j11343j0728L4485M4985
22191b9241K6565M7222n435J01107N2452N4137j13879p5881m1042j0870q159L6474
22179C3450q421L4587L803J93260j9241r3103N9496k40811l7687q215M3173k4092
22167f3801J57748P4426r8769k5490l0712M3672O364k00773j21440l592J20914
22156a41453J40364j1409l9439l6425L8346n6272N6088Q5625r0450l8729N6561
22145c7193J2069R1773K22363J13721n8575r5203j02766J862j42373L8570M3290
22134H7538l6670O0557R6970r086m0288O8428P352j59807k4572m3197o8768l3866
22122i5409M6264j96554j2146R0828J08683J14732K8641j15205j01144m0616M0191
$$ y = [-52590, 38189, 20536, 67921, 31799, 40896, 30940, 40363, 13360, -97983, -108711, -74226, -29241, -2676, 44546, 39111, 140218, 192670, 246807, 132928, 57047, 16005, 5135, -3024, 33450, 25029, 59616, 63419, 256679, 237438, 144335, 203831, -36980, -74667, -82882, -39709, -63801, 93947, 168373, 69604, 44114, 13402, 57074, 63438, -137335, -258775, -262367, -141453, -1089, -12498, -51937, -88362, -50016, -106288, -50200, 35425, -55025, -93754, -37193, -25124, 66649, 289012, 402733, 344158, 248955, 146189, 148051, 5678, 44248, 87538, 50868, 111425, 208395, 199309, 159021, 227449, 234801, 74994, 50422, 7225, -61543, -95409, -49145, -245699, -257845, -167017, -58334, 56398, 85039, -30166, -131310, -171926, -131735]
22111a31735J4096P6907J72591J9153j56930P8231l482M1920Q6520M2843j87872
22100E2242k9150N3700o4230r8324K6005N5185j15852J7314J47544P1102K1904
22089A37440j59346R6464k2765p9546Q4614J615M2657J28781K6791J142r4792
22078A63055j47991j39260J7711m067L4529N1350J68944j2878l5722o8162m4076
22067a6567p1731N9881Q4248l1694l4829r3303M537J8823p8359l8451J09340j24995
22055b13100k8077P9215M5140J38218O0698M4948q1500L5545J01538j09295L6658
22044A09988R126n413L5648q5215o7424k43153O7290j7807P5254L4205l2046m4013
22032a63560j25214N5063l5920J27413J86740J19591j68027j12361J88P9614N6644
$$ y = [-131735, -117639, -40732, 131859, 151012, -5918, 72313, 68831, 110751, 197271, 240114, 52242, 23092, 76792, 12562, -85762, -59757, -4572, -120424, -103110, 44434, 115536, 137440, -21906, 74558, 51793, -27753, 56861, 58476, 101133, 229914, 256705, 257847, 163055, 15064, -124196, -106485, -110552, -76023, -24673, 144271, 131393, 95671, 27509, -16567, -88298, -28417, 55831, 24137, -10692, -103995, -99458, -80635, -158994, -197445, -88105, -213100, -241177, -161962, -116822, 21396, 82094, 127042, 45542, 81087, 182625, 73330, 109988, 119114, 113701, 149349, 64134, -3290, -246443, -179153, -196960, -121706, -87501, -119547, -163560, -288774, -233711, -269631, -142218, 44522, 164113, -3914, -116275, -116087, -36473, 20171]
22021B0171P347J03605j01506n699n0510M5963N3794m2631r0041R6751J73577
22010B10821N1848j27099r7341P8838q1491j49750K5402O9468Q7518L0789l3628
21999F5375q2871m0202J03815J23572j13350j01520Q1226J77981n339j41049j27183
21988e9545o425K47544M4144o0211J38691K7082j48035j44255J7565L0262j28931
21977d2114j22588n2812J66234l0117j40183m2677N993Q6141l1272J4543k8165
21966b17017m1505L1179o749J9314k2764m6400j7371n0966l3892J24503K6170
21955b35498n2331n4377L9624L6845N6323J07930O9400m4072l9851K08355J38034
21944B30382N8592l9307j25196j11460K1022p4998N8211J38049r940K8687m9820
$$ y = [20171, 27518, 131123, 29617, 23918, -26592, 19371, 73165, 30534, -59507, 37244, 210821, 262669, 135570, 38229, 117067, 35576, -114174, -88772, -19304, 68214, 99003, 65375, -17496, -57698, 46117, 169689, 56339, -45181, 36045, 214026, 208687, 67638, -59545, -65970, 181574, 225718, 165507, 304198, 331280, 183245, 38990, 56555, 86817, -42114, -164702, -217514, -51280, -81397, -221580, -264257, -258264, -172123, -203395, -188852, -217017, -258522, -227343, -234092, -214778, -237542, -283942, -301313, -352279, -386171, -261668, -235498, -287829, -342206, -302582, -265737, -209414, -101484, -32084, -76156, -116007, 92348, 230382, 288974, 249667, 124471, 13011, 34033, -40965, 17246, 155295, 145355, 174042, 124222]
21933A24222j11834N4198O7274q2461L0595Q7161r5427j36141k7482J01721R9188
21922A11014P6122K5449m5425J2096j19199M0509l7882J40634j02173j71221K772
21911f7304J04173k4576l0901l6957O5595l4135J9602O8675K9738o3745M9336
21900G9501J15545n595j21694m1708J24219P3502K5789j8700p5624j4519o1865
21889G8851j11512j34607j5302J24322R5171l148K5396q3595l5838J8641n6999
21878i8620L8039K15590J16929p3369j08822o8266j6177R462j3827o4603n0765
21867a14429J0549J37679o5106J05312L3187j04515J9198q1185k8002M7628R4700
21856E5016m0336M7057M2212o9766J42785L6834q0670R1920l7233m2341p7302
$$ y = [124222, 12388, 66586, 133860, 51399, 81994, 169155, 73728, -62413, -89895, 11826, 111014, 187136, 212585, 167160, 179256, 60057, 100566, 62684, 203318, 101145, -70076, -67304, 36869, 12293, -18608, -55565, 10030, -24105, -4503, 64172, 93910, 30165, 79501, 195046, 189451, 67757, 26049, 150268, 223770, 249559, 230859, 155235, 140716, 78851, -32661, -167268, -182570, -58248, 36923, 33775, 59171, -24424, -60262, -41621, -98620, -60581, 155009, 271938, 198569, 89747, 21481, 5304, 14766, 939, -63664, -114429, -103880, 33799, -31307, 74005, 107192, 2677, 21875, -59310, -87312, -39684, 55016, 14680, 61737, 103949, 34183, 176968, 213802, 133132, 225052, 187819, 145478, 68176]
21845F8176j54317Q5332R4635k9551K2907P995p0731Q0172O1849J404r1735M961
21833H1097p1615k3710L9100K8219j74429N178M1385k44418K6815J18927N4237
21822a19214l9048L2379o88l2034l8788N2881R4343J04763M2472p6555M9879r5932
21810b5542N8254o9128j85479P318N5136L8563K1481P4517R1074O4227K369N331
21798A38121j44425L4046k6636k7740K179K0278l7952o1823m6067R0930M5978
21787a3111p0028j11743L7884O2618L8289L0173j9890P3505P9891O2870j00473
21776F9985N7612K8854j67385M603p2478m9712L0278O7374m7606M5297L3218j22244
21764a22204m4584m4432J19052J08128j1838M7474p288L5803Q819r7540R331j18494
$$ y = [68176, -86141, -809, 93826, 64275, 87182, 95177, 24446, 104618, 166467, 167871, 76136, 81097, 9482, -14228, 24872, 53091, -121338, -116160, -74775, -319193, -292378, -173451, -119214, -158262, -125883, -126571, -158605, -197393, -144512, -50169, 54594, 97066, 20511, 70390, -25542, 32712, -36416, -221895, -214577, -159441, -120878, -99397, -24880, 66194, 130421, 132790, 138121, -6304, 27742, 1106, -26634, -24455, -4177, -42129, -103952, -150019, -59089, -13111, -83139, -194882, -156998, -94380, -56091, -25918, -45808, 27697, 107588, 170458, 69985, 127597, 156451, -10934, -6331, -78809, -128521, -98243, -30869, -78475, -33178, 40, -122204, -166788, -211220, -92168, 15960, 4122, 51596, 44308, 80111, 88930, -8610, 721, -117773]
21752a17773o1163O3339l3423o2865L1427K1950N3537N2163N9113J2209o5481
21741d6967L9287J40110P8132j34693j52552J25571Q3189j43674o1742J44077
21731G0738Q7802j0994p9572j002J4524j15168j74770r904J04461L3490o0146
21720a40541R6571L0384q579m2074k4176N8327M8424p3328J39072Q6747r7354
21709G3473j25263j45142J0967j0553l7428O4308j813J11435N8366O9726r6150
21698b8074j00814Q3568P5701p3846L7027K16096o2636m7125K729j44510j17616
21687a59500K9224k6317l9311N1225M7844O0990p3477O1774O7684Q1454j998J1141
21675A10733N4673n003M0751O6258p9374m3666j53282O7024q3978k3864J34585
$$ y = [-117773, -178936, -115597, -149020, -211885, -180458, -158508, -104971, -52808, 6305, 18514, -46967, -7680, 132430, 210562, 75869, -76683, 48888, 132077, -11597, -73339, 70738, 158540, 147546, 67974, 66972, 81496, -33672, -208442, -218346, -113885, -80395, -140541, -43970, -13586, -22165, -64239, -88415, -30088, 18336, -54992, 84080, 170827, 73473, -51790, -196932, -185965, -196518, -233946, -169638, -171451, -60016, -1650, 68076, -28074, -128888, -45320, 30381, -43465, -6438, 209658, 147022, 99897, 102626, -41884, -159500, -130276, -156593, -195904, -144679, -96835, -35845, -109322, -47548, 20136, 101590, 99592, 110733, 165406, 160403, 201154, 267412, 188038, 144372, -8910, 58114, -25864, -49728, 84857]
21664H4857J0812P7518l7104k43167j80995N5614J56738p2986j5132J48015R7924
21653H2094M2080M730o2844j58114k0409J14612J25544J09075j21023l2572l5170
21642D8003p8939J1237J67274J0178q4476M573p0629j30638K4267n9319Q3773
21631g4696J08380J05687J06138Q7548J28427j12250k61365p7191j29116N3056
21621f5382Q0399K5252j79991l1401k3704J24743J37617m1121N0010q9301k4930
21610c7809J16618j16719o0915J8572J59483P8477j54405p1028N7469j2927J00708
21599G7524j46825r7636r40j7261K4748J45325N6185J52592N871k1766q620j51709
21587A7488n1069M255J04429K682J03474k7789k17333j00942P1598j8671P7527
$$ y = [84857, 95669, 173187, 136083, -107084, -288079, -232465, -75727, -148713, -163845, -15830, 82094, 124174, 128904, 66060, -92054, -112463, 2149, 127693, 236768, 115745, 83173, 48003, -30936, -19699, 147575, 157753, 73277, 77850, 7221, -123417, -99150, -158469, -74696, 33684, 139371, 245509, 333057, 461484, 349234, 87869, 10678, -118438, -65382, 15017, 40269, -139722, -171123, -194827, -70084, 67533, 26412, 76422, -12879, -37809, 78809, -37910, -98825, -80253, 79230, 157707, 3302, -67726, -10257, -23184, 77524, -69301, -166937, -167877, -185138, -160390, -15065, 41120, 193712, 199583, 177817, 169197, 17488, -33581, -29326, 75103, 77785, 181259, 153470, -63863, -164805, -93207, -111878, -34351]
21576c4351N181q5391M3775J16300J74307q3409m4656O1646J04922r2209j15666
21565E0449J7207m2470K6387j2466l554n5312o1030K3679l6604M4705P7549j23346
21553i4806k1092L1956J12486n0323n5041K3279j4776L0607R3747L6308l8554
21542E3791j87867l5902m2202N0360J3543l8605P4625N4523O3084j3030Q0277
21531G2597J22654M6285J5741k6882J18693J6738j66233j14503j80683j15831
21521b11424O674R8278l7641j15365l0928N6421J18926M2897j34443K2071J024
21510a83510j6059l6447o7845Q5474P3005J7549p963J17832P6461L1599J09866
21499A99962O0665n4169j07218j2174o5719j6613K6058k0377m5173N854N7329
$$ y = [-34351, -29170, -114561, -70786, 45514, 219821, 136412, 91756, 153402, 258324, 166115, 50449, 67656, 25186, 51573, 39107, 35553, -19759, -80789, -57110, -93714, -49009, 28540, -94806, -115898, -83942, 28544, -21779, -76820, -53541, -68317, -37710, 56037, 92345, 53791, -134076, -169978, -212180, -161820, -148277, -186882, -112257, -57734, 5350, -7680, 72597, 195251, 241536, 257277, 230395, 349088, 365826, 199593, 85090, -95593, -211424, -204750, -106472, -144113, -259478, -290406, -233985, -115059, -72162, -206605, -184534, -183510, -199569, -236016, -303861, -218387, -145382, -127833, -135796, -17964, 58497, 90096, 199962, 260627, 206458, 99240, 87066, 21347, 4734, 30792, 10415, -34758, -28904, 28425]
21488B8425k4960j8797J16165J46002o4723j67629j47377j262l5504j4479J12302
21477g1837J0925Q8206Q4197l172l0610j35814j8333J78625M7102R76O6436J02683
21465C19384r3238j00081o5093k1402J7231j17280j6868J30687o4369j16841K1795
21454a06075J41510M0602N0792j14894j09566j42393j18327q109L2987K18583
21444a14890R2013K1926K1132K272L6241q2842K6363K10619j5431j60160j11528
21433g4285n1559m7972j38115n5002J35596P6738P3538Q1145j7820j50485j48220
21422c16441L0816O2471Q8090P3148o7042l9043m2692L6943L0438N7135j729N5639
21410c2267L2817R3468o9160j74350k9192K8728j3137j5171K8790r5065J9015
$$ y = [28425, 3465, -15332, 100833, 246835, 182112, 14483, -132894, -134156, -169660, -184139, -71837, -60912, 27294, 111491, 108319, 77709, -58105, -76438, 102187, 149289, 150265, 216701, 319384, 226146, 126065, 60972, 39570, 56801, -60479, -77347, 53340, -11029, -127870, -106075, 35435, 76037, 126829, 11935, -97631, -240024, -358351, -366460, -333473, -114890, -22877, -951, 20181, 22453, 58694, -24148, 2215, 212834, 197403, 37243, -74285, -125844, -173816, -311931, -366933, -231337, -154599, -81061, 84, -17736, -168221, -316441, -285625, -223154, -135064, -61916, -128958, -168001, -210693, -173750, -143312, -86177, -87906, -32267, 550, 94018, 24858, -149492, -178684, -149956, -163093, -178264, -149474, -244539, -225524]
21399b25524K03007n1641L7294J07028k0130J8056l5729l0155o5495o9835M060
21388a29064K6988M589j40068q6883O0758L3421J45516J13726l8411M8811r995
21377B9388k9213J3032m2600j3122J72139J8113k83784k4115K27190N2791o0090
21366E9729p4536M8773n4417q1851J76669l2201K16870Q846n1864p6024j17029
21355B2965P4951J14470q3454k6914K476q8434P5106O8943J6564o0623j01122
21344A4928l7287P8713Q9400Q0606l8453k00813m4256K5162P6558J07583p348
21333A44793p8041K8964K9078K9744m3692J9150j8347j7880j18424j8569P5519
21322C2295M5432k0200l9753P6244L9871n1759p5096r1472j9327m6867k0083M861
$$ y = [-225524, -22517, -74158, -36864, 70164, 50034, 68090, 32361, 2206, -63289, -133124, -129064, -102076, -97487, -237555, -324438, -263680, -230259, -84743, 28983, -9428, 39383, 29388, 175, 13207, -29393, -42515, 129624, 147737, -136047, -160162, 67028, 119819, 59729, -14807, 33966, -20451, -102302, 74367, 42166, 259036, 267882, 216018, 139994, 22965, 97916, 212386, 128932, 102018, 104494, 16060, 91166, 160109, 176673, 116050, 14928, -22359, 56354, 145754, 226360, 187907, -12906, -57162, -32000, 44558, 152141, 144793, 66752, 95716, 124794, 154538, 110846, 129996, 111649, 93769, -24655, -43224, 32295, 77727, 57527, 17774, 94018, 133889, 82130, 7034, -84438, -103765, -150632, -170715, -165854]
21310a65854N3696O2510J06868K4088l6873M662r2986l8341n5363j6366M2352
21299a11607R1596P7001Q7000J07203k07975j17347J33422J09901p1818p9843
21289A7533r5797R1726J17853J22908m3585j39283P2665O9033J7530q1286m4345
21278A04952j02160P4309J63845q3761q6152k7860Q255J5298o1588p0325k9837
21267i5024q0719L1124K68391R2220j21885J14486M0920j08755j10377n7278j36101
21256a62998N2889o2688M8080N6261K9197J07495N9282j57202j03792p1900n3774
21245b59150J521J26091J02268j0299Q0182Q2618l159j49409r5517O8007J67872
21234A11025J56215j4777o6677j96577K270L4977r3878j66858O0808J0727Q3625
$$ y = [-165854, -112158, -49648, 57220, 81308, 44435, 49097, -43889, -82230, -137593, -153959, -111607, -20011, 56990, 143990, 251193, 43218, -74129, 59293, 169194, 97376, 17533, -78264, 13462, 131315, 254223, 210638, 71355, 144020, 213053, 230583, 149297, 104952, 2792, 77101, 240946, 157185, 71033, 43173, 51428, 66726, 5138, -65187, -95024, -175743, -144619, 123772, 215992, 94107, 208593, 249513, 140758, 30381, -26897, -162998, -110109, -172797, -124717, -68456, -39259, 68236, 127518, -29684, -133476, -205376, -259150, -257629, -131538, -29270, -39569, 40613, 123231, 120072, -29337, -124854, -56847, 111025, 267240, 252463, 185786, -10791, -8521, 26456, -67422, -234280, -173472, -162745, -79120]
21223g9120J24882Q7216p847j5838J36925l3565l6468P7918k2890r2801n3852
21212H4560l3749j7413q822j3046p8904j24145K7410R4218R3920r8852q6389k5957
21200a87169O1376J39267O2817m01N0518m197M9138r9469j17365J02163L8953
21189I5631l369O900j50155k4309L2460N2433L3942p3946l1558j4843r3313Q7626
21177h2501R5327L5825o6308n2305K0165L8579m0818k07203M8966J13611N0928
21166d5734j27943Q221J2608j9471j64043J20083J48770J48700O3719O3681j19668
21155H8923p7537n458M0871J41275K0850j74085j11931M4388Q3446j21402q3461
21144a54121P6824M6528l3259N3568L2519N5258q0337r1973N83O6679j5936R0194
$$ y = [-79120, 45762, 132978, 125131, 109293, 246218, 212653, 176185, 254103, 231213, 138412, 84560, 50811, 33398, 24576, 11530, -67374, -191519, -164109, -69891, 24029, -74823, -161212, -187169, -125793, 13474, 76291, 75890, 126408, 122211, 171349, 71880, -45485, 56678, 95631, 92262, 99162, -50993, -75302, -42842, 9591, 43533, -30413, -61971, -76814, -170127, -82501, 12826, 48651, -17657, -69962, -49797, -11218, -52036, -259239, -210273, -96662, -45734, -173677, -165456, -152848, -172319, -336362, -216279, -67509, 81191, 144910, 208591, 88923, 11386, 5928, 46799, 188074, 208924, 34839, -77092, -32704, 50742, -70660, -154121, -77297, -30769, -64028, -10460, 22059, 77317, -3020, -94993, -94410, -27731, -43667, 46527]
21132D6527J05364M9475j17647k39146r2790Q6240L3250K9027n3557j39179o4111
21121c56547R5708J85974m2155m9492K5380j13496M8680J6707l406m0890N9348
21110a74189J31888m125j34199N5236M2219Q4784k1480J04348J3207J4355J5930
21099A27974m4108l9071L357j55475q6511k2795L3821K5127L6161N255Q4670J45246
21087A13651o6718j55791K9551P6443j33929J024j4143K7185j30753J14598M7388
21076i1494j890K0817P9620N1703L3265q2416p8532J4864J09656k7383k0681j5563
21064h034L479K8520k2668J50061J40201j59272j25515j03666o2703L5383N5699
21053f8515r692l7691N4777j0979J9415q0124J58030J90723j42868j22523q327
$$ y = [46527, 151891, 201366, 83719, -155427, -248217, -161977, -128727, -99700, -153257, -292436, -356547, -260839, -74865, -117020, -166512, -141132, -254628, -205948, -189241, -192647, -233537, -174189, -42301, -46426, -180625, -125389, -83170, 1614, -19866, 84482, 97689, 112044, 127974, 83866, 44795, 48152, -107323, -193834, -216629, -182808, -157681, -121520, -116265, -31595, 113651, 46933, -108858, -79307, -2864, -136793, -135769, -149912, -122727, -253480, -138882, -91494, -93384, -72567, 7053, 58756, 92021, 9605, -68927, -54063, 55593, 28210, 7529, -8034, -4555, 23965, 1297, 151358, 291559, 132287, 6772, -96894, -159597, -124214, -68515, -78207, -115898, -61121, -72100, -52685, -132809, 25221, 215944, 73076, -49447, -57774]
21042e7774J8969p9879j1197J03910O7703N5219O8418J47481M4804j24364j33526
21031I9764P8896L9350r3989M7052l5014Q5377j2189m2714l7869l9233m6683O6681
21019A09429N4313j24807j49724r3304j29636J43510J58940N0846R0975J4223
21009A24765j29717j15312j02881J10358l056J35190O3483J1700m8310q3977L8729
20998I72O1956n2962K2477q6809q6301O5809N0330l7463J41661j6153q4318l10
20986b1111k2443p7065n2698K2743J38337M9443n0439J9779j16303R5523j2517
20975b6751j16220k3176M3764K32529N4257k30614k4365M3445L6644k2683o8604
20964a01774J20800j4613j35232K2323m4922M2719J29623J31229J41779q8149
$$ y = [-57774, -38805, -118684, -129881, -25971, 41732, 96951, 165369, 312850, 357654, 233290, 99764, 178660, 218010, 124021, 171073, 136059, 221436, 209247, 166533, 128664, 89431, 42748, 109429, 163742, 38935, -110789, -204093, -333729, -190219, -31279, 19567, 110542, 124765, -4952, -120264, -223145, -112787, -115843, 19347, 82830, 94530, 46220, -37757, 972, 62928, 9966, 32443, -54366, -140667, -74858, -24528, -61991, 79670, 63517, -20801, -21111, -43554, -120619, -173317, -150574, -12237, 37206, -13233, 6546, -109757, -14234, -26751, -142971, -166147, -122383, 110146, 164403, -66211, -90576, -47131, -10487, -33170, -101774, 19026, 4413, -130819, -108496, -153418, -110699, 18924, 150153, 291932, 203783]
20954B03783o2020j92860J272o730q2464J70255P7813j34981j47446J4342Q1191
20943g7845N523o6887J76746R037n930j5464j23603j18935O496K7443J4334M5244
20931a23841O7081P6613o6749K5997J2749l9275l9578p009q5163o9252O7340K11978
20919C0891l1713k1428J07544K6610m8043j33132j15705P789J9460J772j8046
20908a74001L0810j7348J1309n2200L6027P9800R3138N2376l8180n9318j1865
20897d9452J07403M9807J00746P6979l1595j81067k28360R457j6055J28475N9609
20886B5947j34486n8208K8392J31370O6639J20122o0595j31914K0021k5508q9984
20875a08204N1009k6640M7080J11651P3298P1766n4498j29881r4425J29457K1213
$$ y = [203783, 141763, -51097, -49825, -56555, -139019, 31236, 109049, -25932, -173378, -159036, -77845, -72322, -139209, 37537, 46574, 40644, 25180, -98423, -217358, -210862, -183419, -169085, -123841, -56760, 19853, -46896, -20899, -8150, -47425, -87003, -94012, -179175, -248427, -181087, 30891, -822, -22250, 85294, 111904, 63861, -69271, -184976, -177187, -157727, -155955, -174001, -143191, -160539, -149230, -201430, -165403, -85603, 7535, 59911, 21731, -37587, -49452, 57951, 107758, 208504, 285483, 253888, 72821, -155539, -146082, -162137, -33662, 25947, -108539, -166747, -138355, -6985, 59654, 179776, 119181, -12733, 7288, -18220, -108204, -57195, -83835, -36755, 74896, 148194, 219960, 165462, 35581, -58844, 70613, 91826]
20864I1826J1859M8965K2728p4635K3762Q310k7112R124l7923j38206j16431j16762
20852b94495J08767P0811K16262j0367j39478Q1733L1952k3139p636p3751j7632
20841e6973l809k1402q094K8689O0815N7733J06295n9276k20524j04037J90885
20830b9698O3169k1324j35223l3771l839O3419N7354N8664M7552J6291J8379q4548
20818A6425p8136m1257j8320j2262m4505J44903Q1801J8981p8940L1566q1157
20807f0901K3257j9836l6821k8248j35272J58112Q7896r4929r0265j0813o431
20796b14251o073Q6189J96292K3304q0750j41668q2370m6224P7348J53375J56624
20785A21796R877K135j45181p1076J16640k4151J63806o3886m3102j9265q9370
$$ y = [91826, 103685, 152650, 175378, 100743, 124505, 132815, 105703, 114827, 76904, -61302, -177733, -294495, -185728, -114917, 101345, 90978, -48500, 33233, 65185, 42046, 34410, -39341, -56973, -60782, -82184, -90278, -61589, -774, 56959, 163254, 103978, -116546, -220583, -29698, 33471, 12147, -123076, -156847, -160686, -97267, -39913, 18751, 66303, 82594, 100973, 16425, -61711, -102968, -121288, -133550, -178055, -33152, 48649, 67630, -11310, 20256, -60901, -37644, -57480, -94301, -122549, -257821, -99709, -11813, -106742, -197007, -207820, -214251, -220324, -134135, 62157, 85461, 4711, -136957, -219327, -265551, -188203, -34828, 121796, 131673, 133808, -11373, -82449, 34191, 10040, 173846, 109960, 66858, 47593, -41777]
20774d1777m4297L1160P2877m0252K0981R175o2996N7398R2491j44484p0679K5826
20762i4577m9988j8054K00983R0838r2328P4947K3886j23221j07384J4725R5682
20751A5509J29827O9356j19180j51715K0013P9496O8785M4850j35519k6402m1863
20740d6843o3169J10824J41400j9346j14173k6640j40458k2743j3822J01911J22780
20729B9721R810J7669P5464J15564r7486J0631J9650K9166p0651L5035p7339O513
20717A03747Q1795p5732k96428j92725J19899K1118l7451J28541J22066j8832
20707d4002j80843j37771P7251M3500J02800M1620J2624j4917N0330m5231r1195
20696a85834p296J28049J01851j01994K6437m9071L0675P9801J06651j01201j41881
$$ y = [-41777, -86074, -54914, 17963, -22289, -1308, 7867, -55129, 2269, 94760, -49724, -120403, -94577, -144565, -162619, 38364, 129202, 36874, 111821, 135707, 12486, -94898, -80173, 15509, 145336, 214692, 95512, -56203, -36190, 43306, 112091, 156941, 21422, -4980, -46843, -110012, 812, 142212, 122866, 8693, -17947, -158405, -181148, -194970, -93059, 29721, 39531, 57200, 132664, 248228, 150742, 161373, 181023, 210189, 139538, 174573, 97234, 103747, 185542, 109810, -186618, -379343, -259444, -238326, -275777, -147236, -25170, -44002, -224845, -362616, -285365, -241865, -139065, -97445, -84821, -99738, -49408, -94639, -185834, -193130, -65081, 36770, -65224, -38787, -87858, -57183, 22618, 129269, 28068, -113813]
20685a13813L5099J6671m6208J9363R0534K4285o2327l0253l4037J2728p2865
20674a60823N1989K5325N5004J78943K3532j04246q2204p2561o1519J26149m168
20663b4579P7175j11635N8726J35178J47339n3540j09557j98551p6606L0327L8679
20652h7044Q5501o5918O765k8420M31J40639P6125K0974o2441K5550o7374k1503
20640B3285L798k4621M2177K1983N6329L2303j5647J19982r0672p2334k1155L7106
20628A12534J05880M3626j11328j57939j47918N2997L7811q4851m6833o575M087
20617a98509k6249Q7783l3463Q7640O8532J36627M6499K2535l0989j38583p6027
20606e4204p8689M5403j1749J8947P9296j9157m207K0002J46034N021j66942o8665
$$ y = [-113813, -78714, -62043, -108251, -88888, 1646, 25931, -36396, -66649, -100686, -87958, -160823, -108834, -83509, -28505, 150438, 173970, 69724, -12480, -85041, -146560, -20411, -24579, 52596, -59039, -313, 134865, 282204, 228664, 119107, -79444, -156050, -125723, -87044, -1543, -67461, -60696, -89116, -88685, 51954, 128079, 149053, 86612, 112162, 44788, 23285, 27083, 2462, 44639, 66622, 122951, 155254, 139607, 259589, 168917, 96583, 75428, 112534, 218414, 262040, 150712, -7227, -155145, -102148, -64337, -149188, -196021, -202596, -198509, -224758, -136975, -170438, -82798, -14266, 122361, 168860, 191395, 160406, 21823, -54204, -132893, -87490, -99239, -80292, -996, -20153, -24360, -4358, 141676, 146697, -20245, -88910]
20594h8910J19656L7347n3025J2372R3223o8345J6918n8238K3410L5539J17255
20583A87202J0791m5744p2840K8082N6303k8525j99130j1729J25685M9144R4790
20572A94029k29509k59483q7513J15545J76164J4104O851P5708N7432m4901p5148
20561e6721L0441J86517k3472n2075n1972M0784M0354m5724n4495l5708M3255
20550B1184k8265n8216R1673k2103n9849p0701L820J07876J08845m6310j3498
20539C4456n0964l1382o7894l2023l122j10950L0953N8667J38358R4001K11369
20528B71469K2186k06572k34143P895L8412J5821R103L3024j04973n5857O0139
20517a43496k7890P8255J97972N7941k9027j28390l3733M2977l3092j2726j27844
$$ y = [-88910, 30746, 68093, 15068, 27440, 120663, 52318, 69236, 10998, 34408, 69947, 187202, 197993, 152249, 79409, 107491, 163794, 135269, -63861, -75590, 50095, 99239, 194029, -35480, -294963, -382476, -266931, -90767, -76663, -69812, 5896, 63328, 18427, -56721, -26280, 160237, 136765, 84690, 32718, 73502, 113856, 68132, 13637, -22071, 21184, -7081, -65297, 26376, 4273, -55576, -126277, -122457, -14581, 94264, 47954, 34456, -16508, -47890, -115784, -147807, -150929, -261879, -230926, -172259, -33901, 60100, 271469, 293655, 87083, -147060, -139165, -100753, -84932, -75829, -42805, -147778, -203635, -143496, -171386, -93131, 104841, 162782, 133755, 5365, -28368, 14609, -18483, -31209, -159053]
20506a59053r944J63216J7123n2423J02826K8028n2478L4586R1529M3650k2906
20495A84154j65154l2411L593J10468K8867j9643n621m4965j26076L2839J00885
20484F6936o2369r0562K4087P4597R5517P2658m4879k9836k9552P6488R296R538
20472A71919j0443p4828j31667k9145L3725M1638M0407k2274j3853k1311O7915
20461E2083O0544P98M014j55503j1731K24026r2195j57669p708Q3131r364m1848
20449e1422j350M7633R5778J09034k7996j12026j50307M7126o3326O645M370N0084
20437d5757k1017j26663J32375K01431k168L9373k59111k46438O3811K06959R2628
20426C5423n9660J4762J1925k5343K7426k2068N373l4565K7453L5985K0890o439
$$ y = [-159053, -168997, -5781, 11342, -41081, 61745, 89773, 37295, 71881, 163410, 207060, 184154, 19000, -13411, -9818, 100650, 129517, 109874, 104253, 59288, -66788, -33949, 66936, 4567, -85995, -61908, 12689, 108206, 180864, 135985, 106149, 76597, 153085, 162381, 171919, 161476, 86648, -45019, -74164, -40439, 1199, 41606, 19332, 5479, -15832, 52083, 112627, 113425, 117439, -38064, -49795, 174231, 82036, -75633, -83341, -210, -9574, -51422, -52772, -5139, 90639, 199673, 171677, 59651, -90656, -43530, -106856, -100211, -95841, -45757, -66774, -193437, -61062, 140369, 138201, 177574, -81537, -327975, -264164, -57205, 35423, -24237, -9475, 2450, -22893, 4533, -17535, -12162, -46727, -19274, 16711, 37601, 31162]
20414C1162j13214K6797l890N729N6596K8193j371K11562q1799j49215n6467r5057
20402a40974M4805J46076K3965k8228j684k1918j08434k4374J15779J24869O7991
20391A97873n7219k03657j6064l2137J2989J34466K3218m7091o1653R0971k0165
20380B1531r2323N648J01427J93975R7667r3376j72406l6999L3261n2128j22130
20369a15853N1140J72448P7031p0006j42759n6254J67499K3832p1710n8195P4736
20358E1909p9556R489k5354L3824K9960l6573m7172K5683O2982j14622r9740M5852
20346a43318L5794J1627p8134L0228J48852P7317M3633J14211r9999j77062p3850
20335a10701K6953l2079M5624R6577J2241K99p4079p2263K2220J31561R0706o7759
$$ y = [31162, -82052, -55255, -59145, -53416, 3180, 31373, 30002, 241564, 159765, 10550, -45917, -140974, -96169, 49907, 73872, 45644, 43960, 22042, -86392, -110766, 5013, 129882, 197873, 140654, -63003, -79067, -111204, -98215, 36251, 59469, 12378, -49275, 41696, 21531, -70792, -65144, 36283, 230258, 327925, 234549, 62143, 25144, 58405, 6277, -115853, -64713, 107735, 184766, 114760, -27999, -84253, 83246, 107078, 35368, -22827, 51909, -27647, -18158, -43512, -9688, 20272, -16301, -63473, -37790, 25192, -89430, -189170, -143318, -107524, -95897, -174031, -143803, 5049, 82366, 125999, 240210, 140211, -36851, -110701, -83748, -115827, -70203, 26374, 38615, 38914, -35165, -107428, -85208, 46353, 137059, 69300]
20323F9300M9476j47232j07630R2633J10113J80360L3625q2775o745j49516j19884
20312g8275r4534L6608O1678l0434O1813P8313K02083L9460j82948j4601j19516
20301d0353j5281J07307J3456n1327j17584j2152P6617Q0538N2000o7459j34165
20290a08403l9425L8372Q2932Q702o2536j1226O6688N2421j51366r084N1198O4632
20278a7095J48372o4438n6520q3252j327J17896L8261K7528J2777k409o9325k676
20266D7792l7856L079L9279N3573j97913m5002J77504J08018n2064j67828j16748
20255a88166L7749J24321J6262O143R0190k3019j54584n0909M1123M7967P6922
20244B3999p8569p3634J52674K04120k1531n6211o3710o8307p4478L7739l6226
$$ y = [69300, 118776, -28456, -136086, -43453, 66660, 247020, 280645, 197870, 191125, 41609, -78275, -172809, -136201, -74523, -104957, -43144, 35169, 237252, 276712, 93764, 79163, -40353, -55634, 51673, 65129, 13802, -103782, -115934, -39317, 41221, 93221, 25762, -108403, -147828, -109456, -26524, -17822, -80358, -91584, -24896, 27525, -123841, -132925, -81727, -17095, 131277, 66839, 10319, -72933, -74260, 43636, 81897, 109425, 122202, 119793, 50468, 47792, 9936, 13015, 52294, 105867, -92046, -137048, 40456, 148474, 96410, -71418, -188166, -150417, -26096, -9834, -3691, 86499, 63480, -91104, -142013, -100890, -52923, 23999, -54570, -128204, 24470, 228590, 207059, 150848, 87138, 18831, -55647, -17908, -54134]
20233e4134l2656O1405p8819K88n3203l906N1388O7366j8942Q780m0642n9582
20221a52657J8563J5079l7708l0202P3482l2408l2328p936m5961K6603P389q1356
20209b79440l274J55136k3037L8941N193M5218J21027N2772k5504j7362l0965
20198C8705m8217K3841n5854j50582J5171R2121K6124r8966K6895J22595n1594
20187e9761m0430K5835K3174r0943m5972J21739l6899O8348J45280Q2295L2505
20176B25171j2359j22261K2264M602o8128j81547j77646R3732L5350J1232q1268
20165b50858J06748N9319j6682j13172j6970m8388j00527J78971J65332K5410
20155a0817K6825j6103o5117K0423O2196L5246j66060m8472L9201Q7958J11201
$$ y = [-54134, -86790, -25385, -104204, -103916, -157119, -161025, -109637, -42271, -61213, -52433, -93075, -152657, -134094, -119015, -156723, -186925, -113443, -145851, -178179, -186115, -232076, -205473, -198084, -279440, -282714, -127578, -150615, -111674, -106481, -61263, 59764, 112536, 87032, 69670, 38705, -9512, 14329, -41525, -192107, -176936, -84815, -58691, -157657, -130762, -8167, -59761, -100191, -74356, -51182, -142125, -188097, -66358, -103257, -34909, 110371, 192666, 225171, 212812, 90551, 112815, 117417, 49289, -132258, -309904, -216172, -180822, -169590, -250858, -144110, -84791, -101473, -214645, -231615, -280003, -380530, -201559, -36227, -10817, 16008, -95, -65212, -44789, 17407, 52653, -113407, -161879, -122678, -34720, 76481]
20144G6481m8388o0613m92j7373Q1383l313L8557J3549m7211m1007l1743J17150
20132G6980Q1820l5049q4283M8120K1663n1704m6227l0179j139R4284J11039k7195
20120A58130j06691k1907J9453R4903L7086N6499j3463J9296l982p9252j56309
20109C763q6642Q9368j9267p4487r2028r3893l8309o0793K6077R1177O9577R1164
20097i4293k6129p5928j15621J06211J76181J49610J2325M9976n0880j19244M194
20086A6402M4312o8976k1601L1701n8293K8714l0770k2789J38609m5396p0409
20075e8496j01771J47027J65087o5585n6332l0887Q4629P70l7422l74n2594R607
20063C659o4747q1324q2177J9828J17179K0079o9964N3598l4742J6994m7871k9316
$$ y = [76481, 28093, -32520, -33012, -50385, 30998, 27685, 66242, 79791, 32580, -8427, -40170, 76980, 158800, 123751, 39468, 87588, 109251, 57547, 11320, -18859, -19998, 74286, 185325, 158130, 51439, 29532, 48985, 143888, 180974, 237473, 224010, 243306, 239324, 160072, 3763, -82879, 6489, -12778, -87265, -179293, -273186, -311495, -372288, -346211, -255034, -185457, -94293, -120422, -196350, -311971, -205760, -29579, 120031, 132356, 182332, 131452, 12208, 16402, 60714, -8262, -29863, 1838, -56455, -27741, -58511, -81300, 57309, 11913, -58496, -160267, -13240, 151847, 86262, 29930, -957, 83672, 84442, 47020, 46646, -5948, 3659, -61088, -142412, -224589, -204761, -87582, -67503, -137467, -83869, -118611, -101617, -149488, -178804]
20051a78804l7099K8205J09932P15K6359Q7432P0979j06664n444m9670q7097J4720
20039a26436J02869P5026K9227n0102N5315p9880j21149l5541R8694Q1073J59454
20028A88550o3332q4340j13587J38843P2186q2725j30563r4258Q9079R5743O828
20017B2424r0756Q995K4978J48646q931l0988o5820m6391L0648o6645j7079j42
20005i1061M9879R4692p3700k8968R0049L6325p2259k3582P9574K35631J14117
19994D10697j76061j34550K3568q538J9614J1508O8411M4916o441j34903o225
19983A11996q8682j09503k5572j48152j60737n851L4662J64634Q5169J80757Q3293
19972A22014p4916m9262r3685J3487j4765R7434L8435p1003p5539J783j0610O6092
$$ y = [-178804, -215903, -187698, -77766, -77051, -50692, 36740, 107719, 1055, -4389, -54059, -141156, -126436, -23567, 51459, 80686, 30584, 85899, 6019, -115130, -150671, -51977, 29096, 188550, 125218, 40878, -72709, 66134, 138320, 55595, -74968, -169226, -80147, 15596, 22424, -68332, -59337, -34359, 114287, 105356, 74368, 8548, -37843, -7195, -73840, -90919, -91061, -41182, 53510, -20190, -49158, 40891, 77216, 4957, -18625, 60949, 296580, 410697, 234636, 100086, 123654, 115116, 134730, 146238, 214649, 259565, 253124, 118221, 111996, 23314, -86189, -111761, -259913, -420650, -426501, -391839, -227205, -142036, 38721, 122014, 47098, -2164, -95849, -82362, -97127, 307, 38742, -32261, -107800, -106017, -116627, -50535]
19960e0535O4014l1581q1549p8362J3738J22311Q9580l4278Q459r0336k439J242
19948f9736N0554l884R3484J8131j11769M6227J34442l5455j7023q4019j08313
19937h7361N005O5691k9914J6557r8522R6116m064M103o9728P9496n4474k6971
19925a04066O3118m7637J6986j14395N1059M7890R1295J09055J0921j91544m2918
19914a10236m672m9360R4343O8594j8659k4209R943M049p8785k1252R7850K131
19902c0263J85639K3652n1031J16471o4336j63307k6416N1167P2616Q3589J88238
19891C86019j08301k08550J4391L8767O0652j08100j01063m0473j629q621p2654
19880a49562P742o0763J14393J40293J09809O8207j0333j25290j29337l8952o4347
$$ y = [-50535, 13479, -18102, -99651, -178013, -164275, -41964, 47616, 13338, 21797, -68539, -70978, -69736, -19182, -23066, 70418, 88549, -23220, 23007, 157449, 121994, 104971, 20952, -87361, -82356, -16665, -46579, -30022, -128544, -32428, -36492, -32389, -102117, -22621, -77095, -104066, -40948, -88585, -71599, -185994, -134935, -87045, 4250, 113305, 124226, -67318, -110236, -114908, -164268, -69925, -1331, -19990, -44199, -34256, -30207, -108992, -130244, -32394, -30263, 155376, 179028, 127997, 244468, 180132, 16825, -9591, 41576, 114192, 197781, 386019, 277718, 69168, 83559, 122326, 182978, 74878, -26185, -66658, -68287, -76908, -149562, -141820, -202583, -88190, 52103, 161912, 230119, 219786, 94496, -34841, -73793, -138140]
19869a38140J60735K7060l3817R8923N4366M8568r3405r7894k1494n2239j45830
19858a93167L992P5727K1327j01044L0489N1115P76J70145M2908l2273j58402
19847h8407L3382j5336L7269L9227M8952r0859r8786k7862L5334l1818l7380J2795
19835a83489J44372l4978o5226m580m4531r8318Q0193Q7617P5124j2577M6853
19824i540N7782M6112m8848p5374j66920o7910J63209m1291J64674j5665j46907
19813a40678n5131l314K6090J7196L6542J17731K6315q2344j47370j01742J15043
19802a91662J43708L6242L1112K6706o2603M5928J9918l1148L1263K5147j18427
19791d3816p3703J00375O7265k158q1176j56842m1634o4818Q1583J65520m9489
$$ y = [-138140, 22595, 49655, 15838, 114761, 169127, 217695, 124290, 26396, 4902, -47337, -193167, -189175, -113448, -92121, -193165, -162676, -111561, -110785, 59360, 102268, 69995, -88407, -55025, -70361, -33092, 6135, 55087, -35772, -134558, -162420, -127086, -158904, -196284, -183489, -39117, -74095, -139321, -143901, -188432, -286750, -206557, -118940, -43816, -56393, -9540, 48242, 94354, 45506, -29868, -196788, -264698, -101489, -142780, 21894, 6229, -140678, -195809, -199123, -173033, -155837, -119295, -1564, 24751, -57593, -204963, -306705, -191662, -47954, -11712, 19400, 46106, -16497, 29431, 49349, 18201, 49464, 74611, -43816, -117519, -17144, 50121, 47963, -33213, -190055, -231689, -296507, -214924, -49404, -98893]
19780i8893M3082m7413l4060M770P3712m4189j29655M0019k9568J21981J40379
19769D0165m4542j67032j1732M828P8881J14167O112j4417q4666n0068Q2030l9375
19757h5649p1107j43363O7932K6841m5315J04279N006L9908J07630J00677J26244
19746B33083N0906q7488k67059r765Q9585r6178r8116R2450J57680q7700j03235
19735a25837j3237n0789L2166N9660L4917J80434P4404j31955M3790J09932l8054
19724A75431j31024m5235R4478N5470K1048J9062r829r7228j65457j15707R2528
19713a06463L4039l9786Q1329N3471J0151j72992j50252J11692J41208N6299K6545
19702D5241R9393J05478l9063j15953J1989k05950k08434M7620M9577R7924l5930
$$ y = [-98893, -55811, -103224, -137284, -132514, -58802, -102991, -232646, -192627, -222195, -100214, 40165, -4377, -171409, -183141, -178313, -99432, 14735, 20847, 6430, -78236, -128304, -46274, -85649, -156756, -300119, -232187, -205346, -250661, -146382, -141376, -101468, 6162, 106839, 233083, 283989, 196501, -70558, -80323, 9262, -86916, -185032, -92582, 65098, -22602, -125837, -139074, -189863, -157697, -98037, -63120, 117314, 191718, 59763, 103553, 213485, 175431, 44407, -828, 93650, 149120, 170168, 189230, 179401, 82173, -83284, -198991, -106463, -72424, -112210, -30881, 22590, 32741, -140251, -290503, -178811, -37603, 18696, 45241, 144634, 250112, 211049, 95096, 107085, -98865, -307299, -259679, -210102, -112178, -148108]
19691a48108k95M3603k5254K8300J18830L1055j60130j01752K4521K3219Q3454
19680h2557J01997J14279R505J20279n6594j8562L0523j57852M1257l2414k2649
19669D7212J25888J7899j24616p3571m5026O0234J41455r1523j12876Q7937J41398
19658A74411J23459l4732k11953j22133Q010J42802n2113j4073m6114j27039o2871
19647b22346K38732J22370o6034j30510r6195N6969J42559o0673m3409K5100R170
19636b4267K3341j20089J08840J04536j14458n4956o1165J24474K4065M9371M6279
19625A05971l7078j71619j19741j7853J18215J45567k5086r8310l0805J22006
19615h733J89622K8548L8691j57763j01045J8648J09965j4501j05367j8500p9066
$$ y = [-148108, -148403, -104800, -130054, -101754, 17076, 48131, -111999, -213751, -189230, -166011, -82557, 19440, 133719, 143224, 263503, 206909, 188347, 218870, 61018, 102275, 69861, 47212, 173100, 190999, 66383, -7188, -52214, 8020, 149475, 57952, -54924, 33013, 174411, 297870, 263138, 51185, -70948, -62938, 79864, 27751, 13678, -32436, -159475, -222346, 16386, 138756, 72722, -57788, -153983, -97014, 45545, -15128, -58537, -33437, -24267, -926, -121015, -12175, 92361, -22097, -77053, -138218, -13744, 10321, 59692, 105971, 68893, -102726, -222467, -240320, -122105, 23462, -1624, -99934, -130739, -8733, 180889, 209437, 248128, 90365, -10680, 7968, 117933, 103432, -1935, -20435, -99501]
19604i9501P2877o7818l7613j02936j52233J40744J19636J580L3746o1814p731
19593a61063M8421J89443m0605L4063p3218j99999r4635M0036m6702k8237J6321
19582c16175J92685J72180m7430K0694M5479l2775j7888o167j24177P696P3314
19571c2564J44803L2368m928o3969k54677r6769J10834O5639J9781j9641N2019
19560d7104O0769L3630J5139l099J24862n8074o2925N6722J60448J2426j49611
19549A43183l3468n5965J8426P1244r6227L676O8543q7835J5020O1120j750j37
19537A05830j434n3275o7187j56423L2910J49419R1909m3371j14968q1071M6527
19526i1134P9226m0494m3305m6699J02246r239J166n1561o0393R366J7013p8573
$$ y = [-99501, -26624, -94442, -132055, -234991, -387224, -246480, -126844, -125264, -91518, -153332, -161063, -112642, 76801, 36196, 70259, -2959, -202958, -297593, -257557, -304259, -332496, -316175, -123490, 48690, 1260, 21954, 67433, 34658, 16770, 10603, -113574, -105878, -32564, 112239, 144607, 139679, 75710, -178967, -275736, -164902, -99263, -79482, -99123, -47104, 13665, 47295, 62434, 59335, 184197, 126123, 63198, 119920, 280368, 292794, 143183, 109715, 53750, 72176, 143420, 47193, 50869, 119412, 31577, 46597, 107717, 105967, 105830, 104396, 51121, -16066, -172489, -139579, 9840, 101749, 58378, -56590, -137661, -91134, -11908, -52402, -95707, -142406, -40160, -49399, -48233, -99794, -160187, -150821, -133808, -212381]
19514b12381P6166O9383J5374n7608J0378L4985p1978j0821R4980P1585L8381
19503E8444j4193o649j57291m7370K835L1595J07232N9154L5255k5640p1820j743
19491c0191l3940P9178n2082M2301q5027n2675l5677J8984R715M7834L6558K18591
19479A63569p5769r4575R684m4477L9275N2828L9035n8249K383O4227j08539J10397
19467I9789M4479m565m3563K8455n1331K1636L7340N6320k2790K5802j6961j45046
19455B9565q6476J10661p6981n1048R7873m3005j41556k7626j09348l6575J62702
19444a71814Q1825N9803K337P3267Q6263p2064o0045r1227l064J1752M966K6430
19432e1571J22652J6544N0063K9967n0601J6297j29399o6386L0767Q0878k00570
$$ y = [-212381, -136215, -66832, -51458, -109066, -98688, -63703, -135681, -146502, -51522, 20063, 58444, 44251, 37602, -119689, -167059, -164224, -132629, -25397, 33757, 69012, 43372, -28448, -30191, -64131, 15047, -37035, 5266, -79761, -132436, -168113, -149129, -139414, -91580, -55022, 163569, 87800, -6775, 2909, -41568, -2293, 50535, 89570, 31321, 33704, 97931, -10608, 99789, 144268, 139703, 96140, 124595, 73264, 94900, 132240, 188560, 165770, 191572, 174611, 29565, -56911, 53750, -23231, -74279, 23594, -19411, -160967, -188593, -297941, -334516, -171814, -89989, -30186, -27849, 45418, 131681, 59617, -428, -91655, -94719, -82967, -78001, -51571, 71081, 87625, 137688, 167655, 117054, 133351, 3952, -62434, -31667, 49211, -151359]
19421a51359o802P2324j9618q200J25344l6952p7558M0720k0860k9528J09022
19410c467O4140l3529O436J19522M7696j66860k23608m8255J5795J10379K7419
19399h4332p2722m0384o9574J04136l5978J5485J7340Q7712N5412L699j12160
19388a31366J26546O6922m7909j89412j29774O0055J52716l4044J64Q2572n6428
19377i9958m3420n9687J3026J31729j07509l1436K22101j0789L7397k8371r0502
19366f7419k8007k4226l2126K3064K731j56064N3321J40548J00454j340L0653
19355D1589l4756J16008j6164o4225M5393Q3989m1584K9044p3898l4788m4464
19344F144J9833J69427l7220n8123K8098K6548l4497o973o1169n7891M3064m620
$$ y = [-151359, -158161, -85837, -105455, -113655, 11689, -25263, -102821, -62101, -82961, -112489, -3467, 60673, 27144, 33580, 153102, 200798, 33938, -189670, -237925, -222130, -111751, -84332, -157054, -197438, -267012, -162876, -198854, -183369, -166029, -78317, -22905, -19206, -131366, -4820, 62102, 14193, -175219, -304993, -244938, -92222, -126266, -126102, -43530, -99958, -143378, -203065, -190039, -58310, -165819, -197255, 24846, 14057, 51454, 23083, -67419, -95426, -119652, -151778, -128714, -125983, -282047, -228726, -88178, 12276, 10936, 41589, 6833, 122841, 106677, 42452, 87845, 171834, 130250, 159294, 85396, 50608, 6144, 25977, 195404, 158184, 100061, 128159, 154707, 120210, 113237, 52068, -5823, 37241, 32621]
19332C2621P9406j41652n1156O4770j07045k0285J02691N0916k5148j681J86557
19321A69994p1309j7524j02438N3070Q4915N6601j11371j34355m377J82509J8907
19310A24622J1035k74099k11373K15374M3181M315R7002k8525q7645K3027R5482
19299A2396J0683o0337K570O2303Q7486l5988K0477J7834k918j72970N2504J32386
19287A26426l5761N2051l5134n9420n6847j2194J4079P4838M982j73876j21388
19276b22244k7720k040J61908J35453q0950k515Q9251j1413P685J8854l7332q3906
19264e4969O4799O4296l1656j59351J04060J1189J1748J05712J4637R9171q0612
19253A49024j28035m4290l5110m804M4392J0305j24592K7127J08982M4398O3220
$$ y = [32621, 112027, -29625, -80781, -16011, -123056, -143341, -40650, 10266, -14882, -16563, 169994, 98685, 81161, -21277, 31793, 116708, 173309, 61938, -72417, -76794, 105715, 124622, 135657, -138442, -349815, -134441, -91260, -86945, 10057, -18468, -106113, -83086, 12396, 23079, -37258, -34688, 27615, 115101, 79113, 99590, 117424, 114506, -58464, -5960, 126426, 90665, 142716, 107582, 48162, -8685, -20879, -6800, 68038, 73020, -100856, -222244, -249964, -252004, -90096, 45357, -35593, -38108, 51143, 39730, 47415, 66269, 28937, -54969, 9830, 74126, 42470, -116881, -12821, -1632, 10116, 115828, 130465, 229636, 149024, 20989, -23301, -58411, -63215, -18823, -8518, -133110, -105983, 2999, 47397, 110617]
19242A10617J48792J4916j42513L5532n060N4295Q5745j10358o1658j7206P3155
19231A86257q554k3138l4763j27763M1542J01548R7172k6707K0933n9323K674
19220A69878n5130j4770M2450r6288J15960j47807j55573l3227N1492j14225J975
19209b35265J79172L2246Q6472Q5628j70491j46820N7810K09849Q273j4270K5101
19198A17705j5427K0381k9517j26390P6376j62189Q3438K09896l868r9216N8035
19187A29224j16688R0744L3567j5036n0529m5664o089N2909P118m2546j9382o9909
19175e2281q0730j16506L7598J81350k2038j4942N8662J33375Q1345p6360J6940
19164A46413k4288p3785R4034n3018q8731r5969k0231k2003Q8728L994q1472k3041
$$ y = [110617, 259409, 274325, 131812, 167344, 162284, 216579, 302324, 191966, 130308, 113102, 186257, 177703, 154565, 119802, -7961, 33581, 135129, 232301, 205594, 226527, 167204, 169878, 114748, 99978, 142428, 46140, 162100, 14293, -141280, -174507, -123015, -237240, -235265, -56093, -23847, 62625, 148253, -22238, -169058, -111248, 98601, 106874, 92604, 117705, 102278, 122659, 93142, -33248, 43128, -119061, -35623, 174273, 170405, 71189, 129224, 12536, 103280, 136847, 121811, 71282, 25618, 19529, 72438, 79556, 37010, 17628, -52281, -133011, -249517, -211919, -30569, -52607, -67549, -8887, 124488, 205833, 129473, 146413, 122125, 48340, 142374, 89356, 625, -95344, -115575, -137578, -48850, -44856, -126328, -149369]
19152a49369N381N0679M326k6159K1286P6903R2389n9677r5629O0860r077j7656
19140d5743k4113n5297l1392O9658J7763L5013N8592O8247p9362o8412j5774j0983
19128h1803j91406R0490J60790J87555n1955j39827Q1193K758j11400M8783J679
19117c143M395J19930m823O561J9597K0695k29987j04003J6933n3775J37547P5815
19105E742n1717o6420n2528j3837r7392l0340J77911J34411J3522o4168j39413
19094a84229o7525n163J15205l6607J03547N2134j47005j00839J5350n2471m9108
19083c56711K841J47180K10378k592o7285J842j3827K5565R2520P7687q7466q354
19071B1778l1323j05600m4762N2522J70393k6389j08124j25988Q8717Q5498J10131
$$ y = [-149369, -143988, -93309, -88983, -115142, -93856, -16953, 75436, 15759, -79870, -19010, -28087, -45743, -69856, -125153, -156545, -86887, -69124, -34111, 24481, 92728, 13366, -55046, -70820, -81803, -273209, -182719, -21929, 165626, 113671, -26156, 55037, 57795, -53605, -4822, -3143, 1252, 121182, 116359, 122920, 142517, 163212, -66775, -170778, -153845, -207620, -70073, 5742, -45975, -112395, -164923, -178760, -276152, -306492, -128581, 5830, 19352, -44816, -184229, -251754, -256917, -141712, -178319, -74772, -22638, -169643, -270482, -255132, -307603, -356711, -353870, -206690, 3688, 1096, -66189, -64347, -78174, -52609, 39911, 117598, 30132, 21778, -9545, -115145, -159907, -107385, 63008, 36619, -71505, -197493, -108776, -23278, 86853]
19060H6853n8735p5899L117M241M7617J5244m3337k6867J57849J0720m0139R3900
19048A74564m7553j52889q4966J23315J86949j4756k9616j82873q8006p8181j03690
19037b97702J1849P4342J05264P7999Q816o5564p6058j09903P0688J37803L5855
19026b6611o7280K589P4295O119j01619K386o8935o996L6149J46419N8567j25654
19014g0571K0995J13923N8719N9014O6922p3835j81032j14127N274N3052j983
19003f3649M9290r8284j17349J49767L9664m3650n1914N0449J4826k813N7361
18992a6302l7676k0599L7182j5760L8158P6523Q1077j08738j51245n5113P7449
18981i5044l8855j8772J36803R607r0089o2428J6811M5093l9650J49842J55621
$$ y = [86853, 28118, -47781, -44664, -40423, 7194, 22438, -20899, -47766, 110083, 120803, 80664, 174564, 127011, -25878, -110844, 12471, 199420, 184664, 155048, -27825, -115831, -194012, -297702, -285853, -211511, -106247, -28248, -19432, -84996, -161054, -270957, -200269, -62466, -26611, -93891, -91302, -17007, -10888, -112507, -110121, -179056, -186052, -149903, -3484, 55083, -70571, -49576, 64347, 123066, 182080, 249002, 175167, -5865, -119992, -114718, -61666, -63649, -14359, -112643, -229992, -80225, -40561, -84211, -136125, -85676, -70850, -73663, -16302, -53978, -74577, -37395, -53155, -14997, 61526, 142603, 33865, -117380, -172493, -95044, -133899, -152671, -15868, -6261, -96350, -158778, -141967, -96874, -136524, 13318, 168939]
18970A68939L27R319r6019r3213j24488j9154J60976J7728o1146p0692N0545P878
18958d9000q9751o0476O592K0180J12779M6475J2895L5894J7585l5858K0724p9850
18946d1811J5822p2956r8348o765l3657k3132O2875J19502k3779o7343m6455J72751
18934d3296J65126j51620o9306J34680j3691n0672o616k9461K1349L8715O9546
18923F4754J1160j5574J8909l7775m4271J0224J18583k8858N7442n4889K2394
18912A22099L123o6427p9294j6372k5773j89321q272K60238q8414m9005J831N2774
18900h2813J61249J35873m9219M2413L6326j83279k10310m3293J46444M0670j57893
18889a63832o2071J37986n9971J247K0731l8203J5256J39094J21336K7738k3502
$$ y = [168939, 169266, 178585, 82566, -10647, -135135, -154289, 6687, 24415, -36731, -107423, -56878, -49000, -138751, -199227, -192635, -172455, -59676, -13201, -306, 35588, 53173, 17315, 38039, -41811, -25989, -98945, -197293, -204058, -237715, -260847, -197972, -78470, -102249, -169592, -216047, -43296, 121830, -29790, -99096, 35584, 21893, -28779, -35395, -64856, -43507, -4792, 64754, 75914, 60340, 79249, 41474, -2797, 7427, 126010, 97152, 154594, 99705, 122099, 125222, 58795, -20499, -36871, -62644, -251965, -260237, 1, -88413, -137418, -135587, -82813, 78436, 214309, 165090, 207503, 243829, 60550, -149760, -193053, -46609, -5939, -163832, -225903, -87917, -147888, -146641, -125910, -164113, -148857, -9763, 111573, 139311, 115809]
18878A15809r2552n6254M7695o0244k6887k5021O4371Q6528K9371k2995l271R2892
18866A49442M8282m5622M9295Q1736n2049l03303k8345J4620n6646K2950R5385
18855b4255k235n9891j27038L2029Q2184k3626P3011J95376j08576j51619j13378
18844b28018P464J17887J67706l8521j21168q4563O5350J06732n5778n3067M046
18833a11930k8420q2905k745J53847M3598k0340j315M8794n1497J77537M6025
18822A70649m5135j02064j09667k8934J39476Q8700p5692q6796j7433n5459Q6050
18811c6305n3475J5435J5278j3639k848K1981N2885J3591K1059p6673M0700O04
18799a407K8091q7959m5983M0554K9635M4510J9531M7492J60437n9563o1317j43183
$$ y = [115809, 23257, -32997, 14698, -45546, -72433, -97454, -33083, 53445, 82816, 59821, 56550, 149442, 197724, 152102, 201397, 283133, 231084, -72219, -100564, -85944, -142590, -119640, -24255, -26490, -86381, -213419, -181390, -99206, -122832, -49821, 145555, 36979, -114640, -228018, -220554, -102667, 65039, 26518, -94650, -179213, -113863, -7131, -62909, -115976, -111930, -140350, -223255, -226000, -72153, -28555, -48895, -50210, -1416, -52913, 124624, 170649, 125514, 23450, -86217, -115151, 24325, 113025, 37333, -49463, -66896, -122355, -36305, -89780, -74345, -59067, -72706, -75554, -53573, -688, 12903, 33962, -42711, -2011, -1407, 26684, -61275, -107258, -66704, -37069, 7441, 26972, 74464, 234901, 175338, 114021, -29162]
18787b9162j65126K2656J34467J4990P5227L9111n0764r351j0718l8309k6805
18776d3784J15500M3319k3963j3030K149J45865n5099m4671J78028K6247J14155
18765D44716J59838L51242L12005j16148j72867j28608k1944k877k06789j53300
18755D65268r0716q7023K7749k3711p2894j15527J43974R4002n6655n9861R6000
18744C20606R9196j06010j82248m0698P8291j34304k06707J36357q4533q1698
18734b01748J03451l6899j47410O5930N6143N0309L9215O2872K4403o8291l4979
18723h7004P7844n2262m9561L0117p8897M9806N7518L0680o2778k0733M1456o3177
18711a26991L1427l3867k7054K1813J38676p480n1436M7911O0195O7470l6950
$$ y = [-29162, -194288, -171632, -37165, -22175, 53052, 92163, 41399, 32048, 21330, -16979, -43784, 71716, 115035, 91072, 78042, 80191, 226056, 170957, 126286, 304314, 330561, 444716, 604554, 955796, 1267801, 1151653, 978786, 850178, 828234, 825357, 618568, 465268, 374552, 287529, 315278, 291567, 218673, 103146, 247120, 341122, 284467, 224606, 320606, 419802, 313792, 131544, 90846, 169137, 34833, -171874, -35517, -120050, -201748, -98297, -135196, -282606, -216676, -160533, -110224, -71009, -8137, 16266, -52025, -87004, -9160, -61422, -110983, -80866, -159763, -109957, -52439, -21759, -84537, -105270, -63814, -126991, -95564, -129431, -156485, -134672, 4004, -3476, -54912, -7001, 53194, 120664, 83714]
18700H3714l8075M5044J6395O8621M5212j31883j24248l3602o0404J46728O0850
18689G8352O0589r391m4281M1945J9977r193j14148k03801J4994j599K1786N1192
18677i3578j7700J82078K378o5821J0420Q8956j03859j9487J9285j8838L6943
18666B0777j1032j26563m5186N5881p7436n5969J43434K6335M3734k6505r4456
18655a46986q4608P9932P7573P0740N52M3647M0815q85j5550j45670l2060J33230
18643B0730R4701n8543L4845P7795p9899j27415o9195j11243j02836J16701J71574
18632c2785r9051j53763J66885J35970R7439r2603m7124R8356K7721n6365N7315
18621A01995k636j50270n4539O2509r6581O2200M4348r3706j08192n8137O6910
$$ y = [83714, 45639, 90683, 107078, 175699, 220911, 89028, -35220, -68822, -129226, 17502, 78352, 138941, 129550, 85269, 127214, 147191, 137998, 23850, -179951, -164957, -166556, -144770, -93578, -111278, 70800, 73178, 7357, 17777, 106733, 2874, -16613, 2672, -16166, 20777, 9745, -116818, -162004, -106123, -183559, -239528, -96094, -69759, -26025, -52530, -146986, -231594, -151662, -74089, -3349, -2797, 40850, 81665, 80780, 65230, -80440, -112500, 20730, 115431, 56888, 91733, 169528, 89629, -37786, -106981, -218224, -321060, -204359, -32785, -131836, -285599, -118714, 17256, 114695, 22092, -25032, 73324, 101045, 44680, 101995, 99359, -50911, -105450, -42941, -139522, -77322, -32974, -126680, -234872, -293009, -226099]
18610b26099Q4176K7900O1873R2823L7527N0672J1756O3849o0539j3032O0929
18599A91835j23481q8884j5406j34002R6404j7743R385O8742n0137O9210m5439
18588c9516j23038R0101J31846R1797J2531P8864j03225r1179m5349N9766R5185
18577A57783j38308l9938n3971R2009K2871N447O262k8985P7965L527j67479r4995
18565a57812P6996n781O660l641m2062J20978O2613O8142P2460m5280j02168p4445
18553b3340J7266r51q0795N3592R2199J40591n4889q5881L1775M500j65716O9420
18541b229P8972k2809N759J2191j26087j36449L2940J13133M9300K9053k1990
18530A1784r45J3039r3349j9830M8685J40218p2220p4305J6729R7800m6464p8765
$$ y = [-226099, -141923, -114023, -52150, 40673, 78200, 128872, 140628, 204477, 143938, 130906, 191835, 68354, -20530, -35936, -169938, -73534, -91277, -81892, -13150, -63287, 5923, -39516, -162554, -72453, 59393, 151190, 163721, 242585, 139360, 48181, 2832, 62598, 157783, 19475, -20463, -74434, 17575, 40446, 45893, 52155, 23170, 101135, 104662, -62817, -157812, -80816, -86597, -79937, -83578, -125640, -4662, 57951, 126093, 198553, 153273, 51105, -23340, -6074, -7025, -87820, -34228, 57971, 198562, 143673, 57792, 89567, 94067, -71649, -2229, 76743, 53934, 59693, 71884, -54203, -190652, -157712, -44579, 4721, 33774, 11784, 10839, 23878, -69471, -89301, -40616, 99602, 27382, -46923, -30194, 67606, 21142, -57623]
18518e7623o2698j05283m592K35752J60354n8907R4803o02j52865j26122Q6834
18507I051O8050J673j22524j33510l515j00995K0769Q6472P3946K72M6274n2604
18495a06641J14408m3749l7655j6197P9962l1132J4019l0061J0956P7890M3161
18484G4961o7598l3193J4888j00990L7168L35o3875J21236L7997k9365J0201q4339
18472h2574R0211N6195o1807n2734K9593P4023L1298L1749p3880K2313p4408k7163
18460c7184k1328n0204J05514j07153m8251j1559N0778R1823L9250k4796p9095
18449i2205j9496O6500K1431R6249M6521Q246j08010l5081K6245p1002r0787O5563
18437h5826m5233j7650N1397R1385k1450P9087j06371J5892J45726l0258k13360
$$ y = [-57623, -120321, -225604, -230196, 5556, 165910, 107003, 201806, 201204, 48339, -77783, 9051, 77101, 78774, -43750, -177260, -180775, -281770, -261001, -174529, -100583, -100311, -54037, -106641, 7767, -35982, -73637, -89834, -9872, -41004, -26985, -57046, -46090, 31800, 74961, 7363, -25830, -10942, -111932, -74764, -74429, -138304, -17068, 20929, -8436, 1765, -82574, 7637, 63832, 2025, -50709, -21116, 52907, 84205, 115954, 42074, 64387, -10021, -37184, -58512, -108716, -3202, -110355, -158606, -170165, -119387, -27564, 11686, -13110, -92205, -111701, -45201, -23770, 72479, 119000, 127246, 19236, -15845, 10400, -60602, -151389, -85826, -131059, -148709, -97312, -5927, -27377, 51710, -54661, -38769, 106957, 76699, -136661]
18426a36661k1927J76600L3358P2339j01194r3949O0907J950o6425o584N8695
18415b2891j7505o9980M6218J46570J09709j5542j30556J7953Q343Q9258k3330
18404A38247j83598N3911J40271O1876O8896p9868j6728j06549j55662J45r470
18393h8529O1230L4594n9277K7468N7917q0293P8837J0392p4112O2142Q2090J19556
18381B32015L0927o7492n9547j08329J1965l4164N587p0303o6190R3347P2083
18370C9899J52387p1754r541l9562q9320j2559j3468R8438J28631Q3240J60087
18359D26478j41189k25321j9274J16947K7760K6233J2584j39846r6153Q416j23998
18348a27363L6196J12719n2076j50152n1923J07991K27413n7088j11239Q5367
$$ y = [-136661, -158588, 18012, 51370, 123709, 22515, -71434, -10527, -8577, -75002, -81586, -22891, -40396, -110376, -64158, 82412, 192121, 176579, 46023, 63976, 72319, 161577, 138247, -45351, 8560, 148831, 210707, 279603, 199735, 183007, 76458, -79204, -79059, -88529, -27299, 7295, -51982, -24514, 33403, -46890, 31947, 42339, -31773, 30369, 112459, 232015, 262942, 195450, 135903, 27574, 39539, 5375, 10962, -59341, -125531, -32184, 39899, 192286, 120532, 110991, 71429, -17891, -30450, -43918, 54520, 183151, 266391, 426478, 285289, 59968, 40694, 157641, 185401, 211634, 224218, 84372, -11781, -3365, -127363, -91167, 21552, -30524, -180676, -232599, -124608, 102805, 45717, -65522, 19845]
18338A9845J56591O3490j47535m5884J9540j4257N3585k15374l7388P1458K6919
18327d9010m1588m6563l3102K43011n9773j50065L2400j75194o4013L3862P1306
18316b38729M019o783O325N4264J79763J3689P9889q2191n3484l0209o1459L215
18304a31691j26393k078K6595l7399n749M9527J33056P0685j25583J5450n239
18293a38819Q545J4805J7934o7687q7371j32044K06506J44009j4686k0044j33314
18282b02166N8448m9073r0035J30882M3569N3784p8282J9127Q1277o9218M3439
18271e8248J11752Q6383j03715j16097L3794j6662r8745J2984J72240R1146n2621
18260F2211K6681P175L7961r371n7287p323Q2168k5934k4279k2572o2356j65819
$$ y = [19845, 176436, 239926, 92391, 46507, 66047, 51790, 105375, -109999, -147387, -75929, -49010, -90598, -137161, -170263, 72748, 12975, -137090, -104690, -279884, -343897, -310035, -238729, -234710, -241493, -235168, -180904, -1141, 12548, 92437, 10246, -43238, -73447, -134906, -131691, -258084, -260162, -233567, -270966, -276715, -227188, -94132, -23447, -149030, -133580, -138819, -130274, -115469, -97535, -165222, -252593, -384637, -178131, -34122, -48808, -68852, -202166, -143718, -192791, -282826, -151944, -108375, -54591, -132873, -113746, -32469, -101687, -58248, 53504, 139887, 36172, -79925, -46131, -62793, -161538, -148554, 23686, 114832, 62211, 88892, 96067, 134028, 124657, 67370, 60047, 142215, 116281, 92002, 69430, 7074, -158745]
18248a58745N1574K21103N3709K736n8745j03531j19414J4059J4343q5532Q5111
18237h3332J10617l8351l8156R210J20874J15154J61872J08197J5017J2893r163
18226D84832o6826j00315M7877j03895r1520r331J4926N8230j01124j58954q424
18215c4524P8313J12139M5151M9842q6640L8147K1204j48592Q001j28363j15336
18204a60658K44808J62999O2006l9812j13956K3348J32521j3111r5308j41171
18194F1666L6191j46563j11558K20153J72537J15402j01326j20022j78097l4842
18184h6459J54314p4873k1077K851p2503o4272Q1017K39331M0393n5807Q9360
18173B32275J32398O6490o7745p5310L7322J31516M2812r2973p3832K9136N4355
$$ y = [-158745, -107171, 113932, 167641, 170377, 111632, 8101, -111313, -97254, -82911, -168443, -83332, 27285, -11066, -49222, -40012, 80862, 196016, 357888, 466085, 481102, 493995, 484832, 418006, 317691, 365568, 261673, 170153, 160822, 175748, 233978, 132854, -26100, -34524, 43789, 155928, 201079, 250921, 164281, 202428, 223632, 75040, 83041, -45322, -160658, 84150, 247149, 309155, 269343, 155387, 178735, 311256, 298145, 202837, 61666, 97857, -48706, -160264, 59889, 232426, 347828, 246502, 126480, -51617, -86459, 67855, -7018, -28095, -25244, -97747, -162019, -81002, 158329, 198722, 142915, 232275, 364673, 431163, 363418, 288108, 325430, 456946, 499758, 406785, 332953, 362089, 416444]
18162D16444J09170k9550J7863l9388j23522k7259J55464M3412j45661J28101
18152E05074J72571n8018j08934j1989J83066J87170k2122k7392P3769l5650m3977
18141H13568J94058Q226o3728J29701K61249J01010L2461P9143n2725J3111M5112
18130A561186K3914J27582K67955J38533J6220K46038M72893P73206P57937O47820
18120E033284O60760J050755J322165J537640J595554K030232K491969K980219
18112A8702578M111092O192095R087085J4282909K4533358M4366751P1757249
18105A93033117M7117353l3357995m7572867k6896690j4157191j6845620k6536815
18098G4783292k3857265j5981037r995219o134912m001204k659243k038779j617374
$$ y = [416444, 525614, 496064, 513927, 474539, 351017, 323758, 479222, 522634, 376973, 505074, 677645, 619627, 510693, 498704, 681770, 868940, 846818, 819426, 893195, 857545, 813568, 1007626, 1015852, 952124, 1081825, 1343074, 1444084, 1476545, 1555688, 1502963, 1516074, 1561186, 1585100, 1712682, 1980637, 2119170, 2135390, 2381428, 2854321, 3627527, 4385464, 5033284, 5694044, 6744799, 8066964, 9604604, 11200158, 13230390, 15722359, 18702578, 22813670, 29005765, 38092850, 52375759, 76909117, 121275868, 193033117, 240150470, 206792475, 159219608, 132322918, 118165727, 101320107, 74783292, 50926027, 34944990, 24949771, 18814859, 14813655, 12154412, 10115633, 8498259]
18090H498259j386581j163667p57729m49376m31315m23471n55667l80831j99973
18081B749649k20595k32837k76468k46381l8637k7463o9426o5718p7043j70258
18071A324823j53166j78382o3430O2616n9540j34818j43483q3216J528O8352K3616
18060F64900J38857j9567j7712l3901p9906m4826K9627P0061J00171M3775J247
18049H52726R206j14307Q0422J93385L28385O95564O05584k13431m62214k50516
18039A724804q3921r5861l14449m34521j34136L3677j09017k05435m4317R2813
18029D29637p2722j33273R2487O4337n93j23970l5401J3311J9568K5226n4176
18018B24431j08828r4378K5042r252J0779j00560n0428J27344J63739R4230o8853
$$ y = [8498259, 7111678, 5948011, 5190282, 4740906, 4309591, 3886120, 3330453, 2949622, 2749649, 2529054, 2296217, 2019749, 1773368, 1734731, 1707268, 1637842, 1572124, 1495081, 1324823, 1171657, 993275, 929845, 992461, 932921, 798103, 654620, 571404, 572932, 641284, 664900, 803757, 784190, 766478, 732577, 652671, 607845, 637472, 707533, 807704, 851479, 852726, 861932, 747625, 828047, 1021432, 1349817, 2045381, 2650965, 2437534, 1975320, 1724804, 1640883, 1545022, 1230573, 796052, 661916, 695593, 586576, 381141, 336824, 429637, 356915, 223642, 316129, 380466, 379873, 255903, 220502, 233813, 253381, 278607, 224431, 115603, 21225, 46267, 37015, 47794, -52766, -103194, 24150, 187889, 282119, 213266]
18007B13266r9768J61518m7612r3243M0425P1404j4989k10093O4413J13672N0400
17996B49393n1546n0580p1572r2624m5652L6709Q0817L1123J02610j15966n9057
17985A3655l9582J02320l8819O27k0987j31018M3412J33313o4284o1798l7343
17974a00504k9322o6493J18924L9878M7344M7171j6345J35101k8434j78325J6563
17963a4442m0469n5846O5480O8550K8868J19565N8999P2604l9543j67005o5272
17952C1489M4590J3824j02966K441O2467K8936m3050k4162p2828L7789P8465o6888
17940i893l9943j77548K0816J25390N7628q9840n6910N9332k2597k8333O6118
17929i5780R7806r8726m4121O9834J3705j03284J06850J87741P152L4984m6199
$$ y = [213266, 113498, 275016, 227404, 134161, 174586, 245990, 231001, 20908, 85321, 198993, 249393, 197847, 147267, 75695, -16929, -62581, -25872, 54945, 86068, 188678, 72712, 13655, -25927, 76393, 37574, 38201, 17214, -113804, -70392, 62921, -1363, -63161, -100504, -129826, -196319, -77395, -37517, 9827, 56998, 40653, 175754, 147320, -31005, -14442, -54911, -110757, -45277, 23273, 52141, 171706, 230705, 303309, 263766, 96761, 31489, 76079, 89903, -13063, -10622, 51845, 80781, 37731, 13569, -59259, -21470, 56995, -9893, -49836, -227384, -206568, -81178, -23550, -113390, -170300, -110968, -133565, -161898, -95780, 2026, -96700, -140821, -70987, -57282, -160566, -53716, 134025, 141177, 176161, 129962]
17918A29962l6268j39986K1925K9468J5306n9768k0997N4154p6520K06218M5448
17907A68942N145m2457j10649q6902M2161K15687N7033k08745l1467J57192K4650
17896A90590l0283m2654Q6204k9993P1523Q7376j6514j8928j14127l3825N1348
17885B00717Q7593j01108j42855n2821k717k9284J30848l2008j20631J6566M6290
17874E90K1103J618O3714J5768J8903J5864r4548M6241O2788k7013o4577o7968
17862g517J1307J03370J41923o9290J1626j8408o4784n7295J6327j01226m2998
17851g6965M8951J27344J75853j10390j06794n7069M6783L4017L4175J16127L7092
17840B69124r7170j14821n5883K3549N2954k02005k45450J05518L82n2796N6695
$$ y = [129962, 93694, -46292, -24367, 5101, 20407, -39361, -60358, -6204, -82724, 123494, 168942, 174087, 131630, 20981, -65921, -23760, 191927, 248960, 40215, 8748, 165940, 190590, 160307, 117653, 203857, 173864, 245387, 332763, 316249, 297321, 183194, 149369, 200717, 288310, 187202, 44347, -8474, -11191, -40475, 90373, 58365, -62266, -45700, 590, 21693, 23311, 87025, 102793, 121696, 137560, 43012, 89253, 152041, 125028, 60451, -7517, 3790, 107160, 249083, 179793, 191419, 173011, 108227, 50932, 67259, -33967, -76965, -28014, 99330, 275183, 164793, 57999, 930, 47713, 81730, 115905, 232032, 269124, 171954, 57133, 1250, 24799, 77753, -124252, -369702, -264184, -263802, -316598, -259903]
17829b59903J70136J92348J7787j3993K6068k741L633k7067q3654k07642J4494
17818a70534J09953J49128P9615M6027l6626J8322m9566n7221k5248p0893r7032
17807a04075P6063J81043J6473k2319m1326k6124o135K8032k3575l3393L3792
17796G8456J15074J37236q4232j2961p8609q4935p3603n911L3524K6909Q3859
17785A34807K3676m1516k21715M339l7333p7209J18692J71723N2108j46055k235
17774b0718l9843J03983P2970q3636K6493L4732q0371j21224J97468J35424l259
17763B22019L284j11684J9734m680P69K5768p856k5480J009M2692m8450o755Q1120
17750A91490j600R7396n6613p2214p6041K0939P3542K3242r9501j9508k8169j35531
$$ y = [-259903, -89767, 102581, 120368, 106375, 132443, 129702, 133335, 106268, 22614, -185028, -170534, -60581, 88547, 168162, 214189, 177563, 195885, 146319, 89098, 63850, -7043, -104075, -28012, 153031, 169504, 147185, 105859, 79735, 73600, 101632, 78057, 44664, 78456, 193530, 330766, 246534, 233573, 154964, 70029, -3574, -9485, 24039, 50948, 134807, 158483, 116967, -104748, -100409, -137742, -214951, -96259, 75464, 127572, -18483, -20718, -60561, 43422, 116392, 32756, 59249, 93981, 13610, -107614, 89854, 225278, 222019, 225303, 113619, 133353, 128673, 129442, 155210, 147354, 121874, 122883, 165575, 117125, 110370, 191490, 189890, 287286, 230673, 158459, 82418, 103357, 176899, 200141, 100640, 81132, 52963, -82568]
17738h2568J471K04355J49189K7190j27043j11677j1623o1888k7645P982R5511
17727F3254M8922O838p590J17593j26374j31132k9603Q3137J9550R7587J18437
17716B60619J3037n4725j06557N779p8813J07752p9542k0240J07177P6364r737
17705B21114j201q580q1176M0654K9576m3161J1725N7577j1205p8858j44411J5504
17693G558m1109O9396r7422L9300P572o985N4525J80732J33678j24783p5003n5493
17681I1966o6688l3223m0676m7820M8212L1829R8911q1264o8517P2893L859K3813
17669C3295O0737r9145p921Q1501J218J53515R4450r5249k37979o7750j73048
17658b56376j4005J46324j4401r1870l1036j7181O4302J46299Q9467k0066k7500
$$ y = [-82568, -81097, 123258, 272447, 299637, 172594, 60917, 49294, -12594, -40239, -32257, 63254, 112176, 119014, 111424, 229017, 102643, -28489, -58092, 25045, 44595, 142182, 260619, 273656, 218931, 112374, 118153, 39340, 147092, 67550, 47310, 154487, 230851, 221114, 219913, 211333, 130157, 170811, 200387, 157226, 168951, 226528, 215323, 136465, -7946, 7558, -33551, 35845, -61577, -22277, -14705, -21690, 32835, 213567, 347245, 222462, 147459, 91966, 25278, -7945, -48621, -96441, -48229, -16400, 82511, 1247, -67270, 5623, 9482, 33295, 94032, -5113, -13034, 68467, 69685, 223200, 317650, 222401, -15578, -83328, -256376, -270381, -124057, -138458, -230328, -261364, -278545, -214243, -67944, 21523, 1457, -26043]
17647b6043K2662Q2220J14230p1921j07900j76633j34560K6611J22874N7907j16812
17636b07365k5383m5521j8509J06057J91721K00606j6943n8418o1438j35468p8325
17625a48986M4587P8309J09341R7877K4087M9090J9826r421l662m926m068j63256
17613H8798n9207k6518J08626o5778r7245j5389L9140q9396j8746R3902J4388
17602b7425N3680R4061o419q5591N848M9720j6206N1382j2031M8383m6862j75966
17590f7426J0527J05630L6213N8104R1168R5554r8048j88528j09624j9847L00307
17579B14030M22693K07209l5307m1465n7349J6677J05216j44182k12941j83359
17569B91222K1260l3893R6519J19144Q4086J6919l9444j34848j59232j07107J18434
$$ y = [-26043, -3381, 78839, 193069, 121148, 13248, -163385, -297945, -271334, -148460, -90553, -207365, -232748, -278269, -296778, -190721, 1000, 201606, 184663, 126245, 64807, -70661, -148986, -104399, -26090, 83251, 181128, 205215, 254305, 274131, 264710, 261048, 256122, 252054, 88798, 29591, 3073, 111699, 45921, -51324, -66713, -27573, -116969, -135715, -41813, -27425, 26255, 120316, 113897, 28306, 34154, 83874, 67668, 119050, 107019, 155402, 108540, -67426, -56899, 48731, 84944, 143048, 234216, 329770, 231722, 43194, -66430, -86277, 214030, 636723, 843932, 808625, 767160, 709811, 726488, 831704, 687522, 474581, 291222, 312482, 278589, 375108, 494252, 578338, 595257, 555813, 420965, 261733, 154626, 273060]
17558B73060R9849j50449q8489J77495M001j37726J23897J72637O8929M2526M3754
17547F29484K481l0189n8323j33165j13168L7179N0062j04857j07218J38369M8425
17536C59080R6272k1526j02419m3178P787L2260N5844j1495J9193j47026J1659
17525B56451L1027J65913J26396q876r3818r6298j13894J08697J71835N5374j8304
17514E84503j6186P179M3418q9110p1474P5780J09457N6510P452J17957R8743
17503I24229P0687M2312J2467J8802J03637J10427o6211J57689J43350n2898R0160
17492A554651M8921K14330K50076J6429J30539Q4884O1776L12246J11532L23008
17482C108392P86210J105414O40609k80253k66607J33377M12583M16300N98050
$$ y = [273060, 372909, 222460, 133971, 311466, 315467, 177741, 301638, 474275, 543204, 585730, 629484, 631965, 601776, 543453, 410288, 297120, 334299, 384361, 279504, 172286, 310655, 359080, 455352, 433826, 331407, 288229, 296016, 328276, 384120, 372625, 391818, 244792, 256451, 287478, 453391, 579787, 570911, 477093, 380795, 266901, 375598, 547433, 602807, 584503, 568317, 575496, 618914, 529804, 458330, 534110, 643567, 700077, 707529, 825486, 924229, 994916, 1037228, 1049695, 1068497, 1172134, 1282561, 1216350, 1374039, 1517389, 1464491, 1554651, 1603572, 1817902, 2067978, 2084407, 2214946, 2299830, 2361606, 2673852, 2785384, 3108392, 3894602, 5000016, 5640625, 5360372, 5093765, 5227142, 5639725, 6056025, 6654075]
17473F654075Q53350J208607Q82623N62656O00648J035006J684871K144710K494517
17464A8121063L084847L737847M741683N777205O820758R795255J5152164K3636321
17456I0867143M0464685P3976368J28141976J13818127m3849578r4165609n6829029
17449B52424083k8226512k8164431m7404103m6190896l1332955k0107022j2764419
17442C8233745q027458n282740l675252k681346k559842k391328j652180p06789
17434A1256810j17605q35257j369191j036170n47295k45014k58067l7206k03130
17425F607875p13207p90686o37754m55131m14260m29068l57092l31781k94995
17416B183901k37631j65866l13813k11841l7826k1676J4518L2813r7151k29317
$$ y = [6654075, 7507425, 8716032, 9598655, 10161311, 10761959, 11796965, 13481836, 15626546, 18121063, 21205910, 24943757, 29685440, 35462645, 42283403, 52078658, 67230822, 90867143, 131331828, 205308196, 333450172, 447268299, 403418721, 309253112, 252424083, 224197571, 196033140, 148629037, 102438141, 71105186, 50998164, 38233745, 30206287, 24923547, 21248295, 18566949, 16007107, 13615779, 11963599, 11256810, 11139205, 10303948, 8934757, 7898587, 7351292, 7106278, 6848211, 6811005, 6607875, 5894668, 5103982, 4466228, 4011097, 3596837, 3167769, 2810677, 2478896, 2183901, 1946270, 1780404, 1466591, 1254750, 1216924, 1195248, 1209766, 1242579, 1145428, 916111]
17406I16111k6685J97295j39649m6159K3962N3443l6557k1682K1483m5710k3636
17395H72216n8371n0936o0657j6431p092j23614P57K931L9742n725j36897J214
17383D57137q0540j7270J43538J52805N373l2742P057M5301j65072r6814K075
17372D20848J22226K9528K7620j62651j58173j34764j54876M6494J90198J10681
17362C37131j4601j9701M5660K0404p9700M2277p2992l6537n0661O0651J38386
17351C70317P3074P8839j77593k32719N7670O108M7242J61475J2995r1570n753
17340C00085o6358l4647M452j09595J6745O5714j1057j17513q3811r2502o4705
17329a93192l9278K93141J06443L2161O4226L3947r7438j86154j37067n3839K32761
$$ y = [916111, 889426, 1086721, 947072, 900913, 924875, 978318, 941761, 920079, 941562, 895852, 872216, 813845, 762909, 702252, 685821, 678729, 555115, 555872, 558803, 598545, 592820, 455923, 457137, 376597, 359327, 502865, 655670, 661043, 628301, 635358, 680659, 515587, 418773, 420848, 543074, 572602, 600222, 437571, 279398, 144634, -10242, 36252, 226450, 337131, 322530, 302829, 348489, 368893, 289193, 331470, 258478, 221941, 171280, 231931, 370317, 443391, 522230, 344637, 111918, 169588, 175696, 222938, 384413, 397408, 305838, 300085, 233727, 199080, 203532, 93937, 110682, 176396, 165339, 47826, -35985, -128487, -193192, -232470, 60671, 167114, 199275, 263501, 297448, 200010, 13856, -123211, -177050, 55711]
17318E5711J65727J6029m7774j29551O6558k4007k7239p0319J47469k8512N5162
17307A79254J35070q0045k06900P9404P7640l6484N9435O541r9385M9057K20301
17296C83888r4739j22163L5816j8232m1935N5674Q7196j0319j5160j98500r502
17285E2024J13199Q0025M9834J4191n6122j147J42838j23471j87038O831J21861
17274B13025J54294Q4315k11575M8134J07468j56956q3899O6480J18643L5095
17264C75024O8654R854Q888J28657Q9928J1880J48750J67487L96874P27840J087476
17253C221312J650043J143660q38192j049761n87212l77955m79467n70128m67770
17244A644530n11904l51285k74924k67722j15522R8658J26067q8128j44650j5926
$$ y = [55711, 221438, 237467, 189693, 60142, 126700, 102693, 75454, 5135, 152604, 124092, 179254, 314324, 234279, 27379, 106783, 184423, 147939, 207374, 213915, 114530, 163587, 383888, 289149, 166986, 202802, 184570, 142635, 198309, 285505, 275186, 260026, 61526, 52024, 165223, 245248, 295082, 309273, 253151, 252004, 394842, 271371, 84333, 91164, 213025, 367319, 451634, 240059, 288193, 395661, 238705, 154806, 221286, 339929, 375024, 443678, 453532, 462420, 591077, 681005, 692885, 841635, 1009122, 1405996, 2133836, 3221312, 4871355, 6015015, 5176823, 4127062, 3539850, 3161895, 2682428, 2112300, 1644530, 1132626, 781341, 506417, 238695, 123173, 221831, 347898, 259770, 115120, 99194]
17234I9194j07966o0594L2069O9892K10641J1248o5922n9084O183m2776J12300
17223B05185O2852n0650n2782k9462Q2993R9174M0183J30432J22399k469Q6417
17212F94272J2339R179J53516J68014j4668K78457M21908L86188N91502P99726
17202C500433J523482K708197L773786J890259j744193k445649j515049q48247
17194F843019j017041j343101j255019j027475n83548l17066j36314k15832j63679
17185G83944K3707o4485j37251q3167j25897n7033k7100K3177n2611R0125L1248
17174D04657j01596j53278J22179j8688O1046q8884j00636O7012o5581q110o663
17163A11458j05638j09060J7073J63654J38962r216o3697j18576Q410j4968r4242
$$ y = [99194, -8772, -69366, -37297, 32595, 243236, 254484, 188562, 129478, 135661, 92885, 205185, 268037, 217387, 164605, 135143, 218136, 317310, 357493, 487925, 610324, 607855, 694272, 706611, 715790, 869306, 1037320, 1022652, 1301109, 1723017, 2109205, 2700707, 3500433, 5023915, 7732112, 11505898, 13396157, 11651964, 9206315, 7691266, 6843019, 5825978, 4482877, 3227858, 2200383, 1616835, 1299769, 1163455, 947623, 783944, 807651, 743166, 605915, 522748, 396851, 339818, 312718, 335895, 283284, 373409, 404657, 303061, 149783, 271962, 253274, 314320, 225436, 124800, 191812, 126231, 118121, 111458, 5820, -103240, -86167, 77487, 216449, 207233, 143536, 24960, 33370, 18402, -75840]
17152g5840l9731j57165J32497Q4858N7864P1954K637J15253o1362j01714j66616
17141a37365n3301J78837J50317j9412N5022M8097j29673o2671o5874Q2922J56863
17130B03762o2150j42455n594K4918m2187N3237R4928M411q0431k16937j04806
17119b73304N0866Q7985J45533Q8694n7438K2955n2391O8343J01531k0059r843
17108A52872m804j08147O0963J43336J8640P2463p9130j89310J1865M7372k0640
17097A05480q6120j05745N0707M4372N6827m382o1403Q0863j2644l4326M1975
17086G5604M409m8742N3752p9326l0221j82216K7645J17791J00610p2025K5860
17075f859J3170j76737P4542J32137j0525N3641Q1746l4655j12969K1715n7177
$$ y = [-75840, -115571, -272736, -140239, -55381, 2483, 74437, 77074, 192327, 130965, 29251, -137365, -190666, -11829, 138488, 119076, 174098, 222195, 92522, 29851, -36023, 46899, 203762, 141612, -843, -6437, 18481, -23706, 29531, 124459, 128870, 48439, -168498, -273304, -222438, -134453, 11080, 99774, 42336, 65291, 12900, 81243, 182774, 162715, 152872, 148068, 39921, 100884, 244220, 262860, 335323, 256193, 66883, 78748, 126120, 105480, 19360, -86385, -35678, 8694, 65521, 61139, -264, 80599, 67955, 33629, 75604, 80013, 31271, 85023, 5697, -24524, -206740, -179095, -61304, 39306, -32719, -6859, 6311, -170426, -95884, 36253, 25728, 79369, 161115, 126460, 13491, 35206, -21971]
17064b1971j25644O7884J71825m7178L6035J00384o1986K5089J0723m5338q4723
17053B5100l4877M8123m1855P2322Q2981J30601L2868j59730n2238P8491R0088
17042B71874m7941l8460J5217j27187r5003j7347j9650n9175P5233J5131K1236
17031f072j45574N8513J9987p9047k3301O9399q7473j40657J2180J99496R7930
17020b4619o5072L536J09788Q7893r7243J3388J8749m9566Q7789o1973k34612
17009b11942m6006J55466L6797O5478J02150M7981m5398J4946K6582r1075j54260
16998i9281J11113J89927K9400j38069l2465L2254l5482o0339J01062M3216l0508
16987A10828M514j6684m7536N1639n0148m3849q4212j2168Q3185l0520j51247
$$ y = [-21971, -147615, -79731, 92094, 44916, 80951, 181335, 119349, 144438, 155161, 109823, 25100, -9777, 38346, -3509, 68813, 151794, 282395, 315263, 155533, 103295, 181786, 271874, 223933, 185473, 200690, 73503, -21500, -38847, -58497, -117672, -42439, -27308, -6072, -151646, -93133, -73146, -152193, -175494, -106095, -193568, -334225, -322045, -122549, -24619, -89691, -86155, 23633, 111526, 14283, 27671, 46420, -3146, 84643, 22670, -211942, -257948, -102482, -65685, -207, 101943, 149924, 104526, 119472, 146054, 54979, -99281, 11832, 201759, 231159, 93090, 60625, 92879, 57397, -2942, 98120, 141336, 110828, 115342, 98658, 51122, 102761, 52613, 8764, -75448, -87616, -4431, -34951, -186198]
16976a86198L6176J16156J15396k9338K8965k9731j69204J16279o9849K1139k8949
16965g9158p6995j9266R7333J78035M5852n1442k3062q3689p4955m4652O9810
16954f2189J03200j4865K5367j6305j05799M7672P7579J06620Q995P4684N632
16943B50591j20900j66340o0818l376Q4125Q7614J86819K8814j23850j36325k20894
16932a94540k8396N4297M9263R7467j11874p9283L3318M1768M7556N3965r410
16921d5869N4446o6744j49680K4306P6871J8311l2556J15128r5975r0381L1894
16910a60249J09797j50238m4045J6153J11858P4689K1775j17302j52011J2493
16900b77080R3240K8923j32799J9002J39630J8215L0974Q2466j04367n2672j1594
$$ y = [-186198, -150022, -33866, 81530, 52192, 81157, 51426, -117778, -1499, -71348, -50209, -79158, -156153, -175419, -78086, 99949, 145801, 94359, 71297, -12392, -87347, -131999, -62189, 41011, 26146, 51513, 35208, -70591, -22919, 54660, 161280, 170275, 244959, 250591, 129691, -36649, -97467, -100843, -16718, 70896, 257715, 286529, 162679, 26354, -194540, -222936, -168639, -119376, -21909, -133783, -213066, -179748, -137980, -90424, -36459, -45869, 8577, -58167, -207847, -183541, -106670, -88359, -120915, -5787, -101762, -192143, -160249, -50452, -200690, -244735, -228582, -116724, -42035, -20260, -137562, -289573, -277080, -183840, -154917, -287716, -268714, -129084, -110869, -79895, 2571, -101796, -154468, -166062]
16889a66062l8492p5430Q1431Q2667L8092J93873k2419L1254j53860J01110Q8037
16878A60201J57n7135o7698O778J04571P7382k272j3068O6252n7445j45944J5918
16866H7697n0903O0207J15895J8665M9723r7249J78292L74711L12912N21482N89984
16855B161416M1325l85219l94852k57843J0794p7421k16717k27669k82411j09883
16845B61520J4417J4168P8998n2558L5793q9354k08712j61722K0006O4816l9396
16834f2024L8796N7731n2353m1348j17090k9328K05510O7668o4155m3227J1389
16823b8431M1640O5024j17096j06199R1981Q8114l7884p3406o4021o0792j5093
16812b16163k3479Q1587J09669K4290J0617q9666l5388j3606r8974J3395K5666
$$ y = [-166062, -204554, -279984, -198553, -115886, -77794, 116079, 93660, 124914, -28946, 72164, 160201, 160358, 103223, 35525, 42303, 146874, 224256, 221984, 208916, 275168, 217723, 71779, 87697, 36794, 97001, 212896, 231561, 281284, 184035, 362327, 737038, 1049950, 1571432, 2161416, 2202741, 1817522, 1422670, 1164827, 1175621, 1098200, 881483, 653814, 371403, 261520, 275937, 290105, 369103, 316545, 352338, 262984, 54272, -107450, -87444, -22628, -62024, -23228, 34503, -17850, -59198, -176288, -205616, -106, 67562, 3407, -39820, -28431, 13209, 78233, -38863, -145062, -53081, 35033, -2851, -76257, -140278, -201070, -216163, -239642, -158055, -48386, -24096, -13479, -103145, -138533, -152139, -251113, -237718, -212052]
16801b12052K2019J38462M748Q2067k5086p1567l5207Q5724O5060j14293R6333
16790C6208N3201k02317j08798K00800J29354m4547l090j56841j0034J81377J701
16779G7014J59836l7822j73115j11635r678l0736K4581j0460P7647R3269j22415
16768f3514m5172m4768p6238R8771J46733O1031r0085l2149Q9542j27611j75827
16757b59287N3636J66877Q891o9505m2982J4079N4639M5229j5095Q3928N7366
16746I7776j44355N4176R1387n5794k1473J2775J2836l0189p4409J00247N3140
16735I6117M8793J15401j6581k08852j47850m3029R0118L4682P5871J10186M5702
16724B00558o7238j89558j54572R3111L4717O2010P5293O6265k0925j96468l491
$$ y = [-212052, -190033, -51571, -46823, 35244, 10158, -61409, -96616, -10892, 54168, -60125, 36208, 89409, -112908, -221706, -20906, 108448, 63901, 60811, -96030, -106064, 75313, 77014, 236850, 199028, 25913, -85722, -95400, -126136, -101555, -112015, -34368, 58901, -63514, -108686, -153454, -229692, -130921, 15812, 76843, -13242, -45391, 44151, -83460, -259287, -205651, -38774, -29883, -99388, -142370, -128291, -73652, -28423, -43518, 40410, 97776, -46579, 7597, 98984, 43190, 21717, 34492, 47328, 17139, -57270, 42977, 96117, 144910, 260311, 243730, 34878, -112972, -156001, -65883, -31201, 44670, 154856, 200558, 133320, -56238, -210810, -117699, -82982, -20972, 54321, 120586, 99661, -96807, -100298]
16713a00298Q9437N1157q5724l9635q495p1757J3015O0623J49439M0961j0911
16702H7812J733N1189O1103o2319j87023O1021q6899o726M3208N4929L343J04584
16690A25955k463j01713j2281P921j28045r7766J94873J62416J25898p082j20230
16679A47483k65404O1357l0607n368Q2835j28723q6175L5938m4977N1781M3521
16668a38339K4285R4384J06213N409M8340K4128p9798j93031r1697q4632N9733
16657b25005J20245m8336k0734L8052P6422j6134P8266N6568o4898q3623J1109
16646g8068j9049l0300Q9155J08575N4974k8536j00174N1578p378k9749j9641
16635h613J07677P878j53102j50274O7009k9371j27374p65K9487N4009J33319
$$ y = [-100298, -10861, 40296, -45428, -85063, -93558, -165315, -152300, -91677, 57762, 98723, 87812, 89545, 140734, 201837, 139518, -47505, 13516, -73383, -80109, -36901, 18028, 21371, 125955, 123492, 21779, 9498, 17419, -110626, -208392, -13519, 148897, 274795, 267713, 147483, -117921, -56564, -87171, -92539, -9704, -138427, -224602, -188664, -233641, -181860, -138339, -114054, -19670, 86543, 91952, 140292, 164420, 84622, -108409, -200106, -284738, -225005, -104760, -153096, -173830, -135778, -59356, -75490, 2776, 59344, -5554, -89177, -78068, -97117, -127417, -38262, 70313, 125287, 96751, -3423, 48155, 40777, 11028, -8613, 99064, 106942, -46160, -196434, -129425, -158796, -286170, -286935, -257448, -203439, -70120]
16624g0120L0387o7483j20451J15437J27908q5082j8044J61052J50822j01801
16614A22625n5769K6370j13696k372k49717L2817M1552k4727J21759N1290l1822
16603h1690j49103M0974J25153K2079p3044n9478P3304J04603q8802q9552J15843
16592e9713J62501O634j0559J1416J7068o8334l2272J24587r005j39567Q5221
16581H7977j2640j3462J11523Q28J11551j61760j30462j87596l1702L2389m0320
16570b33674J67768Q1962O1151L3112J3284p7834m4803m6500m8474k22516m3930
16559c60454P6229J60729K22195L7149r8013j26414K27602O6149o4187r4429n9309
16548a2753L9223J8645r774J86r0575j02443K0201P1860K4884J01445p0448p2237
$$ y = [-70120, -39733, -107216, -227667, -112230, 15678, -69404, -87448, 73604, 224426, 122625, 66856, 93226, -20470, -22842, -272559, -239742, -198190, -222917, -101158, -49868, -81690, -230793, -189819, -64666, -42587, -115631, -175109, -101805, 2798, -86004, -175556, -59713, 102788, 109422, 98863, 110279, 127347, 59013, 26741, 151328, 142323, 2756, 87977, 75337, 61875, 173398, 174226, 285777, 124017, -6445, -194041, -225743, -193354, -233674, -65906, 16056, 77207, 110319, 123603, 45769, 966, -45534, -94008, -316524, -360454, -284225, -123496, 98699, 135848, 37835, -88579, 139023, 205172, 140985, 46556, -12753, 26470, 45115, 35341, 35527, -55048, -157491, -137290, -65430, -40546, 60899, -9549, -81786]
16536h1786j07780k921P3856L9781M9299J58025J7086M0248p9823J4620J57666
16525B78271O3679n4496N588K6988N703j44211m0385n9674j01379j17960r8109
16514b35985k8891J6829J29148O9638R3539k2077p1186p7725L1126M5865k879
16503e2598o4396j6962M3608N9404R2884m9239N2548R5830j69364m0238K0562
16492b7961L1214N4811O0610p4090j940O1406L3581j75397N1178M0937m9760j13793
16480a09204j50855l2305J52914Q9419j254M792j02898N3768r814l4223N5321
16469h4339k9177P322J11530O0101j29383j17661J74398J81342p1701j2951j00555
16458a1074R549o9717r6657k8758N6614J210M4137q7822o222r46N8365R0754l2665
$$ y = [-81786, -189566, -192487, -118631, -78850, -29551, 128474, 145560, 185808, 105985, 120605, 278271, 341950, 287454, 293042, 320030, 325733, 181522, 141137, 81463, -19916, -137876, -235985, -264876, -248047, -118899, -49261, 44278, 22201, -48985, -126710, -95584, -49719, -52598, -116994, -133956, -90348, -30944, 61940, 12701, 65249, 161079, -8285, -48523, -27961, 3253, 58064, 118674, 44584, 42644, 104050, 137631, -37766, 13412, 54349, 4589, -109204, -260059, -292364, -139450, -50031, -51285, -46493, -149391, -95623, -105437, -139660, -84339, -113516, -106194, 5336, 65437, -63946, -181607, -7209, 174133, 102432, 89481, -11074, -1525, -71242, -167899, -196657, -140043, -138833, -94696, -182518, -188740, -189686, -131321, -40567, -73232]
16445g3232J0386j04883J10843J03253k7286o9543K7588O1541J6548j11305p6617
16434a32707j14812J3847N9901o4454m8632N3298J3959p7262J51721M7442n7613
16423a55312l4846J03506L2621j4169k9568J07J79592L8268q6159j7538n6752
16412d0250Q435l4141j30706m6800J06688R5120N1141q2037m0290L7798k5873
16401a00915j35104O7721M4050o4721j7677O0905n2966k7355L2277J25188R9456
16390C0859p1837n4039J04200j1505L4947o7159O136l8079Q0557Q2497k6085n2126
16378A8366L3194O4360k4690k8142l9286J03878l6567l2182N0349o876k2946j04162
16366b4704J46913L3811k03555j17331Q6929p6539p1403o4668J43125O6372M1005
$$ y = [-73232, -62846, -167729, -56886, 46367, 19081, -50462, -22874, 38667, 55215, -56090, -132707, -247519, -233672, -173771, -238225, -286857, -233559, -219600, -296862, -145141, -97699, -155312, -190158, -86652, -54031, -68200, -97768, -97661, 81931, 120199, 34040, 16502, -40250, -31815, -65956, -196662, -243462, -136774, -41654, 9487, -72550, -112840, -75042, -100915, -236019, -168298, -124248, -188969, -206646, -145741, -198707, -226062, -193785, -68597, 30859, -40978, -95017, 9183, -2322, 32625, -34534, -28398, -66477, 14080, 96577, 70492, 18366, 51560, 115920, 91230, 63088, 23802, 127680, 91113, 58931, 109280, 102404, 79458, -24704, 122209, 156020, -47535, -164866, -77937, -154476, -225879, -290547, -147422, -81050, -40045]
16355d0045j43511L8526J79145K3525Q393Q1620R3413p7692j6427O2496J5262
16344B24705n5604j47748k7165J06300Q5781L5540R709k06155r698L0181j1513
16333C4333j32458o082P8871O0473j4827j8467q0312o4575m0103J59585m871n6565
16321h4998M50k7590p894M2956K4492j17456m4470K0929l597J71941P4693L3594
16309H3050L4410j14536O9951L0267m2001j7551l473O8914K0556m8058k567k5310
16297E3652k6561l8613J03544n3637J1984K4626J968k6461Q0137p1142j16561
16286e7064k4397M4214j12131k1730Q2934j6624J1859P9259j1272M8034p866K0101
16274C5317L9997j48959N8139J78382J73371J3530j44281j34238l9517K4394J54566
$$ y = [-40045, -183556, -145030, 34115, 57640, 66033, 147653, 241066, 163374, 146947, 209443, 224705, 169101, 21353, -5812, 100488, 186269, 221809, 231518, 25363, 15665, 45846, 34333, -98125, -104207, -25336, 35137, 20310, 1843, -78469, -143044, -183147, -23562, -28433, -84998, -84548, -112138, -120032, -77076, -52584, -170040, -214510, -193581, -197178, -25237, 49456, 83050, 117460, 2924, 72875, 103142, 61141, 43590, 40117, 109031, 129587, 81529, 78962, 53652, 27091, -11522, 92022, 38385, 50369, 74995, 76963, 50502, 130639, 59497, -57064, -81461, -37247, -149378, -171108, -88174, -104798, -92939, -13680, -24952, 23082, 15216, 35317, 75314, -73645, -15506, 162876, 336247, 349777, 205496, 71258, 31741, 56135, 210701]
16263B10701k3250p7667n7069q1997R0496l7062j47002K28033J40167m6868r5222
16252A03260m4360m0568j89292Q6075K0168J7895L4541m7379j46811Q1009N4793
16241g0669p6656k5397j01140J23412J25576J60314P499J7758O1477k63452j86309
16230b27587L7018m0146R4715Q2888J4248L892P27P9631N881p0441O3621L7882
16218H2329n5162O993P9483O5370L693p0293p2708j41484n622L7232L7698p0687
16206a03158L2865Q3359l835L0506Q9095j04049k48098J2397M1509j2573L0043
16195a51939J41677J68418q6815J476j78314l28J11206L3566r4035q6341k0435
16184a61864J01999l3535r974M4997O9178n5091K628J00978n5042n1679N098O1820
$$ y = [210701, 187451, 109784, 52715, -29282, 61214, 24152, -122850, 105183, 245350, 198482, 103260, 58900, 18332, -170960, -84885, -64717, -46822, -12281, -59660, -206471, -125462, -70669, -147325, -172722, -273862, -150450, -24874, 135440, 142939, 160697, 222174, -41278, -227587, -190569, -230715, -136000, -53112, -38864, -34972, -34245, 45386, 51267, -19174, 44447, 82329, 27167, 34160, 113643, 179013, 182706, 112413, 39705, -101779, -107401, -70169, -32471, -103158, -70293, 13066, 9231, 39737, 128832, 24783, -223315, -210918, -169409, -181982, -151939, -10262, 158156, 71341, 72817, -105497, -105825, 5381, 38947, -55088, -141429, -161864, -59865, -93400, -103374, -58377, 10801, -44290, -41662, 59316, 4274, -47405, -42307, 19513]
16172A9513R4608K8704n9922L0745R5519q3895j52315q9082O9131P0649Q5470
16161A09125o6578m0617n4814l036M9181P7775K4871j54609R9644o349j05658
16150g1065q667P5539L424J28624K8612J20279M9078j63153M3237K4627r0163
16139A40372J8369j7087K2662j12391o7448P2808K2231q4661L4708Q247o7206
16128b9396j8777J38494p666K2565n6897J016p3889j08316l6740m2424J41783
16117g0247N1681l8909o4926M8106J50968M1719o661j76895r0977J88608J35405
16106A67872p9303p6861j0639L8548j3177o3599J1677J56144N517j11241q8636
16095f3698J10742N3527L6613k1382k0069q0369r2721K2988m2193Q6385J30037
$$ y = [19513, 114121, 142825, 82903, 113648, 209167, 125272, -27043, -116125, -46994, 23655, 109125, 42547, 1930, -52884, -55920, -6739, 71036, 95907, -58702, 40942, 34593, -71065, -79732, -4193, -769, 127855, 156467, 276746, 325824, 162671, 205908, 230535, 140372, 158741, 141654, 164316, 51925, -15523, 57285, 79516, -5145, 29563, 37810, -29396, -48173, 90321, 82655, 105220, 48323, 49339, -24550, -132866, -169606, -212030, -70247, -18566, -57475, -122401, -74295, 76673, 118392, 111731, -65164, -156141, 32467, 167872, 88569, 11708, 1069, 39617, 26440, -37159, -25482, 130662, 136179, 24938, -63698, 47044, 100571, 137184, 115802, 95733, 15364, -77357, -54369, -96562, -10177, 119860]
16084A19860n6645j45594o4990l7169M2376P1754r0001J8075R9900P3803k0531
16073A0838k1035j14696j85242L7770R6290P8245O1219k7828j2604j43989q880
16062b29912J25400M5160Q7020L5046m4299J6844J24299M0573m4762j68755o0083
16051g3469O8456P5709j39014n5109P1101K7058q452j13862p4475R5495J11243
16040a5319q8651J44216K30818J9722j83890j27315p5875L2918Q6229O0420n9585
16029B3688N3853n8339J08282Q9404J1787m9555j9826j85160j01355n1550L7059
16018a41712N5498L7101j945J54390M0450q8481l7844j13172K0115N181l6751
16007a07170Q6506J23349L4420k8999j23506j17768J3139L5275J13325J32624
$$ y = [119860, 63215, -82379, -147369, -184538, -142162, -70408, -160409, -142334, -42434, 31369, 10838, -10197, -124893, -310135, -272365, -176075, -97830, -36611, -64439, -77043, -221032, -229912, -104512, -59352, 27668, 62714, 18415, 35259, 159558, 200131, 155369, -13386, -73469, -5013, 70696, -68318, -123427, -52326, -25268, -33720, -147582, -222057, -126562, -15319, -103970, 40246, 271064, 290786, 106896, -20419, -96294, -63376, 22853, 83273, 23688, 77541, 19202, 127484, 216888, 228675, 179120, 159294, -25866, -127221, -178771, -141712, -86214, -49113, -51058, 103332, 143782, 55301, 17457, -95715, -75600, -70419, -107170, -20664, 102685, 137105, 108106, -15400, -133168, -120029, -84754, 28571, 161195]
15997A61195N0556q1007m3266j5931l841m1311l241k2945j09787l3605l3913p392
15985a84488J55000P5854k9933m7797M8430M5422O4258K818r3370O5398j16512
15974a4920J3300O7654L1340L862J5500r7982j26405R9908J08738r1000J5769
15963B5764R1253j10766q8779K8498J7146q807M1215O0489p5725o6478N8763K7693
15951B66q5662R1649J2836o7685k8567p5972p3777N1634K2360Q7986P5959J6019
15939B7046O7525J9009n8135O3705L2481p5672j59289J1344O4160N7016l7302
15928A1888j19770M9380K9761j02158K899Q6717J30612r623k18157k4530P4936
15917h8045K368J275r271O4254n4157q077O0686N6115J65136k9023j74701p5348
$$ y = [161195, 211751, 130744, 87478, 71547, 67706, 26395, 23154, 209, -109578, -143183, -177096, -184488, -29488, 46366, 16433, -31364, 17066, 62488, 126746, 129564, 36194, 101592, -14920, -1620, 66034, 97374, 101236, 116736, 18754, -107651, -7743, 100995, 9995, 25764, 117017, 6251, -82528, -54030, -36884, -45691, -4476, 56013, -19712, -86190, -27427, 266, -85396, 6253, 19089, -48596, -77163, -153135, -226912, -175278, -152918, -64932, 11027, 27046, 94571, 113580, 55445, 119150, 151631, 75959, -83330, -71986, -7826, 49190, 11888, -107882, -58502, -28741, -130899, -128000, -41283, 89329, 79706, -138451, -162981, -88045, -85677, -84402, -93673, -29419, -83576, -91653, -30967, 25148, 190284, 161261, -13440, -88788]
15905h8788o7532J25139P6957k9771n5443j01903o8914J108j1726P0516J2603
15894a37754M8162N4241k386r2081J4609o2714j3467J6277J73870P4437q4170
15883a0976q3598k71K6313p4085R4352M4281J02250J05067r4530p6011k9754j3888
15871a0850O9676J33726l3033q4889k5520l9994P986l4835O4023P1359M1294n624
15859A53319K1876n2165j19901p3340j742J36732n133j20955j30014l4383O9150
15848a56556J9684J20785m4643J18302P2939o8571o0850P5637m1369j65832J13328
15837a7146K19812K6212j4250j28976j32991o9323K42490J20940j90753j21628
15827f5613K9147K5587R6036O9435o414k1227p6740K5927l7543M0933J777K9313
$$ y = [-88788, -156320, -31181, 45776, 16005, -39438, -141341, -210255, -209147, -220873, -150357, -137754, -89592, -35351, -37737, -129818, -115209, -177923, -191390, -175113, -1243, 73194, -10976, -94574, -94845, -68532, -142617, -48265, -3984, 98266, 203333, 108803, 32792, 3038, -10850, 58826, 192552, 159519, 74630, 49110, 9116, 17102, -17733, 46290, 117649, 158943, 153319, 175195, 123030, 3129, -70211, -71953, 64779, 59646, -61309, -191323, -225706, -156556, -136872, -16087, -60730, 57572, 130511, 61940, 1090, 76727, 35358, -130474, -17146, 202666, 228878, 214628, 85652, -47339, -116662, 125828, 246768, 56015, -65613, -36466, -10879, 85157, 154592, 148178, 126951, 50211, 76138, 38595, 79528, 81305, 110618]
15815A10618m4693k0242n7799l2630J12269M928p1859L0337J54904Q5463q9245
15804A82051J46446O2782n3457J7083r8681j89349p0208n8688p6429R4662k2749
15793f6537j36683J21080L4522q5936k436J92821J15604J54306j75025q3271j58960
15782i0515j41445r244l322J42888K6044j39107J24252K13139J35984o7112J4408
15771B05970P3075L6996q6953j9343r9709j3674k5867o8900K4972P8824O9485
15760A74876k6970j76002L1184M0339o6279K0492r3730p3803J40400J95228q5787
15749G9948j63327m0271J78005J00832m6915j60264j19868Q3816M8560P3361j1026
15738B2851o5991K5305M5354r709l7631P9884K7492k4623J32380j48607p8928
$$ y = [110618, 65925, 45683, -12116, -44746, 67523, 72451, 592, 30929, 185833, 271296, 182051, 328497, 391279, 337822, 354905, 256224, 66875, -3333, -62021, -138450, -43788, -66537, -203220, -82140, -47618, -133554, -135990, 56831, 172435, 326741, 151716, 68445, -90515, -231960, -241204, -244526, -101638, -75594, -214701, -90449, 122690, 258674, 191562, 205970, 279045, 316041, 229088, 209745, 110036, 96362, 70495, 1595, 26567, 105391, 174876, 147906, -28096, 3088, 43427, -22852, -2360, -96090, -169893, -29493, 165735, 79948, -83379, -123650, 54355, 155187, 108272, -51992, -171860, -88044, -39484, 33877, 22851, -43140, -17835, 27519, 17810, -19821, 60063, 87555, 62932, 195312, 46705, -32223]
15727c2223o072o8406N6441l6870Q9268M3223J43395n4150r9028Q5998k6727k9370
15715F5479J9750L5959J22938J44258r2858k05311l6431J9421N8519P5861n6665
15704A50920J7684j33906j38389P3470N6899J4745r7642J3888J6668r3310J02347
15693a6626R5740L8986J7644o4310K5437R9117Q8920o1798m2955o7875O9318p8923
15681A02675m9001O0467n4363M7146J30830J00300o5751n3691O652K2261m5486
15670B02039j8676k47997r2206R2332q3214L156o712p422k5179R1141J54676Q8501
15658A50439j96041p1497J12248l95j163j10845j62558j79371q2716L8895N6920
15647d46084j4109L02460J97147J355J0867P0680l2664p8138N4737j40520q1605
$$ y = [-32223, -38295, -106701, -50260, -87130, 2138, 45361, 188756, 134606, 35578, 121576, 94849, 65479, 85229, 121188, 244126, 388384, 295526, 90215, 53784, 73205, 131724, 207585, 150920, 168604, 34698, -103691, -30221, 26678, 41423, -56219, -42331, -25663, -118973, -16626, 79114, 118100, 135744, 71434, 96871, 195988, 284908, 223110, 180155, 112280, 181598, 102675, 53674, 114141, 59778, 106924, 237754, 338054, 272303, 218612, 225264, 247525, 202039, 183363, -64634, -156840, -64508, -147722, -144566, -151278, -158700, -183879, -92738, 61938, 150439, -45602, -117099, -4851, -5246, -6409, -117254, -279812, -459183, -541899, -503004, -446084, -460193, -157733, 39414, 40769, 51636, 122316, 89652, 11514, 66251, -74269, -155874]
15636a55874o095J33300J71602M6506L0969n3978q3986m0356p2224n9758r879
15625i9773l753J3849L4722j22947n3310J18445l5907q2176j11607P3870J59168
15614a09419K4983R1970J23743j1661r1313p1643n8066l4204Q4088j7371K4895
15603d3998M6744O3814M1939j57200j70977J3875R9885P5413Q7963j21892j34966
15592a99400j9318K8484M9988K50132k8231j01736j25022o4963Q0578P0561K8321
15581c0606L2526o4028r2001J0962N6739q362J1145K7166r7350n3361L0947Q6957
15569h9266J42229j13594j07380o6737l6596K8594o8621n3880J17633J44907R4696
15558h015M3653O82o314M38J03952o2643O8614L4687K0682l2045J7760p0635n1825
$$ y = [-155874, -161969, -28669, 142933, 189439, 220408, 166430, 82444, 42088, -30136, -89894, -99773, -103526, -89677, -54955, -177902, -231212, -112767, -148674, -230850, -342457, -268587, -109419, -84436, 7534, 131277, 119616, 28303, -43340, -101406, -135610, -51522, -68893, -43998, 2746, 66560, 108499, -48701, -219678, -205803, -105918, -30505, 57458, -64434, -199400, -218718, -190234, -140246, 109886, 81655, -20081, -145103, -210066, -129488, -58927, -30606, 1920, -62108, -154109, -143147, -86408, -94770, -83625, -56459, -153809, -207170, -176223, -89266, 52963, -60631, -168011, -234748, -271344, -242750, -311371, -365251, -247618, -102711, -8015, 35638, 36320, 30006, 30444, 134396, 71753, 140367, 175054, 195736, 163691, 181451, 110816, 58991]
15545E8991o1071J4651k6497m0552n5419n3693n496R6931J52397O1854j05422
15534C6674p8837q0656Q1305J26831L1501J4064q0878o753j8751K3099n9103L9437
15522B7933O63p2089p770q6132j4003K12586J38301L0814j04328j26116p4328
15511g4469M5274K6699o9314P9090K00778J03998m8613j37554j21228p6895R4153
15500B1919J76227o1542m1048J33374K1478j39423j25145j04689P9440J06378
15490F6969N1035k8532m2075K5671K003K9898l3472j33805l9525L046K03317R0270
15478A94800p5975J1103o8845J0370j2080r454M1055k7276O8043l105m9296o6060
15466A3280M8736n3118k12891O4863R7304l4858r3277J26940O8831Q5377L572
$$ y = [58991, -2080, 12571, -13926, -54478, -109897, -163590, -169086, -72155, 80242, 142096, 36674, -42163, -122819, -41514, 85317, 116818, 130882, 50004, 43251, 24500, 47599, -11504, 27933, 28596, -43493, -51263, -137395, -151398, 61188, 199489, 230303, 125975, -141, -74469, -29195, -2496, -71810, 7280, 208058, 312056, 263443, 125889, 4661, -72234, 21919, 198146, 136604, 95556, 228930, 250408, 110985, -14160, -118849, -39409, 66969, 118004, 89472, 47397, 73068, 75071, 104969, 71497, -62308, -101833, -98787, 104530, 194800, 118825, 129928, 61083, 71453, 59373, 49919, 90974, 63698, 131741, 128636, 79340, 13280, 62016, 8898, -203993, -139130, -41826, -76684, -169961, -43021, 25810, 111187, 114759]
15455A14759j07967j42328K2920M6296q5648m78P435P8799R5082o1993o7855J43727
15443D2749L1650J0419p2742J1568l7164K994l8708K2004J56449K43023j30807
15432B41435k24439p0235q6577K1479J10352L2057L4085j0343j36280j31280o0450
15421b80196l2626O1040J39294R1749r1674n0730J6637o4279K3961L9915J8642
15410a28267l7369O9514O1508l0195o1948j5890l6780O7811J09314J58628J59365
15399C15691j07598j47866p8743O9392P3734j42797l6462O1342j73491M9719K4908
15388i2171j0765J57818J02920n0262n1602M3527k6349m8536p9931l4842J35324
15377D5131k12003q5244J39140r407o6554K5805l3763N4341N6823p8812K3138
$$ y = [114759, 6792, -135536, -112616, -66320, -151968, -152446, -145011, -66212, 28870, -33123, -100978, 42749, 74399, 84818, 12076, 23644, -13520, -10526, -49234, -27230, 129219, 372242, 241435, 16996, -53239, -139816, -118337, -7985, 24072, 58157, 47814, -88466, -219746, -280196, -312822, -251782, -112488, -20739, -112413, -163143, -146506, -210785, -186824, -146909, -128267, -165636, -96122, -34614, -64809, -126757, -142647, -179427, -111616, -2302, 156326, 315691, 208093, 60227, -18516, 50876, 124610, -18187, -54649, 6693, -166798, -117079, -92171, -102936, 54882, 157802, 107540, 55938, 99465, 73116, 24580, -55351, -90193, 45131, -166872, -252116, -112976, -122383, -188937, -163132, -196895, -142554, -85731, -164543, -141405]
15366a41405M2344N5859O5393K8161r7627L2626J52383J11142N1532l3729j26208
15355A40471Q9243o9514k07399p6035k7262O7937J09287m6870N5561n527j71219
15344a41327j2922M6668R3876j3185q02Q6909j53066L6898R9015j4346r9323J10170
15332C8565m819O5911o2325q7217k38513Q6476N5023N4285l6983L1797P089K958
15320h7753P9691J08896j11157j25127J3628Q1902m9715j0764Q8557J10567J44079
15309B42804r6065j45845j09374K3270R9576l1058K4855j1260o0100Q2006J02184
15298A20993j6559n4640r3580o7315m9036J47384N9062j41589j17714L3455J05389
15287g4150J73957J68803n0667j31948J8589P1382J15029P6865p6434q2759N7710
$$ y = [-141405, -99061, -43202, 22191, 50352, -47275, -14649, 137734, 248876, 300408, 266679, 140471, 229714, 160200, -47199, -123234, -150496, -82559, 26728, -20142, 35419, 29892, -141327, -154249, -107581, -13705, -26890, -27692, 59217, -93849, -56951, 42064, 27718, -71605, 38565, 33746, 99657, 37332, -49885, -288398, -201922, -146899, -92614, -129597, -97800, -90711, -87753, -8062, 100834, -10323, -135450, -121822, -39920, -89635, -100399, -11842, 98725, 242804, 146739, 894, -108480, -85210, 14366, -16692, 8163, -3097, -63197, 18809, 120993, 104434, 49794, -43786, -111101, -160137, -12753, 46309, -95280, -212994, -179539, -74150, 99807, 268610, 217943, 85995, 104584, 175966, 290995, 367860, 291426, 208667, 266377]
15276B66377j19900l8018o3930o7537l0151j38256M7396J10234m2789N967O3297
15265g310Q6954j7465J14506N5407j16467j08919m8398q6051J79036M7909J31265
15254B30467J13083O5390j45658n1537O1717l9231k2282j3056j60432k161j06177
15243f9877L1369K06223M8509q1916r3236j49142l877Q3267K3854r6762K0819
15232h0769n0021J7291J15500p658o4385M0227M1849n5421N6841N4993J70973
15221B39420M4940j93310J91536J48618j36096j46875k39267j25043J27189J76525
15211H7637N7823l5665q6767j28408l81J9038N6463K580L168P4752m897J01060
15199A46403R4883o332K6720o6942j15669J1097K5846Q0280Q242l5559q623j58656
$$ y = [266377, 146477, 108459, 44529, -23008, -53159, -191415, -144019, -33785, -76574, -70607, -7310, 79644, 62179, 176685, 232092, 115625, 6706, -41692, -127743, 51293, 99202, 230467, 343550, 408940, 263282, 211745, 273462, 234231, 211949, 198893, 38461, 36300, -69877, -38508, 167715, 216224, 134308, 41072, -108070, -111947, -28680, -4826, -101588, -80769, -130790, -113499, 2001, -5657, -70042, -29815, 12034, -43387, 13454, 68447, 239420, 284360, 91050, 282586, 431204, 295108, 148233, -91034, -216077, -88888, 87637, 145460, 109795, 23028, -105380, -105761, -86723, -30260, -27680, -24512, 50240, 45343, 146403, 241286, 234954, 261674, 194732, 79063, 90160, 116006, 196286, 204528, 168969, 160346, 1690]
15187A690p9776P7139Q2456o2241k49383k2471P3936O1119N7887q4811j37176
15176b81631n8874M8153J24489J62139O8844N7926M1618r3686Q2728J89194l613
15165C37287n9505q5671J0522j5114j11596J6630l0653j48652P9102J4016J4883
15154B1249r1935r569R9115R1817j10781k48754l4601Q9915J93469k8818n3575
15143h2468K679J41836K0162m9797P4812J1932r0659J534J47947j40014q4311
15132d6347o3895j21551k9178P0826J79959o9010n7877J35522Q191J16341l4730
15121H8251j94321n7246N8417J08909M5623R4863r6962o7557J0047R5243J3513
15110I8780K5563Q592q6654p0888j87873k1933J61046L2123p9624J9685p4949
$$ y = [1690, -78086, -947, 81509, 19268, -230115, -252586, -178650, -117531, -59644, -144455, -281631, -340505, -292352, -167863, -5724, 63120, 121046, 162664, 68978, 151706, 340900, 337287, 277782, 192111, 202633, 187519, 75923, 92553, 61900, -86752, -7650, 6366, 21249, -70686, -80255, 18860, 110677, -104, -248858, -283459, -193544, -75, -28893, -82468, -79789, 62047, 82209, 32412, 107224, 119156, 28497, 30031, 177978, 37964, -46347, -110242, -231793, -260971, -190145, -10186, -79196, -137073, -1551, 6640, 122981, 88251, -106070, -163316, -104899, 4010, 49633, 144496, 47534, -20023, -9976, 85267, 98780, 124343, 132935, 46281, -24607, -212480, -234413, -73367, -41244, -120868, -101183, -176132]
15099a76132l6110M6544o5861J31986K7993l5246l225j8291J29179J29450M3962
15088A74249q1442p6058J35798j2389m5608m3964q332m6261j8379k1776q750O6953
15076A4041L4560J37439q038k0824P1936l5383j05646J0691J7646O4715k371j247
15064A77519p4685l9646k2120J5231l9471j1598o393Q3801J18932p6702k24522
15053i9654j700K1843J5594J67530n0918j07498j09208M5069j1414M5846N6620
15042b7890k1267M086m0859j7541j11386O8048l1628J4439O3206j6621J25218
15031G805n3605n3743K5731l0245J19125n5278j28162o2356M7408l5510q7953
15020c06783M0842J22688L9891j1371N4434P318O9088o704o4020L9436L4718L3024
$$ y = [-176132, -212242, -165698, -231559, -99573, -71580, -106826, -110051, -128342, 837, 130287, 174249, 92807, 16749, 152547, 140158, 94550, 50586, 42254, -4007, -22386, -44162, -52912, 14041, 48601, 186040, 178002, 157178, 229114, 193731, 88085, 98776, 116422, 181137, 178766, 177519, 102834, 63188, 41068, 56299, 16828, 5230, -1163, 82638, 201570, 124868, -99654, -101354, -79511, -63917, 103613, 52695, -54803, -164011, -118942, -130356, -84510, -27890, -49157, -45071, -85930, -103471, -214857, -146809, -178437, -163998, -100792, -117413, 7805, -45800, -99543, -73812, -104057, 15068, -40210, -168372, -230728, -183320, -218830, -306783, -265941, -143253, -103362, -114733, -60299, -52981, 16107, 9403, -54617, -15181, 19537, 52561]
15008E2561m3415q0695j02888o427K412Q4426n5721p6692K5127P8305o1749l3172
14996b17928J58978Q4590l7915O4359j48918J2304J51677o7730o5593l5251m879
14985a06306r0536q8443K8667Q3380L723m3478J81810J77786j85591k01510J4435
14974b26063J62743k4281k1707J08907N00l2323j06526M2411M5207O0565J52847
14963A62280j49545j53186p883O577Q2193o4192n2419J07249J20620J2688p7159
14952a2777N4316k5439J25458J17605K3412l8074j2962j05280L1954O24j72576
14941a3739k499J02176p5449J45654R7211l2712p4675J4388K1588O2916j15025
14930A29834j02400p1380j15984J3931k6843J13367J34425o2485j06487Q0642
$$ y = [52561, 9146, -71549, -174437, -180864, -178452, -94026, -149747, -226439, -201312, -123007, -184756, -217928, -58950, 25640, -12275, 52084, -96834, -84530, 67147, -583, -66176, -101427, -106306, -196842, -285285, -256618, -173238, -169515, -212993, -31183, 146603, -38988, -240498, -226063, -63320, -87601, -109308, -401, 99, -32224, -138750, -96339, -51132, 9433, 162280, 12735, -140451, -148334, -141757, -59564, -123756, -176175, -68926, 51694, 64382, -12777, 41539, 16100, 141558, 259163, 282575, 244501, 231539, 126259, 158213, 158837, -13739, -16238, 85938, 10489, 156143, 253354, 220642, 145967, 160355, 181943, 244859, 129834, 27434, -43946, -159930, -145999, -172842, -59475, 74950, 12465, -94022, -13380]
14920a3380N1724N5035K9746j71226l8955J14339J39296j5093j24899n8265N5633
14909B3955j4534k78225K2921m0668j0367K24534J16266n3502o3343K7270j2546
14898e8239K5714Q2787r62j12466n2432M4440R2619J28706J05747M7795l1291
14887B72418j69128k3966O0919J1187q3485K1454O301R6402j40286j78754m215
14876a31153M1940q5248R0372M1344J37372l0532L491J5764J9961L2318k9609
14865A06020n7081k8455K4427J9642o8517r7444M1979J18716O4367j3056o4260
14854D6338l1054O0805P623j23766q4189J00608J53993p8764j84094j00523N0881
14843a82142J12331P8787N7577L2125j12557q1540N945o2968p1808O2226J10644
$$ y = [-13380, 38344, 93379, 123125, -48101, -87056, 27283, 166579, 151486, 26587, -31678, 23955, 9421, -268804, -245883, -286551, -296918, -72384, 43882, -9620, -72963, -45693, -58239, -32525, 50262, 49300, -63166, -115598, -71158, 21461, 150167, 255914, 303709, 272418, 103290, 79324, 140243, 151430, 67945, 89399, 95700, 192102, 51816, -126938, -131153, -89213, -174461, -84089, -42745, 94627, 64095, 67586, 83350, 103311, 135629, 106020, 48939, 20484, 44911, 64553, -3964, -101408, -59429, 59287, 123654, 110598, 46338, 15284, 76089, 83712, -40054, -124243, -23635, 130358, 51594, -132500, -233023, -182142, -69811, 8976, 66553, 98678, -13879, -95419, -89474, -152442, -224250, -162024, -51380]
14832e1380L5814k70M1529J35563N946M1083O5068K2691p8010r125J0223j08086
14820A11046n6033m0906Q3795P4792o6246j87352Q6964J0389l2357l0265l5686
14809h1859j39198n0698J42685O7175j7948K6474N5538J39869m083j72190o6322
14798a00557R7513J6197J00969q6749q8831q6782J1800k9968R2716J44502j21559
14787e0749k2459m5206r9815L6696R1214J24957J0375N3264k4317k0063J37283
14776A91180o0014n7681k462l7957j48991r609J2005q2702J2090J19564N1558
14765a3019J0543R8660K1472o4758j11207N7169R8909r742o9942L4232k2162J80417
14753B10572j01771r2339j90351J7973J35615R3583o6716k8705Q0459l4353Q3826
$$ y = [-51380, -15566, -15836, 25693, 161256, 167202, 208285, 273353, 296044, 218034, 208909, 219132, 111046, 55013, 14107, 97902, 172694, 106448, -80904, 6060, 16449, -15908, -46173, -81859, -221057, -271755, -129070, -61895, -79843, -53369, 2169, 142038, 137955, -34235, -100557, -3044, 13153, 114122, 27373, -61458, -148240, -136440, -166408, -73692, 70810, -50749, -73208, -118414, -218229, -181533, -90319, 34638, 45013, 98277, 73960, 53897, 191180, 131166, 73485, 71023, 33066, -115925, -125534, -113529, -196231, -184141, -64577, -13019, -2476, 96184, 117656, 52898, -58309, -1140, 97769, 88027, 18085, 52317, 30155, 210572, 108801, 16462, -173889, -155916, -20301, 73282, 6566, -22139, 58320, 23967, 107793]
14742A07793j8884m8660M9001r8096j53498J4529Q6679R4900j02656j89890Q1881
14731a76901J15751K5514N4019P4742R1470O8795m5262p7556J15050j15325j60963
14720c0666m4160K4698N2450N3212R34M7965n4729l5084K4617j0306R7170L5170
14708A61271m7526O0343L5451k1127l03536r2518J25732J64789k8960J50384M5781
14697B50084q9273R1499j25257p9477r9229n037o194J56343J22131k3123j8983
14686A73484N7478K2320k00249q763K0506j3991J44945P2473o3208j71513j74287
14675a40805o221P0000q442p5666R4743J41107Q1670n3710j3988Q1625j50732
14664A9581l8151J37998J7792q3410j48743J6532J67165K9834j25425L6738J12604
$$ y = [107793, 88909, 40249, 89250, -8846, -162344, -147815, -61136, 33764, -68892, -258782, -176901, -61150, -35636, 18383, 93125, 184595, 253390, 208128, 130572, 245622, 130297, -30666, -74826, -50128, 2322, 55534, 56468, 104433, 49704, 14620, 39237, 28931, 126101, 161271, 113745, 174088, 209539, 188412, -115124, -207642, -81910, 82879, 53919, 204303, 250084, 160811, 252310, 127053, 47576, -51653, -56690, -62884, 93459, 215590, 192467, 173484, 230962, 253282, 53033, 44270, 64776, 50785, 195730, 268203, 204995, 33482, -140805, -147026, -77026, -85468, -161134, -66391, 74716, 156386, 102676, 88688, 170313, 19581, -18570, 119428, 137220, 53810, -94933, -78401, 88764, 118598, -6827, 29911, 142515]
14653A42515n7785o275l3445q0328m4428K195m1767p1852j4845P5484J18769J43835
14641A32073J63034N514j49421j53977J50799M9229q5382q0286M269m6110j30613
14630a40871N3181N1443J42587K27262j14010q9994O9622k6413q7853j50663k3906
14619h9615j1188q0436J18244J75174J57250j6749N2670r1306j29454k9119p2605
14608a7134L2396j9060m0968j53893J29371J79499R7517m8159j28889M1511j67284
14597i5093J7707J90056K0900q4051n4016R2443M1309k1386Q4622o8187q0916
14586D3388J0630j7228j05056j13521J11416J14219L2453M8486p6383n6473k8357
14575c6426R4082n8853k09060j0076J35840M1662K3375L9758q9831o172Q4437
$$ y = [142515, 84730, 78455, 45010, -35318, -79746, -77551, -119318, -191170, -206015, -130531, -11762, 132073, 295107, 300621, 151200, -2777, 148022, 197251, 111869, 31583, 35852, -10258, -140871, -87690, -36247, 106340, 333602, 219592, 129598, 199220, 172807, 84954, -65709, -89615, -100803, -181239, -62995, 112179, 269429, 252680, 305350, 214044, 84590, 55471, -17134, 15262, -3798, -44766, -198659, -69288, 110211, 207728, 159569, 30680, 72191, -95093, -77386, 112670, 133570, 49519, -4497, 87946, 129255, 107869, 192491, 124304, 43388, 54018, 36790, -68266, -181787, -70371, 43848, 76301, 124787, 48404, -8069, -36426, 57656, -1197, -210257, -220333, -84493, -42831, -19456, 20302, -69529, -75701, 8736]
14564H736J07769M6097j45611j0017Q8550p460k1051J7027j7649j34216J26603
14553E8778J8985j07433j31j7728o6019j7540P5329M0627Q1182o3425o6400o364
14541g0139j8380J04630k4784N493j5050k04203j44024P5486K04968L656j6378
14530i8725k7118j9857M4397K76225O9989K865N5375m2809j01565l5876J57452
14519B80353j1710k14910o8761j4496J24459n4479n1630R2923J36142r817p0706
14508A37368q4493j63424j36259L2466K45255J75581j16783r7742j54715K9254
14498a33492K22303k2687n6305l3607P1007r1335j01005J08356K43607j9941M5005
14487B31906j6850J6144p388M189p3990m9334n0419K0574l2167K7275Q5180q4774
$$ y = [8736, 116505, 162602, 16991, 6974, 95524, 88064, 67013, 84040, 66391, -67825, 58778, 77763, -29670, -29801, -47529, -113548, -131088, -55759, -15132, 66050, 2625, -63775, -70139, -88519, 16111, -8673, -3180, -18230, -222433, -366457, -290971, -86003, -82347, -98725, -125843, -145700, -101303, 174922, 244911, 247776, 303151, 260342, 158777, 122901, 280353, 268643, 53733, -15028, -29524, 94935, 40456, -11174, 81749, 217891, 208074, 137368, 52875, -110549, -246808, -214342, 30913, 206494, 89711, -8031, -162746, -133492, 88811, 66124, 9819, -23788, 47219, -44116, -145121, -36765, 206842, 186901, 231906, 215056, 231200, 223812, 228001, 154011, 104677, 54258, 74832, 42665, 69940, 155120, 70346]
14475G0346j98252l5011j34695m2007R7017J36250N4384R082j6610M8740M806
14464e950j04540l2587q4693r3110J40312Q5620N5560Q2582o5947p7249R8557
14453a445O3004j9355M6048N4827Q0047J6972j51994j59823r6121O9776R640P0015
14441a8409n4701j12855J31208M9464P0621J72532J03233l2477j54787q5833J4751
14430H2747q2101o4093J4386N726j6314J8731o5196r2239O6942Q478k8015M7596
14418a03352N4615J1114R6293Q9098J9853O3589p9234l4589J55992j48407k7457
14407I7515K0140N9917K1233j69389L8014j12900j7850N068N3066o7258l6997
14396a09441R6596J50555r2560l2954p739R2827Q6634k7348J9901j5221K5677
$$ y = [70346, -127906, -162917, -297612, -339619, -242602, -106352, -51968, -42886, -59496, -10756, -5950, -110490, -143077, -227770, -320880, -180568, -94948, -39388, 43194, -22753, -100002, -1445, 61559, 42204, 88252, 143079, 223126, 240098, 88104, -71719, -167840, -98064, -88424, -18409, -73110, -185965, -54757, -5293, 65328, 237860, 341093, 308616, 153829, 67996, 82747, 646, -63447, -49061, -43335, -59649, -40918, -106114, -198353, -131411, -122933, -150948, -103352, -48737, -37623, 58670, 147768, 167621, 231210, 151976, 117387, 273379, 124972, 97515, 117655, 177572, 198805, 29416, 67430, -45470, -63320, -58252, -5186, -72444, -109441, -12845, 137710, 45150, 12196, 4457, 97284, 183918, 156570, 176471, 161250, 186927]
14385A86927O0210q763n4714q8221j07846N2940J49513L7788J10045l382r968
14374C24529j03097j05259j5991O9068r2785n2L5054j75387k5625J01847q5704
14363g3402K7100Q3396N1499O9261P9166j4628P6037O3905q6030k16639j10479
14352e0814P3213l7963k5917K4982m5499o8095K3213J34821j0814J0905M8791
14341G6823m0715P4340Q0716p9731j32981L4334M4323N5414p2817r7522k5626
14330h3442O0602J707J53177L5720j47824q3922J47699K6547k0497p7202m6737
14319c4172o6710R3652K20293n5045k1504K15j17413m3997J08610n5164j05923
14308g7158Q4263J10398M5046j939o7728R8658R6343J7742O107j62609P588k5986
$$ y = [186927, 247137, 238374, 183660, 95439, -12407, 40533, 190046, 227834, 337879, 334497, 324529, 221432, 116173, 100182, 169250, 76465, 76413, 111467, -63920, -89545, 12302, -73402, -46302, 37094, 88593, 157854, 237020, 222392, 298429, 362334, 276304, 59665, -50814, 22399, -15564, -41481, -16499, -61998, -130093, -106880, 27941, 17127, 28032, 76823, 36108, 110448, 191164, 111433, -21548, 12786, 57109, 112523, 39706, -57816, -83442, -22840, -21133, 132044, 167764, 19940, -63982, 83717, 110264, 89767, 12565, -34172, -100882, -7230, 213063, 158018, 136514, 136729, 19316, -24681, 83929, 28765, -77158, 7105, 117503, 162549, 160610, 92882, 191540, 287883, 305625, 311732, 149123, 156711, 130725]
14296A30725p0705Q4853q3307p8504M9675l8560o7405j779k2048L8482M6619P2086
14284F0132P963N9104L9224K4568r9768m5061j25184O1901P1279j05035j2471
14273f3348Q1730J8994N7365Q9530Q320K1529J46691K9963M4845M2408j72883
14262C05144k17733j54658l2450P3293p1800q3324J1057K15360O9802j8196n6084
14251D0411n3095K1194L4404R2167J33381J04622j19192j38884k29769O0901J85850
14240A31990P0531O3949o0682m9991O151j19785r1677J44316j9053L5242j6772
14229I4219p5538J2637J4430l8365o248k4049k6704M8680m4269K4006O4267J32782
14217A75848q7960j54060j40825N2516J3020J87587J01349j8818K8777l3864p877
$$ y = [130725, 60020, 144873, 61566, -16938, 32737, -5823, -73228, -75007, -97055, -58573, -11954, 60132, 68095, 127199, 166423, 190991, 91223, 46162, -79022, -17121, 54158, -50877, -63348, 18382, 37376, 94741, 184271, 192591, 214120, 360811, 390774, 435619, 478027, 305144, 87411, -67247, -99697, -26404, -98204, -181528, -170471, 44889, 114691, 96495, 40411, -12684, 8510, 42914, 135081, 268462, 373084, 253892, 115008, -114761, -53860, 131990, 202521, 266470, 205788, 155797, 161948, 42163, -49514, 94802, 75749, 110991, 94219, 18681, 31318, 45748, 7383, 1135, -22914, -49618, -938, -45207, -21201, 43066, 175848, 87888, -66172, -206997, -154481, -141461, 46126, 147475, 128657, 157434, 123570, 115693]
14206A15693n733m7317P1854m2204r006K1385m6170Q370L4195J32103P4921l4452
14194B73639o5446l0929P4962r3462l4198k3306j43738p7891J10479M3017O0575
14183I3702M5149n4129o5135r248O7772k3743P9892J02897J2133k3366p5815n9060
14171I1049N53j32610m4725J38077J3879r9531J09675M3280M9656O5712q2715
14160A52300l8362J03384L100p5021K89l1172N7430J37666r6822k02972m2181
14149c2361l032R7444r269M7425m0269J9150J13327J46082j18019q8321q4635
14138D7522p7457L2817J60235k0149K7903O3291k2747j44763j10881J04420k1086
14127C9105q143J2292R1475J2548J3094m0133R4138M2258L7734M5096o6746J447
$$ y = [115693, 109960, 62643, 134497, 92293, 83287, 104672, 58502, 66872, 101067, 233170, 308091, 273639, 208193, 177264, 252226, 158764, 124566, 101260, -42478, -120369, -9890, 33127, 93702, 138851, 84722, 19587, 10339, 78111, 54368, 134260, 237157, 249290, 225924, 150109, 91049, 91602, -41008, -85733, 52344, 66223, -33308, 76367, 119647, 169303, 235015, 152300, 113938, 217322, 220422, 145401, 145690, 114518, 171948, 309614, 212792, 9820, -32361, -35393, 62051, 52782, 100207, 59938, 79088, 192415, 338497, 220478, 132157, 47522, -29935, 2882, 163117, 142968, 170871, 234162, 211415, 66652, -44229, 60191, 39105, 30962, 43254, 134729, 147277, 160371, 120238, 214376, 256634, 294368, 339464, 272718, 274165]
14115B74165J0389J21394J62298N7543K02138K33012l7427j30804l9950n6736
14105G96022j17518k4502j30778m2190o1129o5837M0206O8016m589N2567N4328
14094E64596L7729J67282O258q9260l9873K6011q6447J28185K08752J24129J55650
14083A203012L0338M1606p5012j67173j01746j9097j21540k9643r3430n4640J13710
14072G26385K5834L3509j5656j47318p7134K05037K9924j34541k7941N5107j17823
14061E55383p6183P1350J06089J95299J12757N9652j18907k16311j42756p9640
14051D66733n2217o5736j11101o0837j4420m808j9794r7678m7701r107j8442l1123
14039f6231J1596J67608N400k0594O2066j04578P7398L2789Q2233M6024l7445
$$ y = [274165, 284554, 405948, 568246, 625789, 827927, 1060939, 1023512, 892708, 852758, 796022, 678504, 654002, 523224, 481034, 419905, 354068, 394274, 462290, 457701, 510268, 564596, 602325, 769607, 775865, 686605, 646732, 672743, 586296, 714481, 923233, 1047362, 1203012, 1233350, 1274956, 1199944, 1032771, 931025, 911928, 790388, 760745, 667315, 612675, 726385, 752219, 785728, 770072, 622754, 545620, 750657, 780581, 646040, 618099, 673206, 555383, 479200, 550550, 656639, 851938, 964695, 1024347, 905440, 689129, 546373, 466733, 414516, 348780, 237679, 176842, 162422, 157614, 137820, 40142, -7559, -16666, -35108, -66231, -54635, 112973, 118373, 97779, 159845, 55267, 132665, 165454, 247687, 293711, 256266]
14028B56266J0558j36834p0341Q293n1944n2986M7027n5904M7359J80034J4635
14017A96163r0767j17870n3769m8676N9059O2227N0061j34754M9769O081n1315
14006g3791J56523J70896o0473j7413o3205O2772R009l4618j05149M4317m9213
13995C9655m6370N2446l9623j02763m7469n6977J30416J22997J712J5763j21276
13984e1489k5586J22011K5814p3512p9492N9789J05712r7450L5149J59198j14337
13973F5807Q333R3523l977n7726M4669Q6240n3346j48009j32672N1698J02240
13962E6780R215k8214N1548n3557Q56j60002m3253J93277J80169l7878p4613J9048
13950A13376N2618N6544Q1034m0256O716J11626m8716k18599J23862J45383J52429
$$ y = [256266, 266824, 129990, 59649, 67942, 15998, -36988, 10039, -45865, 1494, 181528, 196163, 105396, -12474, -66243, -114919, -55860, 6367, 56428, -78326, -28557, -22476, -73791, 82732, 253628, 193155, 175742, 112537, 175309, 184318, 149700, 44551, 88868, 39655, -6715, 45731, 6108, -96655, -144124, -201101, -70685, 52312, 54024, 69787, -51489, -77075, 44936, 70750, -2762, -82254, -22465, 83247, -14203, 20946, 180144, 65807, 74140, 167663, 163686, 105960, 150629, 236869, 183523, 35514, -97158, -45460, 56780, 65995, 37781, 89329, 35772, 36628, -123374, -166627, 26650, 206819, 168941, 94328, 113376, 165994, 222538, 303572, 263316, 270032, 381658, 332942, 114343, 238205, 383588, 536017]
13939E36017j7997r5187j32472p2637N7736k9394N082j7060P1931N7549q7466
13928B76102M3607P5613j15723n4898j8932l8622J1799j45324M5197J72363Q0615
13917C31797k227m1853J02552O1357j65809M2107K7088j5027p9348M6466k3424
13906B83679k0744P210l4364K2207O5370Q7037O6672o4762J140J34219j21175
13895D26489j74742R083J5340J15576R3248j09996j07613J9646R9335R5136j04396
13884C77106q4814K5337M235J51127n5458j81265Q9513O6025j46102j04840r0705
13873E0159M197Q0015k0216j5373J50406J23173L8486p7880q4200L5910J51624
13862D36301O7460k8113n9448R2343J71345J20776p924o8908n1364J2353O5662
$$ y = [536017, 518020, 422833, 290361, 217724, 275460, 246066, 251148, 234088, 306019, 363568, 276102, 319709, 395322, 279599, 224701, 205769, 167147, 178946, 33622, 78819, 251182, 331797, 329570, 287717, 390269, 451626, 285817, 327924, 355012, 339985, 260637, 307103, 283679, 262935, 270145, 235781, 257988, 323358, 410395, 477067, 412305, 413445, 547664, 426489, 251747, 260830, 276170, 391746, 484994, 374998, 267385, 287031, 386366, 481502, 377106, 292292, 317629, 321864, 472991, 417533, 236268, 325781, 391806, 245704, 140864, 50159, 54356, 134371, 114155, 98782, 249188, 372361, 410847, 332967, 248767, 284677, 436301, 503761, 475648, 416200, 508543, 679888, 800664, 792740, 723832, 672468, 684821, 750483]
13851G50483K76344r553k4714K2770q011J6430j44764k54673j7757j08541n7935
13840D40079O2553k8963J42875m401R4496N8511N8039o3006J10049J62372l310
13829A029294k7051Q1734L0128P2370N0407J974j81501k44667l2833p7978m4870
13818F57007J39389j42587k5134J39700q197p4527J5815J21037L0576j3910o917
13807H32252j008m0437M8266L9055K0561J19820P2970R7803J77628j1144p1605
13796A284161p0340j23178q9896j17706l6891j86707K9400K8734j17714j02205
13786D97658p6414J5226q3161k555k7247l0946J5419J13570L4074q0876j50808
13775B23940p0392K6620J099K0253M9291M984o5593n2628J15458Q9753O7296J80847
$$ y = [750483, 1026827, 1017274, 992560, 1015330, 1007319, 1023749, 878985, 624312, 606555, 498014, 440079, 502632, 473669, 616544, 612143, 706639, 765150, 823189, 760183, 870232, 1032604, 1029294, 1002243, 1083977, 1114105, 1186475, 1236882, 1238856, 1057355, 812688, 779855, 701877, 657007, 796396, 653809, 628675, 768375, 760178, 685651, 701466, 822503, 853079, 839169, 832252, 831244, 790807, 839073, 878128, 898689, 1018509, 1091479, 1189282, 1366910, 1355766, 1284161, 1213821, 1090643, 1000747, 883041, 846150, 659443, 688843, 717577, 599863, 497658, 421244, 436470, 353309, 350754, 323507, 292561, 307980, 421550, 455624, 374748, 223940, 153548, 180168, 181267, 201520, 250811, 255795, 190202, 137574, 253032, 342785, 410081, 590928]
13763E90928l8266Q64M3496K2424k9838j05134M4827J2259j8362n9884O205p769
13751D61750o4432O7737J86258j511N8254n8860j2525r9075Q0274J08116r9610
13740F26376p31K14023J22205r5708j89846J12946l189M704K5800j8544n4136
13729G43900J17358J57875k2821N5354m5745k0634j0153l2418j04628j25251R9071
13718H11908R3786O0036j7449J080j53856k7339J00356J29634N2008k1847L8159
13707A066476J81134L0778j84483k4317J13501j26312m9256N9740O7886J46477
13697A281624k2366j0127k8203n9826J3565j03655L4058J60710Q6817K37405K6594
13686A616596k9441l6667L2230J14037K05270R0182M9553O8943Q9795J04512J62953
$$ y = [590928, 552662, 553526, 597022, 619446, 589608, 484474, 529301, 541560, 523198, 463314, 469519, 461750, 397318, 465055, 651313, 649802, 708056, 649196, 636671, 537596, 617870, 725986, 626376, 625645, 839668, 961873, 866165, 676319, 789265, 786076, 790780, 816580, 798036, 743900, 861258, 1019133, 996312, 1051666, 1005921, 985287, 975134, 942716, 838088, 712837, 811908, 905694, 965730, 948281, 949361, 795505, 768166, 868522, 998156, 1050164, 1028317, 1066476, 1247610, 1278388, 1093905, 1069588, 1183089, 1056777, 1007521, 1067261, 1135147, 1281624, 1259258, 1249131, 1220928, 1161102, 1174667, 1071012, 1105070, 1265780, 1352597, 1590002, 1616596, 1587155, 1550488, 1582718, 1696755, 1902025, 1992207, 2041760, 2110703, 2200498, 2305010, 2467963]
13675B467963N3415P0422j6497L3540n5249K4978R9511O3190J20404K16385K05720
13664C283782J86324J13248J68413L19347M27158L90565N28265L91847L36719
13655F145668M37719Q33543J192908J287191J385293J503385J869764K078350
13647A6733821K619137L416494M543419O251442Q889123J2878649J8982376K5044486
13639I9358947K3072775J2981183O196644l522226j3695197j5986001j4523310
13632I3882815j2561090j1268311r638366o162757k184392J353705M942585R873457
13624F8237646J7039231K2902337J5438711k869850j0354557n468059J106709
13617A06032168N501885R870219J6451722J7410546R838897N784355J437565j1146024
$$ y = [2467963, 2521378, 2591800, 2575303, 2608843, 2553594, 2578572, 2678083, 2741273, 2861677, 3078062, 3283782, 3470106, 3583354, 3751767, 4071114, 4498272, 4888837, 5417102, 5808949, 6145668, 6583387, 7416930, 8609838, 9897029, 11282322, 12785707, 14655471, 16733821, 19352958, 22769452, 27312871, 33564313, 42453436, 55332085, 74314461, 99358947, 122431722, 135412905, 141609549, 138087323, 124392126, 108406125, 93882815, 81321725, 70053414, 60415048, 54252291, 52067899, 53421604, 58364189, 68237646, 85276877, 108179214, 123617925, 120748075, 110393518, 104925459, 106032168, 111534053, 121404272, 137855994, 155266540, 165105437, 170889792, 172327357, 161181333]
13609A61181333j9612126j9530197j6119735j3228278j1274545p822922k709632
13602G0883898L329037J0919914K0478951K4737373R580630j1241249j6046053
13595A12642501j0516091o242097n711625n117040r28241N889490J4535300K6119386
13587A30671583M0545927M5397692K0444604j8055347l2992948k7554901k1656033
13580A36800577k2088836k4257091k2220083j6912465j1719826q055362n423290
13573B6123624l931644l137391k542856j915663j595855j181896q94328q93105
13565A0030886j023021j011507o39750l98878k10166l24863k72589k15480j88729
13556E745903k08718n37534n48047k16240j74316k26287l54036k03731j36824
$$ y = [161181333, 141569207, 122039010, 105919275, 92690997, 81416452, 73593530, 70883898, 74212935, 85132849, 105611800, 130349173, 139929803, 128688554, 112642501, 102126410, 95884313, 90172688, 85055648, 84127407, 90016897, 104552197, 130671583, 171217510, 216615202, 237059806, 219004459, 186011511, 158456610, 136800577, 114711741, 90454650, 68234567, 51322102, 39602276, 31546914, 26123624, 22191980, 19054589, 16511733, 14596070, 13000215, 11818319, 10923991, 10030886, 9007865, 7996358, 7356608, 6957730, 6747564, 6422701, 6150112, 5934632, 5745903, 5537185, 4999651, 4451604, 4235364, 4061048, 3834761, 3480725, 3276994, 3140170]
13547C140170j52377o7665K11443L56665J06679j60057k72887k42665j72160l3158
13537B713988L9027J85797J66215O9757K66638L11960J67980n591k71528l08079
13527C336164l60225l72779j88209k28469k34785k91292j34510k20055k48283
13518A057557O6221J45178J30529L6284j60770j54775L2735P1123K24537K57855
13508A706474L10836L52500N90682J187112J337922L57479o58942p80838n91700
13499C811525l87901m78701n36176m54322k16202J6654r1788p0435p4056j95003
13489A323595n1356l7297j45849N2476N258n8619J19024J44096L0881r3402j5062
13478A273745p4577r3301J61368K6005J00982n4523N7591J20681R7841j02160
$$ y = [3140170, 2987793, 2920128, 3131571, 3488236, 3594915, 3434858, 3161971, 2919306, 2747146, 2713988, 2753015, 2938812, 3105027, 3174784, 3441422, 3753382, 3921362, 3915771, 3644243, 3336164, 2975939, 2603160, 2414951, 2186482, 1951697, 1660405, 1525895, 1305840, 1057557, 1123778, 1268956, 1399485, 1435769, 1274999, 1120224, 1152959, 1224082, 1448619, 1706474, 2017310, 2369810, 2960492, 4147604, 5485526, 5843005, 5184063, 4403225, 3811525, 3423624, 2944923, 2408747, 1954425, 1738223, 1754877, 1663089, 1592654, 1518598, 1323595, 1272239, 1234942, 1089093, 1141569, 1146827, 1088208, 1207232, 1351328, 1382209, 1288807, 1273745, 1199168, 1105867, 1267235, 1293240, 1394222, 1339699, 1397290, 1517971, 1615812, 1513652]
13468A513652n1178K45444M05139L87854O2311J44005N40681R29034J151767P06199
13458F034908m85048p29536m92773k89601m45858n55896n64974k63992k44491
13449A962739j02783r5397j14384J5545P339j981p984O7056p0165j85702l7547
13438A436736K28804J12470j16413J11238q3955R4822N2776M1349P3916m8125
13428A903618m0999m4139n0371J31154J10247K5583m741J06999J95050M1531p2247
13417B301685k4694K547L07637K39823J5344J28167K78041L84924m1024J86489
13407C778939K55769K66772J54434J44689K48990J76733L57073L45611L99659
13398F128669N57883N71783P99078Q71071J088209J389011J682894K098246K452837
$$ y = [1513652, 1462474, 1707918, 2113057, 2500911, 2563222, 2707227, 3247908, 4176942, 5328709, 6034908, 5549860, 4820324, 4327551, 4037950, 3592092, 3036196, 2471222, 2207230, 1962739, 1859956, 1764559, 1650175, 1665720, 1673059, 1671078, 1663094, 1730150, 1659985, 1474283, 1436736, 1665540, 1778010, 1661597, 1772835, 1688880, 1783702, 1836478, 1877827, 1951743, 1903618, 1862619, 1818480, 1768109, 1899263, 2009510, 2035093, 2030352, 2137351, 2332401, 2373932, 2301685, 2276991, 2279538, 2587175, 2826998, 2842342, 2970509, 3248550, 3633474, 3592450, 3778939, 4034708, 4301480, 4455914, 4600603, 4849593, 5026326, 5383399, 5729010, 6128669, 6686552, 7258335, 8057413, 8928484, 10016693, 11405704, 13088598, 15186844, 17639681]
13389A7639681K640300K971064L703269M614757O111140Q002774J0423350J4239031
13381G0345366K0913977L2252533M6024416M6956843J7604295j9083177k9490812
13374A85523441k2789105j7509571j8580461j9891658j6114461q975848j184462
13367H0477875Q155697J9221874K4016178Q999803j2113878j6411120j0472620
13360A01873809o288117o901336p740827m759830O89024P409486J5399539K3154138
13352A22835886K3958930J4308489P447092L723315p110587j5715867j6331915
13345A33115343j2641976p350599r74581P769123J0861632k784394j6734693j6195752
13337I5064103j0408194p361138p958676q163068n597327j937818J679186N650001
$$ y = [17639681, 20279981, 23251045, 26954314, 31569071, 37680211, 45682985, 56106335, 70345366, 91259343, 123511876, 169536292, 216493135, 234097430, 215014253, 185523441, 162734336, 145224765, 126644304, 106752646, 90638185, 81662337, 80477875, 88633572, 107855446, 131871624, 140871427, 128757549, 112346429, 101873809, 95585692, 88684356, 80943529, 76183699, 76872723, 84282209, 99681748, 122835886, 146794816, 161103305, 168550397, 172273712, 165163125, 149447258, 133115343, 120473367, 113122768, 112148187, 119917310, 130778942, 127994548, 111259855, 95064103, 84655909, 77294771, 69336095, 61173027, 55575700, 53637882, 55317068, 60967069]
13329F0967069J0451717J6897113K2330321J8770117R497943K898061q217337
13322A33595004j7449265j8307114j6316742j4455567j3739786j2424091r573930
13315C1328509o718694m589200l238631k395176j764009j277800j175088j017762
13307I152149q79763o80405p24625o91190n22329n39361n06973m71327l01896
13298C834280l98613k71235k12749k86103k70523j69530r0624n5979l04928r3330
13288A680666j60595j96838l9063J18619L2712j77459j52118P025J07849o7730
13278A153068J8311k7286o4354P3514o0403q0013r1157k5505j9954r1201O2413
13267H47433m079k7055p5425n0760n1809o5460j57739K3907j315J4192L7375r1618
$$ y = [60967069, 71418786, 88315899, 110646220, 129416337, 138914280, 141812341, 133595004, 116145739, 97838625, 81521883, 67066316, 53326530, 40902439, 31328509, 24609815, 20020615, 16781984, 14386808, 12622799, 11344999, 10169911, 9152149, 8272386, 7591981, 6867356, 6176166, 5653837, 5114476, 4607503, 4136176, 3834280, 3435667, 3164432, 2951683, 2665580, 2395057, 2225527, 2134903, 2078924, 1773996, 1680666, 1520071, 1323233, 1284170, 1402789, 1435501, 1258042, 1105924, 1112949, 1220798, 1153068, 1171379, 1144093, 1079739, 1153253, 1092850, 1012837, 921680, 896175, 876221, 785020, 847433, 843354, 816299, 740874, 690114, 638305, 572845, 415106, 439013, 437698, 451890, 489265, 397647]
13255C97647j13825M3194j29927m0690J96761K32066O997j14762j22559J08650
13245D63552p901M541K1409q9494k37270K4331j3963N7522j8485q5664L0280J39272
13233B88130r9776j1939K4634m6675p9242M8434J06795M5506j31120j22015L5379
13222E8111K5325R2754l6454r0606J90766J27482N8228j06550j32582k5811M3132
13211B03795J34579K54206p9855j46829l3002P2831j8305j30460l296j1311j7498
13200B24855M6096P7503O8032K6172q8243k4867j1851O5898O7474n8856q6707
13189C05506N8207l0375L2349Q0197o3388j14831k0785J42601j5196N8481j1937
13178D20829p122m4878l2188j11604l2337o6185k2090P2820P6917N1144N2672
$$ y = [397647, 283822, 327016, 197089, 156399, 353160, 585226, 592223, 477461, 354902, 463552, 455651, 460192, 481601, 392107, 154837, 179168, 165205, 222727, 204242, 118578, 148858, 288130, 188354, 176415, 201049, 154374, 75132, 123566, 230361, 275867, 144747, 22732, 58111, 83436, 176190, 139736, 49130, 239896, 367378, 425606, 319056, 186474, 160663, 203795, 338374, 592580, 512725, 365896, 332894, 405725, 387420, 256960, 253664, 242353, 224855, 270951, 348454, 416486, 442658, 354415, 329548, 317697, 383595, 451069, 392213, 305506, 363713, 333338, 365687, 445884, 382496, 267665, 246880, 389481, 374285, 432766, 420829, 413707, 368829, 336641, 225037, 192700, 126515, 104425, 177245, 254162, 305306, 357978]
13167C57978j50031L0885N6763q6062q121L9472Q0729J38964J31842K29072N463
13156H26954J09850J66413J92481J81992M2181j20750k03922j88165l50351j84358
13146D72325j04534J2568R103L0378K07254J45843P8579K739k29579j31535m0165
13135D52976j13005P2104K8372J04351O6867m7410J79400K23949K9335P4219j17620
13124I53538j55060l6197j35366l7146L8700J18549P4760p2087j0146j96616n6685
13113D86244l0241P4932K0383o1360q0465k50729J42641O3040l1160l4822J95984
13102D94447J22166P1914l919j54642J4250K7612o2372o6027o3483m3064j31182
13091B05700n5559k8356Q7247p5748r6766R0205L8267l3394J11553L6099p5681
$$ y = [357978, 207947, 238832, 295595, 209533, 201412, 240884, 321613, 460577, 592419, 821491, 826954, 936804, 1103217, 1295698, 1477690, 1519871, 1399121, 1195199, 1007034, 656683, 472325, 367791, 380359, 389462, 419840, 627094, 772937, 851516, 854255, 624676, 493141, 452976, 339971, 412075, 440447, 544798, 611665, 564255, 743655, 967604, 996939, 1071158, 953538, 798478, 762281, 626915, 589769, 628469, 747018, 821778, 749691, 739545, 542929, 486244, 456003, 530935, 551318, 489958, 409493, 158764, 301405, 364445, 333285, 298463, 494447, 616613, 688527, 684608, 529966, 544216, 571828, 509456, 443429, 379946, 336882, 205700, 150141, 121785, 209032, 133284, 36518, 126723, 164990, 131596, 243149, 279248, 203567]
13080B03567m6603K2648l1648l1272N6989q810N8618j00683p1740M9122q5830
13069A4358j06661j34075L1979L1520O4391Q7216j0258q4730r949K006l2392M2157
13057a04438q569k7739R3933j1126q9224K7326m0558l4351J80224L9986M0397
13046F5861L2452L4088l9240p2763l2634K8767J1830J10419j1282j02970j73837
13035a49309K9810R6206k1191J02Q2691L1593o644N5468j26575J8283P5492K0376
13023A06302j2831j82481j25366k4049R5282K01682O2331l5918j79950o7920K3501
13012a39417j0778R9679P7035o7404k1538J36315J04591m1794j31221k1412o5120
13001h1064m4257m3270J37041L2801N6970O2077j48392p6544j900O0367J4228
$$ y = [203567, 156964, 179612, 147964, 116692, 173681, 164871, 223489, 122806, 51066, 100188, 14358, -92303, -226378, -194399, -162879, -98488, -11272, -21530, -106260, -116209, -114203, -146595, -104438, -113007, -140746, -46813, -57939, -147163, -119837, -160395, -194746, -14522, 25464, 65861, 98313, 132401, 93161, 20398, -12236, 16531, 28361, 138780, 127498, 24528, -149309, -119499, -23293, -44484, -44382, 38309, 69902, 63258, 118726, -7849, 10434, 85926, 106302, 93471, -89010, -214376, -238425, -143143, 58539, 120870, 84952, -94998, -162918, -139417, -150195, -50516, 26519, -40885, -62423, 73892, 178483, 136689, 5468, -15944, -81064, -125321, -168591, -31550, 1251, 58221, 120298, -28094, -104638, -106538, -46171, -31943]
12990c1943j08747m4392M8730P9667N8248J0084J3428j0434J38609q8000j66192
12979a00942j06184Q0289P7390L3847q0971j12403p2364m4802J6193J52835J82679
12968B5567j37516q8015M150K9776J00214Q1556O4653J4017j13814m2460L1966
12957b9906K1679o2675k3961Q9450Q5834n054j355j6740j54422m7956M3035n1548
12945a53619P1145J58987N4392J79440o7700q6173j74697J77857k0563k6351m265
12934A08453j23271n9274J57438l5577j43057J1119J29465o034o7724Q1045J3747
12923F6330k4969J17190j2356j17855N0196N3758N124O0450j10029k7464J26945
12912A87320m7851l1730L3956R316N4247K306R7328K93992L30822J55707j26618
$$ y = [-31943, -140690, -185082, -136352, -56685, 1563, 11647, 25075, 14641, 153250, 65250, -100942, -207126, -126837, -49447, -15600, -96571, -208974, -281338, -326140, -309947, -157112, 25567, -111949, -199964, -195814, -166038, -65824, 15732, 80385, 94402, -19412, -61872, -29906, -8227, -70902, -94863, -5413, 80421, 75367, 74012, 57272, -97150, -145106, -102071, -153619, -82474, 76513, 130905, 310345, 242645, 156472, -18225, 159632, 139069, 112718, 108453, -14818, -74092, 83346, 47769, -95288, -84169, 45296, 39262, -28462, 52583, 66330, 41361, 158551, 146195, 28340, 78536, 132294, 137418, 197868, 87839, 60375, 187320, 139469, 107739, 141695, 151011, 205258, 207564, 304892, 598884, 929706, 1085413, 958795]
12901I58795j45924n2030j83551j4082o8388j07556m5098J9386j52097n3474O7234
12890B23215J73911J56613N2911M7475M7073p1226j53617j20344l4758P3798J78160
12879E73211J37641P8500P1902K9869n8467j17712J2774K2245n7845o0247j45301
12868D86570j45316m5368O390j2943P8990K7975n2269M2411R8354n7228k5706
12857D01860l7595j5623J3521O6507J8621J19950J58964N2778J82280L1746k83461
12846G09548k86510p5903j46300j46542K1656N9736l0767r9085o0511N4285Q2234
12835H1841O2509m5957n7310J69030J4080N7856j38055j84378j29683O5652l4820
12824a39235L4650N2624R690N6335J08803R6622p0016m9947m9992n3809j1878
$$ y = [958795, 812871, 760841, 577290, 563208, 494820, 387264, 342166, 361552, 209455, 155981, 223215, 397126, 553739, 606650, 654125, 701198, 629972, 476355, 356011, 321253, 395051, 573211, 710852, 789352, 861254, 891123, 832656, 714944, 727718, 749963, 692118, 631871, 486570, 341254, 295886, 302276, 289333, 368323, 396298, 344029, 386440, 484794, 427566, 401860, 364265, 348642, 362163, 428670, 447291, 567241, 726205, 778983, 961263, 993009, 709548, 423038, 347135, 200835, 54293, 75949, 135685, 104918, 5833, -54678, -393, 81841, 144350, 98393, 41083, 210113, 224193, 282049, 143994, -40384, -170067, -104415, -139235, -104585, -51961, -42271, 14064, 122867, 219489, 149473, 99526, 49534, -4275, -16153]
12813a6153r73l8401L7801R5931J7899p8333K0843M2898M5797m5332l7741q811
12801C5425J8406J31098N1149k15007p7942J26872L7750q1467j69426k5265J86193
12790A7786r5036R8255O8173J8420r6723P5414p6498p9921J20769N5729J619q4311
12778B3676k3568N3217J05195q2674k60J4296K9244O9901p6573j03080j8847M2102
12766C2629p2588j03843j7344J14682P5426o5775k39833p996R7375J4079M3567
12755a29621P9139P0639J8765n9694K495L5902l5272q0227K06669n0501L3878
12744I2172j9723n2246L5744m6115p3159Q3419K2760O5048r9636k02798p8377
12733b72911l6942J57368J14837J44480j4029p0963j1768j1092q9392o0325N4708
$$ y = [-16153, -17126, -55527, -17726, 78205, 96104, 17771, 38614, 81512, 127309, 81977, 44236, 35425, 53831, 184929, 236078, 21071, -56871, 70001, 107751, 26284, -143142, -168407, 17786, -77250, 21005, 89178, 107598, 10875, 86289, 9791, -70130, 50639, 106368, 107987, 23676, 108, 53325, 158520, 75846, 75586, 89882, 119126, 189027, 112454, 9374, -9473, 32629, -39959, -143802, -161146, -46464, 28962, -36813, -276646, -284642, -187267, -173188, -129621, -50482, 20157, 38922, -20772, -18277, 17625, -17647, -97874, 108795, 58294, 92172, 72449, 20203, 55947, 9832, -63327, 20092, 42852, 107900, 8264, -194534, -272911, -309853, -152485, -37648, 106832, 92803, 21840, 10072, -1020, -90412, -150737, -96029]
12722i6029N9511K7854j32034l8203o1689p4888Q1345N9788N2469M8625J10220
12711C6969l7909n6514p0641j19898j3368J18310m0161m2884P9833J58665N3901
12700F6303M3908l6110j1733r8091L5178J37630l4916p9396j36225j7185J60638
12689C0001M076J41910m4584j73213p9771o2898p4613q174Q5183P5619j9064l8267
12677a63795R141L7479n8750Q8652J29643m9539j40993J9602Q9564l6152l1742
12666a06890O2306J08880j24821j42761j9257N4889n6931o8887J1845J59142K03023
12655H0538n4756j13704p2086Q2951q81N8298j46540n1718P3122M28j3853j01155
12643b59356O4727k2795n1267m0240Q4260J81310l5478Q281R6191K4508M9741
$$ y = [-96029, -36518, -8664, -140698, -178901, -240590, -315478, -234133, -174345, -121876, -73251, 36969, -940, -57454, -128095, -247993, -261361, -143051, -183212, -226096, -146263, 12402, 66303, 110211, 74101, 62368, -35723, -545, 137085, 102169, 22773, -113452, -130637, 30001, 34077, 175987, 131403, -41810, -121581, -184479, -259092, -267266, -182083, -106464, -125528, -163795, -154654, -117175, -175925, -87273, 42370, -7169, -148162, -128560, -38996, -75148, -106890, -44584, 64296, -60525, -203286, -222543, -167654, -224585, -293472, -281627, -122485, 80538, 25782, -87922, -160008, -77057, -77938, -19640, -166180, -217898, -144776, -144348, -158201, -259356, -194629, -217424, -268691, -308931, -224671, -43361, -78839, -70558, 25633, 50141, 99882]
12632I9882p4229l8678j8739N9530k788P3618K8124j48921q6302O5394o8860j0504
12620a22473P6427L8572l4015n9785j16709l754n5016n5393P1614P66O1825J37921
12608f0020J10276q0174l9665j2685r1581K1522J07281M3694k1107j42298L3566
12597a31191O5490J23090j1754p9126J02975m1984N1176q1348q8106m9208R5525
12586d4461J626l4525M1261O4322J87o1002J5436p3849j2605p708K04532M0294
12574A33508q3162J10933J7936k6148o1826j36994K7210j51151M7513O8898K9971
12563b3312j3654j701o138L6303m691j17818j01358l2026J04857k378J71039o3607
12551e4484k02587M5870N5993N7037q8875J3916J11384m3587l2717J52867J47689
$$ y = [99882, 25653, -13025, -31764, 27766, 24978, 98596, 126720, -22201, -108503, -43109, -111969, -122473, -46046, -7474, -41489, -101274, -217983, -221737, -276753, -332146, -260532, -259766, -197941, -60020, 50256, -29918, -69583, -82268, -173849, -152327, -45046, -1352, -22459, -164757, -131191, -65701, 57389, 45635, -33491, 69484, 27500, 78676, -2672, -90778, -139986, -44461, -42835, -77360, -36099, 28223, 28410, -32592, -17156, -91005, -103610, -111318, 93214, 133508, 50346, 161279, 179215, 153067, 91241, -45753, -18543, -169694, -122181, -53283, -23312, -36966, -38667, -44805, -8502, -13193, -131011, -232369, -264395, -159538, -161916, 9123, -54484, -257071, -211201, -155208, -98171, -187046, -173130, -61746, -105333, -138050, 14817, 162506]
12540A62506k8309p4428j14579m6845M1246n0507M8852L2829K2346k8561k2840
12529e8290l1947j34285n3530N5197Q1766K28641n9489k6904j332k9097M3595
12518A4325N0362r5696j03854L2864o1786J25535n715j04766O1520J9782Q0103
12507A2674R4688k0979L6051O1365J8368j10445q2071o4528m7898K1184j5918
12496i7509N0753J0139n3978m4328J9243J03024N6973J67828J03035j30672o9727
12485A14781m7649l1369j03400j28765r4703N4370J99618P6567m9237j45891q540
12474a64218Q7632J58476L3242j48388M9350J0164O0948O1496n256n1031K0805
12463A13220o9016j23360R7654K4967o8821J1508K289j32297q8882J25041R6564
$$ y = [162506, 134197, 59769, -54810, -101655, -60409, -110916, -62064, -29235, -6889, -35450, -58290, -90237, -224522, -278052, -222855, -141089, 87552, 28063, 1159, -173, -29270, 14325, 64687, -31009, -134863, -101999, -163785, -38250, -43965, -148731, -87211, -67429, 12674, 107362, 86383, 122434, 183799, 202167, 91722, 9651, -54877, -102775, -81591, -97509, -46756, -36617, -90595, -134923, -115680, -12656, 44317, 212145, 315180, 184508, 114781, 67132, 35763, -67637, -196402, -291105, -236735, -37117, 39450, -9787, -155678, -164218, -76586, 81890, 115132, -33256, 16094, 26258, 87206, 148702, 143446, 92415, 113220, 44204, -79156, 18498, 43465, -25356, -13848, -11559, -143856, -232738, -107697, -11133]
12452a1133j3555J3658Q5975J54477j7445j59589p0365j42797K4361k306Q298
12441a30421J12348J05121r9927r4295j7970O6826m1424L7437J07632r0510o5703
12430a10886O2872n7472K8206Q7334Q1579K8512k0854K8923n1312p6692o3718
12419f3508l2517R9608M4564q3776K9097p9825j4868J35535K5095l7804j52805
12408a31204l5816N624Q6181K7608k535p2169J56041P7366l7429j28943j53254
12397b08530l671L7050J58692J03002O5857l4665j43695r896N1573j19470r6414
12386b00167j27395k1590Q9932J70063n2553j46914r2494J69380J40229K9865
12376d1644r0508l4530Q0881p2763j47112P6564J04976k825O2654Q5756K3545
$$ y = [-11133, -24688, -11030, 74945, 229422, 211977, 52388, -17977, -160774, -136413, -138719, -130421, -18073, 87048, -12879, -107174, -125144, -58318, -99742, -62305, 45327, -45183, -110886, -48014, -105486, -77280, 10054, 91633, 120145, 99291, 128214, 76902, 210, -63508, -96025, 3583, 48147, -35629, -6532, -86357, -101225, 34310, 59405, 21601, -131204, -167020, -161396, -75215, -47607, -50142, -122311, 33730, 111096, 73667, -55276, -208530, -212201, -175151, -16459, 86543, 152400, 117735, -25960, -35856, 15717, -103753, -200167, -327562, -349152, -259220, -89157, -141710, -288624, -381118, -211738, -71509, -41644, -132152, -166682, -85801, -158564, -305676, -229112, -124136, -126961, -64307, 21449, 44994]
12365D4994M2594m3295p9927J08921k7186j2028q4459K2351J5526N9582n6902
12354i829j6757n2411n041O5520L6621L6924K8704q3161N0931p0084N986N1592
12342C8995j84798p1804Q4654m4831N7070N2848p1041j0236J02206L8050M7417
12331C8530l3418N3326m1103q1933j0212P2230N8160o202o9000m7542o7392l9542
12319a74098j4847Q5273Q6496m1520K3936m7806o0483k177k2886K6622O6629J73534
12307I8673L5871l5111Q2796L1535J9096m1367K1119j8885j61894j61093P8060
12296e1200J35922J6515j00797o8952o259J05098m209k9684j8281M9841j10991
12285h2997n7444J47683l6363M52J32734J01934m9837r0384K3549j82946k09560
$$ y = [44994, 87588, 44293, -35634, 73287, 46101, 34073, -50386, -28035, -12509, 47073, -9829, -26586, -78997, -84038, -18518, 18103, 55027, 83731, 570, 51501, -18583, -12597, 38995, -145803, -217607, -132953, -177784, -120714, -67866, -138907, -149143, -46937, -8887, 38530, 5112, 58438, 17335, -64598, -74810, -2580, 55580, 49378, -19622, -67164, -134556, -174098, -188945, -103672, -17176, -58696, -34760, -82566, -143049, -145226, -168112, -141490, -74861, 98673, 134544, 99433, 182229, 213764, 232860, 191493, 212612, 193727, 31833, -129260, -51200, 84722, 101237, 440, -68512, -74771, 30327, 26118, -3566, -21847, 27994, -82997, -140441, 7242, -29121, -28669, 104065, 205999, 156162, 65778, 89327, -93619, -303179]
12274c03179M5039q255o0686K8293R9510Q672O0035K5899j41215J8780J51997
12263g5110l7490P3219L4579R0264p3332j06881j143P0247O5494M056j44010k5240
12251a25347Q5949J11754O673O032l0431N3511r4999o016j2812L5540k3079n1016
12239d4241m0760p6767j7942N0142K5298J08711N1722N4304L67O472l8056m3934
12227C5316P0949o7477j30492m4011O7001J2827o0956o4630O2132N0579j12369
12216a81131l6703R5429K35448M5352j95053M7951J253L3752J55475M5064k00957
12205D5880o5499R8078M1274j37486k4889j10531j39748N3466P6994Q1661J43797
$$ y = [-303179, -258140, -266395, -327081, -298788, -199278, -190606, -130571, -104672, -245887, -227107, -75110, -112600, -39381, -4802, 85462, 12130, -94751, -95894, -25647, 39847, 43903, -100107, -125347, -39398, 72356, 79029, 85061, 54630, 108141, 13142, 7126, -5686, 29854, 6775, -44241, -85001, -161768, -179710, -129568, -104270, 4441, 56163, 110467, 110834, 117306, 79250, 35316, 106265, 38788, -91704, -135715, -68714, -55887, -116843, -181473, -119341, -68762, -181131, -217834, -122405, 113043, 158395, -36658, 11293, 12546, 46298, 201773, 246837, 45880, -19619, 78459, 119733, -17753, -42642, -153173, -292921, -239455, -162461, -80800, 62997]
$$ [...]
##END NTUPLES=NMR SPECTRUM
##END=
