##TITLE=Analysis number 314354
Compound Code cc 47809
Book Reference 458/42
Project Code adrs
Chemist Name stevem
##JCAMPDX= 6.0         $$ Bruker NMR JCAMP-DX V2.0
##DATA TYPE= NMR SPECTRUM
##DATA CLASS= NTUPLES
##ORIGIN= Bruker BioSpin GmbH
##OWNER= NMR
$$ XWIN-NMR		Version 3.5
$$ Fri Oct 14 10:40:16 2005 GMT Daylight Time (UT+1h)  MAYBRIDGE\NMR@NMR_250MHZ
##.OBSERVE FREQUENCY= 250.131544655141
##.OBSERVE NUCLEUS= ^1H
##.ACQUISITION MODE= SIMULTANEOUS (DQD)
##.ACQUISITION SCHEME= undefined
##.AVERAGES= 16
##.DIGITISER RES= 18
##SPECTROMETER/DATA SYSTEM= dpx250
##.PULSE SEQUENCE= zg30
##.SOLVENT NAME= CDCl3
##.SHIFT REFERENCE= (INTERNAL, CDCl3, 0, 16.522)
##AUDIT TRAIL= $$ (NUMBER, WHEN, WHO, WHERE, WHAT)
$$ ##TITLE= Audit trail, XWIN-NMR		Version 3.5
$$ ##JCAMPDX= 5.01
$$ ##ORIGIN= Bruker BioSpin GmbH
$$ ##OWNER= NMR
$$ C:\u/data/dgb/nmr/ADRS/10800/pdata/1/auditp.txt
$$ ##AUDIT TRAIL=  $$ (NUMBER, WHEN, WHO, WHERE, WHAT)
(   1,<2005-10-14 10:39:44.50 +100>,<MAYBRIDGE\NMR>,<NMR_250MHZ>,
      <created by zg, POWCHK disabled, PULCHK disabled
       configuration hash MD5:
       62 19 C7 07 E1 42 D1 B7 37 6C 3D D0 77 39 F9 E6
       data hash MD5: 64K
       66 13 B8 A9 F1 DA 30 79 B0 91 6F ED 3A A7 83 4F>)
(   2,<2005-10-14 10:40:01.89 +100>,<MAYBRIDGE\NMR>,<NMR_250MHZ>,
      <Start of raw data processing
       ef LB = 0.3 FT_mod = 6 PKNL = 1 SI = 32K 
       data hash MD5: 32K
       F0 1E B3 A0 A9 56 95 3F 3D 05 62 E2 C5 14 FA 7B>)
(   3,<2005-10-14 10:40:05.30 +100>,<MAYBRIDGE\NMR>,<NMR_250MHZ>,
      <apk 
       data hash MD5: 32K
       D0 6D E1 2F 28 27 AA E1 06 B9 08 7A 0B 71 B6 C5>)
(   4,<2005-10-14 10:40:06.74 +100>,<MAYBRIDGE\NMR>,<NMR_250MHZ>,
      <abs ABSG = 5 
       data hash MD5: 32K
       37 F6 E5 C8 A2 80 17 10 65 43 26 4E DD FC 02 F4>)
$$ ##END=
$$ 
$$ hash MD5
$$ AF 60 71 4A F9 7B 74 F0 34 66 77 29 57 9A 96 F0
##$RELAX= 
##$RELAX= 
##$RELAX= 
##$RELAX= 
##$RELAX= 
##$RELAX= 
##$RELAX= 
$$ Bruker specific parameters
$$ --------------------------
##$DU= <C:\u>
##$EXPNO= 10800
##$NAME= <ADRS>
##$PROCNO= 1
##$TYPE= <nmr>
##$USER= <dgb>
##$AMP= (0..31)
100 100 100 100 100 100 100 100 100 100 100 100 100 100 100 100 100 100 
100 100 100 100 100 100 100 100 100 100 100 100 100 100 
##$AQSEQ= 0
##$AQ_mod= 3
##$AUNM= <au_zg>
##$AUTOPOS= <41 >
##$BF1= 250.13
##$BF2= 250.13
##$BF3= 250.13
##$BF4= 250.13
##$BF5= 500.13
##$BF6= 500.13
##$BF7= 500.13
##$BF8= 500.13
##$BYTORDA= 1
##$CFDGTYP= 0
##$CFRGTYP= 5
##$CHEMSTR= <none>
##$CNST= (0..31)
1 1 145 1 1 1 1 1 1 1 1 1 1 1 1 1 1 1 1 1 1 1 1 1 1 1 1 1 1 1 1 1 
##$CPDPRG= <>
##$CPDPRG1= <>
##$CPDPRG2= <>
##$CPDPRG3= <>
##$CPDPRG4= <mlev>
##$CPDPRG5= <mlev>
##$CPDPRG6= <mlev>
##$CPDPRG7= <mlev>
##$CPDPRG8= <mlev>
##$CPDPRGB= <>
##$CPDPRGT= <>
##$D= (0..31)
0 1 0 0 0 0 0 0 0 0.06 0 0 0 0 0 0 0.0002 0 0 0 0 0 0 0 0 0 0 0 0 0 0 
0 
##$DATE= 1129282783
##$DBL= (0..7)
120 120 120 120 120 120 120 120 
##$DBP= (0..7)
150 150 150 150 150 150 150 150 
##$DBP07= 0
##$DBPNAM0= <>
##$DBPNAM1= <>
$$ [...]
##$SUBNAM7= <"">
##$SUBNAM8= <"">
##$SUBNAM9= <"">
##$SW= 20.6930455092707
##$SWIBOX= (0..15)
0 0 3 0 0 0 0 0 0 0 0 0 0 0 0 0 
##$SW_h= 5175.983436853
##$TD= 65536
##$TD0= 1
##$TE= 294.16
##$TE2= 300
##$TE3= 300
##$TEG= 300
##$TL= (0..7)
0 120 120 120 120 120 120 120 
##$TP= (0..7)
150 150 150 150 150 150 150 150 
##$TP07= 0
##$TPNAME0= <>
##$TPNAME1= <>
##$TPNAME2= <>
##$TPNAME3= <>
##$TPNAME4= <>
##$TPNAME5= <>
##$TPNAME6= <>
##$TPNAME7= <>
##$TPOAL= (0..7)
0.5 0.5 0.5 0.5 0.5 0.5 0.5 0.5 
##$TPOFFS= (0..7)
0 0 0 0 0 0 0 0 
##$TUNHIN= 0
##$TUNHOUT= 0
##$TUNXOUT= 0
##$USERA1= <user>
##$USERA2= <user>
##$USERA3= <user>
##$USERA4= <user>
##$USERA5= <user>
##$V9= 5
##$VALIST= <valist>
##$VCLIST= <CCCCCCCCCCCCCCC>
##$VD= 0
##$VDLIST= <DDDDDDDDDDDDDDD>
##$VPLIST= <PPPPPPPPPPPPPPP>
##$VTLIST= <TTTTTTTTTTTTTTT>
##$WBST= 1024
##$WBSW= 4
##$XGAIN= (0..3)
0 0 0 0 
##$XL= 0
##$YL= 0
##$YMAX_a= 179996
##$YMIN_a= -190230
##$ZGOPTNS= <>
##$ZL1= 120
##$ZL2= 120
##$ZL3= 120
##$ZL4= 120
##$ABSF1= 16.522
##$ABSF2= -4.171173
##$ABSG= 5
##$ABSL= 3
##$ALPHA= 0
##$AQORDER= 0
##$ASSFAC= 0
##$ASSFACI= 0
##$ASSFACX= 0
##$ASSWID= 0
##$AUNMP= <proc_1d>
##$AZFE= 0.1
##$AZFW= 0.1
##$BCFW= 0
##$BC_mod= 0
##$BYTORDP= 0
##$COROFFS= 0
##$CY= 12.5
##$DATMOD= 1
##$DC= 0
##$DFILT= <>
##$DTYPP= 0
##$F1P= 14.0000005364418
##$F2P= -0.99999901652339
##$FCOR= 0.5
##$FTSIZE= 32768
##$FT_mod= 6
##$GAMMA= 0
##$GB= 0
##$INTBC= 1
##$INTSCL= 1
##$ISEN= 128
##$LB= 0.3
##$LEV0= 0
##$LPBIN= 0
##$MAXI= 10000
##$MC2= 0
##$MEAN= 0
##$ME_mod= 0
##$MI= 0
##$NCOEF= 0
##$NC_proc= -5
##$NLEV= 6
##$NOISF1= 0
##$NOISF2= 0
##$NSP= 0
##$NTH_PI= 0
##$NZP= 0
##$OFFSET= 16.522
##$PC= 1
##$PHC0= -61.50911
##$PHC1= 7.820341
##$PH_mod= 1
##$PKNL= yes
##$PPARMOD= 0
##$PSCAL= 4
##$PSIGN= 0
##$REVERSE= no
##$SF= 250.13
##$SI= 32768
##$SIGF1= 0
##$SIGF2= 0
##$SINO= 400
##$SIOLD= 32768
##$SREGLST= <1H.CDCl3>
##$SSB= 0
##$STSI= 32768
##$STSR= 0
##$SW_p= 5175.98343685301
##$SYMM= 0
##$S_DEV= 0
##$TDeff= 65536
##$TDoff= 0
##$TI= <Analysis number 999999
Compound Code 99
Book Reference 9
Project Code 9>
##$TILT= no
##$TM1= 0
##$TM2= 0
##$TOPLEV= 0
##$USERP1= <user>
##$USERP2= <user>
##$USERP3= <user>
##$USERP4= <user>
##$USERP5= <user>
##$WDW= 1
##$XDIM= 32768
##$YMAX_p= 344321448
##$YMIN_p= -1455696
$$ End of Bruker specific parameters
$$ ---------------------------------
##NTUPLES= NMR SPECTRUM
##VAR_NAME=  FREQUENCY,     SPECTRUM/REAL,   SPECTRUM/IMAG
##SYMBOL=    X,             R,               I
##VAR_TYPE=  INDEPENDENT,   DEPENDENT,       DEPENDENT
##VAR_FORM=  AFFN,          ASDF,            ASDF
##VAR_DIM=   32768,         32768,           32768
##UNITS=     HZ,            ARBITRARY UNITS, ARBITRARY UNITS
##FACTOR=    0.157963299565203, 1,           1
##FIRST=     4132.6476996994, 0,             0
##LAST=      -1043.33573715361, 0,           0
##MIN=       -1043.33573715361, -1455696,    0
##MAX=       4132.6476996994, 344321448,     0
$$ Real data points
##PAGE= N=1
##DATA TABLE= (X++(R..R)), XYDATA
$$ [...]
23096H8467p9829M4052L10052R8174r5929j35445J89108k22448m00392k62287
23086d66477j91769K14881r643P241J18751M35707K03432l42325l14937K55748
23076h9391L75466K56875q7778o41515j81370j80064p5806j80501L21355J08336
23066c74393m2090M91527q2193o0022j7595k02464l58529k68858l4429L57420
23056e91626M81797R6288J44117M70620R6441Q4501j26455m49388l68757j92686
23046c55148j95613J07731J95733l6732j37532j2778J91441P2862j86532j87259
23036e43827J98584j16666J16173J19006k17378J91824K22667J19044l9443M9972
23026I9956j82675K16611j96316j03115L76226N98023l7092l34411j65151l48207
$$ plain form
23096 88467 8638 52690 362742 460916 364987 229542 418650 196202 -204190 -466477
23086 -466477 -658246 -443365 -453008 -445767 -327016 108691 312123 -30202 -345139 -89391
23076 -89391 286075 542950 455172 -186343 -367713 -547777 -623583 -804084 -482729 -374393
23066 -374393 -416483 75044 -7149 -67171 -84766 -287230 -645759 -914617 -949046 -591626
23056 -591626 -109829 -13541 130576 601196 697637 782138 655683 206295 -162462 -355148
23046 -355148 -550761 -443030 -247297 -284029 -421561 -434339 -242898 -170036 -356568 -543827
23036 -543827 -345243 -461909 -345736 -226730 -444108 -252284 -29617 89427 49984 99956
23026 99956 -82719 133892 -62424 -165539 210687 808710 771618 437207 272056 -76151
23016g6151J75302m53805K4496P2240j52942j04381l1157K19841J99120P8221
23006d9216O9874J17921K3109P9852p5747J5499L12807M2884l10160p05127Q2160
22995c96144K22519j8460k14560J1569r2671j43156K63875k33018K77705L82842
22985F0501j10350k62194K76012L02393N5728o6613k62658j73812K57690P6029
22975A52726q7384J33417O3741l31758n5507L69363J68882j13502O6452l30200
22965C6230K4026j26857K1613J57481L8121L3870R223L46912n4062K99375M2115
22954H28047j39649l73046j74054K7493O9550k4688p9050O0335r5787N3450k78411
22943a25810j82961L92427o8508r0032j10480j33972J03641K90578P5431L01688
$$ plain form
23016 -76151 99151 -354654 -330158 -257918 -410860 -515241 -546398 -326557 -127437 -49216
23006 -49216 20658 138579 161688 241540 165793 181292 494099 536983 226823 -478304 -396144
22995 -396144 -173625 -192085 -406645 -395076 -487747 -630903 -367028 -600046 -322341 60501
22985 60501 -49849 -312043 -36031 266362 322090 255477 -7181 -180993 76697 152726
22975 152726 65342 198759 262500 -69258 -124765 244598 413480 299978 366430 36230
22965 36230 60256 -66601 -44988 112493 150614 184484 193707 540619 486557 785932 828047
22954 828047 688398 315352 141298 168791 238341 213653 134603 194938 99151 152601 -125810
22943 -125810 -308771 83656 15148 -74884 -185364 -319336 -215695 74883 150314 452002
22933D52002K62927o8491l10202j11998k13555l43376r781q2621J75598M65154
22923B15657k0527k03722k63414J54207K65965P1757o9393Q9847q5572L81059
22913E35864N8116k29121j17236j7817K5762k38231j11262N2021O9076K84277
22903C11449p1072l01313m79191K89630P1383j48782k3657r6623K53805L97938
22893B03567q7739l77456k14878o4073K18178L1586j13449J70140K00497N4010
22883B0383n2071J42036L88548R6075R7539j56132j11369j29995n89763J01034
22873a93715L67586L94479l16915m08179J14201J2372j43685J99050L96203J21452
22863E42849k01758r6336k88007k97673J33430O63234M16773j85565l24968k45808
$$ plain form
22933 452002 714929 646438 336236 224238 10683 -332693 -342474 -425095 -249497 215657
22923 215657 195130 -8592 -272006 -117799 148166 219923 150530 240377 154805 535864
22913 535864 593980 364859 247623 229806 255568 17337 -93925 -41904 27172 311449
22903 311449 240377 -60936 -540127 -250497 -179114 -327896 -351553 -448176 -194371 203567
22893 203567 115828 -261628 -476506 -540579 -322401 -290815 -404264 -234124 -33627 20383
22883 20383 -31688 110348 498896 594971 692510 536378 425009 295014 -294749 -193715
22873 -193715 173871 568350 251435 -156744 -42543 -30171 -173856 25194 421397 542849
22863 542849 341091 244755 -43252 -340925 -207495 455739 872512 686947 361979 116171
22853A16171l44937K22978n8905o4690K88273J47961j61992k48103j06827m8417
22843b58488O8336M3528j76629K01337j57298K76322L09052J40665k05543o13373
22833c72091l06674J95865R8439p5390P8835l4812o1843J81981O9287O0321J77334
22822A1252J35094J15439r0058k82109k21596J55260M38073J37214K11765p2366
22812E37968N1447m08481j25059J43143J90272j31735q6013j24330K05105k4927
22802B27390N0411K0871l06122o4494O4882L9156L27830l51700l02856j68640
22792d63272m9245N02986L81988n7219N379o2609k59696j71462N3273O0710M6121
22781a3046J29984k01640l99067J13390J86488o1173L04084k4634j40910k04501
$$ plain form
22853 116171 -228766 -5788 -64693 -129383 158890 306851 144859 -103244 -210071 -258488
22843 -258488 -190152 -146624 -323253 -121916 -279214 -2892 306160 446825 241282 -372091
22833 -372091 -678765 -482900 -384461 -459851 -381016 -415828 -477671 -295690 -226403 -166082 11252
22822 11252 146346 261785 171727 -110382 -331978 -176718 261355 398569 610334 537968
22812 537968 589415 180934 55875 199018 389290 257555 171542 47212 252317 227390
22802 227390 277801 298672 -7450 -71944 -7062 32094 359924 8224 -294632 -463272
22792 -463272 -512517 -9531 372457 315238 320617 258008 -1688 -173150 -119877 -59167 -13046
22781 -13046 116938 -84702 -483769 -370379 -183891 -245064 59020 34386 -106524 -311025
22771c11025J53990K09709L9917Q3823K545O7521l31743n5385K23564J5206L61271
22760D59393j76416J02748K39292j93559k86337K65788K51644L2926p4983k77982
22750C42514j00777J01611n4381m23401j04749M68283J94547k46066k89786k38710
22740c50915o9034K03465J00047l42339J78134J74519Q5214k54547k5024J33460
22730a67020k82000n0445L16865J22908J38554j30748l83278k45546M03428K95920
22720A8638J01546k28281J66503j18048j57868Q327K50887k68777Q530L06232
22710H7689l50985l57662M20614K08227M12924p0309k26175J45703K90888l74317
22700A86597L62929j20235j84507k47268l78721l23732J46388K56931J58712K37825
$$ plain form
22771 -311025 -157035 52674 92591 176414 178959 246480 -85263 -140648 82916 98122 459393
22760 459393 282977 385725 625017 431458 145121 410909 662553 695479 620496 342514
22750 342514 241737 343348 288967 -134434 -239183 229100 423647 177581 -112205 -350915
22740 -350915 -419949 -216484 -116437 -458776 -280642 -106123 -20909 -275456 -300480 -167020
22730 -167020 -449020 -499465 -182600 -59692 78862 -51886 -435164 -680710 -277282 18638
22720 18638 120184 -108097 58406 -59642 -217510 -209183 41704 -227073 -218543 87689
22710 87689 -263296 -620958 -200344 7883 420807 350498 124323 270026 560914 186597
22700 186597 549526 429291 244784 -2484 -381205 -704937 -558549 -301618 -142906 94919
22690I4919j80701J19094N4600L85249N3332m86303p56676j97611K05241P2641
22680f36215J19545K97551N3844l6578J90143N28385k2609l73196K45828K02882
22670E69580k95791o4989K8320K56548q7872k05406n4019l25091j17627L65886
22660F9539M5180j7184j57836J8170j9205K0918P7942K21170l24421l89291J06648
22649c48370n0536k89532L27246N31704J66992j20008l54194l63302K36442K36340
22639b7218L23682j61376J94123J41359k88283m887o9411q2662K3795o02593l25628
22628h79099L91072M41865L94334M4915Q7713J01351j4083m75025N0257O1157
22618B04457Q0763K96191J92047k48336l99195k15805j01341R8771P070N8853
$$ plain form
22690 94919 -85782 33312 87912 473161 526493 40190 -716486 -914097 -708856 -636215
22680 -636215 -516670 -219119 -165275 -201853 -11710 516675 494066 120870 366698 569580
22670 569580 273789 208800 237120 493668 405796 200390 146371 -178720 -296347 69539
22660 69539 114719 97535 -60301 -42131 -61336 -40418 37524 258694 -65727 -455018 -348370
22649 -348370 -398906 -688438 -361192 170512 337504 217496 -136698 -500000 -263558 -27218
22639 -27218 296464 135088 329211 470570 182287 177400 107989 25327 49122 -553471 -879099
22628 -879099 -488027 -46162 348172 393087 480800 582151 568068 93043 143300 204457
22618 204457 285220 581411 773458 525122 125927 -89878 -191219 -92448 -85378 -26525
22608b6525J79365K63929l41476m29044J33166k84026K79465J95493k14209j99109
22598d42971Q2143J39419J74967j23898J95711M46806K74076r3607o0968K9193
22588F20871j10983l5860l66575K04797J0827l40061m7717O4111n9071O46m0314
22577i9329J51190K8592j93763j38306L19833J74706N1187j31278J59396J55189
22567D77417J5927j91451j34874J33248k58031k83417q252K26689j29688j48941
22557c01373k1661O138L10057J33535k41279k69317j55245N2770R6117J09594
22547b80664o4895J38380K60882j77654O7690J28757J24361j17132o4436K12557
22537B27846J67765J61311j96360k40332J38230n8334j15047n4346N59786L39790
$$ plain form
22608 -26525 152840 416769 75293 -353751 -220585 -504611 -225146 -29653 -243862 -442971
22598 -442971 -360828 -221409 -46442 -170340 25371 472177 746253 652646 591678 620871
22588 620871 509888 474028 107453 312250 323077 -16984 -64701 -590 -59661 -59015 -99329
22577 -99329 51861 80453 -113310 -251616 68217 242923 294110 162832 322228 477417
22567 477417 493344 301893 167019 300267 42236 -241181 -249433 -22744 -152432 -301373
22557 -301373 -323034 -316896 -6839 126696 -114583 -383900 -539145 -486375 -390258 -280664
22547 -280664 -345559 -207179 53703 -123951 -56261 72496 196857 79725 15289 227846
22537 227846 395611 556922 360562 120230 258460 200126 85079 30733 590519 930309
22527I30309n9291n19938k58787k86832J9529J12371r9653L73268K50090k61760
22517A99306n6001J49833M0324j16146K2005j56115J53751j34738L9495j12629
22507B9085j60513N5451j80304k84604l30120r438K54233K49579J40225j1060
22497b47466m27056K64147K6532M3682K71331K27545l08371j09788j43616l03743
22487g06803j02403K76483K20584l2290K04984J58221N6463K7620K4305m18301
22477b91137j12617M19687K26936J91241j81107k67141J80734J15135K27271J32930
22467F41932k5649k23720m35902J81776J89362l17750R2935N8664j24112l17548
22457b80012j98443J49065J9810k34955J19274J18862j7312K27819K3687m05723
$$ plain form
22527 930309 871018 351080 92293 -194539 -175010 -62639 -162292 210976 461066 199306
22517 199306 143305 293138 333462 217316 239321 83206 236957 102219 141714 29085
22507 29085 -131428 -75977 -256281 -540885 -871005 -880443 -626210 -376631 -236406 -247466
22497 -247466 -674522 -410375 -383843 -340161 -68830 158715 -149656 -259444 -403060 -706803
22487 -706803 -809206 -532723 -312139 -344429 -139445 18776 75239 102859 127164 -291137
22477 -291137 -403754 15933 242869 434110 253003 -14138 166596 281731 509002 641932
22467 641932 616283 392563 -43339 138437 327799 10049 102984 161648 37536 -280012
22457 -280012 -478455 -329390 -309580 -544535 -425261 -306399 -323711 -95892 -72205 -477928
22447d77928j57369L59128J75079k56074j33831J35355N17088K08735J36928q5514
22437D21597M9218j10576l92355l99354r1348J97767J26787k6424K12276P7839
22427F5427j33457L04753M6588j72112p5922k1037j99001k9378p2098P0987J96871
22416a8379j17557k4454R4727L19622J03743l09906k61079j56950K36539K9348
22406a04346j96028J44502j07287l6933j67309J56424K14627p704Q3443j16604
22396a37215L0672L9933k00629K62699L08569n407k16310j52455q722M2364J85957
22385A49456k79635k48603L40236J93707j22111j99905p6023N1111j51602J27290
22375b16079J62268J19414J17731K86847k1262j94657k037k57271n11991J95255
$$ plain form
22447 -477928 -635297 -276169 -101090 -357164 -490995 -355640 161448 370183 507111 421597
22437 421597 470815 360239 -32116 -431470 -522818 -325051 -198264 -224688 -12412 65427
22427 65427 -68030 236723 283311 111199 35277 14240 -184761 -214139 -286237 -215250 -18379
22416 -18379 -135936 -160390 -65663 253959 357702 47796 -213283 -370233 -133694 -104346
22406 -104346 -300374 -155872 -263159 -300092 -467401 -310977 -96350 -104054 -20611 -137215
22396 -137215 -106543 -66610 -267239 -4540 304029 298622 82312 -70143 -78865 -36501 149456
22385 149456 -130179 -378782 -38546 155161 33050 -166855 -242878 -191767 -343369 -216079
22375 -216079 -53811 65603 183334 470181 448919 254262 252225 -5046 -517037 -321782
22365c21782M8098q4192M73132J81491Q5521j56202j00730K16718j68501K36721
22355D10274J30704L1682k93184K72057p2753m46520l27399J58402M49045j7378
22345B94930n78891J92473J57730j78500J26971M7367O9006q1321l34851M53747
22335A68661J16121k09634K25819j05552J17431k88467P3740M12059m91737j60984
22325a42543P8148J89482p0930J05107N36086K16283J7012l4453k93446l85484
22315B15262j93473j78443J20100K67289L25533R0126j76693m68717j91871L6497
22305a54390K89920K13593k6206L1318j01961j1901j50165l33950o22922K66764
22295e99900L61881L58889k44986M6430O6957j93597k47889J82277L0513J29992
$$ plain form
22365 -321782 -273684 -357876 115256 296747 382268 226066 125336 342054 173553 410274
22355 410274 540978 572660 279476 551533 478780 32260 -295139 -136737 312308 294930
22345 294930 -283961 -91488 66242 -112258 14713 62080 131086 49765 -285086 168661
22335 168661 284782 75148 300967 195415 312846 24379 98119 510178 18441 -142543
22325 -142543 -64395 125087 54157 159264 695350 911633 928645 894192 600746 215262
22315 215262 21789 -156654 -36554 230735 556268 646394 469701 984 -190887 -154390
22305 -154390 135530 349123 322917 354235 252274 240373 90208 -243742 -866664 -599900
22295 -599900 -238019 120870 -124116 -77686 -10729 -204326 -452215 -269938 -239425 -109433
22285a09433J49539J70942m04273j20518l50353L91899L80589k39753q5396q2791
22275b99548l8678J04800K71590J40207K82196k37158K01666J28167j46784k71951
22265A34507l78265l09281M27760M02129K6444r6145j27279j75444L69943L41718
22255F16087r2267l15263k03403q9379J85853J78301J61142l749k10664m13404
22245a86746J10327J39560p3838K56069k23548l39813K29509n1518k38257K24889
22235a53366j9025P233M7875k63636M3071k96762J33133J97729J14357o2555j30931
22224c82877J50039P2737J88101M8484j58668j67898k14631k77825n2945l0598
22214h26081j39693M92476L12696J50598o8824l3085J9812j9439Q29l9262K28534
$$ plain form
22285 -109433 40106 211048 -193225 -313743 -664096 -272197 108392 -131361 -216757 -299548
22275 -299548 -338226 -233426 38164 178371 460567 223409 425075 553242 406458 134507
22265 134507 -243758 -553039 -125279 276850 303294 207149 79870 -95574 274369 616087
22255 616087 523820 208557 5154 -84225 101628 279929 441071 437322 226658 -186746
22245 -186746 -76419 63141 -10697 245372 21824 -317989 -88480 -139998 -378255 -153366
22235 -153366 -172391 -165158 -117283 -380919 -337848 -634610 -501477 -303748 -189391 -251946 -382877
22224 -382877 -232838 -160101 28000 76484 -82184 -250082 -464713 -742538 -795483 -826081
22214 -826081 -965774 -473298 -160602 -10004 -78828 -111913 -92101 -111540 -110711 -149973 78561
22203G8561J06644J17389J16302p8717K89485J42720m30191l65556k7366K30257
22193A79528J47739M40634j68309k02932J16063r0917k63006L6143j56334j24249
22183h5640P2300J71314L62848j99753k02705k55963k79572m84805R9703J63006
22173f39267J04081J01593j00840J00761M69673o3691j18438J68403P2026R2880
22163A87181J104r9866k48118l0994j15020J21573J10898J73969K2477l7809K49925
22152C35320j11667L23697J27792k01301k43497q2794l43475l10876P1589K96021
22142a39191j22897j16873K12908l9855k78584j49792J41665Q3903l2001J19627
22132c21090Q551O2678L05880J19001k46101P571r866R0519J53396j59915K18
$$ plain form
22203 78561 185205 302594 418896 340179 629664 772384 342193 -23363 -50729 179528
22193 179528 327267 767901 599592 396660 512723 421806 158800 194943 38609 -85640
22183 -85640 -13340 157974 520822 321069 118364 -137599 -417171 -901976 -802273 -639267
22173 -639267 -535186 -433593 -534433 -433672 36001 -27690 -146128 22275 94301 187181
22163 187181 188285 88419 -159699 -190693 -305713 -184140 -73242 100727 123204 85395 335320
22152 335320 223653 547350 675142 473841 230344 147550 -195925 -506801 -435212 -139191
22142 -139191 -262088 -378961 -166053 -205908 -484492 -634284 -492619 -408716 -440717 -321090
22132 -321090 -312539 -249861 56019 175020 -71081 -63510 -73376 17143 170539 10624 10842
22121A0842J41267k9812k13613j65630M9874J44222m0047k79300n9572N0594j22417
22110e13592L60162k7610q4307J45153P0655j10279n3887J17811j43694j83713
22100d23301J50799J06932j21262N0664N5514j10560j1255M74772R7758k34585
22090C5476j02340j36414j57524k4687J07676j91167J99063N9090o0151J41144
22080a29834K40057R6514K30575K05336J7746j80909j66801k60982k17603j46446
22070c12347M1798j28027K96798K72719K07437K77751l54739K0493R7970K8441
22060D48294r8503j24129j77085r1507R1812k46139K8176K46940J30860L60902
22050E69621n71109o28595k4503N06810l5375q7035m8266R8895M57241M32218
$$ plain form
22121 10842 152109 122297 -91316 -256946 -207072 -62850 -102897 -382197 -441769 -391175 -513592
22110 -513592 -153430 -181040 -265347 -120194 -49539 -159818 -213705 -95894 -239588 -423301
22100 -423301 -272502 -165570 -286832 -236168 -180654 -291214 -302469 172303 270061 35476
22090 35476 -66864 -203278 -360802 -385489 -277813 -468980 -269917 -210827 -270978 -129834
22080 -129834 110223 206737 437312 642648 660394 479485 312684 51702 -165901 -312347
22070 -312347 -270549 -398576 -101778 170941 378378 656129 301390 321883 419853 448294
22060 448294 349791 225662 48577 -42930 48882 -197257 -169081 77859 208719 569621
22050 569621 -1488 -630083 -654586 -147776 -183151 -270186 -318452 -219557 237684 669902
22040F69902m1934l19253l17346k79543J05111J23730L69220j91513m17551l80597
22030f79774J8694J45030L73953K82365K12764j94575l89011J56295K816n1560
22020a23003M3631L8063J65291M13632L05252o0437J29214n33492l16515m9990
22010A1646k36396R0293K81567k56285K27810k09957r2250j84989j99485K72502
22000b95544j8129L93883M51606k73450m54296q6627K9252J42632k8776N5942
21990h3507l91671R3362M01976q5732m2825k65039P5776O6262k66610O095L06000
21979a85913O5252K87294M9877J21858j82262L9414l95027j75858J93206K45128
21969F2969o3986J0763J69465J9360m36588J72403M65067q2886k39565m65262
$$ plain form
22040 669902 627968 308715 -8631 -288174 -183063 -59333 309887 118374 -299177 -679774
22030 -679774 -661080 -516050 -142097 140268 353032 158457 -230554 -74259 -71443 -123003
22020 -123003 -79372 -41309 123982 537614 842866 782429 911643 378151 61636 11646
22010 11646 -224750 -134457 147110 -109175 118635 -91322 -183572 -368561 -568046 -295544
22000 -295544 -313673 80210 531816 258366 -195930 -282557 -253305 -110673 -139449 -83507
21990 -83507 -475178 -381816 20160 -65572 -108397 -373436 -297660 -231398 -498008 -491913 -185913
21979 -185913 -120661 166633 216510 338368 156106 195520 -199507 -375365 -182159 62969
21969 62969 -1017 9746 179211 198571 -238017 -65614 399453 316567 77002 -388260
21959c88260k69481L05506K27944L16515J96961j91295R4477K2511p0835n8804
21949A85239k55028m0510L77828J38672q5713l38303l88672l0846J79624J4111
21939b43598L20632q6566k62458L99132J08441k68626l7839K42716J73907n2114
21929B93627l33886L76731K45332J4304n42948l00449o0245M19266L5087l16275
21919a69456Q8838P8153n27794k64540J65626L11193N3761J33041K6003O9991
21909c5184K5689J73447l08617o5643n3239K86664P3253J79371m0860j70098k786
21898F1997P9826j61607k03838J17912Q2082O7538L81783K64486j00851n17436
21888G1892k97756j873l4289K34742N1188K1657R6458m4537j60497p243J56340
$$ plain form
21959 -388260 -657741 -352235 -124291 192224 389185 197890 292367 314878 244043 185239
21949 185239 -69789 -110299 267529 406201 320488 -17815 -406487 -437333 -257709 -243598
21939 -243598 77034 -9532 -271990 127142 235583 -33043 -70882 171834 345741 293627
21929 293627 -40259 336472 581804 596108 53160 -247289 -307534 111732 146819 -169456
21919 -169456 -80618 -2465 -530259 -794799 -629173 -317980 -264219 -131178 -105175 -35184
21909 -35184 -9495 163952 -144665 -210308 -263547 23117 96370 275741 234881 64783 61997
21898 61997 141823 -19784 -223622 -105710 -23628 43910 425693 690179 589328 71892
21888 71892 -225864 -227737 -262026 -27284 23904 45561 142019 97482 -63015 -70258 86082
21877H6082J23055n5036N6584l75673j29656K76781L97007j48490l3482J20785
21867C17957m2666j89661J3798K41254j00524l20266J41599N5962m82759j5968
21857c81274O4905j74790K92287J40783J14687J85803o0002j76302Q4151J58719
21847B48967L4693L7409m5221j62060P2257J6376l38026k39637k98737O5506J32307
21836d76166J81994n255K43728q4301J85770K40701k25417l16400R7027Q9680
21826f8639k808l5472m27596j61771K57446K94250J02195j87448k71177l6663
21816e37683n1378k23544P54236K51448j558K42482K8909k20419l98989m07957
21806e64453p9865Q153K03155j42453K7738K58916J13464K63848J97321m9971
$$ plain form
21877 86082 209137 154101 210685 -164988 -294644 -17863 379144 230654 197172 317957
21867 317957 275291 85630 99428 340682 240158 -80108 61491 117453 -365306 -381274
21857 -381274 -316369 -491159 -198872 -58089 56598 242401 182399 6097 90248 248967
21847 248967 283660 321069 275848 113788 186045 202421 -135605 -375242 -673979 -608473 -476166
21836 -476166 -294172 -299427 -55699 -140000 45770 286471 61054 -255346 -158319 -68639
21826 -68639 -71447 -106919 -534515 -696286 -438840 -144590 -42395 -229843 -501020 -537683
21816 -537683 -589061 -812605 -58369 193079 191521 434003 462912 242493 -156496 -564453
21806 -564453 -644318 -636165 -433010 -575463 -547725 -288809 -175345 88503 285824 235853
21796B35853J93656j87730k98787k74568N377K45349K08983J5235m7587L0946
21786A26727K2820j40531L43754M8731k90507k8783J61642j22906j22220j17788
21776a19061M24263Q1317l47903k28679J67390N06953K70527m27846j51751R4948
21766B70158k3205k26914R8355j53186l32943K67365J62717O6713k58676j2525
21756a42141k2262K94957l6651P7739k56511n69248O0302L27853L76965J16240
21746B27243j19759o9756N3766K10074k7931k47180n9900K55511O07937L05962
21736A135967n16619m45131J91328j4177r9000J27845K7040j77909k04753q5896
21726f1305n7128N1234k22451j86001L05017N24284j07508l19571L09064k943
$$ plain form
21796 235853 429509 241779 -57008 -331576 -326199 -80850 128133 143368 95781 126727
21786 126727 149547 9016 352770 401501 110994 82211 243853 120947 -1273 -119061
21776 -119061 305202 386519 38616 -190063 -22673 484280 754807 326961 175210 270158
21766 270158 246953 20039 118394 -34792 -367735 -100370 62347 129060 -129616 -142141
21756 -142141 -164403 130554 93903 171642 -84869 -654117 -593815 -265962 111003 227243
21746 227243 107484 37728 91494 301568 273637 26457 -33443 222068 830005 1135967
21736 1135967 619348 174217 365545 351368 252368 380213 407253 229344 24591 -61305
21726 -61305 -118433 -67199 -289650 -475651 -170634 353650 246142 -73429 235635 232692
21716B32692K2285J46777m4932J25676M2706l7503m45897k83862L61674K74166
21706C93782N6349J2756N2324k07833l42933l33812J62635L17878L2801L9522
21696A83469l73353j44721K59103n6145j05851J24556r0488M412N061j70361n4600
21685d18918K76491P8244L3300j85017p4914j78390j33581J46771K27546N424
21675b23044J89309J95518K66152j06752l79152l18531k22891L3165K13237M13097
21665F0108J14794J75445m47174k68536K79948o7503J02799Q1610M07205J22334
21655E61030k25399j51239J48160K08649j39968j94728J52927R1700j48154r4898
21645B08080j89267j14431k47875K74299L83520j33763m12675J44154N74827j92095
$$ plain form
21716 232692 254977 401754 356822 482498 525204 487701 41804 -242058 119616 393782
21706 393782 450131 462887 515211 307378 -35555 -369367 -206732 111146 143947 183469
21696 183469 -189884 -334605 -75502 -131647 -237498 -112942 -203430 -199018 -193957 -364318 -418918
21685 -418918 -142427 -64183 -30883 -215900 -290814 -469204 -602785 -456014 -228468 -223044
21675 -223044 -33735 161783 427935 321183 -57969 -376500 -599391 -566226 -352989 60108
21665 60108 174902 350347 -96827 -365363 -85415 -152918 -50119 31491 438696 561030
21655 561030 335631 184392 332552 541201 401233 206505 359432 451132 302978 208080
21645 208080 18813 -95618 -343493 -69194 314326 180563 -232112 -87958 486869 294774
21635B94774l92026P8012J16975j29384M950k8543J57457J23434J91535O5569
21625D82753q5940k45844N0193l23129r2344K04166P0015N68980j93124m11476
21615B4250j10669O7922j59682p7773k0340j79566L06793J81909j85547k44122
21605c96825L22318J93487M7520k25007k09571J72053J83585k12283k13610l16793
21595f55126k65851K51480K57849L31569K53047j5258n8270J22367j02631k03376
21585h4200J29283Q9405k69072k03961L71971o2476n6413r5760l36569j32057
21575f49849J93889J97490P24071M37480l42865k94347K45K1209J36469N7896
21565D81688K12318q4894m33263k82077J02870P4414p1514l09894p5561L3788
$$ plain form
21635 294774 -97252 -19240 97735 -31649 -26699 -55242 102215 225649 417184 482753
21625 482753 396813 150969 201162 -121967 -214311 -10145 59870 628850 435726 24250
21615 24250 -86419 -18497 -178179 -255952 -276292 -455858 -149065 32844 -152703 -396825
21605 -396825 -74507 118980 166500 -58507 -268078 -96025 87560 -124723 -338333 -655126
21595 -655126 -920977 -669497 -411648 -80079 172968 157710 99440 221807 119176 -84200
21585 -84200 45083 134488 -134584 -338545 33426 -29050 -85463 -181223 -517792 -649849
21575 -649849 -455960 -258470 465601 903081 560216 265869 266114 287323 423792 481688
21565 481688 694006 609112 175849 -106228 -3358 71056 -458 -310352 -385913 -352125
21555c52125J53489L17393P3618N7990l27510n1202O8229J27579k87884n2511
21545b72934j7781K96146R626J39801M26649K74140k32582q1553l8970r457R2504
21534E85589l1431k28584q7476j30146j82136J06216k50295j17534L18611P9448
21524F2262k95603J51187L24426k46154j39460K40085K96352K33260J60300r1949
21514F94706k04046k38820N065j3908n46165m14426J45303J04466R9614J19666
21504b48545K83229j91548p6994J21364Q2795Q939r9162j32178P5447K41332L09390
21493C74069k51327j96308P6367L12845Q3377j49563k57917M5941l5972K7653
21483B9165o9616Q8491Q7529J420R4270j8401n6552l39471m25350p56L5558J30081
$$ plain form
21555 -352125 -198636 118757 192375 250365 -77145 -128347 -60118 67461 -220423 -272934
21545 -272934 -290715 5431 15057 154858 581507 855647 623065 541512 502542 493085 585589
21534 585589 554158 325574 238098 107952 -74184 32032 -218263 -335797 -17186 62262
21524 62262 -233341 -82154 242272 -3882 -143342 96743 393095 626355 786655 694706
21514 694706 490660 251840 256905 242997 -303168 -717594 -572291 -467825 -368211 -248545
21504 -248545 34684 -156864 -233858 -112494 -29699 -20760 -119922 -252100 -176653 64679 374069
21493 374069 122742 -73566 2801 315646 399023 249460 -8457 37484 1512 29165
21483 29165 -40451 48040 135569 136989 231259 212858 156306 -183165 -608515 -609271 -573713 -443632
21471d43632j11149J55348J20135J36191K0856n39979p4227N59736J94749K25731
21461B43759j78657J02890m2929K7433k2162j31256r3449J30985J4874j9316J00432
21450A32604j4323J07586R4971m96542k70441J21831K75743L43637j82327o7240
21440D5499J4557m076k41848L3203K9042K44075j17833K17923K9262L77304N0743
21429F77851k98283k02799m16415L8984K11449k24161k03006j3434K24296K64904
21419E9386L50738n833n03206k09951J90756K7890k93252l965M42704K72552k20797
21408A07022l24347j327J21988J67851r8863j66444j73529k2976J90039K20806
21398B0220K46318n7631k24663N2339K62491M1454l595l14825m11649k5334K86323
$$ plain form
21471 -443632 -554781 -399433 -279298 -143107 -122251 -662230 -736457 -176721 18028 243759
21461 243759 65102 167992 125063 152496 130334 -922 -94371 36614 51488 32172 132604
21450 132604 118281 225867 320838 -175704 -446145 -324314 -48571 295066 112739 45499
21440 45499 60056 55980 -185868 -152665 -123623 120452 2619 220542 249804 627108 677851
21429 677851 379568 176769 -239646 -200662 10787 -213374 -416380 -429814 -205518 59386
21419 59386 410124 404291 -98915 -308866 -118110 -90220 -383472 -387437 55267 327819 107022
21408 107022 -217325 -218652 -96664 71187 -27676 -194120 -367649 -390625 -200586 20220
21398 20220 266538 208907 -15756 36583 299074 340528 336933 22108 -389541 -414875 -128552
21387a28552K34703P9122k46786P2149J07651j14270j97258L57038J19175p2875
21377B10097k83140r6774J45927K07291j64628m8963M23849k14028n163L09841
21367D84309J81133l34859l53224J09496k49415q318L30746l6756P7084J22734
21357C22930j82311J1245J12310m96962R255J70007J60734j35081l84612m55450
21347h67935J65063L94683K67405p5025L6878k55361j45017M3135j68863K8685
21337e76352M43109K51764K01468P399j71825L13117j90365j38433k9703O243
21327A16422j05790j28177m83169m16003O8043L43268L95188J78118q7722p8431
21317a98253N8294J94863p0026k42029L44652r3987k82863K24756p6218n8934
$$ plain form
21387 -128552 106151 185273 -61513 10636 118287 4017 -193241 163797 282972 210097
21377 210097 -73043 -169817 -23890 183401 18773 -30190 393659 179631 174468 484309
21367 484309 665442 330583 -22641 86855 -162560 -170878 159868 123112 200196 322930
21357 322930 140619 151864 264174 -232788 -223533 -53526 107208 -27873 -412485 -867935
21347 -867935 -702872 -308189 -40784 -115809 -78931 -334292 -479309 -436174 -605037 -576352
21337 -576352 -133243 118521 319989 327388 155563 468680 278315 139882 110179 116422
21327 116422 10632 -117545 -600714 -1016717 -948674 -605406 -210218 -32100 -119822 -198253
21317 -198253 -139959 54904 -15122 -257151 87501 -6486 -289349 -64593 -140811 -199745
21307a99745j44851K53700n6351J76804k00571l8900j69772K47063m5121m34271
21297f12015j92280J39816M36665N7911k91211o0972M32454K66917j7656k23619
21287f3990k51749m7204O131j73663J52087J03564L74965O340k05615Q7818J8358
21276G042k57637j50654J60697L42072K08820m60188l65642K8538k30729J92817
21266e24864K89342m46749m1893L88529J98085o1073J62021k65617J24651K02638
21256B5070j82524K57494O1413L0047j14979l03554j94588J66350l9481J28919
21246a65833J10595M1290J89877l00064j25536Q0345L90482M4028l11183j43997
21236a89996K2730K63340L95038l23658l27205O9256O6803J73016k51828k60000
$$ plain form
21307 -199745 -344596 -90896 -147247 29557 -171014 -209914 -379686 -132623 -177744 -612015
21297 -612015 -804295 -664479 -227814 -169903 -461114 -522086 -89632 177285 159629 -63990
21287 -63990 -315739 -362943 -356812 -530475 -378388 -274824 100141 106481 -99134 -11316 7042
21276 7042 -250595 -401249 -240552 101520 310340 -149848 -515490 -486952 -717681 -524864
21266 -524864 -235522 -682271 -724164 -335635 -137550 -198623 -36602 -302219 -177568 25070
21256 25070 -157454 100040 161453 191500 76521 -227033 -421621 -255271 -294752 -165833
21246 -165833 -55238 -13948 175929 -124135 -249671 -169326 221156 265184 -45999 -189996
21236 -189996 -167266 96074 491112 167454 -159751 -90495 -23692 149324 -102504 -362504
21226c62504O23447K36006k79571p1978J82778r7186p1371J23357J57602k91181
21216A49399J56403K9058k60278m95023k27558K78851K31601J68838J75474R0207
21206B96972k55742k31436k60684n682r0189K13061N27330K94014q3689l80820
21196B3135j01270l99978m74600J19498K54616O58491M1070m69841M9464L47957
21186D8542r4072J87438Q1884j02708m90316J01038K78258K74508J91214Q1741
21176E57527j23210m7663j32674n56310n3088K98389K53738l7867k06927j51864
21166a99949K58034K27992l25150j41055J07440J09842l29071l42777M46671M71137
21156B83114R5631j92756O1560q5353K15416k30152k98382L13363O2800k67729
$$ plain form
21226 -362504 260943 496949 217378 145400 328178 230992 159621 282978 440580 149399
21216 149399 305802 334860 74582 -420441 -647999 -369148 -137547 31291 206765 296972
21206 296972 41230 -190206 -450890 -456572 -546761 -333700 193630 487644 403955 23135
21196 23135 -78135 -478113 -952713 -833215 -578599 79892 120962 -348879 -299415 48542
21186 48542 -45530 141908 223792 121084 -369232 -268194 10064 284572 475786 557527
21176 557527 434317 386654 253980 -302330 -355418 -57029 196709 158842 -48085 -199949
21166 -199949 58085 286077 -39073 -180128 -72688 37154 -291917 -634694 -188023 283114
21156 283114 378745 185989 247549 162196 377612 147460 -150922 162441 225241 -42488
21146d2488m89531l8573J38508K18808j48904K969J91772j0017m5383K19464K10866
21135B07491p2369P4488K83533r7746k49213j89472K85104J68704o5811M5591
21125C90300l06386J4731m5511J50779j27247j29111j77196O1643J74755K18057
21115B24814r6788l43069m71102k75196J98434L48668K2632k95843K96603n0283
21105d41130k26236M3020L52663J88299k24095k43928M5707J96697P793J01850
21095a99360L89815K27715k03351j33273k80505m002N17621P3999k91391k14555
21085a17287j64195K38696N296j03700J26576J21900O9946k80899j93882J04345
21075a93204k59001K07793M99304j37807k80215j5329l6588L18377K81721o8379
$$ plain form
21146 -42488 -532019 -570592 -432084 -213276 -362180 -359211 -167439 -177456 -222839 -3375 207491
21135 207491 135122 209610 493143 395397 146184 -43288 241816 410520 344709 390300
21125 390300 83914 98645 53134 203913 76666 -52445 -229641 -167998 6757 224814
21115 224814 128026 -215043 -686145 -961341 -762907 -414239 -391607 -687450 -390847 -441130
21105 -441130 -667366 -624346 -271683 -83384 -307479 -551407 -505700 -309003 -301210 -199360
21095 -199360 190455 418170 214819 81546 -198959 -202961 314660 388659 97268 -117287
21085 -117287 -281482 -42786 -37490 -141190 -14614 107286 177232 -103667 -297549 -193204
21075 -193204 -452205 -244412 254892 117085 -163130 -178459 -215047 103330 385051 316672
21065C16672l39368k62210K01423Q1985K2539j53881j34285j36057J3354j51853
21055e41681L1463K95136J6389K25396N4185j93162K22078J56053q1353K80775
21045D65279j7090j95558K1563o6448k94131k1320J43412K941j61492m6719j58979
21034c28542l68011j14393K99427J47479K48775Q5491j86858k75564n9823m7044
21024e99063K11215J01197L57761K88820k63142m15711Q3223N27067K0570j24166
21014A87771J04923R7183o02968l32749J30513L4034J55861K70400J11478o1391
21004I5055J50124m7435k43639K15914K48305k18559n6506J08343K19097o292
20994D64407q7731l07075p9007J28582J72165k14097k04794q5560m2050L98719
$$ plain form
21065 316672 -22696 -284906 -83483 -1498 21041 -132840 -267125 -403182 -389828 -541681
21055 -541681 -510218 -215082 -198693 26703 80888 -112274 109804 265857 184504 465279
21045 465279 448189 252631 274194 207746 -86385 -107705 35707 38648 -122844 -169563 -328542
21034 -328542 -696553 -810946 -511519 -364040 -115265 -29774 -216632 -492196 -552019 -599063
21024 -599063 -387848 -286651 71110 359930 96788 -318923 -235700 291367 311937 187771
21014 187771 292694 389877 -213091 -545840 -415327 -381293 -225432 44968 156446 95055
21004 95055 245179 197744 -45895 170019 418324 199765 143259 251602 470699 464407
20994 464407 376676 69601 -9406 119176 291341 77244 -127550 -213110 -255160 143559
20984A43559J1253k77577K72308K70564n49702k48240M76769K85741J51193j41789
20974C94079k006j25345o9666J01811L41803R9110k62238K02398j16954n3901
20964E09091k29703n72313j33076O5082k08769j88286J67541j84929k0517M95045
20954c00834K8453K8041O02879J8204l44259j15301J36794J68569j10605j08713
20944C228J18777J66496o4871j31509J21868K0324Q3296J13995M7407j30424j35826
20933B12761k77107j46381J93450K46305k78143j28144j3993o5829L63891j90551
20923h3741k15113j01694K00155k06524L36162L94397m9900k30189K7654M9676
20913A20883k13117l90712R3197L75917J02773j88682k521K76503k39996J78678
$$ plain form
20984 143559 154812 -122765 149543 420107 -129595 -377835 98934 384675 535868 394079
20974 394079 392073 266728 197062 298873 640676 739786 477548 679946 562992 509091
20964 509091 279388 -292925 -426001 -360919 -569688 -757974 -590433 -775362 -795879 -300834
20954 -300834 -272381 -244340 358539 376743 32484 -82817 53977 222546 111941 3228
20944 3228 122005 288501 223630 92121 213989 234313 317609 431604 479011 348587 212761
20933 212761 -64346 -210727 -17277 229028 -49115 -177259 -191252 -257081 106810 -83741
20923 -83741 -298854 -400548 -200393 -406917 -70755 323642 273742 43553 71207 120883
20913 120883 -92234 -482946 -389749 -13832 88941 -99741 -102262 174241 -65755 112923
20903A12923K47501O6621l78175k12246j29334j1671j50832J68343O07890j66124
20893A54896J47875q0718k5894n727m1064J06854K68197k05250l71378l06270
20883c58479L11491R4857J8639K66510j61343l97738J30318L96782Q0721q0868
20873C00890N7529J44031k43405j21770j33434J9948L7396o5228J7157P0921M3288
20862A27323J84638k08544r8417j01967Q8984K4377o49177j16924M9294K46529
20852d53884J41930L3142L76262L98827J67924l85778l74593j45017j97916J51039
20842b88064j33003o9996K46096J10370j2275k67717J33327Q3220J30807n1579
20832a18814k81038K70462K59780j61011O9449K04687j96117k13501L2427L31933
$$ plain form
20903 112923 360424 427045 48870 -163376 -292710 -304381 -455213 -286870 321020 154896
20893 154896 302771 222053 196159 190432 149368 256222 524419 319169 -52209 -358479
20883 -358479 -46988 47869 66508 333018 171675 -226063 -95745 301037 381758 300890
20873 300890 358419 502450 259045 137275 3841 23789 61185 -4043 13114 84035 127323
20862 127323 311961 103417 5000 -96967 -7983 16394 -632783 -749707 -700413 -453884
20852 -453884 -311954 -278812 97450 496277 664201 278423 -96170 -241187 -439103 -288064
20842 -288064 -421067 -491063 -244967 -134597 -146872 -414589 -281262 -198042 -67235 -118814
20832 -118814 -399852 -129390 130390 -30621 38828 243515 47398 -166103 -133676 198257
20822A98257q4597j89871j41756K62497L62259M4604j25548l73358k99353L3625
20812c13241k47839J1510M08238M34974n3817m52970l4617j9199M32825j69902
20802d038k10772K40298k34463J77084j46135j31146J34838J3778j19778l3469
20792c13803L62487J87591j35432N9534P6392J59452J79588K29484R0249l28740
20782E66802n01788m26304j36332J81922L05560Q8985R2204K41264j54854j58539
20772I8920k34084l84398k53248Q4708J75869J15657Q3734l12147k14090L9808
20762g99271J82361K78090j19097k6040P2366j13413k66501K44138L60398L22292
20752A35323N0412o8049l2824l2472m03603l2078M02322N47335j35347m86232
$$ plain form
20822 198257 113660 -76211 -217967 44530 406789 451393 325845 -47513 -346866 -313241
20812 -313241 -561080 -549570 -141332 293642 239825 -213145 -247762 -266961 165864 -4038
20802 -4038 -214810 25488 -208975 -31891 -178026 -309172 -174334 -160556 -280334 -313803
20792 -313803 48684 236275 100843 160377 236769 396221 575809 805293 895542 566802
20782 566802 65014 -361290 -497622 -315700 -10140 78845 171049 412313 257459 98920
20772 98920 -135164 -519562 -772810 -688102 -512233 -396576 -312842 -624989 -839079 -799271
20762 -799271 -616910 -338820 -457917 -483957 -411591 -525004 -791505 -547367 -186969 135323
20752 135323 185735 117686 84862 52390 -351213 -383291 19031 566366 431019 -55213
20742e5213j69026L35098L20018j76020l47976J53320L31592k5163m43274m3756
20732a20400J14674K69517K20080j63288l66562J0633J93644l6656r700l70744
20722b58802j34694r9180J89871K92769K9935q3633l0278O5418j578N2334M6830
20711F8992r1140J83486J70857m4466j8392J07880j83725k5323J58270k79446
20701D6993l17455K57264L90156j58525K13608j22177M7907J48000l18737m83395
20691b96361k63782J16782M90404Q1322j11512m92145k16621N25540M69792K1551
20681C24970j5590n19372J84997O6898j45051O5470L4572k33315K54959j78784
20671a60246j70749J64735K02158k5910j31001n7353j39299P6434R5337O3847
$$ plain form
20742 -55213 -224239 110859 430877 254857 -93119 60201 391793 366630 -76644 -120400
20732 -120400 -5726 263791 483871 320583 -45979 -35346 158298 121642 111942 -258802
20722 -258802 -393496 -492676 -302805 -10036 19899 -63734 -94012 -28594 -30172 22162 68992
20711 68992 -22148 161338 332195 287729 269337 377217 193492 168169 326439 46993
20701 46993 -270462 -13198 376958 218433 432041 309864 357771 505771 187034 -296361
20691 -296361 -560143 -443361 47043 128365 16853 -475292 -691913 -166373 303419 324970
20681 324970 309380 -209992 -24995 41903 -103148 -37678 -3106 -236421 18538 -160246
20671 -160246 -330995 -166260 35898 9988 -121013 -178366 -317665 -241231 -145894 -82047
20661h2047O1330l61492k7159M85112L51740l69795l41414Q0502p5986O4549J64492
20650e0168J00859q1915J02470j33089n9237R5274J99491j27086k06251J12457
20640d7195l9420j90348J29936J9462J18883K315J20007O3394j10903j42954j98422
20629b75245o37677K7872M64123J20538J20601L57225j32902K86198j50595j84592
20619d454j09099M9317K63571j60131l67970K8453J6409r14j34711o7096J03361
20608c83264L828j75004J70221K16959R1333Q8181l63078k01388K43587M09655
20598A01030Q2207q8898j2345K48033M3358l42479k89696j30309R9110L28415
20588C8426p200l4222K28567j04143k76004Q9905K87247l44509j95274J80526
$$ plain form
20661 -82047 -20717 -382209 -409368 75744 427484 57689 -283725 -203223 -279209 -214660 -50168
20650 -50168 50691 -31224 71246 -61843 -121080 -25806 173685 46599 -159652 -47195
20640 -47195 -86615 -276963 -147027 -127565 -8682 -6367 113640 177034 66131 -76823 -275245
20629 -275245 -912922 -885050 -420927 -300389 -179788 177437 44535 330733 180138 -4454
20619 -4454 -113553 -64236 199335 39204 -328766 -300313 -283904 -284818 -419529 -486625 -383264
20608 -383264 -379436 -554440 -384219 -167260 -75927 12254 -350824 -552212 -308625 101030
20598 101030 183237 94339 81994 330027 373385 30906 -258790 -389099 -289989 38426
20588 38426 31226 -2996 225571 121428 -154576 -64671 222576 -121933 -317207 -136681
20578a36681L83065K16246K59984m75680j22611L13771J00113k92899P0926K5831
20568C42065j19687l14837K44325K97667J17131J01892J5621o25293j94981J48925
20558A2828J53300k15439k78045m0593j86860J76473M64918N2300l07653K55361
20548H6590K06173K72473j74148q1240q056l03218r5724k4815n66447l54915J91526
20537h51801K12524J56273r91M22865J89993j17550j36498j07208n7367o9286
20527c59046M14522l22868j93142k1634j49629j70404L00708J54795m6277L56223
20517c6752L75095K71960l42378p6471P6816j245k22247q360M7486N8670p1759
20506G0815L4869K2788j73536j91657p5788K26361j812j25871J15254l0182j60815
$$ plain form
20578 -136681 246384 462630 722614 246934 124323 438094 538207 245308 316234 342065
20568 342065 222378 -92459 151866 449533 566664 668556 684177 58884 -136097 12828
20558 12828 166128 -49311 -327356 -367949 -554809 -378336 86582 138882 -168771 86590
20548 86590 292763 565236 391088 309848 301792 -1426 -97150 -121965 -688412 -1043327 -851801
20537 -851801 -639277 -483004 -483995 -61130 128863 11313 -125185 -232393 -289760 -359046
20527 -359046 55476 -267392 -460534 -482168 -631797 -802201 -501493 -346698 -392975 -36752
20517 -36752 338343 610303 267925 191454 268270 267025 44778 36418 83904 142574 70815
20506 70815 105684 128472 -45064 -236721 -312509 -86148 -87960 -213831 -98577 -128759 -289574
20495b89574J43336k506J12553p1995K1854j89283M5224j25993j38243K46596
20485b48031K84589J43909j05395r0523K08858Q2001k92039m4261m27473r7018
20475e85383J10000J35092K35906J65258m83588o802L11461J05305l6872P5293
20465B5670J2004j95250k824m1451J60612j6043j19433j34879K6743K88115K775
20454F039Q6157l08647j79545J25152L06240K45326j20635k09630R4269O6731
20444A11457k33329j18851M81823J98981J75418k00475o28969n5443J50101o9761
20434a89048J29202j93583j09820R5196M2120K53497K0196k39604J46643J48135
20424A02934l38807l34160j07037K99579L05341Q0593L4294k87459j42893N7422
$$ plain form
20495 -289574 -146238 -148744 -36191 -108186 -86332 -275615 -230391 -356384 -494627 -248031
20485 -248031 36558 180467 75072 -15451 193407 275408 -16631 -60892 -488365 -585383
20475 -585383 -475383 -340291 -104385 60873 -422715 -429517 -118056 -12751 -49623 25670
20465 25670 37674 -157576 -160400 -201851 -41239 -57282 -176715 -311594 -284851 3264 6039
20454 6039 92196 -216451 -395996 -270844 35396 280722 160087 -49543 44726 111457
20444 111457 -121872 -240723 241100 440081 615499 415024 -213945 -269388 -119287 -189048
20434 -189048 -59846 -253429 -363249 -268053 -225933 27564 47760 -191844 -45201 102934
20424 102934 -235873 -570033 -677070 -377491 -72150 8443 42737 -244722 -387615 -330193
20414c30193M16054L78727k16345k80421M98193K07983l40623m27404l42929J0587
20404d26371j647L52242M54210M798m64464m62998j53131m2453j9505K06851Q4213
20393d68255J39695K37991M70159k16829k86055K32863M0638j95755O5225J58550
20383A78227q9788k07085k9384j25637Q153K85866L06181p8440R4785Q4606J19261
20372E46745j12548o3881p7973K41122j09076l09966O5560P3101l07149k33793
20362b87858J57928O0067L55970J5040k16193k79449k28078P6088k84625n7868
20352f88978O6679L33456K22757J74381j85098J3409L00339j0604O7928o3738
20342B30531l11551j52888p6013j53166k50088J43557N69880R1270q757j92193
$$ plain form
20414 -330193 85861 464588 248243 -32178 466015 673998 333375 -94029 -436958 -426371
20404 -426371 -428018 -75776 378434 383232 -81232 -544230 -697361 -739814 -759319 -552468 -468255
20393 -468255 -328560 -90569 379590 162761 -123294 109569 150207 -45548 19677 178227
20383 178227 88439 -118646 -148030 -273667 -265514 20352 326533 248093 342878 427484 546745
20372 546745 434197 370316 292343 533465 424389 114423 179983 253084 -54065 -287858
20362 -287858 -129930 -69863 286107 301147 84954 -194495 -422573 -346485 -631110 -688978
20352 -688978 -622299 -288843 -66086 108295 -76803 -63394 236945 226341 294269 230531
20342 230531 -81020 -233908 -309921 -463087 -713175 -569618 262 91532 82775 -109418
20332a09418j45619J54627K18126K25530j65923k59734N1531J07634J36104J26821
20322C39679j11135m93259l23712o8698M78209k0900k20229M8578J06579p2713
20312c37601J61743K27814K76833J00913j56110j25363o5547J6374K2798k47772
20302a25918m9060k02674J56280K70569k98378k21141k50574j37557J8931M35184
20292d04338J13543n5369J14765k95833R2856N62075k7703m36306J69131n6660
20282b23839p6591j02080l02787O9602J39383J86817j17361J68829M5119k1454
20272b34362K54929m6046J06453M12608K22848j22383l88061m20926k14146J59740
20262b69346L85566q7702K36313j77243r0588K81456K66649j20554o866R3296
$$ plain form
20332 -109418 -255037 -100410 117716 343246 177323 -82411 -30880 76754 212858 339679
20322 339679 228544 -264715 -588427 -657125 -178916 -199816 -420045 -371467 -264888 -337601
20312 -337601 -175858 51956 328789 429702 273592 148229 82682 99056 121854 -125918
20302 -125918 -174978 -377652 -221372 49197 -249181 -470322 -720896 -858453 -839522 -404338
20292 -404338 -290795 -346164 -231399 -527232 -434376 127699 99996 -336310 -167179 -223839
20282 -223839 -300430 -402510 -705297 -635695 -496312 -309495 -426856 -258027 -212908 -234362
20272 -234362 20567 -25479 80974 493582 716430 594047 205986 -214940 -429086 -269346
20262 -269346 116220 28518 264831 87588 -3000 278456 545105 424551 417685 510981
20252E10981m23573k34577l21306J03015j4582K54015Q6979l65850k70914j0995
20242f86807K54122L47292K0446R9769K37979j87412R1245j77030m43838k01607
20232f45841L43232R1439J67800J86778r5813j48857j71124k13437K38053K18765
20222b9005k48268o4743L08480J65990M70373m5268m32130k04452p0918p0253
20212b20194Q8952K73267J27582K5077k23926k19356l0154L05514J84870l30964
20202a9332m8623J92825L28381L05389k12095l60122L7287M4624k56838j18121
20192a06625R583L5901N2050N3914j5475K28207l46925l10691J36441K90903l07584
20181b80301k15558Q1718Q9479J04623o6420K67509P3004l89444l7413J74086
$$ plain form
20252 510981 87408 -147169 -468475 -365460 -380042 -126027 -39048 -404898 -675812 -686807
20242 -686807 -432685 -85393 -64947 34822 272801 85389 176634 -396 -444234 -645841
20232 -645841 -302609 -211170 -43370 143408 47595 -101262 -272386 -485823 -247770 -29005
20222 -29005 -277273 -342016 -33536 132454 602827 557559 125429 -79023 -149941 -220194
20212 -220194 -131242 142025 269607 294684 70758 -148598 -178752 126762 311632 -19332
20202 -19332 -67955 124870 453251 758640 546545 186423 223710 268334 11496 -106625
20192 -106625 -97042 -61141 -9091 44823 29348 257555 -89370 -400061 -263620 27283 -280301
20181 -280301 -495859 -414141 -324662 -220039 -286459 -18950 54054 -335390 -372803 -198717
20171a98717J78613K17884K50205L46146K1790m8760j38289k63357l70358j05532
20161a10375J1959N6714j81860j72783m18181j15514J3623K79298K16517l1176
20151d51778L5274M05168P5778K17377J94095l54616J55829J68107L60129r915
20141G95448j74497m47579K394N8721j519j37222p5940N5460K8825n61278Q8365
20130c68822L13599m3870l30418r3908L00832K10996k54118R9889K79124j2746
20120A00558k10874J02427K81705o809k43202o7832J76169m76067n7931j4112
20110d15968Q4040L45460J50863n12906j53735K01561K27457R213N8187k04762
20100b10590J9888m6731M3622K7275k4945P111K55221M41512k28100m08185M0969
$$ plain form
20171 -198717 -20104 197780 447985 794131 815921 767161 628872 365515 -4843 -110375
20161 -110375 -98416 -41702 -223562 -396345 -814526 -930040 -916417 -637119 -420602 -451778
20151 -451778 -416504 -11336 64442 281819 475914 121298 277127 445234 805363 795448
20141 795448 620951 173372 175766 234487 232968 95746 19806 75266 104091 -457187 -368822
20130 -368822 -55223 -99093 -429511 -523419 -222587 -11591 -265709 -165820 113304 100558
20120 100558 -110316 -7889 273816 267007 23805 -44027 132142 -343925 -401856 -415968
20110 -415968 -331928 13532 164395 -348511 -502246 -300685 -73228 -64015 -5828 -210590
20100 -210590 -190702 -237433 -193811 -166536 -191481 -184370 70851 512363 284263 -123922 -82953
20089h2953j54225k78895R7552P43819R974k06861l24632k9734J79981J31318
20079H5344j65822J39329K46541J83091q1552j62710O8587k10193j35774P4589
20069D1430N9481j38036j09157J90059K63132n6638j53290P1828r7538k93232
20059b21961r1855J04144K66699J45715M7101K60958J18091p1741p3215l14718
20049A69218j10702j12340R3752L44463l15261k27488k24713J14749P3399O7947
20039a26976J63956J6040J26114O4982j20355l29010J22977O5881J03583K72919
20029C60111j41559k56211q1211Q1845j86696J33544k13408j04945K81098K24743
20019I7311J0590j3407J11931L25741k25392r8392K13428o8202J55623k64709
$$ plain form
20089 -82953 -237178 -516073 -418521 325298 335272 128411 -196221 -225955 -45974 85344
20079 85344 -80478 58851 305392 488483 406931 244221 312808 102615 -33159 41430
20069 41430 100911 -37125 -146282 43777 306909 250271 96981 168809 71271 -221961
20059 -221961 -313816 -209672 57027 202742 249843 510801 628892 557151 483936 169218
20049 169218 58516 -53824 39928 384391 69130 -158358 -383071 -268322 -194923 -126976
20039 -126976 36980 53020 179134 244116 123761 -205249 -82272 -16391 87192 360111
20029 360111 218552 -37659 -118870 -37025 -223721 -90177 -303585 -408530 -127432 97311
20019 97311 107901 94494 206425 532166 306774 208382 421810 353608 509231 244522
20009B44522j79448L0746r5463J48014j47673o465j04808k22307K67448O0268
19999e166p2909l05266j00420L66362L00689M66031J0688o57409n25454k3591
19989e46445M6768K18781K84035N1131q9595l8010L13279k88500l78865Q4743
19979c42678K70019J65823j52679l8010K54657n5704L4952M46943N4329k70740
19969C66912k86816N6085K91802p1540o6941l19814j72618J50415K95156K09456
19959D52097o8271l08381k65257o0120m5733J26724j7929M1865J17980j14861
19949a41886N1556Q6349N4622j41466J83952j70994k03034J10192J30501l30529
19939c70737J64597L27991k12972k2270l72811j22402J73001m8882P9869K60433
$$ plain form
20009 244522 65074 95820 357 148371 698 -5767 -110575 -332882 -65434 -5166
19999 -5166 -78075 -383341 -483761 -117399 183290 649321 660009 2600 -522854 -546445
19989 -546445 -499677 -280896 3139 54270 -35325 -73335 239944 -48556 -427421 -342678
19979 -342678 -72659 93164 -59515 -97525 157132 101428 136380 583323 637652 366912
19969 366912 80096 136181 427983 356443 289502 -30312 -202930 -52515 242641 452097
19959 452097 383826 75445 -189812 -249932 -295665 -168941 -186870 -145005 -27025 -141886
19949 -141886 -90330 -3981 50641 -90825 93127 -77867 -280901 -170709 -40208 -370737
19939 -370737 -206140 121851 -91121 -113391 -486202 -608604 -435603 -484485 -404616 -144183
19929a44183N331n753J00366K15825Q5337j39287j89610J26174Q8747j24220M0224
19918E8951j27174J4716J61427q8331J09433J99753K29858L1201l46368j80260
19908F3206L6428l82538q8916J25713L89989O4018l2290j59053O1525j21366K45998
19897B02714p7514j36036p4417j09865l38252M8303L24659k161j11158r3305k28244
19886e95276L13948J03594J50970L47197J30584k13679k02587l26755k6525l4261
19876c52790q9424L3509K5414J07834k33494K23274Q1408Q5991N9599Q4645K9602
19865E5568J46470q509k62563k86115K23241L59231j9874n15616j15791L62496
19855f1462k1570k90334K53257J30061r9439L10529J93004k67247n0008j8096
$$ plain form
19929 -144183 -138852 -144605 -44239 171586 256923 117636 -71974 54200 142947 18727 58951
19918 58951 -68223 -53507 107920 19589 129022 328775 558633 589834 243466 63206
19908 63206 99634 -282904 -371820 -246107 143882 207900 175610 16557 78082 -43284 202714
19897 202714 125200 -10836 -85253 -195118 -533370 -485067 -160408 -162569 -273727 -367032 -595276
19886 -595276 -281328 -177734 -26764 320433 451017 237338 34751 -292004 -318529 -352790
19876 -352790 -442214 -408705 -383291 -275457 -508951 -285677 -204269 -118278 -58679 25966 55568
19865 55568 202038 193529 -69034 -355149 -131908 227323 207449 -308167 -423958 -61462
19855 -61462 -83032 -373366 -120109 9952 -89487 221042 414046 146799 96791 78695
19845G8695j14154j49133J9551K64234j11492l09418L36481P5155k30436J8583
19835a21934n7949k42702j34132Q7904L86256M47259L1617J8133Q0979n68057
19825g2626j59785l08208J13625M57735K22628j94572p5906K03513J7599n8057
19815A45946j00949j74865J70099J0376k05102L93550R2993j25475K0384o9633
19805A57324k95204j82115K57920K26779m4209j53175k78M04207M2362k75159
19795A38452m4124q4246Q5429J3998j68090N5336j34471j43281J90709K26251
19785A35963J44229l36550J32301o7480l5354R9018n8443J54227J42144o2121
19775B47934k08323K34867j5171k44581n711J79510M5232j58158l57568n5567
$$ plain form
19845 78695 -35459 -184592 -165041 99193 -12299 -321717 14764 89919 -140517 -121934
19835 -121934 -179883 -422585 -556717 -468813 -82557 364702 396319 414452 495431 -72626
19825 -72626 -232411 -540619 -426994 30741 253369 58797 -17109 186404 204003 145946
19815 145946 44997 -129868 40231 50607 -154495 239055 332048 206573 226957 157324
19805 157324 -137880 -319995 -62075 164704 120495 -32680 -32958 371249 413611 138452
19795 138452 94328 10082 95511 109509 -58581 -3245 -137716 -280997 -90288 135963
19785 135963 280192 -56358 75943 8463 -26891 72127 13684 167911 310055 247934
19775 247934 39611 274478 259307 14726 9015 188525 233757 75599 -281969 -337536
19765c37536K69675J46735j98356L5586M5036j2330K60946J25021j89211j48033
19755b467j29341k58765K06552j2067n6067J34965J49859k6563j68676q3648N9617
19744a86601j48926K3070K23851R167J56959O8453L8147n8321j11879J0925o2756
19733c7911j36253j70073j8839k91440J41327L47810q5644j74638P3516J76248
19723a75897j72129j2193K0534k3260K03639M90354J09843k30992k07354j29924
19713a27379l23964k26243j01934O854M10240J39051J83202o5252q0509J36862
19703d9072J13562J83473Q4368J80054J22659K08397l84956l55426l27266j47738
19693c71945j9851J33445J06975N57490K684l55465l21271j97906P3721P9695
$$ plain form
19765 -337536 -67861 78874 -119482 -83896 -38860 -51190 209756 334777 145566 -2467
19755 -2467 -131808 -390573 -184021 -196088 -252155 -117190 32669 6106 -162570 -246218 -186601
19744 -186601 -335527 -312457 -88606 -79439 77520 145973 184120 125799 13920 24845 -37911
19733 -37911 -174164 -344237 -363076 -654516 -513189 -165379 -251023 -425661 -352145 -175897
19723 -175897 -348026 -360219 -339685 -362945 -159306 331048 440891 209899 2545 -127379
19713 -127379 -451343 -677586 -779520 -772666 -362426 -223375 -40173 -105425 -185934 -49072
19703 -49072 64490 247963 332331 512385 635044 843441 458485 103059 -224207 -371945
19693 -371945 -391796 -258351 -151376 406114 408798 53333 -267938 -465844 -392123 -312428
19683c12428M6971K22904J2123j37206P1017N8268j76682L389r4587j03013L91874
19672a7370K08215r0750j32407k57838J16893K69472Q042L87692K02273k22780
19662D71442l31676K42468L0011j00465j37367L9330M8571l44966K40959n9697
19652I8610k6844n5532p3054J36676P492q6915j77473J07601R3678O5171k13907
19641a24497J0362k69219N0304O7153K29906k51447J93257M54175J23743j35668
19631C48069l24551k31827J55416K2527J63024J87165k06771j76484k75917q6398
19621d25747K23053J09374J29418K24950j73020l10400L63697L64894K3282J4930
19611E44431j97948k07635K46422p2400m0822m9736j77473o7197M56057J24166
$$ plain form
19683 -312428 -265457 -42553 -30430 -167636 -96619 -38351 -215033 -211644 -306231 -409244 -17370
19672 -17370 190845 100095 -32312 -290150 -173257 96215 104257 491949 694222 471442
19662 471442 139766 382234 412245 311780 174413 213743 262314 -82652 158307 98610
19652 98610 71766 16234 -56820 79856 87348 433 -177040 -69439 24239 89410 -124497
19641 -124497 -114135 -383354 -333050 -265897 -35991 -287438 -94181 359994 483737 348069
19631 348069 23518 -208309 -52893 -30366 132658 319823 113052 -63432 -339349 -425747
19621 -425747 -202694 -93320 36098 261048 88028 -222372 141325 506219 529501 544431
19611 544431 346483 138848 385270 312870 272048 222312 44839 -22358 433699 557865
19601E57865k43887m00012N2061K20914o1767K18584J56274p2616J04394l86071
19591A45739l85812m5362L80877L48827l09206k99492K6446J2437L11655P2476
19581B58585r4925k10385k88322J53405P7791l48660Q8894J92534M01211j49999
19571H0129l65387P2414o4097P3290K41787K05090J10242j23878k46534k14535
19561b31479k34205j31266K32909J87376o3151j72517p6930L5131K1323q9437
19551e22246J10779K1860J28444J25722O7376L9717j16426j33590J68028K07654
19541I7318L5789m76157l99704J80403K04268k54502j982K18756M35538J97188
19531B36915j70283J02773n1021l82358k47722J40565J19951L70337r7755j77939
$$ plain form
19601 557865 313978 -86034 -33973 186941 125174 343758 500032 427416 531810 145739
19591 145739 -240073 -285435 95442 444269 135063 -164429 -137983 -125546 186109 258585
19581 258585 163660 -46725 -335047 -181642 -103851 -452511 -363617 -171083 230128 80129
19571 80129 -285258 -212844 -276941 -203651 38136 243226 353468 229590 -16944 -231479
19561 -231479 -465684 -596950 -364041 -176665 -239816 -412333 -489263 -454132 -432809 -522246
19551 -522246 -411467 -389607 -261163 -135441 -68065 -28348 -144774 -278364 -110336 97318
19541 97318 133107 -343050 -742754 -562351 -358083 -612585 -614567 -395811 39727 236915
19531 236915 66632 169405 118384 -263974 -511696 -371131 -251180 119157 21402 -156537
19521a56537J65388J70619J77353j46337m44563q9882J51987m9564J60834J96513
19511A35811N5964j26443k44521j09172j27693N2031O5668J66951M6571L14015
19501B29182j29266o8894K2267k50462p6837J43277Q602k01846N0337J67224j46038
19490b52454p142m1753J41592K46649o6492j99579k03606J03051K79503j18500
19480a18731j06607K72653M0055J27461q5257J43317K84160j0810o31928j35669
19470b21356L01087M6810J26997k53169m84029k15996J00531K77236N57861O8483
19460C04455r8560k94238j81289P5854L12616k2470L8944J50405k48314P5356
19450A12759k4294o6259k59025q1340j62086Q4614J25348L70651L35506k52074
$$ plain form
19521 -156537 8851 179470 356823 210486 -234077 -323959 -171972 -221536 -60702 135811
19511 135811 191775 65332 -179189 -288361 -416054 -364023 -298355 -131404 -84833 229182
19501 229182 99916 31022 53289 -197173 -274010 -130733 -122131 -323977 -273640 -106416 -252454
19490 -252454 -259596 -301349 -159757 86892 20400 -179179 -382785 -279734 -231 -118731
19480 -118731 -225338 47315 87370 214831 129574 272891 557051 546241 -85687 -221356
19470 -221356 79731 126541 253538 369 -483660 -699656 -599125 -321889 235972 304455
19460 304455 205895 -88343 -269632 -193778 118838 96368 135312 285717 37403 112759
19450 112759 88465 22206 -236819 -318159 -480245 -395631 -270283 100368 435874 183800
19440A83800j81775L7350J38251K0977k33346j00541L8422j4966R7495P9038r8434
19429c3729p3089l79383K7929L62472K06695K5651l1178J88936j99387k49143
19419a54226L71962J6488j7150m51622j93774P6188L64191J58454m20340k72309
19409e22138k04413K20013M45594P02j6808q6047R7767l6743n9667J80365K59103
19398B77728J04526j70204j85599n2963L42421K19397O7788p180j01208n3015
19388D41691j32515q4471K20082J2077n3730l3874o4975j51318K9907K1364m6328
19377A57910P2058J09389k75872J14817o4500l88822n8522K77317J81551j74612
19367d9286o763k55576l64500J42638J65261k5725M12364R1994k4321j53348k76905
$$ plain form
19440 183800 2025 39375 177626 198603 -34743 -135284 -96862 -111828 -14333 64705 -33729
19429 -33729 -106818 -486201 -458272 -95800 110895 136546 105368 294304 94917 -154226
19419 -154226 217736 234224 217074 -234548 -428322 -352134 12057 170511 -249829 -522138
19409 -522138 -726551 -506538 -60944 -60242 -77050 -163097 -65330 -102073 -161740 18625 277728
19398 277728 382254 212050 26451 -26512 315909 535306 603094 595914 494706 441691
19388 441691 309176 224705 444787 456864 403134 369260 304285 152967 182874 204238 157910
19377 157910 229968 339357 63485 178302 113802 -275020 -333542 -56225 125326 -49286
19367 -49286 -56049 -311625 -676125 -533487 -368226 -393951 18413 110407 86086 -67262 -344167
19356c44167M5493K94205O6871J98325n8061l7344j33884r1203J00643j32318
19346i1440l16949l23323l7542L84276K01692l33495j09229J87058L89053k44411
19336b94310j17974J0790K57244M28123J01857j45232k74500L5644k27719J11560
19326a14517R261k50655j25994K05323J10005o0078j46766P7741J24731J10762
19316f0187j95579j54574J358r515L52289K74026j81335j08402k29377l19083
19306f30379j66193L00909L35196K16053L23717O4361n91m32085j46963J9915
19296a16060j9385K5881K25002K68319P35l44286n13589K05675Q5419J37404j76959
19285b21844n8953J61531J91283n2024R4718J79275l3507o6428J22872l18023
$$ plain form
19356 -344167 -298674 -4469 62402 260727 202666 165322 31438 -59765 40878 -91440
19346 -91440 -408389 -731712 -769254 -384978 -183286 -516781 -626010 -438952 -49899 -294310
19336 -294310 -412284 -401494 -144250 283873 385730 240498 -34002 1642 -226077 -114517
19326 -114517 -105256 -355911 -481905 -276582 -166577 -226655 -373421 -295680 -170949 -60187
19316 -60187 -255766 -410340 -408982 -418497 -66208 207818 26483 -81919 -311296 -630379
19306 -630379 -796572 -495663 -160467 55586 379303 443664 443073 10988 -135975 -116060
19296 -116060 -135445 -109564 115438 383757 384492 40206 -473383 -267708 -182289 -44885 -221844
19285 -221844 -280797 -119266 72017 19993 114711 293986 260479 194051 316923 -1100
19275a100j8936j52607j42639K39463j28088j78761o0714j65101K40176K70005
19265i8302L26088J46640q2196j18930l8396m65836j50063J56552O684K58083
19255e9676j11k27298P2937J62748k04173Q2155L7574j61817J44062L63044L12972
19244E22417m36591j71269K22719j73411k04852j24132k21021K07173J52530K33729
19234G292L8191K45389O639J58964l5669r1402J90858m84332k54757J12492k43188
19223c49523k09527P2053r8819L14040K10483j6920J67146K92859J82275o9954
19213D94113k96752j39365k8724J85328k40686r5169l5436j28355k7418N3754
19203b58710k58110J53101M98244j2181k9030j4465m9864j6477J23744q929k35277
$$ plain form
19275 -1100 -20036 -172643 -315282 -75819 -203907 -382668 -443382 -608483 -368307 -98302
19265 -98302 227786 374426 292230 173300 134904 -330932 -480995 -324443 -317759 -59676
19255 -59676 -59787 -287085 -214148 -51400 -255573 -173418 -135844 -297661 -153599 209445 522417
19244 522417 85826 -85443 137276 -36135 -240987 -365119 -586140 -378967 -226437 7292
19234 7292 45483 290872 297511 456475 420806 329404 520262 35930 -218827 -106335 -349523
19223 -349523 -559050 -486997 -585816 -271776 -61293 -78213 88933 381792 564067 494113
19213 494113 197361 57996 29272 214600 -26086 -121255 -156691 -285046 -312464 -258710
19203 -258710 -516820 -363719 134525 122344 93314 78849 28985 12508 136252 127323 -107954
19192a07954j00894K30138k53392L8017L74170J52975j81514j07654p6875L0660
19182b323J81374K01639R280J87595J10289k29695j40621j94149l91045J97467
19172g0189L6221j07837K09640K73070Q1222k2657M81281o0279m7656l32353k7797
19161D12666j8648J76038J53297k86822n11438J3523m157m9902l30999N7430P5212
19150c13800j89068j00784J613L08652J5521j57536J08765j27301o2927L87249
19140a29616K11267j86241k29720J94105L110m7437k57049J47631L21462m0278
19130a2766J2335j80425j42709J01468m4110M22266K90713J9615k2367n11474
19120f7454m18992K36260J11226J59797J62509L4358J06767J59300k04996k71733
$$ plain form
19192 -107954 -208848 21290 -232102 -194085 180085 333060 151546 43892 -32983 -2323
19182 -2323 179051 380690 389970 577565 687854 458159 317538 123389 -267656 -70189
19172 -70189 -33968 -141805 67835 340905 422127 399470 880751 820472 772816 440463 412666
19161 412666 394018 570056 723353 436531 -74907 -61384 -65541 -115443 -446442 -389012 -313800
19150 -313800 -502868 -603652 -602039 -293387 -277866 -435402 -326637 -453938 -516865 -129616
19140 -129616 81651 -104590 -334310 -140205 -137095 -184532 -441581 -293950 27512 -12766
19130 -12766 -431 -180856 -323565 -222097 -266207 156059 446772 466387 444020 -67454
19120 -67454 -486446 -250186 -138960 20837 183346 217704 324471 483771 278775 7042
19110G042L33949K33822k01535k77855l9344K61848K03864k1499j98716J38664
19100D40240k46407n5777M5122l70498l66199O6868K88632j17324k82338M02180
19090a95501Q8791k4045J48787n7698l09881L48222M6935j40678J03716j14877
19080a06229J64136j81702j10348K42830L1453L36616Q4116l63000j30830J63396
19070A30438J05690M7665J29171Q2744j20652p4260k12516K9852J37215J3053
19060B68400R3593j49629j77689j44641j61027Q7993J0466J03052r1284j48672
19050c09438k9569J71597p7947m10665L12326k501J05343N3980N4254l39846p5535
19039e48001J99766l0202K82249J3951m2476j37975j2936K6581j14313L46649
$$ plain form
19110 7042 340991 574813 373278 95423 56079 317927 521791 500292 301576 440240
19100 440240 193833 138056 183178 -187320 -553519 -486651 -198019 -315343 -597681 -195501
19090 -195501 -106710 -130755 18032 -39666 -349547 -1325 45610 -95068 8648 -106229
19080 -106229 57907 -123795 -234143 8687 40140 376756 460872 97872 -32958 130438
19070 130438 236128 283793 412964 495708 375056 300796 88280 118132 255347 268400
19060 268400 361993 212364 34675 -109966 -270993 -183000 -172534 -69482 -160766 -309438
19050 -309438 -339007 -167410 -245357 -656022 -343696 -346197 -240854 -186874 -132620 -472466 -548001
19039 -548001 -348235 -378437 -96188 -82237 -124713 -262688 -275624 -249043 -363356 -16707
19029a6707m9376j355J46081j07775o8956j01125P3856m01197o32109J61432M34204
19018e63027K60198n4259J13375r3298m1378K51934m6535j51171m8920J75267
19008a97814M40194o5495j6219J54881J2545j21688k80812k74196j1193J22019
18998b37778J24300j08436N7200K84452J95309o792k78820l09536K54768L62939
18988C37606n001K8667J88596j29197K32013j14649k00370k1894p7489k82864
18978d4582k07471J11897K00138K6725k54138n8082L28188J49345j12166j19446
18968B0408Q4207L53232P9000n6072l89487m11045j92690j64534Q4116O6916L83869
18957a42080J33963L85550J18406K1544J11556Q969k97128J754n17n9477n8538
$$ plain form
19029 -16707 -66083 -67438 78643 -29132 -98088 -199213 -125357 -526554 -1158663 -997231 -563027
19018 -563027 -302829 -357088 -243713 -337011 -378389 -126455 -172990 -324161 -373081 -197814
19008 -197814 242380 176885 160666 315547 328092 206404 -74408 -348604 -359797 -237778
18998 -237778 -113478 -221914 -164714 119738 315047 308255 29435 -280101 -25333 337606
18988 337606 332605 361272 549868 420671 652684 538035 337665 315771 238282 -44582
18978 -44582 -252053 -140156 59982 86707 -167431 -225513 102675 252020 139854 20408
18968 20408 104615 457847 536847 480775 91288 -319757 -512447 -676981 -592865 -525949 -142080
18957 -142080 -8117 377433 495839 517383 628939 637908 340780 342534 342017 282540 224002
18946B24002j81652q943m9505K1662P1219j08308M99564K45375K47116m27J06973
18935A067076r845l12265k48186k60624l61404L69733L66891L6550j97028k12557
18925B38341k11663j68122J7222k32196k17585n129J51417K48595K15504j20898
18915h4514j52719K6333M07657M17073p0596l03136k97808j47892k08807K81437
18905a32972J57458j39393K5412j5170J10846R0131p1840k52534k18312r5903
18895e42277M26686K37077K46807l68351k20676K41291J55808o3933J05960L00746
18885E19138J03976l04338J29593l40219j02645J25783J80303k83080j14441J64042
18875G8112m28566p0803L0472m33205r2488J61667K58610K88004J84025j78302
$$ plain form
18946 224002 42350 33407 -16098 5564 76783 -31525 468039 713414 960530 960103 1067076
18935 1067076 1057231 744966 496780 236156 -125248 244485 611376 647926 450898 238341
18925 238341 26678 -141444 -124222 -356418 -574003 -579132 -427715 -179120 36384 -84514
18915 -84514 -237233 -210900 196757 613830 543234 240098 -57710 -205602 -414409 -132972
18905 -132972 24486 -114907 -89495 -104665 6181 96312 24472 -228062 -446374 -542277
18895 -542277 -115591 121486 368293 -58 -220734 20557 176365 112432 218392 519138
18885 519138 623114 318776 448369 108150 5505 131288 311591 28511 -85930 78112
18875 78112 -350454 -421257 -390785 -823990 -916478 -754811 -496201 -208197 -24172 -202474
18865b02474K18691j23432j1485J22829Q8301j02020L67308j17493j04037j53334
18855a7146k52890p1475J51549R8803j26763K72851r790K5890k90094l2942R1056
18844a60951M23986R72j552m6083R9802M7127r6590J51002n4391N4564O1303O5606
18832E44795J38721K78056j19361l70073k17852k00971k0236k28215k07336l07267
18822g09739R1555M53336J82095J50874l00080l04709K34483L03171K37168k4291
18812C13863r7887j78727J74554K23301n2931k89728n76037j15452K0307K01709
18802c77028L47330o09k45919j68718L4280j0591K65407K0838J81750K10020j70937
18791H5823L52946N14115R2945k70095k44978l43091m32690J54356J02840K02449
$$ plain form
18865 -202474 16217 -107215 -118700 4129 92430 -9590 357718 240225 136188 -17146
18855 -17146 -270036 -341511 -189962 -91159 -217922 54929 45139 71029 -219065 -252007 -160951
18844 -160951 263035 264007 262455 216372 316174 363301 266711 417713 363322 417886 479189 544795
18832 544795 683516 961572 842211 472138 254286 53315 33079 -195136 -402472 -709739
18822 -709739 -618184 -164848 17247 168121 -131959 -436668 -202185 100986 338154 313863
18812 313863 215976 37249 211803 435104 382173 92445 -483592 -599044 -578737 -377028
18802 -377028 -29698 -30307 -276226 -444944 -410664 -421255 -155848 -135010 46740 256760 85823
18791 85823 438769 952884 1045829 775734 530756 187665 -245025 -90669 12171 214620
18781B14620J13088J47256j36627m07527q2298O8773J39616R1237R366L1061J12306
18770C00871N9312j72394L52391L03652L83016N0555J35218L87925Q3172k01682
18760A682036L05638M24411m23839o46817k95692r3251k52532l19758p4031r0418
18750B15747J9167j04025p6286R9138o8320r5310l43115k60164J91357O5808j52347
18739e08350j6704K16709J42052j53008L077J39586J77824K70398k2632k6479
18729B22473K64639j14538j21780R5258K84454l70196m04683P0379L60362j61934
18719A24434k76419j43311K30099J72450j27453j55504J3286J63251K46680k6595
18709B20918R7359L1554J35045K95825o6923j61595O6416k62843j31585n6064
$$ plain form
18781 214620 327708 474964 338337 -69190 -151488 -82715 56901 148138 157504 188565 300871
18770 300871 360183 187789 540180 843832 1226848 1277403 1412621 1800546 1883718 1682036
18760 1682036 1987674 2412085 1988246 1341429 1045737 952486 699954 380196 306165 215747
18750 215747 234914 130889 54603 153741 85421 -9889 -353004 -613168 -421811 -356003 -508350
18739 -508350 -525054 -308345 -166293 -319301 -316224 -176638 1186 271584 248952 222473
18729 222473 487112 372574 250794 346052 630506 260310 -144373 -73994 286368 124434
18719 124434 -151985 -295296 -65197 107253 -20200 -175704 -162418 833 247513 220918
18709 220918 318277 349831 484876 780701 713778 552183 618599 355756 224171 168107
18699A68107l138j22026p4579j56637p62J95115N1236j04984O1053K42687J20962
18688C77034J22462m19839k99669K53898L47660R6555k2866j87178j32479n3885
18678H1693K70537J35220k4291j94683l5422k90198K19830J4535R2399K22691
18668D92311j98872l40845k83442K91180l9751J22118P8734p2860j16885J57635
18658H9323k17762J68010J26540L60578j56449l4297K59876j24719l28607q2394
18648F0099N7532p8682n1727l4799R5751M47121l20737k90298m8730J84701J8869
18637C9100P7238J51822o9997l6689l44149j04232K72782R106n2153N5174j31486
18626a33484j14434J19605J13811j95009m04478m8141L06026J37893L71448k06601
$$ plain form
18699 168107 164969 42943 -31636 -188273 -189035 6080 57316 -47668 13385 256072 377034
18688 377034 499496 79657 -220012 33886 381546 478101 455235 268057 135578 81693
18678 81693 352230 487450 463159 268476 233054 -57144 162686 177221 269620 492311
18668 492311 293439 -47406 -330848 -39668 -79419 42699 121433 48573 -68312 89323
18658 89323 -128439 39571 166111 526689 370240 335943 595819 471100 142493 60099
18648 60099 117631 38949 -12778 -47577 48174 495295 174558 -115740 -164470 20231 39100
18637 39100 116338 268160 198163 161474 -182675 -286907 -14125 -5019 -57172 -1998 -133484
18626 -133484 -247918 -128313 -14502 -209511 -613989 -662130 -356104 -218211 153237 -53364
18616e3364k84013L87120k01642k85362j40717J92831M34982K41036M48067j66609
18606E72329m38892k5472o5902J08482j28700K84181L88920R0124j84754p115
18596E93201r9458k58827k65308j9125j6993P5019j87753m28069O4431M92214
18586e0668m6652j36160j41560q1701P6636L88235K95077R5602L9986p472L5727
18575D67050n47749j43809J89235J09989J25704P8328j26921J25442K25440J97802
18565G00511l07463k79462J70965J04997L302j45422o5588O0081k97364k0418
18555g5861K10517l00561j40235j72965J14708M6349N8191J54396J50007J07217
18545A51763k78082k87468J92372K73625K98939j9488l32509p5749N19510K77459
$$ plain form
18616 -53364 -337377 49743 -151899 -437261 -577978 -385147 49835 290871 738938 572329
18606 572329 133437 107965 42063 150545 21845 306026 694946 785070 600316 593201
18596 593201 493743 234916 -30392 -49517 -66510 8509 -179244 -607313 -542882 -50668
18586 -50668 -97320 -233480 -375040 -456741 -380105 8130 303207 398809 438795 431323 467050
18575 467050 -80699 -224508 -35273 74716 200420 278748 151827 277269 502709 700511
18565 700511 393048 113586 284551 389548 392850 247428 181840 241921 -55443 -75861
18555 -75861 134656 -165905 -306140 -479105 -364397 -318048 -259857 -105461 44546 151763
18545 151763 -126319 -413787 -221415 52210 351149 331661 -848 -76597 442913 720372
18535G20372k75761n18650k57939M93050J89075j51477J43809j33330J13232J95550
18525E17931l29079k88367l72603K45954P33621K07765Q3627k37369o7472N694
18515D99702L5155l30695j42454J28332K56960N43652J14887Q4237j12508l91045
18505F86223k41980L4306J7488j31147j19045p6646Q4958j597N1230P500K18981
18494E30271J57145j04648J73433j86661l04796j72402N317k88193J61030K55271
18484B25767J66731K5732j83711K00383J50719q8225l06311j75110J11197P4853
18474B02025R0481P5809J4467j20082J50751Q9826n7541j10663j40151j4913k466
18463A77543o1400j26856l45000R8418L94850o7891N191L3230K14106m6383k56685
$$ plain form
18535 720372 444611 -74039 -331978 161072 350147 198670 342479 209149 322381 517931
18525 517931 188852 -99515 -472118 -226164 507457 715222 798849 561480 494008 499702
18515 499702 534857 204162 61708 190040 447000 990652 1105539 1189776 1077268 686223
18505 686223 444243 478549 496037 364890 245845 169199 254157 252560 303790 311290 530271
18494 530271 687416 582768 756201 569540 264744 92342 97659 -190534 -29504 225767
18484 225767 392498 418230 234519 434902 585621 497396 191085 15975 127172 202025
18474 202025 292506 368315 382782 262700 413451 503277 445736 335073 194922 180009 177543
18463 177543 116143 -10713 -355713 -257295 137555 69664 74855 108085 322191 275808 19123
18452A9123p1870j77249J71747K04179j44062R9668K24002j56454n56367K69115
18442a18168K7929P5016J7741k01621n3715J6333L13497K95604n2220k07402j96915
18431h3921J15041p1214L71890L12800l1257m26300p7828L72302K39896k9670
18421F91739l20390j69551l08527n9034j80698K59525M86679m9174L02088J39259
18411G91916m80592p47962r2733O24422L23973j11887m7087j90676m5497J70931
18401A94808m8056k46403R2436M74069L0070j49611P4386j44743o5449O310J880
18390B19697M37764R8062m46891L1252J34710j83730j14219j46385L08706Q4284
18380D23250k10052j0336l9593K0202K266P912j96487J91331O3805m2008K40568
$$ plain form
18452 19123 -52747 -229996 -58249 145930 1868 101536 325538 169084 -387283 -118168
18442 -118168 -90239 -15223 2518 -199103 -252818 -236485 77012 372616 320396 112994 -83921
18431 -83921 31120 -40094 331796 644596 613339 187039 109211 481513 721409 691739
18421 691739 371349 201798 -106729 -165763 -346461 -86936 399743 350569 652657 791916
18411 791916 311324 -436638 -529371 95051 419024 307137 260050 69374 23877 194808
18401 194808 146752 -99651 -7215 466854 496924 347313 421699 276956 211507 217817 219697
18390 219697 657461 755523 308632 339884 474594 290864 176645 30260 338966 423250
18380 423250 213198 202862 163269 183471 185737 193649 -2838 188493 252298 210290 450858
18369D50858J45128j20372l3170J21367L0888m7324J11247K4586j465M74293j74824
18358I81212m43856l59343l4523Q219K15404J10882L2377M6031P7699Q1170k11573
18347E03699N6158m1020k63885n2513K00369m7847Q863J29430n842p8894J12114
18336E20632K54002k0839J26258J83684k10130m52771l11844K64957N88985r2679
18326H50255l33117m01508j30267L33474O85151j38532j98213J12361j34208J79393
18316H24789L56996m8895j35925j65151K67354L5040p3436k45643j01259L60100
18306A073970J37487k08446J338O9640j88176J32402J11994K12950L55263j67677
18296A530745N773J17071Q390K23820k00296j54766j17808j93903m01763q1417
$$ plain form
18369 450858 595986 475614 442444 563811 594699 547375 658622 683208 681743 1156036 981212
18358 981212 537356 178013 143490 151709 367113 477995 510372 556403 634102 715272 503699
18347 503699 559857 518837 254952 202439 402808 354961 363824 493254 487412 408518 520632
18336 520632 774634 753795 880053 1063737 853607 400836 88992 353949 942934 850255
18326 850255 517138 115630 -14637 318837 1003988 865456 667243 779604 645396 824789
18316 824789 1181785 1132890 996965 831814 1099168 1134208 1060772 815129 713870 1073970
18306 1073970 1211457 1003011 1004349 1073989 885813 1018215 1130209 1343159 1698422 1530745
18296 1530745 1536518 1653589 1661979 1885799 1685503 1530737 1412929 1219026 817263 735846
18286G35846K64223M14306K30527J13799L06662k77176k38411q3936l6078j68656
18276A261106L8930K7522J15438j234l26578j39240l3715R8974N00136o7118o9028
18265A405193J92385J52216J08071j62753j73794J06567O9683j09327N8731p3291
18255A573681k5273K6550J47249j78716j0392m3529Q4689j40771J46817J24660
18245A704965M38106J05829n6870J54848m5759k6506j81432j00280M5870J50999
18235B189770K60638j31672K04730M7050j10336L03595k90114j5080J28614L93344
18225B980539L62741L1516j39279R6994M72140J39699k51195j2078J46926N4149
18215C882152j08775p2259K24909q2261k84288j16791Q8894K68005K01991l4434
$$ plain form
18286 735846 1000069 1414375 1644902 1758701 2065363 1788187 1549776 1465840 1429762 1261106
18276 1261106 1300036 1327558 1442996 1441762 1115184 975944 942229 1041203 1541339 1474221 1405193
18265 1405193 1597578 1749794 1857865 1695112 1521318 1627885 1697568 1588241 1646972 1573681
18255 1573681 1548408 1574958 1722207 1543491 1533099 1489570 1574259 1433488 1580305 1704965
18245 1704965 2143071 2248900 2192030 2346878 2301119 2274613 2093181 1992901 2038771 2189770
18235 2189770 2450408 2318736 2523466 2570516 2460180 2763775 2473661 2458581 2587195 2980539
18225 2980539 3343280 3374796 3235517 3332511 3804651 3944350 3693155 3681077 3828003 3882152
18215 3882152 3773377 3701118 3926027 3843766 3559478 3442687 3531581 3799586 4001577 3967143
18205C967143J3040K54830K03860Q5681J32153O48056N1590k76436L30308M10203
18195E820428J07855N3787n7033j62726J88228J9439K80274n1833k22889O7421
18185F042951J32610M7423R3172L21432K35921l2621J32702M30659N72777Q3132
18175H060158J25135L28792L16372J97420K77472K43590j02900L94554L11834
18166A0152427o816l8426O2271K46543N7544J35865M27341M33450Q55909K45600
18156A2571708J21926K70918J82805K50881L81298K67587M64752M58468J28164
18147A5098507L52405L49464K84765L71043L65334j87337M9950J88944M55186
18138A7328261J70183K57786O15985N75452R6101L77482k25225l47078K50918
$$ plain form
18205 3967143 3980183 4235013 4438873 4524554 4656707 5304763 5356353 5079917 5410225 5820428
18195 5820428 5928283 5982070 5925037 5762311 5950539 5969978 6250252 6198419 5975530 6042951
18185 6042951 6175561 6222984 6316156 6637588 6873509 6840888 6973590 7404249 7977026 8060158
18175 8060158 8185293 8514085 8830457 9027877 9305349 9548939 9446039 9840593 10152427
18166 10152427 10145611 10107185 10169456 10415999 10473543 10609408 11036749 11470199 12326108 12571708
18156 12571708 12693634 12964552 13147357 13398238 13779536 14047123 14511875 14970343 15098507
18147 15098507 15450912 15800376 16085141 16456184 16821518 16634181 16684131 16873075 17328261
18138 17328261 17498444 17756230 18372215 18947667 19043768 19421250 19196025 18848947 19099865
18129A9099865j15616m80127j47622K01958L09871J51856J79129K50907N62670
18120B0012891R16279Q02583J036918J725017K232733L141088M569243O600789
18112D1037541R322438J3136673K0476000L1338413M9731603O9344181O3305052
18105B97691901K3660591j953792k35862J1238641J3919969l6440512j05747358
18098B02133578q1625247m3448056k3149375j3305066q290135n597960m351875
18091B2365864l431246k124642j894115j926140j444506q50596r40076j001364
18083H753179r88987o24423p57366m79885k98794n34356n82355k23256l25377
18074C938380n35531k48024j71813n13287m69814j76964l4780k52406n21451P0017
$$ plain form
18129 19099865 18984249 18504122 18356500 18558458 18868329 19020185 19199314 19450221 20012891
18120 20012891 20929170 21731753 22768671 24493688 26726421 29867509 34436752 41037541
18112 41037541 50359979 63496652 83972652 115311065 165042668 234386849 297691901
18105 297691901 321352492 319398700 319162838 330401479 344321448 307880936 202133578
18098 202133578 120508331 77060275 53910900 40605834 32315699 26717739 22365864
18091 22365864 18934618 16809976 14915861 12989721 11545215 10694619 9754543 8753179
18083 8753179 7764192 7139769 6382403 5902518 5603724 5069368 4487013 4263757 3938380
18074 3938380 3402849 3154825 2983012 2469725 1999911 1822947 1788167 1535761 1014310 1084327
18064A084327J28441l06219m15206n785L63271J58586r6716J29400k2183p39972
18054B77944l71475k97050M48487M95194j06919l36147j91258k7683J31818O1303
18044H4214j25763L3759m6842j52075J36892J30441l64649L954M04018K30390
18034C34339J20274J07913j19527r4994m37159k78395o2387O14075P7978m01086
18024a38969r6237J85622O578O8568j84453Q5398J5694J91368Q7693j87992r1502
18013e8232P6726j03197j41569R5793j12442j52973R3339O4251j00062j78230
18003e16596J2739M38247m9534k38429p7997J71246M44533K27719m4497j0606
17993C56825n06117n06813K42266P59k05529M30153J16151L30846k4747l09997
$$ plain form
18064 1084327 1212768 906549 491343 485558 848829 1007415 910699 1040099 1017916 277944
18054 277944 -93531 -390581 57906 553100 446181 110034 -81224 -108907 22911 84214
18044 84214 -41549 -7790 -54632 -206707 -69815 60626 -304023 -300069 103949 334339
18034 334339 454613 562526 442999 348005 -89154 -367549 -429936 184139 262117 -138969
18024 -138969 -235206 -49584 -43006 25562 -158891 -73493 -57799 133569 221262 33270 -58232
18013 -58232 18494 -84703 -226272 -130479 -242921 -395894 -302555 -238304 -338366 -516596
18003 -516596 -503857 -65610 -115144 -353573 -431570 -260324 184209 411928 367431 356825
17993 356825 -149292 -656105 -413839 -413080 -618609 -188456 -72305 258541 233794 -76203
17983g6203P090p8608p6545j12617K67545L03178J74477K6168l22341j10995M3015
17972D4164o7053J27081o4554j39411J35804j9553m8760L0120l1699k66477j47018
17961d47356j510L6477k70504R7682K22206K78495K67084J5327p1707m6376M8425
17950A28243Q8246J9321J36418n8147O7095o6249j33091j89008j60620j1471l6697
17939b15960R3763o2554M06941j67585m3779J16586j25820j01453J90252K62352
17929C52743l47205l20904j18143j60441k75170K00837L35399K75q8206J29445
17919b91370K57277k02219l55807l35800l27212j45219J70031K38603O7354J36428
17909g87934L13823n3514k5147J67662K0734j4705K26175k17626l25524Q1867
$$ plain form
17983 -76203 -69113 -147721 -224266 -336883 -69338 233840 408317 434485 112144 1149 44164
17972 44164 -22889 104192 39638 -99773 36031 16478 -32282 -2162 -33861 -300338 -447356
17961 -447356 -448866 -412389 -682893 -585211 -363005 -84510 182574 197901 126194 79818 128243
17950 128243 216489 235810 372228 314081 381176 314927 181836 -7172 -167792 -179263 -215960
17939 -215960 -122197 -184751 222190 54605 10826 127412 1592 -99861 90391 352743
17929 352743 5538 -315366 -433509 -593950 -869120 -668283 -332884 -332609 -420815 -291370
17919 -291370 -34093 -236312 -592119 -927919 -1255131 -1400350 -1230319 -991716 -924362 -787934
17909 -787934 -474111 -527625 -552772 -385110 -364376 -379081 -152906 -370532 -696056 -614189
17899f14189N96398J14704m95455q4630j02265j48591m5417L09676l0162k70898
17889g70829P826Q604K61774L58625M13736J51640k33961m60303O4014K43842
17879D4968k82925Q360J10979j97708Q8155L79320K11627l67241R4934j63137
17869g2668J56306j99624k90007j18118J2617N1355P1359L70919N06079q4295
17859D03923k42614p6221j65948k53771n7605J78432P3981R166O3027n1581J22393
17848C182N3085j23367J27987R7610O5690k12010k32493M3459r8048k18676L23724
17837a69857M59285J33679k33765l57238n7902o7796l05043J72150J62733N9174
17827b04580r4405J82999L497k7649K02618k507m3876p7558j98208N2752m1085
$$ plain form
17899 -614189 -17791 96913 -398542 -483172 -585437 -734028 -779445 -469769 -499931 -770829
17889 -770829 -763003 -754399 -492625 -134000 279736 431376 197415 -262888 -198874 44968
17879 44968 -237957 -229597 -118618 -316326 -228171 151149 362776 -4465 90469 -72668
17869 -72668 83638 -115986 -405993 -524111 -511494 -460139 -388780 -17861 488218 403923
17859 403923 161309 85088 -80860 -334631 -392236 -213804 -139823 -130657 -67630 -119211 3182
17848 3182 56267 -67100 60887 158497 224187 12177 -220316 -176857 -274905 -493581 -169857
17837 -169857 289428 423107 189342 -167896 -225798 -293594 -598637 -426487 -263754 -204580
17827 -204580 -298985 -115986 -112489 -140138 62480 59973 16097 -61461 -259669 -206917 -248002
17816b48002j79426O2451L89564J34155K6541O7568J43693M02714l8288l28261
17806D32709p8926m13146J31804m2399K84446j65660k72243L7779L53365j09245
17796A58484j60589L10438J34472j5022m36050L1111K56583J13987l2159k21940
17786A39315l96376J72778M35140k98908j07264l39434j48165L35898J95296J39025
17776A27305J47847r5861k42419j32446L2104J8156L8223q6956L1174J18945J70779
17765A26851q8203J71548r150k47060J87896k73642j69127k355R7898k57584J76803
17754b86125K38396m33982J55355J50129j95297J0094j16099m7953J93320J98866
17744a33296O9426o0431l27537L44861K29966k73029k19842K06866m21546k10463
$$ plain form
17816 -248002 -427428 -364977 24587 158742 185283 252851 396544 799258 760970 432709
17806 432709 353783 -59363 72441 30042 314488 148828 -123415 -85636 267729 158484
17796 158484 -2105 308333 442805 427783 -8267 22844 279427 393414 361255 139315
17786 139315 -257061 -84283 350857 51949 -55315 -394749 -542914 -207016 -11720 127305
17776 127305 275152 179291 -63128 -195574 -163470 -145314 -107091 -194047 -162873 -43928 126851
17765 126851 38648 210196 201046 -46014 141882 -131760 -300887 -303242 -205344 -462928 -286125
17754 -286125 -47729 -481711 -326356 -176227 -371524 -361430 -477529 -525482 -332162 -133296
17744 -133296 -63870 -124301 -451838 -106977 122989 -150040 -369882 -163016 -584562 -795025
17734g95025K48051N38675L18457R6956k63123m12606o692j88330l80027j14635
17724i58299K29606K65014J13181n9585l5325J750k686K72369J66725n15245K2865
17713d99630J51008m1254K35021J82718k82848l19625J29471L72016M3012L2888
17703B777K7121k07101k03127m69649j61850L52771J73894R8513q2027q6427L5099
17692e20006K98729J54333J7859K46268j8991J53622l55089m13181j44212L40577
17682b40091M74109l14573O8086K56574l47144k28577k1944J07511K37963k73389
17672b81475j65181R4758N0726J94695j52314P0648N9738k02745J74716L5557
17662a20877J24205n0739j06280J38115l0890K2273L6024L36160q7673m07478
$$ plain form
17734 -795025 -546974 -8299 310158 407114 143991 -268615 -275307 -463637 -843664 -958299
17724 -958299 -728693 -463679 -350498 -410083 -445408 -443658 -446344 -173975 -7250 -522495 -499630
17713 -499630 -348622 -389876 -154855 27863 -254985 -574610 -445139 -73123 -30111 2777
17703 2777 29898 -177203 -380330 -849979 -1011829 -659058 -485164 -386651 -468678 -555105 -520006
17692 -520006 -221277 -66944 -49085 197183 178192 331814 -23275 -436456 -580668 -240091
17682 -240091 234018 -80555 -12469 244105 -103039 -331616 -353560 -246049 -8086 -281475
17672 -281475 -446656 -351898 -301172 -106477 -258791 -188143 -128405 -331150 -156434 -120877
17662 -120877 3328 -47411 -153691 -15576 -46466 -24193 11831 347991 260318 -147160
17652a47160m42392p4548J31645K30131L00641m753K11297K9248k21187j04198
17642i1276J57654m0451k50150r9065J72040q8952R4507k62604l13225j1037o8798
17631h01357K84495M62208q6723J42098J38306r5670q1899J41277J12880J49348
17621C64963k20857m64807L27230L60828k05159j28885r4026l41748O3180n4908
17611c94189j7493J77031k01176L50140Q4212Q2747J81407L3813J87783k27911
17601B56364m02986l84804J9296K26083L35275R1203L57043K9644q1750l97993
17591D7375m53421K72389L21007K9952Q6010j30878k18136n4791O1559O9794j24077
17580i3217j9390l65876r5473N68122L45395Q2220j56517m54433m00306L30747
$$ plain form
17652 -147160 -589552 -664100 -532455 -302324 -1683 -6436 204861 234109 12922 -91276
17642 -91276 66378 25927 -224223 -323288 -151248 -240200 -145693 -408297 -721522 -732559 -801357
17631 -801357 -516862 -54654 -141377 721 139027 43357 -38542 102735 215615 364963
17621 364963 144106 -320701 6529 367357 162198 33313 -60713 -402461 -339281 -394189
17611 -394189 -411682 -234651 -435827 -85687 -1475 81272 262679 296492 484275 256364
17601 256364 -146622 -531426 -512130 -286047 49228 140431 497474 527118 445368 47375
17591 47375 -406046 -133657 187350 217302 303312 172434 -45702 -100493 -38934 30860 -93217
17580 -93217 -112607 -478483 -573956 -5834 339561 421781 265264 -189169 -589475 -258728
17570b58728L99137J21454k1003n0409j46790J45417K6917L4639q4230n58548
17560c92144j59955L23834M81243m7447r6665k8391l90915l52901n2986R1885
17550f24442K07074K80404M20295N6218l11767j0944J94492J34629o8761l73667
17540i6469j56672J33668N4767Q004M56606o822n50670m11727j60913J1400R6382
17529f22446K9459N1817L60308j38326K8954L30529K31789J58384j62020j26170
17519A42278j32216P2283j8535n852K1428o3312J07721j01440l08490J18477J70844
17508C186J09634l70772L3059K25102r7020j56054M6968j18885j81155N7778J72254
17497b75905M05675K69990k65956l60327L23901J21460l60847K8104J45440J68524
$$ plain form
17570 -258728 140409 261863 240860 190451 43661 189078 215995 250634 166404 -392144
17560 -392144 -552099 -228265 252978 205531 108866 80475 -310440 -663341 -716327 -624442
17550 -624442 -417368 -136964 283331 339549 27782 16838 211330 345959 277198 -96469
17540 -96469 -253141 -119473 -64706 -56702 399904 393082 -157588 -569315 -730228 -718828 -622446
17529 -622446 -592987 -541170 -180862 -319188 -290234 40295 272084 430468 268448 142278
17519 142278 10062 82345 63810 57958 79386 16074 123795 22355 -286135 -167658 3186
17508 3186 112820 -257952 -224893 209 -96811 -252865 -205897 -324782 -505937 -448159 -275905
17497 -275905 129770 399760 133804 -226523 97378 218838 -142009 -113905 31535 200059
17487B00059k53037l45849R5557K10685m1704p165J12516j28348k3205l3117J34219
17476g9389M15080N5219n7388L7184J12315R2420k91625k22339j10002j88522
17466b37047j14299k8888j34312k9232J11185J80928K61677K17936n3367l37068
17456a62487j39251N40240K13054j59177j50920K1158J7093l42737L8451n6538
17446a81114n1109M16521L2657K8595M03511L39281k1504L1712o1407L24510l2332
17435A229321J79295J69645l31415n52363m52725k85328k84597j60991O8161L60405
17425f0592j90563j61756k8920k64139K12378R3446J82222j61640j61122K17039
17415c23647L37114J21895j03700m6967J13876J64358k18266j44874J5708J38079
$$ plain form
17487 200059 -52978 -398827 -303270 -92585 -134289 -141454 -28938 -157286 -180491 -213608 -79389
17476 -79389 335691 390910 333522 370706 483021 575441 283816 61477 -48525 -237047
17466 -237047 -351346 -380234 -514546 -543778 -432593 -251665 10012 227948 174581 -162487
17456 -162487 -301738 238502 451556 292379 141459 162617 179710 -163027 -124576 -181114
17446 -181114 -232223 184298 216955 245550 649061 988342 966838 998550 937143 1261653 1229321
17435 1229321 1408616 1578261 1246846 694483 241758 -43570 -328167 -489158 -420997 -60592
17425 -60592 -251155 -412911 -441831 -705970 -493592 -400146 -217924 -379564 -540686 -323647
17415 -323647 13467 135362 31662 -15305 98571 262929 44663 -100211 -84503 53576
17405E3576l3167k2342j82501N0000K31087J28719j00979o2992r7870j54499J97912
17394F944J86865j12342n4524O5164Q6960q8663j37440r8762j22996K25013J41643
17383I7862O834J35153J63893m8280k05871j86014k54951K89360J8195k07854
17373a91673O5193J29795J59169n5333r643j90738J67673P6316O30J06889j48607
17362A09671j87563l3303K48308N4494K46854J48918K4194P511m43918k88964
17352a13798L4329r3964L7163K2759N0389m3467n5878J13550j68803J7675K86806
17341H6761N7173l23995o2094M09617n6865m57142k602M44024L05398q1253m3057
17330B75965l31123o3010J07922J65043j84825k57089p5802q1085L23630J48757
$$ plain form
17405 53576 20409 -1933 -184434 -134434 96653 225372 124393 61401 -36469 -190968 6944
17394 6944 193809 81467 26943 92107 179067 90404 -47036 -145798 -268794 -43781 97862
17383 97862 104696 239849 403742 355462 149591 -36423 -291374 -2014 16181 -191673
17373 -191673 -126480 3315 162484 107151 97508 -93230 74443 150759 151389 258278 109671
17362 109671 -77892 -111195 137113 191607 438461 587379 611573 619084 175166 -113798
17352 -113798 -79469 -173433 -136270 -113511 -63122 -106589 -162467 -48917 -217720 -200045 86761
17341 86761 143934 -180061 -242155 167462 110597 -346545 -349147 94877 400275 319022 275965
17330 275965 -55158 -118168 -10246 154797 -30028 -287117 -362919 -444004 -120374 28383
17320B8383k8615K00750K18144l15181J30055L12611j62205m55196M7126J48231
17310A24103J23183k74624k05609K0655m2566K36794J23392p2063j26919J87367
17300I3713J2754J02223j15494j3429K43873k98879k91846J43850j53912J61098
17290a16049N01296R3607N0634L03938k18782l11219k91743k28109R5125J37632
17280A6330j76220q9955k14008k11427L27124M48797L23899J34494k15146k32338
17270A11550K1165o3895R1446K9116j51050k86766k02495M703J64358L57653J71664
17259B47449k03253l85732q5252K2606K72929K45585j95383j5865l89910k97795
17249g84621K56689M74092P4474k47487j31928L24826J97111m05314l20682l13
$$ plain form
17320 28383 -232 200518 418662 103481 233536 546147 383942 -71254 -24128 124103
17310 124103 247286 -27338 -232947 -212292 -254858 -18064 105328 33265 -93654 93713
17300 93713 106467 208690 93196 79767 323640 24761 -267085 -123235 -277147 -116049
17290 -116049 385247 478854 529488 833426 614644 303425 11682 -216427 -121302 16330
17280 16330 -159890 -249845 -463853 -675280 -348156 100641 424540 559034 343888 111550
17270 111550 132715 68820 160266 189382 38332 -248434 -450929 -446226 -281868 75785 247449
17259 247449 44196 -341536 -426788 -404182 -131253 114332 -81051 -96916 -486826 -784621
17249 -784621 -527932 -53840 20634 -226853 -358781 -33955 163156 -242158 -562840 -563153
17239e63153k67415K0458M17991J89988J77283n971j29063k37405J25087j07295
17229c79495q0632P8562K13462J69470r0189j50347J98431J99228m4127q6575
17219B7788J37228K83951K1322k86183o0642J32667j93698N2401r3567M061J45464
17208A70792O2587p1803l65488N5103p2049K7763K95391J30362j25545j08009
17198h96n6987J51056J82123J71074j0874o08634l4048M9553j10388k8372K74398
17187b1995N9473n74212l74455J86821L50245J41756K07410k24720P5541K51734
17177G7598J57701m8966j06582k51332k91737j0340Q4910R1997N5603J5587Q6173
17166a39388R0446j01460K76836o5513K74463L42398J57261j98344k3006P5163
$$ plain form
17239 -563153 -830568 -810110 -392119 -202131 -24848 -30819 -159882 -397287 -272200 -379495
17229 -379495 -460127 -381565 -168103 1367 -88822 -239169 -40738 158490 114363 27788
17219 27788 165016 448967 470289 184106 123464 256131 62433 114834 21267 25328 170792
17208 170792 233379 161576 -203912 -148809 -220858 -193095 102296 232658 107113 -896
17198 -896 -57883 93173 275296 446370 435496 -173138 -207186 -157633 -268021 -296393 -21995
17187 -21995 37478 -536734 -911189 -724368 -374123 -232367 -24957 -249677 -174136 77598
17177 77598 235299 186333 79751 -171581 -463318 -473658 -388748 -296751 -241148 -225561 -139388
17166 -139388 -48942 -150402 126434 60921 335384 677782 835043 636699 613693 688856
17156F88856K14221K40230P3777j72455l03465m83172k80839L11396J6630l3586
17146B71593R1141K30661k60750J8516p4227k83649l03917K84056L32135l69305
17136f3746j23250L95021P8484k73986j56955N0519k26912k40787K43743P2125
17126b45744J80222K13954J65871j45948J0915q6207J29262L5675m28631k46416
17116d17047K20302O10965J23996J02379J07906J46317k61705k76979k16124J472
17106A41482j25602j38084K851q0143J01391Q4080O6513r2545R841k5491n7417
17095a13124K5985J40623m33937j25132P8844J34890L78788L50741J14769j71985
17085C80462n5626J53612L0073l02178k00027k74471m33459J06081M14510j51372
$$ plain form
17156 688856 903077 1143307 1217084 1044629 741164 257992 -22847 288549 305179 271593
17146 271593 362734 593395 332645 351161 276934 -6715 -310632 -26576 305559 -63746
17136 -63746 -186996 208025 286509 12523 -144432 -93913 -320825 -561612 -317869 -245744
17126 -245744 -65522 148432 314303 168355 179270 93063 222325 258000 -170631 -417047
17116 -417047 -196745 414220 538216 640595 748501 894818 633113 356134 140010 141482
17106 141482 15880 -122204 -119353 -199496 -98105 -14025 52488 -40057 -30216 -55707 -113124
17095 -113124 -87139 53484 -380453 -505585 -426741 -291851 86937 437678 552447 380462
17085 380462 324836 478448 508521 206343 6316 -268155 -701614 -595533 -181023 -332395
17075c32395j45344k18020K3939L7113o2591Q0752L80356J01284l44512o0275
17065e39693J48259J06344J64430K17119J00373J57611m64926k82623L3436m0069
17055c99739L92014L20294j32040N059j41780J9243q8640o1498r0707K36269J97595
17044B56070M4513J18098p0818k08883L07235r2219o4715r6921k08111j54891
17034a70642j59467J68030k211K1343L96544L01361j21311k64531K887K09232
17024C81235k7817l15058K7237J58738J18759L4439R2142q2170K60804J93029
17014H41338m1664l85408j93406N5032K28100m06327k6023L7115l37347l07822
17004e36412L0595M57600L20245j24967j31532M1464m06322O321N7011M75211
$$ plain form
17075 -332395 -477739 -695759 -671820 -634707 -697298 -616546 -236190 -134906 -479418 -539693
17065 -539693 -391434 -285090 -120660 96459 196832 354443 -110483 -393106 -359670 -399739
17055 -399739 -7725 312569 180529 185588 43808 63051 -25589 -87087 -177794 58475 256070
17044 256070 300583 418681 347863 138980 446215 353996 289281 192360 -15751 -170642
17034 -170642 -330109 -162079 -164290 -142947 253597 554958 433647 169116 172003 381235
17024 381235 353418 38360 65597 224335 343094 377533 469675 387505 648309 841338
17014 841338 799674 414266 220860 275892 503992 97665 71642 108757 -228590 -536412
17004 -536412 -505817 -48217 272028 147061 15529 56993 -349329 -343008 -285997 189214
16994A89214K91568k20915l2777L529Q4436k35956M842k78153j89702O86511J82436
16983D85033K33816J3429l74343l39797L976n8762J69996K59492k20483k22974
16973e0617O529J2833M74874K60520n29533k75472k785L55924J84060L0749j1542
16962D55540k74138q481M7845k05657k80518n2826J63088K4829L23547l9524l17135
16951a63430K42211M38480j57624n8609J24145k37684m25598O9364J68564J09434
16941A09253P4076k8447M25157k09076n30629J65238L41842o2476j11659K17657
16931C90936J71746k57018K83960J20305j5531n4003l6463j36121m02488k22171
16921a56848M9949M74924k15541K15944K32668n5648l2320J22372J09931K8518
$$ plain form
16994 189214 480782 259867 227090 230619 315055 79099 83941 -194212 -383914 302597 485033
16983 485033 718849 732278 357935 18138 22114 -36648 133348 392840 172357 -50617
16973 -50617 -44088 -31255 443619 704139 174606 -100866 -103651 252273 436333 467082 455540
16962 455540 181402 172921 220766 15109 -265409 -318235 -155147 -130318 193229 153705 -163430
16951 -163430 78781 517261 359637 301028 425173 187489 -238109 -168745 -181 109253
16941 109253 183329 154882 580039 370963 -159666 5572 347414 284938 173279 390936
16931 390936 562682 305664 589624 709929 694398 640395 603932 467811 65323 -156848
16921 -156848 -106899 368025 152484 368428 601096 545448 513128 635500 745431 773949
16911G73949p6073m99868k53446l6274J31930K84881O1613j27636M83445l58749
16901C83772m35018m8789K19306K52845J96704m12273N3237L95290M03702m30470
16891E78306n39752K71095n815q4893J78023L1878j8050j96224n0028J15145J03803
16880C83488l48292j90840j02521L3995p009j7473l3306L69909L17753K99549
16870G05253K10642m9621k29770j60883k04474j8865j55260m1489L03211p3526
16860B85218n6810m8191l56383J96253L77840K28866J43575k98056j66619j17802
16850A87891j71402N0027K48597J18210l42211o7120l8998J30720J00725M9365
16840B65804L33370k44856R1917N0876j73182p5129j88716j27779m02857l38040
$$ plain form
16911 773949 697876 198008 -55438 -91712 40218 325099 386712 259076 742521 383772
16901 383772 -51246 -100035 119271 372116 568820 156547 209784 605074 1008776 578306
16891 578306 38554 309649 303834 218941 396964 428842 410792 214568 164540 279685 383488
16880 383488 35196 -155644 -258165 -224170 -231179 -248652 -281958 87951 405704 705253
16870 705253 915895 866274 636504 475621 271147 252282 97022 55533 358744 285218
16860 285218 228408 180217 -176166 20087 397927 626793 770368 472312 305693 187891
16850 187891 16489 66516 315113 433323 91112 23992 -15006 115714 216439 265804
16840 265804 599174 354318 446235 497111 323929 248800 60084 -67695 -470552 -808592
16830h08592j54728P368M41232m1701K06952o0224P1348L35388L06572j82420
16820A21195Q9639K76757q1813O3631K6350k33478j90984L23079L43037O8655
16810H06068j22138m43799k25145J07172j47517j78520P7828K02463K32968j43925
16800A65455l97261k6125L0091K09626L86831l4827m81391r6199J45943J57697
16790E9840K79122j56754N3783N7537j06955J5126J7668o9685J45895k44675k04843
16779a53941N4729K48983J83912k70278j30220J14141L74402L41491J58032m0857
16769H80394k56857l4212P2452K62011j70583k35288L38636K41904J46068K904
16759A247429J28980j32555l97178P2272K12749j26523j96547l04386k53831J41568
$$ plain form
16830 -808592 -963320 -955952 -514720 -556421 -349469 -409693 -338345 -2957 303615 121195
16820 121195 210834 487591 405778 469409 495759 262281 71297 394376 737413 806068
16810 806068 683930 240131 14986 122158 -25359 -203879 -126051 76412 309380 165455
16800 165455 -231806 -257931 -227840 -18214 368617 333790 -147601 -243800 -97857 59840
16790 59840 338962 182208 235991 293528 186573 201699 219367 149682 295577 50902 -153941
16779 -153941 -99212 149771 333683 63405 -66815 47326 421728 763219 921251 880394
16769 880394 623537 589325 661777 923788 753205 517917 856553 1098457 1244525 1247429
16759 1247429 1376409 1243854 846676 918948 1131697 1005174 808627 504241 250410 391978
16749C91978J49650j74652l5411L66498j3685j37240l39194L1606n9435k44897
16739f4782m9391K88678J65760P7339J27988O7808j83084k34412L9814J06777
16729C42495k54365L83266L8204Q1922N40894K66272j69199p487k19042m6043
16719I56917K30315L25883J03444q7458j37843J9272l4160k35152l55646K00854
16709I86426r9431L6619p0768J67839j30666k1691J66940J35234j46888j02422
16699I21192l6417J92882k9529k40596M76673R7407k13101Q1869J13502j59747
16689A204135K98481K33429J7307J15321J13980J2981O2682j33580j10849P0344
16679A884231n6196Q2357M67976O3396k50733r71j77509J72940n1597L3441J53479
$$ plain form
16749 391978 541628 366976 331565 698063 684378 547138 207944 239550 180115 -64782
16739 -64782 -114173 174505 340265 417604 545592 613400 430316 195904 235718 342495
16729 342495 88130 471396 509600 591522 1132416 1398688 1229489 1222002 1002960 956917
16719 956917 1187232 1513115 1616559 1529101 1391258 1410530 1376370 1141218 785572 986426
16709 986426 886995 923614 852846 1020685 890019 868328 1035268 1170502 1023614 921192
16699 921192 884775 1077657 1048128 807532 1284205 1381612 1168511 1250380 1363882 1204135
16689 1204135 1502616 1736045 1753352 1868673 1982653 1995634 2058316 1924736 1813887 1884231
16679 1884231 1828035 1910392 2378368 2441764 2191031 2190060 2012551 2185491 2133894 2167335 2320814
16668B320814K06732o3493k26621M1758L75623j62842L2825J55206K08512j65525
16658B722989K46277O6807R8982k39641j05609j0945J75553L54487R1295k68649
16648C131546j56636N8932l6109L21944L04577j06112k07739L78870K05869k073
16638C893069k25529J70523M51630l52776L8518L84397K75835J11340q7990J77143
16628D836160r6168k18199L01657L90503N47134K81115K13903L3363k11101l76536
16618E701831N6307N80674K55022J7563k39010K32549K30183q3027K0625P84279
16608G556996L87922j61347k9849J42718J49195Q8870J12337J57547M18991K39536
16598I062916J07163L67502L46476p3725o1051K99855J99299m50258k54147j03697
$$ plain form
16668 2320814 2527546 2464053 2237432 2279190 2654813 2491971 2524796 2680002 2888514 2722989
16658 2722989 2969266 3036073 3135055 2895414 2789805 2778860 2954413 3308900 3400195 3131546
16648 3131546 2974910 3033842 2997733 3319677 3624254 3518142 3310403 3689273 3895142 3893069
16638 3893069 3667540 3838063 4289693 3936917 3975435 4359832 4635667 4747007 4659017 4836160
16628 4836160 4739992 4521793 4823450 5213953 5761087 6042202 6256105 6289468 6078367 5701831
16618 5701831 5758138 6338812 6593834 6611397 6372387 6604936 6835119 6752092 6772717 7556996
16608 7556996 7944918 7783571 7753722 7896440 8045635 8134505 8246842 8404389 8823380 9062916
16598 9062916 9170079 9537581 9884057 9810332 9749281 10049136 10248435 9798177 9544030 9440333
16588I440333l22381k39716j19029k2041N65805R42286N42374L66933J001798
16579A2156362J514461J205716K240704L226630M543456O951921J0539171J6848421
16571E9226842K6508660L3194493K3529087M749378k017291J915064P369636K949882
16563A57425751l1276687m8703504l0146374j5631338q379367n381950l402681
16556A4503850k639672j690785j327837j018941n85320m72963q22057l68944n89676
16547D987655m90730n31150m18241l94436K13654K30427o47817p03270K30448
16538B476540K38259j30087k06668n73962j65694k15990n23022l48483L19337
16529H70230M82543k22383k46489k63535l6662K15915J78185k25148j76386k92690
$$ plain form
16588 9440333 9117952 8878236 8759207 8737166 9302971 10245257 10787631 11154564 12156362
16579 12156362 13670823 14876539 17117243 20343873 24887329 31839250 42378421 59226842
16571 59226842 85735502 118929995 142459082 147208460 145191169 147106233 154475869 157425751
16563 157425751 126149064 77445560 47299186 31667848 23288481 17906531 14503850
16556 14503850 11864178 10173393 8845556 7826615 7241295 6768332 5946275 5577331 4987655
16547 4987655 4496925 3965775 3547534 3153098 3366752 3597179 2949362 2246092 2476540
16538 2476540 2714799 2584712 2378044 1804082 1638388 1422398 899376 550893 870230
16529 870230 1352773 1130390 883901 620366 583704 799619 977804 752656 576270 283580
16519B83580L99231K43439L4565l63363k78265l13138L1124K11236N9041j7363
16509B90087j32876J2460Q7458j58737L60163j06975l09683O6045Q7379j723L20342
16498E13940m4582J03007j37819l47880J2908O6668l79906P4420O7475l93053
16488d64822j71761K47945M21125J63222p7821p8326j01297J64411K14958J07974
16478D25608r9194j77418r3008j37743o8290K74007K03105J21522K9333l32244
16468A45678m4527J76913l21291j37541K7316P3954J5562J98480L17324p0653
16458C81215l8656L6211j42511J98437O2185L23145k70370p07193m8713J88313
16448a7937J89799m1063k6294L29108J08358o6821j07264n6919l13880k37904
$$ plain form
16519 283580 682811 926250 960815 597452 319187 6049 37173 248409 307450 290087
16509 290087 157211 169671 257129 98392 458555 351580 41897 107942 195321 193598 513940
16498 513940 469358 572365 434546 86666 99574 166242 -213664 -139244 -71769 -464822
16488 -464822 -636583 -388638 32487 195709 117888 39562 -61735 102676 317634 425608
16478 425608 326414 148996 55988 -81755 -150045 123962 327067 448589 477922 145678
16468 145678 101151 278064 -43227 -180768 -153452 -79498 -63936 134544 451868 381215
16458 381215 342559 378770 236259 434696 496881 820026 549656 -157537 -206250 -17937
16448 -17937 171862 130799 104505 433613 541971 475150 367886 310967 -2913 -240817
16438b40817j40582k1742P8221K32012J6002n2589k49840J54010k18212m156M63337
16427A5644m2799j20484K58828R2768k17179j70684n6121J45483K91181J71810
16417C68447J43863j23066Q2441J08008J54005l92085J19217P0158k43k22642
16407C08103m035j47585l05835j25449Q1752J28035O4022p6465l48159J42116
16397b83500K65590L35664K63702L10430j60684n08012k76582L4195J32542j99801
16387h6456J25878J06648k11561l13638N0524P8238m01592l8824J05848R9520
16377d85415P705J8798J24239j09949J38662K83832k07717j95626R8437J13847
16367b13187m2188j7496q6612k17364K18386P3766m2786J28903K62780m39741
$$ plain form
16438 -240817 -381399 -403141 -324920 -92908 -76906 -129495 -379335 -225325 -443537 -447693 15644
16427 15644 -27155 -147639 111189 203957 -13222 -183906 -240027 -94544 196637 368447
16417 368447 512310 389244 471685 579693 733698 341613 460830 530988 530745 308103
16407 308103 304068 156483 -149352 -274801 -193049 -65014 -992 -77457 -425616 -283500
16397 -283500 -17910 317754 581456 891886 731202 223190 -53392 -19197 113345 -86456
16387 -86456 39422 146070 -65491 -379129 -328605 -250367 -651959 -690783 -584935 -485415
16377 -485415 -477710 -458912 -334673 -444622 -305960 -22128 -229845 -425471 -327034 -213187
16367 -213187 -255375 -272871 -359483 -576847 -358461 -284695 -327481 -198578 64202 -375539
16357c75539J99833L5672Q9131P2004k13898m7118o8595J98174M3174N9081K96403
16346B88322l01920n71493O0421J91228n8443q3230R7319O44363k125k18001k77255
16335b30814j38652k03983J31722L66353J91659k68585k09926P3438j73747K75873
16325a86662J32290j90187Q6073N0834J8071K00027k33599k48873K22668P1827
16315g7531Q0140K41421m6045k39487j38421k64745k10464o0890j54901L44281
16305e26642J51104k6490k01548K54015M22081j00640R1017L08219j47107l74658
16295a50649p6460r0715J1600m0616J1323j69583j94655L68857N59323k15765
16285A2660l54671j77879l7513j1064K76235J36447k38860L4131M57883K38806
$$ plain form
16357 -375539 -175706 -140034 -50903 21101 -192797 -239915 -308510 -110336 -67162 -8081 288322
16346 288322 -13598 -585091 -524670 -333442 -391885 -475115 -377796 266567 264442 46441 -230814
16335 -230814 -369466 -573449 -441727 -75374 116285 -152300 -362226 -288788 -462535 -186662
16325 -186662 -54372 -244559 -158486 -107652 -89581 110446 -123153 -372026 -149358 -77531
16315 -77531 2609 244030 197985 -41502 -179923 -444668 -655132 -716022 -870923 -526642
16305 -526642 -375538 -402028 -603576 -349561 72520 -28120 62897 371116 224009 -150649
16295 -150649 -227109 -317824 -306224 -346840 -335517 -505100 -699755 -330898 228425 12660
16285 12660 -342011 -519890 -557403 -568467 -292232 -155785 -394645 -360514 97369 336175
16275C36175m7666M4733j56641j8517K5492l2832q3212j84649J28098J54372M240
16264A69593k58685j56905j36555N7832R424L91212J7440j26795k30465p5767
16254c39671r6705J08432K34915L61670j18892j74702j00910j29811j82211O3043
16244c74842L53947M20020m9852r686j20338l7920J9398m1442k56694l1588J2532
16233a16465R4673q322j07001k89010m59081J16372P75478J70873j33682k23789
16223a79954j5064J00742L18646K11625o8145p4387J6550k2086j70308q7795L65967
16212C95791K39959j93807m50757K17972j05874n90466o3792J43795N13432K09276
16202C15529j92699j55186R7561L38662n2479j57341K39185l6295l94255o9668
$$ plain form
16275 336175 288509 333242 176601 158084 183576 150744 67532 -117117 10981 165353 169593
16264 169593 -89092 -245997 -382552 -324720 -315296 75916 93356 -33439 -263904 -339671
16254 -339671 -436376 -327944 -93029 268641 149749 -24953 -125863 -255674 -437885 -374842
16244 -374842 -20895 399125 349273 339587 219249 181329 200727 159285 -97409 -128997 -116465
16233 -116465 -21792 -30114 -137115 -426125 -885206 -768834 6644 177517 43835 -179954
16223 -179954 -195018 -94276 224370 435995 367850 293463 310013 287927 117619 29824 395791
16212 395791 635750 441943 -8814 209158 103284 -487182 -550974 -407179 106253 315529
16202 315529 122830 -32356 65205 403867 351388 194047 433232 396937 2682 -66986
16192f6986Q9667J29031O5283q9237q6909L5950p364l35756n2963L24596N8364
16181F3676k17726Q0155O5104J89418L93470j66244p16858l98933K15261O4799
16171d27878m7048k35516j29751Q3386j42177j03015M02898k16864j04996l2804
16161i53765K49332L70475k10026N4172J69870R7800K22287L98059J19670k84497
16151B33377j78775L9395l68693j92754Q3108R8689j29018L51138K46875N0992
16141B34334J5271Q8789J34728j37439r9936J37652k79338k52896o4558k91736
16131e15129J16953M9920n9993J46127k5048L38888J83536J46456l9359l03502
16121C8849J61883K33980j35918j56540r4459L9469k54320j83308j05843J6257
$$ plain form
16192 -66986 22681 151712 216995 127758 40849 76799 69435 -266321 -319284 5312 63676
16181 63676 -154050 -73895 -8791 180627 574097 407853 -309005 -707938 -492677 -427878
16171 -427878 -474926 -710442 -840193 -756807 -898984 -1001999 -599101 -815965 -920961 -953765
16161 -953765 -704433 -333958 -543984 -489812 -319942 -222142 145 398204 517874 233377
16151 233377 54602 93997 -274696 -467450 -384342 -285653 -414671 -63533 183342 234334
16141 234334 249605 338394 473122 335683 235747 373399 94061 -158835 -223393 -515129
16131 -515129 -398176 -348256 -408249 -262122 -287170 51718 235254 381710 342351 38849
16121 38849 200732 434712 298794 142254 47795 87264 -167056 -350364 -456207 -439950
16111d39950Q1176L41626K43416J77699k22046j94932q1365k10906K21360K62708
16101A78786J01680M6772l84129m71600K55376J99062L03254j8791l68531K0681
16091a37440j21775j99213J3819j56005L9525K985R3308q2366J78237N49504J0177
16080A90756j54105k39121m9835J32160K70773K63339M5954l35081P2839Q7070
16070B84749J5032P75l01263m02169J60016j4404l15085K68332K4765K33967M05216
16059C59931P9221k4954p9780l0522j7811R2179K23011m15677l75610j59844j15125
16048d64981K40204k6810O4870M51758L22295j09905l69933j67633o6980l92281
16038e19396k66004J15808M56596J98514J82316L78806N861j40509k50033j5488
$$ plain form
16111 -439950 -358774 -17148 226268 403967 181921 -13011 -94376 -305282 -83922 178786
16101 178786 280466 327238 -56891 -528491 -273115 -74053 229201 210410 -158121 -137440
16091 -137440 -259215 -458428 -444609 -600614 -561089 -558104 -464796 -547162 -368925 180579 190756
16080 190756 36651 -202470 -252305 -120145 150628 413967 459921 124840 197679 284749
16070 284749 299781 300556 -707 -402876 -242860 -257264 -572349 -304017 -279252 -45285 359931
16059 359931 439152 414198 334418 303896 286085 378264 601275 185598 -190012 -349856 -464981
16048 -464981 -224777 -251587 -186717 265041 587336 477431 107498 -60135 -127115 -519396
16038 -519396 -785400 -669592 -212996 -14482 167834 546640 552501 411992 161959 146471
16028A46471j92595n1539l5322O8839j02385J17812J42283J9969J40113J25803
16018C79449m50052n8263K6927J67995j48873O7460L11976L18732l39402j5830
16008B60119O3348K80768K04974Q3840l00771n49222O5915M34692p7779k50167
15998B15717l14608J49480L51378J71560k08086K15211L539l03879j00945K19870
15988C99237J09617J00338p7510r7612J17698q4998k16864k78913k28125N5652
15978b01480P1816j53856n90M24844N53766L92672L9068m04507J87942M38333
15968A348008L12052n1023k19746n88853k48985k86057l12969j3640j0180K14897
15958A43504k25285L22176J73344j42525j33343l7578k03949j63858m4692Q8558
$$ plain form
16028 146471 -46124 -97663 -132985 -64146 -166531 -48719 93564 113533 253646 379449
16018 379449 -70603 -128866 -101939 66056 -82817 -15357 296619 615351 275949 260119
16008 260119 323467 604235 809209 893049 592278 43056 108971 543663 465884 215717
15998 215717 -98891 50589 401967 573527 365441 580652 584191 280312 179367 399237
15988 399237 508854 609192 531682 434070 551768 466770 249906 -29007 -257132 -201480
15978 -201480 -129664 -283520 -284110 140734 694500 1087172 1126240 721733 909675 1348008
15968 1348008 1660060 1609037 1389291 800438 551453 265396 -47573 -61213 -71393 143504
15958 143504 -81781 240395 413739 271214 137871 100293 -103656 -267514 -312206 -223648
15948b23648J93946k00113j71324K7055J32444J41351K68775Q6604o1953r7202
15938I5935J65120M7291N2263r9839j27649J16507K29853Q1729j68376j58034
15928B34800J53796J2277K1793R5506j76565n302j20344l14077K58971k84471
15918a23616j23742L77994K01846j85224J14278o71J34765P8878K1898k04197
15908B92209k29444K00272q1844j67100l83123j48477K86466M1176p8359K67808
15898d16K91182j01933k89440K60048K32625k02283n90475L64893J30062K29891
15888C24154j2555n11091k14638k29990R5290M41963J25365j19119l7770J60048
15878B1657J11606k43339k34116k90703k4606Q6557J55433J3454j30352j33674
$$ plain form
15948 -223648 -29702 -229815 -401139 -374084 -241640 -100289 168486 255090 193137 95935
15938 95935 261055 308346 360609 260770 133121 249628 479481 561210 392834 234800
15928 234800 388596 400873 422666 518172 341607 336305 215961 -98116 160855 -123616
15918 -123616 -247358 130636 332482 147258 261536 260865 395630 474508 496406 292209
15908 292209 62765 263037 181193 14093 -369030 -517507 -231041 -189865 -268224 -416
15898 -416 290766 188833 -100607 159441 392066 189783 -400692 -35799 94263 324154
15888 324154 311599 -199492 -414130 -644120 -548830 -106867 18498 -100621 -138391 21657
15878 21657 133263 -110076 -344192 -634895 -659501 -572944 -417511 -404057 -534409 -668083
15868f68083J12813M59644J29379o2840k17491k50449k91275L03799L54152J26508
15858c843j10090N2092Q1809L8381O2029L55464m2566m42942j09662j53270j42686
15847d15284j22795O8291N87922K33306R3229K2406k87707l11925o4503M65823
15837B68763r9413l36875j03394Q5928L94885K9346k26590m67982L1647J33182
15827b90503O3660m3190P5471K12729j62203n01966M5651L7205q3666J72329j22412
15816e96895l49326O80379L38326n8017O7561p8995k18868j68550k35633K08725
15806d11293L64009R3699J06687o5795N2445J5284k39183l7940L5222K83657K8262
15795B25054N482K25405N3578j68601J5050K15841r2510k30354k39532L29991
$$ plain form
15868 -668083 -555270 -95626 33753 -29087 -246578 -497027 -788302 -484503 -130351 -3843
15858 -3843 -113933 -61841 19968 58349 120378 475842 433276 -9666 -119328 -272598 -415284
15847 -415284 -538079 -469788 118134 351440 444669 467075 179368 -132557 -197060 268763
15837 268763 169350 -167525 -270919 -184991 209894 239240 12650 -455332 -423685 -290503
15827 -290503 -226843 -270033 -194562 18167 -144036 -646002 -600351 -563146 -646812 -474483 -596895
15816 -596895 -946221 -265842 72484 14467 82028 3033 -215835 -384385 -620018 -411293
15806 -411293 -47284 46415 153102 87307 139752 155036 -84147 -122087 -86865 196792 225054
15795 225054 230536 455941 509519 340918 355968 571809 479299 248945 9413 339404
15785C39404k18450k07607j74942m9897m5233Q9189K05834O15810N5721L3726
15775F43555j4836j32390J16296k12964k42937l68893N5774j342L23690N36491
15765G02444j88657l39744k69283m46991r9021K7974j9741J40458J00894R3369
15755b98298O9781Q1995J89481k25862j56107K32890n0800N5429o2597j08333
15745b72421j09161Q665R7209J49266K6147j76272j18212j2406m4300l2478R9618
15734c84345L40010M2469J22735r0099K34060n3514n6196r7174l74029k22947
15724e39030j58966M8664K62997j80470j01753N8446K21620p7821O2912L26775
15714g6626J45184k51195J83233O8408j07783j99579J2783K06004J5770m0851
$$ plain form
15785 339404 120954 -86653 -261595 -311492 -356725 -267536 -61702 554108 609829 643555
15775 643555 628719 496329 612625 399661 156724 -212169 -156395 -157737 165953 702444
15765 702444 513787 174043 -95240 -542231 -641252 -613278 -633019 -492561 -391667 -298298
15755 -298298 -228517 -146522 42959 -182903 -339010 -106120 -156920 -101491 -164088 -272421
15745 -272421 -381582 -372917 -275708 -126442 -100295 -276567 -394779 -407185 -451485 -483963 -384345
15734 -384345 -44335 -1866 120869 30770 264830 211316 155120 57946 -316083 -539030
15724 -539030 -697996 -649332 -386335 -566805 -668558 -610112 -388492 -466313 -403401 -76626
15714 -76626 68558 -182637 596 69004 -38779 -238358 -225575 -19571 -3801 -44652
15704d4652j64909k12127K27188L09114O3972M01482j42097j37416O9019m2715
15694C26859k12971k69804j11098K37715K10087j33991j41591l35909o0660J96018
15684b95345J94263j48779j53039j13077Q4291K73887M44266N1560R7483l24625
15674A10885j64856q6577K28066M10878L3222l06099m17841m1942J99472O71n1410
15663h5531K8637K86624K04404J13801j32764k56433l15231N1167P1998K50276
15653B16948l15672q8504m27056L27362M60774k72886K0968J30267r6798k99721
15643c44318l55575j40713J13068L63003J63377M7178J74385K50605J13799l50071
15633C4738j94853o5074J9580L52319K49615M7071j59502m15369j29571N38330
$$ plain form
15704 -44652 -209561 -421688 -194500 114614 178586 580068 437971 300555 369574 326859
15694 326859 113888 -155916 -267014 -29299 180788 46797 -94794 -430703 -491363 -295345
15684 -295345 -101082 -249861 -402900 -515977 -431686 -157799 286467 338027 435510 110885
15674 110885 -53971 -140548 87518 498396 531618 225519 -192322 -234264 -34792 -34121 -85531
15663 -85531 -56894 229730 434134 547935 415171 158738 -156493 -105326 -33328 216948
15653 216948 -98724 -187228 -614284 -286922 173852 -99034 -78066 52201 -44597 -344318
15643 -344318 -699893 -840606 -727538 -364535 -201158 -153980 20405 271010 384809 34738
15633 34738 -160115 -225189 -205609 146710 396325 443396 283894 -131475 -261046 277284
15623B77284L59902m27588l86997n6213K89270o1337P8745j46840L81582j38741
15613A69067l75858J73907q852J4947J58084L2814M466k05531j0989n6J57953
15602A09952n5956J6505m7781K1615o5098J37842n1907j8543l07815M447n3938
15591c10677J23756K38599J33301K2357j53129j93072K8690k8432o2851J4916
15581a86542J47078l0233l07985M3940N81690M4345j00571J11301L79899q4703
15571E98219k9710j38358m79002k43239K1857R0389m4035o4692L7109K76905Q2689
15560A08132j40495j22594R6607L97767l78499j93438K58082L31116J86008l96945
15550A45741j0652j92210j69089j32343J25578Q3743K59613j90550j87616J76351
$$ plain form
15623 277284 637186 209598 -177399 -233612 55658 -5679 73066 -73774 307808 169067
15613 169067 -206791 -32884 -41736 -26789 131295 164109 168575 -36956 -47945 -48001 109952
15602 109952 53996 70501 22720 44335 -20763 117079 65172 46629 -261186 -256739 -310677
15591 -310677 -186921 51678 184979 207336 54207 -138865 -110175 -138607 -201458 -186542
15581 -186542 -39464 -69697 -377682 -333742 247948 292293 191722 303023 682922 598219
15571 598219 568509 430151 -48851 -292090 -270233 -179844 -223879 -288571 -251462 25443 108132
15560 108132 -32363 -154957 -58350 339417 -39082 -232520 25562 356678 542686 145741
15550 145741 135089 -57121 -226210 -358553 -232975 -149232 110381 -80169 -267785 -91434
15540i1434J64189r1177l6397l0127O0961J66997r5300q2569k13955j03886K54979
15529i7719J06316o2459R1296L1575r851k46545p8141M4009J28298j80180l89206
15518f62607k363L61770K57350P9284m85796k9948M05590n2876k24511j89065
15508e43172r1930Q8495K28565J25862O9948J65351K52730q3834K88943n2777
15498D48181k26193R2144M78623M9938j81347k56810L246M9081m47169l89031
15488c79337K11357M0996m3885k30094J48986J79273K70569K19174L29263l3580
15478G12722Q2116k24703r9307l73462k77095j72063K6675K19872r8708K00254
15468c699J82775j99342k93202l40141K57588p427O9960L37060m4828L7136j74672
$$ plain form
15540 -91434 72755 -18422 -54819 -84946 -23985 143012 47712 -34857 -248812 -352698 -97719
15529 -97719 8597 -53862 37434 69009 59158 -187387 -265528 -221519 -93221 -273401 -662607
15518 -662607 -664970 -303200 -45850 33434 -452362 -482310 -76720 -129596 -354107 -543172
15508 -543172 -635102 -546607 -318042 -192180 -122232 43119 295849 212015 500958 448181
15498 448181 221988 314132 792755 842693 661346 404536 407782 456863 9694 -379337
15488 -379337 -167980 -126984 -170869 -400963 -251977 -72704 197865 417039 746302 712722
15478 712722 794838 570135 470828 97366 -179729 -351792 -325117 -105245 -203953 -3699
15468 -3699 179076 -20266 -313468 -653609 -396021 -403448 -333488 3572 -41256 -4120 -178792
15457a78792j48370M2241J6816k4901r4610J86840M5961K64770J3168k92781N6833
15446a12825L4697J65964p2199l27690j89590J28579J84159j29093K47151K29940
15436A59093L39098m7018j89996j7484j58932M9707K02549K75120n41448m5794
15426B4895O1047M4327O5095L40798R6607j85131L5380j08073j71953k1952n671
15415A75369L9469k2664l58512p6410r1037J90824K50502J40141M9990k00321
15405I7351K112M26055L459r9806k42699j39367l57934R3738N19973J44773k73872
15394A73783j02997J07575K83304L34397J53027k67457k83020o3811Q804K9618
15384C73223j99026j85827j6798J11457j87749J10457J86213j03129J77417k69726
$$ plain form
15457 -178792 -327162 -284921 -268105 -293006 -387616 -200776 -154815 109955 123123 -169658 -112825
15446 -112825 -78128 87836 15637 -312053 -501643 -373064 -188905 -317998 -70847 159093
15436 159093 498191 451173 261177 243693 84761 134468 337017 612137 70689 24895
15426 24895 85942 130269 195364 536162 632769 447638 483018 374945 202992 181040 175369
15415 175369 214838 192174 -166338 -242748 -333785 -142961 107541 247682 297672 97351
15405 97351 99463 525518 528977 429171 186472 47105 -310829 -217091 302882 447655 173783
15394 173783 70786 178361 461665 796062 949089 681632 398612 334801 343605 373223
15384 373223 174197 -11630 -28428 83029 -104720 5737 191950 88821 266238 -3488
15374c488j48820L61460K36123k42285j38151K27716l10853L9178J27049J41754
15364B89683l9826J9502j17957k02459p9667J88051P7434l01396k83691j1128
15354d61454l583M80265M24999j11363m04433j22349k56814M21059M97131lJ28029
15343E91484M8386k76394k57763q8222j49471J63501j9974K5574j36104L66617
15333B67634K52681l50109j47630M2143l47989j76326J59666N4313j12436J04033
15323b54020p18J90317L1226p6367k72523l41633M7676L00824K44073K11551J63948
15312B44354l0620o364l3262j62879k0409j59941J03744R4540k573M3376K67854
15301C37820K10823L2164k00932l67436O2499j42027l25355j30845K06679M32325
$$ plain form
15374 -3488 -152308 209152 445275 202990 64839 292555 -18298 20880 147929 289683
15364 289683 249857 269359 151402 -51057 -130724 57327 134761 -166635 -450326 -461454
15354 -461454 -465037 15228 440227 328864 -75569 -197918 -454732 -33673 463458 463455 591484
15343 591484 639870 363476 105713 17491 -131980 31521 11547 37121 -98983 267634
15333 267634 520315 170206 22576 64719 -283270 -459596 -299930 -245617 -358053 -254020
15323 -254020 -254738 -64421 -33195 -109562 -382085 -723718 -676042 -375218 -131145 80406 244354
15312 244354 213734 207370 174108 11229 -9180 -169121 -65377 29163 26590 69966 337820
15301 337820 548643 580807 379875 12439 74938 -67089 -392444 -523289 -316610 115715
15291A15715M95305j99539j93128m5571l39214K41336J5078K9427Q4359Q0373
15281B84141K6171P5059N8140k23230j44647J73770R6774j38463k67026K07657
15271A48346O3901l5515J34623j39184J08925L49145n30387k23815R0670R4256
15261F0965j1341p1699m15395o05171N25975N51490k7817j07213R8970p3574J5833
15250e8977j750M8117P3020j406M08708M65530l90193o83758k21126q6044J36090
15239c11789j05367J66935L35455J06335K61093O7940K7940r352K90276K9448
15229H58914m39962k73782M4787J34291J69630n5619k58671j37521L19260q0256
15219B81071l5300j0434k02510o9105r1564j2385J60195L20359J68900j04481
$$ plain form
15291 115715 611020 411481 218353 172782 -166432 74904 89982 119409 203768 284141
15281 284141 310312 385371 443511 220281 75634 249404 346178 207715 -59311 148346
15271 148346 212247 176732 311355 172171 281096 630241 99854 -123961 -33291 60965
15261 60965 49624 -22075 -437470 -1042641 -516666 34824 7007 -100206 -1236 -74810 -58977
15250 -58977 -60727 -12610 60410 59004 467712 933242 543049 -140709 -361835 -447879 -311789
15239 -311789 -417156 -250221 85234 191569 452662 520602 548542 539190 829466 858914
15229 858914 418952 145170 189957 324248 493878 438259 179588 42067 361327 281071
15219 281071 245771 235337 32827 -36278 -127842 -140227 19968 340327 509227 404746
15209D04746J97509j49851k61927J7798j06285l54985j37650K29529K07750K75084
15199C21718j10167N8718Q1201j89174j33908R1521j86455m84959m2626L15949
15189b78182M85213m0500r0813m6146J87720p267L33201J53372n54315k07125
15179f4842Q0413m7779J23993r224r4185j5227N5430O27960M7940p1402l57130
15168B75947r6050J2211p6665J20692K57475K77363R8785n77692l35365n6623
15158i9922K39387J27357J4031J96420M33441j36139m94129j58841j78365Q3921
15148B7161L31155J12418J51880r0333j54045k86258J37479j53188k71564m6242
15138b41537P3670j53523j17091R6419J17074j66444m43406L49564L36249j25349
$$ plain form
15209 404746 602255 452404 190477 208275 101990 -252995 -390645 -161116 46634 321718
15199 321718 211551 270269 351470 162296 28388 119909 -66546 -551505 -594131 -278182
15189 -278182 207031 166531 75718 29572 217292 210025 543226 696598 142283 -64842
15179 -64842 15571 -32208 91785 82561 -11624 -26851 28579 656539 704479 633077 275947
15168 275947 179897 192108 115443 236135 493610 770973 869758 292066 -43299 -99922
15158 -99922 139465 266822 280853 477273 910714 774575 280446 121605 -56760 27161
15148 27161 358316 470734 622614 532281 378236 91978 229457 76269 -195295 -241537
15138 -241537 -167867 -321390 -438481 -342062 -224988 -391432 -834838 -485274 -149025 -274374
15128b74374j62496K29028j67088j27080M85047K74623K4049L23212N9546k30246
15118D34221j57450l20663J01761K72373m8312J13685k12340j68866J02098m5351
15108G1156K7436l00657M3427M81274J23806k08997k45541l08364j54431M6261
15098d24630L96194N9468k79101m46222j71370r3076J18035K4275l5959L77313
15088d75073M75485m5673q5377j12794K59460J05608k42883q6130K03575m2476
15078d6278k72847Q6682l8441o8575j79468n0226J87221M1235M6917L05249N50417
15067E61886J39491j74661O0709m668m76792j63455J59217j84342l31545L77029
15057c7131K5388j55088k45926L80849M09214j60890j00359p3183n3250l12309
$$ plain form
15128 -274374 -436870 -207842 -374930 -502010 -16963 257660 281709 604921 664467 434221
15118 434221 276771 -43892 57869 330242 281930 395615 183275 14409 116507 71156
15108 71156 98592 -202065 -158638 322636 446442 237445 -8096 -316460 -470891 -424630
15098 -424630 -28436 31032 -248069 -694291 -865661 -958737 -840702 -816427 -852386 -475073
15088 -475073 412 -45261 -130638 -243432 16028 121636 -121247 -207377 -3802 -46278
15078 -46278 -319125 -232443 -270884 -339459 -518927 -569153 -381932 -340697 -293780 11469 561886
15067 561886 701377 526716 587425 582757 105965 -57490 101727 -82615 -414160 -37131
15057 -37131 -11743 -166831 -412757 -31908 377306 216416 116057 42874 -10376 -322685
15047c22685l52290J0757K98457P2413j90618J68337j41334J1925L32605M75897
15037C63464m80974M0264L68730k20638j85805J66065J93437J66895m5329j72491
15027A93618p1603j17349p08J23115l43158K1789K03241N909j00228j02467l7306
15016b25147K65505L19918R7372N5011j37852k72215J37135K51308k23118l99186
15006a31269k21561k06048N30R664J48532K85994K38200m91365j74338J39660
14996d02001J26262L88991J84033m29015k61566K76668j4442j76199j31923J25039
14986c14153K38977j88419J05047j13753J45170J02022k1434L6672O372l6864
14976d0363M8168J20000m1017l612J73632l9050k819J49219j10138N2839M0987
$$ plain form
15047 -322685 -674975 -664218 -365761 -293348 -483966 -315629 -456963 -445038 -112433 363464
15037 363464 -117510 -77246 291484 70846 -114959 51106 244543 411438 366109 193618
15027 193618 122015 4666 3958 127073 -216085 -194296 8945 14854 -85374 -187841 -225147
15016 -225147 40358 360276 457648 512659 374807 102592 239727 491035 267917 -131269
15006 -131269 -352830 -558878 -558348 -548684 -400152 -114158 124042 -367323 -541661 -402001
14996 -402001 -275739 113252 297285 -131730 -393296 -116628 -131070 -307269 -439192 -314153
14986 -314153 -75176 -263595 -158548 -272301 -127131 -25109 -46543 -9871 -3499 -40363
14976 -40363 7805 127805 86788 83176 256808 217758 214939 364158 254020 306859 347846
14965C47846p0617l30093k22659Q8298R6172J54681J38192J14377r1078m6751
14955A78368k45886p7517q2986M0617K02069o38j9138P4784J2903J62588q227
14944B36937j59400j67523k03781j31483L13836Q911o3400J23979K27541P7536
14934B63153J59798n5669m66397N4677p5329l05997L66063j51349m55602k12968
14924h79620K36751L7886J01072L67771K04613k52016J23512J55490K40462J0937
14914C46858j66312k9227k7808j70751j96560K96562M84780J49857k09188j05341
14904C72870K7218j35227l59311K05760K10897k00214l46009l36343J8154M83264
14894e8941q5649R491L21216J62406q0537j34336J48155j71660l0065p5624k50906
$$ plain form
14965 347846 277229 -52864 -275523 -187225 -91053 63628 201820 316197 225119 178368
14955 178368 -67518 -145035 -228021 -187404 14665 14027 -5111 69673 82576 245164 236937
14944 236937 77537 -89986 -293767 -425250 -111414 -102503 -165903 -41924 185617 263153
14934 263153 422951 367282 -99115 -44438 -119767 -425764 -59701 -211050 -666652 -879620
14924 -879620 -642869 -604983 -503911 -136140 68473 -183543 -60031 95459 335921 346858
14914 346858 180546 151319 123511 -47240 -243800 52762 537542 687399 478211 372870
14904 372870 400088 264861 -94450 111310 322207 121993 -224016 -560359 -542205 -58941
14894 -58941 -144590 -135099 186117 348523 267986 133650 281805 110145 80080 4456 -246450
14883b46450Q5931J43960j33482J91454K22347q1290j10056j24130Q3969j08242
14873g5989j12137Q0757j8244j49276k02783l5600J82998N7550l78980j4763L30129
14862c36338j14440j87716L42054p9244o7221P6102K40898k01327l95424K21586
14852e01070L93273J09171l8913P5438J28731J83427j48495m10003q6661k0984
14842c16086n0398n8860J94767O64126K27958k24761m62338o9883J08538j35265
14832a22202r2772q7846J97710J25746j16927P5882j47737j2630K14661K33415
14822B67300J7165L00121J79928O5900j99038k62404K36983M2277m62411L38834
14812E24655L59140k16607l20195O986J22220L3439l34499r4600J65709j31596
$$ plain form
14883 -246450 -160519 -16559 -150041 41413 263760 182470 72414 -51716 32253 -75989
14873 -75989 -188126 -107369 -125613 -274889 -477672 -513272 -330274 -272724 -651704 -666467 -336338
14862 -336338 -450778 -638494 -296440 -375684 -442905 -366803 -125905 -327232 -722656 -501070
14852 -501070 -107797 1374 -37539 37899 166630 350057 201562 -208441 -295102 -316086
14842 -316086 -366484 -425344 -230577 433549 661507 436746 -25592 -95475 13063 -122202
14832 -122202 -214974 -302820 -105110 20636 -96291 -20409 -168146 -180776 33885 267300
14822 267300 284465 584586 764514 830414 631376 368972 605955 648232 185821 524655
14812 524655 883795 667188 346993 353979 476199 509638 175139 80539 246248 114652
14802A14652K6278K67958J8281n4217J11566J75612l43082K67145K99570k10852
14792F72911k68771k31464j26822O2966J1107O6348n279l1464j33445J12290J48962
14781B77339k57938M9186k54932J28523n7090j83891L4026Q9394j20248Q3827
14771b11804J36488j93583J10993L69858K42678k13656j11865j27448j04928K16689
14761A13422J53067k6523L48421L42911k02885j81312r1648J50244k94712Q2697
14751C93682r9678j77554j6229j29570j66609M20129K57960k69805J14895j45522
14741A81699l06372K29160j59257j53915O5090m2766M9218J88097j93711L05283
14731A62526L06720m17154Q4445N4115r6844K84444K594M8120j6968N9230l26575
$$ plain form
14802 114652 140930 408888 427169 372952 484518 660130 317048 584193 883763 672911
14792 672911 404140 172676 45854 108820 119927 186275 180996 149532 16087 128377 277339
14781 277339 19401 68587 -186345 -57822 -114912 -298803 -264777 -175383 -295631 -211804
14771 -211804 -75316 -268899 -157906 211952 454630 240974 129109 1661 -103267 113422
14761 113422 266489 239966 588387 931298 728413 547101 455453 605697 310985 393682
14751 393682 294004 116450 100221 -29349 -195958 224171 482131 212326 327221 181699
14741 181699 -124673 104487 -54770 -208685 -143595 -186361 -137143 50954 -142757 162526
14731 162526 469246 52092 136537 190652 93808 378252 380846 428966 411998 471228 144653
14720A44653J77622j33695k45717J93044L92618k1031l35653r6759l85L25069
14710C99766O8733j08586J16764k27835k55890j64620L03833N3552K37195J23051
14700E45963J31812K55168j18241L89663K80568R107k74784R048r4744n10807
14690F22753j5644o2921l73636k635j35870l72515K30728K33904J1943M23237
14680E59344K3766m26379o8944m8764k7834j98992M7319L29048j93819n6177J50078
14669H8646L8807K89443K95486p9348j57141k30311j01478J66315j43057l656
14659A63706K70250m322K47806L75457j7830j97659k10503r3328k27534n1231
14649B54812k51044k05269J18031K79534J37948j23226J8038j66133K5702j19636
$$ plain form
14720 144653 322275 188580 -57137 135907 528525 507494 171841 75082 74697 399766
14710 399766 468499 359913 476677 248842 -7048 -171668 132165 185717 422912 545963
14700 545963 677775 932943 814702 1204365 1484933 1494040 1219256 1228304 1133560 622753
14690 622753 607109 544188 170552 167917 32047 -340468 -109740 124164 136107 559344
14680 559344 583110 156731 87787 39023 11189 -187803 -140484 188564 -5255 -61432 88646
14669 88646 127453 416896 712382 633034 475893 245582 144104 310419 167362 163706
14659 163706 433956 429634 677440 1052897 1035067 837408 626905 533577 306043 254812
14649 254812 3768 -201501 -83470 196064 334012 210786 228824 62691 88393 -31243
14639c1243K60410K15907Q0986Q7631k86377j46034j11697N7284O8285j97093
14629a941J34743L32649J08781k30973k46688m04270j75164J99679L94631J27257
14619B38704l16729J64119J56741j62969p9650P8504L38128M38330K5411p8182
14609H02407l87700k12696K68664J34718j47325k18361j83845l99305m06059J15334
14599f34168R7931K3587M66502N50229j23534j0370j21791k26068K67125P9244
14589C68687J1115J49847n9470l02412l48511k1338L72932K69798O0229J03138
14579F04015k44663J58652k15341l97048r0276K38571J34092j14173j22123n5513
14569a03807L86408j33405k71530l5111J02252k19301k8171J27946J3757M82043
$$ plain form
14639 -31243 229167 445074 526060 613691 327314 181280 69583 126867 195152 -1941
14629 -1941 132802 465451 574232 343259 96571 -307699 -482863 -283184 111447 238704
14619 238704 -78025 86094 242835 79866 216 78720 416848 855178 880589 802407
14609 802407 414707 202011 470675 605393 458068 239707 55862 -343443 -749502 -634168
14599 -634168 -536237 -512650 -46148 504081 380547 370177 248386 22318 289443 368687
14589 368687 379802 529649 470179 167767 -180744 -202082 170850 440648 500877 604015
14579 604015 359352 518004 302663 -94385 -184661 53910 188002 73829 -48294 -103807
14569 -103807 282601 149196 -122334 -157445 -55193 -274494 -302665 -174719 -160962 321081
14559C21081K66646J36247k6934k24096k78915j53331J22285L8406m5910m4778
14549A10701L4439K18178M7667k20103j12650L1429O2157j8975K60762K62122
14539F75727k18690j6403r5957j1644j1345j79680o44586j45798N1390j08970
14529g05956K54193O15248M97732k87940P6312K04845k83599J24618L79391n6114
14519H18730m85902l74721j45879J38399L64673J95470K43815j07599k53146n2830
14509C41010l1616O0657M13394M3286k92434k06704l42089j19950o3882m9727
14499b48055m8153J56466l0737K31950J12842q5695M5436J30077K99830M48605
14489A012566k5194n382j49147l16281k10211L33208Q8349j89952j53771M8348
$$ plain form
14559 321081 587727 723974 697040 472944 194029 40698 162983 201389 155479 110701
14549 110701 145140 363318 410985 190882 78232 109661 171818 152843 413605 675727
14539 675727 457037 440634 344677 333033 321688 142008 -502578 -648376 -596986 -705956
14529 -705956 -451763 163485 661217 373277 449589 654434 370835 495453 874844 818730
14519 818730 332828 -41893 -187772 -49373 315300 510770 754585 646986 393840 341010
14509 341010 309394 370051 783445 826731 534297 327593 -14496 -134446 -198328 -248055
14499 -248055 -296208 -139742 -170479 61471 174313 88618 134054 264131 563961 1012566
14489 1012566 987372 981990 832843 516562 306351 639559 727908 537956 384185 432533
14479D32533m5462K43324J23832l16621J1434J07385k82982R621k1514j59513
14469A02037J36949K90561N1009k05307k06324o8325j13865j06289J3518N969
14459a00067M6613K11143M34601j45132l92840l8374j62208L2517Q3712J15619
14449H5584K11134M38635L81335K19337M7774l70553j12343l63455J90223J73036
14439I00707P9327O9597j35996l04379j28787j38916J50516k77138k5746l6512
14429A52673o8435J2365l8162P231P317J55583l52098k98669j2385K19361K38119
14418B2900j91156J17998K30194m3541l4405O4013Q9249k91448n0023K65033M51442
14407F30256m6109l20224k23813k96216J20293q5824N3125K30714o6325k37926
$$ plain form
14479 432533 387071 630395 754227 437606 449040 556425 273443 283064 261550 102037
14469 102037 238986 529547 580556 375249 168925 100600 -13265 -119554 -106036 -100067
14459 -100067 -53454 157689 592290 447158 54318 15944 -146264 -113747 -30035 85584
14449 85584 296718 735353 1116688 1336025 1383799 1013246 900903 537448 727671 900707
14439 900707 980034 1049631 913635 609256 480469 341553 492069 214931 189185 152673
14429 152673 84238 96603 58441 65672 72989 228572 -123526 -422195 -434580 -215219 22900
14418 22900 -168256 -50258 179936 136395 101990 166003 255252 -36196 -86219 178814 630256
14407 630256 584147 263923 40110 -256106 -135813 -221637 -168512 62202 -4123 -242049
14397b42049n3036k792m3335j00547L59259K89832m89640k46838J12688L10472
14387a05986M75795k16313l1089o1239J7125k56323j27865K11900J02891r9671
14377i0775j12161j29177J29727j81854J16981j61365M0439L867R3809J35168
14367a55341Q8988Q1127J18446K72918q6000m33951j87528K45630J3592l54055
14357c96174R6222m7223J772r9000K53664L95900M82409J15130l60812r5833K6043
14346C72098k56944j35196m4642K26618m03135l48542J46782J37614k7138R5776
14336b36709L68085j19740L28845M62090K31179n55046m08230O6331J30831J58174
14326D25810l11024k70797N96371K69488k04994l3231M1061O8469J41716k34255
$$ plain form
14397 -242049 -295085 -297877 -341212 -441759 -82500 207332 -282308 -529146 -416458 -105986
14387 -105986 369809 153496 122407 61168 78293 -178030 -305895 -93995 8896 -90775
14377 -90775 -202936 -332113 -202386 -384240 -267259 -428624 -388185 -384318 -290509 -155341
14367 -155341 -66353 14774 133220 406138 320138 -113813 -301341 -55711 -42119 -396174
14357 -396174 -299952 -347175 -345403 -444403 -190739 205161 687570 802700 441888 346055 372098
14346 372098 115154 -20042 -64684 161934 -241201 -589743 -442961 -305347 -332485 -236709
14336 -236709 131376 11636 340481 802571 1033750 478704 70474 136805 267636 425810
14326 425810 114786 -156011 440360 709848 504854 471623 512684 581153 722869 488614
14316D88614k31307n24420m3396M43932J83841J25071P3430o1649r0956j25424
14306B37736j7160m08876j75744j11210l388J94770J72043K77708P3777l6734
14296B02922N8770J21490j08602N5051k40304l35422K49691L70733J84533j80205
14286C78657j83287l3235l30470o3178J06584L95968M16372k20622j19128K68687
14276F16348L36269K59175j36615m40834j50119o1127l89659j19845j14255L46027
14266A45365N1587K90399J23308K2894K6613J0942j19186k01032J19854J21551
14256E92295j28532q3782J29222Q4109j86573P540J39092j95414K2954K8391J58643
14245E67945K05530J7583j15563k21567j55032K83405N8179K36089j99116k29044
$$ plain form
14316 488614 257307 -267113 -310509 133423 317264 442335 515765 454116 363160 237736
14306 237736 220576 -188300 -364044 -475254 -478642 -283872 -111829 165879 239656 202922
14296 202922 261692 383182 274580 329631 89327 -246095 3596 374329 558862 378657
14286 378657 195370 162135 -168335 -231513 -124929 271039 687411 466789 347661 616348
14276 616348 952617 1211792 1075177 634343 484224 423097 33438 -86407 -200662 145365
14266 145365 196952 487351 610659 633553 660166 671108 551922 350890 470744 592295
14256 592295 463763 379981 509203 593312 406739 414279 553371 357957 380911 409302 567945
14245 567945 773475 791058 675495 453928 298896 582301 640480 876569 677453 448409
14235D48409K29785L20981k01680K71411J04638k10354J04538k704n1174j03579
14225I10271J20175J3683l8458j92741Q9877K31454j93033o8013J61951j17931
14215I17235J34222m5708j55190O1689J05026n5115M6988j13630M41690L1142
14205A368349l75642O0076O252n78091n6989K11472J91915J14758K5084j17783
14195H49401K03880l3852J55353j42767j8856N02163j5330j10390N1030j49804
14185A290828q8435j09293j80017o3675J13393n6540r454L69495J92175J69570
14175A628047L50860K52341Q9078j60087m43245j66887M45820j02003n03282m0118
14165A350524L07542j99425j9581j10422q8758q1142L2234K14466Q4802R1374
$$ plain form
14235 448409 678194 999175 797495 1068906 1173544 963190 1067728 1065024 1013850 910271
14225 910271 1030446 1044129 1005671 812930 902807 1134261 941228 873215 1035166 917235
14215 917235 1051457 1005749 850559 912248 1017274 962159 1009147 895517 1337207 1368349
14205 1368349 992707 1052783 1059035 480944 423955 635427 827342 942100 967184 849401
14195 849401 1053281 1019429 1174782 1032015 1013159 1515322 1499992 1389602 1440632 1290828
14185 1290828 1202393 1093100 913083 849408 962801 906261 896807 1266302 1458477 1628047
14175 1628047 1978907 2231248 2320326 2160239 1716994 1550107 1995927 1893924 1390642 1350524
14165 1350524 1658066 1458641 1439060 1328638 1239880 1158738 1190972 1405438 1490240 1581614
14155A581614Q9939J4357O9914l01265j7670K7237P0110J95047J90040K91025
14145B210348p8695K60280L73164j23599k34316j61823k14194J17120M24499k88229
14135B284555l9623j43808P9277j81528P7317K43669J70604K23175M3925j71303
14125B586260M9724J30377L03162r8031J68165L22420L21932O0052n0650J7878
14115C811289M04737o549p4595N3368p0023J92877J41510L95379M7547r8793j7655
14104D779092Q85J59851J91918k05371J32719k4125k74385J55795L850J92733
14094E112962K38536N36061L14446J09036M5876k06161o5242J57394K86584M61045
14084F990537j24236j51064k7840K85506P7980J47341L03215L19882j1924K79874
$$ plain form
14155 1581614 1671553 1685910 1755824 1454559 1436889 1464126 1534236 1729283 1919323 2210348
14145 2210348 2131653 2391933 2765097 2641498 2407182 2245359 2031165 2148285 2572784 2284555
14135 2284555 2244932 2101124 2180401 1998873 2076190 2319859 2490463 2713638 2757563 2586260
14125 2586260 2635984 2766361 3069523 2971492 3139657 3462077 3784009 3844061 3793411 3811289
14115 3811289 4216026 4209477 4134882 4188250 4118227 4311104 4452614 4847993 4895540 4796747 4779092
14104 4779092 4779977 4939828 5131746 4926375 5059094 5034969 4760584 4916379 4920229 5112962
14094 5112962 5351498 5887559 6202005 6311041 6356917 6150756 6085514 6242908 6529492 6990537
14084 6990537 6866301 6715237 6687397 6972903 7050883 7198224 7501439 7821321 7809397 8089271
14074H089271K42455j23402j68586M24713R3013J65187L32127j73436K29784O15100
14064I726226O35763J6238P9549j7709n6804L17269p5292J98794O66778L94789
14054A1885601J06721K13735M33692P67498L60856J58072J90754J66893L54577
14045A4638399J39861k25267o7810K87130L89340J84205R9224N37901N71456J000344
14035A7554783J050211Q04005J019951J412540K107525K854888L672113N203032
14027C5679048P431190J1086056J6368883K3256995K7577831K1141109P704326
14020A50245438J045777J898508L905518k601614k5544470l7564371k7395400
14013F3989386j6283982r296651n995323l871162k658716k025082j429529j250859
$$ plain form
14074 8089271 8331726 8208324 8039738 8464451 8557464 8722651 9054778 8881342 9111126 9726226
14064 9726226 10361989 10378227 10457776 10440067 10383263 10700532 10625240 10824034 11490812 11885601
14054 11885601 11992322 12206057 12639749 13407247 13768103 13926175 14116929 14283822 14638399
14045 14638399 14778260 14552993 14485183 14772313 15161653 15345858 15445082 15982983 16554439 17554783
14035 17554783 18604994 19408999 20428950 21841490 23949015 26803903 30476016 35679048
14027 35679048 43110238 54196294 70565177 93822172 121400003 142541112 150245438
14020 150245438 151291215 153189723 157095241 154493627 128949157 91384786 63989386
14013 63989386 47705404 38408753 32413430 28542268 25883552 23858470 22428941 21178082
14005B1178082j388424m11837l19471o88630j184886m99597R5137L96424P59077
13996A7935875M89620N93357J001514J742314J997333L339691M915090P370397
13988C9385191J1341005J6944056K3961626K7723428K0084137O743663O85481
13981A46868587J284125K855813m355467k7767382l8308584k7047259j5964950
13974C7564883r643565n883683l698418k538810k107266j768740j022841p77180
13966A0124380j030643j199081j082229r09039q63773m34843l38686q02648n23129
13957B940309j3411l65872q8599L14321O6027k07961l33313l84675n80111m36474
13947I10241j04760J11353J71775J55949L6993l39076j67804j55855k16867j00097
$$ plain form
14005 21178082 19789658 19377821 19058350 18369720 17184834 16685237 16780374 17176798 17935875
13996 17935875 18425495 19018852 20020366 21762680 23760013 27099704 32014794 39385191
13988 39385191 50726196 67670252 91631878 119355306 139439443 146183106 146868587
13981 146868587 148152712 151008525 146653058 118885676 80577092 53529833 37564883
13974 37564883 27921318 22037635 18339217 15800407 13693141 11924401 10901560 10124380
13966 10124380 9093737 7894656 6812427 5903388 5039615 4604772 4266086 3463438 2940309
13957 2940309 2926898 2561026 2472427 2786748 2852775 2644814 2311501 1926826 1346715 910241
13947 910241 805481 916834 1088609 1244558 1281551 942475 774671 618816 401949 301852
13937C01852M976J86394K30696K59231q491K9629J68788J8614q8645m2665l86260
13926F74119o1790k67142K2016K13709O1979Q7134p5578O49O6670j15839L3825
13915F39752J13222l18881m25234K7789J84983p7134J6461j28690O2955L02968
13905C98191J83710k18236p689J95392R7593L43371k10577l97345l3889K68302
13895F18823r2306q0329j02280J24943n80688k05852L90825Q7717J78288p05m6576
13884B91860K63842q165k28080n6504O6243J66414J22481j15496k59819k25166
13874A7610j55830J16638M39963O7311O9464j96057m53072J33692o8499L0807
13864B027p1180J56674j88456Q2009L00961j9666n6306K8187j85264K18966P5333
$$ plain form
13937 301852 306828 493222 723918 983149 974658 1004287 1173075 1191689 1103044 1060379 674119
13926 674119 612329 345187 367203 580912 642891 730025 654447 655096 721766 605927 639752
13915 639752 752974 434093 8859 36648 221631 144497 160958 32268 95223 398191
13905 398191 581901 363665 355976 551368 648961 992332 781755 384410 350521 618823
13895 618823 526517 446188 343908 468851 -111837 -317689 73136 160853 339141 338436 291860
13884 291860 555702 547537 319457 262953 329196 495610 618091 502595 242776 17610
13874 17610 -138220 -21582 418381 485692 555156 359099 -93973 39719 -28780 2027
13864 2027 -69153 87521 -100935 -18926 282035 262369 206063 234250 48986 267952 343285
13853C43285r7142N1555J89649o5542Q9784o2226m34472j54165J93929J92460
13843B47115N6239j97683r7802J95031J49542m5239q8480k08705j12845Q2719
13833b0108O5475j5095j28952k31397K21826j85q4613O4037L75353L89736J495
13822F37572q9673j53299Q5113L54612J21376l56586N4270o9798k65840N5567
13812C73314k40178K09406L43789k40829m27112L54021P36011J17588j82242l05801
13802G37967o20515j93958N4828J28639J14065R9707Q2516j92454j52241R5081
13792A53635J59755k71859o7096N30669K36970m6617j50144p0453L10528k14454
13782E70934l533K17386k82105k37992J72988O3291j77670l10040J38304p313
$$ plain form
13853 343285 246143 297698 487347 421805 511589 449363 14891 -139274 54655 247115
13843 247115 303354 105671 7869 202900 352442 307203 218723 10018 -102827 -20108
13833 -20108 45367 30272 -98680 -330077 -108251 -108436 -193049 -129012 246341 636077 637572
13822 637572 547899 394600 479713 834325 955701 599115 653385 583587 317747 373314
13812 373314 133136 342542 686331 445502 18390 372411 1108422 1226010 1043768 737967
13802 737967 117452 -76506 -21678 106961 221026 320733 403249 210795 58554 153635
13792 153635 313390 41531 -25565 505104 742074 695457 545313 474860 785388 570934
13782 570934 567401 784787 502682 264690 437678 500969 323299 13259 151563 144250
13772A44250k17937J26773K86469L08079l89081l75325J40258j05410J65964K98872
13762C82912R8639j3794j81616l54709Q1014J05976K87778J18434k81178j34953
13752A08503K41156K76900O3731J59738o4852P7441M0598k292L24146J13264j38999
13741A199334l3307j78706m16204j83831J91429L48882l74526K34767K8051l28836
13731D87053j02838j31976Q2180O0319l73253K09970Q3913m8211L13935k13305
13721C67787k52538M77416L42828l01803q0339m48634j78033O8535Q5560K28478
13711C09257J08727k20908j97068K28073J19353k384K45222J95219M4225m53259
13701C76457J73326O2156l19701j66299q4015J66959K41115P9379L12824p7610
$$ plain form
13772 144250 -73687 53086 339555 647634 258553 -116772 23486 -81924 84040 382912
13762 382912 481551 467757 286141 -68568 12446 118422 406200 524634 243456 108503
13752 108503 349659 626559 690290 850028 785176 862617 903215 900923 1225069 1338333 1199334
13741 1199334 1166027 987321 571117 387286 578715 927597 553071 787838 815889 487053
13731 487053 384215 252239 334419 394738 21485 231455 315368 267157 581092 367787
13721 367787 115249 592665 935493 633690 553351 104717 -73316 -4781 80779 309257
13711 309257 417984 197076 8 228081 347434 345050 590272 785491 829716 376457
13701 376457 549783 611939 292238 125939 41924 208883 449998 529377 842201 764591
13691G64591m2129J02504k57697j51214O0860j75701l03240o3343K43827K83244
13681D61702O6002n9905K0912p0254K85011M3755l60661k4494M83086j17096j41986
13670E86072j83321l20466r1245K42908M9006M6258K83010M38216J76437l2256
13660A194619m79456m03436J60668J80304K20013l4583j04635l5738r4638j23644
13650D79474k31724q6629k13460N910l254L7884j32290J85088L67203P0186L5320
13639E13708k60346m17334m1657K64970P7264K41686K59105n4313l65946K48780
13629D65917K55278J44033J12235m73394l41570R4097K09699J73272J35019J31150
13619I05736K46749j64171l75367l24134l8090L21023k84412j04110r4859J10976
$$ plain form
13691 764591 722462 824966 567269 416055 476915 301214 -2026 -65369 178458 461702
13681 461702 527704 467799 488711 418457 703468 747223 386562 362068 845154 728058 586072
13670 586072 402751 82285 -8960 233948 282954 329212 612222 1050438 1226875 1194619
13660 1194619 715163 311727 472395 652699 872712 838129 733494 697756 603118 479474
13650 479474 247750 161121 -52339 -46429 -49683 -11799 -144089 40999 408202 478388 513708
13639 513708 253362 -163972 -205629 59341 136605 378291 637396 583083 217137 465917
13629 465917 721195 865228 977463 504069 162499 256596 466295 639567 774586 905736
13619 905736 1152485 988314 612947 288813 250723 571746 287334 183224 88365 199341
13609A99341K44706K96050k5862l32517J62263J72771J31528Q7545N5051L8821
13599A029697K06181k58689p1119k13606k85472P1898L67362K42426j12641j12827
13589H63210p9477n9462M3078R9632K48765j66440p0450J66212Q4395r2232r607
13578A027624J04633l5938k97816m56258M061L11462m4542P8712n2227J64366
13568H04077n5481N8758k33749p6131M34217J50574K22678M7199l4496j19984
13558A197662l53616K86152L64543n5733k3623L87345J15052m11338l61873J55768
13548A300339K53474l3993n98918k43001N2416K52238K45323M16805J35330J06055
13538A886068k19252J52706J83230l05402m89170k62737k33459p4977L41739J25068
$$ plain form
13609 199341 444047 740097 714235 381718 543981 716752 848280 935825 990876 1029697
13599 1029697 1235878 977189 906070 692464 406992 478890 846252 1088678 976037 863210
13589 863210 783733 724271 767349 866981 1115746 949306 878856 1045068 1129463 1037231 1027624
13578 1027624 1132257 1096319 798503 342245 346306 657768 613226 691938 639711 804077
13568 804077 748596 807354 573605 497474 931691 1082265 1304943 1352142 1317646 1197662
13558 1197662 844046 1130198 1494741 1439008 1415385 1802730 1917782 1506444 1144571 1300339
13548 1300339 1553813 1519820 920902 677901 730317 982555 1227878 1644683 1780013 1886068
13538 1886068 1666816 1819522 2002752 1697350 1208180 945443 711984 637007 978746 1103814
13528A103814o999k07328K22642J13276j45552K6757L55974J81783M50647L00278
13518B395292K03852j16657k75819J40671l6708j84436j32471j78042k21829k0065
13508A573788l84241o3813O3167K22124L76032J25164j70638J6181N4383N3968
13498A866115R884L0374N4955m9555j83160K1095J15604l19895n4925L61091J95357
13487B046940j11189k13073j8103k56265K86196J20975Q6035M43M6766O218L6307
13476B031250K26197P20004l34121l55275j68234m6659j81637j85766K67610L54204
13466B327573P5461K46397J64876J70787k90424j63126L38567P6205N0910k0720
13456B976506k36815J89939L78848Q7023l18748m42980j34075K52365L06675K69656
$$ plain form
13528 1103814 1096815 889487 1112129 1225405 1079853 1106610 1462584 1644367 2095014 2395292
13518 2395292 2599144 2482487 2206668 2347339 2310631 2126195 1993724 1815682 1593853 1573788
13508 1573788 1189547 1125734 1188901 1411025 1787057 1912221 1741583 1757764 1812147 1866115
13498 1866115 1875999 1906373 1961328 1911773 1728613 1749708 1865312 1545417 1490492 1851583 2046940
13487 2046940 1935751 1722678 1704575 1448310 1734506 1855481 1941516 1941959 1988725 1994943 2031250
13476 2031250 2257447 2977451 2643330 2288055 2119821 2073162 1891525 1705759 1973369 2327573
13466 2327573 2403034 2649431 2814307 2985094 2694670 2531544 2870111 2946316 2997226 2976506
13456 2976506 2739691 2929630 3308478 3395501 3076753 2633773 2499698 2752063 3058738 3328394
13446C328394k12958p9535L44603O8546P6402q6228k75414o2222M43401o099k30185
13435C308705j5028N2387k1026M62636K06383O7733R6957j07873k03869L03602
13425D150607O3216L4921N996p4694K24468L16272L53199K77648j65366k08359
13415D977908M2498M38497k71572l29483o7620K57930K0769O4366K87586L16497
13405E737376J77040j3133N28290m8421l75418J36345N35551O4317q7142J48853
13395F803658J55947K71479L14216K85313J91858j80444r9805Q4517J97555K0624
13385H044918j11073K7011M57799N82029J63809K71530L64216l6626J35579L87035
13375A0286227Q7989k17258j64132M4296O07701N98297L19636j19042J86035O08138
$$ plain form
13446 3328394 3115436 3035901 3380504 3449050 3525452 3439224 3163810 3101588 3544989 3538890 3308705
13435 3308705 3293677 3346064 3325038 3787674 3994057 4061790 4158747 4050874 3847005 4150607
13425 4150607 4213823 4248744 4254740 4180046 4404514 4720786 5073985 5351633 5186267 4977908
13415 4977908 5020406 5458903 5187331 4857848 4790228 5048158 5068927 5133293 5420879 5737376
13405 5737376 5914416 5901283 6429573 6381152 6005734 6142079 6677630 6741947 6654805 6803658
13395 6803658 6959605 7231084 7545300 7830613 8022471 7842027 7742222 7826739 8024294 8044918
13385 8044918 7933845 7960856 8418655 9000684 9164493 9436023 9800239 9763613 9899192 10286227
13375 10286227 10374216 10156958 9992826 10037122 10644823 11243120 11562756 11443714 11629749 12237887
13365A2237887O01359L72715N30790K39751L90624O11130M96721K42142J7337
13356A5740456L66391N30470L61395K96498R3573L35165M1814O74045O80357N25788
13346A9645952J237304J622736K235395K061007J631384J212690J058593J098957
13338C1804018P80334K29519q12964p82690K47737J599537K838334L777390L840690
13329D3521905L258692K792385K330178J810367J594098N30786p53194P6793J087767
13320E6249777L59454j224945j675255m90323L44675p27151l640735m805752l088929
13311D1300816j403575K86443J620685L077642M252233N151045M597250K580519
13303F1463058J672273K304086K991688L005648J426836J201225M787128Q827616
$$ plain form
13365 12237887 12839246 13211961 13742751 13982502 14373126 14984256 15480977 15723119 15740456
13356 15740456 16106847 16637317 16998712 17295210 17388783 17723948 17765762 18439807 19120164 19645952
13346 19645952 20883256 22505992 24741387 26802394 28433778 29646468 30705061 31804018
13338 31804018 32584352 32813871 32000907 31218217 31465954 33065491 35903825 39681215 43521905
13329 43521905 46780597 49572982 51903160 53713527 55307625 55838411 55085217 55162010 56249777
13320 56249777 56609231 55384286 53709031 53218708 53563383 52836232 49195497 44389745 41300816
13311 41300816 39897241 40183684 41804369 44882011 49134244 54285289 58882539 61463058
13303 61463058 63135331 65439417 68431105 71436753 72863589 74064814 78851942 87679558
13295H7679558R218126O499889O859581J0228458J4691236J5721537P273899M03025
13287A58575309L905770P696401N912352n90127r340616j1982775j0322387j1738844
13279A32115083j6591626j5173436p712646K43491P397400J2556298J3874847
13272A26709411J2154466J1086827J1428764R367005L609854n061920j0851366
13265A58443041p742400m831507j0038017j6834745j4634204q451249l850734
13258I2060185m748077j1676453j3081261o901302k018627j167389j779653j845936
13250D8841487j582837j190835k775086o223069o972217n197777l097871j290400
13242B0511395L02068J406169K578431L646612K709523J109597J090589J514080
$$ plain form
13295 87679558 96897684 103397573 110257154 120485612 135176848 150898385 158172284 158575309
13287 158575309 162481079 170177480 176089832 175499705 166159089 154176314 143853927 132115083
13279 132115083 115523457 100350021 92637375 92880866 100278266 112834564 126709411
13272 126709411 138863877 149950704 161379468 170746473 174356327 169294407 158443041
13265 158443041 150700641 145869134 135831117 118996372 104362168 95910919 92060185
13258 92060185 87312108 75635655 62554394 55653092 53634465 52467076 50687423 48841487
13250 48841487 47258650 46067815 43292729 37069660 30097443 24899666 21801795 20511395
13242 20511395 20813463 22219632 24798063 28444675 31154198 32263795 33354384 34868464
13234C4868464K074624J726171j332600k616338j143313O48393R757n75981r66964
13225C2692213j990582k370001l039200m396994m236553k738679r73329J88259
13217A3135134Q76497N02111p9030o14914l69677m7835l74006j741770k693389
13208H593121j762232j404265q04478n35729o52190m92272l91382k63532k60394
13199B026647l71592k82379r014J64558j05902j56542J18169k40317k47332L8377
13189I34673J21202m14624k25569K87143L48174J77129l03664j73858m42370j29952
13179A78284J76011L90384j63380k84872k96547J92413L82867L00733O0414k53981
13169F82326Q6743M60101j79042n38315N9033K22601J21565L10350k97368M4427
$$ plain form
13234 34868464 36943088 38669259 37336659 34720321 33577008 34225401 34235158 33659177 32692213
13225 32692213 30701631 28331630 25292430 20895436 16658883 13920204 12946875 13135134
13217 13135134 14011631 14513742 14434712 13819798 13450121 13402286 13028280 11286510 8593121
13208 8593121 6830889 5426624 4622146 4086417 3434227 2941955 2550573 2287041 2026647
13199 2026647 1655055 1372676 1363662 1528220 1422318 1265776 1383945 1143628 896296 934673
13189 934673 1055875 641251 415682 702825 1050999 1228128 924464 750606 308236 178284
13179 178284 354295 744679 581299 296427 -120 192293 575160 875893 936307 682326
13169 682326 769069 1229170 1050128 511813 570846 793447 915012 1225362 927994 972421
$$ [...]
##END NTUPLES=NMR SPECTRUM
##END=
