##TITLE=Analysis number 314021
Compound Code cc 47839
Book Reference 458/12
Project Code adrs
Chemist Name stevem
##JCAMPDX= 6.0         $$ Bruker NMR JCAMP-DX V2.0
##DATA TYPE= NMR SPECTRUM
##DATA CLASS= NTUPLES
##ORIGIN= Bruker BioSpin GmbH
##OWNER= NMR
$$ XWIN-NMR		Version 3.5
$$ Mon Oct  3 14:36:40 2005 GMT Daylight Time (UT+1h)  MAYBRIDGE\NMR@NMR_250MHZ
##.OBSERVE FREQUENCY= 250.131544655141
##.OBSERVE NUCLEUS= ^1H
##.ACQUISITION MODE= SIMULTANEOUS (DQD)
##.ACQUISITION SCHEME= undefined
##.AVERAGES= 16
##.DIGITISER RES= 18
##SPECTROMETER/DATA SYSTEM= dpx250
##.PULSE SEQUENCE= zg30
##.SOLVENT NAME= CDCl3
##.SHIFT REFERENCE= (INTERNAL, CDCl3, 0, 16.522)
##AUDIT TRAIL= $$ (NUMBER, WHEN, WHO, WHERE, WHAT)
$$ ##TITLE= Audit trail, XWIN-NMR		Version 3.5
$$ ##JCAMPDX= 5.01
$$ ##ORIGIN= Bruker BioSpin GmbH
$$ ##OWNER= NMR
$$ C:\u/data/dgb/nmr/ADRS/10240/pdata/1/auditp.txt
$$ ##AUDIT TRAIL=  $$ (NUMBER, WHEN, WHO, WHERE, WHAT)
(   1,<2005-10-03 14:36:21.91 +100>,<MAYBRIDGE\NMR>,<NMR_250MHZ>,
      <created by zg, POWCHK disabled, PULCHK disabled
       configuration hash MD5:
       62 19 C7 07 E1 42 D1 B7 37 6C 3D D0 77 39 F9 E6
       data hash MD5: 64K
       FA 45 CF 76 F0 13 1D 82 7A C9 6E E0 34 3C 2E 91>)
(   2,<2005-10-03 14:36:32.80 +100>,<MAYBRIDGE\NMR>,<NMR_250MHZ>,
      <Start of raw data processing
       ef LB = 0.3 FT_mod = 6 PKNL = 1 SI = 32K 
       data hash MD5: 32K
       5E D1 0B BA C5 6F F3 2C 25 03 75 29 4F 19 38 CD>)
(   3,<2005-10-03 14:36:34.48 +100>,<MAYBRIDGE\NMR>,<NMR_250MHZ>,
      <apk 
       data hash MD5: 32K
       C0 FE 3D 36 C9 21 FD 7C 7A EC 95 BA 86 37 B8 32>)
(   4,<2005-10-03 14:36:35.32 +100>,<MAYBRIDGE\NMR>,<NMR_250MHZ>,
      <abs ABSG = 5 
       data hash MD5: 32K
       05 0B A3 3A 2F 84 4D 6C 74 AA 4D BE C4 96 14 C0>)
$$ ##END=
$$ 
$$ hash MD5
$$ 61 F6 01 6A E6 AA 18 9A 5E EF 53 2E CD 67 0C 80
##$RELAX= 
##$RELAX= 
##$RELAX= 
##$RELAX= 
##$RELAX= 
##$RELAX= 
##$RELAX= 
$$ Bruker specific parameters
$$ --------------------------
##$DU= <C:\u>
##$EXPNO= 10240
##$NAME= <ADRS>
##$PROCNO= 1
##$TYPE= <nmr>
##$USER= <dgb>
##$AMP= (0..31)
100 100 100 100 100 100 100 100 100 100 100 100 100 100 100 100 100 100 
100 100 100 100 100 100 100 100 100 100 100 100 100 100 
##$AQSEQ= 0
##$AQ_mod= 3
##$AUNM= <au_zg>
##$AUTOPOS= <3 >
##$BF1= 250.13
##$BF2= 250.13
##$BF3= 250.13
##$BF4= 250.13
##$BF5= 500.13
##$BF6= 500.13
##$BF7= 500.13
##$BF8= 500.13
##$BYTORDA= 1
##$CFDGTYP= 0
##$CFRGTYP= 5
##$CHEMSTR= <none>
##$CNST= (0..31)
1 1 145 1 1 1 1 1 1 1 1 1 1 1 1 1 1 1 1 1 1 1 1 1 1 1 1 1 1 1 1 1 
##$CPDPRG= <>
##$CPDPRG1= <>
##$CPDPRG2= <>
##$CPDPRG3= <>
##$CPDPRG4= <mlev>
##$CPDPRG5= <mlev>
##$CPDPRG6= <mlev>
##$CPDPRG7= <mlev>
##$CPDPRG8= <mlev>
##$CPDPRGB= <>
##$CPDPRGT= <>
##$D= (0..31)
0 1 0 0 0 0 0 0 0 0.06 0 0 0 0 0 0 0.0002 0 0 0 0 0 0 0 0 0 0 0 0 0 0 
0 
##$DATE= 1128346580
##$DBL= (0..7)
120 120 120 120 120 120 120 120 
##$DBP= (0..7)
150 150 150 150 150 150 150 150 
##$DBP07= 0
##$DBPNAM0= <>
##$DBPNAM1= <>
$$ [...]
##$SUBNAM7= <"">
##$SUBNAM8= <"">
##$SUBNAM9= <"">
##$SW= 20.6930455092707
##$SWIBOX= (0..15)
0 0 3 0 0 0 0 0 0 0 0 0 0 0 0 0 
##$SW_h= 5175.983436853
##$TD= 65536
##$TD0= 1
##$TE= 296.16
##$TE2= 300
##$TE3= 300
##$TEG= 300
##$TL= (0..7)
0 120 120 120 120 120 120 120 
##$TP= (0..7)
150 150 150 150 150 150 150 150 
##$TP07= 0
##$TPNAME0= <>
##$TPNAME1= <>
##$TPNAME2= <>
##$TPNAME3= <>
##$TPNAME4= <>
##$TPNAME5= <>
##$TPNAME6= <>
##$TPNAME7= <>
##$TPOAL= (0..7)
0.5 0.5 0.5 0.5 0.5 0.5 0.5 0.5 
##$TPOFFS= (0..7)
0 0 0 0 0 0 0 0 
##$TUNHIN= 0
##$TUNHOUT= 0
##$TUNXOUT= 0
##$USERA1= <user>
##$USERA2= <user>
##$USERA3= <user>
##$USERA4= <user>
##$USERA5= <user>
##$V9= 5
##$VALIST= <valist>
##$VCLIST= <CCCCCCCCCCCCCCC>
##$VD= 0
##$VDLIST= <DDDDDDDDDDDDDDD>
##$VPLIST= <PPPPPPPPPPPPPPP>
##$VTLIST= <TTTTTTTTTTTTTTT>
##$WBST= 1024
##$WBSW= 4
##$XGAIN= (0..3)
0 0 0 0 
##$XL= 0
##$YL= 0
##$YMAX_a= 404427
##$YMIN_a= -430692
##$ZGOPTNS= <>
##$ZL1= 120
##$ZL2= 120
##$ZL3= 120
##$ZL4= 120
##$ABSF1= 16.522
##$ABSF2= -4.171173
##$ABSG= 5
##$ABSL= 3
##$ALPHA= 0
##$AQORDER= 0
##$ASSFAC= 0
##$ASSFACI= 0
##$ASSFACX= 0
##$ASSWID= 0
##$AUNMP= <proc_1d>
##$AZFE= 0.1
##$AZFW= 0.1
##$BCFW= 0
##$BC_mod= 0
##$BYTORDP= 0
##$COROFFS= 0
##$CY= 12.5
##$DATMOD= 1
##$DC= 0
##$DFILT= <>
##$DTYPP= 0
##$F1P= 14.0000005364418
##$F2P= -0.99999901652339
##$FCOR= 0.5
##$FTSIZE= 32768
##$FT_mod= 6
##$GAMMA= 0
##$GB= 0
##$INTBC= 1
##$INTSCL= 1
##$ISEN= 128
##$LB= 0.3
##$LEV0= 0
##$LPBIN= 0
##$MAXI= 10000
##$MC2= 0
##$MEAN= 0
##$ME_mod= 0
##$MI= 0
##$NCOEF= 0
##$NC_proc= -2
##$NLEV= 6
##$NOISF1= 0
##$NOISF2= 0
##$NSP= 0
##$NTH_PI= 0
##$NZP= 0
##$OFFSET= 16.522
##$PC= 1
##$PHC0= -61.66531
##$PHC1= 6.187606
##$PH_mod= 1
##$PKNL= yes
##$PPARMOD= 0
##$PSCAL= 4
##$PSIGN= 0
##$REVERSE= no
##$SF= 250.13
##$SI= 32768
##$SIGF1= 0
##$SIGF2= 0
##$SINO= 400
##$SIOLD= 32768
##$SREGLST= <1H.CDCl3>
##$SSB= 0
##$STSI= 32768
##$STSR= 0
##$SW_p= 5175.98343685301
##$SYMM= 0
##$S_DEV= 0
##$TDeff= 65536
##$TDoff= 0
##$TI= <Analysis number 999999
Compound Code 99
Book Reference 9
Project Code 9>
##$TILT= no
##$TM1= 0
##$TM2= 0
##$TOPLEV= 0
##$USERP1= <user>
##$USERP2= <user>
##$USERP3= <user>
##$USERP4= <user>
##$USERP5= <user>
##$WDW= 1
##$XDIM= 32768
##$YMAX_p= 469641139
##$YMIN_p= -250036
$$ End of Bruker specific parameters
$$ ---------------------------------
##NTUPLES= NMR SPECTRUM
##VAR_NAME=  FREQUENCY,     SPECTRUM/REAL,   SPECTRUM/IMAG
##SYMBOL=    X,             R,               I
##VAR_TYPE=  INDEPENDENT,   DEPENDENT,       DEPENDENT
##VAR_FORM=  AFFN,          ASDF,            ASDF
##VAR_DIM=   32768,         32768,           32768
##UNITS=     HZ,            ARBITRARY UNITS, ARBITRARY UNITS
##FACTOR=    0.157963299565203, 1,           1
##FIRST=     4132.6476996994, 0,             0
##LAST=      -1043.33573715361, 0,           0
##MIN=       -1043.33573715361, -250036,     0
##MAX=       4132.6476996994, 469641139,     0
$$ Real data points
##PAGE= N=1
##DATA TABLE= (X++(R..R)), XYDATA
$$ [...]
$$ plain form
15077 -16916 -11052 -5913 -5609 576 201 -11662 -21480 -14556 -12712 -17844 -21398 -26498 -16798 -18925 -15384
15062 -15384 1834 4574 -8062 -5770 -7536 5681 3350 5272 4520 6772 -9180 -22302 -21384 -14115
15048 -14115 -5977 3131 8741 12033 10790 17968 15516 25719 18842 6804 -17909 -16925 978 11418
15034 11418 25119 9612 6377 16390 7210 -1450 9243 3165 2014 2184 4934 -3120 -1401 2413
15020 2413 7259 1568 4104 -6561 -1588 19427 20491 9641 16168 22302 16506 18673 11311 8737
15006 8737 4765 3302 9006 5879 -7033 442 4781 5819 -692 -8833 -18753 -23517 -8374 2101
14992 2101 4052 2284 3747 -4052 -14910 -13887 -30532 -27767 -19554 -8810 19031 19584 9185 7059
14978 7059 4710 1753 -4381 3734 19647 19590 27371 13883 8865 7257 5455 8355 23273 30267
$$ packed form
15077a6916N864N139L04O185l75j1863r818O924J844n132l554n100R700k127L541
15062a5384J7218K740j2636K292j766J3217k331J922p52K252j5952j3122R18P269
15048a4115Q138R108N610L292j243P178k452J0203o877j2038k4713R84J7903J0440
15034A1418J3701j5507l235J0013r180q660J0693o078j151J70K750q054J719L814
15020B413M846n691K536j0665M973K1015J064j0850O527O134n796K167p362k574
15006H737l972j463N704l127j2912P475M339J038o511q141r920m764J5143J0475
14992B101J951j768J463p799j0858J023j6645K765Q213J0744K7841N53j0399k126
14978G059k349k957o134Q115J5913n7P781j3488n018j608j802K900J4918O994
$$ plain form
14964 30267 24690 18272 3174 -1733 15504 27214 5862 -4465 1082 759 4321 10926 16973
14951 16973 13230 18344 8714 -19533 -15609 -17384 -5469 2593 4720 9112 8524 928 -15434 -24901
14937 -24901 -18697 -3898 6556 13787 17316 12827 990 -2244 -8227 -13350 -18838 -23626 -7715
14924 -7715 -981 -2259 10122 10847 2492 4841 14196 23685 16374 3257 -862 1088 5461 6186 11733
14909 11733 12420 1542 -3313 7284 15978 15068 4492 6562 6848 677 -7674 -22548 -7857 11239
14895 11239 2984 -9041 -8351 -10063 -5363 5644 6776 -3389 -1895 14666 24388 4865 -12045
14882 -12045 -17150 -25100 -39561 -36046 -21844 -4721 -5505 -4074 3540 12911 10269 -6020 -12437 -5920
14868 -5920 10474 12079 -3703 -825 10887 14798 6539 4889 13419 -7483 -12837 -8122 2818
$$ packed form
14964C0267n577o418j5098m907J7237J1710k1352j0327N547l23L562O605O047
14951A6973l743N114r630k8247L924j775J1915Q062K127M392n88p596j6362r467
14937b4901O204J4799J0454P231L529m489j1837l234n983n123n488m788J5911
14924g715O734j278J2381P25q355K349R355R489p311j3117m119J950M373P25N547
14909A1733O87j0878m855J0597Q694r10j0576K070K86o171q351j4874J4691J9096
14895A1239q255j2025O90j712M700J1007J132j0165J494J6561R722j9523j6910
14882a2045n105p950j4461L515J4202J7123p84J431P614R371k642j6289o417O517
14868e920J6394J605j5782K878J1712L911q259j650Q530k0902n354M715J0940
$$ plain form
14855 2818 8236 11935 11386 4579 -2218 2133 4655 -9926 -13596 -8536 -2189 -9949 -17458 -23606 -17242
14840 -17242 -15474 -4616 8827 11340 14859 9945 5870 4988 -4317 -11357 -4796 10585 15033 13802
14826 13802 10881 8226 16782 8199 -9814 -17228 -11196 -9158 -5672 -164 18407 11703 2090 1705
14812 1705 2605 1672 16607 22942 21861 29430 36675 21758 11903 1698 3695 9550 16189 7613
14798 7613 -5224 12497 10400 -5009 -25823 -16542 -375 -11999 -11813 742 2693 10759 6163
14785 6163 6244 10278 6983 5253 11721 9691 8315 13852 11684 1531 5049 13633 4379 3264 5839
14770 5839 -7814 -4734 6984 5404 -3104 4247 8187 7560 11238 8391 -1673 -5221 -21830 -25660
14756 -25660 -12953 7907 13915 1386 882 -19087 -31708 -21581 -7178 3368 14236 9378
$$ packed form
14855B818N418L699n49o807o797M351K522j4581l670N060O347p760p509o148O364
14840a7242J768J0858J3443K513L519m914m075q82r305p040O561J5381M448j231
14826A3802k921k655Q556q583j8013p414O032K038L486N508J8571o704r613l85
14812A705R00r33J4935O335j081P569P245j4917r855j0205J997N855O639q576
14798G613j2837J7721k097j5409k0814R281J6167j1624J86J2555J951Q066m596
14785F163Q1M034l295j730O468k030j376N537k168j0153L518Q584r254j115K575
14770E839j3653L080J1718j580q508P351L940o27L678k847j0064l548j6609l830
14756b5660J2707K0860O008j2529n04j9969j2621J0127J4403J0546J0868m858
$$ plain form
14744 9378 1910 10539 11941 -5167 -26119 -17742 7032 8016 -287 -8590 8609 15370 5780 17024
14730 17024 26660 16482 7188 5485 4943 8835 -1273 -12092 -29341 -17197 3754 11718 25420
14717 25420 31655 23600 28054 30457 31433 33815 23551 12692 14655 5732 10156 8650 7449 17355
14703 17355 11479 10956 5574 14312 27626 41367 32853 16243 3442 -14575 -13762 3886 15637
14690 15637 10823 1497 -9854 -7856 1143 -20995 -27523 -23555 -11980 -12418 -2387 13707 33764
14677 33764 31551 23572 12636 9673 10604 21435 18785 19362 23454 13625 -11419 -17997 -16263 -11397
14663 -11397 -13702 -13083 -12855 -12909 -12099 -4635 15818 24816 16659 20960 22605 18914 36303 29851 20931
14648 20931 9656 -3323 4129 24085 12683 10463 10449 4099 8465 5413 -3429 -14883 -5650 6184
$$ packed form
14744I378p468Q629J402j7108k0952Q377K4774R84q303q303J7199O761r590J1244
14730A7024R636j0178r294j703n42L892j0108j0819j7249J2144K0951P964J3702
14717B5420O235q055M454K403R76K382j0264j0859J963q923M424j506j201R906
14703A7355n876n23n382Q738J3314J3741q514j6610j2801j8017Q13J7648J1751
14690A5637m814r326j1351J998Q999k2138o528L968J1575m38J0031J6094K0057
14677C3764k213p979j0936k963R31J0831k650N77M092r829k5044o578J734M866
14663a1397k305O19K28n4Q10P464K0453Q998q157M301J645l691J7389o452q920
14648B0931j1275j2979P452J9956j1402k220j4o350M366l052q842j1454R233J1834
$$ plain form
14634 6184 9342 18241 22018 24882 21116 13057 3652 -8694 3033 12783 22649 28533 24800 20754
14620 20754 15229 7168 -1017 135 2804 6942 12012 12973 14497 -4791 -2787 -1059 -14078 -26073
14606 -26073 -19236 -1330 4438 2933 -10037 -18143 -5989 -7545 -10404 3078 -9590 -12840 753
14593 753 5313 992 -645 -1957 -9902 -24800 -21767 -6297 -13374 -13309 -1171 -4266 -828 2365 13210
14578 13210 4709 -12181 -26732 -30095 -11515 -2368 -9008 -16502 1374 9181 9393 11601 3114 6995
14564 6995 14734 14786 20532 19804 -2061 -9023 -1157 4126 8730 -448 7622 7880 -5936 -16314 -16614
14549 -16614 6045 17910 19874 18551 20344 18953 5239 -3600 -3574 -9857 -3282 6696 14618 16723
14535 16723 38454 48675 37627 29769 12196 -1124 -8844 -10335 -6072 11116 12609 -1726 4012
$$ packed form
14634F184L158Q899L777K864l766q059r405j2346J1727R750R866N884l733m046
14620B0754n525q061q185J152K669M138N070R61J524j9288K004J728j3019j1995
14606b6073O837J7906N768j505j2970q106J2154j556k859J3482j2668l250J3593
14593G53M560m321j637j312p945j4898L033J5470p077O5J2138l095L438L193J0845
14578A3210q501j6890j4551l363J8580R147o640p494J7876P807K12K208q487L881
14564F995P739N2N746p28k1865o962P866N283M604r178Q070K58j3816j0378l00
14549a6614K2659J1865J964j323J793j391j3714q839K6o283O575R978P922K105
14535A6723K1731J0221j1048p858j7573j3320p720j491M263J7188J493j4335N738
$$ plain form
14522 4012 4143 13730 19717 15692 12157 15552 2205 -9276 -11766 -8606 -1615 -9298 -21129 -16013
14508 -16013 863 11615 20582 7442 6768 20236 10062 -7052 -9810 643 3166 8216 -12353
14495 -12353 -19033 -22943 -28079 -20840 -14680 -3315 -3715 -16837 -30915 -21183 5326 -625 -1431 -3403
14481 -3403 17317 17831 9692 9684 17561 12237 10000 7980 -5923 -12026 -8570 -8556 -3245 6779 7375 -1932
14465 -1932 -9990 -4204 1501 17931 26736 6596 -241 1670 6348 3971 -5099 -14080 -20256 -23558
14451 -23558 -16264 -11317 -15996 -19374 -1385 -11979 -27939 -26165 -14544 -23691 -20965 -29148 -35395
14438 -35395 -25001 -31231 -39495 -29690 -13365 -8248 -7226 1705 -1066 16924 20061 8942 10296
14425 10296 9759 11203 10707 15958 12735 9490 5017 -7608 -7276 -3023 1221 8056 13934 19338 21419
$$ packed form
14522D012J31R587N987m025l535L395j3347j1481k490L160O991p683j1831N116
14508a6013J6876J0752Q967j3140o74J3468j0174j7114k758J0453K523N050k0569
14495a2353o680l910n136P239O160J1365m00j3122j4078R732K6509n951q06j972
14481c403K0720N14q139qP877n324k237k020j3903o103L456J4N311J0024N96r307
14465a932q058N786N705J6430Q805k0140o837J911M678k377r070q981o176l302
14451b3558P294M947m679l378J7989j0594j5960J774J1621r147K726q183o247
14438c5395J0394o230q264R805J6325N117J022Q931k771J7990L137j1119J354
14425A0296n37J444m96N251l223l245m473j2625L32M253M244O835N878N404K081
$$ plain form
14410 21419 6294 -84 2651 -1783 -6692 -11358 -10179 -2786 7294 8413 24448 37473 35090
14397 35090 17947 -12192 -27044 -18362 5758 19171 21028 20427 10790 12355 11691 13779 21022 16635
14383 16635 954 11732 10553 3929 890 16844 18871 8656 -1570 -802 -5375 -2268 7240
14370 7240 12076 17020 -1144 -17958 -23752 -22269 -18689 -22154 -6999 8620 8330 637 -10165 -16569
14356 -16569 -6171 -2345 -5540 -1398 -5272 -13340 -7758 -11844 -10147 -7041 -4829 11337 700 -7022
14342 -7022 -12999 -21325 -18457 1330 -5619 -3799 1856 662 7632 18614 15329 12901 10351 1261
14328 1261 4472 2891 -1119 254 2460 -1997 -3333 -13344 -11959 -13585 -6545 8671 18240 32956
14314 32956 20138 26720 24214 24424 25309 17557 -4681 -17330 -12187 -1930 2624 7102 13089 24326
$$ packed form
14410B1419j5125o378K735m434m909m666J179P393J0080J119J6035J3025k383
14397C5090j7143l0139j4852Q682K4120J3413J857o01r637J565o64K088P243m387
14383A6635j5681J0778j179o624l039J5954K027j0215j0226P68m573L107R508
14370G240M836M944j8164j6814n794J483L580l465J5155J5619k90p693j0802o404
14356a6569J0398L826l195M142l874q068N582m086J697L106K212J6166j0637p722
14342g022n977q326K868J9787o949J820N655j194O970J0982l285k428k550r090
14328A261L211j581m010J373K206m457j336j0011J385j626P040J5216R569J4716
14314C2956j2818O582k506K10Q85p752k2238j2649N143J0257M554M478N987J1237
$$ plain form
14300 24326 12595 1566 7636 5063 19897 13120 -11864 -11826 -9372 -16864 -23457 -22736 -10311 419
14286 419 5636 4047 5033 7924 3715 3963 6955 3248 7890 740 -1320 1615 2444 4715 9955 11713
14270 11713 -363 -5842 542 10282 -2570 -17727 -14490 -17154 -14242 -885 -1511 -6545 55 500
14256 500 -1886 -10333 -18296 -26224 -26361 -27607 -19285 -15233 -14164 742 2134 -5489 -18438 -16830 -23853
14241 -23853 -20808 -22076 -14887 793 3665 -8749 -11674 -13668 -6649 4823 7648 6445 16289 28967
14227 28967 7568 14791 12839 -1077 -743 1137 2955 11439 21969 30648 6943 1924 3778 -444
14213 -444 2958 -6291 -3835 732 -3684 -19303 -43256 -48448 -23396 -18438 842 21349 15980 8613
14199 8613 4908 4092 3093 10166 27684 21827 17546 25354 15594 13913 13616 27083 15965 23428 23316
$$ packed form
14300B4326j1731j1029O070k573J4834o777k4984L8K454p492o593P21J2425J0730
14286D19N217j589R86K891m209K48K992l707M642p150k060K935Q29K271N240J758
14270A1713j2076n479O384R740j2852j5157L237k664K912J3357o26n034O600M45
14256E00k386q447p963p928j37j246Q322M052J069J4906J392p623j2949J608p023
14241b3853L045j268P189J5680K872j2414k925j994P019J1472K825j203R844J2678
14227B8967k1399P223j952j3916L34J880J818Q484J0530Q679k3705n019J854m222
14213d44L402r249K456M567m416j5619k3953n192K5052M958J9280K0507n369p367
14199H613l705q16r99P073J7518n857m281P808r760j681k97J3467j1118P463j12
$$ plain form
14184 23316 32207 22924 30479 25579 19052 19575 24495 18148 13957 7233 -4755 637 2798 3336 -254
14169 -254 2116 14499 23411 13974 3597 7846 8526 5961 2206 3486 11053 14635 27994 38002
14155 38002 26686 20343 13630 340 -18505 -12027 4856 11668 22326 16148 14262 19468 34981
14142 34981 23410 12612 220 -12488 2091 20804 26583 18264 18907 22387 20974 17234 26561
14129 26561 24892 38021 33862 8864 -3952 1723 12460 9807 7948 25318 30616 9858 9094
14116 9094 12431 12508 -3955 -13314 1230 450 570 4842 12371 12449 24584 10317 7100 1776 -12925
14101 -12925 -17849 -13764 -16108 -16275 -20151 -15965 -9391 -6322 -12692 -12990 -1657 -660 -9052 3653 9891
14086 9891 7660 6454 4684 13425 5291 8110 9595 7526 -7642 -5390 1790 15960 20241 19027
$$ packed form
14184B3316Q891r283P555m900o527N23M920o347m191o724j1988N392K161N38l590
14169b54K370J2383Q912r437j0377M249O80k565l755J280P567L582J3359J0008
14155C8002j1316o343o713j3290j8845O478J6883O812J0658o178j886N206J5513
14142C4981j1571j0798j2392j2708J4579J8713N779q319O43L480j413l740R327
14129B6561j669J3129m159k4998j2816N675J0737k653j859J7370N298k0758p64
14116I094L337P7j6463r359J4544p80J20M272P529P8J2135j4267l217n324j4701
14101a2925m924M085k344j67l876M186O574L069o370k98J1333R97q392J2705O238
14086I891k231j206j770Q741q134K819J485k069j5168K252P180J4170M281j214
$$ plain form
14072 19027 16956 7830 9088 3998 12085 14926 27663 22809 6083 4994 18529 19754 23355 17805
14058 17805 -3126 -18250 -17931 -10877 -9161 6133 5739 -1093 -7459 3959 10741 10495 -1546 -14072
14044 -14072 -9517 5635 16773 19284 16328 13335 14899 19648 4281 -9455 -3910 3218 8324
14031 8324 15672 17985 10576 5346 10304 7926 1009 3810 -37 -1464 -606 3730 13237 11709 15690
14016 15690 14347 -5415 -2817 7570 16928 29444 33214 26589 27951 24615 9169 -1893 -11703
14003 -11703 -4635 17994 28580 26796 10432 6865 -7682 -3877 2990 -4778 -5821 -2619 8003
13990 8003 5857 676 4282 10977 -2112 -18814 -10808 2696 22731 16606 5835 4389 7391
13977 7391 10541 5998 14548 15890 23076 31742 16854 3531 -6470 13072 8276 -11096 -24491
$$ packed form
14072A9027k071r126J258n090Q087K841J2737m854j6726j089J3535J225L601n550
14058A7805k0931j5124L19P054J716J5294l94o832o366J1418O782k46j2041j2526
14044a4072M555J5152J1138K511k956k993J564M749j5367j3736N545P128N106
14031H324P348K313p409n230M958k378o917K801l847j427Q58M336R507j528L981
14016A5690j343j9762K598J0387R358J2516L770o625J362l336j5446j1062r810
14003a1703P068K2629J0586j784j6364l567j4547L805O867p768j043L202J0622
13990H003k146n181L606O695j3089j6702Q006J3504K0035o125j0771j446L002
13977G391L150m543Q550J342P186Q666j4888j3323j0001J9542m796j9372j3395
$$ plain form
13964 -24491 -6107 1318 2292 10295 21288 20184 20322 23562 20729 9453 646 549 7937 22747
13950 22747 31550 36519 21337 23817 25616 26711 30523 16446 12282 17788 22981 28664 3006 560
13936 560 5111 5007 11721 13609 12232 16054 19514 17732 30564 20657 6134 3099 10769 8926 10433
13921 10433 12545 7169 8124 15044 43037 48813 56531 63890 40013 46413 55146 62397 79119 93572
13907 93572 102535 107461 89306 76017 48345 28311 29630 44861 55664 65865 60522 61261 66676
13894 66676 70310 77664 80922 75741 59083 60541 62673 58582 72992 91045 96697 103045 120177
13881 120177 116126 103317 103637 86857 66045 48669 43309 43168 60488 73081 68903 68121 91078
13868 91078 101944 74758 47130 45485 54069 52372 51772 54141 63344 94946 116146 135429 129432
$$ packed form
13964b4491J8384P425R74Q003J0993j104J38L240k833j1276q807r7P388J4810
13950B2747Q803M969j5182K480J799J095L812j4077m164N506N193N683k5658k446
13936E60M551j04O714J888j377L822L460j782J2832r907j4523l035P670j843J507
13921A0433K112n376R55O920K7993N776P718P359k3877O400Q733P251J6722J4453
13907I3572Q963M926j8155j3289k7672k0034J319J5231J0803J0201n343P39N415
13894F6676L634P354L258n181j6658J458K132m091J4410J8053N652O348J7132
13881A20177m051j2809L20j6780k0812j7376n360j41J7320J2593m178p82K2957
13868I1078J0866k7186k7628j645Q584j697o00K369R203L1602K1200J9283n997
$$ plain form
13855 129432 123518 113434 92165 61343 40055 47217 57407 46510 24994 18958 27754 29263
13843 29263 26583 22190 38779 38006 37711 44765 38975 37710 30586 16511 16097 18112 7151 -3191
13829 -3191 -11775 -5845 -2056 1751 21193 28650 19470 14357 23004 23541 24702 19522 16015 18537 27403
13814 27403 17354 13032 13239 18486 12187 3902 7102 -3783 -4900 -1195 -3260 -10092 -12879 -25342
13800 -25342 -22449 -7746 -516 1618 5581 10384 11228 6536 12995 28767 14991 -454 5691 2195
13786 2195 11445 6385 6964 2771 -269 1869 -9528 6447 13571 726 -5917 4090 14058 -7259
13772 -7259 -10619 -19976 -138 18395 18527 21150 23179 22227 -6313 -12271 3315 6497 -2576 -2292
13758 -2292 4906 7736 6596 6643 1859 5298 941 457 -11964 -18048 -8416 -12508 7743 12754 22741
$$ packed form
13855A29432n914j0084k1269l0822k1288P162J0190j0897k1516o036Q796J509
13843B9263k680m393J6589p73k95P054n790j265p124j4075m14K015j0961j0342
13829c191q584N930L789L807J9442P457r180n113Q647N37J161n180l507K522Q866
13814B7403j0049m322K07N247o299q285L200j0885j117L705k065o832k787j2463
13800b5342K893J4703P230K134L963M803Q44m692O459J5772j3776j5445O145l496
13786B195R250n060N79m193l040K138j1397J5975P124j2845o643J0007R968k1317
13772g259l360r357J9838J8533J32K623K029r52k8540n958J5586L182r073K84
13758b292P198K830j140M7m784L439m357m84j2421o084R632m092K0251N011R987
$$ plain form
13743 22741 22378 28114 23447 16869 33794 36305 13857 3683 2193 11166 23871 24610 22480 26958
13729 26958 25811 5560 11363 14555 11470 29772 41840 53240 61240 56723 58204 76609 85871
13716 85871 86249 84918 75056 70245 53015 31707 26551 38981 46971 52411 50724 51414 67304 97575
13702 97575 104769 92223 78288 71828 75438 77078 87235 102292 105134 97377 90394 89156 94413
13689 94413 91048 90331 100014 83552 70633 66223 62659 64408 62161 79853 100634 92073 74986
13676 74986 74188 85485 76967 62892 73289 83012 78910 86051 101815 107025 113119 114691 110368 89028
13662 89028 74950 80445 87012 79814 63570 53778 45973 38579 35839 45065 36871 38921 45747 45127
13648 45127 46540 40124 44914 47923 48214 42585 30518 36140 45424 37269 35504 54742 53600 47225
$$ packed form
13743B2741l63N736m667o578J6925K511k2448j0174j490Q973J2705P39k130M478
13729B6958j147k0251N803L192l085J8302J2068J1400Q000m517J481J8405R262
13716H5871L78j331r862m811j7230k1308n156J2430P990N440j687O90J5890L0271
13702I7575P194j2546j3935o460L610J640J0157J5057K842p757o983j238N257
13689I4413l365p17R683j6462j2919m410l564J749k247J7692K0781q561j7087
13676G4986p98J1297q518j4075J0397R723m102P141J5764N210O094J572m323k1340
13662H9028j4078N495O567p198j6244r792p805p394k740R226q194K050O826o20
13648D5127J413o416M790L009K91n629j2067N622R284q155j765J9238j142o375
$$ plain form
13634 47225 40331 33459 16177 22111 21178 16245 13933 21137 32009 28804 20882 27964 34431 33909
13620 33909 27031 18553 18328 25858 50569 58077 41427 23285 25945 16185 19849 29159 38963 46202
13606 46202 32437 18846 21127 29326 24068 25419 33835 29596 29856 23286 22878 29919 30918 28371 30615
13591 30615 35564 49620 49048 45718 37930 41972 53353 69335 61139 40435 25795 29007 742
13578 742 -1528 2898 16213 18927 14849 28194 45702 43591 31767 31942 47204 54303 60355 53471
13564 53471 57321 49017 38650 30559 25085 38346 48060 46397 44482 51480 52056 55863 68391 76132
13550 76132 68215 60307 60255 53304 39952 47078 65455 65189 61131 70728 79181 63587 53420 55035
13536 55035 51304 41249 36371 50125 72609 90164 91318 95999 96245 84968 85217 91856 82957 93776
$$ packed form
13634D7225o894o872j7282N934r33m933k312P204J0872l205p922P082O467n22
13620C3909o878q478k25P530K4711P508j6650j8142K660r760L664R310R804P239
13606D6202j3765j3591K281Q199n258J351Q416m239K60o570m08P041R99k547K244
13591C0615M949J4056n72l330p788M042J1381J5982q196k0704j4640L212k8265
13578G42k270M426J3315K714m078J3345J7508k111j1824J75J5262P099O052o884
13564E3471L850q304j0367q091n474J3261R714j663j915O998N76L807J2528P741
13550G6132p917p908n2o951j3352P126J8377k66m058R597Q453j5594j0167J615
13536E5035l731j0055m878J3754K2484J7555J154M681K46j1277K49O639q899J0819
$$ plain form
13522 93776 82636 90151 103584 106109 94173 87033 79322 67879 65559 59724 70018 57824 66743
13509 66743 84846 80025 80562 74868 72400 73643 94775 82111 77751 84510 86414 92100 97509 85983
13495 85983 84112 93966 118667 119226 119811 120050 122744 130149 137614 141533 136763 146789 157367 173174
13481 173174 174411 180115 185422 194684 201523 206584 203533 213075 234072 247495 261388 283048 306202
13468 306202 320758 343086 382948 420719 449534 495310 529430 560348 633378 709912 799723
13457 799723 907369 1035818 1215541 1439849 1700150 2055221 2526464 3206433 4235854
13448 4235854 5792183 7879278 10007748 11455718 12367574 13110414 13132485 12021312 10415088
13439 10415088 8909380 7577334 6451781 5639855 5207962 5154939 5510743 6455966 8267504
$$ packed form
13522I3776j1140P515J3433K525j1936p140p711j1443k320n835J0294j2194Q919
13509F6743J8103m821N37n694k468J243K1132j2664m360O759J904N686N409j1526
13495H5983j871R854K4701N59N85K39K694P405P465L919m770J0026J0578J5807
13481A73174J237N704N307R262O839N061l051R542K0997J3423J3893K1660K3154
13468C06202J4556K2328L9862L7771K8815M5776L4120L0918P3030P6534Q9811
13457G99723J07646J28449J79723K24308K60301L55071M71243O79969J029421
13448D235854J556329K087095K128470J447970R11856P42840K2071j111173j606224
13439A0415088j505708j332046j125553q11926m31893n3023L55804R45223J811538
$$ plain form
13430 8267504 10819047 12805486 12893812 11987800 11328604 10994456 11061744 11963365 13475042
13421 13475042 14691775 15293102 15910702 16602285 16389684 14869160 12879036 11050864 9384161
13412 9384161 7937769 6906472 6358155 6283833 6781139 8045948 10393589 13616344 15960388
13403 15960388 15823250 14431298 13275040 12318563 11615336 11867243 13531556 16521815 19888720
13394 19888720 22283188 22936132 21486490 18595227 15370289 12274021 9442711 7140217
13386 7140217 5461294 4282646 3460688 2857984 2430076 2128587 1902336 1742143 1614605
13377 1614605 1502232 1419682 1389373 1417319 1539654 1778586 2252476 3004880 3816308 4110776
13367 4110776 3768198 3278332 2812162 2286859 1770426 1367429 1092179 904041 763412
$$ packed form
13430H267504K551543J986439Q8326r06012o59196l34148O7288R01621J511677
13421A3475042J216733O01327O17600O91583k12601j520524j990124j828172j666703
13412I384161j446392j031297n48317p4322M97306J264809K347641L222755K344044
13403A5960388j37138j391952j156258r56477p03227K51907J664313K990259L366905
13394A9888720K394468O52944j449642k891263l224938l096268k831310k302494
13386G140217j678923j178648q21958o02704m27908l01489k26251j60193j27538
13377A614605j12373q2550l0309K7946J22335K38932M73890P52404Q11428K94468
13367D110776l42578m89866m66170n25303n16433m02997k75250j88138j40629
$$ plain form
13358 763412 658686 564041 497816 459613 440329 428385 391659 354526 327226 316167 303740
13347 303740 284802 286128 279282 272545 253870 234579 217188 218076 220258 216564 224005 221342 213066
13334 213066 202531 203884 211173 208347 195873 179125 173050 170439 180319 196572 194477 188326 183345
13321 183345 174896 174893 171604 164956 180113 176797 161976 162189 166234 162350 142684 129827 133361 148148
13307 148148 164027 175150 161368 156401 181001 197529 195577 192481 201312 204405 220133 234423
13295 234423 245039 237778 234924 240179 249245 256800 275209 296955 313331 340432 369966 420125
13283 420125 471241 538237 608773 690431 807967 979125 1215633 1586725 2169988 3007730
13273 3007730 3810512 4054209 3718595 3272195 2848306 2362350 1925655 1623440 1457203
$$ packed form
13358G63412j04726r4645o6225l8203j9284j1944l6726l7133k7300j1059j2427
13347C03740j8938J326o846o737j8675j9291j7391Q88K182l694P441k663q276
13334B13066j0535J353P289k826j2474j6748o075k611R880J6253k095o151m981
13321A83345q449ll289o648J5157l316j4821K13M045l884j9666j2857L534J4787
13307A48148J5879J1123j3782m967K4600J6528j952l096Q831L093J5728J4290
13295B34423J0616p261k854N255R066P555J8409K1746J6376K7101K9534N0159
13283D20125N1116O6996P0536Q1658J17536J71158K36508L71092N83263Q37742
13273C007730Q02782K43697l35614m46400m23889m85956m36695l02215j66237
$$ plain form
13264 1457203 1371741 1344028 1402565 1519136 1683526 1919020 2247066 2702702 3294609 3873175
13254 3873175 4443172 5314031 6713257 8912927 12220118 16418467 20172666 22255434
13246 22255434 22464184 20959644 18471328 15871306 13604968 11996280 11556789 12605509
13238 12605509 14838059 16474047 15837650 13911995 12118501 10422940 8679641 7314598
13230 7314598 6551807 6360293 6677456 7602328 9259457 11491646 13546729 14693824 15293643
13221 15293643 16007312 16414035 15674199 14111119 12584555 11471672 10980655 11500365 12886258
13212 12886258 13707467 12825501 11197145 9757665 8374892 6997673 5974103 5406927
13204 5406927 5262043 5524068 6240326 7521825 9263312 10928420 11975383 12644704 13159619
$$ packed form
13264A457203q5462k7713N8537J16571J64390K35494L28046M55636N91907N78566
13254C873175N69997Q70859J399226K199670L307191M198349L754199K082768
13246B2255434K08750j504540k488316k600022k266338j608688m39491J048720
13238A2605509K232550J635988o36397j925655j793494j695561j743299j365043
13230G314598p62791j91514L17163R24872J657129K232189K055083J147095N99819
13221A5293643P13669M06723p39836j563080j526564j112883m91017N19710J385893
13212A2886258Q21209q81966j628356j439480j382773j377219j023570n67176
13204E406927j44884K62025P16258J281499J741487J665108J046963O69321N14915
$$ plain form
13195 13159619 12812781 11307106 9430873 7725480 6148973 4749960 3636946 2821331
13187 2821331 2254116 1862146 1582721 1369286 1194314 1062905 937975 834509 741657 652916
13177 652916 584577 536964 499317 455793 422725 391828 359543 341662 336960 322932 311563 285595
13165 285595 261793 240199 225484 222540 204471 189211 181632 182633 184514 181192 184783 193112 185405
13152 185405 165378 154319 143901 141873 150902 150926 146476 138138 134056 132592 113632 100507 96761
13139 96761 101862 112894 114772 105281 109180 112440 125474 114447 109418 111440 98692 91134 93880
13126 93880 106219 112951 97444 69282 56372 43901 45944 55763 49703 50830 49260 58404 70325
13113 70325 77498 66467 66005 59095 58931 69016 63394 55964 49425 48116 58831 65682 74809 62532
$$ packed form
13195A3159619l46838j505675j876233j705393j576507j399013j113014q15615
13187B821331n67215l91970k79425k13435j74972j31409j24930j03466r2852q8741
13177F52916o8339m7613l7647m3524l3068l0897l2285j7881m702j4028j1369k5968
13165B85595k3802k1594j4715k944j8069j5260p579J001J881l322L591Q329p707
13152A85405k0027j1059j0418k028R029K4m450q338m082j464j8960j3125l746
13139I6761N101J1032J878r491L899L260J3034j1027n029K022j2748p558K746
13126I3880J2339O732j5507k8162j2910j2471K043R819o060J127j570R144J1921
13113G0325P173j1031m62o910j64J0085n622p430o539j309J0715O851R127j2277
$$ plain form
13099 62532 59604 45128 39934 24271 20177 23039 13313 13021 10522 23178 36245 30707 27179 33324
13085 33324 32321 27425 8732 3943 19095 26128 24321 40632 50487 61375 66373 58479 47918
13072 47918 65753 81205 61012 44081 45394 50818 40462 30571 19699 19408 35484 47051 34699
13059 34699 32463 27763 23572 23279 33991 21596 9207 3235 1907 6887 24121 23168 21789 18371
13045 18371 5036 -4715 -3072 -4332 2470 12725 29124 36953 30829 22819 17580 5404 6412
13032 6412 18577 32436 25835 23307 38301 32785 34836 38632 42499 44233 43124 28310 11383
13019 11383 5873 18090 23835 18354 21722 22504 27541 29344 31262 33006 24288 17900 8338 5608
13005 5608 23006 42963 33674 19514 22297 12753 17351 31394 19158 21212 14376 14828 21081 18934
$$ packed form
13099F2532k928j4476n194j5663m094K862r726k92k499J2656J3067n538l528O145
13085C3324j003m896j8693m789J5152P033j807J6311R855J0888M998p894j0561
13072D7918J7835J5452k0193j6931J313N424j0356r891j0872k91J6076J1567j2352
13059C4699k236m700m191k93J0712j2395j2389n972j328M980J7234r53j379l418
13045A8371j3335r751J643j260O802J0255J6399P829o124q010n239j2176J008
13032F412J2165J3859o601k528J4994n516K051L796L867J734j109j4814j6927
13019A1383n510J2217N745n481L368P82N037J803J918J744q718o388r562k730
13005E608J7398J9957r289j4160K783r544M598J4043j2236K054o836M52O253k147
$$ plain form
12991 18934 22923 20572 16916 11403 10625 18666 16591 12215 11377 18457 16909 19385 21661 20245 33496
12976 33496 30995 32864 24922 26965 41302 48405 67756 93862 118422 133008 148458 145998 138028
12963 138028 115260 80902 58837 64258 62610 68863 76982 77398 81889 85838 91440 75585 70361
12950 70361 66240 58721 55969 56309 50027 54474 71520 94778 92413 77436 72742 73764 76756 70183
12936 70183 59480 50533 51105 57063 61661 82757 99792 93787 80692 74974 74551 70449 60282 36287
12922 36287 18456 31344 35041 35588 44852 55148 62014 65795 85004 93798 83907 68688 62805
12909 62805 50457 52008 49841 37381 30893 38745 43980 48975 44418 24008 12894 13224 10472 20650
12895 20650 22447 17896 12293 15925 12195 12498 6444 1106 1444 -4718 -12525 -23211 -20038 -9703
$$ packed form
12991A8934L989k351l656n513p78Q041k075m376q38P080j548K476K276j416J3251
12976C3496k501J869p942K043J4337P103J9351K6106K4560J4586J5450k460p970
12963A38028k2768l4358k2065N421j648O253Q119M16M491L949N602j5855n224
12950G0361m121p519k752L40o282M447J7046K3258k365j4977m694J022K992o573
12936G0183j0703q947N72N958M598K1096J7035o005j3095n718m23m102j0167k3995
12922C6287j7831J2888L697N47R264J0296O866L781J9209Q794r891j5219n883
12909F2805j2348J551k167j2460o488P852N235M995m557k0410j1114L30k752J0178
12895B0650J797m551n603L632l730L03o054n338L38o162p807j0686L173J0335
$$ plain form
12881 -9703 -10326 -1455 -2993 -7445 -5574 -13184 -21747 -9213 -7557 -7786 -5715 8178 11946 10523 10475
12866 10475 6245 6836 8416 -4922 -1610 -5525 -10251 -5645 -2723 -3256 2768 10847 25343 22508
12852 22508 13881 12313 9593 -2472 -8 -2454 4048 18725 15914 3387 -2318 2593 8631 13532
12838 13532 5908 -14226 -18774 5756 19539 25349 8971 6613 17947 16935 9307 3888 6770
12825 6770 5996 1059 -8557 -3431 12495 731 -7287 4144 8792 2502 876 -3250 -14553 -16332
12811 -16332 -875 11892 14505 14157 8400 -6068 1770 12786 17428 9154 3117 14329 13840 9444
12797 9444 8128 5856 6017 4054 3132 4177 876 5294 15945 5205 5020 6463 6948 10432 22035
12782 22035 46711 71936 94018 118399 124468 115228 92191 80519 72307 65243 49871 44002 33165
$$ packed form
12881i703o23Q871j538m452J871p610q563J2534J656k29K071J3893L768j423m8
12866A0475m230N91J580j3338L312l915m726M606K922n33O024Q079J4496k835
12852B2508q627j568k720j2065K464k446O502J4677k811j2527n705M911O038M901
12838A3532p624k0134m548K4530J3783N810j6378k358J1334j012p628n419K882
12825F770p74m937r616N126J5926j1764q018J1431M648o290j626m126j1303j779
12811a6332J5457J2767K613l48n757j4468P838J1016M642q274o037J1212m89m396
12797I444j316k272J61j963r22J045l301M418J0651j0740j85J443M85L484J1603
12782B2035K4676K5225K2082K4381O069r240k3037j1672q212p064j5372n869j0837
$$ plain form
12769 33165 36493 47522 57465 79467 84693 78929 76065 60856 51151 49947 56102 51712 62823
12756 62823 71765 88885 99733 108038 116486 116484 106348 91661 79262 68345 51319 66755 72565
12743 72565 68145 86342 87475 96892 100542 77516 56658 46403 53934 55279 57526 54848 52699
12730 52699 58308 60040 74454 103735 120727 96878 82602 71538 69253 63507 38578 38177 41609
12717 41609 56142 50615 29647 28104 24078 10716 32 -6959 -9002 -8484 -3305 14022 29271
12704 29271 18108 20872 25370 9846 2356 -4864 972 5223 12637 30369 46168 59193 57116
12691 57116 48747 34503 20690 10345 -1511 -9981 3330 7505 4414 1101 2048 214 1781
12678 1781 2071 5531 1088 -14740 -6884 -178 10435 -7945 -13813 -2548 4569 5089 -9841 -10899
$$ packed form
12769C3165L328J1029R943K2002N226n764k864j5209r705j204O155m390J1111
12756F2823Q942J7120J0848Q305Q448kj0136j4687j2399j0917j7026J5436N810
12743G2565m420J8197J133R417L650k3026k0858j0255P531J345K247k678k149
12730E2699N609J732J4414K9281J6992k3849j4276j1064k285n746k4929m01L432
12717D1609J4533n527k0968j543m026j3362j0684o991k043N18N179J7327J5249
12704B9271j1163K764M498j5524p490p220N836M251P414J7732J5799J3025k077
12691E7116q369j4244j3813j0345j1856q470J3311M175l091l313R47j834J567
12678A781K90L460m443j5828P856O706J0613j8380n868J1265P117N20j4930j058
$$ plain form
12664 -10899 -8872 -13350 -18683 -13696 -14508 -11440 -7987 -2418 -1953 -5646 -12765 -15881 -7012 -5445 -17485
12649 -17485 -21166 -11228 -3650 -14780 -21851 -19067 -4473 12373 4140 6282 -4781 -2829 3984
12636 3984 5013 620 10422 6579 -4038 -158 5045 7946 23562 32065 20058 19587 6172 17778
12622 17778 26637 20768 8392 -1539 -10213 263 -1456 -13607 -5329 4062 6825 1596 -794 5548
12608 5548 14276 3066 -8048 -14643 -20323 -13919 -30009 -19478 -7516 -19321 -22862 -18656 -7190
12595 -7190 -3610 8369 9751 -5970 -16980 -19751 -11303 -4912 -4873 -10897 -2405 3188 3657 -15228
12581 -15228 -35022 -30103 -23132 -20314 -15412 -6726 456 7815 -3908 -13339 -10693 -2050 14412 21223
12567 21223 13727 7816 -12009 -18140 -17329 -6005 -11439 -7414 -11506 -16070 -9165 -14988 -15341 -14011
$$ packed form
12664a0899K027m478n333M987q12L068L453N569M65l693p119l116Q869J567j2040
12649a7485l681R938P578j1130p071K784J4594J6846q233K142j1063J952O813
12636C984J029m393R802l843j0617L880N203K901J5616Q503j2007m71j3415J1606
12622A7778Q859n869j2376r931q674J0476j719j2151Q278R391K763n229k390O342
12608E548Q728j1210j1114o595n680O404j6090J0531J1962j1805l541M206J1466
12595g190L580J1979J382j5721j1010k771Q448O391L9o024Q492N593M69j8885
12581a5228j9794M919O971K818M902Q686P182P359j1723r431K646Q643J6462O811
12567B1223p496n911j9825o131Q11J1324n434M025m092m564O905n823l53J330
$$ plain form
12553 -14011 -11883 -6254 -143 11846 19494 21835 22085 -9756 -21894 -25364 -9463 -4298 1838 5785
12539 5785 12345 3395 3040 4143 8300 21617 16799 -289 -16345 -14959 6949 23732 25855 20033
12525 20033 2180 -707 -6112 -9826 -20312 -32003 -26333 -13383 -692 688 -10972 -25453 -19742
12512 -19742 -24774 -19158 2155 553 -4574 6109 9820 15205 4137 -8574 -8255 -4234 1270 4370
12498 4370 7543 -6347 -12180 -13332 -11763 -14659 -7360 -6355 -10451 -14176 -17607 -9037 -10978 -18945
12484 -18945 -9135 2611 16192 21238 18340 9145 -4783 -22513 -26137 -19735 -27665 -13624 8
12471 8 8385 -1453 1921 13799 14582 11152 1767 -1253 -1351 -3360 -9345 -9973 -1408 -12177 -8726 2308
12455 2308 -359 -8162 4002 -5772 -9163 3145 8337 -2369 5769 -8478 -17357 -2232 -2043 -3571
$$ packed form
12553a4011K128N629O111J1989P648K341K50l1841j2138l470J5901N165O136L947
12539E785O560q950l55J103M157J3317m818j7088j6056J386K1908J6783K123n822
12525B0033j7853k887n405l714j0486j1691N670J2950J2691J380j1660j4481N711
12512a9742n032N616K1313j602n127J0683L711N385j1068j2711L19M021N504L100
12498D370L173j3890n833j152J569k896P299J005m096l725l431Q570j941p967
12484a8945R810J1746J3581N046k898r195j3928j7730l624O402p930J4041J3632
12471HQ377r838L374J1878P83l430r385l020r8k009n985o28Q565j0769L451J1034
12455B308k667p803J2164r774l391J2308N192j0706Q138j4247q879J5125J89j528
$$ plain form
12441 -3571 -1210 1451 14797 17616 12357 -3941 -519 1593 6337 12749 1698 -8791 -8028 -9191
12427 -9191 -5358 -3724 -6290 6503 -951 -7227 -9278 -4488 -7850 -11011 -2947 -2863 -13568 -11151 -10246
12412 -10246 -13741 -9159 -3245 -6810 -10144 -13194 -23780 -7183 3640 -503 -8884 -2362 -4746 -222
12398 -222 -1625 4788 2992 -2613 11073 22212 7207 4980 -9984 -17789 -31848 -27275 -6416
12385 -6416 3456 7520 10583 1216 -858 -2962 -21254 -22172 -9092 -5349 -64 3730 4000 16711
12371 16711 28099 35979 22684 9354 1978 -13013 -16195 -4192 8114 4129 12105 13841 6262
12358 6262 -417 1117 1136 -3027 -18315 -5181 6617 14674 22790 17569 9627 7117 -1044 -1385 3393
12343 3393 4838 6405 4828 -2664 -4034 17539 26643 12697 -9165 -8153 -1351 7304 13427 9857
$$ packed form
12441c571K361K661J3346K819n259j6298L422K112M744O412j1051j0489P63j163
12427i191L833J634k566J2793p454o276k051M790l362l161Q064Q4j0705K417R05
12412a0246l495M582N914l565l334l050j0586J6597J0823m143q381O522k384M524
12398b22j403O413j796n605J3686J1139j5005k227j4964p805j4059M573K0859
12385f416R872M064L063r367k074k104j8292r18J3080L743N285L794K70J2711
12371A6711J1388P880j3295j3330p376j4991l182J2003J2306l985P976J736p579
12358F262o679J534J9m163j5288J3134J1798Q057Q116n221p942k510q161l41M778
12343C393J445J567j577p492j370K1573R104j3946k1862J012O802Q655O123l570
$$ plain form
12329 9857 12305 20776 8473 11955 15261 -1869 -947 -282 -3724 12537 2797 2527 604 6539 9691
12314 9691 -5852 1553 -2473 -3362 -2510 -1178 -10962 -5424 6407 1896 4050 9658 6407 -4323
12300 -4323 -1730 -5976 1614 672 -3216 9684 -2470 -12728 -7155 6283 -5573 -15170 -5675 -3560
12286 -3560 -5374 -5581 -777 -10296 -3150 6490 1856 -4337 -8322 -8020 -7641 -9815 -21879 -24687 -15402
12271 -15402 -605 -3860 954 -2080 8007 8137 -7500 -17524 -17677 -23407 -19877 -12585 -10559 -10030
12257 -10030 -422 -4965 -10704 -4462 -6144 -9405 -8827 -9989 -12228 -2610 174 -4602 -7609 5140
12243 5140 -1667 -16948 -17298 -8829 17888 22098 25939 29397 16168 5661 3387 -5603 -4079 4984
12229 4984 1485 -11124 652 14395 14248 1197 -4186 12070 12506 12501 14534 16389 9410 3955 3123
$$ packed form
12329I857K448Q471j2303L482L306j7130R22O65l442J6261r740k70j923N935L152
12314I691j5543P405m026q89Q52J332r784N538J1831m511K154N608l251j0730
12300d323K593m246P590r42l888J2900j2154j0258N573J3438j1856r597R495K115
12286c560j814k07M804r519P146R640m634o193l985L02L79k174j2064k808R285
12271a5402J4797l255M814l034J0087J30j5637j0024j53n730L530P292K026N29
12257a0030R608m543n739O242j682l261N78j162k239R618K784m776l007J2749
12243E140o807j5281l50Q469K6717M210L841L458j3229j0507k274q990J524R063
12229D984l499j2609J1776J3743j47j3051n383J6256M36nK033J855o979n455q32
$$ plain form
12214 3123 23163 18943 19825 30052 46906 44587 40586 49955 49524 51957 60679 71769 76256 85470
12200 85470 79069 55358 44923 32017 23060 19003 19214 8774 9185 8556 7565 17117 22226 7770
12186 7770 18472 11286 7511 -5187 -6965 -7006 -6416 7868 1269 -3334 -11701 -2258 12462 13827
12172 13827 16933 15374 1864 19406 25746 13703 3453 -4491 -1215 3930 8388 13598 -2286
12159 -2286 -16444 -9033 10174 12535 -3805 -8857 4725 11815 3728 -2273 -2189 125 3893 17670
12145 17670 21028 22179 24329 3776 -6278 -9539 -10716 -12954 8 -952 -7425 -4508 -4117 -798
12131 -798 -1326 -15153 -14348 -22223 -19173 -21329 -18108 -1755 12084 13263 764 3794 11556 3647
12117 3647 -2425 5296 7397 -2383 -9350 -12252 -7342 -2905 1573 -3080 -8654 -7970 -14000 -4128 8070
$$ packed form
12214C123K0040m220Q82J0227J6854k319m001R369m31K433Q722J1090M487R214
12200H5470o401k3711j0435j2906q957m057K11j0440M11o29r91R552N109j4456
12186G770J0702p186l775j2698j778m1N90J4284o599m603q367R443J4720J365
12172A3827L106j559j3510J7542O340j2043j0250p944L276N145M458N210j5884
12159b286j4158P411J9207K361j6340n052J3582P090q087o001Q4K314L768J3777
12145A7670L358J151K150k0553j0054l261j177k238J2962r60o473K917L91L319
12131g98n28j3827Q05p875L050k156L221J6353J3839J179j2499L030P762p909
12117C647o072P721K101r780o967k902M910M437M478m653n574O84o030R872J2198
$$ plain form
12102 8070 1848 -2869 -2201 17842 23426 17691 19072 5744 4722 7132 2744 5954 3631 -1763
12088 -1763 -1765 13304 20141 20990 15600 4216 5153 2043 -2236 11934 22816 23152 14937 8805 6031
12073 6031 -1439 -13678 -7736 -2122 3553 9255 -4062 -21591 -12406 -9547 -3424 1113 -2513 -2165
12059 -2165 -12837 -9659 1480 3469 -6422 -15721 -33417 -30808 -20612 -16714 -6047 -9734 -11687
12046 -11687 1616 -4309 62 12799 -793 -832 -15976 -28113 -15724 -7599 -10592 -11404 -11105 6487
12032 6487 11813 7581 4366 7025 -1918 -2338 -12549 -11434 804 2551 -490 -2011 449 3482
12018 3482 1029 -5478 -12903 -17675 -17059 -3187 5511 -3973 -15230 -2109 -4976 -8268 -11540 -16256
12004 -16256 -17815 -22851 -23214 -20501 -17259 -10726 -5121 -10286 -14667 -8447 -3085 8504 27217 12726
$$ packed form
12102H070o222m717O68K0043N584n735J381j3328j022K410m388L210k323n394
12088a763kJ5069O837Q49n390j1384R37l110m279J4170J0882L36q215o132k774
12073F031p470j2239N942N614N675N702j3317j7529R185K859O123M537l626L48
12059b165j0672L178J1139J989r891r299j7696K609J0196L898J0667l687j953
12046a1687J3303n925M371J2737j3592l9j5144j2137J2389Q125k993q12K99J7592
12032F487N326m232l215K659q943m20j0211J115J2238J747l041j521K460L033
12018C482k453o507p425m772O16J3872Q698r484j1257J3121k867l292l272m716
12004a6256j559n036l63K713L242O533N605n165m381O220N362J1589J8713j4491
$$ plain form
11990 12726 2640 12723 24703 23767 9340 6984 10224 9888 599 7670 17405 24923 21587 14380
11976 14380 17519 16876 14955 7100 -354 -2539 -1965 2602 21936 16295 -7411 -19519 -25832 -23498
11962 -23498 -11475 981 13003 26773 24160 15320 15279 3718 -14957 -19694 -3927 14924 9631
11949 9631 7877 6358 -8346 -24875 -32760 -24580 -12435 -10252 -8016 -15112 -16840 -5348 -10778 -20238
11935 -20238 -8749 3352 5798 4019 3761 4104 7470 9577 8663 -484 13230 4884 -8469 -10084
11921 -10084 -939 -28 7490 5006 -8426 -13470 -15743 -14830 -16567 -22515 -12295 -19588 -7897 -8818
11907 -8818 -15472 -4502 15310 11363 8395 14743 13485 12422 10458 13356 29721 23046 9305 -4172
11893 -4172 186 -7467 -637 -8679 -10890 8748 14043 -3407 -1064 776 6148 12316 6875 -306
$$ packed form
11990A2726j0086J0083J1980r36j4427k356L240l36r289P071R735P518l336p207
11976A4380L139o43j921p855p454k185N74M567J9334n641k3706j2108o313K334
11962b3498J2023J2456J2022J3770k613q840m1j1561j8675m737J5767J8851n293
11949I631j754j519j4704j6529p885Q180J2145K183K236p096j728J1492n430r460
11935b0238J1489J2101K446j779k58L43L366K107r14r147J3714q346j3353j615
11921a0084R145R11P518k484j3432n044k273R13j737n948J0220p293J1691r21
11907h818o654J0970J9812l947k968O348j258j063j964K898J6365o675j3741j3477
11893d172M358p653O830q042k211J9638N295j7450K343J840N372O168n441p181
$$ plain form
11879 -306 5765 7055 12885 4875 6414 6411 -1832 -1957 -184 -8359 -19567 -20015 -20516 -5176 5627 5594
11863 5594 -4003 -13709 -14095 -5491 7048 7338 16990 2442 -3330 -5013 7308 10904 13342 13864 -4749
11848 -4749 -7203 -8364 -825 11187 951 -25209 -16868 -12619 5676 12966 -5542 -12044 -5083
11835 -5083 11559 -1214 936 10064 8949 -1785 -4089 -1414 283 -15867 -9178 3822 3447 622
11821 622 -10278 -10025 6228 26181 11442 3418 20885 22057 905 -3683 -12835 -15561 -15143 -3114
11807 -3114 -2194 7948 6652 -4394 -6903 -8895 -1148 -3925 -12088 -10577 -8948 2809 3648 -8033
11793 -8033 -10718 -18106 -19508 -21875 -34039 -32472 -24100 -24501 -10551 3936 86 45 -1545 -10036 -15601
11778 -15601 -1908 982 -5258 -30462 -23052 -4129 7440 20558 15610 2133 -4103 -4049 -8580
$$ packed form
11879c06O071J290N830q010J539lq243j25J773q175j1208m48n01J5340J0803l3
11863E594r597r706l86Q604J2539K90R652j4548n772j683J2321L596K438N22j8613
11848d749k454j161P539J2012j0236k6160Q341M249J8295P290j8508o502O961
11835e083J6642j2773K150R128j115j0734k304K675J697j6150O689J3000l75k825
11821F22j0900K53J6253J9953j4739q024J7467J172k1152m588r152k726M18J2029
11807c114R20J0142j296j1046k509j992P747k777q163J511J629J1757Q39j1681
11793h033k685p388j402k367j2164J567Q372m01J3950J4487l850m1j590q491n565
11778a5601J3693K890o240k5204P410J8923J1569J3118m948j3477o236N4m531
$$ plain form
11765 -8580 -10913 -5080 -13360 -14747 -9169 -3586 5874 13277 -5859 -12578 -10580 -7828 9895 6329
11751 6329 -2319 -15694 -25544 -14308 -21608 -40861 -32605 -11611 -18342 -24535 -17288 -11847 -7776 -7494
11737 -7494 -18708 -19986 -2952 4846 5949 -8232 -19227 -21546 -10315 -10562 -2152 5417 10013 5492
11723 5492 14958 8238 6828 -531 -16395 -8744 -16890 -19499 -21218 -23745 -20359 -17950 -26759 -19930
11709 -19930 -11458 -7814 1928 -12067 -16420 -21845 -22647 -14725 -16875 -14760 -10034 -9946 -521 2517 -5392
11694 -5392 1633 -6229 -8462 -3736 13006 4256 1980 464 15714 25211 12608 -4823 -7797 -8085
11680 -8085 -6936 -3749 -8833 -8340 3233 3493 -3023 3690 69 -7170 -16248 -14271 -15042 -7250 -4188
11665 -4188 -1284 11963 4270 -12376 -1862 -3095 -4630 -2961 2576 -9266 -10643 -16394 -25022 -15406
$$ packed form
11765h580k333N833q280j387N578N583R460P403j9136o719J998K752J7723l566
11751F329q648j3375r850J1236p300j9253Q256K0994o731o193P247N441M071K82
11737g494j1214j278J7034P798J103j4181j0995k319J1231k47Q410P569M596m521
11723E492R466o720j410p359j5864P651q146k609j719k527L386K409q809O829
11709a9930Q472L644R742j3995m353n425q02P922k150K115M726Q8R425L038p909
11694e392P025p862k233M726J6742q750k276j516J5250R497j2603j7431k974k88
11680h085J149L187n084M93J1573K60o516O713l621p239r078J977p71P792L062
11665d188K904J3247p693j6646J0514j233j535J669N537j1842j377n751q628R616
$$ plain form
11651 -15406 1636 -3996 -9815 4889 4740 13023 20953 27732 4953 -10096 -12206 -10247 -13334 -15254
11637 -15254 -14937 -13683 -15237 -9229 4514 -9690 -28559 -30277 -17281 444 9799 -5770 -15295
11624 -15295 1143 -12198 -14657 -20490 -25548 -23012 -12727 4660 10630 -5263 -11491 -25005 -19975
11611 -19975 -16186 -24945 -24153 -1936 6195 8191 -10758 -11358 -13514 -15701 -9787 -8150 -11263 3383
11597 3383 185 -13353 -11341 -2119 -331 -3416 -11422 3544 3200 -5820 -5606 -12309 -4203 6262
11583 6262 1319 -5087 -1818 -4653 -6609 -20439 -31093 -24578 -18754 -16336 -18595 -11143 275 798
11569 798 -12257 -3857 4068 8147 8538 8624 664 2178 -2240 -9009 2126 2849 3369 -4011 -10908 4854
11553 4854 6346 16224 14898 4495 6888 5568 -4732 12248 9726 6855 4511 -3201 -3895 -6051
$$ packed form
11651a5406J7042n632n819J4704j49Q283P930O779k2779j5049k110J959l087j920
11637a5254L17J254j554O008J3743j4204j8869j718J2996J7725R355j5569r525
11624a5295J6438j3341k459n833n058K536J0285J7387N970j5893o228j3514N030
11611a9975L789q759P92K2217Q131J996j8949o00k156k187N914J637l113J4646
11597C383l198j3538K012R222J788l085q006J4966l44r020K14o703Q106J0465
11583F262m943o406L269k835j956j3830j0654O515N824K418k259P452J1418N23
11569G98j3055Q400P925M079L91Q6p960J514m418o769J1135P23N20p380o897J5762
11553D854J492R878j326j0403K393j320j0300J6980k522k871k344p712o94k156
$$ plain form
11539 -6051 -8815 -15010 -5759 12268 8414 802 3333 22148 8485 -15526 -27505 -32087 -29525
11526 -29525 -23627 -14644 2863 9644 3369 -9517 -656 -3524 -3039 -8700 -8588 -4146 -9481 -1419
11512 -1419 4246 -4050 -17146 -8434 -3208 -1387 -13913 -13269 -5507 1274 2368 -5868 -12396 -3105
11498 -3105 -13023 -25204 -25791 1745 12758 13094 6930 10763 7542 2536 4731 7331 6934 11491 19172
11483 19172 -836 -7575 -8429 -12090 -13952 -2907 10879 21835 19125 10693 1956 -14975 -27039
11470 -27039 -19342 -5945 -6775 -3886 -6406 -3735 3810 4192 -2206 12151 26386 26651 25928 25413 12024
11455 12024 2697 -1066 -1011 -6339 2553 2472 2851 208 1592 -1050 3061 19212 27334 22048 7400
11440 7400 -2785 -8419 1146 8219 12436 17196 5707 2956 503 -10030 -13807 -7732 -4865 11772
$$ packed form
11539f051k764o195R251J8027l854p612K531J8815j3663k4011j1979m582K562
11526b9525N898Q983J7507O781o275j2886Q861k868M85n661J12M442n335Q062
11512a419N665q296j3096Q712N226J821j2526O44P762O781J094q236o528R291
11498c105r918j2181n87K7536J1013L36o164L833l221n006K195K600l97M557P681
11483A9172k0008o739q54l661j862J1045J3786J0956k710q432q737j6931j2064
11470b7039P697J3397q30K889k520K671P545L82o398J4357J4235K65p23n15j3389
11455A2024r327l763N5n328Q892q1L79k643J384k642M111J6151Q122n286j4648
11440G400j0185n634R565P073M217M760j1489k751k453j0533l777O075K867J6637
$$ plain form
11426 11772 17466 33743 30896 18411 -10694 -30222 -31036 -34093 -25900 -15657 -9379 -23077 -40378
11413 -40378 -34216 -35879 -22813 -20236 -18676 1630 9544 -7293 -13638 -17412 -521 4463 -11582
11400 -11582 -11466 -1480 7744 12402 1695 -4558 596 1285 -2185 -6490 11456 13081 2911 -9806
11386 -9806 -5423 5100 157 -6312 7691 10847 15658 12368 1188 872 -6970 -7784 -106 9683
11372 9683 6970 8276 27283 25033 13001 -932 -11011 -10797 -16203 -13355 -1789 -250 -5712 -4161
11358 -4161 -6431 -4950 -1197 -8292 -3667 -16864 -6118 -336 7942 24218 34541 19314 6577
11345 6577 -3699 -12827 -14166 -15690 -17212 -2118 10839 1638 20732 21562 3221 -4928 -9966 -9924
11331 -9924 -497 16871 21915 15426 5964 -3523 1031 17423 39169 17241 -701 -2451 -7330
$$ packed form
11426A1772N694J6277k847j2485k9105j9528q14l057Q193J0243O278j3698j7301
11413d0378O162j663J3066K577J560K0306P914j6837o345l774J6891M984j6045
11400a1582J16R986R224M658j0707o253N154O89l470m305J7946J625j0170j2717
11386i806M383J0523m943o469J4003L156M811l290j1180l16p842q14P678R789
11372I683k713J306J9007k250j2032j3933j0079K14n406K848J1566J539n462J551
11358d161k270J481L753p095M625j3197J0746N782Q278J6276J0323j5227j2737
11345F577j0276r128j339j524j522J5094J2957r201J9094Q30j8341q149n038M2
11331i924R427J7368N044o489r462r487M554J6392K1746k1928j7942j750m879
$$ plain form
11318 -7330 -22210 -19306 -15704 -15986 2391 20212 8392 -9454 2431 19467 13795 10765 6683
11305 6683 -14454 -27676 -24584 -16402 -15257 -11199 1214 14029 7596 1462 15249 14034 25504
11292 25504 4504 4013 13781 21582 30807 27445 22875 19384 8854 2798 10511 6900 -2060 -7147
11278 -7147 -7571 -12918 2850 10997 8906 2132 -5308 487 7026 2648 -8438 -11147 -8500 378
11264 378 7449 11771 12988 -2732 -2888 -2686 1593 6476 -1210 -5475 -3243 -4534 -12524 -23330 -28303
11249 -28303 -18606 -7669 -3961 -7633 -15459 -3130 3126 -1669 6179 -5180 -19203 -28655 -26193
11236 -26193 -23913 -19496 -30857 -6826 16351 16203 612 5101 14516 10381 12988 21689 28163 9539
11222 9539 3043 5088 8149 3036 4083 8225 10580 14868 6021 -15388 -29155 -26845 -16505 -6763
$$ packed form
11318g330j4880K904L602k82J8377J7821j1820j7846J1885J7036n672l030m082
11305F683k1137j3222L092Q182J145M058J2413J2815o433o134J3787j215J1470
11292B5504k1000m91R768P801R225l362m570l491j0530o056P713l611q960n087
11278g147m24n347J5768Q147k091o774p440N795O539m378j1086k709K647Q878
11264C78P071M322J217j5720j56K02M279M883p686m265K232j291p990j0806m973
11249b8303R697J0937L708l672p826J2329O256m795P848j1359j4023r452K462
11236b6193K280M417j1361K4031K3177j48j5591M489R415m135K607Q701O474j8624
11222I539o496K045L061n113J047M142K355M288q847k1409j3767K310J0340R742
$$ plain form
11208 -6763 -3195 -13295 -18258 -5645 -4247 -5052 -12978 -29631 -6500 14426 13725 8493 15714 15102
11194 15102 8527 -1538 -19025 -12702 -1337 987 8365 12138 9098 2002 -22439 -18372 -23882
11181 -23882 -9861 9978 -8925 -4024 -5019 -4828 17247 17029 4966 -1833 -15475 -18255 7059
11168 7059 6355 528 -5444 5258 3391 -3487 1357 251 -6046 -13519 -12486 -7438 -4796 -14700 -23394
11153 -23394 -26603 -8361 -647 -7529 -17608 -24575 -24243 -2698 7638 1950 -8593 -3211 -11797
11140 -11797 -7175 -15655 -18062 -22222 -12003 606 4646 -195 -3359 -7765 -7459 -11240 -932 12444
11126 12444 13081 -7582 -11011 209 8248 15093 23954 35874 31640 14241 12786 22169 11895
11113 11895 12433 8780 -7018 -15060 -21724 -19189 -5466 -17304 -16322 -4645 -2256 -10700 -16541 -12632
$$ packed form
11208f763L568j0100m963J2613J398q05p926j6653K3131K0926p01n232P221o12
11194A5102o575j0065j7487O323J1365K324P378L773l040p096k4441M067n510
11181b3882J4021J9839j8903M901r95J91K2075k18j2063o799j3642k780K5314
11168G059p04n827n972J0702j867o878M844j106o297p473J033N048K642r904q694
11153b3394l209J8242P714o882j0079o967L32K1545J0336n688j0543N382q586
11140a1797M622q480k407m160J0219J2609M040m841l164m406L06l781J0308J3376
11126A2444O37k0663l429J1220Q039O845Q861J1920m234j7399j455R383j0274
11113A1895N38l653j5798q042o664K535J3723j1838R82J1677K389q444n841L909
$$ plain form
11099 -12632 -2792 -3326 6356 -2761 -6351 6928 13420 14262 4476 -7246 -27228 -49392 -38988 -23553
11085 -23553 -19928 -25002 -25214 -24405 -8684 -6754 -13115 -14654 -19241 -18559 -18072 -28143 -36284 -21847 -19064
11070 -19064 -36449 -29917 -15951 -11186 -12847 -13981 -9620 -8936 2068 2331 -7401 -1063 -3305 -632
11056 -632 -2152 -5362 -16225 -13404 -7166 1046 2083 -442 -7312 3654 10221 -1939 -14327 -12829
11042 -12829 -15319 -1745 -2179 -11685 -11718 1281 7001 -2828 3338 6369 -5712 -6585 4844 7747
11028 7747 8992 5967 -1942 -11825 -20601 -27336 -8145 -9084 -12408 -21209 -4387 9849 8461 269
11014 269 -8450 -13567 -9320 -1885 -500 -26219 -26025 -22387 -32023 -14447 12597 10529 -5354 -12441
11000 -12441 -15959 -8775 -14095 -16627 -24457 -19433 -14215 -23759 -24560 -18678 -19548 -17491 -15843 -23857 -22812
$$ packed form
11099a2632R840n34R682r117l590J3279O492Q42r786j1722j9982k2164J0404J5435
11085b3553L625n074k12Q09J5721J930o361j539m587O82M87j0071q141J4437K783
11070a9064j7385O532J3966M765j661j134M361O84J1004K63r732O338k242K673
11056f32j520l210j0863K821O238Q212J037k525o870J0966O567j2160j2388J498
11042a2829k490J3574m34r506l3J2999N720r829O166L031j2081q73J1429K903
11028G747J245l025p909r883q776o735J9191r39l324q801J6822J4236j388q192
11014B69q719n117M247P435J385k5719J94L638r636J7576K7044k068j5883p087
11000a2441l518P184n320k532p830N024N218r544q01N882q70K057J648q014J045
$$ plain form
10985 -22812 -6513 -11673 -12262 -7118 7611 -4320 -10169 -2075 505 3037 8037 1788 -11022 -3112
10971 -3112 16300 31057 27630 25290 32159 28780 12417 7199 19027 24215 11062 4592 1613
10958 1613 151 -2347 -4852 -19391 -17870 -19894 -16401 -10276 -5243 1106 1881 -11526 13134 27006
10944 27006 10013 -10507 -26968 -18839 -340 -9196 -10099 -11450 -21340 -16895 1763 -5523 -21598
10931 -21598 -11726 2838 11305 4534 -2744 -12132 -17043 -13943 9572 28257 25289 22305 6885
10918 6885 -7996 -7572 -1647 -12155 -17751 -2053 18396 14293 -895 -7162 1016 1155 -2709 -8670
10904 -8670 -26106 -31845 -37649 -42283 -40752 -28231 -24436 -11316 -11288 -3085 5035 713 -8119 -2896
10890 -2896 10497 5648 4593 -6810 -15823 -7394 -99 -9900 -8184 -2635 6754 2936 -5140 -6065
$$ packed form
10985b2812J6299n160n89N144J4729j1931n849Q094K580K532N000o249j2810P910
10971c112J9412J4757l427k340O869l379j6363n218J1828N188j3153o470k979
10958A613j462k498k505j4539J521k024L493O125N033O349P75j3407K4660J3872
10944B7006j6993k0520j6461Q129J8499q856r03j351r890M445J8658p286j6075
10931b1598R872J4564Q467o771p278r388m911L100K3515J8685k968k984j5420
10918F885j4881M24N925j0508n596J5698K0449m103j5188o267Q178J39l864n961
10904h670j7436n739n804m634J531J2521L795J3120K8Q203Q120m322q832N223
10890b896J3393m849j055j1403r013Q429P295r801J716N549R389l818q076r25
$$ plain form
10876 -6065 -13455 -20072 -22886 -6645 -3284 -5593 3824 8909 8130 2226 3072 203 -10274 -3373 -10234
10861 -10234 -15422 -16226 -4494 1490 -7805 -18059 -26856 -43558 -30905 -24013 -22668 -20181 -10266 -8685
10847 -8685 -11627 -9557 -7457 -6174 -20201 -21585 -16786 -6056 -5328 183 -4846 -12953 -29328 -21246
10833 -21246 -11785 -28519 -24956 -4203 -938 -14098 -28261 -30168 -29592 -35420 -31131 -22556 -13948 6826
10819 6826 12937 20142 13902 13161 -1486 -10577 -11712 -11523 -13083 -25425 -50925 -41651 -18985 -10921
10805 -10921 448 7718 3568 -14467 -25411 -19145 -7298 -14140 -9834 -6556 -14285 -15458 -3255
10792 -3255 -7376 -9504 -14696 -3853 3266 -4816 -10572 -15909 -14438 -2235 5044 7291 -1610 -22307
10778 -22307 -41732 -28423 -11275 -7107 -3718 6467 7804 2780 1565 -1790 538 20449 10392
$$ packed form
10876f065p390o617k814J6241L361k309R417N085p79n904Q46k869j0477O901o861
10861a0234n188q04J1732N984r295j0254q797j6702J2653O892J345K487R915J581
10847h685k942K070K100J283j4027j384M799J0730P28N511n029q107j6375Q082
10833b1246R461j6734L563K0753L265j3160j4163j907N76n828M289Q575Q608K0774
10819F826O111P205o240p41j4647r091j135J89j560j2342k5500R274K2666Q064
10805a0921J1369P270m150j8035j0944O266J1847o842M306L278p729j173J2203
10792c255m121k128n192J0843P119q082n756n337J471J2203P279K247q901k0697
10778b2307j9425J3309J7148M168L389J0185J337n024j215l355K328J9911j0057
$$ plain form
10765 10392 -9003 -14338 -15795 -9865 7489 14237 19010 14861 14447 7858 9337 -2598 -1890 2359
10751 2359 11606 12625 12336 7652 3144 6634 -4545 -20022 -30944 -29815 -23701 -24437 -9417 10503
10737 10503 12171 -2294 -6667 -20315 -34793 -27510 -5703 3873 -2734 -6154 -6573 4198 15460
10724 15460 20034 16433 792 -10433 -6035 -2519 -12238 -20026 -19668 -13174 -12637 -2270 -2100 2344
10710 2344 6157 20423 20877 4083 -3457 289 -7978 -24153 -38458 -36949 -20900 -14343 -14483 -16636
10696 -16636 -24027 -19113 -12711 -18185 -22128 -7523 -6784 -24023 -29530 -16519 -18672 -30744 -15535
10683 -15535 -14660 -14070 -8488 2491 23590 12733 323 8814 15739 14868 18757 13848 5399 869
10669 869 -7314 -16342 -11216 -5089 -8587 -3468 30 -5951 -9255 14435 33236 24312 12672 4021
$$ packed form
10765A0392j9395n335j457N930J7354O748M773m149m14o589J479j1935P08M249
10751B359R247J019k89m684m508L490j1179j5477j0922J129O114p36J5020J9920
10737A0503J668j4465m373j3648j4478P283K1807R576o607l420m19J0771J1262
10724A5460M574l601j5641j1225M398L516r719p788L58O494N37J0367J70M444
10710B344L813J4266M54j6794p540L746q267j6175j4305J509J6049O557j40k153
10696a6636p391M914O402n474l943J4605P39j7239n507J3011k153j2072J5209
10683a5535Q75N90N582J0979K1099j0857j2410Q491O925q71L889m909q449m530
10669H69q183r028N126O127l498N119L498n981l304K3690J8801q924j1640q651
$$ plain form
10655 4021 10671 -1255 -9696 -18054 -14731 2458 20240 12032 6166 3714 14038 7524 -14934
10642 -14934 -13577 -11897 -16045 -9551 -4933 -12765 -12159 4092 17766 6139 -8861 -20284 -24672
10629 -24672 -19464 -19331 -6703 7677 -9481 -17969 -2941 6210 -536 -4881 -2232 -5943 6963
10616 6963 12080 21824 25420 23482 17347 24338 18229 17835 8335 6246 13491 23873 22331 10457
10602 10457 1961 -14154 -12798 2425 -2277 6123 -8738 -27282 -17653 7600 17202 19801 10472
10589 10472 -3446 -11842 -9397 -6169 -4666 -5106 -2138 4553 8381 7540 7453 9234 2296 -283 -10346
10574 -10346 -4666 -3595 -4521 -11423 -15803 -16066 -10437 -4330 4857 8480 12335 9851 13027 200 -462
10559 -462 -14116 -19409 -8856 -15763 -21327 -17703 -23396 -14900 -6971 4320 72 17004 20859 23344
$$ packed form
10655D021O650j1926q441q358L323J7189J7782q208n866k452J0324o514k2458
10642a4934J357J680m148O494M618p832O06J6251J3674j1627j5000j1423m388
10629b4672N208J33J2628J4380j7158q488J5028R151o746m345K649l711J2906
10616F963N117R744L596j938o135O991o109l94r500k089P245J0382j542j1874
10602A0457q496j6115J356J5223m702Q400j4861j8544R629K5253R602K599r329
10589A0472j3918q396K445L228J503m40K968O691L828q41q7J781o938k579j0063
10574a0346N680J071r26o902m380k63N629O107R187L623L855k484L176j2827o62
10559d62j3654n293J0553o907n564L624n693Q496P929J1291m248J6932L855K485
$$ plain form
10545 23344 20407 10224 4292 1421 3397 -2206 -14221 -7548 -749 4624 15552 6430 -13525
10532 -13525 -3857 5465 -16899 -25182 -21614 -3800 3196 -8883 -729 -3576 -12662 -21697 -11121
10519 -11121 -304 1721 5839 15115 23510 27207 13638 -9830 -12298 -7400 8299 11385 3602
10506 3602 6859 -370 -6988 -19775 -24184 -26423 -18485 -11271 -11013 -28060 -34507 -26600 -31388 -29926
10492 -29926 -23863 -10854 3825 3729 3231 7694 12595 8994 690 -8353 -14111 -10054 -419 3263 -80
10477 -80 -1220 4524 8738 8249 5177 2020 11765 8340 -999 -10919 1717 -13834 -36459 -20290
10463 -20290 -2939 4188 4659 1772 10568 -3757 -6111 -5962 -2085 5403 11879 11398 11348 -3106 -7944
10448 -7944 -18037 -12228 -8500 -321 -452 16321 32066 38319 24914 19370 6771 -1488 -5568 -7181
$$ packed form
10545B3344k937j0183n932k871J976n603j2015O673O799N373J0928r122j9955
10532a3525R668R322k2364q283L568J7814O996j2079Q154k847r086r035J0576
10519a1121J0817K025M118R276Q395L697j3569k3468k468M898J5699L086p783
10506C602L257p229o618j2787m409k239P938P214K58j7047o447P907m788J462
10492b9926O063J3009J4679r6m98M463M901l601q304r043n758M057R635L682l343
10477h0j140N744M214m89l072l157R745l425r339r920J2636j5551k2625J6169
10463b0290J7351P127M71k887Q796j4325k354J49L877P488O476m81n0j4454m838
10448g944j0093N809L728Q179j31J6773J5745O253j3405n544j2599q259m080j613
$$ plain form
10434 -7181 -6935 -20917 -30806 -17026 -7424 -15967 -1833 2166 -9451 -7969 11934 13756 12774 2705
10420 2705 -12241 -16503 -6977 -4069 -15227 -15730 -7145 2901 -2181 -9575 -8835 -7046 -8872 6556
10406 6556 7220 5748 2992 7663 14888 14822 7986 -1103 -6593 -13930 -20300 -21373 -12673 -5220 7293
10391 7293 1944 3711 6352 7464 -1778 1307 9340 2858 4585 20501 9554 16884 23621 14878
10377 14878 629 -4228 -5248 -1863 4924 5146 14044 23042 12756 -4252 -3443 767 5070 -3438
10363 -3438 -12371 3275 12643 4739 2320 -7842 -19291 -18100 -4894 11048 -5534 -22778 -25169
10350 -25169 -25891 -23674 -11111 4702 15446 4755 -5180 -13710 -14412 -3682 -4919 1911 -2831 -2596
10336 -2596 -14874 -5206 -2060 -10595 -14164 -13766 -3510 -13709 -18249 -7191 -8826 -12963 -9039 -5224
$$ packed form
10434g181K46j3982r889J3780R602q543J4134L999j1617J482J9903J822r82j0069
10420B705j4946m262R526K908j1158n03Q585J0046n082p394P40J789j826J5428
10406F556O64j472k756M671P225o6o836r089n490p337o370j073Q700P453J2513
10391G293n349J767K641J112r242L085Q033o482J727J5916j0947P330O737q743
10377A4878j4249m857j020L385O787K22Q898Q998j0286j7008Q09M210M303q508
10363c438q933J5646R368p904k419j0162j1449J191J3206J5942j6582j7244k391
10350b5169p22K217J2563J5813J0744j0691r935q530p02J0730j237O830m742K35
10336b596j2278R668L146q535l569L98J0256j0199m540J1058j635m137L924L815
$$ plain form
10322 -5224 799 -11 -810 -7380 -767 -11353 -7159 -113 -8182 -13809 -3147 12860 18174 8347
10308 8347 -16363 -15856 -10985 10078 13312 9973 14049 13841 19372 21881 21918 26075 29791 30801 24859
10293 24859 8943 7195 10984 -673 -18127 -17317 -13944 -15772 -20810 -11133 2545 14489 2135
10280 2135 -1759 8979 11853 7283 6638 16392 17525 5293 -9261 -1454 -3015 -11043 -7511 -13920
10266 -13920 -13631 -12489 -12336 7967 26296 8715 -5722 -9542 -15987 -19708 -25853 -20485 5235 14636
10252 14636 9458 12933 5215 5369 1756 -1713 -12072 -14516 -11046 -6953 -2221 -8467 -14308 -12682
10238 -12682 2581 9141 13638 15081 6650 -4376 1787 15908 10507 4951 -758 17641 8136
10225 8136 -3464 -5214 1179 7769 12308 14925 3753 -4968 -1138 -677 -6463 -3511 2599 8525
$$ packed form
10322e224O023q10p99o570O613j0586M194P046q069n627J0662J6007N314r827
10308H347k4710N07M871K1063L234l339M076k08N531K509L7M157L716J010n942
10293B4859j5916j748L789j1657j7454Q10L373j828n038R677J3678J1944j2354
10280B135l894J0738K874m570o45R754J133j2232j4554P807j561q028L532o409
10266a3920K89J142J53K0303J8329j7581j4437l820o445l721o145N368K5720R401
10252A4636n178L475p718J54l613l469j0359k444L470M093M732o246n841J626
10238a2682J5263O560M497J443q431j1026O163J4121n401n556n709J8399r505
10225H136j1600j750O393O590M539K617j1172q721L830M61n786K952O110N926
$$ plain form
10211 8525 12229 4515 -6713 -2193 13164 15807 -3882 -13063 10890 6746 -5126 9670 5345
10198 5345 9038 668 -13066 -5616 5275 13404 18801 10484 5333 19954 14141 12408 5455 6897
10184 6897 9825 8205 12477 11289 15735 11923 5560 5250 -8657 -8178 -3370 -5365 -5203 -1672 -6623
10169 -6623 -7543 -5270 -4550 353 5238 6882 -4332 -19231 -5316 2071 -8572 -23196 -17401 585
10155 585 -3461 -7538 1295 13859 13382 3662 -601 3750 -3429 -9655 -14198 -2290 1833 7525 -1310
10140 -1310 4012 2236 -3012 -7550 -1469 -9507 -20339 -15931 -7222 2239 7796 1366 -23004 -25659
10126 -25659 -26780 -18311 -3504 4369 8774 10660 12756 7115 3488 -13392 -23909 -22485 -28418 -22819
10112 -22819 -9746 3059 4139 -4292 22255 29379 12911 -5553 9192 9378 3990 -2381 -3244
$$ packed form
10211H525L704p714j1228M520J5357K643j9689r181K3953m144j1872J4796m325
10198E345L693q370j3734P450J0891Q129N397q317n151J4621n813j733o953J442
10184F897K928j620M272j188M446l812o363l10j3907M79M808j995J62L531m951
10169f623r20K273P20M903M885J644j1214j4899J3915P387j0643j4624N795J7986
10155E85m046m077Q833J2564m77r720m263M351p179o226m543J1908M123N692q835
10140a310N322j776n248m538O081q038j0832M408Q709R461N557o430k4370k655
10126b5659j121Q469J4807P873M405J886K096n641l627j6880j0517J424n933N599
10112b2819J3073J2805J080q431K6547P124j6468j8464J4745J86n388o371q63
$$ plain form
10099 -3244 6662 11708 28714 27100 7046 -5805 8413 7413 -4293 -9160 -7539 -11089 -19873
10086 -19873 -8337 -11999 -1023 7827 19620 22582 15958 27927 30272 20109 26108 27050 24258
10073 24258 12381 -10978 -19699 -14115 -8258 -5846 8079 20 -7545 -11360 -7458 -7539 -9118 -16108
10059 -16108 -19849 4691 27006 29072 16596 5529 -18968 -38846 -33603 -8461 18938 22526
10047 22526 8625 -7078 1915 21038 7047 11946 3671 4699 17609 27544 28640 13406 -10712
10034 -10712 -13294 2861 5038 9587 1148 -2756 1150 -4049 -17336 -15228 13082 18364 29628
10021 29628 17954 -2865 -2956 15374 24417 35040 18952 6127 18773 20318 11039 20384 4739
10008 4739 4144 11710 1218 131 11465 12176 7884 9158 3415 12475 23752 27027 31343 32177 29146
$$ packed form
10099c244R906N046J7006j614k0054j2851J4218j000j1706m867J621l550q784
10086a9873J1536l662J0976Q850J1793K962o624J1969K345j0163N999R42k792
10073B4258j1877k3359q721N584N857K412J3925q059p565l815L902q1j579o990
10059a6108l741K4540K2315K066j2476j1067k4497j9878N243K5142K7399L588
10047B2526j3901j5703Q993J9123j3991M899q275J028J2910R935J096j5234k4118
10034a0712k582J6155K177M549q439l904L906n199j3287K108K8310N282J1264
10021B9628j1674k0819r1J8330R043J0623j6088j2825J2646J545r279R345j5645
10008D739n95P566j0492j087J1334P11m292J274n743R060J1277L275M316Q34l031
$$ plain form
9993 29146 27240 23725 8973 3428 13502 21840 10476 -4742 -13534 -19002 -15983 -16178 -1195 22632
9979 22632 25076 7699 -10819 -17485 -11930 -15256 -22818 -32681 -21912 -6330 9940 21556 16062
9966 16062 18834 28779 25318 29529 31581 22879 13664 5554 -3788 3444 12464 23124 11477 -8595
9952 -8595 -4835 763 -1403 -4805 -9246 -9472 -1480 -5700 -11757 -7293 -1652 55 11399 18358 15616
9937 15616 9862 8452 2459 17352 25029 20151 13029 19102 4571 3229 10660 7281 12474 23096
9923 23096 30631 27480 23635 10805 -1566 -5832 -14180 -5595 4078 -4922 -4954 -4933 -7483 -6260 -289
9908 -289 -11195 -12328 -5062 -2193 6964 108 -7749 1605 13947 19003 22888 22432 25714 25662 9831
9893 9831 6571 17825 25159 34956 27220 19534 13105 8001 2242 -3971 -5209 17387 11619 3783
$$ packed form
9993B9146j906l515j4752n545J0074Q338j1364j5218q792n468L019j95J4983K3827
9979B2632K444j7377j8518o666N555l326p562r863J0769J5582J6270J1616n494
9966A6062K772R945l461M211K052q702r215q110r342P232R020J0660j1647k0072
9952h595L760N598k166l402m441k26P992m220o057M464N641J707J1344O959k742
9937A5616n754j410n993J4893P677m878p122O073j4531j342P431l379N193J0622
9923B3096P535l151l845j2830j2371m266q348Q585R673r000l2K1k550J223N971
9908b89j0906j133P266K869R157o856p857R354J2342N056L885m56L282n2j5831
9893I831l260J1254P334R797p736p686o429n104n759o213j238K2596n768p836
$$ plain form
9879 3783 14615 5925 7961 323 -3864 11593 15705 19881 15791 -5912 -3476 4165 -5421 -12810
9865 -12810 -7845 -3565 -9748 -9900 -7582 493 6045 117 -2826 -5136 -4241 12406 23598 15716 23319
9850 23319 31001 29897 25224 9701 4294 13865 24460 18471 9818 16234 7564 -3760 -8324 -7711
9836 -7711 -1519 7458 30006 42624 39817 27834 6824 2669 -4564 2693 16895 13701 465
9823 465 -10417 -10563 2209 9821 5792 4663 -2944 -8637 2958 22462 19847 15158 13968 17202
9809 17202 15354 10772 8429 23522 20430 5072 -2581 6355 6922 16851 35452 35663 28589 35653
9795 35653 28366 15874 8370 9373 -2924 -1436 20632 26062 17501 18635 20032 13618 4476 -12824
9781 -12824 -13599 -2453 -2592 10343 25912 19690 6942 3329 3362 3584 -9994 -3139 11692 19521
$$ packed form
9879C783J0832q690K036p638m187J5457M112M176m090k1703K436P641r586p389
9865a2810M965M280o183j52K318Q075N552n928k943k310Q95J6647J1192p882P603
9850B3319P682j104m673j5523n407R571J0595n989q653O416q670j1324m564O13
9836g711O192Q977K2548J2618k807j1983k1010m155p233P257J4202l194j3236
9823D65j0882j46J2772P612m029j129p607n693J1595J9504k615m689j190L234
9809A7202j848m582k343J5093l092j5358p653Q936N67R929J8601K11p074P064
9795C5653p287j2492p504J003j2297J488K2068N430q561J134J397o414r142j7300
9781a2824p75J1146j39J2935J5569o222j2748l613L3K22j3578O855J4831P829
$$ plain form
9767 19521 13287 7296 -4399 -844 19404 18539 27797 46145 30960 12985 7248 22228 28725
9754 28725 28941 24920 21429 23305 9641 10841 16508 14098 23244 21380 22365 17313 8001 -10603 -30908
9739 -30908 -28568 -11718 -2959 7606 14077 16175 21613 14406 -10801 -21406 -17868 -6083 5008
9726 5008 -473 -12635 -9907 -7273 -20546 -22088 -11229 1032 4708 9055 22491 11222 1779
9713 1779 1804 16471 15556 15588 17390 4343 -15868 -12143 -440 -10205 -8664 1584 28 15075 37522
9698 37522 42972 44016 31121 32864 26352 35511 43567 28013 14396 -1012 3158 9569 17682 13883
9684 13883 12048 18786 19572 3657 14634 14334 23013 20684 8146 -5494 -12794 -3132 -4153 -6822
9670 -6822 -8022 2506 -1961 10097 4739 -5800 -5351 -14220 -14586 -17308 -13702 -1235 4449 1902
$$ packed form
9767A9521o234n991j1695L555K0248q65R258J8348j5185j7975n737J4980O497
9754B8725K16m021l491J876j3664J200N667k410R146j864R85n052r312j8604k0305
9739c0908K340J6850Q759J0565O471K098N438p207k5207j0605L538J1785J1091
9726E008n481j2162K728K634j3273j542J0859J2261L676M347J3436j1269r443
9713A779K5J4667r15L2J802j3047k0211L725J1703r765J541J0248j556J5047K2447
9698C7522N450J044j2895J743o512R159Q056j5554j3617j5408M170O411Q113l799
9684A3883j835O738P86j5915J0977l00Q679k329j2538j3640p300R662j021k669
9670f822j200J0528m467J2058n358j0539M49q869l66k722L606J2467N684k547
$$ plain form
9656 1902 -5409 -7324 1087 14960 28781 34714 24068 9438 10391 -590 494 1654 15992 25959
9642 25959 17096 20049 22537 13367 3477 7584 6589 9501 26984 24268 35475 54232 45100 54342
9628 54342 73836 80966 100865 112870 153590 242234 349819 409072 392594 327314 251187 184949
9616 184949 148233 104824 77558 73775 67228 65604 74063 74530 56523 44482 31749 18714 24066
9603 24066 21157 5658 -8576 -15227 -9433 -13801 -10981 11830 34989 33013 10643 -5672 -5096
9590 -5096 10162 14974 13346 7778 13018 20595 17474 14406 -7557 -4017 2094 6007 3684 -930
9576 -930 4141 10475 4225 4905 10746 24742 15034 885 -4432 5985 6645 10021 -2209 -4614 -8799
9561 -8799 -5123 -4931 -13292 -9739 4455 19033 24411 14013 -2995 -20000 -16738 -4282 -14990
$$ packed form
9656A902p311j915Q411J3873J3821N933j0646j4630R53j0981J084J160J4338R967
9642B5959q863K953K488r170r890M107r95K912J7483k716J1207J8757r132R242
9628E4342J9494P130J9899J2005M0720Q8644J07585N9253j6478o5280p6127o6238
9616A84949l6716m3409k7266l783o547j624Q459M67j8007j2041j2733j3035N352
9603B4066k909j5499j4234o651N794m368K820K2811K3159j976k2370j6315N76
9590e096J5258M812j628n568N240P577l121l068k1963L540O111L913k323m614
9576i30N071O334o250O80N841J3996r708j4149n317J0417O60L376j2230k405m185
9561h799L676J92q361L553J4194J4578N378j0398j7008j7005L262J2456j0708
$$ plain form
9548 -14990 -7477 4542 602 -4719 -802 -7985 -14541 -25883 -20372 -5746 -464 3024 1358 309
9534 309 -4266 -2713 4515 -6484 -12730 3096 19457 11921 -843 1746 19391 19490 14404 14813 25151
9519 25151 14793 6102 10812 24612 30418 26544 24556 24158 40601 31718 29118 43006 42897 32661
9505 32661 37809 30342 16742 6566 14706 15246 9814 15244 19203 23954 16559 27454 30855 21553
9491 21553 3623 -4118 -8115 2329 20081 729 5437 13242 16137 13594 7075 685 9197 19604
9477 19604 17112 21406 13790 14627 19158 26092 35049 32629 27827 31820 22455 6736 7039 13633 14796
9462 14796 27038 35359 40052 35116 37143 40090 46913 44308 33382 34883 35197 40288 24959 2170
9448 2170 -3375 -20479 -18366 -9575 -10796 -6337 3353 -7067 -8591 -6160 4146 -7773 2859 19339
$$ packed form
9548a4990P513J2019l940n321L917p183o556j1342N511J4626N282L488j666j049
9534C09m575J553P228j0999o246J5826J6361p536j2764K589J7645R9n086M09J0338
9519B5151j0358q691M710J3800N806l874j988l98J6443q883k600J3888j09j0236
9505C2661N148p467j3600j0176Q140N40n432N430L959M751p395J0895L401r302
9491B1553j7930p741l997J0444J7752j9352M708P805K895k543o519o390Q512J0407
9477A9604k492M294p616Q37M531O934Q957k420m802L993r365j5719L03O594J163
9462A4796J2242Q321M693m936K027K947O823k605j0926J501L14N091j5329k2789
9448B170n545j7104K113Q791j221M459R690j0420j524K431J0306j1919J0632J6480
$$ plain form
9434 19339 10033 11076 5652 16417 12597 -11700 -6542 8218 6897 19569 33889 24100 13164
9421 13164 6128 4779 14091 19078 26426 36679 30613 20263 16631 3340 4970 27132 30105 23862
9407 23862 19677 20033 20285 12183 26047 26608 29334 27991 31386 28216 16732 -869 2147 -2855 -3563
9392 -3563 1659 1327 16026 29580 34062 35287 23495 6365 -6100 -9098 -4643 -5221 -5575 4802
9378 4802 30336 22840 10391 16151 15377 10962 15762 17224 7918 16716 10215 7357 14617 15660 38399
9363 38399 44458 42412 16607 6737 4079 8605 14618 12689 14024 19317 23441 26650 25567 35529
9349 35529 37354 36206 29438 21804 26010 31085 37225 38747 37630 30583 27308 37196 34661 34132 29312
9334 29312 25632 28978 27440 30711 28148 13085 10732 24438 20421 18069 17507 21402 37695 27924
$$ packed form
9434A9339r306J043n424J0765l820k4297N158J4760j321J2672J4320r789j0936
9421A3164p036j349R312M987P348J0253o066j0350l632j3291J630K2162K973o243
9407B3862m185L56K52q102J3864N61K726j343L395l170j1484j7601L016n002p08
9392c563N222l32J4699J3554M482J225j1792j7130j2465k998M455n78l54J0377
9378D802K5534p496j2449N760p74m415M800J462r306Q798o501k858P260J043K2739
9363C8399O059k046k5805r870k658M526O013j929J335N293M124L209j083R962
9349C5529J825j148o768p634M206N075O140J522j117p047l275R888k535n29m820
9334B9312l680L346j538L271k563j5063k353J3706m017k352n62L895J6293r771
$$ plain form
9320 27924 27130 28641 31006 28309 23161 20606 24375 13738 21853 29304 29053 29332 17426 14081 29904
9305 29904 30669 34203 45715 50488 39055 31019 17520 16725 22383 31391 24854 33892 49418 54995
9291 54995 39599 44285 34901 27539 17672 24243 33683 23403 3410 8706 28041 26622 32564 23589
9277 23589 21149 36306 45482 37184 32880 28023 15338 10939 9603 17849 28922 42856 45421 44613
9263 44613 35910 20125 12619 15063 16152 1556 -5037 9837 25864 38034 51586 41218 24623
9250 24623 33555 43735 42992 42418 48247 53984 51581 44522 42519 25183 19671 30347 31569 30999 28227
9235 28227 39508 30799 37226 44798 38474 52722 73329 72215 49420 36656 46474 42872 40280
9222 40280 28976 36514 58557 66804 48616 36349 44021 45107 45312 45745 47296 37681 33039 30157
$$ packed form
9320B7924p94J511K365k697n148k555L769j0637Q115P451k51K79j1906l345J5823
9305B9904P65L534J1512M773j1433q036j3499p95N658R008o537R038J5526N577
9291E4995j5396M686r384p362r867O571R440j0280j9993N296J9335j419N942q975
9277B3589k440J5157R176q298m304m857j2685m399j336Q246J1073J3934K565q08
9263D4613q703j5785p506K444J089j4596o593J4874J6027J2170J3552j0368j6595
9250B4623Q932J0180p43n74N829N737k403p059k003j7336n512J0676J222n70k772
9235B8227J1281q709O427P572o324J4248K0607j114k2795j2764R818l602k592
9222D0280j1304P538K2043Q247j8188j2267P672J086K05M33J551r615m642k882
$$ plain form
9208 30157 31354 40241 50464 54564 45559 38581 44216 53600 55651 38904 32096 33704 32563 39597
9194 39597 30460 37695 52706 49376 47911 52481 53879 53960 46564 55067 64130 69965 75844 73719 65301
9179 65301 65413 73560 76804 59636 45919 43230 46364 51106 70460 67789 59612 71341 81952 75864
9165 75864 62479 75081 80737 75827 69110 80048 87918 81676 75929 75256 79171 93830 99366 88388
9151 88388 92305 113472 101668 94558 95964 106545 115238 108093 115361 132998 139319 140216 140828 166728
9137 166728 196949 223589 238505 253014 284072 344165 404211 465024 568550 702091 856361
9126 856361 1026848 1242568 1455862 1628163 1769915 1845119 1853793 1778436 1647782 1493758
9116 1493758 1333980 1181802 1049650 941758 867171 844143 836610 870396 950407 1075958 1251224
$$ packed form
9208C0157J197Q887J0223M100r005o978N635R384K051j6747o808J608j141P034
9194C9597r137P235J5011l330j465M570J398Q1p396Q503R063N835N879k125q418
9179F5301J12Q147L244j7168j3717k689L134M742J9354k671q177J1729J0611o088
9165G5864j3385J2602N656m910o717J0938P870o242n747o73L915J4659N536j0978
9151H8388L917K1167j1804p110J406J0581Q693p145P268J7637O321Q97O12K5900
9137A66728L0221K6640J4916J4509L1058O0093O0046O0813J03526J33541J54270
9126H56361J70487K15720K13294J72301J41752P5204Q674p5357j30654j54024
9116A493758j59778j52178j32152j07892p4587k3028p533L3786Q0011J25551J75266
$$ plain form
9105 1251224 1520456 1978455 2832803 4465969 7215143 9725890 9544623 7868661 6600459
9096 6600459 5345914 3814430 2603748 1840323 1362041 1054416 835222 673818 572052
9087 572052 497088 430543 364550 329370 305232 273684 254266 236170 216444 197119 184964 183160
9075 183160 184887 165152 139900 122786 103395 84853 78680 83374 85832 86090 90017 80641 86240
9062 86240 82510 87839 87034 82475 83061 90933 80639 72612 84273 75798 62128 56510 68683 82571
9048 82571 76935 62534 47275 57301 64429 58581 57066 69960 70722 75081 79619 79165 63610 49151
9034 49151 35416 26192 35947 20857 18281 40696 42904 37589 34028 41927 56207 57147 46042 53363
9020 53363 48836 55748 58291 58344 59386 73648 74260 77651 72634 67996 84860 96345 86097 77965
$$ packed form
9105A251224K69232M57999Q54348J633166K749174K510747j81267j675962j268202
9096F600459j254545j531484j210682p63425m78282l07625k19194j61404j01766
9087E72052p4964o6545o5993l5180k4138l1548j9418j8096j9726j9325j2155j804
9075A83160J727j9735k5252j7114j9391j8542o173M694K458K58L927r376N599
9062H6240l730N329q05m559N86P872j0294q027J1661q475j3670n618J2173J3888
9048H2571n636j4401j5259J0026P128n848j515J2894P62M359M538m54j5555j4459
9034D9151j3735r224R755j5090k576K2415K208n315l561P899J4280R40j1105P321
9020E3363m527O912K543N3J042J4262O12L391n017m638J6864J1485j0248q132
$$ plain form
9006 77965 84941 84584 87581 82943 75389 86321 101008 102333 84599 80070 74449 71100 65473 66420
8992 66420 84179 89193 87222 94880 97474 104946 124688 139101 157813 168456 197964 226681 257439
8979 257439 285770 304835 327372 316921 314294 294492 252428 196034 156350 150856 152396 158594
8967 158594 157921 150540 136237 112890 113501 108513 96005 111608 124024 124038 115110 113336 110424 96912
8953 96912 103602 117492 94798 82175 72533 79754 93258 98249 112357 117393 114113 114709 123094 114506
8939 114506 115325 108547 105572 118376 135199 163645 185728 198819 200903 194641 200034 204922 213534
8926 213534 214105 200392 200992 192250 201390 233296 280822 320677 381827 459986 519080 568473 570966
8913 570966 492239 364185 259909 155808 72875 52111 41783 59054 75979 77087 63771
$$ packed form
9006G7965O976l57K997m638p554J0932J4687J325j7734m529n621l349n627R47
8992F6420J7759N014j971P658K594P472J9742J4413J8712J0643K9508K8717L0758
8979B57439K8331J9065K2537j0451k627j9802m2064n6394l9684n494J540O198
8967A58594o73p381j4303k3347O11m988j2508J5603J2416J4q928j774k912j3512
8953I6912O690J3890k2694j2623r642P221J3504M991J4108N036l280N96Q385q588
8939A14506Q19o778k975J2804J6823K8446K2083J3091K084o262N393M888Q612
8926B13534N71j3713O00q742R140L1906M7526L9855O1150P8159N9094M9393K493
8913E70966p8727j28054j04276j04101q2933k0764j0328J7271J6925J108j3316
$$ plain form
8902 63771 48809 43847 35229 17659 29407 24467 5182 -2904 7521 20355 48874 61513 69336
8889 69336 69003 63994 79815 85378 95522 110186 126629 130276 133803 139152 158319 182433 201501
8876 201501 218362 233639 241748 231164 229389 233113 237442 246242 264600 279686 278793 298683 313514
8863 313514 334308 351286 368529 398263 418015 430261 443102 477893 526193 562062 570647 540334
8851 540334 509409 533674 592139 649084 629359 533881 428980 347623 299763 265837 262876 264378
8839 264378 277813 271769 256029 269549 260338 260499 263197 257188 253286 258718 284790 297236 309625
8826 309625 342208 368307 373403 379314 390309 402701 414174 417639 410135 400363 399185 401376 389137
8813 389137 396651 396495 401359 439557 483517 521794 558042 584573 601253 612300 641518 638532 612058
$$ packed form
8902F3771j4962m962q618j7570J1748m940j9285q086J0425J2834K8519J2639P823
8889F9336l33n009J5821N563J0144J4664J6443L647L527N349J9167K4114J9068
8876B01501J6861J5277Q109j0584j775L724M329Q800J8358J5086q93J9890J4831
8863C13514K0794J6978J7243K9734J9752J2246J2841L4791M8300L5869Q585l0313
8851E40334l0925K4265N8465N6945j9725r5478j04901q1357m7860l3926k961J502
8839B64378J3435o044j5740J3520r211J61K698o009l902N432K6072J2446J2389
8826C09625L2583K6099N096N911J0995J2392J1473L465p504r772j178K191j2239
8813C89137P514j56M864L8198M3960L8277L6248K6531J6680J1047K9218k986k6474
$$ plain form
8800 612058 604044 595686 589910 595652 629467 664181 683460 715721 759662 804265 836005 858108
8788 858108 893019 919321 950418 977246 992013 996233 1010965 1043459 1086569 1133493 1194263 1246852
8776 1246852 1312027 1399982 1472002 1540150 1631251 1685077 1730222 1760595 1785107 1823524 1867668
8765 1867668 1916159 1978509 2076084 2203663 2363857 2547049 2759950 2998745 3215550 3432115
8755 3432115 3662117 3903673 4185851 4507883 4894441 5367536 5935500 6573473 7320626 8143207
8745 8143207 9012191 9944878 10975795 12183306 13676502 15534910 17870253 20789546 24397114
8736 24397114 28653476 33361589 38528016 44580641 52330306 62703983 76811330 96743019
8728 96743019 126670918 173561796 246461281 346158795 439664796 469641139 433190276
$$ packed form
8800F12058q014q358n776N742L3815L4714J9279L2261M3941M4603L1740K2103
8788H58108L4911K6302L1097K6828J4767M220J4732L2494M3110M6924O0770N2589
8776A246852O5175Q7955P2020O8148R1101N3826M5145L0373K4512L8417M4144
8765A867668M8491O2350R7575J27579J60194J83192K12901K38795K16805K16565
8755C432115K30002K41556K82178L22032L86558M73095N67964O37973P47153Q22581
8745H143207Q68984R32687J030917J207511J493196J858408K335343K919293L607568
8736B4397114M256362M708113N166427O052625P749665J0373677J4107347J9931689
8728I6743019K9927899M6890878P2899485R9697514R3506001K9976343l6450863
$$ plain form
8721 433190276 376879033 319003882 254595144 191761662 142263229 107533309 83795440
8714 83795440 67315107 55568280 46917442 40338920 35208133 30929355 27077218 23599342
8706 23599342 20519190 17789495 15400498 13365729 11687346 10306248 9173188 8257096
8698 8257096 7572507 7028753 6580442 6160866 5724698 5321674 4968170 4649796 4368385 4105553
8688 4105553 3877640 3703023 3564719 3433331 3286937 3159453 3029724 2874134 2713653 2540352
8678 2540352 2381843 2216024 2054447 1939244 1842803 1761799 1683569 1629795 1599854 1575627 1529362
8667 1529362 1492257 1450565 1396598 1346693 1297345 1243148 1187104 1129260 1089709 1054689 1005842
8656 1005842 976788 966456 950212 936195 955346 966007 958071 939188 900933 870461 815251 793655
$$ packed form
8721D33190276n6311243n7875151o4408738o2833482m9498433l4729920k3737869
8714H3795440j6480333j1746827q650838o578522n130787m278778l852137l477876
8706B3599342l080152k729695k388997k034769j678383j381098j133060r16092
8698H257096o84589n43754m48311m19576m36168m03024l53504l18374k81411k62832
8688D105553k27913j74617j38304j31388j46394j27484j29729j55590j60481j73301
8678B540352j58509j65819j61577j15203r6441q1004p8230n3774k9941k4227m6265
8667A529362l7105m1692n3967m9905m9348n4197n6044n7844l9551l5020m8847
8656A005842k9054j0332j6244j4017J9151J0661p936j8883l8255l0472n5210k1596
$$ plain form
8644 793655 780654 750382 712015 666730 648260 647168 672659 696337 706303 702357 685932 681176
8632 681176 675549 679385 662824 633408 613413 599975 585088 569991 554923 562157 580220 612923
8620 612923 658225 752324 899462 1162316 1543523 1802946 1713509 1495259 1313476 1123383
8610 1123383 920617 757392 665319 602893 567145 541764 519160 497063 497252 477693 463006
8599 463006 421331 355201 290144 228402 187391 167381 155689 163593 181850 195034 215715 226450
8587 226450 241506 263759 279477 286680 296181 308744 324388 350969 370589 408197 469499 553946
8575 553946 710801 981711 1489450 2251749 2761343 2588491 2179358 1861786 1520852 1145079
8565 1145079 857758 674542 565287 501866 438667 402907 382369 360481 349741 345967 332347
$$ packed form
8644G93655j3001l0272l8367m5285j8470j092K5491K3678R966l946j6425m756
8632F81176n627L836j6561k9416j9995j3438j4887j5097j5068P234J8063L2703
8620F12923M5302R4099J47138K62854L81207K59423q9437k18250j81783j90093
8610A123383k02766j63225r2073o2426l5748k5381k2604k2097J89j9559j4687
8599D63006m1675o6130o5057o1742m1011k0010j1692P904J8257J3184K0681J0735
8587B26450J5056K2253J5718P203R501J2563J5644K6581J9620L7608O1302Q4447
8575E53946J56855K70910N07739P62299N09594j72852m09133l17572l40934l75773
8565A145079k87321j83216j09255o3421o3199l5760k0538k1888j0740l774j3620
$$ plain form
8554 332347 341349 353047 352606 345151 330085 318848 309050 290738 279576 271482 254467 232818 208814
8541 208814 224138 249941 252857 250604 261606 237285 167564 37028 -92992 -163676 -210696 -246380
8529 -246380 -250036 -204421 -141184 -100580 -66353 -23050 385 5038 6792 13120 13441 27150 28176
8516 28176 17351 14714 24516 36736 37652 49939 84778 101055 106588 113641 119701 115380 101647
8503 101647 103371 93598 82730 103713 127735 128999 125999 122884 122008 109679 121451 107930 87490
8490 87490 82986 70979 62978 79141 96130 85546 71430 69979 58499 62656 78531 82142 86062
8477 86062 86380 93781 97792 81451 72302 80199 102425 122313 117293 120988 103948 83411 83549 78462
8463 78462 84897 76149 67850 64808 58968 62953 57633 54614 54408 68033 83459 82855 95948 117371
$$ packed form
8554C32347R002J1698m41p455j5066j1237r798j8312j1162q094j7015k1649k4004
8541B08814J5324K5803K916k253J1002k4321o9721j30536j30020p0684m7020l5684
8529b46380l656M5615O3237M0604L4227M3303K3435M653J754O328L21J3709J026
8516B8176j0825k637R802J2220R16J2287L4839J6277N533P053O060m321j3733
8503A01647J724r773j0868K0983K4022J264l000l115q76j2329J1772j3521k0440
8490H7490m504j2007q001J6163J6989j0584j4116j451j1480M157J5875L611L920
8477H6062L18P401M011j6341r149P897K2226J9888n020L695j7040k0537J38n087
8463G8462O435q748q299l042n840L985n320l019k06J3625J5426o04J3093K1423
$$ plain form
8449 117371 108732 77440 55023 40587 31052 40826 31862 32943 24722 14801 30712 42608 33230
8436 33230 18324 22162 48339 56484 39092 28608 29236 54022 69291 66197 51782 65709 75071
8423 75071 71460 76278 84170 84695 94077 81728 88310 97062 88142 85095 86614 69770 64222 52498
8409 52498 45320 44611 45682 49650 55590 63173 56886 68779 81658 74384 60937 49816 35538 28249
8395 28249 44379 56383 48435 48109 59842 46388 32703 44445 38918 10729 4598 10038 14700
8382 14700 21721 4312 13677 24487 22120 28692 21424 21836 19409 37324 43400 32929 32608 22182
8368 22182 7172 17902 34476 27120 34647 50661 53882 33539 35658 48123 45586 50244 58723
8355 58723 56718 52858 51138 67096 71245 75460 77457 69345 71295 78592 79121 83349 82922 85395 81550
$$ packed form
8449A17371q639l1292k2417j4436r535R774q964J081q221r921J5911J1896r378
8436C3230j4906L838K6177Q145j7392j0484O28K4786J5269l094j4415J3927R362
8423G5071l611M818P892N25R382j2349O582Q752q920l047J519j6844n548j1724
8409E2498p178p09J071L968N940P583o287J1893J2879p274j3447j1121j4278p289
8395B8249J6130J2004p948l26J1733j3454j3685J1742n527k8189o131N440M662
8382A4700P021j7409R365J0810k367O572p268M12k427J7915O076j0471l21j0426
8368B2182j5010J0730J6574p356P527J6014L221k0343K119J2465k537M658Q479
8355E8723k005l860j720J5958M149M215J997q112J950P297N29M228m27K473l845
$$ plain form
8340 81550 71366 75122 99376 112942 119705 144477 182085 201593 227698 253321 290565 353623
8328 353623 435163 553150 675638 824216 1009396 1204435 1392886 1550165 1661510 1710510
8318 1710510 1684588 1588616 1452054 1270076 1089622 910109 738108 584606 480340 401748
8308 401748 340024 283797 241555 211420 183727 143924 114531 117562 121882 111458 90734 73513
8296 73513 56521 54321 64310 74574 64467 53993 61104 64510 46712 33094 28282 40689 41623
8283 41623 35441 35423 33781 24537 27407 18327 20925 37977 31430 19231 17408 12760 8459 1887 -1242
8268 -1242 -10455 -12387 -11780 -19368 -16495 -26050 -18202 -11460 5578 -929 -10922 5692 17123 14970
8254 14970 1040 -18736 -22404 -22313 -21312 -16490 -18764 -20883 -6295 9085 21938 29309 8192 -11289
$$ packed form
8340H1550j0184L756K4254J3566O763K4772L7608J9508K6105K5623L7244O3058
8328C53623Q1540J17987J22488J48578J85180J95039J88451J57279J11345M9000
8318A710510k5922r5972j36562j81978j80454j79513j72001j53502j04266p8592
8308D01748o1724n6227m2242l0135k7693l9803k9393L031M320j0424k0724j7221
8296G3513j6992k200R989J0264j0107j0474P111L406j7798j3618m812J2407R34
8283D1623o182j8j642r244K870r080K598J7052o547j2199j823m648m301o572l129
8268a242r213j932O07p588K873r555P848O742J7038o507r993J6614J1431k153
8254A4970j3930j9776l668R1J001M822k274k119J4588J5380J2853P371k1117j9481
$$ plain form
8240 -11289 -2908 4078 5089 9034 16024 19095 7042 2399 -9662 -1265 10864 12545 29335 30497
8226 30497 17081 7992 7704 8456 1206 5353 19619 34902 30403 16610 17778 31230 44819 56594
8212 56594 57482 52273 41488 38723 34951 38314 42341 37058 20953 -5868 -16811 -9679 -5756 -11999
8198 -11999 -16399 -12237 -21489 -22141 -13353 -14084 -6940 -4881 -8959 5953 10473 -988 4699 10470 -9945
8183 -9945 -12558 -5318 -1044 12607 9834 14383 7201 8036 -5940 -10960 -15328 -12443 -699 -4846
8169 -4846 -7412 -10795 5479 22455 19937 16993 27014 23100 13086 15050 8076 12216 10365 -6433
8155 -6433 -2532 6943 16801 5160 -998 5516 12006 26317 36483 30529 24011 21626 31473 26621
8141 26621 17290 13477 12144 4912 22 9953 11600 16960 15598 19566 9489 -575 1943 14123
$$ packed form
8240a1289Q381O986J011L945O990L071j2053m643j2061Q397J2129J681J6790J162
8226C0497j3416r089k88P52p250M147J4266J5283m499j3793J168J3452J3589J1775
8212E6594Q88n209j0785k765l772L363M027n283j6105k6821j0943P132L923o243
8198a1999m400M162r252o52Q788p31P144K059m078J4912M520j1461N687N771k0415
8183i945k613P240M274J3651k773M549p182Q35j3976n020m368K885J1744m147
8169d846k566l383J6274J6976k518k944J0021l914j0014J964o974M140j851j6798
8155f433L901R475R858j1641o158O514O490J4311J0166n954o518k385R847m852
8141B6621r331l813j333p232m890R931J647N360j362L968j0077j0064K518J2180
$$ plain form
8127 14123 9748 13963 20302 26991 22317 18377 12839 3201 470 1214 8015 6441 2950 362 -2567
8112 -2567 1857 928 1038 -5602 -17850 -17313 -8807 14198 11910 8418 17119 19301 13317 16174 16675
8097 16675 11262 2499 5705 9886 8069 -1527 -5041 -3428 530 -967 13391 31665 33515 25485
8083 25485 13786 -2747 -9412 -5396 -362 1179 -4759 -7340 -1897 2894 -1893 -4440 -10612 -9827
8069 -9827 -5569 6742 11468 10815 19295 24221 10631 3747 9729 10433 -1379 -3063 -1542 -2518 1709
8054 1709 -2072 -2768 -15698 -32119 -18970 3481 6760 -7002 -2030 7721 8553 -2537 -13409 -10788
8040 -10788 -3695 -1688 -5852 3147 2833 6226 -196 1229 12925 20813 18137 17225 1966 -11153
8026 -11153 3472 18488 17843 34759 23947 7464 180 -1527 -25 14617 22379 18681 -114
$$ packed form
8127A4123m375M215O339O689m674l940n538r638k731P44O801j574l491k588k929
8112b567M424r29J10o640j2248N37Q506K3005k288l492Q701K182n984K857N01
8097A6675n413q763L206M181j817r596l514J613L958j497J4358J8274J850q030
8083B5485j1699j6533o665M016N034J541n938k581N443M791m787k547o172P85
8069i827M258J2311M726o53Q480M926j3590o884N982P04j1812j684J521r76M227
8054A709l781o96j2930j6421J3149K2451L279j3762M972R751Q32j1090j0872K621
8040a0788P093K007m164Q999l14L393o422J425J1696P888k676r12j5259j3119
8026a1153J4625J5016o45J6916j0812j6483p284j707J502J4642P762l698j8795
$$ plain form
8013 -114 -12211 -26765 -21756 -6993 -218 -36 -10464 -27985 -31944 -17301 -8654 -3725 8646 7508
7999 7508 8606 5426 7279 7168 -5727 -7169 4532 6097 2660 -2129 1051 -6442 -3257 -5818 -10322
7984 -10322 -10091 5051 13382 6237 428 566 16828 19439 14643 13915 35361 33940 30210 17332
7970 17332 -5640 -4182 1155 -5821 1657 10039 1315 -4466 2878 3105 9685 -3008 -12623 -11776 -1855
7955 -1855 9740 25125 24681 24737 19792 37405 48110 40578 28750 20164 26417 32413 19215 5651
7941 5651 11912 17401 20671 14915 13282 13987 14899 29168 35356 35392 19360 18536 29580 24509 11209
7926 11209 15057 12240 15359 9132 5942 -3054 1388 -5487 -5945 6936 14217 11976 13569 -2004
7912 -2004 -12034 -3416 4295 15311 24488 18615 9256 20054 21258 21904 16973 16867 17637 33930 14143
$$ packed form
8013a14j2097j4554N009J4763O775J82j0428j7521l959J4643Q647M929J2371j138
7999G508J098l180J853j11j2895j442J1701J565l437m789L180p493L185k561m504
7984a0322K31J5142Q331p145n809J38J6262K611m796p28K1446j421l730j2878
7970A7332k2972J458N337o976P478Q382q724n781P344K27O580j2693r615Q47R921
7955a855J1595J5385m44N6m945J7613J0705p532j1828q586O253N996j3198j3564
7941E651O261N489L270n756j633P05R12J4269O188L6j6032q24J1044n071j3300
7926A1209L848k817L119o227l190q996M442o875m58J2881P281k241J593j5573
7912b004j0030Q618P711J1016R177n873r359J0798J204O46m931j06P70J6293j9787
$$ plain form
7897 14143 -8709 -2637 3240 6867 -2885 -3881 2201 12076 20655 23021 29534 16606 14691 20413
7883 20413 20449 12663 2725 10056 11101 -3779 -16254 -18593 -13980 2425 360 -6012 13014 4731
7869 4731 -5997 -4815 -11675 -11422 -9645 -503 8105 -8157 -9158 -17742 -14158 -1594 2870 3670 9380
7854 9380 17114 14467 -20 3039 148 -25656 -12926 -51 12447 15602 18049 14426 9532 4442
7840 4442 12531 15837 12164 5534 11232 25376 32085 23671 14293 17972 30428 20448 10574 -1943
7826 -1943 12692 20688 10600 -2289 -8367 -14929 -11546 -9268 4997 1558 -10147 -16985 5049
7813 5049 20387 20582 17742 12100 9737 15102 25494 32293 20527 9432 9388 12738 10958 5914 6399
7798 6399 11497 14509 352 -11048 135 5124 7441 9111 12982 15527 8147 352 10044 15648
$$ packed form
7897A4143k2852O072N877L627r752r96O082R875Q579K366O513j2928j915N722
7883B0413L6p786r938P331J045j4880j2475k339M613J6405k065o372J9026q283
7869D731j0728J182o860K53J777R142Q608j6262j001q584L584J2564M464Q00N710
7854I380P734k647j4487L059k891k5804J2730J2875J2498L155K447l623m894n090
7840D442Q089L306l673o630N698J4144O709q414r378L679J2456r980r874j2517
7826a943J4635P996j0088j2889o078o562L383K278J4265l439j1705o838K2034
7813E049J5338J95k840n642k363N365J0392O799j1766j1095m4L350j780n044M85
7798F399N098L012j4157j1400J1183M989K317J670L871K545p380p795R692N604
$$ plain form
7784 15648 14684 24334 13088 1655 -8814 -17954 -14078 -7891 -2773 -17903 -15654 1537 19023
7771 19023 13033 -7190 -27028 -31879 -23808 -1102 6594 13806 13158 15687 12404 18754 23360 24110
7757 24110 14393 13922 7590 -13003 -22456 -14304 -16599 -26322 -23152 -18255 -14185 -16798 -13601 -4933 -45
7742 -45 -2379 -5757 637 15471 13108 2185 10368 9821 13653 6908 -1476 -8959 -1673 7513 5042
7727 5042 194 4983 7927 6639 8878 25706 32284 22539 35139 18508 -6919 -267 11888 13025
7713 13025 11794 14446 30134 25451 10501 18721 15885 17182 21570 27993 -2761 -11791 -6344 -10156
7699 -10156 -5851 518 -2216 -10409 -12609 -12982 1235 -2714 -3843 -1860 -2514 -9947 -21277 -19873 -15198
7684 -15198 -212 6325 6569 13750 15160 9839 24349 38996 41186 35036 29856 17467 -1900 -21632
$$ packed form
7784A5648r64R650j1246j1433j0469r140L876O187N118j5130K249J7191J7486
7771A9023n990k0223j9838m851Q071K2706P696P212o48K529l283O350M606P50
7757B4110r717m71o332k0593r453Q152k295r723L170M897M070k613L197Q668M888
7742d5k334l378O394J4834k363j0923Q183n47L832o745q384p483P286R186k471
7727E042m848M789K944j288K239J6828O578r745J2600j6631k5427O652J2155J137
7713A3025j231K652J5688m683j4950Q220k836J297M388O423l0754r030N447l812
7699a0156M305O369k734q193k200l73J4217l949j129J983o54p433j1330J404M675
7684a5198J4986O537K44P181J410n321J4510J4647K190o150n180j2389j9367j9732
$$ plain form
7670 -21632 -22666 -15616 -9637 -8836 -14788 -15234 -9742 -12899 -18369 -15505 -9472 -939 -847 -14982 -20506
7655 -20506 -14211 -10767 -4398 4796 15952 33887 35528 30364 27146 6246 1409 3908 2596 -4245
7641 -4245 -9841 -3337 14208 29714 27810 21386 1049 -7350 2843 2896 -5041 -903 -180 -5577 -12677
7626 -12677 3838 3406 -1347 -11235 -19093 -9757 -261 15551 32597 25708 7119 3429 860 -2513
7612 -2513 10356 14685 20335 2825 -18325 -19448 -2013 17271 14629 9196 3112 -12907 -24157
7599 -24157 -32752 -6968 -8128 -8860 -13163 -10765 -13148 -10647 -4111 -5014 -5487 -973 -1008 3666 5831 16273
7583 16273 14343 9679 9022 13881 4522 2088 -199 -5925 -6137 7218 -4816 -16375 -740 13774
7569 13774 9633 9635 17341 14073 -10561 -23666 -12762 -503 2569 -862 -16975 -34465 -40383 -45603
$$ packed form
7670b1632j034P050N979Q01n952m46N492l157n470K864O033Q533R2j4135n524
7655b0506O295L444O369R194J1156J7935J641n164l218k0900m837K499j312o841
7641d245n596O504J7545J5506j904o424k0337q399J0193N3p937M138P23n397p100
7626a2677J6515m32m753r888p858R336R496J5812J7046o889j8589l690k569l373
7612b513J2869M329N650j7510k1150j123J7435J9284k642n433o084j6019j1250
7599b4157q595K5784j160p32m303K398k383K501O536r03m73M514l5M674K165J0442
7583A6273j930m664o57M859r359k434k287n726k12J3355j2034j1559J5635J4514
7569A3774m141KP706l268k4634j3105J0904J2259L072l431j6113j7490n918n220
$$ plain form
7555 -45603 -27149 -9332 7287 17612 11399 13485 14293 22178 13248 -945 -16680 -14394 -11827
7542 -11827 -10657 -19592 -18225 -14866 -15527 -13383 -14511 -2694 -5645 1064 -3196 -8391 -8084 -10384 -6748
7527 -6748 -13089 -16263 -13817 -3827 3479 11485 2264 1583 -4584 8234 -2023 -2591 2284 5517 123
7512 123 -82 -5853 1015 14933 13436 7731 9875 4006 -12716 -20502 -13999 1886 3023 2189 -8513
7497 -8513 -11683 -6063 -9252 -11995 -1094 395 -175 -16243 -16922 -3868 3286 -10202 -19312 -20120 -14782
7482 -14782 -4710 -19860 -10050 2184 96 10445 9415 1341 -2756 -6237 -5956 2657 20212 24204
7468 24204 11994 4112 -6035 6693 8683 12101 17153 19417 22719 7683 10513 7528 528 -10766
7454 -10766 2447 18693 31108 32199 22057 10246 -6578 -6733 3593 9898 3944 9124 -7861
$$ packed form
7555d5603J8454J7817J6619J0325o213K086Q08P885q930j4193j5735K286K567
7542a1827J170q935J367L359o61K144j128J1817k951O709m260n195L07k300L636
7527f748o341l174K446R990P306Q006r221o81o167J2818j0257n68M875L233n394
7512A23k05n771O868J3918j497n705K144n869j6722p786O503J5885J137q34j0702
7497h513l170N620l189k743J0901J489n70j6068o79J3054P154j3488r110q08N338
7482a4782J0072j5150R810J2234k088J0349j030q074m097l481K81Q613J7555L992
7468B4204j2210p882j0147J2728J990L418N052K264L302j5036K830k985p000j1294
7454a0766J3213J6246J2415J091j0142j1811j6824j55J0326O305n954N180j6985
$$ plain form
7441 -7861 -17891 -3771 795 7776 425 -10024 -24091 -20333 -4643 113 1958 3704 8229 1229
7427 1229 -6031 3967 15134 1943 -8046 -7896 -7188 1126 12056 19032 19376 11369 4794 10863 21241
7412 21241 21336 6778 12625 19036 18347 -4411 -12772 -20131 -11988 -8286 3430 17766 24245 27655
7398 27655 18777 12652 5292 -884 2044 -5881 -4237 -14941 -11896 -2227 1573 8766 16286 3317
7384 3317 6680 21462 15723 13230 2230 -2474 7747 8051 -1084 -6278 -185 2852 6915 2656
7370 2656 -5367 -7412 -4295 -13426 -9202 -1881 8607 9942 5938 1182 -1254 15956 31020 28428
7356 28428 18612 7681 22349 21873 9661 11722 940 8005 18356 11906 7199 15677 5894 -6791
7342 -6791 -2718 4362 -673 8485 2201 -3405 3910 14257 10886 8390 7279 20808 22667 7572
$$ packed form
7441g861j0030J4120M566O981p351j0449j4067L758J5690M756J845J746M525p000
7427A229p260R998J1167j3191r989J50P08Q314J0930O976L44q007o575O069J0378
7412B1241R5j4558N847O411o89k2758q361p359Q143L702J1716J4336O479L410
7398B7655q878o125p360o176K928p925J644j0704L045R669L800P193P520j2969
7384C317L363J4782n739k493j1000m704J0221L04r135n194O093L037M063m259
7370B656q023k045L117r131M224P321J0488J335m004m756k436J7210J5064k592
7356B8428r816j0931J4668m76j2212K061j0782P065J0351o450m707Q478r783j2685
7342f791M073P080n035R158o284n606P315J0347l371k496j111J3529J859j5095
$$ plain form
7328 7572 -493 -12962 -15657 -13847 -2131 3217 -45 -16080 -22552 -27180 -12989 -20674 -25996 -13905
7314 -13905 -6936 -1236 7477 -438 5513 14364 3853 -1492 -6549 -3946 3379 -11294 -14270 231
7300 231 897 -4246 -12256 -506 -27269 -31927 -9054 4676 6871 2647 -2312 -5768 -977 -599 4534
7285 4534 -127 -5063 -8147 -18090 -25093 -16631 -1929 -4424 -7726 -12259 -12498 -7843 -913 2511 -2598
7270 -2598 -5298 -9719 -13725 -18040 -4179 -7236 -1891 7284 -2294 -12452 -7602 10746 8169 -7331
7256 -7331 -17591 -20542 -24221 -15336 -11643 -20660 -2070 16930 18266 -4144 1317 -5361 -179 15434
7242 15434 22766 20497 32719 23171 13864 5291 -5539 -20802 -12253 -10343 -22355 -18361 -21864 -15712
7228 -15712 -7747 -14349 -24911 -21601 -19918 -18461 -25069 -23307 -5258 3234 3657 1170 -3555 -1795
$$ packed form
7328G572q065j2469k695J810J1716N348l262j6035o472m628J4191p685n322J2091
7314a3905O969N700Q713p915N951Q851j0511n345n057K603P325j4673k976J4501
7300B31O66n143q010J1750k6763m658K2873J3730K195m224m959l456M791L78N133
7285D534m661m936l084r943p003Q462J4702k495l302m533k39M655O930L424n109
7270b598k700m421m006m315J3861l057N345R175r578j0158M850J8348k577j5500
7256g331j0260k951l679Q885L693r017J8590J9000J336k2410N461o678N182J5613
7242A5434P332k269J2222r548r307q573j0830j5263Q549J910j2012L994l503O152
7228a5712P965o602j0562L310J683J457o608J762J8049Q492M23k487m725J760
$$ plain form
7214 -1795 1946 11940 8105 15687 22228 22492 26779 15226 13126 -481 -11034 -2537 1890 -7039
7200 -7039 -13813 -2699 4949 9356 20238 20769 16696 3338 -6765 2149 2431 9233 14457 7040
7186 7040 -758 2683 -5330 -418 1783 3695 1452 12270 591 7173 11349 809 -2969 -1277
7172 -1277 -1008 -6642 -6595 457 -10315 -3903 13248 9040 2362 1609 -873 2335 -7297 -25473 -15888
7157 -15888 -3497 13151 19350 21004 11545 -4518 2271 -4863 -3329 3654 -3647 10489 10873 4606
7143 4606 -944 -9563 -825 1053 -14853 -29197 -17419 -1355 9504 19672 -842 -9007 -3433
7130 -3433 -4373 4171 -426 2608 19217 23780 8312 8477 4645 -4640 -20476 -15412 -599 7161
7116 7161 5826 432 -161 -13964 -25470 -28372 -21581 -19018 -2167 11001 6549 -6228 -2989 -1720
$$ packed form
7214a795L741R994l835P582O541K64M287j1553k100j3607j0553Q497M427q929
7200g039o774J1114P648M407J0882N31m073j3358j0103Q914K82O802N224p417
7186G040p798L441q013M912K201J912k243J0818j1679O582M176j0540l778J692
7172a277K69n634M7P052j0772O412J7151m208o678p53k482L208r632j8176R585
7157a5888J2391J6648O199J654r459j6063O789p134J534O983p301J4136L84o267
7143D606n550q619Q738J878j5906j4344J1778J6064J0859J0168k0514q165N574
7130c433r40Q544m597L034J6609M563j5468J65l832r285j5836N064J4813P760
7116G161j335n394n93j3803j1506k902O791K563J6851J3168m452j2777L239J269
$$ plain form
7102 -1720 4070 1910 -14166 -13670 -8336 -426 8155 1052 -8443 -20335 -22081 -9584 6676 -2158
7088 -2158 -5712 -14460 -24841 -13383 -8777 -11651 12601 35091 34407 31835 28719 28490 33361 29591
7074 29591 22304 4488 2380 -3744 4007 10897 5348 2593 14374 25692 28155 17807 14622 5770
7060 5770 -2778 -7159 -8075 -536 3237 -2600 7082 3570 13453 35330 41415 24538 23711 5896 -4167
7045 -4167 -8080 -6007 5096 1661 7249 5970 -1744 3593 3303 1298 3332 5593 11790 21477 21942
7030 21942 33053 27466 13123 14905 6951 10055 5009 3437 1962 3217 16965 17104 7380 8123
7016 8123 5574 12953 9795 911 5027 13506 11421 13724 17501 14865 6881 6908 6581 -9292 -15150
7001 -15150 -4516 -4146 -6221 7709 11828 5202 13041 17109 -129 -370 7841 5900 5688 6427 7947
$$ packed form
7102a720N790k160j6076M96N334P910Q581p103r495j1892j746J2497J6260q834
7088b158l554q748j0381J1458M606k874K4252K2490o84k572l116k29M871l770
7074B9591p287j7816k108o124P751O890n549k755J1781J1318K463j0348l185q852
7060E770q548m381r16P539L773n837R682l512R883K1877O085j6877q27j7815j0063
7045d167l913K073J1103l435N588j279p714N337k90k005K034K261O197R687M65
7030B1942J1111n587j4343J782p954L104n046j572j475J255J3748J39r724P43
7016H123k549P379l158q884M116Q479k085K303L777k636p984K7l27j5873n858
7001a5150J0634L70k075J3930M119o626P839M068j7238k41Q211j941k12P39J520
$$ plain form
6986 7947 8793 -4048 -2740 3911 6738 10027 -3436 -16031 -19877 -11514 3326 2617 3138 9834 7255
6971 7255 -5122 5 10204 23674 34704 46237 47729 45850 21201 7468 -5557 -2998 -409
6958 -409 185 16188 17253 18651 4843 -6542 -11952 -17343 -28035 -9867 -4378 3150 2094 -142
6944 -142 1060 -3550 -24739 -27863 -21936 -8964 -11995 -17709 -15349 -15111 -9478 -2250 -6926 -10436 -12504
6929 -12504 6282 11095 -10226 -8630 11611 27012 19467 14602 4048 2500 1773 13151 24665
6916 24665 30336 20773 5700 -5626 -6071 -7308 -15441 -12771 4288 16097 16135 12229 9424 6627
6902 6627 3807 1118 -1487 -2766 -138 1621 -10 2148 -17425 -38474 -36200 -22964 -10917 -13338
6888 -13338 -14028 -24534 -19294 -14565 -3717 11856 13782 19679 7706 -684 -4082 -7018 329 17209
$$ packed form
6986G947Q46j2841J308O651K827L289j3463j2595l846Q363J4840p09N21O696k579
6971G255j2377N127J0199J3470J1030J1533J492j879k4649j3733j3025K559K589
6958d09N94J6003J065J398j3808j1385n410n391j0692J8168N489P528j056k236
6944a42J202m610k1189l124N927J2972l031n714K360K38N633P228m676l510k068
6929a2504J8786M813k1321J596K0241J5401p545m865j0554j548p27J1378J1514
6916B4665N671r563j5073j1326m45j237q133K670J7059J1809L8l906k805k797
6902F627k820k689k605j279K628J759j631K158j9573k1049K274J3236J2047k421
6888a3338o90j0506N240M729J0848J5573J926N897j1973q390l398k936P347J6880
$$ plain form
6874 17209 25157 18783 14381 1806 -5209 -18703 -15525 -9449 17756 14926 12044 1989 -12906
6861 -12906 -11911 -21154 -28847 -12082 11247 30910 26638 18702 -8680 -11485 2552 8656 2429 -2933
6847 -2933 -3024 -2566 -13065 -1417 10988 2090 -1479 -9198 -11173 1089 -2599 5130 8840 6033 -8436
6832 -8436 -1685 -11973 -14887 -19847 -2280 -21 -10114 -11811 -2274 -1909 -7871 -9808 -6560 8648
6818 8648 11226 9529 -596 -2392 -16749 -23873 -7502 -4065 -10453 -18864 -19405 -5178 -3770 -2800
6804 -2800 11112 6808 -12230 -6592 -5554 -19308 -7066 -1059 4816 -9851 -13191 -11812 -13872 -11605
6790 -11605 1443 4604 6138 6716 123 -12264 -13827 635 13324 15066 2359 -7592 -12542 -23524
6776 -23524 -14686 -9048 -11899 -13086 -9523 -5187 -6616 -1054 11815 21026 17299 28560 38116 31415
$$ packed form
6874A7209P948o374m402j2575p015j3494L178O076K7205k830k882j0055j4895
6861a2906R95r243p693J6765K3329J9663m272p936k7382k805J4037O104o227n362
6847b933r1M58j0499J1648J2405q898l569p719j975J2262l688P729L710k807j4469
6832h436O751j0288k914m960J7567K259j0093j697R537L65n962j937L248J5208
6818H648K578j697j0125j796j4357p124J6371L437o388q411n41J4227J408R70
6804b800J3912m304j9038N638J038j3754J2242O007N875j4667l340J379k060K267
6790a1605J3048L161J534N78o593j2387j563J4462J2689J742j2707r951m950j0982
6776b3524Q838N638k851j187L563M336j429N562J2869R211l727J1261R556o701
$$ plain form
6762 31415 30899 22288 20335 20522 18603 3343 -13 8433 -4514 -26646 -29814 -35828 -22205 -3668
6748 -3668 4664 6481 -805 -13437 -21827 -27545 -24848 -4991 3053 14223 10249 -4423 -17234 -27493
6734 -27493 -22728 -2930 -2543 -26136 -36322 -38410 -42667 -35714 -16452 -2235 -6108 -13325 -9223 -5241
6720 -5241 -692 6539 10029 16423 32639 50654 50094 34887 25839 34680 31382 11026 -3746 -13196
6706 -13196 -15837 -22273 -16563 -8358 -10580 -6110 21975 22354 17146 14210 9084 9342 107 -8035 -4623
6691 -4623 -2919 -4083 -11269 -21686 -17784 -9723 687 17567 19607 19720 15369 9252 8174 35876
6677 35876 47817 37783 24985 19952 6868 -8245 -22002 -31548 -12298 -13343 -8834 3161 4330
6664 4330 12512 15977 27024 13942 -4582 18218 30136 31508 26799 9379 -2928 -8276 -12773
$$ packed form
6762C1415n16q611j953J87j919j5260l356Q446j2947k2132l168o014J3623J8537
6748c668Q332J817p286j2632q390n718K697J9857Q044J1170l974j4672j2811j0259
6734b7493M765J9798L87k3593j0186k088m257O953J9262J4217l873p217M102L982
6720e241M549P231L490O394J6216J8015n60j5207r048Q841l298k0356j4772r450
6706a3196k641o436N710Q205k222M470K8085L79n208k936n126K58r235q142L412
6691d623J704j164p186j0417L902Q061J0410J6880K040J13m351o117j078K7702
6677C5876J1941j0034j2798n033j3084j5113j3757r546J9250j045M509J1995J169
6664D330Q182L465J1047j3082j8524K2800J1918J372m709j7420j2307n348m497
$$ plain form
6651 -12773 -6714 -3416 8460 14217 20303 33767 23468 560 -17061 -9328 4358 20944 29139
6638 29139 10746 -2732 -6034 -13726 -325 4274 -3029 -10564 -4190 -1638 -5171 735 5273 -7526
6624 -7526 -17497 -24073 -25906 -15246 -7379 -11284 -17174 1278 11371 -1666 -8322 2125 357 6615
6610 6615 4857 -867 3807 6618 -12495 -10743 -3644 -6368 2526 13878 11121 18260 7997 -6597
6596 -6597 -1025 10607 5353 8615 8472 4574 13223 6812 -4655 -5773 1958 364 7544 8802 -1339
6581 -1339 -12350 -18222 -12572 42 3168 -5756 -2436 -3400 5452 15832 10035 5091 677 -1751
6567 -1751 1656 -980 -1669 1645 15366 7046 3908 4640 18870 26674 37894 21629 13693 15042
6553 15042 14488 9722 -736 -6667 1762 -9357 -11332 2965 1287 -12679 -7609 -8769 -13767 -25548
$$ packed form
6651a2773O059L298J1876N757O086J3464j0299k2908j7621P733J3686J6586Q195
6638B9139j8393j3478l302p692J3401M599p303p535O374K552l533N906M538j2799
6624g526r971o576j833J0660P867l905n890J8452J0093j3037o656J0447j768O258
6610F615j758n724M674K811j9113J752P099k724Q894J1352k757P139j0263j4594
6596f597N572J1632n254L262j43l898Q649o411j1467j118P731j594P180J258j0141
6581a339j1011n872N650J2614L126q924L320r64Q852J0380n797m944m414k428
6567a751L407k636o89L314J3721q320l138P32J4230P804J1220j6265p936J349
6553A5042n54m766j0458n931Q429j1119j975J4297j678j3966N070j160m998j1781
$$ plain form
6539 -25548 -25410 -12269 -17932 -6361 11900 20001 2822 -4215 2279 13106 13022 9809 7057 -11939
6525 -11939 -9107 700 9655 5468 -3034 -16802 -16702 -8975 -284 6450 -1945 -12347 -18050 -10815
6511 -10815 -2630 -13548 -16772 -22778 -26211 -11574 -2972 3750 -266 -1483 3043 11563 9245 703
6497 703 -2558 3409 -1824 -18125 -23594 -16129 -16477 -8906 -6163 -15338 -3457 3380 -3313 -12993 -11065
6482 -11065 -7904 4028 9434 5237 11562 18905 11032 -7758 -7165 -11848 -7103 6257 15609 335
6468 335 -13842 -14302 3912 10077 19063 31466 23668 -2472 -11360 -13860 -16573 -10771 10772 14940
6454 14940 9654 4886 7386 3442 -2922 -8099 -7040 5660 14635 3674 -1805 -18994 -24021 -30315
6440 -30315 -23293 -20524 -28158 -21629 -20362 -15537 -33396 -39031 -31042 -17849 -10743 -6529 -13279 -24278
$$ packed form
6539b5548J38J3141n663J1571J8261Q101j7179p037O494J0827q4l213k752j8996
6525a1939K832R807Q955m187q502j3768J00P727Q691O734q395j0402n703P235
6511a0815Q185j0918l224o006l433J4637Q602O722m016j217M526Q520k318q542
6497G03l261N967n233j6301n469P465l48P571K743r175J1881O837o693r680J928
6482a1065L161J1932N406m197O325P343p873j8790N93m683M745J3360R352j5274
6468C35j4177m60J8214O165Q986J2403p798k6140q888k500k713N802K1543M168
6454A4940n286m768K500l944o364n177J059J2700Q975j0961n479j7189n027o294
6440c0315P022K769p634O529J267M825j7859n635P989J3193P106M214o750j0999
$$ plain form
6426 -24278 -16382 -12709 -19328 -28012 -23912 -28286 -27212 -28512 -23058 -19059 -17682 -13945 -19901 -14967 -7352
6411 -7352 -4019 -16011 -14581 -5396 1707 4119 -1872 6539 -7630 -1151 1378 13189 10981 1948
6397 1948 1074 2277 6043 10372 1165 -6029 -8305 -5689 -811 -8063 -4812 -9607 -18233 -11488 7452
6382 7452 5731 -8205 -20097 -13785 -15260 -18719 -12526 6837 -4557 -20088 -14915 -3923 256
6369 256 10274 12862 3996 2870 -11485 -13439 -22664 -32383 -28784 -12711 -12338 -6084 -827 -1342 -888
6354 -888 -1147 -16848 -21500 -25564 -16532 -4471 4145 5500 10541 6082 -6935 -15980 -12635 -9329 -5636
6339 -5636 -6751 -2428 -3678 -21279 -33118 -27298 -9800 -3045 -720 156 8803 9454 3388 -11755
6325 -11755 -21925 -21426 -7407 -1323 18379 11022 1025 13039 24828 22741 11084 1089 -2041
$$ packed form
6426b4278P896L673o619q684M100m374J074j300N454L999J377L737n956M934P615
6411g352L333j1992J430R185P103K412n991Q411j4169O479K529J1811k208r033
6397A948q74J203L766M329r207p194k276K616M878p252L251m795q626O745J8940
6382G452j721j3936j1892O312j475l459O193J9363j1394j5531N173J0992M179
6369B56J0018K588q866j126j4355j954r225r719L599J6073L73O254N257n15M54
6354h88k59j5701m652m064R032J2061Q616J355N041m459j3017r045L345L306L693
6339e636j115M323j250j7601j1839N820J7498O755K325Q76Q647O51o066j5143
6325a1755j0170M99J4019O084J9702p357r997J2014J1789k087j1657r995l130
$$ plain form
6312 -2041 -9226 725 4126 -5119 -5027 -20170 -8481 1392 5380 -348 -15937 -17186 -10242 -3813 -11096
6297 -11096 -21149 -10651 2508 -2081 9671 28926 29983 19929 3595 -12548 -12685 -8245 -2479
6284 -2479 -2112 -4572 -18714 -2960 639 2607 13227 8300 -2466 1140 -9730 -3493 7712 -2666
6270 -2666 -11888 -10097 -3435 7791 31039 34593 42744 34794 25833 33477 40799 30583 20837 22226
6256 22226 29601 20696 4764 5661 8157 -10139 -23431 -28716 -37494 -37002 -31811 -13135 -911 -17836
6242 -17836 -18168 -15698 -19914 -31182 -35659 -20334 -14082 -2962 -3547 -8044 -5634 -9780 -5672 -538
6228 -538 16064 26486 18735 2763 -2344 665 1968 15144 11874 -10308 -17187 -6487 -5050 -8229
6214 -8229 -3854 -7077 -7389 10162 3469 -4551 -5004 -8170 -9917 -646 -4189 3089 1313 4329 724
$$ packed form
6312b041p185R951L401r245R2j5143J1689R873L988n728j5589j249O944O429p283
6297a1096j0053J0498J3159m589J1752J9255J057j0054j6334j6143j37M440N766
6284b479L67k460j4142J5754L599J968J0620m927j0766L606j0870O237J1205j0378
6270b666r222J791O662J1226K3248L554Q151p950q961P644P322j0216r746J389
6256B2226P375q905j5932Q97K496j8296j3292n285q778M92N191J8676J2224j6925
6242a7836l32K470m216j1268m477J5325O252J1120n85m497K410m146M108N134
6228e38J6602J0422p751j5972n107L009J303J3176l270k2182o879J0700J437l179
6214h229M375l223l12J7551o693q020m53l166j747R271l543P278j776L016l605
$$ plain form
6199 724 -17360 -11708 3019 10394 25270 22313 14553 2065 8232 14859 7562 9136 6475 11831
6185 11831 -1463 -24603 -10086 13912 11848 -12588 -32646 -36475 5185 19518 6606 6769 16294
6172 16294 28351 14573 14941 15699 8804 12451 16819 21748 25280 15684 2223 -9642 -14927 -6102
6158 -6102 7891 10766 23794 14461 -2028 1765 24117 20580 15627 15414 -1119 -13033 -13981 -17282
6144 -17282 -12905 -18401 -20320 -16694 -12384 -16236 -28193 -23928 -32258 -23995 -38352 -33592 -18056 1957
6130 1957 12235 9887 10746 3974 -4936 -17215 3871 -5897 -25023 -31067 -37177 -28550 -8248 2770
6116 2770 -667 -1350 -214 237 -15870 -2242 6710 2771 -11702 -30232 -40440 -32853 -30364 -34942
6102 -34942 -32877 -33242 -26673 -26448 -16069 -14959 -1527 -11360 -23448 -12461 -144 -1473 -946 -7149
$$ packed form
6199G24j8084N652J4727P375J4876k957p760j2488O167O627p297J574k661N356
6185A1831j3294k3140J4517K3998k064k4436k0058l829M1660J4333j2912J63R525
6172A6294J2057j3778L68P58o895L647M368M929L532r596j3461j1865n285Q825
6158f102J3993K875J3028r333j6489L793K2352l537m953k13j6533j1914r48l301
6144a7282M377n496j919L626M310l852j1957M265q330Q263j4357M760J5536K0013
6130A957J0278k348Q59o772q910j2279K1086r768j9126o044o110Q627K0302J1018
6116B770l437o83J136M51j6107J3628Q952l939j4473j8530j0208P587K489m578
6102c4942K065l65O569K25J0379J110J3432r833j2088J0987J2317j329N27o203
$$ plain form
6088 -7149 -9778 -17729 -23037 -18831 3404 5353 11561 12411 16431 11194 6490 -1668 -3447 -3336 -10391
6073 -10391 -1552 9801 10124 7277 12906 13700 6201 4123 5490 2131 -5211 -13588 -2069 -1371 -5231
6058 -5231 -9554 -12916 -1375 -7003 -518 553 -11037 -24433 -7358 3240 -1848 -12750 -16175
6045 -16175 -21988 -26735 -6445 6627 8743 13699 -462 -9977 -1620 -824 -12029 -20457 -16233 -4845
6031 -4845 -11907 -9510 -8393 -14620 -17330 -25155 -31015 -17478 -4137 -1347 -10323 -15251 -21658 -20845 -14431
6016 -14431 -10618 9584 9387 9555 5165 -14073 -21783 -1037 10025 7991 2109 8066 11653 13472
6002 13472 9447 -3909 -8529 -14829 -21552 -14583 -7359 4660 354 -5735 2360 -1112 -2693 -927
5988 -927 78 -795 13237 27731 22123 4388 8069 12781 25877 25072 16223 9035 4210 7994 3947
$$ packed form
6088g149k629p951n308M206K2235J949O208Q50M020n237m704q158j779J11p055
6073a0391Q839J1353L23k847N629P94p499k078J367l359p342q377J1519O98l860
6058e231m323l362J1541n628O485J071j1590j3396J7075J0598n088j0902l425
6045a6175n813m747K0290J3072K116M956j4161r515Q357P96j1205q428M224J1388
6031d845p062K397J117o227k710p825n860J3537J3341K790q976m928o407Q13O414
6016a4431L813K0202j97J68m390j9238p710K0746J1062k034n882N957L587J819
6002A3472m025j3356m620o300o723O969P224J2019m306o089Q095l472j581J766
5988i27J005q73J4032J4494n608j7735L681M712J3096q05q849p188m825L784m047
$$ plain form
5973 3947 229 8139 6951 -13942 -22722 -14636 -16841 -10209 -465 -9458 -6198 -17351 -9536 1676
5959 1676 5498 12858 9178 1785 3750 17245 22770 20080 7996 8208 14588 18652 16166 1525
5945 1525 874 -2193 -13195 -19486 -21828 -8935 -2786 -1571 1903 13998 -3835 -11144 -6844 3451
5931 3451 7832 65 -1847 419 3275 -11711 -13936 3893 1728 -17158 -24464 -13370 -11946 -11266
5917 -11266 -7936 -9770 -2031 1448 2378 -4105 -175 7224 5574 -3964 -17453 -26499 -11551 -6618
5903 -6618 5073 13459 15461 19560 9825 2820 1085 -5282 3721 2875 6265 2756 -1724 14543 17848
5888 17848 1308 -1414 7494 -6094 -7347 -19081 -24726 -14748 -18847 -28571 -34633 -26566 -29465 -16220
5874 -16220 1699 22380 18009 -816 -5095 -1118 -3382 -1464 -14637 -20195 -26742 -39243 -33097
$$ packed form
5973C947l718P910j188k0893q780Q086k205O632R744q993L260j1153P815J1212
5959A676L822P360l680p393J965J3495N525k690j2084K12O380M064k486j4641
5945A525o51l067j1002o291k342J2893O149J215L474J2095j7833p309M300J0295
5931C451M381p767j912K266K856j4986k225J7829k165j8886p306J1094J424O80
5917a1266L330j834P739L479R30o483L930P399j650r538j3489r046J4948M933
5903f618J1691Q386K002M099r735p005j735o367R003q46L390l509m480J6267L305
5888A7848j6540k722Q908j3588j253j1734n645R978m099r724o062Q067k899J3245
5874a6220J7919K0681m371j8825m279L977k264J918j3173n558o547j2501O146
$$ plain form
5861 -33097 -22764 -29655 -22463 -10478 9669 19844 13603 7842 -9284 -21878 -14439 -13385 -13281
5848 -13281 -20091 -17465 -10514 1271 -1043 5013 1966 -15270 -21772 -19639 -2009 -5148 -16541 -15944
5834 -15944 -8911 -9131 -1144 4103 3096 222 4330 12592 9716 2314 741 -368 -9665 -3368 -8297
5819 -8297 -12660 -10060 1388 -17156 -24711 -13729 -2288 5637 6212 5739 1841 1054 -12324 -27675
5805 -27675 -23498 -21394 -7751 4182 18750 19048 8581 2641 5618 2118 -33 10000 20346
5792 20346 17027 15696 11673 -303 -2660 -8428 -6286 -6225 9268 7654 -17203 -11560 -1174 813
5778 813 -2924 3134 17141 9368 93 -7427 -19266 -15120 -16531 -19477 -30265 -11030 3992 7144
5764 7144 12292 874 -6947 -4633 -2476 -3769 -4341 -13897 -29666 -25821 4796 1962 -10359 -21069
$$ packed form
5861c3097J0333o891P192J1985K0147J0175o241n761j7126j2594P439J054J04
5848a3281o810K626O951J1785k314O056l047j7236o502K133J7630l139j1393N97
5834a5944P033k20P987N247j007k874M108Q262k876p402j573j109r297O297m929
5819h297m363K600J1448j8544p555J0982J1441P925N75m73l898p87j3378j5351
5805b7675M177K104J3643J1933J4568K98j0467n940K977l500k151J0033J0346
5792B0346l319j331m023j1976k357n768K142O1J5493j614k4857N643J0386J987
5778H13l737O058J4007p773r275p520j1839M146j411k946j0788J9235J5022L152
5764G144N148j1418p821K314K157j293n72r556j5769L845L0617k834j2321j0710
$$ plain form
5750 -21069 -18509 -18277 -18795 -16723 -15355 -8456 -13436 -14019 -2687 -1383 -4006 2234 1660 -8126 -8705 -16258
5734 -16258 -22913 -17455 -11088 -287 -6791 -1708 -12566 -17582 -13450 -5988 411 -7896 -19132 -6402
5720 -6402 2916 -8776 -19686 -20751 -10324 6228 7592 4704 8168 2186 -5040 -6494 -7539 -2132
5706 -2132 -6262 -14979 -24433 -10532 2407 2296 3758 -7669 -21884 -22090 -869 7453 -10436 -26456
5692 -26456 -19929 -16181 -30366 -15478 -7171 -347 -6492 -9545 -4592 114 -3428 -7580 -5764 2782
5678 2782 14197 6395 3890 1261 1863 6359 -3529 -2197 -11295 -10234 62 -3181 4671 3758 15482
5663 15482 452 -15149 -8702 7062 3510 -9412 -23695 -33747 -38902 -21903 -3571 -365 -1583
5650 -1583 -12251 310 16970 7894 -7786 -24576 -29803 -22217 -13309 -10090 -17278 -9967 8634
$$ packed form
5750b1069K560K32n18K072J368O899m980n83J1332J304k623O240n74r786n79p553
5734a6258o655N458O367J0801o504N083j0858n016M132P462O399q307j1236J2730
5720f402R318j1692j0910j065J0427J6552J364k888L464n982p226j454j045N407
5706b132m130q717r454J3901J2939j11J462j1427j4215k06K1221Q322j7889j6020
5692b6456O527L748j4185J4888Q307O824o145l053M953M706l542m152J816Q546
5678B782J1415p802k505k629O02M496r888J332r098J061J0296l243P852r13J1724
5663A5482j5030j5601O447J5764l552j2922j4283j0052n155J6999J8332L206j218
5650a583j0668J2561J6660r076j5680j6790n227P586Q908L219p188P311J8601
$$ plain form
5637 8634 4616 799 1371 -14646 -32945 -30204 -31444 -29872 -21251 -13399 -294 3561 4174 709 -208
5622 -208 -730 -10128 -20086 -25061 -31374 -24724 -24690 -8562 5190 -7300 -26592 -28298 -25194 -20168 -16852
5607 -16852 -9291 -14150 -14681 -3255 -1681 -11000 -22935 -26373 -13014 5221 -1094 -862 10347 19542
5593 19542 2311 -7938 -1957 12108 6146 12025 25675 13390 1542 7137 4730 1241 3312
5580 3312 9796 16745 5062 -3101 -6814 -8317 4231 9651 -10848 -23417 -4826 8730 13893
5567 13893 2022 781 -3690 -5767 14534 13056 18550 19027 34949 32501 14860 20665 34058 23140
5553 23140 15666 9888 13756 20779 6731 -6495 -11929 -24585 -25884 -16952 -7610 -5132 -8026 6469
5539 6469 8790 10563 11419 3260 -11988 -2925 10671 3727 -20935 -21010 -17616 -9824 -784 -9169 -23095
$$ packed form
5637H634m018l817N72j6017j8299K741j240J572Q621P852J3105L855O13l465r17
5622b08n22r398r958m975o313O650L4J6128J3752j2490j9292j706L104N026L316
5607a6852P561m859n31J1426J574r319j1935l438J3359J8235o315K32J1209R195
5593A9542j7231j0249N981J4065n962N879J3650j2285j1848N595k407l489K071
5580C312O484O949j1683q163l713j503J2548N420k0499j2569J8591J3556N163
5567A3893j1871j241m471k077K0301j478N494M77J5922k448j7641N805J3393j0918
5553B3140p474n778L868P023j4048j3226n434j2656j299Q932R342K478k894J4495
5539F469K321J773Q56q159j5248R063J3596o944k4662p5L394P792R040q385j3926
$$ plain form
5524 -23095 -21703 -17168 -7105 -2836 -681 535 3295 1519 3780 133 -9166 2393 7087 10432
5510 10432 7298 12986 17285 11196 11806 9363 5844 627 365 15112 8859 -456 -18561 -17270 -6925
5495 -6925 -1791 -18837 -21812 -38795 -41428 -22121 2868 16466 5091 -8798 -9939 -5314 -14489
5482 -14489 -15858 -7390 -1282 18163 14065 8587 -621 397 14255 1908 660 8374 10257 2198
5468 2198 -12623 -5087 -918 1624 165 -9264 -17509 -27312 -28774 -19440 -8449 -3040 -11784 -23092
5454 -23092 -25025 -21073 2644 6238 2080 -2998 6878 20498 20697 17158 21683 12939 13834 11810 18528
5439 18528 31385 28797 19908 20055 26446 5332 -17483 -19454 -25317 -7236 9196 14141 20445 16034
5425 16034 9756 351 -4197 -1784 5319 1520 -14182 -13684 -3008 8657 -607 -12613 -18029 -6731
$$ packed form
5524b3095J392M535J0063M269K155J216K760j776K261l647r299J1559M694L345
5510A0432l134N688M299o089O10k443l519n217k62J4747o253r315j8105J291J0345
5495f925N134j7046k975j6983k633J9307K4989J3598j1375j3889j141M625r175
5482a4489j369Q468O108J9445m098n478r208J018J3858j2347j248P714J883q059
5468B198j4821P536M169K542j459r429q245r803j462R334J0991N409q744j1308
5454b3092j933L952K3717L594m158n078R876J3620J99l539M525q744Q95k024O718
5439A8528J2857k588q889J47O391k1114k2815j971n863J8081J6432M945O304m411
5425A6034o278r405m548K413P103l799j5702M98J0676J1665r264j2006n416J1298
$$ plain form
5411 -6731 0 10528 22037 23180 14801 13379 21696 20343 6515 7488 7102 -7236 -10020 -9696 -17427
5396 -17427 -25891 -9335 -4315 -4399 7554 3704 768 7526 1929 354 1388 -2652 6358 -1588 -13706
5381 -13706 -23682 -24726 -26965 -40708 -40168 -13921 12914 17312 7606 -2362 -5770 -11540 -12502 -19805
5367 -19805 -20090 1600 3849 -16343 -21259 -21556 -18243 -10003 -7518 -2300 2114 1264 -853 7103 5813
5352 5813 1431 -6166 -5530 2326 -943 -4665 -7010 -305 -10915 -21594 -16970 -12040 3072 4777
5338 4777 -5384 -3776 -1041 -11316 -7077 8196 -1913 17 5568 8986 8572 4479 11703 8105
5324 8105 -1253 -14407 -11631 2558 14750 6725 -3271 -3622 1739 4426 2652 -6260 -1991 -10679
5310 -10679 -8534 4351 13672 6601 -802 -9247 -10218 -10039 443 1373 -2201 1035 -3868 -3523 -1283
$$ packed form
5411f731O731J0528J1509J143q379j422Q317j353j3828R73l86j4338k784L24p731
5396a7427q464J6556N020q4J1953l850k936O758n597j575J034m040R010p946j2118
5381a3706r976j044k239j3743N40K6247K6835M398r706r968l408n770r62p303
5367a9805k85K1690K249k0192m916k97L313Q240K485N218M414q50k117P956j290
5352E813m382p597O36P856l269l722k345O705j0610j0679M624M930J5112J705
5338D777j0161J608K735j0275M239J5273j0109J930N551L418m14m093P224l598
5324H105r358j3154K776J4189J2192q025r996l51N361K687j774q912M269q688
5310a0679K145J2885R321p071p403q445r71J79J0482R30l574L236m903L45K240
$$ plain form
5295 -1283 -5417 -3955 -535 11032 1163 188 -927 4174 -4063 4091 4660 -3816 -10083 -12406 -8919
5280 -8919 -1046 4015 -5704 -19824 -29827 -32746 -16482 -24068 -23922 -20991 -26276 -9851 2147 2941
5266 2941 -4647 -12034 -9542 -1182 6446 6800 1474 15360 23211 16515 18736 21343 14025 17072 3209
5251 3209 9464 15044 2292 5022 14586 -8476 -15024 -4581 4352 6650 -9953 -31680 -13254
5238 -13254 -11604 -12854 2676 11576 29486 26638 16761 6652 1673 -1448 -631 5963 -7833 -7236
5224 -7236 -2886 -3171 3504 -7164 -17602 -27695 -24150 -22381 -20539 -17051 2999 -90 -17743 -36799
5210 -36799 -29159 -11403 -2358 1756 -1733 -13306 -20441 -15220 -22458 2746 20367 11208 11139 9819
5196 9819 -1370 6842 4831 11532 3043 323 7687 1777 6337 18289 7258 -4439 -2558 -609
$$ packed form
5295a283m134J462L420J1567r869r75j115N101q237Q154N69q476o267k323L487
5280h919P873N061r719j4120j0003k919J6264p586J46K931n285J6425J1998P94
5266B941p588p387K492Q360P628L54n326J3886P851o696K221K607p318L047j3863
5251C209O255N580j2752K730R564k3062o548J0443Q933K298j6603k1727J8426
5238a3254J650j250J5530Q900J7910k848r877j0109m979l121Q17O594j3796N97
5224g236M350k85O675j0668j0438j0093L545J769J842L488K0050l089j7653j9056
5210c6799P640J7756R045M114l489j1573p135N221p238K5204J7621r159o9j320
5196I819j1189Q212k011O701q489k720P364n910M560J1952j1031j1697J881J949
$$ plain form
5182 -609 6908 6575 -6760 -10964 -15160 -6125 5183 26357 38148 29850 13605 6926 4760 5927
5168 5927 19156 28543 25846 19305 17967 22233 10437 8156 9955 603 -6740 -4614 2702 -15098
5154 -15098 -22286 -21193 -22715 -6298 18528 12146 5917 12119 7548 12813 16252 17304 17244 15241 7261
5139 7261 -371 -15961 -22505 -28419 -29967 -20168 -18430 -17903 -20343 -21372 -14127 -18018 -24422 -32487 -18759
5124 -18759 -3368 -27041 -30554 -10482 774 -3512 -11578 -8647 2000 8188 11877 11621 11413 19770
5110 19770 9104 -8795 -15102 -7836 -8258 -16781 -12516 -7189 -3699 -14599 -21641 -19157 -20786 -19692
5096 -19692 -14388 -6483 -6972 -5766 7919 12852 12671 4214 -3773 1312 7591 1433 2117 9583 8819
5081 8819 11613 714 -12462 -17272 -18528 3511 8004 12833 9797 -1235 -11580 -10306 -8299 -2171
$$ packed form
5182f09P517l33j3335m204m196R035J1308K1174J1791q298j6245o679k166J167
5168E927J3229R387k697o541j338M266j1796k281J799r352p343K126P316j7800
5154a5098p188J093j522J6417K4826o382o229O202m571N265L439J052o0k003p980
5139G261p632j5590o544n914j548R799J738N27k440j029P245l891o404q065J3728
5124a8759J5391k3673l513K0072J1256m286q066K931J0647O188L689k56k08Q357
5110A9770j0666j7899o307P266m22q523M265N327L490j0900p042K484j629J094
5096a9692N304P905m89J206J3685M933j81q457p987N085O279o158O84P466p64
5081H819K794j0899j3176m810j256K2039M493M829l036j1032j0345J274K007O128
$$ plain form
5067 -2171 -8346 -10793 -1982 7548 -1633 -7044 -5603 -1081 -5038 -21060 -16841 -4402 8169 12200
5053 12200 7126 -1638 -1905 -5209 -7045 2357 1789 -4004 -21360 -14104 -5587 -15309 -15857 1452 8424
5038 8424 -8322 -26872 -24360 -8952 555 -122 4708 2589 1699 7518 24849 31130 28489 21416
5024 21416 -3078 -18206 -22255 -13231 -13418 -8009 -9670 -19275 -20221 -18709 -17123 -7525 -17067 -28118
5010 -28118 -32404 -29559 -23840 -19695 -20265 -5065 -9282 -9972 3774 -8684 -20161 -19102 -8829 -18032
4996 -18032 -15264 13839 14563 -5598 -18262 -16473 -17389 -1458 3254 2020 1377 6603 -7984 -22287
4982 -22287 -20174 -24243 -9853 459 -10159 -12331 -13197 -4331 -2858 -3365 -9528 -1218 1989 1364 -15674
4967 -15674 -31998 -30176 -20317 -30816 -26076 -15767 -15025 -10144 8783 21550 28445 12379 -6287
$$ packed form
5067b171o175k447Q811R530r181n411J441M522l957j6022M219J2439J2571M031
5053A2200n074q764k67l304j836R402n68n793j7356P256Q517r722n48J7309O972
5038H424j6746j8550K512J5408R507o77M830k119q90N819J7331O281k641p073
5024B1416k4494j5128m049R024j87N409j661r605r46J512J586R598r542j1051
5010b8118m286K845N719M145n70J5200m217o90J3746j2458j1477J059J0273r203
4996a8032K768K9103P24k0161j2664J789r16J5931M712j234o43N226j4587j4303
4982b2287K113m069J4390J0312j0618k172q66Q866J473n07o163Q310L207o25j7038
4967a5674j6324J822R859j0499M740J0309P42M881J8927J2767O895j6066j8666
$$ plain form
4954 -6287 -7785 -289 12718 5571 -7429 -8106 -24224 -41013 -19852 -9175 -15181 -12287 6002
4941 6002 12681 16878 -623 11299 7400 -15829 -32038 -7322 8845 11603 10115 -4025 -17408
4928 -17408 -24275 -21594 -22671 -10882 2000 10915 20743 21344 30133 19487 8621 -1319 -12518 -17045
4914 -17045 -13430 -11567 3668 6876 -1047 10124 12496 6778 7438 12205 16396 15060 -6511 -13937
4900 -13937 -15354 -14918 -3610 13854 23687 17190 7324 -576 18446 17285 16027 9472 4508 6151
4886 6151 -1147 -8232 -3253 9169 21563 29317 30857 18793 12284 24225 6948 11245 17080 26449
4872 26449 30557 11935 -3785 -7755 -14399 -14547 -1444 -1548 8359 21111 4511 -5024 -1382 1155
4858 1155 3299 -3197 -20612 -16138 3055 14730 7517 1101 -7987 -13148 -8560 3070 18522 9723
$$ packed form
4954f287j498P496J3007p147j3000o77j6118j6789K1161J0677o006K894J8289
4941F002O679M197j7501J1922l899k3229j6209K4716J6167K758j488j4140j3383
4928a7408o867K681j077J1789J2882Q915R828O01Q789j0646j0866r940j1199m527
4914a7045L615J863J5235L208p923J1171K372n718O60M767M191j336k1571p426
4900a3937j417M36J1308J7464R833o497r866p900J9022j161j258o555m964J643
4886F151p298p085M979J2422J2394P754J540j2064o509J1941j7277M297N835R369
4872B6449M108j8622j5720l970o644j48J3103j04R907J2752j6600r535L642K537
4858A155K144o496j7415M474J9193J1675p213o416r088n161M588J1630J5452q799
$$ plain form
4844 9723 -9370 -11785 -5790 -12710 -12316 -221 -8496 -17149 -16919 -14247 -10593 -9737 -12670 -844 12970
4829 12970 9364 7291 -4510 -4879 4310 5960 1867 4556 10570 20922 17454 5052 -18807 -29870
4815 -29870 -15463 6196 15159 16394 23765 23116 8987 15532 4400 -2186 -18752 -25239 -17359 -12709
4801 -12709 -298 9448 10476 1633 648 24459 20487 -4766 -20247 -27197 -15902 -8437 -7533 -4700
4787 -4700 5295 -2155 -548 -1597 3384 -10186 -17038 -6282 -7146 -16866 -16907 -13072 -23491 -31537 -19586
4772 -19586 -10220 -14017 -18751 -24605 -13479 -5363 713 625 -7424 -9423 -8526 -14574 -16890 -17706 -7986
4757 -7986 -1411 9145 5569 15752 15539 15166 5458 -4564 -857 1188 -6217 -10763 -2971 -7330 -12454
4742 -12454 4376 9581 -293 -4193 -22 -6357 -17087 -16908 -9411 -24314 -31015 -28167 -24375 -23078
$$ packed form
4844I723j9093k415N995o920L94J2095q275q653K30K672L654Q56k933J1826J3814
4829A2970l606k073j1801l69R189J650m093K689O014J0352l468j2402k3859j1063
4815b9870J4407K1659Q963J235P371o49j4129O545j1132o586j6566o487P880M650
4801a2709J2411R746J028q843r85K3811l972k5253j5481o950J1295P465R04K833
4787d700R995p450J607j049M981j3570o852J0756q64r720m1L835j0419q046J1951
4772a9586R366l797m734n854J1126Q116O076q8q049j999Q97o048k316q16R720
4757g986O575J0556l576J0183k13l73r708j0022L707K045p405m546P792m359n124
4742a2454J6830N205r874l900M171o335j0730J79P497j4903o701K848L792J297
$$ plain form
4728 -23078 -12193 -17510 -14560 -4416 5339 -11309 -8893 116 7349 10785 21889 14776 8378 790
4714 790 -1945 -13937 -8089 6330 17117 7793 -8533 -11450 2568 5973 3697 8267 14298 9741
4700 9741 -2678 -10344 2064 13477 20326 5924 -9418 -7988 2065 -3672 -9137 12339 13722
4687 13722 23374 11365 7909 1803 4404 11459 -1507 8643 6999 13122 15207 15706 8501 -4426
4673 -4426 -7367 -2125 -9989 -12072 17023 39562 27644 5964 -20107 -23996 1205 -1062 -18586
4660 -18586 -37308 -36134 -20609 -17469 -11933 -23550 -30467 -35588 -18676 -21008 -30424 -36296 -21215
4647 -21215 -20868 -22757 -16809 -19690 -38380 -39100 -19387 -19118 -6596 -3217 -22274 -24901 -18801 -12357
4633 -12357 726 9848 14928 9779 1739 9293 8460 -10470 -14647 -14607 -12604 -18002 -24548 -24588 -22594
$$ packed form
4728b3078J0885n317K950J0144R755j6648K416R009P233L436J1104p113o398p588
4714G90k735j1992N848J4419J0787r324j6326k917J4018L405k276M570O031m557
4700I741j2419p666J2408J1413O849j4402j5342J430J0053n737n465K1476J383
4687A3722R652j2009l456o106K601P055j2966J0150j644O123K085M99p205j2927
4673d426k941N242p864k083K9095K2539j1918k1680k6071l889K5201k267j7524
4660a8586j8722J174J5525L140N536j1617o917n121J6912k332r416n872J5081
4647b1215L47j889N948k881j8690p20J9713K69J2522L379j9057k627O100O444
4633a2357J3083R122N080n149q040P554q33j8930m177M0K003n398o546m0J994
$$ plain form
4618 -22594 -18387 -28781 -19206 -14855 -14552 -1335 17014 -973 -21120 -16769 -19906 -24687 -29785 -18642
4604 -18642 -5625 -7885 -19790 -12156 -7462 6296 17093 14532 19758 12729 18661 8563 3646
4591 3646 5633 -3015 3151 1986 14831 -5576 -3348 10622 -770 -19896 -7728 14017 9970
4578 9970 8463 -8622 -7337 231 16142 17935 14383 3805 -4405 -7055 -2123 2814 12202 15545
4564 15545 8151 8209 15109 17505 33193 39831 25059 5172 -2604 -14406 -15993 -14005 -10402 -8151
4550 -8151 -6796 4428 7124 992 -1270 3996 4077 -9454 -6073 -8198 -14543 -21154 -26110 -47733 -54946
4535 -54946 -33869 -24067 -5231 -1327 2798 -5638 -10252 -11911 -5547 5679 2608 -6334 -6819 -2161
4521 -2161 -1892 6444 10973 5338 5115 12792 6256 -1798 -7198 7584 18528 19893 20665 18750 10514
$$ packed form
4618b2594M207j0394R575M351L03J3217J8349j7987k0147M351l137m781n098J1143
4604a8642J3017k260j1905P634M694J3758J0797k561N226p029N932j0098m917
4591C646J987q648O166j165J2845k0407K228J3970j1392j9126J2168K1745m047
4578I970j507j7085J285P568J5911J793l552j0578q210k650M932M937R388L343
4564A5545p394N8O900K396J5688O638j4772j9887p776j1802j587J988L603K251
4550h151J355J1224K696o132k262N266Q1j3531L381k125o345o611m956k1623p213
4535e4946K1077R802J8836L904M125q436m614j659O364J1226l071q942m85M658
4521b161K69Q336M529n635k23P677o536q054n400J4782J0944J365P72j915q236
$$ plain form
4506 10514 4689 -1033 4265 1911 10141 18412 9392 17079 33995 25783 15341 -4054 -22523 -31866
4492 -31866 -17024 -19647 -5322 3537 -7188 1635 17886 -217 -11724 845 -9921 -16653 -22206
4479 -22206 -22225 -9685 11688 7716 -1724 -17403 -15815 -22986 -25261 -15406 5461 499 -905 -4454
4465 -4454 12440 -1537 -13364 -15337 -14018 -2968 8767 -3201 -21595 -27101 -21107 -9247 -5143
4452 -5143 -13113 -3845 10609 -351 1178 -9039 -1997 -2511 -14365 -23414 -9920 1130 12225
4439 12225 24246 18010 14186 13503 -469 -8595 -5762 -4770 -5019 -2245 2612 -11123 -11363 -9500 -18171
4424 -18171 -14823 -13083 -20213 -5909 -346 -1704 -6272 -21534 -28226 -29992 -18080 -21101 -22917 -3005
4410 -3005 13104 13298 9845 6015 -9636 -20630 -17041 -19675 -17938 -6636 15856 11291 -11665 -5702
$$ packed form
4506A0514n825n722N298k354Q230Q271r020P687J6916q212j0442j9395j8469r343
4492c1866J4842k623J4325Q859j0725Q823J6251j8103j1507J2569j0766o732n553
4479b2206j9J2540K1373l972r440j5679J588p171k275R855K0867m962j404l549
4465d454J6894j3977j1827j973J319J1050J1735j1968j8394n506N994J1860M104
4452e143p970R268J4454j0960J529j0217P042n14j1854r049J3494J1050J1095
4439A2225J2021o236l824o83j3972q126K833R92k49K774M857j3735k40J863q671
4424a8171L348J740p130J4304N563j358m568j5262o692j766J1912l021j816J9912
4410c005J6109J94l453l830j5651j0994L589k634J737J1302K2492m565k2956N963
$$ plain form
4396 -5702 -9956 -5211 2417 8699 11131 3971 -2826 -21789 -19166 -7093 -3048 -8805 255 6831
4382 6831 1976 -12099 -13304 8902 18131 -2361 -7500 -8962 -4024 -10218 1634 -3209 -7624 -4802
4368 -4802 790 -9087 -6388 15070 22373 25757 19194 5727 5559 2830 4179 7226 5035 12306 9839
4353 9839 5004 4776 13324 19054 10690 8759 12949 12971 24074 24545 -1177 -254 -3850 -3450 4116 6581
4337 6581 -126 -7798 -979 -2810 -12460 4776 16007 25033 35242 34840 22113 10571 -8956 -7345
4323 -7345 -9317 -12120 5006 13737 12313 8739 26608 27543 16698 1742 8254 9552 -6485 -9057
4309 -9057 -10591 -12743 -1667 -9637 -4972 -2823 9966 9941 -1578 1698 9595 12340 12327 17028 22378
4294 22378 26310 15221 9451 10550 10887 -7435 -10890 -1767 10453 8581 10724 19327 10373 3852
$$ packed form
4396e702m254M745P628O282K432p160o797j8963K623J2073M045n757R060O576
4382F831m855j4075j205K2206R229k0492n139j462M938o194J1852m843m415K822
4368d802N592r877K699K1458P303L384o563j3467j68k729J349L047k191P271k467
4353I839m835k28Q548N730q364j931M190K2J1103M71k5722R23l596M00P566K465
4337F581o707p672O819j831r650J7236J1231R026J0209m02j2727j1542j9527J611
4323g345j972k803J7126Q731j424l574J7869R35j0845j4956O512J298j6037k572
4309i057j534k152J1076p970M665K149J2789k5j1519L276P897K745j3M701N350
4294B2378L932j1089n770J099L37j8322l455R123J2220j872K143Q603q954o521
$$ plain form
4280 3852 6067 12947 21105 19817 21250 18657 24931 24085 9920 27753 28777 20810 13370 -3596
4266 -3596 5310 21610 14499 10258 2492 -1847 7260 2363 -18057 -32913 -17237 -10556 -4184 18208
4252 18208 21310 11203 6801 6712 9871 17172 6524 -8498 5486 14155 10607 10297 6950 -2178
4238 -2178 -6754 -1155 2423 3654 15199 6441 1485 -576 682 5415 -5621 -13601 -5371 -4253
4224 -4253 -11274 -3469 4438 15804 7126 -5819 -9823 1687 -1930 -8327 3157 -7130 -7511 -1687
4210 -1687 6819 19006 33719 29941 5421 -3887 -10321 -13553 -2960 6438 -186 13404 14747 11610
4196 11610 11848 7427 3991 -432 6044 7609 4891 683 -5036 -9776 -6207 -17841 -19337 -7751
4182 -7751 8588 4028 -12414 7503 22661 29117 42798 31431 14629 15176 18175 13023 11676
$$ packed form
4280C852K215O880Q158j288J433k593O274q46j4165J7833J024p967p440j6966
4266c596Q906J6300p111m241p766m339R107m897k0420j4856J5676O681O372K2392
4252A8208L102j0107m402q9L159P301j0648j5022J3984Q669l548l10l347r128
4238b178m576N599L578J231J1545q758m956k061J258M733j1036p980Q230J118
4224d253p021P805P907J1366q678j2945m004J1510l617o397J1484j0287l81N824
4210a687Q506J2187J4713l778k4520r308o434l232J0593R398o624J3590J343l137
4196A1610K38m421l436m423O476J565k718m208n719m740L569j1634j496J1586
4182g751J6339m560j6442J9917J5158O456J3681j1367j6802N47K999n152j347
$$ plain form
4169 11676 8927 4801 -4967 -2732 5206 15387 11167 11617 16886 26634 31748 39400 39347 23632 9727
4154 9727 -4348 -353 4138 -6964 -8538 1529 6253 8401 3137 5290 7182 -1522 -1544 -8327 -16447
4139 -16447 -15058 -10236 4377 11216 5747 721 5387 -4826 -5854 -7787 -2036 7608 19347 23837
4125 23837 25135 24702 31559 28455 31707 12709 5799 10630 13154 18986 6354 420 -17 -8129 -14433
4110 -14433 -2008 2693 -5660 -17957 -17462 -4800 -981 -1060 4552 -4496 -5832 -11521 -19747 -11080 -4963
4095 -4963 -14461 -14859 -1338 15618 8622 4940 4402 2599 -1163 -1414 268 -12010 -14309 -2552 4561
4080 4561 1319 -11841 -10411 -12022 -12857 -11617 -5286 -17371 -18636 -4484 9116 11617 12111 8275
4066 8275 436 4063 15050 8072 9315 338 -1354 6203 2932 -4710 1725 4374 1596 11532 8608
$$ packed form
4169A1676k749m126r768K235P938J0181m220M50N269R748N114P652n3j5715j3905
4154I727j4075L995M491j1102j574J0067M724K148n264K153J892q704k2o783q120
4139a6447J389M822J4613O839n469n026M666j0213j028j933N751R644J1739M490
4125B3837J298m33O857l104L252j8998o910M831K524N832j2632n934m37q112o304
4110a4433J2425M701q353j2297M95J2662L819p9N612r048j336n689q226Q667O117
4095d963r498l98J3521J6956o996l682n38j803l762k51J682j2278k299J1757P113
4080D561l242j3160J430j611q35J240O331j2085j265J4152J3600K501M94l836
4066H275p839L627J0987o978J243q977j692P557l271p642O435K649k778R936k924
$$ plain form
4051 8608 -5675 -23284 -19639 -11159 -11640 -11458 -23114 -19919 -10138 -3992 -12958 1365 7902 -5895
4037 -5895 -14353 -6630 -3521 1219 13683 7108 3528 8534 -3780 -8097 3904 94 5649 4851
4023 4851 -4248 -18892 -21963 -20942 -11628 1851 23923 17482 -4487 -3096 2759 1956 -8835 -14947
4009 -14947 -14270 -12676 -14957 -17470 -8424 9017 14484 3246 2514 91 6869 -7618 -12668 -4554
3995 -4554 6236 12804 13802 20845 21329 23049 24309 29068 24153 10709 -9654 2666 14585 18315
3981 18315 19985 12122 1897 -12155 -1771 8612 14457 1487 -4216 698 7321 11493 13590
3968 13590 4819 808 -8652 -4965 4707 14074 13421 5304 10464 16719 20336 19981 14493 15971 23991
3953 23991 19293 12725 8159 6515 10314 8391 -4419 -1174 -3173 2870 1786 -5015 -10652 -4099
$$ packed form
4051H608j4283j7609L645Q480m81J82j1656L195R781O146q966J4323O537j3797
4037e895q458P723L109M740J2464o575l580N006j2314m317J2001l810N555p98
4023D851r099j4644l071J021R314J3479K2072o441k1969J391N855q03j0791o112
4009a4947O77J594k281k513R046J7441N467j1238p32k423O778j4487n050Q114
3995d554J0790O568R98P043M84J720J260M759m915j3444k0363J2320J1919L730
3981A8315J670p863j0225j4052J0384J0383N845j2970n703M914O623M172K097
3968A3590q771m011r460L687R672R367o53q117N160O255L617l55n488J478Q020
3953B3991m698o568m566j644L799j923j2810L245j999O043j084o801n637O553
$$ plain form
3939 -4099 15605 12101 627 -13566 -1327 15702 10683 8600 21813 27900 36997 29526 20434
3926 20434 2977 3969 6407 -2033 15744 21963 4373 10524 21571 20094 13638 8089 1661 -6103
3912 -6103 -2266 -700 719 2789 -8854 -15590 -20433 -26979 -18453 -12462 -7349 -14266 -26265 -21415
3898 -21415 -10409 -3946 -11964 -13871 -13887 -7920 -14112 -6144 -10175 -12161 -309 -7983 -18719 -11765
3884 -11765 -3737 -5500 -3117 -6739 4595 7887 6805 9057 11724 18730 1832 -12212 -28492 -9345
3870 -9345 660 -2023 -7682 5681 12123 -10424 -22257 -23423 -14282 -547 4686 8437 8482 11527
3856 11527 9409 -4620 -6708 -4362 2231 10161 20481 11906 -6717 -22589 -23553 -17160 -6952 1307
3842 1307 -3654 -12252 -15717 -5523 6978 11657 6551 -5667 -10454 3556 3217 -11928 -10801 -20981
$$ packed form
3939d099J9704l504j1474j4193J2239J7029n019k083J3213O087R097p471r092
3926B0434j7457R92K438q440J7777O219j7590O151J1047j477o456n549o428p764
3912f103L837J566J419K070j1643o736m843o546Q526N991N113o917j1999M850
3898b1415J1006O463q018j907j6N967o192P968m031j986J1852p674j0736O954
3884a1765Q028j763K383l622J1334L292j082K252K667P006j6898j4044j6280J9147
3870i345J0005k683n659J3363O442k2547j1833j166R141J3735N233L751M5L045
3856A1527k118j4029k088K346O593P930J0320q575j8623j5872r64O393J0208Q259
3842A307m961q598l465J0194J2501M679n106j2218m787J4010l39j5145J127j0180
$$ plain form
3828 -20981 -21049 -8066 16848 29876 24905 14694 234 -645 -12080 -2744 11742 2705 -2319 877
3814 877 5559 2273 3542 -2830 -791 12109 7008 5697 11438 5156 -6467 -8909 -7695 938 1963
3799 1963 6417 7741 15117 22460 26610 28413 24266 -1161 3041 8906 11081 6560 1644 5998 9675
3784 9675 -1488 -7894 -2885 -4038 -1828 -5606 -13553 -15338 -9504 -6343 -6211 -7595 -11176 -4816 -8149
3769 -8149 -5802 -3459 9425 20090 20452 3747 -9667 -13899 -4726 -5087 -16374 -22397 -22889 -16647
3755 -16647 -14405 -13208 -16081 -10222 -8747 -5075 -10881 -11046 -2717 10426 19437 25827 22318 3850
3741 3850 -6429 -3175 7128 10337 10074 13143 9907 9888 13782 5782 17565 28834 18480 14702
3727 14702 19092 15989 21959 20923 25022 11359 10635 15892 2045 -12026 -19491 -20814 -11705 7961
$$ packed form
3828b0981o8J2983K4914J3028m971j0211j4460q79j1435R336J4486r037n024L196
3814H77M682l286J269o372K039J2900n101j311N741o282j1623k442J214Q633J025
3799A963M454J324P376P343M150J803m147k5427M202N865K175m521m916M354L677
3784I675j1163o406N009j153K210l778p947j785N834L161J32j384l581O360l333
3769h149K347K343J2884J0665L62j6705j3414m232R173l61j1287o023m92O242
3755a6647K242J197k873N859J475L672n806j65Q329J3143R011O390l509j8468
3741C850j0279L254J0303L209k63L069l236j9L894q000J1783J1269j0354l778
3727A4702M390l103N970j036M099j3663p24N257j3847j4071p465j323R109J9666
$$ plain form
3713 7961 13035 1385 4480 11320 18844 14945 9509 9631 14722 9365 8038 -3060 -9117 -13536 -10988
3698 -10988 15952 10795 -2184 -3100 4700 -2339 -7815 -3000 12728 15369 13586 9650 -4725 -5292
3684 -5292 -4377 -10638 -14421 -11911 -7312 -1578 -2909 -11843 -5378 2694 -258 -14435 -21860 -14656 -2306
3669 -2306 -379 6966 10147 6336 4494 12917 10519 -12023 -26423 -22019 -20277 -11942 10645 11130
3655 11130 -909 -9265 -22418 -13154 12730 12448 12731 -112 -12930 -28600 -34507 -30723 -22540 -23744
3641 -23744 -24483 -22250 -18533 -9933 -9400 -3997 6913 -5012 -16679 -10552 -7736 -7929 2816 6140
3627 6140 2041 -4792 -12028 -34741 -41511 -14041 -3455 -7612 -5886 -10057 -4616 4904 -743 -8034
3613 -8034 -6651 -4765 11192 25738 33838 21930 1549 -11242 -4637 -5214 -6462 -2191 -4434 -18513
$$ packed form
3713G961N074j1650L095O840P524l899n436J22N091n357j327j1098o057m419K548
3698a0988K6940n157j2979r16P800p039n476M815J5728K641j783l936j4375n67
3684e292R15o261l783K510M599N734j331q934O465Q072k952j4177p425P204J2350
3669b306J927P345L181l811j842Q423k398k2542j4400M404J742Q335K2587M85
3655A1130j2039q356j3153R264K5884k82K83j2843j2818j5670n907L784Q183j204
3641b3744p39K233L717Q600N33N403J0910j1925j1667O127K816j93J0745L324
3627F140m099o833p236k2713o770K7470J0586m157J726m171N441R520n647p291
3613h034J383J886J5957J4546Q100j1908k0381j2791O605n77j248M271k243j4079
$$ plain form
3599 -18513 -19626 -22998 -44130 -40190 -15817 -9635 -3534 18325 27985 27860 31102 26728 11480 7338
3585 7338 9824 8973 9361 10303 22248 16770 8212 -6812 -13544 2384 -2688 6061 13210 17899 8559
3570 8559 -8414 -10736 -4149 -7388 -7579 -10103 -9676 6726 20632 30004 35302 13180 5367 2101
3556 2101 9110 8114 12428 12414 9255 -5255 -15673 -12454 -6283 -5633 -14864 -25009 -11131 5309 7925
3541 7925 5637 3007 1525 -1159 5730 3874 -18700 -21651 -15677 -17761 -4203 -3294 870 -9228
3527 -9228 -16528 -17613 -19356 -16964 -7715 -6702 -12041 -18477 -12753 -16939 -25087 -18330 -9824 -597 1587
3512 1587 7788 -12527 -33193 -34471 -19934 -5636 -2919 -11343 -13187 -6048 12999 9407 -6894
3499 -6894 -4564 9549 3798 10818 -12835 -26366 -21980 -15319 1108 -7015 -14096 -18420 -12239 -1608
$$ packed form
3599a8513j113l372k1132L940K4373O182O101K1859R660j25L242m374j5248m142
3585G338K486q51L88R42J1945n478q558j5024o732J5928n072Q749P149M689r340
3570H559j6973k322O587l239j91k524M27J6402J3906R372N298k2122p813l266
3556B101P009r96M314j4l159j4510j0418L219O171O50r231j0145J3878J6440K616
3541G925k288k630j482k684O889j856k2574k951N974k084J3558R09M164j0098
3527i228p300j085j743K392R249J013n339o436N724m186q148O757Q506R227K184
3512A587O201k0315k0666j278J4537J4298K717q424j844P139J9047l592j6301
3499f894K330J4113n751P020k3653j3531M386O661J6427q123p081m324O181J0631
$$ plain form
3485 -1608 403 -860 1237 8334 421 3062 13224 24113 25321 23816 8041 -12657 -21184 -8861
3471 -8861 3556 16747 29108 24200 5344 17504 19783 18659 16108 6700 -1222 -3118 -8386 -13021
3457 -13021 -4400 12247 17679 9408 2305 3468 7343 -8116 -16028 -9558 -12922 -29207 -28943 -18467
3443 -18467 -3234 -3296 770 1669 3117 -9193 -2780 7716 18699 31608 29457 23162 7445 -11583
3429 -11583 -19761 -12120 -1746 10255 23835 19992 17393 9826 1584 7150 16626 4653 -22328
3416 -22328 -24734 -13594 7263 4305 1907 7611 4079 20905 28990 32312 9285 246 8509 1913
3402 1913 -7126 -940 -603 -8961 -7839 -11778 -13800 -11312 2370 -1380 -6186 2084 -10782 -25753
3388 -25753 -34881 -44668 -38354 -27517 -12626 -111 -9657 -7675 956 10283 2029 -16519 -20473 -11561
$$ packed form
3485a608K011j263K097P097p913K641J0162J0889J208j505j5775k0698q527J2323
3471h861J2417J3191J2361m908j8856J2160K279j124k551r408p922j896n268m635
3457a3021Q621J6647N432q271p103J163L875j5459p912O470l364j6285K64J0476
3443a8467J5233o2M066Q99J448j2310O413J0496J0983J2909k151o295j5717j9028
3429a1583q178P641J0374J2001J3580l843k599p567q242N566R476j1973k6981
3416b2328k406J1140K0857k958k398N704l532J6826Q085L322k3027r039Q263o596
3402A913r039O186L37q358J122l939k022K488J3682l750m806Q270j2866j4971
3388b5753r128r787O314J0837J4891J2515r546J982Q631R327q254j8548l954Q912
$$ plain form
3374 -11561 772 -9426 -26828 -20038 6941 17137 1407 8716 11943 19361 23927 20640 8122
3361 8122 1416 983 -1398 -10695 -8725 1513 -3158 -19423 -12933 -11421 -13390 -6240 -6395 -10394 -10425
3346 -10425 -12884 -9460 -3483 -9218 -799 1994 -1932 8414 2762 -18499 -12727 -15533 -19770 -12322
3332 -12322 -6788 -7645 -5748 -10539 -23521 -16280 -13255 -17855 -16484 -17717 -12502 -7051 -13033 -11255 -21848
3317 -21848 -20384 -12768 -15958 -21726 -15003 -7080 -22127 -36111 -33629 -14191 2217 -417 4180 -897
3303 -897 -563 -5194 -10357 -4 -5287 -7206 3183 6633 -1209 -10680 -9061 3329 2356 -4549 -16752
3288 -16752 -24483 -13483 -9621 -13115 -12600 -3017 -4953 1330 5967 -3520 -11606 -13969 -10834 -1161 9386
3273 9386 -4190 -3084 4945 3849 15398 24315 34689 24136 19798 25760 17153 5642 11760 8214
$$ packed form
3374a1561J2333j0198j7402O790K6979J0196j5730P309L227P418M566l287j2518
3361H122o706m33k381r297J970J0238m671j6265O490J512j969P150j55l999l1
3346a0425k459L424N977n735Q419K793l926J0346n652k1261N772k806m237P448
3332a2322N534q57J897m791j2982P241L025m600J371j233N215N451n982J778j0593
3317b1848J464P616l190n768O723P923j5047j3984K482J9438J6408k634M597n077
3303h97L34m631n163J0353n283j919J0389L450p842r471J619J2390r73o905j2203
3288a6752p731J1000L862l494N15R583j936O283M637r487q086k363L135R673J0547
3273I386j3576J106Q029j096J1549Q917J0374j0553m338N962q607j1511O118l546
$$ plain form
3259 8214 4925 -4841 -2937 348 4456 6756 21724 28577 24280 18665 12192 1853 -3070 -12208
3245 -12208 -17231 -20592 -2039 -3829 -4970 -348 8328 -8681 -17593 -12403 -18304 -10171 8591 6607
3231 6607 5864 -313 2083 15429 3816 -3321 -13693 -12374 -1816 -3949 -13311 -10700 -15492 -12615
3217 -12615 -8857 -1893 -14928 -19460 -6719 2768 -1665 -13504 -8669 -16277 -26761 -19511 -1941
3204 -1941 4988 -514 -2454 2871 -6092 -6264 5757 8981 17422 12746 16274 31840 43610 20730
3190 20730 -2363 -14266 -13765 -9862 -14788 -26732 -14776 -2153 -5942 -13345 -7747 6791 20527
3177 20527 28663 30906 30623 20273 28262 37795 26088 12964 13123 -2055 -4449 -5386 -5328 -3619 3879
3162 3879 15154 2640 2975 19953 23284 18100 17768 9815 -10803 -32213 -15370 2575 9912 4596
$$ packed form
3259H214l289r766J904L285M108K300J4968O853m297n615o473j0339m923r138
3245a2208n023l361J8553j790j141M622Q676j7009q912N190n901Q133J8762j984
3231F607p43o177K396J3346j1613p137j0372J319J0558k133r362K611m792K877
3217a2615L758O964j3035m532J2741R487m433j1839M835p608j0484P250J7570
3204a941O929n502j940N325q963j72J2021L224Q441m676L528J5566J1770k2880
3190B0730k3093j1903N01L903m926j1944J1956J2623l789p403N598J4538J3736
3177B0527Q136K243k83j0350P989R533j1707j3124J59j5178k394r37N8J709P498
3162C879J1275j2514L35J6978L331n184l32p953k0618k1410J6843J7945P337n316
$$ plain form
3148 4596 5893 16813 9401 6155 15973 24810 15714 7026 19551 26204 28439 33812 27380 13473
3134 13473 899 -15020 -9412 -16926 -11903 1175 16750 12661 16928 30584 19593 3749 7022
3121 7022 566 1902 5656 19850 24261 23459 20674 22319 22813 13493 7111 5495 1176 -7519 -3391
3106 -3391 5656 18790 7946 -1444 826 201 -3466 -9150 1173 21463 27566 7019 -9966 -12430
3092 -12430 -15677 -18874 -13918 -25393 -17006 -7997 -7063 -8061 -11179 1854 22077 19891 16576 19860
3078 19860 31311 21773 15596 7301 686 -11655 -9735 11391 27180 23084 4702 -8899 -5377
3065 -5377 -4876 -4180 -4462 -13164 -11157 -2981 2048 5331 18972 8279 572 -915 9896 12234 -10328
3050 -10328 -14825 -9777 -1682 441 1539 13676 12567 9241 8359 5715 4045 685 -13575 -6137
$$ packed form
3148D596J297J0920p412l246R818Q837r096q688J2525O653K235N373o432j3907
3134A3473j2574j5919N608p514N023J3078J5575m089M267J3656j0991j5844L273
3121G022o456J336L754J4194M411q02k785J645M94r320o382j616m319q695M128
3106c391R047J3134j0844r390K270o25l667n684J0323K0290O103k0547j6985k464
3092a2430l247l197M956j1475Q387R009R34r98l118J3033K0223k186l315L284
3078A9860J1451r538o177q295o615j2341J920K1126J5789m096j8382j3601L522
3065e377N01O96k82q702K007Q176N029L283J3641j0693p707j487J0811K338k2562
3050a0328m497N048Q095K123J098J2137j109l326q82k644j670l360j4260P438
$$ plain form
3036 -6137 1646 -1224 -263 -10758 -7815 194 10143 9069 5385 1544 -17457 -21247 -13114 5090
3022 5090 24936 20664 9155 18901 25825 19180 -333 -10258 148 3533 13819 594 -14716
3009 -14716 -14459 -18232 -13064 -9157 -7473 -4974 8202 5742 -20296 -25950 -3250 22074 13587 2094
2995 2094 15643 20912 19782 22180 27007 20146 27530 23302 13434 2049 289 7470 21306 32269
2981 32269 26770 12285 4946 -9599 -9471 -6264 -8936 -9756 756 5132 8386 1170 -10956 -4073
2967 -4073 10840 20714 21743 4492 -9591 -11833 -13709 -4406 -6103 -23157 -18370 -5929 3287 -1151
2953 -1151 381 14231 17641 14679 -1322 -12852 -8519 -3231 18416 24899 3783 -17168 -28726
2940 -28726 -24316 -14800 -1902 11933 25271 26573 17842 -3763 -21851 -13604 1590 -5320 -7334
$$ packed form
3036f137P783k870R61j0495K943Q009R949j074l684l841j9001l790Q133J8204
3022E090J9846m272j1509R746O924o645j9513r925J0406L385J0286j3225j5310
3009a4716K57l773N168L907J684K499J3176k460k6038n654K2700K5324q487j1493
2995B094J3549N269j130K398M827o861P384m228r868j1385j760P181J3836J0963
2981C2269n499j4485p339j4545J28L207k672q20J0512M376L254p216j2126O883
2967d073J4913R874J029j7251j4083k242j876R303j697j7054M787J2441R216m438
2953a151J532J3850L410k962j6001j1530M333N288K1647O483k1116k0951j1558
2940b8726M410R516J2898J3835J3338J302q731k1605j8088Q247J5194o910k014
$$ plain form
2927 -7334 -3653 -3256 -1041 8218 2371 -874 15518 19312 446 -12190 -1582 9329 3882 -15510
2913 -15510 -12996 -3001 -9511 -13536 -15419 -21552 -21109 -9061 -7948 -6467 555 697 2396 7132 4443
2898 4443 8547 -7597 -11781 6365 18142 1327 -4583 -5640 -7965 -3671 -10570 -6874 15434 6504
2884 6504 -8293 902 11064 -65 -9013 3436 3407 2874 3414 -15395 -13805 -12093 -7322 -1082 -5693
2869 -5693 8526 32247 22095 3789 1423 6798 24716 28584 27294 7246 -4587 2365 -14074
2856 -14074 -5640 28655 23122 16045 7845 1765 -9940 4141 2557 11440 3657 8409 4557 -1995
2842 -1995 -5219 -24661 -24438 -17888 -15484 -12712 -4898 -2376 -1519 -2412 9514 14060 20337 15471 17232
2827 17232 28976 12011 -9863 -26348 -18083 -1275 2550 16341 18423 6132 4916 6490 11564
$$ packed form
2927g334L681L97K215R259n847l245J6392L794j8866j2636J0608J0911n447j9392
2913a5510K514R995o510m025j883o133M43J2048J113J481P022J42J699M736k689
2898D443M104j6144m184J8146J1777j6815n910j057k325M294o899L696K2308q930
2884F504j4797R195J0162j1129q948J2449k9n33N40j8809J590J712M771O240m611
2869e693J4219K3721j0152j8306k366N375J7918L868j290k0048j1833O952j6439
2856a4074Q434L4295n533p077q200o080j1705J4081j584Q883p783M752l852o552
2842a995l224j9442K23O550K404K772P814K522Q57q93J1926M546O277m866J761
2827A7232J1744j6965k1874j6485Q265J6808L825J3791K082j2291j216J574N074
$$ plain form
2814 11564 5661 1032 8633 9782 2947 1103 3747 12360 16009 11532 1349 9578 26950 35758
2800 35758 40554 39678 21971 5459 7377 5459 -8735 -9649 4911 10229 13633 5451 11274 10283
2786 10283 15 -9399 -18770 -14820 -16202 -16896 -14300 -10838 -4490 -2097 -2219 4122 11780 14513 15020
2771 15020 8301 -1762 -4277 -7428 -13387 -13743 -19601 -29688 -25854 -18965 -15660 -14823 -17134 -12345 -13267
2756 -13267 -15372 -9379 -8567 1633 2903 -9757 -1444 8782 -8229 -16990 -19027 -197 2342 9377
2742 9377 5740 -947 12342 3748 -7025 -11750 1172 -3253 -441 7006 -1149 -9273 -8846 -2924
2728 -2924 -4848 -6993 -10073 -17904 -22681 -20489 7396 24959 16660 12825 9462 8513 10153 -8940
2714 -8940 -6038 15124 18746 4226 8182 9077 -1565 -3076 833 8358 26036 19947 14756 9496
$$ packed form
2814A1564n903m629P601J149o835j844K644Q613L649m477j0183Q229J7372Q808
2800C5758M796q76j7707j6512J918j918j4194r14J4560N318L404q182N823r91
2786A0283j0268r414r371L950j382o94K596L462O348K393j22O341P658K733N07
2771A5020o719j0063k515l151n959l56n858j0087L834O889L305Q37k311M789r22
2756a3267k105N993Q12J0200J270j2660Q313J0226j7011q761k037J8830K539P035
2742I377l637o687J3289q594j0773m725J2922m425K812P447q155q124M27N922
2728b924j924k145l080p831m777K192K7885J7563q299l835l363r49J640j9093
2714h940K902K1162L622j4520L956Q95j0642j511L909P525J7678o089n191n260
$$ plain form
2700 9496 8091 16695 15413 13765 10328 -9285 -7116 -17008 -25548 -18800 -17066 -23119 -15248 -7206 -21398
2685 -21398 -19968 -13653 -15619 -19338 -28502 -20221 -12651 -6029 -16424 -16825 -203 -1416 1231 -1624
2671 -1624 4348 2394 7088 15068 23979 14947 9110 -4401 -2202 8759 10328 14301 3632 -2828
2657 -2828 -132 1279 10885 18203 6452 719 -5418 -8755 -19894 -12373 -2189 -508 8861 20899
2643 20899 7127 -1753 5395 17544 11269 4847 7340 -5330 -18440 -17824 -21668 -9769 6355
2630 6355 -5819 -10662 -14928 -24414 -36893 -32933 -26484 -15661 6383 3153 -5990 -2401 15563 28028
2616 28028 19674 -14870 -31081 -44612 -40420 -22803 -21276 -21730 -6896 -476 619 14298 -1200
2603 -1200 -18367 53 9949 1363 -16564 -12522 -6805 4115 1592 -1599 877 -3623 -7099 1581
$$ packed form
2700I496j405Q604j282j648l437j9613K169r892q540O748J734o053P871Q042j4192
2685b1398J430O315j966l719r164Q281P570O622j0395m01J6622j213K647k855
2671a624N972j954M694P980Q911r032n837j3511K199J0961J569L973j0669o460
2657b828K696J411R606P318j1751n733o137l337j1139P521J0184J681R369J2038
2643B0899j3772q880P148J2149o275o422K493j2670j3110O16l844J1899J6124
2630F355j2174m843m266r486j2479L960O449J0823K2044l230r143L589J7964J2465
2616B8028q354l4544j6211j3531M192J7617J527m54J4834O420J095J3679j5498
2603a200j7167J8420R896q586j7927M042N717J0920k523l191K476m500l476Q680
$$ plain form
2589 1581 14716 12311 -1733 -8723 -16356 -11703 -15954 -19343 -15953 -25389 -17601 -8022 -836 -7477
2575 -7477 -10197 -2960 4607 14930 24228 16200 15240 3126 -18808 -29042 -13353 -16315 -26269 -29119
2561 -29119 -35066 -15782 4181 9976 -4722 -1244 22445 20533 13488 8292 -1683 -1487 8033 17167
2547 17167 5139 -5576 -6834 5269 2373 2373 8684 7218 970 749 10233 6958 2190 8367 13656
2532 13656 6355 10584 -405 -13386 -16131 -6536 7525 -5236 1474 9429 1695 -14302 -10930
2519 -10930 -6476 2092 10390 3038 -15890 -26620 -16726 -3021 8604 -3842 -6246 -26197 -24353
2506 -24353 -16105 -10409 -5867 -1899 4996 801 -3685 -17317 -5624 7866 6178 -1138 7232 15922
2492 15922 14287 527 -3681 12709 22813 22528 21095 32563 26000 9681 -10673 -20091 -15643
$$ packed form
2589A581J3135k405j4044o990p633M653m251l389L390r436P788R579P186o641
2575g477k720P237P567J0323R298q028r60j2114k1934j0234J5689k962r954k850
2561b9119n947J9284J9963N795j4698L478K3689j912p045n196r975J96R520R134
2547A7167j2028j0715j258J2103k896%O311j466o248k21R484l275m768O177N289
2532A3656p301M229j0989j2981k745R595J4061j2761O710P955p734j5997L372
2519a0930M454Q568Q298p352j8928j0730R894J3705J1625j2446k404j9951J844
2506b4353Q248N696M542L968O895m195m486j3632J1693J3490j688p316Q370Q690
2492A5922j635j3760m208J6390J0104k85j433J1468o563j6319k0354r418M448
$$ plain form
2479 -15643 -4389 -1770 -7968 -3902 -12489 -7651 -1839 -1506 -3222 -5264 -17501 -12542 -11409 -7159
2465 -7159 -742 5871 3618 -1626 316 1366 6249 11805 16156 18528 11590 8893 1870 -16936 -32892
2450 -32892 -30104 -18855 -11219 -8647 -10633 -18845 -24920 -6923 8693 25487 20383 9115 6199
2437 6199 -12694 -11650 -5143 -13898 -18287 -13709 -18509 -12577 -663 4740 -1033 9077 10247 6410
2423 6410 4190 8608 18996 31073 39242 27319 20774 16442 16906 9856 -4993 -18209 -5245 -7938
2409 -7938 -9657 -16588 -10115 -7980 -12058 -10846 568 2449 13963 26513 37096 18313 9487 7021
2395 7021 11270 2258 -1740 17645 22206 19416 12437 13211 10054 -9908 -19647 -10365 -2873 9533
2381 9533 20763 17545 -6856 -9895 -13022 1905 7398 12931 19519 3835 1038 9084 10804 16197
$$ packed form
2479a5643J1254K619o198M066q587M838N812L33j716k042j2237M959J133M250
2465g159O417O613k253n244J942J050M883N556M351K372o938k697p023j8806j5956
2450c2892K788J1249P636K572j986q212o075J7997J5616J6794n104j1268k916
2437F199j8893J044O507q755m389M578m800N932J1914N403n773J0110J170l837
2423F410k220M418J0388J2077Q169j1923o545m332M64p050j4849j3216J2964k693
2409g938j719o931O473K135m078J212J1414J881J1514J2550J0583j8783q826k466
2395G021M249r012l998J9385M561k790o979P74l157j9962r739R282P492J2406
2381I533J1230l218k4401l039l127J4927N493N533O588j5684k797Q046J720N393
$$ plain form
2367 16197 14012 10865 -2668 5072 23903 36059 35337 25333 9588 -7901 -20317 -17928 -8884
2354 -8884 -9292 -2386 13208 7045 5033 3326 6360 1909 12828 19059 7611 -6178 -12982 -14050
2340 -14050 -7644 -10343 -15944 -19895 -36465 -32793 -6132 -11084 -13040 -16205 -6051 16872 22480 18056
2326 18056 16620 19162 27120 21448 23679 16541 6259 3971 -5883 554 -962 -1718 3051 14262
2312 14262 16396 -6279 -21056 -16254 -24180 -23607 -7310 -9466 -8613 -22 18774 20940 7903 22148
2298 22148 26650 20935 15140 10646 9598 4117 -8397 4225 3971 4958 4072 5139 16890 27186
2284 27186 24534 18349 27273 12680 9198 -1258 -5645 14222 27190 24985 15495 3676 -62
2271 -62 -5502 -20995 -20422 -22348 -10624 -11992 700 30182 44462 30415 8481 198 -3187 -9353
$$ packed form
2367A6197k185l147j3533P740J8831J2156p22j0004j5745j7489j2416K389R044
2354h884m08O906J5594o163k012j707L034m451J0919O231j1448j3789o804j068
2340a4050O406k699n601l951j6570L672K6661m952j956l165J0154K2923N608m424
2326A8056j436K542P958n672K231p138j0282k288r854O437j516p56M769J1211
2312A4262K134k2675j4777M802p926N73J6297k156Q53Q591J8796K166j3037J4245
2298B2148M502n715n795m494j048n481j2514J2622k54R87q86J067J1751J0296
2284B7186k652o185Q924j4593l482j0456m387J9867J2968k205r490j1819l738
2271f2n440j5493N73j926J1724j368J2692K9482J4280j4047k1934q283l385o166
$$ plain form
2257 -9353 -16637 -12121 -10584 -16540 -10655 4156 3345 8235 9468 12808 5934 7647 12576 11717 8025
2242 8025 11144 22452 22205 8965 -521 -2401 -8964 -22304 -21389 -3531 4409 16595 15995 5870
2228 5870 660 -2419 1480 10409 13161 24629 20264 9904 3474 -7172 -4888 -15774 -13916 1793
2214 1793 7309 2178 2075 7597 8453 8131 9644 10244 7680 3985 4375 -891 266 13708 6644 3014
2198 3014 2134 711 -9969 -2966 593 1111 -12693 -9637 -1135 -15620 -26946 -25376 -13298 -17060
2184 -17060 -40341 -44536 -11989 -1195 9228 15644 15347 14130 10692 -2531 -4849 -3506 -3584 1532
2170 1532 2272 245 2590 13203 7136 -4291 -14110 -2490 14291 6732 -5633 -12894 -7111 -17314
2156 -17314 -13475 -9709 -7758 -9306 -15597 -3730 21283 20480 12556 1004 12506 20498 8223 -953
$$ packed form
2257i353p284M516J537n956N885J4811q11M890J233L340o874J713M929q59l692
2242H025L119J1308k47j3240r486j880o563j3340R15J7858P940J2186o00j0125
2228E870n210l079L899Q929K752J1468m365j0360o430j0646K284j0886J858J5709
2214A793N516n131j03N522Q56l22J513O00k564l695L90n266J157J3442p064l630
2198C014q80j423j0680P003L559N18j3804L056Q502j4485j1326J570J2078l762
2184a7060k3281m195L2547J0794J0423O416k97j217l438j3223k318J343p8N116
2170A532P40k027K345J0613o067j1427r819J1620J6781p559j2365p261N783j0203
2156a7314L839L766J951j548o291J1867K5013q03p924j1552J1502P992j2275r176
$$ plain form
2142 -953 -2817 -8834 -13833 -3790 5258 8375 7831 -1431 -1028 -8585 -19257 -10680 -663 -6632 -10971
$$ packed form
2142i53j864o017m999J0043R048L117n44r262M03p557j0672Q577J0017n969m339
$$ [...]
##END NTUPLES=NMR SPECTRUM
##END=
