##TITLE=Analysis number 315962
Compound Code cc 47846
Book Reference 458/64
Project Code qc-cat
Chemist Name stevem
##JCAMPDX= 6.0         $$ Bruker NMR JCAMP-DX V2.0
##DATA TYPE= NMR SPECTRUM
##DATA CLASS= NTUPLES
##ORIGIN= Bruker BioSpin GmbH
##OWNER= NMR
$$ XWIN-NMR		Version 3.5
$$ Fri Dec  9 13:20:59 2005 GMT Standard Time (UT+0h)  MAYBRIDGE\NMR@NMR_250MHZ
##.OBSERVE FREQUENCY= 250.131544655141
##.OBSERVE NUCLEUS= ^1H
##.ACQUISITION MODE= SIMULTANEOUS (DQD)
##.ACQUISITION SCHEME= undefined
##.AVERAGES= 16
##.DIGITISER RES= 18
##SPECTROMETER/DATA SYSTEM= dpx250
##.PULSE SEQUENCE= zg30
##.SOLVENT NAME= CDCl3
##.SHIFT REFERENCE= (INTERNAL, CDCl3, 0, 16.522)
##AUDIT TRAIL= $$ (NUMBER, WHEN, WHO, WHERE, WHAT)
$$ ##TITLE= Audit trail, XWIN-NMR		Version 3.5
$$ ##JCAMPDX= 5.01
$$ ##ORIGIN= Bruker BioSpin GmbH
$$ ##OWNER= NMR
$$ C:\u/data/dgb/nmr/ADRS/13730/pdata/1/auditp.txt
$$ ##AUDIT TRAIL=  $$ (NUMBER, WHEN, WHO, WHERE, WHAT)
(   1,<2005-12-09 13:20:38.24 +000>,<MAYBRIDGE\NMR>,<NMR_250MHZ>,
      <created by zg, POWCHK disabled, PULCHK disabled
       configuration hash MD5:
       62 19 C7 07 E1 42 D1 B7 37 6C 3D D0 77 39 F9 E6
       data hash MD5: 64K
       BF 4B 5B 5F DD 58 26 B9 49 29 F9 D4 84 B2 31 46>)
(   2,<2005-12-09 13:20:49.84 +000>,<MAYBRIDGE\NMR>,<NMR_250MHZ>,
      <Start of raw data processing
       ef LB = 0.3 FT_mod = 6 PKNL = 1 SI = 32K 
       data hash MD5: 32K
       9D 89 33 41 FF F1 1F F2 06 31 0F 8D D5 7D 2A 72>)
(   3,<2005-12-09 13:20:51.67 +000>,<MAYBRIDGE\NMR>,<NMR_250MHZ>,
      <apk 
       data hash MD5: 32K
       D2 72 E7 C0 B3 7F BD 8A 06 B9 0B D0 A1 A6 B9 49>)
(   4,<2005-12-09 13:20:52.45 +000>,<MAYBRIDGE\NMR>,<NMR_250MHZ>,
      <abs ABSG = 5 
       data hash MD5: 32K
       CB 7A 91 C9 01 02 B3 38 A4 DC 8D B7 34 FE 58 E6>)
$$ ##END=
$$ 
$$ hash MD5
$$ 09 ED 2A 48 98 D3 AF 20 33 94 97 64 F6 99 3F C3
##$RELAX= 
##$RELAX= 
##$RELAX= 
##$RELAX= 
##$RELAX= 
##$RELAX= 
##$RELAX= 
$$ Bruker specific parameters
$$ --------------------------
##$DU= <C:\u>
##$EXPNO= 13730
##$NAME= <ADRS>
##$PROCNO= 1
##$TYPE= <nmr>
##$USER= <dgb>
##$AMP= (0..31)
100 100 100 100 100 100 100 100 100 100 100 100 100 100 100 100 100 100 
100 100 100 100 100 100 100 100 100 100 100 100 100 100 
##$AQSEQ= 0
##$AQ_mod= 3
##$AUNM= <au_zg>
##$AUTOPOS= <22 >
##$BF1= 250.13
##$BF2= 250.13
##$BF3= 250.13
##$BF4= 250.13
##$BF5= 500.13
##$BF6= 500.13
##$BF7= 500.13
##$BF8= 500.13
##$BYTORDA= 1
##$CFDGTYP= 0
##$CFRGTYP= 5
##$CHEMSTR= <none>
##$CNST= (0..31)
1 1 145 1 1 1 1 1 1 1 1 1 1 1 1 1 1 1 1 1 1 1 1 1 1 1 1 1 1 1 1 1 
##$CPDPRG= <>
##$CPDPRG1= <>
##$CPDPRG2= <>
##$CPDPRG3= <>
##$CPDPRG4= <mlev>
##$CPDPRG5= <mlev>
##$CPDPRG6= <mlev>
##$CPDPRG7= <mlev>
##$CPDPRG8= <mlev>
##$CPDPRGB= <>
##$CPDPRGT= <>
##$D= (0..31)
0 1 0 0 0 0 0 0 0 0.06 0 0 0 0 0 0 0.0002 0 0 0 0 0 0 0 0 0 0 0 0 0 0 
0 
##$DATE= 1134134437
##$DBL= (0..7)
120 120 120 120 120 120 120 120 
##$DBP= (0..7)
150 150 150 150 150 150 150 150 
##$DBP07= 0
##$DBPNAM0= <>
##$DBPNAM1= <>
$$ [...]
##$SUBNAM7= <"">
##$SUBNAM8= <"">
##$SUBNAM9= <"">
##$SW= 20.6930455092707
##$SWIBOX= (0..15)
0 0 3 0 0 0 0 0 0 0 0 0 0 0 0 0 
##$SW_h= 5175.983436853
##$TD= 65536
##$TD0= 1
##$TE= 294.16
##$TE2= 300
##$TE3= 300
##$TEG= 300
##$TL= (0..7)
0 120 120 120 120 120 120 120 
##$TP= (0..7)
150 150 150 150 150 150 150 150 
##$TP07= 0
##$TPNAME0= <>
##$TPNAME1= <>
##$TPNAME2= <>
##$TPNAME3= <>
##$TPNAME4= <>
##$TPNAME5= <>
##$TPNAME6= <>
##$TPNAME7= <>
##$TPOAL= (0..7)
0.5 0.5 0.5 0.5 0.5 0.5 0.5 0.5 
##$TPOFFS= (0..7)
0 0 0 0 0 0 0 0 
##$TUNHIN= 0
##$TUNHOUT= 0
##$TUNXOUT= 0
##$USERA1= <user>
##$USERA2= <user>
##$USERA3= <user>
##$USERA4= <user>
##$USERA5= <user>
##$V9= 5
##$VALIST= <valist>
##$VCLIST= <CCCCCCCCCCCCCCC>
##$VD= 0
##$VDLIST= <DDDDDDDDDDDDDDD>
##$VPLIST= <PPPPPPPPPPPPPPP>
##$VTLIST= <TTTTTTTTTTTTTTT>
##$WBST= 1024
##$WBSW= 4
##$XGAIN= (0..3)
0 0 0 0 
##$XL= 0
##$YL= 0
##$YMAX_a= 581908
##$YMIN_a= -462286
##$ZGOPTNS= <>
##$ZL1= 120
##$ZL2= 120
##$ZL3= 120
##$ZL4= 120
##$ABSF1= 16.522
##$ABSF2= -4.171173
##$ABSG= 5
##$ABSL= 3
##$ALPHA= 0
##$AQORDER= 0
##$ASSFAC= 0
##$ASSFACI= 0
##$ASSFACX= 0
##$ASSWID= 0
##$AUNMP= <proc_1d>
##$AZFE= 0.1
##$AZFW= 0.1
##$BCFW= 0
##$BC_mod= 0
##$BYTORDP= 0
##$COROFFS= 0
##$CY= 12.5
##$DATMOD= 1
##$DC= 0
##$DFILT= <>
##$DTYPP= 0
##$F1P= 14.0000005364418
##$F2P= -0.99999901652339
##$FCOR= 0.5
##$FTSIZE= 32768
##$FT_mod= 6
##$GAMMA= 0
##$GB= 0
##$INTBC= 1
##$INTSCL= 1
##$ISEN= 128
##$LB= 0.3
##$LEV0= 0
##$LPBIN= 0
##$MAXI= 10000
##$MC2= 0
##$MEAN= 0
##$ME_mod= 0
##$MI= 0
##$NCOEF= 0
##$NC_proc= -3
##$NLEV= 6
##$NOISF1= 0
##$NOISF2= 0
##$NSP= 0
##$NTH_PI= 0
##$NZP= 0
##$OFFSET= 16.522
##$PC= 1
##$PHC0= 78.99169
##$PHC1= 9.741424
##$PH_mod= 1
##$PKNL= yes
##$PPARMOD= 0
##$PSCAL= 4
##$PSIGN= 0
##$REVERSE= no
##$SF= 250.13
##$SI= 32768
##$SIGF1= 0
##$SIGF2= 0
##$SINO= 400
##$SIOLD= 32768
##$SREGLST= <1H.CDCl3>
##$SSB= 0
##$STSI= 32768
##$STSR= 0
##$SW_p= 5175.98343685301
##$SYMM= 0
##$S_DEV= 0
##$TDeff= 65536
##$TDoff= 0
##$TI= <Analysis number 999999
Compound Code 99
Book Reference 9
Project Code 9>
##$TILT= no
##$TM1= 0
##$TM2= 0
##$TOPLEV= 0
##$USERP1= <user>
##$USERP2= <user>
##$USERP3= <user>
##$USERP4= <user>
##$USERP5= <user>
##$WDW= 1
##$XDIM= 32768
##$YMAX_p= 346970141
##$YMIN_p= -77765
$$ End of Bruker specific parameters
$$ ---------------------------------
##NTUPLES= NMR SPECTRUM
##VAR_NAME=  FREQUENCY,     SPECTRUM/REAL,   SPECTRUM/IMAG
##SYMBOL=    X,             R,               I
##VAR_TYPE=  INDEPENDENT,   DEPENDENT,       DEPENDENT
##VAR_FORM=  AFFN,          ASDF,            ASDF
##VAR_DIM=   32768,         32768,           32768
##UNITS=     HZ,            ARBITRARY UNITS, ARBITRARY UNITS
##FACTOR=    0.157963299565203, 1,           1
##FIRST=     4132.6476996994, 0,             0
##LAST=      -1043.33573715361, 0,           0
##MIN=       -1043.33573715361, -77765,      0
##MAX=       4132.6476996994, 346970141,     0
$$ Real data points
##PAGE= N=1
##DATA TABLE= (X++(R..R)), XYDATA
$$ [...]
16418I321702r52976j015265q33564o77032o34419n69001m50906l69439l10235
$$ 9321702 8368726 7353461 6519897 5842865 5208446 4639445 4188539 3819100 3508865
16409C508865k71064j68766o7350L1512R5077j83124l08384k38355k22722k77843
$$ 3508865 3237801 3069035 3001685 3033197 3128274 2945150 2636766 2398411 2175689 1897846
16399A897846k68085k05220j52457j20760q8017o7147l7350l1883m8420n0986
$$ 1897846 1629761 1424541 1272084 1151324 1063307 996160 958810 926927 878507 827521
16389H27521n8860o0622n6672n2155n1839m5896m2691j2955k5224j6151l900k2294
$$ 827521 768661 708039 651367 599212 547373 501477 458786 445831 420607 404456 400556 378262
16377C78262l8941k0151j4893j2673O792m381l7447j9152j4669r690K377j8224
$$ 378262 339321 319170 304277 291604 298396 294015 256568 237416 222747 213057 215434 197210
16365A97210K807j2477l0298k0431q962o553k258Q134Q497k0132k7646j4659j6517
$$ 197210 200017 187540 157242 136811 127849 121296 119038 127172 135669 115537 87891 73232 56715
16352E6715k0236j054l992Q599K3799j0968l1099j4903K2193J0063l7733k0205
$$ 56715 36479 35425 31433 40032 63831 52863 21764 6861 29054 39117 1384 -18821
16340a8821J417O005J9436J0470N348J430P610r17O138J5931j1912l1929R269
$$ -18821 -17404 -11399 8037 18507 23855 25285 32895 31978 38116 54047 42135 10206 19475
16327A9475J4517J447o110J6423R319k7920l3772n351J5073J8149k593j1879n352
$$ 19475 33992 35439 29329 45752 55071 27151 -6621 -11972 3101 21250 18657 6778 1426
16314A426j827J777L108m379K170K2090K5403K2465k8147m6907k121L4564M350
$$ 1426 -401 1376 4484 105 2275 24365 49768 72233 44086 -2821 -4942 29622 33972
16301C3972j2380n787k2085j4360N7j1510L004k718P710J176k535M080j640P678
$$ 33972 21592 15805 -6280 -20640 -20583 -32093 -29089 -31807 -24097 -22921 -25456 -21376 -23016 -15338
16287a5338K3050L2883q016q987J7207L2228J1176n2019k0216J822J378Q3K2536
$$ -15338 7712 40595 32579 23592 40799 73027 84203 32184 11968 13790 15168 15251 37787
16274C7787j0137j5403K3594j6218r230q660l979K51j0585J65J0908N015Q078
$$ 37787 27650 12247 35841 19623 10393 1733 -2246 -1995 -12580 -12415 -1507 3508 11586
16261A1586J2170j0486r108m923j0309R85j2889j3830l978j0101q072L3210N214
$$ 11586 23756 13270 4162 -761 -11070 -10085 -22974 -36804 -40782 -50883 -58955 -25745 -20531
16248b0531J0490N839k744J7296O114k3350m4265p131J1275J2521J078Q147P566
$$ -20531 -10041 -4202 -6946 10350 16464 -6886 -51151 -58282 -47007 -34486 -33408 -25261 -17695
16235a7695p613r380J6375J6305Q377K82l512J500j3461l6048k961M778J3760
$$ -17695 -25308 -34688 -18313 -2008 6369 6651 3139 4639 -8822 -44870 -47831 -43053 -29293
16222b9293o128k2480P399K1531K907q14P43K222j0471K0777J9774j0895M922
$$ -29293 -35421 -57901 -50502 -28971 -26064 -26878 -26135 -23913 -34384 -13607 6167 -4728 194
16209A94Q205K6480n97O72L677k445n374O196l186l3722j2975j884K0331J6148
$$ 194 8399 34879 34282 34954 38631 36186 30812 37008 33822 100 -12875 -14759 5572 21720
16195B1720r788k741j2901O733K117J778K209m277J608j4280k1632Q402L3713
$$ 21720 11932 9191 -3710 3023 5140 6918 9127 4850 6458 -7822 -29454 -21052 12661
16182A2661L602r257L56R147j1616k8560M604J7738J1569j0684K17j8242k945
$$ 12661 16263 7006 7362 16509 4893 -23667 -19063 -1325 10244 -440 -223 -18465 -21410
16169b1410J3289K2160l8p965m847j7384k185r846J4696J1418j2793p152j2144
$$ -21410 -8121 14039 14001 6036 1189 -16195 -18380 -28226 -13530 -2112 -14905 -22057 -34201
16156c4201R40r350j7279J6641K9380R423m594J502J2047j3325l535o469j3239
$$ -34201 -33261 -42611 -59890 -43249 -13869 -4446 -9040 -7538 4509 -8816 -12351 -18820 -32059
16143c2059J5830R798J6277J8775j7521j9679k0132j2279l49j1173r61j2404l283
$$ -32059 -16229 -6431 9846 28621 11100 -8579 -28711 -40990 -41339 -52512 -53473 -65877 -69160
16130f9160J2700J9561J6172j5703j2181J8461K140P109J3591P15j5615l93J9136
$$ -69160 -56460 -36899 -20727 -36430 -48611 -30150 -28010 -20901 -7310 -6595 -22210 -22603 -3467
16117c467j3215p297L085J8131J0395K535J610l968j4880N59K995R894m864o24
$$ -3467 -16682 -23979 -20894 -2763 7632 10167 11777 7809 -7071 -6512 -3517 6377 1513 889
16103H89K393q612k546J0386N132o802j1574J5199q800q082o077J8198k999q340
$$ 889 3282 -5330 -7876 2510 7642 840 -10734 4465 -4335 -12417 -18494 -296 -3295 -11635
16089a1635K1992R615k1130j8191j9362l747K7139K5708K1896k9629k2057J519
$$ -11635 10357 19972 -1158 -19349 -38711 -42458 -15319 10389 32285 2656 -19401 -17882
16077a7882O344k455J1505j4900j0763O037J5596j7118j4119J5201M333k81n611
$$ -17882 -11538 -13993 -2488 -17388 -28151 -22114 -6518 -23636 -37755 -22554 -18221 -18502 -24113
16064b4113O134J1068R395L761q393j045q937n255P472J5167K3100q270l2935
$$ -24113 -17979 -6911 2484 6245 -2148 -3193 -12130 -17385 -9913 5254 28354 20084 -12851
16051a2851k444k5279p394M421J9803K0547n010j0418k547M83M280m239P181J6134
$$ -12851 -15295 -40574 -47968 -43547 -23744 -3197 -8207 -18625 -21172 -20689 -16409 -20648 -13467 2667
16037B667Q127J920O959N420M931K373J1063N811j5026j6258q86Q234p17l77j5897
$$ 2667 10794 12714 19673 25093 30024 32397 43460 49271 34245 17987 17101 25335 24618 24241 8344
16022H344j340O639m9m00n86q801M015L827j8406k339r261j8282O290J6222J5540
$$ 8344 7004 13643 13594 13194 12608 3807 7822 11649 -6757 -9096 -18357 -36639 -30349 -14127 1413
16007A413n08o140k6047Q854m941M548m769n579N337K2448j919o906j2176L794
$$ 1413 905 -5235 -31282 -22428 -27369 -22821 -27590 -33169 -27832 -5384 -7303 -14209 -26385 -22591
15993b2591j2572R025K5349n062j8790p37M01K6453K3667l198j0288M507o640
$$ -22591 -35163 -26138 -789 -5851 -24641 -25378 -24977 1476 25143 21945 11657 16164 9524
15980I524k6982j0382k395J4333J9280O031j0231q52J4962O146M966k188o306
$$ 9524 -17458 -27840 -30235 -15902 3378 9409 -822 -1674 13288 19434 24400 22212 15906
15967A5906j7286o044n314m812O623p281J3859J4597K2800Q794k3971p256j2366
$$ 15906 -1380 -7424 -12738 -17550 -10927 -18208 -4349 10248 33048 41842 17871 10615 -1751
15954a751j8714j4299k2542J1904P879K0121K5092R951m102k067j223n325p951
$$ -1751 -20465 -34764 -57306 -45402 -37523 -17402 7690 17641 13539 11472 10249 4924 -3027
15941c027k3156n011n05j388P91J7308J5238j2737P972j7520Q194J3386j0241
$$ -3027 -26183 -31194 -31699 -33087 -32296 -14988 250 -12487 -4515 -22035 -13841 -455 -10696
15928a0696j1470K725j111M202o546M494k769P165K4331L457M435k2082k9592
$$ -10696 -22166 -19441 -20552 -16350 -22896 -18402 -21171 -14006 10325 13782 18217 -3865 -33457
15915c3457j7448K0172K2679P622j6477O199k242j3292q831K93l412l67N441K0127
$$ -33457 -50905 -30733 -8054 -432 -16909 -10710 -12952 -26244 -35075 -34782 -38194 -38561 -33120 -12993
15901a2993J9807j9201k4585j832q097L554J4055J5006J3914K256j1880q918o285
$$ -12993 6814 -12387 -36972 -38804 -46901 -43347 -29292 -14286 -372 1884 -9996 -18914 -25199
15888b5199O526r993j821J3427K1483K866K223j477j2657r82n751M003J5843n045
$$ -25199 -18673 -28666 -30487 -17060 4423 7289 9512 8035 -4622 -5604 -11355 -7352 8491 3446
15874C446o548j245p326n262M86j3695j2620J5404O203P81r44l452n202J0068
$$ 3446 -3102 -4347 -11673 -16935 -16449 -30144 -42764 -27360 -21157 -20376 -21320 -24772 -29974 -19906
15860a9906J1761j5067M272J881M846J7328M788j708p217N272J2510J1678L896
$$ -19906 -8145 -23212 -18940 -17059 -12213 5115 9903 8195 978 6250 18760 30438 34334
15847C4334J2227J1914j558m460K1253K6128K9663M6736P7346J05041K47416K44313
$$ 34334 46561 58475 56917 52457 73710 99838 129501 176237 253583 358624 606040 850353
15835H50353L1505j04707r1654j01349j50358j48291r4543n2923l4034k0368r154
$$ 850353 881858 777151 685497 584148 433790 285499 190956 138033 103999 83631 74477
15824G4477j6876j4630j010J465j0548m089j282j1791j6301m64J1413J6873K3029
$$ 74477 57601 42971 41961 43426 32878 28789 27507 15716 -585 -1049 10364 27237 50266
15811E0266j2711j2621j5877j5294j4178n681j330J3165J9001J2254k0102j008
$$ 50266 37555 24934 9057 -6237 -20415 -26096 -27426 -14261 4740 16994 -3108 -4116
15799d116j62K795p853m694J6594O095O47o888k1921j3784j071J4879J1515Q590
$$ -4116 -4278 -1483 -9336 -14030 2564 8659 9306 2418 -19503 -33287 -34358 -19479 -7964 626
15785F26j0902j6302J727J0758j571J8875K320p294J1654k213k0963j153P178
$$ 626 -10276 -26578 -24851 -14093 -15664 3211 5531 -1763 9891 7678 -13285 -14438 -7260
15772g260O453j067N822l882p941l660J0082M070J3151j5139J683R11k174k4361
$$ -7260 -807 -1874 3948 66 -7875 -11535 -1453 2617 15768 629 2312 3223 1049 -23312
15758b3312O285Q543L536m725K797O521p564r405o953n129J0243m314J842P929
$$ -23312 -17027 -8484 -4948 -9673 -6876 -355 -7919 -17324 -24277 -29406 -19163 -23477 -21635 -13706
15744a3706J6686k318j3118q760m310J6129j0208J815J0983j8537M681J0610l259
$$ -13706 2980 662 -12456 -21216 -25526 -9397 -19605 -17790 -6807 -25344 -20663 -10053 -13312
15731a3312n702Q598J0434j5827k7510K421k646L529J6633k532j3941J13j3899
$$ -13312 -19014 -10416 18 -15809 -43319 -40898 -43544 -40015 -23382 -25914 -39855 -39742 -53641
15718e3641j931Q650Q784P986L007L897R109p460j0162m745J1595K9462k0971
$$ -53641 -55572 -46922 -38138 -30152 -27145 -23248 -14139 -21599 -31761 -36506 -24911 4551 -16420
15705a6420j0721q63O604N956r133J380N752K2204N11R77r06R316j073k9720L965
$$ -16420 -27141 -28004 -21400 -15444 -24577 -23197 -17445 4759 5270 6247 5341 14657 13584 -16136 -12171
15690a2171O709l748l0145j0553J7410J9762L225J206O585m68o751q505N649M532
$$ -12171 -5462 -9210 -39355 -49908 -32498 -12736 -9511 -8305 -1720 -2188 -8939 -17444 -11795 -7263
15676g263n834L9k807L132J1411J0456L329r032k458L280N978J8490p872R008
$$ -7263 -13097 -13058 -15865 -12733 -1322 9134 12463 3431 973 4253 10231 28721 20849 29857
15662B9857j0942k1690j6955k203K864J501J5493J5537K546o24k849o2l984j5890
$$ 29857 18915 -2775 -19730 -21933 -19069 -17568 -2075 13462 16008 15384 12535 12473 8489 -7401
15648g401r111j086R730K42o025R671J0855K514K156j0764n264M942r359N154
$$ -7401 -16512 -17598 -7868 -7626 -13651 -3980 6875 9389 11545 781 -4483 459 -8900 -3746
15634c746o97Q599P539j2165n232n193J6193m542J3793L849r670j7989o825N323
$$ -3746 -4443 4156 11695 -470 -5702 -10895 5298 756 14549 18398 8728 -9261 -16086 -10763
15620a0763Q413o747r733q882J9018P408l435L566L153K1910p401j9782l0065
$$ -10763 -2350 -9097 -18830 -27712 -8694 -1286 -4721 -1155 1998 23908 16507 -3275 -33340
15607c3340m178L0366L657R101J548j3584N574m940j1670p791K5007l911p57N919
$$ -33340 -37518 -7152 -3495 5606 7154 -6430 -856 -5796 -17466 -25257 -250 -4161 -4918 1001
15593A001J459Q48j3723j9518k0524J3294K2069J6898k203o799k327J4233M027
$$ 1001 2460 3308 -10415 -29933 -50457 -37163 -15094 1804 -399 -7198 -9525 4708 8735
15580H735j0985k7905n066M099J1200Q005J966n092O603J8408N580j5418o667
$$ 8735 -2250 -30155 -35221 -31122 -19922 -11917 -9951 -15043 -8440 9968 15548 130 -6537
15567f537K138J518O815j3274Q679J5052o881J696K301r584J2613o741k971J499
$$ -6537 -4399 -2881 3934 -9340 -661 14391 7510 9206 11507 1923 14536 7795 4824 6323
15553F323j3190K986J6296r345j9868J1239l751o372l652N640O731P005J05k0579
$$ 6323 -6867 -3881 12415 3070 -16798 -5559 -9310 -15682 -19334 -13694 -6963 42 147 -20432
15539b0432o666J9541j3097l281J4716N952J6362n704k191P761k099j8050r659
$$ -20432 -27098 -7557 -20654 -23935 -9219 -3267 13095 7391 5200 12961 10862 -7188 -16847
15526a6847J227k1766k42J1835J3180K2820q308Q88J092j470p260J0659q162l790
$$ -16847 -15620 -37386 -37628 -25793 -12613 10207 1899 2787 3879 2409 -4851 5808 -2354 -6144
15512f144q301P337J7070J1662j5225J3322J3926k170M745j1798k0051j2790n716
$$ -6144 -14445 -7108 9962 21624 6399 19721 33647 31477 36222 24424 4373 -8417 -14133
15499a4133k030J545L643R441J7039J617k2152j3209O238o764J85J9979p338q884
$$ -14133 -16163 -14618 -10975 -1534 15505 17122 -5030 -18239 -12001 -18765 -18580 1399 -5939 -14823
15485a4823l835k3859j0779R201K6540J0835n375O59J3819r93k8521m24J5332
$$ -14823 -18658 -42517 -53296 -44095 -17555 -6720 -12095 -11436 2383 1390 -27131 -27555 -12223
15472a2223Q500j1741k0075o211k2372J7223K3299J8714J0109P135k1460k0054
$$ -12223 -3723 -15464 -35539 -41750 -64122 -46899 -23600 -4886 5223 12358 -9102 -29156
15460b9156R256J1991k499j2172n824j7866J8649K7972Q380r768K389o708l100
$$ -29156 -19900 -7909 -10408 -22580 -28404 -46270 -27621 351 8731 -1037 1352 -5356 -8456
15447h456k304J5819K7408J4476j8317j0120M327j6783q407n496j2734j1582j2086
$$ -8456 -10760 5059 32467 46943 28626 18506 22833 6050 -2357 -7853 -20587 -32169 -44255
15434d4255n47K1643R404j4120J3170K1164m846k4321l990J2414J1334n324m836
$$ -44255 -44802 -23159 -13755 -27875 -14705 6459 1613 -22708 -26698 -14284 -2950 -8274 -13110
15421a3110p579J0250Q867O919j26n050n172j849n701j3570j6254J7134K6063
$$ -13110 -20689 -10439 -1572 5347 5221 171 -5001 -6850 -12551 -26121 -42375 -25241 822
15408H22m297K569J8394K3313j5999p829O271L512n338j1279j6611K60m926j5573
$$ 822 -3475 -906 17488 40801 24802 16973 23244 26756 21418 10139 -6472 -6212 -11138 -26711
15394b6711J901p549K3312L0209p63j1781j0640j5535Q982J0947p090J1236j2750
$$ -26711 -24810 -32359 -9047 21162 20399 8618 -2022 -17557 -8575 2372 -4718 6518 -6232
15381f232q735m939J1415K0659O270j1341J4463K145j9302L430m495k1417J0635
$$ -6232 -14967 -19906 -8491 12168 18438 7097 21560 23705 4403 7833 3338 -18079 -7444
15368g444M292J2298l804j8881O762N055j7863r097M973K3712O193N362L45K005
$$ -7444 -3152 9146 5342 -13539 -6777 -1722 -19585 -28682 -23709 3 6196 11558 11903 13908
15354A3908j1362j031J3859k75l2129o105J062N329j2631l856L7691L3504m866
$$ 13908 2546 1515 15374 15099 -17030 -23135 -22073 -16744 -29375 -33231 4460 37964 33098
15341C3098l711k9617j4441Q633J1670R072N032n921j1129p139m090J6046L344
$$ 33098 29387 -230 -14671 -6038 5632 14704 19736 13815 2686 -4453 -8543 7503 10847
15328A0847p743m729j6175J8356l527j731r259j153j1677o622J1113J0033R022
$$ 10847 3104 -1625 -17800 556 -2971 -4702 -13961 -15114 -26791 -33413 -22300 -12267 -3245
15315c245j3662j1276J7605J7050M191k9909p985J6237K0591K2210J6789o304
$$ -3245 -16907 -28183 -10578 6472 10663 -19246 -27231 -10994 9597 31807 48596 42292
15303D2292k1871j7539o528r781J370l163J4040M309n18J901m824j6445J8854
$$ 42292 20421 2882 -3646 -13427 -12057 -15220 -1180 3129 2611 4512 -312 -16757 2097
15290B097P733q119j3595j0937O855J8906k0254j3860J0769K1009J4312K385l867
$$ 2097 9830 1711 -11884 -22821 -15966 2940 -17314 -31174 -20405 604 14916 17301 13434
15277A3434J2855m993j3425k1214j5429M048L90N955L465Q776R9m388J1399j933
$$ 13434 26289 21296 7871 -13343 -28772 -24724 -24334 -18379 -14914 -6138 -6039 -10427 972 -961
15263i61j5118J9441O437J6171k3363j9620R688r284j7951K805J006j465P462
$$ -961 -16079 3362 9799 25970 2607 -17013 -7325 -16609 -34560 -31755 -30749 -32214 -24752
15250b4752K5699m468k1062k085R883j9619k7375J2920J3627P024o274l237J4181
$$ -24752 947 -3521 -24583 -26668 -16785 -36404 -63779 -50859 -37232 -30208 -36482 -39719 -25538
15237b5538K4433l088j531O090p606r483n673P690j1775j1347K928J4851J796
$$ -25538 -1105 -4193 -5724 366 -7240 -16723 -22396 -14706 -26481 -37828 -34900 -20049 -18253
15224a8253R783J0796m674J430R749J3142l566q731k672n31J5081P636Q212r257
$$ -18253 -8470 2326 -2348 -918 8831 21973 18407 9676 7004 6473 21554 29190 37402 28145
15210B8145k461O114q38p774j5947q659k15p561k7129q743J3791R995J0776P539
$$ 28145 25684 31798 30960 23186 7239 -1420 -1635 -9196 -36325 -45068 -31277 -21282 -10506 -2967
15196b967J785o085J784k457P487M50J1794m502J743K319k78J1027p534j0095
$$ -2967 -1182 -7267 -5483 -7940 -453 -3 11791 7289 9032 11351 11073 22100 14566 4471
15182D471O382J0969j0356O335n234o047l182P674k682K009J011j8979l664J0933
$$ 4471 10853 21822 11466 17801 12567 6520 3338 11012 8330 10339 11350 -7629 -11293 -360
15168c60K569r778j2542m51P297J1730J4769q470l948O204m771q543J1017j0145
$$ -360 2209 -7569 -20111 -20562 -13265 -1535 13234 4764 816 7020 2249 -6294 4723 -5422
15154e422P681n944K9114l738l842l286J88j3176N238J0081P037R485j5159k2558
$$ -5422 2259 -3685 25429 21691 17849 14563 14751 1575 6813 16894 23931 33416 18257 -4301
15140d301J133K235l904Q75k801N279j189o252P85O147j1079j190J6352O514j180
$$ -4301 -3168 -933 -4837 -3962 -6763 -1484 -2673 -8925 -8140 -1993 -13072 -14262 2090 8604 7424
15125G424K2177j9498j7549J1172j1058l244J5556R609N060O669j802j4621j0774
$$ 7424 29601 10103 -7446 3726 -7332 -10576 4980 14589 19649 26318 24516 9895 -879
15112h79j2418O500L013j5477k410J155m644Q065m609J8014J0505k0986j1193
$$ -879 -13297 -6797 -3784 -19261 -21671 -20516 -25160 -17095 -21704 -3690 6815 -14171 -25364
15099b5364J0096m103k266J3153p704M374J8152m562K790n783J4213n480m748
$$ -25364 -15268 -19371 -21637 -8484 -16188 -11814 6338 1776 4566 -1217 12996 7516 2768
15086B768j1487r263j4507M768K079K988J4798M921J7134n830o554j8265m146
$$ 2768 -8719 -17982 -32489 -27721 -25642 -22654 -7856 -2935 14199 8369 1815 -16450 -20596
15073b0596m664r642J08j4549J4196K0151J1148p266p006l558j4606r267O177
$$ -20596 -25260 -34902 -34794 -49343 -35147 -14996 -3848 -11114 -18120 -21678 -36284 -45551 -39374
15060c9374n694n693J4926J7162J4921K0523J3723j1093l688R888j0620k0750
$$ -39374 -45068 -50761 -35835 -18673 -3752 16771 30494 19401 15713 25601 14981 -5769
15048e769n620K9046j1629o119K541N831q955P485J0785j3383k5036r062m8o425
$$ -5769 -11389 17657 6028 -91 2450 8281 -674 6811 17596 4213 -20823 -29885 -29933 -36358
15034c6358M1641J6845k4931j4572J0969j1348m121J1275K215j8175o630P863
$$ -36358 5283 22128 -2803 -17375 -6406 -17754 -21875 -10600 -8385 -26560 -33190 -25327
15022b5327j832j1849J3837L312M586M0174J780r753J273p674j8428Q86J3007
$$ -25327 -27159 -39008 -25171 -21859 -17273 22901 24681 14928 16201 8527 -9901 -9015 3992
15009C992P008j6841n53M822o282j468K2760k140r668K2391K1507j6321k0887
$$ 3992 11000 -5841 -6394 -1572 -7854 -9322 13438 11298 1630 24021 45528 29207 8320
14996H320j6661M584l973j282J2677m728P693J4260M607m538p522j8315L686J2197
$$ 8320 -8341 -3757 -7730 -9012 3665 -1063 6630 20890 25497 20959 13437 -4878 -1192 11005
14982A1005o545k6636J273n368P1K270N872R720r529j1478J0793J4326k210N505
$$ 11005 4460 -22176 -20903 -26271 -26200 -23930 -18058 -8338 -17867 -29345 -18552 -4226 -6436 -931
14968i31K153j1928p990n64K5339J0493L035j674o28j2169k1156q268O670K1390
$$ -931 1222 -10706 -18696 -19260 6079 16572 19607 17933 17305 5136 -16020 -24288 -17618 3772
14954C772J1525K689l190o67P507J3372K3279Q715k9652k5966k6767j4890O137
$$ 3772 15297 17986 14796 14129 21636 35008 58287 67002 37350 11384 -15383 -30273 -24136
14941b4136J5708J2947j1715j0286j792J5884j862K718K2396M095j8138M495P87
$$ -24136 -8428 4519 -7196 -17482 -19274 -3390 -5252 -2534 19862 23957 5819 10314 11101
14928A1101J3022k968k7191j793o792k5518J3475J6879M46J167Q165Q593k0165
$$ 11101 24123 21155 -6036 -7829 -14621 -40139 -26664 -9785 -9339 -8172 -7 8586 -11579
14915a1579j8327m297n863r980m933n051K9811J9394J6786N371q769k258n227
$$ -11579 -29906 -34203 -40066 -50046 -54979 -60030 -30219 -10825 5961 11332 2563 305 -4922
14902d922j0949P39L351l383J86k175k962n266P829J6350K978P543k091j4382
$$ -4922 -15871 -15132 -11781 -15164 -14978 -17153 -20115 -25381 -17552 -1202 1776 9319 7228 -7154
14888g154p171K388m421r772n049l2372O618J6412J4241l71L045K2263o026J421
$$ -7154 -14325 -11937 -16358 -26130 -31179 -63551 -56933 -40521 -26280 -26651 -23606 -1343 -7369 -5948
14874e948O011J2564P021J5172M615p275k2642j4379m999j4718j889m545N476
$$ -5948 63 12627 19648 34820 39435 32160 9518 -4861 -9860 -24578 -26467 -31012 -25536
14861b5536J0857N861N832Q338m934m952j3912l3096O191J5844Q375J3814M034
$$ -25536 -14679 -8818 -2986 5352 418 -4534 -18446 -51542 -45351 -29507 -21132 -7318 -3284
14848c284P898j2373j0207L412l112J4292j216r97K304m359L1686j4898k2190
$$ -3284 4614 -7759 -17966 -14554 -17666 -3374 -4590 -5587 -3283 -7642 24044 9146 -13044
14835a3044q885K033K8257l379j384j2277J9650O553k358r011K9644o479j5467
$$ -13044 -21929 -19896 8361 4982 3598 -8679 10971 17524 15166 6155 35799 29320 13853
14822A3853l870J420K650j2318q494k4821O043K3341P09J301O364k320j0672k792
$$ 13853 9983 11403 14053 1735 -6759 -31580 -25537 -2196 -1487 -186 6178 3858 -6814 -9606
14808i606J1175J0233j2245j6404K0772M491q500l206k689J1248K180l226M221
$$ -9606 1569 11802 -443 -16847 3925 8416 -84 -3290 -5979 5269 7449 4223 8444
14795H444J764o168N102M429r147K854R000j3110L029J8807j3692l3237k1254
$$ 8444 10208 4040 9142 13571 4424 7278 16278 3168 6197 25004 11312 -21925 -43179
14782d3179k804K0635P736J9225J9144R539k1826j2005J3515j663q83P693l377
$$ -43179 -45983 -25348 -17612 1613 20757 30296 8470 -3535 9980 8317 7434 15127 11750
14769A1750j2091l515J250M297J0536m413j2088l171N546j2154k275N723k795
$$ 11750 -341 -3856 -2606 1691 12227 7814 -4274 -7445 -1899 -14053 -16328 -10605 -13400
14756a3400O852J787m103J0685Q996q00L562j3941k926M564n662j2515K1493m722
$$ -13400 -6548 -4761 -8864 1821 10817 10017 13579 -362 -3288 1276 -4386 -16901 4592 -130
14742a30j3311Q367L766m180m685n749J442N489l601J4304k597m337R970N894
$$ -130 -13441 -5074 -1308 -5488 -10173 -15922 -14480 -8991 -12592 1712 -885 -5222 4748 10642
14728A0642j1758j1255j6610j5613J2563L0808p120k7499P034L6030J8366K870
$$ 10642 -1116 -12371 -28981 -44594 -32031 -1223 -8343 -35842 -28808 7222 25588 28458
14716B8458n884k838j5757k0525K535j1902J0409J0471J9072r205n168L867J7253
$$ 28458 22574 19736 3979 -16546 -14011 -25913 -15504 -5033 14039 4834 -334 3533 20786
14703B0786k4914j6623O476J2524j9463P517K3567J109J1754p300r390M330j1347
$$ 20786 -4128 -20751 -14275 -1751 -21214 -13697 9870 10979 22733 15433 6043 10373 -974
14690i74M062Q769J2850Q395k1066o256n056k8352l927J6528J2932K2257q187
$$ -974 3088 11857 24707 33102 12036 5780 724 -27628 -31555 -15027 -2095 20162 11975
14677A1975j9065P264l881k784J0352J3226O360J3428R17j5222J559R006j1982
$$ 11975 -7090 174 -3707 -6491 3861 17087 23447 36875 37792 22570 24129 33135 21153
14664B1153O192q861J3393k411p951j4566K5503k175j4714Q563q402L271M727
$$ 21153 27345 18484 31877 29466 21515 6949 32452 30277 15563 24126 15724 18995 23722
14651B3722n21j8995j7828j2964k1148Q121J9584L3410J3242J2809l293n646j2328
$$ 23722 23201 4206 -13622 -26586 -47734 -39613 -20029 13381 26623 39432 36139 30493 18165
14638A8165k42J4385o768j6027m614r952j1157j1950J8924L2135K665l1230j1814
$$ 18165 17923 32308 25540 9513 4899 -5053 -16210 -28160 -9236 22899 25564 -5666 -17480
14625a7480m787J3058K2801L359M983N165k9907k3542o275K1251K6676n039j9439
$$ -17480 -22267 -9209 13592 16951 21934 27099 -2808 -26350 -32625 -11374 15302 10263 -9176
14612i176J2205O534j3983p52M619m897O084J0305o972J2006l153q918O113O728
$$ -9176 3029 9563 -4420 -5172 -553 -5450 634 10939 3967 15973 12820 3902 10015 16743
14598A6743J5083n941J0025J0046k0511r418k1405R054j284k0417j1977K2499
$$ 16743 31826 25885 35910 45956 25445 16027 -5378 3676 2392 -18025 -30002 -7503
14586g503N349N16m731l491L611r305P560R708J2664J0227K2084J1742k4256j1381
$$ -7503 -2154 -1638 -6369 -9860 -6249 -15554 -7994 1714 14378 24605 46689 58431 34175 22794
14572B2794l3867o528J51K1J6018J0277J8694L596j0272n646J101j2230j4609
$$ 22794 -11073 -17601 -17450 -17429 -1411 8866 27560 31156 20884 15238 16339 4109 -10500
14559a0500p118Q331O839j23j817o492R161r363R667N463L57j8299k2J644J7818
$$ -10500 -17618 -9287 -2448 -2571 -4388 -10880 -1719 -11082 -1415 4048 4405 -13894 -13916 -12272 5546
14544E546J0220k0888m702P466J2841k813p707N273l055o431J914p072l763p286
$$ 5546 15766 -5122 -9824 -2358 10483 7670 -37 5236 2181 -4250 -2336 -9408 -13171 -20457
14530b0457r178K1679k2170p549K1997J9645J3480O245n479N607K626J0765J7216
$$ -20457 -29635 -7956 -30126 -37675 -15678 3967 17447 23692 18213 23820 26446 37211 54427
14517E4427k8376k773J1239j976l184O811m219M327n017j7574j4262k1861R264
$$ 54427 26051 23278 34517 32541 29357 36168 31949 36276 31259 13685 -577 -22438 -13174
14504a3174j633k778j287L761J2837J6145j957k1184k2678J0150J3517J4353Q676
$$ -13174 -14807 -17585 -18872 -15111 -2274 13871 11914 -9270 -31948 -21798 -8281 6072 14748
14491A4748j4616J418J6116j7247J7080O699L335R25k3962k2979J5164J2873J425
$$ 14748 132 1550 17666 419 17499 24198 27533 28458 4496 -18483 -3319 9554 10979
14478A0979j828j1786j2911O275J2403N081N319j056K992K2891P350Q15n465k2174
$$ 10979 9151 -2635 -15546 -9271 3132 8213 13532 12476 15468 38359 45709 46524 41059 18885
14464A8885j2860j30K4032K556r768m984Q208M091j6090q890j0664n1n200k796
$$ 18885 6025 5895 29927 32483 22715 17731 25939 30030 13940 5050 -5614 -5665 -10865 -13661
14450a3661n306l495j0750K103J1759J8838o311l357J149K996l011n969L098J0913
$$ -13661 -18967 -22462 -33212 -31109 -19350 -512 -6823 -10180 -9031 -6035 -9046 -15015 -11917 -1004
14436a004j22l580K702m837j7505n43J0284Q37J5863k4095j4045P394l950M594
$$ -1004 -1126 -4706 -2004 -6841 -24346 -24889 -14605 -13768 2095 -22000 -36045 -28651 -32601 -28007
14422b8007K1731J3741K0427K57q454j4383j0184L694q26L538J276q108o024j737
$$ -28007 -6276 7465 27892 28149 19695 5312 -4872 -1178 -2004 1534 2810 -5298 -11322 -13059
14408a3059J0895M475Q239J4578r44k723R566K216j6904k7733m380K0495R952
$$ -13059 -2164 2311 10550 25128 24184 21461 31027 33243 16339 -11394 -15774 4721 14673
14395A4673M104M014m554R868J1797j5298k1054p871k5022K267K0565J0865Q497
$$ 14673 18777 22791 18237 28105 39902 24604 3550 -4321 -29343 -27076 -6511 4354 12851
14382A2851J0785Q544M006q196j6915J1522K0701m043j5074K745M22k99J5333
$$ 12851 23636 32180 36186 27990 11075 22597 43298 39255 24181 26926 27348 27049 42382
14369D2382j3365j1825p275m915K379k978L816n642N697j848n963j4231P441K2262
$$ 42382 29017 17192 9917 5002 7381 4403 8219 2577 8274 6426 463 -13768 -6327 15935
14355A5935P932L636l786j0593l871l893O705K210N691r28j0713k1759j962K408
$$ 15935 23867 27503 23717 13124 9253 5360 12065 14275 19966 19038 8325 -13434 -15396 -12988
14341a2988l378K6334J6393J077j2534J667O362k4261q462P544P436J3096r85
$$ -12988 -16366 9968 26361 27438 14904 16571 22933 -1328 -9790 -2246 5190 18286 17301
14328A7301M334J1700k2100m933R925R161k8852j9043P277Q849J3570K5623j4832
$$ 17301 21635 33335 11235 6302 16227 25388 -3464 -22507 -15230 -6381 7189 32812 17980
14315A7980j0146J098q296p052n810m673Q327K3988J4511o143j2322l555J91j906
$$ 17980 7834 8932 636 -6416 -12226 -16899 -8572 15416 29927 23784 11462 7907 8098 6192
14301F192k4750j1179R799K5078m53M33N194j4460j6529O7P834J4103J6537r850
$$ 6192 -18558 -29737 -19938 5140 4687 5120 10314 -4146 -20675 -20608 -12774 1329 17866 8016
14287H016k4462K02n582M904Q015N375m221p335J6873Q140K140M732n43N689Q219
$$ 8016 -16446 -16244 -21826 -16922 -8907 -3532 -7753 -15088 1785 9925 12065 16797 16254 21943 30162
14272C0162j5585k0839J735N182J6791Q040j0931j7436K2073M08j6383q394M305
$$ 30162 14577 -6262 -4527 655 17446 25486 14555 -2881 19192 19600 3217 -5177 -872
14259h72J0475l410j1254k4453l666O217l920K0241J5688R417j556J986n509j668
$$ -872 9603 6193 -5061 -29514 -33180 -26963 -30883 -10642 5046 14463 12907 14893 9384 7716
14245G716q578J8295J2557j5757K4901l456j5233p025J3522l962r314j5152J4448
$$ 7716 -862 17433 29990 14233 39134 35678 20445 13420 26942 22980 13666 -1486 12962
14232A2962M393O10r603J2292J6441k0204L800N978p622j5864r238k964J6525
$$ 12962 17355 17965 8362 20654 37095 16891 20691 26669 19047 3183 -6055 -9019 7506
14219G506J1783M759k544Q919l226q012q657N987K2089p546o615J3130L617q147
$$ 7506 19289 24048 21504 30423 27197 19185 10528 16515 38604 31058 24443 37573 41190 33043
14205C3043k7523l208R378P98J3279j4652j2867Q753q648o575L49Q10K2257j3338
$$ 33043 5520 2312 11690 12488 25767 11115 -1752 7001 -1647 -8222 -7873 -7063 15194 1856
14191A856j3899J526J0173R029J3879O625M21J819j6523k254j2097q381j184O491
$$ 1856 -12043 -10517 -344 8685 22564 29189 29610 31429 14906 12652 555 -7826 -9010 -2519
14177b519K6636J2446l696l1215K378Q304M190j0985o226j364j061J1565o851
$$ -2519 24117 36563 32867 1652 4030 12334 16524 5539 -687 -2051 -3112 8453 1602
14164A602o598L031J5722l629j608K128P624R672q648j9939q374j6309N019K4017
$$ 1602 -4996 -1965 13757 10128 8520 10648 18272 27944 19296 -643 -9017 -25326 -20307 3710
14150C710K7943N220j6937j0644J709N211P141J2597q700j7776j99O827J2747
$$ 3710 31653 36873 19936 9292 11001 16212 23353 35950 27250 9474 9275 16102 28849
14137B8849j945j077R87M370o993l797p531n313q045o229j5866p460M527J1758
$$ 28849 26904 25827 26814 31184 24191 20394 12863 7550 -495 -6724 -22590 -30050 -25523 -13765
14123a3765M07P600K4806N595l478J7660m344k2377l247Q460q026n371J0228q19
$$ -13765 -13358 -5758 19048 24643 21165 38825 34481 12104 8857 17317 9291 3920 14148 13329
14109A3329j402o976j7508j2646J0453J8896M551j4774l950N327R63J5402J5926
$$ 13329 11927 4951 -12557 -25203 -14750 4146 8697 -6077 -10027 -4700 -3737 11665 27591
14096B7591J0338j1314j4861Q634R748r239j5237J1689N628l148L082J1493q453
$$ 27591 37929 26615 11754 20388 30136 20897 5660 17349 22977 19829 22911 34404 25951
14083B5951j0253R10P48K661p561L522j5495N50j3029M587J185N941L047J8105
$$ 25951 15698 16608 17356 20017 12456 15978 483 1033 -11996 -7409 -6224 -283 2764 20869
14069B0869q215P447o82j1739N411m921Q118J4346j2690n310p019R217m348j4925
$$ 20869 12654 20101 19419 7680 13091 8170 16288 30634 17944 12634 5615 14832 10484 -4441
14055d441n980M51j2487K8204K6358O805j6755k4108m162K793R191M731R023M582
$$ -4441 -10421 -9970 -22457 5747 32105 38910 22155 -1953 -6115 -3322 5869 10600 19623 24205
14041B4205O313j2804R810K2691R557k2947k6777P507R805j1457K4229R33j0645
$$ 24205 30518 17714 27524 50215 59772 36825 10048 17555 27360 15903 40132 41065 30420
14028C0420l812R70N089J1368R718k8618k2590J688J5767l290J4886J2223P663
$$ 30420 26608 27578 32667 44035 53753 25135 2545 4233 20000 16710 31596 43819 51482
14015E1482p711k169j0857j915k125q527K4704L017l648p152j0039Q19j0360K5033
$$ 51482 43771 41602 30745 28830 26705 18178 42882 45899 42251 35099 25060 25879 15519 40552
14001D0552J5323k8318k0086q930J0313J0398j1002p206J4024J2562j3413k2334
$$ 40552 55875 27557 7471 -1459 8854 19252 8250 1044 15068 27630 14217 -8117
13989h117o390O133m866Q893O948L959k828P457m482q722N1P512O827L174j1169
$$ -8117 -14507 -8374 -13240 -4347 2601 6560 3732 11189 6707 -2015 -1964 5548 12375 15549 4380
13974D380J24J1962J3196j2053r21j0446p151J1555L753J0151J3176J4042J858
$$ 4380 4504 16466 29662 17609 16688 6242 -909 10646 14399 24550 37726 51768 53626
13961E3626R206J3208j462K957q263l261o602K291j7384q809m848o442m723J9513
$$ 53626 62832 76040 74578 77535 69272 66011 59409 61700 44316 35507 30659 24217 19494 39007
13947C9007J6283K852r248m05l0155p329K5881J0926M730O652p64n970P662k231
$$ 39007 55290 58142 48894 48489 18334 11005 36886 47812 52542 59194 58430 52460 60122 57891
13933E7891L510J582J3150M659q421o819j8970J7375J9243K3954L0456K4350M8791
$$ 57891 61401 62983 76133 80792 72371 65552 46582 63957 83200 107154 137610 161960 210751
13920B10751P1232K7560k0072k0461m9790l5980m0853l8445l6420M203j3674m311
$$ 210751 281983 309543 289471 269010 219220 183240 142387 103942 67522 71725 58051 53740
13908E3740n706p824m043L553M596n552k071J1423k872m525R168o945j5766p753
$$ 53740 48034 40210 36167 39720 44316 38764 36693 48116 45244 40719 49887 42942 27176 19423
13894A9423K869l772J7375O117R134k349j5126J4581M706l14M549N046j6784j3708
$$ 19423 22292 18520 35895 42012 51146 48797 33671 48252 52958 52644 57193 62239 45455 31747
13880C1747O05j0715j7873k520J2765J4958j4279j6857L780L0048P317J1786M49
$$ 31747 32352 21637 3764 1244 14009 28967 14688 -2169 1611 31659 38976 50762 51211
13867E1211q113j7919J7618J9107J2601O756j0316j9792j5338j2729q663P407
$$ 51211 43098 25179 42797 61904 74505 81261 70945 51153 35815 23086 14423 21830
13855B1830M682K982J5084J2359J345k5615j4576O823j1671j5779J0675n71J8778
$$ 21830 26512 29494 44578 56937 58282 32667 18091 24914 13243 -2536 8139 7568 26346
13842B6346K0428p858M062R016O818J065J682k0170j9196j1639M775K8879J0856
$$ 26346 46774 38916 42978 51994 58812 59877 61559 41389 22193 10554 15329 44208 55064
13829E5064j4211m144R743K5818l000R28r113N68M455j5963j5128q695l28j1594
$$ 55064 40853 36709 46452 72270 69270 70198 61085 61653 66108 50145 35017 26322 25994 14400
13815A4400M587Q044J5155Q537k3872K307Q110K3648J7649k4275j2470k1226o556
$$ 14400 18987 27031 42186 50723 26851 29158 37268 60916 78565 54290 41820 20594 14038
13802A4038j4701J0704M950Q984K2570m840J3366M662J2907j639k2984Q698M6
$$ 14038 -663 10041 14991 23975 46545 41705 55071 59733 72640 71001 48017 56715 56761
13789E6761O357P526P38q763N082j4500j5335j3805j6928M451J4333J7260N812
$$ 56761 63118 70644 71382 62619 67701 53201 37866 24061 7133 11584 25917 43177 48989
13776D8989N106j2126J7562K6095J5487l940k2815j6675O974k04J6244O354j6320
$$ 48989 54095 41969 59531 85626 101113 97173 74358 57683 64657 64453 80697 87051 70731
13763G0731j912J5841L908N249l198j7175m316P6J0453p290q404O652J4878J1224
$$ 70731 68819 84660 88568 93817 90619 73444 69128 69204 79657 72367 63963 70615 85493 96717
13749I6717l898p449m340j524O797N715J7753M1083M7510M6615N4566N5865K8211
$$ 96717 92819 85370 81030 79506 86303 92018 109771 150854 198364 244979 299545 355410 383621
13736C83621j1018k1871k7061l7339l0445k4340k2637j7628J486J8195J1469M4522
$$ 383621 372603 350732 323671 286332 255887 231547 208910 191282 192768 210963 222432 266954
13724B66954N6003K0732k1823j0542J928m787j271N534J6421L1900O0476P7250
$$ 266954 322957 343689 321866 311324 313252 308465 307194 312728 329149 361049 421525 498775
13712D98775R8330Q2653N1950p693l8135m9501p2743p9444p9370n1955k3604K1826
$$ 498775 597105 679758 731708 724015 685880 636379 563636 484192 404822 352867 329263 351089
13700C51089K9608M9040N7114J5135J1044J273l8014m9253l6933k0771J1937L9404
$$ 351089 380697 429737 486851 501986 513030 514303 476289 427036 390103 369332 381269 420673
13688D20673O1891R7311J07934J07925M3391m928l4501o3621o7120j00335j25370
$$ 420673 482564 579875 687809 795734 839125 834197 799696 736075 668955 568620 443250
13677D43250p3543k9500k8874m1809n129K9496L6876L0033O300l1803k8414j9679
$$ 443250 369707 340207 311333 269524 264395 293891 330767 360800 367100 335297 306883 287204
13665B87204j6992j6595k9492O542K7575L2073N6431O3984O4666K718m7616m1181
$$ 287204 270212 253617 224125 230667 258242 290315 346746 410730 475396 478114 430498 389317
13653C89317l3408m8574m1206m6634l9596l0837j3433k4866j0407J5906K870p381
$$ 389317 355909 307335 266129 219495 179899 149062 135629 110763 100356 116262 119132 111751
13641A11751j7488j2456l979n272J2968J7125j318J146L417J5138j3124j7427
$$ 111751 94263 81807 77828 72556 85524 102649 101331 102477 105894 121032 107908 90481
13629I0481N482J921j559r001p742j1032j3304j8336M639J1480M938R685L376
$$ 90481 95963 97884 96325 87324 79582 68550 55246 36910 41549 53029 57967 67652 71028
13616G1028N603j2821k3540N903J9318Q16j49J3980m612j2293j5553M088J2836
$$ 71028 76631 63810 40270 46173 65491 66307 66158 80138 75526 63233 47680 51768 64604
13603F4604J7120j3989j2337J4947J7350j0283p296j3393K252j520J0277J2172
$$ 64604 81724 67735 55398 70345 87695 77412 70116 56723 58975 57455 67732 79904
13591G9904J7918K244L641k2061k9224m742j5269L4732K6993J1583j6597j1842
$$ 79904 97822 100066 103707 81646 52422 47680 32411 67143 94136 105719 89122 77280
13579G7280N552j3127j0293R053P407j2116M520J6875j2290P133m22J7917K3017
$$ 77280 82832 69705 59412 68465 75872 63756 68276 85151 72861 79994 79572 97489 120506
13566A20506m415l027q62p722j5781k89M506J0528J0574L282n243k1281j7733
$$ 120506 116091 113064 112202 104480 88699 88410 92916 103444 114018 117300 112057 90776 73043
13553G3043J4L625l205m246m3R849j979R558P715n811k0600j8718M636J3300Q254
$$ 73043 73057 76682 73477 69231 69188 79037 77058 86616 94331 88520 67920 49202 53838 67138 75392
13538G5392J1902P956L844N263P278j6353O047N904M032J0650j175N077Q911k352
$$ 75392 87294 95250 99094 104357 111635 95282 101329 107233 111265 121915 120740 125817 134728 132376
13524A32376J7883j5592k503J2465R993J5440q985j1056L316J751k5664J960j2295
$$ 132376 150259 134667 132164 144629 154622 170062 161077 150021 153337 155088 129424 131384 119089
13511A19089L498Q161P232n872K804J2762p582J6370j7272O84R573J9169k96j2971
$$ 119089 122587 130748 137980 132108 134912 147674 140092 156462 139190 139874 149447 168616 168320 155349
13497A55349n06K4067J4887N550P880J0649J4341K7582J9320K1379J7505P763
$$ 155349 154843 178910 193797 199347 207227 217876 232217 259799 279119 300498 318003 325766
13485C25766M252p449K3117J2710q205k0195k4032k945k7983j8811j3188Q734
$$ 325766 330018 322569 345686 358396 350191 329996 305964 303019 275036 256225 243037 251771
13473B51771J8926k4666o921j6775j3555j3336l580j0705J8594J858J412o564
$$ 251771 270697 246031 239110 222335 208780 195444 191864 181159 199753 201611 203023 196459
13461A96459j3906k2861o228J9211J5145p600k5111p327l790J6267L4553j0071
$$ 196459 182553 159692 153464 172675 187820 180220 155109 147782 143992 160259 194812 184741
13449A84741k1637j3394K1930J9383J2083n600m186j5405j1842J651j868J0359
$$ 184741 163104 149710 171640 191023 203106 197506 193320 177915 166073 167724 165856 176215
13437A76215J7316j3614l246M306N587J3217K2951K2030m835j3496Q169k987k761
$$ 176215 193531 179917 176671 180977 186564 199781 222732 244762 239927 226431 234600 231613 228852
13424B28852k383j9137q507j0972q950K900j2062k2824Q10p22K732K702J0545
$$ 228852 226469 207332 198825 187853 178903 181803 169741 146917 147727 147005 149737 152439 162984
13411A62984L2664K0541p187J819l69j6104r70J0594M544n619q353K864K3110
$$ 162984 195648 216189 209002 210821 210452 194348 193378 203972 208516 202897 194544 197408 220518
13398B20518o295n779p863K04J3643m602j2860P740J6684J5181J9082Q092j766
$$ 220518 214223 208444 200581 200785 214428 209826 196966 204706 221390 236571 255653 263745 261979
13385B61979m191K0210J6334j884j4149l436j2567l237K5142L4826L2015K0076
$$ 261979 257788 277998 294332 292448 278299 274863 262296 259059 284201 319027 351042 371118
13373C71118K1330j6050j813N957K9116K3541k497L912L3633M0392M6139J1286
$$ 371118 392448 376398 374585 380542 409658 433199 430702 434614 468247 508639 554778 566064
13361E66064J7539N3771L9044L3023K6373j450M1948J5620L500K2847J0318k7873
$$ 566064 583603 637374 676418 709441 735814 734364 776312 791932 795432 818279 828597 800724
13349H00724k1930r276k0379j2368k8137j9748q987q20j2006j7272R708K6113
$$ 800724 778794 769518 749139 736771 708634 688886 679899 679079 667073 649801 659509 685622
13337F85622K0543K024J5498K4126J9851J3005L7507J1478O238P47J5482J9940
$$ 685622 706165 708189 723687 747813 767664 780669 818176 829654 835892 836639 852121 872061
13325H72061J6750J8242K4755J5553J7530J1472m896K0093L8943J5044M347M1457
$$ 872061 888811 907053 931808 947361 964891 976363 971467 991560 1030503 1045547 1049894 1091351
13313A091351K5655J2265Q52j5654k3000l191K8506K3618M8807L0993L6088O1662
$$ 1091351 1117006 1129271 1130123 1114469 1091469 1088278 1116784 1140402 1189209 1220202 1256290 1317952
13301A317952P7173J06988J26606J56315J33545J62987K35860L04071L47251M56125
$$ 1317952 1395125 1502113 1628719 1785034 1918579 2081566 2317426 2621497 2968748 3424873
13291C424873P04056J051022J105633N46164j6589j37060j27380j62885l9238
$$ 3424873 4128929 5179951 6285584 6831748 6815159 6678099 6550719 6387834 6348596
13282F348596L03583N41522M07585L9891p1992l3828K8261K33400O99326J383377
$$ 6348596 6652179 7193701 7601286 7641177 7569185 7535357 7563618 7797018 8496344 9879721
13272I879721K145105K237156J020689m231j6159K66669P65465J935824K756014
$$ 9879721 12024826 14261982 15282671 15278440 15262281 15528950 16294415 18230239 20986253
13263B0986253O73695j556592j534901j371778j838566j851458j184892m79374
$$ 20986253 21659948 20103356 18568455 17196677 15358111 13506653 12321761 11842387
13255A1842387N7570M32387P54837J095982J506635K059320K701175L559529N017227
$$ 11842387 11899957 12332344 13087181 14183163 15689798 17749118 20450293 24009822 29027049
13246B9027049P294778R767541J0209163P961965P889874J2198036J9527580K6250835
$$ 29027049 36321827 46089368 56298531 64260496 72150370 84348406 103875986 130126821
13238A30126821K3736395K1597492K9622230L1299166K1769615J1739666R371769
$$ 130126821 153863216 175460708 205082938 236382104 258151719 269891385 279263154
13231B79263154R936092K799781r303598j8178774j7853742j6216525k5856260
$$ 279263154 289199246 291999027 282695429 264516655 246662913 230446388 204590128
13224B04590128l0827020k3496514j4754576j0512284j0912004j3547219j3032500
$$ 204590128 173763108 150266594 135512018 124999734 114087730 100540511 87508011
13217H7508011j1211320j0935881j0602225q733486o356921m463612l354329k916540
$$ 87508011 76296691 65360810 54758585 46025099 39668178 35204566 31850237 28933697
13209B8933697k580562k190522j809960j442368j008313l43466O63659K078094
$$ 28933697 26353135 24162613 22352653 20910285 19901972 19558506 20222165 22300259
13201B2300259K816194N72807j625010j520078j179647j268233o60634J80670
$$ 22300259 25116453 25689260 24064250 22544172 21364525 20096292 19435658 19616328
13193A9616328l26393j401520j645442j561583j711169j664342j173683n47845
$$ 19616328 19289935 17888415 16242973 14681390 12970221 11305879 10132196 9584351
13185I584351p7305j0932l01400m97426m96333m40574l54137p6959L39042M68575
$$ 9584351 9507046 9496114 9194714 8697288 8200955 7760381 7406244 7329285 7668327 8136902
13175H136902l4643n79185o68701o67689p32573p37158o37510m91409l64828l14414
$$ 8136902 8102259 7523074 6854373 6186684 5454111 4716953 4079443 3588034 3223206 2908792
13165B908792k78667k31493k01107j60000j59043j36473q8319q3319r5299r1189
$$ 2908792 2630125 2398632 2197525 2037525 1878482 1742009 1653690 1570371 1475072 1383883
13155A383883p3498m8261o6050p9156n8013n6099o3854k6268l3906m1839n2377
$$ 1383883 1310385 1262124 1196074 1116918 1058905 1002806 938952 912684 878778 836939 784562
13144G84562k7075k0248m3815k6096j0890J662p897j4045j5857j9550n598J1997
$$ 784562 757487 737239 693424 667328 656438 658100 650203 636158 620301 600751 595153 607150
13132F07150j4939l7498k9536R27l397k2554p737L133J2335k0481k2371J463j2956
$$ 607150 592211 554713 525177 526104 522707 500153 492416 495549 507884 487403 465032 466495 453539
13119D53539J450j4746k6555n692j4571k7658j6282K2714J3795J2947l784l0852
$$ 453539 454989 440243 413688 407996 393425 365767 349485 372199 385994 398941 395157 364305
13107C64305j144J0229L420j0212k8334j2852K0651J3753q344k2567o428j1091
$$ 364305 363161 373390 376810 366598 338264 325412 346063 359816 351472 328905 322477 311386
13095C11386k7586k7527J429M696K3331O077j5665K679L821J5611J1740J1830
$$ 311386 283800 256273 257702 262398 285729 291806 276141 278820 282641 298252 309992 321822
13083C21822J0150j4672j0654N462R731Q268j3258r631o926m863K2119j28J3176
$$ 321822 331972 317300 306646 312108 321839 330107 316849 307218 300292 295429 317548 317420 330596
13070C30596P119n289J0355p048k255j2066j2045j6150j5392P371N480q511j3765
$$ 330596 337715 332426 342781 335733 333478 321412 309367 293217 277825 285196 290676 282165 268400
13057B68400j0611j1790j043O21L134o440m120J4810L623j164J2825J5164k7138
$$ 268400 257789 245999 244956 245577 248711 242271 238151 252961 256584 255420 268245 283409 256271
13044B56271j5934L64k1233j8927k2907m95O565j783r050j4612j8171R892J6220
$$ 256271 240337 240701 219468 200541 177634 177139 183704 181921 172871 158259 140088 149980 166200
13031A66200J2877K9785o81m189o03J0207K291m720k8418j4632k012j9909j0353
$$ 166200 179077 208862 208181 203992 203389 213596 215887 211167 182749 168117 166105 146196 135843
13018A35843J0906O389l095J0367J2757l726J2275K6554K9879o795j9661n280
$$ 135843 146749 153138 150043 160410 173167 169441 181716 208270 238149 231354 211693 206413
13006B06413K4216K5336K399p658P336J0071K4079P487K1404M8696M4614J10022
$$ 206413 230629 255965 258364 250706 258042 268113 292192 299679 321083 369779 414393 524415
12994E24415J32955J41478J47513J46352P7322K1765n4802r5480j28277j20113
$$ 524415 657370 798848 946361 1092713 1170035 1191800 1136998 1041518 913241 793128
12984G93128j07926j20076o9003p3126m1364l9051k7289p393j0976k7522j5306
$$ 793128 685202 565126 496123 422997 381633 342582 315293 307900 296924 269402 254096
12973B54096l846m13r827j9259j2034L134j4768k6413O986l427n747O490J5702
$$ 254096 250250 249837 240010 220751 208717 211851 197083 170670 177656 174229 168482 174972 190674
12960A90674r018j5602J4948q65j1929m191n492J2304J1830J613J779o274n762
$$ 190674 181656 166054 181002 180137 168208 164017 158525 170829 182659 184272 186051 179777 174015
12947A74015J968J2607o298l814J2299j0871j6936q401P524K099N327n876k3414
$$ 174015 175983 188590 182292 178478 190777 179906 162970 154569 162093 164192 169519 163643 140229
12934A40229J720M411k492O284m293k1649P699k758k1429k1843M005K711q247
$$ 140229 141949 146360 143868 150152 145859 124210 131909 129151 107722 85879 89884 92595 84348
12921H4348J4242L1413Q400j4469k8602M304L2803N073j8620K154J9012L699k683
$$ 84348 98590 130003 138403 123934 95332 99636 132439 137512 118892 121046 140058 143757 141074
12908A41074L73N477J6666p151n298j6003j010l109p100k6599j5932J810Q86J0488
$$ 141074 141447 146924 163590 156439 151141 135138 134128 131019 123919 97320 81388 83198 84084 94572
12894I4572L3849l215j9997j5031O901J2400J7950o249k5226j2423j269j798J4970
$$ 94572 128421 125206 105209 90178 97079 109479 127429 121180 95954 83531 82262 80464 95434
12881I5434J8738j751j8396n584J7801L200o563J9598m835j2413M735o319q611
$$ 95434 114172 112421 94025 88441 106242 109442 102879 122477 117642 105229 109964 103645 95034
12868I5034J6260J1116j0602m061k675m975L095R749Q109J3174P647J6345m816
$$ 95034 111294 122410 111808 107747 105072 100097 103192 112941 121050 134224 141871 158216 153400
12855A53400r525L992K7978k1825k6381j1019L446K452j688K807P67j958J086
$$ 153400 143875 147867 175845 154020 127639 116620 120066 122518 120830 123637 124404 122446 123532
12842A23532N984l76k665J6760j211j7661p561o311Q900P181L147R437l600n116
$$ 123532 129516 129140 126475 143235 142024 124363 116802 110491 119391 126572 129719 139156 135556 130440
12828A30440O638J7050K0284k090j3580j2912o086J5827J354l264J9694M0495
$$ 130440 137078 154128 174412 172322 158742 145830 139744 155571 156925 153661 173355 213850
12816B13850J1409J2753J2261L3525J6634j3156k606j1129l6076M315J6409J3773
$$ 213850 225259 238012 250273 283798 300432 287276 284670 273541 237465 241780 258189 271962
12804B71962M1619M9536N7600O2163M8811J6395n25l1070m4320n0871m1651m0998
$$ 271962 313581 363117 420717 482880 531691 548086 547561 516491 472171 421300 379649 338651
12792C38651k9258k4853O944K3824L3305M8925J771p551o745j4999m6963k2548
$$ 338651 309393 284540 291484 315308 348613 397538 399309 391758 385013 370014 323051 300503
12780C00503N006J6940M8379M5778Q3845R8470J25868J37210P9060O735o1035
$$ 300503 305509 322449 370828 416606 500451 598921 724789 861999 941059 947794 886759
12769H86759p7057r9002r7275q2710l7335j4817K9992L7668R405K2078L6637o37
$$ 886759 809702 710700 613425 530715 493380 478563 508555 546223 555628 577706 614343 613706
12757F13706n3794m9821m2275k2338j1983o43J3111N2428J05129Q8752P3189J4381
$$ 613706 559912 510091 467816 445478 433495 432852 445963 498391 603520 692272 765461 779842
12745G79842k7653l3882l6034n8836o7488n5920n4760k8960j6356r663j00M959
$$ 779842 752189 718307 682273 623437 555949 500029 445269 416309 399953 390290 390190 395149
12733C95149J3017r088m0030j7850k3729l7411j5338J4003L312j2115K2287M5624
$$ 395149 408166 399078 359048 341198 317469 280058 264720 278723 282035 269920 292207 337831
12721C37831P2161O3260L9882r946m2372k0248k9718l0844k9567k5373k7470m1971
$$ 337831 409992 473252 513134 503188 460816 440568 410850 380006 350439 325066 297596 255625
12709B55625k4492k330n825j1268K1874N415o622K310R622Q033j886o735J1441
$$ 255625 231133 228803 222978 211710 233584 238999 232377 234687 244309 252342 250456 243721 255162
12696B55162J4511k752j5132J5849J0203L1280L271K5314L1244L6960L4049K0498
$$ 255162 269673 266921 251789 267638 277841 309121 312392 337706 368950 405910 439959 460457
12684D60457o773j3676q575j5477j7401k9812j8972J998P017J055j3507J2374
$$ 460457 453684 440008 431433 415956 398555 368743 349771 351769 358786 359841 346334 358708
12672C58708p953J206p912N296M477O799K2653K4348L9699O8657L7016p939j6863
$$ 358708 350755 351961 344049 349345 353822 360621 383274 407622 447321 515978 552994 545055 528192
12659E28192J553j6500j6937J9061M2557L5890M2011K5940Q056J2090J1117r751
$$ 528192 529745 513245 496308 515369 557926 593816 635827 661767 669823 681913 693030 683279
12647F83279m063J722Q0j3867j5467j4731Q355N746k994p53L3J9276M270k0861
$$ 683279 679216 680938 681018 667151 651684 636953 645308 651054 648060 647307 647340 666616 670886 650025
12633F50025J2757j439J3455P00K6903L3079J7989K6213K3596L3335K2859K1391
$$ 650025 662782 661343 674798 675498 702401 735480 753469 779682 803278 836613 859472 880863
12621H80863J7676J8597K9054L4911N2789N4515N1569M1189N2914P4510L8771
$$ 880863 898539 917136 946190 981101 1033890 1088405 1139974 1181163 1234077 1308587 1347358
12610A347358M2112M8629O3420O5564N7367N2204M7847P0235Q5883J25867J34667
$$ 1347358 1389470 1438099 1501519 1567083 1624450 1676654 1724501 1794736 1880619 2006486 2141153
12599B141153J08797J36641J58027J70061J90406J95397J67596K02649K49019
$$ 2141153 2249950 2386591 2544618 2714679 2905085 3100482 3268078 3470727 3719746
12590C719746K60663K67179K86497L35022L66027M24256M91225N68592O95685
$$ 3719746 3980409 4247588 4534085 4869107 5235134 5659390 6150615 6719207 7414892
12581G414892Q20231R90715J167863J409907J652253J837442K012500K234680
$$ 7414892 8235123 9225838 10393701 11803608 13455861 15293303 17305803 19540483
12573A9540483K522335L006474L742670M863091O495443Q807115J2025418J6359079
$$ 19540483 22062818 25069292 28811962 33675053 40170496 48977611 61003029 77362108
12565G7362108K1919628K7900393L1642439K8757368J7376416K016403j0797744
$$ 77362108 99281736 127182129 158824568 187581936 204958352 206974755 196177011
12558A96177011j9201936k4228491k5964336k4224478k0205738j5697299j1792981
$$ 196177011 176975075 152746584 126782248 102557770 82352032 66654733 54861752
12551E4861752q768940o550223m987530l882093l099953k594106k306957k128782
$$ 54861752 46092812 39542589 34555059 30672966 27573013 24978907 22671950 20543168
12543B0543168j922104j710050j536059j387868j198755j003569q38239p20519
$$ 20543168 18621064 16911014 15374955 13987087 12788332 11784763 10946524 10226005
12535A0226005n97393n06506m16421l28502k46282j35099l5507J08887K95784
$$ 10226005 9628612 9122106 8705685 8377183 8130901 7995802 7960295 8069182 8364966
12526H364966N20309P80336J094585J441622J661059J518668R43453Q3401o71204
$$ 8364966 8885275 9665611 10760196 12201818 13862877 15381545 16324998 16408399 15737195
12517A5737195j190964j529678j679401j605839j405221j169334r23952p30036
$$ 15737195 14546231 13016553 11337152 9731313 8326092 7156758 6232806 5502770
12509E502770n80432m47850l52118l16610k72295k53829k40322k10328j78870
$$ 5502770 4922338 4474488 4122370 3805760 3533465 3279636 3039314 2828986 2650116
12500B650116j84887j63187j51900j18171j01118r6543q0445r9846o8045n1396
$$ 2650116 2465229 2302042 2150142 2031971 1930853 1834310 1753865 1654019 1585974 1534578
12490A534578o0669n2111l7547l3214l6801l4421j0656O255L2790O8358Q9092
$$ 1534578 1473909 1421798 1384251 1351037 1314236 1279815 1269159 1275414 1308204 1376562 1465654
12479A465654J04811J24512Q5253M3617m7367r7112j24074j44259j56852j25923
$$ 1465654 1570465 1694977 1780230 1823847 1776480 1679368 1555294 1411035 1254183 1128260
12469A128260r7335r0291o6790l7578l8793m8236k7126j5942l4087l6230l4328
$$ 1128260 1030925 940634 873844 836266 797473 749237 722111 706169 672082 635852 601524
12458F01524m7776m0061k906j6743j1744m182p759j7065r519r225L289m990j3429
$$ 601524 553748 513687 510781 494038 482294 478112 470353 453288 443769 434544 437833 432843 419414
12445D19414j0554j2963j387p86K158j4142l3800j6054o197l3209k442J7299n
$$ 419414 408860 395897 394510 393724 395882 381740 347940 331886 325689 292480 290038 307337 307332
12432C07332Q94L1n882k8225r879j0765j0450p487M546j8809l623r44M050j2186
$$ 307332 308226 308257 302375 274150 264271 253506 243056 235569 240115 221306 217683 216739 220789 208603
12418B08603m248J3212J1671R50N334j3276j5408j940N429m587p436J949lj0437
$$ 208603 204355 217567 229238 230188 235522 222246 206838 204898 210327 205740 198304 200253 200250 189813
12404A89813j679P90O132J1539J464j0965j0920R877J54m431j4726J581J620L295
$$ 189813 188134 188924 195056 206595 208059 197094 186174 196051 196205 191774 177048 178629 180249 183544
12390A83544j1284J0131J2999M629R078r769L101J7086L427j8154j5247j0190
$$ 183544 172260 182391 195390 200019 209097 199328 202429 219515 222942 204788 189541 179351
12378A79351N146J8201Q094P762K9707K0946M521J064L0530N1039P7033Q6463
$$ 179351 184497 202698 210792 218554 248261 269207 273728 274792 305322 356361 433394 519857
12366E19857J20338J19570N0201Q347k4472m8003n4624n4986n4717l4837J6312
$$ 519857 640195 759765 809966 818313 793841 745838 691214 636228 581511 546674 562986
12355E62986K8863N5737O4765K4750k250n79n4637o3567n6719o9457o3979m9131
$$ 562986 591849 647586 712351 737101 734851 734272 679635 616068 559349 489892 425913 376782
12343C76782n0869k4650L3664L102k870K5534J6289L2531L8341M6404O1284M4408
$$ 376782 325913 301263 334927 338029 335159 360693 376982 409513 447854 494258 555542 599950
12331E99950K277K076k7191l3138l4124n1781n5880l3186n0969l6174k6502j6097
$$ 599950 602227 604303 577112 543974 509850 458069 402189 369003 318034 281860 255358 239261
12319B39261l2596k2392K6352j2335n257o039j2223j8558j949j529J9839J4737
$$ 239261 206665 184273 210625 198290 193033 186994 174771 156213 154264 152735 172574 187311
12307A87311j9560O253j5427K763J9897J1390J5143M2233K6677J8396K6337J1012
$$ 187311 167751 174004 158577 161340 181237 192627 207770 250003 276680 295076 321413 332425
12295C32425K2742K8757L8221O4105J00573J21801Q7804Q9201K8225k867n5359
$$ 332425 355167 383924 422145 486250 586823 708624 796428 885629 913854 910987 855628
12284H55628r0843j18585j38968j03026p7125n5770k1345k4502k9339j2046m585
$$ 855628 764785 646200 507232 404206 327081 271311 249966 225464 196125 184079 179494
12273A79494j335j1789l650J0001J4858K484j361o427J3617K0528k7572o085k335
$$ 179494 178159 166370 162720 172721 187579 190063 188702 182275 195892 216420 188848 182763 180428
12260A80428p467j3550j5478l998k0622k1808r771N558L866q04k2418m763J0634
$$ 180428 172961 159411 143933 139935 119313 97505 87734 93292 97158 96354 73936 69173 79807
12247G9807j751M413J0838j8225K5417J8515J582j3917J6180L1106M4149K3367
$$ 79807 78056 82469 93307 75082 100499 119014 120596 106679 122859 153965 198114 221481
12235B21481p17K678j7153j4674l2067l7743l0338j9189q104j8007q482J7809
$$ 221481 220764 223442 206289 191615 159548 121805 91467 72278 64174 46167 37685 55494
12223E5494O536J3548J8798r785j9459N831K5567J7631n616K9878R077j977N81
$$ 55494 62030 75578 94376 84591 65132 70963 96530 114161 108545 138423 147500 145523 146104
12210A46104j3852J0907L0827O558m85K221j585j0793p666j3154l2411j5894j3809
$$ 146104 132252 143159 173986 180544 180059 182280 180695 169902 162236 149082 116671 100777 86968
12197H6968l360q524q377m123r94p293j29J1945J4244J0309l39j2351j6132l009
$$ 86968 83608 75084 66707 62584 61590 54297 54168 66113 80357 90666 90327 77976 61844 58835
12183E8835J8737J2502q044j9077q471K602q168j5299k607J272L932L779J0395
$$ 58835 77572 90074 82030 62953 54482 57084 48916 33617 31010 32282 36214 39993 50388
12170E0388j1042O503J0867n633k1180m651Q866J3547P928k881r508J3504j000
$$ 50388 39346 45849 56716 51083 29903 25252 34118 47665 55593 52712 43204 56708 55708
12157E5708j3292P32K0385j1013j9228R64K0789J9682K7567M470j8498J2731J9314
$$ 55708 42416 43148 63533 52520 33292 34256 55045 74727 102294 106764 88266 100997 120311
12144A20311J2362J0585L4483K3953K1880O055J0963J7678J8148O140P597K7252
$$ 120311 132673 143258 177741 201694 223574 229629 240592 258270 276418 282558 290155 317407
12132C17407O1039Q9281P9105J31392J67905J56431J25260N9938M823n6036j03227
$$ 317407 378446 467727 546832 678224 846129 1002560 1127820 1187758 1192581 1136545 1033318
12121A033318j25295j14647q8898q0311k6283M960N0757J08514J96168L15687
$$ 1033318 908023 793376 704478 624167 597884 602844 653601 762115 958283 1273970
12111A273970L85693M06435L40012J97005N763j83809l14739l39083l58292l22645
$$ 1273970 1659663 2066098 2406110 2603115 2608878 2425069 2110330 1771247 1412955 1090310
12101A090310k49778j88626j19368p9766m8160n6561l7003j9625k9579l2288j9400
$$ 1090310 840532 651906 532538 452772 404612 348051 311048 291423 261844 229556 210156
12090B10156k6225l602l771j0319J7177n550L081j2536j5127m746J587N549M882
$$ 210156 183931 180329 176558 166239 183416 177866 180947 168411 153284 148538 150125 155674 160556
12077A60556R080J9369K5982J4191j4694k2320l5251j5856j6513j6362j7137m666
$$ 160556 169636 189005 214987 229178 214484 192164 156913 141057 124544 108182 91045 86379
12065H6379q092o734J5204k1990M49k1549o673R286r213j389M304N38J791k0152
$$ 86379 78287 71553 86757 64767 65216 43667 36994 46280 37067 35678 39982 40520 42311 22159
12051B2159J5444J8438Q70j5747j5524J0842J2381l88L636J4752J3084P884K6350
$$ 22159 37603 56041 56911 41164 25640 36482 48863 48475 52111 66863 79947 87831 114181
12038A14181K272K3510L650r349j6428m960j477k0594M231K2590J7636M764r37
$$ 114181 116453 139963 143613 134264 117836 112876 111399 90805 95036 117626 135262 140026 139089
12025A39089l5302k5054r508j4766o709j3704o671j0232J4830p97L053P954K897
$$ 139089 103787 78733 69225 54459 47750 34046 27375 17143 31973 31176 34229 42183 45080
12012D5080j1982j3004j418M147K2134j77r923o631j171q550m640J0924o956j2107
$$ 45080 33098 20094 18676 22823 44957 44780 34857 28226 27055 18505 13865 24789 17833 5726
11998E726j112L731J839j0069j7738m308O466K1362P396j9945k4527K0772R922
$$ 5726 4614 8345 10184 115 -17623 -21931 -15465 5897 13293 -6652 -31179 -10407 -485
11985d85K2627Q576N874j4300j8651j2023l1473j9937O630J3061O398N351L555
$$ -485 22142 30718 36592 22292 3641 -8382 -39855 -59792 -53162 -40101 -33703 -28352 -24797
11972b4797P679K2827N733j0J3256q139q338q949J631N935j813J1841J0056o502
$$ -24797 -17118 5709 11442 11432 24688 16549 8211 -738 893 6828 5015 16856 26912 20410
11958B0410M916k3038j5549p149J6124J2505J8736j2620q785q72j3518j187N643
$$ 20410 25326 2288 -13261 -20410 -4286 8219 26955 14335 5550 4678 -8840 -10027 -4384
11945d384J905J2466J4113r76m430r595k9786o381J6312J3880J917m675n460k4269
$$ -4384 -2479 9987 24100 23124 18694 9099 -20687 -27068 -10756 3124 5041 366 -5094 -29363
11931b9363k0945M28M0192K9723K807J171j8450j2903q045o930O990J2511O965
$$ -29363 -50308 -49880 -9688 20035 22842 24013 5563 -7340 -15385 -22315 -15325 -2814 4151
11918D151J6444o55J3656j601j8089j0676L156J5071k0044j7199J2653M606p009
$$ 4151 20595 19940 33596 31995 13906 3230 6386 21457 1413 -15786 -3133 1473 -5536
11905e536m997J0850O578j590q053j4322N817J2469n210l749k110M624R884Q956
$$ -5536 -10533 317 6895 5305 -2748 -17070 -11253 1216 -3994 -7743 -9853 -5229 4655 13611
11891A3611J181j527q570J0985L384J274Q395l448j4448j5423j2930r118J2578
$$ 13611 14792 13265 4695 15680 19064 20338 28733 25285 10837 -4586 -17516 -26634 -14056
11878a4056K0427J5711l769o331J496J0645q665J2711R055l869j6508j0147J0353
$$ -14056 6371 22082 18313 11982 13478 24123 15458 28169 37224 33355 16847 6700 17053
11865A7053n502m360Q194J1506K1602j4186l7459q254O187j3260J5681K5392P873
$$ 17053 11551 7191 15385 26891 48493 34307 -3152 -11406 -5219 -18479 -2798 22594 30467
11852C0467J0656l68k8149k4603O915L639j4648N907q355N873J0717j2510j0545
$$ 30467 41123 40755 12606 -11997 -5082 -1443 -16091 -10184 -18539 -12666 -1949 -14459 -25004
11839b5004P591j741o222l132J0096j436k001M510k016K1495K2528P335q356j6838
$$ -25004 -17413 -19154 -25376 -28508 -18412 -19848 -21849 -17339 -19355 2140 24668 32003 23647 6809
11825F809j5115j6976j9987K279O808N32K5893L961o420J879Q364l846m720L235
$$ 6809 -8306 -25282 -45269 -42990 -36182 -35650 -9757 -5796 -12216 -10337 -1973 -5819 -10539 -7304
11811g304O081r899q189J9283l577j474j2512k998J371J732j3484q86J4561J1297
$$ -7304 -1223 -11122 -19311 -28 -3605 -5079 -17591 -20589 -19218 -17486 -30970 -31856 -17295 -5998
11797e998j990M950j1917K697Q655J0021q980j3554q015L39Q655L8765o423j0012
$$ -5998 -7988 -3038 -14955 -12258 -3603 6418 -2562 -16116 -24131 -23792 -15137 23628 17205 7193
11783G193K54j2508k191J7943K083J1004R83j206N415k989P610P833j8356J123
$$ 7193 7447 -5061 -7252 10691 12774 23778 24761 23555 28970 25981 33591 41424 23068 24191
11769B4191O63m875J2521n065Lo03n517O791q705k644j5902J6100J0038q694P22
$$ 24191 24854 19979 32500 27435 27438 26835 21318 28109 19404 16760 858 16958 26996 18302 19024
11754A9024p97r998m358j6335J5552L954j0860j7466K766j0405n96R43J9126Q061
$$ 19024 18227 8229 3871 -12464 3088 7042 -3818 -21284 -18518 -28923 -29519 -28576 -9450 -1389
11740a389j2990M48o37o9P77J9158J5539j7788k2501O532J6651J0113P351p19
$$ -1389 -14379 -13931 -14568 -14637 -13860 5298 20837 3049 -19452 -12920 3731 13844 21195 20476
11726B0476j174j1791l29n086R969j9590k3305n898J4584P667N987J8120O615
$$ 20476 19302 7511 7182 2096 12065 -7525 -30830 -36728 -22144 -14477 -8490 9630 16245
11713A6245j1998l0046k1667m610N230K7261J5145r739L041J0363l687k483M467
$$ 16245 4247 -25799 -47466 -52076 -46846 -19585 -4440 -14179 -11138 -775 -4462 -6945 -2478
11700b478P556J2466l35j6950J4302K4507L427k1145j4108K889K1210k0459k93
$$ -2478 5078 17544 17209 259 14561 39068 42495 21350 7242 10131 31341 10882 10589
11687A0589Q773P887j0528k1877o517K1791J3741M739m852j1156p677M195j1389
$$ 10589 19362 27249 16721 -5156 -11673 10118 23859 28598 23746 12590 4913 9108 -2281
11674b281M657R489M970m751O604j370r349r735M389Q291J647j4059o987n380
$$ -2281 2376 11865 16835 12084 18688 17318 7969 -1766 2623 10914 12561 -1498 -8485 -13865
11660a3865j1558N899J3603r608O019L0636J8177j5771j4434j6905J4140J3365
$$ -13865 -25423 -19524 -5921 -15529 -9510 21126 39303 23532 9098 -7807 6333 19698
11648A9698j1438k4642k0941l713J5546K4888N206j4712R238K839n088J6736J0254
$$ 19698 8260 -16382 -37323 -41036 -25490 -602 4604 -10108 -870 1969 -3119 13617 23871
11635B3871K451L848p345j5029j1325MK571O317m864Q67n730R198n973j8178J2667
$$ 23871 26322 30170 22825 7796 -3529 -3525 -954 5363 499 1366 -4364 4834 -1139 -19317 -6650
11620f650K7452R283k5993j5929k4890K12J5668K1806K2251j083p420r93j8766
$$ -6650 20802 30085 4092 -11837 -36727 -36515 -20847 959 23210 22127 14707 13714 -5052
11607e052k5060q061o157P519k450Q678J5615m249J5390J1892J8112l788j3501
$$ -5052 -30112 -38173 -44330 -36811 -39261 -30583 -14968 -19217 -3827 8065 26177 22389 8888
11594H888p167j838K166k638o250n863J295n606n254K3406K876L646J8219j9339
$$ 8888 1721 -117 2049 -589 -6839 -12702 -11407 -17013 -22267 1139 4015 7661 25880 6541
11580F541j1218l091L287J8403J1231j091r676j3610k2306J0249J7397R081l973
$$ 6541 -4677 -7768 -4481 13922 25153 24062 14386 776 -21530 -11281 6116 15197 11224
11567A1224q907j1276K064m457N222p720L379R893r287K4666J316p087j1885j4961
$$ 11224 2317 -8959 -6895 -11352 -6130 -13850 -10471 -578 -9865 14801 16117 9030 -2855 -17816
11553a7816q790J1696J1214O384j3139P886J2229K660o734o635Q983j3215j2520
$$ -17816 -26606 -14910 -3696 2688 -10451 -2565 9664 12324 5590 -1045 7938 -5277 -17797
11540a7797q130m241J7037J6860R202Q715Q650J2716o729j3105p253p765q404
$$ -17797 -25927 -30168 -13131 3729 12931 21646 30296 43012 36283 23178 15925 8160 -244
11527b44o585J2141K2554J8833M005l6510j4416j0287o144J7706q83k2822j4097
$$ -244 -6829 5312 27866 46699 50704 14194 -222 -10509 -16653 1053 170 -22652 -36749
11514c6749m932J4771K8209J4740k2572M63p276k869J4536J0474R574q407J0924
$$ -36749 -41681 -26910 1299 16039 -6533 -6070 -13346 -16215 -1679 8795 18369 9962 20886
11501B0886M786L0808q223m962k987k3906Q413j10o16j3587j951l842L731J2200
$$ 20886 25672 56480 48257 43295 40308 16402 24815 24705 24089 10502 8551 4709 8440 20640
11487B0640j0516j2619J1006M588N787K1074K0602O748L9529K8589K4548K7831
$$ 20640 10124 -2495 8511 13099 18886 39960 60562 67310 106839 135428 159976 187807
11475A87807O4276L4819J5161J3838k4140m5882l4368l1268l5231m0340l1253
$$ 187807 252083 286902 302063 315901 291761 245879 211511 180243 145012 104672 73419
11464G3419j7372j5808k0129n049R417J3039J0881Q682Q439k3324k1861n232j3048
$$ 73419 56047 40239 20110 15061 24478 37517 48398 57080 65519 42195 20334 15102 2054
11451B054l140J1934K768p003j383p277L526J0041R293M398p250j0896j8322k835
$$ 2054 -1086 10848 13616 6613 5230 -2047 1479 11520 20813 25211 17961 7065 -11257 -14092
11437a4092Q574J1339m599P934L870n451M232p914J8047J2513J2767l327o570
$$ -14092 -5518 5821 1222 9156 13026 7575 11807 3893 21940 34453 47220 43893 37323
11424C7323j438o940O709j1737j5073k974J5807J6077M949N43R911Q862K0029
$$ 37323 35885 28945 35654 23917 8844 5870 21677 37754 42703 43246 53157 62019 82048
11411H2048J9791J0844K9566L1944M2646O5377Q0924Q1761P2062N0825n798l7516
$$ 82048 101839 112683 142249 174193 216839 282216 363140 444901 516963 567788 561990 524474
11399E24474n4777n0980o4658p0697l4523j5738l8242l0976j1489n190p311k0124
$$ 524474 469697 418717 354059 283362 248839 233101 194859 163883 152394 147204 139893 119769
11387A19769k6726l0220j9555p13Q879P321Q930p636j7881O279L89l374p907J1631
$$ 119769 93043 62823 43268 42555 51434 58755 67685 60049 42168 48447 48836 45462 37555 49186
11373D9186K206k1164k683j0992j6635K2327Q439j4703j5359q096M440J7612N001
$$ 49186 51392 30228 27545 16553 -82 22245 30684 15981 622 -7474 -3034 14578 19579
11360A9579J4148j5618k0461j9719O670P392N918J4197L623J5167r400o063Q641
$$ 19579 33727 18109 -2352 -22071 -15401 -8009 -2091 12106 15729 30896 21496 15433 24074
11347B4074J5528j6624Q13M408k118j1394j4554o567j2473J01j349J0773k650
$$ 24074 39602 22978 23791 28199 26081 14687 133 -6434 -18907 -18806 -20155 -9382 -12032
11334a2032l12K4707J6800j1300k6907k92K1293J5835k110j1381r160j161J367
$$ -12032 -12344 12363 29163 17863 -9044 -9336 11957 27792 25682 14301 5141 3980 5347
11321E347J098n805L614J020L406O867o918j3746j893L297R753p63m961M751J374
$$ 5347 6445 640 4254 5274 8680 15547 8629 -5117 -7010 -3713 6040 5277 316 5067 6441
11306F441M693J5176k123j6864J1170K297J068J2762L514J2042j2349o195o746
$$ 6441 11134 26310 24187 7323 18493 20790 21858 34620 38134 50176 37827 31632 24886
11293B4886J1997j2465L101J0842q757r212O728K991Q477k0826j5574L1074L0047
$$ 24886 36883 24418 27519 38361 29604 20392 27120 30111 38588 17762 2188 33262 63309
11280F3309M1923N5074M3830K2481K3306J756k1510l5831m2819l4132j8834l626
$$ 63309 105232 160306 204136 226617 249923 251679 230169 194338 151519 117387 98553 94927
11268I4927l5059k2394m681K62k9410k6583K063J117O398J7166J4798M237j1855
$$ 94927 59868 37474 32793 33055 3645 -22938 -20875 -19758 -13360 3806 18604 22841 10986
11255A0986p963O164j1408K4085M732o078n304j8757O04R90K686Q831Q968P578
$$ 10986 3023 9187 -2221 21864 26596 20518 15214 -3543 -2939 -1949 737 9568 18536 26114
11241B6114j3141q374J5931Q406J1091J3558k216J305L1483J2729P006K0799k6207
$$ 26114 12973 4599 20530 28936 40027 53585 51369 52674 84157 96886 103892 124691 98484
11228I8484k1209j365m455p035K0568n239l2116k1006n371M147Q757j1808NJ5145
$$ 98484 77275 75910 71455 64420 84988 79749 47633 26627 21256 25403 34160 22352 22357 37502
11214C7502Q630k489k1355r224M846R036P530J109J1013Q749j8949q091J7065
$$ 37502 46132 43643 22288 13064 17910 26946 34476 35585 46598 55347 36398 28307 45372
11201D5372J9450l012j370p150j4302p4K903K2126K7132L8491J1481N445j9854
$$ 45372 64822 61810 60440 53290 38988 38914 41817 63943 91075 129566 141047 146492 126638
11188A26638j2637j9634k119k255k1776j6413j1168J0480P640R780j6139O338
$$ 126638 114001 94367 92248 89993 68217 51804 40636 51116 58756 68536 52397 58735
11176E8735N147N680J2440Q26j9016j4774l052m232p256J2039K5275K8084K2246
$$ 58735 63882 69562 82002 82828 63812 49038 45986 41754 34498 46537 71812 99896 122142
11163A22142J8815K2336L2030R415p385k2977l2050r28l739j5082R953O392k814
$$ 122142 140957 163293 195323 204738 197353 174376 142326 141398 137659 122577 132530 138922 136108
11150A36108l087j3044k073J2088M931j5052k4518l5221j1792k978r151j9835
$$ 136108 133021 119977 117904 129992 134923 119871 95353 60132 48340 45362 36211 16376
11138A6376l432P98Q266q269Q781J4584O595k0649n162m01j2304n649L452K3648
$$ 16376 12944 13742 22008 13739 22520 37104 43699 23050 17888 17487 5183 -466 2986 26634
11124B6634J9700N128J283p214l409J2495K0342j3831o212m822q616p669N190
$$ 26634 46334 51462 52745 45531 42122 54617 74959 61128 54916 50094 41478 33809 38999
11111C8999J0704L5033K7240Q602o9K440K4j3716j2485J37j3510L462P026j5727
$$ 38999 49703 84736 111976 120578 120509 122949 122973 109257 96772 96909 83399 86861 93887 78160
11097G8160j1526n555J6474P91o906r76k5081l080l094M883J8567n482n749K1154
$$ 78160 66634 61079 77553 78344 71438 70462 45381 42301 39207 44090 62657 57175 51426 72580
11083G2580L1076N681j4586k02K264P299j3097k5335q450q563J3415K094l5575
$$ 72580 103656 109337 94751 94549 96813 104112 91015 65680 57230 48667 62082 64176 28601
11070B8601j9148J3054O324l397j0261L091L206l333K2702K1254m313j7521j2176
$$ 28601 9453 22507 28831 25434 15173 18264 21470 18137 40839 62093 57780 40259 28083
11057B8083N982J3026J7295k752N513k94j5749m041R93Q636L654j3893j4413R861
$$ 28083 34065 47091 64386 61634 67147 66853 51104 47063 48056 56692 60346 46453 32040 41901
11043D1901J0781o546J861K827K910J7239q051k2142o077j6287O530K1035o527
$$ 41901 52682 46136 47997 50824 53734 70973 62922 40780 34703 18416 24946 45981 39454
11030C9454J3009L1250L4916K9425j706j7824r767o534j1562m908l8332j1237
$$ 39454 52463 83713 118629 148054 146348 128524 118757 112223 100661 95753 57421 46184
11018D6184K2911J1538q591m7016j5176J8263Q980P755J4589J719M76k0109j8353
$$ 46184 69095 80633 72042 25026 9850 28113 37093 44848 59437 61156 61632 41523 23170
11005B3170j2498K453K843q777M044J7479Q568R561N834K941K945J4124j6718
$$ 23170 10672 13125 15968 7191 11235 28714 37282 46843 52677 55618 58563 72687 55969
10992E5969j6895n37K746j8592k2807J518J2673P913L746P764L230J4292J630
$$ 55969 39074 38537 41283 22691 -116 1402 14075 21988 25734 33498 36728 51020 52650
10979E2650j3146k1224J095J9781L4990K206p792j4588p961j2465n02J9396n784
$$ 52650 39504 18280 19375 39156 74146 76352 68560 53972 46011 33546 33044 52440 46656
10966D6656n079j927m770r965m881K949K3912J3059l234q359j2564O538K3833
$$ 46656 41577 39650 34880 24915 20034 22983 46895 59954 56720 48361 35797 42335 66168
10953F6168O652m81m996j3645k1711k39J1317K14k7033k1936k9444J5944K4775
$$ 66168 72820 72339 67343 53698 31987 31748 43065 43279 16246 -5690 -35134 -19190 5585
10940E585P103O27K371m768j0150J8747K4768J0527J4224j9889j1379J3499m881
$$ 5585 12688 13315 15686 10918 768 19515 44283 54810 69034 49145 37766 51265 46384
10927D6384q025J0903n194J4981K7701J6021M303j468J2371K1191p194O093K1979
$$ 46384 38359 49262 44068 59049 86750 102771 107074 105606 117977 139168 131974 138067 160046
10914A60046J3346j1676M3507Q2893R4238R6228J30132J75172K44477K96640K93227
$$ 160046 173392 161716 205223 288116 382354 478582 608714 783886 1028363 1325003 1618230
10903A618230J84593J3247j14189j77818k22243k38364k11199j91731j33894r5004
$$ 1618230 1802823 1816070 1701881 1524063 1301820 1063456 852257 660526 526632 431628
10893D31628o6897m7395j9910k7439l4898N436J1782M611L3446R476k3057k7468
$$ 431628 364731 317336 297426 269987 235089 240525 252307 256918 290364 299840 276783 249315
10881B49315j8134k0686j2683j1321l3545l1085r835k5417k1003M728R298n300
$$ 249315 231181 210495 197812 186491 152946 121861 112026 86609 65606 70334 79632 74332
10869G4332j0031m469O425L608j2195J506P988r637j729K749j2052j7553R833
$$ 74332 64301 59832 66257 69865 57670 59176 67164 57527 55798 58547 46495 28942 38775
10856C8775J7734O162j0913l339k02j0849l507N474J1434o256R223K709K112k784
$$ 38775 56509 62671 51758 48419 48217 37368 33861 39335 50769 44513 53736 56445 58557 55773
10842E5773N943j4962o590m845J0470p099m840l804k187p993N320J497j6035l756
$$ 55773 61716 46754 40164 35319 45789 38690 33850 30046 27859 19866 25186 26683 10648 6892
10828F892N529J8786P945J624l802m957N058M370J1587L180m905j3006r562J0751
$$ 6892 12421 31207 39152 40776 36974 32017 37075 41445 53032 56212 51307 38301 28739 39490
10814C9490p098q862K0166j0254r549l191L660J3492p789Q82J7294J6253K3513
$$ 39490 32392 23530 43696 33442 23893 20702 24362 37854 30065 30947 48241 64494 88007
10801H8007q853n53m051k0042j1606J4846M835k2625j4919j2195j254L485N452
$$ 88007 79154 78601 74550 54508 42902 57748 62583 39958 25039 12844 11590 15075 20527
10788B0527P012Q078L189K985N034J1908k7259k104J4260J9875o829K325r701
$$ 20527 27539 35617 38806 41791 46825 58733 31474 29370 43630 63505 56676 59001 49300
10775D9300r100m303M605o81n277j5801J1169R682k533j1267J8200R568Q496k7264
$$ 49300 40200 35897 40502 39821 34544 18743 29912 39594 37061 25794 43994 53562 62058 34794
10761C4794l66R291J8546J6465J7975J955j2230j97J2949K115J213M762j575o584
$$ 34794 34428 43719 62265 78730 96705 98660 86430 86233 99182 101297 102510 107272 105697 99113
10747I9113P83J1006O575r500J775J4223J7716K1828K2135M5114M5141Q061r699
$$ 99113 99896 110902 117477 107977 109752 123975 141691 163519 185654 230768 275909 283970 274271
10734B74271J628l5595k7850l3430k6043r992q7K052r904j4580R707m311P933
$$ 274271 275899 240304 212454 179024 152981 142989 142902 144954 135050 120470 130177 125866 133799
10721A33799J5013O395k14q498j3931j2506p44o266j2756J0028q98Q583k2802
$$ 133799 148812 155207 154993 146495 132564 120058 119314 113048 100292 110320 109422 118005 95203
10708I5203M353K0083R128r498k671n216j6882N21J6814L7383K3209p054J0521
$$ 95203 99556 119639 128767 119269 116598 111382 94500 95021 111835 149218 172427 165373 175894
10695A75894j1665k1254j9181r495k077K428j2909k3236N202J7523j901M444L354
$$ 175894 164229 142975 123794 114299 112222 114650 101741 78505 83707 101230 99329 103773 107127
10682A07127K5724J6881K2857J7994J2977J0603k3394k4328l7833j8052j4121
$$ 107127 132851 149732 172589 190583 203560 214163 190769 166441 128608 110556 96435
10671I6435k261L165j1898j2033p810J3482O101n998Q245K4737J1431M791N807
$$ 96435 94174 97339 85441 73408 65598 79080 85181 79183 87428 112165 123596 128387 134194
10658A34194M431k9181k1832m078l343J2628K2174L699m518j5700j2099J1509
$$ 134194 138625 109444 87612 83534 80191 92819 114993 118692 114174 98474 86375 97884
10646I7884J0643j908J1696R323k1311q516J966K0801L1713J6843Q997m454n422
$$ 97884 108527 106619 118315 127638 106327 97811 99777 120578 152291 169134 178131 173677 168255
10633A68255j2465k899j3557R86K7154L5339Q753M281j0881l321J6364L7865K9738
$$ 168255 155790 152891 139334 140320 167474 202813 211566 215847 204966 201645 218009 255874 285612
10620B85612K4254N931M231o212j8821L512J2921K4189N7770O9965Q4397P7381
$$ 285612 309866 315797 320028 313816 294995 298507 311428 335617 393387 463352 547749 625130
10608F25130L9411k93k7125m0082k0777j7852j9699k623l3761l8081k7441k5111
$$ 625130 664541 664248 637123 597041 576264 558412 538713 536090 502329 464248 436807 411696
10596D11696k7443k690R008J623K9203J3948P677R594P181J0931n849P809m169
$$ 411696 384253 381563 390571 392194 421397 435345 443022 452616 459797 470728 464879 472688 468519
10583D68519P992k1914K8L2360M2987K5126J3840k200J7758K3590K2212o572O897
$$ 468519 476511 454597 454625 486985 529972 555098 568938 566738 584496 608086 630298 623726 630623
10570F30623M1473L5795L1772J6062L1208J1984j987O116L3386J9439L111L580
$$ 630623 672096 707891 739663 755725 786933 798917 796930 803046 836432 855871 858982 862562
10558H62562L6707N9474M6742M0097O4461J00778J21193P3464O2976N5419J7345
$$ 862562 899269 958743 1005485 1045582 1110043 1210821 1332014 1405478 1468454 1523873 1541218
10547A541218q770o372l54m1476k8884J797J4635L3714L8945O8428O7959O9272
$$ 1541218 1532448 1526076 1525722 1484246 1455362 1457159 1471794 1505508 1544453 1612881 1680840 1750112
10535A750112N3761O1591L8181L5195O7575O2945L1742N8034R1919J00775J11106
$$ 1750112 1803873 1865464 1903645 1938840 2006415 2069360 2101102 2159136 2251055 2351830 2462936
10524B462936J73661J93273J99053K38589K37075K53910K87551K99475L16410
$$ 2462936 2636597 2829870 3028923 3267512 3504587 3758497 4046048 4345523 4661933
10515D661933L45365L53036L72259L65603L90332M17540M34442N12985O36209
$$ 4661933 5007298 5360334 5732593 6098196 6488528 6906068 7340510 7853495 8489704
10506H489704P45245R02797J110396J199095J257418J333110J437618J673802
$$ 8489704 9234949 10137746 11248142 12447237 13704655 15037765 16475383 18149185
10498A8149185K033857K524775L221277M134661N313982O917096R167696J2340866
$$ 18149185 20183042 22707817 25929094 30063755 35377737 42294833 51462529 63803395
10490F3803395J6882683K3388078L2692548M4873950N6884502N8934602M0687740
$$ 63803395 80686078 104074156 136766704 181640654 238525156 297459758 338147498
10483C38147498Q822643j7297460l1934765m1186955m5971208m3561051l5725433
$$ 338147498 346970141 329672681 297737916 256550961 210579753 167018702 131293269
10476A31293269k6830439j9466347j4050565j0169156p357952n245816l571769
$$ 131293269 104462830 84996483 70945918 60776762 53418810 48172994 44601225
10469D4601225k117605p03199N51342J293639Q53190p26957k365707l375352l948230
$$ 44601225 42483620 41780421 42331763 43625402 44478592 43751635 41385928 38010576 34062346
10460C4062346m245746m101386l588723k948027k346857j892012j551567j270003
$$ 34062346 29816600 25715214 22126491 19178464 16831607 14939595 13388028 12118025
10452A2118025j059953r01897q03929o85344n79241n21225m50390l92669l60713
$$ 12118025 11058072 10156175 9352246 8666902 8087661 7566436 7116046 6723377 6362664
10443F362664l44134l14590l18457k95701k79424k95024k80483k55501k51349
$$ 6362664 6018530 5703940 5385483 5089782 4810358 4515334 4234851 3979350 3728001
10434C728001k14300j73472j60319j65580j32860j23105j03269j04109p9732q2608
$$ 3728001 3513701 3340229 3179910 3014330 2881470 2758365 2655096 2550987 2471255 2388647
10424B388647q8912p1228p3708p0023r3365r4353p0796p0108p2920o7195n9814
$$ 2388647 2299735 2228507 2154799 2084776 1991411 1897058 1826262 1756154 1683234 1616039 1556225
10413A556225o0223p5336o2458l8474m6733l6916l5114n7061m7881l9111m7206
$$ 1556225 1496002 1420666 1358208 1319734 1273001 1236085 1200971 1143910 1096029 1056918 1009712
10402A009712k8380m7803l8570k4704j5624l7261k1147l2290k1651q237p644j9628
$$ 1009712 981332 933529 894959 870255 854631 817370 796223 763933 742282 734045 726401 706773
10390G06773N61j925R459j6009l3560j7232j9030j7258j2792k558j1231k424j6252
$$ 706773 707334 705409 714868 698859 665299 648067 629037 611779 598987 596429 585198 582774 566522
10377E66522j1587j1702P713k684j3789j0418k2876o771n567l3384k0424L484
$$ 566522 554935 543233 550946 548262 534473 524055 501179 494408 488841 455457 435033 438517
10365D38517P05j8431k5196R594K5207J9578p379k1752k9552J5455J9339j652
$$ 438517 439222 420791 395595 405189 430396 449974 442595 420843 391291 406746 426085 424433
10353D24433Q927K58k2545l7171j6499n272k2724j4398j5775L11J031K8505J4028
$$ 424433 433360 433618 411073 373902 357403 352131 329407 315009 299234 299545 300576 329081 343109
10340C43109J392j6725q202K5475J5510k62p125k0314l5625l0265J8158O367M381
$$ 343109 344501 327776 319574 345049 360559 360297 353172 332858 297233 266968 285126 291493 295874
10327B95874Q878p955J75j0239L123Q791m238m056r705k5503k908L838J6919M261
$$ 295874 304752 296797 296972 286733 289856 298647 294409 290353 280648 255145 252237 256075 272994 277255
10313B77255l441m274j6975N094r555r461l024r586R710q660N415P068R341K2661
$$ 277255 273814 269540 252565 257659 248104 238643 235619 226033 235743 227083 232498 239566 248907 271568
10299B71568N3J6465K6306j2515l6419k9855o763k2290k9567N245k237j8481q808
$$ 271568 271621 288086 314392 301877 265458 235603 228840 206550 176983 182228 179991 161510 152702
10286A52702q568J5609K5232m684R676N218J2457M9k127n307K144N661l0693j1697
$$ 152702 144134 159743 184975 180291 189967 195185 207642 207691 205564 200257 202401 208062 177369 165672
10272A65672J3514M428o463m161J5891J4091n097j9142p975L784j166n435r526
$$ 165672 179186 183614 177151 172990 188881 202972 197875 178733 170758 174542 173376 167941 158415
10259A58415j4187J019K0914r624k511J0966N439j382j892k0166l310J1683Q404
$$ 158415 144228 145247 166161 156537 154026 164992 170431 169049 167157 146991 143681 155364 163768
10246A63768K0270m809k103K0034J0977K87K1J8398J5238K2734K1633O751K4267
$$ 163768 184038 179229 177126 197160 208137 208424 208445 226843 242081 264815 286448 293199 317466
10233C17466L7184M2892L4703L5004L7122P6037Q0475P3534N5997M1900J2322
$$ 317466 354650 397542 432245 467249 504371 580408 660883 734417 790414 832314 844636
10222H44636K2722M1518P2638J28671J54246K14272K75286K38254J42621K6566
$$ 844636 867358 908876 981514 1110185 1264431 1478703 1753989 1992243 2134864 2161430
10212B161430n8123r5186j13828q7929m6864k8491k8241o0642p9373o6067n7566
$$ 2161430 2103307 2008121 1894293 1806364 1759500 1731009 1702768 1642126 1562753 1496686 1439120
10201A439120n9112n0789k8476K9146O3956J24040J99642L46074O00076R37577
$$ 1439120 1380008 1329219 1300743 1329889 1393845 1517885 1717527 2063601 2663677 3601254
10191C601254J378228J626754J353499N05645l45137q22893j061470j175928j173614
$$ 3601254 4979482 6606236 7959735 8465380 8120243 7297350 6235880 5059952 3886338
10182C886338r46706o58025m24131k94059j79658j05736n3142k0879j6743k9430
$$ 3886338 2939632 2281607 1857476 1563417 1383759 1278023 1224881 1204002 1187259 1157829
10172A157829o8901o5234o6033q3638j03826o9462m8285o1537n9245m1350j8525
$$ 1157829 1088928 1023694 957661 874023 770197 700735 652450 590913 531668 490318 471793
10161D71793J5039L418K925J9083K3994M4932J33932J83503J85298K07624K12465
$$ 471793 486832 490250 493175 512258 536252 581184 715116 898619 1083917 1291541 1504006
10150A504006J05556q958p8946j40181k09564j84834j47181j29659j35172r7505
$$ 1504006 1609562 1600604 1521658 1381477 1171913 987079 839898 710239 575067 477562
10140D77562m5197n6602n3470l0388k7264j8558l324K174j4017n269j1013k4582
$$ 477562 432365 375763 322293 291905 264641 246083 242759 244933 230916 225647 214634 190052
10128A90052n775P500J2415J1731j1389R708R804r79k0168j3429l5940k6656j7990
$$ 190052 184277 191777 204192 215923 204534 214242 224046 223067 202899 189470 153530 126874 108884
10115A08884q349O601M327M450J5204M939q813q250j3775r634J6734m836O9o148
$$ 108884 100535 107136 111463 115913 131117 136056 127243 118993 105218 95584 112318 107482 107551 101403
10101A01403K5700J0367J0707j807J5041k3493j6749l798m851k1106j1383J4252
$$ 101403 127103 137470 148177 146370 161411 137918 121169 117371 112520 91414 80031 94283
10089I4283J4260J2102m80J0588N267J58M569m0584j174O399J0274J1054K1018
$$ 94283 108543 120645 120165 130753 136020 136178 140747 100163 98989 105388 115662 126716 147734
10076A47734K670M264M318J4810J9463O699J6723K9518K4978L5701O3651P0981
$$ 147734 150404 154668 158986 173796 193259 199958 216681 246199 271177 306878 370529 441510
10064D41510J02499J49176J92010K51495K83522K82956J57132K117j16631k11354
$$ 441510 544009 693185 885195 1136690 1420212 1703168 1860300 1862417 1745786 1534432
10054A534432k50178k31013k01019j79882j15067r2997p0966p6031k8414P830
$$ 1534432 1284254 1053241 852222 672340 557273 464276 393310 317279 288865 296695
10044B96695n109j6800j392J9644p544j8034L233k4408k0808j3239k1112j4895
$$ 296695 291586 274786 273394 293038 285494 267460 270693 246285 225477 212238 191126 176231
10032A76231k3090l403O135j6414q462j4431j3047K5606j346N309m808j3080l0223
$$ 176231 153141 149738 155873 139459 130997 116566 103519 129125 127779 133088 128280 115200 84977
10019H4977j1416j4529k6505L20M794o581J4046R206o016p465k442J5625o613
$$ 84977 73561 59032 32527 32847 37641 31060 45106 54312 48296 40831 38389 54014 47401
10006D7401J1326k146j1935q339J8854J8027l256M814k0133j0135n973J1664J4549
$$ 47401 58727 56581 44646 36307 55161 73188 69932 74746 54613 44478 38505 50169 64718
9993F4718l752j262J0784k0463j8446q633j1304J56J2297K2096l290N18L2143
$$ 64718 60966 59704 70488 50025 31579 22946 11642 11798 24095 46191 42901 43419 75562
9980G5562J0988j7577j4987L076J2030p664N880j0979k204j8647j8554J4866L424
$$ 75562 86550 68973 53986 57062 69092 61428 67308 56329 54125 35478 16924 31790 35214
9967C5214Q273J1981j8667k4083J2290J2263L353n935K166j3592j6353J7673o283
$$ 35214 43487 55468 36801 12718 25008 37271 40624 34689 36855 23263 6910 24583 18300
9954A8300j0505N008N045k132j156Q485K2084P46l4104M431k703j358J7408J2798
$$ 18300 7795 12803 17848 15716 14560 23045 45129 45875 11771 16202 13499 12141 29549 42347
9940D2347P677M260N567k0530j9081k126j0678k772J2301J7337J7358k94j2961
$$ 42347 50024 54284 59851 39321 20240 18114 7436 4664 16965 34302 51660 51366 38405
9927C8405j1155N131k417j3682q04R046J1640j6571j1498j908K1778Q040M228
$$ 38405 27250 32381 29964 16282 15478 24524 36164 19593 8095 6187 27965 36005 40233
9914D0233j4031j6170L725J0687q345J5807O928j6364k2367P152l069Q288J8745
$$ 40233 26202 10032 13757 24444 16099 31906 38834 22470 103 7255 4186 12474 31219
9901C1219M77M568N62j583J0665O199j3218J4674J1956P290n176p537j1507k1218
$$ 31219 31696 36264 36826 35243 45908 52107 38889 53563 65519 72809 67633 60096 48589 27371
9887B7371n248K2377J254p473l848p45R887r59O281N86J4426O787l241j3387j3880
$$ 27371 22123 44500 45754 38281 34433 33688 43575 42616 48897 49483 63909 70696 67455 54068 40188
9872D0188j5015q899M317k2710O776J6299N97j964j5220O246K0484J0863J4901
$$ 40188 25173 16274 20591 -2119 4657 20956 21553 19589 4369 10615 31099 41962 56863
9859E6863P046P779p339j8567j2744J645J2004m606j1796p882J2627j2843N527
$$ 56863 63909 71688 64349 45782 33038 34683 46687 42081 30285 22403 35030 22187 27714
9846B7714O712N731R958r83k125M918o667q989j0379k134j4532m049j1094J7710
$$ 27714 34426 40157 50115 49132 47007 51925 45258 36269 25890 23756 9224 5175 -5919 11791
9832A1791O664r865m682J8868M568j4171k691P621L238j3502j5091o7P044J7444
$$ 11791 18455 8590 3908 22776 27344 13173 10482 18103 21341 7839 -7252 -7319 -275 17169
9818A7169K261j270j107p452L319P44P125J4342J1647Q418J8101J0218j0581k1513
$$ 17169 19430 18160 17053 9601 12920 13664 20789 35131 46778 55196 73297 83515 72934 51421
9804E1421j8520j400m109O41O325P843k0783j8233L30J6880M118p91m678J2823
$$ 51421 32901 31501 27392 28033 34358 42201 21418 3185 3515 20395 24513 23722 19044 31867
9790C1867p685n788j004J0L512k349j5537K4831j0535n713P693J2171L586k281
$$ 31867 24182 18394 17390 17400 20912 18563 3026 27857 17322 11609 19302 31473 35059 32778
9776C2778M467j660j7741q56m561m675Q655m314K7215k364O953N658R480O543
$$ 32778 37245 35585 17844 16988 12427 7752 16407 12093 39308 36944 43897 49555 59035 65578
9762F5578M732l290l968M533k675M051J1694L956J1378j654K567p693j032j7443
$$ 65578 70310 67020 63052 67585 64910 68961 80655 84611 95989 94335 96902 89209 88177 70734
9748G0734m928n932j2812p81J0236J5627j6926k4265j863J773O974R323r822p131
$$ 70734 65806 59874 47062 46281 56517 72144 55218 30953 29090 30863 37837 47160 37338 30207
9734C0207J1353k371K0570K6170j6509l8759j8787J2083K4215J220l0940j9863
$$ 30207 41560 39189 59759 85929 69420 30661 11874 23957 48172 49392 18452 -1411
9722a411M922J6822j5736M875N022J4071M836k6171p843J8543Q956M456L34j3294
$$ -1411 3511 20333 4597 9472 14494 28565 33401 7230 -613 17930 26886 31342 31676 18382
9708A8382R333J1326M113k7325j9068P932N085j754m192O960j3489j0051j589
$$ 18382 27715 39041 43154 15829 -3239 4693 9778 8024 3832 10792 -2697 -12748 -14337
9695a4337j5129l444p632j05K2801K167k0600J236P283J1312J5943J6149P023
$$ -14337 -29466 -32910 -40542 -40647 -17846 -15679 -36279 -35043 -27760 -16448 -505 15644 22667
9682B2667j3973k0968j434J3059N614n695m059q719j601r12K9530J4643J3401
$$ 22667 8694 -12274 -13708 -649 4965 -730 -4789 -13508 -15109 -16021 13509 28152 41553
9669D1553J1154J196j6912j6589j2190L563j4417J15O972K8227K202j5716j1742
$$ 41553 52707 53903 36991 20402 8212 11775 -2642 -2527 4445 32672 34874 19158 7416
9656G416j906J7968J4304J433j4752J1119J4367j9374k0655N311J690j6172o027
$$ 7416 5510 23478 37782 39215 24463 35582 49949 30575 9920 15231 16921 749 -5278
9643e278J1823J1005J625J9298j474P34J9162M794j6693k4861q444J4498n518
$$ -5278 6545 17550 19175 38473 36999 37733 56895 61689 44996 20135 11691 26189 20671
9630B0671j8060r484J8594J8907r521j1025n025j2002j6285J6171J3074R481M639
$$ 20671 2611 -6873 11721 30628 21107 10082 5057 -6945 -23230 -7059 6015 15496 20135
9617B0135J6852m670K267L675p90j8019j4973l412J530l526l883J0393p926K690
$$ 20135 36987 32317 34584 38259 37469 19450 4477 1065 2595 -931 -4814 5579 -2347 343
9603C43k034m911k720j0213j1418N792J9513J9800J0850j6382m493K2757M333
$$ 343 -1691 -6602 -9322 -19535 -30953 -25161 -5648 14152 25002 8620 4127 26884 31217
9590C1217r065k7069j0031J4343J4918J3358j032P373J1815J6454q0k2517l410
$$ 31217 22152 -4917 -14948 -605 14313 27671 26639 34012 45827 62281 62201 39684 36274
9577C6274N806l078m464j7029m314l911j4465m61J0292J7227j94o29j5261m422
$$ 36274 42080 39002 34538 17509 13195 9284 -5181 -5642 4650 21877 21683 21054 5793 1371
9563A371j1792M86J5371J8578J3587N0j0668k0285k308J3809r814J313J1876Q720
$$ 1371 -10421 -9935 5436 24014 37601 37651 26983 6698 4390 18199 8385 9698 21574 30294
9549C0294N416j3475K686J1102J2762k469J9901K947k2948j7056j7330r261k0377
$$ 30294 35710 22235 24921 36023 48785 46316 66217 69164 46216 29160 11830 2569 -17808
9536a7808k3011k594J0956P256M389m891K5241p666O660K1427K168O31n504L412
$$ -17808 -40819 -43413 -32457 -25201 -20812 -25703 -462 -8128 -1468 19959 22127 22758 17254 20666
9522B0666r747n565K0383r988m846J1859k799J136k410o363J2967k520N527J4682
$$ 20666 10919 5354 25737 15749 10903 22762 19963 21099 18689 12326 25293 22773 28300 42982
9508D2982l085j1499K946n447j3937J2484J8945K667k198M032Q13j2448R684l40
$$ 42982 39897 28398 31344 25897 11960 24444 43389 46056 43858 47890 48703 36255 45939 45599
9494D5599j7175m562L426p509n876j9027L881O552J3795N342p776j0762p43R879
$$ 45599 28424 23862 27288 19779 13903 -5124 -1243 5309 19104 24446 16670 5908 5165 15044
9480A5044O224N840M381o34l766n254n90p786M602j829K44p512o752J5122J0438
$$ 15044 21268 27108 31489 30855 27089 21835 21245 13459 18061 16232 16476 8964 2212 17334 27772
9465B7772j490k2287K300J6622P330N713N75j0800k2997k7712J6756J8160J2369
$$ 27772 26282 3995 6295 22917 30247 35960 36535 25735 2738 -24974 -8218 9942 22311
9452B2311K4145J1527j8571q298n397n253r351p929O065j16N273J97m634J1091
$$ 22311 46456 57983 39412 31114 25717 20464 11113 3184 9249 9133 14406 14603 9969 21060
9438B1060M723j3695J695o809J2316J6006j2028j6815M438k92j543J824J1420
$$ 21060 25783 12088 13783 6974 19290 35296 23268 6453 10891 10599 9056 10880 22300
9425B2300j581R232L653j3740j1633J3341O173K066k1118o50J4598k1702j0447
$$ 22300 20719 29951 33604 19864 8231 21572 27745 29811 8693 8043 22641 939 -9508
9412i508J7701K6433J5552j409n432r237k347k5382L820Q766M720Q641n52P90
$$ -9508 8193 34626 50178 48769 43337 34100 31753 6371 10191 18957 23677 32318 31766 32556
9398C2556K235j522j0863l757M619l569J0425J302o343K242L1001K298r735J747
$$ 32556 34791 33269 22406 18649 23268 19699 30124 31426 25083 27325 58326 60624 50889 52636
9384E2636k260r218j104R223j5439k3033o115Q078J3703J2532l961Q548J2923
$$ 52636 50376 41158 40054 49277 33838 10805 4690 12768 26471 39003 35042 43590 56513
9371E6513j0060q358m640J0800K297j7850Q2O29M800m333P383J7371M508j634
$$ 56513 46453 38095 33455 44255 46552 28702 28784 29413 34213 29880 37263 54634 59142 57508
9357E7508K5l721j6496p417L7j9588n098J7187L34J597j1959k793P573J1299K4038
$$ 57508 57533 53812 37316 29899 29936 10348 5250 22437 22771 24368 12409 9616 17189 28488 52526
9342E2526k671k0208j818m046j649J981l663J846J1699P010q362R620J193p613
$$ 52526 49855 29647 27829 23783 22134 24115 20452 22298 33997 41007 32645 42265 43458 35845
9328C5845o790j5172n370j530m769J6084n471k0239R35R091P547o629q996M837
$$ 35845 29055 13883 8513 6983 2214 18298 12827 -7412 -6477 2614 10161 3532 -5464 -627
9314f27L3529K286q146J2328l461j4257k1586q092J4878K2169K2682j9946k5328
$$ -627 32902 35188 27042 39370 35909 21652 66 -8026 6852 29021 51703 31757 6429
9301F429q456R887J7490K427J7094j967j815L63j802P68N620K3069o952k674o061
$$ 6429 -2027 7860 25350 27777 44871 42904 41089 41452 39650 40418 46038 69107 62155 59481 53420
9286E3420j8345J235N055J5545o392n885l46J6942K665k1372k1766j229J5623
$$ 53420 35075 36310 41365 56910 50518 44633 44287 61229 63894 42522 20756 19527 35150
9273C5150J0875J2397k3702j7164n027K118J9395k313K163j2595R67q864J3401
$$ 35150 46025 58422 34720 17556 12529 14647 34042 31729 33892 21297 22264 13400 26801
9260B6801J857p100P144o854j4948M967J7742Q259M030q392Q7n202R487J0876
$$ 26801 28658 21558 28702 21848 6900 11867 29609 37868 41898 33506 33593 28391 37878 48754
9246D8754l42q230m442n145P784O852j4009j198J751J0427R54O444L689L864j061
$$ 48754 48412 40182 35740 30595 38379 45231 31222 30024 31775 42202 43156 49600 53289 57153 56092
9231E6092p317k3555j1241r76K0355J0075p882M30L060Q475m044q272K743j340
$$ 56092 48775 25220 13979 13003 33358 43433 35551 35981 39041 47516 43472 35200 37943 36603
9217C6603K1995K0179q44q179j2235r174o264J0978R409j834l860R288j1467j4751
$$ 36603 58598 78777 77933 69754 57519 48345 42081 53059 62468 60634 56774 66062 54595 39844
9203C9844P033R32J2517p125j0761m707K7529J3059j3006J1621J562j5557P5J8000
$$ 39844 46877 47809 60326 53201 42440 37733 65262 78321 65315 76936 78498 62941 63016 81016
9189H1016j2992j844K6707j965k4866l691o843R266N04k877J849K0126J2250j7761
$$ 81016 68024 66180 92887 90922 66056 62365 55522 64788 65292 62415 64264 84390 96640 78879
9175G8879N213J0629N438j9918j7177j7472j840j6438N058K0903K388r056o976
$$ 78879 84092 94721 100159 80241 63064 45592 43752 27314 32372 53275 55663 46607 39631
9162C9631p2R538O884J1261o971m544p255m5J6454K19m406r308j0709j1464J8419
$$ 39631 39559 49097 55981 67242 60271 55727 48472 48427 64881 65100 60694 51386 40677 29213 47632
9147D7632K1268J1949j6874j4064P794J0924l410n171j5688j4124Q855K295l363
$$ 47632 68900 80849 63975 49911 57705 68629 65219 60048 44360 30236 39091 41386 38023
9134C8023J6585l601J0816J5965p970j7496j0363O159J3647k273j709J6367J8971
$$ 38023 54608 51007 61823 77788 69818 52322 41959 48118 61765 59492 57783 74150 93121
9121I3121N388r232P205J702o273j8861j3739J8101L0397M649O040N838J1298
$$ 93121 98509 89277 96482 98184 91911 73050 59311 77412 107809 112458 118498 124336 135634
9108A35634O964n067j1427j1181M117Q244R761L986N635R869J2600j2707j3401
$$ 135634 142598 137531 126104 114923 119040 127284 137045 141031 146666 156535 169135 156428 143027
9095A43027L823L486O963K960j8424k0727J0157J1291K542L145N740J3841J040
$$ 143027 146850 150336 157299 160259 141835 121108 131265 142556 145098 148243 153983 167824 168864
9082A68864k4247N54j8461k0046q8n930j4443p364J4005J3525J1327J1067J752
$$ 168864 144617 145171 126710 106664 106576 100646 86203 78839 92844 106369 117696 128763 130515
9069A30515p68j4467l651O110K8936J8299j379j9498k205l1056L816P344k732
$$ 130515 129747 115280 111629 117739 146675 164974 163595 144097 141892 110836 114652 121996 119264
9056A19264J069J1222p743Q389o724J725J3087j8083n188J5985r23J3880k968
$$ 119264 120333 131555 123812 132201 125477 127202 140289 122206 117018 133003 132080 145960 142992
9043A42992J861N246n779j8812Q318J8494N895J9322K671j0165J375j0839n038
$$ 142992 144853 150099 144320 125508 133826 152320 158215 177537 180208 170043 171418 160579 155541
9030A55541L0992M075p598r217Q940l12m900m128M806o88n093n738N694J5699
$$ 155541 186533 190608 183010 173793 182733 182421 177521 173393 178199 177511 172418 166680 172374 188073
9016A88073J4060Q527K458l903m718j4078L589N982Q91J0575J2367j236l417R293
$$ 188073 202133 210660 213118 209215 204497 190419 194008 199990 200881 211456 223823 222587 219170 228463
9002B28463K854j0167k4038R261K3473r98j2248k88O402J1997n176P678R793J299
$$ 228463 231317 221150 197112 206373 229846 228848 216600 216312 222714 234711 229535 237213 247006 248305
8988B48305K0561n123j5543K203O223q591J9435J6566K76j543M528J5509K4474
$$ 248305 268866 263743 248200 250403 256626 248035 267470 284036 284312 282769 287297 302806 327280
8975C27280K1508K03k847J1084J2358L3922K2959j6275m58K0404O926j1366n788
$$ 327280 348788 348991 346144 357228 369586 403508 426467 410192 409734 430138 437064 425698 419910
8962D19910m336J2423J3853r645K3337K0617r512o035j3257O263Q063R50l084
$$ 419910 415574 427997 441850 432205 455542 476159 466647 460612 447355 453618 461681 462631 459547
8949D59547J5498L2929J7719J4349P810J4176J5122J3659O343J49M933K0993M344
$$ 459547 475045 507974 525693 540042 547852 562028 577150 590809 597152 597301 602234 623227 627571
8936F27571R086q048m925K2401O707J2082K5953R342K9144J4467K6710L5028J7480
$$ 627571 636657 628609 623684 646085 652792 664874 690827 700169 729313 743780 770490 805518 822998
8923H22998P82J1687M5397O204l269J111K7531M8361L1050J1150J4735L2730L1125
$$ 822998 823780 835467 880864 887068 883799 884910 912441 960802 991852 1003002 1017737 1050467 1081592
8910A081592K6459R143L1102L7413M0130L2906L6852M8625M5837N3215L2471M6281
$$ 1081592 1108051 1117194 1148296 1185709 1225839 1258745 1295597 1344222 1390059 1443274 1475745 1522026
8898A522026M8685R0207J00235N6425M4069N7685O1030O8093J05198Q8659Q5445
$$ 1522026 1570711 1660918 1761153 1817578 1861647 1919332 1980362 2048455 2153653 2242312 2327757
8887B327757J00026J04035J11698R8316J17556J42601J41964J64533J55916J60135
$$ 2327757 2427783 2531818 2643516 2741832 2859388 3001989 3143953 3308486 3464402 3624537
8877C624537J70343J99444K47983K41946K62366K55399K99125L38294L78489M00697
$$ 3624537 3794880 3994324 4242307 4484253 4746619 5002018 5301143 5639437 6017926 6418623
8867F418623M01420M58313M92888N63774O35833P17231P82801Q57257J007195
$$ 6418623 6820043 7278356 7771244 8335018 8970851 9688082 10470883 11328140 12335335
8858A2335335J104812J237891J385407J578709J772274J972446K210404K494122
$$ 12335335 13440147 14678038 16063445 17642154 19414428 21386874 23597278 26091400
8850B6091400K756325L025353L278690L482417L593231L582704L372287K943826
$$ 26091400 28847725 31873078 35151768 38634185 42227416 45810120 49182407 52126233
8842E2126233K302377J490529N61682m20553j306850k092245k678892l071945
$$ 52126233 54428610 55919139 56480821 56060268 54753418 52661173 49982281 46910336
8834D6910336l306348l370910l293730l130455k908561k660333k417980k185083
$$ 46910336 43603988 40233078 36939348 33808893 30900332 28239999 25822019 23636936
8826B3636936j969688j783658j594777j423258j288256j155248j038235r56562
$$ 23636936 21667248 19883590 18288813 16865555 15577299 14422051 13383816 12427254
8818A2427254q71118p71392p11611o49942n93382n35471m85497m49880m19336
$$ 12427254 11556136 10784744 10073133 9423191 8829809 8294338 7808841 7358961 6939625
8809F939625l92783l41030l28773l14652k86826k72843k60863k26461k15522j98963
$$ 6939625 6546842 6205812 5877039 5562387 5275561 5002718 4741855 4515394 4299872 4100909
8799D100909j93488j73744j45006j41955j60169j33948j12354j02149j12990j31847
$$ 4100909 3907421 3733677 3588671 3446716 3286547 3152599 3040245 2938096 2825106 2693259
8789B693259j17348q7836r1469j01876o9159r2909p4505o4038n3472m8273n5176
$$ 2693259 2575911 2488075 2396606 2294730 2225571 2132662 2058157 1994119 1940647 1892374 1837198
8778A837198n2481l9898o2689p4030o4282n8507l7422m0924m2895l3911m8140
$$ 1837198 1784717 1744819 1682130 1608100 1543818 1485311 1447889 1406965 1364070 1330159 1282019
8767A282019l3404l2178n2577m0195j9554k0925l5302l6753k0602k9325k6489
$$ 1282019 1248615 1216437 1163860 1123665 1104111 1083186 1047884 1011131 990529 961204 934715
8756I34715k1035p993l0274k7917Q04j6206j9564k7456j0134j3927k5356m0987
$$ 934715 913680 905687 875413 847496 848300 832094 812530 785074 774940 761013 735657 694670
8744F94670p233J847o347L870M208r524l1017k0270r172j5357l060j7159k1689
$$ 694670 687437 689284 682937 686807 691015 681491 650474 630204 621032 605675 602615 585456 563767
8731E63767n667K172M329J546j1001k825J738k0311k6800j869k9605O071R974
$$ 563767 558100 560272 564601 566147 555146 552321 554059 533748 506948 505079 475474 481545 491519
8718D91519j6299k3653j2566j8780m092K4116k680k0942K7O041p347k801k4052
$$ 491519 475220 451567 439001 420221 416129 440245 437565 416623 416650 422691 415344 412543 388491
8705C88491J243j612J2140K0827k1071k1745K991K515j530j0828l184j7451r599
$$ 388491 389734 388122 400262 421089 400018 378273 381264 383779 382249 371421 368237 350786 341187
8692C41187q608k3455J750J6048O206j3964N823N852j0355j3502q404P243j1927
$$ 341187 332579 309124 310874 326922 333128 319164 324987 330839 320484 306982 298578 305821 293894
8679B93894O718o72j2256M077M756j5655R884J092j0585R7J429J1966N518j2641
$$ 293894 300612 299940 287684 291761 296517 280862 290746 291838 281253 281350 282779 294745 300263 287622
8665B87622j3707J4022m532j1867k4622q911J9543J6851J2058r081j2591j8293
$$ 287622 273915 287937 283405 271538 246916 238005 257548 274399 286457 277376 264785 246492
8653B46492n615o40j6643j0169M493J4846j346N294j2466q523M36p891K33l793
$$ 246492 240877 240237 223594 213425 217918 232764 231418 236712 224246 215723 216159 208268 208501 204708
8639B04708J9181J6301k048l2350L00Q53q226J9467O768K295j2927r418m893N883
$$ 204708 223889 240190 238142 205792 206092 206945 198719 218186 224954 227249 214322 204904 200011 205894
8625B05894L186o327K360k4781n15N722j0963l350n505Q416o490M916k607J5011
$$ 205894 209080 202753 205113 180332 179817 185539 174576 171226 165721 174137 167647 172563 169956 184967
8611A84967Q794L901Q400k6561j7303n84p151n1k111k058j0446o763j5260J0917
$$ 184967 193761 197662 206062 179501 162198 161614 154463 154412 152301 150243 139797 133034 117774 128691
8597A28691l412N03J1370K3486J2521l991j2471j2132j76j0299P103J1023P332
$$ 128691 125279 125782 137152 160638 173159 169168 156697 144565 144389 134090 141193 152216 159548
8584A59548j549J3241j9737l455J8225L1758j9090k0564r712k2682o053N747J9649
$$ 159548 157999 171240 151503 148048 166273 198031 178941 158377 148665 125983 119930 125677 145326
8571A45326o442k3632l932k045P624j2086j1389K13R482Q751L734J722k185j6611
$$ 145326 138884 115252 111320 109275 116899 104813 93424 93637 103119 111870 115604 117326 115141 98530
8557I8530m270J4924J0273l47r812q718j4366M067J4252J1766m441j4925O408
$$ 98530 94260 109184 119457 119110 109298 100580 86214 90281 104533 116299 111858 96933 103341
8544A03341j25j7707l74Q689J569P789j1633p930K4367o347k0587P931K0161P527
$$ 103341 103216 85509 85135 93824 95393 103182 91549 83619 107986 101639 81052 88983 109144 116671
8530A16671k2714k9110J1564O348M29o679K180Q594J1455j5119M453J9190Q669
$$ 116671 93957 64847 76411 82759 83188 76509 78689 87283 98738 83619 88072 107262 115931
8517A15931J4260J0520q372J2785k294k3138l1100j8581N781R094J0915j0778
$$ 115931 130191 140711 132339 145124 142830 119692 88592 70011 75792 84886 95801 85023
8505H5023r384O380m783M833L09j3822m893R444J0989k0690k18K2919j5649j4551
$$ 85023 75639 82019 77236 82069 82378 68556 63663 73107 84096 63406 63188 86107 70458 55907
8491E5907J8708n699o973k517K637m763K26M673J1812m127M564j3110q803p243
$$ 55907 74615 68916 61943 59426 62063 57300 57526 62199 74011 69884 74448 61338 52535 45292
8477D5292O283K3292R193q894K520O376j0093j2474k151J181N109k853j8569O448
$$ 45292 51575 74867 84060 75166 77686 84062 73969 61495 59344 60525 65634 62781 44212 50660
8463E0660K692J4959J0230K475q681n588N707J0131J756r480Q81j6601P641J7663
$$ 50660 53352 68311 78541 81016 72335 66747 72454 82585 84341 74861 75742 59141 66782 84445
8449H4445k081l495p458j8792J6261K4890J6232l5040l353K724k7372l886P405
$$ 84445 82364 78869 71411 52619 68880 93770 110002 74962 71609 74333 46961 43075 50480
8436E0480P12j67j1K793k393n02O1Q799m563M009m628j997N286j3163j3641K465
$$ 50480 51192 51025 51014 53807 51414 50912 50973 59772 55209 59218 54590 52593 57879 44716 31075 33540
8420C3540L1588K4668j6212j3828j0235n523K621O709l605K790J7764J991n22
$$ 33540 65128 89796 73584 59756 49521 43998 46619 53328 49723 52513 70277 72268 71746
8407G1746K023m133n79J1006j4682N078k093l2246k1821n651r415L641N042N945
$$ 71746 73769 69636 69057 80063 65381 70459 68366 36120 14299 8648 -767 2874 7916 13861
8393A3861M345L906R733j77P021J0383k801m047n441M117J2604k748j745J2278
$$ 13861 18206 22112 31845 31668 38689 49072 46271 42224 36783 40900 53504 50756 49011 61289
8379F1289m325J321j6454k6165J537J474j0215j278p835Q066R431L075L803J3662
$$ 61289 56964 58285 41831 15666 17203 18677 8462 7184 -651 7415 16846 19921 23724 37386
8365C7386l172j6560p097J7514l707j069J1310j3118j689j15J123j907P968J1543
$$ 37386 34214 17654 10557 28071 24364 23295 34605 21487 19798 19683 20806 18899 26867 38410
8351C8410o234P869L4062l805k1759K386N348r33j0693j1021o791K356Q79J211
$$ 38410 32176 40045 74107 70302 48543 50929 56277 55344 44651 33630 26839 29195 30074 31285
8337C1285K353q604J1829m455j2973k777O798L058R59j1428J3421J3354j1287
$$ 31285 33638 25034 36863 32408 19435 16658 23456 26514 27473 16045 29466 42820 31533
8324C1533J3988J4659Q849m405q974l703q35j3315l883j1151r769k847N573J9837
$$ 31533 45521 60180 69029 64624 55650 51947 51112 37797 33914 22763 12994 10147 15720 35557
8310C5557m753k5253M699J4372N495O736J9573J9250K081j0078r716N635K6323
$$ 35557 30804 5551 10250 24622 30117 36853 56426 75676 77757 67679 57963 63598 89921
8297H9921k2466j402K1646J3656M921K6771L4585J3130K8726M2743P4710J30755
$$ 89921 67455 66053 87699 101355 106276 133047 167632 180762 209488 252231 326941 457696
8285D57696K13107K94348L49056K63338J1760j31132j42883k05341k25501j79088
$$ 457696 670803 965151 1314207 1577545 1589305 1458173 1315290 1109949 884448 705360
8275G05360j15394r4812o7404o5996m2445m5086j5102k8601l6146k7700j1229
$$ 705360 589966 495154 427750 361754 319309 274223 259121 230520 194374 166674 155445
8264A55445k7921k059R929j2656J550J3253K291k150J3945J1903M010j5212K277
$$ 155445 127524 125465 135394 122738 124288 137541 139832 137682 151627 163530 167540 152328 154605
8251A54605J7905J0639P565K5918L8951O5167R2679J46661K20538L16309L42783
$$ 154605 172510 183149 190714 216632 255583 320750 413429 560090 780628 1096937 1439720
8240A439720J62256n7393j26261j60995j99703k31004j99590j26002q7057o5678
$$ 1439720 1601976 1544583 1418322 1257327 1057624 826620 627030 501028 413971 348293
8230C48293n0608m2504l3829k7739j4465l6656r367K156j3819j2213O127p831
$$ 348293 297685 255181 221352 193613 179148 142492 133125 135281 121462 109249 115376 107545
8218A07545j9654j2405j3869j7765N962R669J6061M362j7225k5920j0339j2751
$$ 107545 87891 75486 61617 43852 49814 59483 75544 79906 62681 36761 26422 13671
8206A3671J7270m042j7037K421J7943J002J223j204r591K3247J0858K134J496
$$ 13671 30941 26899 9862 12283 30226 31228 32451 31247 21656 44903 55761 57895 59391
8193E9391m088l168j3399j52J6967j1721k0702r223K1478K127k852j512P545N210
$$ 59391 55303 52135 38736 38584 55551 43830 23128 13905 35383 37510 34658 33146 40691 45901
8179D5901o598O084M918K055q573Q013J0366j7678O930J7112m61n800Q754q506
$$ 45901 39303 45387 50305 52360 43787 51800 62166 44488 51418 68530 68069 62269 71023 62517
8165F2517j4155L087O701n903j5487p024J01n776k587P072N271J3208j9648n011
$$ 62517 48362 51449 58150 52247 36760 29736 29837 24061 21474 28546 33817 47025 27377 22366
8151B2366k291o319J0416l234l004Q164o035n641L040j1263J2694K6233r13L960
$$ 22366 20075 13756 24172 20938 17934 26098 20063 14422 17462 6199 18893 45126 44213 48173
8137D8173J182r798j1758j0590L322o244n881P158K1836J1102r889p778J2741
$$ 48173 49355 39557 27799 17209 20531 14287 8406 15564 37400 48502 38613 30835 43576
8124D3576m26r285J9138N015k276R005L113r875j2558k2914j897J5622P531L52
$$ 43576 43150 33865 53003 58018 55742 64747 67860 57985 45427 22513 20616 36238 43769 44121
8110D4121J1159R194P989Q344j6169j7499j6210j7454J6402N962j0864j5801J0281
$$ 44121 55280 64474 72463 80807 64638 47139 30929 13475 29877 35839 24975 9174 19455
8097A9455J3284j3626j0214J7252J121O251J801J2273J4431o73j8190p065k547
$$ 19455 32739 19113 8899 26151 27272 33523 35324 47597 62028 61355 43165 36100 33553
8084C3553o286J3179K5621k66k225N353j5168j9133J384n222M06Q541j0317K032
$$ 33553 27267 40446 66067 65801 63576 68929 53761 34628 36012 30790 31196 39737 29420 31452
8070C1452K6374J6274k4397j0595J4708K739m978j7745j2332j9785n606r921N230
$$ 31452 57826 74100 49703 39108 53816 56555 51577 33832 21500 1715 -3891 -13812 -8582
8057h582K4745J8808R584p51j1718r752P539J4372N5k3423n463M390J2307Q178
$$ -8582 16163 34971 44555 43804 32086 22334 29873 44245 44300 20877 15414 19804 32111 40289
8043D0289j1325J5781m790k7615K1106J0514J1148m061k1724J0034J5350O176
$$ 40289 28964 44745 39955 12340 33446 43960 55108 51047 29323 39357 54707 60883
8031F0883k2883o057o41K3183J5593l801K749L68K391j4145k4263o608J7093J8168
$$ 60883 38000 31943 31302 54485 70078 66277 69026 69394 71785 57640 33377 26769 43862 62030
8017F2030N221n102J4497j463K394j8974j7034K432K5545Q559j2302j3784r419
$$ 62030 67251 62149 76646 75183 77577 58603 41569 44001 69546 78105 65803 52019 42600
8004D2600O162q131o105l711P404M7l946q346J2673J9401Q35L327j920p020o323
$$ 42600 48762 40631 34526 30815 38219 38266 34320 25974 38647 58048 58883 62210 60290 53270 46947
7989D6947j2144Q036j0147p098J2053k118j7281M284J4340j1091m160l117J4517
$$ 46947 34803 42839 32692 25594 37647 35529 18248 22532 36872 25781 21621 18504 33021
7976C3021J8317J814P320k7425k0666M755J2625m72L00K5970Q967k681k1438m670
$$ 33021 51338 53152 60472 33047 12381 17136 29761 29289 29589 55559 64526 61845 40407 35737
7962C5737l431l083J690J5595k3761l70N103O647j9179jl11j344l08M003J267
$$ 35737 32306 29223 30913 46508 22747 22377 27480 34127 14948 14947 14636 13292 12984 16987 18254
7947A8254j789K6004O317J305M752j9359k4957M50O551J3845p682N623J2416j6960
$$ 18254 16465 42469 48786 50091 54843 35484 10527 10977 17528 31373 23691 29314 41730 24770
7933B4770j3820o62K0218J5222p248l332j5179p633r539q278J9939j106J5155
$$ 24770 10950 10288 30506 45728 38480 35148 19969 12336 2797 -5481 14458 13352 28507
7920B8507j3688j0178L5147R505k2683m299K0705P742n386m122n988k6907K572
$$ 28507 14819 4641 39788 49293 26610 22311 43016 50758 45372 41250 35262 8355 10927
7907A0927L628J15j441j5050n002Q423K0374j7j9627j2168j0192O707M1533O173
$$ 10927 14555 14670 13229 -1821 -6823 1600 21974 21957 2330 -9838 -20030 -13323 28210 34383
7893C4383j1974J279n240k248Q119p587K2069N026j2461J1928J0965k6076J1772
$$ 34383 22409 23688 18448 16200 24319 16732 38801 43827 31366 43294 54259 28183 39955
7880C9955j5341j0747L619l593k3214M51j1664L587K4645l292L421n136L777Q418
$$ 39955 24614 13867 17486 13893 -9321 -8870 -20534 -16947 7698 4406 7827 2691 6468 14886
7866A4886m691j0505o238p567K296l495m554Q827J6898M721m464k308k382J9961
$$ 14886 10195 -310 -6548 -14115 -11819 -15314 -19868 -11041 5857 10578 6114 3806 1424 21385
7852B1385n714Q194K1837r274j4343n385k603j0930O701J5683o881J946J2856
$$ 21385 15671 23865 45702 36428 22085 16700 14097 3167 9868 25551 18670 20616 33472
7839C3472N494m71j2002r466j727J8294k076j5159L853m124J0315J1712J1054
$$ 33472 38966 38495 26493 17027 15300 33594 31518 16359 20212 16088 26403 38115 49169
7826D9169O292j1961j440r681j7391j4434r23p915o434Q766J70K1739N642j3564
$$ 49169 55461 43500 42060 32379 14988 554 -369 -8284 -14718 -5952 -5782 15957 21599 8035
7812H035O168r34n208O077j4563j2427Q6J6551k279J1624j6131n195j5241L058
$$ 8035 14203 13269 8061 14138 -425 -12852 -12766 3785 1506 13130 -3001 -8196 -23437 -20379
7798b0379K4702j372p645L20j1238o030K0251R492N404r256P136P766k59q46J2830
$$ -20379 4323 2951 -4694 -4374 -15612 -21642 -1391 8101 13505 4249 11385 19151 18892 18046 30876
7783C0876k789j4115j9086K287R151J658M471m288k181O828J4198K359o908J963
$$ 30876 28087 13972 -5114 -2827 6324 7982 12453 8165 5984 12812 27010 29369 22461 24424
7769B4424j974j6475J1670j4147k2114k039m48J6282K773m508O390J3693J5935
$$ 24424 22450 5975 17645 3498 -18616 -20655 -21103 -4821 -2048 -6556 -166 13527 29462
7756B9462R297j1382k0945q151q472J7373o071j5099J3788k214L392j1343o771
$$ 29462 38759 27377 6432 -1719 -10191 7182 1111 -13988 -200 -2414 978 -10365 -17136
7743a7136j262p471o830J3503j5328P062L3901J2146R369m55R587P03q445j0374
$$ -17136 -18398 -25869 -32699 -19196 -34524 -27462 6439 18585 27954 27499 37086 37789 29344 18970
7729A8970n498j5764p74J980r950L3242m154j4419r0K068j6814j3744O847J6425
$$ 18970 13472 -2292 -3066 -1086 -11036 22206 18052 3633 3543 5611 -11203 -24947 -18100 -1675
7715a675J8110K4149m605k4365k7793M016q373P086J4210K2391J3353j836j5400
$$ -1675 16435 40584 35979 11614 -16179 -12163 -20536 -13450 760 23151 36504 34668 19268
7702A9268j1947j90k058L624q911N281o755q489k156j2151M772L846j597l876
$$ 19268 7321 7131 5073 8697 -214 5067 -1688 -10177 -12333 -24484 -19712 -15866 -17463 -21339
7688b1339k835k3323L114J2570J5087J5720k710j2453j073k220J384k0489K0773
$$ -21339 -24174 -47497 -44383 -31813 -16726 -1006 -3716 -16169 -17242 -19462 -18078 -38567 -17794
7675a7794K6318o663r781L781P441m410j3124l255N134J463j2163o026L771j711
$$ -17794 8524 1861 -7920 -4139 3302 -1108 -14232 -17487 -12353 -10890 -23053 -29079 -25308 -27019
7661b7019j0301J5107R132N895J131k606k5708k943J0906J1997K3696K7810L638
$$ -27019 -37320 -22213 -13081 -7186 -6055 -8661 -34369 -37312 -26406 -14409 9287 37097 40735
7648D0735l64j878j5433n219o209j554J995k1154j5712j0601j821P779R571J1361
$$ 40735 40371 38493 23060 17841 11632 10078 12073 -9081 -24793 -35394 -37215 -29436 -19865 -8504
7634h504q304J1798O732O622K984j3702j621L696p868L987N380k0325q358J6006
$$ -8504 -16808 -5010 1722 8344 11328 -2374 -3995 -299 -8167 -4180 1200 -19125 -27483 -11477
7620a1477P073n895j6852J5533J0213K6167j0328p383k288r974N946L613J2301
$$ -11477 -4404 -10299 -27151 -11618 -1405 24762 14434 7051 4763 -5211 735 4348 16649
7607A6649r196M497o720m623J0750j1334q06p245O717J617j124O996M292q39P223
$$ 16649 7453 11950 5230 607 11357 23 -783 -8028 -1311 306 -818 6178 10470 9631 16854
7592A6854J494K090j4507Q805O535j4352q230q090m30p604k219m528K0695J0676
$$ 16854 18348 20438 5931 14736 21271 6919 -1311 -9401 -9831 -17435 -19654 -24182 -3487 7189
7578G189r864J55J5052j320L047j2654j8421n002J1099O301J2019M806j8602K370
$$ 7189 -2675 -2520 12532 11212 14259 1605 -16816 -21818 -10719 -4418 7601 12407 -6195 -3825
7564c825o21r656l777R238P896P019M858K430j6801J6657J5722J922J2421l798
$$ -3825 -4446 -14102 -17879 -8641 -745 6274 11132 13562 -3239 13418 29140 31062 43483 39685
7550C9685M23m65o457j8645k036M994M680j4755j0982J1165J4746L945j2230j9374
$$ 39685 40108 39643 33186 14541 12505 17499 22179 7424 -3558 7607 22353 26298 14068 -5306
7536e306p860r262L903J1883J1240N254J0436j8221m902K1357M528m397j1480
$$ -5306 -13166 -22428 -18525 -6642 4598 9852 20288 2067 -2835 18522 23050 18653 7173
7523G173N386j1865P434K0983J695k758p731l609k904N729j4678j5469p041m01
$$ 7173 12559 694 8128 29111 30806 28048 20317 16708 13804 19533 4855 -10614 -17655 -18056
7509a8056k433M106N558R716L495m482R532k4444q60O075L737o742j3957O65K8445
$$ -18056 -20489 -16383 -10825 -1109 2386 -2096 7436 -17008 -17868 -11793 -8056 -14798 -28755 -28090 355
7494C55o29P498P67p260j4588J09O767j3115m548N899k402J3128J9471o528r551
$$ 355 -274 7224 7991 731 -13857 -13748 -6981 -20096 -24644 -18745 -21147 -8019 11452 4924 -4627
7479d627N961N038o263m38J8411P61j0688j5621K673N198q518p785J812O989P527
$$ -4627 1334 6372 109 -329 18082 18843 8155 -7466 -4793 405 -8113 -15898 -14086 -7097 430
7464D30j3034k161J5459k3708K75J5243J3861j0044j4727l634n243m711L8N916
$$ 430 -12604 -14765 694 -23014 -22739 -7496 6365 -3679 -18406 -22040 -27283 -31994 -31956 -26040
7450b6040k2618K47J0738J3727O787J1340k049K574j0847m491M495p110m408J1838
$$ -26040 -48658 -48411 -37673 -23946 -17159 -5819 -7868 -5294 -16141 -20632 -16137 -23247 -27655 -15817
7436a5817M443q0R716K024K3159P472j0375j6749k124K006R979m40j4849k954
$$ -15817 -11374 -11454 -1738 286 23445 30917 20542 3793 1669 3675 13654 13214 -1635 -4589
7422d589M405j98m403M427j797K997r974j4342q745N508J0355k7235J0183J4079
$$ -4589 -184 -382 -4785 -358 -2155 842 -9132 -23474 -32219 -26711 -16356 -43591 -33408 -19329
7408a9329L842q947m929Q802P551Q422k5606j6729R665N521J0690n358J3557J7121
$$ -19329 -15487 -24434 -29363 -20561 -13010 -4588 -30194 -46923 -37258 -31737 -21047 -26405 -12848 4273
7394D273M246l940M202P580J399J1296M726j2902j3937j0875m809o766m149R558
$$ 4273 8519 4579 8781 16361 17760 29056 33782 20880 6943 -3932 -8741 -15507 -19656 -10098
7380a0098P977q649K132n719J8341J0365R407l371k3817j6034q872P1J1939k854
$$ -10098 -2121 -10770 -8638 -14357 3984 14349 23756 20385 -3432 -19466 -28338 -28267 -16328 -19182
7366a9182J0182o70o558Q526j2792o858L564n544K233K2448L968P778j9676R35
$$ -19182 -9000 -9670 -16228 -7702 -20494 -27352 -23788 -29332 -27099 -4651 -683 7095 -12581 -11646
7352a1646l5K93K1572P140j0085p937k1558m585J1485J11L788O2j2876P00M196
$$ -11646 -11681 -11388 10184 17324 7239 -698 -22256 -26841 -15356 -15245 -11457 -11395 -24271 -23571 -19375
7337a9375O480L422m499K2972r992j0935r15j44r51L480J8397N366o631O141j8980
$$ -19375 -12895 -9473 -13972 9000 -992 -11927 -12842 -12986 -13937 -10457 7940 13306 6675 12816 -6164
7322f164j9347J3206J1377l575n753j5440N457J5032o400l417O671J3525j5336
$$ -6164 -25511 -12305 -928 -4503 -10256 -25696 -20239 -5207 -11607 -15024 -8353 5172 -10164
7309a0164r47K296j4589j4846p58J3060j0516M910K5529K4268J6754j0425m4345
$$ -10164 -11111 -8815 -23404 -38250 -39008 -25948 -36464 -31554 -6025 18243 34997 24572 -19773
7296a9773j5750N404R685K2503P666J0600R709p421j1656J9689j558m167m31q455
$$ -19773 -35523 -30119 -20434 2069 9735 20335 30044 22623 10967 30656 29098 24931 24500 16045
7282A6045o390j0981N092J0235p654j4033O573l519n986n326J610Q610j062J6961
$$ 16045 9655 -1326 3766 14001 6347 -7686 -1113 -4632 -10618 -15944 -14334 -5724 -6786 10175
7268A0175O939m698j0394j8111R507J4415O963m524j433j3017j3611j3172q874
$$ 10175 17114 12416 2022 -16089 -6582 7833 14796 10272 8839 -4178 -17789 -30961 -39835
7255c9835K0049K0367N333q741J1053J9795q450j4476k932n977j991O216O963
$$ -39835 -19786 581 5914 -2827 8226 28021 19571 5095 2163 -3814 -5805 411 7374
7242G374q624P803Q386O435O131j7230K49p253Q654m183o188j3834M560J8207
$$ 7374 -1250 6553 14939 21374 27505 10275 10524 3271 11925 7742 1554 -12280 -7720 10487
7228A0487L161l204J8109j6053j0875j3963j2129K2170J2084j273N016L102j4763
$$ 10487 13648 10444 28553 12500 1625 -12338 -24467 -2297 9787 8514 13530 16632 1869
7215A869k6419j4484J8873L3917o93k426l043O343j3673j4562M360j2407m263
$$ 1869 -24550 -39034 -20161 13756 13063 10637 7594 13937 264 -14298 -9938 -22345 -26608
7202b6608J591j8052l758k792O44J2875J2651O220K1569n52j2950j012K1412P074
$$ -26608 -25017 -43069 -46827 -49619 -48975 -36100 -23449 -17229 4340 3788 -9162 -10174 11238 18312
7188A8312k4104p375J773k506J1941j5449q330P363J1496k1156M859j5200o881
$$ 18312 -5792 -13167 -11394 -13900 -1959 -17408 -25738 -18375 -6879 -28035 -23176 -38376 -45257
7175d5257J7366J8514J9897l303j2415j4666o716J7101J0380k53j9613j6356J7359
$$ -45257 -27891 -9377 10520 7217 -5198 -19864 -26580 -9479 901 648 -18965 -35321 -17962
7162a7962J1813J1679R159n184r757j4231K578J2129n972j1219q061Q725J0234
$$ -17962 -6149 5530 14689 9505 -252 -14483 -11905 224 -5748 -16967 -25028 -16303 -6069
7149f069l499N450j2483q19N890o960j1149N997P862j7927p941O185L1723J4886
$$ -6069 -9568 -4118 -16601 -17420 -11530 -18490 -29639 -23642 -15780 -33707 -41648 -35463 -3740 11146
7135A1146o84k2471j489j558K1000K7017j9363j4644J3252J120p229n157O560
$$ 11146 10462 -12009 -13498 -15056 5944 32961 13598 -1046 12206 13326 6097 940 7500
7122G500r773m653l711k0614l7J0537J6704J6277l226j2617n278J3559r820j3043
$$ 7500 -2273 -6926 -10637 -31251 -31288 -20751 -4047 12230 9004 -3613 -8891 4668 -5152 -18195
7108a8195J7729j096m419K499J0123K2715r728J2559R739r959j7693K518N464
$$ -18195 -466 -1562 -5981 -3482 6641 29356 19628 32187 41926 31967 14274 16792 22256
7095B2256J1128r890k1838O210J4756l133N228k8270k326j938k1386J2960P157
$$ 22256 33384 23494 1656 7866 22622 19489 24717 -3553 -5879 -7817 -29203 -16243 -9086
7082i086k9547m889J7245K4595R946j4315p004r319j4743p72R05K424J5576N826
$$ -9086 -38633 -43522 -26277 -1682 8264 -6051 -13055 -22374 -37117 -37889 -36984 -34560 -18984 -13158
7068a3158N79N813q947m552j3909q272L301m502n704N756j589J5512L568j0954
$$ -13158 -12579 -6766 -15713 -20265 -34174 -42446 -39145 -43647 -49351 -43595 -45184 -29672 -26104 -37058
7054c7058J4076N97j5182O09m038J5042j021N857J9215L40O52J5519P361n848
$$ -37058 -22982 -22385 -37567 -36958 -40996 -25954 -26975 -21118 -1903 -1563 -911 14608 21969 16121
7040A6121m9191q587K9111J9134M61J548j5103O768l44j2925J2629k0j2653j4150
$$ 16121 -33070 -41657 -12546 6588 7049 8597 -6506 262 -82 -13007 -378 -398 -13051 -27201
7026b7201l3K5512J8388j3348k2368J424J5907P757J0122m048k2896j3999m048
$$ -27201 -27234 -1722 16666 3318 -19050 -17626 -1719 6038 16160 12112 -10784 -24783 -28831
7013b8831K1748J3635p170o050j0717Q697L679l494j6486k220R95n908o18Q593
$$ -28831 -7083 6552 -618 -6668 -17385 -8688 -5009 -8503 -24989 -27209 -26214 -32122 -32740 -24147
6999b4147J903o973J5640r703J4434l788o80r459N294J0871m392j2860r123N059
$$ -24147 -22244 -29217 -13577 -23280 -8846 -12634 -13314 -22773 -17479 -6608 -11000 -23860 -32983 -27924
6985b7924K706o735K556L662r895p885j0912J6323K0124J568l78Q41j0868J5369
$$ -27924 -25218 -31953 -29397 -25735 -35630 -43515 -54427 -38104 -17980 -16412 -16790 -15949 -26817 -11448
6971a1448O106K1933J6448j0673j6361l111j1475L137J2379P532Q297j296j9787
$$ -11448 -5342 16591 33039 22366 6005 2894 -8581 -5444 6935 14467 22764 21468 1681
6958A681J596o282J7160J8808L49j0280N067k0165M987J2858O501n802J2779n889
$$ 1681 3277 -3005 14155 32963 33312 23032 28099 7934 12921 25779 32280 26478 39257 33368
6944C3368j6947o328L43j7776j034N360j4343o473O324o705j1208n804m084j776
$$ 33368 16421 10093 10436 -7340 -8374 -3014 -17357 -23830 -17506 -24211 -35419 -41223 -45307 -47083
6930d7083Q04K0174R57Q932K1052J2360M4k858j3929R278J8079j9862p595j4884
$$ -47083 -46279 -26105 -25148 -16216 4836 17196 17240 14382 453 9731 27810 7948 353 -14531
6916a4531r692J1338O871j533k16n058J14l304j1191j8136P114J7764Q498Q713
$$ -14531 -24223 -12885 -6014 -7547 -7763 -12821 -12707 -16011 -27202 -45338 -38224 -20460 -11962 -3249
6902c249N967Q050J936p729L095j2078o467j9808n470J2155n257L364J4565k893
$$ -3249 2718 10768 12704 4975 8070 -4008 -10475 -30283 -35753 -23598 -28855 -25491 -10926 -13819
6888a3819M314J0825J5334r135L705k53k109n470j779q175J7025J2206n632q843
$$ -13819 -9505 1320 16654 7519 11224 10971 8862 3392 1613 -6562 10463 22669 17037 8194
6874H194j7780K51K4072P697n030Q009j630j2253m968M48j2043M983L663j6731
$$ 8194 -9586 -9335 14737 22434 17404 25413 23783 11530 6562 7010 -5033 -50 3613 -13118
6860a3118j4462N946J7208J592o970q172Q145J3805J495l383n301j4247j2754
$$ -13118 -27580 -21634 -4426 -2834 -9804 -17976 -9831 3974 5469 2086 -3215 -17462 -30216
6847c0216K853J5151K932J4605N63J4700l349K906J8923j0645j2243J2465j5443
$$ -30216 -27363 -12212 -9280 5325 5888 20588 17239 20145 39068 28423 16180 28645 13202
6834A3202j4192k3071J633J6498k972J5015M027R14m241m127k0396r733K308M56
$$ 13202 -990 -24061 -22428 -5930 -8902 6113 10140 11054 6813 2686 -17710 -27443 -25135 -24679
6820b4679o84P069R238J6147K1095j4806p892j3108j639J7765O199q733J2406
$$ -24679 -25363 -18294 -9056 7091 28186 13380 5488 -7620 -9259 8506 14705 5972 18378
6807A8378n700j8538M166n401j1094k740m491j116j086P430J1719N126j76j924
$$ 18378 12678 -5860 -1694 -7095 -18189 -20929 -25420 -26536 -27622 -20192 -8473 -3347 -3523 -5447
6793e447J128J2815j404l348j3128k0703r989J1668J5677L2751N250R26j2454
$$ -5447 -4319 8496 7092 3744 -9384 -30087 -40076 -28408 -12731 20020 25270 26196 13742
6780A3742J993n044j2990q911J0329J097O303j66P187m025P07o437l550M593R469
$$ 13742 15735 10691 -2299 -11210 -881 216 6519 6353 13540 9515 10222 3785 235 4828 14297
6765A4297o346J000k860Q222K030j4325J3687O012j1731K458l505M190p994j3484
$$ 14297 7951 8951 6091 14313 16343 2018 15705 21717 9986 12444 8939 13129 5135 -8349
6751h349n096L953k0101J384n840o002J3758J4719J577Q013o80M495K875j2534
$$ -8349 -13445 -9492 -29593 -28209 -34049 -40051 -26293 -11574 -9997 -1984 -2664 1831 4706 -7828
6737g828J6257J4271j2783q347J7178M176r087j0475p291M644n926j0486N789
$$ -7828 8429 22700 9917 1570 18748 22924 13837 3362 -3929 715 -5211 -15697 -9908
6724i908R333j7549P6m771J7825k315k0672q109J4048J8323o928K0596J6439m765
$$ -9908 -575 -18124 -18048 -22819 -4994 -7309 -27981 -36090 -22042 -3719 -10647 9949 26388 21623
6710B1623o896j9707K423J3127m442j4793R63J360J4756r290J2601k828J865j0326
$$ 21623 14727 -4980 -2557 10570 6128 -8665 -7702 -6342 8414 -876 11725 8897 10762 436
6696D36R494k3495k5342K158L1397K5549J6776k984l1157k5419J2158J1851K585
$$ 436 9930 -13565 -38907 -36749 -5352 20197 36973 33989 2832 -22587 -10429 1422 4007
6683D007O406j0266l021N645Q435r387q134M064J1899Q88q665N113J2760M503
$$ 4007 10413 147 -2874 2771 11206 1819 -6315 -2251 9648 10536 1871 6984 19744 24247
6669B4247j8607j3667k143O532m938j9284J3480J7005K194j265L785K265J5364
$$ 24247 5640 -8027 -10170 -3638 -8576 -27860 -14380 2625 4819 3554 7339 9604 24968
6656B4968L883k0992o755Q755L642K517j9438l649k707L459J6764Q388M460j7709
$$ 24968 28851 7859 1104 9859 13501 16018 -3420 -7069 -9776 -6317 10447 18835 23295 5586
6642E586k3675N059n824j4958K0778K0394o546o850L139n149r493K2402l707j3462
$$ 5586 -18089 -13030 -18854 -33812 -13034 7360 814 -6036 -2897 -8046 -17539 4863 1156 -12306
6628a2306r677q926r867P226L143N45R672j004K196k3756J3736J5188J0472K1267
$$ -12306 -21983 -30909 -40776 -33550 -30407 -29862 -20190 -21194 -18998 -42754 -29018 -13830 -3358 17909
6614A7909J4173j9810J2866q634j1675j82j8159j9059m351L9991J8018j0865l88
$$ 17909 32082 12272 25138 16504 4829 4647 -13512 -32571 -36922 3069 21087 10222 9834
6601I834n621r182j2320K4957M105N67k1852j4014j1770N708J7970Q681J1445
$$ 9834 4213 -4969 -17289 7668 11773 12340 -9512 -23526 -35296 -29588 -11618 -2937 8508
6588H508l868j3821L289P853k039N911K2694R38k6076l9604j6281J7222J1758
$$ 8508 4640 -9181 -5892 1961 -78 5833 28527 29465 3389 -36215 -52496 -35274 -23516
6575b3516J4557p037q036o091L401N861m950K174J911J2977O961r422L262O330
$$ -23516 -8959 -15996 -24032 -30123 -26722 -20861 -25811 -23637 -21726 -8749 -1788 -11210 -7948 -1618
6561a618j1857j3643q209N981P916O560q632n781J6316J502Q978K920p987J0687
$$ -1618 -13475 -27118 -35327 -29346 -21430 -14870 -23502 -29283 -12967 -11465 -2487 433 -7554 3133
6547C133M270j4080q826p25j184p40J3069J221j1213k2164q313L977J5974J3793
$$ 3133 7403 -6677 -15503 -16228 -17412 -18152 -5083 -3862 -15075 -37239 -45552 -41575 -25601 -11808
6533a1808n312J3153q856j4902K708J2456K3854j911o187j4929j0831P3o824l10
$$ -11808 -17120 -3967 -12823 -27725 -25017 -12561 11293 9382 3195 -11734 -22565 -22492 -29316 -29626
6519b9626l9L6320R959j1845n388n651J1571m279j0132j1147L292P079J3014q9
$$ -29626 -29665 6655 16614 4769 -619 -6270 5301 1022 -9110 -20257 -16965 -9886 3128 3039
6505C039j8254j5879K912K049J7445J4137Q568m076L53Q147n412k086j405j5097
$$ 3039 -15215 -31094 -28182 -26133 -8688 5449 14017 9941 10294 18441 13029 10943 9538 -5559
6491e559n809P27o44L20R7l588o949m115L322N981J4951J4916J10j1198K339r678
$$ -5559 -11368 -10641 -11285 -10965 -10868 -14456 -21405 -25520 -22198 -16217 -1266 13650 13760 2562 4901 -4777
6475d777R253N269j1090J3661J2995o324r566M046Q246p545j803r655k5352l1124
$$ -4777 4476 9745 -1345 12316 25311 18987 9421 13467 21713 14168 12365 2710 -22642 -53766
6461e3766o012K4097K1663j5258J2621J7736J1071o346j832n230J2008o650k536
$$ -53766 -59778 -35681 -14018 -29276 -16655 1081 12152 5806 3974 -1256 10752 4102 1566
6448A566m814j92p135K347J0099J2619m475m996j3165r999o252L595q435N583
$$ 1566 -3248 -3440 -10575 -8228 1871 14490 10015 5019 -8146 -18145 -24397 -20802 -29237 -23654
6434b3654L504M104p272J0591R84o591l073N243Q959l063j1731l310J6212J0862
$$ -23654 -20150 -16046 -23318 -12727 -11743 -18334 -21407 -16164 -7205 -10268 -21999 -25309 -9097 1765
6420A765R050m481r617K650k10m063j161k237j658m084j7835j2319M176J7770
$$ 1765 10815 6334 -3283 -633 -843 -4906 -6067 -8304 -9962 -14046 -31881 -44200 -40024 -22254
6406b2254k948l307K2151K4629n379l7698N034j5166k321N355N615k433P394M491
$$ -22254 -25202 -28509 -6358 18271 12892 -24806 -19772 -34938 -37259 -31904 -26289 -28722 -21328 -16837
6392a6837p386Q016J0427k086J5366Q066J290J6649l522r178q592K791L114M229
$$ -16837 -24223 -16207 -5780 -7866 7500 15566 16856 33505 29983 20805 12213 15004 18118 22347
6378B2347k0887o285r708k677J1853K821r515k892J5651J2571j353j9855r690
$$ 22347 1460 -4825 -14533 -17210 -5357 -2536 -12051 -14943 708 13279 11926 -7929 -17619
6365a7619j176m58r522m089O641J717N965K2030O200p904m744m709n792J2322
$$ -17619 -18795 -19253 -28775 -32864 -26223 -24506 -18541 3489 9689 1785 -2959 -7668 -13460 -1138
6351a138J6986N534j6667K280J760O48K350o952p491K1678R104j502J2653r382
$$ -1138 15848 21382 4715 6995 8755 9403 11753 4801 -2690 18988 28092 26590 39243 29861
6337B9861k8537o643k6100j1109O072K0639J7101m822m400J4155J5309Q00N112
$$ 29861 1324 -5319 -31419 -42528 -36456 -15817 1284 -3538 -7938 6217 21526 22326 27438
6324B7438M441J221J437j4599j7572n425O980l996j0449l508j2320N253J4569
$$ 27438 31879 33100 34537 19938 2366 -3059 3921 -75 -10524 -14032 -26352 -21099 -6530
6311f530j2945j3461n772J1436P731N445P378J38j7655J4024J2978J7249n285
$$ -6530 -19475 -32936 -38708 -27272 -19541 -14096 -6718 -6580 -24235 -10211 2767 20016 14731
6298A4731j2024j3380n120N312L174k751j8096J0477j6684P948K9052J6507p679
$$ 14731 2707 -10673 -15793 -10481 -7307 -10058 -28154 -17677 -34361 -26413 2639 19146 11467
6285A1467l172K686p859m022J0863r938k3018q386K7376K0658k601o477j2989
$$ 11467 8295 10981 3122 -900 9963 25 -22993 -31379 -4003 16655 14054 7577 -5412
6272e412K0004J377k2861L064R594P182O216j392r994j0692j9000P983j968M098
$$ -5412 14592 15969 -6892 -3828 5766 12948 19164 17772 7778 -2914 -21914 -13931 -15899 -11801
6258a1801O143j3136L408J8213J4454k1982P693j120j027q450k572J0852j2595
$$ -11801 -5658 -18794 -15386 2827 17281 -4701 2992 1872 845 -7605 -10177 675 -11920
6245a1920n036j7834o452J6853K9359O8j2345J1666n35N570J591k0777j5101K667
$$ -11920 -16956 -34790 -41242 -24389 4970 5038 -7307 4359 3824 9394 10985 -9792 -24893 -22226
6231b2226J4478J710Q600Q342n668k0926M676j1589k5N276J7196j194j8273K887
$$ -22226 -7748 -6038 2562 10904 5236 -15690 -11014 -22603 -22628 -17352 -156 -1350 -19623 -16736
6217a6736K90R376J8889L436j0157k043J3n44j1078K25J3032l538j8232q286M589
$$ -16736 -16446 -7070 11819 15255 5098 3055 3068 2524 -8554 -8329 4703 1165 -17067 -25353 -20764
6202b0764J3674J946k414K601J4628J5184k618l681p976m994R671J1393J7160
$$ -20764 -7090 -5144 -7558 -4957 9671 24855 22237 18556 10580 5586 15257 26650 43810
6189D3810j1695k4354p876j095l150K1944J3881j8359m518m210K356j1777j3020
$$ 43810 32115 7761 -115 -1210 -4360 17584 31465 13106 8588 4378 6734 -5043 -18063
6176a8063j0569M029J5644j4410o047m015j3505p59P775K0045M120o131m793J6398
$$ -18063 -28632 -24603 -8959 -23369 -29416 -33431 -46936 -47695 -39920 -19875 -15755 -21886 -26679 -10281
6162a0281J6481j1962o452K3915N226n73K334j8290j2614j2184m86L1j5812J0159
$$ -10281 6200 -5762 -12214 11701 16927 16354 18688 398 -12216 -24400 -24886 -24855 -40667 -30508
6148c0508K732P480j2676k682K0959J045q0K0132J9761j3618k6443j778p158J375
$$ -30508 -27776 -20296 -32972 -35654 -14695 -13650 -13730 6402 26163 12545 -13898 -15676 -22834 -21459
6134b1459K2481K388r370K1773J2135Q155r337j5314o989J4578o970j5669j1665
$$ -21459 1022 3410 -5960 15813 27948 36103 26766 11452 4463 19041 12071 -3598 -15263
6121a5263M877J0264N390r943p636l890M292j2625m164K8240k99k6131R797J8186
$$ -15263 -10386 -122 5268 -4675 -12311 -16201 -11909 -24534 -28698 -458 -757 -26888 -17091 1095
6107A095J947r680K264J0141r094j7422J3874J7405j1815L79J2485J2620q890
$$ 1095 3042 -6638 -4374 5767 -3327 -20749 -6875 10530 -1285 -906 11579 24199 15309
6094A5309k0039J2066J8009j8430k9549R986K193p121N695m017q536Q128J7480
$$ 15309 -4730 7336 25345 6915 -22634 -12648 -10455 -17576 -11881 -15898 -24434 -16306 1174
6081A174J8094J956O15r447j7127J619j1011N420l508N961k584o709j4924q334
$$ 1174 19268 21224 21839 12392 -4735 -3116 -14127 -8707 -12215 -6254 -8838 -15547 -30471 -38805
6067c8805R697N727J0803q47J6880j716q092N839Q830k358j5228j2653L874J9575
$$ -38805 -29108 -23381 -12578 -13425 3455 1739 -6353 -514 8316 5958 -9270 -21923 -18049 1526
6053A526L152M483m727p913K060n828o731j0237L378j788j6265N779J6885p618
$$ 1526 4678 9161 4434 -3479 -1419 -7247 -13978 -24215 -20837 -22625 -38890 -33111 -16226 -23844
6039b3844j521M490L427j2318Q339J4392J0301m093j0836o387J689J9443q518
$$ -23844 -25365 -20875 -17448 -29766 -21427 -7035 3266 -827 -11663 -18050 -16361 3082 -5436
6026e436R601K4499J1865j112k1442J54K2991l844j2855M779l83o07j0856j4340
$$ -5436 4165 28664 40529 39417 17975 18129 41120 37276 24421 29200 28817 28210 17354 3014
6012C014Q89J265j9450j2806J0819J013P606J836n474j1873J1042Q946l142M716
$$ 3014 3903 5168 -14282 -27088 -16269 -15256 -7650 -5814 -11288 -23161 -12119 -3173 -6315 -1599
5998a599Q267O374k064j6512q677K3811K225k754k215J5550R617j4841j5549Q818
$$ -1599 6668 13042 10978 -5534 -14211 9600 11825 9071 6856 22406 32023 17182 1633 10451
5984A0451J2212O388J8870j5409k0134k2013j8975l279k738N942K0711n401J012
$$ 10451 22663 29051 47921 32512 12378 -9635 -28610 -31889 -34627 -28685 -7974 -13375 -12363
5971a2363N965j0635o27K1627J4675j7749j5786J0829J2839j0153k7511n399J6783
$$ -12363 -6398 -17033 -17660 3967 18642 893 -14893 -4064 8775 -1378 -28889 -34288 -17505
5958a7505J8938j1208k5569J1113K3052J2854j532n596P344O832j4284j2788j7726
$$ -17505 1433 -9775 -35344 -24231 -1179 11675 10143 4547 11891 18723 4439 -8349 -26075
5945b6075m720J0726L344J632K6640J8249j6293j4671j799r514p371K2759J1966
$$ -26075 -30795 -20069 -16725 -15093 11547 29796 13503 -1168 -2967 -12481 -19852 2907 14873
5932A4873j2515j3717l247J3944J0785l738j2765M474J4906M792R44J557j9470
$$ 14873 2358 -11359 -14606 -662 10123 6385 -6380 -1906 13000 17792 18736 20293 823
5919H23j6440l3307J1033L9170K7524J0986j5722p250j1135j668l71m029L757
$$ 823 -15617 -48924 -37891 1279 28803 39789 24067 16817 5682 4014 3643 -386 3371
5906C371r684k2034j0930J2498k456j1969J5307R805J454k466J680p817j0435
$$ 3371 -6313 -28347 -39277 -26779 -29235 -41204 -25897 -16092 -14638 -17104 -15424 -23241 -33676
5893c3676L359J2229K4663L75o158k5429K667J9352J0958J4141L723j8891R194
$$ -33676 -30317 -18088 6575 6950 792 -24637 -21970 -2618 8340 22481 26204 7313 16507
5880A6507J279K391l493m419j1683Q257n11r336N1K26Q616m98j5269k7470R110
$$ 16507 17786 20177 16684 12265 582 8839 8328 -1008 -957 -731 7885 7387 -7882 -35352 -26242
5865b6242K4267k812Q282J761q156r886K2655J2571j2993M85J0647P654N241j957
$$ -26242 -1975 -4787 3495 5256 -2900 -12786 9869 22440 9447 9932 20579 28233 33474 31517
5851C1517j5686o369L476J1913j3295N940j5236k746K0264j120j3969P658M052
$$ 31517 15831 9462 12938 24851 11556 17496 2260 -486 19778 18658 4689 12347 16399
5838A6399j9044k278J0004J4301l500j6397k1840j3531J0757R478M502L524J330
$$ 16399 -2645 -4923 5081 19382 15882 -515 -22355 -35886 -25129 -15651 -11149 -7625 -6295
5825f295p73j8756o842J2688R908J7694Q584J161k0779M590l202o96j4856p064
$$ -6295 -7068 -25824 -32666 -19978 -10070 7624 16208 17369 -3410 1180 -2022 -2718 -17574 -24638
5811b4638n58P193k718l95L227q699r779j5491R481K4807J0413j3783j0492j232
$$ -24638 -25196 -18003 -20721 -21116 -17889 -26588 -36367 -51858 -42377 -17570 -7157 -20940 -31432 -32664
5797c2664J4919L0478K408j5709r168j1651l767J8290K8046N784k282k2783k9559
$$ -32664 -17745 12733 15141 -568 -9736 -21387 -25154 -6864 21182 26966 24684 1901 -27658
5784b7658q243J3905K3701R424l665j1863O606L543k709j2985m209J3434P043
$$ -27658 -35901 -21996 1705 11129 7464 -4399 2207 5750 3041 -9944 -14153 -719 6324
5771F324m78m10m49j8255j0112n033O663J4238K2290j1517l360j398m639M341
$$ 6324 5846 5436 4987 -13268 -23380 -28413 -21750 -7512 14778 3261 -99 -1497 -6136 -1795
5757a795P19r246j9631r833M641o07J4791K4513p639L74R426K668K6741J7055
$$ -1795 -1076 -10322 -29953 -39786 -35145 -35752 -20961 3552 -4087 -3713 5713 8381 35122 52177
5743E2177r977k1470L560o767k188k265j389r884l1947j5580R407Q851j885J8435
$$ 52177 42200 20730 24290 17523 15335 13070 11681 1797 -30150 -45730 -36323 -27472 -29357 -10922
5729a0922J1247Q036r527o159q939J3243N275j0866M954o019O774J399N897q57
$$ -10922 325 8361 -1166 -7325 -16264 -3021 2254 -8612 -3658 -9677 -2903 -1504 4393 3536
5715C536o762J5504r531k2082j4304K3600J8234j2491k0420k0156P824J7603Q466
$$ 3536 -3226 12278 2747 -19335 -33639 -10039 8195 -4296 -24716 -44872 -37048 -19445 -10979
5702a0979j082q737j4550k847P403l065J3799J6886k757P834Q033J915K773j5126
$$ -10979 -12061 -20798 -35348 -38195 -30792 -33857 -20058 -3172 -5929 1905 9938 11853 14626 -500
5688e00k3775k433R18J3229Q775p690o975J9940Q285j8227j5977J6826L105m191
$$ -500 -24275 -26708 -25790 -12561 -3786 -11476 -18451 1489 9774 -8453 -24430 -7604 -4499 -8690
5674h690J0475J4545j5809L492p697j9075p925K0145L0210p795l2965j1032J126
$$ -8690 1785 16330 521 4013 -3684 -22759 -30684 -10539 19671 11876 -21089 -32121 -30995
5661c0995O246r495R631R042O78p364J803q889J4176n080j5308J2193J9750n635
$$ -30995 -24749 -34244 -24613 -15571 -14893 -22257 -20454 -29343 -15167 -20247 -35555 -23362 -3612 -9247
5647i247l119j8758P155O843m54J1601j4357J7157Q459L80J0778r571j7499j4860
$$ -9247 -12366 -31124 -23969 -17126 -17580 -5979 -20336 -3179 5280 5660 16438 6867 -10632 -25492
5633b5492J0191L391o492M489k2697j1904K1664K5388j1097j3728O283j1j065
$$ -25492 -15301 -11910 -18402 -13913 -36610 -48514 -26850 -1462 -12559 -26287 -20004 -20015 -21080
5620b1080R557M011P479l40p997K931R043p187K107J0150K59J749O428J2953J1795
$$ -21080 -11523 -7512 -33 -373 -8370 -5439 3604 -3583 -1476 8674 8933 10682 17110 30063 41858
5605D1858j156j3805j2470O607k908j0028j6219o758J7878r145j0301P645K0826
$$ 41858 40702 26897 14427 21034 18126 8098 -8121 -14879 2999 -6146 -16447 -8802 12024
5592A2024j978j5537L775L917r903k1032p394k74J4877N766m075j3738M541R837
$$ 12024 10046 -5491 -1716 2201 -7702 -28734 -36128 -36402 -21525 -15759 -19834 -33572 -29031 -19194
5578a9194j830M37J4432o792J4058j0988K997J1423K826M199P521J1551j0808
$$ -19194 -21024 -20587 -6155 -12947 1111 -9877 -6880 4543 7369 11568 19089 30640 19832
5565A9832k3195l083K5240K0606j5741j0413l598m8P753r914p629O79k8096p730
$$ 19832 -3363 -6446 18794 39400 23659 13246 9648 9600 17353 7439 -190 489 -27607 -35337
5551c5337l041R799J3872j320L739l584j6833k863K2330J0002J7776M323j926
$$ -35337 -38378 -28579 -14707 -16027 -12288 -15872 -32705 -35568 -13238 -3236 14540 18863 16937
5538A6937M785L846k6165m080Q697J403l499M031k489J0811j7671j0296n716J8451
$$ 16937 21722 25568 -597 -4677 4020 5423 1924 5955 3466 14277 -3394 -13690 -19406 -955
5524i55q578q032j1863l494Q29J0607K1253R950l504r400j5419O260M273J4707
$$ -955 -9533 -17565 -29428 -32922 -32093 -21486 -233 9717 6213 -3187 -18606 -12346 -8073 6634
5510F634o732J1212q76r753Q608j5552q964J5462j635j4879J4586J7334M471j1745
$$ 6634 -98 11114 10238 485 9093 -6459 -15423 39 -1596 -16475 -1889 15445 19916 8171
5496H171j6483o313R51R583O438k1790n572K182j862J597j600J0575M701k128
$$ 8171 -8312 -14625 -13674 -4091 2347 -19443 -25015 -22833 -24695 -23098 -24698 -14123 -9422 -11550
5482a1550Q408J1587L132j3097J715j045m368j1565M898O311R540R024j0888O531
$$ -11550 -3142 8445 11577 -1520 195 -850 -5218 -16783 -11885 -5574 3966 12990 2102 8633
5468H633J712k630j6335j7811M028R677o079j1013j794j706J5401K6054j2431
$$ 8633 10345 7715 -8620 -26431 -22403 -12726 -18805 -29818 -31612 -33318 -17917 8137 -4294
5455d294j2247p779O356O49M625j806l466j919J5268J4935j2019j081j9551l650
$$ -4294 -16541 -24320 -17964 -17315 -12690 -14496 -17962 -19881 -4613 10322 -1697 -2778 -22329 -25979
5441b5979Q13K185J027M966P006R057J170l901p838j5799j1654J0401J8633J111
$$ -25979 -25166 -22981 -21954 -16988 -9982 -925 245 -3656 -11494 -27293 -38947 -28546 -9913 -8802
5427h802k55M745k0015j9229J4543R406j760k822Q135K8269j2516k251J0217o816
$$ -8802 -9057 -4312 -24327 -43556 -29013 -19607 -21367 -24189 -16054 12215 -301 -2552 7665 849
5413H49Q465L064j0694j8281N883J3404Q522N769J0856j2710r115J330J9534j3491
$$ 849 9314 12378 1684 -16597 -10714 2690 11212 16981 27837 15127 6012 7342 26876 13385
5399A3385j3978j259N215R444L396j2019k8464R25K2948J21j2115j1173j0190
$$ 13385 -593 -1852 3363 12807 16203 4184 -24280 -23355 -407 -286 -12401 -23574 -33764
5386c3764R063N139J8757Q586l565P066O265m133J1041r039j5707m559J1910o083
$$ -33764 -24701 -19562 -805 7781 4216 11282 17547 13414 24455 15416 -291 -4850 7060 977
5372I77K601m201j2577K829J9289K79j4270O741o20k517K06L076Q931P159M171
$$ 977 3578 -623 -13200 -10371 8918 9197 -5073 1668 1048 -1469 -1263 1813 10744 17903 22074
5357B2074o24j030M400m037M569p606p747J174O658J026r934k7272j5883N177
$$ 22074 21450 20420 24820 20783 25352 17746 9999 11173 17831 18857 8923 -18349 -34232 -29055
5343b9055R989K1606j826k266Q7j5196K302O821p864J3396l134j361p671j8070
$$ -29055 -19066 2540 714 -1552 -1465 -16661 -14359 -7538 -15402 -2006 -5140 -6501 -14172 -32242
5329c2242J239j582l132P369N812j593m968m76O264k8q211M432L457O604o03J290
$$ -32242 -31003 -32585 -35717 -28348 -22536 -24129 -29097 -29573 -23309 -23337 -31548 -27116 -23659 -17055 -17658 -16368
5313a6368m408J33o384j7112L164j746j3665J6263J7567P129q91M87j5508J3309
$$ -16368 -20776 -20643 -27027 -44139 -40975 -42721 -56386 -40123 -22556 -15427 -16318 -15831 -31339 -18030
5299a8030O995J3884L189j4266N323l348N056o478o443L297k90J0614R127k188
$$ -18030 -11035 2849 6038 -8228 -2905 -6253 -1197 -7675 -14118 -10821 -11111 -497 8630 6442
5285F442j6636j2080l227o569J4172J6608J2640P99j5169j2559m365k497P252
$$ 6442 -10194 -22274 -25501 -32070 -17898 -1290 11350 12149 -3020 -15579 -19944 -22441 -15189
5272a5189j897q016j4938q168O780J7457K795R745J6703J6392R362k3813j3741
$$ -15189 -17086 -25102 -40040 -48208 -41428 -23971 -21176 -11431 5272 21664 31026 7213 -6528
5259f528K103J7783J962j1240k2596M096r815p570m478j3389j6055J6215L6451
$$ -6528 -4425 13358 15320 4080 -18516 -14420 -24235 -31805 -36283 -49672 -65727 -49512 -13061
5246a3061O223j8012P688k073J3661J437L395n023j728N943P938j4252p679n615
$$ -13061 -6838 -24850 -17162 -19235 -5574 -4137 -742 -5765 -7493 -1550 6388 -7864 -15543 -21158
5232b1158M191Q643J1791j3235j3497N004M50N388j0436L529K0143q751o872p722
$$ -21158 -16967 -8324 3467 -9768 -23265 -18261 -17811 -12423 -22859 -19330 813 -7938 -14810 -22532
5218b2532R874J1490N328P225O083P270J9l1909r973o744J1786j3755j1855J0153
$$ -22532 -12658 -1168 4160 11385 17468 24738 24757 -7152 -17125 -23869 -12083 -25838 -37693 -27540
5204b7540R859K0116o414J4375J0169j2797j7504j109N503M619j078j1446j554
$$ -27540 -17681 2435 -3979 10396 20565 7768 -9736 -10845 -5342 -723 -1801 -13247 -14801
5191a4801L263j4675j8087J4953J7082J0722r396k599J3385k813l576l541r46
$$ -14801 -11538 -26213 -44300 -29347 -12265 -1543 -10939 -13538 -153 -2966 -6542 -10083 -11029
5178a1029P948o705J2100J8151J3461k0235j8293J1118q806j0657j2614N338o304
$$ -11029 -3081 -9786 2314 20465 33926 13691 -4602 6516 -2290 -12947 -25561 -20223 -26527
5165b6527N836J5104P866R06N350M495j772M302L041O468j5617k3500J8077J0057
$$ -26527 -20691 -5587 2279 3185 8535 13030 11258 15560 18601 25069 9452 -14048 4029 14086
5151A4086J0625j4068o756P307k0740m373L133K980j1131K2246K0540o652j6265
$$ 14086 24711 10643 3887 11194 -9546 -13919 -10786 -7806 -18937 3309 23849 17197 932
5138I32j9651P689J2656r385L693K2951J2070j5123j5355P477m086M970P517K5296
$$ 932 -18719 -11030 1626 -7759 -4066 18885 30955 15832 477 7954 3868 8838 16355 41651
5124D1651r392j5174j7985k38j0805l687M7n262K7793Q306j0801q908K195J4331
$$ 41651 32259 17085 -900 -1138 -11943 -15630 -15583 -20845 6948 15254 4453 -4455 -2260 12071
5110A2071k395p730l114j0241k0185M912J0170j1288P650K965J6083J8678m907
$$ 12071 9676 1946 -1168 -11409 -31594 -26682 -16512 -27800 -20150 -17185 -1102 17576 12669
5097A2669j0349n092P599p245j2752M76J3154n498m466L508q103J044l075K879
$$ 12669 2320 -2772 4827 -2418 -15170 -14694 -1540 -7038 -11504 -7996 -16099 -15055 -18130 -15251
5083a5251J6077L2888o328j2324K051j646n902j096k1154P8K1270J9854J435K045
$$ -15251 826 33714 27386 15062 17113 15467 9565 8469 -12685 -12607 8663 28517 29952 31997
5069C1997j6841j0985M621k252k790K767M495q349j9336j7515J4992Q35R783J2638
$$ 31997 15156 4171 8792 6540 3750 6517 11012 2663 -16673 -34188 -19196 -18361 -8578 4060
5055D060m414j0759K0177R254j7432j9480O814r779M963K400N597J9762L794j1955
$$ 4060 -354 -11113 9064 18318 886 -18594 -11780 -21559 -16596 -14196 -8599 11163 14957 3002
5041C002k4590k2685J7069J9889n751Q460R562q790r513o038l194P796J779N472
$$ 3002 -21588 -44273 -27204 -7315 -13066 -4606 4956 -3834 -13347 -19385 -22579 -14783 -13004 -7532
5027g532k058q844R413P201J0580R318q044r364l0337k025K438P86L0143J0466
$$ -7532 -9590 -18434 -9021 -1820 8760 18078 10034 670 -29667 -31692 -29254 -28468 1675 12141
5013A2141j9533j5394R125R048R331Q919q241j6250l016r46j0911K4389Q569j4628
$$ 12141 -7392 -22786 -13661 -4613 4718 13637 5396 -10854 -13870 -14816 -25727 -1338 7231 -7397
4999g397p673P988J3248j0535l184L12r58l046l29n132P304L934j33k661m428
$$ -7397 -15070 -7082 6166 -4369 -7553 -7241 -8199 -11245 -11574 -16706 -9402 -5468 -5601 -8262 -12690
4984a2690J2777J1950r597j2530J754o829j6742l822j775J400K1177K24o167m324
$$ -12690 87 12037 2440 -10090 -8336 -15165 -31907 -35729 -37504 -36104 -14927 -14703 -20870 -25194
4970b5194J001J375m334Q539J3855k846J0823Q221J45k4213p781r294K3711L884
$$ -25194 -24193 -22818 -27152 -18613 -4758 -7604 3219 11440 11585 -12628 -20409 -29703 -5992 -2108
4956b108n167p569j0565j1720J3892J2257R483R69K49n949q429O743K156j6933
$$ -2108 -7275 -14844 -25409 -37129 -23237 -10980 -1497 -528 -279 -6228 -14657 -7914 -5758 -22691
4942b2691j3365j5918j878J9272M000P442J9041J3301j6532q148K2836j5755j4641
$$ -22691 -36056 -51974 -53852 -34580 -30580 -23138 -4097 9204 -7328 -15476 7360 -8395 -23036
4929b3036O303j118N622j440N043l532k7399J5184L8131M692M801o205Q73q735
$$ -23036 -16733 -17851 -12229 -13669 -8626 -12158 -39557 -24373 13758 18450 23251 17046 17919 9184
4915I184k1102j1329J69l687N817q55r236L681M548n235m440k984j6651R024K965
$$ 9184 -11918 -23247 -23078 -26765 -20948 -21803 -31039 -27358 -22810 -28045 -32485 -35469 -52120 -43096 -40131
4900d0131J5418O879N629R969q475O998P937O298O957O63n4j536q126k697O00
$$ -40131 -24713 -17834 -12205 -2236 -10711 -3713 4224 10522 17479 18142 18088 16552 8426 5729 6329
4885F329j0516k075l592j3894j1742K6167L8654j867l8228k308N698L304P464
$$ 6329 -4187 -6262 -9854 -23748 -35490 -9323 29331 27464 -10764 -13072 -7374 -4070 3394
4872C394o011J2445j4498j6939r796R026R140n389O271J1686P530p413M521J573
$$ 3394 -2617 9828 -4670 -21609 -31405 -22379 -13239 -18628 -12357 -671 6859 -554 3967 5540
4858E540J207K5051Q149r74r963j6565r120k0581m060J1278L68l782M784o646
$$ 5540 6747 31798 39947 38973 29010 12445 3325 -17256 -21316 -10038 -9670 -13452 -8668 -15314
4844a5314M574k345q437R535L244L694P157j7800j4878M257l47j1262N443K4796
$$ -15314 -10740 -13085 -21522 -11987 -8743 -5049 2108 -15692 -30570 -26313 -26660 -37922 -32479 -7683
4830g683j1643j389J6585k093j76O299L555j9521l253P711J5083l726p954j1495
$$ -7683 -19326 -20715 -4130 -6223 -6399 -100 3455 -16066 -19319 -11608 3475 -251 -8205 -19700
4816a9700n675J4458M828j6243J5028P570P20j0829L673j7857o458K2600J8581
$$ -19700 -25375 -10917 -6089 -22332 -7304 266 986 -9843 -6170 -24027 -30485 -7885 10696
4803A0696m576p105l885p022m635P420L186L572O903j6951q470j7624K062L1533
$$ 10696 6120 -985 -4870 -11892 -16527 -9107 -5921 -2349 4554 -12397 -20867 -38491 -36429 -4896
4789d896K0879l089o022r773r215k07P017O713o297l2501R537K3254l192j281
$$ -4896 15983 12894 6872 -2901 -12116 -12323 -5306 1407 -4890 -37391 -27854 -4600 -7792 -9073
4775i073k6231p180J0760j189L299J9154r686P194J7197P065L500L017Q57M631
$$ -9073 -35304 -42484 -31724 -32913 -29614 -10460 -20146 -12952 4245 11310 14810 17827 18684 23315
4761B3315J3095M051j6655j9838m094r596l499Q954n019k620Q937o608O275l688
$$ 23315 36410 40461 23806 3968 -126 -9722 -13221 -4267 -9286 -11906 -2969 -9577 -3302 -6990
4747f990j3988k0099K074L9166K4342k127j9351n652P26J2474o408K070J085k4666
$$ -6990 -20978 -41077 -39003 163 24505 22378 3027 -2625 -1899 10575 4167 6237 7322 -17344
4733a7344N896j054o936j1971L705J5433j5330n557j371r02K293J4694M090k148
$$ -17344 -11448 -12502 -19438 -31409 -27704 -12271 -27601 -33158 -34529 -35431 -33138 -18444 -14354 -16502
4719a6502r181m930L99Q255J5025K540J7600j624j1700J544L314j7864k6329j0381
$$ -16502 -25683 -30613 -30214 -21959 -6934 -4394 13206 11582 -118 1426 4740 -13124 -39453 -49834
4705d9834P665J1975K8140J8998P95j8860N64L270q597K576m066J038j1962K684
$$ -49834 -42169 -30194 -2054 16944 17739 -1121 -557 2713 -5884 -3308 -7374 -6336 -18298 -15614
4691a5614J7548J6476q039j1020k599N064J860r308K088j795J0170J0679K064
$$ -15614 1934 18410 10371 -649 -3248 1816 3676 -5632 -3544 -5339 4831 15510 17574
4678A7574j1214j8604k3049O549p481L2864O493o734j2230j547k214j0618j0831
$$ 17574 6360 -12244 -35293 -28744 -36225 -3361 3132 -3602 -15832 -17379 -19593 -30211 -41042
4665d1042J6085p136l078R169J4766R356J6384O861j10j0096R416r368q092j2230
$$ -41042 -24957 -32093 -35171 -26002 -11236 -1880 14504 21365 21255 11159 20575 11207 3115 -9115
4651i115j285J111r861l028J6455J7301J0268j6266Q21J002j7425p964J3556J5096
$$ -9115 -10400 -9289 -19150 -22178 -5723 11578 21846 5580 6401 7403 -10022 -17986 -4430 10666
4637A0666r936m081k264j4754k2880R507M0264k233j9631j4699k9266J6118K2873
$$ 10666 730 -3351 -5615 -20369 -43249 -33742 6522 4289 -15342 -30041 -59307 -43189 -20316
4624b0316J676r591R794O407m199K479J1910M053o406J3277J2000K126R54O656
$$ -20316 -18640 -28231 -18437 -12030 -16229 -13750 -1840 2213 -4193 9084 21084 23210 24164 30820
4610C0820r785k1776O61k55O721q145Q961J4603J5307k4152k5198P13J0412J176
$$ 30820 21035 -741 -80 -335 6386 -1759 7202 21805 37112 12960 -12238 -11525 -1113 63
4596F3J395K446j889k08O6K348o516K564J2207J3908O32j2667j8926l332L960
$$ 63 1458 3904 2015 1807 1873 4221 -2295 269 12476 26384 27016 14349 -4577 -7909 -3949
4581c949l805J830P432j299n159J8417j026j0516j3079q594n910K0622N772n669
$$ -3949 -7754 -5924 1508 209 -4950 13467 12441 1925 -11154 -19748 -25658 -5036 736 -4933
4567d933m825O318N032m082j9862K1681q127p376K420Q328j1603j452J4174K622
$$ -4933 -9758 -3440 1592 -2490 -22352 -671 -8798 -16174 -13754 -5426 -17029 -18481 -4307 -1685
4553a685m264p181Q382N615j1753r224P37K977P556N483j1612k0719q562L024
$$ -1685 -5949 -13130 -4748 867 -10886 -20110 -19373 -16396 -8840 -3357 -14969 -35688 -44250 -41226
4539d1226K1431J5479K3566P113j5331p540M699j7870j9106P356J1842K3668m60
$$ -41226 -19795 -4316 19250 26363 11032 3492 8191 -9679 -28785 -21429 -9587 14081 13621
4526A3621j779M072j6798N437m822L817j673l479J2459P655j559o76n936R504
$$ 13621 11842 15914 -884 4553 -269 3548 1875 -1604 10855 18510 16951 16275 10339 19843
4512A9843J4402L717p379J871j3714j2423j0664M565L355J175m470r434j048l135
$$ 19843 34245 37962 30583 32454 18740 6317 -4347 218 3573 4748 278 -9156 -10204 -13339
4498a3339K523M720q873M68K0055J2437j9428k1480K7863J7066N508j4747j0429
$$ -13339 -10816 -6096 -14969 -14501 5554 17991 -1437 -22917 4946 22012 27520 12773 2344
4485B344j9722P383K4502o856J0765O359j6226j0621k7571J085J4428Q088r763
$$ 2344 -17378 -9995 14507 7651 18416 24775 8549 -2072 -29643 -28558 -14130 -6042 -15805
4472a5805o490o604L087Q502n818n18k585O561j0292p644R607K2299R94q796l165
$$ -15805 -22295 -28899 -25812 -17310 -23128 -23646 -26231 -19670 -29962 -37606 -27999 -5700 -4706 -13502 -16667
4457a6667J952L004J5438L438L245J1534N483k315p56J4550r014j9390r823m2
$$ -16667 -14715 -11711 3727 7165 10410 21944 27427 25112 24356 38906 29892 10502 679 637
4443F37m734j222l957O191l052j8826O507l283J2910J6215K848q288j4921k999
$$ 637 -4097 -5319 -9276 -3085 -6137 -24963 -18456 -21739 -8829 7386 10234 1946 -12975 -15974
4429a5974L897j263P311j5554r911K1900P48k2501R650J4110n930j283j699O257
$$ -15974 -12077 -13340 -6029 -21583 -31494 -9594 -8846 -31347 -21697 -7587 -13517 -14800 -16499 -10242
4415a0242Q128j0886k168r095J1650J5403J8399j9457N485L488L733n636k677
$$ -10242 -2114 -13000 -15168 -24263 -12613 2790 21189 1732 7217 10705 14438 8802 6125
4402F125q733j8519J3118J3282Q580j2631J570L757Q364J043r325m037k418J6716
$$ 6125 -2608 -21127 -8009 5273 13853 1222 2792 6549 14913 15956 6631 2594 176 16892
4388A6892J8138Q175j6136j2440n279p644O667K177j0925k1244n215O679N053
$$ 16892 35030 43205 27069 14629 9350 1706 8373 10550 -375 -21619 -26834 -20155 -15102
4375a5102J5308k0248k759J678J1554J0626k6973q16J0346J0551Q881J3740J7495
$$ -15102 206 -20042 -22801 -21123 -9569 1057 -25916 -26732 -16386 -5835 3046 16786 34281
4362C4281j1695j7591R198o776L012k0016j8368K506O655J4625J416k5949j4327
$$ 34281 22586 4995 14193 7417 10429 -9587 -27955 -25449 -18794 -4169 -2753 -28702 -43029
4349d3029J775M315J1766J763J3080L630m892l49j6914Q299K5158m664k7791p3
$$ -43029 -41254 -36939 -25173 -23410 -10330 -6700 -11592 -11941 -28855 -20556 4602 -62 -27853 -27926
4335b7926P688J1502m483J0994J8974p564J3419K3239r159j8045k6043Q150j0769
$$ -27926 -20238 -8736 -13219 -2225 16749 9185 22604 45843 36684 18639 -7404 746 -10023
4322a0023p017o145J4013J915Q992m203r63M358J4554j930l2098Q86J4470J808
$$ -10023 -17040 -23185 -9172 -7257 1735 -2468 -3431 927 15481 13551 -18547 -17661 -3191 -1383
4308a383k3510j4598P984J4300J7536j3555O785J9164J636o694j6361J5059J829
$$ -1383 -24893 -39491 -31507 -17207 329 -13226 -6441 12723 14359 7665 -8696 6363 8192
4295H192J850L505j7712K781o588k9498K965J6353o536k445R657Q161J2591K514
$$ 8192 10042 13547 -4165 -1384 -7972 -37470 -34505 -18152 -24688 -27133 -17476 -9315 3276 5790
4281E790Q060J645Q633J2720k4286j2279K0683Q615j2287O496Q137k2512j1245
$$ 5790 13850 15495 24128 36848 12562 283 20966 29581 17294 23790 31927 9415 -1830
4268a830j1871p124J0538K4399M231l636j3145k8352p711k653O756L826j177k528
$$ -1830 -13701 -20825 -10287 14112 18343 14707 1562 -26790 -34501 -37154 -30398 -26572 -27749 -30277
4254c0277q439L2021J3102M364m756j2434n986k581O872J5944J837j1528r964
$$ -30277 -38716 -6695 6407 10771 6015 -6419 -12405 -14986 -8114 7830 9667 -1861 -11825
4241a1825J7440J3101j0301P607L998k537o003m965j1984M04R66J3968M539r276
$$ -11825 5615 18716 8415 16022 20020 17483 11480 6515 -5469 -5065 -4099 9869 14408 5132
4227E132k844N764O685l230M073j7428M475j0446L232J5590j4305j3179j7538
$$ 5132 2288 8052 14737 11507 15580 -1848 2627 -7819 -4587 11003 -3302 -16481 -34019
$$ [...]
##END NTUPLES=NMR SPECTRUM
##END=
