##TITLE=Analysis number 316000
Compound Code cc 48003
Book Reference 458/66
Project Code adrs
Chemist Name stevem
##JCAMPDX= 6.0         $$ Bruker NMR JCAMP-DX V2.0
##DATA TYPE= NMR SPECTRUM
##DATA CLASS= NTUPLES
##ORIGIN= Bruker BioSpin GmbH
##OWNER= NMR
$$ XWIN-NMR		Version 3.5
$$ Wed Dec 14 22:36:27 2005 GMT Standard Time (UT+0h)  MAYBRIDGE\NMR@NMR_250MHZ
##.OBSERVE FREQUENCY= 250.131544655141
##.OBSERVE NUCLEUS= ^1H
##.ACQUISITION MODE= SIMULTANEOUS (DQD)
##.ACQUISITION SCHEME= undefined
##.AVERAGES= 16
##.DIGITISER RES= 18
##SPECTROMETER/DATA SYSTEM= dpx250
##.PULSE SEQUENCE= zg30
##.SOLVENT NAME= CDCl3
##.SHIFT REFERENCE= (INTERNAL, CDCl3, 0, 16.4281)
##AUDIT TRAIL= $$ (NUMBER, WHEN, WHO, WHERE, WHAT)
$$ ##TITLE= Audit trail, XWIN-NMR		Version 3.5
$$ ##JCAMPDX= 5.01
$$ ##ORIGIN= Bruker BioSpin GmbH
$$ ##OWNER= NMR
$$ C:\u/data/dgb/nmr/ADRS/13870/pdata/1/auditp.txt
$$ ##AUDIT TRAIL=  $$ (NUMBER, WHEN, WHO, WHERE, WHAT)
(   1,<2005-12-14 22:35:53.31 +000>,<MAYBRIDGE\NMR>,<NMR_250MHZ>,
      <created by zg, POWCHK disabled, PULCHK disabled
       configuration hash MD5:
       62 19 C7 07 E1 42 D1 B7 37 6C 3D D0 77 39 F9 E6
       data hash MD5: 64K
       E0 4B 63 6C 0E 76 E5 FB 00 09 57 5C B7 14 B3 00>)
(   2,<2005-12-14 22:36:13.49 +000>,<MAYBRIDGE\NMR>,<NMR_250MHZ>,
      <Start of raw data processing
       ef LB = 0.3 FT_mod = 6 PKNL = 1 SI = 32K 
       data hash MD5: 32K
       01 C2 77 47 06 FE F5 E3 D4 5B 46 AC 22 C7 E5 80>)
(   3,<2005-12-14 22:36:16.54 +000>,<MAYBRIDGE\NMR>,<NMR_250MHZ>,
      <apk 
       data hash MD5: 32K
       32 10 57 D9 09 13 B4 4F D6 AF 91 34 11 3C 43 97>)
(   4,<2005-12-14 22:36:17.71 +000>,<MAYBRIDGE\NMR>,<NMR_250MHZ>,
      <abs ABSG = 5 
       data hash MD5: 32K
       FF F6 BA FA 3D 09 25 9E 3D A5 15 CE 3D F9 3D 42>)
$$ ##END=
$$ 
$$ hash MD5
$$ B8 2A F4 92 D3 E7 79 4C 4D E4 30 47 5C EB F7 F4
##$RELAX= 
##$RELAX= 
##$RELAX= 
##$RELAX= 
##$RELAX= 
##$RELAX= 
##$RELAX= 
$$ Bruker specific parameters
$$ --------------------------
##$DU= <C:\u>
##$EXPNO= 13870
##$NAME= <ADRS>
##$PROCNO= 1
##$TYPE= <nmr>
##$USER= <dgb>
##$AMP= (0..31)
100 100 100 100 100 100 100 100 100 100 100 100 100 100 100 100 100 100 
100 100 100 100 100 100 100 100 100 100 100 100 100 100 
##$AQSEQ= 0
##$AQ_mod= 3
##$AUNM= <au_zg>
##$AUTOPOS= <40 >
##$BF1= 250.13
##$BF2= 250.13
##$BF3= 250.13
##$BF4= 250.13
##$BF5= 500.13
##$BF6= 500.13
##$BF7= 500.13
##$BF8= 500.13
##$BYTORDA= 1
##$CFDGTYP= 0
##$CFRGTYP= 5
##$CHEMSTR= <none>
##$CNST= (0..31)
1 1 145 1 1 1 1 1 1 1 1 1 1 1 1 1 1 1 1 1 1 1 1 1 1 1 1 1 1 1 1 1 
##$CPDPRG= <>
##$CPDPRG1= <>
##$CPDPRG2= <>
##$CPDPRG3= <>
##$CPDPRG4= <mlev>
##$CPDPRG5= <mlev>
##$CPDPRG6= <mlev>
##$CPDPRG7= <mlev>
##$CPDPRG8= <mlev>
##$CPDPRGB= <>
##$CPDPRGT= <>
##$D= (0..31)
0 1 0 0 0 0 0 0 0 0.06 0 0 0 0 0 0 0.0002 0 0 0 0 0 0 0 0 0 0 0 0 0 0 
0 
##$DATE= 1134599751
##$DBL= (0..7)
120 120 120 120 120 120 120 120 
##$DBP= (0..7)
150 150 150 150 150 150 150 150 
##$DBP07= 0
##$DBPNAM0= <>
##$DBPNAM1= <>
$$ [...]
##$SUBNAM7= <"">
##$SUBNAM8= <"">
##$SUBNAM9= <"">
##$SW= 20.6930455092707
##$SWIBOX= (0..15)
0 0 3 0 0 0 0 0 0 0 0 0 0 0 0 0 
##$SW_h= 5175.983436853
##$TD= 65536
##$TD0= 1
##$TE= 294.16
##$TE2= 300
##$TE3= 300
##$TEG= 300
##$TL= (0..7)
0 120 120 120 120 120 120 120 
##$TP= (0..7)
150 150 150 150 150 150 150 150 
##$TP07= 0
##$TPNAME0= <>
##$TPNAME1= <>
##$TPNAME2= <>
##$TPNAME3= <>
##$TPNAME4= <>
##$TPNAME5= <>
##$TPNAME6= <>
##$TPNAME7= <>
##$TPOAL= (0..7)
0.5 0.5 0.5 0.5 0.5 0.5 0.5 0.5 
##$TPOFFS= (0..7)
0 0 0 0 0 0 0 0 
##$TUNHIN= 0
##$TUNHOUT= 0
##$TUNXOUT= 0
##$USERA1= <user>
##$USERA2= <user>
##$USERA3= <user>
##$USERA4= <user>
##$USERA5= <user>
##$V9= 5
##$VALIST= <valist>
##$VCLIST= <CCCCCCCCCCCCCCC>
##$VD= 0
##$VDLIST= <DDDDDDDDDDDDDDD>
##$VPLIST= <PPPPPPPPPPPPPPP>
##$VTLIST= <TTTTTTTTTTTTTTT>
##$WBST= 1024
##$WBSW= 4
##$XGAIN= (0..3)
0 0 0 0 
##$XL= 0
##$YL= 0
##$YMAX_a= 463462
##$YMIN_a= -437641
##$ZGOPTNS= <>
##$ZL1= 120
##$ZL2= 120
##$ZL3= 120
##$ZL4= 120
##$ABSF1= 16.42807
##$ABSF2= -4.2651
##$ABSG= 5
##$ABSL= 3
##$ALPHA= 0
##$AQORDER= 0
##$ASSFAC= 0
##$ASSFACI= 0
##$ASSFACX= 0
##$ASSWID= 0
##$AUNMP= <proc_1d>
##$AZFE= 0.1
##$AZFW= 0.1
##$BCFW= 0
##$BC_mod= 0
##$BYTORDP= 0
##$COROFFS= 0
##$CY= 12.5
##$DATMOD= 1
##$DC= 0
##$DFILT= <>
##$DTYPP= 0
##$F1P= 14.0000005364418
##$F2P= -0.99999901652339
##$FCOR= 0.5
##$FTSIZE= 32768
##$FT_mod= 6
##$GAMMA= 0
##$GB= 0
##$INTBC= 1
##$INTSCL= 1
##$ISEN= 128
##$LB= 0.3
##$LEV0= 0
##$LPBIN= 0
##$MAXI= 10000
##$MC2= 0
##$MEAN= 0
##$ME_mod= 0
##$MI= 0
##$NCOEF= 0
##$NC_proc= -3
##$NLEV= 6
##$NOISF1= 0
##$NOISF2= 0
##$NSP= 0
##$NTH_PI= 0
##$NZP= 0
##$OFFSET= 16.42807
##$PC= 1
##$PHC0= 84.78031
##$PHC1= 5.374297
##$PH_mod= 1
##$PKNL= yes
##$PPARMOD= 0
##$PSCAL= 4
##$PSIGN= 0
##$REVERSE= no
##$SF= 250.130023492662
##$SI= 32768
##$SIGF1= 0
##$SIGF2= 0
##$SINO= 400
##$SIOLD= 32768
##$SREGLST= <1H.CDCl3>
##$SSB= 0
##$STSI= 32768
##$STSR= 0
##$SW_p= 5175.98343685301
##$SYMM= 0
##$S_DEV= 0
##$TDeff= 65536
##$TDoff= 0
##$TI= <Analysis number 999999
Compound Code 99
Book Reference 9
Project Code 9>
##$TILT= no
##$TM1= 0
##$TM2= 0
##$TOPLEV= 0
##$USERP1= <user>
##$USERP2= <user>
##$USERP3= <user>
##$USERP4= <user>
##$USERP5= <user>
##$WDW= 1
##$XDIM= 32768
##$YMAX_p= 484032043
##$YMIN_p= -110696
$$ End of Bruker specific parameters
$$ ---------------------------------
##NTUPLES= NMR SPECTRUM
##VAR_NAME=  FREQUENCY,     SPECTRUM/REAL,   SPECTRUM/IMAG
##SYMBOL=    X,             R,               I
##VAR_TYPE=  INDEPENDENT,   DEPENDENT,       DEPENDENT
##VAR_FORM=  AFFN,          ASDF,            ASDF
##VAR_DIM=   32768,         32768,           32768
##UNITS=     HZ,            ARBITRARY UNITS, ARBITRARY UNITS
##FACTOR=    0.157963299565203, 1,           1
##FIRST=     4109.15355213783, 0,            0
##LAST=      -1066.82988471518, 0,           0
##MIN=       -1066.82988471518, -110696,     0
##MAX=       4109.15355213783, 484032043,    0
$$ Real data points
##PAGE= N=1
##DATA TABLE= (X++(R..R)), XYDATA
$$ [...]
16718c3638j8334Q620j247L6505O038k8635m4558j3528M0319M6812K2843n503
$$ -33638 -51972 -43352 -44599 -8094 -2056 -30691 -75249 -88777 -48458 -1646 21197 15694
16706A5694l2768J6028J7539k279k6447j9425k4775k5699J3926M2478L7967K8896
$$ 15694 -17074 -1046 16493 14214 -12233 -31658 -56433 -82132 -68206 -25728 12239 41135
16694D1135K787k0419k0647L085k756L028o957j1565L832k3008p110J6269J1192
$$ 41135 43922 23503 2856 5941 3185 6213 -744 -12309 -8477 -31485 -38595 -22326 -11134
16681a1134P919J4776k703m163j0983k60K601j0790j4100J6860K5634l9051j9792
$$ -11134 -3215 11561 8858 4695 -6288 -6548 -3947 -14737 -28837 -11977 13657 -25394 -45186
16668d5186L1391n049J3643O072j3776j1621K9081q1p905o544n838O333j4599
$$ -45186 -13795 -18844 -5201 871 -12905 -24526 4555 4474 -3431 -9975 -15813 -9480 -24079
16655b4079K3719J33K126q572J6618Q304q001k2133j4575M252K2386J652n740
$$ -24079 -360 -227 1899 -6673 9945 18249 10248 -11885 -26460 -22208 178 1830 -3910
16642c910j2787j7649O690O173J6440N631O517j9141q714K067N757N779K7j3456
$$ -3910 -16697 -34346 -27656 -21483 -5043 588 7105 -12036 -20750 -18683 -12926 -7147 -7120 -20576
16628b0576j195k0433l2082J5662J4346K1649O5588j7245j7093L274k5077N23
$$ -20576 -21771 -42204 -74286 -58624 -44278 -22629 42959 25714 8621 11895 -13182 -12659
16616a2659j5292j0248k448K5136j1547l7082k030J5113J7227o566J0862R446
$$ -12659 -27951 -38199 -40647 -15511 -27058 -64140 -66170 -51057 -33830 -40396 -29534 -20088
16604b0088J1578L3843l972j6067j3989j7758k5940P323n171J5731K1361m611
$$ -20088 -8510 25333 21361 5294 -8695 -26453 -52393 -45070 -50241 -34510 -13149 -17760
16592a7760p757j3843m684O569J2553K5428L7554R657m3340l5598N540M983K2559
$$ -17760 -25517 -39360 -44044 -37475 -24922 506 38060 47717 4377 -31221 -25681 -20698 1861
16579A861K2141J3034p622l5274r088K4805j6305k8446j5611J7906R832j2798
$$ 1861 24002 37036 29414 -5860 -14948 9857 -6448 -34894 -50505 -32599 -22767 -35565
16567c5565Q370M3424K5400j1755l4894j2636K7662N59j5891l564L5486R128j3952
$$ -35565 -27195 16229 41629 29874 -5020 -17656 10006 10565 -5326 -8890 26596 35724 21772
16554B1772J6861J1185L959j3167k4073j6522o734p951J0526j7646K6589N261
$$ 21772 38633 49818 53777 40610 16537 15 -6719 -14670 -4144 -21790 4799 10060
16542A0060L194J6325M392k8233J3176J5329l3348l3600R721R078j284p311K6919
$$ 10060 13254 29579 33971 5738 18914 34243 895 -32705 -22984 -13906 -15190 -22501 4418
16529D418q165J1022k0283k2881P99k2244K1316K0861r357k9897j1810J9697L5360
$$ 4418 -3747 7275 -13008 -35889 -35090 -57334 -36018 -15157 -24514 -54411 -66221 -46524 -11164
16516a1164j1050J210J0221l238j5785K9383K0562J1027J960n197K204J9098k1197
$$ -11164 -22214 -21004 -10783 -14021 -29806 -423 20139 31166 33126 27929 30133 49231 28034
16503B8034j0633k5606q016R733l1847k5886K0806J0925L1874N800l326J2213
$$ 28034 17401 -8205 -16221 -6488 -38335 -64221 -43415 -32490 -616 5184 1858 14071
16491A4071j1556k8267j3128L4333K0426j9407k2399J2643J8389j616p841M725
$$ 14071 2515 -25752 -38880 -4547 15879 -3528 -25927 -13284 5105 3489 -4352 373
16479C73j4035J8665J4672L334M561Q435j7951j1398K950K1963R022k5459k8143
$$ 373 -13662 5003 19675 23009 27570 36005 18054 6656 9606 31569 40591 15132 -13011
16466a3011J1061J8324J1700l1698k0489N603j708j0601m500L0575J2980l8506
$$ -13011 -1950 16374 28074 -3624 -24113 -18510 -20218 -30819 -35319 -4744 8236 -30270
16454c0270j6196K1235l1401j9649K2536K7020r556L076J7069l760m0450J2947
$$ -30270 -46466 -25231 -56632 -76281 -53745 -26725 -36281 -33205 -16136 -19896 -60346 -47399
16442d7399K5215q463N663J356J6047J4636ml629o979q933K673Q437j730M830
$$ -47399 -22184 -30647 -24984 -23628 -7581 7055 7051 3422 -3557 -12490 -9817 -1380 -3110 1720
16428A720R007n513J9777P442j8554m9194j2359J6256K3027k770P049J1556Q173
$$ 1720 10727 5214 24991 32433 13879 -35315 -47674 -31418 -8391 -11161 -4112 7444 15617
16415A5617J9925j2767j9366m27P615j6549j469o158j741J2856J4536J8673K0021
$$ 15617 35542 22775 3409 2982 10597 -5952 -7421 -13579 -15320 -2464 12072 30745 50766
16402E0766k729k9994n8970j7920L4029j6596n763J7651j0103J0596K6656o947
$$ 50766 48037 18043 -40927 -58847 -24818 -41414 -47177 -29526 -39629 -29033 -2377 -9324
16390i324r320J438L701P80p00R85M2667j850k3325j2580J2024M167N403M098
$$ -9324 -18644 -17206 -13505 -12725 -13425 -12440 30227 28377 5052 -7528 4496 8663 14066 18164
16376A8164R845j4983M2077L217k3395k3263k1908j9327R559M1850j326j1548
$$ 18164 28009 13026 55103 58320 34925 11662 -10246 -29573 -20014 21836 20510 8962
16364H962R255Q969k8033k2246L2646J0181N672k3548q231k3293k7781M2767N436
$$ 8962 18217 27186 -847 -23093 9553 19734 25406 1858 -6373 -29666 -57447 -14680 -9244
16351i244J4801J7260j2770K89j0297J4094k341o126k3267n3699k5237M5432J2297
$$ -9244 5557 22817 10047 10336 39 14133 11792 5666 -17601 -71300 -96537 -51105 -38808
16338c8808K7027l262l5133P830N4947M0321J8351O088j7083o081k2266o968J0507
$$ -38808 -11781 -15043 -50176 -42346 12601 52922 71273 77361 60278 54197 31931 24963 35470
16325C5470r192o374L847j773J1408j8206J2507P083j6036l178n08j7497Q422
$$ 35470 26278 19904 23751 21978 33386 15180 27687 34770 18734 15556 15048 -2449 5973
16312E973n35q839l610J8929j54k8441l637j5483J2751r618M290K0482J4113j150
$$ 5973 5438 -3401 -7011 11918 11764 -16677 -20314 -35797 -23046 -32664 -28374 -7892 6221 5071
16298E071j0894n042K1288K4694k6238l1205j7025K2342J8391q566Q221J5360
$$ 5071 -5823 -10865 10423 35117 8879 -22326 -39351 -17009 1382 -7184 1037 16397
16286A6397Q979j629k0079j5940L2247K6841o534k4127q768l0484P293J3031l029
$$ 16397 25376 23747 3668 -12272 19975 46816 40282 16155 7387 -23097 -15804 -2773 -5802
16273e802n319M425R048k056M232r192l905m557j872K981k002K2925N191J4521
$$ -5802 -11121 -6696 2352 296 4528 -4664 -8569 -13126 -14998 -12017 -14019 8906 14097 28618
16259B8618J8414N342l1648l837q65k8375O190N232J1565N521J2822l4708l0020
$$ 28618 47032 52374 20726 16889 16024 -12351 -6161 -929 10636 16157 28979 -5729 -35749
16246c5749K0001K0185q146k3196k0213L1371M158k3915J0694J9346l0596K0141
$$ -35749 -15748 4437 -3709 -26905 -47118 -15747 -11589 -35504 -24810 -5464 -36060 -15919
16234a5919J389k0759J7204l439j8172M331K3285K3925M059j5261j2603j62J8360
$$ -15919 -14530 -35289 -18085 -21524 -39696 -35365 -12080 11845 15904 643 -11960 -12122 6238
16221F238k5241K3936J2439j3283k3442N221j9012J8453J4545N747p636J0441
$$ 6238 -19003 4933 17372 4089 -19353 -14132 -33144 -14691 -146 5601 -2035 8406
16209H406k5311j2777k7015k5428L8420M815n454L4115J8377j8502j9667l9889
$$ 8406 -16905 -29682 -56697 -82125 -43705 -38890 -44344 -10229 8148 -10354 -30021 -69910
16197f9910k1703L0144L5028J1840j4457J2415Q704k2613j9434j2533p238L2122
$$ -69910 -91613 -61469 -26441 -14601 -29058 -16643 -7939 -30552 -49986 -62519 -69757 -37635
16185c7635K2736O07J9297M768j3044J8243m671l4454L3856N4047R400l9863l893
$$ -37635 -14899 -14292 5005 9773 -3271 14972 10301 -24153 9703 63750 73150 33287 29394
16172B9394k9528k1001N365k5588m588K7354K4074N3277L1968l4516l1999j0077
$$ 29394 -134 -21135 -15770 -41358 -45946 -18592 5482 58759 90727 56211 24212 14135
16160A4135N234M530p270p989o426o462j8997q608P001n328O594J5261l035m382
$$ 14135 19369 23899 16629 8640 2214 -4248 -23245 -31853 -24852 -30180 -23586 -8325 -11360 -15742
16146a5742K4847K211j8666K2693k8193l384L513j653O174K6585K1233j7421m600
$$ -15742 9105 11316 -7350 15343 -12850 -16234 -12721 -14374 -8200 18385 39618 22197 17597
16133A7597k7638k202j137L8549p332k0996k6854l2191K7699k061J967J624J3881
$$ 17597 -10041 -12243 -13380 25169 17837 -3159 -30013 -62204 -34505 -36566 -34599 -32975 -19094
16120a9094K0031J4956P736j3328j1485l941J804j1227m715m826M88P067O076
$$ -19094 937 15893 23629 10301 -1184 -5125 -3321 -14548 -19263 -24089 -23601 -16534 -10458
16107a0458J0660J5436J0634j3801k0162K4703j5063j5883j9398o427M2968J3845
$$ -10458 202 15638 26272 12471 -7691 17012 1949 -13934 -33332 -39759 3209 17054
16095A7054k4897r221j7565k3511k4401p270L3686L1696J2921j475o980j0343
$$ 17054 -7843 -17064 -34629 -58140 -82541 -89811 -56125 -24429 -11508 -12983 -19963 -30306
16083c0306n286L2830N0554K750k7148j1790L63J336M580j2923J8293k815l6705
$$ -30306 -35592 -2762 47792 50542 23394 11604 11967 13303 17883 4960 23253 20438 -16267
16070a6267r196J7798J8179n6R267l0560k3371r905L0106J1039J9276k6570j7455
$$ -16267 -25463 -7665 10514 10458 19725 -10835 -34206 -44111 -14005 -2966 16310 -10260 -27715
16057b7715P831L6795M1547l784l3099l2213j1254Q418J775o860j1436p780Q660
$$ -27715 -19884 16911 58458 54674 21575 -10638 -21892 -13474 -11699 -18559 -29995 -37775 -29115
16044b9115L0523L5678N590l2753k2976j1234O269J5973J4158l6244j8164J913
$$ -29115 1408 37086 42676 9923 -13053 -24287 -18018 -2045 12113 -24131 -42295 -40382
16032d0382O466N710J7770N397J0886L57q591M221k2829q982R509J7696O008N645
$$ -40382 -33916 -28206 -10436 -5039 5847 6204 -2387 1834 -20995 -29977 -20468 -2772 3236 8881
16018H881K8756m1607P87J8612O923j5324P478j277j8711L921J5094j3169l76
$$ 8881 37637 -3970 -3183 15429 22352 7028 14506 13229 -5482 -1561 13533 364 -12
16005a2K940j1280k775p620j766J2585j9825j1971K5139K0732J7675l0597j6979
$$ -12 2928 -8352 -11127 -18747 -20513 -7928 -27753 -39724 -14585 6147 23822 -6775 -23754
15992b3754J9874J1708M769j0724l3801r469M9799L2631n136k8539J3575o544
$$ -23754 -3880 7828 12597 1873 -31928 -41397 8402 41033 35897 7358 20933 14389
15980A4389k3539J600L891l5225K970J3824m213P441L1595j6728j0899k96q265
$$ 14389 -9150 -7550 -3659 -38884 -35914 -22090 -26303 -18862 12733 -3995 -14894 -15190 -23455
15967b3455j3595o908o648J473J5100M5739K6775J2397k4165k2549j298N181m3049
$$ -23455 -37050 -43958 -50606 -49133 -34033 11706 38481 50878 26713 4164 2866 8047 -35002
15954c5002k541K6340l663J1650r062K8961j6643m5246n014J9329J5442J0951
$$ -35002 -37543 -11203 -14866 -3216 -12278 16683 40 -45206 -50220 -30891 -15449 -4498
15942d498l521n726J4408j4322k0531l3399j5145L036L8560L7100K2128m090l7295
$$ -4498 -8019 -13745 663 -13659 -34190 -67589 -82734 -79698 -41138 -4038 18090 14000 -23295
15929b3295j2785K0513K1990k14j3072r595j0827n127p053R295J9842j4307j4117
$$ -23295 -36080 -15567 6423 6209 -6863 -16458 -27285 -32412 -39465 -30170 -10328 -24635 -38752
15916c8752J1691R193m385L722k0182k5384P311K6847K0995J9921J7143k7656
$$ -38752 -27061 -17868 -22253 -18531 -38713 -64097 -56786 -29939 -8944 10977 28120 464
15904D64K0177K3289p679j1481k6780q916L007L717J6511J0315L119k5410l4599
$$ 464 20641 43930 36251 24770 -2010 -10926 -7919 -4202 12309 22624 25743 333 -34266
15891c4266l5972J0735L5077Q912J1919K478N044j5141l852p541r122j2169M8254
$$ -34266 -70238 -59503 -24426 -15514 -3595 -1117 3927 -11214 -15066 -22607 -31729 -43898 4356
15878D356J9259m691m9890M713o6K0906J8675k2583R266k2706j809j1278r520
$$ 4356 23615 18924 -30966 -26253 -26319 -5413 13262 -9321 -55 -22761 -24570 -35848 -45368
15865d5368K5030J6728j906k6753K1612L5363j0706m1542r691N6209J122j3446
$$ -45368 -20338 -3610 -5516 -32269 -10657 24706 14000 -27542 -37233 18976 20098 6652
15853F652L962r358q83l2268l8079J8171M3024J9533p352P512k7282j3171K76
$$ 6652 10614 1256 373 -31895 -69974 -51803 -8779 10754 3402 10914 -16368 -29539 -29263
15840b9263J351j9534r168m833K4179K965l194Q070j6617J83L0700m710M733n830
$$ -29263 -27912 -47446 -56614 -61447 -37268 -34303 -37497 -29427 -46044 -45861 -15161 -19871 -15138 -20968
15826b0968k5681j1417J2623j9277j8580L9486J6342o429k5342J9647K8479o135
$$ -20968 -46649 -58066 -45443 -64720 -83300 -43814 -27472 -33901 -59243 -39596 -11117 -17252
15814a7252q600o688Q515L126K873Q897j2911j3010l9003M409J66k561L6021R607
$$ -17252 -25852 -32540 -24025 -20899 -18026 -9129 -22040 -35050 -74053 -69644 -69478 -72039 -36018 -26411
15800b6411J81N4496M2800k0444l3672j1653k302r004J3148j28K0811J6186J6272
$$ -26411 -26230 28266 71066 50622 16950 5297 2995 -6009 7139 7011 27822 44008 60280
15787F0280k3991o3809j2020O609K9343J6410k1898j6123J6385K3417l7798k4854
$$ 60280 36289 -27520 -39540 -32931 -3588 12822 -9076 -25199 -8814 14603 -23195 -48049
15775d8049K4932K2218k2329l0320p559J1327K8435K6569P628j4314j5644j358
$$ -48049 -23117 -899 -23228 -53548 -61107 -49780 -21345 5224 12852 -1462 -17106 -18464
15763a8464M358j1132N712J6628r544o954o873L1159K4701r897l4812j0908M659
$$ -18464 -14106 -25238 -19526 -2898 -12442 -19396 -26269 4890 29591 19694 -15118 -26026 -21367
15750b1367l416O160K2018k0685q000L750J7030n879o989J6733J31l702j1172
$$ -21367 -24783 -18623 3395 -17290 -25290 -21540 -4510 -10389 -17378 -645 -514 -4216 -15388
15737a5388R262J1478o664J4138n482k6370J5027K3167J7226k1352k4607j3073
$$ -15388 -6126 5352 -1312 12826 7344 -19026 -3999 19168 36394 15042 -9565 -22638
15725b2638j3730j977J490K0594L3988q442m551k0678j586J5394o55l0653m9634
$$ -22638 -36368 -38345 -36855 -16261 17727 9285 4734 -15944 -17530 -2136 -2791 -33444 -83078
15712h3078J229L9519O1735J1473k0169q857M914k2286P950J310J6022Q717j7406
$$ -83078 -81849 -42330 19405 30878 10709 1852 6766 -15520 -7570 -6260 9762 18479 1073
15699A073J0004K3712J406k3367O21n56O892j3376r065j6399j1521K1099J924
$$ 1073 11077 34789 36195 12828 13449 12893 19785 6409 -2656 -19055 -30576 -9477 -7553
15686g553J6916J7821j2803m5114Q660q820j2834J3851L6033J3282j2779n20J4632
$$ -7553 9363 27184 14381 -30733 -22073 -30893 -43727 -29876 6157 19439 6660 6140 20772
15673B0772j8997k1998m171K272J9251k279r924j6155j8099r264J181K7314K0075
$$ 20772 1775 -20223 -24394 -22122 -2871 -5150 -15074 -31229 -49328 -58592 -57411 -30097 -10022
15660a0022O392L943J2104j3042J4027k5265k4646J4339k1110o762K612L7165
$$ -10022 -3630 313 12417 -625 13402 -11863 -36509 -22170 -43280 -50042 -47430 -10265
15648a0265L56O151j7261P728J7520J0192q787o280J5371q957k7743l9471J1540
$$ -10265 -9909 -3758 -21019 -13291 4229 14421 5634 -646 14725 5768 -21975 -61446 -49906
15635d9906J9598J5507P463L095p887Q798N789k0952J7402j3628m243J1757O803
$$ -49906 -30308 -14801 -7338 -4243 -12130 -3332 2457 -18495 -1093 -14721 -18964 -7207 -404
15622d04J3602J5440J0037j5129j5943j0110j5099K1378L0001K1096j7898r181
$$ -404 13198 28638 38675 23546 7603 -2507 -17606 3772 33773 54869 36971 27790
15610B7790j8119k1782K5130Kj4011l12j7280O087R371K97K8441j3854m634j1416
$$ 27790 9671 -12111 13019 13021 -990 -1302 -18582 -12495 -3124 -2827 25614 11760 7126 -4290
15596d290j3072q133R369J5826Q689j1312L637K9878j2627k9716l642L5853K5973
$$ -4290 -17362 -25495 -16126 -300 8389 -2923 714 30592 17965 -11751 -15393 20460 46433
15583D6433p177P912n897l0632j3496l6743Q983J9470J7592K5884J8058J2969
$$ 46433 39256 47168 41271 10639 -2857 -39600 -30617 -11147 6445 32329 50387 63356
15571F3356j5629K849j3657m3996l6192J5439N090L891M6967k3250j8902J0497
$$ 63356 47727 50576 36919 -7077 -43269 -27830 -22740 -18849 28118 4868 -14034 -3537
15559c537n017J0566J0962J7560l671l0484j3809j3174j1282Q463L7178k142J3407
$$ -3537 -8554 2012 12974 30534 26863 -3621 -17430 -30604 -41886 -33423 3755 1613 15020
15546A5020J7769j3947j9559j8847J3816N969K8274k5025J123K4003N436Q175
$$ 15020 32789 18842 -717 -19564 -5748 221 28495 3470 4593 28596 34032 42207
15534D2207n479J1877k1187k2481k822n219Q958l3453n4839j2477J0682r412K7028
$$ 42207 36728 48605 27418 4937 2115 -3104 5854 -27599 -82438 -94915 -84233 -93645 -66617
15521f6617K9842n474r073L729J1015J9951j6234j0570k3554J0L8639p096J4042
$$ -66617 -36775 -42249 -51322 -47593 -36578 -16627 -32861 -43431 -66985 -66975 -28336 -35432 -21390
15508b1390L681j1453n075o629k74J9688J2561k2155l2757m312J7253K3784k3724
$$ -21390 -17709 -29162 -34237 -40866 -41140 -21452 -8891 -31046 -63803 -68115 -50862 -27078 -50802
15495e0802m757L0714J5436k2382k607L065p298k0037j331J0581q01K0028j2749
$$ -50802 -55559 -24845 -9409 -31791 -34398 -31333 -38631 -58668 -59999 -49418 -50219 -30191 -42940
15482d2940l630J387K3525k449n543L106j5759K8024j1787j2200O084n244J5978
$$ -42940 -46570 -45183 -21658 -24107 -29650 -26544 -42303 -14279 -26066 -38266 -32182 -37426 -21448
15469b1448N2877K7727n5905k7194J5360Q670M391m640J3957Q01O826Q731L1440
$$ -21448 31429 59156 3251 -23943 -8583 87 4478 -162 13795 14596 21422 30153 61593
15456F1593q49k9031P98K206k3359k5029k5376r505j6405L1311m24k694K545o571
$$ 61593 60744 31713 32511 34717 11358 -13671 -39047 -48552 -64957 -33646 -34070 -36764 -34219 -40790
15442d0790k263K8884K3679K866L0766n879j6789j5700R873J5645L4772k0637
$$ -40790 -43053 -14169 9510 12376 43142 37263 20474 4774 14647 30292 65064 44427
15430D4427n7164j4005p129n659k164J0954L293J6224K203l115K2539K9729k1875
$$ 44427 -12737 -26742 -33871 -39530 -41694 -30740 -27447 -11223 -9020 -12135 10404 40133 18258
15417A8258k392j7090l1087J2116j426J9493P054J5163j5250l1757j3359r116
$$ 18258 15866 -1224 -32311 -20195 -21621 -2128 4926 20089 4839 -26918 -40277 -49393
15405d9393J6164L0979J4238R45j586j2879M557K5171j9810P834L5272j1688k374
$$ -49393 -33229 -2250 11988 12933 11347 -1532 3025 28196 8386 16220 51492 39804 37430
15392C7430m6843j6679J4450K7788l448k0642j5098J2954J0120J0872J7676j769
$$ 37430 -9413 -26092 -11642 16146 12698 -7944 -23042 -10088 32 10904 28580 26811
15380B6811j4402p093m203J192j0751J6641Q306j0450M290J8436j0526j3407l5352
$$ 26811 12409 5316 1113 2305 -8446 8195 16501 6051 10341 28777 18251 4844 -30508
15367c0508j0929K5821j9519k1397K2294K0610L087n791j3169J4837O289j25K199
$$ -30508 -41437 -15616 -35135 -56532 -34238 -13628 -10541 -16332 -29501 -14664 -8375 -8500 -6301
15354f301j661l1284m1541o972J2708J1955K0779K2550K0742R575m257k7358P235
$$ -6301 -7962 -39246 -80787 -87759 -75051 -63096 -42317 -19767 975 10550 6293 -21065 -13830
15341a3830l257J7495R661K189j4433Q32l4740J8124K6575j7353j2590q571K3983
$$ -13830 -17087 408 10069 12258 -2175 -1343 -36083 -17959 8616 -8737 -21327 -29898 -5915
15328e915J4226q741l079j892K4133m664P619k58J0860m375l8601K367M4510L084
$$ -5915 8311 -430 -3509 -5401 18732 14068 21687 21429 32289 27914 -10687 -8320 36190 39274
15314C9274J639o112j8476J612k4615k7262J8406J8931p916m7942q411K2453N19
$$ 39274 40913 34801 16325 17937 -6678 -33940 -15534 3397 -4519 -52461 -60872 -38419 -37900
15301c7900J4172K7425O401j0050N273j6001J0859j3361M25J5947J8004K3927
$$ -37900 -23728 3697 10098 48 5321 -10680 179 -13182 -12757 3190 21194 45121
15289D5121k9911K97k4141K705J5025J8928j4360Q216j770j4516K1659K7486J0
$$ 45121 15210 15507 -8634 -5929 9096 28024 13664 21880 20110 5594 27253 54739 54749
15276E4749k6788j5844k3502L7114K6319K2179k7508l3474q823k759j7040m291
$$ 54749 27961 12117 -11385 25729 52048 74227 46719 13245 4422 1663 -15377 -19668
15264a9668K2850R741o040O588j4276Q288J4193K120J4185K3900p084m1882l1834
$$ -19668 3182 12923 6883 13471 -805 7483 21676 23796 37981 61881 54797 12915 -18919
15251a8919K8180M4912l7116M609k2355m984Q375j8550N760K0703k1462n437j2863
$$ -18919 9261 54173 17057 21666 -689 -5673 2702 -15848 -10088 10615 -10847 -16284 -29147
15238b9147j6712J2399J5022O694n507N104K4201k4863m3784J0669K2970R639
$$ -29147 -45859 -33460 -18438 -11744 -17251 -12147 12054 -12809 -56593 -45924 -22954 -13315
15226a3315k49m590L3918K632K953N840q821j3423R565N927j518m952r623j5489
$$ -13315 -13564 -18154 15764 18396 21349 27189 18368 4945 14510 20437 18919 13967 4344 -11145
15212a1145M786q717K573q87J6671K8353j2918j454K264J607K769O278J4115o403
$$ -11145 -6359 -15076 -12503 -13390 3281 31634 18716 17262 19526 21133 23902 30180 44295 37892
15198C7892m367m030q677l6167k7561k2370l361L0149J3090j419R733L7908j535
$$ 37892 33525 29495 20818 -15349 -42910 -65280 -68641 -38492 -25402 -26821 -17088 20820 19285
15185A9285j0700J549K142o778J5966K606p533j3345m318r151k5354P893K607
$$ 19285 8585 10134 12276 5498 21464 24070 16537 3192 -1126 -10277 -35631 -27738 -25131
15172b5131J5668L4537j7082j9762P436J0486K443K4996l3769l5681P921m780
$$ -25131 -9463 25074 7992 -11770 -4334 6152 8595 33591 -178 -35859 -27938 -32718
15160c2718o71J1769K41J3563k938k6825p630J8419J7853j115m291J6201m614
$$ -32718 -33389 -21620 -21379 -7816 -10754 -37579 -45209 -26790 -8937 -10052 -14343 1858 -2756
15147b756R453m109N880M0170J3152k4983j5097n23j538l53j2412j3938j0107
$$ -2756 6697 2588 8468 48638 61790 36807 21710 21187 19649 19296 6884 -7054 -17161
15134a7161L0799P327j3581p866n274j5373J8217L4499m750j9079k2826n128K7280
$$ -17161 13638 20965 7384 -482 -5756 -21129 -2912 31587 26837 7758 -15068 -20196 7084
15121G084j8648q695R988J6218L214K5776L3325m794k243j3890N919J3062M690
$$ 7084 -11564 -20259 -10271 5947 9161 34937 68262 63468 61225 47335 53254 66316 71006
15108G1006k4401n0737j3235J1765J3625k4092l524K6214J1080j6650q02m48j9006
$$ 71006 46605 -4132 -17367 -5602 8023 -16069 -19593 6621 17701 1051 249 -199 -19205
15095a9205m188p734l546l556K740J2513K236M179L2472R302k3326j9680K708
$$ -19205 -23393 -31127 -34673 -38229 -35489 -22976 -20740 -16561 15911 25213 1887 -17793 -15085
15082a5085N443K823j1066K37K8784p261n752p53j6704M522r116O875J0568j1596
$$ -15085 -9642 -6819 -17885 -17648 11136 3875 -1877 -2630 -19334 -14812 -23928 -17053 -6485 -18081
15068a8081J21j181l4653J0849J4532K8328j6024k0553P71K3173J1382J4229k298
$$ -18081 -17960 -19141 -53794 -42945 -28413 -85 -16109 -36662 -35891 -12718 -1336 12893 10595
15055A0595j0523j3376k2190J889K5724o907m72J6458Q335k4336J0974J1788J1913
$$ 10595 72 -13304 -35494 -33605 -7881 -14788 -15260 1198 9533 -14803 -3829 7959 19872
15042A9872o805k1169K0185K0810l766N481m3355k8461l04K5174K2618K7365j1888
$$ 19872 13067 -8102 12083 32893 29127 34608 -8747 -37208 -37512 -12338 10280 37645 25757
15029B5757j1783j3543k5302j237K2982L2885J0357n716m2296l0177K5045J2068
$$ 25757 13974 431 -24871 -26108 -3126 29759 40116 34400 -7896 -38073 -13028 -960
15017i60k4544p62R190K4796k7738k3363p200J1217J8262K6019K7545N378O0552
$$ -960 -25504 -26266 -17076 7720 -20018 -43381 -50581 -39364 -21102 4917 32462 37840 98392
15004I8392K8236j9276N1560J12167J66602K96525M07075R7129k14392j69121
$$ 98392 126628 107352 158912 271079 437681 734206 1141281 1238410 1024018 854897
14994H54897j68371j58450j60687j00645q6459o9773j0721k6969l5978l4840L004
$$ 854897 686526 528076 367389 266744 180285 110512 99791 72822 36844 2004 5008
14983E008K5260L1753K420k8181k8104J7501j5087j961J6957N388k7598l6745
$$ 5008 30268 62021 64441 36260 8156 25657 10570 8609 25566 30954 3356 -33389
14971c3389J359L7936P688k2852j2495J9814o3k2108q023N4638r218k4780l096
$$ -33389 -32030 5906 13594 -9258 -21753 -1939 -2002 -24110 -32133 22505 13287 -11493 -14589
14958a4589j4864j3400L0918j1669l7874J5004K5631L1705M794j1550l255K7409
$$ -14589 -29453 -42853 -11935 -23604 -61478 -46474 -20843 10862 15656 4106 851 28260
14946B8260N1904q174l8604l0003j6364N138R090K0403j0872P683k4974r201j8521
$$ 28260 80164 71990 33386 3383 -12981 -7843 1247 21650 10778 18461 -6513 -15714 -34235
14933c4235l4545L5800K8888J0758K0196j3007k194j1324Q640k0218j4038q7j9713
$$ -34235 -68780 -32980 -4092 6666 26862 13855 11661 337 8977 -11241 -25279 -25366 -45079
14920d5079J8493j6282j2115J6041L6620J7150j467j6153j3247L780J3068J215
$$ -45079 -26586 -42868 -54983 -38942 -2322 14828 13361 -2792 -16039 -12259 809 2024
14908B024J2991J1166J1054k3419J333K0855J0131m212K5654n706m7522N53j8701
$$ 2024 15015 26181 37235 13816 15149 36004 46135 41923 67577 61871 14349 14902 -3799
14895c799m577J606J1138k8828m898j2675o241m729K8414K5295J093j3602K788
$$ -3799 -8376 -6770 4368 -24460 -29358 -42033 -48274 -53003 -24589 706 1799 -11803 -9015
14882i015J2228K911j8012l3128J3534K4006J8843P779p369k5051q52N991m473
$$ -9015 3213 6124 -11888 -45016 -31482 -7476 11367 19146 11777 -13274 -14126 -8135 -12608
14869a2608k2903k2993r633j1958J3409Q893Q22R454O119L8875R496j3399j4766
$$ -12608 -35511 -58504 -68137 -80095 -66686 -57793 -56971 -47517 -41398 -2523 6973 -6426 -21192
14856b1192K11j6483K1198M3100q188k1305J217J2117k52K919m77J5821n162l8695
$$ -21192 -20981 -37464 -16266 26834 18646 -2659 -1442 10675 10423 13342 12865 28686 23524 -15171
14842a5171L222K4234K716j0884j619Q718J661Q740k0602K5137n926j5627k9536
$$ -15171 -11949 12285 15001 4117 2498 11216 12877 21617 1015 26152 20226 4599 -24937
14829b4937k227q270j8121j6058M303K1659l45l06K4551L858l4209q484L21M4130
$$ -24937 -27164 -35434 -53555 -69613 -65310 -43651 -43996 -44302 -19751 -15893 -50102 -58586 -58265 -14135
14815a4135J7088j500J2318k7694r605j569J6467N354K052Q649N887j9991K359
$$ -14135 2953 1453 13771 -13923 -23528 -25097 -8630 -3276 -1224 7425 13312 -6679 -4320
14802d320L938r850j3391J592R552N096j856o931J4213K5683k1855j3594J3482
$$ -4320 -382 -10232 -23623 -22031 -12479 -7383 -9239 -16170 -1957 23726 1871 -11723 1759
14789A759K1490j1726l2460J364Q009j1957J7729N009j5203n625P499J107Q375
$$ 1759 23249 11523 -20937 -19573 -11564 -23521 -5792 -783 -15986 -21611 -14112 -13005 -4630
14776d630K7550K7659j8975j1128K0937N293l3278k9728J61l2114J4463P721J8139
$$ -4630 22920 50579 31604 20476 41413 46706 13428 -16300 -16139 -48253 -33790 -26069 -7930
14763g930l733k61K0821j9065N555k7926j4964N4285K2306p420J3725n208M729
$$ -7930 -11663 -11924 8897 -10168 -4613 -32539 -47503 6782 29088 21668 35393 30185 34914
14750C4914k7499j0637N498J938j9871J3192J0776j2330r552q040M927M386j9276
$$ 34914 7415 -3222 2276 4214 -15657 -2465 8311 -4019 -13571 -21611 -16684 -12298 -31574
14737c1574J1263k031L207K9029K5712r128q053l444J3190q303l671o645j4675
$$ -31574 -20311 -22342 -19135 9894 35606 26478 18425 14981 28171 19868 16197 9552 -5123
14724e123J375N980O986k7161m7049J1647M8756M2628J2611m1275l6848K2785
$$ -5123 -3748 2232 9218 -17943 -64992 -53345 -4589 38039 50650 9375 -27473 -4688
14712d688J1188k0573K3583L599k4515L3M1168L3946P474j5886j7402m751n763
$$ -4688 6500 -14073 9510 13109 -11406 -11373 29795 63741 71215 55329 37927 33176 27413
14699B7413O112K140j114j5502j3471j0625j4900l030K2126M781M226L618J89
$$ 27413 33525 35665 34551 19049 5578 -5047 -19947 -22977 -851 3930 8156 11774 11963
14686A1963n277P015n590k8517J0595J5120m960l6207n507J7131J4313p883j4461
$$ 11963 6686 13701 8111 -20406 -9811 5309 349 -35858 -41365 -24234 -9921 -17804 -32265
14673c2265r668k1252L6942J8144J1099m939j354K7260M3155K565j2377l816j8619
$$ -32265 -41933 -63185 -26243 -8099 3000 -1939 -3293 23967 67122 69687 57310 53494 34875
14660C4875j1165k656R320J2498R793j2981j8660L280J0361j1256k5690k1138
$$ 34875 23710 21054 30374 42872 52665 39684 21024 24304 34665 23409 -2281 -23419
14648b3419J295K194J3888J9711m559o0366q903P371K0872J2051K5169J2432K3417
$$ -23419 -22124 -19930 -6042 13669 9110 -51256 -60159 -52788 -31916 -19865 5304 17736 41153
14635D1153j1274j931M566M380M263l394j7974k0841p495r415P877j5320j371
$$ 41153 29879 27948 32514 36894 41157 37763 19789 -1052 -8547 -17962 -10085 -25405 -26776
14622b6776Q874j4633J2668K2267J9001j9747j2446j4979k436J1432P802J053
$$ -26776 -17902 -32535 -19867 2400 21401 1654 -10792 -25771 -28207 -16775 -8973 -7920
14610g920l8873K1960J9701J7812m3153k9016N34J3847J5893M590n974q54Q922
$$ -7920 -46793 -24833 -5132 12680 -30473 -59489 -58955 -45108 -29215 -24625 -30599 -31453 -22531
14597b2531N326K758p231P238J0964k4198m069L2140o20l0611k4380n545N093
$$ -22531 -17205 -14447 -21678 -14440 -3476 -27674 -31743 397 -223 -30834 -55214 -60759 -55666
14584e5666J1956M3139J3197k3452l673o682k2743m303K2527K3209j2598P078
$$ -55666 -43710 -571 12626 -10826 -14499 -21181 -43924 -48227 -25700 -2491 -15089 -8011
14572h011j4311l378l792l634j653J7977K033R991J2619p203N091k2802n564P503
$$ -8011 -22322 -25700 -29492 -33126 -34779 -16802 -14769 -4778 7841 638 5729 -17073 -22637 -15134
14558a5134K108j0941j7219J8767K6758K677r098j5236N317j7749J9664J0611
$$ -15134 -13026 -23967 -41186 -22419 4339 7016 -2082 -17318 -12001 -29750 -10086 525
14546E25J4505K0100j1825j7123k5405L676L605m289J7769K512O668J0040j6202
$$ 525 15030 35130 23305 6182 -19223 -15547 -11942 -16231 1538 4050 10718 20758 4556
14533D556l1692l203k0787m638l704l265l790L0589m921Q984L3306R938j8260
$$ 4556 -27136 -30339 -51126 -55764 -59468 -62733 -66523 -35934 -40855 -31871 1435 11373 -6887
14520f887J6938K2359r412p779j1490M346l7883j676J4815O828j1854K658R267
$$ -6887 10051 32410 22998 15219 3729 8075 -29808 -31484 -16669 -9841 -21695 -19037 -9770
14507i770J058j2182J3846N041m6634r643L4348J3835j965N0L0052j929l1320
$$ -9770 -8712 -20894 -7048 -2007 -48641 -58284 -23936 -10101 -12066 -12016 18036 16107 -15213
14494a5213j9780k7014J5875M0646j4888l4491o319J9841N497r395m606J9087
$$ -15213 -34993 -62007 -46132 -5486 -20374 -54865 -61184 -41343 -35846 -45241 -49847 -30760
14482c0760L4527J345l813K4289J006l5456J4240J903k05j5471m0657m199m305
$$ -30760 3767 5112 1299 25588 26594 -8862 5378 7281 7076 -8395 -49052 -53251 -57556
14469e7556j4862J782N221J7266m581K8019K8077L444k6943m83j2811J6611J8663
$$ -57556 -72418 -70636 -65415 -48149 -52730 -24711 3366 6810 -20133 -20616 -33427 -16816 1847
14456A847n359K943J7819J8273P823k0141k6018P632n373L4867K206n605k8555
$$ 1847 -3512 -569 17250 35523 43346 23205 -2813 4819 -554 34313 36519 30914 2359
14443B359o462K2438J9653p702j3465k0282O762j7216l6589j1347K3423K1789
$$ 2359 -4103 18335 37988 30286 16821 -3461 3301 -13915 -50504 -61851 -38428 -16639
14431a6639O55p601j2544J7790J0917J5320m368k595L733J786m971k347k2136
$$ -16639 -15984 -23585 -36129 -18339 -7422 7898 3530 935 4668 6454 1483 -864 -23000
14418b3000K657O676p894J2878j0209j2909m11J5846J0873j853J2918q295r422
$$ -23000 -20343 -13667 -21561 -8683 -18892 -31801 -32212 -16366 -5493 -7346 5572 -2723 -12145
14405a2145p534j05k6179J9701M2810n986k6932o1883j4883K7012J9492J3818
$$ -12145 -19679 -19784 -45963 -26262 16548 10562 -16370 -78253 -93136 -66124 -46632 -32814
14393c2814K4200K729j3133J6280j9098J2986L6662q02j4308k9293Q680j7618
$$ -32814 -8614 -5885 -19018 -2738 -21836 -8850 27812 27010 12702 -16591 -7911 -25529
14381b5529l4356p325J1230k6719L5856L7240J5640j3371r088J047P565j6616
$$ -25529 -59885 -67210 -55980 -82699 -46843 -9603 6037 -7334 -16422 -15375 -7810 -24426
14369b4426J3481Q359k992Q073j9120K5351L5460l3634l923J7205N264j7658K2401
$$ -24426 -10945 -2586 -5578 2495 -16625 8726 44186 10552 6629 23834 29098 11440 33841
14356C3841J015p431j5596J6362Q732k9202j0151L3Q523K523J6814j0484J2977
$$ 33841 34856 27425 11829 28191 36923 7721 -2430 -2397 6126 8649 25463 14979 27956
14343B7956l244k7766j460j419P472O563l7687j8860l683m816J6161j558k4412
$$ 27956 24712 -3054 -4514 -5933 1539 8102 -29585 -48445 -52128 -56944 -40783 -42341 -66753
14330f6753K6577l699Q809L9557j565M162J0554p305r558J8135j0571m169L7015
$$ -66753 -40176 -43875 -35066 4491 2926 7088 17642 10337 779 18914 8343 4174 41189
14317D1189k2525j6734K4306l1925k0741O086p689L4784K2819l8574L722Q665
$$ 41189 18664 1930 26236 -5689 -26430 -20344 -28033 6751 29570 -9004 -5282 3383
14305C383J197M639J6530K1280j9463m09J4502O446k6404k5294j0904M94M6Q532
$$ 3383 4580 9219 25749 47029 27566 27157 41659 48105 21701 -3593 -14497 -14003 -13957 -5425
14291e425N221k1322j0365J688Q867k1645J8567J7633q283m4306K509L8514K5900
$$ -5425 -204 -21526 -31891 -30203 -21336 -42981 -24414 -6781 -15064 -59370 -56861 -18347 7553
14278G553J0416Q208n864L058j1609q449o514J2948n011n757K275j2549o848L2027
$$ 7553 17969 26177 20313 23371 11762 3313 -3201 9747 4736 -1021 1254 -11295 -18143 13884
14264A3884P323j3048j4694P571j8091m159J3606r539j5995m987J1261Q640K350
$$ 13884 21207 8159 -6535 1036 -17055 -21214 -7608 -17147 -33142 -38129 -26868 -18228 -15878
14251a5878n215j322K0184l518J3684l1708j6395J696J0556Q449q386M209P803
$$ -15878 -21093 -22415 -2231 -5749 7935 -23773 -40168 -38472 -27916 -19467 -27853 -23644 -15841
14238a5841n597j202L4421k120L0231K1950j9402j3219m950l071k0167j2452k647
$$ -15841 -21438 -22640 11781 9661 39892 61842 42440 29221 24271 21200 1033 -11419 -14066
14225a4066r948j1386K6002J9898j0213K2293j2105k1027n063K0317J4700j6619
$$ -14066 -24014 -35400 -9398 10500 287 22580 10475 -10552 -15615 4702 19402 2783
14213B783j5563j0141r433j1643k563K3601m432J4179J0284n881J4721j1254Q86
$$ 2783 -12780 -22921 -32354 -43997 -46560 -22959 -27391 -13212 -2928 -8809 5912 -5342 -4456
14200d456j4104j7134K2341L1511m554k1136O86j4705k5182Q690M555m706J0434
$$ -4456 -18560 -35694 -13353 18158 13604 -7532 -6846 -21551 -46733 -38043 -33488 -38194 -27760
14187b7760N201O071J1115N406k9904J6783J1033M909J2723q455j9101K0715J6998
$$ -27760 -22559 -16488 -5373 33 -29871 -13088 -2055 2854 15577 7122 -11979 8736 25734
14174B5734K7655n451l1183n139j9511j9336K0376J3830r14k2243J4256J1783
$$ 25734 53389 47938 16755 11616 -7895 -27231 -6855 6975 6061 -16182 -1926 9857
14162I857O353k0260l6433J0499J5775l69J042j1215R454N926J1002Q088J032
$$ 9857 16210 -4050 -40483 -29984 -14209 -14578 -13536 -24751 -15297 -9371 1631 9719 10751
14149A0751j0901k8849k246J3294L383j6004J946l440K1786K9537J5727J343k5561
$$ 10751 -150 -28999 -31245 -17951 -14568 -30572 -28626 -32066 -10280 19257 34984 36327 10766
14136A0766l946m2003l6619K9120J4972j6500k8745O767O628L0314K2716J0435
$$ 10766 6820 -35183 -71802 -42682 -27710 -44210 -72955 -66188 -59560 -29246 -6530 3905
14124C905j4651m813L4821J6639j8425m0789J6903J9298R650k2906j3530l5944
$$ 3905 -10746 -15559 19262 35901 17476 -23313 -6410 12888 22538 -368 -13898 -49842
14112d9842J0354m734k3235K028J0981j0874K8420L4275R482k95o618J5930k7657
$$ -49842 -39488 -44222 -67457 -65429 -54448 -65322 -36902 -2627 6855 6560 -58 15872 -11785
14099a1785O70K0994j305j8086J150R461j6868r081K5429M1538J0498k0960r267
$$ -11785 -11115 9879 8574 -9512 -8362 1099 -15769 -24850 579 42117 52615 31655 22388
14086B2388J0804q783J7354j7578k4211k2099J420j5694j4288K1215L2608K7620
$$ 22388 33192 24409 41763 24185 -26 -22125 -20705 -36399 -50687 -29472 3136 30756
14074C0756j5273j749J2093J9119N95j6502j9075J543k786k7192j8981J3025J2701
$$ 30756 15483 13734 25827 44946 45541 29039 9964 11507 8721 -18471 -37452 -24427 -11726
14061a1726j2066l502j7916j0187j127J5402L3183N609o850l780k1583J4198P351
$$ -11726 -23792 -27294 -45210 -55397 -56524 -41122 -7939 -2330 -9180 -12960 -34543 -20345 -12994
14048a2994j1368l201K360l1721n182Q248N1061m148K0640j7327m4699R917L615
$$ -12994 -24362 -27563 -25203 -56924 -62106 -53858 -2797 -6945 13695 -3632 -48331 -38414 -34799
14035c4799K8921J2917J0636K63l2981L5772Mn849K2510k982J1731j9439m3688
$$ -34799 -5878 7039 17675 17938 -15043 20729 20733 14884 37394 34412 46143 26704 -16984
14022a6984J1728K0036k3262r962J6832k0128M650N914l631J53N548K7725L925
$$ -16984 -5256 14780 -8482 -18444 -1612 -21740 -17090 -11176 -14807 -14654 -9106 18619 22544
14009B2544k5213k556p356j190j590K9468K1244J1911k9183O322L491m3505K684
$$ 22544 -2669 -5225 -12581 -13771 -15361 14107 35351 47262 18079 24401 27892 -15613 -12929
13996a2929L8108N897j0991l4179K8430M23k0501K1204p523M87n956p378M185
$$ -12929 25179 31076 20085 -14094 14336 14759 -5742 15462 7939 8426 2470 -4908 -723
13983g23j1686J1820K9073J1297j4093q423j4914J797J4623q527j0003r28l639
$$ -723 -12409 -589 28484 39781 25688 17265 2351 4148 18771 10244 241 -687 -4326
13970d326r679q368J9676M331j8873m3672j1712J8871K4330M144j528J8203o073
$$ -4326 -14005 -22373 -2697 1634 -17239 -60911 -72623 -53752 -29422 -25278 -26806 -8603 -14676
13957a4676K978M1924l549n489j1178j9205r734R811m576k4761n304J4520K2718
$$ -14676 -11698 30226 26677 21188 10010 -9195 -18929 -9118 -13694 -38455 -43759 -29239 -6521
13944f521K5967J1739j1878j0275j5099L595j5912L263j213J5981k6245j1731
$$ -6521 19446 31185 19307 9032 -6067 -2472 -18384 -15121 -16334 -353 -26598 -38329
13932c8329K2798K5120j3660l592L7852L148K657j4769l7778o64L6564r84k4824
$$ -38329 -15531 9589 -4071 -7663 30189 33337 35994 21225 -16553 -17217 19347 18363 -6461
13919f461r543L2439M135k5185J534J3561o047j4796K115K6715J7618j7981j9735
$$ -6461 -16004 16435 20570 -4615 -3081 10480 4433 -10363 -8248 18467 36085 18104 -1631
13906a631k693j6816L9385k065j41L975J0766l7162m287J3165K411j730N102Q711
$$ -1631 -4324 -21140 18245 16180 16039 20014 30780 -6382 -10669 2496 4907 3177 8279 16990
13892A6990m5201m8879M962K7629O324l1868O796L7063K1902N584M213K192n587
$$ 16990 -28211 -77090 -72128 -44499 -38175 -70043 -63247 -26184 -4282 1302 5515 7707 2120
13879B120j2273P731m844k97N001J1649L2871L5055K18j5237r799k1301j3228
$$ 2120 -10153 -2422 -7266 -7563 -2562 9087 41958 77013 77231 61994 52195 30894 17666
13866A7666J6289j1752j7579k5624p001j497m0068K0888L0984J044L623o466k3669
$$ 17666 33955 22203 4624 -21000 -28001 -29498 -69566 -48678 -17694 -16650 -13027 -19493 -43162
13853d3162j9608J8923J0435M1837J8034k5386k52o777J5946P831l670n099l6062
$$ -43162 -62770 -43847 -33412 8425 26459 1073 821 -5956 9990 17821 14151 9052 -27010
13840b7010j2596J8186K3650J5312k1907m3900J5716K9502L0624j107k0588k6527
$$ -27010 -39606 -21420 2230 17542 -4365 -48265 -32549 -3047 27577 26470 5882 -20645
13828b0645N72J0688J2725R984k9271n683L1959m275o546j4612L766P224K1678
$$ -20645 -20073 -9385 3340 13324 -15947 -21630 10329 6054 -492 -15104 -11338 -4114 17564
13815A7564o390l0497j4223K7308K0951O883j935O42J4164K3791q370L530J0159
$$ 17564 11174 -19323 -33546 -6238 14713 21596 19661 20303 34467 58258 49888 53418 63577
13802F3577l0561m9072n121N9414L6268j5573k0627k5492l2396j5317L4934L533
$$ 63577 33016 -16056 -21177 38237 74505 58932 38305 12813 -19583 -34900 34 3567
13790C567m21p331R994j2627N595j0272J5924o2r878j1283J7729J9951L112L4355
$$ 3567 3146 -4185 5809 -6818 -1223 -11495 4429 4367 -5511 -16794 935 20886 23998 58353
13776E8353L1246j3520l7013j9997n772j7021J5265K0118k4483j2127j2204O503
$$ 58353 89599 76079 39066 19069 13297 -3724 11541 31659 7176 -4951 -17155 -10652
13764a0652Q279k6263R321L0626n585l40L3055O107l7520n180R528o864j1566
$$ -10652 -2373 -28636 -19315 11311 5726 5386 38441 44548 7028 1848 11376 4512 -7054
13751g054J7115J1207J1512j1394k2759l4826K2746R415l103K868K6162j4980
$$ -7054 10061 21268 32780 21386 -1373 -36199 -13453 -4038 -7141 -4273 21889 6909
13739F909l6908r828J809k583K0630J8820N6026L933l1718j6366j6555J7006K926
$$ 6909 -29999 -39827 -38018 -40601 -19971 -1151 54875 58808 27090 10724 -5831 11175 14101
13726A4101p936l136J8149K3139K6270j4414m310l944j8141K2006j8791Q636K270
$$ 14101 6165 3029 21178 44317 70587 56173 51863 47919 29778 51784 32993 41629 43899
13713D3899j5549k3125q838R635J9290L4778q837l7122M229J0303o265l8125P0
$$ 43899 28350 5225 -3613 6022 25312 60090 51253 14131 18360 28663 22398 -15727 -15657
13700a5657j0169j8117J9807K6081R323j6091K984K1431j6373n5650j3681L6555
$$ -15657 -25826 -43943 -24136 1945 11268 -4823 -1839 19592 3219 -52431 -66112 -29557
13688b9557M6282L3021j5344l0065m678L1172J1144l4572k5561j675n068J0532
$$ -29557 16725 49746 34402 4337 -341 30831 41975 7403 -18158 -19833 -24901 -14369
13676a4369J8010J2664O181N319j2255q111r615O471j0409J9608j538P71j2382
$$ -14369 3641 16305 22486 27805 15550 7439 -2176 4295 -6114 13494 11956 12727 345
13663C45L4975Q438l2006k0944J3797N081m9511m746M3626K0686j3371J8327j6165
$$ 345 35320 43758 11752 -9192 4605 9686 -39825 -44571 -945 19741 6370 24697 8532
13650H532K2719J1794j4300j0973j479K4752J8446l2357J717J3570r034k2504
$$ 8532 31251 43045 28745 17772 16293 41045 59491 27134 28851 42421 33387 10883
13638A0883k977q031K095P072j7781J0446J8647k0548r339l916O911P39K8855
$$ 10883 7906 -125 1970 9042 -8739 1707 20354 -194 -9533 -13449 -6538 -5799 23056
13625B3056K2615J1617l5774j384Q422k5419J812j7252j3823J0466O154j3652
$$ 23056 45671 57288 21514 20130 28552 3133 4945 -12307 -26130 -15664 -9510 -23162
13613b3162J502J8954K6823r741k0787m3011R722J4253j6185q201K4956J7089
$$ -23162 -21660 -2706 24117 14376 -6411 -49422 -39700 -25447 -41632 -49833 -24877 -7788
13601g788j1284l504M292K8164Q397l7584j2050o67J209M4018p496J3938K6404
$$ -7788 -19072 -22576 -18284 9880 18277 -19307 -31357 -32024 -30815 13203 5707 19645 46049
13588D6049j434K723r417j9129J1380J810k7884j5275k4879J2495J4757J4853
$$ 46049 44615 47338 37921 18792 30172 31982 4098 -11177 -36056 -23561 -8804 6049
13576F049P723N089L984j5611j728P356q785l5354k1588j4843l1881k322K9128
$$ 6049 13772 18861 22845 7234 5506 12862 4077 -31277 -52865 -67708 -99589 -101911 -72783
13563g2783J9987m09N942j3095K1908K6307m203K114L3991q46j2115j5309j4539
$$ -72783 -52796 -53205 -47263 -60358 -38450 -12143 -16346 -14232 19759 18913 6798 -8511 -23050
13550b3050N761m816p076R574L478L474J2084r34j2501O159J0239j2717Q358j8905
$$ -23050 -17289 -22105 -29181 -19607 -16129 -12655 -571 -1505 -14006 -7847 2392 -10325 -1967 -20872
13536b0872n343M848J2184L153o970j5212k2606M1013J7684o220L3479P316r59
$$ -20872 -26215 -21367 -9183 -6030 -13000 -28212 -50818 -9805 7879 1659 35138 42454 41495
13523D1495k7133J405M735L12J7325n688l7634k4534O775O319J4705K4887P837
$$ 41495 14362 15767 20502 20814 38139 32451 -5183 -29717 -22942 -16623 -1918 22969 30806
13510C0806j8772q535J6622R877j3550l0947j000L0914M59l671k018k6430o832
$$ 30806 12034 3499 20121 29998 16448 -14499 -15499 15415 15874 12203 10185 -16245 -23077
13497b3077J7118M5318K1258k2918k7892k4022M661K9175M72j7356M108K953R743
$$ -23077 -5959 39359 60617 37699 9807 -14215 -9554 19621 20093 2737 6845 9798 19541
13484A9541q862J7478p093n379O042m246J2810J515q205L06J21j1262J3695J861
$$ 19541 10679 28157 21064 15685 21727 17481 30291 31806 23601 23907 24028 12766 26461 28322
13470B8322p526k2699l851K5900p991j1425l9944p82L7750J9919m047m6154p310
$$ 28322 20796 -1903 -5754 20146 12155 730 -39214 -39996 -2246 17673 13626 -32528 -39838
13457c9838J9332k366j1836K785k86J4531M29M134q805k094K4628J5700J9554
$$ -39838 -20506 -22872 -34708 -31923 -32209 -17678 -17249 -13115 -21920 -24014 614 16314 35868
13444C5868K1450M043j5336n0119n503L415q02L9045M6793J80m7397j7589n62
$$ 35868 57318 61361 46025 -4094 -9597 -6182 -6984 32061 78854 79034 31637 14048 13486
13431A3486J0737j4441n370j0418j9607J9430K5795J4094l328l2318q578M338
$$ 13486 24223 9782 4412 -6006 -25613 -6183 19612 33706 30378 -1940 -10518 -6180
13419f180j4484Q186j4290J0395L2071K0690k381j8895m2157K402J7039o288l3004
$$ -6180 -20664 -12478 -26768 -16373 15698 36388 34007 15112 -27045 -24643 -7604 -13892 -46896
13406d6896K0958L5017j1699k1804j3439J1574M973Q09j1005l3713J2622M4779
$$ -46896 -25938 9079 -2620 -24424 -37863 -26289 -21316 -20507 -31512 -65225 -52603 -7824
13394g824K2223j0183m343P21l0890L5749J8151J983J8631l86j0702p0787M608
$$ -7824 14399 4216 -127 594 -30296 5453 23604 25587 44218 43832 33130 -37657 -33049
13381c3049M6244J1743k6183k4341K6826K3180R318K5541j6887k4928n733M375
$$ -33049 13195 24938 -1245 -25586 1240 24420 33738 59279 42392 17464 11731 16106
13369A6106K034j7813r939j7229J2226K9131k672j1328j2522R725j5502m454p4
$$ 16106 18140 327 -9612 -26841 -14615 14516 11844 516 -12006 -2281 -17783 -22237 -22311
13356b2311J5507P227k819J992L062n0489r200K4414K0574q764k286K5840n690
$$ -22311 -6804 423 -2396 -404 2658 -47831 -57031 -32617 -12043 -20807 -23093 2747 -2943
13343b943P587q596K132j0680j1329K3745L094K4319j416J232m053J1307j8179
$$ -2943 4644 -3952 -1820 -12500 -23829 -84 3010 27329 25913 27145 23092 34399 16220
13330A6220j7332N424k3216q895j817J4054J7439m998J6588J463r418r386o258
$$ 16220 -1112 4312 -18904 -27799 -29616 -15562 1877 -3121 13467 14930 5512 -3874 -10132
13317a0132j6037O02M789L6917M1828k2157j5169P657o241o341j0279M409j9312
$$ -10132 -26169 -25567 -20778 16139 57967 35810 20641 28298 22057 15716 5437 9846 -9466
13304i466k6826Q44M317L6261L1817J9966l030k0103k0975j8517k0722J0064L0328
$$ -9466 -36292 -35448 -31131 5130 36947 56913 53883 33780 12805 -5712 -26434 -16370 13958
13291A3958l619k6097Q501L8143M997r560j4340k5200O029l2676k0470K2496L0379
$$ 13958 10339 -15758 -7257 30886 35883 26323 11983 -13217 -7188 -39864 -60334 -37838 -7459
13278g459L847J0064J4448J8182j1050n5773l2517j4860j7397L0350N1492Q751
$$ -7459 -3612 6452 20900 39082 28032 -27741 -60258 -75118 -92515 -62165 -10673 -1922
13266a922L310J6437k3342k857J2581J7752Q727Q857j2643j7438k091k182J4296
$$ -1922 1388 17825 -5517 -8374 4207 21959 30686 39543 26900 9462 7371 5189 19485
13253A9485K5889r627L080J4410L786N758P31J2871k036j9579k4370P544j6904
$$ 19485 45374 35747 38827 53237 57023 62781 63512 76383 74347 54768 30398 37942 21038
13240B1038k9286J6217j1532O830K1454J3667k3828L236q590j0570P498j8200
$$ 21038 -8248 7969 -3563 3267 24721 38388 14560 17796 9206 -1364 6134 -12066
13228a2066n329J1939j148K4170Q840o450J4157O532j9999k149r44k3261R555
$$ -12066 -17395 -5456 -6604 17566 26406 19956 34113 40645 20646 18497 17553 -5708 3847
13215C847J3978j636K603J694J0623Q977N325j2569j0458J025j4095o373J5159
$$ 3847 17825 16189 18792 20486 31109 40086 45411 32842 22384 23409 9314 2941 18100
13202A8100N039k8329l345n109K8093J3599k3934j5039J4252J724J2279J0701
$$ 18100 23139 -5190 -8535 -13644 14449 28048 4114 -10925 3327 5051 17330 28031
13190B8031k313k5083K0557J1018q330M0260J252l0895m4034j6797K6232k1830
$$ 28031 25718 635 21192 32210 23880 64140 65392 34497 -9537 -26334 -102 -21932
13178b1932J8114M143M580P529j2418J4241k6214p315m87q577J1842N637J1803
$$ -21932 -3818 325 4905 12434 16 14257 -11957 -19272 -19759 -28336 -16494 -10857 946
13165I46L908o342k9723j9341r142J9365k141L9867L1190l642r135P316L0773
$$ 946 4854 -1488 -31211 -50552 -59694 -40329 -42470 -2603 28587 24945 15810 23126 53899
13152E3899R618k2925k284j3127k8071M299R090o681Q697R556k675j9186l7660
$$ 53899 63517 40592 38308 25181 -2890 1409 10499 3818 12515 22071 19396 210 -37450
13139c7450L415K877j677L345j6122q164O585K1991K0561J8750j0953O715k762
$$ -37450 -34035 -31158 -32835 -29490 -45612 -53776 -47191 -25200 -4639 14111 3158 9873 7111
13126G111j0856P702L370J9596O298m943k7358j9157J3486K6222k3734l777J5361
$$ 7111 -3745 3957 7327 26923 33221 28278 920 -18237 -4751 21471 -2263 -6040 9321
13113I321L3432L9844k5149r087q125o289K4635N227l9333j9339q306k6109L035
$$ 9321 42753 82597 57448 48361 40236 33947 58582 63809 24476 5137 -3169 -29278 -26243
13100b6243l75L1317K7230l1949K600K0545j909l5134j0857J5690p841o978k2680
$$ -26243 -26618 4699 31929 -20 2580 23125 21216 -13918 -24775 -9085 -16926 -23904 -46584
13087d6584J3918L1623Q064N246j2038Q826K5352j0549M185K3020J8999n472k4210
$$ -46584 -32666 -1043 7021 12267 229 9055 34407 23858 28043 51063 70062 64590 40380
13074D0380k0681j1104q392n498N316m846j5692L05J0627L3195K1786m599J2505
$$ 40380 19699 8595 203 -5295 21 -4825 -20517 -20212 -9585 23610 45396 40797 53302
13061E3302j3786m2291J2063j3494m5935k8685K1171N4310J9337N022p110j5794
$$ 53302 39516 -2775 9288 -4206 -50141 -78826 -57655 -3345 15992 21014 13904 -1890
13049a890J8699K019N44j0156j4226J800k8231j352J6642Q319L7052K0665j569
$$ -1890 16809 18828 19372 9216 -5010 -3210 -31441 -32793 -16151 -7832 29220 49885 48316
13036D8316r792K348K6005J2590j12l629L1482l52o3176j1202O076k7022j0917
$$ 48316 38524 40872 66877 79467 79355 75726 107208 106856 43680 32478 38554 11532 615
13023F15R353k135L3488k511q248k706J6342k405j9664j6451l588J4550j3008
$$ 615 9968 7833 41321 38810 30562 27856 44198 41793 22129 5678 2090 16640 3632
13010C632l1806M2931L4433j392k8527p416L8975M2627l246j7754P509P403m0248
$$ 3632 -28174 14757 49190 47798 19271 11855 50830 93457 90211 72457 79966 87369 47121
12997D7121j099j2716n0606K3517l07k2206K4785K8082J8288J7622J8472k7783
$$ 47121 46022 33306 -17300 6217 5910 -16296 8489 36571 54859 72481 90953 63170
12985F3170r95k1853l5832J1852J8131K9299j7327j6163j382o605k1171n393J2528
$$ 63170 62175 40322 4490 16342 34473 63772 46445 30282 28900 22295 1124 -4269 8259
12972H259K3924k0574m3416L188M838J0241J2143o514J7406J2952J908j4761k2367
$$ 8259 32183 11609 -31807 -28619 -23781 -13540 -1397 -7911 9495 22447 24355 9594 -12773
12959a2773J0743k1151R12R982r616Q50q178q303L6875j0051o659Q084k364k431
$$ -12773 -2030 -23181 -22269 -12287 -21903 -21053 -29231 -37534 -659 -10710 -17369 -9285 -11649 -14080
12945a4080L8594L1108J0177j2765j3286o525J3104j7929j7048q323m605k5498
$$ -14080 24514 55622 65799 53034 39748 33223 46327 28398 11350 3027 -1578 -27076
12933b7076l8329K1238M9913K5357J4573N942n1208k5343r87L4129j0804O311
$$ -27076 -65405 -44167 5746 31103 45676 51618 410 -24933 -25920 8209 -2595 3716
12921C716M3292J950j6965m3672j3544o918k0244P593M5819K0026l612J6031r340
$$ 3716 47008 48958 31993 -11679 -25223 -32141 -52385 -44792 1027 21053 17441 33472 24132
12908B4132m973j8078R203L8038r355L855k2087j6612J2962J5598J5113l1628
$$ 24132 19159 1081 10284 48322 38967 42822 20735 4123 17085 32683 47796 16168
12896A6168l0174k5150j4759M337K0966O302J925j4059J257K5056m915q901q523
$$ 16168 -14006 -39156 -53915 -49578 -28612 -22310 -20385 -34444 -33187 -8131 -13046 -21947 -30470
12883c0470k2360j820L3490L7849j026m2083j3623j6751L5260K6565L134N475
$$ -30470 -52830 -54650 -21160 16689 15663 -26420 -40043 -56794 -21534 5031 8165 13640
12871A3640R369j4745j4893r194j3703j0146J7704K0256J0003l2372j8576M2741
$$ 13640 23009 8264 -6629 -15823 -29526 -39672 -21968 -1712 8291 -24081 -42657 84
12859H4J8473j3956j0408j2909j6092L2972r898K9212j438q293j7539r682J8926
$$ 84 18557 4601 -5807 -18716 -34808 -1836 -11734 17478 16040 7747 -9792 -19474 -548
12846e48l5185l0460k609M6813K6899L724l957N107k5651P473Q023K389O468J2598
$$ -548 -35733 -66193 -68802 -21989 4910 8634 4677 9784 -15867 -8394 -371 2018 8486 21084
12832B1084O672K1515j622k8799r238M463p015k958J7853q873k3387j8457M898
$$ 21084 27756 49271 47649 18850 9612 14075 7060 4102 21955 13082 -10305 -28762 -23864
12819b3864J9061m175k2554o461j003J4761p236J5965P399o451K1179j1564k3560
$$ -23864 -4803 -8978 -31532 -37993 -38996 -24235 -31471 -15506 -8107 -14558 6621 -4943 -28503
12806b8503j9306M972L6333j0240R504J5059J0999O866j9605O657P333J8408O010
$$ -28503 -47809 -42837 -6504 -16744 -7240 7819 18818 25684 6079 12736 20069 38477 44487
12793D4487k7588l0968k516K4313M6048R745j646K198Q45P276l5887r435J432
$$ 44487 16899 -14069 -16585 7728 53776 63521 61875 64073 64918 72194 36307 26872 28304
12780B8304r16J0228l7972j5079O03L5113j5133m0281Q764L0637L6274J0043k5140
$$ 28304 27388 37616 -356 -15435 -14832 20281 5148 -35133 -26369 4268 40542 50585 25445
12767B5445j8308K2474N896n794k3143O925J9498O345j4698j5361o109P517q353
$$ 25445 7137 29611 35507 29713 6570 13495 32993 39338 24640 9279 3170 10687 2334
12754B334k8656P565K2864R776L935M113j3894p926M854L9324Q232k935n207P163
$$ 2334 -26322 -18757 4107 13883 17818 21931 8037 111 4965 44289 52521 49586 44379 51542
12740E1542J0478j9516j1823K2051J7582k5441n258M66j4075j646r95R401O321
$$ 51542 62020 42504 30681 52732 70314 44873 39615 40081 26006 24360 23365 32766 39087
12727C9087j7124j5905L406K7684k616m742j1778j1982K392J8169J3082k003K9158
$$ 39087 21963 6058 9464 37148 34532 29790 18012 6030 8422 26591 39673 37670 66828
12714F6828l3802M915J5072k0750k8657j2754j9346L001O630k1301N0363K6789
$$ 66828 33026 37941 53013 32263 3606 -9148 -28494 -25493 -18863 -40164 10199 36988
12702C6988j0612l0088J0169J4455K4634J3365K4053R007K86J0810l2094m420
$$ 36988 26376 -3712 6457 20912 45546 58911 82964 91971 92257 103067 70973 66553
12690F6553o690r875J9032m485j6209k5330l619k475j5681m678J5838K9124o330
$$ 66553 59863 49988 69020 64535 48326 22996 19377 16902 1221 -3457 12381 41505 35175
12677C5175j9832m2875q136J4072O743k517l0612j8479Q272K8071J6207l181j6075
$$ 35175 15343 -27532 -35668 -21596 -14853 -17370 -47982 -66461 -58189 -30118 -13911 -17092 -33167
12664c3167L55k0715J4687K4350J8939R948O508J6995J0580M052J7690J4945l5707
$$ -33167 -32812 -53527 -38840 -14490 4449 14397 20905 37900 48480 52532 70222 85167 49460
12651D9460o654R550j3032j8329j4765J349L077L3529j1281l5016j2845N90J7652
$$ 49460 42806 52356 39324 20995 6230 7579 10656 44185 32904 -2112 -14957 -14367 3285
12638C285N7446m2719l7957o304M4434K7219L7291r590j5473m8972k5040R261
$$ 3285 60731 18012 -19945 -26249 18185 45404 82695 73105 57632 8660 -16380 -7119
12626g119K2841n273j8987r697J3243M790P640L898o841o442K4460J7341k4155
$$ -7119 15722 10449 -8538 -18235 -4992 -202 7438 11336 4495 -1947 22513 39854 15699
12613A5699n0066j5143N5980K7406k5374J101j2254k8969L584j465o174R931j9873
$$ 15699 -34367 -49510 6470 33876 8502 9603 -2651 -31620 -28036 -29501 -35675 -25744 -45617
12600d5617K5787L6605k569K9738L6219J0465m2444n5862N353J9548l374K5900
$$ -45617 -19830 16775 14206 43944 80163 90628 48184 -7678 -2325 17223 13849 39749
12588C9749J145p990k1485l5673K7776J4900L800k2512J2442Q931j2414L249j4090
$$ 39749 40894 32904 11419 -24254 3522 18422 22222 -290 12152 21083 8669 11918 -2172
12575b172J923J1286L3848k5094j6663n805K5151j0422j9152L09l4936J6244R625
$$ -2172 -249 11037 44885 19791 3128 -2677 22474 12052 -7100 -6791 -41727 -25483 -15858
12562a5858N974K1091K1257k2524L860J7177n01l0659j8478j0085L1156K9350
$$ -15858 -9884 11207 32464 9940 13800 30977 30476 -183 -18661 -28746 2410 31760
12550C1760j5068j4065J025p143l749j3953J5129L9023J1207K450j1738l710j1949
$$ 31760 16692 2627 3652 -3491 -7240 -21193 -6064 32959 44166 46616 34878 31168 19219
12537A9219K514O264m5448J4187L7469O582Q14N98k6663j2926L2077L3101k097
$$ 19219 21733 27997 -17451 -3264 34205 40787 41601 42199 15536 2610 34687 67788 65691
12524F5691J229J6241K9283K5947M7172M0181J50232K75291J34171r1923q9975
$$ 65691 66920 83161 112444 138391 185563 225744 375976 651267 785438 693515 603540
12513F03540q8118j19033j29667j03246n7422l2268l3145n408p340j7042J637
$$ 603540 515422 396389 266722 163476 106054 73786 40641 35233 27893 10851 12488
12502A2488M2006k029m0064m8126j742L326j0861j2545L8624Q758j1671N96J1031
$$ 12488 54494 52465 12401 -35725 -37467 -34141 -45002 -57547 -18923 -10165 -21836 -21240 -10209
12489a0209O079K6929k3350l8411L794J8429M0169j6073o965J7056j7213k2256
$$ -10209 -4130 22799 -551 -38962 -35168 -16739 23430 7357 392 17448 235 -22021
12477b2021k7502J1136K1521M9696j211j0487J3737j914N278N074L37J1954J2383
$$ -22021 -49523 -38387 -16866 32830 31619 21132 34869 32955 38233 43307 43644 55598 67981
12464F7981q631j2258k3759m679K357l050J5718k2422m3011K8076M4880J2556
$$ 67981 59350 47092 23333 18654 21011 17961 33679 11257 -31754 -3678 41202 53758
12452E3758J3703j0985l1490l7573j2511L3237K0622K7965k4002J1733o245k2393
$$ 53758 67461 56476 24986 -12587 -25098 8139 28761 56726 32724 44457 38212 15819
12440A5819k3721j7351k5795q522J5094J6320J0205N0878M9094j3021m3434q128
$$ 15819 -7902 -25253 -51048 -59570 -44476 -28156 -17951 32927 82021 69000 25566 17438
12428A7438L6335J9679m0188j5318o095K119J5848M4736J5343J6353k5732j7567
$$ 17438 53773 73452 33264 17946 11851 13970 29818 74554 89897 106250 80518 62951
12416F2951J128j621l0676k2963j3675R934m809q831K328o404j7662K7473k0726
$$ 62951 64079 62458 31782 8819 -4856 5078 269 -8562 -6234 -12638 -30300 -2827 -23553
12403b3553R310j5355j2252J4662L5035J4007j4831q293J8450R552J9434M0984
$$ -23553 -14243 -29598 -41850 -27188 7847 21854 7023 -1270 17180 26732 46166 87150
12391H7150K2507p346Jk587k8993J245J1900k4794R878k4519j4069p16j5136L2027
$$ 87150 109657 102311 102312 99725 70732 71977 83877 59083 68961 44442 30373 29657 14521 46548
12377D6548q880o799k9567k4928P101R282m651J6845L9724J2351n0266l2427j609
$$ 46548 37668 30869 1302 -23626 -16525 -7243 -11894 4951 44675 57026 6760 -25667 -27276
12364b7276J8893k419O057K6568k473K290L1259J9146N481l4800k3202m727K0455
$$ -27276 -8383 -10802 -4745 21823 19350 21640 52899 72045 77526 42726 19524 14797 35252
12351C5252k765j0194k0399k0833K286R201j0943j9805k185Q644N1475k904p441
$$ 35252 32487 22293 1894 -18939 -16653 -7452 -18395 -38200 -40385 -31741 19734 16830 9389
12338I389j7825j4162K200K1476K0861j9510k3552O232Q278M803K6956J6153L343
$$ 9389 -8436 -22598 -20398 1078 21939 2429 -21123 -14891 -6613 -1810 25146 41299 44642
12325D4642P108j320J3130j9367l816r897L433J0440k7565j9951J6187j057j443
$$ 44642 51750 50430 63560 44193 40377 30480 33913 44353 16788 -3163 13024 11967 10524
12312A0524J9983K6548J4064k6941k6218J1143l277j7049P640K139j6552o0167
$$ 10524 30507 57055 71119 44178 17960 29103 25826 8777 16417 18556 2004 -58163
12300e8163j2840M4180J8048j3764J9338K8800j8176m390j5775p551j3292j1079
$$ -58163 -71003 -26823 -8775 -22539 -3201 25599 7423 3033 -12742 -20293 -33585 -44664
12288d4664K9840M2791J8712j0398l6451j0705L2571J3734q236J6441p782l0878
$$ -44664 -14824 27967 46679 36281 -170 -10875 21696 35430 27194 43635 35853 4975
12276D975l702o129o043J0168j5899n07J0789J6163N360l8503l1631K2935K3796
$$ 4975 1273 -4856 -10899 -731 -16630 -17137 -6348 9815 15175 -23328 -54959 -32024 -8228
12263h228K0460j0090k3908Q490O129M827J9m206K8198l248j1599J4620K1702
$$ -8228 12232 2142 -21766 -13276 -7147 -2320 -2301 -6507 21691 18443 6844 21464 43166
12250D3166k5651l3842J2798k6003r326j3806J6390L9393k5167j3580J718k9186
$$ 43166 17515 -16327 -3529 -29532 -38858 -52664 -36274 3119 -22048 -35628 -33910 -63096
12238f3096O167M104J045K359K1059j065K3021M4909k690k1536r293j7138k4719
$$ -63096 -56929 -52825 -51780 -49421 -28362 -29427 -6406 38503 35813 14277 4984 -12154 -36873
12225c6873k0894M940o437l49K1801N202Q75K0704K0545p967k3086J935K1744
$$ -36873 -57767 -52827 -59264 -59613 -37812 -32610 -31735 -11031 9514 1547 -21539 -19604 2140
12212B140k823J2574o682J434o357q212L506K3888j4999j8548P044j868j5105
$$ 2140 -683 11891 5209 6643 286 -7926 -4420 19468 4469 -14079 -7035 -8903 -24008
12199b4008j5259j8493O092J9521J5561q856m575j7466m237K2471J5681j055l1995
$$ -24008 -39267 -57760 -51668 -32147 -16586 -25442 -30017 -47483 -51720 -29249 -13568 -14623 -46618
12186d6618O373J2551m292l1248K5369J0405K2112j289O653J1459n346r018k5001
$$ -46618 -40245 -27694 -31986 -63234 -37865 -27460 -5348 -6637 16 11475 6129 -2889 -27890
12173b7890j9082j4140j8958K2364M5856R287j3994j2735j0781J4498j7025J7478
$$ -27890 -46972 -61112 -80070 -57706 -11850 -2563 -16557 -29292 -40073 -25575 -42600 -25122
12161b5122j5574J4774O624l980r490j312J5923J2876o925P643J4577n986r238
$$ -25122 -40696 -25922 -19298 -23278 -32768 -34080 -18157 -5281 -12206 -4563 10014 4028 -5210
12148e210j2903R59K7468j1660K985j2656j147m233k1106j2221J1687M6207L1494
$$ -5210 -18113 -17154 10314 -1346 1639 -11017 -12164 -16397 -37503 -49724 -38037 8170 39664
12135C9664m2032o046J9288N116M167l7257m361J0271j6734N758m944J2592J097
$$ 39664 -2368 -8414 10874 15990 20157 -17100 -21461 -11190 -27924 -22166 -27110 -14518 -13421
12122a3421k2416J3828L3491L7230N406l6148l2111J4656N806k437J4286N988
$$ -13421 -35837 -22009 11482 48712 54118 17970 -14141 515 6321 3884 18170 24158
12110B4158j127j3768j1095j975j4676J2262j03r212j8012k0389k331K1886K320
$$ 24158 23031 9263 -1832 -3807 -18483 -6221 -6324 -15536 -33548 -53937 -56268 -34382 -32062
12097c2062J27K480j5015j0151M038K0278M3172k6714j8497j0950R567K5689K4736
$$ -32062 -31935 -29455 -44470 -54621 -50583 -30305 12867 -13847 -32344 -43294 -33727 -8038 16698
12084A6698Q149k19J5762P05k2445n433j5889l3488Q68O773K1186J5510J2579
$$ 16698 24847 24628 40390 41095 18650 13217 -2672 -36160 -35292 -28519 -7333 8177 20756
12071B0756O955O181L026m854j54j3052j2710m765j5686l2J2059J9792k0101k4844
$$ 20756 27711 33892 36918 32064 31910 18858 6148 1383 -14303 -14335 -2276 17516 -2585 -27429
12057b7429J8687j580K435l041l6671k2530J7759K2359J980P144M1348J4217J1389
$$ -27429 -8742 -10322 -7887 -10928 -47599 -70129 -52370 -30011 -28031 -20887 20461 34678 46067
12044D6067j636p49o11k8590K553j5867j0621L621J2269J7827l213m504K8492
$$ 46067 44431 43682 43071 14481 17034 1167 -9454 -5833 6436 24263 21050 16546 45038
12031D5038m18p111L18K5154k2162k0285n011o836j0059j268k750m6568K0182
$$ 45038 44620 37509 37827 62981 40819 20534 15523 8687 -1372 -2640 -5390 -51958 -31776
12018c1776M404q84L378l91M1688J1926N464r024j2699J2016K2701k4447k2656
$$ -31776 -27372 -28256 -24878 -25269 16419 28345 33809 24785 12086 24102 46803 22356 -300
12005c00R363k2426k6983L88K2760N2824J9018l8283l709J6072r664l3355n729
$$ -300 9063 -13363 -40346 -39958 -17198 35626 54644 16361 12652 28724 19060 -14295 -20024
11992b0024k1076L7876L8555j5749n632l300k5141L2490L908J1188J2819J4434
$$ -20024 -41100 -3224 35331 19582 13950 10650 -14491 17999 21907 33095 45914 60348
11980F0348J0401j2385k6472j3074m848K3456N636m1379k2644P940j557k1105
$$ 60348 70749 58364 31892 18818 13970 37426 43062 1683 -20961 -13021 -14578 -35683
11968c5683n398J5699J0090L1505M947n16q933J3542j121k3372r792K4977q065
$$ -35683 -41081 -25382 -15292 16213 21160 20644 11711 25253 24132 760 -9032 15945 7880
11955G880r112j3804m999J9556J5361L635j2837K0806m505n3358p587J0120k8067
$$ 7880 -1232 -15036 -20035 -479 14882 18517 5680 26486 21981 -31377 -38964 -28844 -56911
11942e6911K4560J0821r153j4091N043K8263K6797k0194j3089O951K2492J8896
$$ -56911 -32351 -21530 -30683 -44774 -39731 -11468 15329 -4865 -17954 -11003 11489 30385
11930C0385L7356m241J301l1597l7345r387J9375K7822K739j8365l759J3492K7695
$$ 30385 67741 63500 64801 33204 -4141 -13528 5847 33669 36408 18043 14284 27776 55471
11917E5471k4452J0800l8031m1114R754J6050J6991L0738J290k2328K6697j7716
$$ 55471 31019 41819 3788 -37326 -27572 -11522 5469 36207 37497 15169 41866 24150
11905B4150j9077P053m739J0385J6050O769Q410k7066m712K3632J4511K1830j0617
$$ 24150 5073 12126 7387 17772 33822 40591 49001 21935 17223 40855 55366 77196 66579
11892F6579n8145l2575J3617J8535m61K700j9063J6641K0339J2767P779j1712
$$ 66579 8434 -24141 -10524 8011 7550 10250 -8813 7828 28167 40934 48713 37001
11880C7001j6660p89m645O392l523L995L5991j4256k9925n259o711o70Q007J0305
$$ 37001 20341 19552 14907 21299 17776 21771 57762 43506 13581 8322 1611 941 8948 19253
11866A9253l149l1251o590j7933K3215K5694l684K041p108j95J0660q41J3956
$$ 19253 16104 -15147 -21737 -39670 -16455 9239 5555 7596 488 293 10953 10112 24068
11853B4068j4807l952k094l0312l768L6623K9821N0731M092j8858k7500q572k4171
$$ 24068 9261 5309 3215 -27097 -30865 5758 35579 86310 90402 71544 44044 35472 11301
11840A1301o77j063k356k9957k2373J334L5756R729K2720M326j542J7794l662
$$ 11301 10624 9561 7205 -22752 -45125 -43791 -8035 1694 24414 28740 27198 44992 41330
11827D1330j5161j2302n820m3166k1930J4721K2918n968R034J6791r188k9422
$$ 41330 26169 13867 8047 -35119 -57049 -42328 -19410 -25378 -16344 447 -8741 -38163
11815c8163l591n582j955K3345k713K9556n673J8594J2133j2822q293m965l1928
$$ -38163 -41754 -47336 -49291 -25946 -28659 897 -4776 13818 25951 13129 4836 -129 -32057
11802c2057p587J4646K8455P843j862J3896J1488k511O067j0038M376j0421K510
$$ -32057 -39644 -24998 3457 11300 9438 23334 34822 32311 38378 28340 32716 22295 24805
11789B4805J6207M2608M027j0510M938j1753L135j0595j8506J6428J2706j050
$$ 24805 41012 83620 87647 77137 82075 70322 73457 62862 44356 60784 73490 72440
11777G2440m4956l4208K2854J0961l5556k813R92p259N222M370J231l913J8739
$$ 72440 27484 -6724 16130 27091 -8465 -11278 -10286 -17545 -12323 -7953 -6722 -10635 8104
11764H104N143k2234J1972j792K3681r20k7114J6922J8060k1483k2828J1710J8895
$$ 8104 13247 -8987 2985 1193 24874 23954 -3160 13762 31822 10339 -12489 -779 18116
11751A8116N810l59j9190l6143k2163L8773J9441k7029k9982J7296J9142L6066
$$ 18116 23926 23567 4377 -31766 -53929 -15156 4285 -22744 -52726 -35430 -16288 19778
11739A9778j0385J9208M2892J1939j5471j0160l6112k6287k0685j3295k4862J6124
$$ 19778 9393 28601 71493 83432 67961 57801 21689 -4598 -25283 -38578 -63440 -47316
11727d7316K5096j988M425M403M009J2946J7014J304m490J3955j9760K967M494
$$ -47316 -22220 -24208 -19783 -15380 -11371 1575 18589 19893 15403 29358 9598 12565 17059
11714A7059j504m343j416k6755n186J4742j1441j1777J4491K7598K0095k881K4804
$$ 17059 15555 11212 9796 -16959 -22145 -7403 -18844 -30621 -16130 11468 31563 28682 53486
11701E3486K6622j4033o689K6304m4161m2742r712J6804J4292m761r455k5095
$$ 53486 80108 66075 59386 85690 41529 -1213 -10925 5879 20171 15410 5955 -19140
11689a9140k3193J3929K5604q504o305J7168J1949J5763L008n966k0827p617R418
$$ -19140 -42333 -28404 -2800 -11304 -17609 -441 11508 27271 30279 24313 3486 -4131 5287
11676E287J7303j8688j5255P752J8983j0302L414k512k0288N184J9618K2057K6570
$$ 5287 22590 3902 -11353 -3601 15382 5080 8494 5982 -14306 -9122 10496 32553 59123
11663E9123J5457k3700k4000l9849O726J0096J4260j9862J0389J2148p397n539
$$ 59123 74580 50880 26880 -12969 -6243 3853 18113 -1749 8640 20788 13391 7852
11651G852R73K137K1593L1561j5636k1908R2o96j9501k5050J9138k503O472K9102
$$ 7852 8825 10962 32555 64116 48480 26572 26664 25968 6467 -18583 555 -1948 4524 33626
11637C3626j4058o870q262j4502K3946K7196j9387L2396J1060m6824m9930r036
$$ 33626 19568 12698 4436 -10066 13880 41076 21689 54085 65145 18321 -31609 -40645
11625d0645j3669N620K1343M1815p609j1986j5528j1868o22L3312M1338k9718
$$ -40645 -54314 -48694 -27351 14464 6855 -5131 -20659 -32527 -33149 163 41501 11783
11613A1783l8558l759J4773J4267N656j0116J615R060n856r507J4448J3068m186
$$ 11783 -26775 -30534 -15761 -1494 4162 -5954 -4339 4721 -1135 -10642 3806 16874 12688
11600A2688N640J3410k9769K786L6196j7143r500K7589j7615k7924j196j8198
$$ 12688 18328 31738 1969 4755 40951 23808 14308 41897 24282 -3642 -4838 -23036
11588b3036P05l068J1266K454k437p963j3266m636K7137J0835R166K108N162p143
$$ -23036 -22331 -25399 -14133 -11679 -14116 -22079 -35345 -39981 -12844 -2009 7157 9265 14427 7284
11574G284K0348K8717k1710m4933k6322M603J2505O51j5284m841J9867R998r758
$$ 7284 27632 56349 34639 -10294 -36616 -32013 -19508 -18857 -34141 -38982 -19115 -9117 -18875
11561a8875M255L963j0201j0631J2793J2232K5635R475J2603L2274K592K290m438
$$ -18875 -14620 -10657 -20858 -31489 -18696 -6464 19171 28646 41249 73523 76115 78405 73967
11548G3967k4293k7702j7994j2348J1845o365k5133K689j9594Q303O132J4242
$$ 73967 49674 21972 3978 -8370 3475 -2890 -28023 -25334 -44928 -36625 -30493 -16251
11536a6251j0507l5171J7102J8913L8036J8733J9490l5180k2895J4703L7129p222
$$ -16251 -26758 -61929 -44827 -25914 12122 30855 50345 15165 -7730 6973 44102 36880
11524C6880l7797j3463L4872K4680L87J2181J2159j0969j5221k3253l2386J406
$$ 36880 -917 -14380 20492 45172 45559 57740 69899 58930 43709 20456 -11930 -10524
11512a0524K7752J3930P626l4070K2317n093k722J1220J4930p735m350l330k6073
$$ -10524 17228 31158 38784 4714 27031 21938 19216 30436 45366 37631 33281 29951 3878
11499C878J5201j0759q005l212R65q087q322k762K479M594j7229K1235L5703P742
$$ 3878 19079 8320 315 -2897 -1932 -10019 -18341 -21103 -18624 -14030 -31259 -10024 25679 33421
11485C3421o200k3682m8066J1029K5993k657J0636K9359P623M13j6167l6224r384
$$ 33421 27221 3539 -44527 -33498 -7505 -10162 474 29833 37456 37869 21702 -14522 -23906
11472b3906L4437K4291j481l0028j2631k3719j7619j3994j1510L2402L9880j664
$$ -23906 10531 34822 33341 3313 -9318 -33037 -50656 -64650 -76160 -43758 -3878 -5542
11460e542k0976o96m32m399N417K2409M161j088K4905J5104J3694k728k1222q298
$$ -5542 -26518 -27214 -27646 -32045 -26628 -4219 -58 -1146 23759 38863 52557 49829 28607 20309
11446B0309R899j1547m022o012K3896L59k719K0714j2799k2000O466K0852j9656
$$ 20309 30208 18661 14639 8627 32523 32882 30163 50877 38078 16078 22544 43396 23740
11433B3740r318J7623j0570J6563J3127J4880r189n5679m8317J0350J9997j3547
$$ 23740 14422 32045 21475 38038 51165 66045 56856 1177 -47140 -36790 -16793 -30340
11421c0340m907J6559J4930N627J435J4346L0131J6909k652N719j2905l6063k5100
$$ -30340 -35247 -18688 -3758 1869 3304 17650 47781 64690 62038 67757 54852 18789 -6311
11408f311k3844J0297k059N858J1410J2800j4902p710j697j6987j4216P760P169
$$ -6311 -30155 -19858 -21917 -16059 -4649 8151 -6751 -14461 -16158 -33145 -47361 -39601 -32432
11395c2432q378K1378J3709K6203n091j8268K7237J3434o863P75m457J4703p351
$$ -32432 -40810 -19432 -5723 20480 15389 -2879 24358 37792 30929 31704 27247 41950 34599
11382C4599n211J3442j3090j8889M4044j1880k3010j5625K0378m983K2733k6238
$$ 34599 29388 42830 29740 10851 54895 43015 20005 4380 24758 19775 42508 16270
11370A6270k7522j4884J2419J1073J4057j6553N252J8921J5448j7144k7998K1332
$$ 16270 -11252 -26136 -13717 -2644 11413 -5140 112 19033 34481 17337 -10661 10671
11358A0671J5444j034K0273J6000K50J2932j1656l5703l4929j3673L2571O567
$$ 10671 26115 25081 45354 61354 61604 74536 62880 27177 -7752 -21425 11146 17713
11346A7713J9451J8992j6880K9164O937j1060k8672P727K9422j1273l4555j5724
$$ 17713 37164 56156 39276 68440 75377 64317 35645 43372 72794 61521 26966 11242
11334A1242r520J1446k6682r818N0732L1212j1911l1772j6611j3339n966Q470
$$ 11242 1722 13168 -13514 -23332 27400 58612 46701 14929 -1682 -15021 -20987 -12517
11322a2517J3905K3606l763l142p55q89j8984j7589Q899l252J6279J4291j4213
$$ -12517 1388 24994 21231 18089 17334 16445 -2539 -20128 -11229 -14481 1798 16089 1876
11309A876j6516J3969L0227K3536R612o79k0491J0948J9258j5686M794m7464k984
$$ 1876 -14640 -671 29556 53092 62704 62025 41534 52482 71740 56054 60848 13384 10400
11296A0400J6049j0312q214J0630k149Q23l0970j195L4589L1509j016K716m899
$$ 10400 26449 16137 7923 18553 16404 17227 -13743 -14938 19651 51160 50144 52860 47961
11283D7961N613q801j1083M783K5361j086j911j103l9979L204o519O061K2957
$$ 47961 53574 44773 33690 38473 63834 62748 60837 59734 19755 22959 16440 22501 45458
11270D5458j1386l7149j4617J6900K3844l758O045J7405L1515J8061j5460N354
$$ 45458 34072 -3077 -17694 -794 23050 19292 25337 42742 74257 92318 76858 82212
11258H2212L314j7854j0467n789J2907K435l0603k1020J2488l1686K409O175J0802
$$ 82212 85526 67672 57205 51416 64323 66758 36155 15135 27623 -4063 -1654 4521 15323
11245A5323j3650J1445m804M814p21K1734J8824k3310j8818m0877l992K2899J607
$$ 15323 1673 13118 8314 13128 12407 34141 52965 29655 10837 -30040 -34032 -11133 -9526
11232i526j2604L871J3063r51q020j6569J6848J8589M089K2931K2982j3846j2489
$$ -9526 -22130 -18259 -5196 -6147 -14167 -30736 -13888 4701 8790 31721 54703 40857 28368
11219B8368o502K352L305J0863P420K7801R591l9906o731M014n179j585K2851
$$ 28368 21866 24218 27523 38386 45806 73607 83198 43292 36561 40575 35396 33811 56662
11206E6662N792P672l0088j8532j262k0105Q126N8125J7343j4596k3513M347k3356
$$ 56662 62454 70126 40038 21506 20244 139 8265 66390 83733 69137 45624 49971 26615
11193B6615K4875l1168p120M3903j3222K735M210l3782L261K9964J2016J284j016
$$ 26615 51490 20322 13202 57105 43883 46618 50828 17046 20307 50271 62287 63571 62555
11180F2555n8P661j2301m5509q459K881m918l540P419K8045K9556K3764j3659
$$ 62555 62497 70158 57857 12348 3889 6770 1852 -1688 5731 33776 63332 87096 73437
11167G3437N385K1062m015Q478m0863m9777M619L1119j9103j634L5519K054j0718
$$ 73437 78822 99884 95869 104347 63484 13707 18326 49445 30342 28708 64227 66281 55563
11154E5563L5453K3226k7553l2721k6839R8q544J4126J1126k968q450K5519K0807
$$ 55563 91016 114242 86689 53968 27129 27227 18683 32809 43935 40967 32517 58036 78843
11141G8843J0786K4563j0952k2786k1757k2589j7623l902J7357L1138J583k0574
$$ 78843 89629 114192 103240 80454 58697 36108 18485 14583 31940 63078 64661 44087
11129D4087r930j4142J2889j3455q766R39J7196m281l3417R445k1322K3676K3579
$$ 44087 34157 20015 32904 19449 10683 11622 28818 24537 -8880 565 -20757 2919 26498
11116B6498K9697K9079l2118j4921L3988K2115l121r264k4065q580L6116L4698
$$ 26498 56195 85274 53156 38235 72223 94338 91217 81953 57888 49308 85424 120122
11104A20122l1372r516K9558J5655L3552L5653M1522M7182P0156Q0333J13616
$$ 120122 88750 79234 108792 124447 157999 193652 235174 282356 352512 432845 546461
11093E46461J98153L87919N85611N87002J96964j76397l02185l52813l61730l54605
$$ 546461 744614 1132533 1718144 2305146 2502110 2325713 2023528 1670715 1308985 954380
11083I54380k06257j26937j07729j8946J1210J4190L6653Q9362J02178K46191
$$ 954380 748123 621186 513457 494511 505721 519911 556564 645926 748104 994295
11073I94295M34943N75549M70299J1991k98154l30926l24251l68243l12091k28928
$$ 994295 1429238 2004787 2475086 2487077 2188923 1857997 1533746 1165503 853412 624484
11063F24484j32611j01582m7659n3374o6240k4690J1704k1758l856q765j0014
$$ 624484 491873 390291 342632 289258 223018 198328 210032 188274 184418 175653 165639
11052A65639j1581j7328j8429j2679k8042p381R613q704K1405r506j0607k643
$$ 165639 154058 136730 118301 105622 77580 70199 79812 71108 92513 83007 72400 69757
11040F9757R350J6241K372J8025O383j8110j5091J4757l6878m5332j1747L1170
$$ 69757 79107 95348 97720 115745 122128 104018 88927 103684 66806 21474 9727 40897
11028D0897N3881L4508j7488K119K0653J5700J0538l1209j4957o581j8183k1185
$$ 40897 94778 129286 111798 113917 134570 150270 160808 129599 114642 108061 89878 68693
11016F8693K9874J9569p285k0385J8850l3102l5824k377J9454K5672J7751J796
$$ 68693 98567 118136 110851 90466 109316 76214 40390 38013 57467 83139 100890 102686
11004A02686l240J599K569j1128k0612j108j8722j7133L2719J0185J0254J5004
$$ 102686 99446 101045 103614 92486 71874 70766 52044 34911 67630 77815 88069 103073
10992A03073k3522q949j9097M1899j7485q534J6121L1972O4137j0809m9204Q001
$$ 103073 79551 70602 51505 93404 75919 67385 83506 115478 179615 168806 119602 127603
10980A27603J9835L422k270n4569j5557K3876O24j8498O225K3053J0697r611j6554
$$ 127603 147438 150860 148590 94021 78464 102340 102964 84466 90691 113744 124441 114830 98276
10967I8276j3544j4647K7180p184l3482K4661K259N616l5739l1584L414L9481
$$ 98276 84732 70085 97265 90081 56599 81260 83519 89135 53396 21812 25226 64707
10955F4707K9162l1453J156k087r144L142K7969M589k0142l5201Q892l61J3999
$$ 64707 93869 62416 63572 61485 52341 55483 83452 88041 67899 32698 41590 41229 55228
10942E5228L5819k1120L737Q164J7207L4591K9627J0707L2410J6377n662J8644
$$ 55228 91047 69927 73664 81828 99035 133626 163253 173960 206370 222747 217085 235729
10930B35729J2975k0638O2357N6221k3028m5239k4278k3778j7837j6683l990k707
$$ 235729 248704 228066 290423 346644 323616 278377 254099 230321 212484 195801 191811 189104
10918A89104j4478N615K9381M6750K5701K8193q034l1517j9765k8473n0223k1750
$$ 189104 174626 180241 209622 256372 282073 310266 302232 270715 250950 222477 172254 150504
10906A50504k4647L852K3396j3448n429J7907J1715J9510R469j5062k025j8N488
$$ 150504 125857 129709 153105 139657 134228 152135 163850 183360 192829 177767 175742 175724 181212
10893A81212k3914q176Q636J0165k5386j4436O963l694K547k3431O928J7854j9968
$$ 181212 157298 149122 157758 167923 142537 128101 135064 131370 133917 110486 117414 135268 115300
10880A15300J3247M7964P8070J11391P6406o421l2865m7367n3281n2581l8767
$$ 115300 128547 176511 254581 365972 442378 435957 403092 355725 302444 249863 211096
10869B11096m9322j9244L7710K0257K6698L5218O306J2835P758N367n3140l3808
$$ 211096 161774 142530 180240 200497 227195 262413 268719 281554 289312 294679 241539 207731
10857B07731l9925m4849J8269K0356L6839J5822K0019K8643N6634M2497p777m0352
$$ 207731 167806 122957 141226 161582 198421 214243 234262 262905 319539 362036 354259 313907
10845C13907k738m9120m0405n61J2035l8388l2789j5755q524k8243k1482n0268
$$ 313907 311169 262049 221644 221083 233118 194730 161941 146186 137662 109419 87937 37669
10833C7669m4401M9753P6363P9785P1274O9465M9710P880p320n17K0428m2905
$$ 37669 -6732 43021 119384 199169 270443 339908 389618 397498 390178 389661 410089 367184
10821C67184p0476n3509k8245j489N1532R2332R8018R5236N0192L5003K6334M3528
$$ 367184 296708 243199 214954 213465 264997 357329 455347 550583 600775 635778 662112 705640
10809G05640M5103K6724K9991l2191k6507J11129J43132O5955m3866j00495k7160
$$ 705640 750743 777467 807458 775267 748760 859889 1003021 1068976 1025110 924615 897455
10798H97455P144l3080j05388r9482k1143k6281l3897K6436J25341J38007N3875
$$ 897455 904599 871519 766131 666649 645506 619225 585328 611764 737105 875112 928987
10787I28987m8998n2356l6476l7513r2223j46493o8214n560K5934J8338j9325
$$ 928987 879989 827633 791157 753644 661421 514928 446714 441154 467088 485426 466101
10776D66101k3967n874l412J814J7290K2637L982L9834R2232M7378J3097J6121
$$ 466101 442134 436260 432848 434662 451952 474589 478571 518405 610637 658015 671112 687233
10764F87233K6354K5971k926L058K5267K7772K3294L9403J7946K3945K0606J654
$$ 687233 713587 739558 736632 739690 764957 792729 816023 855426 873372 897317 917923 919577
10752I19577K5197M3942m746M166J1616j2681O1713M9303M7073K9694K4799M7626
$$ 919577 944774 988716 983970 988136 999752 987071 1048784 1098087 1145160 1174854 1199653 1247279
10740A247279O6212N0900K4533j6239O035K6538M7559M1669K9753K2052N0250
$$ 1247279 1313491 1364391 1388924 1372685 1378720 1405258 1452817 1494486 1524239 1546291 1596541
10729A596541J5334p598K2218P6650J36691J58578J29661Q1021R8735J48134J19042
$$ 1596541 1611875 1604277 1626495 1703145 1839836 1998414 2128075 2209096 2307831 2455965 2575007
10718B575007P6155Q0029Q4702J3731Q855Q0434J76863K51220K69921K22864K18319
$$ 2575007 2651162 2731191 2815893 2829624 2838479 2918913 3095776 3346996 3616917 3839781 4058100
10707D058100K52453K98345K94142L17878L65485M14905M50715N81056Q21777
$$ 4058100 4310553 4608898 4903040 5220918 5586403 6001308 6452023 7033079 7854856
10698G854856J172791J310678R37714N61406O29066Q64114J061540J349237J778032
$$ 7854856 9027647 10338325 11276039 11837445 12466511 13330625 14392165 15741402 17519434
10689A7519434K316346L055501M128945N281446O208153P229561Q947179J2295523
$$ 17519434 19835780 22891281 27020226 32301672 38509825 45739386 54686565 66982088
10681F6982088J8715573L0095718N1130108Q6672952J21223323R0016843o496948
$$ 66982088 85697661 115793379 166923487 253596439 374819762 464836605 458339657
10674D58339657n3217564n4089194n9724033o4795860n2110021k9733686r964628
$$ 458339657 405122093 351032899 291308866 226513006 174402985 144669299 134704671
10667A34704671O763803K5468969N4097828R5750321J16666924N0579527l8878701
$$ 134704671 141468474 166937443 221035271 316785592 433452516 484032043 445153342
10660D45153342o0931296o0591825o9450723o9196696n2176043l2878154k0068361
$$ 445153342 384222046 323630221 254179498 184982802 132806759 99928605 79860244
10653G9860244j3422129j0239692q104400o456464n245221m369196l716818l097583
$$ 79860244 66438115 56198423 48094023 41637559 36392338 32023142 28306324 25208741
10645B5208741k541382k042189j584237j121693p18597n17871p56034j188208
$$ 25208741 22667359 20625170 19040933 17919240 17200643 16682772 15926738 14738530
10637A4738530j274362j222483j191130j108168r03562p14504o67185o21842n15396
$$ 14738530 13464168 12241685 11050555 9942387 9038825 8324321 7657136 7035294 6519898
10628F519898l67097k88896k70328k97147k86318k91547k93493k69871k74411
$$ 6519898 6152801 5863905 5593577 5296430 5010112 4718565 4425072 4155201 3880790
10619C880790k51143k45837k06074j86083j43792j07063n0436j01455q0825o9926
$$ 3880790 3629647 3383810 3177736 2991653 2847861 2740798 2690362 2588907 2508082 2438156
10609B438156j16781j23662j06025j13697j02363p4101r6723q5003q8591r7414
$$ 2438156 2321375 2197713 2091688 1977991 1875628 1801527 1704804 1619801 1531210 1433796
10599A433796o2701p1827n9758m3610k0854M454j6602n2196l582P079k6879l3832
$$ 1433796 1371095 1299268 1239510 1195900 1175046 1179500 1162898 1110702 1107120 1114199 1087320 1053488
10587A053488n7069l8224k8833k2992J0458k9938j8806k589r590l5226m1582k2232
$$ 1053488 996419 958195 929362 906370 916828 886890 868084 865495 855905 820679 779097 756865
10575G56865J5140l166J7481K6843j1659m481L9019K7283j3874L7742N1469L0602
$$ 756865 772005 768839 786320 813163 801504 797023 836042 863325 849451 887193 938662 969264
10563I69264P1256M5360k5773j6993K3492l3891o3238m6545l6640j7853k6127
$$ 969264 1040520 1085880 1060107 1043114 1066606 1032715 969477 922932 886292 868439 842312
10552H42312n2900r5550n0644j0867L3075J5865p886l4098l2273j195k5676M678
$$ 842312 789412 693862 643218 632351 665426 681291 673405 639307 607034 605839 580163 584841
10540E84841J9103o3980j08747q9281O995N2128M6744j2302n5328m4141l8217
$$ 584841 603944 539964 431217 341936 348931 401059 447803 435501 380173 336032 297815
10529B97815j4419k1401m1669j9533J1001j1419J2755N5052J31643J60909J02184
$$ 297815 283396 261995 220326 200793 211794 200375 213130 268182 399825 560734 662918
10518F62918Q850m6152p6664n1097j2841j0218k2381r819l5675j3505P7295J27231
$$ 662918 671768 625616 548952 497855 485014 474796 452415 442596 406921 393416 470711 597942
10506E97942J11867J9861o1053l4513m2827m2399j4377L214k9626l7542j3820
$$ 597942 709809 729670 668617 634104 591277 548878 534501 537715 508089 470547 456727
10495D56727j7085l6831n4311j912k2342n155K0207j6039L7275N8963P4378K9259
$$ 456727 439642 402811 348500 346588 324246 319091 339298 323259 360534 419497 493875 523134
10483E23134l826q364r578M362J6693j2226j4297k1122q564m176M0967Q0035M8394
$$ 523134 519308 510944 501366 505728 522421 510195 495898 474776 466212 462036 503003 583038 631432
10470F31432K3768k3679m0416n005J4348J7671J2851o269k4618J2467K2747K6281
$$ 631432 655200 631521 591105 586100 600448 618119 630970 624701 600083 612550 635297 661578
10458F61578j9603m7145l2184O993p703M172K473J083K7003R863j3535R160K0657
$$ 661578 641975 594830 562646 569639 561936 566108 568581 569664 596667 606530 592995 602155 622812
10445F22812N3Q686K935J3891j3680k3484l355J9896L2403K5043l0280o272L016
$$ 622812 622865 631551 634486 648377 634697 611213 607858 627754 660157 685200 654920 648648 651664
10432F51664K4224o423o98l159J5887k6769k3773N1798J4145J3960K8230n011
$$ 651664 675888 669465 668767 665608 681495 654726 630953 682751 696896 710856 739086 734075
10420G34075J696j070j226K0917J1524q306q507J5574M1974K9701J6950k0157
$$ 734075 735771 734701 733475 754392 765916 757610 749103 764677 806651 836352 853302 833145
10408H33145k3501l425K0326j9245j2721p947m082L083J1807Q431J3027J1916
$$ 833145 809644 806219 826545 807300 794579 786632 782550 785633 797440 805871 818898 830814
10396H30814o703j8685k205M9572m51j4442R13k472j4722j9745l8620l9586K5231
$$ 830814 824111 805426 803221 852793 852342 837900 838813 836341 821619 801874 763254 723668 748899
10383G48899K2070n979Q091J6824n647l2975K5673K5860k4312p786K016j1029
$$ 748899 770969 764990 773081 789905 784258 751283 776956 802816 778504 770718 772734 761705
10371G61705j5381j8046o938k480j400l7016K6301L8301j4476k7688l9031r385
$$ 761705 746324 728278 721340 718860 717460 680444 706745 745046 730570 702882 663851 654466
10359F54466j2688l7856m408K2040j5119m56K8682K0557J1633j5642l134o929
$$ 654466 641778 603922 599514 621554 606435 605979 634661 655218 666851 651209 648075 641146
10347F41146l5703j1501q725j9915k42J0886k3484L834j0877k9497Q027O536p930
$$ 641146 605443 593942 585217 565302 565060 575946 552462 556296 545419 515922 523949 530485 522555
10334E22555J0523J8678Q993K947l7355k4870N752k810j7273K5319J6338j3390
$$ 522555 533078 551756 560749 563696 526341 501471 507223 504413 487140 512459 528797 515407
10322E15407q992l0592k4057K9305r422j2767j0234m739n193j4282k7904l90j893
$$ 515407 506415 475823 451766 481071 471649 458882 448648 443909 438716 424434 396530 396140 394247
10309C94247j8768M8821R64k5237j0636P091k0541M451r138r576j9258k3649R408
$$ 394247 375479 424300 425264 400027 389391 396482 375941 380392 371254 361678 342420 318771 328179
10296C28179r763K3708L7463R099j2567k6884L4467m952p600j7692R865n127J5180
$$ 328179 318416 342124 379587 388686 376119 349235 383702 378750 371150 353458 363323 358196 373376
10283C73376j3084l0610L9797J3025m0082K279j4446J8325L61J3507j1400j3124
$$ 373376 360292 329682 369479 382504 342422 344701 330255 348580 348941 362448 351048 337924
10271C37924J005k237J5501N8540K3082L8457M1395L2609M3022Q8691J52737K78680
$$ 337924 338929 336692 352193 410733 433815 472272 513667 546276 589298 677989 830726 1109406
10259A109406M41931O40059N79781J11780k05268k58834k33548j75506n4058K11412
$$ 1109406 1551337 2191396 2771177 2882957 2677689 2418855 2185307 2009801 1955743 2167155
10249B167155N05953L19557j60364l13939l49124l88076m09258l28186k09856
$$ 2167155 2673108 2992665 2832301 2518362 2169238 1781162 1371904 1043718 833862
10240H33862j50795q5084o1768o3321l2275l0248k2065l6410l7283k4057l3009
$$ 833862 683067 597983 536215 472894 440619 410371 388306 351896 314613 290556 257547
10229B57547k8140j2260R286J8715J1884N181j8365j4541M485r922m222k425m0043
$$ 257547 229407 217147 226433 245148 257032 262213 243848 229307 233792 223870 219648 217223 177180
10216A77180j6799J5553K3585K9386j4248j4678m4518l2208Q895J0895M45j0884
$$ 177180 160381 175934 199519 228905 214657 199979 155461 123253 132148 143043 143488 132604
10204A32604q553j0126l235J0265J9190J6828J6082m444k4967k442j0763j5799
$$ 132604 124051 113925 110690 120955 140145 156973 173055 168611 143644 141202 130439 114640
10192A14640r138J8103K2529P855J3134j1682m0128k8263L240K6662J0097j7113
$$ 114640 105502 123605 146134 153989 167123 155441 115313 87050 90290 116952 127049 109936
10180A09936p830k9892j997L6266J7271J4803J1319k926l7392m950j4461J1404
$$ 109936 102106 72214 70217 106483 123754 138557 149876 146950 109558 104608 90147 101551
10168A01551L8230K5771k6233j1410p924j5436j1027j0305O292n598j9295L675
$$ 101551 139781 165552 139319 127909 119985 104549 93522 83217 89509 83911 64616 68291
10156F8291K4210K0889k321K813N307p647r460J3426N072r420p867K7117J0168
$$ 68291 92501 113390 111069 113882 119189 111542 102082 115508 120580 111160 103293 130410 140578
10143A40578k0769k3513k4798J4658J5703j2835l860j0524n150R135K703J1814
$$ 140578 119809 96296 71498 86156 101859 89024 85164 74640 69490 78625 81328 93142
10131I3142k4409J8771J5920K5875J4713J0501l3860j9200j1483p378l1303k603
$$ 93142 68733 87504 103424 129299 144012 154513 120653 101453 89970 82592 51289 48686
10119D8686r608k513j2182P593M3458M220k015K2558J8512n216l0738p634J4777
$$ 48686 39078 36565 24383 31976 75434 79654 77639 100197 118709 113493 82755 75121 89898
10106H9898p011j1945J5731j6357k181j8014m8440O09M6958L8371j951p093J7674
$$ 89898 82887 70942 86673 70316 68135 50121 1681 2290 49248 87619 85668 78575 96249
10093I6249P634M557R127j984k9149k1750j5175l3518K6445L2075j1738k6133
$$ 96249 103883 108440 117567 115583 86434 64684 49509 15991 42436 74511 62773 36640
10081C6640j4593j2667q815m895K7776l712k861N854p355n566O688q159K4016
$$ 36640 22047 9380 565 -4330 23446 19734 16873 22727 15372 9806 16494 8335 32351
10068C2351K1256p977k0396j540n982J3927K9403j7818l893J1245K7765J3651
$$ 32351 53607 45630 25234 23694 17712 31639 61042 43224 39331 50576 78341 91992
10056I1992Q156L733P525j3498R19l1591l0679J9997J1461l044l1006k2248K9347
$$ 91992 100148 103881 111406 97908 98827 67236 36557 56554 68015 64971 33965 11717 41064
10043D1064M2056k7901m0237j5129J4758L4037J4323J1440N768j0212j2373J938
$$ 41064 83120 55219 14982 -147 14611 48648 62971 74411 80179 69967 57594 59532
10031E9532k804q838j671J9659M976j189r404O014p419J4057j6394n959J7964
$$ 59532 56728 47890 46219 65878 70854 69665 60261 66275 58856 72913 56519 50560 68524
10018F8524m648J658J3076J6164J194k4706o9040l8776K0236J1168j2832N383
$$ 68524 63876 65534 78610 94774 95968 71262 2222 -36554 -16318 -5150 -17982 -12599
10006a2599P322J2423J5558J1607j7939K510J1812N68k73J4899k5423L952p37
$$ -12599 -5277 7146 22704 34311 16372 18882 30694 31262 30989 45888 20465 24417 23680
9993B3680L0271O008k3567j6736J7842L524K7455P207j3086j7472J770P378k9011
$$ 23680 53951 59959 36392 19656 37498 41022 68477 75684 62598 45126 46896 54274 25263
9980B5263j8261K8424O799m063M477j8531r423P051J9007N635k1638j4349k192
$$ 25263 7002 35426 42225 38162 42639 24108 14685 21736 40743 46378 24740 10391 8199
9967H199L3832k5935l872J2359J6656J1889j5528l592n082m4436m9275J1029N1282
$$ 8199 42031 16096 12224 24583 41239 53128 37600 34008 28926 -15510 -64785 -53756 -2474
9954b474K6091k7100m3908n170K8740L2819N0970K0378l4591k0419j08J880q432
$$ -2474 23617 -3483 -47391 -52561 -23821 8998 59968 80346 45755 25336 25228 27108 18676
9941A8676K0212Q786J6559q938j4148k4033k5308o969M0870p047o489r637k0389
$$ 18676 38888 47674 64233 55295 41147 17114 -8194 -15163 25707 18660 12171 2534 -17855
9928a7855p769J7663J3611j2465k8596l051O264J0883K9966N651Q557L3617Q891
$$ -17855 -25624 -7961 5650 -6815 -35411 -38462 -32198 -21315 8651 14302 22859 56476 65367
9915F5367k0897k660m666J6259q756k6379l0736l3109M4603K8331l724j4513K6901
$$ 65367 44470 41810 37144 53403 44647 18268 -12468 -45577 -974 27357 23633 9120 36021
9902C6021K1729J3107J2206J1453M919l4l3822l7259k6010J6938J8133l524P739
$$ 36021 57750 70857 83063 94516 99435 99401 65579 28320 2310 19248 37381 33857 41596
9889D1596l0989k4033L009L5951K1047r950P854k2549j9212K712J7886p67K6505
$$ 41596 10607 -13426 -10417 25534 46581 36631 44485 21936 2724 5436 23322 22555 49060
9876D9060J4262j1045J3770J4688l62k8903P641K086k8679k0502P054K2775J1026
$$ 49060 63322 52277 66047 80735 80373 51470 59111 61197 32518 12016 19070 41845 52871
9863E2871O671m082j2856j6815j450N90M688r306r728n286K7078L0858J506k8916
$$ 52871 59542 55460 42604 25789 24339 24929 29617 20311 10583 5297 32375 63233 64739 35823
9849C5823j4680L6279M509l155Q339j8609j2548K8177k572j5875O709n991j3673
$$ 35823 21143 57422 61931 58776 67115 48506 35958 64135 61563 45688 52397 46406 32733
9836C2733J3618l2761P466L0524J7755m389l2861m200J3476M271l3482J040n878
$$ 32733 46351 13590 21056 51580 69335 64946 32085 27885 41361 45632 12150 13190 7312
9823G312M410K7018K664j655j4151O686j280q087k1941j1125J2387L4279J3862
$$ 7312 11722 38740 41404 39749 25598 32284 31004 22917 976 -10149 2238 36517 50379
9810E0379m071J6729j8769Q044N1797L9572L906M372k5359j1201l255k7351l3943
$$ 50379 46308 63037 44268 52312 104109 143681 147587 151959 126600 115399 112144 84793 50850
9797E0850j7419O921j7815r209L3423N834J6919j3409k3484j0730O764p048o371
$$ 50850 33431 40352 22537 13328 46751 52585 69504 56095 32611 21881 28645 21597 15226
9784A5226Q163o929j8577K3842J7635P772l5677m3466J1008K9591K2463m0043
$$ 15226 23389 16460 -2117 21725 39360 47132 11455 -32011 -21003 8588 31051 -8992
9772h992M542K1612J6233P49j680m3988r049J6734J2623k175k8025l075L195J8453
$$ -8992 -4450 17162 33395 34144 32464 -11524 -20573 -3839 8784 6609 -21416 -24491 -21296 -2843
9758b843L3214l9522k3537J6036L710K547K2638j949j1656P14O174n150K0748
$$ -2843 30371 -9151 -32688 -16652 -12942 -10395 12243 10294 -1362 -648 5526 376 21124
9745B1124R40p631l746J2617l861M050j9640j1293J681J8247J456n817M924k8188
$$ 21124 22064 14433 10687 23304 19443 23493 3853 -7440 -5759 12488 13944 8127 13051 -15137
9731a5137j6517j1526N5480L6759j1228k9785r614l232K767L1061j200k6837j7470
$$ -15137 -31654 -43180 12300 49059 37831 8046 -1568 -4800 -2033 29028 27828 991 -16479
9718a6479J9894K870o071p615J8878Q884K1003k7904j6929J974J7844K8868J0094
$$ -16479 3415 6285 214 -7401 11477 20361 41364 13460 -3469 -1495 16349 45217 55311
9705E5311j7679j3187j945M343K1326j5316j4441K9724j6079l1051m5907p799
$$ 55311 37632 24445 22500 26843 48169 32853 18412 48136 32057 1006 -44901 -52700
9693e2700k0467j874l487J931O061N3919K9760j6862m814K7829r854k2478l2864
$$ -52700 -73167 -75041 -78528 -76597 -70536 -16617 13143 -3719 -8533 19296 9442 -13036 -45900
9680d5900Q595J8864k454k0853j3790L1770K2097J302j0639j3113j7688P501N7782
$$ -45900 -37305 -18441 -20895 -41748 -55538 -23768 -1671 -369 -11008 -24121 -41809 -34308 23474
9667B3474J5417q850N62J037k7589k1125j3786j0703M4273K8479J4201M373N52
$$ 23474 38891 30041 30603 31640 4051 -17074 -30860 -41563 2710 31189 45390 49763 50315
9654E0315O544M822k594q147J9294n6070m2491K0327l2304L289J1567R749o368
$$ 50315 56859 61681 59087 50940 70234 14164 -28327 -8000 -40304 -37015 -25448 -15699 -22067
9641b2067r571O0120N0263j6428l8971k1054k2787l099L3367K4729O360o680Q774
$$ -22067 -31638 28482 78745 62317 23346 2292 -20495 -23594 9773 34502 40862 34182 42956
9628D2956j1850l2282j986p703P260L3205J4097m52j4339l5687L858L2071n872
$$ 42956 31106 -1176 -3162 -10865 -3605 29600 43697 43245 28906 -6781 -2923 29148 23276
9615B3276j2765j965K8808J0992k4863m6477m102K075l415j390J2908K2722J5857
$$ 23276 10511 8546 37354 48346 23483 -22994 -27096 -25021 -28436 -29826 -16918 5804 21661
9602B1661L352l4473k2470K3890P836j15m475J3809K5683j6561k5105Q193J1283
$$ 21661 25013 -9460 -31930 -8040 -204 -319 -4794 9015 34698 18137 -6968 1225 12508
9589A2508j1315j0989k0042j3472R476O848k469J2017m827k879n293j3937j6539
$$ 12508 1193 -9796 -29838 -43310 -33834 -26986 -29455 -17438 -22265 -25144 -30437 -44374 -60913
9576f0913Q733m288K6707J7004j2280k3286K9945N5426k0450k7896j3427N878
$$ -60913 -52180 -56468 -29761 -12757 -25037 -48323 -18378 37048 16598 -11298 -24725 -18847
9564a8847M216L0255R941j1630N038K950l5368p24J3255O220J1957K2628k4772
$$ -18847 -14631 15624 25565 13935 18973 21923 -13445 -14169 -914 5306 17263 39891 15119
9551A5119n0269j2385J2083k4175j7151Q800k048L1187L7375O640K856K6523r948
$$ 15119 -35150 -47535 -35452 -59627 -76778 -67978 -70026 -38839 -1464 5176 8032 34555 24607
9538B4607R29p542l085K0662j2820o602J4681P168k2144q659m7551p826m796K7244
$$ 24607 25536 17994 14909 35571 22751 16149 30830 37998 15854 7195 -40356 -48182 -52978 -25734
9524b5734K2204K4385j1537J0929n2660l2671r491J1730j7176O042P483l991O528
$$ -25734 -3530 20855 9318 20247 -32413 -65084 -74575 -62845 -80021 -73979 -66496 -70487 -63959
9511f3959K6356K0311J2293O020j9402j4696J5390J958o097R960k4054J4920L2187
$$ -63959 -37603 -17292 -4999 1021 -18381 -33077 -17687 -15729 -21826 -11866 -35920 -21000 11187
9498A1187n028m2697k1359n499K0318J7295J7812K5535l251K2229j0638L321j0934
$$ 11187 6159 -36538 -57897 -63396 -43078 -25783 -7971 17564 14313 36542 25904 29225 18291
9485A8291j9069J0782J705L762r398J4625k938j6924l4781K4756J3371M684j3406
$$ 18291 -778 10004 11709 15471 6073 20698 17760 836 -33945 -9189 4182 8866 -4540
9472d540l830J5741O948P570k549k1484j6414J6904Q383r21r399k3624m4431Q501
$$ -4540 -8370 7371 14319 21889 19340 -2144 -18558 -1654 6729 5808 -3591 -27215 -71646 -63145
9458f3145m94n042R495M0609J8825k6560j6781K1846L8716J4204q638k5841l1772
$$ -63145 -63639 -68681 -59186 -18577 248 -26312 -43093 -21247 17469 31673 23035 -2806 -34578
9445c4578J1097L6318j699k7760o768J7772j4273j5580m271J3062k196L5864J4891
$$ -34578 -23481 12837 11138 -16622 -23390 -5618 -19891 -35471 -39742 -26680 -28876 6988 21879
9432B1879K931j4480j7582n745l0770l3716m800L7962M9009Q501j2927J5737Q665
$$ 21879 24810 10330 -7252 -12997 -43767 -77483 -82283 -44321 4688 13189 262 15999 24664
9419B4664r935O814j2845l1019j539M1388M122m9478j7159K1796J1305j2821m026
$$ 24664 14729 21543 8698 -22321 -23860 17528 21650 -27828 -44987 -23191 -11886 -24707 -28733
9406b8733j179k8203K655K8831M677k0525L4654r028o727M2441K0450k3553q334
$$ -28733 -29912 -58115 -55460 -26629 -21952 -42477 -7823 -16851 -23578 18863 39313 15760 7426
9393G426l82l3864L257j325n586M039n954J8693L0486L3534k1016j7312j2409
$$ 7426 7044 -26820 -23563 -24888 -30474 -26435 -32389 -13696 16790 50324 29308 11996 -413
9380d13k8910p615M570j4331j2972L5854j4883j6781N768L4123N0496q555J089
$$ -413 -29323 -36938 -32368 -46699 -59671 -23817 -38700 -55481 -49713 -15590 34906 26351 27440
9367B7440J55k7595k5360L745j9557L2908J2239j9403j8261K8232j293J6411R493
$$ 27440 27595 0 -25360 -21615 -41172 -8264 3975 -15428 -33689 -5457 -6750 9661 19154
9354A9154R789K9613k1085j6552K8062j0613j6358J7957K2114j4116m8680K3074
$$ 19154 28943 58556 37471 20919 48981 38368 22010 39967 62081 47965 -715 22359
9342B2359K2662j1530N48J6572k3988j3656m817K2029P882j4022r597j0570j3611
$$ 22359 45021 33491 34039 50611 26623 12967 8150 30179 38061 24039 14442 3872 -9739
9329i739K908K566p638N39J1172k772P606j4503k522R952R473K2201l6112J4773
$$ -9739 -6831 -4265 -11903 -11364 -192 -2964 4642 -9861 -12383 -2431 7042 29243 -6869 7904
9315G904l5536j2581J010l0233L0422K3141j9320M283M360N631J3989J1391r426
$$ 7904 -27632 -40213 -39203 -69436 -39014 -15873 -35193 -30910 -26550 -20919 -6930 4461 -4965
9302d965l9151J6375O070M988j4441k5832K2151J5780q518m546M8208K334k613
$$ -4965 -44116 -27741 -21671 -16683 -31124 -56956 -34805 -19025 -27543 -32089 16119 18453 15840
9289A5840j5436j4683N983J6749J6687N10o34K475J835j819p798K2906L550k1976
$$ 15840 404 -14279 -8296 8453 25140 25650 25016 27491 29326 27507 19709 42615 46165 24189
9275B4189J0391j0517n4433o722K9023O57l6218l3373K0449M6863P091q596n108
$$ 24189 34580 24063 -30370 -37092 -8069 -7412 -43630 -77003 -56554 -9691 -2600 -11196 -16304
9262a6304k2867P709J0068q079O889M1733k7963j4989L2222J8452J5333j5151
$$ -16304 -39171 -31462 -21394 -29473 -22584 19149 -8814 -23803 8419 26871 42204 27053
9250B7053k7703k1536j498R781J0423n123J9008K2028K3706m049n6462l511K7424
$$ 27053 -650 -22186 -23684 -13903 -3480 -8603 10405 32433 56139 52090 -4372 -7883 19541
9237A9541J0371L070L7061p441j3489q256k9911o4L2525k036l0685k2230m469
$$ 19541 29912 32982 70043 62602 49113 40857 10946 10882 43407 41371 10686 -11544 -16013
9224a6013J7052k4844m086L4528K037O21j2972N536m544k448J0688j691J4699
$$ -16013 1039 -23805 -27891 6637 8674 9295 -3677 1859 -2685 -5133 5555 3864 18563
9211A8563K6009l276J122J3460q455J486J4783n0632J2335R277N116p008l932
$$ 18563 44572 41296 42418 55878 47423 48909 63692 13060 25395 34672 39788 32780 28848
9198B8848o433j533L333j2283J6911N375K652k1411n3079L808L2238L4505Q081
$$ 28848 22415 20882 24215 11932 28843 34218 36870 15459 -37620 -33812 -1574 32931 41012
9185D1012R902l3179l3473O518J5748k5287P252J8622J8979j1020p857K3637J2091
$$ 41012 50914 17735 -15738 -9220 6528 -18759 -11507 7115 26094 15074 7217 30854 42945
9172D2945r306l406O946j5756l3831K0244m967l233M5285K6790Q00m1480j0071
$$ 42945 33639 30233 37179 21423 -12408 7836 2869 -364 44921 71711 72511 31031 20960
9159B0960o251J0170r84k7788r175J5094J6600J0467p107K54O09l2865P5J5624
$$ 20960 14709 24879 23895 -3893 -13068 2026 18626 29093 21986 22240 22849 -10016 -9941 5683
9145E683o720n542K9594j512k5074J5817N051j0617P474m771L218k6164K5375
$$ 5683 -1037 -6579 23015 21503 -3571 12246 17297 6680 14154 9383 12601 -13563 11812
9132A1812o936k288J7186J396j0589J5095k332j7894k0940j0363L0426M1108L478
$$ 11812 4876 2588 19774 21170 10581 25676 23344 5450 -15490 -25853 4573 45681 49159
9119D9159l4889J1228Q36j0303p033M945J9066o421O276r982l79k9366r511j427
$$ 49159 14270 25498 26334 16031 8998 13943 33009 26588 32864 22882 22503 -6863 -16374 -17801
9105a7801J0938j0601J2842k376k0501o112M7134J9213j0372k1725J941J7206
$$ -17801 -6863 -17464 -4622 -6998 -27499 -33611 13523 32736 22364 639 2580 19786
9093A9786R536k9441j5966J1187L780k776P077K404m361j7583k7410o849J0854
$$ 19786 29322 -119 -16085 -4898 -1118 -3894 3183 5587 1226 -16357 -43767 -50616 -39762
9080c9762L6415J6024j4502j7562Q831N255l230o734Q75K1675O564n58J6391n7470
$$ -39762 -3347 12677 -1825 -19387 -10556 -5301 -8531 -15265 -14390 7285 13849 13291 29682 -27788
9066b7788k4559K5961R087P648o622k0349k6035J1870N1366q247j4987K0405l081
$$ -27788 -52347 -26386 -17299 -9651 -16273 -36622 -62657 -50787 579 -7668 -22655 -2250 -5331
9053e331O982K6571l624n6619k7795L3966K4873k5578J2002l832J1284M385K656
$$ -5331 1651 28222 24598 -32021 -59816 -25850 -977 -26555 -14553 -18385 -7101 -2716 -60
9040f0o037j9067j2434K7561J6926k2910j0765m196j3155j1412K3200K9587M9093
$$ -60 -6097 -25164 -37598 -10037 6889 -16021 -26786 -30982 -44137 -55549 -32349 -2762 46331
9027D6331k6448k3023K8455M2234q990q583j5506j3956P537p573n2608M228J2773
$$ 46331 19883 -3140 25315 67549 58559 49976 34470 20514 28051 20478 -32130 -27902 -15129
9014a5129J2586J9130j0939K4713M158j4178J6980J0064k4757k6220k7055l591
$$ -15129 -2543 16587 5648 30361 34519 20341 37321 47385 22628 -3592 -30647 -34238
9002c4238L6487N735j2832k4854K0099Q131j5033k2505J8534L2046K5629k833
$$ -34238 2249 7984 -4848 -29702 -9603 -1472 -16505 -39010 -20476 11570 37199 34366
8990C4366j9190k8352M578l014J9415k480p610J4075m160Q239K2164O964L826
$$ 34366 15176 -13176 -8598 -11612 7803 5323 -2287 11788 7628 15867 38031 44995 48821
8977D8821k0620k4851j505K0047p174k2497Q522J7115J7403k3317j6987M0285
$$ 48821 28201 3350 1845 21892 14718 -7779 743 17858 35261 11944 -5043 35242
8965C5242L2822k6317l8732m194P591J3015j2461l047L9087M356j3972m0330j272
$$ 35242 68064 41747 3015 -1179 6412 19427 6966 3919 43006 47362 33390 -6940 -8212
8952h212l33j9186l128J5738K4655o477K074J4648M118l418j6045o123Q222K3166
$$ -8212 -8545 -27731 -30859 -15121 9534 3057 5131 19779 23897 20479 4434 -1689 6533 29699
8938B9699K5397k8487j8230M054j2720o46K6240P584n940k589J857J4561j7337
$$ 29699 55096 26609 8379 12433 -287 -933 25307 32891 26951 24362 26219 40780 23443
8925B3443l1143k3889J7860J1426j530l3761K70N0208K0520j2217K2039k2637
$$ 23443 -7700 -31589 -13729 -2303 -3833 -37594 -37324 12884 33404 21187 43226 20589
8913B0589k0331J4872p566J8874k3999m7815J0775M7529J1893k6544K5364P0292
$$ 20589 258 15130 7564 26438 2439 -45376 -34601 12928 24821 -1723 23641 93933
8901I3933j6739m1179k4859m2013J0659L1984J4118j9627j7148j0146J5222K1515
$$ 93933 77194 36015 11156 -30857 -20198 11786 25904 6277 -10871 -21017 -5795 15720
8889A5720l076K1558j84k4280k7057j8827K1098K5526N7665m973k3981m2272L812
$$ 15720 12644 34202 34018 9738 -17319 -36146 -15048 10478 68143 63170 39189 -3083 729
8876G29p423J4354K9597K3462M3279N786j9645p850j0867M881m271N770J235J3608
$$ 729 -6694 7660 37257 60719 103998 109784 90139 82289 71422 76303 72032 77802 79037 92645
8862I2645M9595M4263N3621M0819n890r022j8022n1118n1806m7792k8982k8277
$$ 92645 142240 186503 240124 280943 275053 266031 248009 196891 145085 97293 68311 40034
8850D0034k8338M422r005j2840K9232K3073K2059P190N968M7301j2571j9076j8242
$$ 40034 11696 16118 7113 -5727 23505 46578 68637 75827 81795 129096 116525 97449 79207
8837G9207j7351j5507J3768j8750k2221j9815K7382L3548k2021k2645R210J1623
$$ 79207 61856 46349 60117 41367 19146 -669 26713 60261 38240 15595 24805 36428
8825C6428j3415P473j7644N512P954k7844J5490o551R295J1654j6624o492p805
$$ 36428 23013 30486 12842 18354 26308 -1536 13954 7403 16698 28352 11728 5236 -2569
8812b569n526K1662p432J838k28J3096K9675M9454N2411J2730k3335m1779m0120
$$ -2569 -8095 13567 6135 7973 7745 20841 50516 99970 152381 165111 141776 99997 59877
8799E9877k4174l1556K8007n558K6485k4575l5023k3014L2851L1936K9270J3361
$$ 59877 35703 4147 32154 26596 53081 28506 -6517 -29531 3320 35256 64526 77887
8787G7887m3109m3014r979n591J1925Q90k856P330K0753J4085j0228k870K654
$$ 77887 34778 -8236 -18215 -23806 -11881 -10991 -13847 -6517 14236 28321 18093 15223 17877
8774A7877R460Q808J5581j9531J927K268J6888L0485P052j6354n574J107q415
$$ 17877 27337 36145 51726 32195 34122 36390 53278 83763 90815 74461 68887 69994 61579
8761F1579L3807j0066k0526n555M632K4278L029k8111m6879j1033J0131J959q162
$$ 61579 95386 85320 64794 59239 63871 88149 91178 63067 16188 5155 15286 17245 9083
8748I083m6615m534l86O832J1552K2456J6368J4564P558K0000M400l6775K0932
$$ 9083 -37532 -42066 -42452 -35620 -24068 -1612 14756 29320 36878 56878 61278 24503 45435
8735D5435L7840k9544o948j9514m976J2650P916J5316j4095l2594j0354R775J7633
$$ 45435 83275 53731 46783 27269 22293 34943 42859 58175 44080 11486 1132 10907 28540
8722B8540J37N503j1052K5087J4582k3305l0190K1837K0019J0574q569j5152J4844
$$ 28540 28677 34180 23128 48215 62797 39492 9302 31139 51158 61732 53163 38011 52855
8709E2855J5977j0385m0669r11J2613J3206J250L891p106k6423J9316M840o333
$$ 52855 68832 58447 17778 16867 29480 42686 43936 47827 40721 14298 33614 38454 32121
8696C2121l7640r938L960K4190R849J002L3010M2379j7054j7130j8808k3056l303
$$ 32121 -5519 -15457 -11497 12693 22542 23544 56554 98933 81879 64749 45941 22885 19582
8683A9582j0292N02m253l707J7816q093j2789j3824K3134O4392L7192k624l2084
$$ 19582 9290 9792 5539 1832 19648 11555 -1234 -15058 8076 72468 109660 107036 74952
8670G4952R282J4664m8950l5227j4836O32M105j1206p902j2701P650j509R109
$$ 74952 84234 98898 49948 14721 -115 517 4622 -6584 -14486 -27187 -19537 -21046 -11937
8657a1937J8993K4816L6244J81m310L4476M0484k2634p509K2976j1384m8924k651
$$ -11937 7056 31872 68116 68297 63987 98463 138947 116313 108804 131780 120396 71472 68821
8644F8821J5739Q665j1273Q049L1191l3880Q656j8172j8788j1R098k3749M546
$$ 68821 84560 93225 81952 90001 121192 87312 95968 77796 59008 58997 68095 44346 48892
8631D8892L324J9768K8728L189j3479o336L5189m49j4502J7310K961j9374k2780
$$ 48892 52216 71984 100712 103901 90422 84086 119275 118826 104324 121634 124595 105221 82441
8618H2441j1882k5856j8616L827L1958K6423j9767k3632Q711J4576k283j5924
$$ 82441 70559 44703 26087 29914 61872 88295 68528 44896 53607 68183 65900 49976
8606D9976j9828j6455K1094L2089P259K4492J8957K7608O620j9146j0903K2446
$$ 49976 30148 13693 34787 66876 74135 98627 117584 145192 151812 132666 121763 144209
8594A44209M8677N5876L0531L5703M827l903j4204j8751k2808l1249k4727r779
$$ 144209 192886 248762 279293 314996 319823 315920 301716 282965 260157 228908 204181 194402
8582A94402r291o911K0111j5277l4495k0555k143Q511m4682j0643J9445J9153
$$ 194402 185111 178200 198311 183034 148539 127984 125841 134352 89670 79027 98472 117625
8570A17625j9262k4130k7308j0552K3016j0275k2483r11J2068o460k7025j0270
$$ 117625 98363 74233 46925 36373 59389 49114 26631 25720 37788 31328 4303 -5967
8558e967K9774J7801J65o604k6052l75J3484K4422R369J0836P647j0770j72R382
$$ -5967 23807 41608 41773 35169 9117 8742 22226 46648 56017 66853 74500 63730 63558 72940
8544G2940m359m3853j0129J1861l370k182O694k1567J139q356J866m413J6823
$$ 72940 68581 24728 14599 26460 23090 20908 27602 6035 7174 -1182 684 -3729 13094
8531A3094K2217o020O423J560J4574m578j1933j8927J9331j1141j7794K8265O137
$$ 13094 35311 29291 35714 37274 51848 47270 35337 16410 35741 24600 6806 35071 41208
8518D1208M225j2620r716j2955r260Q856q130j5526O2418p275m344o610j6959
$$ 41208 45433 32813 23097 10142 882 9738 1608 -13918 48500 41225 36881 30271 13312
8505A3312m250k4316j3690k0650k6233k0L0839N4677p714K1928r440j9951L734
$$ 13312 9062 -15254 -28944 -49594 -75827 -75847 -45008 9669 1955 23883 14443 -5508 -1774
8492a774j4423K5078J7857o050P446O878k6688j7487K0912J530o321Q721J2627
$$ -1774 -16197 8881 26738 20688 28134 35012 8324 -9163 11749 13279 6958 15679 28306
8479B8306K1559J1924j7546l3821j26k3771J8401o320r300J3154m941l7538l250
$$ 28306 49865 61789 44243 10422 10296 -13475 4926 -1394 -10694 2460 -2481 -40019 -43269
8466d3269J3039j5992J119J2532J2447j2099r485K9674j0689P387L1044q119R384
$$ -43269 -30230 -46222 -45103 -32571 -20124 -32223 -41708 -12034 -22723 -15336 15708 7589 16973
8453A6973K1857K1375l4340j9588J0642q717j9074L03m765J1405K2055L0315j1063
$$ 16973 38830 60205 25865 6277 16919 8202 -10872 -10569 -15334 -3929 18126 48441 37378
8440C7378n9907K3110J265m345m0251K6214L3729O015K823J4356R150L2965p355
$$ 37378 -22529 581 1846 -2499 -42750 -16536 17193 23208 26031 40387 49537 82502 75147
8427G5147l3960m2412k5146J0597j4507L850L6049o33O408J0563J1089l641L659
$$ 75147 41187 -1225 -26371 -15774 -30281 -26431 9618 8985 15393 25956 37045 33404 37063
8414C7063M607j8266P258N933J3130m089k0905N102K2799K8995j3515m8913K835
$$ 37063 41670 23404 30662 36595 49725 45636 24731 29833 52632 81627 68112 19199 22034
8401B2034Q029r909J4043o275l3968p832r539N862J1996J645J9794k1101l3877
$$ 22034 30063 20154 34197 27922 -6046 -13878 -23417 -17555 -5559 -3914 15880 -5221 -39098
8388c9098j3430M8595K8186J3053k0053j8996J3259K17k5258r140n501p703L1302
$$ -39098 -52528 -3933 24253 37306 17253 -1743 11516 11733 -13525 -22665 -28166 -35869 -4567
8375d567L8148q516j2472K7234O455J0083k6727l7226J1360j6502l8928K7873
$$ -4567 33581 25065 12593 39827 46282 56365 29638 -7588 3772 -12730 -51658 -23785
8363b3785K9859q715J1219J6288j0628k7283K0059M1871k1534k4908J975o919
$$ -23785 6074 -2641 8578 24866 14238 -13045 7014 48885 27351 2443 4418 -2501
8351b501J9703n831P490J6008r627k2943J549k6193k1381J6461P939K9369j8744
$$ -2501 17202 11371 18861 34869 25242 2299 3848 -22345 -43726 -27265 -19326 10043 -8701
8338h701j5987J7730L00k1909j713K0397o842K5768L361k2816R971K9015J5890
$$ -8701 -24688 -6958 -6658 -28567 -30280 -9883 -16725 9043 12404 -10412 -441 28574 44464
8325D4464p287j1357l2458P96R273r206J1985K3516m846k4859k6435j1257K2422
$$ 44464 37177 25820 -6638 -5842 3431 -5775 6210 29726 24880 21 -26414 -37671 -15249
8312a5249R563k1847J8377M720J2177k0647J8795j1491l1815j2137o682K3598
$$ -15249 -5686 -27533 -9156 -4436 7741 -12906 5889 -5602 -37417 -49554 -56236 -32638
8300c2638N5347r706j1744lj7818o307O131J7874Q724j4275J6118K3976K8297
$$ -32638 22709 13003 1259 1256 -16562 -22869 -16738 1136 9860 -4415 11703 35679 63976
8287F3976m5732m4806k1684J7315M0353l3121N327J9084m0844k6707r540K289
$$ 63976 18244 -26562 -48246 -30931 9422 -23699 -18372 712 -40132 -66839 -76379 -74090
8275g4090K6434K1959l2880N753l305J9169M8869J6466l2537m2266j4078K6382
$$ -74090 -47656 -25697 -58577 -52824 -56129 -36960 11909 28375 -4162 -46428 -60506 -34124
8263c4124Q834j2439j883J5633J495K9813M2268L568j1387l604K0927k711j3724
$$ -34124 -25290 -37729 -39612 -23979 -22484 7329 49597 53165 41778 38174 59101 56390 42666
8250D2666p117l7360m935j6496j1242K5192J8196j6127k2511k5301p761L1726
$$ 42666 35549 -1811 -6746 -23242 -34484 -9292 8904 -7223 -29734 -55035 -62796 -31070
8238c1070K6033K2301J2348k5613l3178Q050j954M205J8712j8346k209J5520J8861
$$ -31070 -5037 17264 29612 3999 -29179 -21129 -23083 -18878 -166 -18512 -20721 -5201 13660
8225A3660k7377r408L85J2835j3749K3999K0823k5527l659k2340K8487j0149q167
$$ 13660 -13717 -23125 -22740 -9905 -23654 345 21168 -4359 -8018 -30358 -1871 -12020 -20187
8212b0187J6264P822O347L018L292j5361j3274o835j2159j0073K0337l833j5550
$$ -20187 -3923 3899 10246 13264 16556 1195 -12079 -18914 -31073 -41146 -20809 -24642 -40192
8199d0192K6764J0757K4302J3038k8156j8036l880n068J5758J8522k8228j7353
$$ -40192 -13428 -2671 21631 34669 6513 -11523 -15403 -20471 -4713 13809 -14419 -31772
8187c1772j5225J3975J3356J6740j5016m3978J8708K1212O4905L1742j6562l1189
$$ -31772 -46997 -33022 -19666 -2926 -17942 -61920 -43212 -22000 42905 74647 58085 26896
8175B6896m2725M462J1155j8984K1485O975o121K3897j5255N217j4119L828Q506
$$ 26896 -15829 -11367 -212 -19196 2289 9264 3143 27040 11785 17002 2883 6711 15217
8162A5217J712J4560k734J5621j4990k4501r30L032N418K6729K8055k6882k2678
$$ 15217 16929 31489 28755 44376 29386 4885 3955 6987 12405 39134 67189 40307 17629
8149A7629J1654k7865k1261L941l375J567J7784J1359J6240J2977M312J1950j969
$$ 17629 29283 1418 -19843 -15902 -19277 -17710 74 11433 27673 40650 44962 56912 54943
8136E4943k2029J175k2954p827K2478J6048J2224N856K807J5135k958j3547j0567
$$ 54943 32914 34089 11135 3308 25786 41834 54058 59914 62721 77856 74898 61351 50784
8123E0784O439j3656n343o465j5000K743K5204j3190O373J725J6545J2064k5999
$$ 50784 57223 43567 38224 31759 16759 19502 44706 31516 37889 39614 56159 68223 42224
8110D2224p944J3894P646l9285p747K5909p710j1981o148K6749j436m0544j1628
$$ 42224 34280 48174 55820 16535 8788 34697 26987 15006 8858 35607 34171 -6373 -18001
8097a8001R995n500l048J6229R364k1909J5372K2806O892J6945J2267O784j3219
$$ -18001 -8006 -13506 -16554 -325 9039 -12870 2502 25308 32200 49145 61412 68196 54977
8084E4977J457j1673L551P886M871P526p985j0126l36j2450j1431r493J229J5447
$$ 54977 56434 44761 48312 56198 61069 68595 60610 50484 50148 37698 26267 16774 18003 33450
8070C3450j836j1507j9263qK5025j2608k3546J4944J8962j1757M78K8050p229
$$ 33450 31614 20107 844 836 25861 13253 -10293 4651 23613 11856 12334 40384 33155
8057C3155J852J5381k2593K2298J8298m903k4963k408M206P917L836o168l4553
$$ 33155 35007 50388 27795 50093 68391 63488 38525 36117 40323 48240 52076 45908 11355
8044A1355k1262J4006K0097L932J0139j632M477J5850j1893J5529R497N371m318
$$ 11355 -9907 4099 24196 28128 38267 36635 41112 56962 45069 60598 70095 75466 71148
8031G1148J074O661j0323j1507J1269k2185K836j6083q032k4748l4190J1245L7350
$$ 71148 72222 78883 68560 57053 68322 46137 48973 32890 24858 110 -34080 -22835 14515
8018A4515K5155l7968k8783j6944K1458J9346J7027K1893J6982k3880j4208q776
$$ 14515 39670 1702 -27081 -44025 -22567 -3221 13806 35699 52681 28801 14593 5817
8006E817R507K5888K0842q397j5239r941O315j8140m862R710L134N785R320R709
$$ 5817 15324 41212 62054 53657 38418 28477 34792 16652 11790 21500 24634 30419 39739 49448
7992D9448J5694Q966j7701j2292J4588O692n443J7426q764j9744O043K269k2831
$$ 49448 65142 74108 56407 44115 58703 65395 59952 77378 68614 48870 54913 57182 34351
7979C4351l2038j5383m1p367J9167M0768L699N808O737q971j3728m8375j6839
$$ 34351 2313 -13070 -13111 -20478 -1311 39457 43156 48964 55701 46730 33002 -15373 -32212
7966c2212N2208N8132m184j6173k5405l6218M69K5879j844l5544O910j672n732
$$ -32212 19996 78128 73944 57771 32366 -3852 -3383 22496 20652 -14892 -7982 -9654 -15386
7953a5386J1492K1917J6199j6134j5959O547n324J3680J0342K4081k886l601l18
$$ -15386 -3894 18023 34222 18088 2129 8676 3352 17032 27374 51455 48569 44968 44650
7940D4650Q668m357K6016k8739l4441k0397l694K218m416j9599N803J9261J5012
$$ 44650 53318 48961 74977 46238 11797 -8600 -12294 -10076 -14492 -34091 -28288 -9027 5985
7927E985J5185q484k319J9742j6905M025j6284l2181j3913K5355l227j4624o20
$$ 5985 21170 12686 10367 30109 13204 17229 945 -31236 -45149 -19794 -23021 -37645 -38265
7914c8265l426R061L2268M085j7367j4166N563Q171r651j1425M4450K6188k3225
$$ -38265 -41691 -32630 -362 3723 -13644 -27810 -22247 -14076 -23727 -35152 9298 35486 12261
7901A2261l4182J9193M0m9293K2081J9019K7158O601N229j4244N686K964p99O78
$$ 12261 -21921 -2728 -2688 -51981 -29900 -10881 16277 22878 28107 13863 19549 22513 21714 22392
7887B2392k4950k334j4778J4421j336r181j4413J1285J4351J2448P466j9899K8024
$$ 22392 -2558 -4892 -19670 -5249 -6585 -15766 -30179 -18894 -4543 7905 15371 -4528 23496
7874B3496j1k6183l7051j8421j918L2193N4382L3799j0877j2341O837Q951k7045
$$ 23496 23485 -2698 -39749 -58170 -60088 -27895 26487 60286 49409 37068 43905 52856 25811
7861B5811j5877j7042j9388p700Q788K1371J7259O358j5462l9843j7204J2390
$$ 25811 9934 -7108 -26496 -34196 -25408 -4037 13222 19580 4118 -35725 -52929 -40539
7849d0539l9618m958J3979M038J2527L6423M869j348K2539j1015l0332j5992m809
$$ -40539 -80157 -85115 -71136 -67098 -54571 -18148 -13279 -14627 7912 -3103 -33435 -49427 -54236
7836e4236K2608L4526J1719K004l2654k1700J0151m9411j7977K5880K6427l692
$$ -54236 -31628 2898 14617 16621 -16033 -37733 -27582 -76993 -94970 -69090 -42663 -46355
7824d6355o249k8640K3897N4911K2663J510q333J103p27m008j6597j4173M675
$$ -46355 -52604 -81244 -57347 -2436 20227 21737 13404 14507 13780 9772 -6825 -20998 -16323
7811a6323L207J8334J0227q588j6581J1144R454n831l78j3284N281M956K064J3837
$$ -16323 -13116 5218 15445 6857 -9724 1420 10874 5043 4665 -8619 -3338 1618 3682 17519
7797A7519q616N239l3689j7119k583o036K2348K2287M027k4948J7852M0548J1188
$$ 17519 8903 14142 -19547 -36666 -39249 -45285 -22937 -650 3377 -21571 -3719 36829 48017
7784D8017k1649n777j3436j2158J507j95J5377k2534k1001j208j5937J3903J3874
$$ 48017 26368 20591 7155 -5003 -3496 -3691 11686 -10848 -31849 -33057 -48994 -35091 -21217
7771b1217J1279M832N69l37J0513J461J5730J4064o582j4909k132k429J8153J6555
$$ -21217 -9938 -5106 -4537 -4874 5639 7100 22830 36894 30312 15403 13271 10842 28995 45550
7757D5550j6541r684j436K6080K7050j0711k1960J4208K335k1564j6600j4265
$$ 45550 29009 19325 17889 43969 71019 60308 38348 52556 54891 33327 16727 2462
7745B462O833K7120j0442m0862j999j491K1291K5496j5392j2233l1764j4724K2833
$$ 2462 9295 36415 25973 -14889 -16888 -18379 2912 28408 13016 783 -30981 -45705 -22872
7732b2872K3355N41q883r551M179J3553J2606j7033k4213J099m244j644K6985
$$ -22872 483 1024 -7859 -17410 -13231 322 12928 -4105 -28318 -27219 -31463 -33107 -6122
7719f122N669K2532k3268m740l373q242K0556q107J617p933k4699J1923r3R287
$$ -6122 -453 22079 -1189 -5929 -9302 -17544 3012 -5095 -3478 -11411 -36110 -24187 -24280 -14993
7705a4993j7813m2132o466J4607J1078j9380O393J4046L5584L1794m689l7989
$$ -14993 -32806 -74938 -81404 -66797 -55719 -75099 -68706 -54660 -19076 12718 8029 -29960
7693b9960k7368j732l812j1513J072K7792L6790K4727p250l6503j9266L1529J9774
$$ -29960 -57328 -59060 -62872 -74385 -73313 -45521 -8731 15996 8746 -27757 -47023 -15494 4280
7680D280J3477o204l3386l0258Q552p806O68j9293J28K8717K1272M2983J9685
$$ 4280 17757 11553 -21833 -52091 -43539 -51345 -50677 -69970 -69842 -41125 -19853 23130 42815
7667D2815k206p001o708o553L1031k2503m3780p556n373r649j3298k0403L203
$$ 42815 40609 33608 26900 20347 51378 28875 -14905 -22461 -27834 -37483 -50781 -71184 -67981
7654f7981M4697J5029j6856J6733N143j3724N325O182M113J7453J605j4918j3246
$$ -67981 -23284 -8255 -25111 -8378 -3235 -16959 -11634 -5452 -1339 16114 17719 2801 -10445
7641a0445j028K1410j7301j0845j8471q735J7215J3420J2152J0677j5541J3491
$$ -10445 -11473 9937 -7364 -18209 -36680 -45415 -28200 -14780 -2628 8049 -7492 5999
7629E999P453O138l6677k4489j9727J5031M9544J3651o143j6299l4149J3806K1983
$$ 5999 13452 19590 -17087 -41576 -61303 -46272 3272 16923 10780 -5519 -39668 -25862 -3879
7616c879k381K0006j6584N71R561j3816j6126J0568R009k4167j383K7715J1296
$$ -3879 -6260 13746 -2838 -2267 7294 -6522 -22648 -12080 -3071 -27238 -28621 -906 10390
7603A0390L771p392q044K218r853j0530K8770J3918J2079k1540l8985k248o533
$$ 10390 14161 6769 -1275 943 -8910 -19440 9330 23248 35327 13787 -25198 -27446 -33979
7590c3979L1770K2622P857j2259m087j4788m965P563j3251p713j0512L588J6732
$$ -33979 -2209 20413 28270 16011 11924 -2864 -7829 -266 -13517 -21230 -31742 -28154 -11422
7577a1422L535K7464j6464P781Q300j6905m965M805J3808j7157j5135j1186o950
$$ -11422 -7887 19577 3113 10894 19194 2289 -2676 2129 15937 -1220 -16355 -27541 -34491
7564c4491j3504q096J7341L909K1456K3937k12k2127m063J3506K2861J7275k4298
$$ -34491 -47995 -56091 -38750 -34841 -13385 10552 10340 -11787 -15850 -2344 20517 37792 13494
7551A3494n410L2294k5969n6424L689L0938j718j0247j487P859J2519k236q473
$$ 13494 8084 40378 14409 -42015 -38326 -7388 -9106 -19353 -20840 -12981 -462 -2698 -11171
7538a1171J9448q711o684m729q828R676j8539j7662L1647K7113J5002J074j4383
$$ -11171 8277 -434 -7118 -11847 -20675 -10999 -29538 -47200 -15553 11560 26562 27636 13253
7525A3253J6375j7135K105p835k2140j5931P628K6697n893j7775K7111L6263m864
$$ 13253 29628 12493 14598 6763 -15377 -31308 -23680 3017 -2876 -20651 6460 42723 37859
7512C7859l3127j2670j6777N627k626K8986J3586J7498k189k6088k5380J0009
$$ 37859 4732 -7938 -24715 -19088 -21714 7272 20858 38356 36167 10079 -15301 -5292
7500e292R982k7871J0851J5170j9185J1009J0628k993J9838K9796j4958k6705
$$ -5292 4690 -23181 -12330 2840 -16345 -5336 5292 2299 22137 51933 36975 10270
7488A0270j5340J020J8916P784j1581m289Q947K048N087k0072l2402p072L5392
$$ 10270 -5070 -4050 14866 22650 11069 6780 15727 17775 22862 2790 -29612 -36684 -1292
7475a292K8194j8363j1470l0499j0686J1708L0142O243M853J3852j2570k355J3038
$$ -1292 26902 8539 -2931 -33430 -44116 -32408 -2266 3977 8830 22682 10112 7757 20795
7462B0795k9692J634j977M497o688L317R281J932l3512j5614J948O530j2687J900
$$ 20795 -8897 -7263 -9240 -4743 -11431 -8114 1167 3099 -30413 -46027 -44079 -37549 -50236 -48336
7448d8336N215Q019K0615j711M0383r888l2862K7214J5289J8594n347J958m338
$$ -48336 -43121 -35102 -14487 -16198 24185 14297 -18565 8649 23938 42532 37185 39143 34805
7435C4805p546k3295m1104J7000K3763J613O327j3671P130J3971l9877j8888M635
$$ 34805 27259 3964 -37140 -20140 3623 5236 11563 -2108 5022 18993 -20884 -39772 -35137
7422c5137m514n160K6655l896j4676r156O242M07R722L399p800L2028Q861p931
$$ -35137 -39651 -44811 -18156 -22052 -36728 -45884 -39642 -39235 -29513 -26114 -33914 -1886 6975 -956
7408i56n278L0012O150l0250J1208j5079j3072L31K2188J2376l2132k3822L0567
$$ -956 -6234 23778 29928 -322 10886 -4193 -17265 -16934 5254 17630 -14502 -38324 -7757
7395g757N8430j0214l5210k4976p56J1057K7452n877k6990k3862J9940M7985L777
$$ -7757 50673 40459 5249 -19727 -20483 -9426 18026 12149 -14841 -38703 -18763 29222 32999
7382C2999l2499j1875Q602M775j5755j6377R362J1475j2711j976j3354q262L792
$$ 32999 500 -11375 -2773 2002 -13753 -30130 -20768 -9293 -22004 -23980 -37334 -45596 -41804
7369d1804p645K4240K0860j0639k0485K831N253N46M8m077j3230k4226m312L1870
$$ -41804 -49449 -25209 -4349 -14988 -35473 -32642 -27389 -26843 -26795 -30872 -44102 -68328 -72640 -40770
7355d0770R062J8683J7390J257m2393J8846N175r768J5939K1348k2643k8217j048
$$ -40770 -31708 -13025 4365 5622 -36771 -17925 -12750 -22518 -6579 14769 -7874 -36091 -37139
7342c7139J1163J382J7568j4143P957r206K0372l169l4576q57k2781J5221L4717
$$ -37139 -25976 -24594 -7026 -21169 -13212 -22418 -2046 -5215 -39791 -40648 -63429 -48208 -13491
7329a3491L8279L6578K348m4290l0829J5293J1896k3649j0256K2568m522n108
$$ -13491 24788 61366 63714 19424 -11405 3888 15784 -7865 -18121 4447 -75 -5183
7317e183K8746j7985l6954j9275j6731q919J6043R634l4540K4232L3794J767j1463
$$ -5183 23563 5578 -31376 -50651 -67382 -76301 -60258 -50624 -85164 -60932 -27138 -25371 -36834
7304c6834L0008J5482K3768p095l0814j6278o104j5101J0028K117K3485J0075
$$ -36834 -6826 8656 32424 25329 -5485 -21763 -27867 -42968 -32940 -30823 -7338 2737
7292B737M62j2044j9523k1321J2706K5709P177n450l1928j4071K595L4268N083
$$ 2737 3199 -8845 -28368 -49689 -36983 -11274 -4097 -9547 -41475 -55546 -52951 -18683 -13600
7279a3600r293J1405K5166k187j5509Q312n48k9971k583k7079Q44K4663j2344
$$ -13600 -22893 -11488 13678 11491 -4018 4294 3746 -26225 -28808 -55887 -55043 -30380 -42724
7266d2724k227K7586R488q555N13o890j0711J4249L6043k498j88j4038j7607m587
$$ -42724 -44951 -17365 -7877 -16432 -15919 -22809 -33520 -19271 16772 14274 14086 48 -17559 -22146
7252b2146L221n261j6284O934N046j6791J4658J3537J2336j7968O617K1478O503
$$ -22146 -18925 -24186 -40470 -33536 -28490 -45281 -30623 -17086 -4750 -22718 -16101 5377 11880
7239A1880j1164l7650l6j2752p094m710K1373J0842N037j3779J1987K9471P982
$$ 11880 716 -36934 -36970 -49722 -56816 -61526 -40153 -29311 -24274 -38053 -26066 3405 11387
7226A1387P333k2055j033J1979l947K3108K368n753l305j4762r321n306o850J7130
$$ 11387 18720 -3335 -4368 7611 3664 26772 29140 23387 20082 5320 -4001 -9307 -16157 973
7212I73m540J9451O243J1948k5713k9189j6330p12N751j6693J5299L0901j3606
$$ 973 -3567 15884 22127 34075 8362 -20827 -37157 -37869 -32118 -48811 -33512 -2611 -16217
7199a6217j9195R042J5342J2116j9061k0895j1156J4823J7049K6689K089l0681
$$ -16217 -35412 -26370 -11028 1088 -17973 -38868 -50024 -35201 -18152 8537 10626 -20055
7187b0055j8450K962M8970j0416L1546L2203j3796k0568l4314j1779k394J1731
$$ -20055 -38505 -35543 13427 3011 34557 66760 52964 32396 -1918 -13697 -16091 -4360
7175d360k616n14p876j3077j0476L125J5301K5542k436O685j1620j5311o48L2284
$$ -4360 -6976 -7490 -15366 -28443 -38919 -35794 -20493 5049 2613 9298 -2322 -17633 -18281 14003
7161A4003R918r641J294o195j48J1768j3141o148p821K259J8217R674m784k3579
$$ 14003 23921 14280 15574 9379 9231 20999 7858 1710 -6111 -3852 14365 24039 19255 -4324
7147d324R103L969l7205j7522J1928N8604L9002j1562p498n874M850k100L214
$$ -4324 4779 8748 -28457 -45979 -34051 24553 63555 51993 44495 38621 43471 41371 44585
7134D4585k2661k7490o87J4329n062k5322M081K1432k4854l686J0529j725P314
$$ 44585 21924 -5566 -6253 8076 3014 -22308 -18227 3205 -21649 -25335 -14806 -16531 -9217
7121i217K5538n154m882l771j1416O349J3638k9121k2751K2549J4189j3339K3547
$$ -9217 16321 11167 6285 2514 -8902 -2553 11085 -18036 -40787 -18238 -4049 -17388 6159
7108F159j7133K920l3777j8641K6610L4994M470M271N231K0833K1570J9807p438
$$ 6159 -10974 -8054 -41831 -60472 -33862 1132 5602 9873 15104 35937 57507 77314 69876
7095F9876m5671k1487P622k6400m375O493N233M705J3790p59l332k0511k8415
$$ 69876 24205 2718 10340 -16060 -20435 -13942 -8709 -4004 9786 9027 5695 -14816 -43231
7082d3231K2040K3551o082L5977L615m1003Q501L7212J2280l6087q799L2746K5867
$$ -43231 -21191 2360 -3722 32255 35870 -5133 3368 40580 52860 16773 7974 40720 66587
7069F6587l8823m9725l431K6216L1827k7609m091r767j903K5426K2199J1469l790
$$ 66587 27764 -21961 -25392 824 32651 5042 951 -8816 -10719 14707 36906 48375 44585
7056D4585n210r793k8971k5489K3850K9939q416j5265n856j0598O117m383R476
$$ 44585 39375 29582 611 -24878 -1028 28911 20495 5230 -626 -11224 -5107 -9490 -14
7043a4k77r153o772p080j5711K107L704J2197K066R625j350M3Q637M5838p655
$$ -14 -291 -9444 -16216 -23296 -39007 -36900 -33196 -20999 -18933 -9308 -10658 -10615 -1978 43860 36205
7028C6205j3146J3851J0257j5550L021L807k2938k1161J452L994j9455k693l069
$$ 36205 23059 36910 47167 31617 34638 38445 15507 -5654 -4202 -208 -19663 -22356 -25425
7015b5425l0217j6336J2062J465J9316N762q38J4959K893k7946Q972K6953l406
$$ -25425 -55642 -71978 -59916 -58451 -39135 -33373 -34211 -19252 -16359 -44305 -35333 -8380 -11786
7002a1786j3688K4503K3008M215j3516J329K2594J7893k5452l3272J3003R513
$$ -11786 -25474 -971 22037 26252 12736 14065 36659 54552 29100 -4172 8831 18344
6990A8344j4638j7811O173K1378n665r369n204n425J0508k0745l698J4839J347
$$ 18344 3706 -14105 -7932 13446 7781 -1588 -6792 -12217 -1709 -22454 -26152 -11313 -9966
6977i966q871K1024K2979Q079k3820q991N877m874l858J5245m859j6844p075K5710
$$ -9966 -18837 2187 25166 33245 9425 434 6311 1437 -2421 12824 7965 -8879 -15954 9756
6963I756O150k4151J224K1903k2922O013J2727M50q134m4137Q530M8325J0137
$$ 9756 15906 -8245 -7021 14882 -8040 -2027 10700 11150 3016 -41121 -32591 15734 25871
6950B5871j3026k281R875k5715J0477K97j3469k6941J6551L820j4579K495L267
$$ 25871 12845 10564 20439 -5276 5201 5498 -7971 -34912 -18361 -14541 -29120 -26625 -23358
6937b3358J8866K920j3846j508L542k896k203K5900k6043l597M670J0590n386
$$ -23358 -4492 -1572 -15418 -16926 -13384 -16280 -18483 7417 -18626 -22223 -17553 -6963 -12349
6924a2349R320k136j7184k0039K6045J4539l838n957m657N094l5448k294K7366
$$ -12349 -3029 -5165 -22349 -42388 -16343 -1804 -5642 -11599 -16256 -11162 -46610 -48904 -21538
6911b1538J3140q357Q457J5813j0064k2464K5967j8778R234Q506N953L8115J3754
$$ -21538 -8398 -16755 -8298 7515 -2549 -25013 954 -17824 -8590 -84 5869 43984 57738
6898E7738m349j3291J2940j2182L0683r948k1947R136M174p466j5789k01j4259
$$ 57738 53389 40098 53038 40856 71539 61591 39644 48780 52954 45488 29699 29498 15239
6885A5239k5973o721J8055l4658j4799N2038J6016J4725J4481Q663q154m605J4269
$$ 15239 -10734 -17455 600 -34058 -48857 3181 19197 33922 48403 57066 48912 44307 58576
6872E8576R218J7972k645j0994Q77R657j2318l5353j7726j7096p62K6783J7600
$$ 58576 67794 85766 83121 72127 73004 82661 70343 34990 17264 168 -594 26189 43789
6859D3789l2481j3726l1415k0153K2135K9611Q420K476J5449J3116J1140J5641
$$ 43789 11308 -2418 -33833 -53986 -31851 -2240 6180 8656 24105 37221 48361 64002
6847F4002m41J119j9289m5060k2179K0713k1062m5117L526K0258j171J0186J7308
$$ 64002 63561 64680 45391 331 -21848 -1135 -22197 -67314 -63788 -43530 -44701 -34515 -17207
6834a7207m64J948O0127J9443k1915L9838j2754l0793r561J3476K7416J8185K090
$$ -17207 -17671 -15723 44404 63847 41932 81770 69016 38223 28662 42138 69554 87739 89829
6821H9829l1282l5712j2018j8982k2471K5275J6475P027k984J682j405j7844j2686
$$ 89829 58547 22835 10817 -8165 -30636 -5361 11114 18141 15157 16839 15434 -2410 -15096
6808a5096n75K4528J9254r766k802K3303K47k0549o00K7952J0381j907n995j5163
$$ -15096 -15671 8857 28111 18345 15543 38846 39093 18544 17944 45896 56277 54370 48375 33212
6794C3212m1427j9182K4960J5467j7477j1993k1302K7140K3282M011J3151o331
$$ 33212 -8215 -27397 -2437 13030 -4447 -16440 -37742 -10602 12680 16691 29842 23511
6782B3511k0157k6877n316m525j2074l1990Q872L1262P037O439L1003j418k2992
$$ 23511 3354 -23523 -28839 -33364 -45438 -77428 -68556 -37294 -30257 -23818 7185 5767 -17225
6769a7225M278J0588j2861J2144K6866m717n8499J1606L2523K7561L5024J7227
$$ -17225 -12947 -2359 -15220 -3076 23790 19073 -39426 -27820 4703 32264 67288 84515
6757H4515M4895R7428J35933P3167m1139n3823n0602n9361o5094l8588j4783k3806
$$ 84515 129410 226838 362771 435938 394799 340976 290374 231013 165919 127331 112548 88742
6745H8742k889j1211L372n288P518j6993j1696k3262r312K9537Q988o211N736
$$ 88742 85853 74642 78014 72726 80244 63251 51555 28293 18981 48518 57506 51295 57031
6732E7031J7092K0014K2220K1538j2992r948l3784l7250j0953J90j2416k1294
$$ 57031 74123 94137 116357 137895 124903 114955 81171 43921 32968 33158 20742 -552
6720e52r196K0654J7334K1551N992l0350J1071o072l7141k3750J9610L1257J0203
$$ -552 -9748 10906 28240 49791 55783 25433 36504 30432 -6709 -30459 -10849 20408 30611
6707C0611m170N336o112R511J2502k9891j1540J7577k038j3185J2565n468p121
$$ 30611 26441 31777 25665 35176 47678 17787 6247 23824 21786 8601 21166 15698 8577
6694H577J7777Q086k6246j5159K0335J4437j2148k8851o441O216q529j4233J9360
$$ 8577 26354 34440 8194 -6965 13370 27807 15659 -13192 -19633 -13417 -21946 -36179 -16819
6681a6819O358l850J0000J528k0629l918j4015K812n63j5044q80K9833K5076J6368
$$ -16819 -10461 -14311 -4311 -2783 -23412 -27330 -41345 -38533 -39096 -54140 -55020 -25187 -111 16257
6667A6257n761j5164j5027n220Q108j0739L2520K5560k1354j9340j521J495r459
$$ 16257 10496 -4668 -19695 -24915 -16807 -27546 4974 30534 9180 -10160 -11681 -10186 -19645
6654a9645k429K3102j1180j8824q488J0175j7996j9792M1312j2979l5766q955
$$ -19645 -22074 1028 -10152 -28976 -37464 -27289 -45285 -65077 -23765 -36744 -72510 -81465
6642h1465J6929N509k835p137M9812L7755k496R53L6743K0752r021j3655J5675
$$ -81465 -64536 -59027 -61862 -68999 -19187 18568 16072 17025 53768 74520 65499 51844 67519
6629F7519k5188J739k3669m3133O936J0610J0535l6844q922Q825n402J2548J4072
$$ 67519 42331 44070 20401 -22732 -15796 -5186 5349 -31495 -40417 -31592 -36994 -24446 -10374
6616a0374J852k1819l4076j5505R820j6234J7564K6739L6990J7105M237j8477
$$ -10374 -8522 -30341 -64417 -79922 -70102 -86336 -68772 -42033 -5043 12062 16299 -2178
6604b178J982k934N798k9212j3902O871m110J9717K2965j748k7211K4285J5152
$$ -2178 -196 -3130 2668 -26544 -40446 -33575 -37685 -17968 4997 3249 -23962 323 15475
6591A5475K408l7673j5710K6781m8674l6271K8744L5447J5584n045L9288K3642
$$ 15475 17883 -19790 -35500 -8719 -57393 -93664 -64920 -29473 -13889 -18934 20354 43996
6579D3996j5565m9737j9179J8755K5166J6916j7223j7700J1284J5266r898j2925
$$ 43996 28431 -21306 -40485 -21730 3436 20352 3129 -14571 -3287 11979 2081 -10844
6567a0844j8244K74J2155k796L1690P359l2978j9450K849N534L9380l948j497
$$ -10844 -29088 -28814 -16659 -19455 12235 19594 -13384 -32834 -29985 -24451 14929 10981 9484
6554I484R296L3924l928j5618k9355l026J0153N035N22M229N387j9541l3936k0714
$$ 9484 18780 52704 48776 33158 3803 777 10930 15965 16487 20716 26103 6562 -27374 -48088
6540d8088k9008K837O0902K8012p620J211m070m224k5831k2647j3650L0230K4932
$$ -48088 -77096 -74259 -13357 14655 7035 8246 4176 -48 -25879 -48526 -62176 -31946 -7014
6527g014k4445K4785O573J8605Q597K5311j3956q657j4182j0466j3746n703K7643
$$ -7014 -31459 -6674 -101 18504 27101 52412 38456 29799 15617 5151 -8595 -14298 13345
6514A3345Q29j9688j4413n523j0105K3670O764J3308m4848J1267K2502j3889j159
$$ 13345 14174 -5514 -19927 -25450 -35555 -11885 -5121 8187 -36661 -25394 -2892 -16781 -17940
6501a7940K9128P544k5851o518j4924K706O906J920J3779R729j7256j793J0425
$$ -17940 11188 18732 -7119 -13637 -28561 -25855 -18949 -17029 -3250 6479 -10777 -12570 -2145
6488b145k2018n624l953J376n538J2385l6414k1876K4187K0478O160N491J7765
$$ -2145 -24163 -29787 -33740 -32364 -37902 -25517 -61931 -83807 -59620 -39142 -32982 -27491 -9726
6475i726r127j9853R055Q978L733J6546K467J8909j9573k0613J2130J9264q11
$$ -9726 -18853 -38706 -29651 -20673 -16940 -394 2073 20982 1409 -19204 -7074 12190 11379
6462A1379j5981j4927J9697P241k3796J1112J0034j3065K666N906Q586O574K300
$$ 11379 -4602 -19529 168 7409 -16387 -5275 4759 -8306 -5640 266 8852 15426 17726
6449A7726p553J0517K1304n51q020J887R99j4967j5758m0398J6563R468N770J824
$$ 17726 10173 20690 41994 41443 33423 35310 36309 21342 5584 -34814 -18251 -8783 -3013 -1189
6435a189j5445j431m537k582Q952N524K1744O670j2019k0587K697J0411n970P857
$$ -1189 -16634 -18065 -22602 -25184 -16232 -10708 11036 17706 5687 -14900 -12203 -1792 -7762 95
6421I5k3983J0152K7723K5120J5362k564k310j0457l7262l0864L300J7324K3030
$$ 95 -23888 -13736 13987 39107 54469 51905 49595 39138 1876 -28988 -25688 -8364 14666
6408A4666p322K464l8036j5612k3935j0869L6427m84M581K0527j7048K5059L8387
$$ 14666 7344 9808 -28228 -43840 -67775 -78644 -42217 -42701 -38120 -17593 -34641 -9582 28805
6395B8805R023j3339r759j2004j1406P067r442j095K5374j4805J2548p018K844
$$ 28805 37828 24489 14730 2726 -8680 -1613 -11055 -12150 13224 -1581 10967 3949 6793
6382F793n036q554k542j6596n015N158J4607J4105J8833q189m7003k628q215L9280
$$ 6793 1757 -6797 -9339 -25935 -30950 -25792 -11185 2920 21753 13564 -33439 -36067 -44282 -5002
6368e002J2073k3066k9091K3020K1944l25j7966m0980K2920K8729K7551m962l175
$$ -5002 7071 -15995 -45086 -22066 -122 -447 -18413 -59393 -36473 -7744 19807 14845 11670
6355A1670m146L141j1569l425m920q642j5555k4252J2046J8248J694P85K9358
$$ 11670 7524 10665 -904 -4329 -9249 -17891 -33446 -57698 -45652 -27404 -25710 -24925 4433
6342D433j3884j3878M854K0569J098K1910J9R004o665j0120j3514l9114M170L6681
$$ 4433 -9451 -23329 -18475 2094 3192 25102 25121 34125 27460 17340 3826 -35288 -31118 5563
6328E563j37O786n869l1399l0061n134j819J7535K5187J8724l5558l1324L1363
$$ 5563 5426 12212 6343 -25056 -55117 -60251 -62070 -44535 -19348 -624 -36182 -67506 -36143
6315c6143K3329Q521j7496L12L1061q076j410j7223o388j5077N178k7601j4436
$$ -36143 -12814 -4293 -21789 -21477 9584 1508 98 -17125 -23513 -38590 -33412 -61013 -75449
6302g5449J9088K668J2468j3762J0364J4705J5240J699J2267l1240q935l728r028
$$ -75449 -56361 -53693 -41225 -54987 -44623 -29918 -14678 -12979 -712 -31952 -40887 -44615 -53643
6289e3643L8048L5485J4800k1378k0159j5355O726J4616j6379L7753N645m0658
$$ -53643 -15595 19890 34690 13312 -6847 -22202 -15476 -860 -17239 20514 26159 -14499
6277a4499l823l852J5703k2304N615P473r838R600J2857j5323r7J8723K4398J5892
$$ -14499 -18322 -22174 -6471 -28775 -23160 -15687 -25525 -15925 -3068 -18391 -18488 235 24633 40525
6263D0525k8167j1284j4653k2993m363K672P676K6705L5181R593j2563j3824R439
$$ 40525 12358 1074 -13579 -36572 -40935 -38263 -30587 -3882 31299 40892 28329 14505 23944
6250B3944P402k2977j485J3780j5607n276J1704P466l9453k9953p201j5688K4394
$$ 23944 31346 8369 6884 20664 5057 -219 11485 18951 -20502 -50455 -57656 -73344 -48950
6237d8950K1504N549K5003J5579K1509k0558j9132J2290j6595l0667P878K3116
$$ -48950 -27446 -21897 3106 18685 40194 19636 504 12794 -3801 -34468 -26590 -3474
6225c474N210j2244j0067l512J8934p61l014j7115j7672j011p508N992K8438O861
$$ -3474 1736 -10508 -20575 -24087 -5153 -5914 -8928 -26043 -43715 -44726 -52234 -46242 -17804 -10943
6211a0943n209l7098p016L8183N304l3402j3045m010J565J8515L737Q19K4756
$$ -10943 -16152 -53250 -60266 -22083 -16779 -50181 -63226 -67236 -65671 -47156 -43419 -42600 -17844
6198a7844N733l475L405r264K4678L3557j1623k8483J0034r23j1320j284k9483
$$ -17844 -12111 -15586 -12181 -21445 3233 36790 25167 -3316 6718 5795 -5525 -6809 -36292
6185c6292M09j8953r333L3598K3281j3483J1581J2864j7116j1429L3725R577p282
$$ -36292 -35883 -54836 -64169 -30571 -7290 -20773 -9192 3672 -13444 -24873 8852 18429 11147
6172A1147k7660p682j328Q165k3147j4950L692L7730K2121J5764j3464l4631J3507
$$ 11147 -16513 -24195 -25523 -17358 -40505 -55455 -51763 -14033 8088 23852 10388 -24243 -10736
6159a0736L0794N107j9404L861J2474n825k0896k9733P212M3537P958m719j7706
$$ -10736 20058 25165 5761 9622 22096 16271 -4625 -34358 -27146 16391 24349 19630 1924
6146A924k462K4854k5635r61J167n4692j5623L6077L0672K2788J5266p485k4472
$$ 1924 -538 24316 -1319 -2280 -1113 -55805 -71428 -35351 -4679 18109 33375 25890 1418
6133A418k4500O949K6003J3395p650l3517j4653J4542j1913j1064j9093J036P714
$$ 1418 -23082 -16133 9870 23265 15615 -17902 -32555 -18013 -29926 -40990 -60083 -59047 -51333
6120e1333j6784k772J8235L2338J2242R444N523L778m255K0092j3288l9713l2525
$$ -51333 -68117 -70889 -52654 -20316 -8074 1370 6893 10671 6416 26508 13220 -26493 -59018
6107e9018q583L6303J2413P716K8666J5337j4918Q456o81m480P817j4493p194
$$ -59018 -67601 -31298 -18885 -11169 17497 32834 17916 26372 25691 21211 29028 14535 7341
6094G341j6837L026M24P06Q748j5148j617L2137K0462j806j2735j3078K5055n258
$$ 7341 -9496 -6470 -6046 -5340 3408 -11740 -13357 18780 39242 37436 24701 11623 36678 31420
6080C1420O234j7939n490r752j0257k2161r717J2999M6207J6707m7690k4494M665
$$ 31420 37654 19715 14225 4473 -5784 -27945 -37662 -24663 21544 38251 -9439 -33933 -29268
6067b9268J4340P826K1415N174n713J0662J9638j061J0105l912l6792k4075K2809
$$ -29268 -14928 -7102 14313 19487 13774 24436 44074 43013 53118 49206 12414 -11661 11148
6054A1148M570l0993l208K2108J0586r381k8371J0870M486j2435q84J2069k9073
$$ 11148 15718 -15275 -18483 3625 14211 4830 -23541 -12671 -8185 -20620 -21504 -9435 -38508
6041c8508j6709K4494L7609K4250j4087J1445J6497l3689l3275J5715J5989p485
$$ -38508 -55217 -30723 6886 31136 17049 28494 44991 11302 -21973 -6258 9731 2246
6029B246O25L454M2428J1130j912r373l1329n563j1858j7236m4161Q477L826K3361
$$ 2246 2871 6325 48753 59883 57971 48598 17269 11706 -152 -17388 -61549 -53072 -49246 -25885
6015b5885K3153j16n01L020K9061O579k0035o598l4047K017K3047l325j5688k8538
$$ -25885 -2732 -2848 -3349 -329 28732 35311 15276 8678 -25369 -23352 -305 -3630 -19318 -47856
6001d7856J5146L3271j127l5169j5093J9813j7180Q000J7390r572J0446L899j2916
$$ -47856 -32710 561 -566 -35735 -50828 -31015 -48195 -40195 -22805 -32377 -21931 -18032 -30948
5988c0948r876J4990k2234j6781M0569M4544J1072o779r774k198L969P081r231
$$ -30948 -40824 -25834 -48068 -64849 -24280 20264 31336 24557 14783 12585 16554 23635 14404
5975A4404j7372J3249K1897j988j0764n794k2474m0077j6063j5493P913K1796
$$ 14404 -2968 10281 32178 30190 19426 13632 -8842 -48919 -64982 -80475 -72562 -50766
5963e0766k032j1644L4288j458j907j4326q713J7322J4246O296J2571L8990J4496
$$ -50766 -52798 -64442 -30154 -31612 -33519 -47845 -56558 -39236 -24990 -18694 -6123 32867 47363
5950D7363k315j859j4177o448l0647j1617J6111K8936l5152j4555J2542j5935
$$ 47363 45048 43189 29012 22564 -8083 -19700 -3589 25347 -9805 -24360 -11818 -27753
5938b7753N098l13q744r926j9236K5705J7973q4P557J7199P929L027Q634n613
$$ -27753 -22655 -22968 -31712 -41638 -60874 -35169 -17196 -17280 -9723 7476 15405 18432 27066 21453
5924B1453N148k2755j0296l058R200o408m8664m876K4814M636J1767J0024O722
$$ 21453 26601 3846 -6450 -9508 -308 -6716 -55380 -60256 -35442 -30806 -19039 -9015 -2293
5911b293k0849l2184P312K5238O166l4744J6973K5734J4464m197j6294N391J1238
$$ -2293 -23142 -55326 -48014 -22776 -16610 -51354 -34381 -8647 5817 1620 -14674 -9283 1955
5898A955j5941j2523J9115J0044j2400n396M503L6691m818j3415j723N348J7349
$$ 1955 -13986 -26509 -7394 2650 -9750 -15146 -10643 26048 21230 7815 6092 11440 28789
5885B8789j5611q012J4211j1674j791p264j5292k8090K795j3319J3062L1740K994
$$ 28789 13178 5166 19377 7703 5912 -1352 -16644 -44734 -41939 -55258 -42196 -10456 -7462
5872g462O91p617N827p379k3771p627j0750L5105J3293p544J3897k0622J0546
$$ -7462 -6771 -14388 -8561 -15940 -39711 -47338 -58088 -22983 -9690 -17234 -3337 -23959 -13413
5859a3413J0205J8203j4904P804m317l4664L3823J5724r287n767j7846k1507j2109
$$ -13413 -3208 14995 91 7895 3578 -31086 2737 18461 9174 3407 -14439 -35946 -48055
5846d8055L3963K866P594M709Q44J7888k1549R257L7842J7607k4845k2171q723
$$ -48055 -14092 -11226 -3632 1077 1921 19809 -1740 7517 45359 62966 38121 15950 7227
5833G227N24l8221j2566J6836J8707K1488l645l7235K1025L4114N156k5388k0427
$$ 7227 7751 -30470 -43036 -26200 -7493 13995 10350 -26885 -5860 28254 33410 8022 -12405
5820a2405J770L3458J1893l3385k9869R31J2768N05j3052q76j0261l796k164n164
$$ -12405 -10635 22823 34716 1331 -28538 -27607 -14839 -14334 -27386 -28262 -38523 -42319 -44483 -49647
5806d9647R482J2065N806k820K8620r648l632l123j634n346j7958j0098J4036
$$ -49647 -40165 -28100 -22294 -25114 3506 -6142 -9774 -12897 -14531 -19877 -37835 -47933 -33897
5793c3897J7614Q743k3674q908K5856K6767k8763N85N891j5940j905N275k0982
$$ -33897 -16283 -7540 -31214 -40122 -14266 12501 -16262 -15677 -9786 -25726 -27631 -22356 -43338
5780d3338O613o9J5886J7959j3104k8753J2726R494j7542o231K1838J4230J1142
$$ -43338 -36725 -36794 -20908 -2949 -16053 -44806 -32080 -22586 -40128 -46359 -24521 -10291 851
5767H51M686j0318J6846Q655r230j828P057O202J8765L515j9191j8635P348M318
$$ 851 5537 -4781 12065 20720 11490 9662 16719 22921 41686 45201 26010 7375 14723 19041
5753A9041m108k8149j4388j6805L9920k617j7892j0451j9652K3629J6575J4118
$$ 19041 14933 -13216 -27604 -44409 -4489 -7106 -24998 -35449 -55101 -31472 -14897 -779
5741g79K444J7636J3300K597k0207O443M668j3454k4114o629j6501J3895M0620
$$ -779 1665 19301 32601 35198 14991 21434 26102 12648 -11466 -18095 -34596 -20701 19919
5728A9919M712J3864r784k1926k9965N4458N006m2320l0981j0135l227J5320k06
$$ 19919 24631 38495 28711 6785 -23180 31278 36284 -6036 -37017 -47152 -50379 -35059 -35265
5715c5265K0008M5862K0077m012k6154k4332j992K1256k9387k7814K1436J667
$$ -35265 -15257 30605 50682 46670 20516 -3816 -5808 15448 -13939 -41753 -20317 -18650
5703a8650q346j4175Q307J9399K9025R037l9301j3954K034K3186J5146J5387k1594
$$ -18650 -26996 -41171 -32864 -13465 15560 24597 -14704 -28658 -26624 -3438 11708 27095 5501
5690E501N88k076J6416R002j9197k8608J3842j0019j3929J0898j096J6362J2091
$$ 5501 6089 4013 20429 29431 10234 -18374 -4532 -14551 -28480 -17582 -18678 -2316 9775
5677I775K750J3199Q000k9736j0108L864j4296q141N723L379j457k1855J0429
$$ 9775 12525 25724 33724 3988 -6120 -2256 -16552 -24693 -18970 -15591 -17048 -38903 -28474
5664b8474j0576N022J0213m110r275K8524k016k935J7713L0457M113k7047l6810
$$ -28474 -39050 -34028 -23815 -27925 -37200 -8676 -10692 -13627 4086 34543 38656 11609 -25201
5651b5201j6949o952K3966K9990j0312m6326J7497K3959M09j5976J4559M199j0518
$$ -25201 -42150 -49102 -25136 4854 -5458 -51784 -34287 -10328 -9919 -25895 -11336 -7137 -17655
5638a7655p22l929r840o459k062j3796k292L6527L2782j940j2014O122k708j3597
$$ -17655 -18377 -22306 -32146 -38605 -40667 -54463 -56755 -20228 12554 10614 -1400 4722 2014 -11583
5624a1583l832J09J2869K113k4052P864j5140K5183K2325L2153r339K483k6692
$$ -11583 -15415 -15306 -2437 -324 -24376 -16512 -31652 -6469 15856 48009 38670 41153 14461
5611A4461j1465K601K1636J9832j4502m1710K975r943J0674j4245m3668k6630
$$ 14461 2996 5597 27233 47065 32563 -9147 -6172 -16115 -5441 -19686 -63354 -89984
5599h9984J4407L3324j1754j5499N068m222L016K9503J4346j8770j138J5329J9052
$$ -89984 -75577 -42253 -54007 -69506 -64438 -68660 -65644 -36141 -21795 -40565 -41703 -26374 -7322
5586g322L6042J7847k2822k3885J7338m0840Q859L3911J4315l1347j3684L530
$$ -7322 28720 46567 23745 -140 17198 -23642 -14783 19128 33443 2096 -11588 -8058
5574h058k5167j9070N441J7196O20r637K5207K7065j9356K4462J0269O820o637
$$ -8058 -33225 -52295 -46854 -29658 -29038 -38675 -13468 13597 -5759 18703 28972 35792 29155
5561B9155n852M346j4545N641K067J9848k8580k4863P140J1734j0318k704j9454
$$ 29155 23303 27649 13104 18745 20812 40660 12080 -12783 -5643 6091 -4227 -6931 -26385
5548b6385j6530q006J3029K5995p794P429j252k576j2465K3731J3224K0830k1662
$$ -26385 -42915 -50921 -37892 -11897 -19691 -12262 -13514 -16090 -28555 -4824 8400 29230 7568
5535G568l7010k4077J7303K5928j3164j5596j4714L0730J4231j2528J5421J528
$$ 7568 -29442 -53519 -36216 -10288 -23452 -39048 -53762 -23032 -8801 -21329 -5908 -4380
5523d380N313p108K0136k316m215n0070j0923K187M713K6378j3840m0493J318
$$ -4380 933 -6175 13961 11645 7430 -42640 -53563 -51376 -46663 -20285 -34125 -74618 -73300
5510g3300K0136J9182N374K999K9269p134j983O6p400J0712N622K6168K2126l2747
$$ -73300 -53164 -33982 -28608 -25609 3660 -3474 -5457 -5391 -12791 -2079 3543 29711 51837 19090
5496A9090l0053j3506O410N815P276q76K7212J3571k3581k8579k1929J1818r940
$$ 19090 -10963 -24469 -18059 -12244 -4968 -5844 21368 34939 11358 -17221 -39150 -27332 -37272
5483c7272j4023k1057K3786K6506j4096m523K3320L772k5446O238M3493K9701
$$ -37272 -51295 -72352 -48566 -22060 -36156 -40679 -17359 -13587 -39033 -32795 10698 40399
5471D0399J0892n445j4641j3590j2958J9712Q065M337j9497o122j678k5510J5112
$$ 40399 51291 45846 31205 17615 4657 24369 32434 36771 17274 11152 9474 -16036 -924
5458i24J189R89J2866j1163j9429j0765K8351J9246J2445j8812j3589l740q968
$$ -924 265 1254 14120 2957 -16472 -27237 1114 20360 32805 13993 404 -3336 -12304
5445a2304p979k2294p115K3201K4970R655j7338l8593j4112R860J6378j3490N514
$$ -12304 -20283 -42577 -49692 -26491 -1521 8134 -9204 -47797 -61909 -52049 -35671 -49161 -43647
5432d3647Q991K968k5949n71J1815J169P667L0873L8838K6602M657j8483l0650
$$ -43647 -34656 -31688 -57637 -58208 -46393 -45224 -37557 -6684 32154 58756 63413 44930 14280
5419A4280l972j1107J1488P368l1188j8762j7881j2153k249L31M3803K3665l429
$$ 14280 10308 -799 10689 18057 -13131 -31893 -49774 -61927 -64176 -63845 -20042 3623 194
5406A94j730j3790j5302j2342L1784J2269J7474J2409j2969m894j8596j4799j0069
$$ 194 -1536 -15326 -30628 -42970 -11186 1083 18557 30966 17997 13103 -5493 -20292 -30361
5393c0361J5894O907j6331k075J9335K5377j4255l959L033K6607J1095J0600n3
$$ -30361 -14467 -7560 -23891 -25966 -6631 18746 4491 532 3565 30172 41267 51867 51814
5380E1814k2577k4752j860j4031l191q597J4941L945K9582M0794j807j7440l0992
$$ 51814 29237 4485 2625 -11406 -14597 -23194 -8253 -4308 25274 66068 64261 46821 15829
5367A5829l1279O611K2946j4305n678j7513K0575j7566j0314J7728J3553J5415
$$ 15829 -15450 -8839 14107 -198 -5876 -23389 -2814 -20380 -30694 -12966 587 16002
5355A6002m033k8122K38O0P026j5133j1827n22Q433K4656M8735J9636l8010l0939
$$ 16002 11969 -16153 -15915 -15855 -8829 -23962 -35789 -36311 -27878 -3222 45513 65149 27139 -3800
5341c800k2203j0564K0288J8006P382O263k3616m866J6940K217j1165j079m555
$$ -3800 -26003 -36567 -16279 1727 9109 15372 -8244 -13110 3830 6047 -5118 -6197 -10752
5328a0752j9249P980j9593M422J4223J7778J2434j0124p803P182J455K0939J4714
$$ -10752 -30001 -22021 -41614 -37192 -22969 -5191 7243 -2881 -10684 -3502 -2047 18892 33606
5315C3606J2027P979j7837j5003l944O321k3379L306J6148k1375k1327K5839J8152
$$ 33606 45633 53612 35775 20772 16828 23149 -230 3076 19224 -2151 -23478 2361 20513
5302B0513j0371j5216k774j3611o061J4874j4925l0467O570R553J6217J4198J2244
$$ 20513 10142 -5074 -7848 -21459 -27520 -12646 -27571 -58038 -51468 -41915 -25698 -11500 744
5289G44k7138p156L9054N011M837J4467k250j2419k2681j9264j6000K3267J2776
$$ 744 -26394 -33550 5504 10515 15352 29819 27569 15150 -7531 -26795 -42795 -19528 -6752
5276f752N032m640j1704J2812j408L062j4075k1745j5806j382O025K0510p629
$$ -6752 -1720 -6360 -18064 -5252 -6660 -3598 -17673 -39418 -55224 -56606 -50581 -30071 -37700
5263c7700j8332M711L7621l899j1951J6135J3487O134l6960l6054K0175K3846
$$ -37700 -56032 -51321 -13700 -17599 -29550 -13415 72 6206 -30754 -66808 -46633 -22787
5251b2787j490j6405Q058M4973L2775q806J2049j6687k0923L893q512J4967N82
$$ -22787 -24277 -40682 -32624 12349 45124 36318 48367 31680 10757 14650 6138 21105 21687
5238B1687J142K0992o821o17l1137k528R03j6872j5717K77J0390j3384K4335L0394
$$ 21687 22829 43821 37000 36383 5246 2718 3621 -13251 -28968 -28691 -18301 -31685 -7350 23044
5224B3044J3666j1581N209M3662J840k3080n4021l7381j2451L6031K9836J4787
$$ 23044 36710 25129 30338 74000 75840 52760 -1261 -38642 -51093 -15062 14774 29561
5212B9561j3812j1570l4203K3843M3931J324l3647J506L9817j9002j5119k5894
$$ 29561 15749 4179 -30024 -6181 37750 39074 5427 6933 46750 27748 12629 -13265
5200a3265O934K8325j3713j7290j047J0420p898r132p075O589N191k8884K800
$$ -13265 -6331 21994 8281 -9009 -10056 364 -7534 -16666 -23741 -17152 -11961 -40845 -38045
5187c8045r994j3338K0458n620l608J9450K6644k1141k1959l295K5810J3835Q767
$$ -38045 -48039 -61377 -40919 -46539 -50147 -30697 -4053 -25194 -47153 -50448 -24638 -10803 -2036
5174b036j3636j3494k454r460K799L0408K2013r195p036k2268J9414N5127J2448
$$ -2036 -15672 -29166 -31620 -41080 -38281 -7873 14140 4945 -2091 -24359 -4945 50182 62630
5161F2630j8043k4091k0775J4471n810j9459j2201J381K9722O451j0728o955J2903
$$ 62630 44587 20496 -279 14192 8382 -11077 -23278 -21897 7825 14276 3548 -3407 9496
5148I496m5420j6411K4923J9315J9462j1417N656N093Q153j9437n247j7072j3768
$$ 9496 -35924 -52335 -27412 -8097 11365 -52 5604 10697 18850 -587 -5834 -22906 -36674
5135c6674k6464L9722J6256Q121j9136l2139o124K3701M8757J5352j3566L8598
$$ -36674 -63138 -23416 -7160 961 -18175 -50314 -56438 -32737 16020 31372 17806 56404
5123E6404J7420m3247j9501j1226r874J4835J7787J5799k9351J550j0867j4947
$$ 56404 73824 30577 11076 -150 -10024 4811 22598 38397 9046 10596 -271 -15218
5111a5218N862R757j2911j4008J1716L1626m47L1284k0783p4524j3998J8868K3546
$$ -15218 -9356 401 -12510 -26518 -14802 16824 16377 47661 26878 -47646 -61644 -42776 -19230
5098a9230K3209j6229m3534K167K0409N271m597J9987L0881j7504J7688J1552
$$ -19230 3979 -12250 -55784 -53617 -33208 -27937 -32534 -12547 18334 830 18518 30070
5086C0070O946q362m0948k4785J5210K2129K7070o061k0271j7050J3257M224r581
$$ 30070 37016 28654 -12294 -37079 -21869 260 27330 21269 998 -16052 -2795 1429 -8152
5073h152o739r891Q291r370J9565J3697K0658o364p276p95Q305q913M544J9843
$$ -8152 -14891 -24782 -16491 -25861 -6296 7401 28059 21695 14419 13624 21929 13016 17560 37403
5059C7403n260l6821j1808Q228j378O820j9647p570o161o757j3824K4499J5705
$$ 37403 32143 -4678 -16486 -8258 -9636 -2816 -22463 -30033 -36194 -42951 -56775 -32276 -16571
5046a6571J5095o883k2459L3175K9875M721J7800N579l5578k2225j1924J0381
$$ -16571 -1476 -8359 -30818 2357 32232 36953 54753 60332 24754 2529 -9395 986
5034I86l7339j873j1185K5504K3599j6966j4022j8368M119J0936l5639k20L1842
$$ 986 -36353 -38226 -49411 -23907 -308 -17274 -31296 -49664 -45545 -34609 -70248 -70468 -38626
5021c8626M743o29K397J8680j4090Q087J0661j878k3017k7253J8236K0007K3294
$$ -38626 -33883 -34512 -32115 -13435 -27525 -19438 -8777 -10655 -33672 -60925 -42689 -22682 612
5008F12K0901j8766k4773m75j5919m220K7227R917r601q311r422J1040J5166R966
$$ 612 21513 2747 -22026 -22501 -38420 -42640 -15413 -5496 -15097 -23408 -32830 -21790 -6624 3342
4994C342j1276o705P004K2947m043j3391p16P104n256R360J0274K3392P2j8894
$$ 3342 -7934 -14639 -7635 15312 11269 -2122 -2838 4266 -990 8370 18644 42036 42108 23214
4980B3214K074k2192k9204j2445l755O164J5517M101K0239J9690p239m1880k5377
$$ 23214 25288 3096 -26108 -38553 -42308 -36144 -20627 -16526 3713 23403 16164 -25716 -51093
4967e1093J9683M0278J5843l701j721n1842j9013J6181K7535P836R596n362M66
$$ -51093 -31410 8868 24711 21010 19289 -32553 -51566 -35385 -7850 -14 9582 4220 4686
4954D686L5381K1147k868K498k6808j0986j4735K1834l05k0347j6872J4576R505
$$ 4686 40067 61214 58346 60844 34036 23050 8315 30149 29844 9497 -7375 7201 16706
4941A6706j6254n096Q562k1858j6395q26L8302L8778j7158q408j3858l1744k584
$$ 16706 452 -4644 3918 -17940 -34335 -35161 3141 41919 24761 16353 2495 -29249 -31833
4928c1833J0361l350J2960k1718j3985R994j3095K9545K1840j2222O677q943L3213
$$ -31833 -21472 -24822 -11862 -33580 -47565 -37571 -50666 -21121 719 -11503 -4826 -13769 19444
4915A9444k639j6117K5645q729j1783j1266k5005J0093q077k4320K2533L2731
$$ 19444 16805 688 26333 17604 5821 -5445 -30450 -20357 -28434 -52754 -30221 2510
4903B510K1563l1800k2974J6358j744p666J9660L19K324j0016K0588O277l985
$$ 2510 24073 -7727 -30701 -14343 -16087 -23753 -4093 -3774 -1450 -11466 9122 15399 11414
4890A1414J2214J935l5215j4506r505m694N906J674J6331K577M146k8035l6853
$$ 11414 23628 25563 -9652 -24158 -33663 -38357 -32451 -30777 -14446 -11869 -7723 -35758 -72611
4877g2611K8847J2940n551M8415K8366J3805l8467l8316L277J5264R326J0962
$$ -72611 -43764 -30824 -36375 12040 40406 54211 15744 -22572 -19295 -4031 5295 16257
4865A6257l0650j8641J5478P981j7636L7065j7649j0018l469K400M622K1746j2461
$$ 16257 -14393 -33034 -17556 -9575 -27211 9854 -7795 -17813 -21282 -18882 -14260 7486 -4975
4852d975k2515j0026n076R887m029n766J2603K307l705J7809M17k8412J59L1220
$$ -4975 -27490 -37516 -42592 -32705 -36734 -42500 -29897 -27590 -31295 -13486 -13069 -41481 -41322 -10102
4838a0102K7136R27k0314o510M73N444K6956L4999m277o977k8275k5508L7632
$$ -10102 17034 17961 -2353 -8863 -8390 -2946 24010 59009 54732 47755 19480 -6028 31604
4825C1604N152k3662Q935p398K044O509k4368k0660r186J4314p593J48l1658k022
$$ 31604 36756 13094 22029 14631 16675 23184 -1184 -21844 -31030 -16716 -24309 -24161 -55819 -57841
4811e7841K5430Q739l185p341J8120K5926K6141K3614k6694j4640q563m580l7370
$$ -57841 -32411 -23672 -26857 -34198 -16078 9848 35989 59603 32909 18269 9706 5126 -32244
4798c2244j465k2227O81K6376R126Q357n83k8742j3648K2048K0148k186j4441
$$ -32244 -33709 -55936 -55255 -28879 -19753 -11396 -11979 -40721 -54369 -32321 -12173 -14359 -28800
4785b8800j6807J1594L3150k5528j0260J3673J4873n120j2733j2541R384j3340
$$ -28800 -45607 -34013 -863 -26391 -36651 -22978 -8105 -13225 -25958 -38499 -29115 -42455
4773d2455q61L9084M3435R516j4985J767j9406l655o169q431M314L961l7776l0914
$$ -42455 -43316 -4232 39203 48719 33734 35501 16095 12440 6271 -2160 2154 6115 -31661 -62575
4759f2575J0944L0724K9518k736l2776J099O122j255M0857Q485j983k2412j1615
$$ -62575 -51631 -20907 8611 5875 -26901 -25802 -19680 -20935 19922 28407 26424 4012 -7603
4746g603P611l0862K3757L3097K6513P676k2309l863J8556R691k8584l9328j5283
$$ -7603 8 -30854 -7097 26000 52513 60189 37880 34017 52573 62264 33680 -5648 -20931
4733b0931M58P261N123K69j2776j9632J8890j703J5438L512k353l1464p332o586
$$ -20931 -20473 -13212 -8089 -7820 -20596 -40228 -21338 -23041 -7603 -4091 -6444 -37908 -45240 -51826
4719e1826P12M847R581L0441K3089J4164j4129l0119k8665j2010j048N987k775
$$ -51826 -51114 -46267 -36686 -6245 16844 31008 16879 -13240 -41905 -53915 -54963 -48976 -51751
4706e1751O58q865K1657M4826K515j7309j2j1979Q656J5278J492j7639J4173J785
$$ -51751 -51093 -59958 -38301 6525 9040 -8269 -8281 -20260 -11604 3674 5166 -12473 1700 3485
4692C485J5364J4247J6427j714k1628m5966k8186m92K0688L5892J4004r66j9800
$$ 3485 18849 33096 49523 47809 26181 -19785 -47971 -48463 -27775 8117 22121 21155 1355
4679A355O711K2414k3069o143o511M706J665K4640P401K459p602q055K1611k1969
$$ 1355 8066 30480 7411 1268 -5243 -537 1128 25768 33169 35628 28026 19971 41582 19613
4665A9613n8051M426K3653j3139N718J3955J7286K3270j6521j2159K8723o52l5271
$$ 19613 -38438 -34012 -10359 -23498 -17780 -3825 13461 36731 20210 8051 36774 36122 851
4652H51m3925J0323P552j0803l4132j0865L1647J1764J5680J1503l69j6095j2153
$$ 851 -43074 -32751 -25199 -36002 -70134 -80999 -49352 -37588 -21908 -10405 -10774 -26869 -39022
4639c9022O874J484M4530K6842L760j7591k0773n292j2658K0465K8925J2345m2090
$$ -39022 -32148 -30664 13866 40708 44468 26877 6104 812 -11846 8619 37544 49889 7799
4626G799k6018J3472N968J909j1962N233j20M925J3558J5426k850k8435j5250
$$ 7799 -18219 -4747 1221 3130 -8832 -3599 -3719 1206 14764 30190 27340 -1095 -16345
4613a6345j0752J017p909J0778k2204j6114J6758M7007K3361j3757j1751J4940
$$ -16345 -27097 -26080 -33989 -23211 -45415 -61529 -44771 2236 25597 11840 89 15029
4601A5029j3955k430K5155m294m0644q557n508P805l318L1258J1779k1633J7246
$$ 15029 1074 -1356 23799 19505 -21139 -29696 -35204 -27399 -30717 541 12320 -9313 7933
4588G933J7399j4477K136j2459O331j582J9251O925M809k8931l3960J2646R505
$$ 7933 25332 10855 12991 532 6863 5281 24532 31457 36266 7335 -26625 -13979 -4474
4575d474K7552P596P079l7537l1659q211M0790K9404q554r91l483r912L469J6002
$$ -4474 23078 30674 37753 216 -31443 -39654 1136 30540 21986 20995 17512 7600 11069 27071
4561B7071r207j1933j1373j7059L010P328p906l837K8300k0841l0632j0163o882
$$ 27071 17864 5931 -5442 -22501 -19491 -12163 -20069 -23906 4394 -16447 -47079 -57242 -64124
4548f4124L1783J1092k806J7720N6L780p966k4491Q84N851q456K2196j2695L1728
$$ -64124 -32341 -21249 -24055 -6335 -6279 -2499 -10465 -34956 -34072 -28221 -36677 -14481 -27176 4552
$$ [...]
##END NTUPLES=NMR SPECTRUM
##END=
