##TITLE=Analysis number 314892
Compound Code cc 48009
Book Reference 458/48
Project Code adrs
Chemist Name stevem
##JCAMPDX= 6.0         $$ Bruker NMR JCAMP-DX V2.0
##DATA TYPE= NMR SPECTRUM
##DATA CLASS= NTUPLES
##ORIGIN= Bruker BioSpin GmbH
##OWNER= NMR
$$ XWIN-NMR		Version 3.5
$$ Mon Oct 31 09:00:34 2005 GMT Standard Time (UT+0h)  MAYBRIDGE\NMR@NMR_250MHZ
##.OBSERVE FREQUENCY= 250.131544655141
##.OBSERVE NUCLEUS= ^1H
##.ACQUISITION MODE= SIMULTANEOUS (DQD)
##.ACQUISITION SCHEME= undefined
##.AVERAGES= 16
##.DIGITISER RES= 18
##SPECTROMETER/DATA SYSTEM= dpx250
##.PULSE SEQUENCE= zg30
##.SOLVENT NAME= CDCl3
##.SHIFT REFERENCE= (INTERNAL, CDCl3, 0, 16.4537)
##AUDIT TRAIL= $$ (NUMBER, WHEN, WHO, WHERE, WHAT)
$$ ##TITLE= Audit trail, XWIN-NMR		Version 3.5
$$ ##JCAMPDX= 5.01
$$ ##ORIGIN= Bruker BioSpin GmbH
$$ ##OWNER= NMR
$$ C:\u/data/dgb/nmr/ADRS/11600/pdata/1/auditp.txt
$$ ##AUDIT TRAIL=  $$ (NUMBER, WHEN, WHO, WHERE, WHAT)
(   1,<2005-10-31 08:59:59.99 +000>,<MAYBRIDGE\NMR>,<NMR_250MHZ>,
      <created by zg, POWCHK disabled, PULCHK disabled
       configuration hash MD5:
       62 19 C7 07 E1 42 D1 B7 37 6C 3D D0 77 39 F9 E6
       data hash MD5: 64K
       47 74 5A E7 A7 C6 7C 4B 9A 9C D5 80 9B 5F CA A1>)
(   2,<2005-10-31 09:00:15.05 +000>,<MAYBRIDGE\NMR>,<NMR_250MHZ>,
      <Start of raw data processing
       ef LB = 0.3 FT_mod = 6 PKNL = 1 SI = 32K 
       data hash MD5: 32K
       8B 26 94 14 DC 0C 15 79 D0 8B 63 1D 23 CC EB 44>)
(   3,<2005-10-31 09:00:20.36 +000>,<MAYBRIDGE\NMR>,<NMR_250MHZ>,
      <apk 
       data hash MD5: 32K
       66 89 28 A8 4E B9 D3 16 3D DF 66 C4 5A AE CB 3E>)
(   4,<2005-10-31 09:00:21.91 +000>,<MAYBRIDGE\NMR>,<NMR_250MHZ>,
      <abs ABSG = 5 
       data hash MD5: 32K
       59 68 85 91 08 72 22 26 04 77 0E AE BC 72 F5 B0>)
$$ ##END=
$$ 
$$ hash MD5
$$ A3 88 F9 CD 86 48 F1 A5 6B 1A ED 38 4D 56 29 48
##$RELAX= 
##$RELAX= 
##$RELAX= 
##$RELAX= 
##$RELAX= 
##$RELAX= 
##$RELAX= 
$$ Bruker specific parameters
$$ --------------------------
##$DU= <C:\u>
##$EXPNO= 11600
##$NAME= <ADRS>
##$PROCNO= 1
##$TYPE= <nmr>
##$USER= <dgb>
##$AMP= (0..31)
100 100 100 100 100 100 100 100 100 100 100 100 100 100 100 100 100 100 
100 100 100 100 100 100 100 100 100 100 100 100 100 100 
##$AQSEQ= 0
##$AQ_mod= 3
##$AUNM= <au_zg>
##$AUTOPOS= <4 >
##$BF1= 250.13
##$BF2= 250.13
##$BF3= 250.13
##$BF4= 250.13
##$BF5= 500.13
##$BF6= 500.13
##$BF7= 500.13
##$BF8= 500.13
##$BYTORDA= 1
##$CFDGTYP= 0
##$CFRGTYP= 5
##$CHEMSTR= <none>
##$CNST= (0..31)
1 1 145 1 1 1 1 1 1 1 1 1 1 1 1 1 1 1 1 1 1 1 1 1 1 1 1 1 1 1 1 1 
##$CPDPRG= <>
##$CPDPRG1= <>
##$CPDPRG2= <>
##$CPDPRG3= <>
##$CPDPRG4= <mlev>
##$CPDPRG5= <mlev>
##$CPDPRG6= <mlev>
##$CPDPRG7= <mlev>
##$CPDPRG8= <mlev>
##$CPDPRGB= <>
##$CPDPRGT= <>
##$D= (0..31)
0 1 0 0 0 0 0 0 0 0.06 0 0 0 0 0 0 0.0002 0 0 0 0 0 0 0 0 0 0 0 0 0 0 
0 
##$DATE= 1130749198
##$DBL= (0..7)
120 120 120 120 120 120 120 120 
##$DBP= (0..7)
150 150 150 150 150 150 150 150 
##$DBP07= 0
##$DBPNAM0= <>
##$DBPNAM1= <>
$$ [...]
##$SUBNAM7= <"">
##$SUBNAM8= <"">
##$SUBNAM9= <"">
##$SW= 20.6930455092707
##$SWIBOX= (0..15)
0 0 3 0 0 0 0 0 0 0 0 0 0 0 0 0 
##$SW_h= 5175.983436853
##$TD= 65536
##$TD0= 1
##$TE= 295.16
##$TE2= 300
##$TE3= 300
##$TEG= 300
##$TL= (0..7)
0 120 120 120 120 120 120 120 
##$TP= (0..7)
150 150 150 150 150 150 150 150 
##$TP07= 0
##$TPNAME0= <>
##$TPNAME1= <>
##$TPNAME2= <>
##$TPNAME3= <>
##$TPNAME4= <>
##$TPNAME5= <>
##$TPNAME6= <>
##$TPNAME7= <>
##$TPOAL= (0..7)
0.5 0.5 0.5 0.5 0.5 0.5 0.5 0.5 
##$TPOFFS= (0..7)
0 0 0 0 0 0 0 0 
##$TUNHIN= 0
##$TUNHOUT= 0
##$TUNXOUT= 0
##$USERA1= <user>
##$USERA2= <user>
##$USERA3= <user>
##$USERA4= <user>
##$USERA5= <user>
##$V9= 5
##$VALIST= <valist>
##$VCLIST= <CCCCCCCCCCCCCCC>
##$VD= 0
##$VDLIST= <DDDDDDDDDDDDDDD>
##$VPLIST= <PPPPPPPPPPPPPPP>
##$VTLIST= <TTTTTTTTTTTTTTT>
##$WBST= 1024
##$WBSW= 4
##$XGAIN= (0..3)
0 0 0 0 
##$XL= 0
##$YL= 0
##$YMAX_a= 545909
##$YMIN_a= -525429
##$ZGOPTNS= <>
##$ZL1= 120
##$ZL2= 120
##$ZL3= 120
##$ZL4= 120
##$ABSF1= 16.45373
##$ABSF2= -4.239443
##$ABSG= 5
##$ABSL= 3
##$ALPHA= 0
##$AQORDER= 0
##$ASSFAC= 0
##$ASSFACI= 0
##$ASSFACX= 0
##$ASSWID= 0
##$AUNMP= <proc_1d>
##$AZFE= 0.1
##$AZFW= 0.1
##$BCFW= 0
##$BC_mod= 0
##$BYTORDP= 0
##$COROFFS= 0
##$CY= 12.5
##$DATMOD= 1
##$DC= 0
##$DFILT= <>
##$DTYPP= 0
##$F1P= 14.0000005364418
##$F2P= -0.99999901652339
##$FCOR= 0.5
##$FTSIZE= 32768
##$FT_mod= 6
##$GAMMA= 0
##$GB= 0
##$INTBC= 1
##$INTSCL= 1
##$ISEN= 128
##$LB= 0.3
##$LEV0= 0
##$LPBIN= 0
##$MAXI= 10000
##$MC2= 0
##$MEAN= 0
##$ME_mod= 0
##$MI= 0
##$NCOEF= 0
##$NC_proc= -3
##$NLEV= 6
##$NOISF1= 0
##$NOISF2= 0
##$NSP= 0
##$NTH_PI= 0
##$NZP= 0
##$OFFSET= 16.45373
##$PC= 1
##$PHC0= 75.44804
##$PHC1= 7.69575
##$PH_mod= 1
##$PKNL= yes
##$PPARMOD= 0
##$PSCAL= 4
##$PSIGN= 0
##$REVERSE= no
##$SF= 250.130017074365
##$SI= 32768
##$SIGF1= 0
##$SIGF2= 0
##$SINO= 400
##$SIOLD= 32768
##$SREGLST= <1H.CDCl3>
##$SSB= 0
##$STSI= 32768
##$STSR= 0
##$SW_p= 5175.98343685301
##$SYMM= 0
##$S_DEV= 0
##$TDeff= 65536
##$TDoff= 0
##$TI= <Analysis number 999999
Compound Code 99
Book Reference 9
Project Code 9>
##$TILT= no
##$TM1= 0
##$TM2= 0
##$TOPLEV= 0
##$USERP1= <user>
##$USERP2= <user>
##$USERP3= <user>
##$USERP4= <user>
##$USERP5= <user>
##$WDW= 1
##$XDIM= 32768
##$YMAX_p= 389365016
##$YMIN_p= -123529
$$ End of Bruker specific parameters
$$ ---------------------------------
##NTUPLES= NMR SPECTRUM
##VAR_NAME=  FREQUENCY,     SPECTRUM/REAL,   SPECTRUM/IMAG
##SYMBOL=    X,             R,               I
##VAR_TYPE=  INDEPENDENT,   DEPENDENT,       DEPENDENT
##VAR_FORM=  AFFN,          ASDF,            ASDF
##VAR_DIM=   32768,         32768,           32768
##UNITS=     HZ,            ARBITRARY UNITS, ARBITRARY UNITS
##FACTOR=    0.157963299565203, 1,           1
##FIRST=     4115.57167316797, 0,            0
##LAST=      -1060.41176368504, 0,           0
##MIN=       -1060.41176368504, -123529,     0
##MAX=       4115.57167316797, 389365016,    0
$$ Real data points
##PAGE= N=1
##DATA TABLE= (X++(R..R)), XYDATA
$$ [...]
$$ plain form
16428 3619 1746 -6022 -12220 -4938 -13706 -27951 -19385 -2143 16787 6754 784 -1270 -11332
16415 -11332 -20465 -18452 -13743 -24124 -37125 -36093 -31016 -13146 2111 -22053 -26748 -21379 -22661
16402 -22661 -14465 -14515 -24828 -19287 -19722 -41749 -37850 -19503 -1508 8407 219 -5338 -12626 -20173
16388 -20173 -7536 -8951 -14604 -11079 -19722 -37509 -20975 2510 1367 809 -6371 -792 1702 -6317
16374 -6317 319 5034 583 -3221 -11909 -29843 -24550 -16715 -21608 -45044 -45974 -34160 -45148 -31269
16360 -31269 -19895 -15346 -12566 -5465 -7436 -2322 -13642 -11460 -15117 -24658 -21575 -11237 7221
16347 7221 3722 -8401 -23009 -22881 -24136 -8502 1566 -3718 -9190 -18658 -20260 -25289 -25795 -27822
16333 -27822 -21267 -27441 -30582 -35210 -19811 -9921 264 9052 15029 20204 17587 -929 8689 21275
$$ packed form
16428C619j873p768o198P282q768j4245Q566J7242J8930j0033n970k054j0062
16415a1332r133K013M709j0381j3001J032N077J7870J5257k4164m695N369j282
16402b2661Q196n0j0313N541m35k2027L899J8347J7995R915q188n557p288p547
16388b0173J2637j415n653L525q643j7787J6534K3485j143n58p180N579K494q019
16374f317O636M715m451l804q688j7934N293P835m893k3436r30J1814j0988J3879
16360c1269J1374M549K780P101j971N114j1320K182l657r541L083J0338J8458
16347G221l499j2123j4608J28j255J5634J0068n284n472r468j602n029n06k027
16333b7822O555o174l141m628J5399R890J0185Q788N977N175k617j8516R618J2586
$$ plain form
16319 21275 12284 15303 7748 18848 26694 3657 3916 22335 14716 5242 -2933 11085 18285 -8499
16305 -8499 -26313 -23274 -16702 -6767 -6692 -885 -17486 -15201 7938 -12771 -9384 1388 -2680 4277
16291 4277 3310 -1636 -17628 -13560 -5002 1076 -9135 -16805 -29935 -25904 -23025 -23186 -11528 -12430
16277 -12430 -12828 -5400 -5067 -9134 -20952 -29002 -28543 -23546 -18767 -14962 -20808 -24435 -21918 -31460 -51447
16262 -51447 -47112 -31126 -25879 -18781 -9054 -12001 -17845 -32141 -37762 -26154 -245 15305 16267
16249 16267 3339 -9467 -13778 -999 6489 9285 11191 38682 35770 25418 13605 -4751 -11575
16236 -11575 -4109 4543 2112 13380 20828 436 -9607 -11678 -11430 -5585 -4676 5268 17630 19766
16222 19766 -1259 -8859 2763 -8898 -22279 -33217 -35923 -14597 -518 -18698 -28321 -22838
$$ packed form
16319B1275q991L019p555J1100P846k3037K59J8419p619r474q175J4018P200k6784
16305h499j7814L039O572R935P5N807j6601K285K3139k0709L387J0772m068O957
16291D277r67m946j5992M068Q558O078j0211p670j3130M031K879j61J1658r02
16277a2430l98P428L33m067j1818q050M59M997M779L805n846l627K517r542j9987
16262e1447M335J5986N247P098R727k947n844j4296n621J1608K5909J5550R62
16249A6267j2928j2806m311J2779P488K796J906K7491k912j0352j1813j8356o824
16236a1575P466Q652k431J1268P448k0392j0043k071K48N845R09R944J2362K136
16222A9766k1025p600J1622j1661j3381j0938k706K1326J4079j8180r623N483
$$ plain form
16210 -22838 -23040 -15293 -821 -5686 -7500 4174 9853 16097 -689 -16120 -17195 -13076 -19646 -26100
16196 -26100 -6505 4706 8481 10009 -1398 -24760 -40107 -31412 -19298 -24605 -15358 -31346 -36551
16183 -36551 -30967 -22570 -23456 -20297 -10957 -14307 -847 -4149 4976 6708 1821 -789 -1048 5982 18080
16168 18080 14953 8595 -1548 -7357 -1739 -9626 -13884 -15219 -33657 -13632 -12554 -5996 17922
16155 17922 26235 7139 -17312 -9953 -4163 4229 8715 6149 15033 11822 -9812 -21931 -17576
16142 -17576 -11468 -13 11934 2652 55 -8855 -20650 -31478 -32755 -25597 -22678 -21006 -30070
16129 -30070 -45633 -39263 -14085 4765 -5128 -11997 -19907 -27266 -34189 -35754 -36919 -40349 -33765 -25723
16115 -25723 -20499 -16406 -22677 -30300 -35465 -23763 -12814 -6141 -5547 -9148 -18514 -28861 -10673 -4624
$$ packed form
16210b2838k02P747J4472m865j814J1674N679O244j6786j5431j075M119o570o454
16196b6100J9595J1211L775J528j1407k3362j5347Q695J2114n307R247j5988n205
16183c6551N584Q397q86L159R340l350J3460l302R125J732m887k610k59P030J2098
16168A8080l127o358j0143n809N618p887m258j335j8438K0025J078O558K3918
16155A7922Q313j9096k4451P359N790Q392M486k566Q884l211k1634j2119M355
16142a7576O108J1455J1947r282k597q910j1795j0828j277P158K919J672r064
16129c0070j5563O370K5178J8850r893o869p910p359o923j565j165l430O584Q042
16115b5723N224M093o271p623n165J1702J0949O673N94l601r366j0347J8188O049
$$ plain form
16101 -4624 4473 23627 28316 23339 26778 27976 21327 20484 37097 47290 57810 59884 44849 48883
16087 48883 41612 34003 24210 24530 18896 14581 9760 4213 -31879 -48512 -43437 -33072 -45350 -62378
16073 -62378 -55066 -49305 -37489 -24515 -7673 -15687 -18464 -1707 3944 -6060 -15978 -10676 -1472
16060 -1472 -13889 -25208 -13841 -11337 -14351 -15746 -9376 1046 7456 17085 14918 1179 -3183
16047 -3183 1342 5824 -10357 -15047 -9347 -36890 -50028 -44911 -35172 -27461 -32714 -31969 -4294 -5664
16033 -5664 -16627 -31866 -18794 -2992 -4546 7252 7387 2354 -12402 -19980 -10145 -19191 -43937
16020 -43937 -63542 -42680 -29269 -31714 -23073 6016 -1261 -906 1746 -2442 -20334 -44026 -49834
16007 -49834 -51084 -46539 -40059 -20364 -12804 -23210 -27415 -41555 -42016 -52700 -52682 -41250 -38376 -41297
$$ packed form
16101d624R097J9154M689m977L439J198o649q43J6613J0193J0520K074j5035M034
16087D8883p271p609r793L20n634m315m821n547l6092j6633N075J0365j2278j7028
16073f2378P312N761J1816J2974J6842q014k777J6757N651j0004r918N302R204
16060a472j2417j1319J1367K504l014j395O370J0422O410R629k167j3739m362
16047c183M525M482j6181m690N700k7543j3138N117R739P711n253P45K7675j370
16033e664j0963j5239J3072J5802j554J1798J35n033j4756p578R835r046k4746
16020d3937j9605K0862J3411k445Q641K9089p277L55K652m188j7892k3692n808
16007d9834j250M545O480J9695P560j0406m205j4140m61j0684J8J1432K874k921
$$ plain form
15993 -41297 -17964 -11446 -24449 -33085 -17782 -17421 -10486 -2296 -4406 -7508 -3114 4423 14050 -3797
15979 -3797 -8745 -6196 -15109 -16791 3171 4073 -23678 -9026 4119 4959 3323 -16978 -35212 -38701
15965 -38701 -39014 -49878 -39892 -47040 -46775 -28735 -34130 -34425 -25377 -22339 -11641 -18138 -25382 -12680
15951 -12680 -23719 -19683 -31741 -23847 -14343 -919 9071 3416 -1064 -7603 -6560 -1962 -9305 -4796
15937 -4796 -572 -384 -9454 -13162 9389 12032 12936 22429 30767 30848 27824 18824 25806 12637 3167
15922 3167 -5400 -1176 -2427 -24962 -26592 -28671 -23482 -22872 -27136 -33234 -28542 -11144 6206 10347
15908 10347 8874 -9802 -18217 -11824 4847 8620 -1448 -5678 -17519 -29435 -25779 -26565 -31802
15895 -31802 -31861 -15194 -1233 -5110 -15181 -4934 -8624 -28338 -27462 -12645 -14871 -10155 -8690 6433
$$ packed form
15993d1297K3333O518j3003q636J5303L61O935Q190k110l102M394P537R627j7847
15979c797m948K549q913j682J9962R02k7751J4652J3145Q40j636k0301j8234l489
15965c8701l13j0864R986p148K65J8040n395k95R048L038J0698o497p244J2702
15951a2680j1039M036j2058P894R504J3424R990n655m480o539J043M598p343M509
15937d796M224J88r070l708K2551K643R04R493Q338Q1l024r000O982j3169r470
15922C167q567M224j251k2535j630k079N189O10m264o098M692J7398J7350M141
15908A0347j473j8676q415O393J6671L773j0068m230j1841j1916L656p86n237
15895c1802n9J6667J3961l877j0071J0247l690j9714Q76J4817k226M716J465J5123
$$ plain form
15881 6433 9745 4099 8165 -5448 -39504 -43133 -33417 -22042 -7804 -9735 -20278 -8056 -2451
15868 -2451 3783 1334 9495 7034 2509 -19468 -42819 -32061 -28087 -45707 -42304 -25840 -1085
15855 -1085 875 -2798 -6433 2900 2395 838 -15414 -32432 -38971 -40454 -38087 -31450 -35375 -34650 -26240
15840 -26240 -9458 -14758 -14198 -9490 -6942 2568 11131 -2456 8432 12699 3665 1705 -12400 -15545
15826 -15545 -9891 -6019 8824 14766 6715 5625 8465 18137 8991 921 14297 25647 1963
15813 1963 4103 7432 11950 23049 12505 -15895 -27445 -18978 -16562 -10739 -13630 -16933 -25727 -15570
15799 -15570 -19845 -16412 -6747 -15101 -15917 -11419 -12318 -10228 -2826 -1371 1352 6781 289 2879 3684
15784 3684 4834 11027 -387 -2485 7742 30926 30353 8964 5527 -10258 -8155 -23637 -35619
$$ packed form
15881F433L312n646M066j3613l4056l629R716J1375J4238j931j0543J2222N605
15868b451O234k449Q161k461m525k1977k3351J0758L974j7620L403J6464K4755
15855a085J960l673l635R333n05j557j6252j7018o539j483K367O637l925P25Q410
15840b6240J6782n300N60M708K548R510Q563j3587J0888M267r034j960j4105l145
15826a5545N654L872J4843N942q051j090K840R672r146q070J3376J1350k3684
15813A963K140L329M518J1099j0544k8400j1550Q467K416N823k891l303q794J0157
15799a5570m275L433R665q354q16M498q99K090P402J455K723N429o492K590Q05
15784C684J150O193j1414k098J0227K3184n73k1389l437j5785K103j5482j1982
$$ plain form
15771 -35619 -30795 -24300 -27616 -23022 -20521 -37236 -50130 -55440 -41646 -37084 -30840 -24791 -26501 -34815
15757 -34815 -37198 -32548 -15494 -5667 -8925 -5898 7503 16836 6988 -7272 -19236 -16523 881
15744 881 5683 -5953 -7076 -7484 -30604 -42420 -18039 10691 -4453 -29958 -41765 -49076 -40951
15731 -40951 -26107 -16996 -16270 -10637 -19940 -7776 -3555 -7492 -19411 -15712 -14650 -16854 -3575 772
15717 772 7472 -3662 -9129 -13825 -16696 -43574 -50182 -29717 4227 2947 -6116 -15376 -17520 -33672
15703 -33672 -27363 -15817 -20536 -11655 -18184 -41366 -55595 -50643 -34698 -33373 -28347 -17768 5519
15690 5519 18562 17161 12651 -4425 -17802 -28768 -31176 -21564 -16873 -17492 -24446 -13779 -2469
15677 -2469 -9716 -23554 -28902 -24413 -20299 -16194 -24048 -13343 -13578 -14212 3832 10689 4595 -10710
$$ packed form
15771c5619M824O495l316M594K501j6715j2894n310J3794M562O244O049j710q314
15757c4815k383M650J7054R827l258L027J3401R333r848j4260j1964K713J7404
15744H81M802j1636j123m08k3120j1816K4381K8730j5144k5505j1807p311Q125
15731d0951J4844R111P26N633r303J2164M221l937j1919L699J062k204J3279M347
15717G72O700j1134n467m696k871k6878o608K0465L3944j280r063r260k144j6152
15703c3672O309J1546m719Q881o529k3182j4229M952J5945J325N026J0579K3287
15690E519J3043j401m510j7076j3377j0966k408R612M691o19o954J0667J1310
15677b469p247j3838n348M489M114M105p854J0705k35o34J8044O857o094j5305
$$ plain form
15663 -10710 -25476 -10187 4935 12260 -1718 -16869 -19120 -23697 -16735 -2895 11841 20424 22775
15650 22775 20186 18121 39140 36031 24867 16961 19538 23694 25259 29310 29318 9223 -11364 -39026
15636 -39026 -23051 -13359 -24224 -16587 4566 2702 14685 18592 1264 -26797 -28632 -25106 -34874
15623 -34874 -20727 -18549 -35196 -42355 -14790 8386 -12822 -17897 -8788 -8240 15721 9447 12387
15610 12387 -1399 -17842 -2342 16402 24845 30740 36993 31433 11245 -19559 -22244 -16340 -8182
15597 -8182 -716 -1567 -10904 -12457 -11739 -14804 -21848 -15624 -10136 -6991 -30855 -51413 -38074 -31046
15583 -31046 -21914 3044 10045 29713 31857 25976 15391 -2487 -18132 -8565 -19201 -8058 -2488
15570 -2488 7728 -606 -17216 -3064 -4234 -21006 -39057 -32584 -16886 -35081 -59236 -74731
$$ packed form
15663a0710j4766J5289J5122P325j3978j5151k251m577O962J3840J4736Q583K351
15650B2775k589k065K1019l109j1164p906K577M156J565M051Qk0095k0587k7662
15636c9026J5975R692j0865P637K1153j864J1983L907j7328k8061j835L526r768
15623c4874J4147K178j6647p159K7565K3176k1208n075R109N48K3961o274K940
15610A2387j3786j6443J5500J8744Q443N895O253n560k0188l0804k685N904Q158
15597h182P466q51r337j553P18l065p044O224N488L145k3864k0558J3339P028
15583c1046R132K4958P001J9668K144n881j0585j7878j5645R567j0636J1143N570
15570b488J0216q334j6610J4152j170j6772j8051O473J5698j8195k4155j5495
$$ plain form
15558 -74731 -65535 -26258 -15236 -15462 -27947 -39152 -30708 -25957 -25712 -32053 -37769 -35056 -38949 -42882
15544 -42882 -20315 -1349 367 519 -6486 -14963 -30811 -31394 -21651 -21808 -18742 -16539 -17776 -27764
15530 -27764 -33108 -41045 -34331 -18915 -4199 -14280 -14747 7341 5627 -22022 -11436 1397 -12107
15517 -12107 -9056 -506 -8060 -3218 12651 10374 -6921 -14128 -14622 -4362 -8226 -20873 -17386 -18391
15503 -18391 -30824 -14873 -10550 -67 2369 8745 6955 9301 156 -27742 -51187 -33937 -28513
15490 -28513 -13369 -2092 10549 24481 10648 1621 -2869 -9074 4153 15056 26597 12354
15478 12354 -13790 -21996 -32238 -45720 -41309 -25366 -14691 -10960 -7363 -10735 -18373 -5429 -10521
15465 -10521 -13121 -1528 -9794 -25691 -39989 -32660 -36324 -25701 -9220 7739 19716 31564
$$ packed form
15558g4731R196L9277J1022k26j2485j1205Q444M751K45o341n716K713l893l933
15544d2882K2567J8966J716J52p005q477j5848n83R743j57L066K203j237r988
15530b7764n344p937O714J5416J4716j0081m67K2088j714k7649J0586J2833j3504
15517a2107L051Q550p554M842J5869k277j7295p207m94J0260l864j2647L487j005
15503a8391j2433J5951M323J0483K436O376j790K346r145k7898k3445J7250N424
15490b8513J5144J1277J2641J3932j3833r027m490o205J3227J0903J1541j4243
15478A2354k6144q206j0242j3482M411J5943J0675L731L597l372p638J2944n092
15465a0521k600J1593q266j5897j4298P329l664J0623J6481J6959J1977J1848
$$ plain form
15453 31564 18541 -4011 -16762 -10930 -22935 -29099 -150 10624 -5165 -4905 -9245 5927 12980
15440 12980 1316 2701 12181 -7566 -28624 -22169 -7689 -18239 -25812 -30244 -12756 9057 21277
15427 21277 13502 9928 21845 15865 5397 -3608 -8430 -3172 -12431 -12091 -19720 -5360 11535 -23535
15413 -23535 -32350 -9028 -8733 -16099 -33160 -26640 -17010 -5342 -3736 -1638 -15038 -25464 1394
15400 1394 -538 -2056 -3754 -9520 -1049 17091 16699 -7393 -27461 -4913 12670 14153 5709 -16564
15386 -16564 -23165 -16354 -8414 80 2973 -467 -930 -10574 -4215 8135 19402 29873 9377 -7604
15372 -7604 -8283 1585 -11170 -15379 -10943 -3156 2579 -1567 -18353 -15322 -17982 -37049 -45976 -26648
15358 -26648 -5117 -5380 -15124 -26596 -27098 -25255 -8908 17334 3862 -39211 -46181 -23173 -18451
$$ packed form
15453C1564j3023k2552j2751N832j2005o164K8949J0774j5789K60m340J5172P053
15440A2980j1664J385R480j9747k1058O455J4480j0550p573m432J7488K1813J2220
15427B1277p775l574J1917n980j0468r005m822N258r259L40p629J4360J6895l5070
15413b3535q815K3322K95p366j7061O520R630J1668J606K098j3400j0426K6858
15400A394j932j518j698n766Q471J8140l92k4092k0068K2548J7583J483q444k2273
15386a6564o601O811P940Q494K893l440m63r644O359J2350J1267J0471k0496j6981
15372g604o79R868j2755m209M436P787N735m146j6786L031k660j9067q927J9328
15358b6648K1531k63r744j1472n02J843J6347K6242j3472m3073o970K3008M722
$$ plain form
15345 -18451 -22400 -5223 1758 -9146 -19994 -20072 -30020 -26579 -22953 -24078 -11256 -9220 -9460 -29636
15331 -29636 -25893 -4229 -4600 -14135 -8660 -4619 -12534 -3773 6667 3994 -895 677 1914 11459
15317 11459 5824 -905 -18612 -28402 -13363 -6159 -4321 2937 6746 -2681 -15329 -10886 386
15304 386 18678 2465 2097 5160 -5783 4921 -15818 -29979 -30445 -10030 -8068 -5032 -5045 -4821
15290 -4821 -19296 -34527 -41640 -47430 -39617 -35813 -31342 -11844 -4743 -7216 -7945 -19821 -37585 -25852
15276 -25852 -4297 -4236 -1586 11704 3290 7705 14569 8318 9220 12981 22858 26806 4226 -10192
15262 -10192 -11172 4770 18751 11803 18433 8325 10575 11028 3006 2116 -7695 -17035 -16080 -1789
15248 -1789 12124 -8443 -11232 -22241 -20548 -16345 -16170 -1116 24845 34906 22509 15459 6573
$$ packed form
15345a8451l949J7177O981j0904j0848p8r948L441L626j125J2822K036k40k0176
15331b9636L743K1664l71r535N475M041p915Q761J0440k673m889J572J237R545
15317A1459n635o729j7707r790J5039P204J838P258L809r427j2648M443J1272
15304C86J8292j6213l68L063j0943J0704k0739j4161m66K0415J962L036j3K24
15290d821j4475j5231p113n790P813L804M471J9498P101k473p29j1876j7764J1733
15276b5852K1555O1K650J3290q414M415O864o251R02L761R877L948k2580j4418
15262a0192r80J5942J3981o948O630j0108K250M53q022q90r811r340R55J4291
15248a789J3913k0567k789j1009J693M203J75J5054K5961J0061j2397p050q886
$$ plain form
15235 6573 18147 20462 6645 3231 -23322 -46585 -43762 -31511 -35647 -23416 -20197 -7093 9236
15222 9236 11348 15426 1719 -25401 -53949 -41795 -42712 -21226 -2274 -5030 -274 -25892 -40793
15209 -40793 -50179 -31060 -9658 -15639 -24663 -13407 -11922 -18528 162 -8002 9102 16313 8636
15196 8636 -5283 -1424 -1006 7937 16560 17878 17793 14746 6565 12812 9974 -13445 -11988 3292 -15004
15181 -15004 -30903 -30014 -22524 2583 3503 -8628 -7330 -305 5060 14577 17887 -1274 6506 16988
15167 16988 8119 -2978 -3744 -6880 -9676 -1991 -13028 -37879 -36577 -35616 -20958 -13922 -16979 -7046
15153 -7046 14530 27446 10833 -449 -6184 6780 17685 32563 33196 19498 -7668 -4001 16978
15140 16978 8477 -1527 -3433 10144 9885 -487 -1244 -10180 -8532 11719 22948 12009 -11442
$$ packed form
15235F573J1574K315j3817l414k6553k3263K823J2251m136J2231L219J3104J6329
15222I236K112M078j3707k7120k8548J2154r17K1486J8952k756M756k5618j4901
15209d0793r386J9119K1402n981r024J1256J485o606J8690q164J7104P211p677
15196H636j3919L859M18Q943Q623J318q5l047q181O247k838k3419J457J5280j8296
15181a5004j5899Q89P490K5107R20j2131J298P025N365R517L310j9161P780J0482
15167A6988q869j1097p66l136k796P685j1037k4851J302R61J4658P036l057R933
15153g046K1576J2916j6613j1282n735J2964J0905J4878O33j3698k7166L667K0979
15140A6978q501j0004j906J3577k59j0372p57q936J648K0251J1229j0939k3451
$$ plain form
15127 -11442 -15205 -14178 -39680 -45534 -18744 -2664 1092 9770 6295 -3034 -12689 -10164 -7488 4628
15113 4628 15213 16672 10563 9772 -9254 -23706 -28515 -31006 -22825 -271 10037 -1758 6725
15100 6725 17604 18741 14251 4716 2652 -7555 -4138 3382 131 12014 15583 2538 -15969
15087 -15969 -21485 -6445 -3892 5212 -3676 -10344 -2446 -10066 -3785 -3276 -1808 -2860 -11767 -24509
15073 -24509 -33316 -43020 -37408 -33177 -31478 -26060 -19327 -38992 -46111 -39596 -34406 -17935 1306 -5534
15059 -5534 -3163 -8904 -34080 -33875 -25847 -10404 -8345 607 12828 5757 -6837 139 -3814 2769
15045 2769 -1259 -633 11603 22565 26461 12329 -19871 -37604 -49522 -42439 -23827 -13772 -4729
15032 -4729 -18374 -27081 3912 -7902 -8994 -8779 -2738 -318 3340 10852 6574 9090 13427 9074
$$ packed form
15127a1442l763J027k5502n854K6790J6080L756Q678l475r329r655K525K676J2116
15113D628J0585J459o109p91j9026j4452m809k491Q181K2554J0308j1795Q483
15100F725J0879J137m490r535k064j0207L417P520l251J1883L569j3045j8507
15087a5969n516J5040K553R104q888o668P898p620O281N09J468j052q907j2742
15073b4509q807r704N612M231J699N418O733j9665p119O515N190J6471J9241o840
15059e534K371n741k5176K05Q028J5443K059Q952J2221p071j2594O976l953O583
15045B769m028O26J2236J0962L896j4132l2200j7733j1918P083J8612J0055R043
15032d729j3645q707L0993j1814j092K15O041K420L658P512m278K516M337m353
$$ plain form
15018 9074 1670 15682 14752 20019 42242 49773 36260 42207 38542 33503 28822 43033 48599 35191
15004 35191 35758 45350 52996 72214 65937 50291 53037 62828 51686 52785 64145 89603 114133
14991 114133 157370 198011 278401 417077 651728 1099035 1831081 2618024 2975632 2687268
14981 2687268 2221657 1832696 1411107 961878 610355 406955 286986 214269 154182 126927
14971 126927 110049 102263 93376 61898 36807 22762 19919 23958 19411 16485 26588 33558 34678
14958 34678 1952 -16108 -7414 -5486 5814 -2176 -21810 -4509 2638 -14167 -11279 -4443 -10621
14945 -10621 -16864 -23193 -18427 -4374 -8855 -9677 -21004 -32394 -3257 10815 6670 -6619 -14271
14932 -14271 -13364 -1217 -8747 -11200 -506 15800 13371 -88 -11621 -7869 8056 -8791 -8371
$$ packed form
15018I074p404J4012r30N267K2223P531j3513N947l665n039m681J4211N566j3408
15004C5191N67R592P646J9218o277j5646K746R791j1142J099J1360K5458K4530
14991A14133M3237M0641Q0390J38676K34651M47307P32046P86943L57608k88364
14981B687268m65611l88961m21589m49229l51523k03400j19969p2717o0087k7255
14971A26927j6878p786q887l1478k5091j4045k843M039m547k926J0103O970J120
14958C4678l2726j8060Q694J928J1300p990j9634J7301P147j6805K888O836o178
14945a0621o243o329M766J4053m481q22j1327j1390K9137J4072m145j3289p652
14932a4271R07J2147p530k453J0694J6306k429j3459j1533L752J5925j6847M20
$$ plain form
14919 -8371 5084 11645 2042 -10119 -17778 5708 23353 32143 22893 16262 23777 15310 4428
14906 4428 -4797 -1828 6036 25110 33671 19479 -2363 -7584 -13353 -15820 -25100 -27652 -17164 -3476
14892 -3476 -4085 -9089 -9955 -9373 -11566 -18426 -12733 -22926 -40268 -37786 -29404 -18403 -17375 -7557 -8374
14877 -8374 -12538 -14140 -22483 -11117 9575 11494 1537 -28712 -26805 -10051 5625 1266 -9310
14864 -9310 -8009 -13206 -23666 -13998 -10555 -12373 -12813 -29784 -53019 -48334 -22644 -16584 -14606 -15887
14850 -15887 -15578 -14374 1664 5599 5753 444 18632 15803 -24232 -34228 -10705 -13390 -15440 -4718
14836 -4718 14229 14970 14617 3085 -11574 -24715 -20846 -7729 -10679 5900 20141 9761 8122
14823 8122 5394 3815 -18950 -8973 7493 10519 12580 14481 32030 35904 29582 980 -30193
$$ packed form
14919h371J3455O561r603j2161p659K3486J7645Q790r250o631P515q467j0882
14906D428r225K969P864J9074Q561j4192k1842n221n769k467r280k552J0488J3688
14892c476o09n004q66N82k193o860N693j0193j7342K482Q382J1001J028R818q17
14877h374m164j602q343J1366K0692J919r957l0249J907J6754J5676m359j0576
14864i310J301n197j0460R668L443j818m40j6971k3235M685K5690O060J978j281
14850a5887L09J204J6038L935J54n309J8188k829m0035r996K3523k685k050J0722
14836d718J8947P41l53j1532j4659j3141L869J3117k950J6579J4241j0380j639
14823H122k728j579k2765R977J6466L026K061J901J7549L874o322k8602l1173
$$ plain form
14810 -30193 -21451 10548 21830 -3541 -1912 7387 6404 3146 2615 -6073 -14481 -4357 6380 22893
14796 22893 21631 14358 -1739 -20627 -26625 -18584 -17620 -13659 -7592 3805 10046 1243 -10193 -34184
14782 -34184 -22527 -15820 -13859 -20129 -20687 -2711 5670 5540 17403 9244 -3572 -24680 -15393 6625
14768 6625 7143 2276 11899 29672 22034 4760 -11662 -29500 -23136 -4825 10130 7562 -8108
14755 -8108 -20952 -25702 -10164 -7163 -12472 -2773 -7007 -6450 -5853 -17234 -12210 -8309 2184 2196 2387
14740 2387 3483 17391 10436 -1782 8504 28177 31618 27117 26812 16539 33 -16202 -23075
14727 -23075 -13555 -1392 10428 -6781 -25279 -17634 -25640 -29151 -24682 -10896 -16574 -14264 13136
14714 13136 16926 14693 3719 5321 25688 23010 8628 -29400 -50695 -54466 -46978 -45936 -35211
$$ packed form
14810c0193Q742L1999J1282k5371J629R299r83l258n31q688q408J0124J0737J6513
14796B2893j262p273j6097j8888n998Q041R64L961O067J1397O241q803j1436k3991
14782c4184J1657O707J961o270n58J7976Q381j30J1863q159j2816k1108R287K2018
14768F625N18m867R623J7773p638j7274j6422j7838O364J8311J4955k568j5670
14755h108j2844m750J5538L001n309R699m234N57N97j1381N024L901J0493J2J91
14740B387J096J3908o955j2218J0286J9673L441m501l05j0273j6506j6235o873
14727b3075R520J2163J1820j7209j8498P645q006l511M469J3786n678K310K7400
14714A3136L790k233j0974J602K0367k678j4382l8028k1295l771P488J042J0725
$$ plain form
14701 -35211 -12240 -21371 -17148 -6554 5689 3426 -7764 -14435 -201 946 6149 -1938 -4084
14688 -4084 10261 22843 31229 25711 -4362 -7918 -7196 10909 153 6772 1355 -4153 -26430
14675 -26430 -42883 -19146 -18618 -27430 -8626 -2450 11991 23855 6374 -8611 -2887 4834 -7119
14662 -7119 -16631 2919 15313 13321 8838 -7400 -7788 -15499 -29561 -37049 -26867 -20602 -7161
14649 -7161 5258 -8765 -14546 -18558 -22140 -22095 -8826 2563 -3937 -15671 -10863 -12219 -13827 -18836
14635 -18836 -36748 -38310 -27213 -21166 -8149 -1396 -2464 6630 16938 2082 -20500 -19427 -20567
14622 -20567 -19854 -23400 -32227 -37386 -59012 -43153 -36534 -30055 -16876 -21030 -11851 -649 1466 10723
14608 10723 -10309 -4518 4682 9033 15500 20420 12289 -2420 -11037 21765 40949 30070 -1933
$$ packed form
14701c5211K2971r131M223J0594J2243k263j1190o671J4234J147N203q087k146
14688d084J4345J2582Q386n518l0073l556P22J8105j0756O619n417n508k2277
14675b6430j6453K3737N28q812J8804O176J4441J1864j7481j4985N724P721j1953
14662g119r512J9550J2394j992m483j6238l88p711j4062p488J0182O265J3441
14649g161J2419j4023n781m012l582M5J3269J1389o500j1734M808j356j608n009
14635a8836j7912j562J1097O047J3017O753j068R094J0308j4856k2582J073j140
14622b0567P13l546q827n159k1626J5859O619O479J3179m154R179J1202K115R257
14608A0723k1032N791R200M351O467M920q131j4709q617L2802J9184j0879l2003
$$ plain form
14595 -1933 -4225 -3158 10468 3292 4096 12294 -12293 -22043 -18687 -15751 -21394 -20799 -1674 3125
14581 3125 18649 -908 -35983 -31568 -12908 5323 1178 5158 11839 3874 10942 477 -20811
14568 -20811 -31845 -33812 -5282 10553 19280 11693 -13209 -15653 14121 7035 9902 15108 5568
14555 5568 10790 11068 24514 42472 36361 13045 -8624 -1672 12322 6504 -1603 -17006 -11398
14542 -11398 -9571 -11786 -1657 13676 10880 29601 18724 14077 37496 84535 85364 90176 98865
14529 98865 87864 83755 56808 33506 13995 8182 11664 8223 1832 3949 -1472 -3148 5413
14516 5413 20403 34651 29690 23953 11457 9501 9814 -1216 957 -7780 -23962 -16921 5614
14503 5614 1606 -2839 136 -2779 2607 9430 10402 6841 -4124 4243 15657 1328 -298 -9041
$$ packed form
14595a933k292J067J3626p176Q04Q198k4587r750L356K936n643N95J9125M799
14581C125J5524j9557l5075M415J8660J8231m145L980O681p965P068j0465k1288
14568b0811j1034j967K8530J5835Q727p587k4902k444K9774p086K867N206r540
14555E568N222K78J3446J7958o111k3316k1669O952J3994n818q107j5403N608
14542a1398J827k215J0129J5333k796J8721j0877m647K3419M7039Q29M812Q689
14529I8865j1001m109k6947k3302j9511n813L482l441o391K117n421j676Q561
14516E413J4990J4248m961n737j2496j956L13j1030K173q737j6182P041K2535
14503E614m008m445K975k915N386O823R72l561j0965Q367J1414j4329j626q743
$$ plain form
14489 -9041 -27007 -16438 -8209 -10298 -18220 -6214 -20137 -32276 -29458 -12508 3050 -321 -10152
14476 -10152 -16125 -2772 3520 -1987 21715 19488 -1224 -27627 -27894 -4255 11865 18789 18558
14463 18558 13977 370 -14192 -19553 -15791 -7060 -3240 -890 -12708 -12639 -8737 -12493 -18377 -23196
14449 -23196 -18658 -9961 -3517 -11449 -21706 -1438 -9671 -9889 19626 20410 21688 23627 25943 16484
14435 16484 17011 4572 3077 5790 -2110 -15644 -10344 18582 16830 -9550 -16892 -13855 10375
14422 10375 27594 24543 9490 9858 28580 45814 30560 5451 -7556 7127 24419 35487
14410 35487 39781 25819 15135 23828 20563 16559 2612 -4505 -7400 7281 5210 11947 13531
14397 13531 29147 49749 45272 31029 38551 44649 26034 2892 -253 3420 11800 17831 35226
$$ packed form
14489i041j7966J0569Q229k089p922J2006j3923j2139K818J6950J5558l371r831
14476a0152n973J3353O292n507K3702k227k0712k6403k67K3639J6120O924k31
14463A8558m581j3607j4562n361L762Q731L820K350j1818O9L902l756n884m819
14449b3196M538Q697O444p932j0257K0268q233k18K9515P84J278J939K316r459
14435A6484N27j2439j495K713p900j3534N300K8926j752k6380p342L037K4230
14422A0375J7219l051j5053L68J8722J7234j5254k5109j3007J4683J7292J1068
14410C5487M294j3962j0684Q693l265m004j3947p117k895J4681k071O737J584
14397A3531J5616K0602m477j4243P522O098j8615k3142l145L673Q380O031J7395
$$ plain form
14384 35226 31206 17093 8943 29535 18716 16652 20310 15499 4624 -2964 -12251 -853 7259
14371 7259 16468 -3170 -19838 -3652 13534 8431 3283 7527 20499 23965 14722 -2306 -12881
14358 -12881 -9624 -6777 14024 16570 8785 5254 5876 22885 31751 38697 28637 32025 53196 45787
14344 45787 19534 22 -2871 1063 20961 32580 9802 14043 11289 4770 2426 9646 11842
14331 11842 10569 9375 11353 6356 6078 3917 -10858 -5475 11291 15264 2936 6480 6098 378
14317 378 6523 8307 2480 17710 32539 35704 27966 13550 16129 22370 22755 7370 12288 28808
14303 28808 28927 30735 28842 25889 28858 21134 5902 4197 7833 4761 -10490 -6771 4159 23907
14289 23907 28439 28295 33508 43900 36497 31413 31985 48249 44427 25597 23780 16062 24763 27259
$$ packed form
14384C5226m020j4113q150K0592j0819k064L658m811j0875p588r287J1398Q112
14371G259R209j9638j6668J6186J7186n103n148M244J2972L466r243j7028j0575
14358a2881L257K847K0801K546p785l531O22J7009Q866O946j0060L388K1171p409
14344D5787k6253j9512k893L934J9898J1619k2778M241k754o519k344P220K196
14331A1842j273j194J978m997k78k161j4775N383J6766L973j2328L544l82n720
14317C78O145J784n827J5230J4829L165p738j4416K579O241L85j5385M918J6520
14303B8808J19J808j893k953K969p724j5232j705L636l072j5251L719J0930J9748
14289B3907M532j44N213J0392p403n084N72J6264l822j8830j817p718Q701K496
$$ plain form
14275 27259 17711 9817 11449 21552 47456 67239 52570 36339 40781 50146 52164 62379 80993
14262 80993 73483 64848 70726 95770 97578 102900 131106 145672 152702 166346 191898 202162 203423
14249 203423 218857 218819 248673 272685 308545 340337 361780 405722 434415 466710 488270 516499
14237 516499 507290 493684 482609 482790 474988 453341 459605 431412 393198 348880 313673 285914
14225 285914 268547 251349 235265 215702 184738 174085 150023 133097 135021 123663 105865 87442
14213 87442 82324 82825 66520 45506 39143 38162 44621 45371 40409 46359 60142 45348 30706 48596
14199 48596 65958 59098 44238 52944 69518 50302 35422 41423 43722 29126 21466 25807 20630
14186 20630 2684 3388 -11238 -7150 9105 17227 22353 30995 43597 37434 21025 24671 32592
$$ packed form
14275B7259r548p894J632J0103K5904J9783j4669j6231M442R365K018J0215J8614
14262H0993p510q635N878K5044J808N322K8206J4566P030J3644K5552J0264J261
14249B03423J5434l8K9854K4012L5860L1792K1443M3942K8693L2295K1560K8229
14237E16499r209j3606j1075J81p802k1647O264k8193l8214m4318l5207k7759
14225B85914j7367j7198j6084j9563l0964j0653k4062j6926J924j1358j7798j8423
14213H7442n118N01j6305k1014o363r81O459P50m962N950J3783j4794j4642J7890
14199D8596J7362o860j4860Q706J6574j9216j4880O001K299j4596p660M341n177
14186B0630j7946P04j4626M088J6255Q122N126Q642J2602o163j6409L646P921
$$ plain form
14173 32592 27915 25473 8527 -4807 5228 10769 14190 11740 14777 23100 28954 33567 41779 41110
14159 41110 37556 20773 25924 27291 33916 40160 51183 60853 42430 32746 32791 41164 34810 39143
14145 39143 39100 21236 23828 30846 9548 17783 51838 55202 42264 39890 36856 21260 35398
14132 35398 48990 56471 45100 48306 52962 51886 56021 56526 28244 13977 17636 22005 13824 14897
14118 14897 22587 29066 37455 40327 21052 34874 37904 38078 44889 43143 32805 46280 70523
14105 70523 83356 79705 73367 69990 66333 78552 77787 55195 57589 76784 73345 57359 38913
14092 38913 24160 19890 15406 16423 13306 17946 19862 31823 41618 33851 24488 2694 -537 10615
14078 10615 15312 17317 21292 13154 22289 23320 14906 388 -5316 1904 8152 17323 31649 31891
$$ packed form
14173C2592m677k442j6946j3334J0035N541L421k450L037Q323N854M613Q212o69
14159D1110l554j6783N151J367O625O244J1023R670j8423r684M5Q373o354M333
14145C9143m3j7864K592P018k1298Q235L4055L364j2938k374l034j5596J4138
14132C5398J3592P481j1371L206M656j076M135N05k8282j4267L659M369q181J073
14118A4897P690O479Q389K872j9275J3822L030J74O811j746j0338J3475K4243
14105G0523J2833l651o338l377l657J2219p65k2592K394J9195l439j5986j8446
14092C8913j4753m270m484J017l117M640J916J1961R795p767r363k1794l231J1152
14078A0615M697K005L975q138R135J031q414j4518n704P220O248R171J4326K42
$$ plain form
14064 31891 36586 34027 38581 22888 11486 8191 8966 5980 24338 39651 40938 31593 27570 38081
14050 38081 46435 57100 66142 79733 76973 76579 87386 69772 51185 49096 45885 47773 56998
14037 56998 63255 73062 67202 40038 41573 48969 42182 29107 21142 11209 10430 20686 25710 40080
14023 40080 49543 46764 42242 17598 18214 27414 26828 16536 726 4214 3561 -1705 -20132 -23727
14009 -23727 -9838 20969 35852 35229 26222 13040 -3218 10225 23450 13077 14613 41894
13997 41894 51661 36540 15801 12537 13969 9390 12102 31036 53203 53489 28653 13899 53722
13984 53722 71772 68637 60226 42810 47242 37518 33607 35909 42538 57425 59146 51977 41295
13971 41295 41941 39856 24036 16285 19214 31214 43783 49492 53649 48162 41468 17802 20811 10921
$$ packed form
14064C1891M695k559M554j5693j1402l295P75k986J8358J5313J287r345m023J0511
14050C8081Q354J0665R042J3591k760l94J0807j7614j8587k089l211J888R225
14037E6998O257R807n860k7164J535P396o787j3075p965r933p79J0256N024J4370
14023D0080R463k779m522k4644O16R200n86j0292j5810L488o53n266j8427l595
14009b3727J3889L0807J4883o23r007j3182j6258J3443J3225j0373J536K7281
13997D1894R767j5121k0739l264J432m579K712J8934K2167K86k4836j4754L9823
13984E3722J8050l135q411j7416M432r724l911K302O629J4887J721p169j0682
13971D1295O46k085j5820p751K929J2000J2569N709M157n487o694k3666L009r890
$$ plain form
13957 10921 4928 -3527 -3793 -12037 -12977 -5004 14329 14379 22285 24864 21680 37049 49558 37290
13943 37290 29579 36481 50735 66663 67208 72514 75281 78521 70579 73819 92528 111698 120311 123426
13929 123426 137812 128011 108667 102274 124010 154840 156492 146744 135121 125755 136344 149420
13917 149420 147251 150527 151993 150656 148627 145508 153311 173794 181620 192917 196663 191758 203657
13904 203657 217542 234020 247821 245652 249667 267345 276277 282920 274369 262275 269667 275144 277316
13891 277316 288589 294658 302358 316132 325334 332272 338401 354086 372820 384109 388636 392239 416336
13878 416336 436117 450388 456737 445013 457151 470555 485009 492478 516935 526335 536517 564220
13866 564220 563208 576146 591074 602791 645862 688013 706374 729151 781383 818041 834917 868865
$$ packed form
13957A0921n993q455k66q244r40P973J9333N0P906K579l184J5369J2509j2268
13943C7290p711O902J4254J5928N45N306K767L240p942L240J8709J9170Q613L115
13929A23426J4386r801j9344o393K1736L0830J652r748j1623r366J0589J3076
13917A49420k169L276J466j337k029l119P803K0483P826J1297L746m905J1899
13904B03657J3885J6478J3801k169M015J7678Q932O643q551j2094P392N477K172
13891B77316J1273O069P700J3774R202O938O129J5685J8734J1289M527L603K4097
13878D16336J9781J4271O349j1724J2138J3404J4454P469K4457R400J0182K7703
13866E64220j012J2938J4928J1717M3071M2151J8361K2777N2232L6658J6876L3948
$$ plain form
13854 868865 901438 935107 974913 1008007 1051114 1118416 1176584 1242182 1322938 1412166 1478763
13843 1478763 1550000 1629446 1723532 1831406 1934692 2053180 2177821 2287888 2438513 2590979
13833 2590979 2759093 2943422 3141004 3351221 3585352 3875264 4183308 4467899 4803845
13824 4803845 5187291 5614105 6106152 6614642 7177870 7825668 8540980 9348271 10256595
13815 10256595 11252865 12352439 13578644 14928606 16426795 18096607 19985509 22069990
13807 22069990 24353007 26895378 29704021 32818977 36295186 40116372 44274767 48801131
13799 48801131 53673036 58872887 64267487 69702874 75007635 79959808 84283868 87774519
13791 87774519 90149564 91234640 90985987 89425568 86677014 82914700 78381464 73322883
$$ packed form
13854H68865L2573L3669L9806L3094M3107O7302N8168O5598Q0756Q9228O6597
13843A478763P1237P9446R4086J07874J03286J18488J24641J10067J50625J52466
13833B590979J68114J84329J97582K10217K34131K89912L08044K84591L35946
13824D803845L83446M26814M92047N08490N63228O47798P15312Q07291R08324
13815A0256595R96270J099574J226205J349962J498189J669812J888902K084481
13807B2069990K283017K542371K808643L114956L476209L821186M158395M526364
13799D8801131M871905N199851N394600N435387N304761M952173M324060L490651
13791H7774519K375045J085076k48653j560419k748554l762314m533236n058581
$$ plain form
13783 73322883 67999275 62618373 57330089 52255067 47477362 43020788 38930292 35210614
13775 35210614 31841897 28768666 26025123 23566483 21324114 19310144 17505026 15886993
13767 15886993 14440224 13123073 11937853 10892071 9956690 9119902 8359662 7674030 7058333
13758 7058333 6491483 5967526 5495032 5092398 4718195 4354858 4051302 3795870 3540824
13749 3540824 3293953 3067533 2853478 2670431 2508038 2360327 2239502 2121558 1992494
13740 1992494 1858461 1760634 1670321 1590544 1511892 1427815 1334383 1262722 1207050 1135375 1087049
13729 1087049 1043674 987696 936813 890671 843677 792559 745319 720709 686381 662106 632506
13718 632506 580801 562962 550762 533543 516044 504352 488041 456933 450524 460114 438237 409469
$$ packed form
13783G3322883n323608n380902n288284n075022m777705m456574m090496l719678
13775C5210614l368717l073231k743543k458640k242369k013970j805118j618033
13767A5886993j446769j317151j185220j045782r35381q36788p60240o85632o15697
13758G058333n66850n23957m72494m02634l74203l63337l03556k55432k55046
13749C540824k46871k26420k14055j83047j62393j47711j20825j17944j29064
13740A992494j34033r7827r0313p9777p8652q4077r3432p1661n5672p1675m8326
13729A087049m3375n5978n0883m6142m6994n1118m7240k4610l4328k4275k9600
13718F32506n1705j7839j2200j7219j7499j1692j6311l1108o409R590k1877k8768
$$ plain form
13706 409469 385940 362540 345761 345485 355494 350867 335931 319678 320935 319965 311784 284376 276817
13693 276817 276863 270947 246989 225695 218151 210900 205039 210903 210667 216107 217002 202329 214296 214571
13679 214571 189668 185788 175720 179779 169055 166651 167584 149785 145272 161334 172598 156565 153946
13666 153946 166827 168255 177778 192852 192870 199555 188642 180516 180384 184181 204437 211291 202483 194580
13652 194580 174099 168183 180998 185439 182522 162752 158154 158125 162493 161564 166529 183745 165164 134627
13638 134627 133468 136456 129060 135685 158478 194572 197721 196520 200063 196202 190825 188368 193053 176749
13624 176749 163591 162780 159099 159362 179141 179816 148253 159782 161052 159554 148303 129688 148755
13611 148755 146515 127307 120913 117489 91556 79311 72565 73834 67315 71456 75238 70731 72113
$$ packed form
13706D09469k3529k3400j6779k76J0009m627j4936j6253J257r70q181k7408p559
13693B76817M6n916k3958k1294p544p251n861N864k36N440Q95j4673J1967K75
13679B14571k4903l880j0068M059j0724k404R33j7799m513J6062J1264j6033k619
13666A53946J2881J428R523J5074J8O685j0913q126j32L797K0256O854q808p903
13652A94580k0481n916J2815M441k917j9770m598k9M368r29M965J7216j8581l0537
13638A34627j159K988p396O625K2793L6094L149j201L543l861n377k457M685j6304
13624A76749j3158q11l681K63J9779O75l1563J1529J270j498j1251j8615J9067
13611A48755k240j9208o394l424k5933j2245o746J269o519M141L782m507J382
$$ plain form
13598 72113 81986 75372 86530 88229 82134 100239 101354 86662 79965 58949 41543 55208 81985
13585 81985 93507 107579 98307 67593 74057 73980 68520 69427 85705 102160 65937 63666 76731
13572 76731 76492 56025 58174 65540 50987 42444 62616 83639 88414 79209 70715 74197 73785 68163
13558 68163 69189 88183 66265 49916 64493 72178 66470 67342 50772 38732 53959 55242 37495
13545 37495 27760 43022 49874 48901 64506 57074 54288 60976 41210 20942 27491 52377 46173
13532 46173 45104 32647 27614 30460 43669 51012 52214 53972 71696 78068 70000 42011 31822
13519 31822 48241 59726 58559 46387 48153 52618 62099 60942 43615 50110 63333 58081 56056
13506 56056 54615 47251 48186 57695 56264 62846 57318 56830 56263 35643 12217 -19283 -33533 -9863
$$ packed form
13598G2113R873o614J1158J699o095J8105J115j4692o697k1016j7406J3665K6777
13585H1985J1522J4072r272l0714O464p7n460R07J6278J6455l6223k271J3065
13572G6731k39k0467K149P366j4553q543K0172K1023M775r205q494L482m12n622
13558F8163J026J8994k1918j6349J4577P685n708Q72j6570j2040J5227J283j7747
13545C7495r735J5262O852r73J5605p432k786O688j9766k0268O549K4886o204
13532D6173j069j2457n033K846J3209P343J202J758J7724O372q068k7989j0189
13519C1822J6419J1485j167j2172J766M465R481j157j7327O495J3223n252k025
13506E6056j441p364R35R509j431O582n528m88n67k0620k3426l1500j4250K3670
$$ plain form
13492 -9863 1116 -28760 -30536 -19226 7165 -2655 -10600 -4642 -7473 -2899 -6101 7292 -595
13479 -595 -16307 -25692 -13266 -10155 -3103 -843 2399 2681 -3578 -17142 -21611 -23943 -30584 -25718
13465 -25718 3341 1132 -12502 -11146 10622 24610 30656 31959 26302 1133 -8751 -8723 7206
13452 7206 7624 131 -6281 -3615 -15307 -11755 1139 -3563 9548 10641 2475 -4791 -16896 -22397
13438 -22397 -24157 -16738 -12991 2616 21667 14279 9771 13488 14903 20284 34921 41775 35391 15137
13424 15137 26779 50807 48202 41424 49513 33272 35289 42941 43178 37433 54302 49132 47707 54484
13410 54484 54004 31555 6551 4693 11869 12555 15425 9922 2690 -3807 -16084 -9919 -10302 -17930
13396 -17930 -23711 -15056 -6356 6834 20872 32606 48518 67304 69365 49006 13828 11176 18260
$$ packed form
13492i863J0979k9876j776J1310K6391r820p945N958k831M574l202J3393p887
13479e95j5712r385J2426L111P052K260L242K82o259j3564m469k332o641M866
13465b5718K9059k209j3634J356K1768J3988O046J303n657k5169r884K8J5929
13452G206M18p493o412K666j1692L552J2894m702J3111J093q166p266j2105n501
13438b2397j760P419L747J5607J9051p388m508L717J415N381J4637O854o384k0254
13424A5137J1642K4028k605o778Q089j6241K017P652K37n745J6869n170j425O777
13410E4484m80k2449k5004j858P176O86K870n503p232o497j2277O165l83p628
13396a7930n781Q655Q700J3190J4038J1734J5912J8786K061k0359l5178k652P084
$$ plain form
13383 18260 24980 27202 35730 39052 42173 53859 53137 63081 78360 91148 109754 124448 117162
13370 117162 108382 122064 142943 143241 139121 149866 160614 169757 164190 148562 144274 161503 185870
13357 185870 189322 190462 176028 178152 202500 214513 235099 242230 236218 264249 290955 321720
13345 321720 350106 381003 405004 426325 447202 470099 496200 517914 519944 526919 532596 537183
13333 537183 512360 483389 475801 474266 464624 448786 429108 402279 371804 356641 328740 330223
13321 330223 292849 250748 218508 211456 204514 186514 171846 136215 123872 107619 98750 101642
13309 101642 98973 78935 68699 74413 78574 67703 59418 35025 40593 47195 65015 62155 50406
13296 50406 30134 23256 13379 4742 13413 26996 31878 31991 33351 14932 15195 20646 39486 31372
$$ packed form
13383A8260O720K222Q528L322L121J1686p22R944J5279J2788J8606J4694p286
13370A17162q780J3682K0879K98m120J0745J0748R143n567j5628m288J7229K4367
13357A85870L452J140j4434K124K4348J2013K0586P131o012K8031K6706L0765
13345C21720K8386L0897K4001K1321K0877K2897K6101K1714K030O975N677M587
13333E37183k4823k8971p588j535r642j5838j9678k6829l0475j5163k7901J483
13321C30223l7374m2101l2240p052o942j8000j4668l5631j2343j6253q869K892
13309A01642k669k0038j0236N714M161j0871q285k4393N568O602J7820k860j1749
13296E0406k0272o878r877q637Q671J3583M882J13J360j8419K63N451J8840q114
$$ plain form
13282 31372 23625 23501 18583 11289 1745 -7099 5204 16401 20235 19130 -1449 3928 -4690 -8351
13268 -8351 18163 16437 22242 33068 21934 16012 6958 -8357 -25010 -7143 17251 14928 6929
13255 6929 -5685 -8269 -10118 -4129 10049 5171 -7257 -8194 -6848 -6324 16083 19009 11854 12327
13241 12327 24690 24376 5521 3327 27302 42545 44192 33653 36580 23824 12830 7899 -1053
13228 -1053 -28536 -30314 -17886 623 -5735 -5313 -6068 -4131 -15660 -1979 1239 5445 15348 4971
13214 4971 6636 14207 14090 -3569 -7740 10197 25193 20025 -5789 -30722 -21651 -23916 -9688
13201 -9688 12643 18596 -4834 -6254 -24531 -31644 -41370 -39186 -5496 13950 6245 -5157 -2973
13188 -2973 -18803 -28386 -14771 -24858 -29994 -41321 -36675 -4570 4910 7582 15257 4193 -8336
$$ packed form
13282C1372p747j24m918p294r544q844J2303J1197L834j105k0579N377q618l661
13268h351K6514j726N805J0826j1134n922r054j5315j6653J7867K4394k323p999
13255F929j2614k584j849N989J4178m878j2428r37J346N24K2407K926p155M73
13241A2327J2363l14j8855k194K3975J5243J647j0539K927j2756j0994m931q952
13228a053k7483j778J2428J8509o358M22p55J937j1529J3681L218M206R903j0377
13214D971J665P571j17j7659m171J7937J4996n168k5814k4933R071k265J4228
13201i688K2331N953k3430j420j8277p113r726K184L3690J9446p705j1402K184
13188b973j5830r583J3615j0087n136j1327M646L2105R480K672P675j1064j2529
$$ plain form
13175 -8336 -8940 14347 10255 -2932 -12346 -16687 -21157 -26856 -24434 -15746 -7515 13855 4592 -22
13161 -22 -12859 -9108 15844 12597 5938 -12942 -8055 -3136 -6226 -5056 -16901 -9963 -7732 -7146
13147 -7146 -22678 -21383 -19651 -11304 -1653 11132 13931 20267 12286 13132 15561 13976 5970 -21239
13133 -21239 -22210 -1752 16169 9323 -6164 -2708 -12952 -14010 -866 6170 23437 25911 27172
13120 27172 14722 13387 7158 1218 10597 35296 29091 23954 18128 22246 33642 8220 -14341
13107 -14341 -19014 -13856 -17036 -1008 4081 -4124 -11209 -2995 18343 25284 17129 -8568 -31024
13094 -31024 -27075 -17279 -2122 -1596 -4533 266 -8495 3496 8589 -813 3819 13065 13946 22970
13080 22970 5410 -3451 -6275 -11531 -14152 -2097 11765 18355 11224 13475 9542 7981 16971 25539
$$ packed form
13175h336o04K3287m092j3187r414m341m470n699K422Q688Q231K1370r263m614
13161b2j2837L751K4952l247o659j8880M887M919l090J170j1845O938K231N86
13147g146j5532J295J732Q347R651J2785K799O336p981Q46K429j585q006k7209
13133b1239r71K0458J7921o846j5487L456j0244j058J3144P036J7267K474J261
13120B7172j2450j335o229n940R379K4699o205n137n826M118J1396k5422k2561
13107a4341m673N158l180J6028N089q205p085Q214K1338O941q155k5697k2456
13094c1024L949R796J5157N26k937M799q761J1991N093r402M632R246Q81R024
13080B2970j7560q861k824n256k621J2055J3862O590p131K251l933j561Q990Q568
$$ plain form
13066 25539 22850 26316 26419 26144 21244 26348 30403 19552 5959 6327 16088 -3933 -14307 -11874
13052 -11874 -10097 -18304 -3397 -14245 -18560 -15255 -10706 -8325 -886 -14072 -14091 4801 8093 13372
13038 13372 16112 7323 1886 13509 22550 33041 13064 -11575 -6048 5870 16139 38553 48184
13025 48184 46507 16201 11043 10494 5979 5409 -5309 -16507 -14761 -22215 -31484 -48739 -35491 -34110
13011 -34110 -22688 -2298 -12833 -12223 -8214 -17493 -20944 -6203 4607 8848 18601 15947 -1520
12998 -1520 -1428 9658 12944 5160 12532 50745 44440 26441 4085 -22897 -4987 10002 12695
12985 12695 16814 38674 43709 41432 18771 9638 175 5353 4218 2059 6815 20421 19647 8459
12971 8459 2508 -3053 -2257 627 -833 -12675 -11689 -26507 -31889 -29761 -21118 -19466 -24596 -14175
$$ packed form
13066B5539k689L466J03k75m900N104M055j0851j3593L68R761k0021j0374K433
13052a1874J777q207J4907j0848m315L305M549K381P439j3186j9J8892L292N279
13038A3372K740q789n437J1623R041J0491j9977k4639N527J1918J0269K2414R631
13025D8184j677l0306n158n49m515n70j0718j1198J746p454r269j7255J3248J381
13011c4110J1422K0390j0535O10M009r279l451J4741J0810M241R753k654j7467
12998a520R2J1086L286p784P372L8213o305j7999k2356k6982J7910J4989K693
12985A2695M119K1860N035k277k2661r133r463N178j135k159M756J3606p74j1188
12971H459n951n561P96K884j460j1842R86j4818n382K128Q643J652n130J0421
$$ plain form
12957 -14175 -13596 -19389 -23152 -24880 -15441 -5887 -13478 -17128 -13417 -10127 -1282 -10562 -16814 -17382 -17425
12942 -17425 -11294 -7273 -128 6859 18071 9416 3830 -4863 -2459 187 -15874 -2648 18500
12929 18500 14604 13973 25301 22228 12764 -1946 1101 -526 -3851 -10160 1097 584 6212 22898
12915 22898 35076 33045 41162 35487 20232 14898 251 -9016 8611 24362 11277 8271 7458
12902 7458 1562 3799 17959 26969 39214 27630 13022 14320 -7092 -29023 916 14706 8259
12889 8259 3822 6368 16022 21960 -2964 -12999 -5564 3717 2009 3758 10529 21744 43370 41784
12875 41784 32673 27965 8404 -3693 8174 20570 19768 12113 3383 -10943 -27752 -40766 -30289
12862 -30289 -4195 -14768 -19897 -4498 3644 1651 -4309 5501 10268 12737 22668 13892 5902 6312
$$ packed form
12957a4175N79n793l763j728R439R554p591l650L711L290Q845r280o252n68m3
12942a7425O131M021P145O987J1212q655n586q693K404K646j6061J3226K1148
12929A8500l896o31J1328l073r464j4710L047j627l325o309J1257n13N628J6686
12915B2898J2178k031Q117n675j5255n334j4647r267J7627J5751j3085l006q13
12902G458n896K237J4160R010J2245j1584j4608J298k1412k1931K9939J3790o447
12889H259m437K546R654N938k4924j0035P435R281j708J749O771J1215K1626j586
12875D1784r111m708j9561j2097J1867J2396q02p655q730j4326j6809j3014J0477
12862c0289K6094j0573n129J5399Q142j993n960R810M767K469R931q776p990M10
$$ plain form
12848 6312 10699 -2934 1954 6292 7592 -3898 -14987 3743 7950 -7670 -30535 -22573 -3181
12835 -3181 9199 7952 8253 8334 8364 -3746 -18506 -9586 -17521 3836 10327 -5445 -12218 -16410 -16044
12820 -16044 -27289 -40720 -45837 -34338 -22979 -11241 2981 15047 28849 13214 -4319 -13209
12808 -13209 19271 22861 5916 -7735 -4670 -13003 -34865 -37861 -18819 2415 -879 -8616 -7915
12795 -7915 6700 27883 23563 7934 22304 31592 40217 39555 40664 28364 14080 -1847 -18868
12782 -18868 -17713 -3829 10118 4237 8778 18230 33641 38497 26888 24163 2720 16690 48536
12769 48536 55017 51254 55640 39036 15518 15085 40493 39680 28093 17760 15563 -5814 -8824
12756 -8824 4877 -1118 -8257 -4261 20529 28361 10935 -1571 2018 8533 11058 11029 23456 4781
$$ packed form
12848F312M387j3633M888M338J300j1490j1089J8730M207j5620k2865P962J9392
12835c181J2380j247L01Q1L0j2110j4760Q920p935K1357O491j5772o773m192L66
12820a6044j1245j3431n117J1499J1359J1738J4222J2066J3802j5635j7533q890
12808a3209L2480L590j6945j3651L065q333k1862k996J9042K1234l294p737P01
12795g915J4615K1183m320j5629J4370R288Q625o62J109j2300j4284j5927j7021
12782a8868J155J3884J3947n881M541R452J5411M856j1609k725k1443J3970L1846
12769D8536O481l763M386j6604k3518m33K5408q13j1587j0333k197k1377l010
12756h824J3701n995p139L996K4790P832j7426j2506L589O515K525k9J2427j8675
$$ plain form
12742 4781 5681 19869 26789 22160 -11811 -18995 -1939 6321 1528 4911 1998 -17833 -6184 14971
12728 14971 6932 -3036 -23181 -13893 -4859 6006 18651 13031 19299 37123 39705 33200 4589
12715 4589 2471 25944 26255 28698 11557 -3185 -10142 -11688 -1730 -8066 -11369 -6045 1541 -2194
12701 -2194 -3373 441 11679 27593 21221 29133 11573 -6058 -7614 -24891 -15462 -5854 1994
12688 1994 18257 14464 -3105 -18064 -18278 -14897 -9594 -2145 10699 14891 -16838 -36457 -27338
12675 -27338 -6036 1407 -10421 -15774 -7456 -5833 15561 4477 -5359 -15313 -19762 -9005 1267
12662 1267 18864 31161 28310 21696 27434 22821 14990 30709 26928 13232 -1689 22986 39217
12649 39217 43655 62570 70434 78030 70050 62126 60536 60732 50030 37367 43390 37545 54504 50219
$$ packed form
12742D781R00J4188O920m629l3971p184J7056Q260m793L383k913j9831J1649K1155
12728A4971q039r968k0145R288R034J0865J2645n620O268J7824K582o505k8611
12715D589k118K3473L11K443j7141j4742o957j546R958o336l303N324P586l735
12701b194j179L814J1238J5914o372P912j7560j7631j556j7277R429R608P848
12688A994J6263l793j7569j4959k14L381N303P449J2844M192l1729j9619R119
12675b7338K1302P443j1828n353Q318J623K1394j1084r836r954m449J0757J0272
12662A267J7597J2297k851o614N738m613p831J5719l781j3696j4921K4675J6231
12649C9217M438J8915P864P596p980p924j590J96j0702j2663O023n845J6959m285
$$ plain form
12635 50219 66189 66832 56956 50483 49074 13632 7065 29762 45508 50300 47916 42401 62373
12622 62373 67426 55894 54085 41340 29197 14375 9693 19238 36292 49676 71596 73462 83397
12609 83397 75405 75164 76817 57795 39038 41898 62782 67294 53414 35288 33446 21254 11341
12596 11341 16126 32706 20501 15718 13207 5779 6588 15490 8479 14061 27161 50000 46977 43753
12582 43753 24086 6680 6258 5497 17723 14941 18034 48001 52117 48447 47669 47480 49120 66499
12568 66499 39504 18246 10934 -6454 -5950 4644 12094 17216 17636 24214 36866 28201 29956 19415
12554 19415 11607 16063 25511 20872 16681 10550 12469 13195 14501 12157 -1425 -16430 -16232 -494
12540 -494 4043 -11854 -3936 1162 7278 22528 23374 8141 -283 1111 -7537 -6682 18336 9877
$$ packed form
12635E0219J5970O43r876o473j409l5442o567K2697J5746M792k384n515J9972
12622F2373N053j1532j809j2745j2143j4822m682R545J7054J3384K1920J866R935
12609H3397p992k41J653j9022j8757K860K0884M512j3880j8126j842j2192r913
12596A1341M785J6580j2205m783k511p428Q09Q902p011N582J3100K2839l023l224
12582D3753j9667j7406m22p61J2226k782L093K9967M116l670p78j89J640J7379
12568F6499k6995k1258p312j7388N04J0594P450N122M20O578J2652q665J755j0541
12554A9415p808M456R448m639m191o131J919P26J306k344j3582j5005J98J5738
12540d94M537j5897P918N098O116J5250Q46j5233q424J394q648Q55K5018q459
$$ plain form
12526 9877 7603 17113 434 -1630 3742 8391 10517 9917 17195 8846 -4619 -7268 6691 39734
12512 39734 22439 2395 514 14260 20920 -5896 -4211 6538 17985 40372 30722 20576
12500 20576 13477 3428 -2685 2457 5527 -7397 -11800 -8721 -8204 -2269 -1217 -6078 16547 34319
12486 34319 40788 39002 26803 21874 26724 33608 37148 27194 20409 13800 20548 25886 12709 19873
12472 19873 33829 40472 20307 16921 25262 19793 3386 -6451 2223 21873 29592 24939 23895
12459 23895 19686 13179 25963 46710 41578 17972 14121 3743 -2792 -8310 -10391 10813 19230
12446 19230 18490 31364 40857 33669 56205 46410 40924 27096 32532 23900 10034 875 2387 11738
12432 11738 25930 39815 43227 37354 29818 60918 93552 99033 100317 96194 90886 65859 36661
$$ packed form
12526I877k274R510j6679k064N372M649K126o00P278q349j3465k649J3959L3043
12512C9734j7295k0044j881J3746O660k6816J685J0749J1447K2387r650j0146
12500B0576p099j0049o113N142L070j2924m403L079N17N935J052m861K2625J7772
12486C4319O469j786j2199m929M850O884L540r954o785o609O748N338j3177P164
12472A9873J3956O643k0165l386Q341n469j6407r837Q674J9650P719m653j044
12459B3895m209o507J2784K0747n132k3606l851j0378o535n518k081K1204Q417
12446A9230p40J2874R493p188K2536r795n486j3828N436q632j3866r159J512R351
12432A1738J4192J3885L412n873p536L1100L2634N481J284m123n308k5027k9198
$$ plain form
12419 36661 21998 6677 -2571 4933 14665 17924 22071 30508 45670 41905 47548 43786 25317
12406 25317 20840 50419 63968 61252 60824 53180 52002 70508 79593 76950 83635 85971 91150 114668
12392 114668 132530 150038 189264 221791 279070 346379 393981 400482 393153 386881 367704 344984
12380 344984 308824 266664 244648 243676 248998 263616 278762 275621 270804 261802 268430 280053 318729
12367 318729 313698 322461 351072 382912 387722 366530 363132 370727 351379 366724 391108 413570
12355 413570 468774 514587 585982 689436 786863 859641 909910 943002 921916 882200 822782
12344 822782 731305 646618 561463 481983 442288 425354 425662 423699 414446 401620 372161 372547 373972
12331 373972 363299 364993 350879 338219 317241 308206 308023 286674 273018 275001 264190 249328
$$ packed form
12419C6661j4663j5321r248P504R732L259M147Q437J5162l765N643l762j8469
12406B5317m477K9579J3549k716m28p644j178J8506R085k643O685K336N179K3518
12392A14668J7862J7508L9226L2527N7279O7309M7602O501p329o272j9177k2720
12380C44984l6160m2160k2016r72N322J4618J5146l141m817r002O628J1623L8676
12367C18729n031Q763K8611L1840M810k1192l398P595j9348J5345K4384K2462
12355D13570N5204M5813P1395J03454R7427P2778N0269L3092k1086l9716n9418
12344H22782r1477q4687q5155p9480l9695j6934L08j963r253j2826k9459L86J425
12331C73972j0673J694j4114j2660k0978r035j83k1349j3656J983j0811j4862
$$ plain form
12319 249328 237036 233172 253765 282713 297123 336651 378774 416965 421523 401254 359594 295773
12307 295773 255111 212541 177568 147447 127225 105136 106902 108680 102172 91450 62833 40447
12295 40447 57147 61444 62093 40375 49873 68883 54490 30120 35824 43353 48018 38905 32455
12282 32455 15449 2378 5778 20161 17431 20580 19859 33334 44862 50921 46387 46584 48865 44655
12268 44655 56700 56678 43276 38519 31132 5846 -10074 -951 -13634 -10811 17207 27587 11771
12255 11771 -15634 -14176 -8417 -11762 -16126 -19212 -5848 -6330 6842 16145 809 -2828 -5805 383
12241 383 592 13578 -2342 -13027 -1345 13318 20732 35324 46851 23355 12557 -4096 -9412
12228 -9412 -6329 -16401 -12713 -2233 6179 -1709 -2076 -509 6515 15337 2888 15600 24643 15915
$$ packed form
12319B49328j2292l864K0593K8948J4410L9528M2123L8191M558k0269m1660o3821
12307B95773m0662m2570l4973l0121k0222k2089J766J778o508j0722k8617k2386
12295D0447J6700M297O49k1718R498J9010j4393k4370N704P529M665r113o450
12282C2455j7006j3071L400J4383k730L149p21J3475J1528O059m534J97K281m210
12268D4655J2045k2j3402m757p387k5286j5920R123j2683K823K8018J0380j5816
12255A1771k7405J458N759l345m364l086J3364m82J3172R303j5336l637k977O188
12241C83K09J2986j5920j0685J1682J4663P414J4592J1527k3496j0798j6653n316
12228i412L083j0072L688J0480Q412p888l67J567P024Q822j2449J2712R043q728
$$ plain form
12214 15915 -14624 -31654 -31936 -29006 -15587 -8600 -8590 -16106 -1738 7523 -10466 -16557 -11100 2550
12200 2550 8324 -157 -16636 -31457 -16931 -8611 1235 13532 25198 28879 28227 28918 13709 16532
12186 16532 13540 2946 19736 24536 11438 1367 3044 22882 7286 -1690 -6702 5608 22723
12173 22723 28562 17194 2790 5659 19975 21336 10455 16551 14439 7342 15425 26059 27123
12160 27123 32829 42204 33259 41068 36447 21029 4578 226 6221 23230 9912 -3886 1417
12147 1417 -3150 -7072 -15388 -28004 -10697 1170 10538 15647 6103 -7712 -24751 -12943 7371
12134 7371 13008 12475 996 -2232 3927 13642 5017 -10841 -4344 6656 -8202 -300 10135 13236
12120 13236 4448 10639 6134 14832 7163 6014 34974 26633 -5441 -6560 -21244 -24603 -15958 26406
$$ packed form
12214A5915l0539j7030k82K930J3419O987J0p516J4368R261j7989o091N457J3650
12200B550N774q481j6479j4821J4526Q320R846J2297J1666L681o52O91j5209K823
12186A6532k992j0594J6790M800j3098j0071J677J9838j5596q976n012J2310J7115
12173B2723N839j1368j4404K869J4316J361j0881O096k112p097Q083J0634J064
12160B7123N706R375q945P809m621j5418j6451m352N995J7009j3318j3798N303
12147A417m567l922q316j2616J7307J1867R368N109r544j3815j7039J1808K0314
12134G371N637n33j1479l228O159R715q625j5858O497J1000j4858P902J0435L101
12120A3236q788O191m505Q698p669j149K8960q341l2074j119j4684l359Q645M2364
$$ plain form
12106 26406 28411 8384 1421 -3954 -5628 -3494 5411 2683 4472 21018 15861 7913 26308 23943
12092 23943 26097 30965 46716 54189 38143 25903 27323 26409 22561 31859 27966 11984 4803 -5039
12078 -5039 3819 13312 15057 6624 -11736 -19007 -17957 -10383 -1074 -2920 -24765 -17683 -7605 -13719
12064 -13719 -14349 -19756 -13564 -10721 -699 -2968 -7548 16011 18826 4399 14533 17386 22295 29947
12050 29947 14731 3313 9209 12489 11388 19215 32526 21915 13581 11711 -6994 -5688 -3468
12037 -3468 -20833 -17822 -16965 -20262 -26416 -34064 -12445 -17221 -16532 3099 28796 42328 23202 -6539
12023 -6539 -16602 -31203 -30620 -8156 -10941 -14848 4718 1182 9163 -17061 -37964 -20001 -1564
12010 -1564 15584 24964 29016 18349 25077 36007 26691 23437 9069 30743 47099 20499 3348
$$ packed form
12106B6406K005k0027o963n375j674K134Q905k728J789J6546n157p948J8395k365
12092B3943K154M868J5751P473j6046j2240J420r14l848R298l893j5982p181r842
12078e039Q858R493J745q433j8360p271J050P574R309j846k1845P082J0078o114
12064a3719o30n407O192K843J0022k269m580K3559K815j4427J0134K853M909P652
12050B9947j5216j1418N896L280j101P827J3311j0611q334j870j8705J306K220
12037c468j7365L011Q57l297o154p648K1619m776O89J9631K5697J3532j9126k9741
12023f539j0063j4601N83K2464k785l907J9566l536P981k6224k0903J7963J8437
12010a564J7148R380M052j0667O728J0930r316l254j4368K1674J6356k6600j7151
$$ plain form
11997 3348 6145 8136 -11220 -8552 -270 15132 22940 6636 -1001 -22007 -21965 -12379 -13656 -10268
11983 -10268 -2602 1030 -8715 -9799 11010 14149 382 14211 45970 50333 22054 -7034 -10947
11970 -10947 -11748 7901 16091 9932 12593 18896 12156 -2773 502 -6186 2349 -12494 -22864 -22256
11956 -22256 -7745 -5907 -14308 -2486 16355 37328 21604 10518 -2111 3800 32175 45667
11944 45667 43385 44106 38057 20622 3876 15940 14931 492 18025 16337 -2032 -13918 -28430
11931 -28430 -14748 -2462 4904 -9487 -1006 13546 23118 22439 30685 32686 26742 29989 40947
11918 40947 36555 36022 38376 19082 -8459 5082 2359 -5015 -12039 -4825 3612 1330 -7294 -960
11904 -960 -2537 17074 25697 22755 10270 7626 7791 5942 -10930 7067 7678 -12779 -11600 -17093
$$ packed form
11997C348K797J991j9356K668Q282J5402P808j6304p637k1006M2R586j277L388
11983a0268P666L632r745j084K0809L139j3767J3829L1759M363k8279k9088l913
11970a0947q01J9649Q190o159K661O303o740j4929L275o688Q535j4843j0370O08
11956b2256J4511J838q401J1822J8841K0973j5724j1086j2629N911K8375J3492
11944D5667k282P21o049j7435j6746J2064j009j4439J7533j688j8369j1886j4512
11931b8430J3682J2286P366j4391Q481J4552R572o79Q246K001n944L247J0958
11918D0947m392n33K354j9294k7541J3541k723p374p024P214Q437k282q624O334
11904i60j577J9611Q623k942j2485k644J65j849j6872J7997O11k0457J179n493
$$ plain form
11890 -17093 -26434 -4400 15256 19123 16002 15410 7535 -14535 -4806 -4524 -4223 10857 3723 -6409
11876 -6409 -9034 -8023 -5451 -25328 -27647 -13745 -1456 22936 27899 10423 -10518 -16784 -3105
11863 -3105 12883 21775 11834 -4359 -16368 -25670 -36277 -37330 -27906 -14785 -4798 1980 9258
11850 9258 691 -3555 -14200 -8515 192 14046 10301 -476 1946 -10854 -18611 -17944 4250 19326
11836 19326 7411 17884 6586 -619 -9437 -3273 -2588 -5087 -3993 -334 -6403 -13110 -14973 -25309
11822 -25309 -27633 -19321 3056 1745 -2520 -5241 -5698 -15079 -13323 -8634 -635 375 -872 -4816
11808 -4816 -7406 -7744 8234 12518 13912 12446 -1325 -11064 1480 19072 11131 25264 15302 4911
11794 4911 22641 19859 15479 13611 8522 -6084 -4408 4432 -24534 -38314 -19746 -9557 -3160
$$ packed form
11890a7093r341K2034J9656L867l121n92p875k2070R729K82L01J5080p134j0132
11876f409k625J011K572j9877k319J3902J2289K4392M963j7476k0941o266J3679
11863c105J5988Q892r941j6193j2009r302j0607j053R424J3121R987O778P278
11850I258q567m246j0645N685Q707J3854l745j0777K422j2800p757O67K2194J5076
11836A9326j1915J0473j1298p205q818O164O85k499J094L659o069o707j863j0336
11822b5309k324Q312K2377j311m265k721m57r381J756M689P999J010j247l944
11808d816k590l38J5978M284J394j466j3771r739J2544J7592p941J4133r962j0391
11794D911J7730k782m380j868n089j4606J676Q840k8966j3780J8568J0189O397
$$ plain form
11781 -3160 8991 26881 42747 39123 21680 13110 -13920 -21924 -10184 16556 28635 26577 43760
11768 43760 42941 41068 29824 22410 30291 42581 35341 39426 42194 8803 -1041 7600 8386 7552
11754 7552 7256 -2314 -155 26200 32109 26813 10209 -22016 -12535 -6805 -18420 3994 18546
11741 18546 14091 21277 11331 -155 -5753 -1185 -22840 -38350 -28022 -25676 -4063 10680 32342
11728 32342 35736 46592 68107 64290 44510 40145 37688 32963 26016 20399 19785 33970 36844 38847
11714 38847 -1892 -11809 -1441 -16122 -7898 11830 5529 -20355 -13169 -16875 -24518 -17099 -11839
11701 -11839 -12516 -2763 -10653 -7107 20356 13351 10342 3230 6759 9222 4983 7430 871 11067
11687 11067 17985 34670 48776 41948 26135 4227 -440 7096 18823 -872 -13754 -14248 -10659
$$ packed form
11781c160J2151J7890J5866l624j7443q570k7030q004J1740K6740J2079k058J7183
11768D3760q19j873j1244p414P881J2290p240M085K768l3391r844Q641P86q34
11754G552k96r570K159K6355N909n296j6604l2225R481N730j1615K2414J4552
11741A8546m455P186r946j1486n598M568k1655j5510J0328K346K1613J4743K1662
11728C2342L394J0856K1515l817j9780m365k457m725o947n617o14J4185K874K003
11714C8847m0739r917J0368j4681Q224J9728o301k5884P186l706p643P419N260
11701a1839o77R753p890L546K7463p005l009p112L529K463m239K447o559J0196
11687A1067O918J6685J4106o828j5813k1908m667P536J1727j9695j2882m94L589
$$ plain form
11674 -10659 -6571 7960 16809 17498 12548 17331 30643 34982 23171 28036 49308 68547 67660 44636
11660 44636 13642 -2572 11098 3972 -5597 1482 7034 23509 17517 22559 18275 15402 14610 14683
11646 14683 15667 17745 25066 17977 25588 14070 15832 10760 -4620 -2533 8729 7589 -1259 -4463
11632 -4463 10227 19530 13764 -10744 -20862 -2546 -6933 -27647 -22667 -15338 -7556 -11506 -20063
11619 -20063 -14907 -17707 -27107 -6683 6180 18185 3205 -14857 -20781 -16573 -5449 5803 12949
11606 12949 9860 -904 -20764 -29432 -21885 -12480 -1122 8374 27172 16382 437 6359 13966
11593 13966 2535 6775 15045 15450 9324 6425 -3356 -14101 6241 18447 12042 3820 3336 -1418
11579 -1418 -22856 -27278 -22865 -5757 9399 -1674 -21121 -15977 -15681 -7175 -4812 -6033 -23285
$$ packed form
11674a0659M088J4531Q849O89m950M783J3312M339j1811M865K1272J9239q87k3024
11660D4636l0994j6214J3670p126r569P079N552J6475n992N042m284k873p92P3
11646A4683R84K078P321p089P611j1518J762n072j5380K087J1262j140q848l204
11632d463J4690R303n766k4508j0118J8316m387k0714M980P329P782l950q557
11619b0063N156k800r400K0424J2863J2005j4980j8062n924M208J1124J1252P146
11606A2949l089j0764j9860q668P547R405J1358R496J8798j0790j5945N922P607
11593A3966j1431M240Q270M05o126k899r781j0745K0342J2206o405q222m84m754
11579a418k1438m422M413J7108J5156j1073j9447N144K96Q506K363j221j7252
$$ plain form
11566 -23285 -25805 -34348 -18406 -10636 -18241 -15260 -7939 6465 8763 10607 -13284 -8020 5194
11553 5194 -4064 -25842 -26634 -31519 -24040 -18382 -12659 2759 1388 -12965 -3251 -74 -7902 -1931
11539 -1931 1454 -2161 4254 9069 -4117 -10405 -9453 -1904 8779 10866 5364 -3792 347 4210
11525 4210 -6653 -22570 -17728 -7698 -6014 8626 16634 12681 5228 25114 38691 22814 9131
11512 9131 10882 30461 43016 39468 12630 1216 4623 -14376 -21286 -20603 -17991 -19673 -21846 -31785
11498 -31785 -21869 -16527 -18377 -5195 -5540 8463 15186 8231 3597 6748 30926 39881 23267 16508
11484 16508 32983 24980 -3209 -14558 -19376 1860 -4042 -235 4043 4060 6803 3926 10624 12163
11470 12163 3474 6846 2873 11425 9148 8076 4034 16354 28948 37520 38477 13712 19207 27778
$$ packed form
11566b3285k520q543J5942P770p605K981P321J4404K298J844k3891N264J3214
11553E194r258k1778p92m885P479N658N723J5418j371j4353R714L177p828N971
11539a931L385l615O415M815j3186o288R52P549J0683K087n502r156M139L863
11525D210j0863j5917M842J0030J684J4640Q008l953p453J9886J3577j5877j3683
11512I131J751J9579J2555l548k6838j1414L407j8999o910O83K612j682k173r939
11498c1785R916N342j850J3182l45J4003O723o955m634L151K4178Q955j6614o759
11484A6508J6475q003k8189j1349m818K1236n902L807M278J7K743k877O698J539
11470A2163q689L372l973Q552k277j072m042J2320J2594Q572R57k4765N495Q571
$$ plain form
11456 27778 33500 23537 6408 1943 12083 2533 6493 16548 6850 5430 14067 33753 47454
11443 47454 57414 56963 44664 36488 22350 27981 16697 542 6886 11290 4990 -9517 -14262
11430 -14262 10531 21292 5836 -10924 -15531 -11619 -8610 12063 23018 24297 19576 28681 31920
11417 31920 19211 15304 1300 -11032 -23823 -3201 14001 30107 20489 -1062 -16371 -13999
11405 -13999 545 17408 39656 40482 53198 48121 25092 3635 9316 23893 18855 12025 16644
11392 16644 2405 1561 -264 12879 29700 31291 22822 17976 25306 28222 33869 38780 31910 41381
11378 41381 61248 56680 56210 75595 100909 114471 113772 133830 166688 205540 213742 224199 258313
11365 258313 276108 256233 212072 186871 186602 168308 140385 121061 104571 82801 55254 54844
$$ packed form
11456B7778N722r963j7129m465J0140r550L960J0055r698j420Q637J9686J3701
11443D7454R960m51j2299q176j4138N631j1284j6155O344M404o300j4507m745
11430a4262K4793J0761j5456j6760m607L912L009K0673J0955J279m721R105L239
11417C1920j2709l907j4004j2332j2791K0622J7202J6106r618k1551j5309K372
11405a3999J4544J6863K2248Q26J2716n077k3029k1457N681J4577n038o830M619
11392A6644j4239q44j825J3143J6821J591q469m846P330K916N647M911o870R471
11378D1381J9867m568m70J9385K5314J3562o99K0058L2858L8852Q202J0457L4114
11365B58313J7795j9875m4161k5201k69j8294k7923j9324j6490k1770k7547m10
$$ plain form
11353 54844 56340 55089 44921 21195 16269 13869 27258 39694 45729 59738 65422 57183 33860
11340 33860 25566 24343 10611 1399 -770 14990 22391 20646 12446 3872 18602 17955 19396 25840
11326 25840 33337 32548 41444 38194 28815 34942 35636 38898 35338 28841 32461 36247 45420 55535 49925
11311 49925 29447 20506 31925 20291 5631 8774 16670 24435 -7624 -25943 -16490 -9672 -13206
11298 -13206 -4884 12245 15962 -5250 -5899 4038 7312 7500 9940 32647 27011 28579 14817 14009
11284 14009 5621 4290 1374 10432 12034 13206 9427 -8585 -13510 -16246 -4244 4226 2042 2366
11270 2366 -143 8479 11298 -1501 -4472 7917 -21047 -32080 -7435 6288 11187 15680 8199
11257 8199 12459 39601 39561 33969 34580 38885 42527 50048 46885 50896 66728 70801 37332 46974 76945
$$ packed form
11353E4844J496j251j0168k3726m926k400J3389J2436O035J4009N684q239k3323
11340C3860q294j223j3732r212k169J5760P401j745q200q574J4730o47J441O444
11326B5840P497p89Q896l250r379O127O94L262l560o497L620L786R173J0115n610
11311D9925k0478q941J1419j1634j4660L143P896P765l2059j8319R453O818l534
11298a3206Q322J7129L717k1212o49R937L274J88K440K2707n636J568j3762q08
11284A4009q388j331k916R058J602J172l779j8012m925k736J2002Q470k184L24
11270B366k509Q622K819j2799k971J2389k8964j1033K4645J3723M899M493p481
11257H199M260K7142m0n592O11M305L642P521l163M011J5832M073l3469R642K9971
$$ plain form
11242 76945 74664 70928 74397 81893 68093 71225 109153 127453 136421 175124 202206 211253 205295
11229 205295 192873 179480 156012 127635 107585 82516 66546 70143 79346 72957 59999 42963
11217 42963 16284 12556 8281 3498 -5246 11940 10510 37262 30518 24000 32166 39436 27769
11204 27769 18711 14224 22460 19552 -6086 -4317 9203 -11203 -31374 -23776 -16669 -18597 -28575
11191 -28575 -29670 -9814 -4817 -20081 -3731 3261 13607 14927 20291 20841 32799 33603 29049 23081
11177 23081 18497 8310 -1481 -2088 17711 16756 21268 42730 24797 -15518 989 25466 24707
11164 24707 15463 13890 1408 11586 30348 29553 43752 41203 17811 17403 42437 55091 63372
11151 63372 50625 52327 42049 39714 52201 45398 27471 10878 -464 7301 7446 -11383 -19163
$$ packed form
11242G6945k281l736L469P496j3800L132L7928J8300Q968L8703K7082R047n958
11229B05295j2422j3393k3468k8377k0050k5069j5970L597R203o389j2958j7036
11217D2963k6679l728m275m783q744J7186j430K6752o744o518Q166P270j1667
11204B7769r058m487Q236k908k5638J769J3520k0406k0171P598P107j928r978
11191b8575j095J9856M997j5264J6350O992J0346J320N364N50J1958Q04m554n968
11177B3081m584j0187r791o07J9799r55M512K1462j7933m0315J6507K4477p59
11164B4707r244j573j2482J0178J8762p95J4199k549k3392m08K5034J2654Q281
11151F3372j2747J702j0278k335J2487o803j7927j6593j1342P765J45j8829p780
$$ plain form
11138 -19163 -7349 15514 16134 12473 12575 18455 31393 29189 21298 26532 28937 19922 23280 22312
11124 22312 25032 19194 27319 30884 21621 24089 28621 35418 31720 17740 19990 19554 32199 40920
11110 40920 27070 10763 10202 26496 24553 7513 8540 15413 17962 27402 25229 29186 34849 37156
11096 37156 31430 20068 10096 15731 26020 35754 34555 35968 35995 62472 65922 54883 45699 25208
11082 25208 13389 14576 17637 12205 15794 20401 20261 14719 11697 9832 12709 9569 20281 29101
11068 29101 14400 3981 9429 8743 7000 6761 20431 15917 15012 16360 20258 19448 20534 26002 48233
11053 48233 46622 31376 13903 15172 20489 37433 46571 29614 27690 21326 34242 44513 43886
11040 43886 36591 43684 45148 42402 51046 59629 48923 29266 38425 64098 65609 52473 54652
$$ packed form
11138a9163J1814K2863O20l661J02N880J2938k204p891N234K405r015L358r68
11124B2312K720n838Q125L565r263K468M532O797l698j3980K250m36J2645Q721
11110D0920j3850j6307n61J6294j943j7040J027O873K549R440k173L957N663K307
11096C7156n726j1362r972N635J0289R734j199J413K7K6477L450j1039r184k0491
11082B5208j1819J187L061n432L589M607j40n542l022j865K877l140J0712Q820
11068B9101j4701j0419N448o86j743k39J3670m514r05J348L898q10J086N468K2231
11053D8233j611j5246j7473J269N317J6944R138j6957j924o364J2916J0271o27
11040D3886p295P093J464k746Q644Q583j0706j9657R159K5673J511j3136K179
$$ plain form
11027 54652 59334 62840 51892 55102 68799 70663 57115 49766 49598 46974 33840 41736 42853 37866
11013 37866 73702 77659 59164 41031 13963 22890 24706 32320 42188 49188 45911 42917 21921
11000 21921 10694 10130 14303 26642 44945 70719 66336 50779 54784 61407 52529 41662 37207
10987 37207 35744 32565 35533 34598 44395 37013 44093 48623 39151 41589 52100 42970 34327 41660
10973 41660 44841 41419 58614 65815 60987 44050 52576 62700 53924 63083 67520 59338 47648
10960 47648 25031 18882 23542 20665 19009 32247 38454 21655 -3856 -10424 -12662 3845 25581
10947 25581 20801 33468 23732 26103 46313 53071 44637 36866 34693 31093 17553 9880 13425 14179
10933 14179 28207 42800 41370 31113 32453 31784 19095 25669 45568 41193 27243 17059 5981
$$ packed form
11027E4652M682L506j0948L210J3697J864j3548p349j68k624j3134P896J117m987
11013C7866L5836L957j8495j8133k7068Q927J816P614R868P000l277k994k0996
11000B1921j1227n64M173J2339J8303K5774m383j5557M005O623q878j0867m455
10987C7207j463l179K968r35R797p382P080M530r472K438J0511r130q643P333
10973D1660L181l422J7195P201m828j6937Q526J0124q776R159M437q182j1690
10960D7648k2617o149M660k877j656J3238O207j6799k5511o568k238J6507K1736
10947B5581m780J2667r736K371K0210O758q434p771k173l600j3540p673L545P54
10933A4179J4028J4593j430j0257J340o69j2689O574J9899m375j3950j0184j1078
$$ plain form
10920 5981 5156 1715 -19333 -8759 3454 11454 24182 18242 6710 26905 38541 43024 49074
10907 49074 36096 21859 9610 9056 18272 27545 40131 17450 5677 4145 17066 17647 15736
10894 15736 14414 10941 12305 1393 -9440 643 -7702 -13611 1859 20438 26753 21635 32415
10881 32415 19765 15328 26099 33683 46712 55029 46450 39128 39872 51969 42416 57029 68688
10868 68688 86702 98987 118308 125067 147338 161803 159268 152442 150613 151838 140177 112020 84881
10855 84881 55029 48496 60054 81336 89986 78359 60205 47320 53253 61019 71376 93615
10843 93615 80019 67773 71263 71388 69590 69835 72620 66294 41829 40994 53578 60892 63335 63423 69912
10828 69912 81677 104192 100208 87963 93734 100611 106812 123893 131903 138238 127456 134979 135065 137591
$$ packed form
10920E981q25l441k1048J0574J2213Q000J2728n940j1532K0195J1636M483O050
10907D9074j2978j4237j2249n54R216R273J2586k2681j1773j532J2921N81j911
10894A5736j322l473J364j0912j0833J0083q345n909J5470J8579O315n118J0780
10881C2415j2650m437J0771P584J3029Q317q579p322P44J2097r553J4613J1659
10868F8688J8014J2285J9321O759K2271J4465k535o826j829J225j1661k8157k7139
10855H4881k9852o533J1558K1282Q650j1627j8154j2885N933P766J0357K2239
10843I3615j3596j2246L490J25j798K45K785o326k4465q35J2584P314K443Q8O489
10828F9912J1765K2515l984j2245N771O877O201J7081Q010O335j0782P523Q6K526
$$ plain form
10814 137591 161575 165191 172236 174445 168280 138763 117830 108197 114833 114093 102360 86636 73769
10801 73769 93971 112035 108197 109610 111463 108820 97295 96166 101997 97867 91236 104498 106164
10788 106164 94680 93894 87510 89451 96669 83915 89182 95708 89822 82507 88363 88814 86126 91877
10774 91877 87190 111142 111857 104243 107292 129320 139539 141223 165667 203879 194926 186242 196207
10761 196207 183952 194197 193815 189218 164847 136389 118637 100033 77743 58496 52886 69868
10749 69868 89102 97631 87223 70481 76587 87371 84093 115573 118577 115272 102931 94615 72228
10736 72228 65550 68332 80462 99577 113602 126188 137411 141069 138975 131573 122495 123079 129644
10723 129644 135702 130963 161843 161991 130930 112276 83928 81967 89776 103776 124845 141953 158540
$$ packed form
10814A37591K3984L616P045K209o165k9517k0933r633O636p40j1733j5724j2867
10801G3769K0202J8064l838J413J853k643j1525j129N831m130o631J3262J666
10788A06164j1484p86o384J941P218j2754N267O526n886p315N856M51k688N751
10774I1877m687K3952P15p614L049K2028J0219J684K4444L8212q953q684R965
10761A96207j2255J0245l82m597k4371k8458j7752j8604k2290j9247n610J6982
10749F9868J9234Q529j0408j6742O106J0784l278L1480L004l305j2341q316k2387
10736G2228o678K782J2130J9115J4025J2586J1223L658k094p402r078N84O565
10723A29644O058m739L0880J48l1061j8654k8348j961P809J4000K1069J7108J6587
$$ plain form
10710 158540 172112 200385 223888 248944 274627 319023 383183 451049 485122 511704 526763
10699 526763 541050 536156 531888 531013 533129 571988 667197 834603 1111198 1486636 1900111 2180703
10687 2180703 2205655 2019783 1716933 1404160 1110519 846520 639203 485651 383189 325660
10677 325660 267452 258293 262535 226280 207748 195735 199754 211360 227777 252255 266398 300040
10665 300040 318097 331150 347845 393769 475976 605114 817569 1135819 1536938 1892187
10655 1892187 2085974 2074038 1887881 1627178 1331670 1046078 808723 611142 474717 385108
10645 385108 315819 294303 272072 249225 249184 229001 238050 252916 261314 260888 252783 254679 241757
10632 241757 219440 201518 199657 173090 165342 157442 170296 202373 203491 181170 154171 140103
$$ packed form
10710A58540J3572K8273K3503K5056K5683M4396O4160O7866L4073K6582J5059
10699E26763J4287m894m268q75K116L8859R5209J67406K76595L75438M13475K80592
10687B180703K4952j85872l02850l12773k93641k63999k07317j53552j02462n7529
10677C25660n8208r159M242l6255j8532j2013M019J1606J6417K4478J4143L3642
10665C00040J8057J3053J6695M5924Q2207J29138K12455L18250M01119L55249
10655A892187J93787j1936j86157k60703k95508k85592k37355j97581j36425q9609
10645C85108o9289k1516k2231k2847m1k0183R049J4866Q398m26q105J896j2922
10632B41757k2317j7922j861k6567p748p900J2854L2077J118k2321k6999j4068
$$ plain form
10620 140103 151707 163835 156770 150825 171783 154092 120206 114749 119767 125625 129020 121249 127001
10607 127001 148234 169746 175384 198612 228924 296599 364156 396507 377572 356526 327422 279913
10595 279913 236853 187338 133488 114346 101345 84683 54521 67592 85678 98765 87959
10584 87959 65245 82945 103096 129832 138222 120759 83430 81489 73487 60331 79287 96014
10572 96014 107608 127215 124253 132127 149029 183103 198670 199701 217635 240297 243574 260783
10560 260783 256518 226281 177985 135762 118089 106894 101703 82768 70193 73371 70796 104693
10548 104693 124128 138199 150229 167870 202404 244854 301569 353360 359635 332584 297736 259010
10536 259010 206582 143104 123583 133792 157852 152771 120074 124957 119512 98425 81450 85781
$$ packed form
10620A40103J1604J2128p065n945K0958j7691l3886n457N018N858L395p771N752
10607A27001K1233K1512N638K3228L0312O7675O7557L2351j8935k1046k9104m7509
10595B79913m3060m9515n3850j9142j3001j6662l0162J3071J8086J3087j0806
10584H7959k2714J7700K0151K6736Q390j7463l7329j941q002j3156J8956J6727
10572I6014J1594J9607k962P874J6902L4074J5567J031J7934K2662L277J7209
10560B60783m265l0237m8296m2223j7673j1195n191j8935j2575L178k575L3897
10548A04693J9435J4071J2030J7641L4534M2450N6715N1791O275k7051l4848l8726
10536B59010n2428o3478j9521J0209K4060n081l2697M883n445k1087j6975M331
$$ plain form
10524 85781 86656 83647 77067 62991 62749 58771 71987 93149 117990 118978 106414 91456 80888
10511 80888 77797 90258 113383 117628 159899 224177 287357 340113 381535 374329 361437 328081
10499 328081 284984 217459 158075 121630 121424 108229 109389 105588 82318 63838 70173 65825 64985
10486 64985 58884 68544 70516 74616 83978 111941 131904 138907 146466 165309 173324 151713 112099
10473 112099 114218 123408 127741 133837 131231 121430 98708 89842 100109 101762 82441 80362 99156
10460 99156 79625 70738 61370 39911 16972 6633 2347 -23011 -58196 -75371 -81429 -85031 -89872
10447 -89872 -99592 -109373 -123529 -84710 -7030 65610 139723 236535 284186 287561 269049 253728
10435 253728 242900 239040 216356 231422 245763 230100 203114 203829 194687 185996 191454 193510 197568
$$ packed form
10524H5781Q75l009o580j4076k42l978J3216K1162K4841R88j2564j4958j0568
10511H0888l091J2461K3125M245M2271O4278O3180N2756M1422p206j2892l3356
10499C28081m3097o7525n9384l6445k06j3195J160l801k3270j8480O335m348q40
10486F4985o101R660J972M100R362K7963J9963P003P559J8843Q015k1611l9614
10473A12099K119R190M333O096k606r801k2722q866J0267J653j9321k079J8794
10460I9156j9531q887r368k1459k2939j0339m286k5358l5185j7175o058l602m841
10447h9872r720r781j4156L8819P7680P2640P4113R6812M7651L375j8512j5321
10435B53728j0828l860k2684J5066J4341j5663k6986P15r142q691N458K056M058
$$ plain form
10422 197568 185890 151136 100024 54357 25854 15717 -1989 -41754 -87115 -107352 -108191 -93666
10410 -93666 -64263 -32404 31862 73384 119812 219053 328392 423246 481850 518917 520997 501617
10398 501617 477728 452710 426452 411443 392073 380883 384860 375242 391866 406211 412553 435863
10386 435863 450419 450994 456461 453702 444324 418838 402718 419453 432447 409709 388437 412888
10374 412888 453417 507455 599418 697166 801926 876646 902781 916483 917032 905334 871418 857955
10362 857955 877268 891756 873373 865815 859471 865225 852869 840695 841198 853376 868983 879842
10350 879842 907336 924278 980562 1021174 1062227 1125403 1180640 1202885 1242420 1299578 1344047
10339 1344047 1405054 1466027 1516036 1593313 1675691 1796730 1956104 2126378 2233157 2276883
$$ packed form
10422A97568j1678l4754n1112m5667k8503j0137j7706l9765m5361k0237q39J4525
10410i3666K9403L1859O4266M1522M6428R9241J09339R4854N8604L7067K080j9380
10398E01617k3889k5018k6258j5009j9370j1190L977r618J6624J4345O342K3310
10386D35863J4556N75N467k759r378k5486j6120J6735J2994k2738k1272K4451
10374D12888M0529N4038R1963R7748J04760P4720K6135J3702N49j1698l3916j3463
10362H57955J9313J4488j8383p558o344N754j2356j2174N03J2178J5607J0859
10350H79842K7494J6942N6284M0612M1053O3176N5237K2245L9535N7158M4469
10339A344047O1007O0973N0009P7277Q2378J21039J59374J70274J06779M3726
$$ plain form
10329 2276883 2346474 2436146 2526614 2617288 2693883 2769613 2812090 2847883 2867936 2907491 3005608
10318 3005608 3125557 3291265 3509944 3774816 4102325 4499814 5003587 5609181 6346387
10309 6346387 7193816 8056723 8813620 9463574 10064438 10719886 11515525 12584601 14089292
10300 14089292 16228190 19106164 22860184 27727717 34015141 42559741 55004359 74097174
10292 74097174 104610852 153253546 223490494 304687345 368884738 389365016 365031606
10285 365031606 316672686 261676196 205890209 153757682 110985244 80251516 60135527
10278 60135527 47285644 38857650 33125186 29033069 25847776 23254013 21299357 19975136
10270 19975136 19144581 18692755 18550147 18672734 18900708 19195341 19771015 20851416 22594588
$$ packed form
10329B276883O9591Q9672R0468R0674P6595P5730M2477L5793K0053L9555R8117
10318C005608J19949J65708K18679K64872L27509L97489N03773O05594P37206
10309F346387Q47429Q62907P56897O49954O00864O55448P95639J069076J504691
10300A4089292K138898K877974L754020M867533O287424Q544600J2444618J9092815
10292G4097174L0513678M8642694P0236948Q1196851O4197393K0480278k4333410
10285C65031606m8358920n4996490n5785987n2132527m2772438l0733728k0115989
10278F0135527j2849883q427994n732464m092117l185293k593763j954656j324221
10270A9975136q30555m51826j42608J22587K27974K94633N75674J080401J743172
$$ plain form
10261 22594588 25117088 28644191 33555725 40609438 51098074 67072132 92149271 131670513
10253 131670513 190000892 263078851 332500637 372915681 371700014 337637437 287930789
10246 287930789 233728309 180577989 133572866 96671956 70574808 53210086 41723888
10239 41723888 33770444 27975628 23565729 20091123 17272180 15005172 13239828 11964297
10231 11964297 11082472 10483375 9966742 9345973 8618527 7848225 7080894 6369329 5759214
10222 5759214 5253672 4861886 4530758 4205502 3914993 3653918 3417529 3194444 2959842
10213 2959842 2776398 2650877 2525386 2410365 2347992 2292348 2225824 2173699 2117965 2039779
10203 2039779 1929071 1833226 1761127 1691141 1634903 1590233 1550070 1513013 1467136 1409660 1363266
$$ packed form
10261B2594588K522500L527103M911534P053713J0488636J5974058K5077139L9521242
10253A31670513N8330379P3077959O9421786M0415044j215667l4062577m9706648
10246B87930789n4202480n3150320m7005123l6900910k6097148j7364722j1486198
10239D1723888p953444n794816m409899l474606k818943k267008j765344j275531
10231A1964297q81825n99097n16633o20769p27446p70302p67331p11565o10115
10222E759214n05542l91786l31128l25256k90509k61075k36389k23085k34602
10213B959842j83444j25521j25491j15021o2373n5644o6524n2125n5734p8186
10203B039779j10708r5845p2099o9986n6238m4670m0163l7057m5877n7476m6394
$$ plain form
10192 1363266 1330678 1275111 1234203 1210548 1177826 1143441 1127268 1108605 1090585 1062839 1028937
10181 1028937 1017098 990510 956899 908938 866450 837257 816825 797031 784973 780328 792471
10170 792471 810552 806047 786259 728374 674926 658357 717272 894239 1132639 1319783 1376160
10159 1376160 1398271 1498748 1695425 1973835 2349714 2759487 3107035 3267398 3184240 2913379
10149 2913379 2561069 2225858 1881390 1559126 1324229 1155040 1038675 974755 943137 910899
10139 910899 895315 924438 958054 989696 1019394 1034734 1041978 1096685 1129441 1110742 1058410 1023877
10127 1023877 1014731 1088991 1285951 1526329 1725716 1873083 2014500 2203790 2426542 2624174
10117 2624174 2718982 2743667 2707110 2579177 2368717 2115492 1832792 1568190 1351687 1207295
$$ packed form
10192A363266l2588n5567m0908k3655l2722l4385j6173j8663j8020k7746l3902
10181A028937j1839k6588l3611m7961m2488k9193k0432j9794j2058m645J2143
10170G92471J8081m505j9788n7885n3448j6569N8915J76967K38400J87144N6377
10159A376160K2111J00477J96677K78410L75879M09773L47548J60363q3158k70861
10149B913379l52310l35211l44468l22264k34897j69189j16365o3920l1618l2238
10139I10899j5584K9123L3616L1642K9698J5340P244N4707L2756j8699n2332l4533
10127A023877r146P4260J96960K40378J99387J47367J41417J89290K22752J97632
10117B624174R4808K4685l6557j27933k10460k53225k82700k64602k16503j44392
$$ plain form
10107 1207295 1094149 1016194 1005999 1027458 1040293 1006821 933643 832662 731915 640563 578714
10096 578714 560445 599742 672483 724514 773048 784237 775837 738441 711435 706285 693190 654435
10084 654435 626578 610773 607029 594120 549544 489966 470009 440286 391376 396854 392151 368606
10072 368606 381383 381594 363310 364362 351203 335158 322031 319338 325384 348252 342481 309855 271674
10059 271674 245336 256664 257839 269296 288113 308521 333257 383368 418748 423215 409130 396243
10047 396243 392200 421570 427742 451122 457783 454888 489576 545954 610783 710716 857007 986715
10035 986715 1046880 1049542 1005507 935084 812428 705329 603762 524413 457304 410983 401675
10024 401675 393091 371465 341328 323308 317218 316135 315856 325015 313414 298769 314031 325166 314631
$$ packed form
10107A207295j13146p7955j0195K1459J2835l3472p3178j00981j00747r1352o1849
10096E78714j8269L9297P2741N2031M8534J1189q400l7396k7006n150j3095l8755
10084F54435k7857j5805l744j2909m4576n9578j9957k9723m8910N478m703k3545
10072C68606J2777K11j8284J052j3159j6045j3127k693O046K2868n771l2626l8181
10059B71674k6338J1328J175J1457J8817K0408K4736N0111L5380M467j4085j2887
10047C96243m043K9370O172K3380O661k895L4688N6378O4829R9933J46291J29708
10035I86715O0165K662m4035p0423j22656j07099j01567p9349o7109m6321r308
10024D01675q584k1626l0137j8020o090j083k79R159j1601j4645J5262J1135j0535
$$ plain form
10011 314631 300853 303232 299028 280366 248042 253314 256797 259504 269128 279685 275049 272240 264448
9998 264448 252587 267821 261815 260016 256743 251513 261686 289517 294791 290664 294402 280613 264310
9985 264310 276504 282119 273246 261376 237367 231390 221187 179904 137442 110268 100325 116099
9973 116099 150189 183078 190527 193458 191512 194523 196506 200493 191171 164539 165533 186408 189261 199306
9959 199306 200741 197127 199610 189871 178273 177213 189729 194726 181971 195655 185323 175590 176991
9946 176991 191092 198775 203669 200213 157331 104175 66701 24942 -8393 -26341 -19759 5963
9934 5963 34881 56608 73132 86108 101350 117650 120048 107769 119443 152190 157689 159321 148226
9921 148226 136744 119273 137102 162473 165132 162542 156364 148697 148961 159991 163016 182064 190690
$$ packed form
10011C14631j3778K379m204j8662l2324N272L483K707R624J0557m636k809p792
9998B64448j1861J5234o006j799l273n230J0173K7831N274m127L738j3789j6303
9985B64310J2194N615q873j1870k4009n977j0203m1283m2462k7174r943J5774
9973A16099L4090L2889P449K931j946L011J983L987r322k6632R94K0875K853J0045
9959A99306J435l614K483r739j1598j060J2516M997j2755J3684j0332r733J401
9946A76991J4101P683M894l456m2882n3156l7474m1759l3335j7948O582K5722
9934E963K8918K1727J6524J2976J5242J6300K398j2279J1674L2747N499J632j1095
9921A48226j1482j7471J7829K5371K659k590o178p667K64J1030L025J9048Q626
$$ plain form
9908 190690 201325 195147 203980 219992 226217 221962 224824 222054 227083 257489 271461 281140 293575
9895 293575 291423 290010 315427 371592 436893 519573 608215 737947 915102 1179784 1594480
9884 1594480 2195107 2889204 3560000 4087411 4353292 4307770 3954763 3396791 2791793 2211949
9874 2211949 1710852 1313660 1011084 807076 653716 548290 496310 449503 403220 371349
9864 371349 341545 315476 328073 337122 354789 365438 379266 372124 350201 324487 318660 324412
9852 324412 337276 353524 362425 348652 358618 399991 468997 577924 758814 1004908 1329697
9841 1329697 1732127 2069420 2208361 2125503 1902600 1619280 1323036 1056630 829332 655088
9831 655088 532145 456436 392044 346914 335844 316685 310825 303890 283861 265582 240382 196752
$$ packed form
9908A90690J0635o178Q833J6012O225m255K862k770N029L0406J3972R679J2435
9895B93575k152j413K5417N6165O5301Q2680Q8642J29732J77155K64682M14696
9884A594480O00627O94097O70796N27411K65881m5522l53007n57972o04998n79844
9874B211949n01097l97192l02576k04008j53360j05426n1980m6807m6283l1871
9864C71349k9804k6069J2597R049J7667J0649J3828p142k1923k5714n827N752
9852C24412J2864J6248Q901j3773R966M1373O9006J08927J80890K46094L24789
9841A329697M02430L37293J38941q2858k22903k83320k96244k66406k27298j74244
9831F55088j22943p5709o4392m5130j1070j9159n860o935k0029j8279k5200m3630
$$ plain form
9819 196752 161707 142713 130524 141259 158021 153264 155013 164234 148180 131490 118966 110736
9807 110736 101359 107490 121403 136828 150007 146655 135977 130372 131865 131946 145997 157024 149864
9794 149864 130099 119156 128404 151800 149487 141707 164022 175611 158438 133850 126346 110981
9782 110981 108130 110882 121406 108413 93394 95894 102709 103740 131674 120403 122123 134158 148977
9769 148977 152073 154570 154760 159272 169759 178112 185371 212179 256829 288205 312759 385180 489724
9756 489724 602058 720583 856345 970490 996195 914704 811370 723933 669080 622248 594523
9745 594523 624337 717409 855787 1031038 1241568 1501159 1767658 1989718 2132019 2195755
9735 2195755 2165407 2023831 1808233 1567860 1329469 1084810 895282 729016 590554 476591
$$ packed form
9819A96752l5045j8994j2189J0735J6762m757J749R221j6054j6690j2524q230
9807A10736r377O131J3913J5425J3179l352j0678n605J493Q1J4051J1027p160
9794A49864j9765j0943R248K3396k313p780K2315J1589j7173k4588p504j5365
9782A10981k851K752J0524j2993j5019K500O815J031K7934j1271J720J2035J4819
9769A48977L096K497J90M512J0487Q353P259K6808M4650L1376K4554P2421J04544
9756D89724J12334J18525J35762J14145K5705q1491j03334q7437n4853m6832k7725
9745E94523K9814R3072J38378J75251K10530K59591K66499K22060J42301O3736
9735B195755l0348j41576k15598k40373k38391k44659j89528j66266j38462j13963
$$ plain form
9725 476591 407887 376638 352011 339819 327318 346087 365093 373522 394099 425461 479322 563129
9713 563129 642235 691343 693285 620559 549051 489503 436095 387752 371248 354544 343434 339442
9701 339442 321744 347259 377481 401011 455146 506711 582669 656221 686549 640919 590377 505760
9689 505760 433995 379723 309153 256500 226156 182801 170467 205909 211173 208195 207423 210877 210224
9676 210224 210586 218819 221846 219319 200491 180095 175447 186251 193720 197838 202356 205243 209444 215347
9662 215347 219946 219699 208893 205830 222560 227829 214612 207649 215438 239417 253160 239417 221372
9649 221372 215092 218327 217050 231924 241722 249634 262303 262952 283661 292393 275222 265425 249933
9636 249933 235998 232522 224210 218221 217919 211590 212967 232151 219606 208774 212664 200038 183646
$$ packed form
9725D76591o8704l1249k4627j2192j2501J8769J9006Q429K0577L1362N3861Q3807
9713E63129P9106M9108J942p2726p1508n9548n3408m8343j6504j6704j1110l992
9701C39442j7698K5515L0222K3530N4135N1565P5958P3552L0328m5630n0542q4617
9689E05760p1765n4272p0570n2653l0344m3355j2334L5442N264k978p72L454o53
9676B10224L62Q233L027k527j8828k0396m648J0804P469M118M518K887M201N903
9662B15347M599k47j0806l063J6730N269j3217o963P789K3979J3743j3743j8045
9649B21372o280L235j277J4874R798P912J2669O49K0709Q732j7171r797j5492
9636B49933j3935l476q312n989l02o329J377J9184j2545j0832L890j2626j6392
$$ plain form
9623 183646 183310 163325 174155 162317 159668 143947 143690 145929 148495 144298 138740 132604 134951 153800
9609 153800 150628 142157 128396 128017 148894 169510 185335 183307 189601 197206 191132 191107 205865 208940
9595 208940 207372 202850 185954 170855 172048 172784 185005 181777 188268 209114 182404 158184 164990
9582 164990 175311 191109 178521 163575 160517 172098 193163 210573 210381 204244 184525 167273
9570 167273 172844 193732 215470 215956 212155 226961 248038 234117 224504 208306 203481 210277 227895
9557 227895 231093 222133 221131 219801 214411 224573 249420 248334 254252 276793 271650 279155 274700 268751
9543 268751 274443 300535 320364 315408 313728 300549 304138 299465 302208 301980 297119 321171 343310
9530 343310 338223 329330 333844 346824 345739 327776 337256 341649 357824 355202 373924 378950 376193
$$ packed form
9623A83646l36j9985J0830j1838k649j5721k57K239K566m197n558o136K347J8849
9609A53800l172q471j3761l79K0877K0616J5825k028O294P605o074k5J4758L075
9595B08940j568m522j6896j5099J193P36J2221l228O491K0846k6710k4220O806
9582A64990J0321J5798j2588j4946l058J1581K1065J7410j92o137j9719j7252
9570A67273N571K0888K1738M86l801J4806K1077j3921r613j6198m825O796J7618
9557B27895L198q960j002j330n390J0162K4847j086N918K2541n143P505m455n949
9543B68751N692K6092J9829m956j680j3179L589m673K743k28m861K4052K2139
9530C43310n087q893M514J2980j085j7963R480M393J6175k622J8722N026k757
$$ plain form
9517 376193 359406 365436 366611 368940 386573 389958 394885 408259 417967 445077 460058 449831 443113
9504 443113 461418 463612 479057 484038 492028 505861 522876 548177 583242 601521 612918 624684
9492 624684 634740 631649 635435 664767 710584 733596 764096 795487 825267 864780 886882 924765
9480 924765 966757 973293 977245 1025594 1040968 1055292 1074068 1122624 1177720 1227162 1281716 1323948
9468 1323948 1357569 1392039 1435576 1493981 1545653 1570986 1599600 1626782 1652559 1684628 1713894
9457 1713894 1719130 1731111 1741927 1766290 1807873 1827426 1840209 1851664 1857398 1849733 1836777 1833334
9445 1833334 1835869 1846587 1844743 1835862 1846903 1833881 1821322 1819281 1791276 1760787 1747217 1734415
9433 1734415 1688041 1639188 1612245 1593883 1583845 1560832 1536399 1527562 1502107 1475912 1455736 1422911
$$ packed form
9517C76193j6787O030J175K329J7633L385M927J3374R708K7110J4981j0227o718
9504D43113J8305K194J5445M981P990J3833J7015K5301L5065J8279J1397J1766
9492F24684J0056l091L786K9332M5817K3012L0500L1391K9780L9513K2102L7883
9480I24765M1992O536L952M8349J5374J4324J8776M8556N5096M9442N4554M2232
9468A323948L3621L4470M3537N8405N1672K5333K8614K7182K5777L2069K9266
9457A713894N236J1981J0816K4363M1583J9553J2783J1455N734p665j2956l443
9445A833334K535J0718j844q881J1041j3022j2559k041k8005l0489j3570j2802
9433A734415m6374m8853k6943j8362j0038k3013k4433q837k5455k6195k0176l2825
$$ plain form
9421 1422911 1395565 1378029 1353677 1339112 1324243 1288245 1252985 1235996 1228137 1208659 1179876 1183438
9409 1183438 1159114 1129506 1123923 1122576 1136470 1125874 1070920 1039227 1032789 1033174 1044118 1051315 1046404
9396 1046404 1028460 1016085 1010554 1021709 1034719 1029983 1023885 996327 940916 913148 912759 893611
9384 893611 908687 913731 915377 889738 891641 899482 877262 863989 860332 867291 868207 860496 849306
9371 849306 846190 840483 848182 849129 856054 867499 868479 868492 857913 861891 880175 875386 860111 856451
9357 856451 873218 880139 880245 885514 893538 903884 910338 884906 867588 857223 850300 849616 871373
9344 871373 882658 902784 927436 931137 919445 939471 947925 958298 950245 979553 1002081 991832
9332 991832 979438 990177 1010930 1043444 1062037 1071153 1079485 1090773 1111726 1143005 1183607 1221212
$$ packed form
9421A422911k7346j7536k4352j4565j4869l5998l5260j6989p859j9478k8783L562
9409A183438k4324k9608n583j347J3894j0596n4954l1693o438L85J0944P197m911
9396A046404j7944j2375n531J1155J3010m736o098k7558n5411k7768l89j9148
9384H93611J5076N044J646k5639J903P841k2220j3273l657O959R16p711j1190
9371H49306l116n707P699R47O925J1445R80J3j0579L978J8284m789j5275l660
9357H56451J6767O921J06N269Q024J0346O454k5432j7318j0365o923o84K1757
9344H71373J1285K0126K4652L701j1692K0026Q454J0373q053K9308K2528j0249
9332I91832j2394J0739K0753L2514J8593R116Q332J1288K0953L1279M0602L7605
$$ plain form
9320 1221212 1231332 1236417 1238861 1256994 1280909 1295556 1315146 1351435 1391854 1431979 1461228 1488165
9308 1488165 1526645 1562977 1602723 1646449 1689010 1734799 1795261 1860358 1915250 1978237 2048603
9297 2048603 2110372 2163106 2237999 2319420 2408504 2505332 2596770 2694713 2790959 2888230 3001875
9286 3001875 3117989 3240233 3385104 3523845 3667300 3836166 4010298 4189550 4397205 4604941
9276 4604941 4816635 5044549 5278329 5519549 5766837 6042613 6320586 6616947 6939046 7284159
9266 7284159 7608817 7960486 8346448 8728290 9115730 9532750 9946756 10372071 10855777 11355442
9256 11355442 11868438 12376459 12878005 13393203 13912618 14467764 15035614 15618430 16194032
9247 16194032 16755148 17307589 17851487 18394180 18889645 19356178 19790469 20194944 20532645
$$ packed form
9320A221212J0120N085K444J8133K3915J4647J9590L6289M0419M0125K9249K6937
9308A488165L8480L6332L9746M3726M2561M5789O0462O5097N4892O2987P0366
9297B048603O1769N2734P4893Q1421Q9084R6828R1438R7943R6246R7271J13645
9286C001875J16114J22244J44871J38741J43455J68866J74132J79252K07655K07736
9276D604941K11694K27914K33780K41220K47288K75776K77973K96361L22099L45113
9266G284159L24658L51669L85962L81842L87440M17020M14006M25315M83706M99665
9256A1355442N12996N08021N01546N15198N19415N55146N67850N82816N75602
9247A6194032N61116N52441N43898N42693M95465M66533M34291M04475L37701
$$ plain form
9238 20532645 20800271 21004159 21152916 21204882 21199187 21122122 20962881 20754576 20482068 20157126
9228 20157126 19793706 19344058 18792624 18187319 17565093 16925846 16275298 15623260 14989127
9219 14989127 14379942 13790091 13215739 12678366 12172451 11692127 11265790 10854524 10438493
9210 10438493 10044900 9632520 9225736 8818514 8400055 8016642 7664342 7316295 6984888
9201 6984888 6673302 6385873 6121918 5863534 5614779 5410288 5261778 5144858 5085815 5043991
9191 5043991 5014693 4937270 4783135 4528917 4235645 3944940 3676998 3432547 3229771 3044868
9181 3044868 2890724 2755580 2627766 2516257 2422840 2351849 2282300 2196258 2134668 2097825 2066833
9170 2066833 2005188 1932290 1840322 1731800 1634681 1551382 1459516 1390982 1330928 1261775 1222491
$$ packed form
9238B0532645K67626K03888J48757N1966n695p7065j59241k08305k72508l24942
9228B0157126l63420m49648n51434o05305o22226o39247o50548o52038o34133
9219A4989127o09185n89851n74352n37373n05915m80324m26337m11266m16031
9210A0438493l93593m12380m06784m07222m18459l83413l52300l48047l31407
9201F984888l11586k87429k63955k58384k48755k04491j48510j16920n9043m1824
9191E043991k9298p7423j54135k54218k93272k90705k67942k44451k02776j84903
9181C044868j54144j35144j27814j11509r3417p0991o9549q6042o1590l6843l0992
9170B066833o1645p2898r1968j08522r7119q3299r1866o8534o0054o9153l9284
$$ plain form
9159 1222491 1208705 1214182 1223368 1237668 1260718 1274557 1268400 1241259 1176896 1095246 1001196 943363
9147 943363 890898 832386 780003 739757 717244 693667 684155 654232 640683 632167 612923 589131
9135 589131 566163 544973 522820 510694 478060 477135 490730 484093 466094 467857 443751 410923
9123 410923 411752 422333 410440 398704 399273 416625 421489 413419 414070 404751 387378 371893 368264 366214
9109 366214 371974 372771 353889 330452 317210 323448 329939 324135 317641 318723 305824 305617 315566 322676
9095 322676 316621 311068 316464 320235 322516 313556 301223 296766 285934 275080 273027 278964 301387
9082 301387 311897 303070 300204 300399 285808 305525 308886 292822 301415 285091 263598 250990 260554
9069 260554 265446 258990 252920 233197 231800 238098 238300 235776 232067 253336 253651 243744 233482 232045
$$ packed form
9159A222491j3786N477R186J4300K3050J3839o157k7141o4363q1650r4050n7833
9147I43363n2465n8512n2383m0246k2513k3577r512k9923j3549q516j9244k3792
9135E89131k2968k1190k2153j2126l2634r25J3595o637j7999J763k4106l2828
9123D10923Q29J0581j1893j1736N69J7352M864q070O51r319j7373j5485l629k050
9109C66214N760P97j8882k3437j3242O238O491n804o494J082j2899k07R949P110
9095C22676o055n553N396L771K281q960j2333m457j0832j0854k053N937K2423
9082C01387J0510q827k866J95j4591J9717L361j6064Q593j6324k1493j2608R564
9069B60554M892o456o070j9723j397O298K02k524l709K1269L15r907j0262j437
$$ plain form
9055 232045 226617 225063 220282 227507 244775 242629 244396 249243 236073 226137 218580 213490 199188 186527
9041 186527 193245 191812 193649 194631 195365 183884 193543 184997 203150 215269 210364 189600 171433 173168
9027 173168 175267 188160 176821 166798 155482 155213 171431 168327 160661 167385 167367 178031 187843 189896
9013 189896 182778 189937 205671 178846 142653 138610 134323 118027 111618 116384 130423 160425 170334
9000 170334 139430 133588 137352 137598 141698 139249 150985 154072 142337 147657 142580 148432 155901 135170
8986 135170 131884 134796 141238 137360 135513 122714 128023 135363 134924 121105 123656 125813 123067 105102
8972 105102 106319 105944 114461 116190 101330 105168 109843 119954 121973 126735 119277 108917 88662 98193
8958 98193 108410 112996 114461 127139 144508 155914 156056 149518 127053 130894 131824 122831 120577 117187
$$ packed form
9055B32045n428j554m781P225J7268k146J767M847j3170r936p557n090j4302j2661
9041A86527O718j433J837R82P34j1481R659q546J8153J2119m905k0764j8167J735
9027A73168K099J2893j1339j0023j1316k69J6218l104p666O724j8J0664R812K053
9013A89896p118P159J5734k6825l6193m043m287j6296o409M766J4039L0002R909
9000A70334l0904n842L764K46M100k449J1736L087j1735N320n077N852P469k0731
8986A35170l286K912O442l878j847j2799N309P340m39j3819K551K157k746j7965
8972A05102J217l75Q517J729j4860L838M675J0111K019M762p458j0360k0255R531
8958I8193J0217M586J465J2678J7369J1406J42o538k2465L841R30q993k254l390
$$ plain form
8944 117187 107737 113220 104994 81002 79217 91557 81722 75482 71022 67391 92542 104050 103531 92685
8930 92685 105021 105677 102819 103519 103107 90267 101774 105461 104133 109166 98344 120220 131952 152258
8916 152258 146636 154374 154448 168899 169817 163853 201081 220071 213203 194884 203601 211087 207835 217389
8902 217389 217595 202847 218530 217856 208028 209984 191295 186710 194067 177784 181290 189103 185599 181392
8888 181392 185974 185389 175162 176497 180909 177093 165405 161877 167759 189077 197356 207274 226571 239465
8874 239465 260308 284042 294303 316481 362173 440032 561378 736114 961559 1130381 1172069
8863 1172069 1095215 994659 878483 765280 660064 558779 485410 453574 440149 429915
8853 429915 395617 371253 355982 355002 333491 314017 282481 258054 224551 214258 216777 200054
$$ packed form
8944A17187r450N483q226k3992j785J2340r835o240m460l631K5151J1508n19j0846
8930I2685J2336O56k858P00m12j2840J1507L687j328N033j0822K1876J1732K0306
8916A52258n622P738P4J4451R18n964L7228J8990o868j8319Q717P486l252R554
8902B17389K06j4748J5683o74r828J956j8689m585P357j6283L506P813l504m207
8888A81392M582n85j0227J335M412l816j1688l528N882K1318Q279R918J9297J2894
8874B39465K0843K3734J0261K2178M5692P7859J21346J74736K25445J68822M1688
8863A172069p6854j00556j16176j13203j05216j01285p3369l1836j3425j0234
8853D29915l4298k4364j5271r80k1511j9474l1536k4427l3503j0293K519j6723
$$ plain form
8841 200054 184922 187335 193125 182994 178676 181910 168934 166351 166226 154457 161373 158791 145257
8828 145257 148846 151515 136778 134119 146695 175870 171761 159453 153067 165452 173595 166131 177392
8815 177392 201820 224169 248104 244544 236876 254141 252922 248894 243637 252179 247234 233777 225215
8802 225215 213263 209618 202091 185736 176407 152904 135472 149474 163020 166944 160868 170783 164807
8789 164807 149545 129333 114021 122561 112207 106227 95416 85484 86865 92606 103897 105312 102386
8776 102386 85139 81378 110843 120610 110826 95460 78432 87535 103197 107765 94986 97607 102739
8763 102739 95785 114270 129368 140370 136237 139746 151854 142057 117216 110904 115992 119806 93567
8750 93567 69288 64469 51447 44878 41719 43984 58085 70183 68865 69447 64816 61668 72256 81878
$$ packed form
8841B00054j5132K413N790j0131m318L234j2976k583j25j1769O916k582j3534
8828A45257L589K669j4737k659J2576K9175m109j2308o386J2385Q143p464J1261
8815A77392K4428K2349K3935l560p668J7265j219m028n257Q542m945j3457q562
8802B25215j1952l645p527j6355r329k3503j7432J4002J3546L924o076R915n976
8789A64807j5262k0212j5312Q540j0354n980j0811r932J381N741J1291J415k926
8776A02386j7247l761K9465R767r784j5366j7028R103J5662M568j2779K621N132
8763A02739o954J8485J5098J1002m133L509J2108r797k4841o312N088L814k6239
8750I3567k4279m819j3022o569l159K265J4101J2098j318N82m631l148J0588R622
$$ plain form
8736 81878 60333 67794 73692 62108 55202 40722 32122 11407 21121 38803 33009 38077 49124
8723 49124 58265 57230 90708 102008 79503 63575 57125 51419 70881 82767 79535 85619 84715
8710 84715 96026 104336 110631 83074 60883 76082 83985 70060 59624 65283 84241 99692 92271
8697 92271 82797 74658 78653 68907 66311 66263 60342 40864 23780 38834 63481 88718 95502 101222
8683 101222 96810 75000 63869 60756 66950 56301 62488 70784 69455 60282 57497 66428 83672
8670 83672 81134 82022 94807 97507 82582 88406 80863 61586 49207 41269 46666 58335 51129 54691
8656 54691 58121 48058 37987 39694 62099 70259 63395 61916 57027 67025 98138 113190 103754
8643 103754 93927 88941 86751 72380 77723 87444 97859 107804 125944 142423 131649 124652 105187
$$ packed form
8736H1878k1545P461N898j1584o906j4480q600k0715R714J7682n794N068J1047
8723D9124R141j035L3478J1300k2505j5928o450n706J9462J1886l232O084r04
8710H4715J1311Q310O295k7557k2191J5199P903j3925j0436N659J8958J5451p421
8697I2271r474q139L995r746k596m8n921j9478j7084J5054K4647K5237O784N720
8683A01222m412k1810j1131l113O194j0649O187Q296j329r173k785Q931J7244
8670H3672k538Q88J2785K700j4925N824p543j9277j2379p938N397J1669p206L562
8656E4691L430j0063j0071J707K2405Q160o864j479m889R998L1113J5052r436
8643A03754r827m986k190j4371N343R721J0415R945J8140J6479j0774o997j9465
$$ plain form
8630 105187 110889 97306 92888 73863 58718 81630 83906 62165 58772 69602 82301 87451 79234
8617 79234 73776 94161 109265 101471 90903 111918 106062 94972 93386 93735 102149 119942 118958 108190
8603 108190 97659 110296 129928 117678 125863 142280 144926 151243 154973 170997 186219 209617
8591 209617 238231 262451 271165 268138 283928 293198 260835 220506 191321 190999 168022 136293 139555
8578 139555 123208 110630 102607 105765 104739 89401 78255 83335 91291 98853 124779 125899 114072
8565 114072 123518 114377 104019 111810 116985 123224 120221 123646 139190 133778 128590 143805 176003
8552 176003 192330 201621 201410 205427 202619 228759 272014 301521 327705 313413 327322 340711 335419
8539 335419 320903 308552 282932 257384 244333 231059 207665 200013 195407 188938 190726 184039 183339
$$ packed form
8630A05187N702j3583m418j9025j5145K2912K276k1741l393J0830J2699N150q217
8617G9234n458K0385J5104p794j0568K1015n856j1090j586L49Q414J7793r84j0768
8603A08190j0531J2637J9632j2250Q185J6417K646O317L730J6024J5222K3398
8591B09617K8614K4220Q714l027J5790R270l2363m0329k9185l22k2977l1729L262
8578A39555j6347j2578q023L158j026j5338j1146N080P956P562K5926J120j1827
8565A14072R446r141j0358P791N175O239l003L425J5544n412n188J5215L2198
8552A76003J6327R291k11M017k808K6140M3255K9507K6184j4292J3909J3389n292
8539C35419j4516j2351k5620k5548j3051j3274k3394p652m606o469J788o687p00
$$ plain form
8526 183339 200900 210144 205149 217212 235959 244579 227470 218569 211781 223886 235976 227042 214738
8513 214738 221063 221381 212921 237706 268619 283232 291647 301335 310697 336834 336935 354756 376846
8500 376846 390669 402651 408676 424612 421113 415614 440258 452913 431848 405300 377250 339387
8488 339387 326009 296281 283473 280254 280495 278596 280423 286534 291207 295405 292682 288031 292327 319396
8474 319396 311123 310410 300605 253858 226422 218263 189094 169547 159549 155089 165141 178046 179358
8461 179358 177138 183045 193445 211881 213900 206965 222963 245243 253492 248234 269965 271202 265609
8448 265609 242604 240792 230646 210027 191848 178284 165802 154978 145901 151248 145736 130307
8436 130307 131485 128685 121797 122984 123888 141460 143239 142150 141187 130815 135628 161288 160965 143471
$$ packed form
8526A83339J7561R244m995J2063J8747Q620j7109q901o788J2105J2090q934j2304
8513B14738O325L18q460K4785L0913J4613Q415R688R362K6137J01J7821K2090
8500C76846J3823J1982O025J5936l499n499K4644J2655k1065k6548k8050l7863
8488C39387j3378k9728j2808l219K41j899J827O111M673M198k723m651M296K7069
8474C19396q273p13r805m6747k7436q159k9169j9547r998m460J0052J2905J312
8461A79358k220N907J0400J8436K019o935J5998K2280Q249n258K1731J237n593
8448B65609k3005j812j0146k0619j8179j3564j2482j0824r077N347n512j5429
8436A30307J178k800o888J187R04J7572J779j089r63j0372M813K5660l23j7494
$$ plain form
8422 143471 122635 116053 114920 118007 127274 118595 102994 113052 120291 118666 101547 76291 61270
8409 61270 70088 71286 80129 113291 144059 137867 127148 113408 98552 100574 90638 77661 66742
8396 66742 69106 75037 77248 63699 36603 53287 63968 47833 34220 50467 49319 54134 76328
8383 76328 74424 79604 73084 70628 69259 85823 86290 85468 85774 92336 87577 77011 53649 57818 57823
8368 57823 37004 17101 41887 55388 34636 40357 51298 49723 56692 65756 56566 32705 35115
8355 35115 39186 32460 41280 26842 19135 28680 43179 46816 54866 59710 48400 30360 33382 21626
8341 21626 28711 41214 39049 39659 32545 42821 53082 60384 71800 81548 70556 45687 45713 45023
8327 45023 51185 44604 45813 43865 40149 34994 29816 33271 56952 58075 56536 62926 71168 63954
$$ packed form
8422A43471k0836o582j133L087R267q679j5601J0058P239j625j7119k5256j5021
8409F1270Q818J198Q843L3162L0768o192j0719j3740j4856K022r936j2977j0919
8396F6742K364N931K211j3549k7096J6684J0681j6135j3613J6247j148M815K2194
8383G6328j904N180o520k456j369J6564M67q22L06O562m759j0566k3362M169N
8368E7823k0819j9903K4786J3501k0752N721J0941j575O969R064r190k3861K410
8355C5115M071o726Q820j4438p707R545J4499L637Q050M844j1310j8040L022j1756
8341B1626P085J2503k165O10p114J0276J0261P302J1416R748j0992k4869K6o90
8327D5023O162o581J209j948l716n155n178L455K3681J123j539O390Q242p214
$$ plain form
8313 63954 56611 43896 40541 50452 54955 69135 90682 83101 71188 68190 73816 62418 39280
8300 39280 22023 20355 19770 22254 20493 8368 6090 41115 55943 65843 50078 39201 33619
8287 33619 31670 27054 34128 41651 39450 18756 22426 26862 36037 29145 23373 16888 18805 35687
8273 35687 36232 38228 31508 47127 53170 63698 60518 39472 44728 52490 40887 39970 21665 13469
8259 13469 28804 31178 27120 12252 11385 13570 18147 26176 25490 26552 38605 44288 52984 55483
8245 55483 47224 46647 35538 11199 1233 1333 4735 7519 5135 4491 23849 49637 45113 41344
8231 41344 41670 59951 55152 44176 35509 28346 16899 19048 12241 17888 27091 32561 37774 23614
8217 23614 29440 10545 956 4466 18950 36703 41570 31509 24920 25211 21057 11719 10317 9496
$$ packed form
8313F3954p343j2715l355R911M503J4180K1547p581j1913k998N626j1398k3138
8300C9280j7257j668n85K484j761j2125k278L5025J4828R900j5765j0877n582
8287C3619j949m616P074P523k201k0694L670M436R175o892n772o485J917J6882
8273C5687N45J996o720J5619O043J0528l180k1046N256P762j1603r17j8305q196
8259A3469J5335K374m058j4868q67K185M577Q029o86J062J2053N683Q696K499
8245E5483q259n77j1109k4339r966J00L402K784k384o44J9358K5788m524l769
8231D1344L26J8281m799j0976q667p163j1447K149o807N647R203N470N213j4160
8217B3614N826j8895r589L510J4484J7753M867j0061o589K91m154r338j402q21
$$ plain form
8203 9496 31328 36613 14812 7496 12806 13913 4297 -10708 -30648 -22558 -61 14320 19909
8190 19909 20418 15641 -4900 -20493 -7913 12954 22841 25156 25778 15949 23621 16213 18713 16990
8176 16990 20610 19904 22708 4358 -5761 2095 -3375 3570 19399 27301 35080 31563 37805 37362
8162 37362 51053 64670 75386 69181 60484 45274 41068 19699 7118 36940 51296 43763 43487
8149 43487 40997 31327 40286 39863 36456 28829 31972 30299 25070 27158 35586 26635 15279 12002 5092
8134 5092 14125 43390 66985 68475 30402 19069 21956 28916 37381 48010 50676 50370 60533 55472
8120 55472 40172 21608 12845 41128 64100 46410 43493 62712 74146 63302 40052 40518 42801
8107 42801 30757 25681 26775 38868 58995 75364 86236 93648 79075 69271 54772 45728 42225
$$ packed form
8203I496K1832N285k1801p316N310J107r616j5005j9940Q090K2497J4381N589
8190A9909N09m777k0541j5593J2580K0867R887K315O22r829P672p408K500j723
8176A6990L620p06K804j8350j0119P856n470O945J5829P902P779l517O242m43
8162C7362J3691J3617J0716o205q697j5210m206k1369j2581K9822J4356p533k76
8149D3487k490r670Q959m23l407p627L143j673n229K088Q428q951j1356l277o910
8134E092R033K9265K3595J490l8073j1333K887O960Q465J0629K666l06J0163n061
8120E5472j5300j8564q763K8283K2972j7690k917J9219J1434j0844k3250M66K283
8107D2801j2044n076J094J2093K0127J6369J0872P412j4573r804j4499r044l503
$$ plain form
8094 42225 33030 20381 13874 13154 22274 15921 6271 11842 21421 27577 49564 60013 44637 46556
8080 46556 47618 50769 65230 60460 54861 55362 57590 53927 45741 49347 56981 68125 72301 56104
8066 56104 65137 76372 72951 72513 77970 76529 42512 42253 58789 59884 52177 65545 64487 61608
8052 61608 66547 70413 65305 43772 39619 39652 42719 24599 16021 16667 17963 11141 -2323 -6846 -4264
8037 -4264 15758 12020 11734 13362 26429 33136 24552 30769 28408 38353 44657 42426 28859 26412
8023 26412 45160 59803 55863 56405 64059 55619 42931 34961 43067 42852 30672 48236 69858 83850
8009 83850 72517 54388 50446 63252 72050 63927 52595 48228 48718 35997 22729 13959 12690
7996 12690 19074 17833 9464 16246 32933 43226 61133 48944 34286 41375 45589 29291 24638
$$ packed form
8094D2225r195j2649o507p20R120o353r650N571R579O156K1987J0449j5376J919
8080D6556J062L151J4461m770n599N01K228l663q186L606P634J1144M176j6197
8066E6104R033J1235l421m38N457j441l4017k59J6536J095p707J3368j058k879
8052F1608M939L866n108k1533m153L3L067j8120q578O46J296o822j3464m523K582
8037d264K0022l738k86J628J3067O707q584O217k361R945O304k231j3567k447
8023B6412J8748J4643l940N42P654q440j2688p970Q106k15j2180J7564K1622J3992
8009H3850j1333j8129l942J2806Q798q123j1332m367M90j2721j3268q770j269
7996A2690O384j241q369O782J6687J0293J7907j2189j4658P089M214j6298m653
$$ plain form
7983 24638 21933 28267 34802 25363 22982 38377 49169 49476 54575 56570 41166 25941 28734 25925
7969 25925 13652 7635 28625 26248 35223 59970 59647 67593 57213 41260 34634 41068 72173
7956 72173 69311 60791 46287 33227 32514 31689 54077 69591 59565 56338 62267 54966 53521 45217
7942 45217 50155 44390 49849 43121 53443 63355 76308 88355 97877 100413 108394 117846 105873 113463
7928 113463 147449 183199 211281 256191 320802 383992 429633 485009 575253 596362 580353 562756
7916 562756 511410 427343 347060 277032 208036 184455 176191 185476 189124 164578 157293 157493 165727
7903 165727 165342 147454 149354 145541 145385 124901 107294 108624 118931 120013 106549 105855 126861 157700
7889 157700 146320 136129 147395 144078 147942 157885 179228 225322 256908 296421 374547 472115
$$ packed form
7983B4638k705O334O535r439k381J5395J0792L07N099J995j5404j5225K793k809
7969B5925j2273o017K0990k377Q975K4747l23P946j0380j5953o626O434L1105
7956G2173k862q520j4504j3060p13q25K2388J5514j0026l227N929p301j445q304
7942D5217M938n765N459o728J0322R912J2953J2047R522K536P981R452j1973P590
7928A13463L3986L5750K8082M4910O4611O3190M5641N5376R0244K1109j6009j7597
7916E62756n1346q4067q0283p0028o8996k3581q264R285L648k4546p285K00Q234
7903A65727l85j7888J900l813j56k0484j7607J330J0307J082j3464o94K1006L0839
7889A57700j1380j0191J1266l317L864R943K1343M6094L1586L9513P8126R7568
$$ plain form
7877 472115 610399 791901 984785 1124987 1176982 1153117 1063945 945228 811470 666000
7867 666000 562363 505263 466240 444507 439022 415883 408140 386524 362160 330137 274901 233746
7855 233746 212628 184560 180574 167487 128729 120565 118006 125717 131111 130383 133964 133537 137445 145261
7841 145261 147725 138291 141673 144592 143592 149485 175629 221889 268417 317741 374417 425732 455493
7828 455493 481419 497975 494243 465575 436156 384081 345291 291190 258450 227661 214720 202560
7816 202560 168171 149561 144916 136523 114870 97027 90965 88456 71395 70151 66971 67262 66362 86988
7802 86988 96533 82132 80617 70649 55535 54351 44558 49475 45828 53481 56668 55511 51158 45595
7788 45595 41506 51755 45116 19369 6578 6195 25247 17964 22079 24706 42974 46315 39341 44947
$$ packed form
7877D72115J38284J81502J92884J40202N1995k3865q9172j18717j33758j45470
7867F66000j03637n7100l9023k1733n485k3139p743k1616k4364l2023n5236m1155
7855B33746k1118k8068l986j3087l8758q164k559P711N394p28L581m27L908P816
7841A45261K464r434L382K919j000N893K6144M6260M6528M9324N6676N1315K9761
7828D55493K5926J6556l732k8668k9419n2075l8790n4101l2740l0789j2941j2160
7816B02560l4389j8610m645q393k1653j7843o062k509j7061j244l180K91r00K0626
7802H6988R545j4401j515r968j5114j184r793M917l647P653L187j157m353n563
7788D5595m089J0249o639k5747j2791l83J9052p283M115K627J8268L341o974N606
$$ plain form
7774 44947 56270 48598 29976 37021 30287 24156 16023 16889 38181 42985 45244 38869 44332 56505
7760 56505 46457 35987 34028 16391 17398 16616 7693 12464 41351 39499 49478 51454 20941 19644
7746 19644 29827 45084 56180 43668 24275 13358 1273 5701 32032 38828 33962 43149 17603
7733 17603 9480 16825 24586 18891 2553 -9989 -16493 -21338 -10881 -8620 -12684 -13535 8049 18472
7719 18472 13008 7853 1070 -8412 -9577 -3011 9032 11863 -881 9239 2975 -3613 4277 -3535
7705 -3535 -7649 1781 11372 10489 3567 -14127 -23796 -8233 11944 9603 20449 30412 31628 16834
7691 16834 7253 4484 -7422 -7570 -6181 948 6096 5856 12889 -4727 1806 1461 11652 -4814
7677 -4814 -32545 -26127 -33082 -21989 -28183 -20414 -670 130 -16758 -13989 -721 12672 16923 21614
$$ packed form
7774D4947J1323p672j8622P045o734o131q133Q66K1292M804K259o375N463J2173
7760E6505j0048j0470j959j7637J007p82q923M771K8887j852R979J976l0513j297
7746A9644J0183J5257J1096j2512j9393j0917j2085M428K6331O796m866R187k5546
7733A7603q123P345P761n695j6338j2542o504m845J0457K261m064q51K1584J0423
7719A8472n464n155o783r482j165O566J2043K831j2744J0120o264o588P890p812
7705c535m114R430R591q83o922j7694r669J5563K0177k341J0846R963J216j4794
7691A6834r581k769j1906j48J389P129N148k40P033j7616O533l45J0191j6466
7677d814k7731O418o955J1093o194P769J9744Q00j6888K769J3268J3393M251M691
$$ plain form
7663 21614 15615 12326 23975 14289 5733 13761 32826 38539 43166 44616 44886 21549 14369 14419 21242
7648 21242 44166 37079 7519 -7799 -6515 -2449 3453 -3283 -23740 -4790 9806 -1332 -21717
7635 -21717 -27745 -1098 22632 33157 25140 25665 23556 10051 -1507 -2608 6613 14465 11844 25014
7621 25014 41395 49876 32856 13457 14067 22290 26198 6168 1956 -596 -2497 4684 -2801 -2049
7607 -2049 1814 -2960 -26034 -31875 -25555 -21278 -26437 -11314 -20910 -25572 630 18251 14505 13259
7593 13259 13250 9072 13444 11677 6123 25314 39195 25353 23031 17545 -4933 -15137 6280 26794
7579 26794 13103 -864 19192 13648 14697 10292 6400 13146 9620 4592 -1135 4885 7229 3661
7565 3661 320 13194 -2210 -7914 8634 17335 16885 -239 -2545 9350 8690 6720 10248 10078
$$ packed form
7663B1614n999l289J1649r686q556Q028J9065N713M627J450K70k3337p180N0O823
7648B1242K2924p087k9560j5318J284M066N902o736k0457J8950J4596j1138k0385
7635b1717o028K6647K3730J0525q017N25k109j3505j1558j101R221P852k621J3170
7621B5014J6381Q481j7020j9399O10Q223L908k0030m212k552j901P181p485P52
7607b049L863m774k3074n841O320M277n159J5123r596m662K6202J7621l746j246
7593A3259rm178M372j767n554J9191J3881j3842k322n486k2478j0204K1417K0514
7579B6794j3691j3967K0056n544J049m405l892O746l526n028n727O020K344l568
7565C661l341J2874j5404n704J6548Q701m50j7124k306J1895o60j970L528j70
$$ plain form
7551 10078 7745 10207 18882 36644 42366 37816 27334 17001 7231 -3507 -18412 -307 14511
7538 14511 28182 19279 9929 11025 3078 -5850 -2369 -2349 -9583 -4127 2445 -3040 -3217 2391 14095
7523 14095 9937 6593 8238 6655 9693 19133 9808 -1613 2237 10387 20058 27169 35429 23502
7509 23502 16516 14085 20728 27040 24899 7911 15482 17524 21498 18862 8276 19081 45541 58991
7495 58991 38185 6474 12072 22111 32642 40843 32495 20125 21634 24755 4793 -9202 -3360
7482 -3360 11793 2815 -10293 -2726 840 -3051 1474 3764 -9819 -24209 -11177 139 12049
7469 12049 25172 34246 21160 12203 2420 -25859 -36995 -28540 -14801 -12321 -2519 22238 13417
7456 13417 -9561 -32991 -47608 -52240 -25345 -2587 -5399 3835 -4767 -1510 -14094 -22206 -29849
$$ packed form
7551A0078k333K462Q675J7762N722m550j0482j0333r770j0738j4905J8105J4818
7538A4511J3671q903r350J096p947q928L481K0p234N456O572n485j77N608J1704
7523A4095m158l344J645j583L038R440r325j1421L850Q150R671P111Q260j1927
7509B3502o986k431O643O312k141j6988P571K042L974k636j0586J0805K6460J3450
7495E8991k0806l1711N598J0039J0531Q201q348j2370J509L121j9962j3995N842
7482c360J5153q978j3108P567L566l891M525K290j3583j4390J3032J1316J1910
7469A2049J3123R074j3086q957r783k8279j1136Q455J3739K480R802K4757q821
7456A3417k2978k3430j4617m632K6895K2758k812R234q602L257j2584q112p643
$$ plain form
7443 -29849 -29140 -20842 -17504 -22858 -16159 5745 366 5903 4090 -3736 -9925 -27338 -25223 -23543
7429 -23543 -3934 1139 7910 -733 -15357 1103 6369 -11854 -21986 -21557 -25452 -24076 -19490 -12644
7415 -12644 -17716 -16320 -5135 4537 12022 -1417 -30345 -48895 -41734 -31775 -26185 -19885 -11601 -2083
7401 -2083 11571 6610 -18328 -22186 -103 25364 29137 16127 28484 38149 20652 10212 -4363
7388 -4363 9135 30198 28620 16539 16009 5163 3387 18161 23870 29515 9386 14109 21061 20119
7374 20119 38816 46235 28490 14546 25305 20778 16695 15678 13429 4033 21078 9868 2117
7361 2117 3789 8552 -6188 -5536 12722 32274 18715 6907 -6561 -13105 -11721 -7627 -1626 -3877
7347 -3877 -9212 11761 18893 -7153 -18205 -13671 -6644 -9897 -17980 -14179 -3888 -2638 -833 -13923
$$ packed form
7443b9849P09Q298L338n354O699K1904n379N537j813p826o189j7413K115J680
7429b3543J9609N073O771q643j4624J6460N266j8223j0132M29l895J376M586O846
7415a2644n072J396J1185R672P485j3439k8928j8550P161R959N590O300Q284R518
7401b083J3654m961k4938l858K2083K5467L773j3010J2357R665j7497j0440j4575
7388d363J3498K1063j578j2081n30j0846j776J4774N709N645k0129M723O952r42
7374B0119J8697P419j7745j3944J0759m527m083j017k249r396J7045j1210p751
7361B117J672M763j4740O52J8258J9552j3559j1808j3468o544J384M094O001k251
7347c877n335K0973P132k6046j1052M534P027l253q083L801J0291J250J805j3090
$$ plain form
7333 -13923 -21575 -27194 -24848 -3874 13750 32882 38657 30066 32367 23250 11397 -4779 1442
7320 1442 8039 26254 42086 40924 32717 12462 8362 10509 29778 16067 -10833 -6450 5497
7307 5497 19064 19932 16160 12802 4035 -8377 -5671 2223 13049 18944 6490 14266 24927 12686
7293 12686 13409 18388 29812 12517 11249 18140 15747 7211 -16175 -25940 -49969 -42459 -19103 -4594
7279 -4594 2231 -15642 -22053 -20549 -13816 13202 21321 11366 23816 5726 -4592 4779 15211
7266 15211 2754 -3203 -2126 -9428 10224 32579 25071 20909 15946 30834 34875 23529 20031
7253 20031 7155 716 1241 -1286 -14116 -22937 -23161 -28201 -16062 -8842 1079 -7335 3206 25422
7239 25422 22047 12820 16462 24323 6302 8793 21102 16157 30408 31858 21813 -437 -10848
$$ packed form
7333a3923p652n619K346K0974J7624J9132N775q591K301r117j1853j6176O221
7320A442O597J8215J5832j162q207k0255m100K147J9269j3711k6900M383J1947
7307E497J3567Q68l772l358q767j2412K706P894J0826N895j2454P776J0661j2241
7293A2686P23M979J1424j7295j268O891k393q536k3386r765k4029P510K3356J4509
7279d594O825j7873o411J504O733K7018Q119r955J2450j8090j0318R371J0432
7266A5211j2457n957J077p302J9652K2355p508m162m963J4888M041j1346l498
7253B0031j2876o439N25k527j2830q821k24n040J2139P220R921q414J0541K2216
7239B5422l375r227L642P861j8021K491J2309m945J4251J450j0045k2250j0411
$$ plain form
7226 -10848 -9104 -7331 2840 1334 -2278 -20208 -26977 2021 7691 772 -3031 -3970 11702 21736
7212 21736 28904 31886 20532 10776 6260 -50 13363 23954 22599 17400 -67 10901 17036
7199 17036 6463 8190 -3522 -32758 -32038 -24943 -15910 -15202 -16162 -11571 15489 17400 7442 5808
7185 5808 657 -5421 3285 73 -746 2109 4797 -24597 -26554 -16121 -13176 -7589 7738 1320
7171 1320 -6144 -9206 -13223 3831 -4416 -1934 -6125 -24231 -39819 -31730 -21524 -6338 -2653 -29073
7157 -29073 -34809 -13872 11630 32791 33570 6055 -22017 -16834 2211 21587 4349 7997 14304
7144 14304 16213 1470 -14125 -25405 -21900 -2783 3664 4361 -20619 -43449 -47861 -21520 -5045
7131 -5045 1095 -908 -4432 4836 3966 -2295 11597 17094 13572 -684 17254 26412 11180 -4762
$$ packed form
7226a0848J744J773J0171j506l612j7930o769K8998N670o919l803r39J5672J0034
7212B1736P168K982j1354r756m516o310J3413J0591j355n199j7467J0968O135
7199A7036j0573J727j1712k9236P20P095R033P08r60M591K7060J911r958j634
7185E808n151o078Q706l212q19K855K688k9394j957J0433K945N587J5327o418
7171A320p464l062m017J7054q247K482m191j8106j5588Q089J0206J5186L685k6420
7157b9073n736K0937K5502K1161P79k7515k8072N183J9045J9376j7238L648O307
7144A4304J909j4743j5595j1280L505J9117O447O97k4980k2830m412K6341J6475
7131e045O140k003l524R268q70o261J3892N497l522j4256J7938R158j5232j5942
$$ plain form
7117 -4762 -1375 9732 11750 32705 31769 5255 6864 6323 -21439 -30932 -16760 6413 25353 15793
7103 15793 7050 6411 14000 4997 -7067 1355 -8001 -4835 10634 18317 13013 30650 35173 22717
7089 22717 12204 14894 25859 12908 15955 2140 -7866 664 1729 -9595 3429 6916 18378
7076 18378 30496 30242 33284 16398 -1413 1636 18254 31475 17573 25292 7378 8982 4235
7063 4235 1529 -11127 -15709 280 17635 22408 21400 19724 23003 7292 2592 5831 3765 14252
7049 14252 21800 -5548 7239 27658 18505 -264 -5201 -8536 -8460 -15911 -25202 -2613 -14684 -18345
7035 -18345 -9349 -2768 -1083 1054 7198 -1170 -25559 -12453 -14996 -7469 -847 4591 19217 2103
7021 2103 -19984 -10300 -5520 -3592 3478 -14430 -10711 -15361 -5644 -15870 -29908 -34922 -14350 -10161
$$ packed form
7117d762L387J1107K018K0955r36k6514J609n41k7762r493J4172K3173J8940r560
7103A5793q743o39P589r003j2064Q422r356L166J5469P683n304J7637M523j2456
7089B2717j0513K690J0965j2951L047j3815j0006Q530J065j1324J3024L487J1462
7076A8378J2118k54L042j6886j7811L049J6618J3221j3902P719j7914J604m747
7063D235k706j2656m582J5989J7355M773j008j676L279j5711m700L239k066J0487
7049A4252P548k7348J2787K0419r153j8769m937l335P6p451r291K2589j2071l661
7035a8345Q996O581J685K137O144q368k4389J3106k543P527O622N438J4626j7114
7021B103k2087R684M780J928P070j7908L719m650R717j0226j4038n014K0572M189
$$ plain form
7007 -10161 -17588 -19357 -8409 -11550 -26454 -33812 -24201 -26219 -20222 -7609 5918 25489 21916
6994 21916 29899 23711 24673 13504 4843 2534 1942 -7563 -12823 -15902 -24543 -15463 -7742 -14811 -14842
6979 -14842 -19369 -24919 -37413 -20690 -16155 -9459 -14609 -21886 -26687 -27727 -15172 -17764 -14246 -20021
6965 -20021 -38611 -47276 -29464 -14446 -22492 -15345 -4685 -19161 -14451 -1987 -3768 -3119 5801
6952 5801 -5569 -7112 -7330 -8334 138 -1376 9527 13494 9814 2042 -9481 -7829 -17633 -6259
6938 -6259 12482 12311 -7766 -6957 -13415 -12586 -9800 -41082 -75828 -57591 -21214 -30096 -23282 -2894
6924 -2894 1390 20138 31201 19468 8948 2005 30698 18078 2842 -470 -3131 -17421 -28755
6911 -28755 -30182 -34396 -21847 -5164 1966 11197 14596 393 -13117 -20058 -3511 -5292 -21028
$$ packed form
7007a0161p427j769J0948l141j4904p358R611k018N997J2613J3527J9571l573
6994B1916P983o188R62j1169q661k309n92r505n260l079q641R080P721p069l1
6979a4842m527n550j2494J6723M535O696n150p277m801j040J2555k592L518n775
6965b0021j8590q665J7812J5018q046P147J0660j4476M710J2464j781O49Q920
6952E801j1370j543k18j004Q472j514J0903L967l680p772j1523J652r804J1374
6938f259J8741j71k0077Q09o458Q29K786l1282l4746J8237L6377q882O814K0388
6924b894M284J8748J1063j1733j0520o943K8693j2620j5236l312k661j4290j1334
6911b8755j427m214J2549J6683P130R231L399j4203j3510o941J6547j781j5736
$$ plain form
6898 -21028 -33534 -33435 -26889 -35851 -36896 -37630 -11949 -5585 -3305 8287 -4915 -10213 -22391 -21122
6884 -21122 1116 23037 32663 19827 4847 21697 17356 8840 8962 -7035 -5334 685 5677
6871 5677 8709 12821 15253 11003 2761 -11327 -8443 -9400 8741 24286 31024 35395 39154 25585
6857 25585 25074 27398 45592 35517 41509 52474 46018 36687 31359 25782 27980 35757 7463 -11081
6843 -11081 -10572 -4171 -9797 -23424 -37256 -36662 -9717 26387 35463 20170 -3053 -3229 11398 18613
6829 18613 24224 13564 4146 4836 -19816 -30035 -8722 330 15823 33432 30751 -2561 -916
6816 -916 3099 8776 23254 34114 36792 19183 5521 1898 5979 24911 37230 50039 50139 30296
6802 30296 2504 -11929 -14871 4515 -3192 19608 41848 45344 49841 56176 61144 80021 119301
$$ packed form
6898b1028j2506R9O546q962j045p34K5681O364K280J1592j3202n298j2178J269
6884b1122K2238K1921R626j2836j4980J6850m341q516J22j5997J701O019M992
6871E677L032M112K432m250q242j4088K884r57J8141J5545O738M371L759j3569
6857B5585n11K324J8194j0075N992J0965o456r331n328n577K198P777k8294j8544
6843a1081N09O401n626j3627j3832N94K6945L6104R076j5293k3223j76J4627P215
6829A8613N611j0660r418O90k4652j0219K1313R052J5493J7609k681l3312J645
6816i16M015N677J4478J0860K678j7609j3662l623M081J8932J2319J2809J00j9843
6802C0296k7792j4433k942J9386p707K2800K2240L496M497O335M968J8877L9280
$$ plain form
6789 119301 137012 132024 126034 110934 113542 132072 164348 220402 296855 354918 347160 295486
6777 295486 257214 223822 188105 160666 134991 123466 150137 181480 214692 221004 185765 158189
6765 158189 132898 111597 98660 59367 44085 49313 48597 51020 68901 64102 66327 74823 68350
6752 68350 58527 58040 85477 93233 72753 56872 74912 79761 79871 92027 100852 126273 146233
6739 146233 144179 147761 164019 156125 144641 116114 91843 88313 95764 105803 127382 122347 111889
6726 111889 118619 132140 142418 147318 183307 259135 331844 448439 640655 895066 1256214
6715 1256214 1682561 2022887 2091823 1908038 1612589 1297309 1008272 750393 541788 398893
6705 398893 297228 215565 168850 137273 112844 89792 90836 89141 77735 38706 25652 42366
$$ packed form
6789A19301J7711m988n990j5100K608J8530L2276N6054P6453N8063p758n1674
6777B95486l8272l3392l5717k7439k5675j1525K6671L1343L3212O312l5239k7576
6765A58189k5291k1301j2937l9293j5282N228p16K423J7881m799K225Q496o473
6752F8350r823m87K7437P756k0480j5881J8040M849J10J2156Q825K5421J9960
6739A46233k054L582J6258p894j1484k8527k4271l530P451J0039K1579n035j0458
6726A11889O730J3521J0278M900L5989P5828P2709J16595J92216K54411L61148
6715A256214M26347L40326O8936j83785k95449l15280k89037k57879k08605j42895
6705C98893j01665q1663m6715l1577k4429k3052J044j695j1406l9029j3054J6714
$$ plain form
6693 42366 58743 54174 62914 61048 49226 60924 69982 54272 45541 49348 48764 36890 43082 37233
6679 37233 11479 6952 403 2196 3842 28859 39738 31547 15212 -1583 73 -4064 1670
6666 1670 2433 -1058 -802 3613 5996 2992 -19923 -26783 -41018 -29214 -25376 -16823 10714 18899
6652 18899 -2508 -20956 -34367 -14198 -3955 -5888 -12263 -2431 -3013 7325 -16992 -41603 -42528
6639 -42528 -45439 -34227 -31057 -11928 2513 15288 9327 21022 34765 20237 3445 -2528 -10294
6626 -10294 4049 27113 27130 15733 10109 5589 9169 8723 831 5898 -225 15637 29466 33675
6612 33675 26550 13363 3745 10012 -10840 -15870 -3523 1487 -14584 -18563 -4271 -8256 -12764
6599 -12764 -11019 -12533 -41621 -44594 -25338 -21990 -11692 -6276 -8880 -2041 1507 -12291 -7864 10592
$$ packed form
6693D2366J6377m569Q740j866j1822J1698R058j5710q731L807n84j1874O192n849
6679C7233k5754m527o549J793J646K5017J0879q191j6335j6795J656m137N734
6666A670P63l491K56M415K383l004k2915o860j4235J1804L838Q553K7537Q185
6652A8899k1407j8448j3411K0169J0243j933o375R832n82J0338k4317k4611r25
6639d2528k911J1212L170J9129J4441J2775n961J1695J3743j4528j6792n973p766
6626a0294J4343K3064J7j1397n624m520L580m46p892N067o123J5862J3829M209
6612C3675p125j3187r618O267k0852n030J2347N010j6071l979J4292l985m508
6599a2764J745j514k9088k973J9256L348J0298N416k604O839L548j3798M427J8456
$$ plain form
6585 10592 21450 19070 22334 15561 16714 20183 19797 960 -7738 -6883 2203 2863 -3971 11864 37712
6570 37712 41954 35862 23228 5532 16773 12655 5542 1796 -10923 -549 25104 42494 34052
6557 34052 863 -17558 -11010 -6683 -604 12113 24848 20080 8995 2563 -7653 -11077 -18085
6544 -18085 -5680 3416 -13010 -19923 -18560 -9897 -7831 7926 10707 4854 -8236 -29109 -17152
6531 -17152 -9682 505 1765 -14971 -27383 -14282 -5021 -797 -9921 -26050 -30893 -24420 -24944 -15376
6517 -15376 2385 -5151 10392 25608 36229 15820 30704 34880 13878 3536 3828 6772 -3085
6504 -3085 -4323 3645 21788 24512 27847 37405 24154 7681 6224 -5918 9356 14565 17220 10065
6490 10065 -9137 -10288 13416 26299 17478 17638 23851 23734 2405 -14734 -6535 12147 30200
$$ packed form
6585A0592J0858k380L264o773J153L469l86j8837q698Q55R086O60o834J5835K5848
6570C7712M242o092j2634j7696J1241m118p113l746j2719J0374K5653J7390q442
6557C4052l3189j8421O548M327O079J2717J2735m768j1085o432j0216l424p008
6544a8085J2405R096j6426o913J363Q663K066J5757K781n853j3090k0873J1957
6531a7152P470J0187J260j6736j2412J3101R261M224r124j6129m843O473n24R568
6517a5376J7761p536J5543J5216J0621k0409J4884M176k1002j0342K92K944r857
6504c085j238P968J8143K724L335R558j3251j6473j457j2142J5274N209K655p155
6490A0065j9202j151K3704J2883q821J60O213j17k1329j7139Q199J8682J8053
$$ plain form
6477 30200 36784 27461 14438 16736 10760 -11838 -41594 -37427 -11380 10879 12245 12069 17830 7002
6463 7002 2126 2426 9576 8133 14257 22563 24895 20024 9296 6322 5267 17915 7313 -8097
6449 -8097 -14832 6541 596 5868 10553 6587 6222 -5797 -20549 -16517 -16363 -21010 -20580 -8584 1646
6434 1646 -13898 -12764 -8039 -22551 -18412 -5209 -4042 -4054 -4995 -15584 -44027 -45864 -41638 -34771
6420 -34771 -45695 -47844 -32513 -31254 -14804 1750 25571 32801 5506 8989 21194 32544 14392
6407 14392 -10658 -17111 5390 14175 -20325 -31399 -14990 -7076 -3219 -19183 -7544 8519 1926
6394 1926 -13390 -36922 -30090 -40057 -26013 -15974 -16353 -11669 -5551 -1572 4202 11053 3118 11611
6380 11611 30190 22997 921 -11074 -9576 2483 29906 43057 11804 -4234 -16845 -30116
$$ packed form
6477C0200O584r323j3023K298n976k2598k9756M167K6047K2259J366j76N761j0828
6463G002m876L00P150j443O124Q306K332m871j0728k974j055J2648j0602j5410
6449h097o735K1373n945N272M685l966l65j2019j4752M032J54m647M30J1996J0230
6434A646j5544J134M725j4512M139J3203J167j2r41j0589k8443j837M226O867
6420c4771j0924k149J5331J259J6450J6554K3821P230k7295L483J2205J1350j8152
6407A4392k5050o453K2501Q785l4500j1074J6409P914L857j5964J1639J6063o593
6394A926j5316k3532O832r967J4044J0039l79M684O118L979N774O851p935Q493
6380A1611J8579p193k2076j1995J498J2059K7423J3151l1253j6038j2611j3271
$$ plain form
6368 -30116 -40953 -33238 -14668 -10805 -2622 -10400 -18965 -21367 -17266 -18861 -38679 -43988 -26450 -12672
6354 -12672 -21735 -24732 -19462 -15627 -16247 -35039 -40377 -34560 -15634 -6749 -12677 -21703 1550 19957
6340 19957 19034 24939 41510 47799 23024 7929 21513 11981 3143 6274 13631 7476 -6052 -2024
6326 -2024 17669 16873 1351 -12142 853 -88 -16271 -14915 -6241 1745 663 -18701 -33829 -25972
6312 -25972 -4068 -1416 10376 16840 10087 10509 -17 -10635 -12952 -2807 14384 8018 -8504
6299 -8504 -20662 -19706 -29496 -26452 -45095 -48600 -28481 293 5469 -2160 2063 -14117 -20432 -20261
6285 -20261 -7726 -905 -13117 -15933 -716 -5980 -2431 1191 2543 5223 4492 -27713 -35785 -20254
6271 -20254 -28245 -40260 -40507 -36978 -4627 16731 17772 15653 1826 -6925 8400 2216 7219 12430
$$ packed form
6368c0116j0837P715J8570L863Q183p778q565k402M101j595j9818n309J7538J3778
6354a2672r063k997N270L835o20j8792n338N817J8926Q885n928r026K3253J8407
6340A9957r23N905J6571O289k4775j5095J3584r532q838L131P357o155j3528M028
6326b024J9693p96j5522j3493J2995r41j6183J356Q674P986j082j9364j5128P857
6312b5972K1904K652J1792O464o753M22j0526j0618k317J0145J7191o366j6522
6299h504j2158R56r790L044j8643l505K0119K8774N176p629M223j6180o315J71
6285b0261J2535O821j2212k816J5217n264L549L622J352K680p31l2205q072J5531
6271b0254p991j2015k47L529L2351K1358J041k119j3827q751J5325o184N003N211
$$ plain form
6257 12430 21763 29510 5352 -17420 -19792 -20001 -8906 2815 -4525 15333 24376 13886 -11661
6244 -11661 -4133 9637 6889 1679 3493 9762 25006 21799 20445 30680 16730 15394 20557 8728
6230 8728 4125 10169 -2341 -16890 -21410 -7388 -198 -6702 -1717 -5073 -3459 -7235 556 10221
6216 10221 -2819 9883 12782 4990 1703 -13531 41 3605 -14843 -25570 -40962 -24920 -5760
6203 -5760 -12021 -19837 -3989 -13661 -35183 -33005 -5792 -3993 -16643 -23165 -12450 8372 29490
6190 29490 16212 -1214 -10231 -6245 12816 4200 6885 4838 4276 -19879 -41040 -38845 -49733
6177 -49733 -47219 -37514 -31424 -42550 -10602 12054 4742 19370 23261 3252 7641 24284 27279
6164 27279 23177 3013 -10372 -3112 5370 14262 5632 -15924 -14248 -8253 -34351 -60249 -46105
$$ packed form
6257A2430R333P747k4158k2772k372k09J1095J1721p340J9858R043j0490k5547
6244a1661P528J3770k748n210J814O269J5244l207j354J0235j3950j336N163j1829
6230H728m603O044j2510j4549m520J4022P190o504M985l356J614l776P791R665
6216A0221j3040J2702K899p792l287j5234J3572L564j8448j0727j5392J6042J9160
6203e760o261p816J5848r672k1522K178K7213J799j2650o522J0715K0822K1118
6190B9490j3278j7426r017L986J9061q616K685k047n62k4155k1161K195j0888
6177d9733K514R705O090j1126L1948K2656p312J4628L891k0009M389J6643K995
6164B7279m102k0164j3385P260Q482Q892q630k1556J676N995k6098k5898J4144
$$ plain form
6151 -46105 -18697 -8222 -14592 -5477 -3053 1103 20635 15797 -2630 -13640 -16034 -28723 -26074
6138 -26074 -30758 -45215 -37949 -23487 -22945 -28075 -17368 -20813 -23766 -1619 6951 524 -3879 -4376
6124 -4376 -16319 -17929 -39168 -42934 -30210 -33486 -33199 -31245 -35667 -32678 -7627 11227 31165 11629
6110 11629 -12792 -25206 -21958 -5891 -17629 -36309 -32501 -18030 -18392 -8530 1362 -6297 -382
6097 -382 8324 6792 -5315 7833 25602 26194 -3649 930 9153 3609 5725 12209 2308 -14995
6083 -14995 -16224 -4566 -11487 -21292 -13984 -17235 -26353 -10477 1610 -3248 -5443 -5558 -3506 -4338
6069 -4338 -11566 -23058 -1187 5835 -13794 -16551 -1263 -4652 2283 1859 7391 19337 10023 -1132
6055 -1132 -4277 -9941 -7374 2558 -1281 -7060 -7812 13255 3786 9720 15210 -3714 -19249 -6298
$$ packed form
6151d6105K7408J0475o370R115K424M156J9532m838j8427j1010k394j2689K649
6138b6074m684j4457P266J4462N42n130J0707l445k953K2147Q570o427m403m97
6124d376j1943j610k1239l766J2724l276K87J954m422K989K5051J8854J9938j9536
6110A1629k4421j2414L248J6067j1738j8680L808J4471l62R862R892p659N915
6097c82Q706j532j2107J3148J7769N92k9843M579Q223n544K116O484r901j7303
6083a4995j229J1658o921r805P308l251r118J5876J2087m858k195j15K052q32
6069d338p228j1492K1871P022j9629k757J5288l389O935m24N532J1946r314j1155
6055a132l145n664K567R932l839n779p52K1067r469N934N490j8924j5535J2951
$$ plain form
6041 -6298 -10081 -10146 -9226 -8550 -8530 -17974 -40432 -46645 -36829 -14462 5332 5064 2885 -18150 -26304 -17134
6025 -17134 11272 528 -17085 -23306 -12506 -954 -9481 -25385 -9025 20399 14057 -5891
6013 -5891 -15498 -24965 -46687 -55672 -38231 -24529 -15943 -29592 -38991 -31410 -9928 9642 2850
6000 2850 -11077 -36680 -31421 -28496 -18195 -13349 -15797 -413 9714 28035 25719 1560 5612
5987 5612 1176 9415 24850 26010 25404 23185 21653 9485 -17201 -23655 -12383 -6011 6324 -3887
5973 -3887 -5339 -6040 -124 -5261 -13832 -15097 -18560 -12265 -6464 -6041 1487 7824 -3922 -26958 -8201
5958 -8201 -5035 10461 12935 2534 -3701 -4470 -5678 -2785 -930 4458 6296 10683 4988 5576 12572
5943 12572 5325 2211 2737 16943 35461 50821 39005 22686 22417 11478 12030 15979 11705 -7206
$$ packed form
6041f298l783o5R20O76K0r444k2458o213R816K2367J9794k68k179k1035q154R170
6025a7134K8406j0744j7613o221J0800J1552q527j5904J6360K9424o342j9948
6013e891r607r467k1722q985J7441J3702Q586j3649r399P581K1482J9570o792
6000B850j3927k5603N259K925J0301M846k448J5384J0127J8321k316k4159M052
5987E612m436Q239J5435J160o06k219j532j2168k6686o454J1272O372J2335j0211
5973c887j452p01N916n137q571j265l463O295N801M23P528O337j1746k3036J8757
5958h201L166J5496K474j0401o235p69j208K893J855N388J838M387n695N88O996
5943A2572p247l114N26J4206J8518J5360j1816j6319k69j0939N52L949m274j8911
$$ plain form
5929 -7206 -42235 -57440 -31330 878 4003 3831 10155 13615 -14206 -29257 -26078 -22148 -11333
5916 -11333 -2420 -27900 -22636 -7999 -10363 -10892 -11966 -6654 13486 9510 -10121 -12731 -13715 -14685
5902 -14685 2054 10897 7430 -247 -11101 -7521 -1280 14300 8468 5468 2265 -19697 -8375
5889 -8375 2021 -9006 -14582 -20414 -26963 -21414 -6779 13743 14010 -150 -24992 -22458 -13222 -9814
5875 -9814 -17424 -26267 -7824 20213 19873 -3441 -19797 -25020 -24065 -10836 15 -11644 -29665
5862 -29665 -36730 -38061 -48684 -45748 -37602 -21051 -6598 2774 4197 -2976 6287 14442 -24145 -26724
5848 -26724 -5406 4139 -12687 -7229 -16409 -11912 243 -12457 -9100 -962 -2120 -7954 -5844 -14953
5834 -14953 -15470 -3120 4685 -7072 -9053 -13681 -30683 -16181 -26461 -49141 -43010 -22644 -24684
$$ packed form
5929g206l5029j5205K6110L2208L125j72O324L460k7821j5051L179L930J0815
5916a1333Q913k5480N264J4637k364n29j074N312K0140l976j9631k610r84r70
5902a4685J6739Q843l467p677j0854L580O241J5580n832l000l203k1962J1322
5889h375J0396j1027n576n832o549N549J4635K0522K67j4160k4842K534R236L408
5875i814p610q843J8443K8037l40k3314j6356n223R55J3229J0851j1659j8021
5862b9665p065j331j0623K936Q146J6551J4453R372J423p173R263Q155l8587k579
5848b6724K1318R545j6826N458r180M497J2155j2700L357Q138j158n834K110r109
5834a4953n17J2350P805j1757j981m628j7002J4502j0280k2680O131K0366k040
$$ plain form
5821 -24684 -23884 4298 17046 37191 41975 26529 15185 -14112 -22859 -22375 -9887 -25995 -40786
5808 -40786 -28856 -5004 2537 13191 2323 -29464 -12131 11259 5710 5072 3995 3791 4363 15221
5794 15221 41143 50215 33465 24222 1688 -17429 -12456 -21414 -22109 -19920 -27957 -29490 -22549 -22903
5780 -22903 -22013 -13978 -27018 -31281 -2013 10756 -5395 -25562 -20690 -21925 -8638 -277 -916 5109
5766 5109 -1280 -6732 2029 1475 -4519 -16750 -8183 12336 18220 32915 32442 23106 21975 38772
5752 38772 34333 25028 14057 -15188 -9480 -15154 -15352 -3036 9031 2685 -12343 -17996 -26545 -28129
5738 -28129 -1106 3524 884 -29607 -20969 -25012 -27903 -8460 683 -3249 -536 -13757 -9323 3974
5724 3974 -11435 -4575 -4932 3006 10355 15031 7723 -1796 -11703 -20906 -22400 -9600 -15590 -1844
$$ packed form
5821b4684Q00K8182J2748K0145M784j5446j1344k9297q747M84J2488j6108j4791
5808d0786J1930K3852P541J0654j0868l1787J7333K3390n549o38j077k04N72J0858
5794A5221K5922R072j6750r243k2534j9117M973q958o95K189q037j533O941l54
5780b2903Q90Q035j3040m263K9268J2769j6151k0167M872j235J3287Q361o39O025
5766E109o389n452Q761n54n994j2231Q567K0519N884J4695m73r336j131J6797
5752C8772m439r305j0971k9245N708n674j98J2316J2067o346j5028n653q549j584
5738b8129K7023M630k640l0491Q638m043k891J9443R143l932K713j3221M434J3297
5724C974j5409O860l57P938P349M676p308r519r907r203j494J2800n990J3746
$$ plain form
5710 -1844 12485 15420 11142 4639 -3808 -7692 -20006 -20323 -17687 -40131 -26106 -4558 -4743 -5791
5696 -5791 -5834 -11801 -20232 -18469 -37385 -48312 -22461 -5659 -8333 -9854 13671 23072 27640 19751
5682 19751 -486 -498 5678 4147 2891 -16733 -43299 -46442 -32024 -37158 -34113 -15236 -22159 -20637
5668 -20637 2040 10993 10607 4011 -5107 -33312 -27279 -14625 -7855 -24693 -38763 -30756 -11898
5655 -11898 -9036 765 705 -12737 -1771 -969 -823 193 -15303 -16449 -21089 -12041 -11863 2950 -3445
5640 -3445 -4351 -3642 -11073 -3639 6533 16991 36626 35389 21003 19644 14657 14204 5780 2312 -5416
5625 -5416 -2486 -3099 -11681 -16286 -2542 -10856 -8251 -2367 -10038 2375 15860 8208 8383 6487 -6532
5610 -6532 -21316 -25573 3178 9683 15968 7523 -789 -3510 3595 21308 7883 2648 8570 6280
$$ packed form
5710a844J4329K935m278o503q447l884j2314l17K636k2444J4025K1548j85j048
5696e791m3n967q431J763j8916j0927K5851J6802k674j521K3525R401M568p889
5682A9751k0237j2O176j531j256j9624k6566l143J4418n134L045J8877o923J522
5668b0637K2677Q953l86o596r118k8205O033J2654O770j6838j4070Q007J8858
5655a1898K862R801o0j3442J0966Q02J46J016j5496j146m640R048J78J4813o395
5640c445r06P09p431P434J0172J0458J9635j237j4386j359m987m53q424l468p728
5625e416K930o13q582m605J3744q314K605N884p671J2413J3485p652J75j896j3019
5610f532j4784m257K8751O505O285q445q312k721P105J7713j3425n235N922k290
$$ plain form
5596 6280 8667 2637 -23108 -23974 -14533 10766 27519 20679 8799 -2509 -11614 7770 8189 -4281
5582 -4281 6349 -7605 -3518 12480 13943 -6568 591 -5245 -26447 -42488 -49401 -25255 -11017
5569 -11017 -10597 -19206 424 4168 9431 -7100 5417 11876 -21253 -24978 -23081 -14448 -7496 -8755
5555 -8755 -25151 -18934 -15896 -17775 -13156 -25371 -23149 -12193 -11614 -28960 -42530 -27045 -28892 -34710
5541 -34710 -30245 -18110 -14474 -10169 -19495 -13012 -4552 -6374 -19502 -8981 12882 1038 6544
5528 6544 12163 -1670 236 10733 7472 16836 -711 -9377 -7759 -4265 -25540 -21742 -10913 -22034
5514 -22034 -25485 -13518 -8855 -12653 -13447 9009 20822 17298 24644 3399 -24160 -28940 -44417
5501 -44417 -35193 -19562 -15093 -3015 -5374 -43 11621 18331 16018 1670 8182 6208 -5442
$$ packed form
5596F280K387o030k5745q66R441K5299J6753o840j1880j1308r105J9384M19j2470
5582d281J0630j3954M087J5998J463k0511P159n836k1202j6041o913K4146J4238
5569a1017M20q609J9630L744N263j6531J2517O459l3129l725J897Q633O952j259
5555h755j6396O217L038j879M619j2215K222J0956N79j7346j3570J5485j847n818
5541c4710M465J2135L636M305r326O483Q460j822j3128J0521K1863j1844N506
5528F544N619j3833J906J0497l261R364j7547q666J618L494k1275L798J0829j1121
5514b2034l451J1967M663l798p94K2456J1813l524P346k1245k7559m780j5477
5501d4417R224J5631M469J2078k359N331J1664O710k313j4348O512j974j1650
$$ plain form
5488 -5442 -27081 -30124 -29585 -29588 -29040 -38565 -41428 -46169 -30122 -23616 -15953 -20773 -11237 5058 10993
5473 10993 15410 15597 15191 7497 -292 -14745 -8481 -1773 -10856 -19529 -8717 7338 3507 -11823
5459 -11823 -10570 2771 26947 32491 11321 12244 17187 -13772 -37811 -39722 -27565 -13744 -2770
5446 -2770 -14550 -14663 -15598 -22602 -26745 -12578 6662 -6498 -12224 -9272 -4310 -10253 -8152 -8392 -12683
5431 -12683 -15831 -20448 -14919 -15819 -17759 -27981 -22041 -22952 -12536 -25383 -24875 -219 29402 24099
5417 24099 17511 21319 12773 5835 18130 24305 22991 1627 -20723 -11457 -3453 16703 20629 12179
5403 12179 -12748 1656 12444 21908 13802 5511 -3921 -8638 2392 4432 5979 10657 26790
5390 26790 31167 28383 -3231 -14567 -11720 -18537 -19794 -31326 -21792 -1590 16628 25753 33799
$$ packed form
5488e442k1639l043N39lN48r525k863m741J6047O506P663m820R536J6295N935
5473A0993M417J87m06p694p789j4453O264O708r083q673J0812J6055l831j5330
5459a1823J253J3341K4176N544k1170R23M943l0959k4039j911J2157J3821J0974
5446b770j1780j13r35p004m143J4167J9240j3160n726K952M962n943K101k40m291
5431a2683l148m617N529r00j940j0222N940r11J0416j2847N08K4656K9621n303
5417B4099o588L808q546o938J2295O175j314k1364k2350R266Q004K0156L926q450
5403A2179k4927J4404J0788R464q106q291r432m717J1030K040J547M678J6133
5390B6790M377k784l1614j1336K847o817j257j1532R534K0202J8218R125Q046
$$ plain form
5377 33799 29697 12212 -6103 -17372 -16550 -5874 -2052 3583 4543 2806 13199 -297 3866 15780
5363 15780 24840 32820 15502 -7418 -12321 -13580 -20320 -21532 -11911 1127 -6725 -1532 14170 8125
5349 8125 -534 -10118 -6814 310 5905 9883 10546 5567 1245 -4445 -12667 1007 9202 -5127 -942
5334 -942 -21770 -31170 -6884 19664 34617 26452 25082 9970 3945 4787 7009 24163 27786 -2362
5320 -2362 -17758 -9615 -18302 -33329 -22757 -16317 -9586 -4898 -22985 -28009 -26752 -8572 -6715 -29654
5306 -29654 -25470 -15563 -14330 -14636 -11166 -16426 -26635 -10987 -3199 -4129 -4078 -3652 -5059 544 15283
5291 15283 12765 20822 24961 24613 8526 2707 13718 6434 1620 5163 -3155 -4181 -4590 -27370
5277 -27370 -45752 -18287 -6323 2287 2565 636 -12285 -17786 -19789 2834 5561 -7081 -2636
$$ packed form
5377C3799m102j7485j8315j1269Q22J0676L822N635R60j737J0393j3496M163J1914
5363A5780R060P980j7318k2920m903j259o740j212R621J3038p852N193J5702o045
5349H125q659r584L304P124N595L978O63m979m322n690q222J3674Q195j4329M185
5334i42k0828r400K4286K6548J4953q165j370j5112o025Q42K222J7154L623l0148
5320b362j5396Q143q687j5027J0572O440O731M688j8087n024J257J8180J857k2939
5306b9654M184R907J233l06L470n260j0209J5648P788r30N1M26j407N603J4739
5291A5283k518Q057M139l48j6087n819J1011p284m814L543q318j026m09k2780
5277b7370j8382K7465J1964Q610K78j929j2921n501k003K2623K727j2642M445
$$ plain form
5264 -2636 -2795 -5041 7881 15729 -2356 7113 17529 13534 480 -8142 -16531 -7926 -21394 -31414
5250 -31414 -28559 -14194 -14857 -5793 -890 -9559 -3038 -846 -7132 -14968 -15699 -15126 -28041 -43166 -29030
5235 -29030 16437 21048 6755 -4018 -9471 -6844 7396 13529 -3990 -5877 -6339 9495 18941
5222 18941 28745 27890 23378 11656 15665 7341 -8400 -6062 8093 -3026 -31426 -44991 -46801
5209 -46801 -23898 -14334 -11289 -15405 -14623 -10070 -14347 -17761 -23827 -34684 -43291 -28554 -39534 -10495
5195 -10495 -3820 -4532 12776 3882 -5306 -5559 -14884 -9515 -13523 -11069 -12168 -5909 -7068 -8083 -6211
5180 -6211 -10679 6272 12717 7227 -4651 -17774 -8088 -14126 -17535 -19270 -21420 -25847 -17405 -4072
5166 -4072 -3112 4625 9331 7273 -2054 5826 12785 32564 37544 41017 13994 -8793 2186 10599
$$ packed form
5264b636j59k246J2922P848j8085R469J0416l995j3054q622q389Q605j3468j0020
5250c1414K855J4365o63R064M903q669O521K192o286p836p31N73j2915j5125J4136
5235b9030M5467M611j4293j0773n453K627J4240O133j7519j887m62J5834R446
5222A8941R804q55m512j1722M009q324j5741K338J4155j1119k8400j3565j810
5209d6801K2903R564L045m116P82M553m277l414o066j0857q607J4737j0980K9039
5195a0495O675p12J7308q894r188k53r325N369m008K454j099O259j159j015J872
5180f211m468J6951O445n490j1878j3123R686o038l409j735k150m427Q442J3333
5166d072R60P737M706k058r327P880O959J9779M980L473k7023k2787J0979Q413
$$ plain form
5152 10599 8969 10549 7536 2832 -12623 -10131 -9418 -2347 6427 19342 8026 -1007 -19007 -10178
5138 -10178 -18577 -19173 -1165 503 4210 1679 7978 -4415 -9158 -13113 -13185 -18850 -14256 -20791 -33714
5123 -33714 -50536 -29079 1323 3035 -15113 -25849 -38906 -44113 -17342 -7586 -505 -15967 -27703
5110 -27703 -13339 4152 11848 -5284 -16186 -22720 -24870 -13448 -10469 -16293 -30405 -19530 -12191
5097 -12191 -18183 -3374 -6020 -11663 2434 -14099 -34268 -34255 -50106 -47578 -32004 -13622 -4592
5084 -4592 -7651 -2383 5607 19653 11726 11857 21818 11423 -16957 -30749 -23537 -14339 -4916 3185
5070 3185 11053 23873 -357 -29458 -18903 -10751 1746 5275 8433 16257 4590 -10767 -15731
5057 -15731 -9576 -15273 -20963 3477 26028 23392 10492 3323 1220 -3360 -1046 5789 6451 5075
$$ packed form
5152A0599j630J580l013m704j5455K492P13P071Q774J2915j1316r033j8000Q829
5138a0178q399n96J8008J668L707k531O299j2393m743l955p2n665M594o535j2923
5123c3714j6822K1457L0402J712j8148j0736j3057n207K6771R756P081j5462j1736
5110b7703J4364J7491P696j7132j0902o534k150J1422K979n824j4112J0875P339
5097a2191n992J4809k646n643J4097j6533k0169J3j5851K528J5574J8382R030
5084d592l059N268P990J4046p927J31R961j0395k8380j3792P212R198R423Q101
5070C185P868J2820k4230k9101J0555Q152J2497L529L158P824j1667j5357m964
5057a5731O155n697n690K4440K2551k636j2900p169k103m580K314O835O62j376
$$ plain form
5043 5075 21814 22865 22633 540 -17698 -43959 -47054 -13115 -5619 1049 551 110 11651 18059
5029 18059 17841 13739 11348 1664 -6840 463 8486 -5474 15744 25332 35056 28062 27502 37814
5015 37814 24256 985 -1905 9316 7205 4456 4333 6405 15983 6108 -2744 4161 18169 26152
5001 26152 12765 -538 -4994 5292 -2506 -8276 6820 33459 15256 -14181 -7219 -2678 -5552
4988 -5552 8675 3929 -11831 -29957 -33010 -33956 -14913 -14641 -4786 -13991 -14540 -3405 8250 22272
4974 22272 -4611 -19318 -15899 -3298 -18092 -26310 -15033 -18862 -8817 -21111 -28005 718 13974
4961 13974 -2190 -8500 -15575 4343 16362 26266 28921 39492 19809 -31015 -46508 -24518 -21212
4948 -21212 -7655 12269 7666 18557 19659 9634 4660 -8255 4426 -566 -15625 -21989 -10736
$$ packed form
5043E075J6739J051k32k2093j8238k6261l095L3939P496O668m98m41J1541O408
5029A8059k18m102k391r684q504P303Q023j3960K1218R588R724o994n60J0312
5015C7814j3558k3271k890J1221k111k749j23K072R578r875q852O905J4008P983
5001B6152j3387j3303m456J0286p798n770J5096K6639j8203k9437O962M541k874
4988e552J4227m746j5760j8126l053r46J9043K72R855r205n49J1135J1655J4022
4974B2272k6883j4707L419J2601j4794q218J1277l829J0045j2294o894K8723J3256
4961A3974j6164o310p075J9918J2019R904K655J0571j9683n0824j5493K1990L306
4948b1212J3557J9924m603J0891J102j0025m974j2915J2681m992j5059o364J1253
$$ plain form
4935 -10736 -5400 -629 152 4215 -14195 -36984 -28136 -24206 -17595 -14582 1830 -628 12828 25392
4921 25392 29009 28380 10549 8395 3146 -18628 -916 3994 4410 6074 -13558 2903 2400 5266
4907 5266 -7815 -30040 -14775 2886 2875 10013 6606 -7294 -12205 -1356 -19930 -27636 -11278
4894 -11278 9351 1154 15068 19647 11457 2680 -9210 -8544 -3414 2227 2208 -14446 -10282 8400
4880 8400 5029 -2725 -7759 -29542 -33463 -10937 -8226 -11064 -9007 -15908 -15413 -4626 -1221 4295
4866 4295 3329 2698 -5883 -20607 -30083 -29606 -17525 -8970 -643 -5173 -2742 8812 14945 10887 -7538
4851 -7538 -23409 -17756 11957 14197 13597 20464 13415 12173 10534 -3113 -14440 -18806 1940 -6629
4837 -6629 -18114 -9239 -4436 6378 6264 -153 22922 27991 29744 27657 5126 -10449 -22629 -30346
$$ packed form
4935a0736N336M771P81M063j8410k2789Q848L930O611L013J6412k458J3456J2564
4921B5392L617o29j7831k154n249k1774J7712M910M16J664j9632J6461n03K866
4907E266j3081k2225J5265J7661j1P138l407j3900m911J0849j8574p706J6358
4894a1278K0629q197J3914M579q190q777j1890O66N130N641j9j6654M164J8682
4880H400l371p754n034k1783l921K2526K711k838K057o901M95J0787L405N516
4866D295r66o31q581j4724r476M77J2081Q555Q327m530K431J1554O133m058j8425
4851g538j5871N653K9713K240o00O867p049j242j639j3647j1327m366K0746q569
4837f629j1485Q875M803J0814j14o417K3075N069J753k087k2531j5575j2180p717
$$ plain form
4823 -30346 -29422 -26395 -26806 -17788 -18809 1185 7501 8517 18948 34181 9137 -24624 -26092 -22736
4809 -22736 2508 12653 19829 33072 25678 29671 28338 25097 8272 -26286 -11386 -18400 -42710
4796 -42710 -47758 -30595 -18817 -9320 -4528 -5008 3260 8016 14881 29080 28251 24987 17809 11218
4782 11218 4692 393 5098 5521 1988 -4363 -14646 -26397 -26502 -4171 4112 9815 21645 38145
4768 38145 45808 30872 2929 80 -14987 -20634 -18188 -30538 -38339 -30039 -2041 8922 -2575
4755 -2575 4274 -9097 -10082 -6776 -15212 -12726 -4546 3669 7701 18420 13985 11554 -5687 -6222 -3881
4740 -3881 -4266 4831 5536 10911 1663 -25843 -28125 -24808 -1621 -312 11470 19488 21189 13803 8651
4725 8651 14712 7574 21835 16693 7141 10332 21240 32991 35700 28197 18239 13016 12787 12908 -4325
$$ packed form
4823c0346R24L027m11R018j021J9994O316J016J0431J5233k5044l3761j468L356
4809b2736K5244J0145P176J3243p394L993j333l241j6825l4558J4900p014k4310
4796d2710n048J7163J1778R497M792m80Q268M756O865J4199q29l264p178o591
4782A1218o526m299M705M23l533o351j0283j1751j05K2331Q283N703J1830J6500
4768C8145P663j4936k7943k849j5067n647K446j2350p801Q300K7998J0963j1497
4755b575O849j3371r85L306q436K486Q180Q215M032J0719m435k431j7241n35K341
4740c881l85R097P05N375r248k7506k282L317K3187J309J1782Q018J701p386n152
4725H651O061p138J4261n142r552L191J0908J1751K709p503r958n223k29J21j7233
$$ plain form
4710 -4325 -13383 -18779 -13049 -231 15203 11296 -5715 7359 7135 -3488 5997 8239 4182 21439
4696 21439 20803 19974 26397 4822 21349 30415 16184 2417 1864 -7210 -21793 -20248 -16535 -12765
4682 -12765 -1993 17206 19180 16518 9949 -992 -21655 -22515 -16364 2011 1938 4120 1235 -13809
4668 -13809 -13733 -86 9272 -24295 -12896 -6070 2901 23447 26650 15834 12188 17739 31887 20406
4654 20406 -952 -2059 -21492 -26743 -15044 -8038 -3217 2889 5632 10394 3484 5042 -3268 -18593
4640 -18593 -18340 -19058 -23067 -27013 -28615 -23622 -19332 -15380 -3185 -3994 -21681 -30519 -13356 -13948 -13164
4625 -13164 -31281 -31433 -14809 -13651 -29294 -30633 -21293 -20855 -30053 -16122 -10615 -24843 -26579 -9333
4611 -9333 -18723 -28776 -24609 -22441 -29894 -25040 -7663 -12424 -8861 2935 8643 31534 39857 24657
$$ packed form
4710d325r058n396N730J2818J5434l907j7011J3074k24j0623R485K242m057J7257
4696B1439o36q29O423k1575J6527R066j4231j3767n53r074j4583J545L713L770
4682a2765J0772J9199J974k662o569j0941k0663q60O151J8375p3K182k885j5044
4668a3809P6J3647R358l3567J1399O826Q971K0546L203j0816l646N551J4148j1481
4654B0406k1358j107j9433n251J1699P006M821O106K743M762o910J558q310j5325
4640a8593K53p18m009l946j602M993M290L952J2195q09j7687q838J7163n92P84
4625a3164j8117j52J6624J158j5643j339R340M38r198J3931N507j4228j736J7246
4611i333r390j0053M167K168p453M854J7377m761L563J1796N708K2891Q323j5200
$$ plain form
4597 24657 -14492 -7994 -4666 19268 13800 10088 7149 21715 25459 26628 4913 -3508 7787
4584 7787 15639 711 -13776 -24494 -11702 -12366 -10726 -34858 -43985 -33539 -36544 -34786 -24501
4571 -24501 -8326 -26751 -30722 -25544 -18760 -8937 -7073 -9513 -8430 3568 1503 -12659 -1578
4558 -1578 -13843 -24936 -24077 -26239 -28372 -15824 -15799 -16079 -3454 19415 30255 21207 -8959 -17902
4544 -17902 -27055 -21549 -25504 -6519 -3934 -18870 -17160 -9616 -17898 -25178 -14201 -8796 -10264 -17920
4530 -17920 -17338 -13900 -5914 -642 4072 -1280 11945 12407 17838 -2092 -17314 -20677 -6548 2579
4516 2579 7805 7495 -6252 1663 10134 -4655 -16921 -31756 -24362 -16815 -2460 -1851 3213 8845
4502 8845 12998 -3226 -21422 -15681 -10291 -12766 -18033 -9980 -6168 -706 742 -3134 -11153 -10745 10483
$$ packed form
4597B4657l9149O498L328K3934n468l712k939J4566L744J169k1715q421J1295
4584G787P852j4928j4487j0718J2792o64J640k4132r127J0446l005J758J0285
4571b4501J6175j8425l971N178O784R823J864k440J083J1998k065j4162J1081
4558a578j2265j1093Q59k162k133J2548K5k80J2625K2869J0840r048l0166q943
4544a7902r153N506l955J8985K585j4936J710P544q282p280J0977N405j468p656
4530a7920N82L438P986N272M714n352J3225M62N431j9930j5222l363J4129R127
4516B579N226l10j3747P915Q471j4789j2266j4835P394P547J4355O09N064N632
4502H845M153j6224j8196N741N390k475n267Q053L812N462J448l876q019M08K1228
$$ plain form
4487 10483 12905 5707 -4505 -1795 7641 11459 3331 -18927 -6090 -1263 -8963 15079 25343
4474 25343 11010 -10384 -19466 -12316 2395 -1742 4088 11185 8659 5757 -2194 -5218 -18101 -6032
4460 -6032 943 1740 20136 11491 5606 2334 2271 11072 7241 6326 15213 13553 21589 17566 17604 31125
4444 31125 31555 20407 15591 13210 7899 -1191 -6767 -2030 7692 20086 7170 17189 8601 3978
4430 3978 8283 4880 3146 2304 8756 13307 14058 11241 -3932 -1945 8134 16757 19719 8550 5021
4415 5021 -10751 -20177 -15192 -28977 -36951 -7428 29093 31085 14569 13243 -381 4539 3398
4402 3398 -14340 -40764 -32324 -22291 -34537 -14872 -8114 10811 22093 15201 1633 -3059 -5318
4389 -5318 -21646 -15957 4882 4048 -24600 -9647 -4841 -3541 -4358 -11769 -14 -1905 -18571 -30466
$$ packed form
4487A0483K422p198j0212K710R436L818q128k2258J2837M827p700K4042J0264
4474B5343j4333k1394r082P150J4711m137N830P097k526k902p951l024j2883J2069
4460f032O975P97J8396q645n885l272o3Q801l831r15Q887j660Q036m023L8J3521
4444C1125M30j1148m816k381n311r090n576M737R722J2394j2916J0019q588m623
4430C978M305l403j734q42O452M551P51k817j5173J987J0079Q623K962j1169l529
4415E021j5772r426M985j3785p974K9523L6521J992j6516j326j3624M920j141
4402C398j7738k6424Q440J0033j2246J9665O758J8925J1282o892j3568m692k259
4389e318j6328N689K0839q34k8648J4953M806J300q17p411J1755j891j6666j1895
$$ plain form
4375 -30466 -19818 -10506 -17236 -11977 -7838 1299 -18791 -8423 9931 3242 5322 -6731 -21281
4362 -21281 -29341 -17458 -293 -3062 2701 3546 59 6729 18424 -2233 -5584 7078 10749 24694
4348 24694 34904 25684 10582 10560 17610 10437 615 14024 6799 -2116 -3796 6751 11598 17292
4334 17292 27187 14197 -17620 -14269 -3294 230 -1820 -11904 -24887 -25134 -19575 -32957 -35544
4321 -35544 -19531 7466 5597 6027 11331 924 15327 18804 5640 1990 695 -7247 -10438 -26290
4307 -26290 -17145 -16248 -19512 -13312 3285 25180 14072 -341 -16975 -14579 -13413 -9946 -10943 -3362
4293 -3362 -11987 7411 15144 -7712 -13730 -5641 15729 17630 22902 25565 11222 -1802 7757 4310
4279 4310 -7875 -8072 4781 9313 11994 563 1915 -12205 -7371 -13427 -16198 -4986 -5787 -1619
$$ packed form
4375c0466J0648R312o730N259M139R137k0090J0368J8354o689K080j2053j4550
4362b1281q060J1883J7165k769N763Q45l487O670J1695k0657l351J2662L671J3945
4348B4694J0210r220j5102k2P050p173r822J3409p225q915j680J0547M847N694
4334A7292R895j2990l1817L351J0975L524k050j0084j2983k47N559j3382k587
4321c5544J6013K6997j869M30N304j0407J4403L477j3164l650j295p942l191j5852
4307b6290R145Q97l264O200J6597K1895j1108j4413j6634K396J166L467r97P581
4293c362q625J9398P733k2856o018Q089K1370J901N272K663j4343j3024R559l447
4279D310j2185j97J2853M532K681j1431J352j4120M834o056k771J1212q01M168
$$ plain form
4265 -1619 7713 13354 -381 2477 -12040 -12291 -4901 4809 -6431 -15295 -4471 -11213 -31764 -30862
4251 -30862 -13585 8148 12002 8984 -8332 -7766 15367 19611 13185 -8335 -17018 -3448 -6092
4238 -6092 -3876 -5840 -20100 -10238 10825 8596 -10030 -2831 14160 32820 30337 16981 2232
4225 2232 -5861 -11217 1984 -4030 -17568 15370 43464 26799 26273 42884 37097 6813 -11512
4212 -11512 -1325 9227 -15608 3663 1119 -4242 -7207 -7225 -24711 -36585 -12146 1068 12806
4199 12806 9142 13104 36187 48212 41785 46380 49607 38592 26812 1233 -3469 9123 8603
4186 8603 -8036 -3200 8435 4750 6726 6771 -15800 -13186 16167 12451 -14040 -22293 -19020 -17753
4172 -17753 -10134 -5360 -2018 4787 8566 -15374 -29834 -680 13392 7529 -8832 -3518 3061
$$ packed form
4265a619R332N641j3735K858j4517k51P390R710j1240q864J0824o742k0551R02
4251c0862J7277K1733L854l018j7316N66K3133M244o426k1520q683J3570k644
4238f092K216j964j4260R862K1063k229j8626P199J6991J8660k483j3356j4749
4225B232q093n356J3201o014j3538L2938K8094j6665n26J6611n787l0284j8325
4212a1512J0187J0552k4835J9271k544n361k965j8j7486j1874K4439J3214J1738
4199A2806l664L962K3083J2025o427M595L227j1015j1780k5579m702J2592n20
4186H603j6639M836J1635l685J976M5k2571K614K9353l716k6491q253L273J267
4172a7753P619M774L342O805L779k3940j4460K9154J4072n863j6361N314O579
$$ plain form
4159 3061 12306 22507 12075 18117 10520 -2933 3466 11937 3222 7320 5220 -15288 -9623 1546
4145 1546 17849 22324 21255 17214 5393 -8340 -8002 -2471 -611 16210 2160 119 -16295 -29988
4131 -29988 -37565 -20590 -6450 -13777 -2272 12248 18465 -1901 -26337 -27938 -15150 8917 12690
$$ packed form
4159C061R245J0201j0432O042p597j3453O399Q471q715M098k100k0508N665J1169
4145A546J6303M475j069m041j1821j3733L38N531J860J6821j4050k041j6414j3693
4131b9988p577J6975J4140p327J1505J4520O217k0366k4436j601J2788K4067L773
$$ [...]
##END NTUPLES=NMR SPECTRUM
##END=
