##TITLE=Analysis number 318533
Compound Code cc 48063
Book Reference 458/78
Project Code adrs
Chemist Name stevem
##JCAMPDX= 6.0         $$ Bruker NMR JCAMP-DX V2.0
##DATA TYPE= NMR SPECTRUM
##DATA CLASS= NTUPLES
##ORIGIN= Bruker BioSpin GmbH
##OWNER= nmr
$$ XWIN-NMR		Version 3.5
$$ Fri Mar 31 10:44:45 2006 GMT Daylight Time (UT+1h)  MAYBRIDGE\nmr@NMR_250MHZ
##.OBSERVE FREQUENCY= 250.131544655141
##.OBSERVE NUCLEUS= ^1H
##.ACQUISITION MODE= SIMULTANEOUS (DQD)
##.ACQUISITION SCHEME= undefined
##.AVERAGES= 16
##.DIGITISER RES= 18
##SPECTROMETER/DATA SYSTEM= dpx250
##.PULSE SEQUENCE= zg30
##.SOLVENT NAME= DMSO
##.SHIFT REFERENCE= (INTERNAL, DMSO, 0, 16.522)
##AUDIT TRAIL= $$ (NUMBER, WHEN, WHO, WHERE, WHAT)
$$ ##TITLE= Audit trail, XWIN-NMR		Version 3.5
$$ ##JCAMPDX= 5.01
$$ ##ORIGIN= Bruker BioSpin GmbH
$$ ##OWNER= nmr
$$ C:\u/data/dgb/nmr/ADRS/1990/pdata/1/auditp.txt
$$ ##AUDIT TRAIL=  $$ (NUMBER, WHEN, WHO, WHERE, WHAT)
(   1,<2006-03-31 10:43:59.05 +100>,<MAYBRIDGE\nmr>,<NMR_250MHZ>,
      <created by zg, POWCHK disabled, PULCHK disabled
       configuration hash MD5:
       84 BC 41 DB A1 6E 1D 46 DA 25 12 A5 C1 ED C5 3A
       data hash MD5: 64K
       CF 94 F4 E3 FB EB 8E 41 F9 60 2C 96 F1 1C A5 71>)
(   2,<2006-03-31 10:44:22.45 +100>,<MAYBRIDGE\nmr>,<NMR_250MHZ>,
      <Start of raw data processing
       ef LB = 0.3 FT_mod = 6 PKNL = 1 SI = 32K 
       data hash MD5: 32K
       19 16 AB 32 26 9F 51 8A 8F DC D1 C6 45 EE 29 D9>)
(   3,<2006-03-31 10:44:26.35 +100>,<MAYBRIDGE\nmr>,<NMR_250MHZ>,
      <apk 
       data hash MD5: 32K
       66 E2 E1 05 83 50 F4 43 2A 04 7D B8 84 C4 68 90>)
(   4,<2006-03-31 10:44:27.74 +100>,<MAYBRIDGE\nmr>,<NMR_250MHZ>,
      <abs ABSG = 5 
       data hash MD5: 32K
       DE DD EA E4 CB E0 70 6B 6F F7 7F 1C 2D 60 B4 68>)
$$ ##END=
$$ 
$$ hash MD5
$$ BF F3 F1 BB 62 57 F6 DB CE B8 DC 29 D9 38 71 E5
##$RELAX= 
##$RELAX= 
##$RELAX= 
##$RELAX= 
##$RELAX= 
##$RELAX= 
##$RELAX= 
$$ Bruker specific parameters
$$ --------------------------
##$DU= <C:\u>
##$EXPNO= 1990
##$NAME= <ADRS>
##$PROCNO= 1
##$TYPE= <nmr>
##$USER= <dgb>
##$AMP= (0..31)
100 100 100 100 100 100 100 100 100 100 100 100 100 100 100 100 100 100 
100 100 100 100 100 100 100 100 100 100 100 100 100 100 
##$AQSEQ= 0
##$AQ_mod= 3
##$AUNM= <au_zg>
##$AUTOPOS= <10 >
##$BF1= 250.13
##$BF2= 250.13
##$BF3= 250.13
##$BF4= 250.13
##$BF5= 500.13
##$BF6= 500.13
##$BF7= 500.13
##$BF8= 500.13
##$BYTORDA= 1
##$CFDGTYP= 0
##$CFRGTYP= 5
##$CHEMSTR= <none>
##$CNST= (0..31)
1 1 145 1 1 1 1 1 1 1 1 1 1 1 1 1 1 1 1 1 1 1 1 1 1 1 1 1 1 1 1 1 
##$CPDPRG= <>
##$CPDPRG1= <>
##$CPDPRG2= <>
##$CPDPRG3= <>
##$CPDPRG4= <mlev>
##$CPDPRG5= <mlev>
##$CPDPRG6= <mlev>
##$CPDPRG7= <mlev>
##$CPDPRG8= <mlev>
##$CPDPRGB= <>
##$CPDPRGT= <>
##$D= (0..31)
0 1 0 0 0 0 0 0 0 0.06 0 0 0 0 0 0 0.0002 0 0 0 0 0 0 0 0 0 0 0 0 0 0 
0 
##$DATE= 1143798236
##$DBL= (0..7)
120 120 120 120 120 120 120 120 
##$DBP= (0..7)
150 150 150 150 150 150 150 150 
##$DBP07= 0
##$DBPNAM0= <>
##$DBPNAM1= <>
$$ [...]
##$SUBNAM7= <"">
##$SUBNAM8= <"">
##$SUBNAM9= <"">
##$SW= 20.6930455092707
##$SWIBOX= (0..15)
0 0 3 0 0 0 0 0 0 0 0 0 0 0 0 0 
##$SW_h= 5175.983436853
##$TD= 65536
##$TD0= 1
##$TE= 294.16
##$TE2= 300
##$TE3= 300
##$TEG= 300
##$TL= (0..7)
0 120 120 120 120 120 120 120 
##$TP= (0..7)
150 150 150 150 150 150 150 150 
##$TP07= 0
##$TPNAME0= <>
##$TPNAME1= <>
##$TPNAME2= <>
##$TPNAME3= <>
##$TPNAME4= <>
##$TPNAME5= <>
##$TPNAME6= <>
##$TPNAME7= <>
##$TPOAL= (0..7)
0.5 0.5 0.5 0.5 0.5 0.5 0.5 0.5 
##$TPOFFS= (0..7)
0 0 0 0 0 0 0 0 
##$TUNHIN= 0
##$TUNHOUT= 0
##$TUNXOUT= 0
##$USERA1= <user>
##$USERA2= <user>
##$USERA3= <user>
##$USERA4= <user>
##$USERA5= <user>
##$V9= 5
##$VALIST= <valist>
##$VCLIST= <CCCCCCCCCCCCCCC>
##$VD= 0
##$VDLIST= <DDDDDDDDDDDDDDD>
##$VPLIST= <PPPPPPPPPPPPPPP>
##$VTLIST= <TTTTTTTTTTTTTTT>
##$WBST= 1024
##$WBSW= 4
##$XGAIN= (0..3)
0 0 0 0 
##$XL= 0
##$YL= 0
##$YMAX_a= 343348
##$YMIN_a= -570600
##$ZGOPTNS= <>
##$ZL1= 120
##$ZL2= 120
##$ZL3= 120
##$ZL4= 120
##$ABSF1= 16.522
##$ABSF2= -4.171173
##$ABSG= 5
##$ABSL= 3
##$ALPHA= 0
##$AQORDER= 0
##$ASSFAC= 0
##$ASSFACI= 0
##$ASSFACX= 0
##$ASSWID= 0
##$AUNMP= <proc_1d>
##$AZFE= 0.1
##$AZFW= 0.1
##$BCFW= 0
##$BC_mod= 0
##$BYTORDP= 0
##$COROFFS= 0
##$CY= 12.5
##$DATMOD= 1
##$DC= 0
##$DFILT= <>
##$DTYPP= 0
##$F1P= 14.0000005364418
##$F2P= -0.99999901652339
##$FCOR= 0.5
##$FTSIZE= 32768
##$FT_mod= 6
##$GAMMA= 0
##$GB= 0
##$INTBC= 1
##$INTSCL= 1
##$ISEN= 128
##$LB= 0.3
##$LEV0= 0
##$LPBIN= 0
##$MAXI= 10000
##$MC2= 0
##$MEAN= 0
##$ME_mod= 0
##$MI= 0
##$NCOEF= 0
##$NC_proc= -4
##$NLEV= 6
##$NOISF1= 0
##$NOISF2= 0
##$NSP= 0
##$NTH_PI= 0
##$NZP= 0
##$OFFSET= 16.522
##$PC= 1
##$PHC0= 164.0403
##$PHC1= 2.327029
##$PH_mod= 1
##$PKNL= yes
##$PPARMOD= 0
##$PSCAL= 4
##$PSIGN= 0
##$REVERSE= no
##$SF= 250.13
##$SI= 32768
##$SIGF1= 0
##$SIGF2= 0
##$SINO= 400
##$SIOLD= 32768
##$SREGLST= <1H.DMSO>
##$SSB= 0
##$STSI= 32768
##$STSR= 0
##$SW_p= 5175.98343685301
##$SYMM= 0
##$S_DEV= 0
##$TDeff= 65536
##$TDoff= 0
##$TI= <Analysis number 999999
Compound Code 99
Book Reference 9
Project Code 9>
##$TILT= no
##$TM1= 0
##$TM2= 0
##$TOPLEV= 0
##$USERP1= <user>
##$USERP2= <user>
##$USERP3= <user>
##$USERP4= <user>
##$USERP5= <user>
##$WDW= 1
##$XDIM= 32768
##$YMAX_p= 351821700
##$YMIN_p= -227540
$$ End of Bruker specific parameters
$$ ---------------------------------
##NTUPLES= NMR SPECTRUM
##VAR_NAME=  FREQUENCY,     SPECTRUM/REAL,   SPECTRUM/IMAG
##SYMBOL=    X,             R,               I
##VAR_TYPE=  INDEPENDENT,   DEPENDENT,       DEPENDENT
##VAR_FORM=  AFFN,          ASDF,            ASDF
##VAR_DIM=   32768,         32768,           32768
##UNITS=     HZ,            ARBITRARY UNITS, ARBITRARY UNITS
##FACTOR=    0.157963299565203, 1,           1
##FIRST=     4132.6476996994, 0,             0
##LAST=      -1043.33573715361, 0,           0
##MIN=       -1043.33573715361, -227540,     0
##MAX=       4132.6476996994, 351821700,     0
$$ Real data points
##PAGE= N=1
##DATA TABLE= (X++(R..R)), XYDATA
$$ [...]
15809a03581l2756r149N5450R126l6853O2426J02873j1693k4785r46m4579k4365
$$ -103581 -136337 -145486 -90036 -80910 -117763 -55337 47536 35843 11058 10112 -34467 -58832
15797e8832k1837K6639N391o335m1287p2926M9414L8946j836j6016N444q546q956
$$ -58832 -80669 -54030 -48639 -54974 -96261 -169187 -119773 -80827 -82663 -98679 -93235 -101781 -110737
15784a10737j3367J126J1850N2566K0876q957r836L450m3184k8041n6667L6132
$$ -110737 -124104 -122978 -111128 -58562 -37686 -46643 -56479 -53029 -96213 -124254 -180921 -144789
15772a44789J1766M3407K5851j7594K217L4839J2530m5245k1372j8548N8079M4575
$$ -144789 -133023 -89616 -63765 -81359 -79142 -44303 -31773 -77018 -98390 -116938 -58859 -14284
15760a4284K0631K1624p96Q152K1025l4698m7822m2497l0495k78N619J7076j7417
$$ -14284 6347 27971 27175 35327 56352 21654 -26168 -68665 -99160 -99438 -93819 -76743 -94160
15747i4160j3425j0995J5877J0571k1890r923l4531J6902n239J2231L7985O8050
$$ -94160 -107585 -118580 -102703 -92132 -114022 -123945 -158476 -141574 -146813 -134582 -96597 -28547
15735b8547J7406m1302m015J5772k6302k1699n6280l6061O5423P2415j2159j417
$$ -28547 -11141 -52443 -56458 -40686 -66988 -88687 -144967 -181028 -115605 -43190 -55349 -56766
15723e6766K880K6978Q813l4934k1890O03J6916M7380k8394r211n1924K3736K3872
$$ -56766 -53886 -26908 -18095 -53029 -74919 -74316 -57400 -10020 -38414 -47625 -99549 -75813 -51941
15710e1941K2743m6859j4556O7226O181j412m195m2728m1100k5343L6168K2945
$$ -51941 -29198 -76057 -90613 -23387 -17206 -18618 -22813 -65541 -106641 -131984 -95816 -72871
15698g2871n881l1077l6212K9393m7082M3592J5111j9603M7631L5943M3285K569
$$ -72871 -78752 -109829 -146041 -116648 -163730 -120138 -105027 -124630 -76999 -41056 2229 4798
15686D798m87o0028j0909M3018K7543R621j0739K5667m9793m9555j5532J6057
$$ 4798 4311 -55717 -66626 -23608 3935 13556 2817 28484 -21309 -70864 -86396 -70339
15674g0339K3048k6960n0085j6726N1029M2156K1056L8188K738P333K8109o2942
$$ -70339 -47291 -74251 -124336 -141062 -90033 -47877 -26821 11367 14105 21438 49547 -13395
15662a3395k3877m77k1259L4276M7485k0330m8847l3407K5516J141k6075k3489
$$ -13395 -37272 -37749 -59008 -24732 22753 2423 -46424 -79831 -54315 -53174 -79249 -102738
15650a02738j7820N5942L9749l0387k6981k2957K1419M0934L9634K7833m4706
$$ -102738 -120558 -64616 -24867 -55254 -82235 -105192 -83773 -42839 -3205 24628 -20078
15639b0078K168L276L258l6407j8137K1860j8642K0638k3476j4340P28J4338o070
$$ -20078 -17910 -14634 -11376 -47783 -65920 -44060 -62702 -42064 -65540 -79880 -79152 -64814 -70884
15626g0884p7876m0577M795K550M9626Q30L445O1387J6639k1186L7869o2196k3238
$$ -70884 -148760 -189337 -184542 -181992 -132366 -131536 -128091 -66704 -50065 -71251 -33382 -95578 -118816
15613a18816O6218K5993n665K2031r891m2211n6105j7743K2509L117M2894J5990
$$ -118816 -52598 -26605 -32270 -10239 -20130 -62341 -118446 -136189 -113680 -110563 -67669 -51679
15601e1679m406K8176M766j7723n569j0559Q807L0019J7280N8282L4795n9956
$$ -51679 -56085 -27909 -23143 -40866 -46435 -56994 -48187 -18168 -888 57394 92189 32233
15589C2233p794n670o215o6836l6856M5195K8662j3617j6392N941l4028j3648
$$ 32233 24439 18769 12554 -54282 -91138 -45943 -17281 -30898 -47290 -41349 -75377 -89025
15577h9025j081K1306m263q432K6088K9414j7077L679Q863J0120K6436j0691J2539
$$ -89025 -90106 -68800 -73063 -81495 -55407 -25993 -43070 -39391 -30528 -20408 6028 -4663 7876
15564G876M1113l6411k0787l505l4792J1469N9054K3137m5160n6349q522j6871
$$ 7876 48989 12578 -8209 -11714 -46506 -35037 24017 47154 1994 -54355 -62877 -79748
15552g9748P839o779j4404K9657m3424L774J8036o436N4267l7959J160M0255j760
$$ -79748 -71909 -78688 -93092 -63435 -106859 -103085 -85049 -91485 -37218 -75177 -74017 -33762 -35522
15539c5522k3491k2197l5521m0733j9264K9333M1027L2716J7724j7958j5487N9798
$$ -35522 -59013 -81210 -116731 -157464 -176728 -147395 -106368 -73652 -55928 -73886 -89373 -29575
15527b9575j8590k9296N360K8445K2235K3722r86N282L4295n982l8944n1608l6222
$$ -29575 -48165 -77461 -72101 -43656 -21421 2301 1315 6597 40892 34910 -4034 -55642 -91864
15514i1864K8823m3248J6771J1316o5340l9400K3310L7761N7790M6778K8785q849
$$ -91864 -63041 -106289 -89518 -78202 -143542 -182942 -159632 -121871 -64081 -17303 11482 2633
15502B633n0934k32Q2161l8373m4262M562r068j8819m477n5545l7007L6768L1306
$$ 2633 -48301 -48533 33628 -4745 -49007 -44445 -53513 -72332 -76809 -132354 -169361 -132593 -101287
15489a01287J996K9708J7716l1048K134o552Q301O5830K7161l0773j9821M114
$$ -101287 -99291 -69583 -51867 -82915 -80781 -87333 -79032 -13202 13959 -16814 -36635 -32521
15477c2521Q323j4497m5080k2195k8369k8346O0039M8005o832p3976m4203l3742
$$ -32521 -24198 -38695 -83775 -105970 -134339 -162685 -102646 -54641 -61473 -135449 -179652 -213394
15465b13394j4146P0708Q0144q32J6886j1005k6014l7095p268J7993k874p459
$$ -213394 -227540 -156832 -76688 -77520 -60634 -71639 -97653 -134748 -142016 -124023 -126897 -134356
15453a34356p239M6823j453j707O5851L9916J8911q444k7623K239k291k2234L0717
$$ -134356 -141595 -94772 -96225 -97932 -32081 7835 26746 18302 -9321 -7082 -9373 -31607 -890
15440h90J5016m5956j5948o69J2773J7222o873L7209K1674l6048l7039k6529J3049
$$ -890 14126 -31830 -47778 -48447 -35674 -18452 -25325 11884 33558 -2490 -39529 -66058 -53009
15427e3009L8962O1288l4101p7143j8569K3445k0690q798k246k4056J8054K1863
$$ -53009 -14047 47241 13140 -64003 -82572 -59127 -79817 -88615 -90861 -114917 -96863 -75000
15415g5000j6244L0091N4445j5925l8348k1372p777m0980J5531K1242o938l961
$$ -75000 -91244 -61153 -6708 -22633 -60981 -82353 -90130 -131110 -115579 -94337 -101275 -105236
15403a05236Q594j2449L2765M8258L9831K2229p8859p8588N23N9945L270K1049
$$ -105236 -96642 -109091 -76326 -28068 11763 33992 -44867 -123455 -122932 -62987 -59717 -38668
15391c8668o32l8124k2481M1378L2851k6407o4071K6142Q796k8207n6581M1466
$$ -38668 -39300 -77424 -99905 -58527 -25676 -52083 -116154 -90012 -81216 -109423 -166004 -124538
15379a24538M6220p3604K8037L1205K8431L7907l427J360J4863L1504l5299k3423
$$ -124538 -78318 -151922 -123885 -92680 -64249 -26342 -29769 -28409 -13546 17958 -17341 -40764
15367d0764l3056J2269K1284L4891k1444k7666J4731k0601k3048O231J4823O9222
$$ -40764 -73820 -61551 -40267 -5376 -26820 -54486 -39755 -60356 -83404 -77173 -62350 6872
15355F872q335l1852j6770j2897o504n5987L315P6063L0226K000K6467n126n773
$$ 6872 -1463 -33315 -50085 -62982 -69486 -125473 -122158 -46095 -15869 -13869 12598 7472 1699
15342A699O5990M1139l8627l7291j5349j216L1733J6487o208j2555n2018n33N4710
$$ 1699 67689 108828 70201 32910 17561 16345 48078 64565 58357 45802 -6216 -6749 47961
15329D7961k1838o6514j9454J0010P2387L686k2912M228K3919l0863j5049K9394
$$ 47961 26123 -40391 -59845 -49835 22552 26238 3326 7554 31473 610 -14439 14955
15317A4955j2815j2930K7749M3692j4138m5507n45L554m632p839n0019K0522N3864
$$ 14955 2140 -10790 16959 60651 46513 1006 461 4015 -617 -8456 -58475 -37953 15911
15304A5911j9665K8795M101m2414k164P484M462j5383l5376m2695l2049k0963
$$ 15911 -3754 25041 29142 -13272 -15436 -7952 -3490 -18873 -54249 -96944 -128993 -149956
15292a49956L9152K6725p190l7416j9519N8925R2916N383p299L9088N631o4734
$$ -149956 -110804 -84079 -91269 -128685 -148204 -89279 3637 9020 1721 40809 46440 -18294
15280a8294m5121J540K2419Q248l5641l8498j5195J1126N2888r509j14133L6825
$$ -18294 -63415 -61875 -39456 -31208 -66849 -105347 -120542 -109416 -56528 -66037 -180170 -143345
15268a43345J3698k0119M4871L3315N2265j6402k0917L9072N4662p1618n4057
$$ -143345 -129647 -149766 -104895 -71580 -19315 -35717 -56634 -17562 37100 -34518 -88575
15257h8575L435K0980L4425o5306l1320J4442Q881j806K7962J3602K2942m415
$$ -88575 -85140 -64160 -29735 -95041 -126361 -111919 -103038 -104844 -76882 -63280 -40338 -44753
15245d4753k9848K5599K7157N768p5314j8893n843j2072L4874q227L4067M4571
$$ -44753 -74601 -49002 -21845 -16077 -91391 -110284 -116127 -128199 -93325 -101552 -67485 -22914
15233b2914N9044o047q084n9084m726k491K4848M5290K9065l9954p924k1795j3420
$$ -22914 36130 30083 21999 -37085 -41811 -44302 -19454 25836 54901 14947 7023 -14772 -28192
15220b8192l4073K4661k738O6713K1384m0060J4574K8226k1733J8656n23o3677
$$ -28192 -62265 -37604 -40342 26371 47755 7695 22269 50495 28762 47418 46895 -16782
15208a6782L160o844K6221J5695L5842k1784j6492q475O7765O4785q726m3892
$$ -16782 -13622 -20466 5755 21450 57292 35508 19016 10541 78306 143091 134365 90473
15196I0473m6383k5704K6281L3128Q015l0368k3232n862m1136J7451L0124l306
$$ 90473 44090 18386 44667 77795 85810 55442 32210 26348 -14788 2663 32787 29481
15184B9481l4702j8274j4692N82l9994j6208L4294M5626K2171n565l738M3860
$$ 29481 -5221 -23495 -38187 -37605 -77599 -93807 -59513 -13887 8284 2719 -1019 42841
15172D2841P2065k1714m1752k7676o2458k4219M63M3836L5048Q22n5669j2580
$$ 42841 114906 93192 51440 23764 -38694 -62913 -62450 -18614 16434 17256 -38413 -50993
15160e0993J8880P722J1364L5999R101N54Q451j3545m6104n296N4372K9422j8086
$$ -50993 -32113 -24391 -13027 22972 32073 32627 41078 27533 -18571 -23867 30505 59927 41841
15147D1841k1123L57l3691p120m0707m8665L3862O9731K4514P328o3059M6198
$$ 41841 20718 21075 -12616 -19736 -60443 -109108 -75246 -5515 18999 26327 -36732 9466
15135I466L4111o2320m7344M34Q3628l75p048L3020j0791J1669J9806m1952k0229
$$ 9466 43577 -18743 -66087 -65653 17975 17600 10552 43572 32781 44450 64256 22304 2075
15122B075J9162K607q936L4474n339j3979j3317j3520P232j8259q4871k5936N1718
$$ 2075 21237 23844 14908 49382 44043 30064 16747 3227 10459 -7800 -92671 -118607 -66889
15109f6889O6096P0102m4107n609L3304m7252n4120j4311J8774M8093j4796l2319
$$ -66889 -793 69309 25202 19593 52897 5645 -48475 -62786 -44012 4081 -10715 -43034
15097d3034n12L8321J1875J200L4776Q913K1627L0908J2490j9554J9647k0219
$$ -43034 -43546 -5225 6650 7850 42626 51539 73166 104074 116564 97010 116657 96438
15085I6438p5703l7833j1187L4363j5836l5783l5041N8816K9518J2627l4130l2604
$$ 96438 20735 -17098 -28285 6078 -9758 -45541 -80582 -21766 7752 20379 -13751 -46355
15073d6355K7154P9763J4563j6707q1469o2252J8482M7205k8397N8909K1031j5215
$$ -46355 -19201 60562 75125 58418 -23051 -85303 -66821 -19616 -48013 10896 31927 16712
15061A6712q8275k4359O0010q293j7257K0020j0878L0154K767N6083m5561n1522
$$ 16712 -71563 -95922 -35912 -44205 -61462 -41442 -52320 -22166 -19399 36684 -8877 -60399
15049f0399K1286J9111m7200j3575j5233L2518K1204m329j5926m224L6422K0454
$$ -60399 -39113 -20002 -67202 -80777 -96010 -63492 -42288 -46617 -62543 -66767 -30345 -9891
15037i891O4330J0595K230j8621p456l3369l0118J0636K8224k1049q108j192L3534
$$ -9891 54439 65034 67264 48643 41187 7818 -22300 -11664 16560 -4489 -12597 -13789 19745
15024A9745j8363M309j0080r132K4845l1568m1638L6867M2540R919L3925l1448
$$ 19745 1382 5691 -4389 -13521 11324 -20244 -61882 -25015 17525 27444 61369 29921
15012B9921o0291n2032m0265k4828J4347L4104L3921j3107m5837j2594L3799K5748
$$ 29921 -30370 -82402 -122667 -147495 -133148 -99044 -65123 -78230 -124067 -136661 -102862 -77114
15000g7114n348k5981n6332J8268K2694J4584K3256K5519l4939q078j3547M9794
$$ -77114 -82462 -108443 -164775 -146507 -123813 -109229 -85973 -60454 -95393 -103471 -117018 -67224
14988f7224J5075k2732k1866L1110J9526K9108n0731l9047J7234M3065M5442K7656
$$ -67224 -52149 -74881 -96747 -65637 -46111 -17003 -67734 -106781 -89547 -46482 -1040 26616
14976B6616k0570k1309n236J1743m2001k1929j7964L041j0364K2899Q636n9893
$$ 26616 6046 -15263 -20499 -8756 -50757 -72686 -90650 -87609 -97973 -75074 -66438 -126331
14964a26331l993Q535R662N775j391j275j2419L8951Q0756j9154j6975K408R800
$$ -126331 -130324 -121789 -112127 -106352 -107743 -109018 -121437 -82486 -1730 -20884 -37859 -35451 -25651
14951b5651P726P264k0254L947j2946J2733o621j1287l0626J9742P7279J6383
$$ -25651 -17925 -10661 -30915 -26968 -39914 -27181 -33802 -45089 -75715 -55973 21306 37689
14939C7689k4832j1632J1325j5608k7418m5173J6587L4055N0745l8500o9118P1952
$$ 37689 12857 1225 12550 -3058 -30476 -75649 -59062 -25007 25738 -12762 -81880 -9928
14927i928O393m7873k5330j8829l5767l359j2193J5465L7084L9911J2768M726
$$ -9928 -3535 -51408 -76738 -95567 -131334 -134693 -146886 -131421 -94337 -54426 -41658 -36932
14915c6932j7634r2243j8870J3272M8343M1184k7962k8201p5313K7750Q1474M9669
$$ -36932 -54566 -146809 -165679 -152407 -104064 -62880 -90842 -119043 -194356 -166606 -85132 -35463
14903c5463n6679M2527N4622q285j154o3754n5980M0042L6362J3194l6487R649
$$ -35463 -92142 -49615 5007 -3278 -4432 -68186 -124166 -84124 -47762 -34568 -71055 -61406
14891f1406O7438n406J104j0420j7177n8042l5212N4221L4323L742N10M735q536
$$ -61406 6032 626 1730 -8690 -25867 -83909 -119121 -64900 -30577 -26835 -26325 -21590 -30126
14878c0126K5095j0266k2174n1934K2246N0655K000j0359L5549j5093m0485n91
$$ -30126 -5031 -15297 -37471 -89405 -67159 -16504 -14504 -24863 10686 -4407 -44892 -45483
14866d5483J2703M0048j9219o6634j4847K7573q115k3191j9726P8633O833M538
$$ -45483 -32780 7268 -11951 -78585 -93432 -65859 -73974 -97165 -116891 -38258 -31425 -26887
14854b6887N268j3291L253j8704n0473P0552Q7793M1053j1862m5152o2037p2406
$$ -26887 -21619 -34910 -31657 -50361 -100834 -30282 57511 98564 86702 41550 -20487 -92893
14842i2893l886L3605L4423o8955l7671m5460R312N8628N47J014O9820K3585L3491
$$ -92893 -96779 -63174 -28751 -97706 -135377 -180837 -171525 -112897 -112350 -111336 -41516 -17931 15560
14829A5560O0793m2776j5596l3652j9631K0180k9325O966J9259M1M3444k4792
$$ 15560 76353 33577 17981 -15671 -35302 -15122 -44447 -37481 -18222 -18181 25263 471
14817D71k3054M5433m7849l6203k0776P3115P5289n6289O294N7723M8404m5284
$$ 471 -22583 22850 -24999 -61202 -81978 -8863 66426 10137 16431 74154 122558 77274
14805G7274n1824J85m4078J320L3488O9207N716L437j1220k6804j9774k1275k1312
$$ 77274 25450 25635 -18443 -17123 16365 85572 91288 94725 83505 56701 36927 15652 -5660
14792e660p312J1534M0949K2356k7733J207m9820k1678L2884N1463K2370j4538
$$ -5660 -12972 -1438 39511 61867 34134 35341 -14479 -36157 -3273 48190 70560 56022
14780E6022m1842k0594j8098m958J848r515M9639j8184j6727P269k6918m7200
$$ 56022 14180 -6414 -24512 -29470 -27622 -37137 12502 -5682 -22409 -15140 -42058 -89258
14768h9258L7112o583n2105l2364M9550P6993q332P572j0564n1541R802K4093
$$ -89258 -52146 -58729 -110834 -143198 -93648 -16655 -24987 -17415 -27979 -79520 -69718 -45625
14756d5625K8713j2996K1741P903j4120k4300R976J6858N9448j2576r834J5039
$$ -45625 -16912 -29908 -8167 -264 -14384 -38684 -28708 -11850 47598 35022 25188 40227
14744D0227j5384m2110n2732Q392J2625l6098m5697L8823M6383J4536j8298J2160
$$ 40227 24843 -17267 -69999 -61607 -48982 -85080 -130777 -91954 -45571 -31035 -49333 -37173
14732c7173k0321N65l1731L293J11591L6125k620j3542n2670n5627l1603J9192
$$ -37173 -57494 -56929 -88660 -85367 26224 62349 59729 46187 -6483 -62110 -93713 -74521
14720g4521L9313P303J2261M340l2661K7352N1079j9831m9594m700l839K4688
$$ -74521 -35208 -27905 -15644 -11304 -43965 -16613 34466 14635 -34959 -39659 -43498 -18810
14708a8810J1679k4821j009J627m229R817l164K7042N00j4292m0028R561K2059
$$ -18810 -7131 -31952 -32961 -31334 -35563 -25746 -28910 -1868 -1368 -15660 -55688 -46127 -24068
14695b4068J9347K8491l9045m7200K1064k8564K3501M7908J6924k9865m378K6698
$$ -24068 -4721 23770 -15275 -62475 -41411 -69975 -46474 1434 18358 -11507 -15885 10813
14683A0813J6334K9993j9014J5387j2342q141k507J3297j8336J8778O2676O8014
$$ 10813 27147 57140 38126 53513 41171 33030 30523 43820 25484 44262 106938 174952
14671A74952J6941L1263j4318K1098N3576M1516M764O4141O8938p024j2699L3502
$$ 174952 191893 223156 208838 229936 283512 325028 329792 393933 462871 455847 443148 476650
14659D76650L5700k0448k575O168L8222N979o4276p7177j4717k1557L516J2522
$$ 476650 512350 491902 489327 495495 533717 539696 475420 398243 383526 361969 365485 378007
14647C78007k5349j8473j7078J7557l0499o1031R565N4587k0965m6144R045O7274
$$ 378007 352658 334185 317107 334664 304165 243134 252699 307286 286321 240177 249222 316496
14635C16496O2277K7273k6807p6276J7953O6176P5307L0554m8762J5812N2511
$$ 316496 378773 406046 379239 302963 320916 387092 462399 492953 444191 460003 512514
14624E12514k0083J4978M509R066l9156N991m937p858m8865p2556l6909n7610
$$ 512514 492431 507409 511918 520984 481828 487819 482882 475024 426159 353603 316694 259084
14612B59084K0377N5565N44p888p0842m4371r887m9182m4012M383K3197L3137
$$ 259084 279461 335026 335570 327682 256840 212469 202582 153400 109388 113771 136968 170105
14600A70105L8891l3381j02691o4751K4756O8062K7249J8285J35m2260k301K1513
$$ 170105 208996 175615 72924 8173 32929 100991 128240 146525 146660 104400 102099 123612
14588A23612L8099Q2306N0474m5668k6114N2634M8189Q0190K8446l0142J3355
$$ 123612 161711 244017 294491 248823 222709 275343 323532 403722 432168 402026 415381
14577D15381J45868R2248L7844L6756K8752M0564K9131l3452k8568l1760j6118
$$ 415381 561249 653497 691341 728097 756849 797413 826544 793092 764524 732764 716646
14566G16646j2611j09880o6318l4884O948M1373j7673o8418l7680R198p84k9888
$$ 716646 704035 594155 527837 492953 499901 541274 523601 455183 417503 426701 425917 396029
14554C96029K8915L5575J7711l2656L8769k1574K6568J3039M6426Q3149J9347
$$ 396029 424944 460519 478230 445574 484343 462769 489337 502376 548802 631951 651298
14543F51298k0225j3594K8529K8593l3747K3013K7553l0217j4750Q671l3421o0075
$$ 651298 631073 617479 646008 674601 640854 663867 691420 661203 646453 655124 621703 561628
14531E61628p5899L878p5571p8229j8240j04852k9461k1991m4154N3469N709L9448
$$ 561628 485729 489607 414036 335807 317567 212715 183254 161263 117109 170578 176287 215735
14519B15735J2509j429j6997K622j6155j1657M3761K3400N683q6948r4122n1027
$$ 215735 228244 226815 209818 212440 196285 184628 228389 251789 257472 170524 76402 25375
14507B5375M9125K0246N462j1307j7668M6247O3355l4756l9872o613J8457O772
$$ 25375 74500 94746 100208 88901 71233 117480 180835 146079 106207 99594 118051 124823
14495A24823o5906p554K0069N2193J1043l8899l7810K5325J7417K8037J1594N323
$$ 124823 58917 51363 71432 123625 134668 95769 57959 83284 100701 128738 140332 145655
14483A45655K5886Q103o0447J9045O5939k2010J5464J3285l9815j6511r759R757
$$ 145655 171541 179644 119197 138242 204181 182171 197635 210920 171105 154594 144835 154592
14471A54592J0221n1287J3991j2682l9481M715L4845k5530j1005J8371j0081q058
$$ 154592 164813 113526 127517 114835 75354 80069 114914 89384 78379 96750 86669 78611
14459G8611q714M8576K9858o973N2041M7602K2334r3480l8013Q386J3536K5451
$$ 78611 69897 118473 148331 141358 193399 241001 263335 169855 131842 140228 153764 179215
14447A79215j8803o9191k2967N2636o290P818p863L743Q668l7837j05428j0343
$$ 179215 160412 91221 68254 120890 114600 122418 114555 118298 126966 89129 -16299 -26642
14435b6642K4528M5465J6613M926k2431k4031m120n852J5796k1198j5224K0820
$$ -26642 -2114 43351 59964 64890 42459 18428 14308 8456 24252 3054 -12170 8650
14423H650P329k1780r4551K7167Q0125k1558j9950L7768j4620Q813O246p4249
$$ 8650 15979 -5801 -100352 -73185 6940 -14618 -34568 3200 -11420 -2607 3639 -70610
14411g0610J9980K3193J7260k0473m6472l7428n713M2948K1766L597O9937K2710
$$ -70610 -50630 -27437 -10177 -30650 -77122 -114550 -120263 -77315 -55549 -51952 17985 40695
14399D0695m1031l9334L7730J9948J563m9458k7663Q0617P757J4J9430j8408n8220
$$ 40695 -336 -39670 -1940 18008 19571 -29887 -57550 23067 30824 30838 50268 31860 -26360
14386b6360j0889K7666K8138j606q155k3259k2028j033R837K9911j1103j46J7713
$$ -26360 -37249 -9583 18555 16949 8794 -14465 -36493 -37526 -27689 2222 -8881 -9027 8686
14373H686L0501J384k8528R346K4736P1891j6823k5470p5093L5192J42479R6462
$$ 8686 39187 40571 12043 21389 46125 118016 101193 75723 630 35822 178301 274763
14361B74763p599k525K1946k7776k104L614n940l873K8673J8767K6847Q800m419
$$ 274763 267164 264639 286585 258809 256705 260319 254379 250506 279179 297946 324793 333593 329174
14348C29174n7064r4014k5910N5822j6827l7297m2920k2136O897o1147k1711L5358
$$ 329174 272110 178096 152186 208008 191181 153884 110964 88828 95725 34578 12867 48225
14336D8225m581l983K3515n3493J2750J5504l2588k7622N0465K0679k9457j3009
$$ 48225 43644 39661 63176 9683 22433 37937 5349 -22273 28192 48871 19414 6405
14324F405R789l5709K6652n895L5937N584L1035p331m9713J1775l380k6106n7722
$$ 6405 16194 -19515 7137 1242 37179 42763 73798 66467 16754 28529 25149 -957 -58679
14311e8679L8804M2393L5412n3271K132l3416o95L2757J4233j9347j9724L386
$$ -58679 -19875 22518 57930 4659 6791 -26625 -27320 5437 19670 323 -19401 -16015
14299a6015k1371O058o8320l938Q0142q32R262Q1370L10n9220K0334J2754j0154
$$ -16015 -37386 -31328 -99648 -103586 -23444 -24276 -15014 66356 66666 7446 27780 40534 30380
14286C0380k8003n5809K6285J5134r783o852N0356O956K7377j6070j5223K7053
$$ 30380 2377 -53432 -27147 -12013 -21796 -28648 21708 28664 56041 39971 24748 51801
14274E1801j7896j06641j8126K8182L5318M157r852P686n2141J6883J8855k394
$$ 51801 33905 -72736 -90862 -62680 -27362 -23205 -33057 -25371 -77512 -60629 -41774 -44168
14262d4168J0999k3484O449Q3026k5687p7119k8123L0842K4083K7061L6947l9573
$$ -44168 -33169 -56653 -50204 32822 7135 -69984 -98107 -67265 -43182 -16121 20826 -18747
14250a8747l5873M42N863J9203K3939L5831M8292k6282q3852j0455J9636j2853
$$ -18747 -54620 -54178 -48315 -29112 -5173 30658 78950 52668 -31184 -41639 -22003 -34856
14238c4856K8714j0533M189l544o3702l6282L8040K2581N1558j3533k8250m4123
$$ -34856 -6142 -16675 -12486 -16030 -79732 -116014 -77974 -55393 -3835 -17368 -45618 -89741
14226h9741n9993j3544P1998P3109K345j8583q680P266R146J1807L2885N0899
$$ -89741 -149734 -163278 -91280 -18171 -15826 -34409 -43089 -35823 -26677 -14870 18015 68914
14214F8914m0693r4894q366N2399K0896m7764O0980L7933O309P49k9875n3021
$$ 68914 28221 -66673 -75039 -22640 -1744 -49508 11472 49405 55714 56463 26588 -26433
14202b6433L1516J3017K9398L7360K6730p7932m454k6405n3500N788L7563q110
$$ -26433 5083 18100 47498 84858 111588 33656 29202 2797 -50703 -44915 -7352 -15462
14190a5462L9184l2574L451M8120N8084o4758k1111l8759K575M6195L4451q457
$$ -15462 23722 -8852 -5401 42719 100803 36045 14934 -23825 -21250 24945 59396 50939
14178E0939j900R641J7138K536p377j9904k3175l8512J3418J8650L78j5946j1458
$$ 50939 49039 58680 75818 78354 70977 51073 27898 -10614 2804 21454 21832 5886 -5572
14165e572K4175M0143M9838j4750l0397j582N0233M0778l1372n2350Q780k1396
$$ -5572 18603 58746 108584 93834 63437 61855 112088 152866 121494 69144 77924 56528
14153E6528j551Q856N9422P203k563p663o0764j6085L7095O477q677K7152r104
$$ 56528 54977 63833 123255 130458 127895 120232 59468 43383 80478 86955 78278 105430 96326
14140I6326m3342l8469J6498o046m2213l9668M910K1024l9068K6494k286M1908
$$ 96326 52984 14515 31013 24967 -17246 -56914 -52004 -30980 -70048 -43554 -45840 -3932
14128c932N0034o61R164Q211n0798k7510Q7078K2692o3215m3756M3649Q1237p637
$$ -3932 46102 45441 54605 62816 12018 -15492 71586 94278 31063 -12693 30956 112193 104556
14115A04556j6523M129k7002n215k9833o054L2357l4762l2637l5605j3562N6661
$$ 104556 88033 92162 65160 59945 30112 24058 56415 21653 -10984 -46589 -60151 -3490
14103c490j527n822K6905K1812L0932l358n326k6472N146K9316J3096k2587l9667
$$ -3490 -5017 -10839 16066 37878 68810 65452 60126 33654 38800 68116 81212 58625 18958
14090A8958K7240J3012P6880N6278M4647R808n8530l8836N684K8782m239J9345
$$ 18958 46198 59210 136090 192368 237015 246823 188293 149457 155141 183923 179684 199029
14078A99029M4109J3746O6979p829n0250l1670L7800O2511J1895k276K426p9488
$$ 199029 243138 256884 323863 316034 265784 234114 271914 334425 346320 344044 346470 266982
14066B66982n3762J6328J4451m1504K326l6788o4759l4273M9274L9792N3880l534
$$ 266982 213220 229548 243999 202495 204821 168033 103274 69001 118275 158067 211947 208413
14054B08413l2763p926M5148L8848j4594l2799K2356k8057M1402Q5873L0623k6
$$ 208413 175650 167724 212872 251720 237126 204327 226683 198626 240028 325901 356524 356498
14042C56498K7410l814j3277q6595l4937O505J1750M1717N16R208l8478j2073
$$ 356498 383908 380094 366817 280222 245285 251790 263540 305257 305773 314981 276503 264430
14030B64430k3214K6940N578m0668N482J0018L3502l9195k9061K7694J0141l3266
$$ 264430 241216 268156 273734 233066 238548 248566 282068 242873 213812 241506 251647 218381
14018B18381M5521L624j0003o198l2447m3224m6782o3437K8632L1119L7963L9474
$$ 218381 263902 267526 257523 251325 218878 175654 128872 65435 94067 125186 163149 202623
14006B02623k1817k6641j2230K1146Q625k934j9692O4570L347l0291m3463k6923
$$ 202623 180806 154165 141935 163081 171706 168772 149080 213650 216997 186706 143243 116320
13994A16320o297O1984R2022P8458M1931l7695L5286R6852L8310L280L2587O061
$$ 116320 110023 172007 264029 342487 384418 346723 382009 478861 517171 520451 553038 559099
13982E59099J5343N7340J4118j073K2259O9716k2285n1209r722j7388m1369j8320
$$ 559099 574442 631782 645900 644827 667086 736802 714517 663308 653586 636198 594829 576509
13970E76509n950l9620k2312l8851l1121k6632l6233J02389N4845K8126k6541
$$ 576509 570559 530939 508627 469776 438655 412023 375790 478179 533024 561150 534609
13959E34609l562L9452K0166j0016p3781p9308n5899J6394R3648L4449M8760K5470
$$ 534609 531047 570499 590665 580649 506868 427560 371661 388055 481703 516152 564912 590382
13947E90382N3919M6756J464j783L4988N7043m2255q1076m5108k4558K1676p366
$$ 590382 644301 691057 692521 690738 725726 782769 740514 659438 614330 589772 611448 604082
13935F04082j2958m7757k5026l3787k8783L0550l9650p2560n2829j0750J6680
$$ 604082 591124 543367 518341 484554 455771 486321 446671 374111 321282 310532 327212
13924C27212N3686p708j5899k1877k4842k9258J5829m2826q078O486m8207p5030
$$ 327212 380898 373190 357291 335414 310572 281314 297143 254317 246239 252725 204518 129488
13912A29488j9265L5995l6199j4856Q613p534L0635j3653J5747L8219N425l9968
$$ 129488 110223 146218 110019 95163 103776 96242 126877 113224 128971 167190 172615 132647
13900A32647l4104l7147L7595K3587r323M6159J001K813K5311J9667j0084m3504
$$ 132647 98543 61396 98991 122578 113255 159414 160415 163228 188539 208206 198122 154618
13888A54618j6451M379M78k5665l6488J4993j6070j1380N4449l520K0468M2689
$$ 154618 138167 142546 143024 117359 80871 95864 79794 68414 122863 119343 139811 182500
13876A82500m279N234K6768J0002P173m3783n0476J4720N1119N1900J9413N433
$$ 182500 178221 183455 210223 220225 227398 183615 133139 147859 198978 250878 270291 275724
13864B75724k3129L9109O1216K3422k3606O2283K1434K7796Q4574m924p98L3080
$$ 275724 252595 291704 352920 376342 352736 415019 436453 464249 548823 543899 543101 576181
13852E76181L8518J7395O9198K6013K5853l202L9574J4362o530n9603o687M7105
$$ 576181 614699 632094 701292 727305 753158 749956 789530 803892 797362 737759 731072 778177
13840G78177L1779m965k571K277k8759m3306K4727K246k3198l0451K7871M1965
$$ 778177 809956 804991 802420 804697 775938 732632 757359 759605 736407 705956 733827 775792
13828G75792K4734K0322O9380m332l8474j5897K8216L7183n0136l9019j9854o9690
$$ 775792 800526 820848 890228 885896 847422 831525 859741 896924 846788 807769 787915 718225
13816G18225l0619O758l8947n4136p8417o4143k944n2662l6718Q238p276J099
$$ 718225 687606 694364 655417 601281 522864 458721 455777 403115 366397 374635 367359 368458
13804C68458n0345j2351n4530O44j0097j0787K4832J7651l5292P332J705q66q291
$$ 368458 318113 305762 251232 251876 241779 230992 255824 273475 238183 245515 247220 246354 238063
13791B38063j0573K6301m9456o849J9077J9126J4355J5784J0630k4231n45K1173
$$ 238063 227490 253791 204335 197486 216563 235689 250044 265828 276458 252227 251682 272855
13779B72855k61L5039M1907m5562q3087k9012k7766k6230N4226O4303L6946k31
$$ 272855 272594 307633 349540 303978 220891 191879 164113 137883 192109 256412 293358 293127
13767B93127k704L157m7661j0410L0161N2604N1788J7018j8675J1186P1696l1323
$$ 293127 290423 293580 245919 235509 265670 318274 370062 387080 368405 379591 451287 419964
13755D19964k0193N4920k6323L2948N0864J7572M0623m4744l3600m2506J5534
$$ 419964 399771 454691 428368 461316 512180 529752 570375 525631 492031 449525 465059
13744D65059O246k8732k5944M1596O7467M2817K9377m1955m7873n7964j545P3403
$$ 465059 471305 442573 416629 458225 525692 568509 597886 555931 508058 450094 448549 521952
13732E21952P3319j6788k8729k8443K9116L0830K355n4952k7038n607j8366k0374
$$ 521952 595271 578483 549754 521311 550427 581257 583612 528660 501622 496015 477649 457275
13720D57275l2191p692o9679k8123l7911k6837J6116o834j7792N394k3710j0201
$$ 457275 425084 417392 347713 319590 281679 254842 270958 264124 246332 251726 228016 217815
13708B17815N718n6098m4292O968M4296J5960K7072J0163l3091m125L5534l4847
$$ 217815 223533 167435 123143 130111 174407 190367 217439 227602 194511 190386 225920 191073
13696A91073l8216Q504k7944K455n643j1100j3727P510m62l3643Q990K2979m32
$$ 191073 152857 161361 133417 135872 130229 119129 105402 112912 112450 78807 87797 110776 110344
13683A10344l2686J1094J9990K9907J9364n0805r14m671L7952L5189R675N7171
$$ 110344 77658 88752 108742 138649 158013 107208 106294 101623 139575 174764 184439 241610
13671B41610j04506n7501j4245l2018n809J1152O4561P429m678k1808l0903K3518
$$ 241610 137104 79603 65358 33340 27531 38683 103244 110673 105995 84187 53284 76802
13659G6802m8995j9448J0965o4614K5284K5700k8071J7905L4418j4300j2066J3998
$$ 76802 27807 8359 19324 -45290 -20006 5694 -22377 -4472 29946 15646 3580 17578
13647A7578Q864j36j5268K3757k4353j2404K8062K6665J7936P4656k3631J5675
$$ 17578 26442 26306 11038 34795 10442 -1962 26100 52765 70701 145357 121726 137401
13635A37401k554p273o88l6843k768J9669l9031j2816L6106j2899J3386L2978
$$ 137401 134847 127574 126886 90043 87275 106944 67913 55097 91203 78304 91690 124668
13623A24668M546M890l6787m2893j1528j8997k0829P108l8030l1071J4718N4556
$$ 124668 129214 134104 97317 54424 42896 23899 3070 10178 -27852 -58923 -44205 10351
13611A0351N4236P0160q7492j24333k4440L1819M9272l398L417L2971J4386K5045
$$ 10351 64587 134747 47255 -77078 -101518 -69699 -20427 -23825 -20408 12563 26949 51994
13599E1994K8645n851n6791j06569N9890j0301q219j945K9235O8643K7276l7125
$$ 51994 80639 74788 17997 -88572 -28682 -38983 -47202 -49147 -19912 48731 76007 38882
13587C8882k6119k6954k8055m7933J7095O1839J5585N574M0888M4833k6832l9150
$$ 38882 12763 -14191 -42246 -90179 -73084 -11245 4340 9914 50802 95635 68803 29653
13575B9653l976R086j465k0344j567k5399L2592L965M6947j9207j9752J3202k6443
$$ 29653 25677 34763 33298 12954 11387 -14012 18580 22545 69492 50285 30533 43735 17292
13562A7292K2824j0269m1089J5601l748k0224K5474L3240k0734M7181L4330o259
$$ 17292 40116 29847 -11242 4359 611 -19613 5861 39101 18367 65548 99878 93619
13550I3619m5406m6019j9854L1489o435L9364J7500J7440m4856Q114K164j4536
$$ 93619 48213 2194 -17660 13829 7394 46758 64258 81698 36842 44956 47120 32584
13538C2584j496k1658L7617l0211m7356M6947n238N744K8404O887L1806K3802
$$ 32584 31088 9430 47047 16836 -30520 16427 11189 16933 45337 52224 84030 107832
13526A07832k1520l9778n5697j2324M1519J1211N711L5186M7861K1195l0680J9729
$$ 107832 86312 46534 -9163 -21487 20032 31243 36954 72140 120001 141196 110516 130245
13514A30245l0999k1848o7209O033K3278M3830K0799r1818p3505J8307L5721j3444
$$ 130245 99246 77398 10189 16222 39500 83330 104129 12311 -61194 -42887 -7166 -20610
13502b0610P87J8004K7564j4105k61L3523l0842K1334K6946J4356n57K2952N21
$$ -20610 -19823 -1819 25745 11640 11379 44902 14060 35394 62340 76696 76139 99091 99612
13489I9612k669L1677j1700p4929p4765P7184K8644k8072j3425j2124L0888j5137
$$ 99612 96943 128620 116920 41991 -32774 44410 73054 44982 31557 19433 50321 35184
13477C5184J9933k1019j9094N7858l075k7545m0326Q422M7347J0965k0923n0301
$$ 35184 55117 34098 15004 72862 69787 42242 1916 10338 57685 68650 47727 -2574
13465b574K5900N4365L2337k9137J4581K4699J8400k350j830K1042k5733r407
$$ -2574 23326 77691 110028 80891 95472 120171 138571 136221 134391 155433 129700 120293
13453A20293J5402K7000K7747m0393l6802k1442k7196J0107J6844k1656o2159
$$ 120293 135695 162695 190442 150049 113247 91805 64609 74716 91560 69904 7745
13442G745q326P5421m38k1178l3580K4527M1749J6848k3503l4075l1433J1145
$$ 7745 -581 74840 74402 53224 19644 44171 85920 102768 79265 45190 13757 24902
13430B4902J0917M18J0118j5369J2267K8470K3024n5590n4724j6710J0036K5960
$$ 24902 35819 36237 46355 30986 43253 71723 94747 39157 -15567 -32277 -22241 3719
13418C719k2864k583K6830k8183M0576M5694N019k9383m2660l3379j3618J390
$$ 3719 -19145 -21728 5102 -23081 17495 63189 68208 38825 -3835 -37214 -50832 -49442
13406d9442J7898M9036P70l5828K8557O0742O132P463K1339J0009o7183p0867
$$ -49442 -31544 17492 18262 -17566 10991 71733 77865 85328 106667 116676 49493 -21374
13394b1374l9940L0298Q6968L7470j5700P482R019j7219m159k8586j6285K900
$$ -21374 -61314 -31016 55952 93422 77722 85204 94223 77004 72845 44259 27974 30874
13382C0874J3835q39k9133q679l486M0034J8701L9372L2038l0896n3316o150j7141
$$ 30874 44709 43870 14737 6058 2572 42606 61307 100679 132717 101821 48505 42355 25214
13369B5214J264j3466M8300M6774Q810K1597R131k2732L981r361n7006l6701l2685
$$ 25214 26478 13012 61312 108086 116896 138493 147624 124892 128873 119512 62506 25805 -6880
13356f880P478N3191J7041M6156n922k0364j0104K1485k3521m0624j6913K1878
$$ -6880 598 53789 70830 116986 111064 90700 80596 102081 78560 37936 21023 42901
13344D2901M8384o1397k7645J8426j495M4593L8513J0127o3965k208m615r995
$$ 42901 91285 29888 2243 20669 19174 63767 102280 112407 48442 46234 41619 31624
13332C1624P07K7571r167m3415L43K7630L2692l5973L770q399j0578J5050O91
$$ 31624 32331 59902 50735 7320 7663 35293 67985 32012 35782 27383 16805 31855 32546
13319C2546j7505L680K8162L8394m3275j8491J8034j9896K8210j754j4106k1076
$$ 32546 15041 18721 46883 85277 42002 23511 41545 21649 49859 48105 33999 12923
13307A2923n872P971k4090j4978L9514O64m993O322K9599p373J3093N5203m3071
$$ 12923 7051 15022 -9068 -24046 15468 16132 11139 17461 47060 39687 52780 107983 64912
13294F4912r4999M5145L7905n9993o866J5063K726M321J6582r04m0371Q35J8353
$$ 64912 -30087 15058 52963 -7030 -13896 1167 3893 8214 24796 23892 -16479 -15644 2709
13281B709j3339K3507M6626n728q711K4386M0926k7784q2188m6691M7721R5828
$$ 2709 -10630 12877 59503 53775 45064 69450 110376 82592 404 -46287 1434 97262
13269I7262n292M35O358l7646k4452m432j5311n037Q8011O5671k6639l1573n9628
$$ 97262 91970 92405 98763 61117 36665 32233 16922 11885 99896 165567 138928 107355 47727
13256D7727q482J8978n2039k1569J5492L5982M1700J4741J686k844N8364J9466
$$ 47727 39245 58223 6184 -15385 107 36089 77789 92530 94216 91372 149736 169202
13244A69202j2724m3123m8177j6531L469N3985J6412j3075L3428M8505l5583l0504
$$ 169202 156478 113355 65178 48647 52116 106101 122513 109438 142866 191371 155788 125284
13232A25284m4465n7533r996L0829L2962O5295n0162Q032K8740j4827k073K215
$$ 125284 80819 23286 13290 44119 77081 142376 92214 100246 128986 114159 112086 114301
13220A14301P0713N0900m0247l1548K5913J442K7553j9139l4078J367j6562J4607
$$ 114301 185014 235914 195667 164119 190032 191474 219027 199888 165810 167177 150615 165222
13208A65222M011K5982Q157N615K3045L7673N709K7244M432Q143m3682K3530N061
$$ 165222 169233 195215 203372 208987 232032 269705 275414 302658 307090 315233 271551 295081 300142
13195C00142o9302l7151P244K9071K4550k1202k3934l5336N1336M4389k2093j1522
$$ 300142 230840 193689 200933 230004 254554 233352 209418 174082 225418 269807 247714 236192
13183B36192o722J7564P377j0894N5L5772k9832k806L7672M2710Q130J6274l2241
$$ 236192 229470 247034 254411 243517 243572 279344 249512 246706 284378 327088 335218 351492 319251
13170C19251m2335J6251J842J7014l1990J2082J4783j6587N403M8811J5520j7608
$$ 319251 276916 293167 295009 312023 280033 292115 306898 290311 295714 344525 360045 342437
13158C42437n5499j2449J8522J618K6131l3296q551M9516j4594r8863q606Q240
$$ 342437 286938 274489 293011 294629 320760 287464 278913 328429 313835 214972 206366 214606
13146B14606L3581K5594m2661n4882k1595l964o434J4830j0017j6025l7737J3037
$$ 214606 248187 273781 231120 176238 154643 150679 144245 159075 149058 133033 95296 108333
13134A08333J3408K349M699j0201L3609L4650j9080J2198K2977K4817J7780p217
$$ 108333 121741 124090 128789 118588 152197 186847 167767 179965 202942 227759 245539 238322
13122B38322m0067n831N3519L1675n0170q8968K4988K0210J3700o3270l7387K5346
$$ 238322 198255 192424 245943 277618 227448 138480 163468 183678 197378 134108 96721 122067
13110A22067k7556m6351L7652L860m7031j3353K6093L261J4304K0899K7952k2454
$$ 122067 94511 48160 85812 89672 42641 29288 55381 58642 72946 93845 121797 99343
13098I9343j1819k0947k2825M065m305j6614L3224r856k2885m5600O7500P1141
$$ 99343 87524 66577 43752 47817 43512 26898 60122 50266 27381 -18219 49281 120422
13086A20422j7624o9991L36Q2323j2335j9766M7174N3528k3896n1267l8223k1579
$$ 120422 102798 32807 33143 115466 103131 83365 130539 184067 160171 108904 70681 49102
13074D9102Q363J7480j7757J4428J1779J1432J00332M7071K7207K7735J8982O7459
$$ 49102 57465 74945 57188 71616 83395 94827 195159 242230 269437 297172 316154 383613
13062C83613P9632L1556J501o4866m6470n4766m1280M534J8967n8744n6229j5009
$$ 383613 463245 494801 496302 431436 384966 330200 288920 293454 312421 253677 197448 182439
13050A82439j8398N5470L32n1616J6304L4415l4056l2542K2249J6690l5286l9200
$$ 182439 164041 219511 219843 168227 184531 218946 184890 152348 174597 191287 156001 116801
13038A16801J4015j124j1731K7681L0411N1482O1029j2329k8654j9363m8710L3260
$$ 116801 130816 129692 117961 145642 176053 227535 288564 276235 247581 228218 179508 212768
13026B12768O6362P3260l2604n380K0775O8317O5428O134M4884P0067R8701O2248
$$ 212768 279130 352390 319786 314406 335181 403498 468926 475060 519944 590011 688712 750960
13014G50960j801j22027j05963j23657m9619K0211l5999r0836n8966j6341N4610
$$ 750960 749159 627132 521169 397512 347893 368104 332105 241269 182303 165962 220572
13003B20572k0703j1842n4591j256M3684J4627m5990k5785K1763L4204M4378l3014
$$ 220572 199869 188027 133436 132180 175864 190491 144501 118716 140479 174683 219061 186047
12991A86047m5054M3505Q4493K6267J2458m6126n3946P8146N382m141M4700p276
$$ 186047 140993 184498 268991 295258 307716 261590 207644 285790 291172 287031 331731 324455
12979C24455J277o644l3032N8537N8136Q9003J02060R0977L3280L9015P9910m9997
$$ 324455 325732 319088 286056 344593 402729 491732 593792 684769 718049 757064 836974 786977
12967G86977j51071m1383n0003o2310m5595O6864K6545R513l4558m4726O746J4973
$$ 786977 635906 594523 544520 482210 436615 503479 530024 539537 504979 460253 466999 481972
12955D81972M1002L8168L8595K6536O5310M7392M2702J1312Q658j2424Q228J3789
$$ 481972 522974 561142 599737 626273 691583 738975 781677 792989 801647 789223 797451 811240
12943H11240K9504K7403J037o5303J608J1931m7709o7741o2103N8041j2177k35
$$ 811240 840744 868147 869184 803881 805489 817420 769711 701970 639867 697908 685731 685496
12931F85496L2802N1455L7668L8116Q9667M2786k6831k998m0309l8276o373K7048
$$ 685496 718298 769753 807421 845537 935204 977990 951159 948161 907852 869576 863203 890251
12919H90251N6586N7429O3943L0499K4017Q521P7029P9713M3090O5927P2939K7619
$$ 890251 946837 1004266 1068209 1098708 1122725 1131246 1208275 1287988 1331078 1397005 1469944 1497563
12907A497563l0580k9332p6480r6557k1957o4799J1821l4227j01943o6390p5146
$$ 1497563 1466983 1437651 1361171 1264614 1242657 1177858 1189679 1155452 1053509 987119 911973
12896I11973p3093j1544r15J8007L8678q610o6430q5296n5939m008M3787J6699
$$ 911973 838880 827336 826421 844428 883106 874496 808066 722770 666831 662823 706610 723309
12884G23309M2340p2205n016P959M7177K3297K4451J11257K7277O332L1742m533
$$ 723309 765649 693444 688428 696387 743564 766861 791312 902569 929846 936178 967920 963387
12872I63387k8654j4045K8545l7859J662l0305p4946o6386l1201o246k1853m7984
$$ 963387 934733 920688 949233 911374 913036 882731 807785 741399 710198 703952 682099 634115
12860F34115j8711m1905j7653M8914K3037J5564Q109m0246j7150k3082j009J5980
$$ 634115 615404 573499 555846 604760 627797 643361 651470 611224 594074 570992 569983 585963
12848E85963o96L6031J2356J1623K4546K1787k3439k5836l5563M3384R3729P7312
$$ 585963 585267 621298 633654 645277 669823 691610 668171 642335 606772 650156 743885 821197
12836H21197O5840L818n472J5201R9449N5269P5104L1957k7280O0132P2731O0071
$$ 821197 887037 890855 885383 900584 1000033 1055302 1130406 1162363 1135083 1195215 1267946 1328017
12824A328017Q8674J18255J6125O0970J20064J13226J49455J49108J02131J47097
$$ 1328017 1416691 1534946 1551071 1612041 1732105 1845331 1994786 2143894 2246025 2393122
12814B393122J72226K58430K57804K62280L20222K78555L32023M10284L95511
$$ 2393122 2565348 2823778 3081582 3343862 3664084 3942639 4274662 4684946 5080457
12805E080457M17426M81004N64046N34932O26079O74275P21394O87993O76667
$$ 5080457 5497883 5978887 6542933 7077865 7703944 8378219 9099613 9787606 10464273
12796A0464273N70593N39709M13804K77109K23332J47874R3883L6799r1819j18283
$$ 10464273 11034866 11574575 11988379 12265488 12488820 12636694 12730577 12767376 12675557 12557274
12786A2557274p7689r2132p2062q800M2713J45652J50368K00836L04453L47668
$$ 12557274 12479585 12387453 12315391 12306591 12349304 12494956 12645324 12846160 13150613 13498281
12776A3498281M17967M75086N81952O81081Q37396R72906J175857J344677J555593
$$ 13498281 13916248 14391334 14973286 15654367 16491763 17464669 18640526 19985203 21540796
12767B1540796J810229K080725K336269K488990K631634K659782K487048K200273
$$ 21540796 23351025 25431750 27768019 30257009 32888643 35548425 38035473 40235746
12759D0235746J752852J139955M20398k84396q78270j405389j739713j977600
$$ 40235746 41988598 43128553 43548951 43264555 42386285 40980896 39241183 37263583
12751C7263583j939856j849020j685378j561691j405310j170499r63103q27937
$$ 37263583 35323727 33474707 31789329 30227638 28822328 27651829 26688726 25860789
12743B5860789o23507n12811l48963l15383j07265R3932J53403J94703M28728
$$ 25860789 25237282 24724471 24375508 24060125 23952860 24046792 24200195 24394898 24823626
12734B4823626O73297R43989J116552J334756J622784J884861K090603K215190
$$ 24823626 25496923 26440912 27557464 28892220 30515004 32399865 34490468 36705658
12726C6705658K275185K180917J819778J265297O65125p2765q76931j555906k043877
$$ 36705658 38980843 41161760 42981538 44246835 44911960 44839195 43962264 42406358 40362481
12717D0362481k417281k502050k476819k394484k211422j931950j748964j574099
$$ 40362481 37945200 35443150 32966331 30571847 28360425 26428475 24679511 23105412
12709B3105412j400563j201890j059424r42080q34978p58106p08644n74028n06499
$$ 23105412 21704849 20502959 19443535 18501455 17666477 16908371 16199727 15625699 15119200
12700A5119200m40298l31659l32723k04115p6044J0515K9691R0639J39073J46997
$$ 15119200 14678902 14347243 14014520 13810405 13734361 13744876 13774567 13865206 14004279 14151276
12690A4151276J08746Q5805O2780K041j68955k87713l86435m07862m92168o32830
$$ 14151276 14260022 14345827 14408607 14410648 14241693 13953980 13567545 13159683 12667515 12034685
12680A2034685o34899o85507o53541o30894o68475n73010n64872n74736m74057
$$ 12034685 11399786 10714279 10060738 9429844 8761369 8188359 7623487 7048751 6574694
12671F574694m29687l58426l48053l08814k57881j91775k42701k47771k59057
$$ 6574694 6145007 5786581 5438528 5129714 4871833 4680058 4437357 4189586 3930529
12662C930529k11985j73056j23001j04830q9818j19542n6896q6697j16648n4083
$$ 3930529 3718544 3545488 3422487 3317657 3227839 3108297 3051401 2964704 2848056 2793973
12652B793973j67993j78545q0611q0204j41087j26966k9280r7221q2130j18160
$$ 2793973 2625980 2447435 2366824 2286620 2145533 2018567 1989287 1892066 1809936 1691776
12642A691776n810m4834n1917r4373m7906k5422k0717O476o173m0798n7888o7518
$$ 1691776 1685966 1641132 1589215 1494842 1446936 1421514 1400797 1407273 1401100 1360302 1302414 1234896
12630A234896l4276L8023l9041l0174j0861p7963r1042k9254L1291n038j9343
$$ 1234896 1200620 1238643 1199602 1169428 1158567 1080604 989562 960308 991599 986561 967218
12619I67218k7675P543j9080M5052K738q0392l3177q627j3164P817M668O268J633
$$ 967218 939543 947086 928006 973058 975796 895404 862227 853600 840436 848253 852921 859189 860822
12606H60822k1490O6056M581l9477k4066m6095m1089O176L0214K6933j3120j6913
$$ 860822 839332 905388 909969 870492 846426 800331 759242 765418 795632 822565 809445 792532
12594G92532J1376J3106K8552O345P087K7666J7081R218n0109k3735q7204j6952
$$ 792532 803908 817014 845566 851911 858998 886664 903745 912963 862854 839119 751915 734963
12582G34963M2339M4217L9966l5865o2064L549K5048M8160M9547J1371M4659L0763
$$ 734963 777302 821519 861485 825620 763556 767105 792153 840313 889860 901231 945890 976653
12570I76653Q802L4235l3378j403M713j1955R381M615n8860l2701J6771J2638
$$ 976653 985455 1019690 986312 984909 989622 977667 987048 991663 932803 900102 916873 929511
12558I29511J2870m0157J9776M5324M3465j5818K2614M5169L790o6626l6816N9312
$$ 929511 942381 902224 922000 967324 1010789 994971 1017585 1062754 1066544 999918 963102 1022414
12546A022414k8677l5958m858p03J1279q243r1816o1662l2706m1437l0790L0340
$$ 1022414 993737 957779 952921 952218 963497 955254 863438 801776 769070 727633 696843 727183
12534G27183r914n2245n6330m7354q8211n5006m434K3756M2471P781o6658p0797
$$ 727183 717269 665024 608694 561340 473129 418123 413689 437445 479916 487697 421039 350242
12522C50242l9035P642j5383l4498j679L1181N7052m400l3996k8790r985L7865
$$ 350242 311207 318849 303466 268968 267289 298470 355522 351122 317126 288336 278351 316216
12510C16216R6873M4838j7937q0325m2727J1556M3721j0322k5559j5296L3288
$$ 316216 413089 457927 439990 359665 316938 328494 372215 361893 336334 321038 354326
12499C54326K2633K8215m02N5921Q990k277j7524P303j342j2294J1345K2627q063
$$ 354326 376959 405174 404772 460693 469683 467406 449882 457185 455843 443549 454894 477521 469458
12486D69458j0474O840N5174l7911j7177M0248j7345L054k906k5227J7536K3425
$$ 469458 458984 465824 520998 483087 465910 506158 488813 491867 488961 463734 481270 504695
12474E04695O5446L367J0893N016j9945K6541O7134L3527L3280K6435J2458M185
$$ 504695 570141 573508 584401 589417 569472 596013 663147 696674 729954 756389 768847 773032
12462G73032M7383J5591j8086j0424m6342n1970N6502J0241j0064K793j5777j30287
$$ 773032 820415 836006 817920 807496 761154 709184 765686 775927 765863 768656 752879 622592
12450F22592p0632r693l2918K2783j1517m7770o4696j3886m7984j6064P80l4220
$$ 622592 551960 542267 509349 532132 520615 472845 408149 394263 346279 330215 330995 296775
12438B96775j9341K0902k3016K3752m806j7673k7026J2494P8074L2166o5853k0120
$$ 296775 277434 298336 275320 299072 294266 276593 249567 262061 340135 372301 306448 286328
12426B86328L0767l674n0822L750k2244L396K051k267j4367m406N803L257k2866
$$ 286328 317095 313421 262599 266349 244105 247501 249552 247285 232918 228512 234315 237572 214706
12413B14706l1587n862k9775m4756K7243L0623k1243L5295O0548J9836J0240L0135
$$ 214706 183119 177257 147482 102726 129969 160592 139349 174644 235192 255028 265268 295403
12401B95403k1734l5264K0027J0906K7636m222K6443l0198j3003p747N9471J0804
$$ 295403 273669 238405 258432 269338 296974 292752 319195 288997 275994 268247 327718 338522
12389C38522K0202j993l5066L7793L2859q1131l8628k0246j3507k9161L7703N6687
$$ 338522 358724 356731 321665 359458 392317 311186 272558 252312 238805 209644 247347 304034
12377C04034K2147m334k3697k9316N771j1219j0406o1877K1241M169j9172M6812
$$ 304034 326181 321847 298150 268834 274605 263386 252980 191103 212344 216513 197341 244153
12365B44153L6875K2490r960k7971p43K6301J9335R47j3178j1132m5920k8247
$$ 244153 281028 303518 293558 265587 264844 291145 310480 311427 298249 287117 241197 212950
12353B12950j1054j0502K4503M2101p77K0897L2382J5908j6859n2500l8965L0021
$$ 212950 201896 191394 215897 257998 257221 278118 310500 326408 309549 257049 218084 248105
12341B48105r9N1970O6959p2242m1852j022K786o013k2464L473j287M7569q669
$$ 248105 248006 299976 366935 294693 252841 251819 254605 248592 226128 229601 228314 275883 267214
12328B67214j3176J4752r683o214l1159M194q05R514J299j8728l9613P351N4362
$$ 267214 254038 268790 259107 252893 221734 225928 225123 234637 235936 217208 177595 184946 239308
12315B39308M3428k697L0444m481n1223l3185k8553N8466M8414J1458l5215o138
$$ 239308 282736 280039 310483 306002 254779 221594 193041 251507 299921 311379 276164 270026
12303B70026K7526L6349L3978P7188M0106M935l9600m6281m8106m5975P3584N3878
$$ 270026 297552 333901 367879 445067 485173 490108 450508 404227 356121 310146 383730 437608
12291D37608j2474l1421j7019J0491Q083Q975k37M1323L9445m1018o1740N826
$$ 437608 425134 393713 376694 387185 395268 404243 404006 445329 484774 443756 382016 387842
12279C87842J1927J4445J6834p438j6614P6050j9124L686M8927L2805O46p5144
$$ 387842 399769 414214 431048 423610 406996 483046 463922 467608 516535 549340 549986 474842
12267D74842j0159J4077j7626j6835j26l7258Q0849N9725q33q5047p6517k8549
$$ 474842 464683 478760 461134 444299 444173 406915 487764 547489 546656 461609 385092 356543
12255C56543P324k495O1253m0704j03452m4736L5640J5533j5458Q608L7393K322
$$ 356543 363867 361372 422625 381921 278469 233733 269373 284906 269448 278056 315449 317771
12243C17771m6809j0072p648L6372R4363M5965J2289p16k3898n3231K3010l28
$$ 317771 270962 260890 253242 289614 383977 429942 442231 441515 417617 364386 387396 387068
12231C87068m8803j0844P3431K9176k6355p478K6416L988l5128N1277K6057L8709
$$ 387068 338265 327421 400852 430028 403673 396195 422611 426599 391471 442748 468805 507514
12219E07514L7372m8162m3190L4163N349L543j9760K0763j2379J0373r603L2857
$$ 507514 544886 496724 453534 487697 493046 496589 476829 497592 485213 495586 485983 518840
12207E18840J5982O209k3368L7453L8456J1486Q567Q1324r789n1309j7752n9828
$$ 518840 534822 541031 517663 555116 593572 605058 613625 694949 685160 633851 616099 556271
12195E56271l1151M3161P106J6148L2947M4078M1319R8109j0560L1851M5147n6400
$$ 556271 525120 568281 575387 591535 624482 668560 709879 807988 797428 829279 874426 818026
12183H18026m97j0303K3655M4544k4142J6845N3910Q5483k0202j9457J1709m620
$$ 818026 817529 807226 830881 875425 851283 868128 922038 1007521 987319 967862 979571 974951
12171I74951j1896k0118L9540P8123J3943M39J9357O0643k1473l548R6389L2089
$$ 974951 963055 942937 982477 1060600 1074543 1074982 1094339 1154982 1133509 1129961 1226350 1258439
12159A258439L1411j4527K9458L6568P814J8897M9687P7160L0732Q159N4208P2331
$$ 1258439 1289850 1275323 1304781 1341349 1349163 1368060 1417747 1494907 1525639 1533798 1588006 1660337
12147A660337M9659K6852P2565R9377N2675P6662P6088N1255R2663M4979N2041
$$ 1660337 1709996 1736848 1809413 1908790 1961465 2038127 2114215 2165470 2258133 2303112 2355153
12136B355153J05650J08137J32046J12897R4670J19034R7678J07298K35798J82192
$$ 2355153 2460803 2568940 2700986 2813883 2908553 3027587 3125265 3232563 3468361 3650553
12126C650553J32524R1682J43311J85458K15675J58570J75858K14182K17748K89143
$$ 3650553 3783077 3874759 4018070 4203528 4419203 4577773 4753631 4967813 5185561 5474704
12116E474704L13555L62931L68753L35461L21168M48553N18893N18707O04636
$$ 5474704 5788259 6151190 6519943 6855404 7176572 7625125 8144018 8662725 9267361
12107I267361O44663P39442P45359Q47122J009427J156277J216982J330812J579892
$$ 9267361 9912024 10651466 11396825 12243947 13253374 14409651 15626633 16957445 18537337
12098A8537337J772020J994760K235538K535938K916661L454143M001978M629654
$$ 18537337 20309357 22304117 24539655 27075593 29992254 33446397 37448375 42078029
12090D2078029N331534O161111P042220Q008648Q966405R846413J0590194J0934557
$$ 42078029 47409563 53570674 60612894 68621542 77587947 87434360 98024554 108959111
12082A08959111J0678217R878168Q477050O380310L826254R50442k185504n098599
$$ 108959111 119637328 129515496 137992546 144372856 148199110 149149552 146964048 141865449
12074A41865449p524270r171673j0112290j0343384r989047r354145q541872p657030
$$ 141865449 134341179 125169506 115057216 104713832 94724785 85370640 76828768 69171738
12066F9171738o811299o078559n404244m790927m216231l757744l335691k855473
$$ 69171738 62360439 56281880 50877636 46086709 41870478 38112734 34777043 31921570
12058C1921570k632027k329782k025672j807058j640769j467085j316265j240889
$$ 31921570 29289543 26959761 24934089 23127031 21486262 20019177 18702912 17462023
12050A7462023j062819r97256r11538q47755p64964o43484o61413o83518n56642
$$ 17462023 16399204 15401948 14490410 13642655 12877691 12234207 11572794 10889276 10332634
12041A0332634m41439m50349m41078m20902l78535l11404l05581k99958l23262
$$ 10332634 9891195 9440846 8999768 8578866 8200331 7888927 7583346 7283388 6960126
12032F960126k98210k85436k42251k43851k35923k04057j71850j94175j99067
$$ 6960126 6661916 6376480 6134229 5890378 5654455 5450398 5278548 5084373 4885306
12023D885306k17741j90668j19827j27765j02377j41193j27136r2127j18444r8100
$$ 4885306 4667565 4476897 4357070 4229305 4126928 3985735 3858599 3766472 3648028 3549928
12013C549928j30588j58054p9844l4956r0215j28483o7419q8645p0492r7261r8647
$$ 3549928 3419340 3261286 3181442 3146486 3056271 2927788 2860369 2771724 2701232 2603971 2505324
12002B505324O454m3009j05939r0039k4188l8656r0703o6400K4341m7493J0805
$$ 2505324 2511778 2468769 2362830 2272791 2248603 2209947 2119244 2052844 2077185 2029692 2040497
11991B040497l3459j9929j2212j48529j2191O224l7296l2381M311l3354q8407
$$ 2040497 2007038 1987109 1974897 1826368 1814177 1820401 1783105 1750724 1755035 1721681 1633274
11980A633274o3597K6173k9710l7435l867o0907K4013k221o3829q9128k6544L5385
$$ 1633274 1569677 1595850 1566140 1528705 1524838 1463931 1487944 1485723 1421894 1332766 1306222 1341607
11968A341607P7166l2145k1093o3167l7783k1602l7902j0187m8129q603r9552
$$ 1341607 1418773 1386628 1365535 1302368 1264585 1242983 1205081 1194894 1146765 1138162 1038610
11957A038610k6467L5759J9313k9486k3903j1209n0597j8350l7129m719L2208
$$ 1038610 1012143 1047902 1067215 1037729 1013826 1002617 952020 933670 896541 891822 924030
11946I24030o0295j729M7020m328O0881l7952q0596j3029Q832j1993q5l6918j1224
$$ 924030 863735 862006 909026 904698 965579 927627 847031 834002 842834 830841 830756 793838 782614
11933G82614O9244n85n1385o6345J0202k6923L5595P5665J697J8014O1701P08
$$ 782614 851858 851273 799888 733543 743745 716822 752417 828082 829779 847793 909494 910202
11921I10202k8652q1869j7021M411m2824k6475k3095j0783P7721N1248k8422o1968
$$ 910202 881550 799681 782660 787071 744247 717772 694677 683894 761615 812863 784441 722473
11909G22473n5513J3834J6430l6005k8374M4125J8487m6291m8818l2787m0328
$$ 722473 666960 680794 697224 661219 632845 676970 695457 649166 600348 567561 527233
11898E27233K224J7038O057m77m7914k8990m90j0565L2341K486R779N360o8576
$$ 527233 529457 546495 552552 552075 504161 475171 474681 464116 496457 498943 508722 514082 445506
11885D45506l2914O743R5448M058J3141o475q1458m347J485q630k4320n0202M1998
$$ 445506 412592 419335 514783 518841 531982 525507 444049 439702 441187 432557 408237 358035 400033
11872D00033P8201j7569l9608l0753l7497q3639k0364q443L7816J2428l6198j1192
$$ 400033 478234 460665 421057 390304 352807 269168 248804 240361 278177 290605 254407 243215
11860B43215O8848M1134K9315O495O30L9902l5541j9364Q9234m07k4549j033k9873
$$ 243215 312063 353197 382512 389007 389637 429539 393998 374634 463868 463461 438912 437879 408006
11847D08006k8747j002M3344M700l8139n956r160K1438o7708O5559q577M420r32
$$ 408006 379259 378257 421601 426301 388162 382206 373046 394484 326776 392335 383758 388178 387246
11834C87246l3873J394K7617k3583k0632k8636j3534J8860J7573J3508k4103l5681
$$ 387246 353373 354767 382384 358801 338169 309533 295999 314859 332432 345940 321837 286156
11822B86156j2955R790K499N028K0397N3918m855k7754M5785P904l1237J3862
$$ 286156 273201 282991 285490 290518 310915 364833 359978 332224 378009 385913 354676 368538
11810C68538M664k5471o0584L6474J4753J971L8980L7993L1365J0375n7764k5286
$$ 368538 373202 347731 287147 323621 338374 340345 379325 417318 448683 459058 401294 376008
11798C76008J1721j7537k5153n169r253p5382k9708R466K4543m2977k3410L3646
$$ 376008 387729 370192 345039 339870 330617 255235 225527 234993 259536 216559 193149 226795
11786B26795N3956n4522J9770R15J0716N6283m3363j9189R66r571j722Q1482n720
$$ 226795 280751 226229 245999 246914 257630 313913 270550 251361 252327 242756 241034 322516 316796
11773C16796l725K8597o703o1088P738j0458k5569N2404K7924k7654q9159j866
$$ 316796 313071 341668 334965 273877 281615 271157 245588 297992 325916 298262 209103 207237
11761B07237L2832k0391n3256P075L1559M9743n025m815L0247n8519l483j455
$$ 207237 240069 219678 166422 173497 205056 254799 249774 244959 275206 216687 213204 211749
11749B11749k3650j8381K6697p958m3164j5978J2300L3626l4075K801M4203R379
$$ 211749 188099 169718 196415 188457 145293 129315 141615 175241 141166 143967 188170 197549
11737A97549M27n626J1474J2218k951J1424Q2132m25m3580K3930k2486m481k5104
$$ 197549 197976 192350 203824 216042 213091 224515 306647 306222 262642 286572 264086 259605 234501
11724B34501j494M6867R7516P094r930k9405j5071m102m3703q6651P323J7201
$$ 234501 233007 279874 377390 384484 374554 345149 330078 325976 282273 195622 202945 220146
11712B20146Q020m719m2758J1972N7917n7349n119P745m8180J1502K7448j3419
$$ 220146 228166 223447 180689 192661 250578 193229 188110 195855 147675 159177 186625 173206
11700A73206l387K6666N8210L6322J0978K2878m8662o2593n1986L5030J1010K269
$$ 173206 169819 196485 254695 291017 301995 324873 276211 213618 161632 196662 207672 209941
11688B09941k0337k6394O53L3173J4896m0475j0307N3271L0744M4373K2038N391
$$ 209941 189604 163210 163863 197036 211932 171457 161150 214421 245165 289538 311576 316967
11676C16967m7480M7987N387k962M1438M3321k7K9158l1238k495M8678M2553k4166
$$ 316967 269487 317474 322861 319899 361337 404658 404631 433789 402551 400056 448734 491287 467121
11663D67121k183Q0175k9311k1765N5714N7023J27932K8867K4152M548m804j6800
$$ 467121 464938 545113 515802 494037 549751 606774 734706 763573 787725 792273 787469 770669
11651G70669n9972j0563j6275n3901l0838l3500n8195l9744k938L0559J5633M4683
$$ 770669 710697 700134 683859 629958 599120 565620 507425 467681 464743 495302 510935 555618
11639E55618O9640l715l4118l0542j1015O5612K4955L0774M0811L7032j421r218
$$ 555618 625258 621543 587425 556883 545868 611480 636435 667209 708020 745052 743631 734413
11627G34413Q839K5322N8391M09K2772K7386k8953l9080k8222p5255o7417k6607
$$ 734413 743252 768574 826965 827374 850146 877532 848579 809499 781277 706022 638605 611998
11615F11998m151n9485k4368q4967n7582J9849P79n8975L766Q274p686K696J1226
$$ 611998 607847 548362 523994 439027 381445 401294 402073 343098 346864 355138 347452 350148 361374
11602C61374j7560p003k7940j7446K3742M39M285k1125j2316l6383N535n0123
$$ 361374 343814 336811 308871 291425 315167 315606 319891 298766 286450 250067 255602 205479
11590B05479l2371Q722O5702j0607r743k0693L6570L1565m6909k6591j2373m1546
$$ 205479 173108 181830 247532 236925 227182 206489 243059 274624 227715 201124 188751 147205
11578A47205j707R2563K1716Q886J1953n609l0647L5833J6575R36r601j7920N89
$$ 147205 145498 238061 259777 268663 280616 275007 244360 280193 296768 297704 288103 270183 270772
11565B70772O239k5022l3686M9671P6101O3064K6708L5602M5374O8516L8127P5060
$$ 270772 277011 251989 218303 267974 344075 407139 433847 469449 514823 583339 621466 696526
11553F96526M3044j6985m4791l279j2555L2397O0395j9444m3922j2962n5861p2464
$$ 696526 739570 722585 677794 674515 661960 694357 754752 735308 691386 678424 622563 550099
11541E50099m1953L4075N7035l6229o1820q1025l3744O4068P563k480k0168l3448
$$ 550099 508146 542221 599256 563027 501207 420182 386438 450506 458069 455589 435421 401973
11529D01973J0713M7778m8315l8910L0775M2030R2586J00361O436n5418k3568
$$ 401973 412686 460464 412149 373239 404014 446044 538630 638991 645427 590009 566441
11518E66441O097N5019K7055L5388l2412p474m7192m1613q3254l4132N1372k9182
$$ 566441 572538 627557 654612 690000 657588 650114 602922 561309 478055 443923 495295 466113
11506D66113l7570m4747J9002m448k2951J5575n9502Q673M7840l7196n596j9195
$$ 466113 428543 383796 402798 398350 375399 390974 331472 340145 387985 350789 345193 325998
11494C25998M1018o683k2852m7108l1531m9054o895L6384K718j4557K840l6608
$$ 325998 367016 360333 337481 290373 258842 209788 202893 239277 241995 227438 230278 193670
11482A93670l0878K6341O6958M200k0100m261o1m4819m4685k1607N809M7146L4066
$$ 193670 162792 189133 256091 260291 240191 235930 235869 191050 146365 124758 130567 177713 211779
11469B11779k2594l2280O5893l6009o1761l5296l4228M151M7927M5310K6623K4843
$$ 211779 189185 156905 222798 186789 125028 89732 55504 59655 107582 152892 179515 204358
11457B04358K4163Q1617o0768j03654J997J2333K8637N6226p777m6425j7302l5450
$$ 204358 228521 310138 249370 145716 147713 160046 188683 244909 237132 190707 173405 137955
11445A37955k2298n40K5679q804L6213l9933m9316l1611j6211N7064Q7582K413
$$ 137955 115657 115117 140796 131992 168205 128272 78956 47345 31134 88198 175780 178193
11433A78193q2671l8999l5625n7866N0681L3617N5519l1037k9772l2350J6819
$$ 178193 95522 56523 20898 -36968 13713 47330 102849 71812 42040 9690 26509
11422B6509Q770r80J241p293n351J2573l3456k1173L0821J6231K2508L8666L9891
$$ 26509 35279 34299 35540 28247 22896 35469 2013 -19160 11661 27892 50400 89066 128957
11409A28957m79l8412j5870K003j1085L6344K1122l1709K8797l0237l9336q49
$$ 128957 128478 90066 74196 76199 65114 101458 122580 90871 119668 89431 50095 49246
11397D9246K9312P906m8583j5612L6065M169j414K6310N511n8098k5773n1994
$$ 49246 78558 86464 37881 22269 58334 62503 61089 87399 92910 34812 9039 -42955
11385d2955L734J3768K9502K3670m0934n171K2413O920k8540P389q163j0472K6509
$$ -42955 -39221 -25453 4049 27719 -13215 -18386 4027 10947 -17593 -10204 -18367 -28839 -2330
11372b330K2402K9779N7820O636l4006q874K8675K6911j7069p4327k6459k430
$$ -2330 20072 49851 107671 114307 80301 71427 100102 127013 109944 35617 9158 6728
11360F728P229k961k3933m3725j444R757j147N3652j469j1360l5651j9493J4405
$$ 6728 13957 10996 -12937 -56662 -58106 -48349 -49496 4156 2687 -8673 -44324 -63817 -49412
11347d9412r239L4641M2507L72K7211m2900j9136L4966M4964j2068J1820J1866
$$ -49412 -58651 -24010 18497 18869 46080 3180 -15956 19010 63974 51906 63726 75592
11335G5592n419l2057k8528K3759N8038j6057o5396M0866P801l2827K9567M0360
$$ 75592 70173 38116 9588 33347 91385 75328 9932 50798 58599 25772 55339 95699
11323I5699m8027o012N3040l2222r4068m6322J0648K5956K516L6344J9148J2884
$$ 95699 47672 41660 94700 62478 -31590 -77912 -67264 -41308 -38792 -2448 16700 29584
11311B9584K1050j7170o0815m0777Q5411J05634N058m7096o0333M4667j506l255
$$ 29584 50634 33464 -27351 -68128 17283 122917 127975 80879 20546 65213 63707 60452
11299F0452j2284l7099j3110M1906J3227k5457j4074L3249n8208o1839L0054K9868
$$ 60452 48168 11069 -2041 39865 53092 27635 13561 46810 -11398 -73237 -43183 -13315
11287a3315k2063n12Q964l3158J2198L0019n4254m5282N7935N9641k9646L0606
$$ -13315 -35378 -35890 -26926 -60084 -47886 -17867 -72121 -117403 -59468 173 -29473 1133
11275A133K2988o720l551n2766n3170j3754L5039N1433M2549J1208j1388l5354
$$ 1133 24121 17401 13850 -38916 -92086 -105840 -70801 -19368 23181 34389 23001 -12353
11263a2353L9937M6291n904o1119n3640K9802o071k246J2696m4536j2412K4983
$$ -12353 27584 73875 67971 6852 -46788 -16986 -23057 -25303 -12607 -57143 -69555 -44572
11251d4572M1329J5955k5413l7527K1219J6864l5960N954l8838j2624Q575n314
$$ -44572 -3243 12712 -12701 -50228 -29009 -12145 -48105 -42151 -80989 -93613 -85038 -90352
11239i0352L8397j164l6101l3607M4230O1989m4419r582M573K8760M4322O990
$$ -90352 -51955 -53119 -89220 -122827 -78597 -16608 -61027 -70609 -66036 -37276 7046 14036
11227A4036J1735m7147l6516k1713M3353N1121k5276n4067P3940J6669l7369r149
$$ 14036 25771 -21376 -57892 -79605 -36252 14869 -10407 -64474 9466 26135 -11234 -20383
11215b0383r70k4099m8456L4798J049l2994K2472M3311j9219n4204J6545P2141
$$ -20383 -21353 -45452 -93908 -59110 -58061 -91055 -68583 -25272 -44491 -98695 -82150 -10009
11203a0009L1925l3257l1901j1314J4799q458Q035o681Q3780J4750j0367k444
$$ -10009 21916 -11341 -43242 -54556 -39757 -48215 -40180 -46861 36919 51669 41302 38858
11191C8858n2166j5159K1620J3110N870l067o0669R620N2923l492r209R341K2276
$$ 38858 -13308 -28467 -6847 6263 12133 9066 -51603 -41983 10940 7448 -1761 7580 29856
11178B9856L4567N0801K8212m267r940O625M2486K0861m3224j156M3134j8591
$$ 29856 64423 115224 143436 139169 129229 135854 178340 199201 155977 154821 197955 179364
11166A79364n6185p1141p7252J685J5564L021l0148N716r80k7711K920r220J1050
$$ 179364 123179 52038 -25214 -23529 -7965 -4944 -35092 -29376 -30356 -58067 -55147 -64367 -53317
11153e3317M3943j3040O270k4644l5872l0543J4232Q0334l4180n3813J9893k0683
$$ -53317 -9374 -22414 -16144 -40788 -76660 -107203 -92971 -12637 -46817 -100630 -80737 -101420
11141a01420P6492l8731k3431k6796L1402m0321q948N8441O5839N3278L2918l7094
$$ -101420 -24928 -63659 -87090 -113886 -82484 -122805 -131753 -73312 -7473 45805 78723 41629
11129D1629q0265K2171L5199m5227m6286j3923P815N415J5391M915L0195R0798
$$ 41629 -38636 -16465 18734 -26493 -72779 -86702 -78887 -73472 -58081 -53166 -22971 67827
11117F7827K4122K4142n7001j8864r637O0504J2907k8955m0304m0279K0163Q1379
$$ 67827 91949 116091 59090 40226 30589 91093 104000 75045 34741 -5538 14625 96004
11105I6004L3384q076J0183l7228o9675m5241j8572J9329O3318M7772J7446n2612
$$ 96004 129388 121312 131495 94267 24592 -20649 -39221 -19892 43426 91198 108644 56032
11093E6032N743M0434Q789l0657p4442J4569J1217n7481K6937J5524M0918m871
$$ 56032 61775 102209 110998 80341 5899 20468 31685 -25796 1141 16665 57583 52712
11081E2712l0422K581J8412K8089o3480l5000K3065R732m7348n7181J4313L9644
$$ 52712 22290 24871 43283 71372 7892 -27108 -4043 5689 -41659 -98840 -84527 -44883
11069d4883N8555K3708L5337J4017k4155o7410j5701L3559k7951J8964O8574J3491
$$ -44883 13672 37380 72717 86734 62579 -4831 -20532 13027 -14924 4040 72614 86105
11057H6105r445p1876n7231L6081R475q4777l3961K0042L0567J8750L2599Q8183
$$ 86105 76660 4784 -52447 -16366 -6891 -91668 -125629 -105587 -75020 -56270 -23671 64512
11045F4512J6944j6199k5165j0815L0022K2863J9128O414k0932m817L9518J2137
$$ 64512 81456 65257 40092 29277 59299 82162 101290 107704 86772 81955 121473 133610
11033A33610K8010J3761K1038P7895O0313J0456L7736M3495J9465Q1255o809n0169
$$ 133610 161620 175381 196419 274314 334627 345083 382819 426314 445779 527034 520225 470056
11021D70056j3554o06j0410K2570L6287R7675R5376M9690m7361n0655Q071O5922
$$ 470056 456502 455896 445486 468056 504343 602018 697394 747084 699723 649068 657139 723061
11009G23061m0428r7024j19432l9816J2002P195M3231M4699K7715N1616j8058
$$ 723061 682633 585609 466177 426361 438363 445558 488789 533488 561203 612819 594761
10998E94761l5986K794n3580m2739j20L1262j930J5675N9033M0276M0834J5565
$$ 594761 558775 561569 507989 465250 465130 496392 494462 510137 569170 609446 650280 665845
10986F65845P586N8463J00404R5710O2767J14857K24881J90671K64752L25423
$$ 665845 673431 731894 832298 928008 990775 1105632 1330513 1521184 1785936 2111359
10976B111359L83101M39168N77928O74496O43567M89377J42443j41865l10595
$$ 2111359 2494460 2933628 3511556 4186052 4829619 5318996 5461439 5319574 5008979
10967E008979o21962p54641o62614m50056l79880k38809k12440j58452j77199
$$ 5008979 4387017 3632376 2969762 2519706 2139826 1901017 1688577 1530125 1352926
10958A352926j89184r2639o2617r0303q2949o9939n6106o851j6920j03252q1581
$$ 1352926 1163742 1071103 1008486 918183 835234 765295 709189 702338 685418 582166 500585
10947E00585l2661o22Q649J9755q3877m1698j2716j9104J7315M9127j5795k9163
$$ 500585 467924 467302 475951 495706 411829 370131 357415 338311 355626 404753 388958 359795
10935C59795m1687l8677j2243n796n63j1628k0218J1112N0389k0961n908L3317
$$ 359795 318108 279431 267188 261392 260829 249201 228983 240095 290484 269523 263615 296932
10923B96932J8389O786j4745L3171j433K4236Q043K6882N5879j7598K4327N2102
$$ 296932 315321 322107 307362 340533 339100 363336 371379 398261 454140 436542 460869 512971
10911E12971M4449j2524n4993k0600K0823l6082m6339p4442n3690j9269q5327
$$ 512971 557420 544896 489903 469303 490126 454044 407705 333263 279573 260304 174977
10900A74977j3146J4548j112L0690O3838N572n3556m2351n0854q075K2032M9574
$$ 174977 161831 176379 175267 205957 269795 275367 221811 179460 128606 120531 142563 192137
10888A92137J7423J4284J0247J8380K0163L7324l3152o2607r116N5180N306j4288
$$ 192137 209560 223844 234091 252471 272634 309958 276806 214199 205083 260263 265569 251281
10876B51281L4861m1220p9686K5359L6681k8966l101M2942L5711J697p8423l8439
$$ 251281 286142 244922 165236 190595 227276 198310 195209 238151 273862 275559 197136 158697
10864A58697J6487Q145J5531L7938k3310j0384J9691k1074J286l9273k6868L0776
$$ 158697 175184 183329 198860 236798 213488 203104 222795 201721 203007 163734 136866 167642
10852A67642R440L4342n9826J9338K4286L256j4661n562L6478J8488R77J2128
$$ 167642 177082 211424 151598 170936 195222 198478 183817 178255 214733 233221 234198 246326
10840B46326j0636l3150p971M8778o736r2414m8142k181M028l8610J7403L1461
$$ 246326 235690 202540 194569 243347 236611 144197 96055 93874 97902 59292 76695 108156
10828A08156O1391M398k2009K2015K9658j6613o1964L7101J1481k8924J6677K3985
$$ 108156 169547 173945 151936 173951 203609 186996 125032 162133 173614 144690 161367 185352
10816A85352P5954M102m6793j1068L0782J7442r849J603j7005o3099o4370k0650
$$ 185352 261306 265408 218615 207547 238329 255771 245922 247525 230520 167421 103051 82401
10804H2401Q148J5611M3240k0774q5270j8996J0864L8900O548L4420J0282m4503
$$ 82401 90549 106160 149400 128626 43356 24360 35224 74124 80672 115092 125374 80871
10792H0871j4682M1215K2127J8246J4467O5609J7100j7813l3679k8797j0094l788
$$ 80871 66189 107404 129531 147777 162244 227853 244953 227140 193461 164664 154570 150782
10780A50782l3076N588M5943j6980m9259O427M9856M2476k5J8982k546k9757k3133
$$ 150782 117706 123294 169237 152257 102998 109425 159281 201757 201732 220714 218168 188411 165278
10767A65278N181l0567k1178m636j5404l1676K6965O3357M2077L3485K2166k8490
$$ 165278 170459 139892 118714 114078 98674 66998 93963 157320 199397 232882 255048 226558
10755B26558P220L1363M1752L5015P6544M7995L9779M9568R4725J76058J85554
$$ 226558 233778 265141 306893 341908 418452 466447 506226 555794 650519 826577 1012131
10744A012131J70453J79745J47860P0093j682o253n8004p8699l4690M7188J12321
$$ 1012131 1182584 1362329 1510189 1580282 1578600 1572347 1514343 1435644 1400954 1448142 1560463
10733A560463J79453K09958L13797K57633K47055J24475P0123m9446j70383k47832
$$ 1560463 1739916 1949874 2263671 2521304 2768359 2892834 2962957 2913511 2743128 2495296
10723B495296l04057k06398j97350j85197j3154J0350j9398l6869p8323l5194
$$ 2495296 2191239 1984841 1787491 1602294 1589140 1599490 1580092 1543223 1464900 1429706
10713A429706p9956r4830l8349O9259o583j687K7055J6449J36980J57238J36113
$$ 1429706 1349750 1254920 1216571 1285830 1279247 1277560 1304615 1321064 1458044 1615282 1751395
10702A751395R9303J75633K43809K87920K84037L26032K87765L70335M77790N69523
$$ 1751395 1850698 2026331 2270140 2558060 2842097 3168129 3455894 3826229 4304019 4873542
10692D873542M77094M20163M15571L24060L34051M94217O18900O34533Q95598
$$ 4873542 5350636 5770799 6186370 6510430 6844481 7338698 7957598 8592131 9487729
10683I487729Q49184N23981J14680k88695o59880r79721j089078r40967p82035
$$ 9487729 10336913 10860894 10975574 10686879 10026999 9047278 7958200 7017233 6235198
10674F235198o07571m91324m52781l23762k92404k47196k14603j92721n6004o5808
$$ 6235198 5627627 5136303 4683522 4359760 4067356 3820160 3605557 3412836 3356832 3291024
10664C291024l2485R8110J60890J18606K24584K57857K27367K13025J08966J3044
$$ 3291024 3258539 3356649 3517539 3636145 3860729 4118586 4345953 4558978 4667944 4680988
10654D680988r1053k05498k07999k46280k54601j76806j65611m1901P159o4799
$$ 4680988 4589935 4384437 4176438 3930158 3675557 3498751 3333140 3291239 3298398 3233599
10644C233599j55819j13491j32527j61442q8742j14072j26143o6010J6885J25096
$$ 3233599 3077780 2964289 2831762 2670320 2581578 2467506 2341363 2275353 2292238 2417334
10634B417334K28267L25143L23690K48539J44986Q8789P6277K9954l767J66603
$$ 2417334 2645601 2970744 3294434 3542973 3687959 3776748 3853025 3882979 3879212 4045815
10624D045815K76484M18458N58771O90748R95048J245087J156809P03414L13133
$$ 4045815 4322299 4740757 5299528 5990276 6985324 8230411 9387220 10090634 10403767
10615A0403767J83034N1633J14141P19956J645959K519871L355658L863321L562995
$$ 10403767 10586801 10638434 10752575 11472531 13118490 15638361 18994019 22857340 26420335
10606B6420335K678405J576588N94635j53797m63632J28180J361666L179336N240966
$$ 26420335 29098740 30675328 31269963 31116166 30652534 30780714 32142380 35321716 40562682
10597D0562682P167736Q126184P029030M391979J420364j362627l644782m330345
$$ 40562682 47730418 55856602 62885632 67277611 68697975 67335348 63690566 59360221
10589E9360221k962172k39408K927722O120031Q789757R659178P585887L240662
$$ 59360221 56398049 56158641 59086363 65206394 73996151 83655329 91241216 94481878
10581I4481878j157041n025581q100869q923258p243338m184298r11066J947267
$$ 94481878 93324837 88299256 80198387 71275129 64031791 59847493 58936427 60883694
10573F0883694L972607M452610K763903k13315l175915n695143p458075p539395
$$ 60883694 64856301 69308911 72072814 71859499 68683584 62988441 55530366 47990971
10565D7990971o026428l973239k071326n06772M70797N62126j59066j408250k580299
$$ 47990971 41964543 37991304 35919978 35413206 35884003 36446129 36287063 34878813 32298514
10556C2298514l524239m119844m084792l529293k801970k073563j560526j300398
$$ 32298514 28774275 24654431 20569639 17040346 14238376 12164813 10604287 9303889
10548I303889j019827q43927o49329o20034n79840m57886m10142l32313l23638
$$ 9303889 8284062 7440135 6790806 6170772 5590932 5133046 4722904 4390591 4066953
10539D066953k78828k75521k48945j87739j96866k03805j40882k09978j43291
$$ 4066953 3788125 3512604 3263659 3075920 2879054 2675249 2534367 2324389 2181098
10530B181098r0037n9605o2408m0612R205n267r7576r5145m9478r2862j19946
$$ 2181098 2091061 2031456 1969048 1928436 1937641 1932374 1834798 1739653 1690175 1597313 1477367
10519A477367r793K1690p5467k1078o668L1739o871j25644q5075o6978l7710o4732
$$ 1477367 1467574 1489264 1413797 1392719 1386051 1417790 1410919 1285275 1200200 1133222 1095512 1030780
10507A030780p070L7851n669k3012p2680l7030j226n1480k3464L1843j0001j0281
$$ 1030780 1023710 1061561 1055892 1032880 960200 923170 921944 870464 847000 878843 868842 858561
10495H58561j6917K6805K7886N3678O0989k315r166r2537k8230n064O0834N8505
$$ 858561 841644 868449 896335 950013 1011002 1008687 999521 906984 878754 873690 934524 993029
10483I93029n2578m1419j6852l3603k3583o2428r489l829K3713L2351K4805J5070
$$ 993029 940451 899032 882180 848577 824994 762566 753077 749248 772961 805312 830117 845187
10471H45187L4597J9543m594l2592J4975M4804L4238k6141j7583Q090k620j191
$$ 845187 879784 899327 894733 862141 877116 921920 956158 930017 912434 920524 917904 916713
10459I16713J5305O6833Q9214R6733J04146K8880L110l1980k3857K1833J05529
$$ 916713 932018 998851 1088065 1184798 1288944 1317824 1320934 1288954 1265097 1286930 1392459
10448A392459J22752J99607K87515K87399L31261M81416N94275P72327J113715
$$ 1392459 1515211 1714818 2002333 2289732 2620993 3102409 3696684 4469011 5582726
10439E582726J448307J434814R75260N08108K37412j19845l03034l12749l21806
$$ 5582726 7031033 8465847 9441107 9949215 10186627 10066782 9763748 9450999 9129193
10430I129193l94648m89896o48000o97835o79602n75633m23905m07082l32487
$$ 9129193 8734545 8244649 7596649 6898814 6219212 5643579 5219674 4812592 4480105
10421D480105l27961l78659l21319k35301k13222k12932j33386n6819m6910m8385
$$ 4480105 4152144 3773485 3452166 3216865 3003643 2790711 2657325 2600506 2553596 2505211
10411B505211m6711l6814M07j3225M4097N4737K7304M8470N4789J34522J83988
$$ 2505211 2458500 2421686 2422093 2408868 2452965 2507702 2535006 2583476 2638265 2772787 2956775
10400B956775K02633J38726K2656j5924J1599p1381J2356P2952J52918K45631
$$ 2956775 3159408 3298134 3320790 3304866 3316465 3245084 3257440 3330392 3483310 3728941
10390C728941J65310K93470L58238M13441N34161O97493P48451Q46809O24805
$$ 3728941 3894251 4187721 4545959 4959400 5493561 6191054 6939505 7786314 8411119
10381H411119K15025j13704l48994n65711o73828n86190m21639l61063k35766
$$ 8411119 8626144 8512440 8163446 7597735 6923907 6337717 5916078 5555015 5319249
10372E319249r7133j42144j47120r0005O950Q7687J87048J52946K48692M11470
$$ 5319249 5222116 5079972 4932852 4842847 4849797 4937484 5124532 5277478 5526170 5937640
10362E937640N00131P14246R44480J120581J334316J251520Q49737L61655n6073
$$ 5937640 6437771 7152017 8096497 9217078 10551394 11802914 12652651 13014306 12958233
10353A2958233m43542p98412p33576m86412k95281J2275L59339N53028P75192
$$ 12958233 12514691 11716279 10982703 10496291 10201010 10213285 10572624 11125652 11900844
10344A1900844R83764J194487J211537J312507J387930J669210K057737K523899
$$ 11900844 12884608 14079095 15290632 16603139 17991069 19660279 21718016 24241915
10336B4241915L197891M132173N109075O226708P492921Q896436J0904361J3917373
$$ 24241915 27439806 31571979 36681054 42907762 50400683 59297119 70201480 84118853
10328H4118853J8642637K5487142L4424439M4508963N1584069M8044813L0648480
$$ 84118853 102761490 128248632 162673071 207182034 258766103 306810916 337459396
10321C37459396P518472j3193145l2334252m6772844m9228575m1402291l0895422
$$ 337459396 344977868 331784723 299450471 252677627 203449052 162046761 131151339
10314A31151339k2069743j5675238j1405623q907900p543568o714427o134666
$$ 131151339 109081596 93406358 82000735 73092835 65549267 58834840 52700174
10307E2700174n596317m995430m311015l619938k991825k476994k139969j914390
$$ 52700174 47103857 42108427 37797412 34177474 31185649 28708655 26568686 24654296
10299B4654296j642277j438540j321458j234865j130136r11114p41987n67510
$$ 24654296 23012019 21573479 20252021 19017156 17887020 16975906 16233919 15666409
10291A5666409n91977n53366m86161n10940n83627n39998m22162l13432k34618
$$ 15666409 15074432 14521066 14034905 13523965 12940338 12400340 11978178 11664746 11430128
10282A1430128r9232q268K552M6767J08658K11179K73647M01309N20220P44272
$$ 11430128 11330896 11322628 11325180 11371947 11480605 11691784 11965431 12366740 12886960 13631232
10272A3631232R07710J062672J397181J827048K163325K602390K989671L032101
$$ 13631232 14538942 15601614 16998795 18825843 20989168 23591558 26581229 29613330
10264B9613330K475517J547229P47288J18397n06309j102282j384628j417533
$$ 29613330 32088847 33636076 34383364 34501761 33995452 32893170 31508542 30091009
10256C0091009j382593j388609j209440q65639n06659k91620j64650j1779K52134
$$ 30091009 28708416 27319807 26110367 25244728 24738069 24446449 24281799 24270020 24522154
10247B4522154N47522R91234J607277K379710L212657M236931N521134P165363
$$ 24522154 25069676 26060910 27668187 30047897 33260554 37497485 43018619 50183982
10239E0183982R309731J2344135J6652476K2914676L1625561M2561808N2930102
$$ 50183982 59493713 71837848 88490324 111405000 143030561 185592369 238522471
10232B38522471N5429720M1558910J6310599o377097k6264654m5427933n3361665
$$ 238522471 293952191 335511101 351821700 345444603 319179949 273752016 220390351
10225B20390351m6696998l4859311k4524748j7164310j2376370r592834q038316
$$ 220390351 173693353 138834042 114309294 97144984 84768614 75175780 67137464
10218F7137464p202441o651485n948328n049125m124367l323648k707791k219270
$$ 67137464 59935023 53283538 47335210 42286085 38161718 34838070 32130279 29911009
10210B9911009j867958j674361j453601j299887j118102q51131o66982l23960
$$ 29911009 28043051 26368690 24915089 23615202 22497100 21645969 20978987 20655027
10202B0655027M4057L22490N80858P77415N93409K4018o21139j109903j535459
$$ 20655027 20699084 21021574 21602432 22379847 22973256 22997274 22376135 21266232 19730773
10193A9730773j765243j716652j383403j096093r07300p04593o01067o11622n73191
$$ 19730773 17965530 16248878 14865475 13769382 12862082 12157489 11556422 10944800 10371609
10184A0371609n42335n17771m48837l84406l72780l96016k80311k69749l03514
$$ 10371609 9829274 9311503 8862666 8478260 8105480 7709464 7429153 7159404 6855890
10175F855890k24944j68545j81736j22333l4800n2656k1768j18273j24869j06520
$$ 6855890 6630946 6462401 6280665 6158332 6123532 6070876 6049108 5930835 5805966 5699446
10165E699446r1463r5772r0278q393k9501M362P9214Q5056O6797P882k5869m4466
$$ 5699446 5607983 5512211 5421933 5413540 5384039 5388401 5467615 5552671 5619468 5627350 5601481 5557015
10153E557015n3578n1445j89176k20387j87145j60446r0592J1448m3103r0353
$$ 5557015 5503437 5451992 5262816 5042429 4855284 4694838 4604246 4615694 4572591 4482238
10143D482238j26966j51267j90093r4103j3694r1088n3824l1060k8687q0428q7036
$$ 4482238 4355272 4204005 4013912 3919809 3906115 3815027 3761203 3730143 3701456 3621028 3533992
10132C533992q0277j16867q6610q0321r8838l9337j9482p778j3052l86q7819n9024
$$ 3533992 3453715 3336848 3250238 3169917 3071079 3031742 3012260 3004482 2991430 2991044 2903225 2844201
10120B844201n6721m8928O404K132O0551k597m7072J8382R251q6477o5740k6253
$$ 2844201 2787480 2738552 2744956 2747088 2807639 2805042 2757970 2776352 2785603 2699126 2633386 2607133
10108B607133m6959k1433J6143J1747K7960K0663K4125M683p4057q9742j12801
$$ 2607133 2560174 2538741 2554884 2566631 2594591 2615254 2639379 2644062 2570005 2480263 2367462
10097B367462r316O8481K2688J4573J7106J8594j396n9172l8794J2919J7301P2262
$$ 2367462 2358146 2426627 2449315 2463888 2480994 2499588 2498192 2439020 2400226 2413145 2430446 2502708
10085B502708J45146O9510J47690J64119J7622m0680n9015n9010j06039r8720
$$ 2502708 2647854 2717364 2865054 3029173 3046795 3006115 2947100 2888090 2782051 2683331
10075B683331j19154j15443q5979j0421P2630J8467K204L9208J4190N0353R221
$$ 2683331 2564177 2448734 2362755 2352334 2424964 2443431 2445635 2484843 2499033 2549386 2558607
10064B558607n8974j18616r9755r6488j04210m7303n6148n0672k9593l7576q8542
$$ 2558607 2499633 2381017 2281262 2184774 2080564 2033261 1977113 1926441 1896848 1859272 1770730
10053A770730q0225o1028k2381k4656k5624j9282J1045K6565O5738N3949j690
$$ 1770730 1690505 1629477 1607096 1582440 1556816 1537534 1548579 1575144 1640882 1694831 1693141
10042A693141o4710q5841n7151K993M5168J7856l0179m9590k1377n7617q057M3661
$$ 1693141 1628431 1542590 1485439 1488432 1533600 1551456 1521277 1471687 1450310 1392693 1384636 1428297
10030A428297j7366m732o4788p2016j5118k2826k2876j5511N440O601K2750L3074
$$ 1428297 1410931 1406199 1341411 1269395 1254277 1231451 1208575 1193064 1198504 1205105 1227855 1260929
10018A260929M6875m7239p488Q157P795J4212p1166m843L8441K3456k1901p675
$$ 1260929 1307804 1260565 1253077 1261234 1269029 1283241 1212075 1207232 1245673 1269129 1247228 1239553
10006A239553k607N2324L5316j0008m142l0354l9494N60M3846L8447L6789m0368
$$ 1239553 1236946 1289270 1324586 1314578 1310436 1280082 1240588 1241148 1284994 1323441 1360230 1319862
9994A319862n1263N1891l0434o2970k1497k2028p17M3579M8120N4757J9535L6206
$$ 1319862 1268599 1320490 1290056 1227086 1205589 1183561 1182844 1226423 1274543 1329300 1348835 1385041
9982A385041M6220J7695O7313L8720k2792p818l7660k8714j6744m1294l2362k59
$$ 1385041 1431261 1448956 1516269 1554989 1532197 1524379 1486719 1458005 1441261 1399967 1367605 1367346
9970A367346N68l1994P021n8862q8784l5348N1695M428J8401M3823p144l536J00081
$$ 1367346 1367914 1335920 1342941 1284079 1195295 1159947 1211642 1216070 1234471 1278294 1271150 1267614 1367695
9957A367695J20736L3187N2203J292l7398l1461j3293j8620j01107n4427O268
$$ 1367695 1488431 1521618 1573821 1575113 1537715 1506254 1492961 1474341 1373234 1318807 1325075
9946A325075n3097m5193j9003P732L508N1176n7815r1096l7391j347o2116n7767
$$ 1325075 1271978 1226785 1207782 1215514 1219022 1270198 1212383 1121287 1083896 1082549 1020433 962666
9934I62666K4420N3710K4244k34M349m0854L162K2146j1178J2712J2323J8545
$$ 962666 987086 1040796 1065040 1064806 1069155 1028301 1031463 1053609 1042431 1055143 1067466 1086011
9922A086011M5695O9704J1381K2264P5096M3590J10425J26475J38649J52315K04767
$$ 1086011 1131706 1201410 1212791 1235055 1310151 1353741 1464166 1590641 1729290 1881605 2086372
9911B086372J90521J53940L8134l6418j36290k41424j98382k44794j62041j08641
$$ 2086372 2276893 2430833 2468967 2432549 2296259 2054835 1856453 1611659 1449618 1340977
9901A340977j02428r7499o3136m4078n7849k8100p3936l3289m7778J5248n72K0182
$$ 1340977 1238549 1141050 1077914 1033836 975987 947887 873951 840662 792884 808132 807560 827742
9889H27742L5756m165o328K7307j4791l6282m9639L9258K3687j0562R540o0874
$$ 827742 863498 859333 853005 880312 865521 829239 779600 818858 842545 831983 841523 780649
9877G80649o3276o446J5502J9969j8747j3329L643L5097k4983j1965M315R9224
$$ 780649 717373 710927 726429 746398 727651 714322 717965 753062 728079 716114 720429 819653
9865H19653L0973l2300N223J8n2135l5630k0247J5272L9199R210l9867Q23P9626
$$ 819653 850626 818326 823549 823567 771432 735802 715555 730827 770026 779236 739369 740192 819818
9852H19818K7215M1201M8652M9725l156N2179k3320o8391J3719J1377n572m7085
$$ 819818 847033 888234 936886 986611 983455 1035634 1012314 943923 957642 969019 963447 916362
9840I16362J1114K0073P895P599N0890N5362K5791N4681L3749K1612R4846J78582
$$ 916362 927476 947549 955444 963043 1013933 1069295 1095086 1149767 1183516 1205128 1299974 1478556
9828A478556K26884K76265K45305J44859R4577q3426k01891j87099k16060k03692
$$ 1478556 1705440 1981705 2227010 2371869 2466446 2383020 2181129 1994030 1777970 1574278
9818A574278j34058j12256j36223j04454p2377l3737j1668j7489k5659N091r196
$$ 1574278 1440220 1327964 1191741 1087287 1014910 981173 969505 952016 926357 931448 922252
9807I22252k4430m1718n9431k0058n3496K4607K2136j8210N0923q013q5418p269
$$ 922252 897822 856104 796673 776615 723119 747726 769862 751652 802575 794562 709144 701875
9795G01875K1777J9960o966m449N163k0353k9402K3540M1163k1767k876k8301
$$ 701875 723652 743612 736646 732197 737360 717007 687605 711145 752308 730541 727665 699364
9783F99364l1573l0843j1074l8742J05334N0126J112J0749q866P07O5413J12219
$$ 699364 667791 636948 625874 587132 692466 742592 743704 754453 745587 746294 811707 923926
9771I23926J60648K99824M67935O85123N41178J68164p7957k75540n06696o28770
$$ 923926 1084574 1384398 1852333 2537456 3078634 3246798 3168841 2893301 2386605 1757835
9761A757835m76035k24154r4084p5650n10J8884n0812j5803l5351m3365k9583
$$ 1757835 1281800 1057646 963562 887912 887402 906286 855474 839671 804320 760955 731372
9750G31372n5027l7992j2524k939k7985n1699L3950M7858L2983J1793l4003l8991
$$ 731372 676345 638353 625829 622890 594905 543206 577156 625014 657997 669790 635787 596796
9738E96796j8284k4983q6827K1831Q681L108J3437r525j5472p117L5316J3664
$$ 596796 578512 553529 466702 488533 497214 500322 513759 504234 488762 481645 516961 530625
9726E30625P286K8003j86m6643l1558N2464K9164j2151j9718L025m4468Q490l8158
$$ 530625 537911 565914 565728 519085 487527 539991 569155 557004 537286 540311 495843 504333 466175
9713D66175q27m6628J9382N6375j3349k4784P6705L8168k1016j8841l2780p2193
$$ 466175 465348 418720 438102 494477 481128 456344 533049 571217 550201 531360 498580 426387
9701D26387k5131j251j3698k2567N962J7412R641J8307M269n9136N442M361N2728
$$ 426387 401256 400005 386307 363740 369702 387114 396755 415062 419331 360195 365637 369998 422726
9688D22726O791k0518J88L7531m6221O662M8492o5651l1697L1750L969M2983K2076
$$ 422726 429517 408999 409187 446718 400497 407159 455651 390000 358303 390053 394022 437005 459081
9675D59081J2412m7862q1486q028L28M7038J1392K0480J8121k4537j633p525q428
$$ 459081 471493 423631 342145 334117 334445 381483 392875 413355 431476 406939 405306 397781 389353
9662C89353P8859j0212j924l4154K5181M2190j3700L307n0562J6151M4556n5764
$$ 389353 468212 458000 456076 421922 447103 489293 475593 478900 428338 444489 489045 433281
9650D33281p6051L0455J24865P0999J10421J15919J21304M3096j2931k5770r6912
$$ 433281 357230 387685 512550 583549 693970 809889 931193 974289 961358 935588 838676
9639H38676j87446j02420Q997m8515k2971k345J3039J8023J5500l6458m5708k1659
$$ 838676 651230 548810 557807 509292 486321 483976 497015 515038 530538 494080 448372 426713
9627D26713J8980j2458m2069p5147l4357M3386k721J9409K8112k8917P194k154
$$ 426713 445693 433235 391166 316019 281662 325048 322327 341736 369848 340931 348125 345971
9615C45971o8049L9405M3822K7312M4506K7092p3003m8410K738n0333l0675M6047
$$ 345971 277922 317327 361149 388461 432967 460059 387056 338646 341384 291051 260376 306423
9603C06423l995P154J6838l7458N9005j8515m0225m3652k7958K0260K2133K378
$$ 306423 302428 309582 326420 288962 347967 329452 289227 245575 217617 237877 260010 262388
9591B62388K463J2589M7804j5949J8600K193j1366L566J6411J8565J5528n8882
$$ 262388 264851 277440 325244 309295 327895 330088 318722 322288 338699 357264 372792 313910
9579C13910l0406m092m8528K1274M1340M0289J1785k0183k5128l2551l2250L7173
$$ 313910 283504 279412 230884 252158 293498 333787 345572 325389 300261 267710 235460 272633
9567B72633P1581k4086J8053P9012l338l6295N1933k4905l5571J3550n4634o7811
$$ 272633 344214 320128 338181 417193 413855 377560 429493 404588 369017 382567 327933 260122
9555B60122p001O2069J9099J2632K2749K705l2641J4215M1853O266L5223r818
$$ 260122 253121 315190 334289 346921 369670 372375 339734 353949 395802 402068 437291 427473
9543D27473n2007k1859M630p807j3922l2873J1399L3847L6604m703l2934m6226
$$ 427473 375466 353607 358237 350430 336508 303635 315034 348881 385485 380782 347848 301622
9531C01622k2308J1351K4897l1103J2328N4527N8370j6267K1643M7375l8917o4746
$$ 301622 279314 290665 315562 284459 296787 351314 409684 393417 415060 462435 423518 358772
9519C58772j1985L1476J7664j7030j4318k001J7940L5308L5794k0505m2646L2892
$$ 358772 346787 378263 395927 378897 364579 362578 380518 415826 451620 431115 388469 421361
9507D21361J1114L6482l2069K0572l0406k8023M6493N2973J6642K6220m0420k4722
$$ 421361 432475 468957 436888 457460 427054 399031 445524 498497 515139 541359 500939 476217
9495D76217l1005j8396J0251p237N9544P48j2806m4546L6545J0150m1095J5564
$$ 476217 445212 426816 437067 429830 489374 490122 477316 432770 469315 479465 438370 453934
9483D53934O2063L392o9854m6773M4716P1259R0529J18414J10458P8877M0972
$$ 453934 515997 519389 449535 402762 447478 518737 609266 727680 838138 917015 957987
9472I57987L3078l7407j02789j09130q5885j05617p8470o0158q165j6912k1953
$$ 957987 991065 953658 850869 741739 655854 550237 471767 411609 403444 386532 364579
9461C64579M1839L4416m217J1610L9245o7997j5025M633K9425Q3302M6554L9903
$$ 364579 406418 440834 436617 448227 487472 419475 404450 409083 438508 521810 568364 608267
9449F08267k1476l3926j2720J2203l2124j2428M6618l6901j0620L2736k3591p3892
$$ 608267 586791 552865 540145 552348 520224 507796 554414 517513 506893 539629 516038 442146
9437D42146o7458K3323O091N0366O6014L2450P801K108n9662o2172O539N3117
$$ 442146 374688 398011 404102 454468 520482 552932 560733 562841 503179 441007 447546 500663
9425E00663l1681n5377n569J00437m0605l8731L08o566J5024O053j1903o2947
$$ 500663 468982 413605 408036 508473 467868 429137 429445 422879 437903 443956 432053 369106
9413C69106J5990P3520o466n3977o0448l2253K8654P7021J7974r05K606N6842
$$ 369106 385096 458616 452150 398173 337725 305472 334126 411147 429121 428216 430822 487664
9401D87664M7556K9143L4118L6540K5811p340J6369j8195k5989r4216m0973L6634
$$ 487664 535220 564363 598481 635021 660832 653492 669861 651666 625677 531461 490488 527122
9389E27122O904j6995k8372l8056m533j2670P476j5340l9730j8672j6168j7146
$$ 527122 534026 517031 488659 450603 446070 433400 440876 425536 385806 367134 350966 333820
9377C33820L5821p9980l0763L875J4498k4713J2388k83J7732L0418Q2490m3991
$$ 333820 369641 289661 258898 262773 277271 252558 264946 264663 282395 312813 395303 351312
9365C51312j05251j6548O742J0607M7309N3944L0605P712K829m550k8452p755
$$ 351312 246061 229513 236255 246862 294171 348115 378720 386432 389261 384711 356259 348504
9353C48504O598k0636n892P6283M1967L651o7438J0559K0362n3274l2233l2804
$$ 348504 355102 334466 328574 404857 446824 450475 383037 393596 413958 360684 328451 295647
9341B95647q531j4401j9183k1778J7767K6235J7151m9604M555J6509J0917J6307
$$ 295647 287116 272715 253532 231754 249521 275756 292907 243303 247858 264367 275284 291591
9329B91591j0508K471j3821l5786J2042N6200O7043j3961l3325n0452l1299n4885
$$ 291591 281083 283554 269733 233947 245989 302189 369232 355271 321946 271494 240195 185310
9317A85310j86L9969M5167J7370j6216j1197L7055m967J6580j8322l0306m0315
$$ 185310 185124 225093 270260 287630 271414 260217 297272 292305 308885 290563 260257 219942
9305B19942m9170k5234N1828j6474K4319M1986L9071l035n4057m2173j8406k4268
$$ 219942 170772 145538 197366 180892 205211 247197 286268 283233 229176 187003 168597 144329
9293A44329N3929L9725J3688k8596L2776K7300m1616q0842J3864N8105l7583l0673
$$ 144329 198258 237983 251671 223075 255851 283151 241535 160693 174557 232662 195079 164406
9281A64406N5494O5821n0363j0871l1888l9426n08k4271N40L0639L4646q94r724
$$ 164406 219900 285721 235358 224487 192599 153173 152665 128394 128934 159573 194219 193325 183601
9268A83601k9612M7798L3562K7919K0305L6848j8221o2741o6434k3755J2563L2094
$$ 183601 153989 201787 235349 263268 283573 320421 302200 239459 173025 149270 161833 193927
9256A93927J4118k2321q134j2273K8945l852m258N042m2081P071M8149L6725L2810
$$ 193927 208045 185724 177590 165317 194262 190410 186152 191194 149113 156184 204333 241058 273868
9243B73868r419j1719j2040n3391r841o0067m430M7369P6359k9936n3104Q868
$$ 273868 264449 252730 240690 187299 177458 117391 112961 160330 236689 206753 153649 162517
9231A62517L664j5456p9110l4304K3982K2711L8749M6188J1304L5796L235J5620
$$ 162517 166181 150725 71615 37311 61293 84004 122753 168941 180245 216041 219276 234896
9219B34896K1732j00p428l2274l81M4665l659m7267m4762J9773K6694L1265m1550
$$ 234896 256628 256528 249100 216826 216445 261110 257451 210184 165422 185195 211889 243154 201604
9206B01604J587J7330J7293o210o2955j5176P175p555J6760J3314M0502k1545
$$ 201604 203191 220521 237814 231604 168649 153473 160648 153093 169853 183167 223669 202124
9194B02124l6962O8398j0337n9554n7324l310J527j8269l0489J5042n48K2950
$$ 202124 165162 233560 223223 163669 106345 103035 104562 86293 55804 70846 70298 93248
9182I3248L6166P2530j4250o0277j2794J2192k6070l4953m749J5648P5649O8329
$$ 93248 129414 201944 187694 127417 114623 126815 100745 65792 61043 76691 152340 220669
9170B20669J1915l0440l2057j2321O2969J8405L6740O5432p251J1753J2279L5787
$$ 220669 232584 202144 170087 157766 220735 239140 275880 341312 334061 345814 358093 393880
9158C93880m506k948L5314l5574n0265r855n3846M7921k5859m0003l8275l0322
$$ 393880 389374 386426 421740 386166 335901 326046 272200 320121 294262 254259 215984 185662
9146A85662k8033o823M5582M9476K5140M033l4538J305N065k6559O3036J4601
$$ 185662 157629 150806 196388 245864 271004 275037 240499 241804 246869 220310 283346 297947
9134B97947m1943K0853M2479o8189n5361l6121M7677k7747l2528l0647J9438m1305
$$ 297947 256004 276857 319336 251147 195786 159665 207342 179595 147067 116420 135858 94553
9122I4553o65M5391K2819m9782l9025L7565N9390k9101k9378k2359N303P6821
$$ 94553 93888 139279 162098 112316 73291 110856 170246 141145 111767 89408 94711 171532
9110A71532O8077m5168l291m0459l8515m3736M9502j1098K2131O6936k7661q627
$$ 171532 239609 194441 191150 150691 112176 68440 117942 106844 128975 195911 168250 159623
9098A59623m9408j4585L503L6708J6712l52k68K3383L4199L0907P847m5243J9466
$$ 159623 110215 95630 99133 135841 152553 152201 151933 175316 209515 240422 248269 203026 222492
9085B22492J5036J0965m2180R479J24k169n872l6116m0072o596O113K171M065
$$ 222492 237528 248493 206313 215792 215916 213747 207875 171759 131687 125091 131204 133375 137440
9072A37440L136k6077n2069q041L1714m720K6215J1215l2766l942J2962O8269
$$ 137440 140576 114499 62430 54389 86103 81383 107598 118813 86047 82105 95067 163336
9060A63336k3160m1253j5223M19j6876N819J8620J8689J2869M7347M335K7736
$$ 163336 140176 98923 83700 84119 67243 73062 91682 110371 123240 170587 174922 202658
9048B02658k8703l5439l9254Q245Q537l0403r1233N33L2058M9583L0383M1123
$$ 202658 173955 138516 99262 107507 116044 85641 -5592 -5059 26999 76582 106965 148088
9036A48088L131K3543k0629m7821j1858j5042l5473o0637J0531J8007M937K3630
$$ 148088 151219 174762 154133 106312 94454 79412 43939 -16698 -6167 11840 16777 40407
9024D0407L4820L5137M5555L4683K471j6928k1116m1563n1530m866J4577j7748
$$ 40407 75227 110364 155919 190602 193073 176145 155029 113466 61936 57070 71647 53899
9012E3899K1100M4376N684R568p879J1342J1806J8949k9198l4801N053M9432J561
$$ 53899 74999 119375 125059 134627 126748 138090 149896 168845 139647 104846 109899 159331 160892
8999A60892k9032n0742O408j3792r181k8875O0162K9824n536J6966o1517R139
$$ 160892 131860 81118 87526 73734 64553 35678 95840 125664 120128 137094 75577 84716
8987H4716L1087K2464j8051J9084J5971L194k268n169n49k2573P162n0253n8711
$$ 84716 115803 138267 120216 139300 155271 158465 156197 151028 150479 127906 135068 84815 26104
8974B6104K7432K3865k0744K5399j2995l038K1812k8288O366L2194k6735j0398
$$ 26104 53536 77401 56657 82056 69061 66023 87835 59547 65913 98107 71372 60974
8962F0974M7332M4514o7982r037J9369P49k4848M963M4219k7501l0575l9440N5853
$$ 60974 108306 152820 84838 75801 95170 95919 71071 76034 120253 92752 62177 22737 78590
8949G8590L7917M2311m5562K1333j9266j7379m4013j3481J5856J2884j1869K9625
$$ 78590 116507 158818 113256 134589 115323 97944 53931 40450 56306 69190 57321 86946
8937H6946J607M571N4101L147m3958O723k4307P498L342M66K6919R003j3763J1257
$$ 86946 88553 93124 147225 150372 106414 113137 88830 96328 99670 100136 127055 136058 122295 133552
8923A33552M2541m3719q2421K8444P3177j6104n9361M9079o450o996R4m3602m645
$$ 133552 176093 132374 49953 78397 151574 135470 76109 125188 118738 111742 111836 68234 63589
8910F3589j0711j1671M3190K3684n3542j9335O0909N9113m4908n3618o012M1032
$$ 63589 52878 41207 84397 108081 54539 35204 96113 155226 110318 56700 50688 91720
8898I1720L2330k3813j4307q440k5045N8696K2616k0216J9948j3271l8915k8472
$$ 91720 124050 100237 85930 77490 52445 111141 133757 113541 133489 120218 81303 52831
8886E2831J5621l5591n9723N6755N7997O1087q110k4316m1234l5795M4345j546
$$ 52831 68452 32861 -26862 29893 87890 148977 140867 116551 75317 39522 83867 82321
8874H2321p487J1356p283K0919N136k5212j8335k1127K3930M1745K4437j1440
$$ 82321 74834 86190 78907 99826 104962 79750 61415 40288 64218 105963 130400 118960
8862A18960L7602J148m7126n9382k1658q511J017J6811j2728Q0303L7156l1075
$$ 118960 156562 157710 110584 51202 29544 21033 22050 38861 26133 106436 143592 112517
8850A12517r79J947k8110l1008m0239K0387J9455m794L2416L3963J3405l4340
$$ 112517 111538 113485 85375 54367 14128 34515 53970 49176 81592 115555 128960 94620
8838I4620k4795m8221L1651L2229K09k7991j5088R102N0117M2660j3939M7950
$$ 94620 69825 21604 53255 85484 85693 57702 42614 51716 101833 144493 130554 178504
8826A78504r291n2966l2141N789r521j8168r564k794O650K9441J4163o3555j2683
$$ 178504 169213 116247 84106 89895 80374 62206 52642 49848 56498 85939 100102 36547 23864
8813B3864P0004k7593p2308o045O3866Q1618L7424k8899k8904J1497N4114j1344
$$ 23864 93868 66275 -6033 -12078 51788 133406 170830 141931 113027 124524 178638 167294
8801A67294l3449l6160K938j3573J9268M744m1432P413j7023n9833M3991O7641
$$ 167294 133845 97685 100623 87050 106318 111062 69630 77043 60020 187 44178 111819
8789A11819m046m9056P807Q1588N3784m4160p5025j0374J998m487l4860o551L223
$$ 111819 107773 58717 66524 148112 201896 157736 82711 72337 74335 69848 34988 28437 31660
8776C1660j5774j5464K6572O0109j4749m546k5914k3940J6387n254J2653M4124
$$ 31660 15886 422 26994 87103 72354 67808 41894 17954 34341 29087 41740 85864
8764H5864o859L1670P2141p629j1511k2603P664k8591l2063K2130J6760P8k3773
$$ 85864 79005 110675 182816 175187 163676 141073 148737 120146 88083 110213 126973 127051 103278
8751A03278k4021J6580k8607K0697M6789j7177P544L547j7277j4927K700K7980
$$ 103278 79257 95837 67230 87927 134716 117539 125083 128630 111353 96426 99126 127106
8739A27106o240l893K5990J4630J024j4820K0399k4022m0283J7582L5272l8426
$$ 127106 120866 116973 142963 157593 158617 143797 164196 140174 99891 117473 152745 114319
8727A14319q026L2545l3157K5770K4732M5724P925l6760j1607L7800L918L9738
$$ 114319 106293 138838 105681 131451 156183 201907 209832 173072 161465 199265 203183 242921
8715B42921k8977J4191l2607J5083J2343k2876j5704k0162J7042k443k1357m0961
$$ 242921 213944 228135 195528 210611 222954 200078 184374 164212 181254 178811 157454 116493
8703A16493l0666K4546l5349k7228Q404J403L4220R4177K7816k8194p2536K810
$$ 116493 85827 110373 75024 47796 56200 57603 91823 186000 213816 185622 113086 115896
8691A15896J0143M3256J0158k8769n3392Q34M507O084J2733L0608J0710j7194
$$ 115896 126039 169295 179453 150684 97292 98126 102633 108717 121450 152058 162768 145574
8679A45574l1988J2591J7045n7695j2754J4935j1499k948K4449O0125k9586k6452
$$ 145574 113586 126177 143222 85527 72773 87708 76209 73261 97710 157835 128249 101797
8667A01797j4969N7966J0559n2232K6765m7224o4932L9991J8468L2910K7059n032
$$ 101797 86828 144794 155353 103121 129886 82662 17730 57721 76189 109099 136158 131126
8655A31126j156k1329o684R337l4917L3701j355j2596o884Q691J029k662L9050
$$ 131126 129970 108641 101957 111294 76377 110078 108723 96127 89243 97934 98963 96301 135351
8642A35351o353l0434j6397m4057q869L9765R215L041J3024j104M088J5379j5372
$$ 135351 128998 98564 82167 38110 29241 69006 78221 81262 94286 93182 97270 112649 97277
8629I7277j6517o6812K0642M505j4594k0886P731O443J31836L6613j1556k0817
$$ 97277 80760 13948 34590 39095 24501 3615 11346 17789 149625 186238 174682 153865
8617A53865k3647K991R336k1336m77p848n070q597j3155N758K2975J2467j3896
$$ 153865 130218 133209 142545 121209 120732 112884 107814 99217 86062 91820 114795 127262 113366
8604A13366k4525Q911M3974l2076j03410p0513R4682P0682n753n2892L0997J0742
$$ 113366 88841 97752 141726 109650 6240 -64273 30409 101091 95338 42446 73443 84185
8592H4185J9786J910j3893k0592J9192k0296j7407O117l2026j9495N6561M0434
$$ 84185 103971 105881 91988 71396 90588 70292 52885 59002 26976 7481 64042 104476
8580A04476L2711P0561o155q5107j4140k8268L151O0919M881J1301m3123m3183
$$ 104476 137187 207748 201593 116486 102346 74078 77229 138148 143029 154330 111207 68024
8568F8024K4909r828m0203k6858Q1419J6156l464k0750J6590m312P113m996n4044
$$ 68024 92933 83105 42902 16044 97463 113619 110155 89405 105995 101683 108796 103800 49756
8555D9756q28J5027M7162L5864R990m1360K820J9822k5813k8048m5407Q375O8102
$$ 49756 48928 63955 111117 146981 156971 115611 118431 138253 112440 84392 38985 47360 115462
8542A15462J276m6264L9342N485l2100k9143K9879J5092N5054j691J8238L9469
$$ 115462 116738 70474 109816 115301 83201 54058 83937 99029 154083 152392 170630 210099
8530B10099n5509k0184P048M0360L4173l8782K3709K6519O9675J05401J06469
$$ 210099 154590 134406 141454 181814 215987 177205 200914 227433 297108 402509 508978
8519E08978J38943J33045O261q6882j95256j76971j06081p0812k9311M1240q26
$$ 508978 647921 780966 787227 700345 505089 328118 222037 151225 121914 163154 162328
8508A62328o6408j9888N7214L2114j4914J9939m1965n2831j8828J6909N3053j1513
$$ 162328 95920 76032 133246 165360 150446 170385 128420 75589 56761 73670 126723 115210
8496A15210k7171j5286l4167r055M9632J0106j1893N9537j4824l3937K6795J4462
$$ 115210 88039 72753 38586 29531 79163 89269 77376 136913 122089 88152 114947 129409
8484A29409J4373L1851N5353R723J8030K8091J00642J60795K06883K82448M22241
$$ 129409 143782 175633 230986 240709 258739 286830 387472 548267 755150 1037598 1459839
8473A459839J15032n7554p6160k28048l73297k54912j55397r1168q1606j8020
$$ 1459839 1574871 1517317 1441157 1213109 839812 584900 429503 338335 256729 238709
8463B38709j4846m2348o29k0761K5742K1283l4439l6884j0442r207j0834K8350
$$ 238709 223863 181515 180886 160125 185867 207150 172711 135827 125385 116178 105344 133694
8451A33694j9101j4825M3584m287l8897J9878N0439Q738L0685k4969j9432J7618
$$ 133694 114593 99768 143352 139065 100168 120046 170485 179223 209908 184939 165507 183125
8439A83125m5582j2732N3603N3653Q001L8995N0254O8319N3542J50728J39168
$$ 183125 137543 124811 178414 232067 240068 279063 329317 397636 451178 601906 741074
8428G41074L7280J3805m0706j25390j48432j09736p9235j07233j1456J501l6403
$$ 741074 778354 792159 751453 626063 477631 367895 288660 181427 169971 171472 135069
8417A35069j2825M0509k2841o887O0512K0036p6264k9226R327N674k0637k1268
$$ 135069 122244 162753 139912 133025 193537 213573 137309 108083 117410 123084 102447 81179
8405H1179l923n8584o763N9984o968J0379M4708J6544k8275K0743J7050j176j06031
$$ 81179 77256 18672 11909 71893 64925 75304 120012 136556 108281 129024 146074 144898 38867
8392C8867m1499N0000n274P867L8447K9493l5933j6162R060j998K2012R990Q303
$$ 38867 -2632 47368 42094 49961 88408 117901 81968 65806 74866 72868 94880 104870 113173
8379A13173J0871M8319J77m5764m5151j7289J6948k936K766O181K383k1168l6251
$$ 113173 124044 172363 172540 126776 81625 64336 81284 78348 81114 87295 89678 68510 32259
8366C2259k2422n3701j8315M2202Q0259k4503o021j7058o7603Q378M4067K6103
$$ 32259 9837 -43864 -62179 -19977 60282 35779 29758 12700 -54903 -46525 -2458 23645
8354B3645J8291l5271j8978Q6626K6215K9630o490j6664m2212J1069K8501L66
$$ 23645 41936 6665 -12313 74313 100528 130158 123668 107004 64792 75861 104362 104728
8342A04728R889k0664l2024m7443R240L2752j1811K7069K6170L6175n2464J7613
$$ 104728 114617 93953 61929 14486 23726 56478 44667 71736 97906 134081 81617 99230
8330I9230M4791k7535k3888Q818M071m353L7011J3228j5813k1025L644k1957j6733
$$ 99230 144021 116486 92598 101416 105487 101134 138145 151373 135560 114535 118179 96222 79489
8317G9489N571q887M4101l4285m7760J5749J6367n162M706Q620J1359K0553L4852
$$ 79489 85060 76173 120274 85989 38229 53978 70345 65183 69889 78509 89868 110421 145273
8304A45273J6369j8983p0542o9214l1853M8547L6389O381k9896J8910M5819N585
$$ 145273 161642 142659 72117 2903 -28950 19597 55986 62367 32471 51381 97200 102785
8292A02785L1919L8897k1656o4052k3746L7223r371j3828K4185j0142r317l374
$$ 102785 134704 173601 151945 87893 64147 101370 91999 78171 102356 92214 82897 79523
8280G9523l4946P3242q778l7703N873j8026m0556k640L2722O738J7640N0019O4138
$$ 79523 44577 117819 109041 71338 77211 59185 18629 15989 48711 55449 73089 123108 187246
8267A87246n9477m0295N2481j1840m1988m6871J2222M178j9307J5559P245q25
$$ 187246 127769 87474 139955 128115 86127 39256 51478 55656 36349 51908 59153 58328
8255E8328j0919K318j9619l4995K2169O2638L9234O995l721L911j6561M1159L5780
$$ 58328 47409 49727 30108 -4887 17282 79920 119154 126149 122428 126339 109778 150937 186717
8242A86717k5587n6525J952j4110J567K0442j1570K2462k2953n4497P2900N4030
$$ 186717 161130 104605 106557 92447 94014 114456 102886 125348 102395 47898 120798 174828
8230A74828j0995Q655K727m4316p4086l5843K8261r940k4259J3446M889N698N82
$$ 174828 163833 172488 175215 130899 56813 20970 49231 39291 15032 28478 33367 39065 39647
8217C9647j4079J8119M798L5099K280k9773J3959J4189k9013k9535L2269J2192
$$ 39647 25568 43687 48485 83584 85864 56091 70050 84239 55226 25691 57960 70152
8205G0152j5732L9820K0649L5031K721K3109R371j02396J998K1846j5879n3906
$$ 70152 54420 94240 114889 149920 152641 175750 185121 82725 84723 106569 90690 36784
8193C6784K5694M3293L7897Q252l6504m8576m4633r090k3990P768O9017k1770
$$ 36784 62478 105771 143668 151920 115416 66840 22207 13117 -10873 -3105 65912 44142
8181D4142o9323O766M9506M7640K8099m3187n611L1770K3513q1744j5224M2606
$$ 44142 -25181 -18415 31091 78731 106830 63643 58032 89802 113315 31571 16347 58953
8169E8953N6761M6223j4394J4587j7847m5166m3163K6122R929l1390K4342K6954
$$ 58953 115714 161937 147543 162130 144283 99117 55954 82076 92005 60615 84957 111911
8157A11911l6072J5374j5053j8875M5090j5682O099l9069j8893M1411k339j421
$$ 111911 75839 91213 76160 57285 102375 86693 92792 53723 34830 76241 73902 72481
8145G2481R65k8868J6147j0774m856K2968N4778q274o261M0213l1496K3931K0388
$$ 72481 73446 44578 60725 49951 45095 68063 122841 114567 108306 148519 117023 140954 161342
8132A61342n7379J4010p548j299j8348n8585p2703K6182L9973K004k666l8119
$$ 161342 103963 117973 110425 109126 90778 32193 -40510 -14328 25645 27649 24983 -13136
8120a3136r154R3198l8650l1447M3180m4784l2621L0083N5371j0690j4388p852
$$ -13136 -22290 70908 32258 811 43991 -793 -33414 -3331 52040 41350 26962 19110
8108A9110J2076R686o548l014L2850M2033k640J3849k3103r0116J5859M3368R088
$$ 19110 31186 40872 34324 31310 64160 106193 103553 117402 94299 4183 20042 63410 72498
8095G2498J784l8782j1406L6646o038Q018K4278k0728O983j805o316l2652J1909
$$ 72498 74282 35500 24094 60740 54702 62720 86998 66270 73253 71448 65132 32480 44389
8082D4389O879l1968j4337O02Q133K6712L9700j9130o5048M078J1725K9589J7493
$$ 44389 51268 19300 4963 5565 13698 40410 80110 60980 -4068 10 11735 41324 58817
8069E8817j0780K3429M2455L1757K7993l0161l5409j7227K5625J3323K4217m684
$$ 58817 48037 71466 113921 145678 173671 143510 108101 90874 116499 129822 154039 149355
8057A49355m1557m6867j816j4566J5361p1817n2373O0825O865p337N470j5214
$$ 149355 107798 60931 59115 44549 59910 -11907 -64280 -3455 3410 -3927 1543 -13671
8045a3671m719M4480J8916j8067M7261j0909m808k229p487J1191j8961j2072k494
$$ -13671 -18390 26090 45006 26939 74200 63291 58483 56254 48767 59958 40997 28925 26431
8032B6431m404J8006N8555j4252k6985L9837R00K7484l7201j2161n9L6604k7758
$$ 26431 22027 40033 98588 84336 57351 97188 98088 125572 88371 76210 76151 112755 84997
8019H4997l4365j6787j5126l0352M3850M7864m2218J2027M1734R245K0560K4714
$$ 84997 50632 33845 18719 -11633 32217 80081 37863 49890 91624 100869 121429 146143
8007A46143m2853m7858J1283K3171P1085l1253k3852l4495o0244R8165P956n7495
$$ 146143 103290 55432 66715 89886 160971 129718 105866 71371 11127 109292 117248 59753
7995E9753l7808K1120J6408L3411L7356k4561q4238J930J5310l2972J0371k3858
$$ 59753 21945 43065 59473 92884 130240 105679 21441 23371 38681 5709 16080 -7778
7983g778K420k5530K6521M2800j0995K4902J8472n0254M1422K4374k7992K3713
$$ -7778 -5358 -30888 -4367 38433 27438 52340 70812 20558 61980 86354 58362 82075
7971H2075l167k5476M0161l7432l9885J5987K1376j5614q761J251N3138Q588n3977
$$ 82075 78908 53432 93593 56161 16276 32263 53639 38025 29264 30515 83653 92241 38264
7958C8264J5302N5139n4727k1850J5635r762K3906L0090J3807p5453o5423K8545
$$ 38264 53566 108705 53978 32128 47763 38001 61907 91997 105804 30351 -35072 -6527
7946f527M8018N2830p592m7418n088k1475J0035P3734O473J5096K2705J2343J9514
$$ -6527 41491 94321 86729 39311 34223 12748 22783 96517 102990 118086 140791 153134 172648
7933A72648p4419Q697P597k2380r867m308m8804N3895K7968n9143L4008J8479
$$ 172648 98229 106926 114523 92143 82276 77968 29164 83059 111027 51884 85892 104371
7921A04371l2111m9719K082N7826k7648m7669m0755L951m7225j175J8155o786
$$ 104371 72260 22541 24623 82449 54801 7132 -33623 -29672 -76897 -78072 -59917 -66703
7909f6703M8449P259r234j2496L6304N4685K4529K9210l9028k8848j3930r706
$$ -66703 -18254 -10995 -20229 -32725 3579 58264 82793 112003 72975 44127 30197 20491
7897B0491k9727J6747N6008j4301j9616l8149j8290j6068j1962L3704L101l8705
$$ 20491 -9236 7511 63519 49218 29602 -8547 -26837 -42905 -54867 -21163 -18062 -56767
7885e6767k671M1202l044l9329m278K2459M7389L0058k6609l7083l2395K0297
$$ -56767 -59438 -18236 -21280 -60609 -64887 -42428 4961 35019 8410 -28673 -61068 -40771
7873d0771M7831K1689j5519r795M0333q196p9969L1937Q411n800L8570j1982k5193
$$ -40771 7060 28749 13230 3435 43768 35572 -44397 -12460 -4049 -9849 28721 16739 -8454
7860h454J369N5716K970l7549k4066l5096j4030K0379L0471k259k4142M5382N7081
$$ -8454 -7085 48631 51601 14052 -10014 -45110 -59140 -38761 -8290 -10549 -34691 10691 67772
7847F7772k4271P830l9190k501q624j3016N5640K3628k0918m0552k9032l760q387
$$ 67772 43501 51331 12141 9640 1016 -12000 43640 67268 46350 5798 -23234 -26994 -35381
7834c5381L1487P8832n112m6204l5263L5535N2733J8468k9605k4423L957Q803
$$ -35381 -3894 74938 69826 23622 -11641 23894 76627 95095 65490 41067 45024 53827
7822E3827l041k592J9020J4793k6081M1838k0580k9905m1730n9362J0506M0988
$$ 53827 50786 48194 67214 82007 55926 97764 77184 47279 5549 -53813 -43307 -2319
7810b319K0531k8107O9470Q727l1131K7507N5777l7451m8294O396K1664J9886
$$ -2319 18212 -9895 59575 68302 37171 64678 120455 83004 34710 41106 62770 82656
7798H2656J7853k1358l4572j231p1901J2221O7410M497l5600Q128k8544k7966
$$ 82656 100509 79151 44579 43348 -28553 -16332 51078 55575 19975 28103 -441 -28407
7786b8407J9652O707o553q541j478k6895J351K0037N7489L3383l74N451r959m3480
$$ -28407 -8755 -2048 -8601 -17142 -18620 -45515 -44164 -24127 33362 66745 66371 71822 61863 18383
7772A8383J6962r288n8018J3617O9651O574n5599m611k5352p896m946l0060R0091
$$ 18383 35345 26057 -31961 -18344 51307 57881 2282 -2329 -27681 -35577 -40523 -70583 19508
7759A9508Q9732k0376l9075k3949l4012Q225j4406m6554N080K0800k7820m8063
$$ 19508 109240 88864 49789 25840 -8172 53 -14353 -60907 -55827 -35027 -62847 -110910
7747a10910Q2449K0113L2753j0185k2743m426q885k4747n187k6953J6461K9183
$$ -110910 -28461 -8348 24405 14220 -8523 -12949 -21834 -46581 -51768 -78721 -62260 -33077
7735c3077n7649J129k904r03K3678K2285N6298J5966l8477k909N4595K2617j5574
$$ -33077 -90726 -89597 -92501 -93404 -69726 -47441 8857 24823 -13654 -16563 38032 60649 45075
7722D5075j0793n5971j0154O1007R3604k2834m4377l2588l4757J3906J5630j3893
$$ 45075 34282 -21689 -31843 29164 122768 99934 55557 22969 -11788 2118 17748 3855
7710C855l1624j1820K2707r229Q665J1344P592J7914M3550K3407m5587m2223j3540
$$ 3855 -27769 -39589 -16882 -26111 -17446 -6102 1490 19404 62954 86361 40774 -1449 -14989
7697a4989q83j1200K0046O682J3902m0883l1316r499R891j4761L4239Q3175N5746
$$ -14989 -15872 -27072 -7026 -344 13558 -27325 -58641 -68140 -58249 -73010 -38771 44404 100150
7684A00150J8895m6489q0115l1854k4081N4148j4433L7293P7966j1306p7033j0165
$$ 100150 119045 72556 -7559 -39413 -63494 -9346 -23779 13514 91480 80174 3141 -7024
7672g024K5601L747l8443K482L7621M77j9249m9937j9244L1726J4053J4985j898
$$ -7024 18577 22324 -16119 -13637 23984 24461 5212 -44725 -63969 -32243 -18190 -3205 -5103
7659e103K0459L981o7057j6993k1747M0334L4974K8140M124l1706l151l0829q0477
$$ -5103 15356 19337 -47720 -64713 -86460 -46126 -11152 16988 21112 -10594 -13745 -44574 -125051
7646a25051m8092L8988J06208N5468k5562L6843m897j1919K347L5549J5602k1575
$$ -125051 -173143 -134155 -27947 27521 1959 38802 33905 21986 24333 59882 75484 53909
7634E3909l8706k0841l5863j0407K6893J1044L896J8361M4267k38o1154k8599
$$ 53909 15203 -5638 -41501 -51908 -25015 -13971 -10075 8286 52553 52315 -8839 -37438
7622c7438j6182J3743O678l5993j9385M1045P4572K5793m8118K38N6747J7013
$$ -37438 -53620 -39877 -33199 -69192 -88577 -47532 27040 52833 4715 4953 61700 78713
7610G8713k8215m9171j3846L5611k516l9269k9010l1607L4520K8806Q042K482
$$ 78713 50498 1327 -12519 23092 20576 -18693 -47703 -79310 -44790 -15984 -7942 -5460
7598e460P149n5609R865m2852j1885K1363M0403L8883j1438k3043l7465L8806
$$ -5460 1689 -53920 -44055 -86907 -98792 -77429 -37026 1857 -9581 -32624 -70089 -31283
7586c1283L2507j4745O1262l224o2070k4955j2660K3675J5232l3808m7133J0165
$$ -31283 1224 -13521 47741 44517 -17553 -42508 -55168 -31493 -16261 -50069 -97202 -87037
7574h7037M8699J8603M719p457k0398j149k4719k3411P956j9760L1024J13969
$$ -87037 -38338 -19735 -15016 -22473 -42871 -44020 -68739 -92150 -84194 -103954 -72930 41039
7562D1039O1140p6464j7027K2703R692k8289k7275k8059N51J8719Q4303M2728
$$ 41039 102179 25715 8688 31391 41083 12794 -14481 -42540 -41989 -23270 61033 103761
7550A03761m6885o5309k2733N4804Q605J6322j5657o4233k7521K3660L787P987
$$ 103761 56876 -8433 -31166 23638 32243 48565 32908 -31325 -58846 -35186 -31399 -23412
7538b3412K8107M404J9516O794K647m5163p515j1770m7527J4745J9112m7642j8413
$$ -23412 4695 9099 28615 35409 38056 -7107 -14622 -26392 -73919 -59174 -40062 -87704 -106117
7525a06117O2842L7797K4080K9195M5422O238m8493o2059j5289o9671R747J8596
$$ -106117 -43275 -5478 18602 47797 93219 99457 50964 -11095 -26384 -96055 -86308 -67712
7513f7712L0058O6267L2968J8754l6135J4566K6765j6494k1719n4507L0906l662
$$ -67712 -37654 28613 61581 80335 44200 58766 85531 69037 47318 -7189 23717 20055
7501B0055p3477J8937M9774N184j8227M8946L4794j7360p7815k2396j5743j1381
$$ 20055 -53422 -34485 15289 20473 2246 51192 85986 68626 -9189 -31585 -47328 -58709
7489e8709K5050O3256L1141P435n4028k048l674k689J2300r350k3006K9447K2212
$$ -58709 -33659 29597 60738 68173 14145 12097 8423 5734 18034 8684 -14322 15125 37337
7476C7337j4972l8169K1802Q2602k3717q4461r0693J9004M675J784K2084n889
$$ 37337 22365 -15804 5998 88600 64883 -19578 -110271 -91267 -86592 -84808 -62724 -68613
7464f8613L8196k2021l2499r741N1477O6083Q6821n5675j3636L1176J7255n3536
$$ -68613 -30417 -52438 -84937 -94678 -43201 22882 109703 54028 40392 71568 88823 35287
7452C5287j77o4882n2397J4403J8550p324k9494J6728N0978n644RJ9251m2725
$$ 35287 35110 -29772 -82169 -67766 -49216 -56540 -86034 -69306 -18328 -23972 -23963 -4712 -47437
7439d7437K9893L6758L1487r259k8176k0216J3222l295j0841n5545J2575L1984
$$ -47437 -17544 19214 50701 41442 13266 -6950 6272 2977 -7864 -63409 -50834 -18850
7427a8850Q896j1616K0837j2378l3580j5262K1144R564P9436K7230p9746l4049
$$ -18850 -9954 -21570 -733 -13111 -46691 -61953 -40809 -31245 48191 75421 -4325 -38374
7415c8374M5724J1859K6416L3603m17m2751o5022k6973P174J2575M7867M8220
$$ -38374 7350 19209 45625 79228 78811 36060 -28962 -55935 -48761 -36186 11681 59901
7403E9901O7713q95n8666j0513M5499l9056p7480j3277l2686k1248N5682K6948
$$ 59901 127614 126719 68053 57540 103039 63983 -13497 -26774 -59460 -80708 -25026 1922
7391A922l2703L7814m152l8668j3386Q6537O1990l1638j5548J1359l7889n6332
$$ 1922 -30781 7033 2881 -35787 -49173 37364 99354 67716 52168 63527 25638 -30694
7379c0694q790N2244K6796J9208N583n1631K0684j4751n8706k5756j0177N308
$$ -30694 -39484 12760 39556 58764 64347 12716 33400 18649 -40057 -65813 -75990 -70682
7367g0682K7130M443j7057R090J6648P908K8244k5776n0549j0248N0016N4228
$$ -70682 -43552 -39109 -56166 -47076 -30428 -22520 5724 -20052 -70601 -80849 -30833 23395
7355B3395j6091N0047L4758j0879n20j9061k5647m8060p6740N1453J8992j1237
$$ 23395 7304 57351 92109 81230 80710 61649 36002 -12058 -88798 -37345 -18353 -29590
7343b9590M2896J437j6456p3072R599M6550r669j1658K4015K9226K0374j9116
$$ -29590 13306 14743 -1713 -74785 -65186 -18636 -28305 -39963 -15948 13278 33652 14536
7331A4536k0455j1585j5529n68P671j0354l5589K0115N2768K2808l6700m7147
$$ 14536 -5919 -17504 -33033 -33601 -25930 -36284 -71873 -51758 1010 23818 -12882 -60029
7319f0029J2544K8705K2979K4318n9601k2863K0503j7013k2598J6575L0368J9967
$$ -60029 -47485 -18780 4199 28517 -31084 -53947 -33444 -50457 -73055 -56480 -26112 -6145
7307f145j1223m1673M7756M3242J8586l6801p7447m8118M4899L506L2248K3787
$$ -6145 -17368 -59041 -11285 31957 50543 13742 -63705 -111823 -66924 -63418 -31170 -7383
7295g383j2676J7823J103k3378k3718L8472L9723N169k4376k0844k8209J4239
$$ -7383 -20059 -2236 -1133 -24511 -48229 -9757 29966 35135 10759 -10085 -38294 -24055
7283b4055O1411P840j8212k6534j1264J4079J7451p958K4765l4357k5849j0005
$$ -24055 37356 45196 26984 450 -10814 3265 20716 12758 37523 3166 -22683 -32688
7271c2688N958j8117q616l128K1921m679j3020K9806J1649j2104p265J3034l1863
$$ -32688 -26730 -44847 -53463 -56591 -34670 -39349 -52369 -22563 -10914 -23018 -30283 -17249 -49112
7258d9112K3848K6608J1183k511j7202j7804l9010n774l2241K129M844N1213J5930
$$ -49112 -25264 1344 12527 10016 -7186 -24990 -64000 -69774 -102015 -99886 -95042 -43829 -27899
7245b7899m2211R174j7562J0008L2778K1696L2452m686L0647r574k9432J667k4810
$$ -27899 -70110 -60936 -78498 -68490 -35712 -14016 18436 13750 44397 34823 5391 7058 -17752
7232a7752m668K0064M2738J675j5453j4613k9987m0453P7805M6849J0717m29j3281
$$ -17752 -22420 -2356 40382 42057 26604 11991 -17996 -58449 19356 66205 76922 76493 63212
7219F3212l6883J2401L5218n8317q9887J4512k578N681P83k1582l7072P702P2238
$$ 63212 26329 38730 73948 15631 -74256 -59744 -62322 -56641 -55858 -77440 -114512 -106810 -34572
7206c4572M2035k282j00051K1387J9562l3037r306k5946n909M7552q319r479P1929
$$ -34572 7463 5181 -94870 -73483 -53921 -86958 -96264 -122210 -128119 -80567 -88886 -98365 -26436
7193b6436K429r305N5454o33k1415N868m9838K6432P558l7149j3893O9292j3252
$$ -26436 -24007 -33312 22142 21509 94 5962 -43876 -17444 -9886 -47035 -60928 8364 -4888
7180d888J5851O1615K8905n7370n0635J1284k9776k2847j204l5923k6880N2524
$$ -4888 10963 72578 101483 44113 -6522 4762 -25014 -47861 -49065 -84988 -111868 -59344
7168e9344P8288k4970m3978K7264O447J35O514J8298J5636J6705m0861o753K1919
$$ -59344 18944 -6026 -50004 -22740 -16293 -16158 -9644 8654 24290 40995 134 -6619 15300
7155A5300K9184M4119l3668l7695K9425J6198o0263J1317j2757n2375N6293K8827
$$ 15300 44484 88603 54935 17240 46665 62863 2600 13917 1160 -51215 5078 33905
7143C3905n143j1187O1564r116k0221m3059J1840m6180J706l9190n8253M4575
$$ 33905 28762 17575 79139 70023 49802 6743 18583 -27597 -25891 -65081 -123334 -78759
7131g8759P7032R723k6375m912J3149Q134R148n942K2096p838n546j8703p2665
$$ -78759 -1727 7996 -18379 -23291 -10142 -2008 7140 1198 23294 15456 9910 -8793 -81458
7118h1458j9962l6875O461O7160Q3074N9653n1024p330K1462j5956l3173r5527
$$ -81458 -101420 -138295 -131834 -64674 18400 78053 27029 19699 41161 25205 -7968 -103495
7106a03495L319M5747k9010R555J05795J9001l5904r499K0675l557L1875J6303
$$ -103495 -100176 -54429 -83439 -73884 31911 50912 15008 5509 26184 22627 54502 70805
7094G0805m7442l7604n2697L6683N7207J3781r5512o2128K3837J2480j1334L6869
$$ 70805 23363 -14241 -66938 -30255 26952 40733 -54779 -116907 -93070 -80590 -91924 -55055
7082e5055J3182l2265L96m13j9913L4878p76J1394K0736K911o536O307m8782n28
$$ -55055 -41873 -74138 -73742 -74155 -94068 -59190 -59966 -48572 -27836 -24925 -31461 -25154 -73936 -74464
7068g4464L6758l3209j0904M2916J6208q631l6337j2644M531J2032L4802M7175
$$ -74464 -37706 -70915 -81819 -38903 -22695 -31326 -67663 -80307 -75776 -63744 -28942 18233
7056A8233P028o379j0993r177j4584J3329j5950J2173L5021K7868M3113j7346
$$ 18233 25261 18882 7889 -1288 -15872 -2543 -18493 -6320 28701 56569 99682 82336
7044H2336j11696k3222k888J493j0047J6972M6394J1723L424J7115p890j5392
$$ 82336 -29360 -52582 -55470 -53977 -64024 -47052 -658 11065 14489 31604 23714 8322
7032H322o4789j8071j8338m273N2732P0905j2255p0445O835L2757J4142j6199
$$ 8322 -56467 -74538 -92876 -97149 -44417 26488 14233 -56212 -49377 -16620 -2478 -18677
7020a8677n434J5379q816O328J5908K4613p3448n0864O414L8675j0254J1015k1863
$$ -18677 -24111 -8732 -17548 -11220 4688 29301 -44147 -95011 -88597 -49922 -60176 -49161 -71024
7007g1024K998M9597K3107p158P6488N994k9000q711N57M8957j313j1998j5848
$$ -71024 -68026 -18429 4678 -2480 74008 80002 51002 42291 42848 91805 90492 78494 62646
6994F2646l9643k6548j6640j5727J9628M7831j535o8983J2704K4975j3753p768
$$ 62646 23003 -3545 -20185 -35912 -16284 31547 30012 -38971 -26267 -1292 -15045 -22813
6982b2813o2413m3318k5061L792K5084J2346K7260r933Q623O9520J973p509L5800
$$ -22813 -85226 -128544 -153605 -149813 -124729 -112383 -85123 -95056 -86433 -16913 -14940 -22449 13351
6969A3351Q291o285O4484j0511n2509r554K963n5839m0155K9399j7490n0776m800
$$ 13351 21642 15357 79841 69330 16821 7267 10230 -45609 -85764 -56365 -73855 -124631 -129431
6956a29431O2774J5011k3814J5112R768m7407k5057L4990P1683q2066J8346J0716
$$ -129431 -66657 -51646 -75460 -60348 -50580 -97987 -123044 -88054 -16371 -98437 -80091 -69375
6944f9375k996L1570j275P070L6751k6738p7091N0223N2443L3392R840n2727P410
$$ -69375 -72371 -40801 -42076 -35006 1745 -24993 -102084 -51861 582 33974 43814 -8913 -1503
6931a503j4579p3920l1578l6445k270J1960Q6862J4049j7914J5325P762O903m0076
$$ -1503 -16082 -90002 -121580 -158025 -160295 -148335 -61473 -47424 -65338 -50013 -42251 -35348 -75424
6918g5424n2154K869M6813R9364j7672l9768K7106o377n3928J816o539O3797K3326
$$ -75424 -127578 -124709 -77896 21468 3796 -35972 -8866 -15243 -69171 -67355 -73894 -10097 13229
6905A3229k9458l6704j4017L0477n225L3810L3456j2105M5269J5681K074q7329
$$ 13229 -16229 -52933 -66950 -36473 -41698 -7888 25568 13463 58732 74413 76487 -10842
6893a0842m3583K1074m9091j183L4641M6279M7643L183p1657o879n851j9690M6849
$$ -10842 -54425 -33351 -82442 -83625 -48984 -2705 44938 48121 -23536 -30415 -36266 -55956 -9107
6880i107K1528j7950m3669o833L7007L6865m395m7173J0651K5105m7108m6745
$$ -9107 12421 -5529 -49198 -56031 -19024 17841 13446 -33727 -23076 2029 -45079 -91824
6868i1824l491J4848L5975O2422J4918L0900l874n4939l2784K0924j742Q24J7494
$$ -91824 -95315 -80467 -44492 17930 32848 63748 59874 4935 -27849 -6925 -8667 -7843 9651
6855I651o6449n962L3799M9783J74M898n565J6579k0891m167J6669m7088K208
$$ 9651 -56798 -62760 -28961 20822 20996 25894 20329 36908 16017 11850 28519 -18569 -16361
6842a6361P0490k233n1453j2789J0270K2066j7961o0675l1510L7063M2298Q184
$$ -16361 54129 51896 443 -12346 -2076 19990 2029 -58646 -90156 -53093 -10795 -2611
6830b611L5895k9848m0133l854K1107J1739J6085r714j4711k4589q528j6695J2845
$$ -2611 33284 3436 -36697 -40551 -19444 -7705 8380 -1334 -16045 -40634 -49162 -65857 -53012
6817e3012R0849m712n9492j1903L8773L9915N874k8701m7147k1682r357j3349
$$ -53012 37837 33125 -26367 -38270 503 40418 46292 17591 -29556 -51238 -60595 -73944
6805g3944j1427O316N3784p848k0868P202L522j4080L2653n628j375L4906l1146
$$ -73944 -85371 -79055 -25271 -33119 -53987 -46785 -43263 -57343 -24690 -30318 -31693 3213 -27933
6792b7933O704k799j6057l5963N4631J8965o4087j2969K5510J2759N225j122q33
$$ -27933 -21229 -24028 -40085 -76048 -21417 -2452 -66539 -79508 -53998 -41239 -36014 -37136 -37969
6779c7969M1198j9590l0099N2360m73l500j6878J7210N616m731q602o048J7671
$$ -37969 3229 -16361 -46460 5900 5427 1927 -14951 2259 7875 3144 -5458 -11506 6165
6766F165l3907P243K0641R835K8355l797l1579o0854N681O805m544o059j1026
$$ 6165 -27742 -20499 142 9977 38332 34535 2956 -57898 -52217 -45412 -49956 -56015 -67041
6753f7041R004j642j1518P783M6543M8152M2820j7746n1545m7050L3554L6080
$$ -67041 -58037 -59679 -71197 -63414 -16871 31281 74101 56355 4810 -42240 -8686 27394
6741B7394j3064l6131O898L4637O829j0692m5396j138M3168N6662p060l7058p599
$$ 27394 14330 -21801 -14903 19734 26563 15871 -29525 -30663 12505 69167 62107 25049 17450
6728A7450K2832N8444N5179L7163P470m8062k3342j405M197K1274o1291m8120
$$ 17450 40282 98726 153905 191068 198538 150476 127134 125729 129926 151200 89909 41789
6716D1789j6979k9488K083K0616o7471n0318N7401L2677j9543K3384J5543m0304
$$ 41789 24810 -4678 -2595 18021 -49450 -99768 -42367 -9690 -29233 -5849 9694 -30610
6704c0610N00O4543K8882P775j6527l4610R426n341m1873o829O701k3373j9430
$$ -30610 -30110 34433 63315 71090 54563 19953 29379 24038 -17835 -24664 -17963 -41336 -60766
6691f0766M8613L6673N333Q834q5961k7349J5397J8254J8742L0761o282n6244
$$ -60766 -12153 24520 29853 38687 -47274 -74623 -59226 -40972 -22230 8531 2249 -53995
6679e3995m5842n149Q2856M0866k8885M2662k0587k0800p705j2453j7935M7311
$$ -53995 -99837 -104986 -22130 18736 -10149 32513 11926 -8874 -16579 -29032 -46967 344
6667C44J4342j0199p111j5742K6112N9494L3247N891j9412l9445L6013P565m1741
$$ 344 14686 4487 -2624 -18366 7746 67240 100487 106378 86966 47521 83534 91099 49358
6654D9358l1818j9201K7226O028k4804L5855j7013j6436J4924K499L5180J364
$$ 49358 17540 -1661 25565 31593 6789 42644 25631 9195 24119 26618 61798 63162
6642F3162m2861K3307J1004m7385J4323M388L1891k462j4098J1315l6639n0533
$$ 63162 20301 43608 54612 7227 21550 25938 57829 55367 41269 52584 15945 -34588
6630c4588N4423M3577m2862n1536K9494K4308L6000L8526p713p6155m6284m7788
$$ -34588 19835 63412 20550 -30986 -1492 22816 58816 97342 89629 13474 -32810 -80598
6618h0598P575q64k2748l658p518r245N2087L4437l0106J9168J9211K4644n506
$$ -80598 -73023 -73887 -96635 -100293 -107811 -117056 -64969 -30532 -60638 -41470 -22259 2385 -3121
6605c121R339j4157k6947M538Q106j2575O4676N5031o4366l3641m193o273j7370
$$ -3121 6218 -7939 -34886 -30348 -22242 -34817 29859 84890 20524 -13117 -17310 -23583 -40953
6592d0953J958J702j0508K8706r814k1809K3523j4839J2351J1078k0217k602R791
$$ -40953 -38995 -37293 -47801 -19095 -28909 -50718 -27195 -42034 -29683 -18605 -38822 -41424 -31633
6579c1633m60j4746m9156M7110O4987q554M951j5908N875j8443L331L8672k3230
$$ -31633 -32093 -46839 -95995 -48885 16102 7548 12499 -3409 2466 -15977 -12646 26026 2796
6566B796J2437l640K379K5103M5096Q179n0340n7779k5747O4589r06o4159l0661
$$ 2796 15233 11593 13972 39075 84171 92350 42010 -15769 -41516 23073 22167 -41992 -72653
6553g2653l5578j2339l785P5294K475k8718L018L885N5273L6010o459l4756j4007
$$ -72653 -108231 -120570 -124355 -49061 -46586 -75304 -72286 -68401 -13128 22882 16423 -18333 -32340
6540c2340K0038N5199q7m4423N004J3757p353L6897j0741j4109k4746N65j5950
$$ -32340 -12302 42897 42810 -1613 3391 17148 9795 46692 35951 21842 -2904 -2339 -18289
6527a8289o8776L018R549j9946J9438k704j353L6480J1956n915Q410K9045j4838
$$ -18289 -87065 -84047 -74498 -94444 -75006 -77710 -79063 -42583 -30627 -36542 -28132 913 -13925
6514a3925k4988K1963j8996n239K2510m3702j7712N5884K6093M6874L8303L593
$$ -13925 -38913 -16950 -35946 -41185 -18675 -62377 -80089 -24205 1888 48762 87065 90658
6502I0658l8197r3609l0955k8650J1580K7827N7501l1484R519N3184r436k3949
$$ 90658 52461 -41148 -72103 -100753 -89173 -61346 -3845 -35329 -25810 27374 17938 -6011
6490f011k3899J1015l1413l6121J7447K5461N5080J8581j8930L3225n6677k9126
$$ -6011 -29910 -18895 -50308 -86429 -68982 -43521 11559 30140 11210 44435 -12242 -41368
6478d1368o5907K2471L582j655P5037N2997n9794k7683K2371j7372J6306o819
$$ -41368 -107275 -84804 -81222 -82877 -7840 45157 -14637 -42320 -19949 -37321 -21015 -27834
6466b7834m8179j5750j9428J6483L359J4913N7755L6447J208j2242k8374n4698
$$ -27834 -76013 -91763 -111191 -94708 -91349 -76436 -18681 17766 18974 6732 -21642 -76340
6454g6340l9722o7650Q486M8803l0706K6258L8769K8548J0452k3950k9509J1369
$$ -76340 -116062 -183712 -175226 -126423 -157129 -130871 -92102 -63554 -53102 -77052 -106561 -95192
6442i5192J7530p818K8596J9098n635q20K4434k833K2056r59n517n516j4215J04819
$$ -95192 -77662 -85480 -56884 -37786 -43421 -44241 -19807 -22640 -584 -1543 -7060 -12576 -26791 78028
6428G8028J8070r2492q9387l1653J4133M5782N7001k0547k8483M905N290l0861
$$ 78028 96098 3606 -85781 -117434 -103301 -57519 -518 -21065 -49548 -44643 -39353 -70214
6416g0214o3050J5431R740n586L8958J6782R341k3232r828J0829O003p312k199
$$ -70214 -133264 -117833 -108093 -113679 -74721 -57939 -48598 -71830 -81658 -70829 -64826 -72138 -74337
6403g4337L1197l2975k3553L9015l4589j1820R9506M04q2085P4034M5748m6543
$$ -74337 -43140 -76115 -99668 -60653 -95242 -107062 -7556 -7152 -89237 -15203 30545 -15998
6391a5998n565q418K507l3536J023m730k7932O3889J9987p0913l8503l693n576
$$ -15998 -21563 -29981 -27474 -61010 -59987 -64717 -92649 -28760 -8773 -79686 -118189 -121882 -127458
6378a27458m180J9315Q6677K2147k66O6731m337k4497q297M156m7753j7611m3389
$$ -127458 -131638 -112323 -25646 -3499 -3765 62966 58629 34132 25835 29991 -17762 -35373 -78762
6365g8762l184J4062M2747L2464m9451l0337J7544l5209n8320N1475K6957j5441
$$ -78762 -81946 -67884 -25137 7327 -42124 -72461 -54917 -90126 -148446 -96971 -70014 -85455
6353h5455r725R749L799J4271N4514K6974m8231n8895J3838J3893Q374N748O479
$$ -85455 -95180 -85431 -81632 -67361 -12847 14127 -34104 -92999 -79161 -65268 -56894 -51146 -44667
6340d4667L4582M3739L2047N27l3662o7004O607j0986M2303N443l0147p996L3908
$$ -44667 -10085 33654 65701 66228 32566 -34438 -27831 -38817 3486 8929 -21218 -29214 4694
6327D694j1155p038k2050l6556r795M2027N527K7119j0697N359K9344K8354k9453
$$ 4694 -6461 -13499 -35549 -72105 -81900 -39873 -34346 -7227 -17924 -12565 16779 45133 15680
6314A5680k3496K4921K0779p785K7251L5699m2791m7489l2141J5123m6913k3479
$$ 15680 -7816 17105 37884 30099 57350 93049 50258 2769 -29372 -14249 -61162 -84641
6302h4641J0615Q0269l0684l1273l1662q670K6724J5974N7969k2069j9238M8409
$$ -84641 -74026 6243 -24441 -55714 -87376 -96046 -69322 -53348 4621 -17448 -36686 11723
6290A1723N56p692m909n1815L0125J1569k7006j9106P337k1288K924j0175J0291
$$ 11723 12279 4587 -322 -52137 -22012 -10443 -37449 -56555 -49218 -70506 -67582 -77757 -67466
6277f7466M7511L8393j0072J6090R843l2965M704L7216Q997j7041l5467j5477
$$ -67466 -19955 18438 8366 24456 34299 1334 6038 43254 52251 35210 -257 -15734
6265a5734l7984J4664p92m119p077L1979K3298K693j650l6174k2118j1319l6908
$$ -15734 -53718 -39054 -39846 -43965 -51042 -19063 4235 6928 5278 -30896 -53014 -64333 -101241
6252a01241m6049j2268O6277N4653K4947L9111j2380L933l5143p1793j594O5241
$$ -101241 -147290 -159558 -93281 -38628 -13681 25430 13050 16983 -18160 -89953 -91547 -26306
6240b6306P0369r346R7o2868K0874L901o3746j9972O1422J5246n6491l1049K0560
$$ -26306 44063 34717 34814 -28054 -7180 -3279 -67025 -86997 -25575 -10329 -66820 -97869 -77309
6227g7309L6485o6361p4527O8412O8443M8973j9004r3994K4565l356J9666M0798
$$ -77309 -40824 -107185 -181712 -113300 -44857 4116 -14888 -108882 -84317 -87673 -68007 -27209
6215b7209K3585n583R114j3898k080J4972L7381j073p2491L2967L9682J7906M714
$$ -27209 -3624 -9207 -93 -13991 -16071 -1099 36282 35209 -37282 -4315 35367 53273 57987
6202E7987J3932m5656L3292J6211n5808l8346k963o984k4739k5016j7423j742
$$ 57987 71919 26263 59555 75766 19958 -18388 -21351 -28335 -53074 -78090 -95513 -97255
6190i7255k2466K8356M5326K8364N0770m3777k8407N660L5891K6399l2406r6215
$$ -97255 -119721 -91365 -46039 -17675 33095 -10682 -39089 -33429 2462 28861 -3545 -99760
6178i9760p3006N656L4270N2613J3098j7600l0598J2061M9970M5870K3702o308
$$ -99760 -172766 -167110 -132840 -80227 -67129 -84729 -115327 -103266 -53296 -7426 16276 9968
6166I968j0834k6311k1378m550K2981N9306K3786n324N4302j6377k2765l4262
$$ 9968 -866 -27177 -48555 -53105 -30124 29182 52968 47644 101946 85569 62804 28542
6154B8542l6466L5849j9280Q269R467k2745Q432l1577J0207R79Q603J8835O94
$$ 28542 -7924 27925 8645 16914 26381 3636 12068 -19509 -9302 -8323 280 19115 19809
6141A9809n8902j1530J5579N1849m458L277m0556m2815j8871K2723M2844K3927
$$ 19809 -39093 -50623 -35044 16805 12347 15624 -24932 -67747 -86618 -63895 -21051 2876
6129B876K5807O0487m1835k4759k295R386n1955l0339k4122K5163k7734l6717
$$ 2876 28683 89170 47335 22576 20281 29667 -22288 -52627 -76749 -51586 -79320 -116037
6117a16037M3486P0843J232k1576Q339O292k3037l0290k4212j1877K245k3426
$$ -116037 -72551 -1708 -476 -22052 -13713 -7421 -30458 -60748 -84960 -96837 -94592 -118018
6105a18018j4363K1848J8324p76J3825L8830N6361j2924n5283k2817l39J5868
$$ -118018 -132381 -110533 -92209 -92985 -79160 -40330 16031 3107 -52176 -74993 -75332 -59464
6093e9464j3246K5970M8433L8717K705m2059r313M10k6600r311K4782J0904k0345
$$ -59464 -72710 -46740 1693 40410 43115 1056 -8257 -7847 -34447 -43758 -18976 -8072 -28417
6080b8417M312K6475q984n32R364K1952j3817l8278l9264j6848Q1797L0819L8999
$$ -28417 -24105 2370 -6614 -7146 2218 24170 10353 -27925 -67189 -84037 -2240 28579 67578
6067F7578O127m1786j5035m0335l5517K4865n1321l4025k4396K1534L8071K6242
$$ 67578 73705 31919 16884 -23451 -58968 -34103 -85424 -119449 -143845 -122311 -84240 -57998
6055e7998J0668k2713j0455K6801L6980P859L9359j0543n0950k3658J259j1851
$$ -57998 -47330 -70043 -80498 -53697 -16717 -8858 30501 19958 -30992 -54650 -53391 -65242
6043f5242J262m3600m2058L5702J3215P0889j6389m1209O871N6065j1219k4357
$$ -65242 -63980 -107580 -149638 -113936 -100721 -29832 -46221 -87430 -80559 -24494 -35713 -60070
6031f0070J3960k5999J4236M928O2056O8688n4277m5107J9431K1581m4126J2874
$$ -60070 -46110 -72109 -57873 -52945 9111 77799 23522 -21585 -2154 19427 -24699 -11825
6019a1825J636N4348J0306l3159l9619k4394m6157J6486K2181j441n121J4818
$$ -11825 -10189 44159 54465 21306 -18313 -42707 -88864 -72378 -50197 -51638 -56759 -41941
6007d1941J8356J0157L4511K8334K888k2065q703m35n4050Q515N622L6250J0628
$$ -41941 -23585 -13428 21083 49417 52305 30240 21537 21102 -32948 -24433 -18811 17439 28067
5994B8067k5828j5163j4223j3891j348K2112J1586J3827J2679j4508K743L0472
$$ 28067 2239 -12924 -27147 -41038 -42386 -20274 -8688 5139 17818 3310 6053 36525
5982C6525m3610o0705K296M7475l89j7104K7388N9245L96m5777j8652j727J087
$$ 36525 -7085 -67790 -65494 -18019 -18408 -35512 -8124 51121 51517 5740 -12912 -14639 -13552
5969a3552O316J4379J3128K2135m4086k9818q616L8709J0267m5555M4258O7621
$$ -13552 -7236 7143 20271 42406 -1680 -31498 -40114 -1405 8862 -36693 7565 75186
5957G5186J2057q5587l8219J8765j8355J6967Q891k4234l5782J5510L5986O559
$$ 75186 87243 1656 -36563 -17798 -36153 -19186 -10295 -34529 -70311 -54801 -18815 -12256
5945a2256m1489q236k3969j6075K0563K0965j0185k091J8193m8043M076L1778
$$ -12256 -53745 -61981 -85950 -102025 -81462 -60497 -70682 -72773 -54580 -102623 -98547 -66769
5933f6769L9694N4109N4668l0387p334J2622L3462o3071j4387m255l2149J3894
$$ -66769 -27075 27034 81702 51315 43981 56603 90065 26994 12607 8352 -23797 -9903
5921i903L0213M6341n49L6562k6326q1557l4768K5992J8398o4302k5152J3091
$$ -9903 20310 66651 66102 102664 76338 -5219 -39987 -13995 4403 -59899 -85051 -71960
5909g1960M695j9347o063N1115L9628J0493k2994n7493K037K1697l3115J6847
$$ -71960 -67265 -86612 -92675 -41560 -1932 8561 -14433 -71926 -69889 -48192 -81307 -64460
5897f4460N2764J9879k3170m6124l8951k8620J5443O8518L1347j1163k321J0260
$$ -64460 -11696 8183 -14987 -61111 -100062 -128682 -113239 -44721 -13374 -24537 -26858 -16598
5885a6598k3076l4056J5920R22l911p576j6876j2945L492L8499J8999O439J4139
$$ -16598 -39674 -73730 -57810 -56888 -60799 -68375 -85251 -98196 -94704 -56205 -37206 -30767 -16628
5872a6628m1107m1301K8818K3242J1979j0974M255P5079m830n167J0868L6694
$$ -16628 -57735 -99036 -70218 -46976 -34997 -45971 -41716 33363 28533 23366 34234 70928
5860G0928K1270l2123k4757m8273n6652k0509M3158j2099M008j336p44m0628J6042
$$ 70928 92198 60075 35318 -12955 -69607 -90116 -46958 -59057 -55049 -56385 -57129 -97757 -81715
5847h1715N784J5870K0631o883M4732Q488o318K458k1247J5320o6320j5335P571
$$ -81715 -75931 -60061 -39430 -46313 -1581 6907 589 3047 -18200 -2880 -69200 -84535 -76964
5834g6964P731K6971j7131l761R942J0548m1065l7300M5143O8176j47k7626k8122
$$ -76964 -69233 -42262 -59393 -63154 -53212 -42664 -83729 -121029 -75886 -7710 -7857 -35483 -63605
5821f3605k9002m4693K5702j2790N5495M6507j8332o6068n138K3535R013M386
$$ -63605 -92607 -137300 -111598 -124388 -68893 -22386 -40718 -106786 -111924 -88389 -79376 -74990
5809g4990n882M2746J7819J4246M946J7168J6388O514k6507K516N3074j245k8451
$$ -74990 -80872 -38126 -20307 -6061 -1115 16053 32441 38955 12448 14964 68038 66793 38342
5796C8342L506n117n0597N472M7396K4950k2185m8517k5996j8979j9624n933k1721
$$ 38342 41848 36731 -13866 -8394 39002 63952 41767 -6750 -32746 -51725 -71349 -77282 -99003
5783i9003j454M3555N3577j5489k8763j046K7149M1777L3244p8483m4452M3155
$$ -99003 -100457 -56902 -3325 -18814 -47577 -48623 -21474 20303 53547 -24936 -69388 -26233
5771b6233L9527m229l6014k7819j6002oK895K4611O3989N6455k3112k8665j6479
$$ -26233 13294 9065 -26949 -54768 -70770 -70776 -67881 -43270 20719 77174 54062 25397 8918
5758H918l1307l7545J0375K3809J5342L8734n656j1784l9588n069P606l5815M3371
$$ 8918 -22389 -59934 -49559 -25750 -10408 28326 22670 10886 -28702 -33771 -26165 -61980 -18609
5745a8609r472K351L8056k0108n6048J7252M9986j305M29l6527j9221J0494o1664
$$ -18609 -28081 -25730 12326 -7782 -63830 -46578 3408 2103 2532 -33995 -53216 -42722 -104386
5732a04386l5669M0407P494Q3020R7600N447m7111n1424k7065M3584M7484m4073
$$ -104386 -140055 -99648 -92154 -9134 88466 93913 46802 -4622 -31687 11897 59381 15308
5720A5308R231K0154j2793p504N14k0433j7167J94q908R910l818l8005L592j199
$$ 15308 24539 44693 31900 24396 24910 4477 -12690 -12496 -21404 -11494 -15312 -53317 -49725 -50924
5706e0924m6066J8470k6021o756M3359L5649j0809N0157k5587j0774k0530l9634
$$ -50924 -96990 -78520 -104541 -111297 -67938 -32289 -43098 7059 -18528 -29302 -49832 -89466
5694h9466L0230J9912M8496m425k3416k6223L4569l6990k5765L9381M3236L2332
$$ -89466 -59236 -39324 9172 4747 -18669 -44892 -10323 -47313 -73078 -33697 9539 41871
5682D1871J4731j44K7883k9828k6606l6033l4165k8581L2255k7563K6282M3918
$$ 41871 56602 56458 84341 54513 27907 -8126 -42291 -70872 -38617 -66180 -39898 4020
5670D020m5234n0849r355J9907J5646J149M9223O3889k1264k1405k8898N0806
$$ 4020 -41214 -92063 -101418 -81511 -65865 -64716 -15493 48396 27132 5727 -23171 27635
5658B7635N6206J1627m0814n7551m663J7192L5176L896J236j4844m6584o4055
$$ 27635 83841 95468 54654 -2897 -7560 9632 44808 48704 49940 35096 -11488 -75543
5646g5543k6549m803Q199O5364P2044m7353m1078m9502j3247J3606L8182k866
$$ -75543 -102092 -106895 -98696 -33332 38712 -8641 -49719 -99221 -112468 -98862 -60680 -63546
5634f3546l003J742n0108k0052K4305M6802N6004O00l7241n9722J1433P0421l508
$$ -63546 -66549 -64807 -114915 -134967 -110662 -63860 -7856 -7256 -44497 -104219 -92786 -22365 -25873
5621b5873n19l409m783l3546n705K1764l130j7941k208O2967P813M5510L2855
$$ -25873 -26392 -29801 -34584 -68130 -73835 -52071 -55201 -73142 -75350 -12383 -4570 40940 73795
5608G3795l4537P049n0903o5537r251M6151N4269M5067j9855m4389l5335M970
$$ 73795 39258 46307 -4596 -70133 -79384 -33233 21036 66103 46248 1859 -33476 -28506
5596b8506K2977N361m401K0006L2071L6341l0768k393l997k1694m221J4148M936
$$ -28506 -5529 -168 -4569 15437 47508 83849 53081 50688 46691 24997 20776 34924 39860
5583C9860j2048J4125j6247J6641j2056k2682j660j8970k3414j3345p674R831
$$ 39860 27812 41937 25690 42331 30275 7593 5933 -13037 -36451 -49796 -57470 -47639
5571d7639Q561l0298m352K1384K3253q300k6667j3625j4817M8357J9912J2229
$$ -47639 -39078 -69376 -73728 -52344 -29091 -37391 -64058 -77683 -92500 -44143 -24231 -12002
5559a2002K8875K7574L2778m8459p0024K8331J3372J9849m2879m073J5384m037
$$ -12002 16873 44447 77225 28766 -41258 -12927 445 20294 -22585 -26658 -11274 -15311
5547a5311q935M8308j8476l5430p994J8091k534R451j4051K2515M1195j9963M4706
$$ -15311 -24246 24062 5586 -29844 -37838 -19747 -22281 -12830 -26881 -4366 36829 16866 61572
5534F1572L5059k42k0565q9766n2230m2771k7352L2241P6377K6189J7043K7947
$$ 61572 96631 96389 75824 -13942 -66172 -108943 -136295 -104054 -27677 -1488 15555 43502
5522D3502K4310o98k2022l1815k180j1809J7262R250j2475L862k2788N275J4973
$$ 43502 67812 67114 45092 13277 11097 -712 16550 25800 13325 17187 -5601 -326 14647
5509A4647J3912n6661m0355Q1798L20j2045j4828l1079j1949j8488l1373P8707
$$ 14647 28559 -28102 -68457 13341 13661 1616 -13212 -44291 -56240 -74728 -106101 -27394
5497b7394K3512k7216P377O2498N9809J3821o4153n9428L884l7130l6942J6591
$$ -27394 -3882 -31098 -23721 38777 98586 112407 48254 -11174 -7290 -44420 -81362 -64771
5485f4771J01749O6254o1619o392L713k6522R504l3139k4830r217J509J1793M4947
$$ -64771 36978 103232 41613 35221 38934 12412 21916 -11223 -36053 -45270 -43761 -31968 12979
5472A2979j4164l4705k5489o7667M6120K1048K8921O1750N1465n2133m9944R339
$$ 12979 -1185 -35890 -61379 -129046 -82926 -61878 -32957 28793 80258 28125 -21819 -12480
5460a2480l2582k3638K7563K896j7999j3599j1402J7754K2709J9478K6850K5209
$$ -12480 -45062 -68700 -41137 -38241 -56240 -69839 -81241 -63487 -40778 -21300 5550 30759
5448C0759M1099j2476k668Q813N565l2616n5231m608k7707m5506K4250M4570j4176
$$ 30759 71858 59382 56714 65527 71092 38476 -16755 -21363 -49070 -94576 -70326 -25756 -39932
5435c9932o3518p8475M0996L4474L4188P294O095l7312L8639N2089K1321l4878
$$ -39932 -103450 -181925 -140929 -106455 -72267 -64973 -58878 -96190 -57551 -5462 15859 -19019
5423a9019j5989L676j891M6761p1997q2578K6834R705J9767L7405J2539n124L4730
$$ -19019 -35008 -31332 -33223 13538 -58459 -141037 -114203 -104498 -84731 -47326 -34787 -39911 -5181
5410e181k3196j947j4261J7477K2162J2807l2713L8141K13k2888J603l4055j6562
$$ -5181 -28377 -30324 -44585 -27108 -4946 7861 -24852 13289 13502 -9386 -7783 -41838 -58400
5397e8400Q048m430K4506k2967m3914J2755L1580L9438n2573m2630K3902J9957
$$ -58400 -50352 -54782 -30276 -53243 -97157 -84402 -52822 -13384 -65957 -108587 -84685 -64728
5385f4728P271J3656o8319l8371N5712P3579P0672k5499j0290j7822r295N9205
$$ -64728 -57457 -43801 -112120 -150491 -94779 -21200 49472 23973 13683 -4139 -13434 45771
5373D5771N0821k3974m5986j1551N437K5296K5258m5149k1292j031j7369k17j545
$$ 45771 96592 72618 26632 15081 20518 45814 71072 25923 4631 3600 -13769 -13986 -15531
5360a5531j1328J2871M3088l86k8071q345m8599k7174L4025L4979J0591O502M683
$$ -15531 -26859 -13988 29100 28714 643 -7702 -56301 -83475 -49450 -14471 -3880 2622 7305
5347G305k454l5890j8340l3040n898N5619J7121L1101O090m0221L3217J521j8802
$$ 7305 4851 -31039 -49379 -82419 -88317 -32698 -15577 15524 21614 -18607 14610 16131 -2671
5334b671j483M9492m7149m2465m6982K2353N1051k3628j294J0344l0285J1550
$$ -2671 -4154 45338 -1811 -44276 -91258 -68905 -17854 -41482 -42776 -32432 -62717 -51167
5322e1167K4155k876M3357k2675o6121K4249L4139k3303n100M348J1887m111L4676
$$ -51167 -27012 -29888 13469 -9206 -75327 -51078 -16939 -40242 -45342 -40994 -29107 -33218 1458
5309A458j7493k8322J3392M1374j1419m0378m2743K7203R3375j3787k3180n2325
$$ 1458 -16035 -44357 -30965 10409 -1010 -41388 -84131 -56928 36447 22660 -520 -52845
5297e2845l4234P666L2968N8735M9213k7219j6498j9745R322k4181j5496k248
$$ -52845 -87079 -79413 -46445 12290 61503 34284 17786 -1959 7363 -16818 -32314 -34562
5285c4562l557J9961K0480l9837P120K3723N916N20k335L4022m7754q995K7682
$$ -34562 -38119 -18158 2322 -37515 -30395 -6672 -756 -236 -2571 31451 -16303 -25298 2384
5272B384k651L5147l4503k09j368k4822j3875J2776J0461Q494J471k0491j0153
$$ 2384 -267 34880 377 168 -1200 -26022 -39897 -27121 -16660 -8166 -6695 -27186 -37339
5259c7339M4086P0407N0603l8394q5861m7383k5718K1980K6639J704O7835J2229
$$ -37339 6747 77154 127757 89363 3502 -43881 -69599 -47619 -20980 -19276 48559 60788
5247F0788n9453l0052j2848k3492M4153J2677l3493k019K5241l5834P369J7850
$$ 60788 1335 -28717 -41565 -65057 -20904 -8227 -41720 -43739 -18498 -54332 -46963 -29113
5235b9113m146k4417k3350l0938J431L2905N6736K3498j5677J9391J6413j04235
$$ -29113 -33259 -57676 -81026 -111964 -110533 -77628 -20892 2606 -13071 6320 22733 -81502
5223h1502n6554P6821J02288k5116K858Q2n902n932K5035N2567j624q8126k7971
$$ -81502 -138056 -61235 41053 15937 18795 18877 12975 7043 32078 84645 83021 -5105 -33076
5210c3076K7357n024k514k368k2383O5503j4681j1722r394k5740Q287M2761O66
$$ -33076 -5719 -10743 -13257 -15625 -38008 27495 12814 1092 -8302 -34042 -25755 17006 17672
5197A7672j5270l1783N6106J7625l9714k3172N880N8473M2641k8820m8046n0608
$$ 17672 2402 -29381 26725 44350 4636 -18536 -12656 45817 88458 59638 11592 -39016
5185c9016j4640j2238J3529M9642N0254K0865k5558q2102m340L6654N3362O4148
$$ -39016 -53656 -65894 -52365 -2723 47531 68396 42838 -39264 -43604 -6950 46412 110560
5173A10560k7606o0384J5974m6769o6319j5380K2999L2240p22R107M2750l5224
$$ 110560 82954 22570 38544 -8225 -74544 -89924 -66925 -34685 -35407 -26300 16450 -18774
5161a8774j1M187J7010J5393j871J4492q763o0793j1659L3303j8034M161J3129
$$ -18774 -18785 -14598 2412 17805 15934 30426 21663 -39130 -50789 -17486 -35520 -31359 -18230
5148a8230l3075p6099m4355Q329R4284M6790m2747l9325J5369j4712L0525N7494
$$ -18230 -51305 -127404 -171759 -163430 -69146 -22356 -65103 -104428 -89059 -103771 -73246 -15752
5136a5752j451m4225N6751M0125O208k076q060l4770m1452j6966L6105p3784k000
$$ -15752 -17203 -61428 -4677 35448 41656 39580 31520 -3250 -44702 -61668 -25563 -99347 -101347
5123a01347M233q460r218r769J3473K1376j2168J1871N1743p108j1036L9218j8099
$$ -101347 -97114 -105574 -114792 -124561 -111088 -89712 -101880 -90009 -38266 -45374 -56410 -17192 -35291
5110c5291l5906J414k8246J0190M4388K7140Q304K3505l3969m0350K9760N6077
$$ -35291 -71197 -69783 -98029 -87839 -43451 -16311 -8007 15498 -18471 -58821 -29061 27016
5098B7016j5774n3372m2518J7250K9194L6653k0298k5476M284j6927j9832P262
$$ 27016 11242 -42130 -84648 -67398 -38204 -1551 -21849 -47325 -43041 -59968 -79800 -72538
5086g2538N5736P3183K0385q2143q980r94l278q223l228Q24j8980O469J184k395
$$ -72538 -16802 56381 76766 -5377 -14357 -15351 -18629 -26852 -30080 -29256 -48236 -41767 -40583 -42978
5072d2978K5520L8921j5557m735K1612m35k4524Q334k5989j6970N1502M9805j0891
$$ -42978 -17458 21463 5906 1171 22783 22348 -2176 6158 -19831 -36801 14701 64506 53615
5059E3615J7602R070n3520j2799j3265l3916O62M9883K0609J0749l3285k249p634
$$ 53615 71217 80287 26767 13968 703 -33213 -32551 17332 37941 48690 15405 13156 5522
5046E522j1811j3111K0186J8888m2387r7K4478L0264n1254n9261J3903J6603L6
$$ 5522 -6289 -19400 786 19674 -22713 -22810 1668 31932 -19322 -78583 -64680 -48077 -48041
5033d8041J90n579m0212L092J1768L8344k802P022J0989j9675P985L3063j2310
$$ -48041 -47851 -53430 -93642 -90550 -78782 -40438 -43240 -36218 -25229 -44904 -36919 -3856 -16166
5020a6166j2831L5663k657n6678m5220M151L8155n803p855L7544M1706r020K948
$$ -16166 -28997 6666 4009 -52669 -97889 -93738 -55583 -61386 -69241 -31697 10009 989 3937
5007C937j4552N4693j8561k6419K7305J0586l1486m5727k2072j4741M734j0167
$$ 3937 -10615 44078 25517 -902 26403 36989 5503 -40224 -62296 -77037 -72303 -82470
4995h2470J7384m4352J5987P7351M3269k1582m9876o153J8153L808K776R9m0241
$$ -82470 -65086 -109438 -93451 -16100 27169 5587 -44289 -50442 -32289 -28481 -25705 -25606 -65847
4982f5847j7133L6519L0965k9521j9496l52k3778l0016j1912k379O0717O619N726
$$ -65847 -82980 -46461 -15496 -45017 -64513 -64865 -88643 -118659 -130571 -132950 -72233 -65614 -59888
4969e9888M9351K1782l0690l3321R628n260K5546J6470k3696j7235k542j821k6139
$$ -59888 -10537 11245 -19445 -52766 -43138 -48398 -22852 -6382 -30078 -47313 -49855 -51676 -77815
4956g7815O6011M3121m4165k6751j3098k4587M3799J9731p59l5923J5690k2571
$$ -77815 -11804 31317 -12848 -39599 -52697 -77284 -33485 -13754 -14513 -50436 -34746 -57317
4944e7317j5987L1972J567l2243P943K2814r164R1205N4118j1331q5126r798j6601
$$ -57317 -73304 -41332 -39765 -72008 -64065 -41251 -50415 40790 94908 83577 -1549 -11347 -27948
4931b7948r908j4722J1732m4066k1067L4642L0847k7877Q588J1772M7797P402
$$ -27948 -37856 -52578 -40846 -84912 -105979 -71337 -40490 -68367 -59779 -48007 -210 7192
4919G192p391O786J9914j9707q343K1368J0372L7145J470n1503r9008p084r203
$$ 7192 -199 6587 26501 6794 -1549 19819 30191 67336 68806 17303 -81705 -88789 -97992
4906i7992M897K8704K6228Q936j732k2756k1250K8738M7465P525l5357n1003L0731
$$ -97992 -93095 -64391 -38163 -29227 -30959 -53715 -74965 -46227 1238 8763 -26594 -77597 -46866
4893d6866K1255k7047N6012k426o849k706m332n202l8134M6286L3879N7821L3866
$$ -46866 -25611 -52658 3354 928 -5921 -8627 -12959 -18161 -56295 -10009 23870 81691 115557
4880A15557l7181l6375p8571o1880j4321O7272J3648r473n740n056j8105j2900
$$ 115557 78376 42001 -36570 -98450 -112771 -45499 -31851 -41324 -47064 -52120 -70225 -83125
4868h3125J2097M2583J1761j8428J507j934J2246Q007Q811L3648K8507l8492k7793
$$ -83125 -71028 -28445 -16684 -35112 -33605 -35539 -23293 -15286 -6475 27173 55680 17188 -10605
4855a0605j6313l4672j7362l5361Q246K8813l775n977k7454M955O4400J9432o073
$$ -10605 -26918 -61590 -78952 -114313 -106067 -77254 -81029 -87006 -114460 -109505 -45105 -25673 -31746
4842c1746k9449q809L8160J2661J9358p425j9716m4724n3262L1265n508K5290
$$ -31746 -61195 -70004 -31844 -19183 175 -7250 -26966 -71690 -124952 -93687 -99195 -73905
4830g3905L5806K9044k0209L0327m9214m6997L6036L6165k8099q095M0554o121
$$ -73905 -38099 -9055 -29264 1063 -48151 -95148 -59112 -22947 -51046 -59141 -18587 -24708
4818b4708J9561K8270k4976J5897N8202O027j8593m6132m3096k4534m5745N0680
$$ -24708 -5147 23123 -1853 14044 72246 78273 59680 13548 -29548 -54082 -99827 -49147
4806d9147J12391M7149l8207o0622n5149O508J4691l8744K6156L7793k3145r708
$$ -49147 63244 110393 72186 11564 -43585 -37077 -22386 -61130 -34974 2819 -20326 -30034
4794c0034n9625N791M9452N2935K6892q8134j4966J0932P432O8247k7105l1585
$$ -30034 -89659 -83868 -34416 18519 45411 -42723 -57689 -46757 -39325 28922 1817 -29768
4782b9768k2542r528Q514l8646N682m539k1983K8727L2922N2107J1575l2098o9915
$$ -29768 -52310 -61838 -53324 -91970 -86288 -90827 -112810 -84083 -51161 946 12521 -19577 -89492
4769h9492k6420m318L2059k72J4578M4150N1298K3219l4508m751L9488K014j5901
$$ -89492 -115912 -120230 -88171 -88443 -73865 -29715 21583 44802 10294 5543 45031 47045 31144
4756C1144j1572J6682L3281k7258l2627n0171j9935L5768K3725M448k7532n262
$$ 31144 19572 36254 69535 42277 9650 -40521 -60456 -24688 -963 3485 -24047 -29309
4744b9309J0471p183L26J3519k5976J5615J3086K5577r584m6707J5161j1137k909
$$ -29309 -18838 -26021 -25695 -12176 -38152 -22537 -9451 16126 6542 -40165 -25004 -36141 -39050
4731c9050L3286L201L8340L5088k701j2106M2547k2561m8862P389K226L2039k0912
$$ -39050 -5764 -2563 35777 70865 68164 56058 98605 76044 27182 34571 36797 68836 47924
4718D7924o43l853m9210J5377j7527j7840K5711l6351K6842n4928r405m8135l617
$$ 47924 47281 43428 -5782 9595 -7932 -25772 -61 -36412 -9570 -64498 -73903 -122038 -125655
4705a25655L9279J0275j1927M8012Q884K2698O9827M8906j0783m1381l0246r979
$$ -125655 -86376 -76101 -88028 -40016 -31132 -8434 61393 110299 99516 58135 27889 17910
4693A7910K654k9253j7866m2027j6403K692L4125K8453J5839Q658k5059o203o189
$$ 17910 20564 -8689 -26555 -68582 -84985 -82293 -48168 -19715 -3876 4782 -20277 -26480 -32669
4680c2669J0807Q40K9326l9259J1437l6154j4769j0991P190J6377J0745J6170
$$ -32669 -21862 -21022 8304 -30955 -19518 -55672 -70441 -81432 -74242 -57865 -47120 -30950
4668c0950q115K5949k0694O810m225m9405K8303k3834k3017l4218K2697L5041
$$ -30950 -39065 -13116 -33810 -27000 -31225 -80630 -52327 -76161 -99178 -133396 -110699 -75658
4656g5658K6170P0494K7554j3372M880O693k1633m1521J6387K183n7328k0913
$$ -75658 -49488 21006 48560 35188 40068 46761 25128 -16393 -6 2177 -55151 -76064
4644g6064p411O2763k2958m048J4294j6735p249K0731Q058J901j601L7715j334
$$ -76064 -83475 -20712 -43670 -47718 -33424 -50159 -57408 -36677 -28619 -26718 -28319 9396 8062
4631H062j6343k7514J1242l4158R771J4613K1643k1572Q168j7336L5430j103j081
$$ 8062 -8281 -35795 -24553 -58711 -48940 -34327 -12684 -34256 -26088 -43424 -7994 -9097 -10178
4618a0178n6n629n693M573k6728K018j1378L9106p649k3601K3923o825K3903P2749
$$ -10178 -10234 -15863 -21556 -16983 -43711 -41693 -53071 -13965 -21614 -45215 -21292 -28117 -4214 68535
4604F8535L792r090J7968j6071n1167n3933J3422l7507m9596M4537K6141J9523
$$ 68535 72327 63237 81205 65134 13967 -39966 -26544 -64051 -113647 -69110 -42969 -23446
4592b3446P4576j7526m5008p9600k2108M9083K0822k3022O776M9490J5648K8690
$$ -23446 51130 33604 -11404 -91004 -113112 -64029 -43207 -66229 -59453 -9963 5685 34375
$$ [...]
##END NTUPLES=NMR SPECTRUM
##END=
