##TITLE=Analysis number 318218
Compound Code cc 48210
Book Reference 449/92
Project Code adrs
Chemist Name davee
##JCAMPDX= 6.0         $$ Bruker NMR JCAMP-DX V2.0
##DATA TYPE= NMR SPECTRUM
##DATA CLASS= NTUPLES
##ORIGIN= Bruker BioSpin GmbH
##OWNER= nmr
$$ XWIN-NMR		Version 3.5
$$ Mon Mar 20 15:32:57 2006 GMT Standard Time (UT+0h)  MAYBRIDGE\nmr@NMR_250MHZ
##.OBSERVE FREQUENCY= 250.131544655141
##.OBSERVE NUCLEUS= ^1H
##.ACQUISITION MODE= SIMULTANEOUS (DQD)
##.ACQUISITION SCHEME= undefined
##.AVERAGES= 16
##.DIGITISER RES= 18
##SPECTROMETER/DATA SYSTEM= dpx250
##.PULSE SEQUENCE= zg30
##.SOLVENT NAME= CDCl3
##.SHIFT REFERENCE= (INTERNAL, CDCl3, 0, 16.4465)
##AUDIT TRAIL= $$ (NUMBER, WHEN, WHO, WHERE, WHAT)
$$ ##TITLE= Audit trail, XWIN-NMR		Version 3.5
$$ ##JCAMPDX= 5.01
$$ ##ORIGIN= Bruker BioSpin GmbH
$$ ##OWNER= nmr
$$ C:\u/data/dgb/nmr/ADRS/1120/pdata/1/auditp.txt
$$ ##AUDIT TRAIL=  $$ (NUMBER, WHEN, WHO, WHERE, WHAT)
(   1,<2006-03-20 15:32:30.65 +000>,<MAYBRIDGE\nmr>,<NMR_250MHZ>,
      <created by zg, POWCHK disabled, PULCHK disabled
       configuration hash MD5:
       84 BC 41 DB A1 6E 1D 46 DA 25 12 A5 C1 ED C5 3A
       data hash MD5: 64K
       A2 36 5F D8 75 25 A4 21 11 E4 DB 30 EB D1 42 1B>)
(   2,<2006-03-20 15:32:47.37 +000>,<MAYBRIDGE\nmr>,<NMR_250MHZ>,
      <Start of raw data processing
       ef LB = 0.3 FT_mod = 6 PKNL = 1 SI = 32K 
       data hash MD5: 32K
       2B 8D 9E 54 7E E1 9E 43 02 16 A5 82 F6 DF 44 93>)
(   3,<2006-03-20 15:32:49.07 +000>,<MAYBRIDGE\nmr>,<NMR_250MHZ>,
      <apk 
       data hash MD5: 32K
       80 72 F6 D4 92 FE 07 50 C6 5B 5D E7 4A C5 2F CD>)
(   4,<2006-03-20 15:32:49.88 +000>,<MAYBRIDGE\nmr>,<NMR_250MHZ>,
      <abs ABSG = 5 
       data hash MD5: 32K
       A0 AB 45 A9 7F EF 87 5F D8 F5 A7 00 9A 9D 58 DE>)
$$ ##END=
$$ 
$$ hash MD5
$$ B4 3C 57 EF A2 D5 00 34 B0 24 F1 A9 23 81 EB E6
##$RELAX= 
##$RELAX= 
##$RELAX= 
##$RELAX= 
##$RELAX= 
##$RELAX= 
##$RELAX= 
$$ Bruker specific parameters
$$ --------------------------
##$DU= <C:\u>
##$EXPNO= 1120
##$NAME= <ADRS>
##$PROCNO= 1
##$TYPE= <nmr>
##$USER= <dgb>
##$AMP= (0..31)
100 100 100 100 100 100 100 100 100 100 100 100 100 100 100 100 100 100 
100 100 100 100 100 100 100 100 100 100 100 100 100 100 
##$AQSEQ= 0
##$AQ_mod= 3
##$AUNM= <au_zg>
##$AUTOPOS= <53 >
##$BF1= 250.13
##$BF2= 250.13
##$BF3= 250.13
##$BF4= 250.13
##$BF5= 500.13
##$BF6= 500.13
##$BF7= 500.13
##$BF8= 500.13
##$BYTORDA= 1
##$CFDGTYP= 0
##$CFRGTYP= 5
##$CHEMSTR= <none>
##$CNST= (0..31)
1 1 145 1 1 1 1 1 1 1 1 1 1 1 1 1 1 1 1 1 1 1 1 1 1 1 1 1 1 1 1 1 
##$CPDPRG= <>
##$CPDPRG1= <>
##$CPDPRG2= <>
##$CPDPRG3= <>
##$CPDPRG4= <mlev>
##$CPDPRG5= <mlev>
##$CPDPRG6= <mlev>
##$CPDPRG7= <mlev>
##$CPDPRG8= <mlev>
##$CPDPRGB= <>
##$CPDPRGT= <>
##$D= (0..31)
0 1 0 0 0 0 0 0 0 0.06 0 0 0 0 0 0 0.0002 0 0 0 0 0 0 0 0 0 0 0 0 0 0 
0 
##$DATE= 1142868747
##$DBL= (0..7)
120 120 120 120 120 120 120 120 
##$DBP= (0..7)
150 150 150 150 150 150 150 150 
##$DBP07= 0
##$DBPNAM0= <>
##$DBPNAM1= <>
$$ [...]
##$SUBNAM7= <"">
##$SUBNAM8= <"">
##$SUBNAM9= <"">
##$SW= 20.6930455092707
##$SWIBOX= (0..15)
0 0 3 0 0 0 0 0 0 0 0 0 0 0 0 0 
##$SW_h= 5175.983436853
##$TD= 65536
##$TD0= 1
##$TE= 294.16
##$TE2= 300
##$TE3= 300
##$TEG= 300
##$TL= (0..7)
0 120 120 120 120 120 120 120 
##$TP= (0..7)
150 150 150 150 150 150 150 150 
##$TP07= 0
##$TPNAME0= <>
##$TPNAME1= <>
##$TPNAME2= <>
##$TPNAME3= <>
##$TPNAME4= <>
##$TPNAME5= <>
##$TPNAME6= <>
##$TPNAME7= <>
##$TPOAL= (0..7)
0.5 0.5 0.5 0.5 0.5 0.5 0.5 0.5 
##$TPOFFS= (0..7)
0 0 0 0 0 0 0 0 
##$TUNHIN= 0
##$TUNHOUT= 0
##$TUNXOUT= 0
##$USERA1= <user>
##$USERA2= <user>
##$USERA3= <user>
##$USERA4= <user>
##$USERA5= <user>
##$V9= 5
##$VALIST= <valist>
##$VCLIST= <CCCCCCCCCCCCCCC>
##$VD= 0
##$VDLIST= <DDDDDDDDDDDDDDD>
##$VPLIST= <PPPPPPPPPPPPPPP>
##$VTLIST= <TTTTTTTTTTTTTTT>
##$WBST= 1024
##$WBSW= 4
##$XGAIN= (0..3)
0 0 0 0 
##$XL= 0
##$YL= 0
##$YMAX_a= 371409
##$YMIN_a= -402278
##$ZGOPTNS= <>
##$ZL1= 120
##$ZL2= 120
##$ZL3= 120
##$ZL4= 120
##$ABSF1= 16.44652
##$ABSF2= -4.246653
##$ABSG= 5
##$ABSL= 3
##$ALPHA= 0
##$AQORDER= 0
##$ASSFAC= 0
##$ASSFACI= 0
##$ASSFACX= 0
##$ASSWID= 0
##$AUNMP= <proc_1d>
##$AZFE= 0.1
##$AZFW= 0.1
##$BCFW= 0
##$BC_mod= 0
##$BYTORDP= 0
##$COROFFS= 0
##$CY= 12.5
##$DATMOD= 1
##$DC= 0
##$DFILT= <>
##$DTYPP= 0
##$F1P= 14.0000005364418
##$F2P= -0.99999901652339
##$FCOR= 0.5
##$FTSIZE= 32768
##$FT_mod= 6
##$GAMMA= 0
##$GB= 0
##$INTBC= 1
##$INTSCL= 1
##$ISEN= 128
##$LB= 0.3
##$LEV0= 0
##$LPBIN= 0
##$MAXI= 10000
##$MC2= 0
##$MEAN= 0
##$ME_mod= 0
##$MI= 0
##$NCOEF= 0
##$NC_proc= -5
##$NLEV= 6
##$NOISF1= 0
##$NOISF2= 0
##$NSP= 0
##$NTH_PI= 0
##$NZP= 0
##$OFFSET= 16.44652
##$PC= 1
##$PHC0= 180.9884
##$PHC1= 3.825126
##$PH_mod= 1
##$PKNL= yes
##$PPARMOD= 0
##$PSCAL= 4
##$PSIGN= 0
##$REVERSE= no
##$SF= 250.130018878547
##$SI= 32768
##$SIGF1= 0
##$SIGF2= 0
##$SINO= 400
##$SIOLD= 32768
##$SREGLST= <1H.CDCl3>
##$SSB= 0
##$STSI= 32768
##$STSR= 0
##$SW_p= 5175.98343685301
##$SYMM= 0
##$S_DEV= 0
##$TDeff= 65536
##$TDoff= 0
##$TI= <Analysis number 999999
Compound Code 99
Book Reference 9
Project Code 9>
##$TILT= no
##$TM1= 0
##$TM2= 0
##$TOPLEV= 0
##$USERP1= <user>
##$USERP2= <user>
##$USERP3= <user>
##$USERP4= <user>
##$USERP5= <user>
##$WDW= 1
##$XDIM= 32768
##$YMAX_p= 495265342
##$YMIN_p= -673870
$$ End of Bruker specific parameters
$$ ---------------------------------
##NTUPLES= NMR SPECTRUM
##VAR_NAME=  FREQUENCY,     SPECTRUM/REAL,   SPECTRUM/IMAG
##SYMBOL=    X,             R,               I
##VAR_TYPE=  INDEPENDENT,   DEPENDENT,       DEPENDENT
##VAR_FORM=  AFFN,          ASDF,            ASDF
##VAR_DIM=   32768,         32768,           32768
##UNITS=     HZ,            ARBITRARY UNITS, ARBITRARY UNITS
##FACTOR=    0.157963299565203, 1,           1
##FIRST=     4113.76832098826, 0,            0
##LAST=      -1062.21511586475, 0,           0
##MIN=       -1062.21511586475, -673870,     0
##MAX=       4113.76832098826, 495265342,    0
$$ Real data points
##PAGE= N=1
##DATA TABLE= (X++(R..R)), XYDATA
$$ [...]
24204B540630Q1410J0647r0298j49564k866Q4098K43130O2117p8850j4025M2950
$$ 2540630 2622040 2632687 2542389 2392825 2389959 2474057 2717187 2779304 2700454 2686429 2729379
24193B729379j10764p5476K33789R0058k09867l9043r915k2701j8573l9418J65616
$$ 2729379 2618615 2543139 2776928 2866986 2657119 2618076 2608161 2585460 2566887 2527469 2693085
24182B693085L32939J8883k53710j86924j68109j79366J66212n919n1179j8933
$$ 2693085 3026024 3044907 2791197 2604273 2436164 2256798 2423010 2417091 2365912 2346979
24172B346979J51625J33702K6851k3920J3244o461n6211L9615Q8698k9939N9850
$$ 2346979 2498604 2632306 2659157 2635237 2648481 2642020 2585809 2625424 2714122 2684183 2744033
24161B744033l486k0207q746J79798J45697J1018m8121R4779k32816j51850J42810
$$ 2744033 2740547 2720340 2711594 2891392 3037089 3048107 2999986 3094765 2861949 2710099 2852909
24150B852909P5952O1869l1578J08195j6226j40382O894L1570P2685k6711o5638
$$ 2852909 2928861 2990730 2959152 3067347 3051121 2910739 2917633 2949203 3021888 2995177 2929539
24139B929539L0943o1869j06129J96174K0412j24499L8488j38822j05963R3655
$$ 2929539 2960482 2898613 2792484 2988658 3009070 2884571 2923059 2784237 2678274 2771929
24129B771929K12020J70243M5903P8793j7507j18610j28164J07100J54289k8339
$$ 2771929 2983949 3154192 3200095 3278888 3261381 3142771 3014607 3121707 3275996 3247657
24119C247657k50337r2437J91824K19653O993J12659m649j10019k4415m6716R2433
$$ 3247657 2997320 2904883 3096707 3316360 3323353 3436012 3431363 3321344 3296929 3250213 3342646
24108C342646j1718o0355n4688K875O2641M4672j96162k4128K46683J03565k6589
$$ 3342646 3330928 3270573 3215885 3218760 3281401 3326073 3129911 3105783 3352466 3456031 3429442
24097C429442p1652k6447p3194K04168J78094M4877K8796j29191n8856j53063
$$ 3429442 3357790 3331343 3258149 3462317 3640411 3685288 3714084 3584893 3526037 3372974
24087C372974k0448J51996l9260n0194k1134L9334N8764J675O3240P2035l2769
$$ 3372974 3352526 3504522 3465262 3415068 3393934 3433268 3492032 3493707 3556947 3628982 3596213
24076C596213Q8240M960o5298j26729m6916J33958J47682L8146M5037R1598M8521
$$ 3596213 3684453 3689413 3624115 3497386 3450470 3584428 3732110 3770256 3815293 3906891 3955412
24065C955412n571j15539j03317M3168K24895j18618j59930J18q8506K9748K13274
$$ 3955412 3949841 3834302 3730985 3774153 3999048 3880430 3720500 3720618 3632112 3661860 3875134
24054C875134K8864p3245n3856M596j34451K1411K3723J44364J24770r0220J20132
$$ 3875134 3903998 3830753 3776897 3781493 3647042 3668453 3692176 3836540 3961310 3871090 3991222
24043C991222R0091K46734P118p4388P7481P3052M5737O3658J7204p8039m2189
$$ 3991222 4081313 4328047 4335165 4260777 4338258 4411310 4457047 4520705 4537909 4459870 4417681
24032D417681j58150m2132l56r6247K12792J8841j13023o485J71773p8526j53907
$$ 4417681 4259531 4217399 4217043 4120796 4333588 4352429 4239406 4232921 4404694 4326168 4172261
24021D172261q232J92817J01755J12108J02136r4700J3466l3168j88086n2987
$$ 4172261 4164029 4356846 4458601 4570709 4672845 4578145 4591611 4558443 4370357 4317370
24011D317370J88536j24919J17524J7958N6249j31494l6095O9746J8516J0413
$$ 4317370 4505906 4380987 4498511 4516469 4572718 4441224 4405129 4474875 4493391 4503804
24001D503804J62473J04245o2420R8735m2841j50858O0875L4893l3937j0613P3759
$$ 4503804 4666277 4770522 4708102 4806837 4763996 4613138 4674013 4708906 4674969 4664356 4738115
23990D738115K13306O0424j29343n0992J02073N9134Q5289J24517j75169o7299
$$ 4738115 4951421 5011845 4882502 4831510 4933583 4992717 5078006 5202523 5027354 4960055
23980D960055m3755P7393j0541Q798K14701l1146l3520J39424J03184Q6668J17430
$$ 4960055 4916300 4993693 4983152 4991950 5206651 5175505 5141985 5281409 5384593 5471261 5588691
23969E588691j24552j57887n3406J58234j18212j54791K1860Q2136m4747j197
$$ 5588691 5464139 5306252 5252846 5411080 5292868 5138077 5159937 5242073 5197326 5196129
23959E196129j20295O5084k9543o2179K42152L17667P0493K1980R6315J1989j76482
$$ 5196129 5075834 5140918 5111375 5049196 5291348 5609015 5679508 5701488 5797803 5809792 5633310
23948E633310q381J24242j54535j9930r8960j12710K29858K19238J27833K05145
$$ 5633310 5624929 5749171 5594636 5574706 5475746 5363036 5592894 5812132 5939965 6145110
23938F145110N3558j25905j20788q3121J8794k2550P6403L0597N014k1792J1119
$$ 6145110 6198668 6072763 5951975 5868854 5887648 5865098 5941501 5972098 5977112 5955320 5966439
23927E966439j10788N5125Q4768m0628L0537J66891J6971j35840j34983j9094
$$ 5966439 5855651 5910776 5995544 5954916 5985453 6152344 6169315 6033475 5898492 5879398
23917E879398J50809J80361R8606R8385R053j9483L0813P3134o099l9419J24564
$$ 5879398 6030207 6210568 6309174 6407559 6416612 6397129 6427942 6501076 6494977 6455558 6580122
23906F580122j8053J1775n9995R7986J01228P0149j66007L4183o9626j11992j81026
$$ 6580122 6562069 6573844 6513849 6611835 6713063 6783212 6617205 6651388 6581762 6469770 6288744
23895F288744M8849J74042O7676K6127j00812j58862M6526J06509N8773q290K5121
$$ 6288744 6337593 6511635 6579311 6605438 6504626 6345764 6392290 6498799 6557572 6549282 6574403
23884F574403L3192L2787R3506K84030J26051o2355j05543o6890J23960K38365
$$ 6574403 6607595 6640382 6733888 7017918 7143969 7081614 6976071 6909181 7033141 7271506
23874G271506K05826p6196k53729l5982L910j05798K16453Q7312j22549j6926
$$ 7271506 7477332 7401136 7147407 7111425 7115335 7009537 7225990 7313302 7190753 7173827
23864G173827J31138k8236q0461Q3830J36663R1869j08206p9187R4813P0538m1244
$$ 7173827 7304965 7276729 7196268 7280098 7416761 7508630 7400424 7321237 7416050 7486588 7445344
23853G445344j6550J04111M7464M1708R3190j06585j98797L2333q5334p965L9418
$$ 7445344 7428794 7532905 7580369 7622077 7715267 7608682 7409885 7442218 7356884 7348919 7388337
23842G388337P7081K22213J21961L5250J35316M4719Q1769j7965q6411J1852K5574
$$ 7388337 7465418 7687631 7809592 7844842 7980158 8024877 8106646 8088681 8002270 8014122 8039696
23831H039696k4395J04431m7664j20880p3763q7592O0664J26960o0071l2046l5713
$$ 8039696 8015301 8119732 8072068 7951188 7877425 7789833 7850497 7977457 7917386 7885340 7849627
23820G849627K5749J54488Q7609J49494K64469r2319j51677j17424L6136K34120
$$ 7849627 7875376 8029864 8117473 8266967 8531436 8439117 8287440 8170016 8206152 8440272
23810H440272J7006j13670j10935J26370P1024j08233j39671K96749J80594M4160
$$ 8440272 8457278 8343608 8232673 8359043 8430067 8321834 8182163 8478912 8659506 8703666
23800H703666Q1107k8849N2593M2636P055j04301M2237j9753m2601Q5930J25096
$$ 8703666 8784773 8755924 8808517 8851153 8858208 8753907 8796144 8776391 8733790 8819720 8944816
23789H944816M8052L9818Q3275j54762M4917l8579L1918p3955j42416K8704J35889
$$ 8944816 8992868 9032686 9115961 8961199 9006116 8967537 8999455 8925500 8783084 8811788 8947677
23778H947677R9049J37041J26667j13129j06289J67830J93019j41191M4603J11355
$$ 8947677 9046726 9183767 9310434 9197305 9091016 9258846 9451865 9310674 9355277 9466632
23768I466632j457l6825J46329j66308l0170j7492M7232J67459P8810q619N273
$$ 9466632 9465175 9428350 9574679 9408371 9378201 9360709 9407941 9575400 9654210 9645591 9650864
23757I650864m7473J09616J63142o4163k03882k6912J18424J4574P169J09044
$$ 9650864 9603391 9713007 9876149 9811986 9608104 9581192 9699616 9714190 9721359 9830403
23747I830403K2385R4389J11859R0707j38285o3330m5701j0437J34847j3960J0629
$$ 9830403 9852788 9947177 10059036 10149743 10011458 9948128 9902427 9891990 10026837 10012877 10023506
23736A0023506j1734J56536J23155j13696k29871O1045J00532j3665J4829J36433
$$ 10023506 10011772 10168308 10291463 10177767 9947896 10008941 10109473 10095808 10110637 10247070
23726A0247070J80002M583k18524o2307n2129k1118o2587l7949J59965K24760
$$ 10247070 10427072 10431655 10213131 10150824 10098695 10077577 10014990 9977041 10137006 10361766
23716A0361766P8798N0262J07452P8458l6138q8135j03191j54475k4335K2036
$$ 10361766 10440564 10490826 10598278 10676736 10640598 10552463 10449272 10294797 10270462 10292498
23706A0292498K0801R4717L3046j50256n2367J04588R7634O3963j19359J16097
$$ 10292498 10313299 10408016 10441062 10290806 10238439 10343027 10440661 10504624 10385265 10501362
23696A0501362Q7926j85936J28169N5412m1828l3909L2249J59812J69016l3783
$$ 10501362 10589288 10403352 10531521 10586933 10545105 10511196 10543445 10703257 10872273 10838490
23686A0838490P0079R8263N7062J0071n3013k10394p2896N3833L6310j12383J92812
$$ 10838490 10908569 11006832 11063894 11073965 11020952 10810558 10737662 10791495 10827805 10715422 10908234
23675A0908234j8386j39296j14516J64864J48497Q5636N8452j25394j22107Q467
$$ 10908234 10889848 10750552 10636036 10800900 10949397 11035033 11093485 10968091 10845984 10854451
23665A0854451J28736L0648k4826Q7975O4596l08246j97955M4262Q5577M4981
$$ 10854451 10983187 11013835 10989009 11076984 11141580 10833334 10635379 10679641 10765218 10810199
23655A0810199J47635k0368P8455J49313O223J47546R6743n5995j04455j14474
$$ 10810199 10957834 10937466 11015921 11165234 11171457 11319003 11415746 11359751 11255296 11140822
23645A1140822o0222R3106L2080j97347p1521J43282L1633p4416N2197P8561q48
$$ 11140822 11080600 11173706 11205786 11008439 10936918 11080200 11111833 11037417 11089614 11168175 11167327
23634A1167327L8670j19150n9998q9108K1952Q6643j5664p2161j8625J18974p0790
$$ 11167327 11205997 11086847 11026849 10937741 10959693 11046336 11030672 10958511 10939886 11058860 10988070
23623A0988070o6780m4716K8125K344o9139j50208J95727J12384o668o326P5232
$$ 10988070 10921290 10876574 10904699 10907043 10837904 10687696 10883423 10995807 10989139 10982813 11058045
23612A1058045J18856j56265k48943m6369j6431j6733J91081K38670J76959l1441
$$ 11058045 11176901 11020636 10771693 10725324 10708893 10692160 10883241 11121911 11298870 11267429
23602A1267429l45999J01747J45569j055L1365j40187N7763R6617j21475j59640
$$ 11267429 10921430 11023177 11168746 11167691 11199056 11058869 11116632 11213249 11091774 10932134
23592A0932134J17919J34777j03053k50772n9116L0257K21063r9647r345j7510
$$ 10932134 11050053 11184830 11081777 10831005 10771889 10802146 11023209 10923562 10914217 10896707
23582A0896707p4734J544r1486r8034R0495j720j86066m6476J92806L3363N6325
$$ 10896707 10821973 10823517 10732031 10633997 10724492 10722772 10536706 10490230 10683036 10716399 10772724
23571A0772724J14245j7182j26098q2526j0407j8206Q6776j1690k9658k0233j0972
$$ 10772724 10886969 10869787 10743689 10661163 10650756 10632550 10719326 10707636 10677978 10657745 10646773
23560A0646773j26794j47719K07817K17858k1331M2601R4495o8800n4168l30894
$$ 10646773 10519979 10372260 10580077 10797935 10776604 10819205 10913700 10844900 10790732 10459838
23550A0459838q1370J92432N1072L1251j10618j99042n4527M0120j03850J27470
$$ 10459838 10378468 10570900 10621972 10653223 10542605 10343563 10289036 10329156 10225306 10352776
23540A0352776K3485K078r8208O5167M8737r7391k4188k27147p8091O8670J59538
$$ 10352776 10376261 10378339 10280131 10345298 10394035 10296644 10272456 10045309 9967218 10035888 10195426
23529A0195426N4946N1048O5449M911q0706l00756j92402P6185o163N81J16859
$$ 10195426 10250372 10301420 10366869 10371780 10291074 9990318 9797916 9874101 9867938 9868519 9985378
23518I985378J9736L8413j91420j63416L6433j16187j74792K56211K70235k9887
$$ 9985378 10005114 10043527 9852107 9688691 9725124 9608937 9434145 9690356 9960591 9930704
23508I930704j03947K3211O4077Q7695L610j20282k12362m0538K319j55902P946
$$ 9930704 9826757 9849968 9914045 10001740 10005350 9885068 9672706 9632168 9634487 9478585 9486531
23497I486531J01951j8402j15383m4856P0497Q2762n839k24077n1728L5142m4727
$$ 9486531 9588482 9570080 9454697 9409841 9480338 9563100 9557261 9333184 9281456 9316598 9271871
23486I271871K6328Q001J58709q065k3699L7012j38116K3720p5642k24101q5870
$$ 9271871 9298199 9306200 9464909 9456844 9433145 9470157 9332041 9355761 9280119 9056018 8970148
23475H970148O0197r9195O8341M9310p476N4065O5991o0633m7946q8959p3579
$$ 8970148 9030345 8931150 8999491 9048801 9041325 9095390 9161381 9100748 9052802 8963843 8890264
23464H890264Q4291L38984P343j69405k88942m766J6024O0894m8541O6380N8965
$$ 8890264 8974555 9313539 9320882 9151477 8862535 8857769 8873793 8934687 8886146 8952526 9011491
23453I011491r7410k57284n8639q8394K1271J09041j92613j64709O933Q3797J61235
$$ 9011491 8914081 8656797 8598158 8509764 8531035 8640076 8447463 8282754 8289687 8373484 8534719
23442H534719J44193q5499n6218L3085q3424j77382p90j17682q7857j3487M0782
$$ 8534719 8678912 8593413 8537195 8570280 8486856 8309474 8308684 8191002 8103145 8089658 8130440
23431H130440j11282j35020m3496J46487J77210p9595r6177L569J63872M1379
$$ 8130440 8019158 7884138 7840642 7987129 8164339 8084744 7988567 7992136 8156008 8197387
23421H197387j2441j47123j38559Q9314l6359j50l2899j56762j27643n0750k07526
$$ 8197387 8184946 8037823 7899264 7988578 7952219 7952069 7919170 7762408 7634765 7584015 7376489
23410G376489Q0186K72606J36437n6995q1641M768j08573r3179j86533J0324L7169
$$ 7376489 7456675 7729281 7865718 7808723 7727082 7731850 7623277 7530098 7343565 7353889 7391058
23399G391058k8367o6805Q6232R5886Q9593q2882j10937J9802q4242j28980q822
$$ 7391058 7362691 7295886 7382118 7478004 7567597 7484715 7373778 7393580 7309338 7180358 7171536
23388G171536R3383r5199j5866J05014M2983q7837j01638k25438O2833J71262
$$ 7171536 7264919 7169720 7153854 7258868 7301851 7214014 7112376 6886938 6949771 7121033
23378G121033J83696M1420j80054k4853J10602j5111j4190j58418j47705l20677
$$ 7121033 7304729 7346149 7166095 7141242 7251844 7236733 7222543 7064125 6916420 6595743
23368F595743J70129J21029O099R0897J94726K8847j34597j44800r753N9428j59
$$ 6595743 6765872 6886901 6893000 6983897 7178623 7207470 7072873 6928073 6918320 6977748 6977589
23357F977589j45269j29098k2459J59345l8370l01715j546K8523j29854Q0847
$$ 6977589 6832320 6703222 6680763 6840108 6801738 6500023 6498477 6527000 6397146 6477993
23347F477993k0533m5819j8939l2948M5539J33110Q5536o871j10578j83495j18639
$$ 6477993 6457460 6411641 6392702 6359754 6405293 6538403 6623939 6617068 6506490 6322995 6204356
23336F204356J95037l5702k5172j8318n0030m6037j47790n3035Q1658M5548R3279
$$ 6204356 6399393 6363691 6338519 6320201 6270171 6224134 6076344 6023309 6104967 6150515 6243794
23325F243794j3216m6775K21167m4110j70020k02978R30p6068o3948p5048p4236
$$ 6243794 6230578 6183803 6404970 6360860 6190840 5987862 5988792 5912724 5848776 5773728 5699492
23314E699492N323J43895r5153k6771j34607n6037K0532R7035j33837j01194Q0612
$$ 5699492 5704815 5848710 5753557 5726786 5592179 5536142 5556674 5653709 5519872 5418678 5499290
23303E499290q2595P4819k0529j36425R9506K06981J5684j80478l766p0485j00983
$$ 5499290 5416695 5491514 5470985 5334560 5434066 5641047 5656731 5476253 5472487 5402002 5301019
23292E301019J04843j5726L3020q2351n400J5033R559P6219Q7569k55751P943
$$ 5301019 5405862 5390136 5423156 5340805 5335405 5350438 5359997 5436216 5523785 5268034 5275977
23281E275977Q0572M8036J06811j30224K1632q0502l4371Q0504k00349k04044
$$ 5275977 5356549 5404585 5511396 5381172 5402804 5322302 5287931 5368435 5168086 4964042
23271D964042K7829L2498O9497l9471m7896Q9189K2607J12937J04820l0444q9628
$$ 4964042 4991871 5024369 5093866 5054395 5006499 5095688 5118295 5231232 5336052 5305608 5215980
23260E215980k16294q8840k4466j3031J07310N5422j68523o8315r189P2915r0750
$$ 5215980 4999686 4910846 4886380 4873349 4980659 5036081 4867558 4799243 4790054 4862969 4772219
23249D772219Q2460N1J1100n0190O7881R0461N9200J173r1640j39324r3824J30824
$$ 4772219 4854679 4854730 4865830 4815640 4883521 4973982 5033182 5034355 4942715 4803391 4709567 4840391
23237D840391r323j86898J005m4700m1479k5590J0787J8048k14303q9192J54587
$$ 4840391 4831068 4644170 4645175 4600475 4558996 4533406 4544193 4562241 4347938 4258746 4413333
23226D413333k0819j55361R50J34077K26195j00008n3466j36068N5414k6685L3864
$$ 4413333 4392514 4237153 4238103 4372180 4598375 4498367 4444901 4308833 4364247 4337562 4371426
23215D371426P1412P6450m9629j49250j10608m5073Q7175K59200O4376n4597j01929
$$ 4371426 4442838 4519288 4469659 4320409 4209801 4164728 4251903 4511103 4575479 4520882 4418953
23204D418953n752j00421J20087J00716j93169j30479j60160J13079j02748q3708
$$ 4418953 4413201 4312780 4432867 4533583 4340414 4209935 4049775 4162854 4060106 3976398
23194C976398j59431j1033J26855N605J7242N5209J14397o8995k02428j13314
$$ 3976398 3816967 3805934 3932789 3938394 3955636 4010845 4125242 4056247 3853819 3740505
23184C740505K27361K06065Q4746r7863j52730J9086J45718j15791j96435q7239
$$ 3740505 3967866 4173931 4258677 4160814 4008084 4027170 4172888 4057097 3860662 3773423
23174C773423q8915j20329j06698q1050J11508R0130M0623J87610Q9679p6267
$$ 3773423 3684508 3564179 3457481 3376431 3487939 3578069 3618692 3806302 3895981 3819714
23164C819714p1622j6423o0527P7431J95333p1922o383J57511m0733k26298k1268
$$ 3819714 3748092 3731669 3671142 3748573 3943906 3871984 3865601 4023112 3982379 3756081 3734813
23153C734813j15053K3107K1022P0898Q9066j3655j53693N1152Q4384n201m5810
$$ 3734813 3619760 3642867 3663889 3734787 3823853 3810198 3656505 3707657 3792041 3786840 3741030
23142C741030m0539j03773j45496j09044j1847o5328j5147M9040j06598O1081
$$ 3741030 3700491 3596718 3451222 3342178 3330331 3265003 3249856 3298896 3192298 3253379
23132C253379P5953K6794m4050j27896N485J16820O1795n190J09163n8528N6729
$$ 3253379 3329332 3356126 3312076 3184180 3189665 3306485 3368280 3363090 3472253 3413725 3470454
23121C470454o3459j94227O0867R3472J37530K8272q9935n7332r95L409k85111
$$ 3470454 3406995 3212768 3273635 3367107 3504637 3532909 3442974 3385642 3384647 3388056 3102945
23110C102945P8824J56244J78160L7653k6698k13293k7458M9510p9260q5202p5572
$$ 3102945 3181769 3338013 3516173 3553826 3527128 3313835 3286377 3335887 3256627 3171425 3095853
23099C095853K30159l4114p9351O3106p9917j35619P9959O0412o4849j73050r1445
$$ 3095853 3326012 3291898 3212547 3275653 3195736 3060117 3140076 3200488 3135639 2962589 2871144
23088B871144Q0079J51618j40229k78287R5587J25575Q0810K0284r5623j65994
$$ 2871144 2951223 3102841 2962612 2684325 2779912 2905487 2986297 3006581 2910958 2744964
23078B744964r185J61122K8473J03726J3101R6876J29541j02584k32406j47285
$$ 2744964 2735779 2896901 2925374 3029100 3042201 3139077 3268618 3166034 2933628 2786343
23068B786343J88993J13643m3800l0758M7107p0178j43825j74828j09819j5150
$$ 2786343 2975336 3088979 3045179 3014421 3061528 2991350 2847525 2672697 2562878 2547728
23058B547728Q6648J47477j2352K33681K283j23138r3473j47320Q0500k1300m4444
$$ 2547728 2634376 2781853 2769501 3003182 3005465 2882327 2788854 2641534 2722034 2700734 2656290
23047B656290K0734L3949o8561l7345J2757o8604R168R1662R31J67964J3674R6804
$$ 2656290 2677024 2710973 2642412 2605067 2617824 2549220 2558388 2650050 2650981 2818945 2832619 2929423
23035B929423k15211n9465j52715j02924J31586J02364N4320j40408j90106J37234
$$ 2929423 2714212 2654747 2502032 2399108 2530694 2633058 2687378 2546970 2356864 2494098
23025B494098j73639R5630J90708J7977o1037q3359R7269M2371j62251o028n0117
$$ 2494098 2320459 2416089 2606797 2624774 2563737 2480378 2577647 2620018 2457767 2451739 2401622
23014B401622O4166p1762N2420K68012k5672q7568k23653K574j12542N4736J15620
$$ 2401622 2465788 2394026 2446446 2714458 2688786 2601218 2377565 2380139 2267597 2322333 2437953
23003B437953J3023j00222l5975k6841j7334K39939Q1562j19995p9623l0977j12891
$$ 2437953 2450976 2350754 2314779 2287938 2270604 2510543 2592105 2472110 2392487 2361510 2248619
22992B248619m3635O8082N6241J21018r8122j00528m3360l7647J9348j9255r3651
$$ 2248619 2204984 2273066 2329307 2450325 2352203 2251675 2208315 2170668 2190016 2170761 2077110
22981B077110m6378K11306m4497k10444j42317P1946J38682J39212k749J67315
$$ 2077110 2030732 2242038 2197541 1987097 1844780 1916726 2055408 2194620 2191871 2359186
22971B359186J8164p872K1720n1995j69998N1281k7489k93133Q0463j35J01721
$$ 2359186 2377350 2369478 2391198 2339203 2169205 2220486 2192997 1899864 1980327 1980192 2081913
22960B081913N61N9176K75377o9331j86770k7088J17992p2859J26724P5499K277
$$ 2081913 2082474 2141650 2417027 2347696 2160926 2133838 2251830 2178971 2305695 2381194 2383471
22949B383471k13632m7498k30142j96046L843K3039R4328O6249N6269J04098j46864
$$ 2383471 2169839 2122341 1892199 1696153 1699996 1723035 1817363 1883612 1939881 2043979 1897115
22938A897115n9153q1973m200K12922P0562l8538J41755N5911Q7619O7559j68733
$$ 1897115 1837962 1755989 1751789 1964711 2035273 1996735 2138490 2194401 2282020 2349579 2180846
22927B180846J06422K52875r1567K6172j60279k04693j48500r4600p4013Q052
$$ 2180846 2287268 2540143 2448576 2474748 2314469 2109776 1961276 1866676 1792663 1800715
22917A800715O2029J22800n4581p2776M9862K24828r8747q6542l3069N0684j16305
$$ 1800715 1862744 1985544 1930963 1858187 1908049 2132877 2034130 1947588 1914519 1965203 1848898
22906A848898K5406J90265M2212q3276l2514j15117N394n1188o4879P6443K65288
$$ 1848898 1874304 2064569 2106781 2023505 1990991 1875874 1881268 1830080 1765201 1841644 2106932
22895B106932o4509K5617P4161O9862K5908n4981j24975j65473N0240o0746o5211
$$ 2106932 2042423 2068040 2142201 2212063 2237971 2182990 2058015 1892542 1942782 1882036 1816825
22884A816825m6524L0701L4712o9653j77264j68982J13060J04034J06053m9699
$$ 1816825 1770301 1801002 1835714 1766061 1588797 1419815 1532875 1636909 1742962 1693263
22874A693263Q282J77671L463j49860M797m9768o7027P5421K36495k4884p6118
$$ 1693263 1701545 1879216 1882679 1732819 1737616 1687848 1620821 1696242 1932737 1907853 1831735
22863A831735j22953J15754J88566j38326n720j81593j56469p7217J73727K1598
$$ 1831735 1708782 1824536 2013102 1874776 1869056 1687463 1530994 1453777 1627504 1649102
22853A649102K1477o2725q9531o7587K0445J15689J35210r4961k2533p2496p2654
$$ 1649102 1670579 1607854 1518323 1450736 1471181 1586870 1722080 1627119 1604586 1532090 1459436
22842A459436m3122k7803j79523J12133J25903J20862J31709p6631J14176L4266
$$ 1459436 1416314 1388511 1208988 1321121 1447024 1567886 1699595 1622964 1737140 1771406
22832A771406o0940m9792J1614J19306J04725j52054j86597q5094R7373Q1085
$$ 1771406 1710466 1660674 1672288 1791594 1896319 1744265 1557668 1472574 1569947 1651032
22822A651032j76677j72738K08064J02201k42093j55299M3619N7469j3150P057
$$ 1651032 1474355 1301617 1509681 1611882 1369789 1214490 1258109 1315578 1302428 1309485
22812A309485p8488o3501J13120R4418L8559P7057L5974J5953J70007R5035L0295
$$ 1309485 1230997 1167496 1280616 1375034 1413593 1490650 1526624 1542577 1712584 1807619 1837914
22801A837914j78178j89403j90843Q0625J31007Q381n3200J39817K9184k9532
$$ 1837914 1659736 1470333 1279490 1360115 1491122 1499503 1446303 1586120 1615304 1585772
22791A585772K311J10237l0323n8314J21345n2351p3488J7644k9851j45128o6440
$$ 1585772 1588083 1698320 1667997 1609683 1731028 1678677 1605189 1622833 1592982 1447854 1381414
22780A381414M9907J2750J35127J15504p3856J837p0708j02097r0109P8980j1459
$$ 1381414 1431321 1444071 1579198 1694702 1620846 1622683 1551975 1449878 1359769 1438749 1427290
22769A427290K5913j11696j58619j8284O5294L5073J12668o0470J35024n7178
$$ 1427290 1453203 1341507 1182888 1164604 1229898 1264971 1377639 1317169 1452193 1395015
22759A395015R1309J54057k46651p6347R457L8873m370Q8912o4913M6752q0459
$$ 1395015 1486324 1640381 1393730 1317383 1326840 1365713 1361343 1450255 1385342 1432094 1351635
22748A351635p3000j9476j22620K8544J11653j5832j61387J27091R273J7253o5365
$$ 1351635 1278635 1259159 1136539 1165083 1276736 1260904 1099517 1226608 1235881 1253134 1187769
22737A187769l6229K1770J63O062Q23j33693j2172J71542Q5865M7734R6413r5015
$$ 1187769 1151540 1173310 1173473 1179535 1180358 1046665 1034493 1206035 1291900 1339634 1436047 1341032
22725A341032j1640R5883M3510j02433k5308n2075n2412o0576J39785K35604k9080
$$ 1341032 1329392 1425275 1468785 1366352 1341044 1288969 1236557 1175981 1315766 1551370 1522290
22714A522290k5775J81451j71990p7106O1220j47362K913J8993L5089R7324J35036
$$ 1522290 1496515 1677966 1505976 1428870 1490090 1342728 1345641 1364634 1399723 1497047 1632083
22703A632083K1326j26224j2078o7805o0736p9290M7641p8603p5302o3944J47611
$$ 1632083 1653409 1527185 1515107 1447302 1386566 1307276 1354917 1276314 1201012 1137068 1284679
22692A284679j04968j58613o7574J89925J61453M5120l4499p4216l7180o883l599
$$ 1284679 1179711 1021098 953524 1143449 1304902 1350022 1315523 1241307 1204127 1197244 1193645
22681A193645n2271M7443l2507J19864K10379n4948j36450r2010M5516m4823J6671
$$ 1193645 1141374 1188817 1156310 1276174 1486553 1431605 1295155 1203145 1248661 1203838 1220509
22670A220509J7292j7762N121k35412j37754P0621K48159M6641Q182K05464o0726
$$ 1220509 1237801 1220039 1225160 989748 851994 922615 1170774 1217415 1225597 1431061 1370335
22659A370335j90035j53028J26091j14494L1209K09503J92184j83129l61520q4036
$$ 1370335 1180300 1027272 1153363 1038869 1070078 1279581 1471765 1288636 927116 843080
22649H43080R4125R3820q6431l4672N0454J40871J43721J07092j61490o1469L1236
$$ 843080 937205 1031025 944594 909922 960376 1101247 1244968 1352060 1190570 1129101 1160337
22638A160337j76880j82536K63Q1293J25809J54470k06137j20736P8414J38660
$$ 1160337 983457 800921 801184 882477 1008286 1162756 956619 835883 914297 1052957
22628A052957J09014j7763j08061j24988p7970M5855L210J2501P606O6193J79866
$$ 1052957 1161971 1144208 1036147 911159 833189 879044 882254 894755 902361 968554 1148420
22617A148420J9072j06305j64656M4554N5383P1956L4505n880q1926j8384L8273
$$ 1148420 1167492 1061187 896531 941085 996468 1068424 1102929 1097049 1015123 996739 1035012
22606A035012n7088J34124l6131j27405k2709n767l250o6572o6989j44076J3758
$$ 1035012 977924 1112048 1075917 948512 925803 920036 916786 850214 783225 639149 652907
22595F52907P4767O5547r3439L5271J26433K66644J8306m9008J26593r1633r7631
$$ 652907 727674 793221 699782 735053 861486 1128130 1146436 1097428 1224021 1132388 1034757
22584A034757J01043j42828j08114k7288Q1195J43800O4786J2620p9736O840m5865
$$ 1034757 1135800 992972 884858 857570 938765 1082565 1147351 1159971 1080235 1087075 1041210
22573A041210R7798r9182k0719j55769n9999J40793m4186o1030O5714M3141r4087
$$ 1041210 1139008 1039826 1019107 863338 803339 944132 899946 838916 904630 947771 853684
22562H53684m2692J2200l6425J19206p0297j15600o8003j86923J22134J72829
$$ 853684 810992 823192 786767 905973 835676 720076 652073 465150 587284 760113
22552G60113j3534K954K50919m7276j95592J9802j3150j6862j9743J41393J9557
$$ 760113 746579 749533 1000452 953176 757584 777386 764236 747374 727631 869024 888581
22541H88581N5107O285N747L9462J09321N8094p5545j09961m0100j75602q3657
$$ 888581 943688 949973 955720 995182 1104503 1162597 1087052 977091 936991 761389 677732
22530F77732J27623J22547l6634j55010j0945O7975R6799j28508L9008m0452q4917
$$ 677732 805355 927902 891268 736258 725313 793288 890087 761579 800587 760135 675218
22519F75218R2099p2897p2499j27M669j06589J68434n7303j71209k8004M4686
$$ 675218 767317 694420 621921 621794 626463 519874 688308 631005 459796 431792 476478
22508D76478P0728L2158m8046K06988n2100o9259K9177N5974o5470p2091N0631
$$ 476478 547206 579364 531318 738306 686206 616947 646124 702098 636628 564537 615168
22497F15168n0947J5067L8987J09733J25319K72274Q9688j34174l17737m4026
$$ 615168 564221 579288 618275 728008 853327 1125601 1215289 1081115 763378 719352
22487G19352k4271j38958J11540l4463O2751m9312l2708j5263J56104J07460J0290
$$ 719352 695081 556123 667663 633200 695951 646639 613931 598668 754772 862232 872522
22476H72522N6761J7633N4401M1546j71599j95600m2110K39497Q3424k6888j28064
$$ 872522 929283 946916 1001317 1042863 871264 675664 633554 873051 956475 929587 801523
22465H01523j66557J3442r7559J8521Q2228J10018L2155Q1307n9236j38481N0977
$$ 801523 634966 648408 550849 569370 651598 761616 793771 875078 815842 677361 728338
22454G28338J17415k3588j292j67503j48457J44880J13752K5401J42066Q2797
$$ 728338 845753 822165 820873 653370 504913 649793 763545 788946 931012 1013809
22444A013809j72206o4419p3186k12326L5921k8039K8662O4722J35968N9031j88312
$$ 1013809 841603 777184 703998 491672 527593 499554 528216 592938 728906 787937 599625
22433E99625j66640k2191P0573R7577J55849L237M9696L1807p3265q1260J58741
$$ 599625 432985 410794 481367 578944 734793 738030 787726 819533 746268 665008 823749
22422H23749N2694j49105j30750O4009n4374j8928Q6416P7821l5774j63125l9011
$$ 823749 876443 727338 596588 660597 606223 587295 673711 751532 715758 552633 513622
22411E13622P2916P7957J14448j07603q2370L4017K13886M3483k41389Q736K15045
$$ 513622 586538 664495 778943 671340 588970 622987 836873 880356 638967 647703 862748
22400H62748j1890j92723j6355M4635N8236m1912M6913m7478j16567Q5273J29468
$$ 862748 850858 658135 641780 686415 744651 702739 749652 702174 585607 670880 800348
22389H00348P531q3900J5076l7745r805l9571q2595q803L4959L2295j0883j4727
$$ 800348 807879 723979 739055 701310 691505 651934 569339 560536 595495 627790 616907 602180
22377F02180R3650N3976j1689o4697L5515o4316k19903J45596K00837k3479j83119
$$ 602180 695830 749806 738117 673420 708935 644619 424716 570312 771149 747670 564551
22366E64551Q1931o896j63737m8299n8689R8220L0977L0842J09527j4913J36561
$$ 564551 646482 639586 475849 427550 368861 467081 498058 528900 638427 623514 760075
22355G60075r2605j38322j6001r7209q4828K4598J13036o618r2272R199n083k9818
$$ 760075 667470 529148 513147 415938 331110 355708 468744 462126 369854 379053 373970 344152
22343C44152p9536Q4786K27908J16381q0046K9883o1767j52229J32812N491q4283
$$ 344152 264616 349402 577310 693691 613645 643528 581761 429532 562344 567835 483552
22332D83552l0857l2931J22040O7761j36295M4187n4191q9934J0771O7911O6401
$$ 483552 452695 419764 541804 609565 473270 517457 463266 373332 384103 452014 518415
22321E18415L4833K2155L74N722j7564K7098j60182M1402J0390p9622K7292P1459
$$ 518415 553248 575403 575777 581499 563935 591033 430851 472253 482643 403021 430313 501772
22309E01772O6165m4528r7143j4596O600j35292K3486J35935J66272K12943R3325
$$ 501772 567937 523409 426266 411670 418270 282978 306464 442399 608671 821614 914939
22298I14939j39540j87783q9833j79334o3934O9845K1532j24505O1287K23536
$$ 914939 775399 587616 497783 318449 254515 324360 345892 221387 282674 506210
22288E06210M4103o765J5626J09075j4358j12679m7542J14679K8361j19312O6595
$$ 506210 550313 543548 559174 668249 653891 541212 493670 608349 636710 517398 583993
22277E83993N1253K6298m0846N3377p5499j47584Q7599o5705q7426l7285j65063
$$ 583993 635246 661544 620698 674075 598576 450992 538591 472886 385460 348175 183112
22266A83112N5065J78137P2179N238k442J31549J19846J30312k57754j44191J24639
$$ 183112 238177 416314 488493 493731 491289 622838 742684 872996 615242 471051 595690
22255E95690J57112k2655M1248m6465j43790j97659j08096J45092O211l9861O4561
$$ 595690 752802 730147 771395 724930 581140 383481 275385 420477 426688 386827 451388
22244D51388o5481J88713k6241J07834P3098p2811j78094m2311J43944j00730
$$ 451388 385907 574620 548379 656213 729311 656500 478406 436095 580039 479309
22234D79309m67N7748p0204J21800L1662l3058Q4379l1614o38p7400p0915l5642
$$ 479309 478842 536590 466386 588186 619848 586790 671169 639555 638917 561517 490602 454960
22222D54960R5728j08319j86555o7050J6582L3812J06465N753n8085M1854r7507
$$ 454960 550688 442369 255814 188764 205346 239158 345623 351376 293291 335145 237638
22211B37638n9483M157J05637J72227m1419k5809m6317j72695n1364K33208J09778
$$ 237638 178155 182312 287949 460176 418757 392948 346631 173936 122572 355780 465558
22200D65558P8969j54635j59183o5586P7677K30963J79152o5664j11184j41730
$$ 465558 544527 389892 230709 165123 242800 473763 652915 587251 476067 334337
22190C34337m9002J58980L03j265m0623p1689l5908j0783L0900K1095j18851M758
$$ 334337 285335 444315 444618 443353 402730 331041 295133 284350 315250 336345 217494 222252
22178B22252j8538R9384M1329n959K1582J10249n1502k2267N1849Q8041k4979
$$ 222252 203714 303098 344427 338468 360050 470299 418797 396530 448379 536420 511441
22167E11441j68816j02293J38177J30928l2387j38107o09m3414J15650L5286r1460
$$ 511441 342625 240332 378509 509437 477050 338943 338334 294920 410570 445856 354396
22156C54396J2982J40063n5076o2892j68922K9187R0169Q0636K8685k1551j16143
$$ 354396 367378 507441 452365 389473 220551 249738 339907 420543 449228 427677 311534
22145C11534j1992J8791p4978N196m6939j43723R4278O9083P241J65082j1969
$$ 311534 299542 318333 243355 248551 201612 57889 152167 221250 228491 393573 381604
22134C81604j96641J09409j4780o4755J08746J55264r0205M1804j9715j73967
$$ 381604 184963 294372 279592 214837 323583 478847 388642 430446 410731 236764
22124B36764M0349J91352J11791r5817j40364j34451O854K95K7715J49628N0655
$$ 236764 277113 468465 580256 484439 344075 209624 216478 216773 244488 394116 444771
22113D44771P9092N1981j4548o9195p4487j5226j21180q4820J477P7981O0749
$$ 444771 523863 575844 561296 492101 417614 402388 281208 196388 197865 275846 336595
22102C36595j05352k2761j09117j04255J29072J30757J00123J04101n8128j55943
$$ 336595 231243 208482 99365 -4890 124182 254939 355062 459163 401035 245092
22092B45092J3080K9830R1834O9244L019N4283n4102l8973J20008k6982j02049
$$ 245092 258172 288002 379836 449080 452099 506382 452280 413307 533315 506333 404284
22081D04284j8152K0766j01272N6489m5790j04691K7868N2069L5762q859q877
$$ 404284 386132 406898 305626 362115 316325 211634 239502 291571 327333 318474 309597
22070C09597P4334j52691j7249Q8847J48507K31623j22901n5241P7398j50663
$$ 309597 383931 231240 213991 302838 451345 682968 560067 504826 582224 431561
22060D31561m3315M7655j5460j05102J4075J30594P7057j50742k18052o0243K3683
$$ 431561 388246 435901 420441 315339 329414 460008 537065 386323 168271 108028 131711
22049A31711J03971M4635k3125K0293J3389M9306J848J5590k39666j77547r3085
$$ 131711 235682 280317 257192 277485 290874 340180 342028 357618 117952 -59595 -152680
22038a52680J84195J73229J41223L8345L2750J44982j25495j48057O201m2602
$$ -152680 31515 204744 345967 384312 417062 562044 436549 288492 294693 252091
22028B52091o0227l4388P7335J63991J757J4755r5698j45992p0984l8039q7226
$$ 252091 191864 157476 234811 398802 400559 415314 319616 173624 102640 64601 -22625
22017b2625m9406k6904J00775J57629K10137R7520q1772j17690j31571j04148
$$ -22625 -72031 -98935 1840 159469 369606 467126 385354 267664 136093 31945
22007C1945R1847L6661J86491r108m5679N6358K5459l7399j14215P8501j8251
$$ 31945 123792 160453 346944 337836 292157 348515 373974 336575 222360 300861 282610
21996B82610k7082J08234J39555M847K0092k22130j40627M464O303P614m995o9940
$$ 282610 255528 363762 503317 508164 528256 306126 165499 169963 176266 183880 178885 108945
21984A08945q3267K19984J81959j25858j68077l6902Q7499m4336N1599j45202
$$ 108945 25678 245662 427621 301763 133686 96784 184283 139947 191546 46344
21974D6344J22660K6872j48018J41281P6156p377N321j05180L631r6307Q9226
$$ 46344 169004 195876 47858 189139 265295 257918 263239 158059 161690 65383 154609
21963A54609L9853N7892J5324j33145j0206J45370P2195k0850K475J28847J5940
$$ 154609 194462 252354 267678 134533 124327 269697 341892 321042 323517 452364 468304
21952D68304L1199m3140j30830j29619L8154l4028l8016Q269k02440J97909J34560
$$ 468304 499503 456363 325533 195914 234068 200040 162024 170293 -32147 165762 300322
21941C00322M9493N7863M9023K9873j33045j12907n3695j52564j03165j358K40235
$$ 300322 349815 407678 456701 486574 353529 240622 186927 34363 -68802 -70160 170075
21930A70075J30216m8885j04439m1521O4573Q1018j23920J28434K7516r8485p3623
$$ 170075 300291 251406 146967 105446 170019 251037 127117 255551 283067 184582 110959
21919A10959j02194m2748K5286j0355p141O6753j74980J48144K580K08534J20272
$$ 110959 8765 -33983 -8697 -19052 -26193 40560 -134420 13724 16304 224838 345110
21908C45110L6430j33181j75581j37956J6447m124J14639O6545j72585J46320
$$ 345110 381540 248359 72778 -65178 -48731 -52855 61784 128329 -44256 102064
21898A02064J0269K6022R2876K319K7858J43002j9760j5904o7039j21806L2447
$$ 102064 112333 138355 231231 233550 261408 404410 384650 368746 301707 179901 212348
21887B12348k0581o4853k3399j12566j1256J11331J01555L2944Q0952n7384j25337
$$ 212348 191767 126914 103515 -9051 -20307 91024 192579 225523 306475 249091 123754
21876A23754O8355J00341L9447n2569J14795j47358j36268K3691j15472J9631
$$ 123754 192109 292450 331897 279328 394123 246765 110497 134188 18716 38347
21866C8347J8985P7150m4070J33537r265m9561j87469o4059j47583J12833J56395
$$ 38347 57332 134482 90412 223949 214684 165123 -22346 -86405 -233988 -121155 35240
21855C5240J7153J05673o5882M3060J59350r3561j11252p4570q239K0987P3177
$$ 35240 52393 158066 92184 135244 294594 201033 89781 15211 6972 27959 101136
21844A01136o0771o7909J47087J26372j26529q9209L1068N853J96083J33244M7723
$$ 101136 40365 -27544 119543 245915 119386 30177 61245 67098 263181 396425 444148
21833D44148k51409k15286Q0768J69960J43698M5137k81077j77603j29750L5365
$$ 444148 192739 -22547 58221 228181 371879 417016 135939 -41664 -171414 -136049
21823a36049R2291J22514j9749M0600o372m8061J333K02585O3550j80359k71678
$$ -136049 -43758 78756 59007 99607 93235 45174 46507 249092 312642 132283 -139395
21812a39395l3029M2726J01883M9491O854k5456L6890N5628J75958m4595O1994
$$ -139395 -172424 -129698 -27815 21676 28530 3074 39964 95592 271550 226955 288949
21801B88949n9243k5194Q93j7725N9751m6028O7304Q1733M3427N7361M0629j24214
$$ 288949 229706 204512 205405 187680 247431 201403 268707 350440 393867 451228 491857 367643
21789C67643n1270J75948O8568p3018l7883L4622m0715j69961j4275P3536M751
$$ 367643 316373 492321 560889 487871 449988 484610 443895 273934 259659 333195 337946
21778C37946j49281O6424m7184K3950L9874k4402n8030j22905Q2052j05137j64940
$$ 337946 188665 255089 207905 231855 271729 247327 189297 66392 148444 43307 -121633
21767a21633K0604P7157J61084R6898j08775o5048n9065j82205o794k8784J52309
$$ -121633 -101029 -23872 137212 234110 125335 60287 1222 -180983 -187777 -216561 -64252
21756f4252L23712M3093q0505P2605n8051P6290J10260n087j20286j6629J56135
$$ -64252 259460 302553 222048 294653 236602 312892 423152 418065 297779 281150 437285
21745D37285q677k29478k07708P1930l6362j0122j2022J23035L6478J1782j5906
$$ 437285 428608 199130 -8578 63352 26990 16868 4846 127881 164359 176141 160235
21734A60235J11945k7922L3149L9785l8647j67523p1770M3372k0044r0060J04
$$ 160235 272180 244258 277407 317192 278545 111022 39252 82624 62580 -27480 -27376
21723b7376J66686O210K5396r1864K7105p398K36618k8165J75296q5983k13137
$$ -27376 139310 145520 170916 79052 106157 98759 335377 307212 482508 396525 183388
21712A83388m6902j68603o6846J23543Q7150N5393k9600K4472m4579n7038p3196
$$ 183388 136486 -32117 -98963 24580 111730 167123 137523 161995 117416 60378 -12818
21701a2818j22217N3800J03643j8160P7290J35386r7942k39436J8741Q9414J22643
$$ -12818 -135035 -81235 22408 4248 81538 216924 118982 -120454 -101713 -12299 110344
21690A10344M3025r1310J33815J9750m0738O5641N7405j45521O6861l2971j3304
$$ 110344 153369 62059 195874 215624 174886 240527 297932 152411 219272 186301 172997
21679A72997J05357O1522p600j11783j25585j68945Q1276j9168j3540N3380J17886
$$ 172997 278354 339876 332276 220493 94908 -74037 7239 -11929 -25469 27911 145797
21668A45797j06624k14585O4036R9179K4333O7461l8686j02684J5710J34170j04891
$$ 145797 39173 -175412 -111376 -12197 12136 79597 40911 -61773 -46063 88107 -16784
21657a6784K06207k9130j13470J01953J32243n3992j02293M9867j0994k45541
$$ -16784 189423 160293 46823 148776 281019 227027 124734 174601 163607 -81934
21647h1934o9031L4632p64R6675P7636O3943K17271o1015k31867O1670j0228K8143
$$ -81934 -150965 -116333 -117097 -20422 57214 121157 338428 277413 45546 107216 96988 125131
21635A25131q1186J49710J66761q2610o0012n9260p1604K25202K5460j57053j48755
$$ 125131 43945 193655 360416 277806 217794 158534 86930 312132 337592 180539 31784
21624C1784N4549P2062M8375m1482o0577q7968K5391p908j08568r6597r4606K8878
$$ 31784 86333 158395 206770 165288 104711 16743 42134 34226 -74342 -170939 -265545 -236667
21612b36667J27056M3687r252q9905K5982R6400K01497l7455j4296m831R9225
$$ -236667 -109611 -65924 -75176 -165081 -139099 -42699 158798 121343 107047 102216 201441
21601B01441j26213j36401r5480p4961n3981R7247J17745K81602O9319R8461j20524
$$ 201441 75228 -61173 -156653 -231614 -285595 -188348 -70603 210999 280318 378779 258255
21590B58255m5917o3500o3003r9334J09826J39076k2117m9661q9671K8674L820
$$ 258255 212338 148838 85835 -13499 96327 235403 213286 163625 73954 102628 106448
21579A06448J4359j84452m1431J04819Q1579O233J9170k47373Q369P4578L3889
$$ 106448 120807 -63645 -105076 -257 81322 87555 106725 -140648 -132279 -57701 -23812
21568b3812K9145L963L6057P4680P0221R1125n4902o7564r9080L5410m6430j09076
$$ -23812 5333 9296 45353 120033 190254 281379 226477 158913 59833 95243 48813 -60263
21556f0263Q4109n5613K445j54984k26423J7032P3354L01622K19324j3097p8301
$$ -60263 23846 -31767 -29322 -184306 -410729 -393697 -320343 -18721 200603 187506 109205
21545A09205J02606K16801J83152O615j02980k35124K6011N2742q7677j03737
$$ 109205 211811 428612 611764 618379 515399 280275 306286 359028 271351 167614
21535A67614Q432q7788n4123R5468J27607M506n0491j79001N6978Q1902j662J01994
$$ 167614 176046 88258 34135 129603 257210 261716 211225 32224 89202 171104 169442 271436
21523B71436j28722o8853R6426j1450j02816n4792j84430j34825K39633O6794
$$ 271436 142714 73861 170287 158837 56021 1229 -183201 -318026 -78393 -11599
21513a1599j01345L3373J25410p2417O4108m997J61822N1326j63174j7061M2992
$$ -11599 -112944 -79571 45839 -26578 37530 32533 194355 245681 82507 65446 108438
21502A08438k1932l3255R0574j6252p7764j15544m819O7052l9130J615n883J11298
$$ 108438 86506 53251 143825 127573 49809 -65735 -70554 -3502 -42632 -41017 -46900 64398
21490F4398o3404l3204J9148j77392J448L92171J03046k78186j92855Q4625K3744
$$ 64398 994 -32210 -13062 -190454 -189006 203165 306211 28025 -164830 -80205 -56461
21479e6461J19490L0986o591o4403n6535q1031L3502J5497o4863k0793r30J71311
$$ -56461 63029 94015 87424 23021 -33514 -114545 -81043 -65546 -130409 -151202 -152132 19179
21467A9179J88474j01640M9836J75785J20303n8070j88261l0204n4379K3370p4085
$$ 19179 207653 106013 155849 331634 451937 393867 205606 175402 121023 144393 70308
21456G0308j0990N9473K2822j68826j04887O7374J4859N6956R6854L4888l8571
$$ 70308 59318 118791 141613 -27213 -132100 -64726 -49867 7089 103943 138831 100260
21445A00260M7558n5799p839P2552J38901j2327j8348p5485j50179q9091k6873
$$ 100260 147818 92019 84180 156732 295633 283306 264958 189473 39294 -49797 -76670
21434g6670P7999L8313J14257r7958l8523j5157l1376Q9917j7537q2970j1206
$$ -76670 1329 39642 153899 55941 17418 2261 -29115 60802 43265 -39705 -50911
21423e0911Q8775M4416J5269k2273j04101p2048J42811J50091n1042m1281N9542
$$ -50911 37864 82280 97549 75276 -28825 -100873 41938 192029 140987 99706 159248
21412A59248p6586j53732N5676j9567j3309o4075J07457K04842j3551j37267q3395
$$ 159248 82662 -71070 -15394 -34961 -48270 -112345 -4888 199954 186403 49136 -34259
21401c4259P554q8596O0789J48785L6652n2488j11357n9613J1506K73241R9150
$$ -34259 -26705 -115301 -54512 94273 130925 78437 -32920 -92533 -81027 192214 291364
21390B91364l2610l7446j8429N8426j2117j07975q243m5583k08307r7257O8836
$$ 291364 258754 221308 202879 261305 249188 141213 132970 87387 -120920 -218177 -149341
21379a49341J27303J79950M6834o8365J0616l3675J00289P9819j81566k39291
$$ -149341 -22038 157912 204746 136381 146997 113322 213611 293430 111864 -127427
21369a27427L7880J59873l2033p2229p5566j32035N1943J23736j5709k6583J22462
$$ -127427 -89547 70326 38293 -33936 -109502 -241537 -189594 -65858 -81567 -108150 14312
21358A4312K16727J21545k317q4185j18108n8103m9854r3467m7551J33558M8880
$$ 14312 231039 352584 350267 266082 147974 89871 40017 -53450 -101001 32557 81437
21347H1437j65042p3292J15484l2929K126J18082O1870O5130j72242K2596P4013
$$ 81437 -83605 -156897 -41413 -74342 -72216 45866 107736 172866 624 23220 97233
21336I7233m0034j39540j95130j33593l2001J54864K5322O3872J41416M6062N9495
$$ 97233 57199 -82341 -277471 -411064 -443065 -288201 -262879 -199007 -57591 -11529 47966
21325D7966O9749l0843K5279l9479l3808m7453l2793J7818k81098k58966J07828
$$ 47966 117715 86872 112151 72672 38864 -8589 -41382 -23564 -304662 -563628 -455800
21314d55800K62284J00106j55274m1974N6274J22326J45356J9061j02317l855
$$ -455800 -193516 -93410 -248684 -290658 -234384 -112058 33298 52359 -49958 -53813
21304e3813J15824O331m6454J20927R2232k0808j60575j57800m3440l3549L1465
$$ -53813 62011 68342 21888 142815 235047 214239 53664 -104136 -147576 -181125 -149660
21293a49660j4805m8259M859J10137m4671N8015J7024J17364K02279Q2116j24159
$$ -149660 -164465 -212724 -207865 -97728 -142399 -84384 -67360 50004 252283 334399 210240
21282B10240k66150K2098R2094Q6667J26120j09498k10885j2488Q7229N1756j27660
$$ 210240 -55910 -33812 58282 144949 271069 161571 -49314 -61802 25427 77183 -50477
21271e0477n0155J12669k9212p0545m432o482K7960K027j08428j21081P7914N2296
$$ -50477 -100632 12037 -17175 -87720 -92152 -98634 -70674 -68647 -177075 -298156 -220242 -167946
21259a67946q5156M8454Q8538J24035K23697J71649l6770k34571j47818J17125
$$ -167946 -253102 -204648 -116110 7925 231622 403271 366501 131930 -15888 101237
21249A01237Q6124m0883p2812l6492K7485j10360j4697M7743p4338j18403J7314
$$ 101237 187361 146478 73666 37174 64659 -45701 -60398 -12655 -86993 -205396 -188082
21238a88082K32021J90034q6706j7776j51945N3297n1372N2679J5796L8064o8442
$$ -188082 43939 233973 147267 129491 -22454 30843 -20529 32150 47946 86010 17568
21227A7568J5111k956m286Q2447J2300j46961K2354J18342M6344J36153j13800
$$ 17568 32679 29723 25437 107884 120184 -26777 -4423 113919 160263 296416 182616
21216A82616p1557k45927j88028P3817J58363J02517N220J0569j0276r2319j42426
$$ 182616 111059 -134868 -322896 -249079 -90716 11801 17021 27590 17314 -75005 -217431
21205b17431q3440J58870M0265n0844j18277l3208m7328J15150M7553J4504J16723
$$ -217431 -300871 -142001 -101736 -152580 -270857 -304065 -351393 -236243 -188690 -174186 -57463
21194e7463J24845o7151l0943K9866j35070p9726q6118r7738l011N8828K9743
$$ -57463 67382 231 -30712 -846 -135916 -215642 -301760 -399498 -402509 -343681 -313938
21183c13938R6777J7990P8657n1329J72788n991o442j13265J6763r1641m920K33251
$$ -313938 -217161 -199171 -120514 -171843 945 -5046 -11488 -124753 -107990 -199631 -204551 28700
21171B8700J30470N0148k11138l13098p5287K35080R7422j78746j76549Q7102
$$ 28700 159170 209318 -1820 -314918 -390205 -155125 -57703 -236449 -412998 -325896
21161c25896L02127N5178j14193r8334o7826J35865R3960p9305J53546Q2028j13075
$$ -325896 -23769 31409 -82784 -181118 -248944 -113079 -19119 -98424 55122 137150 24075
21150B4075p1098K5767O2910n7444j87654K90p6005N6221J38393Q8620J28192
$$ 24075 -47023 -21256 41654 -15790 -203444 -203154 -279159 -222938 -84545 4075 132267
21139A32267J57742l0566q4566p1500N5235p2353J05435K1080m7720R0486O2807
$$ 132267 290009 259443 174877 103377 158612 86259 191694 212774 165054 255540 318347
21128C18347k35531p9921j46632J24445m422p5545j15845R6305M5539m7555K0006
$$ 318347 82816 2895 -143737 -19292 -23714 -99259 -215104 -118799 -73260 -120815 -100809
21117a00809K3593J14064J4576o175k02741j63387q6908j5589o154O5852K07406
$$ -100809 -77216 36848 51424 45249 -157492 -320879 -407787 -423376 -429530 -363678 -156272
21106a56272J57433k4015P7388q0253j88729J11803j2805l0376J29204p995R942
$$ -156272 1161 -22854 54534 -25719 -214448 -102645 -115450 -145826 -16622 -24617 -14675
21095a4675M5621j66995K8410J24190j92790k2481J04815L62413K808J274j40353
$$ -14675 30946 -136049 -107639 16551 -176239 -198720 -93905 268508 271316 272590 132237
21084A32237k5294j5412J60054J40358j28324j70676r8509q039K473L5632j8005
$$ 132237 106943 91531 251585 391943 263619 92943 -5566 -13605 -11132 24500 6495
21073F495j17987R62O7264p8247n1041R3395J17344m0491n9772J17452p7847P0243
$$ 6495 -111492 -110530 -43266 -121513 -172554 -79159 38185 -2306 -62078 55374 -22473 47770
21061D7770J49127J98464j23042j99426j42450j2515N0196J0136M9322M7273j28297
$$ 47770 196897 395361 272319 72893 -69557 -82072 -31876 -21740 27582 74855 -53442
21050e3442p2461L6527K01800K02800r9192K8922j35624j14292J03187m3292j39503
$$ -53442 -125903 -89376 112424 315224 216032 244954 109330 -4962 98225 54933 -84570
21039h4570N1526J51910J04108O2052n0828m4562K4329n839J8337j51160k13082
$$ -84570 -33044 118866 222974 285026 234198 189636 213965 208126 226463 75303 -137779
21028a37779K2406K14659J22456O070J36968r6875j71238K3452j59785n7711j20512
$$ -137779 -115373 99286 221742 227812 364780 267905 96667 120119 -39666 -97377 -217889
21017b17889m039k1750p7456J48179J39719o0632k84018J01831P2036J34217o7648
$$ -217889 -221928 -243678 -321134 -172955 -33236 -93868 -377886 -276055 -204019 -69802 -137450
21006a37450M7842P4921o2001R2551L4032j06313n7199J12083Q0450n8839j35974
$$ -137450 -89608 -14687 -76688 15863 49895 -56418 -113617 -1534 78916 20077 -115897
20995a15897N9878P1672J54123j15855j65515K6852R2985m4517n677j27262K10669
$$ -115897 -56019 15653 169776 53921 -111594 -84742 8243 -36274 -41951 -169213 41456
20984D1456J11786O4511q9958k59615j25063P6799j7293P4548J70616j7423j00177
$$ 41456 153242 217753 127795 -131820 -256883 -180084 -197377 -122829 47787 30364 -69813
20973f9813k5933J49894l053O0210j56542j61772M9450n3820q109k7810k381K48194
$$ -69813 -95746 54148 51095 111305 -45237 -207009 -157559 -211379 -219488 -247298 -249679 -1485
20961a485O8498J8698j6012j53720j7431J00528K16706O7119k54006j25901R5127
$$ -1485 67013 85711 69699 -84021 -101452 -924 215782 282901 28895 -97006 -1879
20950a879Q7886j08609j46245R0558p3329n5947J06423j42269K9744P0236p3059
$$ -1879 86007 -22602 -168847 -78289 -151618 -207565 -101142 -243411 -213667 -143431 -216490
20939b16490O9233P2184j66456j5669R6106K74872J21689k01262o6602r5619K0437
$$ -216490 -147257 -75073 -241529 -257198 -161092 113780 235469 34207 -32395 -128014 -107577
20928a07577k2212J07451j09606o4592P0883K5007L3413K7941N6315j14703M8464
$$ -107577 -129789 -22338 -131944 -196536 -125653 -100646 -67233 -39292 17023 -97680 -49216
20917d9216J3087j03956j65454o2878m2123L9787J14968J75197p0943j46111m7810
$$ -49216 -36129 -140085 -305539 -368417 -410540 -370753 -255785 -80588 -151531 -297642 -345452
20906c45452J11205K3034k2014Q2608J14261k33647j85619j1977l343J59137O600
$$ -345452 -234247 -211213 -233227 -150619 -36358 -270005 -455624 -467601 -470944 -311807 -305207
20895c05207j1721O2774K9856K6747J09718K8572J11427j59781l12019p3134J30925
$$ -305207 -316928 -254154 -224298 -197551 -87833 -59261 52166 -107615 -419634 -492768 -361843
20884c61843R1290J44076L0371j30738j23515J3508K0270j35352K4667J34644
$$ -361843 -270553 -126477 -96106 -226844 -350359 -336851 -316581 -451933 -427266 -292622
20874b92622J34863J01115J22384k14k6949n452N222K2532J8162J1273n0300j68546
$$ -292622 -157759 -56644 65740 65526 38577 33125 38347 60879 79041 90314 40014 -128532
20862a28532k00276J15492J64138p8605N9757O9491J9458k7370l0370J2412R9715
$$ -128532 -328808 -213316 -49178 -127783 -68026 1465 20923 -6447 -36817 -24405 75310
20851G5310k04917l5256J87187O1709r4028j78481q1603J40510M6066j1313k46444
$$ 75310 -129607 -164863 22324 84033 -9995 -188476 -270079 -129569 -83503 -94816 -341260
20840c41260P603R72M3161O2543O3700O5745J59253j21719k15365j30507J78317
$$ -341260 -333657 -332685 -289524 -226981 -163281 -97536 61717 -60002 -275367 -405874 -227557
20829b27557R7830r2219Q4945Q0727M9269j29043p7197J44126K46170M0548L525
$$ -227557 -129727 -221946 -137001 -56274 -7005 -136048 -213245 -69119 177051 217599 221124
20818B21124k1705j19819J13955n6772o7312N8706M759R7051j34424k57963n7887
$$ 221124 199419 79600 193555 136783 69471 128177 132936 229987 95563 -162400 -220287
20807b20287r9579j1776J08327j9724k9749o1063P6444n1398Q2714L5517R3738
$$ -220287 -319866 -331642 -223315 -243039 -272788 -333851 -257407 -308805 -226091 -190574 -96836
20796i6836j9472r9831O0209K0045L0360P1477P3933j4289J26473Q1517j12286
$$ -96836 -116308 -216139 -155930 -135885 -105525 -34048 39885 25596 152069 233586 121300
20785A21300j28020l9949n4283k3692J523r1874O7312J32529p237l8077j04303
$$ 121300 -6720 -46669 -100952 -124644 -123121 -214995 -147683 -15154 -22391 -60468 -164771
20774a64771m6903j39319j524J98525J68831Q2100j39068k4027J91411k12860
$$ -164771 -211674 -350993 -352517 -153992 14839 96939 -42129 -66156 125255 -87605
20764h7605m1365m1603l2547j03801m9914K35753J65523j4936o1072j0328K1067
$$ -87605 -128970 -170573 -203120 -306921 -356835 -121082 44441 29505 -31567 -41895 -20828
20753b0828O9834k0594p4202L3349L746j01717j2277j6540P6928m9025N4390J36606
$$ -20828 49006 28412 -45790 -12441 -8695 -110412 -122689 -139229 -62301 -111326 -56936 79670
20741G9670J0499L9839j77125K155j32367k5818P3106q562O8443o4311L7586j7399
$$ 79670 90169 130008 -47117 -44962 -177329 -203147 -130041 -138603 -70160 -134471 -96885 -114284
20729a14284R383Q8501N6711J1242P3985K1508q1347j976k7703k9495J699K8354
$$ -114284 -104901 -16400 40311 51553 125538 147046 65699 63723 36020 6525 8224 36578
20717C6578j85369o4959J4386j1985K18646j09805j00227q1650Q7539P0505N4954
$$ 36578 -148791 -213750 -199364 -211349 7297 -102508 -202735 -284385 -196846 -126341 -71387
20706g1387m4344J02179l2837J11014Q221q1253o5286K32913R1228j03114l6192
$$ -71387 -115731 -13552 -46389 64625 72846 -8407 -73693 159220 250448 147334 111142
20695A11142J13359J38361J5730k05160j34283Q5817K5310p1638J5209J51305
$$ 111142 224501 362862 378592 173432 39149 124966 150276 78638 93847 245152
20685B45152L6060j38817M702Q197j7778Q2214j16830j16694J28092p5380q5678
$$ 245152 281212 142395 147097 155294 137516 219730 102900 -13794 114298 38918 -46760
20674d6760o9099m7737j6276K01400K02915n0031j52414j03822P5287M7781r1121
$$ -46760 -115859 -163596 -179872 21528 224443 174412 21998 -81824 -6537 41244 -49877
20663d9877o6734J30865N8183r6535j05595j8047n57J5157j55769j02030M1518
$$ -49877 -116611 14254 72437 -24098 -129693 -147740 -148297 -133140 -288909 -390939 -349421
20652c49421M9555k7872L6525o878P4949R4581j44938r1197R6663P2587Q3523
$$ -349421 -299866 -327738 -291213 -298091 -223142 -128561 -273499 -364696 -268033 -195446 -111923
20641a11923l7171j7506J25864J36662Q0674n580j1668l0338j84233j22155N1875
$$ -111923 -149094 -166600 -40736 95926 176600 171020 159352 129014 -55219 -177374 -125499
20630a25499K9941j02754J1327O0057j191J39197J81238j97302n7954R5330j17862
$$ -125499 -95558 -198312 -186985 -126928 -128119 11078 192316 -4986 -62940 32390 -85472
20619h5472k7262K74157j5879o6695P7134P2962j15656k03245P4466J17724j61888
$$ -85472 -112734 161423 145544 78849 155983 228945 113289 -89956 -15490 102234 -59654
20608e9654r6245N78L1497Q5577P9867j31242J56524l4891l4013J29714P5906
$$ -59654 -155899 -155321 -123824 -38247 41620 -89622 66902 32011 -2002 127712 203618
20597B03618k660k13198j12796M3763J1073M3733J26797j59533m4223P7740l480
$$ 203618 200958 -12240 -125036 -81273 -70200 -26467 100330 -59203 -103426 -25686 -29166
20586b9166K58371K2974k04716k09508k29684k0756J93362J56043J2867o3695
$$ -29166 229205 252179 47463 -162045 -391729 -412485 -219123 -63080 -50213 -113908
20576a13908j28389n942O3971P2080q7081o5826q564k0117N722J6270J78985R0339
$$ -113908 -242297 -248239 -184268 -112188 -199269 -265095 -273659 -293776 -288054 -271784 -92799 -2460
20564b460r2870M4338r1408L902J9267J26682N2991J59927q718l3911j89253j55730
$$ -2460 -95330 -50992 -142400 -138498 -119231 7451 60442 220369 211651 177740 -11513 -167243
20552a67243J04273Q5366j6572l4417j96978k22095J24643J35460J51297j6081
$$ -167243 -62970 22396 5824 -28593 -225571 -447666 -323023 -187563 -36266 -52347
20542e2347j19845R6120K07915P7577l2641j70187k15698M1006J64807o1510K4541
$$ -52347 -172192 -76072 131843 209420 176779 6592 -209106 -168100 -3293 -64803 -40262
20531d0262J4508l688N6895l8816j48105M9028J12861q4536J38172J13090n8368
$$ -40262 -25754 -29442 27453 -11363 -159468 -110440 2421 -82115 56057 169147 110779
20520A10779r9094q3544r3428l6871J12358M4146o46P5450j40397l0599L6703
$$ 110779 11685 -71859 -165287 -202158 -89800 -45654 -46300 29150 -111247 -141846 -105143
20509a05143k0075J22531o2172J6685o0411n5738J4682J66764P2827N316q0691
$$ -105143 -125218 -2687 -64859 -48174 -108585 -164323 -149641 17123 89950 95266 14575
20498A4575k2065Q0063Q7036j17694q8353r0896j30349o7608J76028J64473Q8183
$$ 14575 -7490 72573 159609 41915 -46438 -137334 -267683 -335291 -159263 5210 93393
20487I3393j24006N0440r9278n5435J16870l5758n4035m4204k27115N1690R0642
$$ 93393 -30613 19827 -79451 -134886 -18016 -53774 -107809 -152013 -379128 -327438 -236796
20476b36796J54037P0511j70889K3686n6780m6548q7455J44079N7251j6180J54591
$$ -236796 -82759 -12248 -183137 -159451 -216231 -262779 -350234 -206155 -148904 -165084 -10493
20465a0493N1746j46792J28361L8693j58816p3425K27603J0267P115j0501o5515
$$ -10493 41253 -105539 22822 61515 -97301 -170726 56877 67144 74259 63758 -1757
20454a757m8367m5365p6466J38468j00281j65924J5182J18325J06496J14307N0693
$$ -1757 -50124 -95489 -171955 -33487 -133768 -299692 -284510 -166185 -59689 54618 105311
20443A05311k08881o724O0018l6659m2167n3093r907J2386k1335l4894J47731
$$ 105311 -103570 -110294 -50276 -86935 -129102 -182195 -192102 -179716 -201051 -235945 -88214
20432h8214L88610j51015j70071m3319J57974r5940j07441N7581m4420r8640k7126
$$ -88214 300396 149381 -20690 -64009 93965 -1975 -109416 -51835 -96255 -194895 -222021
20421b22021K3408N6542J4640J27584o1009J54809l6449L2045J13664J078k34765
$$ -222021 -198613 -142071 -127431 153 -60856 93953 57504 89549 203213 204291 -30474
20410c0474J13170O8502j6060m7110M8473R777j52980p9361K9465j5177J06985
$$ -30474 82696 151198 135138 88028 136501 146278 -6702 -86063 -56598 -71775 35210
20399C5210K3683n9407r8528l5482p6482J17668J77345K66711n1058k09111j42927
$$ 35210 58893 -514 -99042 -134524 -211006 -93338 84007 350718 299660 90549 -52378
20388e2378n376j33441j40928R6079J55062j0418J14920Q3103N131J14040m1999
$$ -52378 -57754 -191195 -332123 -236044 -80982 -91400 23520 106623 111754 225794 183795
20377A83795k678L4184q5623j98158Q4815O9538r703M321J32230N8989O2998j63807
$$ 183795 181117 215301 129678 -68480 16335 85873 76170 80491 212721 271710 334708 170901
20365A70901k66323o956J24683K18622k27401j94777p6703m7292M0887J75208
$$ 170901 -95422 -102378 22305 240927 13526 -181251 -257954 -305246 -264359 -89151
20355h9151J46764K2162q3288p6119q819J77096K32443J3336j85093j36895l0824
$$ -89151 57613 79775 -3513 -79632 -88451 88645 321088 334424 149331 12436 -18388
20344a8388R451j170M4941R6165L8336p8789P1958l0215j22967N295O6018K8921
$$ -18388 -8937 -10107 34834 130999 169335 90546 162504 132289 9322 14617 80635 109556
20332A09556j38324p4550K03853l6352n839l9323K0891P0144p3779K4684J16601
$$ 109556 -28768 -103318 100535 64183 58344 19021 39912 110056 36277 60961 177562
20321A77562j01604p0209N0699K1490k33331j12377J3445J29582p393K5615J98907
$$ 177562 75958 5749 56448 77938 -155393 -267770 -254325 -124743 -132136 -106521 92386
20310I2386j38336j28451O7252N5340J11617j1855Q2903K0462m6041M2890M1561
$$ 92386 -45950 -174401 -107149 -51809 59808 47953 130856 151318 105277 148167 189728
20299A89728m5719n8126k8179P0848R8434j75493l8734j2380R8663P0340j1149
$$ 189728 144009 85883 57704 128552 226986 51493 12759 379 99042 169382 158233
20288A58233m0345q627L300k09102L9439J70913n3235k555q9094J4154M2349O8405
$$ 158233 117888 109261 112561 -96541 -57102 113811 60576 58021 -31073 -16919 25430 93835
20276I3835k98134j58006J46974J6801N3635J21735Q7567J15164J41732n1195
$$ 93835 -204299 -362305 -215331 -198530 -144895 -23160 64407 179571 321303 270108
20266B70108m5865p8860o568l7478P1113j7489j45873r0356L1285K0134q507O710
$$ 270108 224243 145383 138815 101337 172450 154961 9088 -81268 -49983 -29849 -38356 -31646
20254c1646N0674q8010N4506q5111L6980R2257l1801J37646l3579N8273o3168
$$ -31646 19028 -68982 -14476 -99587 -62607 29650 -2151 135495 101916 160189 97021
20243I7021q9387Q1523K5893j4456j2418r6206R9730o0524m1492L1057q5795n061
$$ 97021 7634 89157 115050 100594 88176 -8030 91700 31176 -10316 20741 -65054 -70115
20231g0115k2743L5257J6125p1237j3553J96234L0097j18178p3413q1925k7761
$$ -70115 -92858 -57601 -41476 -112713 -126266 69968 100065 -18113 -91526 -173451 -201212
20220b01212K169Q888J01736J72881r951m3735o495L1590L7201R5037J01688P6096
$$ -201212 -199043 -190155 -88419 84462 74511 30776 24281 55871 93072 188109 289797 365893
20208C65893l4436n1069o2179n3648j616Q45o7291P6569j51707l3855J44582r0980
$$ 365893 331457 280388 218209 164561 162945 163790 96499 173068 21361 -12494 132088 41108
20196D1108k10751K27770M7088k50109m5932K68485P7312j4688j65286k1823J95082
$$ 41108 -169643 58127 105215 -144894 -190826 77659 154971 140283 -25003 -46826 148256
20185A48256J15308J26347P593j64263j14921J04344m6570q8696J6113q4978j4783
$$ 148256 263564 389911 397504 233241 118320 222664 176094 87398 103511 18533 3750
20174C750N7611p3349O4548r6126j21076O168J01491O5633J07872J41854l6476
$$ 3750 61361 -11988 52560 -43566 -164642 -158474 -56983 8650 116522 258376 221900
20163B21900j56838J84713K20604p1639k44334p691J62641J39227m4357l5669
$$ 221900 65062 249775 470379 398740 154406 146715 309356 448583 404226 368557
20153C68557L1392k3693J8323j75323q2443Q6376m0014J35035J03919K2132k5204
$$ 368557 399949 376256 394579 219256 136813 223189 183175 318210 422129 444261 419057
20142D19057q0596K2730j5414J08760j0102L6751p3722j38441M842K2016M3705
$$ 419057 338461 361191 345777 454537 444435 481186 407464 269023 273865 295881 339586
20131C39586n1952o2008M1122J4448M5011j40203r9229J16247L9030q4839o8377
$$ 339586 287634 225626 266748 281196 326207 186004 86775 203022 242052 157213 88836
20120H8836m6123R3458Q0586P278j01660k40386j01915J87244J01794J18775Q8119
$$ 88836 42713 136171 216757 224035 122375 -118011 -219926 -32682 69112 187887 276006
20109B76006N0429P5897R2191N667j5491q3102j2796J18478j12478n2964L0413
$$ 276006 326435 402332 494523 500190 484699 401597 388801 507279 394801 341837 372250
20098C72250J08808R0643P5326J67987J06125j7319K11216K36019L96049N99048
$$ 372250 481058 571701 647027 815014 921139 903820 1115036 1351055 1747104 2346152
20088B346152P48275O70670L51380L8424P5624N4919q6111n12253n98140k01978
$$ 2346152 3094427 3765097 4116477 4154901 4230525 4285444 4199333 3687080 3088940 2886962
20078B886962N8815M39230O57018N11246M5404r0791j12358j71408n75901p23778
$$ 2886962 2945777 3385007 4042025 4553271 4598675 4507884 4395526 4224118 3648217 2924439
20068B924439o32988n39829l06729j85118j19126q226o0081n1635j59939j49566
$$ 2924439 2291451 1751622 1444893 1259775 1140649 1132423 1072342 1020707 860768 711202
20058G11202k73696k9919p0031o4700P7850J28396K5703P5737J79959N7531k5875
$$ 711202 437506 407587 337556 272856 350706 479102 504805 580542 760501 818032 792157
20047G92157q1075j14446p5592Q2051Q8922j02565r2198q5045K6435l1890O3347
$$ 792157 711082 596636 521044 603095 692017 589452 497254 412209 438644 406754 470101
20036D70101n3621j2193N6451j5329K9621R4212l1332j77559N6068J36576p997
$$ 470101 416480 404287 460738 445409 475030 569242 537910 360351 416419 552995 544998
20025E44998l5303Q1681M3058j83671j48596O2056K80223K4938k29000J15062
$$ 544998 509695 591376 634434 450763 302167 364223 644446 669384 440384 555446
20015E55446K9338j71462P1121K7628j9329r6385M7527O1173J6740k23779J6765
$$ 555446 584784 413322 484443 512071 492742 396357 443884 505057 521797 298018 314783
20004C14783O3024M0497J31778L9126m6819j9491m8364m9943K615P7643j9721
$$ 314783 377807 418304 550082 589208 542389 522898 474534 424591 427206 504849 485128
19993D85128j25706P5727k4020j10464K16669J70622p5439k558k6671n4856m3095
$$ 485128 359422 435149 411129 300665 517334 687956 612517 609959 583288 528432 485337
19982D85337L8383M1386l3988l0848k1819P4215K62644Q5563K8543n2148q7900
$$ 485337 523720 565106 531118 500270 478451 552666 815310 900873 929416 877268 789368
19971G89368j17726p668J6930j9335j74758j86296O329J40961l8639Q8208J38019
$$ 789368 671642 663974 680904 661569 486811 300515 306844 447805 409166 497374 635393
19960F35393k08418K4344j2129o0393k2312R058O6477Q6990j06257J7013n967
$$ 635393 426975 451319 439190 378797 356485 365543 432020 519010 412753 429766 423799
19949D23799n3247J21921o3186J14313R2759j10k5207K94303k9045o5022N9065
$$ 423799 370552 492473 429287 543600 636359 636249 611042 905345 876300 811278 870343
19938H70343j35292K0350p3618j1187J466q7616J51684J64621o6423o1951j05999
$$ 870343 735051 755401 681783 670596 672062 584446 736130 900751 834328 772377 666378
19927F66378O8613p3818q2768J39477j01842m9386j0971K5360p0964j12107Q7251
$$ 666378 734991 661173 578405 717882 616040 566654 555683 581043 510079 397972 485223
19916D85223P7295J89144L0027j33931q9239o5070J73341N8085P045r0116k50393
$$ 485223 562518 751662 781689 647758 558519 493449 666790 724875 731920 641804 391411
19905C91411J17342J29843J19870j52313R373R7150p0246P2767l3653j20510r3103
$$ 391411 508753 638596 758466 606153 615526 712676 642430 715197 681544 561034 467931
19894D67931M7392j5130n6155k054J4798J4903L8442K24978J40896j36225j49157
$$ 467931 515323 500193 444038 441984 456782 471685 510127 735105 876001 739776 590619
19883E90619J38358j7907k7569N6840K8552q5348j34390l0335J15643j3935r5243
$$ 590619 728977 711070 683501 740341 768893 683545 549155 518820 634463 620528 525285
19872E25285K093L3308R268J6890j3269Q6758m7655J05612P9038l7290j38434
$$ 525285 527378 560686 569954 586844 573575 660333 612678 718290 797328 760038 621604
19861F21604o6503N1886K1647l3750O6653R098j6690m7l39J22947N6856R5580
$$ 621604 555101 606987 628634 594884 661537 670635 653945 653898 653559 776506 833362 928942
19849I28942o4528j138k4111j47140j03443M0625K75339J46379L5325j68060n4635
$$ 928942 864414 863276 839165 692025 588582 629207 904546 1050925 1086250 918190 863555
19838H63555p545j22377J42577K5930n7735j25458L9656K66893k7883K3957N1759
$$ 863555 856010 733633 876210 902140 844405 718947 758603 1025496 997613 1021570 1073329
19827A073329Q593l1987n4058M4927j20551j02779J2905O5169P8227P6109j69466
$$ 1073329 1081922 1049935 995877 1040804 920253 817474 830379 895548 973775 1049884 880418
19816H80418p6066r1188o1022o8095l4585O2547K5235O7820K1595Q0834J43555
$$ 880418 804352 713164 652142 584047 549462 612009 637244 705064 726659 807493 951048
19805I51048m2306J4760k35833q3749r040o7012J22853K12116P6152k9083Q5111
$$ 951048 908742 923502 687669 603920 594880 527868 650721 862837 938989 909906 995017
19794I95017O8029K6229K7092k7527r9267k7846o1171m2288N6937L2709J33587
$$ 995017 1063046 1089275 1116367 1088840 989573 961727 900556 858268 915205 947914 1081501
19783A081501J86581K8165L4255J8944j08891j56384o3123j3193M3682K3131l2050
$$ 1081501 1268082 1296247 1330502 1349446 1240555 1084171 1021048 1007855 1051537 1074668 1042618
19772A042618l0161J55319O2212n2131J4462l9609O3274J5938j26938J19533L70949
$$ 1042618 1012457 1167776 1229988 1177857 1192319 1152710 1215984 1231922 1104984 1224517 1595466
19761A595466N1226j30193N3589J647K3979o5209j12433j86788k3410R1731N2494
$$ 1595466 1646692 1516499 1570088 1571735 1595714 1530505 1418072 1231284 1207874 1299605 1352099
19750A352099O9083n9895k00084j43252J16133J11334J06532n2629n8785J25446
$$ 1352099 1421182 1361287 1161203 1017951 1134084 1245418 1351950 1299321 1240536 1365982
19740A365982N9096r8056r0516p324o1983M3884J74504J34977J47625J35597r6481
$$ 1365982 1425078 1327022 1236506 1229182 1167199 1211083 1385587 1520564 1668189 1803786 1707305
19729A707305L5343J48526p3083J46982R3439N9490m2157k99306j8678K88021
$$ 1707305 1742648 1891174 1818091 1965073 2058512 2118002 2075845 1776539 1757861 2045882
19719B045882J49903q7043k17806k10623r1547J12235J95566l7372m1972K9128
$$ 2045882 2195785 2108742 1890936 1680313 1588766 1701001 1896567 1859195 1817223 1846351
19709A846351K0911J29102m4251r9316k0097l6063N7100L6574P3830J37781r570
$$ 1846351 1867262 1996364 1952113 1852797 1832700 1796637 1853737 1890311 1964141 2101922 2092352
19698B092352q8494R475L2957l2966j26477n7533N3779L3136k9436n69K48600
$$ 2092352 2003858 2013333 2046290 2013324 1886847 1829314 1883093 1916229 1886793 1886224 2134824
19687B134824K73411L11398M01545N39991K18876L8395J32245K04032Q454L06086
$$ 2134824 2408235 2719633 3121178 3661169 3880045 3918440 4050685 4254717 4263171 4569257
19677D569257R3335j07406n37J41913J66719K12185p3286L2096J49499J13362
$$ 4569257 4662592 4555186 4554649 4696562 4863281 5075466 5002180 5034276 5183775 5297137
19667E297137L047l09873l60220l64809l89124l11280j32276r5670j03287q6075
$$ 5297137 5300184 4990311 4630091 4265282 3876158 3564878 3432602 3336932 3233645 3147570
19657C147570q7982j98554j60068J31032L4932K3983R7193j44289j21431P9513
$$ 3147570 3059588 2861034 2700966 2831998 2866930 2890913 2988106 2843817 2722386 2801899
19647B801899J1696j37448j3434K24784J97855M4059N3015m3668J34692N40945
$$ 2801899 2813595 2676147 2662713 2887497 3085352 3129411 3182426 3138758 3273450 3814395
19637C814395M94673J63420J53624j07163O8326K11466N4699p3925j52344l41666
$$ 3814395 4309068 4472488 4626112 4518949 4587275 4798741 4853440 4779515 4627171 4285505
19627D285505j84428j50969j74943k16246j14803K4671j8869n7168K0014L9819
$$ 4285505 4101077 3950108 3775165 3558919 3444116 3468787 3449918 3392750 3412764 3452583
19617C452583J82899L51068p3705j60301K9884j71157m6217j38164k0531M3851
$$ 3452583 3635482 3986550 3912845 3752544 3782428 3611271 3565054 3426890 3406359 3450210
19607C450210Q5860R2886m0678R444L2739M4020R1142R0518l6100K1967M8756
$$ 3450210 3536070 3628956 3588278 3597722 3630461 3674481 3765623 3856141 3820041 3842008 3890764
19596C890764J35088J63677J65436N9453j639J0123j8691L8091N4767J66016J03794
$$ 3890764 4025852 4189529 4354965 4414418 4412779 4422902 4404211 4442302 4497069 4663085 4766879
19585D766879n5628K8101J2050L3879K1829k8059M9538m5208k06661o7534R6616
$$ 4766879 4711251 4739352 4751402 4785281 4807110 4779051 4828589 4783381 4576720 4509186 4605802
19574D605802R4917J57088o6986J56258J89795K28871K0641o796Q3751j76444
$$ 4605802 4700719 4857807 4790821 4947079 5136874 5365745 5386386 5379590 5463341 5286897
19564E286897J45635J14063Q4868Q847K66500J05356n0823J17085m7481J11863
$$ 5286897 5432532 5546595 5631463 5640310 5906810 6012166 5961343 6078428 6030947 6142810
19554F142810J58062j552L7941J75608J01743K82031J11914l2519l6121O2910
$$ 6142810 6300872 6299320 6337261 6512869 6614612 6896643 7008557 6976038 6939917 7002827
19544G002827J25657K22607k8232J84785R7576J1569J26931L9474J16320K38850
$$ 7002827 7128484 7351091 7322859 7507644 7605220 7616789 7743720 7783194 7899514 8138364
19534H138364J26758J5925p9616n2953J62302J10798K66327K97893M6014m2952
$$ 8138364 8265122 8281047 8201431 8148478 8310780 8421578 8687905 8985798 9031812 8988860
19524H988860K1097J02799O9045K12014J60427J02830J83414L51183R6051J0218
$$ 8988860 9009957 9112756 9181801 9393815 9554242 9657072 9840486 10191669 10287720 10297938
19514A0297938O0014J24076L05146J52907J2299N8067j023L32040K38935K31937
$$ 10297938 10357952 10482028 10787174 10940081 10952380 11010447 11009424 11341464 11580399 11812336
19504A1812336J57824R2364P8076K51609J57821J27794J79843J17172J98313K41227
$$ 11812336 11970160 12062524 12140600 12392209 12550030 12677824 12857667 12974839 13173152 13414379
19494A3414379K60116J62515K03369K22181K81461K27127J72184J90478L98793
$$ 13414379 13674495 13837010 14040379 14262560 14544021 14771148 14943332 15133810 15532603
19485A5532603L21768L62991J36454J56509K38038K46348L90699K63185L03326
$$ 15532603 15854371 16217362 16353816 16510325 16748363 16994711 17385410 17648595 17951921
19476A7951921L51001K93228K35871K55671M08398L16609K64464K19677L78334
$$ 17951921 18302922 18596150 18832021 19087692 19496090 19812699 20077163 20296840 20675174
19467B0675174L57883L53147L99260M40228L31286K46958K85122L98464L81664
$$ 20675174 21033057 21386204 21785464 22225692 22556978 22803936 23089058 23487522 23869186
19458B3869186M83948M38894N06106N58351M33583M21729L75682N05662O24254
$$ 23869186 24353134 24792028 25298134 25856485 26290068 26711797 27087479 27593141 28217395
19449B8217395N23719N95293M76718M26726M91256O28160N89250M90830P81534
$$ 28217395 28741114 29336407 29813125 30239851 30731107 31359267 31948517 32439347 33220881
19440C3220881O73342O14658O99187M23669O05183O43126O70643O13838O63863
$$ 33220881 33894223 34508881 35208068 35631737 36236920 36880046 37550689 38164527 38828390
19431C8828390O39606M65438O50293P25541R28388P07947N56965M36019O72103
$$ 38828390 39467996 39933434 40583727 41309268 42237656 42945603 43502568 43938587 44610690
19422D4610690O25980M68140P28555O22426O51818Q39727R62490P73444N86697
$$ 44610690 45236670 45704810 46433365 47055791 47707609 48547336 49509826 50283270 50869967
19413E0869967N34379O33337O57136P67631N32632P30971P83353O15572N11302
$$ 50869967 51404346 52037683 52694819 53462450 53995082 54726053 55509406 56124978 56636280
19404E6636280M71060N20169O11374M01650M57725N99164M61400L87363M33273
$$ 56636280 57107340 57627509 58238883 58640533 59098258 59697422 60158822 60546185 60979458
19395F0979458K42506L13040J32129n415P4729R4296J52646m1564j77236j63692
$$ 60979458 61221964 61535004 61667133 61661718 61736447 61830743 61983389 61941825 61764589 61600897
19385F1600897l7120n4502j93233l95429l08471k54709k94373l21402l36725l79966
$$ 61600897 61563777 61509275 61316042 60920613 60612142 60357433 60063060 59741658 59404933 59024967
19375E9024967l71710m08037l56814l01861m13257m38047n99009n66031o85846
$$ 59024967 58653257 58245220 57888406 57586545 57173288 56735241 56136232 55570201 54884355
19366E4884355n65421n41304m34627o31462p11659p11489o29501q13089p91483
$$ 54884355 54318934 53777630 53343003 52711541 51999882 51288393 50658892 49845803 49054320
19357D9054320p25973m55532n22289q22568o47647o67843q01294q87566o77829
$$ 49054320 48328347 47872815 47350526 46527958 45880311 45212468 44411174 43523608 42845779
19348D2845779o44264l75409l97220p68237q16228o40744m94321n31202o11005
$$ 42845779 42201515 41826106 41428886 40660649 39844421 39203677 38709356 38178154 37567149
19339C7567149m64111m72944o97011p72807n68124o67966m26244n57181o20230
$$ 37567149 37103038 36630094 35933083 35160276 34592152 33924186 33497942 32940761 32320531
19330C2320531n52879n42333m41646p55353p92917l99190l60387n52043l84559
$$ 32320531 31767652 31225319 30783673 30028320 29235403 28836213 28475826 27923783 27539224
19321B7539224m00651o34219n40372k37333m43331n37435n28987l23154k34495
$$ 27539224 27138573 26504354 25963982 25726649 25283318 24745883 24216896 23893742 23659247
19312B3659247l16058l90862m92256k86825l41129k22855p5441j50674l40348
$$ 23659247 23343189 22952327 22460071 22173246 21832117 21609262 21533821 21383147 21042799
19303B1042799l10680m31539l72118k70480r5474k96118m37340l35037j76703
$$ 21042799 20732119 20300580 19928462 19657982 19562508 19266390 18829050 18494013 18317310
19294A8317310o8926j86162j16903j87857k43457l79546l49031m29451l35195
$$ 18317310 18248384 18062222 17945319 17757462 17514005 17134459 16785428 16355977 16020782
19285A6020782j39952j31407j88021q3475k50736k36027j65114j09711q3884p0524
$$ 16020782 15880830 15749423 15561402 15477927 15227191 14991164 14826050 14716339 14632455 14561931
19275A4561931l11510m36850j80935j33457k12987j64447L1266j38118j77145
$$ 14561931 14250421 13813571 13632636 13499179 13286192 13121745 13153011 13014893 12837748
19266A2837748j20321k34519l14247j26534r7841l99720l58002r5349j65631o4809
$$ 12837748 12717427 12482908 12168661 12042127 11944286 11544566 11186564 11091215 10925584 10860775
19256A0860775j69770j65014j67151j41403n7829k15372k53444j23318j94349
$$ 10860775 10691005 10525991 10358840 10217437 10159608 9944236 9690792 9567474 9373125
19247I373125J7706m9716j36212k41632k26608j77593k7648q3873j61529r8499
$$ 9373125 9390831 9341115 9204903 8963271 8736663 8559070 8531422 8447549 8286020 8187521
19237H187521j13337J4254L5732J04118j05339j73862j77637k43205m8314J31261
$$ 8187521 8074184 8088438 8124170 8228288 8122949 7949087 7771450 7528245 7479931 7611192
19227G611192J27644j21120j55960r8499j80512p0662j7675M856P5904j89340
$$ 7611192 7738836 7617716 7461756 7363257 7182745 7112083 7094408 7099264 7175168 6985828
19217F985828j82075m2572J94368l7422j34960l6740J94405J79626R6423n0370
$$ 6985828 6803753 6761181 6955549 6918127 6783167 6746427 6940832 7120458 7216881 7166511
19207G166511p1686Q7881J1636L0008M3908L6721J59739J53001J40664J47238
$$ 7166511 7094825 7182706 7194342 7224350 7268258 7304979 7464718 7617719 7758383 7905621
19197G905621R8247n8712p0138j49201p5781j99256j40411J78368K64513K53393
$$ 7905621 8003868 7945156 7875018 7725817 7650036 7450780 7310369 7488737 7753250 8006643
19187H006643K88973J99875K53537K10506J09718l6338k5881J77611M31071O44736
$$ 8006643 8295616 8495491 8749028 8959534 9069252 9032914 9007033 9184644 9615715 10260451
19177A0260451R40427J093611J020951R50382J296192J324446J248589J127789
$$ 10260451 11200878 12294489 13315440 14265822 15562014 16886460 18135049 19262838
19169A9262838J373693J940160K108190K381859K861228L604023M868847O312855
$$ 19262838 20636531 22576691 24684881 27066740 29927968 33531991 38400838 44713693
19161D4713693Q273502J1305131J6784962K6481654M3758742O9313162Q6799817
$$ 44713693 52987195 64292326 81077288 107558942 151317684 220630846 307430663
19154C07430663O8753072L3792604J0735425M461933J0848227M903378j1571880
$$ 307430663 376183735 409976339 420711764 425173697 436021924 440925302 429353422
19147D29353422k2431911j5418446J2024704L4688980K6231530K462069r374725
$$ 429353422 406921511 391503065 403527769 438216749 464448279 466910348 457535623
19140D57535623k570141P768208j2383181m6673622p2147158q0066743o4144766
$$ 457535623 454965482 462733690 450350509 403676887 331529729 251462986 187318220
19133A87318220m2970349k8429614j9838427j4251862j0769760q377205o593876
$$ 187318220 144347871 115918257 96079830 81827968 71058208 62681003 56087127
19126E6087127n452807m185929l615232l143412k909942k741885k605108k264563
$$ 56087127 50634320 46448391 42833159 39689747 36779805 34037920 31432812 29168249
19118B9168249k001578j764368j675352j534401j411626j512274j245325j068933
$$ 29168249 27166671 25402303 23726951 22192550 20780924 19268650 18023325 16954392
19110A6954392j028582r24345o73979n81737m23114l85692m98340n18155l45454
$$ 16954392 15925810 15001465 14327486 13745749 13322635 12936943 12438603 11920448 11574994
19101A1574994m53921m62610l29549l78595k60122j66682k66211k97828k69474
$$ 11574994 11121073 10658463 10328914 9950319 9690197 9523515 9257304 8959476 8690002
19092H690002l03115l69102k19367l46677l58439k22485k00925k51373q0837k0142
$$ 8690002 8386887 8017785 7798418 7451741 7093302 6870817 6669892 6418519 6337682 6317540
19082F317540r3744j52472j50768L5002O4007k13083l27062j39805m809j20j8859
$$ 6317540 6223796 6071324 5920556 5955558 6019565 5806482 5479420 5339615 5334806 5334686 5315827
19071E315827j63180p4148K0038k36093j61381r1062j11406k4633j68957j09206
$$ 5315827 5152647 5078499 5098537 4862444 4701063 4610001 4498595 4473962 4305005 4195799
19061D195799n7751j59781k10982O2396R6953q4221j33130K7099J70963R9208
$$ 4195799 4138048 3978267 3767285 3829681 3926634 3842413 3709283 3736382 3907345 4006553
19051D006553r0362l08093j73924J56826N6254O6319j42521k29538m7203l1251
$$ 4006553 3916191 3608098 3434174 3591000 3647254 3713573 3571052 3341514 3294311 3263060
19041C263060j35549j5479r6570n005L72405J8903j07340r1993r3161q5903o4495
$$ 3263060 3127511 3112032 3015462 3010457 3382862 3401765 3294425 3202432 3109271 3023368 2958873
19030B958873j0828k37008j2868N6468o8345L3137j41987J06799R7151Q8008o0592
$$ 2958873 2948045 2711037 2698169 2754637 2686292 2719429 2577442 2684241 2781392 2869400 2808808
19019B808808j19005J9013O3595Q9198K5662K42330K01254l2829J7937j58210
$$ 2808808 2689803 2708816 2772411 2861609 2887271 3129601 3330855 3298026 3315963 3157753
19009C157753k05725j50242Q230m6397l616j7890J8322M0304N2996L3655j85019
$$ 3157753 2952028 2801786 2810016 2763619 2760003 2742113 2760435 2800739 2853735 2887390 2702371
18998B702371l52346J46892L8871j21616j31120j23372q9419j2106J05026n3059
$$ 2702371 2350025 2496917 2535788 2414172 2283052 2159680 2070261 2058155 2163181 2110122
18988B110122q9409R8326M2517R551J82532M880N1232O7241K54442k9469J5197
$$ 2110122 2020713 2119039 2161556 2171107 2353639 2358519 2409751 2476992 2731434 2701965 2717162
18977B717162j44800J76245Q6988m7299J82648P8244j29441k13612k06922q6257
$$ 2717162 2572362 2748607 2835595 2788296 2970944 3049188 2919747 2706135 2499213 2412956
18967B412956N5743m7001J78528M4200K5705J13663J33048m060N5082K98607K75469
$$ 2412956 2468699 2421698 2600226 2644426 2670131 2783794 2916842 2912782 2967864 3266471 3541940
18956C541940P5362K9088m36479j08466J7649j32090p4908M8196J31982N3280
$$ 3541940 3617302 3646390 3209911 3101445 3119094 2987004 2912096 2960292 3092274 3145554
18946C145554q8036P7J22046j20619l11733p4048N5615p8427j96676o9834N788
$$ 3145554 3057518 3057595 3179641 3059022 2747289 2673241 2728856 2650429 2453753 2383919 2389707
18935B389707j59995K3336o7354j1196k0300m6921P1773m3793j01390L1022L0279
$$ 2389707 2229712 2253048 2185694 2174498 2154198 2107277 2179050 2135257 2033867 2064889 2095168
18924B095168J46937r9427j25533N8408n3520q7941K8122j53615m5262Q3353k8353
$$ 2095168 2242105 2142678 2017145 2075553 2022033 1934092 1962214 1808599 1763337 1846690 1818337
18913A818337L0328l8749k02591L9998O9627J1336R0567L9197O2393r5827N512
$$ 1818337 1848665 1809916 1607325 1647323 1716950 1728286 1818853 1858050 1920443 1824616 1830128
18902A830128J63463j13003N1792j7443l6286r3417n6654J43734J51750n0061
$$ 1830128 1993591 1880588 1932380 1914937 1878651 1785234 1728580 1872314 2024064 1974003
18892A974003K4426L68843L39891L72880K12011L11807L21001K66552K13595K15176
$$ 1974003 1998429 2367272 2707163 3080043 3292054 3603861 3924862 4191414 4405009 4620185
18882D620185P5128j83506M1805j12861k53018k67435k39819k23794J1235l4098
$$ 4620185 4695313 4511807 4553612 4440751 4187733 3920298 3680479 3456685 3467920 3433822
18872C433822K5172r5490j9849K06184J62136j15734k12542k22381j51480j71981
$$ 3433822 3458994 3363504 3343655 3549839 3711975 3596241 3383699 3161318 3009838 2837857
18862B837857j06363N0854M8750Q2563K97603N56992N09875M36583L26436O548
$$ 2837857 2731494 2782348 2831098 2913661 3211264 3768256 4278131 4714714 5041150 5047698
18852E047698J15005m2920m58768o51141o45272l60122k53245k74087j72269k32843
$$ 5047698 5162703 5119783 4661015 4009874 3364602 3004480 2751235 2477148 2304879 2072036
18842B072036q3592K8501k5186j4678K00133N7833K18340K79805J10991q854K2386
$$ 2072036 1988444 2016945 1991759 1977081 2177214 2235047 2453387 2733192 2844183 2835329 2857715
18831B857715J41480J48731K00896K48406J71209J0452j41583k23008k44575Q81
$$ 2857715 2999195 3147926 3348822 3597228 3768437 3778889 3637306 3414298 3169723 3170604
18821C170604r3929j20423j6124k3087m4261j81161r2789j30064k18839j35769
$$ 3170604 3076675 2956252 2940128 2917041 2872780 2691619 2598830 2468766 2249927 2114158
18811B114158j02838o3710K38612M18388J39302J96662J54079L30780L31626N58372
$$ 2114158 2011320 1947610 2186222 2604610 2743912 2940574 3094653 3425433 3757059 4315431
18801D315431P56516P38793N23037m2274k62685m99967n43339o95190o55418m55350
$$ 4315431 5071947 5810740 6333777 6291503 6028818 5528851 4985512 4290322 3634904 3179554
18791C179554k21109k09989k47464k94501j99843j73103j0029m8087Q8935K14432
$$ 3179554 2958445 2748456 2500992 2206491 2006648 1833545 1823516 1775429 1864364 2078796
18781B078796j2446K13032M2390K3279j20494j26465j34559L8353l5491J1369
$$ 2078796 2066350 2279382 2321772 2345051 2224557 2098092 1963533 2001886 1966395 1977764
18771A977764J52551Q4303K28989J48909J95959J87029j97024k37270q0724M1202
$$ 1977764 2130315 2214618 2443607 2592516 2788475 2975504 2778480 2541210 2460486 2501688
18761B501688q2909m5680o0909l70328j81422j63914j27182L16966J96540J6130
$$ 2501688 2418779 2373099 2312190 1941862 1760440 1596526 1469344 1786310 1982850 1998980
18751A998980n9396M6396j19657p9412j42521l1197j32923k42858k27238J08197
$$ 1998980 1939584 1985980 1866323 1786911 1644390 1613193 1480270 1237412 1010174 1118371
18741A118371K01413j18849j26053K6940J3509o5593P5614J05892Q6748O5065
$$ 1118371 1319784 1200935 1074882 1101822 1115331 1049738 1125352 1231244 1317992 1383057
18731A383057O3903N3049J71381K14666L07997J78878n935p4198o3262r1892k20679
$$ 1383057 1446960 1500009 1671390 1886056 2194053 2372931 2366996 2292798 2229536 2137644 1916965
18720A916965n8860n2299j66161q7075j93860j10656O2951J02695J8730k80965
$$ 1916965 1858105 1805806 1639645 1552570 1358710 1248054 1311005 1413700 1432430 1151465
18710A151465k45489l488J81877K48478j5268r5709m5233k8948j26885o0617j03880
$$ 1151465 905976 902488 1084365 1332843 1317575 1221866 1176633 1147685 1020800 960183 856303
18699H56303j34476J13082Q7220O2888K03371N5189L9174n9213j70862J6179J6396
$$ 856303 721827 834909 922129 985017 1188388 1243577 1282751 1223538 1052676 1068855 1085251
18688A085251N1847N1893P4361o3616Q0021q069j15855K2823n058J17863O6400
$$ 1085251 1137098 1188991 1263352 1199736 1279757 1271688 1155833 1178656 1173598 1291461 1357861
18677A357861J1493j44471M7967L2517o9169j27513J1270m8414j60558j20135
$$ 1357861 1369354 1224883 1272850 1305367 1236198 1108685 1119955 1071541 910983 790848
18667G90848r2682J56255J02145k1933k49555j21410l9103L3925J36575K6961
$$ 790848 698166 854421 956566 934633 685078 563668 524565 558490 695065 722026
18657G22026J62957K51717M3327L1101O2079J09109N34190P59171N09607l580
$$ 722026 884983 1136700 1180027 1211128 1273207 1382316 1916506 2675677 3185284 3181704
18647C181704j97047l31354m89634k33691l3973N1900J75408K95204M01180N28835
$$ 3181704 2984657 2653303 2163669 1929978 1896005 1947905 2123313 2418517 2819697 3348532
18637C348532J31564j87874j67694l36309n08623m96430o9350o6045N0345J83233
$$ 3348532 3480096 3292222 3124528 2788219 2279596 1783166 1713816 1647771 1698116 1881349
18627A881349l1792K9089J30959K17573K62787L90990N17944O24375O33148N42641
$$ 1881349 1849557 1878646 2009605 2227178 2489965 2880955 3398899 4023274 4656422 5199063
18617E199063N00330L54659J75455J45895K06661J17756P0423j40255k19329J26814
$$ 5199063 5699393 6054052 6229507 6375402 6582063 6699819 6770242 6629987 6410658 6537472
18607F537472O9477J04559J27597J49511J5400M195l47170m94560m05279l05332
$$ 6537472 6606949 6711508 6839105 6988616 7004016 7008211 6661041 6166481 5761202 5455870
18597E455870o5264J14989L84023N25855L55831j61595n77507q89481r34632p18087
$$ 5455870 5390606 5505595 5889618 6415473 6771304 6609709 6032202 5142721 4208089 3490002
18587C490002m17013K2844J14691M13905Q20347O87929L55057j79196o42058p22466
$$ 3490002 3072989 3095833 3210524 3624429 4444776 5132705 5487762 5308566 4666508 3944042
18577C944042o65732n22496k19333k84632j44035j23074J09134R228k6264l6749
$$ 3944042 3278310 2755814 2536481 2251849 2107814 1984740 2093874 2103102 2076838 2040089
18567B040089j03648J8239K6279J3866J59410M4570j42219K2154o5277j0224N3211
$$ 2040089 1936441 1954680 1980959 1994825 2154235 2198805 2056586 2078740 2013463 2003239 2056450
18556B056450K18276N1407k5726k050P8955n979k7951q2745N2692K5757J06534
$$ 2056450 2274726 2326133 2300407 2298357 2377312 2371333 2343382 2260637 2313329 2339086 2445620
18545B445620j6295k9876l2733j89372n7544j51861j11722J96093J41405J67913
$$ 2445620 2429325 2399449 2366716 2177344 2119800 1967939 1856217 2052310 2193715 2361628
18535B361628l3539j10411j6130R2294M00088K84313L44921K52935J39951K96905
$$ 2361628 2328089 2217678 2201548 2293842 2693930 2978243 3323164 3576099 3716050 4012955
18525D012955L06996J17908J02074N2175J54181K50693L23971L52771M21656O84394
$$ 4012955 4319951 4437859 4539933 4592108 4746289 4996982 5320953 5673724 6095380 6779774
18515F779774O90429P45210P99883Q45483R06832Q28580O75634Q93660J409431
$$ 6779774 7470203 8215413 9015296 9860779 10767611 11596191 12271825 13165485 14574916
18506A4574916J622934J882218K575213L381117M217632N372431P194944R632264
$$ 14574916 16197850 18080068 20655281 24036398 28254030 33626461 40821405 50453669
18498E0453669J2757184J6587557J9861154J9694323J4181688M701171m943088
$$ 50453669 63210853 79798410 99659564 119353887 133535575 138236746 133293658
18491A33293658j0842759j1750090q895600l766484J831553P189291J1394177
$$ 133293658 122450899 110700809 101805209 98038725 99870278 107059569 118453746
18484A18453746J1873508P136711j649804j0560499j6159868j7408441j5740472
$$ 118453746 130327254 137463965 135814161 125253662 109093794 91685353 75944881
18477G5944881j2584401r482070p248593n635028m477136l691231k758592k081500
$$ 75944881 63360480 53878410 46629817 40994789 36517653 32826422 30067830 27986330
18469B7986330j588448j367850j221948q85374o34302m26548m85974k68113M38794
$$ 27986330 26397882 25030032 23808084 22922710 22288408 21861860 21375886 21107773 21546567
18460B1546567N59866P34141J027706J226016J347188J360182J460067J751116
$$ 21546567 22106433 22840574 23868280 25094296 26441484 27801666 29261733 31012849
18452C1012849K000227K592604L683035M699540N991167P999804J0391536J3488729
$$ 31012849 33013076 35605680 39288715 43988255 49979422 57979226 68370762 81859491
18444H1859491J7624960K3199706L1129391L9653649M5839670M3824878K9800021
$$ 81859491 99484451 122684157 153813548 193467197 239306867 283131745 312931766
18437C12931766Q230608j2298677k4525944k5854281j7982738n897782P466423
$$ 312931766 321162374 308863697 284337753 258483472 240500734 234602952 242069375
18430B42069375K0522033K9156883K8444519J5391213o178099k7067669m0341946
$$ 242069375 262591408 291748291 320192810 335584023 329405924 302338255 261996309
18423B61996309m3417120l8920710l1542294k4654277j8909283j4793983j1754045
$$ 261996309 218579189 179658479 148116185 123461908 104552625 89758642 78004597
18416G8004597r344022p279285n864097m885903m020312l356238l003978k424668
$$ 78004597 68660575 61381290 55517193 50631290 46610978 43254740 40250762 37826094
18408C7826094k368731k400810k335567k128546j770263j401508j135982o78404
$$ 37826094 35457363 33056553 30720986 28592440 26822177 25420669 24284687 23606283
18400B3606283n55503l57283l38778m53019m29162p47523o48570m55929m74188
$$ 23606283 23050780 22693497 22354719 21901700 21472538 20725015 20076445 19620516 19146328
18391A9146328j34350o615K8951J85518K77143L42141L40722L78031L01914R7599
$$ 19146328 19011978 19005363 19034314 19219832 19496975 19839116 20179838 20557869 20859783 20957382
18381B0957382J74654J12725J50663M61769R44315J458602J990899K470143K401400
$$ 20957382 21132036 21244761 21395424 21857193 22801508 24260110 26251009 28721152 31122552
18372C1122552K750778L526998M411805N614175P111654R254949J2450987J7280551
$$ 31122552 33873330 37400328 41812133 47426308 54537962 63792911 76243898 93524449
18364I3524449K3760084L2111702M1724704N0875182N7740759N8959330N3589256
$$ 93524449 117284533 149396235 191120939 241996121 299736880 358696210 412285466
18357D12285466M2498017K8018336J2463523l386244j9860784l5823806m8757590
$$ 412285466 454783483 482801819 495265342 491879098 472018314 436194508 387436918
18350C87436918n5813092n6247950n0988130m2634251l3959772k5988289j9856496
$$ 387436918 331623826 275375876 224387746 181753495 147793723 121805434 101948938
18343A01948938j5115784j1844535r397752p596498o189915n071956m394279l840100
$$ 101948938 86833154 74988619 65590867 57994369 51804454 46732498 42338219 38498119
18335C8498119l293401k479018k115074j813035j599125j386988p57308n04057
$$ 38498119 35204718 32725700 30610626 28797591 27198466 25811478 25054170 24550113
18327B4550113n62369o00853n35852o05808l59524k61659j48511O4613N3497M3967
$$ 24550113 23987744 23386891 22851039 22245231 21885707 21624048 21475537 21540150 21593647 21637614
18317B1637614M00564O10700R05861J452273J903051K559542L798486N201634
$$ 21637614 22038178 22648878 23554739 25007012 26910063 29469605 33268091 38469725
18309C8469725P321062J0324225J3654769J7822442K1852959K4323136K4425011
$$ 38469725 45790787 56115012 69769781 87592223 109445182 133768318 158193329
18302A58193329K1686006J6756729J0241876L419744l210892r695234j6120119
$$ 158193329 179879335 196636064 206877940 210297684 207086792 197391558 181271439
18295A81271439k1264520k3750548k3332154k0804783j7433360j3657170j0427567
$$ 181271439 160006919 136256371 112924217 92119434 74686074 61028904 50601337
18288E0601337q217916o257717m716790l596714k812085k367260j919500j703141
$$ 50601337 42383421 36125704 31408914 27812200 25000115 22632855 20713355 19010214
18280A9010214j490809j271948j232646r95111r23793o76351n64297n34660n19909
$$ 19010214 17519405 16247457 15014811 14019700 13095907 12419556 11855259 11320599 10800690
18271A0800690l72883m40530m59098q9784j34863l22313j26291n8363m27825o09588
$$ 10800690 10427807 9987277 9528179 9438395 9303532 8981219 8854928 8796565 8368740 7759152
18261G759152m02709l35688l35041k77295j31515k84753p1337m5270k57862k60218
$$ 7759152 7356443 7020755 6685714 6408419 6276904 5992151 5920814 5875544 5617682 5357464
18251E357464l42716j52135q3669K0709q1599k42729j44453j59275k86748j05969
$$ 5357464 5014748 4862613 4778944 4799653 4718054 4475325 4330872 4171597 3884849 3778880
18241C778880P4824K51481K15591J42056R6888j83069p3586j69599k77010k53300
$$ 3778880 3853704 4105185 4320776 4462832 4559720 4376651 4303065 4133466 3856456 3603156
18231C603156k56415j72506n7026O7189J3640o438M5135M665p2241j46381J09232
$$ 3603156 3346741 3174235 3117209 3184398 3198038 3191600 3236735 3241400 3169159 3022778 3132010
18220C132010J42766N6685j48442k95858j36777j22821J14358n8197k36765k27582
$$ 3132010 3274776 3331461 3183019 2887161 2750384 2627563 2741921 2683724 2446959 2219377
18210B219377N4271j44414j38614j50518J5665L4799M9743o2619j6372l7550J08034
$$ 2219377 2273648 2129234 1990620 1840102 1855767 1890566 1940309 1877690 1861318 1823768 1931802
18199A931802J57159m7358m8242K1595K84717K92829J20703k2759J6199k1408
$$ 1931802 2088961 2041603 1993361 2014956 2299673 2592502 2713205 2690446 2706645 2685237
18189B685237j58572m5012J16368j47919k40312M9179k2133K45202Q1281Q36j74911
$$ 2685237 2526665 2481653 2598021 2450102 2209790 2258969 2236836 2482038 2563319 2564155 2389244
18178B389244k09232j15069J9625L0739j32069j20266k7086j8026l1491p5726
$$ 2389244 2180012 2064943 2084568 2115307 1983238 1862972 1835886 1817860 1786369 1710643
18168A710643M5422k0946P5792Q3310j02859k2461n6839N7314J29201k916L1519
$$ 1710643 1756065 1735119 1810911 1894221 1791362 1768901 1712062 1769376 1898577 1895661 1927180
18157A927180k9127j25822r4492N2623M3875J17156J51306j7890m8443k78533
$$ 1927180 1898053 1772231 1677739 1730362 1774237 1891393 2042699 2024809 1976366 1697833
18147A697833k07498o7669L7843L0430J45978r783L5330J12853N1146J72321R7332
$$ 1697833 1490335 1422666 1460509 1490939 1636917 1627134 1662464 1775317 1826463 1998784 2096116
18136B096116N2158m6420O8905J58735K64769M6332J04714K58149L54647M60091
$$ 2096116 2148274 2101854 2170759 2329494 2594263 2640595 2745309 3003458 3358105 3818196
18126C818196L89052L87975K75663N62862N66143M79270P73210J301022J571121
$$ 3818196 4207248 4595223 4870886 5433748 5999891 6479161 7252371 8553393 10124514
18117A0124514K216188L449338M875995P453669J2840358K4117048M8106487Q0847131
$$ 10124514 12340702 15790040 20666035 28119704 40960062 65077110 113183597 194030728
18109A94030728O8550483Q140846l3268946o5804902o3077584l7781134k0890552
$$ 194030728 262581211 270722057 237453111 171648209 108570625 70789491 49898939
18102D9898939j2551925q191931n570418l778976k690583k163270j682387j527955
$$ 49898939 37347014 29155083 23584665 19805689 17115106 14951836 13269449 11741494
18094A1741494j246459j280875r57236o29923o90557n96484l82317l13230k89723
$$ 11741494 10495035 9214160 8256924 7627001 6936444 6339960 5957643 5644413 5354690
18085E354690k43105l46556l10096j59125j05017j31725k56712k58423j98077
$$ 5354690 5111585 4765029 4454933 4295808 4190791 4059066 3802354 3543931 3345854
18076C345854k30792k19501j6903O0402P0251P4726r7250k53257j66103r594N0050
$$ 3345854 3115062 2895561 2878658 2939060 3009311 3084037 2986787 2733530 2567427 2557833 2607883
18065B607883j67279p8397q6973r8276r4987n5694j09809q381J35209J64001j60628
$$ 2607883 2440604 2362207 2275234 2176958 2081971 2026277 1916468 1908087 2043296 2207297 2046669
18054B046669j48825l8622j38196L4300j80467n6538Q5125j32650j81892m8543
$$ 2046669 1897844 1859222 1721026 1755326 1574859 1518321 1603446 1470796 1288904 1240361
18044A240361Q4878L1562j518K7834J11887k4374j48482k15725M2093K23997J03963
$$ 1240361 1325239 1356801 1355283 1383117 1495004 1470630 1322148 1106423 1148516 1372513 1476476
18033A476476j23582r3160P4507j33600q0277j72737p6243p4615l8672J05261
$$ 1476476 1352894 1259734 1334241 1200641 1120364 947627 871384 796769 758097 863358
18023H63358J38916N3268l3289N6461l3968m2181m1873k2802N417l5976L3061
$$ 863358 1002274 1055542 1022253 1078714 1044746 1002565 960692 937890 943307 907331 940392
18012I40392o1087J1523J16774J3752k5315N317N0315Q6221J26478l8454r6217
$$ 940392 879305 890828 1007602 1021354 996039 1001356 1051671 1137892 1264370 1225916 1129699
18001A129699j27944L9857o5914j16140J43485K14964k618j22270j11714J71236
$$ 1129699 1001755 1041612 975698 859558 1003043 1218007 1215389 1093119 981405 1152641
17991A152641Q3486j33124j89829k51J45833k8694j54341j30544j04106N3312
$$ 1152641 1236127 1103003 913174 912923 1058756 1030062 875721 745177 641071 694383
17981F94383m1180l1463n1111J95085K61264J30807j23504j66963J05325p1182
$$ 694383 653203 621740 570629 765714 1026978 1157785 1034281 867318 972643 901461
17971I01461l8332R6950o8200j23105J28805J29100O5313J05387P2847R7455J47964
$$ 901461 863129 960079 891879 768774 897579 1026679 1091992 1197379 1270226 1367681 1515645
17960A515645J32696R7598J03615J41054k8839j3000q8007j2845J356J949J46935
$$ 1515645 1648341 1745939 1849554 1990608 1961769 1948769 1860762 1847917 1849273 1851222 1998157
17949A998157K3515N1225M4056l8430K645p987j28107m6167k11659k55919j89235
$$ 1998157 2021672 2072897 2116953 2078523 2081168 2073181 1945074 1898907 1687248 1431329 1242094
17938A242094n6876J09007J25539o3800k03521p2773R2961o1043r1898j24135
$$ 1242094 1185218 1294225 1419764 1355964 1152443 1079670 1172631 1111588 1019690 895555
17928H95555k7058J22474J9726K0344J34240M3257j61744m5958K037j11669k31686
$$ 895555 868497 990971 1010697 1031041 1165281 1208538 1046794 1000836 1002873 891204 659518
17917F59518Q8666O5248M1563n3262j5193q3173L393J46289K03974K144K4226
$$ 659518 748184 813432 854995 801733 786540 703367 706760 853049 1057023 1059167 1083393
17906A083393Q3570J55941K15903J04975k744j53618j17446J84584O7862p7564
$$ 1083393 1166963 1322904 1538807 1643782 1641038 1487420 1369974 1554558 1622420 1544856
17896A544856r1884J04058o699M7165j2656M5383K1074R8594J4875n9168j30357
$$ 1544856 1452972 1557030 1550331 1597496 1584840 1630223 1651297 1749891 1764766 1705598 1575241
17885A575241q4318j95991l15466j31437K1319J9052l9929o240l9899j54587N5094
$$ 1575241 1490923 1294932 979466 848029 869348 888400 848471 842231 802332 647745 702839
17874G02839O735Q3181J20104N0964q7209M2269j10493j10415J1671k3911J56170
$$ 702839 709574 792755 912859 963823 876614 918883 808390 697975 709646 685735 841905
17863H41905q951J55678J4088j32769J5453Q6952o8825j05119q0364o4782K3123
$$ 841905 832954 988632 1002720 869951 885404 972356 903531 798412 718048 653266 676389
17852F76389J50535J62944o2100r2187N6599K18437N2068j72170q4175J46032
$$ 676389 826924 989868 927768 835581 892180 1110617 1162685 990515 906340 1052372
17842A052372K61055J05534K76308K31959K61457K14464O9495J18263R7272J72038
$$ 1052372 1313427 1418961 1695269 1927228 2188685 2403149 2472644 2590907 2688179 2860217
17832B860217n0118l01353k05386n2654k41987j12121k57501k64227k43331j61096
$$ 2860217 2810099 2508746 2303360 2250706 2008719 1896598 1639097 1374870 1131539 970443
17822I70443K0438o6688p5750j56718j07558o514J02436l4897j58500o720R7723
$$ 970443 990881 924193 848443 691725 584167 577653 680089 645192 486692 479972 577695
17811E77695J91884L1751J9322m8204M073o8158m9226Q7087j43530j86342N8641
$$ 577695 769579 801330 820652 772448 776521 708363 659137 746224 602694 416352 474993
17800D74993J40363O629M6569q9100R7818R0894j11941j36053J01789Q6911p7613
$$ 474993 615356 621985 668554 579454 677272 768166 656225 520172 621961 708872 631259
17789F31259k54455k980J87488K2711J37551J85839J69059J99071K54459J39742
$$ 631259 376804 373824 561312 584023 721574 907413 1076472 1275543 1530002 1669744
17779A669744K38471J58642K5170k45908r8277q4883k15031k26676q8405J2544
$$ 1669744 1908215 2066857 2092027 1846119 1747842 1662959 1447928 1221252 1132847 1145391
17769A145391r2341q8544n5115k20284l33482j59742l2074K18261J91610m2912
$$ 1145391 1053050 964506 909391 689107 355625 195883 163809 382070 573680 530768
17759E30768j03766l3619k1038K11971R6710n311j7670q7644j52276j30886R20
$$ 530768 427002 393383 372345 584316 681026 675715 658045 570401 418125 287239 288159
17748B88159J27817J81364Q8940L0393J53292o1204n3303k1037J00699p2711j02574
$$ 288159 415976 597340 686280 716673 869965 808761 755458 734421 835120 762409 659835
17737F59835K6936j00699o5748j37199J3458J27564j45035j61366p6667J58710
$$ 659835 686771 586072 520324 383125 396583 524147 379112 217746 141079 299789
17727B99789J13742r0083L3482K33778O8481m3368m3061o3734R0090k0402J45277
$$ 299789 413531 323448 356930 590708 659189 615821 572760 509026 599116 578714 723991
17716G23991l00485j49042J27256l1944K308J07104q4276k6181j24442j94763
$$ 723991 423506 274464 401720 369776 372084 479188 394912 368731 244289 49526
17706D9526K5035m0964J24799j04163o4864K34126L3951O6107N1800j14375j8128
$$ 49526 74561 33597 158396 54233 -10631 223495 257446 323553 375353 260978 242850
17695B42850J23875k0988r6763j14470Q5569J91957J38189N9944p3610j08197
$$ 242850 366725 345737 248974 134504 220073 412030 550219 610163 536553 428356
17685D28356k8803O516P7875l1039j13357J25995J04416j09822k2108N9901m7455
$$ 428356 399553 406069 483944 452905 339548 465543 569959 460137 438029 497930 450475
17674D50475J52986r5953j27737n0923J77422J06464J36084j45077j53063k54862
$$ 450475 603461 507508 379771 328848 506270 612734 748818 603741 450678 195816
17664A95816K4570N3992P6304J09927J08058j48741j13246l7116K392L745M1652
$$ 195816 220386 274378 350682 460609 568667 419926 306680 269564 271956 275701 317353
17653C17353k9798Q8440K2052N4791J32654j7706j72608O632j3192K8833K3966
$$ 317353 287555 375995 398047 452838 585492 567786 395178 401810 388618 417451 441417
17642D41417m5356N9528J38409M3107o2976K319m1194j09739j60363m9461J92183
$$ 441417 396061 455589 593998 637105 574129 576448 535254 425515 265152 215691 407874
17631D07874K92308j9479k98345j34632R7890j09791L0171j4973L07238M9213
$$ 407874 700182 680703 382358 247726 345616 235825 265996 251023 558261 607474
17621F07474l7316j87787J336m3608J60214k0230k44177j17003j45844J30186
$$ 607474 570158 382371 383707 340099 500313 480083 235906 118903 -26941 103245
17611A03245P3989M0334K03413P1841o5823l6249N617J21663K6067k95999j8976
$$ 103245 177234 217568 420981 492822 426999 390750 396367 518030 544097 248098 229122
17600B29122J1843j13730o1856o876O8350N732J26288J73446j11459n3274J28921
$$ 229122 240965 127235 65379 58503 126853 132585 258873 432319 320860 267586 396507
17589C96507K0372j31679q4174O8620l7144J22781K69624k1323j38747j7025K5007
$$ 396507 416879 285200 201026 269646 232502 355283 624907 603584 464837 447812 472819
17578D72819l19033j06007J87701O0048J3490j79824J3027N6811k6317n850J49817
$$ 472819 153786 47779 235480 295528 309018 129194 142221 199032 172715 166865 316682
17567C16682L3743p8248Q7630m2818r9183m6082K3863R7001J20259J94387k29227
$$ 316682 350425 272177 359807 316989 217806 171724 195587 292588 412847 607234 378007
17556C78007l9542L7401p4088O6563K3270j76779o0401J80267L7151n9040Q9539
$$ 378007 338465 375866 301778 368341 391611 214832 154431 334698 371849 312809 402348
17545D02348P2707M5234k29170l1968O1117J23524o3987j10298m2111k65145j04938
$$ 402348 475055 520289 291119 259151 320268 443792 379805 269507 227396 -37749 -142687
17534a42687J7888R1728N7407o3050Q4228Q3894J37968R7180J700k01998P1450
$$ -142687 -124799 -33071 24336 -38714 45514 129408 267376 364556 366256 164258 235708
17523B35708o0325J79455L0422j28198J4130Q8785n2056J71162o3576m6260J2732
$$ 235708 175383 354838 385260 257062 271192 359977 307921 479083 415507 369247 381979
17512C81979n3129K5824j30999k7584O0760L1652N2618M7864N1600k25300n4317
$$ 381979 328850 354674 223675 196091 256851 288503 341121 388985 440585 215285 160968
17501A60968J10509J68778J67814n434j79647p3934N8987k2823j4602n0169k21006
$$ 160968 271477 440255 608069 602635 422988 349054 408041 385218 370616 320447 99441
17490I9441M8028J32617J27741j59082n5428m8228P956R0277J07024J15805j76239
$$ 99441 147469 280086 407827 248745 193317 145089 153045 243322 350346 466151 289912
17479B89912j62236M4975o5538K8516J64569J33056Q2339K0321j38034k10665
$$ 289912 127676 172651 107113 135629 300198 433254 515593 535914 397880 187215
17469A87215O5909m8628L3206M7688J35583k6370j1484k7625q3549k6905J45006
$$ 187215 253124 204496 237702 285390 420973 394603 383119 355494 271945 245040 390046
17458C90046K16127o4796k1032j6756j37128n0812l8124j72582p0655O9621L02534
$$ 390046 606173 541377 520345 503589 366461 315649 277525 104943 34288 103909 406443
17447D06443J65618R1998J35032K97308N01211J28933k7891j69868m66291k87255
$$ 406443 572061 664059 799091 1096399 1597610 1726543 1698652 1528784 1062493 775238
17437G75238k11886k63161j10558m4231J9631n7205R4014r471j96665J84087L6857
$$ 775238 563352 300191 189633 145402 165033 107828 201842 192371 -4294 179793 216650
17426B16650n3780m490o6316J56j5638K182K6863k2827n0309P620P6158R5526
$$ 216650 162870 158380 92064 92220 76582 78764 105627 82800 32491 40111 116269 211795
17414B11795n2435j20558k5988m0740K17755J53044M4664O3117n6560N6302J8162
$$ 211795 159360 38802 12814 -27926 189829 342873 387537 450654 394094 450396 468558
17403D68558m0374m6524n9240j8306q3205j17425k6889J34299J03769N4698p743
$$ 468558 428184 381660 322420 304114 220909 103484 76595 210894 314663 369361 361618
17392C61618J01242q7885n7106j56479K3166j76478o7173l1007J7993Q1048N7365
$$ 361618 462860 374975 317869 161390 184556 8078 -59095 -90102 -72109 8939 66304
17381F6304P602k7609n0899J37728J39371O2576j62982o6400j67598R7087Q6744
$$ 66304 73906 46297 -4602 133126 272497 335073 172091 105691 -61907 35180 121924
17370A21924p3192j14152k9307P3301J53289N6701O5173N7699P9759r3988p5053
$$ 121924 48732 -65420 -94727 -21426 131863 188564 253737 311436 391195 297207 222154
17359B22154l610L2031N037K0361N2551N944K1421j22885m7481k00848N4079j10378
$$ 222154 218544 250575 255612 275973 328524 334468 355889 233004 185523 -15325 38754 -71624
17347g1624J56498P7969J77468L2770r1904j68592j03196l535q3395m1732K33817
$$ -71624 84874 162843 340311 373081 281177 112585 9389 5854 -77541 -119273 114544
17336A14544J28871o1606j34154J53753m8800N331N458l381j8994l4135L485K27472
$$ 114544 243415 181809 47655 201408 152608 157939 163397 160016 141022 106887 110372 337844
17324C37844J27058J44299J5793j81770j69747M6355j14595j14568J50100J66151
$$ 337844 464902 609201 624994 443224 273477 319832 205237 90669 240769 406920
17314D06920p2566q1932Q9701j56741j65278m3409J9114m4549m4789J21457J02669
$$ 406920 334354 252422 342123 185382 20104 -23305 -4191 -48740 -93529 27928 130597
17303A30597l2777j16305Q2467K25572n2341j06808n5786J51233J70491k23533
$$ 130597 97820 -18485 63982 289554 237213 130405 74619 225852 396343 172810
17293A72810j95861j79665K3552J57785L08028M7752r1510j29828j08662k1548
$$ 172810 -23051 -202716 -179164 -21379 286649 334401 242891 113063 4401 -17147
17283a7147J40187L9500j10530J78159M1731n8787J02113O5110n8889j55119o6110
$$ -17147 123040 162540 52010 230169 271900 213113 315226 380336 321447 166328 100218
17272A00218P4m2677q4356l1302Q8676j02000J1810R9918J10541j80013J20593
$$ 100218 100292 57615 -26741 -58043 30633 -71367 -59557 40361 150902 -29111 91482
17261I1482J60004j37983l5769N308j01429m671P8865J33448J6906j5610N1173
$$ 91482 251486 113503 77734 83042 -18387 -23058 55807 189255 206161 190551 241724
17250B41724K277M0577K6860o8498n5023n1351j02744O6843J32834r0535j88511
$$ 241724 244001 284578 311438 242940 187917 136566 33822 100665 233499 142964 -45547
17239d5547n9622J84656K82893K8164J2002J1878j84119j06094j694M0301k5837
$$ -45547 -105169 79487 362380 390544 402546 414424 230305 124211 122517 162818 136981
17228A36981J53715j8025o3244k9283o6809K8770k0115R8642J39969k04052Q3390
$$ 136981 290696 272671 209427 180144 113335 142105 121990 220632 360601 156549 239939
17217B39939l3273p8654o7327r0764J13019r162k7625Q3577m5010j00324r1158
$$ 239939 206666 128012 60685 -30079 82940 73778 46153 129730 84720 -15604 -106762
17206a06762J6240P3294k0930j9915O9394J35324R7106m0387m1300l4924o8194
$$ -106762 -90522 -17228 -38158 -58073 11321 146645 243751 203364 162064 127140 58946
17195E8946m4398j81989j71820N9214J31173J96829l0056n6441j8786K47162J57693
$$ 58946 14548 -167441 -339261 -280047 -148874 47955 17899 -38542 -57328 189834 347527
17184C47527J21798j8311l26828j28211p4130Q4571J36385J8263l7059j23069
$$ 347527 469325 451014 124186 -4025 -78155 6416 142801 161064 124005 936
17174I36M7605J16826J56424J9290l3491m1394o9540j22867M91j5152R2661K444
$$ 936 48541 165367 321791 341081 307590 266196 196656 73789 74280 59128 151789 154233
17162A54233J1182q8726j63223L8606Q8464o6668N2910J29470K0065l2091j14538
$$ 154233 165415 76689 -86534 -47928 40536 -26132 26778 156248 176313 144222 29684
17151B9684q792r012K4004J05755K3456q0158j3155J54075J84093j00682l11996
$$ 29684 20892 11880 35884 141639 165095 84937 71782 225857 409950 309268 -2728
17140b728j53601q486Q1182K19600l503J2173J48168j7575n6647n2913J90022
$$ -2728 -156329 -164815 -83633 135967 132464 144637 292805 275230 218583 165670 355692
17129C55692Q1322j43930o6965M910P9169J57438j99166j93063O6528J18486l2060
$$ 355692 437014 293084 226119 231029 310198 467636 268470 75407 141935 260421 228361
17118B28361r3017j15642J69526J10991L5382j70717q0417O325l0262L7878j27196
$$ 228361 135344 19702 189228 300219 335601 164884 84467 90792 60530 98408 -28788
17107b8788J04812L20708j4153r6838l0774j8588n4483m7791m9204R8791Q8662
$$ -28788 76024 396732 382579 285741 254967 236379 181896 134105 84901 183692 272354
17096B72354q2154j46461o2734j6905M7025j47370N6157J18954J8128K1963J0005
$$ 272354 190200 43739 -18995 -35900 11125 -136245 -80088 38866 56994 78957 88962
17085H8962k7796M0050J63234Q4071Q5971j26300K8069o9957m1334j3948j24788
$$ 88962 61166 101216 264450 348521 434492 308192 336261 266304 224970 211022 86234
17074H6234R5564J88062q1121q3569q5881l4872j48851m2834J64834M6350J09039
$$ 86234 181798 369860 288739 205170 119289 84417 -64434 -107268 57566 103916 212955
17063B12955k0720k92906L349N5737K7470k8229Q6524R5465k4374J8418n5056
$$ 212955 192235 -100671 -97322 -41585 -14115 -42344 44180 139645 115271 133689 78633
17052G8633k2865l5435J71565L5363k991m0149Q4181J99733O2458o0452j15398
$$ 78633 55768 20333 191898 227261 224270 184121 268302 468035 530493 470041 354643
17041C54643k02764J9657k7883K6410K994q4103j31049K3153J72938Q6870o5365
$$ 354643 151879 171536 143653 170063 173057 88954 -42095 -18942 153996 240866 175501
17030A75501K32876J30233j48102R1076R4236p2273m6096j6979j51234R9061R927
$$ 175501 408377 538610 390508 481584 575820 503547 457451 440472 289238 388299 398226
17019C98226p2538n341M330j08076j969j24258q7430M6716p6884J53820J35213
$$ 398226 325688 320347 324677 216601 214632 90374 2944 49660 -27224 126596 261809
17008B61809J2194K6550m1183j15168o8822J17952K8612j16447M8094k157m1670
$$ 261809 274003 300553 259370 144202 75380 193332 221944 105497 153591 151434 109764
16997A09764J0729J17375o5876k30233N0300K25898L7610m2778j07673n0662L9310
$$ 109764 120493 237868 171992 -58241 -7941 217957 255567 212789 105116 54454 93764
16986I3764J5446L6177N8563k014L4892j2461J2768R3993q4069n1806o492j78422
$$ 93764 109210 145387 203950 201936 236828 224367 237135 331128 247059 195253 188761 10339
16974A0339k64667l425K57034R6778J36884M5982k05629p4040N2837l3355l5514
$$ 10339 -254328 -257753 -719 96059 232943 278925 73296 -744 52093 18738 -16776
16963a6776j8337J05314N6257l8344K4487P8414L8078q8599K9866M4597k8650
$$ -16776 -35113 70201 126458 88114 112601 191015 229093 140494 170360 214957 186307
16952A86307k0609K12692J5227j85366m3436J24472O3865j46536J20128O8810
$$ 186307 165698 378390 393617 208251 164815 289287 353152 206616 326744 395554
16942C95554j83116m9245Q6768L942J27276K1083k2830j17668K9829p3703j06071
$$ 395554 212438 163193 249961 253903 381179 402262 379432 261764 291593 217890 111819
16931A11819J93987l0422j48393k38523q3862J02306J91435J76945N3371P0135
$$ 111819 305806 275384 126991 -111532 -195394 -93088 98347 275292 328663 398798
16921C98798j30244j10042j15241j38091N9325J6167L1176q8621q3796p499r8040
$$ 398798 268554 158512 43271 -94820 -35495 -19328 11848 -76773 -160569 -168068 -266108
16910b66108p2131j6343J48153K97665K04309n7760K5805Q4975N3025L1676M4772
$$ -266108 -338239 -354582 -206429 91236 295545 237785 263590 348565 401590 433266 478038
16899D78038k65255r1764r865L7038J01460r5899r549m4393j6801J894r9152L513
$$ 478038 212783 121019 111154 148192 249652 153753 144204 99811 83010 84904 -14248 -10735
16887a0735P1401M0138k7257Q2958M8222J5248j46618q9107P4101j6310O6896
$$ -10735 60666 100804 73547 156505 204727 219975 73357 -15750 58351 42041 108937
16876A08937J49477j7585k38643m6055K1397l570J01529J4388N0341j4658Q1522
$$ 108937 258414 240829 2186 -43869 -22472 -26042 75487 89875 140216 125558 207080
16865B07080k19868p1162J05512J18938l1535j90286m5705K13425r8097k58650
$$ 207080 -12788 -83950 21562 140500 108965 -81321 -127026 86399 -11698 -270348
16855b70348r608R4711L9071j15718q3776O3690K12184L7221N5768k077j28003
$$ -270348 -279956 -185245 -146174 -261892 -345668 -281978 -69794 -32573 23195 21118 -106885
16844a06885L9636P6646p7606l073Q5556o3312j03697k4530K3657R8049J82806
$$ -106885 -67249 9397 -68209 -71282 14274 -49038 -152735 -177265 -153608 -55559 127247
16833A27247m2696j31038j36618O6723J33815N1525J37405j03351N2414l2563
$$ 127247 84551 -46487 -183105 -116382 17433 68958 206363 103012 155426 122863
16823A22863J03682J57138R520j0976K3954k64894J6290j2703n4060j49205j0875
$$ 122863 226545 383683 393203 382227 406181 141287 157577 144874 90814 -58391 -69266
16812f9266L5668J25564L8537Q5715k1496j14238n9051N3735k40662J2900J18293
$$ -69266 -33598 91966 130503 216218 194722 80484 21433 75168 -165494 -152594 -34301
16801c4301k4501J0783k7335Q0783J06231p8197J33546k9142O627r200j5936k7269
$$ -34301 -58802 -48019 -75354 5429 111660 33463 167009 137867 144494 135294 119358 92089
16789I2089l1435j10188o0291J22916K38227N9873r0099K01670k07436j54902
$$ 92089 60654 -49534 -109825 13091 251318 311191 221092 422762 215326 60424
16779F0424J12911J60003j04522q487J45209k04594k09576j04975J14368m7202
$$ 60424 173335 333338 228816 220329 365538 160944 -48632 -153607 -39239 -86441
16769h6441N2903j0078P5470n3742m5560j04221j07611n216K05123L1698J9299
$$ -86441 -33538 -43616 31854 -21888 -67448 -171669 -279280 -284496 -79373 -47675 -28376
16758b8376L5535R9309r8189j41541Q255k2148j2093r648o8144O424R2992K3357
$$ -28376 7159 106468 8279 -133262 -125007 -147155 -159248 -168896 -237040 -230616 -137624 -114267
16746a14267P6626L9333n1696L7249K61750K4613q0204Q2179L1181j5033j06191
$$ -114267 -37641 1692 -50004 -12755 248995 273608 193404 275583 306764 291731 185540
16735A85540j55169J0322M4210o408j31648P1098J96517j1597M2890n1325n8003
$$ 185540 30371 40693 84903 78495 -53153 17945 214462 202865 245755 194430 136427
16724A36427m009j36474q2973O9161J68376J06703P0957o7010p7639R6029l8744
$$ 136427 132418 -4056 -87029 -17868 150508 257211 328168 261158 183519 279548 240804
16713B40804m9683l9122J9244l2335k5415l8060o3005m0916P2752l6653Q4898
$$ 240804 191121 151999 171243 138908 113493 75433 12428 -28488 44264 7611 92509
16702I2509M4684R2125P2151j06294j30443P8715J66920o801q8627L3029j80203
$$ 92509 137193 229318 301469 195175 64732 143447 310367 303566 214939 247968 67765
16691F7765k25241j44480n7966K15634J03903J1646J5406j00258M8503q7568O
$$ 67765 -157476 -301956 -359922 -144288 -40385 -28739 -13333 -113591 -65088 -152656 -152650
16680a52650o1827R678K1807R3383n6436J64447K5683j9670j6215J53q7775L7522
$$ -152650 -214477 -204799 -182992 -89609 -146045 18402 44085 24415 8200 8353 -79422 -41900
16668d1900J9994m5668k593M150k3740k6568l7692o8716N8841q613j1194K4334
$$ -41900 -21906 -67574 -70167 -66017 -89757 -116325 -154017 -222733 -163892 -172505 -183699 -159365
16656a59365K40929J36948j40010m1860P721m9825k7365R3463J02727J18836Q1480
$$ -159365 81564 218512 78502 36642 44363 -5462 -32827 60636 163363 282199 363679
16645C63679j74457k1113Q1664r8031n4653L034o0557n4875j45741j11903n5910
$$ 363679 189222 168109 249773 151742 97089 100123 39566 -15309 -161050 -272953 -328863
16634c28863O1505J16315j3294j83362N0982o0659Q4876K09923J22237L1488k54177
$$ -328863 -267358 -151043 -164337 -347699 -296717 -357376 -272500 -62577 59660 91148 -163029
16623a63029N1004O5730J57554O7750J21713N9864j67713k21053j34363n6P2461
$$ -163029 -112025 -46295 111259 179009 300722 360586 192873 -28180 -162543 -162599 -90138
16612i0138r9567p7482l1863N7862l6882P7534R0935l2863M1184P9575J64059
$$ -90138 -189705 -267187 -299050 -241188 -278070 -200536 -109601 -142464 -101280 -21705 142354
16601A42354k2171j01102q1457j4130Q4947J82716J05595j58297o1478k2195L1838
$$ 142354 120183 19081 -62376 -76506 8441 191157 296752 138455 76977 54782 86620
16590H6620j48927J49112J50653J8543j96448j33025q6748J36204l4381J97232
$$ 86620 -62307 86805 237458 256001 59553 -73472 -160220 -24016 -58397 138835
16580A38835J98168j58656j1722j26711p8744Q613Q2194j58689m7726Q7730j71698
$$ 138835 337003 178347 166625 39914 -38830 -30217 51977 -106712 -154438 -66708 -238406
16569b38406j87642J99074K97563J16889m8533j80149j03900q254K072J44199
$$ -238406 -426048 -226974 70589 187478 138945 -41204 -145104 -153358 -151286 -7087
16559g087J94167L3687j79732j11196j199m4868j24164j22792J1250J89144k5172
$$ -7087 187080 220767 41035 -70161 -71360 -116228 -240392 -363184 -351934 -162790 -187962
16548a87962J067J80501K58246j47858k23030q5402n2687n1342k5261l7103K76406
$$ -187962 -186895 -6394 251852 103994 -119036 -204438 -257125 -308467 -333728 -370831 -94425
16537i4425N5613J13361L2862q9165k18853M4256K4309l4441m5917J76065J4024
$$ -94425 -38812 74549 107411 18246 -200607 -156351 -132042 -166483 -212400 -36335 -22311
16526b2311j46924K2573j00383J36103R7246J37668j4597L2573O432q126n5385
$$ -22311 -169235 -146662 -247045 -110942 -13696 123972 109375 141948 148380 140254 84869
16515H4869J2589m1145n8476J70071K7579j40412P7879P2892K1450j26990o7729
$$ 84869 97458 56313 -2163 167908 195487 55075 132954 205846 227296 100306 32577
16504C2577k5632M5745q0077N1528J58001m2149l8024j37065q5140o224J80843
$$ 32577 6945 52690 -27387 24141 182142 139993 101969 -35096 -120236 -126460 54383
16493E4383j6256j10922L2565P9321M0578k3072m4769j9184n3070R9532O6396
$$ 54383 38127 -72795 -40230 39091 79669 56597 11828 -7356 -60426 39106 105502
16482A05502q3817o0469M7914M9875L5280j32678J72017l414l95911q0025P4497
$$ 105502 21685 -38784 9130 59005 94285 -38393 133624 130210 -265701 -345726 -271229
16471b71229k8435Q7208K16723M0054j23270p4647L0033M2088l5976P2812j17172
$$ -271229 -299664 -212456 4267 44321 -78949 -153596 -123563 -81475 -117451 -44639 -161811
16460a61811K7971N4885o4117j7692Q6269J05825J16397j04195j21120l3850l8854
$$ -161811 -133840 -78955 -143072 -160764 -74495 31330 147727 43532 -77588 -111438 -150292
16449a50292o5865j4852L3107L9750J70516l9243j18536R2764J76709l8781M4565
$$ -150292 -216157 -231009 -197902 -158152 12364 -26879 -145415 -52651 124058 85277 129842
16438A29842L5237k5995p9413m1550J57171l2577j02471j582j592p300j94232
$$ 129842 165079 139084 59671 18121 175292 142715 40244 38662 37070 29770 -164462
16427a64462n7022J37976J82468K4357l2125j6076K7571R2026m2591k25514j22486
$$ -164462 -221484 -83508 98960 123317 91192 75116 102687 194713 152122 -73392 -195878
16416a95878n9240r972M3664m8370Q6305j13793j3719J72778K8961l1562k598
$$ -195878 -255118 -265090 -221426 -269796 -183491 -297284 -311003 -138225 -109264 -140826 -143424
16405a43424n4656R1164K2549j38271p1969K01173J7939k05264j39214M1019P0847
$$ -143424 -198080 -106916 -84367 -222638 -294607 -93434 -75495 -280759 -419973 -378954 -308107
16394c08107P2248R6690J94478J3896p9280l8773k4425j25421L953J29124J6365
$$ -308107 -235859 -139169 55309 69205 -10075 -48848 -73273 -198694 -194741 -65617 -49252
16383d9252J77067J14341j39327j05455p2873R1095J23025M0127j86490j77289
$$ -49252 127815 242156 102829 -2626 -75499 15596 138621 178748 -7742 -185031
16373a85031l3158J2027J05872L4470q1729M4059K0000p5586J9540j55692Q0530
$$ -185031 -218189 -206162 -100290 -65820 -147549 -103490 -83490 -159076 -139536 -295228 -214698
16362b14698K74769J02216j75696k10423O368M9065p8612J7889K57987J65132
$$ -214698 60071 162287 -13409 -223832 -217464 -168399 -247011 -229122 28865 193997
16352A93997m9389j23565k4055o8850j39973K38908L5099l5570l0522O2049r861
$$ 193997 144608 21043 -3012 -71862 -211835 27073 62172 26602 -3920 58129 48268
16341D8268p6441J74280J15255q2581p3284q3120j33276j56092j5226R7286l1642
$$ 48268 -28173 146107 261362 178781 105497 22377 -110899 -266991 -282217 -184931 -216573
16330b16573J86077J44589J5997M1478K7795m446N6599Q353j29983l6804j607
$$ -216573 -30496 114093 130090 171568 199363 194917 251516 259869 129886 93082 91475
16319I1475r085o053Q4913R3194l0750r6952p5850J32581n1618Q3124K202n9519
$$ 91475 82390 76337 161250 254444 223694 126742 50892 183473 131855 214979 217181 157662
16307A57662j11630j56717j81807J3341J1954O8627J98144o4213j25285P7574
$$ 157662 46032 -110685 -292492 -279151 -267197 -198570 -426 -64639 -189924 -112350
16297a12350J49891P0635k84007q8352J0436Q9684J48714O2623j61372L715K74662
$$ -112350 37541 108176 -175831 -264183 -253747 -164063 -15349 47274 -114098 -110383 164279
16286A64279P7355P9629j31912k04424j09867m1230M3449K0431o2662J4649J73478
$$ 164279 241634 321263 189351 -15073 -124940 -166170 -122721 -102290 -164952 -150303 23175
16275B3175M0408o473m6510K0276J9550j9990k4792j60932J763J91739L9963j02894
$$ 23175 63583 57110 10600 30876 50426 30436 5644 -155288 -153525 38214 78177 -24717
16263b4717J14039J06094j48077j67835k21716k2498J22417M0602R0069j264P5824
$$ -24717 89322 195416 47339 -120496 -342212 -364710 -242293 -201691 -111622 -112886 -37062
16252c7062J9250n0618n3306j79571O1102K5536R1484L5240j40283p0198j33594
$$ -37062 -17812 -68430 -121736 -301307 -240205 -214669 -123185 -87945 -228228 -298426 -432020
16241d32020R7822L5359R0659K79266P7329M5579j47564l9038k01906j49188M6110
$$ -432020 -334198 -298839 -208180 71086 148415 193994 46430 7392 -194514 -343702 -297592
16230b97592R8566L7542m9742k2435J70646J31683R7915m5426p1627q3403p2599
$$ -297592 -199026 -161484 -211226 -233661 -63015 68668 166583 121157 49530 -33873 -106472
16219a06472Q7404J21758k2713L0134P041j42980O1869l0605j9210m0639k28589
$$ -106472 -19068 102690 79977 110111 117152 -25828 36041 5436 -13774 -54413 -283002
16208b83002L2669Q1100N8242J1865j47496K7763K15071J71667P6630p7610J9673
$$ -283002 -250333 -169233 -110991 -99126 -246622 -218859 -3788 167879 244509 166899 186572
16197A86572r6153k0908k06280R1822J75788j18686j45702N013J6717R6381j26473
$$ 186572 90419 69511 -136769 -44947 130841 12155 -133547 -128534 -111817 -15436 -141909
16186a41909O5506J48830j44382o201K4466j9719m5056M8326r6496k195K09699
$$ -141909 -76403 72427 -71955 -78156 -53690 -73409 -118465 -70139 -166635 -168830 40869
16175D0869R047l3717m4434j87461p7495K18031K03869j17536j64800j11513o2735
$$ 40869 49916 16199 -28235 -215696 -293191 -75160 128709 11173 -153627 -265140 -327875
16164c27875K89529K3082o9895p2650n2969n8616N6754K4018R8865K16635J05859
$$ -327875 -38346 -15264 -85159 -157809 -210778 -269394 -212640 -188622 -89757 126878 232737
16153B32737l4894j46598k688J26062j28674m1284N9483K9132p879O2839J89403
$$ 232737 197843 51245 48557 174619 45945 4661 64144 93276 85397 148236 337639
16142C37639j07255k95924k00819n7302j5624J03389J73285J68886J04534j7799
$$ 337639 230384 -65540 -266359 -323661 -339285 -235896 -62611 106275 210809 193010
16132A93010o4659j71871l9464q9936m5434J22137o1208J24818O3415l507j45284
$$ 193010 128351 -43520 -82984 -172920 -218354 -96217 -157425 -32607 30808 27301 -117983
16121a17983j67182J29282q911M7680J25932P5713O4813n7687N7685r1791k3942
$$ -117983 -285165 -155883 -164794 -117114 8818 84531 149344 91657 149342 57551 33609
16110C3609m3149J35750l0638q4805N8580j79748q4602J12408J11967n8304O1986
$$ 33609 -9540 126210 95572 10767 69347 -110401 -195003 -82595 29372 -28932 33054
16099C3054M2927j17252j15832Q0589K11042K7781j09415j73975q1266p0423n4211
$$ 33054 75981 -41271 -157103 -76514 134528 162309 52894 -121081 -202347 -272770 -326981
16088c26981J52688N2450m5665J0195K0609p101P3502J19241J23880k24334j52008
$$ -326981 -174293 -121843 -167508 -157313 -136704 -143805 -70303 48938 172818 -51516 -203524
16077b03524O3200P3427n0849k2851Q649J81109K7857j83594K8397N4418j47476
$$ -203524 -140324 -66897 -117746 -140597 -131948 49161 77018 -106576 -78179 -23761 -171237
16066a71237k12086N476K41282k7582l9284K55184j473j06394r453J57505N5323
$$ -171237 -383323 -377847 -136565 -164147 -203431 51753 50280 -56114 -65567 91938 147261
16055A47261k34078O4031J64079K606m1277R4614j4821l0290l1256j76452o7743
$$ 147261 -86817 -22786 141293 143899 102622 197236 182415 152125 120869 -55583 -123326
16044a23326J96534j41236j14489J41916O8243k85019j22962r4695p1162j1301
$$ -123326 73208 -68028 -182517 -40601 27642 -257377 -380339 -475034 -546196 -557497
16034e57497M4998J19781m0674J07729J93315M3766J5040O6621j59927n356P9360
$$ -557497 -512499 -392718 -433392 -325663 -132348 -88582 -73542 -6921 -166848 -172204 -92844
16023i2844J33868J19060P2198n9024R7544R566m5870q9413k06081j56138J6385
$$ -92844 41024 160084 232282 173258 270802 280368 234498 145085 -60996 -217134 -200749
16012b00749J17061o5800O6739r7588p8641j6112p0360R3427J69320J4944l3323
$$ -200749 -83688 -149488 -82749 -180337 -258978 -275090 -345450 -252023 -82703 -67759 -101082
16001a01082J566p7223J00745p8899O0393j90587j65426O6684j20400K05549R5039
$$ -101082 -99516 -176739 -75994 -154893 -94500 -285087 -450513 -383829 -504229 -298680 -203641
15990b03641J88980L1449q5896o7468J35230p1104k1256k2516j55796j67204K6864
$$ -203641 -14661 16788 -69108 -136576 -1346 -72450 -93706 -116222 -272018 -439222 -412358
15979d12358M5848M838K87601J16718J47860L533L2098j37979j67012K3550l2628
$$ -412358 -366510 -361672 -74071 42647 190507 194040 226138 88159 -78853 -55303 -87931
15968h7931k9625j4968J78602J35210q8237n3152J8470l1222k7667J08408J26843
$$ -87931 -117556 -132524 46078 181288 93051 39899 58369 27147 -520 107888 234731
15957B34731j275m2098J7426k234O9283j0975n6757K6520N4484j39726j07594
$$ 234731 233456 191358 208784 206550 275833 264858 208101 234621 289105 149379 41785
15946D1785n0822n9816p0218r6886J17565J14889L8693l1796L7677R06j10585
$$ 41785 -9037 -68853 -139071 -235957 -118392 -3503 35190 3394 41071 41977 -68608
15935f8608K9649P8198o0141j0922Q9955M1935l0524P2210L7453p4907M3699o7137
$$ -68608 -38959 39239 -20902 -31824 58131 100066 69542 141752 179205 104298 147997 80860
15923H0860j52635l14141k2437M3329J98179R3146j38141R8072M6785O4556k7020
$$ 80860 -71775 -385916 -408353 -365024 -166845 -73699 -211840 -113768 -66983 -2427 -29447
15912b9447j47484J06545J06332n064r3122k23253M1177R3528P9728K6061j43146
$$ -29447 -176931 -70386 35946 30882 -62240 -285493 -244316 -150788 -71060 -44999 -188145
15901a88145L2163m8557Q6367P5538N4532j9913O4937j5339j39869K6205j99286
$$ -188145 -155982 -204539 -118172 -42634 11898 -8015 56922 41583 -98286 -72081 -271367
15890b71367j79011J67036P2294J01728O2419k02521m3983K26287J18651m3328
$$ -271367 -450378 -283342 -211048 -109320 -46901 -249422 -293405 -67118 51533 8205
15880H205q7266q4703M7324j1439L6190j19673Q1583k5708p8035J67587N6250
$$ 8205 -79061 -163764 -116440 -127879 -91689 -211362 -129779 -155487 -233522 -65935 -9685
15869i685j94934l0981N7780o8949J84436J72824o9516j09810p6267m8474M6117
$$ -9685 -204619 -235600 -177820 -246769 -62333 110491 40975 -68835 -145102 -193576 -147459
15858a47459K01556R4228j31043j58300k90129Q4651J72573r7879N7807K25308
$$ -147459 54097 148325 17282 -141018 -431147 -346496 -173923 -271802 -213995 11313
15848A1313O5498j5104m8302r636n8433L6126k6117l3461J5072j77531J15208
$$ 11313 76811 61707 13405 3769 -54664 -18538 -44655 -78116 -63044 -240575 -125367
15837a25367J48838J06812K1939p9864k0717J7335l9548R7213J37080M565l6233
$$ -125367 23471 130283 152222 72358 51641 68976 29428 126641 263721 268286 232053
15826B32053k6089j40789m8475J7705k864K794j58574l6238o5019r0356L6018
$$ 232053 205964 65175 16700 34405 31541 34335 -124239 -160477 -225496 -315852 -279834
15815b79834j3273r9684l5170O6815J74925j7657p6501R8567K26085j23029p7693
$$ -279834 -293107 -392791 -427961 -361146 -186221 -203878 -280379 -181812 44273 -78756 -156449
15804a56449J08209J26225Q5117j43208k00304K7876m1925M7126O5916J16199
$$ -156449 -48240 77985 163102 19894 -180410 -152534 -194459 -147333 -81417 34782
15794C4782J07813j51482r7267J30507M8815r232l2586l4310m8889J19760J60747
$$ 34782 142595 -8887 -106154 24353 73168 63936 31350 -2960 -51849 67911 228658
15783B28658j50444j73183K3702J10354k05813j12118P3719n9586l8743j8170
$$ 228658 78214 -94969 -71267 39087 -166726 -278844 -205125 -264711 -303454 -321624
15773c21624J66425J92898o6335k18692M036J20134J45235N3121n9191n2596J42167
$$ -321624 -155199 37699 -28636 -247328 -243292 -123158 22077 75198 16007 -36589 105578
15762A05578k3615k1881K2538J40552o3092j47257Q1514J28410O6620j57288j54238
$$ 105578 81963 60082 82620 223172 160080 12823 94337 222747 289367 132079 -22159
15751b2159K6143L144k3932p2870j4858J07113J70771L6733j17769K7706j17209
$$ -22159 3984 7128 -16804 -89674 -104532 2581 173352 210085 92316 120022 2813
15740B813k4600J7273r1472l9614J43519p2420n4598L8558j24545k98463R2887
$$ 2813 -21787 -4514 -95986 -135600 7919 -64501 -119099 -80541 -205086 -503549 -410662
15729d10662R0791n9392J28344J24580P901Q9183p945O0629J38422O0813K6105
$$ -410662 -319871 -379263 -250919 -126339 -118438 -29255 -37200 23429 161851 222664 248769
15718B48769m7364m3070l25660o7884J53364J1810M6896j74338j76187k4490K21640
$$ 248769 201405 158335 -167325 -235209 -81845 -70035 -23139 -197477 -373664 -398154 -176514
15707a76514J16267q8745j08117Q9053P4525j63405q8803K70128J36474n5207
$$ -176514 -60247 -148992 -257109 -168056 -93531 -256936 -345739 -75611 60863 5656
15697E656J13826J6811j4562j56037j67417N8430R7150M5550j02019r7120j13817
$$ 5656 119482 136293 121731 -34306 -201723 -143293 -46143 -593 -102612 -199732 -313549
15686c13549J9418m7676J21668J32778m7316l6930L2685n4776L1248J62133j09061
$$ -313549 -294131 -341807 -220139 -87361 -134677 -171607 -138922 -193698 -162450 -317 -109378
15675a09378M6842K8598m510M0375P1446j7186n2800n053j00634l9075k7480J10404
$$ -109378 -62536 -33938 -38448 1927 73373 56187 3387 -1666 -102300 -141375 -168855 -58451
15663e8451K1834j4844P3883J70395O2484o1083J2779k7321j22687j95262o3596
$$ -58451 -36617 -51461 22422 192817 255301 194218 206997 179676 56989 -138273 -201869
15652b01869l0733J22591P1126o7436m3397l7861k4635K9094J21348J61606j5507
$$ -201869 -232602 -110011 -38885 -106321 -149718 -187579 -212214 -183120 -61772 99834 84327
15641H4327P1532p7731k5715j12078j55929J92826J67469q9511j17331O8264j94112
$$ 84327 155859 78128 52413 -59665 -215594 -22768 144701 55190 -62141 6123 -187989
15630a87989j5960K2043J3069N5568o2732K5414P5319r0099L6055L0631j3393
$$ -187989 -203949 -181906 -168837 -113269 -176001 -150587 -75268 -165367 -129312 -98681 -112074
15619a12074J5364R6494J08332o212n62n6404P5774P8011r9315j37551j2797o9372
$$ -112074 -96710 -216 108116 101904 101342 44938 120712 198723 99408 -38143 -50940 -120312
15607a20312j11542Q8125J60954P8930j20557j75587M1326q6844O1555l2377L1741
$$ -120312 -231854 -143729 17225 96155 -24402 -199989 -158663 -245507 -183952 -216329 -184588
15596a84588o5357Q9624m5476j42823P6647R8212J2058J01435m1672n7323q9177
$$ -184588 -249945 -160321 -205797 -348620 -271973 -173761 -161703 -60268 -101940 -159263 -248440
15585b48440J03593j42324j68112K54640K21490L7306J78672J83412n8206k28868
$$ -248440 -144847 -287171 -455283 -200643 20847 58153 236825 420237 362031 133163
15575A33163k36340R1344l7576P7389N3251j50923M2768K36623L1618j40075j80277
$$ 133163 -103177 -11833 -49409 27980 81231 -69692 -26924 209699 241317 101242 -79035
15564g9035k2856j93822O5452Q5715K08411j6130m3674j01900j04222J94652P5005
$$ -79035 -101891 -295713 -230261 -144546 63865 47735 4061 -97839 -202061 -7409 67596
15553F7596J77862O4116m759k6121K6083p4443j82424k54354j59192J8255Q7288
$$ 67596 245458 309574 304815 278694 304777 230334 47910 -206444 -365636 -347381 -260093
15542b60093J20159J57810J99018N9838j96195j98485j81046j63407J13693K00680
$$ -260093 -139934 17876 216894 276732 80537 -117948 -298994 -462401 -348708 -148028
15532a48028J22945J19255K4113n1962j19385p1331Q352k06709O4204R3940M2153
$$ -148028 -25083 94172 118285 66323 -53062 -124393 -116041 -322750 -258546 -164606 -122453
15521a22453j41147P2665P6518J78280J44451j71660j17270q830k518J02322Q4859
$$ -122453 -263600 -190935 -114417 63863 208314 36654 -80616 -89446 -91964 10358 95217
15510I5217j24812k17902p7253J17702J03319Q5095o870o0875L2711J38858J11093
$$ 95217 -29595 -247497 -324750 -207048 -103729 -18634 -25504 -86379 -53668 85190 196283
15499A96283P3686o8800R6496n6109j6167k06424K4828q6172K1932J59306K68162
$$ 196283 269969 201169 297665 241556 225389 18965 43793 -42379 -20447 138859 407021
15488D07021j26157k07221j45972p8701R573M0853M7637l168j63449n915L6659
$$ 407021 280864 73643 -72329 -151030 -141457 -100604 -52967 -56135 -219584 -225499 -188840
15477a88840O5461o601J23322j14309O9701K84783J82374p3805j87457r8594R107
$$ -188840 -123379 -129980 -6658 -120967 -51266 233517 415891 342086 154629 56035 65142
15466F5142R2123o3297k1269Q106j20242j52040L5848R8539n7592q252L671Q4034
$$ 65142 157265 93968 72699 80805 -39437 -191477 -155629 -57090 -114682 -122934 -119263 -35229
15454c5229J9493j1884M3847q9593n8297J33837O5062p1953j10460j0028p3371
$$ -35229 -15736 -27620 16227 -73366 -131663 2174 67236 -4717 -115177 -125205 -198576
15443a98576R3476P6956J1065j68758o2612L9158Q166M5133J14876k4383J36413
$$ -198576 -105100 -28144 -17079 -185837 -248449 -209291 -201125 -155992 -41116 -65499 70914
15432G0914J01486L3738j47279n7793r4513n7674j41680M7689J58373J66917K492
$$ 70914 172400 206138 58859 1066 -93447 -151121 -292801 -245112 -86739 80178 82670
15421H2670n1810o0655N7076n4298j18209j0568q2285n8204M4633N3572J43906
$$ 82670 30860 -29795 27281 -27017 -145226 -155794 -238079 -296283 -251650 -198078 -54172
15410e4172M6560j16333j44088R19O3130j39621m0538J58459K73638n6532j32201
$$ -54172 -7612 -123945 -268033 -267114 -203984 -343605 -384143 -225684 47954 -8578 -140779
15399a40779K8173o4703K6491Q023K4562j16868J0561J05473m9049j45438m9303
$$ -140779 -112606 -177309 -150818 -142795 -118233 -235101 -224540 -119067 -168116 -313554 -362857
15388c62857M1474j37796m0300j02101J67663J51206Q7185J29898J173R6702N4105
$$ -362857 -321383 -459179 -499479 -601580 -433917 -282711 -195526 -65628 -64455 32247 86352
15377H6352l3246J0603k57540j77260m1975K06177Q6762j43064k0241Q7021j9959
$$ 86352 53106 63709 -193831 -371091 -413066 -206889 -120127 -263191 -283432 -196411 -216370
15366b16370M5939J07952j39918l4098J35845K71810J32689j50632o7917j87721
$$ -216370 -170431 -62479 -202397 -236495 -100650 171160 303849 153217 85300 -102421
15356a02421j58688O0617m4282M0866L8008R8267L7178k3842O0872J7662k5895
$$ -102421 -261109 -200492 -244774 -203908 -165900 -67633 -30455 -54297 6575 24237 -1658
15345a658p7276J59050O0115j27684N5201L6468j92941j62016k4943O092j17106
$$ -1658 -78934 80116 140231 12547 67748 104216 -88725 -250741 -275684 -269592 -386698
15334c86698K2698J17512J78734K13518N6060N8484k57478k23270j5997R6203
$$ -386698 -364000 -246488 -67754 145764 201824 260308 2830 -220440 -236437 -140234
15324a40234Q058j19784N9941O4251N4394l1666p1544M8372j17119L5052K04522
$$ -140234 -132176 -251960 -192019 -127768 -73374 -105040 -176584 -128212 -245331 -210279 -5757
15313e757J8246J9957J32788q3267j1877k6987L517Q7634R5726j62955k51233
$$ -5757 12489 32446 165234 81967 70090 43103 46620 134254 229980 67025 -184208
15302a84208r8360K45969J37079J21406j26172j53812j58045l6612p3482R7574
$$ -184208 -282568 -36599 100480 221886 95714 -58098 -216143 -252755 -326237 -228663
15292b28663j8741J51699J8337l7676k3616n3028M1934J77339J52658M7755k0997
$$ -228663 -247404 -95705 -77368 -115044 -138660 -191688 -149754 27585 180243 227998 207001
15281B07001r8020p0371j02844k6473O2564J50492o3487J5935J6365m0711q0411
$$ 207001 108981 38610 -64234 -90707 -28143 122349 58862 74797 91162 50451 -29960
15270b9960j11806m4265J75528l8229j15541J36340J14237R455j5043j76662J8914
$$ -29960 -141766 -186031 -10503 -48732 -164273 -27933 86304 95759 80716 -95946 -77032
15259g7032N694L409j29378J10582O1511J80725J3976k6668j25671j08561j77847
$$ -77032 -71338 -67929 -197307 -86725 -25214 155511 169487 142819 17148 -91413 -269260
15248b69260n9426J00924R9682J11357N8325J6465K051l9121r58J83655K9975
$$ -269260 -328686 -227762 -128080 -16723 41602 58067 60118 20997 20039 203694 233669
15237B33669r3754k20547k7268J03844r9699j05900J54512J07971M4040j7901
$$ 233669 139915 -80632 -107900 -4056 -103755 -209655 -55143 52828 96868 78967
15227G8967j60458k4813M0546L2666J30062J46323p6296j74320k64998P3743M8024
$$ 78967 -81491 -106304 -65758 -33092 96970 243293 166997 -7323 -272321 -198578 -150554
15216a50554J16728k1956r4516k5176j7933p0318q769M0317J04761J2450n703
$$ -150554 -33826 -55782 -150298 -175474 -193407 -263725 -272494 -232177 -127416 -114966 -120669
15205a20669R1874R4756j16378o1228M6982L6204L0353q520j13668M379j29065
$$ -120669 -28795 65961 -50417 -111645 -64663 -28459 1894 -6626 -120294 -115915 -244980
15194b44980k93225K8801J92644J43146r4600K2629Q3148j50743j6324M2102J0011
$$ -244980 -538205 -509404 -316760 -173614 -268214 -245585 -162437 -313180 -329504 -287402 -277391
15183b77391J54477O2699O951J0016L1529J11438N4330p8946n8161L2755K304
$$ -277391 -122914 -60215 -53264 -43248 -11719 99719 154049 75103 16942 49697 52001
15172E2001p212M3704O0855O8974j75653k28698M3144N5500j15121j03802J46793
$$ 52001 44789 88493 149348 218322 42669 -186029 -142885 -87385 -202506 -306308 -159515
15161a59515M7869L8078q231l1651l3667j82470O6699k693O6982R9157r355N2946
$$ -159515 -111646 -73568 -81799 -113450 -147117 -329587 -262888 -265581 -198599 -99442 -108797 -55851
15149e5851m6496r8410j31723n0704J27909p42L236Q345q4380Q1769o2193n7200
$$ -55851 -102347 -200757 -332480 -383184 -255275 -256017 -252781 -244436 -328816 -247047 -309240 -366440
15137c66440R0996J38541J87554N8618J9010N5110n102m1262r411o4065n0682
$$ -366440 -275444 -136903 50651 109269 128279 183389 178287 137025 127614 63549 12867
15126A2867m8054R9557K8778j4058Q7388P7876j42776L6980r8079k62662k07207
$$ 12867 -35187 64370 93148 79090 166478 244354 101578 138558 40479 -222183 -429390
15115d29390k0285L40408J50608m7017o1760n0334n3107j07424o2894J80141J46676
$$ -429390 -449675 -109267 41341 -5676 -67436 -117770 -170877 -278301 -341195 -161054 -14378
15104a4378P7266Q4582k8674m4809m3108j98711j17425J62217j8287p6548q5021
$$ -14378 62888 147470 118796 73987 30879 -167832 -285257 -123040 -141327 -217875 -302896
15093c02896Q0404m0248j91938q730J11069Q090m7764j6443J58263J14886o8231
$$ -302896 -222492 -262740 -454678 -463408 -352339 -344249 -392013 -408456 -250193 -135307 -203538
15082b03538o1458L9831J02329J83220M6280J064r5792l9620j64298r2534N4829
$$ -203538 -264996 -225165 -122836 60384 106664 107728 11936 -27684 -191982 -284516 -229687
15071b29687J16236M027o4696k30034J0065l3748Q8717K77836J84433j09134q0981
$$ -229687 -113451 -109424 -174120 -404154 -394089 -427837 -339120 -61284 123149 14015 -66966
15060f6966j865r1866j3967J43612M5074m8265r4746n5827l7300r723l1662j5451
$$ -66966 -68831 -160697 -174664 -31052 14022 -34243 -128989 -184816 -222116 -231839 -263501 -278952
15048b78952Q8898L7941o6551j54806J39400N8700j38290p3075J61443P6843l5898
$$ -278952 -190054 -152113 -218664 -373470 -234070 -175370 -313660 -386735 -225292 -148449 -184347
15037a84347l6820K6566Q4026j53753L8892K30328m4865K4690R5565R6812p1922
$$ -184347 -221167 -194601 -110575 -264328 -225436 4892 -39973 -15283 80282 177094 105172
15026A05172k74560j24325m5489J46248j9561J09735K13249N6734N1895J4432
$$ 105172 -169388 -293713 -339202 -192954 -212515 -102780 110469 167203 219098 233530
15016B33530l1325o4745l7204q7003O9505K0867p4970o0792J42143K27477j5954
$$ 233530 202205 137460 100256 13253 82758 103625 28655 -32137 110006 337483 321529
15005C21529L5262M54054N89263J186426J245269L49377l28514r12871j254493
$$ 321529 356791 810845 1400108 2586534 3831803 4181180 3852666 2939795 1685302
14996A685302o82986j56543j14960j85761j84830j44762j23301L2025M2041l1051
$$ 1685302 1002316 845773 730813 545052 360222 215460 92159 124184 166225 135174
14986A35174N018j52406O3664j54676j14885K6720J47869N0687n0827o2125N1582
$$ 135174 140192 -12214 51450 -103226 -218111 -191391 -43522 7165 -43662 -105787 -54205
14975e4205K6513M495q6678j05743N7984K35898M3477R4192j45995j04619R4925
$$ -54205 -27692 -23197 -109875 -215618 -157634 78264 121741 215933 69938 -34681 60244
14964F0244k7559j94212p1013j08806J98885M5814L8463J02933J06044J3382j04644
$$ 60244 32685 -161527 -232540 -341346 -142461 -96647 -58184 44749 150793 164175 59531
14953E9531r4902k04459j67836L0166J52994K36073K9621Q0578j33413j14364
$$ 59531 -35371 -239830 -407666 -377500 -224506 11567 41188 121766 -11647 -126011
14943a26011j9457J16262l9037r2210q1575J13233J20190R1225m1241j88440k19856
$$ -126011 -145468 -29206 -68243 -160453 -242028 -128795 -8605 82620 41379 -147061 -366917
14932c66917k1764K5042J07586N1647K7401J28206R136J202J90978Q3498q1883
$$ -366917 -388681 -363639 -256053 -204406 -177005 -48799 -39663 -38461 152517 236015 154132
14921A54132k65020j63983J40555J72885O5346k06956J020K6317j7251P8914l045
$$ 154132 -110888 -274871 -134316 38569 103915 -103041 -102021 -75704 -92955 -14041 -17086
14910a7086j8860J7074J13752m2395k6682q381j08315j1217l4953j23777o3225
$$ -17086 -35946 -18872 94880 52485 25803 17422 -90893 -102110 -137063 -260840 -324065
14899c24065r71R3730J55263J70667J51535j15124j6320j33152q5229M1896k4109
$$ -324065 -325036 -231306 -76043 94624 246159 131035 114715 -18437 -103666 -61770 -85879
14888h5879J37306K48427K7747P3128j35338j53997k29882q308Q2030M6902p0544
$$ -85879 51427 299854 327601 400729 265391 111394 -118488 -126796 -44766 2136 -68408
14877f8408j01858R6542Q7636j11904j20941M6536q6625l3596J54907N0373j5486
$$ -68408 -170266 -73724 13912 -97992 -218933 -172397 -259022 -292618 -137711 -87338 -102824
14866a02824J32916p2293o594l3045K1573L2618L8379J40501R2002R7781M8792
$$ -102824 30092 -42201 -48795 -81840 -60267 -27649 10730 151231 243233 341014 389806
14855C89806O5294q5070j82788K8733M418J5975K155m6418M9848J06546j01198
$$ 389806 455100 370030 187242 215975 220393 236368 238523 192105 241953 348499 247301
14844B47301j27870m7241j78347j54675J41542J45422K9360j10367r0311K02878
$$ 247301 119431 72190 -106157 -260832 -119290 26132 55492 -54875 -145186 57692
14834E7692L7393M3264j22835J9013Q8145J31242l24316o3658J71752J99479n6467
$$ 57692 95085 138349 15514 34527 122672 253914 -70402 -134060 37692 237171 180704
14823A80704j83368j18995n4115k962r130o2432R9066J23899K06116n3432J07815
$$ 180704 -2664 -121659 -175774 -178736 -187866 -250298 -151232 -27333 178783 125351 233166
14812B33166M9068r6420M3743o9615N2575M5974j11454j43476k74670Q682K52127
$$ 233166 282234 185814 229557 159942 212517 258491 147037 3561 -271109 -262427 -10300
14801a0300j4117k30670J09411K7635o9994R3611J34613M0408n5289j05885K90
$$ -10300 -24417 -255087 -145676 -118041 -188035 -94424 40189 80597 25308 -80577 -80287
14790h0287K0654q2888p878J91591M4998J83193l8259o6629j36083j9091O3939
$$ -80287 -59633 -142521 -150399 41192 86190 269383 231124 164495 28412 9321 73260
14779G3260l0155j43140n6962N3339Q7567P1783o0892j2216j79895J8955K7860
$$ 73260 43105 -100035 -156997 -103658 -16091 55692 -5200 -17416 -197311 -178356 -150496
14768a50496n7232k022J96583M3166r6426j62450n8796L2321J74601P6480j54067
$$ -150496 -207728 -209750 -13167 29999 -66427 -228877 -287673 -255352 -80751 -4271 -158338
14757a58338J3673K6380J2060j6588J0117Q1517n1806O7144l6330k07848p8670
$$ -158338 -144665 -118285 -106225 -122813 -112696 -31179 -82985 -15841 -52171 -260019 -338689
14746c38689N4140L5795K093K38546J02914o9190o7121j09016j21779J44319M0399
$$ -338689 -284549 -248754 -246661 -8115 94799 25609 -41512 -150528 -272307 -127988 -87589
14735h7589P6340J59437j7215j40594o5210J3533L6779P9116j19811r7199j35195
$$ -87589 -11249 148188 130973 -9621 -74831 -61298 -24519 54597 -65214 -162413 -297608
14724b97608J34928J82862p3646k03457Q5440O6714l2118J8038n6527J2859M6154
$$ -297608 -162680 20182 -53464 -256921 -171481 -104767 -136885 -118847 -175374 -162515 -116361
14713a16361j2587m5511J42795J03159j02534k312r7369k30977J6319K3850K41626
$$ -116361 -128948 -174459 -31664 71495 -31039 -33351 -130720 -361697 -345378 -321528 -79902
14702g9902Q9952m98r1618J41588J50575O0599l2779j47730o1046j98821k10378
$$ -79902 10050 9552 -82066 59522 210097 270696 237917 90187 29141 -169680 -380058
14691c80058R5248K55480R3246N8056j25235k56269j53321O6392R9745O0481J31428
$$ -380058 -284810 -29330 63916 121972 -3263 -259532 -412853 -346461 -246716 -186235 -54807
14680e4807J08709Q8589o0405Q8328P960j91739O1338J2972r5655j26029n9688
$$ -54807 53902 142491 82086 170414 178374 -13365 47973 60945 -34710 -160739 -220427
14669b20427J9261J35744o3043k4596O9420R7568K3087L6811P3768P2642j37417
$$ -220427 -201166 -65422 -128465 -153061 -83641 13927 37014 73825 147593 220235 82818
14658H2818j03405J5378K8932K1912n2113J05930J46100p3989j14761n9778o8276
$$ 82818 -20587 -5209 23723 45635 -6478 99452 245552 171563 56802 -2976 -71252
14647g1252k58095P1332J46201o9278n37P2320j3313j02429R4737J37683P252
$$ -71252 -329347 -258015 -111814 -181092 -181629 -109309 -122622 -225051 -130314 7369 14621
14636A4621M4492j11656l4062J12552m0297j83534j32805r3275K63654J57355
$$ 14621 59113 -52543 -86605 25947 -14350 -197884 -330689 -423964 -160310 -2955
14626b955M6365j82218o2339j16173R2464K14949Q6711m057r8077J19239P9014
$$ -2955 43410 -138808 -201147 -317320 -224856 -9907 76804 72747 -25330 93909 172923
14615A72923k21354k25417j15678m2931p0237R9099K16206J66460P6093n1937
$$ 172923 -48431 -273848 -389526 -432457 -502694 -403595 -187389 -20929 55164 3227
14605C227q1909q186M3814M7760p159J10053k5215q7802o9106J56147J28546k04920
$$ 3227 -78682 -86868 -43054 4706 -2453 107600 82385 -5417 -74523 81624 210170 5250
14593E250p6205R9214J93985p2422j50531N5559Q7242L9118N0495j18937k56714
$$ 5250 -70955 28259 222244 149822 -709 54850 142092 181210 231705 112768 -143946
14582a43946j12773n0418P5506p2215m5890J92644J32120n6608M0181r5056l1984
$$ -143946 -256719 -307137 -231631 -303846 -349736 -157092 -24972 -81580 -41399 -136455 -168439
14571a68439n50j35275m8875L1657L9176J21251K0258M2722J7217m0885k3245
$$ -168439 -168989 -304264 -353139 -321482 -282306 -161055 -140797 -98075 -80858 -121743 -144988
14560a44988K6457j62589J79296J84147n4787j43065P5564K14197Q899k6769j27743
$$ -144988 -118531 -281120 -101824 82323 27536 -115529 -39965 174232 183131 156362 28619
14549B8619j10086R4708P0254J45205K5942p1741O2833J4595j27058J2820p7149
$$ 28619 -81467 13241 83495 228700 254642 182901 245734 260329 133271 146091 68942
14538F8942j88858J40794K52937k8092j84525r8335j5856Q8551K9345K2643N854
$$ 68942 -119916 20878 273815 245723 61198 -37137 -52993 35558 64903 87546 93400
14527I3400J41933J02429J14729p2369j02479k10619j87113Q3709O8815n3806
$$ 93400 235333 337762 452491 380122 277643 67024 -120089 -36380 32435 -21371
14517b1371J22476j69426k5021o190k843J2221J1084k368J41547J66329j08903
$$ -21371 101105 -68321 -93342 -99532 -102375 -90154 -79070 -81438 60109 226438 117535
14506A17535j14954j08554N3780p6706L9362J42645k361j70079J8610j03828j48413
$$ 117535 2581 -105973 -52193 -128899 -89537 53108 50747 -119332 -100722 -204550 -352963
14495c52963J72290J57392N0620m0091K9319J1921L8333l9623K9578j24021j24926
$$ -352963 -180673 -23281 27339 -12752 16567 28488 66821 27198 56776 -67245 -192171
14484a92171Q4874J15165J36867L4501j44839k30457Q0268K76588O7508j32349
$$ -192171 -107297 7868 144735 179236 34397 -196060 -115792 160796 228304 95955
14474I5955l0823p4700O818q6857j94150P5964J92101l6937k02476j12302M7835
$$ 95955 65132 -9568 -2750 -89607 -283757 -207793 -15692 -52629 -255105 -367407 -319572
14463c19572J93752j5341j52296j1268R9398l4888M1604K02246n8442Q6423k2602
$$ -319572 -125820 -141161 -293457 -304725 -205327 -240215 -198611 3635 -54807 31616 9014
14452I014q550n1134j50496N623L9920J37545J60109r2494p8093r2851M1969L4849
$$ 9014 464 -50670 -201166 -195543 -155623 -18078 142031 49537 -28556 -121407 -79438 -44589
14440d4589j31759J103R257Q1074P7566K42750j07350j68415J6420R5487K9623
$$ -44589 -176348 -175245 -165988 -84914 -7348 235402 128052 -40363 -23943 71544 101167
14429A01167j38714j03899J11247N641k03045O6671J14848K9758J41133N9800
$$ 101167 -37547 -141446 -30199 -24558 -227603 -160932 -46084 -16326 124807 184607
14419A84607j15746q1453j28362R2942M6795k2921K17610L4670o6733j9001j13401
$$ 184607 68861 -12592 -140954 -48012 -1217 -24138 193472 228142 161409 142408 29007
14408B9007k29434j03085R4149K58092r0030j99341O4278J27818j03575p2358
$$ 29007 -200427 -303512 -209363 48729 -41301 -240642 -176364 -48546 -152121 -224479
14398b24479N239K42836J41032q0032j57356J31689K14952O2509R6156j42893
$$ -224479 -219240 23596 164628 84596 -72760 58929 273881 336390 432546 289653
14388B89653l12830j1467O6588l4603p8369o0806n7014J06032J99057o2225N3848
$$ 289653 -23177 -34644 31944 -2659 -81028 -141834 -198848 -92816 106241 44016 97864
14377I7864J52461m1942r1719n8922j28112j31430L3281J05713J22120j9815p5370
$$ 97864 250325 208383 116664 57742 -70370 -201800 -168519 -62806 59314 39499 -35871
14366c5871R94k8253o7291j02093J62239M9789L3771P5991q0212M6238L0557j4417
$$ -35871 -34877 -63130 -130421 -232514 -70275 -20486 13285 89276 9064 55302 85859 71442
14354G1442p2181L6156N1470N6212k20650r3570j15010n1852L8744J06035K31722
$$ 71442 -739 35417 86887 143099 -77551 -171121 -286131 -337983 -299239 -193204 38518
14343C8518M5249j7579k31300l4949k9663M353J34300K014o895L1647L9971N7283
$$ 38518 83767 66188 -165112 -200061 -229724 -225371 -91071 -89057 -95952 -64305 -24334 32949
14331C2949j8583j20751n4367J8043K1054j1275P962k45009L8607L1079Q298O5000
$$ 32949 14366 -106385 -160752 -142709 -121655 -132930 -124968 -369977 -331370 -300291 -291993 -226993
14319b26993R5913R2082j0718J68346K9130K4110j44979q2519J45165J3706L7393
$$ -226993 -131080 -38998 -49716 118630 147760 171870 26891 -55628 89537 103243 140636
14308A40636l92J9479K8848L0481q5607p4551k6926J684m1554k9738j32777j57490
$$ 140636 140244 159723 188571 219052 133445 58894 31968 33652 -7902 -37640 -170417 -327907
14296c27907J86300J56830j01078q3218N8166R0866P7761j42465j57792J72055
$$ -327907 -141607 15223 -85855 -169073 -110907 -20041 57720 -84745 -242537 -70482
14286g0482n3925J12990J85270L2866j23229N2888J9864j01074k05234r6432Q3404
$$ -70482 -124407 -11417 173853 206719 83490 136378 156242 55168 -150066 -246498 -163094
14275a63094J0828J7111J6930j07364L943O7396J63218p2148j7987n9362J1234
$$ -163094 -152266 -135155 -118225 -225589 -221646 -154250 8968 -63180 -81167 -140529 -129295
14264a29295l950l5370K2527P1343j9170M2523M1967Q2478k7543j4539m6607j1103
$$ -129295 -133245 -168615 -146088 -74745 -93915 -51392 -9425 73053 45510 30971 -15636 -26739
14252b6739l9687M0339O0655O9782k9583r4475n7959m759j9212J84083N2650m6835
$$ -26739 -66426 -26087 34568 104350 74767 -19708 -77667 -82426 -101638 82445 135095 88260
14240H8260J67458M5961K0211o5946k381k78186j63704J22443J31148j32000J04948
$$ 88260 255718 301679 321890 255944 253563 -24623 -188327 -65884 65264 -66736 38212
14229C8212J30117j3762l3267j18178k4757Q1928l0152Q2182J2099j44464J1224
$$ 38212 168329 154567 121300 3122 -21635 60293 30141 112323 124422 -20042 -8818
14218h818p9906k6511j7380j9129q7762J20550P1768K1981L8941n134m5535M5358
$$ -8818 -88724 -115235 -132615 -151744 -239506 -118956 -47188 -25207 13734 8600 -36935 8423
14206H423J57329j08074R4025n0969k3008q6128k39550j64651K92224O9878l8023
$$ 8423 165752 57678 151703 100734 77726 -8402 -247952 -412603 -120379 -50501 -88524
14195h8524r8971k0802J51742M3575k0661j08560n771M2649O3863l7346J00411
$$ -88524 -187495 -208297 -56555 -12980 -33641 -142201 -147972 -105323 -41460 -78806 21605
14184B1605j46513k08384O5578L2875J79222J33411O6155N329k22621J2817k5945
$$ 21605 -124908 -333292 -267714 -234839 -55617 77794 143949 149278 -73343 -60526 -86471
14173h6471q7106j65365P0836K15755j06107m5811j6131J69056j33575R7235O4930
$$ -86471 -173577 -338942 -268106 -52351 -158458 -204269 -220400 -51344 -184919 -87684 -22754
14162b2754o5245n23r2918P9691J16624r7540K4668L4931j42545p3101o6530Q3683
$$ -22754 -87999 -88522 -181440 -101749 14875 -82665 -57997 -23066 -165611 -238712 -305242 -221559
14150b21559m7522P2639N8866L6272M9450j27759j48655J31795Q0339o0591m1570
$$ -221559 -269081 -196442 -137576 -101304 -51854 -179613 -328268 -196473 -116134 -176725 -218295
14139b18295L2235o8960J25438J30738R1207k3179n4571o8745n7639R0375m7760
$$ -218295 -186060 -255020 -129582 1156 92363 69184 14613 -54132 -111771 -21396 -69156
14128f9156o1166o8832j08850n4020p1392J9272J14964J51943o4332p8642Q1594
$$ -69156 -130322 -199154 -308004 -362024 -433416 -414144 -299180 -147237 -211569 -290211 -208617
$$ [...]
##END NTUPLES=NMR SPECTRUM
##END=
