##TITLE=Analysis number 318611
Compound Code cc 48311
Book Reference 196/162
Project Code adrs
Chemist Name jimp
##JCAMPDX= 6.0         $$ Bruker NMR JCAMP-DX V2.0
##DATA TYPE= NMR SPECTRUM
##DATA CLASS= NTUPLES
##ORIGIN= Bruker BioSpin GmbH
##OWNER= nmr
$$ XWIN-NMR		Version 3.5
$$ Wed Apr  5 16:37:29 2006 GMT Daylight Time (UT+1h)  MAYBRIDGE\nmr@NMR_250MHZ
##.OBSERVE FREQUENCY= 250.131544655141
##.OBSERVE NUCLEUS= ^1H
##.ACQUISITION MODE= SIMULTANEOUS (DQD)
##.ACQUISITION SCHEME= undefined
##.AVERAGES= 16
##.DIGITISER RES= 18
##SPECTROMETER/DATA SYSTEM= dpx250
##.PULSE SEQUENCE= zg30
##.SOLVENT NAME= DMSO
##.SHIFT REFERENCE= (INTERNAL, DMSO, 0, 16.522)
##AUDIT TRAIL= $$ (NUMBER, WHEN, WHO, WHERE, WHAT)
$$ ##TITLE= Audit trail, XWIN-NMR		Version 3.5
$$ ##JCAMPDX= 5.01
$$ ##ORIGIN= Bruker BioSpin GmbH
$$ ##OWNER= nmr
$$ C:\u/data/dgb/nmr/ADRS/2210/pdata/1/auditp.txt
$$ ##AUDIT TRAIL=  $$ (NUMBER, WHEN, WHO, WHERE, WHAT)
(   1,<2006-04-05 16:37:06.74 +100>,<MAYBRIDGE\nmr>,<NMR_250MHZ>,
      <created by zg, POWCHK disabled, PULCHK disabled
       configuration hash MD5:
       84 BC 41 DB A1 6E 1D 46 DA 25 12 A5 C1 ED C5 3A
       data hash MD5: 64K
       5F E0 74 8B 1A 68 31 ED 68 34 C9 C5 E6 91 12 9E>)
(   2,<2006-04-05 16:37:20.27 +100>,<MAYBRIDGE\nmr>,<NMR_250MHZ>,
      <Start of raw data processing
       ef LB = 0.3 FT_mod = 6 PKNL = 1 SI = 32K 
       data hash MD5: 32K
       9C B3 BF 7D FC F4 59 9D A0 D6 79 B6 90 BC 22 16>)
(   3,<2006-04-05 16:37:21.93 +100>,<MAYBRIDGE\nmr>,<NMR_250MHZ>,
      <apk 
       data hash MD5: 32K
       A6 2D 4F A3 6A 9B 5D 00 C0 65 7E 70 24 6F 71 1D>)
(   4,<2006-04-05 16:37:22.73 +100>,<MAYBRIDGE\nmr>,<NMR_250MHZ>,
      <abs ABSG = 5 
       data hash MD5: 32K
       D7 BA 99 DD 33 6C CD 49 B2 55 2E D4 C2 C5 19 E0>)
$$ ##END=
$$ 
$$ hash MD5
$$ A1 0A EE E5 93 63 68 78 D6 B5 CE 60 A2 2F 3E 8B
##$RELAX= 
##$RELAX= 
##$RELAX= 
##$RELAX= 
##$RELAX= 
##$RELAX= 
##$RELAX= 
$$ Bruker specific parameters
$$ --------------------------
##$DU= <C:\u>
##$EXPNO= 2210
##$NAME= <ADRS>
##$PROCNO= 1
##$TYPE= <nmr>
##$USER= <dgb>
##$AMP= (0..31)
100 100 100 100 100 100 100 100 100 100 100 100 100 100 100 100 100 100 
100 100 100 100 100 100 100 100 100 100 100 100 100 100 
##$AQSEQ= 0
##$AQ_mod= 3
##$AUNM= <au_zg>
##$AUTOPOS= <59 >
##$BF1= 250.13
##$BF2= 250.13
##$BF3= 250.13
##$BF4= 250.13
##$BF5= 500.13
##$BF6= 500.13
##$BF7= 500.13
##$BF8= 500.13
##$BYTORDA= 1
##$CFDGTYP= 0
##$CFRGTYP= 5
##$CHEMSTR= <none>
##$CNST= (0..31)
1 1 145 1 1 1 1 1 1 1 1 1 1 1 1 1 1 1 1 1 1 1 1 1 1 1 1 1 1 1 1 1 
##$CPDPRG= <>
##$CPDPRG1= <>
##$CPDPRG2= <>
##$CPDPRG3= <>
##$CPDPRG4= <mlev>
##$CPDPRG5= <mlev>
##$CPDPRG6= <mlev>
##$CPDPRG7= <mlev>
##$CPDPRG8= <mlev>
##$CPDPRGB= <>
##$CPDPRGT= <>
##$D= (0..31)
0 1 0 0 0 0 0 0 0 0.06 0 0 0 0 0 0 0.0002 0 0 0 0 0 0 0 0 0 0 0 0 0 0 
0 
##$DATE= 1144251425
##$DBL= (0..7)
120 120 120 120 120 120 120 120 
##$DBP= (0..7)
150 150 150 150 150 150 150 150 
##$DBP07= 0
##$DBPNAM0= <>
##$DBPNAM1= <>
$$ [...]
##$SUBNAM6= <"">
##$SUBNAM7= <"">
##$SUBNAM8= <"">
##$SUBNAM9= <"">
##$SW= 20.6930455092707
##$SWIBOX= (0..15)
0 0 3 0 0 0 0 0 0 0 0 0 0 0 0 0 
##$SW_h= 5175.983436853
##$TD= 65536
##$TD0= 1
##$TE= 295.16
##$TE2= 300
##$TE3= 300
##$TEG= 300
##$TL= (0..7)
0 120 120 120 120 120 120 120 
##$TP= (0..7)
150 150 150 150 150 150 150 150 
##$TP07= 0
##$TPNAME0= <>
##$TPNAME1= <>
##$TPNAME2= <>
##$TPNAME3= <>
##$TPNAME4= <>
##$TPNAME5= <>
##$TPNAME6= <>
##$TPNAME7= <>
##$TPOAL= (0..7)
0.5 0.5 0.5 0.5 0.5 0.5 0.5 0.5 
##$TPOFFS= (0..7)
0 0 0 0 0 0 0 0 
##$TUNHIN= 0
##$TUNHOUT= 0
##$TUNXOUT= 0
##$USERA1= <user>
##$USERA2= <user>
##$USERA3= <user>
##$USERA4= <user>
##$USERA5= <user>
##$V9= 5
##$VALIST= <valist>
##$VCLIST= <CCCCCCCCCCCCCCC>
##$VD= 0
##$VDLIST= <DDDDDDDDDDDDDDD>
##$VPLIST= <PPPPPPPPPPPPPPP>
##$VTLIST= <TTTTTTTTTTTTTTT>
##$WBST= 1024
##$WBSW= 4
##$XGAIN= (0..3)
0 0 0 0 
##$XL= 0
##$YL= 0
##$YMAX_a= 392940
##$YMIN_a= -502435
##$ZGOPTNS= <>
##$ZL1= 120
##$ZL2= 120
##$ZL3= 120
##$ZL4= 120
##$ABSF1= 16.522
##$ABSF2= -4.171173
##$ABSG= 5
##$ABSL= 3
##$ALPHA= 0
##$AQORDER= 0
##$ASSFAC= 0
##$ASSFACI= 0
##$ASSFACX= 0
##$ASSWID= 0
##$AUNMP= <proc_1d>
##$AZFE= 0.1
##$AZFW= 0.1
##$BCFW= 0
##$BC_mod= 0
##$BYTORDP= 0
##$COROFFS= 0
##$CY= 12.5
##$DATMOD= 1
##$DC= 0
##$DFILT= <>
##$DTYPP= 0
##$F1P= 14.0000005364418
##$F2P= -0.99999901652339
##$FCOR= 0.5
##$FTSIZE= 32768
##$FT_mod= 6
##$GAMMA= 0
##$GB= 0
##$INTBC= 1
##$INTSCL= 1
##$ISEN= 128
##$LB= 0.3
##$LEV0= 0
##$LPBIN= 0
##$MAXI= 10000
##$MC2= 0
##$MEAN= 0
##$ME_mod= 0
##$MI= 0
##$NCOEF= 0
##$NC_proc= -3
##$NLEV= 6
##$NOISF1= 0
##$NOISF2= 0
##$NSP= 0
##$NTH_PI= 0
##$NZP= 0
##$OFFSET= 16.522
##$PC= 1
##$PHC0= 159.2367
##$PHC1= 6.177036
##$PH_mod= 1
##$PKNL= yes
##$PPARMOD= 0
##$PSCAL= 4
##$PSIGN= 0
##$REVERSE= no
##$SF= 250.13
##$SI= 32768
##$SIGF1= 0
##$SIGF2= 0
##$SINO= 400
##$SIOLD= 32768
##$SREGLST= <1H.DMSO>
##$SSB= 0
##$STSI= 32768
##$STSR= 0
##$SW_p= 5175.98343685301
##$SYMM= 0
##$S_DEV= 0
##$TDeff= 65536
##$TDoff= 0
##$TI= <Analysis number 999999
Compound Code 99
Book Reference 9
Project Code 9>
##$TILT= no
##$TM1= 0
##$TM2= 0
##$TOPLEV= 0
##$USERP1= <user>
##$USERP2= <user>
##$USERP3= <user>
##$USERP4= <user>
##$USERP5= <user>
##$WDW= 1
##$XDIM= 32768
##$YMAX_p= 542675236
##$YMIN_p= -56092
$$ End of Bruker specific parameters
$$ ---------------------------------
##NTUPLES= NMR SPECTRUM
##VAR_NAME=  FREQUENCY,     SPECTRUM/REAL,   SPECTRUM/IMAG
##SYMBOL=    X,             R,               I
##VAR_TYPE=  INDEPENDENT,   DEPENDENT,       DEPENDENT
##VAR_FORM=  AFFN,          ASDF,            ASDF
##VAR_DIM=   32768,         32768,           32768
##UNITS=     HZ,            ARBITRARY UNITS, ARBITRARY UNITS
##FACTOR=    0.157963299565203, 1,           1
##FIRST=     4132.6476996994, 0,             0
##LAST=      -1043.33573715361, 0,           0
##MIN=       -1043.33573715361, -56092,      0
##MAX=       4132.6476996994, 542675236,     0
$$ Real data points
##PAGE= N=1
##DATA TABLE= (X++(R..R)), XYDATA
$$ [...]
$$ plain form
18914 127524 138560 138062 152127 159318 167040 164714 164217 171037 174488 196355 206781 198643 196287 202628
18900 202628 202692 204031 198623 208392 220713 223897 228664 227455 218628 229381 245573 242261 244272 237337
18886 237337 243577 232827 225398 220814 219669 202036 202463 197728 196731 196120 185221 177743 182449 183636
18872 183636 180460 179695 191918 193759 177483 161985 152741 167958 172878 154855 150792 153859 155359
18859 155359 147991 137902 130616 120948 107032 104064 91771 87104 91258 90203 90436 94627 99817 108104
18845 108104 110421 107222 94902 101061 112521 109702 113427 123635 124228 127070 120746 103492 107599
18832 107599 116699 110861 125899 132847 115195 117934 123626 136487 143510 151858 164057 165499 171356
18819 171356 175713 171093 183673 190851 187634 196213 215322 238308 262235 272171 284723 299471 327071
$$ packed form
18914A27524J1036m98J4065P191P722k326m97O820L451K1867J0426q138k356O341
18900B02628O4J339n408R769J2321L184M767j209q827J0753J6192l312K011o935
18886B37337O240j0750p429m584j145j7633M27m735r97o11j0899p478M706J187
18872A83636l176p65J2223J841j6276j5498r244J5217M920j8023m063L067J500
18859A55359p368j0089p286r668j3916k968j2293m667M154j055K33M191N190Q287
18845A08104K317l199j2320O159J1460k819L725J0208N93K842o324j7254M107
18832A07599R100n838J5038O948j7652K739N692J2861P023Q348J2199J442N857
18819A71356M357m620J2580P178l217Q579J9109K2986K3927R936J2552J4748K7600
$$ plain form
18806 327071 355347 359879 371011 399154 428406 446482 458328 478057 505704 550228 585819 600805
18794 600805 619238 618924 614548 626717 642987 650643 664461 685184 727047 783234 827838 855025
18782 855025 893957 922200 929333 919724 856370 770142 695269 639543 602389 582432 567377 557580
18770 557580 545191 534613 522591 527817 535350 509640 516153 525602 504634 499847 497517 493433 498410
18757 498410 500129 509709 510963 509068 510588 513027 508982 522508 529182 524454 523785 521607 511569 512985
18743 512985 535547 552193 551826 560388 581193 597272 598904 598615 613399 641733 665269 677023 698569
18730 698569 714699 732534 747980 781088 820319 844398 851827 869842 911549 966608 1029583 1108037
18718 1108037 1205366 1314680 1427290 1522210 1626637 1723455 1803398 1891223 1958427 2024261 2106575
$$ packed form
18806C27071K8276M532J1132K8143K9252J8076J1846J9729K7647M4524L5591J4986
18794F00805J8433l14m376J2169J6270P656J3818K0723M1863N6187M4604K7187
18782H55025L8932K8243P133r609o3354q6228p4873n5726l7154j9957j5055r797
18770E57580j2389j0578j2022N226P533k5710O513R449k0968m787k330m084M977
18757D98410J719R580J254j895J520K439m045J3526O674m728o69k178j0038J416
18743E12985K2562J6646l67Q562K0805J6079J632k89J4784K8334K3536J1754K1546
18730F98569J6130J7835J5446L3108L9231K4079P429J8015M1707N5059O2975P8454
18718A108037R7329J09314J12610R4920J04427R6818P9943Q7825O7204O5834Q2314
$$ plain form
18707 2106575 2187729 2291285 2404524 2521600 2649370 2805375 2968912 3146777 3355888 3604280
18697 3604280 3904490 4255150 4677509 5179237 5802155 6615670 7654981 9047836 11034956
18688 11034956 13912200 18090029 23957717 31751340 41353290 52105107 63231610 73820411
18680 73820411 82691333 88561118 90067449 87282459 81137833 72595553 64259534 58310295
18672 58310295 55890469 57394242 62381642 69732886 78224784 86575688 93399582 97303294
18664 97303294 96810931 91810427 83172803 71652236 59566823 48744313 39934928 33305417
18656 33305417 28519696 25089919 22590332 20723756 19288476 18118735 17141180 16292612
18648 16292612 15528156 14818634 14157765 13557706 13007241 12500116 12035496 11594923 11189723
$$ packed form
18707B106575Q1154J03556J13239J17076J27770J56005J63537J77865K09111K48392
18697C604280L00210L50660M22359N01728O22918Q13515J039311J392855J987120
18688A1034956K877244M177829N867688P793623R601950J0751817J1126503J0588801
18680G3820411Q870922N869785J506331k784990o144626q542280q336019n949239
18672E8310295k419826J503773M987400P351244Q491898Q350904O823894L903712
18664I7303294m92363n000504q637624j1520567j2085413j0822510q809385o629511
18656C3305417m785721l429777k499587j866576j435280j169741r77555q48568
18648A6292612p64456p09522o60869o00059n50465n07125m64620m40573m05200
$$ plain form
18639 11189723 10828645 10514999 10224949 9951395 9697555 9455136 9218796 8967948 8703315
18630 8703315 8431773 8172170 7924788 7679391 7428899 7177297 6943604 6723672 6529484
18621 6529484 6342010 6156368 5988215 5841222 5709223 5574634 5440469 5321129 5187602
18612 5187602 5060964 4948770 4831249 4730512 4629624 4520351 4421337 4323812 4234587 4138643
18602 4138643 4049300 3970415 3876703 3793656 3717295 3623626 3548215 3479895 3406137 3339322 3262374
18591 3262374 3190035 3110204 3038511 2984818 2937675 2883947 2825123 2763836 2708203 2654527 2598346
18580 2598346 2553510 2505113 2455133 2415166 2377565 2323168 2276317 2240641 2203694 2171412 2146694
18569 2146694 2125766 2102942 2080416 2066555 2055179 2033562 2006962 1995079 2001413 1999040 1988435 1974765
$$ packed form
18639A1189723l61078l13646k90050k73554k53840k42419k36340k50848k64633
18630H703315k71542k59603k47382k45397k50492k51602k33693k19932j94188
18621F529484j87474j85642j68153j46993j31999j34589j34165j19340j33527
18612E187602j26638j12194j17521j00737j00888j09273r9014r7525q9225r5944
18602D138643q9343p8885r3712q3047p6361r3669p5411o8320p3758o6815p6948
18591C262374p2339p9831p1693n3693m7143n3728n8824o1287n5633n3676n6181
18580B598346m4836m8397m9980l9967l7601n4397m6851l5676l6947l2282k4718
18569B146694k0928k2824k2526j3861j1376k1617k6600j1883O334k373j0605j3670
$$ plain form
18557 1974765 1968460 1971389 1980874 1983736 1966571 1964166 1961738 1937790 1906014 1892156 1884454 1887141 1887454
18544 1887454 1887745 1890395 1883988 1857380 1827238 1797300 1735958 1684429 1645875 1613814 1573890 1535546
18532 1535546 1525971 1527265 1512050 1498141 1466876 1420822 1398126 1360780 1317038 1283882 1257415 1240550
18520 1240550 1218294 1194797 1165253 1128509 1102725 1081250 1062191 1046574 1026506 1007775 989547
18509 989547 968238 955773 954203 944924 947373 937804 909678 886232 871780 857872 852229 839943
18497 839943 839221 834359 831734 839246 838693 830679 812662 797334 787646 781935 778631 766084 754426 762543
18483 762543 772909 768617 743700 729724 729732 735673 735861 730863 720522 716234 708397 699071 691706 683869
18469 683869 666907 651073 630223 623352 628191 622219 611755 598880 584004 573335 575794 561567
$$ packed form
18557A974765o305K929R485K862j7165k405k428k3948l1776j3858p702K687L13
18544A887454K91K650o407k6608l0142k9938o1342n1529l8554l2061l9924l8344
18532A535546r575J294j5215j3909l1265m6054k2696l7346m3742l3156k6467j6865
18520A240550k2256k3497k9544l6744k5784k1475j9059j5617k0068j8731j8228
18509I89547k1309j2465j570r279K449r569k8126k3446j4452j3908n643j2286
18497H39943p22m862k625P512n53q014j8017j5328r688n711l304j2547j1658Q117
18483G62543J0366m292k4917j3976QN941J88m998j0341m288p837r326p365p837
18469F83869j6962j5834k0850o871M839n972j0464j2875j4876j0669K459j4227
$$ plain form
18457 561567 541976 529393 515855 497283 479970 463663 451863 453669 438814 426906 424134 432670
18445 432670 429395 403406 402600 398745 396922 386389 381115 368335 350323 345990 332588 317864 311172
18432 311172 308704 297759 293025 290664 287621 292389 296611 280525 276956 280318 286921 278790 264162
18419 264162 254748 260078 271689 269617 262619 249480 244434 240439 251625 253346 230264 214744 213350
18406 213350 218668 210712 195557 199685 201244 202458 206556 204737 182620 182285 184983 171891 176368 179064
18392 179064 184861 180781 181432 172202 157380 170333 167471 155622 156075 158200 160849 145069 132694
18379 132694 129220 135451 148108 160113 160425 141744 130734 134081 121782 111416 122345 131511 120146
18366 120146 99146 91513 89049 101158 102216 105269 109888 110622 101274 103169 117125 122385 110275
$$ packed form
18457E61567j9591j2583j3538j8572j7313j6307j1800J806j4855j1908k772Q536
18445D32670l275k5989q06l855j823j0533n274j2780j8012m333j3402j4724o692
18432C11172k468j0945m734k361l043M768M222j6086l569L362O603q131j4628
18419B64162r414N330J1611k072o998j3139n046l995J1186J721k3082j5520j394
18406B13350N318p956j5155M128J559J214M098j819k2117l35K698j3092M477K696
18392A79064N797m080O51r230j4822J2953k862j1849M53K125K649j5780j2375
18379A32694l474O231J2657J2005L12j8681j1010L347j2299j0366J0929R166j1365
18366A20146k1000p633k464J2109J058L053M619P34r348J895J3956N260j2110
$$ plain form
18353 110275 101662 104372 97588 91741 86688 82550 84222 87422 108171 112761 92038 69902 80977
18340 80977 90416 87828 69589 68982 71780 65722 67604 65248 61724 73859 71758 69319 68606 67394
18326 67394 70958 87039 84201 74558 78636 80078 73568 64504 58153 49043 54581 52533 61175 59093
18312 59093 55106 55928 62808 57642 51925 48410 48899 48485 49174 37676 35746 33866 59908 84773 73888
18297 73888 52982 49355 36474 38922 41286 43282 39921 37583 40314 44206 42453 38955 36620 33696
18283 33696 24032 37659 36946 44037 40986 33108 16319 14413 11054 17596 23494 26068 31466 37870
18269 37870 41264 35025 27544 18483 17670 26848 30697 41857 50677 33429 23251 33520 39180 33306
18255 33306 25198 22165 5174 -5735 -23288 -7261 5666 20357 29807 32931 28435 12303 20817
$$ packed form
18353A10275q613K710o784n847n053m138J672L200K0749M590k0723k2136J1075
18340H0977R439k588j8239o07K798o058J882k356l524J2135k101k439p13j212
18326F7394L564J6081k838r643M078J442o510r064o351r110N538k048Q642k082
18312E9093l987Q22O880n166n717l515M89m14O89j1498j930j880K6042K4865j0885
18297G3888k0906l627j2881K448K364J996l361k338K731L892j753l498k335k924
18283C3696r664J3627p13P091l051p878j6789j906l359O542N898K574N398O404
18269C7870L394o239p481r061q13R178L849J1160Q820j7248j0178J0269N660n874
18255C3306q108l033j6991j0909j7553J6027J2927J4691R450L124m496j6132Q514
$$ plain form
18242 20817 28996 35186 43223 36913 34824 31417 21313 26364 31986 27448 30578 29886 26376 19841
18228 19841 13251 5669 13380 15113 1020 4208 9017 16142 15698 5893 -7623 -9623 -26390 -33034
18214 -33034 -19858 -16286 -5050 -3017 -14333 -12020 -3678 -7638 6771 24147 21529 9357 -12951
18201 -12951 -10371 5114 15063 2694 -10052 -10353 -3421 8062 3713 4475 28558 44069 39884
18188 39884 27284 5335 -7104 -10828 -8888 -19609 -17591 -9771 2125 1377 -7065 3140 13306
18175 13306 11759 10367 3209 977 1829 19184 37504 39165 26791 10530 9899 18853 20549 10868
18161 10868 11401 10174 19577 17073 19612 11134 -3713 -21443 -17345 -16511 -5332 6372 5204 8993
18147 8993 11844 14503 11583 15904 18298 2941 1604 15835 29253 32276 22707 7570 -2894
$$ packed form
18242B0817Q179O190Q037o310k089l407j0104N051N622m538L130o92l510o535
18228A9841o590p582P711J733j4093L188M809P125m44r805j3516k000j6767o644
18214c3034J3176L572J1236K033j1316K313Q342l960J4409J7376k618j2172k2308
18201a2951K580J5485R949j2369j2746l01O932J1483m349P62K4083J5511m185
18188C9884j2600k1949j2439l724J940j0721K018P820J1896p48q442J0205J0166
18175A3306j547j392p158k232Q52J7355J8320J661j2374j6261o31Q954J696r681
18161A0868N33j227R403k504K539q478j4847j7730M098Q34J1179J1704j168L789
18147H993K851K659k920M321K394j5357j337J4231J3418L023r569j5137j0464
$$ plain form
18134 -2894 -10506 113 16301 18744 4120 -5500 -3479 11711 16426 14560 3896 2827 1278
18121 1278 16182 20429 10429 11029 9571 5165 8817 10818 8753 3802 4267 5359 10804 12456 14751
18106 14751 8361 20350 31340 24241 12946 15469 19336 36064 37705 30322 24465 32984 30144
18093 30144 28245 35522 35280 39170 45791 43411 44267 58878 69299 78084 87451 107287 131863 176972
18079 176972 215093 255999 311589 383430 427473 459360 466640 468213 441654 407314 379874 350732
18067 350732 327121 312849 328585 360378 386267 420349 461203 486437 498207 476553 441844
18056 441844 379333 329583 283563 248247 214100 185175 164936 152274 133638 113964 116468 109612
18044 109612 97222 92335 82743 76719 91501 101499 93272 89231 86802 80716 69870 63693 57737
$$ packed form
18134b894p612J0619J6188K443j4624r620K021J5190M715j866j0664j069j549
18121A278J4904M247j0000O00j458m406L652K001k065m951M65J092N445J652K295
18106A4751o390J1989J0990p099j1295K523L867J6728J641p383n857Q519k840
18093C0144j899P277k42L890O621k380Q56J4611J0421Q785R367J9836K4576M5109
18079A76972L8121M0906N5590P1841M4043L1887P280J573k6559l4340k7440k9142
18067C50732k3611j4272J5736L1793K5889L4082M0854K5234J1770k1654l4709
18056D41844o2511m9750m6020l5316l4147k8925k0239j2662j8636j9674K504o856
18044A09612j2390m887r592o024J4782R998q227m041k429o086j0846o177n956
$$ plain form
18031 57737 53989 57466 64427 63831 64558 71011 69879 68493 70856 60612 50836 53434 54557 35954
18017 35954 33718 42340 52965 53169 51992 49866 45441 29750 36622 42089 39311 50985 46388 41952
18003 41952 38595 25154 20870 18524 27953 16599 19404 16335 19724 14430 23112 32741 35199 21083
17989 21083 21194 36015 37844 35052 29080 23622 31003 22772 29227 36160 22397 14142 18164 6486
17975 6486 7157 15287 6229 10290 10055 15174 11309 3358 -1363 18935 26243 -4660 -16637 -4992
17961 -4992 5528 6908 8290 12701 12343 16396 9929 11092 19953 14570 197 20475 22699 -7969
17947 -7969 -21511 -5059 3976 -6361 805 5586 3546 6212 2904 -462 -12473 -5600 6664
17934 6664 10094 6987 -3613 -10201 -9181 -18983 -17698 -19916 -15777 -7993 -1106 -831 17534 7664
$$ packed form
18031E7737l748L477O961n96P27O453j132j386K363j0244r776K598J123j8603
18017C5954k236Q622J0625K04j177k126m425j5691O872N467k778J1674m597m436
18003D1952l357j3441m284k346R429j1354K805l069L389n294Q682R629K458j4116
17989B1083J11J4821J829k792n972n458P381q231O455O933j3763q255M022j1678
17975F486O71Q130r058M061k35N119l865p951m721K0298P308l0903j1977J1645
17961d992J0520J380J382M411l58M053o467J163Q861n383j4373K0278K224l0668
17947g969j3542J6452R035j0337P166M781k040K666l308l366j2011O873J2264
17934F664L430l107j0600o588J020r802J285k218M139P784O887K75J8365r870
$$ plain form
17920 7664 -4660 7033 17031 13028 12858 7314 2415 4180 -10579 -18105 -15645 -2621 6231 6548
17906 6548 18957 14387 -4426 -1501 6804 8182 11329 11649 23553 25414 27561 31999 19688 5631
17892 5631 4428 16708 22864 13606 11193 -2301 -18249 -27528 -20175 -21381 -8622 21532 15351
17879 15351 -5267 -8240 -10081 -22052 -23108 -8044 12192 12449 7004 3571 10817 11133 -1024 -7056
17865 -7056 -22614 -17528 -174 -3923 -157 -7115 -7736 -1739 1955 503 6947 17629 15311 13790
17851 13790 2922 2064 -4970 -9064 -13863 -5681 11957 8087 7940 4503 -5810 -3423 14915 34688
17837 34688 38214 18302 6069 -5978 -19014 -20563 -18056 -24776 -17896 -24479 -25470 -10009 267
17824 267 -2678 -15328 -16877 -20798 -20994 -4194 -10536 -12047 -463 5037 -4102 -18081 -18090 -14926 -16204
$$ packed form
17920G664j2324J1693R998m003j70n544m899J765j4759p526K460J3024Q852L17
17906F548J2409m570j8813K925Q305J378L147L20J1904J861K147M438j2311j4057
17892E631j203J2280O156r258k413j3494j5948r279P353j206J2759L0154o181
17879A5351k0618k973j841j1971j056J5064K0236K57n445l433P246L16j2157o032
17865g056j5558N086J7354l749L766o958o21N997L694j452O444J0682k318j521
17851A3790j0868q58p034m094m799Q182J7638l870j47l437j0313K387J8338J9773
17837C4688L526j9912j2233j2047j3036j549K507o720O880o583r91J5461J0276
17824B67k945j2650j549l921j96J6800o342j511J1584N500r139j3979rL164j278
$$ plain form
17809 -16204 -6657 6998 7273 -501 -5026 -5998 -3956 -12501 -18492 -15030 -22602 -22702 -6857 -12958 -10462
17794 -10462 -3153 6054 11795 13277 11931 -2268 -28591 -35582 -19382 -13369 -9125 -10080 -9813 -12856
17780 -12856 -3005 2174 -710 -3488 -5765 2491 7566 -8249 -18324 -18361 -7759 6181 10918 15353
17766 15353 15253 2784 1680 2025 3439 752 -5488 -6772 -9826 -6942 -6086 -9948 -2077 -6097 -13840
17751 -13840 -17601 -8351 -10556 -23027 -24556 -21979 -17114 -10409 -7530 4468 5424 151 13289 26509
17737 26509 22541 18058 8360 3899 -194 -12775 -12189 -14337 -11532 -15260 -15447 -12768 -5290 4898
17723 4898 7040 4275 5181 2516 8176 8754 4932 2109 -1882 -1482 9044 -5377 -8296 -2008 9728
17708 9728 18921 5239 -13157 -14377 -8642 -16346 -8075 15754 15732 7943 12897 16233 7261 -3571
$$ packed form
17809a6204R547J3655K75p774m525r72K042q545n991L462p572j00J5845o101K496
17794a0462P309R207N741J482j346j4199k6323o991J6200O013M244r55K67l043
17780a2856R851N179k884k778k277Q256N075j5815j0075l7J0602J3940M737M435
17766A5353j00j2469j104L45J414k687o240j284l054K884Q56l862P871m020p743
17751a3840l761R250k205j2471j529K577M865O705K879J1998R56n273J3138J3220
17737B6509l968m483r698m461m093j2581N86k148K805l728j87K679P478J0188
17723D898K142k765R06k665N660N78l822k823l991M00J0526j4421k919O288J1736
17708I728R193j3682j8396j220N735p704Q271K3829k2p789M954L336q972j0832
$$ plain form
17694 -3571 6622 10142 3278 -7129 -18177 -18893 -23704 -15670 -8583 -7063 5023 7766 5188 -4306
17680 -4306 -1343 -8801 87 20201 23641 14388 13205 8590 787 6733 18790 16338 10471 19762
17666 19762 9921 -5679 -8360 -1532 -9911 -14709 -15640 -15950 -21145 -14678 4474 8316 6603 8283
17652 8283 11629 14775 6871 2611 3927 6300 13969 14368 5927 8412 8145 3608 7678 8469 -3794
17637 -3794 -3474 -13974 -15483 -21201 -23220 -12754 -2373 1826 7581 14689 3789 -5631 -14778 -9468
17623 -9468 -7484 -9669 -9952 -12581 -12058 -12485 -2344 -6547 -14237 -11219 -6840 2054 538 -3242 9716
17608 9716 17061 402 -15140 -31809 -25024 -17568 -16630 -24647 -28111 -26222 -19961 -2278 -2568 130
17594 130 -5563 -8786 -9789 -9501 -2596 2511 5647 -3112 -8649 -8064 -11210 8902 3777 1914 16360
$$ packed form
17694c571J0193L520o864j0407j1048p16m811Q034P087J520J2086K743k578r494
17680d306K963p458Q888K0114L440r253j183m615p803N946J2057k452n867R291
17666A9762r841j5600k681O828q379m798r31l10n195O467J9152L842j713J680
17652H283L346L146p904m260J316K373P669L99q441K485k67m537M070P91j2263
17637c794L20j0500j509n718k019J0466J0381M199N755P108j0900r420r147N310
17623i468J984k185k83k629N23m27J0141m203p690L018M379Q894j516l780J2958
17608I716P345j6659j5542j6669O785P456R38q017l464J889O261J7683k90K698
17594A30n693l223j003K88O905N107L136q759n537N85l146K0112n125j863J4446
$$ plain form
17579 16360 20934 729 -19210 -17206 3561 8916 -2587 -6297 -2127 6037 15935 17939 14047
17566 14047 21692 26911 15665 776 9016 23577 10769 -2098 4565 -3862 -6745 -7720 -9147
17553 -9147 2029 13055 12991 20295 23084 39424 42560 30128 35417 33028 19674 11613 1967 -7452
17539 -7452 -4243 -1953 1364 5756 9636 -9229 -4383 279 7174 6097 18012 42796 38080 26693
17525 26693 6508 -145 5396 5354 -11469 -24313 -16499 1391 11729 28217 28759 4357 -5236
17512 -5236 -6049 -12515 -14017 -4304 585 -3413 6777 27075 31115 8325 9568 9754 14417 10492
17498 10492 6982 9503 18059 14335 7010 19373 31367 29374 12605 13024 26428 23142 20335 25792
17484 25792 30268 38610 34365 13280 13816 8382 5157 8755 6815 6862 15956 23573 30629 28922 19082
$$ packed form
17579A6360M574k0205j9939K004K0767N355j1503l710M170Q164R898K004l892
17566A4047P645N219j1246j4889Q240J4561j2808j2867O663q427k883r75j427
17553i147J1176J1026o4P304K789J6340L136j2432N289k389j3354q061r646r419
17539g452L209K290L317M392L880j8865M846M662O895j077J1915K4784m716j1387
17525B6693k0185o653N541m2j6823j2844P814J7890J0338J6488N42k4402r593
17512e236q13o466j502R713M889l998J0190K0298M040k2790J243J86M663l925
17498A0492l510K521Q556l724p325J2363J1994j993j6769M19J3404l286k807N457
17484B5792M476Q342m245k1085N36n434l225L598j940M7R094P617P056j707r840
$$ plain form
17469 19082 21323 27397 23137 21545 15875 16299 25941 31124 14843 13808 14994 3807 11124 -2332
17455 -2332 -2787 -5149 -14413 -8142 6354 17356 4651 8138 10896 10698 7020 -919 -13080 -24651
17441 -24651 -15708 -90 2233 8567 19101 15197 1914 -7696 3240 5582 15328 7373 8312 13084
17427 13084 6625 3581 4303 9043 19957 26543 32136 38631 35728 26804 20580 22503 34243 39813
17413 39813 42071 52843 60211 59740 67163 73524 82869 95229 116655 149816 192850 253342 323943
17400 323943 402297 465911 517763 558218 553913 508547 450324 379741 316870 280479 278088 309731
17388 309731 354105 410639 445269 483067 523466 560585 564871 510867 416762 339842 277676 230813
17376 230813 185235 165748 152538 127902 108996 112524 120633 123104 117243 101680 82214 86235
$$ packed form
17469A9082K241O074m260j592n670M24R642N183j6281j035J186j1187P317j3456
17455b332m55k362r264O271J4496J1002j2705L487K758j98l678p939j2161j1571
17441b4651Q943J5618K323O334J0534l904j3283r610J0936K342R746p955R39M772
17427A3084o459l044P22M740J0914O586N593O495k903q924o224J923J1740N570
17413C9813K258J0772P368m71P423O361R345J2360K1426L3161M3034O0492P0601
17400C23943P8354O3614N1852M0455m305m5366n8223p0583o2871l6391k391L1643
17388C09731M4374N6534L4630L7798M0399L7119M286n4004r4105p6920o2166m6863
17376B30813m5578j9487j3210k4636j8906L528Q109K471n861j5563j9466M021
$$ plain form
17364 86235 89649 75477 62488 62434 64414 58332 56443 55677 46191 33691 44780 58541 68570 55777
17350 55777 54074 62838 61838 54887 43780 42337 51208 51759 50873 48758 52678 65704 62281 45185
17336 45185 36353 23697 25909 46752 58233 50455 40506 33903 26395 26328 20970 12952 2934 -4371
17322 -4371 9622 22830 25792 43577 37040 30785 29636 28877 31064 31699 32083 29023 19786 19964 17886
17307 17886 23773 50888 55039 44150 46260 38638 45168 55021 52417 44474 35813 34372 21825 9035
17293 9035 2931 8086 17545 29443 28335 27776 24095 27651 26281 20572 9188 -4630 -42 8102
17279 8102 5893 21517 33630 26323 25084 27708 24354 31639 36373 36285 31929 28782 27000 29398 26568
17264 26568 18873 12996 30093 34321 34427 34044 28012 19538 23840 12072 14469 13701 4904 2721 3311
$$ packed form
17364H6235L414j4172j2989n4J980o082j889p66r486j2500J1089J3761J0029j2793
17350E5777j703Q764j000o951j1107j443Q871N51q86k115L920J3026l423j7096
17336D5185q832j2656K212K0843J1481p778r949o603p508o7n358q018j0018p305
17322d371J3993J3208K962J7785o537o255j149p59K187O35L84l060r237J78k078
17307A7886N887K7115M151j0889K110p622O530R853k604p943q661j441j2547j2790
17293I035o104N155R459J1898j108n59l681L556j370n709j1384j3818M588Q144
17279H102k209J5624J2113p307j239K624l354P285M734q8m356l147j782K398k830
17264B6568p695n877J7097M228J06l83o032q474M302j1768K397p68q797k183N90
$$ plain form
17249 3311 12834 25325 9784 -561 6210 15294 31147 36825 28575 18417 23801 25675 18317
17236 18317 22326 20924 3010 -7739 -2658 7994 10424 17784 10090 6692 22709 21220 22157 19333
17222 19333 28704 21789 12843 16687 24874 35315 37702 29226 30106 33544 40631 28835 24610 18840
17208 18840 18958 21233 21839 18393 4350 -2477 -3119 -1446 234 11016 17016 14817 9849 12772 16670
17193 16670 15031 6738 911 4299 15275 11907 11210 25753 18864 27716 31896 22403 21770 18601
17179 18601 13726 14501 9906 10346 10715 11538 21799 20924 12959 -2013 1793 1194 10930 6065 18490
17164 18490 32004 19320 14966 8033 14926 16874 23982 29272 11792 15352 29338 34446 17723
17151 17723 2740 4171 13741 22075 17411 19906 26441 13938 4826 10470 3721 -5136 -18179 -11541
$$ packed form
17249C311R523J2491j5541j0345O771R084J5853N678q250j0158N384J874p358
17236A8317M009j402j7914j0749N081J0652K430P360p694l398J6017j489R37k824
17222A9333R371o915q946L844Q187J0441K387q476Q80L438P087j1796m225n770
17208A8840J18K275O06l446j4043o827o42J673J680J0782O000k199m968K923L898
17193A6670j639q293n827L388J0976l368o97J4543o889Q852M180r493o33l169
17179A8601m875P75m595M40L69Q23J0261q75p965j4972L806n99R736m865J2425
17164A8490J3514j2684m354o933O893J948P108N290j7480L560J3986N108j6723
17151A7723j4983J431R570Q334m664K495O535j2503r112N644o749q857j3043O638
$$ plain form
17137 -11541 8665 21894 23509 14804 20657 26473 34823 29579 11210 2105 697 3188 -6444 1292
17123 1292 14619 22070 8631 9637 25055 37747 42762 38346 39308 24872 5308 1835 9620
17110 9620 15249 15280 8565 14097 12689 4233 -8218 -906 13661 29132 34517 27445 29763 30354 30845
17095 30845 38131 41922 48718 52066 60303 52805 39733 35883 25062 21720 26873 29196 37458 50951
17081 50951 59710 63064 70470 66861 51375 34178 32178 43206 46137 54062 54700 53369 59899 69589
17067 69589 75768 70151 72398 72055 73255 88101 90915 77460 58376 48221 49803 59175 68782 74868
17053 74868 65582 68997 63100 56091 67338 84232 87363 77051 68838 54936 53847 51183 63314
17040 63314 68868 69767 57141 55016 48796 49717 71215 68882 51727 59019 76879 80368 74684 65184
$$ packed form
17137a1541K0206J3229J615q705N853N816Q350n244j8369r105j408K491r632P736
17123A292J3327P451j3439J006J5418J2692N015m416R62j4436j9564l473P785
17110I620N629L1o715N532j408q456j2451P312J4567J5471N385p072K318N91M91
17095C0845P286L791O796L348Q237p498j3072l850j0821l342N153K323Q262J3493
17081E0951Q759L354P406l609j5486j7197k000J1028K931P925O38j331O530R690
17067F9589O179n617K247l43J200J4846K814j3455j9084j0155J582R372R607O086
17053G4868r286L415n897p009J1247J6894L131j0312q213j3902j089k664J2131
17040F3314N554Q99j2626k125o220R21K1498k333j7155P292J7860L489n684r500
$$ plain form
17026 65184 54673 39676 32738 53092 67040 59163 61160 61443 50241 57417 65416 78506 86927
17013 86927 72873 69887 67681 69727 78059 83027 79910 71264 78164 94952 106946 122492 113327
17000 113327 100088 91575 66425 63186 59204 61492 73373 76514 89758 97342 97744 96140 82582
16987 82582 79201 92443 101306 93923 96470 96972 102862 106369 101919 108601 96320 84730 92375 92884
16973 92884 94004 110225 112211 128538 139170 129403 131680 138471 149301 146608 136216 136765 141350
16960 141350 144845 145282 152584 172485 195263 226925 281520 307249 322367 322310 332002 355880 369285
16947 369285 386589 416438 427777 434531 446384 495324 565185 600818 608043 586621 583078 587938
16935 587938 595632 601009 608695 611474 604184 591814 594526 617146 645366 651576 614711 569168 572553
$$ packed form
17026F5184j0511j4997o938K0354J3948p877J997K83j1202P176P999J3090Q421
17013H6927j4054k986k206K046Q332M968l117q646O900J6788J1994J5546r165
17000A13327j3239q513k5150l239l982K288J1881L141J3244P584M02j604j3558
16987H2582l381J3242Q863p383K547N02N890L507m450O682j2281j1590P645N09
16973I2884J120J6221J986J6327J0632r767K277O791J0830k693j0392N49M585
16960A41350L495M37P302J9901K2778L1662N4595K5729J5118n7R692K3878J3405
16947C69285J7304K9849J1339O754J1853M8940O9861L5633P225k1422l543M860
16935E87938P694N377P686K779p290j2370K712K2620K8220O210l6865m5543L385
$$ plain form
16922 572553 586012 584471 578949 574037 574184 565209 569889 560500 562184 551919 544579 549404 537315 525017
16908 525017 520610 518171 523582 536658 544711 558613 563682 557954 548019 554741 550173 538368 522933
16895 522933 519741 517216 503757 491158 501995 503681 504882 513463 524114 535120 556052 580189
16883 580189 589932 592559 598797 600662 597554 589890 597199 597791 603334 615585 633608 653894 698144
16870 698144 723398 753521 765616 776894 786075 816133 858014 888582 926927 975540 1027770 1085574
16858 1085574 1158683 1242065 1344906 1459118 1588042 1721709 1852638 1981057 2114065 2228225
16848 2228225 2319519 2398122 2513966 2668861 2881864 3148849 3475771 3865379 4322919 4846439
16838 4846439 5454992 6161051 7025572 8102117 9436540 11182014 13690731 17513507 23435959
$$ packed form
16922E72553J3459j541n522m912J47q975M680r389J684j0265p340M825j2089j2298
16908E25017m407k439N411J3076Q053J3902N069n728r935O722m568j1805j5435
16895E22933l192k525j3459j2599J0837J686J201Q581J0651J1006K0932K4137
16883E80189R743K627O238J865l108p664P309N92N543J2251J8023K0286M4250
16870F98144K5254L0123J2095J1278R181L0058M1881L0568L8345M8613N2230N7804
16858A085574P3109Q3382J02841J14212J28924J33667J30929J28419J33008J14160
16848B228225R1294P8603J15844J54895K13003K66985L26922L89608M57540N23520
16838D846439O08553P06059Q64521J076545J334423J745474K508717L822776N922452
$$ plain form
16829 23435959 32527677 45355767 60110373 73137634 83337222 92924674 102325963
16822 102325963 105186996 94968232 77762260 62844006 52912488 47915888 47672126 52342006
16814 52342006 61807504 73891933 84683718 92837443 100388635 107749577 108767401 96804352
16806 96804352 77585295 60319050 47474034 38431548 32185445 27850461 24809262 22613297
16798 22613297 20968773 19690124 18621196 17684707 16856893 16072465 15264406 14445513 13706617
16789 13706617 13046516 12437918 11899568 11435906 11039808 10713766 10427832 10164980 9902565
16780 9902565 9621651 9339944 9064040 8738776 8405373 8085236 7800326 7547893 7340239
16771 7340239 7155271 6979729 6796669 6627282 6467450 6307551 6144046 5999358 5848751
$$ packed form
16829B3435959R091718J2828090J4754606J3027261J0199588R587452R401289
16822A02325963K861033j0218764j7205972j4918254r931518m996600k43762M669880
16814E2342006R465498J2084429J0791785Q153725P551192P360942J017824j1963049
16806I6804352j9219057j7266245j2845016r042486o246103m334984l041199k195965
16798B2613297j644524j278649j068928r36489q27814p84428q08059q18893p38896
16789A3706617o60101o08598n38350m63662l96098l26042k85934k62852k62415
16780I902565k80914k81707k75904l25264l33403l20137k84910k52433k07654
16771G340239j84968j75542j83060j69387j59832j59899j63505j44688j50607
$$ plain form
16762 5848751 5693359 5552824 5436455 5321737 5200058 5090914 4981602 4866056 4749500
16753 4749500 4625909 4507371 4400155 4300511 4212021 4125428 4042844 3957166 3892133 3816066 3729091
16742 3729091 3649445 3581824 3496384 3404668 3334883 3256569 3166617 3086840 3022952 2958825 2906095
16731 2906095 2856741 2810235 2758399 2697246 2648111 2617018 2578229 2523264 2462370 2416717 2362204
16720 2362204 2316164 2258209 2224674 2194958 2159250 2132944 2118546 2103547 2102040 2111962 2116063 2112365
16708 2112365 2071258 2026418 2014196 1999589 1993090 1988740 1974232 1962684 1970196 1987341 2003333 2018035
16696 2018035 2004511 1951667 1886391 1842788 1851982 1869931 1893663 1918342 1897161 1859738 1857172 1850387
16684 1850387 1815143 1771214 1706631 1640110 1579674 1540699 1512558 1484922 1474285 1471938 1431668
$$ packed form
16762E848751j55392j40535j16369j14718j21679j09144j09312j15546j16556
16753D749500j23591j18538j07216r9644q8490q6593q2584q5678o5033p6067q6975
16742C729091p9646o7621q5440r1716o9785p8314q9952p9777o3888o4127n2730
16731B906095m9354m6506n1836o1153m9135l1093l8789n4965o0894m5653n4513
16720B362204m6040n7955l3535k9716l5708k6306j4398j4999j507R922M101l698
16708B112365m1107m4840j2222j4607o499m350j4508j1548P512J7145J5992J4702
16696B018035j3524n2844o5276m3603R194J7949K3732K4679k1181l7423k566o785
16684A850387l5244m3929o4583o6521o0436l8975k8141k7636j0637k347m0270
$$ plain form
16673 1431668 1397006 1386123 1357029 1314238 1280987 1248527 1224117 1194960 1162336 1130230 1092022
16662 1092022 1069310 1053777 1040562 1027255 1014541 991499 952104 921823 900687 894001 906270
16651 906270 919459 897969 869146 859994 852303 829846 812292 791029 778691 770028 768959 768676 760494
16638 760494 748775 736129 722537 724828 706040 683265 663247 649355 631645 616955 610950 603399
16626 603399 593570 583575 582009 578298 562694 545020 537182 536338 534085 520538 507864 498042 488845
16613 488845 488360 481598 477607 470897 455435 432853 430802 422355 424540 427639 416407 409257 406039 392403
16599 392403 387359 374526 356742 357441 355340 349257 335976 332674 340830 348767 343201 345714 347914 347931
16585 347931 341939 336190 326935 326332 321277 323733 322773 313907 317387 335708 351989 364371 365771 364044
$$ packed form
16673A431668l4662j0883k9094m2791l3251l2460k4410k9157l2624l2106l8208
16662A092022k2712j5533j3215j3307j2714k3042l9395l0281k1136o686J2269
16651I06270J3189k1490k8823r152p691k2457j7554k1263j2338q663j069k83q182
16638G60494j1719j2646j3592K291j8788k2775k0018j3892j7710j4690o005p551
16626F03399r829r995j566l711j5604j7674p838q44k253j3547j2674r822r197
16613D88845m85o762l991o710j5462k2582k051q447K185L099j1232p150l218j3636
16599C92403n044j2833j7784O99k101o083j3281l302Q156P937n566K513K200J7
16585C47931n992n749r255o03n055K456r60q866L480J8321J6281J2382J400j727
$$ plain form
16571 364044 372531 386013 395778 393298 398284 419889 424445 419871 397325 381210 372826 378936 382122
16558 382122 385319 391397 407587 417905 418206 424267 433432 431270 423449 388830 359386 343147 341637
16545 341637 334137 314828 310758 296837 293410 282320 258722 252338 253675 259452 250466 232646 222626
16532 222626 216462 213019 203306 210328 212062 201302 183490 168634 166618 167493 166353 161280 166109 166106
16518 166106 147701 142757 153414 176998 160014 136889 120775 112411 117468 113636 113800 119745 121830
16505 121830 121502 127514 134340 119795 115454 121376 124951 114165 101796 99328 103509 103543 109895 102496
16491 102496 97328 105380 95593 94493 92890 94877 95643 91242 83302 85384 101876 102939 94477 87236
16477 87236 79466 81186 89932 86197 65193 62110 51787 47494 45010 32659 34459 41773 43884 55295
$$ packed form
16571C64044Q487J3482R765k480M986K1605M556m574k2546j6115q384O110L186
16558C82122L197O078J6190J0318L01O061R165k162p821l4619k9444j6239j510
16545C41637p500j9309m070j3921l427j1090k3598o384J337N777q986j7820j0020
16532B22626o164l443r713P022J734j0760j7812j4856k016Q75j140n073M829l
16518A66106j8405m944J0657K3584j6984k3125j6114q364N057l832J64N945K085
16505A21830l28O012O826j4545m341N922L575j0786j2369k468M181L4O352p399
16491A02496n168Q052r787j100j603J987P66m401p940K082J6492J063q462p241
16477H7236p770J720Q746l735k1004l083j0323m293k484j2351J800P314K111J1411
$$ plain form
16463 55295 56685 56200 63646 64672 59377 57596 57239 55729 59812 69541 59659 51170 41194 38670 43641
16448 43641 45741 48082 55851 65644 65560 55044 45437 36202 25566 36244 51077 47502 53327 57516
16434 57516 49260 30446 16746 23017 45406 59692 57875 52267 53962 48432 40995 43201 46276
16421 46276 30479 14583 13047 5327 6010 21966 28714 24882 36816 48031 33767 11895 7129
16408 7129 3644 6104 21161 32866 32989 22188 9830 11237 28964 38170 21764 17971 33207
16395 33207 33189 34280 32608 38053 34606 27806 33193 31797 28700 26863 16074 5506 -1443 9534
16381 9534 21130 26755 25041 23260 16236 11643 14326 25975 38726 34284 21894 3114 9689
16368 9689 28384 22293 18474 4912 7194 23838 29340 12260 6889 7871 2884 9269 22726 30674
$$ packed form
16463E5295J390m85P446J026n295j781l57j510M083R729r882q489r976k524M971
16448D3641K100K341P769R793q4j0516r607r235j0636J0678J4833l575N825M189
16434E7516q256j8814j3700O271K2389J4286j817n608J695n530p437K206L075
16421D6276j5797j5896j536p720O83J5956O748l832J1934J1215j4264k1872m766
16408G129l485K460J5057J1705J23j0801j2358J407J7727R206j6406l793J5236
16395C3207j8J091j672N445l447o800N387j396l097j837j0789j0568o949J0977
16381I534J1596N625j714j781p024m593K683J1649J2751m442j2390j8780O575
16368I689J8695o091l819j3562K282J6644N502j7080n371R82m987O385J3457P948
$$ plain form
16354 30674 28286 28886 20993 7507 -471 328 7391 20246 24949 17990 14430 12754 14938 4597
16340 4597 -13993 -3384 -1166 3876 18249 30039 22790 10918 2758 1115 13263 17407 23251
16327 23251 24227 16144 12395 9472 -1189 12085 10185 -3324 -5138 -4289 5593 8089 2076 -5760
16313 -5760 2106 10331 1719 9688 10129 5402 -4515 7683 19259 19863 571 -1760 -7060 -6022
16299 -6022 4004 9187 8729 -167 -1047 -3446 3244 1910 -4165 1573 28648 40448 33745 33551 31451
16284 31451 22165 21755 16784 18498 28741 25326 13142 12391 10208 15070 -1916 -15024 -4013 18159
16270 18159 25324 20107 14378 25286 18393 14062 27261 16199 24975 19232 13374 19501 28753 29324
16256 29324 38354 47907 54946 56488 72220 96217 107297 133365 183199 253917 332739 402922
$$ packed form
16354C0674k388O00p893j3486p978P99P063J2855M703o959l560j676K184j0341
16340D597j8590J0609K218N042J4373J1790p249j1872q160j643J2148M144N844
16327B3251R76q083l749k923j0661J3274j900j3509j814Q49R882K496o013p836
16313e760P866Q225q612P969M41m727r917J2198J1576O04j9292k331n300J038
16299f022J0026N183m58q896q80k399O690j334o075N738K7075J1800o703j94k100
16284C1451r286m10m971J714J0243l415j2184p51k183M862j6986j3108J1011K2172
16270A8159P165n217n729J0908o893m331J3199j1062Q776n743n858O127R252N71
16256B9324R030R553P039J542J5732K3997J1080K6068M9834P0718P8822P0183
$$ plain form
16244 402922 443804 494957 543096 556908 508419 427912 358201 315515 295481 294178 316634 360666
16232 360666 432880 485979 497424 528726 564449 565907 499736 413005 333197 259869 201915 156019
16220 156019 137097 139347 123707 103872 97225 82512 66725 79227 85264 84759 81557 84388 76368
16207 76368 63838 54562 60524 63257 60030 71109 68254 64053 72263 66944 62064 53017 43768 42122
16193 42122 37968 47593 53664 59311 43911 33127 35766 32493 36785 53096 55805 44310 40121
16180 40121 45189 46384 35992 41186 36234 30841 24172 30759 29643 30927 24549 16562 11372 21921
16166 21921 37784 34894 30315 20770 7947 5568 11153 9109 7917 14757 25377 25691 23006 6323
16152 6323 12554 31130 35209 24093 22252 23541 23815 37380 34907 23330 30009 43309 43225 45553
$$ packed form
16244D02922M0882N1153M8139J3812m8489q0507o9711m2686k0034j303K2456M4032
16232C60666P2214N3099J1445L1302L5723J458o6171q6731p9808p3328n7954m5896
16220A56019j8922K250j5640j9835o647j4713j5787J2502O037n05l202K831q020
16207G6368j2530r276N962K733l227J1079k855m201Q210n319m880r047r249j646
16193D2122m154R625O071N647j5400j0784K639l273M292J6311K709j1495m189
16180D0121N068J195j0392N194m952n393o669O587j116J284o378p987n190J0549
16166B1921J5863k890m579r545j2823k379N585k044j192O840J0620L14k685j6683
16152F323O231J8576M079j1116j841J289K74J3565k473j1577O679J3300q4K328
$$ plain form
16138 45553 43990 35118 36346 42367 45383 48116 49234 30144 17663 5537 -2807 -7520 -749 3747
16124 3747 17172 25032 18915 23678 15209 12303 9968 16266 23357 39127 37333 29933 23486 17124
16110 17124 10133 2610 605 -144 4519 -414 -2776 8095 24188 31579 22871 25537 42283 33250
16096 33250 6843 -730 11876 26563 24759 14601 414 -2126 -5489 -1404 1310 -634 -7078
16083 -7078 -7246 6444 13167 10480 23962 37160 19755 1688 -181 14401 11357 14140 19928
16070 19928 4986 -5145 -13984 -14287 -8681 -15324 -17867 -18393 -20522 -32052 -25534 -726 8216 3133
16056 3133 6629 12991 16875 14795 8100 8974 1739 -3250 3257 24 -11518 -12770 5810 -3116
16042 -3116 -12356 -2991 2097 -895 -5231 2295 -9933 -14621 -14579 -11015 -1439 825 -5443 -17689 -22421
$$ packed form
16138D5553j563q872J228O021L016K733J118j9090j2481j2126q344m713O771M496
16124C747J3425P860o117M763q469k906k335O298P091J5770j794p400o447o362
16110A7124o991p523k005p49M663m933k362J0871J6093P391q708K666J6746r033
16096C3250k6407p573J2606J4687j804j0158j4187k540l363M085K714j944o444
16083g078j68J3690O723k687J3482J3198j7405j8067j869J4582l044K783N788
16070A9928j4942j0131q839l03N606o643k543n26k129j1530O518K4808Q942n083
16056C133L496O362L884k080o695Q74p235m989O507l233j1542j252J8580q926
16042c116r240R365N088k992m336P526j2228m688M2L564R576K264o268j2246m732
$$ plain form
16027 -22421 -9037 10013 7250 1203 3818 4072 -3354 -2064 3155 -3604 -18618 -30894 -31634 -22800
16013 -22800 -6411 6291 -3611 -636 -5561 1834 707 748 -8339 -19455 -15909 -8029 -8340 1094
15999 1094 -10895 -17012 -18280 -10886 -5569 -3321 -711 -7257 -13842 -7534 -6377 -6578 -1778 -385 -893
15984 -893 -9207 -12755 -10998 -762 -818 -8074 -2982 -6194 -10789 -13029 -8319 -2528 2332 6454 4290
15969 4290 6968 -3953 -4860 -12107 -21178 -16709 3737 8380 14668 20961 23032 18108 7559 -12716
15955 -12716 -6279 -4602 -14107 -23471 -15085 -13981 -11162 -2134 3604 -608 -2392 -11965 -5694 1089
15941 1089 -2223 -11805 -28199 -27516 -22179 -15381 -12950 -398 4670 10998 14227 -6913 -5372 -19076
15927 -19076 -21425 -14530 -6921 -12081 -14883 -17726 -12738 1649 -608 -2545 -3957 -560 -4633 -8410
$$ packed form
16027b2421J3384J9050k763o047K615K54p426J290N219o759j5014j2276p40Q834
16013b2800J6389J2702r902K975m925P395j127M1r087j1116L546P880l11R434
15999A094j1989o117j268P394N317K248K610o546o585O308J157k01M800J393n08
15984h93q314l548J757J0236n6p256N092l212m595k240M710N791M860M122k164
15969D290K678j0921r07p247r071M469K0446M643O288O293K071m924j0549k0275
15955a2716O437J677r505r364Q386J104K819R028N738m212j784r573O271O783
15941A089l312r582j6394O83N337O798K431J2552N068O328L229k1140J541j3704
15927a9076k349O895P609n160k802k843M988J4387k257j937j412L397m073l777
$$ plain form
15913 -8410 -12882 -14026 -11825 -1992 -3583 -11079 -11156 -5051 3791 -7388 -4087 -2236 1868 1214 -10801
15898 -10801 -19784 -17192 -21762 -14351 -2857 4439 6553 3963 -8940 -13250 -5169 5901 1815 10562
15884 10562 5813 562 7971 3014 -4198 -4275 -11475 -20244 -24195 -22118 -15637 -12511 -2991 4790 5801
15869 5801 3013 -2054 -280 -2519 -11930 -10791 -20325 -5018 -544 -5743 -4323 -10849 -7902 -4854
15855 -4854 -13551 -29309 -26405 -24623 -22234 -21848 -16777 -12871 -14472 -4322 15707 24753 20160 14126
15841 14126 5464 -657 -3209 281 -20140 -30791 -13454 -5446 1425 -10428 -14562 -5160 -9666
15828 -9666 -9675 -3556 2147 1332 -3858 -8129 -302 4510 660 -3949 -4140 -9454 -19691 -28661 -36149 -29764
15812 -29764 -22598 -13669 -16094 959 11550 7415 8070 8704 5853 4111 -13409 -27432 -18940 -6429
$$ packed form
15913h410m472j144K201R833j591p496p7O105Q842j1179L301J851M104o54j2015
15898a0801q983K592m570P411J1494P296K114k590j2903m310Q081J1070m086Q747
15884A0562m749n251P409m957p212p7p200q769l951K077O481L126R520P781J011
15869E801k788n067J774k239r411J139r534J5307M474n199J420o526K947L048
15855d854q697j5758K904J782K389L86N071L906j601J0150K0029R046m593o034
15841A4126q662o121k552L490k0421j0651J7337Q008O871j1853m134R402m506
15828i666rO119N703q15n190m271P827M812l850m609j91n314j0237q970p488O385
15812b9764P166Q929k425J7053J0591m135O55O34k851j742j7520j4023Q492J2511
$$ plain form
15798 -6429 -7649 7156 17833 14518 5610 2485 -7886 -16414 -12574 -7847 -11275 -8709 -13934 -7281
15784 -7281 -6789 -1450 8004 10074 10088 3780 1761 7711 14214 11140 19552 8685 10042 7885 13269
15769 13269 9710 3136 7682 12322 15633 27329 15961 14816 10584 10632 -131 3488 4934 4971 3304
15754 3304 1545 5277 -1009 -2521 4959 7102 -75 -2427 5085 -289 -6524 -3625 4440 4647 1607
15739 1607 -988 -2793 -12637 -18453 -20359 -12277 2985 6768 3371 2555 11747 23562 20642 5240
15725 5240 -1318 12097 9073 7651 -1840 4505 11139 2131 -10383 -9566 -15538 -7722 5443 20013
15711 20013 19751 6234 10640 1875 -2597 898 315 3566 2517 -4270 -2231 8713 7845 2174 -25346
15696 -25346 -16465 -6270 -10256 8896 11883 3417 -2746 -1600 -3928 4634 7659 24849 33007 19914
$$ packed form
15798f429j220J4805J0677l315q908l125j0371q528L840M727l428K566n225O653
15784g281M92N339R454K070J4o308k019N950O503l074Q412j0867J357k157N384
15769A3269l559o574M546M640L311J1696j1368j145m232M8j0763L619J446L7j667
15754C304j759L732o286j512P480K143p177k352P512n374o235K899Q065K07l040
15739A607k595j805r844n816j906Q082J5262L783l397q16R192J1815k920j5402
15725E240o558J3415l024j422r491O345O634r008j2514Q17n972P816J3165J4570
15711B0013k62j3517M406q765m472L495n83L251j049o787K039J0944q68n671k7520
15696b5346Q881J0195l986J9152K987q466o163J146k328Q562L025J7190Q158j3093
$$ plain form
15682 19914 107 -9087 -7417 4239 20383 10673 2572 -7340 -9057 -15174 -10463 -3354 -604 -12161
15668 -12161 -13769 -9142 771 988 8348 -8795 -24057 -16170 -19483 -24977 -19521 -9728 -4353 181
15654 181 8850 15360 8009 -1519 -8706 -9457 -12578 -8811 -1204 3052 17257 9832 -14020 -6789 -9307
15639 -9307 -11101 -20537 -19877 -22730 -16677 -5212 5815 -3253 -7095 -6232 4083 8049 -758 -18432
15625 -18432 -16918 -15563 -15607 -11159 -17199 -20032 -12434 -7566 -10642 -7019 9410 14128 9260 -3674
15611 -3674 -14760 -5088 4870 -6858 -18651 -5340 4970 904 -2094 -1047 -8375 -14578 -9051
15598 -9051 -796 8869 22609 2283 -15115 -20959 -28458 -20829 -18050 -17520 -29849 -24624 -13722 -7063
15584 -7063 -13019 -1066 -6235 -20649 -16946 -1820 4769 13285 22033 14982 6771 -14961 -15316 -11534
$$ packed form
15682A9914j9807r194J670J1656J6144r710q101r912j717o117M711P109K750j1557
15668a2161j608M627R913K17P360j7143j5262P887l313n494N456R793N375M534
15654A81Q669O510p351r528p187p51l121L767P607M256J4205p425k3852P231k518
15639i307j794r436O60k853O053J1465J1027r068l842Q63J0315L966q807j7674
15625a8432J514J355m4M448o040k833P598M868l076L623J6429M718m868j2934
15611c674j1086R672R958j1728j1793J3311J0310m066k998J047p328o203N527
15598i051Q255R665J3740k0326j7398n844p499P629K779N30j2329N225J0902O659
15584g063n956J1953n169j4414L703J5126O589Q516Q748p051q211k1732l55L782
$$ plain form
15570 -11534 -12770 -6501 -2332 -8981 -11415 -4142 2725 -869 12763 19662 10640 16768 8392 -1622
15556 -1622 -5011 -13786 -13227 11719 15475 549 -2388 -783 -6336 -8237 -8597 -10707 -16345 -5094
15542 -5094 1724 6719 -2686 -11482 -11430 -15521 -13149 -4878 6519 5440 -5183 -3566 12272 19570
15528 19570 21016 12958 3010 -993 -12311 2107 4802 -4783 -17513 -22241 -25077 -13352 -5642
15515 -5642 -7516 -2783 1297 -11066 -22462 -15196 -7158 4830 7884 1503 1923 3276 1717 -4975
15501 -4975 -6847 -9753 -22417 -12481 -9858 -10998 -27025 -26142 -17211 -14490 -3799 -4324 10375 9186
15487 9186 -381 -6966 -12478 -13918 -5322 7133 12758 3945 -4763 20 -6692 -13139 -25380 -33076
15473 -33076 -25170 -26066 -21251 -16588 -18367 -19426 -4774 -8679 -12428 -12907 -12735 -18200 -13070 4746 11958
$$ packed form
15570a1534j236O269M169o649k434P273O867l594J3632O899r022O128q376j0014
15556a622l389q775N59K4946L756j4926k937J605n553j901l60k110n638J1251
15542e094O818M995r405q796N2m091K372Q271J1397j079j0623J617J5838P298
15528A9570J446q058r948m003j1318J4418K695r585j2730m728k836J1725P710
15515e642j874M733M080j2363j1396P266Q038J1988L054o381M20J353j559o692
15501d975j872k906j2664R936K623j140j6027Q83Q931K721J0691n25J4699j189
15487I186r567o585n512j440Q596J2455N625q813q708M783o712o447j2241p696
15473c3076P906q96M815M663j779j059J4652l905l749m79J72n465N130J7816P212
$$ plain form
15458 11958 -879 -1327 -316 -549 5752 10428 7153 269 -6739 -17383 -22952 -16922 -5703 11028
15444 11028 27824 30123 20926 8617 7575 4636 -8168 -23756 -19628 -3743 -3410 -10661 -15097
15431 -15097 -14371 -7840 8310 18503 11844 11994 15264 17864 7450 -4206 -14799 -19338 -13720 -5443
15417 -5443 -10267 -10256 -23791 -10830 -5360 5918 3449 -220 -2901 -8555 -18491 -16332 -11218 -9704
15403 -9704 -10051 -1527 6768 9388 2896 -9451 -20692 -23514 -22557 -24051 -25995 -16862 -16284 -17542 -19487
15388 -19487 -7092 2775 -1731 -8403 -15695 -12946 -6879 -17542 -6189 2537 3692 7540 3910 13687
15374 13687 18092 26229 36886 32212 26828 18702 2618 334 8861 14531 12792 15980 26910 24748
15360 24748 3543 -7468 -15972 -14632 -1143 -1775 -19174 -25604 -12202 9126 6264 750 -7500
$$ packed form
15458A1958j2837m48J011k33O301M676l275o884p008j0644n569O030J1219J6731
15444A1028J6796K299r197j2309j042k939j2804j5588M128J5885L33p251m436
15431a5097P26O531J6150J0193o659J50L270K600j0414j1656j0593m539N618Q277
15417e443m824J1j3535J2961N470J1278k469l669k681n654r936K159N114J514
15403i704l47Q524Q295K620o492j2347j1241k822R57j494j944R133N78j258j945
15388a9487J2395R867m506o672p292K749O067j0663J1353Q726J155L848l630R777
15374A3687M405Q137J0657m674n384q126j6084k284Q527N670j739L188J0930k162
15360B4748k1205j1011q504J340J3489o32j7399o430J3402K1328k862n514q250
$$ plain form
15347 -7500 -14910 -23324 -24622 -16459 -6185 1038 -8765 -23930 -29074 -27776 -20139 -23609 -17782 7298
15333 7298 3261 -3499 -4242 -12630 -15987 -95 -1399 -1140 3371 1226 -9468 -5685 -88 -1757 -5807
15318 -5807 -12982 -10934 -10245 -19464 -25545 -23812 -8014 750 -5032 -11874 -13100 -10821 -8080 -5971 -9436
15303 -9436 -19087 -16360 1024 2884 1439 6959 10504 11944 9538 3954 10890 -2139 -11062 -10033
15289 -10033 -27698 -28700 -19473 1498 1556 -2504 -8858 -10907 -17070 -18699 -17432 -15226 -12697 -4394
15275 -4394 6898 3565 -2680 2471 -3540 133 -8321 -17444 -16093 -12048 -9035 -3034 -4691 -1848
15261 -1848 -1974 1499 -2839 -6082 -5604 -6523 -7203 -16399 -13652 -10066 -1403 -3831 -5634 -7762 -11827 -12247
15245 -12247 -15305 -3897 399 -8235 -14500 -9462 -4768 8700 19351 29656 15130 1223 8535
$$ packed form
15347g500p410q414j298Q163J0274P223r803j5165n144J298P637l470N827K5080
15333G298m037o760p43q388l357J5892j304K59M511k145j0694L783N597j669m050
15318e807p175K048O89r219o081J733J5798Q764n782o842j226K279K741K109l465
15303i436r651K727J7384J860j445N520L545J440k406n584O936j3029q923J029
15289a0033j7665j002R227K0971N8m060o354k049o163j629J267K206K529Q303
15275d394J1292l333o245N151o011L673q454r123J351M045L013O001j657K843
15261a848j26L473m338l243M78r19o80r196K747L586Q663k428j803k128m065m20
15245a2247l058J1408M296q634o265N038M694J3468J0651J0305j4526j3907P312
$$ plain form
15232 8535 10696 -1590 -6357 -2383 -801 5440 -1193 -7484 3003 16886 25397 16225 17091 18566
15218 18566 8161 -76 -1256 -9962 -9891 777 6036 16815 17932 2443 -621 -1729 -3990 -12744
15204 -12744 -16989 -9729 -8898 758 3394 2822 1951 -2186 3987 3727 2332 -1781 -7641 -3567 901
15189 901 1939 5602 5864 733 -3712 -14721 -12510 -23772 -28299 -25003 -27517 -22222 -15955 -14477 -18452
15174 -18452 -18952 -1503 2515 -7983 -7355 -654 -11317 -37142 -34599 -23637 -33947 -28560 -8160
15161 -8160 10275 1707 4128 849 -9053 -6388 -12433 -17702 -20816 -10747 782 -3783 4387 14976
15147 14976 7398 -3757 -13330 -10517 -698 -4209 -5695 -5229 -10261 -1004 5871 -10071 -22471 -20141
15133 -20141 -10322 13686 13426 6984 11709 20831 19359 17903 9574 1710 -8741 -11619 -2073 4476
$$ packed form
15232H535K161j2286m767L974J582O241o633o291J0487J3883Q511r172Q66J475
15218A8566j0405q237j180q706P1J0668N259J0779J117j5489l064j108k261q754
15204a2744m245P260Q31R656K636n72q71m137O173k60j395m113n860M074M468
15189I01J038L663K62n131m445j1009K211j1262m527L296k514N295O267J478l975
15174a8452n00J7449M018j0498O28O701j0663k5825K543J0962j0310N387K0400
15161h160J8435q568K421l279r902K665o045n269l114J0069J1529m565Q170J0589
15147A4976p578j1155r573K813R819l511j486M66n032R257O875j5942j2400K330
15133b0141R819K4008k60o442M725R122j472j456q329p864j0451k878R546O549
$$ plain form
15119 4476 1988 3961 -6566 -249 19757 25804 9983 123 -8104 -18058 -14213 -1267 -1772 -4579
15105 -4579 -16019 -21208 -10794 160 -1814 4117 2616 4584 -1675 -16891 -27847 -38692 -34148
15092 -34148 -21124 -14333 -20696 -18357 -15240 -14257 -14588 -21131 -22416 -19718 -14279 11253 4865 -9891
15078 -9891 -7699 -5371 -2194 7651 14228 5850 -164 5738 2600 -2390 4442 5162 11227 4474 -1749
15063 -1749 1159 -11591 -21304 -16382 -4114 -2212 -2077 18734 18992 19783 9409 8660 -222 -7027 3075
15048 3075 2671 -12328 -10763 -18169 -25875 -24084 -26954 -32259 -31073 -24496 -2688 -10737 -13623 -12018
15034 -12018 -9858 -2625 -3238 7265 17981 14012 2803 -2056 -10339 -5762 -7514 -20108 -23173 -14205
15020 -14205 4317 23629 30169 23299 16737 29061 25506 12513 -3016 4368 -5750 -22995 -27594
$$ packed form
15119D476k488J973j0527O317K0006O047j5821r860q227r954L845J2946n05k807
15105d579j1440n189J0414J0954j974N931j501J968o259j5216j0956j0845M544
15092c4148J3024O791o363K339L117R83l31o543j285K698N439K5532o388j4756
15078i891K192K328L177R845O577q378o014N902l138m990O832P20O065o753o223
15063a749K908j2750r713M922J2268J902J35K0811K58P91j0374p49q882o805J0102
15048C075m04j4999J565p406p706J791k870n305J186O577K1808q049k886J605
15034a2018K160P233o13J0503J0716l969j1209m859q283M577j752j2594l065Q968
15020a4205J8522J9312O540o870o562J2324l555j2993j5529P384j0118j7245m599
$$ plain form
15007 -27594 -18853 7153 16100 -422 -5115 -3004 -8080 -23266 -23992 -17149 -10863 -12730 -18268 -20653
14993 -20653 -25729 -22613 -16527 -26050 -33199 -25613 -12543 -246 -4476 223 3682 5036 7798 -15730
14979 -15730 -18017 -14825 -15320 -19115 -4091 -12405 -17338 -30984 -27851 -13437 -12672 -19336 -15017 -8401
14965 -8401 -13804 -15181 -24923 -19398 -22542 -33757 -30039 -30256 -24570 -20788 -14610 -17925 -21608 -26609 -29502
14950 -29502 -21997 -6065 -1686 -254 1952 -11176 -24925 -13709 -10845 -14745 -17482 -3605 -3381
14937 -3381 -10272 -15627 -17323 -11276 2429 -1172 -7401 -7533 -9860 -10274 -8999 1341 285 -11239
14923 -11239 -20307 -17438 -15974 -13642 -15966 -24512 -23479 -23882 -24529 -27729 -20475 -13985 -5649 -2440 1732
14908 1732 14095 6514 -513 -2216 10163 10502 2696 -941 -8416 -8270 1361 -1788 -9045 -18229 -12913
$$ packed form
15007b7594Q741K6006Q947j6522m693K111n076j5186p26O843O286j867n538k385
14993b0653n076L116O086r523p149P586J3070J2297m230M699L459J354K762k3528
14979a5730k287L192m95l795J5024q314m933j3646L133J4414P65o664M319O616
14965h401n403j377r742N525l144j1215L718k17N686L782O178l315l683n001k893
14950b9502P505J5932M379J432K206j3128j3749J1216K864l900k737J3877K24
14937c381o891n355j696O047J3705l601o229j32k327m14J275J0340j056j1524
14923a1239r068K869J464K332k324q546J033m03o47l200P254O490Q336L209M172
14908A732J2363p581p027j703J2379L39p806l637p475J46R631l149p257r184N316
$$ plain form
14893 -12913 -9993 -1064 -4688 -8067 -10143 -11343 -16465 -13080 -15197 -2482 1570 -4113 -8387 -7407
14879 -7407 -16464 -8014 -7752 4490 20444 16655 14723 5860 -1520 -1662 -5020 -2807 -5142 -16433
14865 -16433 -18127 -6447 -5728 -11901 -15968 -29308 -36723 -34927 -28090 -22634 -15196 -16215 -7408 -4177
14851 -4177 -12773 -14796 -7058 4199 4457 122 4985 7481 -3246 -9463 -3559 9247 17250 9992
14837 9992 14116 205 -14653 -12441 -1813 2580 1834 2338 7193 8059 2102 -4551 -1830 5273 1713
14822 1713 -6821 -2239 4940 -2647 -1231 1175 -11192 -11187 -375 -6684 -7899 -3865 -5442 -4030 -5851
14807 -5851 -22804 -32575 -37094 -46539 -38744 -27462 -5829 -17948 -23079 -22334 -13561 -10530 -16987 -14702
14793 -14702 -11755 -12276 -10150 -2426 14613 26002 26514 19185 20425 15662 1381 -6702 -15530 -19021
$$ packed form
14893a2913K920Q929l624l379k076j200n122L385k117J2715M052n683m274R80
14879g407r057Q450K62J2242J5954l789j932q863p380j42l358K213k335j1291
14865a6433j694J1680P19o173m067j3340p415J796O837N456P438j019Q807L231
14851d177q596k023P738J1257K58m335M863K496j0727o217N904J2806Q003p258
14837I992M124j3911j4858K212J0628M393p46N04M855Q66n957o653K721P103l560
14822A713q534M582P179p587J416K406j2367NJ0812o309j215M034j577J412j821
14807e851j6953r771m519r445P795J1282K1633j2119n131P45Q773L031o457K285
14793a4702K947n21K126P724J7039J1389N12p329J240m763j4281q083q828l491
$$ plain form
14779 -19021 -24941 -19740 -5618 1076 -11312 3458 9121 8387 12498 15312 9696 3866 -1812 8278
14765 8278 3955 8175 4357 -2612 -9817 -5158 9662 12257 20622 25036 3872 -3609 4515 7681
14751 7681 2454 2988 -5193 6907 5819 -421 1827 1733 -3096 934 2511 -5805 -10598 -12799 -11177
14736 -11177 -10056 -13271 -14481 -12240 -15833 -12360 2199 16581 18808 25782 17088 16020 5978 -11154
14722 -11154 -7785 10599 1294 6848 16003 27987 15251 11455 22821 17108 -1988 -3747 -10791
14709 -10791 -23998 -19441 -9821 -12321 -15932 -21148 -19883 -12701 -23574 -27684 -19959 -14244 -16272 -19208
14695 -19208 -23747 -29536 -30936 -29434 -23302 -14120 7939 6628 -11666 -11863 -8000 1496 19219 16864
14681 16864 3284 -11893 -17519 -17777 -11979 -9814 -16744 -11567 -24075 -23617 -15485 2654 7084 2283
$$ packed form
14779a9021n920N201J4122O694j2388J4770N663p34M111K814n616n830n678J0090
14765H278m323M220l818o969p205M659J4820K595Q365M414k1164p481Q124L166
14751G681n227N34q181J2100j088o240K248r4m829M030J577q316m793k201J622
14736a1177J121l215j210K241l593L473J4559J4382K227O974q694j068j0042j7132
14722a1154L369J8384r305N554R155J1984j2736l796J1366n713j9096j759p044
14709a0791j3207M557R620k500l611n216J265P182j0873m110P725N715k028k936
14695a9208m539n789j400J502O132R182K2059j311j8294j97L863R496J7723k355
14681A6864j3580j5177n626k58N798K165o930N177j2508M58Q132J8139M430m801
$$ plain form
14667 2283 -9109 -10487 -9633 4128 19508 22927 23292 12640 11266 13683 1131 -5937 -4287 -3746
14653 -3746 1635 1336 707 -3951 -13461 -12775 -5010 -1431 -16899 -19244 -17672 -8376 -22844 -29985 -33839
14638 -33839 -25923 -28686 -28375 -25264 -18329 972 13184 10705 746 -9374 -28769 -40282 -39797 -33297
14624 -33297 -20492 -11678 -6991 -7166 -7862 -12816 -25303 -20708 -7882 -9574 -20062 -25742 -19816 -19822 -18890
14609 -18890 -11660 -19527 -25012 -19106 -9729 -514 -6343 -20321 -25462 -24632 -12381 -14224 -29176 -22703
14595 -22703 -26791 -22161 -14157 -18387 -27169 -25411 -7682 -14628 -29755 -20238 -9107 -11468 -3256 -8860
14581 -8860 -16324 -7864 2326 -2176 8132 13059 5019 -7235 -23671 -30796 -26395 -24618 -12836
14568 -12836 1990 10275 -634 -8045 -3749 -5044 -15173 -16460 -7722 499 -5728 4435 12770
$$ packed form
14667B283j1392j378Q54J3761J5380L419L65j0652j374K417j2552p068J650N41
14653c746N381k99o29m658r510O86P765L579j5468k345J572R296j4468p141l854
14638c3839P916k763L11L111O935J9301J2212k479r959j0120j9395j1513M85O500
14624c3297J2805Q814M687j75o96m954j2487M595J2826j692j0488n680N926oR32
14609a8890P230p867n485N906R377R215n829j3978n141Q30J2251j843j4952O473
14595b2703m088M630Q004m230q782J758J7729o946j5127R517J1131k361Q212n604
14581h860p464Q460J0190m502J0308M927q040j2254j6436p125M401J777J1782
14568a2836J4826Q285j0909p411M296j295j0129j287Q738Q221o227J0163Q335
$$ plain form
14555 12770 18145 10028 -1312 -18819 -13801 -9706 -10968 -13443 -18194 -17249 -21829 -24346 -18113 -22796
14541 -22796 -35753 -32670 -30068 -19597 -3750 3214 -12569 -30210 -33634 -21111 -14567 -7367 -18627
14528 -18627 -27455 -17316 -7466 -2367 -4558 -18160 -20057 -20637 -28295 -26364 -19432 -17526 -19573 -16507
14514 -16507 -9415 -13134 -7305 -9831 -9774 -2767 -6558 -14948 -21683 -20189 -7998 5324 4737 -6852
14500 -6852 -16903 -25903 -21804 -18774 -15540 -15535 -20374 -9057 -13154 -18780 -18881 -11812 -3909 1915 2909
14485 2909 1628 3658 15412 13920 15708 6566 1745 -11098 -12436 -4004 6633 793 2240 -95
14471 -95 -3408 -4187 515 8925 5532 -984 -17230 -22001 -22681 -5073 -11632 -9405 -7637 -13183 -9298
14456 -9298 -2512 8891 20727 20727 11409 -1024 -6969 -2019 -6608 6458 18753 -1096 -15306 -19468
$$ packed form
14555A2770N375q117j1340j7507N018M095j262k475m751R45m580k517O233m683
14541b2796j2957L083K602J0471J5847O964j5783j7641l424J2523O544P200j1260
14528a8627q828J0139R850N099k191j3602j897n80p658J931O932J906k047L066
14514a6507P092l719N829k526N7P007l791q390o735J494J2191J3322n87j1589
14500f852j0051r000M099L030L234Nm839J1317m097n626j01P069P903N824R94
14485B909j281K030J1754j492J788r142m821j2843j338Q432J0637n840J447k335
14471i5l313p79M702Q410l393o516j6246m771o80J7608o559K227J768n546L885
14456i298O786J1403J1836%r318j2433n945M950m589J3066J2295j9849j4210m162
$$ plain form
14442 -19468 -15423 -24429 -27345 -10907 8601 2712 6323 9823 -163 -9241 -8694 -6456 1743 14232
14428 14232 8567 733 3084 -2207 -893 -382 -10398 -22773 -17922 -15033 -25478 -33981 -35277 -26325
14414 -26325 -18639 -14918 -6419 -21477 -28721 -22723 -4089 8042 1364 -12765 -11041 -4631 -1061
14401 -1061 -15331 -17793 -10787 -11650 -2883 -766 195 -8147 -13502 -14637 -6219 -1538 -7560 -6017 1756
14386 1756 1534 -8210 -10999 -10993 -2110 -527 5298 8166 -6286 -18792 -12810 -21528 -26293 -24434 -28408
14371 -28408 -32019 -15949 -11606 132 -2285 -10403 -8776 993 -6086 -5188 -9892 -2789 11389 17846
14357 17846 13960 12788 10099 -4440 -108 -6244 -12181 -12371 -2842 -3748 -2484 -1467 5632 11132 13063
14342 13063 14542 14164 19863 9229 2891 596 4016 -1519 -15502 -13477 180 -12618 -18189 -15071
$$ packed form
14442a9468M045r006k916J6438J9508n889L611L500r986r078N47K238Q199J2489
14428A4232n665p834K351n291J314N11j0016j2375M851K889j0445q503j296Q952
14414b6325P686L721Q499j5058p244N998J8634J2131o678j4129J724O410L570
14401a061j4270k462P006q63Q767K117R61q342n355j135Q418M681o022J543P773
14386A756k22r744k789OQ883J583N825K868j4452j2506N982q718m765J859l974
14371b8408l611J6070M343J1738k417q118J627R769p079Q98m704P103J4178O457
14357A7846l886j172k689j4539M332o136n937j90R529r06J264J017P099N500J931
14342A3063J479l78N699j0634o338k295L420n535j3983K025J3657j2798n571L118
$$ plain form
14328 -15071 -11698 -7674 -10950 -14630 308 -1745 -4331 -5997 -16364 -12138 -9430 -6605 2455 -4564
14314 -4564 -17754 -21684 -22026 -26131 -17467 -11359 -9379 -6935 -5186 -17073 -5498 -384 -10932 -19744
14300 -19744 -5604 6830 -4563 -7676 -3649 7068 17165 -3567 -18172 -23289 -32325 -23079 -22026
14287 -22026 -30463 -24704 -15594 -20098 -7572 10128 7769 -14386 -15029 -1203 8233 10193 4471 -9193
14273 -9193 -12675 -14091 -9285 2065 -8307 -20010 -27277 -20522 -11841 -18465 -15225 -8342 -34099 -25989
14259 -25989 -3833 13144 17575 25030 11511 4076 3154 691 -1926 -25846 -29576 -20770 -11873 -8718
14245 -8718 -1481 -2937 1227 -11524 -18508 -17627 -16526 -18350 -11353 -333 13456 10674 375 -4347
14231 -4347 -4425 1648 3871 -5009 -715 9089 12448 13919 10681 11082 9174 9059 -5459 -8103 -6896
$$ packed form
14328a5071L373M024l276l680J4938k053k586j666j0367M226K708K825R060p019
14314d564j3190l930l42m105Q664O108J980K444J749j1887J1575N114j0548q812
14300a9744J4140J2434j1393l113M027J0717J0097k0732j4605n117r036R246J053
14287b2026q437N759R110m504J2526J7700k359k2155o43J3826R436J960n722j3664
14273i193l482j416M806J1350j0372j1703p267O755Q681o624L240O883k5757Q110
14259b5989K2156J6977M431P455j3519p435r22k463k617k3920l730Q806Q897L155
14245h718P237j456M164j2751o984Q81J101j824O997J1020J3789k782j0299m722
14231d347p8O073K223q880M294R804L359J471l238M01j908j15j4518k644J207
$$ plain form
14216 -6896 -15320 -23683 -28087 -27404 -24738 -18157 -4482 18192 10209 -3643 -6564 -13988 -17653 -4947
14202 -4947 -5547 -6081 -8862 -16907 -25124 -20215 -16866 -13068 -1140 232 -18738 -25078 -25798 -8459 12486
14187 12486 16777 2697 -9026 -24143 -41247 -40036 -14719 -14253 -5137 -8444 -4970 -11905 -18201
14174 -18201 -20196 -23632 -16273 -10594 -17115 -10765 -3081 -84 13681 14590 12795 -7454 -4700 6732
14160 6732 10037 -1990 -17387 -26311 -22354 -21766 -19028 -8915 -8544 20 5126 3233 1257 6428
14146 6428 9127 5227 424 -13137 -22553 -21503 -5060 1723 6495 3682 1338 700 -9385 -16513
14132 -16513 -8828 -5692 4368 -7496 -18335 -17030 -11649 -4745 5755 12185 7661 16860 12291
14119 12291 14039 -967 -1966 4129 14345 21215 28554 25622 10591 2478 16264 3991 -7996
$$ packed form
14216f896q424q363m404O83K666O581J3675K2674p983j3852k921p424l665J2706
14202d947o00n34k781q045q217M909L349L798J1928J372j8970o340p20J7339K0945
14187A2486M291j4080j1723j5117j7104J211K5317M66R116l307L474o935o296
14174a8201j995l436P359N679o521O350P684K997J3765R09j795k0249K754J1432
14160F732L305j2027j5397q924L957N88K738J0113L71Q564N106j893j976N171
14146F428K699l900m803j3561r416J050J6443O783M772k813k344o38j0085p128
14132a6513P685L136J0060j1864j0839J305N381O904J0500O430m524R199m569
14119A2291J748j5006r99O095J0216O870P339k932j5031q113J3786j2273j1987
$$ plain form
14106 -7996 -1441 5452 -2763 -8181 -6557 2983 5514 6839 8876 6230 8255 -8674 -13129 -8452
14092 -8452 713 1591 -5760 -13430 -11386 -8696 -11456 -12423 -17436 -19204 -11129 -7065 -11606 -9914 -1019
14077 -1019 4940 6686 4942 5845 -2610 -62 4457 14637 15789 512 -11392 -1691 18074 20392
14063 20392 13555 -237 -3686 8627 12673 14699 15361 9343 -3987 -446 15514 -1012 -20186
14050 -20186 -24189 -22040 -14129 -6434 -8699 -8600 -8950 -8856 -16130 -14826 -3813 -2845 -4914 -12926 -19565 -14798
14034 -14798 -11677 -12258 -4160 6498 3346 -10509 -5983 6588 10647 7200 11989 12557 1074 -11049
14020 -11049 -17661 -11903 -1588 5141 10664 -3656 -5385 642 5072 2181 -6017 -2458 14155 29734
14006 29734 31555 27504 12160 -4530 -1238 839 -223 5872 -1734 1365 10411 19383 15403 12242
$$ packed form
14106g996O555O893q215n418J624R540K531J325K037k646K025j6929m455M677
14092h452R165Q78p351p670K044K690k760r67n013j768Q075M064m541J692Q895
14077a019N959J746j744R03q455K548M519J0180J152j5277j1904R701J9765K318
14063B0392o837j3792l449J2313M046K026O62o018j3330L541J5960j6526j9174
14050b0186m003K149P911P695k265R9l50R4p274J304J1013R68k069q012o639M767
14034a4798L121n81Q098J0658l152j3855M526J2571M059l447M789N68j1483j2123
14020a1049o612N758J0315O729N523j4320j729O027M430k891q198L559J6613J5579
14006B9734J821m051j5344j6690L292K077j062O095p606L099R046Q972l980l161
$$ plain form
13992 12242 12691 19923 6929 5578 5527 -2465 -502 10219 7210 668 -7072 -7846 -4968 -5817 -5960
13977 -5960 2763 -3664 -10639 -988 -6512 -25727 -23790 -16870 -19242 -18682 -9289 -962 -8938 -17898 -18980
13962 -18980 -12904 6225 15098 14335 15673 8985 -4481 -4236 -4839 -1617 -79 -6217 -11664 -9933 -10964
13947 -10964 -16756 -19463 -16904 -31477 -42481 -36399 -26479 -18903 -19851 -14318 3104 6787 -10851 -20034
13933 -20034 -13001 -5402 6546 4086 5342 -4002 925 16868 4751 5872 11748 2501 950 3260
13919 3260 2054 12486 20450 17862 7579 191 -4462 -991 -12678 -24234 -5084 4371 2937
13906 2937 -492 -2610 -6310 6093 22204 21407 15778 7847 -5211 -9459 -19683 -22254 -22406 -16796
13892 -16796 2432 6663 -1431 -1917 7452 11910 15709 6145 487 -6162 -7526 -2594 6098 -2172
$$ packed form
13992A2242M49P232j2994j351n1p992J963J0721l009o542p740p74K878q49j43
13977e960Q723o427o975R651n524j9215J937O920k372N60R393Q327p976q960j082
13962a8980O076J9129Q873p63J338o688j3466K45o03L222J538o138n447J731j031
13947a0964n792k707K559j4573j1004O082R920P576r48N533J7422L683j7638r183
13933b0034P033P599J1948k460J256r344M927J5943j2117J121N876r247j551K310
13919C260j206J0432P964k588j0283p388m653L471j1687j1556J9150R455j434
13906B937l429k118l700J2403J6111p97n629p931j3058m248j0224k571j52N610
13892a6796J9228M231q094m86R369M458L799r564n658o649j364M932Q692q270
$$ plain form
13878 -2172 -14533 -11388 -6269 -7880 1699 1807 -7496 -6638 -4688 7739 10217 4152 -4035 -8217 -11848
13863 -11848 -8919 528 -4208 -8112 -7253 -9977 -13710 -18522 -3144 7091 -3658 -3689 -4223 797 15113
13848 15113 12515 8364 7372 9370 9289 14307 22677 18807 17730 13859 13877 12351 -1357 -8063 -16754
13833 -16754 -24169 -7466 3161 7194 1564 -4108 1840 3982 19919 28914 16230 11122 8358
13820 8358 -4412 -1293 -2961 2659 4449 4299 -960 -3928 -4589 -3042 -6310 -2057 167 2010 -5134
13805 -5134 -8014 -11995 -11795 -20322 -27632 -16525 -8062 -19750 -12187 -1060 6236 3191 1994 2359
13791 2359 6426 14609 10757 1546 -153 -4647 6603 19157 17352 1734 15236 26834 22429
13778 22429 18405 10652 -460 2994 294 -15731 -12168 3650 5427 13610 19545 10753 2590 -10608
$$ packed form
13878b172j2361L145N119j611R579J08r303Q58J950J2427K478o065q187m182l631
13863a1848K929R447m736l904Q59k724l733m812J5378J0235j0749l1n34N020J4316
13848A5113k598m151r92J998q1N018Q370l870j077l871J8j526j3708o706q691
13833a6754p415J6703J0627M033n630n672N948K142J5937Q995j2684n108k764
13820H358j2770L119j668N620J790j50n259k968o61J547l268M253K224J843p144
13805e134k880l981K00q527p310J1107Q463j1688P563J1127P296l045j197L65
13791B359M067Q183l852r211j699m494J1250J2554j805j5618J3502J1598m405
13778B2429m024p753j1112L454k700j6025L563J5818J777Q183N935q792q163j3198
$$ plain form
13764 -10608 -3013 2571 -8437 -11526 -4175 -7976 4220 15831 5095 -5359 -5549 7486 13691
13751 13691 4562 948 7601 15313 13918 15944 16150 1650 -1077 17341 26497 28723 16294 22874
13737 22874 28906 13951 4446 16041 31795 33610 28247 8723 -1179 6662 183 -8571 2979
13724 2979 7910 5136 1184 647 -9617 -21509 -20944 -21553 -32608 -26505 -17487 -14803 -4796 7954
13710 7954 -579 -5836 -7815 -4438 5309 -2067 -2479 11910 10247 1914 13878 17689 13967 -7403
13696 -7403 -12811 -5220 7167 12343 12546 3625 11057 5087 -10509 -14195 -15632 -2971 -886 15182
13682 15182 22499 11238 341 -4004 -17157 -6359 2988 6276 719 15985 17661 15932 3630
13669 3630 -6500 -11892 2384 4918 -4281 -6622 -5011 -1722 2564 4823 -15 -3415 -538 11216
$$ packed form
13764a0608P595N584j1008l089P351l801J2196J1611j0736j0454j90J3035O205
13751A3691r129l614O653P712j395K026K06j4500k727J8418R156K226j2429O580
13737B2874O032j4955r505J1595J5754J815n363j9524r902P841o479q754J1550
13724B979M931k774l952n37j0264j1892N65o09j1055O103R018K684J0007J2750
13710G954q533n257j979L377R747p376m12J4389j663q333J1964L811l722k1370
13696g403n408P591J2387N176K03q921P432n970j5596l686j437J2661K085J6068
13682A5182P317j1261j0897m345j3153J0798R347L288n557J5266J676j729j2302
13669C630j0130n392J4276K534r199k341J611L289M286K259m838l400K877J1754
$$ plain form
13655 11216 5701 -2502 7300 17279 19644 14980 13372 13977 12346 14650 15500 9719 11312 7842 -6760
13640 -6760 -2576 703 11586 13093 3331 -8908 -15641 -22479 -20528 -7532 213 -518 6126 -4332
13626 -4332 1897 16007 29224 31029 15066 13766 24853 30246 12780 14519 23999 25694 34140
13613 34140 43698 32459 21356 17147 22959 15054 4228 -4942 4363 16784 8457 6507 -2229
13600 -2229 5931 -527 -11443 -21259 -11336 9598 15032 -2375 617 18265 16656 4401 5928
13587 5928 -4731 -15965 -10144 4808 6999 -12986 -13673 -8488 5101 15887 23648 24149 20124 21067
13573 21067 22070 16141 13485 12154 1390 13411 21377 31114 19611 19475 35280 30569 20824 14655
13559 14655 11449 18128 7261 6167 6664 656 8987 24510 28414 14194 -4704 -4542 6433 14342
$$ packed form
13655A1216n515q203R802R979K365m664j608O05j631K304Q50n781J593l470j4602
13640f760M184L279J0883J507r762j2239o733o838J951J2996P745p31O644j0458
13626d332O229J4110J3217J805j5963j300J1087N393j7466J739R480J695Q446
13613C4140R558j1239j1103m209N812p905j0826r170R305J2421q327j950q736
13600b229Q160o458j0916r816R923K0934N434j7407K992J7648j609j2255J527
13587E928j0659j1234N821J4952K191j9985o87N185J3589J0786P761N01m025R43
13573B1067J003n929k656j331j0764J2021P966R737j1503j36J5805m711r745o169
13559A4655l206O679j0867j094M97o008Q331J5523L904j4220j8898J62J0975P909
$$ plain form
13545 14342 15656 11189 -371 -4569 -1215 4643 8779 -6684 -16090 -17143 -13854 -15331 -21862 -25185
13531 -25185 -13438 -8665 -11708 -8816 -12101 -5562 8533 10601 13003 13881 12263 965 4725 -324
13517 -324 1956 1213 -2158 -676 5279 6188 -4226 -12303 -5219 3492 10925 -2315 -3586 9394 14092
13502 14092 10318 7968 12643 21644 18152 23478 14443 657 -5802 2196 12702 7580 1740 836
13488 836 19484 21833 11280 15784 16949 15858 9323 -11739 -10121 -427 -1471 1151 -13403 -11524
13474 -11524 -5215 327 2673 8541 -697 9995 13156 2506 904 -2376 -9094 -3396 -10425 2412
13460 2412 11514 13256 7433 11041 10193 -7086 -3041 -794 -10444 -709 16993 24407 24487 22497 31441
13445 31441 29032 25413 29316 23665 25196 12900 -2574 -4780 23578 48134 46783 42128 27351
$$ packed form
13545A4342J314m467j1560m198L354N858M136j5463r406j053L289j477o531l323
13531b5185J1747M773l043K892l285O539J4095K068K402Q78j618j1298L760n049
13517c24K280p43l371J482N955R09j0414q077P084Q711P433j3240j271J2980M698
13502A4092l774k350M675R001l492N326r035j3786o459P998J0506n122n840r04
13488H36J8648K349j0553M504J165j091o535k1062J618R694j044K622j4554J879
13474a1524O309N542K346N868r238J0692L161j0650j602l280o718N698p029J2837
13460B412R102J742n823L608q48j7279M045K247r650R735J7702P414Q0j990Q944
13445C1441k409l619L903n651J531j2296j5474k206K8358K4556j351m655j4777
$$ plain form
13432 27351 20389 20556 21249 17948 22833 27953 27422 29415 27405 19488 11942 13102 26723 26442 28956
13417 28956 18838 7183 4762 17929 18588 10727 11262 24062 29070 27133 23783 33703 23724 35482
13403 35482 50040 52188 46103 30801 26408 27910 25961 27730 25805 16132 33725 36592 26856 20582
13389 20582 21750 21510 22681 15560 25504 41751 47330 46953 47501 36409 29344 31630 22214 10224
13375 10224 17509 25561 29069 24825 22436 29907 34057 23040 19563 19053 29643 44843 42812 32163
13361 32163 18490 8281 23128 23533 29413 20616 17445 25772 28115 35918 31049 32093 35317 13138
13347 13138 18061 40487 40834 34148 36889 33861 34255 25386 29255 29041 28630 31191 16569 7859 21696
13332 21696 27556 21946 10564 4467 16833 22707 8134 28909 30466 28345 25716 32143 31063
$$ packed form
13432B7351o962J67O93l301M885N120n31J993k010p917p546J160J3621k81K514
13417B8956j0118j1655k421J3167O59p861N35J2800N008j937l350R920r979J1758
13403C5482J4558K148o085j5302m393J502j949J769j925r673J7593K867r736o274
13389B0582J168k40J171p121R944J6247N579l77N48j1092p065K286r416j1990
13375A0224P285Q052L508m244k389P471M150j1017l477n10J0590J5200k031j0649
13361C2163j3673j0209J4847M05N880q797l171Q327K343P803m869J044L224k2179
13347A3138M923K2426L47o686K741l028L94q869L869k14m11K561j4622q710J3837
13332B1696N860n610j1382o097J2366N874j4573K0775J557k121k629O427j080
$$ plain form
13319 31063 32628 42965 48724 54894 53331 39943 16643 16071 28102 40571 34098 34462 44002 56446
13305 56446 56318 58125 62848 59700 50152 57482 37867 31844 38279 36432 35071 39994 21775 16244
13291 16244 26241 23830 25347 27991 37381 54994 64149 57665 51804 37947 27523 33981 33264 28180
13277 28180 31751 43326 54859 55775 57668 49329 38591 44501 61608 54366 41746 38342 32639
13264 32639 25572 26442 28080 23674 22161 20280 24133 28139 23009 30583 41226 50283 46727 34806
13250 34806 27326 30859 43988 53958 56481 59508 58200 37750 29242 31630 27328 16252 14475 30536
13236 30536 35389 29418 27453 30628 47302 47991 57543 73482 81995 85728 80665 67860 60009 60490
13222 60490 64769 59176 58031 52099 37595 38650 31005 25696 35857 50268 56602 40938 42024
$$ packed form
13319C1063J565J0337N759O170j563j3388k3300n72J2031J2469o473L64R540J2444
13305E6446j28J807M723l148r548P330j9615o023O435j847j361M923j8219n531
13291A6244R997k411J517K644R390J7613R155o484n861j3857j0424O458p17n084
13277B8180L571J1575J1533R16J893q339j0738N910J7107p242j2620l404n703
13264C2639p067Q70J638m406j513j881L853M006n130P574J0643R057l556j1921
13250C4806p480L533J3129R970K523L027j308k0450q508K388m302j1076j777J6061
13236C0536M853n971j965L175J6674O89R552J5939Q513L733n063j2805p851M81
13222F0490M279n593j145n932j4504J055p645n309J0161J4411O334j5664J086
$$ plain form
13209 42024 39962 27380 27958 52450 68208 68987 60094 61572 55998 70988 86564 87137 94092 106620
13195 106620 114420 123550 107568 93648 87361 79315 70694 73584 77411 94290 100399 79987 81633
13182 81633 94569 99209 99855 99911 102152 100536 83660 94070 119289 131296 126406 113231 126961
13169 126961 147898 176875 185445 212239 248884 301130 373696 471499 604219 759044 1003528
13158 1003528 1325419 1689488 2053904 2399781 2718113 2942374 2996243 2828880 2498217 2033491
13148 2033491 1593452 1260380 1021689 846540 721300 637903 582280 521493 464279 435532
13138 435532 415034 392906 376915 363215 336287 306535 284872 286165 290305 276394 267157 268708
13126 268708 277178 268428 242919 229161 228177 230464 232930 216099 200207 208247 211631 209684 194976
$$ packed form
13209D2024k062j2582N78K4492J5758P79q893J478n574J4990J5576N73O955J2528
13195A06620P800R130j5982j3920o287q046q621K890L827J6879O109k0412J646
13182H1633J2936M640O46N6K241j616j6876J0410K5219J2007m890j3175J3730
13169A26961K0937K8977Q570K6794L6645N2246P2566R7803J32720J54825K44484
13158A003528L21891L64069L64416L45877L18332K24261N3869j67363l30663m64726
13148B033491m40039l33072k38691j75149j25240q3397n5623o0787n7214k8747
13138D35532k0498k2128j5991j3700k6928k9752k1663J293M140j3911r237J551
13126B68708Q470q750k5509j3758r84K287K466j6831j5892Q040L384j947j4708
$$ plain form
13113 194976 175566 167832 161351 163294 171063 169764 158393 158895 163990 145546 144596 145191 135281 141723
13099 141723 149777 153841 147504 139985 144840 141684 149299 149909 146459 134460 130551 124401 126789 128820
13085 128820 123520 121904 118363 121575 123641 123715 125527 118490 103607 116683 118291 106582 103156 103944
13071 103944 94969 86983 93082 106053 111452 111952 110711 116650 107676 114676 122200 110089 120936 120328
13057 120328 127835 119529 113197 112384 116774 133665 132445 121991 115968 101658 95669 87309 96310 120808
13043 120808 127831 112330 104620 93367 105292 119368 125895 136110 131882 122935 112789 118907 120982
13030 120982 110710 104720 105172 97515 94944 111379 112560 109471 113817 113265 104334 98157 101784 103535
13016 103535 97784 88205 67923 57976 54801 52850 51067 47713 66086 76648 80113 82234 87449
$$ packed form
13113A94976j9410p734o481J943P769j299j1371N02N095j8444r50N95r910O442
13099A41723Q054M064o337p519M855l156P615O10l450j1999l909o150K388K031
13085A28820n300j616l541L212K066P4J812p037j4883J3076J608j1709l426P88
13071A03944q975p986O099J2971N399N00j241N939q974P000P524j2111J0847o08
13057A20328P507q306o332q13M390J6891j220j0454o023j4310n989q360R001K4498
13043A20808P023j5501p710j1253J1925J4076O527J0215m228q947j0146O118K075
13030A20982j0272n990M52p657k571J6435J181l089M346n52q931o177L627J751
13016A03535n751r579k0282r947l175j951j783l354J8373J0562L465K121N215
$$ plain form
13003 87449 91584 94967 94584 87664 67872 64212 85224 110872 119516 129924 132515 139383 124347
12990 124347 124302 123631 130403 136872 134094 144543 143055 138569 130245 129820 135640 129473 132221 142219 168991
12975 168991 182323 184859 199610 212320 217888 223816 223170 228539 237655 243601 235475 218948 203768
12962 203768 182542 168233 171481 194275 213828 248217 275228 289905 305497 306206 298442 296035
12950 296035 297685 280756 272867 264536 261783 256429 266767 256295 245135 229513 223875 224338 222527
12937 222527 232132 246379 252902 240745 225499 214490 215703 224905 214594 216237 220022 227963 247561
12924 247561 243369 238931 233218 225069 225183 218636 214506 215225 217233 211748 197724 198763 196915 205033
12910 205033 227257 235186 236894 232555 251945 272376 273368 264420 230273 203769 186883 182236 190560
$$ packed form
13003H7449M135L383l83o920j9792l660K1012K5648Q644J0408K591O868j5036
12990A24347m5o71O772O469k778J0449j488m486q324m25N820o167K748R998K6772
12975A68991J3332K536J4751J2710N568N928o46N369R116N946q126j6527j5180
12962B03768k1226j4309L248K2794J9553L4389K7011J4677J5592P09p764k407
12950B96035J650j6929p889q331k753n354J0338j0472j1160j5622n638M63j811
12937B22527R605J4247O523j2157j5246j1009J213R202j0311J643L785P941J9598
12924B47561m192m438n713q149J14o547m130P19K008n485j4024J039j848Q118
12910B05033K2224P929J708m339J9390K0431R92q948l4147k6504j6886m647Q324
$$ plain form
12897 190560 200857 223694 241593 268851 279074 291077 292222 279131 276820 276901 264750 257840 260324
12884 260324 264982 262635 253502 258509 273216 271161 269494 272231 281135 303169 324418 344353 370814
12871 370814 404935 424020 440188 461577 478962 473316 434549 402934 400715 420556 417202 403288
12859 403288 404122 424261 440451 469537 488295 511853 528780 536085 545198 586287 636681 692248
12847 692248 732055 771822 862911 1013848 1189470 1362654 1479390 1567351 1618909 1689884 1755699
12836 1755699 1859956 1940817 2002127 2039312 2078294 2185616 2271169 2337139 2296116 2218500 2144457
12825 2144457 2044571 1989794 1945399 1873063 1800044 1740243 1688776 1642299 1615334 1575128 1536930
12814 1536930 1501592 1492715 1497573 1503940 1498400 1500554 1493676 1495868 1482164 1467027 1473792 1474620 1478706
$$ packed form
12897A90560J0297K2837J7899K7258J0223J2003J145j3091k311Q1j2151o910K484
12884B60324M658k347r133N007J4707k055j667K737Q904K2034K1249J9935K6461
12871C70814L4121J9085J6168K1389J7385n646l8767l1615k219J9841l354j3914
12859D03288Q34K0139J6190K9086J8758K3558J6927P305R113M1089N0394N5567
12847F92248L9807L9767R1089J50937J75622J73184J16736Q7961N1558P0975O5815
12836A755699J04257Q0861O1310L7185L8982J07322Q5553O5970m1023p7616p4043
12825B144457r9886n4777m4395p2336p3019n9801n1467m6477k6965m0206l8198
12814A536930l5338q877M858O367n540K154o878K192j3704j5137O765Q28M086
$$ plain form
12801 1478706 1475220 1461220 1464618 1463563 1493143 1511440 1516524 1532076 1562846 1597323 1628498 1661990
12789 1661990 1691446 1737131 1798195 1862969 1906825 1976813 2052619 2105948 2194145 2298873 2394374
12778 2394374 2489755 2595341 2695987 2773023 2810624 2829958 2808209 2756260 2701068 2657239 2627388
12767 2627388 2608424 2607207 2624561 2675539 2756388 2853320 2954385 3061970 3172862 3300716 3445499
12756 3445499 3591044 3746704 3908425 4086659 4255903 4422506 4589614 4772728 4991188
12747 4991188 5250323 5524447 5820847 6129546 6444741 6794950 7217308 7713772 8312707
12738 8312707 9026629 9858659 10770289 11776135 12905416 14138838 15418435 16733801 18155318
12729 18155318 19829351 21960910 24771506 28441051 33216987 39431571 47628391 58773095
$$ packed form
12801A478706l486j4000L398j055K9580J8297N084J5552L0770L4477L1175L3492
12789A661990K9456M5685O1064O4774M3856O9988P5806N3329Q8197J04728R5501
12778B394374R5381J05586J00646P7036L7601J9334k1749n1949n5192m3829k9851
12767B627388j8964j217J7354N0978Q0849R6932J01065J07585J10892J27854J44783
12756C445499J45545J55660J61721J78234J69244J66603J67108J83114K18460
12747D991188K59135K74124K96400L08699L15195L50209M22358M96464N98935
12738H312707P13922Q32030R11630J005846J129281J233422J279597J315366J421517
12729A8155318J674033K131559K810596L669545M775936O214584Q196820J1144704
$$ plain form
12721 58773095 74386102 97009586 130467378 178654868 241312628 311162046 380134935
12714 380134935 443591725 498388450 536361607 542675236 514142207 454958989 372187210
12707 372187210 290685771 226860718 180952142 148776958 126191926 109923206 97706460
12700 97706460 88105234 80306595 73830841 68335596 63615252 59546800 55996021 52896270
12692 52896270 50200681 47836774 45704092 43753999 41973383 40334661 38820749 37399940
12684 37399940 36043737 34755351 33507492 32321800 31201505 30153804 29176727 28258176
12676 28258176 27387034 26602184 25868783 25190704 24541838 23938564 23350942 22774096 22196356
12667 22196356 21616930 21047477 20493184 19971364 19495396 19047205 18627286 18223646 17841428
$$ packed form
12721E8773095J5613007K2623484L3457792M8187490O2657760O9849418O8972889
12714C80134935O3456790N4796725L7973157O313629k8533029n9183218q2771779
12707C72187210q1501439o3825053m5908576l2175184k2585032j6268720j2216746
12700I7706460r601226p798639o475754n495245m720344m068452l550779l099751
12692E2896270k695589k363907k132682j950093j780616j638722j513912j420809
12684C7399940j356203j288386j247859j185692j120295j047701r77077r18551
12676B8258176q71142p84850p33401o78079o48866o03274n87622n76846n77740
12667B2196356n79426n69453n54293n21820m75968m48191m19919m03640l82218
$$ plain form
12658 17841428 17477388 17112681 16746608 16380250 16006729 15639819 15287310 14947962 14617404
12649 14617404 14302631 14001175 13697288 13372067 13056826 12742576 12454612 12179181 11893532
12640 11893532 11629131 11381538 11145254 10934039 10758547 10575646 10413589 10279530 10148064
12631 10148064 10018249 9880196 9710692 9517537 9300074 9045959 8783345 8544756 8323816
12622 8323816 8127343 7942039 7754244 7571278 7407359 7256440 7129024 7003815 6881048
12613 6881048 6759941 6636162 6525516 6427492 6330988 6227322 6133660 6059248 6013247 5959035
12603 5959035 5920020 5934865 5989595 6074275 6171945 6235530 6239641 6207517 6187106 6210519 6264608
12592 6264608 6308834 6351496 6383542 6405010 6414800 6397652 6271021 6079437 5844585 5595508 5420485
$$ packed form
12658A7841428l64040l64707l66073l66358l73521l66910l52509l39348l30558
12649A4617404l14773l01456l03887l25221l15241l14250k87964k75431k85649
12640A1893532k64401k47593k36284k11215j75492j82901j62057j34059j31466
12631A0148064j29815j38053j69504j93155k17463k54115k62614k38589k20940
12622H323816j96473j85304j87795j82966j63919j50919j27416j25209j22767
12613F881048j21107j23779j10646r8024r6504j03666r3662p4412m6001n4212
12603E959035l9015J4845N4730Q4680R7670O3585M111l2124k0411K3413N4089
12592F264608M4226M2662L2046K1468R790j7148j26631j91584k34852k49077j75023
$$ plain form
12581 5420485 5320704 5314301 5363362 5372097 5355172 5304619 5186412 5038341 4898513 4747797 4596340
12570 4596340 4459080 4339121 4225748 4104957 4000290 3899536 3786663 3694749 3615074 3534944
12560 3534944 3459199 3371408 3268057 3181378 3123281 3084175 3040153 3017234 2996376 2948193 2909624
12549 2909624 2862516 2805055 2768277 2728668 2693193 2653577 2625177 2591982 2563984 2544474 2516115
12538 2516115 2469983 2425801 2369015 2322065 2285312 2237808 2191847 2155591 2135629 2106777 2073130
12527 2073130 2049060 2022586 1980697 1944993 1897676 1841232 1798674 1758504 1735731 1717676 1690293
12516 1690293 1660750 1651207 1644407 1641218 1619335 1582011 1553295 1535868 1512957 1488967 1474038 1441885
12504 1441885 1399881 1361123 1342633 1325200 1302775 1282332 1260986 1237862 1228445 1212146 1192340
$$ packed form
12581E420485r9781o403M9061Q735j6925n0553j18207j48071j39828j50716j51457
12570D596340j37260j19959j13373j20791j04667j00754j12873r1914p9675q0130
12560C534944p5745q7791j03351q6679n8097l9106m4022k2919k0858m8183l8569
12549B909624m7108n7461l6778l9609l5475l9616k8400l3195k7998j9510k8359
12538B516115m6132m4182n6786m6950l6753m7504m5961l6256j9962k8852l3647
12527B073130k4070k6474m1889l5704m7317n6444m2558m0170k2773j8055k7383
12516A690293k9543r543o800l189k1883l7324k8716j7427k2911k3990j4929l2153
12504A441885m2004l8758j8490j7433k2425k0443k1346k3124r417j6299j9806
$$ plain form
12493 1192340 1195657 1193168 1181359 1160554 1136238 1133593 1126653 1104980 1087753 1067634 1040342 1018358
12481 1018358 1000219 986320 971018 951681 951723 954632 933063 912746 891508 882216 852174 817866
12469 817866 806268 796673 805384 825243 831243 811888 779631 772426 772671 779264 773548 761115 758408
12456 758408 758348 745183 717682 695618 682476 673296 666392 660958 643476 637357 639581 624827 616255
12443 616255 608206 606318 600057 598091 599740 586105 573565 561812 554686 536443 519933 515559 511385
12430 511385 503237 498610 490646 481924 488373 500975 502645 499632 491189 479431 480694 471185 468467 461880
12416 461880 451793 427350 431299 433811 429075 404592 399179 394382 382406 380091 388707 374373 366467
12403 366467 363379 353131 344645 343229 339207 334350 315101 321769 331352 333979 325155 310188 299868
$$ packed form
12493A192340L317k489j1809k0805k4316k645o940k1673j7227k0119k7292k1984
12481A018358j8139j3899j5302j9337M2K909k1569k0317k1238r292l0042l4308
12469H17866j1598r595Q711J9859O000j9355l2257p205K45O593n716j2433k707
12456G58408o0j3165k7501k2064j3142r180o904n434j7482o119K224j4754q572
12443F16255q049j888o261j966J649j3635j2540j1753p126j8243j6510m374m174
12430E11385q148m627p964q722O449J2602J670l013q443j1758J263r509k718o587
12416D61880j0087k4443L949K512m736k4483n413m797j1976k315Q616j4334p906
12403C66467l088j0248q486j416m022m857j9249O668R583K627q824j4967j0320
$$ plain form
12390 299868 300900 315987 311676 318841 310793 306202 316466 315254 305375 295957 276309 273587 262453
12377 262453 248758 252375 244293 241894 247681 232758 225333 232333 238435 254982 259299 243241 249726
12364 249726 254019 248094 241126 234854 233143 239337 239068 226743 209819 212248 218854 211562 207004 200239
12350 200239 198943 205768 210070 206358 187002 174505 180974 184393 189832 186523 173475 170247 182813
12337 182813 182792 180969 181802 174839 168571 168036 160242 147058 158839 152609 138860 155892 162830 164838
12323 164838 157382 148686 142981 138123 151878 167185 166108 163576 146692 129632 112548 110702 113281
12310 113281 121470 108337 93288 116459 118708 118063 119795 116306 125773 133337 119115 115348 109605
12297 109605 115658 121865 127978 139901 138717 140398 142218 148020 164561 169542 165309 154842 157059
$$ packed form
12390B99868J032J5087m311P165q048m591J0264j212r879r418j9648k722j1134
12377B62453j3695L617q082k399N787j4923p425P000O102J6547M317j6058O485
12364B49726M293n925o968o272j711O194k69j2325j6924K429O606p292m558o765
12350B00239j296O825M302l712j9356j2497O469L419N439l309j3048l228J2566
12337A82813k1j823Q33o963o268n35p794j3184J1781o230j3749J7032O938K008
12323A64838p456q696n705m858J3755J5307j077k532j6884j7060j7084j846K579
12310A13281Q189j3133j5049K3171K249o45J732l489R467P564j4222l767n743
12297A09605O053O207O113J1923j184J681J820N802J6541M981m233j0467K217
$$ plain form
12284 157059 179894 203664 201359 215996 211900 223275 232413 239424 274996 331521 387070 468672
12272 468672 592959 756870 973395 1280337 1644979 2028629 2391450 2714057 2939131 2999582
12262 2999582 2876126 2560994 2136510 1694453 1332951 1091759 919669 804898 705749 624885
12252 624885 569780 518679 470599 438032 406133 374897 364164 344812 327018 311622 295183
12241 295183 274746 280497 270943 263425 259714 254096 240332 229987 234516 233405 221431 209596 201308
12228 201308 189737 185357 196216 201124 195158 180247 175929 183111 184410 182232 179409 166467 147118
12215 147118 148003 147689 162824 165924 160779 155056 141754 141223 147250 152579 137752 136881 135966 136453 136236
12200 136236 128732 127938 130759 139381 134929 130513 128363 116454 120133 128816 123221 113976 94972 102209
$$ packed form
12284A57059K2835K3770k305J4637m096J1375R138P011L5572N6525N5549Q1602
12272D68672J24287J63911K16525L06942L64642L83650L62821L22607K25074O0451
12262B999582j23456l15132m24484m42057l61502k41192j72090j14771r9149q0864
12252F24885n5105n1101m8080l2567l1899l1236j0733j9352j7794j5396j6439
12241B95183k0437N751r554p518l711n618j3764j0345M529j111j1974j1835q288
12228B01308j1571m380J0859M908n966j4911m318P182J299k178k823j2942j9349
12215A47118Q85l14J5135L100n145n723j3302n31O027N329j4827q71r15M87k17
12200A36236p504p94K821Q622m452m416k150j1909L679Q683n595r245j9004P237
$$ plain form
12186 102209 116625 119406 128802 123658 120971 115659 116273 108908 102600 102001 112692 108393 106169 89673
12172 89673 82441 84578 94049 85884 97086 110177 109264 99380 94305 99278 99305 93931 83491 87239
12158 87239 83713 76519 80666 80998 74556 64688 71922 77330 63826 60639 76743 70614 70911 84272
12144 84272 87766 84465 90512 80544 70949 77749 76964 69636 74452 76992 76405 69309 68413 73425 78561
12129 78561 80381 83024 80649 81735 76130 64258 77965 80352 80403 65457 78954 81398 88541 100918
12115 100918 89912 81458 80761 74553 74777 70345 66689 69562 75954 77531 74232 70405 77309 82974
12101 82974 81156 86311 88704 85630 91813 90992 92437 94214 72940 50523 52580 44210 49950 55605
12087 55605 80589 86290 77198 70720 80363 82941 73659 63490 56436 54699 60385 61013 69403 71758
$$ packed form
12186A02209J4416K781R396n144k687n312O14p365o308n99J0691m299k224j6496
12172H9673p232K137R471q165J1202J3091r13r884n075M973K7n374j0440L748
12158H7239l526p194M147L32o442r868P234N408j3504l187J6104o129K97J3361
12144H4272L494l301O047r968r595O800p85p328M816K540n87p096q96N012N136
12129G8561J820K643k375J086n605j1872J3707K387N1j4946J3497K444P143J2377
12115A00918j1006q454o97o208K24m432l656K873O392J577l299l827O904N665
12101H2974j818N155K393l074O183q21J445J777k1274k2417K057q370N740N655
12087E5605K4984N701r092o478R643K578r282j0169p054j737N686O28Q390K355
$$ plain form
12073 71758 63300 65203 74804 93108 101357 102417 100689 85927 93265 83497 73593 83304 89688 87946
12059 87946 78412 78386 92697 105945 110581 106431 97526 99545 88481 84181 84237 84917 95934 104599 94304
12044 94304 105696 103590 109896 116079 111167 107078 100640 95414 87719 87624 97278 115050 108160 107570 121346
12029 121346 121314 121080 113234 107616 116072 119968 117220 126176 129925 126423 124326 121440 112543 109035 108956
12014 108956 109954 107917 109443 122731 128952 124552 121894 132295 135681 130818 125826 128809 135374 148057
12000 148057 166173 168209 162220 161402 159879 159780 164070 161494 163458 167804 167851 174524 174300 178917 180807
11985 180807 171424 189927 203055 218468 224345 230527 249586 265157 266606 277613 296036 304984
11973 304984 309936 321511 335744 335346 357291 374290 398280 421298 422451 435698 447996 471119
$$ packed form
12073G1758q458J903R601J8304Q249J060j728j4762P338r768r904R711O384j742
12059H7946r534k6J4311J3248M636m150q905K019j1064m300N6O80J1017Q665j0295
12044I4304J1392k106O306O183m912m089o438n226p695r5R654J7772o890n90J3776
12029A21346l2k34p846n618Q456L896k748Q956L749l502k097k886q897l508p9
12014A08956R98k037J526J3288O221m400k658J0401L386m863m992K983O565J2683
12000A48057J8116K036n989q18j523r9M290k576J964M346M7O673k24M617J890
11985A80807r383J8503J3128J5413N877O182J9059J5571J449J1007J8423Q948
11973C04984M952J1575J4233l98K1945J6999K3990K3018J153J3247J2298K3123
$$ plain form
11961 471119 493623 517758 525935 559952 605071 644068 681684 718247 757600 820642 869231 920254
11949 920254 979207 1054385 1141898 1216387 1295821 1381469 1483867 1593868 1719484 1844940 1982995
11938 1982995 2147379 2314943 2479742 2635083 2784580 2922607 3062995 3193100 3284364 3346798
11928 3346798 3370448 3365525 3347282 3302030 3221411 3115184 3002617 2880618 2758164 2619556
11918 2619556 2505519 2375073 2249874 2136255 2032314 1930167 1832206 1753556 1678356 1606995
11908 1606995 1543395 1476490 1426862 1364591 1298412 1254936 1220170 1197891 1172386 1139103 1117098
11897 1117098 1104239 1078473 1052250 1036541 1013575 987074 959748 943289 926439 916984 892643
11886 892643 851766 816046 792046 777966 761181 736141 705584 697927 672971 647600 635927 611625
$$ packed form
11961D71119K2504K4135Q177L4017M5119L8997L7616L6563L9353O3042M8589N1023
11949I20254N8953P5178Q7513P4489P9434Q5648J02398J10001J25616J25456J38055
11938A982995J64384J67564J64799J55341J49497J38027J40388J30105R1264O2434
11928C346798K3650m923j8243m5252q0619j06227j12567j21999j22454j38608
11918B619556j14037j30446j25199j13619j03941j02147r7961p8650p5200p1361
11908A606995o3600o6905m9628o2271o6179m3476l4766k2279k5505l3283k2005
11897A117098j2859k5766k6223j5709k2966k6501k7326j6459j6850r455k4341
11886H92643m0877l5720k4000j4080j6785k5040l0557p657k4956k5371j1673k4302
$$ plain form
11874 611625 580865 569746 560697 559959 550282 531610 505385 475497 466637 461370 450565 443229 440066
11861 440066 420160 410974 400148 382937 363823 347103 334449 340553 339137 327274 333434 321712
11849 321712 293627 285097 283381 276583 286057 281072 265650 257841 254627 247390 240735 231773 229093 226175
11835 226175 227460 222271 223288 223289 208442 204403 201579 206796 200851 207039 214449 209546 208241 220405
11821 220405 223916 235374 222687 202984 206300 202787 191614 210513 214936 202945 198206 202420 208149
11808 208149 205309 200949 194009 188573 185666 172985 169770 170736 167598 167203 168660 169741 170805 160970
11794 160970 155400 144280 149703 151320 156345 156741 153127 153677 145113 142527 140284 150567 153815 153936
11780 153936 151880 155282 153297 140488 125693 121511 120022 115514 115136 112165 115949 123550 119813 115945
$$ packed form
11874F11625l0760j1119r049p38r677j8672k6225k9888q860n267j0805p336l163
11861D40066j9906r186j0826j7211j9114j6720j2654O104j416j1863O160j1722
11849C21712k8085q530j716o798R474m985j5422p809l214p237o655q962k680k918
11835B26175J285n189J017Jj4847m039k824N217n945O188P410m903j305J2164
11821B20405L511J1458j2687j9703L316l513j1173J8899M423j1991m739M214N729
11808B08149k840m360o940n436k907j2681l215R66l138l95J457J081J064r835
11794A60970n570j1120N423J617N025L96l614N50q564k586k243J0283L248J21
11780A53936k056L402j985j2809j4795m182j489m508l78k971L784P601l737l868
$$ plain form
11766 115945 105819 101405 106519 94332 93197 100619 98116 95884 89405 81652 83687 86120 84075 87607
11752 87607 77111 71582 73650 72915 69204 66704 74721 79947 78439 73097 72515 88257 89912 84697
11738 84697 87653 87249 76934 73509 65537 74447 90522 87407 80536 71485 74490 79545 77234 70986
11724 70986 74779 59496 52020 57376 65853 77901 69964 58414 52984 48533 42128 41592 45390 46896
11710 46896 44076 47301 56854 59392 58549 53822 46881 47723 44556 39506 44227 57250 49005 46425 49005
11695 49005 63031 65260 65236 65208 58199 49474 46104 43813 58514 58324 46921 35494 29617 24453 22680
11680 22680 32434 33953 34762 28728 30200 40397 54049 44254 32071 11969 7705 21919 37891
11667 37891 37710 41962 45397 47160 37501 27726 32555 46370 46643 47534 55778 58453 57983 52598 45823
$$ packed form
11766A15945j0126m414N114j2187j135P422k503k232o479p753K035K433k045L532
11752H7607j0496n529K068p35l711k500Q017N226j508n342n82J5742J655n215
11738H4697K956m04j0315l425p972Q910J6075l115o871r051L005N055k311o248
11724G0986L793j5283p476N356Q477J2048p937j1550n430m451o405n36L798J506
11710D6896k820L225R553K538q43m727o941Q42l167n050M721J3023q245k580K580
11695D9005J4026K229k4k8p009q725l370k291J4701j90j1403j1427n877n164j773
11680B2680R754J519Q09o034J472J0197J3652r795j2183k0102m264J4214J5972
11667C7891j81M252L435J763r659r775M829J3815K73Q91Q244K675m70n385o775
$$ plain form
11652 45823 44527 37476 22784 24507 32416 37892 48063 46398 39109 41410 39337 46888 35374 29051
11638 29051 2592 3209 24848 29896 19966 16660 25041 35062 31139 40842 59586 59320 50691 43632
11624 43632 46739 38050 27948 34351 44862 42706 41968 40181 44575 28529 24224 17647 20577 25998
11610 25998 35398 45934 44719 41400 32663 31395 24349 39049 43202 26138 20293 26585 31284 32808
11596 32808 31202 44936 43055 43199 38854 21763 12084 9762 24784 33888 37278 30712 24686 24865
11582 24865 32670 43383 43369 32426 43069 49123 33039 23525 31737 31255 28989 22382 3359 12635
11568 12635 17172 18887 22152 21994 21123 24640 20273 20825 14510 8529 7121 17990 22731 30765 26292
11553 26292 8993 13527 13221 7908 15507 19051 10081 4354 3646 14475 19729 33992 50535 37992
$$ packed form
11652D5823j296p051j4692J723P909N476J0171j665p289K301k073P551j1514o323
11638B9051k6459O17K1639N048r930l306Q381J0021l923R703J8744k66q629p059
11624D3632L107q689j0102O403J0511k156p38j787M394j6046m305o577K930N421
11610B5998R400J0536j215l319q737j268p046J4700M153j7064n845O292M699J524
11596C2808j606J3734j881J44m345j7091r679k322J5022R104L390o566o026J79
11582B4865P805J0713j4j0943J0643O054j6084r514Q212m82k266o607j9023R276
11568A2635M537J715L265j58q71L517m367N52o315n981j408J0869M741Q034m473
11553B6292j7299M534l06n313P599L544q970n727p08J0829N254J4263J6543j2543
$$ plain form
11539 37992 21894 30816 25708 8923 6886 20371 14115 -2936 4389 3759 2805 6110 18016 19367
11525 19367 13648 9767 19701 24014 27486 32373 30221 25306 22935 15425 -951 -17390 -1612 21483
11511 21483 13047 -4711 2218 4097 10428 25246 31116 24841 19787 20994 22562 20523 17913 7057
11497 7057 201 1700 6849 16147 12415 11424 7145 5444 15872 21428 22898 27082 21560 5397
11483 5397 -431 -5491 1067 10495 11841 24511 22537 21494 21062 10999 13970 12988 15533 27328
11469 27328 35043 27754 31469 31615 35661 43864 63105 58943 52020 27546 19185 15491 12825 17223
11455 17223 19090 25706 37552 36351 32839 16340 10432 13651 9111 15140 21613 21106 14427 7903
11441 7903 6997 4798 5090 7836 17211 25611 35404 24109 15781 14041 13121 27882 30121 17741 23298
$$ packed form
11539C7992j6098Q922n108j6785k037J3485o256j7051P325o30r54L305J1906J351
11525A9367n719l881R934M313L472M887k152m915k371p510j6376j6439J5778K3095
11511B1483q436j7758O929J879O331J4818N870o275n054J207J568k039k610j0856
11497G057o856J499N149R298l732r91m279j701J0428N556J470M184n522j6163
11483E397n828n060O558R428J346J2670j974j043m32j0063K971r82K545J1795
11469B7328P715p289L715J46M046Q203J9241m162o923k4474q361l694k666M398
11455A7223J867O616J1846j201l512j6499n908L219m540O029O473n07o679o524
11441G903r06k199K92K746R375Q400R793j1295q328j740r20J4761K239j2380N557
$$ plain form
11426 23298 27912 24677 23549 11841 11890 34304 54821 44157 21459 16516 28080 31286 22298
11413 22298 22424 17138 22996 31269 36067 20095 21320 15944 11110 11585 20629 11551 -1049 -4305
11399 -4305 -7892 -11052 -9596 -12880 -3565 14522 16060 15430 31490 27669 23824 22315 20247 20882 8863
11384 8863 8841 14693 10439 11263 8183 3434 -219 5503 17064 20923 19512 18814 8812 6660 9110
11369 9110 17640 28147 33740 31109 25393 15013 11952 10076 10184 16881 20554 19396 19226 25989 9457
11354 9457 5164 18426 10346 9422 11138 10472 -10471 -13644 1964 16219 32189 16671 5348
11341 5348 19853 19864 19215 20435 19410 5186 -18145 -12240 7134 4850 6007 15529 14975 12114 13527
11326 13527 12624 8643 6116 9579 6838 3992 9990 10846 4065 -7849 -384 5231 -4846 -13265
$$ packed form
11426B3298M614l235j128j1708M9K2414K0517j0664k2698m943J1564L206q988
11413B2298J26n286N858Q273M798j5972J225n376m834M75R044r078j2600l256
11399d305l587l160J456l284R315J8087J538o30J6060l821l845j509k068O35j2019
11384H863k2N852m254Q24l080m749l653N722J1561L859j411o98j0002k152K450
11369I110Q530J0507N593k631n716j0380l061j876J08O697L673j158j70O763j6532
11354I457m293J3262q080r24J716o66k0943l173J5608J4255J5970j5518j1323
11341E348J4505J1o49J220j025j4224k3331N905J9374k284J157R522n54k861J413
11326A3527r03l981k527L463k741k846N998Q56o781j1914P465N615j0077q419
$$ plain form
11312 -13265 -1984 -6578 5001 7565 12921 15785 13323 449 8229 9466 2494 -2007 -9987 -10935
11298 -10935 -1059 6846 8471 7048 4398 3413 -2585 3693 29212 21892 19009 31703 23583 10188
11284 10188 18451 26387 16667 14104 8198 11720 18479 30004 12966 3382 -7390 -4238 5355 5878
11270 5878 6633 10716 17034 6104 -8985 -13305 -18215 -4549 12139 7194 -1240 5252 8152 12343
11256 12343 8159 13214 19745 8404 -1820 -9231 -4758 6562 11664 14082 22503 18350 18027 22004
11242 22004 23567 11741 5101 12281 11359 9377 15359 20211 21263 12515 14746 10044 7998 9006
11228 9006 12104 11743 1249 -2732 4532 3418 -10149 -13144 -703 16394 20938 21135 8723 11039
11214 11039 10013 15046 14434 22304 20192 22833 30679 30135 28840 26631 7520 1321 -520 -8982 -19591
$$ packed form
11312a3265J1281m594J1579K564N356K864k462j2874P780J237o972m501p980r48
11298a0935R876P905J625j423k650r85n998O278K5519p320k883J2694q120j3395
11284A0188Q263P936r720k563n906L522O759J1525j7038r584j0772L152R593N23
11270E878P55M083O318j0930j5089m320m910J3666J6688m945q434O492K900M191
11256A2343m184N055O531j1341j0224p411M473J1320N102K418Q421m153l23L977
11242B2004J563j1826o640P180r22j982N982M852J052q748K231m702k046J008
11228I006L098l61j0494l981P264j114j3567k995J2441J7097M544J97j2412K316
11214A1039j026N033o12P870k112K641P846n44j295k209j9111o199j841q462j0609
$$ plain form
11199 -19591 -22540 -18762 -6822 -6522 6107 19459 14959 6477 6001 12334 18184 13336 14021 12889
11185 12889 8893 13586 11566 8938 9835 24228 34150 34734 35267 24550 18620 18538 3435 -5828 -10231
11170 -10231 -12676 -1566 3264 6667 -6372 -7856 4608 9541 14804 6552 16548 14590 15422 17699
11156 17699 18034 4055 -9823 6300 11510 14537 4571 5572 4799 17335 17903 3963 867 -7889
11142 -7889 -3721 4798 -394 11151 8455 -3135 5141 10832 10361 9276 7789 9191 14498 19692
11128 19692 10337 5739 -1676 -2379 -718 1136 9721 19622 16871 17496 24410 5167 -4049 760 18540
11113 18540 23461 11638 11489 6338 -1361 19394 34504 28918 29619 20026 16529 4095 436 8161
11099 8161 -2861 331 723 -14451 -4596 1855 5889 8846 7910 -2187 -3488 1635 -4650 -8207
$$ packed form
11199a9591k949L778J1940L00J2629J3352m500q482m76O333N850m848O85j132
11185A2889l996M693k020k628Q97J4393R922N84N33j0717n930q2j5103r263m403
11170a0231k445J1110M830L403j3039j484J2464M933N263q252R996j958Q32K277
11156A7699L35j3979j3878J6123N210L027r966J001p73J2536N68j3940l096q756
11142g889M168Q519n192J1545k696j1590Q276N691m71j085j487J402N307N194
11128A9692r355m598p415p03J661J854Q585R901k751O25O914j9243r216M809J7780
11113A8540M921j1823j49n151p699K0755J5110n586P01r593l497j2434l659P725
11099H161j1022L192L92j5174R855O451M034K957r36j0097j301N123o285l557
$$ plain form
11085 -8207 666 10753 14628 15837 21270 25376 23773 22072 9051 2517 8201 6330 24918 32036
11071 32036 22415 11103 -3228 -6400 7044 20976 15652 28186 34119 34992 27594 28440 42708
11058 42708 41688 35428 29659 25804 11071 -2529 -5581 18108 39313 31966 21753 31363 46956
11045 46956 42748 38074 34109 44792 58263 45079 40768 47440 54375 71519 77685 92285 87517
11032 87517 75624 62888 56750 66515 76447 80525 80005 81323 103536 111792 116081 105785 102387 92524
11018 92524 82708 80632 83756 82859 84266 72592 71717 83042 84646 74881 70729 66951 68762 68821 77918
11003 77918 70595 58459 53785 60481 58560 47493 47756 49784 37721 38052 39622 21673 -639 8578
10989 8578 17915 10832 13567 16508 16667 16802 22929 29155 20382 17958 28236 37033 38164 33130 30964
$$ packed form
11085h207Q873J0087L875J209N433M106j603j701j3021o534N684j871J8588P118
11071C2036r621j1312j4331l172J3444J3932n324J2534N933Q73p398Q46J4268
11058D2708j020o260n769l855j4733j3600l052K3689K1205p347j0213R610J5593
11045D6956m208m674l965J0683J3471j3184m311O672O935J7144O166J4600m768
11032H7517j1893j2736o138R765R932M078n20J318K2213Q256M289j0296l398r863
11018I2524r816k076L124q97J407j1674q75J1325J604r765m152l778J811N9R097
11003G7918p323j2136m674O696j921j1067K63K028j2063L31J570j7949k2312R217
10989H578R337p083K735K941J59J35O127O226q773k424J0278Q797J131n034k166
$$ plain form
10974 30964 25900 28497 41694 39481 34602 25246 21825 24012 32859 36861 35222 35190 34624 24806 19578
10959 19578 34491 21348 11228 11462 10521 12508 2137 -15237 1387 22452 17459 22163 23807
10946 23807 15417 9976 12561 15060 30309 36962 22026 16309 7869 7247 23252 42277 30004
10933 30004 5220 7849 14204 12842 7093 3527 6219 23232 40448 42544 35421 23673 24855
10920 24855 19823 14860 18727 25971 34161 32518 32804 31112 33140 36340 35509 27690 32173 37740 37512
10905 37512 26799 30720 10337 -7987 -12222 -14404 -21173 -18464 -666 6580 31311 43541 27201
10892 27201 13994 10871 -3747 1805 -6309 7943 17614 11097 8835 6596 11885 13583 18234 22352
10878 22352 14848 11570 6007 -684 4181 8084 17780 19506 10526 3444 21791 31875 20846 16297
$$ packed form
10974C0964n064K597J3197k213m879r356l421K187Q847M002j639l2n66r818n228
10959A9578J4913j3143j0120K34r41J987j0371j7374J6624K1065m993M704J644
10946B3807q390n441K585K499J5249O653j4936n717q440o22J6005J9025j2273
10933C0004k4784K629O355j362n749l566K692J7013J7216K096p123j1748J182
10920B4855n032m963L867P244Q190j643K86j692K028L200q31p819M483N567k28
10905C7512j0713L921k0383j8324m235k182o769K709J7798P246K4731J2230j6340
10892B7201j3207l123j4618N552q114J4252R671o517k262k239N289J698M651M118
10878B2352p504l278n563o691M865L903R696J726q980p082J8347J0084j1029m549
$$ plain form
10864 16297 13003 9957 1364 -3103 2037 10832 12564 -4416 -5116 4084 2537 4118 12133 26132
10850 26132 12392 14259 24320 18241 20543 26688 29951 21075 6187 2993 15701 22606 24727
10837 24727 22030 16906 37136 32861 14996 17196 16195 16932 16828 18738 28323 39799 28195 24408
10823 24408 22094 19779 24227 25819 9149 6213 9035 4280 -2219 5150 4094 17988 27261 34438
10809 34438 33667 30127 27056 23433 32340 29223 25239 24026 30677 29785 20181 20227 22575 13881 17258
10794 17258 14555 23188 26172 24615 27488 18870 24730 26243 22793 17809 23912 35398 30085 31700
10780 31700 30692 33552 34831 29464 37791 51858 57044 52314 54961 49639 39961 36899 43186 33415
10766 33415 32924 32426 31203 34769 28610 20141 20001 26110 37927 46682 39142 37172 44252 47446 47649
$$ packed form
10864A6297l294l046q593m467N140Q795J732j6980p00R200j547J581Q015J3999
10850B6132j3740J867J0061o079K302O145L263q876j4888l194J2708O905K121
10837B4727k697n124K0230m275j7865K200j001P37j04J910R585J1476j1604l787
10823B4408k314k315M448J592j6670k936K822m755o499P369j056J3894R273P177
10809C4438p71l540l071l623Q907l117l984j213O651q92r604M6K348q694L377
10794A7258k703Q633K984j557K873q618N860J513l450m984O103J1486n313J615
10780C1700j008K860J279n367Q327J4067N186m730K647n322r678l062O287r771
10766C3415m91m98j223L566o159q469j40O109J1817Q755p540j970P080L194K03
$$ plain form
10751 47649 38847 36576 47300 47841 44178 36421 35159 52569 66692 65820 53097 47915 56590 57511
10737 57511 46287 53712 61575 58130 67600 66009 70439 69036 76691 87579 92418 92876 85930 85492
10723 85492 91237 107527 130771 147449 153123 138746 132338 126634 121980 118773 125495 123385 127786
10710 127786 136271 137882 133932 132588 138231 150177 156055 160151 166919 162284 156796 168001 155256
10697 155256 139262 129450 145754 165409 160986 139648 146038 167179 184130 164753 152188 159470
10685 159470 170001 162435 148432 152007 148747 148453 144339 145245 132485 114238 120070 130146 127362
10672 127362 130575 148401 150901 142257 137439 137044 129788 146833 160901 168060 178468 187975 186413
10659 186413 188663 199140 207398 220785 230668 237573 247751 270893 284553 285746 297509 298316 287012
$$ packed form
10751D7649q802k271J0724N41l663p757j262J7410J4123q72j2723n182Q675R21
10737E7511j1224P425P863l445R470j591M430j403P655J0888M839M58o946m38
10723H5492N745J6290K3244J6678N674j4377o408n704m654l207O722k110M401
10710A27786Q485J611l950j344N643J1946N878M096O768m635n488J1205j2745
10697A55256j5994r812J6304J9655m423k1338O390K1141J6951j9377j2565P282
10685A59470J0531p566j4003L575l260k94m114R06j2760j8247N832J0076k784
10672A27362L213J7826K500q644m818l95p256J7045J4068P159J0408R507j562
10659A86413K250J0477Q258J3387R883O905J0178K3142J3660J193J1763Q07j1304
$$ plain form
10646 287012 270405 273262 295687 312888 322887 328219 335123 365166 377253 407638 445160 493056
10634 493056 525566 561433 612173 668139 725314 787566 862202 936809 1020893 1134504 1283097
10623 1283097 1474553 1712372 2018600 2389870 2810693 3323441 3858028 4378292 4899366
10614 4899366 5366172 5759984 6085931 6336068 6580396 6903091 7342824 7952048 8696286
10605 8696286 9515868 10344275 11126166 11798492 12256574 12470396 12490874 12452929 12504986 12768094
10595 12768094 13267959 13975778 14786050 15587774 16277012 16748404 16885219 16600695 15950810
10586 15950810 15155736 14428438 13902347 13631022 13583823 13670160 13778793 13826506 13724108 13396464
10576 13396464 12822306 12037824 11183361 10396912 9751648 9259686 8914695 8664045 8443759
$$ packed form
10646B87012j6607K857K2425J7201R999N332O904L0043J2087L0385L7522M7896
10634D93056L2510L5867N0740N5966N7175O2252P4636P4607Q4084J13611J48593
10623A283097J91456K37819L06228L71270M20823N12748N34587N20264N21074
10614D899366M66806L93812L25947K50137K44328L22695M39733O09224P44238
10605H696286Q19582Q28407P81891O72326M58082K13822K0478l7945N2057K63108
10595A2768094M99865P07819Q10272Q01724O89238M71392J36815k84524o49885
10586A5950810p95074p27298n26091k71325m7199Q6337J08633M7713j02398l27644
10576A3396464n74158p84482q54463p86449o45264m91962l44991k50650k20286
$$ plain form
10567 8443759 8223308 7958842 7584636 7097435 6533205 5932620 5371824 4888165 4454757
10558 4454757 4084466 3778725 3532299 3343508 3159665 3004126 2863818 2730360 2620227
10549 2620227 2510606 2420640 2341318 2250345 2165749 2111978 2051626 1983136 1932749 1888784 1828149
10538 1828149 1773974 1725468 1685716 1646707 1609708 1569413 1531926 1491444 1452694 1406070 1375701
10527 1375701 1342192 1319654 1303645 1274275 1237545 1198003 1166270 1165083 1149045 1121766 1095546
10516 1095546 1067694 1047307 1022014 988633 962785 945837 929922 909680 879661 855642 833487
10505 833487 816809 807660 798859 775769 753448 733844 711302 711472 717590 701141 683752 677416 670839
10492 670839 666591 651031 646711 636246 637841 641780 631045 621893 596466 576305 574252 582591 566072
$$ packed form
10567H443759k20451k64466l74206m87201n64230o00585n60796m83659m33408
10558D454757l70291l05741k46426j88791j83843j55539j40308j33458j10133
10549B620227j09621q9966p9322r0973q4596n3771o0352o8490n0387m3965o0635
10538A828149n4175m8506l9752l9009l6999m0295l7487m0482l8750m6624l0369
10527A375701l3509k2538j6009k9370l6730l9542l1733j187j6038k7279k6220
10516A095546k7852k0387k5293l3381k5848j6948j5915k0242l0019k4019k2155
10505H33487j6678r149q801k3090k2321j9604k2542J70O118j6449j7389o336o577
10492F70839m248j5560m320j0465J595L939j0735r152k5427k0161k053Q339j6519
$$ plain form
10479 566072 561570 572881 576619 577260 575636 554295 538067 523335 527573 524108 517268 511657 513071
10466 513071 517017 509197 488547 482173 478040 465095 458210 449387 445499 440742 437672 442157 434442 414557
10452 414557 401708 407140 400115 389342 386930 374484 365540 356144 354274 368490 373845 357326 337411
10439 337411 323989 317852 303483 302512 298984 309546 316021 307451 297365 290392 288815 290751 290856 274472
10425 274472 255391 256355 260208 260470 248372 234467 236188 235842 227936 212862 200580 197468 211914
10412 211914 211454 208738 202617 180757 168559 162185 168111 175765 178878 181794 191452 200277 196853 174962
10398 174962 175367 179436 159026 165216 172219 170627 158440 148559 146663 149712 134882 128985 132944 132536
10384 132536 138357 137918 140862 138203 141324 138059 130080 130868 121600 105845 96602 108110 112123 121434
$$ packed form
10479E66072m502J1311L738O41j624k1341j6228j4732M238l465o840n611J414
10466E13071L946p820k0650o374m133j2945o885q823l888m757l070M485p715j9885
10452D14557j2849N432p025j0773k412j2446q944r396j870J4216N355j6519j9915
10439C37411j3422o137j4369r71l528J0562O475q570j0086o973j577J936J05j6384
10425B74472j9081R64L853K62j2098j3905J721l46p906j5074j2282l112J4446
10412B11914m60k716o121k1860j2198o374N926P654L113K916R658Q825l424k1891
10398A74962M05M069k0410O190P003j592j2187r881j896L049j4830n897L959m08
10384A32536N821m39K944k659L121l265p979P88r268j5755r243J1508M013R311
$$ plain form
10370 121434 116304 99070 103190 107322 92579 87368 88179 100156 102929 99249 109871 113551 113924 109711
10356 109711 94984 80843 81299 95837 103764 99854 84205 68128 62480 78465 86512 82214 82276
10343 82276 79090 68696 55488 53654 56402 69856 72488 72463 66468 62389 65218 77833 96188 86489
10329 86489 59521 55193 44300 34658 44901 39382 49444 64979 60303 63627 67637 59858 63245
10316 63245 70726 66240 50722 41941 45993 51885 53848 67085 66046 64139 64273 49901 60425 60617
10302 60617 52997 58705 59300 52373 48768 33562 27572 36955 53557 55226 47524 51156 58134 61009
10288 61009 53574 40156 41532 44839 42739 29705 12369 2523 9442 13414 15818 8193 3313 17320
10274 17320 20292 11815 8919 19011 35648 35211 24690 25934 33551 34154 29191 29728 23026 14535
$$ packed form
10370A21434n130j7234M120M132j4743n211Q11J1977K773l680J0622L680L73m213
10356A09711j4727j4141M56J4538P927l910j5649j6077n648J5985Q047m298O2
10343H2276l186j0394j3208j834K748J3454K632k5n995m079K829J2615J8355r699
10329H6489k6968m328j0893r642J0243n519J0062J5535m676L324M010p779L387
10316F3245P481m486j5518q781M052N892J963J3237j039j907J34j4372J0524J92
10302F0617p620N708N95o927l605j5206n990R383J6602J669p702L632O978K875
10288F1009p435j3418J376L307k100j3034j7336r846O919L972K404p625m880J4007
10274A7320K972q477k896J0092J6637m37j0521J244P617O03m963N37o702q491
$$ plain form
10260 14535 23504 12783 621 6166 21166 30369 19511 12525 18537 17832 20031 29856 37652 25908
10246 25908 12527 5451 10764 14322 22147 22225 22634 16769 5829 -9264 5147 6969 1309 5288
10232 5288 13542 33066 17214 18884 27665 26792 31271 37213 38030 31329 17071 12311 11687 13894 11601
10217 11601 9255 12034 13354 17098 21875 22710 15146 20851 16515 12473 15942 35461 18693 7164
10203 7164 3025 6379 1860 550 15673 29206 32007 26663 16886 22860 17754 14154 16690 7689
10189 7689 -2210 -272 -20300 -15573 -3719 14240 38456 44524 37391 24131 33896 47296 45567
10176 45567 40008 30370 28711 48047 63843 65423 66491 66858 64655 69661 78923 89413 82777 71310
10162 71310 67626 76482 75893 72968 83830 98597 104179 97698 92225 95067 102850 102211 91288 95525
$$ packed form
10260A4535Q969j0721j2162N545J5000R203j0858o986O012p05K199R825P796j1744
10246B5908j3381p076N313L558P825P8M09n865j0940j5093J4411J822n660L979
10232E288Q254J9524j5852J670Q781q73M479N942Q17o701j4258m760o24K207k293
10217A1601k346K779J320L744M777Q35p564N705m336m042L469J9519j6768j1529
10203G164m139L354m519j310J5123J3533K801n344r777N974n106l600K536r001
10189G689r899J938k0028M727J1854J7959K4216O068p133j3260R765J3400j729
10176D5567n559r638j659J9336J5796J580J068L67k203N006R262J0490o636j1467
10162G1310l684Q856n89k925J0862J4767N582o481n473K842P783o39j0923M237
$$ plain form
10148 95525 85148 67737 61930 58637 67953 74366 83297 92180 80204 62493 55383 61406 62375 55047
10134 55047 57280 60252 61442 67768 54688 49846 40896 30032 44139 48046 41057 33529 24078 28079
10120 28079 30112 6767 -5873 6717 15788 24267 21875 17556 24364 16171 12203 12035 14170 28267
10106 28267 42591 36558 27165 17067 10900 8883 5757 3729 3571 13426 15083 8654 7002 -4228
10092 -4228 327 -3048 8568 25985 28575 23502 12911 16480 22903 16960 19940 12057 25002 28429
10078 28429 23584 19578 13620 11637 11555 21945 25187 26207 18570 13603 14618 8714 -39 4625 1808
10063 1808 3372 18837 17007 9881 10305 3301 16696 30544 19312 10189 16815 15340 10317 19989
10049 19989 25111 17533 12782 9265 12817 11800 13442 20138 22224 9861 4831 463 4317 4496
$$ packed form
10148I5525j0377j7411n807l293R316O413Q931Q883j1976j7711p110O023R69p328
10134E5047K233K972J190O326j3080m842q950j0864J4107L907o989p528r451M001
10120B8079K033k3345j2640J2590R071Q479k392m319O808q193l968j68K135J4097
10106B8267J4324o033r393j0098o167k017l126k028j58R855J657o429j652j1230
10092d228M555l375J1616J7417K590n073j0591L569O423n943K980p883J2945L427
10078B8429m845m006n958j983q2J0390L242J020p637m967J015n904q753M664k817
10063A808J564J5465j830p126M24p004J3395J3848j1232r123O626j475n023R672
10049A9989N122p578m751l517L552j017J642O696K086j2363n030m368L854J79
$$ plain form
10035 4496 11016 15845 22147 28768 16923 -1276 -1573 -1889 -5645 -13455 -6226 -4813 -10947 4439
10021 4439 4398 -3237 -2442 -6276 20019 21016 13126 20856 15529 9505 -984 -19620 -12866 -11340 -11945
10006 -11945 -20646 -26870 -13620 -7892 -1126 9437 25183 16390 -2245 -2635 7147 14342 7944 17521
9992 17521 33828 36323 28301 12317 9543 10991 5264 4987 1908 4353 6731 11702 8059 -7687
9978 -7687 -14137 -7296 11583 7295 11532 9040 18438 18272 1245 -6063 -10112 -19282 -21205 -3598
9964 -3598 20362 1277 -10288 -3523 -3321 -13037 -14598 -20862 -22899 -15654 -25300 -21294 -6745 -11011
9950 -11011 -10920 4673 22791 26679 21457 24558 27774 14112 -1311 3620 9980 16320 28279 29226
9936 29226 27108 30373 41599 51602 50100 45154 48807 49681 54211 51105 64014 74239 72289 64339
$$ packed form
10035D496O520M829O302O621j1845j8199k97l16l756p810P229J413o134J5386
10021D439m1p635P95l834K6295R97p890P730n327o024j0489j8636O754J526o05
10006a1945q701o224J3250N728O766J0563J5746q793j8635l90R782P195o398R577
9992A7521J6307K495q022j5984k774J448n727k77l079K445K378M971l643j5746
9978g687o450O841J8879m288M237k492R398j66j7027p308m049r170j923J7607
9964c598K3960j9085j1565O765K02r716j561o264k037P245r646M006J4549m266
9950a1011R1J5593J8118L888n222L101L216j3662j5423M931O360O340J1959R47
9936B9226k118L265J1226J0003j502m946L653Q74M530l106J2909J0225j950p950
$$ plain form
9922 64339 69388 69567 53040 33682 23985 24055 19803 18819 21502 25579 20599 2461 -7892 -16476 -37020
9907 -37020 -23868 -12705 -4668 9263 16331 4255 -5383 -15076 -5628 -2431 -2241 11745 9969 2128
9893 2128 -6046 12646 9509 4648 -3857 -13618 -9208 7305 8464 3503 5784 3451 17925 18917
9879 18917 24660 26907 17249 18050 34162 43369 40311 24938 21539 13784 6548 10873 8361 7696 -6444
9864 -6444 -13957 -14914 -11503 -13046 -15307 -12588 -15965 -15321 -1266 9014 7617 -3351 -9946 -18419 -19061
9849 -19061 -2817 11805 16358 20071 16913 16093 9662 11372 10254 8555 4405 2593 -6395 -8893
9835 -8893 -12911 -15384 -18953 -14365 -8418 4151 812 -11345 -12798 -18958 -19712 -12995 -19560 -17472 -10730
9820 -10730 2061 11914 10055 4134 -4753 7375 3644 -5272 -3844 -11175 -426 5128 -5611 -17133
$$ packed form
9922F4339N049J79j6527j9358r697P0m252r84K683M077m980j8138j0353q584k0544
9907c7020J3152J1163Q037J3931P068j2076r638r693R448L197J90J3986j776p841
9893B128q174J8692l137m861q505r761M410J6513J159m961K281k333J4474R92
9879A8917N743K247r658Q01J6112R207l058j5373l399p755p236M325k512o65j4140
9864f444p513r57L411j543k261K719l377O44J4055J0280j397j0968o595q473o42
9849a9061J6244J4622M553L713l158q20o431J710j118j699m150j812q988k498
9835h893m018k473l569M588N947J2569l339j2157j453o160p54O717o565K088O742
9820a0730J2791R853j859n921q887J2128l731q916J428p331J0749N554j0739j1522
$$ plain form
9806 -17133 -15835 -3120 -264 487 6938 8996 15935 19495 8631 5169 10307 7192 -24 -53 -8276
9791 -8276 -21601 -9550 9101 13803 14609 2152 -20069 -26272 -20326 -14168 -9436 -10732 2657 -2764
9777 -2764 2037 -1099 -8691 -6548 3032 17950 15666 17136 8877 -6818 -5524 -16207 -13773 -13602
9763 -13602 -23069 -17222 -14152 -6355 -2589 6045 4709 7396 -1366 -9617 5294 15083 5647 -491
9749 -491 11943 16087 18740 11961 14784 23339 23189 5691 -9251 -5113 3924 -2671 1195 3610 14837
9734 14837 9427 -6875 3674 16384 20215 13357 13075 1411 -874 9635 17271 19194 6896
9721 6896 5395 -5798 -14321 -6377 -5799 -13167 -14945 -11897 -10658 -10361 8115 13957 15086 8944 -2861
9706 -2861 -13166 -10064 -3499 -4092 -13874 -20513 -9706 -6712 -9105 -13729 -10029 -9450 4041 11444 -376
$$ packed form
9806a7133J298J2715K856P51O451K058O939L560j0864l462N138l115p216k9q223
9791h276j3325J2051J8651M702Q06j2457k2221o203N946O158M732j296J3389n421
9777b764M801l136p592K143R580J4918k284J470q259j5695J294j0683K434J71
9763a3602r467N847L070P797L766Q634j336K687q762q251J4911R789r436o138
9749d91J2434M144K653o779K823Q555j50j7498j4942M138R037o595L866K415J1227
9734A4837n410j6302J0549J2710L831o858k82j1664k285J0509P636J923j2298
9721F896j501j1193q523P944N78p368j778L048J239K97J8476N842J129o142j1805
9706b861j0305L102O565n93r782o639J0807K994k393m624L700N79J3491P403j1820
$$ plain form
9691 -376 3806 -1078 -11262 -9332 -395 11009 4842 7784 3381 8067 2206 13765 26367 7620
9677 7620 4225 11702 4472 -4650 -2152 18997 19385 5745 3284 9755 1597 -4288 -11102 -17874 -9292
9662 -9292 -11997 -4131 5449 5166 -4520 -3437 11625 13346 14559 20027 7942 -178 6494 1977 5933
9647 5933 24234 13946 -1929 11530 21915 20322 15008 16900 6984 -7724 -6092 5007 19413
9634 19413 9482 -7961 -15262 -5892 -1435 -11176 -23355 -18264 -13911 -19012 -15121 -11006 -8235 2180
9620 2180 12579 9944 758 7406 12734 15627 11725 2181 -2730 1487 1778 -908 17622 22296 21811
9605 21811 11346 9478 653 -12380 -15351 -12896 -26880 -23845 -3581 3806 8634 5687 -1445 2440
9591 2440 6529 37 -10661 -11756 7298 23438 16511 1608 7920 4564 6889 4123 -5041 18121
$$ packed form
9691c76M182m884j0184J930Q937J1404o167K942m403M686n861J1559J2602j8747
9677G620l395P477p230r122K498K1149L88j3640k461O471q158n885o814o772Q582
9662i292k705P866R580k83r686J083J5062J721J213N468j2085q120O672m517L956
9647E933J8301j0288j5875J3459J0385j593n314J892r916j4708J632J1099J4406
9634A9413r931j7443p301R370M457r741j2179N091M353n101L891M115K771J0415
9620B180J0399k635r186O648N328K893l902r544m911M217K91k686J8530M674m85
9605B1811j0465j868q825j3033k971K455j3984L035K0264P387M828k947p132L885
9591B440M089o492j0698j095J9054J6140o927j4903O312l356K325k766r164K3162
$$ plain form
9577 18121 23018 2658 -4469 9486 12403 9293 888 3634 19352 33876 23586 17320 12315
9564 12315 2078 -2748 -18375 -11327 -6625 -2580 4684 4140 10351 28405 18661 5119 -8081 -25537
9550 -25537 -22544 -16728 -14133 4598 1772 -2568 -5289 -2924 1465 953 4406 10857 3892 6962 11648
9535 11648 7298 4224 603 -12211 -20103 -12721 -2662 -4908 -15081 -12189 -12795 -17947 -22074 -26607
9521 -26607 -22390 -29479 -26445 -21454 -19061 -12809 -19015 -30018 -24462 -15249 -1550 -1487 -785 6942 359
9506 359 -8871 2259 2420 973 11128 14990 2534 -9882 -5063 -6151 -4994 9545 23414 22690
9492 22690 27007 16049 1661 -10760 -16920 -24602 -17300 -11340 -19873 -21220 -6986 7549 22457
9479 22457 7393 -1245 -3170 -8283 -1361 9953 2905 -13037 -24645 -18088 680 -4027 -17619
$$ packed form
9577A8121M897k0360p127J3955K917l110q405K746J5718J4524j0290o266n005
9564A2315j0237m826j5627P048M702M045P264n44O211J8054r744j3542j3200j7456
9550b5537K993N816K595J8731k826m340k721K365M389n12L453O451o965L070M686
9535A1648m350l074l621j2814p892P382J0059k246j0173K892o06n152m127m533
9521b6607M217p089L034M991K393O252o206j1003N556R213J3699O3P02P727o583
9506C59r230J1130J61j447J0155L862j2456j2416M819j088J157J4539J3869p24
9492B2690M317j0958j4388j2421o160p682P302N960q533j347J4234J4535J4908
9479B2457j5064q638j925n113O922J1314p048j5942j1608O557J8768m707j3592
$$ plain form
9466 -17619 -20428 -21251 -27725 -28095 -32387 -24129 -20008 -21354 -20958 -25286 -14692 -13652 -10276 -9078 -11635
9451 -11635 -8510 -7659 -4320 4175 6144 179 481 -2448 -5986 -5885 -5730 -3717 -9075 -9077 3255 7725
9435 7725 14717 22480 17875 18294 16869 -2343 -4913 -5774 -17671 -6689 1855 -1240 -8650 -2896 -6881
9420 -6881 -5745 -4367 -9414 -5813 -8192 -10699 -19924 -19535 -19293 -12105 1581 6699 10615 11974 7172
9405 7172 4479 3148 14125 14350 3373 2416 5432 18273 15647 2389 608 -2525 27 -9081
9391 -9081 -23702 -21982 -16138 -17477 -9469 -9134 -13853 -7585 20575 27070 11507 -1124 -9791 -11320
9377 -11320 -1862 -5377 -10837 -25449 -28170 -22003 -21356 -14337 -3067 -4689 -17479 -17370 -12852 -13196 -27239
9362 -27239 -24342 -4821 7089 8461 10744 13489 11046 5551 13570 19320 1 -7507 -4267 3886
$$ packed form
9466a7619k809q23o474l70m292Q258M121j346L96m328J0594J040L376J198k557
9451a1635L125Q51L339Q495J969n965L02k929l538J01J55K013n358kJ2332M470
9435G725O992P763m605M19j425j9212k570q61j1897J0982Q544l095p410N754l985
9420f881J136J378n047L601k379k507r225L89K42P188J3686N118L916J359m802
9405G172k693j331J0977K25j0977r57L016J2841k626j3258j781l133K552r108
9391i081j4621J720N844j339Q008L35m719O268K8160O495j5563j2631q667j529
9377a1320R458l515n460j4612k721O167O47P019J1270j622j2790J09M518l44j4043
9362b7239K897J9521J1910J372K283K745k443n495Q019N750j9319p508L240Q153
$$ plain form
9348 3886 9168 7169 7641 4032 -734 4311 3487 10590 -4984 -10093 -6012 -186 -4982 -11780 -21339
9333 -21339 -24770 -7535 14299 15648 2113 12099 14680 6303 333 -7915 -5446 -8706 -10510 -1919
9319 -1919 2589 4098 13179 9483 7125 -6065 -13212 -15323 -12728 -8317 -2044 15 3828 -11803
9305 -11803 -20376 -14434 -4195 -5627 -10158 -5415 -7031 -8376 666 1647 11101 7820 1476 13882
9291 13882 9284 6330 4770 6677 3170 -7248 -18185 -7793 3580 5144 3260 -16983 -16378 -2907
9277 -2907 -1608 -1833 -667 -17418 -12568 -9281 1 -1156 4330 11894 10502 -3462 5638 19064
9263 19064 10471 2784 -3464 4039 16521 16984 23148 25748 21825 12437 13859 -449 -8666 -6912
9249 -6912 1690 749 -2298 709 -3935 -7609 -6668 -9770 -1865 5305 -1820 5268 5976 4383 8812 3202
$$ packed form
9348C886N282j999M72l609m766N045q24P103j5574n109M081N826m796o798r559
9333b1339l431J7235K1834J349j3535R986K581q377n970q248K469l260j804Q591
9319a919M508J509R081l696k358j3190p147k111K595M411O273K059L813j5631
9305a1803q573N942J0239j432m531M743j616j345R042R81R454l281o344J2406
9291A3882m598k954j560J907l507j0418j0937J0392J1373J564j884k0243O05J3471
9277b907J299k25J166j6751M850L287R282j157N486P564j392j3964R100J3426
9263A9064q593p687o248P503J2482M63O164K600l923r388J422j4308q217J754
9249f912Q602r41l047L007m644l674R41l102P905P170p125P088P08j593M429n610
$$ plain form
9233 3202 -6454 8103 25503 20312 13194 7942 5907 -2111 -14683 -21158 -15393 -16778 -30854 -34855
9219 -34855 -26481 -16532 -2962 13217 16134 2488 -8308 1195 8066 -2374 -14963 -16316 -12977
9206 -12977 1392 -902 -11269 -2152 12335 13386 -116 -21782 -17359 -561 17813 27449 28895
9193 28895 17995 13000 20751 19972 19169 11316 -4430 460 21028 10234 -2563 -5797 -13744 -20771
9179 -20771 -14525 -4301 -7640 -14240 -11688 7445 14709 17293 18322 24881 17326 695 -10950 -19780
9165 -19780 -24064 -15100 -409 821 5550 16690 25425 13859 -2067 -1365 -2900 3623 18804 25329
9151 25329 27029 24315 18679 7159 -1458 -8833 -20845 -21833 -23245 -27316 -35886 -38472 -25997 1121
9137 1121 17371 11950 11708 10766 7099 -7975 2642 11188 6030 -1549 -1247 -6968 -16057 -27467 -19336
$$ packed form
9233C202r656J4557J7400n191p118n252k035q018j2572o475N765j385j4076m001
9219c4855Q374R949J3570J6179K917j3646j0796R503O871j0440j2589j353L339
9206a2977J4369k294j0367R117J4487J051j3502k1666M423J6798J8374R636J446
9193B8895j0900m995P751p79q03p853j5746M890K0568j0794j2797l234p947p027
9179b0771O246J0224l339o600K552J9133P264K584J029O559p555j6631j1645q830
9165a9780m284Q964J4691J230M729J1140Q735j1566j5926P02j535O523J5181O525
9151B5329J700k714n636j1520q617p375j2012r88j412m071q570k586J2475K7118
9137A121J6250n421k42r42l667j5074J0617Q546n158p579L02n721r089j1410Q131
$$ plain form
9122 -19336 -14751 -8937 -8686 135 12128 10523 -2885 -19140 -20516 -14420 -11881 -14095 -18780 -12540
9108 -12540 -4778 7790 15909 14183 8029 12606 18344 14395 -1726 -20774 -18493 -9518 2598 11793
9094 11793 6246 1677 -20610 -24313 -4768 11745 8026 9036 -7818 -4221 -8190 -2350 16233
9081 16233 27299 19962 7028 3130 -8354 -10787 -5436 -7252 -6765 7219 28751 2420 -10495
9068 -10495 -3696 -81 8378 901 -12962 -24135 -28925 -15752 2845 7340 3830 -4584 -4413 -8005
9054 -8005 -11051 -10374 -23582 -35199 -37230 -15829 -4054 -3445 -6921 -11638 -20648 -31885 -26567 -7845
9040 -7845 16835 24461 1200 -11498 -24640 -24461 -15455 -7537 -528 -2510 3195 16917 19443 16145
9026 16145 10784 2722 5422 9017 -6411 -5409 -3052 2616 6684 10135 2663 5990 6257 8102 -5437
$$ packed form
9122a9336M585N814K51Q821J1993j605j3408j6255j376O096K539k214m685O240
9108a2540P762J2568Q119j726o154M577N738l949j6121j9048K281Q975J2116R195
9094A1793n547m569k2287l703J9545J6513l719J010j6854L597l969N840J8583
9081A6233J1066p337j2934l898j1484k433N351j816M87J3984K1532k6331j2915
9068a0495O799L615Q459p477j3863j1173m790J3173J8597M495l510q414J71l592
9054h005l046O77j3208j1617k031K1401J1775O09l476m717r010j1237N318J8722
9040g845K4680P626k3261j2698j3142J79R006P918P009j982N705J3722K526l298
9026A6145n361q062K700L595j5428J002K357N668M068L451p472L327K67J845j3539
$$ plain form
9011 -5437 -10310 10529 20645 27633 31330 20214 5435 -8494 -8104 5840 7256 9633 8497 13845
8997 13845 18432 17010 9255 -4585 -7422 331 -3688 -7321 5859 21491 13188 6091 -719 -12254
8983 -12254 -14512 -11274 -6202 9339 14023 6444 8241 14957 5447 2772 14479 32855 40746 28733
8969 28733 3369 -16773 -7699 -7143 -11129 -3592 5266 16475 9519 21170 16675 2430 -6403 -13747
8955 -13747 -21330 -27598 -14882 13548 11921 13005 13837 26289 35680 27309 28856 43648 37126 19069
8941 19069 10956 7778 12532 5705 9047 -2721 -6271 -10207 -8731 -7856 -15595 -17177 -7039 -818
8927 -818 -5641 -4837 -137 6496 -13461 -15856 -13443 -11824 -1742 10743 -1997 -9837 -570 2873
8913 2873 10082 13008 10040 5748 8210 1393 -13839 -18235 -16560 -2497 8578 -13033 -13107 -352
$$ packed form
9011e437m873K0839J0116O988L697j1116j4779j3929L90J3944J416K377j136N348
8997A3845M587j422p755j3840k837P753m019l633J3180J5632q303p097o810j1535
8983a2254k258L238N072J5541M684p579J797O716r510k675J1707J8376P891j2013
8969B8733k5364k0142R074N56l986P537Q858J1209o956J1651m495j4245q833p344
8955a3747p583o268J2716K8430j627J084Q32J2452R391q371J547J4792o522j8057
8941A9069q113l178M754o827L342j1768l550l936J476Q75p739j582J0138O221
8927h18m823Q04M700O633j9957k395K413J619J0082J2485j2740p840R267L443
8913B873P209K926k968m292K462o817j5232m396J675J4063J1075k1611p4J2755
$$ plain form
8899 -352 10210 4868 4382 17439 6979 2357 8381 9433 728 -2084 3002 17310 21037 3331
8885 3331 -18843 -34289 -27431 -19068 -14850 -15560 -4322 -8247 -9959 -25801 -18826 -11734 -820 -3933
8871 -3933 -12216 -26970 -46917 -46087 -46932 -36563 -24328 -19726 -15965 -23773 -36204 -20635 -9481 -9024
8857 -9024 404 -2955 4285 12545 14843 9775 6485 1819 5257 -2160 2639 -8627 -20042 -30066
8843 -30066 -37288 -31247 -8420 6190 7390 7090 7626 5234 3797 4596 -1556 -24845 -31386 -31395 -24224
8828 -24224 -12633 -3271 -5396 -18216 -19874 -13496 -17048 -12710 -3101 18626 5744 9987 13644 6218
8814 6218 -4544 4128 8442 1542 5322 -1573 -3053 -1214 -8267 -13206 -16708 -20146 -29975 -22548 -18116
8799 -18116 -14209 481 6889 -46 -7189 3184 8317 2099 -1041 -3546 -7033 -16554 -6274 -4722
$$ packed form
8899c52J0562n342m86J3057j0460m622O024J052q705k812N086J4308L727j7706
8885C331k2174j5446O858Q363M218p10J1238l925j712j5842O975P092J0914l113
8871c933q283j4754j9947Q30q45J0369J2235M602L761p808j2431J5569J1154M57
8857i024R428l359P240Q260K298n068l290m666L438p417M799j1266j1415j0024
8843c0066p222O041K2827J4610J200l00N36k392j437P99o152k3289o541rP171
8828b4224J1591R362k125j2820j658O378l552M338R609K1727j2882M243L657p426
8814F218j0762Q672M314o900L780o895j480J839p053m939l502l438r829P427M432
8799a8116L907J4690O408o935p143J0373N133o218l140k505l487r521J0280J552
$$ plain form
8785 -4722 -8352 -13755 -15601 -20801 -15599 -11949 -7967 -4744 -1518 5966 7516 -13873 -28389 -19777
8771 -19777 -17744 -19914 -964 -1505 -12006 -6358 1839 -5410 -5860 -2107 -4582 -775 -7513 -10728 -4654
8756 -4654 -11459 -2199 11836 17684 10432 10511 13237 20384 29867 30638 10464 -6820 -13916 -18304 -5009
8741 -5009 10920 15656 16909 8694 -934 -6305 -9320 -3596 -3481 -5331 -4811 -845 15456 19051 9501
8726 9501 -5199 -13704 -12868 -14113 -28314 -27955 -11732 1385 5108 -1141 -3431 1772 -5012 -7959
8712 -7959 -3003 10318 -2960 -13525 -11142 -8392 -18687 -37673 -34445 -21726 -17969 -18454 -28731
8699 -28731 -23859 -3670 13247 14498 91 1997 4634 8916 14234 7302 3781 4781 8694 5926
8685 5926 -230 -12875 -23465 -14194 -15517 -21087 -11137 -3054 4261 15323 12557 12534 -4892 -16859
$$ packed form
8785d722l630n403j846n200N202L650L982L223L226P484J550k1389j4516Q612
8771a9777K033k170J8950n41j0501N648Q197p249m50L753k475L807o738l215O074
8756d654o805R260J4035N848p252P9K726P147R483P71k0174j7284p096m388J3295
8741e009J5929M736J253q215r628n371l015N724J15j850N20L966J6301L595r550
8726I501j4700q505Q36j245j4201L59J6223J3117L723o249k290N203o784k947
8712g959M956J3321j3278j0565K383K750j0295j8986L228J2719L757m85j0277
8699b8731M872K0189J6917J251j4407J906K637M282N318o932l521J000L913k768
8685E926o156j2645j0590R271j323n570R950Q083P315J1062k766k3j7426j1967
$$ plain form
8671 -16859 -5051 10409 21446 14669 8237 5178 12807 25068 20521 8732 -5706 -11200 -12926
8658 -12926 -19286 -12230 -16743 -24925 -23568 -15869 -15952 -10534 -12082 -6532 -4194 6660 6871 -1065 -1287
8643 -1287 -3344 -5516 -10551 -13693 -16410 -11917 -481 -3098 -5515 -10339 -22286 -12430 -944 -88
8629 -88 5071 1727 6544 6190 11320 8204 2034 -21390 -21053 -6232 4061 13477 16358 7929 9321
8614 9321 22641 6351 -2846 -5421 -19945 -25188 -47006 -44146 -24515 2449 26124 35288 40047
8601 40047 41178 37443 29932 20008 15067 5268 -14552 -27684 -21390 -14842 2042 18721 11637 1020
8587 1020 -4371 -4772 8252 10826 4848 -6207 -15784 597 15615 29230 46641 26233 11506
8574 11506 11315 27832 23857 14445 25809 33948 31705 27386 39413 55530 55056 31181 28018 28624
$$ packed form
8671a6859J1808J5460J1037o777o432l059P629J2261m547j1789j4438n494j726
8658a2926o360P056m513q182J357P699q3N418j548N550K338J0854K11p936k22
8643a287k057k172n035l142k717M493J1436k617k417m824j1947R856J1486Q56
8629h8N159l344M817l54N130l116o170k3424L37J4821J0293R416K881q429J392
8614I321J3320j6290r197k575j4524n243k1818K860J9631K6964K3675R164M759
8601D0047J131l735p511r924m941r799j9820j3132O294O548J6884J6679p084j0617
8587A020n391m01J3024K574n978j1055r577J6381J5018J3615J7411k0408j4727
8574A1506j91J6517l975r412J1364Q139k243m319J2027J6117m74k3875l163O06
$$ plain form
8560 28624 19623 7770 -1866 -4105 -5123 3771 15810 23238 22581 20673 20042 13498 12013 9073 15634
8545 15634 23655 23387 11846 5063 1167 50 -7920 -8965 710 8341 15215 18092 14637 17211 29678
8530 29678 25588 11678 -135 -13378 -1379 -9528 -8361 6005 2917 13113 18662 10103 10998
8517 10998 6765 4377 -256 -5395 8563 12212 90 -7439 -8883 -7571 1155 20295 24861 24979
8503 24979 20737 13612 12123 7069 15634 5903 -6424 896 5751 7753 4622 7370 11415 11994 12261
8488 12261 9181 11246 11620 5789 5162 9677 12514 8361 18166 25154 33971 39477 29244 9715 -33
8473 -33 10597 15728 21771 23993 26983 25969 21508 27200 23562 29272 30404 22537 17133 4666 1816
8458 1816 7306 20747 16152 8272 18738 16410 7361 9874 11006 18462 16527 15257 22262 24152
$$ packed form
8560B8624r001j1853r636k239j018Q894J2039P428o57j908o31o544j485k940O561
8545A5634Q021k68j1541o783l896j117p970j045R675P631O874K877l455K574J2467
8530B9678m090j3910j1813j3243J1999q149J167J4366l088J0196N549q559Q95
8517A0998m233k388m633n139J3958L649j2122p529j444J312Q726J9140M566J18
8503B4979m242p125j489n054Q565r731j2327P320M855K002l131K748M045N79K67
8488A2261l080K065L74n831o27M515K837m153R805O988Q817N506j0233j9529r748
8473c3J0630N131O043K222K990j014m461N692l638N710J132p867n404j2467k850
8458A816N490J3441m595p880J0466k328r049K513J132P456j935j270P005J890
$$ plain form
8444 24152 25843 31685 36417 34000 29013 42350 43567 41000 37335 28811 18635 18846 20172 21965
8430 21965 31078 20918 7681 1809 -2339 -6142 -9111 -12484 -2302 -130 7569 -3628 1733 16700
8416 16700 27852 22538 1179 -6044 -11808 -3927 1576 5604 -3282 -9791 -6549 17 4034 -5847
8402 -5847 3332 18958 15255 13279 11429 4479 6649 21037 31307 23574 15139 16649 22409 11042
8388 11042 3301 1223 7400 11485 9888 4688 -547 -8705 -22747 -26316 -25143 -26212 -21092 -13498
8374 -13498 -18944 -7935 -546 3466 -1316 -13105 -14389 -11103 -9052 -10648 -28092 -37578 -24521 -4873
8360 -4873 11723 7879 15203 12954 10510 19026 8964 2420 4082 4549 -13319 -11400 2914 2275
8346 2275 11957 28185 26697 28547 26027 20600 14054 3027 4638 1464 -3750 -10127 -8702 1104
$$ packed form
8444B4152J691N842M732k417m987J3337J217k567l665q524j0176K11J326J793
8430B1965R113j0160j3237n872m148l803k969l373J0182K172P699j1197N361J4967
8416A6700J1152n314k1359p223n764P881N503M028q886o509L242O566M017r881
8402e847R179J5626l703j976j850o950K170J4388J0270p733q435J510N760j1367
8388A1042p741k078O177M085j597n200n235q158j4042l569J173j069N120P594
8374a3498n446J1009P389M012m782j1789j284L286K051j596j7444r486J3057J9648
8360d873J6596l844P324k249k444Q516j0062o544J662M67j7868J919J4314o39
8346B275R682J6228j488J850k520n427o546j1027J611l174n214o377J425R806
$$ plain form
8332 1104 13350 12799 11011 -1479 -12847 -9341 -2085 16950 16258 21136 16884 20428 28391 10130
8318 10130 -4537 17831 31786 35130 15900 3003 4613 9843 13983 18290 7494 -2020 550
8305 550 -2568 -1907 -6881 -12744 -14184 -14040 8242 10605 11875 11133 12886 17895 12926 4049 -5286 -846
8289 -846 8298 15240 16038 7983 -5684 2555 -4753 -21142 -18285 -12605 -16084 -22965 -18684 -4212 -4146
8274 -4146 -15269 -5814 -8692 -4010 5038 9856 10184 7520 -4011 4162 9687 12731 10013 16522 20136
8259 20136 10069 3679 3930 14049 10708 -723 -19779 -21884 -6469 -13485 -11335 -21534 -19214
8246 -19214 512 -16304 -17916 -11393 -13230 -644 13139 8815 12886 -8328 -13316 4423 22135
8233 22135 36064 34471 27919 27789 18900 16462 23127 35470 49845 39163 26568 14663 5752
$$ packed form
8332A104J2246n51j788j2490j1368L506P256J9035o92M878m252L544P963j8261
8318A0130j4667K2368J3955L344j9230j2897J610N230M140M307j0796r514K570
8305E50l118O61m974n863j440J44K2282K363J270p42J753N009m969q877r335M440
8289h46R144O942P98q055j3667Q239p308j6389K857N680l479o881M281J4472O6
8274d146j1123R455k878M682R048M818L28k664j1531Q173N525L044k718O509L614
8259B0136j0067o390K51J0119l341j1431j9056k105J5415p016K150j0199K320
8246a9214J9726j6816j612O523j837J2586J3783m324M071k1214m988J7739J7712
8233B2135J3929j593o552j30q889k438O665J2343J4375j0682j2595j1905q911
$$ plain form
8220 5752 17783 20746 10139 9380 3876 1856 26584 26924 9919 2308 -8369 -23176 -9129 10361
8206 10361 20131 23106 19517 18042 24897 34528 26461 13331 23872 29948 31777 14829 6393 7040
8192 7040 11198 28423 19791 10518 17020 21592 39734 51737 54976 59545 64319 55551 43265 15204
8178 15204 639 -10153 3412 10538 10280 14181 6711 2979 -3876 -3794 1151 2905 9943 14416 25945
8163 25945 33443 29779 10285 10372 4754 12624 15413 21070 13072 9409 2671 5680 8404 8702 2380
8148 2380 12450 2379 -4107 1811 -4095 2973 9927 -4953 -19639 -11201 122 15765 15861 13511
8134 13511 2341 3919 4789 10838 20541 18966 21285 17948 25865 18399 613 1535 996 -1104 -8108
8119 -8108 -13528 -4506 -3298 -8582 -8907 2888 380 1631 -4567 -16050 1058 14697 -43 -6080
$$ packed form
8220E752J2031K963j0607p59n504k020K4728L40j7005p611j0677j4807J4047J9490
8206A0361R770K975l589j475O855R631q067j3130J0541O076J829j6948q436O47
8192G040M158J7225q632r273O502M572J8142J2003L239M569M774q768j2286k8061
8178A5204j4565j0792J3565P126k58L901p470l732o855Q2M945J754P038M473J1529
8163B5945P498l664j9494Q7n618P870K789N657p998l663o738L009K724K98o322
8148B380J0070j0071o486N918n906P068O954j4880j4686Q438J1323J5643R6k350
8134A3511j1170J578Q70O049R703j575K319l337P917p466j7786R22n39k100p004
8119h108n420R022J208n284l25J1795k508J251o198j1483J7108J3639j4740o037
$$ plain form
8105 -6080 2702 7890 6067 2061 -9935 -14357 -18852 -8806 3425 2461 6353 6695 3521 11392 11324
8090 11324 9711 8480 10135 3012 269 3399 9194 4390 -5013 1025 10051 8144 -6535 100
8076 100 9650 3770 3671 -1794 -11968 5240 28130 27066 3495 -2858 7427 11383 16932 17828 12518
8061 12518 8060 16743 18249 19531 24453 30440 34920 38400 23888 12194 771 -3852 8935 11025
8047 11025 6666 5174 -1272 1946 2782 3074 -3355 -7276 -13775 -11388 -11081 -5281 -12939 -19899 -4291
8032 -4291 11593 17275 11777 2520 -7474 -5817 -4869 -13068 -18525 -10561 -1685 1446 8527 9970 3857
8017 3857 10492 8372 2443 11733 8911 -2602 -4555 597 8147 9486 13312 5169 -734 11968
8003 11968 2202 -1022 11627 7336 1238 -5269 -6036 -7004 -15698 -16408 -9468 -8982 -1351 2329 4808
$$ packed form
8105f080Q782N188j823m006j1996m422m495J0046J2231r64L892L42l174P871o8
8090A1324j613j231J655p123k743L130N795m804r403O038R026j907j4679O635
8076A00R550n880r9n465j0174J7208K2890j064k3571o353J0285L956N549Q96n310
8061A2518m458Q683J506J282M922N987M480L480j4512j1694j1423m623J2787K090
8047A1025m359j492o446L218Q36K92o429l921o499K387L07N800p658o960J5608
8032d291J5884N682n498r257r994J657R48q199n457P964Q876L131P081J443o113
8017C857O635k120n929R290k822j1513j953N152P550J339L826q143n903J2702
8003A1968r766l224J2649m291o098o507p67r68q694p10O940M86P631L680K479
$$ plain form
7988 4808 15379 14017 14931 21091 26897 21395 9554 -7156 -2930 7354 6349 5962 12126 10119
7974 10119 -5783 -4515 -314 2333 -510 1534 6268 17376 21464 12851 19517 26332 17377 11840
7960 11840 8371 1651 12084 20587 8874 1093 -5014 -7426 1681 2063 -10088 -21009 -20845 -20535
7946 -20535 -26455 -28485 -31768 -26918 -22311 -12013 -16417 -14779 -5778 1865 10223 7983 985 14958
7932 14958 9664 7007 -420 -4755 -9743 -1212 -5159 -6799 3266 6596 6218 10631 -7362 -34639
7918 -34639 -31565 -25115 -7812 -3644 -5153 255 -962 6098 11843 12138 12231 15613 6327 -5052 -12453
7903 -12453 -16482 -20391 -1 5566 -2360 -1987 -695 8532 9999 4340 -1399 1782 4979 2014 -1140
7888 -1140 9488 5300 -13117 -9156 -14298 -25731 -19277 -15574 -9263 2237 7096 -1384 2710 -464
$$ packed form
7988D808J0571j362R14O160N806n502j1841j6710M226J0284j005l87O164k007
7974A0119j5902J268M201K647k843K044M734J1108M088q613O666O815q955n537
7960A1840l469o720J0433Q503j1713p781o107k412R107L82j2151j0921J64L10
7946b0535n920k030l283M850M607J0298m404J638R001P643Q358k240o998J3973
7932A4958n294k657p427m335m988Q531l947j640J0065L330l78M413j7993k7277
7918c4639L074O450J7303M168j509N408j217P060N745K95R3L382r286j1379p401
7903a2453m029l909K0390N567p926L73J292R227J467n659n739L181L197k965l154
7888a140J0628m188j8417L961n142j1433O454L703O311J1500M859q480M094l174
$$ plain form
7874 -464 -13949 -3943 8211 -761 -11277 -21962 -21383 -12129 -19155 -35978 -21022 -5698 10155
7861 10155 19318 11028 1973 -4233 -6120 -5477 -2714 -10010 -14848 -5939 6899 8197 3094 1798 3436
7846 3436 14438 15010 3491 -6347 5188 9645 6131 -2796 -1786 -1601 -7660 -14794 -18395 -5632
7832 -5632 10386 11413 3535 6603 6839 -1337 -4886 -17169 -24363 -23519 -13893 -16944 -17486 -10766 -6990
7817 -6990 -6661 -6045 -4187 5218 -3088 -16925 -14808 -4709 -1095 938 -3237 -15060 -7213 -5874 -9592
7802 -9592 -10606 -7563 -10255 7258 21021 16496 214 -5495 -12364 -6949 -78 44 1731 -4339
7788 -4339 -11229 -2580 -1573 -13278 -31214 -27023 -26430 -25041 -17466 -9518 -12292 -16266 -5626 7416
7774 7416 14283 13249 -2761 314 -55 3268 -9764 -5467 1966 7396 507 -12460 -6303 -9493
$$ packed form
7874d64j3485J0006J2154q972j0516j0685N79R254p026j6823J4956J5324J5853
7861A0155R163q290r055o206j887O43K763p296m838Q909J2838J298n103j296J638
7846C436J1002N72j1519r838J1535M457l514q927J010J85o059p134l601J2763
7832e632J6018J027p878L068K36q176l549j2283p194Q44R626l051n42O720L776
7817f990L29O16J858R405q306j3837K117J0099L614K033m175j1823P847J339l718
7802i592j014L043k692J7513J3763m525j6282n709o869N415O871J22J687o070
7788d339o890Q649J007j1705j7936M191N93J389P575P948k774l974J0640J3042
7774G416O867j034j6010L075l69L323j3032M297P433N430o889j2967O157l190
$$ plain form
7760 -9493 -16109 -19013 -15965 -21310 -18530 -18284 -5661 -4619 -1071 8666 2678 2442 7742 7964 -2478
7745 -2478 -12318 -21401 -18754 -14748 -8801 -19701 -30037 -20779 -3915 5109 4166 -1389 -11238 -21077
7731 -21077 -22948 -16022 1287 -9766 -21948 -27888 -29635 -23149 3781 9637 4282 12415 13424 3001
7717 3001 -10212 -18137 -20938 -1665 3807 -5517 -19085 -25911 -25584 -13856 8361 10822 16300 22704
7703 22704 22223 15130 -916 -12627 -9396 3965 4063 5068 -4963 -2596 281 1312 -882 -13002
7689 -13002 -27870 -33147 -21101 -9377 -14728 -17629 -8115 -3872 -11597 -11988 -7728 2151 3812 5684
7675 5684 5121 -3863 -11206 -9355 -9232 -21219 -19453 -3974 -4357 2999 9814 11855 7200 1258 4059
7660 4059 22940 13839 -1469 7585 14060 615 -8283 -4592 -12464 -13005 -9987 -4568 -3150 -2451 1732
$$ packed form
7760i493o616k904L048n345K780K46J2623J042L548R737n988k36N300K22j0442
7745b478r840r083K647M006N947j0900j0336R258J6864R024r43n555r849r839
7731b1077j871O926J7309j1053j2182n940j747O486K6930N856n355Q133J009j0423
7717C001j3213p925k801J9273N472r324j3568o826L27J1728K2217K461N478O404
7703B2704m81p093j6046j1711L231J3361R8J005j0031K367K877J031k194j2120
7689a3002j4868n277J2046J1724n351k901R514M243p725l91M260R879J661J872
7675E684n63q984p343J851J23j1987J766J5479l83P356O815K041m655n942K801
7660D059J8881r101j5308R054O475j3445q898L691p872n41L018N419J418O99M183
$$ plain form
7645 1732 9160 12878 339 -1820 -8791 -13300 2964 13542 -2647 -31283 -48112 -47908 -30610
7632 -30610 -24008 -13725 -10247 355 1779 -7649 -9710 -9873 -2333 -7294 -18672 -29613 -15394 1655
7618 1655 4717 11293 6773 4440 1271 10758 21914 5101 -20790 -14530 -28110 -27024 -14137 -15242
7604 -15242 -17761 -13948 -3058 -4111 -5086 -1354 10348 12230 9835 12753 10203 -4427 -19243 -26946
7590 -26946 -34374 -22665 -10904 -5652 -1414 -5859 4142 -4370 -16791 -5495 8275 5189 1866
7577 1866 -3041 820 11876 5887 -14569 -11422 -11629 -13787 -5530 -8394 -11923 -14945 -12818 -17667 -12208
7562 -12208 -12717 -18065 -24063 -25615 -21888 -18282 -9617 -1329 20109 26474 14211 2159 464 -9140
7548 -9140 -16641 -24718 -30339 -19592 -25362 -26147 -14119 -5975 -11779 -13857 -11343 -19228 -28484 -21880 -14717
$$ packed form
7645A732P428L718j2539k159o971m509J6264J0578j6189k8636j6829K04J7298
7632c0610O602J0283L478J0602J424r428k061j63P540m961j1378j0941J4219J7049
7618A655L062O576m520k333l169R487J1156j6813k5891O260j3580J086J2887j105
7604a5242k519L813J0890j053r75L732J1702J882k395K918k550j4630j4816p703
7590b6946p428J1709J1761N252M238m445J0001q512j2421J1296J3770l086l323
7577A866m907L861J1056n989k0456L147k07k158Q257k864l529l022K127m849N459
7562a2208n09n348n998j552L727L606Q665Q288K1438O365j2263j2052j695r604
7548i140p501q077n621J0747n770p85J2028Q144n804k078K514p885r256O604P163
$$ plain form
7533 -14717 -7552 -17527 -25456 -22951 -18835 -19013 -31079 -24760 -23549 -19001 -1593 1406 -1159 -5759
7519 -5759 -15215 -9822 -2509 3951 4012 7184 -10779 -13932 -6417 10322 15176 7805 9852 6613 4380
7504 4380 -15681 -15831 4454 7263 -466 -10574 5550 16668 17246 3882 9426 8823 4016 6875
7490 6875 -1057 -8851 -725 9398 2285 -4999 4014 630 -6657 -3575 -1033 -8683 -17544 -17320 -18123
7475 -18123 -15665 251 828 3145 7684 11285 9872 8836 1202 -2660 -5431 637 6295 223 -10604
7460 -10604 -10330 -14172 -12626 -10386 -8411 -1364 17223 29922 34261 26823 16199 2639 -10187 -18295
7446 -18295 -5533 365 11610 23407 16419 22742 11160 4008 -8391 -17452 -18129 -24252 -8202
7433 -8202 -645 -4168 -11349 -4739 -15813 -18469 -23358 -12111 -14922 -15022 -13070 -19098 -6523 -254
$$ packed form
7533a4717P165r975p929K505M116j78j2066O319J211M548J7408K999k565m600
7519e759r456N393P313O460O1L172j7963l153P515J6739M854p371K047l239k233
7504D380k0061j50K0285K809p729j0108J6124J1118N78j3364N544o03m807K859
7490F875p932p794Q126J0123p113p284R013l384p287L082K542p650q861K24q03
7475a8123K458J5916N77K317M539L601j413j036p634l862k771O068N658o072j0827
7460a0604K74l842J546K240J975P047J8587J2699M339p438j0624j3560j2826q108
7446a8295J2762N898J1245J1797o988O323j1582p152j2399r061o77o123J6050
7433h202P557l523p181O610j1074k656m889J1247k811j00J952o028J2575O269
$$ plain form
7419 -254 -4402 -2778 -2183 -5971 -15487 -17728 -17000 -5616 -244 -3552 11661 6706 16033 23465 14379
7404 14379 9060 5006 4083 -4099 -5477 813 -15728 -30534 -27952 -19368 -17042 -15966 -20503 -4824
7390 -4824 -1223 -7713 -11476 -10470 -12716 4897 1508 4006 15051 21553 22810 18330 17899 20216 13468
7375 13468 284 -7837 -4410 4607 7107 271 -3787 -2112 188 -2658 -11667 -29164 -20994 -21139
7361 -21139 -12434 -17186 -24700 -7196 -3572 -1260 7052 9715 6732 -6522 -22860 -31709 -18139 -6801
7347 -6801 14884 19721 15202 7176 2296 2231 -6119 -7446 448 1033 -7598 -12430 -1216 4884 -3833
7332 -3833 -11228 -10762 -1403 -981 -7844 -8529 6649 -8040 -10741 -6091 -11502 -16071 -16041 -14770 -15596 -16423
7316 -16423 -20771 -20611 -17430 -7062 5165 5687 1006 -7254 -4513 -4821 -1764 -3578 -8837 -16309 -6655
$$ packed form
7419b54m148J624N95l788r516k241P28J1384N372l308J5213m955R327P432r086
7404A4379n319m054r23q182j378O290j6541j4806K582Q584K326J076m537J5679
7390d824L601o490l763J006k246J7613l389K498J1045O502J257m480m31K317o748
7375A3468j3184q121L427R017K500o836m058J675K300k846r009j7497Q170j45
7361b1139Q705m752p514J7504L624K312Q312K663k983j3254j6338q849J3570J1338
7347f801K1685M837m519q026m880o5q350j327P894N85q631m832J1214O100q717
7332c833p395M66R359M22o863o85J5178j4689k701M650n411m569L0J271q26q27
7316a6423m348J60L181J0368J2227N22m681q260K741l08L057j814n259p472R654
$$ plain form
7301 -6655 -5719 -1826 2972 338 4334 15859 18391 20498 12223 5589 6301 1066 4622 17092 7926
7286 7926 3414 8761 11379 627 -9055 -9550 -19677 -13928 -2485 9085 9072 -9165 -13972 47
7272 47 10520 12959 -695 -3905 1989 16783 21193 17739 17310 16104 19391 14991 9851 13345 10361
7257 10361 -8852 -3655 11874 12163 5166 -9945 -15992 -16331 -22414 -14048 -7129 -12928 -6887 2741
7243 2741 17317 26908 26131 7548 -16451 -20946 -6885 -832 -1414 4374 -5311 -11498 -4905 -12764
7229 -12764 -14486 -17940 -29519 -21171 -5810 -9397 -18680 -25804 -31961 -22741 -3529 12369 12600 9232
7215 9232 12610 12056 8402 -2399 10492 12038 13831 3554 -4639 -11262 -9352 -639 -3200 -7993
7201 -7993 -17549 -6004 3061 -2690 -7388 1357 11912 -1083 -2551 -4313 -19444 -17618 -17415 -24585
$$ packed form
7301f655R36L893M798k634L996J1525K532K107q275o634P12n235L556J2470r166
7286G926m512N347K618j0752r682m95j0127N749J1443J1570j3j8237m807J4019
7272D7J0473K439j3654l210N894J4794M410l454m29j206L287m400n140L494k984
7257A0361j9213N197J5529K89o997j5111o047l39o083Q366O919n799O041R628
7243B741J4576R591p77j8583k3999m495J4061O053n82N788r685o187O593p859
7229a2764j722l454j1579Q348J5361l587r283p124o157R220J9212J5898K31l368
7215I232L378n54l654j0801J2891J546J793j0277q193o623J910Q713k561m793
7201g993r556J1545R065n751m698Q745J0555j2995j468j762j5131J826K03p170
$$ plain form
7187 -24585 -13080 -12649 -16922 -4313 -2403 997 8435 823 -5472 -5078 1230 15559 20248 16204
7173 16204 -3535 -14475 -6126 -9208 -6103 -4819 -18408 -22404 -30859 -37513 -28491 -8439 -3625 2721
7159 2721 12470 4999 -667 -9621 -13197 -6584 -5278 -6653 773 1894 -6568 -25204 -18585 -13114 -8679
7144 -8679 -7458 -14546 -24718 -16512 -8505 -2032 4671 6139 969 -2890 -5453 6622 18186 13022
7130 13022 878 -13888 -7062 2466 -10720 -22814 -28780 -16257 -23518 -27894 -19549 -11253 -17683
7117 -17683 -16709 -13585 -12694 -18114 -10417 -10157 -20583 -22615 -13529 -1915 13230 11332 3397 5281 7062
7102 7062 2684 2019 153 4749 947 -7797 -7590 4255 15600 6491 3120 795 -1547 -11165 -14852
7087 -14852 872 -9775 -10754 -9397 -4442 -6418 -8735 -4589 -6866 -5800 -8978 -695 -6655 -9085
$$ packed form
7187b4585J1505M31m273J2609J910L400P438p612o295L94O308J4329M689m044
7173A6204j9739j0940Q349l082L105J284j3589l996q455o654R022K0052M814O346
7159B721R749p471n666q954l576O613J306j375P426J121q462j8636O619N471M435
7144h679J221p088j0172Q206Q007O473O703J468n170l859k563J2075J1564n164
7130A3022j2144j4766O826R528j3186j2094n966J2523p261m376Q345Q296o430
7117a7683R74L124Q91n420P697K60j0426k032R086J1614J5145j898p935J884J781
7102G062m378o65j866M596l802q744K07J1845J1345r109l371k325k342r618l687
7087a4852J5724j0647r79J357M955j976k317M146k277J066l178Q283n960k430
$$ plain form
7073 -9085 -1020 7762 -2491 -13168 -15064 -15198 -15603 -15139 -13998 -16821 -1197 14336 -693 -3694
7059 -3694 3587 833 -7222 -4153 -7165 -6454 351 7800 1263 -5208 -14971 -3891 4739 12363 9015
7044 9015 2784 8807 6105 2813 925 4569 9328 8530 14780 7905 20207 13401 3276 10467 9307
7029 9307 -11176 -20105 -5051 7732 1584 351 4927 -3142 -3763 -5657 -10947 -18565 -15010 -246
7015 -246 16217 24069 25733 21055 7791 9844 3659 3420 21258 36294 47278 38243 20311 10851
7001 10851 15870 19008 17316 4867 8461 13135 15966 1915 -1992 -5553 -7097 -8834 -5505 -1597
6987 -1597 -1105 -18082 -14167 -8544 -18049 -1314 -1494 -14574 -27240 -28767 -26262 -19028 -13001 -20084
6973 -20084 -21951 -16735 -16582 -2475 -5066 -8027 -1519 4134 -2808 -4649 -16079 -16220 -16808 -12958 -22814
$$ packed form
7073i085Q065Q782j0253j0677j896j34m05M64J141k823J5624J5533j5029l001
7059c694P281k754q055L069l012P11O805P449o537o471r763J1080Q630P624l348
7044I015o231O023k702l292j888L644M759p98O250o875J2302o806j0125P191j160
7029I307k0483q929J5054J2783o148j233M576q069o21j894n290p618L555J4764
7015b46J6463P852J664m678j3264K053o185k39J7838J5036J0984r035j7932r460
7001A0851N019L138j692j2449L594M674K831j4051l907l561j544j737L329L908
6987a597M92j6977L915N623r505J6735j80j3080j2666j527K505P234O027p083
6973b0084j867N216J53J4107k591k961O508N653o942j841j1430j41n88L850r856
$$ plain form
6958 -22814 -35371 -26831 -14804 -7499 -9807 -20402 -11865 -33 3914 -8116 -14892 -27541 -29908
6945 -29908 -29479 -33106 -49719 -45233 -33389 -13626 -6533 -1035 8784 12032 7903 3863 -1544 1157
6931 1157 -3040 -15034 -6264 6955 1336 1169 1007 8601 16608 4588 -8324 -7273 -1912 -5211
6917 -5211 -11461 -18409 -7989 9415 9876 5723 -8836 522 2222 12963 17728 11143 -9668 -6104
6903 -6104 -2562 2943 5952 6583 17926 15796 12611 9192 7684 16104 18310 13636 12084 7417 5267
6888 5267 15113 18414 19741 18180 18078 11085 9437 6374 1573 9400 13975 5522 6304 -7840 -5153
6873 -5153 8062 7624 3459 7342 1712 1594 886 2481 -4611 -14846 -14942 -9499 6756 8850 1927
6858 1927 -3152 -7906 -13005 -20258 -23983 -17063 -21785 -21440 -2250 -5249 -9662 -6447 -643 6707 12738
$$ packed form
6958b2814j2557Q540J2027P305k308j0595Q537J1832L947j2030o776j2649k367
6945b9908M29l627j6613M486J1844J9763P093N498R819L248m129m040n407K701
6931A157m197j1994Q770J3219n619j67j62P594Q007j2020j2912J051N361l299
6917e211o250o948J0420J7404M61m153j4559R358J700J0741M765o585k0811L564
6903f104L542N505L009O31J1343k130l185l419j508Q420K206m674j552m667k150
6888E267R846L301J327j561j02o993j648l063m801P827M575q453P82j4144K687
6873e153J3215m38m165L883n630j18p08J595p092j0235r6N443J6255K094o923
6858A927n079m754n099p253l725O920m722L45J9190k999m413L215N804P350O031
$$ plain form
6843 12738 -8263 -18129 -11877 -13510 -7506 -26673 -31500 -26468 -14366 -1572 -1598 -4529 -2608 -1022
6829 -1022 -1201 -13079 -13471 -9015 -16780 -12988 -7309 736 9207 8925 22992 26055 30371 14916 17370
6814 17370 11621 10649 -765 -7389 2656 6345 -7388 -8807 -7484 -6413 -412 -9206 -34999 -37202
6800 -37202 -28236 -34861 -16730 -11140 -14785 -11042 -1601 -562 -6228 681 9502 16061 19628 17624
6786 17624 11241 8774 10849 15953 19527 21665 24930 10391 -10511 -19798 -23530 -18710 1554 9834
6772 9834 6752 -5978 -18440 -10436 6224 23424 29430 16306 -18026 -35681 -19775 1185 17427
6759 17427 17176 2607 4979 5299 1313 1854 -4786 8267 11595 11886 3132 2173 15138 26675 20946
6744 20946 24305 29722 23718 4710 -4315 -5207 -25295 -30772 -13738 -2622 7827 9506 16234 18714
$$ packed form
6843A2738k1001r866O252j633O004j9167m827N032J2102J2794k6k931J921J586
6829a022j79j1878l92M456p765L792N679Q045Q471k82J4067L063M316j5455K454
6814A7370n749r72j1414o624J0045L689j3733j419J323J071O001q794k5793k203
6800c7202Q966o625J8131N590l645L743R441J039n666O909Q821O559L567k004
6786A7624o383k467K075N104L574K138L265j4539k0902r287l732M820K0264Q280
6772I834l082j2730j2462Q004J6660J7200O006j3124l4332j7655J5906K0960J6242
6759A7427k51j4569K372L20l986N41o640J3053L328K91q754r59J2965J1537n729
6744B0946L359N417o004j9008r025q92k0088n477J7034J1116J0449J679O728K480
$$ plain form
6730 18714 -1403 -6255 -2846 6625 14442 21297 -936 -17722 -18236 9761 25927 14865 -3607
6717 -3607 4840 2800 -3308 2435 8414 12747 12171 3005 -6360 -2159 7593 10333 6114 15638 20664
6702 20664 14364 -1159 -6013 3416 15912 14719 8026 19351 20898 21379 13263 -9134 -22864 -16592
6688 -16592 -9074 10721 17521 832 -5385 9356 7616 2341 -1222 -8066 1070 -1235 -7193 -423
6674 -423 -10456 -13116 -11607 -21387 -25496 -28581 -26722 -18470 6891 20144 12569 14512 8596 -1451
6660 -1451 -4832 -1750 11747 3879 -14069 -21359 -9015 2884 6374 7192 -205 1870 -5647 -12726
6646 -12726 -1746 -2241 5010 -2153 -9550 322 2624 4989 13083 17767 14433 18849 11928 3605 3947
6631 3947 -1646 -5656 -4389 -4856 -11721 -15304 -7052 -2636 -6463 -15320 -1176 6457 15744 17861 21041
$$ packed form
6730A8714k0117m852L409R471P817O855k2233j6786n14K7997J6166j1062j8472
6717c607Q447k040o108N743N979M333n76r166r365M201R752K740m219R524N026
6702B0664o300j5523m854R429J2496j193o693J1325J547M81q116k2397j3730O272
6688a6592P518J9795O800j6689o217J4741j740n275l563o844R136k305n958O770
6674d23j0033k660J509r780m109l085J859Q252K5361J3253p575J943n916j0047
6660a451l381L082J3497p868j7948p290J2344J1899L490Q18p397K075p517p079
6646a2726J0980m95P251p163p397R872K302K365Q094M684l334M416o921q323L42
6631C947n593m010J267m67o865l583Q252M416l827q857J4144P633R287K117L180
$$ plain form
6616 21041 11708 -6252 -13854 -10653 -10985 -8881 -17070 -1383 8553 4869 4296 20837 24594 29800
6602 29800 13551 -14822 -12261 -7623 -10745 -18518 -17609 -11956 -4417 -5478 4925 -3862 -5346 52
6588 52 7655 1565 1930 -7752 -3436 2175 6939 16888 14566 564 -9460 -5619 5125 19463 20762
6573 20762 12429 -2221 -24964 -25552 -13562 -6940 7086 -2309 -7864 -2506 5757 24365 29726 10595
6559 10595 6341 14750 12869 2525 -8769 -5500 2730 -599 -7616 -3898 377 2799 7227 -12921
6545 -12921 -20302 -20743 -12666 -3226 2479 229 -2368 1284 4628 3252 261 -11066 -13292 -4552 1100
6530 1100 -799 -20738 -25814 -10906 -12316 -19577 -20459 -13239 6120 6253 -7215 -4903 -4064 -8273 -20229
6515 -20229 -10549 208 7708 21741 15741 8622 12217 7402 -20657 -36852 -25006 -23171 -27354
$$ packed form
6616B1041r333j7960p602L201l32K104q189J5687R936l684n73J6541L757N206
6602B9800j6249k8373K561M638l122p773R09N653P539j061J0403q787j484N398
6588E2P603o090L65r682M316N611M764R949k322j4002j0024L841J0744J4338J299
6573B0762q333j4650k2743n88J1990O622J4026r395n555N358Q263J8608N361j9131
6559A0595m254Q409j881j0344j1294L269Q230l329p017L718M275K422M428k0148
6545a2921p381m41Q077R440N705k250k597L652L344j376k991j1327k226Q740N652
6530A100j899j9939n076J4908j410p261q82P220J9359J33j3468K312Q39m209j1956
6515b0229R680J0757P500J4033o000p119L595m815k8059j6195J1846J835m183
$$ plain form
6502 -27354 -21002 -22887 -7678 -436 -21054 -30410 -4816 14697 9724 18574 2912 -7740 1091
6489 1091 -12567 -23388 -17747 -19746 -11619 -7585 2572 4443 -5106 -7059 -5211 -6127 -13616 -13256 -9403
6474 -9403 -15178 -15851 -19651 -18386 -19316 -29317 -31171 -17971 -11417 -17778 -16903 6 11159 6179 -18220
6459 -18220 -33225 -24439 -13093 -1449 125 -7657 -10286 -3592 -6660 -14811 -16310 -9905 -4474 9397
6445 9397 5264 -559 -1594 -663 3019 2464 -7420 -4487 -1292 6590 10521 17734 22109 10481 6645
6430 6645 10189 7446 1692 -14465 -28343 -22330 -452 11065 5079 -16797 -14183 -24155 -29838 -3576
6416 -3576 16500 21584 19184 9903 5612 6080 -3513 -11270 -7532 -5821 -7313 -10540 -9937 -8949 -24922
6401 -24922 -20834 -8972 3428 1725 -3451 -9954 -8466 2069 -4973 -11805 -9422 -11872 -19543 -31015
$$ packed form
6502b7354O352j885J5209P242k0618r356K5594J9513m973Q850j5662j0652Q831
6489A091j3658j0821N641j999Q127M034J0157J871r549j953J848r16p489L60L853
6474i403n775o73l800J265r30j0001j854J3200O554o361Q75J6909J1153m980k4399
6459a8220j5005Q786J1346J1644J574p782k629O694l068q151j499O405N431J3871
6445I397m133n823j035R31L682n55r884K933L195P882L931P213M375j1628l836
6430F645L544k743n754j6157j3878O013K1878J1517n986k1876K614r972n683K6262
6416c576K0076N084k400r281m291M68r593p757L738J711j492l227O03R88j5973
6401b4922M088J1862J2400j703n176o503J488J0535p042o832K383k450p671j1472
$$ plain form
6387 -31015 -23844 -17968 -1816 4226 -2513 -6096 -6146 -12713 -12735 -5438 295 -4913 5194 6329 5367
6372 5367 13241 10987 4837 -1390 -5067 4162 2386 1999 -7309 2025 1091 -4434 -8363 -10842 -110
6357 -110 6812 8611 -2895 -16061 -15980 -8743 -1872 -6064 6301 10808 8613 21228 8917 2261
$$ packed form
6387c1015P171N876J6152O042o739l583n0o567k2P297N733n208J0107J135r62
6372E367P874k254o150o227l677R229j776l87r308R334r34n525l929k479J0732
6357a10O922J799j1506j3166Q1P237O871m192J2365M507k195J2615j2311o656
$$ [...]
##END NTUPLES=NMR SPECTRUM
##END=
