##TITLE=Analysis number 318976
Compound Code cc 48401
Book Reference 476/48
Project Code adrs
Chemist Name williamk
##JCAMPDX= 6.0         $$ Bruker NMR JCAMP-DX V2.0
##DATA TYPE= NMR SPECTRUM
##DATA CLASS= NTUPLES
##ORIGIN= Bruker BioSpin GmbH
##OWNER= nmr
$$ XWIN-NMR		Version 3.5
$$ Wed Apr 26 09:27:52 2006 GMT Daylight Time (UT+1h)  MAYBRIDGE\nmr@NMR_250MHZ
##.OBSERVE FREQUENCY= 250.131544655141
##.OBSERVE NUCLEUS= ^1H
##.ACQUISITION MODE= SIMULTANEOUS (DQD)
##.ACQUISITION SCHEME= undefined
##.AVERAGES= 16
##.DIGITISER RES= 18
##SPECTROMETER/DATA SYSTEM= dpx250
##.PULSE SEQUENCE= zg30
##.SOLVENT NAME= DMSO
##.SHIFT REFERENCE= (INTERNAL, DMSO, 0, 16.522)
##AUDIT TRAIL= $$ (NUMBER, WHEN, WHO, WHERE, WHAT)
$$ ##TITLE= Audit trail, XWIN-NMR		Version 3.5
$$ ##JCAMPDX= 5.01
$$ ##ORIGIN= Bruker BioSpin GmbH
$$ ##OWNER= nmr
$$ C:\u/data/dgb/nmr/ADRS/3200/pdata/1/auditp.txt
$$ ##AUDIT TRAIL=  $$ (NUMBER, WHEN, WHO, WHERE, WHAT)
(   1,<2006-04-26 09:27:26.45 +100>,<MAYBRIDGE\nmr>,<NMR_250MHZ>,
      <created by zg, POWCHK disabled, PULCHK disabled
       configuration hash MD5:
       84 BC 41 DB A1 6E 1D 46 DA 25 12 A5 C1 ED C5 3A
       data hash MD5: 64K
       F5 C5 16 54 13 B1 1D 37 64 5F 92 A9 E0 33 95 1B>)
(   2,<2006-04-26 09:27:40.00 +100>,<MAYBRIDGE\nmr>,<NMR_250MHZ>,
      <Start of raw data processing
       ef LB = 0.3 FT_mod = 6 PKNL = 1 SI = 32K 
       data hash MD5: 32K
       56 53 8C 48 3D 41 62 99 1A BF 11 C3 50 47 A2 B1>)
(   3,<2006-04-26 09:27:41.86 +100>,<MAYBRIDGE\nmr>,<NMR_250MHZ>,
      <apk 
       data hash MD5: 32K
       3C 7C FE 9B 53 CC 5C 98 8F 1D 7C 75 54 E5 41 22>)
(   4,<2006-04-26 09:27:42.69 +100>,<MAYBRIDGE\nmr>,<NMR_250MHZ>,
      <abs ABSG = 5 
       data hash MD5: 32K
       D5 0B 47 6A 26 FF 74 5B FC BB 35 E7 14 FB 0E 67>)
$$ ##END=
$$ 
$$ hash MD5
$$ 13 2F AD 19 E1 7E 9B C6 A7 81 E5 58 6A 96 53 BA
##$RELAX= 
##$RELAX= 
##$RELAX= 
##$RELAX= 
##$RELAX= 
##$RELAX= 
##$RELAX= 
$$ Bruker specific parameters
$$ --------------------------
##$DU= <C:\u>
##$EXPNO= 3200
##$NAME= <ADRS>
##$PROCNO= 1
##$TYPE= <nmr>
##$USER= <dgb>
##$AMP= (0..31)
100 100 100 100 100 100 100 100 100 100 100 100 100 100 100 100 100 100 
100 100 100 100 100 100 100 100 100 100 100 100 100 100 
##$AQSEQ= 0
##$AQ_mod= 3
##$AUNM= <au_zg>
##$AUTOPOS= <4 >
##$BF1= 250.13
##$BF2= 250.13
##$BF3= 250.13
##$BF4= 250.13
##$BF5= 500.13
##$BF6= 500.13
##$BF7= 500.13
##$BF8= 500.13
##$BYTORDA= 1
##$CFDGTYP= 0
##$CFRGTYP= 5
##$CHEMSTR= <none>
##$CNST= (0..31)
1 1 145 1 1 1 1 1 1 1 1 1 1 1 1 1 1 1 1 1 1 1 1 1 1 1 1 1 1 1 1 1 
##$CPDPRG= <>
##$CPDPRG1= <>
##$CPDPRG2= <>
##$CPDPRG3= <>
##$CPDPRG4= <mlev>
##$CPDPRG5= <mlev>
##$CPDPRG6= <mlev>
##$CPDPRG7= <mlev>
##$CPDPRG8= <mlev>
##$CPDPRGB= <>
##$CPDPRGT= <>
##$D= (0..31)
0 1 0 0 0 0 0 0 0 0.06 0 0 0 0 0 0 0.0002 0 0 0 0 0 0 0 0 0 0 0 0 0 0 
0 
##$DATE= 1146040045
##$DBL= (0..7)
120 120 120 120 120 120 120 120 
##$DBP= (0..7)
150 150 150 150 150 150 150 150 
##$DBP07= 0
##$DBPNAM0= <>
##$DBPNAM1= <>
$$ [...]
##$SUBNAM7= <"">
##$SUBNAM8= <"">
##$SUBNAM9= <"">
##$SW= 20.6930455092707
##$SWIBOX= (0..15)
0 0 3 0 0 0 0 0 0 0 0 0 0 0 0 0 
##$SW_h= 5175.983436853
##$TD= 65536
##$TD0= 1
##$TE= 295.16
##$TE2= 300
##$TE3= 300
##$TEG= 300
##$TL= (0..7)
0 120 120 120 120 120 120 120 
##$TP= (0..7)
150 150 150 150 150 150 150 150 
##$TP07= 0
##$TPNAME0= <>
##$TPNAME1= <>
##$TPNAME2= <>
##$TPNAME3= <>
##$TPNAME4= <>
##$TPNAME5= <>
##$TPNAME6= <>
##$TPNAME7= <>
##$TPOAL= (0..7)
0.5 0.5 0.5 0.5 0.5 0.5 0.5 0.5 
##$TPOFFS= (0..7)
0 0 0 0 0 0 0 0 
##$TUNHIN= 0
##$TUNHOUT= 0
##$TUNXOUT= 0
##$USERA1= <user>
##$USERA2= <user>
##$USERA3= <user>
##$USERA4= <user>
##$USERA5= <user>
##$V9= 5
##$VALIST= <valist>
##$VCLIST= <CCCCCCCCCCCCCCC>
##$VD= 0
##$VDLIST= <DDDDDDDDDDDDDDD>
##$VPLIST= <PPPPPPPPPPPPPPP>
##$VTLIST= <TTTTTTTTTTTTTTT>
##$WBST= 1024
##$WBSW= 4
##$XGAIN= (0..3)
0 0 0 0 
##$XL= 0
##$YL= 0
##$YMAX_a= 367171
##$YMIN_a= -428879
##$ZGOPTNS= <>
##$ZL1= 120
##$ZL2= 120
##$ZL3= 120
##$ZL4= 120
##$ABSF1= 16.522
##$ABSF2= -4.171173
##$ABSG= 5
##$ABSL= 3
##$ALPHA= 0
##$AQORDER= 0
##$ASSFAC= 0
##$ASSFACI= 0
##$ASSFACX= 0
##$ASSWID= 0
##$AUNMP= <proc_1d>
##$AZFE= 0.1
##$AZFW= 0.1
##$BCFW= 0
##$BC_mod= 0
##$BYTORDP= 0
##$COROFFS= 0
##$CY= 12.5
##$DATMOD= 1
##$DC= 0
##$DFILT= <>
##$DTYPP= 0
##$F1P= 14.0000005364418
##$F2P= -0.99999901652339
##$FCOR= 0.5
##$FTSIZE= 32768
##$FT_mod= 6
##$GAMMA= 0
##$GB= 0
##$INTBC= 1
##$INTSCL= 1
##$ISEN= 128
##$LB= 0.3
##$LEV0= 0
##$LPBIN= 0
##$MAXI= 10000
##$MC2= 0
##$MEAN= 0
##$ME_mod= 0
##$MI= 0
##$NCOEF= 0
##$NC_proc= -6
##$NLEV= 6
##$NOISF1= 0
##$NOISF2= 0
##$NSP= 0
##$NTH_PI= 0
##$NZP= 0
##$OFFSET= 16.522
##$PC= 1
##$PHC0= 155.9928
##$PHC1= 7.570751
##$PH_mod= 1
##$PKNL= yes
##$PPARMOD= 0
##$PSCAL= 4
##$PSIGN= 0
##$REVERSE= no
##$SF= 250.13
##$SI= 32768
##$SIGF1= 0
##$SIGF2= 0
##$SINO= 400
##$SIOLD= 32768
##$SREGLST= <1H.DMSO>
##$SSB= 0
##$STSI= 32768
##$STSR= 0
##$SW_p= 5175.98343685301
##$SYMM= 0
##$S_DEV= 0
##$TDeff= 65536
##$TDoff= 0
##$TI= <Analysis number 999999
Compound Code 99
Book Reference 9
Project Code 9>
##$TILT= no
##$TM1= 0
##$TM2= 0
##$TOPLEV= 0
##$USERP1= <user>
##$USERP2= <user>
##$USERP3= <user>
##$USERP4= <user>
##$USERP5= <user>
##$WDW= 1
##$XDIM= 32768
##$YMAX_p= 505363612
##$YMIN_p= -1032381
$$ End of Bruker specific parameters
$$ ---------------------------------
##NTUPLES= NMR SPECTRUM
##VAR_NAME=  FREQUENCY,     SPECTRUM/REAL,   SPECTRUM/IMAG
##SYMBOL=    X,             R,               I
##VAR_TYPE=  INDEPENDENT,   DEPENDENT,       DEPENDENT
##VAR_FORM=  AFFN,          ASDF,            ASDF
##VAR_DIM=   32768,         32768,           32768
##UNITS=     HZ,            ARBITRARY UNITS, ARBITRARY UNITS
##FACTOR=    0.157963299565203, 1,           1
##FIRST=     4132.6476996994, 0,             0
##LAST=      -1043.33573715361, 0,           0
##MIN=       -1043.33573715361, -1032381,    0
##MAX=       4132.6476996994, 505363612,     0
$$ Real data points
##PAGE= N=1
##DATA TABLE= (X++(R..R)), XYDATA
$$ [...]
24307d63826N0264p9539R5629L81296P1738k55399N5512J8232l1485k12737k21975
24296e92290J86204k36974J03380K16038J75347J42053O2528p2024l49779P2234
24286b93283J30339J1793K17694J35676n4889o1980l14636j09996J50019K60378
24276G1115j6228J8353K34563J4232j6830o122J13283O7155l74883M1196O4785
24265B10619r2534j55110n0937o4411l430J3459j01624j01688J50853J72206K5186
24254B589k18626M2388j14395P6528J70625k78234j47439J18520K02794K04861
24244E9611j5472k97991J16513K68848J5194J51092n032m9971N177j37600q539
24233A01830Q6779J00517j70894k02128k83020N5363j49969K2697L18448O3870
$$ plain form
24307 -463826 -413562 -493101 -397472 -16176 55562 -199837 -144325 -126093 -157578 -370315 -592290
24296 -592290 -406086 -643060 -539680 -323642 -148295 -6242 56286 -15738 -365517 -293283
24286 -293283 -162944 -151151 66543 202219 147330 85350 -229286 -339282 -189263 71115
24276 71115 54887 73240 307803 322035 305205 299083 412366 479521 104638 145834 210619
24265 210619 118085 -37025 -87962 -152373 -155803 -142344 -243968 -345656 -194803 -22597 2589
24254 2589 -216037 -173649 -288044 -211516 -40891 -319125 -466564 -348044 -145250 59611
24244 59611 44139 -253852 -137339 131509 146703 297795 292763 242792 247969 110369 101830
24233 101830 188609 289126 118232 -83896 -366916 -311553 -461522 -438825 -120377 -56507
24223e6507r8387k8481J10379K58392K04057j88885r5407J0583o535J11815Q0248
24212C01272r2882J07356j45289j57518R9986n7411k8246n1907K6588J09432q750
24201A02631l10285j38270p4930J71469O3720N0834K89586O7435j18002j24424
24191b0236N6054j08130j66733j25936L4999K13771K63369k906j14525j11640
24181h1913n7814K4426p0239j14639K30156K4074q0481J31197M4887k1107K59106
24170B87653P4733p5191k51172k35153Q3331j98794j7504N31462K72996l77873
24160I4488M2931j41797j15469P8670J20189k4739L6334K07511Q5727k45118q8841
24149D9886k34713j16126J22650L42413J31367j43985q0350j30997R0625N0725
$$ plain form
24223 -56507 -154894 -183375 -72996 185396 389453 200568 105161 115744 109209 221024 301272
24212 301272 208390 315746 170457 12939 112925 55514 27268 -24639 1949 111381 102631
24201 102631 -207654 -345924 -420854 -249385 -185665 -134831 154755 222190 104188 -20236
24191 -20236 35818 -72312 -239045 -364981 -329982 -116211 147158 144252 29727 -81913
24181 -81913 -139727 -115301 -185540 -300179 -70023 -45949 -126430 4767 49654 28547 287653
24170 287653 362386 287195 36023 -199130 -115799 -314593 -332097 199365 472361 94488
24160 94488 137419 -4378 -119847 -41177 79012 54273 90607 298118 383845 138727 49886
24149 49886 -184827 -300953 -178303 164110 295477 151492 71142 -59855 30770 81495
24139H1495J2000j01951o838L7794q0321N4759r0633j49339K20719J01630k47768
24128a68453j25633P0205L0432r7131j98348M8970Q5390J00411J87859q434m2565
24117a17297K09094n8874n7600J07343J79429N0370p3690r4020j8597j5802o6048
24106D4308l5049J05892J31861L9327P6919j7112J6532o0546J25730j5604r6479
24095C15779o7267J3826k4191j78768j27857J23092K79824k32k57928j2491j901
24084F1886r2988J4178m9865j73032k97514J26119L33319R0255k39741p9431r0972
24073c97786K2254n5755k0460n3421J3342J14978r8643N6977K02147R03j67936
24062c83400j38919J33799J54564l7003L3948J14707k00477m7055O7975M914N7141
$$ plain form
24139 81495 93495 -8456 -15294 22500 -57821 -3062 -93695 -243034 -22315 79315 -168453
24128 -168453 -294086 -223881 -193449 -290580 -488928 -439958 -354568 -254157 -66298 -74732 -117297
24117 -117297 91797 32923 -24677 82666 262095 312465 238775 144755 126158 110356 44308
24106 44308 9259 115151 247012 286339 363258 346146 362678 302132 427862 412258 315779
24095 315779 248512 262338 238147 59379 -68478 54614 334438 334206 76278 63787 61886
24084 61886 -31102 -16924 -66789 -239821 -537335 -411216 -77897 12358 -227383 -306814 -397786
24073 -397786 -375532 -431287 -451747 -505168 -491826 -376848 -475491 -418514 -216367 -215464 -383400
24062 -383400 -522319 -388520 -233956 -270959 -237011 -122304 -322781 -369836 -301861 -296947 -239806
24051b39806J44155N3368j143q3795M8898l2709j13603J64645L07405K20391j43281
24040C24525p8810K5833q3531n9289r5456r9831l90289q0169J97329L7281J05000
24029a97407O3136M1734K02778j13522l7071M1785J1689J57419L7593j73248k67701
24018b32815J4013J05278K3516O8414J86765K08109p769n5440k31563o0221r8886
24007h0599j6313l6183L918R1288K17491R199j53808j47109j57875k846R0285
23996a82552L9589o638K47624K44932j05400J8758L9947k63614j51838k18648
23986c37840K57029M06694j33420l35619O9460N9590J9528k2965o1191m5210j30911
23975b54855L7142O5573N0445j77708j05820P219N3621K05825K51189l668P0264
$$ plain form
24051 -239806 -95651 -42283 -43426 -127221 -78323 -111032 -224635 -59990 247415 467806 324525
24040 324525 245715 271548 188017 128728 33272 -66559 -456848 -537017 -339688 -302407 -197407
24029 -197407 -134271 -92537 110241 -3281 -40352 1433 13122 170541 208134 34886 -232815
24018 -232815 -218802 -113524 -90008 -21594 165171 373280 365511 310071 78508 18287 -80599
24007 -80599 -96912 -133095 -129177 -37889 179602 188801 34993 -112116 -269991 -272837 -182552
23996 -182552 -142963 -149601 98023 342955 237555 256313 296260 32646 -119192 -337840
23986 -337840 -80811 325883 192463 -143156 -73696 -14106 5422 -17543 -78734 -123944 -254855
23975 -254855 -217713 -152140 -101695 -279403 -385223 -378004 -324383 -118558 132631 128963 199227
23964A99227J62494n2842J802n8279j01321Q3966M5103q0884O9601J48475j97963
23953B19379l93417N3479K81587K01458K9430n5356R707o1316p3915L6671n1402
23942A96305j06274l33869o0545k6509o6051R9938J78727o194J5584K06331r1900
23931E543L0540O4838O7391J86155K06351k69558k67613R2679J58502k57708r763
23920G357P4431L02618P1539j49769j43109J4782j4916K7565P3380p0103j08237
23909H5538j46129m4443N8946p3355l02343m5659K04540R7843o4661J5923k26904
23898d40704M7974L50163J93242J20774P1072J98825j17070p5700J644m1805n3441
23887B54974j1241K3998J05542j02748j30501j33469J6097N0248j04376j28978
$$ plain form
23964 199227 361721 308879 310681 252402 151081 235047 280150 199266 268867 417342 219379
23953 219379 -174038 -120559 161028 362486 391916 336560 346267 284951 211036 247707 196305
23942 196305 90031 -243838 -304383 -330892 -396943 -297005 -118278 -124472 -108888 97443 5543
23931 5543 36083 100921 168312 354467 560818 291260 23647 116326 274828 17120 7357
23920 7357 81788 384406 455945 306176 163067 177849 162933 190498 263878 193775 85538
23909 85538 -60591 -105034 -46088 -119443 -421786 -467445 -262905 -165062 -229723 -213800 -440704
23898 -440704 -392730 -42567 150675 271449 342521 541346 424276 348576 350220 308415 254974
23887 254974 243733 267731 373273 270525 140024 6555 22652 72900 -31476 -160454
23877a60454K53481J28974J02971j94404l05949J18671J29078J71842k909j68808
23867G2493P6578m3221o3139k66800l5568K56810L4528j22505J54012K16485J53783
23856D33456j54682j97933J8749M0460o6454j76703K06432N8312j40894L1681
23846E2424o0759L5470j56346p4777J37704j71254j3056J46616n2436j42705J27500
23835a71619K59669j93302o6400L2708p7388J58011j80139r6901K647m8161R7977
23824b82898J81684J45162j29309k97067K16K74584K06396j24286K8252m0036
23814c7302j1539M3141P3184L6569j27705o8098o6210P7347J28260M1868k23250
23803a33735k42294J61209j0544o2558k5786j35490j3336J14180J56177k6294
$$ plain form
23877 -160454 93027 222001 324972 130568 -175381 -56710 72368 244210 241301 72493
23867 72493 149071 105850 42711 -224089 -259657 -2847 31681 -90824 63188 279673 433456
23856 433456 278774 80841 99590 140050 73596 -103107 103325 161637 20743 52424
23846 52424 -8335 27135 -129211 -203988 -66284 -237538 -250594 -103978 -156414 -299119 -171619
23835 -171619 88050 -105252 -171652 -138944 -216332 -58321 -238460 -335361 -332714 -380875 -282898
23824 -282898 -101214 43948 -85361 -382428 -382212 -107628 98768 -25518 2734 -37302
23814 -37302 -48841 -5700 67484 104053 -23652 -91750 -157960 -80613 47647 89515 -133735
23803 -133735 -376029 -214820 -225364 -287922 -313708 -449198 -462534 -348354 -192177 -218471
23793b18471R7908K32416o3260q6998j37930J7684r4670j5509O2623K06786K06427
23782B07006j87858j32554L1511j28259n6178P4739j5086K9579Q6655P5594q0837
23771i5688K7603J75191J56172J18336r9259K4454o0224j50225R1607j61254l18304
23760b91591j98667K6328L48010Q8329j91218O6656L58563Q783j7117l6497j73134
23749a1555J38882P5977P8295j58102j11718j63275j69130k1901K80081J87883
23739A25437j47854L1743J56648M6727J14158j52262j35215j50064J01114q1265
23729i0833J02678J07623J41398N7904p9127j85624l6464L9947J97302k63518
23719h714o2454L7210k1926k35719M6732K55384L5244J68886j78676k67234q831
$$ plain form
23793 -218471 -120563 111853 48593 -38405 -176335 -158651 -253321 -268830 -206207 579 207006
23782 207006 19148 -113406 -81895 -210154 -266332 -191593 -206679 -177100 -90445 -14851 -95688
23771 -95688 -68085 107106 263278 381614 282355 306809 246585 96360 187967 26713 -291591
23760 -291591 -490258 -463930 -115920 -27591 -218809 -152153 206410 215193 198076 161579 -11555
23749 -11555 127327 203304 281599 123497 11779 -151496 -320626 -342527 -62446 125437
23739 125437 -22417 9326 165974 212701 326859 174597 39382 -110682 -9568 -90833
23729 -90833 11845 119468 260866 318770 239643 54019 17555 57502 254804 -8714
23719 -8714 -71168 -33958 -55884 -291603 -244871 10513 45757 214643 35967 -231267 -240098
23708b40098p0330L9756K721r5114J9282k3733J91522k252j90712Q7763M06427
23697A25232Q6560j30395j55892J33224j64477L7255m2681N4277O5893M6559o943
23686D8612j46154K4969N8634R6215M9540K3362J046k10021Q258o6073J81066
23675F9454K06766J7058N4481k35088O0628k5757P8953k19137j11618m0892l1396
23664a76548J10267l0785Q3381J87411p425j66502r2050k44347j43348R3443J36440
23653b50063p6610K54604J30796j87491j88342j92463L8845R0698J26766R5540
23643a57720L49800J97656j26799k14423n7243m7813j79927K2717P2515J19572
23633b1665N5993l1913J74211k0828Q7059j52353k90865K20913Q3065j93640m0886
$$ plain form
23708 -240098 -310428 -270672 -267951 -363065 -343783 -367516 -175994 -178246 -368958 -281195 125232
23697 125232 211792 81397 -74495 58729 -105748 -68493 -111174 -56897 8996 55555 48612
23686 48612 -97542 -72573 -13939 82276 131816 155178 156224 -53797 -45539 -111612 69454
23675 69454 276220 293278 347759 112671 173299 147542 226495 7358 -104260 -145152 -176548
23664 -176548 -66281 -97066 -13685 173726 166301 -201 -92251 -336598 -479946 -386503 -250063
23653 -250063 -326673 -72069 58727 -128764 -317106 -509569 -470724 -380026 -253260 -157720
23643 -157720 192080 389736 262937 48514 -8729 -56542 -236469 -213752 -141237 -21665
23633 -21665 34328 2415 176626 155798 242857 90504 -200361 20552 103617 -90023 -130909
23622a30909p2196o8716P8762J91682J71050j86649k54051M7647p9118r4004K4714
23611c71788K17342J92748J42696J34956k84976r4196R288k01721n1135j44536
23601d51322L172L9877J2750J64395q667K79022O0818P0883j35776j09392o944
23590h1184M355Q3310K59559j09266J12392j63435k17716n1180J93555K74328
23580C04718J99739j77795j32287j30357q0508J72015Q2148j86997N2320o2953
23570D0043L6531k9078o8149j25571P0906J6224Q0684k34603o6638J43650l4953
23559a70954l1519k55819L4267J47175j33599k32055K01811K82348p4359j84756
23549d17460K7667J32468O5606J5905J01794L14772K41798P8279k34088k42707
$$ plain form
23622 -130909 -203105 -271821 -193059 -1377 169673 -16976 -271027 -223380 -302498 -396502 -371788
23611 -371788 -154446 38302 180998 315954 30978 -63218 -53930 -255651 -306786 -451322
23601 -451322 -448150 -408273 -395523 -231128 -239795 39227 100045 170928 35152 -74240 -81184
23590 -81184 -76829 6481 266040 156774 269166 105731 -111985 -163165 30390 304718
23580 304718 504457 326662 194375 64018 -16490 155525 237673 50676 102996 40043
23570 40043 76574 47496 -20653 -146224 -75318 -59094 21590 -213013 -279651 -136001 -170954
23559 -170954 -202473 -458292 -424025 -276850 -410449 -642504 -440693 -158345 -232704 -417460
23549 -417460 -389793 -257325 -191719 -175814 -74020 240752 482550 560829 326741 84034
23539H4034j0880n2802q7466o7919P9713K53486Q1365n110l929j30581J31167
23528B71078J2879j40430j79139j72528O5240n1862J18337Q2474j69938n5440
23518b19329j72313Q8901J91524L170n964l02954j93547K80247K70870J1762j68701
23507b16334j96360J61127J0709j20292J15168L3576J9951M0895m9209R7708J12494
23496I433k11667j02482R6870K26841N1217q6181J9292j4448j88890o4693j12737
23485c77445n3897J92573K32625K95831j33450j72502L1276Q1059J50270N51j45165
23474A01726l20680K0260j797Q6749J32917j19904j0782O2889K2693q3253j36756
23463b45938r7321L2244J24121j05034m7163L3051P3632K48957k5779J08112j22657
$$ plain form
23539 84034 73154 20352 -67114 -135033 -55320 198166 279531 274421 270492 139911 271078
23528 271078 283957 143527 -35612 -208140 -142900 -194762 -76425 6049 -163889 -219329
23518 -219329 -391642 -302741 -111217 -108047 -114011 -416965 -610512 -330265 -59395 -47633 -216334
23507 -216334 -412694 -251567 -240858 -361150 -245982 -212406 -192455 -151560 -200769 -103061 9433
23496 9433 -202234 -304716 -207846 18995 70212 -15969 3323 -11125 -200015 -264708 -377445
23485 -377445 -431342 -238769 -6144 289687 156237 -16265 15011 96070 246340 246891 101726
23474 101726 -218954 -198694 -200491 -113742 19175 -100729 -111511 -48622 -25929 -109182 -245938
23463 -245938 -343259 -311015 -186894 -291928 -339091 -306040 -232408 16549 -9230 98882 -23775
23452b3775N3609m6997k8918k02744j07273J80796J39317M7632j20657N6238n4773
23441a07545n0547l6733o733p8654K93955j6236j36864K27035K41372k01421j01881
23430B5748q3245P0573j057R993Q2957O9211K4606P2913j81748j95214j94119
23419b99382J74178L08207O097M0017J10578j82635J20626p0518k38640j91128
23409b22600K8709K14613L26042l7349j37738l5816j90371j48500K14968j74834
23399a62876L1991J18596J39051O0354M4820K39556R5808j39328m29952j53505
23389a55485j8369j75291N214J47982K19310m0526K7474J07433J09462j75197
23379E2007J09555Q8022n7165K7957r318J47403O635l47420j03005m1823N9616
$$ plain form
23452 -23775 29834 -17163 -46081 -248825 -356098 -175302 -35985 11647 -109010 -52772 -107545
23441 -107545 -158092 -194825 -201558 -280212 13743 -2493 -139357 87678 329050 127629 25748
23430 25748 -57497 13076 12019 22012 104969 174180 198786 271699 89951 -105263 -299382
23419 -299382 -125204 183003 189100 229117 339695 157060 277686 207168 -31472 -222600
23409 -222600 -193891 20722 346764 309415 171677 135861 -54510 -203010 11958 -162876
23399 -162876 -130885 -12289 126762 187116 231936 471492 567300 427972 -1980 -155485
23389 -155485 -173854 -349145 -343931 -195949 23361 -17165 10309 117742 227204 52007
23379 52007 161562 249584 192419 220376 211058 358461 365096 17676 -85329 -127152 -67536
23368f7536K34266r0352J49117N0623j51894j11869J25695J31841j69092J9204
23358A20003j15947k28484K5597J70376Q5319r1583j61283j70595j34835J32567
23348c68865K34204J93419l3074j34758J2335n0180r088J02401J07617P2692J10971
23337B37674J0963r6115q2264p1989p3766O4225k9213j34848j69519N2232J54549
23326a38071L3804J07520K4219J46285l6332j9399J6042m17855k65191O8870K77623
23315b02485K14668N3293P7126J31790j85197k30856P7995J67556m7587j13163
23305e6860k8292o6010l49706l9788K44738J80250R2573J22293n8239J2609j41495
23294h7927q1395j45288j42417j57102k1694J77442J82959Q5089K48922K23387
$$ plain form
23368 -67536 166730 76378 225495 276118 124224 12355 138050 269891 100799 120003
23358 120003 4056 -224428 -198831 -28455 56864 -34719 -196002 -366597 -501432 -368865
23348 -368865 -134661 58758 25684 -109074 -96739 -146919 -156007 -53606 54011 126703 237674
23337 237674 248637 152522 70258 -1731 -75497 -11272 -40485 -175333 -344852 -292620 -138071
23326 -138071 -104267 3253 27472 173757 137425 118026 134068 -283787 -548978 -480108 -202485
23315 -202485 12183 65476 142602 274392 89195 -141661 -63666 103890 56303 -56860
23305 -56860 -85152 -151162 -500868 -540656 -295918 -115668 -23095 99198 40959 53568 -87927
23294 -87927 -169322 -314610 -457027 -614129 -635823 -458381 -275422 -190333 58589 281976
23284B81976N2484j08542r7535k08287o2272P050K5242o6232L2730J87640P8322
23273A22576q8154N7713j75743j305J30954L52127j08967p1772J38365j06475
23263B49319j58244q960j03969K0161j70818j75301K19373J66211R7979Q3924
23253B19675l21862k34220J25975j29304M00792J09168J74229r013j50405o7831
23243A17204m3994n6804N6031J65065J45442J22426J03421P974p555k11423k44977
23232A52810p3986m2984J92428O7626l45918L1238m7749j72296J20510J58852
23222D0531j00825j65418o5631j27222L5535m1809q7873l2807K4950L0851J27571
23211c62147J37894L25944j04026q7563j47021J09301J26565M4245j27568l59565
$$ plain form
23284 281976 334460 225918 128383 -79904 -142176 -135126 -109884 -176116 -143386 44254 122576
23273 122576 34422 92135 -83608 -84913 46041 398168 289201 217429 355794 249319
23263 249319 91075 82115 -21854 -1693 -172511 -347812 -128439 37772 135751 219675
23253 219675 -102187 -336407 -210432 -339736 61056 170224 344453 335440 185035 117204
23243 117204 73210 16406 72437 237502 382944 505370 608791 616765 609210 397787 152810
23232 152810 78824 35840 228268 295894 -50024 -18786 -66535 -238831 -118321 40531
23222 40531 -60294 -225712 -291343 -418565 -383030 -424839 -512712 -545519 -520569 -489718 -362147
23211 -362147 -224253 101691 -2335 -89898 -236919 -127618 -1053 43192 -84376 -443941
23201d43941r9453P0140K94853J78668K13667k7011P6635j00160k25174l4626
23191i6402J12207M4939j0538o2624l8137j6670j6115K8941l6530O4574r9186
23180a25541J2145R5165q9814j64278J29985K51138L958j75527N0547l90011Q033
23169c94200L70135J99130m8775k38576Q4751J16722P1828j28864J20258m8327
23159A04082p6134Q7466j42110p0097q3569O8313j31370O983J50858J21800j44567
23148a08345m3375J11638j13332J40007K94984M7325j56452l10155m3025J52195
23138b8535j36254n807K11768l3298j83029L9237J33169M089j25875Q1240J96233
23127A52938j65797P1840J05926j12967J21810p5653O490r3105q9323k53230L4196
$$ plain form
23201 -443941 -543394 -473254 -178401 267 213934 186923 263558 163398 -61776 -96402
23191 -96402 15805 60744 50206 -12418 -50555 -67225 -83340 -54399 -90929 -26355 -125541
23180 -125541 -113396 -18231 -108045 -272323 -142338 108800 112758 -62769 -12222 -402233 -394200
23169 -394200 -24065 175065 126290 -112286 -27535 89187 161015 32151 152409 104082
23159 104082 27948 115414 -26696 -96793 -180362 -112049 -243419 -236436 -85578 36222 -108345
23148 -108345 -151720 -40082 -153414 -13407 281577 328902 172450 -137705 -180730 -28535
23138 -28535 -164789 -170596 41172 7874 -175155 -135918 -2749 1340 -124535 -43295 152938
23127 152938 -12859 58981 164907 51940 173750 98097 104587 11482 -77841 -331071 -296875
23116b96875o6930j60862J99985L20356J80044n5713l62427J9517J22850J60369
23106F0314K34461O8503n65k12576j03912j10730N437P263n9546J06140P3885
23095F8674J69145O3198m33423l2624Q3567N0241j29899J28251k234l04789j20230
23084d60123K21303L6347k54592K48690J34335M2660j57411k62601J30517j3956
23074c34831j76721K42490K64150J35485l3996j02244J34880J21153j19044J57194
23064B88516j1639q8855P1999K60117k88945j58543J19775p9904J3329j23355
23054B495n94j07372L597R0162o9294J20114j28955k23426J49003k5116J38816
23043e0570r764n0314k04645P5806j8585n0149M9039K61722l9516p7158K3713
$$ plain form
23116 -296875 -363805 -524667 -324682 -4326 175718 120005 -242422 -222905 -100055 60314
23106 60314 294775 363278 362713 150137 46225 -64505 -59068 -51805 -111351 -5211 68674
23095 68674 237819 301017 -132406 -165030 -81463 -31222 -161121 -32870 -35104 -339893 -460123
23084 -460123 -238820 -202473 -457065 -208375 -74040 -31380 -188791 -451392 -320875 -334831
23074 -334831 -511552 -269062 -4912 130573 96577 -5667 129213 250366 131322 288516
23064 288516 276877 188022 260021 520138 231193 72650 192425 112521 125850 2495
23054 2495 1901 -105471 -101874 -11712 -81006 39108 -89847 -313273 -164270 -189386 -50570
23043 -50570 -60334 -110648 -315293 -239487 -258072 -308221 -259182 2540 -36976 -114134 -90421
23032i0421m0446k0961k83167j24057K43271L89390J20719j11337j61301J48242
23022F9932J01949k16765r3061j73730J06399J55459K7598K48394j09234R468
23012A26409J46402j60992O6250k50164j91524j4298Q5509j56285l4480k4815
23002d07988Q8222J5407K24324L0619k13020J1216M417o4076j86130J94375K43239
22991e9395O2774j79584J14302R0310n0007J2762j67625L9197J03388J09359J98824
22980B74305j26257l46328o0119K11643J09624q0306k12351o3654j77579r425
22970d80447J37174J62694L4285j18879K038j1465M4815J79957J30632j05064
22960b4260n2452j50972o6824n2768K4228l109r970K05494j17985k18145M5061
$$ plain form
23032 -90421 -130867 -151828 -434995 -559052 -315781 73609 194328 82991 -78310 69932
23022 69932 171881 -44884 -137945 -311675 -205276 -49817 -22219 226175 116941 126409
23012 126409 272811 111819 178069 -72095 -263619 -277917 -192408 -348693 -383173 -407988
23002 -407988 -319766 -304359 -80035 -49416 -262436 -251220 -246803 -310879 -497009 -302634 -59395
22991 -59395 3379 -176205 -61903 28407 -21600 -8838 -176463 -137266 -33878 75481 274305
22980 274305 148048 -198280 -258399 -46756 62868 -17438 -229789 -293443 -471022 -480447
22970 -480447 -343273 -180579 -146294 -265173 -263135 -274600 -229785 -49828 80804 -24260
22960 -24260 -76712 -227684 -294508 -347276 -323048 -326157 -336127 -130633 -248618 -466763 -421702
22949d21702J31147K86284L58366l8182m35105J6542Q9057l3409M1075J24161
22939A18234j25618j75237j43123P0930J3529K33465J94344Q6368j97585M1585
22929A16892n2704j81378J49465P5784J27832K7841k95699j90214j5118M8500
22919a88799j25717J3961J07759N7550N987K0978j91577O6665J20163l4535k1730
22908a69295J85930J3628k53138j31458K74240J23489m2624j9386n1057L0442
22898c9229O7233k34393r5174o6956l1134P1388r3986k11033L0971K74257J24546
22887b03510J67267o4947Q7275J13260J5854l63246M1147L4079J14903K88150
22877B30232j0208j89378k5918o8989l7016O6279j50189J571J72773J49753r5262
$$ plain form
22949 -421702 -290555 -4271 354095 315913 -119192 -102650 -13593 -47002 -5927 118234
22939 118234 -7384 -182621 -325744 -254814 -241285 -7820 186524 272892 75307 116892
22929 116892 64188 -117190 32275 108059 235891 263732 -31967 -222181 -237299 -188799
22919 -188799 -314516 -300555 -192796 -135246 -129259 -108281 -299858 -233193 -113030 -147565 -169295
22908 -169295 16635 30263 -222875 -354333 -80093 43396 772 -18614 -69671 -39229
22898 -39229 28004 -206389 -301563 -368519 -399653 -328265 -422251 -633284 -602313 -328056 -203510
22887 -203510 -36243 -101190 -13915 99345 115199 -248047 -206900 -172821 -57918 230232
22877 230232 220024 30646 4728 -64261 -101277 -34998 -185187 -183616 -10843 138910 43648
22866D3648j02316n9279k32338L1771J38534J3223O226m6316o5123r0563p2249
22855d34782r0770P0263O8059K79642P0648m946j35319J97610K93807j04997j73238
22844C5977k50263o1967O5246j04835k28591k2008K93416J03871J135M4024j89074
22833c13069p8795q9435J04493O1317P6987L90548K30063m11785k82901K2531
22823b90046j12351j85368j33533K11046K35606K70681J015j68152n0876k4486
22813b46464J26404P5362j69688j56231m145K10004K44965j91513K246k30552
22803c39612O8753q0206L1941J65529o3267K48645M8534j27960q3489j1320J14818
22792b7634j1110k45184M1293N4969j43431J72063L90714N5454k02305l26277
$$ plain form
22866 43648 -58668 -117947 -350285 -318514 -179980 -166757 -160531 -206847 -271970 -362533 -434782
22855 -434782 -525552 -455289 -387230 -107588 -36940 -41886 -177205 20405 314212 209215 35977
22844 35977 -214286 -276253 -211007 -315842 -544433 -566441 -273025 -169154 -168019 -123995 -313069
22833 -313069 -391864 -481299 -376806 -315489 -238502 152046 382109 -29676 -312577 -290046
22823 -290046 -402397 -587765 -721298 -510252 -274646 -3965 -2950 -171102 -221978 -246464
22813 -246464 -120060 -44698 -214386 -370617 -374762 -164758 80207 -111306 -109060 -339612
22803 -339612 -270859 -351065 -319124 -153595 -216862 31783 80317 -47643 -131132 -142452 -27634
22792 -27634 -38744 -283928 -242635 -187666 -331097 -159034 231680 287134 84829 -241448
22782b41448L4615L37101J45190q9832j14099R0302k89024k35732j09424K36682
22772b35669J97564K12680p4548k69707j36308K29172Q4792k17615R9656k8097
22762a38080p2474q692M0120o9854l50887n5553J65601J84544J33061L3921J38217
22751g6L9947q7209L370O4934n8461R5053J74044O6271J14586m3920k44803j14806
22739H930k8688K3915j57374l31506j54418L81468K64523k45427k35481J76469
22729b97589p547J8790K08457j96432j07152K72775J42154J56831o7684K0055
22719A42658j81969n2790K2275q847j25945J05556Q6793j44822n8522k59944P2223
22708d03334J0833M520o5295J27669J85177j3610n6020j08233O4310K60681P5013
$$ plain form
22782 -241448 -206833 130268 275458 185626 71527 161829 -127195 -362927 -472351 -235669
22772 -235669 -38105 174575 100027 -169680 -305988 -76816 7976 -209639 -109983 -138080
22762 -138080 -210554 -219246 -179126 -248980 -599867 -655420 -489819 -305275 -172214 -138293 -76
22751 -76 39871 -47338 -43968 20966 -37495 57558 231602 297873 412459 368539 123736 8930
22739 8930 -19758 4157 -153217 -484723 -639141 -257673 6850 -238577 -474058 -297589
22729 -297589 -305136 -286346 -77889 -274321 -381473 -108698 33456 190287 122603 142658
22719 142658 -39311 -92101 -69826 -78673 -204618 -99062 -12269 -157091 -215613 -475557 -403334
22708 -403334 -392501 -387981 -453276 -325607 -140430 -154040 -210060 -318293 -253983 6698 81711
22697H1711l27805j76977j28276J07698K79925K03185j54177J07792o5058j19304
22687a91286j23407k2685K73902K20646J20781j40965n9224J63486K7267j10136
22677A58379r1183j1997Q4615l8613l941J06074M7883j23736m04934p8900j1767
22666c68120K3643J52939K08308K31968j41733j26527J57625N4571p5981J95464
22656C12157L8711j00992j09576n9396k7270R1849N8417m2188J09817L3052l7249
22645B67332k3733m2842j33689O988R9865p4581k49848r0450J75048N6877K7127
22634A8094n7228j78735k96805K21449j37632j31019K63476k37250j1113L22789
22624b23974N8209j39297J63243K35198j12527j7247k7474J56092M2708l69388
$$ plain form
22697 81711 -246094 -423071 -551347 -443649 -163724 39461 -114716 -6924 -71982 -191286
22687 -191286 -314693 -337378 -63476 157170 277951 136986 77762 241248 268515 158379
22677 158379 67196 55199 139814 101201 97260 203334 251217 127481 -277453 -356353 -368120
22666 -368120 -344477 -191538 16770 248738 107005 -19522 138103 192674 116693 312157
22656 312157 350868 249876 140300 80904 53634 145483 203900 161712 271529 304581 267332
22645 267332 243599 200757 67068 74056 173921 99340 -150508 -240958 -65910 -9033 18094
22634 18094 -39134 -217869 -514674 -293225 -430857 -561876 -298400 -535650 -546763 -223974
22624 -223974 -165765 -305062 -141819 93379 -19148 -36395 -63869 92223 134931 -234457
22614b34457j10940J32806K42179K09711j52208l6517k7171j47956N103M32211
22604C12761J6633j76474p8136j03726J15762J52675m7381o3708k04932j82665
22594b59191r647l4053j153k5089o3430n1475j01995K00093L1177J70865J04652
22583c9246l18517r4356L00978J17126m8316j68759j95721Q3411L90409J09523
22573A36532l0375j27012l68952j65033L61723J32324m8486j24566p7696j74888
22563d86429J81980j6797R0255Q5799R405j28370r2596r3883n3753J65774J22492
22552b16123R3583j25444r5109K56735J64119O6073k28271l35220M3216J66864
22542b09577j11724k0160M5969J44646l7450j74530L39784n1323q7442o3264J20672
$$ plain form
22614 -234457 -345397 -212591 29588 239299 87091 50574 23403 -124553 -119450 312761
22604 312761 329394 152920 74784 -28942 86820 239495 192114 128406 -76526 -259191
22594 -259191 -268838 -302891 -304044 -329133 -392563 -444038 -546033 -345940 -314763 -143898 -39246
22583 -39246 -357763 -452119 -151141 -34015 -82331 -251090 -446811 -363400 27009 136532
22573 136532 106157 -20855 -389807 -554840 -193117 -60793 -109279 -233845 -311541 -486429
22563 -486429 -304449 -321246 -230991 -145192 -135787 -264157 -356753 -450636 -504389 -338615 -216123
22552 -216123 -122540 -247984 -343093 -86358 77761 143834 -84437 -419657 -376441 -209577
22542 -209577 -321301 -341461 -295492 -150846 -188296 -362826 -23042 -74365 -161807 -225071 -104399
22531a04399J48154j93459k09264J80748J23011J59648Q3039K58828J09529j78961
22521C76874j99673k64274L2830J22590k15971r8196K25982J92006k6175j13816
22511C2177j18607j69325N3293M1547P1815M1096J20102J9249M2496j39807Q096
22500B132K15965J08898j44699j83652l03478j78683Q8544J77543J39558R4521
22490A6649j01874j73796p6553K9013K37543J7911r9838J9592o702n8949r8195
22479b95199o5303J39595J33174J73277m3092j03288k7923O8367j99894j31050
22469c51336R3047N08621K4208L3592j4465k19954L4482k17114m5112J66616O2028
22458G4613J62501K23804J86053k49973k86190K39135P144k66338l5844J53364
$$ plain form
22531 -104399 43755 -149704 -358968 -178220 -55209 104439 187478 446306 555835 376874
22521 376874 177201 -87073 -54243 68347 -147624 -245820 -19838 172168 145993 32177
22511 32177 -86430 -255755 -202462 -160915 -89100 -48004 72098 91347 133843 -5964 2132
22500 2132 218097 326995 182296 -1356 -304834 -483517 -394973 -217430 -77872 16649
22490 16649 -85225 -259021 -335574 -306561 -69018 -51107 -150945 -131353 -138055 -197004 -295199
22479 -295199 -360502 -220907 -87733 85544 42452 -60836 -88759 -20392 -220286 -351336
22469 -351336 -258289 250332 274540 308132 293667 73713 108195 -108919 -154031 12585 74613
22458 74613 237114 460918 646971 396998 110808 349943 357087 90749 54905 208269
22448B08269j86922J4194J55636r4896j33304k66642o4718J62367J83422o7953
22438i0547j49674J28636J51056J13208Q6137l6023o0802K62704j223N573p8685
22427C30360m70085O2963m3450P7780J65310N4068P7281R7838J04457k07050k05374
22416D4098k04048K7536O5832M9108P4002R7480n6488m6126P0992o053o4829J43589
22404A95093O0949l37384j74059j05285J69852n4100r6186Q4226j01002N3909
22394c03987J53871L59582l5344j34588J68018l6918K30442j19011l33980j08257
22384a60172k0167N7281n6320J30289K05497n6450n8970O9017j41719m2640j55065
22373b29419M0199J03177N129j25359J00911o6994K08556j06672Q5741j43295
$$ plain form
22448 208269 21347 35541 191177 96281 -37023 -303665 -368383 -206016 -22594 -90547
22438 -90547 -240221 -111585 39471 152679 238816 202793 141991 404695 403472 409045 330360
22427 330360 -139725 -76762 -120212 -42432 122878 176946 254227 352065 456522 249472 44098
22416 44098 -159950 -132414 -66582 -17474 56528 154008 97520 51394 122386 116333 51504 195093
22404 195093 256042 -81342 -255401 -360686 -190834 -244934 -341120 -256894 -357896 -303987
22394 -303987 -150116 209466 174122 39534 207552 170634 401076 282065 -51915 -160172
22384 -160172 -180339 -123058 -179378 -49089 156408 99958 40988 110005 -31714 -74354 -229419
22373 -229419 -189220 -86043 -80914 -206273 -105362 -172356 36200 -70472 15269 -128026
22363a28026r6348L03783k01604n3459m2908J38606O4750J8576l5072r109K71445
22352B30634J52756j47106k20065q7274m6364J66866J11528m8541J01473j34894
22342G9013J04528J62623l9667o1308p6859J24798k5555n2135j15287l18183P2841
22331a45191Q2197K64522P6996j37058j23277l853O4395p3812q6423k06168R3405
22320a94267J76944J51572m3239k01819j39692K1542k7592o6153J20650J18046
22310h4008J23979j02944j08036j75307j63065M7361J83396K18496J26511m1220
22300B5163J06962K2643J9495J6757j65808M0403n5946m1596n4819N2084J8682
22289a5980m1989q8429p3384j52519L40198L54062o6402k05941l4879O4121j09935
$$ plain form
22363 -128026 -224374 79409 -122195 -175654 -218562 -79956 -15206 3370 -31702 -40811 230634
22352 230634 383390 236284 16219 -71055 -117419 49447 160975 112434 213907 79013
22342 79013 183541 346164 306497 245189 168330 293128 267573 215438 100151 -218032 -145191
22331 -145191 -62994 201528 278524 141466 18189 14336 78731 4919 -81504 -287672 -194267
22320 -194267 -17323 134249 91010 -110809 -250501 -228959 -256551 -322704 -202054 -84008
22310 -84008 39971 -62973 -171009 -346316 -509381 -462020 -278624 -60128 66383 25163
22300 25163 132125 154768 174263 191020 25212 65615 9669 -31927 -86746 -34662 -15980
22289 -15980 -57969 -146398 -219782 -372301 -32103 321959 255557 49616 14737 78858 -31077
22278c1077j4055Q0166K9758O6419q3648j55564k0435J93021J51665l2918j39628
22267D3704j49994l4810O0931J47745J19724O57p7659p9270r5824j28333k35927
22256d29056l6851J52387J51368o8919j95194J33287O0161K52478L25141j28961
22246B15841r5448j27977q947P3780m080p380r2244j65610J99656J48555k4094
22235A12052N538l4489j64653k57665L31826J72670j48192p3147P6435K5802R8066
22224A44243r6136k03628o7337K47283M1867j20663J12188J22025l9601j14578
22214B5663j11107o1627k3270K02275J7353j36095N391o9849q2552o5019L816
22203b95021R7093q0117k51363l2394J29986J25481J8538j35565K64J06951J02373
$$ plain form
22278 -31077 -45132 35034 64792 131211 47563 -108001 -128436 64585 216250 183332 43704
22267 43704 -106290 -141100 -80169 67576 187300 187957 110298 31028 -64796 -193129 -429056
22256 -429056 -465907 -313520 -162152 -231071 -426265 -292978 -232817 19661 344802 215841
22246 215841 120393 -7584 -16531 57249 53169 45789 -46455 -212065 -12409 136146 112052
22235 112052 117590 83101 -81552 -339217 -7391 165279 17087 -56060 20375 46177 144243
22224 144243 48107 -155521 -222858 24425 66292 -54371 57817 179842 140241 25663
22214 25663 -85444 -147071 -170341 31934 49287 -86808 -81417 -151266 -233818 -298837 -295021
22203 -295021 -197928 -278045 -529408 -561802 -431816 -306335 -287797 -423362 -423098 -316147 -213774
22192b13774L80123R4855N6413M7004j68256k71045j20459J72304k9717r1113
22182a43665J76816J00957J3870O8381j12223k67048j61145J16152k54004K25107
22172b36802J85493K07428J92906n9654p6727j75667J43386k5637k68316L8735
22162g4855n704k2127K67433l6509Q5762L7594N627L7908j58051m13271o406J54370
22150a28229J61573j0825n2334j4219j61834n5052j46734j0024J83297J57169
22140g7212K7441l3939j661p6436o4579j2014J70656K61427j98317k59164k0606
22129b84404Q3247P8613J01293J97255N0672q5321l7300R5283n9808o0525l3093
22118D5912n6629N0954j48109r5801n8459o0546J11003J1724R7129J78866m0305
$$ plain form
22192 -213774 166349 261204 317617 364621 196365 -74680 -195139 -22835 -52552 -143665
22182 -143665 33151 134108 147978 216359 104136 -162912 -324057 -207905 -461909 -236802
22172 -236802 -51309 156119 349025 289371 212644 36977 180363 154726 -113590 -74855
22162 -74855 -80559 -102686 164747 128238 214000 251594 257221 295129 137078 -276193 -282599 -128229
22150 -128229 33344 22519 -29815 -44034 -205868 -260920 -407654 -417678 -234381 -77212
22140 -77212 -49771 -83710 -85371 -161807 -226386 -238400 -67744 193683 -4634 -263798 -284404
22129 -284404 -201157 -122544 -21251 176004 226676 141355 104055 199338 139530 79005 45912
22118 45912 -10717 40237 -107872 -203673 -262132 -322678 -211675 -199951 -102822 76044 35739
22107C5739J59401k0638j23288j57006L6555J3525J0348k00141j95605P815J67082
22096b66213K90936N6554J80671r2252l816L53925p0815k19661j83591j73421
22086a27683K3266l5379N6457N1714P144j01344J72829K00689N0940Q6237k79160
22075A05710j07450j08761j87240o3588p8323K662J18920l4530L67911J77513
22065A92824j4905k09602m1209L633q6932o0228J65948q40q5816K14418J1589
22054H8880j0213K2613j10449q3705R5751l8093J21013n6031K47212N0174j7329
22043C09823l33816k0105K8720O1039J21978P4878p7858n2101q734K9269J3989
22032A47082J65759p8027r3552k1211m4444J91663J37987j73343j62524j64542
$$ plain form
22107 35739 195140 174502 51214 -105792 -69237 -55712 -45364 -245505 -441110 -433295 -266213
22096 -266213 24723 81277 261948 169696 165880 519805 448990 229329 45738 -127683
22086 -127683 -104417 -139796 -83339 -31625 -24481 -125825 47004 247693 298633 384870 105710
22075 105710 -1740 -110501 -297741 -361329 -439652 -436990 -318070 -352600 15311 192824
22065 192824 177919 -31683 -72892 -69259 -156191 -216419 -50471 -51311 -137127 77291 88880
22054 88880 78667 101280 -9169 -92874 2877 -35216 85797 29766 276978 327152 309823
22043 309823 -23993 -44098 -15378 45661 167639 242517 164659 112558 103824 133093 147082
22032 147082 312841 234814 141262 120051 75607 267270 405257 231914 69390 -95152
22022i5152j3047m0007O9188J04910k84158K38147J84113J1498O7407l0479o3471
22011A48949k0394j43292o8911L5669J87016j16437j70950P2017r8494M2771J80141
22000D8085J02866j05793l370L0945J51986j29006k61568J85408O1205J81049
21990B61807N315j04358j20287K6750J83467K4618j96266o9441J33799o9330J16596
21979A92670j838j63336L2057J37666m2169q9440l76556k791J08833L297N911
21968a95696m7036r9468j66635J47994K52177M0729k63697J54219K72422m4036
21958E0973k59926Q396k98036j3442L50325J36881m3633K3904k06162N3442K74452
21947G7174K5320j45314R0679n6953r6548J05378J66772p7087j66280L2835m4389
$$ plain form
22022 -95152 -108199 -148206 -79018 25892 -258266 -20119 163994 175492 242899 212420 148949
22011 148949 128555 -14737 -83648 -47979 139037 22600 -148350 -76333 -174827 -132056 48085
22000 48085 150951 45158 41788 72733 224719 95713 -165855 19553 80758 261807
21990 261807 267122 162764 42477 69227 252694 277312 81046 11605 145404 76074 192670
21979 192670 190832 27496 59553 197219 155050 65610 -310946 -313737 -204904 -201607 -195696
21968 -195696 -242732 -342200 -508835 -360841 -108664 -67935 -331632 -177413 95009 50973
21958 50973 -208953 -200557 -498593 -512035 -161710 -24829 -68462 -44558 -250720 -197278 77174
21947 77174 102494 -42820 47859 -9094 -105642 -264 166508 89421 -76859 -44024 -88413
21936h8413k41207J1237K04744R1340J87847L2823j44833k51957n65K2245q8590
21925b65329P879L55572L6312j99169k16810l1666J50199N0190j77894j09760
21915d00476J97525Q6564J13408K6592p2262k00488K8467J20441j03751M2604
21905a61376K87744j35641j20387P5216J63642r7201j14190j8533k00518n1830
21895c73074L43388K69175J20161j01314j53249l02915k78545n7217j73162K5391
21885f81361R9434J14161M69084J95943j80804P9706J34186o1251j06638j39782
21875g7322j93174K16202l0558n9947M6007k20887K73169j5091l01582j67180
21865e30363K1734K81780J51590k4070N9593Q3871P8255j29019k08541J13172
$$ plain form
21936 -88413 -329620 -318383 -113639 -22299 165548 198371 53538 -198419 -198984 -176739 -265329
21925 -265329 -257450 98122 134434 -64735 -281545 -313211 -163012 -112822 -290716 -400476
21915 -400476 -202951 -116387 -2979 23613 -48649 -249137 -220670 -100229 -203980 -161376
21905 -161376 126368 -9273 -129660 -54444 109198 11997 -102193 -120726 -321244 -373074
21895 -373074 -29686 239489 359650 258336 105087 -197828 -476373 -533590 -706752 -681361
21885 -681361 -581927 -467766 1318 197261 16457 96163 230349 169098 62460 -77322
21875 -77322 -270496 -54294 -84852 -144799 -98792 -319679 -46510 -61601 -363183 -530363
21865 -530363 -508629 -226849 -75259 -99329 -39736 44135 122390 -6629 -215170 -101998
21855a01998k28460q2442O5200L19757J18787k69290m0497q2892J31258r1550
21845b62127J61239k6386J91274K15782j79409j74610M2389M4667j69739Q0526
21835g6394L8518J28851J53152p9142k77108k90274K9868J25392K2864j38787
21825c63060K61840Q8527l05424J41168O884J4926k7132k06257r4287J80178K37031
21814f5606P4554J5130M8221m2501K9938q3656p3446j86075J16005L5202J11489
21803b0745j17163j28805k6819L6948J0419l0873o2629M5662j18884J82384M9814
21792a80691J07353K11421J17257J92899o2632l93817k88496K28105P9329J24073
21782A34801J010j04461J2563R565M9173m413J45386K18801k3124j55744q5465
$$ plain form
21855 -101998 -330458 -412900 -347700 -27943 90844 -178446 -218943 -301835 -170577 -262127
21845 -262127 -100888 -127274 64000 279782 100373 -74237 -31848 12819 -156920 -76394
21835 -76394 -37876 90975 244127 164985 -112123 -402397 -372529 -247137 -224273 -363060
21825 -363060 -101220 -12693 -318117 -176949 -170065 -155139 -182271 -388528 -482815 -302637 -65606
21814 -65606 8948 24078 72299 29798 59736 -23920 -97366 -283441 -167436 -132234 -20745
21803 -20745 -137908 -266713 -293532 -256584 -246165 -277038 -339667 -294005 -412889 -230505 -180691
21792 -180691 -73338 138083 255340 448239 385607 -8210 -296706 -68601 10728 134801
21782 134801 135811 31350 43913 53478 102651 98238 243624 462425 439301 283557 198092
21771A98092l5644k09764j90877o0063j56650J37809J84148P0849j42274j04124
21761c08498J17098j2065M27414M1601j74065L493k9493j64869k1837Q0783l16314
21750c56752j44968J9117J78180K21079L18102J97762j2216J0432j67133j9778
21740B43825K38438q4166r6091k50807r7168K1288J48467q1589l30473r5426q9031
21729d72733J44196n380m4604k9292K7016Q1789k0795q5112J87130K00649M7396
21718C0260K3950j29790Q601P2367k556k11968J34555J32849l25079Q9198R1621
21707h5992L91198N2653o1233J09918r1779r9469o7639L5087J08597r890r8419
21696A83032j41795Q0508N6335m6664k19436p8204j1650q4435j42073J37301J66636
$$ plain form
21771 198092 162448 -47316 -238193 -298256 -454906 -317097 -132949 -62100 -204374 -308498
21761 -308498 -191400 -203465 223949 265550 91485 94978 65485 -99384 -121221 -40438 -356752
21750 -356752 -501720 -482603 -304423 -83344 234758 432520 420304 430736 263603 243825
21740 243825 482263 398097 302006 51199 -45969 -24681 123786 42197 -288276 -383702 -472733
21729 -472733 -328537 -333917 -378521 -407813 -380797 -299008 -319803 -404915 -217785 -17136 30260
21718 30260 54210 -75580 -66979 5388 2832 -209136 -74581 58268 -266811 -177613 -85992
21707 -85992 305206 357859 296626 406544 314765 215296 147657 182744 291341 281451 183032
21696 183032 41237 121745 178080 131416 -88020 -166224 -177874 -262309 -404382 -267081 -100445
21685a00445K24274K51965J74202j03738j99822j57460l9714j03458J5057k8644
21675f7783r8807J27146J78864m6802j17407R4873j39291k16765q5591k9167j0882
21664d11612r161O0983O6714K05811j78177q2880K80208O1522O7766L1100j55917
21653f3643q9651j56550j38275J84203M12034J2796q1373J49249j91597j17783
21643h0590J53776m7880n3901K63823k06063l18835L7539K96144P7194M1294j11445
21632E1056Q7548r5116j3416L1775n5370Q7394O4236k00189j87698L5942J14608
21621g9230j61695O0883J57560J22995j3671l4867j43641J55491J0092M162P5245
21610A53324R6632q2555J44008l5003l3671N6888k18638l85904j00652J54748
$$ plain form
21685 -100445 123829 375794 549996 446258 246436 88976 49262 -54196 -39139 -67783
21675 -67783 -166590 -39444 139420 92618 -24789 70084 -69207 -285972 -371563 -400730 -411612
21664 -411612 -420773 -359790 -293076 -87265 -265442 -348322 -68114 -6592 61174 92274 -63643
21653 -63643 -153294 -309844 -448119 -263916 148118 160914 79541 228790 37193 -80590
21643 -80590 73186 25306 -28595 235228 29165 -289670 -252131 44013 121207 162501 51056
21632 51056 138604 43488 30072 61847 6477 93871 158107 -42082 -229780 -193838 -79230
21621 -79230 -240925 -180042 -22482 100513 86842 51975 -91666 63825 73917 78079 153324
21610 153324 249956 167401 311409 276406 242735 299623 80985 -304919 -405571 -250823
21600b50823J24569J69016J61092Q541j56451r07O9696P1452R382k0495J1459
21589A96531p8384m1503K39410P7206n2294k4668j98944R2330q5263j16317j43829
21578a35725k75331K14632K20435M3786O9973j59345j35848N3841J9981J78531
21568I4930J43892j36104P1572k59428j49027J11924N2265j36131q5412J24647
21558a66872J60317o2836P914K01777j61247j07838J23724j1046l24867m1254
21548c82228N4181j05128R5196J59301L03899J03940n7587n9369L8421N5252J50380
21537C56258Q1906l19528j81242Q4191n5990J81099l963J2987n5192j40493N1673
21526A1706J93879m1899j33713j76727k72534M15327L12890K68546k38239n34077
$$ plain form
21600 -250823 -126254 42762 203854 212395 55944 55037 124733 196185 205567 185072 196531
21589 196531 118147 76644 316054 393260 340966 316298 117354 209684 124421 8104 -135725
21578 -135725 -411056 -196424 24011 67797 137770 -21575 -157423 -103582 -83601 94930
21568 94930 238822 102718 174290 -85138 -234165 -122241 -69976 -206107 -291519 -166872
21558 -166872 -6555 -69391 -61477 140300 -20947 -128785 -5061 -16107 -340974 -382228
21548 -382228 -328047 -433175 -337979 -178678 125221 229161 171574 112205 150626 205878 356258
21537 356258 438164 118636 -62606 21585 -34405 146694 142731 155718 100526 -39967 11706
21526 11706 205585 163686 29973 -146754 -419288 -3961 308929 577475 339236 -194841
21516a94841j52613M5751K77379q2903q0879R6596N7729J28134j20213j78370
21506b04230j53935q7430o2782P8154J01231J49814J14040l0820j19818j08397
21496c24173Q2271J72087j80355N1876L54480K0713j72161l9215N2334Q7894M748
21485A10499J47245L4730K483k17377k20172o1879J04019J36289j26381P2934
21475a7610J86816J4500M1311k99547k82921k464K34885j4094L0045K17737N2185
21464A60843O1806j74692r2556k12367j27041R9767J87158O055P5433K3170m4670
21453c7094Q4865r6110k28465J40928J20070L5993k06449j56636R5115J05654
21443a42129q6197r6680K92690J33469j10790k74532J69456j32076R051L021J60004
$$ plain form
21516 -194841 -347454 -301703 -24324 -107227 -188106 -91510 -33781 94353 -25860 -204230
21506 -204230 -358165 -445595 -508377 -430223 -328992 -179178 -65138 -95958 -215776 -324173
21496 -324173 -241902 -69815 -250170 -198294 156186 176899 4738 -34477 17857 105751 110499
21485 110499 257744 292474 294957 77580 -142592 -204471 -100452 35837 -90544 -17610
21475 -17610 169206 183706 225017 -74530 -357451 -359915 -125030 -139124 -109079 108658 160843
21464 160843 222649 47957 -44599 -256966 -384007 -284240 -97082 -91027 -15594 7576 -37094
21453 -37094 47771 -48339 -276804 -135876 -15806 20187 -186262 -342898 -247783 -142129
21443 -142129 -228326 -325006 -32316 101153 -9637 -284169 -114713 -246789 -237738 -234717 -74713
21432g4713r2218k10219K72079K54928k46250L7160K83794j53767l26205j63431
21422d18842l16581N7989M23861P7762K50516j47626r4818J17628j37030j9302
21412b06443L90184Q4008p4202k16681j39431j28350j38O7777M0546K2514O3917
21401i6299K07290J62011L9230n8157k88415l38405j48356J71622K93959J97688
21391A42168j78082j37635J35755P1334P7406l0366j07547j57747j28934j45608
21381d59256J99277K25997P2893P1917L6852q2274J24262K3884q6638j04717p1940
21370d9743l2999M3726j05694j55344L2379J42306k6132L6794K5991q5087J9206
21359a54597j64030J11135K16173j63043k67059j13305J83061K9841J82403j30090
$$ plain form
21432 -74713 -166931 -377150 -105071 149857 -96393 -59233 224561 70794 -255411 -418842
21422 -418842 -735423 -677434 -253573 -175811 74705 -72921 -167739 -50111 -187141 -206443
21412 -206443 183741 267749 193547 -23134 -162565 -290915 -291053 -223276 -182730 -160216 -96299
21401 -96299 110991 273002 312232 254075 -34340 -372745 -521101 -349479 -55520 142168
21391 142168 -35914 -173549 -37794 33540 110946 80580 -26967 -184714 -313648 -459256
21381 -459256 -259979 -33982 38911 110828 147680 65406 189668 213552 126914 22197 -49743
21370 -49743 -82742 -39016 -144710 -300054 -267675 -125369 -151501 -114707 -88716 -173803 -154597
21359 -154597 -318627 -207492 8681 -154362 -421421 -534726 -351665 -321824 -139421 -269511
21349b69511k33639j52596R9673J95694j8213j35623L5700L31489K38243K14533
21339C05750o4856j51370j49211l7817k82881k0755P9871R647j86335K60079L03033
21328F5155p3118k4938j86053m0589p8354K46784J69816J62741p9341l64726k28367
21317d30990j7696K61096J09516k975J24809k79591q2824K14334L26485K2463
21307B44627J13101n2714m00128l8474J19636J78570j02075o9675N2457K23892
21297B69217P3383p6868k09970n6196J92873L2568k4731o3974k95416k46412L87872
21286a7654J49976K1304j15549k06208O1867Q3681l9015R5187R2032j65131j85977
21275b25487n4719j93823j30538k2399K12104L90000R2660j32780k88774j9421
$$ plain form
21349 -269511 -503150 -655746 -556073 -360379 -378592 -514215 -478515 -147026 91217 305750
21339 305750 240894 89524 -59687 -97504 -380385 -401140 -321269 -311622 -497957 -237878 65155
21328 65155 -7963 -32901 -218954 -259543 -337897 -91113 78703 241444 162103 -202623 -430990
21317 -430990 -448686 -187590 -78074 -81049 43760 -235831 -318655 -104321 222164 244627
21307 244627 357728 305014 -95114 -133588 -13952 164618 62543 -7132 45325 269217
21297 269217 342600 265732 55762 -434 192439 225007 200276 136302 -159114 -405526 -17654
21286 -17654 132322 153626 38077 -168131 -106264 -22583 -61598 33589 125621 -39510 -225487
21275 -225487 -280206 -474029 -604567 -626966 -414862 -24862 67798 -64982 -353756 -373177
21265c73177L04302Q0346l21527K6623J71002m5417J97055L5351J02659p0449
21255A06768J47740M5370j45337j03315k09559r7454J36735O0056k61587l61479
21245f82062j17487J70903J01673J6905J13375K5143o3616o0929K84665J78362
21235c3068j27460K55424O9888l08653j12353J03286M8237P8399J1937N4348n6446
21224a6461j36672p0618o0313K58486J62500j14398l4514Q9655j335l1108J21044
21213A66266K54660j73649O0792q1165k45690N4340L8612l9057J33533K85853
21203D54495q1720q0271j32055J14897O3846j11023n3590M0951k08194j36896
21193a29560m5834K14345R3731J16052J058k64196p221l25072l27717j35030J46530
$$ plain form
21265 -373177 -68875 11471 -310056 -283433 -112431 -157848 39207 74558 177217 106768
21255 106768 254508 299878 154541 51226 -158333 -255787 -119052 -58996 -320583 -682062
21245 -682062 -799549 -628646 -526973 -510068 -396693 -371550 -435166 -496095 -211430 -33068
21235 -33068 -160528 94896 164784 -143869 -256222 -152936 -104699 -26300 -14363 39985 -16461
21224 -16461 -153133 -223751 -284064 -25578 136922 22524 -11990 77665 76330 45222 166266
21213 166266 420926 247277 308069 226904 -18786 35554 74166 35109 168642 454495
21203 454495 372775 292504 160449 275346 339192 228169 174579 215530 7336 -129560
21193 -129560 -175394 38951 132682 248734 249792 -14404 -21625 -346697 -674414 -809444 -662914
21182f62914L81207J19543K30696J07799k178j50769N6326n078Q790M1727k37704
21171a12555k4057J04017J7176L3473N2002R1906J1360j95547j03012J3499j90247
21160c01985M3286K30711J16171R845j77519k96427M737K14051K0074k50866q186
21149c96108J73885J16445J23642K3333j89118N8308M4447K0476k1746k74458
21139c20894k85296J55446L42398j52554k43082k74252l9152K59243J11368j17022
21129e63797J0480L31271J28783j13193Q1007k22171j96473k4237K96691K72511
21119H72l1567P5411p916p6773J27459L12223k2651k14646N9683R6313n8702k08580
21107E1126j13880M5325q0795j700N252k6601K07659l5418o4839r7964r2688l4605
$$ plain form
21182 -662914 -281707 -162164 68532 176331 174153 23384 79710 74632 83422 125149 -112555
21171 -112555 -136612 -32595 -15419 18054 70056 161962 173322 -22225 -125237 -111738 -301985
21160 -301985 -258699 -27988 88183 98028 -79491 -375918 -371181 -157130 -137056 -387922 -396108
21149 -396108 -222223 -105778 17864 41197 -147921 -89613 -45166 -24690 -46436 -320894
21139 -320894 -606190 -450744 -108346 -260900 -503982 -778234 -817386 -558143 -446775 -563797
21129 -563797 -553317 -222046 -93263 -206456 -125449 -347620 -544093 -568330 -271639 872
21119 872 -30695 44716 36800 -39973 87486 399709 377058 162412 222095 318408 259706 51126
21107 51126 -62754 -17429 -98224 -99924 -94672 -121273 86386 50968 -13871 -111835 -204523 -239128
21095b39128j33884J39351L9701J39719L2383J62797j30518j7768J33866k0080
21085A06439j69307j65415J29701o1203j66429r3091J68623K7753j5777j21467
21075c60173K5045K18154R4418L1368j0165P0679j11764k9318K9675P0168j43487
21064a15400M2560K22742j25188J35193P1089K8082k02815p7194K9013j4493q8894
21053i5305R5421K39451j1664J28064P3605q7273l66613k87701P298q4869J50934
21042b38652J79915J63622Q1522r8272k78526j01595k427K74857K14904p3046
21032A22302J25125J92294k35522j63995o953j29531k38574K4779K77738P216
21022b5121n9190J01614J55607K02794j90844k39826k02912M0151J47208L63024
$$ plain form
21095 -239128 -373012 -233661 -193960 -54241 -21858 140939 10421 -7347 126519 106439
21085 106439 -62868 -228283 -98582 -159785 -326214 -419305 -250682 -222929 -238706 -360173
21075 -360173 -335128 -116974 -22556 8812 -1353 69326 -42438 -71756 -42081 28087 -115400
21064 -115400 -72840 149902 24714 159907 230996 259078 56263 -20931 8082 -6411 -95305
21053 -95305 116 239567 227903 355967 429572 342299 -24314 -312015 -304717 -389586 -238652
21042 -238652 -58737 104885 186407 88135 -190391 -291986 -294413 -19556 195348 122302
21032 122302 247427 439721 204199 40204 33251 -96280 -334854 -310075 -32337 -25121
21022 -25121 -84311 17303 172910 375704 184860 -54966 -257878 -217727 -70519 292505
21012B92505j27931q3550J41550n6740k19341n4987J68154j33703l33665O6164
21002c41544J37212P6226n1485p2723K10877J97812j81059l49218Q9238P7961
20992b06703P5192J85486K12409r5825j61791k226k08855K38794K46436r8368
20982A84549P7001n5939K7498m6641K0495k04546k03003j88615J00620l1431J41883
20971a78129L429o9672j08334P6472O0223k4667L8404K57966J56818j74370j09013
20960g0873j23796n4887J69018J9100j47855L5830p6185q3716L89341J48124J85599
20949C89700J4676j52742j78641l8084o1004j54723r0141L7675j9986J78819J83774
20938A09323j03883R3082L5281r6181J7709Q9480j88694n4088n12J82332J81712
$$ plain form
21012 292505 164574 81024 222574 165834 -53507 -108494 59660 -74043 -407708 -341544
21002 -341544 -204332 -128106 -179591 -252314 -41437 156375 -24684 -373902 -284664 -206703
20992 -206703 -131511 53975 266384 170559 8768 6542 -202313 36481 282917 184549
20982 184549 261550 205611 233109 186468 206963 2417 -200586 -389201 -288581 -320012 -178129
20971 -178129 -174700 -244372 -352706 -276234 -216011 -240678 -202274 55692 212510 38140 -70873
20960 -70873 -194669 -249556 -80538 -61438 -209293 -173463 -249648 -333364 55977 204101 389700
20949 389700 404376 251634 72993 34909 -26095 -180818 -270959 -233284 -253270 -74451 109323
20938 109323 5440 98522 133803 37622 55331 144811 -43883 -97971 -98483 83849 265561
20927B65561j25756j5186P0226J00161j04356m5688q3983j89029j46423P2757
20917b01716K71520J3025j28817j54510N4151L35406k1261j44823j29297L18133
20907B11811J19724k79301k82041m2176K27411R7698Q2304j3491O6864L9878k6345
20896B02336L6798j09800q6990k3737k68635j74221J46901J41536K59198j42440
20886a9054J04826J83081j71749k32865N3001l0377K48359K57661k3851L9406
20876D08438Q6088k10399j41606j46541k7306N6199j23368j89738K61155J65918
20866A38840P0131O768j23810j36455j33859r3642J11723J59593J0636j20997
20856a11072J56372N7617j85894j17077O2251J85316K49033L22304J27221n8471
$$ plain form
20927 265561 139805 124619 194845 295006 190650 144962 60979 -128050 -274473 -201716
20917 -201716 69804 82829 -45988 -200498 -146347 189059 167798 22975 -106322 211811
20907 211811 331535 52234 -229807 -271983 -44572 53126 135430 121939 188803 228681 202336
20896 202336 239134 129334 42344 18607 -250028 -424249 -277348 -135812 123386 -19054
20886 -19054 85772 268853 97104 -135761 -82760 -113137 135222 392883 369032 408438
20876 408438 494526 284127 142521 -4020 -31326 24873 -98495 -288233 -27078 138840
20866 138840 208971 215739 91929 -44526 -178385 -272027 -160304 -711 9925 -111072
20856 -111072 45300 102917 -82977 -200054 -137803 47513 296546 618850 746071 687600
20846F87600j56767k23439j79282k6116k60835m7698J14452M17817K27802j93039
20836C60495j69645j79395p8260K58445J91032j74521r9603J7780Q3265o6368
20826A43225J21980K42025k01028j23503k04756k03066l2531L12408n7857k1847
20816b4950O5881k68401N4831K6021J47639L76952p303k11754j21021j81368o4022
20805b07495p5258J36078L72444J41890k29804l57825n6196j23818j16429J62953
20795c53460j11948L26909J89434o2760Q1747k28781J876j10236p3200J53210
20785a87209M5030q8433j01720J7052M1896k02546M8232J01629L78489o8733q6368
20774a02681K45895J49291J18344q7035q3353j31138k58073R556l8326O2689n2492
$$ plain form
20846 687600 530833 307394 128112 101996 -158839 -206537 -92085 325732 553534 360495
20836 360495 190850 11455 -66805 191640 382672 208151 108548 126328 209593 143225
20826 143225 265205 507230 306202 182699 -22057 -225123 -257654 54754 -3103 -24950
20816 -24950 40931 -227470 -172639 -146618 1021 377973 370670 158916 37895 -143473 -207495
20805 -207495 -282753 -146675 225769 367659 137855 -219970 -276166 -399984 -516413 -353460
20795 -353460 -465408 -138499 50935 -11825 69922 -158859 -156983 -267219 -340419 -187209
20785 -187209 -142179 -230612 -332332 -315280 -273384 -475930 -427698 -326069 52420 -16313 -102681
20774 -102681 143214 292505 410849 323814 240461 109323 -148750 -139194 -177520 -114831 -167323
20763a67323j06533q8039J51767l1912k77611j10608K63646J08076J13117K2201
20753a23219j30118R4001J6747k27575k1870J74177L97331j2569l9981j20746
20743F178j00631n8374P7817o1881j19849K63832J51305j21296o871l5587P2407
20732F7050K9489j07148R8578J73400J8205j46877k30482j13417j18573l1263
20722c61038K41918J57502P7178k8362j12406n8841L1059p1963J31091k97179
20712b91041j05927J68805J54594n0996J37411K18601J89751j22960j01418J47773
20702C44593k07971q4408J10911j18898j66881J42020j02211n9991K36859k0591
20692G3432j16599j34685K15422J93378j19790R620k9731k21513j65138n8502
$$ plain form
20763 -167323 -273856 -361895 -210128 -242040 -519651 -630259 -366613 -258537 -145420 -123219
20753 -123219 -253337 -159336 -142589 -370164 -392034 -217857 179474 166905 126924 6178
20743 6178 -94453 -152827 -75010 -136891 -256740 7092 158397 37101 30230 -5357 67050
20732 67050 96539 -10609 87969 261369 279574 132697 -97785 -211202 -329775 -361038
20722 -361038 -119120 38382 115560 87198 -25208 -84049 -52990 -124953 6138 -291041
20712 -291041 -396968 -228163 -73569 -124565 12846 231447 421198 298238 196820 344593
20702 344593 136622 52214 163125 44227 -122654 19366 -82845 -142836 94023 73432
20692 73432 -43167 -177852 37570 230948 111158 120778 91047 -130466 -295604 -354106
20682c54106M36672M4264j66876J51652P5681l14253j24710l2229K38466J27900
20672H2461j9394J07509J44378R0082n8998k61763j18273L5727n1325j35425J00570
20661h4451J04374L23767l4835j54053j15944P9175p0538l12040l5461J1369j15590
20650d04227J65763J12984n081j15439J45377J4646m0606J17246m1759J16104
20640F5008j37330k25000J47884K74461o4308k81510m4928K10881L6210Q0853
20630F2221M1977j93868o9112n7990K8069j6697j4542p2921J02361K03579J12771
20619A25848j6529j35907m9338o1575j33967O2197J55669o4062J10186p9557K04811
20608A17776P9567o1469q8067q4109K01910J44440j19547J7491k38k23853m8389
$$ plain form
20682 -354106 82566 126830 -40046 111606 187287 -126966 -251676 -283905 -45439 82461
20672 82461 63067 170576 314954 405036 346038 84275 -33998 1729 -49596 -185021 -84451
20661 -84451 19923 343690 308855 154802 38858 118033 47495 -264545 -300006 -288637 -404227
20650 -404227 -238464 -125480 -130561 -246000 -100623 -85977 -126583 -9337 -51096 65008
20640 65008 -72322 -297322 -149438 125023 60715 -220795 -265723 -54842 -18632 62221
20630 62221 104198 -89670 -158782 -216772 -188703 -205400 -219942 -292863 -190502 13077 125848
20619 125848 109319 -26588 -75926 -137501 -271468 -209271 -53602 -117664 -7478 -87035 117776
20608 117776 197343 135874 47807 -36302 165608 310048 190501 207992 207754 -16099 -64488
20597f4488R171k6918Q4578m4737J28834J46526j23496o5252J297l5672o0401
20586e0558j37506Q5524o6459J29560L03693o1659j86251r4153q6162R7482O5775
20575g14J5087k8180j42801k637J4920j9113j06122K3747J45637j06590Q656J09377
20563h8733J57774R3323m3380r4131l5574l8575L4000j10791j09329p1970k1051
20552c28437p5561J73671r8359j70899K12190M57651O1041j24616j86731P88K26679
20541A47417K36780J0996j68649m6306J18854J8108k96838l3303K6264K76531
20531B89854p1990j42826K45480P1604j93859J36405r0803N1875r562r1509J2582
20520B07251o5612N3892p1218k79891k03917j7439J58093j72816q8248J66089
$$ plain form
20597 -64488 -55317 -82235 2343 -42394 86440 232966 109470 44218 45515 9843 -50558
20586 -50558 -188064 -102540 -168999 -39439 264254 202595 16344 -77809 -163971 -66489 -714
20575 -714 14373 -13807 -156608 -159245 -144325 -163438 -269560 -245813 -100176 -206766 -198110 -88733
20563 -88733 69041 162364 118984 24853 -10721 -49296 -15296 -126087 -235416 -307386 -328437
20552 -328437 -403998 -230327 -328686 -499585 -287395 170256 231297 106681 -80050 -79262 147417
20541 147417 384197 395193 226544 180238 299092 317200 20362 -12941 13323 289854
20531 289854 217864 75038 320518 392122 198263 334668 243865 295740 286178 194669 207251
20520 207251 141639 195531 124313 -155578 -359495 -376934 -218841 -391657 -479905 -313816
20510c13816K02111L6159j13279N3448J62506J8942O7933j63967k808r5957K7336
20499a21392P4025O634R7716j83932O3704J9229K10048J05929J6512k13001l35898
20488b60426N9583K82777P9620j59562p4662J6952j36679J11444j07148o9537
20478b57638m3228R2382J69127K00330q1851k0662r5793j06948L1151J4971J18393
20467B0234q93o6166O498n7154J2631o109L73356l8214k32116j03494m1943q9649
20455b23019r4967J75551R7653p2668L31514k778j21951j80763j17365k43578
20445d52371K07376L70613K25839p5723l23273k72226K66944R6580j04902l7245
20435i8388j88418J81207N6601l9247R1931J24875l19655J0142L02432P2816k13110
$$ plain form
20510 -313816 -111705 -75546 -188825 -135377 27129 46071 114004 -49963 -52771 -148728 -121392
20499 -121392 -47367 -40733 56983 -126949 -63245 -44016 166032 271961 288473 75472 -260426
20488 -260426 -200843 81934 161554 1992 -72670 -55718 -192397 -80953 -188101 -257638
20478 -257638 -300866 -208484 -39357 160973 79122 58460 -37333 -144281 -113130 -98159 20234
20467 20234 19341 -46825 -40327 -97481 -84850 -90959 282397 244183 12067 -91427 -133370 -223019
20455 -223019 -317986 -142435 -44782 -117450 214064 211286 89335 -91428 -208793 -452371
20445 -452371 -244995 125618 351457 275734 -47539 -319765 -52821 43759 -61143 -98388
20435 -98388 -286806 -105599 -48998 -88245 3686 128561 -191094 -180952 121480 194296 -18814
20424a8814N1057o2112m6081Q004K1150o4567P371R077K41893O1766j34755k67721
20412a93732l363P0627j18658K29818M576p2418p3206J7703J9723J55390J54034
20401A90494J40057J4295K42135N6086L8778J6478k72673j66112j08282j49810
20391A446j9960K4574j21903j03731o4846J77878K25518K5511l8465K8834j73745
20380c8889j57946O7402J88978K29252j62295o5887m5047O9107p2800j48862K23373
20369H6386J76952K7601J23329J62078k07275q0220L7583m4521q9198M8667Q7451
20358C28833p8350m1638N730k41245L866q7345K39335j3160j378K45493K03140
20347E63281R8290m2191J0713j23841l87415P882J24786R5915J5524m6734M7762
$$ plain form
20424 -18814 32243 -29869 -75950 -67946 -46796 -111363 -103992 -94915 146978 208744 73989 -193732
20412 -193732 -197095 -126468 -245126 -15308 -10732 -83150 -156356 -138653 -118930 36460 190494
20401 190494 330551 344846 586981 643067 681845 698323 425650 259538 151256 1446
20391 1446 -18514 6060 -115843 -219574 -284420 -106542 118976 144487 106022 134856 -38889
20380 -38889 -196835 -129433 59545 288797 126502 60615 15568 84675 11875 -136987 86386
20369 86386 263338 290939 414268 576346 369071 288851 326434 281913 192715 241382 328833
20358 328833 250483 208845 214575 -26670 -22804 -110149 129186 116026 114648 360141 563281
20347 563281 661571 619380 630093 506252 118837 126719 251505 347420 362944 316210 363972
20336C63972O4346k00877L0545o8405j57120J32532K08359O6626k62974j79955
20326b951L3642N9004N6137J13952J46584K7861j46358j8058J11552j44989M2615
20315B78991o008J95724L7407k63851k29922K12326J30573l37907R4125K30796
20305C42254L8203q0055n5129Q6598L5851n4567M7332J7006l8296q2953j67422
20294H8822k87832K45409K55145k68509k81884j73116K21811N1430L3290Q3980
20284c1454J14615j04080p8422O8668L1657P6270P0123j63773l4833K78345J58715
20273C85831j81050J29425J648J25610J53994k89809j10844J00745K2078J61677
20263D99305j04245k8959k7825n8077J04755j73394j32118J25745j06209M8714
$$ plain form
20336 363972 428318 227441 257986 189581 32461 164993 373352 439978 177004 -2951
20326 -2951 30691 89695 145832 259784 406368 434229 287871 269813 381365 236376 278991
20315 278991 272983 468707 506114 242263 12341 224667 355240 17333 111458 342254
20305 342254 380457 300402 245273 331871 367722 313155 360487 377493 339197 256244 88822
20294 88822 -199010 46399 301544 33035 -248849 -421965 -200154 -148724 -115434 -31454
20284 -31454 83161 -20919 -99341 -30673 984 77254 147377 -16396 -51229 227116 385831
20273 385831 204781 334206 335854 461464 615458 325649 214805 315550 337628 499305
20263 499305 395060 366101 338276 280199 384954 211560 79442 205187 98978 147692
20253A47692J11675P1700n2930J09268O1581l3697k71829q7435J64123l4799R3229
20242B78578L73682J81156j06612m19638j47282N5366k4573L8613J20562L3756
20232C83608q9520k17287k16808L6627j38726j70949J34853K55220o5692M369
20222h4305K59754N160J5691M1049k59919P0661j38821j18455J73708o958j45874
20211a88309L5638M1289j7335l2879r4463m0271K46368J28386R9412j32660k09208
20200a64032K47254J1290j76831N4786j3955K7816Q9006J0656n9544k20642K81641
20189H7445Q6400j46046o2007l5028K9893K41668J69985O4233J3423r5792p0971
20178B83203J18014Q3715O299J35235j46491j47719K49845K62402J04102n7961
$$ plain form
20253 147692 259367 331067 278137 387405 448986 415289 143460 56025 220148 185349 278578
20242 278578 652260 833416 726804 307166 159884 215250 190677 229290 349852 383608
20232 383608 294088 76801 -140007 -103380 -242106 -413055 -278202 -22982 -88674 -84305
20222 -84305 175449 180609 196300 237349 -22570 48091 -90730 -209185 -35477 -42435 -188309
20211 -188309 -152671 -111382 -128717 -161596 -256059 -296330 -49962 78424 177836 45176 -164032
20200 -164032 83222 94512 -82319 -27533 -41488 -13672 75334 85990 26446 -194196 87445
20189 87445 173845 27799 -34208 -69236 -39343 202325 372310 436543 449966 354174 283203
20178 283203 401217 484932 491231 626466 479975 332256 582101 844503 948605 890644
20168H90644k4129J47867N04763P8612k30256P1648L51025K85332o6936j08860
20158A899710o4551J79598J31700O1797k31204j42134j70595r3269O1127K00761
20148A832940k8283j89740o8523M5415K07547j7679P46j16039j66415m08699l41302
20137G49968p2064r9084j44387j09846j12705j4862k17450m7867K9938J43527
20127A05168O2910J00688J6906L569l14491k48458L1299J36986J83821L48240
20117D26638q36k41027L2725P5774J20843m6876q4338M8096j37382K12407J36090
20106E42114q6920k82900J02060Q9933J08696j35314l2316J16072j11050k26850
20096H3525j92451J20886Q2121j23087J14729P5703j14412L1652K60290N6443
$$ plain form
20168 890644 866515 1014382 1519145 1597757 1367501 1439149 1790174 2075506 2008570 1899710
20158 1899710 1835159 2014757 2146457 2208254 1977050 1834916 1664321 1571052 1632179 1832940
20148 1832940 1804657 1614917 1546394 1591809 1799356 1781677 1782423 1666384 1499969 1091270 749968
20137 749968 677904 578820 434433 324587 211882 197020 -20430 -68297 -38359 105168
20127 105168 168078 268766 285672 289241 -25250 -273708 -242409 -105423 78398 426638
20117 426638 425802 184775 217500 293274 414117 367241 282903 330999 193617 406024 542114
20106 542114 455194 172294 274354 364287 472983 337669 305353 421425 310375 83525
20096 83525 -108926 11960 94081 -29006 85723 161426 47014 78666 338956 395399
20086C95399K8630k3823j49600K5690J07290J0993P8743q5566p0907k3368J45155
20075D38636j1585P2913N7993J80201j14595l869k41256j96453k35825J55309
20065A01469Q3132J13457K67332n6853k53700k53084J5743M3808j14663j06909
20055a60268K87293J01865O1725j15210M0198Q3317k27859j46033L6073M1343
20045B444J43153K29391j33589k97611o1886J84863K80082J15214l88543K1646
20035I5164M10378O6950r2029k96872R073M69947J22608j45268j77241J05122
20025E67832O7688j28968j31867k5836J13287M2891n0309p4343p3958m5650p5250
20014A85517j63374J85511K44111o9569j81161j56740N6960K2391J93120J86853
$$ plain form
20086 395399 424029 400206 250606 276296 383586 394579 473322 387756 316849 293481 438636
20075 438636 427051 499964 557957 738158 623563 619694 378438 181985 -53840 101469
20065 101469 184601 298058 565390 508537 254837 1753 17496 61304 -53359 -160268
20055 -160268 127025 228890 290615 175405 215603 298920 71061 -74972 -38899 2444
20045 2444 145597 374988 241399 -56212 -118098 66765 346847 462061 73518 95164
20035 95164 505542 572492 480463 183591 192664 662611 785219 639951 462710 567832
20025 567832 635520 506552 374685 348849 462136 505027 454718 380375 306417 260767 185517
20014 185517 22143 207654 451765 382196 201035 44295 101255 123646 316766 503619
20004E03619j82842K8871k3214j51614l9556M818J04574Q6953J04416L7651r2552
19993C81124m4640M28J32262j47957o0247n824n2443O7966p1770k04963k06254
19982b12318K2589J82720J55059l4015J50096M7365J78745N8158o7758P5109o3894
19971D91856j53542l37003K03798K02300q8005k24966L6439J40093J59437j63099
19961B67308J27038J13781j79788k5722j68630Q9158N9416j05616M4389N5695
19951B77029R1183l1027k46466O6249K62855Q0115O2798o5267J77370r7584k53913
19940C23342j0141n6326n9842j62031j83326L10240R0491j73963k61864p8657
19930b62077K08803K11261K16279J88269J59094n083p6406l6094j13085k1635
$$ plain form
20004 503619 320777 349648 326434 174820 135264 140082 244656 331609 436025 473676 381124
19993 381124 336484 336912 469174 321217 260970 255146 202703 270669 198899 -6064 -212318
19982 -212318 -189729 -7009 148050 114035 264131 311496 490241 548399 480641 555750 491856
19971 491856 338314 1311 205109 407409 319404 94438 130877 270970 430407 267308
19961 267308 394346 508127 328339 302617 133987 223145 282561 176945 221334 277029
19951 277029 368212 337185 90719 156968 419823 499938 562736 497469 674839 577255 323342
19940 323342 313201 256875 197033 35002 -148324 161916 252407 78444 -183420 -262077
19930 -262077 -53274 157987 374266 562535 721629 716546 640140 604046 490961 469326
19920D69326l5142J90625m7481k02674k54388J18537J19435J3117l718J2364p1154
19909C08847m0770J66948L0675n1666o2732m8059N26507r619j61001m8902K8517
19898F38745j30561M0703J79826Q5654r1j12478J3774q1386j29609M592j8204
19887D90965J00528N8207k63561k68263J62488K13414j23374j71453j14731j9444
19877F4776K18081K74255J95391J84164j68510j76971k59922Q8856K87500L16991
19867A024611K57315l6414l0421K89023J32745q638J07643o6689k3193L08462
19857A954444M6954j78450M7762j5368j38394j6611j41797l09854K65959L34653
19847A849298j27179J60192Q9964l72814j05035k1563q3017L1272p306Q4197n8959
$$ plain form
19920 469326 434184 624809 577328 374654 120266 238803 358238 371355 367637 380001 308847
19909 308847 268077 435025 465700 414034 351302 303243 829750 820131 659130 610228 638745
19898 638745 508184 548887 728713 814367 814276 701798 715572 634186 504577 509169 490965
19887 490965 591493 649700 386139 117876 280364 493778 370404 198951 84220 64776
19877 64776 282857 557112 752503 936667 768157 591186 331264 420120 707620 1024611
19867 1024611 1281926 1245512 1215091 1504114 1636859 1628221 1735864 1669175 1645982 1954444
19857 1954444 2001398 1822948 1870710 1855342 1716948 1700337 1558540 1248686 1514645 1849298
19847 1849298 1722119 1882311 1972275 1599461 1494426 1472863 1389846 1421118 1413812 1498009 1439050
19836A439050j84060j35368J15649n0296k60597o8237k6109j54373j67304Q3986
19826E92341M571o4683p9586j88993L49648L30935p6483n6751K07966J50679J12316
19815A281960p5774j41499n9227L02166J08025M5163k05998j1665l6984l60804
19805H45363j02542j12007k7927j5976K17691J54711J58374J19637M6507J47251
19795A431082N4243m6367K06246J60873K83511K36044K7232K1960J85916J16320
19785B677060J3394K62242L48849L096L8565K55508L00965K82211J3920J96904
19775D392714J96943J4710K5819j28951J16177m8815j86625L0772j36201j33580
19765D142963O8079l7937l30369j89074R8399m20676q2125n7775j30750k11318
$$ plain form
19836 1439050 1254990 1119622 1235271 1184975 924378 856141 830032 675659 508355 592341
19826 592341 596912 532229 452643 263650 613298 944233 867750 810999 1018965 1169644 1281960
19815 1281960 1206186 1064687 1005460 1307626 1415651 1460814 1254816 1243151 1206167 845363
19805 845363 742821 630814 602887 586911 804602 959313 1117687 1237324 1283831 1431082
19795 1431082 1485325 1438958 1645204 1806077 2089588 2325632 2352864 2374824 2560740 2677060
19785 2677060 2690454 2952696 3301545 3304641 3343206 3598714 3899679 4181890 4195810 4392714
19775 4392714 4589657 4604367 4630186 4501235 4617412 4568597 4381972 4412744 4276543 4142963
19765 4142963 4211042 4173105 3842736 3653662 3752061 3331385 3249260 3191485 3060735 2849417
19755B849417j46859k430j2061k64609m05369k1633K20042j3431j61244K9672
19745B071495n0793J22038R8091J16333R60J6190o4730j11249Q1020j27881J39267
19734B290741M302l9689M7277l4004J35666K66005k12437k07709J80351K26444
19724B656947J04499J45796K06853j01335L0925J53387Q1602Q0175j17949m6724
19714C194176k19170n8474K30767K87556R439K7834J87034J03138j29516l46609
19704C286175n7273J43674L947J11040R209N8353j04648M23580N17582Q8121J19180
19693D598940O8476J96972N15525J64326K65162M11286L25987N0151K22650P43543
19683G563018R61968J017969P51448O45542O44383J019104J194649J615895J877068
$$ plain form
19755 2849417 2702558 2700128 2688067 2423458 2018089 1996456 2216498 2203067 2041823 2071495
19745 2071495 2020702 2142740 2240831 2357164 2358124 2374314 2309584 2198335 2279355 2151474 2290741
19734 2290741 2295043 2255354 2302631 2268627 2404293 2670298 2457861 2250152 2430503 2656947
19724 2656947 2761446 2907242 3114095 3012760 3043685 3197072 3278674 3358849 3240900 3194176
19714 3194176 2975006 2916532 3147299 3434855 3444294 3472128 3659162 3762300 3632784 3286175
19704 3286175 3228902 3372576 3376523 3487563 3496772 3555125 3450477 3874057 4391639 4479760 4598940
19693 4598940 4667416 4864388 5379913 5544239 5809401 6220687 6546674 6596825 6819475 7563018
19683 7563018 8524986 9542955 10294403 10939945 11584328 12603432 13798081 15413976 17291044
19674A7291044K128378K389405K930957M042168N023379O996481J0709859J5317378
19666F6829049K0793239K4529682K5740813K7950770K9601940K4826549J4073063
19659B34345105M795675K554314M059770N358073R682573J9924275L1521584L9117063
19651C51358432M0725698L5186759J9750693r04960j7474584k7702359l2488825
19644C68450854l1976940k5632906j5660272o566192K401292Q964032O176297
19637C06156165o128000k0932087k6341636k6493426k9356850l1716132k7443618
19630A37744416j9927369j3851763j0143906p397489n898365m725693m205524
19623G1594307m001472l755270l146407k872267k715487k619533k423447k146904
$$ plain form
19674 17291044 19419422 21808827 24739784 28781952 33805331 40801812 51511671 66829049
19666 66829049 87622288 112151970 137892783 165843553 195445493 220272042 234345105
19659 234345105 239140780 241695094 245754864 251112937 260795510 280719785 312241369 351358432
19651 351358432 392084130 427270889 447021582 446116622 428642038 400939679 368450854
19644 368450854 336473914 310841008 295180736 288614544 291015836 299979868 306156165
19637 306156165 300028165 279096078 252754442 226261016 196904166 165188034 137744416
19630 137744416 117817047 103965284 93821378 86423889 80525524 75799831 71594307
19623 71594307 67592835 63837565 60691158 57818891 55103404 52483871 50060424 47913520
19615D7913520k109621j740375j666324j410060j308966j317735j356950j300615
19607C5702874j085455j046456r75694r62199q46288m96035p03938p54609n85396
19598B8246804n03874k76805O2390q9791r88L0372J76714M23053m6385j91875
19588B7829615m94430n76077j25935j51580j4485K61052M95569P38228P38639
19579B8700596N60382K25314o17256j102256j084895j302254j225618r57879r05133
19570B2291001m84895j76185j71703r3250m74382q93283r36621j008230j175821
19561A6876631j203559j196415o28355m64166k09612n81892l61479j84479m82035
19552A1564639k70182j17418j46271p9581k34417m03005p2451n0821N5498J41151
$$ plain form
19615 47913520 45803899 44063524 42397200 40987140 39678174 38360439 37003489 35702874
19607 35702874 34617419 33570963 32595269 31633070 30786782 30290747 29586809 28832200 28246804
19598 28246804 27742930 27466125 27528515 27438724 27437736 27468108 27644822 28067875 28021490 27829615
19588 27829615 27335185 26759108 26633173 26481593 26467108 26728160 27223729 27961957 28700596
19579 28700596 29260978 29486292 28869036 27766780 26681885 25379631 24154013 23196134 22291001
19570 22291001 21806106 21629921 21458218 21364968 20890586 19997303 19060682 18052452 16876631
19561 16876631 15673072 14476657 13848302 13384136 13174524 12592632 12231153 12046674 11564639
19552 11564639 11294457 11177039 11030768 10951187 10716770 10313765 10241314 10190493 10245991 10387142
19542A0387142K1742r926k35817j333J55556K00976K97785R6939J15570K04618
19532A1233252K28239R8722k1810k44860k12926J30072n6827p6017M1696J17224
19522A1236765k5991O3614p5558m71964m49447l09810m55793l28025l3607N786
19512I155970m16544j39753j40284m92401k68897m06084l61543k39296l46938
19503F344230l26238l79995l50262n8626k8274j52676k23866P3662n3519l91126
19493D453310q2689J40232K02295L2844k78743k5204j47746m2598j28249m4510
19483D078942L524j89725k7783P2288o5031l66656k7162Q1456j04434j33141k88221
19472C034057q0103l5904j02456j11286K3036L16275J35782k04904J40278J7912
$$ plain form
19542 10387142 10408884 10398958 10163141 10161808 10317364 10518340 10816125 10913064 11028634 11233252
19532 11233252 11461491 11560213 11538403 11293543 11080617 11210689 11153862 11077845 11119541 11236765
19522 11236765 11210774 11274388 11198830 10726866 10277419 9967609 9511816 9183791 9150184 9155970
19512 9155970 8739426 8599673 8459389 7966988 7698091 7292007 6930464 6691168 6344230
19503 6344230 6017992 5637997 5287735 5229109 5200835 5048159 4824293 4897955 4844436 4453310
19493 4453310 4370621 4510853 4713148 4745992 4467249 4442045 4294299 4251701 4123452 4078942
19483 4078942 4082466 3892741 3864958 3937246 3872215 3505559 3478397 3559853 3455419 3322278 3034057
19472 3034057 2953954 2918050 2815594 2704308 2727344 3043619 3179401 2974497 3114775 3132687
19462C132687p4663k82762N9526J5107O2104m0500K8191j32995j20129K09023
19452B855589k74685l59818q4789J72269L6193j90599k33150K4100n6384k38175
19442A650551J7088r394K07263J80932J65075N2267o0834j44152J72344J67650
19432B398790J129J95268J38958k26411j65164Q3112j3153j45787k16208k39890
19422A810644J10680K21827J8298L1003j0676k4456M9595J26132M8080L71572
19412B752699M27298N3430M1425K59965K02230L87259L64539J8554k08690P7474
19402D376183K17717L37382M97615M09817n6884j66879l26946j13589K04578L09482
19392E688476L84627K70961J10620R0115O3325k36017l48697l98937q3482K72586
$$ plain form
19462 3132687 3058024 2775262 2834788 2849895 2911999 2871499 2899690 2766695 2646566 2855589
19452 2855589 2580904 2221086 2136297 2308566 2344759 2154160 1921010 1945110 1888726 1650551
19442 1650551 1667639 1658245 1865508 2046440 2211515 2263782 2202948 2058796 2231140 2398790
19432 2398790 2399919 2595187 2734145 2507734 2342570 2425682 2412529 2266742 2050534 1810644
19422 1810644 1921324 2143151 2161449 2192452 2181776 2157320 2206915 2333047 2381127 2752699
19412 2752699 3179997 3233427 3274852 3534817 3737047 4124306 4488845 4507399 4298709 4376183
19402 4376183 4593900 4931282 5428897 5838714 5781830 5614951 5288005 5174416 5378994 5688476
19392 5688476 6073103 6344064 6454684 6544799 6608124 6372107 6023410 5624473 5540991 5813577
19382E813577L15624K04129k6124k98171l88364m66463j61546K71476J55760k05424
19372E214474j61167o2198k875k87564m31873j57742K10783K79585n5505Q7006
19362D632924q9028L1346K35522j4972J44914k7986N120j79087J15956K08714
19352E063423J85795L030M8947O6342J75766L0622M2946L00859Q4348p2814K78494
19341F207758L47048J25532j59735j09151k65453l98403m4794K0856k893J42997
19331E863762j49975q4235j51365J11847N305j1126R6442K97506N175k62598k98150
19320E422588j11452Q6251K45150L39578M39271J08179L64725M95811K59896J79620
19310G829617M45023M99644K48709O8767L98085N24122M14613O33955J002137
$$ plain form
19382 5813577 6129201 6333330 6307206 6009035 5620671 5154208 4992662 5264138 5419898 5214474
19372 5214474 5053307 4991109 4988234 4700670 4268797 4111055 4321838 4601423 4545918 4632924
19362 4632924 4543896 4575242 4810764 4795792 4940706 4912720 4917840 4738753 4854709 5063423
19352 5063423 5249218 5252248 5301195 5367537 5543303 5573925 5616871 5917730 6002078 5929264 6207758
19341 6207758 6554806 6680338 6520603 6411452 6145999 5747596 5702802 5723658 5720765 5863762
19331 5863762 5713787 5629552 5478187 5590034 5595339 5584213 5680655 5978161 5983336 5720738 5422588
19320 5422588 5311136 5397387 5642537 5982115 6421386 6529565 6894290 7390101 7649997 7829617
19310 7829617 8274640 8774284 9022993 9091760 9489845 10013967 10428580 11062535 12064672
19301A2064672J080114J028540J141805R81016J232806J538965K024531K459882
19293B3552331K528288K917376L882306M961154O466418R041218J3577638K1557403
19285H8484132L3414629M3731586M2022495L1730891K9289809L1920842K7974842
19278C28569226R680513p196606K848588K5144166L1490535K2263654J6298658
19271D29098734J5980665R545118j2216392k4643425m853282K5334297L2071820
19264D70317535J2284692K199087R444692J1117606p394830l4198743l1242805
19257D32527234l855915J3701452J1377426M580764o20917j5765274m1477800
19250D00466970o7151966o9550786n0789390l2279526k0885419j4286990j0450301
$$ plain form
19301 12064672 13144786 14173326 15315131 16296147 17528953 19067918 21092449 23552331
19293 23552331 26080619 28997995 32880301 37841455 44307873 53349091 66926729 88484132
19285 88484132 121898761 165630347 207652842 239383733 268673542 300594384 328569226
19278 328569226 338249739 331053133 333901721 359045887 390536422 412800076 429098734
19271 429098734 445079399 454624517 442408125 417764700 412911418 438245715 470317535
19264 470317535 482602227 484801314 494246006 505363612 497968782 463770039 432527234
19257 432527234 428671319 442372771 453750197 458330961 457710044 441944770 400466970
19250 400466970 333315004 263764218 212974828 180695302 159809883 145522893 135072592
19243A35072592p658697o037707n034616l995863l318110k497525k008715j147745
19235A03373614k45289J260334K932577N332146R435012J4751824J8482970J7253076
19227A72576264J3435612J2516302J3081082J0386934L779160q1665K150967M875622
19219B32720278Q181941J3001038J5036875O793136p635052j2749732q540584
19212B46807900l941089n335288r336093p908419n122345m004178l125574l799910
19204B04235004r687886j9838904k6111507k2922223j6102096j0876890p481883
19197I1213615n327404m167336l113504k560352k481233k541589k098051j843392
19189F7080754j856559j622777j368892r50066q04559j073412j183135j425403
$$ plain form
19243 135072592 127413895 121376188 116341572 112345709 109027599 106530074 104521359 103373614
19235 103373614 103128325 104388659 107321236 112653382 122088394 136840218 155323188 172576264
19227 172576264 186011876 198528178 211609260 221996194 225775354 225693689 227844656 232720278
19219 232720278 240902219 253903257 268940132 275733268 268098216 255348484 246807900
19212 246807900 242866811 237531523 228195430 220287011 215164666 211160488 208034914 204235004
19204 204235004 194547118 174708214 148596707 125674484 109572388 98695498 91213615
19197 91213615 85886211 81718875 78605371 76045019 73563786 71022197 68924146 67080754
19189 67080754 65224195 63601418 62232526 61282460 60477901 59404489 58221354 56795951
19181E6795951j428834j837877j922846j544253j231158r89368r36822j356890
19173D5547903j251101j324513j435493j676276j802939j584167j068691q57600
19165C4547123p37140o60398o88009o99017l93634k1678j68543n32997q93676
19156B9752031m81354k16254J00724M76539K08862L54007N46943M64211L90007
19147C1595716L40858M3878K28922J32113K883l3578N9255J75678M15829L58866
19137C3320420K73346K85659N3126K00696L47533L55168Q8891j33800r7782L44092
19127C5037349J330155J693803J961928K955884M402146O598149J0745232J5479580
19119H0204226J7889108J6111787J2887883J2536924J2861669J0136853N466971
$$ plain form
19181 56795951 55367117 53529240 51606394 50062141 48830983 47841615 46904793 45547903
19173 45547903 44296802 42972289 41536796 39860520 38057581 36473414 35404723 34547123
19165 34547123 33809983 33149585 32461576 31762559 31368925 31347247 31178704 30645707 29752031
19156 29752031 29270677 29054423 29155147 29631686 29840548 30194555 30741498 31205709 31595716
19147 31595716 31936574 31980452 32209374 32341487 32344370 32310792 32370047 32545725 32961554 33320420
19137 33320420 33593766 33879425 33932551 34133247 34480780 34835948 34924839 34791039 34693257 35037349
19127 35037349 36367504 38061307 40023235 42979119 47381265 53979414 64724646 80204226
19119 80204226 98093334 114205121 127093004 139629928 152491597 162628450 168095421
19112A68095421M703171P881697J1384957J5153839J6052663J0132036j155118
19105B32248666j0648455j2521801j1483040j0957130q349390o434746n106073
19098A66748031l058478l200860q476135j7507033k2126298j8617775j2672527
19091H1088925q369785n784076m195384l305511k611552k125041j540906j321109
19083E1835561j228578j007613m89924j3251M25686O64103J361267K292999L834703
19074E7674953N900100R326478J4613269K0507292K3385044K0290673J6587850
19067A68285659J6420409J5687200J1107602L187315L79648N680309J2976187
19060B33724329J9657190J9293370R950244j747566r448954j1555955j4751288
$$ plain form
19112 168095421 172798592 180680289 192065246 207219085 223271748 233403784 232248666
19105 232248666 221600211 209078410 197595370 186638240 178288850 171854104 166748031
19098 166748031 163689553 160488693 152012558 134505525 112379227 93761452 81088925
19091 81088925 72719140 66935064 62739680 59434169 56822617 54697576 53156670 51835561
19083 51835561 50606983 49599370 49109446 49096195 49521881 50185984 51547251 53840250 57674953
19074 57674953 63575053 72901531 87514800 108022092 131407136 151697809 168285659
19067 168285659 184706068 200393268 211500870 214688185 215067833 220748142 233724329
19060 233724329 253381519 272674889 282625133 280877567 271428613 259872658 245121370
19053B45121370j8116995j5316653j1351664q164479n490246n697250j1914529
19046A69069554k1369362k4999554k0451797j4361660r831100p257329n673986
19039F5124766m454287l626290l194847k437555k167229k079901j872821j978565
19031D3313271j594189j583049j555497j554663j204940j230835j395382j086017
19023C2108699j007866j041407j057931j042942o34405n87362q52203o75411n76349
19014B4632823o29372n49665n46853m33110m57352p10645n16878l40003k99528
19005B0149417l63180m95302n26189n04739o37732k22297l93162j88321l74384
18996A6444111l39587j33061l00249l13764m15236j73033K105p9123j20111k54088
$$ plain form
19053 245121370 227004375 211687722 200336058 192171579 186681333 180984083 169069554
19046 169069554 147700192 122700638 102248841 87887181 78056081 70798752 65124766
19039 65124766 60670479 57044189 53849342 51411787 49244558 47164657 45291836 43313271
19031 43313271 41719082 40136033 38580536 37025873 35820933 34590098 33194716 32108699
19023 32108699 31100833 30059426 29001495 27958553 27324148 26736786 25884583 25209172 24632823
19014 24632823 24003451 23453786 22906933 22473823 22016471 21305826 20788948 20448945 20149417
19005 20149417 19786237 19290935 18764746 18260007 17622275 17399978 17006816 16818495 16444111
18996 16444111 16104524 15971463 15671214 15357450 14942214 14769181 14771286 14692163 14572052 14317964
18986A4317964l64281j19306j30711j33274k36392m05790k11316J50542k92286
18977A2575150k54740q8516j12232m87254n29711j04516m49666k40801r7217l40005
18967I870492j61208p4863n6787m50347l73261j06474k70934l189j49251l26980
18957G897198n07862k30750j31852M9022K17825j47815P7503J12073N5214J87242
18947G577798Q3640k5569j31106J1292O6119j548J42271K71167L1313j72651k5263
18936G827463K88118J77294N2232J23197k10522M817K07347M40354L23841p0167
18926I163974l12294k79280l65087m90071k23808o5521j02037j75191l24113l10910
18916F515662m54861l57150k28455J05261P790o6591l7532J72688J4296J7202
$$ plain form
18986 14317964 13953683 13834377 13703666 13570392 13334000 12928210 12716894 12867436 12575150
18977 12575150 12320410 12231894 12119662 11632408 11102697 10998181 10548515 10307714 10210497 9870492
18967 9870492 9709284 9634421 9577634 9127287 8754026 8647552 8376618 8373429 8224178 7897198
18957 7897198 7389336 7158586 7026734 7075756 7293581 7145766 7223269 7335342 7390556 7577798
18947 7577798 7661438 7635869 7504763 7516055 7582174 7580626 7722897 7994064 8025377 7852726 7827463
18936 7827463 8115581 8292875 8345107 8468304 8257782 8262599 8469946 8910300 9234141 9163974
18926 9163974 8851680 8572400 8207313 7717242 7493434 7427913 7325876 7150685 6826572 6515662
18916 6515662 6060801 5703651 5475196 5580457 5588247 5521656 5484124 5656812 5671108 5688310
18906E688310J13251k07910k09859o3555J90532J18711j43075j63641l0402J35190
18896E427552K91334K35559K1201j23003k36712l10485m31028j1069L6785J19437
18886E019571Q4949r6837l41839k48512L0966J69151J68424M8984M30529M86858
18876E752244K17007K36169q8913m18019m98017m47101J4536K05655j02955k23429
18866D647177l74994l87197r064J5875J56203p7923j81814P4730K10375L25593
18856D398961K35261L93405L89934N15520M51159O82171R72234J103646Q72381
18847A0014672M84843J39730J84099J1128j21339k80093l717M18726J154562J199924
18837A3202535J132942P04854N01901K2655q16577j160124j305648r48134r02208
$$ plain form
18906 5688310 5801561 5593651 5383792 5320237 5510769 5629480 5486405 5322764 5292362 5427552
18896 5427552 5718886 5954445 5975646 5852643 5615931 5305446 4874418 4863349 4900134 5019571
18886 5019571 5104520 5007683 4665844 4417332 4448298 4617449 4785873 4834857 5265386 5752244
18876 5752244 5969251 6205420 6116507 5698488 5200471 4753370 4767906 4973561 4870606 4647177
18866 4647177 4272183 3884986 3875922 3891797 4048000 3970077 3788263 3862993 4073368 4398961
18856 4398961 4634222 5027627 5417561 5933081 6384240 7066411 8038645 9142291 10014672
18847 10014672 10499515 10639245 10823344 10834472 10713133 10433040 10429323 10848049 12002611 13202535
18837 13202535 14335477 15040331 15542232 15564887 14748310 13588186 12282538 11334404 10432196
18828A0432196n74427l93398k89761K5400K11099K54486K06557K69519M6656J93022
18818A0381349K06429K96404N68052O78606R77237J188781J213516J562332J809044
18809A8881750K330622L318196N182924Q347111J3579078K2388990L3985578L6232695
18801A44246944K2566913J4550857J5238008J1175208p134828l5930627m0637748
18794A24074727k6697747j4907338p921039l923324j589418L73731L096800P154929
18786G9661321J3659308K3585914L1426733K5020879J3012446J1293693J0333261
18779B07993555O76775k2571272l7234748k7408150j1479892K013975J5785936
18772A27776179L3562623N2836430N3873950L1857172K1324317K1660041J1888413
$$ plain form
18828 10432196 9857769 9464371 9174610 9200010 9411109 9665595 9872152 10141671 10188327 10381349
18818 10381349 10587778 10884182 11452234 12130840 13108077 14296858 15510374 17072706 18881750
18809 18881750 21212372 24530568 29713492 38060603 51639681 74028671 108014249 144246944
18801 144246944 166813857 181364714 196602722 207777930 200643102 164712475 124074727
18794 124074727 97376980 82469642 74548603 70625279 69035861 69409592 72506392 79661321
18786 79661321 93320629 116906543 148333276 173354155 186366601 197660294 207993555
18779 207993555 208670330 186099058 148864310 121456160 109976268 111990243 127776179
18772 127776179 161338802 214175232 268049182 299906354 321230671 342890712 354779125
18765C54779125k1870325o5421793o7870242m4745487k6051911j4966777q271251
18758A05581339l810467M28166N560432J3000508K5487971M3190055N4373198
18751B43811202L9438729K0139947J8579187J5480187n581406m9251025p1644855
18744B10971966n4597911l3350444k0057469j2720606q739625o648491n069566
18737F9787854m130088l475903k878021k955324k791894k509211k045648k010090
18729D6991675j983506j485991j201576j182071q95023j194265p68617p73528
18721C7507098p47953o00789p09743q29635p10838l52051l24747J50712L76182
18712C3758236M74478N61684N64184J14987l78156o60117n11186p28213q41997
$$ plain form
18765 354779125 332908800 267487007 199616765 154871278 128819367 113852590 105581339
18758 105581339 101770872 102199038 107759470 120759978 146247949 189438004 243811202
18751 243811202 283249931 303389878 321969065 337449252 331867846 282616821 210971966
18744 210971966 156374055 123023611 102966142 90245536 81505911 74857420 69787854
18737 69787854 65657766 62181863 59303842 56348518 53556624 51047413 49001765 46991675
18729 46991675 45008169 43522178 42320602 41138531 40243508 39049243 38280626 37507098
18721 37507098 36759145 36158356 35448613 34618978 33908140 33556089 33231342 33382054 33758236
18712 33758236 34232714 34794398 35358582 35473569 35095413 34435296 33924110 33195897 32353900
18703C2353900n21495l40793k7128M34982M59627L01285O67650P52002R00401
18694C4980431J265465J246865J077508J052972J622787K263505L652519M996687
18686E2158739O976008J0345337J6229272K6488919M1578338N4979196M9920882
18679B58676691L3136003K7793950K8071780J7279318j2597800l5707589j9084661
18672B97567692J2093200K1585149J2129847R192032R655835j500055l2978403
18665C27745297o2662043n9152636l9315013k3721679j4509338r932844p466060
18658A10985684o059869m553267l412310k437721l83015K394493O277364J2789212
18650A15600571K2663726L1516346K8124912J7669985J4413495J5026013Q415862
$$ plain form
18703 32353900 31832405 31491612 31464484 31899466 32359093 32660378 33328028 34080030 34980431
18694 34980431 36245896 37492761 38570269 39623241 41246028 43509533 47162052 52158739
18686 52158739 59134747 69480084 85709356 112198275 153776613 208755809 258676691
18679 258676691 291812694 319606644 347678424 364957742 352359942 316652353 297567692
18672 297567692 309660892 331246041 343375888 352567920 362223755 360723700 327745297
18665 327745297 265083254 205930618 166615605 142893926 128384588 118451744 110985684
18658 110985684 104925815 100372548 96960238 94522517 94139502 96533995 102811359 115600571
18650 115600571 138264297 169780643 197905555 215575540 229989035 245015048 253430910
18643B53430910j0206408k3981226j2619638O653723J2023151N151888L401689
18636B33854089M326436k226482k0982808l9197609l5921174k2324505j2277757
18629A05250190o502132k799578K15248L402776P824284J4238502K2246840K7665074
18621A71541204K7679655K7241917K8498006K3696570R142480q702913j9059546
18614B60037373k2650119k8010722l3519688l0991151k3152207j6101666j1295406
18607I4316414q716077p020282n681488m685561l639415k888243k442737k050317
18599E7192294j509415q14437o05572n16196l78117l71523p22101o33204q63334
18590E0778395r69204p74001r72591q65159m70134L92225J079400J381532K230778
$$ plain form
18643 253430910 243224502 219243276 206623638 213277361 225300512 230452400 233854089
18636 233854089 238180525 235954043 214971235 175773626 139852452 117527947 105250190
18629 105250190 98748058 95948480 96163728 99566504 107390788 121629290 143876130 171541204
18621 171541204 199220859 226462776 254960782 278657352 287799832 279096919 260037373
18614 260037373 237387254 209376532 175856844 144865693 121713486 105611820 94316414
18607 94316414 85600337 78580055 72898567 68213006 64573591 61685348 59242611 57192294
18599 57192294 55682879 54868442 54262870 53746674 53368557 52997034 52274933 51641729 50778395
18590 50778395 49809191 49035190 48062599 47197440 46727306 47119531 48198931 49580463 51811241
18581E1811241L148581M448274N675182P845635J1596284J7348372K6993993M0222145
18573A69089707M9763362M9400949M8545642N1346798M3972177J8622532j2844320
18566D17896847l1669353l7308733m6635317n8128890n3411682l8157637k5147799
18559A27437436j6666662j1601917q412530o828605n105494m193252l615922k656906
18551F8356148j450255j201166j013933n94610l35205p64981r94165j230666j217394
18542E9553773j201696j254851j563245j977576k068242j935816k114567j854595
18534D5583185j127087n31793N77184R75357J649625K882848M520281O845413
18526F1375013J1304149J6957798K1005290K0574500K0374871K1910842J8775834
$$ plain form
18581 51811241 54959822 59408096 65083278 72928913 84525197 101873569 128867562 169089707
18573 169089707 218853069 268254018 316799660 368146458 412118635 430741167 417896847
18566 417896847 386227494 348918761 302283444 244154554 190742872 152585235 127437436
18559 127437436 110770774 99168857 90756327 83927722 78822228 74628976 71013054 68356148
18551 68356148 66905893 65704727 64690794 64096184 63760979 62995998 62001833 60771167 59553773
18542 59553773 58352077 57097226 55533981 53556405 51488163 49552347 47437780 45583185
18534 45583185 44456098 43924305 44501489 45476846 47126471 50009319 54529600 61375013
18526 61375013 72679162 89636960 110642250 131216750 151591621 173502463 192278297
18519A92278297P689740n640460j3832769j6066259j9891160k5303982k3876933
18512I5356474j7081155j0845382p263300n078525l790937l152679k453952j681190
18504D4009354j228974j139371r55084o9535N58462R47038R99292P21235K7698
18495D3870115o65822j082464j408446k044427k584614k300781j981400j157503
18487C0644658m98150q01830q56024r67705j124062j042224j178890j106443j081101
18478B1988229j349303r90937o94260o06218l37127n37035p35466j23211j69659
18469A6445013k84217m13258l84897k48914R0040k46286j18093K76100K71171
18460A5386659K15129K52916J04543P2223J90744M35632L43954K75198L79626
$$ plain form
18519 192278297 199968037 194327577 180494808 164428549 144537389 119233407 95356474
18512 95356474 78275319 67429937 60166637 55088112 51297175 48144496 45690544 44009354
18504 44009354 42780380 41641009 40685925 40616390 41174852 42121890 43121182 43842417 43870115
18495 43870115 43204293 42121829 40713383 38668956 36084342 33783561 31802161 30644658
18487 30644658 30146508 29344678 28488654 27520949 26396887 25354663 24175773 23069330 21988229
18478 21988229 20638926 19647989 18953729 18347511 18010384 17473349 16737883 16614672 16445013
18469 16445013 16160796 15747538 15362641 15113727 15203767 14957481 14839388 15115488 15386659
18460 15386659 15601788 15854704 15959247 16031470 16222214 16657846 17001800 17276998 17656624
18451A7656624P50200P80267P54394R34014L82976L3888m16494p31850o31837
18442A9512182o40741j160429j435980j378767j017605o86802p53917n76133n43157
18433A1318651l31592m41442k61401k81221n33226o27975n16380j28197J60191
18424H357408j06639k52848k46835k00409k40852j69796j87302P05j06166N2882
18414F900148k35325k14617K121J34012J45648k22588j31713m3636K04556J88951
18404F727557N58376O54133L82866L10790K82025M28677J19641n6349k08956L85438
18394I584198O20817R43209L78507L03943n9902n35546p88813r40929o55735k74619
18384H575130k54294j50438j47673l06921l59116m52347l68517l61313n37675
$$ plain form
18451 17656624 18406824 19187091 19941485 20875499 21258475 21292363 20875869 20144019 19512182
18442 19512182 18871441 17711012 16275032 14896265 13878660 13191858 12437941 11861808 11318651
18433 11318651 10987059 10545617 10284216 10002995 9469769 8841794 8325414 8197217 8357408
18424 8357408 8250769 7997921 7751086 7550677 7309825 7140029 6952727 6953432 6847266 6900148
18414 6900148 6664823 6450206 6452327 6586339 6731987 6509399 6377686 6334050 6538606 6727557
18404 6727557 7285933 7940066 8322932 8633722 8915747 9344424 9464065 9407716 9198760 9584198
18394 9584198 10205015 11148224 11526731 11830674 11770772 11235226 10446413 9505484 8849749 8575130
18384 8575130 8320836 8170398 8022725 7715804 7356688 6904341 6535824 6174511 5636836
18375E636836k83285l03899j6912q5715k14604n5741Q7359l66191l73050K32737
18365D257535L42817M91556K95114J08143M8689j87814m20805k68459j00198n7966
18355D508612R6362N5900K42387N11070R35607O57740O81695P37586O03812R9922
18345I130693r318k25896n77196j229701r16130o67388p84345l89952l01683n2227
18335C976857j23005l59801J0749J16688K36850m4498p8758J49722n0928k71707
18325C562169l80716j61726J55225k21699j07677p6252O3634j13974o9581N8783
18315B708186p2062k5043P343p8858J34736J85695J48477J86546n7398p1205J49128
18304C215545O5439p2139Q5567J19444p6453l43484m6641p5738j25902j24742
$$ plain form
18375 5636836 5353551 5049652 5032740 4947025 4732421 4676680 4764039 4397848 4024798 4257535
18365 4257535 4600352 5091908 5387022 5495165 5543854 5356040 4935235 4666776 4566578 4508612
18355 4508612 4604974 4660874 4903261 5414331 6349938 7007678 7689373 8426959 9030771 9130693
18345 9130693 9121375 8895479 8318283 7088582 6172452 5505064 4720719 4330767 4029084 3976857
18335 3976857 3853852 3494051 3504800 3621488 3858338 3813840 3735082 3884804 3833876 3562169
18325 3562169 3181453 3019727 3174952 2953253 2845576 2769324 2832958 2718984 2649403 2708186
18315 2708186 2636124 2611081 2618424 2539566 2674302 2859997 3008474 3195020 3137622 3066417 3215545
18304 3215545 3280984 3208845 3294412 3413856 3337403 2993919 2947278 2871540 2745638 2620896
18294B620896j06414J30178K11362k52764l82373r0279j53710k38133m15938k72114
18284A050711J38274J81316l2434j46672j36424K70182L04561n217k25809p6826
18274A321662j11283j10804J23981K8873J70653R1206j19493r2666j92274N1227
18264A161082j35019j50189J73136N5947m5094k6040O4529j08149J09653o4227
18254A035629j0495j03918o3997J1896j12567l8948j21897o3631q0482J7076n6849
18243D11817k6865K82894J39904M1845J59912l6405m8319j678k83546j02661n828
18232E31070J35081J38430J9995Q4572r7634k13043n0619q1225j41649m4032L10671
18221E91617r7723r2118Q0067Q0455K38448K37784k93000k02150j9949j72516
$$ plain form
18294 2620896 2514482 2644660 2856022 2603258 2220885 2130606 1976896 1738763 1322825 1050711
18284 1050711 1188985 1370301 1337867 1191195 1054771 1324953 1629514 1624297 1398488 1321662
18274 1321662 1210379 1099575 1223556 1252429 1423082 1514288 1394795 1302129 1109855 1161082
18264 1161082 1026063 875874 1049010 1104957 1059863 1033823 1098352 990203 1099856 1035629
18254 1035629 1025134 921216 857219 869115 756548 717600 595703 532072 451590 468666 411817
18243 411817 384952 667846 807750 849595 1009507 973102 924783 923105 639559 536898 531070
18232 531070 666151 804581 824576 909148 811514 598471 547852 466627 324978 280946 591617
18221 591617 493894 401776 481843 562298 800746 1038530 745530 543380 523431 350915
18211C50915j33092K25811J86713J76023J7172l09426k41068j5757K95036L58986
18201I11313P3934N9076J73936K27740K04471Q527J46199j69479k48123l45641
18191A041953k02122L5396N650R662L44177p5555j050N3427n935L7673L37060
18180A580336j8681j61921j47531N2594N1995j61779J8535r557j242j63434J71136
18169A210451J63570J89275L7904P290K86273L2936n7155K54665q0974k86570
18159A757665m48110k48905p930q8891J89012K70716n6138Q2120N62500L25472
18149B337511L01065J73414K38851P3221k91766k88322O145j15709k94608P0669
18139B210471j00215n5052k878k00536m04533K7832k24629l12880m7642K05968
$$ plain form
18211 350915 217823 443634 630347 806370 823542 514116 273048 257291 552327 911313
18201 911313 985247 1044323 1218259 1445999 1650470 1658997 1805196 1635717 1387594 1041953
18191 1041953 839831 875227 880877 890539 1234716 1159161 1158111 1211538 1205603 1243276 1580336
18180 1580336 1561655 1399734 1252203 1304797 1356792 1195013 1213548 1203991 1202749 1039315 1210451
18169 1210451 1374021 1563296 1601200 1608490 1894763 1927699 1870544 2125209 2044235 1757665
18159 1757665 1309555 1060650 1052720 963829 1152841 1423557 1367419 1449539 2012039 2337511
18149 2337511 2638576 2811990 3050841 3124062 2832296 2543974 2550119 2434410 2139802 2210471
18139 2210471 2110256 2055204 2052326 1851790 1447257 1475089 1250460 937580 889938 1095906
18129A095906j43994j73578Q3821M8886j21233j24751J26333j04545J50280K80756
18119A117881J33578J67216K64660Q1973J68986J65143n7081q0928J26348J4159
18109B101935r2312L3103J16786k74094j32500J00850n8194J46854N798m66743
18099A481483j59549l7613l8778k14126j02152j4025P9125R1221n9118k20965
18089H05503j52756M2893J48527J09117L7521j29859k65785k63756Q365J32636
18079D72406q5989m1978J93489m545n3417l38157k3551k8380k05572J20544J97512
18068B02362N5240l148j20K33824J23895J57142l3158m0188K10358J43508J92616
18057A242331L14988K63005l1700R3069K76279N2807j65364k68823k88776k08673
$$ plain form
18129 1095906 951912 778334 862155 911041 789808 665057 791390 686845 837125 1117881
18119 1117881 1251459 1418675 1683335 1765308 1934294 2099437 2042356 1961428 2087776 2101935
18109 2101935 2009623 2042726 2159512 1885418 1752918 1853768 1795574 1942428 1948226 1481483
18099 1481483 1321934 1284321 1245543 1031417 929265 915240 994365 1085586 1026468 805503
18089 805503 652747 695640 844167 953284 990805 860946 595161 331405 339770 472406
18079 472406 386417 344439 537928 533383 479966 141809 118258 89878 -115694 4850 202362
18068 202362 257602 254454 254334 488158 612053 769195 736037 695849 906207 1049715 1242331
18057 1242331 1557319 1820324 1788624 1881693 2157972 2210779 2045415 1776592 1487816 1279143
18047A279143j94006j04249R5045l27097k86121j04191q7326J10561J02921j93034
18037B91646j74587R7140J29624O7741j97168J89325J90378J45953K0547L1419
18027G92018R511k19342l4850J09188Q4422l08834k6709k32388L4902Q0810p5452
18016B13276J18966J2934R2276L10414K21068r5748k69037k21593J49262L70393
18006I02211K35274J05982L19583J44271j37193k91453j88908j61429q8453k9443
17996H10442J5775J65435n9542j3858l48888o4604J22573r648k35535j19798N2854
17985C15206o6910n893J20439J23221J47954j09520K91861M68676J28874p8325
17975A335583L6011J4908N1785l23592j99262l10405k48462J8413J28424K8446
$$ plain form
18047 1279143 1085137 980888 1075933 748836 462715 358524 271198 381759 484680 291646
18037 291646 117059 214199 343823 411564 214396 403721 594099 740052 760599 792018
18027 792018 801529 582187 547337 656525 740947 432113 405404 173016 207918 288728 213276
18016 213276 332242 345176 437452 747866 968934 873186 604149 382556 531818 902211
18006 902211 1137485 1243467 1563050 1707321 1570128 1278675 1089767 928338 839885 810442
17996 810442 826217 991652 932110 918252 569364 504760 627333 617685 382150 262352 315206
17985 315206 248296 242403 362842 486063 634017 524497 816358 1285034 1413908 1335583
17975 1335583 1371594 1386502 1438287 1114695 915433 605028 356566 374979 503403 531849
17965E31849J6210k7743J07305k21742k68972J62278J32184M2456J29581K27319
17955H30725k71987l01399O307K7655p6425J72819J71400P326N0008L62883O6112
17944A045424j24906j50302j96005j08413p5402k6911j86503N974J48890j77967
17934A53879l1850M1633o468R2377o9511L7692p3333j52780j3434Q2369j59372
17923i8798j57391J4601m8118M2271j3342j27692J33966J85629M20020M1066Q8569
17912D80781N1278N5637j75644O6683k12538j38275J50475j55853M8128j8238
17902A52434K48534j6335j92669k66115R1967L01673J59161p2321j50659j25575
17892A30095P18K10938l20533j54253k7664j6580J96708K30209j4978N427n5600
$$ plain form
17965 531849 548059 520316 627621 405879 136907 299185 431369 473825 603406 830725
17955 830725 558738 257339 263646 291301 214876 387695 559095 566421 616429 979312 1045424
17944 1045424 920518 770216 574211 465798 390396 363485 176982 182956 331846 153879
17934 153879 122029 163662 157194 249571 180060 217752 144419 -8361 -21795 60574 -98798
17923 -98798 -256189 -241588 -289706 -247435 -260777 -388469 -254503 -68874 351146 392212 480781
17912 480781 532059 587696 412052 478735 266197 127922 278397 122544 170672 152434
17902 152434 400968 384633 191964 -74151 17816 319489 478650 406329 255670 130095
17892 130095 130813 341751 21218 -133035 -160699 -177279 19429 249638 234660 240087 184487
17881A84487O2824l8286k14416k02225n2413j76344K70103K86044j70920j27562
17871a78708k52262O6383J72635P8703j34322K22899O2144M133r2274j84866Q1584
17860a53951J10743J87534K0465p4724j00094K43580K14355n4611j55759J350
17850B38888J30517Q5625k58072k95390j26959J79335K00364N7850J13029R8570
17840D23757p476l59410m0825L5710K08714Q7128l52406l99076j55333n3815M6140
17829e66892K38921N9818J35995K98921o998j5084n2075k65127j31579Q5530J19294
17818i9276k67073J94252L49150O4464l22427j87587J8172J43035K22972K7550
17808A43232r3728j08215J00863q843J21136P8309m1295M1077j332k81992l45410
$$ plain form
17881 184487 247311 209025 -5391 -207616 -260029 -436373 -166270 119774 -51146 -178708
17871 -178708 -430970 -364587 -191952 -113249 -247571 -24672 37472 41605 -50669 -235535 -153951
17860 -153951 -43208 144326 164791 90067 -10027 233553 447908 393297 237538 238888
17850 238888 369405 455030 196958 -98432 -225391 -46056 154308 212158 325187 423757
17840 423757 416281 56871 16046 51756 260470 347598 -4808 -403884 -559217 -613032 -566892
17829 -566892 -327971 -268153 -132158 166763 159765 144681 92606 -172521 -304100 -218570 -99276
17818 -99276 -366349 -172097 177053 241517 -80910 -268497 -250325 -107290 115682 143232
17808 143232 49504 -58711 42152 33309 154445 232754 191459 232536 231204 -50788 -396198
17797c96198n046J13215J24701J70989J77206j627o21n7794M6499J62450j440
17786C32334k63935j93892j27727r3744N0641M58652J88121P5237Q9615j48810
17776C66492Q3795M3880k9067k69921q6825K3021j63028q2891J04428J9097N1033
17765F0014J28436j26035Q4586J3942J28828p3774j63061k6468q1726k9464j29086
17754b13808P46q0497J48510J40024K480K10765Q7985R0212N2603k4350j99714
17743B14956j9183j54937n1171m116l3790K36350J22162j11790J21011l7268L005
17732B85229J75786J39101k30860k41202m5769O9618O3182J86127j17070L2713
17722C16855o038N3837L3489k8499k04615j73342j21779K34310J2596j07623j06801
$$ plain form
17797 -396198 -401244 -288029 -163328 7661 184867 183240 182619 124825 171324 333774 332334
17786 332334 68399 -125493 -253220 -346964 -296323 162329 350450 425687 515302 366492
17776 366492 450287 494167 465100 195179 108354 131375 -31653 -114544 -10116 8981 60014
17765 60014 188450 62415 147001 160943 289771 215997 52936 26468 -55258 -84722 -213808
17754 -213808 -213062 -293559 -145049 -5025 -2545 208220 296205 386417 439020 414670 214956
17743 214956 195773 40836 -10335 -14451 -48241 188109 310271 198481 319492 282224 285229
17732 285229 461015 600116 369256 128054 82285 151903 215085 401212 284142 316855
17722 316855 310817 364654 398143 369644 165029 -8313 -130092 104218 116814 9191 -97610
17711i7610j43921j72230J16471K43984M712R4924j41053L548J3150p9024J87415
17700C0366k3588q8094j78863p1830O5697P1482m0518J76011N0245k08547j23177
17689c40816j77844J42617J53004J65886j44699p1914J93985j14414J00296J33718
17679C9819J16372Q0711J4503R1165j31138J18516J90339N3621k34503m8618j66184
17668A24603j23381O6867q8858k34017j07484K89059K50271R7982J51799M2769
17658D69610l4547n1996q6107o7967J52870j5443j24912O6688k610m12936j86386
17647b93736J87362j64600p7424j01016j64928J09106J79415j4539j51502p0007
17637e61869O3642L70116O8374L2095Q6161q075m8846j39179j25843n2153j06463
$$ plain form
17711 -97610 -241531 -413761 -297290 -53306 -48594 46330 -94723 -91175 -78025 -157049 30366
17700 30366 6778 -81316 -260179 -332009 -266312 -194830 -235348 -59337 -9092 -217639 -340816
17689 -340816 -518660 -376043 -223039 -57153 -201852 -273766 -79781 -194195 -93899 39819
17679 39819 156191 236902 251405 342570 211432 329948 520287 573908 339405 290787 124603
17668 124603 1222 68089 -20769 -254786 -362270 -73211 177060 275042 426841 469610
17658 469610 435063 383067 296960 228993 381863 366420 241508 308196 305586 -107350 -293736
17647 -293736 -106374 -270974 -348398 -449414 -614342 -505236 -325821 -340360 -491862 -561869
17637 -561869 -498227 -128111 -59737 -27642 58519 50444 1598 -137581 -263424 -315577 -422040
17626d22040p7779L60736M48967l0424J7591m0637j37686Q3701j47269l25214
17616b70054O3675M269R4258J57623j30431q9034j02631K0973o3097K33689P9184
17605a576N0950J72227O5864l7806o1606j51578L9269M914q8855q5388K4808J60240
17593I1463K6695j57556k0053M8459J64810R9583q7202O9412K3436k97038j47895
17582a85886R2232j2183N986k94300Q025j26320j25884M2300J70096K62369k5188
17571a88753L0315l1252m43L05168J75575j28408n8410M9525k886M1142j29200
17560F2373j92993J05410K95940Q5189j2900P6374J28418J00169j66083O3113
17550E45010L1916l63170l39183j36165J83764l2115N8167K25042p2474n8896
$$ plain form
17626 -422040 -499819 -139083 309884 279460 297051 256414 118728 202429 55160 -270054
17616 -270054 -206379 -202110 -107852 49771 -80660 -169694 -272325 -251352 -314449 -80760 -1576
17605 -1576 49374 221601 287465 249659 188053 36475 75744 80658 -8197 -93585 -68777 91463
17593 91463 118158 -39398 -59451 -10992 153818 253401 166199 235611 259047 -37991 -185886
17582 -185886 -93654 -105837 -99851 -394151 -386126 -512446 -638330 -596030 -425934 -163565 -188753
17571 -188753 -158438 -189690 -190133 115035 290610 162202 103792 153317 150431 191573 62373
17560 62373 -130620 -25210 270730 355919 343019 419393 547811 647980 481897 545010
17550 545010 576926 213756 -125427 -261592 -77828 -109943 -51776 173266 100792 41896
17540D1896j53155l31902J27671J40749J3841J8299j872J57689J46474R019o9165
17529I9544j40896j22066P0749K01173Q525m8704n6163J47986O1877j34084k1870
17518F6071k54068j01051R0091P385j77417J776K8450J73392K07660m6662O2537
17507E8164J72265l5387o8803K7323r0297r7048L4552M5000m9647K05910j25468
17496G6564P576O5788O9192P5233j4388r9409J12752N6614j14762k32240R9549
17485A02469r3664k06251J6798N3772n8747K03491J93221j34298l23508j08806
17475c55523k4645K77323J28808K12859K027j63054J9104k2679r84k8247q4561
17464c9572r5973j93310j70005N8086J06150K82284J44432R8309o0096j63973
$$ plain form
17540 41896 -111259 -443161 -315490 -174741 -160900 -142601 -144473 13216 159690 168709 99544
17529 99544 -41352 -163418 -92669 108504 117029 68325 12162 160148 222025 87941 66071
17518 66071 -187997 -289048 -198957 -191572 -368989 -367213 -338763 -165371 42289 -4373 58164
17507 58164 230429 195042 126239 153562 63265 -33783 769 45769 -3878 202032 76564
17496 76564 84140 149928 219120 294353 279965 180556 293308 349922 235160 2920 102469
17485 102469 8805 -197446 -180648 -126876 -185623 17868 211089 76791 -246717 -355523
17475 -355523 -380168 -102845 25963 238822 240849 77795 96899 74220 73236 44989 -39572
17464 -39572 -135545 -328855 -498860 -440774 -334624 -52340 92092 190401 130305 -33668
17454c3668k37090k08517N4481J64747j44918n962R3205J36535L282j27571R8708
17443b06768j62171J31464J53742j68507J07602J44763K8571k28606j58898K4625
17433c34183R8715K9396k1731J33227K71431J21106Q5936n4111k08334M9692J39581
17422C10725K27649j64853k59030J21635J60051O7571j83375J823K36451m4144
17412D74503m17237j49980J27031L6331J16701L506j530p4088K2426N4260j1937
17401A79986m3507j33849L4171O2342k38608j43104N2815j16459n0011L09401
17391h6823K00055j721k15713m5650J10599N8807O0161o6404R1745m5772k4718
17380C4566j06280j76076J34830L3079r3481N8460l8089J04023p4303k53436r9459
$$ plain form
17454 -33668 -270758 -479275 -424794 -260047 -404965 -410927 -317722 -181187 -177905 -305476 -206768
17443 -206768 -368939 -237475 -83733 -252240 -144638 125 28696 -199910 -358808 -334183
17433 -334183 -235468 -206072 -227803 -94576 176855 297961 383897 329786 121452 171144 310725
17422 310725 538374 373521 114491 236126 396177 463748 280373 282196 518647 474503
17412 474503 57266 -92714 34317 70648 187349 190855 189325 115237 137663 191923 179986
17401 179986 136479 2630 36801 99143 -139465 -282569 -229754 -346213 -396224 -86823
17391 -86823 113232 111511 -104202 -149852 -39253 19554 79715 13311 105056 59284 34566
17380 34566 -71714 -247790 -112960 -79881 -173362 -114902 -152991 -48968 -123271 -376707 -476166
17369d76166J66529J32124m9921R138j8464J1033j05779N2862K49415K18579o6085
17358A23265M8221J15754J84515N3157k22224o0577n5521k15332j68786q695L6597
17347a69626j06403J96177J77443k08870k78908m3003J89744j021j15406q3666
17337d43539L48250K36612j98180q8001J25626J0534K74367k3329J32303k0324
17327C54319j37563k05875o6074j03583k97525N8649M99559K25120P158k21571
17317A12614k01266j45393k0627J10658P9600K95187l9392K2805n5385k82140
17307a23339o8538p7397O3066K4729j31360j66629J32713K31998k8033M1933j507
17296a02364J03418k2543n8975j93546J19427J54624k84913j34916Q2671J50698
$$ plain form
17369 -476166 -309637 -177513 -227434 -218296 -236760 -225727 -331506 -278644 -29229 189350 123265
17358 123265 171486 287240 471755 524912 302688 242111 186590 -28742 -197528 -206223 -169626
17347 -169626 -276029 -79852 97591 -111279 -390187 -433190 -243446 -244467 -359873 -443539
17337 -443539 -95289 141323 -56857 -144858 -19232 -8698 265669 242340 374643 354319
17327 354319 216756 10881 -55193 -158776 -456301 -397652 101907 327027 334185 112614
17317 112614 -88652 -234045 -254672 -144014 -64414 230773 191381 214186 158801 -123339
17307 -123339 -191877 -269274 -206208 -181479 -312839 -479468 -346755 -114757 -142790 -100857 -102364
17296 -102364 1054 -21489 -80464 -274010 -154583 41 -284872 -419788 -337117 -186419
17286a86419j7298J70423k5393k6311K26494m764k73860n35r7707q422M5516j60622
17274c58898j54608R9415L66431L5880n0805R367k1363o5235n779K4151J26151
17263D707j55948Q9405O5443p4010j87104J51356K01439l3612k16466N338n869
17252a55321k75369K68361L01246J65185j76536q4006K2478J65357J32932j18750
17242B45577j85659j91856k11381M039J05145J18501K0239j47968p7980j3924
17232c35267O6619J40151J2457O8240j03616j21115J72667L30752p742k15725
17222G421j20275J30266N3630m9365N952J18610N0377j3859k3027k9603p2845
17211E7282k23675k45806J59837K97380J98518j34042N1117M3796p6951q2675
$$ plain form
17286 -186419 -203717 -33294 -58687 -84998 141496 136732 -137128 -137663 -235370 -243792 -198276 -358898
17274 -358898 -513506 -414091 -47660 -11780 -62585 -53218 -74581 -139816 -145595 -121444 4707
17263 4707 -151241 -61836 3607 -70403 -257507 -106151 95288 61676 -154790 -149452 -155321
17252 -155321 -430690 -162329 138917 304102 127566 43560 66038 231395 364327 245577
17242 245577 59918 -131938 -343319 -339280 -234135 -115634 -95395 -243363 -321343 -335267
17232 -335267 -268648 -128497 -116040 -47800 -151416 -272531 -99864 230888 223146 7421
17222 7421 -112854 17412 71042 21677 27629 146239 196616 182757 159730 130127 57282
17211 57282 -166393 -412199 -252362 45018 243536 109494 160611 204407 127456 44781
17201D4781K0851j89414P511J26528J23469J93720N286q2404j78808L1165J3521
17190A16206m024m5640j42855J72654J70621j92843k9507K6325n0518N1156K60861
17179C32436o0717j79726j04582j42582R5834P7690r1041j75014j12347M0652
17169c19397j5134Q3952R7116O5412K23448K36158Q2285p4255k07839J23338k5785
17158B69299R177k50298j45357j22814J22662J29945Q312l20061j23898J54320
17148b68713K08698q9878J75044J49585J4231N477K6586j58375k87190J66607
17138e7928M8608J24817n9564j95276M6994J39524l359k00881r3697J70185N391
17127g5186R8780j1881j0930l9426k65534j86078J0146R4047J69498J35297J55771
$$ plain form
17201 44781 65632 -123782 -116271 10257 133726 327446 332732 250328 71520 102685 116206
17190 116206 112182 66542 -76313 96341 266962 74119 44612 70937 20419 71575 332436
17179 332436 271719 91993 -12589 -155171 -59337 18353 -72688 -247702 -360049 -319397
17169 -319397 -334531 -250579 -153463 -88051 135397 371555 453840 379585 171746 295084 269299
17158 269299 278476 28178 -117179 -239993 -117331 12614 20926 -299135 -423033 -268713
17148 -268713 -60015 -149893 25151 174736 188967 194444 221030 62655 -224535 -57928
17138 -57928 -9320 115497 55933 -139343 -92349 47175 43816 -157065 -250762 -80577 -75186
17127 -75186 23594 11713 783 -38643 -304177 -490255 -480109 -386062 -216564 -81267 74504
17116G4504j7661J60348Q7684j04380m25196m7790J01124M4567P1469P537J44092
17105I6298K06301m5468l22106j06422Q4827K00649L01681j12761k27468j7313
17095E8218j24910J29158K31689j22399J54817Q0304k06028j60596P8850M22949
17085E42052j22863j91073k74412R426K42307K99238k09179q1256O6005P3130
17075C53375n2780n8022N7921K087k93234l21939K80460R0250q4410J43419q6673
17064C0454N3200n0916j64269k43467q8693k7639j49697R7332L38382l7896m7461
17053b90670Q5051K30778K38889k8073p4600j34263k08676R1420K3095l3739j64845
17042b65633o1277J64689J0351j17968j27771P2436K59160J32618k47915J05079
$$ plain form
17116 74504 56843 217191 304875 200495 -224701 -272491 -171367 -126800 -55331 -47794 96298
17105 96298 302599 257131 -64975 -171397 -86570 114079 415760 302999 75531 58218
17095 58218 -66692 62466 294155 171756 326573 406877 200849 40253 119103 542052
17085 542052 419189 228116 -46296 -36870 205437 504675 295496 214240 280245 353375
17075 353375 300595 242573 300494 302581 9347 -312592 -32132 58118 -26292 117127 30454
17064 30454 83654 32738 -131531 -374998 -463691 -491330 -641027 -543695 -205313 -243209 -290670
17053 -290670 -205619 25159 264048 235975 161375 27112 -181564 -90144 -67049 -100788 -265633
17042 -265633 -326910 -162221 -151870 -269838 -397609 -325173 -66013 66605 -181310 -76231
17032g6231M6179N4392p5018j19343k89819k59503P6675K53252k24812o111K38604
17021c81735K56209o7814k7872j98337l7468K57364R1278J15068J64572j4246
17011A57019k11202k86708N2660j0540L65975K58761j77161k89122m0672R5149
17001h5841J65937R878j03333J0603l3959j05006R4983J84187m3273k60332M0824
16990a25332L60668K01966r5801l42776J18399M081j77561k41985j56196M77867
16980B3330J60017j8760N5072j46079L04167J74329j00267O9209l1212k608m4270
16969D42928j69348j04809k2882l38803j58052K51994j47091J45025Q8415r8413
16959a11036j20178J01479p0381K00099j11353R0714J8927R6525j11626J14720
$$ plain form
17032 -76231 -30052 24340 -50678 -170021 -459840 -719343 -642668 -389416 -614228 -620339 -381735
17021 -381735 -125526 -193340 -221212 -419549 -457017 -199653 -108375 6693 171265 157019
17011 157019 -54183 -340891 -288231 -298771 67204 325965 148804 -140318 -180990 -85841
17001 -85841 80096 89974 -13359 -2756 -36715 -141721 -46738 137449 94176 -166156 -125332
16990 -125332 235336 437302 341501 -1275 117124 121205 -56356 -298341 -454537 23330
16980 23330 183347 164587 219659 73580 377747 552076 451809 521018 489806 487198 442928
16969 442928 273580 168771 145889 -192914 -350966 -98972 -246063 -101038 -12623 -111036
16959 -111036 -231214 -129735 -200116 -17 -111370 -20656 -1729 94796 -16830 97890
16949I7890P9451o434J82406j19436k73353j83281n9773K9453J9748M0356j916
16938a94889j4856J86561J71080j67967N720K72960o3455K6314p2194k15775K5233
16927d1268o5328J1405J21167j82934J16467r520k83253J12033J21384J5964M2408
16916d1475k106O9528J35609N0767R3036k36097k61509K8442K425K04604L7547
16905H0771N4313o2235J0300j49817q2066J6207Q744J15520k15453K156O9898
16894a51662j10458J24913K16174J47675J0389k1564K1286n9533k13971r5875
16884a32626m5733j55884j23631J41340J54375P0160J83132J43598J30281m7525
16874C17487j51737l04433k92206J86968J34348L9684J72404j22762r5448M8917
$$ plain form
16949 97890 177341 170907 353313 233877 -39476 -222757 -282530 -253077 -233329 -192973 -194889
16938 -194889 -209745 -23184 147896 -20071 -14351 258609 195154 221468 149274 -66501 -41268
16927 -41268 -106596 -95191 25976 -156958 -40491 -50011 -333264 -221231 -99847 -83883 -41475
16916 -41475 -43581 25947 161556 212323 305359 69262 -192247 -163805 -161380 43224 80771
16905 80771 135084 72849 83149 -66668 -148734 -132527 -123783 -8263 -223716 -221560 -151662
16894 -151662 -262120 -137207 78967 226642 237031 215467 236753 177220 -36751 -132626
16884 -132626 -178359 -334243 -457874 -316534 -162159 -91999 91133 234731 365012 317487
16874 317487 165750 -138683 -430889 -243921 -109573 -69889 102515 -20247 -115695 -66778
16864f6778j18424J71107J48059J2528j69877j4368k36066j2246j22409N1169
16854c57305J70944L9983r8864R6634J68514K44145J72714P7157l15765l1839
16844A66318K9556l34170j16291J31384K41784J40764k23539l27133j29224L4527
16834c86024N1538m0770o852K01830K14981j7471l5221o0986k85837q5732N881
16823d44663j29267J33950L01399K99547k97161o6853L34558M5055j35399O778
16813D7944j05703p6543M0373q4862K54607J47281r6327j5656p8721l2286n8573
16802e8466j81616N6381o2760R2352J83476J25281P4298q6223k67179k4651J43240
16791e867K8370m5566K9675j88471k8090n0923r0458j0637K15392J18228J16986
$$ plain form
16864 -66778 -185202 -14095 133964 146492 -23385 -37753 -273819 -286065 -408474 -357305
16854 -357305 -186361 -146378 -245242 -148608 19906 264051 436765 513922 198157 166318
16844 166318 195874 -138296 -254587 -123203 118581 259345 35806 -291327 -420551 -386024
16834 -386024 -334486 -375256 -382108 -180278 34703 17232 -17989 -78975 -364812 -450544 -444663
16823 -444663 -573930 -439980 -138581 160966 -136195 -203048 131510 176565 41166 47944
16813 47944 -57759 -134302 -93929 -178791 75816 223097 126770 111114 32393 107 -58466
16802 -58466 -240082 -183701 -246461 -154109 29367 154648 228946 142723 -124456 -149107 -5867
16791 -5867 22503 -23063 6612 -181859 -209949 -260872 -351330 -361967 -146575 -28347 88639
16780H8639j63047J7487J78222J26882j33946j27012m9496L0411J34446j08575
16770e989p7351p770J22141L18318N645k43776j85917J43948K53579m4107m0372
16759B38349j60632j39822j70828O4120J36237Q4606Q0399j0582j21464J29735
16749A30118R9622J8779k00028j74253k88J96847k15797j88694J53212l5722J39215
16738g6989K37702r6761j55365K60003L00806j31383j41509j20576k5387P1240
16728A21781o4092M4725M5152N5590l6872k04386k8293j76889r5613q0530J92732
16717b26695J28858j3493P4208L15142j90499j22530j21072J66869j4741O9144
16707F5191R9216J71773k43712l4360l3820R574q5221J0760l406K4915j12995
$$ plain form
16780 88639 -74408 -56921 121301 248183 114237 -12775 -62271 -31860 102586 -5989
16770 -5989 -83340 -91110 31031 349349 354994 111218 -74699 69249 322828 278721 238349
16759 238349 77717 -62105 -232933 -168813 -32576 52030 132429 121847 383 130118
16749 130118 229740 248519 48491 -125762 -126050 70797 -145000 -333694 -180482 -216204 -76989
16738 -76989 160713 63952 -91413 168590 469396 338013 196504 75928 50541 121781
16728 121781 57689 102414 147566 203156 166284 -38102 -66395 -243284 -338897 -419427 -226695
16717 -226695 -97837 -111330 -37122 278020 87521 -35009 -156081 10788 -3953 65191
16707 65191 164407 336180 92468 58108 24288 33862 -51359 -40599 -44005 -19090 -132085
16696a32085l6303J24866O0728r2501Q7994o4033J28286m0989j08186M8607j6926
16685d0542p4656P9629j03343j5643K40033J74117J49673k9024r0157M688j21423
16674A73352J7313P5971k15245M1203p8159R9817p9077q9779M2480j84864j22861
16663c19849k9201Q2901K32362j02450m866q041J98859J25438j61484o0105K72887
16652B26451L5388R5424M0905n910p5375j00486l7984j57899K0038p4921j54597
16641a88966N7401l6767l5530J27169K98849R898k20155J65633O5259J36558j21729
16630B57620k5465j15835j36874Q0578j67672q7945P3815J48508R0661j2490p1799
16619C3102k98139M7293L88336K94704m4210m47j04609n8737j0307p4136j292
$$ plain form
16696 -132085 -168388 -43522 17206 -75295 12699 -51334 76952 35963 -72223 -23616 -40542
16685 -40542 -115198 -35569 -138912 -154555 85478 259595 409268 380244 290087 294775 173352
16674 173352 190665 266636 51391 92594 14435 114252 35175 -54604 -12124 -196988 -319849
16663 -319849 -349050 -266149 -33787 -136237 -141103 -149144 49715 175153 13669 -46436 226451
16652 226451 261839 357263 398168 392258 316883 216397 178413 20514 40552 -34369 -188966
16641 -188966 -131565 -168332 -203862 -76693 222156 232054 11899 177532 242791 379349 257620
16630 257620 232155 116320 -20554 60024 -107648 -195593 -121778 26730 117391 104901 33102
16619 33102 -265037 -217744 170592 465296 421086 420639 316030 257293 246986 172850 171558
16608A71558j32447n9323l2283K80446o0180p2868L5406l70460k81236Q4726J86598
16597b50063j50890j33711q7872N1028K92965P7858J64133L22555P0850r1820
16587B65033q8133N596j2941q0900q0409l8789J73843J24849o6001n2394K27747
16576C77501J8046j46209j15553j92086j37729K3591q3445N3205P8803L1596p6192
16565a68472O9192P7596n097j34877J94241J93610p218N4779J746k18169j35489
16554g8158J95279m6922j31817o3572J60541O9057j29031K9183K79534r2234m7088
16543A44772j07081j15597j59593m1660J23652R3879j21454J33043l3324K6023
16533e7340n3066o3845j60975r1202N2512K14147J57365j36030k48275P8271K02539
$$ plain form
16608 171558 39111 -20212 -52495 227951 167771 94903 130309 -240151 -521387 -436661 -250063
16597 -250063 -400953 -534664 -622536 -571508 -278543 -200685 -36552 286003 356853 265033
16587 265033 176900 182496 169555 88655 8246 -30543 143300 268149 202148 149754 377501
16576 377501 395547 249338 133785 -58301 -196030 -172439 -255884 -202679 -123876 -92280 -168472
16565 -168472 -99280 -21684 -26781 -161658 32583 226193 218975 273754 275500 57331 -78158
16554 -78158 117121 70199 -61618 -125190 35351 104408 -24623 4560 284094 191860 144772
16543 144772 37691 -77906 -237499 -279159 -155507 -61628 -183082 -50039 -83363 -57340
16533 -57340 -110406 -174251 -335226 -426428 -373916 -159769 -2404 -138434 -386709 -308438 -105899
16522a05899N5473j17421o2776j28610R1086L16639K96636J16127j37509k14892
16512A08854q7253J67560J47293q8033j25904k5734J64824N3225K07176k68720
16502B53288r1229j73169l4671K85192j2259j05960K40514J22417j75999j46491
16492A61633m2790q8497j85982M8790K88446L7350k06596k2551p2595p6082M8149
16481a10725l5676j67279Q441j20891l0146J54037L06382J64828j63315k00096
16471a94440j29450l1679o1726J57863q3186j00193L07148K05369Q9017J41608
16461C00331J9350J72648M887J4265n927j78376l66030n5349R3800l3719j33508
16450a67628K81128k53k48035Q3062R3671q5246J7012R1578m4205m8067j07991
$$ plain form
16522 -105899 -50426 -167847 -230623 -359233 -268147 48492 345128 461255 323746 108854
16512 108854 21601 189161 336454 248421 122517 96783 261607 314832 522008 253288
16502 253288 162059 -11110 -45781 239411 227152 121192 361706 484123 308124 161633
16492 161633 118843 30346 -155636 -106846 181600 218950 12354 -10197 -82792 -158874 -110725
16481 -110725 -146401 -313680 -305239 -426130 -456276 -302239 4143 168971 5656 -194440
16471 -194440 -323890 -355569 -417295 -259432 -342618 -442811 -135663 69706 158723 300331
16461 300331 319681 492329 497216 511481 505554 327178 -38852 -94201 -401 -34120 -167628
16450 -167628 113500 113247 -134788 -51726 41945 -43301 -26289 65289 21084 -26983 -134974
16439a34974o5118R4914J38015Q5703J3877p2791j21932J29876K49496Q542k27242
16428I8366P7812r1156j13245j202j81954J37602n1674l60620k5073N13220M3363
16417D5439k77245J37774O0526R462J54881j73623l0606O1489o5170k40547R3631
16406b23989K42049L3919j63698P5585j33592j16538Q9457L27185k7822j83671
16396h1115j46559J8850L0986m1490N8299K3326J04864J40660k13419j34766J03366
16385a36998J36209J23060r4322M2531J05054l4430K6579k90173j33923R4088
16375a62325R2783k138k867J33794J92773o8807J958j11951j63659J481J76155
16364H7197J01723l43148J63552L58109l14008l22315L6375K78453L8967l4198
$$ plain form
16439 -134974 -200092 -105178 32837 118540 132417 59626 -62306 67570 317066 325608 98366
16428 98366 176178 85022 -28223 -29425 -211379 -73777 -125451 -486071 -511144 2076 45439
16417 45439 -231806 -94032 -33506 -24044 130837 -42786 -73392 -11903 -77073 -317620 -223989
16406 -223989 18060 51979 -111719 -36134 -169726 -286264 -196807 130378 102556 -81115
16396 -81115 -227674 -208824 -177838 -219328 -161029 -137703 -32839 107821 -105598 -240364 -136998
16385 -136998 -789 122271 27949 70480 175534 141104 167683 -122490 -256413 -162325
16375 -162325 -69542 -71680 -74547 59247 252020 183213 185171 73220 -90439 -88958 87197
16364 87197 188920 -154228 9324 367433 53425 -268890 -232515 45938 84905 50707
16354E0707J96690O8258j06303p394k9852M5984J0979J02184l8408m3283j29577
16343A19985Q1707k43617p7511K78654K04623k04579j00050l699L9008J62617
16333B57138Q595M6456n378j97550k89174o1923M6743J63870J87040j25832J2489
16322D2474l5158n2657q1435n371p5397j57613J49038N2385R222o8686L1315K9158
16310a62725J08237J03580p6995k86568j3673J55068N8604l9562J4693L4469P818
16299i7054L3116j02670r4503q458K80894n5415P7433Q4404j01291L9302l5649
16288B0109j0512j17457p405M5929l3985j78784J33979J42567K7531J63473P0283
16277B55728r486j86135o1121L3193Q4493p1052j75112o9810q4986J12280Q3384
$$ plain form
16354 50707 247397 315655 209352 201958 172106 218090 229069 331253 292845 249562 119985
16343 119985 201692 -41925 -119436 159218 363841 159262 59212 55513 94521 257138
16333 257138 265733 312189 306811 109261 -179913 -241836 -195093 -31223 155817 29985 42474
16322 42474 7316 -45341 -126776 -132147 -207544 -365157 -216119 -163734 -154512 -223198 -191883 -162725
16310 -162725 -54488 49092 -27903 -314471 -328144 -173076 -114472 -154034 -139341 -104872 -97054
16299 -97054 -63938 -166608 -261111 -269569 11325 -44090 33343 117747 16456 55758 20109
16288 20109 9597 -107860 -115265 -69336 -103321 -282105 -148126 -5559 21972 185445 255728
16277 255728 246242 60107 -1014 32179 116672 45620 -129492 -199302 -284288 -172008 -88624
16266h8624O9383M9049L5207j41299l1247J7407J30097k76809j03637J42674l7148
16255b34947M4189J69735j10752j08847J721K95689j20125k04014j76570K18877
16245b25044J75316k36634j97189J04830R0344J45991K38801l4680k42636p7422
16235b58323j7433j1135l6982J41l8615R313R8969J13416J32088P9345M3047r9622
16223A4209p5677M5031J42123J09816j78954j56894l6342J60856k30931r9889
16213c06652R1861L5907L2290N2228r0086J58916l0778j4935j07967k08085M9047
16202c38254L3183L7741N8803n2186J03726J13794P3503J001k36158j51373p4882
16191d31102j66255L5014q2599O1646K83381L00000P2547Q7827p934Q3542K1408
$$ plain form
16266 -88624 -19241 29808 65015 -76284 -107531 -90124 39973 -236836 -340473 -197799 -234947
16255 -234947 -190758 -21023 -131775 -240622 -238901 56788 -63337 -267351 -443921 -225044
16245 -225044 -49728 -286362 -483551 -378721 -288377 -142386 96415 61735 -180901 -258323
16235 -258323 -275756 -286891 -323873 -323732 -362347 -353034 -254065 -140649 -8561 70784 113831 14209
16223 14209 -61468 -16437 125686 235502 56548 -100346 -136688 24168 -206763 -306652
16213 -306652 -214791 -178884 -146594 -94366 -184452 -25536 -56314 -71249 -179216 -387301 -338254
16202 -338254 -305071 -267330 -208527 -260713 -156987 -43193 30310 31311 -204847 -356220 -431102
16191 -431102 -597357 -562343 -644942 -583296 -299915 85 72632 160459 152525 236067 257475
16180B57475q3133M7316K78698L246l25147l83342j36915L3814J00034J29938
16170g8016K25555J04389J81132k46518k60700L1937L242r111r6970J04070M475
16159c6515R0244N0255J96903j60886q6810j71152M5760j16086R782J9832o4271
16148b22944K4926J90978K52653j59760k16371N1533N9791k3835J87374L04034
16138D48379j0573j47210l0060Q3033k46792j38673m7394J64687K71838p1054
16128B76181q2503R2866j40848j09925j3360j76728j97754J96810N6832J56154
16118E7725N6642j46428k73705L7365J71451M1843o9886R7279j7458j03888N5872
16107i3188K3894o9390M5263l5059Q6990m9247J05830M36879p7060l52893K34649
$$ plain form
16180 257475 174342 221658 500356 503602 178455 -204887 -341802 -307988 -207954 -78016
16170 -78016 147539 251928 433060 186542 -74158 -42221 -38979 -48090 -145060 -40990 -36515
16159 -36515 53729 103984 300887 140001 53191 -117961 -72201 -188287 -178505 -158673 -222944
16148 -222944 -198018 -7040 245613 85853 -130518 -78985 -19194 -43029 144345 448379
16138 448379 437806 290596 260536 343569 96777 -41896 -89290 75397 347235 276181
16128 276181 193678 286544 145696 35771 22411 -154317 -352071 -155261 -98429 57725
16118 57725 114367 -32061 -305766 -268401 -96950 -55107 -124993 -27714 -45172 -149060 -93188
16107 -93188 -69294 -138684 -93421 -128480 -41490 -90737 15093 451972 374912 22019 256668
16096B56668N5493j73204P9866j04643J29516P6653m27592l07245J58500L3529
16086b22459J76560N2983R2044Q7747r2487l45919l18109P6082L80299N4890P8834
16075B0465j65784J56436K02328P081j44843O9359m4243J3595L7733L1344q3797
16064I9674q0939k9557k6381k38035J94137J16117o0847r6193n9796M1519j6727
16053a57028J02518j9870R5838j47094l4861n39O7994O5427J621r7585j14316
16042b37895P6390j10328j71525J99718K37463m534q6954m9208J49012p1916k17917
16031b87694o9741J36338J2439P6268j17744P6713p147K47396J12751J43201N801
16020C28581j08613j84926J39911J03167o9951J4119j19778r9959k28922j48024
$$ plain form
16096 256668 312161 138957 218823 114180 243696 320349 -107243 -414488 -255988 -222459
16086 -222459 -45899 7084 99128 186875 94388 -251531 -569640 -493558 -113259 -58369 20465
16075 20465 -145319 11117 213445 220526 75683 145042 100799 114394 152127 183471 99674
16064 99674 18735 -10822 -37203 -275238 -81101 35016 -25831 -122024 -181820 -140301 -157028
16053 -157028 -54510 -74380 21458 -125636 -160497 -161036 -93042 -27615 -25994 -123579 -237895
16042 -237895 -161505 -271833 -443358 -243640 -6177 -10711 -97665 -146873 2139 -69777 -287694
16031 -287694 -357435 -221097 -208658 -132390 -250134 -173421 -180568 66828 179579 322780 328581
16020 328581 219968 35042 174953 278120 208169 222288 102510 2551 -226371 -374395
16010c74395J12426J8141K41083o1414K9831j05193K592J17015J35242O4436j15850
15999F3914k11372o9410K48070J49428k87213o6461J63185j25271j1911m2862
15989a89903j02854J93524N9340m9207j41496M961J21798J78532M2323m3598O2985
15978A36405N3269o8535j37757K22720q0216o0168J16023K8219k86477j30663
15968b07180P1350K13660j7537k90112j01116j61409k67054J48241M66802L75882
15958B31527R3454j01063J83519j12721O14j54085j65967j87885M5367J34331
15948c2909k34920p0013J38262l0496Q7518k6876N1579J01217o8252J8798J24269
15937E8177o41n56J07794J20219R5152J8528J6472j51710j14991L380l8537n9322
$$ plain form
16010 -374395 -261969 -243828 -2745 -64159 -34328 -139521 -136929 -19914 115328 179764 63914
15999 63914 -147458 -216868 31202 180630 -106583 -173044 -9859 -135130 -147041 -189903
15989 -189903 -292757 -99233 -39893 -89100 -230596 -225635 -103837 74695 117018 73420 136405
15978 136405 189674 121139 -16618 206102 125886 65718 181741 209960 -76517 -207180
15968 -207180 -135830 77830 60293 -229819 -330935 -492344 -759398 -611157 -144355 231527
15958 231527 324981 223918 407437 294716 295330 141245 -24722 -212607 -167240 -32909
15948 -32909 -267829 -337842 -199580 -230076 -142558 -169434 -117855 -16638 -84890 -66092 58177
15937 58177 57536 56980 164774 284993 380145 398673 415145 263435 148444 151824 113287 53965
15925E3965R9035j11254J1577J79691l9107K8267m1806O7475p0395M4435K50508
15914D72391j12141k08761j01447R012q1176r0487J16676R1955K0554n9851j7210
15903C9515l9552q667l0040j6658O4848k4669Q8159j4912o8057J80270L3925j0033
15891A94129J18531k19267r4036L4885l5143K7165L5887k64136l8739J61205n1862
15880a31381k67368J45297L08450M4158j91596J105K14976J17851J8389o5424
15870A94457q7756J83262J60830k51405l09240j21502n5948J59613M7198O746
15860g3745J57289L4632k7511Q8288M0552M1846j31220k17036J19175J2726p4963
15849b9967o2841k03j2781p4181j87220k15339J686L51289J55997N8922L7769
$$ plain form
15925 53965 153000 41746 53323 233014 193907 222174 180368 247843 177448 221883 472391
15914 472391 360250 151489 50042 59054 -22122 -112609 4067 96022 116576 56725 39515
15903 39515 -37 -8704 -38744 -55402 9446 -15223 72936 58024 -10033 170237 204162 194129
15891 194129 312660 93393 -643 34242 -901 26264 62151 -201985 -240724 -79519 -131381
15880 -131381 -398749 -253452 54998 99156 -92440 -91335 123641 241492 259881 194457
15870 194457 106701 289963 450793 199388 -109852 -231354 -287302 -127689 -80491 -73745
15860 -73745 83544 118176 90665 178953 219505 261351 130131 -86905 32270 44996 -29967
15849 -29967 -92808 -93011 -105792 -179973 -367193 -582532 -580846 -229557 -73560 -14638 23131
15838B3131j29953m754K86671L47629j04920j02122k58472j67685j61068n7662
15828c29205J74342J56454Q8071j06619j53179N8172m8824j51140J80700K10647
15818G9419K0193p281q2582j33792l0635L9375j26076r9051j0462L07850K52748
15807B09706K17624M0207q7634l42274o6955J48701P0963J04615J19818j09632
15797C05139j71829o4541j09640L3731K546R4852o9021j36677N0851J2190k36569
15786b88968J41233J60283N6078j8854j70486J39402K39163J3456k58484n482
15776G341p8956J08134L77804N0113p9940k66275m1280O1818L5300j72262k34961
15765b33164l2856J34635k1595q9903K91057N6898j47913l3746k1732O7255J02263
$$ plain form
15838 23131 -106822 -111576 175095 522724 417804 315682 57210 -110475 -271543 -329205
15828 -329205 -154863 1591 89662 -16957 -170136 -111964 -160788 -311928 -131228 79419
15818 79419 99612 92331 9749 -124043 -154678 -115303 -241379 -340430 -350892 -43042 209706
15807 209706 427330 467537 379903 37629 -29326 119375 190338 294953 414771 305139
15797 305139 133310 68769 -40871 -7140 -4594 90258 21237 -115440 -64589 -52399 -288968
15786 -288968 -147735 12548 68626 49772 -120714 18688 257851 271307 12823 7341
15776 7341 -71615 36519 414323 464436 384496 118221 76941 138759 174059 1797 -233164
15765 -233164 -266020 -131385 -152980 -242883 48174 105072 -42841 -76587 -98319 -31064 71199
15754G1199m8152p7280o1970q754K7984L49847N52929J94990j93117j62162L70308
15743A015822Q40970J479019J542479O99694M29207N17454O52469P2502j655556
15734E594060j821271j263185n19683l96711l66112j15757J44134j29170l34932
15725G91373j01086K7262j34969j34474L7879P7583o3196j30814N251j24457N98
15714B50950J23099j8854j5760O4577m5459k85195l11853J73273J34093M09359
15704D78230N6724l63341q5039m7252O519K97206J24635K18553j11069j70914
15694D04252k04215q1117O416l15662k08103L90619L36228r1867q380R5167k79176
15683D4162p5038l89000k09899n4533K21155J73528J07190K08438J89219k44635
$$ plain form
15754 71199 23047 -54233 -116203 -124957 -96973 252874 805803 1000793 807676 645514 1015822
15743 1015822 1856792 3335811 4878290 5577984 6007191 6524645 7177114 7249616 5594060
15734 5594060 3772789 2509604 1989921 1593210 1227098 1111341 1255475 1126305 791373
15725 791373 690287 717549 582580 448106 485985 563568 500372 369558 374809 250352 250950
15714 250950 374049 355195 339435 404012 358553 73358 -238495 -65222 68871 478230
15704 478230 534954 171613 86574 39322 45841 343047 467682 686235 575166 404252
15694 404252 200037 118920 125336 -190326 -398429 -7810 328418 236551 228171 323338 44162
15683 44162 -30876 -419876 -629775 -684308 -463153 -289625 -182435 26003 215222 -29413
15673b9413m7937Q543J05633J95560p3511k50483j21675r1436r1257K39346L53898
15662A97268k57009j93122J0731L2059M6108L12338j47355j86710l1602N3362
15652a63932K87821P4447k83476j14014o4557K35123n3348o6472J52649K19934
15642B24175n9649j09807J25205P3699J98140j45329j95351J3821r7554j00082
15632g2732k5338J35311J53284J49606j29727k07463M6370P4798Q4402j05682
15622A02829j2647j55239l2561K39624J97188j01010j30615j27503j0993k40801
15612b71728M6759L7274k0479Q0447p4030J08590n9500J82260N4462j34337J71919
15601A21637j54566j86616j33747L8702O0072K02623J57695O6279L02317p8259
$$ plain form
15673 -29413 -77350 -68807 36826 232386 158875 -91608 -213283 -304719 -395976 -156630 197268
15662 197268 -59741 -252863 -242132 -210073 -163965 148373 1018 -185692 -217294 -163932
15652 -163932 123889 198336 -85140 -199154 -263711 -28588 -81936 -148408 4241 224175
15642 224175 164526 54719 179924 253623 451763 306434 111083 124904 27350 -72732
15632 -72732 -98070 37241 190525 340131 210404 2941 49311 124109 208511 102829
15622 102829 90182 -65057 -97618 142006 339194 238184 107569 -19934 -30927 -271728
15612 -271728 -224969 -187695 -208174 -127727 -201757 -93167 -152667 29593 84055 -50282 121637
15601 121637 -32929 -219545 -353292 -314590 -254518 -51895 105800 172079 474396 396137
15591C96137k06861k01654l090K250m0767J4743m8127k4197J46032l9370l0311
15580c5215K121J62160k0535O7401K79261k9665j20796j84495j12109N8072m3774
15569B2426r5809o3361J40080K28699J08558l4888k65717j89696K08151n7677
15559G66L774J13042O0185p5983j98696k25271q0969J04862L53725P6951J92960
15548C25346J07926j28507k65464p6535k63392j30999l56402k7925K41285J91943
15538c82724K70122n8497j18740k50937M8145M6414j96064K5928J36635K49899
15528b29819P9850j56183O1532J84249n3712k21503p4269L0137j12115K70699
15518b21134K77987j35064J1325J55585J01642N4751L1686j36396J0400J82935
$$ plain form
15591 396137 189276 -12378 -15468 -13218 -53985 -39242 -87369 -111566 34466 -4904 -35215
15580 -35215 -33094 129066 108531 175932 455193 425528 304732 120237 8128 66200 22426
15569 22426 -73383 -136744 3336 232035 340593 305705 39988 -149708 58443 766
15559 766 4540 117582 177767 101784 -96912 -322183 -403152 -298290 55435 132386 325346
15548 325346 433272 304765 39301 -37234 -300626 -431625 -788027 -815952 -574667 -382724
15538 -382724 -112602 -171099 -289839 -540776 -492631 -446217 -642281 -616353 -479718 -229819
15528 -229819 -149969 -306152 -244620 -60371 -114083 -335586 -409855 -379718 -491833 -221134
15518 -221134 56853 -78211 -66886 88699 190341 245092 276778 140382 150782 333717
15508C33717o1157m64110j76010M2156R4373K45664L7875j48342m1641j95674
15498c33149p5671J54086K01585k334p6097N0817j39642J62085K01334N341l11632
15487a63277j17537J44536K53251J48137K9557q7825k74758l19206N5877K90135
15477d1110J60663L6549k48057k62527m0469k40942j14737K60205K81416J53201
15467e5808j48377n518K10277q5104j85934O0201j02329j22631m190N7012J22585
15456b59816O5306L2475o6120p3902L19410J96070r5494j41968l2344J92028K0410
15445A56055K04387J34940o0922j63400l18533o893K24353p7616K5278K958j16755
15434C852j29123J02243j87085k5765J74832j2948J74436J45518j53063k80837
$$ plain form
15508 333717 272560 -191550 -367560 -325404 -231031 14633 52508 -95834 -137475 -333149
15498 -333149 -408820 -254734 -53149 -55483 -131580 -80763 -220405 -58320 143014 148355 -163277
15487 -163277 -280814 -136278 116973 265110 294667 206842 -67916 -387122 -331245 -41110
15477 -41110 119553 156102 -91955 -354482 -394951 -635893 -750630 -490425 -209009 -55808
15467 -55808 -204185 -209703 574 -84530 -270464 -210263 -312592 -435223 -439413 -382401 -259816
15456 -259816 -194510 -162035 -228155 -302057 17353 213423 117929 -24039 -56383 135645 156055
15445 156055 360442 495382 434460 271060 -47473 -54366 169987 92371 117649 120607 3852
15434 3852 -125271 -23028 -210113 -235878 -61046 -73994 100442 245960 92897 -187940
15424a87940J41563O3490L1354r5421k26223R311K7455r727L9852k44722n8791
15413e09799O9434j12283M1870J21055p6710N4848N9131K51301L19208J3238j78139
15402E3154r6098O6208Q409J36174O2993q4740m0451J09318o8126j46421P0440
15391G0860L9493o7728k5813k03855o1191L3169J54216m7832P6389j38883k61185
15380d32360l1393OJ99320J75968j1673K94894p1197K7906J27110J12513r0411
15369C00683j12914K29880p0528n9796L0782q3858j36363n8859J86675k57743
15359c2041k96648J51263L88710J77390j12767N3669J79220j59680k68534k00666
15349a20084q7969K7536J08595J58918j34106k15375m9495M8257r3674K85381
$$ plain form
15424 -187940 -46377 17113 48467 -46954 -273177 -263866 -236411 -246138 -206286 -451008 -509799
15413 -509799 -440365 -552648 -510778 -389723 -466433 -411585 -352454 -101153 218055 231293 53154
15402 53154 -42944 23264 31673 167847 230840 146100 105649 214967 146841 420 70860
15391 70860 110353 42625 16812 -187043 -248234 -215065 -60849 -108681 -32292 -171175 -432360
15380 -432360 -463753 -463747 -264427 -88459 -100132 194762 123565 151471 278581 391094 300683
15369 300683 187769 417649 347121 287325 318107 234249 97886 39027 225702 -32041
15359 -32041 -328689 -177426 211284 388674 275907 329576 508796 349116 80582 -120084
15349 -120084 -208053 -180517 -71922 86996 -47110 -262485 -311980 -263723 -357397 -72016
15339g2016j26674o165L34539Q0542j65500j5644o156J38938j28889k25209N3664
15328a38570L4922o5317o5074q746j12335q8758J15583J11646K1495k11289N7647
15317c48796J29473J41525M6589j71772m6018L02754L34406k26625k94239j99951
15307c32654n1965J94589J60742J2271K1570K7537K1439k32824R7563p7437J391
15296a57778J15067Q2645J70197K0346q7287j23918k25955K30879J22526k4266
15286A22456k75796n3571L8168L8338r5255J30939P4064j44674l7885j15043L8949
15275b79310J26496J22828m9617k8776L8J02068J40668l74717q7554J28296K24503
15264B4923j33403r3633J84502J45931r9808j43141J26194L74409K27284p7477
$$ plain form
15339 -72016 -198690 -204855 129684 210226 44726 29082 22926 161864 32975 -192234 -138570
15328 -138570 -103648 -168965 -234039 -242785 -355120 -443878 -328295 -216649 -195154 -406443 -348796
15317 -348796 -219323 -77798 -31209 -202981 -248999 53755 388161 161536 -132703 -332654
15307 -332654 -384619 -190030 -29288 -17017 4553 32090 53529 -179295 -81732 -159169 -157778
15296 -157778 -42711 39934 210131 230477 143190 19272 -206683 24196 146722 122456
15286 122456 -153340 -206911 -168743 -130405 -225660 -94721 -20657 -165331 -203216 -318259 -279310
15275 -279310 -152814 -29986 -79603 -108379 -108341 -6273 134395 -240322 -327876 -199580 24923
15264 24923 -108480 -202113 -17611 128320 28512 -114629 11565 385974 613258 535781
15254E35781N1977l98024q8120J45210j08931k56886k4287P5864n8462N7629K12979
15243A44730j18804Q0597Q9475q3752q8734Q9378j67569r0469Q1241j15478k2905
15232b02290p5096K23265K06697q0574o9397r8114k8993r7601K73912Q5366l23131
15221a85956k16844R5737p2260l6809j16926Q0112M51396J29604J29451k4370
15211B33135j81614k13046m48329Q8181N738K75671J59666J06449o3134j24668
15201a61951n820j22594N2881k8583m0317J75275j3509m8890J32256J04213J81327
15190B24288Q060j53323k13965K14519L0885J02875J61720k03248l32655j40031
15180c00875r6417j51671j61905J12885N7663L6114K44190J77672J13823J45539
$$ plain form
15254 535781 587758 189734 101614 246824 137893 -118993 -143280 -67416 -125878 -68249 144730
15243 144730 25926 106523 195998 112246 23512 112890 -54679 -145148 -63907 -179385 -202290
15232 -202290 -277386 -54121 152576 72002 2605 -95509 -124502 -222103 51809 137175 -185956
15221 -185956 -402800 -307063 -379323 -416132 -533058 -452946 -1550 128054 257505 233135
15211 233135 51521 -161525 -609854 -521673 -515935 -240264 -80598 25851 -37283 -161951
15201 -161951 -167771 -290365 -237484 -266067 -306384 -131109 -144618 -193508 -61252 42961 224288
15190 224288 232348 79025 -134940 79579 110464 213339 375059 171811 -160844 -300875
15180 -300875 -397292 -548963 -710868 -597983 -540320 -504206 -260016 -82344 31479 177018
15170A77018p1065j19101j41742k05465J58431q3560P6337K01802N4910R7655
15160A45220k2508j4743M496j61998j67866j97715j67828L04652L1511J00581
15150a46198l2337M7178J50789L20684M6395k47630M9388J21731j71124j83860
15140d4984j16072K31809J27949J2276k18244j46120n37149j78706K25315J80671
15130d63255M0823K31825K19290J14869L2549r51j13697n1059p5201k8862q5787
15119a79456n6734m1872r5629O4628O9476N7466K16513M870J3916L0340l7026
15108D6492j57179K5448J86370k5119K3278p5267K44739r0537k53138N8822L323
15097a2768o3120K82502J10638P9525j63469m0089J32038k81419r2349P2726j29180
$$ plain form
15170 177018 105953 -13148 -154890 -360355 -201924 -285484 -209147 -7345 47565 145220
15160 145220 122712 107969 112465 -49533 -217399 -415114 -582942 -278290 -246779 -146198
15150 -146198 -178535 -131357 19432 340116 386511 138881 188269 310000 138876 -44984
15140 -44984 -161056 70753 198702 210978 -7266 -153386 -690535 -869241 -643926 -463255
15130 -463255 -422432 -190607 28683 143552 176101 175150 61453 10394 -64807 -93669 -179456
15119 -179456 -236190 -278062 -373691 -309063 -239587 -182121 34392 39262 53178 83518 46492
15108 46492 -110687 -85239 101131 76012 99290 24023 268762 178225 -74913 -16091 -12768
15097 -12768 -75888 206614 317252 396777 233308 193219 325257 43838 -48511 24215 -104965
15086a04965o1544R8710Q1947P1970J73532j08017p8122J70674L0081k3514j72860
15075G7892k99655q7048J36297J11317o3814k42988j27657k9808p8861J81138
15065d23187K09022q8371k9112L02498r2197K31523M265k03107m1864l2138k0396
15054a83064J96623J85158O0778j88911q6275q1082k32565n0299o3822J21897
15044c21562K49526L08307J81318j18208l60858j8838j94750J6407P2060M2986
15034a43612n1331J06430j4675J37960K10563M090q6550K6005R0794j31810j9920
15023A27944j04149k14114j06716J1149R3435N9363j6726K30260Q755M208M1552
15012A34961P4407k2467J19694j30964j12888j02028O7468J59608L2777k24212
$$ plain form
15086 -104965 -166509 -67799 14148 86118 259650 151633 73511 244185 274266 250752 77892
15075 77892 -221763 -308811 -172514 -61197 -125011 -367999 -495656 -525464 -604325 -423187
15065 -423187 -214165 -302536 -331648 -29150 -121347 110176 114441 -88666 -130530 -162668 -183064
15054 -183064 13559 198717 259495 70584 -15691 -96773 -329338 -379637 -443459 -321562
15044 -321562 -72036 236271 417589 299381 -61477 -80315 -275065 -258658 -186598 -143612
15034 -143612 -194943 -88513 -103188 34772 245335 249425 162875 188880 279674 147864 127944
15023 127944 23795 -190319 -297035 -285886 -192451 -133088 -149814 80446 89201 93409 134961
15012 134961 209368 186901 306595 175631 62743 -39285 28183 187791 220568 -3644
15002c644O4251L3261k6679J83771k3046j94969j3269K4293Q9790M1113J03097
14991B77969j07342M5159k11385j15891L1280K18713N7105j06219k04080k39532
14981c54223K2806J07672o3595m8601K561J98523K55825J05312K6471K7548k31704
14970D8595k1638K51270Q2998l08132j56066J92121o8818k09018L0012J28181
14960c0495k0302j80017k02651R2801K69815K55361p6135J46351k39746k83044
14950b68062m1187P5924J46557L33597J15662l59110k38748J79469O9859J03265
14940A17226r3169k2619o4764r3038j52592m9247L6152J95758J32433r1659m87
14929h6006L3998J83489j04546O1997n6247L0486R591r3817m7582N9856K4853
$$ plain form
15002 -3644 60607 93868 67189 250960 227914 32945 19676 43969 133759 174872 277969
14991 277969 170627 215786 4401 -111490 -80210 138503 195608 89389 -114691 -354223
14981 -354223 -331417 -223745 -287340 -335941 -333380 -134857 120968 226280 252751 280299 48595
14970 48595 26957 278227 361225 53093 -102973 89148 20330 -188688 -158676 -30495
14960 -30495 -50797 -230814 -433465 -340664 -70849 184512 108377 254728 14982 -268062
14950 -268062 -309249 -233325 -86768 246829 362491 3381 -235367 -55898 13961 117226
14940 117226 24057 1438 -63326 -156364 -308956 -358203 -322051 -126293 6140 -85519 -86006
14929 -86006 -52008 131481 26935 88932 32685 63171 72762 -21055 -68637 -8781 16072
14918A6072N1636J67689N4975n9384j2362J19970k8328J27455O0474K6349M2151
14907E66697J6024p2009M5491k73778l21906j19162P7254K67944o1855J68324
14897B93024J17163l6718p9536J53829k90430j54991j7113r2591j19358P4878
14887a51843k175k4979k974M9623k4J36056o47p1854R2149q6569N7189K4773M0347
14874E9072K3690P3770k23498r3832J52754K36387k982j62066k00143O8573M1162
14863b7113l18626l1438L23842O6743m8238q0712r5761J16687N7664J57039P5223
14852A95310j02279J01465Q3023p7971n5933p209k11226K05262J21681j34256
14842A17867l2257J6714k3868L1699m41118j65315K89705J31995J78505J18544
$$ plain form
14918 16072 67708 235397 290372 230988 218626 338596 310268 437723 498197 524546 566697
14907 566697 582721 510712 556203 282425 -39481 -158643 -81389 186555 124700 293024
14897 293024 410187 373469 293933 447762 157332 2341 -14772 -107363 -226721 -151843
14887 -151843 -154018 -178997 -181971 -132348 -132372 3684 3037 -68817 23332 -63237 -6048 18725 59072
14874 59072 82762 156532 -66966 -160798 -8044 228343 225361 63295 -136848 -68275 -27113
14863 -27113 -345739 -377177 -53335 13408 -34830 -115542 -211303 -94616 -36952 120087 195310
14852 195310 93031 194496 277519 199548 143615 136406 -74820 130442 252123 117867
14842 117867 85610 102324 78456 110155 -330963 -496278 -206573 -74578 103927 222471
14832B22471P6706l40195K7564O1482k4737J04807N1526L2214J35713k1469j42720
14821A83362k59020k12475n6747j430K03352J03479L36818K53325k00045l91135
14811d0516K4996J26429j0225R5330k48247O0847K46012j6520l2175r7477k26836
14800a18382P9825N7237j66838o7907J230r3918P6697L347P082J36422j11984
14789a97189J26273K85698j09208O9755J8097K3309j28719O6394L2812k53147
14779f5925j9195M7596O053n2541M7149p8376j89719K52684J0845J47054l3049
14768G2576J84022J51602r7706j27377J07539O8340k27857p8628j14913m3586
14758a05988j4399R4200K74036K30762J26626k7113j09842n3322j93468q6623
$$ plain form
14832 222471 299177 -41018 -13454 48028 23291 128098 179624 211838 347551 326082 183362
14821 183362 -75658 -288133 -344880 -346310 -142958 -39479 297339 550664 350619 -40516
14811 -40516 -15520 110909 100684 196014 -52233 8614 254626 238106 205931 108454 -118382
14800 -118382 -38557 18680 -148158 -216065 -214835 -308753 -232056 -228709 -221627 -85205 -197189
14789 -197189 -70916 214782 105574 175329 193426 216735 88016 154410 187222 -65925
14779 -65925 -85120 -37524 -31471 -84012 -36863 -115239 -304958 -52274 -41429 105625 72576
14768 72576 256598 408200 310494 183117 290656 358996 131139 52511 -62402 -105988
14758 -105988 -120387 -26187 247849 478611 605237 578124 468282 414960 221492 134869
14748A34869R5587k06784j69830J82311K57097K00800R5614Q924n9864k9927j18134
14737C90663k25343P8926P0220j46726m0999J02682k88882j14200N3839J53134
14727C3314o8846j40884n2250r9637R4380R0653J24425N9438O0754O4753K0449
14716A86549j1189n876j22799n7096k09501l04730L68361K64376j1859j85517
14706h9281K2462m9566O2652J19733p1577k04382j54703J13563j15497k23346
14696e89942n3630K80175P161m1041K26605J00817j01410p3674J45909K795J23913
14685B7678P7306O1440j384J34317Q0588j74615r5572o4292j57284l82l8579M2970
14673a07809j46609J90856K5334l7895o2024J59006R0327k36105M25558L6571
$$ plain form
14748 134869 230456 23672 -146158 36153 293250 494050 589664 598588 538724 508797 390663
14737 390663 165320 244246 314466 167740 126741 229423 -59459 -173659 -119820 33314
14727 33314 -35532 -176416 -228666 -328303 -233923 -143270 -18845 40593 101347 166100 186549
14716 186549 175360 169484 46685 -10411 -219912 -524642 -156281 108095 96236 -89281
14706 -89281 -66819 -116385 -53733 66000 -5577 -209959 -364662 -251099 -366596 -589942
14696 -589942 -643572 -363397 -356236 -397277 -170672 -69855 -171265 -244939 -99030 -96235 27678
14685 27678 104984 166424 165040 299357 379945 205330 109758 45466 -111818 -112200 -150779 -107809
14673 -107809 -254418 -63562 -38228 -76123 -138147 20859 111186 -124919 300639 337210
14663C37210K0506J75370j9267k61940j55056L9685j21551k07563j26167r804
14653c28577k23308n2198J95360L81134M2587N586j0710j01160J76227K62518
14643C47459n3632L0827j34586q0827l49932L8131L45124J33978k2456k21184
14633C2902j02335J84532K7733J35701j00084j11166k83861k3297q3837j88289
14623e12001j59269P1130L61914m7134j8061J57974J34826M5302L0851j25831
14613f0299O5877j22874r0165J1066J70046J15345J20438N7490j20734q3191p2574
14602i575k21989m2200K43377J79781r8531k26250J21843l0702j40694q0422K32950
14591g2412J98227p7851N7667p8700p2923j1480R0598J54779J29886q5286j11914
$$ plain form
14663 337210 357716 533086 513819 251879 96823 136508 14957 -192606 -318773 -328577
14653 -328577 -551885 -604083 -408723 -27589 14998 20584 9874 -91286 84941 347459
14643 347459 293827 324654 190068 109241 -240691 -202560 142564 276542 254086 32902
14633 32902 -69433 115099 142832 278533 178449 67283 -216578 -239875 -323712 -512001
14623 -512001 -671270 -600140 -238226 -285360 -303421 -145447 -10621 34681 65532 -60299
14613 -60299 5578 -117296 -207461 -196395 -26349 88996 209434 266924 146190 62999 -9575
14602 -9575 -231564 -273764 -30387 149394 50863 -175387 -53544 -84246 -224940 -305362 -72412
14591 -72412 125815 47964 105631 26931 -45992 -57472 33126 187905 317791 232505 120591
14580A20591j20146J30591m4903k03369j37632K41077J61468m2378l85961j41409
14570d22071m0352M0026O0645L0778K50047N1790R9198J67604K06433j00406m4579
14559B99113k14627k1984K3229L1259j1125o6832p4800J2210L0497j16819J81326
14548G1447L58873k29584m87764o3663L49581j76051J51455J15166l0293P1509
14538A30676j7291m8854r9612k4524K2913q091M8687J16304l3499m6815k07711
14527a67817k35547p8844r9674J47650P7911K56512l6592N3110J14594j3835j4103
14516C365p5695j10396J19176n297J1163K46490L0706j38601k46879N540k3486
14505a83914o0453J18586N1941k4559K7702r5505l27987J76772J64930J15005
$$ plain form
14580 120591 445 131036 86133 -117236 -254868 -13791 147677 105299 -280662 -422071
14570 -422071 -462423 -422397 -361752 -330974 -80927 -29137 70061 237665 444098 343692 299113
14559 299113 84486 62502 85731 116990 105865 39033 -35767 -23557 6940 -109879 71447
14548 71447 430320 200736 -287028 -350691 -1110 -177161 -25706 89460 59167 130676
14538 130676 113385 64531 -35081 -59605 -36692 -44783 3904 120208 86709 39894 -167817
14527 -167817 -403364 -482208 -581882 -434232 -356321 -99809 -136401 -83291 31303 17468 3365
14516 3365 -72330 -182726 -63550 -68847 -57684 188806 219512 80911 -165968 -160428 -183914
14505 -183914 -244367 -125781 -73840 -98399 -70697 -166202 -494189 -317417 -152487 -37482
14495c7482O4813J24108o4743j09904l52086K4663K1805Q4585Q6758K01968O7652
14484A12137o0632O8996k66103N7685J1434J20191l0072j12924n3957k795Q7643
14473f8397Q3585o0896o3380j10447J00721K9219L3622J11749J31804j0641k93639
14462a16700j68170j44455J81652M0936j18188K23424K14191P3407k25852j08297
14452a48052o9924J14640K70984l8449m9080r47k80529o5661J75357N0334J1617
14441b9710n2436J77040p1591j65348q9724j9291P8089q5183r8063Q7068n139
14430b74288j61629O3967R6589p6728P9575R9324J48932P0750K43198q298j24711
14419A56681L8237j75518p3859k8510n0510j63583m32531j81819L24690K26910
$$ plain form
14495 -37482 27331 151439 86696 -23208 -375294 -350631 -328826 -244241 -157483 44485 112137
14484 112137 51505 120501 -145602 -87917 -76483 43708 13636 -99288 -153245 -156040 -68397
14473 -68397 15188 -45708 -109088 -219535 -118814 -89595 -55973 55776 187580 176939 -116700
14462 -116700 -284870 -429325 -247673 -206737 -324925 -101501 112690 186097 -39755 -148052
14452 -148052 -217976 -103336 167648 129199 80119 79172 -201357 -267018 -91661 -41327 -29710
14441 -29710 -82146 94894 23303 -142045 -231769 -251060 -172971 -258154 -356217 -269149 -274288
14430 -274288 -435917 -371950 -275361 -352089 -272514 -173190 -24258 46492 289690 281392 156681
14419 156681 194918 19400 -54459 -82969 -133479 -297062 -729593 -911412 -586722 -359812
14409c59812l4673L0891K76281J92411j36603O3911L2628Q4032j71005k40629
14399b62568L2795J43664J2123J43278O4268r0110q9000J17554j10995N1372r6129
14388h3748R2272q5204j19605L95259k0880O04j10861j7075O4717k3025j16073
$$ plain form
14409 -359812 -394485 -363594 -87313 105098 -31505 32406 65034 149066 -21939 -262568
14399 -262568 -229773 -86109 -73986 69292 133560 43450 -45550 72004 -38991 12381 -83748
14388 -83748 8524 -76680 -196285 198974 178094 178698 67837 50762 115479 92454 -23619
$$ [...]
##END NTUPLES=NMR SPECTRUM
##END=
