##TITLE=Analysis number 319766
Compound Code cc 48402
Book Reference 479/70/6
Project Code adrs
Chemist Name roba
##JCAMPDX= 6.0         $$ Bruker NMR JCAMP-DX V2.0
##DATA TYPE= NMR SPECTRUM
##DATA CLASS= NTUPLES
##ORIGIN= Bruker BioSpin GmbH
##OWNER= nmr
$$ XWIN-NMR		Version 3.5
$$ Fri May 26 10:38:19 2006 GMT Daylight Time (UT+1h)  MAYBRIDGE\nmr@NMR_250MHZ
##.OBSERVE FREQUENCY= 250.131544655141
##.OBSERVE NUCLEUS= ^1H
##.ACQUISITION MODE= SIMULTANEOUS (DQD)
##.ACQUISITION SCHEME= undefined
##.AVERAGES= 16
##.DIGITISER RES= 18
##SPECTROMETER/DATA SYSTEM= dpx250
##.PULSE SEQUENCE= zg30
##.SOLVENT NAME= CDCl3
##.SHIFT REFERENCE= (INTERNAL, CDCl3, 0, 16.522)
##AUDIT TRAIL= $$ (NUMBER, WHEN, WHO, WHERE, WHAT)
$$ ##TITLE= Audit trail, XWIN-NMR		Version 3.5
$$ ##JCAMPDX= 5.01
$$ ##ORIGIN= Bruker BioSpin GmbH
$$ ##OWNER= nmr
$$ C:\u/data/dgb/nmr/ADRS/5230/pdata/1/auditp.txt
$$ ##AUDIT TRAIL=  $$ (NUMBER, WHEN, WHO, WHERE, WHAT)
(   1,<2006-05-26 10:37:50.86 +100>,<MAYBRIDGE\nmr>,<NMR_250MHZ>,
      <created by zg, POWCHK disabled, PULCHK disabled
       configuration hash MD5:
       84 BC 41 DB A1 6E 1D 46 DA 25 12 A5 C1 ED C5 3A
       data hash MD5: 64K
       3B FF BC 61 2C 38 09 CF DA F9 43 C6 C5 90 C2 7B>)
(   2,<2006-05-26 10:38:05.60 +100>,<MAYBRIDGE\nmr>,<NMR_250MHZ>,
      <Start of raw data processing
       ef LB = 0.3 FT_mod = 6 PKNL = 1 SI = 32K 
       data hash MD5: 32K
       0F 44 38 2C 56 58 5C 9A B8 1D 3F C3 DC E2 DC 16>)
(   3,<2006-05-26 10:38:07.24 +100>,<MAYBRIDGE\nmr>,<NMR_250MHZ>,
      <apk 
       data hash MD5: 32K
       1F A4 D7 D1 C9 F1 B3 69 67 3E D0 52 4F 1E 5D D2>)
(   4,<2006-05-26 10:38:08.08 +100>,<MAYBRIDGE\nmr>,<NMR_250MHZ>,
      <abs ABSG = 5 
       data hash MD5: 32K
       16 D6 83 56 13 37 8F BB 93 DD 5F FF 15 D4 CC 4E>)
$$ ##END=
$$ 
$$ hash MD5
$$ CE 46 83 27 51 FB 6A B8 3D 12 FA 91 C4 26 0F 60
##$RELAX= 
##$RELAX= 
##$RELAX= 
##$RELAX= 
##$RELAX= 
##$RELAX= 
##$RELAX= 
$$ Bruker specific parameters
$$ --------------------------
##$DU= <C:\u>
##$EXPNO= 5230
##$NAME= <ADRS>
##$PROCNO= 1
##$TYPE= <nmr>
##$USER= <dgb>
##$AMP= (0..31)
100 100 100 100 100 100 100 100 100 100 100 100 100 100 100 100 100 100 
100 100 100 100 100 100 100 100 100 100 100 100 100 100 
##$AQSEQ= 0
##$AQ_mod= 3
##$AUNM= <au_zg>
##$AUTOPOS= <11 >
##$BF1= 250.13
##$BF2= 250.13
##$BF3= 250.13
##$BF4= 250.13
##$BF5= 500.13
##$BF6= 500.13
##$BF7= 500.13
##$BF8= 500.13
##$BYTORDA= 1
##$CFDGTYP= 0
##$CFRGTYP= 5
##$CHEMSTR= <none>
##$CNST= (0..31)
1 1 145 1 1 1 1 1 1 1 1 1 1 1 1 1 1 1 1 1 1 1 1 1 1 1 1 1 1 1 1 1 
##$CPDPRG= <>
##$CPDPRG1= <>
##$CPDPRG2= <>
##$CPDPRG3= <>
##$CPDPRG4= <mlev>
##$CPDPRG5= <mlev>
##$CPDPRG6= <mlev>
##$CPDPRG7= <mlev>
##$CPDPRG8= <mlev>
##$CPDPRGB= <>
##$CPDPRGT= <>
##$D= (0..31)
0 1 0 0 0 0 0 0 0 0.06 0 0 0 0 0 0 0.0002 0 0 0 0 0 0 0 0 0 0 0 0 0 0 
0 
##$DATE= 1148636269
##$DBL= (0..7)
120 120 120 120 120 120 120 120 
##$DBP= (0..7)
150 150 150 150 150 150 150 150 
##$DBP07= 0
##$DBPNAM0= <>
##$DBPNAM1= <>
$$ [...]
##$SUBNAM7= <"">
##$SUBNAM8= <"">
##$SUBNAM9= <"">
##$SW= 20.6930455092707
##$SWIBOX= (0..15)
0 0 3 0 0 0 0 0 0 0 0 0 0 0 0 0 
##$SW_h= 5175.983436853
##$TD= 65536
##$TD0= 1
##$TE= 295.16
##$TE2= 300
##$TE3= 300
##$TEG= 300
##$TL= (0..7)
0 120 120 120 120 120 120 120 
##$TP= (0..7)
150 150 150 150 150 150 150 150 
##$TP07= 0
##$TPNAME0= <>
##$TPNAME1= <>
##$TPNAME2= <>
##$TPNAME3= <>
##$TPNAME4= <>
##$TPNAME5= <>
##$TPNAME6= <>
##$TPNAME7= <>
##$TPOAL= (0..7)
0.5 0.5 0.5 0.5 0.5 0.5 0.5 0.5 
##$TPOFFS= (0..7)
0 0 0 0 0 0 0 0 
##$TUNHIN= 0
##$TUNHOUT= 0
##$TUNXOUT= 0
##$USERA1= <user>
##$USERA2= <user>
##$USERA3= <user>
##$USERA4= <user>
##$USERA5= <user>
##$V9= 5
##$VALIST= <valist>
##$VCLIST= <CCCCCCCCCCCCCCC>
##$VD= 0
##$VDLIST= <DDDDDDDDDDDDDDD>
##$VPLIST= <PPPPPPPPPPPPPPP>
##$VTLIST= <TTTTTTTTTTTTTTT>
##$WBST= 1024
##$WBSW= 4
##$XGAIN= (0..3)
0 0 0 0 
##$XL= 0
##$YL= 0
##$YMAX_a= 398438
##$YMIN_a= -448093
##$ZGOPTNS= <>
##$ZL1= 120
##$ZL2= 120
##$ZL3= 120
##$ZL4= 120
##$ABSF1= 16.522
##$ABSF2= -4.171173
##$ABSG= 5
##$ABSL= 3
##$ALPHA= 0
##$AQORDER= 0
##$ASSFAC= 0
##$ASSFACI= 0
##$ASSFACX= 0
##$ASSWID= 0
##$AUNMP= <proc_1d>
##$AZFE= 0.1
##$AZFW= 0.1
##$BCFW= 0
##$BC_mod= 0
##$BYTORDP= 0
##$COROFFS= 0
##$CY= 12.5
##$DATMOD= 1
##$DC= 0
##$DFILT= <>
##$DTYPP= 0
##$F1P= 14.0000005364418
##$F2P= -0.99999901652339
##$FCOR= 0.5
##$FTSIZE= 32768
##$FT_mod= 6
##$GAMMA= 0
##$GB= 0
##$INTBC= 1
##$INTSCL= 1
##$ISEN= 128
##$LB= 0.3
##$LEV0= 0
##$LPBIN= 0
##$MAXI= 10000
##$MC2= 0
##$MEAN= 0
##$ME_mod= 0
##$MI= 0
##$NCOEF= 0
##$NC_proc= -5
##$NLEV= 6
##$NOISF1= 0
##$NOISF2= 0
##$NSP= 0
##$NTH_PI= 0
##$NZP= 0
##$OFFSET= 16.522
##$PC= 1
##$PHC0= 176.3583
##$PHC1= -9.043188
##$PH_mod= 1
##$PKNL= yes
##$PPARMOD= 0
##$PSCAL= 4
##$PSIGN= 0
##$REVERSE= no
##$SF= 250.13
##$SI= 32768
##$SIGF1= 0
##$SIGF2= 0
##$SINO= 400
##$SIOLD= 32768
##$SREGLST= <1H.CDCl3>
##$SSB= 0
##$STSI= 32768
##$STSR= 0
##$SW_p= 5175.98343685301
##$SYMM= 0
##$S_DEV= 0
##$TDeff= 65536
##$TDoff= 0
##$TI= <Analysis number 999999
Compound Code 99
Book Reference 9
Project Code 9>
##$TILT= no
##$TM1= 0
##$TM2= 0
##$TOPLEV= 0
##$USERP1= <user>
##$USERP2= <user>
##$USERP3= <user>
##$USERP4= <user>
##$USERP5= <user>
##$WDW= 1
##$XDIM= 32768
##$YMAX_p= 490733618
##$YMIN_p= -518113
$$ End of Bruker specific parameters
$$ ---------------------------------
##NTUPLES= NMR SPECTRUM
##VAR_NAME=  FREQUENCY,     SPECTRUM/REAL,   SPECTRUM/IMAG
##SYMBOL=    X,             R,               I
##VAR_TYPE=  INDEPENDENT,   DEPENDENT,       DEPENDENT
##VAR_FORM=  AFFN,          ASDF,            ASDF
##VAR_DIM=   32768,         32768,           32768
##UNITS=     HZ,            ARBITRARY UNITS, ARBITRARY UNITS
##FACTOR=    0.157963299565203, 1,           1
##FIRST=     4132.6476996994, 0,             0
##LAST=      -1043.33573715361, 0,           0
##MIN=       -1043.33573715361, -518113,     0
##MAX=       4132.6476996994, 490733618,     0
$$ Real data points
##PAGE= N=1
##DATA TABLE= (X++(R..R)), XYDATA
$$ [...]
27587 -156718 -87858 -74606 -11368 41647 107954 274547 289608 148795 27565 91336 60159
27576 60159 114833 141775 151639 66958 45684 114511 -22032 -189568 -92731 77666 91322
27565 91322 41891 42066 -123039 -226339 -207506 -195760 -126457 -202205 -178507 -137385 -112111 -66150
27553 -66150 12583 84299 97694 75278 -113798 -182816 -305168 -263115 -104700 -63972 -193219
27542 -193219 -177228 -124229 -29438 -9937 48819 87709 137819 99283 -8900 -79381 -20073
27531 -20073 63953 110172 102145 107254 132935 156645 226264 268327 244660 184016 109249 -27400
27519 -27400 18508 116284 151355 110819 178457 242851 134842 140743 311457 182649 104792
27508 104792 89933 68343 109095 168359 -11683 -136509 -151766 -142278 -192284 -184365 -17709
27497 -17709 87551 23725 9300 85023 71949 39368 -37359 54233 85498 -7589 -75459
27486 -75459 -99056 -88254 -105606 -116279 -136822 -272312 -124005 20604 -173272 -276456 -192617
27475 -192617 -13804 66531 -63825 -56138 -28959 21105 11165 32283 8091 19714 113267
27464 113267 87347 58094 36984 87927 178895 233264 225240 274809 275501 200312 76992 -105430
27452 -105430 -54734 34994 26735 55701 -34522 51785 217684 235456 177121 242587 170017
27441 170017 137486 178248 309648 193090 -12188 -21189 -137641 -148439 -5914 154451
27431 154451 158264 107349 80760 94516 84478 95200 -35248 -171240 -337186 -324209 -166557
27420 -166557 -89638 -160617 -256051 -270319 -144689 -48167 -2029 71485 103251 59243 -738
27409 -738 -8133 -120501 -99804 -104502 -5342 91981 42804 85934 154510 162895 248706 290733
27397 290733 154550 -41957 -287916 -222143 -86253 -74095 -89423 -52648 -47629 -8705 139812
27386 139812 171747 58806 39256 70121 161259 191992 198284 153533 200748 212277 148926
27375 148926 124688 60646 -68654 4008 31639 94249 190087 190765 97859 -78939 41465
27364 41465 159834 39811 -138085 -237524 -219708 -42035 43304 -16229 62639 162743 44125
27353 44125 65763 207243 141690 -108841 -202570 -270529 -209551 -132795 -205304 -139181 -12481
27342 -12481 98681 107537 52822 -105741 -99652 -278 57541 52269 -62248 -5150 144851
27331 144851 187757 35307 -96546 -56826 -32560 -95806 -133605 -132909 -97988 -54861 44224
27320 44224 -72310 -207418 -266014 -203879 -161625 -144759 -7336 3353 -52103 -67516 39835
27309 39835 154842 115321 10669 -117255 5434 133012 93449 60291 158496 138341 122740
27298 122740 -24857 -126818 -73285 49791 4296 -62946 -93280 -92178 -266915 -220592 -105121
27287 -105121 2680 39321 -98542 -147577 -146692 -199810 -46456 39399 155665 264718 160280
27276 160280 104461 176193 88323 32599 -62615 -86091 -18939 56848 -67290 -11418 -72187
27265 -72187 -18837 10215 -17602 -17106 -34814 17987 172689 245225 228785 211761 137052 7905
27253 7905 -29332 -177547 -252074 -154735 -105613 -50160 -103146 -130600 -178072 -64587 97061
27242 97061 121668 127272 139018 140685 101241 6461 -127182 -133925 -103606 -15869 -135305 -202195
27230 -202195 -158325 -135689 -148538 -183202 -34855 101815 156995 68573 42877 78365 85056
27219 85056 122535 90444 75491 45558 58503 -41574 -119622 -82516 -94924 -117794 53211
27208 53211 120755 103930 36366 -54900 -147395 -200110 -10260 105075 56284 115112 34688
27197 34688 68511 -18870 -21967 85088 -39291 -144669 -195299 31707 219514 150259 21863
27186 21863 7704 153262 155782 68986 59822 56317 -61955 -138217 -81740 7495 114939 92382
27174 92382 48712 162937 114244 170700 142969 166525 170046 50397 5789 114047 146248
27163 146248 305061 355691 452363 363825 152347 27346 -1697 12548 -64519 -61690 -158626
27152 -158626 -11516 54134 156306 128996 153785 301935 305510 283664 105323 206 -83206
27141 -83206 -59525 21698 154163 97937 35715 119005 115121 95396 68319 16373 -22750 -64835
27129 -64835 -256026 -259991 -138034 -14957 84057 194205 229865 323164 329933 324539 310695
27118 310695 314041 184134 56638 -96278 -176293 -46932 -38858 -124753 -137898 -103900 7013
27107 7013 48960 122203 8587 25776 23226 -360 72169 113300 167732 144348 129813 131445
27095 131445 87095 -11800 48948 55519 31207 -22848 -115996 -81934 32969 131582 105883
27084 105883 -65374 -141174 -179579 -8572 110857 211439 234689 219511 117628 71074
27074 71074 -61341 -100139 -103216 -100180 -88165 52189 52872 91265 52573 2472 62868 130618
27062 130618 193322 155976 198508 264909 194943 160916 82329 -18411 -94640 -69733 118584
27051 118584 125971 191415 176417 318596 382062 243649 20988 -70109 -130761 -189245 -187899
27040 -187899 -84606 -30825 32988 -45833 -52000 -29432 -27811 -15521 108292 184772 96228
27029 96228 44389 -19642 -11586 -26190 -61695 -72134 26629 45948 -40420 -96387 -86859 -30282
27017 -30282 24823 -4627 34433 109888 130102 10879 -148971 -141375 -262207 -274027 -299448
27006 -299448 -200535 -48354 80937 9795 -36804 84771 132949 36851 -90728 -171614 -150912
26995 -150912 -103877 -16745 -59016 -152306 -39566 31228 -30222 -69782 -45056 -53645 -61771 21754
26983 21754 179834 234498 203200 148431 -4459 -37082 -91924 -31852 36918 -28325 -79660
26972 -79660 -83563 10466 79259 13942 -77041 -62657 -3268 62946 -15425 33504 26032 -17453
26960 -17453 -26837 -47851 -26655 -118667 -119540 -85871 -53872 6213 17885 -152592 -166616 8774
26948 8774 108197 79935 104160 -33891 -112907 -108861 -96791 -81816 42762 -31922 -79410 -96121
26936 -96121 -45195 -71872 -120192 -124297 -134725 -153661 -118886 -137755 -134816 -111117 -30180 -126065
26924 -126065 -90190 41610 -22407 -46772 -64895 -69336 47475 186329 175648 288521 325538
26913 325538 185504 124152 185973 316991 217921 180985 176825 66484 -117765 -213589 -189722
26902 -189722 -75449 15538 43206 26981 63489 -27504 12583 -41979 -17296 136645 212300
26891 212300 183827 75510 77470 119314 156587 117551 44049 170093 268400 242921 71302
26880 71302 -66814 -113209 -102550 97824 263594 143207 109232 125249 111371 57888 73391
26869 73391 48239 -30299 -91333 -116668 -85938 -77355 -64973 -149903 -71149 -141000 -214936 -212206
26857 -212206 -106530 -17936 -71438 -43332 -21527 92301 43469 -2638 -7752 -99867 -201055
26846 -201055 -172518 -184907 -75632 65609 132902 22682 -130425 -178762 -150689 -320996
26836 -320996 -324061 -269184 -286883 -148621 109265 -19753 -78983 34792 49293 108352 126662
26825 126662 80048 -40628 -6403 -70009 -178098 -202609 -138270 -33798 -25505 30900 34499
26814 34499 -6922 39851 -41595 -35635 -10816 -17860 -79827 -108134 -1529 15572 41241 -1162
26802 -1162 11323 28186 33779 -51548 -57652 -54103 112051 208880 172042 133859 77498 24676
26790 24676 24973 14260 -2268 -87341 -166572 -241878 -358677 -227866 -153106 -124249 -154743 -61940
26778 -61940 47181 85606 -54644 -101740 -93754 -27127 200756 223090 149193 110034 35153
26767 35153 -37740 -33726 39225 145539 257921 215946 -58873 -192623 -296301 -186780 -108213
26756 -108213 -15106 30092 6022 12580 85290 230506 223770 220299 196947 124080 84344 -25890
26744 -25890 -103303 12533 82681 -9691 -133807 -133450 -236954 -272125 -279214 -273568 -322955 -178377
26732 -178377 -89445 3912 -21145 -46922 -17755 122895 144853 60387 92229 71196 68447
26721 68447 69415 -74459 -122309 -196742 -261077 -318036 -276324 -203867 -185908 -216718 -122529 -111303
26709 -111303 -136700 12386 76019 -25044 -55145 -196593 -170788 -32466 57417 217083
26699 217083 200445 30186 -22742 103784 277144 234907 111778 -4128 -71762 -222937
26689 -222937 -160002 -32046 29767 -103930 -148918 -15485 106953 104171 190099 255996 191882
26678 191882 -20196 -26933 94809 203046 169931 23228 -40617 117092 115605 85427 75680
26667 75680 11842 -86 19679 -73325 -68335 -54125 -89170 -95400 -71734 -27262 -42217 -130367
26655 -130367 -166082 -247372 -274453 -237778 -133275 -39420 69626 69749 -50746 -50420 97809
26644 97809 141861 220552 227181 118520 94112 159425 87964 154077 187006 191044 129247 -28219
26632 -28219 31489 145024 245166 238113 273744 200773 137812 116472 59141 68831 36780 -18781
26620 -18781 -79883 -194009 -52728 71101 141457 95331 109684 68387 -12160 -42687 -11679
26609 -11679 33319 160203 136092 107885 47062 -113845 -190515 -155023 -43419 -52246 -95228
26598 -95228 19275 44384 -122815 -192411 -191795 -269441 -215163 -166424 -106243 74453 24668
26587 24668 -50555 -11416 -79340 -118628 -155490 -234778 -109288 55820 31929 -13843 158388
26576 158388 104589 -54293 -82366 -83294 20160 48094 -19340 -40129 -37173 26299 29039 -56603
26564 -56603 -115394 -240348 -181340 -95364 29875 -62169 -164818 -88080 38190 -48214 -120112
26553 -120112 -24854 -41727 29755 170824 147755 100294 81676 152084 148415 123056 210122
26542 210122 115339 102219 106508 54169 99418 27173 -59607 -68476 -74561 -49201 89021 117348
26530 117348 184616 315347 352051 229690 35446 -131304 -232071 -193703 -70846 -36670
26520 -36670 -80200 20365 77676 28158 -65237 -54739 71682 107796 231165 321603 184677
26509 184677 70493 7317 -31470 -72424 -46606 -83928 -50717 67057 96024 128277 230342
26498 230342 240733 117845 100739 11568 -80347 -136955 -52498 80543 120140 59077 -72896
26487 -72896 -147665 -206337 -179427 -132247 -102435 -16994 109201 -23486 -1429 11088 -208591
26476 -208591 -188276 -108049 3656 -9037 39664 62856 -47722 -130324 -129886 35341 -4470
26465 -4470 99140 73889 114588 89642 34820 35864 971 16598 174263 128684 35959 -47294
26453 -47294 -38716 25872 25422 9712 -64556 31132 71563 -106879 -29317 79288 16278 15958
26441 15958 96616 85631 122134 211877 230204 65982 -59724 -59246 8468 45481 15365 48556
26429 48556 107547 95084 176427 310103 197665 191090 263351 243789 198263 234681 293385
26418 293385 327211 138544 117114 109374 23312 9120 68171 -6288 24476 32783 41455 -39284
26406 -39284 -100664 45056 -1201 -37488 -49732 -48820 -78301 -9095 56272 43494 75533 11932
26394 11932 40559 101345 254703 137431 -14208 25398 93307 186993 307268 313137 252896
26383 252896 221218 47720 -2961 82442 97027 121195 242167 285082 87896 120557 129779
26372 129779 84698 92848 213403 112144 58714 133716 141944 132712 45675 -14654 -62355 -5308
26360 -5308 174280 183693 52508 166691 224191 142045 43968 -90390 -113026 -93248 -74395
26349 -74395 -34803 48178 -33152 -93583 117434 -62554 -139965 -73606 -66750 -49671 -97839
26338 -97839 -108 -76476 -208819 -216821 -214714 -154680 -213543 -127193 -139509 -23853 16197 22590
26326 22590 58186 117913 93181 68242 29237 -125460 -122762 47301 200994 109189 -8877
26315 -8877 163161 189519 175477 201278 164217 80400 26329 58048 101650 210762 235668
26304 235668 23305 104225 139667 158255 148579 106078 105533 101102 -26369 4637 -1885 45809
26292 45809 131860 5480 -147819 -106998 -120498 -190551 -214075 -237505 -203916 -41282 14898
26281 14898 -105157 -43767 124325 245557 294799 202833 54629 18436 92797 147534 106739
26270 106739 227474 162751 197135 189804 5910 -3753 108916 244989 207586 53897 22995
26259 22995 -28815 -143884 -117375 -196276 -104933 18725 -920 -129380 8439 139055 103720
26248 103720 -9339 -56012 -63647 33398 131060 174073 51425 74096 93311 38634 13549
26237 13549 33272 -284758 -391735 -245368 -60801 -47726 -167694 -58445 561 -71545
26227 -71545 -63698 -69255 24470 51962 141591 6261 -9194 -66555 53286 143293 1134
26216 1134 -17550 66124 64315 85454 152782 -42254 -91426 -83531 -150452 -166267 -251728 -210420
26204 -210420 -189623 -155449 -106727 -44532 -52382 -38302 38644 -14201 -53915 38386 -12850 47580
26192 47580 104750 98659 27710 -274 122718 263506 310077 266802 134410 52564 97717
26181 97717 105504 166946 7819 -110261 14945 18921 15337 17868 95874 -60479 -106795 -38904
26169 -38904 93461 81738 -105616 -10630 7739 23100 -23096 49692 21346 -119024 -189901
26158 -189901 -100535 24110 37756 119100 104031 68932 -4440 -185649 -192142 -84057 -19076
26147 -19076 -113445 -164563 -53483 -10880 111410 226224 232419 208757 41157 -1244 -35587
26136 -35587 18941 68809 64857 15110 -55462 -178640 -193173 -82192 -38250 6559 1594 -54340
26124 -54340 41328 87395 188238 136715 22785 79698 115960 174792 136777 -39650 -35217
26113 -35217 32268 58228 170122 175963 99133 132640 159805 125175 63619 120337 171983 256931
26101 256931 265270 106934 -6213 134574 356763 342115 306409 235166 85171 55124 132398
26090 132398 71839 -19411 -93586 -133123 -133055 -65609 31907 130207 145644 126281 185579 405217
26078 405217 346081 328706 271354 267875 169833 5498 101322 229639 139253 124776 94383
26067 94383 150115 190851 179962 125475 148944 303468 312242 250524 209186 84932 81782 225
26055 225 10848 71704 135957 70730 4629 -92321 -68884 9967 -6034 13721 -2699 -30418
26043 -30418 -54648 41791 -31968 -28799 -54088 -131819 -68190 68401 213250 262678 166109
26032 166109 -38886 -146244 -121340 -130410 -39342 -63373 -22516 84179 114584 -46360 -34518
26021 -34518 -80432 -181945 -68310 -101528 -72156 -12395 102587 72593 -14328 29568 238352
26010 238352 335226 271600 189535 -45447 -258735 -97490 70648 6349 -48671 -82812 -60032
25999 -60032 40903 92393 96279 50738 -33247 101884 143003 6457 -59818 -27207 -77543
25988 -77543 -23560 135994 153497 26734 26843 63431 89176 44836 189950 262709 88136
25977 88136 -66172 -84188 -3437 87595 84777 164157 178570 82657 -3583 40423 -5403 -91398
25965 -91398 -119858 -187987 -182507 -571 -73888 -77405 -73157 -130992 -50969 74380 -57942 -145543
25953 -145543 -82083 13399 126553 41352 37989 -6815 -115507 4116 137250 107678 10616
25942 10616 -28364 12316 -12136 20102 86626 143560 100664 -51318 -165176 -164478 -24547
25931 -24547 85266 96673 40268 -19808 -1590 -8735 -84025 -115940 -143377 -83034 -136943 -221844
25919 -221844 -317251 -335298 -205819 -311778 -259891 -180744 -254448 -135995 38299 73352 89320
25908 89320 43979 -31006 -29759 -3500 66672 28039 122756 174767 59551 -59914 -135897
25897 -135897 -67206 801 -35320 -79330 -142967 -139497 -127581 -167025 -219151 -145247 -94467 -166892
25885 -166892 -193595 -157247 -38401 -1578 67673 84636 222961 252704 200436 313262 166248
25874 166248 -111143 -148161 -152914 -177349 -129205 -34888 62219 54628 2037 25240 -62710 -146619
25862 -146619 -66709 -39577 98554 173836 230682 226504 294766 284125 184014 156716 35357
25851 35357 23483 10922 22633 -52917 -67137 24285 97095 13807 -31086 -8591 16925 87757
25839 87757 36846 30952 12620 -18161 76537 48173 -85949 -138123 -73016 -126229 -192868 -192613
25827 -192613 -139604 -192014 -191032 -127267 -90948 -116033 -119065 -147111 -53003 104574 212682 175227
25815 175227 94322 42633 -90643 -99842 -159074 -213531 -126922 -279416 -221215 -117116 49037
25804 49037 126662 46487 -30299 -109430 -153158 -27205 133071 144224 18789 -76331 12599
25793 12599 203063 269400 192937 148384 121085 230194 170285 80183 133401 176551 192810
25782 192810 194153 207458 228299 142839 58003 -85032 -247021 -172407 -116493 -84242 -133677
25771 -133677 -159110 -224298 -211651 -49626 -45844 -234698 -329473 -371494 -263714 -213290 -262153
25760 -262153 -292787 -85834 149293 218022 161130 72954 84044 33977 -16498 43187 35426
25749 35426 -155392 -193794 9599 118643 137180 138082 -122125 -165554 -77314 -152834 -267139
25738 -267139 -258737 -208584 -64220 90112 140118 -5561 -23022 88414 159864 96929 43903
25727 43903 -6939 -53984 -80451 -137384 -165835 -128158 19490 42325 -73969 -63186 -121608
25716 -121608 -158826 -52730 38432 61869 140326 72623 -53543 -50180 -99338 -125709 -128971
25705 -128971 -156345 -51819 197502 79481 70390 50306 110443 141945 -22578 -47482 16385
25694 16385 45709 209678 268917 192312 135256 110295 33414 46953 95178 101758 35383 172178
25682 172178 130525 156818 233774 110962 -90564 -188161 -241224 -21457 1900 54175 101068
25671 101068 -96639 -159577 -177871 -203525 -146283 -154501 -238659 -120484 -83881 -225996 -298438
25660 -298438 -199507 -156659 -95639 -78326 -97989 119641 8202 -283301 -273714 -283916 -334801
25649 -334801 -114137 73131 170828 170405 68046 -70650 -73377 -41759 50299 92114 -35496
25638 -35496 -122940 -37583 109612 -10814 35205 49086 -64132 -109485 -56607 47928 16333
25627 16333 -58793 -21113 61878 33947 -23677 137498 184070 99464 -29176 -36992 56
25616 56 -1095 -60758 -127524 -204429 -141464 -9972 110030 81905 -38785 -161819 -265520
25605 -265520 -233088 -178380 -181245 -197454 -51422 -7833 159510 98334 -35052 -97565 -13337
25594 -13337 90628 94295 99835 119933 -34819 -183211 -195178 -143408 -48786 49633 -3194
25583 -3194 -106996 -79379 -68293 -158918 -110080 -43010 -1907 -17392 89488 155000 10686
25572 10686 -69437 -51700 130149 297275 227748 120951 -1491 -95086 -143533 -182835 -70440
25561 -70440 67151 147567 80386 -132628 -155545 -111805 -102821 93706 270433 222860 -11525
25550 -11525 -180654 -149707 -71009 -39371 39133 53854 -48422 54570 -5392 -44983 26782
25539 26782 2826 65396 152860 6052 -249703 -264812 -63433 66333 97835 -41608 -172009
25528 -172009 -119923 -11463 67125 77582 192530 217700 120066 -12194 -148960 -179946 -116317
25517 -116317 -73165 -72768 -126087 -83281 -155935 -106891 -130464 -144651 -140570 -113310 -125038 -212908
25505 -212908 -415281 -382494 -239764 -140250 -24640 115101 192175 167397 145609 37408
25495 37408 63130 10224 -140033 -153511 -174009 -9004 130611 124540 191713 183811 231395
25484 231395 331010 237959 122146 78577 131310 124584 93009 40529 -72963 -26072 128551
25473 128551 61248 33713 -30244 -73228 -146797 -143772 4135 74217 168861 16575 80855
25462 80855 78947 -33998 -154726 -93560 5593 -86170 -62844 44837 5596 -16383 103536
25451 103536 137273 209459 267291 231263 152824 160223 110331 53385 58718 -14806 -17420 65520
25439 65520 205941 175593 -6061 -87146 -17637 122360 133278 184226 266884 230168 67724
25428 67724 -101369 -164614 -140835 -144743 56215 103105 22062 50339 21480 -15859 -78181
25417 -78181 -97023 -47299 86762 158200 78507 -11124 -25854 -216094 -282344 -109212 -119233
25406 -119233 -136167 -206494 -251434 -284357 -236541 -132421 -93222 -22496 -95322 -39904 -4192
25395 -4192 73616 180817 251833 327807 214395 -73013 -186538 -48292 30425 25012 54114
25384 54114 1862 48980 121658 96912 85416 54525 8640 -22610 -173419 -114073 12503
25373 12503 81788 216217 232199 59607 -94948 -16186 10738 25774 -78650 5462 65051
25362 65051 73319 4507 -44232 -110579 40288 141482 154759 149237 41585 -13540 -142257
25351 -142257 -250613 -264454 -201571 -23786 84256 37728 28044 55474 -66658 -71786 13969
25340 13969 145783 128225 68294 -40565 -200219 -260309 -153746 -165572 -241558 -383112 -400019
25329 -400019 -316259 -235073 -28251 -12307 13945 77432 45376 -38620 16802 55157 12448
25318 12448 -111044 -66204 -109904 -277519 -292844 -274311 -179592 -113626 -151039 -164929 -58388
25307 -58388 77028 51042 -16812 -24230 -120236 -161867 -84000 -81294 9770 -14009 -39891 714
25295 714 -107820 -52432 -32792 10904 221004 216004 146812 166584 202923 151847 69214 -1430
25283 -1430 65667 -7631 -217402 -167798 -109678 -40460 49524 67451 118459 125742 179349 208502
25271 208502 51031 -101164 -216695 -269413 -183752 -130973 -76572 59485 156729 129289 20389
25260 20389 44009 174275 82342 -57454 -69536 -48861 40817 -134544 -189160 -102153 -91465
25249 -91465 -164454 -198511 -165139 -93318 -142754 -203763 -185774 -89464 -191772 -220351 -186689
25238 -186689 -213965 -210849 -226821 -162851 -25105 -10201 70052 76234 -78010 -18021 -56180
25227 -56180 18303 -57142 -166452 -173717 -249600 -312630 -169653 -186684 -234614 -156845 -131652
25216 -131652 -141481 -201047 -254647 -85625 -22656 -133124 -114634 -100963 -147602 -131779 -223714
25205 -223714 -249651 -54809 -56811 -39669 -22222 49598 141670 174926 216710 110617 40327
25194 40327 778 9340 37653 -50039 -182179 -108517 -30700 -17296 -24904 -2974 4039 -48156
25182 -48156 -94843 -132464 -133543 -25109 -43288 -176418 -300784 -202940 -76576 84395 123494
25171 123494 -54912 -15303 147736 143647 88584 179957 39935 -125146 -146369 -184725 -128250
25160 -128250 -32020 48133 135095 87068 -64435 -159870 -139118 -75327 17323 13548 -10530
25149 -10530 -91218 -95288 -148140 -50428 -13723 112338 224364 200430 129182 9737 54281
25138 54281 -19198 -68156 -186102 -105008 -78347 -74402 -56889 30152 82015 96817 40798 33864
25126 33864 100261 20979 -22285 38312 38677 78579 81964 128453 47852 96614 185382 248394
25114 248394 272910 172527 84256 105756 30618 -120976 -153800 -106689 -23392 56487 69067
25103 69067 383 10603 130952 77593 19494 103746 85720 -6253 -86984 4743 133048
25092 133048 149921 131975 94166 130756 42008 15317 22009 122172 68331 90222 62324
25081 62324 148225 18349 148249 232918 339846 210537 10221 -52809 -47098 -136742 -202759
25070 -202759 -129224 -108553 -192210 -103687 113642 67231 -30812 34970 61502 36103 -109641
25059 -109641 -239932 -97567 29479 74699 110661 153779 97033 76888 56150 -47663 -145588
25048 -145588 -162637 -43747 -33050 -42321 68401 5778 -85677 -126806 -174945 -109032 -113282
25037 -113282 -90257 -108971 -83568 -15261 -22239 -53149 71861 159752 122935 235673 299017
25026 299017 162856 42734 -31424 -93850 -102600 64440 213133 140425 66370 126383 -38900
25015 -38900 -172262 -68090 -36209 107017 14933 39106 14965 -101000 -10817 165729 265097
25004 265097 204206 137914 51654 -25298 -136978 -147798 -187653 -189525 -69572 25621 85507
24993 85507 46127 8624 141439 108783 -127308 -145375 -123027 -39845 34908 24496 76639
24982 76639 74312 161938 17636 -93947 -225666 -409107 -295269 -63402 50706 39122
24972 39122 -216928 -211482 -134351 -207992 -257688 -302426 -203300 -94345 -85337 -63766 -52741 26032
24960 26032 -28343 112195 290077 218585 157112 166299 41711 -35853 -119422 -86558 -5979
24949 -5979 -696 119187 259014 229414 147317 132665 143617 223775 241539 158313 60132 -22292
24937 -22292 9236 50778 193439 315224 399645 366554 291540 179025 115487 143087 140491
24926 140491 101355 39966 133436 226997 191952 124585 9593 -78264 50354 192233 261034
24915 261034 267735 25096 -72418 1196 81020 104585 125635 98530 -34168 -15924 -48174
24904 -48174 -83635 -17756 57518 1902 -261531 -280702 -171985 -179330 -175357 -101932 -86538 -93892
24892 -93892 -14689 -183100 -283173 -221287 -133579 -30177 -51662 -303059 -385599 -122950 17380
24881 17380 8101 -32844 -99239 36580 101106 -58119 -153151 -96235 82862 178764 153897
24870 153897 92920 -37705 43969 -46568 -9494 -8243 -38731 36430 176064 92059 90378
24859 90378 46691 14236 -38906 1079 136893 143277 -27707 -44148 -21588 -145175 -45569
24848 -45569 -15374 25214 44992 83716 9213 31214 78212 -16999 -124546 -219689 -330815
24837 -330815 -358659 -366685 -333497 -250029 -258383 -109470 -103971 -157790 -88198 -53494 -95679 -190514
24825 -190514 -192548 -272950 -263075 -226296 -180286 -188064 -151381 -232776 -226130 -127490 82585 133012
24813 133012 133947 32980 -35866 -206258 -256067 -217101 -101599 -54021 -80966 64781 151140
24802 151140 165407 24211 31127 154236 158134 120850 84686 20873 -100772 -200228 -146553
24791 -146553 -13215 -19305 -116040 -24849 -48306 -83740 8337 74524 37240 -21270 -4993
24780 -4993 31930 -33467 -153535 -209021 -149658 -12414 60287 187998 281411 317303 154942
24769 154942 26675 108911 -21935 -94473 -113792 -215407 -129741 -64534 -81064 -47444 -31379
24758 -31379 -8736 -40647 -99392 -43606 -166360 -197879 -162285 -67819 -13101 -1511 -50706
24747 -50706 17286 63468 41708 74836 104024 29451 -57230 15512 73675 158995 260261
24736 260261 194373 49260 -74311 -93206 -77962 -150597 -18656 86554 6480 -120603
24726 -120603 -98574 -80755 -63104 -163201 -62655 203797 248842 158637 74130 -90175 -120510
24715 -120510 -137872 -97659 -21064 -36311 16344 213889 285851 204394 79245 132668 128326
24704 128326 33896 105346 250011 267200 83897 -66008 -98474 -52860 -101703 -175527 -107094
24693 -107094 -126720 -173452 -72274 119443 89504 42039 -14941 -120551 -220161 -302234 -220877
24682 -220877 -127723 -146372 -312876 -236475 -109566 9373 -54574 -163922 -84479 -100626 -56771
24671 -56771 31704 99248 7008 -78925 -154690 -144736 -99020 -141426 -140353 -158595 -150215 -176912
24659 -176912 -180997 -184776 -126025 -64046 3406 30256 -16395 -61472 -118827 -272806 -283317 -213525
24647 -213525 -192084 -93042 -77560 72661 210550 231752 178098 161816 70131 6 11827
24636 11827 -36207 69206 145489 178353 698 4580 137456 235106 168350 32393 -42898
24625 -42898 -77161 84032 198035 201108 129907 77525 183861 97400 -115165 -159280 -169246
24614 -169246 -200916 -222084 -112165 -116138 -88665 -54999 8419 20365 9440 -75322 -203147
24603 -203147 -112469 81786 -26916 23896 63310 95576 25624 58907 45965 -193154 -331346
24592 -331346 -196080 -63819 12218 97766 170389 159152 -11647 15097 61299 148300 144470
24581 144470 59192 -88664 -91604 39754 155325 36338 -112861 -248454 -89246 -55892
24571 -55892 -118239 -142135 -98254 -100656 -30480 14954 142877 120874 34476 39661 -10182 117246
24559 117246 70812 13782 14611 93046 55756 -75558 67377 168641 150560 106065 73751
24548 73751 142647 243067 295173 200364 95852 5746 44853 -71680 -51251 126677 258426
24537 258426 143760 73425 108380 210723 247906 135900 115407 185014 241248 183613 181444
24526 181444 195554 145512 79301 109294 106707 83005 162468 191792 298226 193422 124443
24515 124443 80987 110887 168556 72917 -65185 67847 123697 82159 40210 -7788 48571
24504 48571 123305 243906 222224 -22083 -67386 -56825 -110073 20165 -54152 -134590 -32708
24493 -32708 8421 -13777 -60294 -201009 -191623 -135078 91853 230253 155676 165305 97457
24482 97457 -74450 -131512 -75253 12310 29582 -47226 -9069 -137522 -152367 -52072 3300
24471 3300 -51913 -47320 -7358 46698 6435 -55634 7163 67075 26337 -28802 -37647 -51988
24459 -51988 -16020 -18061 90620 36771 -103239 -87406 49496 202521 287888 254679 93826
24448 93826 -32800 -107794 -196268 -116629 37349 82193 34264 34245 -33863 -30915 -19155 -100731
24436 -100731 -213652 -121104 -69839 -34707 38976 101789 58413 -62816 -139793 -223975 -240937
24425 -240937 -146542 -203256 -187681 -125907 -30305 -26944 -8201 215 69704 48241 51086 95637
24413 95637 143210 92276 55431 30643 -75465 -54741 1426 124933 125360 124737 93039 28350
24401 28350 147119 241034 262436 112875 158933 240706 310929 344518 428344 279500 145346
24390 145346 127479 92217 188898 288098 239826 167391 -80534 -206790 -228844 -257131 -235859
24379 -235859 -262485 -176618 -167234 -43442 91846 26877 -102451 -104137 -36618 72168 7065
24368 7065 -1141 -18772 -200904 -120372 19461 7924 85334 98179 46777 21571 3478 -7951
24356 -7951 54497 25802 -72510 -54772 21681 136168 143144 67418 6776 -45066 75185 74528
24344 74528 2162 -121239 -175586 -8158 115130 78923 29705 35015 -23231 -120512 -160632
24333 -160632 -92076 -36300 58139 -35481 -156945 -174511 -54120 27714 -95330 -100678 93346
24322 93346 141475 119040 -2024 -188686 -203750 -196152 -57383 -14595 -71787 -126626 -68381
24311 -68381 -5154 13332 86169 114127 65994 238584 169484 120809 -43160 -40595 60694
24300 60694 107788 165443 149922 69321 41842 109036 133820 27034 -84860 -188043 -140098
24289 -140098 10293 -37878 -88274 -124091 -180216 -92033 -79340 -92635 49227 29702 -10517
24278 -10517 33801 49254 153098 114171 -10220 578 125393 220805 242510 182190 58718
24267 58718 -190834 -309497 -288497 -145226 -83740 -189404 -189145 -103859 -153177 -66370 -17677
24256 -17677 1110 51701 -58673 -67357 40261 159212 287825 285255 273716 316856 260098
24245 260098 128253 106308 94852 67591 -14441 -102481 759 158867 160539 57222 47607
24234 47607 83787 -15860 62708 120252 -51968 -184674 -186752 -149342 -118358 -12095 52694
24223 52694 192400 218556 93993 31844 71826 -38598 -26957 -146019 -157021 -73119 -53886
24212 -53886 78882 160445 192225 73340 103726 124273 129272 122065 300877 352560 249891
24201 249891 200715 216939 -9022 -226171 -253945 -129757 -27107 -29967 110156 158648 118969
24190 118969 75464 -10965 -298892 -277634 -242095 -65416 -9774 21595 -12715 -78639 -20848
24179 -20848 15260 -15978 24931 52520 72411 115751 118565 -59107 -137307 -34074 33834
24168 33834 4108 -135465 -73938 -23786 -42521 -40381 -15591 -7818 -79295 79803 108764 -64860
24156 -64860 -20522 49614 46500 -29332 4225 -90123 -121439 -87096 35106 226767 203342
24145 203342 95692 190845 251132 273445 85482 -31692 -25133 -72083 -89757 -95399 -145735
24134 -145735 -51643 -9734 -16269 -35637 -107194 102967 196567 138234 77529 -33409 -118523
24123 -118523 -144779 -175569 -144118 -154575 -122218 -129245 -176657 -246790 -25920 56511 4274
24112 4274 126251 164070 161267 113734 48131 -18412 -93917 -99341 -140285 -92749 -83918 -107085
24100 -107085 -35510 133983 119303 -37952 -52462 64262 122218 -39492 -137050 -1592
24090 -1592 14755 45477 85192 -18922 58595 134639 123270 181828 59098 -36642 -61980
24079 -61980 33778 162014 96692 -115893 -126304 -13136 48497 -8119 -59747 28064 -74216
24068 -74216 -94782 -61814 -144885 -150819 -154498 -294298 -280126 -14570 114627 -25439 -67373
24057 -67373 30715 -32115 -130996 -64176 1890 -84151 -64542 -89092 29736 82840 47662
24046 47662 30805 13188 -50134 -43537 -87741 -90981 2139 47673 25022 213718 263087 252633
24034 252633 25708 50892 78896 23100 -135172 -262661 -427982 -397165 -277637 -269897 -241776
24023 -241776 -124661 -60124 -184594 -207648 -136806 -115771 -113749 -162507 -163151 -95440 -39196 -38137
24011 -38137 -4358 -202232 -244821 -270966 -233008 -231945 -248594 -178557 -192662 -235512 -236981 -176625
23999 -176625 -81966 -95484 -92051 -57044 -98158 -56326 -51001 162775 286563 247961 140238
23988 140238 -23436 -84560 -61409 13517 27011 48116 8910 -88669 -284899 -289096 -205470
23977 -205470 -177195 -220818 -227433 -322097 -288358 -104104 -57768 -137153 -166068 -106101 -62614
23966 -62614 -183530 -266685 -253380 -168833 -157457 -32235 -19620 -59959 -50060 10478 94095
23955 94095 147848 86210 -16221 -63297 -286298 -135683 105866 216931 189989 175967 1700
23944 1700 -124907 -13025 -3261 69665 80248 36320 -137663 -118078 -52632 -68925 -80971
23933 -80971 18079 47013 -73639 -105384 -76639 -11072 -50450 -84853 6867 57554 -17368
23922 -17368 -125175 -37396 49516 40807 -112032 -217652 -59919 -64925 -101248 -160119 -200443
23911 -200443 -295489 -269426 -197700 -73419 16824 -68536 -66475 19794 4372 51067 103768
23900 103768 3557 -128902 -226792 -198440 -182232 -147333 -131410 92558 187340 238756 105649
23889 105649 -44308 80554 65325 102285 -26285 -115700 7052 -11727 81306 210853
23879 210853 241083 214208 103777 41324 57339 128982 24570 -64020 14099 64713 -30387
23868 -30387 -110413 -160172 -91363 -94913 -82348 -189536 -62154 21547 -77287 -202100 -180751
23857 -180751 -102588 -80889 -216678 -262676 -237203 -78421 74590 88772 85941 -20317 -83290
23846 -83290 -91562 -109841 -122231 -131566 -118698 144580 116630 2969 -24958 -107512 -204680 -118814
23834 -118814 -68216 -141239 -145481 -83831 -136799 -181986 -284529 -390013 -454630 -372156 -216211
23823 -216211 -83773 -28464 -5496 -139778 -153830 -114918 -39417 -91224 23020 99531 167576
23812 167576 134290 80547 69549 96916 36934 13434 -175357 -252192 -147641 -51545 -26993
23801 -26993 -1441 53959 66363 187529 317553 301799 241730 142952 1186 -116797 -126682
23790 -126682 -95523 -128743 -125013 -44593 -123837 -199223 -313433 -332818 -232529 -115695 -42992
23779 -42992 8372 54384 49550 126750 192122 96692 -20809 -66802 -10772 -16429 43774 -79676
23767 -79676 17005 117291 -70 -140627 -28646 -23462 -19270 22138 80882 100872 34855
23756 34855 48772 -52522 -148469 -95521 -156439 3225 220453 197630 66424 4333 35229
23745 35229 54156 14572 29998 -75143 -185387 -120112 -68023 -132342 -109628 -40454 -95686
23734 -95686 -35223 -91531 -199959 -138865 -60401 -8012 25540 25077 -54195 -93292 -35304 -51633
23722 -51633 31599 111064 33676 -65619 -113480 -54169 -12466 47490 170419 260191 184664
23711 184664 194572 133137 190012 54983 192703 268219 248608 121247 76554 -100621 14655
23700 14655 85795 35051 13022 71580 94820 87609 -10779 -256963 -291872 -137224 -29988
23689 -29988 -11217 -88662 -141369 -281152 -316728 -211045 -155016 -96142 46425 -15485 24790
23678 24790 43803 -37622 -34339 31252 46323 -22621 -59361 -5704 80139 64316 -17936 -108742
23666 -108742 -45074 -42316 -95728 -126264 -140904 -48791 43957 -1439 -33991 46011 207713
23655 207713 327307 381630 260049 60707 39067 213049 260158 83304 -48933 -17968
23645 -17968 84237 28438 7432 -26477 -8482 -87911 -98058 -83539 45027 63026 25165
23634 25165 -15841 -92599 -67451 984 15809 -1148 40964 -142339 -185627 -62626 14435
23623 14435 88867 39837 113463 124299 138028 270481 143333 59496 78467 106469 -49497
23612 -49497 -65186 -22689 -51226 51543 35458 14744 -25905 20351 1001 7572 78371 96475
23600 96475 192412 208573 179967 159007 35425 -121038 -50787 -129207 -238598 -81126 -94623
23589 -94623 -140865 -178804 -53607 -124564 -228329 -165505 -214257 -346383 -294068 -137800 -92567
23578 -92567 48340 -102777 -166179 -89156 -5486 -74673 -101895 -231667 -346053 -346762 -385348
23567 -385348 -194302 -77254 -88937 -3714 61425 -43553 -21531 40070 40624 -43415 -58981
23556 -58981 -98221 -52423 64659 61439 46088 21571 -22626 166105 75409 -80751 -22270
23545 -22270 28789 147021 122305 -38858 -95127 -97129 -56353 -117938 -182851 -34379 -19103
23534 -19103 -132276 -192149 -170329 -131702 -101937 41662 -99926 -117706 -85362 -100958 -238649
23523 -238649 -126508 -71488 -98575 -117768 -46598 43072 34615 45045 16988 86309 7119
23512 7119 26267 -106329 -343255 -280650 -222819 -185519 -45515 -48494 17958 90904 122792
23501 122792 126770 125803 101532 38646 -77853 -14135 9918 -162827 -310451 -266033 -93942
23490 -93942 55998 51346 -123186 -203864 -249556 -232674 -23324 -21127 26620 119895 100844
23479 100844 115214 79189 130791 52153 27415 -40110 -20477 25285 137835 115621 16884
23468 16884 -9415 -44375 -39487 71312 85402 93791 40552 112564 181253 97220 98129 146275
23456 146275 86942 -26267 -101765 -32008 45622 207082 197117 68945 -59567 -180465 -117243
23445 -117243 -26963 -53820 -142231 -158422 -35102 -37862 23647 -24357 17270 214848 237201
23434 237201 198822 171691 17130 4541 175035 135403 20204 30613 -98065 -148793 -76237
23423 -76237 47933 85209 -144703 -182624 -216123 -245541 -137824 -84630 -130280 -66749 20088
23412 20088 96125 86404 66972 52790 -20450 -61310 -168335 -285452 -306004 -227011 -35551
23401 -35551 -104231 -150395 -37699 -75858 -62304 -7527 -5547 -779 -50522 42137 -44692 -57514
23389 -57514 50318 53796 -5559 -82105 -115516 -231923 -295921 -209292 -178974 28255 -60240
23378 -60240 -101517 167747 243736 165552 -1401 -73860 -107853 -124830 -91796 -85515 -149153
23367 -149153 -145166 -156096 -245077 -208136 -163882 -172460 -197753 -181690 -33844 35627 116959 79903
23355 79903 82241 101982 114498 7734 85459 103137 93846 118676 41757 468 11145 -1926
23343 -1926 28727 24729 -121541 -208524 46289 27317 -44036 -51513 -37024 -98634 -223386 -197264
23331 -197264 -95948 -32161 58123 207776 158453 16588 14028 139363 189257 124846 88087
23320 88087 124547 68927 -39457 -48155 -44423 73215 212142 232470 141257 57014 125468
23309 125468 128653 28976 -22161 85812 143163 132181 157818 133785 27660 3174 80401
23298 80401 16623 -9087 -79170 -220731 -305260 -277526 -266029 -219594 -148331 -21117 24267
23287 24267 -24328 71307 46700 8159 97268 112475 106999 114828 -41978 -213748 -242305 -94669
23275 -94669 -33534 69305 109115 100796 17114 -9141 162018 246135 123626 112142 73622
23264 73622 71019 58645 106162 44853 -48996 117344 232009 298589 326346 122118 57336
23253 57336 146454 169063 114237 26449 138568 159280 33647 19062 50196 80367 -106148
23242 -106148 -213637 -186964 -150294 44260 80588 89865 52030 76968 85039 40046 36120 20249
23230 20249 -162638 -137291 -69944 -107344 -206199 -148282 68698 183662 152341 40569 124780
23219 124780 224240 226582 38891 43825 -52202 -30303 -48076 -104172 -64998 15243 -45080 -96544
23207 -96544 8314 9840 -51849 -148091 -152975 -144557 -29372 -2736 -93516 -32028 74283 115695
23195 115695 -10600 -180366 -223835 -109838 -70880 56806 105596 -40666 -37439 -83460 -82990
23184 -82990 -180117 -263456 -267347 -279682 -172915 -146837 -243151 -326260 -137758 77087 89769
23173 89769 21309 -19581 47130 26776 -66981 6624 148056 174086 46102 -6747 38843
23162 38843 18736 13703 2162 15982 -4106 -90527 -92594 40993 156738 154688 109493 210761
23150 210761 261473 310697 332177 300225 153219 -88443 -114438 -135150 -176561 -144001 -65643
23139 -65643 -14593 -10585 -39682 -127989 -108768 -134092 -43362 -3867 -185449 -209185 -156037 -44252
23127 -44252 -420 111183 -15850 -184258 -181642 -89326 75193 73002 37535 53878 50633
23116 50633 -5484 -12319 87968 28466 163077 92653 88942 5130 -47299 -201396 -204641 -99542
23104 -99542 -133539 -130507 -131117 -148335 -167913 -51586 31952 22956 38821 66326 69337 123848
23092 123848 129622 126452 -27071 -112928 -42066 15382 -66956 -156695 -147128 -39683 -92856 -224
23080 -224 69249 199781 112428 43366 117546 107158 43649 -42201 59477 112480 145244 80672
23068 80672 -107609 -154572 -223717 -250972 -193995 -104082 -84402 -44800 1920 43377 24751
23057 24751 -45115 34455 57257 -10825 -135117 -118461 11755 75005 116362 125974 110755
23046 110755 87628 144089 75311 -64439 -76901 -195541 -108833 -54784 -59667 -136631 -205500
23035 -205500 -176237 -165535 -33971 37513 12024 -149168 -120435 -22638 -24080 -112110 -133304
23024 -133304 -34349 -33863 -151633 -219618 -220132 -277504 -222297 -181293 -132781 -120931 109945 157355
23012 157355 187451 90471 4761 -8424 -94140 -213722 -186741 -211297 -198226 -49336 15613
23001 15613 17642 9079 -100296 -123506 -158309 -224662 -105402 42601 166507 116308 59279
22990 59279 66989 107038 72579 -56429 -241368 -327555 -286398 -207927 -143841 -92513 -108264
22979 -108264 -29622 -116293 -95612 -105057 -9518 60276 99472 -13283 -51826 -44998 -10532 25715
22967 25715 84196 -19241 -62398 -70438 -146766 -113416 19971 182322 180459 186609 174589 129112
22955 129112 162851 39805 -20287 -6446 -100104 -91724 61179 91807 208152 131230 112338
22944 112338 171402 111040 85228 271888 236764 131477 100058 30292 138736 142270 -102150
22933 -102150 -167788 -6152 72815 -113434 -194374 -159092 -112651 -185893 -175718 -158387 -93143
22922 -93143 -4093 72909 39682 105819 49389 96763 206331 251361 239629 210131 150899
22911 150899 93400 47494 -61786 -212750 -254659 -163197 -35389 175446 159282 -54324
22901 -54324 -87246 32616 21359 -146372 -246837 -212436 -45810 -75896 -117095 -172084 -251709
22890 -251709 -119478 8483 23708 -81270 -113509 -118695 -87377 42062 43907 126000 298050
22879 298050 154011 32989 40988 50193 74299 89898 27771 143294 269447 200879 115312
22868 115312 122659 255987 349619 297201 223557 158013 69118 15882 40776 -18196 -25673 -2361
22856 -2361 2197 5814 -134674 -171011 -159508 -192871 -150852 -53802 -98037 -18736 -2815 -2401
22844 -2401 -57094 -37018 -18990 9871 -177858 -204498 -32182 159364 76742 -60902 -182783
22833 -182783 -252324 -335943 -163226 -178079 -240427 -119166 10337 42752 7063 -198881 -142998
22822 -142998 -156146 -137270 -268933 -220349 -204728 -168311 -37948 -102351 -191099 -89370 -49283
22811 -49283 -17641 -50832 -76694 73610 192175 202878 96398 -42477 -61610 -78970 141552
22800 141552 185395 125467 136461 97523 215908 190604 6740 -1626 85840 140118 6244
22789 6244 -86641 -52707 -26076 -79487 -137666 -235000 -267981 -151331 -82744 -82013 -211044 -225076
22777 -225076 -305039 -298192 -273643 -65661 2541 -125460 -234445 -261134 -11430 117430 53157
22766 53157 -66616 73630 8203 -5521 115549 50310 -44968 -129876 -111804 48939 191229
22755 191229 266624 124615 3872 -140111 -179162 -250965 -382979 -266741 -260804 -193750 -157719
22744 -157719 -161437 -123480 -6751 -23620 -32709 42398 -24738 -90767 -95639 -21743 -87774 -321763
22732 -321763 -273165 -135673 -136133 -336326 -361534 -191307 -52748 -31744 50375 75007 75339
22721 75339 142241 112695 -42076 -84636 -6745 -1591 -55048 -37584 -75650 -118151 -43041 18518
22709 18518 54328 13884 -39297 -7545 -129926 -126054 -33531 67370 41844 134887 224208
22698 224208 267213 255610 205023 279847 286834 247924 69238 10947 113640 152175 14635
22687 14635 78338 134904 126848 104554 -125693 -231810 -267996 -186878 -25845 36628 -86427
22676 -86427 -151699 -102131 24781 52848 142054 211882 222883 40122 77962 56189 -6386
22665 -6386 -26746 -119271 -24518 110317 199392 162898 163158 25985 -142213 -179454 -48878
22654 -48878 -124103 -159598 -233124 -237712 -265808 -242348 -118088 81033 91454 -25627 -103949
22643 -103949 -144941 -95360 -789 21004 82965 50150 -177323 -295561 -75533 2746 -102268
22632 -102268 -162348 -129073 -126692 -230627 -162896 -153683 -83532 -105319 -52834 -40066 -57405 4970
22620 4970 -93998 -129008 -211318 -180906 -23279 -44123 -20186 -18736 -38547 -66026 -40563 -47291
22608 -47291 -64541 -61528 -27903 58181 54999 -19034 105029 62903 -70034 -69442 35329 35727
22596 35727 -82316 -182752 -83781 -75800 -102741 -108036 -64587 -52460 -105737 -91969 -133491 -160175
22584 -160175 -7447 10729 -117982 -90558 -113443 -182762 -68801 -45517 -91749 29334 18744
22573 18744 -1476 105236 220399 81850 15202 926 -114937 -34540 5579 -49834 -104909
22562 -104909 -21404 49967 149555 86327 92840 14619 -70685 -108810 -24663 123704 6296
22551 6296 -41597 -20343 -108727 -138971 -13417 4251 -202235 -388711 -420147 -321693 -228456
22540 -228456 -171314 -167825 -203026 -131340 -129943 -103077 -49819 -44997 -52490 -80520 -70744 -76858 -61726
22527 -61726 -60992 -53988 53611 93248 57151 50033 110878 155924 54785 -15117 -73773 -223639
22515 -223639 -209000 -113086 -94159 -236066 -155913 -147050 -155616 -139893 -136098 -26942 -21 -82197
22503 -82197 -8526 66973 74577 45364 -15525 191249 197371 72951 123241 112894 135693 78426
22491 78426 37543 -73499 -80936 73723 86827 60093 26328 138534 307096 320894 309940
22480 309940 277104 281866 85990 -106738 -121059 34922 -74450 -88020 95917 168992 226328
22469 226328 70478 27418 13357 36715 19051 81941 83937 151223 109064 -134823 -295957
22458 -295957 -104840 36037 6264 19672 73375 169459 226273 305323 112357 -148126 -178311
22447 -178311 -223300 -518113 -297546 -24653 169357 229845 298858 187686 147847 227034
22437 227034 177859 91739 8428 -101281 -178962 -132762 -56419 -33079 9228 21114 95495
22426 95495 186687 221590 203530 181852 56783 62972 224918 365125 261014 98025 80340
22415 80340 19623 9676 -8259 -67627 -101238 -18801 79329 101421 26284 25856 -19167 -116875
22403 -116875 -175140 -82372 -151901 -153856 -64107 -6045 53738 70821 20985 53253 37268 68004
22391 68004 -57711 -162768 -90352 22932 29695 73441 -60617 -122746 -20925 -21524 -34867
22380 -34867 92764 101151 169175 279331 232996 -4615 -10875 -40326 70037 36323 114182
22369 114182 140882 -3161 -97175 -136539 -100708 -31533 -116515 -223768 -265606 -287291 -115142
22358 -115142 44632 -25306 -47076 -86418 -93402 -80099 -84322 102475 143769 9602 -33020
22347 -33020 -1889 -28486 18960 -67681 -139776 -94108 62083 69860 71716 74688 50987 80521
22335 80521 96910 133742 303826 369712 392290 405910 192898 61300 -109944 -301458 -266576
22324 -266576 -104881 73167 293167 136559 83866 43538 56572 108489 183895 155247 105991
22313 105991 -117176 -67703 11071 795 5335 10109 14184 139262 261736 235901 90820
22302 90820 -7073 -4116 -20065 -112563 -51248 -50088 -132840 -182002 -5783 109142 179955 119205
22290 119205 99478 136328 55002 -25851 -124550 -267466 -423459 -373210 -174660 105670 85027
22279 85027 11711 6013 129902 117878 96141 64477 -50607 -81952 58840 42207 45844
22268 45844 141187 198766 79443 -48230 -86249 -75228 -58178 -94950 -233293 -261803 -105949
22257 -105949 -60553 -13969 89443 147880 192451 163982 140195 98863 61300 -33545 2035
22246 2035 -21114 -150568 -177073 -268374 -144694 23992 200648 185621 -33191 -132349 -197641
22235 -197641 -217450 -170155 -25746 33502 -5075 -155450 -208753 -33947 109241 149933 17105
22224 17105 -105569 8321 100534 44009 56220 -5775 4935 138358 223582 91346 3951
22213 3951 -12422 -43656 327 111142 55014 37574 35802 120653 111530 -6203 49618 48821
22201 48821 -17715 -110430 -202064 -213133 -169960 -95506 -106418 -69652 70 129781 169338
22190 169338 8420 6349 83630 -11107 -27109 -34091 -34940 17784 58991 95468 64671 -9817
22178 -9817 101060 138829 129389 44910 -146441 -197979 -104754 12484 -47474 55079 72781
22167 72781 -25367 -66696 619 72504 49978 -19825 -161762 -221184 -213446 -151074 -132077 -55258
22155 -55258 -56407 -7887 -151458 -200615 -182066 -107522 -49596 -39396 -62805 15235 49636 -89123
22143 -89123 -96705 60403 281296 221241 40459 33507 -57928 26076 49073 90101 49163
22132 49163 -41431 -99492 -160902 -174942 -120772 -99541 51486 9563 -142257 -8814 6728
22121 6728 -26414 -29529 -80349 -15218 81429 57831 96679 11585 76340 65066 143935 77808
22109 77808 93521 38369 -3941 -89767 -111893 -158104 -46290 54909 195913 157403 188439
22098 188439 235732 277368 178034 127035 39324 -104174 -49299 -41937 65231 38699 -88484
22087 -88484 -131141 -212694 -208764 -92273 -138525 -71200 -43783 -108686 -214170 -180552 -73565
22076 -73565 2445 2077 36066 27121 77779 -27402 -79787 -54427 -109314 -116084 -99239 -110903
22064 -110903 -131994 -38947 -32252 -42810 17661 103542 -26239 -197006 -136148 -15497 -33719
22053 -33719 -169663 -101584 16105 -8551 -6635 57686 11396 1651 37424 103977 -31359
22042 -31359 -110115 -62523 32033 69784 72116 117286 237847 348337 221405 73492 156067
22031 156067 6832 -110775 -119935 -94601 -137689 -248262 -252406 -8107 -236 -90219 -122901
22020 -122901 -83787 -54873 186405 260723 257356 230384 238675 199085 152171 249408 182009 -19210
22008 -19210 -44698 -127447 -45653 9758 -30950 53182 108068 118951 269276 312588 181089
21997 181089 103641 49529 36799 -62004 -98851 -45482 22027 66169 9327 -129572 -143153
21986 -143153 -284158 -325809 -190258 -36375 -114981 -9925 273792 283929 263145 141429
21976 141429 118019 216493 182662 106627 128823 -80508 -58331 -37921 -147171 -175273 -144480
21965 -144480 24656 19706 -6276 70025 86133 132903 -65037 -125499 -174022 -71111 -65400
21954 -65400 -125430 -92106 -12254 25771 31501 9478 70349 121371 -85841 -123545 -5419
21943 -5419 -51908 -13403 77222 89904 4577 -87713 -54566 -24665 -108190 -62510 -88935 -95584
21931 -95584 -79806 14777 70626 139372 32088 -210620 -130562 17518 -35946 -37805 88458
21920 88458 51630 32911 42871 -28266 41319 97905 -3735 -26213 -32909 -17981 -9722 -24300
21908 -24300 30547 100094 113437 57271 112956 51143 216255 175148 56256 -33949 -96203
21897 -96203 -74079 13494 78613 73040 -32086 -91838 -91684 -138902 -210570 -188637 -171610 -115209
21885 -115209 60011 146314 259905 292791 21235 -58650 18858 11767 -29448 -73894 -25021
21874 -25021 65821 270689 210901 96628 -64125 -1560 26300 -42636 -100699 -120048 -84264
21863 -84264 -106006 -91822 -83608 -218599 -226507 -227284 -230533 -52240 17773 -99462 -77300 -89911
21851 -89911 47072 59980 -29612 -141241 -171470 -114328 -23327 99631 191316 301748 181674
21840 181674 34193 11738 -70030 15528 60847 -111639 -146250 -66682 23211 144236 93728
21829 93728 53675 -32776 -108056 -101510 -54576 -22465 -7141 -112916 -112490 -132807 -180480 -151850
21817 -151850 -142440 -106585 -130669 -100926 -161184 -78424 5096 85894 14705 -80744 1966 145244
21805 145244 234602 220838 62492 -122368 -32574 -4842 -181754 -216997 -53460 -46437 -56765
21794 -56765 21781 57632 -19078 -159358 -188130 -32237 19584 -1275 -57263 -59394 -57434 -32909
21782 -32909 -26432 -50105 -167641 -143211 -82013 -87453 40381 128361 120166 95609 -26510 -82636
21770 -82636 -135727 -237784 -421816 -292705 -267654 -253687 -89725 -27994 19443 33112 151736
21759 151736 118638 -134821 -196232 -79927 -272479 -413045 -318316 -102488 -40591 -20961
21749 -20961 -42707 -24959 -94148 -128206 -116448 -24024 86140 192098 152749 163445 173317
21738 173317 238869 270125 135192 -19625 -97720 -73088 71259 63851 1398 -35585 -104363
21727 -104363 -204666 -270190 -320662 -381595 -217258 -92527 -38530 -54481 -56964 89191 148310
21716 148310 55938 9179 123540 108277 174935 146121 36543 -25265 -28648 29538 89971
21705 89971 178969 179563 -22154 -138025 -39953 77859 66938 41192 36266 30360 7153 -7319
21693 -7319 47045 26373 64856 119275 89880 68878 50427 -35763 -18722 109916 67776 -32719
21681 -32719 -65910 -59045 -23370 -53796 -190267 -90889 34165 61514 73672 185853 314215
21670 314215 265695 98171 116783 135306 -37770 26991 87930 47719 27870 14804 15990
21659 15990 65712 -18899 11667 32330 58710 119256 24935 -30136 -20093 -38114 -156729
21648 -156729 -186756 -214950 -34945 -13297 -134746 -207318 -186539 -175611 -133294 -93984 -173441
21637 -173441 -147599 -68048 -119189 -51052 -28276 -93622 -142900 -238782 -291943 -259501 -20256
21626 -20256 206223 222492 47002 73302 -29333 -59145 74034 86456 -12630 -36443 70392
21615 70392 112312 179190 215575 64118 -8205 82560 103014 99298 98992 57616 -32352 -170714
21603 -170714 -176837 -76336 69590 154222 45777 -118890 -22080 43561 146386 199333 118765
21592 118765 -26426 -4889 -45025 -167022 -261763 -43848 146291 127450 95046 48581 -61565
21581 -61565 -53659 -30142 -13519 -103630 -155413 -209387 -91794 114655 154778 77260 61427
21570 61427 15843 -65239 -41950 75645 120837 81805 116853 46152 -33774 2271 -19902
21559 -19902 110984 263821 248899 254154 143117 35443 -33734 -184165 -190056 -285561 -239166
21548 -239166 -176141 -196234 -177467 -34398 -122785 -185858 -83001 -124743 36128 163306 184913
21537 184913 16214 -209962 -119858 -57735 -41621 49472 -73429 -178974 -92837 -138385 670
21526 670 141819 82887 19408 24836 15711 -124708 -284961 -212019 -150370 -91996 -42148 -869
21514 -869 -51449 -63352 -17063 53031 -12610 28464 70581 110 2802 -1518 -75296 -29264
21502 -29264 11435 12276 47704 38824 50713 34407 98988 126819 83329 111532 29607 -102076
21490 -102076 -96838 -61519 -47745 -136245 -11682 33850 124722 115941 151208 9971 -62180
21479 -62180 2084 -51063 -71082 -58892 -105544 -84192 39782 58529 76903 154887 193702
21468 193702 150985 107745 22263 14771 73347 3866 -137619 -46778 -61621 -42027 -5795
21457 -5795 117369 74413 4846 -85705 -99134 -91526 -64178 -74103 10361 -96461 -239676 -303222
21445 -303222 -290078 -162326 -172481 -165681 -97863 -198687 -150074 -169147 -191753 -158795 -171395
21434 -171395 -149519 -138701 -58243 -42283 62703 -52820 -129929 -152106 -109701 -81384 -17053
21423 -17053 44829 22063 -115611 -161674 -305159 -274241 -124069 -38631 -83880 -126678 -93892
21412 -93892 -83023 -90756 -155598 -263710 -143262 -63395 -106014 -20828 -36150 -89092 -59760
21401 -59760 25063 -97 10498 -5833 77560 141226 153060 115041 33591 -4046 -51765 817
21389 817 110737 55658 6611 28726 51761 49233 28601 -95346 -204954 -171314 -210992 -247791
21377 -247791 -193355 -103122 68160 87672 78002 61351 53277 -38641 -60625 -132784 -116497 -13883
21365 -13883 56151 44648 122011 320748 205591 38093 27647 109921 141931 180228 11320
21354 11320 -34596 56513 68216 19862 61883 94232 28125 7422 21648 66196 233192
21343 233192 228404 145812 104219 545 -74627 -3407 -16414 -4298 86016 123889 116530 56598
21331 56598 -61229 -93314 -22267 6992 -21538 -116673 -66181 -72367 -147786 -115594 -59612 -17381
21319 -17381 33648 22414 85518 138359 83210 34341 138097 154300 97171 167850 123977
21308 123977 55973 113683 196335 239324 253240 167117 364123 377542 212555 163776 113412
21297 113412 -10179 -36984 -67239 -99279 -110497 -47179 -149036 -433549 -473186 -312275 -153862
21286 -153862 -166771 -9714 14194 -7381 -41949 -50397 66057 60342 142443 176661 226857
21275 226857 261148 82965 -111957 -111226 -49640 69008 126852 206009 239839 300053 333734
21264 333734 271522 204625 215583 221511 62601 15010 -23366 -86795 -151763 71204 229960
21253 229960 235399 204433 120520 127685 158014 124596 38400 -37604 42497 120553 127506 174343
21241 174343 103069 83964 57548 5160 -113015 -54727 -83316 -76688 -89885 -81176 -93688 -90180
21229 -90180 -59779 -75858 -61878 -37063 -189034 -114023 60312 92612 88854 44100 -64783
21218 -64783 -130311 -110398 -167625 -154223 -36105 89269 59656 -30508 -4593 163915 182476
21207 182476 189999 122616 -36951 -24767 136614 14029 -2873 95621 -5140 -32228 -49387
21196 -49387 -156720 -149165 -82460 -58077 -129209 -68875 42216 62582 123299 80334 -60960
21185 -60960 -212548 -141555 -802 -85168 -102310 -29867 113075 -78023 -271299 -136490
21175 -136490 150340 288602 309213 204195 -75489 -90120 -30430 -66630 54645 13676
21165 13676 10983 39760 -43556 -13430 -32775 -149650 -55837 40506 109982 102746 153479 -110741
21153 -110741 -297296 -238959 -232044 -221392 -205141 -299047 -313339 -273444 -133256 59324 95014
21142 95014 135756 20340 7676 -74331 -11464 47288 123474 56463 55833 114393 2429 -73836
21130 -73836 -197029 -106117 -56592 -121578 -136443 -260155 -177995 -70626 -101978 -93992 -87050
21119 -87050 -57900 -66640 -54228 -132565 -147980 57843 41666 -38461 -83979 -50037 -41816 33935
21107 33935 -58260 48486 41574 -18809 -57159 -13547 -73970 12377 102703 84153 -5037 95313
21095 95313 285471 242184 64504 122204 117115 31106 -50484 -105540 -223079 -109857 -116607
21084 -116607 -142948 -114488 -129288 -169259 -122900 -148300 -84044 4466 57529 42574 12796
21073 12796 -61829 -78305 22537 19897 -69810 16544 6136 -28391 -61659 37750 -35194 -155138
21061 -155138 -88547 -114692 -117705 -161796 -190843 -179250 -126922 -77712 76126 200923 335182
21050 335182 246584 102801 58910 90257 49211 115424 131302 22985 -63862 -131703 4551
21039 4551 151150 128998 89476 99878 -20820 -191514 -216199 -269274 -276060 -255267 -148105
21028 -148105 -54091 62907 81184 -17387 -62153 -72180 -112239 -217250 -168682 23209 203059
21017 203059 92330 92380 62859 -113970 -161543 -102397 -57837 92284 89145 82662 94218 160708
21005 160708 195114 21005 -103747 -55934 -115467 -77503 3284 97095 111406 191716 128059
20994 128059 7853 6018 118847 79635 217709 227915 255258 221799 65665 -160428 -282034
20983 -282034 -256261 -169702 -67591 -106686 -19664 144944 176989 17251 -140556 -140916 -60224
20972 -60224 -126280 -58591 -79495 -178854 -215673 -217973 -151802 -219029 -93750 13428 153404
20961 153404 89162 -128042 -200774 -240704 -168627 -61940 -43339 -160024 -304185 -300941 -258751
20950 -258751 -310377 -218389 -130597 -292809 -430957 -299073 -228951 -245503 -162009 -51884 -53296
20939 -53296 -87828 -89528 -189415 -315571 -302731 -205752 -68924 97562 300798 192134 -59024
20928 -59024 -71580 -28090 -50380 -115203 -164619 -167223 -176991 -80925 45618 -50207 -196066 -181626
20916 -181626 -140599 -26999 193159 77775 7836 24257 8612 77543 29265 77138 131754
20905 131754 120016 145395 33662 -68160 -83122 -27386 103081 146877 63009 -41912 -15915
20894 -15915 -4004 -6135 111794 170020 227862 195149 211594 32396 88503 232697 95444
20883 95444 11490 35874 61239 -88255 -65114 -21863 -142995 -217208 -263887 -331734 -305464
20872 -305464 -178187 -62119 -57275 -58539 -54792 -49507 -43440 -28598 27680 101724 123331 172667
20860 172667 125113 -14110 -73309 44399 131976 94152 78597 31785 216010 320052 87426
20849 87426 71320 81053 113299 66953 63347 -132200 -201743 -319236 -331372 -199129 -149616
20838 -149616 -86655 -144085 -62875 63351 165040 134995 -12973 52183 150407 198336 112994
20827 112994 134446 135014 88764 186378 144357 223142 199310 81073 1393 -12999 44928 186638
20815 186638 193719 168008 199974 104233 111574 51407 11885 129342 274783 299540 345687
20804 345687 216701 190356 201806 198307 287422 286735 207829 218576 265106 382153 366786 395773
20792 395773 266777 211466 92958 154632 119945 146043 -17644 -168465 3369 62289
20782 62289 82018 51813 55667 -7158 -87790 -111441 80594 163109 117102 -4174 -34812
20771 -34812 -98609 -58314 -98409 -77630 -137168 -167153 -100866 27208 90158 86305 84110 104001
20759 104001 133052 132245 68058 136539 115984 17507 -58563 -84329 16187 197734 271393
20748 271393 113077 2493 47558 46275 -7024 -4194 -86150 -112359 7661 33774 88409
20737 88409 4834 -172261 -166573 -157765 -117370 87395 212793 249751 255522 193398 108060 8124
20725 8124 97646 59701 11875 -5327 -203174 -201265 -128163 -244007 -42048 3857 -44866
20714 -44866 18402 108770 112935 121768 162958 62485 139765 141401 28121 -139193 -89961 43556
20702 43556 39832 -29077 -1089 46242 102638 82125 -31878 -69126 17259 86355 -63553
20691 -63553 -262956 -178180 637 -115384 -337189 -285363 -236950 -395132 -310102 -173826
20681 -173826 -64765 -167607 -326844 -333739 -142708 -59971 -88425 -223371 -243704 -209026 -184932
20670 -184932 -137013 -273937 -323733 -197848 -117412 -59646 13720 2920 -38722 9014 80076
20659 80076 88051 54802 -63636 -96539 -46984 -73727 -31535 54944 38911 -16249 -76059 -149647
20647 -149647 -148594 -236152 -366888 -405225 -352018 -204345 -81792 -41571 48036 59502 -3395
20636 -3395 17927 39882 73353 102867 -33525 -162935 -171574 -187276 -158771 -86313 131067
20625 131067 75484 15781 104430 177904 6761 -171760 -105882 65478 92249 92462 169985
20614 169985 125760 81253 149567 157339 110893 133247 211452 60107 -57942 -42778 76851
20603 76851 93647 67216 -56714 -16800 -112715 -155376 -550 8769 13171 74850 91367 128984
20591 128984 73299 -61831 -62042 -94673 -116634 -86173 -124411 21166 79648 59826 82517
20580 82517 76279 137863 44756 -147403 -251885 -188541 -95227 -2885 -64518 -49958 -4519
20569 -4519 20852 128202 250127 195319 154106 102451 163394 80354 77907 57712 -61039
20558 -61039 82586 142707 290784 255311 122411 149108 217895 252593 191364 52111 -30549
20547 -30549 -64661 55163 55871 12735 -153269 -169632 -82021 -81150 28693 137827 53928 1942
20535 1942 13235 48774 111135 122895 74511 31678 -41702 -101221 31586 198857 190404 53362
20523 53362 -77342 -105677 61561 4163 -92895 100869 351219 348965 246853 223189 116230
20512 116230 136349 146565 117719 219234 314098 289501 248268 85123 -69270 -38301 -19824
20501 -19824 49453 29974 100874 28544 -108045 -188438 12923 127817 -29262 -25041 -75996
20490 -75996 -37985 11024 -19925 20269 29471 -62813 -138841 -164724 -13329 18510 -139009
20479 -139009 -119554 55484 215198 121602 84489 106557 112642 292305 285348 215411 76379
20468 76379 43089 -88389 -43341 98318 182392 214436 30077 -73859 -86815 57964 71387
20457 71387 77503 76876 2205 -13037 68665 3959 -137827 -249788 -170474 -93366 -113085 -33693
20445 -33693 -91757 -3091 78274 103055 -24166 -83226 -43998 22877 -13963 -153950 -116629
20434 -116629 -149209 -148024 -123756 -3991 9484 -123341 -192284 -228785 -123248 -14847 -22478
20423 -22478 -51186 38028 -49569 -211036 -199361 -163273 -42131 80459 47620 -100259 -258965
20412 -258965 -265764 -120171 105301 98106 83014 98176 63127 75421 51519 15208 69987
20401 69987 3340 -16138 -64649 -73366 -112108 -110780 -23907 41494 -16737 -20413 7382 119198
20389 119198 153714 187153 289712 157396 140429 14582 -91179 -95325 -36000 -18709 140741
20378 140741 304144 272336 33484 -54005 -80481 -12831 57751 133329 48861 42517 -74152
20367 -74152 -189074 -168171 -111173 -120140 -80966 -38828 72998 138641 194304 175786 243893
20356 243893 288992 163832 43532 17749 56322 51404 143427 104607 102470 80155 -1696
20345 -1696 81438 39911 -51883 1410 8006 96168 138492 16493 -74636 -22755 -17518 -12475
20333 -12475 21865 74299 124996 35762 -87233 86836 153373 48081 94796 238583 193559
20322 193559 40882 -98786 18283 49264 -22852 5915 -43522 -30141 64907 179713 204879
20311 204879 235835 336129 451273 561604 694147 738193 777846 821460 769638 861930 957168
20300 957168 919162 994440 1098308 1291344 1473144 1512711 1645699 1683640 1486055 1305664
20290 1305664 1142100 929355 779592 704013 783328 794961 728189 668577 760990 736965 736245
20279 736245 864675 850216 683750 610437 511531 401489 343475 291238 318563 347022 367254
20268 367254 401685 411940 298853 208975 79580 114540 286757 152191 91908 70096 70913
20257 70913 90593 177848 134873 288558 296470 219102 194652 237689 241244 229521 145348 310335
20245 310335 299324 102388 37113 -127760 -146105 -40840 -43690 -140775 -12497 60316 210214
20234 210214 303425 204496 116674 53800 108342 65440 103592 136768 180203 147586 75159
20223 75159 119858 -78658 -50578 50655 85802 75475 -133142 -208414 -81399 -16661 71111
20212 71111 120109 -25211 104720 329406 368566 199783 112583 78799 92470 39806 125810
20201 125810 132980 -36040 -72084 -40075 1721 -20952 77969 185498 137937 24042 13393
20190 13393 64615 -106883 -174665 -189166 -246691 -332785 -256610 -119184 54066 235292 258719
20179 258719 199350 52208 -54300 -22864 48942 203237 366238 237246 106617 -3706
20169 -3706 -46940 -177453 -298200 -198709 -46598 -71001 15143 61111 -7626 -27108 73697
20158 73697 83806 20464 43043 15861 -32627 -38062 -2694 28141 -106401 -179436 -209013 -74027
20146 -74027 -6844 -44252 -61204 -33500 -202746 -240274 -175866 -533 -40633 -90619 -77817
20135 -77817 -27255 -19704 -20385 39760 -3412 40547 126974 132767 66161 30373 67769 151031
20123 151031 184153 200535 248932 276483 145189 81215 -90178 -103573 114748 199204 190344
20112 190344 58877 -41382 -171860 -231863 -189303 70419 264669 276246 264959 227128
20102 227128 197241 370295 559804 443795 363286 293220 147722 -109106 -123099 45970
20092 45970 173818 213836 149589 48782 37974 167696 239201 287018 235841 230067 170851
20081 170851 233664 180708 136409 95931 134470 125988 170900 84077 39518 91009 103217 21620
20069 21620 -122167 -200302 -204954 -132697 -152042 -99812 121199 247798 237153 283381 244574
20058 244574 206996 223373 272422 248526 71195 110769 129872 133803 108444 79279 151842
20047 151842 314665 397645 403431 343534 241344 152194 105089 166379 183947 99664 140331
20036 140331 281846 335186 335895 219199 273049 341819 278598 335501 320344 299485 336980
20025 336980 469449 455595 382958 315324 230283 151932 98322 236416 229807 141188 80570
20014 80570 173388 164630 94754 195327 231979 114793 52040 25977 31537 -83497 -169958
20003 -169958 -211316 -160983 -191646 -119751 -89876 40485 158504 94955 74441 93233 229153
19992 229153 98056 86082 113617 123105 91972 120884 288460 425841 366036 301793 304486
19981 304486 157653 157420 287710 240902 252739 127062 14844 8645 160997 196132 267295
19970 267295 503386 355142 162651 273825 463739 450739 370784 450416 339267 263800
19960 263800 395258 436758 396020 467090 510672 380651 378047 368233 253595 231754 381858
19949 381858 642469 577138 517379 438169 234754 72608 52306 136915 192866 121814 116090
19938 116090 127647 275941 372554 298977 117652 263112 326635 225185 216288 420617 442524
19927 442524 236458 37240 104587 269641 426355 477353 355984 291088 498843 717780
19917 717780 681539 640831 638718 595505 793620 916401 860357 752510 813857 860830 966372
19906 966372 1104747 1148640 1214051 1192946 1099715 1213413 1147880 1143206 1130590 1095773 1050008
19895 1050008 1089184 951022 836207 930106 956847 915338 863820 841363 921719 969214 810958
19884 810958 757893 953951 948336 950505 1013817 1068702 1121961 1187070 1070566 874062 760617
19873 760617 843165 871241 857584 776165 766742 922826 942150 953241 940934 999806 1029594
19862 1029594 1001227 1173299 1374515 1447430 1533298 1468852 1450164 1546165 1596486 1732744 1729505
19851 1729505 1680473 1635887 1581352 1628999 1657713 1758769 1697389 1703612 1678008 1665259 1606314
19840 1606314 1661520 1552168 1428116 1429349 1480851 1485333 1511772 1504096 1525320 1671878 1768129
19829 1768129 1922285 1986162 2121651 2278931 2339135 2537604 2817631 3134434 3545867 4354056
19819 4354056 5431326 6657725 7951911 9153392 10325823 11368377 11844713 11928856 12149079
19810 12149079 12493424 12677366 13683641 15635456 18229710 21099060 24422526 28416331
19802 28416331 33105865 38412246 46093524 58931110 76368260 94239553 110292674
19795 110292674 126665901 142350385 149008651 142535032 134221346 130198474 125910070 126531174
19787 126531174 143458349 174304585 206690971 234801353 262844598 286655710 288047352
19780 288047352 262245261 235045540 213709934 185378842 159568828 151079280 156193998
19773 156193998 165013829 173451268 182921991 189833445 183987454 165359140 147843199 132114258
19765 132114258 111615406 91944239 78167437 68895799 62326417 57257823 52944290
19758 52944290 49439177 46612763 44399091 42133008 40120939 38446077 36783062 35086723
19750 35086723 33473805 32049307 30465894 29051506 27868461 26537494 25375451 24430036
19742 24430036 23628179 22897271 22114637 21349514 20702949 19963439 19260258 18608163 18014288
19733 18014288 17437121 16852707 16520132 16124052 15703925 15322416 14892732 14495099 14054681
19724 14054681 13742661 13481239 13131909 12803586 12436504 12049883 11574210 11130608 10798761
19715 10798761 10511014 10264192 9993281 9658848 9454336 9435419 9271589 9010925 8909494
19706 8909494 8716030 8531418 8183644 7900614 7702271 7336318 7149742 7108179 7062337 7056182
19696 7056182 6990704 6963156 6822013 6652095 6473740 6303006 6028213 5719253 5581057 5492775
19686 5492775 5287026 5058216 4867937 4739522 4633954 4606923 4757819 4780006 4474010 4103019
19676 4103019 3899206 3770817 3700237 3558597 3469682 3482826 3366311 3387220 3466017 3543909
19666 3543909 3398771 3295785 3216098 3302824 3089478 3039489 3161764 3273136 3345324 3534239
19656 3534239 3509175 3331524 3169856 3027162 3098893 3178959 3196472 3131616 3068147 3136725 2938466
19645 2938466 2765958 2723795 2702746 2698248 2743320 2793013 2697880 2514682 2399707 2209979 2025983
19634 2025983 1925476 1802498 1874220 1889774 1730887 1546491 1502146 1473632 1567737 1488182
19624 1488182 1471270 1598260 1603603 1530527 1432939 1256125 1085282 1103331 1149986 1102742 1015960
19613 1015960 817577 906235 1135514 1260521 1320491 1303541 1271146 1221117 1297062 1307978 1404529
19602 1404529 1369568 1392646 1429770 1505385 1555638 1555087 1468179 1269831 1269663 1439253 1414221 1215655
19590 1215655 1195624 1166621 1089281 1072733 994296 900825 905396 888829 860209 909841 865436
19579 865436 920675 1050912 1091569 1265604 1272579 1074107 871207 859115 918102 950727 883608
19568 883608 838272 746418 743969 808327 623839 553309 624442 664433 643688 594753 694135
19557 694135 714226 760916 927091 819907 668029 534600 459419 541740 484082 557107 624863
19546 624863 621821 696845 845373 857215 767496 641027 582277 570253 600436 624261 585278
19535 585278 702917 777003 782019 772627 662501 599657 706817 789743 777405 846221 799742
19524 799742 640957 692784 823853 970590 880203 993612 1398387 1386724 1336633 1249629
19514 1249629 1217501 1186757 1106410 1089766 1180950 1166482 1159150 1182332 1154786 1108005 1125518
19503 1125518 1111227 1238491 1442758 1450616 1361095 1397590 1409002 1386430 1305768 1378705 1527523
19492 1527523 1737207 2174817 2733381 3478239 4113459 4521760 4739926 4893039 5161015
19483 5161015 5228798 5304821 5580691 6110151 6306341 6485062 7020931 7172585 6760929 6094060
19473 6094060 5607477 5550705 5663485 5633849 5682681 5818869 5714646 5512913 5289131 4840230
19463 4840230 3980772 3437347 3085111 2856733 2825710 2722897 2711409 2678924 2734519 2638762
19453 2638762 2509777 2504877 2506968 2561470 2482208 2456144 2502025 2579052 2575325 2726124 2817444
19442 2817444 2849003 3182695 3816146 4562278 5346843 5823323 6084708 6247506 6590367 6805749
19432 6805749 6768883 7204150 7662050 7995527 8511841 9053777 9159322 8566742 8102834 8082274
19422 8082274 8044860 7798206 7805917 8104848 8270589 8293752 8360402 8274249 7807041 7272570
19412 7272570 6834699 6593369 6472901 6532993 6621489 6935902 7346878 7813264 8420519 9415291
19402 9415291 10733523 12594096 15232250 19520994 26768789 38190134 52930340 66506941
19394 66506941 74627309 78938792 83114367 86738364 87298389 90624253 98049495 104069967
19386 104069967 109143177 117267947 125875812 125063351 115979780 108296538 104862744 102804172
19378 102804172 98999732 98548862 100992263 100569340 97246611 93400538 86929627 73343484
19370 73343484 58413358 48325727 42090908 38013106 35130269 32688907 30762695 29248109
19362 29248109 27981753 27052850 26396416 25926397 25654623 25422114 25169867 25026955 24903169
19353 24903169 25113479 25787308 27075637 29462689 34056439 42212435 55181544 71857152
19345 71857152 86498666 94703536 99278062 103996100 107593209 107790297 111352655 119134478
19337 119134478 125373207 131053362 140306996 149074695 146720471 136360719 128081251 124709977
19329 124709977 122171981 117650585 117338459 120070584 119097924 114600954 109465598 100782362
19321 100782362 84380838 67472916 55971244 48884623 44048161 40478378 37515915
19314 37515915 35027617 32993620 31350602 29904489 28477195 27149681 26057759 24996401
19306 24996401 23794489 22786638 21819642 21000420 20361382 19577977 18717436 18023389 17506585
19297 17506585 17009384 16501638 15925304 15351700 14784513 14235517 13709722 13229938 12945331
19288 12945331 12642840 12194706 11807743 11571551 11264082 10988611 10804671 10707269 10508022
19279 10508022 10304669 10054758 10012280 9918795 9642114 9457955 9189432 8933124 8683030 8460541
19269 8460541 8374475 8519538 8651154 8596013 8441501 8295910 8410092 8235550 7828752 7573857
19259 7573857 7312654 6996348 6892510 6783823 6639571 6467783 6314610 6216813 5985383 5647065
19249 5647065 5511468 5416758 5280382 4945654 4644578 4462135 4463074 4380370 4136857 4110385
19239 4110385 4107651 4074981 4025859 3907369 3712190 3404786 3301287 3401355 3449301 3340870
19229 3340870 3351669 3266443 3079544 3132964 3219520 3160528 3093899 3076628 2988385 2981085 2854332
19218 2854332 2724454 2801624 3026893 2999173 2987995 3102809 3063483 2845298 2749677 2723961
19208 2723961 2733486 2699403 2580046 2589080 2603668 2698380 2648451 2599077 2652616 2654485 2615141 2582221
19196 2582221 2620356 2535704 2494040 2507521 2462546 2471133 2524647 2630417 2781951 2774721 2733937
19185 2733937 2722444 2915559 3239295 3240050 3167930 3329444 3540045 3709821 3994045 4328374
19175 4328374 4581503 4829638 5303233 5837618 6386910 6977257 7468347 8289275 9393813
19166 9393813 10649775 12177198 13741869 15796593 19013705 23741313 31102258 42907084
19158 42907084 58717073 73106345 81409888 85797333 90404218 93820765 92903393 94648178
19150 94648178 101344029 107211941 112482820 121248592 131270580 131183244 122197123 114751939
19142 114751939 111371985 108209107 102338317 100857495 102389012 100893854 96868788 92721890
19134 92721890 86283121 72490564 58110097 48666415 42819309 38892642 35952631 33649984
19126 33649984 32089395 30963063 29971044 29056760 28506888 28115406 27886764 27950572 28355580
19117 28355580 29269624 30620413 32182873 34150085 37086511 41583079 48922474 61081591
19109 61081591 78631020 96603062 107929354 113310900 117888268 122457214 121326575 119919805
19101 119919805 125417554 132077701 137872338 147228638 160117727 164755604 156084123 145950419
19093 145950419 140381443 136797593 128875457 123646320 124194547 123171887 118704639 113334366
19085 113334366 106535977 92300217 74435558 61483079 53236868 47696650 43570292
19078 43570292 40223805 37803582 35775292 33899748 32291225 30935957 29619006 28378185
19070 28378185 27189880 26054052 24995873 24089476 23131451 22283003 21349928 20354085 19398228
19061 19398228 18565724 17783906 17146710 16659229 16003394 15403222 14904739 14399085 13952892
19052 13952892 13533628 12991613 12575544 12490862 12166585 11878540 11476508 11098564 10582496
19043 10582496 10286700 10002175 9724763 9489640 9350006 9209816 8941323 8736263 8584684
19034 8584684 8260425 7973595 7862498 7623330 7378765 7214536 7176867 7122725 6990936 6764248
19024 6764248 6577909 6631845 6456425 6333948 6277145 6433800 6490064 6349777 6169798 5925950
19014 5925950 5729656 5454597 5175011 5097264 4996020 4719270 4586045 4436526 4408926 4404042
19004 4404042 4304446 4190245 4296296 4331471 4279261 4236869 4143461 4045557 3882604 3693733
18994 3693733 3408137 3037345 2906961 2919597 2913834 2866897 3060372 3209202 3236053 3276952
18984 3276952 3302689 3333901 3228338 2961222 2742469 2664706 2477850 2521501 2483126 2401018
18974 2401018 2301740 2274833 2323359 2435669 2711820 2866595 2869531 2838738 2831381 2841555 2892623
18963 2892623 2634123 2247075 2060991 1977738 1878053 1880928 1909001 1940753 1988736 1978645 1916874
18952 1916874 1743482 1566718 1634585 1582410 1480262 1644847 1557497 1356943 1319287 1394062
18942 1394062 1415678 1326207 1256066 1241785 1163092 1170972 1149694 1073263 996982 936525 931314 1051744
18930 1051744 1015997 942436 883385 804909 755896 878712 937163 929969 913447 809476 786988
18919 786988 744797 783340 956201 1248739 1481935 1565128 1601815 1591692 1433192 1311886
18909 1311886 1185632 1123109 1198786 1377888 1508991 1484129 1429684 1409068 1213579 1071402
18899 1071402 1180269 1288744 1318345 1265277 1101814 990241 965935 848476 895745 989618
18889 989618 1007124 1051678 1171857 1296217 1347733 1476557 1564696 1689256 1777442 1798518 1747362
18878 1747362 1463096 1354460 1432093 1598437 1703133 1915917 1959464 1887469 1932848 1889753
18868 1889753 1720109 1585342 1604271 1577882 1519487 1471518 1506806 1603302 1607265 1621580 1595513
18857 1595513 1606163 1448475 1440424 1496135 1436578 1341254 1430515 1483036 1416062 1376966 1492118
18846 1492118 1444695 1273406 1149070 1168938 1242585 1203439 1137530 1100638 1126316 1193752 1281217
18835 1281217 1303688 1223781 1077649 893065 881194 983783 1082528 1049011 967641 983593 962090
18824 962090 964486 1105223 1363331 1600071 1641468 1655259 1747878 1976075 2038619 1901741 1876084
18813 1876084 1825193 1805400 1628921 1592135 1631245 1703139 1706119 1594165 1516678 1428196 1423072
18802 1423072 1478071 1390588 1322490 1454906 1565920 1576798 1483646 1445852 1437132 1380797 1321295
18791 1321295 1167960 971473 969971 981453 1003805 942109 968311 881235 825575 780835 749144
18780 749144 904122 1106953 1131831 1113577 1080867 1055409 1029732 899690 762159 719338 818153
18769 818153 945975 963300 1094053 1345320 1496045 1535258 1454809 1430231 1484108 1531388 1450370
18758 1450370 1226253 1212179 1280671 1209972 1150606 1160808 1274129 1203804 1143620 1131302 1218031
18747 1218031 1263854 1201933 1194591 1127924 1090178 1044771 1180979 1367308 1417646 1297022 1148167
18736 1148167 1103088 1074104 1012593 858718 991566 1127520 1178190 1266989 1357916 1358839 1340691
18725 1340691 1319691 1340192 1196843 1120625 1290421 1431088 1544968 1390499 1476042 1561956
18715 1561956 1657425 1951846 2283604 2509011 2852533 3311983 3799308 4540427 5594768
18706 5594768 6734201 7725084 8443552 8644160 8536633 8538327 8316320 8017384 8057921 8543920
18696 8543920 9490091 10950455 12222806 13259918 13702235 13818373 13712375 13322271 12970468
18687 12970468 12903228 13074084 13412420 13944350 14347640 13939822 13033472 12372688 11628765
18678 11628765 10369502 9401902 8636326 7636191 6915851 6383011 6142132 6073561 5993056
18669 5993056 5946930 6055311 6138405 6470947 7001952 7875385 8829836 9669275 10391396 10907845
18659 10907845 11572753 11809545 11700972 11872097 12564450 13909092 15595841 17241112 18335664
18650 18335664 19000896 19725513 20348068 19939499 19433282 19891583 21022689 22156536 22951695
18641 22951695 23269327 23531320 23794035 23833035 23599421 23608573 24075480 24617608 24456650 23184700
18631 23184700 21959986 21173563 20250267 19244751 18716100 18941425 19795005 21551580 24313970
18622 24313970 28701350 36162391 48522366 67434474 90750487 111998827 130136329
18615 130136329 148205059 161825936 159751012 143017775 127588198 113452506 92434430
18608 92434430 72365027 60057026 53061152 48810630 46212852 45103640 45550194 47766510
18600 47766510 52586339 61927066 78761054 103925280 130997443 148831457 155440981
18593 155440981 157611190 157250863 145903859 127734819 120994617 130795804 152505396 175453327
18585 175453327 188556103 192158845 192878129 191086108 182114706 177477912 190235572 210315448
18577 210315448 221006749 221981320 221815898 219293575 202983923 187418660 196675637 236490019
18569 236490019 299634337 362417689 404101344 431356633 453472232 451154498 400480202
18562 400480202 334224057 285445438 242288824 196029071 159719324 136221030 120413880
18555 120413880 108468673 98921561 91319589 85285462 80208850 75919931 72370184 69414481
18547 69414481 66576266 63912535 61481290 59334159 57329655 55376016 53829031 52533334
18539 52533334 51053592 49493837 48119768 46863110 45836667 45016772 44141605 43203963
18531 43203963 42380311 41556599 40524775 39565809 38710460 38564406 39728006 41812435 44876124
18522 44876124 50056428 58659319 71782322 88129435 103306978 115647153 127661630
18515 127661630 137310453 136619384 123767954 110326608 99437573 84174132 67941170
18508 67941170 56933080 49870884 45085334 41412693 38161636 35527605 33497372 31810947
18500 31810947 30398343 29286917 28177351 27170916 26461159 26005483 25717566 25325792 25076941
18491 25076941 24657197 24473587 24017700 23438310 23083475 23081038 23663895 24614830 25340433 25893816
18481 25893816 26611016 27825701 29220129 30018126 29720944 28953087 28157072 26964191 24719542
18472 24719542 22367052 20785881 19797711 19448103 19412846 19449874 19399691 19400455 19068526 18222721
18462 18222721 17303952 16472400 15550247 14652066 13954037 13495256 13322685 13200457 13055347
18453 13055347 13014583 12937303 12760252 12734627 12784357 12888139 13097677 13470679 14236236 15475643
18443 15475643 17039299 19334932 22522838 27402002 35592452 48274429 63334212 73715232
18435 73715232 77229040 78108983 78664896 73197826 59293374 48046603 41634521 37733998
18427 37733998 35155268 33025464 31375579 30795058 31305369 33133190 37609562 44723228
18419 44723228 52476467 57215053 58591320 59084101 59279905 55584735 49399058 47206495
18411 47206495 49216992 54605255 64533660 82810979 115236387 165040723 222073480
18404 222073480 260604620 272515321 273117855 271049667 244842392 188884717 144236507
18397 144236507 119012300 105028403 96561241 91831055 91692533 96574344 108432229 131277100
18389 131277100 171518324 233495592 309582682 380691171 440262689 480609909 490733618
18382 490733618 459602897 408392875 358082946 295489347 251542454 243766137 265811405
18375 265811405 301001610 323003453 322707218 313237527 301854797 269666941 212850097
18368 212850097 167390031 140413857 123624128 111785361 102888833 95728042 90070963
18361 90070963 85749185 82764611 80909022 80068230 80517160 82614147 87285340 95235383
18353 95235383 105347654 112604378 113291675 110685323 108042701 102160673 89422245 79264970
18345 79264970 76398824 79056039 84307177 87151850 85954259 83476270 80824786 74051069
18337 74051069 62850995 54463040 49584468 46320748 43890424 41972524 40168272 38246174
18329 38246174 36521930 35078563 33943608 32868306 31775970 30796919 29772935 28479430
18321 28479430 27354611 26295447 25412184 24664548 23945637 23157415 22251625 21499267 20884893
18312 20884893 20537473 20389197 20017891 19455942 19003093 18553240 18141628 17484240 16836200
18303 16836200 16354695 15971504 15714625 15395407 14975752 14683622 14458980 14038004 13515412
18294 13515412 13030018 12672778 12324432 12181730 11878088 11571389 11238192 10919021 10649094
18285 10649094 10256208 9853933 9437543 9075578 8701952 8347769 8209493 7972094 7682201
18276 7682201 7373484 7193002 7195578 7060818 6903118 6828207 6826566 6745746 6713417 6504949 6699578
18265 6699578 6866557 6809900 6572961 6422855 6203442 5953467 5747759 5439895 5210112 5188674
18255 5188674 5198326 5286473 5354447 5170020 4851576 4637134 4350795 4017244 3785984 3708828
18245 3708828 3627378 3533033 3501200 3415433 3164194 3090615 3043435 2901476 2756358 2714462 2612448
18234 2612448 2491214 2420475 2384349 2245767 1941582 1875894 2051018 2134341 2091698 1890260
18224 1890260 1826979 1732529 1801241 1869549 1788457 1585263 1336210 1124434 1052576 1096077 1086280
18213 1086280 1063610 1114160 1221157 1423234 1606508 1579559 1348990 1120070 1117069 1279132
18203 1279132 1283304 1298140 1326017 1287102 1216177 1144298 1151794 1065989 1009146 1025614 987530 1129344
18191 1129344 1150387 1010515 974569 1033197 1030790 975552 866080 955338 980581 1129660 1115805
18180 1115805 1047137 917101 1016015 1091502 1074479 1046430 1159527 1320303 1238946 1166374 1092192
18169 1092192 990984 1038177 1053959 877722 911238 922564 776755 768033 874887 940940 965283
18158 965283 881924 923401 947125 1108169 1081389 1124344 1063921 963799 750678 799514 977737
18147 977737 1009761 982663 877996 942272 1157839 1210457 1310058 1303795 1094932 1095726 1174790
18136 1174790 1188157 1201282 1144652 1223574 1448436 1663672 1871709 1822078 1861383 1847370 1679871
18125 1679871 1760613 2078003 2271417 2427246 2709378 2927107 3294199 3644241 4148555 4707289
18115 4707289 5676055 7011688 8922842 12111495 17267776 26570560 43636100 70860023
18107 70860023 102168987 121197838 124817303 123281059 121973289 105612888 72417079
18100 72417079 49435594 37353053 30590700 26150823 22968117 20504001 18486363 16824580
18092 16824580 15288583 13868383 12840365 12029277 11351929 10835013 10394504 10043940 9545049
18083 9545049 8983213 8573055 8206894 7848193 7610205 7243307 6814597 6402424 6199537
18074 6199537 5989535 5614479 5233165 5026332 4877808 4747917 4647465 4592432 4455420 4421432
18064 4421432 4343892 4163052 3973464 3945791 4040017 3940607 3835867 3702240 3617485 3561320
18054 3561320 3551648 3567949 3699885 3694698 3698817 3702556 3876222 4139869 4051209 3977486 3809941
18043 3809941 3513728 3332413 3069448 2765611 2601424 2526971 2338766 2347361 2408887 2397946
18033 2397946 2369023 2235537 2168947 1921965 1800965 1897847 1972763 1834658 1641989 1608352
18023 1608352 1604483 1626779 1589128 1547508 1600874 1421654 1372767 1480278 1586872 1586570 1659743
18012 1659743 1805287 2028524 2280158 2213401 2157931 2086057 1812029 1611322 1618582 1799580
18002 1799580 1970209 2181201 2359080 2475364 2525016 2472352 2485650 2507370 2503330 2479590 2291554
17991 2291554 2055668 1906768 1840802 1649524 1305245 1208437 1300456 1569345 1713073 1704615
17981 1704615 1664060 1644830 1527942 1275865 1159783 1158002 1069120 1202284 1164438 1067114 983829
17970 983829 909317 843786 797064 865741 730068 689458 615796 597504 690553 650214 549345
17959 549345 384951 303246 196645 208067 273699 276022 386795 434863 416162 372647 373483
17948 373483 280946 389104 364924 249731 218812 280882 427783 383819 240031 206471 149539
17937 149539 300850 356488 286619 292108 256652 285040 434672 559836 562914 470480 528661
17926 528661 776010 910853 969250 1098878 1100042 821048 549583 369385 327381 326770 377312
17915 377312 410777 405184 339494 276753 171314 208761 226157 154579 134578 124242 194677
17904 194677 268413 349923 487076 653006 684866 569507 537927 550696 578576 590890 597562
17893 597562 691163 753814 602830 512325 512640 514875 457059 403046 292090 256226 308803 338120
17881 338120 379010 399226 290565 71178 3353 219927 239981 170462 239678 366268 540608
17870 540608 741725 737035 669849 668588 631170 555099 606120 713446 716111 766843 994558
17859 994558 1209343 1257817 1174967 1132137 1105667 973597 871902 907249 954011 1092638 1169181
17848 1169181 1106995 971355 919190 912480 989115 820044 573002 530038 489166 563228 651166
17837 651166 959585 1345308 1307287 1276225 1334434 1208799 1049967 883479 891141 948249 1024321
17826 1024321 1093747 1242235 1511255 1697022 1794790 2005856 2230696 2396959 2297825 2366325
17816 2366325 2479725 2279120 2034241 1887215 1531024 1094206 1062530 1051716 931748 889185
17806 889185 979572 1143795 1266950 1319979 1252392 1211723 1116325 1020855 889559 622119 527182
17795 527182 481986 380959 413786 370821 562710 713107 840319 942975 1123327 1325077
17785 1325077 1365673 1374690 1265105 983737 751410 712483 453313 369922 531824 475605
17775 475605 491463 415325 323491 397798 386238 320750 377114 429420 294198 185220 45270
17764 45270 35263 51310 21860 83877 99892 248351 221207 116992 39166 48295 39451 164362
17752 164362 140991 -2308 967 -10677 -11863 135888 122991 58445 8056 48858 133065
17741 133065 176859 120277 228089 241201 333388 278634 235857 290050 295962 308367 285179
17730 285179 167679 183406 100314 132462 176935 177065 143333 263435 279554 274166 264196 120508
17718 120508 173601 54062 -17014 -39589 -22919 -40060 -63114 -69863 -54691 -31115 -181387
17707 -181387 -80447 -177455 -82506 -26872 -21232 -83246 -145020 -208208 -209815 -18507 55403
17696 55403 -24629 -85089 -126502 -144370 -30802 2435 -86777 -87959 36723 132429 85419
17685 85419 41326 21639 146322 158779 189451 258311 171698 90754 -10780 -185723 -224826
17674 -224826 -52914 -7494 -44209 -96985 -123337 -44588 54021 90200 124376 135650 51658
17663 51658 87813 70864 192396 287418 181940 135643 155446 212924 90506 -37486 -39987
17652 -39987 45131 -56359 -170162 -156389 -10160 110023 146470 159689 111870 -25174 -221776
17641 -221776 -255208 -339368 -277367 -315726 -369933 -431789 -439480 -497843 -460997 -340187 -234823
17630 -234823 -61125 40729 41876 87107 115467 86511 7849 70441 118633 1994 -87130
17619 -87130 -115979 -165796 -129218 11677 26681 -40571 -9761 103212 266634 279284 287281
17608 287281 193773 203514 152676 91365 114604 108696 116799 -42971 -95712 -29940 115687 14209
17596 14209 82284 171293 176934 106419 29715 122293 62954 11822 -75200 -81928 70163 196305
17584 196305 154427 90421 149139 82584 -145247 -231069 -151238 -113595 -227081 -91321 2557
17573 2557 53241 -72936 -46074 79688 37335 -3042 13683 85453 -57153 -74584 -125219
17562 -125219 -263438 -200777 -9482 -43633 -153562 -157521 -65674 -18729 99968 166523 104585
17551 104585 118039 35723 -7195 -76358 -125103 -105484 -136472 -176737 -183423 -193611 -162610 -238553
17539 -238553 -183324 -8672 -48187 -121202 -84342 -59185 -1407 -6932 34904 50817 17564
17528 17564 -10413 -141348 -168323 -36330 -139408 -64159 -17532 111697 -22317 -72883 -2750
17517 -2750 4038 62100 64132 36561 -30740 -126077 -209604 -129880 -103623 7399 -95693 -151533
17505 -151533 -11758 60869 -93684 -225526 -220389 -56959 6741 33318 75115 -35634 -98639
17494 -98639 14200 -11305 -196522 -388655 -403890 -394810 -285036 -198257 -198112 -240696 -143806
17483 -143806 -25549 -148462 -225963 -242807 -146021 -113616 -150809 -101008 -35603 -105972 -285650
17472 -285650 -343905 -292856 -53850 133722 208309 132023 33607 -42679 -130423 -61611 -3380
17461 -3380 -136333 -129638 -120569 -108995 -65540 -120249 -6104 208575 166178 288675 321995
17450 321995 293273 149645 -16442 -129482 -155236 -135032 -45466 47010 95989 231758 268599
17439 268599 383727 569804 734361 736274 519604 230564 194144 156893 149302 15681 -120509
17428 -120509 -56594 -30858 120250 103259 14852 63207 -54404 -229497 -140719 46575 63386
17417 63386 89903 100857 102952 92995 -62812 -119938 -127043 -163860 -61495 -155734 -220111 -217457
17405 -217457 35191 53688 -12864 -80910 -38564 -18864 22203 102515 13051 -99871 -119896
17394 -119896 -93742 -74932 58244 21731 -4517 -19701 -51638 -41962 93202 268170 343671
17383 343671 287466 43758 -84364 -142038 -112221 125504 79524 -91982 -149847 -133909 -255551
17372 -255551 -310112 -386766 -248139 -164224 -73817 27833 9535 10683 53245 1472 -19164
17361 -19164 -100451 -58611 67064 177850 214325 137605 40868 156078 88393 10653 -46474
17350 -46474 -12707 58108 87127 174453 171247 -51132 -206233 -215685 -180251 -53753 22036
17339 22036 61463 -61393 -94120 -271212 -332487 -121118 -98683 -234226 -197850 -101882 -28991
17328 -28991 -53842 -98262 -149800 -94089 -107674 -108873 -110328 -252878 -317521 -196873 -185292 -151778
17316 -151778 -81982 3251 9572 36483 59163 17639 48554 106424 156974 65514 -16600 -90155
17304 -90155 -100043 -244524 -224410 -227895 -143490 -32712 -102750 -33444 78311 -24908 -192539
17293 -192539 -137151 7570 -77509 -65169 -14125 -59323 -167333 -294543 -204476 -113087 -159252
17282 -159252 -186987 -138670 42941 38124 72577 -33684 -61017 624 -74364 -70882 -27262
17271 -27262 -44302 -146201 -218655 -149779 -214980 -66007 -370 -66265 -90509 -95653 -90088 -45191
17259 -45191 -14313 60307 505 -55560 -104335 -53380 -67428 -13214 -10925 -67474 -141657 9271
17247 9271 50811 5252 -7441 81326 27062 42591 -9284 -47487 -9984 -27651 -80700 5507
17235 5507 139123 251107 71524 109974 140317 86463 12851 124893 163686 179279 103322
17224 103322 22368 -121838 -148649 -90150 -187084 -265333 -238866 -107516 -39538 -210510 -334865
17213 -334865 -185949 -49779 -29984 -21987 -64444 -2980 29900 -62422 -191782 -144642 -121038
17202 -121038 -127500 -12655 86409 102794 74019 -68116 -159250 -195241 -42721 64297 143950
17191 143950 131533 86175 -24021 17764 12719 -60924 -86608 29456 66748 -118722 -55322
17180 -55322 68553 90107 122811 198573 95066 -110866 -101922 -16436 17655 19822 63417
17169 63417 56082 118764 -19695 -55849 -110674 14179 62417 55019 6154 -26408 -19057 -145555
17157 -145555 -218466 -160780 -98243 -64791 -7217 108579 49888 75795 121022 179503 179930 143068
17145 143068 120868 -680 -157853 -197277 -201642 -180954 24788 -21749 -183361 -139653 -52754
17134 -52754 -113496 -179528 -339942 -308707 -251265 -329568 -312051 -114728 48564 5184 38171
17123 38171 142496 164575 97870 -45362 -55918 47451 -23740 -144810 -312753 -302074 -196868
17112 -196868 -310552 -253710 -163662 -111026 -30969 -159617 -239720 -176566 -59124 -70722 -79360
17101 -79360 -6396 26432 4180 45117 92295 -30668 -130869 77736 186298 120753 238046
17090 238046 178755 53305 -80398 -1634 153242 6064 -190205 -219068 -1824 112510
17080 112510 115691 -45587 -84073 -3803 30545 -3925 -74206 -189424 -162629 -102347 -82573
17069 -82573 73190 200500 140303 106577 198704 89346 -60488 -67650 -91815 -128186 -13690
17058 -13690 62050 -35913 -60211 -47867 -73459 33631 147469 159454 205852 224152 253557
17047 253557 113985 -64371 -148517 -105227 51548 151789 228629 186477 160907 59080
17037 59080 33159 -11958 4440 -34495 36786 104045 -23425 -123328 -180370 -183578 -185724 -139560
17025 -139560 -64438 -137703 -54796 158373 264077 194859 138380 82916 74872 280428 229241
17014 229241 70929 -38709 108918 139641 1181 -85019 -19224 -51470 -6244 24987 60845
17003 60845 141069 203247 135604 130725 48517 10499 61767 80899 163588 -2843 -118253
16992 -118253 -27668 76931 84060 -21000 -51732 64996 106520 158779 121515 -7216 -119699
16981 -119699 -35132 -47372 67094 171287 79651 -13820 -40659 -16708 -1544 -14386 -91163
16970 -91163 -98731 -58306 -35121 -28343 45947 121467 215340 324496 421113 338819 187627 211967
16958 211967 173750 97098 29113 -12241 -89824 -79220 -77962 -175716 -232537 -263319 -294143 -267712
16946 -267712 -126773 -105855 -135542 -71774 3079 -108914 -314179 -270014 -117849 -17114
16936 -17114 12874 -114742 -213270 -23221 125139 92841 16761 -39778 -103487 -246512 -159245
16925 -159245 -67284 -36237 -86503 -81656 -157465 -43693 43133 56900 32094 117494 135607
16914 135607 16156 -48975 -668 -10098 -199507 -191243 -104415 -52989 -91947 -70402 -89369
16903 -89369 -38327 15223 96367 88892 95624 14386 -63259 -188879 -240717 -263938 -277029 -304822
16891 -304822 -177703 -136079 -88344 -158944 -227467 -205702 -178836 -167785 -103800 -49679 -137252
16880 -137252 -83294 9188 -85233 -42759 -58844 -150607 -164131 -63255 -18380 68925 5710
16869 5710 -41458 -150323 -90902 19759 52469 29312 -57060 -95512 -163361 -262947 -353398
16858 -353398 -143566 68602 158877 133517 115374 52364 52252 182475 200556 46565 -28322
16847 -28322 -18488 -8378 -40868 -64918 -126828 -13081 9951 -12258 -9009 -110623 -32216 54449
16835 54449 18088 7669 177516 163196 42971 65659 68876 -28595 48030 83083 72197
16824 72197 113609 203531 247800 212861 206862 37342 -16795 86215 85579 135715 107329 53041
16812 53041 42713 -39980 -143969 -185238 -188491 -237296 -53426 3764 -86934 -67570 -17016
16801 -17016 -66185 -122781 -196494 -177088 -56966 32158 54929 -53754 -58049 -73941 53497
16790 53497 109204 101326 -35083 -193921 -184841 -219032 -119668 -134698 -166804 -171182 -150544 -10520
16778 -10520 154728 164722 22924 -81571 -103553 69989 73396 -73176 -185765 -213553 -28660
16767 -28660 169311 153711 -30615 -41351 -9742 -47832 19388 72445 62832 -35738 -65689
16756 -65689 -132876 -280253 -200169 -47914 129556 390667 296587 14245 1125 -98111 -152391
16745 -152391 -112842 -16187 -8841 -132865 -144154 34680 63648 -63660 -59876 16538 74221
16734 74221 108007 92756 -57634 -57824 -136382 -152431 -262411 -348570 -339658 -321865 -155032 -106394
16722 -106394 -74871 -125180 -43542 -22440 36435 103447 128107 51908 14232 82938 86831 133331
16710 133331 117618 150215 197687 295048 200326 14445 37956 1731 50498 30911 -67450
16699 -67450 -9577 18477 143012 113822 35359 130322 239578 207039 -2856 75483 45783
16688 45783 -69430 -65105 10385 -886 -20341 -58960 47801 157059 84077 68205 75643
16677 75643 -40621 -174422 -301750 -371493 -327033 -295832 -287117 -65307 -12948 -129516 -51021
16666 -51021 82030 111994 99435 126 -152803 -131045 -215834 -129064 26399 55245 100791
16655 100791 257643 245092 86248 -48861 -138309 -166407 -111873 -108445 5996 -34388 60919
16644 60919 -42390 -175715 -133224 -34237 -73397 -173899 -213562 -311841 -330168 -309542 -173143
16633 -173143 -167389 -133736 -200928 -213229 -220056 32447 94425 -95476 -184109 -248157 -188128
16622 -188128 -131302 -81405 -5294 87 -45854 -29248 23883 27941 122124 220299 129160 -2774
16610 -2774 -91505 -113876 -65123 -97303 -162618 82035 130812 86330 23909 -124257 -156253
16599 -156253 -187870 -116476 -103385 -154941 -110162 -86315 -40328 8589 64562 231400 134392
16588 134392 -80091 -194116 -109050 -13573 76914 187153 167927 7020 -68509 110143
16578 110143 110400 150590 254705 30924 -144546 -149622 -173207 -181821 -165682 -73815 60051
16567 60051 47552 -113534 -309985 -172707 -81552 29865 71749 3051 76382 154341 259198
16556 259198 227657 85883 67521 193046 94314 62369 65672 53589 8069 -68137 -68056 -71470
16544 -71470 -90610 -81972 -139270 -102777 63055 59010 -48220 -3832 -138354 -72940 -3600
16533 -3600 -80243 -20984 -8345 -99499 -88750 13946 114972 23185 -77205 -120415 -47530
16522 -47530 166765 265055 177328 91810 -72371 -65562 74289 73783 84266 65508 84706 80826
16510 80826 35275 93032 113330 60607 38575 149506 58463 -70057 -69079 -10978 121484
16499 121484 108132 52526 -85551 -155329 -230200 -208713 -247225 -380056 -230762 -131699 -76060
16488 -76060 -152447 -240486 -188159 -110819 -41910 -21726 -202582 -320192 -361161 -407430 -202995
16477 -202995 -163433 -30327 119517 122875 196890 57092 -14519 -69646 -55542 -20983 -15193
16466 -15193 -36062 40448 14449 -61594 -27743 40973 159323 184035 181277 284971 326832
16455 326832 205149 -62275 5719 19712 24446 161641 218079 19745 -29702 -140468 -122327
16444 -122327 -44189 -157300 -35791 25831 -34972 -49853 83047 192263 181448 137716 -29059
16433 -29059 -137899 -76739 -112358 -109715 -80601 -154949 -255433 -273315 -191120 -195463 -140896 -239783
16421 -239783 -156379 1969 50534 77421 607 -186715 -187878 -124100 -74419 41808 220536
16410 220536 294655 174189 76383 41805 102605 136949 113336 13323 -163348 -244690 -245622
16399 -245622 -149090 123901 231806 232958 125718 -123771 -273511 -295002 -85785 113110
16389 113110 182296 163365 99518 128720 51447 24025 -69842 -95795 -73950 -59503 -70678
16378 -70678 -28037 45644 -89728 -236016 -112814 -7045 92628 125801 141600 169291 89782
16367 89782 85910 90201 18645 -142302 -233315 -143987 -113741 -107649 -83441 27070 -68715 -74092
16355 -74092 44854 146312 65293 -105303 -78352 -102695 -61426 -49598 -128832 -99316 -39961
16344 -39961 107377 76502 158922 158313 83702 -14177 -126552 -79103 -21677 -62718 -122098 -78835
16332 -78835 -29980 26297 183435 3577 -102926 110065 168318 167308 206847 166848 17233
16321 17233 -17646 19810 61775 -10680 103676 30099 -80799 -146453 -144921 -145711 -170404 -167579
16309 -167579 -288667 -278212 -93239 53694 87844 152160 84264 -67759 -204436 -133571
16299 -133571 -109913 -75635 -14289 22451 81338 281995 315028 179559 53327 120771 91598
16288 91598 -52267 -187809 -195531 -186585 -150303 -69047 86311 -34409 50098 190850 164159
16277 164159 161651 152881 79216 28082 49692 101074 161551 69811 58160 -3687 -43228 24157
16265 24157 75719 -118882 -205850 -260450 -185562 -160711 -49257 -1727 -58505 98600 156284
16254 156284 206027 257347 201559 57508 100226 177659 152235 122075 19021 37611 65889
16243 65889 161823 223856 213324 60942 61556 42905 25118 67424 44592 -69195 -108140 50555
16231 50555 58136 -81049 -8041 155476 130526 -83555 -136518 -140876 -90503 -55063 26754
16220 26754 3656 -66650 -137857 -39933 107300 36609 -21233 209920 412112 363310 252826
16209 252826 118000 103373 104951 70552 -23593 -31220 10715 8120 9821 5405 39490 -1876
16197 -1876 126150 253330 188722 278162 326754 141084 -40474 -76712 -6930 7544 -29618
16186 -29618 -61431 -143986 -171007 -45627 -7666 3938 -80736 -138831 -157875 -162600 -264618
16175 -264618 -164751 -131574 -175274 -65809 143918 157147 92836 103017 61800 -47949 -73261
16164 -73261 -110001 14653 9886 68602 54952 -69115 -94297 -108920 -71351 45116 125121
16153 125121 116589 52985 -104184 -79290 13374 55249 61681 57625 -101069 -182532 -170568 -169561
16141 -169561 -306193 -262400 -157326 -48143 -49009 -62700 -110119 -100303 71691 136524 37955
16130 37955 39370 64346 29431 49066 -12283 -51222 -190152 -236898 -137805 -74999 -78638 57108
16118 57108 152023 152578 101466 12946 -53210 -6281 -89656 -30964 39624 130492 167293 140426
16106 140426 126180 155715 89700 -73363 -57262 -34501 -29933 -32265 -57463 86135 194792
16095 194792 106396 132905 120933 -86 -39568 -51669 -66915 -136086 -56478 33379 28284
16084 28284 18051 -65756 18615 -8241 -25277 12576 -61231 -138350 -112495 -29539 334 103118
16072 103118 -37527 -117742 -161790 -194120 23736 73276 184062 237534 1154 -187850
16062 -187850 -35365 104865 119729 123278 154891 211223 242212 290228 99739 20936 -33691
16051 -33691 -97342 -85166 -37354 6665 50322 -20066 119757 54630 -70160 -95377 -97472
16040 -97472 -235560 -253883 -107132 -11796 117420 208016 87766 31009 215192 259657 193130
16029 193130 127154 23743 36012 -54532 -123779 -57075 63522 -39651 -49467 25648 86716
16018 86716 20929 -166324 -236172 -219400 -74092 -153054 -311354 -265451 -134752 -69424 -32911
16007 -32911 63058 1897 -175836 -3310 -8149 -82181 -82739 79783 -55185 -102752 -115714
15996 -115714 -163306 -193323 -148435 -44732 66939 66212 82299 127066 316992 327448 171509
15985 171509 38268 43688 62211 78056 24584 58958 67886 -68470 -86453 76755 261448
15974 261448 105422 57350 74952 -39736 -46727 -45127 -38294 27885 83536 88147 65572 94160
15962 94160 128531 115320 -11926 113631 132404 -44095 -214427 -200926 -184128 -183808 -155439
15951 -155439 -147969 -131401 -237813 -250657 -166039 -26025 -50036 -103169 -110898 -68228 126871
15940 126871 200769 213773 200027 167439 216407 124291 98186 15643 168494 281021 205377
15929 205377 137921 6865 -137566 -190093 -190648 -200186 -49973 41475 -105098 -187225 -32031
15918 -32031 -43910 -91329 -185067 -224919 -282017 -305078 -345582 -348693 -180593 47669 30283
15907 30283 -43903 -60617 -58018 -594 -112072 -235359 -336900 -344687 -288267 -241021 -209669
15896 -209669 -126048 -118840 -180991 -118734 -154874 -143477 -113414 -113370 -1150 100396 217821 245455
15884 245455 222485 94343 55960 -12834 -110299 -174133 -163726 -128260 -161066 -132505 -56704
15873 -56704 -87113 -31654 118740 -11715 -132386 -171648 -247523 -197826 -154687 -98854 26097
15862 26097 23060 100076 258031 211515 215643 202666 145615 225354 263308 252467 134687 77651
15850 77651 -7147 85506 120057 -799 17597 89742 80824 20019 63158 107801 -17780
15839 -17780 -233656 -31672 24460 -47035 -179524 -89414 85543 115949 140930 236084 184230
15828 184230 81178 -8246 2134 -27824 -75710 -95933 -173706 -128337 -86426 -7248 56162
15817 56162 63691 57572 50274 37243 149844 309840 238795 207804 99971 -257281 -352601
15806 -352601 -104649 36002 69268 28836 -2351 -70127 -93948 10351 48774 -49684 -71613
15795 -71613 -93373 72366 150429 178750 127187 144617 84331 89830 33206 44409 -95185
15784 -95185 -112979 -144823 -153321 -129803 16037 -39871 -75073 -18573 -52354 -7604 62879 120062
15772 120062 -84920 -162161 -218725 -212595 -118080 -35646 24384 -118576 -165479 -138858 -69548
15761 -69548 29955 107120 59633 165937 206944 183090 49695 78079 153432 194314 106778
15750 106778 -24226 -109394 -112909 -61113 36033 30897 6520 60058 25592 -175736 -223116
15739 -223116 -52827 51479 6224 49958 135266 21023 20193 13618 -12865 -78766 -160571
15728 -160571 -146657 -61930 -62600 -52896 3907 120996 191645 20688 -88130 -82842 -57051 -145103
15716 -145103 -142689 -188185 -307006 -164318 6065 -29795 48405 141658 93730 -21759 19673
15705 19673 -136679 -97191 -66439 -40984 -48298 -37961 94536 81932 -4609 -1189 -83733 -193652
15693 -193652 -194318 -122107 20532 49698 74505 -41894 -178327 -258671 -300994 -160871 -144666
15682 -144666 -259214 -260678 -159400 -177861 -181142 -173263 -47215 47543 67198 51712 -109659
15671 -109659 26409 30284 40702 78673 57939 -67422 -152766 -231046 -401951 -362230 -295245
15660 -295245 -194951 -68363 2417 -95259 -124250 -21038 53970 -27865 -120635 -206849 -166256
15649 -166256 4054 45852 2110 -123408 31131 102953 164151 164693 216169 288487 228885
15638 228885 29318 -175101 -51629 -36446 -13961 -27295 -2206 -89161 8768 -56297 -108627
15627 -108627 -129214 -11091 -126301 -231010 -146403 -74232 -47624 -89461 64842 -48073
15617 -48073 -126662 -224104 -27097 130582 145105 84922 -13187 -44520 -112491 -170854 -205872
15606 -205872 -169761 -129070 -157809 -102015 -204516 -240800 69988 163476 104013 30005 56785
15595 56785 -43346 -71090 54714 -34554 -48216 50903 45916 91209 -20558 -145475 -85662
15584 -85662 -94037 -21760 -135655 -285027 -241448 -178953 -49249 40035 -103248 -252614 -287152
15573 -287152 -291282 -160711 -93400 -89460 -22573 -37923 55721 -62627 -130523 15004 17902
15562 17902 -27249 -89095 -37961 90774 86217 -91693 33710 78780 -106235 -107510 -22085
15551 -22085 -59482 27002 -3334 -74343 -31434 19714 -31454 81465 98939 29394 55753
15540 55753 69975 63472 7491 39992 114072 89092 43856 -78458 -69798 104127 137721 47034
15528 47034 77069 32635 17826 23225 -39671 -121218 -96076 -25932 142639 144466 81984 -29228
15516 -29228 61728 111176 20208 -36805 -148785 -117051 -26844 -96425 -31205 68851 -43661
15505 -43661 -120710 -104015 -50697 66334 144585 19473 103685 92158 52039 -47795 -135742
15494 -135742 -210244 -175525 -132809 -29660 576 10681 175712 400569 274908 257792 227764
15483 227764 138812 26838 -108717 -33570 110110 75373 21610 -4095 -17929 -148 -66151
15472 -66151 -177915 -203645 -112839 -147926 -15711 9966 -25351 -92736 -14212 -17741 -35555
15461 -35555 -84598 -28319 -53931 114514 276062 180636 77802 155076 179904 281253 403726
15450 403726 197375 129924 147807 181035 79316 -90198 -193682 -147679 -42326 -134388
15440 -134388 -266173 -256118 -241052 -182397 8976 281650 381321 330775 168453 100499 -52166
15429 -52166 -38494 75399 -19581 -189893 -131916 91671 221655 173504 120630 17882 -40887
15418 -40887 96254 106632 150734 81681 100047 126142 118453 -64656 -130390 -101913 -96385 -113838
15406 -113838 -120895 -155197 -200663 -93251 -102839 -222599 -281490 -311837 -199012 -171208 -138471
15395 -138471 -173821 -81906 2054 -52664 -195555 -188238 -171853 -187862 -107819 -111825 -141670 -109453
15383 -109453 20422 134149 253956 365523 281709 209750 73274 -126829 -175344 -128521
15373 -128521 -74846 -3008 12918 -65534 -178321 -157814 -279541 -159377 -22331 16368 -91722
15362 -91722 -121833 -150313 -167331 -127102 24395 77508 -608 9801 13192 -36066 2546 -38856
15350 -38856 -123643 -89757 -18494 8594 76693 210909 283210 265074 130836 86566 -84241
15339 -84241 -166940 -245070 -163306 -71229 36451 -20675 14148 -136211 -282291 -184212 -224307
15328 -224307 -322650 -311513 -247240 -108122 -155710 -217690 -307860 -345740 -270475 -128720 -33843
15317 -33843 -55989 1271 20476 13245 -98392 -51750 -105081 -215735 -142750 -138147 -123704 -30803
15305 -30803 -21247 -110688 -186419 -182863 -99091 -46440 13256 -22388 -103606 -143945 -112519 -47244
15293 -47244 -58122 -3260 102923 116116 59186 -62591 -67860 -9236 -112034 -126385 -56381
15282 -56381 -70139 -115004 56498 58470 64137 81601 -19545 15527 90933 49669 100866 205759
15270 205759 210851 224378 198840 118043 -62210 -1660 90242 96812 106356 195030 79691 -54319
15258 -54319 -208195 -153136 -72818 6802 -549 79431 193223 187488 217011 74595 -42954
15247 -42954 -114137 -59198 -40458 8595 109657 134037 179239 162351 129760 44032 -42846
15236 -42846 -60273 24965 204972 220714 129954 51970 113144 80186 28070 -21554 -66308
15225 -66308 -3945 148419 102485 -46252 -46329 34337 -36704 -23636 102993 146978 -10101
15214 -10101 -5505 -95475 -213924 -136631 -143040 -376664 -307274 -188401 -229320 -73426 8645
15203 8645 -34365 -94668 -144381 -132053 46833 79400 161881 148159 152300 137165 191659 252384
15191 252384 210752 80597 13913 118171 204528 152764 147659 93200 82338 69966 200559
15180 200559 274569 85848 -192594 -264078 -101870 -10882 17330 -89929 -152862 -234951 -210951
15169 -210951 -222436 -250603 -397988 -309086 -178645 -136873 -94021 -162378 -42454 44499 -9381
15158 -9381 -20767 -1567 14477 -56926 -131513 -130844 -58512 -29801 -141148 -38470 24108 -25309
15146 -25309 27853 95385 18577 -22832 33586 79398 80433 27811 -3286 26321 49444 -28492
15134 -28492 61434 6803 -89019 -25969 40697 -46252 41659 -771 -79766 -257940 -275636
15123 -275636 -151123 -174473 -114868 12394 90406 143831 13486 -20583 12049 68158 76373
15112 76373 42252 38730 58694 -171561 -316328 -211823 -132863 -52137 76109 117883 -3086
15101 -3086 -35254 -94785 -62885 -213118 -232504 -119434 -175308 -155443 -39254 -70185 47182
15090 47182 56364 -51741 -39823 -97814 -62699 83412 58253 54772 -23921 -120917 -133308 -128141
15078 -128141 -107021 -110238 -44019 52384 17353 25043 -8609 -15267 5514 125001 170645 106179
15066 106179 -28963 -105523 -86865 -176753 -149856 -177864 -234023 -212277 -173131 -171877 -17657
15055 -17657 124168 248880 272034 224454 255929 300689 111333 70952 88218 59389 23706
15044 23706 24692 12530 -45972 1465 117961 11896 -29809 69969 186400 160436 61037
15033 61037 70549 71230 160475 255565 191826 170170 107837 104092 -183502 -299893 -170580 -65107
15021 -65107 -23541 -17446 20343 80248 156703 310683 300738 177140 191515 200743 167904 68770
15009 68770 -179 59471 33058 -89190 -177446 -87463 28862 -36622 -112824 -80233 -26413
14998 -26413 -108534 -96162 67494 143075 166055 184659 -11724 -57146 1112 68960 16102
14987 16102 1671 -114894 -127265 -125145 -58409 9667 -30283 -5464 31796 -108337 -188389
14976 -188389 -101003 -13757 14772 -28067 -35029 -35472 -61582 -67102 -60634 -61229 -126301 -184690 -176483
14963 -176483 -120273 -172095 -277511 -215279 -212131 -192974 -63717 41664 93760 80526 76445
14952 76445 72738 191333 339508 283109 179495 231077 154138 98455 149604 70928 93692
14941 93692 -52766 -155120 -219775 -159205 -207572 -148236 -97808 56268 78669 82801 50230
14930 50230 31264 6874 96769 178059 82258 52156 78095 -45414 169685 269031 249807
14919 249807 195018 178048 167118 46342 39667 -155978 -259057 -175204 -8601 4286 14522
14908 14522 75693 96937 97218 225891 263946 189618 138363 119066 -33925 -56652 135363
14897 135363 228049 240362 266111 421075 440614 274620 182333 29688 -117508 -74281 -74179
14886 -74179 -146145 -129959 -451 -73651 -96616 -80946 -85146 -72710 8674 137178 157067
14875 157067 52805 -45412 -3711 -8471 -38768 -147615 -67049 -71207 -133703 -173542 -82486
14864 -82486 -5858 -82666 -21981 -15483 -99767 -62601 -81466 -7607 50839 109154 151770 4931
14852 4931 -114090 15889 19564 465 -129013 -205802 -113435 53277 66257 156598 80474
14841 80474 5743 -25733 -226436 -216943 -120683 -125969 -13100 55454 -14228 -106171 -259688
14830 -259688 -244861 -329578 -229445 -71560 -66043 20945 190604 202440 95346 -6603 41694
14819 41694 -37818 -190574 -110967 -67531 -222392 -85668 89716 171692 83139 37964 -139111
14808 -139111 -119792 -112502 -278978 -220178 -218739 -233261 -220825 -92304 -83472 -23347 136500
14797 136500 81453 -211519 -271022 -218063 -80167 -122258 -90681 -20102 166100 223095 228070
14786 228070 117402 19887 -93074 -92790 -121714 -193144 -118698 -92699 -115642 -79112 -60603
14775 -60603 -254017 -291460 -150893 58773 124089 147696 268631 40578 -157631 -25831
14765 -25831 133644 64453 -21429 -91306 78030 147364 136899 196924 126994 116529 102472
14754 102472 162786 143643 -15360 -40874 -89233 -119508 -117720 -71183 -56468 -6766 -80120
14743 -80120 -99983 -62431 -32787 -3716 -118773 -34714 -64726 -150413 -167736 -32909 4643
14732 4643 139921 203874 68103 -48029 31345 35928 52490 6482 -9817 16633 -36579
14721 -36579 -80470 -97645 -105759 -152740 -129619 -34116 43039 16493 59056 186002 222233 174411
14709 174411 83958 -13406 -68936 -101436 -32625 -67316 -19926 6665 118016 63020 124417
14698 124417 129146 103410 196827 181001 131937 151756 179775 38488 -106628 -193293 -180130
14687 -180130 -42635 64291 48528 128409 149475 36173 -67163 -19876 -27943 4918 -8073
14676 -8073 -10995 6443 -14228 -76343 -74271 -120113 -105246 -35401 -128770 -127818 -74860 81722
14664 81722 174143 187694 255965 295977 122363 -9904 -77578 -97326 -214263 -234862 -203413
14653 -203413 31321 19820 -64751 -32636 88763 29179 -7343 -24466 -60263 25083 105868
14642 105868 278117 206432 132251 127890 145604 144154 156597 220840 209162 53937 -42622
14631 -42622 -18929 -6554 73347 101680 167588 -37023 -194111 -242505 -188937 -109717 34178
14620 34178 219040 226589 153276 -84219 -217563 -284081 -217037 -157848 -188846 -203946 -9624
14609 -9624 5549 -108995 -22110 -6790 -35618 -70602 8264 -30886 -53451 -80453 -76560 -1822
14597 -1822 -107849 -191525 -100017 67271 -72630 -104503 54662 50177 44976 -68189 -92927
14586 -92927 -52422 41508 -38719 -196756 -241475 -80666 -156889 -94491 -77462 17460 134352
14575 134352 248726 290275 105847 11419 32109 29731 117527 75101 47019 82036 66159
14564 66159 -60170 -101511 -2113 135473 225189 157461 41326 -40875 -117175 18540 140054
14553 140054 132765 68441 104356 -5480 -115004 -85135 10536 194525 306545 179642 150785
14542 150785 237733 289804 262882 265779 299121 314909 176211 66122 30211 -99760 -181756
14531 -181756 -143759 -135235 -162770 -11955 89208 55423 -81975 -138472 -135362 -102671 -177832
14520 -177832 -205202 -119554 -112409 -174871 -115697 -86418 -31622 -48197 68133 155259 197129
14509 197129 186820 139579 156410 101726 89415 5790 -72202 -37873 -11602 112475 176590
14498 176590 260377 160051 117674 -2911 44588 125071 147086 94513 62442 116243 177789
14487 177789 73832 -20414 -74089 -110787 -153051 -162658 -48257 -25833 76808 125157 132999
14476 132999 90251 59512 57873 9870 -40297 -76278 7174 45999 -17050 -75650 -13330 78171
14464 78171 124472 106216 -97607 -169050 -137758 -211595 -158859 -79592 -142159 -205397 -223077
14453 -223077 -178496 -91077 20068 -69913 -181350 -212358 -245540 -153096 -196636 -95413 -130125
14442 -130125 -152826 23527 14276 70146 60229 67480 82280 98077 71171 -32179 -32347 -4099
14430 -4099 995 110063 51847 128195 130593 63087 -21507 -23564 39324 27875 31709 150138
14418 150138 177893 110250 1038 18281 -50769 -169200 -208092 -112621 -52608 -104580 -138293
14407 -138293 -39051 -60297 48199 59720 10187 -28752 -27403 909 -34844 -36340 -6304 -69173
14395 -69173 -60681 154343 164638 145909 67736 151420 258720 230370 84738 -93291 7110
14384 7110 81324 -48280 -80202 -9194 39426 -77896 -134728 27609 70941 188078 266991
14373 266991 185112 143788 27267 51687 16099 -14884 -86784 -130175 -163228 -144763 -77416
14362 -77416 -102753 -170190 -188838 -249532 -339647 -290023 -237448 -269081 -254455 -266288 -138247
14351 -138247 58987 -12658 -108375 -222220 -292888 -259905 -171709 -233474 -188564 -220833 -301274
14340 -301274 -122467 -14413 109951 122278 95400 73370 31802 -7308 38692 18468 61072
14329 61072 101569 41462 47250 -53505 -108467 -55277 104767 81120 12398 -121095 -79903
14318 -79903 -18520 19742 -75404 -88246 -137479 -110229 -86944 -81938 -63133 12283 -58782 -178278
14306 -178278 -143482 -25948 159636 165907 112474 118320 19627 32341 156678 222511 115610
14295 115610 54425 23510 -72633 -200802 -163051 -125368 -113330 -82336 -89905 -117944 -15304
14284 -15304 46534 107832 62611 90742 135755 170222 38797 126670 237583 81133 35059
14273 35059 -80913 -129908 -49683 30124 27303 127687 106152 102805 177260 77380 47665 62196
14261 62196 -172444 -237420 -115250 -3832 43077 140104 16718 -18223 -38089 -65891 -50679
14250 -50679 -63592 65567 200013 172027 158258 158362 144010 -28811 -168565 -43245 -15246
14239 -15246 11436 46920 -6151 68656 135852 -74619 -85481 -5979 19611 -15998 -37440
14228 -37440 2828 33440 -68106 -71282 -113315 -141402 -148451 -189123 -168283 29421 278194
14217 278194 227254 68361 -47888 9026 3608 -2273 20636 -45038 -55486 -47855 37561 -24122
14205 -24122 -100944 -51736 -5921 -9720 40707 -32669 -55991 -5103 14185 -90473 -129518 -110365
14193 -110365 -131512 -124876 -123547 -170455 -201008 -172654 -179709 -156654 -93049 -130851 -88043 170089
14181 170089 241945 176792 164569 225998 117909 -47962 -192867 -180126 -132898 -78700 -93207
14170 -93207 74769 164661 -30297 -174483 -139552 -125832 -52430 23193 106346 86114 -64555
14159 -64555 -93370 125471 213540 111833 -32291 75604 74583 116140 143638 56717 -58420
14148 -58420 34441 171595 388302 331869 266449 270866 135517 78028 73812 112210 178598
14137 178598 217482 173231 262241 227742 193385 10957 -110928 -190344 -234412 -149578 -4662
14126 -4662 158952 228825 128816 50634 87130 23482 -156280 -244731 -97332 -96670 -81448
14115 -81448 114657 185604 152920 129423 71624 51922 35319 -113705 -182017 -126619 -121426
14104 -121426 -197381 -66963 72564 119490 90724 -32522 -106227 -159140 -185692 -211979 -229556
14093 -229556 -287304 -173799 -30938 -33086 -33604 -89854 -150459 -69980 -120182 -223932 -15926
14082 -15926 96609 96928 94745 108171 78920 130543 101714 -88146 -264349 -275354 -108815
14071 -108815 32685 16624 -49147 4919 -49142 -115261 -9794 42384 98020 200073 142962
14060 142962 218499 165594 94341 39941 136589 242753 135975 25179 -100200 -138242 -154666
14049 -154666 -114245 -115729 14206 29788 -32946 18313 145118 132553 17288 -25446 -54730
14038 -54730 -65990 53934 49368 -85207 -247399 -189863 -193563 -106339 75080 58652 145334
14027 145334 230202 205803 24434 -125483 -87107 -100055 414 42561 61989 36369 102501
14016 102501 151107 78494 14113 105537 135903 -18690 -107157 -54215 -86005 -36990 3243
14005 3243 -84761 -112819 -205803 -289191 -284309 -203842 -112355 -97375 -28695 -26103 -8105 -25750
13993 -25750 -187475 -255863 -113736 -137697 -56515 49746 109877 67350 -64224 -76859 -2926
13982 -2926 31975 -84339 -75941 -153653 -97263 -60410 -73403 -18783 -9152 93553 19429 -72080
13970 -72080 -97352 15932 86264 15038 33225 41494 85402 166697 130321 81980 -64870
13959 -64870 -105153 -183609 -223249 -27690 11633 67642 95139 173135 110319 86867 176214
13948 176214 228960 87380 109843 100372 71829 164253 234175 247367 199235 135840 104383
13937 104383 39653 34903 -33059 -35079 -96147 -93813 -107614 -206409 -129904 -56375 -65524 -218178
13925 -218178 -146850 16145 12814 5336 -29776 -98582 -133752 -24987 115742 154090 189075
13914 189075 137050 96642 54587 6750 26690 9189 -37034 -11279 56118 117718 71485
13903 71485 -77807 41175 154323 162076 29389 91053 242172 259032 411183 285122
13893 285122 78316 83966 103842 134276 133499 184006 134221 12595 47710 -148066 -116164
13882 -116164 -59155 -146028 -154874 -100883 -262478 -372029 -304140 -197594 -80376 -117740 -92687
13871 -92687 -37851 14716 -33303 -54228 -92896 -103107 1541 55088 32741 44657 161512
13860 161512 121330 -3909 -11457 -29743 -2858 52757 -34836 -52976 4347 -127596 -184800
13849 -184800 -66223 -90028 -82870 -113354 -132524 -44101 -29808 78738 80257 -75578 -15833
13838 -15833 154189 92202 -4465 -12946 77913 179000 210451 -52271 -102586 -59078 -170999
13827 -170999 -245897 -186096 -114699 -106135 -81597 41468 30777 -32130 88774 190631 164774
13816 164774 123122 -2443 -4991 30637 -3460 -115783 -85099 -43457 -11367 -37185 76048
13805 76048 119279 -39999 -157999 -50393 -30384 -120503 -138858 -40387 96802 -38192 -179254
13794 -179254 -12074 166957 263636 203248 48075 71293 -36491 -123714 -122425 -149630 -24023
13783 -24023 24501 5152 50566 48654 154098 147846 94405 92265 31987 181149 222692 55338
13771 55338 125455 95045 -39377 -23799 -62430 -30193 -17410 -113273 -111681 -139990 -84439 10210
13759 10210 66678 145272 135882 -44905 -96000 11919 182434 234303 164401 109335 93352
13748 93352 44033 -32225 -47054 -95478 -32376 54586 -52340 -85139 -16435 40421 104522
13737 104522 19817 78419 162121 190152 184453 143258 125147 14658 -39441 44418 209098
13726 209098 202341 95233 162278 113833 -39631 -163226 -180476 -82705 -36803 -33658 60300
13715 60300 -1474 -158442 -186615 -216487 -92989 -16220 -98228 -94263 70500 160893 90381
13704 90381 -20967 -129546 -216622 -272824 -260826 -278671 -220169 -161598 1842 95411 -1813
13693 -1813 -125028 -189742 -174992 -75503 -55663 -56365 -166755 -110106 -49906 -47977 -85970 -125452
13681 -125452 -19102 -99150 -40423 68799 61233 -32748 -145874 -201191 -167624 -154881 -137195
13670 -137195 -142574 -80816 38683 14463 -178427 -190197 -291693 -336144 -382542 -288326 -169956
13659 -169956 9598 132735 145534 54840 7129 -91382 -227850 -101250 82850 112988
13649 112988 198888 151520 124041 116663 80018 165031 141702 2537 -62347 14020 23653 22624
13637 22624 15500 -131663 -61980 87527 179025 96960 92173 72021 -14379 10260 107782 119856
13625 119856 74309 74286 53276 84942 141155 64660 -78680 -91611 110023 195939 310027
13614 310027 230133 76525 -15274 -164126 -246700 -99578 13718 8293 -48559 45872 45864 21989
13602 21989 133806 124701 -19218 -231186 -308325 -217981 -70997 10494 34063 49739 -3888
13591 -3888 77751 42900 -93498 -143959 -49129 -80824 -121269 -85603 38843 121088 172754
13580 172754 120092 -36876 -235881 -259824 -106067 -47196 -78390 -38756 25674 36389 158254
13569 158254 108492 121799 100968 75247 64035 -25111 80236 186994 246233 82805 44804
13558 44804 128617 30678 73402 167668 124020 -15148 -89607 -16970 90109 79014 -11813
13547 -11813 25381 -51879 -215600 -124022 -49076 -12720 -69233 -213981 -261793 -236760 -241854
13536 -241854 -160290 -116693 -89562 -162183 -299069 -265616 -270765 -211477 -186820 -246714 -290612
13525 -290612 -265345 -214467 -102048 -179037 -223319 -136798 13185 -35900 -81348 -13909 -17216
13514 -17216 42100 135946 66826 40244 58405 30902 -31212 -62733 41009 35684 106046 143834
13502 143834 146786 72555 48309 93302 143851 105952 17139 121315 226203 148634 83636
13491 83636 10396 -170952 -176551 -110525 -138172 -217375 -203471 -243598 -115627 -71933 34487
13480 34487 210074 181075 93383 180731 187779 166441 74562 -22954 43370 180564 117728
13469 117728 -14038 -80679 42603 45808 -70262 64302 148263 157966 126114 85475 4038
13458 4038 49740 23285 66015 152380 99638 -9692 -29125 -52463 -12779 -741 -56978 -105111
13446 -105111 35237 8152 -55978 -157084 -133368 -59309 -47859 -149245 -108728 -130171 -93656
13435 -93656 61603 188529 144324 79910 60030 -59438 -124306 -239409 -171093 -135141 -152017
13424 -152017 -157301 -50039 -48373 -104302 28770 194981 194360 53695 56088 159237 83247
13413 83247 -39969 -53169 -169551 -224263 -195862 -172879 6783 125998 36803 -94498 -63061
13402 -63061 -69463 -64940 7897 129388 118739 60630 3477 -5819 28153 93755 117974 161292
13390 161292 58266 62956 167996 126088 154627 104944 102968 48563 -176162 -222170 -88371
13379 -88371 99387 154188 177558 30779 -56196 5224 21032 24779 -36041 -77667 -104597
13368 -104597 -43700 74064 122414 88032 -53696 -80708 58510 81345 -34287 -135886
13358 -135886 -101974 -3034 23129 -58236 -175688 -237967 -142248 -96793 -19183 96533 248124
13347 248124 370286 432920 364780 227359 171435 212993 265191 228052 149002 190543 159632
13336 159632 185304 139841 197248 240850 74358 -18899 11878 60583 146269 81973 -53201
13325 -53201 -82482 -51094 -30248 56300 88850 109140 144435 164199 105550 -48782 -41912 72239
13313 72239 179822 251984 184639 201884 306824 381651 318506 242405 202538 126169 174953
13302 174953 164625 4444 43226 53420 53845 27868 -9828 -504 94636 112930 188567 76246
13290 76246 -89181 16622 177227 131310 137502 157467 107609 180497 147527 218571 189757
13279 189757 295310 446714 502114 470121 237546 116041 179859 260442 171411 166222 123752
13268 123752 88699 46199 95930 -12424 13420 79498 165443 172285 5129 -82405 75497
13257 75497 196663 183538 134677 19246 -22579 61357 238561 182665 113556 101604 65194
13246 65194 18027 9554 47543 138188 242918 132808 109765 60265 4482 105691 163479
13235 163479 121331 114689 122281 128196 230530 280320 176654 13672 27117 85077 141185
13224 141185 108308 102149 48390 192899 259579 230104 228491 169856 148860 135641 74909 45871
13212 45871 138601 90783 -72580 -113039 110634 125179 102545 120773 100006 113924 -10802
13201 -10802 -51536 -76664 -72944 -143800 -281244 -139406 61452 239339 254009 5942 -149198
13190 -149198 -114425 15072 240589 180486 107618 47815 17165 109948 49143 127111 149939
13179 149939 131764 -4637 -31295 -44291 -97314 -98350 -84680 -16160 121763 29663 96174
13168 96174 141781 193888 127020 104756 14397 112142 53814 30354 -64764 -26584 44517 -22606
13156 -22606 -71434 16030 66300 125503 84043 -57977 -113722 -75697 -88780 -56755 -73273
13145 -73273 -47090 -19377 -46638 -46191 64046 136177 89690 89265 79153 77794 42731 38297 125509
13132 125509 190706 244209 170944 39396 80655 143147 106542 60507 170928 173162 38357
13121 38357 -88063 -104044 -16055 -22163 -71471 -6633 -38798 -16074 26808 79197 143729 174220
13109 174220 134232 83513 50620 14689 59931 -31603 -70832 23976 125844 56030 -141753
13098 -141753 -71178 -10136 89257 -36784 -32289 44817 20100 -40763 -141654 -281875 -104533
13087 -104533 -59931 -75121 -166872 -91447 -52255 40202 63198 82274 186878 166586 154456
13076 154456 116440 -98610 -119909 -113294 -21914 13145 142887 106332 177845 171989 137188
13065 137188 106071 84011 160983 264904 283565 207899 38007 -30135 -55494 -89653 -31882
13054 -31882 -60239 8008 -125127 -188760 -110646 -60261 -56571 -17763 -120780 -120926 -27949 -53579
13042 -53579 -153515 -77264 -52066 -160992 -162699 54721 110139 -59183 -110821 -94901 -77284
13031 -77284 -10194 -116833 -240875 -128135 -149145 -251754 -292412 -148373 -103511 -237917
13021 -237917 -180133 -104469 -155652 -60348 -53939 -96957 -83640 -87773 21489 11920 -78256 -70685
13009 -70685 54574 62150 110197 144693 101010 183775 157807 121133 26456 24934 59343 33088
12997 33088 -119074 -76890 -104853 -160631 -146297 -128183 -268625 -286413 -186667 -168359 -85242
12986 -85242 42318 65640 141062 185733 -25003 -321215 -325124 -285165 -113667 -40651 -116140
12975 -116140 -137633 -104572 -74796 -25346 59163 -638 65951 141081 139566 68815 54605 -5616
12963 -5616 -76403 -30862 -55314 -8155 9629 70856 -67349 -144378 -66893 -84513 -73916 -93906
12951 -93906 -89936 -35113 -44078 -159240 -140366 -264955 -302082 -344126 -221163 -56169 99077
12940 99077 46868 -89247 30507 154710 228458 253084 254491 131995 55105 -116946 -292120
12929 -292120 -271170 -91471 94914 168545 130402 23713 -42240 -31379 -23792 -35798 -25535
12918 -25535 -23761 22437 -49372 -3716 2055 180296 301751 213588 148319 50948 31628 42500
12906 42500 54108 37232 -72282 -51947 -94936 -95312 -127500 -82876 -40196 24325 84358 53844
12894 53844 27428 -3325 -41984 -58326 -4388 -8262 -16928 65234 134384 241652 250033 97596
12882 97596 104006 -16895 -66312 -20239 -33152 -107537 -88835 -66118 -155088 -258360 -271553
12871 -271553 -301843 -229245 -94192 31622 -71592 91696 144974 158905 56005 99337
12861 99337 106138 23043 -18835 -31008 2266 15040 -88037 -117726 -37331 7136 114391
12850 114391 174131 182109 239938 185909 186969 108325 -68224 -291364 -289494 -114671 -93143
12839 -93143 -80599 23789 79252 46353 114005 117811 -5173 -183744 -160977 51579 217751
12828 217751 233015 154475 147867 4424 -88912 -20265 60177 55383 -129318 -132541 120088
12817 120088 224238 132392 155951 65368 122867 101587 117115 -9104 3349 138524 201145
12806 201145 105665 35434 -16927 -84115 -29864 23398 -30513 6028 -22002 -96844 -213564
12795 -213564 -224717 -136428 -179799 -202904 -130698 -140927 -17485 -45565 -32528 -90478 -160978
12784 -160978 -272067 -369909 -251412 -111924 -100042 -43983 -11399 -33176 -95662 -110804 -119052
12773 -119052 -187118 -23956 182442 125513 105918 91256 117313 192457 244259 130233 90392
12762 90392 50988 -108081 -100732 -50261 -60245 15073 42332 21523 4017 -127014 -279778
12751 -279778 -223889 -41457 37185 -69863 -6773 -121687 -170060 -157183 -70580 82396 101032
12740 101032 127507 133348 156773 137112 69990 -64446 -119757 -43691 88860 73610 -6871
12729 -6871 -19889 -62736 -94956 -187446 -221666 -195886 -19569 -215731 -259941 -96889 31251
12718 31251 -35956 -146062 -80372 -61231 -233332 -157071 8806 -22996 -54498 -6317 -34895
12707 -34895 -64786 23156 152064 33186 -105295 -68327 80016 62729 -70328 -97360 -120069
12696 -120069 -160302 -244844 -309251 -276022 -174821 -62034 -102359 -43280 -59579 26811 -23345
12685 -23345 6861 96844 159819 190989 93885 16863 262 -22235 104 -23657 -115808 -149881
12673 -149881 -83110 -105308 -165858 -230025 -89547 -129436 -96701 -191964 -154047 -136163 -93894
12662 -93894 16257 -201740 -275893 -120112 16736 38471 61046 -148101 -219823 -168178 -155031
12651 -155031 -136653 -95308 56268 -23250 38622 139680 135432 173417 112895 57491 -16422
12640 -16422 9321 123097 116871 1401 22578 -24318 -75725 -132101 -78916 -140202 -262624
12629 -262624 -170640 -120839 -108558 -164279 -91164 -72441 -66572 53915 75246 -34437 -98023
12618 -98023 -77191 89518 134974 124806 59662 48768 -78223 -155378 -86500 -37772 -114973
12607 -114973 -31622 65596 59289 15140 -174426 -175288 -142175 -202697 -55298 54665 8029
12596 8029 -76955 82786 283167 294301 301420 314035 279117 109259 -2564 -119216 -1520
12585 -1520 -63728 -99413 -51369 57338 80805 -40695 -6591 125156 259049 248892 161867
12574 161867 77953 -83716 -128101 -3626 -17700 -77730 -42628 -46907 -100652 -77514 -186210
12563 -186210 -270285 -205279 -83259 -36497 -192714 -236392 -298106 -260792 -121287 -23395 -39048
12552 -39048 -118477 -119445 61071 115385 88770 -12058 -22023 68285 34142 153723 182161 42064
12540 42064 -18803 -58821 -77780 -72845 102839 108165 -19831 -32211 163406 84695 -141203
12529 -141203 -136877 -83270 -95698 -17237 78242 33246 -104989 -275334 -367792 -217482 -40005
12518 -40005 184346 143008 124802 146428 138782 86620 134517 253325 109275 89697 222817
12507 222817 80208 1565 56117 152826 16848 -64940 -159036 -112090 -18356 -51039 -88684
12496 -88684 -43940 -17464 190184 177883 146216 117912 136809 49425 -33620 -119846 -144493
12485 -144493 -91323 -224136 -220799 -116509 -96637 -92440 17600 44718 -59158 -140302 -171344
12474 -171344 -221251 -192356 -15898 140521 224948 52475 24722 -93205 6834 26459
12464 26459 -82695 -45644 27451 68043 99540 -49212 -12988 77763 812 -57429 20486
12453 20486 97227 17819 -151110 -202060 -167603 -51469 27464 155120 174402 67549 136634
12442 136634 169411 109786 103184 46893 61612 92379 30274 -30008 52324 10781 92124 121473
12430 121473 83034 -3860 -24243 52608 98257 -10053 -103073 -131427 -7401 -55182 -110750
12419 -110750 -258000 -282921 -262553 -71793 85829 206477 180403 -11300 -28449 117994
12409 117994 161164 114395 18346 -151331 -223688 -289960 -308658 -208654 -142050 -115239 19121
12398 19121 -63592 -109597 -105052 -50116 -76549 -85993 -139835 -193482 -43050 -151450 -166338 -162699
12386 -162699 -89603 58973 250727 175008 104582 -45375 27855 -14768 -12467 78181 88143
12375 88143 -51493 -128155 -75110 3569 48521 74257 159559 69597 145242 269773 176173
12364 176173 67806 -8459 -19137 -55565 -135209 -79294 24664 -37201 -113745 -103361 -64837
12353 -64837 -43403 -101224 -215896 -285765 -105471 -34927 -123631 -104738 25857 143621 95163
12342 95163 361 -3447 -10494 166645 211919 187761 154026 89273 113567 104084 -45740 5857
12330 5857 6932 -126435 -245639 -101852 24725 12764 68673 42629 55261 165198 201679
12319 201679 167074 65947 -41754 -155969 -234110 -168372 -8860 205979 153772 134219
12309 134219 166578 75825 68989 58811 89622 182638 175201 17448 -89943 -50780 3235
12298 3235 -107586 -179701 -61420 -49269 -54240 -95894 -103220 18691 -28885 -45014 -11953 28992
12286 28992 26554 -76674 -22729 -11842 20272 51331 61073 61031 90181 168244 66013 73027
12274 73027 60154 -9608 -42116 -33550 9737 -75691 -294224 -286897 -146731 -109103 -158765 -55747
12262 -55747 3440 -37689 -61401 -127421 -142819 -87325 -32210 79148 126 -197555 -267977
12251 -267977 -197979 -106846 -111081 -165269 -227849 -168778 -170038 -125601 -46418 -4378 11075 74678
12239 74678 80401 -32682 -90423 -31007 125116 93714 -97939 -127413 6126 25781 164340
12228 164340 107203 -72085 -193213 -88846 -15438 -100053 -189620 -214986 -192021 -177720 -152616
12217 -152616 -53422 -204813 -197961 -80515 22669 91947 151054 185931 148679 227454 285591
12206 285591 282575 233869 137611 164442 187453 301346 319031 222924 209701 40906 -121806
12195 -121806 -22236 78273 118935 89056 -63374 100412 101900 29266 111038 117017 185085
12184 185085 157480 107781 120985 115355 102349 191421 158216 62628 17762 -5944 49315 123257
12172 123257 166625 53776 -70781 -100873 -160616 -119628 -83973 42722 3513 -47885 -184270
12161 -184270 -269564 -182043 -86790 56588 17268 -225343 -112947 63674 127351 150025 100640
12150 100640 106276 91073 25229 -18225 -59221 13352 81347 48173 178596 161726 127421
12139 127421 108029 -20314 -96475 -120687 -94180 -37752 11298 63667 175373 234232 277760
12128 277760 244280 311538 398645 282135 246640 148750 122521 101306 -125494 -110302 -85648
12117 -85648 -114871 -76210 6990 -55583 -221681 -327162 -257334 -365533 -418085 -227570 -44977
12106 -44977 -62201 33410 67692 -73499 -56774 13535 123593 76318 86600 -24513 -130915
12095 -130915 -36271 -75352 -88616 -66355 -95673 -130637 -58073 -1184 4074 -26276 19762 115932
12083 115932 15760 14083 50940 91850 35085 -16713 111830 210579 57008 -56266 -24853
12072 -24853 62769 -27780 -80516 -109174 -1832 79380 71573 11977 34360 64442 179726
12061 179726 314230 227999 235849 181561 222177 220161 174734 233046 114273 3849 18082
12050 18082 70252 130072 136376 191958 153390 125323 118249 138474 211466 194065 67760 2457
12038 2457 13440 111726 163093 84539 46544 54412 30894 169912 105963 93703 102481 122628
12026 122628 139983 22522 -85215 -7813 -34416 36207 60825 115036 84991 -13091 -117820
12015 -117820 -176377 -196523 -235114 -162820 -177726 -26460 30125 -80332 -134071 -163660 -296225
12004 -296225 -311989 -176246 -109608 -220822 -146708 -64226 -147137 -254715 -349588 -245073 -331759
11993 -331759 -328113 -338035 -274880 -117540 -120404 -163178 -69162 37677 105337 1241 -7202 -3163
11981 -3163 -37803 -24542 -6280 18436 70848 55589 -47979 -24104 -59571 -78085 -6075 156824
11969 156824 140242 78500 113148 59782 4258 -43947 -39542 13295 -51864 -145878 -140421 -88926
11957 -88926 -72179 31194 84445 88818 96696 162741 245072 146914 162881 143690 -22634 140523
11945 140523 221159 142013 55722 -33861 48760 -56603 -130407 58397 215764 162681 149836
11934 149836 139930 48531 45014 40022 -27380 -109390 -47532 23438 -17579 -36506 -70463 -114785
11922 -114785 -58317 -137479 -263101 -181701 -181007 -153902 -120315 -40363 44101 -37771 -100342 18762
11910 18762 -34247 -41083 -39832 -68529 55778 -59566 -126878 -256298 -174547 -166802 -217693 -133591
11898 -133591 -96339 -23229 -27457 13965 114607 31676 10692 132131 250329 210477 42336
11887 42336 -125479 -67625 -458 -51664 -125637 -59714 -30797 42643 140600 81756 87568 25041
11875 25041 19620 -27597 -154411 -96969 -119944 -140976 -89871 -141407 21036 191038 170876
11864 170876 154296 72006 83346 115125 22732 33673 -56394 -222002 -168440 -162639 -156821 -85521
11852 -85521 -126131 -59984 181832 255692 283636 291403 220276 63997 -94220 -144092 -17769
11841 -17769 -49027 -149677 -181270 13630 -5883 10180 43216 -19333 -206237 -125394 -12143
11830 -12143 -48593 2361 77781 68720 81855 88909 208480 225412 60897 41987 8302 37718
11818 37718 -7750 -100545 -41204 28204 30161 261413 290910 -21584 -12656 -35465 -79741 -103517
11806 -103517 -52116 -11465 -29639 -103814 -246696 -297254 -209188 -199456 -197372 -45113 107879
11795 107879 -5514 32448 5771 102238 132157 19085 -36206 12715 92551 86923 138686
11784 138686 93015 96861 -4732 28431 113617 51520 -3916 92345 203170 233333 253804
11773 253804 236539 197187 86656 12426 20755 -18667 -111856 -35377 60497 70573 146596
11762 146596 222007 253947 161220 50488 11527 116801 202377 193828 65261 10556 -21199
11751 -21199 -40300 -176068 -238444 -183528 -80947 -49826 -58301 15551 50183 21742 -123072
11740 -123072 -49137 89702 31218 -23066 -11483 97149 55357 42821 131808 13305 -10728
11729 -10728 -44603 -44255 24372 -23616 8563 174207 127435 -64035 -119908 -124754 -271125 -253093
11717 -253093 -192705 -82763 53755 -26562 -96489 -43373 -86183 -268038 -298281 -189797 -16511
11706 -16511 69185 113956 -29404 -86785 -103738 -95001 -62834 24050 57443 87396 67644 -29849
11694 -29849 3456 97565 50660 -19649 -42721 59428 63770 23574 -44248 -33999 -19568 -34444
11682 -34444 53132 -7607 -70585 -127678 -121250 -96158 -41613 -15731 65283 140412 75696 49828
11670 49828 38955 16205 -82311 -52317 -1922 -11295 -44842 -63651 145966 164577 127166 92146
11658 92146 -93675 -143407 -137793 -125130 -59189 95445 126818 189770 208986 230507 116340
11647 116340 106442 118057 45480 -71448 -115589 -16537 115395 24571 -116104 12824 131382
11636 131382 144661 37287 -22806 -145054 -41806 31746 95023 183581 57162 -136937
11626 -136937 -155198 -260016 -289366 -330536 -269490 -134308 -52823 53406 25826 -37805 9106
11615 9106 -72266 -46335 72547 76643 69763 -55092 -73940 -40573 -37243 16462 38764 14345
11603 14345 -9879 -37510 -117900 -183584 -50423 118601 59524 -31287 -9506 -40541 -50487
11592 -50487 -66801 -135533 -73257 -41129 89920 112386 104645 36271 133594 131678 9281 36007
11580 36007 -12798 -8601 86053 166269 71504 2460 90796 111621 155444 260459 203596 176424
11568 176424 197120 61625 14755 82791 127610 284781 314829 259478 175029 187926 232228
11557 232228 126735 153515 201429 99608 51138 -2281 8159 50652 59174 100498 81202
11546 81202 46549 106289 -10786 -164405 -106856 -75899 -96481 -248959 -198427 -193022 -142504
11535 -142504 -67319 49616 -27737 20306 41247 57177 82872 62007 23823 -35338 19383
11524 19383 -21601 -144398 -309678 -299424 -139483 -35747 53953 14664 -7646 56652 110979
11513 110979 83460 50556 -22132 -99767 -225563 -61584 97317 93320 92343 57053 31066
11502 31066 -100907 -104531 -8673 -57472 -42010 -4253 -41310 -38323 -12252 -68315 -104015 -6975
11490 -6975 9874 173288 309699 183165 25658 -68607 -113914 -157216 -191461 -136775 -12933
11479 -12933 23461 -21 -168069 -74215 -100364 -55477 -32537 -59718 -12770 -7604 -48259 15945
11467 15945 20856 30983 59195 17225 64705 115426 108767 189254 183305 194200 124043 78986
11455 78986 100081 161268 209468 55351 -18886 -12297 -76827 -19830 13376 -33377 -1084 190787
11443 190787 225384 81444 92476 -35694 -111035 -104348 -167953 -19211 -113977 -224527 -262760
11432 -262760 -77590 -77906 -40198 69728 20582 -8682 -96263 -73822 26872 89999 -18377
11421 -18377 100753 174739 181606 165072 128709 300339 401289 302762 81871 -140251 -254759
11410 -254759 -348928 -302533 -42411 5787 -3564 -91981 -38027 -56823 -143862 -57721 171183
11399 171183 210222 176589 132531 20366 -25924 119604 4256 -35297 48153 122401 99297
11388 99297 1224 -117371 -218515 -153648 -5060 41587 13963 68573 12798 -201844 -339511
11377 -339511 -330707 -266321 -87924 -54109 30539 92104 48853 -17823 -88875 -64630 106326
11366 106326 130911 7765 -93078 -138778 -74372 10166 -134181 -294361 -320935 -263678 -76327
11355 -76327 -42276 -206351 -321672 -281707 -276636 -179774 -57661 61988 -22581 -83348 -111940
11344 -111940 -30589 42275 -47386 -162863 -11629 187739 269698 215049 210922 271873 221336
11333 221336 114439 174920 118145 24922 -27181 -26501 -53906 -35364 108215 154839 66791
11322 66791 -19279 24743 39686 63356 13583 -127222 -96738 -49453 -4227 -21979 -100834
11311 -100834 -149198 -209130 -231932 -114702 -39022 142521 76168 -14457 12866 125762 166468
11300 166468 55242 -478 -60064 -79564 -10325 96015 104686 77390 14701 -1745 26064
11289 26064 51796 239305 352733 319322 122812 -49806 -54340 -15231 18467 39549 17535
11278 17535 -34434 -91607 -132793 -17089 38578 -30122 -10145 -31449 -79927 31320 49810
11267 49810 -80737 -107594 -31416 -76966 -110887 -121764 -214644 -179401 -184710 -130774 23925
11256 23925 61782 24479 64601 169838 203873 167327 -10462 -180830 -194746 -153327 -159530
11245 -159530 -88494 4515 -99208 -48798 -45684 -238107 -229297 -104957 -98497 -87968 -43278
11234 -43278 -85895 -34154 139047 354128 281879 155994 115346 -18403 -185204 -208155 -134789
11223 -134789 -7474 104752 44829 -92518 123517 251476 58044 71200 -45692 -37314
11213 -37314 64309 62136 35214 46645 70119 61505 -8498 -121790 -105684 27163 -50359
11202 -50359 -113199 -91576 -67434 -125491 -151201 -44222 -48144 -27701 -24452 -4885 118730 180860
11190 180860 128504 34941 14877 12769 88557 206982 60829 -33517 35641 15996 89612
11179 89612 90875 179253 146919 -37358 -191438 -168849 -5331 3517 -56139 44603 31618
11168 31618 24299 20387 81762 36941 125706 209749 143256 71138 178014 256310 323852 252925
11156 252925 205415 92149 -127666 -187980 -172723 -290839 -204152 -96974 -41229 514 -24503
11145 -24503 -134196 -131256 -145308 -39914 8573 -105151 29139 78222 -28476 -40512 -39808
11134 -39808 -204524 -147749 -124875 -204344 -111344 -26932 -20137 31316 9754 111638 234955
11123 234955 170812 69001 13196 120511 235531 202806 180891 113417 21285 40085 -1408
11112 -1408 -21996 -33050 -38207 21659 -28682 -23782 2885 -31285 -40306 5371 90591 79768
11100 79768 82752 47083 81953 29542 -47638 -10638 58830 87206 31527 -64298 -159526 -65628
11088 -65628 17365 69343 227953 289371 97675 -44873 -120465 -155069 -170621 -47239 -43072
11077 -43072 -134587 -165504 -40626 -131805 -308928 -213688 45502 167442 50842 133565 195878
11066 195878 10679 -94066 15303 53695 -29212 -65666 -64337 -33757 -17833 -37951 -83869
11055 -83869 -101429 -127646 -168788 -61713 35523 -2113 -73093 -31734 125353 156726 135773
11044 135773 56701 -42731 61776 53492 -67457 -11026 114545 72980 -4791 -152767 -254967
11033 -254967 -221148 -34435 24386 80346 116917 301279 303877 44054 -31991 -8144 -34382
11022 -34382 -39206 68846 105129 87169 86531 129576 172068 81835 -88887 -126149 -15300 -39252
11010 -39252 27482 40981 23761 -31195 85414 147404 85257 67607 98969 240319 300879
10999 300879 246489 229408 180440 198908 187505 31742 -43984 20798 185319 103754 -35074
10988 -35074 -47822 20938 -2747 -41487 58166 91747 25582 -32622 -19291 18616 16977 -69046
10976 -69046 -52392 -87758 -178800 -188553 -233657 -197232 -10826 29326 -16400 -110444 -162787 -263698
10964 -263698 -225939 -36499 -47496 -192817 -299521 -207403 -130837 -146092 -127428 60523 57087
10953 57087 -203955 -328811 -253846 23423 142462 162920 253709 230324 -12635 -171470
10943 -171470 -201637 -170083 -73792 73376 29846 61793 78900 -40714 -88526 -160347 -99391
10932 -99391 -145750 -69796 -102425 -265032 -364282 -317663 -220479 -125145 -27276 -31487 -48807 -150912
10920 -150912 -195032 -179474 -153335 -174872 -208835 -101265 84267 205963 125991 74325 26683
10909 26683 -22773 9697 1575 -99482 -131141 -139606 -37910 -16798 6988 90085 42814 -99160
10897 -99160 -72956 -33673 64070 176370 208008 51304 -127831 -133871 -156361 -93648 161827
10886 161827 223397 86774 -79786 -131415 -11738 36301 -87454 -184643 -107449 -37519 -2202
10875 -2202 -87490 -149880 -100903 -56601 65438 96200 102897 41449 42759 -27628 -15353 -25836
10863 -25836 -49685 -55423 -190550 -318385 -309065 -155751 -10149 -13212 -111641 -157562 -176723
10852 -176723 -204103 -188799 -254277 -203631 -167969 -165283 -113439 -87435 -31808 -55674 -48027 -56644
10840 -56644 -169492 -239059 -290904 -330123 -243560 -168872 -176613 -209059 -173541 -63476 -131119
10829 -131119 -145727 -218605 -139045 -46187 -97921 -148109 -223574 -204578 -32393 38622 -72048
10818 -72048 -246825 -192974 -141959 -118134 -99279 -1538 1399 -3412 29294 -42979 -145633 -101420
10806 -101420 -34210 72032 114426 108804 153410 102427 -4762 12198 137380 240804 208667
10795 208667 17050 -27495 -42156 -33464 -79708 -37920 88930 90998 154399 67760 -99017
10784 -99017 -134652 -88170 -111511 -206224 -41032 54794 -10825 -31996 -22467 145459 108564
10773 108564 -109928 -332755 -407908 -255565 768 154334 84126 -40779 -38655 -18832
10763 -18832 -76570 -83984 -31972 -81767 -59517 -58453 75384 157487 198950 130541 27743 -116835
10751 -116835 -230476 -214120 -136466 -13004 -27290 -35926 17635 64091 -21374 -140849 -72099
10740 -72099 -69822 -32659 -119487 -189154 -174140 -53051 74535 35398 -26133 -43088 -15382
10729 -15382 -45607 -58454 84630 166643 75765 5012 -51809 -87536 -195743 -218686 -144162
10718 -144162 -123142 -113124 -72053 62374 -6326 -67268 -36933 35096 200752 156490 53087
10707 53087 -6841 -57608 -32806 -73075 499 84224 277685 269455 136643 7987 -54013
10696 -54013 18262 -30131 -71545 -234923 -120313 91116 26930 -38890 -82688 -43806 -25710
10685 -25710 -22237 -156219 -82854 -59332 -168789 -222457 -151788 -147883 -120068 -93777 2443 12929
10673 12929 -131697 -123269 22602 79299 113849 197519 95824 -24090 -43763 -78355 81290
10662 81290 158771 73541 -65303 -40420 124022 179991 104425 117936 101350 -63789 10721
10651 10721 154649 253539 184055 53450 -38688 -133964 -38609 18094 -95345 -39115 -14304
10640 -14304 -78384 -96203 -2106 -45137 -107586 -154012 -176337 -165605 -56878 -27628 -54530
10629 -54530 58716 20515 -51467 -86047 -193052 -245597 -144944 -3630 49611 -25636 -96955
10618 -96955 104563 154993 -14857 -34796 -101912 -84621 -38787 11813 -38067 -104280 -125240
10607 -125240 -85239 -112245 -37130 -20527 7123 100573 57413 35553 -96592 -70597 -81451
10596 -81451 -87053 126733 183282 49375 79770 200054 192091 29567 -4282 -105654 -118342
10585 -118342 -166045 -120770 -101275 -115160 -118943 -47809 -5064 2988 -3592 24051 -34654 -96349
10573 -96349 -76314 41855 45194 -49145 -159927 -112297 -7608 7261 -87171 -166420 -5545
10562 -5545 58304 121663 -24248 -65487 100794 67438 -22450 35726 53954 79986 20057
10551 20057 29576 -7647 -99113 -165388 -272703 -238763 -114171 -43946 -219380 -134431 -44490
10540 -44490 53325 71096 75150 99738 -69281 -95493 -20558 54505 59345 18798 33330 510
10528 510 25228 -127442 -114415 -211760 -151041 -167073 -68731 19200 -65550 -131051 -133337 -51310
10516 -51310 20471 61442 90339 59378 69620 178677 206035 134795 133913 132669 124845 142029
10504 142029 -68606 -151715 -16228 -92634 -73182 -36851 38508 212582 218883 137392 83522
10493 83522 151983 249926 243617 173690 172395 286924 371746 392053 472461 605204 538436 490659
10481 490659 548408 466070 371481 294329 167417 166822 332297 391940 317962 105683 -88213
10470 -88213 -162272 -36638 6418 28573 94517 183055 154683 -15842 -211528 -373441 -415852
10459 -415852 -225643 -164258 -167151 -195163 -255282 -275773 -100573 -201265 -153846 -25589 110794
10448 110794 65673 -110197 -248121 -215060 -194973 -63303 -119822 -132412 -118099 -99358 41968
10437 41968 131843 207209 125075 -12333 -76644 -12241 226730 162838 101216 163385 192086
10426 192086 110788 66614 9594 -32811 25481 -35151 66878 149625 126910 143197 148751
10415 148751 232384 204357 200304 98786 69279 105950 9431 -29637 -69814 -119339 -150554
10404 -150554 -78467 17793 141015 327362 292387 69070 -44429 -11009 34993 99478 106784
10393 106784 40129 64431 9094 33763 72430 235238 436645 383870 179354 103976 102366
10382 102366 98985 118122 207180 179934 171158 116918 91221 82062 34117 100662 196416 290287
10370 290287 384709 358005 356818 241731 58958 79146 134697 120458 8412 -109732 -118629
10359 -118629 -44566 -48284 -8818 -117014 -165319 -190687 11365 112671 115559 108229 216516
10348 216516 105606 -114336 -154372 -103854 -156909 -147843 -154161 -50082 -73364 -133931 -156641
10337 -156641 -118887 91666 112221 126237 176256 139866 -71661 -129356 -177206 -58753 -6789
10326 -6789 66987 112569 242916 318705 229337 207323 193998 146295 74359 -34453 -8341
10315 -8341 70559 88064 48074 6788 73820 88483 -25308 -87337 -149415 -167493 -195618 -10235
10303 -10235 88748 53798 17752 95329 233792 226005 170435 185528 156574 240448 185120 95408
10291 95408 65093 106798 91847 96215 76694 32706 40300 -65234 -98165 -138658 -227530 -205398
10279 -205398 -175727 -120383 -102902 -177547 -170358 -163266 -198084 -137535 66231 210036 219707 -7607
10267 -7607 -37475 -83643 -92260 -139809 -114586 -60475 -4313 63325 92811 46080 45836 96708
10255 96708 53560 15427 28205 63843 -16388 -62567 -216198 -183427 -173873 -183942 -140209 -179024
10243 -179024 -264367 -225854 -337308 -216765 -75214 72733 165671 176305 215973 223859 74584
10232 74584 43195 -62310 -113702 -37770 8664 107806 38775 -30672 50792 111398 161301
10221 161301 168807 177490 193683 185601 150857 201402 195244 3623 44727 92478 105344 171704
10209 171704 286507 250564 297088 270117 230552 214226 -5411 -90524 -178835 -186950 22362
10198 22362 197714 197036 86470 4731 -69723 -19313 -14010 57751 -51196 -55424 55592 52551
10186 52551 32006 -53761 -31390 112254 184637 131323 117312 -33315 23178 2402 -14842
10175 -14842 72387 152335 46963 5127 31246 69074 9555 -125843 -76242 116123 126352
10164 126352 19445 57011 154115 199953 175956 70576 8492 -26289 5168 76734 34621
10153 34621 47818 96742 -114459 -148264 -129311 -11966 62076 75651 69904 20336 -41732
10142 -41732 -46664 3463 10141 50958 110136 214215 240764 113402 -97659 49812 138947
10131 138947 85673 153566 121668 50518 106739 100243 930 -19909 -55086 79059 45209
10120 45209 119092 -10997 -155740 -184511 -47661 57913 -7805 -9238 27178 107508 106414
10109 106414 318233 351671 175630 73383 -974 69098 116446 59662 2156 -90105 -95654
10098 -95654 39072 74283 -13902 22694 53069 107326 152957 163967 205801 191081 129297
10087 129297 -33551 100096 -7707 -29108 19645 -29694 -39148 -7492 61857 55107 186220
10076 186220 385792 380220 310428 151734 112980 202902 164172 127066 178098 237457 171715
10065 171715 306904 373321 450160 430617 569985 926881 1626466 2506361 3733746 4555210
10055 4555210 4895462 4731376 4573621 4025682 2653678 1721609 1276867 964689 813667
10046 813667 775909 526821 414010 366796 494110 559338 494188 385011 307934 348577 426110
10035 426110 396303 395140 216695 132602 229019 280745 252139 163648 175199 232522 288547
10024 288547 225050 223365 284919 302702 201743 165774 93507 -85699 -118180 -177249 -278047
10013 -278047 -189425 -43044 -65207 -73905 -66230 -166618 -143068 -210786 -160795 -22375 -71521
10002 -71521 5006 57934 202612 280353 263775 233643 311378 263490 164894 87844 54565
9991 54565 13347 131316 168075 113974 83713 52594 37105 -40933 -62829 11201 207756
9980 207756 356172 327801 262654 71233 15483 56570 -51549 20966 -60127 -61900 146739
9969 146739 191256 122284 16173 124232 301571 366207 261994 120124 48303 86902 88291
9958 88291 69456 74746 170660 122864 105650 131593 144124 -4534 -72998 -154487 -108097 -78180
9946 -78180 -79482 53931 91164 109768 69371 45598 87786 107963 -45436 -106194 -58578 -205994
9934 -205994 -271368 -194513 -57310 -68998 -102058 5649 -67733 -156106 -115642 -127764 -38725
9923 -38725 23087 -8943 30283 53708 98969 110701 80455 40204 149347 214629 -7633
9912 -7633 -141010 -105352 -157038 -146938 -133969 -90101 -146257 -115509 -95531 -23740 101826 194380
9900 194380 194255 145135 58076 52855 135146 264365 136350 200 63106 101930 28178 106651
9888 106651 106904 2825 42803 51722 2250 -39520 -57114 20433 41336 -2170 112998 44006
9876 44006 82973 193683 213451 222646 215396 104110 -36974 13438 25899 -31894 -174024
9865 -174024 -84520 -78518 -23920 -33112 -14181 -37380 -56277 63061 107005 179647 121504 -54651
9853 -54651 -30627 -65708 -183093 -146773 7880 119640 19684 -161903 -101782 44033 135144
9842 135144 29516 -134081 -191062 -128470 -64019 -11296 -87716 61238 155513 281952 298247
9831 298247 198542 92640 179741 -5205 -147396 -78440 44597 108122 149904 126069 100793
9820 100793 80831 172177 124731 123554 198918 102983 66161 5801 -82703 104760 145032 165674
9808 165674 162018 163278 183791 169500 142539 140431 -103503 -179676 -86517 49706 194309 166338
9796 166338 87332 31753 118759 176580 188449 86650 -44922 -107311 -61907 -10138 -18570
9785 -18570 -115653 -85387 15929 111171 74969 174089 54597 -46208 492 -80440 -63241
9774 -63241 5226 3263 60193 49232 116671 191205 219228 194456 140416 41465 -66337 -45715
9762 -45715 -15250 -22761 -63531 88608 81832 93296 113918 170424 123151 449 13906 91076
9750 91076 200666 315485 270307 144850 24699 106262 -82286 -102868 30990 128508 215201
9739 215201 142615 39736 -538 19076 54727 40072 -25476 -23887 62214 111186 94576 20765
9727 20765 127610 127182 45414 -20493 -24983 -59679 -47062 -21788 96140 251077 242645 -24239
9715 -24239 -10308 79813 22975 -8854 85569 236820 278207 285409 358674 412846 293405 117532
9703 117532 41176 4563 -66609 -61321 -55043 53587 253142 272827 286961 353270 433997 413780
9691 413780 261164 195005 269263 210248 222326 354536 245357 209773 244174 204245 44802
9680 44802 67077 -53407 -103845 42342 46740 140842 114811 -30565 -65120 102705 249515
9669 249515 51635 -13487 -35909 -98312 -134663 -153346 -141328 -53697 92697 97875 -88349
9658 -88349 -191351 -119701 -28974 -18323 -60809 -190025 -179020 -86285 -14280 37855 234908
9647 234908 436646 343093 209034 296689 243298 156293 126160 -2975 -21315 207400 270165
9636 270165 121120 -17090 -37758 10073 72008 142983 114159 33662 66569 45612 71377
9625 71377 181918 117404 73198 161025 109265 183962 119935 -4293 -114287 -85420 -41504
9614 -41504 29924 39109 5373 -169949 -197728 -23999 -56657 -75432 -118767 -41174 -40362 -67759
9602 -67759 -77435 -130629 -132964 -159113 -99081 -44521 -7790 -3621 68801 47793 -8540 42741
9590 42741 77297 79408 111395 71330 60151 117517 109617 6690 -36190 149678 65663 148
9578 148 -157156 -15367 135348 293864 243556 181536 157022 172692 135431 133967 180323 87045
9566 87045 52815 -4799 -144327 -190917 -240510 -215569 -12076 149575 313821 412276 427179
9555 427179 442607 318907 171676 134703 14849 6492 46657 11244 -49012 -14901 69226
9544 69226 33608 -10345 -82312 -154983 -235395 -243777 -182296 -111143 14624 2681 -111595 -78992
9532 -78992 -47862 -100863 -130310 36919 79845 34985 97963 148223 85784 146428 143816 172211
9520 172211 95067 147554 142370 61350 95600 -17961 -2540 1818 -195759 -64691 183823
9509 183823 303961 223145 53147 -102088 -89781 -32991 -31030 -1902 28971 -33117 -39474
9498 -39474 50283 109446 56545 -30395 74379 94565 80844 -36768 -61558 29649 -74769
9487 -74769 -83408 -38 90008 150256 91944 23879 -35768 2475 -4147 66525 171398 198223
9475 198223 138398 127147 17023 -65682 143280 247831 283375 403500 212349 23673
9465 23673 145706 129837 163188 200136 247063 316951 448096 350524 322433 370451 281349
9454 281349 175349 99852 49715 -43018 -185907 -245130 -271039 -82922 38919 22986 8667
9443 8667 71242 114136 47009 59123 19211 15930 61869 116658 110228 60757 16003 164552
9431 164552 160360 -2942 35383 134814 92043 123402 251324 284638 195205 154062 151769 104543
9419 104543 131849 156565 187488 226773 269674 208270 252596 264924 339029 302629 160964
9408 160964 163812 116256 44230 61222 107414 113712 -39513 -13217 79228 160966 107594 39118
9396 39118 117945 217356 253331 296854 284346 323598 266633 166475 82259 62679 18608 92341
9384 92341 118300 108487 82708 84515 73641 28921 -2691 195467 144868 174386 240147 205714
9372 205714 215045 319944 259600 94751 71434 191996 322501 346169 358513 235705 138272
9361 138272 88193 101099 86769 277577 392998 271479 214022 109452 142582 103272 123605
9350 123605 60820 31531 96505 200564 204516 57963 -65245 70422 112044 63001 225623
9339 225623 316487 259498 117486 211006 259219 254295 212667 156094 284624 315725 138075
9328 138075 -38182 -140564 -49834 201104 343435 459552 467460 412112 323136 227404 201713
9317 201713 282551 263795 81832 90933 247539 261570 97471 22892 172462 248375 231343
9306 231343 213237 182321 225539 186473 195526 91029 97439 82234 72483 152841 140487 258617
9294 258617 193541 38091 26897 65498 155495 247247 297898 318641 367041 253814 94036
9283 94036 142237 168023 326853 435174 388643 266990 289955 418379 394946 317343 361364
9272 361364 363266 449808 385839 198380 146977 176037 126633 254130 332062 387459 465468
9261 465468 402591 456558 353020 261062 283118 265869 239827 244034 221794 236667 382194
9250 382194 394219 318775 211244 300550 297510 185162 50755 203129 358614 341855 386583
9239 386583 407385 427189 407251 385594 256985 229753 317689 260068 190559 171553 209518
9228 209518 211731 171292 181635 341344 301881 331456 355764 330715 253183 227038 201192 169132
9216 169132 246950 252256 243044 217675 409530 547431 564291 588089 578302 550815 455452 402417
9204 402417 505670 531161 512260 421317 421223 296194 315829 419576 440723 463006 316319
9193 316319 297223 343475 282697 190412 232815 255358 351233 425387 398826 372453 530439
9182 530439 418285 429149 528494 523174 454406 334127 387996 427378 240755 185983 311630
9171 311630 433734 351569 450903 395869 416785 453483 525772 544624 614230 592162 557395
9160 557395 595845 498564 524861 502728 389976 467822 465616 471405 588959 627371 670947 618305
9148 618305 461708 506130 589306 723693 689337 728937 742678 630484 431511 491111 599823
9137 599823 768540 847686 812763 716775 702028 820098 863058 838235 735706 653112 815626
9126 815626 897036 993841 1060932 1167716 1220968 1214241 1134108 1197345 1339336 1331438 1296741 1352255
9114 1352255 1581885 1757657 1623784 1523366 1640678 1709117 1760671 1822324 1967576 2117006
9104 2117006 2244782 2218532 2159511 2140344 2344719 2572401 2849018 3070963 3292531 3395849
9094 3395849 3608986 4023518 4585360 5199923 5649414 6160125 6736814 7514003 8479395 9727455
9084 9727455 11371103 13096288 15333818 18254337 21578056 25328196 29273241 32787673
9076 32787673 35600797 37477166 38076724 37199042 34951901 31886564 28473370 25032055
9068 25032055 21956556 19247385 16860895 14916609 13340384 12079841 11067702 10154876
9060 10154876 9283206 8550412 7942895 7421805 6852664 6308670 5960539 5657955 5438057
9051 5438057 5180840 4937343 4782094 4624082 4301629 3894351 3584750 3364173 3310755 3251541
9041 3251541 3194278 3081411 2862572 2876835 2789310 2664111 2419355 2414269 2488557 2340647 2194819
9030 2194819 2089843 2052498 1887473 1839283 1909547 1883477 1900560 1897883 1797086 1699778 1640788
9019 1640788 1592828 1562179 1446000 1501336 1369268 1257696 1198815 1241803 1095603 1166130 1066219
9008 1066219 972543 1053179 1100448 1163970 1184183 997376 974318 958109 919303 884612 756601
8997 756601 763147 790682 693854 602986 559849 662595 564279 568781 496524 469740 601721 636277
8985 636277 608000 473649 396101 408398 443012 508553 534004 534547 473197 427518 362824 293902
8973 293902 371913 382089 471405 312403 211706 224421 262318 286599 408238 493643 367631
8962 367631 348610 353307 224995 164642 137032 170731 249307 310586 330359 269711 144966
8951 144966 120991 162887 394244 468991 496615 405316 322192 355990 348043 179238 113013
$$ [...]
##END NTUPLES=NMR SPECTRUM
##END=
