##TITLE=Analysis number 318357
Compound Code cc 48404
Book Reference 476/18
Project Code adrs
Chemist Name williamk
##JCAMPDX= 6.0         $$ Bruker NMR JCAMP-DX V2.0
##DATA TYPE= NMR SPECTRUM
##DATA CLASS= NTUPLES
##ORIGIN= Bruker BioSpin GmbH
##OWNER= nmr
$$ XWIN-NMR		Version 3.5
$$ Fri Mar 24 12:08:32 2006 GMT Standard Time (UT+0h)  MAYBRIDGE\nmr@NMR_250MHZ
##.OBSERVE FREQUENCY= 250.131544655141
##.OBSERVE NUCLEUS= ^1H
##.ACQUISITION MODE= SIMULTANEOUS (DQD)
##.ACQUISITION SCHEME= undefined
##.AVERAGES= 16
##.DIGITISER RES= 18
##SPECTROMETER/DATA SYSTEM= dpx250
##.PULSE SEQUENCE= zg30
##.SOLVENT NAME= CDCl3
##.SHIFT REFERENCE= (INTERNAL, CDCl3, 0, 16.522)
##AUDIT TRAIL= $$ (NUMBER, WHEN, WHO, WHERE, WHAT)
$$ ##TITLE= Audit trail, XWIN-NMR		Version 3.5
$$ ##JCAMPDX= 5.01
$$ ##ORIGIN= Bruker BioSpin GmbH
$$ ##OWNER= nmr
$$ C:\u/data/dgb/nmr/ADRS/1450/pdata/1/auditp.txt
$$ ##AUDIT TRAIL=  $$ (NUMBER, WHEN, WHO, WHERE, WHAT)
(   1,<2006-03-24 12:07:48.78 +000>,<MAYBRIDGE\nmr>,<NMR_250MHZ>,
      <created by zg, POWCHK disabled, PULCHK disabled
       configuration hash MD5:
       84 BC 41 DB A1 6E 1D 46 DA 25 12 A5 C1 ED C5 3A
       data hash MD5: 64K
       75 10 52 12 CB A8 9B 6A 2B 4F EF 89 0C EB 0C 1E>)
(   2,<2006-03-24 12:08:08.97 +000>,<MAYBRIDGE\nmr>,<NMR_250MHZ>,
      <Start of raw data processing
       ef LB = 0.3 FT_mod = 6 PKNL = 1 SI = 32K 
       data hash MD5: 32K
       13 F0 6E F9 E4 2E 7E A3 6C AD AF 87 EA 08 37 6A>)
(   3,<2006-03-24 12:08:13.06 +000>,<MAYBRIDGE\nmr>,<NMR_250MHZ>,
      <apk 
       data hash MD5: 32K
       9B 62 8F 55 01 D8 EF 03 7F F1 73 5D 3A 19 20 9A>)
(   4,<2006-03-24 12:08:15.20 +000>,<MAYBRIDGE\nmr>,<NMR_250MHZ>,
      <abs ABSG = 5 
       data hash MD5: 32K
       0A 31 BE 8D 74 70 D1 67 82 0D DB 8F 8A F2 AC 47>)
$$ ##END=
$$ 
$$ hash MD5
$$ 5E B4 83 34 5F 5D 65 01 9D 11 3D CE 98 F2 58 4F
##$RELAX= 
##$RELAX= 
##$RELAX= 
##$RELAX= 
##$RELAX= 
##$RELAX= 
##$RELAX= 
$$ Bruker specific parameters
$$ --------------------------
##$DU= <C:\u>
##$EXPNO= 1450
##$NAME= <ADRS>
##$PROCNO= 1
##$TYPE= <nmr>
##$USER= <dgb>
##$AMP= (0..31)
100 100 100 100 100 100 100 100 100 100 100 100 100 100 100 100 100 100 
100 100 100 100 100 100 100 100 100 100 100 100 100 100 
##$AQSEQ= 0
##$AQ_mod= 3
##$AUNM= <au_zg>
##$AUTOPOS= <19 >
##$BF1= 250.13
##$BF2= 250.13
##$BF3= 250.13
##$BF4= 250.13
##$BF5= 500.13
##$BF6= 500.13
##$BF7= 500.13
##$BF8= 500.13
##$BYTORDA= 1
##$CFDGTYP= 0
##$CFRGTYP= 5
##$CHEMSTR= <none>
##$CNST= (0..31)
1 1 145 1 1 1 1 1 1 1 1 1 1 1 1 1 1 1 1 1 1 1 1 1 1 1 1 1 1 1 1 1 
##$CPDPRG= <>
##$CPDPRG1= <>
##$CPDPRG2= <>
##$CPDPRG3= <>
##$CPDPRG4= <mlev>
##$CPDPRG5= <mlev>
##$CPDPRG6= <mlev>
##$CPDPRG7= <mlev>
##$CPDPRG8= <mlev>
##$CPDPRGB= <>
##$CPDPRGT= <>
##$D= (0..31)
0 1 0 0 0 0 0 0 0 0.06 0 0 0 0 0 0 0.0002 0 0 0 0 0 0 0 0 0 0 0 0 0 0 
0 
##$DATE= 1143202066
##$DBL= (0..7)
120 120 120 120 120 120 120 120 
##$DBP= (0..7)
150 150 150 150 150 150 150 150 
##$DBP07= 0
##$DBPNAM0= <>
##$DBPNAM1= <>
$$ [...]
##$SUBNAM7= <"">
##$SUBNAM8= <"">
##$SUBNAM9= <"">
##$SW= 20.6930455092707
##$SWIBOX= (0..15)
0 0 3 0 0 0 0 0 0 0 0 0 0 0 0 0 
##$SW_h= 5175.983436853
##$TD= 65536
##$TD0= 1
##$TE= 294.16
##$TE2= 300
##$TE3= 300
##$TEG= 300
##$TL= (0..7)
0 120 120 120 120 120 120 120 
##$TP= (0..7)
150 150 150 150 150 150 150 150 
##$TP07= 0
##$TPNAME0= <>
##$TPNAME1= <>
##$TPNAME2= <>
##$TPNAME3= <>
##$TPNAME4= <>
##$TPNAME5= <>
##$TPNAME6= <>
##$TPNAME7= <>
##$TPOAL= (0..7)
0.5 0.5 0.5 0.5 0.5 0.5 0.5 0.5 
##$TPOFFS= (0..7)
0 0 0 0 0 0 0 0 
##$TUNHIN= 0
##$TUNHOUT= 0
##$TUNXOUT= 0
##$USERA1= <user>
##$USERA2= <user>
##$USERA3= <user>
##$USERA4= <user>
##$USERA5= <user>
##$V9= 5
##$VALIST= <valist>
##$VCLIST= <CCCCCCCCCCCCCCC>
##$VD= 0
##$VDLIST= <DDDDDDDDDDDDDDD>
##$VPLIST= <PPPPPPPPPPPPPPP>
##$VTLIST= <TTTTTTTTTTTTTTT>
##$WBST= 1024
##$WBSW= 4
##$XGAIN= (0..3)
0 0 0 0 
##$XL= 0
##$YL= 0
##$YMAX_a= 440455
##$YMIN_a= -473434
##$ZGOPTNS= <>
##$ZL1= 120
##$ZL2= 120
##$ZL3= 120
##$ZL4= 120
##$ABSF1= 16.522
##$ABSF2= -4.171173
##$ABSG= 5
##$ABSL= 3
##$ALPHA= 0
##$AQORDER= 0
##$ASSFAC= 0
##$ASSFACI= 0
##$ASSFACX= 0
##$ASSWID= 0
##$AUNMP= <proc_1d>
##$AZFE= 0.1
##$AZFW= 0.1
##$BCFW= 0
##$BC_mod= 0
##$BYTORDP= 0
##$COROFFS= 0
##$CY= 12.5
##$DATMOD= 1
##$DC= 0
##$DFILT= <>
##$DTYPP= 0
##$F1P= 14.0000005364418
##$F2P= -0.99999901652339
##$FCOR= 0.5
##$FTSIZE= 32768
##$FT_mod= 6
##$GAMMA= 0
##$GB= 0
##$INTBC= 1
##$INTSCL= 1
##$ISEN= 128
##$LB= 0.3
##$LEV0= 0
##$LPBIN= 0
##$MAXI= 10000
##$MC2= 0
##$MEAN= 0
##$ME_mod= 0
##$MI= 0
##$NCOEF= 0
##$NC_proc= -4
##$NLEV= 6
##$NOISF1= 0
##$NOISF2= 0
##$NSP= 0
##$NTH_PI= 0
##$NZP= 0
##$OFFSET= 16.522
##$PC= 1
##$PHC0= 168.9304
##$PHC1= 10.29992
##$PH_mod= 1
##$PKNL= yes
##$PPARMOD= 0
##$PSCAL= 4
##$PSIGN= 0
##$REVERSE= no
##$SF= 250.13
##$SI= 32768
##$SIGF1= 0
##$SIGF2= 0
##$SINO= 400
##$SIOLD= 32768
##$SREGLST= <1H.CDCl3>
##$SSB= 0
##$STSI= 32768
##$STSR= 0
##$SW_p= 5175.98343685301
##$SYMM= 0
##$S_DEV= 0
##$TDeff= 65536
##$TDoff= 0
##$TI= <Analysis number 999999
Compound Code 99
Book Reference 9
Project Code 9>
##$TILT= no
##$TM1= 0
##$TM2= 0
##$TOPLEV= 0
##$USERP1= <user>
##$USERP2= <user>
##$USERP3= <user>
##$USERP4= <user>
##$USERP5= <user>
##$WDW= 1
##$XDIM= 32768
##$YMAX_p= 518948258
##$YMIN_p= -231440
$$ End of Bruker specific parameters
$$ ---------------------------------
##NTUPLES= NMR SPECTRUM
##VAR_NAME=  FREQUENCY,     SPECTRUM/REAL,   SPECTRUM/IMAG
##SYMBOL=    X,             R,               I
##VAR_TYPE=  INDEPENDENT,   DEPENDENT,       DEPENDENT
##VAR_FORM=  AFFN,          ASDF,            ASDF
##VAR_DIM=   32768,         32768,           32768
##UNITS=     HZ,            ARBITRARY UNITS, ARBITRARY UNITS
##FACTOR=    0.157963299565203, 1,           1
##FIRST=     4132.6476996994, 0,             0
##LAST=      -1043.33573715361, 0,           0
##MIN=       -1043.33573715361, -231440,     0
##MAX=       4132.6476996994, 518948258,     0
$$ Real data points
##PAGE= N=1
##DATA TABLE= (X++(R..R)), XYDATA
$$ [...]
$$ plain form
23847 4870 -33323 -9953 -16998 -16122 5565 -16712 -77393 -14312 26102 35743 16380 -56468 -47654
23834 -47654 -40519 6772 109591 115778 71849 34248 -9673 -2791 -13324 2984 -42503 -123236
23822 -123236 -74231 -61980 -109568 -66077 -35408 -2623 -26584 -23593 28479 18152 18844 -29831
23810 -29831 -56066 -62076 -83275 -86618 -77380 -66312 -70462 -113021 -91518 -53857 -87418 -59486
23798 -59486 11001 46471 28897 31103 43071 54099 68244 86834 -26962 -71999 -55867 -87135
23786 -87135 -139073 -143688 -93155 -96671 -78764 -33155 -119470 -176865 -174123 -139303 -51151 14837
23774 14837 16235 -13429 3646 -2661 -24130 -49692 -40273 -31113 -37828 -30317 16483 84354 72893
23761 72893 -5750 -67379 -80171 -13326 15241 15300 37526 65230 35582 7568 -27346 -24670
$$ packed form
23847D870l8193K3370p045Q76K1687k2277o0681O3081M0414R641j9363p2848Q814
23834d7654P135M7291J02819O187m3929l7601m3921O882j0533J6308m5487q0733
23822a23236M9005J2251m7588M3491L0669L2785k3961K991N2072j0327O92m8675
23810b9831k6235o010k1199l343R238J1068m150m2559K1503L7661l3561K7932
23798e9486P0487L5470j7574K206J1968J1028J4145J8590j13796m5037J6132l1268
23786h7135n1938m615N0533l516J7907M5609q6315n7395K742L4820Q8152O5988
23774A4837J398k9664J7075o307k1469k5562R419R160o715P511M6800O7871j1461
23761G2893p8643o1629j2792O6845K8567N9K2226K7704k9648k8014l4914K676
$$ plain form
23749 -24670 -58998 -36134 22192 45215 61697 89503 72050 60951 70938 72495 8392 -6567
23737 -6567 -2731 43105 41198 -14139 -4653 -17901 -29971 6217 19140 -22708 -55300 -42937
23725 -42937 -75659 19265 59545 79843 56322 19335 16997 32886 29314 -11914 7744 23789
23713 23789 359 -33343 56991 101886 74587 7463 65348 114688 76261 51267 81810 58943
23701 58943 -9871 -70738 -137193 -88156 -49885 -64999 15514 46190 62909 61721 -28589 -128321
23689 -128321 -139149 -62242 -17537 -30257 -104375 -97966 -44100 -32839 -17295 -25156 -49881 -80432
23677 -80432 -60672 -66814 -27473 6550 15822 -39668 -23683 -31191 -46358 -12487 18614 15955
23665 15955 35732 25447 44472 -13742 -7429 -6666 45056 -8055 -12119 -7254 14359 46847 -6419
$$ packed form
23749b4670l4328K2864N8326K3023J6482K7806j7453j1099R987J557o4103j4959
23737f567L836M5836j907n5337R486j3248j2070L6188J2923m1848l2592J2363
23725d2937l2722R4924M0280K0298k3521l6987k338J5889l572m1228J9658J6045
23713B3789k3430l3702R0334M4895k7299o7124N7885M9340l8427k4994L0543k2867
23701E8943o8814o0867o6455M9037L8271j5114Q0513L0676J6719j188r0310r9732
23689a28321j0828P6907M4705j2720p4118O409N3866J1261J5544p861k4725l0551
23677h0432J9760o142L9341L4023R272n5490J5985p508j5167L3871L1101k659
23665A5955J9777j0285J9025n8214O313P63N1722n3111m064M865K1613L2488n3266
$$ plain form
23652 -6419 33139 42740 53294 69790 37590 6320 -15705 19130 101415 106347 92175 59192
23640 59192 24 -18209 -8665 61715 44485 -64426 -120648 -107713 -24287 29583 3978 5815
23628 5815 -8203 -11273 20898 93170 99165 63432 5203 -20308 -23605 7242 78188 81121 70397
23615 70397 -27661 -81324 -100239 -67419 -26332 37898 31417 -45227 -69403 -75566 -67558 1136
23603 1136 -18573 -64363 -74617 -49541 -10207 15394 7651 2308 -18801 -47545 -78102 -36892
23591 -36892 16194 -31905 -34278 -52449 -26009 -10455 28623 -10409 -34168 6843 27479 -6966
23579 -6966 -33327 -21455 -10344 -6673 -16989 -81481 -99340 -55884 -2296 -39817 -7866 24654
23567 24654 63805 42027 40934 4849 25748 44735 40562 12188 15533 -4864 -40406 -11436
$$ packed form
23652f419L9558R601J0554J6496l2200l1270k2025L4835Q2285M932j4172l2983
23640E9192n9168j8233R544P0380j7230j08911n6222J2935Q3426N3870k5605J837
23628E815j4018l070L2171P2272N995l5733n8229k5511l297L0847P0946K933j0724
23615G0397r8058n3663j8915L2820M1087O4230o481p6644k4176o163Q008O8694
23603A136j9709m5790j0254K5076L9334K5601p743n343k1109k8744l0557M1210
23591c6892N3086m8099k373j8171K6440J5554L9078l9032k3759M1011K0636l4445
23579f966k6361J1872J1111L671j0316o4492j7859M3456N3588l7521L1951L2520
23567B4654L9151k1778j093l6085K0899J8987m173k8374L345k0397l5542K8970
$$ plain form
23555 -11436 -9647 28955 16236 62299 78382 27068 -13999 -19719 63006 87204 -10760 -8835
23543 -8835 7177 7198 22762 46822 74128 51536 -7086 -15704 5734 31643 12056 20008 25505
23530 25505 -2247 26391 105955 117989 142254 128093 84412 59270 78324 50338 32164 21219
23518 21219 29619 56885 77793 51745 44061 76759 46470 14148 16030 30053 -16399 -57539
23506 -57539 -67939 -63161 -61198 -37662 24159 14624 2866 60665 10393 49990 100480 89689
23494 89689 38327 15530 -11885 -15420 43422 -563 1860 27322 796 -5607 295 -15836
23482 -15836 -53650 -34998 2583 107474 119325 106695 121130 131797 91714 64619 70925 92834
23470 92834 106308 9744 -19290 -2712 -33674 -104620 -151387 -121441 -79278 -4218 7512 -12215
$$ packed form
23555a1436J789L8602j2719M6063J6083n1314m1067n720Q2725K4198r7964J925
23543h835J6012K1J5564K4060K7306k2592n8622q618K1438K5909j9587P952N497
23530B5505k7752K8638P9564J2034K4265j4161m3681k5142J9054k7986j8174j0945
23518B1219Q400K7266K0908k6048p684L2698l0289l2322J882J4023m6452m1140
23506e7539j0400M778J963K3536O1821r535j1758N7799n0272L9597N0490j0791
23494H9689n1362k2797k7415l535N8842m3985K423K5462k6526o403N902j6131
23482a5836l7814J8652L7581J04891J1851j2630J4435J0667m0083k7095O306K1909
23470I2834J3474r6564k9034J6578l0962p0946m6767K9946M2163P5060J1730j9727
$$ plain form
23458 -12215 5155 43647 80536 45457 9493 33557 58385 34511 -18761 -66272 -32352 71261
23446 71261 110039 23976 49772 91550 116638 113462 71758 34735 -1812 -9806 -16315 -1978
23434 -1978 16002 21722 -44396 -63764 -41331 -73214 -54875 20697 100482 106545 13838 -14889
23422 -14889 28381 6264 -39629 12801 22485 -37031 7325 6193 12776 130905 151701 117462
23410 117462 110482 77068 6212 -63555 -60941 -75684 -71577 -45447 41979 42461 32575 3133 -19754
23397 -19754 -12652 -15849 -9691 4443 -56691 -99047 -66247 -28858 -65693 -67220 -75645 -56697 -27845
23384 -27845 11466 9991 213 -48758 -58799 -26889 -29008 -18001 5396 10211 40122 105603
23372 105603 133454 63078 44677 44613 77029 86888 78229 79238 -1388 -50025 -72965 -81558 -69651
$$ packed form
23458a2215J7370L8492L6889l5079l5964K4064K4828k3874n3272m7511L3920J03613
23446G1261L8778q6063K5796M1778K5088l176m1704l7023l6547p994o509J4337
23434a978J7980N720o6118j9368K2433l1883J8339P5572P9785O063r2707k8727
23422a4889M3270k2117m5893N2430R684n9516M4356j132O583J18129K0796l4239
23410A17462o980l3414p0856o9767K614j4743M107K6130Q7426M82r886k9442k2887
23397a9754P102l197O158J4134o1134m2356L2800L7389l6835j527q425J8948K8852
23384b7845L9311j475r778m8971j0041L1910k119J1007K3397M815K9911O5481
23372A05603K7851p0376j8401o4L2416R859q659J009q0626m8637k2940q593J1907
$$ plain form
23359 -69651 -88045 -151666 -105709 -38869 -35395 -21091 -27715 -26496 -1895 59462 114318 63732
23347 63732 4656 -76949 -68198 -47539 -41286 6369 67621 71065 44721 34152 -36649 -37858
23335 -37858 -52651 -83890 -73121 -73386 -82096 -110489 -110578 -55225 38309 48381 55050 28204 20974
23322 20974 408 26253 23663 108085 144126 154669 113323 118777 97939 75636 102572 119732
23310 119732 77158 49340 78792 113435 118147 138343 73233 30282 33754 48541 55356 64568
23298 64568 77350 63195 74867 136939 80974 9947 -26254 -20561 44014 33295 38233 24707
23286 24707 -12100 7833 56543 4605 -4815 20556 8250 36859 79480 79140 85247 68947
23274 68947 39371 9362 -33930 -137284 -101813 -36052 -26408 -9642 -67568 -35454 62598 57678
$$ packed form
23359f9651j8394o3621M5957O6840L474J4304o624J219K4601O1357N4856n0586
23347F3732n9076q1605Q751K0659O253M7655O1252L444k6344j0569p0801j209
23335c7858j4793l1239J0769k65q710k8393q9N5353R3534J0072O669k6846p230
23322B0974k0566K5845k590Q4422L6041J0543m1346N454k0838k2303K6936J7160
23310A19732m2574k7818K9452L4643M712K0196o5110m2951L472J4787O815R212
23298F4568J2782j4155J1672O2072n5965p1027l6201N693O4575j0719M938j3526
23286B4707l6807J9933M8710n1938r420K5371j2306K8609M2621l40O107j6300
23274F8947k9576l0009m3292j03354L5471O5761R644J6766n7926L2114R8052m920
$$ plain form
23262 57678 24690 8827 15493 16296 -18496 26071 63859 68528 42183 60058 75661 41648
23250 41648 21849 -1045 -28943 -40290 -27300 3884 -44614 -17850 17661 32778 36068 24378
23238 24378 -24090 -85084 -49502 -52874 -66813 -71002 -62849 -14011 -15465 -70055 -69936 -33168 -10164
23225 -10164 -11041 -82414 -119300 -113255 -77337 -39699 18843 85042 93113 69511 98551 68739
23213 68739 30715 6272 5001 3260 -35066 -61924 -10088 2586 -18631 -28884 -45073 -42230
23201 -42230 -29445 -59121 -94971 -64303 -32546 -3083 -18648 43595 69422 62337 24787 -4150
23189 -4150 -52066 -32168 9633 -21471 -4543 22934 44984 10388 29055 74086 74241 38140
23177 38140 16532 -40322 -81981 -78160 -58789 -94581 -105234 -56950 -56508 -3867 -17210 -65803
$$ packed form
23262E7678l2988j5863O666Q03l4792M4567L7788M669k6345J7875J5603l4013
23250D1648j9799k2894k7898j1347J2990L1184m8498K6764L5511J5117L290j1690
23238B4378m8468o0994L5582l372j3939m189Q153M8838j454n4590J19L6768K3004
23225a0164q77p1373l6886O045L5918L7638N8542O6199Q071k3602K9040k9812
23213F8739l8024k4443j271j741l8326k6858N1836J2674k1217j0253j6189K843
23201d2230J2785k9676l5850L0668L1757K9463j5565O2243K5827p085l7550k8937
23189d150m7916J9898M1801l1104J6928K7477K2050l4596J8667M5031J55l6101
23177C8140k1608n6854m1659L821J9371l5792j0653M8284M42N2641j3343m8593
$$ plain form
23165 -65803 -83902 -31000 -19303 -67322 -98611 -17590 28881 -25684 -65776 -63468 -39318 -22269
23153 -22269 -14556 -29592 -53584 -70320 -43173 12484 13600 -21288 -1149 -23863 -28105 -33560
23141 -33560 -41052 -29287 -29918 -16600 -18140 -65674 -36389 10038 -10116 -49174 -27161 26386
23129 26386 15077 5224 -26737 -30437 -34489 28649 85594 124882 107798 92520 138618 81324
23117 81324 25911 32826 23913 49854 134585 223938 262405 262303 234272 257048 313491 306796 299878
23104 299878 548940 881839 1325410 1778073 2062614 2215004 2167876 1867975 1466310 1062611
23094 1062611 771855 573880 455298 329743 229361 116637 75068 46631 22607 91940
23084 91940 111626 111588 71686 77552 48714 130256 132819 33128 -10633 -28474 -4562 52165 -853
$$ packed form
23165f5803j8099N2902J1697m8019l1289Q1021M6471n4565m0092K308K4150J7049
23153b2269P713j5036k3992j6736K7147N5657J116l4888K0139k2714m242n455
23141c3560p492J1765o31J3318j540m7534K9285M6427k0154l9058K2013N3547
23129B6386j1309r853l1961l700m052O3138N6945L9288j7084j5278M6098n7294
23117H1324n5413O915q913K5941Q4731Q9353L8467j02k8031K2776N6443o695o918
23104B99878K49062L32899M43571M52663K84541J52390m7128k99901m01665m03699
23094A062611k90756j97975j18582j25555j00382j12724m1569k8437k4024O9333
23084I1940J9686l8l9902N866k8838Q1542K563r9691m3761j7841K3912N6727n3018
$$ plain form
23071 -853 -22855 -28945 -10792 -65188 -79214 -44953 5957 50256 13996 22075 -21454 -29427 -16874
23058 -16874 -61015 -62830 -42913 43333 67193 64852 66407 38210 55297 84369 97200 67404
23046 67404 45539 8421 -11621 -38129 -43176 12988 2149 13366 40423 25328 27340 11407
23034 11407 16930 17965 22802 6628 67461 44122 25376 -8981 -2530 79723 94408 82173
23022 82173 158571 185549 184735 167215 128075 74802 119045 127348 88012 71634 30134 11106
23010 11106 27194 81979 81000 16924 1766 -9936 -40486 -31993 34978 -19482 -59598 9746
22998 9746 50494 -30768 -4312 13971 26001 13784 -7717 -26913 -47856 -58694 -13726 19457
22986 19457 72303 36019 6389 -42858 -43797 -93515 -82478 -54183 20891 54707 42845 34472
$$ packed form
23071h53k2002o090J8153n4396j4026L4261N0910M4299l6260Q079m3529p973J2553
23058a6874m4141j815J9917Q6246K3860k341J555k8197J7087K9072J2831k9796
23046F7404k1865l7118k0042k6508n047N6164j0839J1217K7057j5095K012j5933
23034A1407N523J035M837j6174O0833k3339j8746l4357O451Q2253J4685j2235
23022H2173P6398K6978q14j7520l9140n3273M4243Q303l9336j6378m1500j9028
23010A1106J6088N4785r79o4076j5158j1702l0550Q493O6971n4460m0116O9344
22998I746M0748q1262K6456J8283J2030j2217k1501j9196k0943j0838M4968L3183
22986A9457N2846l6284k9630m9247r39m9718J1037K8295P5074L3816j1862q373
$$ plain form
22974 34472 22182 34232 67327 108224 79038 20183 63697 88491 65829 26267 17212 26272
22962 26272 10309 9762 -3350 51803 109415 126800 77769 68048 73016 66466 82558 66151 110031
22949 110031 37060 -3014 52383 126162 98569 1732 -51156 16131 64382 32687 -25186
22938 -25186 -29630 23207 5942 -86006 -54937 15473 -19048 -66191 22826 118163 115173 23436
22926 23436 -35707 18846 82052 65711 44174 25913 -33506 -19700 -11108 51288 59158 47195
22914 47195 24952 -12186 27015 131850 152413 150296 114060 40101 5561 6623 59396 41103
22902 41103 43812 56133 74981 111140 165697 155643 121924 86467 65136 116402 106011 65369
22890 65369 60659 38909 44416 38297 75277 109361 43323 26514 16989 1319 58446 27450
$$ packed form
22974C4472j2290J2050L3095M0897k9186n8855M3514K4794k2662l9562r055R060
22962B6272j5963n47j3112N5153N7612J7385m9031r721M968o550J6092j6407M3880
22949A10031p2971m0074N5397P3779k7593r6837n2888O7287M8251l1695n7873
22938b5186m444N2837j7265r1948L1069P0410l4521m7143Q9017R5337k990r1737
22926B3436n9143N4553O3206j6341k1537j8261n9419J3806Q592O2396P870j1963
22914D7195k2243l7138L9201J04835K0563k117l6236p3959l4540J062N2773j8293
22902D1103K709J2321J8848L6159N4557j0054l3719l5457k1331N1266j0391m0642
22890F5369m710k1750N507o119L6980L4084o6038j6809r525j5670N7127l0996
$$ plain form
22878 27450 12253 16464 3163 31039 103981 105446 112929 90964 66044 15743 -24839 -9614
22866 -9614 -20384 -60901 -74970 -29323 -22635 22653 15871 64716 76037 118492 87170 89610
22854 89610 133230 175188 138369 116016 93689 4775 -29421 -728 6437 39841 86219 116206
22842 116206 178584 170480 166252 180318 150878 126613 114654 133238 198332 240616 184917 83244
22830 83244 39824 -19070 13199 85514 129270 77284 45432 47177 44631 54508 10945 -41949
22818 -41949 -28249 1122 3376 12731 31905 88265 109684 206583 216934 208181 196323 287587
22806 287587 289442 240855 255741 240651 226547 208344 239000 198026 122233 68826 94479 72584
22794 72584 104446 147753 143964 63729 44213 74146 96325 110151 164494 168680 141853 125035
$$ packed form
22878B7450j5197M211j3301K7876P2942J465P483k1965k4920n0301m0582J5225
22866i614j0770m0517j4069M5647O688M5288o782M8845J1321M2455l1322K440
22854H9610M3620M1958l6819k2353k2327q8914l4196K8693P165L3404M6378K9987
22842A16206O2378q104m228J4066k9440k4265j1959J8584O5094M2284n5699j01673
22830H3244m3420n8894L2269P2315M3756n1986l1852J745k546R877m3563n2894
22818d1949J3700K9371K254R355J9174N6360K1419R6899J0351q753j1858R1264
22806B87587J855m8587J4886j5090j4104j8203L0656m0974p5793n3407K5653k1895
22794G2584L1862M3307l789q0235j9516K9933K2179J3826N4343M186k6827j6818
$$ plain form
22782 125035 132503 159612 189814 156828 79707 -2738 -24920 -7562 -13286 -161 7198 20252
22770 20252 24316 30372 80419 123105 85917 53313 41420 12428 69680 79928 77332 90600
22758 90600 152179 201770 223152 158404 79436 81074 183210 232699 254091 321995 301423 227501
22746 227501 142233 95734 53519 93813 109259 140614 118000 118216 92127 54585 64472 125317
22734 125317 138901 101738 55359 89102 114740 102525 21891 7753 -15135 48581 96211
22723 96211 54462 25848 81383 77583 111151 137502 159245 80728 57558 72768 67689 -56267
22711 -56267 -116340 -47822 -44584 -31302 23172 24144 47795 81634 192027 235311 235947 273014
22699 273014 239845 227942 252153 252909 210259 127509 105020 97626 63161 131568 207285 215571
$$ packed form
22782A25035P468K7109L0202l2986p7121q2445k2182J7358n724J3125P359J3054
22770B0252M064O056N0047M2686l7188l2604j1893k8992N7252J0248k596J3268
22758I0600O1579M9591K1382o4748p8968J638J02136M9489K1392O7904k0572p3922
22746B27501q5268m6499m2215M0294J5446L1355k2614K16k6089l7542R887O0845
22734A25317J3584l7163m6379L3743K5638j2215q0634j4138k2888O3716M7630
22723I6211m1749k8614N5535l800L3568K6351K1743p8517k3170J5210n079j23956
22711e6267o0073O8518L238J3282N4474R72K3651L3839J10393M3284O36L7067
22699B73014l3169j1903K4211P56m2650q2750k2489p394l4465O8407P5717Q286
$$ plain form
22687 215571 271591 303662 269114 233126 212213 182667 192043 174837 155328 203548 213431 218329
22675 218329 278154 363439 423892 418613 428970 397045 407421 463515 405981 371520 399252 439782
22663 439782 433727 394680 313854 334209 358272 331377 339506 387711 401931 439263 418896 397650
22651 397650 384494 327881 397708 412346 405917 402755 401856 390996 426395 386570 377448 393565
22639 393565 438706 462303 493876 502913 626239 774449 886076 989552 1178602 1519396
22629 1519396 1949355 2357120 2678807 2910708 2834046 2493621 2036881 1637699 1356225 1249501
22619 1249501 1151125 1043749 977591 924133 916487 948474 1009236 1015454 1031564 1009796 1027128
22608 1027128 1015245 1031537 1098193 1210420 1379158 1525603 1709567 1962605 2237432 2586268
$$ packed form
22687B15571N6020L2071l4548l5988k0913k9546R376j7206j9509M8220R883M898
22675B18329N9825Q5285O0453n279J0357l1925J0376N6094n7534l4461K7732M0530
22663D39782o055l9047q0826K0355K4063k6895Q129M8205J4220L7332k0367k1246
22651C97650j3156n6613O9827J4638o429l162q99j0860L5399l9825r122J6117
22639C93565M5141K3597L1573R037J23326J48210J11627J03476J89050L40794
22629A519396M29959M07765L21687K31901p6662l40425m56740l99182k81474j06724
22619A249501r8376j07376o6158n3458p646L1987O0762O218J6110k1768J7332
22608A027128j1883J6292O6656J12227J68738J46445J83964K53038K74827L48836
$$ plain form
22598 2586268 3031720 3597069 4438980 5823019 7969126 10545648 12821133 14254924 14307937
22589 14307937 12898913 10720864 8428827 6640190 5449533 4736396 4267739 3997995
22581 3997995 3904433 3904785 4026968 4299577 4593120 4940214 5329590 5732717 6169386 6689436
22571 6689436 7285756 8065361 8978580 10051396 11317225 12874082 14850274 17509707 20933097
22562 20933097 25536793 31687892 39874541 50934395 66570541 90340307 128824561
22555 128824561 190106096 271038164 349849773 405577046 419837651 382416402 311736784
22548 311736784 232770308 163570556 114865213 84414784 64999953 51640001 41875010
22541 41875010 34603962 29118330 24966392 21762566 19279728 17287944 15623557 14076863
$$ packed form
22598B586268M45452N65349Q41911J384039K146107K576522K275485J433791N3013
22589A4307937j409024k178049k292037j788637j190657p13137m68657k69744
22581C997995r3562L52J22183K72609K93543L47094L89376M03127M36669N20050
22571F689436N96320P79605R13219J072816J265829J556857J976192K659433L423390
22562B0933097M603696O151099Q186649J1059854J5636146K3769766L8484254
22555A28824561O1281535Q0932068P8811609N5727273J4260605l7421249p0679618
22548C11736784p8966476o9199752m8705343l0450429j9414831j3359952r764991
22541D1875010p271048n485632m151938l203826k482838j991784j664387j546694
$$ plain form
22533 14076863 12528040 11139648 9939600 8854441 7988652 7282551 6659435 6145878 5658747
22524 5658747 5274994 4930646 4603829 4206630 3796267 3476735 3131093 2858000 2677131
22515 2677131 2546941 2412034 2194798 1954782 1829331 1689369 1512473 1408325 1318227 1287829
22505 1287829 1272194 1203121 1161868 1202237 1172408 1071905 1030966 1008148 975323 927179 945110
22494 945110 852488 827579 852172 797217 747154 766998 782167 805662 763235 777016 743869
22483 743869 720414 772184 868454 1091915 1360812 1807179 2240518 2590644 2749366 2714112
22473 2714112 2358644 1878889 1480084 1158144 883937 796267 748675 673498 574118 491981
22463 491981 414219 450962 488555 453130 381474 285678 218168 212938 237583 199167 142698 99891
$$ packed form
22533A4076863j548823j388392j200048j085159q65789p06101o23116n13557m87131
22524E658747l83753l44348l26817l97199m10363l19532l45642k73093j80869
22515B677131j30190j34907k17236k40016j25451j39962j76896j04148r0098l0398
22505A287829j5635o9073m1253M0369k9829j00503m0939k2818l2825m8144J7931
22494I45110r2622k4909K4593n4955n0063J9844J5169K3495m2427J3781l3147
22483G43869k3455N1770R6270K23461K68897M46367M33339L50126J58722l5254
22473B714112l55468m79755l98805l21940k74207q7670m7592p5177r9380q2137
22463D91981p7762L6743L7593l5425p1656r5796o7510n230K4645l8416n6469m2807
$$ plain form
22451 99891 138269 149384 149386 171599 181159 167179 168661 174026 189462 188355 147294 125318 139823
22438 139823 126698 60679 51025 104129 116554 128970 162083 200936 149915 131854 215787 264226
22426 264226 234035 284368 267334 234872 189006 143033 137994 95343 62518 89245 143706 120027
22414 120027 93210 65283 159351 204331 140415 69956 47988 39400 27765 37649 13346 2334
22402 2334 -14437 26267 -78875 -78402 28333 68996 89514 160482 221835 226890 177293 172980
22390 172980 156728 146705 96961 115132 146180 121908 172406 180482 161658 187112 208018 236538
22378 236538 185878 140405 66304 96223 40308 945 -15621 7441 34226 -8614 10540
22367 10540 8441 -109733 -138026 -91366 -8156 38147 44842 50543 58369 6423 2628 -44839
$$ packed form
22451I9891L8378J1115KK2213R560j3980J482N365J5436j107m1061k1976J4505
22438A39823j3125o6019r654N3104J2425J2416L3113L8853n1021j8061Q3933M8439
22426B64226l0191N0333j7034l2462m5866m5973n039m2651l2825K6727N4461k3679
22414A20027k6817k7927R4068M4980o3916p0459k1968q588j1635R884k4303j1012
22402B334j6771M0704j05142M73J06735M0663K0518P0968O1353N055m9597m313
22390A72980j6252j0023m9744J8171L1048k4272N0498Q076j8824K5454K0906K8520
22378B36538n0660m5473p4101K9919n5915l9363j6566K3062K6785m2840J9154
22367A0540k099j18174k8293M6660Q3210M6303O695N701P826n1946l795m7467
$$ plain form
22355 -44839 -38811 -28147 -49182 -67595 -51917 -20072 -25704 -102312 -58678 14261 3718 -10980
22343 -10980 -8931 -24641 56230 131079 89953 -8928 -20787 31766 35147 44853 20482 54264
22331 54264 124222 30363 -23127 -10207 -56467 -88499 -84522 -97370 -73827 -22688 -733 -31856
22319 -31856 -50007 -61127 -134781 -152879 -121003 -104184 -130776 -126712 -99467 -78550 -87662 -79622
22307 -79622 -39945 -74552 -128037 -68295 -20765 4529 16908 7961 26490 60816 35489 40407
22295 40407 74669 50156 12361 17521 70346 55394 5695 18930 47913 82036 61997 63348
22283 63348 26519 6676 -55090 -79217 -97459 -132614 -141634 -142836 -62108 19580 4791 14280
22271 14280 -8709 -26769 -5739 -62375 -99381 -106731 -100502 -61986 -58947 -59248 -17643 21646 -52579
$$ packed form
22355d4839O028J0664k1035j8413J5678L1845n632p6608M3634P2939j0543j4698
22343a0980K049j5710Q0871P4849m1126r8881j1859N2553L381R706k4371L3782
22331E4264O9958r3859n3490J2920m6260l2032L977j2848K3543N1139K1955l1123
22319c1856j8151j1120p3654j8098L1876J6819k6592M064K7245K0917r112Q040
22307g9622L9677l4607n3485N9742M7530K5294J2379q947J8529L4326k5327M918
22295D0407L4262k4513l7795N160N2825j4952m9699J3235K8983L4123k0039J351
22283F3348l6829j9843o1766k4127j8242l5155r020j202Q0728Q1688j4789R489
22271A4280k2989j8060K1030n6636l7006p350O229L8516L039l01M1605L9289p4225
$$ plain form
22258 -52579 -27155 9283 38228 58245 79618 73634 47372 49632 31286 -67326 -76658 -36227
22246 -36227 -38851 -23963 -23607 -93001 -86949 -68205 -98777 -46965 -35039 -11080 -14223 -55090 -83541
22233 -83541 -70120 -78530 -70635 -97486 -79290 -24023 27547 1102 17796 2026 9986 9943 4792
22220 4792 -76003 -43674 -15760 -38259 -7738 -30521 -3665 -35220 -118604 -102973 -82222 -52317
22208 -52317 -83341 -93256 -88729 -111278 -108356 -47519 -43026 -30837 -64258 -105489 -118012 -145594
22196 -145594 -139907 -115159 -75323 -27150 -20730 -8333 17345 24564 24568 13227 -4267 -16945 -67346
22183 -67346 -56008 -54551 -59147 -29375 -7402 -15354 -20854 13693 -55010 12476 3065 -1936 12546
22170 12546 45679 69217 -11187 -29182 31085 68362 129399 103253 21176 -43372 -41307 -10398
$$ packed form
22258e2579K5424L6438K8945K0017K1373n984k6262K260j8346r8612r332M0431
22246c6227k624J4888L56o9394O052J8744l0572N1812J1926K3959l143m0867k8451
22233h3541J3421q410P895k6851J8196N5267N1570k6445J6694j5770P960m3n151
22220D792q0795L2329K7914k2499L0521k2783K6856l1555q3384J5631K0751K9905
22208e2317l1024r915M527k2549K922O0837M493J2189l3421m1231j2523k7582
22196a45594N687K4748L9836M8173O420J2397K5678P219Mj1341j7494j2678n0401
22183f7346J1338J457m596K9772K1973p952n500L4547o8703O7486r411n001J4482
22170A2546L3133K3538q0404j7995O0267L7277O1037k6146q2077o4548K065L0909
$$ plain form
22158 -10398 38389 -25416 -59073 -19699 -4283 17665 -8542 -48956 -73736 -68376 -25352 -46906
22146 -46906 -52645 -65901 -54632 -22655 -40445 -16417 -7200 -44322 -80844 -63139 -21413 30821
22134 30821 74751 48624 11365 -9270 -74419 -112455 -100075 -104455 -110393 -75622 -48114 29502
22122 29502 48833 67002 115701 118415 80976 30935 1189 23438 73354 62202 27703 -60905
22110 -60905 -48848 -20370 53788 59143 1587 -63467 -96590 -102321 -78056 -45447 -48874 -77006
22098 -77006 -32972 99605 79328 9533 -18636 -11845 -30052 -18950 -36536 -63070 -52661 -46650
22086 -46650 -47379 -23203 -1275 14326 43766 65288 9883 -48828 -41983 -67632 -104058 -77926
22074 -77926 -61145 -17441 -46741 -15732 52048 45296 15817 2629 -6203 -23503 18372 -33035
$$ packed form
22158a0398M8787o3805l3657L9374J5416K1948k6207m0414k4780N360M3024k1554
22146d6906n739j3256J1269L1977j7790K4028R217l7122l6522J7705M1726N2234
22134C0821M3930k6127l7259k0635o5149l8036J2380m380n938L4771K7508P7616
22122B9502J9331J8169M8699K714l7439n0041k9746K2249M9916j1152l4499q8608
22110f0905J2057K8478P4158N355n7556o5054l3123n731K4265L2609l427k8132
22098g7006M4034J32577k0277o9795k8169O791j8207J1102j7586k6534J0409O011
22086d6650p29K4176K1928J5601K9440K1522n5405n8711O845k5649l6426K6132
22074g7926J6781M3704k9300L1009O7780o752k9479j3188q832j7300M1875n1407
$$ plain form
22062 -33035 -37814 71808 115519 55853 -2378 5454 -27937 -66460 -34638 -25098 -23375 1344
22050 1344 16400 -6342 -32260 -36455 -29161 -45082 -38728 16927 38583 14804 -3078 -8971 49436
22037 49436 74133 83139 99601 61804 89257 148053 55723 -15122 -13732 73346 94531 37129
22025 37129 -6042 -7256 -20342 -39115 -112845 -99728 -47268 -29858 -51258 -97404 -92775 -26653
22013 -26653 3011 -24683 -2482 32262 104069 110973 136482 160014 146805 137027 167269 264709
22001 264709 409991 500985 673894 994600 1452705 1840069 2112069 2214565 2050041 1726081
21991 1726081 1285615 916884 687278 491807 331510 262844 199011 153185 118552 97058
21981 97058 70977 35732 -12289 -13859 -9716 59607 88012 44586 23814 23000 -29798 -8815
$$ packed form
22062c3035m779J09622M3711n9666n8231P832l3391l8523L1822R540J723K4719
22050A344J5056k2742k5918m195P294j5921O354N5655K1656k3779j7882n893N8407
22037D9436K4697R006J6462l7797K7453N8796r2330p0845J390Q7078K1185n7402
22025C7129m3171j214j3086j8773p3730J3117N2460J7410k1400m6146M629O6122
22013b6653K9664k7694K2201L4744P1807O904K5509K3532j3209r778L0242R7440
22001B64709J45282R0994J72909L20706M58105L87364K72000J02496j64524l23960
21991A726081m40466l68731k29606j95471j60297o8666o3833m5826l4633k1494
21981I7058k6081l5245m8021j570M143O9323K8405m3426k0772q14n2798K0983
$$ plain form
21969 -8815 44144 91874 80511 17257 -44378 -88057 -57631 32585 74917 70566 5036 -37207
21957 -37207 -68855 -81203 -20941 3855 16041 -65 3058 -16499 -45173 -26644 -46779 -62198
21945 -62198 -41959 -85735 -72813 7529 58281 53909 -14288 26801 51141 601 -37789 -11676
21933 -11676 -26497 2102 43786 37035 22391 -1703 -36746 -30591 -23514 -11643 -16562 48390
21921 48390 74145 54747 21379 18308 12481 26655 -31886 -23607 -34408 -13155 5140 -9940
21909 -9940 -2098 13133 23935 77097 96407 56842 -16917 -22370 38379 54924 60157 -12641
21897 -12641 -22417 -58407 -51647 -73876 -98470 -65240 -7257 51604 58639 48431 78637 33616
21885 33616 -19685 29865 159681 149586 98392 83172 38609 52320 1642 -66045 -68176 -55289
$$ packed form
21969h815N2959M7730j1363o3254o1635m3679L0426R0216M2332m351o5530m2243
21957c7207l1648j2348O0262K4796J2186j6106L123j9557k8674J8529k0135j5419
21945f2198K0239m3776J2922Q0342N0752m372o8197M1089K4340n0540l8390K6113
21933a1676j4821K8599M1684o751j4644k4094l5043O155P077J1871m919O4952
21921D8390K5755j9398l3368l071n827J4174n8541Q279j0801K1253J8295j5080
21909i940P842J5231J0802N3162J9310l9565p3759n453O0749J6545N233p2798
21897a2641r776l5990O760k2229k4594L3230N7983N8861P035j0208L0206m5021
21885C3616n3301M9550J29816j0095n1194j5220m4563J3711n0678o7687k131J2887
$$ plain form
21873 -55289 -110047 -140347 -86567 -16017 -47251 -118959 -91688 -72409 -23058 -24641 -46072 -54547
21861 -54547 1047 17847 106949 108143 120012 123010 122493 104893 59106 -723 -17475 -59705
21849 -59705 -25912 -39704 -70364 -103768 -109585 -44197 -76537 -46465 -6932 2496 19301 -26381
21837 -26381 -47971 -28298 -20216 -56841 -100442 -105931 -57390 -70058 -88953 -56986 11700 40359
21825 40359 -15323 -39855 -84075 -64794 21405 83994 81542 64730 83906 33134 7259 26304
21813 26304 23769 28571 21781 -18449 66413 22933 6703 -25023 2338 85701 96978 60933
21801 60933 56151 78758 63194 -32475 44040 97382 74893 62992 39934 -12628 -25290 -34374
21789 -34374 -42178 4161 27782 -3121 20998 -17565 -73378 -72399 -57496 -43980 -36375 -41489 8578
$$ packed form
21873e5289n4758l0300N3780P0550l1234p1708K7271J9279M9351j583k1431q475
21861e4547N5594J6800Q9102J194J1869K998n17j7600m5787n9829j6752m2230
21849e9705L3793j3792l0660l3404n817O5388l2340L0072L9533R428J6805m5682
21837b6381k1590J9673Q082l6625m3601n489M8541j2668j8895L1967O8686K8659
21825D0359n5682k4532m4220J9281Q6199O2589k452j6812J9176n0772k5875J9045
21813B6304k535M802o790m0230Q4862m3480j6230l1726K7361Q3363J1277l6045
21801F0933m782K2607j5564r5669P6515N3342k2489j1901k3058n2562j2662r084
21789c4374p804M6339K3621l0903K4119l8563n5813R79J4903J3516P605n114N0067
$$ plain form
21776 8578 10587 1774 -8904 -12296 -17128 1153 -44504 -37828 -12103 15295 -4059 -15389 -355
21763 -355 27061 7030 -63399 -141536 -111992 -146060 -107703 -49443 -90939 -103355 -111980 -99201
21751 -99201 -107544 -130389 -119124 -135056 -97755 -48142 -29787 -13183 -27819 10771 26184 -7958
21739 -7958 -69981 -106058 -84284 -70694 -114302 -163155 -122328 -62260 -111811 -163924 -114359 -91170
21727 -91170 -76687 -101224 -71092 -44771 -36905 -47108 -54159 -38875 -26807 -47929 -51496 -44291
21715 -44291 92 15682 65714 31366 16558 -36737 -71289 -57030 -38822 -35778 12370 34173
21703 34173 33178 -9698 -20532 -58364 -62321 -67194 -55478 -33148 -39755 -79203 -99183 -60743 -32526
21690 -32526 -19634 -69187 -47289 9355 11186 14715 27089 -4889 -10940 51142 74288 46832
$$ packed form
21776H578K009q813j0678l392m832J8281m5657O676K5725K7398j9354j1330J5034
21763c55K7416k0031p0429p8137K9544l4068L8357N8260m1496j2416q625J2779
21751i9201q343k2845J1265j5932L7301M9613J8355J6604j4636L8590J5413l4142
21739g958o2023l6077K1774J3590m3608m8853M0827O0068m9551n2113M9565K3189
21727i1170J4483k4537L0132K6321P866j0203p051J5284J2068k1122l567P205
21715d4291M4383J5590N0032l4348j4808n3295l4552J4259J8208L044M8148K1803
21703C4173r95m2876j0834l7832l957m873J1716K2330o607l9448j9980L8440K8217
21690c2526J2892m9553K1898N6644J831L529J2374l1978o051O2082K3146k7456
$$ plain form
21678 46832 27850 -17078 -42596 -47417 -57203 -32203 -64902 -58851 -27690 -58974 -43906 -40793
21666 -40793 -72172 -78421 -29004 -37336 -58178 -57384 -66136 -61806 -80554 -71947 -57772 -83634 -180738
21653 -180738 -173991 -57191 18476 18398 -9613 46604 67109 -5152 -33820 -41270 -30776 -8429
21641 -8429 -27417 -67686 -134307 -94208 -56990 -31660 4872 -1679 -98751 -73401 -6411 -32422
21629 -32422 -34530 -11202 -48725 7235 50769 45377 18146 62460 67539 36559 -25651 -86705
21617 -86705 -80593 -93563 -129918 -86467 -46703 -7143 -19253 4196 49591 57707 29495 21931
21605 21931 14444 33391 -11108 -28642 -60378 -46256 -62579 -70606 -87801 -36000 24047 651
21593 651 8748 8641 -17679 -41003 3570 -53582 -107548 -80577 -79850 -87712 -41963 -17322 -8466
$$ packed form
21678D6832j8982m4928k5518m821r786K5000l2699O051L1161l1284J5068L113
21666d0793l1379o249M9417q332k0842P94q752M330j8748Q607J4175k5862r7104
21653a80738O747J16800P5667p8k8011N6217K0505p2261k8668p450J0494K2347
21641h429j8988m0269o6621M0099L7218K5330L6532o551r7072K5350O6990k6011
21629c2422k108K3328l7523N5960M3534n392k7231M4314N079l0980o2210o1054
21617h6705O112j2970l6355M3451L9764L9560j2110K3449M5395Q116k8212p564
21605B1931p487J8947m4499j7534l1736J4122j6323q027j7195N1801O0047k3396
21593F51Q097j07k6320k3324M4573n7152n3966K6971P27p862M5749K4641Q856
$$ plain form
21580 -8466 -13040 -1859 29566 -40877 -46592 -1462 47465 96810 62685 61696 126838 166996 117758
21567 117758 67783 30120 -4552 -9375 -67679 -75305 -97634 -86412 -92202 -76620 -100715 -132277
21555 -132277 -126622 -107805 -121139 -128151 -74978 -33735 -3110 1332 -74264 -31530 42996 60589
21543 60589 27843 -67023 -97016 -85430 4587 62365 7849 -95358 -106948 -51169 12292
21532 12292 31608 49758 26167 -3126 -36617 -42074 -28513 -82592 -92094 -80334 -58121 -26940
21520 -26940 -29085 6261 5119 72606 90453 84555 17069 11334 32107 88572 75468 55636
21508 55636 39700 80513 117182 84844 76373 85255 75809 17377 21926 10672 17254 -5051 -24428
21495 -24428 -43177 -93742 -122680 -132040 -161863 -109879 -62249 -49444 -95606 -78648 -83793 -105909
$$ packed form
21580h466m574J1181L1425p0443n715M5130M8927M9345l4125r89O5142M0158m9238
21567A17758m9975l7663l4672m823n8304p626k2329J1222n790J5582k4095l1562
21555a32277N655J8817j3334p012N3173M1243L0625M442p5596M2734P4526J7593
21543F0589l2746r4866k9993J1586R0017N7778n4516j03207j1590N5779O3461
21532A2292J9316J8150k3591k9293l3491n457J3561n4079r502J1760K2213L1181
21520b6940k145L5346j142O7487J7847n898o7486n735K0773N6465j3104j9832
21508E5636j5936M0813L6669l2338q471Q882r446n8432M549j1254O582k2305j9377
21495b4428j8749n0565k8938r360k9823N1984M7630J2805m6162J6958n145k2116
$$ plain form
21483 -105909 -121729 -111061 -92750 -82555 -13768 8356 -33619 -25385 -7600 -31349 -33967 -5589
21471 -5589 18549 -56602 -26015 -55602 -37394 -1034 -25436 26061 -1238 25548 36950 -7137
21459 -7137 -45408 -7518 -34160 -48204 -24729 -2082 33775 -111 48530 56346 42465 11043
21447 11043 -26249 -23621 -3721 16792 -21021 -39608 -16013 -14008 -60739 -43191 -20088 -55777
21435 -55777 -20686 -36197 -71365 -67196 3366 -8293 -18141 6344 -6373 -20022 -59145 -63742
21423 -63742 -47397 2159 36589 24314 -2525 -29246 -67936 -89412 -87866 -45508 -32094 -39233
21411 -39233 24163 7896 -41491 -52411 -84659 -58906 -14202 7730 -947 10858 -15446 -1352
21399 -1352 -8379 10776 -10389 -9361 40577 38050 -48429 -88541 -67436 -54729 -53531 -52406 -18865
$$ packed form
21483a05909j5820J0668J8311J0195O8787K2124m1975Q234J7785k3749k618K8378
21471e589K4138p5151L0587k9587J8208L6360k4402N1497k7299K6786J1402m4087
21459g137l8271L7890k6642j4044K3475K2647L5857l3886M8641P816j3881l1422
21447A1043l7292K628J9900K0513l7813j8587K3595K005m6731J7548K3103l5689
21435e5777L5091j5511l5168M169P0562j1659r848K4485j2717j3649l9123m597
21423f3742J6345M9556L4430j2275k6839k6721l8690k1476J546M2358J3414p139
21411c9233O3396j6267m9387j0920l2248K5753M4704K1932q677J1805k6304J4094
21399a352p027J9155k1165J028M9938k527q6479m0112K1105J2707J198J125L3541
$$ plain form
21386 -18865 -2171 6731 -12355 -4606 6996 -28094 -36054 -36379 -60357 -70491 -79020 -61483 -59714
21373 -59714 -11043 7716 8715 6299 33451 35021 5302 -38207 -100713 -155589 -112370 -29388
21361 -29388 16728 47649 13401 -2619 54805 60872 -8721 -70440 -17610 38306 -1255 21453
21349 21453 11533 -76418 -51837 -39232 -31179 -99706 -137281 -67230 -14276 -31948 -50363 -52558
21337 -52558 -32333 -96538 -73006 -51240 -56853 -59914 -46836 -57387 -90379 -72434 -74932 -61326
21325 -61326 -49492 -54243 -22139 -51434 -85175 -107350 -150089 -204532 -176965 -127379 -41561 32370
21313 32370 22229 22056 32181 18408 33270 7419 7234 -2345 -45359 -42251 11227 -27104 -42298
21300 -42298 -26611 29628 33559 -8648 -82133 -130033 -160511 -132127 -101851 -84696 -109157 -153899
$$ packed form
21386a8865J6694Q902j9086P749J1602l5090p960l25k3978j0134q529J7537J769
21373e9714M8671J8759R99k416K7152J570k9719m3509o2506n4876M3219Q2982
21361b9388M6116L0921l4248j6020N7424O067o9593o1719N2830N5916l9561K2708
21349B1453r920q7951K4581J2605Q053o8527l7575P0051N2954j7672j8415k195
21337e2558K0225o4205K3532K1766n613l061J3078j0551l2992J7945k498J3606
21325f1326J1834m751L2104k9295l3741k2175m2739n4443K7567M9586Q5818P3931
21313C2370j0141j73J0125j3773J4862k5851j85r579m3014L108N3478l8331j5194
21300d2298J5687N6239L931m2207p3485m7900l0478K8384L0276J7155k4461m4742
$$ plain form
21288 -153899 -130223 -113533 -121778 -47874 1037 8497 -58925 -75021 -30280 7424 5759 -11280
21276 -11280 -45567 -69536 -95922 -91793 10359 48739 39678 -23041 -55343 -64286 -21424 39003
21264 39003 79166 57713 -233 -11834 -89740 -90772 -34908 3282 -6680 -24250 -18805 -27826
21252 -27826 -68143 -53035 -29891 -8407 -13981 1531 28646 71942 34864 -9014 30972 22521
21240 22521 10097 -49638 -37584 -99576 -110155 -87335 -58763 -33246 -39228 -57117 -42313 -40798
21228 -40798 -83843 -118378 -41457 -25000 -56426 -32020 3188 684 9307 38587 -5391 -28549
21216 -28549 18300 -49805 -31401 38781 13570 41374 28599 2045 -27902 10408 53683 15515
21204 15515 -1732 -14108 -18792 -67543 -74952 -5185 -7187 -53500 -63494 -42066 -10092 -1135 11240
$$ packed form
21288a53899K3676J6690q245P3904M8911P460o7422j6096M4741L7704j665j7039
21276a1280l4287k3969k6386M129J02152L8380r061o2719l2302q943M2862O0427
21264C9003M0163k1453n7946j1601p7906j032N5864L8190r962j7570N445r021
21252b7826m0317J5108K3144K1484n574J5512K7115M3296l7078m3878L9986q451
21240B2521j2424n9735J2054o1992j0579K2820K8572K5517n982j7889J4804J515
21228d0798m3045l4535P6921J6457l1426K4406L5208k504Q623K9280m3978k3158
21216b8549M6849o8105J8404P0182k5211K7804j2775k6554k9947L8310M3275l8168
21204A5515j7247j2376m684m8751p409O9767k002m6313r994K1428L1974Q957J2375
$$ plain form
21191 11240 -1065 4638 -30714 -77886 -162671 -155996 -123630 -22100 -12682 -59952 -51108 32
21179 32 18521 -10074 -62976 -89267 -111540 -158547 -138506 -72139 -22825 -10250 -36911 -20938
21167 -20938 -12053 21377 -13208 -75114 -90984 -74148 -19656 9473 54069 101937 84456 84801
21155 84801 70881 49032 88430 83290 72452 39495 2816 7361 2267 -48033 -42472 -36246 -24722
21142 -24722 22982 30602 -13148 -53629 -34773 5757 -50190 -99349 -58259 -31390 -33329 -104127
21130 -104127 -58264 -24822 -48291 -42845 -59837 -58640 -37782 26080 41572 8534 -27453 -103546
21118 -103546 -169534 -137027 -67229 -60346 -63487 -32684 -42595 -63035 -44126 -17744 -61100 -61368
21106 -61368 -3046 48566 89105 83753 60186 70556 76969 36809 50969 63597 54057 2456
$$ packed form
21191A1240j2305N703l5352m7172q4785O675L2366J01530R418m7270Q844N1140
21179C2J8489k8595n2902k6291k2273m7007K0041O6367M9314J2575k6661J5973
21167b0938Q885L3430l4585o1906j5870J6836N4492K9129M4596M7868j7481L45
21155H4801j3920k1849L9398n140j0838l2957l6679M545n094n0300N561O226J1524
21142b4722M7704P620m3750m0481J8856M0530n5947m9159M1090K6869j939p0798
21130a04127M5863L3442k3469N446j6992J197K0858O3862J5492l3038l5987p6093
21118a03546o5988L2507O9798O883l141L0803r911k0440J8909K6382m3356k68
21106f1368N8322N1612M0539n352k3567J0370O413m0160J4160J2628r540n1601
$$ plain form
21094 2456 -22470 -45711 -44194 -29031 -36786 -47842 -113491 -95003 -75606 -6537 -21707 -52649
21082 -52649 -72291 -96619 -94993 -73499 -73949 -29211 21395 -24133 -60006 -38172 -30868 20955
21070 20955 -18088 -103339 -67492 -33804 -31455 29240 27801 5522 -33716 -43829 -23747 -33300
21058 -33300 -49495 -26600 -102 21146 33904 3366 33961 41733 68139 91825 85669 45349
21046 45349 19032 -32270 -39632 -78410 -17876 10629 17906 -254 -2551 -8827 6311 49470
21034 49470 60134 30168 21919 9993 -58958 -94974 -46425 -29187 -40117 1092 16618 37896
21022 37896 44902 -3362 -58275 -25932 -57769 -123920 -97314 -97204 -46574 -1971 -49471 -67383
21010 -67383 -66012 -27327 -51359 -37824 -42362 -67998 -172889 -200054 -201750 -134983 -47260 -9862
$$ packed form
21094B456k4926k3241J517J5163p755j1056o5649J8488J9397O9069j5170l0942
21082e2649j9642k4328J626K1494m50M4738N0606m5528l5873K1834P304N1823
21070B0955l9043q5251L5847L3688K349O0695j439k2279l9238j0113K0082r553
21058c3300j6195K2895K6498K1248J2758l0538L0595P772K6406K3686o156m0320
21046D5349k6317n1302p362l8778O0534K8505P277j8160k297o276J5138M3159
21034D9470J0664k9966q249j1926o8951l6016M8549J7238j0930M1209J5526K1278
21022C7896P006m8264n4913L2343l1837o6151K6606J10N0630M4603m7500j7912
21010f7383J371L8685k4032J3535m538k5636j04891k7165j696O6767Q7723L7398
$$ plain form
20998 -9862 -30283 -142527 -200155 -196233 -212934 -137053 -145023 -165895 -139564 -84762 -93139 -102188
20986 -102188 -121651 -103918 -105364 -130893 -107019 -99443 -69752 -64891 -17532 -26856 -72308 -86376
20974 -86376 -94724 -117622 -150780 -182888 -111156 -38379 -54431 -17434 -15666 -4744 -18187 -51722
20962 -51722 -42629 18235 14973 -8045 49502 71828 27775 -7116 -58216 -43327 -2621 20883
20950 20883 -37416 -54851 -48052 -2740 -8070 -80288 -71172 -61278 -124752 -139308 -84469 -98230
20938 -98230 -45262 -5824 -46117 -41973 13910 49937 91622 45997 95485 71550 74057 38848
20926 38848 34191 55141 46988 53173 89619 29408 -585 -5383 -22244 -44833 -98161 -68894
20914 -68894 -112041 -161653 -121195 -105313 -80788 -84228 -77615 -33311 -85613 -82159 -36445 7082
$$ packed form
20998i862k0421j12244n7628L922j6701P5881p970k0872K6331N4802q377r049
20986a02188j9463J7733j446k5529K3874P576K9691M861M7359r324m5452j4068
20974h6376q348k2898l3158l2108P1732P2777j6052L6997J768J0922j3443l3535
20962e1722R093O0864l262k3018N7547K2326m4053l4891n1100J4889M0706K3504
20950B0883n8299j7435O799M5312n330p2218R116R894o3474j4556N4839j3761
20938i8230N2968L9438m0293M144N5883L6027M1685m5625M9488k3935K507l5209
20926C8848m657K0950q153O185L6446o0211k9993m798j6861k2589n3328K9267
20914f8894m3147m9612M0458J5882K4525l440O613M4304n2302L454M5714M3527
$$ plain form
20902 7082 -6289 4639 70742 37314 20385 -14279 -52369 -108930 -80068 -71390 -125037 -125280
20890 -125280 -118558 -97480 -21310 21574 21931 54642 49272 5494 -48098 -97112 -109907 -34160
20878 -34160 77087 73067 -15144 16102 37130 61546 54994 6987 -64415 -75828 38303 98198
20866 98198 84548 39530 -10652 -21373 -26798 103 33715 16999 26818 13147 -41543 -55960
20854 -55960 -76589 -91982 -104498 -112054 -90304 -56346 -7723 90035 78221 39159 28085 8088
20842 8088 -2636 -25313 -2126 14954 -2182 -21681 -55558 -58719 -41293 10609 1564 -27901
20830 -27901 -33266 -55901 -71606 -79661 -39794 -70766 -55883 -38273 -20254 -14827 -36832 -47028
20818 -47028 -30861 -34129 -103757 -25412 -23669 -32769 -34157 -13344 33936 62141 76452 25892
$$ packed form
20902G082j3371J0928O6103l3428j6929l4664l8090n6561K8862Q678n3647k43
20890a25280O722K1078P6170M2884L57L2711n370m3778n3592m9014j2795P5747
20878c4160J11247m020q8211L1246K1028K4416o552m8007p1402j1413J14131N9895
20866I8198j3650m5018n0182j0721n425K6901L3612j6716R819j3671n4690j4417
20854e5960k0629j5393j2516p556K1750L3958M8623R7758j1814l9062j1074j9997
20842H088j0724k2677K3187J7080j7136j9499l3877l161J7426N1902r045k9465
20830b7901n365k2635j5705q055L9867l0972J4883J7610J8019N427k2005j0196
20818d7028J6167l268o9628P8345J743r100j388K0813M7280K8205J4311n0560
$$ plain form
20806 25892 -54721 -133896 -130274 -103237 -56853 -18737 -6165 -6965 -22994 -80373 -113749 -32461
20794 -32461 -66798 -95760 -129588 -109476 -80996 11263 -10356 -24011 -59668 -66704 -6416 56452
20782 56452 15792 6244 -10870 -63845 -18809 27289 -23350 -63259 -39791 14013 -27357 -65333
20770 -65333 -76700 -133549 -153267 -94143 -54661 -28421 -43663 -109047 -95624 -45700 -79466 -123831
20758 -123831 -138901 -131465 -95660 -88033 -77652 -78666 -161198 -162869 -171440 -143522 -156560 -93421
20746 -93421 -130012 -113842 -46244 -55223 -73936 -88197 -160925 -165702 -95075 -44844 -11472 6197
20734 6197 -4633 73071 76431 -23905 -105362 -96654 -68668 -88446 -39564 -42234 -64922 -90216
20722 -90216 -139999 -129631 -81973 -65068 -69294 -55009 -38600 -34893 -52740 -68001 -33769 14293
$$ packed form
20806B5892q0613p9175L622K7037M6384L8116J2572q00j6029n7379l3376Q1288
20794c2461l4337k8962l3828K0112K8480R2259k1619j3655l5657p036O0288O2868
20782E6452m0660r548j7114n2975M5036M6098n0639l9909K3468N3804m1370l7976
20770f5333j1367n6849j9718N9124L9482K6240j5242o5384J3423M9924l3766m4365
20758a23831j5070P436L5805P627J0381j014q2532j671q571K7918j3038O3139
20746i3421l6591J6170O7598q979j8713j4261p2728m777P0627N0231L3372J7669
20734F197j0830P7704L360j00336q1457Q708K7986j9778M8882k670k2688k5294
20722i0216m9783J0368M7658J6905m226J4285J6409L707j7847j5261L4232M8062
$$ plain form
20710 14293 51442 -10567 -51250 -22635 19253 28889 17708 -8166 -8406 -26322 -9638 735
20698 735 -50693 -53624 -8516 519 -46842 -46176 -104510 -121901 -98266 -16771 62339 51853 17999
20685 17999 -42986 -100846 -138415 -94792 -25036 74417 68375 -23343 -78640 -71157 -64451 -67967
20673 -67967 -116276 -105561 -67595 -50325 -44573 -60355 -61655 11133 18611 6457 -38709 7717
20661 7717 14450 -67944 -86134 -32640 -27737 -5017 -47330 -101450 -66335 12794 -24425 -50701
20649 -50701 -85867 -51624 -63363 -35353 -38771 -74168 -27008 25303 74675 62914 13790 14636
20637 14636 45973 42680 64154 8625 -44777 -78677 -99779 -84861 -63151 -83233 -57788 -75481
20625 -75481 -108166 -101316 -44616 -28927 26339 -22107 -103753 -164942 -159825 -133324 -116877 -119138
$$ packed form
20710A4293L7149o2009m0683K8615M1888R636j1181k5874k40j7916J6684J0373
20698G35n1428k931M5108R035m7361O66n8334j7391K3635Q1495P9110j0486l3854
20685A7999o0985n7860l7569M3623O9756R9453o042r1718n5297P483O706l516
20673f7967m8309J0715L7966J7270N752j5782j300P2788P478j2154m5166M6426
20661G717O733q2394j8190N3494M903K2720m2313n4120L5115P9129l7219k6276
20649e0701l5166L4243j1739K8010l418l5397M7160N2311M9372j1761m9124Q46
20637A4636L1337l293K1474n5529n3402l3900k1102J4918K1710k0082K5445j7693
20625g5481l2685O850N6700J5689N5266m8446q1646o1189N117K6501J6447k261
$$ plain form
20613 -119138 -124805 -92095 -68053 -44460 -41996 -72370 -22788 -88495 -150084 -188530 -146806 -132344
20601 -132344 -105136 -50111 -49172 -79059 -123643 -42983 -64924 -124992 -153076 -121488 -50331 2785
20589 2785 -12830 -70921 -73864 -95962 -111266 -152219 -137546 -49253 -2429 -11185 11973 42389
20577 42389 -37393 -76051 -149612 -87537 46842 66961 58439 65052 -29935 -142254 -140916 -77479
20565 -77479 -15010 46797 66941 56875 44493 -9928 -12008 3197 -44044 -79607 -79863 -37266
20553 -37266 -32648 -32120 -39286 -47125 -70364 -74679 -32775 -39823 -6051 -27518 -56725 -95219 -77186
20540 -77186 -62838 -53158 -94454 -102419 -128160 -93501 -86565 -64445 -110507 -121874 -78200 -28565
20528 -28565 -7193 -36911 -112090 -99160 -100489 -129793 -189171 -132529 -42190 -61892 -84711 -85857
$$ packed form
20613a19138n667L2710K4042K3593K464l0374M9582o5707o1589l8446M1724J4462
20601a32344K7208N5025R39k9887m4584Q0660k1941o0068k8084L1588P1157N3116
20589B785j5615n8091k943k2098j5304m0953J4673Q8293M6824q756K3158L0416
20577D2389p9782l8658p3561O2075J34379K0119q522O613r4987j12319J338O3437
20565g7479O2469O1807K0144j0066j2382n4421k080J5205m7241l5563k56M2597
20553c7266M618N28p166p839k3239m315M1904p048L3772k1467k9207l8494J8033
20540g7186J4348R680m1296p965k5741L4659O936K2120m6062j1367M3674M9635
20528b8565K1372k9718p5179J2930j329k9304n9378N6642R0339j9702k2819j146
$$ plain form
20516 -85857 -76985 -67925 -87251 -46581 -14974 13679 -3135 8654 -58087 -66237 -11433 -10560 21614
20503 21614 23452 16720 3208 -5276 -95236 -124096 -113114 -110834 -112814 -52333 -63466 -42887 -82020
20490 -82020 -76216 -74717 -41215 -34599 -34328 -52936 -75846 -91626 -109421 -62085 -30945 -1139 519
20477 519 41682 74080 43053 35577 35432 -4 -24600 37337 46144 55643 63233 18364 -4021
20464 -4021 9839 61386 2891 -51383 -62360 -30951 29865 -35540 -139937 -168531 -121235 -129362
20452 -129362 -145058 -169942 -128109 -14678 -397 -51319 -47883 -34248 -72556 -88065 -71407
20441 -71407 -52077 -37656 -66526 -50966 -29738 -18597 -73301 -143344 -155853 -91117 -10142 29723
20429 29723 23380 -37918 -60022 -49533 -38326 -20592 -32484 -54417 -48797 -51436 4020 16821
$$ packed form
20516h5857Q872R060j9326M0670L1607K8653j6814J1789o6741q150N4804Q73L2174
20503B1614J838o732j3512q484q9960k8860J0982K280j980O0481j1133K0579l9133
20490h2020N804J499L3502O616K71j8608k2910j5780j7795M7336L1140K9806J658
20477E19M1163L2398l1027p476j45l5436k4596O1937Q807R499P590m4869k2385
20464d021J3860N1547n8495n4274j0977L1409O0816o5405j04397k8594M7296q127
20452a29362j5696k4884M1833J13431J4281n0922L436J3635l8308j5509J6658
20441g1407J9330J4421k8870J5560K1228J1141n4704p0043j2509O4736Q0975L9865
20429B9723o343o1298k2104J0489J1207J7734j1892k1933N620k639N5456J2801
$$ plain form
20417 16821 -2187 -56548 -15226 6167 874 1184 19058 -12081 -58478 -67942 -33372 -77918
20405 -77918 -123650 -131030 -81463 -70429 -40839 -21138 -41207 -28421 -305 -3507 -17822 -22173
20393 -22173 -33519 -35643 -13398 -36944 -97194 -85434 -52392 -34277 -30301 -73114 -102666 -108782
20381 -108782 -147555 -159676 -74751 -58231 -55858 -73118 -45010 -62641 -55084 -102685 -118203 -60033
20369 -60033 45878 90917 70036 58436 3379 1162 -25062 -89028 -100056 -57205 -46494 -69654
20357 -69654 -63372 -86499 -112046 -101838 -72714 -46045 -37227 -63914 -78161 -56711 -79490 -82860
20345 -82860 -122693 -116813 -66457 -47080 -3252 26695 7607 -78031 -63781 67501 52052 50185
20333 50185 -14364 -21599 33736 43171 -12770 -44713 -1228 -5123 -9819 -26649 -67031 -42264
$$ packed form
20417A6821j9008n4361M1322K1393n293L10J7874l1139m6397r464L4570m4546
20405g7918m5732p380M9567J1034K9590J9701k0069J2786K8116l202j4315m351
20393b2173j1346k124K2245k3546o0250J1760L3042J8115L976m2813k9552o116
20381a08782l8773j2121Q4925J6520K373j7260K8108j7631P557m7601j5518N8170
20369f0033J05911M5039k0881j1600n5057k217k6224o3966j1028M2851J0711k3160
20357f9654O282k3127k5547J0208K9124K6669Q818k6687j4247K1450k2779l370
20345h2860l9833N880N0356J9377M3828K9947j9088q5638J4250J31282j5449j867
20333E0185o4549p235N5335R435n5941l1943M3485l895m696j6830m0382K4767
$$ plain form
20321 -42264 -24842 -28279 6585 27724 -6520 -95262 -65894 20652 2659 -59374 -77897 11012
20309 11012 55838 52042 32062 34373 -8616 -85743 -100881 -129711 -103665 -47196 -31799 -16187
20297 -16187 -13997 -31811 -36582 -74416 -82898 -53411 -8850 21649 524 -28954 -22065 -7353
20285 -7353 -23590 -31366 -21352 14568 46550 2946 -62209 -83506 -37637 -22297 31573 85117
20273 85117 63246 -7055 -27540 -110998 -175686 -205321 -129584 -100920 -51943 -70068 -114607 -119076
20261 -119076 -28568 102146 125736 74378 9788 -36456 -57688 -15213 21966 -4984 -48917
20250 -48917 -56507 -44403 -138182 -136507 -109306 -111892 -49474 -41613 -41418 -33745 8087 57169 40579
20237 40579 15344 -45649 -65077 -47142 -47852 -81519 -107779 -169409 -128617 -127467 -107305 -72108
$$ packed form
20321d2264J7422l437L4864K1139l4244q8742K9368Q6546j7993o2033j8523Q8909
20309A1012M4826l796j9980K311m2989p7127j5138k8830K6046N6469J5397J5612
20297a6187K190j7814m771l7834q482K9487M4561L0499k1125k9478O889J4712
20285g353j6237p776J0014L5920L1982m3604o5155k1297M5869J5340N3870N3544
20273H5117k1871p0301k0485q3458o4688k9635P5737K8664M8977j8125m4539m469
20261a19076R0508J30714K3590n1358o4590m6244k1232M2475L7179k6950m3933
20250d8917p590J2104r3779J675K7201k586O2418P861J95P673M1832M9082j6590
20237D0579k5235o0993j9428J7935p10l3667k6260o1630M0792J150K0162L5197
$$ plain form
20225 -72108 -45971 -44052 -43767 -41950 -33755 2053 -32569 -21588 18025 21463 -18406 -41570 4022
20212 4022 31756 26000 32144 -54689 -51315 -55239 -54384 -21828 -26214 -12827 -5127 -59703 -84806
20199 -84806 -60308 -54155 -47277 -26479 -91564 -123373 -138963 -134824 -96194 -16839 65875 32365
20187 32365 33159 50606 36751 -12053 -32344 -43003 -93316 -50720 -19622 -38069 -6802 -15064
20175 -15064 -34165 -96782 -126787 -82254 -48976 -14033 7220 7539 34643 -21404 -40670 -76769
20163 -76769 -65016 13280 60646 77164 88861 94057 28714 15544 -11974 31518 66078 103472
20151 103472 46901 -24016 -41216 -62510 -78776 -39793 -10850 22476 34895 -50385 -81386
20140 -81386 -80898 -73175 -31468 -50003 -48705 -44962 -2120 53315 3735 -20072 18227 68472 87589
$$ packed form
20225g2108K6137J919K85J817Q195L5808l4622J0981L9613L438l9869k3164M5592
20212D022K7734n756O144q6833L374l924Q55L2556m386J3387P700n4576k5103
20199h4806K4498O153O878K0798o5085l1809j5590M139L8630P9355Q2714l3510
20187C2365P94J7447j3855m8804k0291j0659n0313M2596L1098j8447L1267q262
20175a5064j9101o2617l0005M4533L3278L4943K1253L19K7104n6047j9266l6099
20163g6769J1753P8296M7366J6518J1697N196o5343j3170k7518M3492L4560L7394
20151A03472n6571p0917j7200k1294j6266L8983K8943L3326J2419q5280l1001
20140h1386M88P723M1707j8535J298L743M2842N5435m9580k3807L8299N0245J9117
$$ plain form
20127 87589 52945 -977 -31174 -17119 16062 -1703 -24345 18659 30018 38081 45480 44918
20115 44918 -39136 -16726 93357 109368 81800 95387 50458 49635 69988 -4394 -67094 -36154
20103 -36154 -38178 67634 123483 75858 13764 16964 28700 12079 -7785 -9751 55886 58546
20091 58546 4127 -53915 -71060 -12624 105558 105849 36969 9364 67287 97663 89303 37271
20079 37271 54321 97958 103818 69941 -25553 -70092 -29404 -47504 -38958 -27348 -16154 35217
20067 35217 12050 -9101 -19200 -27611 -96910 -125421 -79851 -85917 -70158 13563 33988 6757
20055 6757 -56229 -75660 -78603 -46906 -64040 -58011 -32734 -40890 -127911 -187633 -87033 -32557
20043 -32557 -72210 -109550 -28844 42832 60665 32925 14805 16378 3407 -25550 -34155 -53530
$$ packed form
20127H7589l4644n3922l0197J4055L3181j7765k2642M3004J1359Q063P399n62
20115D4918q4054K2410J10083J6011k7568J3587m4929q23K0353p4382o2700L0940
20103c6154k024J05812N5849m7625o2094L200J1736j6621j9864j966O5637K660
20091E8546n4419n8042j7145N8436J18182K91o8880k7605N7923L0376q360n2032
20079C7271J7050M3637N860l3877r5494m4539M0688j8100Q546J1610J1194N1371
20067C5217k3167k1151j0099q411o9299k8511M5570o066J5759Q3721K0425k7231
20055F757o2986j9431k943L1697j7134O029K5277q156q7021n9722J00600N4476
20043c2557l9653l7340Q0706P1676J7833k7740j8120J573j2971k8957q605j9375
$$ plain form
20031 -53530 -69409 -75949 -27070 -20376 -998 77171 60191 112522 124178 62068 -36198 -49739
20019 -49739 24078 60185 3578 -55018 -401 34478 -36812 -84367 -36471 50552 3155 -48330
20007 -48330 -18793 -5388 24959 84425 88942 29272 116111 56517 999 -9669 24358 37627
19995 37627 23062 42227 -9313 -123635 -115532 -86584 18477 44597 67782 95800 113520
19984 113520 93240 14726 -44781 6150 30786 93152 77327 87971 134612 125403 53924 -9319
19972 -9319 -24929 71342 90168 49349 -18380 31640 69396 60824 111629 158567 105894 142500
19960 142500 160084 97272 95413 126308 152111 219392 357471 410989 516018 523397 557631
19949 557631 629113 596393 531918 524992 535705 644826 716789 804813 932371 1055180 1105676
$$ packed form
20031e3530j5879o540M8879O694J9378P8169j6980N2331J1656o2110r8266j3541
20019d9739P3817L6107n6607n8596N4617L4879p1290m7555M7896Q7023m7397n1485
20007d8330K9537J3405L0347N9466M517n9670Q6839n9594n5518j0668L4027J3269
19995C7627j4565J9165n1540j14322Q103K8948J05061K6120K3185K8018J7720
19984A13520k0280p8514n9507N0931K4636O2366j5825J0644M6641r209p1479o3243
19972i319j5610R6271J8826m0819o7729N0020L7756q572N0805M6938n2673L6606
19960A42500J7584o2812j859L0895K5803O7281J38079N3518J05029P379L4234
19949E57631P1482l2720o4475o926J0713J09121P1963Q8024J27558J22809N0496
$$ plain form
19938 1105676 1010336 953340 836029 742958 629173 580077 626348 672100 718585 696678 712123
19927 712123 679993 590500 546773 463611 358885 274554 218988 169649 159150 149647 146487 155246
19915 155246 142361 116416 94815 60980 40052 27893 53934 94622 107867 79106 103765
19904 103765 185271 144599 55680 62102 123518 96675 79720 60783 53909 50247 42653 28268
19892 28268 -29588 -45847 -41808 -10769 -57050 -77812 -110052 -91160 -18981 13377 6127 12486
19880 12486 63860 126043 110176 -2262 -38537 -21574 27038 26978 74300 150891 86331 29662
19868 29662 5139 4705 93419 107142 54383 22615 110559 149438 91260 68128 108853 99917
19856 99917 49717 45546 56793 12638 11535 31480 41434 32733 14086 -5890 31260 19090
$$ packed form
19938A105676r5340n6996j17311r3071j13785m9096M6271M5752M6485k1907J5445
19927G12123l2130q9493m3727q3162j04726q4331n5566m9339j0499r503l160Q759
19915A55246j2885k5945k1601l3835k0928j2159K6041M0688J3245k8761K4659
19904A03765Q1506m0672q8919O422O1416k6843j6955j8937o874l662p594j4385
19892B8268n7856j6259M039L1039m6281k0762l2240J8892P2179L2358p250O359
19880A2486N1374O2183j5867j12438l6275J6963M8612o0M7322P6591o4560n6669
19868B9662k4523m34Q8714J3723n2759l1768Q7944L8879n8178k3132M0725q936
19856I9917n0200m171J1247m4155j103J9945R954q701j8647j9976L7150j2170
$$ plain form
19844 19090 19658 38923 55754 30615 3720 74600 27702 19509 35039 -4715 31592 940
19832 940 -14307 -18065 -12763 6644 -23987 -75470 -25462 29479 25208 3392 32322 76326 75205
19819 75205 15207 36143 37171 83060 66813 24109 -56945 -63194 -50156 -50633 -80001 -82964 -72430
19806 -72430 -39364 47313 39191 42585 71722 76974 48932 29057 3174 64176 155234 203452
19794 203452 233692 226442 149507 121850 116873 49851 39532 80315 23930 -67851 -59662 -1382
19782 -1382 42150 17974 -22734 10501 62741 117144 170926 207523 181583 151312 128269 70976
19770 70976 70814 73134 41892 25673 62164 126606 100714 97265 71777 58760 70040 22424
19758 22424 -23314 25218 70001 42501 -1274 37967 57883 3152 -34406 -86706 -28901 -23695
$$ packed form
19844A9090N68J9265J6831k5139k6895P0880m6898q193J5530l9754L6307l0652
19832I40j5247l758N302J9407l0631n1483N0008N4941m271k1816K8930M4004j121
19819G5205n9998K0936J028M5889j6247m2704q1054o249J3038m77k9368k963J0534
19806g2430L3066Q6677q122L394K9137N252k8042j9875k5883O1002R1058M8218
19794B03452L0240p250p6935k7657m977o7022j0319M0783n6385r1781Q189N8280
19782a382M3532k4176m0708L3235N2240N4403N3782L6597k5940l0271k3043n7293
19770G0976j62K320l1242j6219L6491O4442k5892l449k5488j3017J1280m7616
19758B2424m5738M8532M4783k7500m3775L9241J9916n4731l7558n2300N7805N206
$$ plain form
19746 -23695 46213 39514 -9005 36625 90511 121898 117198 67697 58225 79305 105167 103601
19734 103601 85911 117724 36208 10182 11136 32078 40393 129293 162735 137260 120335 137496
19722 137496 117918 104461 107614 123909 123951 146280 151631 159820 158769 168862 143327 148616 170266
19709 170266 214154 185289 192582 223195 226355 217917 142688 156738 136267 115182 100275 133425
19697 133425 147323 139973 141509 153089 114504 130840 130137 128713 124868 129904 128555 125862 175801
19684 175801 194547 181997 241273 205588 215374 200427 201665 157521 145012 129252 86221 91486
19672 91486 76473 96801 132421 76918 31168 70397 31353 -20557 5938 18449 26212 49235
19660 49235 57260 80417 95865 71368 39463 41067 111693 101313 38882 7097 52053 112914
$$ packed form
19746b3695O9908o699m8519M5630N3886L1387m700m9501r472K1080K5862j566
19734A03601j7690L1813q1516k6026R54K0942Q315Q8900L3442k5475j6925J7161
19722A37496j9578j3457L153J6295M2K2329N351Q189j051J0093k5535N289K1650
19709A70266M3888k8865P293L0613L160q438p5229J4050k0471k1085j4907L3150
19697A33425J3898p350J536J1580l8585J6336p03j424l845N036j349k693M9939
19684A75801J8746j2550N9276l5685R786j4947J238m4144j2509j5760m3031N265
19672I1486j5013K0328L5620n5503m5750L9229l9044n1910K6495J2511P763K3023
19660D9235Q025K3157J5448k4497l1905J604P0626j0380o2431l1785M4956O0861
$$ plain form
19648 112914 82253 55490 42092 22353 35394 123328 226179 220537 133475 56529 46151
19637 46151 64762 80938 97858 160661 160183 150603 84824 60537 47687 90106 88052 47526
19625 47526 27637 46430 93532 121242 116200 78184 109524 115997 67548 47943 80723 68267
19613 68267 70090 48688 19927 16206 -9727 -23100 -10108 6252 44738 50730 58365 85258
19601 85258 94263 141863 137365 145145 196013 281885 314407 343048 408890 431796 422658 426784 478148
19588 478148 500961 497202 468031 462439 492508 485502 499369 550822 575974 490909 467763 509800
19576 509800 551023 562200 506127 488196 471772 370864 316915 353100 339114 298753 275060
19565 275060 218062 253343 275927 256669 211530 216667 204079 189155 215362 240523 247066 254435
$$ packed form
19648A12914l0661k6763j3398j9739J3041Q7934J02851n642q7062p6946j0378
19637D6151J8611J6176J6920O2803m78r580o5779k4287j2850M2419k054m0526
19625D7526j9889J8793M7102K7710n042l8016L1340O473m8449j9605L2780j2456
19613F8267J823k1402k8761l721k5933j3373J2992J6360L8486N992P635K6893
19601H5258R005M7600m498P780N0868Q5872L2522K8641O5842K2906r138M126N1364
19588D78148K2813l759k9171n592L0069p006J3867N1453K5152q5065k3146M2037
19576E09800M1223J1177n6073j7931j6424j00908n3949L6185j3986m0361k3693
19565B75060n6998L5281K2584j9258m5139N137j2588j4924K6207K5161O543P369
$$ plain form
19553 254435 312919 318953 318119 359310 396685 440630 515720 594824 619566 583699 582228 559540
19541 559540 566596 639006 689142 680463 721924 820531 845092 900324 896912 841369 744059 727590
19529 727590 688805 694422 790174 846094 838005 770452 653552 537913 521958 537305 537394 588968
19517 588968 563293 516720 496499 534980 501361 527810 526809 548579 532238 573587 615225 645226
19505 645226 635884 718433 756731 782730 810401 850959 895131 886307 974310 1123073 1214640 1306757
19493 1306757 1299412 1318721 1355361 1339917 1345629 1417616 1442979 1472649 1519829 1544942 1582972 1603606
19481 1603606 1640337 1683052 1717059 1794914 1965537 2156913 2369538 2568347 2863583 3292241
19471 3292241 3755490 4173772 4607973 5061624 5395232 5732261 6261977 6886370 7736896
$$ packed form
19553B54435N8484O034q34M1191L7375M3945P5090P9104K4742l5867j471k2688
19541E59540P056P2410N0136q679M1461R8607K4561N5232l412n5543r7310j6469
19529G27590l8785N617R5752N5920q089o7553j16900j15639j5955J5347Q9N1574
19517E88968k5675m6573k0221L8481l3619K6449j001K1770j6341M1349M1638L0001
19505F45226r342Q2549L8298K5999K7671M0558M4172q824Q8003J48763R1567R2117
19493A306757p345J9309L6640j5444N712P1987K5363K9670M7180K5113L8030K0634
19481A603606L6731M2715L4007P7855J70623J91376K12625J98809K95236M28658
19471C292241M63249M18282M34201M53651L33608L37029N29716O24393Q50526
$$ plain form
19462 7736896 8908103 10391344 12198813 14265671 16551898 19238017 22729618 27400606
19454 27400606 34421904 45323884 60552017 76514690 88843237 97795892 104085227
19447 104085227 105781287 102698209 97109728 92264196 93664565 105267120 125123597 147591719
19439 147591719 168096194 182027552 186981611 183015261 170228604 149896809 127291623
19432 127291623 108045160 96937180 96708706 103856189 110355983 112935945 112691076 108472019
19424 108472019 98801067 84576430 67740652 51491916 39168020 30899316 25331771
19417 25331771 21365665 18494517 16373182 14659215 13276268 12087830 10922336 9923578
19409 9923578 9045088 8189725 7449812 6825470 6244725 5729146 5200757 4708747 4230661
$$ packed form
19462G736896J171207J483241J807469K066858K286227K686119L491601M670988
19454B7400606P021298J0901980J5228133J5962673J2328547Q952655O289335
19447A04085227J696060l083078n588481m845532J400369J1602555J9856477K2468122
19439A47591719K0504475J3931358M954059l966350j2786657k0331795k2605186
19432A27291623j9246463j1107980k28474P147483O499794K579962k44869m219057
19424A08472019r670952j4224637j6835778j6248736j2323896q268704n567545
19417B5331771l966106k871148k121335j713967j382947j188438j165494r98758
19409I923578q78490q55363p39913o24342n80745n15579n28389m92010m78086
$$ plain form
19400 4230661 3810331 3478467 3234288 3003660 2817801 2557377 2331100 2171886 2048375
19391 2048375 1942699 1815771 1769289 1774272 1733257 1639637 1555653 1460140 1360146 1229881 1185293
19380 1185293 1139700 1083647 1043901 1070092 1094529 1038517 986002 927000 907026 938405 883017
19369 883017 802414 764041 682546 698866 729799 731345 743851 753610 743661 691232 705864 657799
19357 657799 622304 619371 631954 621999 617068 625240 588396 544432 538018 550651 569295 531249
19345 531249 487270 503852 566093 605742 573909 533768 427744 391923 492092 503227 527356
19334 527356 505846 506508 477531 441092 405737 412833 379313 315575 259116 238379 295142 255659
19322 255659 243607 318417 338530 300610 283923 316270 303692 341567 364527 330413 344451
$$ packed form
19400D230661m20330l31864k44179k30628j85859k60424k26277j59214j23511
19391B048375j05676j26928m6482M983m1015r3620q3984r5513r9994j30265m4588
19380A185293m5593n6053l9746K6191K4437n6012n2515n9002j9974L1379n5388
19369H83017q0603l8373q1495J6320L0933J546J2506R759r949n2429J4632m8065
19357F57799l5495k933J2583r955m931Q172l6844m3964o414J2633J8644l8046
19345E31249m3979J6582O2241L9649l1833m0141j06024l5821J00169J1135K4129
19334E27356k1510O62k8977l6439l5355P096l3520o3738n6459k0737N6763l9483
19322B55659j2052P4810K0113l7920j6687L2347j2578L7875K2960l4114J4038
$$ plain form
19311 344451 385427 442054 429240 402274 349502 351987 374336 416086 401390 398170 406899 418833
19299 418833 416042 430237 406676 353699 375383 364394 306600 299968 306366 285271 248626 271297
19287 271297 308171 308418 294228 267517 304964 325667 285344 312389 296299 296751 290821 336972
19275 336972 374723 365570 357961 305221 295548 320519 321669 302156 303426 284054 275847 298198 321765
19262 321765 329975 356646 363234 303363 257928 225623 231770 248279 256758 292902 370749 399942
19250 399942 392435 378371 357324 360733 413102 356348 309374 341577 313228 261756 247790 224042
19238 224042 186984 236350 245157 180138 216928 282867 314009 281465 222182 215270 285258 341612
19226 341612 321458 256337 261632 285668 275527 185950 172190 195519 210839 242863 260007 279055
$$ packed form
19311C44451M0976N6627j2814k6966n2772K485K2349M1750j4696l220Q729J1934
19299D18833k791J4195k3561n2977K1684j0989n7794o632O398k1095l6645K2671
19287B71297L6874K47j4190k6711L7447K0703m0323K7045j6090M52n930M6151
19275C36972L7751r153p609n2740r673K4971J150j9513J270j9372q207K2351K3567
19262C21765Q210K6671O588n9871m5435l2305O147J6509Q479L6144P7847K9193
19250C99942p507j4064k1047L409N2369n6754m6974L2203k8349n1472j3966k3748
19238B24042l7058M9366Q807o5019L6790O5939L1142l2544n9283o912O9988N6354
19226C41612k0154o5121N295K4036j0141q9577j3760K3329J5320L2024J7144J9048
$$ plain form
19214 279055 262405 200217 168020 238545 239380 216567 245887 303546 234803 278245 401467 445621
19202 445621 384130 354756 283899 292432 319664 321236 398453 500864 514320 470933 478085 415426
19190 415426 353105 359440 443261 442689 469454 419824 337819 331257 349271 379339 441910 467909
19178 467909 403277 350375 355744 369143 417224 441433 464677 473569 511594 573449 603570 619841
19166 619841 615200 659053 724966 833057 969952 1048886 1099222 1161398 1134511 1023174 865170
19155 865170 772554 787769 818475 875157 993429 1170423 1310079 1395195 1419757 1421417 1497320
19144 1497320 1551728 1449205 1281431 1187711 1135949 1146707 1170919 1205977 1331147 1470872
19134 1470872 1615423 1681513 1652530 1611382 1557044 1513461 1524613 1542939 1581053 1641564 1733495
$$ packed form
19214B79055j6650o2188l2197P0525Q35k2813K9320N7659o8743M3442J23222M4154
19202D45621o1491k9374p0857Q533K7232J572P7217J02411J3456m3387P152o2659
19190D15426o2321O335Q3821n72K6765m9630q2005o562J8014L0068O2571K5999
19178D67909o4632n2902N369J3399M8081K4209K3244Q892L8025O1855L0121J6271
19166F19841m641M3853O5913J08091J36895P8934N0336O2176k6887j11337j58004
19155H65170r2616J5215L0706N6682J18272J76994J39656Q5116K4562J660P5903
19144A497320N4408j02523j67774r3720n1762J0758K4212L5058J25170J39725
19134A470872J44551O6090k8983m1148n4338m3583J1152J8326L8114O0511R1931
$$ plain form
19123 1733495 1858410 2026165 2195366 2359752 2500570 2650373 2771971 2844810 2923567 3082629
19113 3082629 3252242 3391788 3634377 3893797 4273987 4738083 5272078 5788288 6414807
19104 6414807 7256532 8456382 10211494 12615414 15924002 20769728 28333231 40032358
19096 40032358 53798322 62614994 63817223 59417018 52742261 49376368 52441733 62491732
19088 62491732 74857872 81698743 83055680 82158080 81768613 80728015 75972666 67732238
19080 67732238 57912347 51049202 50081445 55429209 63754442 66990773 62569473 52689944
19072 52689944 40442553 30460307 23857775 19547631 16562320 14494242 13091407 12212627
19064 12212627 11780693 11592995 11482019 11380574 11256943 11153051 11176797 11406457 11815802
$$ packed form
19123A733495J24915J67755J69201J64386J40818J49803J21598P2839P8757J59062
19113C082629J69613J39546K42589K59420L80190M64096N33995N16210O26519
19104F414807Q41725J199850J755112K403920L308588M845726P563503J1699127
19096D0032358J3765964Q816672J202229m400205o674757l365893L065365J0049999
19088F2491732J2366140O840871J356937q97600l89467j040598m755349q240428
19080F7732238r819891o863145r67757N347764Q325233L236331m421300r879529
19072E2689944j2247391r982246o602532m310144k985311k068078j402835q78780
19064A2212627m31934j87698j10976j01445j23631j03892K3746K29660M09345
$$ plain form
19055 11815802 12636996 13912924 15766968 18603867 22948212 29645117 40201768 55270034
19047 55270034 70372075 77607411 76752507 70342119 63346686 61965281 68663083 82577131
19039 82577131 96103290 101865410 102140628 100897671 100693880 97948428 90278867 78755220
19031 78755220 66956788 60555027 62154422 71008445 80538397 81536732 73554315 59606067
19023 59606067 44548222 33173373 25812092 20965205 17699835 15349905 13650439 12425615
19015 12425615 11534937 10898860 10319936 9899407 9574577 9274488 8997604 8929821 8957766 9078716
19005 9078716 9243094 9566791 10123012 10968557 12260971 14115992 16782737 21038039 27913886
18996 27913886 38183287 50308265 59203299 61414221 58087879 52356397 48968844 51510844
$$ packed form
19055A1815802Q21194J275928J854044K836899M344345O696905J0556651J5068266
19047E5270034J5102041P235336q54904o410388o995433j381405O697802J3914048
19039H2577131J3526159N762120K75218j242957k03791k745452p669561j1523647
19031G8755220j1798432o401761J599395Q854023R529952R98335p982417j3948248
19023E9606067j5057845j1374849p361281m846887l265370k349930j699466j224824
19015A2425615q90678o36077n78924m20529l24830l00089k76884o7783K7945J20950
19005I078716J64378L23697N56221Q45545J292414J855021K666745M255302O875847
18996B7913886J0269401J2124978Q895034K210922l326342n731482l387553K542000
$$ plain form
18988 51510844 60692069 73809667 85889043 93687999 94175093 86512644 74506028 62178417
18980 62178417 53014061 49585518 52170586 57811272 60790233 57736916 49636217 39259467
18972 39259467 30042333 23526291 19351326 16726225 14947800 13691123 12829398 12210721
18964 12210721 11725982 11333986 10958441 10753278 10680416 10707368 10831130 11059272 11573200 12420998
18954 12420998 13617908 15190022 17482310 20894264 26130077 34419307 47345960 64207575
18946 64207575 78870381 84778110 81729751 73572571 66455784 65898349 73953658 88774629
18938 88774629 105062235 118317162 124064374 118427116 104202222 87139494 72283226
18931 72283226 64087839 63806175 68893952 73169107 71208495 62779435 50556916 38408741
$$ packed form
18988E1510844R181225J3117598J2079376P798956M87094p662449j2006616j2327611
18980F2178417r164356l428543K585068N640686K978961l053317q100699j0376750
18972C9259467r217134o516042m174965k625101j778425j256677q61725o18677
18964A2210721m84739l91996l75545k05163p2862K6952J23762K28142N13928Q47798
18954A2420998J196910J572114K292288L411954N235813Q289230J2926653J6861615
18946F4207575J4662806N907729l048359q157180p116787n57435Q055309J4820971
18938H8774629J6287606J3254927N747212n637258j4224894j7062728j4856268
18931G2283226q195387k81664N087777M275155j960612q429060j2222519j2148175
$$ plain form
18923 38408741 29342008 23357641 19392490 16584765 14439607 12784676 11459254 10342642
18915 10342642 9407638 8590459 7909111 7244713 6529222 5942912 5435135 5017376 4669791
18906 4669791 4412938 4325140 4351978 4254393 4045021 3745954 3417353 3211866 2938769 2720610
18896 2720610 2631550 2611482 2545474 2362788 2218111 2076936 1879426 1708564 1603505 1559989
18886 1559989 1529828 1398978 1357097 1351227 1308001 1259609 1237666 1177345 1126288 1117030 1105619
18875 1105619 1112616 1066940 1029688 1001501 954199 913426 928981 964119 927098 872427 841232
18864 841232 877082 850422 731062 735049 753045 715503 647495 599603 614578 683038 796397
18853 796397 815417 755496 686392 655803 639374 568814 591358 634887 626313 575160 563396 518204
$$ packed form
18923C8408741r066733n984367l965151k807725k145158j654931j325422j116612
18915A0342642r35004q17179o81348o64398p15491n86310n07777m17759l47585
18906D669791k56853q7798K6838r7585k09372k99067l28601k05487k73097k18159
18896B720610q9060k0068o6008j82686j44677j41175j97510j70862j05059m3516
18886A559989l0161j30850m1881n870m3226m8392k1943o0321n1057r258j1411
18875A105619O997m5676l7252k8187m7302m0773J5555L5138l7021n4671l1195
18864H41232L5850k6660j19360L987J7996l7542o8008m7892J4975O8460J13359
18853G96397J9020n9921o9104l0589j6429p0560K2544M3529q574n1153j1764m5192
$$ plain form
18841 518204 506607 519347 527260 582081 614254 531082 500730 550858 578949 500274 484155 501770
18829 501770 568365 610369 544284 516040 511902 513006 540809 516481 510189 569784 634548 614676
18817 614676 584078 536023 563832 580069 562854 554601 569476 525408 508728 543174 519732 548298
18805 548298 576541 521940 498792 481256 485836 521685 538443 509259 563032 505959 466582 531808
18793 531808 515903 459929 434328 455798 479939 463277 410401 382672 349330 349109 470334 523908
18781 523908 550506 554410 527339 523855 495443 452816 460912 448390 500117 557900 595685 581465
18769 581465 599790 605560 649405 701467 694958 794168 948717 1001883 984423 871973 715838
18758 715838 618165 543662 548284 636406 669475 679614 699597 698008 647669 675868 713761 680562
$$ packed form
18841E18204j1597J2740P913N4821L2173q3172l0352N0128K8091p8675j6119J7615
18829E01770O6595M2004o6085k8244m138J104K7803k4328o292N9595O4764j9872
18817F14676l0598m8055K7809J6237j7215q253J4875m4068j6680L4446k3442K8566
18805E48298K8243n4601k3148j7536M580L5849J6758k9184N3773n7073l9377O5226
18793E31808j5905n5974k5601K1470K4141j6662n2876k7729l3342k21J21225N3574
18781E23908K6598L904k7071l484k8412m2627Q096j2522N1727N7783L7785j4220
18769E81465J8325N770M3845N2062o509R9210J54549N3166j7460j12450j56135
18758G15838r7673p4503M622Q8122L3069J0139J9983j589n0339K8199L7893l3199
$$ plain form
18746 680562 706302 698522 705520 697537 709090 752477 868965 977137 1119250 1254071 1428655
18735 1428655 1666929 1941131 2328775 2772945 3260750 3799900 4149849 4181444 3946486 3535363
18725 3535363 3280438 3164620 3387811 3928433 4753191 5736286 6600979 7146600 7291682
18716 7291682 7150586 6929264 6710934 6374120 5876952 5322771 4797100 4294889 3807674
18707 3807674 3490189 3297854 3148586 2942548 2714427 2467519 2195185 2017915 1867924
18698 1867924 1753846 1750042 1763108 1806474 1904554 2034497 2158127 2299867 2508480 2902017
18688 2902017 3432861 4031033 4409173 4548471 4474537 4483163 4616336 4754448 4926755 5368174
18678 5368174 6226311 7581550 8751801 9223401 9346590 9372268 9576604 10120849 10958259
$$ packed form
18746F80562K5740p780O998p983J1553M3387J16488J08172J42113J34821J74584
18735A428655K38274K74202L87644M44170M87805N39150L49949L1595k34958m11123
18725C535363k54925j15818K23191N40622Q24758R83095Q64693N45621J45082
18716G291682j41096k21322k18330l36814m97168n54181n25671n02211m87215
18707C807674l17485j92335j49268k06038k28121k46908k72334j77270j49991
18698A867924j14078l804J3066M3366R8080J29943J23630J41740K08613L93537
18688B902017N30844N98172L78140J39298p3934Q626J33173J38112J72307M41419
18678E368174Q58137J355239J170251M71600J23189K5678K04336N44245Q37410
$$ plain form
18669 10958259 12055574 13088668 13496369 13142021 12293908 11155053 10257408 9589392 9181097
18660 9181097 9054016 9137762 9418778 10073707 11191254 12993656 15656570 19591495 25359752
18651 25359752 34081376 46838653 62451900 77877158 92424766 103136456 107150968
18644 107150968 104862610 97151502 83789451 67915478 52542583 39177665 29356780
18637 29356780 22794479 18444510 15500844 13370750 11759534 10516643 9590394 8891809
18629 8891809 8303819 7956283 7756363 7764312 7992714 8329814 8811769 9318953 9858851 10279281
18619 10279281 10632886 10834941 10957069 11079430 11093422 11142612 11374201 11803992 12385288 13170048
18609 13170048 14389029 16394364 19287025 23353707 29141440 37310525 49010653 66099758
$$ packed form
18669A0958259J097315J033094M07701l54348q48113j138855q97645o68016m08295
18660I181097j27081Q3746K81016O54929J117547J802402K662914L934925N768257
18651B5359752Q721624J2757277J5613247J5425258J4547608J0711690M014512
18644A07150968k288358p711108j3362051j5873973j5372895j3364918r820885
18637B9356780o562301m349969k943666k130094j611216j242891r26249o98585
18629H891809n87990l47536j99920P949K28402L37100M81955N07184N39898M20430
18619A0279281L53605K02055J22128J22361J3992M9190K31589M29791N81296P84760
18609A3170048J218981K005335K892661M066682N787733Q169085J1700128J7089105
$$ plain form
18601 66099758 89038585 113838128 137575744 158404422 170428774 172019782 165222580
18594 165222580 149957643 127930367 105117336 84747494 69889213 62649510 63453642
18587 63453642 73204435 92191442 112599981 120615789 113803756 96558133 76615058
18580 76615058 62244907 54880465 52784072 54673305 60852592 73220409 95700461 133589347
18572 133589347 183918475 223966512 232459418 209728259 167517487 124196260 92982515
18565 92982515 74538311 64625223 60292033 60460642 65767507 78418730 101570741 132192978
18557 132192978 153445313 153746397 137444832 113272559 94130363 85714688 84369301
18550 84369301 86692228 88939738 88003782 83834053 76795534 66501383 54989816 44012703
$$ packed form
18601F6099758K2938827K4799543K3737616K0828678J2024352J591008o797202
18594A65222580j5264937k2027276k2813031k0369842j4858281p239703Q04132
18587F3453642R750793J8987007K0408539Q015808o812033j7245623j9943075
18580G6615058j4370151p364442k096393J889233O179287J2367817K2480052L7888886
18572A33589347N0329128M0048037Q492906k2731159m2210772m3321227l1213745
18565I2982515j8444204r913088m333190J68609N306865J2651223K3152011L0622237
18557A32192978K1252335L01084j6301565k4172273j9142196q415675j345387
18550H4369301K322927K247510r35956m169729p038519j0294151j1511567j0977113
$$ plain form
18542 44012703 34662731 27991396 23913754 21595671 19856473 18018751 15877328 13680705
18534 13680705 11823734 10470612 9487918 8858465 8464659 8026479 7513974 7037345 6665735
18525 6665735 6295431 5876360 5505540 5170601 4928647 4757955 4702653 4741002 4814705 4971305
18515 4971305 5057470 5091952 4981717 4675790 4242203 3809333 3573587 3526561 3728800 4154570
18505 4154570 4554165 4874429 4993828 4715107 4253368 3794300 3308579 2950588 2729588
18496 2729588 2705066 2685771 2710177 2850327 2964992 3033170 2955713 2708608 2461811 2310067
18486 2310067 2194337 2140237 2145587 2124043 2156541 2141496 2057830 2125481 2250583 2416719 2590199
18475 2590199 2842220 3032209 3086404 3114540 3128609 3205620 3368705 3678127 4241448 5071012
$$ packed form
18542D4012703r349972o671335m077642k318083j739198j837722k141423k196623
18534A3680705j856971j353122r82694o29453l93806m38180n12505m76629l71610
18525F665735l70304m19071l70820l34939k41954j70692n5302L8349P3703J56600
18515D971305Q6165L4482j10235l05927m33587m32870k35746m7026K02239M25770
18505D154570L99595L20264J19399k78721m61739m59068m85721l57991k21000
18496B729588k4522j9295K4406J40150J14665O8178p7457k47105k46797j51744
18486B310067j15730n4100N350k1544L2498j5045q3666O7651J25102J66136J73480
18475B590199K52021J89989N4195K8136J4069P7011J63085L09422N63321Q29564
$$ plain form
18465 5071012 6049333 6798561 7283977 7704109 8258981 8901256 9159132 8638380 7523408
18456 7523408 6319585 5359620 4817860 4601962 4596293 4710070 4872526 4919616 4909460 4716003
18446 4716003 4376278 4044210 3750110 3466144 3208845 3107968 3107272 3224737 3360242 3442590
18436 3442590 3505905 3544854 3647097 3796411 3953695 4285985 4668114 4932006 5167894 5371859
18426 5371859 5761446 6379631 7219511 8308815 9285846 10146712 11032306 11998493 13272488
18417 13272488 14890364 17012307 19747792 22704706 24621169 24819981 23954673 22954130
18409 22954130 22676074 23409970 25095420 27592585 30972068 35623309 41644045 49432668
18401 49432668 60130769 75976146 100372489 139260615 204176396 310607859 443256824
$$ packed form
18465E071012R78321P49228M85416M20132N54872O42275K57876n20752j114972
18456G523408j203823r59965n41760k15898n669J13777J62456M7090j0156j93457
18446D716003l39725l32068k94100k83966k57299j00877o96J17465J35505Q2348
18436C442590O3315L8949J02243J49314J57284L32290L82129K63892K35888K03965
18426E371859L89587O18185Q39880J089304R77031Q60866Q85594R66187J273995
18417A3272488J617876K121943K735485K956914J916463J98812q65308j000543
18409B2954130k78056P33896J685450K497165L379483M651241O020736P788623
18401D9432668J0698101J5845377K4396343L8888126O4915781J06431463J32648965
$$ plain form
18394 443256824 518948258 505192060 428111915 316210098 223547262 168598941 139701065
18387 139701065 126854272 126441250 139092257 169673294 227580604 314771417 399773652
18380 399773652 437390183 409507062 334864390 245182992 171265031 124010938 95703274
18373 95703274 77882336 65282660 55572987 47823843 41411096 36159269 32033259 28635454
18365 28635454 25971244 24047662 22715349 21624651 20667897 19567038 18153130 16599388
18357 16599388 15150010 13977154 13148843 12601114 12086009 11622507 11365386 11527329 12257157
18348 12257157 12989786 12900637 12124986 10826764 9455497 8333372 7430092 6601696 5811867
18339 5811867 5267804 4918636 4674192 4424016 4336151 4421674 4532751 4766587 5072694 5446612
$$ packed form
18394D43256824P5691434j3756198p7080145j11901817r2662836n4948321k8897876
18387A39701065j2846793m13022J2651007L0581037N7907310Q7190813Q5002235
18380C99773652L7616531k7883121p4642672q9681398p3917961m7254093k8307664
18373I5703274j7820938j2599676r709673p749144o412747n251827m126010l397805
18365B8635454k664210j923582j332313j090698r56754j100859j413908j553742
18357A6599388j449378j172856q28311n47729n15105m63502k57121J61943P29828
18348A2257157P32629q9149p75651j298222j371267j122125r03280q28396p89829
18339E811867n44063l49168k44444k50176q7865Q5523J11077K33836L06107L73918
$$ plain form
18329 5446612 5879130 6148524 6143976 5843921 5399935 4954527 4499115 4083449 3709260 3415697
18319 3415697 3165183 2898326 2687534 2521655 2392337 2296914 2136324 2004858 2028378 2073144
18309 2073144 2105205 2165802 2176835 2119477 2067858 1986839 1861030 1766760 1656110 1581288 1519270
18298 1519270 1511377 1535790 1452195 1458201 1448712 1431792 1535104 1657123 1729902 1729415 1647433 1564609
18286 1564609 1564630 1588771 1652542 1767259 1819780 1771485 1677492 1576267 1512665 1435589 1427552 1464198
18274 1464198 1487883 1488725 1464422 1345660 1264712 1186000 1115182 1146521 1211100 1280751 1293104
18263 1293104 1282875 1237657 1067473 893452 896999 970792 1006179 952953 917092 899584 882015
18252 882015 883510 802292 752972 751886 750069 682156 711671 784808 860772 990637 1065179 1056841
$$ packed form
18329E446612M32518K69394m548l00055m43986m45408m55412m15666l74189k93563
18319C415697k50514k66857k10792j65879j29318r5423j60590j31466K3520M4766
18309B073144L2061O0597J1033n7358n1619q1019j25809r4270j10650p4822o2018
18298A519270p893K4413q3595O006r489j6920J03312J22019P2779m87q1982q2824
18286A564609K1K4141O3771J14717N2521m8295r3993j01225o3602p7076q037L6646
18274A464198K3685Q42k4303j18762q0948p8712p0818L1339O4579O9651J2353
18263A293104j0229m5218j70184j74021L547P3793L5387n3226l5861j7508j7569
18252H82015J495q1218m9320j086j817o7913K9515P3137P5964J29865P4542q338
$$ plain form
18240 1056841 1041119 1059177 1051834 982429 935344 1037615 1202964 1322389 1398480 1368370 1206564
18229 1206564 1053472 1045486 1113379 1225659 1367328 1489264 1454013 1343943 1178743 1116258
18219 1116258 1130307 1071660 927402 751718 682162 651043 580855 597066 548687 551069 603060
18208 603060 572982 513187 562827 642753 647516 622047 586116 494573 387799 364656 325517
18197 325517 299431 280479 383159 397378 389069 412170 421571 414124 411880 373574 357363 376834
18185 376834 382394 402286 387817 356438 366974 383331 350932 411454 454095 504347 511903 476042
18173 476042 535384 464211 370855 365629 435088 492882 523285 544927 542039 536466 482838 479284
18161 479284 471512 466247 461302 417157 435884 474009 462955 425742 425783 409044 455345 486271 526381
$$ packed form
18240A056841j5722J8058p343o9405m7085J02271J65349J19425P6091l0110j61806
18229A206564j53092p986O7893J12280J41669J21936l5251j10070j65200o2485
18219A116258J4049n8647j44258j75684o9556l1119p0188J6211m8379K382N1991
18208F03060l0078n9795M9640P9926M763k5469l5931r1543j06774k3143l9139
18197C25517k6086j8952J02680J4219q309K3101R401p447k244l8306j6211J9471
18185C76834N560J9892j4469l1379J0536J6357l2399O0522M2641N0252P556l5861
18173D76042N9342p1173r3356n226O9459N7794L0403K1642k888n573n3628l554
18161D79284p772n265m945m4145J8727L8125j1054l7213M1j6739M6301L0926M0110
$$ plain form
18148 526381 489564 502276 473247 453638 465277 477609 557462 582455 634665 680063 760043
18137 760043 754456 798179 848420 967239 1033711 1140643 1222365 1277075 1328567 1379304 1407351
18126 1407351 1433929 1524366 1570258 1633572 1672078 1730859 1956107 2238376 2524477 2892017
18116 2892017 3393605 4031892 4814930 5845746 7270867 9276900 12281934 16797539 24265838
18107 24265838 37368840 59401037 84976719 95263523 88719605 70682054 47973588
18100 47973588 31388922 21800619 16154895 12543862 10004201 8194860 6882152 5854476
18092 5854476 5090588 4558677 4099910 3689107 3408784 3195274 3034528 2925154 2837243 2736313
18082 2736313 2665902 2577339 2398904 2209246 2054196 1939468 1787959 1597883 1382076 1213594
$$ packed form
18148E26381l6817J2712k9029j9609J1639J2332P9853K4993N2210M5398P9980
18137G60043n587M3723N0241J18819O6472J06932Q1722N4710N1492N0737K8047
18126A407351K6578R0437M5892O3314L8506N8781K25248K82269K86101L67540
18116B892017N01588O38287P83038J030816J425121K006033L005034M515605P468299
18107B4265838J3103002K2032197K5575682J0286804o543918j8037551k2708466
18100D7973588j6584666r588303n645724l611033k539661j809341j312708j027676
18092E854476p63888n31911m58767m10803k80323k13510j60746j09374q7911j00930
18082B736313p0411q8563j78435j89658j55050j14728j51509j90076k15807j68482
$$ plain form
18072 1213594 1071368 1021345 994605 982711 935778 880177 810965 786878 734240 669103 657428
18061 657428 629401 584126 569587 574381 560200 553881 542922 514618 538915 567376 564446 511085
18049 511085 495225 519181 533410 484119 425465 354445 354573 356892 390496 443203 473912 516304
18037 516304 549512 576027 619399 709895 712828 682982 643643 537440 497947 474445 454525
18026 454525 445656 385348 364688 379755 347948 304301 286235 331884 375049 416458 429602 381168
18014 381168 372154 322517 260340 287575 344385 293443 289733 303482 343490 434925 498906 557592
18002 557592 718029 894449 992500 988159 871169 730107 633089 588372 603672 635751 629842
17991 629842 615441 741100 930679 1154817 1314709 1344784 1277932 1156197 939885 743564
$$ packed form
18072A213594j42226n0023k6740j1894m6933n5601o9212k4087n2638o5137j1675
18061F57428k8027m5275j4539M794j4181o319j0959k8304K4297K8461k930n3361
18049E11085j5860K3956J4229m9291n8654p1020J28K319L3604N2707L0709M2392
18037E16304L3208K6515M3372R0496K933k9846l9339j06203l9493k3502j9920
18026D54525q869o0308k0660J5067l1807m3647j8066M5649M3165M1409J3144m8434
18014C81168r014m9637o2177K7235N6810n0942l710J3749M0008R1435O3981N8686
18002E57592J60437J76420R8051m341j16990j41062r7018m4717J5300L2079n909
17991F29842j4401J25659J89579K24138J59892L0075o6852j21735k16312j96321
$$ plain form
17981 743564 608174 521270 502134 469441 492083 531280 577053 710353 759166 702669 585160
17970 585160 512585 437532 359979 334263 331108 282633 253099 200284 194517 153867 173103 143470
17958 143470 132991 100106 93091 127124 175305 218692 210898 178814 159556 219916 239899 219206
17946 219206 194446 227162 243285 215951 229987 223085 271697 282510 279511 275660 223982 199342
17934 199342 270820 243034 200060 191487 183138 185066 210147 173207 128286 131766 165972 186252
17922 186252 234522 241890 194520 233330 215478 212551 287792 311291 276624 305884 359107 444780
17910 444780 446128 364301 336960 370514 311121 243431 193626 189371 182692 148066 134917 162270
17898 162270 231472 202976 181362 222884 219453 255601 319119 397255 419105 462920 541080 625610
$$ packed form
17981G43564j35390q6904j9136l2693K2642L9197M5773J33300M8813n6497j17509
17970E85160p2575p5053p7553k5716l155m8475k9534n2815n767m0650J9236k9633
17958A43470j0479l2885p015L4033M8181M3387p794l2084j9258O0360J9983k0693
17946B19206k4760L2716J6123k7334J4036o902M8612J0813k999l851n1678k4640
17934A99342P1478k7786m2974q573q349J928K5081l6940m4921L480L4206K0280
17922A86252M8270P368m7370L8810j7852k927P5241K3499l4667K9260N3223Q5673
17910D44780J348q1827k7341L3554n9393o7690m9805m255o679l4626j3149K7353
17898A62270O9202k8496k1614M1522l431L6148O3518P8136K1850M3815P8160Q4530
$$ plain form
17886 625610 648300 624124 589217 634255 753306 920324 1108560 1288057 1256732 1166623 1088804
17875 1088804 994049 909000 939493 1083293 1138091 1074842 950540 812789 639903 562981
17865 562981 556647 502785 478378 493062 427129 382350 354503 342391 429418 500046 577910 627462
17853 627462 550269 532395 536013 593122 678807 741334 729990 678696 594264 550921 543140 528231
17841 528231 593513 750164 868274 884372 758960 562282 455158 385095 371616 281593
17831 281593 279047 290604 265596 276296 263147 235300 194520 239226 232104 213982 143145 150637
17819 150637 299974 462422 638864 817059 890310 827307 671212 531038 455169 387190
17809 387190 260697 215358 230987 181460 145945 151959 167139 189106 233162 374975 554689
$$ packed form
17886F25610K2690k4176l4907M5038J19051J67018J88236J79497l1325r0109p7819
17875A088804r4755q5049L0493J43800N4798o3249j24302j37751j72886p6922
17865E62981o334n3862k4407J4684o5933m4779k7847j2112Q7027P0628P7864M9552
17853F27462p7193j7874L618N7109Q5685O2527j1344n1294q4432m3343p781j4909
17841E28231O5282J56651J18110J6098j25412j96678j07124p0063j3479r0023
17831B81593k546J1557k5008J0700j3149k7847m0780M4706p122j8122p0837P492
17819A50637J49337J62448J76442J78195P3251o3003j56095j40174p5869o7979
17809C87190j26493m5339J5629m9527l5515O014J5180K1967M4056J41813J79714
$$ plain form
17798 554689 643134 749090 763709 737854 623668 463013 371506 324740 294361 312991 340279
17787 340279 384003 504511 629386 725085 779407 697055 609761 513909 442828 392856 335858
17776 335858 323685 297157 303001 358337 337963 293884 270061 292487 385489 496427 662582
17765 662582 785708 758405 649760 501852 399712 348995 311029 226308 193780 146996 143357
17754 143357 122248 94458 64600 101633 101696 130860 152317 120022 71836 10363 -48331 9551
17742 9551 61322 105116 102379 98144 91638 47598 -4118 27125 63162 63920 50393 69947 63512
17729 63512 80585 83559 58710 60726 74413 123798 119837 103089 101927 101223 722 811 82049
17716 82049 125416 64172 64308 78722 55965 -48383 -24494 49233 67396 -8406 12892 41246
$$ packed form
17798E54689Q8445J05956J4619k5855j14186j60655r1507m6766l0379J8630K7288
17787C40279M3724J20508J24875R5699N4322q2352q7294r5852p1081m9972n6998
17776C35858j2173k6528N844N5336k0374m4079k3823K2426R3002J10938J66155
17765F62582J23126k7303j08645j47908j02140n0717l7966q4721l2528m6784l639
17754A43357k1109k7790k9858L7033O3K9164K1457l2295m8186o1473n8694N7882
17742I551N1771M3794k737m235o506m4040n1716L1243L6037P58j3527J9554o435
17729F3512J7073K974k4849K016J3687M9385l961j6748j162p04j00501Q9Q1238
17716H2049M3367o1244J36J4414k2757j04348K3889P3727J8163p5802K1298K8354
$$ plain form
17704 41246 27331 -15254 29034 57345 129633 117890 114815 162108 128631 30087 29791 52526
17692 52526 110704 83557 81681 107976 124273 121387 80440 73165 93870 69279 71289 76493 104066
17679 104066 90195 60175 78805 -10359 1268 74661 90266 -214 -37894 -33693 11361 25318
17667 25318 -10248 66925 152199 115177 84505 124235 96804 124097 139940 140377 181892 128958
17655 128958 83340 80333 55802 83264 92325 78104 81943 101705 95148 68945 55082 105454
17643 105454 139022 132388 79961 87509 76789 24597 27476 10408 34891 117847 163228 156418
17631 156418 175421 147463 114124 103683 108458 104116 138321 99081 14399 -882 1797 56029
17619 56029 94255 97646 44004 58197 54282 29881 -5138 -9286 -15455 57063 81230 69422
$$ packed form
17704D1246j3915m2585M4288K8311P2288j1743l075M7293l3477r8544k96K2735
17692E2526N8178k7147j876K6295J6297k886m0947p275K0705k4591K010N204K7573
17679A04066j3871l0020J8630q9164J1627P3393J5605r0480l7680M201M5054J3957
17667B5318l5566P7173Q5274l7022l0672L9730k7431K7293J5843M37M1515n2934
17655A28958m5618l007k4531K7462R061j4221L839J9762o557k6203j3863N0372
17643A05454L3568o634n2427P548j0720n2192K879j7068K4483Q2956M5381o810
17631A56418J9003k7958l3339j0441M775m342L4205l9240q4682j5281K679N4232
17619E6029L8226L391n3642J4193l915k4401l5019m148o169P2518K4167j1808
$$ plain form
17607 69422 46092 26452 3869 6566 51202 41101 63396 54817 38815 19215 49408 56133
17595 56133 31669 -25938 -10380 51308 116736 80890 73588 66947 103205 140623 149284 68904
17583 68904 20252 306 71605 75039 73207 97766 97932 61098 111032 137848 106296 82656
17571 82656 81419 131044 71322 51910 18528 -16195 -19569 40521 21821 -57358 -53659 10508
17559 10508 51380 82442 89440 72864 28494 -17923 -62389 -84126 -90798 -40345 -4591 -30069
17547 -30069 53209 114964 177342 246028 257303 161965 102354 129278 129771 130530 162557 147624
17535 147624 125999 127182 118254 133693 194820 129478 90862 119675 125852 57890 38113 60607
17523 60607 34834 37484 -14888 -42067 -27788 30849 50363 45166 53885 68751 95123 135776
$$ packed form
17607F9422k3330j9640k2583K697M4636j0101K2295q579j6002j9600L0193O725
17595E6133k4464n7607J5558O1688O5428l5846p302o641L6258L7418Q661q0380
17583F8904m8652j9946P1299L434j832K4559J66l6834M9934K6816l1552k3640
17571H2656j237M9625n9722j9412l3382l4723l374O0090j8700p9179L699O4167
17559A0508M0872L1062O998j6576m4370m6417m4466k1737o672N0453L5754k5478
17547c0069Q3278O1755O2378O8686J1275r5338n9611K6924M93P59L2027j4933
17535A47624k1625J183q928J5439O1127o5342l8616K8813O177o7962j9777K2494
17523F0607k5773K650n2372k7179J4279N8637J9514n197Q719J4866K6372M0653
$$ plain form
17511 135776 96691 84977 7754 -61795 -52377 31707 70278 108186 135989 144124 147239 102324
17499 102324 12432 9144 58381 45223 20570 -30228 -190 32204 82956 117393 109123 100915
17487 100915 136568 117901 115207 102893 138412 153497 129907 117919 164383 181319 98396 64435
17475 64435 94493 70440 4862 17665 12850 25980 -7633 -40743 -20386 3177 20680 62774
17463 62774 59612 71722 70383 47488 22321 72867 104768 126197 127942 157447 177088 150560
17451 150560 56124 14956 23305 35129 42283 55734 78485 54582 20535 43059 139471 313332
17439 313332 439274 522489 487452 448204 325261 201880 168760 193359 171640 78827 100131
17428 100131 130523 115707 56538 50343 35546 336 -7421 -20606 16078 76650 51725 38731
$$ packed form
17511A35776l9085j1714p7223o9549R418Q4084L8571L7908K7803Q135L115m4915
17499A02324q9892l288M9237j3158k4653n0798L0038L2394N0752L4437q270q208
17487A00915L5653j8667k694j2314L5519J5085k3590j1988M6464J6936q2923l3961
17475F4435L0058k4053o5578J2803m815J3130l3613l3110K0357K3563J7503M2094
17463F2774l162J2110j339k2895k5167N0546L1901K1429J745K9505J9641k6528
17451A50560r4436m1168Q349J1824P154J3451K2751k3903l4047K2524R6412J73861
17439C13332J25942Q3215l5037l9248j22943j23381l3120K4599k1719r2813K1304
17428A00131L0392j4816n9169o195j4797l5210p757j3185L6684O0572k4925j2994
$$ plain form
17416 38731 55583 21489 -69829 -43512 -29198 -33289 -39140 -84694 -14273 16452 686 -7149
17404 -7149 33711 110652 123327 103806 96259 62130 43489 73643 114376 101800 107554 83355
17392 83355 93779 128500 118423 157107 121689 39266 52052 67991 45266 27909 59524 119569
17380 119569 129172 111658 136728 82207 24330 15222 18576 11915 31443 28627 81505 113780
17368 113780 113783 68906 120170 148156 110336 76523 64502 11673 -39676 -48120 -63800 -29474
17356 -29474 -10957 12804 -1097 -87899 -90324 -87965 -60597 -25110 35054 75241 54835 84894
17344 84894 95874 17761 -39884 -9 63053 192861 184329 126309 76384 73729 111495 91519
17332 91519 25187 28366 39531 23613 18956 46009 85410 116169 112465 107717 103233 38363 6272
$$ packed form
17416C8731J6852l4094r1318K6317J4314m091n851m5554P0421L0725j5766p835
17404g149M0860P6941J2675j9521p547l4129j8641L0154M0733j2576N754k4199
17392H3355J0424L4721j0077L8684l5418q2423J2786J5939k2725j7357L1615O0045
17380A19569R603j7514K5070n4521n7877r108L354o661J9528k816N2878L2275
17368A13780Lm4877N1264K7986l7820l3813j2021n2829n1349q444j5680L4326
17356b9474J8517K3761j3901q6802k425K359K7368L5487O0164M0187k0406L0059
17344H4894J0980p8113n7645L9875O3062J29808q532n8020m9925k655L7766j9976
17332I1519o6332L179J1165j5918m657K7053L9401L0759l704m748m484o4870l2091
$$ plain form
17319 6272 81923 120705 83332 59618 14552 -60878 -74457 -82341 -42205 61266 94018 123862
17307 123862 119580 29841 25569 53788 41756 52445 -4855 -55606 -81442 -52410 -1309 75479
17295 75479 77115 25620 3886 -15702 -31260 -63346 -140167 -132838 -43318 -14661 -93221 -109973
17283 -109973 -74721 -33285 7248 33383 40282 1176 -55016 -16004 11880 4597 11289 15656
17271 15656 72425 131724 95333 38213 14850 -32842 -31924 -22295 40216 56815 15677 77965
17259 77965 126452 72166 39433 -31831 -30175 -11973 -22437 -19290 71161 69367 69190 57093 -9797
17246 -9797 6511 22623 -16300 -24954 -23185 -27960 21169 75290 113636 92842 26557 96594
17234 96594 129786 111948 125106 152763 120186 145545 166599 91215 94027 141152 217930 188137
$$ packed form
17319F272P5651L8782l7373k3714m5066p5430j3579p884M0136J03471L2752K9844
17307A23862m282q9739m272K8219j2032J0689n7300n0751k5836K9032N1101P6788
17295G5479J636n1495k1734j9588j5558l2086p6821P329Q9520K8657p8560j6752
17283a09973L5252M1436M0533K6135O899l9106n6192L9012K7884p283O692M367
17271A5656N6769N9299l6391n7120k3363m7692R18R629O2511J6599m1138O2288
17259G7965M8487n4286l2733p1264J656J8202j0464L147R0451j794j77j2097o6890
17246i797J6308J6112l8923q654J769m775M9129N4121L8346k0794o6285P0037
17234I6594L3192j7838J3158K7657l2577K5359K1054p5384K812M7125P6778k9793
$$ plain form
17222 188137 120941 134725 176159 150261 89708 52946 56547 76916 -1072 -33846 20588 89460
17210 89460 70142 87425 88335 43079 -42472 -34913 -36805 -47266 -55060 -54956 6207 76177 79823
17197 79823 -63632 -109311 -61640 -33309 4630 9653 5642 26490 -2618 22373 18088 12952
17185 12952 33080 5688 70711 79616 41613 46093 43052 10143 47874 26745 47099 85654
17173 85654 97657 40625 9431 -38845 -64757 -94265 -58232 7408 61061 77601 67136 49727
17161 49727 35099 -13521 11488 45708 51433 21233 -26926 -42150 -19372 -38836 25170 83605
17149 83605 51543 29224 94413 115852 91525 67984 32166 53074 118354 139221 127412 153399
17137 153399 99379 11082 -22116 6823 48358 17493 20257 -26482 -23402 -12762 -52381 -55645
$$ packed form
17222A88137o7196J3784M1434k5898o0553l6762L601K0369p7988l2774N4434O8872
17210H9460j9318J7283R10m5256q5551P559j892j0461p794J04O1163O9970L646
17197G9823j43455m5679M7671K8331L7939N023m011K0848k9108K4991m285n136
17185A2952K0128k7392O5023Q905l8003M480l041l2909L7731k1129K0354L8555
17173H5654J2003n7032l1194m8276k5912k9508L6033O5640N3653J6540j0465j7409
17161D9727j4628m8620K5009L4220N725l0200m8159j5224K2778j9464O4006N8435
17149H3605l2062k2319O5189K1439k4327k3541l5818K0908O5280K0867j1809K5987
17137A53399n4020q8297l3198K8939M1535l0865K764m6739L080J0640l9619l264
$$ plain form
17125 -55645 -20130 16843 48720 90201 75145 73091 58621 31250 55141 61136 20931 -2376
17113 -2376 -41065 -80605 -53687 -37489 -76827 -76916 -25858 11532 32999 25595 -13463 -25532 -19846
17100 -19846 -52390 -24504 545 -18682 14035 34357 17038 49029 24731 12386 8178 -27146
17088 -27146 -78520 -38630 10396 33115 86119 119055 109969 44455 46366 35977 50048 12348
17076 12348 19876 13114 50599 84751 15111 -29121 -32333 -25015 75369 143926 139389 47058
17064 47058 -46758 -37406 18111 -14812 464 17062 29932 82928 166262 185813 107130 92542
17052 92542 64141 29680 52831 67879 134098 121827 47784 -19380 47333 124521 140578 176704
17040 176704 150767 116256 71555 44461 37936 13471 -5141 65434 58414 665 3402 14255
$$ packed form
17125e5645L5515L6973L1877M1481j5056k054j4470k7371K3891N995m0205k3307
17113b376l8689l9540K6918J6198l9338q9N1058L7390K1467p404l9058j2069N686
17100a9846l2544K7886K5049j9227L2717K0322j7319L1991k4298j2345m208l5324
17088b7146n1374L9890M9026K2719N3004L2936r086o5514J911j0389J4071l7700
17076A2348P528o762L7485L4152o9640m4232l212P318J00384O8557m537r2331
17064D7058r3816R352N5517l2923J5276J6598J2870N2996Q3334J9551p8683j4588
17052I2542k8401l4461K3151J5048O6219j2271p4043o7164O6713P7188J6057L6126
17040A76704k5937l4511m4701k7094o525k4465j8612P0575p020n7749K737J0853
$$ plain form
17028 14255 27924 45943 98941 94317 55403 26508 13430 -11135 -32394 -3380 38672 34751
17016 34751 21294 -66195 -93046 -59062 -57847 -39387 -49324 -35628 -3082 33268 73269 67176
17004 67176 21843 -8840 -21459 -32832 -13705 -57111 -78883 -37727 21866 45962 -32633 -79533
16992 -79533 -63240 -3837 381 -2334 11879 36384 43754 8974 -3218 28928 35780 -13714
16980 -13714 50463 77496 56448 -22321 -99796 -5177 57026 10643 -45930 -53730 -63123 -57625
16968 -57625 -47531 -77456 -17848 4503 -19041 -79436 -66886 -106460 -201773 -167062 -86074 -40346
16956 -40346 -59404 -76028 -85423 -93844 -42332 14377 69741 135198 104643 73916 82822 83136 94516
16943 94516 38752 33111 43322 -7573 -41527 -43419 -65090 -9997 55003 45227 104558 222300
$$ packed form
17028A4255J3669J8019N2998m624l8914k8895j3078k4565k1259K9014M2052l921
17016C4751j3457q7489k6851L3984J215J8460r937J3696L2546L6350M0001o093
17004F7176m5333l0683j2619j1373J9127m3406k1772M1156N9593K4096p8595m6900
16992g9533J6293N9403M218k715J4213K4505P370l4780j2192L2146O852m9494
16980a3714O4177K7033k1048p8769p7475R4619O2203m6383n6573p800r393N498
16968e7625J0094k9925N9608K2351k3544o0395J2550l9574r5313L4711Q0988M5728
16956d0346j9058j6624r395q421N1512N6709N5364O5457l0555l0727Q906L14J1380
16943I4516n5764n641J0211n0895l3954j892k1671N5093O5000r776N9331J17742
$$ plain form
16931 222300 227994 137598 103098 107866 119540 89649 35234 61761 20787 -20819 -60270 -57532
16919 -57532 -30334 27747 31596 776 -15462 -2256 -28507 -49917 -34776 -49816 1188 21098
16907 21098 23970 48052 53246 41021 4281 -48490 -91997 -31474 -6446 23876 37242 28951
16895 28951 72027 66754 66542 52258 -3620 -30694 -91956 -73883 -50874 -47487 -28313 41419
16883 41419 56455 52029 73536 155113 115545 56970 78053 105714 129340 87901 46254 50520
16871 50520 -10836 -33377 10076 92722 73681 37725 29537 -17508 16939 14499 1330 -30360
16859 -30360 -39392 3207 -26026 -22938 38135 44633 66527 38793 37777 43535 77733 24318 -35996
16846 -35996 -12388 55571 7496 -56203 -85004 -54913 -84417 -52757 -127 -9664 -56243 -76514
$$ packed form
16931B22300N694r0396l4500M768J1674k9891n4415K6527m0974m1606l9451K738
16919e7532K7198N8081L849l0820j6238J3206k6251k1410J5141j5040N1004J9910
16907B1098K872K4082N194j2225l6740n2771m3507O0523K5028L0322J3366q291
16895B8951M3076n273k12j4284n5878k7074o1262J8073K3009L387J9174O9732
16883D1419J5036m426K1507Q1577l9568n8575K1083K7661K3626m1439m1647M266
16871E0520o1356k2541M3453Q2646j9041l5956q188m7045L4447k440j3169l1690
16859c0360r032M2599k9233L088O1073O498K1894k7734j016N758L4198n3415o0314
16846c5996K3608O7959m8075o3699k8801L0091k9504L1660N2630r537m6579k0271
$$ plain form
16834 -76514 -5320 14931 -45284 -659 2382 -20860 -67621 864 30091 22396 509 -12798
16822 -12798 -28736 -24163 -35697 -23633 -993 33651 12326 53189 26944 -2458 44909 17631
16810 17631 26994 41643 40016 45691 44772 37190 -5493 -25298 28536 10797 2544 -17029 -58956
16797 -58956 -73012 -107356 -32731 49207 98259 106442 68286 -73107 -117588 -131470 -76005 -26073
16785 -26073 49237 52086 5388 2228 15702 1729 -24808 -9439 40393 27538 -17087 -48395
16773 -48395 -60003 -52588 14257 45804 57574 29333 -12151 -72490 -117040 -49936 32394 51529
16761 51529 49164 38165 -15032 -37099 11384 9357 16479 24071 -6377 -15631 54719 125058 145485
16748 145485 84682 42971 55531 76242 67926 -37546 -43961 77795 107724 95558 34570
$$ packed form
16834g6514P1194K0251o0215M4625L041k3242m6761O8485K9227p695k1887j3307
16822a2798j5938M573j1534J2064K2640L4644k1325M0863k6245k9402M7367k7278
16810A7631R363J4649j627N675r19p582m2683j9805N3834j7739q253j9573m1927
16797e8956j4056l4344P4625Q1938M9052Q183l8156j41393m4481j3882N5465M9932
16785b6073P5310K849m6698l160J3474j3973k6537J5369M9832j2855m4625l1308
16773d8395j1608P415O6845L1547J1770k8241m1484o0339m4550O7104Q2330J9135
16761E1529k365j0999n3197k2067M8483k027P122P592l0448r254P0350P0339K0427
16748A45485o0803m1711J2560K0711q316j05472o415J21756K9929j2166o0988
$$ plain form
16737 34570 -61557 -59269 -43966 -52962 -22463 2539 -44875 -3655 74648 72692 35711 -14751
16725 -14751 -46264 -22104 -50429 -67120 -85598 -47563 37152 60586 41640 26905 -11015 428
16713 428 260 1443 67001 86564 102693 132311 80141 -16838 -65308 24410 81585 63857 40367
16700 40367 44784 71251 105153 148581 147579 83396 43123 47327 46684 17207 -30089 -24010 -73028
16687 -73028 -82263 -19097 -24060 28838 17768 1019 -53218 -143 77587 77281 -3071 -40161
16675 -40161 -24780 -3590 -1503 48377 72864 23046 11988 -1217 -1269 19045 32139 3997
16663 3997 14454 15465 -16754 12335 -23211 -2584 -6140 -13350 -19280 -5666 -66662 -95632 -86843
16650 -86843 -40291 1747 14641 31729 38801 11971 -2198 -11655 52969 92901 78182 6109
$$ packed form
16737C4570r6127K288J5303q996L0499K5002m7414M1220P8303j956l6981n0462
16725a4751l1513K4160k8325j6691j8478L8035Q4715K3434j8946j4735l7920J1443
16713D28j68J183O5558J9563J6129K9618n2170r6979m8470Q9718N7175j7728k3490
16700D0367M417K6467L3902M3428j002o4183m0273M204o43k9477m7296O079m9018
16687g3028r235O3166m963N2898j1070j6749n4237N3075P7730l06q0352l7090
16675d0161J5381K1190K087M9880K4487m9818j1058j3205n2K0314J3094k8142
16663C997J0457J011l2219K9089l5546K0627l556p210n930J3614o0996k8970Q789
16650h6843M6552M2038J2894J7088P072k6830j4169r457O4624L9932j4719p2073
$$ plain form
16638 6109 -2434 -64192 -114194 -118270 -65805 -64057 -71438 -43498 -31030 -51911 -43497 25028 48489
16625 48489 53157 46620 55688 40880 10408 4301 15931 -10510 1997 75238 73387 -518 -1721
16612 -1721 24584 40121 13641 -6499 11323 11810 43684 -4074 27179 93176 150505 132654
16600 132654 63256 32310 67816 74500 88068 94650 75745 156115 142674 53282 44270 55311
16588 55311 102144 78615 15839 -55732 -34637 -35639 -46638 -29967 254 62196 73130 139347
16576 139347 147850 131106 123800 99405 38075 42300 7804 20720 17882 178 -19622 -61942
16564 -61942 -60925 -43165 -13239 16590 69776 88155 46710 68211 46095 37171 26293 43512
16552 43512 43615 23310 38710 52675 27680 36835 61133 101011 114697 14115 24078 -5657
$$ packed form
16638F109q543o1758n0002m076N2465J748p381K7940J2468k0881Q414O8525K3461
16625D8489M668o537R068j4808l0472o107J1630k6441J2507P3241j851p3905j203
16612a721K6305J5537k6480k0140J7822M87L1874m7758L1253O5997N7329j7851
16600A32654o9398l0946L5506O684J3568O582j8905Q0370j3441q9392r012J1041
16588E5311M6833k3529o2776p1571K1095j002j0999J6671L0221O1942J0934O6217
16576A39347Q503j6744p306k4395o1330M225l4496J2916k838j7704j9800m2320
16564f1942J017J7760K9926K9829N3186J8379m1445K1501k2116q924j0878J7219
16552D3512J03k0305J5400J3965k4995R155K4298L9878J3686j00582R963k9735
$$ plain form
16540 -5657 -23295 32215 50496 88369 126146 107243 74228 97904 61093 -31755 -31585 -44863
16528 -44863 -13253 48688 20602 -10974 -10622 26182 74688 114770 75762 41471 55375 9613
16516 9613 -19017 -10114 -40570 -65159 -18012 22904 51293 82060 62137 66094 130273 99781
16504 99781 43537 51129 29451 50764 10541 47933 17953 11662 39362 26476 39510 69645
16492 69645 90651 65801 28992 37974 12229 -9232 -22418 -23825 259 2786 6834 58479
16480 58479 84786 126574 120880 75413 74644 112869 68005 -211 11364 29904 33517 43036 85928
16467 85928 54537 1284 -43267 -36437 22240 81613 44360 43603 46673 37115 6404 -64492 -108398
16454 -108398 -87245 -102472 -132320 -102003 -100732 -96462 -36552 12205 48425 23143 41421 77986
$$ packed form
16540e657j7638N5510J8281L7873L7777j8903l3015K3676l6811r2848J70j3278
16528d4863L1610O1941k8086l1576L52L6804M8506M0082l9008l4291J3904m5762
16516I613k8630Q903l0456k4589M7147M0916K8389L0767j9923L957O4179l0492
16504I9781n6244P592k1678K1313m0223L7392k9980o291K7700j2886J3034L0135
16492F9645K1006k4850l6809Q982k5745k1461j3186j407K4084K527M048N1645
16480E8479K6307M1788n694m5467p69L8225m4864o8216J1575J8540L613R519M2892
16467H5928l1391n3253m4551O830N8677N9373l7253p57L070r558l0711p0896m3906
16454a08398K1153j5227k9848L0317J271M270N9910M8757L6220k5282J8278L6565
$$ plain form
16442 77986 114778 139185 94317 66351 36113 69181 34924 1311 41172 37203 49168 12210
16430 12210 -79043 -79578 -75729 -59013 24666 47943 58490 2442 7552 22277 32518 23374 77148
16417 77148 110615 112652 89590 61486 46398 59280 31718 75882 94682 76935 15472 -11778
16405 -11778 4943 -38200 -20667 -12522 -8213 27303 21727 -28425 -66706 -94450 -25413 10728
16393 10728 12105 -8567 35139 35534 24256 -39447 -117109 -80016 -23037 -34810 -43183 5254
16381 5254 22143 47423 51459 62754 32228 -33264 -61552 -75647 -77168 -63187 -84920 -56710
16369 -56710 -26904 -33183 -17522 35359 51626 31530 83895 73426 61650 62786 76992 6935
16357 6935 -69481 -21703 52959 103199 162314 150701 132234 134838 125954 111875 91142 128371
$$ packed form
16442G7986L6792K4407m4868k7966l0238L3068l4257l3613L9861l969J1965l6958
16430A2210r1253n35L849J6716Q3679K3277J0547n6048N110J4725J0241r144N3774
16417G7148L3467K037k3062k8104j5088J2882k7562M4164J8800j7747o1463k7250
16405a1778J6721m3143J7533Q145M309L5516n576n0152l8281k7744O9037L6141
16393A0728J377k0672M3706L95j1278o3703p7662L7093N6979j1773q373M8437
16381E254J6889K5280M036J1295l0526o5492k8288j4095j521J3981k1733K8210
16369e6710K9806o279J5661N2881J6267k0096N2365j0469j1776J136J4206p0057
16357F935p6416M7778P4662N0240N9115j1613j8467K604q884j4079k0733L7229
$$ plain form
16345 128371 81888 -32023 -42934 -10439 -16932 -25057 -16971 -4428 -9913 5200 42794 16572
16333 16572 -19870 -48921 -49079 -56048 -90678 -52537 -27663 -13716 -59110 -74349 -77583 -76824 733
16320 733 -8156 -3332 -35424 -100561 -62092 63682 95871 57774 56966 24533 -2152 -13312 -7499
16307 -7499 45983 65986 57435 82000 64531 39727 41944 42062 35868 21463 -3672 20697 4718
16294 4718 8345 50474 94061 94797 50214 62881 114750 112205 66476 36368 -48913 -39114 -33004
16281 -33004 -68344 -32264 -51322 -29331 -17412 -29549 -8738 58558 85141 62293 76391 105949
16269 105949 93701 41412 4930 15998 55979 62902 34148 30566 72668 63597 64155 26806
16257 26806 -12251 -38448 -36081 -41207 -42729 -21050 38674 -5814 17489 58316 51172 3736
$$ packed form
16345A28371m6483j13911j0911L2495o493q125Q086J2543n485J5113L7594k6222
16333A6572l6442k9051j58o969l4630L8141K4874J3947m5394j5239l234P59P7557
16320G33q889M824l2092o5137L8469J25774L2189l8097q08l2433k6685j1160N813
16307g499N3482K0003q551K4565j7469k4804K217J18o194j4405k5135K4369j5979
16294D718L627M2129M3587P36m4583J2667N1869k545m5729l0108q5281R799O110
16281c3004l5340L6080j9058K1991J1919j2137K0811O7296K6583k2848J4098K9558
16269A05949j2248n2289l6482J1068L9981O923k8754l582M2102r071N58l7349
16257B6806l9057k6197K367n126j522K1679N9724m4488K3303M0827p144m7436
$$ plain form
16245 3736 31745 53313 -1117 -29200 -3948 -21345 -5261 12520 -38947 -67616 -63077 -21138
16233 -21138 53043 66766 31495 -40061 -44053 3499 -12745 14559 35392 58205 29435 8729
16221 8729 -13577 -33745 5665 45810 58832 48497 31155 54865 92293 55756 6222 -13256
16209 -13256 -24572 13399 1606 -17549 -9252 37941 24026 76523 119737 97078 46844 44318
16197 44318 79838 48304 88928 120584 27556 -34349 26411 54482 81653 63723 4214 -23647
16185 -23647 40744 43479 36553 52997 90478 75737 54902 83591 16844 -46670 -17436 -30988
16173 -30988 -17226 -6852 31665 18219 -5505 -22966 -10526 3985 -46380 -33049 -34693 -60528
16161 -60528 -49346 11935 84330 72826 43558 49268 22849 -38195 -19525 -24755 -14342 -13089
$$ packed form
16245C736K8009K1568n4430k8083K5252j7397J6084J7781n1467k8669M539M1939
16233b1138P4181J3723l5271p1556l992M7552j6244K7304K0833K2813k8770k0706
16221H729k2306k0168L9410M0145J3022j0335j7342K3710L7428l6537m9534j9478
16209a3256j1316L7971j1793j9155Q297M7193j3915N2497M3214k2659n0234k526
16197D4318L5520l1534M0624L1656r3028o1905O0760K8071K7171j7930n9509k7861
16185b3647O4391K735o926J6444L7481j4741k0835K8689o6747o3514K9234j3552
16173c0988J3762J0374L8517j3446k3724j7461J2440J4511n0365J3331j644k5835
16161f0528J1182O1281P2395j1504k9268N710k6419o1044J8670n230J0413J253
$$ plain form
16149 -13089 263 -32461 127 28107 32830 -15443 4512 -37051 -49990 -47720 29380 25721
16137 25721 6638 61052 88301 98390 67261 24050 27196 30248 23359 40533 -42984 -24271
16125 -24271 -42064 -675 32430 -9493 380 15696 47781 -18456 -22760 -32906 -69678 -83440
16113 -83440 -32533 -29651 -18454 -30665 -16404 -9159 -16915 -43856 -35841 -36247 -98738 -89166 -45878
16100 -45878 8380 56889 52667 111898 108308 109439 21135 -36296 -68560 -88118 -76229 -86748
16088 -86748 -81833 -44512 44216 82125 107813 107285 72771 17931 -60680 -36616 -33959 -29106 -7019
16075 -7019 -17117 -25549 21540 86710 124288 94617 68404 -15075 -39471 10198 -7577 -14712
16063 -14712 -38288 -1559 -19846 -27168 -33638 65488 81592 81345 119692 148322 145726 61945 47004
$$ packed form
16149a3089J3352l2724L2588K7980M723m8273J9955m1563j2939K270P7100l659
16137B5721j9083N4414K7249J0089l1129m3211L146L052o889J7174q3517J8713
16125b4271j7793M1389L3105m1923R873J5316L2085o6237m304j0146l6772j3762
16113h3440N0907K882J1197j2211J4261P245p756k6941Q015m06o2491R572M3288
16100d5878N4258M8509m222N9231l590J131q8304n7431l2264j9558J1889j0519
16088h6748M915L7321Q8728L7909K5688n28l4514n4840p8611K4064K657M853K2087
16075g019j0098q432M7089O5170L7578k9671k6213q3479k4396M9669j7775p135
16063a4712k3576L6729j8287p322o470R9126J6104k47L8347K8630k596q3781j4941
$$ plain form
16050 47004 106846 82826 49914 90274 79287 42388 62480 72636 83462 81313 21501 -16050
16038 -16050 -4182 29143 21579 -28830 -58588 -86874 -33791 3995 -23913 -13472 -54405 -50160
16026 -50160 -44848 -104450 -88781 -14083 44001 27379 -12904 -10784 -2926 32806 83328 71206
16014 71206 61797 55098 32429 20787 15845 31489 104050 52444 -23902 9689 52477 30756
16002 30756 21586 23006 32461 64045 111166 88882 85229 63428 38738 10611 37228 72703
15990 72703 26641 -6713 9266 64136 45033 -12125 34886 124141 133358 83513 56572 12359
15978 12359 -23391 -36255 -59214 -75194 -87678 -105408 -87646 -58590 -33983 -11188 -40144 6078
15966 6078 37860 63243 52510 46763 23973 -30359 -58328 -58613 -83682 -91317 -50064 10724 -23401
$$ packed form
16050D7004N9842k4020l2912M0360j0987l6899K0092J0156J0826k149n9812l7551
16038a6050J1868L3325p564n0409k9758k8286N3083L7786k7908J0441m0933M245
16026e0160N312n9602J5669P4698N8084j6622m0283K120P858L5732N0522j2122
16014G1206r409o699k2669j1642m942J5644P2561n1606p6346L3591M2788k1721
16002C0756r170J420R455L1584M7121k2284l653k1801k4690k8127K6617L5475
15990G2703m6062l3354J5979N4870j9103n7158M7011Q9255R217m9845k6941m4213
15978A2359l5750j2864k2959j5980j2484j7730J7762K9056K4607K2795k8956M6222
15966F078L1782K5383j0733n747k2790n4332k7969k85k5069p635M1253O0788l4125
$$ plain form
15953 -23401 -56003 -27787 -22704 -32895 5612 -13566 -46618 -45176 -46980 2976 46461 12299
15941 12299 13851 45043 53990 27873 15487 5983 85624 117480 115544 96833 70454 73955 47156
15928 47156 17244 30313 81946 38679 17262 36931 50492 14664 -42678 -26113 25438 13136
15916 13136 -14996 -460 61772 113606 123792 163475 155111 140601 49112 -16439 -76934 -32871
15904 -32871 -10566 16801 40936 65624 14190 -31620 -82817 -112421 -132268 -92951 -71650 -57490
15892 -57490 -49033 26831 78110 112435 77445 540 -43804 30926 102551 61310 41871 39219
15880 39219 21637 32098 79389 80258 93879 143899 150251 121893 36669 18324 745 37053
15868 37053 83702 57688 58949 81992 97401 91992 25321 61231 87717 71421 65640 58256
$$ packed form
15953b3401l2602K8216N083j0191L8507j9178l3052J442j804M9956M3485l4162
15941A2299J552L1192Q947k6117j2386r504P9641L1856j936j8711k6379L501k6799
15928D7156k9912J3069N1633m3267k1417J9669J3561l5828n7342J6565N1551j2302
15916A3136k8132J4536O2232N1834J0186L9683q364j4510r1489o5551o0495M4063
15904c2871K2305K7367K4135K4688n1434m5810n1197k9604j9847L9317K1301J4160
15892e7490Q457P5864N1279L4325l4990p6905m4344P4730P1625m1241j9439k652
15880C9219j7582J0461M7291Q69J3621N0020O352k8358q5224j8345j7579L6308
15868C7053M6649k6014J261K3043J5409n409o6671L5910K6486j6296n781p384
$$ plain form
15856 58256 84282 79593 36894 52702 11589 -6443 -13789 -8686 -1718 65473 101611 75412
15844 75412 67138 112183 69967 62922 45566 -26601 -26964 -55180 -46312 -33306 -14755 -16348 932
15831 932 -14498 41236 30148 -6270 -51879 -53524 -3829 10096 34434 44561 3940 26022
15819 26022 72758 64910 9308 28504 36965 -1358 -42873 -14386 -1786 -1449 3894 1646 35361
15806 35361 71463 115738 38918 2357 18904 42091 42056 69540 59107 8677 -5384 38115
15794 38115 44345 60838 27794 27583 65650 108307 125823 81087 48235 25055 -24129 -98609
15782 -98609 -120225 -64198 -18195 32159 18047 -21452 -15778 -30269 -56574 -20563 -85035 -127416
15770 -127416 -87378 -84023 -131646 -121986 -124391 -128217 -48315 -68152 -72962 -13357 61599 116727
$$ packed form
15856E8256K6026m689m2699J5808m1113j8032p346N103O968O7191L6138k6199
15844G5412q274M5045m2216p045j7356p2167l63k8216Q868J3006J8551j593J7280
15831I32j5430N5734j1088l6418m5609j645M9695J3925K4338J0127m0621K2082
15819B6022M6736p848n5602J9196Q461l8323m1515K8487J2600L37N343k248L3715
15806C5361L6102M4275p6820l6561J6547K3187l5K7484j0433n0430j4061M3499
15794C8115O230J6493l3044k11L8067M2657J7516m4736l2852k3180m9184p4480
15782i8609k1616N6027M6003N0354j4112l9499N674j4491k6305L6011o4472m2381
15770a27416M0038L355m7623R660k405l826P9902j9837m810N9605P4956N5128
$$ plain form
15758 116727 56052 6437 -6473 -23825 -26090 -13127 -51141 -63486 -26490 -1693 0 7975
15746 7975 -8038 11750 41633 38725 30689 33455 80107 110174 114044 115878 100566 33493 -14996
15733 -14996 -21489 19273 89805 89140 99721 117994 129357 127894 135143 99605 53428 80102 62243
15720 62243 50047 88445 78793 69131 20865 -29265 -17048 -67602 -99141 -28164 42782 23098
15708 23098 -28662 -11467 39079 -72789 -172770 -115356 -29379 -3212 -12848 -54335 9685 72722
15696 72722 117056 98473 74576 77958 21624 -29738 31365 79628 27599 -37317 -97792 -152974
15684 -152974 -123709 -36888 -9873 14784 41343 -2064 -24240 -65413 -47366 -66378 -85020
15673 -85020 -87728 -73568 -47032 -46677 -49482 -75374 -70383 -20588 46401 64782 28959 -15043 9790
$$ packed form
15758A16727o0675m9615j2910j7352k265J2963l8014j2345L6996K4797J693P975
15746G975j6013J9788K9883k908q036K766M6652L0067L870J834j5312o7073m8489
15733a4996o493M0762P0532o65J0581J8273J1363j463P249l5538m6177K6674j7859
15720F2243j2196L8398r652r662m8266n0130J2217n0554l1539P0977P0946j9684
15708B3098n1760J7195N0546j11868r9981N7414Q5977K6167r636m1487O4020O3037
15696G2722M4334j8583k3897L382n6334n1362O1103M8263n2029o4916o0475n5182
15684a52974K9265Q6821K7015K4657K6559m3407k2176m1173J8047j9012j8642
15673h5020k708J4160K6536L55k805k5892M991M9795O6989J8381l5823m4002K4833
$$ plain form
15660 9790 -706 -46305 -100465 -73250 -61751 -56456 -66904 18241 24366 9858 -18812 -77606
15648 -77606 -148714 -136049 -112873 -105298 -87614 -68854 -18797 -62829 -61536 5000 -9364 -47317
15636 -47317 670 -8986 -10545 3747 2177 4058 18816 -25234 -19825 43437 38930 -1299 -86555
15623 -86555 -132805 -114961 -76784 10323 72952 71986 36970 22453 70375 96914 100557 96541
15611 96541 12416 -151 -11425 -9994 -34386 -11863 -3893 -10614 12757 8167 24631 65638
15599 65638 49439 54009 85858 39571 -42029 -4452 -21713 -110926 -97501 -79661 -93342 -37465
15587 -37465 -17922 -47023 -61210 37454 86727 64699 -37504 -22285 -36545 -396 18939
15576 18939 -3976 48166 102849 144975 137937 80065 32191 8605 -79121 -23817 54580 5250
$$ packed form
15660I790j0496m5599n4160K7215J1499N295j0448Q5145O125j4508k8670n8794
15648g7606p1108J2665K3176P575J7684J8760N0057m4032J293O6536j4364l7953
15636d7317M7987r656j559J4292j570J881J4758m4050N409O3262m507m0229q5256
15623h6555m6250J7844L8177Q7107O2629r66l5016j4517M7922K6539L643m016
15611I6541q4125j2567j1274J431k4392K2523P970o721K3371m590J6464M1007
15599F5638j6199M570L1849m6287q1600L7577j7261q9213J3425J7840j3681N5877
15587c7465J9543k9101j4187R8664M9273k2028j02203J5219j4260L6149J9335
15576A8939k2915N2142N4683M2126p038n7872m7874k3586q7726N5304P8397m9330
$$ plain form
15564 5250 23968 77426 73502 11320 -16198 -14176 -42556 -39889 -95332 -105277 -48902 43732 47851
15551 47851 -16923 -29426 -48466 27174 18150 -4989 -5130 -14521 -40855 -69839 -32162 5284
15539 5284 34068 26752 -18417 -71473 -93624 -61235 -48811 -66376 -38605 -28278 -37312 -61838
15527 -61838 -83675 -99510 -63573 -42306 -41639 -41125 19552 60398 87729 58702 14794 -24714
15515 -24714 -43719 14226 16557 9154 2744 -32827 -8944 -160 -8312 -11467 23275 20363 6400
15502 6400 11752 -1688 34518 5716 -9564 -21309 -29952 -40428 -11787 -19304 -1420 15289
15490 15289 5359 12773 9646 25939 94327 130216 123046 118235 103146 88105 48990 60127 87630
15477 87630 106026 5581 45709 80245 39673 40100 31468 8520 20375 -36184 -57315 -19049
$$ packed form
15564E250J8718N3458l924o2182k7518K022k8380K667n5443r945N6375R2634M119
15551D7851o4774j2503j9040P5640r024k3139j41r391k6334k8984L7677L7446
15539E284K8784p316m5169n3056k2151L2389J2424j7565K7771J0327r034k4526
15527f1838k1837j5835L5937K1267O67N14O0677M0846K7331k9027m3908l9508
15515b4714j9005N7945K331p403o410l5571K3883Q784q152l155L4742k912j3963
15502F400N352j3440L6206k8802j5280j1745q643j0476K8641p517J7884J6709
15490A5289r930P414l127J6293O8388L5889p170m811j5089j5041l9115J1137K7503
15477H7630J8396j00445M0128L4536m0572M27q632k2948J1855n6559k1131L8266
$$ plain form
15465 -19049 -40987 -56748 -48423 -60639 -69422 -137250 -139663 -62164 6391 -1063 -24387 6557
15453 6557 35215 43427 32876 9211 6671 10468 -16606 -23809 15413 14695 -9859 -44466 -39717
15440 -39717 -17555 40095 51276 10941 8449 63352 58693 -5932 -18586 -83510 -34511 -477
15428 -477 -15535 2066 13309 -20062 8741 -7094 -31164 2825 31711 27932 32239 4132
15416 4132 -16219 1111 8969 49318 33891 -65886 -104915 -72285 -13094 29038 7548 -43190
15404 -43190 -63890 -97405 -111230 -130228 -94378 -55714 -6833 -22940 -61445 -27293 29784 58428
15392 58428 20767 -43606 -79313 -64474 -54218 32427 78256 18310 -45258 -98428 -100818 -114844
15380 -114844 -75016 -18212 -43160 -41228 -23155 -6246 177 -27263 -16499 36320 69413 86953
$$ packed form
15465a9049k1938j5761Q325j2216q783o7828k413P7499O8555p454k3324L0944
15453F557K8658Q212j0551k3665k540L797k7074p203L9222p18k4554l4607M749
15440c9717K2162N7650J1181m0335k492N4903m659o4625j2654o4924M8999L4034
15428d77j5058J7601J1243l3371K8803j5835k4070L3989K8886l779M307k8107
15416D132k0351J7330P858M0349j5427r9777l9029L2630N9191M2132k1490n0738
15404d3190k0700l3515j3825j8998L5850L8664M8881j6107l8505L4152N7077K8644
15392E8428l7661o4373l5707J4839J0256Q6645M5829n9946o3568n3170k390j4026
15380a14844L9828N6804k4948J932J8073J6909O423k7440J0764N2819L3093J7540
$$ plain form
15368 86953 90530 70459 55334 49104 63260 82222 164103 212251 189795 157470 101519 76528
15356 76528 27877 15069 33296 84994 55141 15190 64683 48856 10026 -14806 -52378 -74765
15344 -74765 -91248 -31306 -13737 -21937 -14406 -27065 -63760 -77590 -68118 11561 59717 7097
15332 7097 -27616 215 45938 12464 10957 68410 58044 31595 34460 43676 51140 73486 53865
15319 53865 53913 -39428 -68143 -17055 -23087 -7336 -38306 28269 88218 112835 42428 -26553
15307 -26553 -30510 20417 -32954 -66071 -53197 -17439 -36733 -22725 -48577 -36289 24866 110423
15295 110423 167564 98264 20569 55124 45399 -7201 -46190 -90484 -84626 -23868 -57683 -57599
15283 -57599 -36092 11643 69939 94884 159143 173018 184907 94559 30811 90337 35968 -30559
$$ packed form
15368H6953L577k0071j5125o230J4156J8962Q1881M8148k2456l2325n5951k4991
15356G6528m8651j2808J8227N1698k9853l9951M9493j5827l8830k4832l7572k2387
15344g4765j6483N9942J7569q200P531j2659l6695j3830R472P9679M8156n2620
15332G097l4713K7831M5723l3474j507N7453j0366k6449K865R216P464K2346j9621
15319E3865M8r3341k8715N1088o032J5751l0970O6575N9949K4617p0407o8981
15307b6553l957N0927n3371l3117J2874L5758j9294J4008k5852J2288O1155Q5557
15295A10423N7141o9300p7695L4555r725n2600l8989m4294N858O0758l3815Q4
15283e7599K1507M7735N8296K4945O4259J3875J1889r0348o3748N9526n4369o6527
$$ plain form
15271 -30559 -13908 -27399 32128 11464 4355 33703 93712 127956 64514 -3981 -51750 -52633
15259 -52633 -22959 20516 -9735 -9411 21182 6088 23149 -5824 -36219 -67509 -74085 -90021
15247 -90021 -67794 -4042 42232 10889 -30851 -6214 25009 -677 -37398 -14767 29910 24344
15235 24344 43104 30804 2403 -52663 -49355 -14596 -896 30359 38278 38665 32844 10727 -24955
15222 -24955 -39375 -35536 -342 30411 7546 17058 32718 7386 -32608 -13009 -52054 -52526
15210 -52526 -35328 -35951 -31617 -19212 -7630 -30943 -27742 41971 42605 -9570 -15892 -50217 -23229
15197 -23229 18702 22939 -2742 -22870 -17657 31586 78669 -16859 -64415 -88238 -45561 -19391
15185 -19391 -40687 -98990 -91223 -22220 -9355 -32563 9806 -11156 -76123 -56216 -24879 -20412
$$ packed form
15271c0559J6651j3491N9527k0664p109K9348O0009L4244o3442o8495m7769q83
15259e2633K9674M3475l0251L24L0593j5094J7061k8973l0395l1290o576j5936
15247i0021K2227O3752M6274l1343m1740K4637L1223k5686l6721K2631M4677n566
15235B4344J8760j2300k8401n5066L308L4759J3700L1255P919L87n821k2117l5682
15222b4955j4420L839L5194L0753k2865R512J5660k5332l9994J9599l9045m72
15210e2526J7198o23M334J2405J1582k3313L201O9713O34n2175o322l4325K6988
15197b3229M1931M237k5681k0128N213M9243M7083r5528m7556k3823M2677K6170
15185a9391k1296n8303P767O9003J2865k3208M2369k0962o4967J9907L1337M467
$$ plain form
15173 -20412 7902 54654 78343 81944 85394 141862 141276 90198 -6227 24455 56139 47824 42982
15160 42982 -2318 -26711 -5113 45101 36338 -17838 -34762 -24776 -24992 15564 16218 26438 79753
15147 79753 87498 66030 25278 -7154 49454 44501 48042 36804 17897 1897 -28506 -19991
15135 -19991 10424 2032 -27332 5599 24520 -102 -40329 349 27118 -26207 -31076 -9678
15123 -9678 64093 111874 82016 18691 -63008 -44891 -51849 -71617 4740 33991 36281 83368
15111 83368 146290 100130 64191 81397 35161 -23338 -50344 -36119 39494 47419 -11263 14368
15099 14368 49987 35753 24341 -19842 -52447 -55294 -44360 -9840 -11133 35302 92958 58180
15087 58180 8523 25833 33139 -48521 -96592 -30215 21203 48266 22927 53347 92353 81866
$$ packed form
15173b0412K8314M6752K3689L601L450N6468n86n1078r6425L0682L1684q315m842
15160D2982m5300k4393K1598N0214q763n4176j6924R986k16M0556O54J0220N3315
15147G9753P745k1468m0752l2432N6608m953L541j1238j8907j6000l0403Q515
15135a9991L0415q392k9364L2931J8921k4622m0227M0678K6769n3325m869K1398
15123i678P3771M7781k9858o3325q1699J8117o958j9768P6357K9251K290M7087
15111H3368O2922m6160l5939J7206m6236n8499k7006J4225P5613P925n8682K5631
15099A4368L5619j4234j1412m4183l2605k847J0934L4520j293M6435N7656l4778
15087E8180m9657J7310P306q1660m8071O6377N1418K7063k5339L0420L9006j0487
$$ plain form
15075 81866 52362 -28492 -58903 -31310 -36066 -67670 -50272 32376 75706 -22513 -42856 -879
15063 -879 44929 15052 3 1312 66248 119435 92808 100956 75636 6670 -4403 38349
15051 38349 73062 88486 136521 84546 31883 6424 -17676 -25443 -31210 17245 34756 14505
15039 14505 24001 49655 86651 135107 105186 88119 79596 61036 43021 23498 10984 68072
15027 68072 86709 44435 -58649 -104767 -102567 -96542 -90083 -80717 -41263 59435 54839 20759
15015 20759 14339 28731 35612 34558 -18000 -82472 -33511 -62725 -58897 26532 71136 65394 10032
15002 10032 1981 23263 93522 162684 266946 451637 604334 648209 543347 328762 239161
14991 239161 179903 145516 81787 58591 67210 23386 41672 102803 51398 621 -49589 -98155
$$ packed form
15075H1866k9504q0854l0411K7593m756l1604J7398Q2648M3330r8219k0343M1977
15063h79M5808k9877j5049J309O4936N3187k6627Q148k5320o8966j1073M2752
15051C8349L4713J5424M8035n1975n2663k5459k4100p767n767M8455J7511k0251
15039A4505R496K5654L6996M8456k9921j7067q523j8560j8015j9523j2514N7088
15027F8072J8637m2274j03084m6118K200O025O459R366L9454J00698m596l4080
15015B0759o420J4392O881j054n2558o4472M8961k9214L828Q5429M4604n742n5362
15002A0032q051K1282P0259O9162J04262J84691J52697M3875j04862k14585q9601
14991B39161n9258l4387o3729k3196Q619m3824J8286O1131n1405n0777n0210m8566
$$ plain form
14979 -98155 -39897 58667 111536 117827 81892 61966 69181 37024 80357 47960 -13055 28558
14967 28558 61689 141330 121202 96879 40309 -22194 4141 -3266 -43429 -71676 -84951 -26915
14955 -26915 -58730 -52329 -84093 -102476 -81112 -32469 -45000 -85278 -6250 23176 42267 59209
14943 59209 105455 84283 17944 52330 -12105 -35556 -29628 -48215 -17115 21120 62334 71314
14931 71314 25133 -19549 -54828 53647 168472 183958 110201 82721 101228 80607 60111
14920 60111 -5445 -73988 -17495 23186 48427 58919 40871 52407 103092 160547 148392 35926
14908 35926 -15024 50726 4391 -63655 -106415 -107542 -24940 9193 6823 60103 62327 10346
14896 10346 56217 64570 68783 -8945 -40821 -68268 -95672 -72690 -30059 -24610 -33791 -28310 22377
$$ packed form
14979i8155N8258R8564N2869O291l5935j9926P215l2157M3333l2397o1015M1613
14967B8558L3131P9641k0128k4323n6570o2503K6335p407m0163k8247j3275N8036
14955b6915l1815O401l1764j8383K1364M8643j2531m0278P9028K9426J9091J6942
14943E9209M6246k1172o6339L4386o4435k3451N928j8587L1100L8235M1214Q980
14931G1314m6181m4682l5279J08475J14825J5486p3757k7480J8507k0621k0496
14920F0111o5556o8543N6493M0681K5241J0492j8048J1536N0685N7455j2155j12466
14908C5926n0950O5750m6335o8046m2760j127Q2602L4133k370N3280K224n1981
14896A0346M5871Q353M213p7728l1876k7447k7404K2982M2631N449r181N481N0687
$$ plain form
14883 22377 58223 -1247 -26354 -2700 40771 37970 1646 -40014 -74321 -88070 9124 22711
14871 22711 10948 -3310 -20777 10691 -22039 -60241 -106640 -37416 29750 30297 -3376 -63297
14859 -63297 -85079 -56004 -30051 -17816 48349 72318 80639 88789 49943 11479 -44469 -93103
14847 -93103 -92801 -66556 -927 5492 -24184 -46543 -30517 -48175 -55270 -62565 3813 87081 53392
14834 53392 -14974 -52970 -4493 -2094 8729 22065 -2207 -30335 -10821 -9746 20777 74621
14822 74621 78338 83729 70549 45528 22869 58903 69073 7249 11917 44407 -8952 -11743
14810 -11743 -5565 -184 -38358 15966 75222 24840 35889 66233 86982 48792 54861 9899
14798 9899 -1559 48003 104173 93519 96750 123472 53473 -3566 -35321 -13518 -17411 -27299
$$ packed form
14883B2377L5846n9470k5107K3654M3471k801l6324m1660l4307j3749R7194J3587
14871B2711j1763j4258j7467L1468l2730l8202m6399O9224O7166N47l3673n9921
14859f3297k1782K9075K5953J2235O6165K3969Q321Q150l8846l8464n5948m8634
14847i3103L02K6245O5629O419k9676k2359J6026j7658p095p295O6378Q3268l3689
14834E3392o8366l7996M8477K399J0823J3336k4272k8128J9514J075L0523N3844
14822G4621L717N391j3180k5021k2659L6034J0170o1824M668L2490n3359k791
14810a1743O178N381l8174N4324N9256n0382J1049L0344K0749l8190O069m4962
14798I899j1458M9562N6170j0654L231K6722o9999n7039l1755K1803l893r888
$$ plain form
14786 -27299 -16020 -16953 14421 62903 80579 45829 27646 18548 -20446 -290 27871 16761
14774 16761 -36621 -50705 -85991 -100638 -57766 -65835 -66182 -64692 -83230 -6751 8429 -2145
14762 -2145 1704 -34186 -21600 6195 47511 18578 -6184 51792 105192 134571 137673 110539
14750 110539 77050 10109 313 10129 49767 86889 109467 71156 13221 5940 86482 52822
14738 52822 -41354 -106773 -129643 -111681 -79970 -82100 -37794 -70124 -17207 39157 52086 16737
14726 16737 -83738 -70474 62051 79434 -11106 -99181 -88067 -26264 29329 68681 18567
14715 18567 -55136 -74328 -51751 -27451 -9798 -37009 -29343 -35917 -113325 -117942 -161576 -96524
14703 -96524 15249 71557 25653 -36 2774 43043 -2216 27530 44802 -1707 31864 55693
$$ packed form
14786b7299J1279r33L1374M8482J7676l4750j8183r098l8994K0156K8161j1110
14774A6761n3382j4084l5286j4647M2872q069l47J490j8538P6479J5180j0574
14762b145L849l5890J2586K7795M1316k8933k4762N7976N3400K9379L102k7134
14750A10539l3489o6941r796R816L9638L7122K2578l8311n7935p281Q0542l3660
14738E2822r4176o5419k2870J7962L1711k130M4306l2330N2917N6364J2929l5349
14726A6737j00475J3264J32525J7383r0540q8075J1114O1803N5593L9352n0114
14715A8567p3703j9192K2577K4300J7653k7211P666o574p7408m617m3634O5052
14703i6524J11773N6308m5904k5689K810M0269m5259K9746J7272m6509L3571K3829
$$ plain form
14691 55693 32487 33177 13214 9234 73143 47891 7632 3425 19754 85110 37397 -3067
14679 -3067 -30183 -61111 17348 83730 57347 -13811 -43469 -74738 -107817 -100191 3468 57632
14667 57632 14973 14866 19816 -39099 -45672 -42918 -72953 -115527 -78522 18508 11391 63293 -5490
14654 -5490 -78859 -59004 8968 55208 47328 26743 -13263 -276 16777 67563 66006 69382
14642 69382 73094 19519 -11049 28944 34214 37632 -14078 -36521 29736 30725 17559 33934 58913
14629 58913 119641 102809 82381 78433 55907 8776 -20174 -36722 -23502 -29143 11518 32938
14617 32938 22470 21571 32509 -13341 -36240 -59539 -60589 -71684 -48057 -75818 -76308 -29157 17267
14604 17267 59861 70233 16360 -40407 -342 2336 15185 42186 3192 22059 103730 105344
$$ packed form
14691E5693k3206O90j9963l980O3909k5252m0259m207J6329O5356m7713m0464
14679c067k7116l0928P8459O6382k6383p1158k9658l1269l3079P626J03659N4164
14667E7632m2659j07M950n8915o573K754l0035m2574L7005R7030p117N1902o8783
14654e490p3369J9855O7972M6240p880k0585m0006J2987J7053N0786j557L376
14642F9382L712n3575l0568L9993N270L418n1710k2443O6257R89j3166J6375K4979
14629E8913O0728j6832k0428l948k2526m7131k8950j6548J3220n641M0661K1420
14617C2938j0468q99J0938m5850k2899k3299j050j1095K3627k7761m90M7151M6424
14604A7267M2594J0372n3873n6767M0065K678J2849K7001l8994J8867Q1671J614
$$ plain form
14592 105344 57426 34513 39687 61709 78422 56796 16318 -32366 -37811 -19419 31271 30771
14580 30771 109555 121473 40188 -47122 -19694 24857 42078 73550 78622 124753 128575 146442
14568 146442 82041 80376 80667 33704 3710 -14843 -27961 -53961 -44781 43073 91821 98089
14556 98089 43550 38562 45787 26517 58260 23776 4706 -24878 -680 -38420 -68368 -18928
14544 -18928 60383 55583 11821 -94741 -55617 1076 -24357 -17437 26902 39535 34318 23130
14532 23130 65384 76627 63059 72824 85615 80353 30126 2169 36035 54568 16570 -68671
14520 -68671 -92937 -7738 29162 22552 -16147 -49530 -62785 -45896 -22737 -40393 -82926 -112914
14508 -112914 -129039 -147642 -102817 -36518 -83961 -78837 -111494 -120537 -100627 -88108 -55275 -37534
$$ packed form
14592A05344m7918k2913N174K2022J6713k1626m0478m8684n445J8392N0690n00
14580C0771P8784J1918q1285q7310K7428M4551J7221L1472N072M6131L822J7867
14568A46442o4401j665K91m6963k9994j8553j3118k6000R180Q7854M8748O268
14556I8089n4539m988P225j9270L1743l4484j9070k9584K4198l7740k9948M9440
14544a8928P9311m800m3762j06562L9124N6693k5433O920M4339J2633n217j1188
14532B3130M2254J1243j3568R765J2791n262n0227k7957L3866J8533l7998q5241
14520f8671k4266Q5199L6900o610l8699l3383j3255J6889K3159j7656m2533k9988
14508a12914j6125j8603M4825O6299m7443N124l2657r043J9910J2519L2833J7741
$$ plain form
14496 -37534 -22048 38338 38031 -10478 -66 12316 -12373 -6862 24581 51258 55261 25394
14484 25394 26091 71189 98742 26236 -26276 -49178 -20138 -56317 -105422 -29109 -20300 -24030
14472 -24030 2135 -20817 -24921 -29049 -7287 43944 88767 116718 96102 17449 -8938 -11552
14460 -11552 -3388 -25579 -65018 -49319 -20959 11091 -19398 -53861 -61830 -79261 -33721 60636
14448 60636 76487 24765 -59642 -40720 -34092 -50914 -59792 -44602 -15248 -12506 -18200 16527
14436 16527 9726 -29757 -68963 -80720 -26802 7820 86765 121055 39701 36358 2860 -27242
14424 -27242 -30030 16684 27709 35808 34202 -20659 -50198 -38722 -29260 -34161 -32848 -37119 35060
14411 35060 42108 15977 -22950 -33227 -52111 -34292 -38097 -2242 56920 97364 61850 65037
$$ packed form
14496c7534J5486O0386l07m8509J0412J2382k4689N511L1443K6677M003k9867
14484B5394O97M5098K7553p2506n2512k2902K9040l6179m9105P6313Q809l730
14472b4030K6165k2952m104m128K1762N1231M4823K7951k0616p8653k6387k614
14460a1552Q164k2191l9439J5699K8360L2050l0489l4463p969j7431M5540R4357
14448F0636J5851n1722q4407J8922O628j6822q878J5190K9354K742n694L4727
14436A6527o801l9483l9206j1757N3918L4622P8945L4290q1354l343l3498l0102
14424b7242k788M6714J1025Q099j606n4861k9539J1476R462m901J313m271P2179
14411C5060P048k6131l8927j0277j8884J7819l805L5855N9162M0444l5514L187
$$ plain form
14399 65037 95713 98986 119708 70647 22855 53787 66025 62360 116065 91995 36987 44767
14387 44767 29821 48186 49418 63367 43920 51437 86876 74544 103155 60033 44563 52979
14375 52979 76777 115569 114575 116184 116436 114266 51567 27157 -26479 42096 102059 53867 -70083
14362 -70083 -118543 -74123 -52953 -18976 -23543 -92504 -71499 -41609 -22834 -36869 -15638 54120
14350 54120 87150 47547 14026 31413 19536 8455 -31489 -62599 -18059 30482 14046 29183
14338 29183 23345 35155 40495 44847 38604 -39716 -32424 77531 103781 13032 -73132 -49267
14326 -49267 -26015 1510 -29577 -46570 -29126 -45166 -60095 -63668 -17740 28698 72087 58407
14314 58407 -474 11727 7994 -23387 28669 42034 33232 28240 66000 -2165 -32223 -30683
$$ packed form
14399F5037L0676L273K0722m9061m7792L0932J2238l665N3705k4070n5008P780
14387D4767j4946J8365J232J3949j9447P517L5439j2332K8611m3122j5470Q416
14375E2979K3798L8792r94J609K52k170o2699k4410n3636O8575N9963m8192j23950
14362g0083m8460M4420K1170L3977m567o8961K1005K9890J8775j4035K1231O9758
14350E4120L3030l9603l3521J7387j1877j1081l9944l1110M4540M8541j6436J5137
14338B9183n838J1810N340M352o243p8320P292J09955K6250r0749q6164K3865
14326d9267K3252K7525l1087j6993J7444j6040j4929l573M5928M6438M3389j3680
14314E8407n8881J2201l733l1381N2056J3365q802m992L7760o8165l0058J540
$$ plain form
14302 -30683 -23822 4503 -31904 57418 158734 139122 78736 53056 55077 123821 141796 144399
14290 144399 106117 105672 56077 25337 19864 56616 74882 25544 11013 17769 11051 -14901
14278 -14901 -47629 -82205 -11108 12444 14741 14045 21170 10902 7772 -64127 -93000 -96793 -92430
14265 -92430 -77797 -61182 -39253 -9434 -11427 -64958 -51715 -13423 -41889 -72201 -104001 -82039
14253 -82039 19245 89183 36666 -26594 -56800 -21505 -32810 -2457 -21933 -16402 -3315 22515
14241 22515 -30424 -34707 -41212 -31725 39910 17576 -64620 -85586 -33471 -9024 812 -30463
14229 -30463 -58972 -49107 -33716 -63648 -75834 -6727 29154 45017 64187 69665 48192 12074
14217 12074 -4801 -12737 -27839 -58636 -27125 -62294 -99197 -51909 -6011 37818 16691 56684
$$ packed form
14302c0683O861K8325l6407Q9322J01316j9612o0386k5680K021O8744J7975K603
14290A44399l8282m45m9595l0740n473L6752J8266m9338j4531O756o718k5952
14278a4901l2728l4576P1097K3552K297o96P125j0268l130p1899k8873l793M363
14265i2430J4633J6615K1929K9819j993n3531J3243L8292k8466l0312l1800K1962
14253h2039J01284O9938n2517o3260l0206L5295j1305L0353j9476N531J3087K5830
14241B2515n2939m283o505R487P1635k2334q2196k0966N2115K4447R836l1275
14229c0463k8509R865J5391k9932j2186O9107L5881J5863J9170N478k1473l6118
14217A2074j6875p936j5102l0797L1511l5169l6903M7288M5898M3829k1127L9993
$$ plain form
14205 56684 54366 31386 59789 23930 -17979 31257 22592 21586 36893 -20404 -76235 -84541
14193 -84541 -87393 -69620 -38083 8645 44311 91944 80560 23548 18356 40951 62661 99708
14181 99708 94545 103603 82727 63901 69439 56689 30144 49385 55381 88188 92269 70842 32339
14168 32339 420 -59326 -41505 -124 -23000 -35400 -25883 -7599 -40128 -42907 -34033 -7244
14156 -7244 27841 76415 121039 86002 84819 84538 81131 116294 75197 39299 97882 88228 40365
14143 40365 -2814 -60308 -109610 -110185 -70504 -68827 -34141 1163 21876 -1654 -23372 -43208
14131 -43208 -12211 58511 37485 57338 101136 70531 49847 -9436 -66360 -52964 3189 -628
14119 -628 -68912 -88743 -121564 -78323 -66402 -84703 -66241 -118 54924 44985 -19249 -40848
$$ packed form
14205E6684k318k2980K8403l5859m1909M9236q665j006J5307n7297n5831q306
14193h4541k852J7773L1537M6728L5666M7633j1384n7012n192K2595K1710L7047
14181I9708n163R058k0876j8826N538j2750k6545J9241N996L2807M081k1427l8503
14168C2339l1919n9746J7821M1381k2876j2400R517J8284l2529k779Q874K6789
14156g244L5085M8574M4624l5037j183k81l407L5163m1097l5898N8583r654m7863
14143D0365m3179n7494m9302n75L9681J677L4686L5304K0713k3530k1718j9836
14131d3208L0997P0722k1026J9853M3798l0605k0684n9283n6924J3396N6153l817
14119f28o8284j9831l2821M3241J1921j8301J8462O6123N5042r939o4234k1599
$$ plain form
14107 -40848 -7911 25432 32603 35939 -18238 -80469 -44757 -66439 -73656 -1580 18851 51211
14095 51211 68152 73678 68711 106694 129786 114150 83266 83717 66489 67136 57965 5594 -67792
14082 -67792 -61223 -55921 -110955 -121683 -102863 -69312 -58783 -16164 -23445 -51490 -35900 -60542
14070 -60542 -26462 29238 -11369 -10507 72224 93985 -5260 -109096 -144450 -111839 -81321 -32202
14058 -32202 40127 121116 117025 99568 21748 -55271 -33665 39958 81679 4023 -98138 -119980
14046 -119980 -72924 -53329 -7328 87443 75173 33995 15866 -11107 -2574 -43474 2009 55881
14034 55881 74748 81604 77618 33535 33147 54027 112441 139757 136381 195291 196774 156112 118126
14021 118126 117933 89961 75131 87592 92379 78293 -1638 -39353 -36714 25124 27879 -26522
$$ packed form
14107d0848L2937L3343P171L336n4177o2231L5712k1682p217P2076K0431L2360
14095E1211J6941N526m967L7983K3092j5636l0884M51j7228O47r171n2371p3386
14082f7792O569N302n5034j0728J8820L3551J0529M2619p281k8045J5590k4642
14070f0542L4080N5700m0607Q62Q2731K1761r9245j03836l5354L2611L0518M9119
14058c2202P2329Q0989m091j7457p7820p7019K1606P3623M1721p7656j02161k1842
14046a19980M7056J9595M6001R4771j2270m1178j8129k6973Q533m0900M5483N3872
14034E5881J8867O856l986m4083l88K0880N8414K7316l376N8910J483m0662l7986
14021A18126j93k7972j4830J2461M787j4086p9931l7715K639O1838K755n4401
$$ plain form
14009 -26522 -6462 59176 -5246 -45261 -58817 -37010 -4011 -34217 -69157 -61626 -77462 -67921
13997 -67921 5805 70214 102742 104962 60042 -1371 -62544 -90979 -66939 -132006 -110150 -29395
13985 -29395 36459 42188 12903 70370 82028 86676 11877 11293 41498 40451 32407 -21773 -76795
13972 -76795 -77555 -19702 44157 27210 -34731 -28423 -7499 -2103 61144 97363 -18055 -60712
13960 -60712 -46488 29936 53644 103033 168494 124987 90526 20267 -5863 28753 5311 -9109
13948 -9109 -38350 -52701 -20797 -41747 -52399 -38945 4375 15976 6376 43901 48260 -5590
13936 -5590 -39899 -81822 -91450 -79495 -32742 -26554 5417 35481 9596 -30516 18934 28578
13924 28578 -15762 13448 43101 2473 -46727 -32223 27078 83942 50296 61428 78387 62867
$$ packed form
14009b6522K0060O5638o4422m0015j3556K1807L2999l0206l4940P531j5836R541
13997f7921P3726O4409L2528K220m4920o1413o1173k8435K4040o5067K1856Q0755
13985b9395O5854N729k9285N7467J1658M648p4799n84L0205j047q044n4180n5022
13972g6795p60N7853O3859j6947o1941O308K0924N396O3247L6219j15418m2657
13960f0712J4224P6424K3708M9389O5461m3507l4461p0259k6130L4616k3442j4420
13948i109k9241j4351L1904k0950j0652J3454M3320J1601r600L7525M359n3850
13936e590l4309m1923r628J1955M6753O188L1971L0064k5885m0112M9450R644
13924B8578m4340K9210K9653m0628m9200J4504N9301N6864l3646J1132J6959j5520
$$ plain form
13912 62867 29548 53480 125061 125756 96226 40864 -51765 -64692 -129259 -109642 -71891 -66145
13900 -66145 -51335 -30857 -38004 -41027 -13382 7974 49413 8044 -26265 -42972 -19511 13003
13888 13003 21193 47791 24597 5055 45684 19507 19183 -21141 -43658 -45269 -78548 -43004
13876 -43004 -16910 -4514 26634 1623 -52012 -22092 -32206 -48970 -102212 -64873 -53818 -44109
13864 -44109 -76486 -110334 -117945 -68882 -19343 -24292 3726 37848 97751 98338 64738 -207
13852 -207 1177 21074 31094 29367 4599 -70469 -71708 -20441 28501 42951 51853 58292 122144
13839 122144 109941 94720 63170 1484 -74215 -76430 -17590 38795 38567 66928 106159 92105
13827 92105 13295 -42680 6060 68333 65007 78615 65011 44018 60334 90375 47232 7586
$$ packed form
13912F2867l3319K3932P1581O95k9530n5362r2629j2927o4567J9617L7751N746
13900f6145J4810K0478p147l023K7645K1356M1439m1369l4309j6707K3461L2514
13888A3003Q190K6598k3194j9542M0629k6177l24m0324k2517j611l3279L5544
13876d3004K6094J2396L1148k5011n3635K9920j0114j6764n3242L7339J1055R709
13864d4109l2377l3848p611M9063M9539m949K8018L4122N9903N87l3600o4945
13852b07J384J9897J0020j727k4768p5068j239N1267M8942J4450Q902O439O3852
13839A22144j2203j5221l1550o1686p5699k215N8840N6385k28K8361L9231j4054
13827I2105p8810n5975M8740O2273l326J3608j3604k0993J6316L0041m3143l9646
$$ plain form
13815 7586 67777 102282 62940 -466 -37347 4169 14025 83263 91090 62463 86741 72874
13803 72874 69058 63603 49664 1042 7191 31172 74016 105613 55640 13764 32044 75003
13791 75003 50682 42654 17164 35990 76296 108401 28017 -44528 -52098 -13236 27644 7911
13779 7911 44997 67947 52251 11975 -12158 -83896 -125424 -111288 -65051 -44300 -44343 -31381
13767 -31381 2442 39212 25485 8260 17380 -66177 -80632 -67384 -56681 -40016 -38571 -50260
13755 -50260 -31368 -56081 -72200 -120913 -108146 -3713 32174 60109 23372 -7374 -66544
13744 -66544 -102848 -155265 -111720 -51339 -55092 14381 49024 -51308 -49259 -69879 -70343 -24071
13732 -24071 9501 -18149 -60319 -51387 -33469 -48390 -45236 -18052 5976 15773 -8412 -97006
$$ packed form
13815G586O0191L4505l9342o3406l6881M1516R856O9238P827k8627K4278j3867
13803G2874l816n455j3939m8622O149K3981M2844L1597m9973m1876J8280M2959
13791G5003k4321q028k5490J8826M0306L2105q0384p2545p570L8862M0880j9733
13779G911L7086K2950j5696m0276k4133p1738m1528J4136M6237K0751m3J2962
13767c1381L3823L6770j3727j7225R120q3557j4455J3248J0703J6665J445j1689
13755e0260J8892k4713j6119m8713J2767J04433L5887K7935l6737l0746n9170
13744f6544l6304n2417M3545O0381l753O9473L4643j00332K049k0620m64M6272
13732b4071L3572k7650m2170Q932J7918j4921L154K7184K4028R797k4185q8594
$$ plain form
13720 -97006 -102249 -72866 -90142 -45297 -108 -39171 -77210 -28709 30836 70070 33120 -26897
13708 -26897 -55268 -30375 -69391 -83329 8275 65765 105926 62779 1036 48693 42842 34393
13696 34393 -14256 -49156 -42113 -43381 -24171 -33919 -38551 -35830 -24540 1256 28266 -4769 -24825
13683 -24825 -20998 -39995 -77365 -37429 36728 -58352 -66979 -69065 -89275 -61699 -20670 1760
13671 1760 38789 56638 47542 48546 77263 94558 73904 31860 34274 37432 6529 63730 61576
13658 61576 53564 69846 46829 39814 3611 -68562 -87339 -37582 -19407 -68776 -67150 -31303
13646 -31303 -19525 34778 77442 145085 110042 49668 -18719 2515 45006 18657 -17913 -96636
13634 -96636 -122539 -68217 -71281 -72045 -53830 -60944 -87063 -127168 -107990 -13625 -39309 -41564 18117
$$ packed form
13720i7006n243K9383j7276M4845M5189l9063l8039M8501N9545L9234l6950o0017
13708b6897k8371K4893l9016j3938R1604N7490M0161m3147o1743M7657n851q449
13696C4393m8649l4900P043j268J9210r748m632K721J1290K5796K7010l3035k0056
13683b4825L827j8997l7370L9936P4157r5080q627k086k0210K7576M1029K2430
13671A760L7029J7849r096J004K8717J7295k0654m2044K414L158l0903N7201k154
13658F1576q012J6282k3017p015l6203p2173j8777M9757J8175m9369J626L5847
13646c1303J1778N4303M2664O7643l5043o0374o8387K1234M2491k6349l6570p8723
13634i6636k5903N4322l064p64J8215p114k6119m0105J9178R4365k5684k255N9681
$$ plain form
13621 18117 39335 63158 53166 41692 32482 114348 219092 251346 314980 324101 286135 255190
13609 255190 162111 60450 34451 69061 37819 45222 34842 1738 -65749 -57328 35692 71140
13597 71140 79982 68233 82239 81268 78992 82871 121255 86398 41932 61210 69089 77408 74820
13584 74820 -3305 -65689 -40754 11963 41259 74372 6580 32476 47912 14136 60924 18687
13572 18687 -16948 8571 99585 173561 291810 295633 320345 228677 158310 153011 151167 180478
13560 180478 177441 129569 118922 104138 93874 79309 46341 74380 122452 76674 -5849 4131
13548 4131 38529 45622 64315 43958 32325 -15968 -35519 -47262 27496 -4828 -26334 798
13536 798 26660 74457 87960 66685 43784 28048 9338 51030 118978 134276 103414 58114
$$ packed form
13621A8117K1218K3823r992j1474r210Q1866J04744L2254O3634R121l7966l0945
13609B55190r3079j01661k5999L4610l1242P403j0380l3104o7487Q421R3020L5448
13597G1140Q842j1749J4006r71k276L879L8384l4857m4466J9278P879Q319k588
13584G4820p8125o2384K4935N2717K9296L3113o7792K5896J5436l3776M6788m2237
13572A8687l5635K5519R1014P3976J18249L823K4712r1668p0367n299j844K9311
13560A80478l037m7872j0647j4784j0264j4565l2968K8039M8072m5778q2523R980
13548D131L4398P093J8693k0357j1633m8293j9551j1743P4758l2324k1506K7132
13536G98K5862M7797J3503k1275k2901j5736j8710M1692O7948J5298l0862m5300
$$ plain form
13524 58114 44513 76581 153501 156494 115724 113046 131726 143533 121372 66064 73406 40141
13512 40141 65702 51524 54154 67813 64628 -27959 -39872 -42269 -47923 5743 24900 13122
13500 13122 -20362 -48090 -46570 -57358 -37934 -4157 22037 -2457 -21790 -51439 -62497 -123773
13488 -123773 -122975 -124491 -107102 -42142 13019 11287 -24216 -50468 -61702 -3952 -23374 -114141
13476 -114141 -125935 -86609 -100224 -122643 -122741 -118166 -90158 -11446 -13803 51109 99092 52317
13464 52317 61826 43255 -9862 -20296 -9351 24808 -9087 -23277 -33481 -55437 -12720 -24677
13452 -24677 -5112 48050 41761 6438 25843 -3582 -31439 22944 67582 -3379 -31718 18674
13440 18674 688 34316 -2323 -51810 -89736 -89771 -89358 -125514 -56553 15790 87502 48509 33288
$$ packed form
13524E8114j3601L2068P6920K993m0770k678J8680J1807k2161n5308P342l3265
13512D0141K5561j4178K630J3659l185r2587j1913k397n654N3666J9157j1778
13500A3122l3484k7728J520j0788J9424L3777K6194k4494j9333k9649j1058o1276
13488a23773P98j516J7389O4960N5161j732l5503k6252j1234N7750j9422r0767
13476a14141j1794L9326j3615k2419r8M575K8008P8712k357O4912M7983m6775
13464E2317R509j8571n3117j0434J0945L4159l3895j4190j0204k1956M2717j1957
13452b4677J9565N3162o289l5323J9405k9425k7857N4383M4638p0961k8339N0392
13440A8674j7986L3628l6639m9487l7926l5M13l6156O8961P2343P1712l8993j5221
$$ plain form
13427 33288 39852 12464 -4487 -31517 -18194 -10656 -33548 -37842 -43567 -48113 -26559 -21646 37758
13414 37758 28460 -15272 -21321 4067 -1840 -4208 -3540 -19794 -60376 -27043 38422 28424 -239
13401 -239 -5922 60787 79703 67037 47645 36563 55241 8610 -2796 -2112 -45124 -94989 -113578
13388 -113578 -105582 -85359 -43040 -693 39231 39123 13492 -6446 -62216 -23071 -14823 -5571
13376 -5571 51328 54195 18724 3932 -59360 -71372 -13736 24296 -17739 -1630 -19348 -2107
13364 -2107 -4697 1960 10427 60629 -31718 -89379 -42129 -20728 46403 70816 -5131 -58840
13352 -58840 -94447 -84349 -13371 20 22274 9122 18544 -11472 -62778 -151857 -110224 -33177
13340 -33177 16824 13602 -29208 -98003 -124174 -114939 -149286 -192217 -137994 -60248 -52225 -85856
$$ packed form
13427C3288O564k7388j6951k7030J3323P538k2892m294n725m546K1554M913N9404
13414C7758r298m3732o049K5388n907k368O68j6254m0582L3333O5465r998k8663
13401b39n683O6709J8916j2666j9392j1082J8678m6631j1406O84m3012m9865j8589
13388a13578P996K0223M2319M2347L9924j08k5631j9938n5770L9145Q248R252
13376e571N6899K867l5471j4792o3292j2012N7636L8032m2035J6109j7718J7241
13364b107k590O657Q467N0202r2347n7661M7250K1401O7131K4413p5947n3709
13352e8840l5607J0098P0978J3391K2254j3152R422l0016n1306q9079M1633P7047
13340c3177N0001l222m2810o8795k6171R235l4347m2931N4223P7746Q023l3631
$$ plain form
13328 -85856 -57352 -29554 -55391 -101156 -103559 -120662 -118459 -80971 -51475 27987 113963 69436
13316 69436 26529 18303 18202 -32727 8623 44128 76345 37438 -2031 -61735 -65169 -37362
13304 -37362 1589 -18019 -74449 -69813 -54986 -32692 31473 94854 102263 58135 -53077 -52572
13292 -52572 17722 26010 64351 70285 83290 91187 46692 30588 31781 -26230 -88527 -102574
13280 -102574 -70127 -14256 17817 -25677 -34840 -39216 -82717 -25182 6793 -63604 -97677 -51272
13268 -51272 -73879 -90781 -49592 20868 96901 76479 55018 28138 22222 1406 6450 -61138
13256 -61138 -42292 27086 16300 11574 55454 49098 35641 40119 47014 13010 17405 23931 30973
13243 30973 20311 49530 42628 33382 -21694 -50179 -55318 -16755 22383 -8651 26253 39852
$$ packed form
13328h5856K8504K7798k5837m5765k403j7103K203L7488K9496P9462Q5976m4527
13316F9436m2907q226j01n0929M1350L5505L2217l8907l9469n9704l434K7807
13304c7362L8951j9608n6430M636J4827K2294O4165O3381P409m4128j11212N05
13292e2572P0294Q288L8341N934J3005P897m4495j6104J193n8011o2297j4047
13280a02574L2447N5871L2073m3494r163m376m3501N7535L1975p0397l4073M6405
13268e1272k2607j6902M1189P0460P6033k0422k1461k6880n916k0816N044o7588
13256f1138J8846O9378j0786m726M3880o356j3457M478O895l4004M395O526P042
13243C0973j0662K9219o902r246n5076k8485n139L8563L9138l1034L4904J3599
$$ plain form
13231 39852 66059 19342 -43021 -50866 -55494 -22898 -6898 -27566 -59539 -66979 3909 17993
13219 17993 50718 53117 89259 91422 18029 31141 3734 -50980 -34898 -14872 -69907 -73570
13207 -73570 -77294 -25385 25753 35397 -13223 -59192 -48279 -44706 -42825 -22415 -25033 -30708 -48351
13194 -48351 3818 20068 40122 26016 -17955 -27927 -17810 -50429 -43232 -34422 -5566 -22955
13182 -22955 -92883 -110587 -60305 11783 -146 11685 -10119 -19224 -61725 -81391 -97444 -104189
13170 -104189 -17980 28303 25978 13810 -5165 -74301 -46464 48352 108606 97764 39553 -252
13158 -252 -4153 5973 -30137 21717 66584 75140 62762 63176 -28680 -102762 -77154 -6396 -3482
13145 -3482 -7893 19032 39151 25633 -40172 -11709 26962 20069 47326 71505 72711 92757
$$ packed form
13231C9852K6207m6717o2363p845m628L2596J6000k0668l1973p440P0888J4084
13219A7993L2725K399L6142K163p3393J3112k7407n4714J6082K0026n5035l663
13207g3570l724N1909N1138R644m8620m5969J0913L573J881K0410k618n675j7643
13194d8351N2169J6250K0054j4106m3971r972J0117l2619P197Q810K8856j7389
13182b2955o9928j7704N0282P2088j1929J1831k1804r105m2501j9666j6053o745
13170a04189Q6209M6283k325j2168j8975o9136K7837R4816O0254j0842n8211l9805
13158b52l901J0126l6110N1854M4867Q556j2378M14r1856p4082K5608P0758K914
13145c482m411K6925K0119j3518o5805K8463L8671o893K7257K4179J206K0046
$$ plain form
13133 92757 107283 110067 85559 64050 37706 -27277 -42525 -47811 -42322 -37942 -85064 -51526
13121 -51526 -4738 -27443 -58192 -31645 -4257 -365 33202 941 -67494 -49683 -34827 -38986
13109 -38986 -34050 7737 13590 36649 119430 140490 105677 18620 -17850 -51948 -34103 43245
13097 43245 54498 61311 91621 61492 23909 -40238 -49174 -25172 -18675 -24016 -13784 7278
13085 7278 36430 -7077 -10466 5111 35421 69556 41093 11999 11373 -16616 -2784 40832
13073 40832 41025 -8634 -33314 23596 33702 41513 17664 -29284 28558 -19666 -88688 -38613
13061 -38613 3794 -4052 -15600 -80194 -58754 -77738 -75443 -77937 -107063 -102685 -21762 29479
13049 29479 29809 25427 43363 -12686 -27922 -1389 -25741 -12742 24173 -31307 -21323 -897
$$ packed form
13133I2757J4526K784k4508k1509k6344o4983j5248n286N489M380m7122L3538
13121e1526M6788k2705l0749K6547K7388L892L3567l2261o8435J7811J4856m159
13109c8986M936M1787N853K3059Q2781K1060l4813q7057l6470l4098J7845P7348
13097D3245J1253O813L0310l0129l7583o4147q936K4002O497n341J0232K1062
13085G278K9152m3507l389J5577L0310L4135k8463k9094o26k7989J3832M3616
13073D0832J93m9659k4680N6910J0106P811k3849m6948N7842m8224o9022N0075
13061c8613M2407p846j1548o4594K1440j8984K295k494k9126M378Q0923N1241
13049B9479L30m382J7936n6049j5236K6533k4352J2999L6915n5480R984K0426
$$ plain form
13037 -897 -13345 12018 11130 64734 94455 83472 90424 37708 33603 36858 60927 127345 109111
13024 109111 54449 28857 6833 -37880 -45840 -4379 12419 43522 63352 58639 29931 22757
13012 22757 17055 46662 75679 47826 52674 78874 3216 -18358 38565 49648 48854 117402
13000 117402 158127 125476 50073 -55161 -71405 -22280 -14117 -37376 -26211 -98534 -100753 -78322
12988 -78322 -68340 -67010 -55466 -33084 -462 25835 18500 -7665 -22641 -42635 -72419 -43576
12976 -43576 -74760 -122661 -89541 -56091 -2006 -51822 -63059 -124353 -110270 -42581 -32395 -71637
12964 -71637 -113394 -97344 -97554 -42428 24981 -446 -65155 -97172 -100718 -63591 19355 -10386
12952 -10386 -34538 29659 57397 70283 34558 57862 86372 132978 120061 44626 -31680 -35504
$$ packed form
13037h97j2448K5363q88N3604K9721j0983O952n2716m105L255K4069O6418j8234
13024A09111n4662k5592k2024m4713p960M1461J6798L1103J9830m713k8708p174
13012B2757n702K9607K9017k7853M848K6200p5658k1574N6923J1083p94O8548
13000A17402M0725l2651p5403j05234j6244M9125Q163k3259J1165p2323k219K2431
12988g8322R982J330J1544K2382L2622K6297p335k6165j4976j9994k9784K8843
12976d3576l1184m7901L3120L3450N4085m9816j1237o1294J4083O7689J0186l9242
12964g1637m1757J6050k10N5126O7409k5427o4709l2017l546L7127Q2946k9741
12952a0386k4152O4197K7738J2886l5725K3304K8510M6606j2917p5435p6306l824
$$ plain form
12940 -35504 -12069 -39405 -43807 -112988 -81457 -17956 -6262 11649 -12896 -17011 -6335 -23054
12928 -23054 -57996 -77726 -104374 -59207 -24166 -18830 -33320 -20027 5557 10281 63262 84605
12916 84605 58432 494 -25524 -55209 -53597 -9207 -16170 -2198 -82134 -121095 -96252 -86674
12904 -86674 -49484 -30303 -10656 1760 -57300 -95688 -35742 10366 22969 12941 -3245 22137
12892 22137 129932 159231 90822 60830 19994 15167 -5179 -21186 18990 50628 57167 36686
12880 36686 16122 28654 49096 34281 10817 -11314 -16447 -17546 19514 28293 12247 -47394
12868 -47394 -70110 -20807 -58620 -119172 -82781 -77845 -71047 4320 32598 65895 80793 127572
12856 127572 145571 119863 48634 -28915 -98703 -138858 -161067 -171459 -113870 -42761 -47089 -34494
$$ packed form
12940c5504K3435k7336m402o9181L1531O3501J1694J7911k4545m115J0676j6719
12928b3054l4942j9730k6648M5167L5041N336j4490J3293K5584M724N2981K1343
12916H4605k6173n7938k6018k9685J612M4390o963J3972p9936l8961K4843R578
12904h6674L7190J9181J9647J2416n9060l8388N9946M6108J2603j0028j6186K5382
12892B2137J07795K9299o8409k9992m0836m827k0346j6007M0176L1638O539k0481
12880C6686k0564J2532K0442j4815k3464k2131n133j099L7060Q779j6046n9641
12868d7394k2716M9303l7813o0552L6391M936O798P5367K8278L3297J4898M6779
12856A27572J7999k5708p1229p7549o9788m0155k2209j0392N7589P1109m328J2595
$$ plain form
12844 -34494 14062 20370 40474 36842 32023 2760 22264 55591 47898 -32345 -95951 -14828
12832 -14828 14211 12508 -41504 -72605 -36070 -6458 24513 26908 -3856 -68382 -94940 -77736
12820 -77736 -82106 -54881 3809 -8193 -40941 -68052 -29959 -19770 -21238 -11271 73248 86246
12808 86246 108790 142998 91877 82100 65451 46185 30868 66361 32964 -1822 -30646 -33804
12796 -33804 -12286 7259 95 -36464 -22572 26990 42282 50966 1258 2380 1738 20899 69347
12783 69347 34005 -60145 -119120 -120888 -109682 -120796 -78056 -373 -1150 6136 -11650 19171
12771 19171 35288 15622 46701 61942 3624 -9802 -18716 -24594 22286 38404 15843 -25298
12759 -25298 -9424 -53881 -114661 -94317 -59886 -67462 -82660 -55734 -22470 -29428 -76679 -113611
$$ packed form
12844c4494M8556O308K0104l632m819k9263J9504L3327p693q0243o3606Q1123
12832a4828K9039j703n4012l1101L6535K9612L0971K395l0764o4526k6558J7204
12820g7736m370K7225N8690j2002l2748k7111L8093J0189j468R967Q4519J2998
12808H6246K2544L4208n1121r777j6649j9266j5317L5493l3397l4786k8824l158
12796c3804K1518J9545p164l6559J3892M9562J5292Q684m9708J122o42J9161M8448
12783F9347l5342r4150n8975j768J1206j1114M2740P7683p77P286j7786L0821
12771A9171J6117j9666L1079J5241n8318j3426q914n878M6880J6118k2561m1141
12759b5298J5874m4457o0780K0344L4431p576j5198K6926L3264o958m7251l6932
$$ plain form
12747 -113611 -137220 -106805 -30817 -19828 -4851 -14989 -69703 1802 29057 -3318 -54615
12736 -54615 -56998 -38640 -45411 6749 68040 19230 -40567 -67461 -27554 -39045 -8293 -52557
12724 -52557 -28514 -10583 -7879 25336 40712 15420 -605 40900 105581 62312 -33512 -80273
12712 -80273 -108485 -61199 -84341 -75428 -15823 32593 61820 70833 80722 57064 -43961 -86228
12700 -86228 -76139 -84609 -103917 -146279 -100937 -16482 16376 39245 95881 85632 994 37693
12688 37693 74333 56244 36277 44404 85709 110824 94154 52959 38705 88279 43431 -7770
12676 -7770 -48928 -37995 8487 39814 25941 -16014 8068 53197 37723 35790 -45462 -152787
12664 -152787 -159031 -72381 -7631 -51938 -40233 4419 24326 63442 32975 25528 46256 32454
$$ packed form
12747a13611k3609L0415P5988J0989J4977j0138n4714P1505K7255l2375n1297
12736e4615k383J8358o771N2160O1291m8810n9797k6894L9907j1491L0752m4264
12724e2557K4043J7931K704L3215J5376k5292j6025M1505O4681m3269r5824m6761
12712h0273k8212M7286k3142Q913N9605M8416K9227R013R889k3658j01025m2267
12700h6228J0089q470j9308m2362M5342Q4455L2858K2869N6636j0249q4638L6699
12688C7693L6640j8089j9967Q127M1305K5115j6670m1195j4254M9574m4848n1201
12676g770m1158J0933M6482L1327j3873m1955K4082M5129j5474j933q1252j07325
12664a52787o244Q6650O4750m4307J1705M4652J9907L9116l0467p447K0728j3802
$$ plain form
12652 32454 27064 58434 81512 9605 -37427 14810 13169 -14764 -12206 -37471 -47859 -2133
$$ packed form
12652C2454n390L1370K3078p1907m7032N2237j641k7933K558k5265j0388M5726
$$ [...]
##END NTUPLES=NMR SPECTRUM
##END=
