##TITLE=Analysis number 319765
Compound Code cc 48408
Book Reference 471/66
Project Code adrs
Chemist Name carlr
##JCAMPDX= 6.0         $$ Bruker NMR JCAMP-DX V2.0
##DATA TYPE= NMR SPECTRUM
##DATA CLASS= NTUPLES
##ORIGIN= Bruker BioSpin GmbH
##OWNER= nmr
$$ XWIN-NMR		Version 3.5
$$ Fri May 26 10:30:54 2006 GMT Daylight Time (UT+1h)  MAYBRIDGE\nmr@NMR_250MHZ
##.OBSERVE FREQUENCY= 250.131544655141
##.OBSERVE NUCLEUS= ^1H
##.ACQUISITION MODE= SIMULTANEOUS (DQD)
##.ACQUISITION SCHEME= undefined
##.AVERAGES= 16
##.DIGITISER RES= 18
##SPECTROMETER/DATA SYSTEM= dpx250
##.PULSE SEQUENCE= zg30
##.SOLVENT NAME= CDCl3
##.SHIFT REFERENCE= (INTERNAL, CDCl3, 0, 16.522)
##AUDIT TRAIL= $$ (NUMBER, WHEN, WHO, WHERE, WHAT)
$$ ##TITLE= Audit trail, XWIN-NMR		Version 3.5
$$ ##JCAMPDX= 5.01
$$ ##ORIGIN= Bruker BioSpin GmbH
$$ ##OWNER= nmr
$$ C:\u/data/dgb/nmr/ADRS/5220/pdata/1/auditp.txt
$$ ##AUDIT TRAIL=  $$ (NUMBER, WHEN, WHO, WHERE, WHAT)
(   1,<2006-05-26 10:30:23.99 +100>,<MAYBRIDGE\nmr>,<NMR_250MHZ>,
      <created by zg, POWCHK disabled, PULCHK disabled
       configuration hash MD5:
       84 BC 41 DB A1 6E 1D 46 DA 25 12 A5 C1 ED C5 3A
       data hash MD5: 64K
       11 60 E7 C6 58 58 65 BE 3A 3C 00 D2 F5 EF 72 9F>)
(   2,<2006-05-26 10:30:38.71 +100>,<MAYBRIDGE\nmr>,<NMR_250MHZ>,
      <Start of raw data processing
       ef LB = 0.3 FT_mod = 6 PKNL = 1 SI = 32K 
       data hash MD5: 32K
       13 9E 94 4F E3 45 A0 B0 68 0C EA C7 1E B3 76 83>)
(   3,<2006-05-26 10:30:45.22 +100>,<MAYBRIDGE\nmr>,<NMR_250MHZ>,
      <apk 
       data hash MD5: 32K
       8B 87 F8 15 D1 31 75 85 4C A0 99 12 F1 D3 45 21>)
(   4,<2006-05-26 10:30:46.21 +100>,<MAYBRIDGE\nmr>,<NMR_250MHZ>,
      <abs ABSG = 5 
       data hash MD5: 32K
       16 DF 6D C8 C2 A1 45 55 C7 12 7A D7 41 6D D7 94>)
$$ ##END=
$$ 
$$ hash MD5
$$ 1C 9A 68 65 10 87 21 70 04 5C 74 39 95 00 78 32
##$RELAX= 
##$RELAX= 
##$RELAX= 
##$RELAX= 
##$RELAX= 
##$RELAX= 
##$RELAX= 
$$ Bruker specific parameters
$$ --------------------------
##$DU= <C:\u>
##$EXPNO= 5220
##$NAME= <ADRS>
##$PROCNO= 1
##$TYPE= <nmr>
##$USER= <dgb>
##$AMP= (0..31)
100 100 100 100 100 100 100 100 100 100 100 100 100 100 100 100 100 100 
100 100 100 100 100 100 100 100 100 100 100 100 100 100 
##$AQSEQ= 0
##$AQ_mod= 3
##$AUNM= <au_zg>
##$AUTOPOS= <10 >
##$BF1= 250.13
##$BF2= 250.13
##$BF3= 250.13
##$BF4= 250.13
##$BF5= 500.13
##$BF6= 500.13
##$BF7= 500.13
##$BF8= 500.13
##$BYTORDA= 1
##$CFDGTYP= 0
##$CFRGTYP= 5
##$CHEMSTR= <none>
##$CNST= (0..31)
1 1 145 1 1 1 1 1 1 1 1 1 1 1 1 1 1 1 1 1 1 1 1 1 1 1 1 1 1 1 1 1 
##$CPDPRG= <>
##$CPDPRG1= <>
##$CPDPRG2= <>
##$CPDPRG3= <>
##$CPDPRG4= <mlev>
##$CPDPRG5= <mlev>
##$CPDPRG6= <mlev>
##$CPDPRG7= <mlev>
##$CPDPRG8= <mlev>
##$CPDPRGB= <>
##$CPDPRGT= <>
##$D= (0..31)
0 1 0 0 0 0 0 0 0 0.06 0 0 0 0 0 0 0.0002 0 0 0 0 0 0 0 0 0 0 0 0 0 0 
0 
##$DATE= 1148635823
##$DBL= (0..7)
120 120 120 120 120 120 120 120 
##$DBP= (0..7)
150 150 150 150 150 150 150 150 
##$DBP07= 0
##$DBPNAM0= <>
##$DBPNAM1= <>
$$ [...]
##$SUBNAM7= <"">
##$SUBNAM8= <"">
##$SUBNAM9= <"">
##$SW= 20.6930455092707
##$SWIBOX= (0..15)
0 0 3 0 0 0 0 0 0 0 0 0 0 0 0 0 
##$SW_h= 5175.983436853
##$TD= 65536
##$TD0= 1
##$TE= 294.16
##$TE2= 300
##$TE3= 300
##$TEG= 300
##$TL= (0..7)
0 120 120 120 120 120 120 120 
##$TP= (0..7)
150 150 150 150 150 150 150 150 
##$TP07= 0
##$TPNAME0= <>
##$TPNAME1= <>
##$TPNAME2= <>
##$TPNAME3= <>
##$TPNAME4= <>
##$TPNAME5= <>
##$TPNAME6= <>
##$TPNAME7= <>
##$TPOAL= (0..7)
0.5 0.5 0.5 0.5 0.5 0.5 0.5 0.5 
##$TPOFFS= (0..7)
0 0 0 0 0 0 0 0 
##$TUNHIN= 0
##$TUNHOUT= 0
##$TUNXOUT= 0
##$USERA1= <user>
##$USERA2= <user>
##$USERA3= <user>
##$USERA4= <user>
##$USERA5= <user>
##$V9= 5
##$VALIST= <valist>
##$VCLIST= <CCCCCCCCCCCCCCC>
##$VD= 0
##$VDLIST= <DDDDDDDDDDDDDDD>
##$VPLIST= <PPPPPPPPPPPPPPP>
##$VTLIST= <TTTTTTTTTTTTTTT>
##$WBST= 1024
##$WBSW= 4
##$XGAIN= (0..3)
0 0 0 0 
##$XL= 0
##$YL= 0
##$YMAX_a= 451945
##$YMIN_a= -430254
##$ZGOPTNS= <>
##$ZL1= 120
##$ZL2= 120
##$ZL3= 120
##$ZL4= 120
##$ABSF1= 16.522
##$ABSF2= -4.171173
##$ABSG= 5
##$ABSL= 3
##$ALPHA= 0
##$AQORDER= 0
##$ASSFAC= 0
##$ASSFACI= 0
##$ASSFACX= 0
##$ASSWID= 0
##$AUNMP= <proc_1d>
##$AZFE= 0.1
##$AZFW= 0.1
##$BCFW= 0
##$BC_mod= 0
##$BYTORDP= 0
##$COROFFS= 0
##$CY= 12.5
##$DATMOD= 1
##$DC= 0
##$DFILT= <>
##$DTYPP= 0
##$F1P= 14.0000005364418
##$F2P= -0.99999901652339
##$FCOR= 0.5
##$FTSIZE= 32768
##$FT_mod= 6
##$GAMMA= 0
##$GB= 0
##$INTBC= 1
##$INTSCL= 1
##$ISEN= 128
##$LB= 0.3
##$LEV0= 0
##$LPBIN= 0
##$MAXI= 10000
##$MC2= 0
##$MEAN= 0
##$ME_mod= 0
##$MI= 0
##$NCOEF= 0
##$NC_proc= -4
##$NLEV= 6
##$NOISF1= 0
##$NOISF2= 0
##$NSP= 0
##$NTH_PI= 0
##$NZP= 0
##$OFFSET= 16.522
##$PC= 1
##$PHC0= 168.9956
##$PHC1= 8.99397
##$PH_mod= 1
##$PKNL= yes
##$PPARMOD= 0
##$PSCAL= 4
##$PSIGN= 0
##$REVERSE= no
##$SF= 250.13
##$SI= 32768
##$SIGF1= 0
##$SIGF2= 0
##$SINO= 400
##$SIOLD= 32768
##$SREGLST= <1H.CDCl3>
##$SSB= 0
##$STSI= 32768
##$STSR= 0
##$SW_p= 5175.98343685301
##$SYMM= 0
##$S_DEV= 0
##$TDeff= 65536
##$TDoff= 0
##$TI= <Analysis number 999999
Compound Code 99
Book Reference 9
Project Code 9>
##$TILT= no
##$TM1= 0
##$TM2= 0
##$TOPLEV= 0
##$USERP1= <user>
##$USERP2= <user>
##$USERP3= <user>
##$USERP4= <user>
##$USERP5= <user>
##$WDW= 1
##$XDIM= 32768
##$YMAX_p= 447349485
##$YMIN_p= -280098
$$ End of Bruker specific parameters
$$ ---------------------------------
##NTUPLES= NMR SPECTRUM
##VAR_NAME=  FREQUENCY,     SPECTRUM/REAL,   SPECTRUM/IMAG
##SYMBOL=    X,             R,               I
##VAR_TYPE=  INDEPENDENT,   DEPENDENT,       DEPENDENT
##VAR_FORM=  AFFN,          ASDF,            ASDF
##VAR_DIM=   32768,         32768,           32768
##UNITS=     HZ,            ARBITRARY UNITS, ARBITRARY UNITS
##FACTOR=    0.157963299565203, 1,           1
##FIRST=     4132.6476996994, 0,             0
##LAST=      -1043.33573715361, 0,           0
##MIN=       -1043.33573715361, -280098,     0
##MAX=       4132.6476996994, 447349485,     0
$$ Real data points
##PAGE= N=1
##DATA TABLE= (X++(R..R)), XYDATA
$$ [...]
19241f2311M5395P5135J0809l885l257o8736j0957K5751l9732j1736k129m670
19229e0323j5271J10543M815J7133l5771k2912k150J813J1979j0191r4864p8762
19217a63961J27756j2927N9995Q6829m0898j6173O9150J2737n6389q5837l2859
19206e2577K2878M4907k4631N688m0591j8305J8558N4186k7540n2680K4316m3009
19194h8800j629O3220k945J09384R7340R7589O3129j8451P442L3235j8532o1213
19182B79769L7570O4927k012m0767j3278N8869N3074O5899M6083K9533J0788M0997
19170F31452L052q10n936m2484j9754k0583K761l0438k8285O687L551j33540r9386
19157B66287k0078K7155J4703L676n7264m0925N616Q342l3295j811L1239k3708
$$ plain form
19241 -62311 -16916 58219 69028 65143 61886 -6850 -17807 7944 -31788 -43524 -45653 -50323
19229 -50323 -65594 44949 49764 66897 31126 8214 6064 7877 19856 9665 -85199 -163961
19217 -163961 -36205 -49132 10863 97692 56794 40621 109771 122508 66119 -19718 -52577
19206 -52577 -29699 15208 -9423 -3735 -44326 -62631 -44073 10113 -17427 -70107 -45791 -88800
19194 -88800 -90429 -27209 -30154 79230 176570 274159 337288 318837 326279 359514 340982 279769
19182 279769 317339 382266 380254 339487 326209 385078 438152 504051 550134 579667 590455 631452
19170 631452 634504 633694 627758 585274 565520 544937 547698 517260 488975 495662 499213 365673 266287
19157 266287 246209 273364 288067 291743 234479 193554 199170 207512 174217 172406 203645 179937
19145A79937l1205j3342k9318m7616J6509N2602L8043l7610J4662J0158L8937
19134A91757N5474j6141p6862l8900J702j2495K5295J1143o524k0222m091M0276
19122A50412M7383o7712n2388j4207M1878l0825K9870p727L9737k8568j8329Q069
19110I7593L1864l3563k8471o4476n0792m9718o32K3797N3880L7738q704J3174
19098B1690M2451j1726M7659M3060n4001l6154l4702K2938m376J0687m1281P3802
19086H0047J25531K5894k6367P033L6703k1174j15296m8343k7709N9778L0035
19075A26132O6032N3928Q4036K0157m3061j6534m2581K1646m0614J6411N2377
19064B97929M7209L4389N9924J2171r7226m0242J5228m7066N262J2700K5137O1607
$$ plain form
19145 179937 148732 135390 106072 58456 74965 127567 165610 128000 142662 152820 191757
19134 191757 247231 231090 154228 115328 117030 104535 129830 140973 134449 114227 110136 150412
19122 150412 197795 130083 77695 63488 105366 74541 104411 96684 136421 107853 89524 97593
19110 97593 129457 95894 67423 2947 -47845 -97563 -98195 -74398 -20518 17220 8516 21690
19098 21690 64141 52415 100074 143134 89133 52979 18277 41215 36839 47526 6245 80047
19086 80047 205578 231472 205105 212138 248841 227667 112371 64028 36319 96097 126132
19075 126132 192164 246092 330128 350285 307224 290690 248109 269755 229141 245552 297929
19064 297929 345138 379527 439451 451622 354396 314154 329382 282316 287578 300278 325415 387022
19052C87022L9783R3687n507j10495n2354k7851J2985K2818k9185J28443J29664
19041E89010j1812M7925m8794j35861r7544o6433O7902J8256j109Q6898J60783
19030F09221K22794J74755O1697Q2691k4096j62756k56033j30687p0063l932J8742
19019E22333P7550P3270R7322J45241k1096q0076M2470l2697j60625r0129J2846
19008E86409m6574j01854O6101K4755M0260k7597m2347j09547j26415m7371n5108
18997A60712m9714K858j6914K9535N3203L9687N6966l5223j6384n5097o8410K3260
18985A24479l9052O1628K7074K3868k4740K7469J7533m8577m5929L2236Q8734
18974B44723L6457l1362o5320m9589j0535M959K3177o9707O7412J29396K7825
$$ plain form
19052 387022 426805 520492 514985 404490 352136 324285 337270 360088 330903 459346 589010
19041 589010 577198 625123 576329 440468 342924 276491 344393 362649 361540 448438 609221
19030 609221 832015 1006770 1068467 1151158 1127062 964306 708273 577586 507523 503591 522333
19019 522333 599883 673153 770475 915716 894620 814544 857014 824317 663692 573563 586409
19008 586409 539835 437981 504082 528837 569097 541500 499153 389606 263191 215820 160712
18997 160712 110998 113856 96942 126477 179680 219367 276333 241110 224726 169629 101219 124479
18985 124479 85427 147055 174129 197997 173257 200726 218259 169682 123753 155989 244723
18974 244723 281180 249818 184498 134909 124374 129333 152510 82803 150215 279611 307436
18963C07436J0154j9576p8387l2233p139Q833j573k5245L7845J5362o3388k9285
18951A22804N0799J02589N0083L6927Q7086O0581L6484k1128j3629J5580r2441
18940D35735o4359j0911m7529N4610O5566M3886o1878p8458k8374L5189R9416
18929D42893N9146M9357K0956K4543J2795J2744l3959m7808o2489p6853j4800
18918C86525j8549Q018K2451L149Q1245Q2086R1240k8559j51433j56326j16713
18907B03134L5202N4312m0756m5894N4545N7034K9027l9078K045J6001m4276J10352
18895C91648Q8131J07007Q9080J4956p6674j02398k11681n2185p2678K9202P1138
18884B75546M1473O59k6428p5003p060K2413Q9301L2444L6j0450P956J0665k4401
$$ plain form
18963 307436 317590 298014 219627 187394 180255 189088 187515 162270 200115 215477 152089 122804
18951 122804 173603 276192 326275 363202 450288 510869 547353 526225 512596 528176 435735
18940 435735 371376 360465 312936 367546 433112 476998 415120 336662 308288 343477 442893
18929 442893 502039 551396 572352 596895 609690 622434 588475 540667 478178 401325 386525
18918 386525 367976 375994 398445 401594 482839 564925 656165 627606 476173 319847 203134
18907 203134 238336 292648 251892 205998 260543 317577 346604 307526 309571 325572 281296 391648
18895 391648 479779 586786 675866 690822 614148 511750 300069 247884 175206 204408 275546
18884 275546 317019 317678 291250 216247 209187 231600 320901 353345 353381 342931 350887 361552 337151
18871C37151k8562J6017N9236j3937p039K0387M8482J03437J30094M2914j13093
18860E95087L7046O449L6406O4793J2429L2317O3111L2435j47300j36295q2766
18849E13712j26814m5960N1651k1319o2888j0554j2202j166j8044k1806O4606
18838C09216N9639j3839M3889O5683P0484L6372M8661P2974L2442p5719n3199
18827E96603k315r6294L4492J37564R1794L2871l6093l3318q7795p2335p7467
18816D87707j4402P9870M7749m1300N1826K4272L7095L7179R2943J41501J2008
18805I56448k2405M2260j2693q2187p3100q0637p4628K5066r653l8793n5671m8355
18793E25652M930k2410k8498J10243Q1658k278n3397j00729r437J1914K4573l4840
$$ plain form
18871 337151 308589 324606 383842 369905 362866 383253 431735 535172 665266 708180 595087
18860 595087 632133 638582 674988 739781 752210 784527 847638 880073 732773 596478 513712
18849 513712 386898 340938 392589 371270 308382 297828 285626 284460 266416 244610 309216
18838 309216 368855 355016 398905 464588 535072 571444 620105 693079 725521 649802 596603
18827 596603 594288 497994 532486 670050 761844 794715 758622 725304 637509 565174 487707
18816 487707 473305 553175 600924 559624 611450 635722 672817 709996 802939 944440 956448
18805 956448 934043 976303 963610 881423 808323 727686 653058 678124 668471 629678 574007 525652
18793 525652 530582 508172 479674 589917 671575 669297 615900 515171 505734 517648 542221 507381
18781E07381o1919O6108n096J20J0005O8491J0975K3368j3412M1734m348k3541
18769F19866J8032L3111M6733R3490J55850J77797N4406j9546o6566n4389n5118
18758A003666K8773j1448j088k3285j09238o1384k5386l8673l1807J18M2734L790
18746G76772k9336J6305j0066M8442Q2600M271o5568J0809K2306l5551n2752j5862
18734G52370M0817P1455M5834L7990K5160k134M6485l9147j8204l4364L620O0854
18722I90736M4661L1338j5735J13636J17397N6302R8803K05319K59276K45630
18712B147363K25169J80679J93470K60623J40550K18353K96842L48289M27218
18703D438556O13219P30619Q95417J236771J641843K418082L413553M489541N663822
$$ plain form
18781 507381 445462 511570 506474 506594 516599 585090 596065 619433 606021 647755 643407 619866
18769 619866 637898 671009 717742 811232 967082 1144879 1199285 1179739 1113173 1058784 1003666
18758 1003666 1032439 1020991 1019903 996618 887380 825996 800610 761937 730130 730248 772982 776772
18746 776772 747436 763741 753675 802117 884717 888988 823420 834229 856535 820984 768232 752370
18734 752370 793187 864642 910476 948466 973626 971492 1017977 978830 960626 926262 929882 990736
18722 990736 1035397 1066735 1051000 1164636 1282033 1338335 1437138 1642457 1901733 2147363
18712 2147363 2372532 2553211 2746681 3007304 3147854 3366207 3663049 4011338 4438556
18703 4438556 5051775 5782394 6677811 7914582 9556425 11974507 15388060 19877601 25541423
18694B5541423O624561O545756O051478N492669L338408J320572O55799N19842
18686E6090508M20796K436503N833268Q708370J0022172R522900Q984792N546655
18678A07565964P28218k106241m326801o674146q204317o151845l546352j926184
18670G5358296m37048Q39012r1031k070219l451545m729724o172874p784196p221462
18661D4239209o228634n369421l985309k958487k298732j794198j525356j249853
18653A8829219j004402r54562q20314o38159n95609n41308n65392n37578m91029
18644A2680866m87971m95834m37965m29529l72419l46479l55155k77639l46761
18635I131114l43912k74374k69582k54819j93346j06230j50508j16152j63358
$$ plain form
18694 25541423 32165984 38711740 44763218 50255887 53594295 54914867 55570666 56090508
18686 56090508 56511304 58947807 64781075 73489445 83511617 93034517 102019309 107565964
18678 107565964 108294182 106187941 101861140 95186994 86982677 80830832 77284480 75358296
18670 75358296 74921248 75760260 75669229 73599010 70147465 65417741 59244867 51460671 44239209
18661 44239209 38010575 32641154 28655845 25697358 23398626 21604428 20079072 18829219
18653 18829219 17824817 16870255 16049941 15411782 14816173 14274865 13709473 13171895 12680866
18644 12680866 12192895 11697061 11259096 10829567 10457148 10110669 9755514 9477875 9131114
18635 9131114 8787202 8512828 8243246 7988427 7795081 7688851 7538343 7422191 7258833
18626G258833j82623q5243j78035j87324j89943j23827l7513M8349j5846p989
18616F298839Q272j33595j82398j55203j29368p0066m9034J3157r5343j20675
18606E384586k59001l29525j72982j04011n6641q2279j28434K5824J10763j6719
18596D371581o7898N2151L5079m2874k5167l6068P8507J63122J67425K04158K28133
18585E128149K26103L26812M82801N71333R05262J722993K797510L972289M963036
18576B1096288N218984M295680K164721l63895k923957l404899k068088N57504
18568B4572338L652053O296100P968919P846967N581445J232150m030227p623757
18560D5495988q099983o122573l263281l98149J680176K615862K368702J000156
$$ plain form
18626 7258833 7076210 6990967 6812932 6625608 6435665 6311838 6274325 6322674 6306828 6298839
18616 6298839 6307111 6173516 5991118 5835915 5706547 5636481 5587447 5600604 5505261 5384586
18606 5384586 5125585 4796060 4623078 4519067 4462426 4380147 4251713 4277537 4388300 4371581
18596 4371581 4303683 4355834 4390913 4348039 4322872 4286804 4365311 4528433 4695858 4900016 5128149
18585 5128149 5354252 5681064 6163865 6735198 7640460 9363453 12160963 16133252 21096288
18576 21096288 26315272 30610952 32775673 32411778 29487821 26082922 24014834 24572338
18568 24572338 28224391 34520491 42489410 50336377 55917822 57149972 53119745 45495988
18560 45495988 37396005 31273432 28010151 27612002 29292178 31908040 34276742 35276898
18552C5276898j375570l905405m945698m392913l146437k132070j353701q61271
18544A3163833n51598k56612j81358q9731l0446j9198K1812J75628N34252J004514
18534A3771096J890859L266803M821005O196815O966892O148996L651784O14186
18526D7328436k948217m566327l453044p62769L300988P272351J0224434J1186175
18518F7582027R512108M970420j663909p459246j0658402j0522765p477480l592182
18510D0690571K33572K991069M071522L160893O93518k803272o263223p478289
18502C5296361o517149m680270l112090k147984j560116j150556q65651o74393
18494A4588152n67725n15274n36881n43445m50323k68249j59048o1877j02350
$$ plain form
18552 35276898 33901328 29995923 25050225 20657312 17510875 15378805 14025104 13163833
18544 13163833 12612235 12355623 12174265 12084534 12054088 12034890 12056702 12232330 12766582 13771096
18534 13771096 15661955 18928758 23749763 29946578 36913470 43062466 46714250 47328436
18526 47328436 44380219 39813892 36360848 35598079 38899067 46171418 56395852 67582027
18518 67582027 77094135 82064555 80400646 72941400 62282998 51760233 44282753 40690571
18510 40690571 40924143 43915212 47986734 51147627 51841145 49037873 42774650 35296361
18502 35296361 28779212 24098942 20986852 18838868 17278752 16128196 15262545 14588152
18494 14588152 14020427 13505153 12968272 12424827 11974504 11706255 11547207 11485330 11382980
18485A1382980j86470k73394k95914k75819j69905j74112r664J75250K57432M73720
18475A0904104O56532P28151R65807J486210K569027M858670Q402481J1622779
18467D2193761J1273125Q527064M994611m366238j3177942j0574269m763174m86391
18459C3620547L244182P725400J2129319J3281346J1644036J0458936O503400
18452I8607166M70700J92108J778687J735552o838966j9851584j7753793r303650
18444D9036220l149496J822795P621582J3995317J6173312J2306337P381272k387172
18436A02800167j9613456k3043258j4784519q127164m776966l154650k293733
18429B7006421j780213j604692j418879j261022r60541q51157o58787m21855j15771
$$ plain form
18485 11382980 11196510 10923116 10627202 10351383 10181478 10007366 9997702 10172952 10430384 10904104
18475 10904104 11560636 12288787 13254594 14740804 17309831 22168501 30570982 42193761
18467 42193761 53466886 61993950 66988561 62622323 49444381 38870112 34106938 33620547
18459 33620547 36864729 44590129 56719448 70000794 81644830 92103766 98607166
18452 98607166 99077866 99269974 101048661 102784213 95945247 76093663 58339870 49036220
18444 49036220 45886724 47709519 55331101 69326418 85499730 97806067 105187339 102800167
18436 102800167 83186711 60143453 45358934 37231770 32454804 29300154 27006421
18429 27006421 25226208 23621516 22202637 20941615 19981074 19129917 18471130 18049275 17933504
18420A7933504J1057M7827o7108l91733q41807j332503j231298p74238o22278
18411A2731423m17057l27835l07059l86738m42158m36920m03721l70942m12786
18402I226207k97939k60164k03981k44706k04154j16448j79787j75899j01869
18393G441260o9024j25219j87559j97169j25194m9488o6360J5153Q5730O0387
18383F782517O9885j37734n0697M9386m0507O9527K38901L16763M51440M53281
18373H202762O79297Q73381J136843J937743K624303K192966J394634P96989j725536
18364A8113382l530906k251393q96494r4461J39464M76224J283632K212829L603408
18355A9055685N124461O274053O738904O308157M751966K337269j93806j698519
$$ plain form
18420 17933504 17944561 17992388 17925280 17533547 16691740 15359237 14127939 13353701 12731423
18411 12731423 12314366 11986531 11679472 11292734 10850576 10413656 10009935 9638993 9226207
18402 9226207 8928268 8668104 8464123 8219417 8015263 7898815 7719028 7543129 7441260
18393 7441260 7372236 7247017 7059458 6862289 6737095 6687607 6621247 6636400 6722130 6782517
18383 6782517 6852402 6714668 6663971 6713357 6672850 6742377 6981278 7298041 7749481 8202762
18373 8202762 8882059 9755440 10892283 12830026 15454329 17647295 19041929 19838918 18113382
18364 18113382 14582476 12331083 11434589 11340128 11479592 11955816 13239448 15452277 19055685
18355 19055685 24180146 30454199 37193103 43501260 48253226 50590495 50396689 48698170
18347D8698170k564114l901864m818687l476168r26535J686380M662928Q890458
18339D8250568J5926292K6541409L4461613L1428000K6809232K1721353r93300
18332B04145167r868479J7517M165909K326312j9649277m0714524k9087822j2090778
18324I9244025M75629J3398232L1513346M9670842M7450930L2141350K0464317
18317B94358671k2087560p4970413n9750109l1715108j6994716r550727n197006
18310G4093032j799757J414055M773937Q179089J1200920J2758867J1972664Q684143
18302A31276950L509901j632402m720089q305891j2550064j4891203j4931590
18295G7755612j2749838q688485n895506m343750l215419k519385j933636j603176
$$ plain form
18347 48698170 46134056 42232192 37413505 33937337 33010802 34697182 39360110 48250568
18339 48250568 64176860 90718269 125179882 156607882 183417114 205138467 204145167
18332 204145167 194276688 194294205 198460114 200786426 181137149 140422625 111334803 99244025
18324 99244025 99719654 113117886 144631232 194302074 241753004 273894354 294358671
18317 294358671 272271111 197300698 137550589 105835481 88840765 79290038 74093032
18310 74093032 72293275 73707330 78481267 86660356 97861276 110620143 122592807 131276950
18302 131276950 134786851 133154449 128434360 120128469 107578405 92687202 77755612
18295 77755612 65005774 56317289 50421783 46078033 42862614 40343229 38409593 36806417
18287C6806417j399550j145550j302474j663879j359550j092145q67078n51352
18279B7424839n43645n90578m61712n05722o34499p31384p59141o59392o43141
18270B1895625m34731k80598j23002J39907M10149Q25948J521251K494361M202598
18261C0651508O669181R177876J0478200J0135233Q720026N223901J10625k616014
18253G8550536l035448m673196q470714j0545679q723960n292023k444555k63974
18245C5100987J816506L687904N435572O764837O644026M547519K105826q25906
18237F5277271l889099l711654j461473K223495O781440J0659403J2693575J1162606
18229I9735564O067168m19072p404119j1914646j1926465q899835m711786n14357
$$ plain form
18287 36806417 35406867 34261317 32958843 31294964 29935414 28843269 27976191 27424839
18279 27424839 26881194 26290616 25828904 25323182 24688683 23957299 23198158 22538766 21895625
18270 21895625 21460894 21180296 21057294 21197201 21607350 22433298 23954549 26448910 30651508
18261 30651508 37320689 46498565 56976765 67111998 75832024 81055925 81166550 78550536
18253 78550536 75515088 70841892 62371178 51825499 43101539 37809516 35364961 35100987
18245 35100987 36917493 40605397 46040969 52805806 59449832 63997351 66103177 65277271
18237 65277271 61388172 57676518 56215045 58438540 65219980 75879383 88572958 99735564
18229 99735564 105802732 105383660 97979541 86064895 74138430 65238595 60526809 60012452
18221F0012452K666114L630375K010173q96669m389679p662840q075792p250648
18213D0043486n676576l864042k709116k063176j540182j277072j159151j095082
18205B0659089q02558o37911n19377m58120l11441j13519K30762M64546Q44112
18196A9355583J308087J967220K516632K653161J937147R16508l83345j850585
18188B8420408k035326j385632k21909J436642K989876M077583L960515K592987
18180C9835144O32217j724357l824512m398711l644282k465440r45736K68288
18172B3732611Q72770O23953m1406j030420k261490k552173k354337j999999j469539
18163A3519970j059778q49230o29193m19432m37020m42834l41592m77379n13565
$$ plain form
18221 60012452 62678566 66308941 68319114 67422445 63032766 55369926 47294134 40043486
18213 40043486 34366910 30502868 27793752 25730576 24190394 22913322 21754171 20659089
18205 20659089 19856531 19218620 18699243 18241123 17929682 17816163 18046925 18511471 19355583
18196 19355583 20663670 22630890 25147522 27800683 29737830 30654338 30270993 28420408
18188 28420408 26385082 24999450 24777541 26214183 29204059 33281642 37242157 39835144
18180 39835144 40467361 38743004 34918492 30519781 26875499 24410059 23464323 23732611
18172 23732611 24605381 25229334 25187928 24157508 21896018 19343845 16989508 14989509 13519970
18163 13519970 12460192 11610962 10981769 10562337 10125317 9682483 9340891 8863512 8349947
18154H349947m28336l57115l14647k49065k46118j68789j60741j84251k12120
18145F028765k37119k23049k61055j23006k6866n3944j24070j72954j59230j14422
18135D533050j19595j30807j05844m1629r3815p9490J9217o1478n0204K576j1695
18124C860286L9864L2700M8867R9473J32847P1380M6582J39108K24389L23701
18114E019197O30616Q63817J337846K092353L741112O890279J2421026J6513707
18106D9509953J3506165R387863N200043j3284907k3067488j3965686o832346
18099B0453597l776273k496395j787175j389958j052846q28103o63119n94300
18091G865428n15302m19589l89245m01806l11041k44354j35479j37875k12575
$$ plain form
18154 8349947 7921611 7564496 7249849 7000784 6754666 6585877 6425136 6240885 6028765
18145 6028765 5791646 5568597 5307542 5184536 5157670 5103726 4979656 4806702 4647472 4533050
18135 4533050 4413455 4282648 4176804 4135175 4041360 3961870 3981087 3919609 3869405 3871981 3860286
18124 3860286 3900150 3932850 3981717 4081190 4214037 4285417 4331999 4471107 4695496 5019197
18114 5019197 5649813 6513630 7851476 9943829 13684941 20575220 32996246 49509953
18106 49509953 63016118 72403981 77604024 64319117 41251629 27285943 20453597
18099 20453597 16677324 14180929 12393754 11003796 9950950 9122847 8459728 7865428
18091 7865428 7350126 6930537 6541292 6139486 5828445 5584091 5448612 5310737 5098162
18082E098162k10839j32673j13248p6681j69320j87188j69938j16169k38726j47032
18072C536348p0727j10465j17414n8840j2141m2873K402q4766q1010J8097p1975
18061B906636j84922j13802n6075k5266q440q000j9769j8809j6699N758n7601
18050B403011q4178j9444j33367j30237k5508q3750r6208r7370k5781L8090j03742
18039A641516p4745k3846l019m0473n8331j9381l9527l629q162o3033n4029p8674
18027A174667m6317j4364m0672q361m8666l054p304J8495K6777M432l1267n9807
18015I64559o1118l9125j9208n708n983m3830Q0926L3965M0601m4729O886k5233
18003H82003k2801o1983q9651j05292K522L7604P253N0765m6094p6526l1040n6879
$$ plain form
18082 5098162 4887323 4754650 4641402 4564721 4395401 4208213 4038275 3922106 3683380 3536348
18072 3536348 3465621 3355156 3237742 3178902 3166761 3123888 3126290 3041524 2960514 2978611 2906636
18061 2906636 2721714 2607912 2551837 2526571 2518131 2510131 2490362 2471553 2454854 2460612 2403011
18050 2403011 2318833 2299389 2166022 2035785 2010277 1926527 1830319 1732949 1707168 1745258 1641516
18039 1641516 1566771 1542925 1539906 1499433 1441102 1421721 1382194 1378565 1370403 1307370 1253341 1174667
18027 1174667 1128350 1113986 1073314 1064953 1016287 1013233 1005929 1024424 1051201 1055633 1024366 964559
18015 964559 903441 864316 845108 839400 833417 789587 870513 904478 945079 900350 907236 882003
18003 882003 859202 797219 707568 602276 604798 642402 649655 700420 654326 577800 546760 489881
17991D89881L9318K9583j01225p1369L8934Q3783k7260m7086r428k8544j6915
17980C79672q1907J1897K8413Q0137L1474L2242m8175n9393k3238O1270L4344
17969D46736K9417L5432j5530l6926L7406l0946p3837q4652q8142l5635Q2674
17958B65997R2354j2040m5399Q262j0611l1520Q120J983K8830m3286l7802K0573
17946B45461K1663L8000P787m7637o5956k4427L5811N2516m2591J3976p9518l85
17934A54700R5662O1966L9396j1648n4108n3658k0827j4820M9755p086l9724K5754
17922B25362l3030k4414j0983J3119M952o3815j1408K3538N9749l6505k4634q6423
17910C5508j5801J15580N948O27l3491o4782K061J3439p588O2571M8617m6370
$$ plain form
17991 489881 529199 558782 457557 386188 425122 508905 481645 434559 425131 396587 379672
17980 379672 297765 309662 338075 418212 449686 481928 433753 374360 351122 412392 446736
17969 446736 476153 511585 496055 459129 496535 465589 391752 307100 218958 183323 265997
17958 265997 358351 346311 300912 309174 298563 267043 275163 277146 305976 262690 224888 245461
17946 245461 267124 305124 312911 265274 199318 174891 210702 263218 220627 234603 155085 154700
17934 154700 250362 312328 351724 340076 285968 232310 211483 196663 246418 239332 199608 225362
17922 225362 192332 167918 156935 170054 175006 111191 99783 123321 183070 146565 121931 35508
17910 35508 19707 135287 141235 141862 108371 43589 45650 59089 51501 114072 162689 116319
17898A16319j6646M1376M2245q371o3446o384n6125N450L5974K0587R44K6018
17886A37941Q9159R6342P5017J21720M7627k7221m1335n6313j23937q4344j2920
17875B21736P1192J58612J57936J63660J36023P7928O5110q1804j12540j32675
17865G25178j5950r226p8734j01567k1129p9916l2928M6269Q582N7564R2300N5719
17853F46162n6348l8743K6540k2284K8770O2650O9658m0457j31639j02842M5627
17842D87094O2122N5367J46774J47035M1721R483q1152j06542n4586m0093p1089
17831E96134j07054j17279Q702l674J1169P225m1720o5789k4605M6398R147k8303
17819B90351k0764J14570J17910P2993M4831j199o5078p1514r387J44075O2247
$$ plain form
17898 116319 99673 141049 183294 174923 111477 105093 48968 54418 90392 110979 111923 137941
17886 137941 227100 323442 398459 520179 567806 540585 499250 442937 319000 234656 221736
17875 221736 292928 451540 609476 773136 909159 987087 1052197 970393 857853 725178
17865 725178 709228 700002 621268 519701 498572 418656 385728 431997 440579 498143 590443 646162
17853 646162 589814 551071 577611 555327 584097 646747 716405 675948 544309 441467 487094
17842 487094 549216 604583 751357 898392 940113 949596 868444 761902 707316 667223 596134
17831 596134 489080 371801 380503 376829 387998 395223 353503 287714 263109 309507 318654 290351
17819 290351 269587 384157 502067 575060 619891 618692 553614 482100 472713 616788 679035
17808F79035o0206p0801p6501k281M6580K5855j030P906j3127l1094m868J0075
17796E09543o4331j26938q2594N1200N8673O9141O5183J08690R0416Q3292L314
17785G65589m0013J3154l4908p0370n5057k8938M2451P9502J1068j10655k0700
17774E51123j04661r0901k7230Q3955J16568O2935L6463O1897k266m6931L6802
17763F77754J4286o0460k32690p7147j5917m3305O663O1482O604j31755m9446
17752A56069j8006M6140O1854R4904J64197Q8977K0962L6392Q862j42195p7683
17741D40473J3014K2077J01974R4629J7981M3432O4443J30435R4658l1416k9030
17730I62670q0374q7382k5604p9130j06836n4868j787p628k9877r4900m7692K9128
$$ plain form
17808 679035 618829 548028 471527 469246 515826 541681 540651 548557 535430 504336 499468 509543
17796 509543 445212 318274 235680 286880 345553 414694 479877 588567 678983 762275 765589
17785 765589 725576 738730 703822 633452 578395 549457 591908 671410 682478 571823 551123
17774 551123 446462 355561 328331 412286 528854 591789 628252 690149 687883 640952 677754
17763 677754 692040 631580 398890 321743 305826 262521 269184 330666 337270 205515 156069
17752 156069 138063 184203 246057 340961 505158 594135 615097 651489 660351 518156 440473
17741 440473 453487 475564 577538 672167 690148 733580 798023 928458 1023116 991700 962670
17730 962670 882296 794914 769310 690180 583344 528476 526689 519061 489184 394284 346592 375720
17718C75720J41000M9981P3650N4270l9414O6051n6568j68038j42754r0234J5786
17707B79450J17991K5213j3100j21713R295q74N1986l1202p4142m1111m3005K7300
17695A86088Q262m6659M5011K8230K5818O468J3571k7230j3564L0284j6247P6330
17683C16362l7070J4858O4006L052K7097L9863l973j0951m1625m8930L7695K542
17671C62926m0958q227n3307q6257K0135N3867L5718o685o5431o6648j9992J1215
17659A36356l0977K8471J0717l5481q4495j9003N3226N3658m5020p7326J8895
17648I021K4007J1725N4421M3841J9658m9960P509J1912p802K3539p0391m2053
17636C5427N2035o1018K6744L8515j69m9547k681O426k4933j19762j2558K7579
$$ plain form
17718 375720 516720 566701 640351 694621 655207 721258 664690 496652 353898 263664 279450
17707 279450 397441 422654 409554 287841 297136 296262 348248 317046 242904 201793 158788 186088
17695 186088 194350 147691 192702 220932 246750 253218 266789 239559 225995 256279 240032 316362
17683 316362 279292 294150 358156 361208 388305 428168 424195 413244 371619 322689 360384 362926
17671 362926 321968 313741 260434 174177 194312 248179 283897 277212 211781 145133 125141 136356
17659 136356 105379 133850 144567 109086 24591 5588 58814 112472 67452 -9874 9021
17648 9021 33028 44753 99174 143015 162673 112713 120222 132134 124332 147871 77480 35427
17636 35427 87462 26444 53188 91703 91534 41987 39306 45732 20799 -98963 -111521 -83942
17624h3942N0900M2030K8041L1527k1591j0371m7763j5303Q955j7422p203Q5007
17612D2865J3859p464m9331m403K2925Q441O7685j8184j5484l0218J8041M1952
17600I0684j9432k518N709l0083l1224M9472M8749q713m5728P8390j1148p3376
17588E0782j30534Q29O0617N4361P5332K6766K8342K5433m0773N969M432m9489
17576A12067j4541l7749j822O2860K343k8459k0326m1413o5261Q6339N4829l2552
17564G6315R092K3468J3376m3999J0624p3748l2093M3292M9362k9261m8040l8657
17552d0269O3339P0997n6501j35745K5785J07670K4685k7831p4126k7961J976
17541f7981N5584p160Q118O3530K5667p414r0592l0559M4809Q1822M2933n5033
$$ plain form
17624 -83942 -33042 8988 37029 68556 46965 36594 -11169 -26472 -17517 -34939 -42142 42865
17612 42865 56724 49260 -71 -4474 18451 26892 94577 76393 60909 30691 48732 90684
17600 90684 71252 68734 74443 44360 13136 62608 111357 102644 56916 135306 124158 50782
17588 50782 -79752 -78923 -18306 36055 111387 138153 166495 191928 151155 157124 161556 112067
17576 112067 97526 59777 57955 120815 123158 94699 74373 32960 -32301 54038 108867 76315
17564 76315 85407 108875 122251 78252 88876 15128 -16965 26327 75689 46428 -1612 -40269
17552 -40269 23070 94067 37566 -98179 -72394 35276 59961 32130 -41996 -69957 -67981
17541 -67981 -12397 -19557 -11439 52091 77758 70344 -20248 -50807 -5998 75824 118757 63724
17529F3724j0201p7152N2047Q7992k2303q5852J3209k0424q3210o948Q4686P0820
17517F6388l5138q6828q177N4851O3353o619m8560p2091O1629J115l6907l8395
17505h5379N8627K5714P528J246N1268P4242M960q19j9285n0465n7283N5775P0988
17492A37117O2795J0445o0078l2537l0326r0900J9055N544L1500L5953q7341j05748
17480a04521o1286N2984L9898N8846J6723k4152j0427j2665J5253j1471N5216
17469A4398L5832m206q5982j0855O0325M5511N665n3354j5267O510M4963L9581
17457H3121n5772n0280k582M0107M2928n932o2112j11716O5931N5436q7222m269
17445i2362M3843J4941Q4420Q9417N6796L3660N0517P1160q4807r9589m5582L5063
$$ plain form
17529 63724 53523 -23629 28418 116410 94107 8255 21464 1040 -82170 -89118 -4432 66388
17517 66388 31250 -55578 -63755 -8904 54449 47830 -730 -72821 -11192 -10077 -46984 -85379
17505 -85379 -26752 -1038 6490 7736 59004 133246 138206 137387 118102 67637 10354 66129 137117
17492 137117 199912 210357 150279 117742 87416 -3484 15571 21115 52615 88568 1227 -104521
17480 -104521 -165807 -112823 -72925 -14079 2644 -21508 -31935 -44600 -29347 -40818 14398
17469 14398 50230 46024 -39958 -50813 9512 55023 60688 7334 -7933 -1423 43540 83121
17457 83121 27349 -22931 -25513 14594 57522 51590 -10522 -122238 -56307 -871 -88093 -92362
17445 -92362 -48519 -33578 50842 140259 197055 230715 281232 352392 267585 167996 122414 157477
17433A57477l1821m5183n9049m893L3968Q8906L9109o4068m4099k1906j1648l8519
17421a726N8263L0625o3715o9707P6785R1291N0943k0507j1420l2471l4024k0629
17409E3708m472k4148M6350J0227L4399Q0398K4173p0121p0347K3276N621m4638
17397F4426m4526j2463J3304P018M6985J06132J8903p7560j22556j1484N7010
17386D5189O7869n1144m5157K6358J6950m9383J4952k0661o72R752j5783J3907
17374A2177K8350M9483K647n1716L1257N363k8607k5675k453K0334p35l9214m2413
17361d1202M1248K2393O812j922M6663J634j6689j0577m9103r198J8440K5325
17349C3824O92R770l192r355r6480k4038O3850R600j9892k3524P30P1278O2332
$$ plain form
17433 157477 125656 80473 21424 16531 50499 139405 178514 114446 70347 48441 36793 -1726
17421 -1726 56537 87162 23447 -46260 30525 121816 172759 152252 140832 108361 74337 53708
17409 53708 49236 25088 71438 81665 116064 196462 220635 150514 80167 103443 109064 64426
17397 64426 19900 7437 20741 27759 74744 180876 199779 122219 -337 -11821 45189
17386 45189 113058 61914 16757 43115 60065 10682 25634 4973 4301 14053 -1730 12177
17374 12177 40527 90010 92657 40941 72198 77561 48954 23279 20826 41160 40425 1211 -41202
17361 -41202 46 22439 29251 27329 73992 75626 58937 48360 -743 -9941 8499 33824
17349 33824 34516 44286 41094 31739 -64741 -88779 -24929 -15329 -35221 -58745 -58015 13263 75595
17336G5595J1357M3784L0118m6197k8967J3375o9224k448j1167m2511k1318M0214
17324g389j3788o6139J8691J4696j9165P3996Q1711o0393n1256J3242Q822l9269
17312d6241l6458j5247L5294O2247R1087j7675l0622O924m6863k0338K9614L7541
17300D9263l6226m3819Q25k0741k131R878K8587N8642L6801p0464K6513L11j7425
17287B0014O1288O433q025J5489l4305k0754j0569l4842J8455M2279L3943P8642
17275A68048j6579l9982m2176m3777j6402k1257j8370o74K4326j7127K9130L2979
17263C8139q9005J65O1708j9394N679l0389J7108n868R380l8764q902K6868l6223
17250f9498n204L0909J4354J1890p8217L5081O4745P778K1972J980j6921Q698
$$ plain form
17336 75595 86952 130736 160854 114657 85690 99065 29841 27393 16226 -26285 -47603 -7389
17324 -7389 -21177 -87316 -68625 -53929 -73094 902 82613 22220 -29036 -15794 -6972 -46241
17312 -46241 -82699 -97946 -62652 -405 90682 73007 42385 49309 2446 -17892 11722 49263
17300 49263 13037 -30782 -29957 -50698 -52829 -42951 -14364 44278 81079 10615 37128 37439 20014
17287 20014 81302 87735 79710 95199 60894 40140 29571 -5271 13184 55463 89406 168048
17275 168048 151469 111487 69311 25534 9132 -12125 -30495 -31169 -6843 -23970 5160 38139
17263 38139 -50866 -50701 11007 -8387 -2708 -33097 -15989 -21857 -12477 -51241 -60143 -33275 -69498
17250 -69498 -74702 -43793 -29439 -17549 -95766 -60685 4060 11838 33810 35790 18869 27567
17238B7567K3973m0673k4864J3201J1798J3946o3699l8852N1378j8250L2031j2051
17226b4495j3932J6219m8230M319P0780Q7888K4958n6402L64j2696k9382r5579
17214g6188k3570O9129R1755m9957q0641K0936L9468N1959p646m9376j5680L7532
17202G721j8017j8895L8626K0019o062k9662k916n430O050J2452J6886m4463l2652
17189e6343K9356q1485k0392L8860L0308Q8538L4487O1446k8371j02074k2203
17178b7873J3234J9737r776n314Q0267j2692L9096n7193l7613L4967J9798j53
17166E6485q3382J6794L9359o354j8268q6174Q2K8697j57L419r377L0763N538
17153b2575M9473K2773j5012L6831k2924J6679k210m2634M089L1760l5813l1074
$$ plain form
17238 27567 51540 10867 -13997 -796 11002 24948 -38751 -77603 -26225 -44475 -12444 -24495
17226 -24495 -38427 -22208 -70438 -66119 4661 92549 117507 61105 61469 48773 19391 -76188
17214 -76188 -99758 -30629 61126 11169 -69472 -48536 -9068 42891 35245 -14131 -29811 7721
17202 7721 -10296 -29191 9435 29454 23392 -6270 -9186 -14616 -8566 3886 20772 -23691 -56343
17189 -56343 -26987 -108472 -128864 -90004 -59696 28842 63329 124775 96404 -5670 -27873
17178 -27873 -14639 5098 -4678 -9992 70275 57583 96679 39486 1873 36840 56638 56485
17166 56485 -26897 -10103 29256 22902 4634 -81540 -81458 -52761 -52918 -49499 -58876 -28113 -22575
17153 -22575 26898 49671 34659 71490 48566 65245 63035 20401 24490 56250 20437 -10637
17141a0637J8603O0817k7359L8j4880n4928j6533K7295L8383m0734J379L4340
17129A5784K1538k7733m6911l7868O9182N2224n4810o2662o434k5277j1856J3513
17117a01310O3863J8567k7711l2726R150N592P7991Q3945k6793k0005n8339P147
17105f29N198K4272k3439j5587k9929K0366k6026j8350Q564k0459m217O9769o127
17092a6594l9036L0912O7930k3559m5831l2073j7544N358O6810m6034J257P6629
17080B8225J777M21p559n1624M909o8769j7783J5426P3118K870k8734L5109j5314
17067b7928K3009M9008J2624J8166l8007l6203q680R1204P0641l4787m6751k6634
17055D5662q6200k4911q111P2250K3838l4398p770J0716p370J9742j0626K6484
$$ plain form
17141 -10637 7966 68783 41424 41462 26582 -28346 -44879 -17584 20799 -19935 -18556 15784
17129 15784 37322 9589 -37322 -75190 -6008 46216 -8594 -71256 -77690 -102967 -114823 -101310
17117 -101310 -37447 -18880 -46591 -79317 -70167 -64575 13416 97361 70568 50563 -7776 -629
17105 -629 4569 28841 5402 -10185 -40114 -19748 -45774 -64124 -55560 -76019 -80236 -10467 -16594
17092 -16594 -55630 -24718 43212 19653 -26178 -58251 -75795 -70437 -3627 -49661 -48404 28225
17080 28225 30002 30423 22864 -28760 -23851 -92620 -110403 -94977 -21859 -18989 -47723 -12614 -27928
17067 -27928 -4919 44089 56713 74879 36872 669 -8011 83193 153834 119047 72296 45662
17055 45662 -40538 -65449 -73560 -1310 22528 -11870 -19640 -8924 -16294 3448 -7178 19306
17043A9306l4019O9381N5100j8996m5054J7007k783k1476j2884M979K6455J9819
17031G6835l6775j8850l0856M0135M80r711l0962j0409m5184k1885k6524O062
17019a07644l2353O0608J7822Q53K6290K840l8206J1905K3650J9254L9890O0924
17007H5833J7120p1555p0246N04J7216J643l9705M7768N0701N6061J5403j7708
16995I3035q5276m6406J8114j1244K4787O197N9051M6737J0434o5355j00554o6361
16983a16841K9352J8585j4568Q6419M9970q3278k3102N0691Q8757n835k9874q1642
16971c1366N6718J2820L2545l528j35382J544J06493L4139n6404r129j4560j10300
16959a16410M8497N5686R949J9384J9680j2207M6606j2436m4744j9185N0490L2832
$$ plain form
17043 19306 -14713 54668 109768 90772 45718 62725 59942 38466 25582 30561 57016 76835
17031 76835 40060 21210 -9646 30489 30969 21258 -9704 -20113 -65297 -87182 -113706 -107644
17019 -107644 -139997 -79389 -61567 -60714 -34424 -31584 -69790 -57885 -34235 -14981 24909 85833
17007 85833 102953 31398 -38848 -38344 -21128 -19485 -59190 -11422 39279 95340 110743 93035
16995 93035 7759 -38647 -20533 -31777 -6990 -793 58258 104995 115429 50074 -50480 -116841
16983 -116841 -87489 -68904 -83472 2947 52917 -30361 -53463 -2772 85985 80150 50276 -31366
16971 -31366 25352 38172 70717 67189 -68193 -66649 39844 73983 17579 8450 -6110 -116410
16959 -116410 -67913 -12227 -2278 17106 36786 24579 71185 58749 14005 -5180 45310 78142
16947G8142p4986p1794j3791k827R481P1637N139J5758J3180k4756J1187J8680
16935C5050k2882N4287Q968q6911k6120k5609j742L3102k8634l4937j8237o7095
16923a80760J1459J4262N0070K3737L3530J8003n7071M1388N3559k8356K3975
16912C796p358N4652J9275Q053K6720k9228j11875n0321J6564K9600l5117O864
16900f8375j2093l373K7010j1754K957p633J19754Q7376m0623l4046o3152k807
16888f759Q3614J7325l930k983J2042q2398k7999o1301J0456K6922L6257N0284
16876E1530l1150j14516L1231P007M4875O8984L2193n4898j2960l3998j3812n0127
16864g5641k7645M6900L0094M1653l1222l7848L6962R0061R378l3871J393R548
$$ plain form
16947 78142 3156 -68638 -82429 -85256 -75775 -4138 1001 16759 29939 5183 16370 35050
16935 35050 12168 66455 75423 -11488 -37608 -63217 -64959 -31857 -60491 -95428 -113665 -180760
16923 -180760 -169301 -155039 -104969 -81232 -47702 -29699 -86770 -45382 8177 -20179 3796
16912 3796 -3562 51090 70365 78418 105138 75910 -35965 -86286 -69722 -40122 -75239 -68375
16900 -68375 -80468 -83841 -56831 -68585 -65628 -73261 46493 133869 93246 59200 -3952 -6759
16888 -6759 76855 94180 90250 87267 99309 16911 -11088 -72389 -61933 -35011 1246 51530
16876 51530 20380 -94136 -62905 -55898 -11023 57961 90154 35256 22296 -11702 -25514 -75641
16864 -75641 -103286 -56386 -26292 15361 -15861 -53709 -16747 73314 82692 48821 50214 59762
16852E9762K7974m1663J4346k9897P429j89j600k0824Q195L912L0615j5350p2752
16839c0042j0936L1183m201p9572j7509M0248K0710N9570J01706K9350l8460o5201
16827C6846L0920r814p453J7567r5073k0671M9803M212M541K0995J0112M2755
16815H4740J0958o749k1388J7938o848k7021J1978k1865K8546m1443m4177J5286
16803d5m5685L124r695N5388J8585r33m1390m221l9510O425k345m3384q984K0299
16789i2371J00575O8535l8901j824l1054K6126l0818l9349O1854J3285N2703p056
16777H1705q7390Q639k1588P8572l1780o2915k0159M16M6537K4543p9840n6385
16765a19645M9278J0272N2557l780L725l1122K820n5016K0139R6719K7684l2714
$$ plain form
16852 59762 87736 46073 60419 30522 37951 37762 36162 15338 23533 27445 58060 42710 -30042
16839 -30042 -40978 -9795 -13996 -93568 -111077 -70829 -50119 9451 111157 140507 102047 36846
16827 36846 67766 57952 50499 68066 -27007 -47678 2125 6337 10878 31873 41985 84740
16815 84740 95698 88949 67561 85499 78651 51630 63608 41743 70289 28846 -15331 -45
16803 -45 -45730 -42606 -52301 3087 21672 20739 -20651 -24872 -64382 -57957 -60302 -103686 -112670 -92371
16789 -92371 8204 76739 37838 36014 4960 31086 268 -39081 22773 36058 88761 81705
16777 81705 -5685 2954 -18634 59938 28158 -34757 -54916 -54500 -7963 16580 -63260 -119645
16765 -119645 -70367 -60095 -7538 -11318 -7593 -38715 -35895 -90911 -70772 25947 53631 20917
16753B0917K5225N0062P1634J8499r8270j13506m3865K0511j1250m2413L7476
16742f4980M5824k1985k3460k2262r232M1279Q8040J3088j1639j15982r20M5109
16730c7120O5569l4581j3140L4491N5865m6331p2142J2185J4355J3259R8618n0922
16718D0106r0861J3019O5693K2849m2175p0387p103j3576L110l6929K6429N2585
16706c7240K8798m4264j4563O3086o4958j4855l2970K0260O1590K1099L4368K0713
16694D1064l6808r518J05473l3272j3290N308q252l193l3380k9749M3182l9297
16682a1732L6022k4658o5465m4994M7948M7971j7380j2066M0660O9193N0894k6843
16670H9550n0575j7502J4317j9913j7091l5480k5151L7855P2863J2634n2696m93
$$ plain form
16753 20917 46142 96204 167838 186337 88067 -25439 -69304 -48793 -60043 -102456 -64980
16742 -64980 -19156 -41141 -64601 -86863 -96095 -54816 33224 46312 34673 -81309 -82229 -37120
16730 -37120 28449 -6132 -19272 15219 71084 24753 -47389 -35204 -20849 -7590 91028 40106
16718 40106 -50755 -37736 27957 50806 8631 -61756 -68859 -82435 -79325 -116254 -89825 -37240
16706 -37240 -8442 -52706 -67269 -4183 -69141 -83996 -116966 -96706 -35116 -14017 20351 41064
16694 41064 4256 -5262 100211 66939 53649 58957 50705 47512 14132 -15617 27565 -11732
16682 -11732 24290 -368 -65833 -110827 -62879 -14908 -32288 -44354 -3694 65499 116393 89550
16670 89550 38975 21473 35790 15877 -1214 -36694 -61845 -23990 48873 61507 8811 8318
16658H318O4951M8020j2181n8793l43J9492m0883n4239j955L7211J976r216j820
16645E38L0029l8369L022n37k8420L411O3589R646j7020P4044r4387j26539O586
16632a14407O0791N3790L1254k8233n6326K1264Q2553Q199J152k7911k3723M5559
16620E3962q11K305m5294K7123J8425j536m4299k0080l7761l5837M467J7330M7569
16607a4437J5293m017L688J13235m3912q9929R731l5614K5316j4469M2678K2346
16595B9909p1308J2047R2Q014J3592M1102j6760n7240j487O2486J5821R978N8311
16582A04557m1113J6175K2806K8397l3948l7516m1340m1453L3271K9129K9756
16571F8721M6831r1465o4246m1208J0653K4257j4037l2301J3793N9473k9581o8997
$$ plain form
16658 8318 73269 121289 109108 50315 49972 69464 28581 -25658 -27613 9598 11574 2358 538
16645 538 30567 -7802 -4780 -5317 -33737 -30326 33263 42909 25889 99933 5546 -120993 -114407
16632 -114407 -53616 174 31428 3195 -53131 -31867 50686 58885 60037 32126 8403 53962
16620 53962 53151 55456 10162 37285 55710 54174 9875 -10205 -47966 -83803 -79336 -62006 -14437
16607 -14437 856 -3161 527 113762 69850 -20079 -10348 -45962 -20646 -35115 7563 29909
16595 29909 -41399 -29352 -29260 -21246 -7654 33448 16688 -40552 -42039 20447 36268 46246 104557
16582 104557 63444 79619 102425 130822 96874 59358 18018 -23435 9836 38965 68721
16571 68721 115552 24087 -40159 -81367 -70714 -46457 -60494 -92795 -79002 -19529 -49110 -118107
16559a18107l9475O2145J40296m367n218m6953n1490j0562L0030O5198K1888J7438
16547F0823J4609k5054p3092r291M7192M3259k1279n9250J3490M8276J5298O0885
16535A15866N232J4339L3060l4493j10198j5808M7731l1648k4706K0448l2952
16524a3129r6944L2841P290r489L5985J5862L0958O1241J3142j719j6021l257
16512E6760k5720L2479K8006P65o2611N878k1222J2002K7316M0227q4557m8728
16500c9405N8831P1487m8413j20773k0764K1762m120Q3n850j187r153J6822O3434
16487a7246L33L4230N4487J3776l3753O1003j6666r6000o7107K7008P5257P033
16475D2355L4529j0564o5614p0667k8769N3977l15M5930N2781N1056J177j07765
$$ plain form
16559 -118107 -157582 -95437 44859 40492 35274 -11679 -63169 -73731 -43701 21497 43385 60823
16547 60823 75432 50378 -22714 -32005 15187 58446 37167 -22083 -8593 39683 54981 115866
16535 115866 121098 135437 168497 134004 23806 7998 55729 24081 -625 19823 -13129
16524 -13129 -110073 -77232 -69942 -79431 -43446 -27584 3374 64615 77757 76038 60017 56760
16512 56760 31040 63519 91525 92290 29679 35557 14335 26337 53653 93880 9323 -39405
16500 -39405 19426 90913 42500 -78273 -99037 -77275 -81395 -81312 -87162 -88349 -97502 -80680 -17246
16487 -17246 -16913 17317 71804 85580 51827 112830 96164 164 -66943 -39935 35322 42355
16475 42355 76884 66320 706 -69961 -98730 -44753 -45068 862 53643 104699 105876 -1889
16463a889l2888N5897J6746m4703m5844J3269N4599K4755Q027n845o9953l7994
16451f5823n210O6477n3463p4420j2300M6388K6958p469p177J7581M5446O4190
16439D1178L8221J5460j4601j2289M6928l2466j16699q3294K6140l3813j5529
16428a40764pN9245J37870P826m403j6184J7157q935r312J386l1661m5632n1491
16415h4905J00274N0221J4187j9818k2695n9572J835J1776k2074J7531N7922n964
16403C8718K9931J7418O1274P4570p5434l2621M6500N3793L1142o4011j08575
16392G2705l9127m3121l3794K792j2638k8428N92M8188P1853k4844J6175K3173
16380E3526k9596r878J5304o600m5660Q099J1j1599m0652l4018K3502N3510L4466
$$ plain form
16463 -1889 -34777 21120 37866 -6837 -52681 -39412 15187 39942 47969 42124 -27829 -65823
16451 -65823 -71033 -4556 -58019 -132439 -144739 -98351 -71393 -78862 -86039 -68458 -23012 41178
16439 41178 79399 94859 80258 67969 114897 82431 -34268 -117562 -91422 -125235 -140764
16428 -140764 -140771 -81526 56344 64170 59767 43583 60740 51805 42493 43879 12218 -33414 -84905
16415 -84905 15369 65590 79777 59959 37264 -22308 -20473 -8697 -30771 -13240 44682 38718
16403 38718 68649 86067 147341 221911 146477 113856 160356 214149 245291 181280 72705
16392 72705 33578 -9543 -43337 -40545 -53183 -81611 -81019 -32831 39022 14178 30353 53526
16380 53526 23930 14052 29356 22756 -22904 -14805 -14794 -26393 -67045 -101063 -77561 -24051 10415
16367A0415P4757L923k2119o2455l6140K502j0173l0778j5232K2522K3978m7340
16355h6140r630j8102N8274N9505M3178O6390l9405p8364o3049l9130n6827L8823
16343a24477Q2347p037j1027Q279K6537J7095P248O7l2033L1682M9222l1824o9631
16330e3552l2075N313L1146R9090L3619m3949L643L0664J8565j5987P419l9170
16318D4726k3334k7537N8477l514o3350m1847J5769J09827k1323o379L7012j2825
16306F5702k8250j13346o052O8912Q0942p942p3599K692O1010J0732o261O9506
16294A24046o2226n029m348l9488j8075L6394J12767O5669J838n6467p1561R948
16282I3468k0117M9401j950k0279n5281j5806k4244n9827p2596O3593K2243j9254
$$ plain form
16367 10415 85172 89095 66976 4521 -31619 -29117 -39290 -70068 -85300 -62778 -38800 -86140
16355 -86140 -95770 -113872 -55598 3907 47085 113475 74070 -4294 -67343 -106473 -163300 -124477
16343 -124477 -42130 -49167 -60194 -51915 -25378 -8283 -1035 -968 -33001 -1319 47903 16079 -53552
16330 -53552 -85627 -80314 -49168 49922 83541 39592 43235 73899 92464 76477 83896 44726
16318 44726 21392 -6145 52332 48818 -14532 -56379 -40610 69217 47894 41515 78527 65702
16306 65702 37452 -75894 -81946 -13034 67908 59966 -13633 -10941 50069 60801 54540 124046
16294 124046 61820 56791 52443 12955 -5120 31274 144041 209710 211548 155081 83520 93468
16282 93468 73351 122752 120802 100523 45242 29436 5192 -54635 -127231 -63638 -41395 -60649
16270f0649K7229J7586P0408K5581q751j4688j4963j5857n6817q728p150K5476
16258b1323L6887J1841M81r419n5729m073P4186k0607K4437K8943l6146n2757
16246b3279K636N607m2410J9184o4922k5609p502O5669k633L0010P1263k4328
16234C686R656j005l1688j0958l397R5981K8589m8601j20152J5669J04051l4360
16222G471o8922O6458L3245r5777q576M1503M0368q2552n6176N1491O947k2088
16210h6608J2231J6214o193m2344p434P4175L6520n535N1019R8074j0409j19139
16198A0571M9712J1227m3661m147n5269M6332L3736J5483p0051p4705l657J3036
16186g1393M9272K7375j5097o831N7528l6107m8244L6182N181m58j3898m237k4876
$$ plain form
16270 -60649 -33420 -15834 54574 80155 71404 56716 41753 25896 -30921 -39649 -46799 -21323
16258 -21323 15564 27405 27886 18467 -37262 -41335 32851 12244 36681 65624 29478 -23279
16246 -23279 -20643 -15036 -57446 -38262 -103184 -128793 -136295 -70626 -73259 -43249 28014 3686
16234 3686 13342 12337 -19351 -30309 -33706 62275 90864 42263 -77889 -62220 41831 7471
16222 7471 -61451 5007 38252 -57525 -66101 -24598 15770 -66782 -122958 -71467 -64520 -86608
16210 -86608 -74377 -58163 -64356 -106700 -114134 -39959 -3439 -8974 42045 140119 129710 10571
16198 10571 60283 71510 27849 23702 -31567 14765 48501 63984 -6067 -80772 -84429 -71393
16186 -71393 -22121 5254 -9843 -16674 40854 4747 -43497 -7315 -2134 -2592 -16490 -20727 -45603
16173d5603J3785M2968K9609M2811O181m9169n526n3457n8954J516J3185M8436
16161a4218O9948N3696j887l2376l8428r0366J3506K9508o104K1921J222j5869
16149i447l0991J8488m605l5644J07229O3924l0518q8028m290J7214o6782m954
16137f8404k4329j3316O9364p487j1253K1513j0863j0236N8749L2874k1540k5214
16125a0142J8069m1415j4030N7076j0402J10415j82p2048p3591K0859q7625P5589
16113b7427J18534M9279K6428p3801j48501m137M8120N2952n3521m421j6778J1897
16101b1376M4986m2110K3973O547l6060n743K1060j12j3151j2483j2313j0543
16089e7325l2367j6335L0161R9502k0828L5981K0463l2520q3505J1182O1818O8591
$$ plain form
16173 -45603 -31818 11150 40759 83570 89751 40582 35056 -18401 -77355 -75839 -62654 -14218
16161 -14218 55730 109426 107539 75163 36735 -53631 -40125 -10617 -16721 5200 6422 -9447
16149 -9447 -40438 -21950 -26555 -62199 45030 108954 78436 -9592 -13882 3332 -63450 -68404
16137 -68404 -92733 -106049 -36685 -44172 -55425 -33912 -44775 -55011 3738 36612 15072 -10142
16125 -10142 7927 -33488 -47518 9558 -844 109571 109389 37341 -36250 -15391 -103016 -27427
16113 -27427 91107 140386 166814 93013 -55488 -59625 -11505 41447 -12074 -16495 -33273 -21376
16101 -21376 23610 -18500 5473 12020 -24040 -29783 -8723 -8835 -21986 -34469 -46782 -57325
16089 -57325 -89692 -106027 -75866 23636 2808 38789 59252 26732 -56773 -45591 16227 84818
16077H4818Q815j3941n9410m7966k7709n510j2634m3087L6325R6004K9324J4303
16065E9332l2482o5402l7527j4549L8354j3090L6788N8055J1112k5567l7899n4478
16053g7353n2075j3973L9709M5525N481J796j10138j4657N5763N9073Q5195M6537
16041G0883j2022j9843l6660l6008q1399j8273N5954J25344L6867n0015m6200
16030a1372K5747j2900n2316N2252l1332J9507L8075n9159m0042Q555J34989K9849
16018A01853l1591n4899M488J307N1856J2986l6756j3332j7224m136m6040n6862
16006h8350j7953k9796P7015Q827J818L5132J5697L8301L1597l2224J0940l1677
15994A9327m7620j6674L9118N0933K1906l2429o9780j3266K6867J4450j2881j1792
$$ plain form
16077 84818 93633 79692 20282 -27684 -55393 -60903 -73537 -116624 -80299 15705 45029 59332
16065 59332 26850 -38552 -76079 -90628 -52274 -65364 -28576 29479 40591 15024 -22875 -77353
16053 -77353 -129428 -143401 -103692 -58167 -52686 -50890 -161028 -175685 -119922 -60849 24346 70883
16041 70883 58861 39018 2358 -33650 -115049 -133322 -77368 47976 84843 34828 -11372
16030 -11372 14375 1475 -50841 1411 -29921 -10414 27661 -31498 -71540 -62985 72004 101853
16018 101853 70262 15363 19851 21158 73014 86000 49244 35912 18688 14552 -31488 -88350
16006 -88350 -106303 -136099 -59084 -50257 -48439 -13307 2390 40691 72288 40064 51004 19327
15994 19327 -28293 -44967 -5849 45084 66990 34561 -35219 -48485 -21618 -7168 -20049 -31841
15982c1841k8562R785P0043M4248N560R110j3070R995K2165m1526K48k154l109
15969E0892L9288K8188J9585l7354K1143L4891k2182m4264j4996p1670j7060k9871
15957d3410o2261L9052N2636k0807J1755K1496k0283k7876k5439L1311L7166p3169
15945g9829o059j8662l2796K8962O7730P3899O2784k6501J5817L791l2956k7866
15933B8314L9285l5760l1265R921P650J2650M0656K6672k9677l9708L0134l7574
15921B1298J7457M7253J9435k5167o8699l8206K7445O4238O0725N5495m5142n1169
15909H4963r3596l8168n2959j8477K3385m205L6390J9578k8825r429j8091O3045
15897c6389L7555Q289L7171L3761p6068m2696L394J6976O5896j7034j0174J9783
$$ plain form
15982 -31841 -60403 -50618 19425 63673 69233 78343 65273 75268 97433 55907 56155 54001 50892
15969 50892 90180 118368 137953 100599 121742 156633 134451 90187 75191 3521 -13539 -43410
15957 -43410 -105671 -66619 -13983 -34790 -23035 -1539 -21822 -49698 -75137 -43826 -6660 -79829
15945 -79829 -85888 -104550 -137346 -108384 -40654 33245 96029 69528 85345 89136 56180 28314
15933 28314 67599 31839 574 10495 18145 30795 71451 98123 68446 28738 58872 21298
15921 21298 38755 86008 105443 80276 11577 -26629 816 65054 125779 181274 136132 84963
15909 84963 -8633 -46801 -99760 -118237 -94852 -99057 -62667 -43089 -71914 -81343 -99434 -36389
15897 -36389 1166 9455 46626 80387 4319 -38377 -34983 -18007 47889 30855 20681 40464
15885D0464L1293K0454J6831m2298j09070R706M8488j8862J7918k5443k9894J2368
15873b8045J1447K0029m7371K7200k430K8727N1817k370R215l6670k4496L9575
15861D6628l3253k7521n6057k6443L6645K3103j6496j348M3064q383L3226n9231
15849d6066l3599Q5728L5885r0913j0543J7709l4011M4685r358k8227k2879o459
15837i8048N7204l1096Q631K9084m7337k4076M3314N3117m1421j4409j2503j8158
15825i5698N0228L8332k9193J5340J11896P6287m5414l3678k7444l4009j8509
15814H138l2592K0844j9377l3524J1649j9871J1212k4723P2840M0704l0743k5985
15802b1428n420k4183m7073o4453l687Q8794l1306k4259L8367k5843M397M2632
$$ plain form
15885 40464 71757 92211 109042 66744 -42326 -32620 15868 -2994 14924 -10519 -40413 -28045
15873 -28045 -16598 3431 -43940 -16740 -19170 9557 61374 59004 68219 31549 7053 46628
15861 46628 13375 -14146 -70203 -96646 -60001 -36898 -53394 -54742 -11678 -20061 13165 -46066
15849 -46066 -79665 6063 41948 -48965 -59508 -41799 -75810 -31125 -40483 -68710 -91589 -98048
15837 -98048 -40844 -71940 -63309 -34225 -81562 -105638 -62324 -9207 -50628 -65037 -77540 -95698
15825 -95698 -45470 -7138 -36331 -20991 90905 167192 121778 88100 60656 26647 8138
15814 8138 -24454 -3610 -22987 -56511 -44862 -64733 -53521 -78244 -5404 35300 4557 -21428
15802 -21428 -26848 -51031 -98104 -162557 -166244 -77450 -108756 -133015 -94648 -120491 -116094 -73462
15790g3462j1149k4867O7241O0008L644J1250m7643K0752L2676n7102K444J8250
15778B042n3516p727j8978j3572M2399O4089k9238m9808n4375M4267n249K1819
15766e7847J18910L4198q1263j3267N6446J0038q5581m0607O6488R6217j7974
15755H5758o9332N863O6164P632K7181j757J4590N52m3560j6771n9520J0360k713
15742B4447Q611m5276l7530n7662n6260j991O8585O9079M164J7093q953M2964
15730B7271J8962J9147J1082j8526o6781j6916N1320J4462J4132J1220r544P58
15718E6587N1030n4151o5410n567j849l4415L5392N2952N1433p0595k0033K3925
15706A9299n4409l8761O710n5543K5922M2477O9039L3496j3423K8818k1271J5475
$$ plain form
15790 -73462 -84611 -109478 -42237 17771 21415 32665 -14978 5774 38450 -18652 -16208 2042
15778 2042 -51474 -59201 -78179 -91751 -49352 14737 -14501 -64309 -118684 -74417 -79666 -57847
15766 -57847 61063 95261 13998 731 57177 67215 -18366 -58973 7515 103732 85758
15755 85758 16426 22289 88453 96085 123266 121509 136099 136651 93091 76320 16800 27160 24447
15742 24447 33058 -12218 -49748 -107410 -163670 -165661 -97076 -27997 -23833 -6740 -15693 27271
15730 27271 46233 65380 76462 57936 -8845 -25761 25559 40021 54153 65373 55829 56587
15718 56587 107617 53466 -11944 -17511 -19360 -53775 -18383 34569 86002 15407 -4626 19299
15706 19299 -35110 -73871 -67161 -122704 -96782 -54305 14734 48230 34807 63625 42354 57829
15694E7829l1707l8325L4688n9181L1278O2295m317n4878L4391L4792m756p3549
15682a1440L5409L6264k1455N6807p4238l3056o0633o226o8911r64N4739N5763
15670c7941j0872k671r605j9080L6030J076K7369M1899k7460o2730O6867l1163
15658b8281l1508j9016L6253M7821j0910O7302K0387J9707k0680q0125p4953m8413
15646a22416Q5981P849J504Q4627M0205J6778l781r501j0715k7427n9034M6951
15634E1021M9922o4112l1801M8037P496k6030o391l4839k7242M2762O9557N452
15622H3832m6611m5081n2085J4770K6339k3222K1159R0033m5555p274q956j30646
15610a23297l2733M7465K4217K4306K4167K3397M769K9253L8730l2943J5800L0593
$$ plain form
15694 57829 26122 -12203 22485 -36696 -5418 56877 52560 -2318 32073 66865 62109 -11440
15682 -11440 23969 60233 38778 95585 21347 -11709 -72342 -78568 -147479 -148443 -93704 -37941
15670 -37941 -48813 -51484 -61089 -80169 -44139 -43063 -15694 26205 -1255 -63985 2882 -28281
15658 -28281 -59789 -78805 -42552 5269 -5641 61661 82048 101755 81075 950 -74003 -122416
15646 -122416 -36435 -28586 -27082 57545 97750 114528 110747 101246 90531 63104 4070 51021
15634 51021 100943 36831 5030 53067 60563 34533 28142 -6697 -33939 8823 78380 83832
15622 83832 37221 -7860 -59945 -45175 -18836 -42058 -20899 69134 23579 16305 7349 -123297
15610 -123297 -156030 -108565 -84348 -60042 -35875 -12478 -7709 21544 60274 27331 43131 73724
15598G3724l7715M4344m3735j5917n968l551p895l1083j7412l9248L4517O527
15586d3412Q4368O585j8996J0059k0532J7270l472j9964j2220M218k7461K1250
15574b307K6265l9353N772O3960M267k1079M0114J3807P287m2047M23J8210j02632
15561b7313p602k3597K7869Q0036m3684n8216K9223k9809J7372j5384J9987L2754
15549A636j393J9711r3103J4820J1909L3673j1428J6188J3157J069R413k8421
15537a2769M8539M238m5519j9221m2802K4961M9515m1398m7695j2642m4828K3068
15525a16553j1671N4684l5045O0840O1190j403J3884j7699k6301J5659p166L9086
15513B9505J4005m1631M7236K237r3940k0457O2553q962j8881J4809j894l6722
$$ plain form
15598 73724 36009 80353 36618 20701 14733 11182 3287 -27796 -45208 -84456 -49939 -43412
15586 -43412 40956 47541 28545 38604 18072 35342 31870 11906 -314 3904 -23557 -2307
15574 -2307 23958 -15395 -9623 54337 58604 37525 77639 91446 98733 56686 57109 75319 -27313
15561 -27313 -34915 -58512 -30643 49393 5709 -52507 -23284 -53093 -35721 -51105 -31118 1636
15549 1636 243 19954 -73149 -58329 -46420 -12747 -24175 -7987 5170 6239 15652 -12769
15537 -12769 35770 40008 -5511 -24732 -67534 -42573 6942 -34456 -82151 -94793 -139621 -116553
15525 -116553 -128224 -73540 -108585 -47745 13445 12042 25926 8227 -18074 -2415 -9581 29505
15513 29505 43510 1879 49115 51352 -42588 -63045 -492 -9454 -28335 -13526 -15420 -52142
15501e2142k5578p115O6183M2512k417O9486L1981J7476o0601p6952m5793o0067
15489a03027j8374L4395K7394M7439L1823M4046k7317N7598L8641K2628J8545
15478A73791o0315K7429K0563n9618n0689m4697j7651k2141l4950m0088N9032
15467d9334K8496M706l1969O596K5508J1502k3159k7349P209m4848Q727M6665
15455c7250R091j942O4815P8209m2533q0429q028O09l4821k6467k404N367L0167
15442d5616j9044L7141l0487N151P551O562o4996J5839L4322N5350K3803k6674
15430a098J2736J7400L4061J5412k8723k0002k1881M868M907k5193m7225l3887
15418h8625M3378N3463M5893Q6627K1799j38326k0260L1338r80r0161j1568L0040
$$ plain form
15501 -52142 -77720 -84835 -18652 23860 21443 90929 122910 140386 79785 2833 -42960 -103027
15489 -103027 -121401 -87006 -59612 -12173 19650 63696 36379 93977 132618 155246 173791
15478 173791 113476 140905 161468 101850 51161 6464 -11187 -33328 -68278 -108366 -49334
15467 -49334 -20838 -16132 -48101 -41505 -15997 -4495 -27654 -55003 -47794 -92642 -83915 -37250
15455 -37250 -28159 -30101 34714 112923 70390 -10039 -18067 -17458 -52279 -78746 -81150 -75783 -45616
15442 -45616 -64660 -27519 -58006 -52855 -45304 -38742 -103738 -87899 -53577 1773 25576 -1098
15430 -1098 11638 29038 63099 78511 49788 29786 7905 12773 17680 -7513 -54738 -88625
15418 -88625 -45247 8216 54109 140736 162535 24209 3949 35287 34307 -55854 -67422 -37382
15406c7382k3213J1180j2164K6501P0377M3784m9711k0977M0873R8486j3424j7336
15394A16994o2148j1920l217K349O057m6826k4522K2496K9495l9318j9900k2209
15382e2669J1093J0969m457P1279k4987J3229r314L504J8822k013M4696p224k7720
15369D5208J4634l7865j8552o126p7349r5140O9665J34848P2567K0164l3251p7220
15357A1583q0468R534L5731m2211m211L7106l9023k6169N5286M7235j4526l1732
15345d1865l5108O7934l9601J9546L3070j5500j8597j5265M7640n276L1953N6974
15333H5905Q529l8759n3010K8343M6457l2819J0748j9823L8421K8264m1813k2594
15321C7849L0147Q412M034L757P8184n7871n0230j074p5906j1193K3289r95J9823
$$ plain form
15406 -37382 -60595 -49415 -61579 -35078 35299 79083 29372 8395 49268 147754 134330 116994
15394 116994 54846 42926 39709 42058 48115 1289 -23233 -737 28758 -10560 -30460 -52669
15382 -52669 -41576 -30607 -35064 36215 11228 24457 15143 18647 37469 35456 80152 72928 45208
15369 45208 59842 21977 3425 -2701 -80050 -175190 -105525 29323 101890 122054 88803 11583
15357 11583 -68885 -59351 -23620 -65831 -70042 -32936 -71959 -98128 -42842 4393 -10133 -41865
15345 -41865 -76973 -9039 -48640 -29094 3976 -11524 -30121 -45386 2254 -3022 28931 85905
15333 85905 94434 55675 2665 31008 77465 44646 55394 35571 73992 102256 60443 37849
15321 37849 67996 76408 80442 84199 162383 104512 54282 53208 -22698 -33891 -10602 -11597 8226
15308H226K7624k99l6124L658M0166J4444j30263l684K8445K4273K3807K2674
15296B2947R9464J9289J4882o4559m9061L1293N6436m8842o3776M39m4100k5523
15284e1111Q01K5684j1399l5113L4368L3002j511m4514m212J02492L3264k2744
15272E9007K5143J7590k6001m004l7471k5286L0122L8168P103J2566J292k3885
15260G4344j2888n071p553k8282r7659r8991m338P3246K9664k8554n292N6442
15248e4932R9914N2521O307q56M5681k8598m9382j0040k5878l945n949o1942p3881
15235a10980Q497N9425R7639P8145J6860m6329j04980n3089r1663P6917N1696
15224a7862l215k3354J1833o643K7119P1117m180L0361J8410q6305o0285K4072
$$ plain form
15308 8226 35850 35551 -573 3085 43251 57695 -72568 -76252 -47807 -23534 273 22947
15296 22947 122411 141700 156582 92023 42962 74255 130691 81849 18073 18512 -25588 -51111
15284 -51111 -50310 -24626 -36025 -71138 -36770 -3768 -5279 -49793 -54005 48487 81751 59007
15272 59007 84150 101740 75739 71735 34264 8978 39100 77268 84371 96937 98229 74344
15260 74344 61456 56385 48832 20550 -77109 -176100 -180438 -107192 -77528 -106082 -111374 -54932
15248 -54932 44982 97503 103810 102954 148635 120037 70655 60615 34737 30792 24843 -37099 -110980
15235 -110980 -102483 -43058 54581 132726 149586 103257 -1723 -54812 -146475 -69558 -17862
15224 -17862 -21077 -44431 -32598 -39241 -12122 58995 54815 85176 103586 17281 -43004 -18932
15212a8932j8418m2190k9626M3976K6895M8705R5101n900n4026j0386j0193k4584
15200D22M4503J8690j9574j0040J4948n4699l4282j3552J5613O9409N9251l2640
15188E8049p2556M9325N172o5265j3564N0320L6441K2938n982l8315k4230q3641
15176h1308O620J0600J24984M3876j5160r7431r301M2639Q1867j2102O459l1369
15164G0374n9370l2145j7598O6339j3998o5992N2290L9186j9613K6300K286l3975
15152A4084j5647O5547K3435j860j6366m370M1115R9318k8587q0276K176l5708
15140F2861m7976m3118o4616O7619O887m4109k5096O5057N7616M779k2043k6801
15128h940M225M5243L662K3879n8957K626L4325j3331p933L2241k5768J5927J1624
$$ plain form
15212 -18932 -37350 -79540 -109166 -65190 -38295 10410 105511 99611 45585 35199 25006 422
15200 422 44925 63615 44041 34001 48949 -5750 -40032 -53584 -37971 31438 90689 58049
15188 58049 -14507 34818 39990 -25275 -38839 11481 47922 70860 64878 26563 2333 -81308
15176 -81308 -74688 -64088 60896 104772 89612 -7819 -17120 25519 107386 95284 101743 70374
15164 70374 11004 -21141 -38739 27600 13602 -52390 -100 39086 19473 45773 48059 14084
15152 14084 -1563 63984 87419 85559 69193 64823 105938 205256 176669 96393 98569 62861
15140 62861 14885 -28233 -92849 -25230 -18343 -62452 -87548 -22491 35125 39904 17861 -8940
15128 -8940 -4715 40528 44190 68069 9112 11738 46063 32732 24799 57040 31272 47199 58823
15115E8823j5476o0359j01976n3390K2105k991K7182J15102M81K9265N5809m9095
15103B5480k7545J7314O110n5539j5695j5290L721o5046n222j7703P9340k7893
15091i7968K6937L6446P2313n477J7469N424L221O763m6692l3073N000J5198j2017
15078f456P047l1351o9000J6599M0511K0134k1970K3409M4860k6213Q163K8396
15066C4129j9767m1783M4861r882j5513Q1236O4394J1415M710k1996m5763j6471
15054F9570l4890o2679j6884q36m395K0122N4187M853r5537Q756J6166k9300M4427
15041b6440K5720J8725N316j3079j11656J8766O3763J0591M1117O0561j4577m5906
15029C2901J9424j9020j3090j2319q912J4737J4098k2958k581K0473J9216k7867
$$ plain form
15115 58823 43347 -17012 -118988 -172378 -150273 -153264 -126082 -10980 -10499 18766 74575 25480
15103 25480 -2065 15249 21359 -34180 -49875 -65165 -61444 -126490 -131712 -149415 -70075 -97968
15091 -97968 -71031 -34585 37728 32251 49720 55144 58365 65128 18436 -14637 -9637 5561 -6456
15078 -6456 591 -30760 -99760 -83161 -42650 -22516 -44486 -21077 23783 -2430 5733 34129
15066 34129 14362 -27421 17440 7558 -7955 73281 137675 149090 153800 131804 86041 69570
15054 69570 34680 -27999 -44883 -45719 -50114 -29992 24195 29048 -66489 -57733 -41567 -70867 -26440
15041 -26440 -720 18005 23321 10242 -101414 -82648 -18885 -8294 32823 93384 78807 32901
15029 32901 52325 33305 20215 7896 -1016 13721 27819 4861 2280 22753 41969 14102
15017A4102p5827K7196J3188N6366k2861n3864Q2703N9449p0527l3667L3870m2742
15005a2614J9089J9677k8737o9392k0750M899O6854Q1375l598m2481m7713M859
14993b8532k7472j3117R559P4734L9574m1229k7907L3425P098J8326j4212l8041
14981g794o7183k8995o4663K2854J28860Q3046l8785l2391j3311o57j416k383
14969b2818M9041m144l359j8853r336O9438L807m2594K7876L2956m4328p6651
14957c8965l3371M3421O6816l0204J498m7583N6262L4545K4698N996o603l7076
14945C9434o0809o1704L4201m2287k8162O5859L6764L5059k9475k1553J4391Q950
14933i332l0179m3514J8373o6586O0675J00065J4041J1725j3797p5723K1536j7735
$$ plain form
15017 14102 -61725 -34529 -21341 35025 12164 -41700 41003 100452 29925 -3742 30128 -12614
15005 -12614 6475 26152 -2585 -71977 -92727 -87828 -20974 60401 56803 14322 -33391 -28532
14993 -28532 -56004 -69121 -59562 15172 54746 13517 -14390 19035 26133 44459 30247 -7794
14981 -7794 -74977 -103972 -168635 -145781 -16921 66125 27340 -5051 -18362 -19019 -20435 -22818
14969 -22818 26223 22079 18720 -133 -9469 59969 63776 21182 49058 82014 37686 -38965
14957 -38965 -72336 -28915 37901 7697 9195 -38388 17874 52419 77117 83113 76510 39434
14945 39434 -21375 -83079 -48878 -91165 -119327 -53468 -16704 18355 -11120 -32673 -18282 -9332
14933 -9332 -39511 -83025 -64652 -131238 -70563 29502 43543 55268 41471 -34252 -12716 -30451
14921c0451q323m161l4070K5315R5965O5427k4101p0472k2322j933K8418J954
14909B1246q4457l2741Q4190N5491O9800J9783n7314q725J818k3610n0983L2495
14897B6993l6982j0845M3988M1649j616n3158p0302J0471O962l4556O724l3610
14885a04282N5477M9714L8030l7570j7641q061n8271k2993L7480N3173J5408p4640
14873g4176m6862J08430O9528p7290l0045j2574o3086P6257J17232m2241n8602
14862c3429o7501L2015K7346M195L8451J5196k5758q777Q2011J3504K1073j6239
14850H2087l6597m1733J8961m2004m0694N7171K347J677R837k5631r853L7182
14838A2750k9975o0290m7248N9128N7219J7511j9339j01980J8188K7203O1525
$$ plain form
14921 -30451 -38774 -42935 -77005 -51690 44275 109702 85601 15129 -7193 -9126 19292 21246
14909 21246 -63211 -95952 -11762 43729 113529 133312 75998 67273 69091 45481 -5502 26993
14897 26993 -9989 -20834 23154 64803 63187 10029 -60273 -49802 -42840 -77396 -70672 -104282
14885 -104282 -48805 909 38939 1369 -16272 -24333 -82604 -105597 -68117 -14944 464 -74176
14873 -74176 -121038 -12608 56920 -20370 -50415 -62989 -126075 -49818 67414 25173 -33429
14862 -33429 -100930 -68915 -41569 -37374 1077 16273 -9485 -18262 63749 77253 98326 82087
14850 82087 45490 3757 22718 -19286 -59980 -2809 -462 1215 11052 -14579 -24432 12750
14838 12750 -17225 -77515 -124763 -65635 -8416 9095 -10244 -112224 -94036 -66833 -5308
14827e308M4769M5744m516j6188k0986k3451j4559K517l109K1182k7581J2730
14815A1244l4497K6930O9687L4400l8792o3508o8741L332K5883M5806K8646P6055
14803A16445N7187k1736p1202k6145j5589p6925p5070j915J1398O423K1068Q3695
14791G634N3428l6982M0292L7787k6610J1128J5762j0360n1520m4098R828P245
14779A3534j8252P150k6543Q065J28395O9340k1704j575p7906l9107K5842o2811
14767D428k8541k506J788K3907J8213k1324j04868r928O8434P9708l580K4540
14755E0271J3303l4581m3925K3450j571L0810L8081l0968m4935l9717Q221k2962
14743e4523K0181p084j14015k4447P6007J1992O1406k4495l996Q2277K4104j7349
$$ plain form
14827 -5308 39461 85205 80689 64501 43515 20064 5505 8022 4913 26095 -1486 11244
14815 11244 -23253 3677 73364 107764 68972 5464 -63277 -59945 -34062 11744 40390 116445
14803 116445 173632 151896 80694 54549 38960 -37965 -113035 -114950 -103552 -97129 -76061 7634
14791 7634 61062 24080 64372 102159 75549 86677 102439 92079 40559 -3539 6289 13534
14779 13534 -4718 2432 -24111 -16046 112349 181689 159985 158410 80504 41397 67239 4428
14767 4428 -24113 -26619 -24831 -924 17289 -4035 -108903 -118831 -50397 29311 25731 50271
14755 50271 63574 28993 -14932 8518 6947 37757 75838 44870 -65 -39782 -31561 -54523
14743 -54523 -34342 -41426 -155441 -179888 -103881 -91889 -30483 -54978 -58974 23303 47407 30058
14731C0058p3078m5813O1047N0219j2736L2581J480Q337o4866j28232M761J52588
14719A6346J9018l1560j3992L5482p0981m1646P784o8902N233Q8945N0962m0078
14707d3389o1631q783P2926J28536n0174n6894L0713K2307j6870l8053m9423l0699
14695a01434j5067P4766L7096L0156k0772j3392k7219n1958L2505O082j387k5972
14683g6596r057J08627n28k844p5894L9553M8093l5237n6982n049k7509L9281
14671e4142L6622k2015J29762L5800l8537j9047j2184O1826j5190n8550o4305
14660a9960k321q179m8603N2178M1525k7801r9022l1770J6498L8858P5490K2836
14648I729l4445L115M5637j3085o8437k3580k0487P2520L6976m5387n3579m1138
$$ plain form
14731 30058 -43020 -88833 -27786 22433 9697 42278 43758 52095 -12771 -141003 -136242 16346
14719 16346 35364 3804 -10188 25294 -45687 -87333 -79549 -148451 -143218 -54273 -3311 -43389
14707 -43389 -105020 -113803 -40877 87659 37485 -19409 11304 33611 16741 -21312 -70735 -101434
14695 -101434 -116501 -41735 -4639 25517 4745 -8647 -35866 -87824 -55319 -49237 -50624 -76596
14683 -76596 -85653 22974 22446 19602 -56292 -16739 31354 -3883 -60865 -65914 -93423 -54142
14671 -54142 -17520 -39535 90227 126027 87490 68443 56259 118085 102895 44345 -19960
14660 -19960 -22281 -30460 -79063 -26885 14640 -13161 -112183 -143953 -127455 -88597 -13107 9729
14648 9729 -24716 -21601 24036 10951 -57486 -81066 -101553 -29033 7943 -37444 -91023 -132161
14636a32161J0700K2209l7220L2700M6662N9701J6589j7970j9529n0877k0508
14625h9704N5866j463j8155J119M1736K441o5530j0626O0538R2898K4657m4325
14613D9452m7909m4062q640L827n705j5052L2560k533O504P3751M5972N3640J0560
14600A52365r6085r2540q146o224k1068p0186k202o584K5236P9000J548k8561
14588g3447J3796K547k7033k7434O0137P3707P9850M7271l5866k9300m4381J0650
14576E0497n5327j3094j3390K8334L8798K123p303J5873L0533k5766k7691j8048
14564E539J3801j671N0847O3646p0692l2170M29M4718J05397r848m8728j05284
14552A5984j8389L2738J6965J643p3859m7225M8160R546j3426J3845M6393P9960
$$ plain form
14636 -132161 -121461 -99252 -136472 -103772 -57110 2591 19180 1210 -18319 -69196 -89704
14625 -89704 -33838 -35301 -53456 -52337 -10601 -8160 -73690 -84316 -23778 69120 93777 49452
14613 49452 1543 -42519 -51159 -47332 -53037 -68089 -35529 -38062 -31558 42193 88165 141805 152365
14600 152365 56280 -36260 -44406 -50630 -71698 -141884 -144086 -150670 -125434 -46434 -44886 -73447
14588 -73447 -59651 -57104 -84137 -111571 -51434 22273 102123 149394 113528 84228 39847 50497
14576 50497 -4830 -17924 -31314 -2980 35818 37941 30638 46511 77044 51278 23587 5539
14564 5539 19340 17669 68516 132162 61470 29300 29729 74447 179844 169996 121268 15984
14552 15984 -2405 30333 47298 48941 -24918 -72143 -23983 -14437 -27863 -14018 32375 112335
14540A12335J8159n7729o6576m1979l7569n293J3982j3967M7834J0272m7642O18
14528f7555j5524N6273O3618k3402O539R7004L6400n3270n9410j3704k3704m3763
14516d0498j0788m3392K7375J3236Q5660k325l6136l387p9984N3235P047m1460
14504g1417J6584K443L7108O1313L0168m7678j9383J0627L581N123k4571k7595
14492b3697k7668K7341O2386k5538o3725J0850k014p869Q2594J4914n0996j1737
14480a5159M4124j6848k1228p3811Q030K1779r433N0172P6601L0605l9089k5078
14468C0665M537K1722j9433k9288q576O939L0278j4065K2710j4442Q2153n3372
14456E9828o3262K710l4523k6205Q3758N0818k7862p0629m3176Q6881j60P420
$$ plain form
14540 112335 130494 72765 6189 -35790 -73359 -78652 -64670 -78637 -30803 -20531 -68173 -67555
14528 -67555 -83079 -26806 36812 13410 19949 116953 153353 100083 40673 26969 3265 -40498
14516 -40498 -51286 -94678 -67303 -54067 31593 29268 -6868 -10255 -90239 -37004 -29957 -71417
14504 -71417 -54833 -52390 -15282 46031 76199 28521 9138 19765 23346 28469 3898 -23697
14492 -23697 -51365 -24024 38362 12824 -50901 -40051 -42065 -49934 32660 47574 -3422 -15159
14480 -15159 28965 12117 -9111 -82922 -74892 -53113 -62546 -12374 64227 94832 55743 30665
14468 30665 35202 56924 37491 8203 -373 6566 36844 22779 45489 31047 113200 59828
14456 59828 -3434 -724 -35247 -61452 22306 73124 45262 -25367 -68543 18338 18178 25598
14444B5598L1347L0061M3636n4820m2945j4295M0140j1544k8688p2173l290L2842
14432b4131O005M1596M6967N2802m5969k8575L3034K1489n6857m2530j6108p4466
14420h6743J4780L973O1437J0089m320p9144l9642M5040P2354J7036k5880L8238
14408B7218N302p7538O308q9965m7684Q8253Q6219o2927m1166K1787K0654K3799
14396c9740l1293O7210J12355k2698l2285n988l664j142j6653k1167m1729L8685
14384A891r209l3493p2220L6351N9532k685M639J6866m7789J2908L8213j7394
14372a2390l4548k4909j8043Q870K6067R523M8041R194k2785j2936m9958m4358
14360a18232m5624j0942M844R0348K8191j69L7964R3336k6114j2217l7225r1111
$$ plain form
14444 25598 56945 87006 130642 75822 32877 18582 58722 47178 18490 -53683 -56973 -24131
14432 -24131 -18126 23470 70437 123239 77270 48695 81729 103218 46361 3831 -12277 -86743
14420 -86743 -71963 -67990 -6553 3536 -784 -79928 -119570 -74530 -2176 14860 -11020 27218
14408 27218 32520 -45018 -38710 -128675 -176359 -88106 -1887 -64814 -105980 -84193 -63539 -39740
14396 -39740 -71033 -3823 108532 85834 53549 47561 43897 42755 26102 4935 -36794 1891
14384 1891 -7318 -40811 -113031 -76680 -17148 -19833 -15194 1672 -46117 -33209 5004 -12390
14372 -12390 -46938 -71847 -89890 -81020 -54953 -45430 2611 11805 -10980 -23916 -73874 -118232
14360 -118232 -163856 -174798 -169954 -79606 -51415 -51584 -13620 79716 53602 41385 4160 -86951
14348h6951L8935m9774O2164N6740K3005M458l3954n1886q467R969J3333R641
14336a2787K0184K2562o4266o4969K1289L0504K4805j27757n1976J41577J33512
14325G2678Q090p8482k4876L8961M2451K6588M6529k280l1334m1772L850J3391
14313G3794n23m5359n8714m4372O3031N5009l3387J4665j7827O184K5627L9084
14301G7212L6326n8551m9227N1164K3957m4205j860M5344P4359K202L2605R2872
14289B82198M7613M4273J70183K01105K63894K70869L99359L66602K11016J23085
14279B380197j19246k66412k95494k93294k86378k28992j44732j33060j04519
14270E08070p3714M4677o210j26369m6491M7911N899m9374m3622L0616P3204m4747
$$ plain form
14348 -86951 -48016 -97790 -35626 21114 44119 48577 14623 -37263 -45730 -35761 -22428 -12787
14336 -12787 7397 29959 -34307 -99276 -77987 -47483 -22678 -150435 -202411 -60834 72678
14325 72678 80768 2286 -22590 16371 58822 85410 131939 129659 98325 56553 60403 73794
14313 73794 73271 27912 -30802 -75174 -12143 42866 9479 24144 6317 12501 38128 77212
14301 77212 113538 54987 5760 56924 80881 36676 34816 80160 154519 156721 189326 282198
14289 282198 329811 374084 544267 745372 1009266 1280135 1679494 2046096 2257112 2380197
14279 2380197 2260951 1994539 1699045 1405751 1119373 890381 745649 612589 508070
14270 508070 434356 479033 472823 346454 299963 347874 353773 304399 260777 291393 364597 319850
14258C19850j30j3301l165J8873l3050j1902k436p6340j50594p4053J6609R8352
14246H8713O4660j6829r9805k6443M676J2589L1936P898m9803N0896L3913N474
14234A07875K6939J6554K9325p2226n0509m2617Q707l9377j0416J6378n2130M6648
14222a4849n216L9322K893Q194j7268l0044k0957L7592K8799l9436j9773o7242
14210i7985O790J2920L0978M0156L2387Q3494m5679j19301m385Q3298j5815N4950
14198F1808J6964m4528n1074n2456l0038K4245m922L536r1336J4485M0447O2316
14186e0553K0120l9683J4631N0620r2092M8719m1861K3893Q5810J2574J6307l2133
14174A6352m1237K2315L3197M0262K5271M7J2152o6305m7544k7153K3856P6916
$$ plain form
14258 319850 319720 306419 303254 322127 289077 277175 274739 198399 47805 -26248 -9639 88713
14246 88713 153373 136544 36739 10296 14972 27561 59497 67395 17592 68488 102401 107875
14234 107875 134814 151368 180693 108467 57958 15341 24048 -15329 -25745 -9367 -61497 -14849
14222 -14849 -20065 19257 22150 30344 13076 -16968 -37925 -333 28466 -10970 -30743 -97985
14210 -97985 -91195 -78275 -47297 -7141 25246 108740 63061 -56240 -60625 22673 6858 61808
14198 61808 78772 34244 -16830 -69286 -99324 -75079 -80001 -76465 -167801 -153316 -112869 -50553
14186 -50553 -30433 -70116 -55485 -4865 -96957 -48238 -90099 -66206 19604 32178 48485 16352
14174 16352 -24885 -2570 30627 70889 96160 96207 108359 42054 -5490 -32643 -8787 68129
14162F8129L4604Q6046p9925m8452j1203K5013k7859L1790n972K0936j11359j9892
14150c8144K5772m8594l531O7813k6760n0028N4902j6619r96k2943p9556j522
14138a40206N7714L4982L1962l1699M6576J3177q252k1730Q7644o9331k9893j9768
14126d8824J3321K8297n5829n6103N8687N1512Q1618J5824l5539J0447L2349j6670
14114G9090O0562l2562l2985j338l2521P4578k7048m5J0502o9456l5386l7944
14102d4553l5804l9623n1405K3463N0504L2576K9414J5753k2972o641L2967N0118
14090C3797K8564K8907k9073m5190k3535m0529J0625j3984M7723L9986P38q668
14078B9361k0616J1938L456k7447k5687j4620j023J9879k4317N9119Q7238K1451
$$ plain form
14162 68129 102733 188779 108854 60402 49199 74212 46353 78143 72171 93107 -18252 -38144
14150 -38144 -12372 -60966 -64497 3316 -23444 -73472 -18570 -35189 -36185 -59128 -138684 -140206
14138 -140206 -82492 -47510 -15548 -47247 -671 12506 4254 -17476 70168 837 -29056 -48824
14126 -48824 -35503 -7206 -63035 -119138 -60451 -8939 72679 88503 52964 63411 95760 79090
14114 79090 139652 107090 74105 72767 40246 114824 87776 87731 98233 28777 -6609 -44553
14102 -44553 -80357 -119980 -171385 -147922 -97418 -64842 -35428 -19675 -42647 -49288 -16321 33797
14090 33797 62361 91268 62195 17005 -6530 -47059 -36434 -50418 -2695 37291 38029 29361
14078 29361 8745 20683 24139 -3308 -28995 -43615 -44638 -24759 -49076 10043 97281 118732
14066A18732k4036n4088n0771L76O5018N5725N9165j683o4672L8079N6852l955
14054A94742L4483K4154k0998J7452M610q86r5640m1922P0957k3776n1103N955
14042A18028p396j2322k3191J893o3778k0162O120K3947J10178L7661m3415l185
14030A24378o3311l2499m0367q1332m2087N7587O2581M9512J174N6712k0252j8122
14018E3974m5640K6079K9916K7518Q311k506p2663l3594k0148R827K4282j0417
14006e061J0189j3065J8311J53205R4046P776J5912l4518o1682Q612k4129k6472
13994A43124j5903K5771J9424m873l3986K2473K1331K5764n8514n8856l8979k5278
13982B1498Q4872l0860j49472l5434m6797p974Q7948m1766q5656K5045J5670j9189
$$ plain form
14066 118732 94696 40608 -10163 -9787 55231 110956 170121 168438 103766 141845 198697 194742
14054 194742 229225 253379 232381 249833 254443 253557 157917 115995 186952 163176 112073 118028
14042 118028 110632 98310 75119 77012 13234 -6928 -808 23139 133317 170978 127563 124378
14030 124378 61067 28568 -11799 -93131 -135218 -77631 -15050 34462 35636 92348 72096 53974
14018 53974 8334 34413 64329 91847 100158 97652 24989 -8605 -28753 -18926 5356 -5061
14006 -5061 5128 -7937 10374 163579 257625 265401 281313 246795 185113 193725 169596 143124
13994 143124 127221 152992 172416 167543 133557 156030 177361 203125 144611 85755 46776 21498
13982 21498 106370 75510 -73962 -109396 -156193 -164167 -76219 -117985 -203641 -178596 -162926 -182115
13970a82115J3876k1096O2312K6511m8919J7749O4686L7763n7700k4478k7480
13959a38891M3090J06326O7139j8901J0109p275J520K6827O8511q894j3446P2394
13947B08509J03512R775j3426m1153p6102j7755n6266n5Q2931L6024m1266k3775
13935A70953l5726k5716Q2482J10148J0774M6020K7712J01953L8896j00814o0204
13924C66478K6460K3185O984m917N22r227M798N5403j2589o2880r435K1807r363
13911C97226k9543K0983O577l3985l3742l355k3781R4009J35471k6327m5516O7367
13899E25384j0436J5082J9734k1997L9515l2486n4128l9841m415J9054r676J4121
13887D59911p5033o8899j2760M5927k1889J0524O6744J2661o680J5493j9043j5265
$$ plain form
13970 -182115 -168239 -189335 -127023 -100512 -149431 -131682 -66996 -29233 -86933 -111411 -138891
13959 -138891 -95801 10525 77664 58763 68872 61597 63117 89944 158455 149561 136115 208509
13947 208509 312021 321796 308370 267217 191115 173360 117094 117039 199970 235994 194728 170953
13935 170953 135227 109511 191993 302141 312915 358935 386647 488600 527496 426682 366478
13924 366478 392938 416123 423107 418190 418712 409485 414283 469686 457097 394217 384782 406589 397226
13911 397226 367683 388666 395243 361258 327516 324161 300380 394389 529860 503533 458017 525384
13899 525384 514948 530030 549764 527767 567282 534796 480668 440827 436412 455466 445790 459911
13887 459911 384878 315979 303219 349146 327257 337781 404525 417186 410506 425999 406956 391691
13875C91691k9471l5048l7056p368M0989M7503M3369Q4444M3180R7230o466K0258
13863F53255l9614l772n0074M4783m995J4941J16522J19654P2937O4896J14397
13852A102930Q0572Q1725J37092J73361J54814L07814N14955O84981P10865P05618
13842D654727L70448R6191o6281l64344n58018n32451l48443k09053j30742j43877
13832B768157m7508M0963R1017O1604J22581K56102M42141N16979O94505R69166
13822E915707J138312J383351J581172J782079J778563J779374J701965J725425
13814A8785948J866870K275012K920944M139201O168550R556638J5222246K4677761
13806H5613170L7717564N2396582O5918121P3015165O7256316M7601813J7830754
$$ plain form
13875 391691 362220 327172 290116 282748 323737 371240 414609 499053 542233 639463 632997 653255
13863 653255 613641 609869 559795 604578 599583 614524 731046 850700 923637 988533 1102930
13852 1102930 1183502 1265227 1402319 1575680 1730494 2038308 2553263 3238244 3949109 4654727
13842 4654727 5025175 5121366 5055085 4690741 4132723 3600272 3251829 3042776 2912034 2768157
13832 2768157 2720649 2761612 2852629 2914233 3036814 3292916 3735057 4252036 4946541 5915707
13822 5915707 7054019 8437370 10018542 11800621 13579184 15358558 17060523 18785948
13814 18785948 20652818 22927830 25848774 29987975 36156525 45713163 60935409 85613170
13806 85613170 123330734 175727316 241645437 314660602 381916918 429518731 447349485
13799D47349485j6341702m6026368o3099702o7140011n7867053m4297065l1131030
13792A21446554k0296082j3459886r522212p187771n644408m522644l739483l296141
13784E3777927k916818k756003k652337k599650k383183k081212j827908j551441
13776C5009375j253186j250812j260245j393641j413918j451197j405138j250860
13768B4330378j148128r05937q15247p85814p20147o46727o35270o07320n92462
13759A7473326n00058m28729n21694m95845m10981l70635m70919m77560l94555
13750A3402350l11742l35588l02608k46163k93786l75859l08060k32723k71709
13741A0724112l43496l45880l52813k80339k96730l30641l00084k83383j58342
$$ plain form
13799 447349485 431007783 384981415 321881713 254741702 196874649 152577584 121446554
13792 121446554 101150472 87690586 78168374 70980603 65336195 60813551 57074068 53777927
13784 53777927 50861109 48105106 45452769 42853119 40469936 38388724 36560816 35009375
13776 35009375 33756189 32505377 31245132 29851491 28437573 26986376 25581238 24330378
13768 24330378 23182250 22276313 21461066 20675252 19955105 19308378 18673108 18065788 17473326
13759 17473326 16973268 16544539 16022845 15527000 15116019 14745384 14274465 13796905 13402350
13750 13402350 13090608 12755020 12452412 12206249 11912463 11536604 11228544 10995821 10724112
13741 10724112 10380616 10034736 9681923 9401584 9104854 8774213 8474129 8190746 8032404
13732H032404j03600j26986j30261k09721k46293k63291j99104j90419j70531
13723F392198j41842k15351k43848k06057n4827j25205j86336j82964j84068j63064
13713D688636j19716j04314r3254j45477j49472j62259p1601j01680j52232j03898
13703C484733l1986j5978j1640r6690q8165j21479k525m2546p4305j69465j83311
13692B646643j04894j19753k9659K6868l3979n0449l2397j3680j17841n3844J477
13681B118492j6152q7063r8528k3372J56322L0525m1420o8775k6720k4277m2119
13670A876913q3730q3032M1961M5994j4957j4159p1555j04326l7619l9982k3181
13659A492327m7697o1665q7831o1085o2946J2797k2661j18786p4831P595L525
$$ plain form
13732 8032404 7928804 7801818 7671557 7461836 7215543 6952252 6753148 6562729 6392198
13723 6392198 6250356 6035005 5791157 5585100 5530273 5405068 5218732 5035768 4851700 4688636
13713 4688636 4568920 4464606 4371352 4225875 4076403 3914144 3842543 3740863 3588631 3484733
13703 3484733 3452747 3436769 3425129 3328439 3240274 3118795 3116270 3073724 2999419 2829954 2646643
13692 2646643 2541749 2421996 2392337 2419205 2385226 2334777 2302380 2288700 2170859 2117015 2118492
13681 2118492 2102340 2015277 1916749 1893377 2049699 2080224 2038804 1970029 1943309 1919032 1876913
13670 1876913 1793183 1710151 1752112 1798106 1783149 1768990 1697435 1593109 1555490 1515508 1492327
13659 1492327 1444630 1382965 1295134 1234049 1171103 1183900 1161239 1042453 967622 975217 978742
13648I78742N151O2939m2987p5054n8935k7953m5284k3687l9161j8274p79k5389
13636F89329j03844m8043K5289Q5746O7470J7900l458j485n5568o8681j6008O175
13624E94822L2745K8540L2999k8942L2231p650r2718r7377r1808l7263L9095J57
13612D04831K0179M0638k460k7400p7538L1396M5544K1053q3009j2325K5701L5629
13600D22239m2775j8440L4717l4967j0202K6747J6162M4679J515m8892j6109L2402
13588D07076j2333j9097J4458m3478l1439j0208R685M5294O2993N7496n1387l3235
13576C95825o460q7630l5489J1246p507l5249J0545L5544P3067J20866N5900l3715
13564D96943n6656k5494k1550m6540n5573M6415m3222n9376P1585o654m0278j00543
$$ plain form
13648 978742 983893 1046832 1003845 928791 869856 841903 796619 772932 733771 715497 714718 689329
13636 689329 585485 537442 562731 648477 715947 733847 730389 728904 673336 604655 588647 594822
13624 594822 627567 656107 689106 660164 692395 684745 592027 494650 402842 365579 404674 404831
13612 404831 425010 465648 463188 435788 358250 389646 435190 456243 373234 360909 386610 422239
13600 422239 379464 361024 395741 360774 350572 377319 393481 438160 439675 390783 374674 407076
13588 407076 394743 375646 390104 346626 315187 304979 314664 359958 422951 480447 429060 395825
13576 395825 389365 301735 266246 277492 269985 234736 245281 280825 353892 474758 530658 496943
13564 496943 440287 414793 393243 346703 291130 337545 294323 234947 306532 299878 259600 159057
13552A59057k9777P4931L0406O5238P9296j5907J0588j1157K0660k7096j707l4291
13540C20241k6141k9649o7591n2087P4932N5578j5447Q298j7047M143K6946j7884
13528B64292j0760K5962l5031m1460M7188N5340o0344p0883j4251k1673M1214
13517A79594M9721k0296m0785J1354R6336J5647J6109n5731k760m0290K0091o6280
13505A62710m1404K242J3650L2721N1461r199n7332l9798N1448j9846J5204p548
13493A54309k6488m6226N7714Q6335L7271n0119n3467o0795L9240l2110n9435
13482D6229j028l3795M2745j260M126O6746N3309N371q5916m3069p435J5025l8070
13469B2978m1013J6208P505K7254J3748K4207M0595J364k1821O5919L9850o982
$$ plain form
13552 159057 129280 204211 234617 299855 379151 363244 373832 362675 383335 356239 354532 320241
13540 320241 294100 264451 196860 144773 219705 275283 259836 268134 251087 255230 282176 264292
13528 264292 253532 279494 244463 203003 250191 305531 245187 174304 160053 138380 179594
13517 179594 229315 209019 168234 179588 275924 291571 307680 251949 249189 208899 228990 162710
13505 162710 121306 123548 137198 169919 221380 212181 154849 115051 166499 146653 161857 154309
13493 154309 127821 81595 139309 225644 262915 212796 159329 98534 137774 105664 46229
13482 46229 45201 11406 54151 52891 57017 123763 177072 182443 96527 53458 46023 61048 22978
13469 22978 -18035 -1827 5678 32932 46680 70887 111482 112846 91025 156944 196794 189812
13457A89812k2524n6113l8937P2480M7974l3626l207K6494r5616m9896Q092o3700
13445a8767n335n3164r166Q7369J48774R5622m3989n0926q4209j00011n5419L2133
13433e7088N8356J23145K8022O3854o7508l6432N9091J3719o844o9820q1278l7755
13421a0538m417M4478N8597N091r293K3215l1033J6388J6282n6399j7835K6879
13409F1415M0841l2174m93m1202j372M792J972J3842J8905n7100N3146N1842j5333
13396I9081o8179k1722L1449J8032L7216l9377J4890J1219r775j8166j2356l5379
13384F933l0682L2887j3810K4480j8927j779k2474k2440J13022P0333r0721l8920
13372G902k8079P2454O1827k5934Q105M1610m0542p6070p2923q114P1895O8009
$$ plain form
13457 189812 167288 111175 72238 144718 192692 159066 155859 182353 86737 36841 44933 -18767
13445 -18767 -24102 -77266 -86432 937 149711 245333 201344 150418 66209 -33802 -89221 -57088
13433 -57088 1268 124413 152435 216289 148781 112349 171440 185159 178315 108495 27217 -10538
13421 -10538 -14955 29523 88120 93211 83918 107133 76100 92488 108770 52371 34536 61415
13409 61415 102256 70082 69589 28387 27015 31807 33779 47621 66526 9426 62572 114414 99081
13396 99081 30902 9180 40629 58661 95877 56500 71390 82609 72834 54668 42312 6933
13384 6933 -23749 9138 -4672 19808 881 -898 -23372 -45812 67210 137543 46822 7902
13372 7902 -20177 52277 114104 88170 96275 137885 97343 21273 -51650 -59764 12131 80140
13360H0140M9362k0912k8104k1202j8388K5008K2772L736j8975q9553Q139N0245
13348D2268n877L6598O2507l9655R092l3451l8848m7564O8091J07276n1880l3106
13336G5451O5513M4564M8527J01944j0728o9655q7185k2837M6110O0469r842N4410
13324B96741J7163l450R4946Q0740N3596J53370K60265L78533L83170L01720L22731
13313B339525M8616o2963j50489k91801l65521m35711k75231j23000N434q77J9048
13302G07030o0617n5423p0339n7766k7649J3122M2136n621j24820p392M4261l1542
13290C65380o5471r7186p0281P3808N9760L6181j0213l0530q4265l7586l4611
13279A04986j9100N9094M4097l0864m6382k6081k492j0570j9267N361L8748L6189
$$ plain form
13360 80140 129502 108590 80486 59284 40896 65904 88676 92412 73437 -16116 -7977 42268
13348 42268 36391 72989 135496 95841 104933 71482 32634 -14930 53161 160437 108557 75451
13336 75451 140964 185528 234055 335999 325271 255616 168431 145594 191704 252173 242331 296741
13324 296741 313904 310454 405400 486140 539736 693106 953371 1331904 1715074 2016794 2339525
13313 2339525 2388141 2325178 2174689 1882888 1517367 1081656 806425 683425 688859 687982 707030
13302 707030 646413 590990 520651 462885 435236 448358 490494 484873 360053 352661 396922 365380
13290 365380 299909 202723 132442 206250 266010 302191 291978 261448 177183 139597 104986
13279 104986 85886 144980 189077 158213 111831 85750 83258 72688 53421 58782 97530 133719
13267A33719M8400L1880j7422m3467L4235k2989k3396L3744J0914l1854L5734
13256A89498l9733r1779l283O2223R6337k4206m4482k354n00n9651n9335j2578
13244A0157l5490J0876P7448K7903j7651J5166k023J0506J01720p516k9264k781
13232A59051j544m7859J435o9197k1069k4580j0822K0993P981j948K8961L5241
13220G6643N4836j7911m7878M6581m0024j01247p776O4846l7669L2774j941L2154
13208E3388O8702O9777j6837J3376m513k0224p7689P600J9785l369j05508K8161
13196C2649N074k4614m8136j0189N6727L7571m1353p6343n9752L2757K4976O0692
13184i941l4568J8272N6525M1357L0038m8340k5568j7492k3032K5209L6801l5180
$$ plain form
13267 133719 182119 213999 196577 153110 187345 164356 140960 174704 185618 153764 189498
13256 189498 149765 57986 54703 116926 213263 189057 144575 142221 141721 82070 22735 10157
13244 10157 -25333 -14457 62991 90894 73243 88409 86386 96892 198612 191096 161832 159051
13232 159051 157507 109648 111083 41886 20817 -3763 -14585 6408 14389 12441 41402 76643
13220 76643 131479 113568 65690 112271 72247 -29000 -36776 28070 -9599 23175 21234 53388
13208 53388 122090 191867 175030 188406 183893 163669 85980 93580 113365 109996 4488 32649
13196 32649 37723 13109 -35027 -45216 11511 49082 7729 -68614 -128366 -95609 -70633 -9941
13184 -9941 -44509 -26237 30288 71645 101683 53343 27775 10283 -12749 12460 49261 14081
13172A4081k4472K3921M9353R6593L982r2691l2702J4904K313L0976j0825l3201
13160D2232L2688J546j319L0534m58N023K1616M5453m9981k7205L00j6670l6264
13147D7495K999j3652j215q1116L4023p92L696n4687k5468O1428L7216J2385m6396
13134b4084K848J989n3546N7097J07623q681j9125n9302n7516M5317L8912M8616
13122H0148k1119J8393j3398p00r3227L4435N7557k776K8207J5027p4157n6217
13110b7827q6815L9928K4398M2476K6770o2626J0343N4891j1746k1274m9261p817
13098f8560K4071K9019k832n063j3203L9460O505J5508j8190J1912O0393J1100
13086I0120j0893K6594P9417m0257j08196m1431n6157P60P4436N5589q2307N650
$$ plain form
13172 14081 -10391 13530 62883 159476 163458 70767 38065 52969 55282 86258 75433 42232
13160 42232 74920 76466 75147 105681 105223 110246 131862 177315 127334 100129 100429 83759 47495
13147 47495 50494 36842 35627 -45489 -11466 -12258 -8562 -63249 -88717 -27289 9927 22312 -24084
13134 -24084 -21236 -19247 -72793 -15696 91927 83246 64121 4819 -52697 -7380 31532 80148
13122 80148 59029 77422 64024 63324 -29903 4532 62089 59313 87520 102547 28390 -27827
13110 -27827 -114642 -74714 -50316 -7840 18930 -43696 -33353 21538 9792 -11482 -60743 -68560
13098 -68560 -44489 -15470 -18302 -23365 -36568 2892 9397 24905 6715 18627 79020 90120
13086 90120 79227 105821 185238 144981 36785 -4646 -60803 -60043 14393 69982 -12325 -6675
13074f675L6172L0651L2587k5259m6363n6392K5327Q2191N9161k5495l2219J2416
13062H6102j0271M6175k6009q4148k1878J9422K3486j1294K5807k3889L445M6270
13050G3218K1397j628n377M0686n1066o0414k7651m3827p250K3780J3594m0041
13038f4579P0684j660m2624j5474j1443q490N854J6401O3207m3428k6021P931
13026d9642N4833O7682k3232j4031K0243k5562R53J5595K7640J2179M2494n9323
13014F9829o7689l2318R207K9110j7791M6150L388n0659J916R3456M7024q9066
13002D2557n9087J1556N494L3915P3428Q0635l0303p5927o315J0486k4850J5905
12990G7494K2475M4621k0959p2997m9783k6190n2424J3544O1648k874J100N720
$$ plain form
13074 -6675 29497 60148 92735 67476 21113 -35279 -9952 72239 131400 105905 73686 86102
13062 86102 75831 122006 95997 11849 -10029 9393 32879 21585 47392 23503 26948 73218
13050 73218 94615 92987 87610 128296 77230 16816 -10835 -54662 -61912 -38132 -24538 -64579
13038 -64579 6105 4445 -38179 -53653 -65096 -73586 -67732 -51331 11876 -31552 -57573 -49642
13026 -49642 5191 72873 49641 35610 55853 30291 31244 46839 74479 86658 129152 69829
13014 69829 2140 -30178 -20971 8139 -9652 36498 39886 -10773 -8857 84599 131623 42557
13002 42557 -16530 -4974 520 34435 107863 188498 158195 82268 75953 86439 61589 77494
12990 77494 99969 144590 123631 50634 851 -25339 -77763 -64219 -2571 -5445 -4345 1375
12978A375j7822O2857N6286p9899m6845J202k0084J6404J3404n6932K0517L0391
12966a9146L3546J3367L4991p3757o2777l6245N6435M1240j7244j7697O2220K2576
12954C7509k3597K095k7462q3397O7834N7356L0843k5661j8269L4353k0026k9585
12942A993j4967K3277L3044N50r1130q976O7561j4046l6719K1381R213P104M8623
12929D6908m6891j4829J5069M6914J0977K238K1156O4941l0867J5412j149m9974
12917G9905m0684J9032k4481O7076q015q4449n8657K6097N3253n513j9173O1732
12905F6123N7114K2918j0149o1939n5731k5525J2828N9895N567m351L2798l5759
12893F3789M5820l0466m0503J8138j3104J1047p590j5344N38k2338K7590Q7495
$$ plain form
12978 1375 -16447 46410 102696 22797 -24048 -22846 -42930 -26526 -13122 -70054 -49537 -19146
12966 -19146 14400 27767 62758 -10999 -73776 -110021 -53586 -12346 -29590 -47287 14933 37509
12954 37509 13912 16007 -11455 -94852 -27018 30338 61181 35520 17251 51604 31578 1993
12942 1993 -12974 10303 43347 43897 -47233 -56209 11352 -2694 -39413 -18032 -8819 -1715 46908
12929 46908 17 -14812 257 47171 58148 60386 81542 146483 115616 131028 129879 79905
12917 79905 39221 58253 33772 100848 92833 8384 -50273 -24176 29077 23564 4391 66123
12905 66123 123237 146155 136006 74067 18336 -7189 5639 65534 71101 66750 99548 63789
12893 63789 109609 79143 38640 56778 43674 54721 47131 31787 32325 9987 37577 125072
12881A25072P067k0268j7351R090j9693q3063m5182K4248R1629O5347J4512K502
12869A53910m577m436m0701o8634j4400j406N3809q7058j5619J7843K2714K1708
12857C3153L2310N9369j5787o6301m7044m5240m6246n227k0687L6752M3617K5834
12845a5497M9575p375m8368k8221j7462K8266J8504K9020N0200m2452j06005m8150
12833a37965M6670K900L1839J18215K625o1900N9421N0881Q923K2537K52m3852
12821A00546j01535n4052K7441J02895Q4473m9965r9311j3401k0907l5300n347
12810f4463L5669K5254m0700L7467J4395L3524O248l914m0480J8752j8645J963
12798E070l623k3434L2352N3049k7687m0640L5321j3319N6207O3761M4926q9166
$$ plain form
12881 125072 132139 111871 94520 103610 83917 854 -44328 -20080 71549 136896 151408 153910
12869 153910 149333 144897 104196 35562 21162 19756 73565 -13493 -29112 -11269 11445 33153
12857 33153 65463 124832 109045 42744 -4300 -49540 -95786 -101013 -121700 -84948 -41331 -15497
12845 -15497 34078 26703 -21665 -49886 -67348 -39082 -20578 8442 58642 16190 -89815 -137965
12833 -137965 -91295 -88395 -56556 61659 64284 2384 61805 112686 121609 144146 144398 100546
12821 100546 -989 -55041 -27600 75295 159768 109803 10492 -2909 -23816 -59116 -64463
12810 -64463 -28794 -3540 -44240 -6773 7622 41146 47394 43480 3000 21752 3107 5070
12798 5070 1447 -21987 10365 63414 35727 -4913 30408 17089 73296 137057 181983 92817
12786I2817p0661J00419N3185r1032o3562N2001n0768m8833P8239J17118L3533
12775B02456m7488j17186q3183r615Q5224l1026J5746k1741o0309K0895J4692
12764c1535L7726O1447J3705j7471p4967q984O0813k5705R67L22N9616J7014m135
12751H8813k4412k9973m1056k774k4108n1629k5729j2915K6391P4164R625l4451
12739d8054K948J2155J6775L0515L6061K3180o695M125r4392l6275n5087L7880
12727g6864M2644K2652m9226N0156O4073M9250J30606J4268q9692q3710n8273
12716A5884K3674M5136j6758p0030k6159L0773l2801o8038L9013K0766j6805p3604
12704a28949M2735P1220N5007N1279k018o5694m6097j02582q296O7005M9049K2910
$$ plain form
12786 92817 22156 122575 175760 84728 21166 73167 22399 -26434 51805 168923 202456
12775 202456 154968 37782 -45401 -55016 30208 -818 14928 -6813 -67122 -46227 -31535
12764 -31535 6191 67638 81343 63872 -11095 -20079 40734 15029 15996 16318 75934 92948 88813
12751 88813 64401 34428 -6628 -9402 -33510 -85139 -110868 -123783 -97392 -23228 -13603 -48054
12739 -48054 -45106 -32951 -16176 14339 50400 73580 66885 71010 -23382 -59657 -114744 -76864
12727 -76864 -34220 -11568 -60794 -10638 53435 102685 233291 247559 157867 74157 15884
12716 15884 39558 84694 67936 -2094 -28253 2520 -30281 -98319 -59306 -38540 -55345 -128949
12704 -128949 -86214 -14994 40013 91292 89274 23580 -22517 -125099 -133395 -66390 -17341 5569
12692E569p436P8965r148o1148M8935J5005K2275k7748p0710L0934M1017L5654
12680A02164P1110L2715o4879n7655k582l4348j5957o6172N804N8528j1041q1332
12668f3645o650R304N8550P6680L2005n6509l7503J1957k6713k495J4697q773
12656I05Q288k8262M091J769q0528N2337J1820n5666L71q602k9497j8458J5956
12643a25476L9492J7200M3311J9970p862J5078l4690K5317M6751j6125k1997Q1215
12631H2184P4644p826K9004L372m6855p7140j1947J8741L470k4816N652l3659
12619A4824n6020L021Q1668O7345L5010l912m0507k1313l4304L908K1261m2308
12607B8673K8541M8951k7907n6879Q547J0467n9093k1095m0077M187N0979j8213
$$ plain form
12692 5569 -1867 77098 67950 6802 55737 70742 93017 65269 -5441 25493 66510 102164
12680 102164 173274 205989 141110 83455 80873 46525 30568 -35604 -29800 28728 17687 -63645
12668 -63645 -70295 -60991 -2441 74239 106244 49735 12232 24189 -2524 -5019 9678 905
12656 905 9193 -19069 -14978 -13209 -93737 -41400 -29580 -85246 -84875 -93477 -122974 -141432 -125476
12643 -125476 -85984 -68784 -25473 -5503 -13365 1713 -32977 -7660 39091 22966 969 82184
12631 82184 156828 149002 178006 181378 134523 57383 45436 64177 67647 42831 48483 14824
12619 14824 -41196 -38175 43493 110838 145848 141936 101429 80116 45812 49720 70981 28673
12607 28673 57214 106165 78258 21379 29926 40393 -18700 -39795 -79872 -75685 -24706 -42919
12595d2919l4230J4091q759j1825N2132N4623j3107J9105K0595Q793m68J1944
12583F9975P046l9219j2099n523j3532Q118N2089K2243k3494l1798J8584n137
12571D7253o8989l6507m562k2780l6355J2673O8236P7333L8677P32j4016l5373
12559B6322N0605O589l2741n0597K4308l9089k3361K3298q37q280O627l0304p8823
12546a26283j2333Q3092N3156m8844j6003L0178q4253l4572l6266O6469P4359
12535e1300M6861l3120L1126K4541l5465k4684j9105j6850K6052J5689n8759J6979
12523g8035L6132j0745j1649K0818J7553M5797j388j2075P2307n4117j01575m5727
12511a22704L072K2631O8605P4963L1417o9959k0867P2062n774l7963k3346L8085
$$ plain form
12595 -42919 -77149 -63058 -71817 -83642 -31510 23113 10006 29111 49706 58499 58031 69975
12583 69975 77021 37802 25703 20180 6648 14766 66855 89098 65604 33806 52390 47253
12571 47253 -21736 -58243 -62805 -85585 -121940 -109267 -41031 36302 74979 75711 61695 26322
12559 26322 76927 83516 50775 178 24486 -14603 -37964 -14666 -15503 -23783 -17156 -47460 -126283
12546 -126283 -138616 -55524 -2368 -51212 -67215 -37037 -121290 -155862 -192128 -125659 -51300
12535 -51300 -4439 -37559 -6433 18108 -17357 -42041 -61146 -77996 -51944 -36255 -95014 -78035
12523 -78035 -41903 -52648 -64297 -43479 -25926 19871 18483 6408 78715 24598 -76977 -122704
12511 -122704 -119632 -97001 -28396 46567 77984 8025 -12842 59220 53446 15483 -7863 30222
12499C0222j5973j4624L6895O207m0367k6311L1424n9514o289N4180P4920J4663
12487H5433o1948q4884j7470J9596Q0016K6302m4390j3912j4647m8368k3261o929
12475a04462l8588n311P2704L5392o0103K1006K6424J4632P2817J2547l3129k645
12463A1284J0345n766k8307l2559j7519J4455L3333O1181L7283L9308o339m5762
12451G0937l1619L05l587L6008M0183l8660m1741j843M7177J7231l6538K592J5433
12438G5878M4448k7244j5805p3359k2373J5916n7210k4325L5264N3032O2521N9502
12426A26245j0361n6632m2981M864P1630M593k1522q6155k3847P0685k3807k2787
12414a0075k6200q668N3005N1470O5M724j9442J9128l5234k6468L870J9532k2523
$$ plain form
12499 30222 14249 -375 36520 42727 2360 -23951 7473 -52041 -58330 -4150 70770 85433
12487 85433 23485 -61399 -78869 -59273 20743 47045 2655 -11257 -25904 -74272 -97533 -104462
12475 -104462 -143050 -148361 -75657 -40265 -100368 -79362 -52938 -38306 34511 47058 13929 11284
12463 11284 21629 15863 -12444 -45003 -62522 -48067 -14734 46447 83730 123038 116699 70937
12451 70937 39318 39623 36036 72044 112227 73567 31826 29983 77160 94391 57853 60445 75878
12438 75878 120326 93082 77277 3918 -18455 -2539 -59749 -84074 -48810 4222 66743 126245
12426 126245 115884 59252 16271 21135 92765 97358 75836 -10319 -34166 36519 12712 -10075
12414 -10075 -36275 -44943 8062 59532 59597 64321 44879 64007 28773 2305 6175 25707 3184
12401C184K8183J9425p2228O385M061O6966L2621k1342k503m7761m2680j980j8623
12388d6292J6056m056P5021L2565l6240l5895P159j5014m9487l2494o587M7090
12376d8174l0368o3536p593K5187L810M951M7402O1787J0856K8296j3973q2908
12364f4263l2115M1614q252o700j7291k2805j676K2327M7363M0322l0444K9760
12352b160n190J6516K1564l1902k4674k9962J574r147N9007N0658j09507k258
12340f5481Q7260R3046m1835o1619j9899n710O2875M5264p4726j11434q45Q5495
12328g609j2764K5534n773K9753J6918l9026m1107k9391R651n175J3517p024m0196
12315i2692Q5084L8505j528k2453M8798j283K0081N7816J68p6301p7132n5059
$$ plain form
12401 3184 31367 50792 -21436 -15051 -10990 55976 88597 67255 64752 16991 -25689 -27669 -46292
12388 -46292 -30236 -34292 40729 73294 37054 1159 8318 -6696 -56183 -88677 -95264 -48174
12376 -48174 -78542 -142078 -149671 -124484 -120674 -115723 -68321 -6534 4322 32618 18645 -64263
12364 -64263 -96378 -54764 -63016 -69716 -87007 -109812 -111488 -89161 -41798 -1476 -31920 -2160
12352 -2160 -7350 9166 30730 -1172 -25846 -55808 -54234 -63381 -4374 46284 -63223 -65481
12340 -65481 21779 114825 72990 11371 -8528 -14238 48637 93901 19175 -92259 -93104 -7609
12328 -7609 -20373 5161 -612 29141 46059 7033 -34074 -63465 -53814 -58989 -45472 -52496 -92692
12315 -92692 -7608 30897 29369 6916 55714 54431 74512 132328 132496 56195 -20937 -75996
12303g5996J6132L7791P3142Q096p7740l4659K1599K6522L5397J2633J802J3667
12291E8386n2990j615L648n745J1908K8122m635l3262J3402j3321j1936j6342
12279b4380J4181J2443o663n5368L7327L6328O749J9980O7288p868J4559k9248
12267H5328p7909k0891j0779l1105O4805j205m1181k4338j2177k5384N9299M8245
12255A2708m4009o3337m2396M4057P0297O945J2635K72K2392n8717O459k0707
12243e3401n455J7265J4737P1860K6850L1373q3771q2292K0283K150k8529n4187
12231a23117k3122r760L9818K8856M3111L8948q2751n9469J4807N4760L0852M1646
12219e421j6889k9748q643M0719J5739j9679l7848Q3520L0367p9870l4336L12
$$ plain form
12303 -75996 -59864 -22073 51069 59165 -18575 -53234 -31635 -5113 30284 42917 44719 58386
12291 58386 5396 3781 7429 1684 13592 41714 37079 3817 17219 3898 -8038 -24380
12279 -24380 -10199 2244 -4419 -59787 -22460 13868 20617 40597 107885 100017 114576 85328
12267 85328 7419 -13472 -24251 -55356 9449 8244 -32937 -57275 -69452 -94836 -35537 12708
12255 12708 -31301 -94638 -137034 -92977 -22680 -15735 -3100 -2828 19564 -39153 -32694 -53401
12243 -53401 -58856 -41591 -26854 45006 71856 103229 19458 -62834 -42551 -40401 -68930 -123117
12231 -123117 -146239 -155999 -116181 -87325 -44214 -5266 -88017 -147486 -132679 -77919 -47067 -5421
12219 -5421 -22310 -52058 -60701 -19982 -4243 -23922 -61770 21750 52117 -27753 -62089 -61777
12207f1777L0242M2730M4104r126l1411K6809N505P594N450n998m9541j15638
12195a11057N2644K8006o464M1505P7776R993j8079J7752K5776k9300m2118m1158
12183E276k1221j45M601O495o072L536J06600M5339r074r8332k7274m8696m9604
12170h8571Q041J8089L4157L421n332L337o387K5662p6684m0661O042M8726k1230
12157i1390L5786P1498r024o525K3381j9703o0487m5913j1732K8782M6768j3650
12145e2209K6518l9100J515J7092n0713k2262Q7783j764p3676n2787J8587L8376
12133a02640N1995m8542o5654N0131J17782R123k6314J3696n9942m1923J0770
12122i1518L0112O5981J1318l103L3793k2585J005l3894L6437l2961j931q168
$$ plain form
12207 -61777 -31535 11195 55299 46173 14762 41571 47076 54670 60120 54122 4581 -111057
12195 -111057 -58413 -30407 -36871 4634 82410 92403 74324 92076 117852 88552 46434 5276
12183 5276 -15945 -16090 -11489 -4994 -11066 -7530 99070 144409 135335 37003 9729 -38967 -88571
12170 -88571 -80530 -62441 -28284 -24863 -30195 -26858 -33245 -7583 -84267 -124928 -118886 -70160 -91390
12157 -91390 -55604 15894 6870 345 23726 4023 -56464 -102377 -114109 -85327 -38559 -52209
12145 -52209 -25691 -64791 -63276 -46184 -96897 -119159 -31376 -33140 -106816 -159603 -141016 -102640
12133 -102640 -50645 -99187 -164841 -114710 3072 12195 -14119 -423 -60365 -102288 -91518
12122 -91518 -61406 4575 15893 12790 46583 23998 25003 -8891 27546 -5415 -7346 -15514
12110a5514k9362J4788j3061k8487K8608Q6074k8541M0521o8255n3481k4896O6317
12098b5289P3957l1168l7171J3437k9499k207k268L0506P939M8790K4939p2919
12086i53j671K195K6451L6841m493o5573n1111p2995O2618K1153k014O2783k7950
12073a4719m9381M477o408m6028J4990O7557O166k9525k7294M2616P3081j9828
12061A5704K565m4066o5884k135J8692l4696M228J8152J6119O1267K7225K6888
12049D4059j6516Q4444j4017p7181m8203K3056J7160r7624j8163K6892O2864O2154
12037D8925K7930P1386k8082o9108o8910n2807K1374J8657L628l3594J4564L5623
12025a0414K3862L1392k602J3546R7496M3850m346j27273p4771K7712o797J1507
$$ plain form
12110 -15514 -44876 -30088 -43149 -71636 -43028 43046 14505 55026 -13229 -66710 -91606 -25289
12098 -25289 48668 17500 -19671 -6234 -35733 -37940 -40208 -9702 -1763 47027 71966 -953
12086 -953 -2624 -429 26022 62863 58370 -7203 -58314 -131309 -68691 -47538 -49552 13231 -14719
12073 -14719 -64100 -59623 -66031 -112059 -97069 -29512 -23346 -52871 -80165 -37549 35532 15704
12061 15704 18269 -25797 -91681 -93816 -75124 -109820 -105592 -87440 -71321 -10054 17171 44059
12049 44059 27543 111987 97970 20789 -27414 -4358 12802 -84822 -102985 -76093 -13229 48925
12037 48925 76855 148241 120159 51051 -17859 -70666 -49292 -30635 -27007 -60601 -46037 -10414
12025 -10414 13448 44840 42238 55784 153280 197130 192784 65511 -9260 18452 11655 23162
12013B3162J3652n4749J2659N4938J6522n622l4139p6279J073m3358j5800L2089
12001g5852K7427j7901l483K6366K175K3633M3146M972J3199k5826q8337m5953
11989a16434J304n794M245J9501O7800j0163j1761L6211O320n1673M765L876O2008
11976A0205j3693J0933n7435j4648k2638Q121N9317J5685k1721J2175M6523j36529
11964a03705m5105M8891L7865L5370O9631M5064m2492j06748k9478n5104n2726
11953a98537K5777J19744J31178L8895n84n9079j0754J1087m7428n8620K8688
11942a9633K0213P6412J2660q1188n3165p8690N694J16304L1446J8044K2000Q565
11930G8662p4734l5437k642M234K7329L4666j0388o0681o1084M4861k6742j8137
$$ plain form
12013 23162 36814 -17935 -5276 49662 66184 60562 26423 -49856 -48783 -92141 -107941 -75852
12001 -75852 -48425 -66326 -69809 -43443 -41268 -17635 25511 30483 43682 17856 -70481 -116434
11989 -116434 -115130 -120924 -116679 -97178 -29378 -39541 -51302 -15091 -8771 -60444 -55679 -51803 10205
11976 10205 -3488 7445 -49990 -64638 -87276 -79155 -19838 -4153 -25874 -13699 32824 -103705
11964 -103705 -148810 -99919 -62054 -26684 42947 88011 45519 -61229 -90707 -145811 -198537
11953 -198537 -172760 -53016 78162 117057 116473 57394 46640 57727 10299 -48321 -19633
11942 -19633 580 76992 89652 8464 -44701 -123391 -117697 -1393 30053 48097 70097 78662
11930 78662 3928 -31509 -34151 -29917 -2588 32078 21690 -38991 -100075 -55214 -81956 -100093
11918a00093M7659J6606M4488J8508L1258O283k6461L2496k4249K3258N7931q0108
11906D7576o6194M6892j1367L3991K3467J7809J4388P4808j4767p2991m011K6222
11894A15823M1575l3009k6135k0547j2402m9083L7751P973j25987q532M8j1520
11882h4045Q7123q654k5448r923N7442L7411M2636k2887n174l9360l1506m7469
11870d9854L328N1712L98j283R59O667l1593N510N0133l1512o5791O7279P6003
11857H1956k9153n8557L8522L4397o0837m3620J8407k1652q5457k5789J02379
11846d9404k601k7346M9378k9225j6385J8491K8473J3665m1717j5709J0025O6356
11834D001M2550M7531l2699o5930P3323j2192o1480n809K9207k0610m2572j9358
$$ plain form
11918 -100093 -52434 -35828 8660 27168 58426 64709 38248 70744 46495 69753 127684 47576
11906 47576 -18618 28274 16907 50898 74365 92174 106562 181370 166603 93612 89601 115823
11894 115823 157398 124389 98254 77707 65305 16222 53973 61946 -64041 -72573 -72525 -84045
11882 -84045 3078 -5576 -31024 -40947 16495 53906 96542 73655 68481 29121 -2385 -49854
11870 -49854 -46526 5186 5584 4301 5260 11927 -19666 -14156 35977 4465 -61326 5953 81956
11857 81956 52803 -5754 32768 67165 6328 -37292 -18885 -40537 -125994 -151783 -49404
11846 -49404 -52005 -79351 -29973 -59198 -75583 -57092 -28619 -14954 -56671 -72380 -62355 4001
11834 4001 46551 94082 61383 -4547 68776 56584 -4896 -10705 18502 -2108 -44680 -64038
11822f4038O388j1606j98N8519k6000R66l7762k7270J4212J0958L9758l3788j4044
11809h3905K6440Q9845L5342j08190r7856O82J00991N3167K2874m9800P61k0512
11797c0161p385N22l5590j8893L1645M6281P3019J966m6367n2795n2100J9J1880
11784g7959P840l85j0720N0619O7140R2513p5582j8090l2426k0548k4545J4701
11772b7442M8778M3458m737r2641j2072R415L5928L1925L1849Q3115J6562k3919
11760A40219P617k6965k4348PJ6015l4402n2095p4231m8826O0609J5278M719k7508
11747d3911O1846J05558o1105l9708p15L0487k1348n1566M5013j017r818m8141
11735c4425l203J266K6101J927K6591R6295m0663l9328q960l852k3004p1454M0398
$$ plain form
11822 -64038 -57650 -69256 -69454 -10935 -36935 -35969 -73731 -101001 -86789 -75831 -36073 -69861 -83905
11809 -83905 -57465 32380 67722 -40468 -138324 -137642 -36651 16516 39390 -10410 -9649 -30161
11797 -30161 -37546 -37024 -72614 -91507 -59862 -13581 59438 61404 15037 -37758 -89858 -89839 -77959
11784 -77959 -70119 -70504 -81224 -30605 36535 129048 53466 35376 2950 -17598 -42143 -27442
11772 -27442 21336 64794 60057 -32584 -44656 -35241 687 32612 64461 147576 164138 140219
11760 140219 147836 120871 96523 96530 112545 78143 26048 -48183 -97009 -36400 -21122 -16403 -43911
11747 -43911 17935 123493 62388 22680 21965 52452 31104 -20462 24551 23534 13716 -34425
11735 -34425 -37628 -36362 -10261 -8334 18257 114552 73889 34561 25601 21749 -1255 -72709 -32311
11722c2311L8882K5475k1674j5059k5538l610J985j2250N3459P5520L1096n8596
11710E7379l5271m019O025O6810p090k2963N8982J0169n0505m3122k5786L6214
11698D6823O4567L8058j9195l2489j2193p0998k1535L2322Q5641N9365p1490l6683
11686F2193k010j6149R3519J19o2549p0408M1810q0045J253k0863N272K3771j4094
11673c8181m8310N678o5696l9111k3311J00N3167O5469N1195L566M1171N4098
11661E9835K3263m5989o5516m3227q5988r19J30543M4409N5601l1845q3045J9090
11649b3788j0001L1319J3903N905j3994j8345R263P5476O2159l5343q8546j4619
11637f611j4931P420r231J0534M9743l5145j7395M7358j3643m6654o0246k0670
$$ plain form
11722 -32311 6571 32046 10372 -4687 -30225 -33835 -31850 -44100 9359 84879 115975 57379
11710 57379 22108 18089 24114 90924 83834 60871 119853 130022 79517 36395 10609 46823
11698 46823 111390 149448 130253 97764 85571 14573 -6962 25360 111001 170366 98876 62193
11686 62193 60183 44034 137553 137672 75123 4715 46525 -33520 -32267 -53130 -47858 -24087 -38181
11673 -38181 -86491 -80813 -146509 -185620 -208931 -208831 -155664 -90195 -39000 -35434 5737 59835
11661 59835 83098 37109 -28407 -71634 -157622 -158541 -27998 16411 72012 40167 -42878 -23788
11649 -23788 -33789 -2470 11433 17338 3344 -15001 -5738 69738 131897 96554 8008 -6611
11637 -6611 -21542 -14122 -23353 -12819 36924 1779 -15616 31742 18099 -28555 -88801 -109471
11625a09471M2539J4544r8874m305L4414M0971O6057R4129n0184n3203J6549r497
11613a6331j6378l8593k8181k3292L5876k0183M797J09728M3870p9764J0285P6134
11601E7968o3848o4282O7682k2563q4271K4789O0138M5439L4690j0923k2946M2174
11589F4047K156k4884r9217l6613k778n0129N8358L6708P5340j5871k6896n191
11577b4970M0746J1822m5893j7343m3139m3140K3564N5291Q6446J06874J1759
11566A62017m9695n2519P103O4463R269k8053p2746k9689M1556o9593O574o614
11554a7927M7595Q079o4183p9290k2313J13236R7180l2349p1370J7600j944J0208
11542D522n606l0618j3427l5683J9270K1777m9013k0786J0353K4948O4491q843
$$ plain form
11625 -109471 -66932 -52388 -151262 -155567 -121153 -80182 -14125 80004 29820 -23383 -6834 -16331
11613 -16331 -32709 -71302 -99483 -122775 -86899 -107082 -102285 7443 51313 -28451 -18166 57968
11601 57968 -5880 -70162 -2480 -25043 -109314 -84525 -24387 21052 55742 44819 21873 64047
11589 64047 66203 41319 -57898 -94511 -97289 -147418 -89060 -52352 22988 7117 -19779 -24970
11577 -24970 15776 27598 -18295 -35638 -78777 -121917 -98353 -43062 43384 150258 162017
11566 162017 112322 59803 66906 131369 140638 112585 39839 10150 51706 -17887 -11313 -17927
11554 -17927 29668 37747 -26436 -105726 -128039 -14803 82377 50028 -21342 -3742 -5686 4522
11542 4522 -1084 -31702 -45129 -80812 -61542 -39765 -88778 -109564 -99211 -74263 -9772 -18615
11530a8615l4219M9349L3420j5044p356K1039l4769k6308L188N6350M9212J9443
11518I5690M4933l7995j18334m9824J0896j986K1867K6025J5031K0668K590M696
11506C4257l6877m535j7143j9306j3497j4025k5332m098N5143K0825k7122J9108
11494c2602l591p978p7325j8383O5932N7001J8615o2623k5473M9590J0048p628
11482c4417q174k7892N87j0310l3143M7623K5309L6268J3108k2998p4398m4915
11470a33352k0847l2188O5129J13950J03419q9189j6590K0464m0018j0768L9770
11459b20m0440o0983P3252n0655n5042Q3578N2521p499r307L6783O034J8592k9357
11446A7257q2797N2910p934j1318R3693q691j3815N4263n1825m2565n607K4754
$$ plain form
11530 -18615 -52834 -3485 29935 14891 7535 28574 -6195 -32503 -29315 27035 76247 95690
11518 95690 140623 102628 -15706 -65530 -54634 -56620 -34753 -8728 6303 26971 29561 34257
11506 34257 -2620 -7155 -24298 -43604 -57101 -71126 -96458 -100556 -45413 -24588 -51710 -32602
11494 -32602 -36193 -44171 -121496 -139879 -73947 -16946 1669 -60954 -86427 -36837 -26789 -34417
11482 -34417 -42591 -70483 -69896 -80206 -113349 -65726 -40417 -4149 8959 -14039 -88437 -133352
11470 -133352 -154199 -186387 -121258 -7308 96111 6922 -9668 10796 -29222 -39990 -220
11459 -220 -40660 -101643 -28391 -79046 -134088 -50510 2011 -5488 -14795 21988 28022 46614 17257
11446 17257 -65540 -12630 -20564 -31882 61811 53120 39305 93568 41743 -822 -6429 18325
11434A8325n9547k9499J4257J6756J8606O4870k4669M7555L5730o4815o5446j0242
11422c8119J478o8061l0230M384Q1828L6106R395j3189l8230m1411M3716M3307
11410i026L0352L6068R447p8731r9599J0946M5723k110J5886o9980L0935J4172
11398f5917Q1683O849j2399J7606L1455o38J0770o323j344n2479m2353j4497l9823
11385h7410n7785O2554m1470P0466J02002K7347m8283o9338j7533L3926k6437
11374e1961l3003n4061R630L920J6873N7626M7815n9227O1898m0465m256J3984
11362c1227N5429n1948m8339J2554l099m0241J8000O4770N1102l4911m9675k7612
11350h5197j12748K736M8275J24808P7491m3391k5039j0513K792j8096M680o4867
$$ plain form
11434 18325 -41222 -70721 -56464 -39708 -21102 43768 19099 66654 102384 37569 -27877 -38119
11422 -38119 -36641 -104702 -134932 -130548 -48720 -12614 -3219 -16408 -54638 -96049 -52333 -9026
11410 -9026 21326 57394 66841 -11890 -111489 -100543 -54820 -56930 -41044 -111024 -80089 -65917
11398 -65917 15766 22615 10216 27822 59277 58639 69409 63086 61742 9263 -33090 -47587 -87410
11385 -87410 -145195 -82641 -124111 -53645 48357 75704 27421 -41917 -59450 -25524 -51961
11374 -51961 -84964 -139025 -129395 -125475 -108602 -50976 -3161 -62388 -490 -40955 -45211 -31227
11362 -31227 24202 -27746 -76085 -63531 -66630 -106871 -88871 -24101 27001 -7910 -57585 -85197
11350 -85197 -197945 -195209 -146934 -22126 55365 11974 -13065 -23578 -20786 -38882 -34202 -99069
11338i9069k1566K8007M1438q685J9064J7518N6199K7594l2421l1686o3933K5606
11326d1934N9904n1811j6173J1211M432m3519r555L7381k2024L209K0058Q8735
11314C9914j269n2332q2040l8318J2855L9193K4277r697M7576P7008k874j3260
11302D1033j7617j2277M9551p7307m6583j8507K2903j1910N72K7077p177m1618
11290i1860J6408j753P2425J2810l3059m3539K8721K7039k5226O2483L6385o781
11278E4053L987r825j6307L548l1134l3733l3326K8983l6096K1979L5759p4243
11266h6355J0639O7382R963M1835N9577j3026j10642p5054j6157Q0787M4622O6097
11254G9668o5885K008N162k8028L845O485K6227Q052K329K0698m7899j2856K6922
$$ plain form
11338 -99069 -120635 -92628 -51190 -59875 -40811 -23293 32906 60500 28079 -3607 -67540 -41934
11326 -41934 17970 -33841 -50014 -38803 -34371 -77890 -87445 -50064 -72088 -68879 -48821 39914
11314 39914 38645 -13687 -95727 -134045 -121190 -81997 -57720 -67417 -19841 57167 54293 41033
11302 41033 23416 11139 60690 -16617 -63200 -81707 -58804 -70714 -70142 -43065 -50242 -91860
11290 -91860 -75452 -77205 -4780 8030 -25029 -68568 -39847 -12808 -38034 24449 60834 54053
11278 54053 58040 48215 31908 35456 4322 -29411 -62737 -33754 -69850 -47871 -12112 -86355
11266 -86355 -75716 -8334 1629 43464 103041 90015 -20627 -95681 -111838 -31051 13571 79668
11254 79668 13783 15791 20953 -7075 -3230 3255 29482 37534 39863 60561 12662 -194 26728
11241B6728P739m1128n7828j9624L047K9959L5643K358N8983P6556n6847m1670
11229B3916k7039n0147l8006J2522L0251l294K7640L1050L1223k6260j1323j8252
11217a7719L414l2035K915N5829m122l9735J3455N252j8816N0260M6421k3926
11205D1193R614o203o0404q7950M914M1662J0350K9547O7569L4821j7075J9944
11193H7982m1009J0994q074k3885p3282j7009L0148j2195m7314K3626l4338M9188
11181e5168M3652J6025j3221n2950J5711N3667j6069m5603j6270J13342L1855
11170G4971L1922N5284k6635r6714p9821j6833M6579L9258J28768K1454j10627
11159F7606m4340l7468j5492M754K5492Q023k5033k1831J5413N910m0763J2331
$$ plain form
11241 26728 34467 -6661 -64489 -84113 -81066 -51107 -15464 -13106 45877 122433 65586 23916
11229 23916 -3123 -53270 -91276 -78754 -48503 -51797 -24157 6893 38116 11856 533 -17719
11217 -17719 -14305 -46340 -43425 12404 8282 -31453 -17998 -12746 -31562 18698 65119 41193
11205 41193 50807 44604 -15800 -103750 -98836 -57174 -46824 -17277 50292 85113 68038 87982
11193 87982 46973 57967 49893 26008 -47274 -64283 -34135 -46330 -93644 -70018 -104356 -55168
11181 -55168 -11516 4509 -8712 -61662 -45951 7716 -8353 -53956 -70226 43116 74971
11170 74971 106893 162177 135542 38828 -40993 -57826 -11247 28011 156779 178233 67606
11159 67606 23266 -14202 -29694 -24940 552 8575 -16458 -38289 -22876 -16966 -57729 -45398
11147d5398O2713J5582k1547O713J1096N989L9238l85l1949k2516M1477m5619
11135A5394q5915n189N7288P1007K0504k3535m2157l3857k6335N5091K096J5351
11123A9743J1848j9865M757j3388j5300m5505l2879k74M1228J778k170M364L4075
11110a1588k4178q5341j6506L4436O5837M1738o2549m6071n3583O7950L4567J8207
11098c7081J154K291l3593K0904J00285O8689k6943p5310n3455m6153M6563K6646
11086f003n8839r4041N9490L8076n0979j13233M4770R8577P4703N541n402k1617
11074b8957j34240r604Q3867L6295j3255K0182j7315k1521L1362J2649P1881K2828
11062E4172J0922j5885m6861m487P8344J9446m0100m4595o5736L51J1613j1156
$$ plain form
11147 -45398 17315 32897 11350 18063 29159 35148 74386 74001 42052 19536 61013 15394
11135 15394 -70521 -75710 -18422 52585 73089 49554 7397 -26460 -52795 2296 4392 19743
11123 19743 31591 11726 16483 3095 -12205 -57710 -90589 -90863 -49635 -47857 -50027 -45663 -11588
11110 -11588 -35766 -121107 -137613 -103177 -37340 4398 -58151 -104222 -157805 -89855 -55288 -37081
11098 -37081 -35927 -33636 -67229 -46325 53960 122649 95706 20396 -33059 -79212 -32649 -6003
11086 -6003 -64842 -158883 -99393 -61317 -112296 -225529 -180759 -82182 -7479 -1938 -7340 -28957
11074 -28957 -163197 -172801 -88934 -52639 -65894 -45712 -63027 -84548 -53186 -40537 31344 54172
11062 54172 65094 49209 2348 -2139 76205 95651 55551 10956 -54780 -54429 -42816 -53972
11050e3972K4247L6708m383p2299M6473O2233K5331n1809l3497N6824r38j3964
11038B0954k5802l5394k0827m6392R842J5938o859m628J627R778J588N345M3951
11025c0879l0983K0255O2518L274l8606L9545N9652m111k2586j3991j2956J809
11013C2941O143M4661p247n6688n767L5781k5306p4358j5279k8517K6592j4434
11001h1478l2689M604L2345J7090K4679k9740l6943O097M9340L6623L3389N9931
10989H3248m0880k5353K3280m2065N1121K9680n6170l8520k7287p135K9475R9063
10977G8457o3395n0925r379l6587M5481o95l7611m6934j640p535J9620R5351O1815
10964D6023R831k6309P6507P3674N643q2914l7318j9289N5016o5831m2755K245
$$ plain form
11050 -53972 -29725 6983 2600 -69699 -23226 39007 64338 12529 -20968 35856 34918 20954
11038 20954 -4848 -40242 -61069 -107461 -97619 -81681 -88540 -93168 -91541 -81763 -80175 -74830 -30879
11025 -30879 -61862 -41607 20911 24185 -14421 25124 84776 80665 58079 44088 31132 32941
11013 32941 39084 83745 76498 19810 14043 49824 24518 -49840 -65119 -93636 -67044 -81478
11001 -81478 -114167 -109563 -77218 -60128 -35449 -65189 -102132 -96035 -46695 -10072 23317 83248
10989 83248 42368 17015 40295 -1770 49351 79031 22861 -15659 -42946 -50081 -20606 78457
10977 78457 15062 -35863 -45242 -81829 -36348 -37043 -74654 -121588 -123228 -130763 -111143 -15792 46023
10964 46023 55854 29545 106052 179726 185369 102455 65137 45848 100864 35033 -7722 -5477
10952e477m8577N2990N6797k092l5554o9249p41J0491k2423M6567k4009j6650
10940e7927o443L9324o2843r0267O4M6530L5854M7815J03168j0882j00859k9125
10928h5591j6096L1442M3852L4460j04347k3912P0779L7639p871k2129j0101J202
10916e0673P5050J1150m3387K7747J8044o0939n358M2097R9507P2831o2332q5776
10904C7961J129l0390m495K4789K0139j064k7719k65J2323k717p1385q161K7340
10891b2515J9247j6142L9389M9166P771r249m7016M383n4167K4231M1940q295
10879B8743l6847j2021n91J2882L467M4321K9045k2693j4928p4199k4547K6528
10867d0840M3104N3807k2342k1475O5686k5104l1796J6733K6118j5528J3010j1962
$$ plain form
10952 -5477 -54054 -1064 55733 53641 18087 -51162 -51903 -41412 -63835 -17268 -41277 -57927
10940 -57927 -64370 -25046 -87889 -178156 -178092 -131562 -95708 -47893 55275 44393 -56466 -85591
10928 -85591 -101687 -70245 -26393 8067 -96280 -120192 -49413 -11774 -19645 -41774 -51875 -50673
10916 -50673 24377 35527 -7860 19887 37931 -23008 -28366 13731 113238 186069 123737 37961
10904 37961 39090 8700 4205 28994 49133 48069 20350 20085 32408 29691 -41694 -49855 -22515
10891 -22515 -3268 -19410 19979 69145 76916 67667 20651 25034 -29133 -4902 37038 28743
10879 28743 -8104 -20125 -20716 -7834 -4367 39954 68999 46306 31378 -42821 -67368 -40840
10867 -40840 2264 56071 33729 12254 77940 52836 21040 37773 63891 48363 61373 49411
10855D9411k1958k1927K9845K0824o2650k9027k061j1998L3891R316L8999L4955
10843F7620L510q1132k4179Q164l5049m9605M8887J10727K2671n1646J8468o5
10831C8371m5922k2757p137j6333m3146j096K8308k140k504j7993Q842Q2009M7833
10818D6335j3695l5959L4334j0N8927J0598K533m181m6021k4977k2685m3621q3614
10805a22036p0416K6114O9243n351n1422K4742O6406l568o140M0169k1258j21327
10793a74844m8077R0292R6942K5390m2267k0807M6993k4615K1432N6208K9340
10782E5987l4132k1678j3562j1389O253J2566N2344o1137j3467j9629l7059k7594
10770a12497K4975N3787M0059l6615l4609p813N4521Q196l3995K1251P770J8848
$$ plain form
10855 49411 27453 5526 35371 56195 -6455 -35482 -37543 -49541 -15650 -6334 32665 67620
10843 67620 71130 -10002 -34181 -26017 -61066 -110671 -61784 48943 71614 19968 38436 38371
10831 38371 -7551 -30308 -37445 -53778 -96924 -98020 -69712 -71852 -74356 -92349 -83507 -1498 46335
10818 46335 32640 -3319 31015 31005 89932 100530 103063 98882 52861 27884 5199 -38422 -122036
10805 -122036 -192452 -166338 -97095 -102446 -153868 -129126 -62720 -66288 -72428 -32259 -53517 -174844
10793 -174844 -222921 -132629 -35687 -10297 -52564 -73371 -26378 -50993 -29561 26647 55987
10782 55987 21855 177 -13385 -24774 -18521 -5955 46389 -14748 -28215 -47844 -84903 -112497
10770 -112497 -87522 -33735 6324 -30291 -64900 -72713 -18192 -9996 -43991 -22740 -14970 3878
10758C878J0628J8522j6467K487K0281p8293o0993L6222L3503O070L1884l3104
10746b5382l9278M9541J0365j751Q866k4385L7448L3770o6906k7876O0129R1102
10734A05643j4609m3643m9929M5452J7325R939m448r552K5502M0599p8744l0140
10722A3395L9379P7449l2402k1699O2082j8407j01814p0435l4902j5255L0260
10711g2349O5135P2558l8175n0477J4257n151n685K3085J4948k7886n4885J7306
10699d7319P502r5110m0961P8160N7823M4689o494l0349K9975L3512J9817l8187
10687A3058n3284K4385L0029p1642m723q54l0766k173N9863L752J6791L4714L6045
10674E5195l7660m4181j0584k2124O643n437k6719L6867O0080M995m4834l1819
$$ plain form
10758 3878 14506 33028 16561 19048 39329 -38964 -99957 -63735 -30232 -24162 7722 -25382
10746 -25382 -64660 -15119 -4754 -6505 2361 -22024 15424 49194 -17712 -45588 14541 105643
10734 105643 91034 47391 -2538 42914 60239 70178 65730 56178 81680 122279 43535 13395
10722 13395 52774 130223 97821 76122 138204 119797 17983 -52452 -87354 -102609 -72349
10711 -72349 -7214 65344 27169 -23308 -9051 -14202 -19887 3198 18146 -9740 -64625 -47319
10699 -47319 -39817 -134927 -175888 -97728 -39905 4784 -1710 -32059 -2084 31428 51245 13058
10687 13058 -40226 -15841 14188 -57454 -62177 -63031 -93797 -95970 -36107 -32355 -15564 19150 55195
10674 55195 17535 -26646 -37230 -59354 -52711 -58148 -84867 -48000 12080 17075 -27759 -59578
10662e9578q919O2773J4029m8882n4928l9899j3845L6011M1390Q443O5789Q9429
10650I1813k4346m3345p0274k823K4130Q4009k2224K8345K3095n3889k2688L4342
10638D6145J195k673J8243j0288l5475k3050n1771j6082M7368N6887K4094o7079
10626a2486n8820M4187k2013k7839j0036J6203Q0795R3746j1525q3311n7464K1969
10614b6594m0581j8047J5886j8629N6245o1370l8888j3497M0929M3439K9316L8601
10602F810R059J1093R5006p6950p0727k5356j226K1599J3625j851R110p5883j24883
10589b10574o7263L9690J04601K7176M1769o605N3188J1321M7754K5496o5820
10578G33p1817l7143j7693O2048K0736L2700L4775N4112o879j32535n1224j3414
$$ plain form
10662 -59578 -68497 -5724 8305 -40577 -95505 -135404 -149249 -113238 -71848 -63405 2384 91813
10650 91813 67467 24122 -46152 -48975 -24845 59164 36940 65285 88380 34491 11803 46145
10638 46145 47340 44667 62910 52622 17147 -5903 -57674 -73756 -26388 30499 54593 -12486
10626 -12486 -71306 -27119 -49132 -76971 -87007 -70804 9991 103737 92212 8901 -48563 -26594
10614 -26594 -67175 -85222 -69336 -87965 -31720 -93090 -131978 -145475 -104546 -61107 -31791 6810
10602 6810 15869 26962 121968 45018 -25709 -51065 -52291 -30692 -17067 -18918 -9808 -85691 -210574
10589 -210574 -277837 -238147 -133546 -106370 -64601 -71206 -18018 -6697 41057 66553 733
10578 733 -71084 -108227 -125920 -63872 -43136 -10436 24339 78451 71572 -60963 -112187 -125601
10566a25601j1295J6750J589j2625k6053O5880L2918J3946j1851P0408M3547J5794
10554G3407l6856l7413L5309n820k6038p7024K2433N8962j17k9675l998j9822
10542d6652n6761p018J8009M1026M8443j6825o318K6950K050m65K2795Q88m0203
10529a4081l327L4278m5143m5807K4344K0012R209J7140K9453j03682l9123P9815
10517c6912L6809M3480N7128n0952q1334K9987o306j9042P3799M5582L8527K4795
10505A55561o118r6029j2398o235O428J3076L3622o0061j6814J1995j0067k5610
10493a2650m0351j3368L0495K8573J2836J2223Q7252M0084o0173M0433j8206o758
10481A00390R361l079l0343p1029o6341j240K8579L2677k9672l4782r4713M0654
$$ plain form
10566 -125601 -136896 -120146 -118557 -131182 -157235 -91355 -58437 -44491 -56342 14066 57613 73407
10554 73407 36551 -862 34447 28627 2589 -74435 -52002 6960 6843 -22832 -26830 -46652
10542 -46652 -103413 -110431 -92422 -51396 -2953 -19778 -26096 854 2904 2439 25234 26122 -14081
10529 -14081 -17408 16870 -28273 -74080 -49736 -29724 -20515 -3375 26078 -77604 -116727 -36912
10517 -36912 -103 43377 100505 49553 -31781 -1794 -8100 -27142 46657 92239 130766 155561
10505 155561 149443 53414 41016 34781 41209 54285 87907 27846 11032 23027 12960 -12650
10493 -12650 -53001 -66369 -35874 -7301 5535 17758 105010 145094 84921 125354 107148 100390
10481 100390 109751 106672 76329 5300 -61041 -62281 -33702 -1025 -30697 -65479 -160192 -119538
10469a19538P2967j4207n8984L8135M2108N6745N0594P862l6269p9507j7509k6900
10457h4503J1505n3359L678J4972O7532j4572L0454n184n9038l2195q836K6928
10445a02618J1021j3098O9605P3469J1948J1712r991j3363j4258J0026j8770J6540
10433C2223j4365j8708J0295r098o6571j4392L9576j8676O631N2287N861j7548
10421a2485J1724O9381k5242j0100L7253L5651O901j4373p1219m9392K4350n8594
10409e6145K6467M7419J5552l4732n6974q4369Q3890K9277l8096o742N2385L3451
10397A1383L3604Q800J030l0861k3026K6481o305n573l9559r216M9931j6595L1523
10384C1617J9400o4883k1420L1894M1812j5884O130J1598o3073K364L347l7419
$$ plain form
10469 -119538 -46571 -60778 -119762 -81627 -39519 17226 67820 75682 39413 -40094 -57603 -84503
10457 -84503 -72998 -126357 -122679 -107707 -40175 -54747 -24293 -29477 -88515 -120710 -129546 -102618
10445 -102618 -91597 -104695 -35090 38379 50327 62039 52048 38685 24427 34453 15683 32223
10433 32223 17858 -850 9445 347 -66224 -80616 -41040 -59716 -53085 -798 5063 -12485
10421 -12485 -761 68620 43378 33278 70531 106182 113083 98710 27491 -21901 2449 -56145
10409 -56145 -29678 17741 33293 -1439 -58413 -142782 -58892 -29615 -67711 -74453 -22068 11383
10397 11383 44987 53787 54817 23956 930 27411 21106 15533 -24026 -33242 16689 94 31617
10384 31617 51017 -13866 -35286 -3392 38420 22536 28666 40264 -22809 -20445 -17098 -54517
10372e4517J191O2077M5030O558R612k6608k5819k3473J6770R383j0237k9059
10360a9092L1528P1059J4390N2882p717j0225n2031m0925q1066Q001R4005k6549
10348C4260k6795m6915l9967L109p067k8601O988O2729K8505j6744n0443m250
10336h5191Q927k2985J3170R9471J0983n4512Q7979Q5269n4963r1375j9991J5991
10324g227k6132m786L1777K2933m6276M290O6604L221k0159j8572N4899p925l5422
10311A7225k7272J0293K4152o9695J7087N4344O1430O4652K3062m7889k882q4596
10299C9911o2691k1092K4564L4865L0122K3637m4970n068m5786l3740j1984P959
10287f4273K0131O8882N5994p947p7393o3176m419m235K1198m0788O638J26524
$$ plain form
10372 -54517 -53326 8751 53781 60339 69951 43343 17524 -5949 10821 20204 9967 -19092
10360 -19092 12436 83495 97885 150767 143050 132825 80794 39869 -41197 -33196 60809 34260
10348 34260 7465 -39450 -79417 -76308 -83375 -111976 -104988 -42259 -13754 -30498 -80941 -85191
10336 -85191 -76264 -99249 -86079 13392 24375 -30137 57842 143111 88148 -3227 -23218 -7227
10324 -7227 -33359 -38145 -6368 16565 -29711 -25421 41183 44404 24245 5673 60572 52647 17225
10311 17225 -10047 246 24398 -45297 -28210 26134 87564 152216 175278 127389 124507 39911
10299 39911 -22780 -43872 -19308 15557 45679 69316 24346 19278 -26508 -60248 -72232 -64273
10287 -64273 -44142 24740 80734 72787 -4606 -67782 -72201 -76436 -55238 -96026 -89388 37136
10275C7136m6137K1239R0755k7604m5572p6399n3758q360j26M924P9436L0110
10263E644J2438r9748K3810R1382k9007J169n5756m0874n9352k6851J7299P2865
10251h6981P6411O3354R603k1035j1455L0406k4492k3961J4814K5040p7284q1249
10239a06829j7155P0773J5470l5356O0236K1726m7235j9045J588k7680j5844j528
10227a00879M8269o1759L7102K3228l2294J4923k9496J8308J57955L9826l6683
10216G8500k5120j11680r4055K9550l7743l5689k0371O4409J0571m0401K7085
10205a54944J58294J14290K2348k8101j16655R126J2714n2133o7377P9477P7096
10194E4135J8438n7376p6348L3920j6262L29O8715Q262j8118p20M2230l1080l9839
$$ plain form
10275 37136 -9001 12238 102993 75389 29817 -46582 -100340 -108700 -108826 -103902 -24466 5644
10263 5644 18082 -81666 -57856 33526 4519 5688 -50068 -90942 -150294 -177145 -159846 -86981
10251 -86981 -10570 52784 62387 41352 29897 60303 35811 11850 26664 51704 -25580 -106829
10239 -106829 -123984 -53211 -37741 -73097 -12861 8865 -38370 -57415 -55827 -83507 -99351 -100879
10227 -100879 -52610 -114369 -77267 -54039 -86333 -71410 -100906 -82598 75357 115183 78500
10216 78500 53380 -58300 -152355 -122805 -160548 -196237 -216608 -152199 -141628 -182029 -154944
10205 -154944 3350 117640 139988 111887 -4768 4358 17072 -35061 -102438 -22961 54135
10194 54135 72573 15197 -61151 -27231 -43493 -43164 25551 33813 15695 14975 57205 26125 -13714
10181a3714l3977j2737J2474Q5735k4534l3403j0501J2921L1955n803r4718m0922
10169a27224l4428J5218K3410J9449L840K5384P1895r200J0528O3535p4218o1517
10157g3328k8627n219l9084N9124J5286k8493k8990M3603N9533J1945l6569K2356
10145b8463j366j114o4268l614L5433P798l4720J1276l8391Q558M7489L3696k8953
10132e6639m3102k8851J4777L0217K2260J5231n2851k5432N19M9680O4035k2384
10120c2540m5284j3689L3900R6535j2156K688P939j7521o047L6590k189l1826
10108A6400j07212l8372N2793p69k0334M0697O172K894K3474R1969K9413n1383
10096D5742m8663l0070j897K1374K7204M099o9825k7802O1428K5646r528M1884
$$ plain form
10181 -13714 -47691 -60428 -47954 37781 13247 -20156 -30657 -17736 14219 8416 -86302 -127224
10169 -127224 -161652 -146434 -123024 -103575 -99735 -74351 -2456 -11656 -1128 62407 -11811 -73328
10157 -73328 -101955 -107174 -146258 -87134 -71848 -100341 -129331 -85728 -26195 -14250 -50819 -28463
10145 -28463 -29829 -30943 -95211 -98825 -63392 -55594 -90314 -79038 -117429 -108871 -61382 -27686 -56639
10132 -56639 -99741 -128592 -113815 -83598 -61338 -46107 -98958 -124390 -123871 -74191 -10156 -32540
10120 -32540 -77824 -91513 -57613 38922 26766 29454 37393 19872 13825 50415 48226 16400
10108 16400 -90812 -129184 -76391 -77160 -97494 -56797 -50625 -47731 -24257 67712 97125 45742
10096 45742 -2921 -32991 -34888 -13514 13690 17789 -52036 -79838 -18410 7236 -2292 39592
10084C9592L8211N9781j2316l3767m5718L7311P907p218l7018j9270p687m4873
10072b5065L377L5998K9419O4333K5829j6561p1559m9057L1497R3185K3220J23594
10060B68210K18310L30561L77671L17289K31649Q010m36325m75987k99792k15924
10050C23672q2420p103l4478k4991J3412j3121k7027q421N1881k8644m1216R088
10038A30632j00244k1432O9107N4612J0008o6636k7209j3581j0828m7034m8845
10027g1450Q7571L391j788l7095k7515l3415k2431N9261J00417J9568j7681O6650
10015A25483j8830l8240K2541m4655m6300K1948M9949j4562o1453k1188J5092
10004a0215N6411k9195m5070j3520N373Q5170p88n2013p4626j2430N8341l2292
$$ plain form
10084 39592 77803 137584 125268 91501 45783 83094 91001 83783 46765 27495 19808 -25065
10072 -25065 -21688 14310 43729 108062 133891 117330 45771 -3286 28211 121396 144616 268210
10060 268210 486520 817081 1194752 1512041 1743690 1751700 1315375 839388 539596 323672
10050 323672 241252 234149 199671 174680 188092 174971 147944 139523 191404 162760 121544 130632
10038 130632 30388 8956 78063 132675 142683 76047 48838 35257 24429 -22605 -71450
10027 -71450 16121 19512 17724 -19371 -46886 -80301 -102732 -43471 56946 76514 58833 125483
10015 125483 106653 68413 90954 46299 -1 21947 71896 57334 -4119 -25307 -10215
10004 -10215 46196 17001 -28069 -41589 -36216 48954 48166 -3847 -78473 -90903 -32562 -64854
9992f4854k4189K9787P1493L2030K9281J1575N7617m8119q5803k9803O814K5163
9980A0992J8155o120p018k2579L5562j9081J8923m4510J9916r158j4022L8205
9968A9265k2661n3444O4124O0545k249L5273k7048n1964j7177p9382N790O0284
9956h644K0179n3385J1215L7256J5966l4347R979m8091p1661l4721O7254Q5110
9944c890k9633k5731n5171K3943K9793P495l4220l3413O8694O2937J5591K2311
9932D8706j968l8771O457j8637J6813K0916l1028n7029K0992M691K1320L9058
9920C1520K4560p3168l5075M3565L8197M687N5347J8210j5387q7250k2401L5798
9908A8603K2842J6147l0068m7268J5959J4309j0100J4082L0874K602n518k6529
$$ plain form
9992 -64854 -89043 -59256 12237 44267 73548 85123 142740 94621 8818 -20985 -14171 10992
9980 10992 29147 23027 16009 -6570 28992 9911 28834 -15676 4240 -4918 -18940 19265
9968 19265 -3396 -56840 7284 67829 65580 100853 73805 21841 4664 -74718 -68928 -8644
9956 -8644 11535 -41850 -30635 6621 22587 -11760 -1781 -49872 -121533 -156254 -89000 -3890
9944 -3890 -33523 -59254 -114425 -90482 -60689 -53194 -87414 -120827 -52133 10804 26395 48706
9932 48706 46738 7967 14424 -4213 12600 33516 2488 -54541 -33549 -28858 -7538 31520
9920 31520 56080 -17088 -52163 -8598 29599 34286 89633 107843 92456 5206 -17195 18603
9908 18603 41445 57592 27524 -19744 -3785 10524 424 14506 45380 47982 42464 15935
9896A5935k5814j9086l620R1313O0495j983q2885l8035O55j3809q7735P896M3601
9883e3072m187l1210L4865P5159J9284j31880l6186p894q5470N9314O5365N3514
9871d2398Q4720m6841m9228J274K4817P359K6154N450j9415L2453J7215r888l7702
9858f030j05719j27P8347N2121L2293L9910J0919L109M2588K5184r1231n6989
9846B4375L50R521m7170L9013K8485M1809j3317q0573J5377O1662Q439m6202l7024
9833D745K8386P589m7736m2658m1970L2775N5901K2602p053j1921j1533m854L2713
9820A6986l0763L1336M7918L470j5524J28216O8556j36486r7819j8192P5916o648
9808F6966n1270j0046K2663K4879O5581P985m0005q147m7904n5432J4814K9295
$$ plain form
9896 15935 -9879 -28965 -32585 58728 119223 117240 34355 -3680 -3025 -16834 -104569 -96673 -53072
9883 -53072 -57259 -88469 -53604 21555 40839 -91041 -127227 -135121 -220591 -161277 -95912 -42398
9871 -42398 42322 -4519 -53747 -52473 -27656 -20297 5857 11307 -8108 24345 41560 31672 -6030
9858 -6030 -111749 -111876 -33529 18592 50885 90795 101714 104823 147411 172595 81364 24375
9846 24375 24725 34246 -12924 26089 54574 96383 83066 2493 17870 79532 87971 41769 4745
9833 4745 33131 40720 -7016 -49674 -91644 -58869 -2968 19634 12581 660 -10873 -15727 16986
9820 16986 -13777 17559 65477 68947 53423 181639 250195 113709 15890 -2302 73614 66966
9808 66966 15696 5650 28313 53192 118773 126758 86753 78606 30702 -24730 -9916 19379
9796A9379M793K2286k868M4319O9550k2273l1669l430m5913j1432o4523K8031
9784F250L7082k3949l735N2414l1232L1402J8261o8103n5695m217M2002J8536
9772A9016J7492n49j3951L1441J2778J6895m8841j8839L9745k1412m7123q175
9760b1523n632n583q914K371o0565m1211q680N7227Q2109n738r2429n3934M2155
9747a20347Q1919N0586K1688l826m121q75p4536j098j2321O467L7085J0959J9553
9734A1133j7422r1192k4156o403m141N4085k6498K1451m7386j7028L624P4401
9722f9532K0525J5815l0569O9743k4494M4345J8756m6860l0647j9103J8283p207
9710d0945m4655N1088K7226j8275K2166k3077M6183L0274p032M479k264m5913
$$ plain form
9796 19379 24172 46458 43590 87909 157459 135186 103517 100087 54174 42742 -21781 6250
9784 6250 43332 19383 15648 68062 36830 68232 86493 18390 -37305 -41522 480 19016
9772 19016 36508 35959 22008 53449 66227 83122 34281 15442 55187 33775 -13348 -21523
9760 -21523 -27155 -32738 -41652 -39281 -99846 -141057 -149737 -92510 -10401 -16139 -108568 -162502 -120347
9747 -120347 -38428 12158 33846 30020 25899 25024 -49512 -50610 -62931 -56464 -19379 -8420 11133
9734 11133 -6289 -97481 -121637 -128040 -132181 -78096 -104594 -83143 -130529 -147557 -143933 -69532
9722 -69532 -49007 -33192 -63761 5982 -18512 25833 44589 -2271 -32918 -52021 -33738 -40945
9710 -40945 -85600 -34512 -7286 -25561 -3395 -26472 19711 49985 42953 47432 45168 -745
9698g45O5379j3220q4691m327K9145K149N7301P4282k3615n9497j5058o9851l1233
9685g3981j1360l2655M6411M4231K2878J6993P33K4154k8006q3048O367M9452
9673a7831J00086J4759l8852j5579J8436n1645j2633K0200J0893K4023K6493l4539
9661D3811K285M289m1411M9129O1775n485j8321J1747q7613r8277k0209L2069
9649f6211L4410n144k990M135N329J48319M4147j24900m3687K0950k8973j821
9637a6436P403l6746j254P3765N1349j25607q3497K6357P7742N2449j5846j1226
9625a547J7809O9135n5237p3202Q0119j4128n4402k9244j2686m0903J12794K1106
9613A9614p218K5227l2087j403j4731P2984J3367L2315k6104p5398k1076J3730
$$ plain form
9698 -745 64634 51414 -33277 -37604 -8459 -6310 50991 125273 101658 42161 27103 -42748 -73981
9685 -73981 -85341 -117996 -71585 -27354 -4476 12517 13250 37404 9398 -73650 -67283 -17831
9673 -17831 82255 97014 58162 42583 61019 9374 -3259 16941 27834 51857 78350 43811
9661 43811 46096 50385 8974 58103 119878 114393 96072 107819 20206 -78071 -98280 -66211
9649 -66211 -31801 -36945 -39935 -35800 -30471 117848 161995 37095 -6592 14358 -14615 -16436
9637 -16436 -9033 -45779 -47033 26732 78081 -47526 -131023 -104666 -26924 25525 9679 -1547
9625 -1547 16262 85397 30160 -43042 37077 22949 -31453 -60697 -73383 -114286 -1492 19614
9613 19614 12396 37623 5536 4133 -10598 62386 75753 108068 81964 6566 -14510 -780
9601g80o522j5140N1532N4205j1007l1325k1281K9792J5760k720k2927J1781K270
9588E3638P921j5980j9397k7913J3184N5410L4832L882m4412k8760M5837L8823
9576A17065N7700q9015m5497M3061k1781r0588p1977O4277j3239o0862L981L3031
9564g3844O2136M3137r4653P3Q0383j1246q966N9023M5018P2781j3333q3439J857
9551G8927K2081J1483K8478M429o4235J0910q232m7472n789l838k4789l9437K3446
9538a4038O1335j3675l4181n1077N4482L8928j0167o598O749k0180l1589K4038
9526D027N44k2223O8307P6956k0562q0243j16500k9283q451O1808J33760q228
9514E9912j15589l4843m5004N6438O4328k8045N8861L2776o6233j01133J7559
$$ plain form
9601 -780 -7302 -22442 29090 83295 72288 40963 19682 49474 65234 62514 39587 51368 53638
9588 53638 61559 45579 26182 -1731 11453 66863 101695 105577 61165 32405 78242 117065
9576 117065 174765 85750 40253 83314 61533 -29055 -101032 -36755 -49994 -110856 -106875 -73844
9564 -73844 -11708 31429 -63224 -63151 17232 5986 -2980 56043 101061 173842 160509 77070 78927
9551 78927 101008 112491 140969 145398 81163 92073 83841 36369 30580 26742 1953 -37484 -14038
9538 -14038 47297 33622 -559 -51636 2846 41774 31607 25009 31758 11578 -20011 4027
9526 4027 4571 -17652 50655 127611 107049 26806 -89694 -118977 -127428 -65620 68140 59912
9514 59912 -55677 -90520 -135524 -79086 -14758 -42803 16058 48834 -17399 -118532 -100973
9503a00973L7222K9088O2637K3416o1816n3440k6069M275R4653j5891k844K6831
9491A7089o312o0438l1029Q3046L2672j6136n998l8797K8237k6596J9671K6251
9479B1660m5241N6960R3022j0220j18495m9325J5680k1597L4777K1558q527M5761
9467C6013m96p1355r206j0577K0804l8566l5010l7952Q3542O9166M9075P3972
9455A29410m8359n9341L0174J8035N8490o958j19304k7576l3952M640N0260M2521
9443C8040k4367n4551J5657K8189K9026m6300m8588N486J5173j3260N2393K7543
9431B4441l3683n1771M311K9428K7259O888m8949L4902J9563J1310M8517K2180
9419I4396l8564m1766O0525J8114l008l2472L7005J4080m5067o2365K839M760
$$ plain form
9503 -100973 -63751 -34663 27974 51390 -10426 -63866 -89935 -85660 8993 -6898 -9742 17089
9491 17089 10777 -49661 -80690 2356 35028 18892 12894 -25903 2334 -24262 -4591 21660
9479 21660 -23581 33379 126401 116181 -2314 -51639 -35959 -57556 -22779 -1221 -9748 36013
9467 36013 35517 -35838 -45044 -55621 -34817 -73383 -108393 -146345 -62803 6363 55438 129410
9455 129410 81051 21710 51884 69919 128409 121451 2147 -25429 -59381 -54741 -4481 38040
9443 38040 13673 -40878 -25221 2968 31994 -14306 -62894 -57408 -42235 -55495 -3102 24441
9431 24441 -9242 -61013 -56702 -27274 -15 6873 -42076 -7174 12389 23699 72216 94396
9419 94396 55832 14066 74591 92705 89697 57225 94230 108310 63243 878 3717 8477
9407H477m0628M8086r936O8132k9561r6438k2533M5297o0429n1612J7101n175
9395a29219l524K1564P6341j5250j5447m581n5610N7082R0355N5375J4104j8902
9383G2288J987K7000M3510l9575p6787p0634p835N3065J5390k4141M1336j4949
9371B0655l4411N107N2056k4209J4221M5894m3915p2729J9579M0047j040j0855
9359A0400Q842j023n9663k0622Q026L4131r992K146Q643j6293M3977M415m3243
9346c0256m9937k2365M8809L4201J1488L5376J6009J1053l7847l6137q0733q663
9334a09002N1998O1381N994j0020j9201l0602K7081O4561M8953Q004N3340L5835
9322A88322K7120n8395j05481O776l8433l5523K4847j3750N5274J5110l8508n6739
$$ plain form
9407 8477 -32151 15935 5999 74131 44570 -51868 -74401 -29104 -89533 -141145 -124044 -129219
9395 -129219 -132743 -111179 -34838 -50088 -65535 -70116 -125726 -68644 21711 77086 91190 72288
9383 72288 74275 101275 144785 105210 28423 -42211 -50046 3019 18409 -5732 35604 20655
9371 20655 -13756 -8649 43407 19198 33419 79313 35398 -37331 -17752 22295 21255 10400
9359 10400 19242 18219 -41444 -62066 -54040 -19909 -29901 -27755 -19112 -35405 8572 12987 -30256
9346 -30256 -80193 -102558 -53749 -19548 -8060 27316 43325 54378 16531 -19606 -100339 -109002
9334 -109002 -57004 4377 10371 351 -18850 -49452 -22371 42190 91143 99147 152487 188322
9322 188322 215442 157047 51566 58342 19909 -15614 9233 -4517 50757 65867 27359 -29380
9310b9380l5941J0200M4853L5333p220J5578j2900K6282L3961n7279l1993J8940
9298A0434k5977o7839k3174o065O0309M623M499N3407n0972j8048M1369K4931
9286G497J6468M4746O7978M9006M6023j3165O436m2442j02626m6547J2637N9823
9274A05834J3921Q782k1772k4453j1058O6235k5967p8518K0895K0928M202R090
9262H8119n3222j8221n6168L7722L1729l2634j9947j3939j5978L2148K5000l4726
9250c0117n838L7900k723J1766N0274K8737K6921l6418J4894l0117r6303m7375
9238g8399l5644Q8368N6598K2418O4963j6173k4259j822L623j5898J8946K9636
9226A12357P555m3225r064p0139o873k4252K7342K2153m9529K6932Q2581K6126
$$ plain form
9310 -29380 -65321 -55121 -10268 25065 17845 33423 20523 46805 80766 23487 -8506 10434
9298 10434 -15543 -83382 -106556 -112621 -52312 -47689 -43190 10217 -40755 -58803 -17434 7497
9286 7497 23965 68711 136689 185695 231718 218553 224989 182547 79921 33374 46011 105834
9274 105834 119755 128537 106765 82312 71254 137489 111522 33004 53899 74827 79029 88119
9262 88119 34897 16676 -39492 -1770 29959 -2675 -22622 -36561 -52539 -20391 4609 -30117
9250 -30117 -35955 1945 -778 10988 61262 89999 116920 80502 95396 65279 -31024 -78399
9238 -78399 -114043 -25675 30923 53341 118304 102131 77872 76050 79673 63775 82721 112357
9226 112357 119912 76687 67623 -2516 -9389 -33641 -6299 15854 -33675 -6743 75838 101964
9214A01964m7488N4487M1059o4700o3296N3546l1514J5898K7700q2493K7964j5795
9202A7332q464K0326l3038k7721L2337n783j3772r49L6828p044n9500m3603K2422
9189g0629J2599M7670L9567k7811l097q10q268j8642m2326J0185j0675J21548
9177D9311M2444o4569N448m0776k6118N2264M4551k5051K3631L2537M6169l6538
9165A03303M0638R2255k7101m2725j40168O573M5647J4558k0784k0557n1048M8824
9153D9415M9152L2503K8301m7425J8451O0555j5335o5640m7161O8767J4583K1918
9141A68084o1052L5500j3165L1546j8129l8153J3583R91o240n722o618m3147O848
9128F4326J7188q056J944J2754L3743l4598J8309p967M7396M5609l5420j8925
$$ plain form
9214 101964 54476 108963 150022 85322 22026 75572 44058 59956 87656 5163 33127 17332
9202 17332 8868 29194 -3844 -31565 772 -5011 -18783 -19732 17096 10052 -49448 -93051 -70629
9189 -70629 -58030 -10360 29207 1396 -1701 -2511 -10779 -29421 -71747 -61562 -72237 49311
9177 49311 91755 27186 32634 -8142 -34260 18004 62555 37504 61135 93672 139841 103303
9165 103303 143941 236196 209095 166370 26202 32775 78422 92980 72196 51639 591 49415
9153 49415 98567 131070 159371 111946 130397 190952 175617 109977 62816 131583 146166 168084
9141 168084 107032 142532 129367 160913 142784 104631 118214 119205 112965 107243 100625 57478 64326
9128 64326 81514 73458 75402 88156 121899 87301 105610 97643 145039 190648 155228 136303
9116A36303m7822m3679j913O9654R5370j115m7050J2393J0166l9073L5006J0747
9104A88987j2872N6002J0270J7291J7679q7955R268K3710k5070K3895L2755j1675
9092B42285L5867O0262n6161n5223J1463k2225L849j5026R1369J3707P864L9613
9080C57644K5218P3155L5449j323O1587J25903O7174J2949O1914J00220O1910
9069I81800J73607K16138K07168K47955K95841L86624N01116O33688Q10198J166758
9059E620893J642383K151623K862924L380647L365215K618266J183950p26782
9051B2099119k453686l249047l092881k453176j821446j338230r60098p83988
9043E946567o67658n87191m10781l24363k21946k16893k27235k72972j62396j56192
$$ plain form
9116 136303 88481 44802 42889 112543 207913 206798 159748 172141 182307 143234 178240 188987
9104 188987 176115 232117 242387 259678 277357 189402 198670 222380 197310 221205 253960 242285
9092 242285 278152 338414 282253 227030 238493 216268 220117 205091 296460 310167 318031 357644
9080 357644 382862 456017 491466 490143 551730 677633 744807 757756 819670 919890 981800
9069 981800 1155407 1371545 1578713 1826668 2122509 2509133 3010249 3643937 4454135 5620893
9059 5620893 7263276 9414899 12277823 15658470 19023685 21641951 22825901 22099119
9051 22099119 19645433 16396386 13303505 10850329 9028883 7690653 6730555 5946567
9043 5946567 5278909 4691718 4280937 3956574 3734628 3517735 3290500 3017528 2855132 2698940
9033B698940j72442r3989n7917j13593j42498p6464m611q0808j84228r6248q0323
9022A595819j06398o5858o2345k3616j6012n6079m0801j6917j2997Q806j5593
9011A188009l7770o9140o9185r2339o1181K174P2435l4769o7929J6538K0386j9764
8999H47465p3496L8399l9900m4149m640N7476L0006k0947k5729l2135m0888l3303
8987F58159j04441m5528p6322j6821K9656k0547p532j6288M7337m2492j2183K4959
8975D17957m3278n5092K652R5509k6982q2189J5392m741o8849K0152j4671K4299
8963B80159J2175j207n473k5834k7578K7197j3221k4633m8273L7445J8408o939
8951B22226L0196l1731l8970q300l792L0720L1807m1453q0242k4896J8821n929
$$ plain form
9033 2698940 2526498 2432509 2374592 2260999 2118501 2042037 2037426 1956618 1772390 1676142 1595819
9022 1595819 1489421 1423563 1361218 1337602 1321590 1265511 1224710 1207793 1194796 1203602 1188009
9011 1188009 1150239 1081099 1011914 919575 858394 860568 933003 898234 830305 846843 867229 847465
8999 847465 773969 812368 772468 728319 723679 781155 811161 790214 764485 732350 691462 658159
8987 658159 553718 508190 431868 415047 444703 424156 416624 400336 447673 405181 392998 417957
8975 417957 374679 319587 322239 417748 390766 308577 323969 319228 250379 270531 255860 280159
8963 280159 292334 291127 285654 259820 232242 259439 246218 221585 173312 210757 229165 222226
8951 222226 252422 220691 181721 173421 169629 200349 232156 190703 110461 85565 104386 98457
8939I8457L5815K8519L3290l117o3916n066j3324M1538k1238j5143k0266J8119
8927A13668L6811P6696L5777l5804k2097k2638J2961q517q8108m2894k099M1269
8915I5025L4562n1798M7951L812m4908P74J2406q1091J331k0747J5606J4089J2728
8902C9740k0088J0660L8807R334m08N508p880J2085r960M4250l7371j3490K145
8889G3332L7407k4116m9366p984M3368J20613O2044J16526J15930O0808m3319
8878E05243J5887p0882o7049m7193o9398j04087j0195j1060n2579j3149L1194
8867A06732J9758L8267l682j4204j9435p7693k2289j6276L7960n771N9568L2178
8855A35113m0756k5886l1885m586M9237r785m7180N2860L6921m7134P148J3138
$$ plain form
8939 98457 134272 162791 196081 192964 129048 123982 110658 152196 130958 115815 95549 113668
8927 113668 150479 227175 262952 227148 205051 182413 195374 186857 98749 55855 53756 95025
8915 95025 129587 77789 125740 129552 84644 85418 97824 16733 18064 -2683 12923 27012 39740
8902 39740 19652 30312 69119 78453 78045 83553 75673 87758 77798 122048 84677 71187 73332
8889 73332 110739 86623 37257 29273 72641 193254 255298 371824 487754 548562 505243
8878 505243 521130 450248 383199 336006 266608 162521 152326 141266 88687 75538 106732
8867 106732 126490 164757 161075 146871 127436 49743 27454 11178 49138 43367 102935 135113
8855 135113 94357 68471 36586 32000 81237 71452 24272 77132 114053 66919 74067 87205
8843H7205l2540N866M4583J563N3964p5267r8782k1128J1752M3914n29K9931J9437
8830F9969m2856N374M6013j4210j285n9247m5363R8418O6290K8522p5101j02272
8818b5748Q270M7408n1587k8539p05j4085M0417O6233L0318k5978R927k1124q703
8805B6104P1974j1379J9113L6500p4830k4936l1898l50O4742j6305K4704K6303
8793A09742M778J5576m6878l1354R3214N2224k0254r3118J4389q0672o6158l1893
8781h0404N1919M4308J6998o4678r5494K4061R5647R7290O8091J4391k6937j7333
8769A27859m5130K4275J556l3571j3021M7919J0662l7475J3520j6302l4188J9391
8757F5495R459M5413M051K7153l1280n3807j7124M2318j7875J2423L1037J3178
$$ plain form
8843 87205 54665 60531 105114 106677 160641 85374 -13408 -34536 -22784 21130 20601 50532 69969
8830 69969 27113 32487 78500 64290 63005 3758 -41605 56813 123103 151625 76524 -25748
8818 -25748 -17478 29930 -21657 -50196 -50901 -64986 -24569 41664 71982 46004 55931 34807 26104
8805 26104 98078 86699 105812 142312 67482 42546 10648 10298 75040 58735 83439 109742
8793 109742 114520 130096 83218 51864 145078 197302 177048 83930 98319 17647 -48511 -80404
8781 -80404 -28485 15823 32821 -31857 -127351 -103290 -7643 89647 157738 172129 145192 127859
8769 127859 82729 107004 108560 74989 61968 109887 120549 83074 96594 80292 46104 65495
8757 65495 74954 120367 124418 151571 120291 66484 49360 91678 73803 86226 117263 130441
8745A30441R145o3369p2693J8077Q4383K4779l7423J1481K9997k3701l6547J1641
8733H6211L979j9414k2862m9584L7219j6684M0343N8460O1198L0694l783K3715
8721B29492k2083m0529k8335J1257l2269K7288J5093K6384m7497j1912L9758N3536
8709B20183l681O247L8821q1091o6981l8259J8680N0129K3965J0328J1223J9529
8697B09093L876P1375N7449m4720J305M0229P5999K0400p6814r5351J3573j1815
8685B64599n1997l9531O6664k0065M42K6829j303j00038p4112K8434L1114Q9356
8673B20392J04179P0995J8204J3792l8908L977P5047O4589R950j01963j12033
8662C28221k392K5347P5075K9988J7153O7838j0142N425N049J2135l2329J4355
$$ plain form
8745 130441 139586 76217 3524 21601 105984 130763 93340 104821 134818 111117 74570 86211
8733 86211 90190 70776 47914 -1670 35549 18865 59208 117668 178866 209560 205777 229492
8721 229492 207409 166880 138545 149802 117533 144821 159914 186298 138801 126889 166647 220183
8709 220183 216502 222749 261570 180479 113498 75239 93919 144048 168013 178341 189564 209093
8697 209093 212969 284344 341793 297073 298378 338607 414606 435006 358192 262841 276414 264599
8685 264599 212602 173071 239735 219670 220112 246941 245638 145600 71488 99922 131036 220392
8673 220392 324571 395566 413770 427562 388654 392631 467678 532267 542217 440254 328221
8662 328221 325829 351176 426251 456239 473392 541230 531088 536513 541562 553697 521368 535723
8650E35723R8275r6793r7382J35593J50140N9086L6755O0090O1740K0863m560
8639I59530P3091l6616O4351J07239J27771R8777p093p6176j02462R7722J08113
8628A414247o4553m3398J2246k9077J8062p0061q8505l9114j9632m3513l5873
8617A010829K104k0768L861P0817M2538N4621k4032n3552r2169n9929o9821k3491
8605H41008p8936l0173r5052k4835m3042k2894q6559m4275J8601p752P1042K3703
8593E20836k7257q346l8099j3951m8600n4178l352n378n8715J3918L3692k7591
8581B82979J5437m2826j9771R095N2000j7158p3771r5115j2906Q7293M1245K6750
8569B53252O4602j48J4537J0469o6035q8038K3878J3206O502J2790j1020l240
$$ plain form
8650 535723 633998 537205 439823 575416 725556 784642 821397 881487 943227 964090 959530
8639 959530 1032621 996005 1060356 1167595 1295366 1394143 1387050 1310874 1208412 1306134 1414247
8628 1414247 1349694 1306296 1318542 1289465 1307527 1237466 1148961 1109847 1090215 1046702 1010829
8617 1010829 1012933 992165 996026 1066843 1109381 1164002 1139970 1086418 994249 934320 864499 841008
8605 841008 762072 731899 636847 612012 568970 546076 459517 415242 433843 426091 497133 520836
8593 520836 493579 485233 447134 433183 384583 330405 327053 321675 262960 276878 310570 282979
8581 282979 298416 255590 235819 244914 296914 279756 205985 110870 97964 185257 226502 253252
8569 253252 317854 317706 332243 342712 276677 188639 212517 225723 232225 245015 233995 230755
8557B30755J2945n9452K5831J45m8453r952K7558k5877K5363M857m011p2782p1885
8544C5042r854K1725l0559K3615j86L0892K1878n7964l0628K2889j6133j9691
8532h974n824R684R459N8010j6670J8653L0769J4724k4838n2713n3616o1084L4820
8519d7600R4912l838p3222j0560M6196O5456K3677J7741M0141L9686J8567p6259
8507A34897k1246m8148n6751k9667N5082O1045O6243lq1350j00842R933M75P6533
8494F6201J13754l5868l4741L0832J5401l4872l7551m8679r677K688K9161P7831
8482A34480J7428l9541L9571K3735j4244O691r218n0722m4743l2799N6791k1974
8470F5455L9860J10318J7814l4323k3261m4559l5610j9443L1910k3392J0924N3372
$$ plain form
8557 230755 243700 184248 210079 210224 161771 151819 179377 153500 178863 183720 179709 106927 35042
8544 35042 25188 46913 16354 39969 39783 70675 92553 34589 3961 26850 10717 -8974
8532 -8974 -14798 -5114 4345 62355 45685 64338 95107 109831 84993 32280 -21336 -82420 -47600
8519 -47600 47312 43474 -29748 -40308 5888 71344 95021 112762 152903 192589 211156 134897
8507 134897 113651 65503 8752 -20915 34167 95212 161455 161452 80102 -20740 -10807 -10332 66201
8494 66201 179955 144087 109346 140178 155579 120707 83156 34477 24800 27488 56649 134480
8482 134480 151908 112367 151938 175673 161429 168120 158902 108180 63437 30638 87429 65455
8470 65455 105315 215633 233447 199124 175863 131304 95694 76251 108161 84769 95693 149065
8458A49065J8102l0398m0608J073r15k4326o1838j5837L3518K3839J1941O2732
8446A26348M6593M050o3580m8592L5543M7170l9463K99k2594j1675j5556Q31L4094
8433I3468J1961J955o109j3870N7596M3964n4654l8734M4897m6457N462K034k552
8420I8961J0693J3788K3343m3160m9216k0118l1030J0903L2662M6236J2801j3480
8408I2383n2118n0861K3797K3325j8531L1943L8846m215k0324Q393K5902Q5614
8396A84154o0908j0332L295K7764K2181K6286l8299p0600m0445N37J7921p4468
8384a2914N0277J10717K1321r7291m8607O7503k7730j34411J8844R8862j5654
8373C0917o1470N9747K4727l611m9398r502J746O843L3114J8506N298m3699o792
$$ plain form
8458 149065 167167 136769 96161 97234 96319 71993 10155 -5682 27836 51675 63616 126348
8446 126348 172941 176991 113411 64819 100362 147532 108069 108368 85774 74099 58543 59374 93468
8433 93468 105429 107384 101275 87405 145001 188965 134311 95577 140474 94017 99479 101513 98961
8420 98961 109654 123442 146785 103625 54409 34291 3261 14164 46826 93062 105863 92383
8408 92383 40265 -10596 13201 36526 17995 49938 88784 84569 64245 72638 98540 184154
8396 184154 123246 112914 116209 143973 166154 192440 154141 83541 43096 43633 61554 -12914
8384 -12914 37363 148080 169401 72110 23503 91006 63276 -71135 -52291 46571 30917
8373 30917 -30553 29194 53921 50310 912 -8590 -6844 -1 33113 51619 56917 13218 6426
8360F426M1787O6218M9390j3528m8258m0341L9334Q7887p663J7457k1599K5952
8348B03062o820r2095n5011k2173L0612M8229L7739n9651m4125L6579l5104l3902
8336G340o323Q0894o162M4326p414q2761J202j9439Q601N1328K1735l3813n6023
8323C491r723J8575M1292M7720j2287j0265k3323J7022m5837p94Q657n07Q2017
8310A16038j6472M175o6660p4090l1747R8478L5571K3203O9102J2679p465r9762
8298F3050j01956m0126K8789K9892j7246L989M1818O8186K883n688J5413l4047
8286E4957r3859K4538J9786Q1594k4384n2288R872L4906P103J2287l0259n5857
8274a1604k4894M161j0586L3458k5512K7562L2411k9773l4605N1736n0807o899
$$ plain form
8360 6426 48213 114431 163821 150293 102035 61694 101028 188915 181252 198709 177110 203062
8348 203062 196242 104147 49136 26963 57575 105804 143543 83892 39767 76346 41242 7340
8336 7340 1017 81911 75749 120075 112661 29900 31102 11663 20264 71592 93327 59514 3491
8323 3491 -6232 12343 53635 101355 89068 78803 55480 72502 26665 25871 34528 34021 116038
8310 116038 99566 103741 37081 -37009 -68756 29722 65293 88496 157598 170277 162812 63050
8298 63050 -38906 -79032 -50243 -20351 -37597 -33608 8210 76396 79279 73591 89004 54957
8286 54957 -38902 -14364 5422 87016 62632 10344 20216 55122 62225 74512 44253 -11604
8274 -11604 -36498 -32337 -42923 -9465 -34977 -7415 24996 -4777 -39382 12354 -38453 -45352
8262d5352P2243O6842L6066M551M2419k9133j4650k3170L61k0382r3629n2360
8250e6194M6060M2189m9903K6524P220j7474k9933N07j9787N8205K7129N8519
8238I3062m2946k5108M3941j2174k3623J0843L2400m3815p0470L7591J023L3364
8226C4088J8203M065k6775M657L4495j0746q6200M3490L3566k9170j285l1780
8214a3392L4721M4616r031n0070m154l9986J0373O4183K3727K9468R72l1717p0988
8201a1278j2088O2885P2616m7253j07102m9698p837P956K1206o55L697l4933k3036
8188a25520M6641O3928N2544J6469N1773k9963r9022Q410J04264M5998l3205j3309
8176H9008K9739O8278J00471R5164K2709j8372r0396p7786o5009q1729O594l061
$$ plain form
8262 -45352 26891 93733 129799 134350 176769 147636 132986 109816 110177 89795 -3834 -56194
8250 -56194 -10134 32055 -17848 8676 15896 -1578 -31511 -31004 -50791 7414 34543 93062
8238 93062 50116 25008 68949 56775 33152 43995 76395 32580 -37890 -299 724 34088
8226 34088 52291 56356 29581 34238 68733 57987 -28213 15277 48843 19673 18388 -13392
8214 -13392 21329 65945 56914 6844 2690 -37296 -26923 37260 60987 90455 91427 59710 -11278
8201 -11278 -23366 39519 112135 64882 -42220 -91918 -99755 -91799 -70593 -71248 -67551 -102484 -125520
8188 -125520 -78879 -14951 37593 54062 105835 75872 -23150 -14740 89524 135522 102317 89008
8176 89008 118747 187025 287496 382660 405369 386997 296601 218815 153806 72077 78671 75610
8164G5610j6213q2257l1789M9287L8212j4929l2156K8041j9989N8153l192p5606
8152b6828j606J4066Q894o2284K780N7023J4859K8151N520o1986l029J03221M2197
8139A20978n988r784o44N7796K0936Q7827O6311M2273J3853j6371J3315j2814
8127C77688k9164r3171r3010l5274q5107j5326N3520J7787K785l167o876j6783
8115G3902j0179J4246j4213N574j2312m9524K7528n5640l3339M3887L913O310
8103A53L8504M285l0428k2494O4436M773M3726m0526j6376k2389M627M332J8822
8090E1445j1270k7517K9239K7022M095k0147m5438k3225N6822O361J5344L1421
8078I4152M6105L3629J1200M629l3314q6611K3938M6186K3911R213J06763J13413
$$ plain form
8164 75610 59397 -22860 -54649 -5362 32850 17921 -14235 13806 -6183 51970 48778 -26828
8152 -26828 -28434 -14368 -5474 -67758 -64978 -7955 6904 35055 40575 -21411 -24440 78781 120978
8139 120978 114990 105206 104562 162358 183294 271121 337432 379705 393558 377187 390502 377688
8127 377688 348524 255353 162343 127069 41962 26636 80156 97943 100728 97561 90685 73902
8115 73902 63723 77969 63756 69330 57018 7494 35022 -20618 -53957 -10070 -6157 153
8103 153 38657 42942 12514 -9980 54456 59229 102955 62429 46053 23664 28291 32623 51445
8090 51445 40175 12658 41897 68919 73014 52867 7429 -15796 41026 47387 62731 94152
8078 94152 140257 173886 185086 189715 156401 69790 93728 139914 163825 173038 279801 393214
8066C93214K0999P123K3109j556K7311n2324j7299M1727K9697L3916O7749M2660
$$ plain form
8066 393214 414213 421336 444445 442889 470200 417876 400577 442304 472001 505917 573666 616326
$$ [...]
##END NTUPLES=NMR SPECTRUM
##END=
