##TITLE=Analysis number 320403
Compound Code km 05818
Project Code adrs
Chemist Name endeavour
##JCAMPDX= 6.0         $$ Bruker NMR JCAMP-DX V2.0
##DATA TYPE= NMR SPECTRUM
##DATA CLASS= NTUPLES
##ORIGIN= Bruker BioSpin GmbH
##OWNER= nmr
$$ XWIN-NMR		Version 3.5
$$ Fri Jun 23 09:10:19 2006 GMT Daylight Time (UT+1h)  MAYBRIDGE\nmr@NMR_250MHZ
##.OBSERVE FREQUENCY= 250.131544655141
##.OBSERVE NUCLEUS= ^1H
##.ACQUISITION MODE= SIMULTANEOUS (DQD)
##.ACQUISITION SCHEME= undefined
##.AVERAGES= 16
##.DIGITISER RES= 18
##SPECTROMETER/DATA SYSTEM= dpx250
##.PULSE SEQUENCE= zg30
##.SOLVENT NAME= CDCl3
##.SHIFT REFERENCE= (INTERNAL, CDCl3, 0, 16.6756)
##AUDIT TRAIL= $$ (NUMBER, WHEN, WHO, WHERE, WHAT)
$$ ##TITLE= Audit trail, XWIN-NMR		Version 3.5
$$ ##JCAMPDX= 5.01
$$ ##ORIGIN= Bruker BioSpin GmbH
$$ ##OWNER= nmr
$$ C:\u/data/dgb/nmr/ADRS/1300/pdata/1/auditp.txt
$$ ##AUDIT TRAIL=  $$ (NUMBER, WHEN, WHO, WHERE, WHAT)
(   1,<2006-06-23 09:09:55.53 +100>,<MAYBRIDGE\nmr>,<NMR_250MHZ>,
      <created by zg, POWCHK disabled, PULCHK disabled
       configuration hash MD5:
       E2 DF 36 D8 04 B2 41 60 5A D7 A3 38 5A 4B D0 FE
       data hash MD5: 64K
       B2 8F 15 A6 59 08 69 29 70 98 38 6D 4D 5E 92 66>)
(   2,<2006-06-23 09:10:10.28 +100>,<MAYBRIDGE\nmr>,<NMR_250MHZ>,
      <Start of raw data processing
       ef LB = 0.3 FT_mod = 6 PKNL = 1 SI = 32K 
       data hash MD5: 32K
       99 25 7D AB 74 EA A3 6A E8 A5 18 46 77 F2 93 16>)
(   3,<2006-06-23 09:10:11.85 +100>,<MAYBRIDGE\nmr>,<NMR_250MHZ>,
      <apk 
       data hash MD5: 32K
       55 2B CA DD 93 25 1C D1 E0 FD 09 13 D9 B7 5B EC>)
(   4,<2006-06-23 09:10:12.58 +100>,<MAYBRIDGE\nmr>,<NMR_250MHZ>,
      <abs ABSG = 5 
       data hash MD5: 32K
       03 7E 92 43 1E 29 26 D0 06 4F D4 02 E4 9F 3B 54>)
$$ ##END=
$$ 
$$ hash MD5
$$ 34 13 25 B1 A6 36 72 F1 63 14 3D AA D2 77 FE 77
##$RELAX= 
##$RELAX= 
##$RELAX= 
##$RELAX= 
##$RELAX= 
##$RELAX= 
##$RELAX= 
$$ Bruker specific parameters
$$ --------------------------
##$DU= <C:\u>
##$EXPNO= 1300
##$NAME= <ADRS>
##$PROCNO= 1
##$TYPE= <nmr>
##$USER= <dgb>
##$AMP= (0..31)
100 100 100 100 100 100 100 100 100 100 100 100 100 100 100 100 100 100 
100 100 100 100 100 100 100 100 100 100 100 100 100 100 
##$AQSEQ= 0
##$AQ_mod= 3
##$AUNM= <au_zg>
##$AUTOPOS= <6 >
##$BF1= 250.13
##$BF2= 250.13
##$BF3= 250.13
##$BF4= 250.13
##$BF5= 500.13
##$BF6= 500.13
##$BF7= 500.13
##$BF8= 500.13
##$BYTORDA= 1
##$CFDGTYP= 0
##$CFRGTYP= 5
##$CHEMSTR= <none>
##$CNST= (0..31)
1 1 145 1 1 1 1 1 1 1 1 1 1 1 1 1 1 1 1 1 1 1 1 1 1 1 1 1 1 1 1 1 
##$CPDPRG= <>
##$CPDPRG1= <>
##$CPDPRG2= <>
##$CPDPRG3= <>
##$CPDPRG4= <mlev>
##$CPDPRG5= <mlev>
##$CPDPRG6= <mlev>
##$CPDPRG7= <mlev>
##$CPDPRG8= <mlev>
##$CPDPRGB= <>
##$CPDPRGT= <>
##$D= (0..31)
0 1 0 0 0 0 0 0 0 0.06 0 0 0 0 0 0 0.0002 0 0 0 0 0 0 0 0 0 0 0 0 0 0 
0 
##$DATE= 1151050194
##$DBL= (0..7)
120 120 120 120 120 120 120 120 
##$DBP= (0..7)
150 150 150 150 150 150 150 150 
##$DBP07= 0
##$DBPNAM0= <>
##$DBPNAM1= <>
##$DBPNAM2= <>
$$ [...]
##$SUBNAM7= <"">
##$SUBNAM8= <"">
##$SUBNAM9= <"">
##$SW= 20.6930455092707
##$SWIBOX= (0..15)
0 0 3 0 0 0 0 0 0 0 0 0 0 0 0 0 
##$SW_h= 5175.983436853
##$TD= 65536
##$TD0= 1
##$TE= 295.16
##$TE2= 300
##$TE3= 300
##$TEG= 300
##$TL= (0..7)
0 120 120 120 120 120 120 120 
##$TP= (0..7)
150 150 150 150 150 150 150 150 
##$TP07= 0
##$TPNAME0= <>
##$TPNAME1= <>
##$TPNAME2= <>
##$TPNAME3= <>
##$TPNAME4= <>
##$TPNAME5= <>
##$TPNAME6= <>
##$TPNAME7= <>
##$TPOAL= (0..7)
0.5 0.5 0.5 0.5 0.5 0.5 0.5 0.5 
##$TPOFFS= (0..7)
0 0 0 0 0 0 0 0 
##$TUNHIN= 0
##$TUNHOUT= 0
##$TUNXOUT= 0
##$USERA1= <user>
##$USERA2= <user>
##$USERA3= <user>
##$USERA4= <user>
##$USERA5= <user>
##$V9= 5
##$VALIST= <valist>
##$VCLIST= <CCCCCCCCCCCCCCC>
##$VD= 0
##$VDLIST= <DDDDDDDDDDDDDDD>
##$VPLIST= <PPPPPPPPPPPPPPP>
##$VTLIST= <TTTTTTTTTTTTTTT>
##$WBST= 1024
##$WBSW= 4
##$XGAIN= (0..3)
0 0 0 0 
##$XL= 0
##$YL= 0
##$YMAX_a= 680252
##$YMIN_a= -703535
##$ZGOPTNS= <>
##$ZL1= 120
##$ZL2= 120
##$ZL3= 120
##$ZL4= 120
##$ABSF1= 16.67556
##$ABSF2= -4.017616
##$ABSG= 5
##$ABSL= 3
##$ALPHA= 0
##$AQORDER= 0
##$ASSFAC= 0
##$ASSFACI= 0
##$ASSFACX= 0
##$ASSWID= 0
##$AUNMP= <proc_1d>
##$AZFE= 0.1
##$AZFW= 0.1
##$BCFW= 0
##$BC_mod= 0
##$BYTORDP= 0
##$COROFFS= 0
##$CY= 12.5
##$DATMOD= 1
##$DC= 0
##$DFILT= <>
##$DTYPP= 0
##$F1P= 14.0000005364418
##$F2P= -0.99999901652339
##$FCOR= 0.5
##$FTSIZE= 32768
##$FT_mod= 6
##$GAMMA= 0
##$GB= 0
##$INTBC= 1
##$INTSCL= 1
##$ISEN= 128
##$LB= 0.3
##$LEV0= 0
##$LPBIN= 0
##$MAXI= 10000
##$MC2= 0
##$MEAN= 0
##$ME_mod= 0
##$MI= 0
##$NCOEF= 0
##$NC_proc= -3
##$NLEV= 6
##$NOISF1= 0
##$NOISF2= 0
##$NSP= 0
##$NTH_PI= 0
##$NZP= 0
##$OFFSET= 16.67556
##$PC= 1
##$PHC0= 170.9551
##$PHC1= 4.816113
##$PH_mod= 1
##$PKNL= yes
##$PPARMOD= 0
##$PSCAL= 4
##$PSIGN= 0
##$REVERSE= no
##$SF= 250.129961589598
##$SI= 32768
##$SIGF1= 0
##$SIGF2= 0
##$SINO= 400
##$SIOLD= 32768
##$SREGLST= <1H.CDCl3>
##$SSB= 0
##$STSI= 32768
##$STSR= 0
##$SW_p= 5175.98343685301
##$SYMM= 0
##$S_DEV= 0
##$TDeff= 65536
##$TDoff= 0
##$TI= <Analysis number 999999
Compound Code 99
Book Reference 9
Project Code 9>
##$TILT= no
##$TM1= 0
##$TM2= 0
##$TOPLEV= 0
##$USERP1= <user>
##$USERP2= <user>
##$USERP3= <user>
##$USERP4= <user>
##$USERP5= <user>
##$WDW= 1
##$XDIM= 32768
##$YMAX_p= 285749502
##$YMIN_p= -51677
$$ End of Bruker specific parameters
$$ ---------------------------------
##NTUPLES= NMR SPECTRUM
##VAR_NAME=  FREQUENCY,     SPECTRUM/REAL,   SPECTRUM/IMAG
##SYMBOL=    X,             R,               I
##VAR_TYPE=  INDEPENDENT,   DEPENDENT,       DEPENDENT
##VAR_FORM=  AFFN,          ASDF,            ASDF
##VAR_DIM=   32768,         32768,           32768
##UNITS=     HZ,            ARBITRARY UNITS, ARBITRARY UNITS
##FACTOR=    0.157963299565203, 1,           1
##FIRST=     4171.05718167437, 0,            0
##LAST=      -1004.92625517864, 0,           0
##MIN=       -1004.92625517864, -51677,      0
##MAX=       4171.05718167437, 285749502,    0
$$ Real data points
##PAGE= N=1
##DATA TABLE= (X++(R..R)), XYDATA
$$ [...]
13883G255l489o336L392r574l022J039p376m720l073P062J5246O327r163o701
$$ 7255 3766 -2570 822 -8752 -11774 -10735 -18111 -22831 -25904 -18842 -3596 2731 -6432 -13133
13869a3133J3968j03K481L009k88m862n151m71p288J186K4761M731q819r105J685
$$ -13133 835 732 3213 6222 5934 1072 -4079 -4550 -11838 -10652 14109 18840 10021 916 2601
13854B601j614l446N664R181l640j0082q711K823o69o99K827J5383K0849L807
$$ 2601 987 -2459 3205 12386 8746 -1336 -10047 -7224 -7893 -8592 -5765 9618 30467 34274
13840C4274k4893j3225l270J879j0050M282K4297r022l646j1633n918P008J0986
$$ 34274 9381 -3844 -7114 -5235 -15285 -11003 13294 4272 626 -11007 -16925 -9917 1069
13827A069O049n119O581P77j1407j4229j082N345p393l768Q416l705l149J1409
$$ 1069 7118 1999 8580 9357 -2050 -16279 -17361 -12016 -19409 -23177 -14761 -18466 -21615 -10206
13813a0206P405J4164L934n873J26p838j302j754j0372M003L1527p973k0805k5130
$$ -10206 -2801 11363 15297 9424 9550 1712 410 -1344 -11716 -7713 23814 15841 -4964 -30094
13799c0094q789J3640R247n260n916R600J9491j3907n035J1578l835J104O860
$$ -30094 -38883 -25243 -15996 -21256 -27172 -17572 1919 -11988 -17023 -5445 -9280 -8176 -1316
13786a316n222j0083j987O767j921K663M847R59j1316L503J4693l632l337J0609
$$ -1316 -6538 -16621 -18608 -11841 -13762 -11099 -6252 -5293 -16609 -13106 1587 -2045 -5382 5227
13772E227J4121O828l291j357J462j1048J056r942R23n886Q013K953q668p483
$$ 5227 19348 26176 22885 21528 22990 11942 12998 3056 3979 -1907 6106 9059 391 -7092
13758g092J495j30O815l259p883l869Q180q60P82l444n437j470K712J2522j0203
$$ -7092 -5597 -5727 1088 -2171 -10054 -13923 -5743 -6603 -5821 -9265 -14702 -16172 -13460 -938 -11141
13743a1141r218L586J1034J4109j7690j5708O546K973J1245J4771P336p203M072
$$ -11141 -20359 -16773 -5739 8370 -9320 -25028 -18482 -15509 -4264 10507 17843 10640 14712
13730A4712j0105r628M76N602o613j3678j0337J419R373R177J3248k115r996p260
$$ 14712 4607 -5021 -4545 1057 -5556 -19234 -29571 -28152 -18779 -9602 3646 1531 -8465 -15725
13716a5725N873L112J239o297m950N810K978J0193J0525Q745k580J0667j8422
$$ -15725 -9852 -6740 -5501 -11798 -16748 -10938 -7960 2233 12758 21503 18923 29590 11168
13703A1168k1162j6960O227L067J848P382P323J3120j6626k1190j252l180K008
$$ 11168 -9994 -26954 -20727 -17660 -15812 -8430 -1107 12013 -4613 -25803 -27055 -30235 -28227
13690b8227M010J2827O219L857j266L021J0602q725j3083J773L212L926N244j1298
$$ -28227 -24217 -11390 -5171 -1314 -2580 441 11043 2318 -10765 -8992 -5780 -1854 3390 -7908
13676g908j3429K207J6072p73r192O31K936N099J1681K951j3151P94M597m221
$$ -7908 -21337 -19130 -3058 -3831 -13023 -12392 -9456 -4357 7324 10275 -2876 -2082 2515 -1706
13662a706j5526q813j297j935J1732J5386J847J690L489o388j3069j5256m210
$$ -1706 -17232 -26045 -27342 -29277 -17545 -2159 -312 1378 4867 -1521 -14590 -29846 -34056
13649c4056J2331J9728l81o463L223r924j974J7909K013l813j2750L867J697m324
$$ -34056 -21725 -1997 -2378 -8841 -5618 -15542 -17516 393 2406 -1407 -14157 -10290 -8593 -12917
13635a2917J950M164J4678P831r063k1392j651J7343m590j4052m283J3473L522
$$ -12917 -10967 -6803 7875 15706 6643 -14749 -16400 943 -3647 -17699 -21982 -8509 -4987
13622d987N611J037j0163l905j3770O676J2776k681Q785M580M723J1372M486j0026
$$ -4987 624 1661 -8502 -12407 -26177 -19501 -6725 -9406 -621 3959 8682 20054 24540 14514
13608A4514k76j044L387m650m647m771M635O136n752j0275q234n44O513m712j3902
$$ 14514 14238 13194 16581 11931 7284 2513 7148 13284 7532 -2743 -10977 -11521 -5008 -9720 -23622
13593b3622j2617m444J855M670J9139Q230k80P480Q316j0331J212p899j1546O241
$$ -23622 -36239 -40683 -38828 -34158 -15019 -6789 -7069 411 8727 -1604 -392 -8291 -19837 -13596
13579a3596R594N924j729J283j1915J360j046J693L981m887o999L793K470N681
$$ -13596 -4002 1922 193 1476 -10439 -9079 -10125 -8432 -4451 -9338 -16337 -12544 -10074 -4393
13565d393O738j1767n484J6970L659O020n484m860n100J691j2629m825k709J3707
$$ -4393 2345 -9422 -14906 2064 5723 11743 6259 1399 -3701 -2010 -14639 -19464 -22173 -8466
13551h466n253r263o91j480K293K588L198K101k864R41p824O71r915l740J7522
$$ -8466 -13719 -22982 -23673 -25153 -22860 -20272 -17074 -14973 -17837 -16896 -24720 -24049 -33964 -37704 -20182
13536b0182J0777R15p713J6764L664r701j3225l420J6489l529m958n371j183J193
$$ -20182 -9405 -8490 -16203 561 4225 -5476 -18701 -22121 -5632 -9161 -14119 -19490 -20673 -19480
13522a9480r78P151J346l843K2896J0927l206j477L00Q748J952N236m530j3432
$$ -19480 -20458 -13307 -11961 -15804 7092 18019 14813 13336 13636 22384 24336 29572 25042 11610
13508A1610o141j22j1665l225Q756m975Q928j0294o85M0o558M113J1202Q585j1112
$$ 11610 5469 5347 -6318 -9543 -787 -5762 3166 -7128 -7813 -7773 -14331 -10218 984 9569 -1543
13493a543o599j981m059j0016R26l879J769P062P416M975m844L744p451J5347
$$ -1543 -8142 -10123 -14182 -24198 -23272 -27151 -25382 -18320 -10904 -5929 -10773 -7029 -14480 867
13479H67N288r058o701k250O293j626R156k0073j480J4666p661l814J6552K720
$$ 867 6155 -2903 -9604 -11854 -5561 -7187 1969 -18104 -19584 -4918 -12579 -16393 159 2879
13465B879N276J1839l145j3606j1098J0365J1264l769o362j848Q63q618j501J3444
$$ 2879 8155 19994 16849 3243 -7855 2510 13774 10005 3643 1795 2658 -5960 -7461 5983
13451E983J3158j1517r877R716r020j1567m017j5R796J2423K714N203j2819n594
$$ 5983 19141 7624 -2253 7463 -1557 -13124 -17141 -17156 -7360 5063 7777 12980 161 -5433
13437e433O981n707L195O438j5106j5467J255J3637O916n114k982P469Q614k12
$$ -5433 1548 -4159 -964 5474 -9632 -25099 -23844 -10207 -3291 -8405 -11387 -3918 4696 4484
13423D484O41j1889L526K700M69j3311n234k355M525p168J0780N555J999N837
$$ 4484 5125 -6764 -3238 -538 -69 -13380 -18614 -20969 -16444 -23612 -12832 -7277 -5278 559
13409E59j6063l564L404J5287K098M002Q878L166q240j943q491j0637j34k71L278
$$ 559 -15504 -19068 -15664 -377 1721 5723 14601 17767 9527 7584 -907 -11544 -11678 -11949 -8671
13394h671M930J447j6566k793J5614J1099q799K631Q719k542M929J172n308P43
$$ -8671 -3741 -2294 -18860 -21653 -6039 5060 -3739 -1108 7611 5069 9998 11170 5862 6605
13380F605r198q33J0409o981q913k816N405K344K466k699j585k309L046j3959
$$ 6605 -2593 -3426 6983 2 -8911 -11727 -6322 -3978 -1512 -4211 -5796 -8105 -5059 -19018
13366a9018j1619N682J8011O807q730k397j1368Q84N190J4228l786o510O534J847
$$ -19018 -30637 -24955 -6944 -137 -8867 -11264 -22632 -21748 -16558 -2330 -6116 -12626 -6092 -4245
13352d245n209n583Q049J6213r785q648P474J390j7224o987P128o14q693J5246
$$ -4245 -9454 -15037 -6988 9225 -560 -9208 -1734 -344 -17568 -24555 -17427 -18041 -26734 -11488
13338a1488J0595q150O669L291j2194l523P887K467N510j874j3220k637K857K171
$$ -11488 -893 -9043 -2374 917 -11277 -14800 -6913 -4446 1064 -810 -14030 -16667 -13810 -11639
13324a1639P415N786m869o976M421J0290j2076j675L250O475M256r52k641n419
$$ -11639 -4224 1562 -3307 -10283 -5862 4428 -7648 -9323 -6073 402 4658 3706 1065 -4354
13310d354l622l122j0261J160R559L628K556Q905l678k3030O51R913J2181N668
$$ -4354 -7976 -11098 -21359 -20199 -10640 -7012 -4456 4449 771 -22259 -21608 -11695 486 6154
13296F154j906j4631j2962o85J6124O137Q780k947j7269K595K1657o069l590K593
$$ 6154 4248 -10383 -23345 -24030 -7906 -1769 7011 4064 -13205 -10610 11047 4978 1388 3981
13282C981Q893P733N807P488j1845j5312o204q526M385L012L719n58Q41M777q682
$$ 3981 12874 20607 26414 33902 22057 6745 541 -7985 -3600 -588 3131 2573 3414 8191 -491
13267d91n105n394l734k128O97K801r567j2676l789J3517J1387O347M383q536
$$ -491 -5596 -10990 -14724 -16852 -16155 -13354 -22921 -35597 -39386 -25869 -14482 -8135 -3752 -12288
13253a2288J030k211O0j493O481j35Q85K164r23j0011q402j968P955J399n380
$$ -12288 -11258 -13469 -13409 -14902 -8421 -8556 -7671 -5507 -6430 -16441 -24843 -26811 -18856 -17457 -22837
13238b2837L466J3809k757m538L723j125K45m249L955K525J1141M262P150j832
$$ -22837 -19371 -5562 -8319 -12857 -9134 -10259 -10014 -14263 -10308 -7783 3358 7620 14770 12938
13224A2938j6778R19K4874n884k977M582k83j7061m705K257J742J1070K365o880
$$ 12938 -3840 -2921 21953 16069 13092 17674 17391 330 -4375 -2118 -376 10694 13059 6179
13210F179k24p491N795k491L464J0418j0855j6084J574O593K074M384N299J2935
$$ 6179 5955 -1536 4259 1768 5232 15650 4795 -11289 -9715 -3122 -1048 3336 8635 21570
13196B1570k647m998J420j6861k2287J0258J0408n664m264p746J0218J963o483
$$ 21570 18923 13925 15345 -1516 -23803 -13545 -3137 -8801 -13065 -20811 -10593 -8630 -15113
13183a5113j1277n644M399J6865j954j885l754m699o403q724O248K1241J2833
$$ -15113 -26390 -32034 -27635 -10770 -12724 -14609 -18363 -23062 -29465 -38189 -31941 -10700 2133
13170B133n632n416k1737O108R238J936R356M92o648k3285L957J2854J9690Q603
$$ 2133 -3499 -8915 -30652 -24544 -15306 -13370 -4014 -3522 -10170 -33455 -29498 -16644 3046 11649
13156A1649q96q665r02J8532Q56k0370l295j181j768P4K85r376j0864P826K0700
$$ 11649 10753 2088 1186 19718 20574 204 -3091 -4272 -6040 -5966 -5681 -15057 -25921 -18095 2605
13141B605N616o501J768o368N67j3078N379O640Q206o806R85n658M280M726J5225
$$ 2605 8221 1720 3488 -2880 -2313 -15391 -10012 -3372 4834 -1972 -987 -6645 -2365 2361 17586
13126A7586K368j8017q323j7617r099o992O371J6920L106l59L720j809k142j8734
$$ 17586 19954 1937 -6386 -24003 -33102 -40094 -33723 -16803 -13697 -14056 -10336 -12145 -14287 -33021
13112c3021j2105n682J1379J4659K302L82J0471K1185r153o512O166j618k5579
$$ -33021 -45126 -50808 -39429 -24770 -22468 -22086 -11615 9570 417 -6095 71 -1547 -27126
13099b7126j250J0394K569J5418L62m47L441P77l615J99K524N96J236n826L033
$$ -27126 -28376 -17982 -15413 5 367 -80 3361 4138 523 722 3246 3842 5078 -748 2285
13084B285j364n221j6664l822R344K418Q123M728m654J0026N748k724m897N745
$$ 2285 921 -4300 -20964 -24786 -15442 -13024 -4901 -173 -4827 5199 10947 8223 3326 9071
13070I071n320k2505O693R070j323k56K631O123j1248j0553K478L843p343K770
$$ 9071 3751 -18754 -12061 -2991 -4314 -4570 -1939 4184 -7064 -17617 -15139 -11296 -18639 -15869
13056a5869J1706J4610K077m939k3186j379N584K901k571n772J783Q113j1242
$$ -15869 -4163 10447 12524 7585 -15601 -16980 -11396 -8495 -11066 -16838 -15055 -6942 -18184
13043a8184L560J61k002J5491N275n819j5694p816O688m82k140J3736N714J0621
$$ -18184 -14624 -14463 -16465 -974 4301 -1518 -17212 -25028 -18340 -18822 -20962 -7226 -1512 9109
13029I109J0513o378O68m571j251J136L203j5785p491L115p529K250K037O260
$$ 9109 19622 13244 13912 9341 8090 9226 12429 -3356 -10847 -7732 -15261 -13011 -10974 -4714
13015d714K407j300k1405l09L578m692m57O025J0022L96L782J7516R552k2458
$$ -4714 -2307 -3607 -25012 -25321 -21743 -26435 -26892 -20867 -10845 -10449 -6667 10849 20401 -2057
13001b057j3499N456K457J0355J077P39J2475J863j7990n561j185q651O22M440
$$ -2057 -15556 -10100 -7643 2712 3789 4528 17003 18866 876 -4685 -5870 -14521 -13899 -9459
12987i459J842j54p019Q167L638m795Q193l608n270J1443N178k751o8O128J549
$$ -9459 -7617 -7771 -14790 -6623 -2985 -7780 413 -3195 -8465 2978 8156 5405 5337 11465 13014
12972A3014L606m086m082M758P824p977l51l869N569l016k872m49q092k095q510
$$ 13014 16620 12534 8452 13210 21034 13057 12706 8837 14406 11390 8518 8069 -23 -2118 -10628
12957a0628J186j687j292J03J0379J3596m204k5057M525J9556O005K017n659j8514
$$ -10628 -9442 -11129 -12421 -12318 -1939 11657 7453 -17604 -13079 6477 12482 14499 8840 -9674
12943i674k4214N077N894M656M34P073m752l769M824J1552L604p157K885J4029
$$ -9674 -33888 -28811 -22917 -18261 -17827 -10754 -15506 -19275 -14451 -2899 705 -6452 -3567 10462
12929A0462M95J866r932m370L206J115k162J211k882O49q301n141K834R04L855
$$ 10462 10957 12823 2891 -1479 1727 2842 680 1891 -991 -342 -8643 -13784 -10950 -10046 -6191
12914f191q351K794J0102J0673q000j5536j165J6097M954j4276J133M229J2455
$$ -6191 -14542 -11748 -1646 9027 1027 -14509 -15674 423 5377 -8899 -7766 -3537 8918
12901H918p28L73K268o201J3494k080j4945M35J1417j0044j7551j093R273N514
$$ 8918 8190 8563 10831 4630 18124 16044 1099 1534 12951 2907 -14644 -15737 -6464 -950
12887i50Q341L774o436M203m086j4088J660Q724n073O47k766j0021o764R83J0325
$$ -950 7391 11165 4729 8932 4846 -9242 -7582 1142 -3931 -3284 -6050 -16071 -22835 -21852 -11527
12872a1527P176K022o208J0654J4241k3403j7841J2612J1234J1014l100j2888
$$ -11527 -4351 -2329 -8537 2117 16358 -7045 -24886 -12274 -1040 9974 6874 -6014
12860f014j1956N016O413N385m96j8094k225Q749J4037k772k312l612j2938j4600
$$ -6014 -17970 -12954 -6541 -1156 -1652 -19746 -21971 -13222 815 -1957 -4269 -7881 -20819 -35419
12846c5419M936J0006L007j2611q546J8126J6327m952j0510M911R903R948M034
$$ -35419 -30483 -20477 -17470 -30081 -38627 -20501 -4174 -9126 -19636 -14725 -4822 5126 9160
12833I160P83N924q180j0285r33j1005j1000l747K4328L612o076J6862L720q494
$$ 9160 9943 15867 7687 -2598 -3531 -14536 -25536 -29283 -4955 -1343 -7419 9443 13163 4669
12819D669J443J604k1439P4N724L802Q57N109j5782k237Q516k70M319q63m767
$$ 4669 6112 7716 -13723 -13649 -7925 -4123 -3266 1843 -13939 -16176 -7660 -7930 -3611 -4474 -9241
12804i241K837J653l65L594Q339j2228l637O869k755L506J0373p36l691m967M493
$$ -9241 -6404 -4751 -5116 -1522 6817 -5411 -9048 -2179 -4934 -1428 8945 8209 4518 -449 4044
12789D044r620r522j785O352J3035O480K589j1516o52R853j0122j3786m338L909
$$ 4044 -5576 -15098 -16883 -10531 2504 8984 11573 57 -595 9258 -864 -14650 -18988 -15079
12775a5079J7860j784l60N538n977l781N747N690R200j15P990o615m396j0790
$$ -15079 2781 997 637 6175 198 -3583 2164 7854 17054 16939 24929 18314 13918 3128
12761C128K181m261j116P417q470m240J1149K628n455P459K952M357L148J1788
$$ 3128 5309 1048 -68 7349 -1121 -5361 5788 8416 2961 10420 13372 17729 20877 32665
12747C2665j0545j6948k216n765l695K019J345j0605P64J1893N224R018N589m139
$$ 32665 22120 5172 2956 -2809 -6504 -4485 -3140 -13745 -12981 -1088 4136 13154 18743 14604
12733A4604j6076r12J1068j004k662l371J045p471p777j1504J1416N904J2157
$$ 14604 -1472 -2384 8684 7680 5018 1647 2692 -4779 -12556 -24060 -12644 -6740 5417
12720E417K0836J49k2670j930j944O219J5707j15l859j0852N159j6652l60J819
$$ 5417 26253 26402 3732 1802 -142 6077 21784 21669 17810 6958 12117 -4535 -4895 -3076
12706c076m788J201o475o238R063l277m996M053J223p738N008J099r69O439J599
$$ -3076 -7864 -6663 -13138 -19376 -10313 -13590 -18586 -14533 -13310 -21048 -16040 -14941 -15910 -9471 -7872
12691g872P81L036m846J223k412K0461J1713Q390o527j8275r487o654n160L059
$$ -7872 -7091 -4055 -8901 -7678 -10090 10371 22084 30474 23947 5672 -3815 -10469 -15629 -12570
12677a2570n589N508m441o916k250K982N387l786j169J1665L692Q508J336L770
$$ -12570 -18159 -12651 -17092 -24008 -26258 -23276 -17889 -21675 -22844 -11179 -7487 1021 2357 6127
12663F127j6598j331L841O102j0229q438J4131K218m604J914J2278M579r154j4592
$$ 6127 -10471 -11802 -7961 -1859 -12088 -20526 -6395 -4177 -8781 -6867 5411 9990 836 -13756
12649a3756O882J9996M815O57q29J141O19r02j4117O287J0393j8292q622k473
$$ -13756 -6874 13122 17937 18594 17765 18906 19525 18623 4506 10793 21186 2894 -5728 -8201
12635h201O169j5070O405L290K484m033m558J1540R438l550l856n511P109r648
$$ -8201 -2032 -17102 -10697 -7407 -4923 -8956 -13514 -1974 7464 3914 58 -5453 1656 -7992
12621g992j716q130J0533N709J074J9844L695q044k0457N999q93R486q010j3431
$$ -7992 -9708 -17838 -7305 -1596 -522 19322 23017 14973 -5484 515 -378 9108 1098 -12333
12607a2333k805M964J1860j590J8046k866n576J005j2486m80j095j1838K973J5802
$$ -12333 -15138 -10174 1686 96 18142 15276 9700 10705 -1781 -2261 -3356 -15194 -12221 3581
12593C581J2881q895j2453l396l449K343R916K1115N183j1126j1123j3409N099
$$ 3581 16462 7567 -4886 -8282 -11731 -9388 528 21643 26826 15700 4577 -8832 -3733
12580c733P452o439l168O704l364p43m015J4006J0990N515p579j3173O357J4162
$$ -3733 3719 -2720 -5888 816 -2548 -3291 -7306 6700 17690 23205 15626 2453 8810 22972
12566B2972j717k2020j2693l627j776o485j577N53Q355J3362J331O97j858N33
$$ 22972 21255 -765 -13458 -17085 -18861 -25346 -26923 -26370 -18015 -4653 -3322 -2625 -4483 -3950
12552c950L429M813q508j3522K235K4923o53j4423J826Q034l824J1918J4176O18
$$ -3950 -521 4292 -4216 -17738 -15503 9420 8767 -5656 -3830 4204 380 12298 26474 27092
12538B7092o375k835q750j3099M139m01P721J257R90q401p707l081r309o088L705
$$ 27092 20717 17882 9132 -3967 172 -229 7492 8749 9739 1338 -6369 -9450 -18759 -24847 -21142
12523b1142j650P422N995j040p37K038o668O291J3221O050J342l808j029Q729
$$ -21142 -22792 -15370 -9375 -10415 -11152 -9114 -15782 -9491 3730 9780 11122 7314 6285 15014
12509A5014n318N037p396L960k159j640j3534m198L169J643L888K921O114J336
$$ 15014 9696 14733 7337 11297 9138 7498 -6036 -10234 -7065 -5422 -1534 1387 7501 8837
12495H837N576j613p120J0656O939P954q017p091o292k550n851J556q098j3850
$$ 8837 14413 12800 5680 16336 23275 31229 23212 16121 9829 7279 1428 2984 -5114 -18964
12481a8964m649j759J5850J4982q855r237m687J932n075p322o799K137M629K711
$$ -18964 -23613 -25372 -9522 5460 -3395 -12632 -17319 -15387 -20462 -27784 -34583 -32446 -27817 -25106
12467b5106j765n086j727j32p336o230L754P999R886N280M0J5057m154p500J2094
$$ -25106 -26871 -31957 -33684 -33816 -41152 -47382 -43628 -35629 -25743 -20463 -20423 -5366 -9520 -17020 -4926
12452d926J0680j2493l466p493N871K084r067j1890r81M523K1418l789P311k400
$$ -4926 5754 -6739 -10205 -17698 -11827 -9743 -18810 -30700 -31681 -27158 -5740 -9529 -2218 -4618
12438d618j4291N444J7421O791m527M974k505p281M214m106m275O716l110N224
$$ -4618 -18909 -13465 3956 10747 6220 11194 8689 1408 5622 1516 -2759 3957 847 6071
12424F071J9731P516j2347J94q02J297p230j1577k286N669J0869j698n805m266
$$ 6071 25802 33318 20971 21165 20363 21660 14430 2853 567 6236 17105 15407 9602 5336
12410E336Q147J6390n120k103O01k8309N639J1009j3005k125n770J2174K708q772
$$ 5336 13483 29873 24753 22650 23251 -5058 581 11590 -1415 -3540 -9310 2864 5572 -3200
12396c200M615N929j50J157J90j0887r020p170K727R003N704j796j953k870J850
$$ -3200 1415 7344 7194 8351 8541 -2346 -11366 -18536 -15809 -6806 -1102 -2898 -4851 -7721 -5871
12381e871M763M175n4R689K085j875Q4M297q616p044J58Q347J6888Q00O753k28
$$ -5871 -1108 3067 3013 12702 14787 12912 12996 17293 8677 1633 1791 10138 27026 27826 34579 34351
12365C4351j1374r938j3862J459J4255K26q117q727p665p9J004N289R567o096
$$ 34351 22977 13039 -823 636 14891 15117 7000 -1727 -9392 -9471 -8467 -3178 6389 293
12351B93j0092R321o270l730J3266l35r884j2178l392m961k54j781O702J4064
$$ 293 -9799 -478 -6748 -10478 2788 2453 -7431 -19609 -23001 -27962 -28216 -29997 -23295 -9231
12337i231J703N433R537L109O602j23r216p317o383K234M153n769j7772k490J697
$$ -9231 -7528 -2095 7442 10551 17153 17030 7814 497 -5886 -3652 501 -5268 -23040 -25530 -23833
12322b3833K0457R78q121N424J851N363R249L173m247j456N983O756k762j5136
$$ -23833 -3376 -2398 -10519 -5095 -3244 2119 11368 14541 10294 8838 14821 21577 18815 3679
12308C679K02Q149p67m287o811r911q509O130k98L863M712l887L901K495L512
$$ 3679 3881 12030 11263 6976 165 -9746 -18255 -12125 -12423 -8560 -3848 -7735 -3834 -1339 2173
12293B173O260k1106n475j398p176r250R334P720Q672J0922J324k556K429O629
$$ 2173 8433 -12673 -18148 -19546 -26722 -35972 -26638 -18918 -10246 676 2000 -556 1873 8502
12279H502J0025Q600J463r996j4337p964L701n533m490J852N022Q298k678R035
$$ 8502 18527 27127 28590 18594 4257 -3707 -6 -5539 -10029 -8177 -3155 5143 2465 11500
12265A1500L669j652l78m004j6362j3191m425p2j461O392J2017n64q82p875J426
$$ 11500 15169 13517 13139 9135 -7227 -20418 -24843 -24915 -26376 -19984 -7967 -8531 -9413 -17288 -15862
12250a5862P73J3760N8J065J4638j2774o446R780p507m720k693N804L412m926
$$ -15862 -15089 -1329 -1271 -206 14432 1658 -4788 4992 -2515 -7235 -9928 -4124 -712 -5638
12236e638M120r72j3244J2386K1023O900j4650j1685K092N062J3140P645m060
$$ -5638 -1518 -2490 -15734 -3348 17675 24575 9925 -1760 332 5394 18534 26179 22119
12223B2119p749j3564j0512j76R101J1158k116j148N313j3659k4864J840J4269
$$ 22119 14370 806 -9706 -9882 -781 10377 8261 7113 12426 -1233 -26097 -24257 -9988
12210i988J8940j982j9222L69R121K784M638n895j4379m235K085M221J1971j618
$$ -9988 8952 6970 -12252 -11883 -2762 22 4660 -1235 -15614 -19849 -17764 -13543 -1572 -3190
12196c190K06M799j970j879o228m354J1502L716n703Q29j1356J233N453j882m383
$$ -3190 -2984 1815 -155 -2034 -8262 -12616 -1114 2602 -3101 -2272 -13628 -12395 -6942 -8824 -13207
12181a3207N271N535O467M541K187m762p073j2589K301l289p649p04J1189J0628
$$ -13207 -7936 -2401 4066 8607 10794 6032 -1041 -13630 -11329 -14618 -22267 -22971 -11782 -1154
12167a154p06K528m550J940O507N640m637j1746p008J2875J3215k585j1469k983
$$ -1154 -1860 668 -3882 -1942 4565 10205 5568 -6178 -13186 -311 12904 10319 -1150 -4133
12153d133j0512R511J4776n531j5041j3323J2572M257k366m281P829J5328R774
$$ -4133 -14645 -5134 9642 4111 -10930 -24253 -11681 -7424 -9790 -14071 -6242 9086 18860
12140A8860j4062n715K948N297R132k869j6433K038K182l854o472L291K859J1621
$$ 18860 4798 -917 2031 7328 16460 13591 -2842 -804 1378 -2476 -8948 -5657 -2798 8823
12126H823k418Q243r330m025k26J670r796M967L744N933J2042j102j3357k400
$$ 8823 6405 14648 5318 1293 1067 2737 -7059 -2092 1652 7585 19627 18525 5168 2768
12112B768j140J10O354M704j9581j0327N175J696L303K709K182n632O875k246
$$ 2768 1628 1738 8092 12796 -6785 -17112 -11937 -10241 -6938 -4229 -2047 -7679 -804 -3050
12098c050P528N095M13m506O378N785L53k5127j3072n340k155J5124R883o612
$$ -3050 4478 9573 9986 5480 11858 17643 17996 -7131 -20203 -25543 -27698 -12574 -2691 -9303
12084i303l639P736J4931J2469m410j2408M023K047p511m616k584j8759j1945
$$ -9303 -12942 -5206 9725 22194 17784 5376 9399 11446 3935 -681 -3265 -22024 -33969
12071c3969p882K4681N814j4079j1074R47R178J9643K5991r955m297J098l438
$$ -33969 -41851 -17170 -11356 -25435 -36509 -35562 -26384 -6741 19250 9295 4998 6096 2658
12058B658K92J6882O870j6096k072K464K19K532J2424k211q326o050o001K222
$$ 2658 2950 19832 26702 10606 8534 10998 11217 13749 26173 23962 15636 9586 3585 5807
12044E807m410r051l363J2783N644L458K885j2973O47m542P289J4970l042j9355
$$ 5807 1397 -7654 -11017 1766 7410 10868 13753 780 1427 -3115 4174 19144 16102 -3253
12030c253J245J4623N516n695k0622j088J0226K133K504j4941m611L205N526j2864
$$ -3253 -2008 12615 18131 12436 -8186 -9274 952 3085 5589 -9352 -13963 -10758 -5232 -18096
12016a8096o582K4409J0466L377m011M590m043q235L80l641k508l329J591k723
$$ -18096 -24678 -269 10197 13574 9563 14153 10110 1875 2255 -1386 -3894 -7223 -5632 -8355
12002h355M806P023L43r81L304j3744k675J1896j381P32M950J600K669l603p964
$$ -8355 -3549 3474 3817 2836 6140 -7604 -10279 1617 236 968 5918 7518 10187 6584 -1380
11987a380j6585j906r926P08P964Q984P234q045L832P456l112r106N013J290R708
$$ -1380 -17965 -19871 -29797 -29089 -21125 -12141 -4907 -12952 -9120 -1664 -4776 -13882 -8869 -7579 2129
11972B129M584N146l907o286l827n058R150Q365j2760j5789j0277J6538J5142
$$ 2129 6713 11859 7952 1666 -2161 -7219 1931 10296 -2464 -18253 -28530 -11992 3150
11959C150M337j529K993J953j993l515r770j5502K340k082Q626L482l009N030
$$ 3150 7487 5958 8951 10904 8911 5396 -4374 -19876 -17536 -19618 -10992 -7510 -10519 -5489
11945e489m734P45r288K482k068r55J748J0474r87N2P909k22M472j1050k095J084
$$ -5489 -10223 -9478 -18766 -16284 -18352 -19307 -17559 -7085 -8072 -8020 -111 -333 4139 -6911 -9006 -7922
11929g922J0597N302J6234K931p477q449K91q482n885P596J1275p929Q1m408k559
$$ -7922 2675 7977 24211 27142 19665 11216 11507 3025 -2860 4736 16011 8082 8163 3755 1196
11914A196l425k510n971j1541Q436O626P591L192k307m834O411J1407m661j6305
$$ 1196 -2229 -4739 -10710 -22251 -13815 -7189 402 3594 1287 -3547 2864 14271 9610 -6695
11900f695j6344Q869j059R590l267P154n015Q90O657K269j1271q108P793J0380
$$ -6695 -23039 -14170 -15229 -5639 -8906 -1752 -6767 -5877 780 3049 -8222 -16330 -8537 1843
11886A843J4717l741j1402p610j03O091j5038j2989J6225J5946l976J4251Q99
$$ 1843 16560 12819 1417 -6193 -6296 -205 -15243 -28232 -12007 3939 -37 14214 15113
11873A5113j1376k960q454o644l041P945Q350J3206K167j149j132r025O074J9441
$$ 15113 3737 777 -7677 -14321 -17362 -9417 -1067 12139 14306 13157 12025 3000 9074 28515
11859B8515N784r301j4958m875K028J179n28K432q850r617L662Q645m880N69Q307
$$ 28515 34299 24998 10040 5165 7193 8372 7844 10276 1426 -8191 -4529 4116 -764 -195 8112
11844H112q766j0699k851L879Q434J0676j8121J913J6639l675j0865l772J1835
$$ 8112 -654 -11353 -14204 -10325 -1891 8785 -9336 -7423 9216 5541 -5324 -9096 2739
11831B739O754m109N938l656j5737m114j13M566K254N909O745M892m1J963l213
$$ 2739 9493 5384 11322 7666 -8071 -12185 -12298 -7732 -5478 431 7176 12068 12027 13990 10777
11816A0777N691r979j4334j376q73K086M940J1620J3985k559q635k3261j81L193
$$ 10777 16468 6489 -7845 -9221 -10094 -8008 -3068 8552 22537 19978 11343 -11918 -12099 -8906
11802h906m334q412o219O180q33o90J1267P356J3485p226j3072O585q481K463
$$ -8906 -13240 -21652 -27871 -21691 -22524 -23214 -11947 -4591 8894 1668 -11404 -4819 -13300 -10837
11788a0837q275n520J632N79L250l3J004r89L209O269J4491r626r244K531J1240
$$ -10837 -19112 -24632 -23000 -22421 -19171 -19204 -18200 -19189 -15980 -9711 4780 -4846 -14090 -11559 -319
11773c19N151J0797L165j8458l268K714N117L42P265M325j4855o509q186l887
$$ -319 4832 15629 18794 336 -2932 -218 4899 5241 12506 16831 1976 -4533 -12719 -16606
11759a6606j1083J021R511J4513N196M054O969n070P47J674R75N59O529n833j2811
$$ -16606 -27689 -26668 -17157 -2644 2552 6606 13575 8505 9252 10926 11901 12460 18989 13156 345
11744C45J1519J2511N392m785j7239k1166J400J4374jj3706R815J6300L764r776
$$ 345 11864 24375 29767 24982 7743 -13423 -12023 2351 2350 -11356 -1541 14759 18523 8747
11730H747j9552q067J0952L547J2261K782Q441q46q463L437R606O031m18j9161
$$ 8747 -10805 -18872 -7920 -4373 7888 10670 19111 18265 9802 13239 22845 28876 28458 9297
11716I297k3340R187J9877J784l588o153j0635r541l13N605n328m133J1119O426
$$ 9297 -14043 -4856 15021 16805 13217 7064 -3571 -13112 -13425 -7820 -13148 -17281 -6162 264
11702B64j6454N659J1494J421n026p17M723N838O721p503o926p76N907k948l509
$$ 264 -16190 -10531 963 2384 -2642 -3359 1364 7202 13923 6420 -506 -1282 4625 1677 -1832
11687a832j5559n645j851k05J5577K0301K079j2506J679N233j0665p803k65M785
$$ -1832 -17391 -23036 -24887 -25092 -9515 10786 12865 359 2038 7271 -3394 -11197 -11462 -6677
11673f677K754o082O175J825R328n092j5126m199p771L764P578l940J3654J2015
$$ -6677 -3923 -10005 -3830 -2005 7323 2231 -12895 -17094 -24865 -21101 -13523 -17463 -3809 8206
11659H206n983j2031j2695N706J4735J284m541p99O704j361m048r573o949p172
$$ 8206 2223 -9808 -22503 -16797 -2062 -778 -5319 -6118 586 -775 -4823 -14396 -21345 -28517
11645b8517J0392J9050M168N929r943K924q170o071L678P806j2509n385J4586
$$ -28517 -18125 925 5093 11022 1079 4003 -4167 -10238 -6560 1246 -11263 -16648 -2062
11632b062L33J595J4066j500k2810j0754l053l983Q390O895j9159r656K3125M282
$$ -2062 -1729 -134 13932 12432 -10378 -21132 -24185 -28168 -19778 -12883 -32042 -41698 -18573 -14291
11618a4291j2571J325J0217J1133Q10j9764r572J7929Q491L721j262Q767L612
$$ -14291 -26862 -25537 -15320 -4187 -3377 -23141 -32713 -14784 -6293 -2572 -3834 4933 8545
11605H545Q12P982j0359j511J1422j0339r082J120r8j307J44k987k051r70O047
$$ 8545 9357 17339 6980 5469 16891 6552 -2530 -1410 -1508 -2815 -2671 -5658 -7709 -8679 -2632
11590b632m257o253L102P876J2757o705l573o059J7265p738j1578n994m38q765
$$ -2632 -6889 -13142 -10040 -2164 10593 3888 315 -5744 11521 3783 -7795 -13789 -14227 -22992
11576b2992k49o53m80Q39J4595J3686o815j5398O255J0388o945R19J0620R969
$$ -22992 -23241 -23894 -24374 -23535 -8940 4746 -2069 -17467 -11212 -824 -7769 -6850 3770 13739
11562A3739m645m321J1393J1218N53K425r483j3286j605K969M688J3895n507j0482
$$ 13739 9094 4773 16166 27384 27937 30362 20879 7593 5988 8957 13645 27540 22033 11551
11548A1551o327l235M264O238m066J327Q107R145J1464j4224j0544o707M446j4938
$$ 11551 5224 1989 6253 12491 8425 9752 17859 27004 38468 24244 13700 6993 11439 -3499
11534c499m794Q770J6658M563M265m556j6689p119J873j530q913N69O957j8007
$$ -3499 -8293 477 17135 21698 25963 21407 4718 -2401 -528 -2058 -10971 -10402 -3445 -21452
11520b1452j0076J5834J2398n676j4781p92K0172N498j1367m257j0874k896J6571
$$ -21452 -31528 -15694 -3296 -8972 -23753 -24545 -4373 1125 -10242 -14499 -25373 -28269 -11698
11507a1698J4466m582R655J2670P173j2724q456j9164o154o299j6431R890J2412
$$ -11698 2768 -1814 7841 20511 27684 14960 6504 -12660 -18814 -25113 -41544 -31654 -19242
11494a9242R377N175J0214J441J204j454j1809j6509q55M487P23M383J1445n717
$$ -19242 -9865 -4690 5524 6965 8169 6715 -5094 -21603 -22458 -17971 -17248 -12865 -1420 -7137
11480g137m532K360K236K374P20p885N912J5454j342Q688l570J0753J4239j5232
$$ -7137 -11669 -9309 -7073 -4699 -3979 -11864 -5952 9502 8160 16848 13278 24031 38270 23038
11466B3038o549M165n505j2187j4088N643J1118K223j2819n767m58N376m523J3363
$$ 23038 16489 20654 15149 2962 -11126 -5483 5635 7858 -4961 -10728 -11186 -5810 -10333 3030
11452C030R216n424l496j2203k2656m176O554P450J8210n80m956p439M476k771
$$ 3030 12246 6822 3326 -8877 -31533 -35709 -29155 -21705 -3495 -4075 -9031 -16470 -11994 -14765
11438a4765j1674L749k42R424J2217J2535P960M317j6590j6521m718J0786K612
$$ -14765 -26439 -22690 -22932 -13508 -1291 11244 19204 23521 6931 -9590 -14308 -3522 -910
11425i10r817J52N937j1870n309n391J4229R122l365K207o38J166jj0175l804
$$ -910 -10727 -10575 -4638 -16508 -21817 -27208 -12979 -3857 -7222 -5015 -5653 -4487 -4488 -14663 -18467
11410a8467R119k889q473J0426J4140J5873J4212q813j3432m852M21J1459n205
$$ -18467 -9348 -12237 -20710 -10284 3856 19729 33941 25128 11696 6844 7265 18724 13519
11397A3519P132j685k4558Q26Q318k41j8119j279r10K055J3968J0595N942o27
$$ 13519 20651 18966 -5592 -4766 3552 3311 -14808 -16087 -16997 -14942 -974 9621 15563 14936
11383A4936K02L425P131p603l174m273N916l310M548j1259k617m304o781R128
$$ 14936 15138 18563 25694 18091 14917 10644 16560 13250 17798 6539 3922 -382 -7163 1965
11369A965K319J3821n546K6k222j1235k414J98m645j3129O928L358k388J0168
$$ 1965 4284 18105 12559 12585 10363 -872 -3286 -3088 -7733 -20862 -13934 -10576 -12964 -2796
11355b796N264r515Q265R650k033n415k519o229n762r543k185J1667J2921O929
$$ -2796 2468 -7047 1218 10868 8835 3420 901 -5328 -11090 -20633 -22818 -11151 1770 8699
11341H699M157L37k383Q093o781J563Q409j0565j6183n57N821O87n789o267N866
$$ 8699 12856 13193 10810 18903 12122 13685 22094 11529 -4654 -5211 610 1297 -4492 -10759 -4893
11326d893M052p046J5106Nq128j6981k991J2455J5120M626P330j958o077n54P783
$$ -4893 -841 -7887 7219 7224 -904 -17885 -20876 -8421 6699 11325 18655 16697 10620 10066 17849
11311A7849k907n191J401K575N55p11P232L338m714o385o682r036m462L918Q597
$$ 17849 14942 9751 11152 13727 14282 13571 20803 24141 19427 13042 6360 -2676 -7138 -3220 5377
11296E377k062J3202O620O656J98k1714o962O803P01K2365j5625j4690Q007J5481
$$ 5377 3315 16517 23137 29793 29991 8277 1315 8118 8819 31184 15559 869 8876 24357
11282B4357n966j4172j8830J516o442K545J2507m87m689o55K923K952L004n413
$$ 24357 18391 4219 -14611 -13095 -19537 -16992 -4485 -4972 -9661 -10316 -7393 -4441 -1437 -6850
11268f850k148k818j2792k505J3367M029Q627k274k778J0800r000P258Q260j6828
$$ -6850 -8998 -11816 -24608 -27113 -13746 -9717 -1090 -3364 -6142 4658 -4342 2916 11176 -5652
11254e652l087M778K465P512M615r790r810J5380L329m104j6846N529m37k992
$$ -5652 -8739 -3961 -1496 6016 10631 841 -8969 6411 9740 5636 -11210 -5681 -6118 -9110
11240i110O017j787j0145q436M155M566L3J3494J1932j0472j771O721J6921R524
$$ -9110 -3093 -4880 -15025 -23461 -19306 -14740 -14707 -1213 10719 247 -1524 5197 22118 31642
11226C1642o404o151n488m825j6961J505J5961J3094O364k2406K33l815j2437
$$ 31642 25238 19087 13599 8774 -8187 -6682 9279 22373 28737 6331 6564 2749 -9688
11213i688N464N846o74K265M644M326k730p491K672k3384q732R223k06p834O620
$$ -9688 -4224 1622 948 3213 7857 12183 9453 1962 4634 -18750 -27482 -18259 -18465 -26299 -19679
11198a9679J638r709O531J6817K126j4626O797J4723J3183J659j194n349j4121
$$ -19679 -18041 -27750 -21219 -4402 -2276 -16902 -10105 4618 17801 19460 18266 12917 -1204
11185a204K94M968n959q921P697J2044p335K931l451Q23Q324N26n546m896r697
$$ -1204 -910 4058 -1901 -10822 -3125 8919 1584 4515 1064 1887 10211 10737 5191 295 -9402
11170i402J6566P147p726j6758m504P579J2472l972k924N381J1450J361O56J177
$$ -9402 7164 14311 6585 -10173 -14677 -7098 5374 1402 -1522 3859 15309 16670 17326 18503
11156A8503j0377o260K961J275l278j2927J687J083K15J636R769j543p299P752
$$ 18503 8126 1866 4827 6102 2824 -10103 -8416 -7333 -7118 -5482 4287 2744 -4555 3197
11142C197J0314P393M932m34l974j6246r430L204J8252m274o531Q39P359J5166
$$ 3197 13511 20904 25836 25402 21428 5182 -4248 -1044 17208 12934 6403 7242 14601 29767
11128B9767J244k6269r341j0383j0404J8170J4039J39k636j687J6462K062k13
$$ 29767 31011 4742 -4599 -14982 -25386 -7216 6823 6962 4326 2639 19101 21163 20950
11115B0950M727l441o866o881r451p612j1333J8992J6728m238j0110p564N430
$$ 20950 25677 22236 15370 8489 -962 -8574 -19907 -915 15813 11575 1465 -6099 -669
11102f69O690O836m048K632R652j0562j0884k686k091j145l558N864j902j527
$$ -669 6021 12857 8809 11441 21093 10531 -353 -3039 -5130 -6275 -9833 -3969 -5871 -7398
11088g398J2117J3179m400J051L631K901m616j2137J772Q349Q27m72j3250l107
$$ -7398 4719 17898 13498 14549 18180 21081 16465 4328 6100 14449 15276 14804 1554 -1553
11074a553m42M500P265M905j443j1131K130m56n441j0579M565Q871N303l277Q91
$$ -1553 -1995 2505 9770 14675 13232 2101 4231 3775 -1666 -12245 -7680 1191 6494 3217 4108
11059D108r217P781O876j66J619R898K923P00p033k591n88K632q332p583j0024
$$ 4108 -5109 2672 9548 9382 11001 20899 23822 24522 17489 14898 14310 16942 8610 1027 -8997
11044h997O669l070J8820J1635J3194J0901p935j0044p456o171p489J3258R046
$$ -8997 -2328 -5398 13422 25057 38251 49152 41217 31173 23717 17546 10057 23315 32361
11031C2361j5473k825l502J521j063K414j2906L059k786r637n841Q548n57M16
$$ 32361 16888 14063 10561 12082 11019 13433 527 3586 800 -8837 -14678 -6130 -6687 -6271
11017f271K744K107l171q64j3902p71J4059K240P704N742n656q67J5953Q884J4096
$$ -6271 -3527 -1420 -4591 -5455 -19357 -20128 -6069 -3829 3875 9617 3961 3094 19047 27931 42027
11002D2027J5220J078o249k7462k2447M200Q402p741l768P45R098m894j3178P536
$$ 42027 57247 58325 52076 24614 2167 6367 14769 7028 3260 4005 13103 8209 -4969 2567
10988B567J1024l432j157Q085P168k520j0431L706K727M117N392j6552l83Q266
$$ 2567 13591 10159 9002 17087 24255 21735 11304 15010 17737 21854 27246 10694 10311 18577
10974A8577p175K756n173J374m808o652o971K192R587J129k09J8974J0755n399
$$ 18577 11402 14158 8985 10359 5551 -1101 -8072 -5880 3707 4836 4627 23601 34356 28957
10960B8957j2133j1058J657Q593q054j1147R514O605k968J2250K329m520k2510
$$ 28957 16824 5766 7423 16016 7962 -3185 6329 12934 9966 22216 24545 20025 -2485
10947b485j4526J0700Q773l756J5321N737k924P494N331j0313o091O991J0648
$$ -2485 -17011 -6311 2462 -1294 14027 19764 16840 24334 29665 19352 13261 20252 30900
10934C0900l365m45k447j690j070k545j3143Q025J8269J2204J627j4349j1985
$$ 30900 27535 27090 24643 22953 21883 19338 6195 14220 32489 44693 46320 31971 19986
10921A9986m785o746R749k727j7345J6594J0159k0120j866J0894P220r312r6O210
$$ 19986 15201 8455 18204 15477 -1868 14726 24885 4765 2899 13793 21013 11701 11605 17815
10907A7815j785k895n73J0165q591o920J415J610k354J1451N549n625j287j612
$$ 17815 16030 13135 12562 22727 14136 7216 8631 10241 7887 19338 24887 19262 17975 16363
10893A6363N961j0307q439o126J2515J0847L272p142k81N923q422m579N669r926
$$ 16363 22324 12017 3578 -2548 9967 20814 24086 16944 16663 22586 14164 9585 15254 5328
10879E328P707R518k525l127n648j4534n781L590k247p07J3777O324K77J0976
$$ 5328 13035 22553 20028 16901 11253 -3281 -9062 -5472 -7719 -8426 5351 11675 11952 22928
10865B2928r686k800k394Q112N978M118n38l489o546q534P314k439M391j666j2639
$$ 22928 13242 10442 8048 16160 22138 26256 25718 22229 15683 7149 14463 12024 16415 14749 2110
10850B110p093L560J0691j095J034l443K716O611K035L098p898J967P316n08P571
$$ 2110 -4983 -1423 9268 8173 9207 5764 8480 15091 17126 20224 12326 14293 21609 21101 28672
10835B8672j0431n101Q012K082K753L117l913r850j5628o09K1004o546j2692L392
$$ 28672 18241 13140 21152 23234 25987 29104 25191 15341 -287 -896 20108 13562 870 4262
10821D262N952J9530J07k454j5377P319J727j0550K887n593j672M661j1619j1918
$$ 4262 10214 29744 29851 27397 12020 19339 21066 10516 13403 7810 6138 10799 -820 -12738
10807a2738N28M144k845J478M803K794J0465r462L078J4385N752M618M822Q16
$$ -12738 -12210 -8066 -10911 -9433 -4630 -1836 8629 -833 2245 16630 22382 27000 31822 32638
10793C2638L979O485r606p795L75L01m611j6381n943j3692J08J3839K1955J5066
$$ 32638 36617 43102 33496 25701 26076 26377 21766 5385 -558 -14250 -14142 -303 21652 36718
10779C6718q472k3568n40o777P129N50n022L654J044J762j1811N34J4820N315
$$ 36718 28246 4678 4138 -2639 4490 5040 18 3672 4716 6478 -5333 -4799 10021 15336
10765A5336J0482R075p310j3310l321N236L288l391j1644p040L422P855J2906
$$ 15336 25818 34893 27583 14273 10952 16188 19476 16085 4441 -2599 823 8678 21584
10752B1584M097l070o725j7021j3729K832J5038J2380J6290q252j2085q926q786
$$ 21584 25681 22611 15886 -1135 -14864 -12032 3006 15386 31676 23424 11339 2413 -6373
10739f373p74j2164M731M277l443m323J0365J5787k518o9k138m476l911Q205n231
$$ -6373 -7147 -19311 -14580 -10303 -13746 -18069 -7704 8083 5565 5496 3358 -1118 -5029 3176 -2055
10724b055N168J5534J3682q43j6706K45l884K908Q509m91l894j7343K992P484
$$ -2055 3113 18647 32329 31486 14780 15025 11141 14049 22558 22067 18173 830 3822 11306
10710A1306J0909J7177L026p893M618L599K234O74j6565j1474m61k668k1230J3876
$$ 11306 22215 39392 42418 34525 39143 42742 44976 45650 29085 17611 17150 14482 -6748 7128
10696G128O794R77o410q266j7648o283J4307K2177R209O755M088R87r672j983
$$ 7128 13922 14899 8489 223 -17425 -23708 -9401 12776 21985 28740 32828 33815 24143 22160
10682B2160J8018Q733q063q720J0p888l893P99j4249p15J0322O476k04r70j0065
$$ 22160 40178 48911 40848 32128 32138 24250 20357 21156 6907 6192 16514 22990 22786 21816 11751
10667A1751L1J531q0l317l94o432J687K3717M129j5729o169m961p567P98k256
$$ 11751 11782 13313 13233 9916 9522 3090 4777 28494 32623 16894 10725 5764 -1803 -1005 -3261
10652c261J2132l006J573J715n562L901m390r583q463m17k296P849J6206N742
$$ -3261 8871 5865 7438 9153 3591 7492 3102 -6481 -14944 -15361 -17657 -9808 6398 12140
10638A2140o594p306O801J3559j3053n620m021J6641N680J5455R822k1042J409
$$ 12140 5546 -1760 5041 18600 5547 -73 -4094 12547 18227 33682 43504 22462 23871
10625B3871O22j0990j0888r842j1591M680J2079Q208np979l738R926J3584J0245
$$ 23871 24493 13503 2615 -7227 -18818 -14138 -2059 6149 6144 -1835 -5573 4353 17937 28182
10611B8182L196j7671N948M947O5o264k198K0125K096j058j312J97m006m22j8858
$$ 28182 31378 13707 19655 24602 24667 18403 16205 36330 38426 37368 36056 36253 32247 31825 12967
10596A2967q638J3572k004n644P035N220q934j040j338k2866M53K0622p28j2843
$$ 12967 4329 17901 15897 10253 17288 22508 13574 12534 11196 -11670 -11217 9405 8677 -4166
10582d166j3597k005J5582P569n970J0166M812K029R8j4159m455j3424J1545K1220
$$ -4166 -17763 -19768 -4186 3383 -2587 7579 12391 14420 14518 359 -4096 -17520 -5975 15245
10568A5245J3055L871k470j3629o053q373M429J5997N949j2555o419p509o17Q518
$$ 15245 28300 32171 29701 16072 10019 1646 6075 22072 28021 15466 9047 1538 921 9439
10554I439J499j937O722J0883J1688j0341j88R15o801L214j0118j3803R48O900
$$ 9439 10938 9001 15723 26606 38294 27953 27765 28680 21879 25093 14975 1172 2120 9020
10540I020Q904R377j0105j4304k804J804k906p6J0924j954Q302O840K843M415
$$ 9020 17924 27301 17196 2892 88 1892 -1014 -1090 9834 7880 16182 23022 25865 30280
10526C0280j0597p225J7156K615l485L660O264j1392j8870M715L306l220N586
$$ 30280 19683 12458 29614 32229 28744 32404 38668 27276 8406 13121 16427 13207 18793
10513A8793L596L795K00q992j3570j2471L851O817K2068R210o111J7178O803q82
$$ 18793 22389 26184 26384 17392 3822 -8649 -4798 2019 24087 33297 27186 44364 51167 50285
10499E0285J226q23r445o711j3967l601j4087N733J6684l657j8624l886n050n391
$$ 50285 51511 50688 41243 34532 20565 16964 2877 8610 25294 21637 3013 -873 -5923 -11314
10485a1314m301q544m623p305R599Q548J1558O187P999l982m014l050J0406q43
$$ -11314 -15615 -24159 -28782 -36087 -26488 -17940 -6382 -195 7804 3822 -192 -3242 7164 6321
10471F321J35r868J1569M07k13J6561P960j4241p830J0885l209j3825M38j5510
$$ 6321 6456 -3412 8157 8564 8351 24912 32872 18631 10801 21686 18477 4652 5090 -10420
10457a0420J3379K184N1l485J767P662J7134Q073k4954j3898J0234J0111R405
$$ -10420 2959 5143 5194 1709 3476 11138 28272 36345 11391 -2507 7727 17838 27243
10444B7243R466m058j4943j2655N689j952L345N039l173j5940j3523R627R806
$$ 27243 36709 32651 17708 5053 10742 8790 12135 17174 14001 -1939 -15462 -5835 3971
10431C971j0150m733N803J4577k270K384Q916o491M848M881N048p509l611j4094
$$ 3971 -6179 -10912 -5109 9468 7198 9582 18498 12007 16855 21736 26784 19275 15664 1570
10417A570L637M071j2768o731J2302L596O970l967L772J0144P224L478K405m016
$$ 1570 5207 9278 -3490 -10221 2081 5677 12647 8680 12452 22596 29820 33298 35703 31687
10403C1687k1512k597j530j673Q149j305O144L337J018k426P944j3312K239o174
$$ 31687 10175 7578 6048 4375 12524 11219 17363 20700 21718 19292 27236 13924 16163 9989
10389I989P0N680M046j258n241p640O297O653J1809M908l237j3106j1713r722
$$ 9989 10059 15739 19785 18527 13286 5646 11943 18596 30405 35313 32076 18970 7257 -2465
10375b465r001P663R524J6108J0500j2479j0487J3460N944j0184l610o210j708
$$ -2465 -11466 -3803 5721 21829 32329 19850 9363 22823 28767 18583 14973 8763 7055
10362G055K683k10j775j6N935L999k228o151j5686N222N889j749j959l007J3084
$$ 7055 9738 9528 7753 7737 13672 17671 15443 9292 -6394 -1172 4717 2968 1009 -1998 11086
10347A1086O406k6l655M779J6311M77n398J2235O448p019m703K430J2217n086
$$ 11086 17492 17466 13811 18590 34901 35378 29980 42215 48663 41644 36941 39371 51588 46502
10333D6502j5809j879O110O53K596R193P63k627j0320j9738j0242J0529L147l263
$$ 46502 30693 28814 34924 35577 38173 47366 48129 45502 35182 15444 5202 15731 18878 15615
10319A5615m137j216J801q116P001R751J1820k699j3599m845j1142J3313J4266
$$ 15615 11478 10262 12063 3947 10948 20699 32519 29820 16221 11376 234 13547 27813
10306B7813P468j3855j0061j539l346l358P440J9410J8708q820k8687k641L517
$$ 27813 35281 21426 11365 9826 6480 3122 10562 29972 48680 39860 11173 8532 12049
10293A2049p24j043j0642Q03P290j0447J2916P669q381R897J3607q138p33J2723
$$ 12049 11325 10282 -360 443 7733 -2714 10202 17871 9490 19387 32994 24856 24123 36846
10279C6846K991p638r466k208l09o92m505k489J2303m727j6460O607J298m286
$$ 36846 39837 32199 22733 20525 20216 19524 15019 12530 24833 20106 3646 10253 11551 7265
10265G265k439J5133j312q074p144q782J0042J0953j3662m146J8731J8745N292
$$ 7265 4826 19959 18647 10573 3429 -5353 4689 15642 1980 -2166 16565 35310 40602
10252D0602k348n131r003j427J6666Q859o564K431L070J315p669j0725j3144Q94
$$ 40602 38254 33123 24120 22693 39359 48218 41654 44085 47155 48470 40801 30076 16932 17826
10238A7826J643J036j580k954j21o851R86K0854j6j0452O850l649o735j345K1600
$$ 17826 19469 20505 18925 15971 15850 8999 9985 30839 30823 20371 27221 23572 16837 15492 37092
10223C7092K646p957p707N824J3590J44r993j1677O073J8118Q204m443Q426J597
$$ 37092 39738 31781 24074 29898 43488 43632 33639 21962 28035 46153 54357 49914 58340 59937
10209E9937o446l521L977R265P142K235r972o555m180r035Q821r70k817K118p716
$$ 59937 53491 49970 53947 63212 70354 72589 62617 56062 51882 42847 51668 50698 47881 49999 42283
10194D2283q625o717j1104J1505R604O269L445M292k073p631N597p258k859L147
$$ 42283 33658 26941 15837 27342 36946 43215 46660 50952 48879 41248 46845 39587 36728 39875
10180C9875j0506j5803k875Q070R499R598J0405n420k1501m376j0727j6068M11
$$ 39875 29369 13566 10691 18761 28260 37858 48263 42843 21342 16966 6239 -9829 -9418
10167i418K508J7360J0827M053Q009Q791O536j278j7392M03Q60Q805Q94K440M70
$$ -9418 -6910 10450 21277 25330 33339 42130 48666 47388 29996 30399 31259 40064 40958 43398 43868
10152D3868K684j3238j8331n718Q374M385q900O131O874L64n667K52L909Q367
$$ 43868 46552 33314 14983 9265 17639 22024 13124 19255 26129 26493 20826 21078 24987 33354
10138C3354J5286j0366o217P477L913l612l006K456j6822r563K777n91L283p698
$$ 33354 48640 38274 32057 39534 43447 39835 36829 39285 22463 12900 15677 15086 18369 10671
10124A0671m85J6641J4361N842M16L995j3092j518j5305K219R546m787q116R119
$$ 10671 10186 26827 41188 47030 47446 51441 38349 36831 21526 23745 33291 28504 20388 29507
10110B9507J0326Q435M67J336L69Q48K459J060n732j4205l175R798o074K820M470
$$ 29507 39833 48268 48735 50071 50440 51288 53747 54807 49075 34870 31695 41493 35419 38239 42709
10095D2709j779j2346k2862m877j511J2607J2912O701N19m140r363J0550R294
$$ 42709 40930 28584 5722 845 -666 11941 24853 31554 32073 27933 18570 29120 38414
10082C8414j376M32k657j217N685q129j7326l729J8125k229P093J2769L035j6852
$$ 38414 37038 37470 34813 33596 39281 31152 13826 10097 28222 25993 33086 45855 48890 32038
10068C2038M481j6776p239N789N407J2747O155o715j1579K585Q773Q163R801R03
$$ 32038 36519 19743 12504 18293 23700 36447 42602 35887 24308 26893 35666 43829 53630 54533
10054E4533j0258K765Q140r679M525P244q830j1052j1707J143J8443N437J125
$$ 54533 44275 47040 55180 45501 50026 57270 48440 37388 25681 26824 45267 50704 51829
10041E1829K0944L5349L7519L3081N833J109J1328j4454l7257l0632k1201j6670
$$ 51829 72773 108122 145641 178722 184555 185664 196992 182538 145281 114649 93448 76778
10029G6778j3086j4282l921J6631P24J5683l162k2204j2530p000M815J3417Q923
$$ 76778 63692 49410 45489 62120 62844 78527 75365 53161 40631 33631 38446 51863 60786
10016F0786m013L068J45j115j164j6651P20Q417P070M08j893R136m341M193n901
$$ 60786 56773 59841 59986 58871 57707 41056 41776 50193 57263 57671 55778 64914 60573 64766 58865
10001E8865j1300o934k734L194n917K798l886j0732J0208J7028K45N780J758l074
$$ 58865 47565 40631 37897 41091 35174 37972 34086 23354 33562 50590 50835 56615 58373 55299
9987E5299R430K691p670q542M804m194l663O887j2N786k962k1307k1860j248R77
$$ 55299 64729 67420 59750 51208 56012 51818 48155 55042 55030 60816 57854 36547 14687 13439 14416
9972A4416O840J3142J1155K681L607o170j2642j509L152r21N991M90o286p633
$$ 14416 21256 34398 45553 48234 51841 45671 33029 31520 34672 33751 39742 40232 33946 26313
9958B6313J3356J2860J0826N319n378j5872m435R404J360Q692j5979n998o214
$$ 26313 39669 52529 63355 68674 63296 47424 42989 52393 53753 62445 46466 40468 34254
9945C4254O804q486p881l978L66k246J0209J0741K0628J6605n511j7107o904L560
$$ 34254 41058 32572 24691 20713 21079 18833 29042 39783 60411 77016 71505 54398 47494 51054
9931E1054j83p289J6906L332N241L611o569M762m66o161p03R041O258L34p89O358
$$ 51054 50871 43582 60488 63820 69061 72672 66103 70865 70399 64238 63535 72576 78834 79168 78379 84737
9915H4737J3167K2897m641j328J5778k125j0262L966J1936r37Q99J981O324Q304
$$ 84737 97904 120801 116160 114832 130610 128485 118223 122189 134125 133188 134087 136068 142392 150696
9901A50696J9896J8167K0585K5064J9545N0432N4411O5215O9831J00754J56398
$$ 150696 170592 188759 209344 234408 253953 304385 358796 424011 493842 594596 750994
9890G50994K07669L00780N12590Q31698J202688J337355R40666L92336Q2533n382
$$ 750994 958663 1259443 1772033 2603731 3806419 5143774 6084440 6476776 6559309 6553927
9880F553927n41021j273001j243945q68567n73674l72573k67656j90643j50455
$$ 6553927 6012906 4739905 3495960 2627393 2053719 1681146 1413490 1222847 1072392
9871A072392j02467p2990o5914o1289l9196m8740m6417j4093l5352k9746m1456
$$ 1072392 969925 896935 831021 769732 730536 681796 635379 621286 585934 556188 514732
9860E14732l4119k0240p598k086k6437k8590j0966p518P974q799l1139r207N54
$$ 514732 480613 460373 452775 450689 424252 395662 384696 377178 385152 376353 345214 336007 336561
9847C36561j916j9473j3605o929j1599j5233r49J3907j2519j0497m244k011j1876
$$ 336561 334645 315172 301567 294638 283039 267806 266857 280764 268245 257748 253504 251493 239617
9834B39617j6245L389p052k1078N326p275j1938o205q745K407n756K647J334j4086
$$ 239617 223372 226761 219709 198631 203957 196682 184744 178539 169794 172201 166445 169092 170426 156340
9820A56340k362K0612j1285j9241L654R482j3624k2970Q02J1687P77l12Q0q795
$$ 156340 153978 174590 163305 144064 147718 157200 143576 120606 121408 133095 133872 133560 133640 124845
9806A24845n631K747j0341k0104L366Q646O839p251j7212J0411K3405o627r242
$$ 124845 119214 121961 111620 91516 94882 103528 110367 103116 85904 96315 119720 113093 103851
9793A03851o193O095L252j3405J4189L699q289N173L319j2904K534R493j7916
$$ 103851 97658 103753 107005 93600 107789 111488 103199 108372 111691 98787 101321 110814 92898
9780I2898j4879o522N740N772J0195r24J213J072j210J179j681n344J67q911n722
$$ 92898 78019 71497 77237 83009 93204 92280 93493 94565 93355 94534 92853 87509 87676 78765 73043
9765G3043Q990p930m648j1262j7943P918K3649N973J0908j1177M436L216L561
$$ 73043 82033 74103 69455 58193 40250 48168 71817 77790 88698 77521 81957 85173 88734
9752H8734j8921l551o17R087J743j2481p621Q597J4713R604o420K13J3583o164
$$ 88734 69813 66262 65645 74732 76475 63994 56373 64970 79683 89287 82867 83080 96663 90499
9738I0499j592J9002r48j0355j4581j1609K217L930n200K540k2778m487J6324
$$ 90499 88907 107909 106961 96606 82025 70416 72633 76563 71363 73903 51125 46638 62962
9725F2962J1656L916M689l846j899r500j864K016J105l771j333O025k317M191
$$ 62962 74618 78534 83223 79377 77478 67978 66114 68130 69235 65464 64131 70156 67839 72030
9711G2030Q091O94j854l499Q725Q374L61m680N882J1689O612q811j3534J980K066
$$ 72030 80121 80815 78961 75462 84187 92561 92922 88242 94124 105813 112425 103614 90080 92060 94126
9696I4126N162P444r725r8O834o334r386p107J844J0116P441j4073K840P993O429
$$ 94126 99288 106732 97007 96909 103743 97409 88023 80916 82760 92876 100317 86244 89084 97077 103506
9681A03506p068L039J1391m311J321J454r096m472J1424N05o957j18l294J694
$$ 103506 96438 99477 110868 106557 107878 109332 100236 95764 107188 107693 100736 100618 97324 99018
9667I9018j9450j6532j980J0054N603O432J3481L562N422J3831O689K361j1224
$$ 99018 79568 63036 61056 71110 76713 83145 96626 100188 105610 119441 126130 128491 117267
9654A17267L914K434k305n840j3243L526N140J6771j831q640O124j9103j3686
$$ 117267 121181 123615 121310 115470 102227 105753 110893 127664 125833 117193 123317 104214 90528
9641I0528L056J7740O893Q764q945j2979J0875J285p268P763N367n355j496j749
$$ 90528 93584 111324 118217 126981 118036 105057 115932 117217 109949 117712 123079 117724 116228 114479
9627A14479J891j3806j3199J0114J217p139k045m597j6204J1036J4317J1815R968
$$ 114479 116370 102564 89365 99479 100696 93557 91512 86915 70711 81747 96064 107879 117847
9614A17847J0487K693j4234r357Q162Q258j4226j4662P420P987k768O803J0312
$$ 117847 128334 131027 116793 107436 115598 123856 109630 94968 102388 110375 107607 114410 124722
9601A24722j276j7244K697O652N30l178l636J1919K7652M05j2735q818p344O514
$$ 124722 123446 106202 108899 115551 116081 112903 109267 121186 148838 149243 136508 127690 120346 126860
9587A26860o64k112K061m559k5939l278P469J3008J937j2076M1R924N259n440
$$ 126860 126196 124084 126145 121586 95647 92369 99838 112846 114783 102707 102748 112672 117931 112491
9573A12491q936j4828K849J2078J2583Q421M450r715n219N251J8697R66K066n627
$$ 112491 103555 88727 91576 103654 116237 124658 129108 119393 114174 119425 138122 139088 141154 135527
9559A35527j591k0273M055P083q576R288N686j6323q54J4139Q208j220K407K8004
$$ 135527 133936 113663 117718 124801 116225 125513 131199 114876 114022 128161 136369 135149 137556 165560
9545A65560O096j1646m520k538q648j1055n32M60k013j3015L725R740K6742L5056
$$ 165560 171656 160010 155490 152952 144304 133249 132717 133177 131164 118149 121874 131614 158356 193412
9531A93412J651j0821J1224J2134K354k0807j5133j8235j4838l110p03J195O045
$$ 193412 195063 184242 195466 207600 209954 189147 174014 155779 140941 137831 137128 138323 144368
9518A44368M06l329j028j3044l433R248O424L124k54Q381J5492N766n291j6222
$$ 144368 144774 141445 140417 127373 123940 133188 139612 142736 142482 150863 166355 172121 166830 150608
9504A50608j9572n45J7436P728j392n872J1101J5409J4400J2174N608L999j70
$$ 150608 131036 130491 147927 155655 154263 148391 159492 174901 189301 201475 207083 211082 210912
9491B10912K6998O533J7370J8267O356L125q451k731k095K4860K0835N77m580
$$ 210912 237910 244443 261813 280080 286436 289561 281110 278379 276284 301144 321979 322556 317976
9478C17976q317r592O492N151j8458j6767p176j443k754j074o904j8723p604M471
$$ 317976 309659 300067 306559 311710 293252 276485 269309 267866 265112 264038 257134 238411 230807 235278
9464B35278N407J1735J4074O404k772k481J2888r073j4367q242k072n142n395
$$ 235278 240685 252420 266494 272898 270126 267645 280533 271460 257093 248851 246779 241637 236242
9451B36242J2991J3479K4907J6586J216Q605K0232N254j5207j0128R127J3974
$$ 236242 249233 262712 287619 304205 305421 314026 334258 339512 324305 314177 323304 337278
9439C37278O780J6509K3841K2913L1142L0229J8499M291P078J1969j0898o244
$$ 337278 344058 360567 384408 407321 438463 468692 487191 491482 498560 510529 499631 493387
9427D93387l898j0165j9317j9836k5340k2145j5230k1123q768j2764L908R958
$$ 493387 489489 479324 460007 440171 414831 392686 377456 356333 347565 334801 338709 348667
9415C48667K1643M675N129K3708L264j3697j7493j5231j210R650k043o477r332
$$ 348667 370310 374985 380114 403822 407086 393389 375896 360665 359455 369105 367062 360585 351253
9402C51253m929n693j18J6564J6857J5229N203j059K284P212J1697k053q96J5033
$$ 351253 346324 340631 340513 357077 373934 389163 394366 393307 395591 402803 414500 412447 411551 426584
9388D26584M1313J3169J9401J6183K0229J1754J165n452m555k0640k1941m0813
$$ 426584 467897 481066 500467 516650 536879 548633 549798 544346 539791 519151 497210 456397
9376D56397j9961o774N345l68P809m79J0635J5754r36q131k029j3148r288l312
$$ 456397 436436 429662 435007 434639 442448 441969 452604 468358 467422 459291 457262 444114 434826 431514
9362D31514k0429n291K950M10q575P230k2821j9471J861J3283J809o684J2300
$$ 431514 411085 405794 408744 409154 400579 407809 384988 365517 367378 380661 382470 375786 388086
9349C88086J6963M30o912j086k553j80N585j996r976J1116J3295J4632P700J1901
$$ 388086 405049 405479 398567 397481 394928 394748 400333 398337 388361 399477 412772 427404 435104 447005
9335D47005K2895R857J9616J2822k826m800l08K201K983r26r377j4627j6648j4153
$$ 447005 469900 479757 499373 512195 509369 504569 504261 506462 509445 508519 499142 484515 467867 453714
9321D53714k0950K189Q103M169l293M779J4973K4740J6631J4616J9803J9791K7037
$$ 453714 432764 434953 443056 447225 443932 448711 463684 488424 505055 519671 539474 559265 586302
9308E86302M8969P2797P0412P7745O7722O5984P5053O5573P2405P6516N3093M0307
$$ 586302 635271 708068 778480 856225 923947 989931 1064984 1130557 1202962 1279478 1332571 1372878
9296A372878J3340K398k2007l5729m1208m9891m9671m0920l4828m3342p2158n0789
$$ 1372878 1386218 1388616 1366609 1330880 1289672 1239781 1190110 1149190 1114362 1071020 998862 948073
9284I48073k7147m4642l2489k8854k8865j3440Q818o363M923J8672R620J5527
$$ 948073 920926 876284 843795 814941 786076 772636 781454 775091 780014 798686 808306 823833
9272H23833K8524N6078P5583O2611P9349J16945J30029J60348J85788J96652J96251
$$ 823833 852357 908435 984018 1046629 1125978 1242923 1372952 1533300 1719088 1915740 2111991
9261B111991J98674J71226J60816J61600J68217J69223J36060J17980O3862K9467
$$ 2111991 2310665 2481891 2642707 2804307 2972524 3141747 3277807 3395787 3459649 3489116
9251C489116J623m9429k9044L470j0696j4137l5030k0770k2056n5188q7688p5725
$$ 3489116 3490739 3441310 3412266 3415736 3405040 3390903 3355873 3335103 3313047 3257859 3170171 3094446
9239C094446m9793j9480p571k3723j9523m1939o8265o2056q9777r5583p1858m3804
$$ 3094446 3044653 3025173 3017602 2993879 2974356 2932417 2864152 2802096 2712319 2616736 2544878 2501074
9227B501074m5905k0549K0605M8738O7192Q2009P0710P9304P6382Q3650J03174
$$ 2501074 2455169 2434620 2455225 2503963 2571155 2653164 2723874 2803178 2879560 2963210 3066384
9216C066384J03304J14234J25694J65446K13561K60756K70887K62532K49481K57385
$$ 3066384 3169688 3283922 3409616 3575062 3788623 4049379 4320266 4582798 4832279 5089664
9206E089664K79851K89113K65169K14999J84657K00920J57598R4830K892p3143
$$ 5089664 5369515 5658628 5923797 6138796 6323453 6524373 6681971 6776801 6779693 6706550
9196F706550j62244k18975k16330k27428k55150k64449k17993j88277j46561j13490
$$ 6706550 6544306 6325331 6109001 5881573 5626423 5361974 5143981 4955704 4809143 4695653
9186D695653q3256r0889p7286l6505l8354l7612n6847m3876l3235l0346m7457
$$ 4695653 4612397 4521508 4444222 4407717 4369363 4331751 4274904 4231028 4197793 4167447 4119990
9175D119990q0923p0982m5423l4291j9184j254R572K893J0670M4714Q8227J20079
$$ 4119990 4039067 3968085 3922662 3888371 3869187 3867933 3877505 3880398 3891068 3935782 4024009 4144088
9163D144088J76837K44058L12911L27269L32317L07824K80673K67126K61353K30431
$$ 4144088 4320925 4564983 4877894 5205163 5537480 5845304 6125977 6393103 6654456 6884887
9153F884887K02737J87227J71325J69625J97224K59719L66103N63916Q07342R69618
$$ 6884887 7087624 7274851 7446176 7615801 7813025 8072744 8438847 9002763 9810105 10779723
9143A0779723Q55976N39502K76284J18680j22266m63714m78926j34759K31043
$$ 10779723 11635699 12175201 12451485 12570165 12447899 11984185 11505259 11370500 11601543
9134A1601543L76087K88299Q6693j86962m97846q37462j083113j127878r76399
$$ 11601543 11977630 12265929 12352622 12165660 11667814 10830352 9747239 8619361 7642962
9125G642962p53171n53332m05028k97060k08554j62049j13298o8729m1964q86
$$ 7642962 6889791 6336459 5931431 5634371 5425817 5263768 5150470 5081741 5039777 5038891
9115E038891K4275Q0942J69538K64789L16540L91678M87684N55611O74385Q88136
$$ 5038891 5063166 5144108 5313646 5578435 5894975 6286653 6774337 7329948 8004333 8892469
9105H892469J167120J592658K154719K802713L429507L777175L451535K483620
$$ 8892469 10059589 11652247 13806966 16609679 20039186 23816361 27267896 29751516
9097B9751516J473642Q97892K80923q59886j514020j323498r93222r84996j258839
$$ 29751516 31225158 32123050 32403973 31544087 30030067 28706569 27713347 26728351 25469512
9088B5469512j361028j234916j049471p40186l06036Q8314L75742N14018N01429
$$ 25469512 24108484 22873568 21824097 21083911 20777875 20866189 21241931 21755949 22257378
9079B2257378K66407j89817n98203p79381p32580o75269o20611l97643j87586
$$ 22257378 22523785 22333968 21735765 20956384 20223804 19548535 18927924 18530281 18342695
9070A8342695j13687j63305l48999o26611q33830q46067o54865k13052M32251
$$ 18342695 18229008 18065703 17716704 17090093 16256263 15410196 14755331 14542279 14974530
9061A4974530J044989J418034J451082J411860J423961J375500J159633J123938
$$ 14974530 16019519 17437553 18888635 20300495 21724456 23099956 24259589 25383527
9053B5383527J497795J941301K117210K175869K420777K924270L177750K816073
$$ 25383527 26881322 28822623 30939833 33115702 35536479 38460749 41638499 44454572
9045D4454572K223128J990059K215086K054379R20451m03734j067394j462091
$$ 44454572 46677700 48667759 50882845 52937224 53857675 53453941 52386547 50924456
9037E0924456k094943k888468l236369l261216l121391k776901k384767k008984
$$ 50924456 48829513 45941045 42704676 39443460 36322069 33545168 31160401 29151417
9029B9151417j713582j370497q26313j79915K68790M38972M60962N14451M32917
$$ 29151417 27437835 26067338 25241025 25061110 25329900 25768872 26229834 26744285 27177202
9020B7177202m3801m77650m68224l85990o35345r83294j107042q90433o98968
$$ 27177202 27133401 26655751 26187527 25801537 25166192 24182898 23075856 22185423 21486455
9011B1486455n20955J70666J076163J558657J452919R97372O42095L58622j4812
$$ 21486455 20965500 21136166 22212329 23770986 25223905 26221277 26863372 27221994 27207182
9002B7207182j70447M31209J922771L786179N336329N896771N233137L793181
$$ 27207182 27036735 27467944 29390715 33176894 38513223 44409994 49643131 53436312
8994E3436312K195170M46226j781445m078423n368605n233421m506565l913730
$$ 53436312 55631482 56077708 54296263 50217840 44849235 39615814 35109249 31195519
8986C1195519l402745k693492j805444q50293J33156J129569J966696K420298
$$ 31195519 27792774 25099282 23293838 22443545 22576701 23706270 25672966 28093264
8978B8093264K337173J891326J273072K66530j153203k484590k982633l006414
$$ 28093264 30430437 32321763 33594835 33861365 32708162 30223572 27240939 24234525
8970B4234525l099981k809016k180909j606071j184124q97973p03918n50446m41522
$$ 24234525 21134544 18325528 16144619 14538548 13354424 12456451 11752533 11202087 10760565
8961A0760565l55542k67647j76835r4020j3841R8605K32593M12893P16804J162390
$$ 10760565 10405023 10137376 9960541 9866521 9852680 9951285 10183878 10596771 11313575 12475965
8951A2475965J739797K347354K577692K185132J505208R95588O05740l8289o06129
$$ 12475965 14215762 16563116 19140808 21325940 22831148 23826736 24432476 24394187 23788058
8942B3788058m25612N2151J20281k27137n83202q65910j413009k114849k288112
$$ 23788058 23362446 23414597 23534878 23307741 22724539 21858629 20445620 18330771 16042659
8933A6042659j903379j408822j049208q11813o43744n22060m82156m69411m33640
$$ 16042659 14139280 12730458 11681250 10869437 10225693 9703633 9221477 8752066 8318426
8924H318426l89120l51614l10145k63814k08867j86982j70157j39871j31112j11097
$$ 8318426 7929306 7577692 7267547 7003733 6794866 6607884 6437727 6297856 6166744 6055647
8914F055647j31647j52529j25579j35367j38300j34520j28505o6557m6818m6407
$$ 6055647 5924000 5771471 5645892 5510525 5372225 5237705 5109200 5042643 4995825 4949418
8904D949418m1326l0939l7677k4494k0973J1145O6463J00118J31934J53071J77366
$$ 4949418 4908092 4877153 4839476 4814982 4794009 4805154 4871617 4971735 5103669 5256740 5434106
8893E434106J60419J43669J46664J54350J38842R7106N1220M6925J0010l7123
$$ 5434106 5594525 5738194 5884858 6039208 6178050 6275156 6326376 6373301 6383311 6346188
8883F346188q7526j50850j95543k22054k20579k05617j97904j74106j41859j04603
$$ 6346188 6258662 6107812 5912269 5690215 5469636 5264019 5066115 4892009 4750150 4645547
8873D645547n6406l7335j4043R533J7243M094l344R90k5645m7688l2507j8976
$$ 4645547 4589141 4551806 4537763 4547296 4564539 4568633 4565289 4566279 4540634 4492946 4460439 4441463
8861D441463o196N747J035J7628O8712J02923J16784J01528J04440J18226J11943
$$ 4441463 4435267 4441014 4442049 4459677 4528389 4631312 4748096 4849624 4954064 5072290 5184233
8850E184233Q9249Q1915R7474Q6506P2165M7555M6267M5102K634M224J5001J1258
$$ 5184233 5273482 5355397 5452871 5539377 5611542 5659097 5705364 5750466 5753100 5757324 5772325 5783583
8838E783583K801J5490K2233K324K8374P6540J18970J85562K10701K33297K53935
$$ 5783583 5786384 5801874 5824107 5826431 5854805 5931345 6050315 6235877 6446578 6679875 6933810
8827F933810L03703L63888M37638N63523Q37335J250118J653947J823261J532001
$$ 6933810 7237513 7601401 8039039 8602562 9439897 10690015 12343962 14167223 15699224
8818A5699224R87376N02181P2983n91617j356664j640575j423828j087995q45701
$$ 15699224 16686600 17188781 17261764 16670147 15313483 13672908 12249080 11161085 10315384
8809A0315384o92016n66318m06477k77056j73191j00687m0681N55L7361N8170
$$ 10315384 9623368 9057050 8650573 8373517 8200326 8099639 8058958 8059513 8096874 8155044
8799H155044Q2176J07492J42137J70353J96256K11854K74654L56319M40110M69234
$$ 8155044 8237220 8344712 8486849 8657202 8853458 9065312 9339966 9696285 10136395 10605629
8789A0605629M19686L74799L96443M26156M70303N71409Q26005J251808J796070
$$ 10605629 11025315 11400114 11796557 12222713 12693016 13264425 14090430 15342238 17138308
8780A7138308K416328L075629L736970M391084M787671M586820L773558K800674
$$ 17138308 19554636 22630265 26367235 30758319 35545990 40132810 43906368 46707042
8772D6707042J875766M92915j496789l030591l336365l374042l762560l643091
$$ 46707042 48582808 49075723 47578934 44548343 41211978 37837936 34075376 30432285
8764C0432285k974325k293040j789549j505942j346338j206129j078014r41656
$$ 30432285 27457960 25164920 23375371 21869429 20523091 19316962 18238948 17297292
8756A7297292q27618o91391n45248m04444k28297n2818J16660L29659N10999O13759
$$ 17297292 16469674 15778283 15233035 14828591 14600294 14547476 14664136 14993795 15504794 16118553
8746A6118553O90320Q28835J028996J148495J142036J119592J203225J460288
$$ 16118553 16808873 17637708 18666704 19815199 20957235 22076827 23280052 24740340
8738B4740340J817872K188899K630025L231796L977025M764318N384806N549189
$$ 24740340 26558212 28747111 31377136 34608932 38585957 43350275 48735081 54284270
8730E4284270N176178M330257L371481K484353J462197L55915p68552j601501
$$ 54284270 59460448 63790705 67162186 69646539 71108736 71464651 70696099 69094598
8722F9094598k053965k393117l157258m267032m754044m659556m546260m357688
$$ 69094598 67040633 64647516 61490258 57223226 52469182 47809626 43263366 38905678
8714C8905678l809624l060661k437274k032675j730610j472934j281122j122818
$$ 38905678 35096054 32035393 29598119 27565444 25834834 24361900 23080778 21957960
8706B1957960r32818o74682l75995r0202J53592L87288N47273O86567Q52789J062573
$$ 21957960 21025142 20350460 19974465 19884263 20037855 20425143 20972416 21658983 22511772 23574345
8696B3574345J178946J145599J174621J377723J654832J919172K177124K555753
$$ 23574345 24753291 25898890 27073511 28451234 30106066 32025238 34202362 36758115
8688C6758115L097691L606441L890228L830391L495781L023635K685587K589630
$$ 36758115 39855806 43462247 47352475 51182866 54678647 57702282 60387869 62977499
8680F2977499K369984J732591J183538Q00343k37174j998921l701531m716468
$$ 62977499 65347483 67080074 68263612 69063955 68826781 66827860 63126329 58409861
8672E8409861n408463n933008n719384m841685l806694k942009k307358j891268
$$ 58409861 53001398 47068390 41349006 36507321 32700627 29758618 27451260 25559992
8664B5559992j672730j571711j489307j331476j141095r86926p94133n86134l71364
$$ 25559992 23887262 22315551 20826244 19494768 18353673 17366747 16572614 15986480 15615116
8655A5615116k16429p0629J04112K24403K81205K92119L07906L75995M32928M84200
$$ 15615116 15398687 15328058 15432170 15656573 15937778 16229897 16537803 16913798 17346726 17830926
8645A7830926N93633P91727J059814J392420J756659K138736K485478K718975
$$ 17830926 18424559 19216286 20276100 21668520 23425179 25563915 28049393 30768368
8637C0768368K848015K854902K650088K160384J428140L08302r63135k070543
$$ 30768368 33616383 36471285 39121373 41281757 42709897 43018199 42055064 39984521
8629C9984521k871553l479654l913983l834080l255246k580328k003615j561756
$$ 39984521 37112968 33633314 29719331 25885251 22630005 20049677 18046062 16484306
8621A6484306j232301j011270r31090q92594q33416p34945o56061n75505n07762
$$ 16484306 15252005 14240735 13309645 12417051 11583635 10848690 10192629 9617124 9109362
8612I109362m30362l46203k87704k27514j86033j83306j67495j46689j31566j49585
$$ 9109362 8679000 8332797 8045093 7817579 7631546 7448240 7280745 7134056 7002490 6852905
8602F852905j39797j01766n7944k2937P5836J60804K84209M63039P38279J039526
$$ 6852905 6713108 6611342 6553398 6530461 6606297 6767101 7051310 7514349 8252628 9292154
8592I292154J326079J489777J340100Q81210L33176j84197o82663j240710j595168
$$ 9292154 10618233 12108010 13448110 14329320 14662496 14478299 13795636 12554926 10959758
8583A0959758j577389j284776r50599o98784n25577m00322l12877k65933k24403
$$ 10959758 9382369 8097593 7146994 6448210 5922633 5522311 5209434 4943501 4719098
8574D719098j94189j83976j67424j47338j33143j02283q8332p3879n9454l4548
$$ 4719098 4524909 4340933 4173509 4026171 3893028 3790745 3702413 3628534 3569080 3534532
8564C534532m2597l1785k6981k1432l3316l9203k9900l7238l0851J6124M5705
$$ 3534532 3491935 3460150 3433169 3411737 3378421 3339218 3309318 3272080 3241229 3257353 3303058
8553C303058R1299J89290K88478L40375L86696M04092M27916M41552M09811L39123
$$ 3303058 3394357 3583647 3872125 4212500 4599196 5003288 5431204 5872756 6282567 6621690
8543F621690K86691K12150J31351P8731J2427p4027j49988k27290k64079k80316
$$ 6621690 6908381 7120531 7251882 7330613 7343040 7269013 7119025 6891735 6627656 6347340
8533F347340l10728l49539l47389l13706k81941k41038k08293j97040j62415j21958
$$ 6347340 6036612 5687073 5339684 5025978 4744037 4502999 4294706 4097666 3935251 3813293
8523C813293j00233p3295j7607j3971K2225L4081L4034N6604P8435P3226R4812
$$ 3813293 3713060 3639765 3622158 3608187 3630412 3664493 3698527 3755131 3833566 3906792 4001604
8512D001604R6395R0691O9355P6214R9689R6629J06136J23177J43156J68145J94083
$$ 4001604 4097999 4188690 4258045 4334259 4433948 4530577 4636713 4759890 4903046 5071191 5265274
8501E265274J89912K08711K57680K56416K50042K47829K28161J93595J70734J60892
$$ 5265274 5455186 5663897 5921577 6177993 6428035 6675864 6904025 7097620 7268354 7429246
8491G429246J25494O3010R017m7975j03630j48570k18168k40634k52304k58092
$$ 7429246 7554740 7617750 7626767 7578792 7475162 7326592 7108424 6867790 6615486 6357394
8481F357394k65589k59386k82468l02505k99337k73517k38301k26658k17704j84214
$$ 6357394 6091805 5832419 5549951 5247446 4948109 4674592 4436291 4209633 3991929 3807715
8471C807715j63037j71867j63955j62993j53917j16368j06182j05717r8171p8863
$$ 3807715 3644678 3472811 3308856 3145863 2991946 2875578 2769396 2663679 2565508 2486645
8461B486645o4396n6542l1073r371J334M7740R5061J32180K02811K60518K93225
$$ 2486645 2422249 2365707 2334634 2325263 2326597 2374337 2469398 2601578 2804389 3064907 3358132
8450C358132K93970K66497K19109K17389K36187K59098K48547K52820K06399J28302
$$ 3358132 3652102 3918599 4137708 4355097 4591284 4850382 5098929 5351749 5558148 5686450
8440E686450N4382k9573j44000k19554k38757k08960k11902k13642k32810k75647
$$ 5686450 5740832 5711259 5567259 5347705 5108948 4899988 4688086 4474444 4241634 3965987
8430C965987k84941k75667k43513j87583j42669j10848q8123p6280n2046j9035
$$ 3965987 3681046 3405379 3161866 2974283 2831614 2720766 2632643 2556363 2504317 2485282
8420B485282j4786o975K3117K8286N6463Q1000J24066J48435J85433K34630K68315
$$ 2485282 2470496 2463521 2486638 2514924 2571387 2652387 2776453 2924888 3110321 3344951 3613266
8409C613266K73617K66896K36769J91168J37009P7175M1180M0029Q0836J40033
$$ 3613266 3886883 4153779 4390548 4581716 4718725 4795900 4837080 4877109 4957945 5097978
8399E097978K22205L36635M54133N66417P05125Q55855J016405J231830J561344
$$ 5097978 5320183 5656818 6110951 6677368 7382493 8238348 9254753 10486583 12047927
8390A2047927K110632L038687M477655O555077R044005J1131854J1952140J1266585
$$ 12047927 14158559 17197246 21674901 28229978 37273983 48405837 60357977 71624562
8382G1624562R269111N799357R33104m023466p646858r898809j1050485j0478737
$$ 71624562 80893673 86693030 87626134 83602668 75955810 66057001 55006516 44527779
8374D4527779q415414o130165m343308l072823k205434j599225j199520r12457
$$ 44527779 36112365 29982200 25638892 22566069 20360635 18761410 17561890 16649433
8366A6649433p32955n69261m23824k94064j60456n3046O3592K11703M03981O04233
$$ 16649433 15916478 15347217 14923393 14629329 14468873 14415827 14479419 14691122 15095103 15699336
8356A5699336R32041J432830K089625K680364K906189K705383K235845J767380
$$ 15699336 16631377 18064207 20153832 22834196 25740385 28445768 30681613 32448993
8348C2448993J112745K34345m66030m89703P9197O64118J047599J294669J430477
$$ 32448993 33561738 33796083 33330053 32840350 32919547 33583665 34631264 35925933 37356410
8339C7356410J489127J446538J375841J705818K616586L922750N151242N677102
$$ 37356410 38845537 40292075 41667916 43373734 45990320 49913070 55064312 60741414
8331F0741414N496592M972409L895018J757666q49791k545986k938654l000219
$$ 60741414 66238006 71210415 75105433 76863099 76013308 73467322 70528668 67528449
8323F7528449l002435k812661k482478k092626k022007k701455l733283m152002
$$ 67528449 64526014 61713353 59230875 57138249 55116242 52414787 48681504 44529502
8315D4529502l932323l571668l264780k914174k541530k272739j975429j701680
$$ 44529502 40597179 37025511 33760731 30846557 28305027 26032288 24056859 22355179
8307B2355179j540854j363543j121745r14588p91055p25987o71581o31130n57584
$$ 22355179 20814325 19450782 18329037 17414449 16623394 15897407 15225826 14594696 14037112
8298A4037112m70963l94237l18334k22883j17255J0906J64699L37985O16405R97624
$$ 14037112 13566149 13171912 12853578 12630695 12513440 12524346 12689045 13027030 13643435 14641059
8288A4641059J525438K358685L535492N070567O618238P624645P845571P423663
$$ 14641059 16166497 18525182 22060674 27131241 33749479 41374124 49219695 56643358
8280E6643358O302250L970191M13711l102350n355125o678371p710188p898558
$$ 56643358 62945608 66915799 67329510 64227160 58872035 52193664 44483476 36584918
8272C6584918o808503n186542l717308k650325j933945j439731j112755r01870
$$ 36584918 29776415 24589873 20872565 18222240 16288295 14848564 13735809 12833939
8264A2833939p58078o70660n97171n52727n29981m95668m39658l93002l73590
$$ 12833939 12075861 11405201 10808030 10255303 9725322 9229654 8789996 8396994 8023404
8255H023404l48030l09057k85405k85164k77242k24567k14712j98412j74774j57491
$$ 8023404 7675374 7366317 7080912 6795748 6518506 6293939 6079227 5880815 5706041 5548550
8245E548550j64277j63362j44728j26126j16635o8880n8382o6053p7963o0361
$$ 5548550 5384273 5220911 5076183 4950057 4833422 4764542 4706160 4640107 4562144 4501783
8235D501783o0008n6666n0366l6976k546N0209J45458K77003M25536N26027N38321
$$ 4501783 4441775 4385109 4334743 4297767 4295221 4345430 4490888 4767891 5193427 5719454 6257775
8224F257775M80602L95534K80929J79626J11456O6995M5840J5357k9711j39898
$$ 6257775 6738377 7133911 7414840 7594466 7705922 7772917 7818757 7834114 7804403 7664505
8214G664505k86811m57757o03143o60709o37385n59512m40943l25535k37208j67690
$$ 7664505 7377694 6919937 6316794 5656085 5018700 4459188 4018245 3692710 3455502 3287812
8204C287812j33293j15045q8917o9367n4262l0785j2906M324J4788N5367Q0349
$$ 3287812 3154519 3039474 2950557 2881190 2826928 2796143 2783237 2787561 2802349 2857716 2938065
8193B938065J23872J61552J71732J62339J14838J17852J22728J38436J53884J80590
$$ 2938065 3061937 3223489 3395221 3557560 3672398 3790250 3912978 4051414 4205298 4385888
8183D385888J70344J28931R2280J02833P5612M8870O2416J59832K69269L28482
$$ 4385888 4556232 4685163 4777443 4880276 4955888 5004758 5067174 5227006 5496275 5824757
8173E824757L64454L24796K70031J93367J09936N9898N5372M8057P6583R1194
$$ 5824757 6189211 6514007 6784038 6977405 7087341 7147239 7202611 7250668 7327251 7418445
8163G418445O6444p012j08935k16466k96225l43737l18525k64651k17587k03897
$$ 7418445 7484889 7477877 7368942 7152476 6856251 6512514 6193989 5929338 5711751 5507854
8153E507854j92707j85636k05805k42293k86332k78387k36331k12759j83387j57518
$$ 5507854 5315147 5129511 4923706 4681413 4395081 4116694 3880363 3667604 3484217 3326699
8143C326699j32068j22581j01400q9267n6876Q929M7110O5843O4299N7907K8046
$$ 3326699 3194631 3072050 2970650 2881383 2824507 2833436 2880546 2946389 3010688 3068595 3096641
8132C096641L3499M0497L4216N7841J11264J61436K24543L15598L60251L88975
$$ 3096641 3130140 3170637 3204853 3262694 3373958 3535394 3759937 4075535 4435786 4824761
8122D824761M01498L58389K68312J95429J48890J37757J15539R9352P7622N2768
$$ 4824761 5226259 5584648 5852960 6048389 6197279 6335036 6450575 6549927 6627549 6680317
8112F680317m1484j48491k78247l92763m16550l64930k53433j22115L2244J26219
$$ 6680317 6638833 6490342 6212095 5819332 5402782 5037852 4784419 4662304 4694548 4820767
8102D820767K19552K96095L43111L85517M05271M20334L61654K65140J48004R839
$$ 4820767 5040319 5336414 5679525 6065042 6470313 6890647 7252301 7517441 7665445 7675284
8092G675284j48766k64748l52955l81645l89191l35241k54039j82229j44953j04777
$$ 7675284 7526518 7261770 6908815 6527170 6137979 5802738 5548699 5366470 5221517 5116740
8082E116740o8326m9443m9990m3516m1533K011N2525Q5046R8665J32832J82866
$$ 5116740 5048414 4998971 4948981 4905465 4863932 4865943 4918468 5003514 5102179 5235011 5417877
8071E417877K44033L16651L85116M52244N41896O10025O83280P80500R16036J114723
$$ 5417877 5661910 5978561 6363677 6815921 7357817 7967842 8651122 9431622 10347658 11462381
8061A1462381J416288J844576K455899L328224M611853O535554R197282J2434523
$$ 11462381 12878669 14723245 17179144 20507368 25119221 31654775 40852057 53286580
8053E3286580J5690287J8463471K0313446K0054158J6521450J0342373L416493
$$ 53286580 68976867 87440338 107753784 127807942 144329392 154671765 158088258
8046A58088258l419830j0766975j6598373j8550421j8357445j6781291j3508148
$$ 158088258 154668428 143901453 127303080 108752659 90395214 73613923 60105775
8039F0105775r919386p108417n146362l791221k843611k183772j705067j360360
$$ 60105775 50186389 43077972 37931610 34140389 31296778 29113006 27407939 26047579
8031B6047579j097335r04923p67009o39529n42448m56390l38985j78188j9364
$$ 26047579 24950244 24045321 23278312 22638783 22096335 21639945 21300960 21122772 21103408
8022B1103408J35346L04657M36730N86358P64045R73187J248761J636481K180209
$$ 21103408 21238754 21543411 21980141 22566499 23330544 24303731 25552492 27188973 29369182
8013B9369182L005842M137664N851928Q499819J2728041J9300624K7861591L6402564
$$ 29369182 32375024 36512688 42364616 50864435 63592476 82893100 110754691 147157255
8005A47157255M1784016M0418053L2200442J9328860M860876r557509k5264814
$$ 147157255 188941271 229359324 261559766 280888626 285749502 276191993 250927179
7998B50927179l5786062l8978565l5716019k8062841k0352811j4502275j0399924
$$ 250927179 215141117 176162552 140446533 112383692 92030881 77528606 67128682
7991F7128682p585621n666163m378409l472699k815355k395701k119022j862065
$$ 67128682 59543061 53876898 49498489 46025790 43210435 40814734 38695712 36833647
7983C6833647j656281j526702j409078j268518j117492r90423q70657p39178o32799
$$ 36833647 35177366 33650664 32241586 30973068 29855576 28865153 27994496 27255318 26622519
7974B6622519n30895l72751j88667K5460L00912O35157J027410J529478K193723
$$ 26622519 26091624 25718873 25530206 25555666 25856578 26491735 27519145 29048623 31242346
7965C1242346L260222M852437O957804R226061J1198255J2743896J3569996J2359139
$$ 31242346 34502568 39355005 46312809 55538870 66737125 79481021 93051017 105410156
7957A05410156Q462187L852752L73539l611160r502934j3199049j2597161j1474315
$$ 105410156 113872343 117725095 118098634 114487474 104984540 91785491 79188330 67714015
7949F7714015j1182696r713463p325334n222394l769867k830951k224269j824970
$$ 67714015 56531319 46817856 39492522 34270128 30500261 27669310 25445041 23620071
7941B3620071j528028j324448j159567j022216q97609q08647p38745o83145o57350
$$ 23620071 22092043 20767595 19608028 18585812 17688203 16879556 16140811 15457666 14800316
7932A4800316o16727n95180n64675n24740m70656m39684l93399l36615l05874
$$ 14800316 14183589 13588409 13023734 12498994 12028338 11588654 11195255 10858640 10552766
7923A0552766k87049k61990k76386k95544l13270l39258l59252l42230l18552
$$ 10552766 10265717 10003727 9727341 9431797 9118527 8779269 8420017 8077787 7759235
7914G759235k99838k75890k50563k23153k06405k00224j98149j85175j97471j99488
$$ 7759235 7459397 7183507 6932944 6709791 6503386 6303162 6105013 5919838 5722367 5522879
7904E522879j93327j82534j87120j81174j64649j77448j80744j65712j57588j68595
$$ 5522879 5329552 5147018 4959898 4778724 4614075 4436627 4255883 4090171 3932583 3763988
7894C763988j36132j04388j05522q5723p5024o9766o7741p3570q0075o6571p9089
$$ 3763988 3627856 3523468 3417946 3332223 3257199 3187433 3119692 3046122 2966047 2899476 2820387
7883B820387q6880o4851p7680o9903l2472j4744m350J8470K1894M505J9082j7484
$$ 2820387 2733507 2668656 2590976 2521073 2488601 2473857 2469507 2487977 2509871 2514376 2533458 2515974
7871B515974n9641o7163o8097q6817q5922q1636p3166o6736p1656n9982n3345
$$ 2515974 2456333 2389170 2321073 2234256 2148334 2066698 1993532 1926796 1855140 1795158 1741813
7860A741813n7589n3365m8292o7202p3267o4032l7516m3512n2418m9851m3205
$$ 1741813 1684224 1630859 1582567 1515365 1442098 1378066 1340550 1297038 1244620 1194769 1151564
7849A151564m3521l2646j4886j5706l3485l1296l0164l7810l0336k6114l9207
$$ 1151564 1108043 1075397 1060511 1044805 1011320 980024 949860 912050 881714 855600 816393
7838H16393k2302l2629l0347k5167j6117k1275n548j3987o321J4092J493R037
$$ 816393 794091 761462 731115 705948 689831 668556 663008 649021 642700 656792 658285 667322
7826F67322K2592K7766L1473N2858N2144M6930J8789q27q617j0897m1297m6755
$$ 667322 689914 717680 749153 802011 854155 901085 919874 919047 910430 899533 858236 811481
7814H11481o8921o5512l9976k6128j2494j5816P123R387r801l999P714M123r029
$$ 811481 742560 677048 637072 610944 598450 582634 589757 599144 589343 585344 593058 597181 588152
7801E88152j4777r268p021l268p027k6236k5504l2553j3457m803j1994q964j1475
$$ 588152 573375 564107 557086 553818 546791 520555 495051 462498 449041 444238 432244 423280 411805
7788D11805j2781Q841m52j5071M143L833n423l889p423j6657j2140R113J828k969
$$ 411805 399024 407865 407413 392342 396485 400318 394895 391006 383583 366926 354786 363899 365727 362758
7774C62758j1037J7116N418J3423P650k744l923J7166J5711J855r32M95K937n228
$$ 362758 351721 368837 374255 387678 395328 392584 388661 405827 421538 423393 422461 422956 425893 420665
7760D20665O324N420o003n295n014j2221k0145o948j0984j3944l3047j0852j4145
$$ 420665 426989 432409 426406 421111 416097 403876 383731 376783 365799 351855 318808 307956 293811
7747B93811k0387j8924j8341l441l866o005l756r123n757M987n904k3373j5440
$$ 293811 273424 254500 236159 232718 228852 222847 219091 209968 204211 209198 203294 179921 164481
7734A64481r022O734k481N126m941j625J7836P508K3866J2498J5469P917m721
$$ 164481 155459 162193 159712 164838 159897 158272 176108 183616 207482 219980 235449 243366 238645
7721B38645j2093m242m934o745J0055J1652M961J949j103Q362J654r683P723O180
$$ 238645 226552 222310 217376 210631 220686 232338 237299 239248 238145 246507 248161 238478 246201 252381
7707B52381k305k2586j9494p910j6838j4334j079j1625j7349r126L851K661J426
$$ 252381 250076 227490 207996 200086 183248 168914 167835 156210 138861 129735 133586 136247 137673
7694A37673l431m192P759L55o940j8376j1090M482N156o467j413O60M98K130J0287
$$ 137673 134242 130050 137809 138164 131224 112848 101758 106240 111396 104929 103516 104176 104674 106804 117091
7679A17091m091j8959L528P863p137P505N137k788L081N576J0766K4310K3428
$$ 117091 113000 94041 97569 105432 98295 105800 110937 108149 111230 116806 127572 151882 175310
7666A75310Q497L51p689O697k43P382K0870L3461M9915O1664Q6378Q9237J15676
$$ 175310 183807 184158 176469 183166 182923 190305 211175 244636 294551 356215 442593 531830 647506
7653F47506J03909R2064N2149J4059l0330o4746r9564j25270r3192q8477o5194
$$ 647506 751415 843479 895628 909687 879357 814611 715047 589777 496585 408108 342914
7642C42914n1714m2039k7553j3066J750J665l139j8074j9979j5594K657p993N480
$$ 342914 291200 249161 221608 208542 210292 211957 208818 190744 170765 155171 157828 149835 155315
7629A55315j1526p589j491J7905L700O754O174Q845K390P871q81N507K536Q543
$$ 155315 143789 136200 134709 152614 156314 163068 169242 178087 180477 188348 187467 192974 195510 204053
7615B04053K8384K7295M0833P3748R7861J46810K00867K46840K39920J84902J12547
$$ 204053 232437 259732 300565 374313 472174 618984 819851 1066691 1306611 1491513 1604060
7604A604060J3013n8492j26940k26912k62507j95179j35626j05900p0167n2319
$$ 1604060 1617073 1558581 1431641 1204729 942222 747043 611417 505517 435350 383031
7594C83031m1518k9059k1567j3762j0550j7397K477j2424l2816j7768q09l247
$$ 383031 341513 312454 290887 277125 266575 249178 251655 239231 206415 188647 187838 184591
7582A84591J384k780j7020j4679j261j604q870j619j56J1245J9631J3493J0901
$$ 184591 185975 183195 166175 151496 150235 148631 139761 138142 137986 149231 168862 182355 193256
7569A93256k03M624J1468K8969O4937Q8743P5303R0086R6305O2653K8923r579
$$ 193256 193053 197677 209145 238114 303051 391794 467097 557183 653488 716141 745064 735485
7557G35485m7654o5221j03185r5060q5307o7303l5648r180j3204k2208o820j9114
$$ 735485 687831 622610 519425 424365 339058 271755 236107 226927 213723 191515 184695 165581
7545A65581j7519j941j382k6466l1448r849J1592k163j4526j2913j1329M36K865
$$ 165581 148062 146121 144739 118273 86825 76976 88568 86405 71879 58966 47637 48073 50938
7532E0938N757Q649r25k4511p138J0197R252K214n395j0091n311J242J907L702
$$ 50938 56695 65344 64419 39908 32770 42967 52219 54433 49038 38947 33636 34878 36785 40487
7518D0487n44J3052L005o669M900P23r432k073o658j5210p006m669J541N923k483
$$ 40487 39943 52995 56000 49331 54231 54954 45522 43449 36791 21581 14575 9906 11447 17370 14887
7503A4887J0145K6214O59j1462p943J246j1370n575q280q778L565J2248K488j6562
$$ 14887 25032 51246 51905 40443 32500 33746 22376 16801 8521 -257 3308 15556 18044 1482
7489A482n623K319J1481j1786J0427M873r353P396K1824n171k3138p075k716K538
$$ 1482 -4141 -1822 9659 -2127 8300 13173 3820 11216 33040 27869 4731 -2344 -5060 -2522
7475b522O830Q30O520M009k107Q07L139L896q665j3849P80k414m166m456r97n991
$$ -2522 4308 5138 11658 15667 13560 14367 17506 21402 12737 -1112 -332 -2746 -6912 -11368 -12365 -18356
7459a8356J0951o462j1405L431J6756J0319P023j910J0962P45n666M717k281R18
$$ -18356 -7405 -13867 -25272 -21841 -5085 5234 12257 10347 21309 22054 16388 21105 18824 19742
7445A9742R70M076J527j2440j3197J0700J6100j4785l348J0544N54q284m144l720
$$ 19742 20712 24788 26315 13875 678 11378 27478 12693 9345 19889 20443 12159 8015 4295
7431D295n940j573J4472M014M873j0772M090O958m112j8999j4850J873J0042n21
$$ 4295 -1645 -3218 11254 15268 20141 9369 13459 20417 16305 -2694 -17544 -15671 -5629 -6150
7417f150q846R733J0995j635k379q738L350m271J6464L082j2634k598N800O469
$$ -6150 -14996 -5263 5732 4097 1718 -7020 -3670 -7941 8523 11605 -1029 -3627 2173 8642
7403H642p568r92O638N615j0713j9634m636o15o652N034j12l149P721M384K901
$$ 8642 1074 82 6720 12335 1622 -18012 -22648 -23263 -29915 -24881 -24993 -28142 -20421 -16037 -13136
7388a3136J2368J5661O274j5238M02n756m521k647m55J841l672N99K200K749Q174
$$ -13136 -768 14893 21167 5929 6331 575 -3946 -6593 -7048 -5207 -8879 -8280 -6080 -3331 4843
7373D843J5314K0654M336n382q345j0483m226J0834p37q94M750n035q591n623
$$ 4843 20157 40811 45147 39765 31420 20937 16711 27545 26808 25914 30664 25629 17038 11415
7359A1415k841r295m478L531m747O896N080j0089p802J6294O17r854o189j5657
$$ 11415 8574 -721 -5199 -1668 -6415 481 5561 -4528 -12330 3964 4581 -5273 -11462 -27119
7345b7119m970n095n02J8859K0083J517n709m642l430p073l307L149J3137N849
$$ -27119 -32089 -37184 -37686 -18827 1256 2773 -2936 -7578 -11008 -18081 -21388 -18239 -5102 747
7331G47J1799J3057j1923o278j7488N526k856p011r44q221N683P528O627j604
$$ 747 12546 25603 13680 7402 -10086 -4560 -7416 -14427 -15371 -23592 -17909 -10381 -3754 -5358
7317e358J2732Q820l742J263l466r558n573L239O471j6218P001N953j960m079
$$ -5358 7374 16194 12452 13715 10249 691 -4882 -1643 4828 -11390 -4389 1564 -396 -4475
7303d475r928P813Q658J0532M258k65J3060r157p730l335r250J5o041j227m901
$$ -4475 -14403 -6590 2068 12600 16858 16593 29653 20496 12766 9431 181 196 -5845 -7072 -11973
7288a1973l74J5434K920k68q131N221M660k4272J1376R229k637K633N504R740
$$ -11973 -12347 3087 6007 5739 -2392 2829 7489 -16783 -5407 3822 1185 3818 9322 19062
7274A9062n483p136j057k253K916j0873p078o567r011k412J2675Q522N639m223
$$ 19062 13579 6443 5386 3133 6049 -4824 -11902 -18469 -27480 -29892 -17217 -8695 -3056 -7279
7260g279j661j902J220J5754J4023l450o147o150j853P490j1555k5260n144J8615
$$ -7279 -8940 -10842 -9622 6132 20155 16705 10558 4408 2555 10045 -1510 -26770 -31914 -13299
7246a3299J6023m081q680k933n258O728J842J862j1508N651J3382M992j522j8491
$$ -13299 2724 -1357 -10037 -12970 -18228 -11500 -9658 -7796 -19304 -13653 -271 4721 3199 -15292
7232a5292j3427L645N854l36J3058O087l443j3517j3379M084R696l216J654R623
$$ -15292 -28719 -25074 -19220 -19556 -6498 -411 -3854 -17371 -30750 -26666 -16970 -20186 -18532 -8909
7218h909J422M790M615n069n004O041J3947O811p710j3402j0654k035N118R966
$$ -8909 -7487 -2697 1918 -3151 -8155 -2114 11833 18644 10934 -2468 -13122 -15157 -10039 -73
7204g3n128j919O536n389j2019r459M285J3985Q896J0762n072l646J331o063k363
$$ -73 -5201 -7120 -584 -5973 -17992 -27451 -23166 -9181 -285 10477 5405 1759 3090 -2973 -5336
7189e336j0656R532K653p856j2212L093M346J183P468q60j8797r855J6143P734
$$ -5336 -15992 -6460 -3807 -11663 -23875 -20782 -16436 -15253 -7785 -8645 -27442 -37297 -21154 -13420
7175a3420o179j4427r310N478K1395J5068j6495j2391m151Q70O7M420n854R578
$$ -13420 -19599 -34026 -43336 -37858 -16463 -1395 -17890 -30281 -34432 -33562 -33495 -29075 -34929 -25351
7161b5351L221P944N204J0643J1284r17n284j785m009l817q523j5122N314n575
$$ -25351 -22130 -14186 -8982 1661 12945 12028 6744 4959 950 -2867 -11390 -26512 -21198 -26773
7147b6773k843k810J3396O353o630M09M301k789j0858Q26J690P107O914N233j682
$$ -26773 -29616 -32426 -19030 -12677 -19307 -18898 -14597 -17386 -28244 -27418 -25728 -18621 -11707 -6474 -8156
7132h156j4602r220P031j167J420n19j290q54r860o228M533O161o049J800o062
$$ -8156 -22758 -31978 -24947 -26114 -24694 -25213 -26503 -27357 -37217 -43445 -38912 -32751 -38800 -37000 -43062
7117d3062K0768L782K759M106l205P189L441n389l319J736j2775M438O049p459
$$ -43062 -22294 -18512 -15753 -11647 -14852 -7663 -4222 -9611 -12930 -11194 -23969 -19531 -13482 -20941
7103b0941m242J2524N702j1442q282O106m127j5508Q339P115k819r04P29k235
$$ -20941 -25183 -12659 -6957 -18399 -26681 -20575 -24702 -40210 -31871 -24756 -27575 -28479 -27750 -29985
7089b9985J4179j081j0737J403J4888L61J0862K777p607j4096J002J2795r354
$$ -29985 -15806 -16887 -27624 -26221 -11333 -10972 -110 2667 -4940 -19036 -18034 -5239 -14593
7076a4593l068m136K647J4468J1754n037r64j535N483j1426N807q153p127q836
$$ -14593 -17661 -21797 -19150 -4682 7072 2035 1071 -464 5019 -6407 -600 -8753 -15880 -24716
7062b4716k931N875L973J578L539M338L192L458J303O541Q451j0359j5614J0552
$$ -24716 -27647 -21772 -17799 -16221 -12682 -8344 -5152 -1694 -391 6150 14601 4242 -11372 -820
7048h20Q193j7832r533n20J3835L366p070K34P841M256k351m06O785K184j1080
$$ -820 7373 -10459 -19992 -20512 -6677 -3311 -10381 -10147 -2306 1950 -401 -807 5978 8162 -2918
7033b918n992q547l46Q311L965K1898R005J678j6940L342l543k0362q102j5872
$$ -2918 -8910 -17457 -17803 -9492 -5527 16371 25376 27054 10114 13456 9913 -10449 -18551 -34423
7019c4423m347J1768O131J4717J4483K427j6051L408R763K427n395m044J834j1233
$$ -34423 -38770 -27002 -20871 -6154 8329 10756 -5295 -1887 7876 10303 4908 864 2698 -8535
7005h535r915j767P007n364l824O396L424o760l863N41K571O315Q03j0201J4397
$$ -8535 -18450 -20217 -13210 -18574 -22398 -16002 -12578 -19338 -23201 -22660 -20089 -13774 -12971 -23172 -8775
6990h775O790J424N176M679J576p299j1671k2868m677J1233K474R985J4463p552
$$ -8775 -1985 -561 4615 9294 10870 3571 -8100 -30968 -35645 -24412 -21938 -11953 2510 -5042
6976e042j886k720J8503P799k0673j4632p772J1184J97J0971J4382n90l827n470
$$ -5042 -6928 -9648 8855 16654 -4019 -18651 -26423 -15239 -15042 -4071 10311 9721 5894 424
6962D24J1641j1885k4177j281K6250J726j3581p692N340p676k421J0830Q903l572
$$ 424 12065 180 -23997 -25278 972 2698 -10883 -18575 -13235 -20911 -23332 -12502 -3599 -7171
6948g171L27J3134L596k0805k806O452J989Q32p87j2391J6003P823m985r546J5892
$$ -7171 -6844 6290 9886 -10919 -13725 -7273 -5284 -4452 -5239 -17630 -1627 6196 1211 -8335 7557
6933G557J5957L452j9670n602k517j6652j3955J009P014R307l997M824L440k218
$$ 7557 23514 26966 7296 1694 -823 -17475 -31430 -30421 -23407 -14100 -18097 -13273 -9833 -12051
6919a2051r219J765J0880J004j9514q099J3514L373p38P80J3674j150K42J551
$$ -12051 -21270 -19505 -8625 -7621 -27135 -35234 -21720 -18347 -19085 -18305 -4631 -5781 -5539 -3988
6905c988R148l846o702m021n884K928J71p741r315m376J309J0701L447O23O277
$$ -3988 5160 1314 -5388 -9409 -15293 -12365 -12194 -19935 -29250 -33626 -32317 -21616 -18169 -17546 -11269
6890a1269J5763K222l95k189p117k041q206j3202m77j761J6648J8207O044m534
$$ -11269 4494 6716 6321 4132 -2985 -5026 -13232 -26434 -26911 -28672 -12024 6183 12227 7693
6876G693j1039j2797L642L883K72j4615j0119j539k526O473J1118n295J5143J0659
$$ 7693 -3346 -16143 -12501 -8618 -8346 -22961 -33080 -34619 -37145 -30672 -19554 -24849 -9706 953
6862I53K659p890n249P137O513q319O371R757j4579o311j9495M203J7358J1315
$$ 953 3612 -4278 -9527 -2390 4123 -4196 2175 11932 -2647 -8958 -28453 -24250 -6892 4423
6848D423J807n680n719O81m672j4926N150K20l578M465J6992J6068j8679K521
$$ 4423 6230 550 -5169 -4488 -9160 -24086 -18936 -18716 -22294 -17829 -837 15231 -3448 -927
6834i27K1109N811k0317r281K899p7m520q901j1336n677r0r845L103k717j0911
$$ -927 20182 25993 5676 -3605 -706 -783 -5303 -14204 -25540 -31217 -31307 -41152 -38049 -40766 -51677
6819e1677J3444R343J2935J455P272J1152K890j5143r839j390O233L412j957j364
$$ -51677 -38233 -28890 -15955 -14500 -7228 3924 6814 -8329 -18168 -19558 -13325 -9913 -11870 -13234
6805a3234J0257m245j6256M646k19M718J0273l13k70J5935m236j6191j3583n357
$$ -13234 -2977 -7222 -23478 -18832 -19051 -14333 -4060 -4373 -4643 11292 7056 -9135 -22718 -28075
6791b8075q853N028k311p66J6801L791j0711k598j350K636R624k892j3435k077
$$ -28075 -36928 -31900 -34211 -34977 -18176 -14385 -25096 -27694 -29044 -26408 -16784 -19676 -33111 -35188
6777c5188J3531J8819O228l162j9281l883m272M137J8829J9305N03J698j3649
$$ -35188 -21657 -2838 3390 228 -19053 -22936 -27208 -23071 -4242 15063 15566 17264 3615
6764C615q175P647J981j2534j0080l79J2734j287Q769Q344Q51j8311j3372O800
$$ 3615 -4560 3087 5068 -7466 -17546 -17925 -5191 -6478 2291 10635 11486 -6825 -20197 -13397
6750a3397K778k063O087l651l476M581R234k903j0591J0400P126j6918k570q81
$$ -13397 -10619 -12682 -6595 -10246 -13722 -9141 93 -2810 -13401 -3001 4125 -12793 -15363 -16244
6736a6244K675J6650n498o990j552m254K333o607n123K417P133K3119j1074j4726
$$ -16244 -13569 3081 -2417 -9407 -10959 -15213 -12880 -19487 -24610 -22193 -15060 8059 -3015 -17741
6722a7741J7134M419m86R740L549o79J0772J718k4142p926N398N091r244n740
$$ -17741 -607 3812 3326 13066 16615 15936 26708 28426 4284 -3642 1756 6847 -2397 -8137
6708h137k995J837m755j7804l282M908Q031q35L062J0987k258m433L744p444k0333
$$ -8137 -11132 -9295 -14050 -31854 -35136 -30228 -22197 -23032 -19970 -8983 -11241 -15674 -11930 -19374 -39707
6693c9707J4884J5365m119j0323k612M771M543l930M772P731k880Q29o846K74
$$ -39707 -24823 -9458 -13577 -23900 -26512 -21741 -17198 -21128 -16356 -8625 -11505 -10676 -17522 -17248
6679a7248n012K621P905Q068L365M075J262k12Q326k3481j605J0762j1231m711
$$ -17248 -22260 -19639 -11734 -3666 -301 3774 5036 4824 13150 -10331 -11936 -1174 -12405 -17116
6665a7116P583l303J400J1952o893j4160j3226k864J7432O428P872N312J066q688
$$ -17116 -9533 -12836 -11436 516 -6377 -20537 -33763 -36627 -19195 -12767 -4895 417 1483 -7205
6651g205p079J433O698m960M025j0589r839P652l267N905R224J8193K0905r12
$$ -7205 -14284 -12851 -6153 -11113 -7088 -17677 -27516 -19864 -23131 -17226 -8002 10191 31096 30184
6637C0184k5943j0641l818P229n619N300J6116K201p612l567l353o163m095j3209
$$ 30184 4241 -6400 -10218 -2989 -8608 -3308 12808 15009 7397 3830 477 -5686 -9781 -22990
6623b2990K642P876p6J4926J062n457j4539j1316Q925K703J0211l678J046M260
$$ -22990 -20348 -12472 -12548 2378 3440 -2017 -16556 -27872 -18947 -16244 -6033 -9711 -8665 -4405
6609d405N315O819R332O442o524k138r909p579K074m420n897k430J7887J5690
$$ -4405 910 7729 17061 23503 16979 14841 4932 -2647 -573 -4993 -10890 -13320 4567 20257
6595B0257M33q309q798j9O914l162k1075j1781R097m799m348n910o768R723J1523
$$ 20257 20690 12381 3583 3564 10478 7316 -13759 -25540 -16443 -21242 -25590 -31500 -38268 -28545 -17022
6580a7022J231k538J401J1464o78L128N183L709K89L289N260l988n713L600j3339
$$ -17022 -15791 -18329 -16928 -5464 -6142 -3014 2169 5878 6167 9456 14716 10728 5015 8615 -4724
6565d724r737J5664L4744K1679K7177J6874J9249J3284j1356J434j2879l4157
$$ -4724 -14461 1203 35947 57626 84803 101677 120926 134210 122854 124288 111409 77252
6553G7252l3357k5614m342n683N629J2383O534k077j0756J345J2645j83L810j1903
$$ 77252 43895 18281 13939 8256 13885 26268 32802 30725 19969 21314 33959 33776 37586 25683
6539B5683j3738K779R293n925o53j7247n588J1205n466n610j919O263L620M303
$$ 25683 11945 14724 24017 18092 17439 192 -5396 5809 343 -5267 -7186 -923 2697 7000
6525G000M66P330n490M299J0555j5194j2305p689O270J1006R144J21j1668k4803
$$ 7000 7466 14796 9306 13605 24160 8966 -3339 -11028 -4758 6248 15392 15513 3845 -20958
6511b0958P22J4852J5559M72o952N45J2339L059j1929j446j616k516m000R037
$$ -20958 -20236 -5384 10175 10647 3695 4240 16579 19638 7709 6263 4647 2131 -1869 7168
6497G168j925L005n352o06j4164J542J7624N729j2317N954j275p626j3077K1012
$$ 7168 5243 8248 2896 2290 -11874 -10332 7292 13021 704 6658 5383 -2243 -15320 5692
6483E692N37n413K572p782L668K674n715M233P400j2192o641o745P688J2892K787
$$ 5692 6229 816 3388 -4394 -726 1948 -3767 466 7866 -4326 -10967 -17712 -10024 2868 5655
6468E655P17n286m781N082P098L659O214k217j413O976J341j1848K804n33j274
$$ 5655 6372 1086 -3695 1387 8485 12144 18358 16141 14728 21704 23045 11197 14001 13468 12194
6453A2194q295k562q582J372J8251L390l912k845k143O910N307m715R355J1558
$$ 12194 3899 1337 -7245 -5873 12378 15768 11856 9011 6868 13778 19085 14370 23725 35283
6439C5283L59L501P943l921q037N641k547q211K724j6706j1102M008Q164p979
$$ 35283 35642 39143 47086 43165 35128 40769 38222 30011 32735 16029 4927 8935 17099 9120
6425I120J3443K4678Q825k82j3297j1389j6246O808R755j3127j0516R657L446
$$ 9120 22563 47241 56066 55784 42487 31098 14852 21660 31415 18288 7772 17429 20875
6412B0875p813r24P13j179P379J8404J9322n366j6868k0471q406J5566K358k390
$$ 20875 13062 12138 12851 11672 19051 37455 56777 51411 34543 14072 5666 21232 23590 21200
6398B1200J205Q366P720n518P8R552p712l778N163M611N402J0441R843J0536J7501
$$ 21200 22405 30771 38491 32973 33051 42603 34891 31113 36276 40887 46289 56730 66573 77109 94610
6383I4610N115k323k493L710J8813N356J2382J1017J5059L1746K7504L7291K9632
$$ 94610 99725 97402 94909 98619 117432 122788 135170 146187 161246 192992 220496 257787 287419
6370B87419M2935N9616O6128O1424O3959Q0501O2053J9057J9491j6874l6477n0874
$$ 287419 330354 389970 456098 517522 581481 661982 724035 743092 762583 745709 709232 658358
6358F58358o3543n3828m9800n8135n1042k7158l1918l3143j8915j0494k6249k9028
$$ 658358 594815 540987 491187 433052 382010 354852 322934 289791 270876 260382 234133 205105
6346B05105q818p621r667r051j2668j7194j1135L447k260m615l362j596p052j6355
$$ 205105 196287 188666 178999 169948 157280 140086 128951 132398 130138 125523 122161 120565 113513 97158
6332I7158m405l579j1109n080p223J2883R629j3701j8764j4458Q943Q468q171
$$ 97158 92753 89174 78065 72985 65762 78645 88274 74573 55809 41351 50294 58762 50591
6319E0591k468q261j8521J0585J6579K759j0438M546J4336k378O22o730M413r6
$$ 50591 48123 39862 21341 31926 48505 51264 40826 45372 59708 57330 57952 51222 55635 55539
6305E5539q521K420k431J357J4147R892p314j0687M524J2084M946k891l658l326
$$ 55539 47018 49438 47007 48364 62511 72403 65089 54402 58926 71010 75956 73065 69407 66081
6291F6081j284j6343j9484L062K984j434p723p887M793J2492j937m195O690O311
$$ 66081 64797 48454 28970 32032 35016 33582 25859 17972 22765 35257 33320 29125 35815 42126
6277D2126j1010k5634o791M773j212J1419O759j1212k1759L676K2755O908p437
$$ 42126 31116 5482 -1309 3464 2252 13671 20430 9218 -12541 -8865 13890 20798 13361
6264A3361P58l885J1853M8j1370P000o20m398K031l506r965k0811j061Q709J1541
$$ 13361 14119 10234 22087 22135 10765 17765 17145 12747 14778 11272 1307 -19504 -20565 -11856 -315
6249c15m66n881j1253P174J2836L401N938l377l468k708Q412L540l631p150r012
$$ -315 -781 -6662 -17915 -10741 2095 5496 11434 8057 4589 1881 10293 13833 10202 3052 -5960
6234e960q174K115K0856J4073j2923k298P169J005o783K383K450r208l414N254
$$ -5960 -14134 -12019 8837 22910 9987 7689 14858 15863 9080 11463 13913 4705 1291 6545
6220F545o11q395l967J2371O355p063j1667j5062K015K310J9755k5l071k021J2186
$$ 6545 5934 -2461 -6428 5943 12298 5235 -6432 -21494 -19479 -17169 2586 2561 -510 -2531 9655
6205I655R167J7062K331p604j1561j2193o364n296P125n121j7008o124J7945J0681
$$ 9655 18822 35884 38215 30611 19050 6857 493 -4803 2322 -2799 -19807 -25931 -7986 2695
6191B695m843Q70P705q077j1722N93K915M845o50k305J6429M195j340J068L710
$$ 2695 -2148 -1278 6427 -1650 -13372 -12779 -9864 -5019 -5669 -7974 8455 12650 11310 12378 16088
6176A6088o523p642J5099N468q876q670q280J0677P392j245l553K595P819j2456
$$ 16088 9565 1923 17022 22490 13614 4944 -3336 7341 14733 13488 9935 12530 20349 7893
6162G893j552p113j4936j2955Q30R369J2432o388j928p990l293L680Q436k698
$$ 7893 6341 -772 -15708 -28663 -27833 -18464 -6032 -12420 -14348 -22338 -25631 -21951 -13515 -16213
6148a6213K696K469P317R963M860L31j0505p163j8583r560N817J0863q397L045
$$ -16213 -13517 -11048 -3731 6232 11092 11423 918 -6245 -24828 -34388 -28571 -17708 -26105 -23060
6134b3060J1422J5358n11j3248l118Q247j2251j5240P260M392k57O037R9k220
$$ -23060 -11638 3720 3209 -10039 -13157 -4910 -17161 -32401 -25141 -20749 -21006 -14969 -14870 -17090
6120a7090K836J4557l232j339k465P561J379k429R532k194q002L722P85n117M823
$$ -17090 -14254 303 -2929 -4268 -6733 828 2207 -222 9310 7116 -886 2836 3621 -1496 3327
6105C327M058o171M70o333m123L061K40N623O281n737p723j0718J566N471K318
$$ 3327 7385 1214 1684 -4649 -8772 -5711 -5471 152 6433 696 -7027 -17745 -16179 -10708 -8390
6090h390J0468o451r452j49J1774n188Q422l154m299k313m855r405M874Q739N705
$$ -8390 2078 -4373 -13825 -13974 -2200 -7388 1034 -2120 -6419 -8732 -13587 -22992 -18118 -9379 -3674
6075c674R594R029K870n961r477p213o617O878J0331j488j9607j1912J4323Q231
$$ -3674 5920 14949 17819 11858 2381 -4832 -11449 -4571 5760 4272 -15335 -27247 -12924 -4693
6061d693J4110j427n701r934k109L947m344j0802j0852k77R807j487L169J5354
$$ -4693 9417 7990 2289 -7645 -9754 -5807 -10151 -20953 -31805 -32082 -22275 -23762 -20593 -5239
6047e239Q038n471j6818m714k175M696K3740J3974o344q327l420J4118J850M615
$$ -5239 2799 -2672 -19490 -24204 -26379 -21683 2057 16031 9687 1360 -2060 12058 13908 18523
6033A8523N903o605J333n675l779j3265P12P957L661P589K42j4615p808J1002
$$ 18523 24426 17821 19154 13479 9700 -3565 -2853 5104 8765 16354 16596 1981 -5827 5175
6019E175O281o047M315K1465o01l4245k0738J328J2059O772O14K492J7899O249
$$ 5175 11456 5409 9724 31189 30588 -3657 -24395 -23067 -11008 -4236 -3622 -1130 16769 23018
6005B3018o984j1363m285j451q663n018o539m376J5166R435j635P411K205l414
$$ 23018 16034 4671 386 -1065 -9728 -14746 -21285 -25661 -10495 -1060 -2695 4716 6921 3507
5991C507N897N679j2393k2827N664M768P17j2896O174J1959O086Q977k74j6277
$$ 3507 9404 15083 2690 -20137 -14473 -9705 -8988 -21884 -15710 -3751 2335 11312 11038 -5239
5977e239j787J7588k043j8760O585k999j731J437L456M60n555k595J09N828m408
$$ -5239 -7026 10562 8519 -10241 -3656 -6655 -8386 -6949 -3493 -3033 -8588 -11183 -11074 -5246 -9654
5962i654O974l1O723k353j0997m035l376j3458m789K3656M936l357l929O737J4226
$$ -9654 -2680 -2711 4012 1659 -9338 -13373 -16749 -30207 -34996 -11340 -6404 -9761 -13690 -6953 7273
5947G273J118o884J622K083j1242l284j791m6l198o87J5394K143j4827L466j959
$$ 7273 8391 1507 3129 5212 -6030 -9314 -11105 -11151 -14349 -15036 358 2501 -12326 -8860 -10819
5932a0819j6576O148L030J318q984J0359K57J7N610o408J0539K385M333Q748n417
$$ -10819 -27395 -21247 -18217 -16899 -25883 -15524 -15267 -15250 -9640 -16048 -5509 -3124 1209 9957 4540
5917D540j9565n537J1069J3486n934j7979j7804N261J4231n628N13J0550P500
$$ 4540 -15025 -20562 -9493 3993 -1941 -19920 -37724 -32463 -18232 -23860 -23347 -12797 -5297
5904e297p70O266O39N448J3338J1947O07j3349m974n387L418m04l294L999p305
$$ -5297 -6067 199 838 6286 19624 31571 32178 18829 13855 8468 11886 11482 8188 12187 4882
5889D882q385j299M26k811J4279n711m923J6502k632j4934n94K421q637m096J5531
$$ 4882 -3503 -4802 -4376 -7187 7092 1381 -3542 12960 10328 -4606 -5200 -2779 -11416 -15512 19
5874A9Q198n569N591l570m355O358j2605j0303k425M729m978J7211K92J0720j08
$$ 19 8217 2648 8239 4669 314 6672 -5933 -16236 -18661 -13932 -18910 -1699 -1407 9313 9205
5859I205j2730K224m22Q983m95q217r682K971l859L189P405p567o293N958o625
$$ 9205 -3525 -1301 -1723 7260 6765 -1452 -11134 -8163 -12022 -8833 -1428 -8995 -15288 -9330 -15955
5844a5955P609P496j729K338J942o250M86L594N029O507q133j3911J7642J2277
$$ -15955 -8346 -850 -2579 -241 1701 -4549 -4063 -469 4560 11067 2934 -10977 6665 18942
5830A8942j6180k781K031j843r020j0035Q734J9155J1614m608j9045q148p664
$$ 18942 2762 -19 2012 169 -8851 -18886 -10152 9003 20617 16009 -3036 -11184 -18848
5817a8848N678M225m7J7511l061o440P950n14R02M512K82j6224j1719j3246K496
$$ -18848 -13170 -8945 -8992 8519 5458 -982 6968 6454 7356 11868 12150 -4074 -15793 -29039 -26543
5802b6543O831M588L255j8162l250J6370J3153k211j0851J1886J4840o762j0114
$$ -26543 -19712 -15124 -11869 -30031 -33281 -16911 -3758 -5969 -16820 -4934 9906 3144 -6970
5789f970K391k198j235P683J110L488M220J2183p270m804O334P464j2602n954
$$ -6970 -4579 -6777 -8012 -329 781 4269 8489 20672 13402 8598 14932 22396 9794 3840
5775C840O705N66k697j0984p06j046L577P389p337Q18O02p355Q083J2624o621
$$ 3840 10545 11111 8414 -2570 -3276 -4322 -745 6644 -693 125 727 -6628 1455 14079 7458
5760G458j5082J1650J782j1006n46J0920J2811K445l268k999j4755r865K838n504
$$ 7458 -7624 4026 5808 -5198 -5744 5176 17987 20432 17164 14165 -590 -10455 -7617 -13121
5746a3121M615J1908k938j0940r4J3188J871k226O645j2136m487P582P723k159
$$ -13121 -8506 3402 464 -10476 -10570 2618 4489 2263 8908 -3228 -7715 -133 7590 5431
5732E431j2300P98J2771j315r736M522J5485J1678q869m697j2607j8581J5934
$$ 5431 -6869 -6071 6700 5385 -4351 171 15656 27334 18465 13768 1161 -17420 -1486
5719a486P767n772l578K877m83o159l314o729J4038K3107o05k1098j5912M487
$$ -1486 6281 509 -3069 -192 -675 -6834 -10148 -16877 -2839 20268 19663 -1435 -17347 -12860
5705a2860K839Q868Q797P38j458j727k907m19J44L94j4040k871N650O17O221L409
$$ -12860 -10021 -1153 7644 8382 6924 5197 2290 1871 2015 2409 -11631 -14502 -8852 -8235 -2014 1395
5689A395j654m456l917J212r873k468J9370O217m684j3786K625K39j0477K515
$$ 1395 -259 -4715 -8632 -7420 -17293 -19761 -391 5826 1142 -12644 -10019 -9780 -20257 -17742
5675a7742J8390Q592m708p040l865j788q175R528M047j1316Q160Q481Q52J933
$$ -17742 648 9240 4532 -2508 -6373 -8161 -16336 -6808 -2761 -14077 -5917 2564 3416 5349
5661E349r279k256m964N621Q628k532k85q941j5140k182l704K0599R807o082j3537
$$ 5349 -3930 -6186 -11150 -5529 3099 567 282 -8659 -23799 -25981 -29685 -9086 721 -5361 -18898
5646a8898J208O795J44J7475M759K553p852R73R84r92N132n385j301J1926n063
$$ -18898 -17690 -10895 -10751 6724 11483 14036 6184 7157 8141 7149 12281 6896 5595 17521 12458
5631A2458j9503m167O368M245m620j457m851N10r31P061k071j7391K306j805j403
$$ 12458 -7045 -11212 -4844 -599 -5219 -6676 -11527 -11017 -11948 -4887 -6958 -24349 -22043 -23848 -25251
5616b5251L831J9839N743l557p556J5611m268k2770q48K172k381M460J7875J0442
$$ -25251 -21420 -1581 4162 605 -6951 8660 4392 -18378 -19226 -17054 -19435 -14975 2900 13342
5602A3342l393j044o347j275m674j7284k070P042Q22N037J2312l489n302N34L997
$$ 13342 9949 8905 2558 1283 -3391 -20675 -22745 -15703 -14881 -9844 2468 -1021 -6323 -5789 -1792
5587a792r44k057j0166l325P748Q555m086K108P373Q337m925J3658M108j2387
$$ -1792 -2736 -4793 -14959 -18284 -10536 -1981 -6067 -3959 3414 11751 6826 20484 24592 12205
5573A2205j4719j947L498j0058j1587m88J7125J6270J10L611n492q68J0616m642
$$ 12205 -2514 -4461 -963 -11021 -22608 -23096 -5971 10299 10409 14020 8528 7660 18276 13634
5559A3634p544k026j299N007n839m01K521L563q926q855k757Q806K2575j401j4542
$$ 13634 6090 4064 2765 7772 1933 1532 4053 7616 -1310 -10165 -12922 -4116 18459 17058 2516
5544B516j2843Q604L755O301O115l422j793P78q164L385J0747o060j9829q05J3455
$$ 2516 -10327 -1723 2032 8333 14448 11026 9233 10011 1847 5232 15979 9919 -9910 -10715 2740
5529B740o994j80J0119N516j2542r744O201J0747p762R488N474j2483j3645O286
$$ 2740 -4254 -4434 5685 11201 -1341 -11085 -4884 5863 -1899 7589 13063 580 -13065 -6779
5515f779L358p686o749J1617J275K511J261j2163o363j7638l511R688L812J0837
$$ -6779 -3421 -11107 -17856 -6239 -4964 -2453 -1192 -13355 -19718 -37356 -40867 -31179 -27367 -16530
5501a6530L134m173r455j003L561J903L813R965L949L242m498m72L334k299j296
$$ -16530 -13396 -17569 -27024 -28027 -24466 -22563 -18750 -8785 -4836 -1594 -6092 -6564 -3230 -5529 -6825
5486f825N705P966r308p099n856j28J0717J4080k799l990o809k23j43Q671Q576
$$ -6825 -1120 6846 -2462 -9561 -15417 -15545 -4828 9252 6453 2463 -4346 -4569 -4712 3959 12535
5471A2535q112l151M038K142p905Q375m646j9347m214Q329J3953O306k386p437
$$ 12535 4423 1272 5310 7452 -453 7922 3276 -16071 -20285 -11956 1997 8303 5917 -1520
5457a520l410K047j5362j3417O477m334K2764O615O619m640J2045J0258M295n424
$$ -1520 -4930 -2883 -18245 -31662 -25185 -29519 -6755 -140 6479 1839 13884 24142 28437 23013
5443B3013j2911o695j0950n334n481P882K83O90Q512N223j821n457j9097R838
$$ 23013 10102 3407 -7543 -12877 -18358 -10476 -10193 -9503 -991 4232 2411 -3046 -22143 -12305
5429a2305q745r283R010J3425J5582k726j1518O8R533J4778l215j2273j8548M293
$$ -12305 -21050 -30333 -21323 -7898 7684 4958 -6560 -6492 3041 17819 14604 2331 -16217 -11924
5415a1924J4252O825J4009R41j0985q204M656j474n551j664o248j6354J4319J4564
$$ -11924 2328 9153 23162 24103 13118 4914 9570 8096 2545 881 -5367 -21721 -7402 7162
5401G162L090R11J772K493m564q927j3516J4642R197o31l645j6058o36O689p94
$$ 7162 10252 11163 12935 15428 10864 1937 -11579 3063 12260 11629 7984 -8074 -8710 -2021 -2815
5386b815J647M355m949j2284k2901Q58R617M895J777N962L512J449K136k981R461
$$ -2815 -1168 3187 -1762 -14046 -36947 -36089 -26472 -21577 -19800 -13838 -10326 -8877 -6741 -9722 -261
5371b61J7242n416p029q116J873Q048J9810o73R16r826M728n617j0698j084j0081
$$ -261 16981 11565 4536 -3580 -1707 6341 26151 25478 26394 16568 21296 15679 4981 3897 -6184
5356f184J6174J1019o541p310N790m15M40q17K136Q804j246q021j8075J830L031
$$ -6184 9990 21009 14468 7158 12948 12533 12973 12156 14292 23096 21850 13829 -4246 -2416 615
5341F15k018r983m934j698N270O49m08N399k25j0168m201M632L217l729J1022
$$ 615 -1403 -11386 -16320 -18018 -12748 -12099 -12507 -7108 -7333 -17501 -21702 -17070 -13853 -17582 -6560
5326f560J3874r52l865k137J8372l186j2759j4967j012K893J0845P513l273m676
$$ -6560 7314 6362 2497 360 18732 15546 2787 -12180 -13192 -10299 546 8059 4786 110
5312A10J16L48J2976P646j590L414j204J13j3971J975N096l520M540p020m579
$$ 110 226 574 13550 21196 19606 23020 21816 21929 7958 9933 15029 11509 16049 9029 4450
5297D450l90j2413O760J1148l35l273J0770j176l263j5300o077M114j394n311
$$ 4450 4060 -8353 -1593 9555 9220 5947 16717 15541 12278 -3022 -9099 -4985 -6379 -11690
5283a1690j556K1424m215j5207P2J4691o194K945K749q660J826p685k231O059
$$ -11690 -13246 8178 3963 -11244 -11172 3519 -2675 270 3019 -5641 -3815 -11500 -13731 -7672
5269g672P317Q289J4690j8021l0934q058J3364L748j447J324J9160K0005P982
$$ -7672 -355 7934 22624 4603 -26331 -34389 -21025 -17277 -18724 -17400 1760 21765 29747
5256B9747o111k3644L257J7191N317k3303j6851K045P488j2472k65J2029J6155
$$ 29747 23636 -8 3249 20440 25757 2454 -14397 -12352 -4864 -17336 -17601 -5572 10583
5243A0583M156l0J561p766q899P007r610j4601J1607j360J2537J3321j8062r725
$$ 10583 14739 14709 16270 8504 -395 6612 -2998 -17599 -5992 -7352 5185 18506 444 -9281
5229i281R505n431n147q72P002o251K789j2679q599J5012J1759n554j852J1698
$$ -9281 224 -5207 -10354 -11226 -4224 -10475 -7686 -20365 -28964 -13952 -2193 -7747 -9599 2099
5215B099L394j4094q676J4081L581L835N508p766j0518j379J2634Q735j5809o455
$$ 2099 5493 -8601 -17277 -3196 385 4220 9728 1962 -8556 -9935 2699 11434 -4375 -10830
5201a0830O388K427J277o965j0350j3313o646K595J8135q7q933m34Q516O933R107
$$ -10830 -4442 -2015 -738 -7703 -18053 -31366 -38012 -35417 -17282 -17369 -26302 -26736 -18220 -11287 -2180
5186b180o161M009q654k339r44r85K943O226p501j171n429P416N686k06Q566q224
$$ -2180 -8341 -4332 -12986 -15325 -16269 -17254 -14311 -8085 -15586 -16757 -22186 -14770 -9084 -9290 -724 -8948
5170h948n411O419J5615R678j7112j2618L915p240p34J2112k940m787o487Q487
$$ -8948 -14359 -7940 7675 17353 241 -12377 -8462 -15702 -16436 -4324 -7264 -12051 -18538 -10051
5156a0051Q765j469p750j4126L989l96n759J1480R718P635L462n627K816R59o41
$$ -10051 -1286 -2755 -10505 -24631 -20642 -21038 -26797 -15317 -5599 2036 5498 -129 2687 3646 3005
5141C005k010M236l866J289l431O881M095p625J27l060N816O26J1305j196k1577
$$ 3005 995 5231 1365 2654 -777 6104 10199 2574 2701 -359 5457 6083 17388 16192 -5385
5126e385j6471q097P745R987J0420J7325M993j2912j2894j674J5524N887r718
$$ -5385 -21856 -29953 -22208 -12221 -1801 15524 20517 7605 -5289 -6963 8561 14448 4730
5113D730J209J2104k438j9454j1663p263J332l421j381J2055m055l78J3579l978
$$ 4730 5939 18043 15605 -3849 -15512 -22775 -21443 -24864 -26245 -14190 -18245 -18623 -5044 -9022
5099i022j995O582j300M485P717Q51o552j6878m137P614Q265P468n184k7135j421
$$ -9022 -11017 -4435 -5735 -1250 6467 7318 766 -16112 -20249 -12635 -4370 3098 -2086 -29221 -30642
5084c0642P965J4908J2224J340q806L651m525K457R044J1656o383l121P758n392
$$ -30642 -22677 -7769 4455 5795 -3011 640 -3885 -1428 7616 19272 12889 9768 17526 12134
5070A2134j7236j821o418J2204J3632P026r425j7355q031L179J2517L681K1j2648
$$ 12134 -5102 -6923 -13341 -1137 12495 19521 10096 -7259 -15290 -12111 406 4087 4108 -8540
5056h540k306P681l079j6175l77L29k999J2822J3199O456N464l197l136k896n595
$$ -8540 -10846 -3165 -6244 -22419 -22796 -22467 -25466 -12644 555 7011 12475 9278 6142 3246 -2349
5041b349l471J9264J2100K856j3434j3057r916p621j7170R776K2715K0966l742
$$ -2349 -5820 13444 25544 28400 14966 1909 -8007 -15628 -32798 -23022 -307 20659 16917
5028A6917O86M139j3595P987L002j0094m643l918M345j11J9532L383k4035k582
$$ 16917 17603 21742 8147 16134 19136 9042 4399 481 4826 4715 24247 27630 3595 1013
5014A013l913R179M15j4170J065P717j975M125j2369M037P807R958L258l062P962
$$ 1013 -2900 6279 6694 -7476 -6411 1306 -669 3456 -8913 -4876 2931 12889 16147 13085 21047
4999B1047n950o151k2383j076Q951O576M664K347R471J991k106j1134j162J8691
$$ 21047 15097 8946 -13437 -14513 -5562 1014 5678 8025 17496 19487 17381 6247 5085 23776
4985B3776O584j383j731p904j0753p889P910J0337M701M68o614j1207N337o469
$$ 23776 30360 28977 27246 19342 8589 700 8610 18947 23648 24116 17502 6295 11632 5163
4971E163m643j0599O311Q225p200l92O925n730l900q630q072O235P529J415q036
$$ 5163 520 -10079 -3768 4457 -2743 -3135 3790 -1940 -5840 -14470 -22542 -16307 -8778 -7363 -15399
4956a5399K327J0115M821p429m421O847q43m798J888n951N468j2182k067J3588
$$ -15399 -13072 -2957 1864 -5565 -9986 -3139 -3982 -8780 -6892 -12843 -7375 -19557 -21624 -8036
4942h036O095J3931Q000o864q980j814L941j3606p797N394N769o375j4684O077
$$ -8036 -1941 11990 19990 13126 4146 2332 6273 -7333 -15130 -9736 -3967 -10342 -25026 -18949
4928a8949J5146Q195J3402N084n490m242r065k421M703L9K761j5619j3144K39
$$ -18949 -3803 4392 17794 22878 17388 13146 4081 1660 6363 6402 9163 -6456 -19600 -19361
4914a9361O405Q071N553k049n830J4101M23j455k772k687P510J5513R008j3070
$$ -19361 -12956 -4885 668 -1381 -7211 6890 7313 5858 3086 399 7909 23422 32430 19360
4900A9360j2873k287J142o341k087J252k201o888J306O530J1477J909o114r418
$$ 19360 6487 4200 5342 -999 -3086 -1834 -4035 -10923 -9617 -3087 8390 10299 4185 -5233
4886e233Q057K740l126J817J430m754m998O473P751N917L51k706r457r428O149
$$ -5233 2824 5564 2438 4255 5685 931 -4067 2406 10157 16074 16425 13719 4262 -5166 983
4871I83j0247L683O969L455q78K181m413K075j460j0829q251M156J3107J3496
$$ 983 -9264 -5581 1388 4843 3965 6146 1733 3808 2348 -8481 -16732 -12576 531 14027
4857A4027M421q35n606J151Q452K800O312M278j1879k1236q714l329Q441L165
$$ 14027 18448 17613 12007 13158 21610 24410 30722 35000 23121 1885 -6829 -10158 -1717 1448
4843A448l699j0541j3610K19M186J8741K2133q880k4415K571M173J8942o9m384
$$ 1448 -2251 -12792 -26402 -26183 -21997 -3256 18877 9997 -14418 -11847 -7674 11268 11199 6815
4829F815j5432K3L596P115P408J5056k4571J200N380k058J85j3797P08j7947l815
$$ 6815 -8617 -8594 -4998 2117 9525 24581 10 1210 6590 4532 4717 -9080 -8372 -26319 -30134
4814c0134J5712j358M336l827l765P726R852r931j1508j6282K392J1695l940L257
$$ -30134 -14422 -15780 -11444 -15271 -19036 -11310 -1458 -11389 -22897 -39179 -36787 -25092 -29032 -25775
4800b5775Q475o925j6792R172J4213J3449K22K798o438k248P135J0504M364p854
$$ -25775 -17300 -24225 -41017 -31845 -17632 -4183 -3961 -1163 -7601 -9849 -2714 7790 12154 4300
4786D300K57K520j383q138j855J3156J141j3505n815k293m325L106M565O052l057
$$ 4300 4557 7077 5694 -2444 -4299 8857 9998 -3507 -9322 -11615 -15940 -12834 -8269 -2217 -5274
4771e274n61r843N309Q941q328j1514m899j512N431r957p876J6347J3422k1871
$$ -5274 -5835 -15678 -10369 -1428 -9756 -21270 -26169 -27681 -22250 -32207 -40083 -23736 -10314 -32185
4757c2185q082K0086J3270L503J073O118l603J6195K357j3657k229j2921k061
$$ -32185 -40267 -20181 -6911 -3408 -2335 3783 180 16375 18732 5075 2846 -10075 -12136
4744a2136J2799J0260l523j1651K957K510R267N42p203J229R149L705N082R065
$$ -12136 663 10923 7400 -4251 -1294 1216 10483 11025 3822 5051 14200 17905 22987 32052
4730C2052k489l202j5398p286Q037M199r32p185m888j5894N633M777q699J48O453
$$ 32052 29563 26361 10963 3677 11714 15913 14981 7796 2908 -12986 -7353 -2576 -11275 -11127 -4674
4715d674k266j689R753P840N354l359j7253j6016J2575j27r609O957J534M808
$$ -4674 -6940 -8629 1124 8964 14318 10959 -6294 -22310 -9735 -9862 -19471 -12514 -10980 -6172
4701f172Q958Q504j4630j1272k385P956J6273J9719l257k6056j5587N539L417
$$ -6172 2786 11290 -3340 -14612 -16997 -9041 7232 26951 23694 -2362 -17949 -12410 -8993
4688h993K276j179L161q29m265J2743J0557j4038L858J471o791N323M998m766
$$ -8993 -6717 -7896 -4735 -5564 -9829 2914 13471 -567 3291 4762 -2029 3294 8292 3526
4674C526k179m870K858Q759L645R73L385n61N819l152K509J1535o828r080n003
$$ 3526 1347 -3523 -665 8094 11739 12712 16097 15536 21355 18203 20712 32247 25419 16339 11336
4659A1336L690J4453j357o984O552l066m049l880l360p208M9J2018J632o434p130
$$ 11336 15026 29479 28122 21138 27690 24624 20575 16695 13335 6127 6176 18194 19826 13392 6262
4644F262j925k733k0743O93K4868q899j4597O751J0767n876j373J848j0676K670
$$ 6262 4337 1604 -19139 -18446 6422 -2477 -17074 -10323 444 -5432 -6805 -4957 -15633 -12963
4630a2963J6881K695N911j939K391o821o093J3338m87J306j1578m253k212n762
$$ -12963 3918 6613 12524 10585 12976 6155 62 13400 12913 14219 2641 -1612 -3824 -9586
4616i586J7405j933p874l827p144K898J1915j113r732n017K98m938M97K067J3485
$$ -9586 7819 5886 -1988 -5815 -12959 -10061 1854 741 -8991 -14008 -13710 -18648 -18151 -16084 -2599
4601b599R823m364M993k966j621p355l997l629N224P285k705j0889n123O860J5634
$$ -2599 7224 2860 7853 4887 3266 -4089 -8086 -11715 -6491 794 -1911 -12800 -17923 -11063 4571
4586D571J7165R145r273m416L366P326j4733q287J679j325r787m811J1460l168
$$ 4571 21736 30881 21608 17192 20558 27884 13151 4864 6543 5218 -4569 -9380 2080 -1088
4572a088J040l874O609O834p609q106L038r95m992j244J454J0591P697j1066o267
$$ -1088 -48 -3922 2687 9521 1912 -6194 -3156 -4151 -9143 -10387 -8933 1658 9355 -1711 -7978
4557g978O511Q010j1897j1413J487J6270j705j4781J558J6310J4752r66N12n611
$$ -7978 -1467 6543 -5354 -16767 -15280 990 -715 -15496 -13938 2372 17124 16158 16670 11059
4543A1059j7101P379J971p020k588K2159P677o818q166R497n611K493Q862l428
$$ 11059 -6042 1337 3308 -3712 -6300 15859 23536 16718 8552 18049 12438 14931 23793 20365
4529B0365o925j2745j0597l061P470M543M557j1453p486R765Q82j165L632k428
$$ 20365 13440 695 -9902 -12963 -5493 -950 3607 -7846 -15332 -5567 -4685 -5850 -2218 -4646
4515d646n951O058k206j747l266m001q983P188L390q948M85J2189N396J1046J3627
$$ -4646 -10597 -4539 -6745 -8492 -11758 -15759 -24742 -17554 -14164 -23112 -22627 -10438 -5042 6004 19631
4500A9631j5854P96J2545M317J88j1885K568K322J741Q55j6481o216J970J7388
$$ 19631 3777 4573 17118 21435 21623 9738 12306 14628 16369 17224 743 -5473 -3503 13885
4486A3885j5o556j211J856J029j4776M330k075P265J2261N953n679l072o218m139
$$ 13885 13870 7314 6103 7959 8988 -5788 -1458 -3533 3732 15993 21946 16267 13195 6977 2838
4471B838M780J1549j4177K174J1983n38j2430N155O235p828j8518m704Q079l782
$$ 2838 7618 19167 4990 7164 19147 18609 6179 11334 17569 9741 -8777 -13481 -5402 -9184
4457i184K822P63k497k7J7262k997j0566j1593q271J2756M503M904N908p346j2820
$$ -9184 -6362 -5599 -8096 -8123 9139 6142 -4424 -16017 -24288 -11532 -7029 -2125 3783 -3563 -16383
4442a6383j247P307Q722K652k744j2245j6502o415R318J8038P898p16j0052J7411
$$ -16383 -17630 -10323 -1601 1051 -1693 -13938 -30440 -36855 -27537 -9499 -1601 -2317 -12369 5042
4428E042j1928r966K377O761R538N702j2135n944J6019J735r172j6999j66m049
$$ 5042 -6886 -16852 -14475 -7714 1824 7526 -4609 -10553 5466 7201 -1971 -18970 -19136 -23185
4414b3185L337P518QJ0882P226l462j145p575j13L127N498M858j053o265K336
$$ -23185 -19848 -12330 -12322 -1440 5786 2324 1179 -6396 -6509 -3382 2116 6974 5921 -344 1992
4399A992r714M140J2864J694q530j0809J6416J7412m74j8474j3402J504J2422
$$ 1992 -7722 -3582 9282 10976 2446 -8363 8053 25465 24991 6517 -6885 -5381 7041
4386G041L713j1440j0874j0432J5717K4688j05m858j3241o099j037l082K567J0179
$$ 7041 10754 -686 -11560 -21992 -6275 18413 18308 13450 209 -5890 -6927 -10009 -7442 2737
4372B737j1062R454p62q374r356J2503j456p27q05k718l302L98L973k224P906
$$ 2737 -8325 1129 367 -8007 -17363 -4860 -6316 -7043 -7848 -10566 -13868 -13470 -9497 -11721 -3815
4357c815N071j948m235m464K684j87N582N949N987J0178k074l783j0336M586Q63
$$ -3815 1256 -692 -4927 -9391 -6707 -6894 -1312 4637 10624 20802 18728 14945 4609 9195 10058
4342A0058m840q255r548l697J7892J5503k27J793R400l022j9101j852k766m292
$$ 10058 5218 -3037 -12585 -16282 1610 17113 16886 18679 28079 25057 5956 4104 1338 -2954
4328b954r194j528l643L426k079N594j254K302p307L384J747K900k797p784L355
$$ -2954 -12148 -13676 -17319 -13893 -15972 -10378 -11632 -9330 -16637 -13253 -11506 -8606 -11403 -19187 -15832
4313a5832O619K406O803K876K050Q398M579R148M37j392n355l638j6249p875K810
$$ -15832 -9213 -6807 -4 2872 4922 13320 17899 27047 27484 26092 20737 17099 850 -7025 -4215
4298d215N986Q482l801q357k0607j2735O744J0813j691l596m294J5055Q563J1811
$$ -4215 1771 10253 6452 -1905 -22512 -35247 -28503 -17690 -19381 -22977 -27271 -12216 -3653 8158
4284H158R462k0408k728N093M168J0279K06M60k293N889K514l049Q973r690o600
$$ 8158 17620 -2788 -5516 -423 3745 14024 14230 14690 12397 18286 20800 17751 26724 17034 10434
4269A0434p592j2711j652l589R186K283P236L65n650P79J0105M013Q307K953o978
$$ 10434 2842 -9869 -11521 -15110 -5924 -3641 3595 3960 -1690 -911 9194 13207 21514 24467 17489
4254A7489o560m61J1962J3471O364k3922o468L919j1650n247L233n283q44k44
$$ 17489 10929 10468 22430 35901 42265 18343 11875 15794 4144 -1103 2130 -3153 -3997 -4241
4240d241N393K715m086m519R080O442k590j6362r458j0797r542J7377L326m4J1395
$$ -4241 1152 3867 -219 -4738 4342 10784 8194 -8168 -17626 -28423 -37965 -20588 -17262 -17306 -5911
4225e911J208l206p447m381l089j515R98N752j487P710l82N925K3805J6659P42
$$ -5911 -4703 -7909 -15356 -19737 -22826 -24341 -23343 -17591 -19078 -11368 -11750 -5825 17980 34639 35381
4210C5381j1278j4431j0201J190p591L913m818l002J1355J2316J0712R51j2039
$$ 35381 24103 9672 -529 661 -6930 -3017 -7835 -10837 518 12834 23546 24497 12458
4197A2458N784J0256o405p538j039j4949j8904Q86j0329k597J0905P337L721n912
$$ 12458 18242 28498 22093 14555 13516 -1433 -20337 -19451 -29780 -32377 -21472 -14135 -10414 -16326
4183a6326n758R174L516N544M102J411J5145N661p203P93m139j4614r500o34Q538
$$ -16326 -22084 -12910 -9394 -3850 252 1663 16808 22469 15266 16059 11920 -2694 -12194 -12828 -4290
4168d290J219o709j599Q550J495L741N232o363q86J1292P134j3306k453k107j8047
$$ -4290 -3071 -9780 -11379 -2829 -1334 2407 7639 1276 390 11682 18816 5510 3057 950 -17097
4153a7097j365J0746k2j0785o078P171N280K942j948N097k97P367J3654j4489
$$ -17097 -18462 -7716 -7738 -18523 -24601 -17430 -12150 -9208 -11156 -6059 -6356 1011 14665 176
4139A76R70J0748j144n128n056k514M844r016j0605q200M584P661M997m814k226
$$ 176 1146 11894 10750 5622 566 -1948 2896 -6120 -16725 -24925 -20341 -12680 -7683 -12497 -14723
4124a4723J6240M128k18M595N728J1055n821k7105l370L40J2503K0939K228j5591
$$ -14723 1517 5645 5427 10022 15750 26805 20984 -6121 -9491 -9151 3352 24291 26519 10928
4110A0928l070o905L024M951l051p524j144O86j2490J328M306Q488j221k260N604
$$ 10928 7858 953 3977 8928 5877 -1647 -2791 -2105 -14595 -13267 -8961 -473 -1694 -3954 1650
4095A650j1938k354n380K152M27J2552J2709N200l005j3255k390L948R344m827
$$ 1650 -10288 -12642 -18022 -15870 -15443 -2891 9818 15018 12013 -1242 -3632 316 9660 4833
4081D833m866L979M464p43n466J1490J0544j0937k5460l615R176N083L617l147
$$ 4833 -33 3946 8410 7667 2201 13691 24235 13298 -12162 -15777 -6601 -1518 2099 -1048
4067a048L265N508j0280Q063K412J352m032o686n609M304m25J409K420J045N582
$$ -1048 2217 7725 -2555 5508 7920 9272 5240 -1446 -7055 -2751 -3176 -1767 653 1698 7280
4052G280L288j0538l11k476q235K2J1286Q578j710N650j0020l641R277j0410j6549
$$ 7280 10568 30 -281 -2757 -10992 -10970 316 8894 7184 12834 2814 -827 8450 -1960 -18509
4037a8509p5m591Q296Q008Q68L855M849q84j591J1686N248K092L206j4047j4844
$$ -18509 -18584 -23175 -14879 -6871 -6003 -2148 2701 1817 226 11912 17160 19252 22458 8411 -6433
4022f433R300M856n255r477n193M754n217J0451J0330L548k640L68n665r67J3094
$$ -6433 2867 7723 2468 -7009 -12202 -7448 -12665 -2214 8116 11664 9024 9392 3727 2760 15854
4007A5854n760j773o283L408l702j0148m925Q770J1742l355o777j8054o764O698
$$ 15854 10094 8321 2038 5446 1744 -8404 -13329 -4559 7183 3828 -2949 -21003 -27767 -21069
3993b1069J9569J7937n362o486m10Q954o227o145j1594k77k754J686J1773N844
$$ -21069 -1500 16437 11075 4589 4179 13133 6906 761 -10833 -11110 -13864 -12178 -405 5439
3979E439m994o672K011L191M399Q183q417r445k21M366n340k2250n809J3083J3916
$$ 5439 445 -6227 -4216 -1025 3374 11557 3140 -6305 -6526 -2160 -7500 -29750 -35559 -22476 -8560
3964h560O067J0293P921k934m627p330p35L772M454n614r28L87N556p977j2820
$$ -8560 -2493 7800 15721 12787 8160 830 95 3867 8321 2707 1779 2166 7722 -255 -13075
3949a3075m003K74L120l234j3541j278J3357j729R724k8J2138K2207p720m739
$$ -13075 -17078 -16804 -13684 -16918 -30459 -31737 -18380 -20109 -10385 -10413 1725 23932 16212 11473
3935A1473Q916m776j464L451m529j0307j647j5667k0917J5110K4959p432k273
$$ 11473 20389 15613 14149 17600 13071 2764 1117 -14550 -35467 -20357 4602 -2830 -5103
3922e103M896r335m568J2372J432n444N520P245j4852N573P418k193o91o649J1643
$$ -5103 -207 -9542 -14110 -1738 -306 -5750 -230 7015 -7837 -2264 5154 2961 2270 -4379 7264
3907G264K501l553k949J1200k294o694Q418M650q30J5161j953p461l799o483k702
$$ 7264 9765 6212 3263 14463 12169 5475 13893 18543 17713 32874 30921 23460 19661 13178 10476
3892A0476L721J0403M125j4467p194P180L521l651n358j4502q197J526O2r385
$$ 10476 14197 24600 28725 14258 7064 14244 17765 14114 8756 -5746 -13943 -12417 -12355 -21740
3878b1740J051P232K3996L845m385p051l594j327j4960r106R132m093O994Q798
$$ -21740 -20689 -13457 10539 14384 9999 2948 -646 -1973 -16933 -26039 -16907 -21000 -14006 -5208
3864e208J4052o175O51P67J545n725P454j675r455j0185m052q406J6731J373O727
$$ -5208 8844 2669 3320 4087 5632 -93 7361 5686 -3769 -13954 -18006 -26412 -9681 -8308 -1581
3849a581J774o157O838L992q103l588Q027J3227j1458k2727n09J2147K1169j348
$$ -1581 193 -5964 874 4866 -3237 -6825 1202 14429 2971 -19756 -20265 -8118 13051 11703
3835A1703r529r158j8322o781Q578J4674j576J34N647Q124m492m030n070P234
$$ 11703 2174 -6984 -25306 -32087 -23509 -8835 -10411 -10277 -4630 3494 -998 -5028 -10098 -2864
3821b864J6198k143N855K789k5315j231P441P71p896j8665j207P243J2718J5423
$$ -2864 13334 11191 17046 19835 -5480 -6711 730 1501 -6395 -25060 -26267 -19024 -6306 9117
3807I117k332j0883n890l712k941J6568J4994r165p321k239M328M171M290R988
$$ 9117 6785 -4098 -9988 -13700 -16641 -73 14921 5756 -1565 -3804 524 4695 8985 18973
3793A8973R237j8610o49q403m120o325M781J2522k4n419o552N699L587q067j4204
$$ 18973 28210 9600 8951 548 -3572 -9897 -5116 7406 7382 1963 -4589 1110 4697 -3370 -17574
3778a7574m443K569N46P828J3076K1895M562L998j1139j5864p254j098O879O93
$$ -17574 -22017 -19448 -18902 -11074 2002 23897 28459 32457 21318 5454 -1800 -2898 3981 4674
3764D674j0565K672O062m924j830J8415N871n234M373o758q136q020m818J3776
$$ 4674 -5891 -3219 2843 -2081 -3911 14504 20375 15141 19514 12756 4620 -3400 -8218 5558
3750E558m819L014l788M534r28R60j5299o958R960O221K897j2102m332P659J3729
$$ 5558 739 3753 -35 4499 3571 4531 -10768 -17726 -7766 -1545 1352 -10750 -15082 -7423 6306
3735F306n452K218M654k954n801M199K104J217L928O827j9403q066J841Q849n404
$$ 6306 854 3072 7726 4772 -1029 3170 5274 6491 10419 17246 -2157 -10223 -8382 467 -4937
3720d937q456k409j662J5561J2681j288l593j2977m601o071K0485J2773j6908
$$ -4937 -13393 -15802 -17464 -1903 10778 9490 5897 -7080 -11681 -17752 2733 15506 -1402
3707a402j6806J995O377M246O898P956p750n473L823L028J708m242k221p398M74
$$ -1402 -18208 -16213 -9836 -5590 1308 9264 1514 -3959 -136 2892 4600 358 -1863 -9261 -8787
3692h787K66N360j3843j2649K625m304N136R208P898J1791j595M098O23j6676
$$ -8787 -8521 -3161 -17004 -29653 -27028 -31332 -26196 -16988 -9090 2701 1106 5204 5827 -10849
3678a0849k835m883J347o292L885j672j272J1938J0736J841j679j2602j567J7316
$$ -10849 -13684 -18567 -17220 -23512 -19627 -21299 -22571 -10633 103 1944 265 -12337 -13904 3412
3664C412P500p412j1256M941q758p204j729l024m084K247R176R154n575J2719
$$ 3412 10912 3500 -7756 -2815 -11573 -18777 -20506 -23530 -27614 -25367 -16191 -7037 -12612 107
3650A07j076r714K1270J1306J2336m183p318q066j4666J491n618n086l674k204
$$ 107 -969 -10683 10587 21893 34229 30046 22728 14662 -4 1487 -4131 -9217 -12891 -15095
3636a5095K664J668q03N793q601J528p493n233j3548P423O367J0459J0309q405
$$ -15095 -12431 -10763 -11566 -5773 -14374 -12846 -20339 -25572 -39120 -31697 -25330 -14871 -4562 -12967
3622a2967J2721J0889j3546j0629p523n425L295O800l64l777N183O704Q363m959
$$ -12967 -246 10643 -2903 -13532 -21055 -26480 -23185 -16385 -16749 -20526 -15343 -8639 -276 -5235
3608e235Q048Q99q139q954P210q055k323J0638k084J615J4986M339Q250m928r79
$$ -5235 2813 3712 -4427 -13381 -6171 -14226 -16549 -5911 -7995 -6380 8606 12945 21195 16267 15288
3593A5288r948j6540P537O765j0164k6560N379J7073m05J0855P647q664n864j325
$$ 15288 5340 -11200 -3663 3102 -7062 -33622 -28243 -11170 -11575 -720 6927 -1737 -7601 -8926
3579h926J7882L047n55j4474o042K983O402O814J3546o621r770j4798J1641L414
$$ -8926 8956 12003 11448 -3026 -9068 -6085 317 7131 20677 14056 4286 -10512 1129 4543
3565D543n582j94Q564J2379j024l727k438N64k543N668p277j7342j2445P116j094
$$ 4543 -1039 -1233 7331 19710 18686 14959 12521 13085 10542 16210 8933 -8409 -20854 -13738 -14832
3550a4832N479r490j4204O966J2058K421L452l497j100N843J28J5415q65q534
$$ -14832 -9353 -18843 -33047 -26081 -14023 -11602 -8150 -11647 -12747 -6904 -6776 8639 7774 -760
3536g60O213j772m706m490k427j0219j0708J8391J3965J0260R78o913m752L041
$$ -760 5453 3681 -1025 -5515 -7942 -18161 -28869 -10478 3487 13747 14725 7812 3060 6101
3522F101k398p496M218o325o768k402P454M478r798l943q141O497K7121P65o858
$$ 6101 3703 -3793 425 -5900 -12668 -15070 -7616 -3138 -12936 -16879 -25020 -18523 8598 9363 2505
3507B505p667l131P866q402Q632K874k643j4745j8028P472J2090J71q426K463
$$ 2505 -5162 -8293 -427 -8829 -197 2677 34 -14711 -32739 -25267 -13177 -13006 -21432 -18969
3493a8969J0233R559R164M289R070r45j3495k785o88j775J0336l565o624j1002
$$ -18969 -8736 823 9987 14276 23346 22401 8906 6121 5433 3658 13994 10429 3805 -7197
3479g197J5M824j5228o004J5421J1110P591n928k398n771J40j4727j1120J7848
$$ -7197 -7182 -2358 -17586 -23590 -8169 2941 10532 4604 2206 -3565 -3425 -18152 -29272 -11424
3465a1424J9297J7049K568j2735o653q220J3706j3942k0290k516R796j867J3071
$$ -11424 7873 24922 27490 14755 8102 -118 13588 -354 -20644 -23160 -13364 -15231 -2160
3452b160J5463l309J1343j6173j3994l308n218j7245M32R018J502R17J0410Q571
$$ -2160 13303 9994 21337 5164 -8830 -12138 -17356 -34601 -34169 -25151 -23649 -22732 -12322 -3751
3438c751J653J553j000J2033R274j0431m971q756R30J8131M305m584r966N465
$$ -3751 -2098 -545 -1545 10488 19762 9331 4360 -4396 -3466 14665 18970 14386 4420 9885
3424I885J453j7668l278m339J285k681P995j892R450r127o956K421K1234j314
$$ 9885 11338 -6330 -9608 -13947 -12662 -15343 -7348 -9240 210 -8917 -15873 -13452 7782 6468
3410F468O05R376J750n866j6730j1419M731j0669N739R330j448O816j2076j4391
$$ 6468 7073 16449 18199 12333 -4397 -15816 -11085 -21754 -16015 -6685 -8133 -1317 -13393 -27784
3396b7784J7933J6118J369l49O254j631j3658m513l714q723N674N053n367K8p611
$$ -27784 -9851 6267 7636 7287 13541 11910 -1748 -6261 -9975 -18698 -13024 -7971 -13338 -13310 -20921
3381b0921M314J1450j344k983l898K215n949p66p9j957J753J2010L059J3159j2379
$$ -20921 -16607 -5157 -6501 -9484 -13382 -11167 -17116 -17882 -17961 -19918 -18165 -6155 -3096 10063 -2316
3366b316M850K3221M95j1244j8445O879k327p164j4173J4070K4902J932j7256
$$ -2316 2534 25755 26250 15006 -3439 3440 1113 -6051 -20224 -6154 18748 20680 3424
3353C424j4841O665p73l380J3303L936m219R485J198L311O575l812j2907j499
$$ 3424 -11417 -4752 -5525 -8905 4398 8334 4115 13600 14798 18109 24684 20872 7965 6466
3339F466j252k766O745Q270j0825j2839l776J401J592K319j3537J446P214l24
$$ 6466 5214 2448 9193 17463 6638 -6201 -9977 -8576 -6984 -4665 -18202 -16756 -9542 -9866
3325i866j04L776p599k35J2182J2865k407P075k910j3235j5218j382J0455J6694
$$ -9866 -9970 -6194 -13793 -14028 -1846 11019 8612 15687 12777 -458 -15676 -17058 -6603 10091
3311A0091p676J103M439p649k429K055l888R240l911K985L580j2099k2594r923
$$ 10091 2415 3518 7957 308 -2121 -66 -3954 5286 1375 4360 7940 -4159 -26753 -36676
3297c6676J3894O796N596O139K964j36j2488O277P637N292L530Q110M770j9942
$$ -36676 -22782 -15986 -10390 -4251 -1287 -1423 -13911 -7634 3 5295 8825 16935 21705 1763
3283A763j744K568q611L209O224l103j2231j7973j5905J2692K5934J1090P584
$$ 1763 19 2587 -6024 -2815 3409 306 -11925 -29898 -45803 -33111 -7177 3913 11497
3270A1497p867L75j1193j2348m598K174k962j5864l976K5378J7098l261M159M245
$$ 11497 3630 4005 -7188 -19536 -24134 -21960 -24922 -40786 -44762 -19384 -2286 -5547 -1388 2857
3256B857l442j867m768J0449J1455K617o811j8525R400J3621P696J4108l604m269
$$ 2857 -585 -2452 -7220 3229 14684 17301 10490 -8035 1365 14986 22682 36790 33186 28917
3242B8917j7590m365R107R524P09R852L438j0934j660M006l943n751Q597k579
$$ 28917 11327 6962 16069 25593 26302 36154 39592 28658 26998 31004 27061 21310 29907 27328
3228B7328j0064r153Q584n222j9112j1343P404J924J0293m585M165P934J3550
$$ 27328 17264 8111 16695 11473 -7639 -18982 -11578 -9654 639 -3946 219 8153 21703
3215B1703n802q011J9152R422j4358o205P707j1771j4490K591L461n667L899n635
$$ 21703 15901 7890 27042 36464 22106 15901 23608 11837 -2653 -62 3399 -2268 1631 -4004
3201d004l34P376O968n372p020j6635J53J6546J5036j76K715o455j0956j28p825
$$ -4004 -4338 3038 10006 4634 -2386 -19021 -18868 -2322 12714 12538 15253 8798 -2158 -2286 -10111
3186a0111n73J0241K528m647J1506J8359l461j3366l111k906k892J495K485M969
$$ -10111 -10684 -443 2085 -2562 8944 27303 23842 10476 7365 4459 1567 3062 5547 10516
3172A0516J4559J3263j3933k4679N613L857j3976m633P067L189O23j5016o027
$$ 10516 25075 38338 24405 -274 5339 9196 -4780 -9413 -2346 843 1466 -13550 -19577
3159a9577L329J0559q809m684m382N077o06p18M972R173L512n327j5688l665L312
$$ -19577 -16248 -5689 -14498 -19182 -23564 -18487 -19093 -19811 -14839 -5666 -2154 -7481 -23169 -26834 -23522
3144b3522K443J1251K0130J1572J246q066j0640j3J302p443J160j2799r216K5504
$$ -23522 -21079 -9828 10302 21874 23120 15054 4414 4401 5703 -1740 -580 -13379 -22595 2909
3130B909L616P764O233o999r678k849r04k436M035R238m11l843o051k356O948
$$ 2909 6525 14289 20522 13523 3845 996 92 -2344 1691 10929 10518 6675 624 -1732 5216
3115E216r858O339J3232J1028K309m989j0379J435M861N895P042j250j8453q078
$$ 5216 -4642 1697 14929 25957 28266 23277 12898 14333 19194 25089 32131 30881 12428 4350
3101D350j964l275M656L452K159l748n668q528J3215J1598l180j2139J2847n076
$$ 4350 2386 -889 3767 7219 9378 5630 -38 -8566 4649 16247 13067 928 13775 8699
3087H699l186o982o614l669J1532J3773r324J471J5287r103j1821n442n282J1312
$$ 8699 5513 -1469 -8083 -11752 -220 13553 4229 5700 20987 11884 63 -5379 -10661 651
3073F51n429p10n887k908J1121J719n58j2257J0256J492j8640k407J318J3840
$$ 651 -4778 -5488 -11375 -14283 -3162 -1443 -2001 -14258 -4002 -2510 -21150 -23557 -22239 -8399
3059h399J3276J9598R370q522L7O920r973J2483L851k3534L32n36j263M109o272
$$ -8399 4877 24475 33845 25323 25360 32280 22307 34790 38641 15107 15439 14903 13640 17749 11477
3044A1477o706R980j5898j4117J234K177j361p205M794N196n386J1843J1458J932
$$ 11477 4771 14751 -1147 -15264 -14030 -11853 -13214 -20419 -15625 -10429 -15815 -3972 7486 9418
3030I418L808n01q525L443N204r800j3304k566N14K112n418R819n096l132J3388
$$ 9418 13226 12725 4200 7643 12847 3047 -10257 -12823 -12309 -10197 -15615 -5796 -10892 -14024 -636
3015f36J5930r00j7525p787R81m663k400K987P791J0767L149O74J391J360q82
$$ -636 15294 14394 -3131 -10918 -9937 -14600 -17000 -14013 -6222 4545 7694 8368 9759 11119 10237
3000A0237j2546j952p028j6185K341J0668R710j086r158p73o935j0692L493K4386
$$ 10237 -2309 -4261 -11289 -27474 -25133 -14465 -4755 -5841 -14999 -15772 -22707 -33399 -29906 -5520
2986e520J7130j3045j4775k665Q994L550J569J645j0339j331N683J3718O648o600
$$ -5520 11610 -1435 -16210 -18875 -9881 -6331 -4762 -3117 -13456 -14787 -9104 4614 11262 4662
2972D662j2755r37J0779M001O192J418m118o900J6206M614p081j8423J4405J6794
$$ 4662 -8093 -9030 1749 5750 11942 13360 9242 2342 18548 23162 16081 -2342 12063 28857
2958B8857q108P729Q426n155j0473k3290J870J1807J2272o541k2724Q321R218
$$ 28857 20749 28478 36904 31749 21276 -2014 -144 11663 23935 17394 -5330 2991 12209
2945A2209P347R363j2949l472K1420n566j4986j659q598n010p53j0707L265N162
$$ 12209 19556 28919 15970 12498 33918 28352 13366 11707 3109 -1901 -2654 -13361 -10096 -4934
2931d934K434R77o178M125N250O77O499q882o823o278l568M316J8744M192J1412
$$ -4934 -2500 -1523 -7701 -3576 1674 2351 8850 -32 -6855 -13133 -16701 -12385 6359 10551 21963
2916B1963q383M281p67p820L27k914P419L158L179o72r019r256m746N307k389
$$ 21963 13580 17861 17094 9274 9601 6687 14106 17264 20443 19771 10752 1496 -3250 2057 -332
2901c32l097k633p475J635L354j554R981O644j1623j7901M935M579k283M923R293
$$ -332 -3429 -6062 -13537 -11902 -8548 -10102 -121 6523 -5100 -23001 -18066 -13487 -15770 -10847 -1554
2886a554J496j5097j0262p784P382K865R334R646O080O894K659J713J1601J1977
$$ -1554 -58 -15155 -25417 -33201 -25819 -22954 -13620 -3974 2106 9000 11659 13372 24973 36950
2872C6950q998j3203j9208n312j6263n453n164k296N475K5105J886j2640L831
$$ 36950 27952 14749 -4459 -9771 -26034 -31487 -36651 -38947 -33472 -8367 -6481 -19121 -15290
2859a5290J4193m281J829R549P08M932j251j3789j4551Q660P346j3639r18K747
$$ -15290 -1097 -5378 -3549 6000 6708 11640 10389 -3400 -17951 -9291 -1945 -15584 -16502 -13755
2845a3755j813k008Q782J2859M930o894r905J1223K269q154J3607J3641m89p084
$$ -13755 -15568 -17576 -8794 4065 8995 2101 -7804 3419 5688 -2466 11141 24782 24293 17209
2831A7209K114R78j8428m383p197j1944J168O843P78Q419O676L516j3506q912
$$ 17209 19323 20301 1873 -2510 -9707 -21651 -20483 -13640 -12862 -4443 2233 5749 -7757 -16669
2817a6669J5064J3704j0711j0475N413P463k5L437o859r973P789M498n343J5078
$$ -16669 -1605 12099 1388 -9087 -3674 3789 3764 7201 342 -9631 -1842 2656 -2687 12391
2803A2391N459n338N995o734L141M194p302j959M570j4206M166k880m296Q573
$$ 12391 17850 12512 18507 11773 14914 19108 11806 9847 14417 211 4377 1497 -2799 5774
2789E774J5386k071p186m801J1527R107o27n343k0692j64O616O955m424N338K478
$$ 5774 21160 19089 11903 7102 18629 27736 27109 21766 1074 910 7526 14481 10057 15395 17873
2774A7873m815j0322J802K891P639j0985l903J2515R718q733k1507K873Q996K493
$$ 17873 13058 2736 4538 7429 15068 4083 180 12695 22413 13680 -7827 -4954 4042 6535
2760F535r413K329K331m319L237m204K251N698M998Q535k280R65o362k71K0725
$$ 6535 -2878 -549 1782 -2537 700 -3504 -1253 4445 9443 17978 15698 16663 10301 10030 30755
2745C0755n757j1205j3320m186J5948P377q834k786k259L60r572j2214L568J5969
$$ 30755 24998 13793 473 -3713 12235 19612 10778 7992 5733 6093 -3479 -15693 -12125 3844
2731C844J3341o241j7074j269o049J7981J2990j1786j4944q790O99J6512J2670
$$ 3844 17185 10944 -6130 -7399 -13448 4533 17523 5737 -9207 -17997 -17298 -786 11884
2718A1884j8330k263M268K501O343P479o501p555o138Q214J584K549o83r261p815
$$ 11884 -6446 -8709 -4441 -1940 4403 11882 5381 -2174 -8312 -98 1486 4035 3352 -5909 -13724
2703a3724Q279J1087k024o918n884L155Q187N165K14j0113r978l955R067J0377
$$ -13724 -5445 5642 3618 -3300 -9184 -6029 2158 7323 7537 -2576 -12554 -16509 -7442 2935
2689B935Q535J640j0604K039k161j1755N494M329J609p730R656K64k232k985P366
$$ 2935 11470 13110 2506 4545 2384 -9371 -3877 452 2061 -5669 3987 4251 2019 -966 6400
2674F400n911r041J503L010L09j5975j0256O725J5482Q248m078P580l015J613
$$ 6400 489 -8552 -7049 -4039 -3730 -19705 -29961 -23236 -7754 494 -3584 3996 981 2594
2660B594K391J340O665o32o137m46p408l1670R253K6674k168k283n00l749n04
$$ 2594 4985 6325 12990 12358 6221 5775 -1633 -33303 -24050 2624 456 -1827 -2327 -6076 -6580
2645f580k695j4379j1321k876J4376J3015j0881k190J862R958j350m917K07M144
$$ -6580 -9275 -23654 -34975 -37851 -23475 -10460 -21341 -23531 -21669 -11711 -13061 -17978 -17771 -13627
2631a3627j6370k488J5337j795P393K577O153L753O507L550n976n588k21o575
$$ -13627 -29997 -32485 -17148 -18943 -11550 -8973 -2820 933 7440 10990 5014 -574 -795 -7370
2617g370q606R915J2948J95j7914k163P463J64j603P824J1008J2323l708n221
$$ -7370 -15976 -6061 6887 7082 -10832 -12995 -5532 -5368 -6971 853 11861 24184 20476 15255
2603A5255n857M824J0747m309O76Q26j3081m553J5426r957o131J8436j0188k504
$$ 15255 9398 14222 24969 20660 21336 22162 9081 4528 19954 9997 3866 22302 12114 9610
2589I610Q74L363N291K48P244N992N523m067j2916q276J54l662k7l252J116j3187
$$ 9610 10484 13847 19138 19386 26630 32622 38145 34078 21162 12886 13040 9378 9351 6099 7215 -5972
2573e972K022J1655M262M073n046j602J2411L65j979n428M803M103P07q727j595
$$ -5972 -3950 7705 11967 16040 10994 9392 21803 22168 20189 14761 19564 23667 24374 15647 14052
2558A4052l777k598P062L804k3923o181P969l132k078K258j395M570l922L263
$$ 14052 10275 7677 14739 18543 -5380 -11561 -3592 -6724 -8802 -6544 -7939 -3369 -7291 -4028
2544d028L92L058J4787m810o936J1918N848m22k0806q221j3221q711R455Q799
$$ -4028 -3636 -578 14209 9399 2463 14381 20229 19807 -999 -9220 -22441 -31152 -21697 -12898
2530a2898m163j5209J3454K1589j473m354J2029J0453r023j3750j1498O64K0768
$$ -12898 -17061 -32270 -18816 2773 1300 -3054 8975 19428 10405 -3345 -14843 -14179 6589
2517F589K977r16j5251r557J9517J1621j4499o467m5J56K122K512K933j887J911
$$ 6589 9566 8650 -6601 -16158 3359 14980 481 -5986 -6031 -5875 -3753 -1241 1692 -195 1716
2502A716P389j565j330O825q372k416Q711L249M467l927l881p895P460O084K497
$$ 1716 9105 7540 6210 13035 4663 2247 10958 14207 18674 14747 10866 2971 10431 16515 19012
2487A9012p470o961j0222N613Q502N943j1150q437L246r480l380p542j932Q21
$$ 19012 11542 4581 -5641 -28 8474 14417 3267 -5170 -1924 -11404 -14784 -22326 -24258 -23437
2473b3437j632m177M344J1501r135o284Q812L849M672J3985J2779n697k034Q11
$$ -23437 -25069 -29246 -24902 -13401 -22536 -28820 -20008 -16159 -11487 2498 15277 9580 7546 8357
2459H357Q994j2026q467J417M946M596q349m900J0144o983J3033M722r696j3402
$$ 8357 17351 5325 -3142 -1725 3221 7817 -532 -5432 4712 -2271 10762 15484 5788 -7614
2445g614j4782N301M381J2665M415J3910l214j5892p824M89J5782J0248r783j3382
$$ -7614 -22396 -17095 -12714 -49 4366 18276 15062 -830 -8654 -8165 7617 17865 8082 -5300
2431e300j0574l6J1693Q876j808r786K485J909O005j952k5111n286n737p964J5471
$$ -5300 -15874 -15910 -4217 4659 2851 -6935 -4450 -2541 3464 1512 -23599 -28885 -34622 -42586 -27115
2416b7115J3456P171K897k030P412J1347Q456Q04n142n322l013J362o653r779
$$ -27115 -13659 -6488 -3591 -5621 1791 13138 21594 22398 17256 11934 8921 10283 3630 -6149
2402f149J2509j578j2562P697r34J964R500m675j1557j882J1465L319J951J07
$$ -6149 6360 4782 -7780 -83 -1017 947 10447 5772 -5785 -7667 3798 7117 9068 9175
2388I175k690m274r966L478Q238J4089M683J709m217r028n430J770j952p345r89
$$ 9175 6485 2211 -7755 -4277 3961 18050 22733 24442 20225 11197 5767 7537 5585 -1760 -2749
2373b749n942O587q759J103M34L068l403j842q072J1501J3849n471k5666J184
$$ -2749 -8691 -2104 -10863 -9760 -9326 -6258 -9661 -11503 -19575 -8074 5775 304 -25362 -24178
2359b4178L760K67m697l917J0055J9020M449J1229n542l035j7002N282j5429m320
$$ -24178 -20418 -20151 -24848 -28765 -18710 310 4759 15988 10446 7411 -9591 -4309 -19738 -24058
2345b4058J4148O795k767j0044N70N644J591m131J623J6902R374p946j6657p850
$$ -24058 -9910 -3115 -5882 -15926 -15356 -9712 -8121 -12252 -10629 6273 15647 7701 -8956 -16806
2331a6806J9043j068l014J3897K477n628q343k481m049N043j771L943J756K989
$$ -16806 2237 1169 -1845 12052 14529 8901 558 -1923 -5972 -929 -2700 1243 2999 5988
2317E988J31P262J595L302j3849q604j5392O965J23O142K182P06j395r855r248
$$ 5988 6119 13381 14976 18278 4429 -4175 -19567 -12602 -12479 -6337 -4155 -3449 -4844 -14699 -23947
2302b3947M879Q844J0143J4855j616r047o921l902K183j717m684n6j176r68J6616
$$ -23947 -19068 -10224 -81 14774 13158 4111 -2810 -6712 -4529 -6246 -10930 -10986 -12162 -13130 3486
2287C486J8314n195j0617j0335q981J1547J9475j916j0568r014R039R437r79l161
$$ 3486 21800 16605 5988 -4347 -13328 -1781 17694 15778 5210 -3804 5235 14672 13693 10532
2273A0532j272k385L546K351r192L140R412l115p182O602q129p373P210m506o084
$$ 10532 9260 6875 10421 12772 3580 6720 16132 13017 5835 12437 4308 -3065 4145 -361 -6445
2258f445O944o602Q574P032o800O05N737l493r52K825M609K512j4562j0803l196
$$ -6445 499 -6103 2471 9503 2703 3308 9045 5552 4600 7425 12034 14546 -16 -10819 -14015
2243a4015J202Q230n777n905R046m643o75K396O594O684N912q398k2422r89Q476
$$ -14015 -12813 -4583 -10360 -16265 -7219 -11862 -12537 -10141 -3547 3137 9049 651 -21771 -22760 -14284
2228a4284J5920P233J0624J090m895j057N009l843k179K616k047O90M063n748
$$ -14284 1636 8869 19493 20583 15688 14631 19640 15797 13618 16234 14187 14877 18940 13192
2214A3192j658j1898j0419N959k53K640K349R917q084k424N199r864m832Q340
$$ 13192 11534 -364 -10783 -4824 -5077 -2437 -88 9829 1745 -679 4520 -5344 -10176 -1836
2200a836M62l291N042J267J498j7348j7206K78M159J6819J043J3148R214k536
$$ -1836 -1374 -4665 377 1644 3142 -14206 -31412 -31134 -26975 -10156 -9113 4035 13249 10713
2186A0713j0067j0292l41k363n379M547j296L901J9888N731l422L781M361m132
$$ 10713 646 -9646 -9987 -12350 -17729 -13182 -14478 -10577 9311 15042 11620 15401 19762 15630
2172A5630p036o513J394l162N079J980q621o440k681n614j141j568k98J0777K1265
$$ 15630 8594 2081 3475 313 5392 7372 -1249 -7689 -10370 -15984 -17125 -18693 -18991 -8214 13051
2157A3051O755j7718j3062m339P255L715R315P9M125J135j683J427J4504R068
$$ 13051 19806 2088 -10974 -15313 -8058 -4343 4972 5051 9176 10311 8628 10055 24559 33627
2143C3627j002o204N07J304j941J0191O427r828j2703k0421m761P828J3792N933
$$ 33627 32625 26421 26928 28232 26291 36482 42909 33081 20378 -43 -4804 3024 16816 22749
2129B2749N903q575j4332j1192J85n463M590k097P63P544K520l64J291J2656M026
$$ 22749 28652 20077 5745 -5447 -5262 -10725 -6135 -8232 -7469 75 2595 2231 3522 16178 20204
2114B0204q720n428p200q806j814J1053M729k1303J0427r99O775O803r15n732
$$ 20204 11484 6056 -1144 -9950 -11764 -711 4018 -17285 -6858 -7857 -1082 5721 4806 -926
2100i26o044j493K846R320Q919j3105j5872j4119J9575J2710o700K283J6637M769
$$ -926 -6970 -8463 -5617 3703 12622 -483 -16355 -30474 -10899 1811 -4889 -2606 14031 18800
2086A8800j2541L141r304k735J91n009N863J0759L717P97m975J8r378l931J1568
$$ 18800 6259 9400 96 -2639 -2448 -7457 -1594 9165 12882 13679 8704 8722 -656 -4587 6981
2071F981J3172j5679K62k022j1127j1302k547n803L586j748p910P402J5668J4513
$$ 6981 20153 4474 4736 2714 -8413 -19715 -22262 -28065 -24479 -26227 -34137 -26735 -11067 3446
2057C446j7461m690R497R725j1845o976j488O477Q142j936K734M130N609j2376
$$ 3446 -14015 -18705 -9208 517 -11328 -18304 -19792 -13315 -5173 -7109 -4375 -245 5364 -7012
2043g012M073R232l92N538p654q476O8n538M871m87O9r689R707J1205o815q631
$$ -7012 -2939 6293 5901 11439 3785 -4691 -4623 -10161 -5290 -5777 -5708 -15397 -5690 5515 -1300 -9931
2027i931K409K258J866n675m678N088j0309m562J5004m978j860N985k590J417
$$ -9931 -7522 -5264 -3398 -9073 -13751 -8663 -18972 -23534 -8530 -13508 -15368 -9383 -11973 -10556
2013a0556J276p00L436p493J5107J0608j627p697j0099L683P652K884o076n707
$$ -10556 -9280 -9980 -6544 -14037 1070 11678 10051 2354 -7745 -4062 3590 6474 398 -5309
1999e309j2391J2115M006o194n084o096J3214J5581q282p683n93J0956j102k301
$$ -5309 -17700 -5585 -1579 -7773 -12857 -18953 -5739 9842 1560 -6123 -6716 4240 3138 837
1985H37K545P09O42J0689O618j0203n914L122R177O074r54q109p167j265J772
$$ 837 3382 4091 4733 15422 22040 11837 5923 9045 18222 24296 23342 15233 8066 6801 8573
1970H573j860J113j1068j2479k481M999R40P775j473M955P436r588l304P248o723
$$ 8573 6713 7826 -3242 -15721 -18202 -13203 -12263 -4488 -5961 -1006 6430 -3158 -6462 786 -5937
1955e937l408L531J735R018Q676j0225p394j435J4933P733J872N273o837j0546
$$ -5937 -9345 -5814 -4079 4939 13615 3390 -4004 -5439 9494 17227 19099 24372 17535 6989
1941F989q867L527J3053N524n405p719P341J011P053P52j6174j1318N983M627
$$ 6989 -1878 1649 14702 20226 14821 7102 14443 15454 22507 23259 7085 -4233 1750 6377
1927F377M72r161J5491J437j1972j09o679n959M193O727Q352q626q075j3095m891
$$ 6377 6849 -2312 13179 14616 2644 2535 -4144 -10103 -5910 817 9169 543 -7532 -20627 -25518
1912b5518J0738K1759n421M449K881K753L787m828m416q892j2542k801J2737L913
$$ -25518 -14780 6979 1558 6007 8888 11641 15428 10600 6184 -2708 -15250 -18051 -5314 -1401
1898a401J6645m607J4099J4798j1889k5088j8029P81O611R958J665m729J207P053
$$ -1401 15244 10637 24736 39534 27645 2557 -15472 -14691 -8080 1878 3543 -1186 21 7074
1884G074j8105p456M150K999O661J161m146M496p477L215m392K35K5676N494j0391
$$ 7074 -11031 -18487 -14337 -11338 -4677 -3516 -7662 -3166 -10643 -7428 -11820 -11585 14091 19585 9194
1869I194o870m871J5474j1650j4240j1808P422J0064Q770j05j960J0936k30j2619
$$ 9194 2324 -2547 12927 1277 -12963 -24771 -17349 -7285 1485 1380 -580 10356 10126 -2493
1855b493J3404J4672n271p640mk012R26j1371k190R901K337J2056J071q849p896
$$ -2493 10911 25583 20312 12672 12668 10656 11582 211 -1979 7922 10259 22315 23386 14537 6641
1840F641J8421j8263k5214R190K64j100r309j131K0496O769r38J0864k0343k5803
$$ 6641 25062 6799 -18415 -9225 -8961 -10061 -19370 -20501 -5 6764 5826 16690 -3653 -29456
1826b9456m318J7263R755k704J881l042p23J550Q53L826J886r66L836J1608k470
$$ -29456 -33774 -16511 -6756 -9460 -7579 -10621 -11344 -9794 -8941 -5115 -3229 -4195 -359 11249 8779
1811H779j0479o766O011k65M375P05J852K259j1876j4968J7217J6839l111p60
$$ 8779 -1700 -8466 -2455 -2720 1655 2360 4212 6471 -5405 -20373 -3156 13683 10572 9812
1797I812o210n449M321j0765K845k256l64M17m656O97M222k838P420P604J8523
$$ 9812 3602 -1847 2474 -8291 -5446 -7702 -8066 -7649 -12305 -11608 -7386 -10224 -2804 4800 23323
1782B3323P105j6042r345l623o79R675J0358j0924M56m124r777N222J2765Q12
$$ 23323 30428 14386 5041 1418 739 10414 20772 9848 10304 6180 -3597 1625 14390 15202
1768A5202k4407k1630J0221N134p594J9814J4540j4611p747N642Q018N973m14
$$ 15202 -9205 -30835 -20614 -15480 -23074 -3260 11280 -3331 -11078 -5436 2582 8555 8141
1755H141m593J6147Q57P993K320o725j8846O542J2720j005j0902m029k0459j767
$$ 8141 3548 19695 20552 28545 30865 24140 5294 11836 24556 23551 12649 8620 -11839 -13606
1741a3606O486K0873J3683r771O073P111n356j2791n086J487Q849k614j0755r348
$$ -13606 -7120 13753 27436 17665 23738 30849 25493 12702 7616 9103 17952 15338 4583 -4765
1727d765p227m592k83L834l277J3613P484n56P393J454p705n830k646l060l531
$$ -4765 -11992 -16584 -16867 -13033 -16310 -2697 4787 4231 11624 13078 5373 -457 -3103 -6163 -9694
1712i694m310k700Q330J2793l427J491P420n534q125O75q689K292O197L430N537
$$ -9694 -14004 -16704 -8374 4419 992 2483 9903 4369 -3756 -3081 -11770 -9478 -3281 149 5686
1697E686K981m739R097j3121m746K186n51Q19J7646P606K007j6684k0186q643
$$ 5686 8667 3928 13025 -96 -4842 -2656 -3207 -2388 15258 22864 24871 8187 -11999 -20642
1683b0642P903J1888L37J704j1860Q696K9404O505j4686K093o43l638k54q701
$$ -20642 -12739 -851 -514 1190 -10670 -1974 27430 33935 19249 21342 20699 17061 16807 8106
1669H106p279l160R422J2873j2514q043j151m091N492O563L509L057p615j1047
$$ 8106 827 -2333 7089 19962 7448 -595 -1746 -5837 -345 6218 9727 12784 5169 -5878
1655e878n355j2277n114K3641J2108n206j0219J2781O867J2035j6767n167L099
$$ -5878 -11233 -23510 -28624 -4983 7125 1919 -8300 4481 11348 23383 6616 1449 4548
1642D548M107j2102Q401O592j2989M827m467L210j1665l02K537j310k870p705
$$ 4548 8655 -3447 4954 11546 -1443 3384 -1083 2127 -9538 -9840 -7303 -8613 -11483 -19188
1628a9188J4264Q520j1309q903m964N825M728J5369J155k159j369j0218j0130
$$ -19188 -4924 3596 -7713 -16616 -21580 -15755 -11027 4342 5497 3338 1969 -8249 -18379
1615a8379J856J3837J6873L779M255o272j0200o889l43j3172o81M466q35j848
$$ -18379 -16523 -2686 14187 17966 22221 15949 5749 -1140 -1483 -14655 -15336 -10870 -11705 -13553
1601a3553l817O352k409J1879L2425m868j3774k661q850L047j187l084R83n087
$$ -13553 -17370 -11018 -13427 -1548 30877 26009 12235 9574 724 3771 2584 -500 483 -4604
1587d604L328j2073k65J1199O933k298k0861m938M675K4781J4458r457k558J2380
$$ -4604 -1276 -13349 -13614 -2415 4518 2220 -18641 -23579 -18904 5877 20335 10878 8320 20700
1573B0700K0404k244o803j8090j4588l978J2950J094n603R387N976n384j228R699
$$ 20700 41104 38860 32057 13967 -621 -4599 8351 9445 3842 13229 19205 13821 12593 22292
1559B2292J927N987o924j7757o476J1897O31N437q300j0191r689Q83R951J2657
$$ 22292 24219 30206 23282 5525 -951 10946 11577 17014 8714 -1477 -11166 -10283 -332 12325
1545A2325j5165k120j292O51J6460O560p876M03m630K54q072k940r812L083R883
$$ 12325 -2840 -4960 -6252 -5601 10859 17419 9543 9946 5316 5570 -2502 -5442 -15254 -12171 -2288
1530b288m163n692m381n130N347J0690L774L614j727J4055P580M134k0522j5528
$$ -2288 -6451 -12143 -16524 -21654 -16307 -5617 -1843 1771 44 14099 21679 25813 5291 -10237
1516a0237K365n405R05K372Q809K080M312Q51L832j788O8n233n162o351M911q248
$$ -10237 -7872 -13277 -12372 -10000 -1191 889 5201 6052 9884 8096 8164 2931 -2231 -8582 -3671 -11919
1500a1919L097J2542m083j2481J895n162r811p022J5256J5358J4648K93L960l861
$$ -11919 -8822 3720 -363 -12844 -10949 -16111 -25922 -32944 -17688 -2330 12318 12611 16571 12710
1486A2710k622J0386L82P078j6097j0226L384J1027p733L043m308J227J2194j8392
$$ 12710 10088 20474 20856 27934 11837 1611 4995 16022 8289 11332 7024 8251 20445 2053
1472B053q238J4147M358l455J282J606R373J432j9722j1031q140J407J9446M170
$$ 2053 -6185 7962 12320 8865 10147 11753 21126 22558 2836 -8195 -16335 -14928 4518 8688
1458H688L852O235J034j5665L026o087n689P404L592J1516J1638l507n976l863
$$ 8688 12540 18775 19809 4144 7170 1083 -4606 2798 6390 17906 29544 26037 20061 16198
1444A6198K898l115L737n528O274p980q912j0356L054J6800Q76n143q976j4719
$$ 16198 19096 15981 19718 14190 20464 12484 3572 -6784 -3730 13070 13946 8803 -173 -14892
1430a4892Q27J8877m078p686J0817N606K850J3267q607k1219K928J341l247L34
$$ -14892 -14065 4812 734 -6952 3865 9471 12321 25588 16981 -4238 -1310 31 -3216 -2882
$$ [...]
##END NTUPLES=NMR SPECTRUM
##END=
