##TITLE=Analysis number 319474
Compound Code cc 14703
Project Code adrs
Chemist Name af chempharm
##JCAMPDX= 6.0         $$ Bruker NMR JCAMP-DX V2.0
##DATA TYPE= NMR SPECTRUM
##DATA CLASS= NTUPLES
##ORIGIN= Bruker BioSpin GmbH
##OWNER= nmr
$$ XWIN-NMR		Version 3.5
$$ Tue May 16 13:49:05 2006 GMT Daylight Time (UT+1h)  MAYBRIDGE\nmr@NMR_250MHZ
##.OBSERVE FREQUENCY= 250.131544655141
##.OBSERVE NUCLEUS= ^1H
##.ACQUISITION MODE= SIMULTANEOUS (DQD)
##.ACQUISITION SCHEME= undefined
##.AVERAGES= 16
##.DIGITISER RES= 18
##SPECTROMETER/DATA SYSTEM= dpx250
##.PULSE SEQUENCE= zg30
##.SOLVENT NAME= CDCl3
##.SHIFT REFERENCE= (INTERNAL, CDCl3, 0, 16.522)
##AUDIT TRAIL= $$ (NUMBER, WHEN, WHO, WHERE, WHAT)
$$ ##TITLE= Audit trail, XWIN-NMR		Version 3.5
$$ ##JCAMPDX= 5.01
$$ ##ORIGIN= Bruker BioSpin GmbH
$$ ##OWNER= nmr
$$ C:\u/data/dgb/nmr/ADRS/4500/pdata/1/auditp.txt
$$ ##AUDIT TRAIL=  $$ (NUMBER, WHEN, WHO, WHERE, WHAT)
(   1,<2006-05-16 13:48:24.94 +100>,<MAYBRIDGE\nmr>,<NMR_250MHZ>,
      <created by zg, POWCHK disabled, PULCHK disabled
       configuration hash MD5:
       84 BC 41 DB A1 6E 1D 46 DA 25 12 A5 C1 ED C5 3A
       data hash MD5: 64K
       BD ED EA 51 F3 D2 E0 65 F1 C3 AA 81 19 1C 1E C7>)
(   2,<2006-05-16 13:48:45.27 +100>,<MAYBRIDGE\nmr>,<NMR_250MHZ>,
      <Start of raw data processing
       ef LB = 0.3 FT_mod = 6 PKNL = 1 SI = 32K 
       data hash MD5: 32K
       E7 DE 25 0D 6F EC 64 63 92 C1 BA CB CA F1 37 B6>)
(   3,<2006-05-16 13:48:51.08 +100>,<MAYBRIDGE\nmr>,<NMR_250MHZ>,
      <apk 
       data hash MD5: 32K
       7D 53 A7 61 99 63 71 AB 5A 96 4C 21 A5 6D 61 88>)
(   4,<2006-05-16 13:48:52.67 +100>,<MAYBRIDGE\nmr>,<NMR_250MHZ>,
      <abs ABSG = 5 
       data hash MD5: 32K
       71 9C 33 3E E8 78 CF 73 21 CC C0 73 7D 46 4E 2B>)
$$ ##END=
$$ 
$$ hash MD5
$$ 00 82 EA E3 0F A6 03 0F 8A AA 52 38 27 8B 9C EB
##$RELAX= 
##$RELAX= 
##$RELAX= 
##$RELAX= 
##$RELAX= 
##$RELAX= 
##$RELAX= 
$$ Bruker specific parameters
$$ --------------------------
##$DU= <C:\u>
##$EXPNO= 4500
##$NAME= <ADRS>
##$PROCNO= 1
##$TYPE= <nmr>
##$USER= <dgb>
##$AMP= (0..31)
100 100 100 100 100 100 100 100 100 100 100 100 100 100 100 100 100 100 
100 100 100 100 100 100 100 100 100 100 100 100 100 100 
##$AQSEQ= 0
##$AQ_mod= 3
##$AUNM= <au_zg>
##$AUTOPOS= <39 >
##$BF1= 250.13
##$BF2= 250.13
##$BF3= 250.13
##$BF4= 250.13
##$BF5= 500.13
##$BF6= 500.13
##$BF7= 500.13
##$BF8= 500.13
##$BYTORDA= 1
##$CFDGTYP= 0
##$CFRGTYP= 5
##$CHEMSTR= <none>
##$CNST= (0..31)
1 1 145 1 1 1 1 1 1 1 1 1 1 1 1 1 1 1 1 1 1 1 1 1 1 1 1 1 1 1 1 1 
##$CPDPRG= <>
##$CPDPRG1= <>
##$CPDPRG2= <>
##$CPDPRG3= <>
##$CPDPRG4= <mlev>
##$CPDPRG5= <mlev>
##$CPDPRG6= <mlev>
##$CPDPRG7= <mlev>
##$CPDPRG8= <mlev>
##$CPDPRGB= <>
##$CPDPRGT= <>
##$D= (0..31)
0 1 0 0 0 0 0 0 0 0.06 0 0 0 0 0 0 0.0002 0 0 0 0 0 0 0 0 0 0 0 0 0 0 
0 
##$DATE= 1147783703
##$DBL= (0..7)
120 120 120 120 120 120 120 120 
##$DBP= (0..7)
150 150 150 150 150 150 150 150 
##$DBP07= 0
##$DBPNAM0= <>
##$DBPNAM1= <>
##$DBPNAM2= <>
$$ [...]
##$SUBNAM7= <"">
##$SUBNAM8= <"">
##$SUBNAM9= <"">
##$SW= 20.6930455092707
##$SWIBOX= (0..15)
0 0 3 0 0 0 0 0 0 0 0 0 0 0 0 0 
##$SW_h= 5175.983436853
##$TD= 65536
##$TD0= 1
##$TE= 295.16
##$TE2= 300
##$TE3= 300
##$TEG= 300
##$TL= (0..7)
0 120 120 120 120 120 120 120 
##$TP= (0..7)
150 150 150 150 150 150 150 150 
##$TP07= 0
##$TPNAME0= <>
##$TPNAME1= <>
##$TPNAME2= <>
##$TPNAME3= <>
##$TPNAME4= <>
##$TPNAME5= <>
##$TPNAME6= <>
##$TPNAME7= <>
##$TPOAL= (0..7)
0.5 0.5 0.5 0.5 0.5 0.5 0.5 0.5 
##$TPOFFS= (0..7)
0 0 0 0 0 0 0 0 
##$TUNHIN= 0
##$TUNHOUT= 0
##$TUNXOUT= 0
##$USERA1= <user>
##$USERA2= <user>
##$USERA3= <user>
##$USERA4= <user>
##$USERA5= <user>
##$V9= 5
##$VALIST= <valist>
##$VCLIST= <CCCCCCCCCCCCCCC>
##$VD= 0
##$VDLIST= <DDDDDDDDDDDDDDD>
##$VPLIST= <PPPPPPPPPPPPPPP>
##$VTLIST= <TTTTTTTTTTTTTTT>
##$WBST= 1024
##$WBSW= 4
##$XGAIN= (0..3)
0 0 0 0 
##$XL= 0
##$YL= 0
##$YMAX_a= 606927
##$YMIN_a= -605439
##$ZGOPTNS= <>
##$ZL1= 120
##$ZL2= 120
##$ZL3= 120
##$ZL4= 120
##$ABSF1= 16.522
##$ABSF2= -4.171173
##$ABSG= 5
##$ABSL= 3
##$ALPHA= 0
##$AQORDER= 0
##$ASSFAC= 0
##$ASSFACI= 0
##$ASSFACX= 0
##$ASSWID= 0
##$AUNMP= <proc_1d>
##$AZFE= 0.1
##$AZFW= 0.1
##$BCFW= 0
##$BC_mod= 0
##$BYTORDP= 0
##$COROFFS= 0
##$CY= 12.5
##$DATMOD= 1
##$DC= 0
##$DFILT= <>
##$DTYPP= 0
##$F1P= 14.0000005364418
##$F2P= -0.99999901652339
##$FCOR= 0.5
##$FTSIZE= 32768
##$FT_mod= 6
##$GAMMA= 0
##$GB= 0
##$INTBC= 1
##$INTSCL= 1
##$ISEN= 128
##$LB= 0.3
##$LEV0= 0
##$LPBIN= 0
##$MAXI= 10000
##$MC2= 0
##$MEAN= 0
##$ME_mod= 0
##$MI= 0
##$NCOEF= 0
##$NC_proc= -2
##$NLEV= 6
##$NOISF1= 0
##$NOISF2= 0
##$NSP= 0
##$NTH_PI= 0
##$NZP= 0
##$OFFSET= 16.522
##$PC= 1
##$PHC0= 199.6086
##$PHC1= -46.38175
##$PH_mod= 1
##$PKNL= yes
##$PPARMOD= 0
##$PSCAL= 4
##$PSIGN= 0
##$REVERSE= no
##$SF= 250.13
##$SI= 32768
##$SIGF1= 0
##$SIGF2= 0
##$SINO= 400
##$SIOLD= 32768
##$SREGLST= <1H.CDCl3>
##$SSB= 0
##$STSI= 32768
##$STSR= 0
##$SW_p= 5175.98343685301
##$SYMM= 0
##$S_DEV= 0
##$TDeff= 65536
##$TDoff= 0
##$TI= <Analysis number 999999
Compound Code 99
Book Reference 9
Project Code 9>
##$TILT= no
##$TM1= 0
##$TM2= 0
##$TOPLEV= 0
##$USERP1= <user>
##$USERP2= <user>
##$USERP3= <user>
##$USERP4= <user>
##$USERP5= <user>
##$WDW= 1
##$XDIM= 32768
##$YMAX_p= 288534273
##$YMIN_p= -266430
$$ End of Bruker specific parameters
$$ ---------------------------------
##NTUPLES= NMR SPECTRUM
##VAR_NAME=  FREQUENCY,     SPECTRUM/REAL,   SPECTRUM/IMAG
##SYMBOL=    X,             R,               I
##VAR_TYPE=  INDEPENDENT,   DEPENDENT,       DEPENDENT
##VAR_FORM=  AFFN,          ASDF,            ASDF
##VAR_DIM=   32768,         32768,           32768
##UNITS=     HZ,            ARBITRARY UNITS, ARBITRARY UNITS
##FACTOR=    0.157963299565203, 1,           1
##FIRST=     4132.6476996994, 0,             0
##LAST=      -1043.33573715361, 0,           0
##MIN=       -1043.33573715361, -266430,     0
##MAX=       4132.6476996994, 288534273,     0
$$ Real data points
##PAGE= N=1
##DATA TABLE= (X++(R..R)), XYDATA
$$ [...]
16948B1284N268p597o447r155o797m136m599j5912P182O196J3978O039m781l225
16934b702L354P209N137J2995l96k903j7677o608P873J818q83o638K157k376K978
16919C338L061l854p79L147l828J657n776M060J2168p696m044J183J267R597j256
16904A2245r575k0313m587R473J7738J930N104O621n42k451L450R938m415j1792
16890A2824n301j82M179n383n485N572O36j049R284N51J2019Q430M488m250r662
16875B6671K601j5004q716j907Q654N792k772N17j069k733N072N03Q506j1397
16861A4718q495J514L912L535k700o615j954N049k497M685J0711M628j0826R91
16847A6656k920p542j766M174l373M589J991j1230K276R328K257l637j397O21
$$ y = [21284, 26552, 18955, 12508, 3353, -3444, -7580, -12179, -28091, -20909, -14713, -735, 5304, 523, -2702, 652, 7861, 12998, 25993, 25597, 22694, 5017, -1591, 6282, 8100, 7217, 579, 2736, 360, 3338, 6399, 2545, 1766, 4913, 1085, 2742, -3034, 1026, 13194, 5498, 1454, 2637, 3904, 13501, 12245, 2670, -17643, -22230, -12757, 4981, 6911, 12015, 18636, 18094, 15643, 19093, 29031, 24616, 12824, 7523, 7341, 11520, 6137, 652, 6224, 6860, 5811, 15095, 15646, 27665, 36095, 40583, 36333, 26671, 29272, 14268, 5552, 3645, 12299, 18091, 15319, 15836, 14767, 12034, 17106, 17609, 26115, 14718, 6223, 7737, 11649, 15184, 12484, 5869, 3915, 8964, 6467, 11152, 21863, 26491, 15665, 16656, 13736, 6194, 4428, 8602, 5229, 9818, 11809, 579, 2855, 12183, 14440, 10803, 9406, 10027]
16833A0027m461P504K907j6785k857J1647Q394J1191j1406O090K89o784j1077
16820D679J722N168q989o569j03o063M609Q754N067k488j1235n243J1622J0431
16806A1362J3119m204n838j4512L531P390j669n875m58L902J606k543K064l301
16792D574p435l617J697n942L177o370l958J144J0930J4806J7j2917j373M142
16778a125o741P184k91M63p74l539P872J7843J5456j7135j3908j64o341N827J1641
16763A6268l471M662o367k43R440K763o4o290m188J003L513R086n753M352J430
16748B6141p955n916r792j4892j2829R214Q71P540n25p372J737J4519n423J0763
16734F081J2537J690j804n105J37P157M183P11j223p819q681n400j0088p192m051
$$ y = [10027, 5566, 13070, 15977, -808, -3665, 7982, 16376, 27567, 16161, 22251, 22540, 15756, 4679, 6401, 11569, 2580, -3989, -4092, -10155, -5546, 3208, 8275, 5787, -5448, -10691, 931, 11362, 24481, 20277, 14439, -73, 3458, 10848, 9179, 3304, 2846, 6748, 8354, 5811, 7875, 4574, -2861, -6478, -4781, -10723, -7546, -13916, -17874, -16730, -5800, 9006, 9023, -3894, -5267, -1125, -7866, -682, -973, -510, -1284, -4823, 3049, 20892, 36348, 19213, 5305, 5141, -1200, 4627, 16268, 12797, 17459, 11092, 10849, 20289, 23052, 22988, 16698, 12510, 13513, 17026, 26112, 20359, 24711, 26141, 18186, 12270, 2478, -12414, -25243, -16029, -15158, -7618, -8143, -15515, -13778, 741, -4682, 6081, 18618, 20308, 18504, 13399, 13536, 20693, 24876, 25587, 24364, 16545, 7864, 2464, -7624, -14816, -18867]
16719a8867J5391J3707K691m820k304n785j0453M684K113N650m245j4094L534
16706a2798K485k28J0688N72m978J1152m355J0521N490j898j3341p165j811N149
16692e17N590q299o781K01l744M814J1027M698N89q750n204L433R911Q43r160
16677a349j6959m750K1668K178j4031m471L713k354R584J47n421R063L83j945
16663d544n648L881Q600l019l657N225K233q29o953q888r679M536P792M140m797
16648a1607k090K06J0276k6q440M060R021J1666p071n586R217P084L899n600n997
16633I012j276k848Q605N570r848j7618q21P580l584p153J265P523M662N9l599
16618b471l439o979K693k12j2704K122M184P424N029l713N266k764n124n482J2533
$$ y = [-18867, -3476, 10231, 12922, 8102, 5798, 13, -10440, -5756, -3643, 2007, -2238, -16332, -12798, -10313, -10541, 147, 719, -4259, 6893, 2538, 13059, 18549, 16651, 3310, -3855, -5666, -517, 5073, -3226, -10007, -9806, -13550, -8736, 2291, 6989, 7578, -1172, -6376, -2943, 6968, 7811, -1349, -18308, -23058, -1390, 788, -13243, -17714, -14001, -16355, -6771, -6624, -12045, -2982, -2599, -4544, -10192, -6311, 2289, -730, -4387, 838, 3071, 2242, -4711, -13599, -23278, -18742, -10950, -6810, -11607, -13697, -13491, -3215, -3241, -11681, -7621, 1400, 13066, 5995, 409, 9626, 16710, 20609, 15009, 9012, 7736, 4888, 13493, 19063, 9215, -8403, -9224, -1644, -5228, -12381, -11116, -3593, 1069, 1128, -2471, -5910, -12889, -10196, -10408, -23112, -20990, -16806, -9382, -4353, -8066, -2800, -5564, -10688, -16170, -3637]
16603c637O762k401j641J043j2845m493N733M433l694l485o737L934M961Q909
16589c158P737m148M860J0909L944m818O808k867J0069P28r511q149K394j819
16575A2979n756M342j080R257K894j220M203n501j1290m187L723n282m098l45
16561a361q298N769Q734p352N437O671m745k1363j0107P904L64J5552J0637k845
16547D997j358n330m922L892J9327K467j9784l27Q456r628j4095N332P580p938
16533a1331p491J7550P261m175l423n712N990N182r907m327J962J1927j4516r319
16519b0329J632J0947J4714o0N371K696j2093n186p692J0594j21j4016M158R716
16505C31q934m468J2104P39J409j80J9069J139J632m501k687j834K75j4245J328
$$ y = [-3637, 3125, 724, -917, 126, -12719, -17212, -11479, -7046, -10740, -14225, -20962, -17028, -12067, -3158, 4579, 431, 5291, 16200, 20144, 15326, 22134, 19267, 29336, 30064, 20553, 12404, 14798, 12979, 7223, 11565, 10485, 19742, 22636, 21416, 25619, 20118, 8828, 4641, 8364, 3082, -1016, -1361, -9659, -3890, 4844, -2508, 2929, 9600, 4855, -16508, -26615, -18711, -18347, -2795, 7842, 4997, 3639, -1691, -6613, -2721, 16606, 19073, -711, -1038, 7418, -2210, -16305, -10973, -3393, -11331, -18822, -1272, 5989, 1814, -1609, -7321, -1331, 3851, -6056, -10383, -8421, 3506, -11010, -20329, -18697, -7750, 6964, 6904, 12275, 14971, 2878, -2308, -10000, 594, 473, -13543, -9385, 331, -8603, -13071, -967, -228, 1181, 1001, 20070, 21209, 22841, 18340, 15653, 13819, 14094, -151, 1177]
16490A177n329k726P822m040J257P293m798R545R19m316l671l712O255N401J934
16475A3011j4362K884k688j3098n241J550L156J1145R212O507N705l040Q309R11
16461B3961j9160l350n31l767j5482l252J5556P076m305J613P77N97M005Q826
16447A2564M422O58j372M515R977n155q211o818n234j0719K945J7242N468j910
16433A8372l430m239N736L286l916o317j370r163j196r66K231j072L227J822K626
16418E631J481k907j2109n729J0535J5756m429n105l599n103J3179J4599N84j717
16404B1067J253j0189j2249q119L756K385L285O943L694n617j6110m746J0705
16391c942O359l879o853r712J326L002K401L577J5018o82j1257n036P031J0855
$$ y = [1177, -4152, -6878, 944, -3096, -1839, 5454, 656, 10201, 11120, 6804, 3133, -579, 5676, 11077, 13011, -1351, 1533, -1155, -14253, -19494, -17944, -14788, -3643, 5569, 12076, 17781, 14741, 23050, 23961, 4801, 1451, 920, -2847, -18329, -21581, -6025, 1051, -3254, -1641, -864, -267, 3738, 12564, 16986, 17644, 16272, 20787, 30764, 25609, 17398, 10580, 5346, -5373, -2428, 14814, 20282, 18372, 14942, 10703, 16439, 19725, 15809, 9492, 8122, -1041, -2237, -3203, -972, -2044, 1183, 3005, 5631, 7112, 4205, -7904, -13633, -3098, 12658, 8229, 3124, -475, -5578, 7601, 22200, 22784, 21067, 22320, 12131, -118, -8237, -4481, -2096, 1189, 8132, 11826, 6209, -9901, -14647, -3942, 2417, -1462, -8315, -18027, -16701, -13699, -11298, -7721, 7297, 6615, -4642, -9678, -2647, 8208]
16377H208K1242M432n013K67p253q885p786N411J0943j313j97k198L184j4097
16363F945J852J2354M319j1911k828m13r075J55l76j785m978N348L700o583k236
16348e512k513N288p086M038n951n791O875P113J5941M005J2642q399j1780Q536
16334A7406N204n990k449k373j312O847Q298L16j1295r334n602j242Q656n373
16320A757k1235q104J5375J1337M142l258N857j52j4439j034J5119Q994r036j3421
16306h098p755l775J3065R795k666K550N995M874l535j5211q154N081J5753N825
16292A3744q87k604l412j5448q755M424j206J0419R237O96o909j1874j3096J0181
16278a5490J950m24K955L001o219J951m72J549Q851q669N41N962k610N900Q816
$$ y = [8208, 29450, 33882, 28869, 29136, 21883, 12998, 5212, 10623, 21566, 20253, 20056, 17858, 21042, 6945, 8797, 21151, 25470, 13559, 10731, 10318, 1243, 1398, 1022, -763, -5741, -393, 3307, -3276, -5512, -8025, -2737, -9823, -5785, -11736, -17527, -10652, -3539, 12402, 16407, 29049, 20650, 8870, 17406, 22610, 16620, 14171, 11798, 10486, 17333, 25631, 25947, 14652, 5318, -284, -1526, 7130, 1757, -19478, -27582, -12207, -870, 3272, 14, 5871, 5719, -8720, -9754, 5365, 14359, 5323, -8098, -15853, -19628, -6563, 3232, 566, 3116, 9111, 13985, 10450, -4761, -12915, -7834, 7919, 13744, 12857, 10253, 6841, -8607, -17362, -12938, -14144, -3725, 5512, 6208, -701, -12575, -25671, -15490, -13540, -13964, -11009, -8008, -14227, -12276, -12748, -11199, -2348, -11017, -10476, -4514, -7124, -1224, 7592]
16263G592K386r89k059L229o318j6599J228J8453N140p286p683J306j8668j0161
16249c0429J1593J5798J8774J2982q30j7109j1139m778Q788K424P236n502m655
16236C153q266j703k311J532N951O331M343j4082J91J2551O655j274l568m574
16222D929j36M29N475K008J083k401o398L754M098m719o731n463O686n99L668
16207E683J4521o087j3647p947j328N822L414J4320j929m4j680n994K235M022
16193A1361l182j0715M601l400q130M226Q28Q258j7j0262K389P229J36O108j0496
16178a066j3015J0726J6736K33j8940p965n04J0285R520O293R15K977K816M112
16164B3123J5l339j2506j38k63Q635j640m456k453j649J978J0753l883r392K241
$$ y = [7592, 9978, 8989, 6930, 10159, 3841, -12758, -11530, 6923, 12063, 4777, -2906, -1600, -20268, -30429, -18836, -3038, 15736, 28718, 27888, 10779, -360, -5138, 3650, 6074, 13310, 7808, 3153, -5113, -6816, -9127, -7595, -1644, 4687, 9030, -5052, -4861, 7690, 14345, 13071, 9503, 4929, 4793, 5222, 10697, 12705, 13788, 11387, 4989, 8743, 12841, 8122, 1391, -4072, 2614, 2015, 5683, 20204, 14117, 470, -7477, -8805, -2983, 431, 14751, 12822, 12778, 11098, 5104, 7339, 11361, 8179, -2536, 2065, -1335, -9465, -5239, -4411, 3847, 3830, -6432, -4043, 3186, 3322, 9430, -1066, -14081, -3355, 13381, 13614, -5326, -13291, -13795, -3510, 6010, 12303, 13218, 16195, 19011, 23123, 23138, 19799, 7293, 7155, 6892, 15527, 13887, 9431, 6978, 5329, 7307, 18060, 14177, 4785, 7026]
16149G026j382k644j823R12k105p378o519P453N047J0971k899m777j2132q968
16135a9218m972Q704N794N418Q5J1017J0024Q797l859j3799j8075m611P099P153
16121d43k72j0326N582p206r71K1372o12j4976M523R33j804J2791r478j215P161
16106E059M811m825p333k714K936Q866M699m580Q71m03O08j459K109K367r871
16091A141Q60p675p736R407O942J951Q17M500N81K547p596j4532m487J534K275
16076i471O384R924m009l625L189k517p115n189P475L090O349k459J126l79p900
16061e127K442Q776k107J130k882q636o7N015L813O984L109p605p957K67p695
16046a0540L581O372p947j0558k95Q633M674j754p372J6Q377L708R108n558p104
$$ y = [7026, 5644, 3000, 1177, 2089, -16, -7394, -13913, -6460, -1413, 9558, 6659, 1882, -10250, -19218, -24190, -15486, -9692, -4274, -4189, 6828, 16852, 25649, 21790, 7991, -10084, -14695, -7596, -443, -715, -11041, -5459, -12665, -13636, 7736, 7124, -7852, -3329, -2396, -4200, 8591, -887, -2102, 5059, 9870, 5045, -2288, -5002, -2066, 6800, 11499, 6919, 7790, 7387, 7995, 6536, 8645, 11012, 1141, 2001, -5674, -13410, -4003, 2939, 4890, 5707, 10207, 10788, 13335, 5739, -8793, -13280, -11746, -9471, -3087, 6837, 2828, -797, 2392, -125, -7240, -12429, -4954, -1864, 4485, 2026, 3152, 2773, -5127, -2685, 6091, 3984, 5114, 2232, -6404, -6471, -1456, 2357, 9341, 12450, 4845, -3112, -2845, -10540, -6959, -587, -8534, -19092, -19387, -10754, -6080, -7834, -15206, -15190, -6813, -3105, 6003, 445, -6659]
16031f659o642K102J255R540P855J1852m439j2453N049m115p725M819K983M472
16017G894M744j642j3964j837O609p390J094m156O23O658J979O117l594k570N820
16002F385p679j1282q533L395J532R006M661R537Q66p956R364J3728j0042j867
15988A1115j588J1921Q97j2058m563o243K153M300J385k195q68Q902J593j3516
15974A235J0126l224o896n74Q254J2379n133j2208o066j2214k831Q430Q36K808
15960e078O185J3923N7k534j4794P314j024o621q11q6O725J321l202L748J4293
15945A9416q17J148o57k512m922j2124l646k03M87L345m60J263K905P158O488
15930A6869l337j1259M443P437J469m789J083P13j2272Q350J2060j0353K439J0329
$$ y = [-6659, -13301, -11199, -9944, -404, 7451, 19303, 14864, 2411, 7460, 3345, -4380, 439, 3422, 7894, 12638, 10996, -2968, -4805, 1804, -5586, -4492, -8648, -8025, -1367, 612, 6729, 3135, 565, 6385, -1294, -12576, -21109, -17714, -16182, -7176, -2515, 7022, 7888, -68, 9296, 23024, 12982, 11115, 9527, 21448, 22345, 10287, 5724, -519, 1634, 5934, 7319, 5124, 4256, 13158, 14751, 1235, 11361, 8137, 1241, 667, 8921, 21300, 16167, 3959, -2107, -14321, -17152, -8722, -7886, -5078, 1107, 15030, 15087, 12553, -2241, 5073, 4049, -2572, -3383, -3469, 3256, 4577, 1375, 5123, 19416, 18599, 19747, 19090, 16578, 11656, -468, -4114, -4317, -3830, -485, -945, 318, 3223, 10381, 16869, 13532, 2273, 6716, 14153, 15622, 10833, 11916, 12629, 357, 8707, 20767, 10414, 12853, 23182]
15916B3182p707M909J1434r210j6553m831L426K843j0399R41J0611M349R26j8354
15902d433j2944j0205Q340J6306o892K605j416l287K481k408R705J2618n602m62
15888D406k203K77o101l121J598o801R724J7690k655p122l206L199k687j2368
15874i370Q553J327j302R370p482l151l776m579k471K185J6537J3696M846o474
15860A7909j3168o791N883K704J709j0526k263Q892L68o886l139n664l244k808
15846a7024P259N545N049j0797N312J6972k964p711N967o258j433Q785J8j3683
15832d963q051J166K394l749p972J922o621k354J7395N664k103Q120J8319n310
15818A3857j8854r96P282P268J5641k727q494k70m450Q126j523j963K439K243
$$ y = [23182, 15475, 20384, 31818, 22608, 6055, 1224, 4650, 7493, -2906, -1965, 8646, 12995, 13921, -4433, -17377, -27582, -19242, -2936, -9828, -7223, -8639, -11926, -9445, -11853, -2148, 10470, 4868, 4406, 2203, 2480, -3621, -6742, -5144, -11945, -2221, 15469, 12814, 5692, 2486, 5685, 2998, -9370, -817, 510, -792, 8578, 1096, -2055, -5831, -10410, -12881, -10696, 5841, 19537, 24383, 17909, 4741, -2050, 3833, 6537, 8246, -2280, -4543, 4349, 4717, -2169, -5308, -10972, -14216, -17024, -9765, -4220, 829, -9968, -4656, 12316, 9352, 1641, 7608, 1350, -83, 8702, 8720, -4963, -13014, -11848, -9454, -13203, -21175, -19253, -25874, -28228, -10833, -5169, -7272, 848, 19167, 13857, -4997, -5993, 1289, 8557, 24198, 21471, 12977, 12707, 8257, 16383, 14860, 12897, 15336, 17579]
15804A7579k753p981P45m740j0156p739o666K112J3719K632J1311M102j1034j964
15790h33P347L926m795j2797o970R108J094j244j735R717K057q00n09J35l244
15775D57j259o030l44K621L37N995J2758K55q60j3091j0397P491m999n583K075
15760a0574O714O875N303m39p658q069J898N985O108J5048J1226n865K533L218
15746C2303m177r300k479m887P732o802k776L329o725J329m102j4870O597K468
15732b360K027J0233L446o257k485J3662j3567j2777R695J690K546O134R397P129
15718B8513r448N376r512l317M316L662L906n967q783j7011j862R755O83o237
15704e926M320L112M623m306K856P525L500q456j3236n775J4140O234K38j363
$$ y = [17579, 14826, 6845, 7590, 2850, -7306, -15045, -21711, -19599, -5880, -3248, 8063, 12165, 1131, -833, 6514, 10440, 5645, -7152, -14122, -5014, -3920, -5164, -6899, 2818, 4875, 4075, 3566, 3701, 457, -802, -6832, -7176, -4555, -4218, 1777, 14535, 14790, 13930, 839, -9558, -2067, -7066, -12649, -10574, -3860, 3015, 8318, 7879, 221, -7848, -5950, 35, 6143, 21191, 32417, 26552, 29085, 32303, 28126, 18826, 16347, 11460, 19192, 12390, 9614, 12943, 6218, 7547, 3445, -11425, -4828, -2360, -333, 9900, 13346, 7089, 4604, 18266, 4699, -8078, 1617, 3307, 5853, 11987, 21384, 28513, 19065, 24441, 14929, 11612, 15928, 19590, 23496, 17529, 8746, -8265, -10127, -372, 311, -5926, -1606, 1506, 6129, 1823, 4679, 12204, 15704, 7248, -5988, -11763, 2377, 8611, 8849, 7486]
15690G486Q945j2180j0747O345L874l427N728M079p690n417N370P831N595j4869
15676I23j2216n502M924J2322J200K702J274L59N08k042j230p18j4005L45R359
15661a797n427k881J2877Q673l687m872N22K4225O584j4177p72m47O466K95j929
15646B3653n938j0110Q693n703N99p890n905o40J639l549q068P272J0160N324
15632I537K59j033m963j3195o887P928M261o013J4204K629K779R194j4445l093
15618A162j402K808q87p776O767J4243j943l838K762Q1Q374J650n101q387j6001
15603g488j926O376K89K056l605r256q021J1269J1287R255N532l589o954m306
15589I19l417r235j299K162l64R398Q743j4117J211l468l451J161M132p009r748
$$ y = [7486, 16431, 4251, -6496, -151, 3723, 296, 6024, 10103, 2413, -3004, 2366, 10197, 15792, 923, -11293, -16795, -11871, 451, 1651, 4353, 5627, 5986, 6494, 4452, 3222, 2504, -11501, -11156, -1797, -7224, -10105, 2772, 11445, 7758, 2886, 3408, 27633, 34217, 20040, 19268, 18821, 25287, 25582, 23653, 17715, 7605, 16298, 10595, 11194, 3304, -2601, -3241, -1602, -5151, -13219, -5947, 4213, 9537, 9796, 8763, 3800, -9395, -16282, -8354, -4093, -10106, 4098, 6727, 9506, 18700, 4255, 1162, -240, 2568, 1681, -6095, 672, 14915, 12972, 9134, 11896, 11977, 20351, 22001, 16900, 8513, -7488, -9414, -3038, -2749, -693, -4298, -13554, -21575, -10306, 981, 10236, 15768, 12179, 5225, 919, -2498, -11733, -13032, -10870, -11234, -1836, 6907, -7210, -5999, -9467, -12918, -11757, -7625, -14634, -24382]
15574b4382k168J558Q670J7988k111l170l0n327p606K113N661J4993m53p220o29
15559b113j0407p400l579O58K457Q525J912J841P807o450L252k238k737N132o538
15544i878J0421P671j7921q228M667j1671N244R409J1639N112P8J4945L663j2493
15530A2658l604j9301o319J0215O084j0490j3998P431J4972O79q228j1217P727
15517a3391J3809L333j442R865L38q017m39L259j0698j2275M160J5784j257p327
15503d298n103Q825O049N38n47n156l953q699j886l509J3310K272p824L244L405
15488c332R626j272P956P549p849j2979l948K534J3393l541n730J429J621p21
15474D736O827o411o259o001M778M803M454q753j5412J045l210L168J5445k832
$$ y = [-24382, -26550, -24992, -16322, 1666, -445, -3615, -3645, -8972, -16578, -14465, -8804, 6189, 5736, -1484, -2113, -12520, -19920, -23499, -22841, -20384, -11859, -9947, -8106, -299, -6749, -3497, -5735, -8472, -3340, -9878, 543, 8214, -9707, -17935, -13268, -24939, -19695, -10286, 1353, 6465, 6543, 21488, 25151, 12658, 9054, -10247, -16566, -6351, -267, -10757, -24755, -17324, -2352, -1673, -9901, -21118, -13391, 418, 3751, 2309, 12174, 12512, 4495, 4056, 7315, -3383, -15658, -11498, 4286, 3029, -4298, -9401, -576, 5473, 6011, 5464, 308, -3645, -12344, -14230, -17739, -4429, -2157, -9981, -6737, -3332, 6294, 5022, 12978, 20527, 12678, -301, -4249, -1715, 11678, 8137, 2407, 3836, 5457, 4736, 11563, 5152, -1107, -7108, -2330, 2473, 6927, -1826, -17238, -16193, -19403, -16235, -790, -3622]
15460c622l289j1060r239P126J1288L939j5129l028J1639J0725N29J51p068M35
15446f603p996p515N0N065m489K176O097O911J0668j0867q580R48J3239O549J048
15431F701p420m253P817K500l305J34k596k981j0382q19l766K25Q582n32P081
15416c014J0000J2439q690p637n04k16o908o746j1240M055J730P372O941k626
15402e044j007O520k342P277O375J813Q15p979p670l350m035P073P99j3637J479
15387a2913K526J1836J2951k601L833M020r04K839O195l04q438j0864k422k078
15373C676M755N481l646j6374P282P846j480J120p975L319j303L926j0261m821
15359h455L532N959J76J351p576n847j298N622k349m298l935q940Q661J2221Q776
$$ y = [-3622, -6911, -17971, -27210, -20084, -8796, -4857, -19986, -23014, -11375, -650, -121, 30, -7038, -6603, -14599, -22114, -22064, -16999, -21488, -19312, -13215, -6304, 4364, -6503, -15083, -14135, -896, 5653, 6701, -719, -4972, 2845, 5345, 2040, 2174, -422, -3403, -13785, -14604, -18370, -18145, -9563, -10095, -3014, 6986, 19425, 10735, 3098, 2594, 2378, -4530, -11276, -22516, -18461, -16731, -9359, -2418, -5044, -6051, 469, -1873, 5404, 11779, 13592, 14407, 6428, -1242, -4592, -8627, -1554, -755, -14392, -12913, -10387, 1449, 14400, 11799, 15632, 19652, 18748, 21587, 27782, 27478, 19040, 8176, 5754, 3676, 8431, 13912, 10266, -6108, 1174, 9020, 7540, 8660, 685, 4004, 2701, 6627, -3634, -8455, -4923, 1036, 1212, 2563, -5013, -10860, -12158, -6536, -8885, -13183, -17118, -26058, -17397, -5176, 3600]
15344C600k388k15L359J0061O029l403p971l894q50J971j7615j380P015j381N383
15329a679j168r634j5655N671J5188K515M315J0521q888j1508L238J5960O725
15316A5601K672j2588j455k044l675p344j3328K472K691K701o56p762J16L31L844
15301a8424M982L020k78M240R77J2297J2306K099k531j4972j1259N112l83N383
15287B569O58P401Q788N91k294M098P611j1879j280J672r000j5382j0422n11J2411
15272d969L485N93L175o9K470J1289j148p487l903j080j874q129j7152M085J0261
15257a0453k847n263Q909J4631n943p366O396R448o37N342Q395n834no241j5718
15242g186r794J382P101J092j11O580J1466m078j1681L10O422M538j399r359l440
$$ y = [3600, 1212, 997, 4356, 14417, 20446, 17043, 9072, 5178, 4328, 6299, -11316, -12696, -5681, -7062, -1679, -2847, -12481, -28136, -22465, -7277, -4762, -447, 10074, 1186, -10322, -7084, 8876, 15601, 18273, 5685, 4230, 2186, -1489, -8833, -22161, -19689, -16998, -14297, -14953, -22715, -22599, -22268, -18424, -13442, -10422, -10700, -6460, -5483, 6814, 19120, 21219, 18688, 3716, -7543, -2431, -2814, 2569, 3227, 10628, 19416, 20007, 17713, 21811, 29422, 17543, 16263, 17935, 8935, -6447, -16869, -17380, -4969, -1484, -891, 2284, 2215, 4685, 15974, 14826, 7339, 3436, 2356, 482, -7647, -24799, -20714, -10453, -13300, -18563, -9654, 4977, -966, -8332, -1936, 7512, 6875, 12217, 20612, 14778, 14773, 8532, -7186, -16980, -15598, -8497, -7405, -7516, -936, 10530, 6452, -5229, -4919, 1503, 6041, 4642, -4717, -8157]
15227h157J469K089r34J338n0K959n445R215Q117k715r288m703r949q620o157
15212c0831o371R594O665n098J5151J4988K564j559K51m196m706j3222Q558K562
15198e650k826k755n328k886j0070J3027J1564L232R295m720R887Q466q467j3784
15184a015l946J407J0028p155j302k057O09n877O73p847Q971J3773M44R167n432
15169A0441j0314q267k501P61O797N823o031J971N442l94m831k826l492M609o447
15154i259Q75R420M920J297J925k868p70p973r073N507M116J2736K439n71o248
15139F473r305q79j07P17l842R68o48j183R723l1j074K228p48R304L536j3465
15123A667j5630l613N059N675q663K790p138M368J0819K466Q9r559j6370J3065
$$ y = [-8157, -6688, -4599, -5533, -4195, -4245, -1286, -6731, 2484, 10601, 7886, -1402, -6105, -16054, -24674, -30831, -37202, -27608, -20943, -26041, -10890, 4098, 6662, 5103, 5354, 1158, -3548, -16770, -8212, -5650, -8476, -11231, -16559, -19445, -29515, -16488, -4924, -1692, 7603, 2883, 12770, 21236, 12769, -1015, -4961, -3554, 6474, -681, -1983, -4040, -3431, -9308, -8635, -16482, -7511, 6262, 6706, 15873, 10441, 127, -8140, -10641, -9880, -3083, 2740, -3291, -1320, 4122, 3728, -1103, -3929, -7421, -2812, -9259, -8384, 1036, 5956, 7253, 9178, 6310, 5540, -2433, -11506, -5999, -1883, 10853, 13292, 12721, 6473, -2832, -3711, -3818, -3101, -6943, -5975, -6623, -7806, 1917, 1886, 812, 3040, 2292, 11596, 15132, 1667, -13963, -17576, -12517, -6842, -15505, -12715, -19853, -15485, -4666, -2200, -2111, -11670, -28040, -14975]
15109a4975l058j0623m941J6106R795R953K908n370R726M160j3642L525J507J373
15095F444q586l823J0904k830j1411L582O798K215j645j0501K97r281K2875L345
15081H383j2070n594j1556j309M870N570M285r08J5942l335L69N760K467j5210
15067b336m539J0272j613J0607o838N013J779m076q63j644M632K641l638j1003
15053a606j1206N605M997k563l232r040K864J0838j327j5019O425J2319n597J305
15039e237K083k445L697J3894p229r457r768q64R494n842r84P310P080r378n033
15024a2679O146N048m530j0756K514J6139K934o151O384L981Q755J591L813n353
15010A7836j1501N141P027k642o976K608R00r523q115Q957N003R526J7315J532
$$ y = [-14975, -18033, -28656, -33597, -17491, -7696, 2257, 5165, -205, 9521, 13681, 39, 3564, 5071, 6444, -2142, -5965, 4939, 2109, -9302, -5720, 1078, 3293, 1648, -8853, -8556, -17837, 5038, 8383, -3687, -9281, -20837, -22146, -17276, -11706, -7421, -8329, 7613, 4278, 4647, 10407, 12874, -2336, -6875, 3397, 1784, 12391, 5553, 10566, 12345, 8269, 7406, 5762, 10394, 13035, 9397, -1606, -12812, -7207, -2210, -4773, -8005, -17045, -14181, -3343, -4670, -19689, -13264, -945, -6542, -5237, -3154, -5599, -1902, 11992, 4763, -4694, -14462, -15326, -5832, -11674, -12658, -5348, 1732, -7646, -12679, -6533, -1485, -6015, -16771, -14257, 1882, 4816, -1335, 5049, 9030, 17785, 19376, 23189, 17836, 6335, 11476, 18503, 15861, 8885, 11493, 12393, 2870, -5245, 3712, 8715, 18241, 35556, 37088]
14996C7088q95r725j830l039M703J6928L0765K3141j40l3280l1402r906O677R025
14982C8110j913j2050J084M769j2327r927J0506k676r867k167O820J149J0427
14969B1938j788j2905r820K719L985Q211J698N309q158j5098l953N147L002m564
14955d277K729K905Q28o412n462j636R398Q075L759l066m309k796K0375J2599
14941C2710o189l758m748j3872j4431k887O089j527P234J1274m185J048m163J500
14927D095r356j4613K974o032m865M071O915K143O434m416L734O488o55n266L621
14912d728j1243j5492J3701P029j114M147J1578K981L077M499O157L336l638r894
14898A0396o985q671j0570k683N323N402N129J958N90p780r374j678L158O378
$$ y = [37088, 36193, 26468, 24638, 21599, 26302, 43230, 73995, 97136, 96996, 63716, 32314, 22408, 29085, 38110, 36197, 24147, 25231, 30000, 17673, 7746, 18252, 15576, 5709, 3542, 10362, 11511, 21938, 20150, 7245, -2575, 144, 4129, 12340, 14038, 19347, 11189, -3909, -7862, -2715, 287, -4277, -1548, 1357, 2185, -4227, -9689, -11325, -1927, 6148, 9907, 6841, 2532, -264, 20111, 32710, 26521, 22763, 18015, 4143, -10288, -13175, -7086, -8613, -1379, 9895, 5710, 6758, 2595, 4095, -5261, -19874, -16900, -22932, -27797, -23726, -16811, -14668, -8234, -12650, -8916, -2428, -3083, -8349, -4728, -15971, -31463, -17762, -10733, -11847, -7700, 3878, 6859, 9936, 14435, 20592, 23928, 20290, 10396, 3411, -5260, -15830, -18513, -13190, -7788, -2659, -701, -111, -7891, -17265, -18943, -15785, -9407]
14884i407K1830O039j3362k225k118N060L89j1857M52N247k831q585L555K41O247
14869a325L389n377j4289r522J549m757K8P655l395j4558Q286K959J1071J8522
14855B36R320j5803q995N00j793J3295r853P69K199J817Q760K054J0307o74j2769
14840f30o615R459m95m527j836J77K317n75j5662k899K159r374L32J3339J7961
14825C131N662l377J4227n687j5567j8153o503P756j710O755P852Q498K082m180
14811G86q442n498o55P796Q816n980k908M247j3671r104Q608J2759k474L221j145
14796c644q859m199J0265m596j695J039R615J2963r377N764r903j2129N901P114
14782a741N321m32J582o495m574K198q053l692J0172Q28j1884m59M92N77M231
$$ y = [-9407, 12423, 18462, 5100, 2875, 757, 5817, 6206, -5651, -5199, 48, -2783, -11368, -7813, -7572, -1325, 2064, -3313, -17602, -27124, -25575, -30332, -30304, -22649, -26044, -40602, -32316, -29357, -18286, 236, 9556, -6247, -15242, -14742, -16535, -3240, -13093, -12324, -10125, -8308, 452, 2506, 12813, 12139, -630, -7245, 2214, 1719, -2808, -4644, -4467, -2150, -2725, -18387, -21286, -19127, -28501, -28169, -14830, 3131, 8793, 5416, 19643, 13956, -1611, -19764, -26267, -18511, -20221, -13466, -5614, 2884, 4966, 786, -7656, -13154, -13809, -6013, 2803, -3177, -6085, -1838, -15509, -24613, -16005, -3246, -5720, -2499, -3644, -12503, -16702, -6437, -11033, -12728, -11689, -2074, 10889, 1512, 7276, -2627, -14756, -8855, -1741, 3580, 3148, 4730, -1765, -6339, -4141, -12194, -15886, -5714, -4886, -16770, -17229, -16737, -16160, -11929]
14767a1929Q209R26n321k371q55L841J4425K599p935L96l355P0l798l393M187
14752d304O724k336m211k378j0681O558P106j828p696j239l512o521P714N821
14738a0783l735o139l462m976O949J2250N460J4590P929k992j5091p369q864J1345
14724d888O885R77p480r390J005J1077M367o760j083K885m32K15j447M522J7993
14709A8446P788l84m778j0855m534q182o460L383M870q270O602P793o780r392
14695a0753L353P366R759L358m639r363j489M479j2064j3757j852L287J3898J598
14681f819n745l233Q43J617J0117J3062L766K800j0026j2671j0436q684N68M920
14667a9921J802R514L48L984J1031q72K474K229K811K993K273k6014q761o380
$$ y = [-11929, -3720, -2794, -8115, -10486, -11341, -7500, 6925, 9524, 1589, 1985, -1370, -1300, -5098, -8491, -4304, 2420, 84, -4127, -6505, -17186, -10628, -3522, -5350, -13046, -14285, -17797, -24318, -16604, -10783, -14518, -20657, -24119, -29095, -22146, -9896, -4436, 10154, 18083, 15091, 0, -7369, -16233, -4888, 1997, 2974, -4506, -13896, -12891, -1814, 2553, -4207, -5290, -2405, -2837, -2622, -4069, 453, 18446, 26234, 25850, 21072, 10217, 5683, -2499, -8959, -5576, -706, -8976, -2374, 5419, -1361, -10753, -7400, -34, 9725, 13083, 8444, -919, -2408, 2071, -9993, -23750, -25602, -22315, -8417, -6819, -12564, -15797, -14954, -13337, -3220, 9842, 13608, 16408, 6382, -6289, -16725, -25409, -24841, -19921, -18119, -8605, -8257, -4273, 6758, 5886, 8360, 10589, 13400, 16393, 18666, -7348, -16109, -22489]
14653b2489j6174K236M083J1912J3758k805j083j135j736N433p649M200m098O116
14639i431N199n456l195L133M177J3434N827r940J779l67l086p189N193j0642
14625a0564L734O273P635p287j4276M982l691q519J449K612L057J249k355n53
14611a6254K221Q283o182j0477j959K504L235N833J9566L211M829j1763j2150
14598i103j532P057N562j2940j4659R94J7810R520M751j0403q290m269o036k288
14584b3826n665K578Q41j290l635K443J2068J4398M282M795O841r289k2134q772
14570b6365R915K759l58k423m038n723n104K28K814O049J3010O524j625n191n861
14555a5389Q050L915j576M87O588l823j8R66n519l351J066Q644l921m949K433
$$ y = [-22489, -38663, -36427, -32344, -20432, -6674, -9479, -10562, -11697, -13433, -8000, -15649, -11449, -15547, -9431, -4232, -9688, -12883, -9750, -5573, 7861, 13688, 3748, 5527, 5160, 2074, -5115, 78, -10564, -6830, -557, 7078, -209, -14485, -9503, -13194, -21713, -20264, -17652, -14595, -13346, -15701, -16254, -14033, -5750, -11932, -22409, -24368, -21864, -18629, -12796, 6770, 9981, 14810, 3047, -9103, -10635, -3578, 1984, -10956, -25615, -24621, -6811, 2709, 7460, -2943, -11233, -15502, -21538, -23826, -29491, -26913, -26072, -27362, -30997, -28554, -16486, -2088, 2194, 6989, 13830, 4541, -17593, -26365, -16450, -13691, -14049, -16472, -20510, -26233, -31337, -31109, -28295, -22246, -9236, -2712, -4337, -9528, -15389, -7339, -3424, -5000, -4513, 2075, -1748, -1766, -800, -6319, -9670, -8604, 40, -3881, -8830, -6397]
14540f397N847j756k91O654q314k795m838l14m249n55j0297p18L220K6657J2212
14525A4066m819m949p730O828Q220M65j1539o637o25K703J030j2117m160L1N989
14510a3244J936l177m484j112p860j332O434O7k484k136J1105J3984k377k284
14496f964K628L912J0428M462m262r094j3491n440K40J2615Q387M106k27Q054
14482A5354q689k0158p012q056R307J4596j944j855J305L771m154j539K261P593
14468G80K355o679p607r886J679J3558Q728P280n948r166p956j507m967m390K676
14453b1050N038J598L208j851k485Q91M976P953J078j6212j070J839P850k328
14439a0565j221m574j2299J2515O340J4585M385J123n160o095q954o453J787P090
$$ y = [-6397, -550, -2306, -2597, 4057, -4257, -7052, -11890, -12204, -16453, -17008, -27305, -28023, -24803, 1854, 14066, 9247, 4298, -3432, 3396, 11616, 12081, 542, -6095, -6720, -4017, -2987, -15104, -19264, -19233, -13244, -11308, -14485, -18969, -20081, -27941, -29273, -22839, -22772, -25256, -27392, -16287, -2303, -4680, -6964, -4336, -424, 10004, 14466, 10204, 1110, -12381, -17821, -17581, -4966, 3421, 7527, 7300, 15354, 6665, -13493, -20505, -28561, -19254, -4658, -6602, -8457, -7152, -3381, -7535, -9074, -6813, 780, 3135, -3544, -11151, -21037, -19358, -5800, 2928, 10208, 4260, -4906, -12862, -14369, -19336, -23726, -21050, -16012, -14414, -11206, -13057, -15542, -14651, -9675, -1722, -644, -16856, -17926, -16087, -8237, -10565, -11786, -16360, -28659, -16144, -9804, 4781, 9166, 10289, 5129, -966, -9920, -16373, -14586, -7496]
14425g496P572p422j185J2963m00l466L898Q487k48q369j4583N339r167k322o47
14410a7046J2347M264J040n372J380P57l326m030j6588M626j025J2978J6301L623
14396I929l714l308m887L037j123j1667j1679N735M365J4492M181r474O607M657
14382G151r090K648J2083l79j414j538j3170J516o779k491P438j1568o03J104
14368a5092O66o86j799l999M56P411M062j4514L553R872K042J380l03L65L154
14353c432Q0R248j925r463l31R862j3604l18J1904J245l939q849n889p274M14
14338b2271M064J205q9L440O517l27l460K253M819l832n572p472n54j0572N127
14323b6724J3534m921O590R472o451K026L642r496K837J103K487P067m743p903
$$ y = [-7496, 76, -7346, -8531, 4432, 4032, 566, 4464, 12951, 12703, 4334, -10249, -4910, -14077, -16399, -17046, -4699, -435, 605, -4767, -3387, -2630, -5956, -9986, -26574, -21948, -22973, -9995, 6306, 9929, 6215, 2907, -1980, 1057, -66, -11733, -23412, -17677, -13312, 1180, 5361, -4113, 2494, 7151, -1939, 709, 12792, 12413, 10999, 9461, -3709, -2193, -8972, -11463, -4025, -15593, -16196, -15092, -14426, -15112, -16911, -20910, -20454, -13043, -8981, -23495, -19942, -10070, -8028, -6648, -6951, -6586, -3432, -3352, 5896, 3971, -5492, -5823, 4039, -9565, -9883, 2021, 3266, -673, -9522, -15411, -22685, -22271, -18207, -17002, -17091, -13651, -7134, -7461, -10921, -8668, -3849, -7681, -13253, -20725, -21279, -31851, -26724, -13190, -18111, -11521, -2049, -8500, -6474, -2832, -12328, -9491, -8388, -5901, 1166, -3577, -11480]
14309a1480N895J1265l984l061n744l165Q906J8954J5145M764K5468P972n728
14296F5207m072n553j9626k2312J455r43m377o188K126l998K357K775l587l412
14282a48p508n627l845R943q966q356m35K1327Q341l621l827p762R986Q486q858
14267h70m802n692j400N883L665n339N57M825K536l156j4866J903J5037L262r807
14252h264J3350M347K406L930j2433q645k686l978l06L501J4614J416j0835p048
14238a0631l454k532Q807n815j1979p872J1250J0117j545J0278m306j038N566
14225c154N411j720k544q552n432k329J1628L962R770L984k995j013q312n765
14211g061l238P908r102j2368N425P659L697J927o242j782n492N46P048J576M471
$$ y = [-11480, -5585, 5680, 1696, -1365, -7109, -10274, -1368, 17586, 32731, 37495, 62963, 70935, 65207, 61135, 55582, 35956, 13644, 15099, 14156, 9779, 3591, 5717, 1719, 4076, 6851, 3264, -148, -7656, -13283, -17128, -7185, -16151, -24507, -24942, -3615, 4726, 1105, -2722, -10484, -498, 7988, -870, -5672, -11364, -12764, -6881, -3216, -8555, -7998, -3173, -637, -3793, -18659, -16756, -1719, 1543, -8264, 5086, 9433, 11839, 15769, 3336, -5309, -7995, -11973, -12279, -8778, 5836, 7252, -3583, -10631, -14085, -16617, -7810, -13625, -25604, -33476, -22226, -12109, -13654, -3376, -7682, -8720, -3154, 2257, 537, -2007, -10559, -15991, -18320, -6692, -2730, 7040, 11024, 8029, 7016, -1296, -7061, -10299, -2391, -11493, -23861, -18436, -10777, -7080, -5153, -11395, -13177, -18669, -18123, -11075, -9499, -5028]
14196e028j0203r07j637O67K921O780O121M396l064J418m52k065R35o481l603
14181a0202J0801O793o996r447l999Q757N755n918j870l955q146M812N824n559
14167a3350q125o549k70l25J1631M272M049k099P114P401n326M154N962J1027
14153A9566k662j4519j0888N01J1538J6512L09L4316O5889O4906L9069q910n3029
14140A62598m9155k3162k5722j7106k000k0757n969n478j1327K352k750k523m115
14127e114n686O914L043O712K885J934L621N693n700l567n503n719r8R365M420
14112A3200p980j1944j3445Q120K887P046K259m146l319m802j0060J5824J3587
14099G227M428P066R05j2331r024q759o524K945J0297N848q419k5883k824Q430
$$ y = [-5028, -15231, -16138, -17775, -17108, -14187, -7407, -1286, 3110, 46, 1464, 1012, -1053, -118, -6599, -10202, 599, 7392, 396, -9051, -13050, -4293, 1462, -4456, -6326, -10281, -18427, -13615, -7791, -13350, -21475, -28024, -28294, -28619, -16988, -12716, -8667, -10766, -3652, 3749, -1577, 2577, 8539, 19566, 16904, 2385, -8503, -8002, 3536, 20048, 20357, 54673, 120562, 185468, 224537, 215627, 162598, 113443, 90281, 64559, 47453, 45453, 24696, 18727, 13249, 1922, 4274, 1524, -999, -5114, -10800, -3886, -843, 5869, 8754, 10688, 14309, 20002, 14302, 10735, 5232, -487, -585, 8780, 13200, 5220, -6724, -20169, -12049, -9162, -2116, 143, -4003, -7322, -12124, -22184, -6360, 7227, 11655, 18721, 19626, 7295, -1729, -10488, -17012, -14067, -3770, 2078, -6341, -32224, -35048, -26618]
14085b6618J1949J4740L381p524J464j607P076l305r194j0754Q080O478p74l144
14071i752n319m267R491J896K880L782m849j6256o43N322K371J93K826Q23l298
14056a4800m278L952n682N727J4811L628n045k933j38q17p394J051K816q094P21
14041a6475J074k693L062J5601K543j0725K208R200r15j782n167r95l398K700
14027e762n1M033l815M6j1964L707K747L593J2480P360j6852j2350J7309j58j1961
14012a1638O974L327J2092o024o012l278P2M447l815o182m914O782P151J0579
13998I561l773j5116p220q108Q779Q584k447P702P67p8n427J755K866j0952R028
13983d079L030j0450J2691Q825L0q777K613L067O23k206m806p59n082N201O84
$$ y = [-26618, -14669, 71, 3452, -4072, -2608, -4215, 2861, -444, -9638, -20392, -12312, -5834, -6608, -9752, -15071, -19338, -9847, -7951, -5071, -1289, -6138, -22394, -23037, -17715, -15344, -15151, -12325, -11502, -14800, -19078, -15126, -20808, -15081, -270, 3358, -1687, -4620, -4758, -5575, -12969, -11918, -9102, -17196, -16475, -15401, -18094, -15032, 569, 3112, -7613, -5405, 3795, 2880, 1098, -4069, -5064, -8462, -5762, -5813, -1780, -5595, -5549, -17513, -13806, -11059, -7466, 5014, 12374, -4478, -16828, 481, 323, -11638, -4664, -1337, 10755, 4731, -1281, -4559, -4487, -40, -3855, -10037, -14951, -8169, -1018, 9561, 5788, -9328, -16548, -24656, -15877, -7293, -9740, -2038, -1271, -1349, -6776, -5021, -2155, -13107, -4079, -1049, -11499, 1192, 10017, 10047, 1270, 3883, 6950, 7573, 5367, 561, -198, -5280, -79, 605]
13968F05K274R81l624q599m457l776M835k26o636M126N335J6794J4567N955n478
13953B2676k0536o358j0006j3739M148P346J1933j3655j4277J185n392J0491J3808
13940a2376M868r588j136m750k693m838O829J0197P092l367J2r449j3633q943
13926d1775k032J2509J0264p632K172J3024N422m743r134j940P959O730j1472
13913b0648j4929j503J3094j572o562M983j280o673J0111P780J2352O60q968l133
13899a6288l043o114k899P761j009K628J7498R80j2516j5145n127J0458j022M48
13885b3390J2168R880k992o924p523j119j6559N84R395J0529J6852L332j1097
13872f864k815k827j0052m114K914J795J2273l436P494R734l768p585o130m094
$$ y = [605, 2879, 3860, 236, -8363, -12820, -16596, -11761, -11987, -18623, -14497, -9162, 7632, 22199, 28154, 22676, 2140, -4218, -14224, -27963, -23815, -16469, -4536, -18191, -32468, -31283, -36675, -26184, -12376, -7508, -17096, -18232, -22982, -25675, -30513, -23684, -13487, -6395, -9762, -9750, -19199, -32832, -41775, -43807, -31298, -21034, -28666, -26494, -13470, -8048, -12791, -21925, -23865, -15906, -9176, -20648, -35577, -37080, -23986, -25558, -32120, -27137, -28417, -35090, -24979, -17199, -4847, -4187, -13155, -16288, -19331, -25445, -28344, -20583, -21592, -18964, -1466, -486, -13002, -28147, -33274, -22816, -23838, -23390, -11222, -1342, -4334, -11258, -18781, -19900, -36459, -35875, -26480, -15951, 901, 4233, -6864, -9679, -12506, -22558, -26672, -23758, -21963, -9690, -13126, -5632, 4102, 334, -7251, -13381, -17475]
13858a7475m464n162O22R143j960J120L162l921M326p363P846M604p302j3170
13844b9994Q805J1158O956N767L499l148p559K746j1724J921K259j0474J0412
13831i376k44m439J722R164j072k710O160M691O25j1297n891R023j401j899o280
13816a3224o378J0060R8j643R847k328l13P009kj3387N94o149k316n95K667k631
13800a8691n682p154P612L824k838k679p296M819J3400P785l911n949R85m564
13786b0339q947P732J0712j0687O84r20M3k131N624J8851r47j6754O77L47M634
13771a1421O700j0166n892J1113l757n707p383J2420J106M395J2012n527J189
13758i18J109o848q624M652J2898J809j9835j2916l39P817Q500J835L323N730
$$ y = [-17475, -21939, -27101, -26479, -17336, -19296, -18176, -15014, -18935, -14609, -21972, -14126, -9522, -16824, -29994, -21189, -10031, -3075, 2692, 6191, 3043, -4516, -1770, -13494, -11573, -9314, -19788, -9376, -9620, -14059, -12337, -3173, -4245, -6955, -795, 3896, 4521, -6776, -12667, -3644, -5045, -6944, -13224, -19602, -9542, -9444, -11087, -1240, -3568, -3881, 3128, 3126, -10261, -9667, -15816, -18132, -18727, -16060, -18691, -24373, -31527, -23915, -20091, -22929, -25608, -32904, -28085, -14685, -6900, -10811, -16760, -15775, -20339, -29286, -21554, -10842, -21529, -20845, -21765, -21722, -23853, -18229, 622, -325, -17079, -16402, -16055, -11421, -4721, -14887, -20779, -9666, -13423, -19130, -26513, -14093, -12987, -8592, 3420, -2107, -918, 191, -6657, -15281, -10629, 2269, 4078, -15757, -28673, -29012, -21195, -12695, -10860, -7537, -1807]
13744a807p87l804J0303J848j1449k843j846j837q609o906n575k138P70J2736
13730b1944k143M567J1122o075q870j969n060m085l930Q744J0721K0509l289k114
13716c816N61k098p388J011L011K996K068j4216n434k84J714J3091j223o403j216
13701a7626j8561L357J160Q128R470L936j26n517o021N067R471j446l869j0510
13687b3087k610K729j4665l511J479J182K551J1000K4817k092J215q02O704J559
13673F469m275j4404j0140N58J7k872J808j674q54K713O450r620j3492o586P718
13658c8184M130J2208O390J2306l794m785m258o43K068N05P09K317P83j0061L328
13643a6981m325N9J736P520M910j2480k423O587m831P900j2649k17O938R89L647
$$ y = [-1807, -2594, -6398, 3905, 5753, -5696, -8539, -10385, -12222, -20831, -27737, -33312, -35450, -34680, -21944, -24087, -19520, -8398, -14473, -23343, -25312, -30372, -34457, -38387, -29643, -18922, 1587, -1702, -3816, -3255, -5353, -12741, -11730, -8719, -5723, -3655, -17871, -23305, -23589, -21875, -8784, -10007, -16410, -17626, -36187, -32830, -31670, -23542, -14072, -10136, -10262, -15779, -21800, -16733, -7262, -8708, -12577, -23087, -25697, -22968, -37633, -41144, -39665, -38483, -35932, -24932, -115, -2207, -992, -1794, 4910, 6469, 2194, -12210, -22350, -21792, -21775, -24647, -22839, -24513, -25367, -22654, -16204, -25824, -39316, -45902, -38184, -34054, -21846, -15456, -3150, -6944, -11729, -15987, -16630, -14562, -14057, -13348, -11031, -10248, -20309, -16981, -21306, -21247, -19511, -11991, -7081, -19561, -21984, -15397, -20228, -12328, -24977, -25194, -18256, -17267, -13620]
13628a3620j490j119r635R512J515r394r362L849P204L263k804o220K96k68K610
13613b5663K45N881L558j1484l954M05k660o676P264o693O654J2098l399k612
13599b7036Q68o79K4213J2278Q49o829p206n600j0139q584r026P112J9268J9286
13585H775q781R46j442m121j1164k76K326Q050p57o058j725J369N62m596j5260
13570c2152j1794j370J4867R136m074j310Q744l748k105J4298Q812j5260o850
13557b2806j569j995m43k365p227r310p504N632R017M754M460o66K079n698J656
13542c1985M776n014j031M325Q270k423M381O779M292m09j1943l338J555R112
13528a2653J777j9599r234P365J2265r500l612M326N987N930J893l013k925q37
$$ y = [-13620, -15110, -16229, -25864, -16352, -14837, -24231, -33593, -29744, -22540, -19277, -22081, -28301, -28005, -28273, -25663, -25418, -19537, -15979, -27463, -31417, -31012, -33672, -40348, -33084, -39777, -33123, -21025, -24424, -27036, -26168, -26847, -2634, 9644, 10493, 3664, -3542, -9142, -19281, -27865, -36891, -29779, -10511, 8775, -6, 940, -502, -4623, -15787, -16063, -13737, -5687, -6444, -12502, -14227, -12858, -12296, -16892, -32152, -43946, -45316, -30449, -21313, -25387, -26697, -17953, -21701, -23806, -9508, -696, -15956, -22806, -24375, -26370, -26813, -29178, -36405, -45715, -53219, -47587, -38570, -33816, -29356, -30022, -27943, -33641, -31985, -27209, -32223, -33254, -28929, -20659, -23082, -18701, -11922, -7630, -8039, -19982, -23320, -21765, -12653, -10876, -30475, -39709, -32344, -20079, -29579, -33191, -28865, -22878, -16948, -15055, -18068, -20993, -21830]
13514b1830j3704Q9o38O421K236N656P339j65j3194M00j962p725n492l518J2620
13499c3467O552o851j1520R800J2277R905O567o777r263j7309K983J8277o6J1291
13485g601L313j5792l591k17Q193K0838j1313j4197K187n433n728j560K763n093
13471c3231N017O738K184P995K507k871q451K293l386n865l246J283j646J917
13457b8762l76m259M368L934l242l408q970k434O423K491m786L947p18M868J0135
13442b0789O691j78n139j2824q819M14M682O184l332M66k036R517K665J907o118
13427b6709M315j021j7641O767j471o996J3899k775j233M967J531j0145m420m138
13413d5070J3098N954j03L20k222M163j2275o186Q516J3056J29n414P678n503
$$ y = [-21830, -35534, -35445, -36083, -29662, -27426, -21770, -14431, -14596, -27790, -27390, -29352, -37077, -42569, -46087, -33467, -26915, -33766, -45286, -35486, -23209, -13304, -6737, -13514, -22777, -40086, -37103, -18826, -18892, -7601, -4288, -20080, -23671, -23888, -15695, 5143, -6170, -20367, -18180, -23613, -29341, -30901, -28138, -33231, -28214, -21476, -19292, -11297, -8790, -11661, -20112, -17819, -21205, -27070, -30316, -29033, -30679, -28762, -29138, -33397, -29029, -25095, -28337, -31745, -40715, -43149, -36726, -34235, -39021, -35074, -35792, -30924, -20789, -14098, -14276, -19415, -32239, -41058, -40644, -35962, -29778, -33110, -32644, -34680, -25163, -22498, -20591, -26709, -22394, -23415, -41056, -34289, -35760, -42756, -28857, -31632, -32865, -27898, -26367, -36512, -40932, -45070, -31972, -26018, -26121, -25801, -28023, -23860, -36135, -42321, -33805, -20749, -20620, -26034, -18356, -23859]
13399b3859j7310p677K044J271k784J2893j597P384M687j390k776o401J0101J5106
13385a0308n591n549L335o800j8545o672P300J091O883j689m921j365P381P929
13371b7521j4321j5711P251Q097K669P979Q109o663j2927j1812r407k833Q629
13358e8461R916R043R577k926J0621K94J606M568r835j1932O552j85m415O863
13344b8714P444p591k045M607n238P195N199p415p079m56n745j12l110L032J0294
13329b9734J1649O798o131k86J0129M417j5439n640l002p494J893J1279l414K74
13315b4701L769p740j717R403n561j7859Q298J6203J1988j5459P617Q731j4237
13302b1265n988o227q791r980n45R626P308o577k777L043N597j286j1726P064
$$ y = [-23859, -41169, -48846, -46802, -45531, -48315, -35422, -37019, -29635, -24948, -26338, -29114, -35515, -25414, -10308, -15899, -21448, -18113, -24913, -43458, -50130, -42830, -41739, -34856, -36545, -41466, -42831, -35450, -27521, -41842, -57553, -50302, -42205, -39536, -31557, -23448, -30111, -43038, -54850, -64257, -67090, -58461, -48545, -39502, -29925, -32851, -22230, -21936, -20330, -15762, -25597, -37529, -30977, -31162, -35577, -28714, -21270, -28861, -30906, -26299, -31537, -24342, -19143, -26558, -33637, -34093, -39838, -39950, -43060, -40028, -29734, -18085, -11287, -17418, -17704, -7575, -3158, -18597, -24237, -27239, -34733, -32840, -21561, -24975, -24701, -20932, -28672, -30389, -20986, -26547, -44406, -36108, -19905, -7917, -23376, -15759, -7028, -21265, -27253, -33480, -42271, -52251, -52796, -43170, -35862, -42439, -45216, -42173, -36576, -37862, -49588, -42524]
13288d2524J3393O492n806l490l861k581L187j97K887Q047J825o172l540q164
13274d0504L39l641P182L50O668J3361p767r710k0O873J0452l467j3333j869k102
13259c7188J126K236J4081N226j010M460q618J578R34J78J635j0449q271J446
13245c2636k323j516O962p487r808o734L192O118M419K464M682j1538j3733p633
13231f5571Q053K1049Q177L379k60M79q381J247K735P328k270l573K367L591j0694
13216c2344n521m285j30N828J2702q678j1661K881M65J1653n799P513n457j232
13202c4065j6295q325J1486J742o19L221K115Q86n692j279j425J5143m482k049
13188c9638j0352N693J6333Q275j1462m418J664j3648r433Q894J0578p747k451
$$ y = [-42524, -29131, -22639, -28445, -31935, -35796, -38377, -35190, -35387, -32500, -24453, -22628, -28800, -32340, -40504, -40165, -43806, -36624, -36274, -29606, -16245, -24012, -33722, -33742, -26869, -16417, -19884, -33217, -35086, -37188, -36062, -33826, -19745, -14519, -15529, -11069, -19687, -18109, -17175, -16997, -15362, -25811, -34082, -32636, -34959, -36475, -29513, -37000, -46808, -53542, -50350, -44232, -39813, -37349, -32667, -44205, -57938, -65571, -57518, -36469, -28292, -24913, -25173, -24694, -33075, -31828, -29093, -21765, -24035, -27608, -25241, -21650, -32344, -37865, -42150, -42280, -36452, -23750, -32428, -44089, -41208, -40743, -29090, -34889, -27376, -32833, -34065, -50360, -58685, -47199, -45457, -46076, -42855, -40740, -39854, -45546, -46825, -48250, -33107, -37589, -39638, -49990, -44297, -27964, -19689, -31151, -35569, -33905, -47553, -56986, -48092, -37514, -45261, -47712]
13175d7712R740q790n544N482M586L124N446m139l546K757P092N076o389m290
13161c7107o564J282J5511R28M503M257k51r345m427j1935p249M981L106Q466
13147c3844J9548P518j0343n390K165m691N935j770r158R99o063o959j359n047
13133d8459j716o831q763J4522P705J166p456J2985J1876m991J319R343j74n620
13119b5094j1234q783j770K637O156O696L207l678l819q48m529P218N853M400
13105b3588o155j4795R899Q714o833J63J1175m618j1972n902p83O383K033J1058
13091b5221L258k1477j0757O528R284o323o025k489J3725Q392O344k406k71r791
13077c7229n734n562r296R544O353J0243j248O669J3069m195j0482J2954m42n728
$$ y = [-47712, -37972, -46762, -52306, -46824, -42238, -39114, -33668, -37807, -41353, -38596, -31504, -26428, -32817, -37107, -43671, -42389, -26878, -25950, -21447, -17190, -17441, -26786, -31213, -43148, -50397, -45416, -42310, -33844, -14296, -6778, -17121, -22511, -20346, -25037, -19102, -20872, -30030, -29031, -35094, -42053, -43412, -48459, -50175, -57006, -65769, -51247, -43542, -42376, -49832, -36847, -24971, -29962, -28643, -19300, -19474, -25094, -36328, -45111, -46881, -44244, -38088, -31392, -28185, -31863, -35682, -36530, -41059, -33841, -27988, -23588, -29743, -44538, -34639, -25925, -32758, -32595, -21420, -26038, -38010, -43912, -44695, -38312, -36279, -25221, -21963, -43440, -54197, -47669, -38385, -44708, -50733, -53222, -39497, -31105, -24761, -27167, -27438, -37229, -42963, -48525, -57821, -48277, -41924, -31681, -32929, -26260, -13191, -17386, -27868, -14914, -15356, -21084]
13063b1084J1m710p749P185J1349J6351n247o619j7505j6756m694M412J099Q135
13049c5822J5055J8182K3315J6284L5621P2889J07196J60821K35286K63109K15751
13038A127687R8469n0291j49397k02116j87870j44784j15492q7555o4626n2474
13028A71551k1392q420k7097n465m663o735j6353l227J976J055q326p003N27q015
13014E8413j2533q027O692P103o483j1932l241l143q057q732o251p758r40P311
13000B422J0873K867o709l496O633K301m396q951K826L426j8225p824M325R89
12986a2939N918j2250j2319o52J351o706J270j8932O465J7024J915o642j4599
12973e1096j2335m399k566r147n39n46k327Q444l378m694Q066P627J164K138j463
$$ y = [-21084, -21073, -25783, -33532, -26347, -14998, 1353, -3894, -10513, -28018, -44774, -49468, -45056, -43957, -35822, -20767, -2585, 20730, 37014, 72635, 145524, 252720, 413541, 648827, 911936, 1127687, 1226156, 1175865, 1026468, 824352, 636482, 491698, 376206, 288651, 224025, 171551, 150159, 141739, 114642, 109177, 104514, 97779, 81426, 78199, 80175, 81230, 72904, 65901, 66428, 58413, 45880, 37853, 44545, 51648, 45165, 33233, 29992, 26849, 18792, 10060, 3809, -3949, -4889, 2422, 13295, 16162, 9453, 5957, 12590, 14891, 10495, 1544, 4370, 7796, -10429, -18253, -13928, -12939, -7021, -19271, -31590, -32242, -30891, -37597, -36327, -55259, -48794, -31770, -29855, -36497, -51096, -63431, -67830, -70396, -79543, -80082, -80628, -82955, -74511, -77889, -82583, -74517, -66890, -65726, -63588, -65051]
12958f5051p549O950J3785K620j1759l688P335q654K454o617n085j493N841O794
12944f4117M758p271J813N5k057K021j2274n440J2206J0472l799J774k146l17
12930f4322n188L029l149n120L933J390p019j6608r602Q383P180P140l086J378
12916h1661J745K172p67q505j1542j033P141J7959Q013O528Q903O674N44J1459
12902c2370J6802J8722l257l1512k0841k0949r620j797j612O115L974P948R973
12889e8424p894K260R573k945j3483J75R187o741j1636K695m886q958L396J1145
12875g6536l282J214k963l050M972M199M515l297j0900M377k01N788K882M718
12861f7564P399n585k876l70k252M543N171J0771R565q46L495L4031K5788P495
$$ y = [-65051, -72600, -65650, -51865, -49245, -61004, -64692, -57357, -66011, -63557, -70174, -75259, -76752, -70911, -64117, -59359, -66630, -64817, -64762, -66819, -64798, -77072, -82512, -70306, -59834, -63633, -61859, -64005, -64322, -69510, -66481, -69630, -74750, -70817, -69427, -76446, -93054, -102656, -94273, -87093, -79953, -83039, -81661, -79916, -77744, -78511, -87016, -98558, -99591, -92450, -74491, -66478, -59950, -51047, -44373, -43829, -32370, -15568, 3154, -103, -31615, -52456, -73405, -83025, -84822, -86434, -80319, -76345, -68397, -58424, -66318, -64058, -54485, -57430, -70913, -70738, -61551, -68292, -79928, -77233, -82119, -91077, -87681, -76536, -79818, -78604, -81567, -84617, -79645, -75446, -70931, -74228, -85128, -80751, -80952, -75164, -72282, -67564, -60165, -65750, -68626, -68996, -71248, -66705, -61534, -50763, -41198, -42044, -38549, -4518, 21270, 28765]
12847B8765q499k573L28L431k9227k9552k1037o113L228j4091j6580N10K315N944
12833h3151L787l680j0112M960J4673N068J2901L9811K5619J1013L87k4058j6324
12820a9106j7750j8363O72j128j1332l71R483j447m891q532K476M46m810q712
12806h3365k2461j3178j7246j0082q911p801M934J8441L0141J2268J2539J1110
12794g3611K090L243J790L202k16j1336j4266k1696l1190j4341m113j2799k381
12781a75624K4683J7705L78l33k365K143n385l685j064m095n689J0098J5730N765
12767a21738j4852M893M745j7902k5042j8138j5031l030l267n484j3962l961R510
12754b23259N512J70P921J1886J5633J6464M125M8J373p462j5459p513n458q050
$$ y = [28765, 20266, 17693, 18021, 21452, -7775, -37327, -58364, -64477, -61249, -75340, -91920, -91410, -89095, -83151, -79364, -83044, -93156, -88196, -73523, -68455, -55554, -15743, 9876, 20889, 21276, -2782, -19106, -36856, -55219, -54547, -55675, -67007, -67378, -57895, -59342, -64233, -72765, -70289, -69843, -74653, -83365, -105826, -119004, -136250, -146332, -155243, -163044, -158110, -139669, -109528, -97260, -84721, -73611, -71521, -68278, -66488, -63286, -63502, -74838, -89104, -110800, -141990, -156331, -160444, -173243, -175624, -150941, -133236, -132858, -133191, -135556, -133413, -138798, -142483, -143547, -147642, -153331, -143233, -127503, -121738, -136590, -131697, -126952, -144854, -169896, -188034, -203065, -206095, -209362, -214846, -228808, -232769, -223259, -217747, -217577, -209656, -197770, -182137, -165673, -161548, -161500, -160127, -167589, -183048, -190561, -196019, -204069]
12740b04069j2734J190J055j3052J163N433r727p25k218O412l445j6535N850R137
12726b32265J6114L0019K8576J5808K7497M2374J8013n06q787j4048j2793k0951
12714a10949J094Q132K23J9799L2079L3322O5746O9457N0899P876l4188m2507
12702A00983l7876m4884l3905k5852k6004o384j6914Q559J0532K944j0282n086
12690h4169J233j5838j6198o711J1283m37r497l778k274k6468k6539j0747q697
12677a98837L49J397J9775K0780K3392J6085J2310J6442O180O324n19K579j410
12664g5153q542j0826n836K212j856Q214Om568n387J442K593J2869J7067Q593
12650e9172J153K042q830m333K743R059J418j6416O006N586R010K7831L6238K8483
$$ y = [-204069, -216803, -215613, -214558, -227610, -226447, -221014, -230741, -231466, -233684, -227272, -230717, -247252, -241402, -232265, -216151, -186132, -157556, -141748, -114251, -71877, -53864, -54370, -63157, -77205, -89998, -110949, -109855, -101723, -101500, -81701, -49622, -16300, 49446, 118903, 169802, 177678, 143490, 100983, 63107, 18223, -15682, -41534, -67538, -73922, -90836, -82277, -71745, -68801, -79083, -84169, -82936, -98774, -114972, -121683, -110400, -110837, -120334, -124112, -126386, -152854, -179393, -190140, -198837, -198488, -197091, -177316, -156536, -133144, -117059, -104749, -88307, -82127, -75803, -76322, -73743, -75153, -83695, -94521, -100357, -98145, -100001, -91787, -91781, -96349, -101736, -100294, -97701, -84832, -67765, -59172, -58019, -55977, -64807, -69140, -66397, -57338, -55920, -72336, -66330, -60744, -51734, -23903, 12335, 40818]
12636D0818K1041P174M250j7159l5197m1761k9540j7195L540M4433P8751O5457
12624A24612P9979O9411N7761N3739N9537R7923J09535J35254J46992J63647K00524
12613A298914K72232L53331M80933O37451Q34372J065355J357373J721248K188151
12604A0209360K883616M085259O407145J0908385J8863221L0405110M2590050
12597A26352146M8503406M1842749K2261565l744166k6190772l7917248l7707353
12590A33400327l0401813k1747159j4790754j0167519p320350n567403m400070
12583C9005259l506703k765932k145834j636152j246625j003387r04360q98876
12575B4897390r57322r86806r59148q91117p95482p28151o87168o53940o08750
$$ y = [40818, 61859, 69033, 73283, 56124, 20927, -20834, -50374, -67569, -64029, -19596, 59155, 124612, 204591, 274002, 331763, 385502, 445039, 542962, 652497, 787751, 934743, 1098390, 1298914, 1571146, 1924477, 2405410, 3042861, 3877233, 4942588, 6299961, 8021209, 10209360, 13092976, 17178235, 23585380, 34493765, 53356986, 83762096, 126352146, 174855552, 216698301, 238959866, 235215700, 209024928, 171107680, 133400327, 102998514, 81251355, 66460601, 56293082, 48972732, 43405329, 39005259, 35498556, 32732624, 30586790, 28950638, 27704013, 26700626, 25796266, 24897390, 23940068, 22953262, 21994114, 21102997, 20307515, 19579364, 18892196, 18238256, 17629506]
12566A7629506n68536n17131m73973m31972m05708l93242m03977l94085m06263
12557A3634619l95484l62231l30222l13153k94841k84036k61776k63741k76911
12548A0852224k79043k81986k73802k68926k53195k39269k26121k22884k19089
12539H587909k12557j96004j74371j64940j70815j78182j73538j69483j68511
12530F979508j51818j40277j36464j39945j23583j14675j21766j30529j25258
12521E795193j17777j05301j09376r7131r1367q2589q3934q6306j03634j03446
12511D814332j07320j06967j05317j01635r8731q9725q7813p7972o9035p8205
12501C891612p4758p6974o6948n5870o8000p0987o7688o7267o2740o4342p1989
$$ y = [17629506, 17060970, 16543839, 16069866, 15637894, 15232186, 14838944, 14434967, 14040882, 13634619, 13239135, 12876904, 12546682, 12233529, 11938688, 11654652, 11392876, 11129135, 10852224, 10573181, 10291195, 10017393, 9748467, 9495272, 9256003, 9029882, 8806998, 8587909, 8375352, 8179348, 8004977, 7840037, 7669222, 7491040, 7317502, 7148019, 6979508, 6827690, 6687413, 6550949, 6411004, 6287421, 6172746, 6050980, 5920451, 5795193, 5677416, 5572115, 5462739, 5365608, 5274241, 5191652, 5107718, 5021412, 4917778, 4814332, 4707012, 4600045, 4494728, 4393093, 4294362, 4204637, 4116824, 4038852, 3969817, 3891612, 3816854, 3739880, 3672932, 3617062, 3549062, 3478075, 3410387, 3343120, 3280380, 3216038, 3144049]
12490C144049p9096o5593o3816o3547o3815m9245m4584l7446o1315n0087n2683
12479B512822n9818m4993l9118l1011n5344n2660m1162l8124l6579k0808k0714
12468B072491l0611k7542l4699l2175k6985l8674l8413m0829m5085l8234l9988
12457A679256l1343k9548k9758m2206k6599l4045l6567k7375k6791k6315j5131
12446A353578k0110k1940j0580J4541M287j7793j7423k1869k6729l0072l892j4717
12434A187281m884q964j2725j3689j4760k1900j3364l4652l7853l3225k1819k2244
12422I47202j8558n901K546O303j6635p334p252j511q135r622K810Q265K86K383
12408H94847Q840o090j1623j0315j3803m2106m1310l6706l3807k9099k4088k4048
$$ y = [3144049, 3064953, 2999360, 2935544, 2871997, 2808182, 2758937, 2714353, 2676907, 2615592, 2565505, 2512822, 2453004, 2408011, 2368893, 2337882, 2282538, 2229878, 2188716, 2150592, 2114013, 2093205, 2072491, 2041880, 2014338, 1979639, 1947464, 1920479, 1881805, 1843392, 1802563, 1757478, 1719244, 1679256, 1647913, 1618365, 1588607, 1546401, 1519802, 1485757, 1449190, 1421815, 1395024, 1368709, 1353578, 1333468, 1311528, 1300948, 1315489, 1319776, 1301983, 1284560, 1262691, 1235962, 1205890, 1201998, 1187281, 1182397, 1173433, 1160708, 1147019, 1132259, 1110359, 1096995, 1062343, 1024490, 991265, 969446, 947202, 928644, 922743, 925289, 931592, 914957, 907623, 900371, 898860, 890725, 881103, 883913, 892178, 892464, 894847, 903687, 897597, 885974, 875659, 861856, 819750, 778440, 741734, 707927, 678828, 654740, 630692]
12396F30692j8574j3341p908k171p679m995K163m696l789m780j0460j8017j1757
12383E24688l158j8672k9747k4416j8783j3527j3002l660r046j2382j432l803
12371C73060k785l197J1566J093r825R56q059j431R713Q663J66k526J2463M705
12357C94562j3650q256m56M48j2957j5331j8538m801J3536J4222j2882m075N12
12344C32334p086N015k499M327N232j199j0715m424O26j2893j2809p143m075k640
12330B82051M44l792n026j821o145K619N943k419r653l292n284n898J3547J2785
12316B74059j462p921l136n73k991n234k789n897j862J354J1371J332M789m565
12302B56475o340J819j955j677n835K528K74Oj385m582j4564k2400j9198k9694
$$ y = [630692, 612118, 598777, 590869, 588698, 581019, 576024, 578187, 573491, 569702, 564922, 554462, 536445, 524688, 521530, 502858, 473111, 448695, 429912, 416385, 403383, 399723, 390677, 378295, 376863, 373060, 370275, 367078, 378644, 379737, 369912, 370868, 362809, 361378, 371091, 379754, 379920, 377394, 389857, 394562, 380912, 372656, 372200, 372648, 359691, 344360, 325822, 321021, 334557, 348779, 335897, 331822, 332334, 325248, 330263, 327764, 332091, 337323, 336124, 325409, 320985, 321611, 308718, 295909, 288766, 284691, 282051, 282495, 278703, 273677, 271856, 265711, 268330, 274273, 271854, 262201, 258909, 253625, 247727, 261274, 274059, 272597, 264676, 261540, 260967, 257976, 252742, 249953, 244056, 242194, 243548, 254919, 256251, 261040, 256475, 250135, 251954, 249999, 248322, 242487, 245015, 245289, 245295, 243910, 239328, 224764, 202364, 183166, 153472]
12288A53472j1317m648K4116L2685J7533Q502J0160P231j2931L789K698k128J0260
12275B39422J2701J4518J406j3821j5087m627M367r32Q188k913j1994Q93n098
12262B27023q916p4l875n190Q31L756Q163n69l959J848r198o324J5956N589o943
12247B18118q922j2923n654j2407R44J2448m631q467k133m976K031L899k507K209
12233A77029Q20R18m781p459L530M669Q960k25j0180p005J804N615J871j32K900
12218A78334Q048O904o729l022o376k15O039M394n083K498N716R073N332o072
12204A98841q667l092p963J525J2346M558j3206j3724j0102n014Q451N09m793
12191A59669p622L634Q735J78R379K833j992K582l982R407o677j6051n297M373
$$ y = [153472, 142155, 137507, 161623, 194308, 211841, 220343, 230503, 237734, 224803, 228592, 231290, 229162, 239422, 252123, 266641, 268047, 254226, 239139, 234512, 238879, 237947, 246135, 243222, 231228, 232121, 227023, 218107, 218033, 214158, 208968, 209799, 213555, 221718, 221149, 217190, 219038, 209840, 203516, 219472, 225061, 218118, 209196, 196273, 190619, 178212, 179156, 191604, 186973, 178506, 176373, 171397, 173428, 177327, 174820, 177029, 177849, 178767, 173986, 166527, 170057, 174726, 183686, 183461, 173281, 166276, 168080, 173695, 175566, 175434, 178334, 186382, 193286, 186557, 183535, 177159, 176944, 182983, 187377, 182294, 184792, 190508, 199581, 204913, 198841, 190174, 187082, 179119, 180644, 192990, 197548, 184342, 170618, 160516, 155502, 163953, 164462, 159669, 152047, 155681, 164416, 164594, 173973, 176806, 174814, 177396, 173414, 182821, 176144, 160093, 154796, 159169]
12177A59169M02r361j0227Q322L510n677j1721L910K3823J4307j19j2645r096
12164A54597j656j520Q057n20k659l811N370J8337K942J5722J9265K1752K3472
12151B59348M4480R3281J53651K01861K48704K36727J62694J7812j07977k01357
12141A109224k12315j69906j17431p5706o5443n2197l5419l6129k4800k4383k5582
12130B69913r685m11m41q324M230L611K71l100m419k37M122r550p636M027n963
12115B36408j9656j3169n75K377J775q790j7348L955q81l94M039o995K408J0516
12101A93670m447J899l336j3592n336O867p69J560J1764j0842r938N605n697j012
12087A66396R860o745p247o925m483j533J1721m191n585R091J4121L81j0311j0345
$$ y = [159169, 159571, 150210, 139983, 148305, 151815, 146138, 134417, 138327, 162150, 176457, 176338, 163693, 154597, 152941, 151421, 159478, 158958, 156299, 152488, 157858, 176195, 179137, 194859, 214124, 235876, 259348, 303828, 397109, 550760, 752621, 1001325, 1238052, 1400746, 1418558, 1310581, 1109224, 896909, 727003, 609572, 533866, 468423, 416226, 380807, 344678, 319878, 295495, 269913, 260228, 259817, 259376, 251052, 255282, 258893, 259164, 256064, 251645, 251408, 255530, 245980, 238344, 242371, 236408, 216752, 203583, 203008, 205385, 207160, 198370, 181022, 184977, 184096, 183702, 187741, 180746, 183154, 193670, 189223, 191122, 187786, 174194, 168858, 175725, 174956, 176516, 188280, 177438, 167500, 173105, 167408, 166396, 176256, 169511, 162264, 155339, 150856, 149323, 161044, 156853, 151268, 160359, 174480, 174861, 164550, 154205]
12073A54205n467O81N371P953Q63Q585l274p924n696N103M969L67p131p322l451
12058A47832J1168m553n099l7m820l042o915r045M738R87n359K0R293N656j3434
12043A27390M317m170P649R942j835m108R68q899p712r475n835J0848J6247L886
12029A39213j8352j6338N96J050J4200L885j298k0298q08J197O505k82p616M087
12015A05741m930P990p606L727Q147J0757L355l21K575m055n472J0219P690P842
12001A45659j2881j0470q070j7084q233k981J2101J3729N467j3355n771K386L50
11988A00847J750J0272k31j1416M842N583P095P948J0802K856K300o294j1302
11975A25052k0824q368j74j954O568N726J9l497m514P062P649L361K93r305L774
$$ y = [154205, 148738, 149419, 154790, 162743, 163606, 172191, 168917, 160993, 155297, 160400, 165369, 165736, 158605, 151283, 147832, 159000, 154447, 149348, 149311, 144491, 141449, 134534, 125489, 130227, 131214, 125855, 125875, 135168, 140824, 127390, 131707, 127537, 135186, 145128, 143293, 139185, 140153, 131254, 123542, 114067, 108232, 119080, 135327, 139213, 120861, 104523, 105119, 106169, 120369, 124254, 122956, 102658, 101850, 103047, 109552, 109270, 101654, 105741, 100811, 108801, 101195, 104922, 113069, 123826, 127181, 126860, 129435, 125380, 119908, 130127, 137817, 145659, 132778, 122308, 114238, 97154, 88921, 85940, 98041, 111770, 117237, 103882, 98111, 100497, 100847, 102597, 112869, 112638, 101222, 106064, 111647, 118742, 126690, 137492, 140348, 142648, 136354, 125052, 104228, 95860, 95686, 93732, 100300, 106026, 106045, 102548, 98034, 105096, 112745, 116106, 116399, 107094, 110868]
11960A10868M510p25N770P434O091P100r912k2417j9663n01J1962J7010L340q98
11946A19969L873o05l656K746K847n684j2736N040k932j547O051o120l728L974
11932A07492n280l034P967m518j0826k610J0768J3872K848Q5n200j726P723k686
11918A14875o398m76n120N4o102m692J3294j478q906K365M136r75j46J0756Q75
11903A12062j823q302k009k355O271N082J0668n913q095o021o36k983R758O290
11889A11994k786K972l356J624N041p306l719m46m899n57L783K75j582K70M26
11874A01734k763j2144J2943J4172O50N576J97l342p431l813J297J1494p786k2622
11860H8162j3578m404n303O504l5J175J5353J1576O075l017p05r080l148p376
$$ y = [110868, 115378, 114653, 120423, 127857, 133948, 141048, 131136, 108719, 89056, 88555, 100517, 117527, 120867, 119969, 123842, 123237, 119581, 122327, 125174, 119490, 106754, 111794, 108862, 107315, 113366, 107246, 103518, 107492, 102212, 99178, 107145, 102627, 91801, 89191, 99959, 113831, 116679, 116764, 111564, 109838, 117561, 114875, 108477, 108001, 102881, 102935, 96833, 92141, 105435, 103957, 95051, 97416, 101552, 100577, 100431, 111187, 112062, 110239, 101937, 99928, 97573, 103844, 108926, 119594, 113681, 105586, 99565, 98929, 95946, 105704, 111994, 109208, 112180, 108824, 110448, 115489, 108183, 104464, 104018, 99119, 98562, 102345, 102620, 101038, 101308, 101734, 98971, 86827, 99770, 113942, 114592, 120168, 120365, 117023, 109592, 105779, 107076, 118570, 110784, 88162, 74584, 70180, 64877, 71381, 71346, 72521, 87874, 99450, 105525, 102508, 101803, 92723, 89575, 82199]
11846H2199P474J0605j400j4294J847Q048M005l906q313j2162o150J5791Q265
11833I2009J875o654M906J1982Q947l508m783j4044o716p06K763J0095o373p519
11819H2274p463n118R239N077M171O714K238N288M368J865j5174r476P681J3952
11805A05636J903k591l02Q705R68r019J4096q909j2422N353N68j5055n844L336
11791H6423O359J461m348j0554M289L984J320N211J7018J389k2498m654o058L696
11777H3038J66R992J1072k400r930O479Q328m102j0048j805P136l608j19J2176
11763A06375j023q871O636n201k326o305J0100n030P195J5059K080l921N539j2875
11749A07432j2842P283n49O390M83j0322m615p962m888L879Q680o341l501J073
$$ y = [82199, 89673, 100278, 98878, 84584, 86431, 94479, 98484, 94578, 86265, 74103, 67953, 83744, 92009, 93884, 87230, 92136, 104118, 113065, 109557, 104774, 90730, 84014, 83308, 86071, 96166, 89793, 82274, 74811, 69693, 78932, 84009, 88180, 94894, 97132, 102420, 106788, 108653, 93479, 84003, 91684, 105636, 107539, 104948, 104646, 113351, 114319, 105300, 119396, 110487, 98065, 103418, 103986, 88931, 83087, 86423, 92782, 94243, 89895, 79341, 83630, 87614, 88934, 94145, 111163, 112552, 90054, 85400, 79342, 83038, 83204, 93196, 104268, 101868, 91938, 98417, 106745, 102643, 92595, 90790, 97926, 94318, 94199, 106375, 105352, 96481, 103117, 97916, 95590, 89285, 99385, 94355, 101550, 116609, 118689, 114768, 120307, 107432, 94590, 101873, 101324, 107714, 108197, 97875, 93260, 85298, 80410, 84289, 92969, 86628, 83127, 84200]
11735H4200L354Q198m063n426o026r783m012J7133j037o983N621M02J504M703
11721H7785J238q177L559k913N49l146k029J1502N653j1363j422n214q845j1285
11707E5892J2540J6206Q566q619q792n61L277Q698L064J7819J741m044L027L515
11693A12329j4142r499N104P837j0013k717J190J1796O415k457o210j371K148
11680A00410R404j519o687m832P296J966n524p523N143o935j3505P61l622N411
11666H0244J5082r19j268m926K153j732r16o457J033M605J0365J683o576M099
11652I6470P953p99j4340k855r433n031J3413R755q322n052r126j4749R824P083
11638G4791P419N040Q966J480j0959j0550r76J2396O985m709m977l859K026M754
$$ y = [84200, 87554, 95752, 91689, 86263, 80237, 70454, 66442, 83575, 82538, 75555, 81176, 81578, 83082, 87785, 89023, 80846, 84405, 81492, 82041, 78895, 76866, 88368, 94021, 82658, 81236, 76022, 67177, 55892, 68432, 84638, 93204, 84585, 75793, 75232, 78509, 87207, 90271, 108090, 109831, 105787, 108814, 112329, 98187, 88688, 93792, 101629, 91616, 88899, 90089, 101885, 108300, 105843, 99633, 98262, 100410, 109814, 108295, 101608, 96776, 104072, 106038, 100514, 92991, 98134, 91199, 77694, 78455, 74833, 80244, 95326, 94407, 93139, 88213, 90366, 88634, 87718, 81261, 82294, 86899, 97264, 98947, 92371, 96470, 104423, 103624, 89284, 86429, 76996, 71965, 85378, 95133, 86811, 81759, 72633, 57884, 67708, 74791, 82210, 87250, 96216, 97696, 86737, 76187, 75211, 87607, 94592, 89883, 84906, 81047, 83073, 87827]
11624H7827J122rK018l330k919m601j132M78P647k495Q86K746M215m769J4553
11609A02237M234j3438l494k884K100o565j788R812l817p30J305M034P556m431
11595I4131O382k227p879k717J053q100N167O089l293p78j70L808j1209q50J7019
11580I6426k091k195k415p603M185K735m293k831j1878Q040J2909M094q070k852
11566H4161j025K769K707p363j0627J1424o290j2519l16J0221J1637J75j1636
11553G3318j679L620N759J4656L798k477k705J075j527j3253r979J007R684o389
11539G4908l938J7851J0688M310k917j938n07J894J0833N24o092r285Q415Q461
11525A13207k146j0350M99n131p46J15l62j0018j564R688N922R357j58m219k334
$$ y = [87827, 88949, 88940, 90958, 87628, 84709, 80108, 78976, 79454, 87101, 84606, 85492, 88238, 92453, 87684, 102237, 106471, 93033, 89539, 86655, 88755, 82190, 80402, 90214, 86397, 85667, 86972, 91006, 98562, 94131, 100513, 98286, 90407, 87690, 88743, 80643, 85810, 91899, 88606, 87828, 87658, 91466, 80257, 79407, 96426, 94335, 92140, 89725, 82122, 86307, 89042, 84749, 81918, 70040, 78080, 90989, 95083, 87013, 84161, 83136, 85905, 88612, 81249, 70622, 82046, 75756, 63237, 62921, 73142, 84779, 84954, 73318, 71639, 75259, 81018, 95674, 99472, 96995, 94290, 95365, 93838, 80585, 70606, 71613, 81297, 74908, 70970, 88821, 99509, 103819, 100902, 98964, 98457, 100351, 111184, 111708, 105616, 96331, 104746, 113207, 111061, 100711, 101210, 96079, 95333, 95448, 95086, 85068, 83504, 93192, 99114, 108471, 108313, 104094, 101760]
11510A01760p24l875P20j30m035n804O790n360j160J994k999m969m089L037J858
11495H3014N070n63p57K168k205J299j045O461j920j99P122l4n807j2175m172
11480G6257R372J0315N067l911j2694m999k521n759j481N166Q851k50K190p024
11466G8579n719j48M276P268m171J36k132K340J3221J2830P740k329j2811q020
11452I1060p712p756j0521R828J5096J994k303k1362p687l95J4456K1525J0286
11439A06509n325n582p951q945j164O758m48o174P042M773N621o162j41P5J2966
11424A01852N687j0844j3207Q37k531q508L929O789K979R724M275J01o48J30O316
11409A06881r349J244r002K327N054l290j335j1426M67O102q278K023K888P407
$$ y = [101760, 101036, 97161, 97881, 97751, 93716, 87912, 94702, 89342, 88182, 90176, 87177, 82208, 78119, 81156, 83014, 88084, 87521, 86764, 88932, 86727, 88026, 86981, 93442, 91522, 91323, 98445, 98411, 92604, 80429, 76257, 85629, 95944, 101011, 97100, 84406, 79407, 76886, 71127, 69646, 74812, 83663, 83413, 85603, 78579, 72860, 72712, 76988, 84256, 80085, 80221, 78089, 80429, 93650, 106480, 114220, 111891, 99080, 91060, 83348, 75592, 65071, 74899, 89995, 91989, 89686, 68324, 60637, 60242, 74698, 96223, 106509, 101184, 95602, 87651, 78706, 77542, 84300, 83852, 77678, 84720, 89493, 95114, 88952, 88811, 88886, 101852, 107539, 96695, 83488, 84325, 81794, 73286, 77215, 84004, 86983, 96707, 100982, 101083, 100435, 100565, 106881, 97532, 98776, 89774, 92101, 97155, 93865, 92530, 81104, 81571, 87673, 79395, 81418, 84306, 91713]
11395I1713M623L775l347o848q696q823M20J6423M922Q76J0327R170n207k983
11381A06345l561p048j77M884J4827M001l633M303j5427N860k129j6470l187K724
11367I1312N258J7557J2332j305j9396k0868n844R32R047K3451K930K124m831
11354A12699m533k59o79k118l066o437j4026j2578J6543J9287L583k908n775l965
11340I5768L019Q133K998r621J04q883O625R917p371O628P050j0908j543Q789
11326A10705l343k73j2168m185O843N184q004o397N516k446L076N333M900R300
11312A14041K657o10k032r206p589K243J2219R384k022k150j227M576r030j0225
11298A01029o266J877K870l397O389J0719J1914m749l271K198M596Q486j325n625
$$ y = [91713, 96336, 100111, 96764, 89916, 81220, 72397, 72817, 89240, 94162, 95038, 105365, 114535, 109328, 106345, 102784, 95736, 95559, 100443, 115270, 119271, 115638, 119941, 104514, 110374, 108245, 91775, 88588, 91312, 96570, 114127, 126459, 125154, 105758, 84890, 79046, 79978, 89025, 112476, 115406, 117530, 112699, 108166, 107907, 107228, 105110, 102044, 95607, 81581, 69003, 85546, 104833, 108416, 105508, 99733, 95768, 98787, 106920, 109918, 100297, 100401, 91518, 98143, 108060, 100689, 107317, 114367, 103459, 101916, 110705, 107362, 107089, 94921, 90736, 97579, 102763, 94759, 88362, 93878, 91432, 94508, 99841, 104741, 114041, 116698, 116088, 114056, 104850, 97261, 99504, 111723, 121107, 119085, 116935, 115708, 120284, 111254, 101029, 94763, 96640, 99510, 96113, 102502, 113221, 125135, 120386, 117115, 119313, 123909, 132395, 131070, 125445]
11284A25445M994l312p997p19r62M313j144j8848j0919R383M084N83j8267J869
11270H8503J2752j252j014l052Q243m795k889K601k080q000K2830J1485R93p817
11256A16508r712O19O837K978K319J0726N407o366p496j4266p292m582O916O231
11242A08827m668J0381J1068j2947j1952N330J86m528o432P163k194o803K49K1934
11228A15614J0201n622r006l667R377O725q514K532K984K318O76l39M277k726
11214A24830p836K440k389r254J2083L420O406J007K192o823q702M124J8863J0609
11200A50970r355k178q513J54J149J384o282o482m664o239j011N340J4036j225
11186A27084q090p370J1471N553r743J720m008J754J82Q351M640p346O699j285
$$ y = [125445, 130439, 127127, 119130, 118411, 117449, 121762, 120618, 101770, 90851, 100234, 104318, 104901, 86634, 88503, 101255, 100003, 98989, 95937, 104180, 99385, 96496, 99097, 97017, 89017, 111847, 123332, 124325, 116508, 106796, 107415, 114252, 117230, 119549, 130275, 135682, 129316, 121820, 107554, 100262, 95680, 102596, 108827, 104159, 114540, 125608, 112661, 100709, 106039, 106225, 101697, 95265, 102428, 100234, 93431, 93680, 115614, 125815, 120193, 111187, 107520, 116897, 123622, 115108, 117640, 120624, 122942, 123618, 123279, 127556, 124830, 116994, 119434, 117045, 107791, 119874, 123294, 129700, 130707, 132899, 126076, 117374, 121498, 140361, 150970, 141615, 139437, 130924, 131078, 132227, 133611, 127329, 120847, 116183, 109944, 108933, 114273, 128309, 127084, 118994, 111624, 123095, 128648, 118905, 120625, 116617, 118371, 118553, 126904, 131544, 124198, 130897, 129612]
11172A29612j1637L559q295m389m509J7P032L84K455K541k397k020R00N544P363
11157A26160O497l095j3663j572n907L492Q010k693O687J5987O736j974j1037
11144A33628o124r918l645l677K97N631n067m200J6951J3077L982o92l260q217
11130A28766K214O851p331J782M399o627q716k218K323P435K723q231J0637R282
11116A43289l91m593R872Jr131L00K502j1260O501j81J0278J0349N9k947J459
11101A56107O015K193M308r071j0064j0841n924o036K697k294o17P947P098M586
11087A46104M184l163o018m244Q260Q927L710M915l247r168N99M591q210r615
11073A37625k392J0477N233M352n142p704P859J8362N040L111m645P818N191Q01
$$ y = [129612, 117975, 121534, 113239, 108850, 104341, 104358, 111390, 111774, 114229, 116770, 114373, 112353, 113253, 118797, 126160, 132657, 129562, 115899, 114327, 108420, 111912, 119922, 117229, 123916, 139903, 146639, 144665, 133628, 127504, 117586, 113941, 110264, 110561, 116192, 111125, 106925, 123876, 136953, 140935, 140243, 136983, 128766, 130980, 137831, 130500, 132282, 136681, 130054, 121338, 119120, 121443, 128878, 131601, 123370, 134007, 143289, 142898, 138305, 148177, 148178, 139047, 139347, 141849, 130589, 137090, 136909, 147187, 157536, 157595, 154648, 156107, 162122, 164315, 168623, 159552, 149488, 138647, 132723, 126687, 129384, 127090, 126473, 134420, 141518, 146104, 150288, 147125, 141107, 136863, 145123, 154050, 157760, 162675, 159428, 150260, 150859, 155450, 147240, 137625, 135233, 145710, 150943, 155295, 150153, 142449, 150308, 168670, 173710, 176821, 172176, 179994, 185185, 185986]
11059A85986L258J0015K8282J8105L0746M1999P3441J35796K06695K71064K75128
11048A280515J76112P882j24981k12032k27242j95122j37514q1511n6462l7465
11038C92180k9310l1639j1142n513j247j8832q798j5068j7501m336j093q885n383
11025B33433P267m07o777j001p657j3509j1250J408p403o806J378Q229m533M316
11011A96688j329k26P466O740o581k908q802N395J3880q622p559J275R93l95R115
10996B05130l778k2544j0540P374R050l146k804P673P224L73q085j4885j003J5350
10982A85389l148N286N192l581l11k009L967R21o211M482N472J121p966j1538
10968A77066L978J267p903P871J2514p811L891m599j1182o433J6289O266J6860
$$ y = [185986, 189244, 199259, 227541, 245646, 276392, 318391, 391832, 527628, 734323, 1005387, 1280515, 1456627, 1464509, 1339528, 1127496, 900254, 705132, 567618, 486107, 429645, 392180, 362870, 331231, 320089, 314576, 313329, 294497, 285699, 270631, 253130, 248794, 247701, 238816, 233433, 240700, 240293, 233516, 232515, 224858, 211349, 200099, 201507, 194104, 187298, 188676, 196905, 192372, 196688, 195359, 195133, 202599, 209339, 202758, 199850, 191048, 196443, 210323, 201701, 194142, 195417, 196410, 196015, 205130, 201352, 178808, 168268, 175642, 184692, 181546, 178742, 186415, 193639, 194012, 185927, 171042, 170039, 185389, 182241, 187527, 192719, 189138, 188827, 186818, 190785, 191706, 185495, 189977, 195449, 196570, 188604, 177066, 181044, 182311, 174408, 182279, 194793, 186982, 190873, 186274, 175092, 168659, 184948, 191214, 208074]
10955B08074J0824l457p813j2939o763J2681Q223J324J6525K3860L2697K5666
10943C08902N253j4176j7929k2301j5518j9587j1998n013l753n018j0334j618
10931A86910J2343K580j462P661n47k742q50N399N13m732j1127o865J0247J1335
10917B08663o85K427K565N427M576Q039J876r908r541P207J3696J4680J0904R826
10903B69752R466N314J4882J5225k716J6277K6401N6727R4488J61210K72399L91889
10891A331314L73368J35386j54691k98213k99519k12571j39972r2489o8950m3122
10881E30541k8464n1591l0351j9901j8394k4034k3712o897o93j0143j2271j1156
10869B92934p970q54J1982P431Q042P604Q938Q83j0934P178O144k318o897M873
$$ y = [208074, 218898, 215441, 207628, 194689, 187926, 200607, 208830, 210154, 226679, 250539, 283236, 308902, 314155, 299979, 282050, 259749, 244231, 224644, 212646, 207633, 203880, 198862, 188528, 186910, 199253, 201833, 200371, 208032, 207485, 204743, 203893, 209292, 209805, 205073, 193946, 187081, 197328, 208663, 207978, 210405, 212970, 218397, 222973, 231012, 232888, 222980, 213439, 220646, 234342, 249022, 259926, 269752, 279218, 284532, 299414, 314639, 311923, 328200, 354601, 411328, 505816, 667026, 939425, 1331314, 1704682, 1840068, 1685377, 1387164, 1087645, 875074, 735102, 642613, 573663, 530541, 502077, 450486, 420135, 400234, 381840, 357806, 334094, 327197, 326504, 316361, 304090, 292934, 284964, 284110, 296092, 303523, 311565, 319169, 328107, 328990, 318056, 325234, 331378, 329060, 322163, 327036]
10855C27036l343l282j69r918j5377j8669q216j6936k694K99J443j8348l604P392
10841B35614P020J553J9618K1879K5263J5550J2710J5114J0374P73j1614k8670
10829C25184l2000l0485k3313o757P861J2734Q470L807L631O622j44k206n859
10816B67545p211n493l355O832M383J028Q389j026N823Q087K56o497j8399j2504
10802B47858j6946j3493j3743Q006J0924m173L875J2062J1329J6059L8059L7869
10790C37686M6618K7054j5615l6977l2256q840q81q161Q724j366j1811K29L558
10777C07962O193M876j1998p08o468q768N359j348o726J4760K5955K9290L0146
10764C88525L7904L9406L7845J9444N267m359j3111k4017l1966j0413L578J1372
$$ y = [327036, 323693, 320411, 320242, 310324, 294947, 276278, 268062, 251126, 248432, 248731, 250174, 231826, 228222, 235614, 242634, 244187, 263805, 285684, 310947, 326497, 339207, 354321, 364695, 365468, 353854, 325184, 293184, 262699, 239386, 232629, 240490, 253224, 261694, 265501, 269132, 275754, 275610, 273404, 267545, 260334, 254841, 251486, 258318, 262701, 263729, 272118, 271092, 276915, 285002, 285258, 278761, 260362, 247858, 230912, 217419, 203676, 211682, 222606, 218433, 222308, 234370, 245699, 261758, 299817, 337686, 384304, 411358, 395743, 358766, 326510, 317670, 316789, 308628, 317352, 315986, 304175, 304404, 307962, 314155, 319031, 307033, 306325, 299857, 291089, 296448, 295100, 288374, 303134, 329089, 358379, 388525, 426429, 465835, 503680, 523124, 528391, 524032, 510921, 486904, 454938, 444525, 448103, 459475]
10752D59475J4731M161P008P980l773J0L400R059R012J0953M749J4946Q369J4713
10738E64793L2786K0334K96R359J0592J5198R004j1725j1190k5155k3126m027
10726E87139j193j336K833j8185j3879j4430r788K366K60K1129L3712L1782L3320
10713F53730L1709L3843L8952L8480J5324J3202J3184J0673J4074K5351L1238
10702I19760O4083P9525P9342N9199J3764k2555o5336n6585k5576l1213r465R285
10690A014228M742J6375J8254K3466K7802K9318K3887J6847L1103N5531N7000
10679A318553O4215N8107N2768L0457m766k1348k2280p737m525K0304O6443J12853
10667A663044J46145J45751J37748J26824J42586J93341K59349L61852M54663
$$ y = [459475, 474206, 478367, 485375, 493355, 489582, 489592, 492992, 502051, 511063, 522016, 526765, 541711, 550080, 564793, 597579, 617913, 618209, 627568, 638160, 653358, 662362, 650637, 639447, 614292, 591166, 587139, 585946, 584610, 587443, 569258, 555379, 540949, 531161, 533527, 533787, 554916, 588628, 620410, 653730, 685439, 719282, 758234, 796714, 812038, 825240, 838424, 849097, 863171, 888522, 919760, 983843, 1063368, 1142710, 1201909, 1215673, 1193118, 1127782, 1071197, 1045621, 1014408, 1004943, 1014228, 1018970, 1035345, 1053599, 1077065, 1104867, 1134185, 1158072, 1174919, 1206022, 1261553, 1318553, 1382768, 1440875, 1493643, 1524100, 1519334, 1497986, 1475706, 1467969, 1463444, 1483748, 1550191, 1663044, 1809189, 1954940, 2092688, 2219512, 2362098, 2555439, 2814788, 3176640, 3631303]
10658C631303M89875M35530L05215J81433J54563K35037M07210O49609R42677
10649G432452J257180J599383J944934K264677K758265L732324N759446R833809
10641C6582470J7397915K9172163M2715675N1063960M4651144K4342044n236098
10634B40689273k9501854m2437420m0618648l1573565k1728412j4239364r431575
10627E1158435o537801m873334l908577l206614k606098k012120j488414j082519
10619B5442958q15867o48346n83618o01468o57110p45844q11607q54638q44941
10610A8879519q23594p51400o84296n93324n33290m77110m32820m03263l91975
10601A3788447l87028l97660l96495l77649l54125l17570k72832k50404k43561
$$ y = [3631303, 4121178, 4556708, 4861923, 5043356, 5197919, 5432956, 5840166, 6489775, 7432452, 8689632, 10289015, 12233949, 14498626, 17256891, 20989215, 26748661, 36582470, 53980385, 83152548, 125868223, 176932183, 221583327, 245925371, 240689273, 211187419, 168749999, 128131351, 96557786, 74829374, 60590010, 51158435, 44620634, 39747300, 35838723, 32632109, 30026011, 28013891, 26525477, 25442958, 24627091, 23978745, 23395127, 22793659, 22136549, 21390705, 20579098, 19724460, 18879519, 18055925, 17304525, 16620229, 16026905, 15493615, 15016505, 14583685, 14180422, 13788447, 13401419, 13003759, 12607264, 12229615, 11875490, 11557920, 11285088, 11034684, 10791123]
10592A0791123k38630k28891k50295k62419k58004k71846k64695k48604k34383
10583H533356k10689j96982j87235j79182j48244j48542j62173j77786j81529
10574F940994j68805j56439j39205j36574j40252j33876j34830j09330j15590
10565E706093j12073r7571j02573q9112p6235n3245o6501n2354m8022n9290q2405
10554D866712q7091r1092r6254r2969r2704q6995q2324p1388n5921l1451j6152
10543D062371k9160n4546o8039o3306n1071m4865m9223m1246l4226n5591o2738
10532C508360o0701o3169m7796n6019k3982O010J9724K2651N76Q867K1246k882
10520C332885m4344p9281o3522l3043j1133L0015Q0280J20212J38581J25212J02278
$$ y = [10791123, 10552493, 10323602, 10073307, 9810888, 9552884, 9281038, 9016343, 8767739, 8533356, 8322667, 8125685, 7938450, 7759268, 7611024, 7462482, 7300309, 7122523, 6940994, 6772189, 6615750, 6476545, 6339971, 6199719, 6065843, 5931013, 5821683, 5706093, 5594020, 5496449, 5393876, 5304764, 5228529, 5175284, 5108783, 5056429, 5008407, 4949117, 4866712, 4779621, 4688529, 4592275, 4499306, 4406602, 4319607, 4237283, 4165895, 4109974, 4078523, 4062371, 4033211, 3978665, 3910626, 3847320, 3796249, 3751384, 3702161, 3660915, 3626689, 3571098, 3508360, 3447659, 3384490, 3336694, 3280675, 3256693, 3262703, 3282427, 3305078, 3305654, 3314521, 3335767, 3332885, 3288541, 3209260, 3145738, 3112695, 3101562, 3131577, 3211857, 3332069, 3470650, 3595862, 3698140]
10509C698140J17127K17995L56076M95517N65599M42021J49505n7318l6248J13947
10499F062361K84740N02847P73385J050326J390395J783950K166104K365528K538224
10490A8917860L305416N358170R451663J7195370L1877465N4932454P3362056
10483B14400454O0768208J3365611l8055489o0711234n2830534l6233172k3378527
10476G7325317j4918372r547830o408491m775031m021590l550247k970053k288142
10468B8845561j666545j204937q62700o26512n62914o56349p23699o57384n87428
10459B1297093o75696q52891r33001r08140q43989p11995n77691m70806l98855
10450A4924029l74645l72097l78684l87417m18233m40155m13811l81832l25815
$$ y = [3698140, 3815267, 4033262, 4389338, 4884855, 5450454, 5892475, 6041980, 5984662, 5948414, 6062361, 6347101, 6849948, 7623333, 8673659, 10064054, 11848004, 14014108, 16379636, 18917860, 22223276, 27581446, 37033109, 54228479, 86105944, 141038398, 214400454, 275168662, 288534273, 250478784, 189767550, 136937016, 100703844, 77325317, 62406945, 52859115, 46450624, 41675593, 37654003, 34103756, 31133703, 28845561, 27179016, 25974079, 25111379, 24484867, 23921953, 23265604, 22541905, 21884521, 21297093, 20621397, 19768506, 18835505, 17927365, 17083376, 16371381, 15793690, 15322884, 14924029, 14549384, 14177287, 13798603, 13411186, 12992953, 12552798, 12138987, 11757155, 11431340]
10441A1431340k99840k90371k62898k49969k55607k79507k86069k79030k60379
10432H967670k45963k28899k28224k15722k23792k23314j94041j78232j70001
10423G059482j68631j78783j76801j77175j75397j65557j41753j32676j27020
10414E615689j18140j10637j07107j03540j12847j29014j22220j08802r3208o7713
10404D542461o9122q1961p6618q8048r0603r7811r9423j08628j13280r5545r2961
10393C528461q4794o1769n5569p3216q8832q8302o9151n8155m8935l0954m1855
10382B826929o2561o9079q2168r6915q0998n5777o2886n8778m0774m8889m4591
10371B123513n0055m4118m8418m6203m3162k4179j6672m1780n0950n4681n2095
$$ y = [11431340, 11131500, 10841129, 10578231, 10328262, 10072655, 9793148, 9507079, 9228049, 8967670, 8721707, 8492808, 8264584, 8048862, 7825070, 7601756, 7407715, 7229483, 7059482, 6890851, 6712068, 6535267, 6358092, 6182695, 6017138, 5875385, 5742709, 5615689, 5497549, 5386912, 5279805, 5176265, 5063418, 4934404, 4812184, 4703382, 4610174, 4542461, 4473339, 4391378, 4314760, 4226712, 4136109, 4038298, 3938875, 3830247, 3716967, 3621422, 3528461, 3443667, 3381898, 3326329, 3253113, 3164281, 3075979, 3006828, 2948673, 2899738, 2868784, 2826929, 2764368, 2695289, 2613121, 2516206, 2435208, 2379431, 2316545, 2257767, 2216993, 2168104, 2123513, 2073458, 2029340, 1980922, 1934719, 1891557, 1867378, 1850706, 1808926, 1757976, 1703295, 1651200]
10360A651200m8594l5406l0705j9720k0250k6880j6523j8802k9800k6091l7545
10349A340884k7605k9122m9676l4128m6708m4536k6357l0577k5648j2790k6265
10338I87472k9716k2072j9745k9300k5623m9817k7279j9478j1224M504P37m484
10326G53975O21N70M303J3593M250O011j103r785k5753l5206k4811k0494k4252
10313F41919j565j8562j5687j0893j8931j2655j0085j1890j5145j0698n835n425
10301E04548J783j6878j4669J4323J2167J5041J9254L652j6101k3011l2482n8636
10289D08991n4233l7244l8981k4190j4609q905j4088n462L101P622K592N276l243
10276B26627j2673q508p678q49L862k0465k7978j1551k0986k7480n483O396n378
$$ y = [1651200, 1602606, 1567200, 1536495, 1516775, 1496525, 1469645, 1453122, 1434320, 1404520, 1378429, 1340884, 1313279, 1284157, 1234481, 1200353, 1153645, 1109109, 1082752, 1052175, 1026527, 1013737, 987472, 957756, 935684, 915939, 886639, 861016, 811199, 783920, 764442, 753218, 757722, 758459, 753975, 754596, 755166, 759469, 773062, 777312, 783323, 782220, 772435, 746682, 711476, 686665, 666171, 641919, 640354, 621792, 606105, 595212, 576281, 563626, 553541, 541651, 526506, 515808, 509973, 504548, 506331, 489453, 474784, 489107, 501274, 516315, 535569, 539221, 523120, 500109, 467627, 408991, 354758, 317514, 278533, 254343, 239734, 230829, 216741, 211279, 214380, 222002, 224594, 229870, 226627, 213954, 205446, 197768, 196919, 200781, 180316, 152338, 140787, 119801, 92321, 86838, 93234, 87856]
10263H7856j0175J382j182O700n600k018j3351q344j436L291R28O822M491O815
10249G6179O476J0788o114k019Q140m165L815k812j0871p311P447R723O989k138
10235I4127j0564l387m755N839R712J8488J2952J7537K0627J5069K5471P0810
10223B71926J35707K06016K54718K54896J79282L5551j14896k10273k31690j77821
10213F03416j34104j01134o5087m9277l2785j8795j2856j340j4749r421j4978
10202A48890j7065L91p080M479j0399k3457L975P808P419j4965j8802l873O613
10189H3934j490R33O996N551j6124m18J4154j1665j2661l762j3014l3147l8941
10176a9654k7917l620J1085K8248L5024P318J068j794j668O954N85Q605R278k45
$$ y = [87856, 77681, 79063, 77881, 84581, 78981, 76963, 63612, 55268, 53832, 57123, 58051, 64873, 69364, 76179, 82655, 93443, 87329, 85310, 93450, 89285, 93100, 90288, 79417, 72106, 79553, 89276, 96265, 94127, 83563, 80176, 75421, 81260, 90972, 109460, 122412, 139949, 160576, 175645, 201116, 271926, 407633, 613649, 868367, 1123263, 1302545, 1338096, 1223200, 1012927, 781237, 603416, 469312, 368178, 303091, 253814, 221029, 202234, 189378, 188038, 173289, 163868, 148890, 131825, 132216, 125136, 129615, 119216, 95759, 99734, 107542, 114961, 99996, 81194, 77321, 83934, 82444, 83377, 90373, 95924, 79800, 79382, 93536, 81871, 69210, 65448, 52434, 19287, -19654, -47571, -51191, -40106, -11858, 23166, 30484, 31552, 29758, 28090, 35044, 35629, 44234, 53512, 53267]
10162E3267o644J566J885J5031n828j3894k09O938p529n90Q576k602j1707k171
10148C6089J918m773o410O901N882m737K181j1144p787j1272k528K0231j703N068
10134B7916R265l716j872o191O81J231J4117k268o950m107j6717r784M451o605
10120e49n281R883J2695O784j332o053l928j4326j1989J2685j717o251n210L072
10106a1517J4536J3169J6945R22j2292M554J5146O993k570j0460q612l581j690
10093B1543R585Q622O601p745q950j072l68l931J200L886N058J846L379M542J1643
10078E5839J6438K1516L2065L9561O3127J21414K27503L60029L85620K09699q4626
10067A448185k93220l04735k25609j55811j20283p9455n0884l2142j5660j188
$$ y = [53267, 46623, 48189, 50074, 65105, 59277, 45383, 45174, 52112, 44583, 43993, 52569, 49967, 38260, 36089, 38007, 33234, 26824, 33725, 39607, 34870, 37051, 25907, 18120, 6848, 4320, 24551, 22848, 27916, 37181, 33465, 31593, 25402, 26083, 27314, 41431, 39163, 32213, 28106, 11389, 1605, 6056, -549, -5830, 4053, 16748, 23532, 22200, 16147, 12219, -2107, -14096, -1411, -3128, -9379, -14589, -11517, 3019, 16188, 33133, 34055, 21763, 26317, 41463, 48456, 45886, 35426, 26814, 23233, 21543, 31128, 39750, 46351, 38606, 29656, 28584, 28216, 24285, 25485, 29371, 34429, 36275, 39654, 44196, 55839, 72277, 93793, 125858, 165419, 228546, 349960, 577463, 937492, 1323112, 1532811, 1448185, 1154965, 850230, 624621, 468810, 348527, 269072, 218188, 186046, 170386, 169198]
10057A69198l51j7807j5001n18K314q024p040p160n957p143j4167j1651m549o447
10043F5697j6938k193M910k899j0979r369L151J2063M650R234K0137M52L278L912
10029H5106q711k301N083J763l131j6597j9546n322k3532j6743j926O878J3612
10016A4633M350n042q829j7660N70Q59j162J711P338k644j576J2837k178k3854
10002b0647l730L912J7051r51O688Q70p582j4042R54J2726P796m332K854n383
9988c816n845J999L086j455l314m55M721O80q296j3872P098L649O157m776l596
9973a8035N931N374J708l652k969n823Q801K093p681m884R062k542j044p618j6291
9958c7570q31o549O173P857J1306n300q98Q267k105J1641k217j0154M871L010
$$ y = [169198, 168847, 151040, 136039, 135521, 137835, 129811, 122771, 115611, 109654, 102511, 88344, 76693, 72144, 65697, 48759, 46566, 51476, 48577, 37598, 28229, 31380, 43443, 48093, 57327, 77464, 77916, 81194, 85106, 76395, 74094, 79177, 80940, 77809, 61212, 41666, 36344, 12812, -3931, -5857, 1021, 14633, 18983, 13941, 5112, -12548, -11978, -11119, -12281, -10570, -3232, -5876, -7452, 5385, 3207, -20647, -24377, -20465, -3414, -4365, 2323, 3193, -4389, -18431, -17477, -4751, 3045, -1287, 1567, -3816, -9661, -7662, -4576, -6031, -9345, -9800, -5079, -4399, -12695, -26567, -19469, -15820, -9663, -14439, -18035, -12104, -6730, -5022, -8674, -11643, -17466, -8665, -6572, -14253, -19137, -10075, -12617, -13661, -21279, -37570, -38401, -44950, -38777, -30920, -19614, -24914, -25812, -17545, -19650, -8009, -10226, -20380, -15509, -12499]
9944a2499K175j4835r764O699Q10O244N962l783l873j0262j49j185j2462M246
9930d2676O639J0967R566O452j588j6156j2680N120J2257K473o373j1248k049
9917c9296j751m160J0781K318J0436M97o900K931J0554k509n520n108n86l352
9903c1665K252k809n862o532O510P931q16L052K777j86j575J0060M570l524k841
9888a8658R207J1215L874j863n437L113j2191j6879p264J2268Q81L379J877M994
9874a1484n605n075r76M969J0971L96n328p481K444j059m695N489j3026j739l087
9859c5286j830J1418P801j615M497O632p34j1254p472K926J62k374j2914l007
9845d3050L115Q474N573k080J1331L821J695N127N220K154r907j1358N118p714
$$ y = [-12499, -10324, -25159, -34923, -28224, -27414, -21170, -15208, -18991, -22864, -33126, -33275, -34460, -46922, -42676, -36037, -25070, -15504, -9052, -10640, -26796, -39476, -34356, -22099, -19626, -25999, -37247, -39296, -41047, -45207, -34426, -32108, -21672, -21175, -28075, -25144, -14590, -17099, -22619, -27727, -28313, -31665, -29413, -32222, -38084, -44616, -38106, -30175, -30991, -27939, -25162, -25348, -26923, -16863, -12293, -15817, -18658, -9451, 1764, 5638, 3775, -1662, 1451, -10740, -27619, -34883, -22615, -21734, -18355, -16478, -11484, -17089, -22164, -23140, -18171, -7200, -6804, -12132, -19613, -17169, -18228, -22923, -17434, -30460, -32199, -35286, -37116, -25698, -17897, -19512, -15015, -8383, -9117, -20371, -27843, -24917, -24755, -27129, -40043, -43050, -39935, -31461, -25888, -27968, -16637, -12816, -11121, -5994, -774, 1380, -8527, -19885, -14767, -22481]
9831b2481o582o087o91N735J24J0419J1438j405N662K416l668p378J951j1086
9817b1633k420M800Q674o040L784o770L802K802L705O532O241r372M009J561l798
9802d123q1p885J2441M05p178q944q780l53N358J991J945N623J2161k3j5617j0274
9786b3334k99J4253K331p750o474J0283K237L386N106L734N623k298r808O029
9772C019J570j7376l597L234K936Q66K824l176j1584l306J46J081n95M740K52
9757a8966j239o692Q738J0966p155r691j2475O783o268p51P294J1537k3336o788
9743d8043O824M294j0373N039K0926N028M236m55m533m651J069m884n660J8783
9729a2400P151j4936j2831J3300J1174Q486N949l252p839o878p36m574n868m182
$$ y = [-22481, -29063, -35150, -35841, -30106, -29982, -19563, -8125, -9530, -3868, -1452, -5120, -12498, -10547, -21633, -24053, -19253, -10579, -16619, -12835, -19605, -15803, -13001, -9296, -2764, 3477, -5895, -1886, -325, -4123, -4204, -12089, 352, 757, -6421, -15365, -24145, -24498, -19140, -17149, -15204, -9581, 2580, 2557, -13060, -23334, -23633, -9380, -7049, -14799, -21273, -10990, -8753, -5367, -261, 3473, 9096, 6798, -3010, 3019, 4589, -12787, -16384, -13150, -10214, -9348, -6524, -9700, -21284, -24590, -24444, -23363, -23958, -19218, -18966, -20205, -26897, -18159, -7193, -14348, -24039, -36514, -29731, -35999, -36750, -29456, -17919, -41255, -48043, -41219, -36925, -47298, -42259, -21333, -16305, -12069, -12524, -17057, -21708, -20639, -25523, -31183, -12400, -5249, -20185, -33016, -19716, -8542, -56, 5893, 2641, -5198, -12076, -12812, -17386, -23254, -27436]
9715b7436R624m724N944J7282m42M486k142l55o303o136L614m6o505L076P594
9700b469l747J0922M829r084j0084k798j071J1591Q57l164j6092j953P647P058
9686g558Q522n274j3109R15j902M194J64q797J5628O165m261L75q661L219K540
9671g840m467k951l464P594Q759n121l091K964J953J324L677k712K011m991l066
9656i421j0455M606N754q41L345K110o215p859r182n089L0P674q843L195J6161
9641a5030Q363L339l191j5232p486J3888P638p074J158K562k890L83k623n525
9627b1720j0981N402N182R743J628K990Q56P003q151p672L876M151L756j292o928
9612a2157r15N287j317k641m072Q097J4503Q057k1907q304l749m751J3971L595
$$ y = [-27436, -17812, -22536, -16592, 690, 248, 4734, 2592, 2237, -4066, -10202, -6588, -6634, -13139, -10063, -2469, -6216, 4706, 9535, 451, -9633, -12431, -13502, -1911, -1054, -4218, -20310, -22263, -14616, -7558, 964, -4310, -17419, -16504, -18406, -14212, -14048, -22845, -7217, -1052, -5313, -4938, -13599, -10380, -7840, -12307, -15258, -18722, -11128, -2369, -7490, -10581, -7617, -5664, -4340, -663, -3375, -1364, -6355, -9421, -19876, -15270, -9516, -10357, -7012, -4902, -11117, -18976, -28158, -33247, -33217, -25543, -34386, -31191, -15030, -6667, -3328, -6519, -21751, -29237, -15349, -7711, -14785, -13627, -11065, -13955, -13572, -16195, -21720, -32701, -27299, -22117, -12374, -10746, -7756, -6900, 103, -8048, -15720, -11844, -7693, -3937, -5229, -12157, -13072, -7785, -9102, -11743, -15815, -7718, 6785, 14842, -7065, -15369, -19118, -23869, -9898, -6303]
9598f303N616J617J145n241j3914O065n393n362r773o67J0426J0471k552r90N27
9583a4328q831l228J040J276J288J3426L499J01P295J739o133o505J0923l33j5019
9568a3790n818P717J8356j350P689n567q741r113l75j014P720K092j0059p76k546
9553a5575N845k207J89J1090R21q234P694J713J00r641o685l754k653j350O075
9538a6472P17P379j3107K270j595l741o524j662Q311J1066M054J3231L199j0804
9524c678r466J70M869P687O488j4557p623l086J3149j937k494J1046j6207L115
9510a2524J8831j528L051J432n662o740P611M730r486p151o63J7615K023r072
9496B467j1600j5969l273J0491R468N466R869r995n943M060k319P349J122n961
$$ y = [-6303, -687, 930, 2075, -3166, -17080, -11015, -16408, -21770, -31543, -32210, -21784, -11313, -13865, -14855, -14328, -23159, -26387, -25347, -24071, -22783, -9357, -5858, -5757, 1538, 3277, -2856, -9361, 1562, 1229, -13790, -19608, -11891, 6465, 5115, 12804, 7237, -1504, -10617, -10992, -12006, -4286, -2194, -12253, -13029, -15575, -9730, -11937, -11748, -658, 263, -7971, -277, 1436, 1536, -8105, -14790, -18544, -21197, -22547, -16472, -15755, -8376, -21483, -19213, -20808, -24549, -31073, -32735, -24424, -13358, -9304, 3927, 7126, -3678, -13144, -12974, -8105, -418, 6070, -8487, -16110, -19196, -6047, -7984, -10478, 568, -15639, -12524, 6307, 4779, 7830, 9262, 3600, -3140, 4471, 9201, -285, -7436, -8099, 9516, 11539, 2467, -9133, -25102, -28375, -17884, -8416, -2950, 6919, -3076, -9019, -4959, -7278, 71, 1193, -4768]
9482d768o30k561J967R965M059r049j5052J677R31q884l16P636m553M243l013
9467a8348R751M596J881O05p717j7960J151L067l279N616N275q01J280M642k735
9452a2976o384J1272n312k722R856J3483m103q459k635j373m434M058O787m99
9438c441K141N97J046J3779j780l217k849L614L407R78j509l162J0320k550j3190
9423D184m416j4156j1184J5318k870k726R042K628j0824O349P100K287N697P306
9409A3735n595j6983p073J063m672Q072J42P632K657N542N939q336j6259J87J44
9394a3805o983M899J2988J8633m134o042K80O965P051k40K944n208o588R03K42
9379A1905Q511j4420j0703J123L360J180p916j417q142J625j577L676O961K832
$$ y = [-4768, -5398, -7959, -5992, 3973, 8032, -1017, -16069, -14392, -13461, -22345, -22661, -15025, -19578, -15335, -18348, -8597, -4001, -2120, -1515, -9232, -27192, -26041, -22974, -26253, -20637, -15362, -16163, -14883, -10241, -12976, -19360, -8088, -13400, -16122, -6266, 7217, 3114, -5345, -7980, -9353, -13787, -9729, -2942, -3441, -1300, -703, 343, 14122, 12342, 9125, 6276, 9890, 13297, 14275, 12766, 9604, 19924, 17374, 4184, -232, -14388, -25572, -10254, -13124, -15850, -6808, -4180, -15004, -8655, -1555, 732, 6429, 13735, 8140, -8843, -15916, -14853, -19525, -11453, -11311, -3679, -1022, 4520, 10459, 2123, -14136, -13949, -13805, -20788, -15889, -2901, 15732, 11598, 5556, 5836, 12801, 19852, 19612, 22556, 17348, 10760, 11663, 11905, 20416, 5996, -4707, -3584, -224, 956, -6960, -8377, -16519, -14894, -16471, -12795, -5834, -3002]
9365c002M422J4306K650r98L461m35P22n289M470J4037j892j2107k0241L641J4590
9350A8335R315j129m253N334J08j716m100J732n181k135N720j894j257L920P947
9335C0746O567q589j0889L747K928j0454J1336J1747k344j6516k955J5798R224
9322D0346q149k725n98j557n473K840J6097N272N010k462l86m933J431l41N200
9307D9572N052m80j0926P879J7564J468j55L548N557k251P728o380l283M87R556
9292H4936O281N446N458Q089J3060R9N787k385J4547J2615Q795J0821N21L365
9278A77435J7222K3320J7350J2649J8750L0602J5094M605K2684L1568K9217L1884
9266D32380M2764M0257M0414N4993O2581P0235P0312P2575Q1768P5400O0438P4474
$$ y = [-3002, 1420, 15726, 18376, 17378, 20839, 20404, 21126, 15837, 20307, 34344, 32452, 20345, 104, 3745, 18335, 27650, 26521, 22268, 27602, 27710, 25994, 21894, 23626, 18445, 16310, 22030, 20136, 18879, 22799, 30746, 37313, 28724, 17835, 21582, 24510, 14056, 25392, 37139, 34795, 18279, 15324, 31122, 40346, 32197, 29472, 28874, 27317, 21844, 24684, 40781, 46053, 51063, 48601, 48215, 43282, 44713, 44372, 49572, 54624, 54144, 43218, 51097, 68661, 70129, 69974, 73522, 79079, 76828, 84556, 78176, 74893, 75380, 84936, 91217, 96663, 102121, 110210, 123270, 123369, 129156, 126771, 141318, 153933, 162728, 173549, 174070, 177435, 194657, 217977, 235327, 247976, 266726, 297328, 312422, 317027, 339711, 371279, 400496, 432380, 475144, 515401, 555815, 610808, 673389, 743624, 813936, 886511, 968279, 1043679, 1104117, 1178591]
9254A178591O7587L5953J5930K929n222l0071m5816o4480o6202o7781n9463o1871
9242I00084n7711n0334n7766n1259l8876l1158l5033k8900k6555k5895k3519k1083
9230D51995j9142j5963k0395j6396j198n288k0575k9222j3269j6512j3331L068
9218B83772r093j2040q021k932M33j7010j1618R037p936q889n30n354q875Q4k2952
9203A78076j5293O48L866N705j0081o462j889O816K374j946q950r913n378q650
9189A28923j2529j3023J05N49L853M147J09j003J440o494o186r790k286J924O641
9174I6380p476j4722j3291Q687P931J29o855m320p849J906l76j429O633j174R55
9159F5129n384n439n226L842J3N740n258r972p236R686J9320j0606j9473N407
$$ y = [1178591, 1246178, 1282131, 1298061, 1300990, 1295768, 1265697, 1219881, 1155401, 1089199, 1021418, 961955, 900084, 842373, 792039, 734273, 683014, 644138, 612980, 577947, 549047, 522492, 496597, 473078, 451995, 432853, 416890, 396495, 380099, 378901, 373613, 353038, 323816, 310547, 294035, 280704, 283772, 274679, 262639, 254618, 251686, 252119, 235109, 223491, 232528, 224592, 215703, 215173, 209819, 200944, 201028, 178076, 162783, 163431, 167297, 173002, 162921, 156459, 154570, 161386, 163760, 161814, 152864, 142951, 137573, 128923, 116394, 103371, 103476, 104025, 107878, 112025, 112134, 111131, 112571, 106077, 99891, 90101, 87815, 89739, 96380, 88904, 74182, 60891, 69578, 77509, 77638, 70783, 66463, 58614, 60520, 60144, 58715, 65348, 64174, 65129, 59745, 54306, 49080, 52922, 52935, 58675, 53417, 43445, 36209, 45895, 65215, 54609, 35136, 40543]
9145D0543L880L892q590j59l252O46M042r235j2448P205J65j1730p162J477J287
9130A0561J124n076L966J1018J2231J8019L94j2760K970r103r868k232J258N939
9116B8441j18K97q161j5818m942L443L434q73R630p132L236L998q719j2590m623
9101a0497J6870N963k280p143M513P829J3840m537J894P020K12j2541j0720j2250
9087a827o524J5278K8764o979l130m338j3037J252J0871j229j8010j0576j898
9074a1383N404R241n53P41p211M609J5790J3415l392o654m089L77M351j8040j9912
9059a7306m488j658Q044R517Q690P741J2863j1758p492N251R081p787j3689O936
9045C945m714n361j2520m182l521K727L769n61M66j5941L080k576J9264J0705
$$ y = [40543, 44423, 48315, 39725, 39566, 36314, 36960, 41002, 31767, 19319, 26524, 26689, 14959, 7797, 9274, 10561, 11685, 6609, 10575, 21593, 33824, 51843, 52237, 39477, 42447, 33344, 23476, 21244, 22502, 28441, 28323, 28620, 20459, 4641, -301, 3142, 6576, 5703, 15333, 8201, 11437, 15435, 6716, -5874, -10497, 6373, 12336, 10056, 2913, 7426, 15255, 29095, 24558, 26452, 33472, 33684, 21143, 10423, -1827, -8351, 6927, 35691, 28712, 25582, 21244, 8207, 9459, 20330, 19101, 1091, -9485, -11383, -5979, 3262, 2709, 3450, -3761, 848, 16638, 30053, 26661, 20007, 15918, 16295, 20646, 2606, -17306, -21794, -23452, -15408, -5891, 2799, 10540, 23403, 11645, 4153, 9404, 18485, 10698, -2991, 3945, -769, -6130, -18650, -22832, -26353, -23626, -19857, -20418, -19952, -35893, -32813, -35389, -16125, -5420]
9031e420m176Q388J0161P620J0010j3266l744p57l436j1010m466K333P872P532
9017G641J375k2282o520K1287J0538J7837J0007n326j5063p666j1852r528L037
9004f515l309M241K424l776m220j249k331M138Q480K749j5501L448J9690K969
8990A1238n90k248M46m865J159Q480J0425j5477K55R23k744m471p57m885Q91L281
8974A061j3795k119J3410J5616j785O705L1677L6647M9285j682m1069l2492j9168
8961D2291k857j0068r336q158j102J8126N994j70q507j1146q12N626q18o101p158
8946E804j226J0341K5787L061j7207o342J702N312n931m216p056Q575O495J4508
8932C9607j4382l663j0200o460M521N576P362p875o821J745L076R229N165j421
$$ y = [-5420, -9596, -1208, 8953, 16573, 26583, 13317, 9573, 8816, 5380, -5630, -10096, -7763, 109, 7641, 9016, -13266, -19786, 1501, 12039, 29876, 39883, 34557, 19494, 11828, -24, -9552, -6515, -9824, -5583, -3159, -6935, -11155, -12404, -14735, -10597, -2117, 632, -14869, -11421, 8269, 11238, 10648, 8400, 8846, 3981, 5140, 13620, 24045, 8568, 8823, 9746, 7002, 2531, 1774, -3111, -2220, 1061, -12734, -14853, -1443, 14173, 12388, 19093, 50770, 87417, 136702, 135020, 93951, 61459, 42291, 39434, 29366, 20030, 11872, 10770, 28896, 34890, 34720, 26213, 15067, 14255, 19881, 19063, 12962, 5804, 4578, 14919, 40706, 43767, 26560, 20218, 21920, 27232, 21301, 17085, 10029, 18604, 25099, 39607, 25225, 21562, 11362, 4902, 9423, 14999, 22361, 14486, 7665, 9410, 12486, 21715, 26880, 25459]
8918B5459k1559j756Q819K8Q946K410j2835m931N777K194Q226n938N40J24O031
8903B1535k890j3499N73N156N435o989j4355j5429l457L860J4970O844l038m121
8889e405J455o65M124L007J2687M478K582o642j1461n721j0379j352L094N893
8875d305J7758K1949l382j9482N028P212p105n311l176n077l972j39J233n81j0499
8860i849M233L694k817P265q35J1167P134j4112n681P270Q917L324q918o997J196
8845D991J4291Q518j8748j2539J500L683o582j684l565O014K334P864M720Q020
8831A8817j959j1996r303j955k204R289l7l839P568l417O380J1771k546l104J281
8816A4746J925P750k535j2177m693M499k512n720P661O418L778j4879j7813J4552
$$ y = [25459, 3900, 2144, 10963, 10991, 19937, 22347, 9512, 4581, 10358, 12552, 20778, 14840, 15380, 15504, 21535, 18645, 5146, 5719, 10875, 16310, 9321, -5034, -20463, -23920, -20060, -5090, 1754, -1284, -5405, -3950, -4615, -491, 2516, 15203, 19681, 22263, 15621, 4160, -1561, -11940, -13292, -10198, -4305, 13453, 35402, 32020, 12538, 17566, 24778, 17673, 12362, 9186, 4109, 137, -2, 1231, 650, -9849, -5616, -1922, -4739, 2526, 1691, 12858, 19992, 5880, 199, 7469, 16386, 19710, 10792, 3795, 4991, 19282, 27800, 9052, -3487, -1987, 1696, -4886, -6570, -10135, -4121, -1787, 6077, 10797, 18817, 16858, 4862, -4441, -6396, -8600, 689, 652, -3187, 4381, 964, 7344, 19115, 16569, 13465, 14746, 16671, 24421, 21886, 9709, 5016, 9515, 7003, 1283, 8944, 15362, 19140, 4261, -13552, 1000]
8802A000J0364O0n271J1620k374L120l383m574K191J036k51Q038n20j0643j87
8787A0226m290P725k121r507O405j1294j1379J3756J8431l019p477K762J2488
8774B2706M116k123P624j7962n130J2820P937O60o722p911M510K045m194j0955
8760G421j064J403Q784N438Q052L960k820j7864l500Q97J0306J1362K609l204
8746C1780k08L012J768j293R46n410L135o931q794k709j2255M384Q157N35Q217
8731B4334J109m83J0836K335o229l276n993m174N549J3525O492M147n245Q69n338
8716C8458P73N530p091M21q869O387J8008r24O892O313n491j7470m858o785l124
8701B8170p361k168K1450Q870J855r409J147k450j45j750p674j918J5828O760
$$ y = [1000, 11364, 11424, 6153, 17773, 15399, 18519, 15136, 10562, 12753, 13789, 13538, 21576, 21056, 10413, 10226, 5936, 13661, 11540, 2033, 8438, -2856, -14235, -479, 17952, 14933, 7456, 10218, 22706, 26822, 24699, 32323, 14361, 9231, 22051, 29988, 30648, 23926, 16015, 20525, 22570, 18376, 7421, 6357, 7760, 16544, 21982, 30034, 33994, 31174, 13310, 9810, 10707, 21013, 32375, 34984, 31780, 31572, 34584, 36352, 35059, 36005, 30595, 33730, 26799, 18005, 15296, 3041, 7425, 15582, 16117, 24334, 25443, 24960, 35796, 38131, 31902, 28626, 22633, 18459, 24008, 37533, 44025, 48172, 42927, 43796, 38458, 39231, 44761, 37670, 38091, 29222, 35609, 53617, 52693, 59585, 65898, 60407, 42937, 38079, 31294, 28170, 20809, 18641, 40091, 48961, 50816, 41407, 42554, 40104, 39959, 38209, 30535, 28617, 44445, 51205]
8687E1205P497O291N944N044J825n54J0772M221m576m145O832K984K145j420M703
8672I8768R900j651n404N606K123j2437k4493j4048J922J2892J1316o826p189
8659G0479o196P06l164J5N189k404L754L434J2319j960j676J514q70m851Q493
8644H4782M500N053J0883Q460Q07j472l505O362q73l25r767j0821L116n403m31
8629I1366J4093P892j640n643J105m69m922k237J010j159L736r198k388j088P851
8614I8309J2342L995K122o00m589P328R529M902R039J0969o395O59P10k762N4
8599A45612K628n5K434J325o463r597m512M894l802n529n226J7475J8175J0362
8585A67721j304j6212J652J5094k795j9947k1012L600J4830J3243r835j2740k0258
$$ y = [51205, 58702, 64993, 70937, 75981, 77806, 77252, 88024, 92245, 87669, 83524, 90356, 93340, 95485, 94065, 98768, 108668, 107017, 101613, 107219, 109342, 96905, 72412, 58364, 60286, 73178, 84494, 77668, 70479, 64283, 64989, 61825, 61840, 67029, 64625, 68379, 71813, 84132, 82172, 80496, 82010, 81140, 76289, 84782, 89282, 94335, 105218, 113678, 114485, 113013, 109508, 115870, 114997, 114672, 104905, 94084, 97200, 91797, 91366, 105459, 113351, 111711, 106068, 107173, 106704, 101782, 99545, 100555, 99396, 103132, 93934, 91546, 90458, 98309, 110651, 114646, 116768, 116168, 111579, 118907, 128436, 133338, 142377, 153346, 146951, 147610, 148320, 145558, 145612, 148240, 148185, 150619, 151944, 145481, 135884, 131372, 136266, 132464, 126935, 121709, 139184, 157359, 167721, 166417, 150205, 151857, 166951, 164156, 144209, 123197, 126797, 141627, 154870, 145035, 132295, 112037]
8572A12037j3815L346j717j693n379P011Q507q175j2573K670J559O419n129j3292
8558G9776r623p202r20R971O337p333R326K558j7054m778j3842n96K212j021J7648
8543F5459Q082j540o417k197Q234p06M36m872n40J5965P185n029k141q426r59
8528G2534o46Q336L476P823o234o217j1590j074j9052k3529l757l16L835N357
8514B8946J7085j023Q86k117l969n956j745N976o326L611J2756r581j177K238
8500C9604L66M212J208q641j0863K701k406r572M824J1700j1619l253J3363K648
8486C4272J3341J3298o15L019J9295O672j1928j6418p513p98j0285p321P455O639
8472D9113j2534j2205J697L169J923p03j891J0032J750n54k249j727N171M431
$$ y = [112037, 98222, 101568, 99851, 98158, 92779, 99790, 108297, 100122, 87549, 90219, 91778, 98197, 93068, 79776, 70153, 62951, 62031, 72002, 78339, 71006, 80332, 82890, 65836, 61058, 47216, 46620, 48832, 47811, 65459, 73541, 72001, 65584, 63387, 71621, 70915, 71351, 66479, 65939, 81904, 89089, 84060, 81919, 73493, 72534, 71888, 80224, 83700, 91523, 85289, 79072, 67482, 66408, 47356, 23827, 20070, 19754, 23589, 28946, 46031, 45008, 45894, 43777, 39808, 33852, 32107, 38083, 31757, 35368, 48124, 38543, 37366, 39604, 39970, 44182, 45390, 36749, 25886, 28587, 26181, 16609, 21433, 33133, 21514, 18261, 31624, 34272, 47613, 60911, 60296, 63315, 82610, 89282, 77354, 60936, 53423, 52625, 42340, 35019, 42474, 49113, 36579, 24374, 26071, 29240, 31163, 30460, 28569, 38601, 40351, 39797, 37548, 35821, 40992, 45423]
8458D5423q331k382p546O254j227p698j0774n022K478L71L643j217J4879M203
8444C3054j0378n904L718K901o49L941K622M808J1736J0353M203m573j995q67
8430E2970j6532m167J0000m584m053K873M706p519J1634J0819L863l030l469J804
8416E5315q19j0686m947o417r759q1M97j2823N96J615J2288J0346P115r16m35
8401D0889j7008l590K846L162k130j4989o875K2907M446N550J456K221m299q128
8387B6458r695N292r59l258L09p403k274k479Q999J2599L74L32n844k913M828
8372B4366k399O8J9288O22q817j9353M059J3104m18J0863J9499K421j4413j0542
8358C8348j3859j305J2318j0849l215P933m45j7849j4002K292m236J4847J858
$$ y = [45423, 37092, 34710, 27164, 33418, 32191, 24493, 13719, 8697, 11175, 11546, 15189, 13972, 28851, 33054, 22676, 16772, 20490, 23391, 22742, 26683, 29305, 34113, 45849, 56202, 60405, 55832, 53837, 52970, 36438, 32271, 42271, 37687, 33634, 36507, 41213, 33694, 45328, 56147, 60010, 56980, 53511, 55315, 54496, 43810, 38863, 32446, 22687, 22606, 23103, 10280, 10876, 12491, 24779, 35125, 42240, 41324, 40889, 23881, 20291, 23137, 26299, 24169, 9180, 2305, 25212, 29658, 35208, 36664, 38885, 34586, 26458, 16763, 22055, 21096, 17838, 18147, 10744, 8470, 5991, 14990, 27589, 27963, 28295, 22451, 19538, 24366, 21967, 22035, 41323, 41945, 33128, 13775, 17834, 30938, 30520, 41383, 60882, 63303, 48890, 38348, 24489, 23184, 35502, 24653, 21438, 29371, 28926, 11077, -2925, -633, -4869, 9978, 11836]
8345A1836m834j514p617n813r223O254J0403L057m466J940j666Q209O73K62N146
8330A2647J1992R742p596q432J403P606R16l069k877N625Q639J555n648j1717
8316B0786n582J70j3720q170k836o359J0799K158j977%j987O292J3205J654M722
8301A9155l954k1079j3322P168R017m391o371N473J5828J2408r702p918P800N28
8287A0640q199k478o714K968p36o747J4340J4582k077j702p041L235M142k060
8273A2153q401j6217j086R220J767j0600q745m07n932O597J0006k836N73J7514
8259C606O338p781k517J2003N401N274o5m831m895q285q28k040m198k134O527
8244A575J989l135j0260P027J8694M772J566j094o975m407O170J107j1283n820
$$ y = [11836, 7002, 5488, -2129, -7942, -17165, -10911, -508, 2549, -1917, 23, -1643, 6566, 7239, 7501, 12647, 24639, 34381, 26785, 18353, 19756, 27362, 28278, 25209, 22332, 27957, 36596, 38151, 32503, 20786, 15204, 15374, 1654, -6516, -9352, -15711, -4912, -2754, -4731, -4731, -6718, -426, 12779, 14433, 19155, 15201, -5878, -19200, -12032, -3015, -7406, -13777, -8304, 7524, 19932, 10230, 2312, 10112, 10640, 2441, -37, -6751, -3783, -4519, -11266, 3074, 17656, 15579, 13877, 6836, 10071, 14213, 12153, 3752, -12465, -13551, -4331, -2564, -13164, -21909, -22316, -28248, -21651, -11645, -14481, -13908, 3606, 9944, 2163, -354, 11649, 17050, 22324, 22259, 17428, 12533, 4248, 3420, 1380, -2818, -4952, 1575, 3564, 429, -9831, -2804, 15890, 20662, 22228, 21134, 14159, 9752, 15922, 17029, 5746, -74]
8230g4k049j278j171N804L264J180n725R60P840L058l522j4025j0801r086R847
8215a5778J2705J6040J0146Q161k774P60n365p146p133o016P826r447J654k008
8201A625Q880j929j800m284q073M6J0761j332j7581R991q921n254N259J2276Q498
8186H162J0071p097j1409q406j068J5592m820j1198p107J53M813O624O303q244
8172g631j519L655J0689P579n075j380J3213J815l728l73L862N956m330j2311
8158A0422O931M609k963r994o121j733j4l426k3724J042J6302J0822k454l186
8144c487O943j0890m929J1074J0212l137n536K380J254P53J537P386p409q426
8130b275k488r340k462r77o722J2438O069j369Q317J0971L012p747r275K326J2802
$$ y = [-74, -2123, -3401, -4572, 1232, 4496, 5676, -49, 911, 8751, 11809, 8287, -5738, -16539, -25625, -15778, -3073, 12967, 23113, 31274, 28500, 29260, 23895, 16749, 9616, 3600, 11426, 1979, 3633, 1625, 10505, 8576, 6776, 2492, -5581, -5535, 5226, 3894, -13687, -3696, -12617, -17871, -12612, -336, 8162, 18233, 11136, -273, -8679, -9747, 5845, 1025, -10173, -17280, -17127, -12314, -5690, 613, -7631, -9150, -5495, 5194, 12773, 7698, 6318, 19531, 21346, 17618, 17245, 21107, 27063, 22733, 10422, 17353, 21962, 18999, 9005, 2884, 1151, 1137, -2289, -26013, -24971, -8669, 2153, -301, -3487, 3456, -7434, -12363, -1289, 8923, 5786, 250, 2630, 3884, 4637, 6174, 13560, 6151, -2275, -4763, -14103, -16565, -17542, -24264, -11826, -5757, -7126, 1191, 12162, 15174, 7427, -1848, 478, 13280]
8115A3280p352m573J0717M244K492M684n038o3P71m630l080j5950K358k369N145
8100F36M413j3586L433Q960P436L218r399k227O382M71J2676K987o808o572J2426
8085B4446J3894k841o036r629k791n470j995J3726J6503m368r739j0313L933L564
8071B2884j1094j0590j7262R25Q771J0628K194J8849J0293l615o662n678q644
8058A0999k241K510j95N656J0367O847L884k166M047k456j175m073j12J1143P00
8043D3735L3j8914j3460N249n447l562K1754J8945J1933L534P702J8637J2753
8030A02892J1847J0127J1985J7113P205L571N261m847r097L554J1339n481N484
8017A70953l49j0750p968j1096j1172j2824j516m119n29J385j237R924M646j0281
$$ y = [13280, 5928, 1355, 12072, 16316, 18808, 23492, 18454, 18391, 19162, 14532, 11452, -4498, -2140, -4509, 636, 5049, -8537, -5104, 3856, 11292, 14510, 5111, 2884, 9266, 9737, 22413, 25400, 18592, 12020, 24446, 38340, 35499, 29463, 19834, 17043, 11573, 9578, 23304, 39807, 35439, 25700, 15387, 19320, 22884, 11790, 1200, -16062, -15137, -6366, 4262, 6456, 25305, 35598, 31983, 25321, 19643, 10999, 8758, 11268, 11073, 16729, 27096, 33943, 37827, 35661, 39708, 37252, 36077, 32004, 31892, 43035, 43735, 43768, 24854, 11394, 16643, 11196, 7634, 29388, 48333, 60266, 63800, 71502, 90139, 102892, 114739, 124866, 136851, 153964, 161169, 164740, 170001, 165154, 156057, 159611, 170950, 165469, 170953, 170604, 159854, 151886, 140790, 129618, 116794, 115278, 111159, 110630, 112015, 110778, 120702, 125348, 115067]
8003A15067j0856K234L301M760J7927M723P320K74Q0k071O288L3618J6295J3201
7989B12161P758L6955O5208Q5074O9781L1624l0750o9709o4436k0777O461L4498
7977C63848O4567R6531J20856J00146Q42j10193j38617r9777p3403n0007k2655
7966B52138k8448k0313j8009j4391o134N321L836J0941O426p272m016O415n632
7953A80862j626m338J5267J7521J1735J0793R535J0572L4219O1278N1819P7726
7941D75363J34331K14131J91267O3772j05608j59910o8638K4836O9540O0040j8088
7930H81036j03803j33133j14425r0857n4051m1704l8416q946j0049l3861k3962
7919B27829K916j2124j4768j6440j7117m671K165N791r421j6645j412R967P479
$$ y = [115067, 104211, 106445, 109746, 114506, 132433, 137156, 144476, 144750, 144830, 142759, 149047, 182665, 198960, 212161, 219919, 256874, 322082, 407156, 476937, 508561, 477811, 408102, 343666, 322889, 329350, 363848, 428415, 524946, 645802, 745948, 746790, 636597, 497980, 398203, 324800, 274793, 252138, 223690, 203377, 185368, 170977, 164843, 170164, 174000, 184941, 191367, 184095, 180079, 186494, 180862, 179236, 174898, 190165, 207686, 219421, 230214, 239749, 250321, 284540, 345818, 397637, 475363, 609694, 823825, 1015092, 1078864, 973256, 813346, 744708, 769544, 839084, 899124, 881036, 777233, 644100, 529675, 438818, 384767, 343063, 304647, 295701, 285652, 251791, 227829, 230745, 218621, 203853, 187413, 170296, 165625, 167790, 173581, 164160, 147515, 146103, 156070, 163549]
7906A63549q304n14R247J0885J4289J1108N605K951l339p222j5697P30N847J6050
7892B05185K3183L5511L0158k790k0062j1410k4273k9975j6723j2865j1387j7086
7880A47466j4982j3902k0686j3107k690n528n985k419k422Q67J3093J06j913k817
7866G5081j6359J116P109J658p841j2261Q156l621k52k965K493J943K734j7069
7852C9922l3751M501J4922J4106Q507j876m432P457m980n802r646Q389K815l645
7838C6487J1014J5471k695o135o26j2773j8814M22O640m788p581J2690Q036j852
7824C5496J493q672p920l950j750j0633q418M287J4616Q628k052R730j104Q99
7810C0650j643K067p429j5007j0809m978P140Q784j12r048q913j0673q978M561
$$ y = [163549, 155245, 154731, 163978, 174863, 189152, 200260, 205865, 208816, 205477, 198255, 182558, 183288, 189135, 205185, 228368, 263879, 294037, 291247, 271185, 259775, 235502, 205527, 188804, 175939, 164552, 147466, 132484, 118582, 97896, 84789, 82099, 76571, 70586, 68167, 65745, 66612, 79705, 79811, 77898, 75081, 58722, 59838, 66947, 68605, 60764, 48503, 56659, 53038, 52786, 49821, 52314, 54257, 56991, 39922, 6171, 10672, 25594, 39700, 48207, 46331, 41899, 49356, 44376, 38574, 28928, 37317, 40132, 36487, 47501, 62972, 60277, 54142, 53516, 40743, 21929, 22351, 28991, 24203, 16622, 29312, 37348, 35496, 36989, 28317, 20397, 16447, 14697, 4064, -4354, -67, 14549, 23177, 21125, 30855, 29751, 30650, 29007, 31074, 23645, 8638, -2171, -7149, -9, 8775, 8663, -385, -9298, -19971, -28949, -24388]
7796b4388J2152J1853J838j345j7540J979J5673O297o567j199K319j1140j3083
7783b3151P953N500R599P320j0978j0087l176J2939L181q307J494O667J7513l018
7769A3449j6349k0033m679J1348M872J695m337l804k529O338R059j815r821r764
7755b6370M949M63M039J0311p443r548M28o374Q975n424l831J3026J0727N687
7741c85p40r606L965L226P772K008j2191L443k119p394j4342r86J314P74J0036
7726a5225R89N781N889Q980n14n543Q01K580p219M4Q745J825k074j2010J1525
7711D574l57k955M698r490q552M894l377q451L666J578n55N300j0485j0405J608
7696b8309R043J9082M99j5601l226j2291N503N428J1454p52O389J824M044j2689
$$ y = [-24388, -12236, -383, 1455, 110, -17430, -15451, 222, 6519, -48, -1247, 1072, -10068, -23151, -15198, -9698, -99, 7221, -3757, -13844, -17020, -4081, -900, -9207, -7713, -1046, 16467, 13449, -2900, -22933, -27612, -16264, -11392, -9697, -14034, -17838, -20367, -14029, -4970, -6785, -16606, -26370, -21421, -20958, -16919, -6608, -14051, -23599, -23171, -29545, -20570, -25994, -29825, -16799, -6072, -385, -1125, -10731, -6766, -3540, 4232, 6240, -5951, -2508, -4627, -12021, -26363, -27349, -26035, -25261, -15225, -14236, -8455, -2566, 6414, 5900, 357, 1158, 3738, -3481, -3437, 5308, 7133, 5059, -6951, 4574, 4217, 1262, 5960, -3530, -12082, -7188, -10565, -19016, -15350, -13772, -14327, -9027, -19512, -29917, -28309, -19266, -184, 315, -15286, -18512, -30803, -25300, -19872, -8418, -9170, -2781, -957, 3087, -9602]
7682i602J931L841L386q550O228M140J635m357l127n273j4030J0560r94J95k911
7667a6928r53L389N726J0009J005J365J3736P954q657j9586l166l79m13l202l311
7652a3411J2945J5533k327j1616J052J840p562j1481M380n547J585k206J0919
7639e896K893p180O993j0454O146k48j295K009o69k137J3323J1119O71q597r626
7624b948N662N269l475r206N835j0765n216o498L874R251P535M372r103q630J1755
7609b288O717K397J882j0698m88q614j2995N866R772P743L709k962Q255K383j4697
7594d018M16N569o452J031N46m381l568N752j69K703O363P63n474R49j6136k0609
7578c6715L289J0446L993JP941J1434R037j955j0242j2069j1391r25k082K285
$$ y = [-9602, -7671, -3830, -444, -8994, -2766, 1374, 3009, -1348, -4475, -9748, -23778, -13218, -14212, -14017, -16928, -17881, -14492, -8766, 1243, 2248, 3613, 17349, 25303, 16646, -2940, -6106, -6485, -6898, -10100, -13411, -466, 15067, 12740, 1124, 2176, 4016, -3546, -15027, -10647, -16194, -14609, -16815, -5896, -3003, -10183, -3190, -13644, -7498, -7746, -9041, -7032, -7701, -9838, 3485, 14604, 15275, 6678, -2948, 2714, 7983, 4508, -4698, 1137, -9628, -14844, -21342, -17468, -8217, -682, 3690, -5413, -14043, -2288, 4429, 6826, 8708, -1990, -2478, -11092, -24087, -18221, -8449, -706, 3003, 41, 8296, 10679, -4018, -3602, 1967, -4485, -3454, -2908, -7289, -10857, -5105, -5274, -2571, 3792, 4555, -919, 30, -16106, -36715, -33426, -22980, -18987, -18986, -11045, 389, 9426, 7471, -2771, -14840, -26231, -27156, -29238, -26953]
7564b6953J6166Q786k689j137K233J326J663M964m633j0357J1605n724K279r20
7550c391j2193L569M749J158J2072p32r818K142j354p504l306l999j851Q648p49
7535a2559J0426j060n310j930m91Q35m616L214J5126k580j2223N625Q802m300
7521a041L306k740n374j680l555M796K515P17J2733n541L660L181M752l276m058
7506H395R955k943P048j5604j3623n774r22O550M496K637L464Q150j0551j0563
7492i285q083N235J5150l138j2376K299P636R137O499q319q912l25j5010j4943
7478c4435M38K100O344K0603J4071J3829p333j8001q039p159l911m342K0866K3879
7464A8910J076L068O08j3231j3287j0252l927N797J1016J0118K91l051l245M79
$$ y = [-26953, -10787, -2001, -4690, -5827, -3594, -2268, -605, 4359, -274, -10631, 974, -4750, -2471, -3391, -15584, -12015, -7266, -6108, 5964, 5232, -4586, -2444, -3798, -11302, -14608, -18607, -20458, -11810, -12559, -2133, -3193, -8503, -10433, -10924, -10089, -14705, -11491, 3635, 1055, -11168, -5543, 3259, -1041, 2265, -475, -5849, -7529, -11084, -6288, -3773, -3056, 9677, 4136, 7796, 10977, 15729, 12453, 8395, 18350, 15407, 22455, 6851, -6772, -12546, -13468, -6918, -2422, 215, 3679, 11829, 1278, -9285, -17368, -12133, 3017, -121, -12497, -10198, -2562, 6575, 13074, 4755, -4157, -4482, -19492, -34435, -33997, -31897, -25553, -4950, 9121, 22950, 15617, -2384, -10423, -17582, -21493, -25835, -4969, 18910, 19986, 23054, 23662, 10431, -2856, -13108, -17035, -11238, -222, 9896, 10187, 7136, 3891, 4370]
7450D370J0228n807r215l910j823P292j408o207L877l587q999p18P067R76N650
7435b214l214m295j713J0644J0648Q761K036l955j8035p848P39O340n618j3333
7421b1057n227O907L782O225m612m814O655J7376M626j2409O407k736j7585j1207
7407b7669j813N221N405L304Q673N230N495K291n156j0016o866m010P898Q50j1550
7392b2713L032Q222J744R520m615p855l353q767L920m134J2237P012l026l053
7378a1829N777R054j271j280o615R153J0969p14m775j127M804N347j4892j9669
7364a7068p984K214J1108J7647L84J764l69q310j0205M548M45k955m810q971K968
7349a9594J3041R981K637p833o444J596J3911J330p557J960o483q726j085m296
$$ y = [4370, 14598, 8791, -424, -4334, -6157, 1135, -273, -6480, -2603, -6190, -15189, -15907, -8840, -7864, -2214, -5428, -9723, -11436, -792, 9856, 18617, 20653, 16698, -1337, -9185, -8446, -2106, -7724, -21057, -26284, -19377, -15595, -9370, -13982, -18796, -12141, 5235, 9861, -2548, 3859, 1123, -16462, -27669, -29482, -24261, -18856, -15552, -6879, -1649, 3846, 6137, 981, -9035, -15901, -19911, -12013, -11163, -22713, -19681, -11459, -9715, -195, -4810, -12665, -16018, -24785, -20865, -24999, -12762, -5750, -8776, -11829, -6052, 3002, 1731, 451, -6164, 2989, 13958, 13244, 8469, 7342, 12146, 17493, 2601, -17068, -25052, -22838, -11730, 5917, 6301, 8065, 7696, -614, -10819, -6271, -5826, -8781, -13591, -22562, -19594, -6553, 3428, 6065, -1768, -8212, -6616, 7295, 8625, 1068, 3028, -3455, -12181, -13266, -17562]
7335a7562J473r64N739J5616M501k946q691N761p26k291O524j9453j0890L99J0906
7320a2604J0517j609J0210m046M583j106j5371q988M511J4509n265p079k762J7360
7306B860P999o243M948N040K719r362j0723j566n27J1278o32j8891o161J54J4810
7291d297k30j2298J401M085n276K754L200j803N409m592O542N448j010l781k510
7276f958J51L58O260J3026j0604o546J516P31l394l896l537J45J299P583R902
7261F036Q201j243m943m57l584L210j3572m675K771J4272J9349n63j2404l737
7247H661o137j0542j7011o571Q275m257j551J2774J447L82Q580N133L963L763
7233F909r242p88N678K912r88j0041q404M507J137K499R471j172k043j3634j5239
$$ y = [-17562, -16089, -17053, -11314, 4302, 8803, 5857, -2834, 2927, 2201, -90, 6434, -13019, -23909, -23510, -12604, -2087, -3696, 6514, 2468, 7051, 5945, -9426, -18414, -13903, 606, -4659, -11738, -14500, 2860, 10859, 4616, 9564, 14604, 17323, 7961, -2762, -4328, -4855, 6423, 5791, -13100, -19261, -19107, -4297, -4527, -16825, -15424, -11339, -16615, -13861, -10661, -12464, -7055, -11647, -5105, 343, -667, -4448, -6958, -6807, -6449, -189, 12837, 2233, -4313, -2797, -2066, -5460, -9356, -12893, -12748, -11449, -3866, 6036, 14237, 12994, 8051, 7594, 4010, 7220, -6352, -11027, -8256, 6016, 25365, 24802, 12398, 8661, 2524, -8018, -25029, -31600, -23325, -27582, -29133, -16359, -14912, -14530, -5950, -817, 3146, 6909, -2333, -3121, 2557, 5469, 4481, -5560, -13964, -9457, -8320, -5821, 3650, 2478, 435, -13199, -28438]
7218b8438J496J6235O626j729l799n134o071r483M170J2714J542j6580M131K3664
7204f56K859O706j617q183J243R560J3401L2L34j925j0459j1863m759m586J3538
7189C625J2627J078p281M092P619o155q824R9K401l826m1j1664m98Q293p25j4584
7173a3764o028P805J8091P761M093p075j0329n255k656M440j4391k110n79N615
7159a4382J2537L783N334l428J657l187j621q790Q160J1624J0048p826k0337l619
7145a0047J1181M043n243j7993K839k179J107J6205n33M382m330j2740J52J2177
7131i79P869R423o21j1793n471N982Q518J894k944p965J003M272r009O339J076
7116G594L949o552K724J5187n745j1288q308j086P733O493l302k316m396J810
$$ y = [-28438, -26942, -10707, -4081, -5810, -9609, -14743, -20814, -30297, -26127, -13413, -11871, -28451, -24320, -656, 2203, 8909, 7292, -891, 352, 9912, 23313, 23345, 23679, 21754, 11295, -568, -5327, -9913, 3625, 16252, 17330, 10049, 14141, 21760, 15605, 6781, 6880, 9281, 5455, 5414, -6250, -6748, 1545, 820, -13764, -19792, -11987, 6104, 13865, 17958, 10883, 554, -4701, -7357, -2917, -17308, -19418, -19997, -14382, -1845, 1938, 7272, 3844, 5501, 2314, 693, -8097, 63, 11687, 21735, 13909, -6428, -10047, 1134, 5177, -66, -18059, -15220, -17399, -16292, -87, -620, 3762, -568, -13308, -13156, -979, 6890, 16313, 15692, 3899, -1572, 4410, 12928, 14822, 11878, 3913, 4916, 9188, 179, 6518, 7594, 11543, 4991, 7715, 22902, 17157, 5869, -2439, -3525, 4208, 10701, 7399, 5083, 687, 2497]
7102B497j910n167J1503J1317n581j6976o288J516Q355J5636Q623n409j9516J594
7088A94J2247Q423j6245j8070O661M19m247P407n486r012O419p79J2773M311p850
7073b835j3269n531j0197J238J2355J8717Q462M079n467n286J893j8023J8J3521
7059c25M047l750J160k546O322k159p619o181j2543N609R394J805n85P453K784
7044B866M626p988p427J4876L76n390j2941j2100m815J303N787J0463J370P511
7030a483O877j535j099l175j1713J773r520L605M091M026o15L077p954K742M148
7015f755m25l01R8Q824o232j131p74l558l724l17n430m552P821R629o596j8113
6999c1536j2874J2307K2260J8315R071P190m844p619r991j0814q491N209J9302
$$ y = [2497, 587, -4580, 6923, 18240, 12659, -4317, -10605, -9089, -734, 14902, 23525, 18116, -1400, 194, 12441, 20864, 4619, -13451, -6790, -6371, -10618, -3211, -8697, -17709, -11290, -12069, 704, 5015, -2835, -16104, -21635, -31832, -30594, -18239, 478, 8940, 13019, 7552, 2266, 4159, -13864, -13846, -325, 3722, -28, 1132, -1414, 4908, 2749, -4870, -11051, -23594, -17985, -8591, -6786, -7371, 82, 2866, 7492, -496, -7923, 6953, 7329, 1939, -11002, -23102, -27917, -26614, -20827, -10364, -8994, -1483, 5394, 3859, 2760, -415, -12128, -10355, -19875, -16270, -12179, -8153, -8768, -5691, -13645, -10903, -6755, -7180, -7481, -7383, 1441, -4791, -5922, -6696, -10254, -13978, -14295, -19725, -24277, -16456, -6827, -13423, -31536, -44410, -32103, -9843, 8472, 17543, 24733, 19889, 12270, 2279, -8535, -17026, -11817, 7485]
6986G485K370q186q159N346q302j1829M630N648K047Q783N699j7604k917J8029
6972C040o652M580Q305M94n39m44k949j170J1434N95k632j1436r325r916o909
6957b3524L240m795K09Q074J6093M771j905k136j2625O239J0443L378K402m030
6943E834p457O896Q107j325j2396m212m369r40L934J549R060q683j0015J220r120
6928b1917J773P16J2774O611K687l81r356p477L902J1960Q543O96o0J205O94o616
6912E754j0102k455p076k67L179K892M59L720p080M692J0629l334k155o061Q228
6897A023P001M096j7721j0485K2458R163n894r562K165P239j814k840n608Q180
6883G401K804R52K868L009K062j585q777j0827m088j0709p209J2965K0438O954
$$ y = [7485, 9855, 1669, -6490, -1144, -9446, -21275, -16645, -10997, -8950, -167, 5532, -12072, -14989, 3040, -3612, 968, 9273, 9767, 9228, 8784, 5835, 4665, 16099, 16694, 14062, 2626, -6699, -16615, -23524, -20284, -25079, -24870, -16796, -703, 4068, 2163, 27, -12598, -6359, 4084, 7462, 9864, 5834, -1623, 5273, 13380, 12055, -341, -4553, -8922, -9862, -5928, -4379, 4681, -4002, -14017, -12797, -21917, -20144, -19428, -6654, -43, 2644, 2263, -7093, -14570, -10668, 1292, 9835, 10531, 10471, 11676, 12370, 5754, -4348, -6803, -13879, -14146, -10967, -8075, -7616, -3896, -10976, -6284, 4345, 1011, -1144, -7205, 1023, 8024, 12120, -5601, -16086, 6372, 15535, 9641, 79, 2244, 9483, 7669, 4829, -779, 7401, 10205, 11157, 14025, 17034, 19096, 17511, 8734, -2093, -6181, -16890, -24099, -11134, 9304, 16258]
6869A6258L378k551p47j6666j1225o861L110J3908J860j259l948o394K549j669
6855a0257K420J182n317n491o069M243J7724N040M007l656j1089n010R452q836
6841a1657O339J3094r411R09m917q207j0767j038J6084Q272Q705j216j0688n962
6827a0460r61j0101j2900R798J995Q539J1184Q223l202n441o740n138Q053k10
6813g361k560o405M35M730J2644k170o898Q605J1452j4207r220J5795m869p703
6799g732n96O748K691M886J800q405N49M565k833J3900K011l126l216k663Q179
6784A6758j0052r153m837N872j033j3174M626r49l59Q408J592q330q227j0230
6770b9088P138K1769n206n137K094J2372R137K715j1471j1807o692Q489R094j609
$$ y = [16258, 19636, 17085, 16338, -328, -11553, -18414, -15304, -1396, 464, -795, -4743, -11137, -8588, -10257, -7837, -6655, -11972, -17463, -23532, -19289, -1565, 3475, 7482, 3826, -7263, -12273, -2821, -11657, -5318, 7776, -1635, -726, -5643, -13850, -24617, -25655, -9571, -1299, 7406, 6190, -4498, -10460, -11421, -21522, -34422, -24624, -22629, -14090, -2906, 5317, 2115, -3326, -10066, -15204, -7151, -7361, -9921, -16326, -15891, -11161, 1483, -687, -7585, 1020, 12472, -1735, -10955, 4840, -29, -7732, -8328, -1580, 1111, 5997, 7797, -608, -59, 4506, 1673, 15573, 17584, 14458, 11242, 8579, 16758, 6706, -2447, -7284, -1412, -2445, -15619, -10993, -11942, -12301, -3893, -2301, -10631, -18858, -29088, -21950, -181, -5387, -10524, -8430, 3942, 13079, 15794, 4323, -7484, -14176, -5687, 3407, 1798]
6756A798J219j2481r614l245P067J3117q70p134j0802n161j866j05J0186L293
6742a4598o446m341m76P99Q675K605K705J0266j646j9688R113J3373j326k450
6728c435j0362q983Q879O23N744J3185P359j805j1072n003n176L914n166KP925
6713c371k823j4644K480R321J143j956Q063N218o499J081n009R106L527o253K34
6698c82l635j6499R642J4472j0114o57k450K482K551q189l398Q44K0491R346j4632
6683a28k409J6175J018m003j637M162r283m034K592J4592P414j3312j3462K55
6669b060r701L667J6446L448r414M156Q496l201J919M015R71o779j3693j0936
6655a2666l267N435k34Q199J144J026j3853M699Q091J312j0328m640J195M008
$$ y = [1798, 3017, -9464, -19078, -22323, -15256, -2139, -3009, -10143, -20945, -26106, -27972, -28077, -17891, -14598, -21044, -25385, -25861, -25062, -16387, -13782, -11077, -811, -2457, -22145, -13032, 341, -985, -3435, -13797, -22780, -13901, -13278, -7534, 5651, 13010, 11205, 133, -4870, -10046, -6132, -11298, -11296, -3371, -6194, -20838, -18358, -9037, -7894, -9850, -1787, 3431, -3068, -1987, -6996, 2110, 5637, -616, -382, -4017, -20516, -10874, 3598, -6516, -7173, -9623, -7141, -4590, -12779, -16177, -15333, 5158, 14504, -128, -2537, 13638, 14656, 10653, 9016, 13178, 3895, -139, 2453, 17045, 24459, 11147, -2315, -2060, -11761, -8094, 8352, 11800, 2386, 6542, 15038, 11837, 13756, 17771, 18742, 11963, -1730, -12666, -15933, -10498, -10732, -2533, -1389, -363, -14216, -9517, -1426, -114, -10442, -15082, -13887, -9879]
6641i879O591Q023r161k718L473J0051k465m375L055O165J037j1078j0739Q283
6627c737M498p507p250k746k540m680L399L54N038J2096L754J210k937J1194p720
6612B426j8060L10J9945J0212l40q797o212l453n485l076R943L110m591m194N172
6597c090J3845L896j8414m853J0078R545l222nj1116r42J3269k083J5247K856
6583B5011p788j6300j2003L621J5345O029r590l94J724N60J033j0669p340n362
6569a6123M047J985o195J800O552j367M254n03O224J0338K44J359N103L229j1944
6554I003o097m015m153J3582N460O572j176p140j169M9o997k321K957k148j829
6539E78k046r14L149N66o124L733M637R509m474p140K944L224p050j6215n266
$$ y = [-9879, -3288, 4735, -4426, -7144, -3671, 6380, 3915, -460, 2595, 8760, 9797, -1281, -12020, -3737, 761, -6746, -13996, -16742, -19282, -23962, -20563, -20209, -15171, -3075, 679, 1889, -1048, 10146, 2426, -15634, -15324, 4621, 14833, 14493, 5696, -516, -3969, -9454, -12530, -2587, 523, -4068, -8262, -3090, 10755, 14651, -3763, -8616, 1462, 11007, 7785, 7780, -3336, -4278, 8991, 6908, 22155, 25011, 17223, 923, -11080, -7459, 7886, 13915, 4325, 3931, 5655, 6215, 7248, -3421, -10761, -16123, -12076, -10091, -16286, -14486, -7934, -9301, -5047, -5550, 674, 11012, 11256, 12615, 17718, 20947, 9003, 2906, -1109, -5262, 8320, 13780, 20352, 19176, 12036, 10867, 10916, 3919, 1598, 4555, 2407, 578, -1468, -2382, 767, 1333, -4791, -1058, 3579, 13088, 8614, 1474, 4418, 7642, 592, -15623, -20889]
6524b0889Q229J7584O763r843N911N097m036j568l086P170K839j0940l250R680
6510I661J226l294o231R85L090O263K872o09j013p372L568R004K682r276r739
6495A817J65J1110o623j3587p899J0471J2022K354j240N78j223j3937j3783J556
6481a8219M994J1868Q680J0525m364q584j0583j4427n929J1111J1594q366j864
6468a3564N028J7531J3825M517j3162q894l226l434j264K067m29l762J2112J3606
6454B0951r56j2181j1403J93L865N280n062M86M413j7274O635J3355k093j2152
6440e943J102L717l174M225l676l457M896R905o896n432n137J347P702K2513J1683
6425C3375k212m016j7590p182M859J136j2855k37K565q268p106q606q340J6692
$$ y = [-20889, -12660, 4924, 11687, 1844, 7755, 12852, 8816, 7248, 4162, 11332, 14171, 3231, -19, 9661, 10887, 7593, 1362, 2347, 5437, 11700, 14572, 13963, 12950, 5578, 9146, 18150, 20832, 11556, 1817, 1982, 13092, 6469, -7118, -15017, -4546, 7476, 9830, 8590, 9168, 7945, -5992, -19775, -18219, -13225, -1357, 7323, 17848, 13484, 4900, -5683, -20110, -26039, -14928, -3334, -11700, -13564, -8536, 8995, 22820, 27337, 14175, 5281, 2055, -1379, -2643, -576, -1005, -4767, 7345, 20951, 19995, 7814, -3589, -3396, 469, 5749, 687, 1173, 5586, -11688, -5053, 8302, 6209, -5943, -4841, -1124, -4298, -73, -3749, -7206, -2310, 7595, 699, -4733, -9870, -8523, -821, 21692, 33375, 31163, 27147, 9557, 2375, 7234, 8370, -4485, -4722, -2157, -10425, -17531, -26137, -34477, -17785]
6411a7785j778j0500J2959J4344J9096p32m920j1299p29J243j416K850m364l868
6397f899N575N192J839m814l986o548M534L632j659p885l424L686J0215O238r530
6382c834j0045L058N715Q379q948j7854N489N751L785q147j1659O060n347J5551
6368a2046J4035j7202R686M747M625P862p781o730R163j0813j4748l061O510J382
6354a4371Q646J0740Q324l513j5781J5257P966K176q651m532R097O708L892Q62
6340B6820j0396j5045l339R76P784j1720k382N370O466J468N248l417l316J946
6326F463Q022j2137p351l749K362J969j888q66M407j0299k172R027O183j052J194
6311A13N85k602J0596J0488j82r964m030o568l222q899r791P050l56k352J37O098
$$ y = [-17785, -19563, -30063, -17104, -2760, 16336, 15604, 10684, -615, -1344, -101, -1517, 1333, -3031, -6899, -1324, 3868, 5707, 893, -3093, -9641, -5107, -1475, -3134, -11019, -14443, -10757, -542, 5696, -3834, -13879, -10821, -5106, 3273, -5675, -23529, -18040, -12289, -8504, -16651, -28310, -22250, -27597, -12046, 1989, -15213, -5527, -780, 3845, 11707, 3926, -2804, 6359, -4454, -19202, -22263, -15753, -14371, -5725, 5015, 13339, 9826, -5955, 9302, 17268, 19444, 10793, 6261, 15358, 22066, 25958, 26820, 16424, 1379, -1960, -984, 6800, -4920, -7302, -1932, 4534, 6002, 11250, 7833, 4517, 6463, 14485, 2348, -5003, -8752, -6390, -4421, -6309, -7175, -2768, -13067, -15239, -6212, -29, -1081, 113, 698, -1904, 8692, 19180, 18998, 9034, 5004, -1564, -4786, -13685, -23476, -16426, -16782, -19134, -18997, -12899]
6295a2899K51L357J3316L269j5092o095J4373P625N696m071j6124J1022R686j2929
6281A385j1073J8504M810p663m214j651m064o731N38k650k065p940J5019J4379
6267F584n747m275n92l990L446K590L148K364J384N423K345j614n730L023n954
6252B405n861J3088l034p750M43j294J1491j15o6M009q819k0062j961Q181J0584
6237A239O526r752M951j546p94n302P018J2123r658k0969n078P904R595R605m796
6222A066m443r898k304J245N208K545N663n222O032J235J4153n563p958j882L352
6207C229j119o33p889q235O882J5387J0134M734k561K734j0649j5776o23J528
6193b857Q231K270m772j855K89L114L264l581M16J112j01K310k394k124L993O361
$$ y = [-12899, -12648, -9291, 4025, 7294, -7798, -13893, 480, 8105, 13801, 9730, -6394, 4628, 14314, 1385, -9688, 8816, 13626, 5963, 1749, 98, -3966, -10697, -10159, -12809, -14874, -22814, -7795, 6584, 837, -3438, -4030, -8020, -4574, -1984, 1164, 3528, 4912, 10335, 12680, 11066, 5336, 8359, 2405, -3456, 9632, 6598, -1152, -709, -2003, 9488, 9373, 9307, 13316, 4497, -15565, -17526, -9345, 1239, 7765, -1987, 2964, 1418, 624, -4678, 2340, 14463, 4805, -16164, -21242, -13338, -3743, 5862, 1066, -3377, -13275, -15579, -14334, -9126, -6581, -918, -6140, -108, 1127, 15280, 9717, 1759, -123, 3229, 2110, 1477, -6412, -14647, -7765, 7622, 17756, 22490, 19929, 22663, 12014, -3762, -4385, -2857, 5374, 7644, 2872, 1017, 1306, 4420, 7684, 4103, 4519, 5631, 5530, 7840, 5446, 3322, 7315, 13676]
6177A3676N11K845j4025o549P52l882J088O152j246m098k853Q857M171j864J380
6162D915p523l629n50P029N541j508J421R440K0M720p193l694n185j5085j991
6147a3272J3158M405p550L213j148j5902q897O243K154K297L289N302Q574k902
6133a036J4661k375Q400L040j05m72L7j4626j4389P022l296L343k849P289J1641
6118A6285Q89j2611J110J055o584k861p298J268K258q949o720P239R317o66L506
6103b762N977k104n344n585k084l147Q339L426P11j526n927q709Q60J3485l944
6088h334n25m67l079j199J2073P678k168N356J311q942p503P451n292R927j455
6073D832r342K302P85m599J6101M258j3554p110n176j968n963j0940O328R767
$$ y = [13676, 14187, 17032, 3007, -3542, -2790, -6672, -5584, 568, -678, -4776, -7629, 1228, 5399, 3535, 4915, -2608, -6237, -6787, 242, 5783, 4275, 5696, 15136, 15156, 19876, 12683, 8989, 3804, -11281, -13272, -114, 4291, -3259, -46, -1194, -17096, -25993, -19750, -17596, -15299, -12010, -6708, 1866, -1036, 13625, 11250, 19650, 22690, 22585, 22113, 22150, 7524, -6865, 157, -3139, 204, -2645, 4644, 16285, 17174, 4563, 5673, 6728, 144, -2717, -10015, -8747, -6489, -15438, -22158, -14919, -5602, -6268, -2762, 3215, 1111, -4233, -9818, -11902, -15049, -6710, -3284, -2573, -4099, -10026, -18735, -17875, -4390, -8334, -8859, -9326, -12405, -13604, -1531, 6147, 3979, 9335, 10646, 1704, -5799, 1652, -3640, 6287, 4832, -4510, -2208, -1423, -6022, 10079, 14337, 783, -6327, -11503, -13471, -19434, -30374, -24046, -14279]
6059a4279Q165O817o253j1240n340J439l950p28J1242Q492p29o350Q397J5438
6045A1121k263j6793q2R077R70o540j1860Pm03J0969Q814L07j3230L522O875l956
6029c465p331J333k322O693N474Q612l820q868J61J5778K554r770q501K816p293
6014g949j1848N555J6162Q985J03Q38j4383k473J4410R301j4992p249n85P355
6000C230J6350q007p582k606j26p000m22m830j0247j949N761R030J0838j41N134
5985G433m569q137n073M523L951L625q346j7305l418J5806Q773J5665j3741O10
5971b03K668K930o009k480m545k42J8544P46r215J419k090p640r581J6171Q233
5956H706N740o700j5691J679n755K818P144K631J4657k908L806K197j453J370
$$ y = [-14279, -6114, 703, -5550, -16790, -22130, -20691, -24641, -25369, -14127, -5635, -6364, -12714, -4317, 11121, 8858, -7935, -8017, 1060, 2030, -4510, -16370, -16363, -16766, -5797, 3017, 3324, -9906, -6384, 491, -3465, -10796, -9463, -11785, -5092, 382, 8994, 5174, -3694, -3533, 12245, 14799, 5029, -3472, -656, -7949, -19797, -14242, 1920, 10905, 11008, 11846, -2537, -5010, 9400, 18701, 3709, -3540, -4125, 3230, 19580, 11573, 3991, 1385, 1259, -5741, -6163, -10993, -21240, -23189, -17428, -8398, 2440, 2299, 7433, 2864, -5273, -10346, -5823, -1872, 1753, -6593, -23898, -27316, -11510, -2737, 12928, -813, -203, 2465, 5395, -614, -3094, -7639, -7881, 10663, 11409, 2194, 3613, 1523, -6117, -15698, 473, 8706, 14446, 7746, -7945, -6266, -12021, -9203, -2059, 572, 15229, 12321, 16127, 18324, 16871, 18241]
5942A8241j484m440N715P821l671j3608l512L182j0953N618j469j107J601Q622
5928A0556M303K41r588j0550K856J503L786K763N279j0843j4329j759N857J916
5914h009k907n656Q070M524o477r190m930Q141K0644L264J1505r75m533j1361
5900B110q433O063k777Q287Q38n624J170R422Q58n588j370o702m086j3479l448
5885b2759o67N198K884k278R381L489m733J3302M499m115m896K686m886l488P30
5870e653K059M950q635l593q324O443M512J022M040J626p379k412j4771R14O957
5855a8244J698Q937Q419l233m829L702n896o505m642J3597J6157j3259n142O943
5841b297M40J0030j678m973o759M820J673L324l00o650j3004j635m829J3986M035
$$ y = [18241, 16757, 12317, 18032, 25853, 22182, 8574, 5062, 8244, -2709, 2909, 1440, 333, 1934, 10556, 14859, 15100, 5512, -5038, -2182, -679, 3107, 5870, 11149, 306, -14023, -15782, -9925, -8009, -10916, -16572, -8502, -3978, -10455, -19645, -24575, -16434, 4210, 7474, 18979, 18004, 13471, 2110, -6323, -260, -3037, 5250, 6088, 464, 1634, 11056, 11914, 6326, 4956, -1746, -5832, -19311, -22759, -23426, -18228, -15344, -17622, -8241, -4752, -9485, 3817, 8316, 4201, -695, 1991, -2895, -6383, -5653, -3594, 1356, -7279, -10872, -19196, -12753, -8241, -7219, -3179, -1553, -8932, -11344, -26115, -25201, -18244, -16546, -7609, 810, -2423, -7252, -3550, -9446, -15951, -20593, -6996, 9161, -4098, -9240, -2297, -1857, 8173, 6495, 1522, -5237, -417, 1256, 4580, 4280, -2370, -15374, -17009, -21838, -7852, -3817]
5826c817O795p555J151l817N694J6870M009q828n964j3265k263P68o869K583J1130
5811c378Q403K757O144q023j4262r726j220J1863K23o743o529J9673K1263P02
5797B1147K284q573m825p149l924k015m47R378m884k682J1824R988O25j0881r320
5782E46k291O674Q112J592j6617r073K285Q398J4932M395l549o357j6958j792
5768i703K631R656J209Q212R925J244m703p324k497l073K56P831p887l329J122
5753C570o183J05l788j1207m504m181N283J2168n70j82P302J98n874K788J3155
5738H080J0744k79j2741l909L493M30n862l825r20R41J2358k694m05j7888K635
5723i842q059N977N491L355j0746o840k177J2484L030O250q4j0689q426K141P54
$$ y = [-3817, 2978, -4577, -3426, -7243, -1549, 15321, 19330, 10502, 4538, -8727, -10990, -10222, -17091, -14508, -3378, 5025, 7782, 13926, 5903, -8359, -18085, -19305, -7442, -7219, -13962, -20491, -818, 20445, 21147, 23431, 14858, 10033, 2884, -1040, -3055, -3502, 5876, 992, -1690, 10134, 20122, 20747, 9866, 546, -1745, 4929, 13041, 14633, -1984, -11057, -8772, -374, 14558, 18953, 15404, 9047, -7911, -9703, -7072, 2584, 3793, 12005, 21930, 23174, 18471, 11147, 8650, 5577, 5833, 13664, 5777, 2448, 3570, -2613, -2508, -6296, -17503, -22007, -26188, -20905, -8737, -9307, -9489, -2187, -1989, -7863, -5075, 8080, 18824, 18545, 5804, 1895, 5388, 5818, -44, -3869, -4789, -3848, 8510, 5816, 5411, -12477, -9842, -17901, -11924, -6433, -3078, -13824, -20664, -22841, -10357, -7327, -1077, -1161, -11850, -20276, -18135, -17381]
5708a7381n96j290J5684J0498n006P793L430p949j1546q958N024L488k295j340
5694a0444r580q583J0062N348N227O382J0705n199k613K198n277n886k100R731
5680b9J6712J262q732r780Q193J5902P663q442r049q110l119m34l22J3411K564
5665A7690j1602J644L63k299L457P288Q932N917j707q004j2669j6640p312N273
5651i669N42l865J1611j523r939j098J2846K913K030L684p972r096K043o123m445
5636a8061p39m33N181J9329j0756p967p041J1892Q48q099L550n295L678J2901
5622a012R235o172j9106k729J1411Q739O997J1961j1072L165n920q34L659K693
5608A1015N117k731j1280l827l468o816m163j25J0189L360O151j4553K835k097
$$ y = [-17381, -17977, -19267, -3583, 6915, 1909, 9702, 13132, 5183, -6363, -15321, -10297, -6809, -9104, -10444, -20024, -28607, -18545, -13197, -7970, -1588, 9117, 3918, 1305, 3503, -1774, -7660, -9760, -29, 16683, 17945, 9213, -567, 7626, 23528, 31191, 22749, 13700, 5590, 2471, 2037, 1715, 15126, 17690, 6088, 7732, 8095, 5796, 9253, 16541, 25473, 31390, 29683, 21679, 9010, -7630, -14942, -9669, -9127, -12992, -1381, -2904, -12843, -13941, -1095, 1818, 3848, 7532, -440, -9536, -7493, -13616, -18061, -18800, -19233, -14052, 5277, -5479, -13446, -20487, -8595, -7747, -15846, -12296, -17591, -13913, -1012, 8223, 2051, -17055, -19784, -8373, 366, 7363, 19324, 8252, 11417, 5497, 4663, 8322, 11015, 16132, 13401, 2121, -1706, -5174, -11990, -16153, -16278, -6089, -2729, 3422, -11131, -8296, -10393]
5594a0393K363Q359Q189L487n851O088n913l159p261l908M495l078J550m15p881
5579a3328P851J5783o030P336j081K598q022m873M215L211M333L565j214p903
5565F441q910J095O46L25n323K012r2M599O049k319k8n332j7298L221n619K997
5549a7536P37M214M343r160j3459O714J6403J0896M104j917K547N651j474k097
5535I966j244P081J1393M940r601q82j0565O72K975m689j1118l174J5618m74p004
5520C894M809j0714n406j414j1273N348k961O633J0148m38o449M838P365j303
5506C077k204O257P606j7752j4424J0282N701J2089j065j1720j8461l402J3135
5493a0881P826M277N083p857m113P889M026l871O518O882n371j147L481k725j8873
$$ y = [-10393, -8030, 329, 8518, 12005, 6154, 12242, 6329, 3170, -4091, -7999, -3504, -6582, -5032, -5447, -13328, -5477, 10306, 4276, 11612, 10531, 13129, 5107, 234, 4449, 7660, 11993, 15558, 14344, 6441, -2469, -1374, -728, -403, -5726, -3714, -3806, 793, 6842, 4523, 4495, -837, -18135, -14914, -20533, -17536, -16799, -12585, -8242, -17402, -30861, -24147, -7744, 3152, 7256, 5339, 7886, 13537, 12063, 9966, 8722, 15803, 27196, 32136, 22535, 21653, 11088, 11760, 14735, 10046, -1072, -4246, 11372, 10898, 3894, 8703, -2011, -7417, -8831, -20104, -14756, -17717, -11084, -936, -1374, -7823, -2985, 4380, 3077, 873, 7130, 14736, -3016, -17440, -7158, -1457, 10632, 9567, -2153, -20614, -24016, -10881, -3055, 1222, 6305, -1552, -5665, 2224, 6250, 2379, 8897, 15779, 10408, 9261, 12742, 10017, -8856]
5478h856q253P947q109P320J88Q34M859L326J375P876n022k41K02J0402K510r204
5462G154j4540K303k780J213J1343R962N840j4184j3691j613Q305p86j274O221
5448C473L207K002L52K592m410M756J2206j588n232j2187m767k585r436n004j546
5433a8167J1254K0422j0981q817J3886Q810j1878l68J300k868l759l95L747P607
5419I793j0845j1963K819Q460J2817Q369m413n375j0152p104Q752k138o892j876
5405i748l448Q66p887K769L918l273j612J4363J862p942K308J775k426N641R387
5390F553l745j0322k239Q243N269L183p673m795j769m051K110K126K482J8106
5376A3478P80m295k080N306J332L436L34j0740j311J2554k140j5913J770K98R011
$$ y = [-8856, -17109, -9162, -17271, -9951, -9763, -8929, -4070, -744, 631, 8507, 3485, 3244, 3446, 13848, 16358, 7154, -7386, -5083, -7863, -6650, 4693, 14655, 20495, 6311, -7380, -8993, -688, -1474, -2748, 3473, 6680, 8682, 9034, 11626, 7216, 11972, 24178, 22590, 17358, 5171, 404, -2181, -11617, -16621, -18167, -6913, 13509, 2528, -6289, 7597, 16407, 4529, 4161, 5461, 2593, -1166, -1561, 2186, 9793, -1052, -13015, -10196, -1736, 11081, 19450, 15037, 9662, -490, -7594, 1158, -980, -7872, -9748, -13196, -12330, -20217, -17448, -13530, -16803, -18415, -4052, -2190, -10132, -7824, -6049, -8475, -2834, 6553, 2808, -7514, -9753, -1510, 3759, 6942, -731, -5526, -7295, -11346, -9236, -7110, -4628, 13478, 14258, 9963, 7883, 13189, 14521, 17957, 18291, 7551, 6240, 18794, 16654, 741, 2511, 2809, 11820]
5361A1820P919o316j3765j147J1738J0292J4248K65j9302j9715r502L254P278
5348b933n034p991j9447l169J9829J8942k461r033O549L418j7519K212O800o72
5334a0509J535j0908R789J2638p215q81p490j2913J193J9994J4699J845p713j0423
5320f359m296m194m264j77n886R24r38q265R86Q541Q633O105Q241L314l360Q740
5304G745K214r36k180L970j653o798K352m797R993J2044o322j282R30Q692L962
5289B7934r698q808j0513p285J5527J1656j591J758n449j3669o109J3721K055
5276I529l400l273l944R435k205k308M098q519j1156K296K786J959L627P142R983
5261A6050l272l043O8K676n189j2283o311J0333R318j772o551l314J590l519p319
$$ y = [11820, 19739, 13423, -342, -1489, 10249, 20541, 34789, 35054, 15752, -3963, -13465, -10211, -2933, -7967, -15958, -35405, -38574, -18745, 197, -2264, -11297, -4748, -1330, -18849, -16637, -9837, -10509, -8974, -19882, -10093, 2545, -4670, -5551, -13041, -25954, -24761, -4767, 9932, 11777, 4064, -6359, -10655, -14849, -19113, -19290, -25176, -24252, -25190, -33455, -32469, -23928, -15295, -9190, -949, 2365, -995, 7745, 9959, 9023, 6843, 10813, 9160, 2362, 4714, -83, 9910, 21954, 15632, 14350, 15280, 23972, 27934, 18236, 9428, -1085, -8370, 7157, 18813, 17222, 18980, 13531, -138, -6247, 7474, 9529, 6129, 2856, -1088, 8347, 6142, 3834, 7932, -587, -11743, -9447, -6661, -4702, -1075, 6067, 16050, 12778, 9735, 9803, 12479, 7290, -4993, -11304, -971, 8347, 6575, 24, -3290, -1700, -5219, -12538]
5246a2538M258J1457l095l238o979N808K285O21J183M058K319J951l721K942P086
5231A4397p065l19q433n824k047K605O265k359n109Q033k3j744m869P035k747
5216b204j9675k719Q612J2784J3576P024q985j1101L974J2464q715L241p347r663
5202h734m871L181R929n932K638l778Q823P464L37M27m579k452K488k74m670k402
5186b405o935N552O797m52N046pj509N821j3234j1817m470J1184J0460N988k013
5171H006o155q898l479l648j716J1496J3227m233j0643N475P071p638q85R02o486
5156g604J038L976J0557J111o08K849m106M676K364n722j327L045j799O148N828
5141B0426l671M011k900j3726j289n322P384J3975m456j2423r574N454o65k262
$$ y = [-12538, -8280, 3177, 82, -3156, -10135, -4327, -2042, -1421, -238, 3820, 6139, 8090, 4369, 7311, 14397, 7332, 7013, -1420, -7244, -9291, -6686, -421, -2780, -7889, 144, 121, -1623, -6492, 543, -2204, -21879, -24598, -15986, -3202, 10374, 17398, 8413, -2688, 1286, 13750, 5035, 8276, 929, -8734, -13605, -10424, -495, -6427, -3789, -7567, 1256, 8720, 9057, 9484, 4905, 2453, 4941, 4667, -3, -2405, -9340, -3788, 3009, 2557, 7603, 7596, 6087, 11908, -1326, -13143, -17613, -6429, 4031, 10019, 8006, 1851, -7047, -10526, -14174, -15890, -4394, 8833, 4600, -6043, -568, 6503, -1135, -2020, -1118, -7604, -6566, -2590, 7967, 9078, 8470, 11319, 7213, 11889, 14253, 8531, 7204, 10249, 8450, 14598, 20426, 16755, 20766, 17866, 4140, 2851, -2471, 4913, 18888, 14432, 2009, -7565, -2111, -2776, -5038]
5127e038Q361K432L648N386K14j3349j7096K227J8131N137k04M599n105o712l1
5112B600k30J4994N679j0299k893J348N047r298n24N467k45n292N505l66j7365
5097e872M663J46n940o46N458M732M451o052l999R041J8364j1632l795K159j342
5082I736n377O40O015O288j569k140q709r09P125o827n449j10J4638m605o903
5067A844p898Q424J5090N478j1349l755O27J911k240n87m944O983r048K42J554
5052B332l946l82O23L453k247Q18l130J0982K282k505r364j4580N437P742N426
5037B941q631r690J0621Q569o96j1690K33N666o205M262Q95N686mk757p637N943
5021b494R564j532j3272R81J158j30R018K282o09j1438N637j466l16j0436K321
$$ y = [-5038, 3323, 5755, 9403, 14789, 15003, 1654, -15442, -13215, 4916, 10053, 9849, 14448, 9343, 2631, 2600, 2370, 17364, 23043, 12744, 9851, 11199, 16246, 6948, 6424, 11891, 11646, 6354, 11859, 11493, -5872, -1209, -1063, -7003, -7649, -2191, 2541, 6992, 940, -3059, 5982, 24346, 12714, 8919, 11078, 9736, 4359, 4999, 11014, 17302, 15733, 13593, 4884, 3975, 11100, 4273, -1176, -1286, 13352, 8747, 1844, -6054, 2370, 17460, 22938, 11589, 7834, 8461, 10372, 8132, 7545, 2601, 9584, 536, 778, 2332, -1614, -1996, -1373, 2080, -167, 651, -2479, 8503, 10785, 8280, -1084, -15664, -10227, -2485, 2941, -5690, -15380, -4759, 3810, 3114, -8576, -8343, -2677, -8882, -4620, -3725, 1961, 1957, -800, -8437, -2494, 7070, 5538, -7734, -6753, -5595, -5725, 3293, 5575, 4966, -6472, -835, -2301, -2617, -13053, -10732]
5006a0732P937N362n451J673j031n442m365L440k105L641N346o725j0463P319
4992a1596l441r2K0718J6489q52o888K228l708o377j0402n09J4170Q338j3653
4978D425o366j0572j2524K283P445M810m945l033j168j1957K202J0306L675J8437
4964C018l942J272j1279k189L488M771j1536K839J6583O605R396L156N99K069
4950B4850p960m51l10K493N598j4081j3192n926O888m508n839O238p387l665K693
4935a4559K926J6385k484r178j029O086P784O80j0595k164M479L463L234r552
4921d524l475O155k140P836R958r408n804M372R121m376j1224m080q32K473m680
4906a0628q240K423M151P693K2644m059J125L465j2666j2026Q101R159P663M979
$$ y = [-10732, -2795, 2567, -2884, -1211, -2242, -7684, -12049, -8609, -10714, -7073, -1727, -8452, -18915, -11596, -15037, -15129, 5589, 22078, 21226, 14338, 16566, 12858, 6481, -3921, -4430, 9740, 18078, 4425, -1941, -12513, -25037, -22754, -15309, -10499, -15444, -18477, -19645, -31602, -29400, -19094, -15419, 3018, -924, 348, -10931, -13120, -9632, -4861, -16397, -13558, 3025, 9630, 19026, 22182, 22781, 24850, 16890, 16439, 16129, 18622, 24220, 10139, -3053, -8979, -2091, -6599, -12438, -6200, -13587, -17252, -14559, -11633, 4752, 2268, -6910, -7939, -1853, 5931, 6611, -3984, -6148, -1669, 1794, 5028, -4524, -7999, -1844, -3984, 3852, 13810, 4402, -1402, 2970, 12091, 7715, -3509, -7589, -8421, -5948, -10628, -18868, -16445, -12294, -4601, 18043, 13984, 15109, 18574, 5908, -6118, 1983, 11142, 18805, 23784]
4892B3784l900n368r010j2759p07R296k303k574m765Q821J3217J707q094l02j5683
4877h640j1085R445J5602o30p051M248J0291J374j4595k99k057o172l731l670
4863a6970O363M957K234J1561Q50n609K377L531K675q195j3658r867r861M022
4849b5590O870O801J3441R877N75j8374j2417J0013O748J963k183p355R813m125
4835c943k218L582M641l674j5293J399J1124P121l851p654M963N360R693K355
4821A3605m677J714l103N33Q067p883j0959J180R699P635p291k976L843K425J33
4806A1945J707L499M213j3084N083K253q514P585N625O403r297p446r810j736
4792a574J4067o964r323k427M240P406L183j8322o237P381O432m435r60O640J737
$$ y = [23784, 19884, 14516, 5506, -7253, -7960, 1336, -967, -3541, -8306, 515, 13732, 15439, 7345, 7043, -8640, -19725, -10280, 5322, 4692, -2359, 1889, 12180, 13554, -1041, -1340, -3397, -9569, -13300, -16970, -10607, -5650, -3416, 8145, 8995, 3386, 5763, 9294, 11969, 3774, -9884, -19751, -29612, -25590, -18720, -11919, 1522, 11399, 11974, -6400, -18817, -8804, -2056, -93, -2276, -9631, 182, -3943, -6161, -2579, 2062, -1612, -16905, -15506, -4382, 2739, -1112, -8766, -3803, 1557, 11250, 13605, 8928, 10642, 7539, 8072, 16139, 8256, -2703, -1523, 8176, 15811, 8520, 5544, 9387, 11812, 11945, 13652, 17151, 21364, 8280, 13363, 15616, 7102, 14687, 20312, 26715, 17418, 9972, 162, -1574, 12493, 5529, -3794, -6221, -1981, 5425, 8608, -9714, -15951, -8570, -2138, -6573, -7533, -893, 844]
4777H44j0065k07Q835n030m314l706K102J5388J0970J4550p618j3653j1267m062
4763g233r3K670J598n474l842J0612J0693m25m24q156j144j204J0480k805P62
4748F015j798O813M399k281j3464r204j875N680O057k166p332O370Q64Q487M893
4733A1458R19j0111r285p18M412R722R244n819m199m078K925O006q701o502j968
4718f695K104J703J519n41m739n460O809M71J349K964m259K087J0611P115r919
4703E119l596j3453N404P586M564j1209p555K3281K922K865k95N228k57O985n795
4688B1794j6263l152Q000M775l797m634l517k055J473r559O18L909N441J13m705
4673a559k781m223k76Q448K756m271m58N640r981j4747L351J9503J11o154M080
$$ y = [844, -9221, -9428, -593, -5623, -9937, -13643, -11541, 3847, 14817, 29367, 21749, 8096, -3171, -7233, -7326, -4656, -3058, -8532, -12374, -1762, 8931, 8506, 8082, -74, -1218, -2422, 8058, 5253, 6015, 4217, 11030, 15429, 13148, -316, -9520, -11395, -5715, 342, -1824, -9156, -2786, -1922, 6565, 11458, 12377, 2266, -7019, -7737, -3325, 6397, 15641, 9822, 5623, 1545, 4470, 10476, 1775, -4727, -6695, -4591, -2888, -1369, -1910, -6649, -12109, -5300, -4829, -3480, -516, -4775, -2688, 7923, 15038, 5119, 1523, -11930, -6526, 1060, 5624, -5585, -13140, 10141, 13063, 15928, 15633, 20861, 20604, 27589, 21794, 5531, 2379, 10379, 15154, 11357, 6723, 3206, 1151, 2624, -6935, -6317, -2408, 3033, 3146, -1559, -4340, -8563, -8839, -391, 2365, -1906, -2364, 3276, -6705, -21452, -18101, 1402, 1513, -4641, -561]
4658e61K288K355L587m04j1409n803l660o744Q229J0134K650l194o818k844l079
4643a5273P487J2950M942q098L755O334l918O739j877r954N24M003l808M109J815
4628I730r434l80n676K319O074N128L790n352N358O83J772j753j0749p268l938
4613i696Q580J2761L421q753j108m808M269j1620k5774N463J0956N421L212J5947
4599H271J0736r260n038M787j4970o387P537P237P49k231J6816Q287j6847n403
4585D284P437L893r510m164J0992L576j1155n590o055n286L167K770L310n199
4571g530m8R53k612n23N533L311Q450Q231J544M472p055r2k566j2596q237P484
4555a281R849O400K318r303k2601j0000J1225P444N140J30p23J1024Q704N616
$$ y = [-561, 1727, 4082, 7669, 7265, -4144, -9947, -13607, -20351, -12122, -1988, 662, -2532, -9350, -12194, -15273, -7786, 5164, 10106, 2008, 5763, 12097, 8179, 14918, 13041, 3087, 3611, 7614, 3806, 7915, 9730, 296, -84, -5760, -3441, 2633, 7761, 11551, 6199, 11557, 12240, 14012, 12259, 1510, -5758, -9696, -1116, 11645, 15066, 6313, 5205, 397, 4666, -6954, -32728, -27265, -16309, -10888, -7676, 8271, 19007, 9747, 4709, 9496, -5474, -11861, -4324, 2913, 3662, 1431, 18247, 26534, 9687, 4284, 11721, 15614, 6104, 1940, 12932, 16508, 5353, -237, -6292, -11578, -8411, -5641, -2331, -7530, -7578, -6625, -9237, -9760, -4227, -916, 7534, 15765, 17309, 21781, 14726, 14634, 12068, -528, -8765, -1281, 8568, 14968, 17286, 7983, -14618, -24618, -13393, -5949, -809, -679, -1402, 9622, 18326, 23942]
4541B3942j4532j4663q519J0451O632n661m014k875J0583O181j285N497o754m561
4527D22K738N277K865j0671k845P016P19L092K216n529l974M565Q97O04j600J173
4511F965K486o906L817J1294K112l259j391k85J470o024J974L558q180q241o476
4496g086q44n166r64O743p4N429k768l714N856m860L084M933J399K759J4230j3169
4480E788j2419K729o233J890L488L366j844P671O784M066K437J919m331r965j6241
4465a0895j2684M728J2075P890L081j560j3580l525L138q123J335Q695J1063r96
4451F42o302q011j959K914j391k704o388L531K1061O761j5594j1869J6928J3257
4437A0876J5423n484n211o269o489j5835p734m309P85J2736J5386K552J1410q480
$$ y = [23942, 9410, -5253, -13772, -3321, 3311, -2350, -6364, -9239, 1344, 7525, 6240, 11737, 4983, 422, 3160, 8437, 11302, 631, -2214, 4802, 5521, 8613, 10829, 5300, 1326, 5891, 6788, 7392, 5792, 6965, 9451, 2545, 6362, 17656, 19768, 16509, 15118, 14833, 16303, 10279, 12253, 15811, 7631, -610, -7086, -7930, -13096, -14060, -7317, -7391, -1962, -4730, -8444, -2588, -7448, -4364, 569, 1968, 4727, 18957, 5788, -6631, -3902, -10135, -8245, -4757, -1391, -3235, 4436, 11220, 15286, 17723, 19642, 15311, 5346, -10895, -23579, -18851, -6776, 1114, 4195, 2635, -10945, -14470, -11332, -19455, -18120, -9425, 1638, 642, -5660, -13671, -15630, -12716, -14107, -16811, -23199, -19668, 1393, 8154, -7440, -19309, -2381, 10876, 26299, 20815, 15604, 9335, 2846, -12989, -20723, -25032, -24247, -11511, 3875, 6427, 17837, 9357]
4423I357j1392L734O572o92J369J1160j192p439j4840J0008p212m314J0323K665
4409H107j3487O00J5596K79j379m648N492K606l146m514o642o244j606K62P385
4394a339q881Q654P193n429l74J563k572j770M673l65m698m117p380P85R082R816
4378D841j1207j2061O623L612r441P809R807r87k50K872o34j5760j3166J1453
4364a6489J2708K533o79qj624L904J0092L99j020j0178n167J0314N341l314j2591
4349e779m79K72n016N530J944N025L309n57k442M661m07M814k199r549k616N167
4333A678J934q636L558n61M84l668k485R67J1951m186M754Q292L04j0484M914
4318H816J1182k127l113N042m762q720K015l26k624n847P314l599k980m738J452
$$ y = [9357, -2035, 1699, 8271, 7579, 8948, 20108, 18916, 11477, -3363, 6645, -567, -4881, 5442, 8107, -5380, -4780, 10816, 11095, 9716, 5068, 10560, 13166, 10020, 5506, -1136, -7380, -8986, -8724, -1339, -10220, -1566, 5627, 198, -176, 1387, -1185, -2955, 1718, 1353, -3345, -7462, -14842, -14057, -4975, 4841, -6366, -18427, -11804, -8192, -17633, -9824, -17, -1004, -1254, 1618, 984, -14776, -27942, -16489, -3781, -1248, -1927, -1935, -3559, 345, 10437, 10836, 9816, -362, -5529, 4785, 10126, 6812, -5779, -6258, -5986, -11002, -5472, -3528, 1497, 4806, 4249, 1807, 6468, 6061, 10875, 8676, -873, -3489, 1678, 3612, -5024, -1466, -2027, -1543, -5211, -7696, -6729, 5222, 1036, 5790, 14082, 14386, 3902, 8816, 19998, 17871, 14758, 19800, 15038, 6318, 8333, 8007, 5383, -464, 6850, 3251, 271, -4467, -3015]
4303c015K490J610j0257L901J3992L305l912r090M359j05m186l210o97J552M672
4288A409N401M643j990j3285n948J037N652O383K18p350j1234N241J1496M442
4274F115j875O376J188n218N428K075K180R43r394q789N700Q869K687r701m92
4259F092J0365P064m917q468O66o00J3124m848o510j1523l065j602P661o831n539
4244h931O823n80J2375j364r33L077j567n953O298j0315k595K518O123l327K206
4229C855n332K063K300N48J687n50q271n978k011J0165N160Q227j0248k2374j2327
4214c3086J934J5250J6842P210o869n645J905J406k108J642n89l1P478p20J69
4199D788k113P077n12J410l917o612J1379j09j1456N842j530l248m129J0920P261
$$ y = [-3015, -525, 1085, -9172, -5271, 8721, 12026, 8114, -976, 3383, 3278, -908, -4118, -4815, -3263, 1409, 6810, 11453, 9463, -3822, -9770, -8733, -3081, 3302, 3520, -3830, -15064, -9823, 1673, 6115, 4240, 10616, 11804, 6586, 12014, 14089, 16269, 17212, 7818, -971, 4729, 13598, 16285, 6584, 6092, 16457, 23521, 18604, 10136, 10802, 10202, 23326, 18478, 11968, 445, -2620, -4222, 3439, -3392, -8931, -2108, -2688, 9687, 8323, 7390, 10467, 8900, 2947, 9245, -1070, -3665, -1147, 4976, 1649, 3855, -1477, 586, 2886, 3434, 5121, 4571, -3700, -9678, -11689, -1524, 3636, 11863, 1615, -20759, -33086, -31152, -15902, 940, 8150, 1281, -4364, -2459, -1053, -3161, -1519, -2108, -2139, 5339, 4619, 4788, 2675, 9752, 9240, 10650, 6733, 121, 11500, 11391, -65, 5777, 4247, 999, -3130, 7790, 15051]
$$ [...]
##END NTUPLES=NMR SPECTRUM
##END=
