##TITLE=Analysis number 320214
Compound Code km 07609
Project Code adrs
Chemist Name prosynth
##JCAMPDX= 6.0         $$ Bruker NMR JCAMP-DX V2.0
##DATA TYPE= NMR SPECTRUM
##DATA CLASS= NTUPLES
##ORIGIN= Bruker BioSpin GmbH
##OWNER= nmr
$$ XWIN-NMR		Version 3.5
$$ Mon Jun 19 08:33:39 2006 GMT Daylight Time (UT+1h)  MAYBRIDGE\nmr@NMR_250MHZ
##.OBSERVE FREQUENCY= 250.131544655141
##.OBSERVE NUCLEUS= ^1H
##.ACQUISITION MODE= SIMULTANEOUS (DQD)
##.ACQUISITION SCHEME= undefined
##.AVERAGES= 16
##.DIGITISER RES= 18
##SPECTROMETER/DATA SYSTEM= dpx250
##.PULSE SEQUENCE= zg30
##.SOLVENT NAME= DMSO
##.SHIFT REFERENCE= (INTERNAL, DMSO, 0, 16.522)
##AUDIT TRAIL= $$ (NUMBER, WHEN, WHO, WHERE, WHAT)
$$ ##TITLE= Audit trail, XWIN-NMR		Version 3.5
$$ ##JCAMPDX= 5.01
$$ ##ORIGIN= Bruker BioSpin GmbH
$$ ##OWNER= nmr
$$ C:\u/data/dgb/nmr/ADRS/940/pdata/1/auditp.txt
$$ ##AUDIT TRAIL=  $$ (NUMBER, WHEN, WHO, WHERE, WHAT)
(   1,<2006-06-19 08:33:17.65 +100>,<MAYBRIDGE\nmr>,<NMR_250MHZ>,
      <created by zg, POWCHK disabled, PULCHK disabled
       configuration hash MD5:
       E2 DF 36 D8 04 B2 41 60 5A D7 A3 38 5A 4B D0 FE
       data hash MD5: 64K
       AD C7 17 46 F9 17 56 05 CB 71 22 28 78 A0 75 8B>)
(   2,<2006-06-19 08:33:31.43 +100>,<MAYBRIDGE\nmr>,<NMR_250MHZ>,
      <Start of raw data processing
       ef LB = 0.3 FT_mod = 6 PKNL = 1 SI = 32K 
       data hash MD5: 32K
       59 18 F2 50 7F 40 C1 76 4D BC CF 70 FB C5 81 87>)
(   3,<2006-06-19 08:33:33.03 +100>,<MAYBRIDGE\nmr>,<NMR_250MHZ>,
      <apk 
       data hash MD5: 32K
       35 86 94 7B 3E FA 9B AE 6F 5F 20 64 A3 B8 EC 34>)
(   4,<2006-06-19 08:33:33.78 +100>,<MAYBRIDGE\nmr>,<NMR_250MHZ>,
      <abs ABSG = 5 
       data hash MD5: 32K
       B1 5C C5 43 C1 A2 C1 0C F7 0F D5 C8 B9 BE 22 51>)
$$ ##END=
$$ 
$$ hash MD5
$$ 29 67 32 D2 BB 63 3D 75 EA D4 8C 70 38 ED 59 2D
##$RELAX= 
##$RELAX= 
##$RELAX= 
##$RELAX= 
##$RELAX= 
##$RELAX= 
##$RELAX= 
$$ Bruker specific parameters
$$ --------------------------
##$DU= <C:\u>
##$EXPNO= 940
##$NAME= <ADRS>
##$PROCNO= 1
##$TYPE= <nmr>
##$USER= <dgb>
##$AMP= (0..31)
100 100 100 100 100 100 100 100 100 100 100 100 100 100 100 100 100 100 
100 100 100 100 100 100 100 100 100 100 100 100 100 100 
##$AQSEQ= 0
##$AQ_mod= 3
##$AUNM= <au_zg>
##$AUTOPOS= <5 >
##$BF1= 250.13
##$BF2= 250.13
##$BF3= 250.13
##$BF4= 250.13
##$BF5= 500.13
##$BF6= 500.13
##$BF7= 500.13
##$BF8= 500.13
##$BYTORDA= 1
##$CFDGTYP= 0
##$CFRGTYP= 5
##$CHEMSTR= <none>
##$CNST= (0..31)
1 1 145 1 1 1 1 1 1 1 1 1 1 1 1 1 1 1 1 1 1 1 1 1 1 1 1 1 1 1 1 1 
##$CPDPRG= <>
##$CPDPRG1= <>
##$CPDPRG2= <>
##$CPDPRG3= <>
##$CPDPRG4= <mlev>
##$CPDPRG5= <mlev>
##$CPDPRG6= <mlev>
##$CPDPRG7= <mlev>
##$CPDPRG8= <mlev>
##$CPDPRGB= <>
##$CPDPRGT= <>
##$D= (0..31)
0 1 0 0 0 0 0 0 0 0.06 0 0 0 0 0 0 0.0002 0 0 0 0 0 0 0 0 0 0 0 0 0 0 
0 
##$DATE= 1150702396
##$DBL= (0..7)
120 120 120 120 120 120 120 120 
##$DBP= (0..7)
150 150 150 150 150 150 150 150 
##$DBP07= 0
##$DBPNAM0= <>
##$DBPNAM1= <>
##$DBPNAM2= <>
##$DBPNAM3= <>
$$ [...]
##$SUBNAM7= <"">
##$SUBNAM8= <"">
##$SUBNAM9= <"">
##$SW= 20.6930455092707
##$SWIBOX= (0..15)
0 0 3 0 0 0 0 0 0 0 0 0 0 0 0 0 
##$SW_h= 5175.983436853
##$TD= 65536
##$TD0= 1
##$TE= 295.16
##$TE2= 300
##$TE3= 300
##$TEG= 300
##$TL= (0..7)
0 120 120 120 120 120 120 120 
##$TP= (0..7)
150 150 150 150 150 150 150 150 
##$TP07= 0
##$TPNAME0= <>
##$TPNAME1= <>
##$TPNAME2= <>
##$TPNAME3= <>
##$TPNAME4= <>
##$TPNAME5= <>
##$TPNAME6= <>
##$TPNAME7= <>
##$TPOAL= (0..7)
0.5 0.5 0.5 0.5 0.5 0.5 0.5 0.5 
##$TPOFFS= (0..7)
0 0 0 0 0 0 0 0 
##$TUNHIN= 0
##$TUNHOUT= 0
##$TUNXOUT= 0
##$USERA1= <user>
##$USERA2= <user>
##$USERA3= <user>
##$USERA4= <user>
##$USERA5= <user>
##$V9= 5
##$VALIST= <valist>
##$VCLIST= <CCCCCCCCCCCCCCC>
##$VD= 0
##$VDLIST= <DDDDDDDDDDDDDDD>
##$VPLIST= <PPPPPPPPPPPPPPP>
##$VTLIST= <TTTTTTTTTTTTTTT>
##$WBST= 1024
##$WBSW= 4
##$XGAIN= (0..3)
0 0 0 0 
##$XL= 0
##$YL= 0
##$YMAX_a= 326054
##$YMIN_a= -583863
##$ZGOPTNS= <>
##$ZL1= 120
##$ZL2= 120
##$ZL3= 120
##$ZL4= 120
##$ABSF1= 16.522
##$ABSF2= -4.171173
##$ABSG= 5
##$ABSL= 3
##$ALPHA= 0
##$AQORDER= 0
##$ASSFAC= 0
##$ASSFACI= 0
##$ASSFACX= 0
##$ASSWID= 0
##$AUNMP= <proc_1d>
##$AZFE= 0.1
##$AZFW= 0.1
##$BCFW= 0
##$BC_mod= 0
##$BYTORDP= 0
##$COROFFS= 0
##$CY= 12.5
##$DATMOD= 1
##$DC= 0
##$DFILT= <>
##$DTYPP= 0
##$F1P= 14.0000005364418
##$F2P= -0.99999901652339
##$FCOR= 0.5
##$FTSIZE= 32768
##$FT_mod= 6
##$GAMMA= 0
##$GB= 0
##$INTBC= 1
##$INTSCL= 1
##$ISEN= 128
##$LB= 0.3
##$LEV0= 0
##$LPBIN= 0
##$MAXI= 10000
##$MC2= 0
##$MEAN= 0
##$ME_mod= 0
##$MI= 0
##$NCOEF= 0
##$NC_proc= -5
##$NLEV= 6
##$NOISF1= 0
##$NOISF2= 0
##$NSP= 0
##$NTH_PI= 0
##$NZP= 0
##$OFFSET= 16.522
##$PC= 1
##$PHC0= 168.5942
##$PHC1= 4.010824
##$PH_mod= 1
##$PKNL= yes
##$PPARMOD= 0
##$PSCAL= 4
##$PSIGN= 0
##$REVERSE= no
##$SF= 250.13
##$SI= 32768
##$SIGF1= 0
##$SIGF2= 0
##$SINO= 400
##$SIOLD= 32768
##$SREGLST= <1H.DMSO>
##$SSB= 0
##$STSI= 32768
##$STSR= 0
##$SW_p= 5175.98343685301
##$SYMM= 0
##$S_DEV= 0
##$TDeff= 65536
##$TDoff= 0
##$TI= <Analysis number 999999
Compound Code 99
Book Reference 9
Project Code 9>
##$TILT= no
##$TM1= 0
##$TM2= 0
##$TOPLEV= 0
##$USERP1= <user>
##$USERP2= <user>
##$USERP3= <user>
##$USERP4= <user>
##$USERP5= <user>
##$WDW= 1
##$XDIM= 32768
##$YMAX_p= 477138695
##$YMIN_p= -777971
$$ End of Bruker specific parameters
$$ ---------------------------------
##NTUPLES= NMR SPECTRUM
##VAR_NAME=  FREQUENCY,     SPECTRUM/REAL,   SPECTRUM/IMAG
##SYMBOL=    X,             R,               I
##VAR_TYPE=  INDEPENDENT,   DEPENDENT,       DEPENDENT
##VAR_FORM=  AFFN,          ASDF,            ASDF
##VAR_DIM=   32768,         32768,           32768
##UNITS=     HZ,            ARBITRARY UNITS, ARBITRARY UNITS
##FACTOR=    0.157963299565203, 1,           1
##FIRST=     4132.6476996994, 0,             0
##LAST=      -1043.33573715361, 0,           0
##MIN=       -1043.33573715361, -777971,     0
##MAX=       4132.6476996994, 477138695,     0
$$ Real data points
##PAGE= N=1
##DATA TABLE= (X++(R..R)), XYDATA
$$ [...]
16896B9962609k219119j772129j552231j413152j227939r27695j032334j013321
$$ 29962609 27743490 25971361 24419130 23005978 21778039 20850344 19818010 18804689
16888A8804689j091511r29890p07928n85021o10161n63798n31245m72827n63633
$$ 18804689 17713178 16783288 16075360 15490339 14880178 14316380 13785135 13312308 12748675
16879A2748675p49602n67778j88236l47822l95722m92210m57722Q006k34225m70932
$$ 12748675 11999073 11431295 11243059 10895237 10499515 10007305 9549583 9557589 9323364 8852432
16869H852432l25644j5040l35999k13854r4139k30569k62815l76545l28077k36348
$$ 8852432 8526788 8511748 8175749 7961895 7867756 7637187 7374372 6997827 6669750 6433402
16859F433402k64854k87005k00845r1827r9907j79998k86035j46023P6592j973
$$ 6433402 6168548 5881543 5680698 5588871 5488964 5308966 5022931 4876908 4953500 4951527
16849D951527k45984r3594P1093r3450k4308M7899j76k57034n2739q3820m26191
$$ 4951527 4705543 4611949 4683042 4589592 4565284 4613183 4613007 4355973 4303234 4219414 3793223
16838C793223j70511j05117r884r7829k42758r1994j16952J25722J11981l6617
$$ 3793223 3622712 3517595 3507711 3409882 3167124 3075130 2958178 3083900 3195881 3159264
16828C159264j55472k63709j14708p5768j63469J94364K03766N541j56663j36858
$$ 3159264 3003792 2740083 2625375 2549607 2386138 2580502 2784268 2789809 2633146 2496288
16818B496288j94357j83988J1683J42685j58885l24514q6637j6424j20378Q6527
$$ 2496288 2301931 2117943 2129626 2272311 2113426 1788912 1702275 1685851 1565473 1652000
16808A652000J2344K8212m7585L3033J3097o9608q1578j86913J25645J9268j05711
$$ 1652000 1664344 1692556 1644971 1678004 1691101 1621493 1539915 1353002 1478647 1497915 1392204
16797A392204m4576o942m3644r7808R0518k4889K7030j59692j20420J45809q8415
$$ 1392204 1347628 1340686 1297042 1199234 1289752 1264863 1291893 1132201 1011781 1157590 1069175
16786A069175j09413M396K12857J81251r3668k23372o2516K13543j34179m14168
$$ 1069175 959762 964158 1177015 1358266 1264598 1041226 978710 1192253 1058074 643906
16776F43906J2537J68654q229k82910K8659J32875r8197j52464J48032q030j07619
$$ 643906 656443 825097 816868 533958 562617 695492 597295 444831 592863 584833 477214
16765D77214m8638J70501N2979k20561k31209K77469L15058k16469o141K8286
$$ 477214 428576 599077 652056 431495 200286 477755 792813 576344 570203 598489
16755E98489l1982j08378J00280J9090N5365j00022m2996J58602r9520j22139
$$ 598489 566507 458129 558409 577499 632864 532842 489846 648448 548928 426789
16745D26789J1435m7977j4261N3238J11587p351p6206j03679K43292M1891j00599
$$ 426789 438224 390247 375986 429224 540811 533460 457254 353575 596867 638758 538159
16734E38159j08122L9045k08385j57257K66753q7061q7015O4492k5864J43635
$$ 538159 430037 469082 260697 103440 370193 283132 196117 260609 234745 378380
16724C78380Q9334r0567j75566k33890o6653J23046J65730j46040J05558L51067
$$ 378380 467714 377147 201581 -32309 -98962 24084 189814 43774 149332 500399
16714E00399J37275k2687k07802l5759J01544J35602l6187k3258K1328J70539
$$ 500399 637674 614987 407185 371426 472970 608572 572385 549127 570455 740994
16704G40994j46284l01850j21335K937J99383K00141j31878q0247o6986J29731
$$ 740994 594710 292860 171525 174462 373845 573986 442108 361861 294875 424606
16694D24606o8939j64649j658K7684o6357P890P7833j08444p7667L08480J92859
$$ 424606 355667 191018 189360 217044 150687 158577 236410 127966 50299 358779 551638
16683E51638J05268k87549m0235K2580k10658j25330O2858M0518k1904J7869K03064
$$ 551638 656906 369357 329122 351702 141044 15714 78572 119090 97186 115055 318119
16672C18119L1745q3385j23458M0282J00860K3442O8635M9756J3526J1316o4505
$$ 318119 349864 266479 143021 183303 284163 307605 376240 425996 439522 450838 386333
16661C86333M3198J03183j12017j12240J4443J69963N960j17502J93935l3582
$$ 386333 429531 532714 420697 308457 322900 492863 498823 381321 575256 541674
16651E41674j83019P913J5436j85232j15070K7296n6447j24810n2298k4089Q6372
$$ 541674 358655 366568 382004 196772 81702 108998 52551 -72259 -124557 -148646 -62274
16640f2274J30029P0365N3761o4268j31492l1172K62954J33158j76629q4963j60023
$$ -62274 67755 138120 191881 127613 -3879 -35051 227903 361061 184432 99469 -60554
16629f0554j05264J29600J84062J67074R9866P546O9944L7812P289j23197j26826
$$ -60554 -165818 -36218 147844 314918 414784 422330 492274 530086 537375 414178 287352
16618B87352P8774J5657j79047k06745K65331P6441k53707j23060o3289J21865
$$ 287352 366126 381783 202736 -4009 261322 337763 84056 -39004 -102293 19572
16608A9572L66726k6433n7845l1634r1059j53295J03431q172N4610K9304l4849
$$ 19572 386298 359865 302020 270386 179327 26032 129463 121291 175901 205205 170356
16597A70356j54337j65778k2031k4829J92066O9250p1445r0322N8614J57775M995
$$ 170356 16019 -149759 -171790 -196619 -4553 64697 -6748 -97070 -38456 119319 124314
16586A24314k0330j08595J00405M9572j91083j35514M4503J56280j14713l1246
$$ 124314 103984 -4611 95794 145366 -45717 -181231 -136728 19552 -95161 -126407
16576a26407r2404O0839J14071k14040L9356o574J63970j16868m2081J35385Q3728
$$ -126407 -218811 -157972 -43901 -257941 -218585 -225159 -61189 -178057 -220138 -84753 -1025
16565a025j04095j07944L9246p6559L2161J94841j59458l6412o2080L2559O1096
$$ -1025 -105120 -213064 -173818 -250377 -218216 -23375 -182833 -219245 -281325 -248766 -187670
16554a87670o7000n2531J185J55940m2849J58826K48325J12643j45293k22715
$$ -187670 -254670 -307201 -306016 -150076 -192925 -34099 214226 326869 181576 -41139
16544d1139Q8449J44022r1022o3990j78176j86337M0544J44173L380K72152J05445
$$ -41139 47310 191332 100310 36320 -141856 -328193 -287649 -143476 -140096 132056 237501
16533B37501j49704k72760r8836K61783K26529P3057j16846P7148k5506q3364
$$ 237501 87797 -184963 -283799 -22016 204513 277570 160724 237872 212366 129002
16523A29002l1782j51788P6631j71437J41384L0361j34614Q0365N139K03183J29460
$$ 129002 97220 -54568 22063 -149374 -7990 22371 -112243 -31878 -26739 176444 305904
16512C05904m9846k2932J60639P2717k1800q2718O353l1904N294l12970o7253
$$ 305904 256058 233126 393765 466482 444682 361964 368317 336413 341707 28737 -38516
16501c8516K02348j9394M4139N6261o746N2097J90985r3998l953O4909o4821k83532
$$ -38516 163832 144438 188577 244838 238092 290189 481174 387176 383223 448132 383311 99779
16489I9779l186j447j18933j13052R9934l1741k27362j31629j11929l6962K70564
$$ 99779 96593 95146 -23787 -136839 -36905 -68646 -296008 -427637 -539566 -576528 -305964
16478c05964J41854J77574j50804j06513J66478R7491K48211n2252q4906L4082
$$ -305964 -164110 13464 -137340 -243853 -77375 20116 268327 216075 131169 165251
16468A65251j22185M4218p9858R8149Q270r6803J59987O8007p48J6961j0220J56553
$$ 165251 43066 87284 7426 105575 113845 17042 177029 245036 244288 261249 251029 407582
16456D07582K8787q2115q9837J21458q3393p2945j4834M4696J70752J02821j33947
$$ 407582 436369 354254 264417 385875 302482 229537 214703 259399 430151 532972 399025
16445C99025k3018K879l2086K07028l0455J6543l7746j61024q0581j71358J05582
$$ 399025 376007 378886 346800 553828 523373 539916 502170 341146 260565 89207 194789
16434A94789J34506l2299K7809K06730j54211o9485K79398P984j8649K42217o6898
$$ 194789 329295 296996 324805 531535 377324 307839 587237 595221 576572 818789 751891
16423G51891r8963j4179J79569J14158k06157p3183J40475R825O115k02130o9797
$$ 751891 652928 638749 818318 932476 726319 653136 793611 803436 809551 607421 537624
16412E37624J47715P6562k36113j26465N1711O7181j54624J2221R2802J3322j19394
$$ 537624 685339 761901 525788 399323 451034 518215 363591 375812 468614 481936 362542
16401C62542M5292r0412j03503R4944q9993O6988j4655O931N1964r1869k28938
$$ 362542 407834 317422 213919 308863 218870 285858 271203 278134 330098 238229 9291
16390I291j17514J51416K23613M3940r4267j19979n3640n463j2902n5496O177
$$ 9291 -108223 43193 266806 310746 216479 96500 42860 37397 24495 -31001 -24824
16379b4824O44j29192J2458J90117M2185r6940K280R6842N1811n1594r5147j4477
$$ -24824 -24180 -153372 -140914 49203 91388 -5552 -3272 93570 145381 93787 -1360 -15837
16367a5837J78803J23943M7675J36647k5722j76318n7999j23560K39212K3424
$$ -15837 162966 286909 334584 471231 445509 269191 211192 87632 326844 350268
16357C50268L8811q5815P012o47r8306J79387p851R0299J03637L0229j60184j88803
$$ 350268 389079 303264 310276 309629 211323 390710 382859 473158 576795 607024 446840 258037
16345B58037q2207j36930j25840O4942J11016J42925R8161l0456k02902k43727
$$ 258037 175830 38900 -86940 -21998 89018 231943 330104 299648 96746 -146981
16335a46981J08639O1690n2021l4585k7286J09665N2389m1347K6293j01085N5184
$$ -146981 -38342 23348 -28673 -63258 -90544 19121 71510 30163 56456 -44629 10555
16324A0555j98676N0140O0726j0053K7025J73666j46383l52112j20547J96121
$$ 10555 -188121 -137981 -77255 -87308 -60283 113383 -33000 -385112 -505659 -309538
16314c09538L9418J31250Q9218J12339k26008q1923M5075K71408J20019j14424
$$ -309538 -270120 -138870 -49652 62687 -163321 -245244 -200169 71239 191258 76834
16304G6834j27925J43465j35440l37726K026K8729M7074J76339J59769m4363O0791
$$ 76834 -51091 92374 -43066 -380792 -378766 -350037 -302963 -126624 33145 -11218 49573
16293D9573N5501k50858n1407J32074M1092j70563n8095k15443Q5126N2049K3158
$$ 49573 105074 -145784 -197191 -65117 -24025 -194588 -252683 -468126 -383000 -330951 -307793
16282c07793L4331J05954J51872K8068R2657J64716l3946j84071k93061j42708
$$ -307793 -273462 -167508 -15636 12432 105089 269805 235859 51788 -241273 -383981
16272c83981J19434l4634R8147p7109M5291N3699N9963q7018l3142k0560J03834
$$ -383981 -264547 -299181 -201034 -278143 -232852 -179153 -119190 -206208 -239350 -259910 -156076
16261a56076k5374J12368K7258n8862Q331J22151R2229l955j70493o0372l4073
$$ -156076 -181450 -69082 -41824 -100686 -92355 29796 122025 118070 -52423 -112795 -146868
16250a46868n967k32377K56538K35035p0032j40965j9383q9370J6851M1931Q2207
$$ -146868 -152835 -385212 -128674 106361 36329 -104636 -124019 -213389 -196538 -154607 -72400
16239g2400N9734J58668J28443Q7148N4682k51767l5776p9903q8451j609j19260
$$ -72400 -12666 146002 274445 361593 416275 164508 128732 48829 -39622 -41231 -160491
16228a60491k08261J35859L9697p2782k6547j51164p6729J17819K71940J35114
$$ -160491 -368752 -232893 -193196 -265978 -292525 -443689 -520418 -402599 -130659 4455
16218D455k6518L1699R5987j9722j22136j32988L18279J29121j69888j19137r4083
$$ 4455 -22063 9636 105623 85901 -36235 -169223 149056 278177 108289 -10848 -104931
16207a04931j16266P6126J45270P61N6039K8425o4251n3627l8208K01680k65388
$$ -104931 -221197 -145071 199 960 56999 85424 21173 -32454 -70662 131018 -134370
16196a34370p109K12231J27095r0793j18497k62150j01332l4163J17635N2955
$$ -134370 -141479 70752 197847 107054 -11443 -273593 -374925 -409088 -291453 -238498
16186b38498J13477K58058L9332l26877j37942l586k5745J4611p1769K8061q1425
$$ -238498 -125021 133037 172369 -154508 -292450 -296036 -321781 -307170 -378939 -350878 -432303
16175d32303J33189J69360J27652O1792j07620j03798k01401k3589K4578J9298
$$ -432303 -299114 -129754 -2102 59690 -47930 -151728 -353129 -376718 -352140 -332842
16165c32842J24289J65009n3593J9927J72577N0862L4837J69584r8565l09714
$$ -332842 -208553 -43544 -97137 -77210 95367 146229 181066 350650 252085 -57629
16155e7629q9381M6865J47384o3222N2309j27954j61298J02803l2780j37798J44683
$$ -57629 -147010 -100145 47239 -15983 36326 -91628 -252926 -150123 -182903 -320701 -176018
16144a76018J86273L06299N6969j56053j25033R9462J5753k39429k46077J0199
$$ -176018 10255 316554 373523 217470 92437 191899 207652 -31777 -277854 -267655
16134b67655m9816j64217n7004J89157L0704n6151J20076j61352o4447J49439
$$ -267655 -317471 -481688 -538692 -349535 -318831 -374982 -254906 -416258 -480705 -331266
16124c31266J36392j43105P9455m4203l2111K705K17472J21097J07105L4094j35260
$$ -331266 -194874 -337979 -258524 -302727 -334838 -332133 -114661 6436 113541 147635 12375
16113A2375k65230m0978J79280m6647k77174j1212J59263j08054L6722J62211
$$ 12375 -252855 -293833 -114553 -161200 -438374 -449586 -290323 -398377 -361655 -199444
16103a99444J10005k9708p9817J27093p9251p58J05357J88625j4567n4210k2446
$$ -199444 -89439 -119147 -198964 -71871 -151122 -151880 -46523 142102 127535 73325 50879
16092E0879J17708j49140j01901J40683j0576o7385q4258Q6859k9328r1409j58586
$$ 50879 168587 19447 -82454 58229 47653 -19732 -103990 -17131 -46459 -137868 -296454
16081b96454o4085Q1647k9372K7679j9410K79427J46206k55623k15709l7060r2354
$$ -296454 -360539 -278892 -308264 -280585 -299995 -20568 125638 -129985 -345694 -382754 -475108
16070d75108m405Q3569P3026K6343J11058k7855n2419J66882J79095M6187k4736
$$ -475108 -479513 -395944 -322918 -296575 -185517 -213372 -265791 -98909 80186 126373 101637
16059A01637n333m916m2816j38652k9708q0087k08132j11904j4487K39249n5895
$$ 101637 96304 91388 48572 -90080 -119788 -199875 -408007 -519911 -534398 -295149 -351044
16048c51044p7173J06666J83697J02471J22812j41j13401p7160o9140J2446p2793
$$ -351044 -428217 -321551 -137854 -35383 87429 87288 -26113 -103273 -172413 -159967 -232760
16037b32760l1723J13866J75166J00837n7362j26654j06177k77184J42277J88694
$$ -232760 -264483 -150617 24549 125386 68024 -58630 -164807 -441991 -299714 -111020
16027a11020k40098j7153R0312N0419K1829j57204j03429J29104K25942J84146
$$ -111020 -351118 -368271 -277959 -227540 -205711 -362915 -466344 -337240 -111298 72848
16017G2848m622L2428q5265Q08n2530j71971J10100K00877j76765j27171n8331
$$ 72848 68226 100654 15389 16197 -36333 -208304 -98204 102673 -74092 -201263 -259594
16006b59594J28952J32214k36786K8685J57089P6537j87746j6728p8028J51994
$$ -259594 -130642 1572 -235214 -206529 -49440 27097 -160649 -177377 -255405 -103411
15996a03411J78323j9236k29555K8240R5855M6362P8994K8386r1612j86778j71807
$$ -103411 74912 55676 -173879 -145639 -49784 -3422 75572 103958 12346 -174432 -346239
15985c46239O6411N2167j3916o8694J14135K27772o9933j18548j03356N875J74096
$$ -346239 -279828 -227661 -241577 -310271 -196136 31636 -38297 -156845 -260201 -254326 -80230
15974h0230r2910k02173J33361J95179n0027m5072L2919J53324k38271k93405
$$ -80230 -173140 -375313 -241952 -46773 -96800 -141872 -108953 44371 -193900 -487305
15964d87305n2501m8122m2840Q3384K12704k6416M5244P1448J13278m941o400
$$ -487305 -539806 -587928 -630768 -547384 -334680 -361096 -315852 -244404 -131126 -136067 -142467
15953a42467J06965R3144J0212j80046k92286j27396J44869K77526K34026M4567
$$ -142467 -35502 57642 67854 -112192 -404478 -531874 -387005 -109479 124547 169114
15943A69114j99527k85945p4028R0642K37898J64460n1298k08627j89479L9746
$$ 169114 -30413 -316358 -390386 -299744 -61846 102614 51316 -157311 -346790 -307044
15933c07044j6351m0667j85061L2301J19760J83616L0310J72791J53706O4725
$$ -307044 -323395 -364062 -549123 -516822 -397062 -213446 -183136 -10345 143361 208086
15923B08086j41062n1631p008J22315l4266j68889k9867j0342j63578o0118J30340
$$ 208086 67024 15393 8385 130700 96434 -72455 -102322 -112664 -276242 -336360 -206020
15912b06020J36790n15n0924J10342m2372J31878k63264r4982M8659O139R9001
$$ -206020 -69230 -69745 -120669 -10327 -52699 79179 -184085 -279067 -230408 -224269 -125268
15901a25268K4237m0156k53894j81846O6083M4307K5422l5834P3500J45749J41626
$$ -125268 -101031 -141187 -395081 -576927 -510844 -466537 -441115 -476949 -403449 -257700 -116074
15890a16074N5820J89282r8209k34657N1572p2804j50568r664J84649m8706j71095
$$ -116074 -60254 129028 30819 -203838 -152266 -225070 -375638 -385302 -200653 -249359 -420454
15879d20454K01499K14328n5443j73794J21398L6242k04812o4669j5929k2481
$$ -420454 -218955 -4627 -60070 -233864 -112466 -76224 -281036 -345705 -361634 -384115
15869c84115L7267K06492K18775k8231N1K6511R8880l1514j52307j79135K0196
$$ -384115 -346848 -140356 78419 50188 50239 76750 175630 144116 -8191 -187326 -167130
15858a67130m4421q8197j44139L3734J13016K83922M5293l9021J0458K60288j05662
$$ -167130 -211551 -299748 -443887 -410153 -297137 -13215 32078 -6943 3515 263803 158141
15847A58141j85351k08979p4889N972Q0527L1786j29139o3024j1861K3542J39210
$$ 158141 -27210 -236189 -311078 -305106 -224579 -192793 -321932 -384956 -396817 -373275 -234065
15836b34065J31504k1666j45968p7045R2311l7494K8094J869j7186J72898P7504
$$ -234065 -102561 -124227 -270195 -347240 -254929 -292423 -264329 -262460 -279646 -106748 -29244
15825b9244K82961n7360j41009k62972k50775P9919J66702j38678J10789M1487
$$ -29244 253717 196357 55348 -207624 -458399 -378480 -211778 -350456 -239667 -198180
15815a98180l0550L4807L8727K7020q5510m8538J3278J69764L7022o8067p8005
$$ -198180 -228730 -193923 -155196 -128176 -213686 -262224 -248946 -79182 -42160 -110227 -188232
15804a88232j50262R5651K51480n0621m9436p8608J03070j774p6818j39800J6245
$$ -188232 -338494 -242843 8637 -41984 -91420 -170028 -66958 -68732 -145550 -285350 -269105
15793b69105J13576M0132r3848j53215o567P0137R424j6433k3731J31599O4369
$$ -269105 -155529 -115397 -209245 -362460 -369027 -298890 -289466 -305899 -329630 -198031 -133662
15782a33662j33029l3096M7225Q9629j44407J5189J67690O2712r6180j18750M9181
$$ -133662 -266691 -299787 -252562 -162933 -307340 -292151 -124461 -61749 -157929 -276679 -227498
15771b27498L56M7115J52819O20j50052J13731J97419L9905k62856J2773K01956
$$ -227498 -227142 -180027 -27208 -26588 -176640 -62909 134510 174415 -88441 -75668 126288
15760A26288J22933k06855j92813q7299q4049L01481o924l11021k6678J57930
$$ 126288 249221 42366 -150447 -237746 -321795 -20314 -27238 -338259 -364937 -207007
15750b07007L9359M2256L4965L3245L8919k8579R2553J5503k3r3724j06965J08050
$$ -207007 -167648 -125392 -90427 -57182 -18263 -46842 45711 61214 61191 -32533 -139498 -31448
15738c1448J37415J18074J1436m6230q4155j29005k8115j89550m6625J22182j00987
$$ -31448 105967 224041 235477 189247 105092 -23913 -52028 -241578 -288203 -166021 -267008
15727b67008m4810j0961J26669N5348J16635R4310J59490Q932j09500o1948J37020
$$ -267008 -311818 -322779 -196110 -140762 -24127 70183 229673 238605 129105 67157 204177
15716B04177l664j19343p4803k85745k7638K07236J7109k31505L5592P2191Q4504
$$ 204177 200513 81170 6367 -279378 -307016 -99780 -82671 -314176 -278584 -206393 -121889
15705a21889j8537L8415J52389O7713M1751q3383m4738r9640l6118Q5932Q4947
$$ -121889 -140426 -102011 50378 118091 159842 76459 31721 -67919 -104037 -18105 66842
15694F6842m1321j6264j80999K7801K58467K65380n9397l1676l2642o4951j51579
$$ 66842 25521 9257 -171742 -143941 114526 379906 320509 288833 256191 191240 39661
15683C9661j50364r1637R4578q5258P0365j3510J54712P1586j96829Q2813O2470
$$ 39661 -110703 -202340 -107762 -193020 -122655 -136165 18547 90133 -106696 -23883 38587
15672C8587J36623o6434k6180l60L1700Q2930j79041j14781K03269K69412K9896
$$ 38587 175210 108776 82596 82236 113936 196866 17825 -96956 106313 375725 405621
15661D05621j78000k41030j51173R408K07410q922j37282j12220o8767K7333P4384
$$ 405621 227621 -13409 -164582 -155174 52236 43314 -93968 -206188 -274955 -247622 -173238
15650a73238J5992N5766L0218l6222Q0879k8460p1522L210L927M420K15032M4814
$$ -173238 -157246 -101480 -71262 -107484 -26605 -55065 -126587 -123377 -119450 -115030 100002 144816
15638A44816k39227o7376k9020j13414j60091J4811J82627J3598o0522J6397j8313
$$ 144816 -94411 -161787 -190807 -304221 -464312 -449501 -266874 -253276 -313798 -297401 -315714
15627c15714J74668O0694J577M9419n2053R669m0252q8610l09094L8086L24546
$$ -315714 -141046 -80352 -78775 -29356 -81409 -71740 -111992 -200602 -509696 -471610 -147064
15616a47064K9209N701J46010J35290N9726J72773j31397j80948L3706J32221
$$ -147064 -117855 -112154 33856 169146 228872 401645 270248 89300 123006 255227
15606B55227J22361J14209m2813l21963j28585r3810q9460J3010j8551j67468
$$ 255227 377588 491797 448984 127021 -1564 -95374 -184834 -171824 -190375 -357843
15596c57843q6437R8285K2820K23123J49124J48729M0435q5672j54273K5878j0820
$$ -357843 -444280 -345995 -323175 -100052 49072 197801 238236 152564 -1709 24169 13349
15585A3349j92725k84432J9597p3211j41057J39230J13134J45090P0265N5115
$$ 13349 -179376 -463808 -444211 -517422 -658479 -519249 -406115 -261025 -190760 -135645
15575a35645R265L1595j42344o3998J96861J8j28966j05637k7626L7391R7207
$$ -135645 -126380 -94785 -237129 -301127 -104266 -104248 -233214 -338851 -366477 -329086 -231879
15564b31879J6417j5456l2403p5045L6082P9156J12379j26461j54285R3963J70746
$$ -231879 -215462 -230918 -263321 -338366 -302284 -223128 -110749 -237210 -391495 -297532 -126786
15553a26786R2492J9549O4310q9135j62794m0246J5641Q3283J30079L6484J09876
$$ -126786 -34294 -14745 49565 -39570 -202364 -242610 -226969 -143686 -13607 22877 132753
15542A32753j31674j42521K812p607o9852p655J56024l0759k6383J97961J64871
$$ 132753 1079 -141442 -138630 -146237 -216089 -223744 -67720 -98479 -124862 73099 237970
15531B37970J4179r21k20649l87924j84024j01229J20140K92318J31317q4632
$$ 237970 252149 251228 30579 -357345 -541369 -642598 -522458 -230140 -98823 -183455
15521a83455o6982L4978p713j5209N0605m680J28080R9504j07411N949K5106L688
$$ -183455 -250437 -215459 -223172 -238381 -187776 -192456 -64376 35128 -72283 -66334 -41228 -37540
15509c7540j23651j27568K33378K68524J55551j49018k02179o9496R2186L207
$$ -37540 -161191 -288759 -55381 213143 368694 219676 17497 -51999 40187 43394
15499D3394j30983L8769o5822O273L11346J4031q7768O038j4951j63297N2035
$$ 43394 -87589 -48820 -114642 -108369 202977 217008 129240 135278 120327 -42970 9065
15488I065l0593J00314L1457K8944j22589j67452N9309n3097N9729j50511n3104
$$ 9065 -21528 78786 110243 139187 16598 -150854 -91545 -144642 -84913 -235424 -288528
15477b88528J70732Q6903n8196o5997j9681o1509L30699K20970J4102O7683J0517
$$ -288528 -117796 -30893 -89089 -155086 -174767 -236276 94423 315393 329495 397178 407695
15466D07695K460j42047k1860l7345O7977J07366J23412k32018m7387j02147l90818
$$ 407695 410155 268108 246248 208903 276880 384246 507658 275640 228253 126106 -264712
15455b64712k3728J13709N8489K66227q772o9693o7912j07427l31865K60168K00853
$$ -264712 -288440 -174731 -116242 149985 141213 71520 3608 -103819 -435684 -175516 25337
15444B5337p4848m913J73540J52860n8508p2005J61022l3885o3153j07922L2937
$$ 25337 -49511 -54424 119116 271976 213468 141463 302485 268600 205447 97525 130462
15433A30462r0053K7950J5972j5624L2562J8637J20861j4052j9987J17924Q7187
$$ 130462 40409 68359 84331 68707 101269 119906 240767 226715 206728 324652 411839
15422D11839k02360j05821j42668L4751J10589j96334J21228J41210o3497j2188
$$ 411839 209479 103658 -39010 -4259 106330 -90004 31224 172434 108937 96749
15412I6749J74243R9640p8755R5220j41635j53592k16434k02631Q5540K16587
$$ 96749 270992 370632 291877 387097 245462 91870 -124564 -327195 -241655 -25068
15402b5068J91763J45235j78566j80914j8730J34377k7368l2945R5336J08173
$$ -25068 166695 311930 133364 -47550 -66280 68097 40729 7784 103120 211293
15392B11293J91740j19401k13435K31843n9459k7090l948m4706J2628j64723k6430
$$ 211293 403033 283632 70197 302040 242581 215491 211543 166837 179465 14742 -11688
15381a1688K84397m8583P752P392p9303r3753k15099O0413J79651J08794J8360
$$ -11688 272709 224126 231878 239270 159967 66214 -148885 -88472 91179 199973 218333
15370B18333l6501j11449O5531p7500N0314j88738r779R2205K21222q098P05m34172
$$ 218333 181832 70383 135914 58414 108728 -80010 -89789 2416 223638 215540 216245 -217927
15358b17927r6652O0660Q4398L94308M92816Q7859J6936j6650k21306j81194J93301
$$ -217927 -314579 -253919 -169521 224787 717603 805462 822398 805748 584442 403248 596549
15347E96549l3591k21717j95267j34162O5199J96415J77203M973j22703J6329
$$ 596549 562958 341241 145974 11812 77011 273426 450629 455602 332899 349228
15337C49228k40173j8748J28418K21786J24127O3156j89188j58867J05054o0395
$$ 349228 109055 90307 218725 440511 564638 627794 438606 279739 384793 324398
15327C24398K6145o6811o8066r6329L8494Q1913q6248r3277M171K3823K33957
$$ 324398 350543 283732 215666 119337 157831 239744 153496 60219 64390 88213 322170
15316C22170J11678j30297j84534j98605p6900p5843J29515K20411L90710j4633
$$ 322170 433848 303551 119017 -79588 -156488 -232331 -102816 117595 508305 493672
15306D93672o5257J89479J04692k43964l50222j25395J27587J41490R1137J08527
$$ 493672 428415 617894 722586 478622 128400 3005 130592 272082 363219 471746
15296D71746J4924n1390n1929r0007N6393o0883K5122j14524k2692K56454J91013
$$ 471746 486670 435280 383351 293344 349737 288854 313976 199452 176760 433214 624227
15285F24227j24232k25407K06968R1255k8269J61746O5509J23127n5110r6687
$$ 624227 499995 274588 481556 572811 544542 706288 771797 894924 839814 743127
15275G43127K3919K9866J9202o288j59491n3092p682K84509M4887l49772J11791
$$ 743127 767046 796912 816114 809826 650335 597243 589561 874070 918957 569185 680976
15264F80976L02920J01138O320j90617j64729L473j90787N0391J17125J15206
$$ 680976 983896 1085034 1091354 900737 736008 739481 548694 599085 716210 831416
15254H31416J35357j15483n425J08009M1951J47118n5938r2937j23296k028K28029
$$ 831416 966773 851290 845865 953874 995825 1142943 1087005 994068 870772 868744 1096773
15243A096773p569k48280M7019J70288J60061j82344P8783n2625j7861m9651J96136
$$ 1096773 1089204 840924 887943 1058231 1218292 1035948 1114731 1062106 1044245 994594 1190730
15232A190730m7271p3615k3935j02087o4260O2101R7941r0749P0274k6920k09412
$$ 1190730 1143459 1069844 1045909 943822 879562 941663 1039604 948855 1019129 992209 782797
15221G82797l7538J24274J04454j16866k17748K14730J4414j6135K27842j77368
$$ 782797 745259 869533 973987 857121 639373 854103 868517 852382 1080224 902856
15211I02856j46375K09028K637n9569n2291K8103J84834M3104k92964L6198J3903
$$ 902856 756481 965509 968146 908577 856286 884389 1069223 1112327 819363 855561 869464
15200H69464n8039K09114p2920l8115j33478Q6597N2408k0367j2740j36650J64611
$$ 869464 811425 1020539 947619 909504 776026 862623 915031 894664 881924 745274 909885
15189I09885J24604R2780K92519R6788k36213n5087k6386R1196q7642j65589K6122
$$ 909885 1034489 1127269 1419788 1516576 1280363 1225276 1198890 1290086 1202444 1036855 1062977
15178A062977P9641J19927J15781j40261k26564L6588J08807L5236P4520L8569
$$ 1062977 1142618 1262545 1378326 1238065 1011501 1048089 1156896 1192132 1266652 1305221
15168A305221M3499l5139J13225j53854n3385K39619j6440j6789J26791L1678
$$ 1305221 1348720 1313581 1426806 1272952 1219567 1459186 1442746 1425957 1552748 1584426
15158A584426J5115p9859O9075L1793J3356k6869J10668Q8274p7572P7731J95244
$$ 1584426 1599541 1519682 1588757 1620550 1633906 1607037 1717705 1805979 1728407 1806138 2001382
15147B001382m7571j21382K7727J16965R6871K34539k3974j57610O8886K95998
$$ 2001382 1953811 1832429 1860156 1977121 2073992 2308531 2284557 2126947 2195833 2491831
15137B491831N7513N6520J70658j82290l36641Q6625K19287R5749j6885n8760
$$ 2491831 2549344 2605864 2776522 2594232 2257591 2344216 2563503 2659252 2642367 2583607
15127B583607O3098N9100M6611j3327j11472J8638J93202K10895l0453k3573p0268
$$ 2583607 2646705 2705805 2752416 2739089 2627617 2646255 2839457 3050352 3019899 2996326 2926058
15116B926058K5071K4490J41752K96730r372o7990J53931J4907k9978K06539J35025
$$ 2926058 2951129 2975619 3117371 3414101 3404729 3336739 3490670 3505577 3475599 3682138 3817163
15105C817163N8328J7136M6368M720k04737j8058J56732J13283J15995J64532
$$ 3817163 3875491 3892627 3938995 3943715 3738978 3720920 3877652 3990935 4106930 4271462
15095D271462R8690J43555K31352L9424k868o9329K17720J83198J90865K31498
$$ 4271462 4370152 4513707 4745059 4784483 4781615 4712286 4930006 5113204 5304069 5535567
15085E535567K19591J43478j84342p7447J94024K67459J70282K87932J45785J57693
$$ 5535567 5755158 5898636 5714294 5636847 5830871 6098330 6268612 6556544 6702329 6860022
15075F860022J02463K29325K15330K33453K95837K20639J77768J85080K16299
$$ 6860022 6962485 7191810 7407140 7640593 7936430 8157069 8334837 8519917 8736216
15066H736216J26247L56755K70075K20398L33206J59978K13398M18840M31384
$$ 8736216 8862463 9219218 9489293 9709691 10042897 10202875 10416273 10835113 11266497
15057A1266497M12601L51965O60741N48153O33965L82907L85673M97482O90598
$$ 11266497 11679098 12031063 12691804 13239957 13873922 14256829 14642502 15139984 15830582
15048A5830582P54306Q23624Q75840P59781Q57902Q07130O29737J142172J121566
$$ 15830582 16584888 17408512 18284352 19044133 19902035 20709165 21338902 22481074 23602640
15039B3602640J197360J168654J274875J353746J338862J417910J816163K183619
$$ 23602640 24800000 25968654 27243529 28597275 29936137 31354047 33170210 35353829
15031C5353829K149578K225516K521258K560608K754578K933253L206988L601321
$$ 35353829 37503407 39728923 42250181 44810789 47565367 50498620 53705608 57306929
15023E7306929L948293M105809M651398N102702N351732N772396O400042O594641
$$ 57306929 61255222 65361031 70012429 75115131 80466863 86239259 92639301 99233942
15015I9233942P321625P908922Q056210Q270890Q460999Q714538Q928143Q621695
$$ 99233942 106555567 114464489 122520699 130791589 139252588 147967126 156895269 165516964
15007A65516964Q065945P409234O625314N548437M444476K788261J511552n5509
$$ 165516964 173582909 180992143 187617457 193165894 197610370 200398631 201910183 201854674
14999B01854674j544740k929657m297351n322247o273255o871095p494707p937773
$$ 201854674 200309934 197380277 193082926 187760679 181487424 174616329 167121622 159183849
14991A59183849p775376p416117p400754p316229o674699o396568o151172n596917
$$ 159183849 151408473 143992356 136591602 129275373 122600674 116204106 110052934 104456017
14983A04456017n234389n011786m795759m509937m047812l795164l606309l329474
$$ 104456017 99221628 94209842 89414083 84904146 80856334 77061170 73454861 70125387
14975G0125387l306301l129818k891954k687807k615413k434232k090100j966121
$$ 70125387 66819086 63689268 60797314 58109507 55494094 53059862 50969762 49003641
14967D9003641j922225j638050j627358j670497j730735j521417j387212j436292
$$ 49003641 47081416 45443366 43816008 42145511 40414776 38893359 37506147 36069855
14959C6069855j155596j045786j155580j068444j121317j008460q86597j058215
$$ 36069855 34914259 33868473 32712893 31644449 30523132 29514672 28628075 27569860
14951B7569860p94279r68826r03259r04281o16826q03773o21104o24804o64361
$$ 27569860 26775581 25806755 24903496 23999215 23382389 22578616 21957512 21332708 20668347
14942B0668347o34880m94874m00101l93352l79880o50092l55648m10867n64374
$$ 20668347 20033467 19538593 19138492 18745140 18365260 17715168 17359520 16948653 16384279
14933A6384279l96525l06002m77924m07241n28527m21176j18814j20265m43768
$$ 16384279 15987754 15681752 15203828 14796587 14268060 13846884 13728070 13607805 13164037
14924A3164037n10613k48670j97076m00993m63548j69286k88692l98388j88875
$$ 13164037 12653424 12404754 12207678 11806685 11343137 11173851 10885159 10486771 10297896
14915A0297896j28130j57652k40812k91083j61426k51048k56249k40835L0255
$$ 10297896 10169766 10012114 9771302 9480219 9318793 9067745 8811496 8570661 8600916
14906H600916k00575l90543q3717K8198k22551j46312m03240l22387j10265k0208
$$ 8600916 8400341 8009798 7926081 7954279 7731728 7585416 7182176 6859789 6749524 6729316
14896F729316k68926m7390k02284n427R460j84513j19524j38726K9849m2683j30606
$$ 6729316 6460390 6413000 6210716 6205289 6214749 6030236 5910712 5771986 5801835 5759152 5628546
14885E628546o9125k15865k39882r7739J08438q7860m1433j64006k32495m3490
$$ 5628546 5559421 5343556 5103674 5005935 5114373 5026513 4985080 4821074 4588579 4545089
14875D545089o0916q3434n8891j71031j0583M194P3372k00382j28552j5171l05
$$ 4545089 4484173 4400739 4341848 4170817 4160234 4164428 4237800 4037418 3908866 3893695 3893390
14864C893390o9528j06655q5041j75736o8712k17497K5078N4703j35967l89881
$$ 3893390 3823862 3717207 3632166 3456430 3387718 3170221 3195299 3250002 3114035 2724154
14854B724154r9045J34652r7708j56472K7497J14723J0663r2724l0166q113k19571
$$ 2724154 2625109 2759761 2662053 2505581 2533078 2647801 2658464 2565740 2535574 2527461 2307890
14843B307890J9665K75734o7064j27553j24205K547m7492l0938O0794L6847l8829
$$ 2307890 2327555 2603289 2536225 2408672 2284467 2287014 2239522 2208584 2269378 2306225 2267396
14832B267396P8076j19333j29061J10901N232j29117j058j07521m062j95859K25471
$$ 2267396 2345472 2226139 2097078 2207979 2213211 2084094 2083036 1975515 1971453 1775594 2001065
14821B001065R7642l32271j15558j26418K6375J68497N8268M0117J581Q576M2204
$$ 2001065 2098707 1766436 1650878 1524460 1550835 1719332 1777600 1817717 1819298 1827874 1870078
14810A870078r2559K04466L5667j38913n6406l7234J58131J29165p7038k13176
$$ 1870078 1777519 1981985 2017652 1878739 1822333 1785099 1943230 2072395 1995357 1782181
14800A782181k43841j54251j08791J95763J06239k1515M1127J23707J22684r441
$$ 1782181 1538340 1384089 1275298 1471061 1577300 1555785 1596912 1720619 1843303 1833862
14790A833862m0919K3991O186r4456o4421P1221q1398L9525r8163q9723p526k09691
$$ 1833862 1792943 1816934 1823120 1728664 1664243 1735464 1654066 1693591 1595428 1505705 1498179 1288488
14778A288488K400K55989J59343l4446Q7621l8553m820k7589J93927o744j97187
$$ 1288488 1290888 1546877 1706220 1671774 1759395 1720842 1716022 1688433 1882360 1875616 1678429
14767A678429j58085r0392j27869j52258L4594l3619J14566L2181J0061j32636
$$ 1678429 1520344 1429952 1302083 1149825 1184419 1150800 1265366 1297547 1307608 1174972
14757A174972j57203O9212n0091Q8010K52671N5461J9515j90218l6203J12623
$$ 1174972 1017769 1086981 1036890 1124900 1377571 1433032 1452547 1262329 1226126 1338749
14747A338749K50067J1529l16858k23358l3165n1213n3925l6124k07087J36086
$$ 1338749 1588816 1600345 1283487 1060129 1026964 975751 921826 885702 678615 814701
14737H14701R1407J39707J88401K73881O1070j83614j99628K8784J1732k42366
$$ 814701 906108 1045815 1234216 1508097 1569167 1385553 1185925 1214709 1226441 984075
14727I84075J81201J11716P7701J21915j09072j64106j69899J11099k7949l7318
$$ 984075 1165276 1276992 1354693 1476608 1367536 1203430 1033531 1144630 1116681 1079363
14717A079363K3226j5688k8088j07993j17160N6209M4999m3487j65934l485O0834
$$ 1079363 1102589 1086901 1058813 950820 833660 889869 934868 891381 725447 721962 782796
14706G82796J4088n5397r5261M0278j04649m0751J56753K36490K10189J36924
$$ 782796 796884 741487 646226 686504 581855 541104 697857 934347 1144536 1281460
14696A281460j01067j56794j89798J01832j9033j18896J6278j3687j59560j64767
$$ 1281460 1180393 1023599 833801 935633 916600 797704 813982 800295 640735 475968
14686D75968K3523r6200N2922J51495J45862P8384o4612N345j438j36325J63149
$$ 475968 499491 403291 456213 607708 753570 831954 767342 772687 771249 634924 798073
14675G98073K08719m4744k6151J6339J92128l4814N502P4428J84366k59554l05172
$$ 798073 1006792 962048 935897 952236 1144364 1109550 1115052 1189480 1373846 1114292 809120
14664H09120p3386R2081j41203j01172J03532j8696r7351O1294j6810P4282j09068
$$ 809120 735734 827815 686612 585440 688972 670276 572925 634219 617409 691691 582623
14653E82623N050j618k5355M3905N071M5805j14737j21409m4974Q8547Q5179O311
$$ 582623 587673 586055 560700 604605 609676 655481 540744 419335 374361 462908 548087 554398
14641E54398J22416N3849p1587J4989j87596j76818l6491j26067K90070L76957
$$ 554398 676814 730663 659076 674065 486469 309651 273160 147093 437163 814120
14631H14120p1417j24678Q6059j01496p8154P6510K6247p2622J03691j59590M9021
$$ 814120 742703 618025 704084 602588 524434 600944 627191 554569 658260 498670 547691
14620E47691J29454j07452K35959j23973l55546J3842L517K5816J54870J52516
$$ 547691 677145 569693 805652 681679 326133 339975 343492 369308 524178 676694
14610F76694Q2149J7102j42899j65229j80983j22565q514M8139N0104J53360j19532
$$ 676694 758843 775945 633046 467817 286834 164269 155755 203894 253998 407358 287826
14599B87826J0462K22152R4246j2558j01931Q206P2284j06328k69836l9493K12743
$$ 287826 298288 520440 614686 602128 500197 508403 580687 474359 204523 165030 377773
14588C77773n472J02374M1027J91067N7469J8019r7751j28195p7713j55261J72932
$$ 377773 372301 474675 515702 706769 764238 782257 684506 556311 478598 323337 496269
14577D96269N4130L9075L8356J05505k1040l3242n0634Q7197k91897j50698j6783
$$ 496269 550399 589474 627830 733335 712295 679053 628419 715616 423719 273021 256238
14566B56238O0673p2648N9689K6577j12883k26629L1657R2321L6859N6770J56678
$$ 256238 316911 244263 303952 330529 217646 -8983 22674 114995 151854 208624 365302
14555C65302m5261R9438J21575K88955m3285l27173j64890l34430j19408K10280
$$ 365302 320041 419479 541054 830009 786724 459551 294661 -39769 -159177 51103
14545E1103J45311J50625J05498n4099J86366n2090m00287J02763K53597p2793
$$ 51103 196414 347039 452537 398438 584804 532714 132427 235190 488787 415994
14535D15994J58701Q2873j39817j99807n410m2848P8698k1166j59592j65397J43504
$$ 415994 574695 657568 517751 317944 312534 269686 348384 327218 167626 2229 145733
14524A45733J31720J35416o3001m4424r3958j02323j51002O9875J69943O7573
$$ 145733 277453 412869 349868 305444 211486 109163 -41839 28036 197979 265552
14514B65552j3861K2586P3833N5541l4262l5944j6495Q6615J57385J20059m6673
$$ 265552 251691 274277 348110 403651 369389 333445 316950 403565 560950 681009 634336
14503F34336p1376j19043j39230q8174J83816R7453j52664m9327j26902J78358
$$ 634336 562960 443917 304687 216513 400329 497782 345118 295791 168889 347247
14493C47247K05976J19727k49821k04437o0395P8034J76437R1384O0303o307k14371
$$ 347247 553223 672950 423129 218692 158297 236331 412768 504152 564455 558148 343777
14482C43777l5130J7873k4295K3525K06041j63587j84310j29143k5197J14907
$$ 343777 308647 326520 302225 325750 531791 368204 183894 54751 29554 144461
14472A44461L37338K44063j80847j52N0434J17647m1580j45567j7273k57117j88808
$$ 144461 481799 725862 545015 544863 595297 712944 671364 525797 508524 251407 62599
14461F2599K6132N3729J14174Q7768J86291l5243k40078q6811M9647l2172J15393
$$ 62599 88731 142460 256634 344402 530693 495450 255372 168561 218208 186036 301429
14450C01429J2744j22511l0817P8924L6740n2978j07768l7420J14689J62711p5176
$$ 301429 314173 191662 160845 239769 276509 223531 115763 78343 193032 355743 280567
14439B80567M7717K1004l2255k32995p489K42402R1101k22132j59497j59299m9459
$$ 280567 328284 349288 317033 84038 76549 318951 410052 187920 28423 -130876 -180335
14428a80335J56267O485N1861J04385Q8642j08186l2114Q0038J32804N6144k6079
$$ -180335 -24068 -17583 34278 138663 227305 119119 87005 167043 299847 355991 329912
14417C29912k77630j72753j13832Q1051J8785J79578L25237R3244J872l9733l7428
$$ 329912 52282 -120471 -234303 -153252 -134467 45111 370348 463592 465464 425731 388303
14406C88303N7082J61378J04377q4018j56796k11219j38434K85N8942m592r649
$$ 388303 445385 606763 711140 627122 470326 259107 120673 120958 179900 175308 165659
14395A65659J35466j34571k04876j63712j01336J40496J26852L6968J71763J88704
$$ 165659 301125 166554 -38322 -202034 -303370 -162874 -36022 946 172709 361413
14385C61413Q3782J01605p1174K4832q7700j81355Q2873K48559p747k28021J17833
$$ 361413 445195 546800 475626 500458 412758 231403 314276 562835 555088 327067 444900
14374D44900k5575O6547J33893K27790J27032j67849j74715j39917O9759K0438
$$ 444900 419325 485872 619765 847555 974587 806738 632023 492106 561865 582303
14364E82303j20653L8426J39215M1671k11582j83115j4102j3657P7974P6550j4450
$$ 582303 461650 500076 639291 680962 469380 286265 272163 258506 336480 413030 398580
14353C98580O5892m4584K5309n2140p3639J04606k0357k63897O0589k9289q1745
$$ 398580 464472 419888 445197 393057 319418 424024 403667 139770 200359 171070 89325
14342H9325K0200J67920m0107p238J57483p7669j46127R9201m07443L4533K11449
$$ 89325 109525 277445 237338 230100 387583 309914 163787 262988 -144455 -109922 101527
14331A01527J31008R4442L4564k02433K9794J22247o7072k60262k26970L8935
$$ 101527 232535 326977 361541 159108 188902 311149 244077 -16185 -243155 -204220
14321b04220L39282K85566j5385K27509r7764k62013j48418J84661M7719p4198
$$ -204220 135062 420628 405243 632752 534988 272975 124557 309218 356937 282739
14311B82739J01774K2447j05316j40864k6831j55774J33905J36582N4796j65377
$$ 282739 384513 406960 301644 160780 133949 -21825 112080 248662 303458 138081
14301A38081l8975K01752N7599J66631n9064o4395N9325J91084N7306j60192j80289
$$ 138081 99106 300858 358457 525088 466024 401629 460954 652038 709344 549152 368863
14290C68863j07758O4003P53j38398L6375J2717O5736K1170m7763k09356K4553
$$ 368863 261105 325108 325861 187463 223838 236555 302291 323461 275698 66342 90895
14279I0895J82498J30333o1447N7948p7487j28107p6670K18334k2292m0069k95251
$$ 90895 273393 403726 342279 400227 322740 194633 117963 336297 314005 273936 -21315
14268b1315L613J05511M5328K4798j79063M368N1592j51881j64719j16628J76582
$$ -21315 -17702 87809 133137 157935 -21128 -16760 34832 -117049 -281768 -398396 -221814
14257b21814K08299R8682j51088p7515l464k2979M3864J31266J16885o6493Q6213
$$ -221814 -13515 85167 -65921 -143436 -146900 -169879 -126015 5251 122136 55643 141856
14246A41856m278l9978k911K533o5715J56243R9999j64412J16007L9785k66652
$$ 141856 137578 97600 94689 97222 31507 187750 287749 123337 239344 279129 12477
14235A2477L9153r9733j13426m2087k1110Q6272K93219L1413r5003K637L0507
$$ 12477 51630 -48103 -161529 -203616 -224726 -138454 154765 186178 91175 93812 124319
14224A24319j24543l2347j16887j65192J45652J33721j34385q1623J14058J17180
$$ 124319 -224 -32571 -149458 -314650 -168998 -35277 -169662 -251285 -137227 -20047
14214b0047O8061j07080k19847K65040J30356k4483L9162j6501J9131J8457J30836
$$ -20047 48014 -59066 -278913 -13873 116483 92000 131162 114661 133792 152249 283085
14203B83085J81236p4901m49840m8427J40350p4326l39523L3327L20989K11343
$$ 283085 464321 389420 -60420 -108847 31503 -42823 -382346 -349019 -28030 183313
14193A83313o494j30021J8756P3174J86892j73158l7481J69620J5833r7671l1771
$$ 183313 176819 46798 65554 138728 325620 152462 114981 284601 300434 202763 170992
14182A70992J21757R3199j7160p8545m6215K4241N8327k2795P7704r3717o4619
$$ 170992 292749 385948 368788 290243 244028 268269 326596 303801 381505 287788 223169
14171B23169j0800L5286J45080Q458j06378k1955l695j36878J95472m231j33657
$$ 223169 212369 247655 392735 401193 294815 272860 269165 132287 327759 323528 189871
14160A89871p7899J83063K8936J16218N2614j50589j65250o0926q758J14614R7947
$$ 189871 111972 295035 323971 440189 492803 342214 176964 116038 107280 221894 319841
14149C19841K54309O6182J4481o7531k22288j40573P4283l84663m755R5351J31956
$$ 319841 574150 640332 654813 587282 364994 224421 298704 -85959 -90714 4637 136593
14138A36593M8399p9398J28526P5453J61950n3854K0542j16665K8676J64502j0881
$$ 136593 184992 105594 234120 309573 471523 417669 438211 321546 350222 514724 503843
14127E03843j512p244k11655k19264K5512O1467j43216M7035J46749q9154m3873
$$ 503843 502331 495087 283432 64168 89680 151147 7931 54966 201715 112561 68688
14116F8688J9222l6717J40993Q7763j44626n1266j19964p3961k9767J24209J69397
$$ 68688 87910 51193 192186 279949 135323 84057 -35907 -109868 -139635 -15426 153971
14105A53971J39649q0005L5966R0382N266O3277K1730J5307j11029j70136J09373
$$ 153971 293620 213615 249581 339963 345229 408506 430236 445543 334514 164378 273751
14094B73751J26038j4443L6019m1866j65682j07657m7403m9199P1962M3175l1180
$$ 273751 399789 385346 421365 379499 213817 106160 58757 9558 81520 124695 93515
14083I3515N2765J52059R2181k5187L9682l2441l7823J3163k06213K95992K45708
$$ 93515 146280 298339 390520 365333 405015 372574 334751 347914 141701 437693 683401
14072F83401P3979o9911K02868J35122R7567M29290L44877P2885m0025r025K13008
$$ 683401 757380 687469 890337 1025459 1123026 1552316 1897193 1970078 1930053 1921028 2134036
14061B134036J41342N8492J87210K15857L68796N03598K97481K70417O50294N91506
$$ 2134036 2275378 2333870 2521080 2736937 3105733 3609331 3906812 4177229 4827523 5419029
14051E419029N04848N21306M15980M65465K87226M55270O4246N6935J19275k6325
$$ 5419029 5923877 6445183 6861163 7326628 7613854 8069124 8133370 8190305 8309580 8283255
14041H283255k53524k14229l32883k00846n63507m82840k68370m99202m15214
$$ 8283255 8029731 7815502 7482619 7281773 6718266 6235426 5967056 5467854 5052640
14032E052640m46570k20774n0920q6641p7358J95840J52564J09333K17640M70609
$$ 5052640 4606070 4385296 4334376 4247735 4170377 4366217 4518781 4628114 4845754 5316363
14022E316363L07225M47992M30407O42389P81983O98135Q24469M27723R9430L80766
$$ 5316363 5623588 6071580 6501987 7144376 7926359 8624494 9448963 9876686 9976116 10356882
14012A0356882L40799N4874j51685k38046n08681n32935m55931n44562p21935
$$ 10356882 10697681 10752555 10600870 10362824 9854143 9321208 8865277 8320715 7598780
14003G598780m14682l40258o35930n00242m03609l26158k90007l56745j63374
$$ 7598780 7184098 6843840 6207910 5707668 5304059 4977901 4687894 4331149 4167775
13994D167775q6750j21064j11105n4743j52058k14189j43678j03751M9720Q1537
$$ 4167775 4081025 3959961 3848856 3794113 3642055 3427866 3284188 3180437 3230157 3311694
13984C311694R4067k40416k40370J06125J36233O160j1920Q7437p3415K96624
$$ 3311694 3405761 3165345 2924975 3031100 3167333 3173493 3161573 3249010 3175595 3472219
13974C472219Q8928L1439k9734J33001K10711N4240J90481J46917L49929J58436
$$ 3472219 3561147 3592586 3562852 3695853 3906564 3960804 4151285 4298202 4648131 4806567
13964D806567L26308L79584O17540M54091L56412L19387L58286M08460M70511
$$ 4806567 5132875 5512459 6129999 6584090 6940502 7259889 7618175 8026635 8497146
13955H497146J64268j28982P6814J07646j48001l20955l30765m57006m25828m61922
$$ 8497146 8661414 8532432 8609246 8716892 8568891 8247936 7917171 7460165 7034337 6572415
13945F572415m41907l56807m73279m56203k87984l24571k90333j34393k00811
$$ 6572415 6130508 5773701 5300422 4844219 4556235 4231664 3941331 3806938 3606127
13936C606127j98001j20071r2235j69357k10338n4532j42148O3139P639K8323
$$ 3606127 3408126 3288055 3195820 3026463 2816125 2761593 2619445 2682584 2690223 2718546
13926B718546K11891J39576K28899K67154Q3618J27480L87348N91937N14147N58156
$$ 2718546 2930437 3070013 3298912 3566066 3649684 3777164 4164512 4756449 5270596 5828752
13916E828752N75349N75789Q29251N16816L92646N77712O39361L66303K3109N9582
$$ 5828752 6404101 6979890 7809141 8325957 8718603 9296315 9935676 10301979 10325088 10384670
13906A0384670m1028m6276j22365n21268q70916q05397n96980o60725n82665n23286
$$ 10384670 10343642 10297366 10175001 9653733 8782817 7977420 7380440 6719715 6137050 5613764
13896E613764n59225n08242m59076k13828k54429m68485l07782m4760k23712q0521
$$ 5613764 5054539 4546297 4087221 3873393 3618964 3150479 2842697 2797937 2574225 2493704
13886B493704m116j5178p0681Q0891j92590j40945p9763o8877R685j88606q4636
$$ 2493704 2489588 2474410 2403729 2484620 2292030 2151085 2071322 2002445 2012130 1823524 1738888
13875A738888k04765p2455J3084O9055M682j04684J70211J21536r3221j13669
$$ 1738888 1534123 1461668 1474752 1543807 1548489 1443805 1614016 1735552 1642331 1528662
13865A528662o9023j48820r0875M4010j29715l1446J64468j4990k85074p8118
$$ 1528662 1459639 1310819 1219944 1263954 1134239 1102793 1267261 1252271 967197 889079
13855H89079r9455j61733L2446q6515J49802p3558r4716O3947J10491J21809J01204
$$ 889079 789624 627891 660337 573822 723624 650066 555350 619297 729788 851597 952801
13844I52801P6752j37917j38048L1615J15782P710Q678j33948N8219N4595j47080
$$ 952801 1029553 891636 753588 785203 900985 908695 917373 783425 841644 896239 749159
13833G49159J52671Q2496j1569k0767J30628J75999k44541J39511k69539r3501
$$ 749159 901830 984326 972757 951990 1082618 1258617 1014076 1153587 884048 790547
13823G90547J15208J66564R3824l2859p2096J9827K1109j9302m4362O7954R0082
$$ 790547 905755 1072319 1166143 1133284 1061188 1081015 1102124 1082822 1038460 1106414 1196496
13812A196496q8680q4693m6544J37775L63394M37761r9636N1675Q2455M0046R3281
$$ 1196496 1107816 1023123 976579 1114354 1477748 1915509 1815873 1867548 1950003 1990049 2083330
13801B083330K93209M23481K67523J4263n7599p3897p7840j47246j52732m49517
$$ 2083330 2376539 2800020 3067543 3081806 3024207 2950310 2872470 2725224 2572492 2122975
13791B122975l86980j48031l5582p3859o7432M5390K2919N0247k03658j20342
$$ 2122975 1735995 1587964 1552382 1478523 1411091 1456481 1479400 1529647 1325989 1205647
13781A205647l8577o3470q3707p1425M3047J44282m2971J9263o7552j31985P9110
$$ 1205647 1167070 1103600 1019893 948468 991515 1135797 1092826 1112089 1044537 912552 991662
13770I91662k7997J00467m9982j47057j36860O7728P4890j20800n1351p1813o5003
$$ 991662 963665 1064132 1014150 867093 730233 797961 872851 752051 700700 628887 563884
13759E63884k01629M1331K25289L15943M5993j39965n1576l8713j67957K16369
$$ 563884 362255 403586 628875 944818 990811 850846 799270 760557 592600 808969
13749H08969Q4518j13051M2804j33573j25153N9747m7941o1551J34341J87634
$$ 808969 893487 780436 823240 689667 564514 624261 576320 514769 649110 836744
13739H36744J34028p2696Q0289L1353J31140J00514j28490j04535n7306m979K39699
$$ 836744 970772 898076 978365 1009718 1140858 1241372 1112882 1008347 951041 946062 1185761
13728A185761K89854j50393k41808k87281M7426J41982k7738k02145l9605O7798
$$ 1185761 1475615 1325222 1083414 796133 843559 985541 957803 755658 716053 783851
13718G83851K48627K10278O9952M0138J8834L068M9023J65254k1228J2220j60849
$$ 783851 1032478 1242756 1312708 1352846 1371680 1374748 1423771 1589025 1567797 1580017 1419168
13707A419168L31l3300r0006j74050p0032J6241j35357j00297J02879J99671Q4355
$$ 1419168 1419499 1386199 1296193 1122143 1052111 1068352 932995 832698 935577 1135248 1219603
13696A219603J00642J00743M3896M632r5103j65196M6335k7392o2309q3690j62550
$$ 1219603 1320245 1420988 1464884 1469516 1374413 1209217 1255552 1228160 1165851 1082161 919611
13685I19611J10499N2823j17112j39982p9608J60970J24346m3753j1008k0731
$$ 919611 1030110 1082933 965821 825839 746231 907201 1031547 987794 976786 956055
13675I56055J95J31890M03980P2814j06073m0106M8550q2023q7643m0469r5199
$$ 956055 956250 1088140 1492120 1564934 1458861 1418755 1467305 1385282 1297639 1257170 1161971
13664A161971J36106N5231R9583j00153l40705n847p8373P5093K61235O0675j12394
$$ 1161971 1298077 1353308 1452891 1352738 1012033 1006186 927813 1002906 1264141 1324816 1212422
13653A212422M5384M0389l12946j73244P7161J83574K55163J51660J44773Q3058
$$ 1212422 1257806 1298195 985249 812005 889166 1072740 1327903 1479563 1624336 1707394
13643A707394r3687M0454R7276J06921j58280j14435P4674O7034L7485j28519
$$ 1707394 1613707 1654161 1751437 1858358 1700078 1585643 1660317 1727351 1764836 1636317
13633A636317Q9531J2698r4750p3816J7843K64092m696J29770J76429J68407j54460
$$ 1636317 1725848 1738546 1643796 1569980 1587823 1851915 1847219 1976989 2153418 2321825 2167365
13622B167365m2409J89121L41038L94299O67694N76682N36717N49004N62775Q67700
$$ 2167365 2124956 2314077 2655115 3049414 3717108 4293790 4830507 5379511 5942286 6809986
13612F809986Q25027O01177O58421P16190P14495L65949j34659k22481k68402
$$ 6809986 7635013 8236190 8894611 9610801 10325296 10691245 10556586 10334105 10065703
13603A0065703k24395k16294l09431o03935o80087q66704p51155m31993n70179
$$ 10065703 9841308 9625014 9315583 8711648 8031561 7164857 6413702 5981709 5411530
13594E411530m76720l99965m29576m01691k08808l6979o9113l23818k55460P9669
$$ 5411530 4934810 4534845 4105269 3703578 3494770 3457791 3388678 3064860 2809400 2889069
13584B889069J18214k10169m3006J84477j01537k72567k14071k97560N1122j01343
$$ 2889069 3007283 2797114 2754108 2938585 2837048 2564481 2350410 2052850 2103972 2002629
13574B002629q7916N8275K23469K25542o0423m1259j55401j34404J39495K3956
$$ 2002629 1914713 1972988 2196457 2421999 2361576 2320317 2164916 2030512 2170007 2193963
13564B193963P6847R2924K6730J48433k08757n8655K53943j82609j21995j29678
$$ 2193963 2270810 2363734 2390464 2538897 2330140 2271485 2525428 2342819 2220824 2091146
13554B091146j82684k8841j6040k38005P1079Q7039O7268J6998k22956J52908
$$ 2091146 1908462 1879621 1863581 1625576 1696655 1783694 1850962 1867960 1645004 1797912
13544A797912N4468R9948l4676M2697J43353o6060k10187j8640N1144K7880j3857
$$ 1797912 1852380 1952328 1917652 1960349 2103702 2037642 1827455 1808815 1859959 1887839 1873982
13533A873982j5535m0840J6447J78135J02764R6814J48601L1349l16543j15390
$$ 1873982 1858447 1817607 1834054 2012189 2114953 2211767 2360368 2391717 2075174 1959784
13523A959784J65053K07715J4505j81947Q2709K28000R1272M6912K08803K11007
$$ 1959784 2124837 2332552 2347057 2165110 2247819 2475819 2567091 2614003 2822806 3033813
13513C033813m0129j43867q330J62825J63441L14347L38033L11394L12130M79273
$$ 3033813 2993684 2849817 2841487 3004312 3167753 3482100 3820133 4131527 4443657 4922930
13503D922930N41176N93622P26477N99490R36230R14890R49554R91821R01733
$$ 4922930 5464106 6057728 6784205 7383695 8319925 9234815 10184369 11176190 12077923
13494A2077923Q56182Q78315O35689P42535M22047J25945Q2998n3580l5348L4006
$$ 12077923 12934105 13812420 14448109 15190644 15612691 15738636 15821634 15768054 15732706 15766712
13484A5766712J93246J66889L56026N39300O23736R45309J287215J480408J986886
$$ 15766712 15959958 16126847 16482873 17022173 17645909 18591218 19878433 21358841 23345727
13475B3345727K416953L101863L740723M481766O080218P674641R986673J2855310
$$ 23345727 25762680 28864543 32605266 37087032 43167250 50841891 60828564 73683874
13467G3683874J6086594J9678221K3795021K7504406L1328550L3943594L5577867
$$ 73683874 89770468 109448689 133243710 160748116 192076666 226020260 261598127
13460B61598127L6342874L5366169L2942776K8566423K2531708J5174945P440682
$$ 261598127 297941001 333307170 366249946 394816369 417348077 432523022 439963704
13453D39963704o52318q547116j6208541k2925329k8075186l1658841l3302678
$$ 439963704 439311386 430764270 414555729 391630400 363555214 331896373 298593695
13446B98593695l3309441l2307330l0213082k6866691k3251033j9922194j6455279
$$ 298593695 265284254 232976924 202763842 175897151 152646118 132723924 116268645
13439A16268645j3498448j0746868q634468o969876n924697n057868m568742m010204
$$ 116268645 102770197 92023329 83388861 76418985 70494288 65436420 60867678 56857474
13431E6857474l462564l258061l031539k572616k436326k367111k142507j611882
$$ 56857474 53394910 50136849 47105310 44532694 42096368 39729257 37586750 35974868
13423C5974868j679716j559118j273989j185128j263377j334032j126440j064170
$$ 35974868 34295152 32736034 31462045 30276917 29013540 27679508 26553068 25488898
13415B5488898r17205p23560p28702o17268p63683r14521m44036m43337o51115
$$ 25488898 24571693 23848133 23119431 22502163 21738480 20823959 20379923 19936586 19285471
13406A9285471n07405o12417o50074k59846k15717n60441o05988k85812j85045
$$ 19285471 18778066 18165649 17515575 17255729 17040012 16479571 15873583 15587771 15402726
13397A5402726k71295m57012m94153m47832j24910o0236j5173Q5471q9441k30379
$$ 15402726 15131431 14674419 14180266 13732434 13607524 13547288 13532115 13617586 13528145 13297766
13387A3297766j50560J15878J22822J43255K10361J27083L68416M31982K49971
$$ 13297766 13147206 13263084 13385906 13529161 13739522 13866605 14235021 14667003 14916974
13378A4916974M93969P15499N74137N31043Q44021J123458J405942J580367J605983
$$ 14916974 15410943 16126442 16700579 17231622 18075643 19199101 20605043 22185410 23791393
13369B3791393K212955K742708L222249L760673M623179N635607P026919R407607
$$ 23791393 26004348 28747056 31969305 35729978 40353157 45988764 53015683 62423290
13361F2423290J2389969J6415308K1171795K6135264L1010339L5727333L9140379
$$ 62423290 74813259 91228567 112400362 138535626 169545965 205273298 244413677
13354B44413677M0691210M0791198L9300772L5772353L0467362K2985369J3856810
$$ 244413677 285104887 325896085 365196857 400969210 431436572 454421941 468278751
13347D68278751K975701q393712j8254182k5857361l1320784l5107656l7518658
$$ 468278751 471254452 462860740 444606558 418749197 387428413 352320757 314802099
13340C14802099l8197917l7197222l4155576k9825357k4928765k0349824j6139693
$$ 314802099 276604182 239406960 205251384 175426027 150497262 130147438 114007745
13333A14007745j2577507r767789p994903o597010n607070m889247m339028m015304
$$ 114007745 101430238 91662449 83667546 77070536 71463466 66574219 62235191 58219887
13325E8219887l615338l277097k969762k730949k567547k535709k304402j950803
$$ 58219887 54604549 51327452 48357690 45626741 43059194 40523485 38219083 36268280
13317C6268280j744481j471706j614335j415280j185862j088002j048311j103122
$$ 36268280 34523799 33052093 31437758 30022478 28836616 27748614 26700303 25597181
13309B5597181j003536q82755r83363q01960j007076p38296p27804p13654n49470
$$ 25597181 24593645 23710890 22727527 21925567 20918491 20180195 19452391 18738737 18189267
13300A8189267l78436m63639m79174n30715m68184m30802m69270n37574m04535
$$ 18189267 17810831 17347192 16868018 16337303 15869119 15438317 14969047 14431473 14026938
13291A4026938l82426l26204k93782k82831m78958m43640j90546k05676k81315
$$ 14026938 13644512 13318308 13024526 12741695 12262737 11819097 11628551 11422875 11141560
13282A1141560k57813l33087m68449k14429l39375m93133k35308L9111q7257J1850
$$ 11141560 10883747 10550660 10082211 9867782 9528407 9035274 8799966 8839077 8751820 8763670
13272H763670l62800k45893j13116k19996k14419m02513j30311j38553o339J38413
$$ 8763670 8400870 8154977 8041861 7821865 7607446 7204933 7074622 6936069 6929730 7068143
13262G068143J9560j24506K6775q4708l65056j70351o8979q0793k77560j14835
$$ 7068143 7087703 6963197 6989972 6905264 6540208 6369857 6300878 6220085 5942525 5827690
13252E827690j1224j24790o1587j03710r6033j06844j17196l63036k81091L5282
$$ 5827690 5816466 5691676 5630089 5526379 5430346 5323502 5206306 4843270 4562179 4597461
13242D597461j39551p7470q847J05227j57312j61899j72088j99466p1914L9265
$$ 4597461 4457910 4380440 4371593 4476820 4319508 4157609 3985521 3786055 3714141 3753406
13232C753406j7809j80420k09151K2310K2341p0707k05733k3205o1347j87665
$$ 3753406 3735597 3555177 3346026 3368336 3390677 3319970 3114237 3091032 3029685 2842020
13222B842020J4426l0486m507J9156j78480k55822k07395j50343l60152j13669
$$ 2842020 2856446 2825960 2821453 2840609 2662129 2406307 2198912 2048569 1688417 1574748
13212A574748J15342N4701J82447o0836o488j63127k75394J39313J46444J22551
$$ 1574748 1690090 1744791 1927238 1866402 1859914 1696787 1421393 1560706 1707150 1829701
13202A829701p7599p4293J58064K8825Q7508q9600L37l24988j90482R3475Q9069
$$ 1829701 1752102 1677809 1835873 1864698 1952206 1862606 1862943 1537955 1347473 1440948 1530017
13191A530017k39109J4283j2810j1734j36706K0554J49049P5808j43314R6N7240
$$ 1530017 1290908 1305191 1292381 1280647 1143941 1164495 1313544 1389352 1246038 1246134 1303374
13180A303374j56363j03905k0111J72560L7405r3094J7489q1575J47470l9685
$$ 1303374 1147011 1043106 1022995 1195555 1232960 1139866 1157355 1075780 1223250 1183565
13170A183565n0111M0130L1240K0224J3524p1248l4485j76239j35743k7842l0635
$$ 1183565 1133454 1173584 1204824 1225048 1238572 1167324 1132839 956600 820857 793015 762380
13159G62380J06004J08219J7441M2712q8607p577K82136R0510j63149L5409k6693
$$ 762380 868384 976603 994044 1036756 948149 940572 1222708 1313218 1150069 1185478 1158785
13148A158785j97460j8326J97557K3713k26115j66127j54995L4420K83552K4041
$$ 1158785 961325 942999 1140556 1164269 938154 772027 617032 651452 935004 959045
13138I59045k684Q1097l1344o9618j46734P4125K03993n4584j47995K8354K67603
$$ 959045 956361 1037458 1006114 936496 789762 863887 1067880 1013296 865301 893655 1161258
13127A161258L4425L5950n8812k40775j64348O1666l823j26940m49p54K4718m9686
$$ 1161258 1195683 1231633 1172821 932046 767698 829364 825541 698601 698152 697398 722116 672430
13115F72430Q6612J25017r839k98814J56543J47927o6709k09693r709K08735j16518
$$ 672430 759042 884059 874220 575406 731949 879876 813167 603474 593765 802500 685982
13104F85982J00791J62838j73498j36562O0574o0561P7136J82541P88R3933j69784
$$ 685982 786773 949611 776113 639551 700125 639564 716700 899241 900029 993962 824178
13093H24178j4277o6919j699k6199j4482p159J66714J18972k13410j70538J63454
$$ 824178 809901 742982 741283 715084 700602 693443 860157 979129 765719 595181 758635
13082G58635n9092j82775p7436o5161R3308j43010j12347o9517J4723K72607J56291
$$ 758635 699543 516768 439332 374171 467479 324469 212122 142605 157328 429935 586226
13071E86226j38456J09620J56868j28123o3527m9658r9612j54701n2523P595J57924
$$ 586226 447770 557390 714258 586135 522608 472950 373338 218637 166114 173709 331633
13060C31633K44161j20021k42628j15187L3792J12931k7456M0577P601O0674J71270
$$ 331633 575794 455773 213145 97958 131750 244681 217225 257802 265403 326077 497347
13049D97347J5726n3098l9124J01047Q773K04392r5967k14109j99738j40808o1512
$$ 497347 513073 459975 420851 521898 530671 735063 639096 424987 225249 84441 22929
13038B2929K30557K14026K4983q9669O7480j2462P4480J59664M5063n9380j64895
$$ 22929 253486 467512 492495 402826 470306 457844 532324 691988 737051 677671 512776
13027E12776M0994j8853j34842p425N7363J64736p450k0477r3073q8583J86332
$$ 512776 553770 534917 400075 392650 450013 614749 607299 586822 493749 405166 591498
13016E91498K27163J25694q8168k5932Q0392Q1431J6825j55615J47995J41196
$$ 591498 818661 944355 856187 830255 910647 992078 1008903 853288 1001283 1142479
13006A142479K54791L20848J42765K44961K1791n0940j6473N3101L93387L1674
$$ 1142479 1397270 1718118 1860883 2105844 2127635 2076695 2060222 2113323 2506710 2538384
12996B538384k09819j66803r4701j05351p5921k26424k76645r2757k10620m28978
$$ 2538384 2328565 2161762 2067061 1961710 1885789 1659365 1382720 1289963 1079343 650365
12986F50365k06551l0975N479Q6402P4213J43237l8137J4789r2850j2881N8312
$$ 650365 443814 412839 418318 504720 578933 722170 684033 698822 605972 593091 651403
12975F51403J9973P8394O7820k20897k08045k02553R7804J65475j0907j87977
$$ 651403 671376 749770 817590 596693 388648 186095 283899 449374 438467 250490
12965B50490K377L206O9400M2802j78511o4736R0409p9483p732N0932O403p3830
$$ 250490 252867 256073 325473 368275 189764 125028 215437 135954 128222 179154 185557 111727
12953A11727j07694O38J66017J14427J08276q2041J8871N1230L8640j30505P6368
$$ 111727 4033 4671 170688 285115 393391 311350 330221 381451 420091 289586 365954
12942C65954k4638J02597J17470N6940p0787j67712P8200q8987J33799n612j47143
$$ 365954 341316 443913 561383 618323 547536 379824 458024 369037 502836 497224 350081
12931C50081j67453j06937J70661K18440O3653j29789p0780J2599p0791j98618
$$ 350081 182628 75691 246352 464792 528445 398656 327876 340475 269684 71066
12921G1066J14816J65110M7256J1091L9521r5403N9427J0507n6599r970J04502
$$ 71066 185882 350992 398248 409339 448860 353457 412884 423391 366792 356822 461324
12910D61324K2854k10735p2627k15529O6744K25630J50495J14572J81989J46332
$$ 461324 484178 273443 200816 -14713 52031 277661 428156 542728 724717 871049
12900H71049J05696K10573K62906J83938K37070J39240R3479N8881K03172q0237
$$ 871049 976745 1187318 1450224 1634162 1871232 2010472 2103951 2162832 2366004 2285767
12890B285767M3582J62862J2391R6409j28261l84485j99948q5966j69802j87442
$$ 2285767 2329349 2492211 2504602 2601011 2472750 2088265 1888317 1802351 1632549 1445107
12880A445107K8955q2581q9523j5771j64677k49952q7037m5324l26165j50856
$$ 1445107 1474062 1391481 1301958 1286187 1121510 871558 784521 739197 413032 262176
12870B62176J67295J22169q9565Q8112j13974J5347j09529k666J12396k3909R4340
$$ 262176 429471 551640 462075 550187 436213 451560 342031 339365 451761 427852 522192
12859E22192m0931m35012j2728J43076J30931q5677j11235q5079L4020J08695
$$ 522192 481261 46249 33521 176597 307528 221851 110616 25537 59557 168252
12849A68252O9949K9546J95288j9654k39166k29525M087M7283L21376J84925j7959
$$ 168252 238201 267747 463035 443381 204215 -25310 -21223 26060 347436 532361 514402
12838E14402N1364M3134J23714L0179k43465l15805O9853J00284l55332j43412
$$ 514402 565766 608900 732614 762793 519328 203523 273376 373660 18328 -125084
12828a25084J95161J84732L0385L9021n1226j06486j08902N2472K06258K15094
$$ -125084 70077 254809 285194 324215 272989 166503 57601 110073 316331 531425
12818E31425l5692j53377j49152j12272k52092j7367P8824J95979K16092R8115
$$ 531425 495733 342356 193204 80932 -171160 -188527 -109703 86276 302368 400483
12808D00483j4463m2589k99355j84646K711L2654l7633J23041R3703j6621j96148
$$ 400483 386020 343431 44076 -140570 -137859 -105205 -142838 -19797 73906 57285 -138863
12797a38863J35338L3222m4065r4416J0922J23474K01334J18954K34603k24918
$$ -138863 -3525 29697 -14368 -108784 -97862 25612 226946 345900 580503 355585
12787C55585l88044Q9890J72604j76330j16135M3526J11900K3028k7573N8140
$$ 355585 -32459 57431 230035 53705 -62430 -18904 92996 116024 88451 146591
12777A46591K27216j9203j61034r7163K1880m7810K411J26709M2122j54898j65946
$$ 146591 373807 354604 193570 96407 118287 70477 72888 199597 241719 86821 -79125
12766g9125J81642j0705J20951j89145j3247K5121J15604M0102p3336q5836J63436
$$ -79125 102517 91812 212763 23618 10371 35492 151096 191198 117862 32026 195462
12755A95462j15550L6366O2297p7886k9669Q5818K5427M9007p2225M865j45800
$$ 195462 79912 116278 178575 100689 71020 156838 182265 231272 159047 163912 18112
12744A8112j47807K42253J89808l2210j84664n2003M55254N2253j14036m6324
$$ 18112 -129695 112558 302366 270156 85492 33489 488743 540996 426960 380636
12734C80636K9825m9082k29026o8142L800J22396L3625j08399K1835M0593j40967
$$ 380636 410461 361379 132353 64211 68011 190407 224032 115633 137468 178061 37094
12723C7094N3748j24985J31122l6993K7515k3562J19950J74j31144n968L579K0560
$$ 37094 90842 -34143 96979 59986 87501 63939 183889 184063 52919 46951 50530 71090
12711G1090Q4535j32900r3982L6554j09938J21563n290J24571J47537n322j46677
$$ 71090 155625 22725 -71257 -34703 -144641 -23078 -28368 96203 243740 238418 91741
12700I1741l0398J2373K983k2516j31282l0487O2862o1120j82945k02431J76343
$$ 91741 61343 73716 76699 54183 -77099 -107586 -44724 -105844 -288789 -491220 -314877
12689c14877O6384l3120K1784Q8893Q0439J4293K7356R1002J66701r9139j85593
$$ -314877 -248493 -281613 -259829 -170936 -90497 -76204 -48848 42154 208855 109716 -75877
12678g5877j84515L3485N6904k8767M9369J01705J33310j82592K7332J10925j19212
$$ -75877 -260392 -226907 -170003 -198770 -149401 -47696 85614 -96978 -69646 41279 -77933
12667g7933j88385k3847L4564J89763O2248k0767j76724J27686l5218O6644K33519
$$ -77933 -266318 -290165 -255601 -65838 -3590 -24357 -201081 -73395 -108613 -41969 191550
12656A91550J20258m6248L4080j51171n6596k55488J12065J40685l767j11615
$$ 191550 311808 265560 299640 148469 91873 -163615 -51550 89135 85368 -26247
12646b6247k75293m9905K87746L42903o7843l47557O1849n7114j42502K2476R0465
$$ -26247 -301540 -351445 -63699 279204 211361 -136196 -74347 -131461 -273963 -251487 -161022
12635a61022n4770l3856J04587R6223J00119J42354J36388k34023N9010Q7924
$$ -161022 -215792 -249648 -145061 -48838 51281 193635 330023 96000 155010 242934
12625B42934j75649J44638p2552j08723J93278l5607j43860L5405q9218j39039
$$ 242934 67285 211923 139371 30648 223926 188319 44459 79864 -9354 -148393
12615a48393N762J83341L9101K4823K16143j5878l26472l00141q5548J25035J05383
$$ -148393 -142631 40710 79811 104634 320777 304899 -21573 -321714 -407262 -282227 -176844
12604a76844k10644O2484K68437r745n0361p6287Q2525K1159j26516Q8855J81359
$$ -176844 -387488 -325004 -56567 -66312 -116673 -192960 -110435 -89276 -215792 -126937 54422
12593E4422j83043M2703K87016J98112q6985k55904k52521j65594J42401k4728
$$ 54422 -128621 -85918 201098 399210 312225 56321 -196200 -361794 -219393 -244121
12583b44121L9672j04119J89537M73980O8411k14318J01868m7130l09411j9189
$$ -244121 -204449 -308568 -119031 354949 423360 209042 310910 263780 -45631 -64820
12573f4820K97459p7516k40268r7253m9488j25076J5771L21350N0650j4444m5623
$$ -64820 232639 155123 -85145 -182398 -231886 -356962 -341191 -19841 30809 16365 -29258
12562b9258m3926j48438r5780M0702P9259Q5132R6721K9571R5422m8483j91327
$$ -29258 -73184 -221622 -317402 -276700 -197441 -112309 -15588 13983 109405 60922 -130405
12551a30405K4583J85101j6295j43880m1225n2710L4073L3930K5639O045J01642
$$ -130405 -105822 79279 62984 -80896 -122121 -174831 -140758 -106828 -81189 -75144 26498
12540B6498n9810M1764k44449o3166K42068J82357j4965k0269m385J19884L1274
$$ 26498 -33312 8452 -235997 -299163 -57095 125262 110297 90028 85643 205527 236801
12529B36801j69632k27239k6837K89546J19283k8517N293j24944l9903j04145
$$ 236801 67169 -160070 -186907 102639 221922 193405 198698 73754 33851 -70294
12519g0294q5127m4180m6582J39983m8291j40376r1644J35020K86032q334Q6556
$$ -70294 -155421 -199601 -246183 -106200 -154491 -294867 -386511 -251491 34541 26207 112763
12508A12763j6723Q5605L0559k911j5533j04874j67233q0970K8675J27457k23332
$$ 112763 96040 181645 212204 209293 193760 88886 -78347 -159317 -130642 -3185 -226517
12497b26517J29603J1511j63913j81932r3673N5228J87164K40565j14057K9132
$$ -226517 -96914 -85403 -249316 -431248 -524921 -469693 -282529 -41964 -156021 -126889
12487a26889j14544J37214J90303r3677p6355N4330m2055K02870j00996k03603
$$ -126889 -241433 -104219 86084 -7593 -83948 -29618 -71673 131197 30201 -173402
12477a73402O9537J65599Q8487m5398r8103P6104K9594q9560j32443m9279J42001
$$ -173402 -103865 61734 150221 104823 6720 82824 112418 22858 -109585 -158864 -16863
12466a6863L7300r5861O9322J20999J20463J07432j42109j16689J02900k15643
$$ -16863 20437 -75424 -6102 114897 235360 342792 200683 83994 186894 -28749
12456b8749k30241Q090K03257M9216K32611j0477k22760n8186L4602P5611M5840
$$ -28749 -258990 -250900 -47643 1573 234184 223707 947 -57239 -22637 52974 98814
12445I8814j6373k0918O0348k468K2935j3527j0276N483k26471j97674J84250
$$ 98814 82441 61523 121871 119403 142338 128811 118535 124018 -102453 -300127 -115877
12434a15877J17495R6675l1552l1131L6292R1491K4791o6186m3386j26686q0389
$$ -115877 1618 98293 66741 35610 71902 163393 188184 121998 78612 -48074 -128463
12423a28463k10976L02024J469j32367R3160Q5963o3182j62976N2177Q5847K7030
$$ -128463 -339439 -37415 -35946 -168313 -75153 10810 -52372 -215348 -163171 -77324 -50294
12412e0294n8778k16133K9384m8974r1201J2340J4794O7184J78430J69107m3746
$$ -50294 -109072 -325205 -295821 -344795 -435996 -423656 -408862 -341678 -163248 5859 -37887
12401c7887K3805J09641j76362k13919J84376J43986J37402j45586q2006j3162
$$ -37887 -14082 95559 -80803 -294722 -110346 33640 171042 25456 -56550 -69712
12391f9712K4982j02821O2926J51071m3441k7873o1067p6449J02877O8241J21327
$$ -69712 -44730 -147551 -84625 66446 23005 -4868 -65935 -142384 -39507 28734 150061
12380A50061L1713J11722j28311j57431j01300J07686n0830j9320J79576J69642
$$ 150061 181774 293496 165185 7754 -93546 14140 -36690 -56010 123566 293208
12370B93208r7128j93722l4469k12210j64676l3394J84396J37023J6083k5008
$$ 293208 196080 2358 -32111 -244321 -408997 -442391 -257995 -120972 -104889 -129897
12360a29897k84012J12454m0628J76022K62846P8906j88596j48292J67152K84156
$$ -129897 -413909 -301455 -342083 -166061 96785 175691 -12905 -161197 5955 290111
12350B90111j6200j73274j59017q2549p9327q2445K08669P5111r3190Q9919J31882
$$ 290111 273911 100637 -58380 -140929 -220256 -302701 -94032 -18921 -112111 -22192 109690
12339A09690n8643k32612M4467J28641k02905l8619p287j16485j19641K7733R1738
$$ 109690 51047 -181565 -137098 -8457 -211362 -249981 -257268 -373753 -493394 -465661 -373923
12328c73923J4831N310o4661n1324R3690J8152J80867J33021n4511j9755j16022
$$ -373923 -359092 -353782 -418443 -469767 -376077 -357925 -177058 -44037 -98548 -118303 -234325
12317b34325R7616J15085M7757l9210j16937k15660J27370J21867j1295J0005
$$ -234325 -136709 -21624 26133 -13077 -130014 -345674 -218304 -96437 -107732 -97727
12307i7727K22210K5839o5187k0307k37035M5520P5897j49225m9359J72610J89369
$$ -97727 124483 150322 85135 64828 -172207 -126687 -50790 -200015 -249374 -76764 112605
12296A12605P2032O2088j23087j84512J01613J08451j29004M2657L2044j97431
$$ 112605 184637 246725 123638 -60874 40739 149190 20186 62843 94887 -102544
12286a02544O7244P1876M9724N1128L3257j24810j36349J42471r7743j53564k3770
$$ -102544 -35300 36576 86300 137428 170685 45875 -90474 51997 -45746 -199310 -223080
12275b23080O1081J8507M0842j42111j3961O9357j52128k5052J87382K24433J04318
$$ -223080 -161999 -143492 -102650 -244761 -258722 -189365 -341493 -366545 -179163 45270 149588
12264A49588k09081o5946J40803N9429q4981k2158K1618r0004P1256K1076M0023
$$ 149588 -59493 -125439 15364 74793 -10188 -32346 -10728 -100732 -29476 -8400 31623
12253C1623J39038J01835O2173j3194k01620j37579j50932N2609J97321R9388
$$ 31623 170661 272496 334669 321475 119855 -17724 -168656 -116047 81274 180662
12243A80662J9095l42021k52004M2490Q9848M8233k6388J53681o380j0998J13208
$$ 180662 199757 -142264 -394268 -351778 -261930 -213697 -240085 -86404 -92784 -103782 9426
12232I426J24159K91528J90532j36266j39058k28860q7844j81786p8660j13975
$$ 9426 133585 425113 615645 479379 340321 111461 23617 -158169 -236829 -350804
12222c50804j86278L7505J42863J32143j14725K3704J91892K0516j71600p81q4812
$$ -350804 -537082 -499577 -356714 -224571 -339296 -315592 -123700 -103184 -274784 -275565 -360377
12211c60377N0553K30289M7942M9562p7043l3138J71606J81757j84126r6757j24791
$$ -360377 -309824 -79535 -31593 17969 -59074 -92212 79394 261151 77025 -19732 -144523
12200a44523l2691J65367K1955L6310J8201j16412P3668O9560j95899k9108R602
$$ -144523 -177214 -11847 10108 46418 64619 -51793 21875 91435 -104464 -133572 -123970
12189a23970R9345j01764J76678J99121p5642j7657l4619O1556k3012K13640J59530
$$ -123970 -24625 -126389 50289 249410 173768 156111 121492 183048 160036 373676 533206
12178E33206k76949k5476r6510l77910L314n773P2108K5038J1453j11197J08140
$$ 533206 256257 230781 134271 -243639 -240325 -246098 -173990 -148952 -137499 -248696 -140556
12167a40556K57866o4012M9732N4398q8309L9221n3727J7524q3453R9249j40136
$$ -140556 117310 53298 103030 157428 69119 108340 54613 72137 -11316 87933 -52203
12156e2203l8879M8972K36191j5016k00514o6468J47094l4867k76489k07944R5202
$$ -52203 -91082 -42110 194081 179065 -21449 -87917 59177 24310 -252179 -460123 -364921
12145c64921j0199O8465J00871o003M4535j4852k7404K8785j23335j96150J03061
$$ -364921 -375120 -306655 -205784 -211787 -167252 -182104 -209508 -180723 -304058 -500208 -397147
12134c97147Q812N663k51643J77615L85942k9456j79832L9449j20884J08814R9433
$$ -397147 -388335 -382672 -634315 -456700 -70758 -100214 -280046 -240597 -361481 -252667 -153234
12123a53234J16827j78179l4103Q9517J50582R1136k7171m0016R3557j01632J09913
$$ -153234 -36407 -214586 -248689 -159172 -8590 82546 55375 15359 108916 7284 117197
12112A17197J35867r4902l3194K1331Q9812N583j54105M9918J18819j80614j47204
$$ 117197 253064 158162 124968 146299 236111 241694 87589 137507 256326 75712 -71492
12101g1492k43597j65362M8794m0974J05412Q5252N0005J65438k1196J43343P7639
$$ -71492 -315089 -480451 -431657 -472631 -367219 -281967 -231962 -66524 -87720 55623 133262
12090A33262J00534j39055N3342J64628M4653k54304l01278j15545M6276Q5623
$$ 133262 233796 94741 148083 312711 357364 103060 -198218 -313763 -267487 -181864
12080a81864J01182q2802p0695R3267n4276j3344K9805K13845K5771N6363M1139
$$ -181864 -80682 -163484 -234179 -140912 -195188 -208532 -178727 35118 60889 117252 158391
12069A58391L4364K7874N7128r9115J3578J2624R4587J23155K41108O0164j47215
$$ 158391 192755 220629 277757 178642 192220 204844 299431 422586 663694 723858 576643
12058E76643N2079J32470J30422K46023m1354j79498K773k52640j05323J62098
$$ 576643 628722 761192 891614 1137637 1096283 916785 919558 666918 561595 723693
12048G23693p092k69727M0433j32360k33532o3874J56405K10159J05599J38377
$$ 723693 716601 446874 487307 354947 121415 57541 213946 424105 529704 668081
12038F68081L658R1899m0501j04307j54458k0415K481K06556n9389J0681L2907
$$ 668081 671739 763638 723137 618830 464372 443957 446438 652994 593605 604286 637193
12027F37193j01572N1104J39048k48882k43434j92891K70673K00740k45420N5378
$$ 637193 535621 586725 725773 476891 233457 40566 311239 511979 266559 321937
12017C21937J9854m5028j9746J59671K44599q707N5705M8665j50953j5234k24440
$$ 321937 341791 296763 277017 436688 681287 672580 728285 776950 625997 610763 386323
12006C86323r4091Q2927j14678J2080Q6582O1735P4143J44996J63205J72696N711
$$ 386323 292232 375159 260481 272561 359143 420878 495021 640017 803222 975918 981629
11995I81629M0060j31722k38913Q4142j04958J28425k1451j30832J96607N2674
$$ 981629 1021689 889967 651054 735196 630238 758663 737212 606380 802987 855661
11985H55661J90342n239k47162k2518K24452q3297J16768L18802J38148P750L7784
$$ 855661 1046003 1040764 793602 771084 995536 912239 1029007 1347809 1485957 1493707 1531491
11974A531491J35265n3550n3304J71177M3634P1124M14569K20086m2460P6341
$$ 1531491 1666756 1613206 1559902 1731079 1774713 1845837 2260406 2480492 2438032 2514373
11964B514373J6849J16066J52454K04642L84485K03730M4366K49585K77370K62443
$$ 2514373 2531222 2647288 2799742 3004384 3388869 3592599 3636965 3886550 4163920 4426363
11954D426363M80519M97586K56138M11195N03149L83529N66295Q47779Q13078
$$ 4426363 4906882 5404468 5660606 6071801 6574950 6958479 7524774 8372553 9185631
11945I185631R15978J080288J227502J580212K007329J980159K363358K603929
$$ 9185631 10101609 11181897 12409399 13989611 15996940 17977099 20340457 22944386
11937B2944386L333770L969215N172704O690171Q616183J1492501J5480208K1876645
$$ 22944386 26278156 30247371 35420075 42110246 50726429 62218930 77699138 99575783
11929I9575783L2289173M7117719O4980507P7971620P5007261N2310101K2446236
$$ 99575783 131864956 178982675 243963182 321934802 396942063 449252164 471698400
11922D71698400L465523n84890K559662l972980l9185298q1417776q6658663o4973578
$$ 471698400 475163923 474579033 477138695 473165715 433980417 352562641 265903978 200930400
11914B00930400m3354753k8901825j9990051j4406433j0645667q132686o420150
$$ 200930400 157575647 128673822 108683771 94277338 83631671 75498985 69078835
11907F9078835n116774m202805l762966l636133l456804l060040k747987k693237
$$ 69078835 63962061 59759256 55996290 52360157 48903353 45843313 43095326 40402089
11899D0402089k412723j908831j827876j945394j477116j280906j116667r74877
$$ 40402089 37989366 36080535 34252659 32307265 30830149 29549243 28432576 27457699
11891B7457699r00519r98821r48846r63755o75813n66861p21093p39159p00766
$$ 27457699 26557180 25558359 24609513 23645758 22969945 22403084 21681991 20942832 20242066
11882B0242066q56324p29781q77546q28560p01993p08143o85758n94587n87873
$$ 20242066 19385742 18655961 17778415 16949855 16247862 15539719 14853961 14259374 13671501
11873A3671501m75606l16204j28544m01376n90293o74547n97544l32810k43508
$$ 13671501 13195895 12879691 12751147 12349771 11759478 11084931 10487387 10154577 9911069
11864I911069k75989k16103n14043m73168j70667k76240l94919j66132k40374
$$ 9911069 9635080 9418977 8904934 8431766 8261099 7984859 7589940 7423808 7183434
11855G183434l52076k45413k23780r1539R7736K2659j72224j61516l46674r8541
$$ 7183434 6831358 6585945 6362165 6270626 6368362 6391021 6218797 6057281 5710607 5612066
11845E612066l822l25473l25895k51738j49353q8859M5666j78622j37502J2328
$$ 5612066 5608244 5282771 4956876 4705138 4555785 4466926 4512592 4333970 4196468 4208796
11835D208796n8510j49673j49299j53160k29581N4272j09139j64714K02495J8617
$$ 4208796 4150286 4000613 3851314 3698154 3468573 3522845 3413706 3248992 3451487 3470104
11825C470104k70268k53058k4120Q1424Q3670q058k31944j93945Q3329O754j06397
$$ 3470104 3199836 2946778 2922658 3004082 3087752 3079694 2847750 2653805 2737134 2743888 2637491
11814B637491l93715k04566j63859N8496K07609J57986r8780l9907m0399j5820
$$ 2637491 2243776 2039210 1875351 1933847 2141456 2299442 2200662 2160755 2120356 2104536
11804B104536L8179j38139J52671m5232Q193j39121k06264J21182q2926j47180
$$ 2104536 2142715 2004576 2157247 2112015 2120208 1981087 1774823 1896005 1813079 1665899
11794A665899k13260k16408k15356j44277j0745J21776j26414k6522J06582j58431
$$ 1665899 1452639 1236231 1020875 876598 865853 987629 861215 834693 941275 782844
11784G82844P4315P4975j09597p1607J14785Q4719O174r1381l0981K03236O6731
$$ 782844 857159 932134 822537 750930 865715 950434 956608 865227 834246 1037482 1104213
11773A104213j27516P5965j42553n9680L0158l7291k40051O9117J6985n1012l20435
$$ 1104213 976697 1052662 910109 850429 880587 843296 603245 672362 689347 638335 317900
11762C17900p9883L23221J94320J12975l966p9476k31451k87714O9341l398j83806
$$ 317900 238017 561238 755558 868533 864567 785091 553640 265926 335267 331869 148063
11751A48063j75086O4475P9648M2498M9307L36764K25167R194n3199j60974k13211
$$ 148063 -27023 37452 117100 159598 208905 545669 770836 780030 726831 565857 352646
11740C52646j32961k8507j47696k07954j8903K43071L6601n0247K40143P5664
$$ 352646 219685 191178 43482 -164472 -183375 59696 96297 46050 286193 361857
11730C61857r3552J38168k1898j440J02557R2328k14889Q169J85969P1412L9182
$$ 361857 268305 406473 384575 383135 485692 578020 363131 371300 557269 628681 667863
11719F67863n9520O783j2717L218j16333l5988j13034m3002J28816O0146k06730
$$ 667863 608343 615126 602409 605627 489294 453306 340272 297270 426086 486232 279502
11708B79502R447J6080p4105J30798Q6133j32779n9344K07723K17643j57719q6394
$$ 279502 288949 305029 230924 361722 447855 315076 255732 463455 681098 523379 436985
11697D36985j49585N516J92471q7359j30982n9930l583J95875j03629j11477N0412
$$ 436985 287400 292916 485387 398028 267046 207116 203533 399408 295779 184302 234714
11686B34714P0182J01884O756Q3368J18858n0231j59771j28829k13946m4972P2247
$$ 234714 304896 406780 413536 496904 615762 565531 405760 276931 62985 18013 90260
11675I0260J58815k0510n7713K7352J31753K48489P1239L5606j7054k60239j26613
$$ 90260 249075 228565 170852 198204 329957 578446 649685 685291 668237 407998 281385
11664B81385J04027j31621P4939j61361q4623q390J61893O6366j37783M2981n956
$$ 281385 385412 253791 328730 167369 82746 74356 236249 302615 164832 207813 201857
11653B01857k05799n9660J7567O6529J5001Q1240M6426j4766N6429M6652o9946
$$ 201857 -3942 -63602 -46035 20494 35495 116735 163161 148395 204824 251476 181530
11642A81530j51402j33556J06951O9004k77273N865N0768P1039J48115J38927
$$ 181530 30128 -103428 3523 72527 -204746 -198881 -148113 -77074 71041 209968
11632B09968L050O0895M7306n0938j16638k7353J47040J98685j39619l27108j45266
$$ 209968 213018 273913 321219 270281 153643 126290 273330 472015 332396 5288 -139978
11621a39978L7202J41489l0684R0118J60931L4536Q3595J40608Q3904j72060k20275
$$ -139978 -102776 38713 8029 98147 259078 293614 377209 517817 601721 429661 209386
11610B09386L354P0486L2504L8361k57593o3838J51971k25504O313K4578p3310
$$ 209386 212740 283226 315730 354091 96498 32660 184631 -40873 -34560 -9982 -83292
11599h3292l1129K34662Q7394j78209q9325K4851J66963M9157R8165j12890L2720
$$ -83292 -114421 120241 207635 29426 -59899 -35048 131915 181072 279237 166347 199067
11588A99067J0367l7691o4656j20900j28114J52145N0412j07579O8093l9951O6420
$$ 199067 209434 171743 107087 -13813 -141927 10218 60630 -46949 21144 -18807 47613
11577D7613N8040m88974o1680K52224K24799n0170o2307j96065m1108N4245k614
$$ 47613 105653 -383321 -445001 -192777 32022 -18148 -80455 -276520 -317628 -263383 -265997
11566b65997p0351J01767K4232J63363J96558l7489K1527O5277j73883K5522n3160
$$ -265997 -336348 -234581 -210349 -46986 149572 112083 133610 198887 25004 50526 -2634
11555b634j59583Q8952J44432J94983j35710o4436L1666k18484k21046R3677M1454
$$ -2634 -162217 -73265 71167 266150 130440 66004 97670 -120814 -341860 -248183 -206729
11544b06729m2564j7491j7338M6403J17797J12992n0662j21605j81869M5933J56160
$$ -206729 -249293 -266784 -284122 -237719 -119922 -6930 -57592 -179197 -361066 -315133 -158973
11533a58973J69864N6218N1471J9008n2003j03656p655M5915r838j63141M0651
$$ -158973 10891 67109 118580 137588 85585 -18071 -25726 20189 10351 -152790 -112139
11522a12139P2055k1668l1255j11984K1260J64406m2780k3046K02488J12021l3598
$$ -112139 -40084 -61752 -93007 -204991 -183731 -19325 -62105 -85151 117337 229358 195760
11511A95760j16742P3413N169m7537R1056p1844L7414m9236r1910j47678j50749
$$ 195760 79018 152431 157600 110063 201119 129275 166689 117453 25543 -122135 -272884
11500b72884P7296l0602P9673J01657j27350l5574n3327O7019L0043j2492q494
$$ -272884 -195588 -226190 -146517 -44860 -172210 -207784 -261111 -194092 -164049 -176541 -185035
11489a85035J57159J07142k25312j39932q9941J06764R6749M3065M1727M4451
$$ -185035 -27876 79266 -146046 -285978 -375919 -269155 -172406 -129341 -87614 -43163
11479d3163k43020j49594q205j12694m3738K84284M27601r1357L533j06003L7420
$$ -43163 -286183 -435777 -443982 -556676 -600414 -316130 111471 20114 23647 -82356 -44936
11468d4936P5846m0135Q1839K01866k84n5742k79590J86152m9390j37729K9795
$$ -44936 30910 -9225 72614 274480 274196 218454 -61136 125016 75626 -62103 -32308
11457c2308J32524p2957P1759j5018k07724m4136J02791o4401Q9622o6399J8700
$$ -32308 100216 27259 99018 84000 -123724 -167860 -65069 -129470 -39848 -106247 -87547
11446h7547j75570n1401N1358k2108n3376N4839k0406K40272R662k02875j41820
$$ -87547 -263117 -314518 -263160 -285268 -338644 -283805 -304211 -63939 -54277 -257152 -398972
11435c98972Q8547J22506K47326j30909n4415J42519r2215N5352q817J15636P9758
$$ -398972 -310425 -187919 59407 -71502 -125917 16602 -75613 -20261 -29078 86558 166316
11424A66316j689k3856l3724k18446j33810j20045M1053R2905Q6625j2268M3705
$$ 166316 164627 140771 107047 -111399 -245209 -365254 -324201 -231296 -144671 -156939 -113234
11413a13234J92341J7740J07937r1618j91307n4783j315M9628k6323K99074P3137
$$ -113234 79107 96847 204784 113166 -78141 -132924 -134239 -84611 -110934 188140 261277
11402B61277j50857j96394j09358P2286K7989j3254J6947K50654o9937j07874
$$ 261277 110420 -85974 -195332 -123046 -95057 -108311 -91364 159290 89353 -18521
11392a8521L540O0612J26553k02693q2100j85974P3167J23885J20730J8968K5665
$$ -18521 -14981 45631 172184 -30509 -112609 -298583 -225416 -101531 19199 38167 63832
11381F3832J69728J9911l26284k24396Q743p8900j5284J40943J58399J66988l1228
$$ 63832 233560 253471 -72813 -297209 -288466 -367366 -382650 -241707 -83308 83680 52452
11370E2452p1479k3561j43267n9506M312J6151K84491J58643l4531l14523j36515
$$ 52452 -19027 -42588 -185855 -245361 -241049 -224898 59593 218236 183705 -130818 -267333
11359b67333O2768L9049J48092j04126j39023J3305j31519p7098K15254L58830
$$ -267333 -204565 -165516 -17424 -121550 -260573 -247268 -378787 -455885 -240631 118199
11349A18199m5055p1129m3975j71616K1267L7549j40460J36355L47609j31311
$$ 118199 73144 2015 -41960 -213576 -192309 -154760 -295220 -158865 188744 57433
11339E7433j139J2019l6157k05116L4185P3296M5771r5069j51214o6373K40497
$$ 57433 56294 68313 32156 -172960 -138775 -65479 -19708 -114777 -265991 -332364 -91867
11328i1867J84762j23028K8859M989j06416k62454J11256R5724K45858L4671j66884
$$ -91867 92895 -30133 -1274 3715 -102701 -365155 -253899 -158175 87683 122354 -44530
11317d4530k43344K99219J91690K1615j96695j49735j09292J01672p1677m9123
$$ -44530 -287874 11345 203035 224650 27955 -121780 -231072 -129400 -201077 -250200
11307b50200q613P199K5952J09354P6506J09644j38878k89820o3587N7949J12653
$$ -250200 -258813 -251614 -225662 -116308 -39802 69842 -69036 -358856 -422443 -364494 -251841
11296b51841L6039J60580j37008k15029L3019j24333K0498J90936K42873K6818
$$ -251841 -215802 -55222 -192230 -407259 -374240 -498573 -478075 -287139 -44266 -17448
11286a7448K7523j19301J51974J70259K85j06874j37499j4883J03515M6113J89619
$$ -17448 10075 -109226 42748 213007 213292 106418 -31081 -45964 57551 103664 293283
11275B93283q2283k07256k7643n3323p7055K05359R1794l1746J40703r7658M4116
$$ 293283 211000 3744 -23899 -77222 -154277 51082 142876 111130 251833 154175 198291
11264A98291J17973j7462j84916j07734J72938k31414k53746P3769J51977L4929
$$ 198291 316264 298802 113886 6152 179090 -52324 -306070 -232301 -80324 -45395
11254d5395j95049j40584J20582Q3046Q3614l941R4423l7092O2486p3812j4284
$$ -45395 -240444 -381028 -260446 -177400 -93786 -97727 -3304 -40396 22090 -51722 -66006
11243f6006P7196l9306j69385P143J30035n5873m5421K11399J1836R0118q2408
$$ -66006 11190 -28116 -197501 -190358 -60323 -116196 -161617 49782 61618 151736 69328
11232F9328m9064L2352q6578n8717J27758r244K4064P0391K64216l7500k26024
$$ 69328 20264 52616 -33962 -92679 35079 25835 49899 120290 384506 347006 120982
11221A20982j90996K7718j54050j20313Q9452K36478q8292o5328O8817J28678
$$ 120982 -70014 -42296 -196346 -316659 -227207 9271 -79021 -144349 -75532 53146
11211E3146J45901J18951J77659L9813o3577o7067l2715J21379p6869n9901k0144
$$ 53146 199047 317998 495657 535470 471893 404826 372111 493490 416621 356720 336576
11200C36576k36581j33653O5839j42162q5615n1615j26428o7049L03874K82900
$$ 336576 99995 -33658 32181 -109981 -195596 -247211 -373639 -440688 -136814 146086
11190A46086p7418k56310J3685K0160n4421J14853J49996J82884N550k3733o1257
$$ 146086 68668 -187642 -173957 -153797 -208218 -93365 56631 239515 245065 221332 160075
11179A60075J00887q696j9585n0418j64042j50898N1708J01966L1092J23563k0050
$$ 160075 260962 252266 232681 182263 18221 -132677 -80969 20997 52089 175652 155602
11168A55602J3001J3004k42245r0216Q428K3736L16884k385k69108j91456K7775
$$ 155602 168603 181607 -60638 -150854 -142426 -118690 198194 195809 -73299 -264755 -236980
11157b36980K00370P4434Q8457m0680r320j22691k36081n7074K34587K52827k4522
$$ -236980 -36610 37824 126281 85601 76281 -46410 -282491 -339565 -104978 147849 123327
11146A23327p0949k912O1250l3622j6725N7709R5741R8655l51376k75267j43271
$$ 123327 52378 49466 110716 77094 60369 118078 213819 312474 -38902 -314169 -457440
11135d57440J04112J25428k1290l3896K27423J30373n6214J1886q4437r1376J00582
$$ -457440 -353328 -227900 -249190 -283086 -55663 74710 18496 30382 -54055 -145431 -44849
11124d4849J615N5996n8005j82908m12J36068J34343l0622j85559O6892J71090
$$ -44849 -43234 12762 -45243 -228151 -228563 -92495 41848 11226 -174333 -107441 63649
11113F3649r4617l43518q8437J32874Q9025L6360J11777J99280J77579N1490k58827
$$ 63649 -30968 -374486 -462923 -330049 -241024 -204664 -92887 106393 283972 335462 76635
11102G6635k18117l56k6629J05306l5714l9023n83J33560j17335r9135M4275R2374
$$ 76635 -141482 -141838 -168467 -63161 -98875 -137898 -138481 -4921 -122256 -221391 -177116 -84742
11090h4742l1361P2168J48469j49331O9378l8523K5170P1554P4244n8335k89015
$$ -84742 -116103 -43935 104534 -44797 24581 -13942 11228 82782 157026 98691 -190324
11079a90324o0214q991M6303J16900J42810k37536n7061l1004j14499p8452Q4295
$$ -190324 -250538 -259529 -213226 -96326 46484 -191052 -248113 -279117 -393616 -472068 -387773
11068c87773K90029q8239j1894J03133j30825j97382l6603J06547K35409p9570
$$ -387773 -97744 -185983 -197877 -94744 -225569 -422951 -459554 -353007 -117598 -197168
11058a97168j07157j43851J52745K90437N8394j12172J5056K34167l3810n5068
$$ -197168 -304325 -448176 -295431 -4994 53400 -58772 -43716 190451 156641 101573
11048A01573n3202M0079O0242J81009l7988o6008l6014l441J85212J47656o1051
$$ 101573 48371 88450 148692 329701 291713 225705 189691 186250 371462 519118 458067
11037D58067J29224J16153K4093J50664L03549j1216J25966J9471j09931j59095
$$ 458067 587291 703444 727537 878201 1181750 1170534 1296500 1315971 1206040 1046945
11027A046945j14356L6040J67947N4316j58405J27938K51836M3459j53624k47711
$$ 1046945 932589 968629 1136576 1190892 1032487 1160425 1412261 1455720 1302096 1054385
11017A054385r4151K34578N292m9917j60879j03858j22809j5072O1441n0129R9672
$$ 1054385 960234 1194812 1200104 1150187 989308 885450 762641 747569 809010 758881 858553
11006H58553m2678j67159j00975q7748k1127J53713r4163M6675p9865j95246P0924
$$ 858553 815875 648716 547741 459993 438866 592579 498416 545091 465226 269980 340904
10995C40904o2158p8086j9709l1284j39011j09389P4851n5802R9699l5057m1633
$$ 340904 278746 200660 180951 149667 10656 -98733 -23882 -79684 20015 -15042 -56675
10984e6675k18201k89741Q0601M21125K27458N9769j64020l7913N3737M8655j22513
$$ -56675 -274876 -564617 -484016 -62891 164567 224336 60316 22403 76140 124795 2282
10973B282k4521R615j1100k0128j49364J22476K15966P5422L3747j54254k52670
$$ 2282 -22239 -12624 -23724 -43852 -193216 -70740 145226 220648 254395 100141 -152529
10962a52529J6659M3464J09391J84086K14810K84985m4584o9707j7803o6588m8617
$$ -152529 -135870 -92406 16985 201071 415881 700866 656282 586575 568772 502184 453567
10951D53567l0904q9377j80517j42666M0965J17388j56739r1777k9684K03237
$$ 453567 422663 333286 152769 10103 51068 168456 11717 -80060 -109744 93493
10941I3493J40512m7552l4768R8888R6531l0580k01651o6970j97498p3729O1331
$$ 93493 234005 186453 151685 250573 347104 316524 114873 47903 -149595 -223324 -161993
10930a61993K17738J30952n5195k1729O2006L0232j01092j92414N1405K69283
$$ -161993 55745 186697 131502 109773 171779 202011 100919 -91495 -40090 229193
10920B29193L3985o876Q0987j7833j05463n1289J26152l0024j1738r9236j26895
$$ 229193 263178 256302 337289 319456 213993 162704 288856 258832 247094 147858 20963
10909B0963j02741j25924j15907j98544J0152K59474K11418o7360M0517L02305
$$ 20963 -81778 -207702 -323609 -522153 -512001 -252527 -41109 -108469 -67952 234353
10899B34353n9872k6210k64666o6293n6460l1926R8033l1369p1278j4557J18949
$$ 234353 174481 148271 -116395 -182688 -239148 -271074 -173041 -204410 -275688 -290245 -171296
10888a71296m7174j7521p9155j72588N9410O8745n0698J69888J93732M3217n9120
$$ -171296 -218470 -235991 -315146 -487734 -428324 -359579 -410277 -240389 -46657 -3440 -62560
10877f2560k13699J2902J34220j5451r6492L2899L3386p7944j19412J6981n4676
$$ -62560 -276259 -263357 -129137 -144588 -241080 -208181 -174795 -252739 -372151 -355170 -409846
10866d09846l0510K930K22676L19925k24990K0349K46990L2316R4841p8813j29528
$$ -409846 -440356 -437426 -214750 105175 -119815 -99466 147524 179840 274681 195868 66340
10855F6340M169K62072O8690m5406j72074n8873J0408Q5170J68245r5885k13141
$$ 66340 70509 332581 401271 355865 183791 124918 135326 220496 388741 292856 79715
10844G9715q8057l1000o7734O1101M8691K4100K5312N4211j3033M941p1073o1257
$$ 79715 -8342 -39342 -107076 -45975 2716 26816 52128 106339 93306 98247 27174 -34083
10832c4083j919N1384N5146K0928k5294M9153j91388j50441q3130o724N3634K16768
$$ -34083 -36002 15382 70528 91456 66162 115315 -76073 -226514 -309644 -316368 -262734 -45966
10820d5966J26486J76607l957n0686k8674j36025j1418j5042p6345j9993L8792
$$ -45966 80520 257127 253170 202484 173810 37785 26367 11325 -65020 -85013 -46221
10809d6221P4031k22720k3201R4442J02857N0046n7394l5037m7951j92450J47994
$$ -46221 27810 -194910 -218111 -123669 -20812 29234 -28160 -63197 -111148 -303598 -155604
10798a55604K1423O8706J19348j386n9268j04103l530j15579j16889L1377L6608
$$ -155604 -134181 -65475 53873 52487 -6781 -110884 -114414 -229993 -346882 -315505 -278897
10787b78897j9856Q7420J16413J1421p5248J00017K1425m8453j18599j53873L1579
$$ -278897 -298753 -211333 -94920 -83499 -158747 -58730 -37305 -85758 -204357 -358230 -326651
10776c26651l0423N3743o794O6722J38753J18588j21810J8734o0942J94792J25681
$$ -326651 -357074 -303331 -310125 -243403 -104650 13938 -107872 -89138 -150080 44712 170393
10765A70393l29583j35716J56629R3510J57192L01452j16571k3955n4561j54829
$$ 170393 -159190 -294906 -138277 -44767 112425 413877 297306 273351 218790 63961
10755F3961j01751n8447J00346n46m6160n2144K15853j0441j12832J8497r7807
$$ 63961 -37790 -96237 4109 3563 -42597 -94741 121112 110671 -2161 16336 -81471
10744h1471n8134k1638J54499Q4954J9851M4971j05050Q7942l1165p3800J05089
$$ -81471 -139605 -161243 -6744 78210 98061 143032 37982 125924 94759 20959 126048
10733A26048m7906j23261J22199O9293j25209j01277k5135P9478J9672p0981J05077
$$ 126048 78142 -45119 77080 146373 21164 -80113 -105248 -25770 -6098 -77079 27998
10722B7998J42888J37336J37548l337L4781M242l8021O3596k32346j35118K107
$$ 27998 170886 308222 445770 442433 477214 481456 443435 507031 274685 139567 141674
10711A41674j43865K67049J95044n3228J37561J91495L2282j01910l00496o938
$$ 141674 -2191 264858 459902 406674 544235 735730 768012 666102 365606 358668
10701C58668R9920m9872j67433p4950O5256J17681q1620l3700R0606J08050k64530
$$ 358668 458588 408716 241283 166333 231589 349270 267650 233950 324556 432606 168076
10690A68076q7794M7861J61932J15116J07978K98344J14660l03812o4387k9331
$$ 168076 80282 128143 290075 405191 513169 811513 926173 622361 557974 528643
10680E28643j55512R3759j75199k47145p400j24003K7244K07267Q880N2342J11267
$$ 528643 373131 466890 291691 44546 37146 -86857 -59613 147654 156534 208876 320143
10669C20143J73769J6231l2564L4212J09563j51631j5296Q1214R6861L40598K62316
$$ 320143 493912 510143 477579 511791 621354 469723 454427 535641 632502 973100 1235416
10658A235416J37428J31025J72235L8020r037K07587J47857k3700j83567k95363
$$ 1235416 1372844 1503869 1676104 1714124 1705087 1912674 2060531 2036831 1853264 1557901
10648A557901j13339L13234M9820L116P978m333J64190O3567K22417K88117N99470
$$ 1557901 1444562 1757796 1807616 1810732 1818710 1814377 1978567 2042134 2264551 2552668 3152138
10637C152138N76885P63244O08691M04507N46394O29462R66285R03359J055766
$$ 3152138 3729023 4492267 5100958 5505465 6051859 6681321 7647606 8550965 9606731
10628I606731J167876J259749J856203K898231L952971N010095O611884Q328719
$$ 9606731 10774607 12034356 13890559 16788790 20741761 25751856 32363740 40692459
10620D0692459R467046Q825560P599142O166133N082655M632231N076259M951604
$$ 40692459 50159505 58985065 66584207 72750340 77832995 82465226 87541485 92493089
10612I2493089M367666N259152Q092765J2122572J4874968J4281410J0672020
$$ 92493089 96860755 102119907 110212672 122335244 137210212 151491622 162163642
10605A62163642O825962N011499N118115N461162L775462N40478p1659M364490
$$ 162163642 168989604 174001103 179119218 184580380 188355842 188896320 188824661 193189151
10597A93189151J0957554J5310369J4103199Q696161L752597J120779K25492q87489
$$ 193189151 204146705 219457074 233560273 242256434 246009031 247129810 247355302 246467813
10589B46467813m764498j1251456j4766628j1011512l877330P15792J219216j114208
$$ 246467813 241703315 230451859 215685231 204673719 200796389 201512181 202731397 201617189
10581B01617189l408263m614343m378249n114998q466223j3301966j5306713j2764981
$$ 201617189 198208926 193594583 189216334 184101336 175635113 162333147 147026434 134261453
10573A34261453q162249m886829l551576m036380m889523n091927n100814n727586
$$ 134261453 126099204 121212375 117660799 113624419 108734896 103642969 98542155 92814569
10565I2814569p259506r084133j0106942r179121p280732n473192m221896l244138
$$ 92814569 85555063 76470930 66363988 57184867 49904135 44430943 40209047 36964909
10557C6964909k761368k355633k075577j678164j328328r07995j154649j403977
$$ 36964909 34203541 31847908 29772331 28094167 26765839 25857844 24703195 23299218
10549B3299218j221136r88360r45904q50057o67100p63050p77923n92153n71390
$$ 23299218 22078082 21089722 20143818 19293761 18626661 17863611 17085688 16493535 15922145
10540A5922145n61538p82121o80282m69637l42533k14274k48662m85967p9619
$$ 15922145 15360607 14578486 13898204 13428567 13086034 12871760 12623098 12137131 12057512
10531A2057512k77481m84147n85648m01828m69918m37830l61421k51249k3211
$$ 12057512 11780031 11295884 10710236 10308408 9838490 9400660 9039239 8787990 8764779
10522H764779j80973k68544j42012k11977j98918n7417k26130k66323l90416l86301
$$ 8764779 8583806 8315262 8173250 7961273 7762355 7704938 7478808 7212485 6822069 6435768
10512F435768k05455J71094j61621n02602k50284L5690j90202j81720j52711j85467
$$ 6435768 6230313 6401407 6239786 5737184 5486900 5522590 5332388 5150668 4997957 4812490
10502D812490L4660J61412k49663J3325j18380k39986j22418Q2094q1752j73741
$$ 4812490 4847150 5008562 4758899 4772224 4653844 4413858 4291440 4373534 4291782 4118041
10492D118041j21075q3046K0702K4083r4484l84992k59745J00484j31661k69957
$$ 4118041 3996966 3913920 3934622 3958705 3864221 3479229 3219484 3319968 3188307 2918350
10482B918350n1152j37146j39900Q7312L4346j36902q8266K9708j18851j33440
$$ 2918350 2867198 2730052 2590152 2677464 2711810 2574908 2486642 2516350 2397499 2264059
10472B264059o7435k32886j2742k44280R1898Q1373k24687k04892j07095j5499
$$ 2264059 2196624 1963738 1950996 1706716 1798614 1879987 1655300 1450408 1343313 1327814
10462A327814m9484N9912Q3927m2247l9634K4567j04775j62848k32412N2612N3264
$$ 1327814 1278330 1338242 1422169 1379922 1340288 1364855 1260080 1097232 864820 917432 970696
10451I70696J49587M9945j97400J17144J23883j64479P4024o4505q380Q329p9760
$$ 970696 1120283 1170228 972828 1089972 1213855 1049376 1123400 1058895 1050515 1058844 979084
10440I79084J06306Q4119J74027k83015k10104r0263j5006J85420N5146j15942
$$ 979084 1085390 1169509 1343536 1060521 850417 760154 745148 930568 985714 869772
10430H69772q7824k4220J26397J20899p5857j68577p4077Q4766o2797p9725J08785
$$ 869772 781948 757728 884125 1005024 929167 760590 686513 771279 708482 628757 737542
10419G37542R294L8259J13011j13352K2789N6808M0144N5231J24510j24014m98815
$$ 737542 746836 785095 898106 784754 807543 864351 904495 959726 1084236 960222 461407
10408D61407j35441K52681k4463K2972p7332j73310j7868M7329J15891j47696
$$ 461407 325966 578647 554184 577156 499824 326514 308646 355975 471866 324170
10398C24170j48843M0314p3872m8731K61673O8520P3990K70913p5688R265j31135
$$ 324170 175327 215641 141769 93038 354711 423231 497221 768134 692446 701711 570576
10387E70576n6377O4740l4971j04124K5506j65067j05679J22382J10364J82981
$$ 570576 514199 578939 543968 439844 465350 300283 194604 316986 427350 610331
10377F10331o2792j5497j61823R9746M4243l5677K36537J03981j49543k18487
$$ 610331 547539 532042 370219 469965 514208 478531 715068 819049 669506 451019
10367D51019j06862K79935J4212j07165k97679m8534J26425O5539R096N5697j06223
$$ 451019 344157 624092 638304 531139 233460 184926 311351 376890 385986 441683 335460
10356C35460q6401j70359O7956M5263o5002J54001K07040M6884k02892p8564Q3625
$$ 335460 249059 78700 146656 191919 126917 280918 487958 534842 331950 253386 337011
10345C37011L9913q4937J4866J59690Q1452l2385K8763K89598K21373Q1399J72016
$$ 337011 376924 291987 306853 466543 547995 515610 544373 833971 1055344 1136743 1308759
10334A308759j6003J8519j1656q8591j98569j16829J36543n9938j83117j10521
$$ 1308759 1292756 1311275 1299619 1211028 1012459 895630 1032173 972235 789118 678597
10324F78597L3855O8904j388k6609j68464j40525p9840j05622J2483k60495k16264
$$ 678597 712452 781356 779968 753359 584895 444370 364530 258908 271391 10896 -205368
10313b05368J50881L10052Q3904k00794j38180J42779j66318K2783K43785r7645
$$ -205368 -54487 255565 339469 138675 495 143274 -23044 -261 243524 145879
10303A45879r2189J78823K23972k48034k2893p1670m4298r114q5603R3875M5166
$$ 145879 53690 232513 456485 208451 185558 113888 69590 60476 -25127 68748 113914
10292A13914M1452j38539j79527J2973J65109L8797K3306p1661k5902M5864q9206
$$ 113914 155366 16827 -162700 -149727 15382 54179 77485 5824 -20078 25786 -63420
10281f3420q0798R0960k544k3304J4656R880K6068k5526Q3676M1494R9652r090
$$ -63420 -144218 -53258 -55802 -79106 -64450 -54570 -28502 -54028 29648 71142 170794 161704
10269A61704l36774k0858K76256J58022l11050j78453J84216Q7981J68324Q8083
$$ 161704 -175070 -195928 80328 238350 -72700 -251153 -66937 21044 189368 277451
10259B77451k8203j8462j50905l3176J31655m6246p0652Q5935K17644r0226j82665
$$ 277451 249248 230786 79881 46705 178360 132114 61462 147397 365041 274815 92150
10248I2150m8283L0502J5213N6881Q0087j78847j48413k1400j06307o3180K07831
$$ 92150 43867 74369 89582 146463 226550 47703 -100710 -122110 -228417 -291597 -83766
10237h3766J89417L3804q5862M7956j2284j43067m8912K73312J86030Q225j19539
$$ -83766 105651 139455 53593 101549 89265 -53802 -102714 170598 356628 364853 245314
10226B45314k22657k0141J89993K7423l9832l7101P2467r4539m2665q8027o512
$$ 245314 22657 2516 192509 219932 180100 142999 215466 120927 78262 -9765 -16277
10215a6277K57415j4980j06862j21908j26882o4344O3284J18681j04290n6403
$$ -16277 241138 226158 119296 -2612 -129494 -193838 -130554 -11873 -116163 -172566
10205a72566K9493K33150J43899o4303n7269L9147J3k6734P4394j1085J6962p7911
$$ -172566 -143073 90077 233976 169673 112404 151551 151564 124830 199224 188139 205101 127190
10193A27190R5171r9257M6308j7788j41052J24730J3715J59840J6228r6983q162
$$ 127190 222361 123104 169412 151624 10572 135302 149017 308857 325085 228102 219940
10182B19940J70304J51852j7090L6444J52063R8607j13335K6534L9117n0480K729
$$ 219940 390244 542096 525006 561450 713513 812120 698785 725319 764436 713956 716685
10171G16685J76962K42061k96128K3231j7527k21395R4153J43437O1049J74030
$$ 716685 893647 1135708 839580 862811 845284 623889 718042 861479 922528 1096558
10161A096558k74735L5297J98151J9955K5466J78193J46308P0990j84838J54745
$$ 1096558 821823 857120 1055271 1075226 1100692 1278885 1425193 1496183 1311345 1466090
10151A466090k7673j79830j08898p356O3353k21923j5898j03602J07995J32770
$$ 1466090 1438417 1258587 1149689 1142333 1205686 983763 967865 864263 972258 1105028
10141A105028j95702k91472J8953L418j15959j22162j35524O9890J70154L6856
$$ 1105028 909326 617854 636807 640225 524266 402104 266580 336470 506624 543480
10131E43480j42335K64225J96036j65642o7260p7907j78687l2327K36193P9878
$$ 543480 401145 665370 861406 695764 628504 550597 371910 339583 575776 655654
10121F55654r7908k42942J50605o054k06259P514l5576N8863j02584k11329m2346
$$ 655654 557746 314804 465409 459355 253096 260610 225034 283897 181313 -30016 -72362
10110g2362K8780J30962P7210l5439P649j22705O3669j025l1788R0726O7675r7680
$$ -72362 -43582 87380 164590 129151 136800 14095 77764 76739 44951 135677 203352 105672
10098A05672j48741P8147K46253J01566n7600l8553k4213M4305j7752m6573N4815
$$ 105672 -43069 35078 281331 382897 325297 286744 262531 306836 289084 242511 297326
10087B97326o6352k8191K05500J39142o6443j88596j67591l6338p04O2855J8781
$$ 297326 230974 202783 408283 547425 480982 292386 124795 88457 87753 150608 169389
10076A69389j54106L84477K20862j28370n6660j12950l6145j4665o569J96647
$$ 169389 15283 399760 620622 492252 435592 322642 286497 271832 265263 461910
10066D61910j0398k10020q9953K68705K0215r9152l3628L3985j8384k07232o2421
$$ 461910 451512 241492 151539 420244 440459 341307 307679 341664 323280 116048 53627
10055E3627o738K06601J93347J16806m8848J12352l3686k10466j80597Q1403K25271
$$ 53627 46889 253490 446837 563643 514795 627147 593461 382995 202398 283801 509072
10044E09072P2151k62388l61028l282M2191j03003L9241J25161N920P3937L8514
$$ 509072 581223 318835 -42193 -45475 -3284 -106287 -67046 58115 64035 137972 176486
10033A76486L7910r2713r1474N6325O304m7103j28664p5867R6320r0611l1686
$$ 176486 214396 121683 30209 86534 92838 45735 -82929 -158796 -62476 -153087 -184773
10022a84773M0660J12474R487j60123J16136K55153j36656k46138J70976K34854
$$ -184773 -144113 -31639 -22152 -182275 -66139 189014 52358 -193780 -22804 212050
10012B12050O3125p1287p6582R782J93480p6818p1264J56375p967J4894q267K73369
$$ 212050 275175 203888 127306 137088 330568 253750 182486 338861 330894 345788 337521 610890
10000F10890J38035j3516k03670k70424m867Q5448P4785J6796j02787O53O2267
$$ 610890 748925 735409 531739 261315 256448 341896 416681 433477 330690 331343 393610
9989C93610J1834o9757p2303K51179L5531N3060m762j98474J21014J65036k18626
$$ 393610 405444 335687 263384 514563 550094 603154 598392 399918 520932 685968 467342
9978D67342j93221K62516J53359q9216k48311M8691J74671J52593K06218m2349
$$ 467342 274121 536637 689996 600780 352469 401160 575831 728424 934642 892293
9968H92293J82547Q8425L38921J55267N0473P4010N5672J99947M28657M92004
$$ 892293 1074840 1163265 1502186 1657453 1707926 1781936 1837608 2037555 2466212 2958216
9958B958216L41434O11079N53024L71032J63286p9289J01600M69032L06165J25570
$$ 2958216 3299650 3910729 4463753 4834785 4998071 4918782 5020382 5489414 5795579 5921149
9948E921149J06372L36491N95639Q82262J516707K414114L561722O537976J3012308
$$ 5921149 6027521 6364012 6959651 7841913 9358620 11772734 15334456 21872432 34884740
9939C4884740K3743008L3929198L0004118J0747583m326743o914880k022702O259896
$$ 34884740 58627748 92556946 122561064 133308647 128981904 122067024 120044322 126304218
9931A26304218J3905665j3863817m6586271l1786428j4764390p210957l942438
$$ 126304218 140209883 126346066 79759795 47973367 33208977 25998020 22055582
9924B2055582k903526k112665j591169j086841n85935o51312m22439p10550r43120
$$ 22055582 19152056 17039391 15448222 14361381 13775446 13124134 12701695 11991145 11048025
9915A1048025q03002p32424l83411l62646k66594m49385o40877n44311l35401
$$ 11048025 10245023 9512599 9129188 8766542 8499948 8050563 7409686 6865375 6529974
9906F529974k17666k04458k58842k86314l23899k00126j24485k55036j98931j25996
$$ 6529974 6312308 6107850 5849008 5562694 5238795 5038669 4914184 4659148 4460217 4334221
9896D334221k03134j32607j0167l78796l20025M0566Q4315j83152j17452J84667
$$ 4334221 4131087 3998480 3988313 3609517 3289492 3330058 3414373 3231221 3113769 3298436
9886C298436j86176j47158k4220j79420j41983R2495L8970K91640J91998j44000
$$ 3298436 3112260 2965102 2940882 2761462 2619479 2711974 2750944 3042584 3234582 3090582
9876C090582P7614j3998j0653k0943l4912K24480j86326q5203n5961J11221r2823
$$ 3090582 3168196 3154198 3143545 3122602 3087690 3312170 3125844 3040641 2984680 3095901 3003078
9865C003078k29579k59528j38402k41469o7813J50682j23687l45056j63893P766
$$ 3003078 2773499 2513971 2375569 2134100 2066287 2216969 2093282 1748226 1584333 1592099
9855A592099K2155k9562j69063N7697r3434j35491j46490L3234k2556K0720j76554
$$ 1592099 1614254 1584692 1415629 1473326 1379892 1244401 1097911 1131145 1108589 1129309 952755
9844I52755K0372R9613p1963L1580K6540j38326j1155j25538l1566R0007j99618
$$ 952755 973127 1072740 1000777 1032357 1058897 920571 909416 783878 752312 842319 642701
9833F42701O7589j91603j98792J153J30946J49005P2897J68547p7705M9700n047
$$ 642701 710290 518687 319895 321048 451994 600999 673896 842443 764738 814438 809391
9822H09391j65196r9306J36387J8004j86934J04126K5469J1532L5663o6296n3983
$$ 809391 644195 544889 681276 699280 512346 616472 641941 653473 689136 622840 568857
9811E68857j05404n4423q2306l9722L7195J11500q5728j08962m3216J84240R876
$$ 568857 463453 409030 326724 287002 324197 435697 349969 241007 197791 382031 391907
9800C91907N0490q7756m5573P8011p3431j06033k33905L5620J59296o1948q9942
$$ 391907 442397 354641 309068 387079 313648 207615 -26290 9330 168626 106678 16736
9789A6736J30328m6090l8394J53554J70570r9546m3631L4411P2522k07301j81908
$$ 16736 147064 100974 62580 216134 386704 287158 243527 277938 350460 143159 -38749
9778c8749p7363J59210O9464m0002J02072o1175P0499M8327k5626J18748O7949
$$ -38749 -116112 43098 112562 72560 174632 113457 183956 232283 206657 325405 393354
9767C93354j73763j37362J69114J02083r994l2405j24160k04915j03439Q4585
$$ 393354 219591 82229 251343 353426 343432 311027 186867 -18048 -121487 -36902
9757c6902J55854J75427j2026j83780p9427P3241J46566J1950L9222O1470L5599
$$ -36902 118952 294379 282353 98573 19146 92387 238953 250903 290125 351595 387194
9746C87194q5285j80882j57397n1834p7781J21203p431k5455J07489k4831j03337
$$ 387194 301909 121027 -36370 -88204 -165985 -44782 -52213 -77668 29821 4990 -98347
9735i8347J40331l8675P8036L7028K3059R5610m47m0282o7706r4898p016K06216
$$ -98347 41984 3309 81345 118373 141432 237042 236595 196313 128607 33709 26693 232909
9723B32909Q9482j79133r109P3740n0833k7344k6974J62706J28333r9760k57513
$$ 232909 322391 143258 134149 207889 157056 129712 102738 265444 393777 294017 36504
9712C6504M7102Q2174J03117M2968j08255j22480q2914j10835K9194L09239K34953
$$ 36504 83606 165780 268897 311865 203610 81130 -1784 -112619 -83425 225814 460767
9701D60767j52793q3048k7658j44139j40608j44264R8012J00301J13715J63089
$$ 460767 307974 224926 197268 53129 -87479 -231743 -133731 -33430 80285 243374
9691B43374q9708j56096J1542Q3453K2152l6516K1992Q7434j45008J18549n2490
$$ 243374 153666 -2430 9112 92565 114717 78201 100193 187627 42619 161168 108678
9680A08678L2514K49735N9404j8655k33688O752j3798k37228K9046N4663P6970
$$ 108678 141192 390927 450331 431676 197988 204740 190942 -46286 -17240 37423 114393
9669A14393K43196r127j02357n2267J0804j22236O5437K30262q8067J37492J36621
$$ 114393 357589 348462 246105 193838 204642 82406 147843 378105 290038 427530 564151
9658E64151J25094p0079k10216p6229l2087J02330K06278m4007k73843r2057o4183
$$ 564151 689245 619166 408950 332721 300634 402964 609242 565235 291392 199335 135152
9647A35152J44375j95993O7944P6045J27484K4455r3492n0177j82044M4104K53284
$$ 135152 279527 83534 151478 227523 355007 379462 285970 235793 53749 97853 351137
9636C51137M3227j65734j85550j26111k9576K3507j0364L9051j60351R508J52766
$$ 351137 394364 228630 43080 -83031 -112607 -89100 -99464 -60413 -220764 -211256 -58490
9625e8490O6277r6268L0349J53048j87528Q7570J08438j62813m9194k2349K31772
$$ -58490 7787 -88481 -58132 94916 -92612 -5042 103396 -59417 -108611 -130960 100812
9614A00812Q8156o0846j4977O0831J7272l365o0648j52834j21335q4323O5363
$$ 100812 188968 128122 113145 173976 191248 187883 127235 -25599 -146934 -231257 -165894
9603a65894N0269J26863Q1062N8512j39608q9227J49589J19363o1997K1464j35674
$$ -165894 -115625 11238 92300 150812 11204 -78023 71566 190929 128932 150396 14722
9592A4722j65581K0053q1662k2576J23694J48634J69826N4171o1626r482j37238
$$ 14722 -150859 -130806 -212468 -235044 -111350 37284 207110 261281 199655 190173 52935
9581E2935j11113O7531J05873J74427M7550k5976k03401j98274M6019J77091L37169
$$ 52935 -58178 9353 115226 289653 337203 311227 107826 -90448 -44429 132662 469831
9570D69831L33511J63025j25911j11234J1166J83586J88785r2143k2375K37107
$$ 469831 803342 966367 840456 729222 740388 923974 1112759 1020616 998241 1235348
9560A235348K89324J47352J33597q8008j07483M3907q4409j32813J36938N390
$$ 1235348 1524672 1672024 1805621 1717613 1610130 1654037 1569628 1436815 1573753 1579143
9550A579143k62297l01939k61715k36233l4471Q330j22736k94111J9094L3245
$$ 1579143 1316846 1014907 753192 516959 482488 490818 368082 73971 93065 126310
9540A26310K32846J76176j50423j70876m3319K61515K51272K37055j4361l0758
$$ 126310 359156 535332 384909 214033 170714 432229 683501 920556 906195 875437
9530H75437r9107j13984N6432J95344k23495k29867q4885J20077k49461j65507
$$ 875437 776330 662346 718778 914122 690627 460760 375875 495952 246491 80984
9520H0984k7569J34626m9613P5266N4340j130k41827L5127m5014k9960j27825
$$ 80984 53415 188041 138428 213694 268034 266904 25077 60204 15190 -14770 -142595
9509a42595M3987J67194r3108j48383J70830J30285R1400J03041k48938k02000
$$ -142595 -98608 68586 -24522 -172905 -2075 128210 219610 322651 73713 -128287
9499a28287K6762m2685J19976J21354k8820K0617q5498p6951p8076K48906m1925
$$ -128287 -101525 -144210 -24234 97120 68300 88917 3419 -73532 -151608 97298 55373
9488E5373j23707L6194m963J18335R0695j71835k69401J9290L1299P7565N9702
$$ 55373 -68334 -32140 -37103 81232 171927 92 -269309 -250019 -218720 -141155 -81453
9477h1453K96243K532k15969q7511j3277N0583j14779P566P1552J34752K3598
$$ -81453 214790 217322 1353 -86158 -99435 -48852 -163631 -156065 -84513 50239 73837
9466G3837J0814J40673j87758l12242j12359k3796P5045J0212J64727J2926P6845
$$ 73837 84651 225324 37566 -274676 -387035 -410831 -335786 -325574 -160847 -147921 -71076
9455g1076M0594R3217j19004K0098j06710J38152J73374K33451k18085l43059
$$ -71076 -30482 62735 -56269 -36171 -142881 -4729 168645 402096 184011 -159048
9445a59048q6063r946J45735L39218N4793k09364J90076N8497j07754r704P4297
$$ -159048 -245111 -255057 -109322 229896 284689 75325 265401 323898 216144 206440 280737
9434B80737O548M6061J13113M4413l6582J29915J26211K10528J41927n9369l2483
$$ 280737 287285 333346 446459 490872 454290 584205 710416 920944 1062871 1003502 971019
9423I71019p6848l6046P9570r2508j05002k48511l4425l040j70224j85717N7368
$$ 971019 894171 858125 937695 845187 740185 491674 457249 454209 283985 98268 155636
9412A55636R2294J11576K6616j54488n1707M8122j61915R3896J02637J42817l8910
$$ 155636 247930 359506 386122 231634 179927 228049 66134 160030 262667 405484 366574
9401C66574j03079j03987M858J00202J6031O3961k9035m5173j66529r3756K9450
$$ 366574 263495 159508 164366 264568 280599 344560 315525 270352 103823 10067 39517
9390C9517R9309J36357q4483Q804q2197o5691j623N4162o9151l4313K29166K86508
$$ 39517 138826 275183 190700 199504 117307 51616 49993 104155 35004 691 229857 516365
9378E16365p573j56408j43849l371j4894j1169p4518N8025J2836k557j8220p0498
$$ 516365 508792 352384 208535 205164 190270 179101 104583 162608 175444 172887 154667 84169
9366H4169J2918J4089J2955n4676k37015k2727J19338Q9977k5921N309L6777j3239
$$ 84169 97087 111176 124131 69455 -167560 -190287 -70949 19028 -6893 -1584 35193 21954
9354B1954J39536J19247j3297k39671j38141j00448J98496j91864j05137O3369
$$ 21954 161490 280737 267440 27769 -110372 -210820 -12324 -204188 -309325 -245956
9344b45956l50j3998J47130J67770J01512k1266J5939j8460J17635J42870r8734
$$ -245956 -246306 -260304 -113174 54596 156108 134842 150781 132321 249956 392826 294092
9333B94092k58059j07455J6055l6906j29366K3025m8826K6691j20832J68131J37905
$$ 294092 36033 -71422 -55367 -92273 -221639 -198614 -247440 -220749 -341581 -173450 -35545
9322c5545J50379r8820j65824j5655J25865J92457l4545j53073R3841R8833j3050
$$ -35545 114834 16014 -149810 -165465 -39600 152857 118312 -34761 59080 157913 144863
9311A44863J14827P2061k62304n4019R5544J68830J53799K5791j66276k2963K28112
$$ 144863 259690 331751 69447 15428 110972 279802 433601 459392 293116 270153 498265
9300D98265j65811j12105j6856m0028j52773j63528R7654K21218J39483J09693
$$ 498265 332454 220349 203493 163465 10692 -152836 -55182 166036 305519 415212
9290D15212j84110j82078N7192R461R646P7795J6596j19996M2428J15013j41900
$$ 415212 231102 49024 106216 115677 125323 203118 219714 99718 142146 257159 115259
9279A15259r3467j14034o7747K07631J38440J00806j06770k0843k2917j15620
$$ 115259 21792 -92242 -159989 47642 186082 286888 180118 159275 136358 20738
9269B0738q2980q6897J54785K44771m6820j90920q211R79n5188j19699j9784J02983
$$ 20738 -62242 -149139 5646 250417 203597 12677 4466 5445 -49743 -169442 -189226 -86243
9257h6243N1079M1002J93798P1117l35945k46691K6732q0062K81292L61120j4136
$$ -86243 -35164 5838 199636 270753 -65192 -311883 -285151 -365213 -83921 277199 263063
9246B63063r1057K7871J57449q5837J4515K45077n139k05571j46867m4866j02545
$$ 263063 172006 199877 357326 271489 286004 531081 525942 320371 173504 128638 26093
9235B6093n828J39793K49431L5519k50326l6524N6795k01738j02715P8380O6953
$$ 26093 20265 160058 409489 445008 194682 158158 214953 13215 -89500 -11120 55833
9224E5833j6817p5155P0916J6273M345M4083L98345J56803j70490j96175j19285
$$ 55833 39016 -36139 34777 51050 55395 99478 497823 654626 484136 287961 168676
9213A68676N7943r3180j44488M1811J38357J05928p8343k2485p4989j02569j70492
$$ 168676 226619 133439 -11049 30762 169119 275047 196704 174219 99230 -3339 -173831
9202a73831r0484N3943J46R9722Q5119J1956R7547K2574K19423N6500p330j13179
$$ -173831 -264315 -210372 -210226 -110504 -25385 -13429 84118 106692 326115 382615 375285 262106
9190B62106N7754Q8722j66735J93077P0356j50124m813K81865j10613k29882q5675
$$ 262106 319860 408582 241847 434924 505280 355156 350343 632208 521595 291713 206038
9179B06038j28895j16618J70340L86455J00407j38760j07701j96724k77098m1867
$$ 206038 77143 -39475 130865 517320 617727 478967 371266 174542 -102556 -144423
9169a44423L5894J30188N8352p1141K1853L75015J4297k52307q1100j15207p9572
$$ -144423 -108529 21659 80011 8870 30723 405738 420035 167728 86628 -28579 -108151
9158a08151J54183J22728l8596j75559q0873O7704J59306R5859o4868k2354j05510
$$ -108151 46032 168760 130164 -45395 -126268 -58564 100742 196601 131733 109379 3869
9147C869o1175J43959R3372j24108O8510J46850m3197l64913k00956Q0002q1042
$$ 3869 -57306 86653 180025 55917 124427 271277 228080 -136833 -337789 -257787 -338829
9136c38829N6191L12258R0078L624O8668k03831J4340k9116k20442j42585O2035
$$ -338829 -282638 29620 119698 123322 191990 -11841 2499 -26617 -247059 -389644 -327609
9125c27609j11221J60850q616r9531j02435j9799n078n342L23716J99140q9714
$$ -327609 -438830 -277980 -286596 -386127 -488562 -508361 -513439 -518781 -195065 4075 -85639
9114h5639m5606J55840n6121n3119o747J44742l6040j20714k6172m7875N565j20405
$$ -85639 -131245 24595 -31526 -84645 -91392 53350 17310 -103404 -129576 -177451 -171886 -292291
9102b92291N9208O1930J54483k06160j64341J01829K05479Q7126J07120J40231
$$ -292291 -233083 -171153 -16670 -222830 -387171 -285342 -79863 7263 114383 254614
9092B54614M6749k12850k64974N6426J2308l4122O1655l2013r4436P9433P095
$$ 254614 301363 88513 -176461 -120035 -107727 -141849 -80194 -112207 -206643 -127210 -120115
9081a20115n1956k3256j2189j2756k40976J32593R1065K0446n612N4809K49395
$$ -120115 -172071 -195327 -207516 -220272 -461248 -328655 -237590 -217144 -222756 -167947 81448
9070H1448J91252L8285o3477q6067O104r2505j5509J14217K7726k1054m5553p7455
$$ 81448 272700 310985 247508 161441 167545 75040 59531 173748 201474 180420 134867 57412
9058E7412k79464P4721O7879l4994R1450j94097k51609K2800K01599J66357J05009
$$ 57412 -222052 -147331 -79452 -114446 -22996 -217093 -468702 -445902 -244303 -77946 27063
9047B7063m8199j43150p3830J25875o1963L0951J06205j3592p485R1755J12476
$$ 27063 -21136 -164286 -238116 -112241 -174204 -143253 -37048 -50640 -58125 33630 146106
9036A46106K9665k34820K8632L7932m2139n9298j54533o793J54483M2656K2771
$$ 146106 175771 -59049 -30417 7515 -34624 -93922 -248455 -255248 -100765 -58109 -35338
9025c5338J07530J41788l07j31067L8281L4374k1874j91911k24326r7846J32714
$$ -35338 72192 213980 213673 82606 120887 155261 133387 -58524 -282850 -380696 -247982
9014b47982J27519J64505k0572j50299M2949o8622j27583K0316J99896J18553
$$ -247982 -120463 44042 23470 -126829 -83880 -152502 -280085 -259769 -59873 58680
9004E8680k08864m3860K98805l8823j8261L4821j56247k21607J38050K27610K5887
$$ 58680 -150184 -194044 104761 65938 47677 82498 -73749 -295356 -157306 70304 96191
8993I6191J79075k64340j45902K64438J23331r1644n3250N7258N245J08262J2129
$$ 96191 275266 10926 -134976 129462 252793 161149 107899 165157 170402 278664 290793
8982B90793O7463l16k0977j02904j05490R8880R718m4766Q3215Q527M6967o4816
$$ 290793 358256 357940 336963 234059 128569 227449 237167 192401 275616 284143 331110 266294
8970B66294j08066N1195J21665n009l8621L1081N1062j61648j81892k02319l4437
$$ 266294 158228 209423 331088 326079 287458 318539 369601 207953 26061 -176258 -210695
8959b10695J12776K2735J35047J62411k27345j55141J61928J37057O7847J17664
$$ -210695 -97919 -75184 59863 222274 -5071 -160212 1716 138773 206620 324284
8949C24284m7461q8805j31461l0213j15324j52977J54013R0397K7890o8282K2824
$$ 324284 276823 188018 56557 26344 -88980 -241957 -87944 2453 30343 -37939 -15115
8938a5115L18511j17932k38271j68655Q1998K67177J53291M8856j23184k16657
$$ -15115 303396 185464 -52807 -221462 -139464 127713 281004 329860 206676 -9981
8928i981j7402J48870M117j74381p1508q6918k5897j74444P522J57486K46144
$$ -9981 -27383 121487 125604 -48777 -120285 -207203 -233100 -407544 -400022 -242536 3608
8917C608K32745j34911J92647q8864j41090p3863K49519J43062M2175l9189j86688
$$ 3608 236353 101442 294089 205225 64135 -9728 239791 382853 425028 385839 199151
8906A99151m6733J23809K4378m231o6826K6801j54787p5031J26824K4479n2088
$$ 199151 152418 276227 300605 296374 229548 256349 101562 26531 153355 177834 125746
8895A25746j71733l0638M6061J64832L0769k32754l6507R6153J16971L34195N6674
$$ 125746 -45987 -76625 -30564 134268 165037 -67717 -104224 -8071 108900 443095 499769
8884D99769o9476k60638M7697K00040j30905j61991j11815L1871R6239L4240m1523
$$ 499769 430293 169655 217352 417392 286487 124496 12681 44552 140791 175031 133508
8873A33508r6499L1364L3291J52395m3291P4514J57427j16758o1336J19747o8887
$$ 133508 37009 68373 101664 254059 210768 285282 442709 325951 264615 384362 315475
8862C15475K2290j14872j38224j90160J24653P6264J12848M6515k00617P2495
$$ 315475 337765 222893 84669 -105491 19162 95426 208274 254789 54172 126667
8852A26667O6288P7820m4800k7158J42887J20386k01330j63254J18265K6338j80232
$$ 126667 192955 270775 225975 198817 341704 462090 260760 97506 215771 242109 61877
8841F1877K49645P6351j09938n9271j19989J87149N5806J2570J23075j03527j95246
$$ 61877 311522 387873 277935 218664 98675 285824 341630 354200 477275 373748 178502
8830A78502P6367j23024j81967L941J37046J2514J14279M9873N0558R7030j92196
$$ 178502 254869 131845 -50122 -46181 90865 103379 217658 267531 318089 415119 222923
8819B22923j79086q6959O3569P6910m5207j0305j05J56552L05272P7353j41810
$$ 222923 43837 -43122 20447 97357 52150 41845 41740 198292 503564 580917 439107
8808D39107k69406J18768P5532O0412O465j7330j80304j89257j94567k8874j9354
$$ 439107 169701 288469 364001 424413 430878 413548 233244 43987 -150580 -179454 -198808
8797a98808P8565J21311J47155m6404P728L8329j70526m2029J37712n4662Q941
$$ -198808 -120243 1068 148223 101819 109547 147876 -22650 -64679 73033 18371 27312
8786B7312J0533N6663j64215P5881m5971j12061J01700J86018j25181n0786l9203
$$ 27312 37845 94508 -69707 6174 -39797 -151858 -50158 135860 10679 -40107 -79310
8775g9310L4711L95089J7185p6467N9352O7024Q3185k2343j86135j66058N7057
$$ -79310 -44599 350490 367675 291208 350560 417584 500769 478426 292291 126233 183290
8764A83290O5303l5308n7518M5126M1634M5190j44054j15851N2320j31277o8087
$$ 183290 248593 213285 155767 200893 242527 287717 143663 27812 80132 -51145 -119232
8753a19232j66532Q9723P5765P4306P68q0977J77587J25893M5021j8161k6974
$$ -119232 -285764 -196041 -120276 -45970 -45202 -126179 51408 177301 222322 204161 177187
8742A77187l1785M2806Q9357n4786k5376k19733r0338J90014O6548K32406R0681
$$ 177187 145402 188208 277565 222779 197403 -22330 -112668 77346 143894 376300 466981
8731D66981m6185k0579l0438J5840l1195J64995k24464k84326j1861J89290l685
$$ 466981 420796 400217 369779 385619 354424 519419 294955 10629 -1232 188058 184373
8720A84373p9549q6181j40049R9287J87518J43516r2039m7753K6936k6408k09963
$$ 184373 104824 18643 -121406 -22119 165399 308915 216876 169123 196059 169651 -40312
8709d0312j64454J78743K9961N9464Q6178r2477j69569N6171p6678K50625R7084
$$ -40312 -204766 -26023 3938 63402 149580 57103 -112466 -56295 -132973 117652 214736
8698B14736n2099j27005j54684J85375q041q6184j89466n451J72201J00317J5605
$$ 214736 162637 35632 -119052 66323 58282 -27902 -217368 -222819 -50618 49699 65304
8687F5304r55R0092l4396p6381k5515k19649P7937K46868J53562l1058K9821j24335
$$ 65304 64349 154441 120045 43664 18149 -201500 -123563 123305 276867 245809 275630 151295
8675A51295k30969K4322j32297j19659K7251P2423l7551K87800K48869j88682
$$ 151295 -79674 -55352 -187649 -307308 -280057 -207634 -245185 42615 291484 102802
8665A02802j08360M7436r3452n878K0724J6757K84001L5404j01755k305j29546
$$ 102802 -5558 41878 -51574 -57452 -36728 -19971 264030 299434 197679 195374 65828
8654F5828J16802Q0899q5427q2649O5716K5036k82411J8999n8826J91215j7189
$$ 65828 182630 263529 178102 95453 161169 186205 -96206 -77207 -136033 55182 37993
8643C7993K0722L9303o0479l4897m5319J54425m2823p0288P9291j85560N3620
$$ 37993 58715 98018 37539 2642 -42677 111748 68925 -1363 77928 -107632 -54012
8632e4012k6603Q8163J22652r3824j2588P2244q6188o5650K4661j01820j7861
$$ -54012 -80615 7548 130200 36376 23788 96032 9844 -55806 -31145 -132965 -150826
8621a50826P2750L0500k11264j89280K32791J23184J02891k1164m4362J81966
$$ -150826 -78076 -47576 -258840 -448120 -215329 -92145 10746 -10418 -54780 127186
8611A27186q8666M4357K7462o8412q1321p6646M7407O5909M195j29184J09293
$$ 127186 38520 82877 110339 41927 -39394 -116040 -68633 -2724 1471 -127713 -18420
8600a8420J21523l9943M7245l2194k9160J03705P7709l1487N2981J76160N3475
$$ -18420 103103 63160 110405 78211 49051 152756 230465 198978 251959 428119 481594
8589D81594j45418O8749j27415j04460n8017N5033p900l6465o9593M0895N5296
$$ 481594 336176 404925 277510 173050 115033 170066 162166 125701 56108 97003 152299
8578A52299o5266J1729J1180n4314r675J46510J69069P1215l8998j39154P5647
$$ 152299 87033 98762 109942 55628 45953 192463 361532 432747 393749 254595 330242
8567C30242K9445J1898J26918m6852k62399k29346m6099K02901n9577k1941J57794
$$ 330242 359687 371585 498503 451651 189252 -40094 -86193 116708 57131 35190 192984
8556A92984o5140p0460j04384m6764q2490k4296N5509l0660M0574r4466J06201
$$ 192984 127844 57384 -47000 -93764 -176254 -200550 -145041 -175701 -135127 -229593 -123392
8545a23392L57637J0112n0241J6013k8707o4779r7886N0245j65177j17676r2071
$$ -123392 234245 244357 194116 210129 181422 116643 18757 69002 -96175 -213851 -305922
8534c05922J20188J66211l3595M8536J57478k4316j33733j83578r975P6101Q937
$$ -305922 -185734 -19523 -53118 -4582 152896 128580 -5153 -188731 -198706 -122605 -113668
8523a13668J93364M7012o2983j64581J13386j3306k17370l5742J89221J5656j62871
$$ -113668 79696 126708 63725 -100856 12530 -776 -218146 -253888 -64667 -49011 -211882
8512b11882k7575O3622j62472k2201J97831k8127J65093J41634K4624K6067q0155
$$ -211882 -239457 -175835 -338307 -360508 -162677 -190804 -25711 115923 140547 166614 86459
8501H6459R7189R9738j8347n652M0994j58090p2369o5264o3443k18533j16596
$$ 86459 183648 283386 265039 259387 300381 142291 69922 4658 -58785 -277318 -393914
8490c93914J50399k996K5519J29019k748K2280M9828P6754J21289l3569p4704
$$ -393914 -243515 -246511 -220992 -91973 -94721 -72441 -22613 54141 175430 141861 67157
8479F7157j42576O076q2564J81814R8434m9328o6345J59094l3328k69447R7384
$$ 67157 -75419 -69343 -151907 29907 128341 79013 12668 171762 138434 -131013 -33629
8468c3629n5587J11387J72005K1654P7584q437l12509j88708L8980L12057L44751
$$ -33629 -89216 22171 194176 215830 293414 284977 -27532 -216240 -177260 134797 479548
8457D79548P7111k7647P9483J04080M2506J5955j53732m16354k77880j7341J10988
$$ 479548 556659 529012 608495 712575 755081 771036 617304 200950 -76930 -94271 16717
8446A6717O2046M7396P9094Q2730K94460J04055n7838K94078K26766K3546M3229
$$ 16717 78763 126159 205253 287983 582443 686498 628660 922738 1149504 1173050 1216279
8435A216279L0524r422k02877q3294q3833k9847j26968k48741j69100k8701j9576
$$ 1216279 1246803 1237381 1034504 951210 867377 837530 710562 461821 292721 264020 244444
8424B44444m285J21197p2434r758l8364j14l25899l2328K25282K18364L9050j58792
$$ 244444 240159 361356 288922 279164 240800 240686 -85213 -117541 107741 326105 365155 206363
8412B06363l9925K78425Q5339m30260k44785Q248L43156j0813j52389L561j48461
$$ 206363 166438 444863 530202 99942 -144843 -136595 206561 195748 43359 46920 -101541
8401a01541n6658J92847J37628j48119k7479J02364k9246j83039j19233L7992
$$ -101541 -158199 34648 172276 24157 -3322 99042 69796 -113243 -232476 -194484
8391a94484N2419K18395P2299J53579J46717q1263R5102k0423k78134j11077J62136
$$ -194484 -142065 76330 148629 302208 448925 367662 462764 442341 164207 53130 215266
8380B15266K26750O6546l43893j18517O0800o6655M45j89091J01416K19839q4965
$$ 215266 442016 508562 164669 46152 106952 40297 40742 -148349 -46933 172906 87941
8369H7941j61315J33329K8434r6222j33550q2914l8101r5225M6560J21678J26591
$$ 87941 -73374 59955 88389 -7833 -141383 -224297 -262398 -357623 -311063 -189385 -62794
8358f2794P5311Q5591r6682J81393J6827J3885J74311Q2936l5735j06828o9957
$$ -62794 12517 98108 1426 182819 199646 213531 387842 470778 435043 328215 258258
8347B58258L9067j09204O6163L7625j20148r8204j21084L4014O518P427l8858
$$ 258258 297325 188121 254284 291909 171761 73557 -47527 -13513 -6995 432 -38426
8336c8426J59925J13793q3085j01823n4984M0168l8441p8576Q3899n4550j17888
$$ -38426 121499 235292 152207 50384 -4600 35568 -2873 -81449 2450 -52100 -169988
8325a69988N9836J0237p6377k47275n872K60723j55981k8805K09859J65614J6864
$$ -169988 -110152 -99915 -176292 -423567 -429439 -168716 -324697 -353502 -143643 21971 38835
8314C8835J17297Q3799m6236r8628J18599P9489n5822m0006p3952j57162m3446
$$ 38835 156132 239931 193695 95067 213666 293155 237333 197327 123375 -33787 -77233
8303g7233J1298L8460K08772k9894j21556o383J02887n2475j2178k5132M0431
$$ -77233 -65935 -27475 181297 151403 29847 23464 126351 73876 61698 36566 76997
8292G6997K66862o4425n965Q0133r326n4300L6456j98246k13192k11129n307K45501
$$ 76997 343859 279434 273469 353602 344276 289976 326432 128186 -85006 -296135 -301442 -55941
8280e5941K42642J08837k5053l8388j66990j14237q9133Q0323j6638J1366J01947
$$ -55941 186701 295538 270485 232097 65107 -49130 -138263 -57940 -74578 -63212 38735
8269C8735n1654q8687N2757R8619L8016m6567J08300J08619Q9654k5355O9247
$$ 38735 -12919 -101606 -48849 49770 87786 41219 149519 258138 347792 322437 391684
8258C91684k07532j19781J1829q1015m825l4164J8397J09579J30414q1556j60478
$$ 391684 184152 64371 76200 -4815 -9640 -43804 -25407 84172 214586 133030 -27448
8247b7448Q0154J00076j45548r8835J7438J13532J59467M890l1370j08573Q4993
$$ -27448 52706 152782 7234 -91601 -74163 39369 198836 203726 172356 63783 148776
8236A48776N1080K4959j64453j71962K29269j09121j55965o4940O8809J00819
$$ 148776 199856 224815 60362 -111600 117669 8548 -147417 -212357 -143548 -42729
8226d2729K90138J02210j21601K0088K1708o9950M9194j25425r1285O5094o3128
$$ -42729 247409 349619 228018 248106 269814 199864 249058 123633 32348 97442 34314
8215C4314j78881k8961n167J69430J81463n8244o3898R6669p0587N4181q8080
$$ 34314 -144567 -173528 -178695 -9265 172198 113954 50056 146725 76138 130319 42239
8204D2239j37788j01505K11142P0759j23352m7563J37342J48738J6366k9106J90303
$$ 42239 -95549 -197054 14088 84847 -38505 -86068 51274 200012 216378 187272 377575
8193C77575Q2530j55056j77597R977Q5638j29907j99130J08506J87173L4701k5602
$$ 377575 460105 305049 127452 137429 223067 93160 -105970 2536 189709 224410 198808
8182A98808r6455q5463P9501J31844j62080j3362j32899O739k7019J10664J27496
$$ 198808 102353 16890 96391 228235 66155 52793 -80106 -73367 -100386 10278 137774
8171A37774O2263J88180k49165r0400N3525p0623j53175j30305l6826J26833O3657
$$ 137774 200037 388217 139052 48652 102177 31554 -121621 -251926 -288752 -161919 -98262
8160i8262n335K09161j0109l622J3987J10900n9608K9329o8777Q4764K20039N8739
$$ -98262 -103597 105564 95455 91833 105820 216720 157112 186441 117664 202428 422467 481206
8148D81206n1155j38305k7172k7068l7360m1174o3602p704R067L9198M1554R6874
$$ 481206 430051 291746 264574 237506 200146 158972 95370 87666 96733 135931 177485 274359
8136B74359p082M4924p7487m0705J32180J14823M493P0300k42681m6286J52933
$$ 274359 267277 312201 234714 194009 326189 441012 445505 515805 273124 226838 379771
8125C79771m0362j98360r0900j30774N2517J91840J58850n7977j72832r2214J18085
$$ 379771 339409 141049 50149 -80625 -28108 163732 322582 264605 91773 -441 117644
8114A17644j01954m8040n4377q7828J35605P0554J47936L5737o0846m3707M0054
$$ 117644 15690 -32350 -86727 -174555 -38950 31604 179540 215277 154431 110724 150778
8103A50778J050m9199n2190m8350k4558O8374J9559j07653r1089k4277J3246Q3179
$$ 150778 151828 102629 50439 2089 -22469 45905 65464 -42189 -133278 -157555 -144309 -61130
8091f1130m974k6900P1359Q1068J14519M2778j52152j65638J22480J16707n8830
$$ -61130 -66104 -93004 -21645 59423 173942 216720 64568 -101070 21410 138117 79287
8080G9287l06446m2579P8345J14364j25719N3872K9740L4971l6694m8025o8039
$$ 79287 -227159 -269738 -191393 -77029 -202748 -148876 -119136 -84165 -120859 -168884 -236923
8069b36923o1103J9968R9078l6859j70927o431L56527K22468k13804k03096J2215
$$ -236923 -298026 -278058 -178980 -215839 -386766 -393197 -36670 185798 -28006 -231102 -218887
8058b18887J23547J28157q5665k952K19266N8055q3504l4921j11389N6712J94189
$$ -218887 -95340 32817 -52848 -55800 163466 221521 138017 103096 -8293 48419 242608
8047B42608J69188n4685j53170j05082j6340O937j9275L6804l6867K0697J49344
$$ 242608 411796 357111 203941 98859 82519 89456 70181 106985 70118 90815 240159
8036B40159l9367n4508J3216J58200p5186j83277j6799J42519j35756o0329o6923
$$ 240159 200792 146284 159500 317700 242514 59237 42438 184957 49201 -11128 -78051
8025g8051J17516q1312k6890J09945L4126Q6026n4152J03179o7424M1803j50555
$$ -78051 39465 -41847 -68737 41208 75334 161360 107208 210387 142963 184766 34211
8014C4211o0412K30846Q779j57973M3012q2576k97458p028J11749n7119J5926
$$ 34211 -26201 204645 213424 55451 98463 15887 -281571 -288599 -176850 -233969 -218043
8003b18043K62628O8811k01406k08670J44678J10169J32738K76911Q2159k38817
$$ -218043 44585 113396 -88010 -296680 -152002 -41833 90905 367816 449975 211158
7993B11158j63919j30312J18239m3595R0212J6311J14020j48222o4808J4393J08267
$$ 211158 47239 -83073 35166 -8429 81783 98094 212114 63892 -916 13477 121744
7982A21744q7023Q6597j8964M5228r9993N8950M7486N1881P2489p9269j03363
$$ 121744 34721 121318 102354 147582 47589 106539 154025 205906 278395 199126 95763
7971I5763k1677o5528j46758P9172J26493K4201p2010p3068J1902J32555Q4675
$$ 95763 74086 8558 -138200 -59028 67465 91666 19656 -53412 -41510 91045 175720
7960A75720Q3055J77656k5234k53265j29389n7769R0668j74176L1441K62730j82836
$$ 175720 258775 436431 411197 157932 28543 -29226 61442 -112734 -81293 181437 -1399
7949a399j78317m192j8094k15264L8907P0089p9004K2919J28161l3804l5076o6598
$$ -1399 -179716 -183908 -202002 -417266 -378359 -308270 -387274 -364355 -236194 -269998 -305074 -371672
7937c71672J8456p1284J75853j57997m3246M1655J00267J81096Q081J23814K16397
$$ -371672 -353216 -424500 -248647 -406644 -449890 -408235 -307968 -126872 -118791 5023 221420
7926B21420m8549k47178q8299P8835j08781k4084m1295j34049j76375m3203P2189
$$ 221420 172871 -74307 -162606 -83771 -192552 -216636 -257931 -391980 -568355 -611558 -539369
7915e39369K00524P6843o8621j77398j0488K4021N7171K60831J40915o8974O9733
$$ -539369 -338845 -262002 -330623 -508021 -518509 -494488 -437317 -176486 -35571 -104545 -34812
7904c4812L5678q3008k17652m9400j42626J79373K04019R3963j49149m3669J56361
$$ -34812 866 -82142 -299794 -349194 -491820 -312447 -108428 -14465 -163614 -207283 -50922
7893e0922Q0906j27995j18782p9701J7477r173J21771j30795K36249K49734j62211
$$ -50922 29984 -98011 -216793 -296494 -279017 -288190 -166419 -297214 -60965 188769 26558
7882B6558k08172N7117J13458j14410j46389K6741K26019K27199P9261j25982
$$ 26558 -181614 -124497 -11039 -125449 -271838 -245097 -19078 208121 287382 161400
7872A61400j56649j92843K8065O9032k25941j06862J12798K43716j53510j48306
$$ 161400 4751 -188092 -160027 -90995 -316936 -423798 -311000 -67284 -220794 -369100
7862c69100J63804L1352j88847l7831m8954J62846L9589N2545m6137j69250K25962
$$ -369100 -205296 -173944 -362791 -400622 -449576 -286730 -247141 -194596 -240733 -409983 -184021
7851a84021j36806k3655K08736R1859P8233J701q5347k1970L7720M2272J12712
$$ -184021 -320827 -344482 -135746 -43887 34346 36047 -49300 -71270 -33550 8722 121434
7840A21434J02446j68545j13382P5458n4629Q0967P1931r5093k68580j04161M1447
$$ 121434 223880 55335 -58047 17411 -37218 43749 115680 20587 -247993 -352154 -310707
7829c10707K11270R9579L1738o0145j17045M1872J71140R080q0059R354k2571
$$ -310707 -99437 142 31880 -28265 -145310 -103438 67702 76782 -3277 6077 -16494
7818a6494Q0315j25491j3744O0869J48021k30657k88169J03472K45360J38082
$$ -16494 63821 -61670 -75414 -14545 133476 -97181 -385350 -281878 -36518 101564
7808A01564m1972j4422O1218M55P549p930m570L7852k47545q435M9059K43381
$$ 101564 59592 45170 106388 106843 114392 106462 101892 139744 -107801 -116236 -67177 176204
7796A76204J12495j77353m7564j70155n7492O3767m6291J22273j3396L3353P3148
$$ 176204 288699 111346 63782 -106373 -163865 -100098 -146389 -24116 -37512 -4159 68989
7785F8989n4721m1015M8760o0532k42412R2397K39336j51494k60076j09595j99736
$$ 68989 14268 -26747 22013 -38519 -280931 -188534 50802 -100692 -360768 -470363 -670099
7774f70099J44359n2109N2007J83871M9410R2156J06487J27062n5395l03036r5731
$$ -670099 -525740 -577849 -525842 -341971 -292561 -200405 -93918 33144 -22251 -325287 -421018
7763d21018l0030L5933J92614K35260M0690N5276k4427k19329o5834K3796j9125
$$ -421018 -451048 -415115 -222501 12759 53449 108725 84298 -135031 -200865 -177069 -196194
7752a96194M2486O6014L3j87159j44600M5529R1215l9745N803K13497L57486n5011
$$ -196194 -153708 -87694 -87661 -274820 -419420 -373891 -282676 -322421 -316618 -103121 254365 199354
7740A99354l74366j20112J2430J21908l7179k2552J57378N9305p1004j17558l7459
$$ 199354 -175012 -295124 -282694 -160786 -197965 -220517 -63139 -3834 -74838 -192396 -229855
7729b29855O1709l0131J94739j66992j25793M6030O4107J18716j17254l164J29763
$$ -229855 -168146 -198277 -3538 -170530 -296323 -250293 -186186 -67470 -184724 -187888 -58125
7718e8125K06474n8265j6583j61323p87J32375O7063j12495n4655j25116J25171
$$ -58125 148349 90084 73501 -87822 -88609 43766 110829 -1666 -56321 -181437 -56266
7707e6266M3406k961J63199n5840j66690j01355l2594l0759n0454j38062N9048
$$ -56266 -12860 -15821 147378 91538 -75152 -176507 -209101 -239860 -290314 -428376 -369328
7696c69328K21848M0769L1209Q7945P9357P7598k68282k76736K17249K19486j57459
$$ -369328 -147480 -106711 -75502 12443 91800 169398 -98884 -375620 -158371 61115 -96344
7685i6344j76090j68070Q0898J24522j25223P4764J55464P6968k3834q7700l1858
$$ -96344 -272434 -440504 -359606 -235084 -360307 -285543 -130079 -53111 -76945 -164645 -196503
7674a96503J05546m0572k2795j04268M1700l7654k3842M611l6550q1627Q9339
$$ -196503 -90957 -131529 -154324 -258592 -216892 -254546 -278388 -273777 -310327 -391954 -302615
7663c02615K12381K43373J37516k27866p5766j14622L5216j81626K5509M6514
$$ -302615 -90234 153139 290655 62789 -12977 -127599 -92383 -274009 -248500 -201986
7653b01986J02976J42145j30722k7496J5295p8691o7724j8807K05997K6807k38967
$$ -201986 -99010 43135 -87587 -115083 -99788 -178479 -246203 -265010 -59013 -32206 -271173
7642b71173j25522r679m3057m1195N6835R5615J8284j29790J22942L13118m8490
$$ -271173 -396695 -406374 -449431 -490626 -433791 -338176 -319892 -449682 -326740 -13622 -62112
7631f2112j21314M0300J81279L54J4948K5274l41471q9800J83938M0511M6815
$$ -62112 -183426 -143126 38153 38507 53455 78729 -262742 -352542 -168604 -128093 -81278
7620h1278n4868J5163J62231p9994j15299K7976J4515j6417O9866Q3323r6930
$$ -81278 -136146 -120983 41248 -38746 -154045 -126069 -111554 -127971 -58105 25218 -71712
7609g1712M3662k710o3769l6498P3584J18840p315j48599k0481n2414j40136J46777
$$ -71712 -28050 -30760 -94529 -131027 -57443 61397 54082 -94517 -114998 -167412 -307548 -160771
7597a60771O0964M4835j60279k21876J59640K7039J3820J36691j90178j02257
$$ -160771 -99807 -54972 -215251 -437127 -277487 -250448 -236628 -99937 -290115 -392372
7587c92372l5463J47141K50960K7236q039K1757K6227o8174R3467m0038j89088
$$ -392372 -427835 -280694 -29734 -2498 -10537 11220 37447 -30727 62740 22702 -166386
7576a66386p8532Q5376K8602r8104O9485K10541N7553o4883k732k1850N7216J72190
$$ -166386 -244918 -159542 -130940 -229044 -159559 50982 108535 43652 40920 19070 76286 248476
7564B48476Q5513q0510k82953n5464K37782L8646p2410j59054N4249O056J07488
$$ 248476 333989 253479 -29474 -84938 152844 191490 119080 -39974 14275 20331 127819
7553A27819J8952j03140M5618K56635l3275k06430l6405n2858j05212p3232r8822
$$ 127819 146771 43631 89249 345884 312609 106179 69774 16916 -88296 -161528 -260350
7542b60350p0258M4434o5364k46949M245J17971J22445R308l6782J36073j542
$$ -260350 -330608 -286174 -351538 -598487 -594242 -476271 -353826 -344518 -381300 -245227 -246769
7531b46769O8097J16390l8070J71762Q1044J48717J52019r2764j72175k56493
$$ -246769 -178672 -62282 -100352 71410 152454 301171 453190 360426 188251 -68242
7521f8242m2210o1583o9359K9642J6312J41578Q891L3917L7670L0411j81052o0313
$$ -68242 -110452 -172035 -241394 -211752 -195440 -53862 -44971 -11054 26616 57027 -124025 -184338
7509a84338J22688K62141L6118M5733q498k01800m2047j6597l9417j56246n7619
$$ -184338 -61650 200491 236609 282342 273844 72044 29997 13400 -26017 -182263 -239882
7498b39882L268J47900j09276J6228J5805J31784K7930J03642k3716M8694R6484
$$ -239882 -236614 -88714 -197990 -181762 -165957 -34173 -6243 97399 73683 122377 218861
7487B18861j30674j43770k5441J09559J21748j446k28663j90176L8643R3005m6744
$$ 218861 88187 -55583 -81024 28535 150283 148837 -79826 -270002 -231359 -138354 -185098
7476a85098K2603K23648N3573J39307l0192n6753N460l5925j19905J32595m8054
$$ -185098 -162495 61153 114726 254033 223841 167088 172548 136623 16718 149313 101259
7465A01259l0096m8543J0419K8538P6465j73217p2668r1975J39043J55948K6921
$$ 101259 71163 22620 33039 61577 138042 -35175 -107843 -199818 -60775 95173 122094
7454A22094m1403p6317p2955o1396Q7893J17224m1053k04192j83670k25270q7840
$$ 122094 80691 4374 -68581 -129977 -42084 75140 34087 -170105 -353775 -579045 -666885
7443f66885J31322k9973M0887J51136P3746K2941N9420J34282J54651L0200j03632
$$ -666885 -535563 -565536 -524649 -373513 -299767 -276826 -217406 -83124 71527 101727 -1905
7432a905K5310j09029j15914L8514O2325L9131q2078M8552m6069J4976J9826K27636
$$ -1905 23405 -85624 -201538 -163024 -100699 -61568 -143646 -95094 -141163 -126187 -106361 121275
7420A21275J75561p8671k38930j62993J65279J27853Q0939J68571L9019j97446
$$ 121275 296836 218165 -20765 -183758 -18479 109374 190313 358884 397903 200457
7410B00457p6204j75500l9431o2318Q0582k9047J17356J04394n1946j4087j05904
$$ 200457 124253 -51247 -90678 -152996 -72414 -101461 15895 120289 68343 54256 -51648
7399e1648n1005J73479r4026j51170J36768J43025p9066m00903l0985J25950L9277
$$ -51648 -102653 70826 -23200 -174370 -37602 105423 26357 -374546 -405531 -279581 -240304
7388b40304l5091K0252J5897J83091J4788n9266l7502o6215j38730K03560K962
$$ -240304 -275395 -255143 -239246 -56155 -41367 -100633 -138135 -204350 -343080 -139520 -136558
7377a36558n2832j13905j48790O6351J25085j56547j18569O6788L06247M404j50106
$$ -136558 -189390 -303295 -452085 -385734 -260649 -417196 -535765 -468977 -162730 -158326 -308432
7366c08432r8078J03334J29618k7716J59171J13945j69555j58299k19058N2085
$$ -308432 -406510 -303176 -173558 -201274 -42103 71842 -97713 -256012 -475070 -422985
7356d22985K19154J85512J92548J0272r0849R0265j87600O8590K2260j47018n2194
$$ -422985 -203831 -18319 174229 184501 93652 183917 -3683 64907 87167 -59851 -112045
7345a12045N329j50868n2084J88451K62386Q3575j37325L3160J8091J24031r3123
$$ -112045 -106716 -257584 -309668 -121217 141169 224744 87419 120579 138670 262701 169578
7334A69578j98444k6590O9378r6149q4471J0430k3447J00400J23823r1668J06079
$$ 169578 -28866 -55456 13922 -82227 -166698 -156268 -179715 -79315 44508 -47160 58919
7323E8919o7559m2457j02251o6261N1432j2905L47J4275J313M1734J3532k11517
$$ 58919 -8640 -51097 -153348 -219609 -168177 -181082 -180735 -166460 -165147 -123413 -109881 -321398
7311c21398R2979J72041r330p9461J01640P1301j47207j7067l1616k10484j6654
$$ -321398 -228419 -56378 -65708 -145169 -43529 27772 -119435 -136502 -168118 -378602 -395256
7300c95256j26006J03031L11234O8335k1448K5860r5976K33083O7302q5551L3040
$$ -395256 -521262 -418231 -106997 -38662 -60110 -34250 -130226 102857 170159 84608 117648
7289A17648J82416J20228n0174j63021n0759q4639k53428q2676j2502J57462K25841
$$ 117648 300064 420292 370118 207097 156338 71699 -181729 -264405 -276907 -119445 106396
7278A06396O2822j18607K6129k00715j18922Q2664r3403l8587N2955K35928J08639
$$ 106396 169218 50611 76740 -123975 -242897 -160233 -253636 -292223 -239268 -3340 105299
7267A05299r2545n0506q2321j39586l3024J11292J33476j9116J9140J45497m6331
$$ 105299 12754 -37752 -120073 -259659 -292683 -181391 -47915 -67031 -47891 97606 51275
7256E1275q5227j4327j8888j06338j62721M810l8807J84757J90736J15526o8897
$$ 51275 -33952 -48279 -67167 -173505 -336226 -331416 -370223 -185466 5270 120796 51899
7245E1899q740j20695J52621K6755k53116j41441J64308K13943L2040R092n6970
$$ 51899 43159 -77536 75085 101840 -151276 -292717 -128409 85534 117574 126666 69696
7234F9696j91604M3353q7138k62143k22235j5498J28627R1405J43659J1423N9461
$$ 69696 -121908 -78555 -165693 -427836 -650071 -665569 -536942 -445537 -301878 -290455 -230994
7223b30994N8167N9730J51807O5761J10496j5296j46758K317J78300J83517J26008
$$ -230994 -172827 -113097 38710 104471 214967 199671 52913 55230 233530 417047 543055
7212E43055j25433k28848Q3256r2036l53390k19218k1777r4561o0812R7799K15313
$$ 543055 417622 188774 272030 179994 -173396 -392614 -414391 -508952 -569764 -471965 -256652
7201b56652K56711j12102n0879N4928J36153p8725L1583j83483j92285J61592
$$ -256652 59 -112043 -162922 -107994 28159 -50566 -18983 -202466 -394751 -233159
7191b33159O8455m0957J00562J7290m0393k3868k1765j39497N9922J64756N9435
$$ -233159 -164704 -205661 -105099 -87809 -128202 -152070 -173835 -313332 -253410 -88654 -29219
7180b9219K84463j03766p090N296j28554j19300J31630J96842k23965j06729m4574
$$ -29219 255244 151478 144388 149684 21130 -98170 33460 230302 6337 -100392 -144966
7169a44966j28357j5666q7065m3771j6495J29559J18922K18452J63033o7911j34615
$$ -144966 -273323 -288989 -376054 -419825 -436320 -306761 -187839 30613 193646 125735 -8880
7158h880j41399j77565J01972j05219r1035L0485p7237J38049K50604r5160k45577
$$ -8880 -150279 -327844 -225872 -331091 -422126 -391641 -468878 -330829 -80225 -175385 -420962
7147d20962M2629J46468K23890l3490N0229j48198R0856J22334j1896k7151J12533
$$ -420962 -378333 -231865 -7975 -41465 8764 -139434 -48578 73756 61860 34709 147242
7136A47242j2495q9626o7333P6742q8397N520j19397Q6047p2721j68080j31669
$$ 147242 134747 45121 -22212 54530 -33867 -28347 -147744 -61697 -134418 -302498 -434167
7125d34167Q9941J65887N2528j37403k626n480Q0728K84109J0647r1403j04099
$$ -434167 -344226 -178339 -125811 -263214 -265840 -271320 -190592 93517 104164 12761 -91338
7114i1338j52904k11811J78630K48000P5395L4613l2981j88454P6344Q8651j0858
$$ -91338 -244242 -456053 -277423 -29423 45972 80585 47604 -140850 -64506 24145 13287
7103A3287l2751J78558o825k52355r3235K44917J09538k04645o392k8355l8074
$$ 13287 -19464 159094 152269 -100086 -193321 51596 161134 -43511 -49903 -78258 -116332
7092a16332R8003q965j86486j21200n5555K96588K27802N0719o4865r7872l4275
$$ -116332 -18329 -27294 -213780 -334980 -390535 -93947 133855 184574 119709 21837 -12438
7081a2438J26936j00963j51356J04783M662j22446O9423K6856k0294j1471J08988
$$ -12438 114498 13535 -137821 -33038 -28376 -150822 -81399 -54543 -74837 -86308 22680
7070B2680j4716k5671m7050p4640p5470J20507o5880r87J53842p4005K504K09768
$$ 22680 7964 -17707 -64757 -139397 -214867 -94360 -160240 -161227 -7385 -81390 -78886 130882
7058A30882L3562q5272k7034J13816j06190r3243J05502q861n687j40596j03561
$$ 130882 164444 79172 52138 165954 59764 -33479 72023 63162 57475 -83121 -186682
7047a86682k4313l966O2775J39450p7007n1038o772K9728k0770M9452j78248O2023
$$ -186682 -210995 -214961 -152186 -12736 -89743 -140781 -147553 -117825 -138595 -89143 -267391 -205368
7035b05368J46273L1289L2861M0443L273J16311m8512m248k63201N3969k514j95599
$$ -205368 -59095 -27806 5055 45498 48771 165082 116570 112322 -150879 -96910 -99424 -295023
7023b95023k2084L46581L8715k10537K1871K99007k2021j99572R5235j45379k4372
$$ -295023 -317107 29474 68189 -142348 -120477 178530 156509 -43063 52172 -93207 -117579
7012a17579J72038j41582j17467j15005p8933P0450r10j03099J33940K97045Q9628
$$ -117579 54459 -87123 -204590 -319595 -398528 -328078 -328988 -432087 -298147 -1102 88526
7001H8526K9208j92368j60474j04k780J60528J3419O7090J4561q5776j24681j4648
$$ 88526 117734 -74634 -235108 -235212 -237992 -77464 -64045 3045 17606 -68170 -192851 -207499
6989b07499N2638j74484k28041J25637M5337L5541p0476O2288J22682K0207N8941
$$ -207499 -154861 -329345 -557386 -431749 -386412 -350871 -421347 -359059 -236377 -216170 -157229
6978a57229J23879J11888p0827M0838l521j48689J18666K48832K53905j36205
$$ -157229 -33350 78538 7711 48549 45028 -103661 15005 263837 517742 381537
6968C81537k24505j78522Q2777k6369j06415o9379R2663m9162j11448k36873J21303
$$ 381537 157032 -21490 61287 34918 -71497 -140876 -48213 -97375 -208823 -445696 -324393
6957c24393K72634q9331k68693L7573J37597J14094J35464j51596j06605k0645
$$ -324393 -51759 -141090 -409783 -372210 -234613 -120519 14945 -136651 -243256 -263901
6947b63901K7291M542J6725O5913p451J3439J3260L167q9902j61684j08075K56177
$$ -263901 -236610 -232068 -215343 -149430 -156881 -143442 -130182 -127015 -216917 -378601 -486676 -230499
6935b30499J80553L817P9832J17957j95894k43591J09847O4420p5051O3910J72188
$$ -230499 -49946 -46129 33703 151660 -44234 -287825 -177978 -113558 -188609 -124699 47489
6924D7489Q0532p2761k12479r045K9735J29070J90762J98291k43858k06276j51442
$$ 47489 128021 55260 -157219 -166264 -136529 -7459 183303 381594 137736 -68540 -219982
6913b19982J4409J22149n2540P2642k7405j11486k39147J6075M2978J32508K57251
$$ -219982 -205573 -83424 -135964 -63322 -90727 -202213 -441360 -425285 -382307 -249799 7452
6902G452l6960k1588n0806l8553m7315J00373J25569Q7845p3696j04878Q5943
$$ 7452 -29508 -51096 -101902 -140455 -187770 -87397 38172 126017 52321 -52557 33386
6891C3386k2763m0398J24252n945j74065P9156j6628r3685K2948p4680n43J25582
$$ 33386 10623 -29775 94477 88532 -85533 -6377 -23005 -116690 -93742 -168422 -168965 -43383
6879d3383R3328L9501j68470k42856k9078l8374J22305K67528K63837M2119n2100
$$ -43383 49945 89446 -79024 -321880 -350958 -389332 -267027 501 264338 306457 254357
6868B54357n2329K427l8700k64450p8105J82891l9265q8793J36819J14666j96514
$$ 254357 202028 204455 165755 -98695 -176800 6091 -33174 -121967 14852 129518 -66996
6857f6996k60198O5128J43322Q3435j35121J01066p9278q8211M7748Q2300k1411
$$ -66996 -327194 -262066 -118744 -35309 -170430 -69364 -148642 -236853 -189105 -106805 -128216
6846a28216J57624K26564q8639K00326K517k04968k71002j34113N467J22001J34541
$$ -128216 29408 255972 167333 367659 370176 165208 -105794 -239907 -234440 -112439 22102
6835B2102j73362l3852j05326K01894K88785J03864k07513l82844q6024K29590
$$ 22102 -151260 -185112 -290438 -88544 200241 304105 96592 -286252 -372276 -142686
6825a42686L09721J87803p2344n0705K4086k45262k96205p109J32502J1472R0634
$$ -142686 167035 354838 282494 231789 255875 10613 -285592 -292701 -160199 -148727 -58093
6814e8093j47495r9768K2322R9890O5312r9524M8620J56722l6600r2987j46021
$$ -58093 -205588 -305356 -283034 -183144 -117832 -217356 -168736 -12014 -48614 -141601 -287622
6803b87622l6032j9843p5082m4467o5485R0787J17186m1771K9802R1969q4259
$$ -287622 -323654 -343497 -418579 -463046 -528531 -437744 -320558 -362329 -332527 -240558 -324817
6792c24817l2099k27168j5204J29850N2033L6720J97497J18883k8358J859N0163
$$ -324817 -356916 -584084 -599288 -469438 -417405 -380685 -183188 -64305 -92663 -90804 -40641
6781d0641N743l3526k00345p9875J66407J64928Q8122J73469j3131r5189j62033
$$ -40641 -34898 -68424 -268769 -348644 -182237 -17309 70813 244282 231151 135962 -26071
6770b6071p4116J87295M7772k8435j9353l06419r4489J03978J02672n5687j67120
$$ -26071 -100187 87108 134880 106445 87092 -219327 -313816 -209838 -107166 -162853 -329973
6759c29973J47926J7939K11108J55516m5992n1431O0717j01093L8196j93075m3963
$$ -329973 -182047 -164108 47000 202516 156524 105093 165810 64717 102913 -90162 -134125
$$ [...]
##END NTUPLES=NMR SPECTRUM
##END=
