##TITLE=Analysis number 318933
Compound Code cc 14739
Project Code adrs
Chemist Name synnovation
##JCAMPDX= 6.0         $$ Bruker NMR JCAMP-DX V2.0
##DATA TYPE= NMR SPECTRUM
##DATA CLASS= NTUPLES
##ORIGIN= Bruker BioSpin GmbH
##OWNER= nmr
$$ XWIN-NMR		Version 3.5
$$ Tue Apr 25 12:03:06 2006 GMT Daylight Time (UT+1h)  MAYBRIDGE\nmr@NMR_250MHZ
##.OBSERVE FREQUENCY= 250.131544655141
##.OBSERVE NUCLEUS= ^1H
##.ACQUISITION MODE= SIMULTANEOUS (DQD)
##.ACQUISITION SCHEME= undefined
##.AVERAGES= 16
##.DIGITISER RES= 18
##SPECTROMETER/DATA SYSTEM= dpx250
##.PULSE SEQUENCE= zg30
##.SOLVENT NAME= CDCl3
##.SHIFT REFERENCE= (INTERNAL, CDCl3, 0, 16.522)
##AUDIT TRAIL= $$ (NUMBER, WHEN, WHO, WHERE, WHAT)
$$ ##TITLE= Audit trail, XWIN-NMR		Version 3.5
$$ ##JCAMPDX= 5.01
$$ ##ORIGIN= Bruker BioSpin GmbH
$$ ##OWNER= nmr
$$ C:\u/data/dgb/nmr/ADRS/2960/pdata/1/auditp.txt
$$ ##AUDIT TRAIL=  $$ (NUMBER, WHEN, WHO, WHERE, WHAT)
(   1,<2006-04-25 12:02:43.61 +100>,<MAYBRIDGE\nmr>,<NMR_250MHZ>,
      <created by zg, POWCHK disabled, PULCHK disabled
       configuration hash MD5:
       84 BC 41 DB A1 6E 1D 46 DA 25 12 A5 C1 ED C5 3A
       data hash MD5: 64K
       8B 06 D5 BB DA B5 18 E5 16 A3 8D D8 27 DD 63 E0>)
(   2,<2006-04-25 12:02:55.59 +100>,<MAYBRIDGE\nmr>,<NMR_250MHZ>,
      <Start of raw data processing
       ef LB = 0.3 FT_mod = 6 PKNL = 1 SI = 32K 
       data hash MD5: 32K
       FF C2 DA 23 CB 11 5A 3A 4D 03 08 03 03 ED 54 F6>)
(   3,<2006-04-25 12:02:58.31 +100>,<MAYBRIDGE\nmr>,<NMR_250MHZ>,
      <apk 
       data hash MD5: 32K
       DE 9C E3 B8 84 24 7D A6 8D 19 FC 54 53 90 CB 96>)
(   4,<2006-04-25 12:02:59.17 +100>,<MAYBRIDGE\nmr>,<NMR_250MHZ>,
      <abs ABSG = 5 
       data hash MD5: 32K
       FE EE 69 ED 0E 2F 5E 5A 8F DA 27 6B 8F B8 AE B8>)
$$ ##END=
$$ 
$$ hash MD5
$$ 18 91 CF 45 A4 FC 8C 34 75 E1 0A F3 EB 9F AC 44
##$RELAX= 
##$RELAX= 
##$RELAX= 
##$RELAX= 
##$RELAX= 
##$RELAX= 
##$RELAX= 
$$ Bruker specific parameters
$$ --------------------------
##$DU= <C:\u>
##$EXPNO= 2960
##$NAME= <ADRS>
##$PROCNO= 1
##$TYPE= <nmr>
##$USER= <dgb>
##$AMP= (0..31)
100 100 100 100 100 100 100 100 100 100 100 100 100 100 100 100 100 100 
100 100 100 100 100 100 100 100 100 100 100 100 100 100 
##$AQSEQ= 0
##$AQ_mod= 3
##$AUNM= <au_zg>
##$AUTOPOS= <25 >
##$BF1= 250.13
##$BF2= 250.13
##$BF3= 250.13
##$BF4= 250.13
##$BF5= 500.13
##$BF6= 500.13
##$BF7= 500.13
##$BF8= 500.13
##$BYTORDA= 1
##$CFDGTYP= 0
##$CFRGTYP= 5
##$CHEMSTR= <none>
##$CNST= (0..31)
1 1 145 1 1 1 1 1 1 1 1 1 1 1 1 1 1 1 1 1 1 1 1 1 1 1 1 1 1 1 1 1 
##$CPDPRG= <>
##$CPDPRG1= <>
##$CPDPRG2= <>
##$CPDPRG3= <>
##$CPDPRG4= <mlev>
##$CPDPRG5= <mlev>
##$CPDPRG6= <mlev>
##$CPDPRG7= <mlev>
##$CPDPRG8= <mlev>
##$CPDPRGB= <>
##$CPDPRGT= <>
##$D= (0..31)
0 1 0 0 0 0 0 0 0 0.06 0 0 0 0 0 0 0.0002 0 0 0 0 0 0 0 0 0 0 0 0 0 0 
0 
##$DATE= 1145962962
##$DBL= (0..7)
120 120 120 120 120 120 120 120 
##$DBP= (0..7)
150 150 150 150 150 150 150 150 
##$DBP07= 0
##$DBPNAM0= <>
##$DBPNAM1= <>
##$DBPNAM2= <>
$$ [...]
##$SUBNAM7= <"">
##$SUBNAM8= <"">
##$SUBNAM9= <"">
##$SW= 20.6930455092707
##$SWIBOX= (0..15)
0 0 3 0 0 0 0 0 0 0 0 0 0 0 0 0 
##$SW_h= 5175.983436853
##$TD= 65536
##$TD0= 1
##$TE= 295.16
##$TE2= 300
##$TE3= 300
##$TEG= 300
##$TL= (0..7)
0 120 120 120 120 120 120 120 
##$TP= (0..7)
150 150 150 150 150 150 150 150 
##$TP07= 0
##$TPNAME0= <>
##$TPNAME1= <>
##$TPNAME2= <>
##$TPNAME3= <>
##$TPNAME4= <>
##$TPNAME5= <>
##$TPNAME6= <>
##$TPNAME7= <>
##$TPOAL= (0..7)
0.5 0.5 0.5 0.5 0.5 0.5 0.5 0.5 
##$TPOFFS= (0..7)
0 0 0 0 0 0 0 0 
##$TUNHIN= 0
##$TUNHOUT= 0
##$TUNXOUT= 0
##$USERA1= <user>
##$USERA2= <user>
##$USERA3= <user>
##$USERA4= <user>
##$USERA5= <user>
##$V9= 5
##$VALIST= <valist>
##$VCLIST= <CCCCCCCCCCCCCCC>
##$VD= 0
##$VDLIST= <DDDDDDDDDDDDDDD>
##$VPLIST= <PPPPPPPPPPPPPPP>
##$VTLIST= <TTTTTTTTTTTTTTT>
##$WBST= 1024
##$WBSW= 4
##$XGAIN= (0..3)
0 0 0 0 
##$XL= 0
##$YL= 0
##$YMAX_a= 491005
##$YMIN_a= -521264
##$ZGOPTNS= <>
##$ZL1= 120
##$ZL2= 120
##$ZL3= 120
##$ZL4= 120
##$ABSF1= 16.522
##$ABSF2= -4.171173
##$ABSG= 5
##$ABSL= 3
##$ALPHA= 0
##$AQORDER= 0
##$ASSFAC= 0
##$ASSFACI= 0
##$ASSFACX= 0
##$ASSWID= 0
##$AUNMP= <proc_1d>
##$AZFE= 0.1
##$AZFW= 0.1
##$BCFW= 0
##$BC_mod= 0
##$BYTORDP= 0
##$COROFFS= 0
##$CY= 12.5
##$DATMOD= 1
##$DC= 0
##$DFILT= <>
##$DTYPP= 0
##$F1P= 14.0000005364418
##$F2P= -0.99999901652339
##$FCOR= 0.5
##$FTSIZE= 32768
##$FT_mod= 6
##$GAMMA= 0
##$GB= 0
##$INTBC= 1
##$INTSCL= 1
##$ISEN= 128
##$LB= 0.3
##$LEV0= 0
##$LPBIN= 0
##$MAXI= 10000
##$MC2= 0
##$MEAN= 0
##$ME_mod= 0
##$MI= 0
##$NCOEF= 0
##$NC_proc= -2
##$NLEV= 6
##$NOISF1= 0
##$NOISF2= 0
##$NSP= 0
##$NTH_PI= 0
##$NZP= 0
##$OFFSET= 16.522
##$PC= 1
##$PHC0= 163.1438
##$PHC1= 6.878538
##$PH_mod= 1
##$PKNL= yes
##$PPARMOD= 0
##$PSCAL= 4
##$PSIGN= 0
##$REVERSE= no
##$SF= 250.13
##$SI= 32768
##$SIGF1= 0
##$SIGF2= 0
##$SINO= 400
##$SIOLD= 32768
##$SREGLST= <1H.CDCl3>
##$SSB= 0
##$STSI= 32768
##$STSR= 0
##$SW_p= 5175.98343685301
##$SYMM= 0
##$S_DEV= 0
##$TDeff= 65536
##$TDoff= 0
##$TI= <Analysis number 999999
Compound Code 99
Book Reference 9
Project Code 9>
##$TILT= no
##$TM1= 0
##$TM2= 0
##$TOPLEV= 0
##$USERP1= <user>
##$USERP2= <user>
##$USERP3= <user>
##$USERP4= <user>
##$USERP5= <user>
##$WDW= 1
##$XDIM= 32768
##$YMAX_p= 328610411
##$YMIN_p= -137604
$$ End of Bruker specific parameters
$$ ---------------------------------
##NTUPLES= NMR SPECTRUM
##VAR_NAME=  FREQUENCY,     SPECTRUM/REAL,   SPECTRUM/IMAG
##SYMBOL=    X,             R,               I
##VAR_TYPE=  INDEPENDENT,   DEPENDENT,       DEPENDENT
##VAR_FORM=  AFFN,          ASDF,            ASDF
##VAR_DIM=   32768,         32768,           32768
##UNITS=     HZ,            ARBITRARY UNITS, ARBITRARY UNITS
##FACTOR=    0.157963299565203, 1,           1
##FIRST=     4132.6476996994, 0,             0
##LAST=      -1043.33573715361, 0,           0
##MIN=       -1043.33573715361, -137604,     0
##MAX=       4132.6476996994, 328610411,     0
$$ Real data points
##PAGE= N=1
##DATA TABLE= (X++(R..R)), XYDATA
$$ [...]
15208g840Q26Q21Q131L685L949k378m918j522l538L400M729q78q672r17L944M542
15192C364K134k900J945J728q606K02J851k523k263J744L705l239r371J81K566
15177i482M950J815L040L416J882O337M54m283l526r516N76M258M692m258j0424
15162a0069k114O008R44L903k671L096L383n65m605m279j368m611K78l257J179
15147a4748L511Q327L756n89p095l443L845O365O515q31o513m30J331J638j420
15132B19J055O01k803J472k81m041J82J778k341J870K225j86K511j203R25J0389
15116A2372o633n709q74K243j333N33j378l592J546J0453m71p648r75M20k860
15101c906J105M443Q259n82q463o853k162o08M085K615L05n900k072P715R651
$$ y = [-7840, -7014, -6193, 1938, 5623, 9572, 7194, 2276, 754, -2784, 616, 5345, 4467, -4205, -5122, -1178, 3364, 5498, 2598, 4543, 6271, -2335, -2133, -282, -2805, -5068, -3324, 381, -2858, -12229, -12048, -9482, -4532, -2717, 323, 3739, 5621, 11958, 12412, 8129, 4603, -4913, -4337, -79, 4613, 355, -10069, -12183, -6175, -5231, -1328, -3999, -903, 2480, 1915, -2690, -6969, -8337, -12948, -12670, -15927, -14748, -11237, -2910, 846, 257, -6838, -10281, -6436, -71, 6444, 5613, -900, -1330, 1, 1639, 219, 1274, 1875, -928, 544, 263, -3778, -3596, -1818, -4159, -2289, -64, -250, 2261, 1058, 1983, 12372, 5739, 30, -844, 1399, 66, 599, -779, -4371, -2825, 7628, 7157, -491, -1466, -1046, -3906, -2801, 1642, 9901, 9319, 856, -5997, -8159, -8767, -4682, -2067, -1762, -7662, -9734, -2019, 7632]
15086G632K388l160o373J743J275J589J303l786L442k57j0692l628r88O298L742
15071E28K344L49L288l506n054n265M109j0k802P577r40j0841K894L270J347O108
15055C396L063Q46p77J708l91k540j887p957j007R365M100O087M074n605j481
15040A0994M14j0623n680l964K323J894R166N753M388p009o042l025K114j452
15026g49N503O100Q840o698m040M23Q68J207j219j758m297l0o387p437p958M49
15010a7183L922K573L515k019J055M165L395M40n3j834l429j852N971P71K791
14995B228P14m588K911N818L721j638l747k682p994p837J381O920O758M707k371
14980D301j2051q418P22N483R721K000K784Q37l826o835P765L201l060r309q730
$$ y = [7632, 10020, 6860, 487, 2230, 3505, 5094, 6397, 2611, 6053, 5796, -4896, -8524, -9512, -3214, 528, 2872, 3221, 6509, 3003, -2051, -7316, -3207, -3217, -6019, 1558, 618, -10223, -7329, -4059, -2712, 3396, 6459, 7305, 6528, 8236, 7845, 5305, 3418, -4539, -5546, 3819, 7919, 14006, 18080, 12475, 10994, 11408, 785, -4895, -8859, -6536, -4642, 4524, 10277, 14665, 7656, 1614, -1411, 703, -749, 4754, 10854, 19694, 12996, 8956, 9379, 10247, 11454, 10235, 8477, 4180, 4150, -2237, -9674, -17632, -17183, -13261, -10688, -7173, -9192, -8137, -3972, -577, -137, -190, -2024, -5453, -7305, -1334, -563, 2228, 2942, -1646, 1265, 7083, 10804, 9166, 5419, 2737, -5257, -13094, -11713, -4793, 1965, 6672, 4301, -7750, -16168, -15446, -9963, -242, 1758, 4542, 5379, 1553, -5282, 2483, 5684, 2624, -6685, -15415]
14965a5415O461O049Q872L595q090k965n17P57P47M68n771K688J039l43k072k128
14949f625J401m084K882j999j299K477k501k210M073N265k623j46N063K331m144
14934b139r78Q45N68J81m660J057j239M73R605K563j106k047J317o321L11j441
14918c011k857O51J757n498J392L885P98j321P199Q580l747j905k757j517J312
14903B961K364L01J905L708n210m439K591k432m857P77l865m828N02q42o51Q953
14887c062L615M111M066M297J187q819J934M025j1316n971M47L773k902J801M235
14872A421l105n59M771m419N969K973p444k779j530N517P535k156j101L043K46
14857H382q325M806j210j006O043L598L835L181n614l692l077p145m082J029M808
$$ y = [-15415, -8954, -2905, 5967, 9562, 1472, -1493, -2010, -1253, -506, -38, -5809, -3121, -2082, -2425, -4497, -6625, -5224, -9308, -6426, -8425, -9724, -7247, -9748, -11958, -7885, -2620, -5243, -5389, -326, 2005, -2139, -3117, -2272, -1704, -1523, -6183, -5126, -6365, -5892, 3713, 6276, 5170, 3123, 4440, -1881, -1570, -3011, -5868, -5217, -3460, -8958, -7566, -3681, -2883, -4204, 2995, 11575, 7828, 5923, 3166, 1649, 2961, 5325, 5626, 7531, 11239, 6029, 1590, 4181, 1749, -3108, -2331, -6196, -11024, -10522, -11364, -12015, -3062, 553, 4664, 8730, 13027, 14214, 5395, 7329, 11354, 38, -5933, -5486, -1713, -4615, -2814, 1421, -1684, -2243, 2528, -1891, 4078, 7051, -393, -3172, -4702, 815, 8350, 6194, 5093, 8136, 8382, 57, 4863, 3653, 2647, 8690, 12288, 16123, 19304, 13690, 9998, 6921, -224, -4306, -3277, 1531]
14842A531K566L16p954p284K712J408J287J465L396o974k750L432N08j017K034
14827e324q260L293Q477M963q262j100k258j506O44M498P21N2M960J287j109L009
14811D085K662J73k514n778N29O578M554r112K131M818k310p512j378P797Q363
14796A3086Q16q103n948n835m746p74P436L762k390n878O248n633J378P327J321
14781B067n460n475O725M036j565K320o67K540j287q80K388j385k859m690o633
14766a0825j329P907O198j35k411L207n22J124l401r35k517J809O301J033k520
14751B984P34l16J645L759M09j978l842n815o385J839L316M428M819n447k593
14736b443M460n270O712O662o201p784m320m613j337O644J0572O929J461m009
$$ y = [1531, 4097, 4413, -3541, -10825, -8113, -6705, -5418, -3953, -557, -7531, -10281, -6849, -6341, -7358, -5324, -13584, -10291, -1814, 3149, -5113, -6213, -8471, -9977, -9333, -4835, -4114, -4062, 898, 2185, 1076, 4085, 6747, 6920, 4406, -1372, -843, 5735, 10289, 1177, 3308, 8126, 5816, -1696, -3074, 4723, 13086, 13902, 5799, -149, -5984, -10730, -11504, -4068, -306, -2696, -8574, -2326, -7959, -6581, 746, 2067, -3393, -8868, -2143, 1893, 328, 2648, 1981, 4521, 3234, 2354, 4742, 3357, 498, -4192, -10825, -12154, -4247, 1951, 1816, -595, 2612, 2090, 3214, -187, -1122, -3639, -1830, 4471, 5504, 2984, 3718, 3402, 5047, 8806, 9215, 7237, 3395, -2420, -8805, -6966, -3650, 778, 5597, 150, -2443, 2017, -3253, 3459, 10121, 3920, -3864, -8184, -12797, -14134, -7490, 3082, 10011, 11472, 7463]
14722G463J82l200k5k761j125j0374o710L589N213m2o51J755n140M469Q201m657
14706c813K799J0598n092J710M86j511j650K806M465K36j611J755j761l260o72
14691E485q82j009l460n373L035o96J516J331K672j547M529N76j479l363Q37j0585
14675h413K418j523r38k734j853m401L324P236j788p26N18M68K096k414O112M31
14659b187K318M893k212o443l639n809q11J793O111K37J035M079l787n879N266
14644e035R5J093J561J170K987J0349M888m518n93P081L769o16m832r051J34j665
14628F817q77l90P8j219l904J002M422L025n059j0151N21K980k000l98L583J592
14612B2j91L12l809j070l192j750R64R155N706k977m594j668L072O05J266l998
$$ y = [7463, 7645, 4445, 4420, 1659, 534, -9840, -16550, -12961, -7748, -7790, -8441, -6686, -11826, -7357, 844, -3813, -1014, 9584, 4492, 6202, 6688, 5177, 3527, 6333, 10798, 11034, 9423, 11178, 9417, 6157, 5485, 4603, 3594, 134, -5239, -2204, -2900, -1384, -53, 2619, 1072, 5601, 6177, 4698, 1335, 2172, -8413, -5995, -7518, -8456, -11190, -13043, -17444, -14120, -6884, -8672, -9398, -8880, -8412, -6316, -8730, -2618, -2187, 131, 5024, 2812, -3631, -7270, -13079, -13890, -12097, -5986, -5749, -4714, -635, -4422, -10301, -5035, -4940, -3847, -2286, -1116, 1871, 12220, 17108, 12590, 11997, 19078, 22847, 22231, 17399, 8348, 8482, 6817, 5940, 5550, 5628, 4409, 505, 1507, 5929, 8954, 3895, -6256, -5735, -2755, -4755, -5153, -1570, 22, -169, 143, -3666, -4736, -7928, -9678, -8714, 441, 6147, 3170, -1424, -3092, -20, 585, 1851, -2147]
14596b147m828m374l439k121L152L979m367Q671Q128p07l170l550m677j579O187
14581d842L878o81k826j550j094J946P001L42J55R72j183k582L925j886k100r14
14565a439M403P900j222k306o58N393p607j1116j261j125j191P22k737L404P969
14550h71k180P46Q552O62q826n23k055Q834P235m094K780L925n161L919j134m946
14534F863m607r239k254m264O850m113l268M031l868J444K489P262J092k218J015
14519b785n538q838K905R259K191N603Q226K025r394n869l087n887R32L717k000
14504h540j315M38K306l020N133L056L872k386m288J482K519j904J470l23j301
14489b801n476m786K098N091L385o914M110M403k481r04O576l991j611O694N552
$$ y = [-2147, -6975, -11349, -14788, -16909, -13757, -9778, -14145, -5474, 2654, 1947, -1223, -4773, -9450, -11029, -4842, -964, -1645, -4471, -6021, -7115, -5169, 1832, 2174, 2329, 3301, 2118, -464, 3461, 1575, -525, -1439, 2964, 10864, 9642, 7336, 6678, 12071, 4464, -6652, -7913, -9038, -10229, -9507, -12244, -8840, -871, -3051, -2305, 6247, 6909, -1917, -2440, -4495, 4339, 11574, 7480, 10260, 14185, 9024, 12943, 11809, 6863, 2256, -6983, -9237, -13501, -6651, -10764, -14032, -10001, -13869, -12425, -9936, -2674, -1582, -3800, -2785, -8323, -17161, -14256, -4997, -2806, 2797, 11023, 13048, 3654, -2215, -5302, -11189, -10257, -6540, -8540, -9855, -9417, -7111, -10131, -4998, -1942, 1930, -456, -4744, -3262, -743, -2647, -1177, -1500, -2801, -8277, -13063, -10965, -5874, -2489, -9403, -5293, -890, -3371, -4275, 2301, -1690, -3301, 3393, 8945]
14474H945k641k609K437n89j0177J745K809j943O111K414o061n613M37q65j846
14459g446L16J574J0327J207k741j82m854q809R382P083J417o95J759k265K889
14444H962j931n086j728O51j670K509L377j294N08m367J571q88o999M008R047
14429F670K46O39P76L222k834l678o618j764M958K322K825n96N78j0089J905O242
14413D804m048l118L026K612J656O34k779M39k234J683K873k48m45k30Q813O67
14397A4105n328m972L11M226n576r178j648O302M964K59K688j84j690Q33q27l350
14381I35j61n842K067J0949L111N128j60p013n706l051k817j918k098m290l26
14366a1192M777O178k091M83K053l332N831J699m642L296j564l883L409N046O85
$$ y = [8945, 6304, 3695, 6132, 5543, -4634, -2889, -80, -2023, 4088, 6502, 441, -5172, -4735, -5600, -7446, -7130, -5556, 4771, 5978, 3237, 3055, -1799, -10608, -1226, 5857, 7274, 6579, 8338, 6073, 8962, 7031, 1945, 217, 868, -802, 1707, 5084, 3790, 4298, -69, 1502, 614, -6385, -2377, 6670, 6916, 7555, 8331, 11553, 8719, 5041, -1577, -3341, 1617, 3939, 6764, 6168, 6746, -3343, -1438, 4804, 756, -2362, 664, 3276, 4932, 5566, 2787, 3226, 992, 2675, 5548, 5300, 4855, 4625, 13438, 14105, 8777, 3805, 4116, 8342, 2766, -6412, -8060, -1758, 3206, 3465, 6153, 5969, 4279, 5112, 4285, 935, 774, -5068, -3001, 7948, 11059, 16187, 16027, 9014, 3308, 257, -2560, -4478, -6576, -10866, -11192, -6415, -237, -2328, -1845, 208, -3124, 2707, 4406, -236, 3060, 1496, -2387, 1022, 6068, 6753]
14351F753l160k32k721O05Q56R19n239R56k216J462k290l173M695O684N392j0265
14335i74p722J173O082j574k39l225Q39Q017K443l024L574o575j0014L563N482
14320b174K212K976n007j731J796N206L29J446O173P427n536m931l593J31l12
14305D412m395p65J735M769M332K860k747o387K267n20r29m195q54K813M056l003
14289C449m799m319k327P629J173n488L710K151j149O95M277M036P51j993m785
14274C011j953K141o60K967N53p648j182P28L720O84l97N820J2044l110j0881
14259E837k856j121j168o934p86Q611R110K757k577j0260q173Q249m91k589k270
14244d661M398n00j410J610N401R168L397m394j0806L340j341n228J141J387j866
$$ y = [6753, 3593, 3361, 640, 1245, 2101, 3020, -2219, -1263, -3479, -2017, -4307, -7480, -2785, 3899, 9291, -974, -8696, -7523, -1441, -3015, -3254, -6479, -5640, 2377, 4820, 1796, 5370, -1205, -11219, -7656, -2174, 38, 3014, -1993, -3724, -1928, 3278, 3607, 5053, 11226, 18653, 13117, 8186, 4593, 4724, 4412, 17, -748, 987, 5756, 10088, 12948, 10201, 3814, 6081, 5561, 4632, 437, -417, 2396, 6452, 3449, -1350, -5669, -7996, -367, 806, -4682, -972, 1179, 30, 725, 5002, 9038, 9789, 7796, 3011, 1058, 3199, 2539, 5506, 6059, -1589, -2771, -2043, 1677, 2361, 1964, 7784, 19828, 16718, 5837, 2981, 1860, 692, -6242, -7028, 1583, 10693, 13450, 10873, 613, -7560, 689, 198, -2391, -4661, -263, -763, -2173, -563, 4838, 14006, 17403, 13009, 2203, 5543, 4202, -1026, 115, 1502, -364]
14229c64L676J118l69op603K467N565l66j345m657k94n6j906O53Q94J031M73P859
14211F770K29m785M59j17l37k485L109q95r32K89m210k960N232Q902l547o011
14195a289p002O506M678L94n048k637k506R629O337j831m259r18N498K005l264
14180F293j410r30J697j468j071N521K922j665k086m721k725k01l0M214J07q7
14164D360m294k360M69l376j544N96k363j07J745M535j55Q937R98l417J422j52
14148E294l678J772L97p09O338l44q276m121l580l68L537R127k307k224J725o963
14132d380K765N952O576n44o159O74l71p262o280L390j10L732Q246K097J048l635
14116E739k342L805N94O70l299K488o070m477N065J063K35m458p0j663l889J692
$$ y = [-364, 3312, 4430, 4061, 4055, -3548, -1081, 4484, 4118, 2773, -1884, -2178, -2234, -4140, -3487, -2593, -1562, -1089, 6770, 6999, 2214, 2673, 2556, 2219, -266, 2843, 1948, 1016, 1305, -2905, -5865, -633, 8269, 4722, -1289, -8291, -1785, 2893, 3287, -1761, -4398, -6904, 2725, 9062, 7231, 2972, 2054, 7552, 9557, 6293, 4883, 3953, 5650, 4182, 3111, 8632, 11554, 9889, 7803, 3082, 357, 156, 126, 4340, 4447, 4360, 66, -2294, -1825, -5201, -6745, -6149, -8512, -8619, -6874, -2339, -2494, 6443, 7441, 4024, 5446, 5294, 1616, 3388, 3785, 3076, 9414, 9070, 794, -3327, -6907, -7275, -3738, 5389, 3082, 858, 2583, -4380, -1615, 4337, 10913, 10369, 4210, 4884, 4513, -2749, -9029, -5639, -5749, -2017, 6229, 8326, 9374, 5739, 3397, 7202, 7796, 8466, 5167, 7655, 1585, -2892, 2173, 3236, 3471, -987, -1057, -2720, -6609, -4917]
14100d917n36k055r76j665J812J501J926N169k705j585J19j361K915L49o898J0455
14084A548O304l372r87N391l020q622j1646Q40P845Q584K129l097K341M802L147
14069A2187n91n391K926m968j538K547L391j553J409n887p793K184L632O17Q387
14054I559k301k622o28j739j693j04M179l229J965j299p563p509l641P780J554
14039g291n01K714K889N651n558j153N870q4l864o185L889j893n909K010M166
14024e249J702m53m506M142K815k533n283K581L344P66J608m349m288K454O792
14009d57Q17l038o164m05N78o60j197K412L808Q156J927l337k277k662l029J175
13993d353k006K298k602J431Q460M564l940j0235k116R058K116N978j681K04k556
$$ y = [-4917, -5453, -7508, -8484, -10149, -8337, -6836, -4910, 259, -2446, -4031, -3912, -5273, -2358, -2009, -8907, 1548, 7852, 4480, 3493, 8884, 5864, -2758, -14404, -13564, -5719, 2865, 4994, 1897, 4238, 9040, 12187, 11596, 6205, 9131, 4163, 2625, 5172, 8563, 7010, 8419, 2532, -5261, -3077, 555, 1172, 9559, 7258, 4636, 4008, 2269, 576, 472, 4651, 1422, 3387, 2088, -5475, -12984, -16625, -8845, -7291, -7792, -5078, -2189, 3462, -2096, -3249, 2621, 2537, -1327, -7512, -3623, -5516, -11425, -9415, -5249, -3547, -4000, -8506, -4364, -1549, -4082, -9365, -6784, -3440, -2674, -1066, -5415, -9703, -7249, -457, 360, -2678, -8842, -9247, -8669, -9329, -10526, -8114, -4306, 3850, 5777, 2440, 163, -2499, -5528, -4353, -6359, -4061, -6663, -5232, 3228, 7792, 3852, -6383, -8499, 559, 2675, 8653, 6972, 7176, 4620]
13978D620Q252n519p688q422m440N275m756o619N889Q486Q694O513M909l983n831
13963E380K343k724m001j669J44M968J2702L969m432p230J797m785m387J162o87
13948B550l243l293j095N528J1557J71k642J070j928m845R81K033J402M406J822
13933A4474q755k549J013K721R865K657q468p925P32K486m782o635Q987K482m16
13918E887p320m827j078k648m199j620N341J1259M797N031J566l66r56n928k055
13903B884r5K200J55m865o563J65L056N871J399n127o25J861l673m928j054L072
13887f267Q768j344l471p2k370N372J631n509O064P43l994R33R66L044K148K980
13871I622l112m08N55q854l721J71O275J733M70n33k166k769J170P104n951m601
$$ y = [4620, 12872, 7353, -335, -8757, -13197, -7922, -12678, -19297, -13408, -4922, 3772, 10285, 15194, 11211, 5380, 7723, 4999, 998, -671, -527, 4441, 17143, 21112, 16680, 9450, 11247, 6462, 2075, 3237, 2550, -693, -3986, -5081, 447, 12004, 12175, 9533, 10603, 8675, 3830, 4811, 6844, 8246, 12652, 14474, 5719, 3170, 4183, 6904, 16769, 19426, 10958, 3033, 3765, 6251, 1469, -5166, 3821, 6303, 5887, -1433, -6260, -7338, -9986, -14185, -15805, -10464, 795, 5592, 10623, 12189, 11823, 10867, 4939, 2884, 2789, 4989, 5144, 279, -6284, -6119, -3063, 2808, 4207, -920, -1545, 316, -3357, -8285, -9339, -6267, 2501, 1157, -2314, -2386, -4756, 616, 2247, -3262, 2802, 3545, -449, 484, 1450, 4494, 6642, 9622, 6510, 6102, 6657, -2197, -5918, -5747, 528, 2261, 2731, 2198, 32, -2737, -1567, 5537, -414, -5015]
13855e015n80L365M392L513j157o040p072J710N96L723P440k085l501k433P39
13840b405N4K842M468N206n17j425k335J119l26j654l16j113k441L192N725j153
13824H921m378n247j054n350J868Q633j746j507L082k755q9J753K888J197j236
13809D980J944j259j0013m282L841M111K705K497K418R75J966o746n325J324j03
13794i67J540k515L245J120n274l875k722M485K065J308J465L235K175L480n665
13779C100M66O152j59j671J912n21j017P417L327M551l321k601N006n972j2066
13764D603m958j123N718K346M256k084o245R08j791n07J461j408l227J142k873
13749c782Q93K678K730M167p200o766j907M548K796R595q48j972O21K151n124
$$ y = [-5015, -5595, -2230, 2162, 5675, 4518, -1522, -8594, -6884, -6288, -2565, 4875, 2790, -711, -3144, -2405, -2351, 491, 4959, 10165, 9648, 8223, 5888, 7007, 6681, 5027, 4711, 3598, 1157, 4349, 10074, 8921, 4543, -704, -1758, -7108, -5240, 3393, 1647, 140, 3222, 467, 378, 2131, 5019, 6216, 4980, 6924, 5665, -4348, -8630, -4789, -678, 2027, 4524, 6942, 7917, 9883, 3137, -2188, -864, -967, 573, -1942, 1303, 2423, -2851, -6726, -9448, -4963, -2898, -1590, -125, 3110, 5285, 8765, 3100, 3566, 9718, 9559, 7888, 9800, 9279, 8262, 15679, 19006, 23557, 20236, 17635, 22641, 16669, 4603, -355, -1478, 4240, 6586, 10842, 8758, 2513, 3421, 1630, 1123, 2584, 1176, -2051, -909, -3782, -2889, -211, 2519, 6686, -514, -7280, -9187, -4639, -1843, 7752, 6904, 4932, 5553, 7704, 2580]
13734B580q921p95O045M570j682J82M248m190n417K585j675k432N677j69K924
13719C530M380m405m936L727k498m538j884J570L584J0315K827n66j552M306P35
13704A4595r949R23M087J066n567o732j184L206N025K737k811K369M047m814m432
13689B566k04J331m171J807R767J770m10p72n25j987l756q114n62P710Q190m199
13673H441o857K832K514j980K254j539m309O936p92k569o361j843J048K038l342
13658c529j279l32M522O87p23k38P378r860o830O361P577K647j473j541k87J593
13642D673q61j0295k729K930P48N749R21K067q62J048l129J330k842J497M963
13627E208M334o734o48K46K591K497k528J721Q039m107j714j628K059m329l993
$$ y = [2580, -6341, -7136, -1091, 3479, 1797, 1979, 6227, 2037, -3380, -795, -2470, -4902, 775, 606, 3530, 7910, 3505, -1431, 2296, -202, -4740, -6624, -5054, -1470, 8845, 11672, 11106, 9554, 13860, 14595, 4646, 5569, 9656, 10722, 5155, -1577, -2761, 445, 5470, 8207, 5396, 7765, 11812, 6998, 2566, 2362, 3693, -478, 1329, 11096, 12866, 12456, 11684, 11159, 9172, 5416, -2698, -3260, 4450, 12640, 8441, 1584, 4416, 6930, 4950, 7204, 5665, 1356, 8292, 7500, 4931, -1430, -3273, -2225, -187, -3529, -4808, -5140, -618, 69, -654, -892, 6486, -3374, -10204, -3843, 3734, 6381, 4908, 3367, 3080, 4673, 3812, -6483, -9212, -6282, -5534, 215, 1136, 3203, 2341, 3389, 260, 1590, -1252, 245, 5208, 9542, 2808, 2160, 2406, 4997, 7494, 4966, 6687, 14726, 10619, 8905, 7277, 9336, 5007, 1014]
13612A014J477L962l602j796o069K650N245k793N467j7L954M862J933J043m57
13597A6873o391k895j3475m149J7267r16o010J36k319j060J361q90L805l393m295
13582f351L852O104k280J746O599p008o22P098K539m4L7K462N267O58L01k335
13566A8023n346j672j88n408k555J107J887m31M740m829m438N050N735k282p368
13551B025j581L386N977k8N34L473l752n063l706k393J187N157O467p516n338
13536a171n086P748J452j931o398k137q39K541J3199L275j913k355O33k077j99
13521D742k692n344l373n66J596J785J354M979l246r420K357K730K700r42J759
13506a581R05m56K27k016O930K509k812K038J788j574m87j58L363M934n223M691
$$ y = [1014, 2491, 6453, 2851, 1055, -5014, -2364, 2881, 88, 5555, 5538, 9492, 14354, 16287, 17330, 16873, 10482, 7587, -5888, -10037, 7230, 6314, 304, 440, -1879, -2939, -1578, -2468, 1337, -2056, -6351, -2499, 3605, 1325, 3071, 9670, 2662, 2040, 9138, 11677, 11633, 11670, 14132, 19399, 20057, 20358, 18023, 12677, 11005, 10817, 5409, 2854, 3961, 5848, 5417, 10157, 5328, 890, 5940, 11675, 9393, 2025, 444, 3830, 9807, 9779, 10313, 13786, 10034, 4971, 1265, -1128, 59, 5216, 11683, 4167, -1171, -6257, 1491, 2943, 1012, -5386, -7523, -8362, -5821, 7378, 10653, 8740, 6385, 7018, 4941, 4742, 2050, -3294, -6667, -7233, -5637, -3852, -2498, 2481, -765, -10185, -7828, -5098, -2398, -3340, -1581, -676, -1132, -905, -2921, 4009, 6518, 3706, 5744, 7532, 5958, 5471, 5313, 8676, 13610, 8387, 13078]
13490A3078q547k619J357K659K832l806j92k351N202O71m364K509K420o73p09
13475G467O703o641j282k585J375L360m762l557R47O336K508J977L576m332p069
13460D021p702l483M806J810L804M338Q01o352L878M106n825l892J553L833N779
13445A1475K056p94q70j272o047j482P067j854J524k345q378n765l736J510Q104
13430h07J592L386M481l487l554P19J408j675j174K897M25j539j349l957k355
13415d989L574l93k165J862L193M303R202L312o078k435n072Q81J1603q40r407
13400F551m590O644o91L815J099q074K378J932m181m088n347L28M766N546l433
13385B655O480L092L793m286p965m212M745R328N163K29k699n755k292p514j32
$$ y = [13078, 4531, 1912, 3269, 5928, 8760, 4954, 4762, 2411, 7613, 8284, 3920, 6429, 8849, 8176, 7467, 14170, 7529, 6247, 3662, 5037, 8397, 3635, 78, 1025, 7361, 9869, 11846, 15422, 11090, 4021, -3681, -7164, -2358, -548, 3256, 7594, 8395, 2043, 5921, 10027, 4202, 310, 1863, 5696, 11475, 13531, 12737, 11867, 10595, 4548, 3066, 10133, 8279, 9803, 7458, -920, -6685, -10421, -8911, -807, 785, 4171, 8652, 5165, 1611, 2330, 3738, 2063, 889, 3786, 4211, 2672, 1323, -2634, -4989, -1415, -1808, -3973, -2111, 1082, 5385, 14587, 17899, 11821, 9386, 4314, 5195, 16798, 15958, 6551, 1961, 8605, 7914, 11729, 12828, 4754, 7132, 9064, 4883, 795, -4552, -4224, 542, 6088, 2655, 9135, 12227, 16020, 11734, 3769, -443, 4302, 13630, 18793, 19022, 16323, 10568, 8276, 762, 630]
13370F30j325j073M031l48J255J012M086j521JL977oJ86o901p537M834J175M448
13353F924m074L940j133n805K43j701n986n204K920O941p21J278J240o40j60K708
13337G70L240P76R265Q240l411l339j341N082l797R98k84J185j1201m707L667
13322E143R675j757n323j909j941K361K721L254k758j736j450N008j885m470J70
13307E103L053M871m903r930N54N942N23k514K674l759m576j780M783m169m508
13292h636N536R926J864l814J407O155R913J021r439m989J533K44j33r66R82L138
13276A3742k528k657j613j214l842N74J326K09j233l028N792K986K131k280J672
13261A0037M680Q553m222p772m924M963l29j463m668J93J560l485o29J623Q760
$$ y = [630, -695, -1768, 2263, 1915, 3170, 4182, 8268, 6747, 6748, 10725, 10719, 10905, 4004, -3533, 1301, 2476, 6924, 2850, 6790, 5657, -148, 95, -1606, -7592, -12796, -9876, -2935, -3656, -2378, -1138, -1778, -1938, 770, 4010, 4786, 14051, 22291, 18880, 15541, 14200, 19282, 15485, 16483, 16199, 17384, 6183, 1476, 5143, 14818, 13061, 7738, 5829, 3888, 6249, 8970, 12224, 9466, 7730, 6280, 11288, 9403, 4933, 5103, 8156, 13027, 8124, -1806, -1252, 4690, 5213, 2699, 5373, 1614, -2962, -4742, 41, -4128, -8636, -3100, 6826, 8690, 4876, 6283, 12438, 22351, 23372, 13933, 8944, 10477, 10721, 10588, 9622, 10604, 13742, 11214, 8557, 6944, 5730, 1888, 2462, 3788, 3997, 2764, -264, 5528, 8514, 10645, 8365, 10037, 14717, 23270, 19048, 11276, 6352, 11315, 10986, 9523, 4855, 5048, 6608, 3123, 2494, 4117, 12877]
13246A2877K467p397o81j89J163l67j83J767n452J676j190l44M688k546l701J937
13230D525l23M817J730j620K891M869m878k446K112k727p102L792j883J574M253
13215I584L95J573l60K212l340L395k261j570K234K217r115o884L220Q482J844
13200A1626m3k715k831R563O649k267n228J64K939Q813K871O881j1460o688P31
13185A9005J323L107n734q861M179kl617P012k42k927l331o390L7O236o200j085
13169B510N646P712O099L959m045n766n743P94L846j36m763j052P82L417K686
13154A5946N173k77P61L380P950J518p15P878J3320J8654J8677Q252o804j1625
13140H2088j5488j1321r291j0979q717q381M704K959j934l88L392J949j72j195
$$ y = [12877, 15344, 7947, 7266, 7077, 8240, 7873, 7690, 9457, 4005, 5681, 4491, 4147, 8835, 6289, 2588, 4525, 4202, 9019, 10749, 9129, 12020, 16889, 12011, 9565, 11677, 8950, 1848, 5640, 3757, 5331, 9584, 9979, 11552, 11192, 13404, 10064, 13459, 11198, 9628, 11862, 14079, 4964, -1920, 1300, 9782, 11626, 11583, 8868, 6037, 15600, 22249, 19982, 14754, 14918, 17857, 26670, 29541, 36422, 24962, 18274, 19005, 20328, 23435, 17701, 8840, 13019, 13017, 9400, 16412, 16170, 13243, 9912, 3522, 3559, 9795, 3595, 2510, 8156, 15868, 21967, 25926, 21881, 16115, 10372, 11166, 15012, 14876, 10113, 9061, 9843, 13260, 15946, 21119, 20842, 21603, 24983, 32933, 34451, 33736, 41614, 54934, 73588, 92265, 100517, 93713, 82088, 66600, 55279, 45988, 35009, 26292, 17911, 22615, 25574, 23640, 23252, 26644, 28593, 28421, 27226]
13126B7226j125l857n560M424k855r143K769R307N129r7K095P968j848o493n08
13111B7432M854O200m880j331N026K10M903k579P092J3512J2120J2484Q269P321
13097A00633K473q004k0710k2260j8134l068o159m008J024k658j436Q810J0444
13084C6947k734q424K644q792M49l518M905K197r083j358K362J154L89L644j065
13069A9717R57M309Q25o134p805p94J197M625M308J574J204l064m451j165L126
13054A8429J4609O690M656K22o15m845p531n226k515n001J918M841j684r058r15
13039A3975L769l227J858k476J360L055k128l204m584L593j23k982M30M140N543
13024A8999P87M506K005l969R02j472p979p300L280J614n350N58R55N61N441N787
$$ y = [27226, 26101, 22244, 16684, 21108, 18253, 9110, 11879, 21186, 26315, 26218, 28313, 36281, 34433, 27940, 27432, 32286, 38486, 33606, 32275, 37301, 37511, 42414, 39835, 46927, 60439, 72559, 85043, 93312, 100633, 103106, 95102, 74392, 52132, 33998, 30930, 24771, 20763, 21787, 19129, 17693, 26503, 36947, 34213, 25789, 28433, 19641, 20090, 16572, 21477, 23674, 14591, 13233, 15595, 16749, 17138, 20782, 19717, 20674, 24983, 25808, 19674, 11869, 11075, 12272, 16897, 21205, 22779, 23983, 20919, 16468, 15303, 18429, 33038, 39728, 44384, 44606, 43991, 39146, 31615, 26389, 23874, 18873, 20791, 25632, 23948, 14890, 13975, 17744, 14517, 16375, 13899, 15259, 18314, 16186, 12982, 8398, 11991, 11868, 8886, 9316, 13456, 18999, 19786, 24292, 26297, 22328, 23230, 21758, 13779, 6479, 9759, 11373, 6023, 6581, 7536, 8097, 13538, 19325]
13008A9325M221l345n135k808O778N348j474l694m550j571M85N892J1435J099
12994C2006j0264l896k029q460q24O416M021P301k285K582O165M576j502K678
12980C6485k666j2700r065n840M868L769o825q25K808J220l287M993O743J801
12966B1479k067p049m941o120m58P097j917k793K473P69k898M584Q477L307k086
12951A7857n212m248P324O973q33n118p61Q43M60K412j49l924L530L353k0P127
12935B9614l325M448p82L421j424j0746j47P119J804j122k025k583m573l206j312
12920A5161j681K600K629L631k162k290p75j872j97K983j155J378l009J920N438
12905B2599O395J791R77J503J488j093r309l982n937k053M616J996M929Q713M108
$$ y = [19325, 23546, 20201, 15066, 12258, 19036, 24384, 22910, 19216, 14666, 13095, 13580, 19472, 30907, 32006, 21742, 17846, 15817, 7357, 6533, 12949, 16970, 24271, 21986, 24568, 30733, 35309, 33807, 36485, 33819, 21119, 12054, 6214, 11082, 14851, 8026, 7201, 10009, 11229, 7942, 12935, 19678, 21479, 19412, 12363, 7422, 1302, 844, 7941, 6024, 3231, 5704, 6473, 3575, 8159, 16636, 19943, 17857, 12645, 8397, 15721, 22694, 21861, 16743, 15982, 16825, 17285, 19697, 19548, 15624, 19154, 22507, 22487, 29614, 26289, 30737, 29955, 33376, 31952, 21206, 21059, 28178, 29982, 28860, 26835, 24252, 19679, 16473, 15161, 13480, 16080, 18709, 22340, 20178, 17888, 17113, 15241, 15044, 18027, 16872, 18250, 15241, 17161, 22599, 28994, 30785, 31762, 33265, 34753, 33660, 24351, 20369, 14432, 12379, 16995, 18991, 23920, 32633, 36741]
12890C6741l833J650K225K361J740N031Q210J6556K1741J9919M9301O2890P1818
12877B96350P2782O7944L9227m765m0099o3077o7876o2739m6250m3030k6981q817
12865A12669m458j5984j0210r51k15q98p715p357l130L175J557N309p69o362k177
12850F2484o676k234O784J337K067p021o520k534l762j514M611j74k443j005m09
12835D2991k420L811p719m574j514O272K443k263k277J213m042M461Q023N237
12821D9642J907l79m268q115k507j333K706J959k27l498p313j044N764L049K690
12806C9033k464O31k695L425M56q066m056j434m591J559N833p592J305o44k495
12791A8205O57O839O858n123L708K679o834p21J989K730j543M055O309m341m948
$$ y = [36741, 32908, 34558, 36783, 39144, 40884, 45915, 54125, 70681, 92422, 112341, 161642, 224532, 296350, 369132, 437076, 476303, 471538, 431439, 368362, 300486, 237747, 191497, 148467, 121486, 112669, 108211, 92227, 82017, 81066, 80851, 79953, 72238, 64881, 61751, 64926, 66483, 71792, 71023, 64661, 62484, 55808, 53574, 60358, 61695, 63762, 56741, 50221, 47687, 43925, 42411, 47022, 46848, 44405, 43400, 42991, 40571, 44382, 36663, 32089, 30575, 36847, 39290, 37027, 34750, 35963, 31921, 36382, 44405, 49642, 51549, 51170, 46902, 38787, 36280, 34947, 37653, 39612, 39385, 35887, 28574, 27530, 33294, 36343, 39033, 36569, 37200, 34505, 37930, 38386, 30320, 26264, 24830, 20239, 21798, 27631, 20039, 21344, 20700, 18205, 18862, 25701, 32559, 27436, 31144, 33823, 26989, 26268, 28257, 30987, 29444, 33499, 39808, 35467, 30519]
12776C0519j647n202o068P446o08k170QO93o97r138l95O632J999P3l215m148J293
12759A5375k796n154L234P876k558j507j582M145Q831j939j145L945N251K840
12745C4816q00K666O334n04R79Q39J485j638j191K853j257o287m481J548j030
12730C4332j943L275j311n19M253k17k339n321p630O89M793n432n715j744K597
12715A7768J0941J208M732l129n493O565J1567J0190K184j951q46J1080Q875M109
12701G7800M984R290J5716K299k658k901l610p89m865o627O011P754j837l669
12687I6898j447j3354j9521q865K245n20K957J954o0o83n940k328N792k642q827
12672D5659m396n64j626O750R00k397k254L78J324m568P62J0298O596N491j136
$$ y = [30519, 28872, 23670, 17602, 25048, 24440, 22270, 22278, 22971, 22274, 13136, 12741, 19373, 21372, 21445, 18230, 14082, 15375, 12579, 7425, 10659, 18535, 15977, 14470, 12888, 17033, 25864, 23925, 22780, 26725, 31976, 34816, 34016, 36682, 43016, 42512, 43491, 44330, 45815, 44177, 42986, 45839, 44582, 38295, 33814, 35362, 34332, 32389, 35664, 34353, 33834, 38087, 37870, 35531, 30210, 22580, 23269, 28062, 22630, 16915, 15171, 17768, 28709, 29917, 34649, 31520, 26027, 32592, 44159, 54349, 56533, 54582, 53736, 64816, 73691, 77800, 82784, 92074, 107790, 110089, 107431, 104530, 100920, 100131, 95266, 88639, 94650, 102404, 100567, 96898, 95451, 82097, 62576, 53711, 55956, 55436, 58393, 60347, 60287, 59604, 53664, 51336, 57128, 54486, 45659, 41263, 40699, 39073, 45823, 46723, 44326, 42072, 42450, 43774, 39206, 39968, 50266, 56862, 62353, 61217]
12657F1217J083O70K290J471o19j597Q406Q294j595L53J615J098J217m715k748
12642G6440k634K82o408j563q737q582n16L713j19l884o68l620n989q856l036
12627B5823P601P279J1520P541K047m700o602q576L006Q548q28n406j307R45l220
12612D3671J1125L437M864j794o269k661M614K015M063J444N626q67L946P477
12598H0691N654L369J2173J2701N067J006M027N424o628n346r291j322L509j582
12584A09452P584J1213N669J4139J7566P607N825J8757J6627J5573J8204L1499
12572B79715L6720L4187K8461K4295K5258J7092J3483N898o891j2776j9106k5821
12560D00515k4594k3224k9169k7933k7565j7820N51j365j0247j0414J966Q634
$$ y = [61217, 62300, 62970, 65260, 66731, 66112, 64515, 72921, 81215, 79620, 79973, 81588, 82686, 83903, 79188, 76440, 73806, 74088, 67680, 66117, 57380, 48798, 48282, 51995, 51876, 47992, 47324, 43704, 37715, 28859, 25823, 33424, 40703, 52223, 59764, 61811, 57111, 50509, 41933, 44939, 53487, 52659, 47253, 45946, 46891, 43671, 54796, 58233, 63097, 61303, 55034, 52373, 56987, 59002, 63065, 64509, 70135, 69268, 73214, 80691, 86345, 89714, 101887, 114588, 119655, 120661, 124688, 130112, 123484, 118138, 108847, 107525, 111034, 109452, 117036, 128249, 133918, 148057, 165623, 173230, 179055, 197812, 214439, 230012, 248216, 279715, 316435, 350622, 379083, 403378, 428636, 445728, 459211, 465109, 458218, 445442, 426336, 400515, 375921, 352697, 323528, 295595, 268030, 250210, 250761, 249396, 239149, 228735, 230701, 239335]
12548B39335J331J925M002O066Q607N161m605l63o912j940p93L938j040l703P66
12533B51775o621l052P820o497o100j0314m053L957P587J942o820o97N34k253
12519B27208q135l661m026l643m817q00k109p652L359R586O097L540R254J3460
12505B37661J2099K979K328R01J589l649j212k772K801J6719J2110Q316J4139
12492C04009M057P310J0545J1020M502j181P13O719J2853J6357J7283K3119J8153
12479D35459K1692K3831K3918K2723K0106K4219L3737K9119L2258M2945M3610
12468G53617M5940N4954M9947O0958P5223Q2954Q5162R2433J03546J16078J34259
12457A655071J74602K30592K87990L47757M13779N08781O36997Q12197J054660
$$ y = [239335, 240666, 242591, 246593, 252659, 261266, 266427, 261822, 261459, 254547, 252607, 251814, 255752, 254712, 251009, 251775, 245154, 242102, 249922, 243425, 237325, 227011, 222958, 226915, 234502, 236444, 229624, 228927, 229461, 227208, 219073, 215412, 211386, 207743, 202926, 202126, 200017, 192365, 195724, 205310, 211407, 214947, 224201, 237661, 249760, 252739, 255067, 255968, 257557, 253908, 252696, 249924, 252725, 269444, 281554, 289870, 304009, 308066, 315376, 325921, 336941, 341443, 340262, 340975, 347694, 360547, 376904, 394187, 417306, 435459, 457151, 480982, 504900, 527623, 547729, 571948, 605685, 634804, 667062, 710007, 753617, 799557, 854511, 904458, 965416, 1040639, 1123593, 1208755, 1301188, 1404734, 1520812, 1655071, 1829673, 2060265, 2348255, 2696012, 3109791, 3618572, 4255569, 5067766, 6122426]
12448F122426J395089J894122K677066L937926N896933Q589701J1603401J3792510
12440E5909174J3840285J0884848N047832k437493r376823j3400726j3639400
12433D6827697j1168554p949179n309862l568920k514675j886759j472153j161130
12425A1796465r34400p53891o28235n27448m52382m11905l82409l60469l39520
12416G005806l17026l00788k84247k63351k49876k26288k02606j79737j73286
12407D808601j55873j42950j49544j44088j38924j46365j45396j33897j11048
12398C540516j01119r8580r0197p6594p5823p3074o8572o5497o9743p2183p2311
12387B676823p2581p4945p4756p2716o0477o5983o1546o1767n4496n4153m2235
$$ y = [6122426, 7517515, 9411637, 12088703, 16026629, 21923562, 30513263, 42116664, 55909174, 69749459, 80634307, 85682139, 83244646, 73867823, 60467097, 46827697, 35659143, 27709964, 22400102, 18831182, 16316507, 14429748, 12957595, 11796465, 10862065, 10108174, 9479939, 8952491, 8500109, 8088204, 7705795, 7345326, 7005806, 6688780, 6387992, 6103745, 5840394, 5590518, 5364230, 5161624, 4981887, 4808601, 4652728, 4509778, 4360234, 4216146, 4077222, 3930857, 3785461, 3651564, 3540516, 3439397, 3340817, 3250620, 3174026, 3098203, 3025129, 2956557, 2891060, 2821317, 2749134, 2676823, 2604242, 2529297, 2454541, 2381825, 2321348, 2255365, 2193819, 2132052, 2077556, 2023403, 1981168]
12376A981168m1409m7886n4149m0373l3813k3588j8521j5011j3131j5554j9782
12365A657951k8207l8495l9854m3088m7869m0927m5030m1169l3686l6858l6137
12354A226631k6366k5124k5310k8003k7112l0840l0076k3121k1178k1923j8435
12343I49143j8213j4877k2311k2648k0629j9502q717r690j3758j1879j0941q066
12331G67912o461n179o322j1687p742l720Q03L530l296J2432J6890O853J4324
12318G78337J8042J7418J6259J4775J4285L655L289q981j9971k8909k1569j5505
12306G71125j9965k3289j6155j6273j8767q868p467q703j2564j6045j5845j1636
12294E95548o686j0301j4817j2792j3101j5192j6932j7791j8203j5042j1268m226
$$ y = [1981168, 1939759, 1891873, 1837724, 1797351, 1763538, 1739950, 1721429, 1706418, 1693287, 1677733, 1657951, 1629744, 1591249, 1551395, 1508307, 1460438, 1419511, 1374481, 1333312, 1299626, 1262768, 1226631, 1200265, 1175141, 1149831, 1121828, 1094716, 1063876, 1033800, 1010679, 989501, 967578, 949143, 930930, 916053, 893742, 871094, 850465, 830963, 822246, 812556, 798798, 786919, 775978, 767912, 761451, 756272, 749950, 738263, 730521, 726801, 727604, 731134, 727838, 740270, 757160, 764013, 778337, 796379, 813797, 830056, 844831, 859116, 862771, 866060, 857079, 837108, 808199, 786630, 771125, 751160, 727871, 711716, 695443, 676676, 667808, 660341, 651638, 639074, 623029, 607184, 595548, 588862, 578561, 563744, 550952, 537851, 522659, 505727, 487936, 469733, 454691, 443423, 439197]
12282D39197n362m745j0102j2484j0189n928j0408l434n994l821n688r543j6375
12269C35124j5843q595R9M326L906q964j3655l208n53l933q928j0340m388q600
12255B56448q420l633J169j781j713n16R82p084m604o048j0236o189N574J781
12241B15730n783j0391r141k238r325n449m998q640o705k339j6141j1304J153
12228A24429o398K872O10k952k097m004L528r415l530n82k413O537K557O519N562
12213A21223l822k358p186n589M92K639N410m335m381n114n999r80Q70k173l653
12198H5044L402K706N63M419M462l961l272O74K072N0n340l095k353k576m621
12183G8174q259j0222j2133n050n530p055k385O073L509P500R143M867J6q01N787
$$ y = [439197, 433835, 429090, 418988, 406504, 396315, 390387, 379979, 376545, 370551, 366730, 361042, 351499, 335124, 319281, 310686, 310785, 315111, 319017, 310053, 296398, 293190, 292637, 288704, 279776, 269436, 265048, 256448, 248028, 244395, 245564, 243783, 242070, 241554, 242536, 235452, 230848, 224800, 214564, 208375, 213949, 215730, 209947, 199556, 190415, 188177, 178852, 173403, 168405, 159765, 153060, 150721, 134580, 123276, 124429, 118031, 120903, 121513, 118561, 116464, 112460, 115988, 106573, 103043, 102461, 100048, 106585, 109142, 115661, 121223, 117401, 115043, 107857, 102268, 102760, 105399, 110809, 106474, 102093, 96979, 90980, 90000, 90870, 88697, 85044, 88446, 91152, 91715, 96134, 100596, 96635, 93363, 94037, 96109, 96159, 90819, 87724, 85371, 82795, 78174, 69915, 59693, 47560, 42510, 36980, 29925, 27540, 33613, 37122, 44622, 53765, 58632, 58648, 57847, 63634]
12168F3634K280p823l980l72J835O224j091r1p78l029k484N636P001l329K466
12153F6099j049o804l131l283k695k160K045k437l606O216L411m662j011j674
12139D5259n795k280j530q50l14n738m879j157L932L881R67p690M10K161K173
12124B8550J219o208l89L957J84J803L47M568J192j269n568o840J853K569m452
12109B1516l199q30L598m337l260J275L524p212L217J4387l63o788l66K417m005
12094A9574m916K807O264j623J53K85k226O658l241l326k079m151m333J58l97
12079I607K211L06J873m772m66O32K519N224R56p035J68k125O62m159l255k300
12063D6k717L993L043Q69L316l425l601Q68L011L385M771K910K361o514o550L36
$$ y = [63634, 65914, 58091, 54111, 53739, 55574, 61798, 60707, 60616, 59838, 56809, 54325, 59961, 66962, 63633, 66099, 65050, 58246, 55115, 51832, 49137, 46977, 49022, 46585, 42979, 49195, 52606, 47944, 46933, 45259, 39464, 37184, 35654, 34804, 34490, 28752, 23873, 22716, 26648, 30529, 31496, 23806, 24216, 26377, 28550, 29769, 23561, 23172, 27129, 27313, 29116, 29463, 34031, 35223, 33954, 28386, 21546, 23399, 25968, 21516, 18317, 17487, 21085, 16748, 13488, 14763, 18287, 11075, 14292, 28679, 28316, 21528, 21162, 23579, 19574, 14658, 17465, 23729, 22106, 22259, 22544, 20318, 26976, 23735, 20409, 18330, 14179, 9846, 10004, 9607, 11818, 12124, 13997, 9225, 8759, 9391, 11910, 17134, 18090, 11055, 11223, 9098, 9760, 5601, 2346, 46, -2671, 1322, 4365, 5234, 8550, 5125, 1524, 2392, 5403, 8788, 13559, 16469, 18830, 12316, 5766, 6102]
12047F102K345K294r389o453J77m79m060K218M590k949L606j81m999N43R081J140
12031C586m083N80l07k277J452J406L766P545M177k488q170K576j45m606K83L791
12015G086N86K838P74K469J887N64L286N917L012J0099P398J0516J1496J5295
12001H3223K1434K8303N4443O4873P1191O7550L9788J104l0437n8369p5556o3148
11989B04399m1941l8542k4885l138o212p287j2492r696j854J401l750n482k948
11976D7573j2492m804L500j13p455n352M064L634n378J010K019O709k081n442
11962B5392o110m722N971p47L206l504J510J890p92k396m396K401J702m718k20
11947A4467j535n93m67k164k796J326r25L755P527k806o484Q81r80J726J076m00
$$ y = [6102, 8447, 10741, 1352, -5101, -4924, -5403, -9463, -7245, -2655, -5604, -1998, -2179, -7178, -6635, 2446, 3586, -497, 83, -224, -2501, -1049, 357, 4123, 11668, 15845, 13357, 5187, 7763, 7618, 3012, 3295, 7086, 7672, 10510, 11284, 13753, 15640, 16204, 19490, 25407, 28419, 38518, 45916, 56432, 67928, 83223, 104657, 132960, 187403, 252276, 323467, 391017, 430805, 431909, 401472, 343103, 267547, 204399, 162458, 123916, 99031, 95893, 89681, 82394, 69902, 60206, 58352, 59753, 56003, 50521, 47573, 35081, 30277, 33777, 33664, 26209, 20857, 24921, 28555, 23177, 24187, 26206, 32915, 30834, 25392, 19282, 14560, 20531, 19784, 22990, 19486, 20996, 22886, 22094, 19698, 15302, 17703, 19405, 14687, 14467, 12932, 12339, 11872, 9708, 6912, 8238, 7313, 11068, 18595, 15789, 9305, 10186, 9206, 10932, 12008, 11608]
11931A1608M3l122O601R509M925J989J284k018q635r866N920K489q942n068j1965
11916e248k055J0150M025l431K062N596Q43l348r85K846m788l872M08M528O775
11901A3506N686l986j537O77k047J397Q994M068o443J302m521o235m821L126L722
11886A2888l115J772K263p467j222n89K945K300l113j422l95O194j181m861j403
11871C594J755j611J045J155n538J296N879Q716J0910k908j2596n313k806J041
11857D619J732k7n022J54M174J837l085l407L417J950k180l026k05n573M249N309
11841D916m964l832M313L403k741p48J908j785q309m233N761K998J384j650J572
11826b007K437P068o290n33q64M294J721K355K31o674K173j651q393J380M839
$$ y = [11608, 11651, 8529, 15130, 24639, 29564, 31553, 32837, 30819, 22184, 12318, 18238, 20727, 11785, 6717, -5248, -7303, 2847, 6872, 3441, 5503, 11099, 11942, 8594, 7609, 10455, 5667, 1795, 2203, 6731, 13506, 19192, 15206, 13669, 14346, 12299, 13696, 22690, 26758, 20315, 21617, 17096, 10861, 6040, 9166, 12888, 9773, 11545, 13808, 6341, 5119, 4530, 7475, 9775, 6662, 5240, 4845, 11039, 9858, 4997, 3594, 5349, 3738, 4783, 5938, 400, 1696, 7575, 16291, 27201, 24293, 11697, 6384, 3578, 4619, 6351, 6324, 1302, 1456, 5630, 7467, 4382, 975, 4392, 6342, 4162, 1136, 931, -4642, -393, 4916, -48, -3880, 433, 3836, 1095, 347, 2255, 470, -7839, -12072, -6311, -3313, -1929, -3579, -2007, 430, 7498, 1208, 675, -189, 4105, 5826, 8181, 8412, 1738, 3911, 2260, -6133, -4753, 86]
11811H6O599m175q868n302r32M19N077l290N411O890r66m274j0623R391J1929
11796G372j145J365o982j366q67J183J839n350K366Q908J396k762p86P235L099
11781A5505k001O673N12n501r046j34J621j259l549l985N650K589o443k083P0
11766a381m17N693J402K307K086J152p286j10K543L57M861L977l124l732l544
11751D784m542M080j533L707j52K143l548m175l024k178L284N985j675q46N300
11736G610L181O004J598o313R021l736j360o456p440O43j191j218L605P19o751
11721b084k017M943k004j873m1P397J673k075m37M324k276j723K878k970m117
11706d02N695J107l258n565j341m43K737m2m397J563K829J154O23o553j90O12
$$ y = [86, 6685, 2510, -6358, -11660, -12592, -12173, -7096, -10386, -4975, 1915, 949, -3325, -13948, -4557, 7372, 6227, 7592, 610, -756, -1623, -440, 1399, -3951, -1585, 7323, 8719, 5957, 5171, 12406, 15505, 13504, 20177, 20689, 15188, 6142, 6008, 7629, 6370, 2821, -1164, 4486, 7075, 632, -1451, -1381, -1798, 3895, 5297, 7604, 9690, 10842, 3556, 3446, 5989, 6346, 11207, 15184, 12060, 8328, 4784, 242, 4322, 2789, 6496, 6344, 8487, 4939, 764, -2260, -4438, -1154, 4831, 3156, 2310, 7610, 10791, 16795, 18393, 12080, 21101, 17365, 16005, 9549, 2109, 2752, 1561, 343, 3948, 4667, -2084, -4101, 842, -1162, -3035, -3076, 4321, 5994, 3919, 3482, 7806, 5530, 3807, 6685, 3715, -402, 5293, 6400, 3142, -2423, -3764, -4207, -1470, -1512, -5909, -4346, -1517, -363, 260, -6293, -6483, -5871]
11690e871Q809P339n366l041N670n640q061J191l42j535K801O55M937N9n228m018
11674g641M566L561M338N537p44j534o37J49L016K482N55l370l597q474L91M839
11658C437j656l845J178O17J134Q183m619J392K850j0718N248R319K163n398m094
11643E191J822K549J435k92m694j869l512k068O455J1466q728o586l579m032n74
11628g016L929O173M472m03k062l948j899m206m912J0005L216N689M592J518n797
11613I351J894J449m580L712n454n803L022R345k605k337n737l057j623j926K612
11598a737j953M356k090l152R107N296J358j797q3j076o386n846J071O107p61
11583B414R276J132p551m400k67K083j689j926K03J139K011K881o452j759O444
$$ y = [-5871, 2938, 10277, 4911, 1870, 7540, 1900, -6161, -4970, -5312, -6847, -4046, -3391, 1546, 1605, -3623, -7641, -3075, 486, 4824, 10361, 9617, 8083, 7446, 7595, 10611, 13093, 13648, 10278, 6681, -1793, -1402, 3437, 1781, -2064, -886, -269, 865, 9048, 4429, 5821, 8671, -2047, 3201, 12520, 14683, 9285, 5191, 7013, 9562, 10997, 10705, 6011, 4142, 630, -1438, 5017, 16483, 7755, 1169, -2410, -6442, -7016, -3087, 3086, 7558, 7155, 5093, 1145, -754, -4960, -9872, 133, 3349, 9038, 13630, 15148, 9351, 11245, 12694, 8114, 11826, 6372, 569, 3591, 12936, 10331, 7994, 2257, -800, -2423, -4349, -1737, -3690, 666, -1424, -4576, 4531, 9827, 11185, 9388, 9305, 8229, 1843, -4003, -2932, 3175, 2414, 11690, 12822, 5271, 871, 604, 2687, 998, -928, -725, 414, 2425, 5306, -1146, -2905, 3539]
11568C539P055p704r600L012L639J964p38J397K449J445P44K29N52J420L061N996
11552A8460o792L06m771n444L18L376J779k882J9K458n710O05L147l608M067M253
11536I581k49k303m188j009N540L859R58k852p01O553q36q392n157j863j938L835
11520H38O57p54J759J394L404O054p078o934J741q34l0J177p64o17M708K275L45
11503G341m907R818k684n241L577J638k354k358k138q00J562K317O879l34j875
11488A0441k135L945j22l806L455M15L33J976m130l390K40m652k563M041L705
11473G753o81J086M278N720n913n071p33l07K41M350O740r25q590k028M873P20
11457A1513j780j207j834p437j071R164Q067p650n320j70P49M07J052N132K043
$$ y = [3539, 10594, 2890, -6710, -3698, -59, 1905, 1167, 2564, 5013, 6458, 7202, 7431, 7983, 9403, 12464, 18460, 11668, 11974, 7203, 1759, 2077, 5453, 7232, 4350, 4369, 6827, 1117, 1722, 4869, 1261, 5328, 9581, 9332, 7029, 2841, 1832, 7372, 11231, 12189, 9337, 8636, 15189, 14353, 5961, 804, -1059, -2997, 838, 1495, 741, 2500, 3894, 7298, 13352, 6274, -660, 1081, 247, 217, 1394, 630, 13, 4721, 6996, 7341, 2434, 12252, 9568, 4327, 7904, 9542, 7188, 4830, 2692, 1892, 3454, 5771, 12650, 12316, 10441, 8306, 12251, 12129, 8323, 11778, 12193, 12526, 14502, 10372, 6982, 7222, 2570, 7, 4048, 7753, 7072, 8158, 12436, 18156, 12243, 7172, 6439, 6132, 6373, 10723, 17463, 16538, 7948, 5920, 10793, 11513, 9733, 8526, 6692, -745, -1816, 7348, 15415, 7765, 2445, 2275, 3024, 3431, 4483, 9615, 11658]
11442A1658l249l081l596o751N786N573o50j539k211k306j787N628K108M309J42
11427A0034l771L280l85m660N294k137k969P37K906m19l25j259J107J526J666
11412A0625j129q64Q25r718l818K946K835l962N130K00m231K52P298J098l809
11397C678P012M782m342j284P410N43m085n261J544j598q579J921L278n9L23J008
11381F291M7M689M003J515j0338m417Q73L774R226m613m433m677j864J497q77
11366F96p11O166m183o616O325J0661J260j418r56O287m039m571l169J111o822
11351B1p829N394j364m42R87o21M684J849M576L106j593K074L543k194p409k85
11335D497m270Q41P169l20Q37j924k772K716J333L846j516J242M923j662P98L043
$$ y = [11658, 8409, 5328, 1732, -5019, 767, 6340, 5690, 4151, 1940, -366, -2153, 3475, 5583, 9892, 10034, 6263, 9543, 9158, 4498, 9792, 7655, 4686, 5423, 8329, 7910, 7585, 6326, 7433, 8959, 10625, 9496, 8632, 9457, -261, -4079, -1133, 1702, -2260, 2870, 3070, -1161, -909, 6389, 7487, 3678, 10690, 15472, 11130, 9846, 17256, 17799, 13714, 8453, 9997, 8399, -180, 1741, 5019, 4960, 5283, 6291, 6338, 11027, 15030, 16545, 6207, 1790, 2663, 6437, 15663, 11050, 6617, 1940, 76, 1573, 696, -15, 6151, 1968, -4648, 1677, 12338, 13598, 12180, 11224, 17511, 13472, 8901, 5732, 6843, 21, -7808, -2414, -3778, -4220, -3233, -3854, 830, 2679, 7255, 10361, 8768, 10842, 14385, 12191, 4782, 4497, 227, 1068, 8237, 7917, 8754, 6830, 4058, 6774, 8107, 11953, 10437, 11679, 16602, 14940, 15738, 18781]
11319A8781K484n207n481k856n922j031N213M129n26K595L439K645O37o187l073
11304I640o972j695M237k39j992N62M513O075J486N44k03m587q207L631L343m229
11288E907M190J141j880J574N64j431n307R16J608K747L155K398l348m414L017
11273A0837K65k060l426k47L215L93k268k323O957J1125k040o177l730k523q180
11258a82O961J871r441K891L146J152n423k462k279K592J86n225L116N372K235
11243D510m768M796O948J334L855r115r404L922k071k016k481j03L273J440q53
11228g33l80j595J454m501o040L983J2134P607j86O21l033j048p790l02J785N064
11212G040L426j121o758m522L353q18k424L639J1903J013m239K789k132n232p259
$$ y = [18781, 21265, 16058, 10577, 7721, 1799, 768, 5981, 10110, 9584, 12179, 15618, 18263, 18900, 12713, 9640, 2668, 973, 5210, 4971, 2979, 3541, 8054, 14129, 15615, 16159, 15956, 11369, 3162, 6793, 10136, 5907, 10097, 11238, 9358, 10932, 11496, 10065, 4758, 5674, 7282, 10029, 13184, 15582, 12234, 7820, 10837, 11102, 9042, 5616, 5369, 8584, 8977, 6709, 4386, 11343, 22468, 20428, 14251, 10521, 7998, -182, 6779, 8650, -791, 2100, 5246, 6398, 975, -1487, -3766, -1174, -988, -6213, -3097, 2275, 4510, -258, 4538, 11486, 12820, 16675, 7560, -1844, 2078, 7, -2009, -4490, -4593, -1320, 120, -733, -1113, -2708, -1254, -5755, -11795, -7812, 4322, 11929, 11743, 12364, 9331, 8283, 493, 191, 1976, 7040, 10466, 9345, 2587, -1935, 1418, 600, -1824, 1815, 13718, 14731, 10492, 13281, 11149, 5917, -1342]
11197a342L166P747j902J275Q22L25k70l325N16j901k964L449N325J0187P307
11182B8415q739m434K95n765n615p619M477P219L729o097j215L90m858r28m47
11167a192J263Q229K465l741m183j768Q169M99Q3M520p744m988n31L939J522j99
11151F343m2j372P442J492k246l56m175m537O248O738n608p490O399M982p568
11136F250k990J3348j105Q952j553j0142p283l836M206M366L88m03N523P813K737
11121B6271r155m989R317J188n251J903L716n735j0168n294K469P067K533r94
11107A2878O61k888q40j826o98P231Q487o978p053L227K248m24l841J071Q86M612
11091A6753L660l463l56l919n508Q19J117J477K464j134N038M1p251j043K213
$$ y = [-1342, 1824, 9571, 7669, 8944, 9766, 10091, 9821, 6496, 7012, 5111, 2147, 5596, 10921, 21108, 28415, 19676, 15242, 15537, 9772, 4157, -3462, 1015, 8234, 11963, 5866, 4651, 5041, 183, -745, -1192, 71, 8300, 10765, 7024, 2841, 1073, 9242, 9741, 9824, 14344, 6600, 1612, 1081, 5020, 6542, 6343, 6301, 4929, 12371, 13863, 11617, 11261, 7086, 2549, 8797, 15535, 9927, 2437, 8836, 13818, 6250, 3260, 16608, 15503, 24455, 22902, 12760, 5477, 1641, 5847, 10213, 10601, 10198, 15721, 23534, 26271, 17116, 12127, 21444, 22632, 17381, 19284, 23000, 17265, 7097, 1803, 4272, 11339, 13872, 12878, 13539, 10651, 9811, 7985, 7287, 14518, 23005, 16027, 8974, 12201, 14449, 14025, 10184, 11255, 12141, 16753, 20413, 16950, 16594, 12675, 7167, 7986, 9103, 10580, 13044, 11910, 16948, 16989, 9738, 8695, 10908]
11076A0908K902n046N131K223J113r067q66N582O099K251N797J185m665k501j901
11061A9145j070L115k792J314L536K519j238M322J841p523n407L565n128r008
11047G191l863O440n111P282N416L640K074j129o268k696J109J072m338n579M125
11032I365P412k800K992k055N60j858O303L413l483J150j302l210J4906L93m061
11017B7725p10r36J26k644j355k292K048J44l423k884M927K78o225K835O999J740
11001B6353p004P95L895J34l348J401K343J502j139o044R565m32q517k898j073
10986A5533P883K774n019o297pP259L737m905O11L880P918n846m678o998r2Q755
10970B4508L454j015l227L940K834j487j727Q56J970M734r90J550n756N519K17
$$ y = [10908, 13810, 8764, 13895, 16118, 17231, 8164, 7298, 12880, 18979, 21230, 27027, 28212, 23547, 21046, 19145, 18075, 21190, 18398, 19712, 23248, 25767, 24529, 28851, 30692, 23169, 17762, 21327, 16199, 7191, 3328, 9768, 4657, 11939, 17355, 20995, 23069, 21940, 15672, 12976, 14085, 15157, 10819, 5240, 9365, 16777, 13977, 16969, 14914, 15474, 13616, 19919, 23332, 19849, 20999, 19697, 16487, 31393, 31786, 27725, 27015, 26079, 26205, 23561, 22206, 19914, 21962, 22106, 18683, 15799, 20726, 21004, 14779, 17614, 24613, 26353, 19349, 20144, 24039, 24173, 20825, 22226, 24569, 26071, 24932, 18888, 28453, 28021, 19504, 16606, 15533, 23416, 26190, 21171, 14874, 14867, 22126, 25863, 20958, 21569, 25449, 33367, 27521, 22843, 15845, 15753, 24508, 27962, 26947, 23720, 27660, 30494, 29007, 27280, 28136, 30106, 34840, 33850, 35400, 29644, 35163, 35380]
10955C5380o240r67N580l594l125K944j459r04K489j0412j542Q866K894j595p966
10940B0349Q73P14J496J506k117M762l708m145J872k707l431K172M879P65j431
10925B1849J298L9o508K320L93J1465O687k407n024l047L18l71l889k795J302
10910B1630R07K65k992L131Q632K738k571l635m490M054m764k168l171o130P286
10895A8722M012l419o843k984N218O823K540J360k224l890j729M482J133n405
10881A7796L401R788k8k219j427P44L165m794L169J0887P346l941l514q647m040
10866B7686j841K291J0616m909o27N227n92m595K08J057j393o32o063l67J667
10851B7733K815J188k390r7J1l198l977L992m372j22l391N039L971L235l287Q85
$$ y = [35380, 29140, 28173, 33753, 30159, 27034, 29978, 28519, 27615, 30104, 19692, 18150, 27016, 29910, 28315, 20349, 21222, 21936, 23432, 24938, 22821, 27583, 23875, 19730, 21602, 18895, 15464, 17636, 22515, 23280, 21849, 23147, 23186, 16678, 18998, 19391, 30856, 37543, 35136, 30112, 27065, 27383, 27012, 23123, 20328, 21630, 22537, 22802, 19810, 22941, 31573, 34311, 31740, 28105, 23615, 27669, 22905, 20737, 17566, 11436, 18722, 22734, 19315, 12472, 9488, 14706, 21529, 24069, 25429, 23205, 19315, 17586, 22068, 23201, 17796, 21197, 30985, 30957, 28738, 27311, 28055, 31220, 26426, 29595, 40482, 47828, 43887, 40373, 31726, 27686, 25845, 28136, 38752, 33843, 33216, 38443, 37851, 33256, 33464, 34521, 33128, 32496, 26433, 26066, 27733, 30548, 31736, 29346, 29249, 29260, 26062, 22085, 26077, 21705, 21583, 18192, 23231, 27202, 30437, 27150, 28035]
10835B8035n244K192K277j573k206K960P702r57l534j0475k486j149J7k756k856
10820I947J945Q317N038J0081J0218J886m394o413K615l813J147J659K65k796
10806C5702l496l738p939l194O087J2003L443m497n830q09k860Q916N010k966
10792C5832m866q80o276l756K752J550p85R016J0825J943m842M463J101j687k285
10777D2105m517M53L130m4%J71K832M965M976Q645Q320j195O256R903J0095M969
10761A01064K3238L3831M1796O6075Q4525Q2939N3224K0391k4655o2473q6281
10750C33674p5940n3978l7332k0683j6685r110j037o624k187m356m942p942r608
10737H3250r539p069k925Q73N919j929l112N439R496N688j2354j3042L197M82
$$ y = [28035, 22791, 24983, 27260, 25687, 23481, 26441, 34143, 33186, 29652, 19177, 16691, 15542, 15559, 12803, 9947, 11892, 20209, 25247, 35328, 45546, 47432, 43038, 36625, 39240, 35427, 36574, 38233, 38498, 35702, 32206, 28468, 20529, 17335, 23422, 35425, 38868, 34371, 28541, 27732, 24872, 33788, 38798, 35832, 30966, 30086, 23810, 20054, 22806, 24356, 23571, 32587, 43412, 45355, 40513, 44976, 46077, 44390, 42105, 37588, 38041, 41171, 41127, 41127, 41298, 44130, 49095, 54071, 62716, 71036, 69841, 76097, 86000, 96095, 101064, 124302, 158133, 199929, 266004, 350529, 433468, 486692, 507083, 482428, 419955, 333674, 257734, 203756, 166424, 145741, 129056, 119946, 118909, 112285, 110098, 105742, 100800, 92858, 83250, 73711, 66642, 63717, 64590, 70509, 68580, 65468, 70907, 80403, 86091, 73737, 60695, 63892, 64374]
10723F4374O722K172n046J52m396p377J425L324N520K55j633o033l023o783n265
10708D4388P449M584J090M40j961N544k967M841l335R53N556J581k266K342K725
10693G0964P63L439R884Q759R778J2358Q882J9893K9980M1851O0556Q1715P6470
10680D35292N9280K8184j6152n8576o8647p6688o6326m4013k9215j8096j4006
10669A31037j3831j0566j973L836j920q474l399k594L13q859r0O40l225l589O409
10654H3715N788J449k538J369j254j447l891l072l098J479M148N520k106l030
10640H3032o186k111j787J161o222q500l841l371q121m700J2489J3199J0435j766
10626G3711n399L016P751l479j318k609K033J883q14R552O151K181J8322J5584
$$ y = [64374, 71096, 73268, 68222, 68374, 63978, 56601, 58026, 61350, 66870, 67125, 65492, 59459, 56436, 49653, 44388, 51837, 56421, 57511, 57951, 55990, 61534, 58567, 63408, 60073, 61026, 66582, 68163, 65897, 68239, 70964, 71727, 75166, 85050, 93809, 103587, 115945, 124827, 144720, 174700, 216551, 277107, 358822, 435292, 494572, 522756, 506604, 448028, 379381, 302693, 236367, 192354, 163139, 145043, 131037, 117206, 106640, 104667, 108503, 106583, 98109, 94710, 92116, 92429, 83570, 83480, 84120, 80895, 77306, 83715, 89503, 90952, 88414, 89783, 88529, 87082, 83191, 80119, 77021, 78500, 82648, 88168, 86062, 83032, 76846, 74735, 72948, 74109, 67887, 59387, 55546, 52175, 44054, 39354, 51843, 65042, 75477, 73711, 68312, 71328, 79079, 75600, 74282, 71673, 73706, 75589, 74775, 84327, 90478, 92659, 110981, 126565]
10612A26565q04J439k802L458K222k612k871q368l953l251n026o850j998k669
10598I2480O14q899k758J658L145l052J658J150M202m159m627k70p7O74p71k93
10582H0675L324L317J17q444l469Q009M016m382k077j676R213m878q01P299O619
10567I6862L684O00M41l02j107L567l466L295P585j62r876l393j60N83M299j0786
10551I1664r287L059L521M213J100K107J819J0560J5583J0539j062K049J710P653
10537A45228Q865k473O56j929o725o54p81j0238o885j0268r604r81M101M096M324
10522A16732L256N156m297m935J791L832k060p365j324L14K302P476Q899l94J4662
10507A44045J1285L463O497R774L972p310p291m466q67R742R581k069K700J2447
$$ y = [126565, 125761, 127200, 124398, 127856, 130078, 127466, 124595, 116227, 112274, 109023, 103997, 97147, 95149, 92480, 93094, 84195, 81437, 83095, 86240, 83188, 84846, 85996, 90198, 86039, 81412, 81142, 81065, 81739, 80968, 80675, 83999, 87316, 87433, 78989, 75520, 83529, 87545, 83163, 81086, 79410, 88623, 83745, 82944, 90243, 96862, 100546, 101146, 101587, 101285, 100178, 103745, 100279, 103574, 111159, 110997, 101121, 97728, 97568, 98151, 102450, 91664, 82377, 85436, 88957, 93170, 94270, 96377, 98196, 108756, 124339, 134878, 133816, 135865, 137575, 145228, 154093, 151620, 152276, 150347, 143622, 142968, 142187, 131949, 125064, 114796, 105192, 104211, 108312, 112408, 116732, 119988, 125144, 120847, 115912, 117703, 121535, 119475, 112110, 110786, 111100, 113402, 120878, 129777, 129383, 144045, 155330, 158793, 165290, 175064, 179036, 171726, 164435, 159969, 159102, 168844, 178425, 176356, 179056, 191503]
10493A91503J4628J3706K0815J8356K6519K1441J7031K2698K4502K1516L4369
10482D27084L2742K2359R451J331N450k06J631j0659k7989l1762k6590k8565l6883
10469C37394l8141k1819j042K950J0161L685m727n071L541J576M857j361L706
10456B95709J235j651p33J770l89j204p8J356k532N465J044l35o851n459O484
10441B93831P669J214J537M453P947P699M589L89K115L186n29o193p860k18j628
10426C18201j069O241O249M349R582J8164J7582K3787K7516J6541J7162K1537
10414D85842J9155K6986L5763L9363L7433L1760L4372K7913J6867J7758k591k0870
10402G49751k8188k3709j9242k0071k2756j8777j3359J2487J6094J2522J9212
$$ y = [191503, 206131, 219837, 240652, 259008, 285527, 306968, 323999, 346697, 371199, 392715, 427084, 459826, 482185, 491636, 492967, 498417, 498211, 499842, 489183, 461194, 429432, 402842, 374277, 337394, 299253, 277434, 276392, 279342, 289503, 293188, 288461, 283390, 286931, 288507, 293364, 292003, 295709, 296944, 295293, 294560, 296330, 295941, 294737, 294659, 296015, 293483, 298948, 299992, 299657, 292806, 287347, 293831, 301500, 302714, 304251, 308704, 316651, 324350, 328939, 329328, 331443, 334629, 334100, 327907, 320047, 319829, 318201, 317132, 323373, 329622, 333971, 343553, 361717, 379299, 403086, 430602, 447143, 464305, 485842, 504997, 531983, 567746, 607109, 644542, 676302, 710674, 738587, 755454, 773212, 770621, 749751, 721563, 697854, 678612, 658541, 635785, 617008, 603649, 616136, 632230, 644752, 663964]
10391F63964J7608K6931K5693K8623L5580L7403L1317L3818M3236M8255N1581
10380A044009N6814N9175P7237Q9405J12502J30089J55209J73989J82820J73765
10370B255014J52746J46027J60994K16315L03485M17112N48226P09595R00628
10361E810142J128604J465441J991589K875258M373280O791383J0121513J3590251
10353D8147461J5451655J4125143R320591J662692p112525j3787529j5668196
10346E2139292j3224403r304789o018551l874746k616847j897438j485923j219465
10338A2497130j013390q29274o63060n17896m19396l53793l00150k74749k77598
10329G847824k88936l16165l43923l56811l33932k94015k33459j91422j67588
$$ y = [663964, 681572, 708503, 734196, 762819, 798399, 835802, 867119, 900937, 944173, 992428, 1044009, 1100823, 1159998, 1237235, 1326640, 1439142, 1569231, 1724440, 1898429, 2081249, 2255014, 2407760, 2553787, 2714781, 2931096, 3234581, 3651693, 4199919, 4909514, 5810142, 6938746, 8404187, 10395776, 13271034, 17644314, 24435697, 34557210, 48147461, 63599116, 77724259, 87044850, 88707542, 81595017, 67807488, 52139292, 38914889, 29610100, 23591549, 19716803, 17099956, 15202518, 13716595, 12497130, 11483740, 10654466, 9991406, 9473510, 9054114, 8700321, 8400171, 8125422, 7847824, 7558888, 7242723, 6898800, 6541989, 6208057, 5914042, 5680583, 5489161, 5321573]
10320E321573j36010j25901j28275j30612j26377j23877j20281j09624q7918o8511
10310D164187n1890m2025k5995j4391R413K9495N6435P4318Q5594R9295J04623
10299D489059P5631O9036P1649J03887J77154K74937M02717N45302P09755R13258
10289G832385J176011J565875K202958L307715N186007Q047316J1608930J4638447
10281E5565644J5341316J2683604O635337j780256j0012706j4982826j5161887
10274D8288226j1962711q115444n179718l358959k317432j731271j391602j170698
10266A3060391r84672q08976o41505n18095m35676l64406l17953l00144k92914
10257H396050l08706l39158l62804l65416l40781k98283k53346k22878j96468
$$ y = [5321573, 5185563, 5059662, 4931387, 4800775, 4674398, 4550521, 4430240, 4320616, 4232698, 4164187, 4112297, 4070272, 4044277, 4029886, 4039299, 4068794, 4125229, 4199547, 4285141, 4384436, 4489059, 4564690, 4633726, 4705375, 4809262, 4986416, 5261353, 5664070, 6209372, 6919127, 7832385, 9008396, 10574271, 12777229, 16084944, 21270951, 29318267, 40927197, 55565644, 70906960, 83590564, 90225901, 88445645, 78432939, 63450113, 48288226, 36325515, 28210071, 23030353, 19671394, 17353962, 15622691, 14231089, 13060391, 12075719, 11266743, 10625238, 10107143, 9671467, 9307061, 8989108, 8688964, 8396050, 8087344, 7748186, 7385382, 7019966, 6679185, 6380902, 6127556, 5904678, 5708210]
10248E708210j75027j64588j62031j67173j63787j57994j45262j38254j33292
10239D300802j23200j00489q3402p5867o4147n9675m6494n6134o1608m9143n3663
10228C526980n3370n5048o2092o5715p0343q2798q6670p8315p6057q1590p2611
10217B742371p9463p2774o4634n5324m5651l4504k3596k4338k3684k5713l5602
10206B257088m1197m1171m5496n5970n2899n7339o3214n4951n3967n4451m7687
10195A688746m2244l5907l6552l8514l9385l2529k9819k5160k9432l3931k6386
10184A318887l2321k7609k1028k2151k2713j7619j9481k4358k1955j3417j2843
10173A083392j6225j7060j8319p144j295j3225j2809r375p928O347J0596P065
$$ y = [5708210, 5533183, 5368595, 5206564, 5039391, 4875604, 4717610, 4572348, 4434094, 4300802, 4177602, 4077113, 3993711, 3917844, 3853697, 3794022, 3747528, 3691394, 3629786, 3580643, 3526980, 3473610, 3418562, 3356470, 3290755, 3220412, 3137614, 3050944, 2972629, 2896572, 2814982, 2742371, 2662908, 2590134, 2525500, 2470176, 2424525, 2390021, 2366425, 2342087, 2318403, 2292690, 2257088, 2215891, 2174720, 2129224, 2073254, 2020355, 1963016, 1899802, 1844851, 1790884, 1736433, 1688746, 1646502, 1610595, 1574043, 1535529, 1496144, 1463615, 1433796, 1408636, 1379204, 1345273, 1318887, 1286566, 1258957, 1237929, 1215778, 1193065, 1175446, 1155965, 1131607, 1109652, 1096235, 1083392, 1067167, 1050107, 1031788, 1024644, 1023349, 1010124, 997315, 987940, 980012, 986359, 996955, 1004020]
10161A004020M858R89J4487K4742J1237J2573J8198R082K428j6527l8485l8433
10149A009169l4343l1417k3056k4106k6549l1919j9564j9919j8277j6783j3014
10138G50222j1972j2821j0541j2160r594o766n830q410j4719k4395k5540j8430
10126E89044j0375j1112j5685n315j0103p491q994j1868j5094k374p786r594j889
10113D71364l432r234r364m460n836j6006p141j2481j1093j531l288j0096r637
10100C67765p041o852r462j1743p241o152p958m504l322k638o635o394l425L32
10086B84730K753j976j348r27L679K92p072j7296l406l983j2733o859o822j3108
10072B15924j1140r78n932j1844q092l138l063j1612p928M774Q389j489k050K077
$$ y = [1004020, 1008878, 1009867, 1024354, 1049096, 1060333, 1072906, 1091104, 1100186, 1102614, 1086087, 1047602, 1009169, 974826, 943409, 920353, 896247, 869698, 837779, 818215, 798296, 780019, 763236, 750222, 738250, 725429, 714888, 702728, 693134, 686368, 680538, 672128, 657409, 633014, 607474, 589044, 578669, 567557, 551872, 546557, 536454, 528963, 519969, 508101, 493007, 490633, 482847, 473253, 471364, 467932, 458698, 449334, 444874, 439038, 423032, 415891, 403410, 392317, 390786, 387498, 377402, 367765, 360724, 353872, 344410, 332667, 325426, 319274, 311316, 306812, 303490, 300852, 294217, 287823, 284398, 284730, 287483, 285507, 284159, 283232, 286911, 287203, 280131, 262835, 259429, 255446, 242713, 235854, 229032, 215924, 204784, 203806, 197874, 186030, 177938, 174800, 171737, 160125, 152197, 156971, 165360, 163871, 161821, 163898]
10058A63898K314L828K228q880q297n350L1J3335L797n491o895l018m724j513
10044A45263o356m163j3847o242N813L516O606O886J2504R500M260M965o320o229
10030A56156l662j2520r195j345k866q906j0719o575l130q925r029m746m939k922
10016F6677o674q39K433L310J682O049J1636M76j085J182P160l015m90K212L746
10001I4460j263o11J516j894j003j131N75o660k137j543l458j5631q324k287J525
9986E2134N173K066J026J883n470p421M909k296m51O567n929J669K528q970m849
9971D2569K276L219K509P366N427j800K087m030l515L67j855o62N293P317j859
9956F4709o555J792Q740N841N616N312Q447J5551J8015L2951M6347N5939P2168
$$ y = [163898, 166212, 170040, 172268, 163388, 155091, 149741, 149772, 163107, 166904, 161413, 154518, 151500, 146776, 145263, 138907, 134744, 120897, 114655, 120468, 123984, 130590, 137476, 149980, 159480, 163740, 168705, 162385, 156156, 152494, 139974, 130779, 129434, 126568, 117662, 106943, 100368, 97238, 88313, 79284, 74538, 69599, 66677, 60003, 59164, 61597, 64907, 66589, 72638, 84274, 84750, 83665, 84847, 92007, 88992, 88502, 90714, 94460, 93197, 92586, 94102, 92208, 91205, 90074, 90649, 83989, 81852, 80309, 76851, 61220, 52896, 50609, 52134, 57307, 59373, 60399, 62282, 56812, 49391, 54300, 52004, 51553, 58120, 52191, 53860, 56388, 47418, 42569, 44845, 48064, 50573, 57939, 63366, 61566, 63653, 59623, 56108, 56475, 54620, 53958, 59251, 66568, 64709, 58154, 59946, 68686, 74527, 80143, 85455, 93902, 109453, 127468, 160419, 206766, 262705, 334873]
9943C34873Q2236O4515K4505j1121n4121o8505n5996l4712j5369J431j246p888
9931B58602j8402k9769l5143k0911j2687j3657j0381j0222j0510k151j050m316
9919H9403o560j5576n408L787j122J59n650j718N461K009m577m691m989l50L458
9904E3636K396k364L831k088m196Q16L440n69O15j358m975j146J351n050n746
9889C8593o34J940j075M432R920P390P526O454J4841K4971L3824M6490O7364P8590
9875C40626P6524N9803J6297k3478o9569q0739o9930n0703l6443k4791k4991j4303
9863I8303p322m628k430k333n696r911k083k106O733N278k697m721K47j073o600
9848E8961J943M7m814M012K451R800J0146Q863J0284K9006O3519O8433O9565N2088
$$ y = [334873, 417109, 481624, 506129, 495008, 440887, 372382, 316386, 281674, 266305, 267736, 266490, 258602, 240200, 210431, 175288, 154377, 141690, 128033, 117652, 107430, 96920, 94769, 93719, 89403, 82843, 67267, 61859, 65646, 64524, 64683, 59033, 57315, 62776, 64785, 60208, 55517, 50528, 50178, 53636, 56032, 53668, 57499, 55411, 51215, 52031, 55471, 54902, 55517, 54159, 49184, 48038, 49389, 44339, 38593, 37959, 39899, 38824, 43256, 53176, 60566, 68092, 74546, 89387, 114358, 148182, 194672, 262036, 340626, 417150, 476953, 493250, 469772, 400203, 319464, 249534, 198831, 162388, 137597, 112606, 98303, 90981, 86353, 83923, 81590, 75894, 65983, 63900, 61794, 68527, 73805, 71108, 66387, 66634, 65561, 58961, 60904, 60951, 56137, 60149, 62600, 72400, 82546, 91409, 101693, 130699, 194218, 262651, 332216, 384304]
9834C84304K0155k6074p0586p7060n6194l9865k1119j0221q178j1064r236m140
9822G0722p361o839k369N395j21m680j398j0292m357j015M32M903O597K534J233
9807E3384p958j2085R756O537J245r13j28l103m512m589N048k012m233j084L381
9792C8734K271m109N69p194J482k837j492M888J936N362J049o177L983N06j32
9777C8839o017l259K4R68k525J358l433n390j992n7L559J4783k757r553l434L106
9761B4220N72k275l256M084L151J470n99O755l246m317j589P10n348j158L57j490
9745A8041k365l225L358L602n843L999O784m14N18j036p081n692J453N354Q050
9730B5503l312j804Q173K46n817l890l767k231J668J937J811o66n22k00J603M476
$$ y = [384304, 404459, 378385, 307799, 230739, 174545, 134680, 113561, 103340, 95162, 84098, 74862, 70722, 63361, 56522, 54153, 59548, 59427, 54747, 53349, 43057, 38700, 37685, 38117, 43020, 49617, 52151, 53384, 45426, 33341, 43097, 49634, 50879, 49966, 49838, 46735, 42223, 37634, 42682, 40670, 36437, 35353, 38734, 41005, 36896, 37465, 30271, 31753, 28916, 27424, 32312, 34248, 39610, 40659, 34482, 38465, 38971, 38839, 32822, 29563, 29587, 30555, 28030, 29388, 25955, 20565, 18573, 18516, 22075, 36858, 34101, 24548, 21114, 24220, 24792, 22517, 19261, 23345, 26496, 27966, 27367, 34122, 30876, 26559, 24970, 25680, 20332, 19174, 19531, 18041, 15676, 12451, 15809, 19411, 13568, 17567, 24351, 23937, 24455, 23419, 16338, 10646, 12099, 17453, 25503, 22191, 20387, 28560, 28806, 22989, 19099, 15332, 13101, 14769, 16706, 18517, 17851, 17329, 17129, 18732, 23208]
9714B3208o491m0J058K152N465j802l382R87k688M63K495K165O898n727j137J903
9698B5527M428M620O728l958n171k832N868k242r927m887L371K832K516J0895
9684C7768N241p16Q79N40L64j1121m238k665o37q37L973K782L730K813m726j344
9668C1806O976K118J81n015o717o223j000l574O758J322l081k613k028K125l503
9653A7532k692N019J936L917m475l495K734m538L00O296K948N702N374m671n334
9638B6553L293k944m741l123J918K367O225N309N10N819q099r700J979K098L750
9623C1214J397k653j781L02O33R70J614J889M316l965k758p071m92L932m346L733
9607B6934R541M4k900J783o242p013o332L188L24O19N127M484O809O766O828l450
$$ y = [23208, 16717, 16677, 17735, 19887, 25352, 23550, 20168, 21155, 18467, 18930, 21425, 23590, 30488, 24761, 23624, 25527, 29955, 34575, 41303, 37345, 32174, 29342, 35210, 32968, 23041, 18154, 21525, 24357, 26873, 37768, 43009, 42293, 43172, 43712, 44076, 32955, 28717, 26052, 25415, 24578, 28551, 31333, 35063, 37876, 33150, 31806, 38782, 40900, 41081, 36066, 29349, 23126, 22126, 18552, 25310, 26632, 23551, 20938, 18910, 21035, 17532, 14840, 19859, 21795, 25712, 21237, 17742, 20476, 15938, 16238, 22534, 25482, 31184, 36558, 31887, 26553, 29846, 26902, 22161, 19038, 20956, 23323, 29548, 34857, 35367, 41186, 33087, 23387, 25366, 27464, 31214, 32611, 29958, 28177, 28479, 29112, 30082, 31696, 33585, 37901, 33936, 31178, 24107, 23615, 27547, 23201, 26934, 36475, 36519, 33619, 35402, 29160, 22147, 15815, 19003, 19327, 19946, 25073, 29557, 36366, 43132, 49960, 46510]
9591D6510O899J2365M645l222l229L900j219K460R033O820M164j366M157M379
9577I6296L438O430J6016J9454J7552K4068K8488K4178L6468N0090O8611R6438
9565D87527J27743J88643K98229M81087P14360Q86110P77666M83012J52929m71396
9555D125910r77808q81614n89509l74397k34558j60549j13251q3385o8233n8848
9545E83758m7811l1134k6626k3333k0960j5612k0691j1921j9135k3347k0363j0422
9533C12403j2384j2379p251j0510o048l769j0338j0718k565q015q264p125q546
9520B04491r563l467l271j496q095k879K050j0107j4531l993O092j269o560p421
9506A39981n013k477m55m052p750k947O258k279n122O74j900q471n132J081o684
$$ y = [46510, 53409, 65774, 70419, 67197, 63968, 67868, 66649, 69109, 78142, 84962, 89126, 87760, 91917, 96296, 99734, 106164, 122180, 141634, 159186, 183254, 211742, 235920, 272388, 322478, 391089, 487527, 615270, 803913, 1102142, 1583229, 2297589, 3183699, 3961365, 4444377, 4597306, 4125910, 3148102, 2266488, 1676979, 1302582, 1068024, 907475, 794224, 710839, 642606, 583758, 535947, 504813, 478187, 454854, 433894, 418282, 397591, 385670, 366535, 343188, 322825, 312403, 300019, 287640, 280389, 269879, 263831, 260062, 249724, 239006, 236441, 228426, 220162, 213037, 204491, 194928, 191461, 188190, 186694, 178599, 175720, 177770, 167663, 153132, 149139, 155231, 153962, 147402, 139981, 134968, 132491, 132036, 127984, 120234, 117287, 123545, 121266, 116144, 116818, 114918, 106447, 101315, 102396, 95712]
9491I5712j742N884K34k699M81p999j911L367P827m89m098q447l615o108k221
9476G4176K953k56m46L78J459L304Q521K484r949r707m730K234J593n498j734
9461F4782j865k517p731j790M152j638n734R53N033L900J802j4251m409J941L279
9446D5907k063K09k854M322Q065K065k328l953k32O793J1970K310j693R58o376
9431F3100j647j748m513r093p243k665J3414J0238l647p269J597J110k258j359
9417D8017J406K495M288m530n391l947P146m25%L773K653n049R00L359j92q93
9401E3610k724j066l662j956p022l599N175N879k27l475qJ688j372J766J784k149
9385D2642K376L41J514m786J547m018j978M088J546k585K597M003O007j891p464
$$ y = [95712, 93970, 99854, 100088, 97389, 97870, 89871, 87960, 91327, 99154, 98665, 94567, 86120, 82505, 76397, 74176, 77129, 76873, 76427, 76805, 78264, 81568, 90089, 92573, 82624, 72917, 68187, 70421, 72014, 66516, 64782, 62917, 60400, 52669, 50879, 55031, 53393, 47659, 48612, 53645, 57545, 59347, 45096, 40687, 42628, 45907, 43844, 44053, 41199, 45521, 53586, 55651, 53323, 49370, 49138, 55931, 67901, 70211, 68518, 69476, 63100, 61453, 59705, 55192, 46099, 38856, 36191, 49605, 59843, 56196, 48927, 50524, 51634, 49376, 48017, 49423, 51918, 56206, 51676, 46285, 42338, 49484, 49059, 49059, 52832, 55485, 50436, 51336, 54695, 54503, 53610, 50886, 49820, 46158, 44202, 37180, 33581, 38756, 44635, 44408, 40933, 40925, 42613, 41241, 43007, 44791, 42642, 45018, 45359, 46873, 42087, 43634, 39616, 37638, 41726, 43272, 40687, 43284, 47287, 53294, 51403, 43939]
9370D3939k988M528J926m457m122J295M432J344P17n71P09k285R9M218n298k571
9354D0915j298R70j218n771J628K411m572L59N211L681o79p777K145N824Q93J855
9338D4577J375J814m338j041j394J897O949k621q309O33L818N846L060j312k82
9323E0672j99M86L056K474m125m144J973J373j216o79L399O236m445l451K427
9308E3837q65L078K978N55O493l60K908L445k607j563m028n574l035J717M760
9293F1739J093n425n689K46n043K326R45K522O357Q95j992l695j983j972n865
9278D4459K370m494m268J044K257M8k327L5r88o34J83L357K861l365L19j776m79
9261C8602M258O888J327k42n34j638m041l215N388L108l7M219K958m075m723Q801
$$ y = [43939, 40951, 45479, 47405, 42948, 38826, 40121, 44553, 45897, 46614, 46043, 46752, 44467, 44566, 48784, 43486, 40915, 39617, 40587, 39369, 33598, 35226, 37637, 33065, 33424, 38635, 42316, 41637, 33860, 36005, 41829, 42722, 44577, 45952, 47766, 43428, 42387, 40993, 42890, 49839, 47218, 38909, 39542, 43360, 49206, 52266, 50954, 50672, 50473, 50959, 54015, 56489, 52364, 48220, 50193, 51566, 50350, 49671, 53070, 59306, 54861, 51410, 53837, 52972, 56050, 59028, 59583, 66076, 65716, 68624, 72069, 69462, 67899, 63871, 58297, 55262, 56979, 61739, 62832, 57407, 51718, 51964, 46921, 49247, 50192, 52714, 59071, 59966, 57974, 54279, 52296, 50324, 44459, 46829, 42335, 38067, 39111, 41368, 41416, 39089, 39124, 38136, 37502, 37685, 41042, 43903, 40538, 40857, 39081, 38602, 42860, 49748, 51075, 50833, 50299, 48661, 44620, 41405, 46793, 49901, 49864, 54083, 57041, 52966, 48243, 57044]
9245E7044J306o908K636Q430O759r182j449L779k851m832L274m804m358k826M041
9230E0059K764l319j965J796J893l028n936N76M152j791q375l521R93O468m250
9215C6516R74M808K479j99J736J065J502L87K808m739q56K282L336q50l255o689
9199D1305j792j077j203m000M508J3941M814r544k885k111l572K331N406N81M098
9184E0800N217l872j861o200l169R97L72M996N513J619n994l504l822r88O198
9169D6302l027P21J2278O835M998k148m480o706k698j141n518L20m677M904Q308
9154E4271N060l34r195k88J335P096M450j347k086L2k6N515K526q539m726N400
9138E9144M399l81n393j310k711n10m148j804O632k709M25p281k49K101N373k824
$$ y = [57044, 58350, 51442, 54078, 62508, 69267, 60085, 58636, 62415, 59564, 54732, 58006, 53202, 48844, 46018, 50059, 52823, 49504, 47539, 49335, 51228, 48200, 42264, 42840, 46992, 45201, 36826, 33305, 34298, 40766, 36516, 37490, 42298, 44777, 44578, 46314, 47379, 48881, 49268, 52076, 47337, 46481, 48763, 52099, 51249, 47994, 41305, 39513, 38436, 37233, 33233, 37741, 51682, 56496, 46952, 44067, 41956, 38384, 40715, 46121, 46702, 50800, 56017, 52145, 50284, 44084, 40915, 41912, 42284, 47280, 52793, 54412, 48418, 44914, 41092, 40104, 46302, 43275, 43996, 56274, 63109, 68107, 65959, 61479, 54773, 52075, 50934, 45416, 45736, 41059, 45963, 54271, 59331, 58997, 49802, 49514, 50849, 57945, 62395, 61048, 58962, 58994, 58968, 64483, 67009, 58470, 53744, 59144, 63543, 63162, 57769, 56459, 53748, 53238, 49090, 47286, 53918, 51209, 51634, 44353, 44104, 46205, 51578, 48754]
9122D8754o239L077K423l290M10l660o356n5K258P285P321k652M19j34K78K052
9106E1891Q45N110K955J379P148J3630Q844K944j012n872n816l881m418n007o782
9091F1958n791m242O752J0661K859k636n709J256L160J28Q91J443K070K375M298
9076G9473m257N091P962Q678L824p97r28n952n007M451L984m80J456j712j976
9061I3810o963o494j010q50R291R149K210J1912J1355J8643P004K466J0224J4298
9047A75045J8267J3235K4545K9280K9674L7183M3767N8878P5635J00016J28097
9036G33622J40621J45405J36688J10712P2327K1050k8793p3289j03663j29126
9026A025554j27778j22944j05815q6853o2083n0211m2624k8775k5207k7672k9559
$$ y = [48754, 42515, 45592, 48015, 44725, 45135, 41475, 35119, 35064, 37322, 44607, 51928, 49276, 49695, 49561, 49839, 51891, 52736, 57846, 60801, 62180, 69328, 82958, 91802, 94746, 93734, 87862, 82046, 78165, 73747, 68740, 61958, 56167, 51925, 58677, 69338, 72197, 69561, 63852, 65108, 68268, 68396, 69287, 70730, 72800, 75175, 79473, 75216, 80307, 88269, 96947, 100771, 99974, 99046, 93094, 88087, 92538, 96522, 96042, 97498, 95786, 93810, 86847, 80353, 79343, 78493, 87784, 96933, 99143, 111055, 122410, 141053, 148057, 150523, 160747, 175045, 193312, 206547, 231092, 260372, 290046, 327229, 370996, 429874, 505509, 605525, 733622, 874243, 1019648, 1156336, 1267048, 1339375, 1360425, 1331632, 1258343, 1154680, 1025554, 897776, 774832, 669017, 582164, 520081, 469870, 427246, 398471, 373264, 345592, 316033]
9015C16033j4781o380j3218j5062n519j612r849K104n996j3997m800K647l783
9002B25787M536j580j0784r882n001o130q172j0177q511o409J861Q768J4985R574
8988A98865N789K82m727m62m317K144m089l658M587q687p55p812j4476j0758K733
8973A54659N083K986k062r169o086l897p896r393q278N912M720L052p097N337
8959A27871o17n040O375N61n759m590m097o586q84L456M367O305Q014N825q68
8944A34333L059O984M993j39n538j269j740n834m613K84L013J696o3n515O5l122
8928A26594m125k12O713P356P09l423j688l62Q29n351l28n273l00J649K079N110
8912A29977M420R316O978M641K62K719p51J4750J0848L389J6205K6820K0516K3566
$$ y = [316033, 301252, 294872, 281654, 266592, 261073, 259461, 249612, 251716, 245720, 231723, 226923, 229570, 225787, 230323, 228743, 217959, 208077, 203076, 196946, 188774, 178597, 170086, 163677, 165538, 174306, 189291, 198865, 204654, 204936, 200209, 199747, 195430, 197574, 193485, 189827, 194414, 185727, 184972, 177160, 162684, 151926, 154659, 159742, 162728, 160666, 151497, 145411, 141514, 133618, 124225, 115947, 121859, 126579, 129631, 122534, 127871, 127254, 122214, 128589, 129150, 123391, 118801, 114704, 108118, 107234, 110690, 115057, 121362, 129376, 135201, 134333, 137392, 144376, 149369, 149230, 143692, 142423, 140683, 134849, 130236, 130520, 133533, 135229, 135166, 129651, 129716, 126594, 122469, 122257, 128970, 136326, 137035, 133612, 131924, 131562, 132391, 127040, 126712, 121439, 121139, 122788, 124867, 129977, 134397, 143713, 150691, 155332, 155594, 158313, 157562, 172312, 183160, 186549, 202754, 229574, 250090, 273656]
8898B73656K7747K9008L0554J9687K748o076K183Q543n027j0581j0620j5317j2162
8885C34343J355p356k6037k6949j0483j0730j717p450j1356k692j1240o547j1457
8872B01684o306L066K121k676k074n151m565j931K415j59n15J1269Q985R109J0843
8857B26115P619J325O875J456P587J2681J0128P114P416O533J2385R388J4571
8844C31193J4353J2508k406k4084k3662k2638j5363j7490j7357k0395k0674q836
8832A85149j009O309J1679Q974J0113m19j2756l0544k6578j131L2825L4018J0744
8819B27374M746M462r94l637K619M402M729J951L613Q681J267M435K950m403j857
8804B60338M708P229O6N005J6663Q354O383J0075J0669K0173L5814K5049R118
$$ y = [273656, 301403, 330411, 360965, 380652, 383400, 377324, 379507, 388050, 383023, 372442, 361822, 346505, 334343, 335698, 328342, 302305, 275356, 264873, 254143, 252426, 244976, 233620, 230928, 219688, 213141, 201684, 195378, 198444, 200565, 197889, 195815, 190664, 186099, 184168, 186583, 186424, 185909, 197178, 206163, 215272, 226115, 233734, 235059, 241934, 243390, 250977, 263658, 273786, 280900, 288316, 294849, 307234, 316622, 331193, 345546, 358054, 355648, 331564, 307902, 285264, 269901, 252411, 235054, 214659, 193985, 185149, 184140, 190449, 202128, 211102, 221215, 220796, 208040, 177496, 150918, 149787, 182612, 216630, 227374, 232120, 236582, 235588, 231951, 234570, 238972, 243701, 245652, 249265, 257946, 259213, 263648, 266598, 262195, 260338, 265046, 272275, 272341, 277346, 294009, 302363, 308746, 318821, 329490, 349663, 385477, 410526, 419644]
8791D19644J4443K1350K5978K3546J0443K786p328j2600q875J712R619K3987L0552
8778E55257L2772K9130L7853N3539N7659N9915O4602P2550Q0938Q8613J17718
8767A250546J41093J32024J08413Q5724N3061L4200L3121J0120p1909j24567r3975
8756A557851p5210q8654j01922j09865r4299m5446k954J796r737q911n413J763
8744A018999Q386J2702J6242Q104J2828P636l85n406r305r659p484O032Q597N896
8730A073183M604M260J178j2913j7356j5254j0703j2390p99N593J0048Q330L107
8717A040888L075O604m176j1372m743N291o702j2962r60J3643P609K1738K1396
8704A079329K9758K8678K7119K8135K8332K1032J4446j615l638j55M423K1399
$$ y = [419644, 434087, 455437, 481415, 504961, 515404, 518190, 510862, 498262, 489387, 491099, 500718, 524705, 555257, 588029, 617159, 655012, 708551, 766210, 826125, 890727, 963277, 1044215, 1132828, 1250546, 1391639, 1523663, 1632076, 1717800, 1770861, 1805061, 1838182, 1848302, 1776393, 1651826, 1557851, 1482641, 1393987, 1292065, 1182200, 1087901, 1042455, 1039501, 1041297, 1031560, 1022649, 1017236, 1018999, 1027385, 1040087, 1056329, 1064433, 1077261, 1084897, 1084512, 1079106, 1069801, 1060142, 1052658, 1058690, 1067287, 1073183, 1077787, 1082047, 1083225, 1070312, 1052956, 1037702, 1026999, 1014609, 1013810, 1019403, 1029451, 1037781, 1040888, 1043963, 1050567, 1046391, 1035019, 1030276, 1035567, 1028865, 1015903, 1014943, 1028586, 1036195, 1057933, 1079329, 1109087, 1137765, 1164884, 1193019, 1221351, 1242383, 1256829, 1255214, 1251576, 1251421, 1255844, 1277243]
8692A277243M7183O6067P1529O4592M3845M2395M2279K9033K1773K9508L5593
8681A771040M1095N9599O7496Q1142R5308J14586J17253J17861J23439J29726
8671B718545J30888J35302J58948J75944J97820K18435K49770K64784K78104K99970
8661D828510L47845M13478M56014M92838N44883O26428P37237Q87781J096094
8652A0431108J379885J718671K081413K475397K866596L295062L757434M259206
8644C2264772N067025O574733R125962J3327804J9974060K9926419M3171901N5336388
8636B14769064N5257580L9458206J9125561r389651m6065510o0940129n1025635
8629A61189486l5677024k3803032j5991439j1028120p936670o019277m773303
$$ y = [1277243, 1324426, 1390493, 1462022, 1526614, 1570459, 1612854, 1655133, 1684166, 1705939, 1735447, 1771040, 1812135, 1871734, 1939230, 2020372, 2115680, 2230266, 2347519, 2465380, 2588819, 2718545, 2849433, 2984735, 3143683, 3319627, 3517447, 3735882, 3985652, 4250436, 4528540, 4828510, 5176355, 5589833, 6045847, 6538685, 7083568, 7709996, 8447233, 9335014, 10431108, 11810993, 13529664, 15611077, 18086474, 20953070, 24248132, 28005566, 32264772, 37331797, 43906530, 53032492, 66360296, 86334356, 116260775, 159432676, 214769064, 270026644, 309484850, 328610411, 319220760, 273155250, 212215121, 161189486, 125512462, 101709430, 85717991, 74689871, 66753201, 60733924, 55960621]
8622E5960621l990942l513798l089455k721372k512097k394735k206171j996578
8614C3535473j790250j597572j455256j357350j267722j157082j034195r14094
8606B2961952q11494p21511o43043n70366n13265m93683m91763m89781m73009
8597A7754037m24613l29374j74213K9951L44810Q37074J558570K455812L010505
8588B5062559K447600J328867l3552k433019l938049l385722k345246j581064
8580A5122374j101256q06368o19058n20340m66469m23844l93192l67984l28639
8571A0095224l12961k94297k53694k12402j78015j44800j18789r7805o6190k5515
8561H390756K7439l568p7525j31880k74498m18635l93749l10885k53593k19786
$$ y = [55960621, 51969679, 48455881, 45366426, 42645054, 40132957, 37738222, 35532051, 33535473, 31745223, 30147651, 28692395, 27335045, 26067323, 24910241, 23876046, 22961952, 22150458, 21428947, 20785904, 20215538, 19702273, 19208590, 18716827, 18227046, 17754037, 17329424, 17000050, 16825837, 16855788, 17200598, 18037672, 19596242, 22052054, 25062559, 27510159, 28839026, 28805474, 26372455, 22434406, 19048684, 16703438, 15122374, 14021118, 13214750, 12595692, 12075352, 11608883, 11185039, 10791847, 10423863, 10095224, 9782263, 9487966, 9234272, 9021870, 8843855, 8699055, 8580266, 8482461, 8416271, 8390756, 8418195, 8414627, 8337102, 8205222, 7930724, 7512089, 7118340, 6807455, 6553862, 6334076]
8551F334076j97777j85578j60602j41726j25829j20740j24286j17212j16474j19213
8541D924639j21241j18451j14266r7906j03492r2955q9522q4458q2812p4411o7082
8530C878043o4427o0814n1213m2090l9010m3266m7246m3467l1437k5780j1581
8519C417712R166L8052M1888L7249L8477N6762P9687O6742J6157J9507N5284J2192
8507C888875p5192j37726j23507q0078n2265n8292p8802q2756q0583p4589o4380
8496B980705o3192n7291n4823n4743n3089m8106m8438m5494l9064m5080n6012
8485B415373o6704q1784q5430p6276n3956l3846k9023l2749l4854l4063l2490
8474A854198l9717k2567j8859k8193k9346l2165k8697k3273k3594k2405k8530
$$ y = [6334076, 6136299, 5950721, 5790119, 5648393, 5522564, 5401824, 5277538, 5160326, 5043852, 4924639, 4803398, 4684947, 4570681, 4472775, 4369283, 4276328, 4186806, 4102348, 4019536, 3945125, 3878043, 3813616, 3752802, 3701589, 3659499, 3620489, 3577223, 3529977, 3486510, 3455073, 3429293, 3417712, 3426878, 3464930, 3506818, 3544067, 3582544, 3639306, 3718993, 3785735, 3801892, 3821399, 3876683, 3888875, 3813683, 3675957, 3552450, 3472372, 3420107, 3361815, 3283013, 3200257, 3119674, 3045085, 2980705, 2917513, 2860222, 2805399, 2750656, 2697567, 2649461, 2601023, 2555529, 2516465, 2471385, 2415373, 2348669, 2266885, 2181455, 2105179, 2051223, 2017377, 1988354, 1955605, 1920751, 1886688, 1854198, 1814481, 1791914, 1773055, 1744862, 1715516, 1683351, 1654654, 1631381, 1607787, 1585382, 1556852]
8463A556852k7167k9640k1878k8329l4179l2824k8699l3350k4956k4418k2272
8452A249140k4576j4989j4001j7291m797J1283Q184j9003l8432m5707l0365j2612
8440A046834o235l725q616k4371k5235k9255l1535k9546k9500k4699l4518m7627
8428G51972n0519l4664j7258j6444j2536j0104m959m323l197m354j3326r4J229
8415E81423n80n087l598J371l428l964p703r199k822l130k703o030k139j6040
8401E16371j8507j4311o557P311j445q452m853p274k234J019J931j157j0446j146
8387D50250m422k469n288j1868j1392k2078k2328j4790k7640j9558j4150k3823
8375B70444k5501l0755k0211j23J9829K0340J8748J4379J6428J7880L022P41o22
$$ y = [1556852, 1529685, 1500045, 1478167, 1449838, 1415659, 1382835, 1354136, 1320786, 1295830, 1271412, 1249140, 1224564, 1209575, 1195574, 1178283, 1173486, 1184769, 1192953, 1173950, 1135518, 1089811, 1059446, 1046834, 1040599, 1036874, 1028258, 1003887, 978652, 949397, 917862, 888316, 858816, 834117, 799599, 751972, 701453, 666789, 649531, 633087, 620551, 610447, 605488, 601165, 597968, 593614, 580288, 580194, 581423, 580843, 575756, 572158, 573529, 570101, 566137, 558434, 549235, 546413, 543283, 540580, 534550, 532411, 516371, 497864, 483553, 476996, 484307, 482862, 474410, 469557, 462283, 460049, 461068, 462999, 461842, 451396, 450250, 445828, 443359, 438071, 426203, 414811, 392733, 370405, 355615, 327975, 308417, 294267, 270444, 244943, 214188, 193977, 193854, 213683, 234023, 252771, 267150, 283578, 301458, 304480, 305221, 304599]
8362C04599l901j0547o300J55K434l589j635j162l345p608K991n934j1979j3238
8348B40941j0046j0781o790r641P76L206K703k220l978n828L565Q179m997r033
8334A96056j0784j2393p541r599n622r278L86k866n680j573N644R649J045N438
8320A52882P753p75q399p919n912k772P02O947L720l923l500o06N950m369n904
8305A33875N590n377k758p421n846o895n806m407m570k467r62n868j359L262j158
8290H7833L52P273j507j367l26P660J954m534j836N287J111m478r83k992M9L304
8274I6800p771p038l710l257r289M352n413l35R540j965m842J04m041j172P339
8259F9302P086L377K319J0940M282L675J155l104M330P193P587J0000J2942J5186
$$ y = [304599, 300698, 290151, 283851, 284006, 286440, 282851, 281216, 280054, 276709, 269101, 272092, 266158, 254179, 240941, 230895, 220114, 213324, 203683, 204459, 207665, 210368, 208148, 204170, 198342, 201907, 210086, 205089, 196056, 185272, 172879, 165338, 155739, 150117, 140839, 141225, 138359, 132679, 131106, 136750, 146399, 147444, 152882, 160635, 159860, 151461, 143542, 137630, 134858, 135560, 142507, 146227, 142304, 138804, 138198, 144148, 139779, 133875, 139465, 134088, 131330, 123909, 118063, 111168, 105362, 100955, 96385, 93918, 92956, 87088, 85729, 88991, 87833, 88185, 95458, 93951, 92584, 92258, 99918, 101872, 97338, 95502, 100789, 101900, 97422, 96439, 93447, 93496, 96800, 89029, 81991, 78281, 75024, 65735, 70087, 64674, 64339, 73879, 71914, 67072, 67176, 63135, 61963, 69302, 76388, 79765, 82084, 93024, 97306, 100981, 102136, 99032, 103362, 110555, 118142, 128142, 141084, 156270]
8245A56270R349J5657L0489K8075M3786O8271Q8225J06904J15920J29574J38423
8234I30943J36304J16554Q0948K1559l6516p8416j13396j30199j28283j19786
8224F79712j05922q1165n6196m0396l8052l1007k6537k5051j8357j6835j6283
8213B23911j1521r838j324J229r244j9470j3283m415n953j4264p510l741l346
8200A21231m307n817J809m021j908q170k734l93J012j130J493M719M709Q812J0529
8185A25834M175k099n199j818Q40l265N762r694j4860p569o665j5465j4080o346
8171D9551j1016j1047m115N544P987P770O583P054N509N998K454m000q76M201
8157G1597j156r1J014l48n253j0290k332M253K3J316k180o23K692M813k790o499
$$ y = [156270, 165619, 181276, 211765, 239840, 283626, 351897, 440122, 547026, 662946, 792520, 930943, 1067247, 1183801, 1264749, 1286308, 1249792, 1171376, 1057980, 927781, 799498, 679712, 573790, 492625, 436429, 396033, 357981, 326974, 300437, 275386, 257029, 240194, 223911, 212390, 202552, 201228, 202457, 193213, 173743, 160460, 156045, 150092, 135828, 128318, 124577, 121231, 116924, 111107, 112916, 108895, 106987, 98817, 96083, 95690, 96702, 95572, 97065, 101784, 106493, 115305, 125834, 130009, 127910, 122711, 120893, 121733, 118468, 124230, 114536, 99676, 92107, 85442, 69977, 55897, 49551, 38535, 27488, 23373, 28917, 36904, 44674, 51257, 58311, 63820, 69818, 72272, 68272, 67396, 71597, 70441, 70350, 71364, 71016, 65763, 55473, 53141, 57394, 57417, 58733, 56553, 55930, 58622, 63435, 60645, 54146]
8141E4146m215r940M41K922n559n664j875j726l562K798l362O40k125M522K716
8126C0157n892p887p45J0301M836n379j470L010J447J556n42m853j139k079j801
8111A9520j522L037J1811J820j889q194m640P720M153l163l690M890p932p176
8097A4745k329O52L618L955J796n05J026l251q19J046k157P09L129N455J924n485
8081B3509j0329m382k076M098J933n63K679N28m96m48r99j11Kk241l116n561M545
8064F972P264Q543K844o867l000R33j780j279l026k686m731L986N894J398J608
8049A6073N606k471p225o055k320R46M181P268N700K480m132m717j988K09N437
8034A8992J0655r83q146k503P40r2K629l713m44O97L243J889k543J315K031j969
$$ y = [54146, 49931, 39991, 40432, 43354, 37795, 32131, 30256, 28530, 24968, 27766, 24404, 25044, 22919, 27441, 30157, 24265, 16378, 15633, 25934, 30770, 25391, 23921, 26931, 28378, 29934, 29392, 24539, 23400, 21321, 19520, 17998, 21035, 32846, 34666, 32777, 24583, 19943, 27663, 31816, 28653, 24963, 29853, 21921, 14745, 12416, 13068, 16686, 20641, 22437, 21932, 22958, 19707, 18888, 19934, 17777, 18486, 21615, 27070, 28994, 23509, 13180, 8798, 6722, 10820, 12753, 12190, 14869, 15397, 14901, 14453, 13454, 13343, 13345, 11104, 7988, 2427, 6972, 14236, 22779, 25623, 18756, 15756, 16689, 14909, 13630, 10604, 7918, 3187, 7173, 13067, 14465, 16073, 21679, 19208, 11983, 5928, 3608, 4554, 8735, 16003, 21703, 24183, 20051, 15334, 13346, 13555, 18992, 29647, 28664, 20518, 18015, 18755, 18663, 21292, 17579, 17135, 17832, 21075, 22964, 20421, 21736, 23767, 21798]
8018B1798K524l795Q72k73M36j507L41k985O060k079p819l567j493Q488N517M369
8002B6887O839j83P40P835O287O955J8114Q144R647P835j72k1183k0027l891n2
7987E3775r72n76N19K499P18m73J085L528j190r068m272k435m880p878m237m877
7971B1266k304o22m046j823J597l805M128J84L507r3m545J1748P873J399J572
7956C6036q72M556L249R536O916j43L004N934K385r54M023k389q530o805o824
7941D9122J734L755J285M5o251j1124q593n778j126P59N365K751l170j2172k572
7926A4030j873n921P466M194K600L897m671q132O068K148N43L96p96p95N236L714
7910B8104R7P40N937M725K12R31o55l969n426l279m936m435m977k317k323p205
$$ y = [21798, 24322, 20527, 21399, 21126, 21562, 20055, 20396, 17411, 23471, 21392, 13573, 10006, 8513, 17001, 22518, 26887, 33726, 33543, 34283, 42118, 48405, 55360, 73474, 81618, 91265, 99100, 98928, 77745, 57718, 53827, 53775, 52803, 52227, 52746, 55245, 55963, 55490, 56575, 60103, 58913, 49845, 45573, 43138, 38258, 30380, 26143, 21266, 18962, 18340, 14294, 12471, 14068, 10263, 14391, 14575, 18082, 17989, 13444, 25192, 33065, 34464, 36036, 35164, 39720, 42969, 52505, 59421, 59278, 62282, 68216, 70601, 69647, 73670, 71281, 62751, 55946, 49122, 50856, 54611, 55896, 55941, 49690, 38566, 29973, 24195, 23069, 23828, 29193, 31944, 28774, 16602, 14030, 12157, 6236, 13702, 17896, 20496, 24393, 19722, 11590, 17658, 19806, 20349, 20745, 19949, 19154, 24390, 28104, 28201, 28941, 34878, 39603, 39815, 40746, 40091, 36122, 30696, 27417, 22481, 18046, 13069, 10752, 8429, 1224]
7894A224j0249J773P013M84l960o79N989K199l481J962o081J135p99L406P546
7879G482J85k795m044R097m360q788J70k960m452m574M26N76L012M476M419J341
7863g89l145l466m688n34K164N050L576Q39r50N806N256l023p057Q65p690l412
7847a1198M033k494J382N340l327k087K762Q197L144m200m839o569lj277K915
7832h221K285j833P032k109M047n98k440k190l78J867M710k587m340l870n187
7817a3812j927M008O404R016k649o506l138J644k312o600R65L887j612l892M718
7802a1806M618l291L270O93M013m116p865P48K540O323K035p40l688L174j224
7787e316K266l972n191L076j680r09P8k23K969L723K039q194J290M234K699J106
$$ y = [1224, -9025, -7252, -239, 245, -3715, -4394, 1595, 3794, 313, 2275, -3806, -2671, -3470, -64, 7482, 7667, 4872, 828, 9925, 5565, -3223, -3053, -6013, -10465, -15039, -14613, -14037, -11025, -6549, -2130, -789, -3934, -7400, -12088, -12622, -10458, -5408, -1832, -993, -1943, 3863, 9119, 6096, -961, -96, -7786, -11198, -7165, -9659, -8277, -2937, -6264, -8351, -5589, 2608, 5752, 1552, -3287, -9856, -9859, -11136, -8221, -5936, -7769, -737, -2846, 1201, 603, -1837, -4027, -4405, -2538, 2172, -415, -4755, -8625, -13812, -15739, -11731, -5327, 3689, 1040, -5466, -8604, -6960, -9272, -15872, -14907, -11020, -12632, -16524, -11806, -7188, -10479, -7209, -6516, -2503, -6619, -14484, -13736, -11196, -4873, -2838, -3578, -7266, -4092, -5316, -3050, -7022, -12213, -9137, -10817, -11726, -11648, -11871, -8902, -5179, -3140, -11334, -10044, -5810, -3111, -2005]
7771b005L93n97n39n860k665j255L609l046m365n187l920O092K685O097O774J773
7755b016o58L985J869p006j90J055n014n679L80O600J1054r00j64k848l260m81
7739c273j065K510K388j23p817m279j8R86k662k491o7M954J557K011p742l394
7723a8525P172k914k226L6K274J23J914j737q87K382P842K173j0148l230J544
7708a4207j95l44J32M397L323L693k114l791l584k679K062l340J588n23L705K684
7692i193M121J282l650K034k632m927J179M023L207P556N977k408m300m674K802
7677C97P94j621o089K513J300J301P50l680r064L609M08j728K595j653n83R81
7661i770J338K127j327m918M216k705N082P169r55m097k256k992l41m820k906
$$ y = [-2005, -1612, -2209, -2748, -8608, -11273, -12528, -8919, -11965, -16330, -21517, -25437, -19345, -16660, -10563, -3789, -2016, -2674, 1311, 3180, -3826, -4016, -2961, -7975, -13654, -13274, -6674, 4380, 3480, 3316, 468, -2792, -3273, -4338, -1828, 560, 437, -7380, -11659, -11677, -10691, -13353, -15844, -15911, -10957, -9400, -7389, -15131, -18525, -11353, -14267, -16493, -16457, -14183, -14060, -12146, -13883, -14770, -12388, -4546, -2373, -12521, -15751, -14207, -14402, -14746, -14614, -10217, -6894, -3201, -5315, -9106, -12690, -15369, -13307, -16647, -15059, -15582, -11877, -9193, -5072, -3790, -7440, -5406, -8038, -12965, -11786, -7763, -4556, 3000, 8977, 6569, 2269, -2405, 397, 1191, -430, -6519, -4006, -2706, -1405, -655, -4335, -13399, -9790, -9382, -11110, -8515, -10168, -10751, -9770, -8432, -6305, -7632, -12550, -8334, -11039, -5957, 1212, 257, -3840, -6096, -9088, -9429, -14249, -17155]
7646a7155N670P340l211p892N95K167l488K865J0376O641P83p546p772J305l627
7631a2949j156J350k082l142l447M584K181k123m218M009M779j704j433L173J867
7616a0311M999M634q649j0790j78O923L737M866M264k458M38m343L511K179n590
7601f768l821k151o906P850J0297J153r035k333P670l3K356N892M240Q98m569
7586D740q26K2K692q011N015j918N0m229M007Q65Q254m409q267k094m225o1k054
7569a0449L282K425R46l332J675J420k80L239M438P541n50m704k08n208n904N815
7553A46O33o012J257J572K337j095L294L578p17n384j2423j149Q1L660O088k651
7537f785k469K825P22J116k098p05n846k778L944L512L304J843n580n644j930
$$ y = [-17155, -11485, -4145, -7356, -15248, -14653, -12486, -15974, -13109, -2733, 3908, 4691, -2855, -10627, -9322, -12949, -14105, -12755, -14837, -17979, -21426, -16842, -14661, -16784, -21002, -16993, -12214, -13918, -15351, -12178, -10311, -5312, -678, -9327, -20117, -20295, -13372, -9635, -4769, -505, -2963, -2525, -6868, -3357, -1178, -6768, -10589, -12740, -19646, -11796, -1499, -346, -9381, -11714, -4044, -4077, -1721, 4171, 8411, 9309, 4740, 3914, 3936, 6628, -1383, 3632, 1714, 1764, -2465, 1542, 2407, 10661, 6252, -2015, -4109, -8334, -8395, -10449, -7167, -4742, -3796, -7128, -5453, -4033, -4313, -1074, 3364, 10905, 10355, 5651, 5443, 235, -5669, 146, 779, -5233, -3976, -2404, -67, -1162, 2132, 5710, 4993, -391, -12814, -13963, -13882, -10222, -4134, -6785, -9254, -6429, -5707, -4591, -6689, -7394, -13240, -16018, -12074, -8562, -5258, -3415, -8995, -14639, -16569]
7522a6569M888M040J772j025k21m01m477O54Q150J080p707o409Q575K638K095
7507b917K020m882j712m19l664L49Q322k150m49L616j616r05O351m583n135n603
7491a3377K250q177j311M223k87l066N36O106k010l74O404N543M002q567o322
7476a4427J35J464N477K773L270M935L721k43M377K633p705m500R87L056j189
7461D764p799n432k800k919j959K381J905M046r98L708K751J507Q86l903P66L668
7445E72P4k658j710L294M480p413n11J525k369p469j288j962n477N760J2011M890
7429A749j0392r782L772J0799J1426J213q410j692j602l182J189k691n690J76
7415a3117K948j654Q99K466M245J030l63J521j159k294l603p82K930O05m541l715
$$ y = [-16569, -11681, -7641, -5869, -6894, -7115, -7516, -11993, -11339, -3189, -2109, -9816, -16225, -7650, -5012, -2917, -897, -5779, -7491, -7910, -11574, -11225, -2903, -5053, -5502, -1886, -3502, -4407, 1944, -2639, -7774, -13377, -11127, -19304, -20615, -16392, -16679, -19745, -19209, -13103, -15113, -15487, -9083, -3540, 462, -8105, -14427, -14292, -12828, -7351, -4578, -1308, 3627, 7348, 7105, 11482, 14115, 6410, 1910, 2897, 5953, 4764, -3035, -8467, -11267, -14186, -16145, -13764, -11859, -7813, -8811, -5103, -2352, -845, 41, -3862, -3096, 572, 646, -2012, -3722, -428, 4052, -3361, -3872, -2347, -4716, -12185, -13473, -15435, -20912, -15152, -3141, 1749, -8643, -18425, -14653, -3854, 7572, 8785, 375, -1317, -2919, -6101, -4912, -7603, -13293, -13117, -10169, -11823, -10924, -8458, -4213, -3183, -3546, -2025, -3184, -5478, -9081, -9863, -6933, -6328, -10869, -14584]
7399a4584Q565J630K255p647m597p63k74M245O228n217j753J60m31M186N790o8
7383b275r66L551l821m919k355R34J0529N89J161O130l210n589m004K980k500
7368c765q348o077O966L989o614L001Q021R25m324p19M542j090l307J998q042
7353a2844o023L30N681O746M730j431o979K641M63l608m008N129L590K914L272
7338F03o620j0562m49L27N078K914j902n494R79P02m721n81L277K319P76j939
7322a5293k450M671O426K110j0j200n82n878k178l055l964M091J0735K601j299
7307e275k340N561m39o3N249L882l183q851q718O321M086p64K168O059J199k878
7291B014P4k461o270n600r11M67J817k513O242L585l398J07o387q676K267O340
$$ y = [-14584, -6019, -4389, -2134, -9781, -14378, -15141, -15415, -11170, -4942, -10159, -11912, -11752, -12183, -7997, -2207, -2275, -3241, 310, -3511, -8430, -10785, -9851, 678, 1267, 2428, 8558, 5348, -241, -4245, -1265, -3765, -12113, -18190, -11224, -7235, -13849, -10848, -2827, -1902, -6226, -6945, -2403, -3493, -6800, -4802, -12844, -18867, -18537, -12856, -6110, -1380, -2811, -9790, -7149, -6686, -10294, -14302, -9173, -5583, -2669, 603, -6017, -16579, -17028, -16701, -11623, -8709, -10611, -16105, -15126, -14424, -19145, -19726, -16449, -14130, -13354, -15293, -17743, -13072, -6646, -4536, -4546, -5746, -6328, -12206, -14384, -17439, -21403, -17312, -6577, -3976, -5275, -7615, -2054, -2493, -2556, 2693, 6575, 3392, -5459, -14177, -7856, -3770, -4534, -2366, 3693, 4892, 2014, 2088, -373, -6643, -12243, -13154, -12687, -10870, -13383, -7141, -3556, -6954, -6847, -13234, -21910, -19643, -13303]
7275a3303l847l867N955P011K472k812k031m788K417k900p73O943L611m05l495
7260i812O989J1192j45o851o766k597M956l609m236J0548O398N598q356o345K786
7245b50N99P97j411l129m759k009L275K033Q70L293P45m924m484N636M425L103
7229C810m468p026n90j698j719M058N064Q75k901n36M929K201K739J4m823n026
7213e097k365Q487J656l728L9J483l205j1262r709L632P688l475l812j153J067
7198a9754M963P293Q053j729k859J016n92o070L166R704m100j2102k943L862O194
7183e898L666J40R97q191o386N301M280K498Q54M252q39J963p24p748n066M059
7167f842M219J036o681j90j53L428j222J362m510L065J748r08l601K657j886q50
$$ y = [-13303, -17150, -21017, -15062, -8051, -5579, -8391, -10422, -15210, -12793, -15693, -16466, -9523, -5912, -6317, -9812, -2823, 8369, 8224, 1373, -5393, -7990, -3034, -6643, -10879, -331, 6067, 11665, 3309, -3036, -250, 349, 1146, -265, -3394, -8153, -10162, -6887, -4854, -3984, -691, 54, -4870, -9354, -3718, 707, 3810, -658, -7684, -8274, -9972, -11691, -7633, -2569, -1694, -4595, -5131, -202, 1999, 4738, 4752, -71, -5097, -7462, 1025, 2681, -1047, -1008, 475, -2730, -13992, -23701, -20069, -12381, -15856, -19668, -20821, -19754, -14791, -7498, 555, -1174, -4033, -3017, -3609, -9679, -6513, 3191, -909, -13011, -15954, -12092, -5898, -2232, -2092, -1095, -9286, -15672, -10371, -6091, -3593, -2739, 1513, 674, 2637, 1913, -5835, -10901, -6842, -2623, -1587, -8268, -8458, -8611, -5183, -6405, -5043, -9553, -6488, -4740, -5648, -9249, -6592, -8478, -9328]
7151i328Q757N872m642l885j019k296M103M389m590l524l527M759K504L323p487
7136f591j3167n712O659O021J797O13K750J453O75l565n23P807P308M300p381
7121B444K244K934n686p51q55p535k316J256J949J614M72m393k764O93k572k262
7105a5528J556J793k698M676L820L547J177j490J880J0023l233q000K359K610
7091B492L760n010j383l299m995k099k748Q044P028L94m908n224K885o275r78
7076a2316K982N251k234K129N432O137l78j2206j0900N891J0719N527j41K243
7062H136o381o452j0310p821L875R879O146M22L605p006n793k565o886oK048N185
7046a3924K991N093L727J591K184m785j137l945k724Q794N104k562k086j118J612
$$ y = [-9328, -571, 5301, 659, -3226, -4245, -6541, -2438, 1951, -2639, -6163, -9690, -4931, -2427, 896, -6591, -19758, -25470, -18811, -12790, -10993, -10380, -7630, -6177, -5502, -9067, -9590, -1783, 5525, 9825, 2444, 4688, 7622, 1936, 1185, 330, -7205, -9521, -8265, -6316, -4702, -4230, -8623, -11387, -10694, -13266, -15528, -13972, -12179, -14877, -10201, -6381, -2834, -1657, -3147, -1267, 8756, 5523, -2477, -118, 2492, 6252, 1242, -141, -3440, -8435, -10534, -13282, -5238, 1790, 2184, -2724, -7948, -5063, -11338, -12316, -9334, -4083, -6317, -4188, 1244, 7381, 7003, -5203, -16103, -10212, 507, 6034, 5893, 8136, 1755, -4697, -15007, -22828, -18953, -9074, -2928, -2506, 1099, -5907, -11700, -14265, -21151, -21157, -19109, -13924, -10933, -5840, -2113, -522, 1662, -3123, -4260, -8205, -10929, -2135, 2969, 407, -1679, -2797, -1185]
7031a185m870r560N412J564N548n338k516J139K095L758n659P06j070J11N854
7016d011M21o392J786N134O310L090J875p020j0286J610P077j128o861q66k414
7001a1675L890j613K9L126l637l49n153L289P587J1793Q423Q145l798r628m091
6986F338m364p80o335l098j822j028J389k34o769k884Q140M790Q489J88j511j460
6970i51j15j428n171R90N11j3029l552L724R703J094k099o017p97M191L425N222
6954d299j47n289m5K287r65P357J723p89P13m274q583L911P210k178l758N494
6938a632L533l031m543k556J844l397j263p80L360j062k045R298N627l642m855
6923e144m205N774O650Q936P578J093l968o881j1424j560L433J202m817l412K792
$$ y = [-1185, -6055, -15615, -10203, -8639, -3091, -8429, -10945, -9806, -7711, -3953, -9612, -8906, -9976, -9865, -4011, -3590, -9982, -8196, -3062, 3248, 6338, 8213, 1193, -9093, -7483, -406, -1534, -8395, -9261, -11675, -7785, -9398, -9369, -6243, -9880, -10229, -15382, -12093, -4506, 7287, 15710, 23855, 20057, 10429, 6338, 1974, 1194, -5141, -8239, -10061, -11089, -9700, -9934, -16703, -19587, -11447, -6657, 1832, 2020, 509, -951, -1066, -2494, -7665, -6675, -6164, -19193, -22745, -19021, -9318, -8224, -10323, -16340, -17137, -12946, -9521, -4299, -4446, -9735, -9780, -7493, -8458, -1101, 622, -167, 546, -3728, -12311, -8400, -1190, -3368, -7126, -1632, 1901, -1130, -5673, -8229, -6385, -9782, -11045, -11825, -8465, -9527, -11572, -2274, 3353, -289, -5144, -9349, -3575, 3075, 12011, 19589, 20682, 16714, 9833, -1591, -3151, 282, 1484, -3333, -6745, -3953]
6908c953j205m421k648O698R309k97m727J088m561J003M101J21o145m858K856
6893g639R28J055l48k454R97J521j541L254L219m496j000J489J165K269j753J051
6877b283l762o445N804K941l060j773N781n038j432p199K681P861R56m05l70O259
6861E16P523n821o650n445o04m055J0855P789l457o340n540j375L677L123N207
6846e97l847R756P248r061q610L764O352k72m533n97j073P66l235n79O676k307
6830a49n076L77L020J494N903o08m233p620j800o67J485k545j833L454N527l876
6814g147q065o4M592O398k342k89K020j494M806L401j0212O425k770o633k311
6799a3685K619N303L748p430j328L989K678P459J868K661q715n105n795n517K693
$$ y = [-3953, -5158, -9579, -12227, -5529, 3780, 3483, -1244, -156, -4717, -3714, 387, 508, -5637, -10495, -7639, -6711, -5656, -6004, -8458, -7461, -5940, -7481, -4227, -1008, -5504, -6504, -5015, -3850, -1581, -3334, -2283, -6045, -12490, -6686, -3745, -6805, -8578, -2797, -7835, -9267, -16466, -13785, -5924, -4968, -5373, -5743, 516, 8039, 2218, -4432, -9877, -10481, -14536, -3681, 4108, 651, -5689, -11229, -12604, -8927, -5804, -597, -4444, 5312, 12560, 3499, -5111, -1347, 5005, 4733, 200, -397, -1470, -704, -3939, -4518, 2158, -149, -5225, -4848, -1828, -334, 5569, 4961, 728, -6892, -8692, -9359, -7874, -10419, -12252, -8798, -3271, -7147, -15212, -15276, -10684, -4286, -6628, -6917, -4897, -6391, -1585, 1816, -8396, -1971, -4741, -11374, -13685, -11066, -5763, -2015, -9445, -10773, -6784, -4106, 3353, 5221, 7882, -833, -5938, -11733, -17250, -14557]
6784a4557L882M256L987m964j545N681J873m767L696m11l354n365J043q54N217
6769f182L52R10K849k342p551j062k851k829O099N017k27j509Q33R482j914l233
6753d158k980L78L51l176P342P445l24q96P620K637k995l511m531o199L839J47
6737I89n956k804k428j014K174Q600L121j315L432r427r055j074K646J957L758
6722f396M109j628L5R28o630J202O547l980m883m48M493R026N567k093n357m47
6706D5j337k762K047m92n180Q849L021k75J506q06K123k584n939m483l060k891
6690a2218k124m198L88n87n73J50L995l529q273J838P169J0505Q562N647J889
6675H641M44m60J860n656m647j977m900j881K963m768k88Q153J2434n065q259
$$ y = [-14557, -10675, -6419, -2432, -7396, -8941, -3260, -1387, -6154, -2458, -2869, -6223, -11588, -10545, -11399, -6182, -5830, -4920, -2071, -4413, -11964, -13026, -15877, -18706, -12607, -7590, -7817, -9326, -8493, 989, -925, -4158, -7138, -6760, -6409, -9585, -2243, 5202, 4878, 3982, 11602, 14239, 11244, 7733, 3202, -2997, 842, 989, -4967, -7771, -10199, -11213, -9039, -439, 2682, 1367, 4799, -4628, -13683, -14757, -12111, -10154, -6396, -2287, -3915, -3880, -2952, -9582, -8380, -1833, -5813, -10696, -11144, -6651, 2375, 7942, 5849, 492, 45, -1292, -4054, -2007, -2499, -7679, 1170, 4191, 3916, 5422, 4616, 6739, 4155, -1784, -6267, -9327, -12218, -14342, -18540, -18152, -18739, -19312, -19162, -15167, -18696, -26969, -25131, -17962, -7457, 1105, 6752, 8641, 9085, 8625, 10485, 4829, 182, -1795, -6695, -8576, -5613, -10381, -10669, -2516, 9918, 4853, -3406]
6660c406j354J47L762L174L526N578K597o721n698o305k09L302N121k380m366
6645c232k001N642L111J394p361j114M92q845L300j521k324N285N973n8N289N867
6629I897Q118l615q052l156J53j075k360k466k460L155k993k046k454K688o347
6614a3013M618O370m733k179P2j952O175K423k730n531O686N491j68o972j943
6599g386J152J39k454j389R816Q562N270J689J134k415j212o97o129n669k948
6584b537L221M67R65J271o578p38o64p13N790L934l96m668m130J11j369L929N514
6567C409L305m347p095n173K919k149m567o99m780J739Q665P855N47K206j772
6552F3n748j878J286j829M674K605K49k263l172N336l718n79p189J662K095L525
$$ y = [-3406, -4760, -4613, -851, 2323, 5849, 11427, 14024, 7303, 1605, -4700, -4909, -1607, 3514, 1134, -3232, -5233, 409, 3520, 4914, -2447, -3561, -3069, -11914, -8614, -10135, -12459, -7174, -1201, -1259, 4030, 9897, 18015, 14400, 6348, 3192, 3345, 2270, -90, -2556, -5016, -1861, -4854, -6900, -9354, -6666, -13013, -8395, -2025, -6758, -8937, -8865, -10817, -4642, -2219, -4949, -10480, -3794, 1697, 1529, -5443, -7386, -6234, -6095, -8549, -9938, -122, 8440, 13710, 15399, 16533, 14118, 12906, 12209, 6080, 411, -2537, 684, 1151, 2116, 3387, -3191, -3929, -4593, -5306, 484, 4418, 4022, -646, -4776, -4665, -6034, -2105, 3409, 6714, 2367, -4728, -9901, -6982, -9131, -13698, -14397, -19177, -17438, -8773, -918, -371, 1835, 63, -5685, -7563, -6277, -8106, -3432, -827, -578, -2841, -6013, -677, -4395, -4974, -12163, -10501, -8406, -4881]
6536d881p55J162K70P4N09L744k745r76M857l195M426J882J181j170n188k330
6520c135K056L420m286n23L428K072k024k270k044j616k78N22L555k273p732l292
6504a4420Q962Q971j204k676l205Q51o472K633J0038j893m587n248N239M999N707
6489G695L168l588n940l302P445Q139r226n356K940j635k774l285O264J426n237
6474c266O725j004n316R97K786J769k176l86l711j685l936L867R124j251p231
6459d694L71O039m299m993J456p30N72r57M678L908k585k028k557L02k86o588
6443a2391l000M413J1797P99j0608o310J560Q427K357N70K870K246J43n391R06
6428a612O673j571j93k148m79R44j566m85L590O475k628j415j105M657L991p601
$$ y = [-4881, -5636, -4474, -4204, -4130, -3621, 123, -2622, -3598, 1259, -1936, 2490, 4372, 5553, 4383, -805, -3135, -1079, 2341, -1945, -2468, 960, 3032, 1008, -1262, -3306, -4922, -5200, -4678, -1123, -3396, -11128, -14420, -5458, 3513, 2309, -367, -3572, -2721, -9193, -6560, 3478, 1585, -3002, -8250, -3011, 1988, 7695, 10863, 7275, 1335, -1967, 5478, 13617, 4391, -965, 1975, 340, -2434, -5719, 545, 1971, -3266, 3459, 2455, -2861, -1864, 922, 2691, 515, 129, -3582, -5267, -9203, -5336, 3788, 2537, -4694, -4323, 1716, -2583, -7576, -6120, -6850, -6278, -7235, -2557, 1351, -1234, -3262, -5819, -5517, -5803, -12391, -15391, -10978, 819, 1618, -8990, -15300, -13740, -5313, -2956, -2386, 484, 2730, 2873, -2518, -1612, 5061, 3490, 3297, 1149, 670, 1614, 48, -437, 3153, 9628, 7000, 5585, 4480, 9137, 13128, 5527]
6412E527m549j026n341k946m156J0268P334J492j501l755k543k185K464p97r804
6397a1518j362R881L34k272j30l654N028M222l05K383q03N101L046k500O22m039
6381D034o306k843Q72K145O133N400k95n605k192J901r977n633M01K974K170k241
6365i062J196M397R035k524k708l53q78o832n306J726j617O877j511m591l24o13
6349a3088K760N51K342N090M736q75m856q67l344K363k296K900k352k695l234
6334a2865k645k50P509j231K055n463q82j830K897K776l650k54M853M490O06j191
6318e075o47L556m224J932J707M780J038q359j441M671M917Q953j036l091l394
6303D287k695n591m828l877L539J320o685l848Q7J3901J0587K833o44l38J795
$$ y = [5527, 978, -48, -5389, -8335, -12491, -2223, 5111, 6603, 5102, 1347, -1196, -3381, -917, -1714, -11518, -12880, -2999, -2665, -4937, -5067, -8721, -3693, 529, 224, 2607, 1804, 6905, 9951, 7451, 8073, 4034, -2272, -5115, -4243, -2098, 4035, 9435, 9140, 3535, 1343, 3244, -6733, -12366, -11965, -8991, -6821, -9062, -7866, -3469, 5566, 3042, 334, -19, -897, -7729, -13035, -11309, -12926, -6049, -7560, -12151, -12475, -13088, -10328, -9777, -7435, -2345, 2391, 1516, -3340, -4207, -7551, -5188, -7484, -4584, -6936, -9631, -12865, -15510, -15760, -8251, -9482, -7427, -12890, -13772, -15602, -12705, -9929, -13579, -13833, -8980, -4490, -3884, -5075, -5722, -2166, -6390, -4458, -2751, 2029, 3067, -5292, -6733, -2062, 2855, 11808, 10772, 7681, 4287, 1592, -3999, -8827, -12704, -9165, -7845, -14530, -18378, -18291, -4390, 6197, 9030, 8386, 8048, 9843]
6288I843k776j742N29m141k580m729L248j199N609L217k079n623n594J722j982
6273h277m20J475L256Q672j337n116j210k730n524N346N468k356K936l336j615
6258d768n526m786N760J2175J642P593j393k693l062L299r31k11k494q144k494
6243f033l095p494N181N655K44n76P280J135K307j631j624O670r27K062n606l503
6227D5K715j737J407k14l387k038L715k795j0495l737N406l863O208J0645K452
6212D327l473m629l898j120J445J822L743J702J073r06o517j162J54L206N356
6197A123Q03k946j346K24L037l506J439r57J936J488l08o2K299p098n970R83m366
6180a3227l780K898J0264J2401p941n073K698M787L71N14l280j642K364J95j807
$$ y = [9843, 7067, 5325, 5854, 1713, -867, -5596, -2348, -3547, 2062, 5279, 3200, -2423, -8017, -6295, -8277, -8697, -7222, -3966, 4706, 3369, -1747, -2957, -5687, -11211, -5865, -397, -2753, 183, -3153, -4768, -10294, -15080, -9320, 2855, 4497, 12090, 10697, 8004, 4942, 8241, 7310, 7099, 4605, -3539, -6033, -9128, -16622, -11441, -5786, -5542, -6118, 1162, 2297, 4604, 2973, 1349, 8019, 7092, 9154, 3548, 45, 2760, 1023, 2430, 2216, -1171, -3209, 506, -2289, -12784, -16521, -11115, -14978, -8770, 1875, 4327, 854, -3775, -7673, -8793, -7348, -5526, -1783, -81, 992, 86, -6431, -7593, -7439, -4233, 1123, 1926, -1020, -2366, -2142, 895, -2611, -1172, -2129, -193, 1295, 987, 925, 3224, -3874, -9844, -8861, -13227, -17007, -14109, -3845, 8556, 615, -4458, -1760, 3027, 3398, 3912, 632, -1010, 1354, 1549, -258]
6165b58J423O591Q63K395K77p629o035J118M367K723l052L560k146p519j068K236
6149b154J985k579K798L628K621k414k284n618J44P117P45N194N955Q9j973r398
6133C856n543j743j572R237L197m640K92k855k305j278l573k148P379R23L960
6118C187l752k719j788l965m85j091J127O191M634n064L130J813L500M831O7n016
6102D600R94L40K660L461L743q829q092m164n512n35J0089M824M342n584q483
6087f146l694J598J719Q054J406o327k600N06n183k251L167J0273k82n828j39
6072e727q62O77K399O22N952K219p071J02R327L075r939o805K407M199m20R66
6056A121l464J220q999k365k284K567J2052R826o582m2k711r211l485N644R676
$$ y = [-258, 1165, 7756, 8619, 11014, 11291, 3662, -2373, -1255, 3112, 5835, 2783, 6343, 4197, -3322, -4390, -2154, -169, -2748, 50, 3678, 6299, 3885, 1601, -4017, -3873, 3244, 3989, 9183, 15138, 15227, 13254, 3856, -1687, -3430, -5002, 4235, 7432, 2792, 3084, 229, -2076, -3354, -6927, -9075, -1696, -773, 3187, -565, -3284, -5072, -9037, -9522, -10613, -9486, -3295, 1339, -3725, -595, 1218, 4718, 9549, 9616, 4600, 5594, 5934, 8594, 12055, 15798, 6969, -1123, -5287, -10799, -11334, -1245, 3579, 7921, 2337, -6146, -9840, -8242, -6523, 1531, 2937, -3390, -5990, -5484, -10667, -12918, -9751, 522, 240, -5588, -5727, -6589, -5912, -3513, -2891, 3061, 5280, -1791, -1689, 7638, 10713, 774, -6031, -3624, 575, 155, 1121, -2343, -1123, -10122, -12487, -14771, -12204, -152, 9674, 3092, 3050, 339, -8872, -12357, -6713, 2963]
6041B963k377k796M476Q01j736k277J09L620m354p76P115j597m641k96l237l561
6025h564j830J003r38m769J807L990K999j881j808O098K306Q06O071j005m130
6010A55K734J905l251l030O910k070o287j069k546k795K445N74K099L950J325
5995A049p38n282j187n222j386J829O342Q115k433n93l650l178j032M663P60n218
5979g161n133n66P294K079J128J835l36J058p998L758N265k545k763k807n630
5964a2522l702K866N883k6N213J234j688k501q78N045J398J272l592K768k600
5949a830p87M159P5j240j613r40J027k836n963k638O612M273K778l454k530L62
5933d545o87Q54o135O75M022M496K974M099L015l04m157K33m787k397M573J811
$$ y = [2963, 586, -2210, 2266, 3067, 1331, -946, -837, 2783, -1571, -2347, 4768, 3171, -1470, -1766, -5003, -8564, -10394, -9391, -10329, -15098, -13291, -9301, -6302, -8183, -9991, -3893, -1587, -781, 5290, 4285, 155, 2889, 4794, 1543, -1487, 5423, 3353, -2934, -4003, -6549, -9344, -6899, -6325, -4226, -276, 1049, 311, -4971, -6158, -11380, -12766, -10937, -4595, 3520, 1087, 494, -3156, -6334, -7366, -2703, -1943, -7161, -12294, -12860, -5566, -3487, -2359, -524, -860, 198, -7800, -4042, 1223, -1322, -4085, -6892, -12522, -16224, -13358, -7475, -7501, -2288, -1054, -2742, -5243, -6121, -1076, 322, 1594, -1998, 770, -1830, -2617, 1542, 1617, 377, -1236, -2176, -1149, -3985, -9948, -12586, -5974, -1701, 1077, -2377, -4907, -4545, -5232, -4378, -10513, -9838, -5816, -1320, 1654, 5753, 8768, 8464, 4307, 4540, -247, -2644, 1929, 3740]
5917C740q734q880P8J644Q029L719M361O641l220p230r261j097P679N293k643
5902A19p95k134M410M246K645n846m232p726j482K947L694L091q423R57O808n674
5886g395k713q168n092o54M619K565N716K670N939M563m41K281n752k93p61J573
5870a343M325p081l369J2098N857n634l354m853l61K068m227M779O76p789j205
5855i413L026K497K602J983L882J295k262j2529m582L876l046J598l379j540Q825
5840g167J1221q72K220p148n429O263j896o62O640p356K590J378R23L796K293
5825F794j947k783M24n268j938J202J368P93j402m362K059n95o89N26n49l434
5809i801L027R77O415k992m984l375l105K067P275m865k227N509P674q51k443
$$ y = [3740, -4994, -13874, -13796, -12152, -4123, -404, 3957, 10598, 7378, 148, -9113, -10210, -2531, 2762, 119, -676, -2810, 1600, 5846, 8491, 2645, -1587, -9313, -10795, -7848, -4154, -1063, -9486, -8529, -1721, -7395, -10108, -18276, -23368, -24022, -19403, -16838, -11122, -8452, -2513, 2050, 1609, 3890, -1862, -2155, -2916, -1343, 2982, -4099, -7468, 4630, 10487, 4853, 1499, -3354, -3715, -1647, -5874, -1095, -419, -8208, -9413, -6387, -3890, -1288, 695, 4577, 5872, 3610, -8919, -13501, -9625, -12671, -11073, -14452, -15992, -7167, 4054, 3182, 5402, -1746, -7175, -912, -2808, -3470, 3170, -4186, -1596, -218, 705, 4501, 6794, 4847, 2064, 2488, -2780, -4718, -3516, -2148, -1355, -2757, -7119, -5060, -5655, -6344, -5818, -6367, -9801, -6774, -5797, 618, -2374, -7358, -10733, -13838, -11771, -4496, -9361, -11588, -6079, 1595, 744, -1699]
5794a699n052m176q231k078N843O324L831j582M955M392l450J456N165l503l000
5779h05l272K635o315m022L405J205N382R011M324k20p638j563M607k750m932
5764i48J046P14p127K533J412J650m048o749M003P435K333K580p063Q38P81k557
5748c167p475J506L027k145j222N788K887Q90l648J928n551k779L231Q22N377
5733e31l825m449q56M710M952O101m622r273p118l163P027P553K331p65p762p12
5717a0402L174M06J91l339N921N381L912k776O110k484o074j063M4K354k494q185
5701i324q339M615K419M600Q397o13P380m39P503J642p983n913l225j555o916
5686g751k099P318Q125M700m340q293K497n418J791N517K990k499J604N231k794
$$ y = [-1699, -6751, -10927, -19158, -21236, -15393, -9069, -5238, -6820, -1865, 2527, -923, 533, 5698, 2195, -805, -4077, -1442, -7757, -11779, -8374, -7169, -1787, 7224, 11548, 11328, 3690, 2127, 6734, 3984, -948, 98, 812, -6315, -3782, -2370, -720, -4768, -11517, -7514, -79, 2254, 4834, -2229, -1391, -610, -3167, -10642, -9136, -6109, -8254, -9476, -3688, -801, 89, -3559, -1631, -7182, -9961, -6730, -5908, -531, -4356, -8805, -9661, -4951, 1, 6102, 1480, -7793, -14911, -18074, -11047, -3494, -1163, -1928, -9690, -10402, -7228, -6822, -6631, -9970, -4049, 1332, 5244, 2468, 8578, 6094, 20, -1043, -999, 1355, -1139, -9324, -17663, -13048, -10629, -6029, 2368, 1755, 9135, 8696, 16199, 17841, 9858, 3945, 720, -835, -7751, -9850, -2532, 5593, 10293, 5953, -2340, 157, -5261, -3470, 2047, 5037, 2538, 4142, 9373, 6579]
5671F579k923Q36l275k269q399o561N417l174M160Q102J0598O4O99L40p333o288
5655c427l269J879J316K901p40k104J0830j598m580o18k113J691p82j273L807
5640A920l805J275K352N194O78l126L208k85o751O305n273o85l853n273M651j208
5624d676M019R747m881n714J446O502k171q464l831j854O449Q554j253m157j570
5609a854M261k63m61O161R328k925l648K554l302m013o398K3O995l78l456k769
5593a45k127l848N61K889o892P42Q058M611R33K508K312j706o680L44P131l260
5577E431p74J359O06N17q065j910N720m439k688k338J071o81r658m734O158P768
5561f657K31o649k599P557l152K491L171k01K258L922j577n145l117Q596L930
$$ y = [6579, 3656, 4492, 1217, -1052, -9451, -16012, -10595, -13769, -9609, -1507, 9091, 9155, 9854, 10194, 2861, -3427, -6696, -4817, -3501, -600, -1340, -3444, 7386, 5788, 1208, 590, -1523, 168, -614, -1887, 1920, -1885, -610, 1742, 6936, 7614, 4488, 7696, 7411, 660, 6965, 1692, 1007, -2846, -8119, -3468, -4676, -657, 9090, 4209, -1505, -59, 6443, 4272, -4192, -8023, -9877, -3428, 5126, 3873, -284, -1854, 2407, 2144, 1683, 7844, 17172, 14247, 10599, 13153, 9851, 5838, -560, -537, 6458, 6080, 2624, -145, -2272, -6120, -5559, -2670, -9562, -8820, -762, 3849, 4782, 7290, 9602, 7896, 1216, 1560, 8691, 5431, 4657, 6016, 6622, 7139, -926, -2836, 2884, -1555, -4243, -6581, -5510, -6191, -15849, -20583, -14425, -6657, -6426, -13075, -15674, -8117, -11269, -8778, -5607, -5808, -3550, 372, -1205, -6350, -9467, -871, 3059]
5546C059l543r333J01L555K109O649K804n160j904L79p71M40m62J851K097N98
5530B469n145L946J647o81m359p44o322k200P737J0686L265J198Q45P6q333o401
5514b316m238K715L631J634k470L517K797j419j031k996K014j4l770j388Q714
5499E380L211O31m078n924m925p33n447k672M167j609m963O020O415J797l321
5484f051o97M527M947m14p366m486P280K442L006k523m735o36n420j374n040q73
5468a7413K391R99K983J220L119P500o336p804L179J277N625O107M793j559l301
5453B780K204o267r89r135K266L866n773m015J1033R806K934l033j829k023m329
5438b504l23M874k287L03J420q37R90M469Q96j430R76j0261j038L101J592p96
$$ y = [3059, -484, -9817, -9716, -6161, -4052, 2597, 5401, 241, -1663, -1284, -2055, -1615, -2077, -226, 1871, 2469, -2676, 1270, 2917, 2236, -2123, -2867, -9189, -11389, -3652, 7034, 10299, 11497, 12342, 12418, 4085, -2316, -6554, -3839, -208, 1426, -1044, 2473, 5270, 3851, 2820, -176, 1838, 1824, -1946, -3334, 5380, 8591, 9222, 5144, -780, -5705, -6438, -11885, -14557, -10390, -11999, -16962, -10942, -4527, -2730, -6051, -6748, -2221, 2726, 2312, -5054, -9540, -2260, 182, 3188, 665, -4070, -4706, -10126, -11500, -16540, -17413, -15022, -14023, -11040, -9820, -6701, 799, -5537, -13341, -10162, -8885, -3260, 2847, 7640, 6081, 2780, 4984, -1283, -2272, -11407, -9141, -5275, -11048, -15063, -4030, 5776, 8710, 5677, 3848, 1825, -2504, -2827, 2047, -240, 63, 1483, 646, 1636, 6105, 7001, 5571, 6547, -3714, -4752, -1651, -59, -855]
5422h55n595q30L426k023r111M957N691P317M719M231o180o882J822K553j420
5407A820r37m727K298m494L320K000K932n58p38m247p462k905J565N024K251k571
5391g429j877m55J152L651O334L291N001k977k923J060l522M473P471q450K42
5376E042J112l141n695l245L980r89k398l966L827M000l41l807L647J409o85K488
5360A238R325l10R02j832r306n084L819M107r05l806l434j493R93J320k236k210
5344h912m039m68J1899N145J936m724k907K501j309p115L46P574N64K99l751j643
5328d604k937J151M315K205K587r2m228n08J169M34N814J406q529m257K986O360
5312C272J727m183j086j831M535k636J44K342j614j667j971n252K878N292N783
$$ y = [-855, -6450, -7280, -3854, -5877, -14988, -10031, -4340, 2977, 7696, 11927, 5747, -1135, 687, 3240, 1820, 883, -3844, -1546, -6040, -2720, -720, 2212, 1654, 916, -3331, -10793, -13698, -12133, -7109, -4858, -7429, -9306, -9761, -8609, -4958, 1376, 4667, 9668, 6691, 3768, 4828, 1306, 5779, 13250, 4800, 5042, 6154, 3013, -2682, -5927, -1947, -2936, -5334, -9300, -5473, -1473, -1814, -5621, -1974, -565, -1250, 1238, 10563, 10253, 11155, 9323, 17, -5067, -1248, 2859, 1954, -1852, -5286, -6779, -5786, -4466, -6702, -8912, -12951, -13419, -1520, 3625, 5561, 837, -2070, 431, -878, -7993, -7647, -73, 491, 790, -2961, -4604, -7541, -6390, -2075, 130, 2717, 2625, -1603, -2111, -942, -508, 5306, 6712, -1817, -6074, -3088, 3272, 4999, 816, -270, -2101, 2434, -202, -58, 2284, 670, -997, -2968, -8220, -5342, -50, 5733]
5297E733k515l26P72R75l032j042N426P409l348l314l282q76K807M008m806k773
5281A816L216L538r42P58L310o765m638n215Q78M390j66O849M477p62l574l526
5265C644J151l618l331M532M022K541j099m396j806R22M524J87Q50q220j0876
5250a0973j926L106M273Q14Q747O64k569m177j493J953K575J583J87l043J772
5235A493M089P42l412k164P65j234k521m504j419L09K077R057N577k678m034n067
5219b924l781L345N146k404L116K879q01l484j933k220J543Q821o97l507k067
5204A032o95Q56k524j282q68J201R951p30p505j274M348M26L397M753j733p38
5188H615k246o44J680O105m320j0737j917k570L533O117j26p678L72L884O315
$$ y = [5733, 3218, 2892, 3664, 4639, 1607, 565, 5991, 13400, 10052, 6738, 3456, 2580, 5387, 9395, 4589, 1816, 5032, 8570, 7628, 8386, 11696, 4931, 293, -4922, -4044, 346, 180, 7029, 11506, 10744, 7170, 3644, 4795, 1177, -2154, 2378, 6400, 8941, 7842, 3446, 1640, 2562, 7086, 7273, 8123, -97, -10973, -12899, -9793, -5520, -4706, 4041, 4705, 2136, -2041, -3534, -1581, 994, 2577, 2764, -279, 1493, 5582, 6324, 2912, 748, 1513, 279, -2242, -6746, -8165, -7856, -5779, 3278, 8855, 6177, 2143, -2924, -6705, -3360, 1786, -618, 2498, 5377, 4576, 1092, -841, -3061, -1518, 7303, 6606, 3099, 1032, 337, 1193, -1331, -2613, -3481, -2280, 7671, 6941, -564, -1838, 2510, 2936, 6333, 11086, 9353, 8615, 6369, 5725, 7405, 13510, 9190, -1547, -3464, -6034, -2501, 3616, 3490, -4188, -3816, 68, 6383]
5173F383J865j0906q479R316N975J390J343m746n177k214l958l483j735M628k948
5158a2746k470M845J1771O915J40q788j878k749P1M959L245o532l237P152m381
5143c683k311j884J937j276n69J1674N703J433l731l850J171K61N294M915p121
5128G963k851J863K816q497j780P239L13j0141M155M637K146L989o19p74m707
5113E752j679j422R346l513q594m673r19n580j67M569J598J066p28j882N670j71
5097a327k639p98M696j449j476K351n07K008K721P815M713k159J447m741j1081
5082d26p738j633M322L158M456J736K193k591l721k78M262R396J967Q59m864o052
5066E046l115l550k77J143K050n95M863K84K391j06l294n126n175m23O163J326
$$ y = [6383, 8248, -2658, -11137, -1821, 4154, 5544, 6887, 2141, -3036, -5250, -9208, -12691, -14426, -9798, -12746, -15216, -10371, 1400, 8315, 8455, -333, -2211, -4960, -4889, 70, 3315, -3217, -6454, 698, -3683, -5994, -7878, -5941, -7217, -7786, 3888, 9591, 11024, 7293, 3443, 4614, 4875, 10169, 15084, 7963, 5112, 6975, 9791, 1294, -486, 6753, 7066, -3075, 1080, 5717, 7863, 11852, 11233, 10459, 5752, 4073, 2651, 11997, 8484, -110, -4783, -5702, -11282, -11449, -6880, -5282, -4216, -4944, -6826, -1156, -1327, -3966, -4764, -68, -1517, -2993, -642, -1149, 859, 3580, 11395, 16108, 13949, 15396, 10655, -426, -8164, -9797, -5475, -2317, 2139, 3875, 6068, 3477, -244, -522, 3740, 13136, 15103, 15962, 11098, 5046, 1931, -1619, -1896, -753, 1297, 702, 5565, 5849, 8240, 8134, 4840, -286, -5461, -5884, 279, 1605]
5050A605O048L914m615q250K005L486j736m282m284j315K629j981k794J493K888
5035e189J318m23o421m567K989n41M803J0527N200N101O248j817p819k656l718
5020C035k926M092O080n804M28o902j578J611p34k182L69J874n401M182K940J048
5004A32n273K554N66K334k641k046J276L797M324N8n396j348M071j275l449m797
4988g113r694N48M501K219N089P085m846L478J1852o404j2392n115l132j70N423
4973h671M385K393Q150L564k304q945J652L037k592j945M852K454j147q370R35
4958b552o98j656J787j096n80Q69j904L677l963l189j645p995k123O295J571Q839
4942d363N527J598L608m885j508m368L326R38J379m20l827n479O605K149J064
$$ y = [1605, 7653, 11567, 6952, -1298, 707, 4193, 2457, -1825, -6109, -7424, -4795, -6776, -9570, -8077, -5189, -3871, -4294, -10715, -15282, -12293, -12834, -8031, 2496, 7696, 12797, 19045, 17228, 9409, 6753, 3035, 109, 4201, 10281, 4477, 4905, -1997, -3575, -1964, -2698, -4880, -4511, -2637, -8038, -3856, -916, 132, -5141, -2587, -2021, 313, -2328, -4374, -3098, 699, 5023, 5081, -315, -1663, 2408, 1133, -2316, -7113, -16807, -16259, -11758, -9539, -4450, 2635, -2211, 1267, 13119, 6715, -5677, -10792, -13924, -14094, -8671, -4286, -1893, 6257, 9821, 7517, -1428, 224, 3261, 669, -1276, 3576, 6030, 4883, -3487, -2552, -3250, -4906, -3119, -4215, -4795, -3926, -5830, -2153, -6116, -9305, -10950, -18945, -21068, -14773, -13202, -4363, 1164, 2762, 6370, 1485, -23, -4391, -1065, -127, 1252, 832, -2995, -8474, -1869, 280, 1344]
4927A344k327k11L309o740j0759o8N014N559J2251J213r987o215m19J670j991
4912h357q57O524j365o234L216k471k10N92M882K22N31J677m414L064L661N302
4896E763J125r283j990J705r00L738l16k614l119l532q46K595P583k70n704P047
4880I82M07l085J468N427p341k923M807n221l447N292K164J021M399j52k67n265
4864a734l908M131J251M776L675P40O311m730q091M687K220K839m137k445L298
4849H883L371k440j504m590L157K269l278o177L47J050M611N358o123j500k720
4834G14O723J3062J0088M535N4j1981j6466J867k058l507o259k038J293j595O57
4819d911N51k890R074O283o629m33n47P46l451j302l735K146P72l676O537M424
$$ y = [1344, -983, -1194, 2115, -4625, -15384, -15452, -10438, -4879, 7372, 8585, -1402, -7617, -8036, -6366, -8357, -9214, -2690, -4055, -10289, -7073, -9544, -9754, -9162, -4280, -4058, -3527, -1850, -6264, -3200, 461, 5763, 6888, -2395, -4385, -2680, -3580, 158, -158, -2772, -5891, -9423, -10269, -7674, -91, -361, -6065, 982, 1389, -1696, -228, 5199, -2142, -5065, -258, -5479, -8926, -3634, -1470, -449, 3950, 3798, 3531, -1734, -5642, -1511, -260, 4516, 8191, 8931, 15242, 10512, 2421, 7108, 9328, 12167, 8030, 5585, 8883, 12254, 9814, 8310, 3720, 6877, 9146, 5868, -309, 38, 1088, 5699, 11057, 4934, 3434, 714, 7437, 20499, 30587, 35122, 35176, 23195, 6729, 8596, 6538, 3031, -3228, -5266, -3973, -5568, -4911, -4360, -7250, 1824, 8107, 1478, 1045, 498, 1244, -2207, -3509, -7244, -5098, -4326, -8002, -1465, 2959]
4803B959m912j564R23N824l28J043j955Q97l781l546P48J901J888J543N643j199
4787F084q851l484n317J49k355m681j600R333J0595Q46q249J571M643K581J662
4772B927j799q502j55q85l711N376L437M454j37R58J505O39J079l066q331l689
4756i900J056M210R147K994o111q135L384N935L974j638n214m036j913J422O058
4741A233k056m847l841p560M658J621L588p24K242R491K83L261K219k367p59n39
4725E903j174m803k197Q832M485o663k13l34M453J174p65j0613n969J914M487
4710a483j785O246m947o397j647k65P907R596m81q482j03L30L849L85m609m72
4694b358R772J609R82k100q586O95L853n673J519n947j960o998K762J1959K701
$$ y = [2959, -1953, -3517, -2594, 3230, 2902, 3945, 1990, 2887, -894, -4440, -3692, -1791, 97, 1640, 7283, 6084, -2767, -6251, -11568, -11419, -13774, -18455, -20055, -10722, -127, 719, -7530, -5959, -1316, 1265, 2927, 1128, -7374, -7529, -8414, -12125, -6749, -3312, 1142, 1005, 1963, 3468, 4107, 5186, 2120, -6211, -9900, -8844, -4634, 4513, 7507, 1396, -6739, -3355, 2580, 6554, 4916, -298, -4334, -6247, -4825, 1233, -823, -5670, -9511, -17071, -12413, -10792, -7204, -7928, -5686, 3805, 4088, 7349, 9568, 7201, 6442, 5903, 4729, -74, -2271, 6561, 11046, 4383, 4170, 3836, 8289, 9463, 8698, -1915, -7884, -5970, -1483, -3268, 2978, -1969, -8366, -10013, -10278, -2371, 7225, 6744, -1738, -1841, -1511, 2338, 2723, -1886, -2358, 7414, 9023, 10005, 7905, -681, 14, 3867, -1806, -287, -6234, -8194, -15192, -12430, -471, 2230]
4679B230L521pk408o27l771l612J345M259Q502j370r994j4j928N080R65M71l192
4662e50j239P286J236l423k413Q41j398J249j535K194K433r024l960L322M360
4647f21L236j093K826k234l439N562j036k401l102k181J229R51M247l768j03L754
4631A827L647m193N678K48K869l234j0435k090P018P063o822n534K573l997l660
4616i042K6Q180K327K719j4j797N981k617j0883m188K058Q32L782K9L047q7k1
4599C32P54L709L172j695J718J756m311n390m061m087O397K997Q507J062n613
4584E247k790j192K712j805n960q211k059J882P056j306P548O181L395q091p919
4569e312L67n47M416N354N310j032q34o19l461n61N176m97l55K012n358m225l25
$$ y = [2230, 5751, 5744, 3336, 2709, -1062, -4674, -3329, 930, 9432, 8062, -1932, -1946, -3874, 1206, 2171, 2642, -550, -1789, 5497, 6733, 3310, 897, 1738, 340, 1589, 54, 2248, 4681, -4343, -8303, -4981, -621, 2615, 1522, 4348, 2114, -1325, 4237, 3201, 800, -2302, -4483, -3254, -2303, 1944, -1824, -1927, 1827, 5474, 1281, 6959, 7207, 10076, 6842, -3593, -5683, 1335, 8398, 1576, -3958, -1385, -5382, -9042, -9016, -836, 1491, 4210, 4196, 2399, 8380, 5763, -5120, -9308, -7250, -6418, -2636, -2607, 440, 353, 332, 1086, 4795, 7967, 6272, 7990, 9746, 5435, 45, -4016, -8103, -1706, 1291, 9798, 10860, 5247, 2457, 1265, 3977, 2172, -3788, -11999, -14058, -12176, -5120, -6426, 1122, 7303, 10698, 2607, -5312, -4945, -5492, -1076, 4278, 9588, 8556, 7722, 7103, 3642, 3081, 8257, 7760, 7405, 9417, 4059, -166, -491]
4552d91Q621k470n96P85o45m181k269L058l492K099L673k956p0L114K203K0k788
4535C615k275k581K454J26n386m974o63N576L750J241j494J940j073k300L5L234
4519A225M450P029M377p742n559J914M110O133q630o060K643l661L543l155k927
4504b310n049J349R374N278l830j522l797n206k029m113K399M892j099M654Q053
4489G044M365k549m207n178l434j681o260m83L536j020k137M963L785M49o407
4474i214L04N659k863l343j116k416K363J0727M768R65J292j742K265O24j99k946
4458E128l638m48j586r040N205L204K410j465n307j962L50O055J446l409O11J225
4442a221P340L984K373o904m281j100o095l263q11j195K006N225O72j122k995
$$ y = [-491, 8130, 5660, 5064, 5849, 5204, 1023, -1246, 1812, -1680, 419, 4092, 1136, 1066, 4180, 6383, 6403, 3615, 1340, -1241, 1213, 1339, -4047, -9021, -9684, -4108, -358, 883, -611, 1329, 256, -2044, -2009, 1225, 5675, 12704, 17081, 9339, 3780, 5694, 9804, 15937, 7307, 1247, 3890, 229, 3772, 617, -2310, -7359, -6010, 3364, 8642, 4812, 3290, -507, -5713, -7742, -11855, -9456, -4564, -5663, -1009, 7044, 11409, 8860, 4653, -525, -3959, -5640, -11900, -12383, -8847, -9867, -12004, -7041, -3256, -2807, -9214, -8910, -3251, -6114, -9457, -10573, -12989, -10626, 101, 4869, 5834, 7126, 5384, 7649, 8273, 8074, 5128, 1490, 1042, -544, -9584, -4379, -1175, 1235, -230, -5537, -7499, -7149, -1094, 352, -3057, -2446, -1221, 6119, 10103, 12476, 5572, 1291, 191, -5904, -9167, -9978, -11173, -9167, -3942, -3270, -4392, -7387]
4427g387O478J0395J902K842m025q263n066J949N373n208n808L939j301k801p611
4412a4592o027K412J165P118K288K681N672K885l856l833M662j361k298j16P67
4397b433o30K423N756m270l446m61j927J412N495J021O017L196j558k978K292
4382I909J018l551J945P83j545m30j923k296n715k642N999l934o565J284N442
4367b221R904O919j0012j882M096j753k630K168L386j0178j319P206k57L863N51
4352G841p372j0172n040M682O798N666K32j981K24j541l716m47J101p78K634Q475
4336F606O938J368n433n449J451Q00m994R317j137K933K680K253k897o348j294
4321F794l782p470j596K053P020K93k613m141L239J940l653l758m58k70j331L572
$$ y = [-7387, -909, 9486, 11388, 14230, 10205, 1942, -3124, -1175, 4198, -1010, -6818, -2879, -4180, -6981, -14592, -20619, -18207, -17042, -9924, -7636, -4955, 717, 3602, -254, -4087, 575, -786, -3084, -3200, -2433, -3063, -640, 5116, 846, -2600, -3061, -4988, -3576, 1919, 2940, 8957, 12153, 10595, 7617, 9909, 10927, 7376, 9321, 10104, 8559, 8129, 6206, 3910, -1805, -4447, 1552, -2382, -8947, -7663, -2221, 7683, 14602, 4590, 2708, 6804, 5051, 2421, 4589, 7975, -2203, -3522, 3684, 3427, 7290, 7841, 469, -9703, -14743, -10061, -3263, 2403, 2635, 654, 878, -663, -4379, -4826, -3725, -4503, -1869, 6606, 13544, 14912, 9479, 4030, 5481, 6281, 1287, 10604, 9467, 12400, 15080, 17333, 14436, 8088, 6794, 3012, -4458, -6054, -4001, 3019, 3312, 699, -3442, -203, 1737, -1916, -5674, -6132, -6402, -7733, -4161]
4305d161J0856J144l940K692L925J165O69J856k97k301o780j773m283n969Q217
4290A020N365k420m377k7o3n256p207J723K993N093n9J991M227k359p562p66R818
4273B134J344j544p957J128m186l847O706O327r9l663P742M826p170k565J146
4258C22o45k730L749J790N29J716L507J258p390m40N579O88q548P56j814m016
4242e689l444M294K187o044J574j374J37J438l73L952Q96M196m162n6M264K698
4226D494m122k421J770K2K997K909M439L286M864p388j3983n698K426J0801M453
4211H849j378k163K43J735M292m915n605L198L568j213R6L564k013j596n669r149
4195h156n973P926N547M916m848m755r08L102J487k013o83K395m104k367N026
$$ y = [-4161, 6695, 7839, 3899, 6591, 10516, 11681, 12350, 14206, 13909, 11608, 4828, 3055, -1228, -7197, 1020, 6385, 3965, -412, -439, -502, -5758, -12965, -11242, -8249, -3156, -3215, -1224, 3003, 644, -6918, -7684, 2134, 3478, 1934, -6023, -4895, -9081, -12928, -6222, 105, 6, -3657, 4085, 8911, 1741, -824, 322, -323, -3053, 696, 2486, 3015, 4731, 8238, 9496, 2106, 1666, 7245, 7933, -615, 141, -1673, -5689, -9133, -4839, -2652, -8696, -7122, -8496, -8359, -6921, -7294, -3342, -2446, 1750, -2412, -2468, 1796, 4494, 372, -2049, -279, -257, 2740, 5649, 10088, 13374, 18238, 10850, -3133, -8831, -6405, 4396, 8849, 7471, 5308, 5551, 7286, 11578, 6663, 1058, 4256, 7824, 6611, 6707, 10271, 8258, 6662, 993, -8156, -14129, -6203, -656, 4260, -588, -5343, -6251, -3149, -1662, -3675, -4358, -1963, -6067, -8434, -3408]
4180c408R025n731j175L90j790n680m107j795K374K149O227Q965j391J608M040
4165I701M87l46o755m542L103J862L30R32n489q07L563p166o833O301P048K828
4149D217M074L266k316q960p894m916L104J957o65J803O156P275k668p279l439
4134f285J777J9j734J130R8J465K44N325Q21M302k849K024r12J970k024n493r415
4117i537n67Q604N193J840j798l300j153j442j373P543M433m062l410K624O214
4102I809k570K826j642q97o44k626m003M917M019j275K367Q167k886k93Q04n382
4086A0691l127K771j808j965q50k486j705K332J5419j407o104l083n575p10k974
4071e81R730J566m735k899j169n312n300M992Q921j97k828k441j704k94L269k408
$$ y = [-3408, 5617, -114, -1289, -899, -2689, -8369, -12476, -14271, -11897, -9748, -3521, 5444, 4053, 5661, 9701, 10188, 9842, 3087, -1455, 1648, 3510, 3840, 4772, -717, -1524, 2039, -5127, -11960, -5659, 1389, 4217, 8291, 11557, 9241, 281, -7613, -12529, -9425, -7468, -8133, -6330, -174, 7101, 4433, -2846, -6285, -4508, -4489, -6223, -5093, -4995, -3530, -3286, 2039, 2860, 7162, 4313, 6337, 5425, 7395, 5371, -122, -9537, -10104, -1500, 3693, 5533, 3735, 435, -718, -2160, -3533, 4010, 8443, 4381, 971, 3595, 9809, 7239, 10065, 8423, 7526, 6882, 4256, 253, 5170, 9189, 7914, 10281, 18448, 15562, 15269, 16073, 10691, 7564, 10335, 8527, 6562, 5712, 3226, 1521, 3853, 19272, 17865, 11761, 8678, 3103, 2393, -581, 9149, 10715, 5980, 3081, 1912, -3400, -8700, -3708, 5213, 5016, 2188, -253, -1957, -2251, 1018, -1390]
4055a390Q4n709n426P11P299M760K357J34j070P455J630l498O35p89p744k913
4039c474p34M566J494q62P129n137j713L782M166K677K38l240j5296r604o86J2076
4023d618J665L350K289m819N52L726M331l134r46P182l95l90r384n168l48L985
4007b122M995m648l677K489K439L349n491K547J348k196J214n40m08R643p46o493
3991A703j847J0285k513j515O694k922m998K252n557O640J0758m22j828p97o161
3976I772n226j594l883L57j386l718N957L185O570j577K316P882j200p753k703
3961F999m857m778l380L372k210k341J011P015j872K690M71r91n775p310K434
3946i522j571N391j551L721O840M80o09l992n127M041P509o797NO396k180j576
$$ y = [-1390, -1306, -7015, -12441, -11730, -4431, 329, 2686, 2820, 1750, 9205, 10835, 7337, 7972, 7183, -561, -3474, -4208, 358, 1852, 990, 8119, 2982, 1269, 5051, 9217, 11894, 12132, 8892, -6404, -16008, -16694, -4618, -2953, 397, 2686, -2133, -1581, 2145, 6476, 3342, 2396, 9578, 9183, 8793, -591, -5759, -6107, -2122, 2873, -1775, -5452, -2963, -524, 2825, -2666, -119, 1229, -967, 247, -293, -701, 8942, 8196, 1703, -144, 10141, 7628, 6113, 12807, 9885, 4887, 7139, 1582, 8222, 18980, 18558, 16730, 15933, 9772, 4546, 2952, -931, -574, -1960, -5678, 279, 3464, 10034, 8457, 10773, 18655, 17455, 9702, 6999, 2142, -2636, -6016, -2644, -4854, -7195, -6184, 831, -1041, 1649, 2120, 1129, -4646, -11956, -9522, -11093, -5702, -7253, -3532, 3308, 3788, 3179, -813, -5940, -1899, 5610, -1187, -1182, 5214, 3034, 1458]
3930A458m422k14O324J0977j354r859k901m26L966O418M244l525j14k881R26L982
3914A2599m11p853m2j642J561p428k312M608O707J285p901k575N586O008o49n355
3898B186m793l159K145J535k520m27J781K104J756J475K260m919m868p320j031
3883a3795P625M194M920L630j382J160l469m072l982j780j71N487J044N80m681
3868d692k922m357M542L172J09l707J625P448k431N509P142k064k406j527J145
3853F586j3195j315M139M831K12k134k98N08o85l503K920M990j35k922l291Q03
3837b489N826l712N511k3O4Q74m016M007j480k705l576L391k939K686l703l034
3821e318K972O576j632j123n915m883J816M916K456L098L053m373j435K019M727
$$ y = [1458, -2964, -3178, 3146, 14123, 12769, 2910, 9, -417, 3549, 9967, 14211, 10686, 10572, 7691, 8617, 12599, 12188, 4335, 4293, 2651, 4212, -3216, -5528, -920, 5787, 7072, -829, -3404, 2182, 8190, 7541, 2186, -2607, -5766, -3621, -2086, -4606, -5033, -3252, -1148, 608, 2083, 4343, -576, -5444, -12764, -13795, -6170, -1976, 2944, 6574, 5192, 6352, 2883, -1189, -5171, -6951, -7122, -1635, -591, -11, -4692, -7614, -11971, -7429, -4257, -4148, -7855, -6230, 1218, -1213, 4296, 11438, 9374, 6968, 5441, 6586, -6609, -7924, -3785, 1046, 1258, -876, -1174, -666, -1351, -4854, -1934, 3056, 2921, -1, -3292, -2489, 3337, -375, 5136, 5113, 5177, 6051, 2035, 6042, 4562, 1857, -1719, 1672, -1267, 1419, -2284, -5318, -2346, 4230, 2598, 1475, -4440, -9323, -7507, -2591, -135, 2963, 6016, 1643, 208, 2227, 6954]
3806F954k274m436n835l640K066N476M859k78l665p685J5M189J0052M437p678
3791B557j0537Q56O615l462l081N616Q440L367m361p143k990Q26M656J8N75R384
3775A1336J794m915K687M012M71K309j981o061k952n385l755O54M512O840J194
3760A0760j117k554J250l164p583M314O043k421m248k877o042l453L514J1552
3746C974K567k771J262m097l544M842m945K08K577l812l058L278K925O704l79
3731E731O382o88r954k555K007O411j338k501j454J205K091P241K003m785p353
3716B443m756K700K502P851j200p568p663K082J958L313J356q30m028K67k384
3701c957n679J2634l46r09J097l76l766N263J286j443p029k068l99J046k295M406
$$ y = [6954, 4680, 244, -5591, -9231, -7165, -1689, 3170, 2892, -773, -8458, -8443, -4254, 5798, 10235, 2557, -7980, -7124, -509, -3971, -7052, -1436, 7004, 10371, 6010, -1133, -4123, -3297, 1359, 1377, 1952, 11336, 13130, 8215, 10902, 14914, 15385, 17694, 15713, 9652, 6700, 1315, -2440, -1786, 2726, 9566, 10760, 9643, 7089, 8339, 5175, -2408, 1906, 7949, 5528, 1280, -1597, -7639, -11092, -7578, 3974, 6541, 3770, 5032, 935, -2609, 2233, -2712, -2504, 73, -3739, -6797, -3519, -594, 6110, 5731, 12113, 11425, 1471, -1084, 923, 7334, 5996, 3495, 2041, 3246, 5337, 12578, 14581, 9796, 2443, -2313, 387, 2889, 10740, 9540, 1972, -5691, -3609, -1651, 1662, 3018, 2188, -1840, -1573, -3957, -9636, 2998, 2652, 1743, 2840, 2464, -1302, 3961, 5247, 3804, -3225, -5293, -5692, -4646, -6941, -2535]
3685b535J955N309M574p911q639M695L835J164m639l142o284k261j34K418N364
3670f231K454K15O11l710L746k991j538Q937N017k350J220j96r503k192M883N565
3654C937q58m516J558J881l659J602J32n83o019q740M533J1276J1242J219p396
3639E609q951n158J146K144p31K605J94j418j287P546N304p613p767K509O290
3624D22o55k252L589j303k035K33Q44K473L310K96m305l234o599K193K126J669
3608c228Q346k91l245K671K58J461N473k183o059q952k629L75O339O051K444l339
3592C492M08l968o546m949J633R692M143k392l44K454J918K229k236l20k300j662
3576A252M143l747k345l483j380N803K262K435m896L056O283j420j195J599o710
$$ y = [-2535, -580, 4729, 9303, 1392, -7247, -2552, 1283, 2447, -2192, -5334, -11618, -13879, -14013, -11595, -6231, -3777, -3562, -2951, -6661, -2915, -5906, -7444, 1493, 6510, 4160, 5380, 5184, -4319, -6511, -1628, 3937, 3079, -1437, 121, 2002, -1657, -55, 77, -506, -6525, -15265, -10732, 544, 11786, 13005, 5609, -3342, -8500, -7354, -5210, -5941, -3336, -3142, -4560, -5847, 1699, 7003, -610, -8377, -5868, 422, -233, -2485, 1104, -199, -2234, -2001, -1157, 1316, 4626, 4922, 617, -2617, -9216, -7023, -4897, -3228, 5118, 4827, 1582, 4253, 4511, 5972, 11445, 9262, 3203, -5749, -8378, -8003, -1664, 4387, 6831, 3492, 3900, -68, -6614, -11563, -9930, -238, 3905, 1513, 1169, 3623, 5541, 7770, 5534, 5214, 2914, 1252, 5395, 1648, -697, -4180, -5560, 243, 2505, 4940, 44, 3100, 9383, 7963, 6768, 8367, 1657]
3561A657k687P922j061l023j314N611j068o596J01J921p113m068Q586r24m069
3546f125K583m98L154N02L586K424J790M122J852m144n09J777K2l42m837P6J824
3529G257M17n251j790J876N149k109l418o15l246P003M298k234m289K534M053
3514I635L16r52j913k997j745m525J292l232l759K732L689p6m497j100J958L498
3498a676l331P95M274N730R08n820k586O911k274j523M20L551l499O87M803J041
3482H411q655P50O998O27o024m329L972O366n850l342K372K459o749J800o287
3467g481l239R058J978r646P31O295q98p58J928l945L829L060l479l087N011J2923
3451A2280K991p254p050p415K594N551k52k911j076m611n177N175l380M704P195
$$ y = [1657, -1030, 6892, 5831, 2808, 1494, 7105, 6037, -559, -458, 1463, -5650, -9718, -1132, -2056, -6125, -3542, -4040, -886, -384, 3202, 5626, 7416, 11538, 13390, 9246, 8737, 10514, 10536, 10194, 5357, 5433, 7257, 7674, 2423, 633, 2509, 7658, 5549, 2131, 1516, -1730, 5273, 9571, 7337, 3048, 5582, 9635, 9951, 8999, 7086, 4089, 2344, -2181, -889, -4121, -7880, -5148, -1459, -1535, -6032, -7132, -5174, -1676, -5007, -4212, 62, 5792, 6700, 880, -1706, 5205, 2931, 1408, 1828, 5379, 1880, 2567, 7370, 8411, -244, 506, 7504, 8131, 2107, -2222, 1750, 8116, 2266, -1076, 1296, 3755, -2994, -1194, -7481, -10720, -1662, 316, -9330, -8599, -2304, -3202, -3960, -2032, -5977, -2148, 912, -2567, -5654, -643, 12280, 15271, 8017, 967, -6448, -3854, 1697, 1445, -1466, -2542, -7153, -12330, -7155, -10535, -5831, 1364]
3436A364k76L323P91k835m647l942K66n74k69n22M055N471N496j031k411j863
3420B396j619o490l76k748M498J904K70L987Q390j732r939L191L68n045p64L688
3404b1M750k441l161j313M96j072M218J004R37K563l651j0121J2032J602R10M06
3388G138j500l200j480P494J776m344l362q63j64k837L458P393J678j512j795
3373G880m065L241M633j0347o462L689l325l206L493P971K99J685K293L136l598
3358G317J183j916o87J918J086M183N282j932o103p136k695m2Q63M726l544k011
3342D92k546l605K310K284m683p668k161q49L073O248M579J062M938J951J727
3327G152l856n393K572N045Q63J952j73l365r91o201l039O83J778N087l51N172
$$ y = [1364, 1088, 4411, 5202, 2367, -2280, -6222, -5956, -6530, -6799, -7321, -3266, 2205, 7701, 6670, 4259, 2396, 777, -5713, -6089, -8837, -4339, -2435, -2165, 1822, 10212, 8480, -1459, 1732, 2100, -2945, -3709, -21, 4729, 2288, -873, -2186, -1690, -2762, 1456, 2460, 3397, 5960, 2309, -7812, 4220, 5822, 6732, 7138, 5638, 2438, 958, 8452, 10228, 5884, 2522, 1659, 1495, -1342, 2116, 9509, 11187, 9675, 7880, 3815, 7056, 11689, 1342, -5120, -1431, -4756, -7962, -4469, 3502, 3801, 5486, 7779, 10915, 7317, 8500, 6584, 5897, 7815, 8901, 13084, 18366, 16434, 10331, 3195, 500, 458, 1321, 6047, 2503, 492, -2054, -5659, -3349, -1065, -5748, -13416, -15577, -16426, -13353, -7105, -2526, -1464, 3474, 5425, 7152, 3296, -2097, 475, 5520, 6383, 8335, 8162, 4797, 3806, -2395, -5434, -4751, -2973, 2114, 1763, 6935]
3311F935J733L899o036K629L754k824m941j0457j2766Q276R875J885j741m506
3297d285J396J729j082J476j341o382N37m534o87P31L840J900j407j88M677l932
3281g552k028L662J2834K795m855k282p598M96J680n49l663K711O998M43N349
3266H441l388l693j182n66k765j322L805J0759P0m237n265l31l585k47L144l721
3250d083l415N339L028m901k46L840O132n2L503J305L042l884l950l222k98N184
3234G322k117o947M106L364J290Q78L416k414l299m645L166K833l614k617j433
3219g11J175L163P092J679m03p096k094j612q066j324J267M33O661M881K52n44
3203D753q45L354m739J186J401o537j06j0090M236K328l549M247N304N968L186
$$ y = [6935, 8668, 12567, 6531, 9160, 12914, 10090, 5149, -5308, -18074, -9798, 77, 1962, 221, -4285, -2889, -1160, -2242, -766, -2107, -8489, -7952, -12486, -13173, -12442, -8602, -6702, -8109, -8297, -3620, -7552, -9580, -5918, 6916, 9711, 4856, 2574, -5024, -4528, -2848, -3397, -7060, -4349, 2649, 3092, 8441, 5053, 1360, 178, -388, -3153, -4475, -670, 10089, 10159, 5922, 657, 326, -3259, -3506, -362, -4083, -7498, -2159, 869, -4032, -4278, -438, 5694, 5642, 9145, 10450, 13492, 9608, 5658, 2436, 2138, 7322, 5205, -1742, 2364, 5728, 7018, 7896, 11312, 8898, 5599, 954, 4120, 6953, 3339, 722, -711, 464, 3627, 10719, 12398, 11995, 4899, 2805, 1193, -6873, -8197, -6930, -6497, 164, 5045, 5297, 4753, 3908, 7262, 2523, 3709, 5110, -1427, -1533, -11623, -7387, -5059, -8608, -4361, 943, 6911, 10097]
3188A0097n347J143n821k854L736M049n61m597j006n244K146M475Q06m971k586
3173f535L686R970J528k385p126J029N445l384N250k564m796k576m087k147L102
3158e590N279k216J659J558N873P405M73k504K518o61k620j505J430m622R29k99
3142G107q253k577J644k107J535n3k510n999k303J567J042M208Q163N851N665
3127A2980m492q103k473k381k454K682p09M26J571K068L078J30m476N041j038
3112A850N385Q06p880l52p4m047j426j212Q652M046q128m676r6l636N497j930
3096g221N170J3393Q390o420o412M992l709o861j099M167R15k713Q53N623L644
3081A2712l724p206p459l42k18l944O298L356n275q28l3J125o582o16k929Q27
$$ y = [10097, 4750, 5893, 72, -2782, 954, 5003, 4442, -155, -1161, -6405, -4259, 216, 1022, -3949, -6535, -2849, 7121, 8649, 6264, -862, 167, 5612, 2228, 7478, 4914, 118, -2458, -6545, -8692, -5590, -311, -2527, -868, 690, 6563, 13968, 14441, 11937, 14455, 13794, 11174, 9669, 11099, 6477, 7406, 7107, -1146, -3723, -2079, -4186, -2651, -2704, -5214, -11213, -13516, -11949, -10907, -6699, 1464, 7315, 12980, 8488, 385, -2088, -4469, -6923, -4241, -4950, -4524, -2953, -885, 2193, 2323, -2153, 2888, 1850, 7235, 8041, 161, -191, -265, -4312, -5738, -6950, 1702, 5748, -2380, -7056, -7152, -10788, -5291, -7221, -2051, 11342, 19732, 13312, 6900, 11892, 8183, 1322, 223, 4390, 5305, 2592, 3445, 9068, 12712, 8988, 1782, -5677, -6019, -6237, -10181, -3883, -527, -5802, -6630, -6663, -5538, -12120, -12736, -15665, -14838]
3065a4838L820r49K054O730P792n324m76J834l098n258m57R661O394j753n676
3050D56L506l389k136K382P740N013j329r12L42k030m659m779j138K11K389L08
3034A975M508L442j483M255l626j2505n834j540P192J144K865k432J226L055l9
3019B203O922m050k253j511o121l212L452J0043Q457j477L256K90K452J19j1569
3004G001p463j613R39N296K165m890m10O127L16p071j0605L512J138L704K615
2989G61L73o059K82Q387L930j672m478K366k060l649k639K936M523o09n902k441
2973e951l508k4O133O729k105K162O99Q260j755o84j249l276N442L72l317l883
2957D045j289J121l180r846o357K387k464L199J258K552M483Q244M662p004o252
$$ y = [-14838, -11018, -11967, -9913, -3183, 4609, -715, -1191, 643, -2455, -7713, -8170, 1491, 7885, 6132, 456, 3962, 573, -1563, 819, 8559, 13572, 12243, 11331, 11673, 9643, 4984, 205, -933, -722, 1667, 1975, 6483, 9925, 8442, 12697, 9071, -3434, -9268, -10808, -3616, -2472, 393, -2039, -813, 2242, 2203, 9125, 5075, 2822, 1311, -4810, -8022, -4570, 5473, 13930, 12453, 15709, 15999, 18451, 18570, 7001, -462, -2075, -1136, 4160, 6325, 1435, 1025, 7152, 7468, 397, -10208, -6696, -5558, -1854, 761, 1134, -4925, -4643, 3744, 7674, 6002, 1524, 3890, 1830, -1819, -4458, -1522, 3001, 2392, -3510, -5951, -9459, -9483, -3350, 3379, 1274, 3436, 4135, 12395, 10640, 9956, 8707, 5431, 10873, 11245, 7928, 4045, 2756, 3877, 697, -9149, -15506, -13119, -15583, -12384, -11126, -8574, -4091, 4153, 8815, 1811, -4441]
2942d441J017K639k484j714J926M070q07k121L569j903p44M477L417j149M348
2927A0100k158l243m675k069L422J990j693R64K038P174l650m897o4m11n244J828
2911e88l564O19l440l636L192K719K679j812N165J161n671L530N283N240j11l409
2895G357n397O772K208k565m224R01L778K47Q22o401m163R54J482L818n794n312
2879e517N36n95k585J05L008M807J403n63J33l874N855N891K884j186l519n885
2863H98J232M445K310p451n281K168K26n102K961K898J228k7n789n492J757J4467
2847E448p856J536N450m153L723o083O277L636J310M78j7604p520L353M505M527
2832b973N219O571K001l418l887P166l851L15k444J718k702m45k312l303O41k061
$$ y = [-4441, -3424, -785, -3269, -4983, -3057, 1013, 206, -1915, 1654, -249, -993, 3484, 6901, 5752, 10100, 7942, 4699, 24, -2045, 1377, 3367, 1674, 2638, 4676, 11850, 8200, 3303, 3239, 2828, -2416, -588, -4152, -3533, -6973, -10609, -7417, -4698, -2019, -3831, 1334, 2495, -3176, 354, 5637, 10877, 10766, 7357, 1960, 8732, 10940, 8375, 4151, 5052, 8830, 9077, 9899, 3498, -665, 289, 1771, 5589, -205, -5517, -4981, -5576, -8161, -8056, -5048, -241, 1162, 599, 732, -3142, 2713, 8604, 11488, 10302, 6783, 898, 2130, 6575, 8885, 1434, -3847, -1679, -1453, -6555, -3594, -696, 532, 505, -5284, -10776, -9019, 5448, -2408, -872, 4578, 425, 4148, -1935, 4342, 7978, 9288, 9766, -7838, -15358, -12005, -7500, -2973, 2246, 8817, 10818, 7400, 3513, 10679, 6828, 7143, 4699, 6417, 3715, 3270, 958, -2345, -1704, -3765]
2816c765L296M023m77r41L451q93o727M28J981M82q58j098J527j26J828j59j152
2799H20R72J912N031m061o745L969L084J583m19J079o913P09J606n54J360J046
2783D479n913m807m925J338N244K109M050k553N42J074N218M666l14k314J284
2768I178p80o10p340K367J796o685l839P078N63n225o914Q130M404L874L527n059
2752D465j763N339R92j361K749o6r695m540J212M082p23L065n285m903K258N838
2736A664J32L692P524n827j706L583l015m803L411n409N125O137o106k461J986
2721C927Q973l192l295r96l9N60O39l076J400K350n705j231K86J031j309O940
2705G263N747l668j233j0065m732O003j654j505M184K134N494R2K766J863n175
$$ y = [-3765, -469, 3554, 3077, 2136, 5587, 4694, -2033, -1605, 376, 858, 0, -1098, 429, 303, 2131, 1972, 820, 1792, 3704, 8735, 4674, -2071, 1898, 4982, 6565, 6146, 7225, 312, 1021, 2627, 2073, 3433, 4479, -1434, -6241, -11166, -9828, -4584, -2475, 1575, -978, -436, 638, 5856, 10522, 10208, 7894, 9178, 8398, 7788, 448, 2815, 4611, -2074, -5913, 1165, 1728, -3497, -10411, -2281, 2123, 5997, 9524, 4465, 2702, 8041, 9033, 7672, 10421, 10355, 660, -3880, -2668, 1414, 691, 3756, -1529, -6432, -4174, 1664, 1796, 5488, 13012, 7185, 5479, 9062, 6047, 1244, 4655, -754, 4371, 10508, 4402, 1941, 3927, 12900, 9708, 6413, 5417, 5378, 5938, 6577, 3501, 4901, 7251, 1546, 315, 601, 1632, 323, 7263, 13010, 9342, 8109, -1956, -6688, -685, -2339, -3844, 340, 2474, 7968, 8060, 10826, 12689, 7514]
2690G514r64j199k599m900n690P80O402J334l798o897M201L646k107q32p0N264
2674H5P196j141l673L067O207Q653n263r170L991P702k478l942L702m19p237q470
2658a190l785j624q02K86L383P74l289j875O996J755q749O29k591q90O456O165
2642A649K837l245N78O135J582p25j125J28K070L660K844k209n680J008q80o267
2626B360j0K675j1303n274P018O946L431j854k288K470n733l67K532O608N729
2611A2940p299o164l821l768K107P474K189K938j779l503q4m718l092k039l455
2596a2074N342O830k35K173M52l538L563O615l293n526k033L667M93K722O220
2581A1378J5k81r360j109J955n728k041Q81O394L285p888k047K545L570N498J299
$$ y = [7514, 6550, 5351, 2752, -2148, -7838, -7058, -656, 678, -3120, -10017, -5816, -2170, -4277, -5109, -5179, 85, 7281, 6140, 2467, 5534, 11741, 20394, 15131, 5961, 9952, 17654, 15176, 11234, 14936, 14517, 7280, -1190, -4975, -6599, -7401, -7115, -3732, -2958, -6247, -8122, -1126, 629, -8120, -7491, -10082, -10972, -4516, 1649, 4486, 1241, 1819, 7954, 9536, 8811, 7686, 7814, 9884, 13544, 16388, 14179, 8499, 9507, 8627, 2360, 2350, 5025, -6278, -11552, -4534, 2412, 5843, 3989, 1701, 4171, -1562, -1929, 603, 7211, 12940, 5641, -523, -4344, -8112, -6005, 1469, 3658, 6596, 4817, 1314, 1230, -3488, -6580, -8619, -12074, -6732, 98, -137, 2036, 2488, -1050, 2513, 9128, 5835, 309, -1724, 1943, 2436, 5158, 11378, 11393, 11112, 1752, 643, 2598, -3130, -5171, -4290, 2104, 5389, -2499, -4546, -2001, 1569, 7067, 8366]
2565H366j539j308l762k629L21M578J960%J803P026J041n609j2003k216N588J227
2549B844j372R00J633l078k423j666k804k26J727K628m772q60k865N80Q360P858
2533F464K926l60j39n284o34j508P856J102k748N988P714l904P66n3r63m429k808
2516I986J884R78r130j1720M544j522L612L952K165J816L474M17n534k237l255
2501e70q05k252J333L389l334N284K679m82k178m131N58p195l391L782Q831K630
2485D148k431j923j698j13O881l866n098N308K421p073J165k37j259O973L44p378
2469c836q42K244N355r12m103K247P48k674M541p98j099m484l309M369m32n509
2453h494l084N189K230n69m651l948K899J394P84L683M290P301Q212N846j060
$$ y = [8366, 6827, 5519, 1757, -872, -551, 4027, 5987, 5987, 7790, 14816, 15857, 10248, -1755, -3971, 1617, 2844, 1472, 2372, 4005, 927, -1496, -3162, -5966, -6192, -4465, -1837, -6609, -7469, -10334, -9754, -1394, 6464, 9390, 9030, 8891, 3607, 2973, 1465, 9321, 10423, 7675, 13663, 21377, 17473, 18239, 18186, 17223, 12794, 9986, 11870, 12848, 3718, -8002, -3458, -4980, -1368, 2584, 4749, 6565, 10039, 10456, 4922, 2685, -570, -1375, -3627, -2294, 1095, -2239, 3045, 5724, 5242, 3064, -1067, -509, -7704, -11095, -7313, 1518, 4148, 1717, -206, -1904, -2017, 4864, 998, -4100, 1208, 3629, -3444, -2279, -2516, -3775, 3198, 3542, -3836, -4678, -2434, 2921, 2009, -2094, 153, 901, -1773, 2768, 1970, 871, -3613, -6922, -2553, -2985, -8494, -11578, -6389, -4159, -4728, -9379, -13327, -10428, -9034, -8250, -4567, -277, 7024, 15236, 21082, 20022]
2438B0022p252r476J015J13J14m631m327M201k0l335j188K537J0225Q01m277k36
2422D286j237j250o2J122L137J986k921l831m579l970L856L207N430q31j007m769
2406a433k546J570L16R4N113J781n705n347L577Q288L082p202j258k927L35R817
2390G555K695l624J57M83M687j921m411p032n349k568J409L144R97j232J376J222
2374b412n437j438J231L734N70J083R90L02p070K940M260n615j783R00N455Q47
2358a443K105k44J156M690l549m198k424p91o52K564L770P7k394J0M475j098l685
2341a631J422J653P146K930m57m673p250n485j504K748k9j375K78L939P736J260
2325F708r541q372Q03O668J1052L660p625j553j51m264j223j331J575K374r8n66
$$ y = [20022, 12770, 3294, 4309, 4422, 4536, -95, -4422, -221, -241, -3576, -4764, -2227, 7998, 8799, 4522, 4286, 3049, 1799, 1737, 2859, 5996, 7982, 5061, 1230, -3349, -7319, -3463, -256, 5174, 4343, 3336, -1433, -3979, -2409, -2093, -1999, 3114, 4895, -810, -6157, -2580, 5708, 8790, 1588, 330, -2597, -2262, 7555, 10250, 6626, 6783, 7266, 11953, 10032, 5621, -1411, -6760, -9328, -7919, -4775, -3778, -5010, -3634, -2412, -7849, -9287, -8056, -4322, -3752, -2669, -1679, -1377, -8447, -5507, -1247, -6862, -8645, -7745, -2290, -1443, 662, 418, 1574, 6264, 2715, -1483, -3907, -4698, -5350, -2786, 984, 1061, -1333, -1323, 3152, 2054, -1631, -209, 1444, 8590, 11520, 11063, 6390, -860, -6345, -7849, -5101, -5130, -6505, -6227, -2288, 5448, 6708, -2833, -11205, -10402, -3734, 7318, 10978, 3353, 1800, 1649, -2615, -3838, -5169, -3594, -1220, -1318, -1884]
2309a884J913J710J22k398J920k579j455N694P864m139m270n690m006Q492M533
2294E827j67J866R05n667q93q763l111L419j568J32O815j395j0458N206N610o196
2278h438p289Q6Q860N334j526m453L539o26l614K669M391n828J135J798O043m91
2262A590L605N263l305k205k08m772J243P88m752K721L325l337l626R96l60J602
2246a432pJ615n80K99M062k413p748L63M964rq27m235J937J228M51j71q84M290
2228I03L371J099l207o510o911m534J159R902J80K10M673J85N66J0436M225l457
2212A2290r45k317N726M054n080q646M178O661m04m474l855N081k869p390m731
2197b721n728K867M667J493J528L082M638k140o254j933J467J952M58j11k261
$$ y = [-1884, 29, 1739, 1861, -537, 1383, -1196, -2651, 3043, 10907, 6768, 2498, -3192, -7198, 1294, 5827, 5660, 7526, 8431, 2764, 1871, -6892, -10003, -6584, -8152, -8020, -1205, -2600, -13058, -7852, -2242, -8438, -15727, -15641, -6781, -1447, -2973, -7426, -3887, -4513, -8127, -5458, -1067, -6895, -5760, -3962, 2081, 1590, 5195, 10458, 7153, 4948, 4740, -32, 1211, 1999, -2753, -32, 3293, -44, -3670, -2674, -3034, -1432, -1439, 176, -404, -105, 3957, 1544, -6204, -5841, -877, -886, -1713, -5948, -4011, -2783, -2332, -2503, -3387, 903, 4274, 5373, 2166, -4344, -11255, -15789, -14630, -4728, -4548, -4338, 335, 520, 1086, 11522, 15747, 12290, 11345, 9028, 14754, 18808, 13728, 5082, 9260, 15921, 15517, 11043, 7188, 12269, 9400, 2010, -2721, -8449, -5582, -915, 578, 2106, 5188, 9826, 7686, 1432, -501, 966, 2918, 3376, 3265, 1004]
2182A004k26k342N06Q92K57l354R33J496m564J64J310P217j594J39K005J238J376
2165F457l391l303k505n058K470P949j305o383o467R03L277M253L77K084K419
2150A777j664j419K285k726Q87K580j727j51K516p48K292J627r24p31m031j551
2134a708r70J266O343N732J226l520o241o901r00l632O524J0008p456m138Q151
2119C784P42r196l453K837L375L670n429o459J651l383O10Q797J0034K364j136
2104H808J324K210n53o494k432K971J38j96j811k078j967Q727O030j1012r322
2089e657J551J118L167j806j506n390L121J0468l353p575m041k237O813Q200j751
2074A122L85J724j0179L039O060n788l841N645J912L574J1098j166k836j14k78
$$ y = [1004, 778, -1564, -1058, -166, 91, -3263, -2330, -834, -5398, -5234, -3924, 3293, 1699, 1838, 3843, 5081, 6457, 3066, -237, -2742, -7800, -5330, 2619, 1314, -5069, -11536, -10633, -7356, -3103, -2726, -642, 1777, 113, -1306, 979, -1747, -860, 1720, -7, -158, 2358, 1610, 3902, 5529, 4605, 3874, -157, -1708, -2678, -1412, 4931, 10663, 11889, 8369, 2128, -4773, -5673, -9305, -2781, 7227, -229, -4367, 3784, 4526, -4670, -8123, -5286, -1911, 1759, -3670, -10129, -8478, -11861, -11251, -2454, 7580, 9944, 8808, 10132, 12342, 11789, 5295, 2863, 5834, 5972, 5776, 3965, 1887, -80, 8647, 14677, 3665, -5657, -4106, -2988, 179, -1627, -3133, -8523, -5402, 5066, 1713, -5862, -9903, -12140, -5327, 2873, 1122, 1507, 3231, -6948, -3909, 2151, -3637, -7478, -1833, 79, 3653, 14751, 13585, 10749, 10635, 10357]
2059A0357j185J625N10L122p626l875N946J166p751l768k806l400J120J018J071
2044d476K726J204l099k416p63R06J645L953k493k49N644K467l87j275n408K043
2028B2M354j360Q539o557r225l681N562Q144J432l519r80K574M005J90p410K316
2012D406K279K75K580P82J631j606q446q29l087N80p15L834J851k742l333N780
1996C240M52j489j870r386J880P739L89j731l300j725m174m686l512M49R284J1257
1980B817J371n659o305j946M073Q35P66L293P718N13o279O13j266j5k025k898
1964d394J745k462J771k49j74P151j73J841j691r991l584K961K630J722M481j640
1948e6M0M21l610N448M047j637L554K195n445J964N667j153n025j2217o425L400
$$ y = [10357, 9172, 10797, 11307, 14429, 6803, 2928, 8874, 10040, 2289, -1479, -4285, -7685, -6565, -5547, -4476, -1750, -546, -3645, -6061, -6824, -5918, -4273, -320, -2813, -3062, 2582, 5049, 4662, 3387, -2021, 22, 4376, 3016, 11555, 4998, -4227, -7908, -2346, 5798, 7230, 3711, 2731, 5305, 9310, 9500, 2090, 4406, 6685, 6960, 9540, 10322, 11953, 10347, 1901, 1072, -2015, -1435, -2150, 1684, 3535, 793, -2540, 3240, 3692, 2203, 333, -9053, -7173, 566, 955, -776, -4076, -5801, -9975, -14661, -18173, -17724, -8440, 2817, 4188, -1471, -7776, -9722, -5649, -4814, -4048, -755, 6963, 7476, 1197, 1810, 544, 529, -1496, -4394, -2649, -5111, -3340, -3589, -3763, 3388, 3215, 5056, 3365, -6626, -10210, -7249, -4619, -2897, 1584, -56, -16, 405, -3205, 2243, 6290, 4653, 8207, 10402, 4957, 6921, 12588, 11435, 6410, -5807, -12232, -8832]
1932h832Q807J586n129M129N772n622O46N362j747K757M295m874n089J180J824
1917E065N46n299j066j0364k089O327J749j422O123K964n77J94K53J941N404j358
1901H391k653K870J949K397l624n944l617J880N598J512l711o708p847m423m04
1886a4334k280P860P136M78o092L255P162o329o529L016O259M846O912m782j1568
1871d990q084L007J216r46L762K546J966n66j060j474k07P958P989L352K96j0202
1855D563o390j089L22j987O898O465m47l96o56l747q142n809M252M609p73m997
1839g324k514P901P389k696p370J455M253k176j370o49Q274P919n258l146O84
1824E372j551j36k324k833m995O30K682J2425K762N62l265j2303j999K620J128
$$ y = [-8832, -25, 1561, -3568, 561, 6333, 711, 1357, 6719, 4972, 7729, 12024, 7150, 2061, 3241, 5065, 5611, 312, -754, -11118, -13207, -6880, -5131, -6553, -430, 2534, 1957, 2151, 2404, 4345, 9749, 8391, 5738, 8608, 10557, 12954, 9330, 3386, -231, 1649, 7247, 8759, 5048, -1660, -9507, -13930, -14334, -16614, -8754, -1618, -1140, -7232, -3977, 3185, -3144, -9673, -6657, -398, 4448, 11360, 6578, -4990, -13074, -10067, -8851, -9797, -6035, -3489, -1523, -2089, -3149, -4623, -4830, 3128, 11117, 14469, 14765, 4563, -1827, -2916, -2594, -4581, 2317, 8782, 8335, 7939, 7283, 3536, -4606, -10415, -6163, -1554, -2327, -7324, -9838, -1937, 5452, 2756, -4614, -3159, 1094, -1082, -2452, -3101, 5173, 13092, 7834, 4688, 5372, 3821, 3685, 1361, -1472, -6467, -5837, -3155, 9270, 12032, 12594, 9329, -2974, -4973, -2353, -1225]
1809a225k06R20o019L319O184N448j250k588n405m449J857L211k793K264J153
1794D21N03o352J46M171K090K819j588L288K170q096K004r85m94L46k760n582
1778g899J580Q690P114l130o993P67l388P02j290M256l562J402J359n609j46Q673
1762B526L121p723l814O447K744j071N36J941j122Q00o328k383j641O111P20K398
1746C262j364J866m299l28Q128n922m566p531m667j147P772L1N615P643n44p5
1730C874l043k22M533J259n746o077J588R138l243p185l814P454N178M020k465
1715E249J4k911n256l119J268l129M305N308O229L590m861k377p85j573m264m850
1699g162k414K112M452j844k69J554N616L330N698j079n958L137j835j5K639q28
$$ y = [-1225, -1431, -511, -6530, -3211, 2973, 8421, 7171, 4583, -822, -5271, -3414, -203, -2996, -732, 421, 924, -5428, -5282, -1111, 979, 3798, 2210, 5498, 7668, -428, 1576, 591, 97, 443, -2317, -7899, -6319, 2371, 9485, 6355, -638, 129, -3259, -2557, -3847, 409, -3153, -1751, -392, -6001, -6147, 2526, 5647, -2076, -5890, 557, 3301, 2230, 2766, 4707, 3585, 4385, -1943, -4326, -5967, 144, 864, 3262, 1898, 3764, -535, -863, 7265, 1343, -3223, -10754, -15421, -16568, -8796, -8765, -3150, 4493, 3949, 3874, 831, 609, 5142, 6401, 655, -5422, -3834, 5304, 2061, -5124, -8938, -1484, 3694, 7714, 5249, 5263, 2352, -2904, -6023, -4755, -7884, -3579, 1729, 7958, 11548, 6687, 4310, 3525, 1952, -2312, -7162, -9576, -7464, -3012, -4856, -5125, -3571, 2045, 5375, 11073, 9994, 4036, 7173, 5338, 5323, 7962, 7134]
1683G134m540K801K731M36n398M26Q888q233j0021m64Q486R992l493p619l318
1668b192m85M992L16O79l601J286M859l80o377N16M130j908j213L293L394M076
1652A1385n973k15m912o067J465M302M889j500j274P027j542n529J570K351l218
1637B759m293K165L119O38l772j368K098j520J533J472M03j079k975M38k467K394
1621d55L159k925l391o221J616M935M186n06P38O73r45L25j2383o898J198J1832
$$ y = [7134, 2594, 5395, 8126, 8562, 3164, 3590, 12478, 4245, -5776, -6240, 2246, 12238, 8745, 1126, -2192, -2677, 2315, 2631, 3310, -291, 995, 5854, 5474, -903, -387, 3743, 1835, 622, 3915, 7309, 11385, 5412, 5197, 285, -5782, -4317, -15, 4874, 3374, 2100, 9127, 7585, 2056, 3626, 5977, 2759, -1534, 631, 3750, 4388, 616, -752, 1346, -174, 1359, 2831, 3234, 2155, -820, -382, -2849, -455, 2704, -221, -3612, -9833, -8217, -3282, 904, 398, 1136, 1809, 864, 1189, -11194, -18092, -16894, -5062]
$$ [...]
##END NTUPLES=NMR SPECTRUM
##END=
