##TITLE=Analysis number 320586
Compound Code mo 00109
Project Code adrs
Chemist Name fudan
##JCAMPDX= 6.0         $$ Bruker NMR JCAMP-DX V2.0
##DATA TYPE= NMR SPECTRUM
##DATA CLASS= NTUPLES
##ORIGIN= Bruker BioSpin GmbH
##OWNER= nmr
$$ XWIN-NMR		Version 3.5
$$ Fri Jun 30 09:01:04 2006 GMT Daylight Time (UT+1h)  MAYBRIDGE\nmr@NMR_250MHZ
##.OBSERVE FREQUENCY= 250.131544655141
##.OBSERVE NUCLEUS= ^1H
##.ACQUISITION MODE= SIMULTANEOUS (DQD)
##.ACQUISITION SCHEME= undefined
##.AVERAGES= 16
##.DIGITISER RES= 18
##SPECTROMETER/DATA SYSTEM= dpx250
##.PULSE SEQUENCE= zg30
##.SOLVENT NAME= CDCl3
##.SHIFT REFERENCE= (INTERNAL, CDCl3, 0, 16.522)
##AUDIT TRAIL= $$ (NUMBER, WHEN, WHO, WHERE, WHAT)
$$ ##TITLE= Audit trail, XWIN-NMR		Version 3.5
$$ ##JCAMPDX= 5.01
$$ ##ORIGIN= Bruker BioSpin GmbH
$$ ##OWNER= nmr
$$ C:\u/data/dgb/nmr/ADRS/1940/pdata/1/auditp.txt
$$ ##AUDIT TRAIL=  $$ (NUMBER, WHEN, WHO, WHERE, WHAT)
(   1,<2006-06-30 09:00:39.88 +100>,<MAYBRIDGE\nmr>,<NMR_250MHZ>,
      <created by zg, POWCHK disabled, PULCHK disabled
       configuration hash MD5:
       E2 DF 36 D8 04 B2 41 60 5A D7 A3 38 5A 4B D0 FE
       data hash MD5: 64K
       4E 96 16 7B 98 3B BB 60 F6 25 95 DB 11 0A 19 5F>)
(   2,<2006-06-30 09:00:54.71 +100>,<MAYBRIDGE\nmr>,<NMR_250MHZ>,
      <Start of raw data processing
       ef LB = 0.3 FT_mod = 6 PKNL = 1 SI = 32K 
       data hash MD5: 32K
       F7 F6 80 B9 80 74 C2 1C C8 5F 2E C0 47 80 7F 43>)
(   3,<2006-06-30 09:00:56.26 +100>,<MAYBRIDGE\nmr>,<NMR_250MHZ>,
      <apk 
       data hash MD5: 32K
       91 52 A1 1F 71 C9 2B 0A 46 41 40 0F 66 C5 62 F9>)
(   4,<2006-06-30 09:00:57.12 +100>,<MAYBRIDGE\nmr>,<NMR_250MHZ>,
      <abs ABSG = 5 
       data hash MD5: 32K
       26 B5 D9 69 07 45 51 D4 E7 59 1E C4 7A 26 29 A3>)
$$ ##END=
$$ 
$$ hash MD5
$$ B0 19 C9 10 BC 9C 8A 07 AC ED 56 82 6D CA 5A FA
##$RELAX= 
##$RELAX= 
##$RELAX= 
##$RELAX= 
##$RELAX= 
##$RELAX= 
##$RELAX= 
$$ Bruker specific parameters
$$ --------------------------
##$DU= <C:\u>
##$EXPNO= 1940
##$NAME= <ADRS>
##$PROCNO= 1
##$TYPE= <nmr>
##$USER= <dgb>
##$AMP= (0..31)
100 100 100 100 100 100 100 100 100 100 100 100 100 100 100 100 100 100 
100 100 100 100 100 100 100 100 100 100 100 100 100 100 
##$AQSEQ= 0
##$AQ_mod= 3
##$AUNM= <au_zg>
##$AUTOPOS= <6 >
##$BF1= 250.13
##$BF2= 250.13
##$BF3= 250.13
##$BF4= 250.13
##$BF5= 500.13
##$BF6= 500.13
##$BF7= 500.13
##$BF8= 500.13
##$BYTORDA= 1
##$CFDGTYP= 0
##$CFRGTYP= 5
##$CHEMSTR= <none>
##$CNST= (0..31)
1 1 145 1 1 1 1 1 1 1 1 1 1 1 1 1 1 1 1 1 1 1 1 1 1 1 1 1 1 1 1 1 
##$CPDPRG= <>
##$CPDPRG1= <>
##$CPDPRG2= <>
##$CPDPRG3= <>
##$CPDPRG4= <mlev>
##$CPDPRG5= <mlev>
##$CPDPRG6= <mlev>
##$CPDPRG7= <mlev>
##$CPDPRG8= <mlev>
##$CPDPRGB= <>
##$CPDPRGT= <>
##$D= (0..31)
0 1 0 0 0 0 0 0 0 0.06 0 0 0 0 0 0 0.0002 0 0 0 0 0 0 0 0 0 0 0 0 0 0 
0 
##$DATE= 1151654438
##$DBL= (0..7)
120 120 120 120 120 120 120 120 
##$DBP= (0..7)
150 150 150 150 150 150 150 150 
##$DBP07= 0
##$DBPNAM0= <>
##$DBPNAM1= <>
##$DBPNAM2= <>
##$DBPNAM3= <>
$$ [...]
##$SUBNAM6= <"">
##$SUBNAM7= <"">
##$SUBNAM8= <"">
##$SUBNAM9= <"">
##$SW= 20.6930455092707
##$SWIBOX= (0..15)
0 0 3 0 0 0 0 0 0 0 0 0 0 0 0 0 
##$SW_h= 5175.983436853
##$TD= 65536
##$TD0= 1
##$TE= 297.16
##$TE2= 300
##$TE3= 300
##$TEG= 300
##$TL= (0..7)
0 120 120 120 120 120 120 120 
##$TP= (0..7)
150 150 150 150 150 150 150 150 
##$TP07= 0
##$TPNAME0= <>
##$TPNAME1= <>
##$TPNAME2= <>
##$TPNAME3= <>
##$TPNAME4= <>
##$TPNAME5= <>
##$TPNAME6= <>
##$TPNAME7= <>
##$TPOAL= (0..7)
0.5 0.5 0.5 0.5 0.5 0.5 0.5 0.5 
##$TPOFFS= (0..7)
0 0 0 0 0 0 0 0 
##$TUNHIN= 0
##$TUNHOUT= 0
##$TUNXOUT= 0
##$USERA1= <user>
##$USERA2= <user>
##$USERA3= <user>
##$USERA4= <user>
##$USERA5= <user>
##$V9= 5
##$VALIST= <valist>
##$VCLIST= <CCCCCCCCCCCCCCC>
##$VD= 0
##$VDLIST= <DDDDDDDDDDDDDDD>
##$VPLIST= <PPPPPPPPPPPPPPP>
##$VTLIST= <TTTTTTTTTTTTTTT>
##$WBST= 1024
##$WBSW= 4
##$XGAIN= (0..3)
0 0 0 0 
##$XL= 0
##$YL= 0
##$YMAX_a= 299308
##$YMIN_a= -547086
##$ZGOPTNS= <>
##$ZL1= 120
##$ZL2= 120
##$ZL3= 120
##$ZL4= 120
##$ABSF1= 16.522
##$ABSF2= -4.171173
##$ABSG= 5
##$ABSL= 3
##$ALPHA= 0
##$AQORDER= 0
##$ASSFAC= 0
##$ASSFACI= 0
##$ASSFACX= 0
##$ASSWID= 0
##$AUNMP= <proc_1d>
##$AZFE= 0.1
##$AZFW= 0.1
##$BCFW= 0
##$BC_mod= 0
##$BYTORDP= 0
##$COROFFS= 0
##$CY= 12.5
##$DATMOD= 1
##$DC= 0
##$DFILT= <>
##$DTYPP= 0
##$F1P= 14.0000005364418
##$F2P= -0.99999901652339
##$FCOR= 0.5
##$FTSIZE= 32768
##$FT_mod= 6
##$GAMMA= 0
##$GB= 0
##$INTBC= 1
##$INTSCL= 1
##$ISEN= 128
##$LB= 0.3
##$LEV0= 0
##$LPBIN= 0
##$MAXI= 10000
##$MC2= 0
##$MEAN= 0
##$ME_mod= 0
##$MI= 0
##$NCOEF= 0
##$NC_proc= -4
##$NLEV= 6
##$NOISF1= 0
##$NOISF2= 0
##$NSP= 0
##$NTH_PI= 0
##$NZP= 0
##$OFFSET= 16.522
##$PC= 1
##$PHC0= 170.6894
##$PHC1= 4.7881
##$PH_mod= 1
##$PKNL= yes
##$PPARMOD= 0
##$PSCAL= 4
##$PSIGN= 0
##$REVERSE= no
##$SF= 250.13
##$SI= 32768
##$SIGF1= 0
##$SIGF2= 0
##$SINO= 400
##$SIOLD= 32768
##$SREGLST= <1H.CDCl3>
##$SSB= 0
##$STSI= 32768
##$STSR= 0
##$SW_p= 5175.98343685301
##$SYMM= 0
##$S_DEV= 0
##$TDeff= 65536
##$TDoff= 0
##$TI= <Analysis number 999999
Compound Code 99
Book Reference 9
Project Code 9>
##$TILT= no
##$TM1= 0
##$TM2= 0
##$TOPLEV= 0
##$USERP1= <user>
##$USERP2= <user>
##$USERP3= <user>
##$USERP4= <user>
##$USERP5= <user>
##$WDW= 1
##$XDIM= 32768
##$YMAX_p= 339640058
##$YMIN_p= -246515
$$ End of Bruker specific parameters
$$ ---------------------------------
##NTUPLES= NMR SPECTRUM
##VAR_NAME=  FREQUENCY,     SPECTRUM/REAL,   SPECTRUM/IMAG
##SYMBOL=    X,             R,               I
##VAR_TYPE=  INDEPENDENT,   DEPENDENT,       DEPENDENT
##VAR_FORM=  AFFN,          ASDF,            ASDF
##VAR_DIM=   32768,         32768,           32768
##UNITS=     HZ,            ARBITRARY UNITS, ARBITRARY UNITS
##FACTOR=    0.157963299565203, 1,           1
##FIRST=     4132.6476996994, 0,             0
##LAST=      -1043.33573715361, 0,           0
##MIN=       -1043.33573715361, -246515,     0
##MAX=       4132.6476996994, 339640058,     0
$$ Real data points
##PAGE= N=1
##DATA TABLE= (X++(R..R)), XYDATA
$$ [...]
14122g8598j430L6750K9043k1775J437L1073n1367q715N5049k8740k7153j0750
$$ -78598 -80028 -43278 -14235 -36010 -34573 -3500 -54867 -63582 -8533 -37273 -64426 -75176
14110g5176P6502O4325o1385k7318P342K0253M9768k2839M5379j5715P345m3363
$$ -75176 1326 65651 4266 -23052 -15710 4543 54311 31472 76851 61136 68481 25118
14098B5118k1903k9495n9388L8445L1026j9583m8759P147K5538n539k185K3050
$$ 25118 3215 -26280 -85668 -47223 -16197 -35780 -84539 -77392 -51854 -57393 -59578 -36528
14086c6528M7216K7137J0665M131J8331Q702k0155l9054j8913J7259k2218k7330
$$ -36528 10688 37825 48490 52621 70952 79654 59499 20445 1532 18791 -3427 -30757
14074c0757K4189m0062q651L4581r152r0278K6280J24477m3889n9577k7032K3999
$$ -30757 -6568 -46630 -55281 -20700 -29852 -120130 -93850 30627 -13262 -72839 -99871 -75872
14062g5872n0688N563j1340m5521Q710M5845N1304N5303j7104k7833L2586j3019
$$ -75872 -126560 -120997 -132337 -177858 -169148 -123303 -71999 -16696 -33800 -61633 -29047 -42066
14050d2066j2349J7385m9911K8656j2863N2813m0276k1911K3697M7901M3703L671
$$ -42066 -54415 -37030 -86941 -58285 -71148 -18335 -58611 -80522 -56825 -8924 34779 38450
14038C8450n586k3718m8340O857j5887q1647K6425P9401k1873J2061M1400Q1768
$$ 38450 32864 9146 -39194 -32337 -48224 -129871 -103446 -24045 -45918 -33857 7543 89311
14026H9311O743l8583k4478J5786K7754l2499j1847l4112m1603l4912K9660j8693
$$ 89311 96054 57471 32993 48779 76533 44034 32187 -1925 -43528 -78440 -48780 -67473
14014f7473j1857J3356q162p743n950k4237J507j6547P9433P5250L669n803l2982
$$ -67473 -79330 -65974 -74136 -81879 -87829 -112066 -110559 -127106 -47673 27577 31246 25443 -7539
14001g539m5342K5644R9074M6097q0497p0322K582J0081K2062p8554j4374K1911
$$ -7539 -52881 -27237 71837 117934 37437 -32885 -30303 -20222 1840 -76714 -91088 -69177
13989f9177k2683r634K7253m345K7065R139J1266l1608L7453R5097n781R350n4328
$$ -69177 -91860 -101494 -74241 -78586 -51521 -42382 -31116 -62724 -25271 69826 64045 73395 19067
13976A9067J9190N3605O389j4761K9558N6669K0000J1354N5894m5977k7488l616
$$ 19067 38257 91862 98251 83490 113048 169717 189717 201071 256965 210988 183500 179884
13964A79884l3271p827l822l3555l9892L7115o197r164l7981j9439j3168J5986
$$ 179884 146613 138786 134964 101409 61517 98632 92435 83271 45290 25851 12683 28669
13952B8669k0309j0733j5511l9640R163J445J0682J6473K0137j2889p0783k806
$$ 28669 8360 -2373 -17884 -57524 -48361 -46916 -36234 -19761 376 -12513 -83296 -86102
13940h6102L9460j4611n0372j8878J02020N5928O340k8461L0987M7604P3447L8995
$$ -86102 -46642 -61253 -111625 -130503 -28483 27445 33785 5324 36311 83915 157362 196357
13928A96357J31016J61268J24068J40242R6791r7999j76174k31364j05594n2150
$$ 196357 327373 488641 612709 752951 849742 751743 575569 344205 238611 186461
13918A86461p5436p604K1410l1500l3078J641K7977L7233K7278K0153L1460o3985
$$ 186461 111025 103421 124831 93331 60253 61894 89871 127104 154382 174535 205995 142010
13906A42010q0155k2318m6867j3295M2785K1131K0404K694n9819k23L2242l1670
$$ 142010 61855 39537 -7330 -20625 22160 43291 63695 66389 6570 6347 38589 6919
13894F919j086K0356m2060L1172R1264R1232J0982o418M6546j6288Q62O9173J25465
$$ 6919 5833 26189 -15871 15301 106565 197797 208779 202361 248907 232619 233481 302654 428119
13881D28119J80014J15511Q4036L859j36367j95967j26264j28848p2752J1163
$$ 428119 608133 723644 807680 811539 675172 479205 352941 224093 151341 162504
13871A62504J7327N096k6542L5216l6246l9082O43P763N88k906m8781j01285n0938
$$ 162504 179831 184927 158385 193601 157355 118273 118916 126679 127267 124361 75580 -25705 -76643
13858g6643l7255j1720K7782M7262R6471P0315j9033k6165k4845j7935o8740m1290
$$ -76643 -113898 -125618 -97836 -50574 45897 116212 97179 71014 46169 28234 -40506 -81796
13846h1796j9834k1852L6354J48319Q1757O270n4186l7983M0702M6029J09390
$$ -81796 -101630 -123482 -87128 61191 142948 149218 95032 57049 97751 143780 253170
13835B53170N5408o044j1267o7303r5351p7066J9887J6669m0265m2966M8343k592
$$ 253170 308578 302534 291267 223964 128613 51547 71434 88103 47838 4872 53215 50623
13823E0623k4878m4194j9256R0189l606l3546L0892Q839Q608j4527k5120J0731
$$ 50623 25745 -18449 -37705 52484 48878 15332 46224 55063 63671 49144 24024 34755
13811C4755K8004M4884j0523r9663j3928M6717J8914J0611m2736k8364Q191Q1934
$$ 34755 62759 107643 97120 -2543 -16471 30246 49160 59771 17035 -11329 -3138 78796
13799G8796J1273K9721L8877j7773k4322l8094l7264l7865R080L6563O2209n9797
$$ 78796 90069 119790 158667 140894 116572 78478 41214 3349 12429 48992 111201 51404
13787E1404k0407L8585P395k7723k6888k3396k0170M7331J8638l0954o9285m0249
$$ 51404 30997 69582 76977 49254 22366 -1030 -21200 26131 44769 13815 -55470 -95719
13775i5719Q0853Q4583n5725m2495l6246k290M1039J5418J1525J9551K387M0732
$$ -95719 -14866 69717 13992 -28503 -64749 -67039 -26000 -10582 943 20494 22881 63613
13763F3613k1848l5952j8708L134J4832k2879N2234k0619m6081n6435l4024J02823
$$ 63613 41765 5813 -12895 -9761 5071 -17808 34426 13807 -32274 -88709 -122733 -19910
13751a9910L7935p9031l5197M1693O1682R5956N7526r983l4452q577J8716k6987
$$ -19910 18025 -61006 -96203 -54510 7172 103128 160654 150671 116219 107642 126358 99371
13739I9371L9596n3807j4411O6311N1035J7080Q206K2465l7618J7835N28J1065
$$ 99371 138967 85160 70749 137060 188095 205175 213381 235846 198228 216063 216591 227656
13727B27656k2532L2740m9243q3083k6329m4768l3432m4493m8477R1141L5918
$$ 227656 205124 237864 188621 105538 79209 34441 1009 -43484 -91961 -820 35098
13716C5098N2487N0816j7116m655k7362l0358p319k5936K2353J6121l8385n156
$$ 35098 87585 138401 121285 116630 89268 58910 51591 25655 48008 64129 25744 20588
13704B0588K3707J5998R3208N0701m5165p0402l8336L1715J450l6921l9869k0196
$$ 20588 44295 60293 153501 204202 159037 88635 50299 82014 83464 46543 6674 -13522
13692a3522O220P3887J18833N0228r6679r2614o0035J9243N6032L7391j46n9165
$$ -13522 -7302 66585 185418 235646 138967 46353 -13682 5561 61593 98984 98838 39673
13680C9673n7088K0615J4408O6813M2315J3799L3356k7212L923J1245m0189j9081
$$ 39673 -17415 3200 17608 84421 126736 140535 173891 146679 150602 161847 121658 102577
13668A02577M2565N342K5477o745J5620k17K1240j2302m865L0317j1360j8491
$$ 102577 145142 150484 175961 169216 184836 184619 205859 193557 188692 219009 207649 189158
13656A89158K1877J02357M0752l9363j00734m4354j7366j2081Q596K0007n8000
$$ 189158 211035 313392 354144 314781 214047 169693 152327 140246 148842 168849 110849
13645A10849K4715j5563p93J81M6897J1602J1108K1351k2588m0993l9835r680
$$ 110849 135564 120001 119208 119389 166286 177888 188996 210347 187759 146766 106931 97251
13633I7251K0944J1778j0071m3261J6124M4173j4981n610R468R103k0677j6778
$$ 97251 118195 129973 119902 76641 92765 136938 121957 116347 125815 134918 114241 97463
13621I7463Q940L4242j8118j9478L9851O7690O381l8127l7964j3251K1661K9590
$$ 97463 106403 140645 122527 103049 142900 210590 216971 178844 140880 127629 149290 178880
13609A78880k8461m6155l682J7788l3024P0100N522m194K8429m3916m1049k2241
$$ 178880 150419 104264 100582 118370 85346 155446 160968 156774 185203 141287 100238 77997
13597G7997M6962P310K1263P1143L9575r10j3648J8127Q736k8133l1430k0372
$$ 77997 124959 132269 153532 224675 264250 263340 249692 267819 276555 248422 216992 196620
13585A96620k1869n0985k657J6847j2552J6013M922J726n6904q691N0306M6250
$$ 196620 174751 123766 121109 137956 125404 141417 146339 148065 91161 82470 132776 179026
13573A79026P7186N0919q0003o5508J10706K2711k9148j6488J5422J1463n82L841
$$ 179026 256212 307131 227128 161620 272326 295037 265889 249401 264823 276286 275704 279545
13561B79545K8191M9440J365l9053q998J0590Q1152n428l4482Q948j7068O951
$$ 279545 307736 357176 358541 319488 310490 321080 402232 396804 362322 371270 354202 361153
13549C61153L0382m555O4911M6721K3570J5266k4207m89m538l4545m1933k3414
$$ 361153 391535 386980 451891 498612 522182 537448 513241 512752 508214 473669 431736 408322
13537D08322J9591O2414K4265P2115R8453J9352L5544P6039J24185J08957K05927
$$ 408322 427913 490327 514592 586707 685160 704512 740056 816095 940280 1049237 1255164
13526A255164J44112J50334N9190J21045K05016L18423N36676O83559P80904R72724
$$ 1255164 1399276 1549610 1608800 1729845 1934861 2253284 2789960 3473519 4254423 5227147
13516E227147J144285J562818K378009L824700O004354Q607055R624420P919386
$$ 5227147 6371432 7934250 10312259 14136959 20141313 28748368 38372788 46292174
13508D6292174M254226k296295r578479j0786198p516356m477966k628101j649606
$$ 46292174 50546400 48250105 38671626 27885428 20369072 15891106 13263005 11613399
13500A1613399j128847q42234p07491o26748o55071o95027m65183l41696k51055
$$ 11613399 10484552 9642318 8934827 8308079 7653008 6957981 6492798 6151102 5900047
13491E900047j36862j33482n4707J8076O1388K2048O0007Q8243J95157K25885
$$ 5900047 5763185 5629703 5574996 5593072 5654460 5676508 5736515 5824758 6019915 6245800
13481F245800K75557L24990L17834M05204O36117R11456J266622J641252J957101
$$ 6245800 6521357 6846347 7164181 7569385 8205502 9116958 10383580 12024832 13981933
13472A3981933K519264L402573M655694O802416J0765402J7312745K5902881L1273347
$$ 13981933 16501197 19903770 24559464 31361880 42127282 59440027 85342908 116616255
13464A16616255K6422830J5922930k835335k9898195l8037096k5542783j4604259
$$ 116616255 143039085 158962015 156126680 126228485 88191389 62648606 48044347
13457D8044347q476568n153036l373887k515820k167269k176429k151203j880254
$$ 48044347 39567779 34414743 31040856 28525036 26357767 24181338 22030135 20149881
13449B0149881j506861j166265j032682q40750o81909n48880l70558k73324k97216
$$ 20149881 18643020 17476755 16444073 15603323 14921414 14372534 14001976 13728652 13431436
13440A3431436k33153j23366l3635K5668J44480K42462K18919L02498M56125O71914
$$ 13431436 13198283 13074917 13041282 13066950 13211430 13453892 13672811 13975309 14431434 15103348
13430A5103348J050532J430513J954234K357104L050975M374981O533590J0325935
$$ 15103348 16153880 17584393 19538627 21895731 24946706 29321687 35855277 46181212
13422D6181212J6629634K5322713L1557999K7504156J7304702l94360k8105965
$$ 46181212 62810846 88133559 119691558 147195714 164500416 164106056 136000091
13415A36000091l9729191k7640601j5941255r326428n633278l683285k726060
$$ 136000091 96270900 68630299 52689044 43362616 37729338 34046053 31319993
13408C1319993k344962k281287k214560j904934j652947j434648j236952j038130
$$ 31319993 28975031 26693744 24479184 22574250 20921303 19486655 18249703 17211573
13400A7211573q38459o81641n76253m61401m03429l06456l26375k67398k36149
$$ 17211573 16373114 15691473 15115220 14653819 14250390 13943934 13617559 13350161 13114012
13391A3114012k05978j22248r3036j55548o4892P9736J81244L36797M16127N53879
$$ 13114012 12908034 12785786 12692750 12537202 12472310 12552046 12733290 13070087 13486214 14040093
13381A4040093P64004J265377J953124L212478N263429Q040221R882565Q860763
$$ 14040093 14804097 16069474 18022598 21235076 26498505 34538726 44421291 53282054
13373E3282054N669301n2254q499413j2339749r392258n735131l547428k274480
$$ 53282054 58951355 58899101 50399688 38059939 28667681 22932550 19385122 17110642
13365A7110642j552674j105081r60898r01395q39540o75284o50124n73215n37802
$$ 17110642 15557968 14452887 13491989 12590594 11751054 11075770 10425646 9852431 9314629
13356I314629n03939m47598l39867k92935k96657k74690j70693j71274j06172
$$ 9314629 8810690 8363092 8023225 7730290 7433633 7158943 6988250 6816976 6710804
13347F710804j65388j31574j63958j16119j32279j91386j54894j46627r1821j01950
$$ 6710804 6545416 6413842 6249884 6133765 6001486 5810100 5655206 5508579 5416758 5314808
13337E314808j36696k11011j69542j17956j60033j06162o6855j25231j28455j04934
$$ 5314808 5178112 4967101 4797559 4679603 4519570 4413408 4346553 4221322 4092867 3987933
13327C987933r9597o6490m6835j04175j07537j01643j36337r5773j16603j26155
$$ 3987933 3888336 3821846 3775011 3670836 3563299 3461656 3325319 3229546 3112943 2986788
13317B986788p0738n9926j00854p2967r8648j03295l0675o512n9440o2534m0256
$$ 2986788 2916050 2856124 2755270 2682303 2583655 2480360 2449685 2443173 2383733 2321199 2280943
13306B280943k6923R368J0983l6479n9784n1785k8585p7169n9014l5605j6827
$$ 2280943 2254020 2263388 2274371 2237892 2178108 2126323 2097738 2020569 1961555 1925950 1909123
13295A909123k7516K7935k8743n6219n7074l6603r112r05o5983l3738k5372K2039
$$ 1909123 1881607 1909542 1880799 1824580 1767506 1730903 1721791 1720886 1654903 1621165 1595793 1617832
13283A617832m0085n6472p498n472l7715m1885k536K3338o6639r1767j14758o0938
$$ 1617832 1577747 1521275 1513777 1508305 1470590 1428705 1426169 1449507 1382868 1291101 1176343 1115405
13271A115405k1046K5196j7692k7673p2483k8935L1621M5679O438r401k5298L1640
$$ 1115405 1094359 1119555 1101863 1074190 1001707 972772 1004393 1050072 1056510 1047109 1021811 1053451
13259A053451L8847J9320o1633p6001p5680j5181J5400M5928O2515N314n1382
$$ 1053451 1092298 1111618 1049985 973984 898304 883123 898523 944451 1006966 1012280 960898
13248I60898l0652m3610J0123P1540M1073O929J6466l7685l9495k6923k3840Q726
$$ 960898 930246 886636 896759 968299 1009372 1016301 1032767 995082 955587 928664 904824 913550
13236I13550m2150m8502K0717O3125M2167k2377n2456j37503J8049l8073j15418
$$ 913550 871400 822898 843615 906740 948907 926530 874074 736571 754620 716547 601129
13225F01129R310J1235L7987L9282k9732J3373M6339k9352l426k0604j391R4269
$$ 601129 610439 621674 659661 698943 669211 682584 728923 699571 696145 675541 674150 768419
13213G68419O9139l8428j9313K9446o1257m0384q212L7469J9420L2895M1805J1169
$$ 768419 837558 799130 779817 809263 748006 707622 699410 736879 756299 789194 830999 842168
13201H42168O3806j478j238M8552P30J1334n7339j12868j2643Q6613n7518n2482
$$ 842168 905974 904496 903258 951810 952540 963874 906535 793667 781024 867637 810119 757637
13189G57637k972M0441j1766j0394J8932p9056l3858N485k297L3167K7709N2250
$$ 757637 754665 795106 783340 772946 791878 712822 678964 684449 682152 715319 743028 795278
13177G95278N9530J7880n3153j4590j2382J9869P461k2112M7905M7461J0021Q611
$$ 795278 854808 872688 819535 804945 792563 812432 819893 797781 845686 893147 903168 911779
13165I11779J5629J533k2655k8247K963R8494L7514m378K140k6654L368o4388
$$ 911779 927408 928941 906286 878039 881002 979496 1017010 1012632 1014772 988118 991486 927098
13153I27098k4828L7161K63O9969R0729J1712q8698l2991L5904M6187k1505j0276
$$ 927098 902270 939431 939694 1009663 1100392 1112104 1023406 990415 1026319 1072506 1051001 1040725
13141A040725J2176m097Q20J1609m8252L6497J5349j6336N32M6578m90m6961M4704
$$ 1040725 1052901 1048804 1049624 1061233 1012981 1049478 1064827 1048491 1049023 1095601 1095111 1048150 1092854
13128A092854M603m9023n8951N458O5556J03041M3640J5836p639o460J716J7795
$$ 1092854 1097457 1048434 989483 994941 1060497 1163538 1207178 1223014 1215375 1208915 1210631 1228426
13116A228426Q5061q398j33884k6220L2482K7406K4646J05482O2526R918Q5594
$$ 1228426 1313487 1305089 1171205 1144985 1177467 1204873 1229519 1335001 1397527 1407445 1493039
13105A493039o649l0477l2767n7853N9744O6Q194N3481N6802J4549J8680K2382
$$ 1493039 1486390 1455913 1423146 1365293 1425037 1425103 1433297 1486778 1543580 1558129 1576809 1599191
13093A599191L7510j492J4790J8973j8452m50K4445m829M1714O7869M1105p7550
$$ 1599191 1636701 1635209 1649999 1668972 1650520 1650070 1674515 1669686 1711400 1779269 1820374 1742824
13081A742824k3582R3727J07861O7397l109j6497M3570J7457k0336J0912L4697
$$ 1742824 1719242 1812969 1920830 1988227 1985118 1968621 2012191 2029648 2009312 2020224 2054921
13070B054921J05124N4087J9888N5190Q0459P4736M2716q724M9760O0414K6016
$$ 2054921 2160045 2214132 2234020 2289210 2369669 2444405 2487121 2478397 2528157 2588571 2614587
13059B614587k2017J9363M0595N4879L9520N3273R5900J81350M7780m265Q1750
$$ 2614587 2592570 2611933 2652528 2707407 2746927 2800200 2896100 3077450 3125230 3120965 3202715
13048C202715O7956N3073N2481R7767P5291J14342J43044J20519P2121K8567J04837
$$ 3202715 3270671 3323744 3376225 3473992 3549283 3663625 3806669 3927188 3999309 4027876 4132713
13037D132713P9628J1460K8465P5455Q3306J05017J02788K7866Q7368R6000P5916
$$ 4132713 4212341 4223801 4252266 4327721 4411027 4516044 4618832 4646698 4734066 4830066 4905982
13026D905982J38374J54198J12093J26936M2496J42605J90113N0776J08592J37184
$$ 4905982 5044356 5198554 5310647 5437583 5480079 5622684 5812797 5863573 5972165 6109349
13016F109349J58564J59444R3590R3054J54084J49465O8180R1569J75124J39955
$$ 6109349 6267913 6427357 6520947 6614001 6768085 6917550 6985730 7077299 7252423 7392378
13006G392378J14886J93754K27773J68167J19261J38908J90729J90313J93680
$$ 7392378 7507264 7701018 7928791 8096958 8216219 8355127 8545856 8736169 8929849
12997H929849L16574L41438L05612K12711J65015J01419j2231p5931K0576J20573
$$ 8929849 9246423 9587861 9893473 10106184 10271199 10372618 10360387 10284456 10305032 10425605
12987A0425605J14511Q1608J38399K11329J76732R5903J01919J56977J56680J50974
$$ 10425605 10540116 10621724 10760123 10971452 11148184 11244087 11346006 11502983 11659663 11810637
12977A1810637J40576J62892J05548J50118J86535J53351J26180J10000J18159
$$ 11810637 11951213 12114105 12219653 12369771 12556306 12709657 12835837 12945837 13063996
12968A3063996J54700Q9924P1808J7936J7335O8464R2401Q0565N9535M2361Q4783
$$ 13063996 13218696 13308620 13380428 13398364 13415699 13484163 13576564 13657129 13716664 13759025 13843808
12957A3843808J03118P7822J01537N9266J16950J47534J29171K02664J11619M1322
$$ 13843808 13946926 14024748 14126285 14185551 14302501 14450035 14579206 14781870 14893489 14934811
12947A4934811k1213j47425j48365q2724n6050m8809l1210o2662l4458j7650k8617
$$ 14934811 14913598 14766173 14617808 14535084 14479034 14430225 14399015 14336353 14301895 14284245 14255628
12936A4255628k1349n8588r1539p8172q9960l8993m7646r4136q3578p2687j03611
$$ 14255628 14234279 14175691 14084152 14005980 13916020 13877027 13829381 13735245 13651667 13578980 13475369
12925A3475369m9043k0492j4417o1052j68385j40550j15642j54174j95230j39365
$$ 13475369 13426326 13405834 13391417 13330365 13161980 13021430 12905788 12751614 12556384 12417019
12915A2417019k2441j09920j71895o9605p8418j02285j39504j54053j56374r5773
$$ 12417019 12394578 12284658 12112763 12043158 11964740 11862455 11722951 11568898 11412524 11316751
12905A1316751j24896j25698j10982j54227k43876j28683j67429k00211r8116
$$ 11316751 11191855 11066157 10955175 10800948 10557072 10428389 10260960 10060749 9962633
12896I962633r3285j59026j21727j14537j21076j44997j30614j40968j28914j38648
$$ 9962633 9869348 9710322 9588595 9474058 9352982 9207985 9077371 8936403 8807489 8668841
12886H668841j87395j31825j36025j52523j70836p4117r5127r0076m9386o9835
$$ 8668841 8481446 8349621 8213596 8061073 7890237 7816120 7720993 7630917 7581531 7511696
12876G511696j99653j89617j05049j01015j01593r2679o2129r5556j32273j21556
$$ 7511696 7312043 7122426 7017377 6916362 6814769 6722090 6659961 6564405 6432132 6310576
12866F310576j42546j82449j48964l5512o6686p7412j01473n8422l8627j31717
$$ 6310576 6168030 5985581 5836617 5801105 5734419 5657007 5555534 5497112 5458485 5326768
12856E326768q8190q3998j13900r1279o5997r0239j18886p7146m2969p2318p4296
$$ 5326768 5238578 5154580 5040680 4949401 4883404 4793165 4674279 4597133 4554164 4481846 4407550
12845D407550p6832K8422j5560o0879l2007o3324p7372j02537j09525q5699p6051
$$ 4407550 4330718 4359140 4343580 4282701 4250694 4187370 4109998 4007461 3897936 3812237 3736186
12834C736186m2944j2635k5014j02941l4172j8803o2133j01693l0235J6738l7091
$$ 3736186 3693242 3680607 3655593 3552652 3518480 3499677 3437544 3335851 3305616 3322354 3285263
12823C285263j44603q2016l7260N697J9914m2860j19980J6951J6108n6322o3169
$$ 3285263 3140660 3058644 3021384 3027081 3046995 3004135 2884155 2901106 2917214 2860892 2797723
12812B797723r9275o5543k7626m0737O509K1573o3211l3173m934k5151L540R043
$$ 2797723 2698448 2632905 2605279 2564542 2571051 2592624 2529413 2496240 2491306 2466155 2469695 2478738
12800B478738R490l2243j33529n5151l4482J6501K0209o7612m2508l8729o802
$$ 2478738 2488228 2455985 2322456 2267305 2232823 2249324 2269533 2201921 2159413 2120684 2113882
12789B113882m3327J505j4463k9293n6875m1516M743k9548l032M0683k4248r158
$$ 2113882 2070555 2072060 2057597 2028304 1971429 1929913 1934656 1905108 1902076 1942759 1918511 1909353
12777A909353m7062l4834L834j0500l8757m8661k0516J306k3413m3041l9939J6733
$$ 1909353 1862291 1827457 1831291 1820791 1782034 1733373 1712857 1714163 1690750 1647709 1607770 1624503
12765A624503K5040r723K4652l9758n5351n4940q110k97k8295m8700j0426N3566
$$ 1624503 1649543 1639820 1664472 1624714 1569363 1514423 1506313 1506016 1477721 1429021 1418595 1472161
12753A472161o572r699L323m5040j0988j5708k0089j1652m0240k891L050k6548
$$ 1472161 1465589 1455890 1459213 1414173 1403185 1387477 1367388 1355736 1315496 1312605 1315655 1289107
12741A289107L3115L0162L1600m6436l5628k7433n5132j00106n056M2089k7434
$$ 1289107 1322222 1352384 1383984 1337548 1301920 1274487 1219355 1119249 1114193 1156282 1128848
12730A128848p698r754j5981K1139j2996j7116p683k1543K475M2650l0866l8897
$$ 1128848 1121150 1111396 1095415 1116554 1103558 1086442 1078759 1057216 1059691 1102341 1071475 1032578
12718A032578o629L1895l6410N3936J3453l2358o4636n3351o193M2303Q1149J5683
$$ 1032578 1025949 1057844 1021434 1075370 1088823 1056465 991829 938478 932285 974588 1055737 1071420
12706A071420K6390M924k9749k9663j7365j9880n9818p2293l6669M0878Q876j6563
$$ 1071420 1097810 1102734 1072985 1043322 1025957 1006077 946259 873966 837297 878175 887051 870488
12694H70488k5225J7831k6572N216K7960m6038M1483j8868q581n7389l5691P0754
$$ 870488 845263 863094 836522 841738 869698 823660 865143 846275 837694 780305 744614 815368
12682H15368K2676N90J5328Q577K266k4583l8798m1962L8481M5205J9830o026
$$ 815368 838044 838634 853962 862539 864805 840222 801424 759462 797943 843148 862978 856952
12670H56952k8593o5923P4313m253r4336l3934L1508N7276N851Q224k5589j5534
$$ 856952 828359 762436 836749 832496 738160 704226 735734 793010 798861 807085 781496 765962
12658G65962n8055o9294M1582Q8014J2226R339K0098r968k5260m7018j4854o6852
$$ 765962 707907 638613 680195 768209 780435 789774 809872 799904 774644 727626 712772 645920
12646F45920K1176J4111r847J8326K5127J4212J7811L4936K5116q0361m8085M6262
$$ 645920 667096 681207 671360 689686 714813 729025 746836 781772 806888 726527 678442 724704
12634G24704j4386k6467q084J5574j5239j0062J7132l6380m4652K277K7428N5435
$$ 724704 710318 683851 675767 691341 676102 666040 683172 646792 602140 604417 631845 687280
12622F87280k2007j9584r396M9221N661k3030n0079o150Q866l7802k9641L5181
$$ 687280 665273 645689 636293 685514 691175 668145 618066 611916 620782 582980 553339 588520
12610E88520J9354j2726R892M1522j6931j8310l0487p6956L011j9866L960N6172
$$ 588520 607874 595148 605040 646562 629631 611321 580834 503878 506889 487023 490983 547155
12598E47155J3772l3417n7898M0100K5357l1648k5514L6388k7054k9324r209L2847
$$ 547155 560927 527510 469612 509712 535069 503421 477907 514295 487241 457917 448708 481555
12586D81555N717j007J4860m478n6658n6249J025L5937R0209J799K1550k4105
$$ 481555 487272 486265 501125 496647 439989 383740 384765 420702 510911 512710 534260 510155
12574E10155p764J3220o515n3986k855P4323o161q8687l5993M2909K7366m1777
$$ 510155 502391 515611 509096 455110 452255 526578 520417 431730 395737 438646 466012 424235
12562D24235m2316k293J04467O2741O577n0079l7047K0965K5458L5849K0077J3935
$$ 424235 381919 379626 484093 546834 553411 503332 466285 487250 512708 548557 568634 582569
12550E82569l9715k0628J5573M4003J256l102j7437l5020l7982m0317N8760L1152
$$ 582569 542854 522226 537799 581802 583058 579956 562519 527499 489517 449200 507960 539112
12538E39112m046M2452k5726j0764P798p375k5395j4486J2500L9409p070o322
$$ 539112 535066 577518 551792 541028 548826 541451 516056 501570 514070 553479 546409 540087
12526E40087J05680M7977k5941j08407j38021j8662K2676P0954o665R348l039
$$ 540087 645767 693744 667803 559396 421375 402713 425389 496343 489678 499026 495987
12515D95987L3125k0354n4l7896P120L7004K9393l7141q535Q934m643l281k2547
$$ 495987 529112 508758 508704 470808 477928 514932 544325 507184 498649 507583 502940 499659 477112
12502D77112p031j1994m84l2271p3728o48K0571Q2196K2687q3357j768J4765L6809
$$ 477112 470081 458087 457603 425332 351604 350956 371527 453723 476410 393053 391285 406050 442859
12489D42859l648k195O3068R228n5696l6129M4840M0910l4731j139n291j4908
$$ 442859 439211 437016 500084 509312 453616 417487 462327 503237 468506 467367 462076 447168
12477D47168n1848n7708k7168k7481j0595K4204M1863l0607l971O5236M9637j5579
$$ 447168 395320 337612 310444 282963 272368 296572 338435 307828 303857 369093 418730 403151
12465D03151L9065N347J6803k0580M1637N1151J1796j3925n1604m296L105r133
$$ 403151 442216 447563 464366 443786 485423 536574 548370 534445 482841 478545 481650 472517
12453D72517J2652l8158m9616n740m9478k9737N0259J0m0645j4043R2183k507
$$ 472517 485169 447011 397395 391655 342177 312440 362699 362709 322064 308021 400204 397697
12441C97697k3851K4259K4313m0863m8085l1048J2982J5012j430l7761l6389L978
$$ 397697 373846 398105 422418 381555 333470 302422 315404 330416 328986 291225 254836 258814
12429B58814N9488l0141K0944j3904Q339N9435M9509k8767l752K8871j871R087
$$ 258814 318302 288161 309105 295201 303540 362975 412484 383717 379965 408836 406965 416052
12417D16052L0831K1638j3866K6187l4021n6169n4161j2790K0138j9841K3942
$$ 416052 446883 468521 454655 480842 446821 390652 336491 323701 343839 323998 347940
12406C47940N2638j7771o8290J1510N7003j2107p9070J9014j7245K0519J9275
$$ 347940 400578 382807 314517 326027 383030 370923 291853 310867 293622 314141 333416
12395C33416K6702J7414Q031M631Q9583M8746n8669n3327o8970L166N6548J2883
$$ 333416 360118 377532 385563 390194 479777 528523 469854 416527 347557 350723 407271 420154
12383D20154k0244n8182q1787J3650P4229M2083j7799o954P3788k8562j1016K8542
$$ 420154 399910 341728 259941 273591 347820 389903 372104 365150 438938 410376 399360 427902
12371D27902L2330r903j2576l0715k43k0527n6543J9513J649L1792L9633l4070
$$ 427902 460232 450329 437753 407038 406795 386268 329725 349238 350887 382679 422312 388242
12359C88242j2966l723K0388J2654k4710n9390m371J8667r969o416k3896J7047
$$ 388242 375276 371553 391941 404595 379885 320495 316124 334791 324822 318406 294510 311557
12347C11557L7190j6775k1161j132M2994j1349l6327K8919K7218j1426R831k7419
$$ 311557 348747 331972 310811 309679 352673 341324 304997 333916 361134 349708 359539 332120
12335C32120k002k7335J1931J1191j6367J9376l6999l4793L4360J9852k1159J8645
$$ 332120 330118 302783 314714 325905 309538 328914 291915 257122 291482 311334 290175 308820
12323C08820l20k4203M4902M4702K1107L6237N1910n0082n259J1363k7045k0363
$$ 308820 308500 284297 329199 373901 395008 431245 483155 433073 427814 439177 412132 391769
12311C91769M312j6113n9864L7342M0779n1208l415k0615k3645J03731j2127j6134
$$ 391769 396081 379968 320104 357446 398225 347017 343602 322987 299342 403073 390946 374812
12299C74812k5710j9032K8733O5246N6902r884J262k2586l0829J5731L2479n151
$$ 374812 349102 330070 358803 424049 480951 471067 472329 449743 418914 434645 467124 461973
12287D61973l2346L2032L8605k8667p1307L1541J6728l0j227m4091k71L0674M1167
$$ 461973 429627 461659 500264 471597 400290 431831 448559 448529 447302 403211 402940 433614 474781
12274D74781Q1657K8928k6628p7159q271l2458p326N2937k5356j6683j1930N25
$$ 474781 556438 585366 558738 481579 473308 440850 433524 486461 461105 444422 432492 433017
12262D33017J8720o5650Q170J38366M8999p6198p1158k8224M3285j6574l7978
$$ 433017 451737 386087 394257 532623 581622 505424 434266 406042 449327 432753 394775
12251C94775M0333r759q6536q505P4261Q3211L646o0694r1740k4684M8108J6726
$$ 394775 435108 425349 338813 330308 404569 487780 491426 430732 338992 314308 362416 379142
12239C79142J9036k9004O279K4012N4791K6626l1812k5838L461N734n450l9227
$$ 379142 398178 369174 375453 399465 454256 480882 449070 423232 426693 432427 426977 387750
12227C87750J4264j551m784L2742j9467K5262N1207l176L6763O086p0027p305
$$ 387750 402014 400463 395679 428421 408954 434216 485423 482247 519010 525096 455069 447764
12215D47764m3030l294Q7966O774r050q579n970N872j8496N7032n0756q7941J0876
$$ 447764 404734 401440 489406 496180 487130 478551 472581 478453 459957 516989 466233 378292 389168
12202C89168j837r182q613K0406R558j8008K7148O5671l1024Q515L331O692p4914
$$ 389168 387331 378149 369536 389942 399500 381492 408640 474311 443287 451802 455133 461825 386911
12189C86911n658K1209M6177j5746o6185j5379J4958K2190j4391l5470k2586M7557
$$ 386911 381253 402462 448639 432893 366708 351329 366287 388477 374086 338616 316030 363587
12177C63587J10683J5137l094l5388l0733M0314j4188K9178K9972j4270n346l9505
$$ 363587 474270 489407 486313 450925 420192 460506 446318 475496 505468 491198 485852 446347
12165D46347q016L2693j077Q673M3967K7704j9613o3246L130O5480K7866K5850
$$ 446347 438331 471024 469947 478620 522587 550291 530678 467432 470562 536042 563908 589758
12153E89758o0695l1097J8540j4531L2998J4812n1394j6134O516M1723J9055K8560
$$ 589758 529063 497966 516506 501975 534973 549785 498391 482257 488773 530496 549551 578111
12141E78111k925L3063m466m7367k0527L6286M5819j8101k5395k6806j2537J3513
$$ 578111 575186 608249 603783 556416 535889 572175 617994 599893 574498 547692 535155 548668
12129E48668K0860L7152R5895l5610n3260J8295K7827k0498Q346O970k9404J0112
$$ 548668 569528 606680 702575 666965 613705 632000 659827 639329 647675 654645 625241 635353
12117F35353k1352k337k5538k1571M4165q608J8560N0839O0810P834m2927p2911
$$ 635353 614001 611664 586126 564555 608720 600112 618672 669511 730321 738155 695228 622317
12105F22317l6016O4936O0436k2954n8154R276L5126q372M6181M4547q364j2037
$$ 622317 586301 651237 711673 688719 630565 639841 674967 666595 712776 757323 748959 736922
12093G36922R526R2780J1992k5009j9605m0752K9935o0443J9816k609L9300J5155
$$ 736922 746448 839228 851220 826211 806606 765854 795789 735346 755162 752553 791853 807008
12081H07008p999N0281m6468n3159N7844k233J0191J738j0134L3781K676l6042
$$ 807008 799009 849290 802822 749663 807507 805274 815465 817203 807069 840850 843526 807484
12069H07484l022m6585k2831N489M8884O1964l9749o8844m9994J6637K5817K0631
$$ 807484 804462 757877 735046 740535 789419 851383 811634 742790 692796 709433 735250 755881
12057G55881N3939k114L6134K7975j3985J382m8664M404M9126J5834K2985N2127
$$ 755881 809820 807706 843840 871815 857830 859212 810548 814952 864078 879912 902897 955024
12045I55024K7726O724K9108l2814j6371m3981o748L2629J1208L1740O511j8281
$$ 955024 982750 989474 1018582 985768 969397 925416 918668 951297 962505 994245 1000756 982475
12033I82475j2827L7730L1805j2311m1181N4978m508n5935k0912R693L0841R1710
$$ 982475 969648 1007378 1039183 1026872 985691 1040669 1036161 980226 959314 969007 999848 1091558
12021A091558O0519J8151k1072j5108k422m814m3035k6066p84l9096K1088O1444
$$ 1091558 1152077 1170228 1149156 1134048 1131626 1126812 1083777 1057711 1056927 1017831 1038919 1100363
12009A100363M1413o408o416N4019J9025K522O4636M4115p915M6943l5565m8276
$$ 1100363 1141776 1135368 1128952 1182971 1201996 1204518 1269154 1313269 1305354 1352297 1316732 1268456
11997A268456k2856J2989K2796L0576k395J5789J792K4421k1249k8652j7924M84
$$ 1268456 1245600 1258589 1281385 1311961 1309566 1325355 1327147 1351568 1330319 1301667 1283743 1284227
11985A284227J7111K3516N6824j1955L8334Q648j9742L6018q987m2769j9375k1031
$$ 1284227 1301338 1324854 1381678 1369723 1408057 1416705 1396963 1432981 1423994 1381225 1361850 1340819
11973A340819K7427K936j294J32993P1491j2834j1700L2422M1707K0762K2715
$$ 1340819 1368246 1371182 1369888 1502881 1574372 1561538 1549838 1582260 1623967 1644729 1667444
11962A667444L5967o820M1905L8920J2550n3753m4933j6644L9824P5511N2999
$$ 1667444 1703411 1696591 1738496 1777416 1789966 1736213 1691280 1674636 1714460 1789971 1842970
11951A842970r878q776N745J216K0243K4191M91P44k0320L3994k172o8773L3799
$$ 1842970 1833092 1824316 1830061 1831277 1851520 1875711 1876202 1876946 1856626 1890620 1888448 1819675 1853474
11938A853474j4432N2142L4918M1781O0476K7300M2579j3228q7323n497M6563
$$ 1853474 1839042 1891184 1926102 1967883 2028359 2055659 2098238 2085010 1997687 1992190 2038753
11927B038753L8866Q5959M4574o767j8232j4919O6704L7846j5793L4674O4070
$$ 2038753 2077619 2163578 2208152 2201385 2183153 2168234 2234938 2272784 2256991 2291665 2355735
11916B355735R045J8326O9644L0344j5141L6772P1671j4708k8274L7859J32444
$$ 2355735 2364780 2383106 2452750 2483094 2467953 2504725 2576396 2561688 2533414 2571273 2703717
11905B703717r098k6554J2518L0966N9395L2576M4309P3026n410J8502Q3667O292
$$ 2703717 2694619 2668065 2680583 2711549 2770944 2803520 2847829 2920855 2915445 2933947 3017614 3023906
11893C023906N5762R9926N0288K1077j105J0166M6014N5566J646M4095R0117O2291
$$ 3023906 3079668 3179594 3229882 3250959 3249854 3260020 3306034 3361600 3363246 3407341 3497458 3559749
11881C559749N0168R0257Q7788j83L1862R8824m0925Q177L0819J03602L4088Q1848
$$ 3559749 3609917 3700174 3787962 3787779 3819641 3918465 3877540 3885717 3916536 4020138 4054226 4136074
11869D136074J22845J19724K2703M0566J7434k9663M5900P9715R8382M5609P9251
$$ 4136074 4258919 4378643 4401346 4441912 4459346 4429683 4475583 4555298 4653680 4699289 4778540
11858D778540O1694P5043M4111K8018J59784J34069J1710Q0425J59441K10498
$$ 4778540 4840234 4915277 4959388 4987406 5147190 5281259 5292969 5373394 5532835 5743333
11848E743333J01674M7391O1224N5222J24760J15080R6658L2899Q8420J33118
$$ 5743333 5845007 5892398 5953622 6008844 6133604 6248684 6345342 6378241 6466661 6599779
11838F599779P9583J53867K28043J27665Q3943J00558J20487J03857J18530J80647
$$ 6599779 6679362 6833229 7061272 7188937 7272880 7373438 7493925 7597782 7716312 7896959
11828G896959J57530J94913J47819J91749J78841J27420J90815J81136J89129
$$ 7896959 8054489 8249402 8397221 8588970 8767811 8895231 9086046 9267182 9456311
11819I456311J90463J97859K00120K09330K39058K02978K19420K19779K15505
$$ 9456311 9646774 9844633 10044753 10254083 10493141 10696119 10915539 11135318 11350823
11810A1350823K45698L05353L09751K25128J92457K22278L22614L24925K79051
$$ 11350823 11596521 11901874 12211625 12436753 12629210 12851488 13174102 13499027 13778078
11801A3778078K57652K62223K59229L21143L84585M05985L91936M06357L56094
$$ 13778078 14035730 14297953 14557182 14878325 15262910 15668895 16060831 16467188 16823282
11792A6823282L63303L55841L81447L77987M37689M44215M81947M40276M31863
$$ 16823282 17186585 17542426 17923873 18301860 18739549 19183764 19665711 20105987 20537850
11783B0537850M83937M68957M57482M84312N31682N18085M84524M73174M54683
$$ 20537850 21021787 21490744 21948226 22432538 22964220 23482305 23966829 24440003 24894686
11774B4894686M69795N00336N06594N22486N22481N50473M89058M55724M29971
$$ 24894686 25364481 25864817 26371411 26893897 27416378 27966851 28455909 28911633 29341604
11765B9341604M66092M27451L68725M58978M61710M02289M08198M29886L35557
$$ 29341604 29807696 30235147 30603872 31062850 31524560 31926849 32335047 32764933 33100490
11756C3100490J58330K35962K49744K12988K15051J56601J51040J64729L6333
$$ 33100490 33258820 33494782 33744526 33957514 34172565 34329166 34480206 34644935 34681268
11747C4681268N9572L6069N112j09463q1766p4211j22565j50505j62273k53750
$$ 34681268 34740840 34776909 34782021 34672558 34590792 34516581 34394016 34243511 34081238 33827488
11737C3827488j57705k11460k93333l88913l48136k81262k95410l82320m39909
$$ 33827488 33669783 33458323 33164990 32776077 32427941 32146679 31851269 31468949 31029040
11728C1029040m35406l54008l92222n08689m20552l94795l38601m45536m87646
$$ 31029040 30593634 30239626 29847404 29338715 28918163 28523368 28184767 27739231 27251585
11719B7251585m16771l75863m03429m45845m35279m18762m43101m57309m31391
$$ 27251585 26834814 26458951 26055522 25609677 25174398 24755636 24312535 23855226 23423835
11710B3423835m47312m19045l33008l80553m01438m04091l70897m24826l60937
$$ 23423835 22976523 22557478 22224470 21843917 21442479 21038388 20667491 20242665 19881728
11701A9881728k69023k76770l37848l97783l76907l26922l45903l26009k71787
$$ 19881728 19612705 19335935 18998087 18600304 18223397 17896475 17550572 17224563 16952776
11692A6952776k65025k93698l08738l18296k20918k58848k96692k60609k35907
$$ 16952776 16687751 16394053 16085315 15767019 15546101 15287253 14990561 14729952 14494045
11683A4494045k42989k16972k72029k44990k01487j82122k15835j94168k16160
$$ 14494045 14251056 14034084 13762055 13517065 13315578 13133456 12917621 12723453 12507293
11674A2507293j53709j74762k19886j80712j47442j37916j28448j63913j80959
$$ 12507293 12353584 12178822 11958936 11778224 11630782 11492866 11364418 11200505 11019546
11665A1019546r9083j24935p5536j15370j57838j65121k33356j77104j11494o7486
$$ 11019546 10920463 10795528 10719992 10604622 10446784 10281663 10048307 9871203 9759709 9692223
11655I692223j15594j41105j27436j08189j58495j21698j46039j58303p5605r8296
$$ 9692223 9576629 9435524 9308088 9199899 9041404 8919706 8773667 8615364 8539759 8441463
11645H441463j57521j26828j22270j06812q1889j34874j71177j37641n9849q2175
$$ 8441463 8283942 8157114 8034844 7928032 7846143 7711269 7540092 7402451 7342602 7260427
11635G260427j48999j54755j76966j72692j04156o9676j33465j62026j23925r4889
$$ 7260427 7111428 6956673 6779707 6607015 6502859 6433183 6299718 6137692 6013767 5918878
11625E918878o7590q4605j35259r0487o6687q1205j47783r9683o5622q4903j46957
$$ 5918878 5851288 5766683 5631424 5540937 5474250 5393045 5245262 5145579 5079957 4995054 4848097
11614D848097q9773k9694k7699q4439p8740m2774n4780r1510k6679j5919m6594
$$ 4848097 4758324 4728630 4700931 4616492 4537752 4494978 4440198 4348688 4322009 4306090 4259496
11603D259496l8708o4073k6704J1679q7353r7960j42274n8070r7442j06713o1681
$$ 4259496 4220788 4156715 4130011 4141690 4054337 3956377 3814103 3756033 3658591 3551878 3490197
11592C490197K8945L3854n3128n5265l4208l0532l0415q5567q7546k4822k3129
$$ 3490197 3519142 3552996 3499868 3444603 3410395 3379863 3349448 3263881 3176335 3151513 3128384
11581C128384n6254N562n2742r1359q2513N2155K3031N666k7311o4489o4723k9272
$$ 3128384 3072130 3077692 3024950 2933591 2851078 2903233 2926264 2931930 2904619 2840130 2775407 2746135
11569B746135k895o2729k2281l0169l6050p6457r0133k1505J9728r033r902l7523
$$ 2746135 2743240 2680511 2658230 2628061 2592011 2515554 2425421 2403916 2423644 2414611 2404709 2367186
11557B367186n5581j9220R756q097J219m9797m8722L4572K9564m3168p8207j5356
$$ 2367186 2311605 2292385 2302141 2294044 2295263 2245466 2196744 2231316 2260880 2217712 2139505 2124149
11545B124149j4584j1195p8591l8658J0276n7252p2458Q144O0192k9055q478m352
$$ 2124149 2109565 2098370 2019779 1981121 1991397 1934145 1861687 1869831 1930023 1900968 1892490 1888138
11533A888138n69l6263l7780j6634J4585m9676q098r2258o5800J8762l458o945
$$ 1888138 1887569 1851306 1813526 1796892 1811477 1761801 1753703 1661445 1595645 1614407 1610949 1604004
11521A604004J6854K3573n2835n9887R387L877m1834l1078l3995k619K623m1221
$$ 1604004 1620858 1644431 1591596 1531709 1541096 1544973 1503139 1472061 1438066 1435447 1438070 1396849
11509A396849M2184K2215p0559M2163j7582j356k2911l9564L0044J5444l0921
$$ 1396849 1439033 1461248 1390689 1432852 1415270 1413914 1391003 1351439 1381483 1396927 1366006
11498A366006J8922J6820L8611P43n4853j02593n6818Q5064K2109q715J986k0993
$$ 1366006 1384928 1401748 1440359 1441102 1386249 1283656 1226838 1311902 1334011 1325296 1327282 1306289
11486A306289M22j2302j0429K5873L3748l8326j7216l2805n1633m1581n472K0467
$$ 1306289 1306711 1294409 1283980 1309853 1343601 1305275 1288059 1255254 1203621 1162040 1156568 1177035
11474A177035L3160m3989p2110L3893N8331M9635M5806l3968l5309j6147K0976
$$ 1177035 1210195 1166206 1094096 1127989 1186320 1235955 1281761 1247793 1212484 1196337 1217313
11463A217313K7686o260m779l3269m9561j2644l0878M0278L8138j4969o5711m1267
$$ 1217313 1244999 1238739 1233960 1200691 1151130 1138486 1107608 1147886 1186024 1171055 1105344 1064077
11451A064077m147p7307M5287M1972k6181p312m5283p253J966N0978K7076N187
$$ 1064077 1059930 982623 1027910 1069882 1043701 1036389 991106 983853 985819 1036797 1063873 1069060
11439A069060q1068j6203K684M9439K2510l3593l0609l156M8455j949k2454o1696
$$ 1069060 987992 971789 974473 1023912 1046422 1012829 982220 979064 1027519 1025570 1003116 941420
11427I41420P588N4772m8449o6556R951j1260L3598J0385l6252m5947j2503k6237
$$ 941420 949008 1003780 955331 888775 898726 887466 921064 931449 895197 849250 836747 810510
11415H10510k2457K4561L4142m4293n4698m2322l8747K0889Q412J2836R681R1815
$$ 810510 788053 812614 846756 802463 747765 705443 666696 687585 695997 708833 718514 810329
11403H10329L8951o4803p5878L2260k6986q2548m7418p914j5067j9625M3682O2473
$$ 810329 849280 784477 708599 740859 713873 631325 583907 575993 560926 541301 584983 647456
11391F47456K149n2560l444N8397L9173K5500J7523j0505m0564J0144l7516j3555
$$ 647456 649605 597045 593601 651998 691171 716671 734194 723689 683125 693269 655753 642198
11379F42198l121k64M9032O658m6580n0943o745l0617n0228J2347J0881L0646
$$ 642198 639077 638813 687845 694503 647923 596980 590235 559618 509390 521737 532618 563264
11367E63264L9255L0997N4408K5881K6430J1542J4368O296K3690m589M8777k3996
$$ 563264 602519 633516 687924 713805 740235 751777 766145 772441 796131 791542 840319 816323
11355H16323K5839K0636n2851j0091J8632P252k7917k849R19L2763k3138K2871
$$ 816323 842162 862798 809947 799856 818488 825740 797823 794974 795893 828656 805518 828389
11343H28389K3669J8996j1362r7351l7149N0412L2597j1091N44R5255J1929q717
$$ 828389 852058 871054 859692 762341 725192 775604 808201 797110 797654 892909 904838 896121
11331H96121M0854J9614L5603j9416j8993j6303L5006M6453J2074m7680N0683
$$ 896121 936975 956589 992192 972776 953783 937480 972486 1018939 1031013 983333 1034016
11320A034016L7638l083K0455K8054k8161R31o8675k3125L4679L0947J1240J4816
$$ 1034016 1071654 1068571 1089026 1117080 1088919 1089850 1021175 998050 1032729 1063676 1074916 1089732
11308A089732O8436J1218k3615K6860J5842M0606L5489K7235L2633N3708Q4609
$$ 1089732 1158168 1169386 1145771 1172631 1188473 1229079 1264568 1291803 1324436 1378144 1462753
11297A462753J070O74N1115J32776L8313M9501Q5043r420O7251J45848J28739
$$ 1462753 1463823 1464497 1515612 1648388 1686701 1736202 1821245 1811825 1879076 2024924 2153663
11286B153663O7257O7869J03215J06961J03594J10522J38154J50605J74638J47793
$$ 2153663 2220920 2288789 2392004 2498965 2602559 2713081 2851235 3001840 3176478 3324271
11276C324271J46206K23696K59012K28228K39722K29653L71172M40419M21754
$$ 3324271 3470477 3694173 3953185 4181413 4421135 4650788 5021960 5462379 5884133
11267E884133M73891M84683M79488O18823P23520P48155Q75495R41128J039807
$$ 5884133 6358024 6842707 7322195 7941018 8664538 9412693 10288188 11229316 12269123
11258A2269123J235710J356095J525116J766672J962814K145706K517559K864030
$$ 12269123 13504833 14860928 16386044 18152716 20115530 22261236 24778795 27642825
11250B7642825L229522L605133L991923M466313M993645N523322O006990O526775
$$ 27642825 30872347 34477480 38469403 42935716 47929361 53452683 59459673 65986448
11242F5986448O938532P208517P513067P615581P377877P038567O518951N912222
$$ 65986448 72924980 80133497 87646564 95262145 102640022 109678589 116197540 122109762
11234A22109762N143537M401970L586208K904171K288556J760955J453366J095444
$$ 122109762 127253299 131655269 135241477 138145648 140434204 142195159 143648525 144743969
11226A44743969R42588Q47168Q19459P49271O71391O29140O60480M22977K01429
$$ 144743969 145686557 146533725 147353184 148102455 148773846 149402986 150063466 150486443 150687872
11217A50687872j38935o87725j308509k058175k817358l619228m459237n196803
$$ 150687872 150548937 149861212 148552703 146494528 143677170 140057942 135598705 130401902
11209A30401902n852250o288170o563616o659434o660803o481364o159115n798578
$$ 130401902 124549652 118261482 111697866 105038432 98377629 91896265 85737150 79938572
11201G9938572n406295m977937m542022m152642l821963l458318l131453k866288
$$ 79938572 74532277 69554340 65012318 60859676 57037713 53579395 50447942 47581654
11193D7581654k563681k339071k174925k060078j862247j696115j602870j589802
$$ 47581654 45017973 42678902 40503977 38443899 36581652 34885537 33282667 31692865
11185C1692865j357532j260172j124722j120843j065058r52731r36096q35298
$$ 31692865 30335333 29075161 27950439 26829596 25764538 24811807 23875711 23040413
11177B3040413q21037p49473p49908p38037o17409o55881n66924n64106n10727
$$ 23040413 22219376 21469903 20719995 19981958 19364549 18708668 18141744 17577638 17066911
11168A7066911m95961n09090n47409m05445l47245l92231l71841m09433l12253
$$ 17066911 16570950 16061860 15514451 15109006 14761761 14369530 13997689 13588256 13276003
11159A3276003l03211l61130l52747l05546l77360l96918k61492l38045l20360
$$ 13276003 12972792 12611662 12258915 11953369 11576009 11179091 10917599 10579554 10259194
11150A0259194k99286k42890k38674k12800j70431j97561k97269k47903k35220
$$ 10259194 9959908 9717018 9478344 9265544 9095113 8897552 8600283 8352380 8117160
11141H117160j96282j39755j69370k10150j83833j48259j63848j21916j55846
$$ 8117160 7920878 7781123 7611753 7401603 7217770 7069511 6905663 6783747 6627901
11132F627901j05499j79882k15902k17256j38160j29870j02805j50525k01860
$$ 6627901 6522402 6342520 6126618 5909362 5771202 5641332 5538527 5388002 5186142
11123E186142j21810o3980o9432j22596j21354q5487p8936n8616j16520j34756
$$ 5186142 5064332 5000352 4930920 4808324 4686970 4601483 4522547 4463931 4347411 4212655
11113D212655j34031j68326m2792o7157o3521q0921j41667r5473o5100l1338k8336
$$ 4212655 4078624 3910298 3867506 3800349 3736828 3655907 3514240 3418767 3353667 3322329 3293993
11102C293993l4039j47928j23448n8451k9102k4270p3232l5138o4728m1821p4723
$$ 3293993 3259954 3112026 2988578 2930127 2901025 2876755 2803523 2768385 2703657 2661836 2587113
11091B587113n4698n9575n7128p7640m7559J9528j4246q0318l0998k6185l1032
$$ 2587113 2532415 2472840 2415712 2338072 2290513 2310041 2295795 2215477 2184479 2158294 2127262
11080B127262L9138j12970q7234O603m3580j11204p3924m2861K5965j2786q7732
$$ 2127262 2166400 2053430 1966196 1972799 1929219 1818015 1744091 1701230 1727195 1714409 1626677
11069A626677l8686n5315o2553k6317j1182j214O79l3372m4526k5009q133J2220
$$ 1626677 1587991 1532676 1470123 1443806 1432624 1431410 1432089 1398717 1354191 1329182 1321049 1333269
11057A333269k0253l3656p1862q7761p6064l4550k5088L3806k8505O988j809l1020
$$ 1333269 1313016 1279360 1207498 1119737 1043673 1009123 984035 1017841 989336 996324 994515 963495
11045I63495L3519k6907n4283m129n60q62K92k9438j4348k3020K4492N7171j8697
$$ 963495 997014 970107 915824 911695 911135 910273 910565 881127 866779 843759 868251 925422 906725
11032I06725o207m9060l8658K3792o00K6595O5054K8465L3279k5918k9251j716
$$ 906725 900518 851458 812800 836592 835992 862587 927641 956106 989385 963467 934216 932500
11020I32500K7825l161L2753P0244N6472N6065K43786K78967K40437K94276K17921
$$ 932500 960325 957164 989917 1060161 1116633 1172698 1416484 1695451 1935888 2230164 2448085
11009B448085K692k51637l25978l11494k88843j42569p5337r9988j13856k8509
$$ 2448085 2450777 2199140 1873162 1561668 1272825 1130256 1054919 954931 841075 812566
10999H12566N5207J520N3458k924j03706l8907O9579j1567l9371r1385k9527l0211
$$ 812566 867773 869293 922751 919827 816121 777214 846793 835226 795855 704470 674943 644732
10987F44732N9044p853l9695k4484j06673J8388M1555M9101Q0146o2081o4391
$$ 644732 703776 695923 656228 631744 525071 543459 585014 634115 714261 652180 587789
10976E87789l239R821J0989P5982N4672L0576J1614Q062j6245n8411m4054k892
$$ 587789 584550 594371 605360 681342 736014 766590 778204 786266 770021 711610 667556 664664
10964F64664n1838K683M0677j1861m323k0973j8718m3180l8359j3227M5796j1559
$$ 664664 612826 615509 656186 644325 640002 619029 600311 557131 518772 505545 551341 539782
10952E39782J9873K9160J8768J4367L7661J0539o3650n0857l3775L771J0415J6674
$$ 539782 559655 588815 607583 621950 659611 670150 606500 555643 521868 525639 536054 552728
10940E52728M3564m1318j0827r4098n1613L39r63M233l4740M8844P2630L1419
$$ 552728 596292 554974 544147 450049 398436 398775 397812 402045 367305 416149 488779 520198
10928E20198o0168l0233L7361M9414j8283m8006m1433L9833L0917m1210l9174
$$ 520198 460030 429797 467158 516572 498289 450283 408850 448683 479600 438390 399216
10917C99216K1576O6736k4791k3125k731J6086P248q414k6940J3117J6915k8094
$$ 399216 420792 487528 462737 439612 436881 452967 460215 451801 424861 437978 454893 426799
10905D26799L6132N4763P1094J9462J36736J22748R9273R7313M8911O970j63646
$$ 426799 462931 517694 588788 608250 744986 867734 967007 1064320 1113231 1120201 956555
10894I56555j87942j29924Q852l2127r8833j20952j0672J0363K5399L4334k0291
$$ 956555 768613 638689 647541 615414 516581 395629 384957 395320 420719 455053 434762
10883D34762Q209m6959k8196j9320J5027R362j067k3479L6384n564p440M2742
$$ 434762 442971 396012 367816 348496 363523 372885 371818 348339 384723 379159 371719 414461
10871D14461l8398K4280k4686p9869n5409j0656k4036N0202M8628n118r205L1066
$$ 414461 376063 400343 375657 295788 240379 229723 205687 255889 304517 299399 290194 321260
10859C21260Q0907n1387o1637k6201m8375R57k7219L2919O7005L8299l5347K385
$$ 321260 402167 350780 289143 262942 214567 215524 188305 221224 288229 326528 291181 293566
10847B93566J7147M4771O5881M3299J6360M0331o86o624l915o3377k6605L7933
$$ 293566 310713 355484 421365 464664 481024 521355 520669 514045 510130 446753 420148 458081
10835D58081k3612K5596K9718j3832l8003l0856l4802J6648Q1760k8523p0305
$$ 458081 434469 460065 489783 475951 437948 407092 372290 388938 470698 442175 371870
10824C71870k4244J6317K3831l418M7229J6334K6248N0980j9936q781K3876j2440
$$ 371870 347626 363943 387774 384356 431585 447919 474167 525147 505211 496430 520306 507866
10812E07866P3273P2115N6984L785O7568J03538O8212L8583l9545J5523R0501
$$ 507866 581139 653254 710238 714023 781591 885129 953341 991924 952379 967902 1058403
10801A058403Q448N1968j1165J6067l3288k2479O912J1131M2010j0613m5097j8120
$$ 1058403 1066851 1118819 1107654 1123721 1090433 1067954 1074866 1085997 1128007 1117394 1072297 1054177
10789A054177L4461K6614J4724k3113J6658k6269K5724P199j3684M1748k3667
$$ 1054177 1088638 1115252 1129976 1106863 1123521 1097252 1122976 1130175 1116491 1158239 1134572
10778A134572q0927q5770l8649K575m9608o642j0489j00304p3156Q900j6578m466
$$ 1134572 1053645 967875 929226 931801 882193 875551 865062 764758 691602 700502 683924 679458
10766F79458M124R311k9386p8320l7010L510K2788j61m1916p3621Q09L0024m9847
$$ 679458 683582 692893 663507 585187 548177 551687 574475 574314 532398 458777 459586 489610 439763
10753D39763j3366l7612o2058j4903L7810K9118J7442m96l5412n2435J0760M9187
$$ 439763 426397 388785 326727 311824 349634 378752 396194 395698 360286 307851 318611 367798
10741C67798K6124p204m7887J6286L3832N5958J1119J7434M6629Q2537k2425o0493
$$ 367798 393922 386718 338831 355117 388949 444907 456026 473460 520089 602626 580201 519708
10729E19708j5378J4936K770p8160o3395L186K746R003k1135n7815n4975n2538
$$ 519708 504330 519266 522036 443876 380481 383667 386413 395416 374281 316466 261491 208953
10717B08953L1057O2391M3868R674o6674L1787J8595n374k3567m0611j8627j4265
$$ 208953 240010 302401 346269 355943 289269 321056 339651 334277 310710 270099 251472 237207
10705B37207P844N3260J9887k1894J2504J35170K2186k9049l0419K8429k852J0212
$$ 237207 245051 298311 318198 296304 308808 443978 466164 437115 406696 435125 432273 442485
10693D42485J9478l6811n3992K9742k3601n3159n9599l3693M1040l9506l4355
$$ 442485 461963 425152 371160 400902 377301 324142 264543 230850 271890 232384 198029
10682A98029J8317M8566n067p4257l2772k6966K2744K3257M2824q76p5178L8881
$$ 198029 216346 264912 259845 185588 152816 125850 148594 171851 214675 213799 138621 177502
10670A77502k3461Q6445l0019r0607k7510o265P2850P2647k6403j5579l0329k0794
$$ 177502 154041 240486 210467 119860 92350 86085 158935 231582 205179 189600 159271 138477
10658A38477L5200L3706R85k7152m3069j5781J8759L6114m8161M361O009M358
$$ 138477 173677 207383 208368 181216 138147 122366 141125 177239 129078 133439 139448 143806
10646A43806K5035j4477o3517p411N8308K4804J2145k5257n5768l7541K6834R1618
$$ 143806 168841 154364 90847 83436 141744 166548 178693 153436 97668 60127 86961 178579
10634A78579N5342m3681L4877N996j987M7075M3080p3359j3596M2485K013l8427
$$ 178579 233921 190240 225117 231113 229126 276201 319281 245922 232326 274811 276824 238397
10622B38397J0949J3945k2964j8409n1876j1922n3378J6526M6765M0040l9425
$$ 238397 249346 263291 240327 221918 170042 158120 104742 121268 168033 208073 168648
10611A68648m3877K9144N4201j0887K2259m6615j6911K4579k0733J5272R29k4740
$$ 168648 124771 153915 208116 197229 219488 172873 155962 180541 159808 175080 176009 151269
10599A51269n3798j00325p503O5603N5132L6519j4812J7852J13m9186J6932j2943
$$ 151269 97471 -2854 -10357 55246 110378 146897 132085 149937 150050 100864 117796 104853
10587A04853O664N6646J5275j5538k3440K8094n4101l3225P1468j3713n6338q4261
$$ 104853 111517 168163 183438 167900 144460 172554 118453 85228 156696 142983 86645 2384
10575B384K6446L2661L0476O1230O3993k010o4732O278J7716o4968k6161N236
$$ 2384 28830 61491 91967 153197 217190 215180 150448 156726 174442 109474 83313 88549
10563H8549O4719k138l3297m9657m1838j7562K5812K1155J300L5345l2709O423
$$ 88549 153268 151130 117833 68176 26338 8776 34588 55743 57043 92388 59679 66102
10551F6102L9760J6879k4376M0928N4500J3843l9748o0383m5926k6916N862J4313
$$ 66102 105862 122741 98365 139293 193793 207636 167888 107505 61579 34663 40525 54838
10539E4838j0691j8105L1744q415J9730L1749N4346K564m5250n0857L483P2364
$$ 54838 44147 26042 57786 49371 69101 100850 155196 157760 112510 61653 65136 137500
10527A37500L1318m7943m108P8091O302l5252j6012j2690k0168j9887J0061Q758
$$ 137500 168818 120875 116767 194858 201160 165908 149896 137206 117038 97151 107212 115970
10515A15970k4622q1928m3997R4895N7361m1856j5110K5512K3729j1353j7302
$$ 115970 91348 9420 -34577 60318 117679 75823 60713 86225 109954 98601 81299
10504H1299k0169R00r387Q0896l6351o0318K8862P721k719J6636l5185K1543n5744
$$ 81299 61130 62030 52643 133539 97188 36870 65732 73453 70734 87370 52185 73728 17984
10491A7984o1463K4251J5547L8840L1675k7075l2764l486j140m9357r492j7597
$$ 17984 -43479 -19228 -3681 35159 66834 39759 6995 3509 2369 -46988 -56480 -74077
10479g4077J5524L5200N7788O5414q059o913k0667m0561k2192N1305k6513J062
$$ -74077 -58553 -23353 34435 99849 91790 84877 64210 23649 1457 52762 26249 27311
10467B7311p813J5254J5903k9320m1911n542L7555J6138j3863M9444K8111j128
$$ 27311 19498 34752 50655 21335 -20576 -26118 11437 27575 13712 63156 91267 90139
10455I0139m8743j5650N1068L4355K4948N7741n37o0970m4674k4729j0169J8848
$$ 90139 41396 25746 76814 111169 136117 193858 193321 132351 87677 62948 52779 71627
10443G1627m1934Q766R394J965J6590k6420n5277Q341K6351K7679O008J9638r774
$$ 71627 29693 38459 47853 49818 66408 39988 -15289 -6948 19403 47082 53090 72728 62954
10430F2954m9756L3627j5477N5427N5255M3823k2651l1402K8722k6265j9873k3560
$$ 62954 13198 46825 31348 86775 142030 185853 163202 131800 160522 134257 114384 90824
10418I0824k102p0781j6823O2785O618M1778M256l7717r411J6698j0880p562p8675
$$ 90824 88722 17941 1118 63903 70521 112299 116555 78838 69427 86125 75245 67683 -10992
10405a0992l2447L332J2202J1208K2971O776J9618L9587n853l5931j3298K239
$$ -10992 -43439 -40107 -27905 -16697 6274 13050 32668 72255 66402 30471 17173 19412
10393A9412j9783M7466L8410o7308l1343J4635L9602K5125K4579L0064J3882L5891
$$ 19412 -371 47095 85505 18197 -13146 1489 41091 66216 90795 120859 134741 170632
10381A70632m5282p8948k7269l6566L1420L3071K7581l1604l8294k7635O8534
$$ 170632 125350 46402 19133 -17433 13987 47058 74639 43035 4741 -22894 45640
10370D5640j9515K7339N2182M5814L343k8923j2574l4972j1822M8293L7995k2587
$$ 45640 26125 53464 105646 151460 154803 125880 113306 78334 66512 114805 152800 130213
10358A30213n4476l5243M3189k0818o7033n750N1866L4999j8620m1122m0399l7290
$$ 130213 75737 40494 83683 62865 -4168 -9918 41948 76947 58327 17205 -23194 -60484
10346f0484J4259P8124L2391J5789K6146n8594M2015M5697J0l8696O76R41k5665
$$ -60484 -46225 31899 64290 80079 106225 47631 89646 135343 135353 96657 97333 98274 72609
10333G2609L6676M5895p883m2433l0516Q712O0618J7403j8610n1188q0774n6376
$$ 72609 109285 155180 147297 104864 74348 83060 143678 161081 142471 91283 10509 -45867
10321d5867k223M9950J28842N9051O516l0402o6673r3934m8824n1220R9958P5957
$$ -45867 -48090 1860 130702 189753 196269 165867 99194 5260 -43564 -94784 5174 81131
10309H1131L3323M124o8360j9662k342J6077R185J5974N0254l5569P507j3134
$$ 81131 114454 118578 50218 30556 28214 44291 53476 69450 119704 84135 91642 78508
10297G8508L5073L508J3514J6521l0605m3339k8278p404j4642M6341K7275P775
$$ 78508 113581 117089 130603 147124 116519 73180 44902 37498 22856 69197 96472 104247
10285A04247l5944k1666J2398m0955L8128L0197K3914J213m6762k7420m3069J6757
$$ 104247 68303 46637 59035 18080 56208 86405 110319 111532 64770 37350 -5719 11038
10273A1038P0547Q1546k2068k8608j4871o7417k8406L0968P640j8179J0828j2677
$$ 11038 81585 163131 141063 112455 97584 30167 1761 32729 40369 22190 33018 20341
10261B0341p6292q123K0030J365N7952N7970k1218k6381r776n162k4460J1568
$$ 20341 -55951 -64074 -44044 -42679 15273 73243 52025 25644 15868 10706 -13754 -2186
10249b186O278l5718J4167l0018n00L5479J7591R968N7821K6635J459l2356n5933
$$ -2186 4092 -31626 -17459 -47477 -47977 -12498 5093 15061 72882 99517 100976 68620 12687
10236A2687q719J7584K8316O43m1073K9204P4134J8947K7239M0278m608l3365
$$ 12687 3968 21552 49868 50511 9438 38642 112776 131723 158962 199240 194632 161267
10224A61267K2946j1293K7555K2880P088k4446l7425l7520m2722K83l7044k8784
$$ 161267 184213 172920 200475 223355 230443 205997 168572 131052 88330 88613 51569 22785
10212B2785J3358P4455O7568K0913j4682j1967k4445j00083l8661M7832N2830
$$ 22785 36143 110598 178166 199079 184397 172430 147985 47902 9241 57073 109903
10201A09903j824l8172k6304K1336j1805k8823j6522J5502L1830K2473k2647n9524
$$ 109903 108079 69907 43603 64939 53134 24311 7789 23291 55121 77594 54947 -4577
10189d577J1036K1166K0875L4952N2860m9665j2494M531Q733M1476m0224n5940
$$ -4577 6459 27625 48500 83452 136312 86647 74153 78684 87417 128893 88669 32729
10177C2729M1327O5148l7382q8839J453l6820K0647n2214j2710O587L4875P1441
$$ 32729 74056 139204 101822 12983 14436 -22384 -1737 -53951 -66661 -60074 -25199 46242
10165D6242j5737m8748L3778j8629K3302k6428k2627P523o053M5804P8113N2076
$$ 46242 30505 -18243 15535 -3094 20208 -6220 -28847 -21324 -27377 18427 96540 148616
10153A48616n3538m6624k7881l3308k0129J5356o858L331J8087J4736k4411L0351
$$ 148616 95078 48454 20573 -12735 -32864 -17508 -24366 -21035 -2948 11788 -12623 17728
10141A7728L4351m3302L3061N0127q691o6158j0024j9074L078Q133j1598l0161
$$ 17728 52079 8777 41838 91965 83274 17116 7092 -11982 -8904 -771 -12369 -42530
10129d2530j5377J7621J3234L4105K6969K2952L9157l1229l9018m780n653j2168
$$ -42530 -57907 -40286 -27052 7053 34022 56974 96131 64902 25884 21104 15451 3283
10117C283K4298k0040K9337L7478l3247J4103j6307m358l4877l2629P0620K0575
$$ 3283 27581 7541 36878 74356 41109 55212 38905 34547 -330 -32959 37661 58236
10105E8236o771j8960L4279l0037l7228Q5268J1720k59k471k1827K3338M5337
$$ 58236 51465 32505 66784 36747 -481 84787 96507 96248 93777 71950 95288 140625
10093A40625k6675J191M448J533l2616o591j7130q1956N754P7766p946l6178Q014
$$ 140625 113950 115141 119589 121122 88506 81915 64785 -17171 -11417 66349 58403 22225 30239
10080C0239J1385J5678l6200K7381M932j5427R353j3392j9482J3816N3416m3252
$$ 30239 41624 57302 21102 48483 53415 37988 47341 33949 14467 28283 81699 38447
10068C8447k7987J8993k9722K56q647j4750M360j932n157j3305m146J2400j8040
$$ 38447 10460 29453 -269 -13 -8660 -23410 -19050 -20982 -26139 -39444 -43590 -31190 -49230
10055d9230K3879k429K6079O6227J7500L6355K8007M3466N5932Q590l9956p2252
$$ -49230 -25351 -27780 -1701 64526 82026 118381 146388 189854 245786 254376 214420 142168
10043A42168l0204j1912l1235p7803j849l324l0065j856K5575J7554k2931K9881
$$ 142168 111964 100052 68817 -8986 -10835 -14159 -44224 -46080 -20505 -2951 -25882 3999
10031C999l0010L5788Q0649J5696O7466j4298m3403m8677n1345j11502K5794p866
$$ 3999 -26011 9777 90426 106122 173588 159290 115887 67210 15865 -95637 -69843 -77709
10019g7709q365L693M5222Q9192P8092L6786n4157n041L346j5863J7248m6159
$$ -77709 -86074 -82381 -37159 52033 130125 166911 112754 107713 111059 95196 112444 66285
10007F6285r4989M0914J13555k6646n3641k6667L6326j0369j5657P212N0218j431
$$ 66285 -28704 12210 125765 99119 45478 18811 55137 44768 29111 36323 86541 85110
9995H5110j6226L3998J8948p978o1855p7874k5518J5281K579l0722L3590M3160
$$ 85110 68884 102882 121830 113852 51997 -25877 -51395 -36114 -33535 -64257 -30667 12493
9983A2493J8194j0895j5934K8184j7101M9263J1819p0546m8145n443j6090J4695
$$ 12493 30687 19792 3858 32042 14941 64204 76023 5477 -42668 -48111 -64201 -49506
9971d9506j252k8716K8402L935l4620m3407m9041L6887R1935N1481J4798J6280
$$ -49506 -50758 -79474 -51072 -47137 -81757 -125164 -174205 -137318 -45383 6098 20896 37176
9959C7176r487j7406l3636P744N050L1666L8082o822k6342J8905j6225M953K1350
$$ 37176 27689 10283 -23353 -15609 -10559 21107 59189 52367 26025 44930 28705 33658 55008
9946E5008m5148n6238m9089O5493L8880r688L0887N5189j0895K791j0727P797
$$ 55008 9860 -46378 -95467 -29974 8906 -782 30105 85294 74399 77190 66463 74260
9934G4260l8076o3196M2370K2812q3988J1995M205j491L1742j0373R571J9150
$$ 74260 36184 -27012 15358 38170 -45818 -33823 -29618 -31109 633 -9740 -169 18981
9922A8981p104j7738l0428L1213J0718k1806J2991j3484L5680L8805l9250o8529
$$ 18981 11877 -5861 -36289 -5076 5642 -16164 -3173 -16657 19023 57828 18578 -49951
9910d9951R246M2616L5465k0386n2546O2154K817o8356q564J5768J8403L9124
$$ -49951 -40705 1911 37376 16990 -35556 26598 29415 -38941 -47505 -31737 -13334 25790
9898B5790j5946L5823k66K4905O567l6782M2228R109J2120m6749l0540K9702K7572
$$ 25790 9844 45667 45401 70306 76873 40091 82319 91428 103548 56799 26259 55961 83533
9885H3533k6528m10J2200l5590l9184j7337j851K9989O994K2034l4201m819j8710
$$ 83533 57005 56595 68795 33205 -5979 -23316 -25167 4822 11816 33850 -351 -5170 -23880
9872b3880M9227r066k5782L2919L0978N5886j1001k5960n3317j8342P572M0379
$$ -23880 25347 16281 -9501 23418 54396 110282 99281 73321 20004 1662 9234 49613
9860D9613J3313o02j0567j5742N5008P9323K1126l3191r4551k9051k5065J1686
$$ 49613 62926 62324 51757 36015 91023 170346 191472 158281 63730 34679 9614 21300
9848B1300L4233j7132n4731k3273r033J8908O558M3273n073P8738l1189j0718
$$ 21300 55533 38401 -16330 -39603 -48636 -29728 -23170 20103 15030 93768 62579 51861
9836E1861K2274o7595l0335k819k8319l6620j286K0817N073M2316K398J5742J3065
$$ 51861 74135 6540 -23795 -26614 -54933 -91553 -92839 -72022 -66949 -24633 -22235 -6493 6572
9823F572M967o372k9403o736N2478L8784K2443m9175p4077K1226N6357R024k6696
$$ 6572 11539 5167 -24236 -30972 21506 60290 82733 33558 -40519 -19293 37064 46088 19392
9810A9392n941L8225J928L8015o501j3167J9886K3420m3297o5252l1556J905M3832
$$ 19392 13451 51676 53604 91619 85118 71951 91837 115257 71960 6708 -24848 -22943 20889
9797B0889J1040J3238m8314J7919j2238j6621l9958M7401K3878J7211k0908J3772
$$ 20889 31929 45167 -3147 14772 2534 -14087 -54045 -6644 17234 34445 13537 27309
9785B7309Q4035j5724j4961K7513n807o4170O060J6260k498J0642p0831k6135
$$ 27309 111344 95620 80659 108172 102365 38195 44255 60515 58017 68659 -2172 -28307
9773b8307j5765l0093L6909P7089L7737M5102P47k7309m7793l6325M2533k9126
$$ -28307 -44072 -74165 -37256 39833 77570 122672 123419 96110 48317 11992 54525 25399
9761B5399J5647j7537j3010J0094n98K7231k3490M4076K3279k300J5563l744j8997
$$ 25399 41046 23509 10499 20593 19995 47226 23736 67812 91091 88791 104354 100610 81613
9748H1613N2981q3867m3129L4303P4847j557n6488j4473n2239j439L5815j1587
$$ 81613 134594 50727 7598 41901 116748 115191 58703 44230 -8009 -9448 26367 14780
9736A4780P197j5899m2668L7621K3621n568J8623L3319m6178m6134k7861R285
$$ 14780 21977 6078 -36590 1031 24652 19084 37707 71026 24848 -21286 -49147 -39862
9724c9862K7507K0250j19J8249n68q230l2017j3563K7505N1488K9828j7308o1692
$$ -39862 -12355 7895 7776 26025 25457 17227 -14790 -28353 -848 50640 80468 63160 1468
9711A468J2005j1529P415N3980M8911j3953J3773j8432J6631j5921Q692k3820
$$ 1468 13473 1944 9359 63339 112250 98297 112070 93638 110269 94348 103040 79220
9699G9220Q143j5590j612K0177l496M12K0709J3035l2379o2482j5583J9773n1012
$$ 79220 87363 71773 70161 90338 86842 87254 107963 120998 88619 26137 10554 30327 -20685
9686b0685L765L5772O3724N303n3122k5617r647K0540J02884k2959o8038J7703
$$ -20685 -16920 18852 82576 87879 34757 9140 -507 20033 122917 99958 31920 49623
9674D9623L9981l3777M911M3334l5990m8361L3920J4566J6470M3228n9711m3022
$$ 49623 89604 55827 60738 104072 68082 19721 53641 68207 84677 127905 68194 25172
9662B5172L5023J4349k554P259k5241l4740k29n0386q20M1493N1076J5255j5623
$$ 25172 60195 74544 71990 79249 54008 19268 19039 -31347 -32167 9326 60402 75657 60034
9649F0034m9555n2231L8473J7441k2755K3780J5474J0572l2863P807m5914l3455
$$ 60034 10479 -41752 -3279 14162 -8593 15187 30661 41233 8370 16177 -29737 -63192
9637f3192J2618r5085M205J6903L9723P3700Q3518L433n5827Q039k0775L5715
$$ -63192 -50574 -145659 -141454 -124551 -84828 -11128 72390 75823 19996 28035 7260 42975
9625D2975m5467m6282K542M1482l4792J4451L1251J7685j6646l1047K7723k0366
$$ 42975 -2492 -48774 -46232 -4750 -39542 -25091 6160 23845 7199 -23848 3875 -16491
9613a6491n0216Q353J6677N6536j8873k1806k4733j4730K1923P0432M9463p48
$$ -16491 -66707 -58354 -41677 14859 -4014 -25820 -50553 -65283 -43360 27072 76535 75787
9601G5787l2400J3188J0390j2139l6542K3903J7550j9518K76n3174O101j3015
$$ 75787 43387 56575 66965 54826 18284 42187 59737 40219 40495 -12679 -6578 -19593
9589a9593L3626K7066M5618m1280p3524L080J8165K0501n364O986k0325K6246
$$ -19593 14033 41099 86717 45437 -28087 -25007 -6842 13659 8295 15281 -5044 21202
9577B1202o190J5754O9673K8470L8167p832J892p031n8191j4761m942m508q351
$$ 21202 15012 30766 100439 128909 167076 159244 161136 154105 95914 81153 76211 71703 63352
9564F3352m04r770o021o0785j696N4195N3574l891k9585l7760K4051r083r374
$$ 63352 62948 53178 47157 -13628 -15324 38871 92445 88554 58969 21209 45260 36177 26803
9551B6803o0409P9781R3697q017m5017j01175k9835K4156p472l3254N1269R9533
$$ 26803 -33606 46175 139872 131855 86838 -14337 -44172 -20016 -27488 -60742 -9473 90060
9539I0060j6425q9811o2088k289j0958O0277J11293J9600Q113L1210l6890l1867
$$ 90060 73635 -16176 -78264 -80553 -91511 -31234 80059 99659 107772 138982 102092 70225
9527G0225L0489L3013l5062l0204l1229j8853K0395M1370J6042k0371k7495k9204
$$ 70225 100714 133727 98665 68461 37232 18379 38774 80144 96186 75815 48320 19116
9515A9116P800M0263N6605p976j6952L7952l9221l3289k204j6462J9716j4599
$$ 19116 26916 67179 123784 115808 98856 136808 97587 64298 62094 45632 65348 50749
9503E0749L2577O9188O988P085j6270m5591k6554k1456k8043j4555M2653O6372
$$ 50749 83326 152514 159502 166587 150317 104726 78172 56716 28673 14118 56771 123143
9491A23143M0003p4385k4942l8500k2127l7973O400K1681K7226K6728M3372o35
$$ 123143 163146 88761 63819 25319 3192 -34781 -28381 -6700 20526 47254 90626 89991
9479H9991p6776K0502L1350J2350J563k8207k8557m0705K0494O3328k1490o8961
$$ 89991 13215 33717 65067 77417 78980 50773 22216 -18489 2005 65333 43843 -25118
9467b5118q796J6833j4854p985L7954K1692j3498K223L8543j7985p739l151j3691
$$ -25118 -33914 -17081 -31935 -39920 -1966 19726 6228 8451 46994 29009 21270 18119 4428
9454D428p0822p888l0519M3025O5031L5275K4079O224k2845N2045M3836L575j7929
$$ 4428 -66394 -74282 -104801 -61776 3255 38530 62609 68833 45988 98033 141869 145444 127515
9441A27515l8139k2868j841m859j4506J6467Q890K2371K4334m4048l4694Q928
$$ 127515 89376 66508 64667 59808 45302 61769 70659 93030 117364 73316 38622 47550
9429D7550o2042k2448Q8841M7360J8184n3565j6575M5331j1422l0928o9666J4351
$$ 47550 -14492 -36940 51901 99261 117445 63880 47305 92636 81214 50286 -19380 -5029
9417e029J6087J2823j7059j3542J10844M8501m165j3841L7867K9925k2404p9580
$$ -5029 11058 23881 6822 -6720 104124 152625 148460 134619 172486 202411 180007 100427
9405A00427m835j8063J8998M311q864K3938j5839m73N3627j3842p9779M6887k2203
$$ 100427 95592 77529 96527 100838 91974 115912 100073 99600 153227 139385 59606 106493 84290
9392H4290n9845L6973J9033k9436N433O5488K512J6449j4960k3592O0500N703
$$ 84290 24445 61418 80451 51015 56448 121936 124448 140897 125937 102345 162845 168548
9380A68548q1318l1630J2003k7367j2857J08615j2658k2877j4699j2032N5762
$$ 168548 87230 55600 67603 40236 27379 135994 123336 100459 85760 73728 129490
9369A29490J7010o191J671K7211N463j6824o2857O885K5003n1848K6979K5210
$$ 129490 146500 140309 141980 169191 174654 157830 94973 101858 126861 75013 101992 127202
9357A27202j3695O848k834j9080l0046K4029j0580j512J1340J0123K3672N625
$$ 127202 113507 120355 117521 98441 68395 92424 81844 80332 91672 101795 125467 131092
9345A31092n438n3036j1317M4990n3449l4558J897L2317J22473k6692m8220N3343
$$ 131092 125654 72618 61301 106291 52842 18284 20181 52498 174971 148279 100059 153402
9333A53402j7624m451K4328j6551L5573N7161K2079J2535p3280p3304j398Q5073
$$ 153402 135778 131327 155655 139104 174677 231838 253917 266452 193172 119868 118470 203543
9321B03543o947n5830q3092L8558O2537K5125j5836L9620o4230P393R5668N1110
$$ 203543 196596 140766 57674 96232 158769 183894 168058 207678 143448 150841 246509 297619
9309B97619J7210n1648l1175L7601J1042j0656m8008J1125N7657K2327l1988j952
$$ 297619 314829 263181 232006 269607 280649 269993 221985 233110 290767 313094 281106 279154
9297B79154j5782l4458N7754J9243l9631j8785p112k7234k114L1877L3093P652
$$ 279154 263372 228914 286668 305911 266280 247495 240383 213149 211035 242912 276005 283657
9285B83657l694O2768J5122o8354M6523M6221M4261j5604m0097K0509j9305K1670
$$ 283657 279963 342731 357853 289499 336022 382243 426504 410900 370803 391312 372007 393677
9273C93677N5789k3792k9912n131k8388P4233M1646J3343k679q9590P772K9716
$$ 393677 449466 425674 395762 390631 362243 436476 478122 491465 488786 399196 406968 436684
9261D36684O3493N1975O5731m2433k1553N6818J0134j6214J9359K1730m5692n185
$$ 436684 500177 552152 617883 575450 553897 610715 620849 604635 623994 645724 600032 594847
9249E94847L7550N4692M4273J5920J27594L8322r506O535K3599L9789J5839J9565
$$ 594847 632397 687089 731362 747282 874876 913198 903692 910227 933826 973615 989454 1009019
9237A009019O2576P9270O5795M6761L5341M8715J3540l858Q7611O2762N5187P5986
$$ 1009019 1071595 1150865 1216660 1263421 1298762 1347477 1361017 1357159 1444770 1507532 1562719 1638705
9225A638705J09692J17520N0278O6839J18026J74137J28270J55575J47020J35160
$$ 1638705 1748397 1865917 1916195 1983034 2101060 2275197 2403467 2559042 2706062 2841222
9215B841222J89889K76399K98167K46350K64726J68098k3515r3112L7067J04212
$$ 2841222 3031111 3307510 3605677 3852027 4116753 4284851 4261336 4168224 4205291 4309503
9205D309503J02406P8404N2462M2506J00064J37297L3798K1921L4917O1741M1321
$$ 4309503 4411909 4490313 4542775 4585281 4685345 4822642 4856440 4878361 4913278 4975019 5016340
9194E016340o9261r6551n9633m5080r3746j06048j03676r2250j03423j21155o4366
$$ 5016340 4947079 4850528 4790895 4745815 4652069 4546021 4442345 4350095 4246672 4125517 4061151
9183D061151j12255j50539p5952r4686j39189j04809j14163m9837q3057j18253
$$ 4061151 3948896 3798357 3722405 3627719 3488530 3383721 3269558 3219721 3136664 3018411
9173C018411n0263l6511N9672P6570J81188K72729K38207K04348L2935l43188
$$ 3018411 2968148 2931637 2991309 3067879 3249067 3521796 3760003 3964351 3997286 3654098
9163C654098n24640l65687k05353j20158j35204j49239q6214l8953j43504p1878
$$ 3654098 3129458 2763771 2558418 2438260 2303056 2153817 2067603 2028650 1885146 1813268
9153A813268n2928l5383m5934J070o0515q0031q4214m4114J6979M439n7099n3595
$$ 1813268 1760340 1724957 1679023 1680093 1619578 1539547 1455333 1411219 1428198 1432637 1375538 1321943
9141A321943o1877j3729l7345l6937J1751j616l1974o7942o6668l0962l1565K3250
$$ 1321943 1260066 1246337 1208992 1172055 1183806 1182190 1150216 1082274 1015606 984644 953079 976329
9129I76329P72L3288N0711J5862J4612P9726J86652J34215Q4825O0711q1885k21604
$$ 976329 977101 1010389 1061100 1076962 1091574 1171300 1357952 1492167 1576992 1637703 1555818 1334214
9117A334214k06145j13950k6760r2074l9354L1991q8084q3932l3576L0763j756
$$ 1334214 1128069 1014119 987359 895285 855931 887922 799838 715906 682330 713093 711337
9106G11337k7520o0374l5178N0749L0499j9003m2004m0699K5024J4596l0258m2609
$$ 711337 683817 623443 588265 639014 669513 650510 608506 567807 592831 607427 577169 534560
9094E34560k0935j3351m8827K622k0170p8621k7832L2092k1247N1283L210L8920
$$ 534560 513625 500274 451447 454069 433899 355278 327446 359538 338291 389574 392784 431704
9082D31704k1639k5501n3230q273p4317J5732L8495L7723N0409k7227N1604n167
$$ 431704 410065 384564 331334 323061 248744 264476 302971 340694 391103 363876 415480 410313
9070D10313j2893l7247j0078N2522o6716o276q6956m8944l5971n537j9990o865
$$ 410313 397420 360173 350095 402617 335901 329625 242669 193725 157754 152217 132227 125362
9058A25362K9784L0435O3343k7293K3980N1214q923J0258j3252k4302J4730m8187
$$ 125362 155146 185581 248924 221631 245611 296825 287902 298160 284908 260606 275336 227149
9046B27149n1223j6125k4848J2034O876J2709K4931K6025J0408M15j1324M942
$$ 227149 175926 159801 134953 146987 153863 166572 191503 217528 227936 228351 217027 221969
9034B21969J4684k0717M62k7564J6898k5578K8672L9725L5648k1531l852Q168
$$ 221969 236653 215936 216398 188834 205732 180154 208826 248551 284199 262668 258816 266984
9022B66984j4556p2599j8950J3265L7978L4879j1040L0490r821r2257L4149N6758
$$ 266984 252428 179829 160879 174144 212122 247001 235961 266451 256630 164373 198522 255280
9010B55280o0980l0291N3152O2280O8980M1800J592j6492j5386j8086R861p7425
$$ 255280 194300 164009 217161 279441 348421 390221 391813 375321 359935 341849 351710 274285
8998B74285m9342l5120n4511L2142P1828m308n847j4973l1492J5353j6422K9841
$$ 274285 224943 189823 135312 167454 239282 234974 229127 214154 182662 198015 181593 211434
8986B11434M2613j0470j2286j208p1229k8064k0389j5386Q849K1529O683M1334
$$ 211434 254047 243577 231291 230083 158854 130790 110401 95015 103864 125393 132076 173410
8974A73410N8995J8591q6560p7398K5119J05952M7541J524K9255L5190P4890P4470
$$ 173410 232405 250996 164436 87038 112157 218109 265650 267174 296429 331619 406509 480979
8962D80979M4404m1909L299M2075k8408o6075j55281j35225j941K2983J4277o541
$$ 480979 525383 483474 486773 528848 500440 434365 279084 143859 141918 164901 179178 172637
8950A72637j3377N1376j862l4071p9211n8325J8456P3589K2368J932O7110J8489
$$ 172637 159260 210636 208774 174703 95492 37167 55623 129212 151580 153512 220622 239111
8938B39111j6905k8010m9216L2707J3323L7383L7184J1131N0588Q3910L0034K471
$$ 239111 222206 194196 144980 177687 191010 228393 265577 276708 327296 411206 441240 443711
8926D43711n1292k1135M2385j0953k3798M5476L2246Q3856O0777l946n0480n679
$$ 443711 392419 371284 413669 402716 378918 424394 456640 540496 601273 597327 546847 541168
8914E41168M0045l4729l4225m6326n2628o333j6765j7566K0086l3133k6993k4562
$$ 541168 581213 546484 512259 465933 413305 406972 390207 372641 392727 359594 332601 308039
8902C08039j5180N160L8814N0834O8233O7332Q0829O631N2107j6797j09176N632
$$ 308039 292859 298019 336833 387667 455900 523232 604061 610692 662799 646002 536826 542458
8890E42458L0128L5995L2344J9861J80054K14116J35382J11175L6047J2054J05466
$$ 542458 572586 608581 640925 660786 840840 1054956 1190338 1301513 1337560 1349614 1455080
8879A455080J61026L40837O23224P21526N61679K59077k09911o44686p11411n33851
$$ 1455080 1616106 1956943 2580167 3301693 3863372 4122449 3912538 3267852 2556441 2022590
8869B022590l66092j57351j30335r8908k0244j2429n882K2244K86N5547j6798
$$ 2022590 1656498 1499147 1368812 1269904 1249660 1237231 1231349 1253593 1253879 1309426 1292628
8858A292628m9086k56P768l4596l463P4958R4489O4015L1278J8339k0727n221
$$ 1292628 1243542 1243286 1251054 1216458 1212995 1287953 1382442 1446457 1477735 1496074 1475347 1470126
8846A470126j5980k3542L9006M4084M1730J52347J50447J40959J70758J32925
$$ 1470126 1454146 1430604 1469610 1513694 1555424 1707771 1858218 1999177 2169935 2302860
8836B302860J43496J62191J26363K16250K91000L48322M29344M90797N58798N91805
$$ 2302860 2446356 2608547 2734910 2951160 3242160 3590482 4019826 4510623 5069421 5661226
8826E661226P82754R86069J197288J348514J688925K518476L514615N098964P684726
$$ 5661226 6443980 7430049 8627337 9975851 11664776 14183252 17697867 22796831 30481557
8817C0481557J2219836J9580756K8829896L2949881K7038984J5641572o734372
$$ 30481557 42701393 62282149 91112045 124061926 151100910 166742482 160008110
8810A60008110l4698482l8174168k4852486j4405190q598955n345038l523614
$$ 160008110 125309628 87135460 62282974 47877784 39278829 33933791 30410177
8803C0410177k663782k293989k024901j651507j259819j160910j038070r52359
$$ 30410177 27746395 25452406 23427505 21775998 20516179 19355269 18317199 17364840
8795A7364840q63250o79398l98601k12199j30746j04647j06410m4487R5851L11660
$$ 17364840 16501590 15822192 15423591 15211392 15080646 14975999 14869589 14825102 14920953 15232613
8785A5232613N62364P08576Q22675R98948J253509J631619J916503K137792K953909
$$ 15232613 15794977 16503553 17326228 18325176 19578685 21210304 23126807 25264599 28218508
8776B8218508M256472O164996R210658J3977541K2362273L6839005N7484016O8555070
$$ 28218508 32474980 38639976 47850634 61828175 84190448 121029453 178513469 247068539
8768B47068539N6192191L6379328p913528p3543415q1679651n1928362k9577161
$$ 247068539 303260730 339640058 331726530 258183115 176503464 124575102 94997941
8761I4997941j7323372j0753629p135801n243630m404816l883062l257820k646622
$$ 94997941 77674569 66920940 59785139 54541509 50136693 46253631 42995811 40349189
8753D0349189k386806k169873k042335k070920j951881j515240j020915p68137
$$ 40349189 37962383 35792510 33750175 31679255 29727374 28212134 27191219 26423082
8745B6423082p30404o53004o32366n39534l73352k13052k2767r230J03332K10355
$$ 26423082 25692678 25039674 24407308 23867774 23494422 23281370 23258603 23249373 23352705 23563060
8735B3563060L77154N99562Q37104J113706J713476K730371M245357O623701J0495809
$$ 23563060 23940214 24539776 25376880 26490586 28204062 30934433 35179790 41803491 52299300
8726E2299300J6734139K5301681L0987616K6818902J7025868j512330k9568426
$$ 52299300 69033439 94335120 125322736 152141638 169167506 167655176 138086750
8719A38086750l9241764k7373303j6034754r472590n926830l921707k897927k452899
$$ 138086750 98844986 71471683 55436929 45964339 40037509 36115802 33217875 30764976
8711C0764976k139029j819613j478739j313732j165994j138857j218711j174944
$$ 30764976 28625947 26806334 25327595 24013863 22847869 21709012 20490301 19315357
8703A9315357r74776p24986n89320m87660m86968n34303m94701m29801l90664
$$ 19315357 18340581 17615595 17026275 16538615 16051647 15517344 15022643 14592842 14202178
8694A4202178m28702l94023l40985k76059m25819m00790l75171m05247m03089
$$ 14202178 13773476 13379453 13038468 12762409 12336590 11935800 11560629 11155382 10752293
8685A0752293l76607k23665j52983j16484k40091k46652l17819l10603l01788
$$ 10752293 10375686 10152021 9999038 9882554 9642463 9395811 9077992 8767389 8465601
8676H465601k96050k78002l03240k96324j93679j69770j90471j89438j33997j30295
$$ 8465601 8169551 7891549 7588309 7291985 7098306 6928536 6738065 6548627 6414630 6284335
8666F284335k12323k42751j72910j26687j12795q8884j51933j45731q3671q2070
$$ 6284335 6072012 5829261 5656351 5529664 5416869 5327985 5176052 5030321 4946650 4864580
8656D864580m4192k5936q2511j01603l8060j2893k6119m3023j91214k19253j01589
$$ 4864580 4820388 4794452 4711941 4610338 4572278 4559385 4533266 4490243 4299029 4079776 3978187
8645C978187p2831q8202j17242k9764o8748l6584j07344j08274o1621m1277m8936
$$ 3978187 3905356 3817154 3699912 3670148 3601400 3564816 3457472 3349198 3287577 3246300 3197364
8634C197364k192p8212j49506j47672j37720j20775k6348p3967r9357r1202K3796
$$ 3197364 3195172 3116960 2967454 2819782 2682062 2561287 2534939 2460972 2361615 2270413 2294209
8623B294209l8322j41075p9964q8739o2016L0288l4889r4025r0114K4582R2125
$$ 2294209 2255887 2114812 2034848 1946109 1884093 1914381 1879492 1785467 1695353 1719935 1812060
8612A812060M7711j4984o3742K8467N2179R0760K2820Q19N642m031K6851P842
$$ 1812060 1859771 1844787 1781045 1809512 1861691 1952451 1975271 1976090 1981732 1977701 2004552 2012394
8600B012394K2221K8619k9627k6948j8217l2628n1241r0982p7763j08932p2733
$$ 2012394 2034615 2063234 2033607 2006659 1988442 1955814 1904573 1813591 1735828 1626896 1554163
8589A554163r1666p3252l1779l8915P878k0225m78j6415m6830m7156p9143j57490
$$ 1554163 1462497 1389245 1357466 1318551 1326429 1306204 1305726 1289311 1242481 1195325 1116182 958692
8577I58692j33005l0526L8156N6038l157o7721k2569L5412L3864j7558r5591j18928
$$ 958692 825687 795161 833317 889355 886198 818477 795908 831320 865184 847626 752035 633107
8565F33107n640N3313J6118K9192L0924L6278j2936k2388k6445J1972j7171l5033
$$ 633107 627467 680780 696898 726090 757014 793292 780356 757968 731523 743495 726324 691291
8553F91291p9640r4305J80O6904K9492Q021J2126p337q89l5620K425L9714R626
$$ 691291 611651 517346 517526 584430 613922 621943 634069 626732 625843 590223 592648 632362 641988
8540F41988K0818M5602l8616o6945L0512P0837L5964K0057j61111j33379K2364
$$ 641988 662806 708408 669792 602847 633359 704196 740160 760217 599106 465727 488091
8529D88091n855J6689p510o9238l3852L2142l9j9074L1218P1002J4813L9921M5925
$$ 488091 482236 498925 491415 422177 388325 420467 420428 401354 432572 503574 518387 558308 604233
8516F04233N651k6550k7067k6045k2699P369j4059j8889K1893K418j7419L4661
$$ 604233 609884 583334 556267 530222 507523 514892 500833 481944 503837 506255 488836 523497
8504E23497k6724J1043k0574j6607K4695n2054j7980K914m6994n7454p3182l1737
$$ 523497 496773 507816 487242 470635 495330 443276 425296 428210 381216 323762 250580 218843
8492B18843p73N6169Q928l115q607l457M2376k318n7293M0152K9235M0328M3232
$$ 218843 218070 274239 283167 280052 271445 267988 310364 308046 250753 290905 320140 360468 403700
8479D03700M147j1340J6572m9117P592J5447J3870k6126L0025j9975o8125l9736
$$ 403700 407847 396507 413079 363962 371554 387001 400871 374745 404770 384795 316670 276934
8467B76934j1476M16O9989R2656K445o7009j7748m5714l0292L5647j4919m6975
$$ 276934 265458 265874 335863 428519 430964 363955 346207 300493 270201 305848 290929 243954
8455B43954j7990q828q749P179m7668o2182K0595P6591N4872l6863k670r209L7980
$$ 243954 225964 217136 208387 215566 167898 105716 126311 202902 257774 220911 218241 209032 247012
8442B47012j3484n0253j4516J1662J1020J1090M5346J932J6471J084k4709k3534
$$ 247012 233528 183275 168759 180421 191441 202531 247877 249809 266280 267364 242655 219121
8430B19121o043J2334j6424K8851N1754l008j5357m0486K1707J7297r304l4710
$$ 219121 213078 225412 208988 237839 289593 286585 271228 230742 252449 269746 260442 225732
8418B25732n0991L8762K4178L5494Q2960J20906J21583J65712J50094J22816J28241
$$ 225732 174741 213503 237681 273175 356135 477041 598624 764336 914430 1037246 1165487
8407A165487m193j61944k48275j96973q6089m6556p6030l6459l0046K5532j2013
$$ 1165487 1161294 999350 751075 554102 468013 421457 345427 308968 278922 304454 292441
8396B92441k2534k4130k1836K1441R675p2625p024k8646K7299J4202m3432J5175
$$ 292441 269907 245777 223941 245382 255057 182432 175408 146762 174061 188263 144831 160006
8384A60006M0747J0224O8481k1857m8799j4679L570K9462j6121L6666L6038J3677
$$ 160006 200753 210977 279458 257601 208802 194123 197693 227155 211034 247700 283738 297415
8372B97415O6897p20K7991R3198K05767J89434K30638L37342K81736J69868L3422
$$ 297415 364312 363592 391583 484781 690548 879982 1110620 1447962 1729698 1899566 1932988
8361A932988k76068m78726l08886j19311j29716j05812j03377k8583j9222J7702
$$ 1932988 1656920 1178194 869308 749997 620281 514469 411092 382509 363287 380989
8351C80989j6794j3874k3194n1835K2187k7195m718j8860k140l0107l1409j3065
$$ 380989 364195 350321 327127 275292 297479 270284 265566 246706 244566 214459 183050 169985
8339A69985r505J5457O2728o019K1377k377M493J2767o546j7857M9053O7633J8554
$$ 169985 160480 175937 238665 232646 254023 251646 256139 268906 262360 244503 293556 361189 379743
8326C79743n1460J3471K4223M6016L1984J17008K06193J00268N6858Q7718j12694
$$ 379743 328283 341754 365977 411993 443977 560985 767178 867446 924304 1012022 899328
8315H99328k06316k11599p5656L2013l0730J993N424j7471o729K1351q7306q2130
$$ 899328 693012 481413 405757 437770 407040 409033 414457 396986 390257 411608 324302 242172
8303B42172J2904J2449K5687r552l0875P42M2814J3501k9734J050r6644o8480
$$ 242172 255076 267525 293212 283660 252785 253527 296341 309842 280108 281158 184514 116034
8291A16034L5160P8704l40m586J953k9486k9777n1270m322O9855J8703k0204N655
$$ 116034 151194 229898 229558 224972 226925 197439 167662 116392 112070 181925 200628 180424 186079
8278A86079K3123l3483m8118j3085N1238k9061K5662R1331k6167l5172k8381j6295
$$ 186079 209202 175719 127601 114516 165754 136693 162355 253686 227519 192347 163966 147671
8266A47671n128j2053k2815m27K0635N3489j5809K2588O5489l0566k5163j1424
$$ 147671 142543 130490 107675 107248 127883 181372 165563 188151 253640 223074 197911 186487
8254A86487p6596L2709P0339J2283n9040J3266j5203m2503K4063K9790J6644K8949
$$ 186487 109891 142600 212939 225222 166182 179448 164245 121742 145805 175595 192239 221188
8242B21188k9881j6134K6914M7283k378m054J8077J8821k9169q2666m722M3649
$$ 221188 191307 175173 202087 249370 246992 242938 261015 279836 250667 168001 163279 206928
8230B06928R11O004m5620j732M4710l6628n816l8108n488N357n6566J0179M44
$$ 206928 207839 213843 168223 166491 211201 174573 168757 130649 125161 130518 73952 84131 84575
8217H4575K0118Q5225J8036n1071m7913J9138L4452j7226k2805J5745J5382n6203
$$ 84575 104693 189918 207954 156883 108970 128108 162560 145334 122529 138274 153656 97453
8205I7453j947m273J9481P1875N9862k3772r006j7529j06388l8274l2899L9708
$$ 97453 95506 91233 110714 182589 242451 218679 209673 192144 85756 47482 14583 54291
8193E4291L7390J6028L653n2916j1854K8988M8168Q9907j1538o0674j326n6376
$$ 54291 91681 107709 111362 58446 46592 75580 123748 213655 202117 141443 140117 83741
8181H3741J2459p906j569j5522m365L691j826M2200k45q7927J9520L7103n765
$$ 83741 96200 88294 86725 71203 66838 70529 68703 110903 110658 22731 42251 79354 73589
8168G3589Q446N5916J2800J1147k8488j8182m2022L6844J9603M9121k0346N983
$$ 73589 82035 137951 150751 161898 133410 115228 73206 110050 129653 178774 158428 164411
8156A64411k2025L483O6307K8659j8096n2054j11841o3430J080J2395n92K4625
$$ 164411 142386 145869 212176 240835 222739 170685 58844 -4586 -3506 8889 8297 32922
8144C2922M4275L1363m8283k8776J2581J2601j4338K4342o4008p568K6396N1799
$$ 32922 77197 108560 60277 31501 44082 56683 42345 66687 2679 -4889 21507 73306
8132G3306N6383o0963l4512K2551Q4258K7615j5859k6491J8324K2055p3794n7704
$$ 73306 129689 68726 34214 56765 141023 168638 152779 126288 144612 166667 92873 35169
8120C5169J4660M5974j7259n3293L4343K4328J6938O282k9525J0527k3649L0102
$$ 35169 49829 95803 78544 25251 59594 83922 100860 107142 77617 88144 64495 94597
8108I4597j7538l4337k5651n5159J1216J6981K7215J06620Q245o4837k0258o215
$$ 94597 77059 42722 17071 -38088 -26872 -9891 17324 123944 132189 67352 47094 40879
8096D0879n4003j0706j2578q28N8809J1666n3546p7346K7859M6814P2648M6314
$$ 40879 -13124 -23830 -36408 -37236 21573 33239 -20307 -97653 -69794 -22980 49668 95982
8084I5982l9157j9002k7154J5947P2686L4398Q572k4644o3065j6239l8166K473
$$ 95982 56825 37823 10669 26616 99302 133700 142272 117628 54563 38324 158 2631
8072B631m664J6579j1685j1533Q0752L9932l8779o6602K5753M9821j5685m996
$$ 2631 -2033 14546 2861 -8672 72080 112012 73233 6631 32384 82205 66520 61524
8060F1524j3374Q454K1052J7827O4404o384p6572l2395L4227j3161M800L2082
$$ 61524 48150 56604 77656 95483 159887 153503 76931 44536 78763 65602 70402 102484
8048A02484k415k8922J6576R596j3858m2478J605K906j9598m039L460L0266k4944
$$ 102484 100069 71147 87723 97319 83461 40983 42588 45494 25896 21857 25317 55583 30639
8035C0639n2403N3653M6517k5438l0146m0712o36M9213L4294j2453M0382P337
$$ 30639 -21764 31889 78406 52968 22822 -17890 -18526 30687 64981 52528 92910 100247
8023A00247m5257l1447j0773l0953M0211P9799K3128L2860J4605l2572q742K8203
$$ 100247 54990 23543 12770 -18183 22028 101827 124955 157815 172420 139848 131106 159309
8011A59309j2371J8814j5112n9451K258M5305R279L3417k0063j6772M985K176
$$ 159309 146938 165752 150640 91189 93447 138752 148031 181448 161385 144613 149598 151774
7999A51774l519P328l8297j6084J4697N6708K1394o1769m1701j6807n9K2556R0396
$$ 151774 148255 155583 117286 101202 115899 172607 194001 132232 90531 73724 73665 96221 186617
7986A86617M8665l482K4697n0982m2121p0724o033R0l2155j2106K804L6553N7412
$$ 186617 235282 231800 256497 205515 163394 92670 86637 86727 54572 42466 45270 81823 139235
7973A39235O6750K5032m3295k9235o4074l4058N571O5283O6183J3274J0288K2162
$$ 139235 205985 231017 187722 158487 94413 60355 65926 131209 197392 210666 220954 243116
7961B43116o7791k3673k055j2775O4340k5142l5143j6767K6349p610l5333l802
$$ 243116 175325 151652 149597 136822 201162 176020 140877 124110 150459 142849 107516 103714
7949A03714j7831k441N0738J4997l741j4793K1742k2648K1446K5927j1044l0334
$$ 103714 85883 83442 134180 149177 145436 130643 152385 129737 151183 177110 166066 135732
7937A35732l7513o6161K3568Q4078r166m7365O8954l1002P707K4221o3127k1270
$$ 135732 98219 32058 55626 139704 130538 83173 152127 121125 128832 153053 89926 68656
7925F8656J2595j5010l017J6167k0096J1341o603j5602k6804J3558N3289Q0620
$$ 68656 81251 66241 63224 79391 59295 70636 64033 48431 21627 35185 88474 169094
7913A69094j0597m7087K20k5052M5L4352P207n2508l1187J3541r137M0218L0075
$$ 169094 158497 111410 111630 86578 86623 120975 128182 75674 44487 58028 48891 89109 119184
7900A19184n2659j9505M1855K2255Q519M2977n383n2688L633J95k0049n5449N1659
$$ 119184 66525 47020 88875 111130 119649 162626 157243 104555 108188 108383 88334 32885 84544
7887H4544M090n3829J742K3474l9160j4974o172M4576J8818k6150n6395O71K3571
$$ 84544 88634 34805 36547 60021 20861 5887 -285 44291 63109 36959 -19436 -18765 4806
7874D806j3239P921J8022N4442J2449J9976L669J180l6009k0199M5051K6192N0154
$$ 4806 -8433 -512 17510 71952 84401 104377 108046 109226 73217 53018 98069 124261 174415
7861A74415O3940l126k6880m0481m7175l1736j2886J411k5283j945n2249L074
$$ 174415 238355 235229 208349 167868 120693 88957 76071 77482 52199 50254 -1995 1079
7849A079J4278J8623L5124n1433m0682L3564M6753J7122P470j5954m9944m835
$$ 1079 15357 33980 69104 17671 -23011 10553 57306 74428 81898 65944 16000 11165
7837A1165M560R8465O580m7165j7454p548m8028K2867Q394M1923j0343J0017M4789
$$ 11165 15725 114190 120770 73605 56151 48603 575 23442 31836 73759 63416 73433 118222
7824A18222l9330N1412J769n2707j4682p5339l7656J4094O6093M0236l8670m2813
$$ 118222 78892 130304 132073 79366 64684 -10655 -48311 -34217 31876 72112 33442 -9371
7812i371N1743J6682k5346L6342l9978O865M0917m3281L4854K2895o2319M0822
$$ -9371 42372 59054 33708 70050 30072 36937 77854 34573 69427 92322 30003 70825
7800G0825L8532n4031n7947j8856l501K5063L3012l7886L2136L8394L776l3920
$$ 70825 109357 55326 -2621 -21477 -24978 85 33097 -4789 27347 65741 69517 35597
7788C5597l4831N9954M5734M8824N591k5463K9m6112m2443L9421p849k2631l1362
$$ 35597 766 60720 106454 155278 160869 135406 135435 89323 46880 86301 78452 55821 24459
7775B4459l2358J3346O4678K9936J7097l1871J0577p492R0851l2192o7097L0654
$$ 24459 -7899 5447 70125 100061 117158 85287 95864 88372 179223 147031 79934 110588
7763A10588j7917K1847k0673p8087o5674M2247k572Q0323J01754k2560o8949k1956
$$ 110588 92671 114518 93845 15758 -49916 -7669 -10241 70082 171836 149276 80327 58371
7751E8371k2993K7549L4154o8899k6072P6981P6624j8361j2039l0048k3412O0289
$$ 58371 35378 62927 97081 28182 2110 79091 155715 137354 125315 95267 71855 132144
7739A32144J4963k7253k0654l5087k9796p7784k9053j3104M9530L2592J7264K9901
$$ 132144 147107 119854 99200 64113 34317 -43467 -72520 -85624 -36094 -3502 13762 43663
7727D3663j7665m2905n7763n1793j047Q236J5948J9224L4300r739J6092R441J9812
$$ 43663 25998 -16907 -74670 -126463 -127510 -119274 -103326 -84102 -49802 -59541 -43449 -34008 -14196
7714a4196M089L0897q467k0896l1920j5952J06483N1252l4000Q207M2014l8002
$$ -14196 -10107 20790 12323 -8573 -40493 -56445 50038 101290 67290 75497 117511 79509
7702G9509m1498l851k8380k1472J4643L7130j6574l9054L4341N5540R946k9733
$$ 79509 38011 34160 5780 -15692 -1049 36081 19507 -19547 14794 70334 80280 50547
7690E0547k8823N3525j3601p0702n2266J3925N2355k8391p5449L0172K3669k8605
$$ 50547 21724 75249 61648 -9054 -61320 -47395 4960 -23431 -98880 -68708 -45039 -73644
7678g3644K5508J9943N2804K942K3292m374j7796l9969k2667Q098k1995R584k8370
$$ -73644 -48136 -28193 24611 27553 50845 46471 28675 -11294 -33961 -25863 -47858 -38274 -66644
7665f6644Q192Q207J7147K371J4175K9774L1871l736O601j5383K1642K3707q1515
$$ -66644 -58452 -50245 -33098 -30727 -16552 13222 45093 41357 47958 32575 54217 77924 -3591
7652c591L1198m948M8781O2871l5064n7202N507k9829j6620l9189m525K6376J6215
$$ -3591 27607 22659 71440 134311 99247 42045 47552 17723 1103 -38086 -42611 -16235 -20
7639b0P534k0888J9403j8556k9562j4436J6810K2281P335q707L0882N6314J970
$$ -20 7514 -13374 6029 -12527 -42089 -56525 -39715 -17434 -10099 -18806 12076 68390 70360
7626G0360o0975j0465j6042M1890k2547o3296J09N8280k395j2552K2759K6852
$$ 70360 9385 -1080 -17122 24768 2221 -61075 -60966 -2686 -5081 -17633 5126 31978
7614C1978k7852n6094J8108n641m9840m7808l4373M4060O5373M1858M0436J2542
$$ 31978 4126 -51968 -33860 -39501 -89341 -137149 -171522 -127462 -62089 -20231 20205 32747
7602C2747o58n6867K770O2372k3368K6182J3593J3391J905o82j2944o1228Q545
$$ 32747 32089 -24778 -22008 40364 16996 43178 56771 70162 72067 71385 58441 -2787 5758
7589E758l121J4881j1988m0902K7178Q3677L8042l5975n6851k4689j0884J1321
$$ 5758 2637 17518 5530 -35372 -8194 75483 113525 77550 20699 -3990 -14874 -3553
7577c553q317m535M6554M7527l6529n1583P603o316J132R4970l2198n5846R589
$$ -3553 -11870 -16405 30149 77676 41147 -10436 -2833 -9149 -8017 86953 54755 -1091 8498
7564H498j772m3594J8108K5884K9207l9479M2366K0213m745j9506L3000J6052
$$ 8498 6726 -36868 -18760 7124 36331 -3148 39218 59431 54686 35180 68180 84232
7552H4232P296k5999L5028j5771n0267M9021Q8309o7017j1313m56r8054k9151
$$ 84232 91528 65529 100557 84786 34519 83540 171849 104832 93519 93063 -4991 -34142
7540c4142P8531N7224J8185J6152l737m0962m083n0696J6948p642k7178j1873
$$ -34142 44389 101613 119798 135950 132213 91251 87168 36472 53420 45778 18600 6727
7528F727O665P2242n2396p0186M8248N5016j3988J4900n4804m0545j3855J290
$$ 6727 13392 85634 33238 -36948 11300 66316 52328 67228 12424 -28121 -41976 -40686
7516d0686L1874l728K3933J4300j1098M6878j2804k5828n7450j3817K9863J1820
$$ -40686 -8812 -12540 11393 25693 14595 61473 48669 22841 -34609 -48426 -18563 -6743
7504f743j4515q00L9719o0920J883P6720N7217j4950p1906L3095O8882k458q0483
$$ -6743 -21258 -22058 17661 -43259 -41376 35344 92561 77611 5705 38800 107682 105224 24741
7491B4741k5953K4463N9289K0583m2434k6507L0136J4538M180j9495o0170J1377
$$ 24741 -1212 23251 82540 103123 60689 34182 64318 78856 83036 63541 3371 14748
7479A4748M0112m5998K400j8966M6550K0553n1312o2339k0864M7017K0321l5083
$$ 14748 54860 8862 11262 -7704 38846 59399 8087 -54252 -75116 -28099 -7778 -42861
7467d2861M638n889k8046p3904j5275L7256M5340M7198K6568k1068K6500m0295
$$ -42861 -38223 -44112 -72158 -146062 -161337 -124081 -78741 -31543 -4975 -26043 457 -39838
7455c9838L2195P0706k9083l0863j8781K4222K09J8211n5495j2489l373j9983
$$ -39838 -7643 63063 33980 3117 -15664 8558 8767 26978 -28517 -41006 -44379 -64362
7443f4362M5750L9338J002J0214m5658N2577N1305P190l7509q340j6205j2746
$$ -64362 -18612 20726 21728 31942 -13716 38861 90166 97356 59847 51507 35302 22556
7431B2556m693j2662j4977R806J6114l3618L7614m506L3214N025J4060q9523o0256
$$ 22556 17863 5201 -9776 30 16144 -17474 20140 15634 48848 53873 67933 -21590 -81846
7418h1846J4932R3836K3978K7650j0869k9755p8475M0104N9719K069J5237o2738
$$ -81846 -66914 26922 50900 78550 67681 37926 -40549 -445 59274 61343 76580 13842
7406A3842p8064J08221l3538m5163R320O7739K9928J7846K0919p5446o5228l2256
$$ 13842 -64222 43999 10461 -34702 -25382 42357 72285 90131 111050 35604 -29624 -61880
7394f1880M8605J4380l9793L1424L4821j4850J0463k136l1925L0839J2599l3813
$$ -61880 -13275 1105 -38688 -7264 27557 12707 23170 21034 -10891 19948 32547 -1266
7382a266L0027m3356l1446M2224L8290K244l8295k5594K3746P2339o076J6426
$$ -1266 28761 -14595 -46041 -3817 34473 36717 -1578 -27172 -3426 68913 62837 79263
7370G9263k3219m2559l5668K4870Q867k4558j2815j440l0933k7832Q669K8105
$$ 79263 56044 13485 -22183 2687 11554 -13004 -25819 -27259 -58192 -86024 -77355 -49250
7358d9250l456j6168j0027l185N8506k335p9679n5637J0982K4926M3857N663K4081
$$ -49250 -52706 -68874 -78901 -82086 -23580 -25915 -105594 -161231 -150249 -125323 -81466 -75803 -51722
7345e1722m5976j0479N1753N0520Q194J3998J6335l441N741j3066K0057L5982
$$ -51722 -97698 -108177 -56424 -5904 2290 16288 32623 29182 34923 21857 41914 77896
7333G7896o0878J2545L0172j2035J7708P441j8860l7422n388K6405L153r359j6346
$$ 77896 17018 29563 59735 47700 65408 72849 53989 16567 11179 37584 40737 31378 15032
7320A5032k0275J1452j013K2594J3372M880K3228k618m4226j2849J0134k3257
$$ 15032 -5243 6209 5196 27790 41162 46042 69270 66652 22426 9577 19711 -3546
7308c546J9848P282J3113N2j4811k5327K2425K749j2647J078N2322L7425k9326
$$ -3546 16302 23584 36697 36749 21938 -3389 19036 21785 9138 10216 62538 99963 70637
7295G0637m7907l049K66p3222P662L489Q5273J1903m1642n2409m1571O3937L9922
$$ 70637 22730 19681 19947 -53275 -45613 -42124 43149 55052 13410 -38999 -80570 -16633 23289
7282B3289m5257J2354m4295k0750J9110j3116l951L2984O8968m8605n2631K7170
$$ 23289 -21968 -9614 -53909 -74659 -55549 -68665 -72616 -39632 29336 -19269 -71900 -44730
7270d4730K2270k9705J200r949K0760M5077L0043m7737k0329O961j1891L616K3252
$$ -44730 -22460 -52165 -50965 -60914 -40154 4923 34966 -12771 -33100 -26139 -38030 -34414 -11162
7257a1162M8142k3147J3521J6935K883l5800n5792L9655M5934M398r3435n5123
$$ -11162 36980 13833 27354 44289 47172 11372 -44420 -4765 41169 45567 -47868 -102991
7245a02991J9518M0447j1768O293j4067K2401N1638K8944n3956k7724N2383M6342
$$ -102991 -83473 -43026 -54794 -48501 -62568 -40167 11471 40415 -13541 -41265 11118 57460
7233E7460N886k8753J0152J7012J7637l9054j8788j5835k8332K7645P966K8065
$$ 57460 63346 34593 44745 61757 79394 40340 21552 5717 -22615 5030 12996 41061
7221D1061p870m7787k4752L9036k9401n0L6117L9530K1460J7354o5635j7308J326
$$ 41061 33191 -14596 -39348 -312 -29713 -29763 6354 45884 67344 84698 19063 1755 3081
7208C081l0360N2896M9320n4603q721J0656l916J9217R56j9006r232P9139j4826
$$ 3081 -27279 25617 74937 20334 11613 22269 18353 37570 38526 19520 10288 89427 74601
7195G4601l4361L0193J501l3253L2876k8454l2149J629N9368k9078k8344j7246
$$ 74601 40240 70433 71934 38681 71557 43103 10954 12583 71951 42873 14529 -2717
7183b717o3656N1579O6723K4210j9656p5958J6115N077J8020k9135l148j3737
$$ -2717 -66373 -14794 51929 76139 56483 -19475 -3360 1717 19737 -9398 -12546 -26283
7171b6283J5804O1518M2654K1956q8714K0784L513n5920m040Q693j744m4079L9947
$$ -26283 -10479 51039 93693 115649 26935 47719 51232 -4688 -8728 -35 -1779 -45858 -5911
7158e911M9839M4946k4764p7659l5621K2927J2944k2567J1232l9616j6234J6621
$$ -5911 43928 88874 64110 -13549 -49170 -26243 -13299 -35866 -24634 -64250 -80484 -63863
7146f3863N2401J0134K0642l6522r597L5765m0533Q085J1383P6956L8915q485
$$ -63863 -11462 -1328 19314 -17208 -26805 8960 -31573 -23488 -12105 64851 103766 95281
7134I5281n3967l1800J3389J5103k6025L0655m115j1897o4337J7144p893N2927
$$ 95281 41314 9514 22903 38006 11981 42636 38521 26624 -37713 -20569 -28462 24465
7122B4465k144n399Q504j4707n6489m7853J4188Q836M8205L5279K3195L3152l5720
$$ 24465 22321 16922 25426 10719 -45770 -93623 -79435 -70599 -22394 12885 36080 69232 33512
7109C3512o5714j1355O3038O5771p2383o6842J2828P105j1824J6553K405M0032
$$ 33512 -32202 -43557 19481 85252 12869 -53973 -41145 -34040 -45864 -29311 -26906 13126
7097A3126J0039Q679j3279m9801O030p535K9999K8443L1584l5495p9504L8343
$$ 13126 23165 31844 18565 -31236 -25206 -32741 -2742 25701 57285 21790 -57714 -19371
7085a9371J6622l4755l1716L8210P843n623j3576k0677l349k090K0575K0603K5673
$$ -19371 -2749 -37504 -69220 -31010 -23167 -28790 -42366 -63043 -66392 -68482 -47907 -27304 -1631
7072a631L1501m9608m8573L9215L2060M2721k3646n1465j3438l0488q09L5895
$$ -1631 29870 -19738 -68311 -29096 2964 45685 22039 -29426 -42864 -73352 -74161 -38266
7060c8266Q5667J7792j4093L0827J281K8448j5341J3173j2375k7688p6386k0601
$$ -38266 47401 65193 51100 81927 83208 111656 96315 109488 97113 69425 -6961 -27562
7048b7562K74O0070j3978J6116j6682l2232J3342O103j9493Q049j1172j3113M6111
$$ -27562 -27288 32782 18804 34920 18238 -13994 -652 5451 -14042 -5993 -17165 -30278 15833
7035A5833M3308O3142L6364K3710l5089q2441m0146P114k5723L4553n5846j03108
$$ 15833 59141 122283 158647 182357 147268 64827 24681 31795 6072 40625 -15221 -118329
7023a18329J2779J58981J0448j877l1719q6306k2448m417m8561J1482P4117N1810
$$ -118329 -105550 53431 63879 62002 30283 -56023 -78471 -82888 -131449 -119967 -45850 5960
7011E960J1235P374k0211n083j512p0876n1427K8560M2284q918Q2425K7271o7416
$$ 5960 17195 24569 4358 -725 -2237 -73113 -124540 -95980 -53696 -62614 19811 47082 -20334
6998b0334l9910K7500M86L4758n401J2075k9470K2057M7762J9011K153j7356j2889
$$ -20334 -60244 -32744 -32258 2500 -2901 9174 -20296 1761 49523 68534 70687 53331 40442
6985D0442L8220p008o1694j8664l0473K9263k6735n7112q038M4157K9066L1560
$$ 40442 78662 71654 9960 -8704 -39177 -9914 -36649 -93761 -101799 -57642 -28576 2984
6973B984L3919j6032m4126R400M85R51k0357r465L1412M2482m8195Q707J8035
$$ 2984 36903 20871 -23255 -13855 -13370 -12419 -32776 -42241 -10829 31653 -16542 -7835 10200
6960A0200K030K5623N2614o3234k7228n207j9156k295K0945k1878k9733n720k3282
$$ 10200 12230 37853 90467 27233 5 -5202 -24358 -26653 -5708 -27586 -57319 -63039 -86321
6947h6321k0998m1898j4527O6291L0267J7247M546l0846l3123Q1776N1725K4360
$$ -86321 -107319 -149217 -163744 -97453 -67186 -49939 -45393 -76239 -109362 -27586 24139 48499
6935D8499P126k6485l3189M4760j8217j4804k4180m347K8588j1124J4221k927
$$ 48499 55625 29140 -4049 40711 22494 7690 -16490 -20837 7751 -3373 10848 7921
6923G921L5062j3776n6026k3693l2515l1259J6874L0854P4951Q943L7506J4431
$$ 7921 42983 29207 -26819 -50512 -83027 -114286 -97412 -66558 8393 17336 54842 69273
6911F9273m993j9969l3153k6975r257n787N190j0572k3260n0308K6512K6730k1764
$$ 69273 64280 44311 11158 -15817 -25074 -30861 -25671 -36243 -59503 -109811 -83299 -56569 -78333
6898g8333J8606M3062K6252O143M8424N3658j8700o1157r48o7610p1935R063l706
$$ -78333 -59727 -16665 9587 15730 64154 117812 99112 37955 37007 -30603 -102538 -93475 -97181
6885i7181j43o388l250J3815P390L270K7367M3423j0590o597K941O525j3307J9317
$$ -97181 -97324 -103712 -106962 -93147 -85757 -82487 -55120 -11697 -22287 -28884 -25943 -19418 -32725 -13408
6871a3408J1169o3865p7323J7807R2155r503K9433J5871k6267r723M5724N108
$$ -13408 -2239 -66104 -143427 -125620 -33465 -42968 -13535 2336 -23931 -33654 12070 17178
6859A7178n914k3315J6228K775l6950o4643l5480j9501L9614M7919O2625M840
$$ 17178 11264 -12051 4177 6952 -29998 -94641 -130121 -149622 -110008 -62089 536 5376
6847E376J1690M9314M0211l8543m5522m7455p507J7407l0121P377L2660J3303
$$ 5376 17066 66380 106591 68048 22526 -24929 -32436 -15029 -45150 -37773 -5113 8190
6835H190m9350l8506N0912N1566k7850l2264J5015O5914m0947N168L7345K3471
$$ 8190 -41160 -79666 -28754 22812 -5038 -37302 -22287 43627 2680 7848 45193 68664
6823F8664l5626j0578n9739O8792j869m6508l1878k2985J3520J1334L4753m3027
$$ 68664 33038 22460 -37279 31513 29644 -16864 -48742 -71727 -58207 -46873 -12120 -55147
6811e5147k7044J7317L9039l1130L8468M7979k0889p0112L6531L3177l62j9534
$$ -55147 -82191 -64874 -25835 -56965 -18497 29482 8593 -61519 -24988 8189 7827 -11707
6799a1707n442m134N9271J1477k3651N439o838M7832L8760l6049k9717k1339J3405
$$ -11707 -17149 -21283 37988 49465 25814 31253 24415 72247 111007 74958 45241 23902 37307
6786C7307J1092L67Q523j313j6257n8943p6761o749J9923P260K6640k7393k9931
$$ 37307 48399 48766 57289 55976 39719 -19224 -95985 -102734 -82811 -75551 -48911 -76304 -106235
6773a06235M5613P5480K2486L540n1041j7255n5484k1942N1291M917j1436O1539
$$ -106235 -60622 14858 37344 40884 -10157 -27412 -82896 -104838 -53547 -48630 -60066 1473
6761A473l9151q071N366J0812Q756L7622k6290n9987k1344J5122N4030O0788J648
$$ 1473 -37678 -45749 -40383 -29571 -20815 16807 -9483 -69470 -90814 -75692 -21662 39126 40774
6748D0774j0332k5365n0977q50J1863l622K460M4277l6659p6936k7809L7667K1325
$$ 40774 30442 5077 -45900 -46750 -34887 -38509 -36049 8228 -28431 -105367 -133176 -95509 -74184
6735g4184P8192j1910l843O711n1816L0290O2742o229n4245L4498M1192J1098
$$ -74184 4008 -7902 -11745 -5034 -56850 -26560 36182 29953 -24292 10206 51398 62496
6723F2496M659j033k3468j8403j3610j6836n7867J04378N5875j08l2678m1158
$$ 62496 67155 66122 42654 24251 10641 -6195 -64062 40316 96191 96083 63405 22247
6711B2247N9358M374R94q0013l2403M3250K0538n678j0432k802K827k5870k025
$$ 22247 81605 85979 86973 6960 -25443 17807 38345 32667 22235 19433 22260 -3610 -5635
6698e635p833K041p700l6321k2111M7712J2591p312n450r380m915J149j5238Q2446
$$ -5635 -13468 -11427 -19127 -55448 -77559 -29847 -17256 -24568 -30018 -39398 -44313 -43164 -58402 24044
6684B4044J02945m8448l1054l3146j8699K4353M7824K7971n3291l3983m6235k4255
$$ 24044 126989 78541 47487 14341 -4358 19995 67819 95790 42499 8516 -37719 -61974
6672f1974L9259O3694j9790l1576O7021L132o9353k6850m650R270r0623n298N0820
$$ -61974 -22715 40979 21189 -10387 56634 59766 -9587 -36437 -41087 -31817 -122440 -127738 -76918
6659g6918L4565K7526M489M890q498L6271M6557L7346K4484n0417m168m6977l5002
$$ -76918 -42353 -14827 -10338 -5448 -13946 22325 68882 106228 130712 80295 76127 29150 -5852
6646e852M8588M2343l3320n7695m7781j6923L5844j6363K342o8411j0503k3537
$$ -5852 42736 85079 51759 -5936 -53717 -70640 -34796 -51159 -48817 -117228 -127731 -151268
6634a51268O1302K6922J3032l388Q1l6319n8007j2260m98J3885M3881L6789K0921
$$ -151268 -89966 -63044 -50012 -53400 -53319 -89638 -147645 -159905 -160403 -146518 -102637 -65848 -44927
6621d4927L2481Q190k1434P652N490K3446n786J0692k0549l9068Q077L9091K9465
$$ -44927 -12446 -4256 -25690 -18038 -12548 10898 5112 15804 -4745 -43813 -35736 3355 32820
6608C2820k5630l3111j7945k640m540K0521M6085j5773j1922j8982K7816K2266
$$ 32820 7190 -25921 -43866 -46506 -51046 -30525 15560 -213 -12135 -31117 -3301 18965
6596A8965J1991l3819k8425L0771l7726J1744M5034p624o4420J5190O10j6879
$$ 18965 30956 -2863 -31288 -517 -38243 -26499 18535 10911 -53509 -38319 -37709 -54588
6584e4588K3281l3404L7886J9537l8337J975j2591O351O432J5218L9399k0163
$$ -54588 -31307 -64711 -26825 -7288 -45625 -43650 -56241 -49890 -43458 -28240 11159 -9004
6572i004m5589n39j6860j3293J7454J3826j5134P163K0788M2794O8085L218N88
$$ -9004 -54593 -55132 -71992 -85285 -67831 -54005 -69139 -61976 -41188 1606 69691 72909 73497
6559G3497n9248m5488l792P275J8526j1933J3650M9967J9514p5369o7008K1505
$$ 73497 14249 -31239 -35031 -27756 -9230 -21163 -7513 42454 61968 -13401 -80409 -58904
6547e8904l4628M841N6017l7888j8712K7410J4928M9742M5806k0638j5846L4708
$$ -58904 -93532 -88691 -32674 -70562 -89274 -61864 -46936 2806 48612 27974 12128 46836
6535D6836K0225k2974k5944L5722K4182k7373j4289J4550r0216l6782J4908P42
$$ 46836 67061 44087 18143 53865 78047 50674 36385 50935 -39281 -76063 -61155 -60413
6523f0413p389n352m0239k8364M9523P3687L7768K3326k3848J1382J1793m4804
$$ -60413 -67802 -73154 -113393 -141757 -92234 -18547 19221 42547 18699 30081 41874 -2930
6511b930k3657K216K4113o778K0467Q032l3798K378L7386K5648M6787j9011q7052
$$ -2930 -26587 -24371 -258 -7036 13431 21463 -12335 -9957 27429 53077 99864 80853 -6199
6498f199l2050k9679r573Q1432K5865r008l3926n0402J8883M5843L8116k7452
$$ -6199 -38249 -67928 -77501 3931 29796 20788 -13138 -63540 -44657 1186 39302 11850
6486A1850m0572L4972P7809n4406L894K3722k7306K3616L2524k9424k7412j4224
$$ 11850 -28722 6250 84059 29653 33547 57269 29963 53579 86103 56679 29267 15043
6474A5043m3997J4262P1297N7655j0041n8132q1450o0394K6896N8897j0622Q4
$$ 15043 -28954 -14692 56605 114260 104219 46087 -35363 -95757 -68861 -9964 -20586 -20502
6462b0502N2424K0976p8301p1213m6139M4178R8296J8947l8394j4000K1992o4236
$$ -20502 31922 52898 -25403 -96616 -142755 -98577 -281 18666 -19728 -33728 -11736 -75972
6450g5972j122L7321j2927k7510j8242m227j1341J4543M6148N2045J6700K4487
$$ -75972 -77094 -39773 -52700 -80210 -98452 -102679 -114020 -99477 -53329 -1284 15416 39903
6438C9903p914m023q181m0970k98n8768p607M8278M4685j7230K1735Q763m7032
$$ 39903 31989 27966 19785 -21185 -21483 -80251 -87858 -39580 5105 -12125 9610 18373 -28659
6425b8659k5785Q901M9714j0616j72N6808j2414m0524K5696J6362m7592N537N3229
$$ -28659 -54444 -45543 4171 -6445 -6617 50191 37777 -2747 22949 39311 -8281 -2744 50485
6412E0485J7371j352k0461l9357p2864O8426M6860L6397L9531n3759p4030m4469
$$ 50485 67856 66504 46043 6686 -66178 2248 49108 85505 125036 71277 -2753 -47222
6400d7222p741L562m6208K614K3543K4866L0065O071j9316l436P669J667M094
$$ -47222 -54963 -51401 -97609 -94995 -71452 -46586 -16521 -10450 -29766 -33202 -25533 -23866 -19772
6387a9772L1266J6686m3205J7888j4495k7020J2116K4984R376K3822l8252l9197
$$ -19772 11494 28180 -15025 2863 -11632 -38652 -26536 -1552 7824 31646 -6606 -45803
6375d5803L9844K9644q549p208J7502k9661K2218N1201r505q851J8893J430n2107
$$ -45803 -5959 23685 15136 7928 25430 -4231 17987 69188 59683 50832 69725 71155 19048
6362A9048o4066L2286K4403O5257J560p4557j8050P031k8539J5585m2490J5812
$$ 19048 -45018 -12732 11671 76928 78488 3931 -14119 -7088 -35627 -20042 -62532 -46720
6350d6720Q435q959k0498j2756M4243L4120P555L8875K1672K5255K5472l2203
$$ -46720 -38285 -47244 -67742 -80498 -36255 -2135 5420 44295 65967 91222 116694 84491
6338H4491n5717k1724k5851n0093K8291J9256M8386l3123J0648J8587l3654q462
$$ 84491 28774 7050 -18801 -68894 -40603 -21347 27039 -6084 4564 23151 -10503 -18965
6326a8965J0285k2006J5828N566K1823L3982J4618P777J8295N374j7611K1060
$$ -18965 -8680 -30686 -14858 -9292 12531 46513 61131 68908 87203 92577 74966 96026
6314I6026l4442n4707j2204J813K4006k0664p5224M4887O306j6844J580M4840
$$ 96026 61584 6877 -5327 -3514 20492 -172 -75396 -30509 -24203 -41047 -39467 5373
6302E373J5770L0273k5642p7506j7071K0328k5767k4734L3863P2964J0835j4131
$$ 5373 21143 51416 25774 -51732 -68803 -48475 -74242 -98976 -65113 7851 18686 4555
6290D555J1671L5734q082o3663N2643k0613j0471O0655l2643p8659N2849O8169
$$ 4555 16226 51960 43878 -19785 32858 12245 1774 62429 29786 -48873 3976 72145
6278G2145o6760m1587J3588j7279o480L020J966q166L8639m1842l6616l6144J1908
$$ 72145 5385 -36202 -22614 -39893 -46373 -43353 -41387 -49553 -10914 -52756 -89372 -125516 -113608
6265a13608P1552K6770k1631k2260P5576K1937m6959j8191M2478j248L8469N3209
$$ -113608 -42056 -15286 -36917 -59177 16399 38336 -8623 -26814 15664 14416 52885 106094
6253A06094L904j5916p0351p3498M2674P576p4723L7442J5115m0235R11L8166
$$ 106094 109998 94082 23731 -49767 -7093 483 -74240 -36798 -21683 -61918 -61007 -22841
6241b2841M1173L1426L0797K0407M5596m8470r0866l7142J145M6393L4652J4308
$$ -22841 18332 49758 80555 100962 146558 98088 7222 -29920 -28775 17618 52270 66578
6229F6578L2864l1668j773p103J335m6997q227n7212J080M4979R91L2860J6796
$$ 66578 99442 67774 66001 58898 60233 13236 5009 -52203 -51123 -6144 -5153 27707 44503
6216D4503k6929J7627P072r7505J9684P4490J3199p1679K961j7101M4497J9050
$$ 44503 17574 35201 42273 -55232 -35548 38942 52141 -19538 -16577 -33678 10819 29869
6204B9869k5695l6021n1715J343K0399O6254K2461M769j8301K8505N5973j418
$$ 29869 4174 -31847 -83562 -82219 -61820 4434 26895 31664 13363 41868 97841 96423
6192I6423m9893n9716p846M6594L75r1111n4028M9947K5608j4436M5132N5576
$$ 96423 46530 -13186 -21032 25562 25937 -65174 -119202 -69255 -43647 -58083 -12951 42625
6180D2625M203m1396Q549n8610p4292P752P0508L7218j2574o9638k5J4699N1154
$$ 42625 46828 5432 13981 -44629 -118921 -111169 -40661 -3443 -16017 -85655 -85680 -70981 -19827
6167a9827o762M675o659l6140N4263K9788P450P0647k2529l8953J9152M4630j6672
$$ -19827 -26589 -21914 -28573 -64713 -10450 19338 26788 97435 74906 35953 55105 99735 83063
6154H3063o3199n1480P9676L5803m4742o0176J6509l5299k6783r678N471L5582
$$ 83063 19864 -31616 48060 83863 39121 -21055 -4546 -39845 -66628 -76306 -70835 -35253
6142c5253j1632L4957J31917L3654l3730r5892m3660P638K48L090K8563k0530
$$ -35253 -46885 -11928 119989 153643 119913 24021 -19639 -12001 -11753 -8663 19900 -630
6130f30l2880j7455m038M3210R671j5537k9959j5597j2526k6405l444N8826k9125
$$ -630 -33510 -50965 -55003 -11793 -2122 -17659 -47618 -63215 -75741 -102146 -105590 -46764 -75889
6117g5889J4034N4688R424N906m0076l0461J6158R1572Q2865q077l9888o4323
$$ -75889 -61855 -7167 2257 8163 -31913 -62374 -46216 45356 128221 120144 80256 15933
6105A5933L1889o080L069K3543K7653O757j828p3530k7106K8825l712k7734k5961
$$ 15933 47822 41742 44811 68354 96007 102764 100936 27406 300 29125 25413 -2321 -28282
6092b8282m8982j5310L0378M5810K8064n2394k5666l9226j1587N6592K8356j9538
$$ -28282 -77264 -92574 -62196 -16386 11678 -40716 -66382 -105608 -117195 -60603 -32247 -51785
6080e1785J1655p226q0692r4327R195J23825Q3830O66n000o0257j9561o319J6346
$$ -51785 -40130 -47356 -128048 -222375 -213180 -89355 -5525 -4859 -9859 -70116 -89677 -95996 -79650
6067g9650M258k5012N6379k9252m4905k7599j6396K3710K2244P1218J6563m6323
$$ -79650 -75392 -100404 -44025 -73277 -118182 -145781 -162177 -138467 -116223 -45005 -28442 -74765
6055g4765p552j809j0919k1925M255l3325k0304M9192Q0864r212j4595j2067j773
$$ -74765 -82317 -84126 -95045 -116970 -112715 -146040 -166344 -117152 -36288 -45500 -60095 -72162 -73935
6042g3935J4189M7747k1815j9936J1239k4490P9751J5138m152k4984q573J5339
$$ -73935 -59746 -11999 -33814 -53750 -42511 -67001 12750 27888 23736 -1248 -9821 5518
6030E518N2805k3781l8689l5218N6755j936l7440m5701j4251Q8511J0102J8589
$$ 5518 58323 34542 -4147 -39365 17390 15454 -21986 -67687 -81938 6573 16675 35264
6018C5264j0460m2973M590K0560m0315l3140L6627N6954n788M2421J5635l1908
$$ 35264 24804 -18169 -13579 6981 -33334 -66474 -29847 27107 21319 63740 79375 47467
6006D7467K3323l702j5816k6749l8245k6641n5497q468M8346Q113m4163J918l0948
$$ 47467 70790 67088 51272 24523 -13722 -40363 -95860 -104328 -55982 -47869 -92032 -90114 -121062
5993a21062Q5884K8926L3933O2645J9282k1666r5884o6398L4728J5141l8088O353
$$ -121062 -35178 -6252 27681 90326 109608 87942 -7942 -74340 -39612 -24471 -62559 -56206
5981e6206K6754n3698l6280J2596K9869K1923r069k7493K4445K7582q535J0461
$$ -56206 -29452 -83150 -119430 -106834 -76965 -55042 -64111 -91604 -67159 -39577 -48112 -37651
5969c7651J7048j5448J6215K3724M2238k3059L70J5547k1496j7997n0605M964
$$ -37651 -20603 -36051 -19836 3888 46126 23067 23437 38984 17488 -509 -51114 -46150
5957d6150M5117M5253J9787r3718J444K0035j4004k7929j5815L3379q439o2063
$$ -46150 -1033 44220 64007 -29711 -28267 -8232 -22236 -50165 -65980 -32601 -41040 -103103
5945a03103l6113P8297M3018M440N4386J3151j6548L9915J9711J0011k1734j5896
$$ -103103 -139216 -60919 -17901 -13461 40925 54076 37528 77443 97154 107165 85431 69535
5933F9535j3699n4265j5448m3293o3462k8715L650K6067k1335L5320K9493P1552
$$ 69535 55836 1571 -13877 -57170 -120632 -149347 -145697 -119630 -140965 -105645 -76152 -4600
5921d600M5822K988k633l3975l46K3157N3704J671j1063j4334k2098l9167l9660
$$ -4600 41222 44210 41577 7602 7256 30413 84117 85788 74725 60391 38293 -874 -40534
5908d0534n2197J1020j5336J3665O4144o2617K5289R5102j6606m4533J7112K1334
$$ -40534 -92731 -81711 -97047 -83382 -19238 -81855 -56566 38536 21930 -22603 -5491 15843
5896A5843J6512J6132M26o0136J555R044K437j3600k1429M0529l3107K1217j678
$$ 15843 32355 48487 48913 -11223 -9668 -624 1813 -11787 -33216 7313 -25794 -4577 -6255
5883f255l3683K8062n993l5479q93j9444J6981P2576j8161k9195m2639L491L28
$$ -6255 -39938 -11876 -17869 -53348 -54241 -73685 -56704 15872 -2289 -31484 -74123 -70632 -70304
5870g0304K7605L3109l32m5177m5764j1942L1270O8708J3707k6789m8387L6597
$$ -70304 -42699 -9590 -9922 -55099 -100863 -112805 -81535 -12827 880 -25909 -74296 -37699
5858c7699k6839m7354L8583L6366N9794O934O642m6502K6021K0450l3081j2422
$$ -37699 -64538 -111892 -73309 -36943 22851 29785 36427 -10075 15946 36396 3315 -9107
5846i107j621J5592L6255k2860J877o9209j135J5674N9385J2585J7592m4869n1103
$$ -9107 -10728 4864 41119 18259 20136 -49073 -50208 -34534 24851 37436 55028 10159 -40944
5833d0944j8601L1167J1992k5092k3584K3136L4233R769Q098k0877m7357N806
$$ -40944 -59545 -28378 -16386 -41478 -65062 -41926 -7693 2076 10174 -10703 -58060 -52254
5821e2254j4511J0612J4132j4104K0469N0174k8251m9987j3035j0822P9213N8973
$$ -52254 -66765 -56153 -42021 -56125 -35656 14518 -13733 -63720 -76755 -87577 -8364 50609
5809E0609l3688l7012m6708J5390N7037q9110K5660N7797p338k6425n404L6648
$$ 50609 16921 -20091 -66799 -51409 5628 -83482 -57822 -25 -7363 -33788 -39192 -2544
5797b544R331p246M0374o4100n6381J9639P8202M633J0578l0026k9705o3374L0698
$$ -2544 6787 -459 39915 -24185 -80566 -60927 17275 21908 32486 2460 -27245 -90619 -59921
5784e9921N4445l1608o8450k9653N8763N0681R213J2375j1720q3487j6083R731
$$ -59921 -5476 -37084 -105534 -135187 -76424 -25743 -16530 -4155 -15875 -99362 -115445 -105714
5772a05714J3770L9212K6358k9075n2849n1445L1481p444j0915J6159P6675L8469
$$ -105714 -91944 -52732 -26374 -55449 -108298 -159743 -128262 -135706 -146621 -130462 -53787 -15318
5760a5318Q981L2770P471k1197o645n1938N415M4202M2773j982k1773o2155j9237
$$ -15318 -6337 26433 33904 12707 6062 -45876 -40461 3741 46514 44532 22759 -39396 -58633
5747e8633L3395N9687J7670o8047J1148L7542k0398o6850n1709L5786L8174L3075
$$ -58633 -25238 34449 52119 -15928 -4780 32762 12364 -54486 -106195 -70409 -32235 840
5735H40K8359K6421o4829j1114p6142o553j5905K6156N4122L3793l6219J5872
$$ 840 29199 55620 -9209 -20323 -96465 -103018 -118923 -92767 -38645 -4852 -41071 -25199
5723b5199o2834Q985O7985J8690J1490J9490p852J1118j2654k8331O8142m077
$$ -25199 -88033 -79048 -11063 7627 19117 38607 30755 41873 29219 888 69030 64953
5711F4953l8042j28063j8124K5317L1932m2720j9804K9503k1008j563K886Q6195
$$ 64953 26911 -101152 -119276 -93959 -62027 -104747 -124551 -95048 -116056 -117619 -114733 -28538
5699b8538L5349k2048o0935o4301N079J7617O5095L9287L0365M524l988J2545
$$ -28538 6811 -15237 -76172 -140473 -135394 -117777 -52682 -13395 16970 21494 17506 30051
5687C0051M523m834l7043k7715M6269j3263j6075l454m027K6797m3132J6170K367
$$ 30051 34574 29740 -7303 -35018 11251 -2012 -18087 -21541 -25568 1229 -41903 -25733 -23366
5674b3366j7685l0471L2467L4363j4082j8116k5218k9002j3168L9963M23N3401
$$ -23366 -41051 -71522 -39055 -4692 -18774 -36890 -62108 -91110 -104278 -64315 -63892 -10491
5662a0491L7005M1875J9847n1825p3261m1620M0392O6663J2240m070n5342n684
$$ -10491 26514 68389 88236 36411 -36850 -78470 -38078 28585 40825 36755 -18587 -24271
5650b4271j4267J9578m107J4129J3877J9247N05O238m7179j5515M346L0942P141
$$ -24271 -38538 -18960 -23067 -8938 4939 24186 24691 30929 -16250 -31765 -27419 3523 10664
5637A0664m8206k309j7195K1059K9558Q270k0418R922k2153m542k8163k3241k9558
$$ 10664 -37542 -39851 -57046 -35987 -6429 1841 -18577 -8655 -30808 -35350 -63513 -86754 -116312
5624a16312M553K2405m175O5502N7988L7101J9936j7232m1595k9867j4506J5181
$$ -116312 -111759 -89354 -93529 -28027 29961 67062 86998 69766 28171 -1696 -16202 -1021
5612a021L4997o823q777K203j1096m4012N879k0362l0526P386N4696m2846J0549
$$ -1021 33976 27153 18376 20579 9483 -34529 -28650 -49012 -79538 -72152 -17456 -60302 -49753
5599d9753L865K6479K7965K7944R473m6075k4207j4495M0231J0114o5477j7133
$$ -49753 -45888 -19409 8556 36500 45973 -102 -24309 -38804 1427 11541 -53936 -71069
5587g1069N8885j2756n3188k7034k1719M2111M557k893r826P0356L2129k8165
$$ -71069 -12184 -24940 -78128 -105162 -126881 -84770 -80213 -83106 -92932 -22576 9553 -18612
5575a8612J5606l6606k6819l78Q503O5552j5014j3368k1422m93j7459m5708L4173
$$ -18612 -3006 -39612 -66431 -66809 -58306 7246 -7768 -21136 -42558 -43051 -60510 -106218 -72045
5562g2045N4087N2040j2325p8847j7652O1918J3026k1820K18m3195L5455Q3487
$$ -72045 -17958 34082 21757 -57090 -74742 -12824 202 -21618 -21400 -64595 -29140 54347
5550E4347j6616l0639j1510j3415m3268k2609P3873j0211m7318m9313M4348O0755
$$ 54347 37731 7092 -4418 -17833 -61101 -83710 -9837 -20048 -67366 -116679 -72331 -11576
5538a1576k1280J5761Q082j5427k4134l0679L7904M0021K0709l1144k2322L2806
$$ -11576 -32856 -17095 -9013 -24440 -48574 -79253 -41349 -1328 19381 -11763 -34085 -1279
5526a279l6390q745M115L1396J4911K4854l5123l4695K2945j9360q361l3767l9465
$$ -1279 -37669 -46414 -42299 -10903 4008 28862 -6261 -40956 -18011 -37371 -45732 -79499 -118964
5513a18964R062J5109J6453K3641P378P818l4454M620N5378M0992K2457J0462
$$ -118964 -109902 -94793 -78340 -54699 -47321 -39503 -73957 -69337 -13959 27033 49490 59952
5501E9952j258k7068n1090j8958j7895J9178l2889L7288q605o7299P944J914J9495
$$ 59952 58694 31626 -19464 -38422 -56317 -37139 -70028 -32740 -41345 -108644 -100700 -98786 -79291
5488g9291J7405K234K1632k157k1362p001l4995j7024O2611k399p327J9508K8377
$$ -79291 -61886 -59652 -38020 -40177 -61539 -68540 -103535 -120559 -57948 -60347 -67674 -48166 -19789
5475a9789k2383l7732j9842l1336M9279M8454K4513Q945j5090L8239o6196m653
$$ -19789 -42172 -79904 -99746 -131082 -81803 -33349 -8836 109 -14981 23258 -42938 -47591
5463d7591K1865k8429K5777K8598j8661j1187n434K4664J8555Q183L490k7191
$$ -47591 -25726 -54155 -28378 220 -18441 -29628 -35062 -10398 8157 16340 19830 -7361
5451g361l3703L7920m69j1221o662n153o370J9105J086J2025k3287j424K9993
$$ -7361 -41064 -3144 -3613 -14834 -21496 -26649 -33019 -13914 -12828 -803 -24090 -25514 4479
5438D479j7866j7648n5807m3698J2964K7148K4376L036m2880N7361L4032j2095
$$ 4479 -13387 -31035 -86842 -130540 -117576 -90428 -66052 -63016 -105896 -48535 -14503 -26598
5426b6598K2462r222l0121L423K1190k6523J013J0090p4832M0489J3494J1258
$$ -26598 -4136 -13358 -43479 -40056 -18866 -45389 -44376 -34286 -109118 -68629 -55135 -43877
5414d3877p261J2083k5543n066K7988l287l6329N151L5639J202J3492O4356M5794
$$ -43877 -51138 -39055 -64598 -69664 -41676 -44963 -81292 -76141 -40502 -39300 -25808 38548 84342
5401H4342l1662k1404K6009K433j123R838M2705l5430r6716q1954O3339J7664
$$ 84342 52680 31276 57285 59718 58595 68433 111138 75708 -21008 -102962 -39623 -21959
5389b1959j0221O782K786L5482K5164J816L4615q7266o1052N8334M3654P298k7069
$$ -21959 -32180 -25398 -22612 12870 38034 39850 74465 -12801 -73853 -15519 28135 35433 8364
5376H364M1052K2903j9542l9464j7857L6528r859n1881m4127j0037l969L6443
$$ 8364 49416 72319 52777 13313 -4544 31984 22125 -29756 -73883 -83920 -87889 -51446
5364e1446l700K9075K5594l910j9450p677O4530K4609J3516m2128n3319K9853
$$ -51446 -55146 -26071 -477 -4387 -23837 -31514 33016 57625 71141 29013 -24306 5547
5352E547O0578l0438K2716j5824l8026N2647R389m8333k4119J2444J1993j213
$$ 5547 66125 35687 58403 42579 4553 57200 66589 18256 -5863 6581 18574 17361
5340A7361k1022j7291K0648N8145k6016p1362K9624M5448j4086m881o672o1618
$$ 17361 -3661 -20952 -304 57841 31825 -39537 -9913 35535 21449 16568 9896 -51722
5328e1722m2695K2772J7478l3889M8994P6347J2549n3213q591m4524Q9619L1912
$$ -51722 -94417 -71645 -54167 -88056 -39062 37285 49834 -3379 -11970 -56494 33125 65037
5316F5037J0545k8574j8220J4792L7360m908k2664j8219j3217J0795N7671J9498
$$ 65037 75582 47008 28788 43580 80940 76032 53368 35149 21932 32727 90398 109896
5304A09896n8804N036q843m1482k7267n496o73q5368j1236L4468O9152k5670m5751
$$ 109896 51092 56128 47285 5803 -21464 -26960 -27633 -113001 -124237 -89769 -20617 -46287 -92038
5291i2038J2379M5942L0653N495p7270m0878N8302N466K3360N6761o288n4941
$$ -92038 -79659 -33717 -3064 2431 -74839 -115717 -57415 -51949 -28589 28172 21884 -33057
5279c3057k5033k3009O283L4582O6501L6716J7553m5200k9152k7660j7626N8925
$$ -33057 -58090 -81099 -74816 -40234 26267 62983 80536 35336 6184 -21476 -39102 19823
5267A9823l944J8872n1740k5674O022L9856Q0836p0607p3729L2414K0125m4568
$$ 19823 15879 34751 -16989 -42663 -36641 3215 84051 13444 -60285 -27871 -7746 -52314
5255e2314L5793O3878j1983K6450m9808j7675P6832r608P374n100m6498n4765
$$ -52314 -16521 47357 35374 61824 12016 -5659 71173 61565 68939 63839 17341 -37424
5243c7424m9927M385N3396Q4322o684n4726m4682l65J0512J8209K2420L8658k6042
$$ -37424 -87351 -82966 -29570 54752 48068 -6658 -51340 -51705 -41193 -22984 -564 38094 12052
5230A2052K879J4763K959k8081k0924k3042q418L0857O2952R560l5442j2064j3038
$$ 12052 14931 29694 32653 4572 -16352 -39394 -47812 -16955 45997 55557 20115 8051 -4987
5217d987L465M4355k7735k1612j5584l6317K0258M1606N2487o1369k0697K0542
$$ -4987 -1522 42833 15098 -6514 -22098 -58415 -38157 3449 55936 -5433 -26130 -5588
5205e588O4022M2106p276j4732J2164K0855l9678k649l4311l0561p063k6226j727
$$ -5588 58434 100540 93264 78532 90696 111551 71873 69224 34913 4352 -2711 -28937 -30664
5192c0664l5901R08q152J1474M1753l7153M636M5371O1932j3095N664k1804m1750
$$ -30664 -66565 -65657 -73809 -62335 -20582 -57735 -53099 -7728 54204 41109 46773 24969 -16781
5179a6781l4952n076L6764L0417l6966M679L2663o8144n5458K0893J6754K2732
$$ -16781 -51733 -56809 -20045 10372 -26594 -21915 10748 -57396 -112854 -91961 -75207 -52475
5167e2475N8472J7943l693j7662l7417k6673L1525K4291N3370J8977l1952q7233
$$ -52475 5997 23940 20247 2585 -34832 -61505 -29980 -5689 47681 66658 34706 -52527
5155e2527n0793r418O3722Q2944P560k667l0909l3837k249N5051K3621m5524j4724
$$ -52527 -103320 -112738 -49016 33928 41488 38821 7912 -25925 -28174 26877 50498 4974 -9750
5142i750M7086J6441j8088p6296o008J0269q79J1392M607j8746j1281K305N2058
$$ -9750 37336 53777 35689 -40607 -46615 -36346 -37225 -25833 -21226 -39972 -51253 -48948 3110
5129C110J446L236j1309j0612K4835K7762K53n4741K9543N2768j6742k5316J6105
$$ 3110 4556 7792 -3517 -14129 10706 38468 38721 -16020 13523 66291 49549 24233 40338
5116D0338j2327l7570J0748q4019L4406N1124o0981l7904M5953Q6315M4945k9504
$$ 40338 28011 -9559 1189 -82830 -48424 2700 -58281 -96185 -50232 36083 81028 51524
5104E1524l3574J9367m5475p1951q2872L1860O5923M5793J6201j1118l4842k0574
$$ 51524 17950 37317 -8158 -80109 -162981 -131121 -65198 -19405 -3204 -14322 -49164 -69738
5092f9738J1095J1067M0041j2119j8244k4895k4778J4223p273L0009L7174N1146
$$ -69738 -58643 -47576 -7535 -19654 -37898 -62793 -87571 -73348 -80621 -50612 -13438 37708
5080C7708J7508P526o6424m8629J508N1959m90m5544J4244m965l7471o3856M7389
$$ 37708 55216 62742 -3682 -52311 -50803 1156 666 -44878 -30634 -35599 -73070 -136926 -89537
5067h9537P6461L7673J2358j5652m4831n2447J8128J102j5063k2973L1788J5398
$$ -89537 -13076 24597 36955 21303 -23528 -75975 -57847 -56745 -71808 -94781 -62993 -47595
5055d7595K9675j8466r721p7719l3277M5211M6371J8920l4935j0218O819L8914
$$ -47595 -17920 -36386 -46107 -123826 -157103 -111892 -65521 -46601 -81536 -91754 -84935 -46021
5043d6021J3967j1393M6526l2213n198R4760N457l7148J2331J114K3507n1666
$$ -46021 -32054 -43447 3079 -29134 -34332 60428 65885 28737 41068 42182 65689 14023
5031A4023p7366L0698K9734k7365o5072o372L6336m0183n433N1933n085J712N0045
$$ 14023 -63343 -32645 -2911 -30276 -95348 -101720 -65384 -105567 -111000 -59067 -64152 -62440 -12395
5018a2395N1550K932j4686K5044J2529K2150m8359n7103o6973m0515M3235L7115
$$ -12395 39155 42087 27401 52445 64974 87124 38765 -18338 -85311 -125826 -82591 -45476
5006d5476J4025k3842L3382K20l5265J8363M2728R2610k8738p8479J457p832L234
$$ -45476 -31451 -55293 -21911 -21691 -56956 -38593 4135 96745 68007 -10472 -9015 -16847 -13613
4993a3613q450j2740K8998N8138L2050q2311l0148K8096O774l3171N282j2136
$$ -13613 -22063 -34803 -5805 52333 84383 2072 -28076 20 6794 -26377 -21095 -33231
4981c3231q316k9428L9360R2448k4081j4036J7859j1300K8334j8157j8329l0135
$$ -33231 -41547 -70975 -31615 60833 36752 22716 40575 29275 57609 39452 21123 -9012
4969i012k1652j567K7239q540m3994K3447L7469J268N1400J2340j3914o279k4172
$$ -9012 -30664 -32231 -4992 -13532 -57526 -34079 3390 4658 56058 68398 54484 48205 24033
4956B4033n4255o9290j8429N5520J3912o3835j0044M189o4096L9378J01128N4406
$$ 24033 -30222 -99512 -117941 -62421 -48509 -112344 -122388 -118199 -182295 -142917 -41789 12617
4944A2617L909k1530p0230M3102m5305p2124p806K8819L2425P2276O2020K219
$$ 12617 16526 -5004 -75234 -32132 -77437 -149561 -157367 -128548 -96123 -23847 38173 40392
4932D0392l3375l6289L115N960j7443P309j0793k6011M5466J066l2044k0064K1332
$$ 40392 7017 -29272 -26157 -20197 -37640 -30331 -41124 -67135 -21669 -20603 -52647 -72711 -51379
4919e1379M139k078J2640L8431l041J7193L0531n8156n4350j4970q715L0240J3317
$$ -51379 -47240 -49318 -36678 1753 -1288 15905 46436 -11720 -66070 -81040 -89755 -59515 -46198
4906d6198m7813M060Q9472N3719L453L0745K9029n5563n5966l9688J509L4886
$$ -46198 -94011 -89951 -479 53240 56693 87438 116467 60904 4938 -34750 -33241 1645
4894A645m212q1655j2058j042j279j9314L3118J5643m765n787R297O887J8130
$$ 1645 -2567 -84222 -96280 -97322 -98601 -117915 -84797 -69154 -73919 -79706 -70409 -63522 -45392
4881d5392M1831m6886L9701Q4691m3904j9987J1954J7666n699p9744P16Q0210
$$ -45392 -3561 -50447 -10746 73945 30041 10054 22008 39674 33975 -45769 -45053 35157
4869C5157r558K7405K1456K8139p3620q4335K1282o149j648M9804j8057l2939
$$ 35157 25599 53004 74460 102599 28979 -55356 -34074 -40223 -41871 7933 -10124 -43063
4857d3063N3625M839r4480k9780J5009n349K2752m8629j1588M6279j3492k5353
$$ -43063 10562 15401 -79079 -108859 -93850 -99199 -76447 -125076 -136664 -90385 -103877 -129230
4845a29230K7856P3793O6467k4344j5783J453J1345j5733l3855m6120K1792N2065
$$ -129230 -101374 -27581 38886 14542 -1241 212 11557 -4176 -38031 -84151 -62359 -10294
4833a0294j1616m3003K9948L5389N3532K3101j9191m3592O340M8375J5447K9580
$$ -10294 -21910 -64913 -34965 424 53956 77057 57866 14274 20614 68989 84436 114016
4821A14016R182J831m766L058k9276n8693o4715k3881Q439K2223N8904J9298J1306
$$ 114016 123198 125029 120263 123321 94045 35352 -29363 -53244 -44805 -22582 36322 55620 66926
4808F6926l9226M9049n3748J472p817k7137K6290J2332j942p860m829K6146R455
$$ 66926 27700 76749 23001 24473 16656 -10481 15809 28141 26199 18339 13510 39656 49111
4795D9111n3364j3433K2179l9255L2694M1213K2487l957k3077o2205l0862k2202
$$ 49111 -4253 -17686 4493 -34762 -2068 39145 61632 57675 34598 -27607 -58469 -80671
4783h0671o575L3553P6040m502K7208n9311k6168j7374j5203M5269K8782O466
$$ -80671 -87246 -53693 22347 17845 45053 -14258 -40426 -57800 -73003 -27734 1048 7514
4771G514K2970l5513m9347l4044L7444l2219l3437O3128P8768M070k2794J7807
$$ 7514 30484 -5029 -54376 -88420 -50976 -83195 -116632 -53504 25264 29334 6540 24347
4759B4347j9086l5743K7593L1264p263L7639k4683k4797l8816P7295k034k4208
$$ 24347 5261 -30482 -2889 28375 21112 58751 34068 9271 -29545 47750 45716 21508
4747B1508N4473l9513J9567l821j4582k4714N769O847K6692m294j6368n4282l2318
$$ 21508 75981 36468 56035 52214 37632 12918 18687 25534 52226 47932 31564 -22718 -55036
4734e5036M503n363K8490q691J9416J9500O0310j8328n4779m8484k1590M4834
$$ -55036 -50533 -55896 -27406 -36097 -16681 2819 63129 44801 -9978 -58462 -80052 -35218
4722c5218O2400J0893o1352k3274q920k502J1593J7017O1804M3855k4627o6143
$$ -35218 27182 38075 -23277 -46551 -55471 -57973 -46380 -29363 32441 76296 51669 -14474
4710a4474j0248k168k4686o097M323j8538l6282r146k9914Q344Q9488L6138j4095
$$ -14474 -24722 -26890 -51576 -57673 -53350 -71888 -108170 -117316 -147230 -138886 -49398 -13260 -27355
4697b7355L2506J3526J4654j4757j8613k6824o9630O8072k076L6110K8622J9442
$$ -27355 5151 18677 33331 18574 -39 -26863 -96493 -28421 -30497 5613 34235 53677
4685E3677J7426k7431m1937j1796J5897j2888l0869K1485N8098J8427m8464J3445
$$ 53677 71103 43672 1735 -10061 5836 -7052 -37921 -16436 41662 60089 11625 25070
4673B5070K6571q4181l2047K9596m8501j2144J2354J362J2726l3107l0444M4922
$$ 25070 51641 -32540 -64587 -34991 -83492 -95636 -83282 -81920 -69194 -102301 -132745 -87823
4661h7823P6592M8197Q315n447j7819j4817n586k3852J7211J7491N65j7263n3889
$$ -87823 -11231 36966 45281 39834 22015 7198 1612 -22240 -5029 12462 13027 -4236 -58125
4648e8125o303o4456O5913k5181j0073M4252N8099K8658k4765P556o381K6364
$$ -58125 -64428 -128884 -62971 -88152 -98225 -53973 4126 32784 8019 15575 9194 35558
4636C5558K5167L0461m0444J2563J3325j0856O195o5377r709K4154m1777j6698
$$ 35558 60725 91186 50742 63305 76630 65774 71969 6592 -3117 21037 -20740 -37438
4624c7438K1304J1348M2561k4862p3614Q741M5499K3233k5276m3483k4772L1022
$$ -37438 -16134 -4786 37775 12913 -60701 -51960 -6461 16772 -8504 -51987 -76759 -45737
4612d5737r138j4678j5603M5245P1878K546m6579J7667O4237l1700m6778l4395
$$ -45737 -54875 -69553 -85156 -39911 31967 34513 -12066 5601 69838 38138 -8640 -43035
4600d3035j4383m765k903J3614K3190J1630O357J4416m954j1742o6490m6102L8401
$$ -43035 -57418 -62183 -65086 -51472 -28282 -16652 -10295 4121 -833 -12575 -79065 -125167 -86766
4587h6766M3386J4746j2934K0660K1187K0211M1874l4981n709q4225k9663N2862
$$ -86766 -43380 -28634 -41568 -20908 279 20490 62364 27383 21674 -62551 -92214 -39352
4575c9352O0589L2430k2801o0856J0416L0790l6126K9170J2833J2408L0061l0367
$$ -39352 21237 53667 30866 -29990 -19574 11216 -24910 4260 17093 29501 59562 29195
4563B9195j06936k8195k7191j0537N6709K9888j8478K0990N3414J6680N0757J2341
$$ 29195 -77741 -105936 -133127 -143664 -86955 -57067 -75545 -54555 -1141 15539 66296 78637
4551G8637m486l3332o5103j9780j0572m1619K1449O8635q865l1168K9804j5673
$$ 78637 74151 40819 -24284 -44064 -54636 -96255 -74806 -6171 -15036 -46204 -16400 -32073
4539c2073J909o587K6844M5474l9569j4216L9723n02m0737J3704l2754k7484R310
$$ -32073 -30164 -36751 -9907 35567 -4002 -18218 21505 21003 -19734 -6030 -38784 -66268 -56958
4526e6958K6150j06340n8389M5628Q1705o721R788L8035N09O1115L792l9791k4513
$$ -56958 -30808 -137148 -195537 -149909 -68204 -74925 -65137 -27102 -26593 34522 38314 -1477 -25990
4513b5990J8335m492j3610k3291J5736N6956m998L3485P9616n226j2996j08808
$$ -25990 -7655 -12147 -25757 -49048 -33312 23644 18646 52131 131747 126521 113525 4717
4501D717o1897j5438j266q774K8461m8419L510K3856J235j3657J5625N8480K6588
$$ 4717 -57180 -72618 -73884 -82658 -54197 -102616 -99106 -75250 -74015 -87672 -72047 -13567 13021
4488A3021J7495o6874n7405M270L7449M4646O8213l0290j7056l5655M7480R700
$$ 13021 30516 -36358 -93763 -89493 -52044 -7398 60815 30525 13469 -22186 25294 34994
4476C4994l4111p7028o032Q1534K0700n260J8060j0811k2897K3744J7976k4547
$$ 34994 883 -76145 -82177 -643 20057 14797 32857 22046 -851 22893 40869 16322
4464A6322o211J2432K5932J4780l8815k7256j6310K1894N1800L2700m6058N563
$$ 16322 10111 22543 48475 63255 24440 -2816 -19126 2768 54568 87268 41210 46773
4452D6773L871k6226o6639j8301J510m523L2054M4859L7729n4277l2490k0275
$$ 46773 50644 24418 -42221 -60522 -59012 -63535 -31481 13378 51107 -3170 -35660 -55935
4440e5935J3570J0287l0179n002K832J139p239L1437O9145n8081q5900l2973j134
$$ -55935 -42365 -32078 -62257 -67259 -64427 -63288 -70527 -39090 30055 -28026 -113926 -146899 -148033
4427a48033J1529K5284K1788N6221K8298P9594k3536k7348M4781M004k33j4067
$$ -148033 -136504 -111220 -89432 -33211 -4913 74681 51145 23797 68578 72582 72349 58282
4415E8282J9869L2861L8222l1704q3571m7547k1535j2978K4938j1937R7503O6797
$$ 58282 78151 111012 149234 117530 33959 -13588 -35123 -48101 -23163 -35100 62403 129200
4403A29200l6472m6403L1111J6109q7095q4641j6022o1480J6729J1315R315O2431
$$ 129200 92728 46325 77436 93545 6450 -78191 -94213 -155693 -138964 -127649 -118334 -55903
4391e5903O0994l147l9399K3272M7392l073n7596l0002q947K9082J3767J416M4632
$$ -55903 5091 1944 -37455 -14183 33209 30136 -27460 -57462 -66409 -37327 -23560 -22144 22488
4378B2488k7334o344l0367M362J5019o10K8767l4656L5198L5440o4763j3642M6723
$$ 22488 -4846 -11190 -41557 -37195 -22176 -22786 5981 -28675 6523 41963 -22800 -36442 10281
4365A0281M0387j0894m5728k5411k1716M1803N1136J6090n3496k8532M3113L1821
$$ 10281 50668 39774 -5954 -31365 -53081 -11278 39858 55948 2452 -26080 17033 48854
4353D8854l1099l5884M394M7926j7966l3768k06M921J7744L8045P495m2226o0574
$$ 48854 17755 -18129 -13735 34191 16225 -17543 -17749 -12828 4916 42961 50456 8230 -52344
4340e2344J5940L7560L3871J8053L6243m4948n7397m6945J3730j9390M2748m258
$$ -52344 -36404 1156 35027 53080 89323 44375 -13022 -59967 -46237 -65627 -22879 -27137
4328b7137n0199k9614M7746P7978j4158j4207j0638n1939M8450O9962k087n4577
$$ -27137 -77336 -106950 -59204 18774 4616 -9591 -20229 -72168 -23718 46244 44157 -10420
4316a0420l153L6661O953m8893K6140n418k6383k1954K9963N8907n0563q1619
$$ -10420 -13573 23088 30041 -18852 7288 1870 -24513 -46467 -16504 42403 -8160 -89779
4304h9779J2812K9326M0307K8254k3058l1343l6161k0413L0825k3511n4779L6975
$$ -89779 -76967 -47641 -7334 20920 -2138 -33481 -69642 -90055 -59230 -82741 -137520 -100545
4292a00545M2380j0526K7099R121P3748O0453M790K28j8292l5496k0509k5040
$$ -100545 -58165 -68691 -41592 -32471 41277 101730 106520 106748 88456 52960 32451 7411
4280G411j0519J971j488m7312j6203K300K435J5731J2903o8509o302k4153N2574
$$ 7411 -3108 -1137 -2625 -49937 -66140 -63840 -61405 -45674 -32771 -101280 -107582 -131735 -79161
4267g9161O9224L1791J6632j4698k7062k2048j0080K3290P918K022o478K7490
$$ -79161 -9937 21854 38486 23788 -3274 -25322 -35402 -12112 -4194 -2172 -8650 18840
4255A8840M9879k0474k9383J2430j6499k9202p239l9092M5821K3988J995L6014
$$ 18840 68719 48245 18862 31292 14793 -14409 -21648 -60740 -14919 9069 11064 47078
4243D7078l2465p4879k8015L7586k6412m379K5659K9516K2640j1934n386k7327
$$ 47078 14613 -60266 -88281 -50695 -77107 -81486 -55827 -26311 -3671 -15605 -20991 -48318
4231d8318k3612Q3753Q730J4467k3035l2811J8896r455o1139l9662J513L4483
$$ -48318 -71930 11823 20553 35020 11985 -20826 -1930 -11385 -72524 -112186 -110673 -76190
4219g6190K1899N3454M7719l2050Q48j7232L3432r144l6710j8295M9808j1749
$$ -76190 -54291 -837 46882 14832 15680 -1552 31880 22736 -13974 -32269 17539 5790
4207E790n172J7278j6500p851K5994N6727R229j0832N768j5834o5911o3271M312
$$ 5790 618 17896 1396 -6455 19539 76266 85495 74663 80431 64597 -1314 -64585 -60273
4194f0273K0806j5531L954K0557o437K735M2631N3450o6681m3206j5524P7830
$$ -60273 -39467 -54998 -51044 -30487 -36924 -34189 8442 61892 -4789 -47995 -63519 14311
4182A4311K8997k2013K6502k3107j2741K2393J0898p7754n4584L5124j1153J1882
$$ 14311 43308 21295 47797 24690 11949 34342 45240 -32514 -87098 -51974 -63127 -51245
4170e1245L6308R455l4406n0926K8489j0968Q648J1663M5862M4508j0395k8059
$$ -51245 -14937 -5482 -39888 -90814 -62325 -73293 -64645 -52982 -7120 37388 26993 -1066
4158a066m8348n5418K3660M801N9310J727j7707k3916K2908j3500l0287L7538
$$ -1066 -49414 -104832 -81172 -76371 -17061 -15334 -33041 -56957 -34049 -47549 -77836 -40298
4146d0298Q2035K1457k409q7110k1153l2566n9011R213N9905L4660m3907j9307
$$ -40298 41737 63194 60785 -26325 -47478 -80044 -139055 -129842 -69937 -35277 -79184 -98491
4134i8491L0636N0277M7065j6152m0676m493l7037k7469n782N3749K9496J6510
$$ -98491 -67855 -17578 29487 13335 -27341 -31834 -68871 -96340 -102122 -48373 -18877 -2367
4122b367j1053L759K5543N3621k3547q971K9339N3941q003j07664j5082j6277
$$ -2367 -13420 -9661 15882 69503 45956 36985 66324 120265 112262 4598 -10484 -26761
4110b6761O639J1857j2075l828J2398l8373k616l468J0470R469j5640L0108J9835
$$ -26761 -20122 -8265 -20340 -24168 -11770 -50143 -52759 -56227 -45757 -36288 -51928 -21820 -1985
4097a985j460o0227M3409j593p9082k3290M1338J7051J8711J3638J0067P2767
$$ -1985 -3445 -63672 -20263 -21856 -100938 -124228 -82890 -65839 -47128 -33490 -23423 49344
4085D9344L4302l2694r0163o929L9920J7668j0769J8499L7432k0903p3472N3739
$$ 49344 83646 50952 -39211 -46140 -6220 11448 679 19178 56610 35707 -37765 15974
4073A5974l623J2152m7414k1068j820J1447k5524l9914m8491o152O0506R1042
$$ 15974 12351 24503 -22911 -43979 -45799 -34352 -59876 -99790 -148281 -154433 -93927 -2885
4061b885l0055n1585M5040L801j1036k0260P948k1416L6203O6683M7000J0808
$$ -2885 -32940 -84525 -39485 -35684 -46720 -66980 -59032 -80448 -44245 22438 69438 80246
4049H0246Q947j9226n9280m2811o105j9110o6891N4317L5646N762l1042p053m489
$$ 80246 89193 69967 10687 -32124 -38229 -57339 -124230 -69913 -34267 -28505 -59547 -66600 -71089
4036g1089P742K1286J550o138N3688K0835j3269j8802m0961k26K1391K589K6001
$$ -71089 -63347 -42061 -40511 -46649 7039 27874 14605 -4197 -45158 -45384 -23993 -21404 4597
4023D597J0950m1245j608K189L1053K4755l6290l5063K3270K2256P12j1826n0404
$$ 4597 15547 -25698 -27306 -25117 5936 30691 -5599 -40662 -17392 4864 5576 -6250 -56654
4010e6654j1644J1593L9053L4968k3796K260j5321J7955M9668M6463J963n6241
$$ -56654 -68298 -56705 -17652 17316 -6480 -4220 -19541 -1586 48082 94545 96508 40267
3998D0267n444j5508k0840m3437m5686K2283M8445L8484N090N092j3181L953K680
$$ 40267 34823 19315 -1525 -44962 -90648 -68365 -19920 18564 23654 28746 15565 19518 22198
3985B2198n0901J1375N8381n3391l1300J8905O4674K1969m3666j6810q8216j5004
$$ 22198 -28703 -17328 41053 -12338 -43638 -24733 39941 61910 18244 1434 -86782 -101786
3973a01786J4911O8815N7238J6790m2594o0943l2989k445J1133M8140K86K4129
$$ -101786 -86875 -18060 39178 55968 13374 -47569 -80558 -83003 -71870 -23730 -23444 685
3961F85L1399J1358J9620k5098j7626J1299K348m5234j0823L0052N2159K4216
$$ 685 32084 43442 63062 37964 20338 31637 33985 -11249 -22072 7980 60139 84355
3949H4355N322j6739l2285L3086J7689N292o1430m9756j4729M2521J3922m4573
$$ 84355 89677 72938 40653 73739 91428 96720 35290 -14466 -29195 13326 27248 -17325
3937a7325k213N7272k6793k2657m0033m8258P4139P7296R328J621q869l3392k4886
$$ -17325 -19538 37734 10941 -11716 -51749 -100007 -25868 51428 60756 62377 53508 20116 -4770
3924d770R646J3191j1884L6383O1245r895l8815l2784q883j4056p9167j0117R630
$$ -4770 4876 18067 6183 42566 103811 93916 55101 22317 13434 -622 -79789 -89906 -80276
3911h0276M1709N7019N817k1596K551o4326o2563k647J28K2112P5268K712j362
$$ -80276 -38567 18452 24269 2673 5224 -59102 -121665 -124312 -124184 -102072 -26804 -24092 -25454
3898b5454N0464J1216L3791J4072j8061j1022q061K1899l2914j041J5858n1379
$$ -25454 25010 36226 70017 84089 66028 55006 46945 68844 35930 34889 50747 -632
3886f32m2739K417k6627m0493j4713L6685J8171N1720L2724K5892K9299l5027
$$ -632 -43371 -40954 -67581 -108074 -122787 -86102 -67931 -16211 16513 42405 71704 36677
3874C6677k3374m5795l1122m9255l4148K5385N8947M1801K9597q14O910n311r992
$$ 36677 13303 -32492 -63614 -112869 -147017 -121632 -62685 -20884 8713 7899 14809 9498 -494
3861d94o520L5538N747l746n7873k0524J4890L6417r359k8066m872l9294M2495
$$ -494 -7014 28524 34271 30525 -27348 -47872 -32982 3435 -5924 -33990 -38862 -78156 -35661
3848c5661M5897L7628m8221k1012M1462k0444l2762k9603j2984K143J03016L3381
$$ -35661 10236 47864 -357 -21369 20093 -351 -33113 -62716 -75700 -73557 29459 62840
3836F2840J9737l4576m4708p285J7714K0163m4187J0376K145q2153j5296J9129
$$ 62840 82577 48001 3293 -3992 13722 33885 -10302 74 2219 -79934 -95230 -76101
3824g6101N5077L6184k0203k5503K2400l0325O916O0742o571q3359k3497J726
$$ -76101 -21024 15160 -5043 -30546 -8146 -38471 -31555 29187 22616 -60743 -84240 -82514
3812h2514K9498K7393l662M2631M1656J0188o3588o3366K4241Q052m5590O885
$$ -82514 -53016 -25623 -29285 13346 55002 65190 1602 -61764 -37523 -29471 -75061 -68176
3800f8176o614J8650M4386K2697l0849m9059N31j4874l344Q170K6970j8624l153
$$ -68176 -74790 -56140 -11754 10943 -19906 -68965 -68434 -83308 -86652 -78482 -51512 -70136 -73289
3787g3289K3810L089P1133N3098J1640j8210J3316n7136P401Q0273R66m2269j9998
$$ -73289 -49479 -46390 24743 77841 89481 71271 84587 27451 34852 115125 116091 73822 53824
3774E3824k7164o0083p2627O0432r081l5757K1578L6967R707j1261m0583k8896
$$ 53824 26660 -33423 -106050 -45618 -54699 -90456 -68878 -31911 -22204 -33465 -74048 -102944
3762a02944M9665J8270p539j8188p987k774L2163R4l838M7197M6733M4673l962
$$ -102944 -53279 -35009 -42548 -60736 -68723 -71497 -39334 -39240 -43078 4119 50852 95525 91563
3749I1563q8887m3082j1301K6925J4170L7149J868o4636J2843K8625n4884m2768
$$ 91563 2676 -40406 -51707 -24782 -10612 26537 28405 -36231 -23388 5237 -49647 -92415
3737i2415O1822N9397O258Q184M4676Q032l5658n8691L7428l1033m2548J0933
$$ -92415 -30593 28804 35062 43246 87922 95954 60296 1605 39033 8000 -34548 -23615
3725b3615K7999k2897k0995J4773l400K6256k5184N5838M7633r241k747l8717
$$ -23615 4384 -18513 -39508 -24735 -28135 -1879 -27063 28775 76408 67167 64420 25703
3713B5703o2939L3208o530p222O4418M0623k5343l4664j1433J3189J0929n1001
$$ 25703 -37236 -4028 -10558 -17780 46638 87261 61918 27254 15821 29010 39939 -11062
3701a1062K4774M5284k9277n5678m4773L131M7194j3678p120P616J7832l8351
$$ -11062 13712 58996 29719 -25959 -70732 -67601 -20407 -34085 -41205 -33589 -15757 -54108
3689e4108L142L5197o445l5827J3970M1513n3264n4163R0874J10284q478k9224
$$ -54108 -50966 -15769 -22214 -58041 -44071 -2558 -55822 -109985 -19111 91173 82695 53471
3677E3471K456l1385k7135n7273m5781J5207L4747p666l227j6023Q805p904M9046
$$ 53471 55927 24542 -2593 -59866 -105647 -90440 -55693 -63359 -66586 -82609 -73804 -81708 -32662
3664c2662j1448N9550m3611l3945N1038p134k8989J0228l1954n1409L8961l0451
$$ -32662 -44110 15440 -28171 -62116 -11078 -18212 -47201 -36973 -68927 -120336 -81375 -111826
3652a11826k9091k7106O3373J6221j3999K3592J9026M3405o7736n4758J896P1370
$$ -111826 -140917 -168023 -104650 -88429 -102428 -78836 -59810 -16405 -84141 -138899 -137003 -65633
3640f5633P7661O0207k4135q3088r97k8687k0478k8176M1115P2980M2613L4573
$$ -65633 12028 72235 48100 -34988 -35985 -64672 -85150 -113326 -72211 769 43382 77955
3628G7955m5999o8634k0913M7051j8546k4277K5400J6755P342J5948O2229n07
$$ 77955 31956 -36678 -57591 -10540 -29086 -53363 -27963 -11208 -3866 12082 74311 73804
3616G3804n353m4832k8448O6149k646k2333l2104m2234k7515J1577J1243J0754
$$ 73804 68451 23619 -4829 61320 58674 36341 4237 -37997 -65512 -53935 -42692 -31938
3604c1938K0607R43o1959o6070J3134L4033P3294K4764J1329O7485L4980n2255
$$ -31938 -11331 -10388 -72347 -138417 -125283 -91250 -17956 6808 18137 85622 120602 68347
3592F8347k4505o2434l141M8352j3502l9534L0062L038r414l7503K7379K9899
$$ 68347 43842 -18592 -21733 26619 13117 -26417 3645 6683 -2731 -40234 -12855 17044
3580A7044p443j9005N5965M4312k5880p4789l2043J4935J3953L3600L1111l1975
$$ 17044 9601 -9404 46561 90873 64993 -9796 -41839 -26904 -12951 20649 51760 19785
3568A9785M7975N6405m3858j3502k1589r643O314m5832j2971J3619J3497j1323
$$ 19785 67760 124165 80307 66805 45216 35573 41887 -3945 -16916 -3297 10200 -1123
3556a123j7070j2073M4972P231J1266j2986k4079k2685K974J4485J5744m6605
$$ -1123 -18193 -30266 14706 21937 33203 20217 -3862 -26547 -23573 -9088 6656 -39949
3544c9949K4500Q4536j0272m2890J71L8419L8163k4272l3716o399l9637m896J0564
$$ -39949 -15449 69087 58815 15925 16096 54515 92678 68406 34690 28291 -11346 -16242 -5678
3531e678N225K874l466K4022J3965l2295j6588k9273k3704j254K9741o665r040
$$ -5678 -453 2421 -1045 22977 36942 4647 -11941 -41214 -64918 -66172 -36431 -43096 -52136
3518e2136j5296k400K0390k9289J6494N4573N8192l2670j0954j0581l8744m2614
$$ -52136 -67432 -69832 -49442 -78731 -62237 -7664 50528 17858 6904 -3677 -42421 -85035
3506h5035R7251K2870J6838j386l3133l0223J1685K0593J6780o2296M1930O1004
$$ -85035 12216 35086 51924 50538 17405 -12818 -1133 19460 36240 -26056 15874 76878
3494G6878p400o200K3736K3964K0101l8687m7709m5443l8790p976k0254K2921
$$ 76878 69478 63278 87014 110978 131079 92392 44683 -760 -39550 -47526 -67780 -44859
3482d4859O274k0552Q554J01528M0568J1076N433o8599J162m207o6969L3226L4418
$$ -44859 -38585 -59137 -50583 50945 91513 102589 108022 39423 40585 36378 -30591 2635 37053
3469C7053K6972k89k2546J9665J9428l4182j7464L0716P99m9209L8703M6432j7672
$$ 37053 64025 63736 41190 60855 80283 46101 28637 59353 60152 10943 49646 96078 78406
3456G8406k5066l6259J9384J5990K3k5751o7652k1556N9330J3006j3358l5602
$$ 78406 53340 17081 36465 52455 52478 26727 -40925 -62481 -3151 9855 -3503 -39105
3444c9105O2933M690q5580J7530L465j6749J078L7867J8068j4484l9277j9390
$$ -39105 23828 28518 -57062 -39532 -36067 -52816 -51738 -13871 4197 -10287 -49564 -68954
3432f8954n1943n656J9436N466L1941N7294k6492n9865r093J8005O5906l2423
$$ -68954 -120897 -126553 -107117 -101651 -69710 -12416 -38908 -98773 -107866 -89861 -23955 -56378
3420e6378m8261k0782O815j659N0513P9339J3147k5165o8181j2103O319o201L7888
$$ -56378 -104639 -125421 -118606 -120265 -69752 9587 22734 -2431 -70612 -82715 -76396 -82597 -44709
3407d4709J8453L5802K025o5045n9192R6493M0146l7899m8829o5400k7060L5085
$$ -44709 -26256 9546 11571 -53474 -112666 -16173 23973 -13926 -62755 -128155 -155215 -120130
3395a20130O0462O3384K3438J3123j5272n3593k9522L0898O2888q319k2447J7103
$$ -120130 -59668 3716 27154 40277 25005 -28588 -58110 -27212 35676 27357 4910 22013
3383B2013k924Q866o7691K555O3633N3454R267N006k546L6730j4249K8853M814
$$ 22013 19089 27955 -39736 -37181 26452 79906 89173 94179 91633 128363 114114 142967 147781
3370A47781n4605j23935o8993j9194N4218L8697m2884m0428n1678L5418l6576
$$ 147781 93176 -30759 -99752 -118946 -64728 -26031 -68915 -109343 -161021 -125603 -162179
3359a62179L8000P3487J4560K7510k684n3309l9875r006o470M5523L4102J0756
$$ -162179 -124179 -50692 -36132 -8622 -11306 -64615 -104490 -113496 -119966 -74443 -40341 -29585
3347b9585K6310k0042j3807K3600J1586M4378j811p5313j2082j2732Q1020J0330
$$ -29585 -3275 -23317 -37124 -13524 -1938 42440 40629 -34684 -46766 -59498 21522 31852
3335C1852J9695j4081j9140k4554K5399J3276o813l3144l5639N6990K1825l9482
$$ 31852 51547 37466 18326 -6228 19171 32447 25634 -7510 -43149 13841 35666 -3816
3323c816j9298J3065J3776j6380k2763j9184L6150J2029L641j3538k9589k0882
$$ -3816 -23114 -10049 3727 -12653 -35416 -54600 -18450 -6421 -2780 -16318 -45907 -66789
3311f6789M694N658k6284O564O0085J9822M6499l5059m2725m5646J4064m628K9683
$$ -66789 -62095 -56437 -82721 -76157 -16072 3750 50249 15190 -27535 -73181 -59117 -63745 -34062
3298c4062K5472l4726l238K8800j2878L150k5690m0069j5186L8791J0595m1892
$$ -34062 -8590 -43316 -46554 -17754 -30632 -27482 -53172 -93241 -108427 -69636 -59041 -100933
3286a00933L2166J7920n715J9847k0334m9667J7590O5364l2201J4857O4657K8069
$$ -100933 -68767 -50847 -56562 -36715 -57049 -106716 -89126 -23762 -55963 -41106 23551 51620
3274E1620k2233m7210O978J2464N860O5953k0753l0038l0699m3712M591J1496
$$ 51620 29387 -17823 -10845 1619 7479 73432 52679 22641 -8058 -51770 -47179 -35683
3262c5683l4994J5663L0151j705l2482k6961N442J6111K5267j2195l445N215L8608
$$ -35683 -70677 -55014 -24863 -26568 -59050 -86011 -80569 -64458 -39191 -51386 -54831 -49616 -11008
3249a1008R023O46L2374m6898Q326j7540Q623K3795k6264q721L1187O256j0366
$$ -11008 -1985 -1339 31035 -15863 -7537 -25077 -16454 7341 -18923 -27644 3543 9799 -567
3236e67j6957L5460l7969j0498K768k8287l11N5325L5799j6438J841M593J5140
$$ -567 -17524 17936 -20033 -30531 -27763 -56050 -56361 -1036 34763 18325 20166 24759 39899
3223C9899K3889K1924L3706O606j8606O373j3734q2368k3477J281l5409M6341
$$ 39899 63788 85712 119418 126024 107418 113791 100057 17689 -5788 -4507 -39916 6425
3211F425P0671k0856m3625P889k8714m2644J8745Q3663j6438p8068n6296J6901
$$ 6425 77096 56240 12615 20504 -8210 -50854 -32109 51554 35116 -42952 -99248 -82347
3199h2347P5180K1529n2481l5843m6168k465Q7901L5172K8087r656L2050j5173
$$ -82347 -7167 14362 -38119 -73962 -120130 -122595 -34694 478 28565 18909 50959 35786
3187C5786n4898k4585K2452j4814l3698K486L7851K1351l326m5658K5041j517
$$ 35786 -19112 -43697 -21245 -36059 -69757 -67271 -29420 -8069 -11395 -57053 -32012 -33529
3175c3529m2905j3629N1206K2262K9038J014k0889M1039o4893l5060M4398k1686
$$ -33529 -76434 -90063 -38857 -16595 12443 13457 -7432 33607 -31286 -66346 -21948 -43634
3163d3634k72l2635J4179R631j9348J435k2073N8240N6011j6909k9729L9899K6584
$$ -43634 -43906 -76541 -62362 -52731 -72079 -70644 -92717 -34477 21534 4625 -25104 14795 41379
3150D1379j0690J0260J0385K2765O604l7167m8645j1207k8039N6629K2916K1280
$$ 41379 30689 40949 51334 74099 80703 43536 -5109 -16316 -44355 12274 35190 56470
3138E6470k6589l369J721R912r682p910K6832m2560o9474l0066J6257N8177J7863
$$ 56470 29881 26512 28233 38145 28463 20553 47385 4825 -64649 -94715 -78458 -20281 -2418
3125b418j2184j5399j0688k5054K3505o0166q516M9886N826M6104l539J469k3406
$$ -2418 -14602 -30001 -40689 -65743 -42238 -102404 -110920 -61034 -55208 -9104 -12643 -11174 -34580
3112c4580l3283P578N6489J2402L6122L7308J4456K2417m7518j13324o4227L1786
$$ -34580 -67863 -60285 -3796 8606 44728 82036 96492 118909 71391 -41933 -106160 -74374
3100g4374L0706m1454K4561N6155Q316o7703k3269J4L731N1533L1848j8826J5001
$$ -74374 -43668 -85122 -60561 -4406 3910 -63793 -87062 -87048 -83317 -31784 64 -18762 -3761
3087c761j1220R386j0106K0431J1510k8564m5655K5726M1432N1389n5589n4567
$$ -3761 -14981 -5595 -15701 4730 16240 -12324 -57979 -32253 9179 60568 4979 -49588
3075d9588J5030r14o3718l076M8960J4406K9326L310j1227n9275q1823R1777P0651
$$ -49588 -34558 -35472 -99190 -102266 -53306 -38900 -9574 -6264 -17491 -76766 -158589 -66812 3839
3062C839J8346P710q057m5312l9306r289M2847N3216J1970o906M09o913L0355
$$ 3839 22185 29895 21838 -23474 -62780 -72069 -29222 23994 35964 29058 29467 22554 52909
3049E2909l3192K8274M3055j7861q7183k7280N6182L0712r3976m0862N2431M7855
$$ 52909 19717 47991 91046 73185 -13998 -41278 14904 45616 -48360 -89222 -36791 11064
3037A1064L5243n2582J5085L738j95L3707l3179K4961M3903Q609m495o2341j7324
$$ 11064 46307 -6275 8810 12548 12353 46060 12881 37842 81745 90354 85859 23518 6194
3024F194O9906J2645n8671n0473K6311l8505n685N3166J8822k5959r683L6202
$$ 6194 76100 88745 30074 -20399 5912 -32593 -38278 14888 33710 7751 -1932 34270
3012C4270k7304j1044N7362L7066o248l1733l173j6653J8790L757J6029N947J4667
$$ 34270 6966 -4078 53284 90350 84102 52369 49196 32543 51333 55090 71119 77066 91733
2999I1733R345m2489o1512r481l5163O192L1764l0170K8598k7578m4560m4275
$$ 91733 101078 58589 -2923 -12404 -47567 -41375 -9611 -39781 -11183 -38761 -83321 -127596
$$ [...]
##END NTUPLES=NMR SPECTRUM
##END=
