##TITLE=Analysis number 319048
Compound Code cc 15539
Project Code adrs
Chemist Name scafell
##JCAMPDX= 6.0         $$ Bruker NMR JCAMP-DX V2.0
##DATA TYPE= NMR SPECTRUM
##DATA CLASS= NTUPLES
##ORIGIN= Bruker BioSpin GmbH
##OWNER= nmr
$$ XWIN-NMR		Version 3.5
$$ Fri Apr 28 10:08:22 2006 GMT Daylight Time (UT+1h)  MAYBRIDGE\nmr@NMR_250MHZ
##.OBSERVE FREQUENCY= 250.131544655141
##.OBSERVE NUCLEUS= ^1H
##.ACQUISITION MODE= SIMULTANEOUS (DQD)
##.ACQUISITION SCHEME= undefined
##.AVERAGES= 16
##.DIGITISER RES= 18
##SPECTROMETER/DATA SYSTEM= dpx250
##.PULSE SEQUENCE= zg30
##.SOLVENT NAME= CDCl3
##.SHIFT REFERENCE= (INTERNAL, CDCl3, 0, 16.522)
##AUDIT TRAIL= $$ (NUMBER, WHEN, WHO, WHERE, WHAT)
$$ ##TITLE= Audit trail, XWIN-NMR		Version 3.5
$$ ##JCAMPDX= 5.01
$$ ##ORIGIN= Bruker BioSpin GmbH
$$ ##OWNER= nmr
$$ C:\u/data/dgb/nmr/ADRS/3300/pdata/1/auditp.txt
$$ ##AUDIT TRAIL=  $$ (NUMBER, WHEN, WHO, WHERE, WHAT)
(   1,<2006-04-28 10:07:51.64 +100>,<MAYBRIDGE\nmr>,<NMR_250MHZ>,
      <created by zg, POWCHK disabled, PULCHK disabled
       configuration hash MD5:
       84 BC 41 DB A1 6E 1D 46 DA 25 12 A5 C1 ED C5 3A
       data hash MD5: 64K
       C3 E5 E6 52 28 41 FF F3 85 09 17 53 37 D0 73 3F>)
(   2,<2006-04-28 10:08:11.14 +100>,<MAYBRIDGE\nmr>,<NMR_250MHZ>,
      <Start of raw data processing
       ef LB = 0.3 FT_mod = 6 PKNL = 1 SI = 32K 
       data hash MD5: 32K
       F7 B8 80 5A 38 E9 D5 03 BC 7C 05 36 FD C6 77 FD>)
(   3,<2006-04-28 10:08:12.77 +100>,<MAYBRIDGE\nmr>,<NMR_250MHZ>,
      <apk 
       data hash MD5: 32K
       72 59 2F 96 D9 F3 22 4E BA 20 D9 7D B6 5F 96 5C>)
(   4,<2006-04-28 10:08:13.52 +100>,<MAYBRIDGE\nmr>,<NMR_250MHZ>,
      <abs ABSG = 5 
       data hash MD5: 32K
       80 F3 FF EF 69 57 6B 5B 55 69 FB 10 47 CE 4A 46>)
$$ ##END=
$$ 
$$ hash MD5
$$ AA 76 49 90 4A A6 4C 6D 5F 48 AC F0 53 BC 7B BE
##$RELAX= 
##$RELAX= 
##$RELAX= 
##$RELAX= 
##$RELAX= 
##$RELAX= 
##$RELAX= 
$$ Bruker specific parameters
$$ --------------------------
##$DU= <C:\u>
##$EXPNO= 3300
##$NAME= <ADRS>
##$PROCNO= 1
##$TYPE= <nmr>
##$USER= <dgb>
##$AMP= (0..31)
100 100 100 100 100 100 100 100 100 100 100 100 100 100 100 100 100 100 
100 100 100 100 100 100 100 100 100 100 100 100 100 100 
##$AQSEQ= 0
##$AQ_mod= 3
##$AUNM= <au_zg>
##$AUTOPOS= <11 >
##$BF1= 250.13
##$BF2= 250.13
##$BF3= 250.13
##$BF4= 250.13
##$BF5= 500.13
##$BF6= 500.13
##$BF7= 500.13
##$BF8= 500.13
##$BYTORDA= 1
##$CFDGTYP= 0
##$CFRGTYP= 5
##$CHEMSTR= <none>
##$CNST= (0..31)
1 1 145 1 1 1 1 1 1 1 1 1 1 1 1 1 1 1 1 1 1 1 1 1 1 1 1 1 1 1 1 1 
##$CPDPRG= <>
##$CPDPRG1= <>
##$CPDPRG2= <>
##$CPDPRG3= <>
##$CPDPRG4= <mlev>
##$CPDPRG5= <mlev>
##$CPDPRG6= <mlev>
##$CPDPRG7= <mlev>
##$CPDPRG8= <mlev>
##$CPDPRGB= <>
##$CPDPRGT= <>
##$D= (0..31)
0 1 0 0 0 0 0 0 0 0.06 0 0 0 0 0 0 0.0002 0 0 0 0 0 0 0 0 0 0 0 0 0 0 
0 
##$DATE= 1146215268
##$DBL= (0..7)
120 120 120 120 120 120 120 120 
##$DBP= (0..7)
150 150 150 150 150 150 150 150 
##$DBP07= 0
##$DBPNAM0= <>
##$DBPNAM1= <>
##$DBPNAM2= <>
$$ [...]
##$SUBNAM7= <"">
##$SUBNAM8= <"">
##$SUBNAM9= <"">
##$SW= 20.6930455092707
##$SWIBOX= (0..15)
0 0 3 0 0 0 0 0 0 0 0 0 0 0 0 0 
##$SW_h= 5175.983436853
##$TD= 65536
##$TD0= 1
##$TE= 295.16
##$TE2= 300
##$TE3= 300
##$TEG= 300
##$TL= (0..7)
0 120 120 120 120 120 120 120 
##$TP= (0..7)
150 150 150 150 150 150 150 150 
##$TP07= 0
##$TPNAME0= <>
##$TPNAME1= <>
##$TPNAME2= <>
##$TPNAME3= <>
##$TPNAME4= <>
##$TPNAME5= <>
##$TPNAME6= <>
##$TPNAME7= <>
##$TPOAL= (0..7)
0.5 0.5 0.5 0.5 0.5 0.5 0.5 0.5 
##$TPOFFS= (0..7)
0 0 0 0 0 0 0 0 
##$TUNHIN= 0
##$TUNHOUT= 0
##$TUNXOUT= 0
##$USERA1= <user>
##$USERA2= <user>
##$USERA3= <user>
##$USERA4= <user>
##$USERA5= <user>
##$V9= 5
##$VALIST= <valist>
##$VCLIST= <CCCCCCCCCCCCCCC>
##$VD= 0
##$VDLIST= <DDDDDDDDDDDDDDD>
##$VPLIST= <PPPPPPPPPPPPPPP>
##$VTLIST= <TTTTTTTTTTTTTTT>
##$WBST= 1024
##$WBSW= 4
##$XGAIN= (0..3)
0 0 0 0 
##$XL= 0
##$YL= 0
##$YMAX_a= 467229
##$YMIN_a= -535863
##$ZGOPTNS= <>
##$ZL1= 120
##$ZL2= 120
##$ZL3= 120
##$ZL4= 120
##$ABSF1= 16.522
##$ABSF2= -4.171173
##$ABSG= 5
##$ABSL= 3
##$ALPHA= 0
##$AQORDER= 0
##$ASSFAC= 0
##$ASSFACI= 0
##$ASSFACX= 0
##$ASSWID= 0
##$AUNMP= <proc_1d>
##$AZFE= 0.1
##$AZFW= 0.1
##$BCFW= 0
##$BC_mod= 0
##$BYTORDP= 0
##$COROFFS= 0
##$CY= 12.5
##$DATMOD= 1
##$DC= 0
##$DFILT= <>
##$DTYPP= 0
##$F1P= 14.0000005364418
##$F2P= -0.99999901652339
##$FCOR= 0.5
##$FTSIZE= 32768
##$FT_mod= 6
##$GAMMA= 0
##$GB= 0
##$INTBC= 1
##$INTSCL= 1
##$ISEN= 128
##$LB= 0.3
##$LEV0= 0
##$LPBIN= 0
##$MAXI= 10000
##$MC2= 0
##$MEAN= 0
##$ME_mod= 0
##$MI= 0
##$NCOEF= 0
##$NC_proc= -2
##$NLEV= 6
##$NOISF1= 0
##$NOISF2= 0
##$NSP= 0
##$NTH_PI= 0
##$NZP= 0
##$OFFSET= 16.522
##$PC= 1
##$PHC0= 168.3861
##$PHC1= 6.386647
##$PH_mod= 1
##$PKNL= yes
##$PPARMOD= 0
##$PSCAL= 4
##$PSIGN= 0
##$REVERSE= no
##$SF= 250.13
##$SI= 32768
##$SIGF1= 0
##$SIGF2= 0
##$SINO= 400
##$SIOLD= 32768
##$SREGLST= <1H.CDCl3>
##$SSB= 0
##$STSI= 32768
##$STSR= 0
##$SW_p= 5175.98343685301
##$SYMM= 0
##$S_DEV= 0
##$TDeff= 65536
##$TDoff= 0
##$TI= <Analysis number 999999
Compound Code 99
Book Reference 9
Project Code 9>
##$TILT= no
##$TM1= 0
##$TM2= 0
##$TOPLEV= 0
##$USERP1= <user>
##$USERP2= <user>
##$USERP3= <user>
##$USERP4= <user>
##$USERP5= <user>
##$WDW= 1
##$XDIM= 32768
##$YMAX_p= 330301643
##$YMIN_p= -39390
$$ End of Bruker specific parameters
$$ ---------------------------------
##NTUPLES= NMR SPECTRUM
##VAR_NAME=  FREQUENCY,     SPECTRUM/REAL,   SPECTRUM/IMAG
##SYMBOL=    X,             R,               I
##VAR_TYPE=  INDEPENDENT,   DEPENDENT,       DEPENDENT
##VAR_FORM=  AFFN,          ASDF,            ASDF
##VAR_DIM=   32768,         32768,           32768
##UNITS=     HZ,            ARBITRARY UNITS, ARBITRARY UNITS
##FACTOR=    0.157963299565203, 1,           1
##FIRST=     4132.6476996994, 0,             0
##LAST=      -1043.33573715361, 0,           0
##MIN=       -1043.33573715361, -39390,      0
##MAX=       4132.6476996994, 330301643,     0
$$ Real data points
##PAGE= N=1
##DATA TABLE= (X++(R..R)), XYDATA
$$ [...]
19694 11892 6299 5604 7947 8100 6467 7310 1457 2285 653 -3945 -2326 -7796 -6693 1433 -4404
19679 -4404 -12384 -7799 -1963 -1994 2368 203 -11895 -24248 -30035 -20493 -13299 -7851 -3645 6014 13931
19664 13931 8285 6046 -1616 -977 1662 -1931 3770 14793 12863 12749 890 3007 9990 14945
19650 14945 11052 19815 23584 18647 22618 43609 48718 51819 61519 75105 82428 100536 117999
19637 117999 134148 144733 145475 136252 111963 99636 79401 66597 59011 48375 45826 37845 37891
19624 37891 42465 42099 24100 5347 801 12123 22131 22851 18412 8796 13669 9727 9719 7919 2478
19609 2478 6065 817 5000 18429 27791 17872 6572 913 -1790 -6041 -6053 -976 7395 9692 8917
19594 8917 4554 5007 4809 -1466 -9424 -9802 -7749 -242 686 -3862 -6091 -16464 -15121 -6185 79
19579 79 -12 -8097 -7636 -6031 -2464 -7396 -4672 1660 6434 3047 -3674 -13839 -8974 2374 11969
19564 11969 21398 21197 15466 10077 -93 -8410 3209 3612 -4280 -4857 9326 7113 5591 4343
19550 4343 2840 -140 -3909 -472 9336 13431 8777 -4082 -5625 5618 7887 3191 4184 3020
19536 3020 432 -5432 -11031 -11659 -16996 -12936 -11132 -7545 -8637 -12123 -11153 -2891 1880 -1523 -8555
19521 -8555 -13934 -9152 -5904 -6416 2239 -2924 1227 6190 4238 6351 3911 9655 14602 10874 -2584
19506 -2584 -8986 -1842 5395 8283 7664 8045 291 -3683 -6127 2285 13058 15650 20713 19201 15977
19491 15977 12855 11296 14735 19994 9234 6143 9113 15342 4964 -5996 -8518 4228 8078
19478 8078 16980 19895 24822 25841 25543 25706 15991 1871 -1624 8236 3062 -5940 -11416 993 1537
19463 1537 6206 13573 4159 -9658 -12910 -4050 -1365 -8423 -10050 -3853 -5754 -10826 -5040 -1408
19449 -1408 3496 -1593 -13042 -5912 -7890 -15180 1835 15066 14973 13014 13870 14122 15137 13740 20749
19434 20749 23423 23830 37342 40443 32021 19225 1431 -97 6698 10137 7321 4320 6482 5758
19420 5758 12485 19166 26459 25426 19328 9790 6208 5761 -1680 -8910 422 -2040 -3205 -2819 -10272
19405 -10272 -9235 -7022 -7223 82 -1385 -4452 -219 -1324 -4362 -2662 919 2956 6224 10213 15433
19390 15433 16732 12016 4832 9558 16091 11210 13443 20443 24273 18096 11712 11036 5126 570 9609
19375 9609 12478 5391 -1825 -689 -3900 -4848 3077 3403 7259 3627 -2840 -652 -8804 -7263 -6299
19360 -6299 -1876 2886 1152 700 -754 -2303 -7451 -1369 11699 14132 15766 8609 16896 15924 4214
19345 4214 -165 -1358 3159 -794 -374 6096 10221 10867 537 -1816 577 2678 6134 3894 1282
19330 1282 -1065 -6011 -10089 -7914 10063 13663 7164 4755 8009 8393 7658 16141 17752 20587 26940
19315 26940 22549 6183 -5596 -12988 -6636 8855 12241 6546 -8637 -9560 -1518 9384 20701
19302 20701 20971 16244 7316 4558 10870 19640 16620 9729 -1280 5460 16950 19043 4192 -7428
19288 -7428 981 7786 5039 1283 5127 4288 7721 8324 10266 4058 -3409 -10230 -11006 -8456 -9687
19273 -9687 -2119 3965 1658 3436 10507 11616 4565 6835 10140 16661 8323 7354 3847 510 2372
19258 2372 19431 26376 21810 17029 6339 11211 13972 8415 -1292 -10223 -7613 -12573 -10221 -9326
19244 -9326 -16603 -20829 -14641 -8053 -13065 -16861 -15326 -12971 -13567 -15265 -9324 -397 7293 4711 -2321
19229 -2321 8042 5358 1521 -8547 -7969 -1900 -324 373 -11623 -14191 2362 6110 3617 1601
19215 1601 3085 3440 5066 8060 -3771 -6593 -4767 4755 -1105 4987 7784 6997 -889 7364 24450
19200 24450 27620 32678 34731 33564 44583 57519 62036 66746 78044 88549 98307 107090 114165
19187 114165 123252 136319 144686 155799 164320 166995 173251 177487 181214 180197 169753 142099 127618
19174 127618 118167 110067 94857 73753 59501 59641 49779 45667 49848 43119 28691 26263 33395
19161 33395 31914 37985 58862 58514 57893 58796 58898 52789 54500 54952 55937 53653 48576 43807 44108 46901
19145 46901 39526 33812 31097 29615 30647 40856 43655 49620 57934 64464 56917 45934 47167 45402
19131 45402 39296 37177 37514 39632 39591 40087 37097 44243 61258 62336 62716 69656 65480 56169 51755
19116 51755 52898 63009 69502 67017 75123 68282 61991 62011 62891 63373 72712 72722 78120 89782 108015
19101 108015 127687 154355 188484 213141 239341 260262 277434 294727 312974 328373 338894
19090 338894 344936 352561 368471 378927 396050 406218 410625 426157 459681 480539 495102 526608
19078 526608 575853 645268 724942 810554 897961 1013786 1149382 1293012 1493966 1761585
19068 1761585 2138587 2669528 3449789 4617556 6321971 8658589 11636999 15173362 18834586
19059 18834586 22123719 24845139 26537555 26772146 25389943 22947592 20053512 16581335
19051 16581335 13197332 10460034 8322638 6757815 5678039 4937408 4396303 3980127
19043 3980127 3641706 3366498 3128696 2911006 2729939 2584703 2447012 2324311 2213728
19034 2213728 2115463 2024028 1945528 1873476 1806447 1749569 1706122 1662402 1608528 1556325 1524346
19023 1524346 1503595 1495831 1468015 1446559 1423201 1390656 1350764 1309574 1267192 1227546 1183975
19012 1183975 1144181 1097649 1054368 1017473 983689 947259 917464 894456 875204 850821 831206
19001 831206 807704 776894 750746 729788 712981 692834 675858 662665 649625 629285 615716
18990 615716 604602 591780 583251 575273 574976 556864 541063 534949 522916 513413 491148 471382 460551
18977 460551 446494 438065 429264 417022 407007 397814 393130 386059 376501 365155 367914 360080 350625
18964 350625 349440 348731 331133 325570 328824 320986 306640 300242 305101 301496 308430 315895 325043 338989
18950 338989 338500 336241 332965 327355 322174 315626 318856 329246 355714 388979 412711 424021 432291
18937 432291 446061 459275 469248 468283 464947 459285 448293 436350 427423 409773 392099 370666 345873
18924 345873 325742 313117 313830 311511 298288 283418 272219 270681 269140 261686 254583 244580 240947
18911 240947 251054 255069 265062 270546 272464 273343 273666 278440 281686 269696 262969 267368 264698 257775
18897 257775 244282 226029 222281 224875 223026 217291 224265 225800 228042 229121 218561 217617 216345 208231
18883 208231 201533 196655 186900 178337 180256 181836 177976 171858 170938 174783 179516 187978 197536 199452
18869 199452 197374 199462 195229 182789 171316 161989 176424 182902 191254 193116 196072 209181 203464
18856 203464 193340 189357 184223 188949 183638 176316 174198 172295 171098 166830 162877 156828 154715 143874
18842 143874 134269 128437 124070 120935 123482 121349 112002 94209 100694 105844 102900 102634 106689 107639
18828 107639 96425 95430 100165 99027 96745 100166 102868 95478 89676 91526 102196 108650 106137 103608
18814 103608 101646 97575 91826 90939 87702 91117 103597 104625 103965 92944 91918 85417 78639 77835
18800 77835 77752 72039 78414 82560 87059 93215 101815 103573 99101 97598 95324 81231 75762 80608 86285
18785 86285 82291 78794 82314 90475 87514 88836 90668 84276 82883 86028 92493 103991 100900 97009
18771 97009 96721 108421 115919 115534 113956 121937 135528 146831 153903 157527 158643 156102 142348 118076
18757 118076 108212 102897 92784 89773 84149 82735 85235 81694 76821 70431 68083 68727 61536 60088
18743 60088 57691 60302 64915 73300 69069 60275 52890 60944 57241 52427 58769 66838 58018 46311
18729 46311 61081 69607 69953 58084 56778 52259 52957 43150 40336 36710 31470 38402 47359 63522
18715 63522 58089 51769 50617 51595 50131 52278 47149 37890 39800 47254 49501 52643 50661 52318 51618
18700 51618 50371 44077 46578 37174 38921 44611 39230 44246 40264 41777 49101 43589 44127 45481 34436
18685 34436 44825 56888 57340 56334 52395 47263 32558 33685 45402 50763 50403 52135 43012 37104
18671 37104 47504 50057 47224 46588 50979 54428 61313 71290 70363 59578 43633 35642 40582 46502
18657 46502 34760 42902 49175 45311 42027 43609 48558 49244 44226 49726 68669 67355 59613 54039
18643 54039 66661 77002 73962 69673 75239 78622 79532 80683 86056 88554 87674 84205 92617 96771
18629 96771 99469 96653 87180 86431 80374 77412 86190 97134 101913 102756 100090 99855 103025 100216 111836
18614 111836 121988 128370 140232 148920 149668 153413 171414 175711 167390 156657 153026 168112 179674
18601 179674 183320 183500 182355 180748 180533 169266 176496 175899 162401 144041 128298 130228 126857 114237
18587 114237 104788 103493 106254 101672 94591 91215 93226 98824 104652 103780 101079 96290 101009 108884
18573 108884 117971 127220 123720 123423 125741 140574 141675 141783 146292 146232 139252 142706 136912 136840 149110
18558 149110 156278 156595 166809 164630 158333 144048 133798 136957 133105 131647 140281 129410 119640
18545 119640 124328 128149 126660 119865 119969 128531 125022 134022 156046 172273 178838 192424 203993
18532 203993 224937 245135 264457 279874 299497 318323 338146 365468 401118 435450 470748
18521 470748 498914 524490 549317 553373 550637 542320 546262 546016 540055 528087 535319 537579 544617
18508 544617 563512 588160 607785 626993 664052 728084 820988 978950 1231477 1561458 1832561
18497 1832561 1978879 2069151 2170216 2228388 2158557 2168745 2434669 2821188 3073734 3151995
18487 3151995 3180340 3156574 2917524 2395921 1933597 1697215 1619859 1660228 1770490 1886102
18477 1886102 1935541 1953754 1959236 1921497 1795178 1619375 1489436 1423978 1394689 1395226 1403084
18466 1403084 1421080 1451531 1514900 1618599 1782063 1978866 2178532 2395511 2657719 2957659
18456 2957659 3273719 3609485 3999020 4357043 4599098 4788396 5043073 5318763 5509252
18447 5509252 5774447 6224770 6728307 7261814 7950193 8748101 9223282 9291475 9424239 9703103
18437 9703103 9818582 9744366 10115705 10925343 11485955 11462422 11201652 10886318 10239480 8790925
18427 8790925 7053886 5851258 5172783 4830680 4699200 4683542 4698168 4690806 4681987 4661721
18417 4661721 4588307 4453846 4323512 4256142 4287686 4427865 4690163 5068851 5587883 6302076
18407 6302076 7302428 8780613 11054035 14504457 19161980 24254368 28783272 32789396
18399 32789396 36885674 40552821 42314063 41693908 40270445 38806820 36939169 34644909
18391 34644909 32463940 31194005 31172046 32220004 34081032 36285656 38456519 40053528
18383 40053528 40246361 38422237 35157995 31567225 27973660 23883410 19542691 16090294
18375 16090294 13746063 12147918 10998447 10128539 9449029 8898718 8436599 8070461 7797045
18366 7797045 7612875 7514753 7510844 7570785 7648562 7743985 7930748 8275890 8796805 9463190
18356 9463190 10219883 10909247 11355671 11576505 11674995 11697458 11700411 11850945 12356857 13002470
18346 13002470 13757651 14668180 15408664 15461876 14824784 14263517 13887619 13458388 12786529
18337 12786529 11939395 11207532 10652380 10160650 9443989 8702431 8333642 8281167 8301610 8213049
18327 8213049 8056704 7841398 7445521 6844614 6219687 5789248 5556999 5433370 5357291 5335781
18317 5335781 5410375 5591873 5882132 6216340 6418625 6450624 6437135 6410492 6212633 5762390
18307 5762390 5376132 5170776 5036950 4959562 4949469 4977275 4997096 5072430 5327626 5790848
18297 5790848 6402365 7124706 7887580 8535231 8957176 9090609 8928922 8454191 7703409
18288 7703409 6814074 5931105 5099230 4365093 3842974 3508550 3296569 3166003 3070212 2993262
18278 2993262 2948272 2942306 2960996 3025010 3154647 3357228 3637808 3933336 4164838 4264604
18268 4264604 4242396 4134261 3927941 3603832 3205951 2907013 2729910 2621103 2550880 2520644
18258 2520644 2540925 2620745 2802559 3109833 3439097 3611177 3616274 3592818 3536448 3277800
18248 3277800 2806571 2417959 2198494 2080663 2025328 2048230 2141623 2245848 2286754 2272156
18238 2272156 2242282 2197781 2077002 1867913 1688246 1569746 1492362 1432445 1387678 1363186
18228 1363186 1339089 1306975 1265234 1232254 1210484 1192620 1166030 1128063 1098060 1082336 1057586
18217 1057586 1036354 1017006 997768 973469 954209 931621 904545 888155 884386 860943 850302
18206 850302 855450 844716 820359 800485 776034 772134 749193 720376 699683 686561 667867 660349
18194 660349 652099 638323 624097 625184 640634 631139 612214 598000 600099 594155 564057 556570 557488
18181 557488 553280 540262 529121 515758 501372 495141 495812 488204 490148 486183 481511 478235 476909
18168 476909 467276 455333 440376 418434 399658 390697 390490 400576 379727 356827 355660 356153 341434
18155 341434 336172 327960 324098 335029 341156 340180 337367 331320 321350 316566 317748 321255 311608 302895
18141 302895 302563 298835 295155 294159 295912 288365 289949 293555 307622 313813 312158 305847 300156 312867
18127 312867 314626 316562 312572 317315 326512 331712 339082 347896 368466 403140 440101 485518 544218
18114 544218 625452 753985 937925 1211404 1696386 2595728 4186446 6483460 8410454
18105 8410454 8911590 8960976 9181940 9168434 7164327 4504958 3037224 2290427 1864257
18096 1864257 1593611 1408658 1262469 1146413 1046256 976898 928120 876268 836325 791408
18086 791408 747674 722827 696253 670696 645167 616482 591384 558551 542629 541865 534053 511274
18074 511274 491884 478576 457769 447485 443013 448531 440346 430228 418436 395586 378977 371084
18062 371084 355137 352642 345556 344759 343207 332400 323895 319362 314994 310108 307539 299674 293157 278302
18048 278302 261657 265283 252639 244714 235271 232824 233083 227683 228921 226805 211292 209765 209728 204503
18034 204503 199287 192494 188456 186902 190922 193735 179771 170268 165510 159467 159905 159795 151616 151994 154972
18019 154972 154959 147232 137982 137300 135412 144361 138024 126153 123745 131593 137953 130768 117429 116740 124191
18004 124191 130680 134331 142064 150935 159599 170818 196406 215418 230116 242643 256605 272360
17992 272360 281594 274610 259012 239169 222689 203546 191953 185023 183584 178167 175864 173875 162992
17979 162992 155828 146467 144250 143765 134840 128454 137046 143006 145488 142745 145423 148631 139309 134150
17965 134150 128244 124341 121212 121909 131857 132509 139744 136984 131374 126573 125196 117425 108485 109307 106479
17950 106479 100816 101152 103870 104407 100264 90224 81304 74896 71132 64267 72328 70065 68134 82545
17936 82545 79666 74200 74459 78142 77983 67167 70862 84241 97963 96538 102670 106430 109648 119889
17922 119889 126368 119290 111722 102241 111067 119632 113595 108742 114043 121829 127549 128282 116641 93929
17908 93929 84532 79494 75495 77058 82203 83282 79643 78363 84401 90494 88904 87779 90672 94794
17894 94794 97608 92880 98459 110614 109165 104116 98365 101327 96030 94330 95066 98110 101190 114481
17880 114481 126624 134355 134110 134923 141726 142749 136041 138331 132050 134086 124115 109944 108824 103509
17866 103509 106812 106931 107855 114341 113775 110323 103562 92498 71846 67920 63938 62541 69084 66716
17852 66716 61794 54619 57618 66032 73863 83228 91216 98683 97642 98421 96112 89271 91283 111480
17838 111480 115185 104618 99991 105521 106134 105064 110879 108402 112579 112380 109784 110944 107971 102490
17824 102490 98354 90426 90819 86862 80255 74703 71261 68519 75949 87700 85989 76884 69372 67740
17810 67740 68073 54407 45957 42747 47361 51329 60524 60225 55712 55444 56909 52728 50120 51886 50132
17795 50132 51573 62256 65385 60045 62469 61816 62218 62710 70679 81521 83708 77868 72560 65555 65314
17780 65314 65294 62895 66992 65601 67430 58519 52896 37392 34495 36871 43220 45162 44963 39910 42503
17765 42503 53397 48784 28171 18822 19744 24010 21361 30076 38279 43549 43840 34604 33258 42050
17751 42050 44298 40306 27756 24046 37271 37805 37129 45023 38816 32459 32114 32290 34557 42635 39069
17736 39069 29504 28568 37631 31199 20515 13006 21060 24218 21209 23606 20771 17244 18921 14929
17722 14929 12253 13849 18837 11437 10396 11511 12875 11868 17358 20674 26218 32308 28629 19550
17708 19550 22102 34503 34616 23745 22698 18311 16126 15270 10822 16162 27940 25061 12340 10235
17694 10235 6354 11033 7157 8273 10514 19019 23142 24197 15009 11453 6110 2592 5261 -206
17680 -206 4391 19897 11736 1876 6234 8045 3719 3342 10680 15930 13697 14340 15315 15530 5351
17665 5351 -4 -759 2480 8423 20127 22601 15461 11273 19746 24821 17657 16320 17462 14292 15340
17650 15340 14113 14858 10488 13613 17540 19620 10628 5914 8397 -3378 -2001 1770 3843 10480
17636 10480 15290 16952 16117 15219 21347 20300 24106 20084 19329 8992 5187 10692 1905 2377 1606
17621 1606 -374 3979 10314 10154 4671 14406 18506 12770 14986 14975 4074 7294 9967 6994 10861
17606 10861 21287 19082 6640 555 9236 15178 7794 285 66 7863 17186 25221 25083 20916
17592 20916 17708 23075 22653 20928 14393 12681 16906 14445 9389 8915 16751 12062 5700 -2724 -1071
17577 -1071 4108 6425 15302 21969 26284 23314 20409 17161 5291 6994 11415 9210 9164 -490 -5888
17562 -5888 1618 5750 2823 14532 23004 15596 8383 19477 30557 24418 24651 19406 9185 5211
17548 5211 6190 14944 11788 15688 18613 17061 16173 11718 6411 7337 5475 6834 8700 13372 11141
17533 11141 13650 17478 22449 15845 5338 4241 8550 -126 4716 -1411 5662 6907 146 8050
17519 8050 11593 9005 4486 15114 20159 15030 12875 9277 13229 7562 5973 7515 9102 8862 4976
17504 4976 7472 9556 13084 12380 10117 8055 6724 1873 3717 14629 12684 14394 12358 11405 5479
17489 5479 5288 14949 14338 13466 7544 6360 8354 -1516 -354 10563 20007 24743 22577 20427 15403
17474 15403 4679 -1842 -551 3970 8009 10133 3832 -6679 7656 12342 19936 17744 16879 12236
17460 12236 6468 5259 -2936 -1678 4170 3682 811 1253 3477 -1209 6854 -2299 6284 14508 10559
17445 10559 17548 19116 19985 17423 30329 49578 59268 66221 77066 77373 58221 38523 23782
17432 23782 14665 15929 20169 20180 16508 631 -6976 566 3748 12768 15393 13433 8777 14033 8041
17417 8041 -762 2433 8917 7145 -1981 -1167 8937 16853 23238 27443 22250 15403 6335 -2898 -13658
17402 -13658 -16309 -12233 -6974 -2782 -304 1233 -1593 -5206 -804 3742 1284 2919 1752 6125
17388 6125 12193 4358 7460 12894 8250 9991 10816 15247 16801 23257 21355 17292 11409 9461 14580
17373 14580 19556 13078 8314 11765 14687 21025 13325 8135 8886 11531 13781 17324 29079 37421
17359 37421 33271 31340 18587 16261 9834 1074 -5360 -10690 5754 21277 28668 24614 15628 10674
17345 10674 8722 2461 718 -1245 -11976 -10379 -12470 -15226 -17576 -7007 11381 12025 7005 18936
17331 18936 18948 11816 8123 11770 15113 11120 10900 14296 12763 9472 5277 10566 2560 -5221 -7965
17316 -7965 -11300 -1171 2725 8940 5924 7139 1386 -2538 -958 -1292 -4490 24 4649 6998 9410
17301 9410 4149 6414 11697 16755 8884 1432 -4601 -4464 -1093 -1934 2140 13088 13362 4955 1276
17286 1276 5434 6661 1702 4633 14993 18679 14183 10928 6339 6153 7047 9836 11204 13207 8792
17271 8792 5840 8891 11805 7443 4730 7568 6930 5781 4299 3875 -1641 5357 12244 7785 6958
17256 6958 738 -4894 -5048 -9168 -11578 -5791 -4573 -9010 -7859 -6746 -3279 2970 -16 -1712 12462
17241 12462 19765 15688 6519 4676 4551 8045 4735 9708 12937 20215 19225 17797 16099 11677 2249
17226 2249 628 3966 -321 4727 10809 8084 5087 2609 3206 13145 14071 4869 5220 6631 11086
17211 11086 13647 11151 9603 6565 1633 8560 12885 6082 -227 -328 -16031 -25728 -18561 -6372
17197 -6372 1189 2454 7265 12033 15636 10405 16413 10867 14069 13402 10092 2201 569 -2979 -4356
17182 -4356 2773 -953 7807 11244 10207 5321 187 -4441 -2148 -1385 -13395 -13437 -2139 -3147 2113
17167 2113 12798 16573 13754 15831 12469 2069 9283 19805 20917 17403 5108 2951 -5467 2279
17153 2279 3888 -2753 -485 930 7924 9377 8052 5578 10927 9827 4756 -4071 -3717 7057 10570
17138 10570 10505 3960 -8438 -11449 -4991 -337 10509 8859 5034 6452 3962 4222 2886 4901 6931
17123 6931 8486 6646 847 -4338 -11743 -4396 -2741 -6268 -5858 -9103 -7130 -5613 -2050 -5288 3816
17108 3816 7720 4362 3838 10708 15292 21291 12768 9751 2133 5545 15420 16585 11031 15167 8068
17093 8068 4904 9404 10346 13215 2612 4269 7715 5525 19065 16279 13101 12404 6423 9628 14638
17078 14638 5811 858 -2358 1695 2733 9521 7800 -5042 -2255 -2326 -7948 -6470 -7008 -10983 -5375
17063 -5375 5325 17511 19448 15148 7571 10840 7385 -1446 -1765 6156 4967 5235 1884 -6309 -7325
17048 -7325 -13803 -15989 -13291 -6022 -758 2941 6119 -1424 1180 -1407 2326 -2536 -81 760 -319
17033 -319 577 10560 9342 11360 10698 2020 -4823 2001 10067 12864 9247 8088 -611 -3149 -1355
17018 -1355 4678 10581 4830 -1654 -2257 -1369 1556 5175 -293 2739 -3681 -12288 -14297 -16962 -8713
17003 -8713 3141 4275 8601 2670 -6235 -3950 5342 -1032 -8899 -10350 1878 8151 8783 14906
16989 14906 7945 -659 685 6915 3981 7122 5693 7892 -1451 -1121 11716 9463 6055 13525
16975 13525 17723 13873 2321 -11356 -172 7689 9560 4601 -6291 -13039 124 8808 8131
16962 8131 4786 8262 9529 14575 17159 20717 20135 18475 17780 16730 12514 18353 29719 21141 7357
16947 7357 8980 9832 4277 7842 14494 17923 22252 30517 34052 34219 36634 32775 29497 25525 30019
16932 30019 46677 54888 61235 58206 54818 51953 60715 62913 64749 72282 72695 69868 67877 65268
16918 65268 59046 49382 42443 40000 32550 32014 36744 31829 23669 15140 21227 27579 25740 23615 30131
16903 30131 30093 23620 21112 26954 31393 33175 34052 40032 31845 28127 12372 9564 14774 23874 29847
16888 29847 25402 21510 25133 22729 19813 13075 12721 17089 22934 29003 21678 19423 29561 30275 26363
16873 26363 19718 12438 8172 13521 5539 4127 2387 2686 6349 9569 16831 16426 6318 1365 -762
16858 -762 2761 7576 13501 15420 11122 11157 7858 12500 18964 9036 -1408 -12073 -15691 1612 -184
16843 -184 673 8258 8370 -3391 2196 2464 -6445 -3528 5324 11928 14075 6204 1772 2484 12260 5988
16827 5988 3087 4316 1066 4862 1256 5371 18720 17385 11308 11904 12127 8927 872 4873 6826
16812 6826 6451 2926 7797 10320 12091 12214 13053 3010 -3070 -2772 175 -249 -2292 2303 4580 7902
16796 7902 5953 8720 5895 -1909 -855 4882 8369 11515 13738 16117 22085 12666 2284 1550 -1528
16781 -1528 -3096 -121 4662 -5712 -11566 -13635 -15063 -9925 -12954 -13815 -17134 4105 7146 -942
16767 -942 3639 5091 -169 9705 18362 6770 6950 -1721 -10335 -13785 -5037 2765 3557 1176 1155 1670
16751 1670 2929 4708 11628 14934 4343 913 -919 -2106 1553 7567 21401 19720 8043 5401
16737 5401 8128 6840 -2037 -29 5836 5077 1525 -1450 -1479 4775 13975 12566 9626 2692 -6023
16722 -6023 -3731 -3198 -5574 -8022 -9018 -4342 -4586 1417 5739 4697 5441 217 -6687 1379 1251 -4410
16706 -4410 -8294 -11089 -11199 -705 234 -7237 -2686 6235 5933 4293 1937 7378 3546 -4936 -12706
16691 -12706 -14698 -13639 -7757 -3567 -3089 -10375 -6677 -7735 -12505 -15983 -16045 -10768 -8023 -7832 -7563 -6581
16675 -6581 5194 6335 6212 2844 7760 1000 -3822 -3002 2544 9964 13332 14745 12272 -2768 -5904
16660 -5904 674 -3511 -5553 -2644 -652 1694 63 3846 6775 7285 8359 13274 15531 19587 8850
16645 8850 -5386 -2267 8588 9792 2073 -3904 839 3614 4986 571 -10495 -12157 -19118 -20446
16631 -20446 -12760 -12190 -17992 -13561 -5840 699 5972 9356 7065 -472 2135 9224 6249 5218 13212
16616 13212 20119 8152 4598 9129 3097 -6482 -5361 1823 8625 9043 -1770 -4741 6590 -2088
16602 -2088 -6364 -4660 -6799 -10748 -8302 -5441 -5625 -4124 -2074 -5550 -9087 -10703 2719 -5041 -13056
16587 -13056 -10511 -11969 -7399 -5754 6307 -1421 373 1020 -1586 -6803 -234 271 1564 1456 9180
16572 9180 7556 -298 -1190 -1748 -4140 3 583 -3371 5375 10110 15463 23959 14915 1509 594
16557 594 9026 9892 7035 2411 -3090 -4083 -8915 -18790 -14601 -9077 -5064 -6666 -6887 -6169 17 5843
16541 5843 526 -5748 -13746 -26177 -16946 -16617 -13333 -21458 -25867 -17335 -661 -794 -8483 -10347 -9291
16526 -9291 1530 -15 -2910 -1152 -8167 -9120 -8607 -1742 4011 -7625 -14352 -16191 -5542 -5753 -631
16511 -631 2493 225 3892 1736 -4625 -2182 -19 9416 3534 4778 11037 3211 10530 19813 24238
16496 24238 9596 1082 4295 20501 24521 17619 10196 -864 787 -5207 -7224 -13837 -5854 -7523
16482 -7523 -9786 -1151 6587 3504 5565 7431 5455 9601 10288 11342 13799 14343 6854 -6903 -13769
16467 -13769 -12987 -445 16023 17079 13771 7176 1832 -5972 -2659 -222 2466 6067 3590 11651
16453 11651 19649 5153 1248 8683 1632 -5426 -623 -2570 9104 5705 2249 4048 7460 12589
16439 12589 18225 13626 19862 32327 40502 42557 37297 49523 61965 67935 76685 81765 98790
16426 98790 113915 114367 121150 126889 127903 130677 131462 124656 115365 110373 113401 126018 125502 106701
16412 106701 98527 96460 79671 66505 65031 57448 59413 56451 52923 43101 36990 31449 30098 32060
16398 32060 23056 21179 14881 14268 19865 23360 21951 23030 17348 5201 5008 12901 13866 21659 25244
16383 25244 20459 21040 18035 -591 -4829 -1268 -1934 7416 17323 8140 10188 13640 11954 5213 2384
16368 2384 -1840 -1061 3003 7518 8709 15992 8573 -4547 -5247 2328 -4027 -3679 13144 11950 16056
16353 16056 19922 14883 5691 3511 2601 5684 3923 -3984 -6647 14 7898 16401 10835 9426 5866
16338 5866 -118 -1318 579 -7156 -6680 -861 3047 3092 7266 17871 15559 18895 22083 20472 16512
16323 16512 5155 1409 2162 10926 6649 8823 10235 6773 -2148 4374 5465 -209 -10051 -9825 -10811
16308 -10811 -4252 2478 3731 -4746 1029 802 3738 3454 1836 4000 -8117 2242 8745 7425
16294 7425 -2279 -7228 1781 8601 894 -3457 4291 8987 -523 -4125 -5986 -6593 -9933 -12948 -8850
16279 -8850 -1198 -974 -3400 -3206 -3316 698 -5671 -5193 4048 14426 15929 16753 15505 14711 5596 -6509
16263 -6509 -15573 -16057 -9380 -5944 -6187 -9694 -4928 -5115 -908 5503 5395 3355 -4054 -4384 -11954 -12794
16247 -12794 -14002 -10658 -841 -4195 3675 6148 -6270 -11510 -5613 -4270 -7124 -2903 1418 11399
16233 11399 19130 20507 8989 205 5005 4364 8519 10538 3305 6430 2260 -9782 -10063 -5861
16219 -5861 -7021 -2937 -2120 -2103 -1930 4502 3610 -4019 -6546 -441 2131 4722 17069 15960 14839 9451
16203 9451 -3463 -5612 -10185 -19143 -15640 -11513 -13038 -17275 -13012 -3393 -1183 6530 10772 9308
16189 9308 11634 9043 2239 -6710 -17237 -20595 -12328 -5124 -4534 -3245 -2872 2504 941 -4349 249
16174 249 -4394 -3033 -2321 -2928 3261 2978 1252 -6003 -6372 2046 -4024 -16609 -10750 -5054 -6493 -8860
16158 -8860 -9341 -13781 -19163 -16286 -8930 -4813 -9370 -12204 -4026 9130 -2644 -4084 -1660 -6423
16144 -6423 -14504 -9945 -5201 -4739 -6114 -4743 -7121 -2450 -4626 -3080 5035 4644 -2636 -7448 -10749
16129 -10749 -1711 7279 7917 2388 -6876 -9995 -6527 -3138 507 -297 1483 1164 503 7797 10142
16114 10142 9256 8966 11121 18789 19317 13139 5091 7644 10396 9303 11829 6832 86 1161 3944
16099 3944 4346 8139 9362 2290 5083 17430 20098 14896 11816 11775 3722 -4669 -7103 -12678 -4045
16084 -4045 -154 -2547 145 3307 3417 5436 8239 5198 1034 6531 989 -5113 3342 5297 2909
16069 2909 -3886 -3782 2675 11976 16466 13570 8508 2716 1590 4354 -7549 -6383 387 2308 741
16054 741 -6597 -6114 -6489 1188 1257 -4429 -8076 -10882 -8566 -2268 4545 13449 6428 -3352 -1418 2202
16038 2202 4825 2909 5383 -4380 3295 9858 13197 12318 67 1059 1895 7929 16539 24102 22835
16023 22835 14958 10157 7967 2446 -2989 -12506 -10177 -4807 -3556 -288 1018 2288 3941 4777 6650
16008 6650 9546 3598 -5786 -8777 -12863 -6588 -7285 -11006 -3044 -1359 -2493 -44 6660 8291 1060
15993 1060 4385 7817 5917 -1288 -5911 996 2859 9485 15707 13326 17445 22418 16157 8019 4649
15978 4649 2452 4979 2719 10708 3435 -6261 -3799 -1688 -1502 -9387 -17607 -14040 -296 1418 -2297
15963 -2297 -7016 -10022 -3148 -1887 -301 -1912 -6536 -10361 -9855 -82 4033 691 -337 8539 5286
15948 5286 2690 1947 -299 143 1521 10749 18197 7464 -1228 307 10694 7975 2450 -479 2723
15933 2723 -3018 -8 11116 9978 11259 9656 11727 8110 15250 23337 18181 9578 11455 5950
15919 5950 -506 -6759 -12067 -5610 7112 10108 6280 15681 23526 13269 -787 -9088 -7374 -5126
15905 -5126 -5048 -4874 -7596 1015 -3713 1790 648 4301 7631 6793 5058 760 -9211 -9240 -5691 -6433
15889 -6433 -2126 2445 4004 -655 -4425 436 -1341 -3835 -4571 -6573 -14446 -15345 -9616 -40 -1063
15874 -1063 -4079 -9885 -7826 -4487 1584 3188 3977 8972 6513 2550 9367 9760 695 -626 -1369
15859 -1369 -6561 -8683 -19554 -8066 -1386 -201 1142 4190 4314 -137 -11050 -15842 -12196 -5710
15845 -5710 -10156 -1601 1621 -6755 -14086 -13861 -8567 -15689 -21248 -19663 -22926 -26717 -22395 -19938 -9023
15830 -9023 -6720 -13769 -19556 -21958 -19693 -18628 -11925 -14863 -7572 -5778 2343 -6636 -8353 -5288 -4879
15815 -4879 10121 5411 -7504 -12533 -7619 -689 1355 128 1425 8474 1578 -2803 -4025 -6637
15801 -6637 -10247 -16818 -14378 -375 730 -4302 -3498 485 -4219 -10832 -6483 -8818 -2819 6321 13214
15786 13214 14369 11658 7786 4348 5101 -5631 -7778 -2494 4541 7373 6658 -3917 -6052 278
15772 278 10251 14603 17403 9242 5766 -2858 -3784 3655 14084 8213 2108 -2904 -12801 -597 6690
15757 6690 -5967 -9241 -8826 -4873 -9571 6883 15417 12695 3796 -1415 -7841 -2954 -1935 -9347
15743 -9347 -5765 3135 6347 6516 1755 -5912 -18557 -22467 -17260 -10350 -5496 -3379 -3484 4223 3178
15728 3178 2848 5552 10912 4622 11598 3730 4021 15789 15461 8250 -7719 -12989 -15306 -4964 1411
15713 1411 -5207 -18174 -15530 -14219 -10264 -2609 -1958 -7137 -391 -175 1493 -258 -2323 3041 -323
15698 -323 -4577 -5615 -432 -3159 -7046 -1012 824 -1348 -1323 2592 -5207 -9902 -10355 -12676 -13837 -7010
15682 -7010 2300 -326 -1749 11925 15377 5825 9433 -820 -3693 2745 5849 6235 -7325 -14567
15668 -14567 -12620 -14837 -16593 -9785 -2653 3965 7404 1381 -4715 -12073 -7317 -3695 -1452 -7049
15654 -7049 -10848 -11509 -10506 -14150 -20591 -9020 1527 15841 19630 15686 12148 12673 7534 4372
15640 4372 -3980 -8481 -9300 -4314 5573 3193 9650 11180 8318 14194 16363 8640 1615 3299 -3421
15625 -3421 -14643 -18246 -12838 -2127 1256 -3802 -2080 5286 6476 11254 14559 5248 7116 13545
15611 13545 16260 14801 6730 -1783 -6237 -7122 -7253 -6011 9305 9457 -5978 -25019 -22792 -13685
15597 -13685 -10329 -10906 -7232 -10 1071 -8820 1118 -3678 -2943 -8257 -6001 -7005 -6798 -5124 -1859
15582 -1859 -4679 -1959 1720 2146 -3151 -442 9580 17093 -514 -8067 -5106 -2255 -12424 -13844
15568 -13844 -5455 1846 751 1572 -7162 -9923 -2616 8779 7938 -5350 -8788 -13272 -15767 -11463
15554 -11463 4172 2980 -1137 1939 2683 -4133 -4558 7193 -2431 -6506 -8017 -9176 -9669 -7792 -3339
15539 -3339 -8799 -6727 -10920 -10235 -8253 1251 9225 2250 -6734 -1458 -581 139 -2425 284 -5941
15524 -5941 -11423 -12343 -6158 -2786 -10123 -10422 -5389 -2554 -6575 -6457 -1956 719 -5251 -15205 -16952
15509 -16952 -2595 13237 11760 7451 4622 -2799 -2774 -533 2299 9784 10541 4696 7045 4839 -2225
15494 -2225 1270 6924 12939 7975 -1955 5841 15899 13451 7617 -180 -6288 -11753 -11636 -7535 -4356
15479 -4356 -5136 -4504 -3441 3067 -791 -8652 -9142 -10285 -1258 4533 6830 8295 -637 -7733 2430
15464 2430 -748 -1065 2131 -1240 2004 6093 5084 9503 12920 9172 7616 9615 2709 730 6160
15449 6160 881 -12012 -11147 4456 16249 14314 8129 -71 -8642 -11408 -12204 -10438 -7370 -10541
15435 -10541 -1683 5888 13404 15027 11460 9938 2478 -8754 -6374 -5566 -7781 -8443 -11564 -3578 -463
15420 -463 -10792 -10739 -18768 -16580 -11433 -15162 -10058 -3317 -8334 -4599 -3982 -4502 -250 16994 16295 12266
15404 12266 -2162 -4441 5059 11162 6107 -5129 -4765 -519 3928 8285 6646 -8814 -9768 -309
15390 -309 9503 17544 17830 8478 9896 6524 -3211 -9319 -11076 -4633 6181 10360 3834 4957 11733
15375 11733 9127 14642 15975 1907 -292 8280 -261 -2330 -7263 -12112 -2663 -14299 -10466 -2173
15361 -2173 -3797 -6647 -14918 -19386 -20667 -17654 -11593 -12764 -2049 3073 9694 16710 12439 2972
15347 2972 -4910 -4107 2588 -33 -1241 2649 1606 3053 8355 4062 1858 3139 10339 8013 5349
15332 5349 -4694 -14494 -17255 -18933 -21513 -14079 -13164 -15314 -10482 -13831 -12717 -14768 -8128 3692
15318 3692 2403 3722 9748 8446 9461 8690 -784 1448 9062 10754 734 -6296 -8336 -13283 -11229
15303 -11229 -4895 4289 1753 -2876 -1296 1266 835 7733 9499 5476 5155 4345 1126 -6262 -6863
15288 -6863 -2728 -3986 -12939 -3674 -6597 -7737 -4341 -6299 -4360 -4861 -11277 -16789 -15082 -4795 -602
15273 -602 -1592 -2548 -1311 -7099 -18685 -9752 2092 -1278 -8499 -13295 -7524 -2808 9442 21536
15259 21536 29167 25290 12003 4749 1412 -2127 -819 -4348 -7019 -2787 3621 317 -6014 -10400
15245 -10400 -8514 -7892 -6460 -3888 -1304 3545 6003 -1355 -4036 -4599 -3277 -527 -1843 1021 -7356
15230 -7356 -3871 -7433 -6837 -5859 -9259 -11354 -19589 -14820 -8097 -7944 -11288 -15803 -12823 -8636 -1419
15215 -1419 -4147 2862 7642 6916 5079 -4100 -3942 -11791 -3384 8328 11679 9131 -4348 -7233 5460
15200 5460 8310 4201 2839 1837 -609 -2003 -4478 2768 15960 10047 1405 -1728 -2561 -10847 -13259
15185 -13259 -8041 -12013 -17318 -12121 -17711 -10334 -3515 -1549 -2194 -12055 -12367 -13217 -12071 -11562 -9766
15170 -9766 -7249 -5396 -3880 -6623 -1248 2334 2219 3198 -6886 -5093 -11146 -15485 -11671 -2096 -1606
15155 -1606 -1794 -1289 -4434 -4057 -6845 -11643 -6684 -13411 -15790 -13611 -3712 -972 -2521 -9375 -7924
15140 -7924 3400 2922 -6279 -7556 -4725 -7170 -15792 -20213 -17615 -9945 -3075 -3611 -6646 7656 8839
15125 8839 7888 2909 -3654 -3739 -11818 -7547 -4654 -4982 -11105 -15690 -12261 -7503 -11566 -9065 -8883 -18194
15109 -18194 -9322 -13515 -11533 -8004 -8364 -3816 5998 10251 12379 15822 5463 1967 7146 4520
15095 4520 9777 8997 5652 14687 21111 11244 5735 4184 -3615 -4031 -6736 -6412 -11007 -18260 -15230
15080 -15230 -20094 -15001 -5374 269 -1432 245 -1248 3115 14267 10880 2722 1621 1413 2725
15066 2725 42 -11350 -11470 -7575 -12958 -10360 -1702 3230 2409 -6262 -8687 -17904 -19692 -4308 -4362
15051 -4362 -8059 -10385 -18792 -27496 -19894 -18273 -10760 -4983 -10213 -591 10888 6777 1268 1702 6383
15036 6383 -4088 -2894 1298 -421 16137 25724 5827 -5228 -6083 -10981 -16475 -12753 3300 6135
15022 6135 11011 15298 14988 15662 8750 7878 13022 7288 -5791 -12021 -15623 -13808 -12347 -15207 -25857
15007 -25857 -31993 -26228 -10995 -12065 -10806 -4951 -8661 -10744 -16069 -13985 -13962 -15126 -15549 -8391 -2603
14992 -2603 2897 3312 -5595 -6519 -9321 -7560 -12374 -10444 -7676 -8942 -8465 -13280 -14412 -6806 4890
14977 4890 7374 3220 428 1437 952 -2122 -1435 -1847 -3387 -8836 -8599 -8588 -15301 -13727 -13216 -4288
14961 -4288 -7672 -12000 -12778 -6573 12032 7351 2118 354 449 4843 7461 6853 9388 14018 13009
14946 13009 6804 3764 -1112 -13027 -24823 -14689 -17690 -28589 -28496 -15412 -13157 -3962 310 3613
14932 3613 3030 -2008 -3571 -6282 -686 7477 7365 6752 7233 3307 188 -8245 -7357 -1623 3758 4358
14916 4358 4211 -3954 -15252 -5043 857 2977 -2718 -4471 -9111 -10413 -3399 -2491 -9128 -4720 -4146
14901 -4146 -7435 -11051 -16960 -4464 9619 10615 7960 1683 1536 8743 -477 1187 2484 2626 6660
14886 6660 2170 9950 -5527 -14238 -9108 -6529 -6770 -11112 -157 9406 12701 10892 12860 7002
14872 7002 3299 -642 -5319 -5528 -11703 -10007 -9741 -588 1431 6031 2582 7158 11096 13271 13026
14857 13026 15483 12883 18105 10676 6135 -8475 -18139 -18840 -11811 -4832 1811 -4468 -1700 3908
14843 3908 7493 11274 6771 -760 -5472 -2361 -3054 3112 11033 21458 21359 16097 9915 8517 9791
14828 9791 9134 -1194 -3233 59 8386 10207 5120 -7483 -3895 8095 9125 10145 10712 6388
14814 6388 12740 27345 37706 38022 47758 61241 66168 65239 62731 58470 58145 61416 62696 55794 52927
14799 52927 58244 61866 53813 46234 32069 28537 19852 15696 11961 18483 22048 22472 18324 5665
14785 5665 2054 8925 10826 13935 9849 3161 7295 9030 -1667 3301 10611 6030 1822 -1665
14771 -1665 -642 -5486 1819 6947 -934 -5644 -2685 9292 18593 16977 15851 4921 -1771 3993
14757 3993 13667 12667 4990 95 2092 2243 2524 4131 3090 4306 3981 7876 12757 14179 4243
14742 4243 4153 -156 -6022 -11596 -12561 -12763 -9359 -7709 -4335 7627 8577 14197 11779 4205 -8214
14727 -8214 -20150 -7491 5760 2867 -2946 296 4162 5729 1795 -5045 -125 8895 8507 -791
14713 -791 -5164 -6331 -5580 -13033 -6628 -3512 -8924 -1302 -2784 -7371 3873 10721 13543 5601 -1064
14698 -1064 12759 28107 28884 18516 11844 1091 1945 10400 10379 5917 5194 6928 11372 7822 7747
14683 7747 3985 8927 3336 -8142 -8524 -8668 -1745 2787 5292 2085 3256 3196 -759 -6684 -6135 3001
14667 3001 14171 13736 9648 4501 2802 937 446 -1393 -2047 -2584 -8262 -14469 -15397 1168 10880
14652 10880 9103 1091 -2100 -2512 -1018 -8116 -13296 -10466 -6586 -5612 -7276 1058 932 -3134 -4445
14637 -4445 5841 9345 6968 -2647 -10159 -2564 6991 4623 -663 7322 8114 7421 3542 -2687 -4043
14622 -4043 -6117 -16063 -8022 -2740 3376 9431 8174 5152 2263 -4949 -11018 -12961 -14143 -6515 -3071
14607 -3071 903 -1813 -4044 2136 6390 12121 16260 16419 5689 2973 -7807 -12059 -3113 -4311
14593 -4311 -2790 3165 -1996 -4339 -4385 -5164 7241 7844 5117 3824 4706 533 -7434 -2243 -2822 -9846
14577 -9846 -12371 1803 8402 11430 7209 2208 1017 -2715 56 7545 5883 11127 12869 20401
14563 20401 12996 51 -3344 -134 8917 13634 8086 1389 910 1814 1887 -23 -2794 -6152 -3373
14548 -3373 -3098 -2162 1929 8188 3382 -2466 -7903 -10575 -10547 -6780 -12275 -8241 7090 12533 9696
14533 9696 2468 -5129 -1399 -8126 -10215 -13417 -11641 -14222 -23032 -20707 -12057 -13582 -9994 -5395 4840
14518 4840 2362 -3983 -1932 -712 177 -2081 -7575 -8759 -5180 -238 6697 2744 -5708 -8817 -8874
14503 -8874 -7307 -3741 -69 7190 6858 4803 6733 3625 4624 6668 8368 8567 5423 4069 2613
14488 2613 9941 15660 16768 10461 8788 -2933 -9199 -3493 -1007 2076 -5562 -6062 -2004 4710 8154
14473 8154 6073 16260 15533 9519 3716 3256 -1154 2721 11379 13336 10854 7683 1893 -6201 -7346
14458 -7346 -12286 -13400 -8590 -2316 -6171 -5838 -13126 -20607 -29266 -33322 -38807 -28899 -25330 -13539 -3854
14443 -3854 1031 -4224 -12356 -15331 -8654 -6066 -3376 -6589 -12558 -5401 2817 1496 186 -9599 -5903
14428 -5903 -3136 -4346 8075 12466 12116 6080 6559 8349 -561 -4162 650 2438 -5299 -13320 -16725
14413 -16725 -9316 -215 -1405 -4671 -3187 2624 6971 11406 7068 4242 -5751 -6508 -6907 -19511 -25085
14398 -25085 -18684 -11502 -6243 -4097 -14133 -18832 -19548 -11155 6863 13154 660 -7744 -3076 -10505
14384 -10505 -11729 -3200 -6599 -7202 -2463 1885 -22 -3461 -7070 -6027 -8291 -10365 -9046 -762 -2627
14369 -2627 1965 4674 1053 -1623 2314 3338 -2183 -5553 842 1723 -9119 -9309 -9024 -9282 -10699
14354 -10699 -10318 -17156 -8715 -6122 -6606 986 -6979 -24028 -26961 -20597 -18656 -10352 -13816 -16481 -5214
14339 -5214 -3899 -5854 -18088 -19166 -18152 -4408 397 -6295 -8818 -8723 -7322 -7384 2172 8489 10501
14324 10501 7578 11412 8820 9416 7595 5769 4084 8628 991 -8867 -6542 -4454 -3360 -10619 -12159
14309 -12159 -8423 2646 -2279 -1856 -3700 -1872 2689 3641 -8411 -8059 -4541 -6233 5086 696
14295 696 -7459 -11878 -20914 -19976 -13460 -6085 -4011 -1658 1824 797 3440 -3639 -6227 -1917 -1117
14280 -1117 2022 -10885 -13790 -10284 -770 4262 7772 15454 11981 9753 14492 17631 17710 11793 6986
14265 6986 7929 9769 10332 1738 -1291 5389 13431 4137 -10489 -18267 -11500 -9847 -7082 -5416 -6516
14250 -6516 -3466 -2443 -11516 -11207 -1880 -63 1021 -4592 -8643 -8039 -10884 -7119 -5254 -8637 -13808
14235 -13808 -11746 -9205 -11093 -17049 -16136 -12068 -8661 -6058 -9163 -4852 10622 7043 1829 2365 3629
14220 3629 -2372 -6491 -3200 -14063 -18696 -18928 -15698 -8822 -7310 -3585 -4228 604 -7430 -15992 -16631
14205 -16631 -15433 -8871 -4513 -7461 -5135 1183 -2441 -3580 -6265 -3230 2949 10249 5961 -4978
14191 -4978 -9242 -11612 -15451 -7664 4701 -510 -6672 -10085 -5101 1774 -1577 -4303 -6190 -2697
14177 -2697 -1452 -1339 -3218 -7655 -11579 -6044 -5158 -6798 -21787 -21303 -17031 -14547 -14444 -9371 2820
14162 2820 7122 -898 -10118 -7472 -2687 127 -428 -3840 -3576 -2533 -10345 -7505 -10888 -11696 -12340 -9985
14146 -9985 -6010 54 -1120 721 1160 10138 7316 5496 1844 8225 9668 3149 -1603 -5195 2409
14131 2409 -1850 -5331 -2913 -9951 -8190 10346 16454 12758 6097 4888 7500 8752 5166 1343
14117 1343 6478 5395 7575 6229 8301 3883 181 2528 7291 -654 -4143 -8903 -10635 -1103 5178
14102 5178 5417 1184 -10479 -6086 85 -1813 3374 17518 23611 27395 20016 21470 22175 12541 16728
14087 16728 28085 32704 29672 32858 26880 24104 27125 21051 26866 30765 27202 17066 20606 14165
14073 14165 20029 17697 11879 14512 14199 14730 21134 15224 9859 13042 17910 21777 7926 7530 9217
14058 9217 14488 18786 20596 11719 1911 2279 5657 -1054 -3396 -3554 -2475 -9757 -6273 -5146 -9532
14043 -9532 111 14428 11926 5938 2441 11371 12086 8929 6715 4181 10585 16175 8674 302 -7816
14028 -7816 -11607 -11850 -12421 -5579 1068 8454 19933 25114 14552 14794 10229 9443 5915 5043 5948 7619
14012 7619 6982 -2829 -8714 -1080 3319 -3682 -8708 -5150 -2655 -449 -990 -1924 -3194 -95 -2232
13997 -2232 -1037 5725 19779 14163 7550 9909 4227 -1682 -3650 -2142 306 2407 5839 15064
13983 15064 5697 2971 1298 10723 5455 -3306 -3576 -1727 4332 5049 5519 -4269 -2881 -6268 -11053
13968 -11053 -6607 1241 -7780 -11697 -8089 1621 2822 2000 -7453 -13362 -11041 -4935 -3040 -1601 9701
13953 9701 18149 24538 17688 11527 12540 10799 -3859 -5174 3215 8512 6994 2262 -6677 -3709
13939 -3709 4453 2254 -348 -286 -2390 651 213 -3367 -139 9049 6141 -3819 1131 4934 13859
13924 13859 13917 5294 -2558 -7066 4400 10007 1958 5090 3721 3078 5292 -422 -3532 1452 2310
13909 2310 1046 3972 2040 4366 19526 9699 3203 -527 4272 4124 3079 9582 21271 28213
13895 28213 22285 14394 -4597 -10274 -4746 -7549 -4292 2011 1734 8103 9915 -429 -7217 -1510
13881 -1510 13541 15570 6808 7323 12042 5797 5722 -346 4957 4227 -13458 -19125 -6038 1476 -6301
13866 -6301 -8073 -11613 -11451 -14257 -8386 -2451 2657 12141 7381 -12223 -7993 -3314 -9165 -12112 -20865
13851 -20865 -20058 -4484 7575 8696 1802 10136 15203 10989 -5936 -10133 -5296 -5489 -6317 -6599 -4792
13836 -4792 584 8149 5527 -209 -5231 -14147 -26865 -11471 1527 5705 8061 4299 5295 3580
13822 3580 -1984 -3077 -855 3263 341 5784 2384 1710 -2876 906 1626 -935 -394 2962 -3549
13807 -3549 1650 984 -6246 -12684 -7450 1119 11215 5563 7532 5338 -3538 2380 11879 -911
13793 -911 -15914 -19350 -15593 -14201 -7995 8649 6363 8227 16423 14479 278 2349 5872 1843
13779 1843 -3566 -5653 -6081 -5812 -4615 -2918 -5026 -5586 -4877 3855 7715 7278 6114 8664 8857 -5366
13763 -5366 -9229 6567 7286 3695 -258 3282 14687 13111 5710 13218 16321 10440 4191 3196 1431
13748 1431 1019 -5404 -1094 3409 8040 6721 -107 -9529 -7618 -5655 -4691 -9641 -15430 -20667 -21885
13733 -21885 -18451 -14052 -17332 -11613 -4498 3370 10285 6441 7180 6487 6807 2908 -1007 -452 -7445
13718 -7445 -11836 -5204 -7854 -11909 -12929 -4678 -3935 -6409 5075 20169 19390 11373 5831 7060 7364
13703 7364 7949 14877 15345 11868 15721 5012 2553 6979 13199 13745 7708 7351 9682 19047 11542
13688 11542 10818 7621 6735 10369 13161 8486 5333 2819 5061 12267 15178 16550 10029 9479 7618
13673 7618 -3512 -1691 1487 -930 -4765 3413 14120 11945 11479 2204 -1106 7074 13706 10347
13659 10347 2268 -766 -3459 -9522 -11856 3022 13420 16574 6621 1588 -1899 -3177 4408 9302
13645 9302 4198 4152 16139 16122 9053 935 -621 5199 -1481 -2966 -6351 -2345 1847 -3052 -7911
13630 -7911 249 6569 12324 18962 17187 14871 23877 26848 31542 23627 11021 -3285 -5715 -5589
13616 -5589 -8217 -10823 -7214 -9012 -4206 2465 7556 14210 24049 22591 16522 12515 10789 8359 9161
13601 9161 14883 16110 7889 8072 12626 11947 6734 12082 15884 7088 3443 4221 -120 -2835 4422
13586 4422 15764 19871 12010 12375 5952 431 3843 9570 12583 10151 10126 11207 873 -7323 1233
13571 1233 9049 -3744 -15282 -15963 -11778 5884 16855 17995 18425 16664 8144 -168 -6793 -3379
13557 -3379 2837 10995 -220 -12889 -8606 -3056 10326 16172 7384 -3038 -6310 -2158 -497 3016
13543 3016 7441 17712 18594 11483 3069 6130 3695 1990 13076 24194 25922 17211 6688 -2582
13529 -2582 4470 9471 8782 10440 19344 20644 11118 9007 10205 16903 25842 27992 19085 17776 15681
13514 15681 10352 16949 24586 19746 20796 20119 19620 17685 18614 19724 19780 20057 22435 21197 20096 17293
13498 17293 15589 24794 27510 15123 13372 12619 5523 2508 4938 3680 156 2885 9207 3240
13484 3240 -2440 -2469 11260 12931 781 1526 9293 7896 6676 504 1099 675 4987 13551 26332
13469 26332 33127 38855 50320 41802 35099 34833 34759 27276 19546 24937 26083 22371 13721 12992 11843
13454 11843 20713 15067 6480 7143 18794 12146 7194 -784 5148 14387 7096 6855 14631 12664 10546
13439 10546 2971 5859 8553 -4043 -5433 -3665 4133 8765 8301 9308 9439 -3122 -940 -3983
13425 -3983 -5812 10315 13330 13450 9910 3437 -4790 -3067 1145 -8246 -11959 -9381 -1875 -4567 -14550
13410 -14550 -14845 -8290 -2623 -5922 -9010 -10696 -5147 1912 2955 372 10724 23901 23529 10701
13396 10701 4860 8383 6212 6760 5610 6251 11330 9139 -2520 -3645 -7656 -10655 -8097 -8043 -5207
13381 -5207 4188 530 -5357 2301 3721 -844 3929 10028 12982 18704 8080 2864 634 -6755
13367 -6755 -11977 -6227 10309 21288 28855 27886 18951 15473 9612 -9888 -1276 7984 11268 13921
13353 13921 14233 10200 19824 25064 17755 13468 6485 6401 10486 16420 18736 17088 15939 16272 14099
13338 14099 14442 22363 28134 28356 28675 28499 24617 20949 17080 17986 22157 23970 22521 23189 28449 39085
13322 39085 35515 24913 20501 12746 9227 7915 8310 17989 20238 14750 7378 4726 2425 4716
13308 4716 5882 9381 2719 778 324 -1954 6841 4052 -1189 1161 13614 12149 7107 10045 6217
13293 6217 6181 12465 5235 -276 2056 -12673 -12564 -3941 3588 4983 6562 -1033 1748 6752 21919
13278 21919 27240 25569 30934 58510 72975 87141 111237 127253 133911 131086 128149 125070 91319
13265 91319 56881 34747 26247 17223 5641 3698 16382 12312 3331 3272 12273 10675 3784 8744
13251 8744 7932 -1004 5768 7565 7438 7290 3110 -3305 -3231 43 -4470 -6032 1339 2907 -4256 -2562
13235 -2562 -2582 -15147 -14187 -1410 4729 7900 12564 17161 12350 -2112 -11225 -4213 -4211 -9441 -3429
13220 -3429 -5292 -7353 -7525 -17926 -12400 6045 16367 3160 -7051 -11143 -13528 -11532 -5824 646
13206 646 -8996 -9846 -2157 -3396 -7828 -6006 -508 3651 755 -1135 1083 5510 15490 11264 820
13191 820 -4274 -8399 -4865 -3007 -6969 -11943 -17287 -3650 95 1771 -1268 -3114 -2964 3384 -2073
13176 -2073 -14950 -28006 -29523 -33298 -35300 -22030 -17588 -9498 -1852 397 5830 7309 1293 2512
13162 2512 7717 8928 8239 328 -2869 2746 4790 314 -10027 -15886 -12594 -6984 -10281 -8971 -10360
13147 -10360 -4165 -13304 -9768 -1705 -4583 2633 5209 3296 7241 2889 4066 1296 -7647 -9105
13133 -9105 -6360 -1055 856 -16362 -22586 -16074 -12438 -12132 -11548 -4731 -1835 -1975 7161 -3355 -12478
13118 -12478 -8196 -7851 -8584 -5972 -3381 -19762 -21080 -8785 -8556 -12421 -10036 -12606 -10547 3871
13104 3871 6846 3271 -1142 -7592 -6488 -1757 -5253 -5466 -4778 1947 1119 7710 9979 15125 12411
13089 12411 7283 -1900 1228 7434 6874 1288 1713 437 -627 -3380 1662 9426 5103 9429 10794
13074 10794 9383 4637 11508 13977 8676 4426 1315 1270 4905 3823 2657 10108 14052 8004 2260
13059 2260 4724 7527 9728 8301 4583 9164 13764 21417 15555 5885 7773 11029 6565 241 -9317
13044 -9317 -23742 -14509 -2387 10017 21556 30858 28153 20973 6998 8575 11600 11446 18032 12671
13030 12671 10358 8886 10110 13797 11144 9797 13634 25124 29995 28547 23863 22126 9441 12351
13016 12351 7769 5250 10954 10209 7719 7988 4848 -2388 -8491 -3414 -7121 -5404 10872 11850 9569
13001 9569 -1777 -8944 1095 -4332 -7839 -7024 -9861 -13246 -2544 -2540 -1682 1245 -1653 2188 4642
12986 4642 4303 -2776 -3999 972 1590 -5440 -6293 -1979 -3947 1407 7246 17242 4512 -4950 1339
12971 1339 14854 15537 15088 5516 7711 6511 -3107 -3781 -4544 -10616 -15961 -14265 -5694 -2435 -336
12956 -336 2606 -12278 -21757 -18156 -11010 -8020 -13825 -13882 -21383 -16759 -5546 -5227 -14136 -15060 -10418
12941 -10418 -6126 -5103 -3540 -7061 -8833 -11152 -22013 -26948 -15474 -16617 -14456 3595 13490 17231
12927 17231 16275 5419 -2989 -9227 -5521 -10099 -13851 -850 2716 3501 2144 6790 13475 19582
12913 19582 22876 13620 9659 5649 739 -4686 4668 7331 10785 685 -7118 -11853 -3136 6866
12899 6866 3915 1008 2899 5248 1683 -9144 -9028 -4973 5355 5992 -1087 4043 4719 5575 -5701
12884 -5701 -5831 -11074 -15353 -10314 -3100 563 -4509 -12647 -8027 -4359 -4404 -8016 -10214 -15405 -13881
12869 -13881 -15550 -18653 -9004 -12305 -9949 -4030 -7506 -12233 -7480 -7300 -6911 -12638 -3813 -1120 3043
12854 3043 8696 11033 13448 2845 -4645 -4217 -2555 -752 -4927 -6690 -8684 -7359 -8756 -10593 -3534
12839 -3534 1625 -2842 -13025 -10160 -8995 -2660 4832 4457 1486 2198 -2594 1893 6745 6291 -1918
12824 -1918 -13267 -14753 -6872 8013 11053 21640 21674 21877 15741 11181 12879 8184 13094 7508 6425
12809 6425 3634 3704 5102 4419 6309 10382 18145 17489 10161 6268 13806 4746 -1791 -8348 -5230 -5295
12793 -5295 2259 -887 -11474 -16301 -6694 6930 11682 13498 14925 8139 5638 6506 5300 3963
12779 3963 -440 -2322 -3677 -9897 -16158 -13603 2505 12617 10632 4408 5220 4715 -3178 -140 391
12764 391 -2344 530 8776 8798 6823 9984 8027 -32 -4497 -11138 -6833 360 -6714 -10396 -12944
12749 -12944 -15981 -17804 -21158 -16461 -16113 -16915 -2330 5153 -3092 -11223 -13159 -16491 -16309 -12698 -11749
12734 -11749 -9708 -895 6145 -6073 -9221 -9459 -13508 -11894 -14455 -14073 -18415 -27944 -19818 -15423 -29035
12719 -29035 -35575 -36170 -26494 -17367 -6527 -1030 4614 3733 455 -6258 -11450 -12013 -18276 -18477 -15286
12704 -15286 -13710 -1677 5226 -2480 -11832 -11262 -17244 -22182 -21777 -19947 -25432 -12962 -1822 400
12690 400 -7871 -19826 -11971 -5926 -5351 -7041 -14151 -19964 -21259 -13886 -16507 -12102 -3751 692 -7808
12675 -7808 -22334 -18303 -12237 -6083 -651 -4396 -984 3056 7448 14449 9375 -327 -3425 -2426 -1688
12660 -1688 -3361 -6189 -14574 -19012 -21139 -14349 -12187 -20449 -15786 -12770 -6253 -2182 -2741 -12525 -20399
12645 -20399 -22220 -22304 -20809 -22873 -20089 -11057 -12503 -12725 -15083 -11975 -8708 -7102 -9635 -2897 8592
12630 8592 12030 21194 16266 -1411 -18438 -19645 -20133 -24101 -21934 -16458 -16028 -19291 -15029 -10212 -7679
12615 -7679 -6396 -6756 -8280 -393 5488 4719 -2180 2084 11324 1341 -3881 286 4779 903 -8529
12600 -8529 -14795 -11620 -5277 3573 6365 5586 -1166 -5132 -9203 -13410 -11033 -8767 -11565 -15131 -5961
12585 -5961 -3424 2055 16762 16521 -592 -15235 -18821 -14962 -10247 -9421 -1172 -904 -12546 -11609 3466
12570 3466 12861 8652 8442 9733 4072 4293 2078 -3145 368 4421 6821 18606 27364 27853 18246
12555 18246 14752 21729 17401 12853 3728 -2777 3278 867 -797 -2292 -4848 -2359 9584 16871
12541 16871 10813 13054 18746 11772 10640 6942 2415 487 8653 16589 17098 12110 8332 5708 11649
12526 11649 20587 33221 36023 35829 48871 47234 42856 46273 45200 48398 54400 59956 57749 61323
12512 61323 60327 50835 50587 42688 40152 33854 25381 19572 21676 21380 32924 42985 30712 22982
12498 22982 21632 20146 15093 15084 15351 13692 14470 9329 5225 18520 21829 20900 26417 28041 34739 40340
12482 40340 44511 51808 61246 62281 68072 76903 79469 55361 49360 69760 85179 102085 124763
12469 124763 148060 149859 139506 137413 128052 100546 79438 62310 49109 38528 30064 29495 24956
12456 24956 24806 24994 21213 20907 19724 19975 24194 24431 12896 16589 20210 19959 25778 27417 25960 20637
12440 20637 19597 29835 42517 53890 59935 59428 54872 54969 53896 43960 28374 25878 24844 24603
12426 24603 25636 36337 53399 55392 52898 36865 19347 4559 4934 13663 17829 18289 20154 10278
12412 10278 -1660 -12043 -6578 2486 11307 18052 17559 10151 5313 3756 13911 19032 14407 8679
12398 8679 2120 4354 8731 10167 11381 12315 19125 21545 11632 11965 14184 13440 1009 -3905 370
12383 370 2632 2612 987 -4039 -2461 8042 12684 2697 -3450 -4279 -5224 -3072 -6858 -4533 1513 5985
12367 5985 -9367 -17847 -16282 -13268 -11742 1939 5135 5226 2857 1661 989 3619 8014 3786 6284
12352 6284 3137 11007 9815 -3259 1724 4279 4719 5383 -1697 -4307 -2909 -6629 -5217 -299 -2435
12337 -2435 -8687 -8438 -2201 2225 7151 -1936 -11479 -10751 -7149 -7920 1094 -702 -1676 -4078 729 -4792
12321 -4792 -18660 -10503 -1226 375 -3557 -766 4610 -7412 -12398 -15497 -15493 293 6409 9667 7591
12306 7591 2529 -1238 3925 -4494 -7187 -4075 -4625 -567 4255 -2354 773 -3968 2095 2295 -3975
12291 -3975 -2492 -88 -4550 -14926 -19371 -13038 -11572 -13043 -4783 -6260 -16449 -22236 -15057 -8155
12277 -8155 -3616 -7126 -10911 -13607 -13658 -11115 -6188 -6540 -8893 -10911 -2916 -3630 -3532 3114 7888 10125
12261 10125 -3017 -11615 -8361 -4214 -3936 -2960 -9494 -14918 -14454 -20231 -15588 -2974 -3916 -12544 -4253
12246 -4253 -3040 -5574 -6169 -9279 -12065 -9553 -8973 -11732 -8183 -610 1938 9540 5284 4457 -765
12231 -765 732 5166 7314 2683 4722 11459 9591 5886 733 -1340 -5920 -1756 -2588 -6109 901
12216 901 3787 -40 -5144 -2966 9748 680 -6096 -13066 -12773 -2771 422 -3401 1380 -4970 362
12201 362 -4041 -3703 7900 3983 -9312 -11259 -11100 -10319 -1382 -1769 -6490 -3914 6585 8389 3446
12186 3446 -75 -5569 -4033 3102 22474 57824 88782 117462 128909 127372 129376 116382 74563
12173 74563 42621 27724 22672 29473 27753 20497 9443 5592 10396 11446 8975 11537 18077 15973
12159 15973 7634 -1792 -1850 -2925 -11585 -4085 -4917 2306 10250 13003 8493 8426 7097 11239 11185 14138
12143 14138 24176 40695 57137 70644 95804 128581 179179 245898 314798 344614 354426 361278
12131 361278 347619 289740 206542 141220 99624 79698 73369 69490 62565 53352 51401 43160 43067
12118 43067 46711 52052 55803 58649 64339 69164 65741 69308 77860 86669 94386 98236 85779 73748
12104 73748 73825 73700 70489 66418 59221 61387 70250 81263 95375 110429 132115 171607 247396 328320
12090 328320 376213 387852 395315 396964 357480 278207 201227 157771 134547 133526 127436 113744
12078 113744 108522 110748 112878 119531 125528 113568 86129 75149 80072 78734 68258 62035 60115
12065 60115 59941 44526 45243 50055 38308 32494 26818 25820 29610 23138 20606 29814 35689 31838 28908
12050 28908 38619 54682 77963 107899 139447 154779 149319 139502 131360 111926 79605 60213
12038 60213 43944 27426 23563 18341 27396 28716 28220 26164 17972 22794 23988 25439 27497 15438
12024 15438 14879 17520 10333 9978 10598 8936 10655 8376 -1002 2844 16111 14586 1837 387 6785
12009 6785 2424 -7436 -12225 -4115 -4580 3178 4267 333 -3777 -5270 -2780 3428 3023 -1714 -3218
11994 -3218 -717 9627 2178 -5136 -5741 -849 5516 5878 7288 4513 832 7537 8225 5735 6206
11979 6206 8499 6153 10410 10411 6109 6019 -627 -8401 -12284 1385 2955 1686 4678 1103 -7923 -16597
11963 -16597 -16777 -13722 -3107 -3290 -8430 -1086 1239 -3431 -1626 -1595 -14087 -21512 -15076 -6011 -5382
11948 -5382 1525 -1899 -4693 -7082 -12430 -11492 -10295 -15019 -14953 -9949 -2135 -641 10176 7959 -3616
11933 -3616 -21345 -23449 -20681 -17695 -6476 -3269 -3725 -10258 -16225 -13958 -7064 3735 8204 5684
11919 5684 -2104 -1957 -12455 -18196 -21780 -29515 -22352 -4828 -4818 -14224 -9036 -2006 -12770 -12688 -7853
11904 -7853 -15728 -17366 -21470 -17530 -11566 -20324 -24684 -21882 -17325 -8948 -5015 -7417 -14696 -14207 -14473
11889 -14473 -15704 -15007 -10107 -14993 -11718 -10792 -4221 -1186 -8019 -17918 -18584 -13973 -18155 -16939 -20788
11874 -20788 -20382 -12038 3473 5585 -7719 -14675 -6883 -1294 -1599 -3285 -223 -5598 -3946 -974
11860 -974 -9541 -21188 -26807 -27354 -22324 -12509 -9152 -18548 -23045 -18675 -6972 -5394 -7151 -10131 -6078
11845 -6078 -20333 -26436 -16669 -6514 -748 3625 4091 51 -4596 -11135 -11424 -7070 -12071 -27016
11831 -27016 -24473 -18988 -15033 -15932 -12733 -19662 -32817 -34999 -31008 -22170 -16727 -18020 -25847 -28889
11817 -28889 -28558 -29570 -19975 -18390 -23206 -27077 -24389 -27141 -16136 -2259 2235 1430 1503 -1649 1793
11802 1793 -5259 -5098 -9151 -21889 -15991 -4385 1173 -4838 -11070 -16879 -4250 5982 4651 -3145
11788 -3145 -7421 -4117 -6362 -9784 -6046 -8021 -11474 -7602 -14311 -7453 -3356 -4744 -8726 -16362 -15555
11773 -15555 -13183 -16194 -18014 -28436 -26643 -22304 -13955 -7923 -11694 -12207 -11014 -13726 -9646 -7561
11759 -7561 -3049 -5972 -14602 -19453 -17485 -15838 -11851 -7567 -5937 -592 4478 -102 -5956 -5716 -7440
11744 -7440 -16602 -16829 -11434 -10870 -10455 -16813 -6585 -2154 -4972 -1657 -3804 -1808 1594 -3058 -9715
11729 -9715 -15174 -8724 -2378 680 -6475 -8970 -3097 -1849 -8992 -11484 -15293 -24218 -20684 -9690
11715 -9690 -6011 -15323 -19195 -22262 -10595 -4140 -5917 -11573 -16316 -20660 -13382 -17357 -27117 -23648
11701 -23648 -25742 -21130 -6712 -15047 -22768 -18254 -11329 -9933 -14332 -19866 -18049 -9527 -4967 -3354
11687 -3354 -8828 -9670 -9301 -6560 -8836 -3151 -8757 -18995 -17274 -17520 -17178 -21802 -22509 -13277 -14521 -14798
11671 -14798 -20136 -11276 -9141 -8233 -11050 -5742 -7141 -6818 -6137 -13305 -18230 -17301 -10384 -2967 -893
11656 -893 -5422 -8481 -2399 10075 17548 4715 -7308 -4415 3744 -1875 1851 2521 -2937 6865
11642 6865 5498 1825 3882 -1538 1810 -1781 -2701 -2850 2601 -2111 -6578 -16276 -25858 -19368 -4087
11627 -4087 365 -10087 -11364 -13045 -12070 -11105 -6946 -7454 -13361 -12964 -10073 -14384 -20430 -17177 -17690 -16908
11611 -16908 -14809 -15595 -16393 -17443 -21080 -20272 -18342 -18184 -13045 -3020 956 -3756 -8263 -3272 -605
11596 -605 150 3043 -5757 -20902 -14370 -8325 -7892 -15138 -13351 -11441 -6825 -10331 -8467 -4266 -9664
11581 -9664 -21937 -9823 -5237 -151 -6748 -15599 -16953 -12922 2514 3920 -6436 -11283 -15950 -11306
11567 -11306 -8474 509 3819 4173 1543 -3382 -8034 -7925 6699 16738 13522 2966 282 -4918
11553 -4918 -10330 -14704 -16641 -5069 -4808 -6630 -2338 -2221 -8423 -17188 -18594 -8055 -2299 -9304 -19671
11538 -19671 -15823 1321 1159 6440 11006 10228 14458 15387 7801 3754 -662 8120 11439 1894 -2005
11523 -2005 -1534 -9164 277 10213 13031 7226 1673 11098 5596 5362 8914 11019 14152 6794 -2331
11508 -2331 -9496 -8239 2704 -5071 -16249 -22310 -17569 -14207 -8488 -8984 -6023 -11381 -12463 -12840 -7903
11493 -7903 -769 -1793 -1637 8360 6772 76 2257 12571 27474 33501 18449 6290 910 1075
11479 1075 -3566 -5692 -9775 -6759 -8696 -7096 -8830 -6566 9307 8001 2533 -1244 546 -497
11465 -497 -5047 -10746 596 11214 7354 3686 -7984 -5056 -1781 -6210 -11805 -3835 -8547 -5179
11451 -5179 7335 10884 4235 -3005 -6862 -7016 -5166 -3596 -10031 -7274 6649 15467 10615 14858
11437 14858 17423 12878 6224 9446 673 -6455 -4426 -4968 -6905 2819 9868 10219 4194 -4920 -7363
11422 -7363 -6875 -14437 -18411 -9886 -5474 11040 16159 15943 7394 -830 -12280 -16834 -14448 -5659 -1173
11407 -1173 -13473 -26729 -23541 -9452 -8685 -6507 4086 1158 -4434 -11413 -10969 -4334 -8016 -3045
11393 -3045 -8486 -17544 -20584 -20755 -15975 -9552 -8793 -3943 -1936 -6431 -15024 -13393 -9073 -5634 14119
11378 14119 29764 23505 2319 -6355 -4543 -14930 -11095 -10199 -6005 3640 12060 8462 4955 927
11364 927 -1470 -9231 -17492 -26816 -27844 -25825 -23560 -15541 -10841 -3692 4299 5430 -5440 -10691 -12371
11349 -12371 -16377 -17827 -20515 -18025 -13548 -14345 1097 16123 18369 20985 16092 9718 10942 6583
11335 6583 3169 -2147 -15321 -17349 -10573 -13181 -14510 -16030 -16739 -10016 -9916 -14736 -23920 -26540 -14368
11320 -14368 535 2854 -3694 -10146 -12010 -10301 -16719 -22690 -18702 -9727 -5021 5219 8490 8139
11306 8139 -1001 -5987 -12970 -10604 347 7249 5849 -1557 -147 4988 3802 -4638 265 -2179
11292 -2179 -8478 -5362 -2943 -11912 -9141 -5946 -10180 148 6820 6573 3678 4556 5569 2047 -4401
11277 -4401 -10144 -12168 -3073 -5072 -3959 -827 -4177 -1035 -7028 -6957 -14382 -11828 -6542 6512 6846
11262 6846 5958 14868 9828 -282 500 -740 -3535 -7380 -666 12994 9088 3146 2466 -4283 -10564
11247 -10564 -4145 -2763 -12194 -14027 -21628 -16150 3606 13463 7513 1446 -3749 -2486 5890 18600
11233 18600 9937 8016 10362 16786 24072 24437 29548 33409 29992 22887 21308 20219 22596 29376 43854
11218 43854 44303 21485 10349 15123 12836 7586 5285 9555 17998 13767 3335 1656 -743 -7843
11204 -7843 131 6508 -2280 2737 4537 -3784 4807 -465 -10349 -11440 -4676 -14720 -18672 -15734
11190 -15734 -17292 -14967 -4867 -4567 1174 3925 -4590 -8647 -3009 -4280 -1642 2170 -175 8238
11176 8238 28069 35206 40266 39367 31286 17748 1859 -4425 5202 7448 2652 3777 17776 24190
11162 24190 19356 16839 3556 -8766 -12938 -11262 -8448 -11773 -4647 -1319 -1004 -219 1279 5851
11148 5851 -198 -236 3372 5712 6883 7583 2498 -3334 -3051 -6311 1314 -6212 -19981 -17612 -1434
11133 -1434 3163 -6235 -5777 2821 6476 11010 12387 7440 2942 -3384 3104 4985 18289 19026 22719
11118 22719 9192 -6635 -15381 -11375 -1088 1842 12919 12407 7929 -4498 -4351 -827 -3038 -7160
11104 -7160 -13188 -17464 -11991 -5673 -8584 -1840 3192 1183 6302 11577 -4432 -8361 -11175 -6251
11090 -6251 -4279 -5607 -10344 -15577 -11687 -5313 -2795 -44 -1511 -8894 -4244 6942 3617 4442 11716
11075 11716 12563 1753 2939 2200 -8031 -14412 -10626 -5184 -16538 -11942 -11589 -15544 -27518 -22989
11061 -22989 -11632 -11839 -11312 -4245 2674 4889 378 -4715 -3142 1024 -2735 -379 -4602 1373 5605
11046 5605 10497 10155 17283 12842 5559 8878 12436 9830 2472 218 -1539 35 12002 20444 19713
11031 19713 20633 18363 20494 19074 4405 -3369 -5764 -13767 -7349 1954 2520 -10769 -15580 -10096
11017 -10096 -12409 -5410 3463 972 -9098 -11738 -18054 -23176 -20186 -27048 -27098 -22099 -6785 3185
11003 3185 -3413 -10631 1580 11401 6876 1702 1487 343 10050 29853 24978 18867 16667 15195
10989 15195 23130 27504 29851 25483 8525 3199 9532 -2106 -8634 -10216 -2653 -9818 -13272 -16732
10975 -16732 -15844 -15267 -12997 -3065 7388 8585 5029 10407 13443 13594 5649 -2053 -7351 -11560 -5340
10960 -5340 10381 10548 -4067 -737 7147 16919 27071 39396 55032 74521 107698 156762 236167
10947 236167 321261 397712 462263 488887 492969 459739 400667 341970 260298 187372 142564 113590
10935 113590 88146 83143 75047 62789 60242 59475 55856 53658 56910 63480 68900 65624 59736 57302
10921 57302 53077 46092 36876 28258 27367 33036 30123 27507 37412 35580 32305 32304 33381 30040 29391 37469
10905 37469 28789 7655 -6141 -11226 75 4619 5262 954 11885 11658 15188 21482 20380 12920
10891 12920 6068 -2109 -5502 7878 9325 3924 946 -385 7411 2233 -8560 -11037 4181 17520
10877 17520 13298 14923 21197 27562 33069 45863 67523 85171 91482 100094 101790 100966 87096 72193
10863 72193 53638 32704 39739 39244 28449 26037 14113 8729 11526 -2631 -14974 -8073 -231
10850 -231 11608 18530 11494 1341 -3742 -8912 -5733 3620 4538 8941 13886 10133 9768 14094 2657
10835 2657 -10724 -8260 -730 -7357 16 6871 8600 5716 9545 15827 16474 15557 7871 11412 19098
10820 19098 22572 16766 4299 -1883 -4042 6499 9816 -6418 -7497 5805 7707 -3809 -1448
10807 -1448 11182 9023 5248 5285 2742 4662 16421 24388 22290 28133 37877 35285 22597 11557
10793 11557 12470 15637 13904 4587 487 1048 14213 22670 20114 18050 23237 27510 23877 15696 24711
10778 24711 24916 25185 22380 11567 5283 12851 12587 8140 -779 -2286 1406 11724 10564 7947 -4320
10763 -4320 -5519 995 1471 3723 3435 -4761 -15944 -21563 -13404 425 3489 205 2443 4239 8640
10748 8640 18090 19470 8300 14666 17566 14620 20947 22013 16396 11082 9485 14793 22601 21219
10734 21219 28866 28156 28498 25836 31508 26225 21508 17987 7859 -10259 -22932 -23550 -14714 -9982
10720 -9982 -6712 -8335 -5244 -4065 3971 -356 -1768 -1180 -776 -4019 -7602 -14976 -19601 -16543 -8070
10705 -8070 1907 4299 8780 2536 -10974 -1598 2124 4588 1307 3375 2264 18597 26107 17947
10691 17947 16471 18444 20978 28159 27667 39421 44835 32418 28715 28566 43708 56201 75722 88622
10677 88622 102002 117312 144539 160524 171684 209021 233320 252714 275692 307568 335229 354751
10665 354751 394000 430931 460865 504631 530193 544966 541136 511539 465172 413254 361267 301070
10653 301070 248567 202257 163987 144037 121821 113879 104257 97159 90756 99805 113574 115554 113343
10640 113343 120596 124815 114331 102621 100913 90711 86670 84090 84436 87789 81641 74352 69775 76371
10626 76371 76056 67392 60451 62380 60773 57908 61615 54297 44553 46632 63043 72111 64973 68510
10612 68510 72228 78111 84509 72469 66906 74795 71845 91810 120834 127769 121072 120834 127961 133666
10598 133666 136558 133088 129615 131278 126149 104154 81487 73151 67010 57275 58235 69506 90908
10585 90908 104094 113266 123639 147166 161915 186987 205399 232890 265722 298772 332440 368186
10573 368186 402711 455500 514050 578917 630294 693739 766415 849064 929531 1021461 1147936
10562 1147936 1308059 1472367 1646373 1808744 1971830 2140351 2297593 2459864 2682685
10553 2682685 2965490 3347385 3891360 4606813 5531346 6747460 8405362 10778894 14350816
10544 14350816 19983982 28900046 41764644 56762432 70287397 82201278 91591101
10537 91591101 95017047 90531569 80000663 68915331 55050922 40328384 30099317
10530 30099317 23883402 19942737 17257835 15285485 13733278 12442807 11362477 10446417
10522 10446417 9688862 9092031 8620035 8236693 7907478 7615382 7341654 7059296 6753136
10513 6753136 6436298 6125691 5808272 5506895 5259666 5040403 4868478 4731255 4604460
10504 4604460 4467175 4355762 4251925 4138230 4021701 3901777 3783855 3678048 3571429
10495 3571429 3463657 3362430 3280918 3201356 3118740 3038035 2957310 2879065 2794161 2712216 2632584
10484 2632584 2557050 2473508 2383353 2301601 2225438 2161624 2100460 2038064 1979595 1936249 1887979
10473 1887979 1841048 1800617 1759660 1722170 1685347 1653624 1618820 1580229 1544272 1505614 1461822
10462 1461822 1411153 1366425 1326399 1302178 1277926 1253483 1225718 1207498 1182778 1156735 1136728
10451 1136728 1109162 1096533 1071018 1040218 1013899 992746 979148 964147 937787 908751 887935
10440 887935 883914 875160 864857 846666 846087 844093 822771 810709 810221 804943 798986 794570 795929 810623
10426 810623 819737 825833 849159 869701 886987 910218 950526 1000989 1055320 1107473 1131976 1144924
10414 1144924 1141845 1120776 1077912 1029848 974143 917374 876850 814408 763189 723960 680789
10403 680789 649337 631505 613032 592911 569859 546878 525790 509204 508195 503686 489575 477191
10391 477191 463508 456505 445988 431647 418290 413957 409873 396814 396829 404050 398848 396713 416168
10378 416168 440257 454172 472842 480186 483346 484358 466771 448891 428049 409003 400362 390581
10366 390581 371547 355384 347802 337446 321732 303935 298437 289796 285073 294839 294919 295755 305874
10353 305874 306026 301891 305675 300039 296847 295775 284477 277369 275432 282202 300250 323028 369292
10340 369292 440251 521478 586777 667006 753836 816723 842295 850780 849539 811434 753520 676662
10328 676662 603395 537335 455685 384403 337974 310448 296110 274344 265798 259565 257341 243248
10316 243248 231748 231334 221151 204652 200165 195989 185798 179784 183068 178089 178762 172893 169681 172191
10302 172191 172072 172483 167952 163743 163915 160582 149737 139813 131423 129395 128837 134112 125548 114242 111799
10287 111799 118102 119343 110150 106558 107965 109863 107938 114900 106770 97841 90162 93687 91053 84759
10273 84759 93860 103988 102698 97783 92524 81298 78587 82890 89425 91639 82668 72586 73095 67328
10259 67328 63965 63857 75575 83239 76496 69916 62414 53743 56751 65594 72210 72046 72199 58341 49818
10244 49818 54010 56602 64680 61840 57633 56099 39239 41115 45803 48549 55141 58337 65000 63095
10230 63095 62293 64145 68132 83487 86819 81252 80773 73849 67600 65246 59016 64341 70561 66054 67914
10215 67914 76181 71662 60326 49972 50224 45241 35611 41298 49727 53091 54637 50228 47762 47918
10201 47918 53630 53098 46295 42351 40326 32902 35049 33546 30472 36722 37643 31834 24379 26256 32238
10186 32238 32016 34410 40966 46584 36869 43406 41704 42136 43158 32791 26350 37823 45019 36764
10172 36764 26954 35101 50451 57092 50844 43082 33008 25246 21787 26523 29062 23692 12999 10735
10158 10735 19205 12257 16272 22558 26657 21617 10792 24050 28339 33983 38416 37118 44633 56590
10144 56590 43557 35215 39845 46189 53376 54469 50522 48217 59973 74541 96883 110152 146629
10131 146629 198189 268388 355414 433593 490984 526316 535011 509591 463142 395467 309755 232068
10119 232068 186770 159643 134963 116588 103245 93134 100805 92033 88973 77000 70756 70223 69852
10106 69852 79436 85071 78097 78909 76143 78360 89805 101872 114086 130908 162239 204206 255554
10093 255554 339539 431926 511819 579249 625151 619359 575576 516075 448072 352741 269847 216613
10081 216613 187610 157256 130087 109687 102626 104452 105358 95801 84811 84261 84473 83631 83565 73754
10067 73754 67117 60066 53992 50905 43611 38707 36115 37296 37881 44765 51099 50249 47655 40804 29602
10052 29602 30623 37312 39682 44718 39871 36898 43311 39592 37746 40597 38121 24795 30179 37093
10038 37093 30040 25439 24229 19673 25482 26971 23681 20813 28832 30536 23829 23362 18018 20016 26186
10023 26186 21498 27357 32747 30162 32133 35604 29772 22281 19105 16752 14547 9552 9593 -418 151
10008 151 7955 14514 8428 8210 15957 18387 16966 14854 11766 15570 11733 12997 11602 9305 7456
9993 7456 6893 16637 13023 10002 10139 12271 12941 16730 26002 16641 3306 155 7436 8042 -2913
9978 -2913 -6824 930 12726 12874 4115 2230 5635 12257 12709 19416 25666 23598 25154 21300 12645
9963 12645 2209 -2135 335 3567 16280 16657 14833 20929 27067 29339 16341 11487 4148 4476
9949 4476 7508 11813 16326 20668 13344 5018 9659 19300 20361 16000 2246 -563 485 -2244 5731
9934 5731 10154 14158 10749 14436 16792 22140 19196 22397 12294 3132 16871 23886 19642 6772
9920 6772 353 2649 6845 -476 -12732 -16218 -6690 6433 17604 12411 -3892 -4970 -1779 -3375
9906 -3375 1204 10268 9545 9426 4280 8453 5544 -3426 -7756 -3971 1352 11085 12296 12890 5862 3723
9890 3723 -2033 -15478 -10788 461 9270 18140 13839 10480 1478 -1618 6288 6497 -8821 -16591
9876 -16591 -5203 1013 -554 15956 19103 7718 -4589 -2700 2252 -2052 -2817 -11616 -11856 -2106
9862 -2106 -2706 -5389 -3559 -4113 -501 2264 4564 9216 5602 -5098 -5525 -3611 -5344 -884 -4806
9847 -4806 -503 4387 8726 7963 2851 4964 15766 8468 -2613 -4046 -4517 -3203 -4713 -7636 853
9832 853 3633 -1336 -2142 -2148 -1147 -5010 -5279 -6520 -11526 -14558 -2776 -1840 -17076 -17681 -6285 1474
9816 1474 -2636 -6173 -7547 -13120 -14195 -18464 -17571 -10914 1021 8669 11255 4628 11244 11442 7653
9801 7653 -5493 -7664 1162 6514 5967 7594 7628 1242 -6758 4204 10703 -6885 -9791 -2097 -1447
9786 -1447 2790 -9066 -15785 -17872 -13098 -13435 -16744 -15852 -16403 -11803 -8376 -4253 -8409 -18713 -11854
9771 -11854 -8874 -3889 -699 2585 6329 -2143 -10227 -14917 -20453 -20387 -11444 -8706 -7819 -7230 -4908 -2639
9755 -2639 6317 10653 11228 7152 9880 16201 13529 15845 19350 8539 2831 7020 4242 4981 12649
9740 12649 7929 5255 -3171 333 -2474 6548 6394 907 -10621 -5068 -5664 2752 6384 3942 -1986
9725 -1986 -5069 1114 -875 -6986 -7922 4407 6833 409 -4770 -9817 -7015 5614 7451 5480 -3707
9710 -3707 47 7076 1019 -2414 1142 8000 4816 -10627 -27313 -27441 -23514 -12589 -6742 -6192 -1376
9695 -1376 6431 5974 3584 -237 4684 7653 10439 12441 19018 13828 2600 -7496 -6604 -5215 -4119
9680 -4119 -2081 -939 9445 15797 7395 11098 3454 -17406 -18253 -10072 -5001 -11111 -14351 -11185 -8592
9665 -8592 -15017 -8238 -713 -423 576 -9923 -13431 -10335 -15541 -16536 -13298 -9298 -7284 -5475 -3809
9650 -3809 263 -2260 -5134 -10140 -2092 5439 -1115 1007 10104 11587 4562 1023 -1 -1167 3396
9635 3396 7216 11321 13692 9091 4340 -2055 -9444 -7726 -5050 -3158 -12958 -13586 -11565 -10461 -8938
9620 -8938 -17489 -16337 -5669 -571 -2176 -2540 -1211 -1725 940 -5540 1984 7953 1352 -7121 -10869
9605 -10869 -14519 -6997 -4520 1373 941 -6531 -13474 -17671 -14766 -3149 -8590 -5961 2389 3642 17795
9590 17795 15903 1522 -7610 -9080 -4160 -2618 -5120 -3565 5145 10100 4320 5340 2212 -3369
9576 -3369 -5850 1545 1483 -490 -7320 -14777 -13841 -10315 151 4400 6424 8718 4130 3262 -9083
9561 -9083 -13004 -4832 -682 -1614 3059 4080 5648 2234 5843 8373 5377 -2509 -15666 -8911 -1402
9546 -1402 -1360 1910 2209 -3771 -3424 -6094 -4018 -11030 -9625 -3562 -7540 -18688 -19630 -12808 -9562 -5353
9530 -5353 -6001 -2030 -1110 -4571 -2834 -4522 -8449 -9905 -5821 -8362 -12989 -5919 -148 5230 1456
9515 1456 3067 14719 17861 6022 461 -3381 2033 8763 5375 -2830 -10795 -9943 1209 -1052
9501 -1052 -2077 2517 -1331 -5339 -8343 838 2366 -2098 1897 7186 7748 4718 13773 18419 13786
9486 13786 9423 -481 -4330 882 10492 11429 3488 -122 -8215 -9020 -4289 8275 15939 15036 7937
9471 7937 16247 18812 9416 -1604 2867 381 -1849 1344 -3111 2374 5122 3075 14519 18943
9457 18943 7979 -445 -5660 1286 7379 3919 -4375 1439 4985 9088 16577 16347 11420 11455 18311
9442 18311 19586 19478 21702 30432 33347 29480 11962 7425 13630 9451 14651 21493 18838 12196 20785
9427 20785 24672 28363 37317 43769 40954 38842 32823 27472 23568 30043 20662 17528 25220 28922 29941
9412 29941 31831 36814 43391 49559 39397 29177 20438 17861 19048 20234 22591 14604 13454 8035
9398 8035 8130 10120 15462 24351 27048 21692 14317 20320 24807 24211 30079 37196 36091 23500 18992
9383 18992 19060 32017 37373 32773 29682 29580 22508 28895 24269 25123 30057 27958 28181 23902 11033
9368 11033 2517 17621 18779 9828 13448 11784 20258 28904 28817 26081 24718 25838 17417 10464 13353
9353 13353 26394 28935 24010 27425 28393 32532 29618 20441 18107 17586 13330 13209 7072 13352 21598
9338 21598 18267 17482 20475 31702 27750 25742 25914 27225 30686 24528 25076 33368 31608 31935 44659
9323 44659 45163 37995 31802 37646 44041 46272 50506 57070 67274 73830 74430 92269 107508 102266
9309 102266 102571 113275 124121 128160 138870 151384 161338 179329 202479 218756 243131 296911
9297 296911 349787 405660 477953 563971 666806 812851 979474 1182770 1396082 1611037
9287 1611037 1796397 1919850 1971062 1947003 1853516 1702924 1505249 1301141 1115198 952490
9277 952490 829642 733736 658103 590920 540197 495103 450663 423321 381977 348933 328775
9266 328775 307977 291466 281224 268266 258517 242404 232218 235834 232738 223505 210163 202627 190539
9253 190539 185077 177295 172127 178908 182147 171751 169351 170116 165930 162758 151293 150410 152723 143736
9239 143736 136093 140205 138373 130170 131856 127592 126048 118017 109501 118203 134283 127708 117466 107795
9225 107795 103861 97887 95364 84796 83343 92150 94410 87615 94018 96672 90988 92301 91910 89743
9211 89743 87751 81648 82613 70300 66431 72198 79001 77277 64280 60991 56062 52986 49294 58979
9197 58979 67463 66535 68301 67786 68964 67720 62433 57234 44848 46667 40530 44953 48021 52106 46438
9182 46438 48107 41750 41380 53202 61083 57560 52820 56008 65951 70453 77849 79364 83955 90667 90687
9167 90687 87798 87431 84107 74022 65939 70297 73635 75533 67486 58902 56550 47595 36479 27351
9153 27351 24576 18715 22020 27846 39413 40845 45095 62496 73441 67237 67226 68503 66304 63639
9139 63639 73275 75584 81073 71804 71603 84148 91592 96029 104325 108779 112603 126637 144695 156340
9125 156340 174265 203823 246403 283485 333758 405133 492369 591533 709745 846370 1001653
9114 1001653 1142198 1264370 1353650 1407206 1414557 1367125 1279413 1169607 1041082 904648 771116
9103 771116 655030 575549 519503 464551 424168 389455 351728 322381 305158 284096 268814
9092 268814 250376 224055 208175 214932 216794 211558 205235 189718 183949 180293 175080 177174 180967
9079 180967 173731 169767 166804 158892 144334 133467 127966 133340 128694 115451 106793 108028 102661 112263
9065 112263 117821 116975 114382 108293 101665 100654 102593 107184 109069 96834 97948 99702 99162 93851 93894
9050 93894 91015 99655 108135 101732 99808 105823 110401 118655 130422 125792 119128 108407 108179 114973
9036 114973 107491 100841 89404 81098 86548 80915 64439 58472 48134 46394 49193 42023 33860 23946
9022 23946 18978 17393 15381 6810 11434 26708 24714 22739 33268 39377 37453 33024 35175 36180
9008 36180 32078 34515 39523 43795 44330 52165 70018 79034 75774 85001 93758 88535 88535 78271 75583
8993 75583 73233 71607 70748 73173 77050 78772 84673 83130 80754 84433 99452 109836 114630 119721
8979 119721 130796 144305 147531 144643 140347 142768 150251 156410 153267 143588 129487 124357 130520 133827
8965 133827 137156 149330 156662 167727 175791 175098 179561 182436 186807 180221 173391 166801 160876 145396
8951 145396 140620 137040 115580 103060 92613 87045 83973 88839 90176 88785 87535 83257 79407 82732
8937 82732 74022 62119 50579 37122 13129 6731 7492 1221 -10275 -5556 8098 19072 22518
8924 22518 19831 21628 29060 32206 30060 37259 38565 36815 42157 46536 38948 41445 45399 46219 47285
8909 47285 45954 51571 56875 48891 30608 12124 212 -15150 -28437 -39390 -25488 -8738 3727
8896 3727 18779 19622 19325 29372 34096 31153 19617 14123 5583 2479 -3278 -15161 -26595 -30205
8882 -30205 -25932 -17050 -3967 4412 14451 28249 42940 65439 81186 89954 99875 117720 142837
8869 142837 167552 182349 193165 214406 225718 214246 223494 240050 253272 271942 289973 303951
8857 303951 341075 384372 428964 479466 540074 601302 660979 734405 828902 938028 1042308
8846 1042308 1155031 1249365 1321642 1399427 1500395 1617516 1746553 1874195 1981357 2064247
8836 2064247 2148793 2196830 2141414 1999238 1807005 1594427 1380851 1169903 1003944 884480
8826 884480 788976 719153 671320 633258 599242 582994 578470 569583 567606 573956 583251 587541 586319
8813 586319 582556 578285 578022 582464 569963 563738 566679 563509 559572 553583 556882 554611 540818 533729
8799 533729 532320 534897 535761 541811 540243 545813 545284 550294 543143 536591 528531 509487 493323 486412
8785 486412 492827 520272 550486 595909 657356 711246 764087 808800 842610 875301 891747 886772
8773 886772 886020 877071 874377 878101 876137 876221 862494 859946 866623 883515 911600 958927 1041909 1141061
8759 1141061 1242244 1346611 1447828 1562418 1694312 1834671 1964727 2111752 2275443 2452326
8749 2452326 2677046 2924827 3178058 3446751 3744863 4071489 4418623 4796311 5178297 5586437
8739 5586437 6035290 6527254 7090310 7738416 8473040 9339764 10383829 11643771 13177282
8730 13177282 15066171 17350801 20035906 23135439 26730898 30993462 36220175 42907129
8722 42907129 51897740 64497257 82754308 109622458 148336905 199325045 254704633
8715 254704633 298426089 321727112 330301643 328256718 308245587 262590333 206098074
8708 206098074 159183844 126296535 103981204 88574547 77552523 69305014 62861411
8701 62861411 57574262 52997120 48895416 45241787 42003432 39096001 36487784 34193271
8693 34193271 32197067 30456068 28927910 27579608 26355018 25214656 24153274 23173866
8685 23173866 22274103 21463981 20730832 20058493 19472953 18955232 18477274 18008510 17543357
8676 17543357 17054522 16535849 16027694 15527299 15050195 14597114 14182599 13802407 13437398
8667 13437398 13096374 12763358 12440487 12096781 11753510 11424247 11097732 10764536 10446140
8658 10446140 10119911 9812770 9511822 9225977 8961641 8718516 8478080 8252021 8037000
8649 8037000 7839964 7664301 7503632 7358649 7233963 7108096 6974581 6824117 6674313 6519864
8639 6519864 6360731 6201378 6043750 5880711 5734369 5603626 5487617 5381113 5286933 5194605
8629 5194605 5104871 5031134 4948539 4867550 4792825 4716366 4635223 4567169 4509907 4452602 4394893
8618 4394893 4330156 4279054 4232424 4189246 4151435 4109931 4075382 4039844 4018342 4009265 3996171 3980844
8606 3980844 3957015 3937922 3925003 3917058 3926191 3967704 4025141 4104388 4204583 4328883 4470349
8595 4470349 4617603 4760075 4872683 4955771 4995571 4969745 4877315 4728631 4534007 4320108
8585 4320108 4104837 3883404 3676223 3491413 3332498 3209564 3095251 2973680 2844755 2736383
8575 2736383 2633991 2530583 2433011 2362217 2303702 2255897 2223479 2216928 2215820 2219208 2245266 2279143
8563 2279143 2292178 2280718 2256219 2237822 2205745 2143591 2102689 2095105 2073466 2048830 2025672 2000569
8551 2000569 1931493 1834629 1756864 1707500 1669215 1636591 1613473 1590571 1557990 1527361 1495386
8540 1495386 1456425 1431002 1406043 1379981 1358696 1346668 1341242 1340125 1339965 1347130 1369227 1387987
8528 1387987 1384374 1368298 1360629 1354464 1326666 1307548 1337753 1425783 1557785 1667658 1727754 1742950
8516 1742950 1747586 1719418 1575129 1404662 1300304 1236599 1186503 1145206 1111335 1076488 1024093
8505 1024093 975795 944760 926279 916365 903756 895734 887059 881025 876200 869869 865510 861407 861749
8492 861749 867612 878764 897024 910051 924181 941176 943005 913021 871150 845223 827272 803391
8480 803391 784849 776286 796002 841189 909155 985894 1033519 1030047 1020544 1000780 938231 833877
8468 833877 755923 697771 652064 640672 622780 602621 597611 582708 568236 563320 550390 533680
8456 533680 525977 524643 519573 505398 494993 480650 468925 468146 465393 460258 456724 456822 451120 453052
8442 453052 463636 456198 454734 463553 470659 467136 469028 455558 449433 434208 410670 391356 375267
8429 375267 366672 365978 362955 355677 355919 352327 364200 367489 361209 360327 365952 365132 368943 370953 350489
8414 350489 327037 311744 314481 315165 317520 330686 339500 337864 340003 338483 326898 318230 305648
8401 305648 296843 281620 263653 253249 252722 257539 266965 255319 240860 228196 220113 226657 234143
8388 234143 231425 231559 232482 231901 221266 211593 212251 210476 208615 211749 219851 225386 227448 224559 221412
8373 221412 213540 202595 200666 193514 190779 190560 189366 190992 187706 186896 190668 199189 198384 196375 189052
8358 189052 185403 186654 184486 177715 177066 169045 163176 161792 165905 154575 148679 150558 157200 159566
8344 159566 164192 159650 164669 180697 182801 186751 191366 189358 184292 185508 194444 207742 213068 215765
8330 215765 217013 222412 231867 240134 264879 286665 293784 304561 329819 372544 427127 493694 585577
8317 585577 691847 821352 964732 1104381 1238763 1358826 1447845 1485722 1474516 1424383
8307 1424383 1329768 1210379 1074544 946617 835447 723937 635682 574773 521164 475434
8297 475434 432378 398965 365943 348106 339029 334213 318149 301363 282993 272442 267234 254097
8285 254097 244944 242788 234949 225293 222065 217385 215107 210791 211992 214047 214545 215304 209592 203143 196406
8270 196406 181129 177099 169610 168576 159091 155269 142093 126738 120220 114453 104618 100771 102178 99260
8256 99260 97886 107699 114898 121002 122269 122441 123479 110925 106129 105018 112774 114645 113817 118804 118735
8241 118735 113527 110570 113034 116887 124077 124051 117271 129085 136649 125346 100843 85832 86039 94839
8227 94839 102423 104070 111355 103590 99879 109999 120249 114388 98036 93663 96149 96209 85805 85001
8213 85001 86831 84864 89731 89278 86578 92335 88462 81926 77529 77984 66573 62927 69315 73146 74317
8198 74317 79535 83381 83636 76745 71297 70198 77491 87566 78077 66466 60119 71050 73906 75470
8184 75470 72734 69852 65725 61398 71840 75899 68591 69558 70560 68335 64467 59515 58288 61510 63152
8169 63152 65825 69265 62779 58780 64393 61786 60077 71757 80618 85688 71505 65973 75673 96053
8155 96053 108847 116246 130054 134672 130647 129550 129489 115727 99957 89900 79970 67036 59544 56539
8141 56539 58790 65892 74504 69913 66708 67692 61960 51008 56291 60561 68103 74625 77397 74197 70604
8126 70604 66938 60099 67382 73253 83751 95034 93835 89824 78192 83359 104748 118908 128278
8113 128278 138742 151279 155423 152324 138000 119510 101512 97646 88419 84088 81618 71770 65562
8100 65562 64399 57551 67351 70321 69522 69389 64037 58570 66298 77262 74978 71055 67370 64412 63370
8085 63370 64593 64358 62828 64863 76260 75825 72568 74696 70874 63783 68990 74366 74998 68164 70839
8070 70839 72796 79028 70677 60073 66904 62482 66651 77849 76688 70579 74479 79465 81064 85630
8056 85630 91313 98641 92986 97942 111382 123852 121550 114011 115562 132796 153425 173148 186740
8043 186740 191191 195526 202357 219657 232708 227658 234992 245602 263150 282414 281012 264173 254949
8030 254949 242670 235952 232255 228287 220070 212909 194593 184927 186197 192767 187274 183681 188023 189925
8016 189925 193921 195129 198689 212438 226765 240788 260732 286903 322508 362021 418115 489743
8004 489743 565063 636704 675216 692558 709455 696217 645361 571682 506270 478439 478444 507590
7992 507590 575722 660791 717320 739831 731127 699676 641252 553653 454754 372471 330167 312885
7980 312885 297091 289325 280553 268633 263513 250925 240620 238073 235979 234791 247242 268238 270056
7967 270056 271816 274357 287399 312246 351776 398432 457873 528798 598838 655086 696960 730601
7955 730601 735835 710093 686990 667897 674025 700230 731009 744310 740789 723444 689007 637034
7943 637034 556194 474261 411637 367088 338314 319106 309607 297073 285972 266556 254723 233890
7931 233890 217879 213578 210620 199157 205318 209450 209665 217854 219820 222962 232385 255910 283097 304704
7917 304704 322461 339462 347746 353518 360090 340289 312643 284746 277369 274018 257747 251022 253137
7904 253137 251725 238428 216690 195186 188387 176712 150886 141828 152833 157554 158288 148328 142067
7891 142067 130489 111014 108577 109908 102236 92335 96275 106154 105316 100316 89298 82263 86406 81454
7877 81454 83848 92399 96677 85094 74910 75509 75660 84313 90362 104217 92549 79910 78079 75114
7863 75114 81630 82364 74756 67164 60654 56089 51096 54558 48375 57538 71314 72059 75442 64663 62458
7848 62458 55189 49659 44660 49509 54286 55434 52261 57895 62094 66801 62961 61128 57952 61010 59438
7833 59438 55732 62211 62623 57403 53251 54524 56777 53646 48650 53848 48973 45560 41691 38423 39866
7818 39866 41205 32950 26215 22072 30570 34843 33272 41766 57147 59381 60285 45927 41337 46096
7804 46096 35189 25679 27131 31530 32812 33752 37037 33092 33176 37501 38525 35263 30433 30612 29838 26976
7788 26976 25413 33716 37195 30949 33768 36712 41578 37144 35780 41624 43453 33302 17911 16186
7774 16186 22498 15092 15949 26238 17490 23701 26827 30986 35530 39736 34456 26517 20537 20019 21679
7759 21679 27887 31671 22589 17151 22638 31803 32436 24987 28324 26904 31319 34714 26185 17010 19915
7744 19915 20663 18591 12987 12609 30233 27391 14611 15752 16467 15391 17930 25801 32057 33800 29805
7729 29805 24150 25682 30961 27637 25422 29113 29386 29605 33613 41264 33526 20427 5273 -6174
7715 -6174 -1306 3370 8168 15284 20563 26757 26531 22648 8027 235 -7363 -4561 8262 14018 14139
7700 14139 15404 14747 7684 3321 -2343 3885 10258 8802 11926 10798 11871 5137 3405 14766 31815
7685 31815 30881 22218 16715 23249 23832 15558 6555 4546 5591 7647 6369 6984 15684 18927 21641
7670 21641 26402 32955 30556 28618 25189 16819 5709 7239 11470 11151 14718 21522 27377 30430 28559
7655 28559 23394 26469 26861 23542 18024 13509 17512 15001 14683 15247 15865 21409 23130 15982 15543 15032
7639 15032 11297 6708 13991 17212 20322 22783 22510 19542 25036 24538 16054 10524 13187 11822 15809
7624 15809 15839 14907 11015 19825 20333 15766 20442 24810 28137 26310 24568 17296 14095 8946 14228 16061
7608 16061 19556 25996 20058 18083 19175 13831 13118 2099 5546 5225 6134 12214 9529 10609 10263
7593 10263 14021 7411 1853 2416 8175 19734 30976 30543 25169 24190 29957 24299 21618 19129 20545
7578 20545 16294 6095 6959 4671 15893 18344 19986 30812 22539 9257 12082 17400 22807 23212
7564 23212 21965 12184 24922 27394 13210 3759 3549 4476 1148 11134 7337 6997 13007 16992 9731
7549 9731 8170 15359 12995 12192 13115 9532 4131 8708 13447 15057 17944 15465 17135 17803 26598 22324
7533 22324 11851 3621 -9766 -8096 10379 8190 11009 21459 16993 7583 13998 12119 8475 14644
7519 14644 1590 -5406 3385 11410 3461 453 12249 16256 9920 -3465 -11918 -12920 8594 25924
7505 25924 22551 22164 20254 8528 8615 12159 13080 18052 15611 6345 13980 15155 16930 16284 6806 4923
7489 4923 5836 6751 3034 13453 18380 7863 -216 2068 8240 5257 951 2467 13224 19986 29587
7474 29587 36015 32881 23805 20063 7752 7669 8506 11869 272 101 3420 510 -3291 -6807 -5422
7459 -5422 -5767 -4822 -3998 -3375 -4730 96 5635 9794 9699 5182 5569 -1946 472 8493 12876 4828 9728
7442 9728 13129 3349 8042 12873 18237 21292 26462 21652 16549 15533 11015 13251 12905 4814 6455
7427 6455 5115 6222 12597 18129 19892 21187 14856 11236 7853 13517 16598 16081 18280 22286 26902
7412 26902 16325 1630 -2331 6698 12129 10708 5210 -4496 3624 2348 -1469 -1336 -7636 -8186 -3725
7397 -3725 -1134 -1398 1694 87 -5858 358 8393 10870 5727 -3912 17409 28625 22044 21286 17268
7382 17268 10769 8891 24039 38350 30450 7315 2148 9074 2983 8467 18049 11076 1491 -1711
7368 -1711 3831 4411 3069 6734 1746 -8877 -4151 1525 9972 7845 -2521 -6353 -1690 2567 9303
7353 9303 12625 4279 1315 2896 6146 5275 7741 9839 -3659 -3173 3842 8375 11855 13066 11249
7338 11249 5152 1072 -1947 -2327 -6129 716 15145 23959 23582 20071 13846 10014 4757 -5366 -18716
7323 -18716 -19945 -16794 -10011 6710 12455 15315 11057 3075 -80 6539 12448 17307 14863 17392
7309 17392 16669 11267 1074 5152 16143 1342 -4067 8211 3215 -6064 -1374 5657 3570 -6201
7295 -6201 -9651 4574 6181 1469 -5363 -2482 -1656 -1602 -4444 9047 7449 8440 11857 6588 4832
7280 4832 1275 -5175 1390 16873 12945 -788 -8672 493 5324 8901 848 -12764 -10400 -1965
7266 -1965 7577 11615 15940 15621 20838 20707 9453 -1925 -200 13522 23111 23089 14596 12244 15383
7251 15383 14405 11866 12379 13483 17202 9705 48 -2077 15394 23615 26723 19626 10783 493 4556
7236 4556 9479 9048 12465 6610 4366 5006 12582 19611 15868 9865 6684 5772 4217 4979 8794 3292
7220 3292 -6861 3980 12263 13102 3410 -3792 -3811 3205 10652 19289 15060 1565 6829 14933 15967
7205 15967 18866 23248 12223 4433 3432 9119 13598 5775 287 1060 13118 5680 861 3222
7191 3222 3960 5268 5057 -1408 -5259 1878 9421 8113 2022 -907 6299 18541 23140 20929 20306
7176 20306 23021 21257 7552 -7215 319 8332 6704 10751 -4168 -8234 -5657 -3711 2965 1285
7162 1285 279 5408 6652 4094 8649 14325 15926 13862 18482 19491 11577 4090 467 -1902 978
7147 978 12161 12735 8481 7903 4282 -3388 -268 -7367 -16677 -11183 3071 6658 -921 -2105 -931
7132 -931 8929 12919 11838 21334 11581 12586 18573 14935 8767 8682 17557 10893 3798 1104 8969 18081
7116 18081 22108 23834 16405 6719 -8592 -10712 2729 16853 17121 8306 13892 12457 12118 9436
7102 9436 8479 19418 20020 16126 17777 15021 2648 5907 12788 9612 2214 1544 -840 2804 -3815
7087 -3815 -8482 -5314 -3701 3896 11807 5935 8752 11437 3866 -74 5524 9725 11862 13104 13025
7072 13025 6802 4654 10135 14277 13614 15448 10307 4184 3943 -772 -6968 4606 5997 -1181 -2744
7057 -2744 -1504 -1580 -3744 -6140 -5424 -4922 1243 10565 12329 10567 9487 8528 17859 22181 14688 1595
7041 1595 107 5565 5951 3906 -448 -2112 8392 15861 15571 11461 14394 14958 12603 5898 -1413
7026 -1413 5322 9074 11206 21206 15736 11006 4098 1615 6204 4458 8243 7210 2118 2388 5940
7011 5940 15511 17136 16919 19883 20649 18448 8577 9732 4305 -6002 -19182 -25651 -7603 3798
6997 3798 998 -524 534 -1517 954 4018 2963 5243 8995 -1301 -7954 2974 17906 12603
6983 12603 5918 7586 4189 12463 18719 13302 18135 29109 26719 15693 5531 666 2841 9177
6969 9177 7902 7129 12146 13046 397 -6525 -3858 8655 2986 -2510 3050 7671 2934 9421 15334
6954 15334 19548 9491 593 5489 9364 12919 12196 12894 9725 5776 7867 13967 7925 8909 9784
6939 9784 14572 14385 10684 13799 6916 2061 13529 12369 1872 -2544 1148 7132 12582 15565 15087
6924 15087 18764 17957 14386 -9 -9944 -10643 -7723 -8035 -5191 -8909 -16291 -23192 -18020 -6987 343
6909 343 2520 8550 12525 3725 -2361 -997 13045 14296 13526 10930 8386 7149 882 -1844 -700
6894 -700 1749 12282 25144 25969 33616 35760 37961 40735 31301 14553 16691 14146 11179 10994 11793
6879 11793 18939 24464 16058 14817 11215 2638 11144 8880 11281 16340 21322 22702 28003 29753 18999
6864 18999 14872 12905 10076 5525 1571 147 10713 11559 3162 4482 2271 3228 466 -2880 -3995
6849 -3995 -5956 -3388 -6703 -6957 -7311 4321 8603 11852 11691 -5090 -11233 -9047 -1837 2294 10454
6834 10454 5626 -3242 6616 11497 9205 9567 12532 6069 1188 -3575 -12391 -10538 -3708 5932 4475
6819 4475 -6722 -14760 -12146 -1867 5896 6050 -899 6020 9919 9767 4101 11098 14235 5763 -5303
6804 -5303 -2528 5973 4859 6932 -2256 -3570 -3081 -2957 2780 5088 -200 5918 7361 8242 7058 3235
6788 3235 5141 5338 -2742 1259 -1545 2909 3552 311 -4192 -10412 -5611 -6875 3801 11836 11268
6773 11268 547 -3493 -5339 -2661 -1322 2942 4483 2080 1492 -1930 1333 -4072 -9840 2553
6759 2553 14935 15686 16038 6452 -4487 -9390 -8531 -8136 -3023 6480 15415 19531 17017 9136 351
6744 351 13496 24053 19711 6940 4194 3839 -3596 -7482 -9031 -8449 -285 -1232 -5238 -10856 -3267
6729 -3267 2544 -4364 -1667 6727 7087 7387 11674 4886 2004 245 6108 8670 17259 7982 1593
6714 1593 2751 -1356 -10909 -15162 -17549 -13835 -5938 -6636 -11253 -11838 -8977 -7223 -8088 -1430 -2400 -5745
6698 -5745 -1285 6121 3343 970 1921 -483 20 2968 -2665 -7271 -12517 -10996 -4244 8241 12219
6683 12219 11705 13566 17194 17035 16345 15313 9701 7584 -1001 -8499 -9123 -10609 -12947 -566 12768
6668 12768 19362 22827 20583 14518 7943 7254 10279 12741 14000 7386 5661 8763 13627 10658 7899
6653 7899 6396 1235 6111 5424 -2118 -1376 13912 17881 9876 5901 2162 5264 -1350 -6599 -7638
6638 -7638 -1034 5814 1260 6681 6143 2829 -280 774 4500 1438 378 4591 11020 11453 3559
6623 3559 4926 14311 20355 16844 14400 14821 8022 16167 29591 26181 13991 3674 4695 1592
6609 1592 -6617 -18042 -6409 -4011 2511 5274 11332 13087 3902 3050 260 6358 13040 16456 15628
6594 15628 8560 3238 -6474 -8800 -6145 -9731 -12407 -2038 10655 21517 17374 14480 8080 -3344
6580 -3344 -4386 7145 15589 11882 8110 1567 3920 13668 7385 -2105 4843 6684 8952 7183 -218
6565 -218 -5474 2278 10453 -8938 -8881 4704 1896 10725 8251 3057 -8404 -13471 -9128 4771 14225
6550 14225 14208 8679 14884 13446 5908 410 6013 7359 4800 7711 10118 12067 10939 15723 15474
6535 15474 8279 9314 -66 1624 3116 10237 13484 12314 17706 21353 17566 11119 12450 10138 6794
6520 6794 2201 -827 4980 2415 6090 6076 3181 7365 18466 12131 -730 -2006 14734 16084 4152
6505 4152 -4875 -7556 -5764 -235 -917 -3808 2519 11795 12876 13989 15845 17830 13688 12048 -4079
6490 -4079 -7366 -356 -3265 -4734 637 13013 24184 17807 7115 -1167 -3900 -1467 -6030 -2393
6476 -2393 -953 -6972 -6454 -8068 -3884 3197 8914 232 -10749 -9327 718 2268 2138 3385 -1185
6461 -1185 -276 -10628 -9296 -1316 -1698 935 1781 -2585 -6283 -5052 -3547 1453 9443 -1060 -7019
6446 -7019 -6877 -11274 -10861 -6278 -3646 -6411 -10678 -14223 -10368 -11512 -18570 -19985 -13567 -8255 2477
6431 2477 5397 -1376 6485 12187 3097 4785 5089 11922 17224 18443 18609 18357 17738 20962 16324 12145
6415 12145 13771 10697 13461 18897 12877 -1370 -1746 -3438 6324 8975 4491 7145 5246 4342 650
6400 650 961 983 -6497 -3403 928 8171 10727 11782 15460 -2582 -8162 -322 -7329 -10288 -9672 -16351
6384 -16351 -21866 -10307 5107 4364 -1277 -4284 -6321 -12753 -13179 -2261 11410 19771 11254 11388
6370 11388 15483 5638 -1202 2116 4416 -1173 -1331 412 855 11 7686 10806 6060 -4322 -6562
6355 -6562 -3178 -3183 -9025 -3786 -5293 -6449 999 6314 7106 6639 3757 3000 8148 10147 6266 2458
6339 2458 -5577 -4451 -34 366 14295 21786 15471 15837 6076 -834 -4462 -3857 1594 1959 -78 2683
6323 2683 8947 7308 -760 301 9825 8340 11787 5243 1096 -9327 -15389 -14053 -12702 -8726 -14210
6308 -14210 -10957 -9596 -12473 -8155 -1830 -344 555 -3950 -9274 -13437 -7640 3700 4804 -3654 -1066
6293 -1066 -202 3733 6841 -1385 -11275 -8267 -4119 -1417 4556 8797 7010 -759 -4796 -3539 -2509
6278 -2509 -350 -2290 -5596 -6683 -1947 10184 2673 -6895 -3820 6535 511 -5838 -5911 3079 5879
6263 5879 13839 8937 1916 7865 14736 7487 -2915 -2650 1704 5896 2610 7032 4559 1161 4286
6248 4286 2119 5626 7240 9991 3787 5494 6796 761 -3658 -10707 -2135 721 -3611 -2433 429
6233 429 4176 7689 14893 10996 3251 4471 -4764 -4740 8730 10451 2604 -9413 -6163 -6175 -6171 1284
6217 1284 2583 7030 8916 3045 10686 18035 16012 9694 9034 5017 5955 1393 2516 5292 15854
6202 15854 16751 9962 -4846 -8682 -13038 -10543 -3516 -5721 -8442 -14799 -11288 -1637 8860 5712
6188 5712 -952 -3509 -6398 -1798 -2876 -7907 2498 -6427 -5318 -292 1740 -1720 -2006 2709 9106
6173 9106 6460 8918 9617 -727 -4265 -11657 -4901 1781 7815 14231 9848 8573 11213 14305 10645
6158 10645 -2651 -8954 -704 -2707 -7981 -2397 4293 5904 6437 4812 3260 2267 2951 9660 8033
6143 8033 2940 -716 -14511 -7231 6595 7335 -1244 -9185 -15847 -14231 -9967 -15575 -8659 2273
6129 2273 7752 21185 20118 11574 853 -5633 9728 13348 2846 -7180 -12943 -10240 1058
6116 1058 573 -5020 -12370 -18124 -13397 2590 4078 3966 4742 4288 2271 7183 5790 5787 4089 -940
6100 -940 68 12845 11904 4927 213 -52 -3191 -10142 -2938 1866 10318 13501 12099 2898 -3715
6085 -3715 3667 7885 15300 6913 9 -1627 1853 8355 4299 2828 1707 708 6452 4271 -1371
6070 -1371 -11931 -7797 8197 9515 7547 2013 -147 -5484 -4109 1531 -5079 -11287 -17484 -11091
6056 -11091 -4602 -627 3332 1402 -1514 3472 6083 7253 3347 3560 9837 12019 15527 16914 20631
6041 20631 20037 10637 3548 10128 4358 -2414 -6041 -7445 -4771 3123 3596 1595 2673 122 -3140
6026 -3140 -1355 -5677 3416 6197 1809 -6278 -13266 -3395 12140 11986 12449 9866 10584 614 -8221
6011 -8221 -15825 -22484 -20499 -11580 -9512 -21289 -25675 -18089 -9945 -12276 -15248 -2665 13344 15937
5997 15937 4110 6131 10144 10488 5124 -5132 -7211 -10408 -10510 -4499 3579 2627 4107 11504 7262
5982 7262 7907 -949 -3932 -4749 -7894 -10300 -10170 -378 -1228 -7189 -4174 6509 6406 7182 1300 -2311
5966 -2311 -7526 876 1485 4543 -2921 -2233 -2133 4660 9261 -836 -12622 -15142 -5861 4020 -5236
5951 -5236 -233 -1993 -8892 -2965 6367 11447 8720 4999 3128 7342 -2022 -13742 -14319 -2606 -4161
5936 -4161 -2289 9052 12783 -7043 -17694 -19584 -6224 -3913 -816 3576 2281 -3038 -8887 9977
5922 9977 12992 13358 4538 -5331 7575 7238 -1484 -2694 -4235 1193 -6 8036 1187 -6914 -12335
5907 -12335 -9201 -2397 -7422 -6002 -9503 -5220 -6379 -5092 -7699 -10387 -12412 -8739 -8638 -4507 -8807
5892 -8807 -8641 -11141 -20898 -20330 -6907 -3168 -7359 -5741 -2486 -3519 -5337 -3975 -775 3844 -2388
5877 -2388 -1399 4255 7099 7026 4732 9115 12728 4793 -11597 -9375 -7767 -12360 -12055 -12288 -12870 -6208
5861 -6208 -4769 1595 2313 8627 24738 19706 4595 -1177 670 5596 9238 15599 11837 8505 -3826
5846 -3826 -17598 -16015 -21766 -13026 1148 5222 5900 930 4031 4234 -7668 -7176 -3923 -6324 -2990
5831 -2990 3798 2548 5968 5974 4848 9609 10488 1638 -2071 -329 -3274 -5298 -6498 -11030 -12479 -12205
5815 -12205 -8405 -411 5433 10130 14128 -282 1920 924 -4615 -7765 -14074 -24020 -13492 466
5801 466 3543 7683 3047 -1508 -1258 2764 9506 5845 5194 151 -5061 -5282 -2680 2511 6 4792
5785 4792 9301 17186 14606 2614 -5264 -1700 -2629 -2795 -236 3659 8797 10855 10396 12781 13779 12982
5769 12982 14997 10784 6224 2046 5459 2729 3952 6594 4669 6700 7472 15747 19575 10429 6340
5754 6340 10523 14812 6684 2448 8662 12977 18163 13266 2807 4885 5380 9790 9816 7780 7266 8694
5738 8694 12776 9462 2845 2336 -2835 -5284 -10311 -3623 -3087 3280 11820 9771 -115 -5393 -1205
5723 -1205 -2845 3987 7982 6584 -3457 -22606 -18493 -11039 -173 7609 5763 4252 1794 3000
5709 3000 13862 21300 18234 13210 8614 2935 -1533 5224 3365 8589 16503 1204 -11653 -13910
5695 -13910 -14565 -8330 7340 20335 15235 -2743 -6628 -387 6085 3438 1827 5318 -3901 1322
5681 1322 1367 -32 -3134 -10606 -1992 17050 14938 1585 -324 3629 7455 7130 8921 15496 10744
5666 10744 2873 -1376 509 5229 5477 3485 11816 20129 5816 -6958 -5990 1119 5560 5661 -9479
5651 -9479 -15949 -8935 -7412 -6118 -9383 435 10921 4325 8741 10645 14809 10346 3130 -1921 -3035
5636 -3035 -9809 -6827 -13062 -12546 3281 17417 14634 -1034 -8960 -14404 -24472 -24014 -14907 -17413
5622 -17413 -14416 -11182 -7674 -11614 -4377 470 -996 -6182 -657 4962 -679 -2671 -1942 7451 7759
5607 7759 3806 4640 4755 3691 -9496 -12929 -13922 -11706 -12373 -12014 -4426 -1928 -7820 -10747 -8651 3208
5591 3208 8466 6316 1175 7016 2041 1101 3362 6454 5606 8229 -50 -406 -3104 -8324 -14181 -13810
5575 -13810 -14644 -14542 -3907 665 -5740 -15098 -18647 -18163 -17383 -25008 -22990 -20112 -12411 -7060 -2383
5560 -2383 -5168 -5676 -8075 -5949 7450 13568 4167 46 -1844 -675 18 4545 10490 5377 -5141
5545 -5141 734 3442 4410 -5648 -10381 -9316 -74 -5097 -10286 -4531 -5437 -7005 -6821 3898 11983
5530 11983 17122 8521 11561 18072 6591 11137 18147 19342 13507 10615 14704 18336 24730 20746
5516 20746 8798 2252 7897 8032 3486 3943 -493 -7451 -14761 -20443 -9342 -16113 -12314 -9597 -2546
5501 -2546 -2099 -6193 -13107 -5728 735 7368 8425 6530 16575 11999 1079 -545 6531 12580 7603
5486 7603 4805 3263 -2964 1060 3740 2160 4683 -1237 2173 -757 -5656 -6385 -2205 10333 6883
5471 6883 5469 -2338 -4840 -6501 34 1941 1536 6325 8083 9294 10093 9982 12092 1249 -5091
5456 -5091 -2578 -2200 -5658 -10896 -15508 -4724 17134 23476 11952 3403 -10205 -10521 2916 4805
5442 4805 7888 2240 2414 991 2578 7694 6548 5922 269 1796 1761 -3332 -6410 -3042 1287 13542
5426 13542 5924 -3172 -8637 -6748 7680 24367 14461 5681 -402 2424 10376 17974 13792 5394
5412 5394 3113 4232 5352 -1771 -2192 -4190 -7217 -3401 -3757 -8660 -11905 -10932 -7259 -10864 -8788 -3054
5396 -3054 -1672 -8081 -10463 -10568 -11513 -18608 -17451 -14471 -6434 -8358 -9158 -2349 -4327 428 4343 -163
5380 -163 -3447 -7814 -10526 -2593 3094 6063 -5601 -15208 -19060 -12916 -12552 -13918 -11078 -11457 -8683
5365 -8683 -10642 -11997 -8358 -12212 -13355 -4793 162 -7290 -17965 -19218 -15820 -1062 -3961 -4046 -7754
5350 -7754 -12018 -4083 -2211 -3923 -874 -6309 -863 -4647 -7311 -3706 -8572 -5244 1097 3602 -1868
5335 -1868 -1029 7541 3746 -4785 -6309 -7607 -12113 -15307 -5958 -7221 -10510 -1381 3739 14449 20714
5320 20714 6622 7340 14452 10705 6707 5735 5030 1574 -3814 -443 10551 12481 7351 -7 -3182
5305 -3182 -5776 -8463 -3362 -1664 2281 5544 2208 634 -1024 2462 2660 3398 10714 20053 26524
5290 26524 19445 11863 4788 2878 -5190 -1240 300 -728 -4085 1990 10279 -3133 -1342 -2903
5276 -2903 -11332 -25700 -17595 -5098 -3631 -4067 3593 10716 321 235 -3719 -467 6964 8003 4395
5261 4395 -3796 -14829 -5193 -1898 -1077 1059 7762 12055 5816 -7362 -9335 -2971 14 99 5544
5246 5544 1549 -2492 643 -7497 -7168 -2667 -2147 -5115 1045 5790 17246 27256 17330 3000 10874
5231 10874 16381 8459 8260 12179 -3789 -7730 130 6103 -3938 -8159 -18055 -12587 -6494 -4295
5217 -4295 -3755 6455 5865 -6 -6280 -9376 -8073 2142 23840 26742 18149 6634 14392 13935 5632
5202 5632 3666 4788 3264 -294 -2464 -149 6214 2155 -3579 1258 3249 1489 4753 3522 6409
5187 6409 3827 3138 -5518 -10441 -2439 7907 14950 13018 6954 2922 1862 14922 14968 8293 7351
5172 7351 7487 4093 -3875 -2728 -4343 -356 -5093 -12761 -13788 -18047 -14370 -7929 -10931 -8565 -4219
5157 -4219 -3010 5714 -3868 -19608 -9583 -7960 -5948 -7986 -9365 -11934 -1705 401 -1101 -5870
5143 -5870 -9228 -17992 -24638 -28386 -26790 -19135 -20100 -15556 -13306 -9019 -3123 -5108 -6315 -4970 -4854
5128 -4854 -4999 -3658 -9316 -9495 -7049 -9582 -9330 -6840 -3097 154 1925 -3376 -3029 -2328 -1420 -2142 -2461
5111 -2461 -2853 -3962 -2434 2040 1412 -11788 -7905 3293 2188 -7393 -11732 -14072 -7936 -1743 -15707
5096 -15707 -24482 -22131 -9840 -6176 1909 -2910 -7537 -14700 -17665 -8202 2449 3940 -12166 -20889
5082 -20889 -19752 -12237 -6382 -10665 -8268 -4251 -4862 -445 6439 -759 -9250 -16808 -13540 500 -3154
5067 -3154 -6328 -2898 -6653 -10841 -13839 -16578 -4922 11331 18099 13045 8438 6526 -3545 -14153
5053 -14153 -15657 -7903 -2026 -11994 -10184 -5952 -4529 1743 4063 -1564 735 1970 3297 425 -1340
5038 -1340 2894 6057 1610 2092 1314 -1927 2799 -2492 -5587 235 685 5419 4366 4683 -714 -8723
5022 -8723 77 3277 3248 -3029 -4259 -4662 3007 2631 -7727 -5213 1081 5650 -674 -1924 -6906 -4384
5006 -4384 4266 -4199 -8166 -12821 -10532 -2920 -7909 -9590 -14223 -16533 -14279 -5042 3378 3917 -1606
4991 -1606 6778 12447 5004 -488 4742 5995 1138 6521 11884 12025 5445 -4550 -5166 -6395 -6136 -9543
4975 -9543 -17372 -7896 1647 -1236 -6106 -6771 -5767 -7435 -14156 -15650 -11443 -6570 -6483 -3039 -4076 7862
4959 7862 6444 -614 3005 7314 9302 8763 10633 12798 4349 -8844 -3878 -4911 -8854 -13049 -12492
4944 -12492 -11149 -6912 -11995 -10304 1001 4015 -327 -2134 -4544 -1949 -1491 -9817 -3092 4283 8000
4929 8000 -2976 -10047 -8659 -6137 -6210 -1139 7378 1370 4541 847 630 4898 1942 4555 8250
4914 8250 -3025 -11020 -18231 -26375 -19172 -6943 3669 2182 -8632 8653 12391 7074 3760 1813
4900 1813 -109 4449 3849 -7341 -11099 -8905 4822 7820 -2643 -596 -7401 -6279 -9447 -9995 -8070
4885 -8070 -8521 -5980 -263 6116 9818 9408 7424 -4078 -2116 2713 4511 7579 10027 7301 196
4870 196 2530 -5845 -13831 -7848 3087 2245 680 -3595 -3531 15352 16018 3787 -2867 -13453 -8340
4855 -8340 -6617 -2299 1741 6380 8239 1462 -4502 -4087 -9560 -5610 6750 4509 -4737 -2428 -4656
4840 -4656 -6271 -53 4650 -1920 2103 3470 3194 11471 16153 5703 6733 9166 227 -8206 -7261
4825 -7261 -4052 5161 18600 18785 11630 8012 6421 9872 14259 17458 2897 -14650 -22762 -15459
4811 -15459 -5536 -360 346 1841 8267 7634 10788 17520 13542 9648 4619 1449 2880 3820 -3422
4796 -3422 -8350 -5373 1893 6517 6340 5365 993 -6637 -16608 -24780 -24629 -6541 650 1429 4040 10385
4780 10385 18675 22205 15582 8234 10294 11588 9222 2076 386 -3265 11553 15180 9491 19115
4766 19115 27791 21972 10519 -417 -4037 -425 3485 1041 -1539 238 -6348 -13116 -17099 -9523
4752 -9523 165 -2852 -7099 -3551 -1687 5732 6059 8698 9713 8262 2319 -2951 -7690 -6100 -8867
4737 -8867 -1433 6959 8986 -3793 -9120 -2447 3781 12498 3801 -6838 -11858 -17804 -18206 -7630
4723 -7630 1512 1434 -5371 -8640 -6365 -4379 -13839 -4643 11783 4858 -1847 -5964 -3735 -369 -5044
4708 -5044 -7193 -5017 -4859 3093 14997 19358 8610 4833 -2170 -5480 3230 3782 5406 -4075 -11142
4693 -11142 -11270 -4181 7049 5476 3010 4205 -159 -11297 -13199 -11912 -11357 -4770 -3644 -7276 -5028
4678 -5028 645 -7670 -8598 -3484 -2492 612 1944 6611 10815 3230 -11903 -17836 -23662 -19214 -14467
4663 -14467 -13119 -7179 -3648 3513 -5098 -12326 -20621 -19431 -16609 -9693 1840 6095 4983 -945
4649 -945 -1186 -4511 -6567 -2722 -2484 -7372 -5420 -10952 -21350 -17055 -6599 -6179 -1816 1440 -5236
4634 -5236 -6848 -6692 2590 -1578 -4146 3387 12310 -822 -671 -5523 -7465 -10608 -2891 4188 5513
4619 5513 3010 9130 7730 2712 -1357 -635 -1681 -1453 -5925 -13171 -6695 2020 -2241 -447 5911
4604 5911 2315 2270 11316 16200 7094 -1568 1295 9335 4452 2497 7558 4361 -483 5200 12050
4589 12050 13582 9916 13043 24461 19183 20205 15085 12145 9418 3621 91 1501 -3538 -8272
4575 -8272 -15931 -11955 -12986 -2392 1415 -9023 -12014 -12611 -14464 -1768 -6485 -13309 -11149 -672
4561 -672 1755 -724 -10236 -10775 -11589 -10317 -4999 -5683 -18067 -20674 -12582 -10624 -6429 5438 16752
4546 16752 12397 -1026 -12179 -4084 -811 4340 415 -6734 -6187 -7864 -8862 -14005 -11151 -14985 -7237
4531 -7237 -3873 -8172 -2519 -8893 -11841 -2340 2962 627 -8691 -12047 -1428 3441 6339 11720 15318
4516 15318 10824 3027 -11690 -10369 -3964 -5915 -2716 -7223 92 9783 10461 4850 -1777 -3025 -2573
4501 -2573 -1798 4355 13853 9676 9422 13803 10155 -4844 -611 3290 -3339 -1414 195 -1860 -2637
4486 -2637 -7098 6227 8875 1769 5646 5904 7251 10526 15326 5463 2 -3352 -1331 5839 6659
4471 6659 3445 1203 550 617 3016 2039 2892 -5439 -8455 -5802 -14311 -21825 -12270 -6357 -4083 -2222
4455 -2222 922 -2557 -6128 474 4254 -7474 -7651 -11814 -15777 -7147 3215 5514 1543 -1166 -3209
4440 -3209 -5747 -18812 -18949 -20637 -21928 -21039 -14296 -20782 -14348 -3719 486 3320 9277 8308 4578
4425 4578 -6004 -12205 -21666 -19595 -11300 -4150 -2715 2273 1009 1661 -5958 -6468 -12427 -11916 -11276 -10787
4409 -10787 -13554 -7314 2729 1564 -318 -5791 475 11041 6874 2874 3198 -1801 -6767 -12458
4395 -12458 -19793 -19492 -13841 -1987 1170 -4680 -11314 -3893 -5378 734 8406 -1337 -1529 -6910 -14779
4380 -14779 -16458 -5807 -2778 -6113 -7815 -5275 5808 6271 3803 10751 12396 7663 5709 4903 1283
4365 1283 2057 -2788 -2988 -1222 -2732 5285 5938 1793 -7785 -8277 -4094 -4379 -16195 -16145 -1779 2053
4349 2053 3759 -3949 -11418 -9050 -11427 -14517 -12264 -15965 -13019 -1279 -836 -6753 -4133 -6452 -10248
4334 -10248 -9617 -5028 3325 1294 3426 -2881 -7697 -5372 -16708 -17711 -11800 -10182 -4168 -486 -1541
4319 -1541 -9398 -12511 -7183 -5874 -10065 -13599 -19965 -14114 -9233 6524 11466 2400 -11359 -20525
4305 -20525 -20271 -13790 -7141 -810 4029 -8230 -12752 -5038 -12893 -5874 5917 8286 10180 8113
4291 8113 8273 9170 6696 8062 8890 39 839 2831 4934 555 -5997 -4538 -5592 -1123 6374 2997
4275 2997 5097 13913 17771 10158 7228 8939 7939 11142 15032 18158 12289 1089 4415 4850 1421
4260 1421 -1539 267 1791 -7144 -3822 -77 -5456 -12803 -6730 1146 909 4526 13029 18081 10607
4245 10607 -4766 -5189 2114 7448 983 -675 1410 -1130 -228 -5809 -3382 5996 -2716 -14989 -12869
4230 -12869 -5245 -376 3135 -3059 886 -4025 -8305 3477 5300 -199 -1440 3452 5265 -87
4216 -87 -7072 -6600 4858 8922 860 -482 789 -7575 -14378 -2641 1785 8438 12713 13226 4779
4201 4779 1782 -682 -125 -650 -9801 -23833 -28718 -17472 -10062 -12313 -9954 386 522 -1909 2642
4186 2642 1824 1019 -6845 -11806 -491 4188 8348 8205 1637 -1740 -1238 -3088 1959 -1594 -5956 -10382
4170 -10382 -7260 -4682 -10520 -13014 -4511 5562 -267 1003 6080 2647 2274 -1336 -13815 -17782
4156 -17782 -13451 -9241 58 10954 5718 -4249 -2854 -2765 -1001 -2817 -15382 -10275 -13932 -18154 -14404
4141 -14404 -9173 -10072 -3973 -2059 -4241 -5566 -9174 -22726 -18754 -6811 -4671 -6167 -10863 -4783
4127 -4783 -5361 -5192 -3468 -3269 8648 14962 11495 6684 1482 3530 667 3018 2794 8430 8733 4775
4111 4775 -2449 -7071 -17515 -15253 -11704 -12255 284 4488 9325 10703 344 -6837 -14395 -19859
4097 -19859 -12466 -5767 -4478 -812 -552 -4113 -6282 -7033 -8118 -5069 -4881 -6910 3373 6513 3655
4082 3655 2765 2159 -7931 -9290 -1572 1397 8757 8910 15097 11298 2232 -133 -1750 -8235 -14033
4067 -14033 -8087 3508 -5197 -14721 -20615 -19267 -16086 -7176 2383 6922 4181 -1351 3764 9397
4053 9397 11980 5290 19527 11766 -4844 -7392 -3885 -14222 -13038 -3404 -392 211 937 -3860 -9600
4038 -9600 -9569 7833 11632 2996 -2105 3388 -1052 -1968 5512 6050 7780 7324 3632 1979 6887 5432
4022 5432 1002 -6712 -6671 -7857 -7627 -303 -5785 -5799 -11260 -9537 -9571 -10067 -9857 -11996 -1423 7689 -3310
4005 -3310 -2368 -103 -2232 -904 -1202 -3106 3115 13173 13446 22719 23066 15701 -3128 -4877 -3961 736
3989 736 13826 16099 12162 14012 15067 18532 12832 -1332 -3465 7764 4311 612 -6470 -2087
3975 -2087 3759 7124 7969 15537 22398 11220 10489 14005 5868 10261 11488 5903 -5426 -9783 -7879
3960 -7879 -6867 -7436 -6116 -4558 -618 -1176 -4704 -12553 -10320 4026 -846 -9915 -9608 -9812 -6410 -8165
3944 -8165 -13867 -9874 -5259 -3177 -5245 -10699 -6479 -5758 -8399 -3430 -1177 996 1125 1630 6513 -2452
3928 -2452 -10007 -2238 2000 -3412 -4367 3542 488 -5335 -8565 -10016 -13670 -15084 -11217 -7041 -4907
3913 -4907 -9336 -17689 -20418 -6275 3524 6367 1144 4077 -3467 -14611 -13975 -5756 -11555 -7115 -422
3898 -422 -7102 -13751 -12457 -8773 -7643 -1232 1241 1907 5850 2972 -3579 3040 2523 -1328 5676 -3268
3882 -3268 -11777 1036 12221 10174 743 1745 1645 11201 14958 7482 -157 -6899 -7228 -3907 -1076
3867 -1076 -7006 -9644 -10078 -8872 -4165 2594 3821 9142 603 -971 9062 4300 -4532 -2104 1953
3852 1953 8922 10528 11655 9779 1681 -2315 1297 -607 -6066 -11691 -4800 -1378 -1986 -4757 -7503
3837 -7503 -1721 9675 6260 -4975 -6808 -3881 -5057 -11715 -14905 -9688 -627 -2889 -1847 -1050 -1936
3822 -1936 -9204 -9859 1600 -3196 204 9813 10381 5900 5246 1257 -6992 -9912 -11955 -14252 -19761
3807 -19761 -18589 -14572 -11973 -9528 -10090 -991 -16 2910 10828 4260 -2001 4724 1120 10189 16730
3792 16730 20437 13915 3930 -1761 555 2383 -258 -6385 -6063 -2676 1425 2934 11479 7929 -697
3777 -697 8061 8225 -3452 -2621 6627 12854 9185 2565 -1475 -7910 -14624 -18414 -14174 -8915 -11182
3762 -11182 -8040 -8126 -7223 -11795 -13216 -5970 -243 1217 4327 2007 -980 2668 458 -5336 -9208
3747 -9208 -3013 5700 9992 11323 1031 -4087 -5022 -8869 -16298 -11915 -8400 -9886 -2822 3857 1455
3732 1455 -5259 -9895 -3648 294 -920 3890 1763 -3497 -2474 -2949 -6627 -8826 -1970 1022 -16010
3717 -16010 -12375 -3538 122 -3961 -9857 -10031 -2799 -6104 -9734 6374 6295 -7583 -9815 -9836 -5084
3702 -5084 -5749 -11623 -18502 -27020 -26696 -17808 -10637 -1005 2310 -2401 -4510 -3987 691 -3868 -674 5363
3686 5363 3160 4495 6640 1509 655 5082 2 -5898 2485 18732 8375 -2650 -13050 -11337
3672 -11337 -14044 -12545 -12334 -11895 -9699 -3517 2632 2204 3643 -182 -896 8571 14904 21842 25379 22823
3656 22823 10285 6132 7464 3282 3987 3126 -2085 722 9944 10084 14296 20318 11128 10765 17357
3641 17357 11309 -1271 1470 10521 15068 13332 11333 2549 -6471 -9208 -7697 -8771 -12885 -8334
3627 -8334 -10221 -6706 -3634 -7314 -6215 -2143 -1542 3008 12132 6148 2047 3518 -1527 -4347 -5673
3612 -5673 -15032 -14053 -5552 6795 5986 -529 -5142 2575 -2956 5442 5489 8578 5893 2027 2518 4647
3596 4647 7260 -475 -4831 -7450 3165 8391 2362 -3309 -9770 -13203 -7733 -8557 -5692 -1286 6819
3581 6819 5851 8531 -1805 -620 3100 -5869 -9939 -9444 643 5481 1254 -2691 -14688 -19162 -2015
3566 -2015 7303 8609 11941 2606 -574 -4145 -10500 -12780 -4489 -8300 -18995 -22681 -24804 -17771 -4257
3551 -4257 6774 -2163 -8871 -2733 574 -1533 -119 8250 -4772 -8450 -10496 -6055 -3378 -156
3537 -156 -1329 -6265 3258 7278 9022 7680 6047 -684 -8673 -15713 -14381 -15034 -20413 -16045 -10100
3522 -10100 -22964 -26580 -19732 -7283 -643 -8832 -5351 -1594 -11231 -18810 -21711 -17841 -8515 -597
3508 -597 4281 -2182 -1616 5861 3422 3994 6423 -12292 -18064 -11352 -15837 -11915 -5730 2994 -3095
3493 -3095 -4864 -3866 -4732 -17674 -25835 -11708 -6997 -6883 -6737 -6478 -8179 -5499 -8476 -14116 -11349 -3578
3477 -3578 3774 4304 -3941 -4569 -1727 849 7441 3158 -5279 -3921 -9379 -14873 -14655 -4180 8097
3462 8097 539 2401 13208 7493 -3102 4622 7810 -579 3632 1408 -4676 -8415 -10317 -9553 -10049
3447 -10049 -5119 -383 -4054 -9851 -11848 -10299 -6867 -8960 -20393 -23023 -30313 -21930 -15756 -1578
3433 -1578 3585 -1542 -6610 -17589 -19048 -2188 11827 11803 12482 13320 5587 -7848 -14289 -11507 -7482
3418 -7482 -4192 -6051 -7100 -8475 -1982 -2669 -5610 -16918 -20246 -15484 -7567 2036 1301 174 -15713
3403 -15713 -20342 -13955 -21000 -11878 910 -3359 -11710 -2234 -6831 -5624 -2238 -4504 -11433 -15217
3389 -15217 -7825 -8261 -7821 -832 5190 5210 4349 -10924 -11492 -463 -2669 -10195 -11921 -10508 -16781 -10803
3373 -10803 -3567 -6834 -14386 -1834 4044 6233 8722 14096 11457 6500 1255 5568 7013 4905
3359 4905 168 -4940 -6294 -6941 -8704 4918 14852 10740 6254 848 -1468 756 -211 -2332 -9027
3344 -9027 -15183 -10469 -4596 -11136 -8257 -8961 -7736 -51 13234 13973 4736 3561 3761 1636 -13059
3329 -13059 -22686 -16923 -21091 -12298 -16853 -9828 -4921 53 -4127 -14432 -14215 -2680 3665 3722 436
3314 436 3714 1349 4681 4337 3899 -14 3938 -2968 -16530 -21579 -14340 -5446 -1672 -5411 -8615
3299 -8615 -12119 -4349 -2165 3774 2273 2718 641 3184 -388 -8360 -15155 -12893 -9881 -9482 -1709
3284 -1709 -3080 892 -3844 -5874 -1315 346 -1174 -3655 -1688 -4860 -10086 -1332 1728 -3622 -3963
3269 -3963 -8794 -11846 -8666 -8815 416 478 8042 11018 1670 -6522 -16101 -18544 -9441 -2736 -6663 -3222
3253 -3222 6478 -2334 -5565 -6634 -5845 5131 2876 -2950 -7734 -9233 -4163 5347 -4290 1164 11406
3238 11406 12496 8843 686 -13488 -13132 -9052 -4845 -316 -3394 -8196 -13739 -436 6637 -1159
3224 -1159 -4046 -9002 -11633 -10311 -2535 2252 9212 6937 4570 -2241 -12618 -9406 -3330 -374 -4321
3209 -4321 -8723 -2949 -5716 -9034 -7817 -14112 -3296 3410 -2696 -12625 -8028 -1977 536 2581 -2368
3194 -2368 -2422 1612 3998 1030 -5956 -1091 -880 -4285 -15721 -11071 -12091 -14028 -3822 -2359 -4151
3179 -4151 -8659 -5310 -342 9309 13182 10045 9901 15726 12549 2222 2450 -451 -1223 2465 7140
3164 7140 3654 -7476 -1637 -10564 -13791 -8980 -5925 3888 11276 12310 3612 -8064 -12305 -14818
3150 -14818 -11597 -17373 -7196 -6423 -3262 583 -6971 -6703 484 8798 5150 3812 2298 -4733 -3707
3135 -3707 -10351 -3805 4909 3031 5492 6887 -743 -6425 2489 5842 9722 4373 -1672 -11454 -4407
3120 -4407 -886 -1137 4571 12605 12291 15608 9246 -1185 -13775 -15116 -13024 -12110 -13962 -11245 -11033
3105 -11033 -10746 -2449 4611 4777 144 -2793 -6218 -7880 -9593 -10720 -8616 -441 1251 601 3479
3090 3479 -2238 -5832 -3987 809 1298 3857 -3807 -16074 -15217 -6220 -10227 -9485 -2120 11767 9369
3075 9369 4902 3017 -563 13 -5145 -1727 3909 -7098 -17961 -16118 -3100 2677 10485 20847
3061 20847 21623 19612 11384 8228 2303 -8402 -7558 -2175 -7148 391 6108 4128 2464 6092 10740
3046 10740 7173 925 -1211 -2744 -984 -4462 -7647 -2497 4560 1146 -3257 3901 2113 -498 4954
3031 4954 5634 -4505 -6822 7496 7417 -3691 -1542 596 156 -1872 -8957 -10356 -7591 -6335 -2611
3016 -2611 1868 6953 14889 2195 -1591 1238 -1404 -5558 -18076 -15370 -5310 -2069 -74 1266
3002 1266 -1511 -4935 2188 1805 -11880 -13410 -12363 -13627 -162 8713 4919 -746 -483 1921 2677
2987 2677 -5003 -12753 -13150 -3466 1644 3891 2184 -8269 -14066 -5102 -6900 -7013 -3023 -3224 -10615
2972 -10615 -16773 -16046 -11213 -1526 -3056 2001 7709 6135 -416 -5829 -1534 -2825 -3753 3914 10068
2957 10068 15709 10331 2990 -2227 -10297 -5594 2330 3210 2436 -2750 -15214 -16582 -7544 3318 14988
2942 14988 9567 1669 1768 -4058 -8537 -4289 7326 13815 8795 12410 13440 6471 3398 -2839 -4364
2927 -4364 -7647 -8821 -2353 10313 19597 14033 13507 13689 10533 4364 4930 2006 -5224 -5808 -2407 -1588
2911 -1588 -10254 -15771 -17935 -9517 -6622 -2713 4381 2491 702 -4740 -8354 -7464 -11079 -5079 5560
2896 5560 1937 -5218 2774 -1092 -10070 -22024 -20561 -19880 -22767 -19366 -16114 -10096 851 4835 -736
2881 -736 -1637 -2066 -7578 -5654 -4427 -13842 -17606 -21983 -24225 -21095 -17396 -7081 212 7328 4972
2866 4972 -2246 -81 8704 8654 3253 2549 1396 -2640 -377 5238 7140 6704 9449 16774 10306 4631
2850 4631 -1685 -4690 -233 11106 15959 10863 -847 -6924 -4699 -3687 -4046 -8083 -6143 -3371 -1183
2835 -1183 -3172 -8638 -6591 2957 9183 6249 7451 4099 -2144 -3800 -2095 235 -1873 -7498 3733
2820 3733 6827 777 -1676 -7317 -7610 -8804 -7637 11267 11136 3707 9090 12575 -135 -14199 -16268
2805 -16268 -18877 -17972 -22258 -9937 3906 7800 4448 -1189 -3975 -3033 -7615 -14881 -20861 -15372 -2284
2790 -2284 106 -5038 -959 9119 9403 -1338 -5004 1059 533 -5255 -1331 4244 -878 2825 12673
2775 12673 14130 2934 5619 3634 4803 1510 -560 -11066 -5062 13186 13301 8642 5303 5539
2761 5539 -859 -11786 -10019 -11219 2304 10697 14792 13450 9539 460 -3485 1422 -1597 5316
2747 5316 5130 -6404 317 9648 10078 5160 1304 -8978 -9928 1602 -403 -7627 -9666 -9429 -5359
2732 -5359 -3845 -13291 -15297 -12765 -13933 -11134 1559 11779 21806 20561 5987 3469 5588 5086
2718 5086 9757 9533 10196 11515 5929 5094 5775 1498 -4038 2561 1444 -10370 -13033 -6256 -6789 -1911
2702 -1911 -571 3747 9762 15161 18184 11682 -1683 -13445 -7630 -9457 -14890 -14229 -8629 -8609 -9239
2687 -9239 -14274 -14629 -80 12625 6459 2226 -5912 3145 10899 8600 11545 21884 21165 8174
2673 8174 5857 16770 23679 22244 3445 -7801 -5446 1442 9082 9710 8068 1887 -692 9140
2659 9140 8007 -7 2418 12175 15061 17082 12750 12020 7817 8039 16006 8905 -4534 -8203 -5408
2644 -5408 -6591 -5367 -6730 -6058 -6778 306 8948 683 -7038 -2295 -3264 -5387 3589 6283 6657 -783
2628 -783 3221 11901 15703 10641 12421 14364 11871 2644 -237 -5671 -6768 -5867 -2558 -3598 -9982
2613 -9982 -14026 -15739 -15977 -20589 -8458 7128 15228 13324 -1325 5827 8912 5677 -1197 -4870
2599 -4870 -2977 -5750 -2317 -4954 -10730 -13883 -11175 -2420 3282 3713 4208 7943 7383 -1568 3181 2865
2583 2865 -2312 -3866 2551 9267 7879 9236 5562 4215 878 10202 9716 -722 -8837 -5202 5785
2568 5785 5513 -1527 -5946 -15307 -13438 -4608 -12156 -15267 -11392 -12933 -15648 -15920 -8354 -1452 676
2553 676 4701 11649 1126 -7254 -340 -4459 -3625 1210 -158 -5247 -3685 675 -5503 -4323 2892
2538 2892 7072 7914 2827 -998 -6020 5356 7269 7420 7079 9519 5544 9932 5333 -316 342 12103
2522 12103 6357 -6329 -6847 4188 12189 5759 1896 5654 8841 -1317 -13310 -15022 -14301 -3651
2508 -3651 3353 -4271 -8353 -1857 -8446 -14982 -14967 -17963 -14280 -5837 -3700 4132 -825 -840 3229 1850
2492 1850 -787 -657 -1521 5921 5497 2693 7258 2549 -1734 -2733 -13567 -16593 -18577 -16023 -10737 -18034
2476 -18034 -20236 -10443 -7285 -9886 -9711 602 -4701 -1609 -775 5597 6723 -209 -5066 -5527 -3436
2461 -3436 1479 9261 13513 9961 7615 -906 142 14169 19099 21854 22440 10929 3205 4501 10082
2446 10082 13578 11027 6846 1500 -1522 -2747 3939 -666 -7041 -3139 -5475 2893 4100 603 7125
2431 7125 9502 12223 13879 17920 8401 5803 1248 960 -4370 -1286 4422 2162 1965 -3413 -8389
2416 -8389 -6250 -3231 2511 6415 2646 -1409 -7039 -7381 -8350 -14518 -7068 -3940 170 2875 -2299
2401 -2299 -630 -4149 -8550 -6144 1112 -669 307 4308 4783 4481 3422 5124 4203 7065 12386 15165
2385 15165 14218 6372 -1324 -2637 -4903 -1424 9538 4968 1005 7437 1811 -5551 -6807 -3214 -2705
2370 -2705 -10912 -2368 9021 5397 -4006 -10118 -12794 -5265 779 1373 -1864 -6502 -2789 -7258 -10341
2355 -10341 -11428 -14342 -11548 -9896 -7027 -1121 -1986 1594 -1408 -4847 705 4922 2606 5206 7568
2340 7568 16199 20023 11797 3256 -8740 -11191 -13728 -16464 -14003 -6099 -2718 2019 5914 -5329
2326 -5329 5959 3997 -6247 -15048 -8130 -1992 4036 6656 458 1026 -5861 -8450 1102 2756 5037
2311 5037 12482 2147 673 10372 -3367 -11339 -1837 5394 4157 -7831 -11280 -10529 -5365 -5757 -6232
2296 -6232 -2846 -4018 -3110 9110 4662 3771 4020 8504 7211 4404 -5761 -17208 -19483 -8063 -3746
2281 -3746 9352 12579 8777 12578 4912 -2599 -500 1902 5745 -2040 -11805 -14366 -11464 -8737 -5208
2266 -5208 -12710 -9471 -5343 4006 735 -3553 -3338 -2359 694 -743 -3572 -7084 -734 2562 -5624
2251 -5624 -8203 -5494 -7197 -3236 222 2872 3009 -4887 2595 4253 -415 5798 12636 11483 9055
2236 9055 13230 11346 4705 -1539 -3511 -9063 -3244 -4801 -9417 -2045 8572 3650 4629 2276 2110
2221 2110 1094 -5608 -7762 -10156 -4320 -750 -6432 -7923 -12066 -14270 -8522 4970 3558 -1462 -6452
2206 -6452 -12533 -7785 -6496 4364 8439 8930 8901 10559 7842 994 -14541 -18652 -19385 -15352 -5877
2191 -5877 -3001 1868 5302 6086 -99 6887 13115 4368 2451 2380 -8996 -15498 -10707 -6758 -5950 -1421
2175 -1421 5544 9316 8482 7185 13435 11602 3857 2449 2605 22479 32728 21987 8880 6806
2161 6806 6908 2695 6154 14943 22432 15157 382 -6778 -11331 -1892 4528 1410 1445 3025 4325
2146 4325 4059 3757 -4377 -8822 -12159 -10499 -16076 -13531 -11844 -15543 -21693 -15087 -8874 5904 12283
2131 12283 6805 2445 2375 739 -3207 -883 6724 6568 11648 8050 7545 8662 7721 5531 -5982 -12556
2115 -12556 -3170 3076 -5742 -5843 -4653 -15037 -8956 -4066 -6133 -246 5592 1944 -10614 -10205 -7919
2100 -7919 -3676 3138 2115 -3672 -8580 -12037 -4975 -2368 -8506 -12142 -13851 -11750 -10565 -1437 2612
2085 2612 2214 11298 18250 20426 12892 6785 820 574 -3915 -6986 -3835 811 5404 11945 19103
2070 19103 9632 2727 7990 2244 -3362 -13967 -22302 -23078 -16281 -12501 -5731 -6263 -10305 -5737 -3625
2055 -3625 -5344 -3389 -1759 6220 5452 -6909 -11385 -12292 -9279 -4706 -2333 -4791 -8395 -18692 -15667
2040 -15667 -22527 -18934 -8570 -3138 3235 -5509 649 10255 5107 -1275 3023 5962 803 2189
2026 2189 12676 10521 9213 11130 11727 7644 3330 -502 4888 9719 5967 5031 5219 2331 -140
2011 -140 3494 9288 5668 5062 1114 2309 -4795 -517 -5885 -11727 -11880 -13666 -9113 -646 -3707 -9993
1995 -9993 -8696 -14985 -11691 -3140 1406 -4035 -13318 -12759 -4098 2268 1337 -39 -3555 -3203 673 8752
1979 8752 -1422 -12141 -2903 457 -8899 -13301 -20386 -18426 -9181 -1333 7974 13090 17277 15453
1965 15453 19310 19880 5035 1292 -2738 -9274 -6258 820 -2454 1210 4167 2461 1114 -6311 -1037
1950 -1037 7020 9606 10107 7694 1561 3462 298 -7507 -3172 9090 14602 14964 4494 -5404 -7631
1935 -7631 -12390 -2529 576 -1190 13805 17075 11858 972 1 4919 5912 1352 -2581 11700 24882
1920 24882 25781 12847 9241 9144 4917 -3205 -14744 -15723 -10540 -3119 -2995 -15164 -18305 -6549 -6395
1905 -6395 -6965 -6759 -17608 -14826 -10373 -8298 -1742 -889 622 -3546 -4752 834 3540 4206 3402 11614
1889 11614 13940 8361 452 -5991 4302 4426 1391 -8594 -8381 -8252 -10810 -7356 3864 -62 484
1874 484 6401 2736 -6004 -4395 -8447 -12220 -11537 -7074 -15002 -15997 -15681 -5761 -10244 -9902 -9403 -2495
1858 -2495 3203 4942 -1461 -7675 -5249 -2880 -3781 -10795 -10701 -4862 -1534 -948 -1886 8585 12456 7661
1842 7661 1913 4827 11573 7181 2915 9645 12251 13279 4833 163 -2696 -11543 -13728 -7540 -2984
1827 -2984 4180 8539 9468 18562 13391 6518 9565 7394 -2384 -1036 9229 2617 -3713 -1864 -2577
1812 -2577 -5859 -9817 -3856 -5243 -14666 -9707 -6966 -4719 -1105 -6077 -4898 -4175 -7498 -14375 -1860
1797 -1860 12086 16687 17545 11794 11281 13570 9701 -529 -5431 -6527 -9987 -5722 -1520 -6760 -5528
1782 -5528 5267 9111 11345 1230 -4527 -12159 -19777 -16270 -14175 -9637 -3765 1604 14941 20875
1768 20875 10239 -2743 -904 7123 4851 835 -691 -1761 -10948 -10246 1970 749 -6785 -11494
1754 -11494 -2307 1228 10490 16779 10234 1437 -576 -5094 -5945 -7723 -9489 -491 4939 -6533 -9537
1739 -9537 -4556 -4888 -11262 -2143 4318 4650 8279 14878 15655 11860 12310 13342 11370 2928 795 2862
1723 2862 10785 18003 7301 2152 -3954 -525 12918 10137 9812 13262 22859 10899 -1062 -6451
1709 -6451 -10165 -7570 5013 2030 3209 -278 -5182 -2236 1154 -3909 -4886 -1545 -10306 -8331 -14254
1694 -14254 -17444 -15400 -16512 -15279 92 6727 2016 1574 -7860 -4494 -85 -700 3547 3056 462
1679 462 4053 162 -6379 298 4958 7343 320 3690 8823 -1539 -5492 8021 7720 3978 -3924
1664 -3924 -1868 -9320 -13720 645 3817 413 541 -6988 -14797 -10672 229 1882 9580 12665 13775
1649 13775 18232 21243 16323 16034 24668 16118 2774 571 -2301 -5429 -7451 -2294 3175 4761 1345
1634 1345 -5993 -13706 -14405 -7117 -8337 1870 6019 4078 2109 -6816 -7223 -9315 -3269 -3576 -7369
1619 -7369 -5104 -6562 -4468 -5802 -4651 -3700 2225 -10345 -10326 -3462 72 -10317 -851 9774 10583
1604 10583 4391 4887 8445 8123 11581 9818 3671 3638 2552 11472 10629 1660 -3142 397 4000 8916
1588 8916 8370 3321 245 3148 3325 745 327 -1148 2635 2236 4620 16134 20073 4513 -6452
1573 -6452 -5765 -8717 -4200 6326 5881 113 656 -4415 -8376 -4524 -6295 -10511 -10358 -5746 -4398 -12165
1557 -12165 12 4612 -2373 -1475 1862 1264 7498 8331 8170 12532 12679 16963 20217 14741 3129
1542 3129 1147 6841 -2203 -7186 -7876 -8634 -3171 -7877 -2963 -8646 -11617 -3608 67 -3258 -7531
1527 -7531 -3136 999 -6333 -2826 -6647 -716 6279 4652 -638 1661 3979 5098 4463 312 -4902
1512 -4902 -3234 -5984 -8800 904 9791 16418 16720 9500 7018 6211 1958 817 -1202 4035 3783 -4416
1496 -4416 -8662 -9504 -7554 -6169 -6985 -8591 -11485 -5723 5795 16929 5647 2314 -2016 -8724 1693
1481 1693 6471 4708 9301 2585 -2441 -7314 -8062 -1428 -8136 -10806 -9828 -6734 -4346 -1346 -2456
1466 -2456 4471 2993 16901 16347 14819 12244 82 -5423 -1094 2622 -9573 -11069 -4483 -4777 1722
1451 1722 3842 -4535 -7549 -6568 -4321 8291 4627 -11620 -15420 -2443 13497 11018 4696 6542
1437 6542 6761 8488 6363 1485 1324 5652 3553 5960 1576 -6554 -7037 -5015 -11998 -8489 -6670 -8523
1421 -8523 -3688 5791 8140 10254 18054 15286 9959 14232 19311 17122 5265 -838 8089 7267 4817
1406 4817 -36 6698 11367 10650 15091 14160 4026 6537 12152 17663 18386 6860 -3214 3438 159
1391 159 -1807 -4688 -15278 -21360 -13832 -9195 -12446 -10776 -7302 -6242 -4056 4747 14177 14931 17963
1376 17963 21656 18008 15464 4449 -1412 -3242 633 4769 2993 -10269 -15207 -16896 -15277 -9704
1362 -9704 -5970 -5955 -1279 -11639 -12626 -6734 -64 -411 4558 4935 10331 5185 2046 4199 5886 1247
1346 1247 -5315 8745 9723 9330 11223 6923 3946 1683 9047 11295 6543 3468 6304 8734 4657
1331 4657 9565 6123 147 -2752 8004 15603 17655 14973 4011 2863 3460 11333 13780 17651 14547
1316 14547 12423 9670 13601 -1585 -3735 11751 13262 13283 7308 2764 -5018 1941 6278 3584 6575
1301 6575 1230 2112 7937 3847 4223 9423 9854 2253 -4911 775 9161 7716 -5784 -9885 7428
1286 7428 2655 2197 -5561 727 10587 7396 11518 22809 21113 18000 7930 -923 -8373 -12279 -10099
1271 -10099 -14841 -20344 -11246 -7312 285 1096 9651 20075 20779 22895 21908 25731 22173 14911 13045
1256 13045 10598 8143 12862 15313 11469 12528 8828 11299 11796 4221 -531 -9436 -12730 -9124 -5276
1241 -5276 -5837 -7543 -8953 540 1973 3201 10611 8957 13124 12304 8284 3215 -432 -3120 -6999
1226 -6999 -13037 -20652 -13945 -8409 -2789 -1824 3060 8551 8633 -4558 1475 10607 -2900 -12698 -710
1211 -710 1399 1370 9831 21931 17604 12445 2516 -1652 103 -1336 5407 1046 -5762 6819 8213
1196 8213 14783 6056 2144 -3608 -1682 -1118 6174 8424 8026 16325 10388 -423 -421 2303 3703 3922
1180 3922 -5113 -8667 -5335 -11060 -4938 2637 8180 9255 7203 6856 2966 -7271 -12965 -3706 -1417
1165 -1417 2521 399 -1563 -421 -1144 -13579 -7522 -2102 3772 2584 7743 9092 -4962 -8532 3464
1150 3464 5960 4590 -1995 -5909 -8220 -11811 -12184 -1328 -3507 -6658 -5389 4560 9505 11590 13151
1135 13151 15172 15353 8249 6412 2761 10343 11924 1853 6366 3574 8116 6915 15316 13329 11796
1120 11796 16819 22560 15271 6761 6034 10674 10285 8214 -2594 567 8082 13506 12606 2374 5375
1105 5375 12742 8193 15709 18202 7302 12673 15763 3583 3199 2251 -1686 -11 11914 11121 4684
1090 4684 -2910 -10650 -5844 -3956 4556 4558 499 -8518 -11551 -666 1573 -9180 -12462 -11011 -11611
1075 -11611 -13778 -3046 4017 -3280 -4260 2284 11845 15013 18014 10403 6057 5783 6018 3704 5885
1060 5885 6950 16466 15417 9270 6806 2957 -5906 -1659 4591 1505 -6609 -7409 -1888 -4266 -7190
1045 -7190 -10347 -12562 -6639 1201 13615 18206 12495 9984 7477 4884 7071 8152 1186 -8184 -5233
1030 -5233 5273 6766 3443 2929 8860 4722 1518 -6868 1504 -4198 -5687 -2154 -751 -4291 -5952
1015 -5952 7599 7818 150 -3619 -1423 10895 15446 10177 1127 -5074 1167 8812 11178 5509 9722
1000 9722 13521 13777 7193 549 5471 5684 12493 16345 2463 2986 5059 5856 -3959 -10795 -4294 7368
984 7368 14270 8328 -1436 -3507 3677 5618 7623 1597 2003 5893 4273 1670 -4439 -6827 -5511
969 -5511 -5121 -1774 5354 10901 6259 4487 -1158 -4922 -5233 110 5352 9527 10317 -1426 -7148 -4178
953 -4178 2045 7842 4713 2401 -155 -2892 -4322 4112 6102 6842 8745 12738 8894 4950 6613
938 6613 4582 312 1323 2209 10678 9949 3191 12267 13351 4354 -1746 2709 11371 3379 -702 -2279
922 -2279 7648 8697 17089 15029 9039 6830 3471 810 2431 2081 4792 13154 14628 23660 24375 20539
906 20539 20405 14109 15629 13194 6304 2074 843 3851 -6867 -219 12377 3550 -2919 -1703 -3934
891 -3934 536 7999 3752 8819 5315 2861 -2923 -3026 4129 3707 10853 26340 28586 18145 12624
876 12624 5779 -1278 -13045 -10093 5536 15128 6319 -607 10985 9696 8076 11029 1423 -1672
862 -1672 -3651 -573 -768 4458 361 -736 -1574 -5907 -9879 -9182 -15067 -21442 -24954 -16819 -7552 -12832
846 -12832 -23408 -17413 -4908 -6470 -11942 -4764 4401 4474 11614 16993 8730 -1593 -6802 -2441 -7677
831 -7677 -12733 -6258 -2536 -6641 -3383 1299 7284 3462 3684 4046 1566 -4534 -8167 -11274 -5955 -5331
815 -5331 -8877 -12885 -9614 -1656 3352 2051 6741 9703 -624 -6249 -4183 -5530 -1867 2482 -11669
800 -11669 -14579 -4737 4257 8832 10372 13593 14322 15695 3060 3646 -105 -3257 -4408 -5285 -625
785 -625 6125 7146 3781 -955 -7583 -5491 4760 3493 -3591 1310 2457 4020 609 4110 -290
770 -290 -7879 -5675 1114 4749 -1730 3288 17318 8938 -3207 -1161 -1156 -5351 -4672 -3597 830 -2177
754 -2177 -998 6866 816 -7791 -14317 -6684 9557 16804 14006 5183 11518 16838 6033 -654 2771
739 2771 10638 10613 -300 -3822 -3087 -5687 -3241 5122 5157 3679 6428 4191 -1947 -288 -1459 1803
723 1803 557 -4724 -12005 -17718 -23152 -13349 -5538 -7124 -4587 -1095 3216 -1445 -3302 -8397 -13467
708 -13467 -960 5883 1441 4161 8936 8594 6791 10974 3805 -963 -6809 -4471 2544 9431 1356
693 1356 -23 -2574 2248 -3951 -5991 6035 9321 4588 3599 12687 7096 1504 2338 5880 11464
678 11464 10409 3851 4829 1571 -1236 6081 863 -5175 3997 13169 7179 -11148 -15052 -11151 -3259
663 -3259 709 370 2762 3066 1127 -7809 -8940 -6563 2727 8963 9293 9909 -877 -9974 -7248 277
647 277 1585 11927 5937 -6032 -9719 -6827 -13218 -13705 -389 15954 24093 24621 20610 14052 960
632 960 9 3264 -3385 -1017 2569 -3914 -18056 -20233 -13441 -2630 4791 7380 -1494 -11949 -7552
617 -7552 -6037 1575 12372 16631 9786 3442 -10196 -10123 -1327 9235 11915 1349 -4880 -6923 -1829
602 -1829 753 1358 -399 15367 20846 25716 23641 16537 24960 22699 13355 16789 19688 6736 2450
587 2450 8083 1834 -5790 -2083 -2065 -2340 -2088 -6777 -13757 -14380 -2392 -4822 -5392 -11929 -14826 -15220 -16429
570 -16429 -17808 -18409 -18024 -8585 -9631 -9538 -9893 -6826 -3454 -11896 -10571 -704 1458 4203 1312 11732
554 11732 14005 5495 4334 7371 -730 -1020 -547 1176 -1560 -12004 -6355 2603 9144 9222 10438 4783
538 4783 2140 10041 5005 -4214 -7607 -5947 -3618 -1787 -3416 -8295 -18207 -19202 -18006 -8341 -1308
523 -1308 1229 -6394 -4737 -5900 -5078 -10871 -3738 -1545 -5998 -12539 -3271 808 -1082 -3623 -16981
508 -16981 -10424 7034 8161 -2623 837 -12763 -12586 -9193 -4947 -6268 -3350 -2369 -3954 -1361 -4863
493 -4863 -12436 -14795 -9419 -3100 -2618 508 4227 9134 8792 1200 3380 4973 3719 1218 -3645 -4538
477 -4538 4200 13395 21344 16898 20528 27446 27658 13955 6494 6727 4916 2914 317 509 15225
462 15225 22997 21105 18552 13352 5457 -2455 -6957 -11001 -12229 -3821 7723 8040 9724 16677 13986
447 13986 9187 7835 3081 5705 10264 3910 -3541 -6400 -3324 8434 15721 10088 11416 6218 6135
432 6135 6671 825 -2038 -488 3158 3015 -3311 -238 7500 5679 1077 -5832 -3427 -38 -317 -11460
416 -11460 -16154 -9081 -5692 1681 6177 -2736 -3572 -8315 -11024 -735 5000 6673 2157 9819 6223
401 6223 7317 1137 456 2692 5111 18151 20408 26502 17561 7375 -665 -613 -2489 7733 5790
386 5790 -1321 -960 2737 5816 498 -6023 -3356 -1580 6782 12525 8267 6707 10383 11815 5807
371 5807 7489 2993 -4219 -2808 6512 696 -14663 -8376 -2261 7262 9327 6172 -455 -4103 -2203
356 -2203 -3349 -6220 1457 7259 8239 5502 503 -7515 -7164 -3144 8350 18043 12622 10920 7050
341 7050 2447 2132 6285 2812 1703 2288 -3182 -3186 -6054 -10946 -4979 -10576 -16886 -14924 -15079 -7235 -2663
324 -2663 -3187 -4677 -6161 -657 2249 6875 3952 5189 10911 8654 -5291 -6833 -4215 -1191 4049
309 4049 -1156 227 -576 -10593 -17651 -12490 -3888 -7115 -2226 4451 7815 15082 25231 19972 11123
294 11123 -1614 -6509 -3144 1912 -4889 2517 8399 6739 -3905 -757 5089 6306 -4354 -2557
280 -2557 116 7041 15289 1510 -6100 -2676 6457 8644 6450 4658 6913 844 8078 10030 14823
265 14823 7853 31 -3151 413 5280 4195 2743 9339 3017 -10394 -16463 -16620 -10787 -3199 -3074
250 -3074 -4022 -8844 -3707 -5788 -11908 -4683 4430 7103 -1765 3320 5411 5647 10051 8639 9152 2520
234 2520 -53 3984 5102 -1816 -9599 -16130 -7805 2758 9845 5221 1799 1492 2157 2340 6381 5573
218 5573 1223 -3959 -5318 -1605 8298 6875 1124 2899 9321 18720 10392 9035 11643 7786 9213
203 9213 8365 4694 493 9850 7027 2793 4417 7547 5388 8327 5552 23 2298 4563 1307
188 1307 -2487 -2986 -2585 -6055 -9871 -6537 -3165 2511 4113 10312 17082 11634 9840 7760 7732 7369
172 7369 5586 4165 8034 8666 2132 3664 -1951 -10539 -16377 -7932 3888 9153 3587 -3854 -11595
157 -11595 -13283 -9723 -6293 -6133 -6913 -2520 1753 3484 -4445 -9567 -8055 -7347 -190 -4927 -9696 -7983
141 -7983 -7015 -5581 129 719 -3442 120 -1338 -7126 -11376 -12974 -10193 -7669 -5345 -758 -815 152
125 152 814 2623 4686 4610 2230 -3617 -5148 -6340 -3271 413 2570 2232 2888 7594 8507 10975 8234
108 8234 4183 -1166 -747 1895 3577 7543 4888 -2747 -1648 183 -2883 498 5154 2999 5258
93 5258 16976 21906 23775 15683 12202 9634 6164 6065 1145 1467 4880 4289 2554 469 1372 4128
77 4128 3994 5926 6102 1599 -2944 -2594 4787 6957 8168 9997 9705 8732 5466 4969 2205 -1084 -5755
60 -5755 -7023 -3378 1026 -4689 -6965 -2620 -917 3217 6388 6830 11483 10651 3979 2891 5467 10354
44 10354 12325 7850 4641 -742 -1305 4319 5483 6055 7594 4875 2777 -451 1971 4033 1116 3153
28 3153 5693 -962 -1447 1308 7990 9770 4926 -1088 -7947 -7523 -4744 2575 7873 9515 6930 -2112
12 -2112 -1742 2016 1041 2530 2530 1254 173 -5003 -4957 -5314 -6541 -2791
0 -2791
$$ Imaginary data points
##PAGE= N=2
##DATA TABLE= (X++(I..I)), XYDATA
32767 30667 29787 29553 24599 22571 28495 33887 39484 40901 38411 36836 30741 30373 32140 30757 30622
32752 30622 37575 43392 37119 36412 38518 37691 38946 38264 40329 44598 47110 52093 47949 48908 50404
32737 50404 54881 52930 51040 43945 41632 41491 41073 44717 40486 41068 45554 48021 46650 38119 36370
32722 36370 40066 48417 59128 56515 46490 48038 45813 44557 47490 54800 56156 59148 58566 53344
32708 53344 50131 51856 57298 57880 57718 61042 58445 59209 56726 61037 66775 66459 66655 65853 59505 54891
32692 54891 59217 60385 59839 61080 59570 62683 73707 79783 74684 65935 60010 56064 54742 65538
32678 65538 68352 69845 63689 66487 72382 68179 70068 74074 75103 73518 73690 79831 79274 74107 64287
32663 64287 69108 74119 76058 74964 77280 77991 79289 80573 80564 76483 80086 82234 77779 73870 74634 74850
32647 74850 68543 76030 81791 88003 82871 78706 80775 81563 85282 92418 94907 97143 86911 85114
32633 85114 84112 86358 88935 93980 93442 89891 82363 78717 83723 87180 86177 86766 92616 86781 85142
32618 85142 86880 91656 102618 108400 102158 96599 100295 101567 102447 103363 98291 94823 95283 99743 100763
32603 100763 92336 93240 99420 107018 101506 100409 104211 107145 113538 113734 109424 112293 110915 112459 113557
32588 113557 110187 107556 102265 97091 103150 114113 115483 117259 116244 114887 109876 103989 104999 104606
32574 104606 111036 117832 117200 120776 131748 128024 123428 124668 114555 111647 117255 117201 119370 125167
32560 125167 122634 115244 117299 123836 122393 117691 117559 120653 125353 123768 126393 122437 122928 130033 137345
32545 137345 135571 132586 127152 123650 131909 139261 139089 130367 116005 114926 124363 125139 128651 129117 127624
32530 127624 129519 132093 143505 141510 131436 122922 126297 127215 128962 132440 134302 146775 149382 145351
32516 145351 145650 149362 140274 140163 140700 139780 142846 154529 153986 142141 138842 141655 138068 136068 134996
32501 134996 133138 131357 135278 140790 138745 144393 138122 134822 142511 139890 133750 128438 133801 138819
32487 138819 131002 138560 148077 150014 144108 140143 129972 129920 135463 142251 149557 152940 140542 142971
32473 142971 147393 146116 149506 151524 150500 157487 152054 140345 142562 152716 153764 151511 150671 151327
32459 151327 143027 140043 141084 145972 146451 145565 152929 159844 156474 154660 154868 153555 150148 145211 147195
32444 147195 151814 148669 147397 152109 155720 162000 159926 156740 159081 167163 162886 158110 152811 148433
32430 148433 154290 159279 156021 150222 158228 167276 170091 158688 154770 163514 161746 153847 150748 157705
32416 157705 169343 171437 179605 181394 164974 153903 154045 152711 147263 147945 155553 157798 164301 168167
32402 168167 162946 163933 161183 160889 163554 152895 144712 150638 154105 155420 166546 169036 168843 163257
32388 163257 168445 180160 187108 185097 182883 182381 179593 170721 175016 179507 176155 169289 167782 174299
32374 174299 173131 178586 179107 177250 176978 178532 174383 167791 168324 167163 161468 161830 171664 177356 175533
32359 175533 171992 168937 163973 166928 163847 158696 158297 155519 160531 164043 170195 173634 178726 181989
32345 181989 177595 171865 168811 172567 173219 168487 165289 175536 181367 182414 181081 174996 171918 165953
32331 165953 166784 167646 176354 179185 183473 171993 171084 173190 179315 183116 184988 174919 165658 169230
32317 169230 172440 166781 161691 166493 168266 177908 181909 176112 171902 166758 173691 189810 192436 188290
32303 188290 182391 178124 168764 163479 170716 175690 187047 187430 185121 183643 187755 186279 178712 177580
32289 177580 179681 172718 174482 177589 179539 175574 171724 171692 171906 174555 178497 180623 183491 182821 178446
32274 178446 179266 167948 165940 170175 180632 191230 196347 194635 185309 188158 180799 179400 187808 190626
32260 190626 182278 180359 182347 190106 172602 170783 182383 179888 183138 183896 182500 187031 192584 189055
32246 189055 178215 175787 181797 183908 185742 181237 179498 170962 166277 168943 169719 178753 180497 182151
32232 182151 178408 171648 171989 169522 165798 168868 166716 164033 178331 187334 188307 194648 192079 201575
32218 201575 205764 197037 193226 193042 193257 186451 185370 182871 183820 184308 183800 183053 180179 184592 184335 180982
32202 180982 173818 166584 158705 161458 168851 172727 178026 177855 184413 184522 181241 185035 196479 193598
32188 193598 188025 185037 180153 175266 171272 175904 183633 187653 183851 182559 178771 176721 176083 178303
32174 178303 184031 183814 186348 185127 181926 177038 176304 182644 184150 186031 188097 189236 191217 187477 187520
32159 187520 186968 191057 189812 189551 184650 176169 177822 187410 184957 179198 175890 175629 180013 183144 184042
32144 184042 184274 187175 193912 190439 190917 188888 190916 188848 192275 197232 199632 191332 188384 184715 183376
32129 183376 176936 183289 188591 189734 187545 174629 174087 183227 182063 180359 173265 170700 170616 173560 169173
32114 169173 171342 180087 178812 177504 177105 180032 183523 180750 179220 180749 186179 187437 181103 179175
32100 179175 183409 180362 180815 179408 178698 190430 190601 183344 193398 202556 207497 204787 205932 203748
32086 203748 203649 198535 190061 183544 173749 178497 186633 196521 201296 199731 188135 186404 183503 183029 188861
32071 188861 185075 177622 175491 183827 192227 191846 192786 199771 195273 181804 178458 185692 182286 182458 192581
32056 192581 192120 180552 171145 180529 180167 171493 168799 171004 176897 180909 175130 180010 180579 189114 194003
32041 194003 187062 182466 187659 187969 181585 182130 187503 192736 190077 197562 199688 203720 198928 184489
32027 184489 187755 181733 178591 169446 173352 179436 180802 181964 182105 187096 189242 190623 186167 188614
32013 188614 182487 179096 187219 188484 184554 180645 182694 194485 198753 192824 196258 197376 198694 189327
31999 189327 178236 181798 181809 178098 173364 178391 182000 184071 187690 185349 198319 202933 205945 213065
31985 213065 207498 201837 201036 199501 186749 183306 184088 185490 189412 186223 185072 178646 174782 182076
31971 182076 189417 187528 191102 195373 189978 173227 172168 186575 192867 206179 205842 200998 198522 190699
31957 190699 177544 169539 176228 186681 190271 195169 190743 201205 204409 194540 190521 188330 188102 186471
31943 186471 177966 177185 185116 180642 177609 181898 178714 175031 176348 174115 175439 173728 175601 185231
31929 185231 194707 189400 189242 179889 176480 185125 197292 200435 192013 187843 187457 182905 184078 185483
31915 185483 188673 193369 194378 190469 190391 189252 188206 194777 203939 198340 192782 201054 203497 202924 193860
31900 193860 191447 194235 189899 195351 196256 197103 189406 182751 176064 183014 192244 193689 188574 196162 195568
31885 195568 190597 192579 195538 189719 192368 187412 189441 184992 190677 199334 194003 187191 191370 183159
31871 183159 194334 191264 185706 185542 185357 191858 199225 197320 190284 193039 190791 184757 182512 182162 184772
31856 184772 189610 197676 198759 197463 198664 197531 192761 184882 181999 167753 165220 170377 174274 175240
31842 175240 181045 177044 174801 178334 187573 189284 188431 193293 203226 212612 209820 188335 189433 190420
31828 190420 188317 190211 197822 196565 196983 188073 184863 180672 191891 203709 205951 200752 206714 213406
31814 213406 204826 200675 189716 192070 197122 194754 192624 192741 182466 178803 186381 196283 193628 191059
31800 191059 185672 192202 187829 187630 193846 188756 184734 178462 187693 197156 202207 203228 196527 189324
31786 189324 187763 195226 193968 185433 172042 166521 167953 170293 177526 184766 191135 197623 205765 193702
31772 193702 188357 191629 193268 188696 188202 190421 182258 181120 182069 186915 186067 180755 192200 197350 196421
31757 196421 187388 184869 190647 192277 194428 192600 196461 194823 188521 187103 188286 190688 188795 191920
31743 191920 201961 203533 196386 190806 192018 194448 191632 182603 182654 181435 180939 182582 186988 183350 184325
31728 184325 187168 182182 182379 195320 204167 195575 192814 189996 192377 189359 183105 180517 188670 200213
31714 200213 200520 186271 178765 179323 175257 185051 197117 191562 189575 199103 199904 202895 197386 186416
31700 186416 179745 178087 185357 189186 189282 194942 195869 196779 190531 185293 184644 186498 191913 202007 206692
31685 206692 209526 208447 203552 193790 187360 185241 187269 193657 193360 193751 191022 189722 189041 195645 192904
31670 192904 198229 214434 210869 199125 185468 178726 175947 169192 176812 190499 194622 194313 194382 192911
31656 192911 201627 198180 190871 192658 192857 186973 193920 181240 181115 187903 199081 201497 202108 201228 192714
31641 192714 184564 184598 186329 187958 185162 194800 206780 205927 197677 193835 185819 182427 186877 190504 194104
31626 194104 195236 198371 201166 190127 191862 194138 185549 190953 198468 197062 203059 213548 214015 212015
31612 212015 203872 196511 201575 212919 208729 199566 192645 199202 196677 191909 185296 167029 158037 166219
31598 166219 177307 181346 185422 195948 198259 196274 202509 193073 198280 203677 204464 201288 198333 203962
31584 203962 206214 198057 189495 191265 193584 196283 192049 191067 190716 195709 197940 196093 206858 208001
31570 208001 195359 194105 195359 190397 182254 185161 196735 199903 195901 203373 208959 212889 203307 192768
31556 192768 199788 200266 191838 194820 201212 201263 196793 194309 186784 187862 190717 200240 205671 210438 204453
31541 204453 199277 202422 192987 186926 186306 199297 200512 199479 200903 202291 193512 190620 192984 194223
31527 194223 203721 209268 200854 197531 207688 207397 194644 195391 202800 203689 200277 201952 198604 193550
31513 193550 205580 207100 201312 193821 188930 190700 198490 197737 189860 194990 197631 189642 180769 179798
31499 179798 175030 176177 177837 190497 197058 195961 196979 192022 187827 188023 184620 185816 195539 198640
31485 198640 186001 182697 183592 184840 192914 188440 188757 184775 190118 191832 193839 195032 193314 189094
31471 189094 197585 205459 207777 203916 187763 184170 192070 199208 195097 192377 184129 181323 182864 192816
31457 192816 198251 198132 193243 186661 177517 184848 200694 213777 203702 193322 186709 183989 191896
31444 191896 200103 203003 201069 191507 195116 194266 194094 189594 181597 178042 193030 196234 193605 193560 190230
31429 190230 193214 191668 190760 185503 189062 186582 186044 185499 193171 194053 196199 197253 199948 196669 198594
31414 198594 196876 178824 166432 162111 170281 189487 195414 181858 179239 184549 182445 183881 183225
31401 183225 183162 187039 186601 190596 186011 178166 179624 185561 176238 177374 191930 199254 199640 200332 195884
31386 195884 200818 206598 207112 205187 198990 195994 197612 199660 198916 186991 182311 179962 191469 200616
31372 200616 194031 191856 197548 207276 210941 209990 200433 193199 188025 193204 199184 196589 191664 192763
31358 192763 199630 203409 213090 218955 205586 190927 185563 176884 193915 197833 196238 198689 202873
31345 202873 205280 205874 204700 196963 198015 205394 210245 207651 211430 206083 202009 203204 204415 200589
31331 200589 200587 205523 201685 192937 190612 203583 206571 207236 214179 211694 205811 201716 205662 203460 208545
31316 208545 217632 217910 216587 216857 211086 205876 199407 202019 199716 197984 198261 195045 193526 189448 187672
31301 187672 194404 199953 200274 197999 192209 189327 188462 192979 200126 199064 191319 187395 188454 188336 196303
31286 196303 197459 204532 198237 188995 182770 185239 188307 193300 198162 193006 192620 195357 192571 190011
31272 190011 191540 195344 196196 187195 184401 190296 197497 198437 206599 204602 202835 206396 202438 189008
31258 189008 182972 183655 186598 194709 200284 194628 185244 190496 190948 196399 203538 199869 194701 190776 186766
31243 186766 192877 201098 205601 206833 203128 203569 195952 205052 207515 208813 206923 206237 199975 203970 209330
31228 209330 212446 210373 207686 202181 199212 199484 187304 183657 187729 192829 208345 214674 220966 217268
31214 217268 203703 202512 198458 200413 202103 193589 188796 193805 200518 197356 190916 196158 194511 192430
31200 192430 201066 199434 198473 191334 177385 179045 187207 188446 192449 193601 189348 187423 187791 198355
31186 198355 209807 206529 203742 201147 202139 202920 209987 215122 212381 201540 195427 194638 195414 205795
31172 205795 221526 222844 217764 212682 214579 211761 216095 214692 212419 199355 194491 196918 195559 202189
31158 202189 210748 210689 202716 206642 210463 211471 200518 195938 198887 198839 199079 201855 202409 195724 205068
31143 205068 210262 197054 188936 201046 215435 213065 205928 202718 203599 203520 196811 197481 198128 195202 197068
31128 197068 198839 199902 206362 195622 190985 189514 190383 209392 210745 202198 198117 203739 214291 209675
31114 209675 202622 197714 195086 195181 196956 199901 195709 189133 189295 197400 205931 212087 201970 193166 195018
31099 195018 201675 192530 191334 190150 191810 200346 195612 191862 188714 183960 197142 201878 198207 191547
31085 191547 188814 194510 189301 185441 185002 194281 190811 192691 199784 196788 195021 193274 188284 190339
31071 190339 188686 189028 190958 191024 185937 188623 200511 195667 197070 209203 205869 207813 202221 196824
31057 196824 200445 192224 185197 191276 194532 204605 196713 196389 203148 200512 199606 202752 198071 200927
31043 200927 201668 200320 195919 185613 183008 186822 188443 198077 201284 187424 186127 195909 198093 193949
31029 193949 182720 181300 179339 186562 196803 201178 199007 196094 193521 193031 195929 197076 188539 187980
31015 187980 190980 188526 184351 187024 204363 216443 209914 211290 209780 205071 203714 193757 188518 185774
31001 185774 195444 204528 205535 204648 206575 206121 207009 216499 212283 204906 204813 203943 199095 196386 183074
30986 183074 182167 192264 196049 207650 209939 202083 194287 197636 199280 200523 203249 199025 195935 200892
30972 200892 212562 214160 214524 198264 186714 192992 209206 209774 202912 199074 197243 200574 196656 199512
30958 199512 203235 201600 196819 202414 211567 201339 204711 218143 221014 217755 217288 225694 225196 225961
30944 225961 217682 206560 208023 210482 204010 206761 205651 206320 207458 211225 211189 209908 208237 215475 214148
30929 214148 212760 211470 205648 205203 204702 200142 193178 185504 187272 197091 193999 205030 210678 208365
30915 208365 202318 194262 192087 188895 192658 201147 204986 203155 206978 211147 211200 205593 202759 203368 203560
30900 203560 214196 212536 207521 203091 199206 191313 186131 178676 176191 183584 195750 197571 199114 196373
30886 196373 207513 200548 201406 196808 202491 210233 213285 207440 201282 205203 209124 204439 201459 198567
30872 198567 191336 181367 183280 191093 199867 196963 202538 211981 211402 213829 212508 205918 206243 208668 207530
30857 207530 203678 196582 193736 191318 194776 196850 199293 197438 195627 197606 198402 201766 207108 205712
30843 205712 201231 206059 201866 203828 206372 211827 218880 217356 214045 212163 199945 188213 187568 201663
30829 201663 210848 207537 201590 198364 199783 192940 184704 193746 200436 198754 195573 196887 197460 198930
30815 198930 195718 202397 210516 215854 219184 209930 199255 194405 185578 183566 184582 189867 198285 197316
30801 197316 197601 203857 212287 211341 207837 202042 198044 193467 187392 197141 199996 203906 204969 208378 218296
30786 218296 206259 197251 207847 219917 222499 216555 207440 203768 201804 200679 186655 180233 179149
30773 179149 183653 189482 199054 210331 212845 208156 209663 214975 205900 201286 204376 205035 193893 191176
30759 191176 185861 187483 192225 193173 196508 204666 205838 203295 202859 202264 201859 199411 212601 217961 206787
30744 206787 199221 197230 189957 191017 197843 196167 195671 197968 203085 201848 202142 198677 204338 208660 213181
30729 213181 208254 208078 206303 202372 199700 200436 208743 212295 202400 208412 211094 199817 198058 204413
30715 204413 207992 214362 218302 213663 219154 209013 203180 204307 204576 207900 210465 209127 207021 196352
30701 196352 191046 195416 202637 210284 209578 213050 217755 215415 213451 217347 215935 206432 200818 199427
30687 199427 202701 198470 197828 194985 199597 194551 189710 190378 193242 190294 185997 177889 186906 196597 200251
30672 200251 204143 207228 209665 216780 215294 208456 211033 209763 201157 198521 202287 202375 188528 190520
30658 190520 195189 190812 194708 200529 206885 206295 205112 207170 207948 215325 213599 203361 200568 199999 199277
30643 199277 205506 201453 194893 198340 208756 202879 200220 199834 201293 204476 207033 210677 209837 205525
30629 205525 204859 200566 213994 210411 208906 213079 219849 213838 214301 212993 201331 199903 201015 202306
30615 202306 204651 198692 196072 198881 208369 214032 210289 207268 211526 220685 217164 207442 210286 207974
30601 207974 202723 203397 208842 211840 208735 204506 207243 200475 192972 202297 199890 191604 202416 201467
30587 201467 198262 199758 205599 212679 221194 229324 219688 206829 195759 195969 198629 203137 202946 209655
30573 209655 218313 217974 207243 205300 195043 183140 184364 190519 192966 196811 198584 192156 196346 201574
30559 201574 202245 197897 207638 213793 219854 221954 219995 211630 207649 197527 188132 192355 208024 218637
30545 218637 209999 217955 220478 211498 201851 195099 204579 200956 190447 188668 193836 207059 204192 193586
30531 193586 196939 198879 192478 188640 201756 205981 199773 191648 194227 194509 194600 200505 205648 206621 198608
30516 198608 200039 204733 210978 203726 193184 193931 196322 192486 198981 201725 205062 213262 207321 206802
30502 206802 208545 207801 209145 213682 208151 216481 221325 227519 217621 213023 203803 207122 207358 206058 207583
30487 207583 213022 211659 207280 206443 204273 209114 210813 211939 203892 202716 210745 209912 210055 213333 222129
30472 222129 216530 215154 211778 210404 207729 200159 189158 192094 195036 195488 199620 211225 219081 213147
30458 213147 213040 211986 209964 213703 223723 222061 225631 225293 211910 200890 211492 214208 212636 216428
30444 216428 212581 209647 211188 215662 208775 215017 217769 212519 203557 204637 224658 226544 217898 217258
30430 217258 216373 214309 206206 206204 211844 209038 198710 201825 199675 196247 203190 206471 205131 206561 203596
30415 203596 199589 209108 213534 200811 202686 205096 209543 203098 191111 190720 195547 192298 194320 191761
30401 191761 184264 187769 198524 201896 206329 207048 189250 190012 194770 206541 208403 208789 204442 208544
30387 208544 208445 215909 214562 218558 216660 211047 206465 203592 195403 207589 212348 206497 201150 201700 214562
30372 214562 216576 212459 212311 219008 208818 205441 209046 213688 220054 217209 201988 194809 197156 195822
30358 195822 201159 209951 206114 201440 187527 182561 195667 200351 206258 215992 220190 225307 220502 212814
30344 212814 211818 207803 204324 199584 207064 214308 218201 215753 205423 207870 212776 204903 199290 204952
30330 204952 208722 197229 189014 202358 210623 204032 210418 210662 209430 209805 200553 201210 207560 207286 204109
30315 204109 205951 207531 200414 195206 199565 211734 221168 217803 208067 212423 221078 217760 213795 209202
30301 209202 206367 200130 202889 211407 207086 199060 196563 204597 202689 200208 199716 194355 190585 187733
30287 187733 188072 187691 188722 195608 208998 211864 215649 212590 216627 219873 210526 208358 210339 214042
30273 214042 210556 204996 202399 200444 198376 195489 210593 215485 219207 220726 217240 219615 218071 214974
30259 214974 203936 208902 213526 210193 220823 217233 209679 199378 197553 200535 204083 197127 197125 201961
30245 201961 196353 205259 207836 211053 211208 207769 213154 209355 202715 209856 202271 197735 204498 209445
30231 209445 211034 213756 205705 205010 203640 205339 205066 210336 214618 213124 205036 199471 207218 210013 204886
30216 204886 208592 209822 206124 202605 196196 198692 202782 206514 215003 211856 213132 209907 204242 193708
30202 193708 198247 204564 216249 218715 216564 200918 202108 208477 204288 202055 202273 201181 188852 186942
30188 186942 199004 201516 198802 191177 194733 201225 215110 221173 207665 210877 217645 219924 221792
30175 221792 224914 226121 222236 214738 210560 210660 210503 205154 206687 211325 209325 207433 203148 195963 197226
30160 197226 210562 209086 204292 202957 215482 223510 220359 211665 204530 192763 189609 194203 196869
30147 196869 205358 207932 204515 207646 209686 208335 209430 208833 203769 197101 203451 201183 212672 218074
30133 218074 213509 205308 206802 206984 195886 188854 187172 190036 189311 190588 201140 218248 227416 228645
30119 228645 220079 214756 212361 209458 204228 201234 211405 216785 222105 221888 212706 202629 203332 217151
30105 217151 221753 212853 201616 197511 203445 205992 203615 196462 213679 217168 204608 204036 207692 205950
$$ [...]
##END NTUPLES=NMR SPECTRUM
##END=
