##TITLE=Analysis number 315747
Compound Code cc 16201
Project Code adrs
Chemist Name af chempharm
##JCAMPDX= 6.0         $$ Bruker NMR JCAMP-DX V2.0
##DATA TYPE= NMR SPECTRUM
##DATA CLASS= NTUPLES
##ORIGIN= Bruker BioSpin GmbH
##OWNER= NMR
$$ XWIN-NMR		Version 3.5
$$ Wed Nov 30 12:03:52 2005 GMT Standard Time (UT+0h)  MAYBRIDGE\NMR@NMR_250MHZ
##.OBSERVE FREQUENCY= 250.131544655141
##.OBSERVE NUCLEUS= ^1H
##.ACQUISITION MODE= SIMULTANEOUS (DQD)
##.ACQUISITION SCHEME= undefined
##.AVERAGES= 16
##.DIGITISER RES= 18
##SPECTROMETER/DATA SYSTEM= dpx250
##.PULSE SEQUENCE= zg30
##.SOLVENT NAME= DMSO
##.SHIFT REFERENCE= (INTERNAL, DMSO, 0, 16.522)
##AUDIT TRAIL= $$ (NUMBER, WHEN, WHO, WHERE, WHAT)
$$ ##TITLE= Audit trail, XWIN-NMR		Version 3.5
$$ ##JCAMPDX= 5.01
$$ ##ORIGIN= Bruker BioSpin GmbH
$$ ##OWNER= NMR
$$ C:\u/data/dgb/nmr/ADRS/13230/pdata/1/auditp.txt
$$ ##AUDIT TRAIL=  $$ (NUMBER, WHEN, WHO, WHERE, WHAT)
(   1,<2005-11-30 12:03:06.00 +000>,<MAYBRIDGE\NMR>,<NMR_250MHZ>,
      <created by zg, POWCHK disabled, PULCHK disabled
       configuration hash MD5:
       62 19 C7 07 E1 42 D1 B7 37 6C 3D D0 77 39 F9 E6
       data hash MD5: 64K
       0A 1C F6 8E A0 84 D8 48 4D CF FC C1 EE 54 BD 6B>)
(   2,<2005-11-30 12:03:27.18 +000>,<MAYBRIDGE\NMR>,<NMR_250MHZ>,
      <Start of raw data processing
       ef LB = 0.3 FT_mod = 6 PKNL = 1 SI = 32K 
       data hash MD5: 32K
       29 B5 9C 13 AB 2E CC DA 21 53 A6 F3 D9 BC E3 F3>)
(   3,<2005-11-30 12:03:31.05 +000>,<MAYBRIDGE\NMR>,<NMR_250MHZ>,
      <apk 
       data hash MD5: 32K
       9B 58 70 77 D4 41 D0 66 5B D3 0C B4 EA 8F AF E1>)
(   4,<2005-11-30 12:03:32.80 +000>,<MAYBRIDGE\NMR>,<NMR_250MHZ>,
      <abs ABSG = 5 
       data hash MD5: 32K
       75 4F 92 EC A2 21 4A D3 25 3D 1A 4F C7 F2 2A DC>)
$$ ##END=
$$ 
$$ hash MD5
$$ CB 7A D2 9E D4 71 80 92 43 74 52 3D 46 E3 1A 81
##$RELAX= 
##$RELAX= 
##$RELAX= 
##$RELAX= 
##$RELAX= 
##$RELAX= 
##$RELAX= 
$$ Bruker specific parameters
$$ --------------------------
##$DU= <C:\u>
##$EXPNO= 13230
##$NAME= <ADRS>
##$PROCNO= 1
##$TYPE= <nmr>
##$USER= <dgb>
##$AMP= (0..31)
100 100 100 100 100 100 100 100 100 100 100 100 100 100 100 100 100 100 
100 100 100 100 100 100 100 100 100 100 100 100 100 100 
##$AQSEQ= 0
##$AQ_mod= 3
##$AUNM= <au_zg>
##$AUTOPOS= <19 >
##$BF1= 250.13
##$BF2= 250.13
##$BF3= 250.13
##$BF4= 250.13
##$BF5= 500.13
##$BF6= 500.13
##$BF7= 500.13
##$BF8= 500.13
##$BYTORDA= 1
##$CFDGTYP= 0
##$CFRGTYP= 5
##$CHEMSTR= <none>
##$CNST= (0..31)
1 1 145 1 1 1 1 1 1 1 1 1 1 1 1 1 1 1 1 1 1 1 1 1 1 1 1 1 1 1 1 1 
##$CPDPRG= <>
##$CPDPRG1= <>
##$CPDPRG2= <>
##$CPDPRG3= <>
##$CPDPRG4= <mlev>
##$CPDPRG5= <mlev>
##$CPDPRG6= <mlev>
##$CPDPRG7= <mlev>
##$CPDPRG8= <mlev>
##$CPDPRGB= <>
##$CPDPRGT= <>
##$D= (0..31)
0 1 0 0 0 0 0 0 0 0.06 0 0 0 0 0 0 0.0002 0 0 0 0 0 0 0 0 0 0 0 0 0 0 
0 
##$DATE= 1133352183
##$DBL= (0..7)
120 120 120 120 120 120 120 120 
##$DBP= (0..7)
150 150 150 150 150 150 150 150 
##$DBP07= 0
##$DBPNAM0= <>
##$DBPNAM1= <>
##$DBPNAM2= <>
$$ [...]
##$SUBNAM7= <"">
##$SUBNAM8= <"">
##$SUBNAM9= <"">
##$SW= 20.6930455092707
##$SWIBOX= (0..15)
0 0 3 0 0 0 0 0 0 0 0 0 0 0 0 0 
##$SW_h= 5175.983436853
##$TD= 65536
##$TD0= 1
##$TE= 294.16
##$TE2= 300
##$TE3= 300
##$TEG= 300
##$TL= (0..7)
0 120 120 120 120 120 120 120 
##$TP= (0..7)
150 150 150 150 150 150 150 150 
##$TP07= 0
##$TPNAME0= <>
##$TPNAME1= <>
##$TPNAME2= <>
##$TPNAME3= <>
##$TPNAME4= <>
##$TPNAME5= <>
##$TPNAME6= <>
##$TPNAME7= <>
##$TPOAL= (0..7)
0.5 0.5 0.5 0.5 0.5 0.5 0.5 0.5 
##$TPOFFS= (0..7)
0 0 0 0 0 0 0 0 
##$TUNHIN= 0
##$TUNHOUT= 0
##$TUNXOUT= 0
##$USERA1= <user>
##$USERA2= <user>
##$USERA3= <user>
##$USERA4= <user>
##$USERA5= <user>
##$V9= 5
##$VALIST= <valist>
##$VCLIST= <CCCCCCCCCCCCCCC>
##$VD= 0
##$VDLIST= <DDDDDDDDDDDDDDD>
##$VPLIST= <PPPPPPPPPPPPPPP>
##$VTLIST= <TTTTTTTTTTTTTTT>
##$WBST= 1024
##$WBSW= 4
##$XGAIN= (0..3)
0 0 0 0 
##$XL= 0
##$YL= 0
##$YMAX_a= 480068
##$YMIN_a= -416256
##$ZGOPTNS= <>
##$ZL1= 120
##$ZL2= 120
##$ZL3= 120
##$ZL4= 120
##$ABSF1= 16.522
##$ABSF2= -4.171173
##$ABSG= 5
##$ABSL= 3
##$ALPHA= 0
##$AQORDER= 0
##$ASSFAC= 0
##$ASSFACI= 0
##$ASSFACX= 0
##$ASSWID= 0
##$AUNMP= <proc_1d>
##$AZFE= 0.1
##$AZFW= 0.1
##$BCFW= 0
##$BC_mod= 0
##$BYTORDP= 0
##$COROFFS= 0
##$CY= 12.5
##$DATMOD= 1
##$DC= 0
##$DFILT= <>
##$DTYPP= 0
##$F1P= 14.0000005364418
##$F2P= -0.99999901652339
##$FCOR= 0.5
##$FTSIZE= 32768
##$FT_mod= 6
##$GAMMA= 0
##$GB= 0
##$INTBC= 1
##$INTSCL= 1
##$ISEN= 128
##$LB= 0.3
##$LEV0= 0
##$LPBIN= 0
##$MAXI= 10000
##$MC2= 0
##$MEAN= 0
##$ME_mod= 0
##$MI= 0
##$NCOEF= 0
##$NC_proc= -2
##$NLEV= 6
##$NOISF1= 0
##$NOISF2= 0
##$NSP= 0
##$NTH_PI= 0
##$NZP= 0
##$OFFSET= 16.522
##$PC= 1
##$PHC0= 74.13197
##$PHC1= 10.06995
##$PH_mod= 1
##$PKNL= yes
##$PPARMOD= 0
##$PSCAL= 4
##$PSIGN= 0
##$REVERSE= no
##$SF= 250.13
##$SI= 32768
##$SIGF1= 0
##$SIGF2= 0
##$SINO= 400
##$SIOLD= 32768
##$SREGLST= <1H.DMSO>
##$SSB= 0
##$STSI= 32768
##$STSR= 0
##$SW_p= 5175.98343685301
##$SYMM= 0
##$S_DEV= 0
##$TDeff= 65536
##$TDoff= 0
##$TI= <Analysis number 999999
Compound Code 99
Book Reference 9
Project Code 9>
##$TILT= no
##$TM1= 0
##$TM2= 0
##$TOPLEV= 0
##$USERP1= <user>
##$USERP2= <user>
##$USERP3= <user>
##$USERP4= <user>
##$USERP5= <user>
##$WDW= 1
##$XDIM= 32768
##$YMAX_p= 327231492
##$YMIN_p= -780088
$$ End of Bruker specific parameters
$$ ---------------------------------
##NTUPLES= NMR SPECTRUM
##VAR_NAME=  FREQUENCY,     SPECTRUM/REAL,   SPECTRUM/IMAG
##SYMBOL=    X,             R,               I
##VAR_TYPE=  INDEPENDENT,   DEPENDENT,       DEPENDENT
##VAR_FORM=  AFFN,          ASDF,            ASDF
##VAR_DIM=   32768,         32768,           32768
##UNITS=     HZ,            ARBITRARY UNITS, ARBITRARY UNITS
##FACTOR=    0.157963299565203, 1,           1
##FIRST=     4132.6476996994, 0,             0
##LAST=      -1043.33573715361, 0,           0
##MIN=       -1043.33573715361, -780088,     0
##MAX=       4132.6476996994, 327231492,     0
$$ Real data points
##PAGE= N=1
##DATA TABLE= (X++(R..R)), XYDATA
$$ [...]
21145 -5364 -28925 -39766 -38727 -34536 -31533 -19094 -6630 7687 -7397 -3262 10747 21059 -2121
21132 -2121 -11672 5077 9829 4871 -16470 -43537 -30920 -39006 -31931 -39220 -26397 -15531 979
21119 979 3560 4116 -17704 -23202 -14940 -20076 -20996 20426 24536 24343 17970 4441 14005 25240 20122
21104 20122 -7812 -23252 -42928 -34545 -21556 -39331 -62136 -54114 -61157 -29242 -5360 -24004
21092 -24004 -24105 -20559 -3997 7374 5773 861 -23827 -21491 6022 10818 -12377 -22320 -28447
21079 -28447 -45712 -36400 -30433 -17967 -9150 -823 7504 4832 -9147 -12654 -11614 -15427 -2264
21066 -2264 8751 -5323 -18096 -32988 -25914 6469 -113 -27153 -28878 -664 10641 159
21054 159 -9315 -10605 -4768 -9802 -16351 -1743 -3625 -2104 1980 -9849 -10110 10049 20202 21245
21040 21245 1602 -5253 4735 -3174 3565 -5346 -11490 -6979 16503 -873 -13606 -12728 -20968 -8260
21026 -8260 20703 33813 28729 16647 4 -23346 -26197 -21419 71 -14900 -23669 -25981 -29865
21013 -29865 -16752 -11779 262 7479 5127 4092 -4861 -677 7709 15728 33516 27612 6070
21000 6070 -2240 -8289 -10731 -31141 -31134 -22114 -19237 -30832 -26702 -14430 -17553 -40065 -22385 -16089
20986 -16089 -33792 -36785 -35356 -24369 -6764 -8834 -6670 -7034 -13348 925 5320 -24707 -35441
20973 -35441 -44283 -31975 -11320 -21174 -33819 -20108 -19820 -6104 -700 -2861 -24985 -34096 -42172
20960 -42172 -44814 -45240 -41832 -42908 -37545 -24576 -22959 -34946 -16980 -13728 -20959 -29628 -45064 -46392
20946 -46392 -16839 15384 11549 -7806 -24147 -37973 -43806 -23097 -19784 -25886 -28222 -42930 -38792
20933 -38792 -26752 -17173 -11898 -4202 -19691 -13990 -30809 -28134 -5691 12575 15007 8145 661
20920 661 8461 14841 21086 20483 31508 43403 43621 24879 19777 20055 10880 12725 12991 -2371 -31255
20905 -31255 -11759 -2134 -7145 -18592 -1027 26054 42051 65320 63668 67659 50076 14325
20893 14325 3897 11644 17789 22467 20057 15850 26927 34085 27499 34362 23999 4371 -8339
20880 -8339 -9319 -9562 -3899 -680 5881 12078 -1944 -12069 -6778 -5150 -5286 -9974 9968 17696 24625
20865 24625 32050 26469 12893 -4195 -937 -3600 -19397 -20996 -26168 -20146 10292 18945 -6083
20852 -6083 -29787 -39342 -27016 -41602 -29278 -15639 -12270 -16843 -31886 -32771 -12466 5499 10729
20839 10729 4924 21859 27200 17653 -370 -2300 -21528 -28877 -20014 -3761 -8485 -8165 426 -13993
20825 -13993 -5026 16938 24268 25472 25314 12252 -14540 -5506 -8792 -23824 -24885 -22161 -16212 -17673
20811 -17673 -33751 -35328 -44033 -15778 -8809 -8980 -23950 -30163 -29544 -41641 -48276 -22132 4736
20798 4736 6878 4468 9618 3938 -5803 -13160 -13183 -42112 -56023 -48006 -11357 -7088 -23133 -20267
20784 -20267 -17550 -44946 -49202 -47407 -47522 -49653 -10701 5609 18046 4663 -1643 2262 11543
20771 11543 28831 37831 17520 13033 7596 22130 23592 23135 6372 -40 -11782 -5857 -4163
20758 -4163 -26495 -32278 -44492 -41585 -21702 -22032 -17332 -25176 -12113 -5575 10279 23500 1831
20745 1831 -17154 -11295 1708 2919 -9149 -6837 -5237 -34580 -23386 -16177 -5341 -13695 -4007
20732 -4007 -18693 -30260 -6952 257 14832 8163 5675 -1772 -30440 -35915 -27034 -29011 -19526
20719 -19526 -4406 3401 518 -15278 -27310 -9499 14342 727 -16227 -18129 -11681 -26824
20707 -26824 -42758 -14750 -22390 -31785 -18292 656 8109 6413 4126 -8130 -25115 -29178 -17377
20694 -17377 9889 12939 -18156 -2667 16059 23115 17910 -4209 -4853 -34754 -41122 -18466 -15050
20681 -15050 -22081 -20160 -17641 1447 18873 27948 24833 4366 -6073 -7322 -4096 -3763 -8548 9701
20667 9701 2289 54 -5081 5801 -3215 -15088 -2921 21974 33396 26602 16452 26004 21668
20654 21668 9136 6038 751 -10782 -26675 -35155 -36482 -35418 -27259 -10102 734 17177 25021
20641 25021 -462 5565 -9486 -31054 -29013 -34362 -44418 -24543 -2774 -5528 -7379 -7978 -17894
20628 -17894 -18347 -12705 -2394 7485 12870 12718 14039 15721 10608 678 -21215 -14205 -22541 -25194
20614 -25194 -14585 -10138 -11303 -15362 -16472 -8321 -11017 -12690 -16360 -17237 -28596 -20169 -639 16171
20600 16171 -1622 4364 20049 -6359 -6778 119 -4021 -18327 -4877 7759 -2949 7687 12718
20587 12718 -825 -9998 -21866 -34892 -36153 -46132 -27013 -24978 -32867 -43669 -30745 -26750 -19699
20574 -19699 6986 19196 -3081 -38037 -45742 -11019 -7750 -14780 -26177 -34890 -28145 -24715 -33397
20561 -33397 -28207 16492 35507 18446 -10018 -8544 3820 -16500 -25229 -42819 -28971 -28093 -3109
20548 -3109 24514 17399 11501 18192 14976 151 -2487 1116 21382 25170 21800 22706 15730 11572
20534 11572 -5717 -24611 -27080 -11024 12540 25959 22637 6673 267 -8646 -28635 -26113 -7917
20521 -7917 14058 12425 9752 3189 7355 -8045 -2765 -4551 -1135 7538 -4103 -10578 -15314 -26953
20507 -26953 -12923 -6786 -5221 -3164 -25297 -32000 -40070 -18102 -34566 -35274 -12473 -180 1699
20494 1699 -14290 -7899 -13065 -17446 -21100 -15526 -33492 -41503 -18956 -1272 -5368 -10051 6523
20481 6523 2719 -10545 -18165 -14524 -8915 -8585 5839 9339 8256 -6212 -5876 -21168 -886 20440
20467 20440 20397 14681 8574 -423 -20023 -7013 -10831 -24585 -24786 -23795 -8500 6049 8642 4959
20453 4959 -19459 -29622 -27770 -18732 -8602 -13131 679 34527 16705 677 8514 5898 -6619
20440 -6619 12200 -354 -42945 -49574 -16113 -19804 -36898 -32162 -10306 -5118 -9562 -1493 6263
20427 6263 -9851 -22695 -21527 -1296 -1911 -14574 1265 -9592 -18759 -11130 -24901 -15613 -8996
20414 -8996 5812 28907 17523 -6438 -27618 -27266 -28461 -33348 -43587 -35359 -3670 -7981 -13190
20401 -13190 -4890 3398 12402 3298 13702 7669 -6773 -14406 -12844 -11290 341 -2412 -22376
20388 -22376 -21298 -5537 12111 10979 6586 -5359 -7926 3006 8486 -3006 -5281 -5061 -13079
20375 -13079 -4132 744 -2358 -25180 -26578 -23975 -32759 -33432 -8257 854 -19491 -24619 -37988 -42411
20361 -42411 -15654 6481 -2161 -14339 -16365 -20952 -28900 -22816 -7766 -26944 -40829 -45546 -36136
20348 -36136 -35237 -26013 -10428 4446 18308 11591 -12755 -11262 -98 4973 -11354 6243 7626
20335 7626 18654 20196 -16029 -31333 -27498 -13694 20733 25767 13613 7824 -8526 -761 748
20322 748 -733 17093 -12651 -28744 -31214 -37228 -24626 -5814 -3047 15744 -5336 -14184 -14709
20309 -14709 -3711 -12354 -15639 -12434 -30702 -3585 10758 11724 13147 16380 17305 15018 6194 -548
20295 -548 -7029 -14349 -11877 -5706 13260 9774 -9145 -19548 -27933 -38051 -39242 -50245 -47380 -38849
20281 -38849 -11127 -15931 -8215 17716 21419 14140 26173 24966 13821 14894 37263 40176 10003
20268 10003 -11608 -11321 -2022 14233 8980 -5089 -28301 -24819 -20482 -15890 -24689 -7922 -6830
20255 -6830 -762 14353 -2065 -22653 -31107 -30235 -44154 -32270 -173 7978 -14531 -15864 -16450
20242 -16450 -3582 6155 13370 3691 1274 14309 16730 8968 5666 11794 5012 -15609 -21525 -13011
20228 -13011 -3641 1902 7824 25802 3060 -13588 -20773 -24557 -27025 -31620 -26936 -32842 -19461
20215 -19461 -6597 -11809 -14655 -6562 10660 21235 5190 3619 -9739 -26105 -19925 -25365 -28106
20202 -28106 -39675 -29189 -13892 -653 -16451 -38383 -34526 -6968 -7684 -37863 -18581 -7552
20190 -7552 -11392 -3940 -7035 -6324 -2976 2500 6492 15672 -13680 -19234 -8677 -11433 3147 -13000
20176 -13000 -23882 -6980 2983 8591 18792 4965 7584 6640 1408 3300 14499 8214 12188
20163 12188 23530 10630 1573 -16790 -21335 -153 2124 6786 7495 14033 5691 -21555 -33860
20150 -33860 -28937 -31145 -33345 -15495 -4594 17009 35601 33491 16004 3322 19765 20380 13452
20137 13452 15122 10267 19300 26891 10615 6368 18793 34456 31842 20163 18062 11169 310
20124 310 -11060 -17680 -11606 -15931 -3445 16358 21285 10178 22697 57604 82837 86563 73963
20111 73963 52807 47970 29022 9042 -8074 -6462 -19833 -11592 5207 7020 23621 32959 16279
20098 16279 -8952 -21515 -15654 1498 5593 7924 15650 44381 43177 33551 41701 20939 7065
20085 7065 29282 28967 20110 17318 9543 25165 39064 43819 54966 44547 23211 3537 -13756
20072 -13756 -8581 -15753 -13870 69 19791 14934 16285 9584 -927 -12146 -8106 -3820 -19687
20059 -19687 -27831 -22705 -5741 5280 -25908 -29913 -8468 -1788 -4011 3124 -2709 -24459 -13073
20046 -13073 -1131 -3264 -14158 -35819 -46727 -40011 -4546 14434 -304 -15670 -29869 -49148
20034 -49148 -38792 -27982 -9286 -552 -11124 -12817 -27293 -30806 -32584 -28268 -18985 -8799 -23297
20021 -23297 -31702 -18555 -19386 -34814 -35779 -21695 563 -11754 -13267 -16638 553 13034 3693
20008 3693 -7737 -21659 -19955 -4503 16130 13468 12252 1240 -3292 -7929 -19018 -13576 -12318
19995 -12318 -19418 -17552 -7816 -12112 -7724 -6342 -10076 -29025 -34709 -24159 -24355 -40612 -55313 -36292
19981 -36292 -17292 -12825 -23492 -24580 -11194 -16031 -14373 -19194 -14212 -9067 -3230 -4668 -7697 10856
19967 10856 13182 13302 13159 19566 21607 20403 19449 -6004 -16748 -6510 -18128 -447 19066 11153
19953 11153 -26495 -59182 -46227 -30045 -13197 3346 6062 -3811 -13449 600 -1327 -3168 -2459
19940 -2459 2246 -986 -1279 -13553 -21689 -28145 -21542 -6321 -7901 -7954 11192 16741 5065 1814
19926 1814 19339 33334 45637 46344 37271 13853 21583 16449 12258 22242 9642 23016 27879
19913 27879 20695 -5859 -15462 -10830 -14125 -7958 -6806 -11173 -3307 -8877 -9232 1884 -9479 -25577
19899 -25577 -5869 12929 -184 -1685 14394 7176 1122 10270 29293 34100 36462 3254 -17912
19886 -17912 -26425 -28086 -18765 -20240 -10548 -15583 -19309 -3455 -8626 3199 19570 15661 2248
19873 2248 2607 7001 6571 36210 48909 18428 18942 45736 79130 85647 119575 123742 120734 93244
19859 93244 99987 107288 113135 132642 140785 133051 120075 114863 112670 111521 107747 109805 125292 107185
19845 107185 114884 128949 135582 131227 126761 115389 117537 118279 118922 122488 126516 113607 84892 57165
19831 57165 30090 28616 14764 12365 39174 45369 30610 34723 63220 57836 35063 25185 41866
19818 41866 66207 72111 77517 76767 74172 85405 82106 85182 89427 87587 74496 72340 101665 118224
19804 118224 117902 116066 115040 111456 125596 160169 171842 176637 176230 173192 176773 174523 178642 160913
19790 160913 137419 147183 129392 109333 80350 68585 64869 38101 22262 35963 36267 42345
19778 42345 32986 3602 -27775 -25683 -12351 -5306 -1643 7906 21774 994 2482 5299 7114
19765 7114 8632 -9982 -27336 -39303 -61442 -53877 -36292 -30659 4991 17763 17092 6777 2575
19752 2575 -12396 -12511 -1730 -3006 -5190 -18958 -15806 -12633 -14332 -8841 -3120 1368 7185 12978
19738 12978 7139 -1924 14770 25122 26223 9785 2447 12242 10386 123 -1881 15998 29474
19725 29474 5587 -5712 -12559 -19177 -23869 -24923 -20580 -11948 -22443 -6155 5464 14170 33451
19712 33451 26810 17980 9558 2741 5935 10692 26992 15677 20266 22366 18826 -5931 -2292 2084
19698 2084 -5164 -9555 -12653 -11756 -4300 9428 -695 -3466 19792 32212 29660 9471 2272 -16208
19684 -16208 -8649 4124 14971 6804 -7349 7270 11317 17716 40908 35004 35201 27124 21782
19671 21782 27244 30971 7348 12613 4905 13562 6822 -397 10906 22453 36921 30019 8223
19658 8223 7484 29914 33562 14650 6910 7953 2282 14260 35646 41049 28458 13274 -4076
19645 -4076 -21107 -23215 -24204 -30092 -16745 17034 36343 20377 11027 -5933 -23848 -22203 -4923
19632 -4923 11665 12360 9919 5116 -2075 -9846 7317 5005 -2050 -14806 6384 27091 27987 24130
19618 24130 13665 956 17772 32791 23930 12619 3573 1153 4241 5228 15011 21561 30007
19605 30007 -870 -35705 -24331 -38546 -39663 -33266 -30422 -22520 -11655 4397 -9541 -7410 15873
19592 15873 35227 25720 23273 23351 21236 -6 -7095 12491 38124 63826 70095 40938 37731
19579 37731 34656 34693 32429 18542 30686 30503 29883 32200 11405 -10127 -17756 -13193 -8165 -6026
19565 -6026 4916 293 -7807 4134 6735 18532 33442 38109 22772 7911 -5557 864 24112
19552 24112 24601 16345 10271 323 8901 31581 64613 58574 47320 21367 -29249 -29680 -17688
19539 -17688 26811 31620 44684 42472 25599 3396 -23525 -39167 -23209 -7691 -4675 -12010
19527 -12010 -18760 -13262 -23923 -23212 -21421 -24198 -14652 -9044 -21255 -25392 -21006 -22066 -7776 -9024
19513 -9024 -21510 7886 25895 8963 -24180 -34929 -3481 -2136 -30976 -31745 -34268 -59078 -77364
19500 -77364 -67703 -41361 -58050 -63785 -62904 -51655 -26467 -7961 -11490 -4776 -4526 -10636 -24641
19487 -24641 -43288 -36034 -23502 -5301 -13300 -8963 -1145 -15287 -15616 -18219 -43449 -58138 -64250
19474 -64250 -80937 -77074 -59380 -61586 -77711 -72152 -90565 -96846 -92882 -91643 -91842 -62247 -5511
19461 -5511 43572 46325 31883 11291 569 -40488 -43459 -21452 36837 84928 98079 83582
19449 83582 82315 94094 96925 92260 65891 52460 78762 63566 58071 73617 90740 96694 89629
19436 89629 72354 51072 18328 251 6192 19367 27687 31184 24689 14867 33066 56186 55641
19423 55641 58926 35968 15143 40342 49189 56479 66901 53078 57320 63422 72671 92385 97820
19410 97820 96129 116674 124193 160225 174234 161553 159126 164609 171134 196028 236054 251555 257553
19397 257553 251824 221548 216189 235088 253021 233415 209110 212275 214856 228219 233678 242910 238437
19384 238437 235753 261621 269984 259662 264610 274525 299533 305820 327539 346227 345963 343598 349807
19371 349807 352039 370575 415558 455524 469658 492173 528480 580201 615141 650411 705521 776670
19359 776670 858110 923543 1023695 1132941 1250505 1371140 1503883 1675852 1857986 2108250
19349 2108250 2487505 3046663 3920577 5270287 7224996 9463510 10944613 11256099 11628702
19340 11628702 13278138 16423807 20502823 25497804 30825107 32295076 28363606 23507971
19332 23507971 21079533 21710956 25635808 33292207 43476761 50641349 51003451 46591631
19324 46591631 38507239 28764269 20931358 15976996 13047448 11378105 10555105 10422589
19316 10422589 10967489 12078889 13020063 12645571 10768915 8552748 6820145 5653642
19308 5653642 4911752 4433911 4121816 3922395 3789155 3698901 3695985 3747439 3880316 4162868
19298 4162868 4588327 5213281 6235178 7856956 10305861 13605585 17017477 19642925
19290 19642925 21927140 23933492 24602437 24014085 22764458 21688550 22343111 26073612
19282 26073612 33807600 43830369 47998623 43934554 40968110 43058307 46075520 47007047
19274 47007047 47991619 48000909 42076831 31586391 22349097 16250808 12438919 9999851
19266 9999851 8332690 7127738 6270379 5624781 5138743 4835635 4773044 4997967 5489230
19257 5489230 5932472 5744842 4839314 3846820 3091685 2551409 2192622 1934426 1726298
19248 1726298 1531387 1375059 1238753 1132436 1053531 983813 882252 798631 726731 674420
19238 674420 644727 605857 573492 532496 486863 451947 428280 417166 399608 389577 371807
19227 371807 361510 326816 308925 322276 314328 290408 256874 242095 244789 228235 208300 197294
19215 197294 190253 170845 145033 121726 85237 77618 86484 95341 113643 141300 140560 131511 142212
19202 142212 164751 163684 203428 247089 277067 274622 280650 274498 278000 265261 236341 222123
19190 222123 230917 229331 242702 248345 230730 214938 202553 195566 192963 173723 177834 175896 154804
19177 154804 139088 129873 116254 108175 110799 110516 105788 106957 112610 87488 79198 76269 82785 94877
19163 94877 95587 92276 85761 102912 113518 121006 147968 156736 140238 157980 199261 243508 261329
19150 261329 228335 204532 252949 296019 331965 369009 400041 418316 408889 385981 376069 349531
19138 349531 319725 302507 305756 329282 336698 309077 255630 209989 187679 176722 164472 120956
19126 120956 120535 148769 170697 145809 138517 142203 141844 129753 133416 147137 141952 150479 135022
19113 135022 120063 120538 139126 155896 183208 177486 152982 132737 134309 155409 136518 171945
19101 171945 204541 197683 195985 188345 182263 191626 193582 186001 183811 181161 185586 184234 175915 165133
19087 165133 160953 171840 179137 185196 202753 202886 167985 148114 125756 115149 118300 123670 107849
19074 107849 94631 92579 83985 69304 61295 65396 65607 40976 36548 39395 38816 48484 54939 41723
19060 41723 56654 56668 42259 27761 25674 53968 74092 68415 44132 45778 34938 49084 69606
19047 69606 83893 96566 110047 103294 80751 66642 44276 44738 50474 37557 37389 27775 -397
19034 -397 16795 27843 48194 57793 70682 69127 46428 38737 39135 60900 81503 88887 88828 90894
19020 90894 109436 108007 109198 123388 118351 116814 128432 169153 182289 168882 163699 151330 150327
19007 150327 154963 139179 108869 118827 133417 134693 116181 107067 109380 116058 144746 132360 103240
18994 103240 81342 93577 104618 96296 81920 50404 59837 79530 88872 77819 59991 63544
18982 63544 82711 83340 84344 91390 85572 82903 75371 60256 77091 111257 125128 156604 167160
18969 167160 155983 169303 194121 223447 244527 269988 271886 250839 238482 233021 225383 218860
18957 218860 211108 204624 198647 194538 192788 208881 207241 173045 182158 191327 165813 164607 144945
18944 144945 127910 130477 122582 102257 102809 93914 84728 79331 106341 105400 113268 113171 82412 71209
18930 71209 79610 103679 125303 128494 109171 98528 93817 89392 124358 143609 152288 173913 169997
18917 169997 158933 128358 121774 110431 127449 141826 127342 113648 123652 129711 130995 98835
18905 98835 75582 90666 110427 94969 109892 125415 100502 94276 94350 89630 93401 91388 86744
18892 86744 92379 81978 90102 78910 60647 66078 77600 90088 80989 71859 61997 54250 46218
18879 46218 48185 61342 38702 18940 30964 36471 38063 26075 13411 18938 9612 10829 32872
18866 32872 35727 13818 15232 38146 35416 41141 62715 66616 69984 49338 34514 34539 37064 54523
18852 54523 63751 67549 47975 47585 59913 78891 72541 47207 45042 49271 66491 97147 83899
18839 83899 51074 42675 43570 53924 60273 49068 32611 30326 21078 16075 21416 15005 -1389
18826 -1389 7949 -1328 5832 29963 56332 58003 48210 39330 48094 71801 105026 118278 105007
18813 105007 87086 78090 102624 105728 138986 159962 179169 177731 163639 146316 153856 148935
18801 148935 133211 116955 118298 126423 135797 139038 141453 145585 134688 130386 119496 120203 109163
18788 109163 86799 80731 87231 108318 100341 79813 80901 91629 98564 93783 98198 104826 98769
18775 98769 86888 85750 81144 82968 106978 137388 157630 162031 173336 188265 222447 276059
18763 276059 321328 336230 341670 351149 361805 360782 356684 327164 304546 321805 340727 348692
18751 348692 351149 343922 340116 336134 330702 341393 350426 362443 358998 363740 364468 328900 296512
18738 296512 304899 307150 307102 299940 301892 294595 279294 278235 277416 266054 266502 275966 263841 277578
18724 277578 298856 326485 357831 379544 394678 422860 464584 509462 537585 569176 587982
18713 587982 630738 683112 724216 773795 852878 921608 985384 1045403 1135942 1260774 1438564
18702 1438564 1715471 2107061 2725881 3646602 4739155 5495668 5526836 5338572 5532285
18693 5532285 6413804 8186938 10921056 13812902 15017225 14417113 14175739 15458159 17688331
18684 17688331 20431705 23459130 24132164 20651259 15428481 11280793 8724270 7295088
18676 7295088 6619076 6484881 6893123 7879016 9240241 10050962 9314453 7587071 6002877
18667 6002877 4898018 4202171 3734876 3420736 3198338 3076670 3052315 3089089 3199936 3481276
18657 3481276 3994196 4798824 5943467 7046368 7444044 7099513 6752515 6891801 7675116
18648 7675116 9135968 11185508 13379718 15458632 18166490 22605244 28580594 33984082
18640 33984082 38030057 42669458 47793177 50613359 49913944 45532513 38484871 31293908
18632 31293908 26045795 22922846 21841795 22840208 25316549 27265048 25968612 21312630
18624 21312630 16323767 12875925 10903722 9933820 9344422 8361838 7007627 5845515
18616 5845515 5028213 4459432 4035849 3737046 3516397 3336843 3244001 3233429 3224513 3216096
18606 3216096 3253230 3344126 3545007 3893826 4508315 5490620 6993811 9233265 12161191
18597 12161191 14755629 15360376 14112349 12803856 12694289 14199195 17390250 21233437
18589 21233437 24469247 28297603 33111703 35345847 33546206 31348450 29483182 24954967
18581 24954967 18578804 13371618 10036556 7946846 6581812 5660164 5068607 4795095
18573 4795095 4844973 5213166 5652263 5620300 4887337 3916270 3126795 2596494 2225771 1981933
18563 1981933 1792537 1645157 1527390 1436112 1365732 1286546 1219254 1151572 1093818 1076431 1053648
18552 1053648 999683 911062 838586 819648 754639 698204 676742 653135 623953 618020 605241
18541 605241 616585 625237 582697 529732 500625 492568 484976 480254 478526 475887 480895 502174 519497
18528 519497 495398 479934 479370 485501 519003 543248 550474 563294 572281 576953 606219 643658 675893
18515 675893 733151 800130 848235 881316 930034 1011376 1140323 1308211 1504959 1756698 2062110
18504 2062110 2485838 3093901 4028689 5487308 7734712 10622365 12758225 12579503 11048123
18495 11048123 10025851 10334183 12198931 15833210 20979289 24666879 23067389 18081592
18487 18081592 13822711 11525877 10943244 11794510 13694095 14905065 13257324 9955238
18479 9955238 7192243 5408197 4313245 3593041 3113763 2774492 2522502 2329162 2211606
18470 2211606 2109514 2036429 2032772 2068276 2123723 2158613 2225789 2382629 2692814 3222385 4120573
18459 4120573 5541178 7436114 8881168 8644615 7291123 6136342 5645026 5761495 6371655
18450 6371655 7623431 9809244 13296056 18107431 22752076 25769830 28007467 29181968
18442 29181968 26913975 21787077 16620896 12534665 9586870 7594770 6280748 5454402
18434 5454402 4991398 4830784 5072441 5754770 6753487 7385599 6787054 5338182 4052590
18425 4052590 3181375 2642269 2302860 2090959 1919699 1761308 1661364 1574955 1517467 1489847
18415 1489847 1450563 1421803 1463269 1545866 1663354 1823945 2099487 2586029 3426746 4689005
18405 4689005 5910705 6066167 5241374 4553956 4493724 5082750 6447210 8470982 9899349
18396 9899349 9058776 6980638 5343919 4501826 4308322 4643969 5218469 5310741 4447228
18387 4447228 3280894 2396988 1837142 1486506 1232661 1064476 960907 877417 784271 703973
18377 703973 648343 622852 613803 588945 559138 516893 494182 491825 496680 511103 500135 470658
18365 470658 454352 430136 426265 438487 445900 460334 481307 479286 460366 446045 449603 452944
18353 452944 445115 418024 385160 346608 326039 332216 329036 315328 304896 259753 233058 227613
18341 227613 216653 200468 214720 223522 234044 219846 215782 182972 182800 181861 169006 159875 173048
18328 173048 178659 164859 151734 150831 153497 144068 127407 117219 130661 151777 171972 175769 170974
18315 170974 205106 221440 224068 232724 229880 234233 226271 223096 206463 189655 175771 153596 169959
18302 169959 202837 215180 207207 192454 182857 200828 219139 223965 224998 217343 202017 212372
18290 212372 224928 237048 247902 239449 230777 227213 222206 226288 266063 306385 355844 398105
18278 398105 359313 284695 239745 209422 200741 194059 174083 153262 164891 180990 164187 167660
18266 167660 154377 131583 110478 111511 112339 121390 128738 144903 141969 148389 160658 177644 191121
18253 191121 202698 201256 187006 178337 181238 159142 149942 146854 137538 140993 126021 137628 146793
18240 146793 158088 151926 147454 135479 148789 151335 150796 155072 145945 149442 160275 174129 183840
18227 183840 179461 187657 176178 156908 133048 124439 126205 113689 110711 135979 136046 134231 128940
18214 128940 128840 143654 163567 174478 179299 181285 179883 180751 167710 146600 124523 116305 114491
18201 114491 139506 149930 134109 117395 114504 111431 103919 117659 140519 146885 147105 137305 134389
18188 134389 124007 125256 130351 126096 129841 134895 143801 155078 143175 138724 128770 143866 150993
18175 150993 156738 160210 151734 163635 163783 170513 193886 210775 223360 244095 246597 255950 257664
18162 257664 265543 279036 298604 280202 275507 250558 217325 195662 177082 170793 175732 192977
18150 192977 195957 215234 194743 169179 180439 187635 170301 156140 134295 131638 141497 136127
18138 136127 136798 127218 131811 113342 106638 119902 123982 138380 133852 142928 150517 173081 170191
18125 170191 180890 179277 185989 200180 220343 224530 228946 217002 204487 231725 245364 258132
18113 258132 269938 280148 246739 217238 211599 206392 207010 211850 221125 216419 197835 205361 216648
18100 216648 220991 226830 203610 197013 191607 173850 162495 147969 119538 106852 122631 137094
18088 137094 145358 132282 117104 103579 111253 124014 139640 157899 163032 178938 183561 191839
18076 191839 178213 184509 163847 174975 170169 158454 172134 161329 177498 202725 191396 174610
18064 174610 165629 139222 134681 128958 114732 124471 136603 133525 126025 153061 166387 161111 163345
18051 163345 130065 118922 116841 131045 138553 169443 176178 182152 159230 132574 134708 147848
18039 147848 145642 132274 126613 128528 121966 123804 118245 126168 126221 137276 142086 159375 171746 164543
18025 164543 155056 123599 103833 106828 129973 135270 125382 115604 113973 96267 85527 81967 78697
18012 78697 87903 91806 101880 93174 78192 71882 68455 77388 114871 98247 72387 89486 102434
17999 102434 113694 117108 114628 117422 117838 83679 62185 53885 50463 59431 84682 109370 96548
17986 96548 69196 88096 111922 105080 109335 104488 99591 104918 127484 180344 182641 171371 167085
17973 167085 134101 120878 118731 123083 109803 106506 121257 106112 76943 85185 96430 94711
17961 94711 79165 75562 74041 78208 77967 69668 43172 58688 71911 70972 83898 85820 79251 73222
17947 73222 80929 94561 109936 121155 115919 126424 123237 107665 110885 116191 110372 106566 140545
17934 140545 185170 201853 217293 206593 195691 189513 156095 132015 140008 151737 143912 126081
17922 126081 134642 145597 147219 155231 143407 144169 136313 122361 118890 104244 101875 104423 114806
17909 114806 98290 85840 81358 72993 67412 65579 62014 51428 61684 64628 72870 94489 88474
17896 88474 86972 81776 76657 80496 67279 69043 63026 50621 53571 52846 78676 68585 67835 84727
17882 84727 82503 85075 90192 96692 85023 83729 73637 69394 90825 108614 114288 107143 90839
17869 90839 97944 80700 58088 76987 85743 64790 66079 58329 37460 52272 64462 70541 71443
17856 71443 50602 23051 16813 39259 79651 89426 82294 98572 79020 69087 67421 60170 55229
17843 55229 55516 67410 68566 37093 12578 15214 11757 17467 36533 44345 63938 72142 68616
17830 68616 46357 50406 57420 39954 49653 46951 39777 42955 50915 70323 72057 45045 47051
17817 47051 46687 58122 58772 59746 35319 32807 58025 48475 34090 43379 48016 42330 23619 30060
17803 30060 33406 19911 18485 17161 16218 26287 27152 36858 35022 52247 73161 71496 58349 70820
17789 70820 58269 54249 53063 45757 40431 50991 46164 47878 59900 93635 85322 53254 40650
17776 40650 28430 47728 52685 46456 42287 44625 59196 71616 65206 48070 67075 75036 70906
17763 70906 73564 79945 72008 54689 51834 49304 39905 33350 28285 28518 36571 47920 52408 56054
17749 56054 84281 102420 123017 122947 124391 149536 181102 177281 143602 130640 111181 81127 57139
17736 57139 56524 55603 43088 46103 59984 97628 107005 75975 63668 59742 66148 79737 94549
17723 94549 85238 74999 56093 72031 67677 86255 73100 47028 52799 60188 65228 61699 71564
17710 71564 68513 65061 64445 74155 76801 96395 86919 82548 79800 79100 80960 108297 133833 171931
17696 171931 161220 139176 114383 115391 140344 173312 206324 218738 199133 162810 119033 111560
17684 111560 109863 89106 74111 70478 52538 60441 72265 58630 46744 57878 61498 55674
17672 55674 52305 48283 49229 49371 41624 36225 33556 29023 36713 22381 41592 44701 31828 39379
17658 39379 48658 68625 84048 76077 62902 63003 54546 80972 84204 101586 101065 95612 105064 116301
17644 116301 160792 197087 185738 143766 94847 70698 70804 67244 55766 62475 52495 53651 48528
17631 48528 40232 49508 48568 75130 72669 48417 48352 58613 48596 40385 68466 61488 52031 55216
17617 55216 56338 45455 56656 56330 44270 42452 50297 55404 31908 15946 30601 42831 39672
17604 39672 36417 27330 15195 626 8068 20581 30641 26247 30006 32099 22366 11720 14670
17591 14670 31573 39406 56087 63802 46470 36789 42889 26889 15264 20916 25895 26071 15419
17578 15419 8811 28156 30750 24739 20488 44053 50445 36838 32857 39876 31542 26774 63102
17565 63102 81680 45663 41598 42930 36788 45317 48737 53688 51009 32912 27437 23816 16391 15702
17551 15702 15990 17517 3590 -2125 12561 1900 -24211 -20729 4334 17179 9877 21366 28577
17538 28577 27444 22184 49491 40601 44124 59646 56838 38963 38116 42026 33627 32554 26553 22132
17524 22132 4670 10133 43531 51429 24875 22422 21276 27104 26069 31866 33563 25476 46940
17511 46940 59040 49372 49898 41896 37149 27452 34905 41591 42540 26327 19503 12232 -9483 -19510
17497 -19510 2677 12100 21054 18297 19467 11598 9092 20023 31851 42438 45201 51583 42265
17484 42265 22441 22005 18358 23953 11836 -20875 -7380 202 -102 -4563 9619 25007 5734
17471 5734 -7407 -6924 11308 43346 61123 51540 38288 24702 21544 27062 -9673 -21211 -9414
17458 -9414 18413 32065 22900 22793 41453 57639 83755 63508 44432 52562 46529 36384 26618
17445 26618 37986 27814 11671 23337 12869 18575 42350 57068 51729 34790 22746 28703
17433 28703 41767 39767 21607 10231 11058 5642 -2190 -4530 14747 35329 36499 23089 10844
17420 10844 -2447 3953 14226 17928 33259 35180 28710 17621 10391 24180 27722 17839 14475
17407 14475 22907 41479 47692 59717 54505 37840 19933 14579 34122 22074 16475 8257 9274
17394 9274 31420 34303 17615 31468 36572 40118 49231 45032 49251 24833 -754 -8522 -9765
17381 -9765 1080 15714 15530 19960 37867 39904 31329 33290 20712 21911 43130 53329 35791
17368 35791 18345 10940 27065 34676 19538 28282 10661 -6128 3591 9199 28500 35217 23944
17355 23944 23640 15234 37907 40057 45432 40031 31591 38936 31954 35559 13927 -1886 21202 33757
17341 33757 41147 60740 58499 41028 49751 47456 48148 44934 49514 63179 58919 49226 34539 -685
17327 -685 -24077 7953 23174 19433 13290 32637 36689 11309 15184 20922 25692 18262 3027
17314 3027 17979 29130 53470 54435 45944 31982 20491 21236 4115 -8557 6336 28365 28960
17301 28960 33517 36285 28882 23726 38822 39506 36540 35479 14846 28286 53477 47181 29683
17288 29683 23904 18860 31955 28745 2920 1450 1082 40656 45291 52670 58992 47462 48937 56475
17274 56475 60177 42502 25947 13139 13100 9089 5091 -8807 -3096 2468 24473 48612 53112
17261 53112 48991 54489 42199 20279 -20142 -912 24103 24381 13608 5590 -928 -27542 -26396
17248 -26396 -17790 2165 11969 18736 18162 8885 -1569 -11689 -22739 -246 9137 22703 32036
17235 32036 26666 12209 26758 35783 33846 50396 53215 53133 42848 35197 26752 9628 13284 14412
17221 14412 30255 28896 25831 23770 30153 18695 3585 -16554 -19143 -11853 9914 21313 17220
17208 17220 4979 -4240 -5601 -25535 -25154 -6174 10657 23509 39025 42368 40056 23771 20878
17195 20878 15809 22835 25963 30291 34491 32288 30039 21137 22441 -3569 -5531 4415 16769 10383
17181 10383 -8392 -21247 -8443 10354 33108 49900 62293 44804 29781 22242 2242 -16659
17169 -16659 -13927 -14024 -20215 -28429 -9493 17047 6903 -4245 -11117 -687 12944 15863 22022
17156 22022 20332 14982 -270 15405 11621 23300 29930 20496 16677 28486 41923 39582 29693
17143 29693 28652 39120 39595 27952 41969 59398 46407 21880 20427 29717 37816 39015 39019 23471
17129 23471 2991 25997 38976 41038 36474 22874 30571 27296 10954 22453 13972 17157 10757
17116 10757 255 21312 27634 16765 6031 9947 33525 24708 10297 3464 -5526 589 8781
17103 8781 10987 -7833 -5992 6459 4279 -789 -14592 675 -5873 1376 6523 1595 16913
17090 16913 21734 7393 -15477 -19899 -16801 -16036 -19048 15030 32016 35470 18357 6232 5459
17077 5459 -7073 -5456 10132 32212 42626 27069 21444 21360 22455 21409 21997 25635 14893 -214
17063 -214 -7753 8817 8182 7637 -14043 -19132 -7718 -9258 2625 17947 30459 14260 -24040
17050 -24040 -29385 -18125 -19583 5460 39379 47617 28207 11319 3603 12191 16538 14949 8296
17037 8296 1371 19001 30831 18397 38083 39146 44491 45978 46447 31647 10849 -676 9301
17024 9301 5946 7895 2336 13573 26945 13727 24235 34013 52517 64940 64512 66023 81844
17011 81844 108238 141285 158495 152265 131850 99814 94213 124692 167437 198381 186019 142075
16999 142075 108608 112718 136745 121278 95196 75401 56424 39883 28433 53429 75954 86776
16987 86776 79943 53771 34649 15630 5708 -2048 -6166 22360 50883 40782 27337 2664
16975 2664 -473 30012 38528 39945 25883 26712 34112 52568 44259 23157 19465 15305 23575 35973
16961 35973 56158 66802 63418 67931 71761 92197 124978 136208 130149 127681 119016 123005 142496
16948 142496 156922 133666 99583 67941 46225 49826 42034 18538 23188 35597 51390 57313
16936 57313 56122 54266 38681 43292 49590 52614 50266 24526 23418 18019 20205 12921 18597 33751
16922 33751 39053 44534 38696 12883 18629 25385 51118 50213 52006 44945 28536 24395 17005 21962
16908 21962 25882 35598 26541 19513 26571 22850 12316 -20368 -6791 -9250 -10807 -6897 2001 686
16894 686 114 27435 18073 -22508 -39282 -35612 -12354 -22944 -17041 2080 22627 5160 -3516
16881 -3516 -10507 -2827 15240 38776 62141 82863 103502 102839 85373 62550 51208 62032 86954
16868 86954 95794 94488 82293 65527 56814 46098 48409 48849 39354 33159 24139 36808 53116
16855 53116 44366 18871 -20583 -16210 -13590 1299 8544 13902 15050 12168 286 -9549 14034
16842 14034 11199 14340 9282 12811 -143 -14888 -23656 -12276 -1520 -2614 10554 24107 21828
16829 21828 25537 26195 28029 31018 26566 28170 50625 76717 69180 59195 34965 24581 16856 47689
16815 47689 61729 54294 41713 34672 42147 12039 -28035 -36167 -31214 -62718 -73623 -54758 -39655
16802 -39655 -25860 -19443 -11134 -9819 6415 1865 -3397 -2608 -13564 -26632 -11646 -15872 -34927
16789 -34927 -36579 -9516 -13467 -29835 -44902 -33840 -38159 11376 25578 5952 3570 5732 15381
16776 15381 14112 14241 -2623 -13644 4946 1576 -3054 1413 4225 8304 411 11970 4442 -18904
16762 -18904 1639 21972 14927 10254 1611 -7814 -16703 -7237 -6028 -2609 920 23474 21113 5029
16748 5029 -4661 3665 -1585 605 4621 14441 19509 9629 6886 31919 24372 433 7841 21474
16734 21474 27420 13401 3314 43795 76525 59103 17104 -3997 -12617 -1347 7405 -5280
16722 -5280 -9329 5018 488 -17489 -17050 -8480 1285 -1846 -10907 -13223 -1814 13713 10349 -3147
16708 -3147 828 13480 38744 58560 41664 11889 14360 11468 -1897 1695 15062 16444 18075
16695 18075 24860 12351 29694 43040 44599 43138 22952 13756 3861 4855 30722 31279 19159
16682 19159 15704 15587 8661 4503 -619 -2036 11913 34071 35803 15755 7965 20630 22376 7455
16668 7455 -14080 -15797 5687 16855 -6801 -19026 -10203 11896 16668 16856 18597 16345 5055
16655 5055 -4095 -11496 -20995 -9440 5788 21863 21364 -10564 -28892 -21105 2236 -3507 -29696
16642 -29696 -34499 -26574 -12414 -419 3486 6583 2849 -2679 6514 -7395 -17775 5455 22499
16629 22499 19712 22793 29910 15257 -9308 -18046 -14079 -1793 -3228 -14602 -23033 -30291 -17578
16616 -17578 -6757 -7726 10201 26137 24767 13592 9105 35010 41946 16004 -6934 -22325 -17219
16603 -17219 -4546 -660 -11178 -30258 -33425 -5248 8362 -3287 -15391 -22733 6591 -14670
16591 -14670 -8365 -91 11879 24096 32977 11713 -7683 -4518 10057 12112 6293 1978 13330
16578 13330 25628 25748 21622 27239 31166 27437 14702 12034 5804 1525 14871 26906 27745 6763
16564 6763 2312 4374 2440 -9840 9118 38226 30506 7006 482 1521 6236 -1016 408 -6359
16550 -6359 -13995 -16392 -12474 -15228 -21406 -14137 1790 18789 7799 14791 35072 31148 20231
16537 20231 21368 1891 -16095 -18854 -28971 -19314 -180 -6845 -17679 -13520 -16252 -4176 11064
16524 11064 -3338 -17624 10715 24274 10025 18843 30034 19404 13100 22117 13407 9225 5808
16511 5808 38 -20204 -27669 -15926 1059 6498 3579 22012 11425 -17851 -29193 2264 26942
16498 26942 39605 26055 16280 11901 6277 25854 21669 5206 -13438 -15204 -7446 1868 36449
16485 36449 51938 43251 22036 2524 2084 1539 -6199 -20674 -24960 -12961 -3436 -11152 -26486
16472 -26486 -40833 -17822 -4588 -18356 -27727 -20104 1652 20866 3707 -18589 -22906 -28287
16460 -28287 -28401 -4317 23550 13632 12425 12205 -4586 -19177 477 25850 28912 22231 -10368
16447 -10368 -20510 -23355 764 -491 13907 4798 23078 45724 35321 5026 -14540 -17441
16435 -17441 -18203 -2539 9439 -6592 -6436 -9047 -8362 -5136 9500 11373 812 -4747 7615 -2264
16421 -2264 -14507 -4754 -2405 -22870 -18334 -21225 -14108 -24616 3604 29852 30809 29830 15737 9273
16407 9273 -2702 15777 6272 -3512 -102 6189 30127 29421 28713 10825 -7729 -15645 2212 19042
16393 19042 15098 17311 8480 640 2619 11392 11723 20821 14754 6654 17303 12812 3699 -14924
16379 -14924 -24317 -24514 -7017 13458 1325 -8981 -14487 -27296 -18737 -29442 -28628 -12066 -8783
16366 -8783 -6072 101 2910 9916 11373 -15562 -31213 -13114 6355 12112 19122 13520 7452 6061
16352 6061 -2723 11268 17028 23256 25094 32953 31700 29584 37299 40426 20530 15759 13683 12244
16338 12244 6555 557 -2886 -8874 14195 22828 9754 17464 31892 30714 8612 -11831 6594
16325 6594 31911 31549 20634 19350 11029 -15719 -27738 -2052 7442 -1084 3126 28034 17462
16312 17462 -4133 -15332 1341 19088 4683 20829 24461 21717 15151 2733 938 -1052 -5098
16299 -5098 -7541 -1884 1250 18033 29981 26285 24843 15669 -564 -11531 -11982 -15534 -22272 -16942
16285 -16942 -18263 -36260 -22862 130 9664 17080 -3727 9090 18769 17567 7527 -8076 -12952
16272 -12952 -16098 -9335 4312 26344 21863 17351 -10742 -11331 3946 4076 -20718 -7419 -698
16259 -698 9355 3803 -15466 -8578 -13666 -1610 30411 32543 35444 6065 -7657 25722 28936
16246 28936 16048 -2601 11223 4214 8080 7678 2228 -17677 -27795 10078 12867 587 2851
16233 2851 -12463 -7867 9133 3047 -3621 11945 21164 33495 36540 27685 19407 7524 19412
16220 19412 33306 18315 10495 17971 44241 40856 21869 14366 6301 4821 -608 3080 -6457
16207 -6457 -18909 -15874 -22945 -26126 -32247 -34038 -42127 -43804 -23418 -24304 -14891 -22813 -13336 -12168
16193 -12168 -17628 -23079 -25708 -9604 13388 32080 17744 11407 4596 16386 4481 -7868 -20715
16180 -20715 -5704 1105 -13658 -4019 11944 21211 10600 1087 -3894 -14864 -13272 -12973 -11021
16167 -11021 -8169 -10386 -19433 -16257 11703 19057 2650 -24315 -13081 -2800 -9773 -40404 -40048
16154 -40048 -49131 -48095 -15976 24358 29002 13450 7764 7967 7 -10833 -11456 -7794 -5747 -17866
16140 -17866 -13255 9070 -5937 -25039 -16069 -11787 -9710 -7552 -2269 180 -4618 -17092 -6421
16127 -6421 9935 -14326 -24274 -18035 -19224 -5344 2306 1965 -5047 -16478 -11892 -16993 -14553 -17989
16113 -17989 -11860 -6005 10114 3916 150 13382 13791 11438 4454 13246 12101 13540 6777 4137
16099 4137 -2052 -10997 -4938 -11006 -34582 -27516 2187 10729 32520 41900 41836 8322 -13267 3760
16085 3760 19272 18243 4273 -14747 -22766 -16731 14708 17482 13222 4501 -14952 -30735 -9572
16072 -9572 -7498 -16225 7125 5435 3645 13805 6885 -8859 -20840 -4035 -18246 -15257 -6860
16059 -6860 8430 33454 33109 14711 -37 -23839 -21336 -15955 -24638 -18103 -3506 3194 16482
16046 16482 -5320 -5464 -8034 3208 18963 21905 4417 5447 -22288 -45451 -48965 -23668 -7456
16033 -7456 -20794 -8085 14532 17764 -9507 -29615 -38806 -24422 -33355 -30667 -24200 -13916 -34808
16020 -34808 -13396 7659 -10298 -26406 -33861 -26890 -14043 -20046 -13833 -8734 -13442 -26106 -11002
16007 -11002 -19741 -42769 -48526 -25516 104 -12541 -10933 -12735 4690 7625 5520 10044 3197
15994 3197 -12673 -8717 -5399 -7386 -8945 -10686 -2199 235 -16734 -36196 -41817 -16382 -7395 -18856
15980 -18856 -34569 -28958 -29896 -41969 -38477 -30363 -23219 955 29624 28948 24267 23945 -3079 -10940
15966 -10940 -3994 14561 8217 1441 -4164 11001 -1618 4800 19724 20423 2979 -21391 -20044
15953 -20044 -2044 -3594 -5456 -4292 10980 12498 3242 1169 8115 -935 5563 12237 32945 52202
15939 52202 40833 20092 397 -18883 -29512 -36225 -30459 -44861 -30436 -14672 -6749 12992
15927 12992 28410 25623 26089 -677 -24391 -35985 -31640 -25831 -10504 -1794 -7960 -12016 -11752 10089
15913 10089 14867 14586 14639 22468 19360 32283 49984 50429 23841 -4871 -6101 -24804 -28993 -4962
15899 -4962 19541 20483 19285 34411 30258 30398 4523 -12470 -7271 -7596 -3541 -23743 -19047 -14577
15885 -14577 -4841 -13241 -35177 -23826 3716 16196 22218 9931 24673 33747 36757 31935 32409
15872 32409 22776 18053 27291 39249 36517 13115 12772 24373 16996 6045 23690 49618 28641
15859 28641 16268 17124 40514 34307 22004 15049 8275 2030 13749 21955 41360 47394 34988
15846 34988 18007 10732 16604 25739 27536 16474 18087 5215 9290 14974 7207 6110 15291 10032
15832 10032 19039 30357 10426 11361 36561 41032 33308 32292 29267 19940 -2043 2680 17635
15819 17635 -1123 -30842 -34299 -28127 -25467 -5160 -7272 -18106 -7881 -15263 -3429 -3597 3767
15806 3767 3678 2603 -9463 -15289 -17540 -22970 -5747 -4650 -15007 -15413 14973 -2516 -12219 -14328
15792 -14328 8366 29499 42929 25333 27199 12222 268 -639 -5784 -6055 -7739 -15035 -11359
15779 -11359 -20323 -5604 -16323 -15223 -11798 -5923 -5102 -10793 -30147 -18225 -199 -194 -3005 13209
15765 13209 9304 4132 -7567 -25693 -43582 -32615 -19472 -5554 -1744 13182 27693 22802
15753 22802 24780 2125 -24810 -34272 -20909 9706 7283 -3512 17216 21320 1230 -23707
15741 -23707 -32000 -37609 -30953 -21340 -20821 -15251 -7069 11984 25109 17929 2294 16975 25296 15129
15727 15129 18760 27110 18999 4521 7386 8307 2355 -10980 -27718 -20477 -7808 360 4357 18819
15713 18819 9658 -15595 -18745 692 9112 9526 -1679 -21037 -47297 -36376 -37219 -44208 -56291
15700 -56291 -37481 -22800 -8411 19993 28014 5020 -12296 -11292 -23515 -1301 2601 85
15688 85 -12726 8523 14658 6050 9182 577 -15414 -18630 -9749 -18477 -24217 -19345 -10489 -15537
15674 -15537 -13121 4350 -19827 -22855 -12877 9061 23543 24227 26954 30086 25464 6343 5712 1054
15660 1054 -4090 -10341 2687 -3416 -29940 -23135 -16957 -4958 14249 12434 -11306 -42750 -54458
15647 -54458 -41544 -18462 -8989 3127 -5181 -10867 5941 26381 21555 12962 5990 917 -10491
15634 -10491 -7881 -9860 -13107 -15628 -17152 -7254 -2008 -2038 -3849 4103 20729 24325 6688 -19124
15620 -19124 -19686 -20272 -23986 -4872 426 -7692 -16558 -23172 -20058 -43665 -30855 -30132 -15231 16450
15606 16450 25501 -43 16580 24550 8162 -24869 -29166 -30650 -29973 -22166 957 -16164 -29958
15593 -29958 -26932 -8083 -10340 -14475 -6982 -10004 -9726 11251 1680 2331 -17763 3275 14536 -429
15579 -429 3982 17608 23792 35987 29629 16637 8924 28898 30087 21472 33429 28046 27807 19894
15565 19894 -12651 -42373 -32981 -7387 24223 22358 -14392 -15641 21717 10371 1831 7246 8433
15552 8433 14349 3266 -17087 -27104 -20950 -19564 -38184 -21810 -20805 -8786 -8642 9780 14663
15539 14663 -16305 -3550 19196 16678 16111 3451 4510 -1861 -13725 -27350 -16919 5850 26245
15526 26245 28202 12197 -10077 -8725 15200 12522 -6981 -8867 3498 17729 25245 19932 4740
15513 4740 5947 -8802 -4075 -22080 -33857 -4732 -9435 -11028 -3906 18843 5678 -5224 -12628
15500 -12628 -16255 -28890 -8429 -14083 -18076 -9149 -17720 -3247 6367 4921 19128 25665 9845
15487 9845 -10253 -19509 493 -1532 8671 26116 13662 7970 5529 895 -21615 -28796 -40401
15474 -40401 -18292 2139 4068 -4673 -17872 -15227 -7891 -1387 2 -23961 -13293 5211 3669
15461 3669 2361 12190 21551 8190 9119 -9571 -17791 -14927 -21597 -31017 -29527 -21790 -36122 -34059
15447 -34059 -16122 -18894 -26824 -33447 -33425 -36940 -40701 -40540 -45854 -37747 -30388 -33617 -22227 -10520
15433 -10520 1260 22077 46049 36644 6037 -1622 -2806 23037 19372 12115 10828 5619 -6223
15420 -6223 -1964 -4470 -23578 -61 16557 7953 7797 17802 8191 -4305 -152 13536 15976
15407 15976 8871 9355 8940 13498 9900 851 -153 -6163 -1680 -5698 -7971 -6827 -5581 -9231 -16575
15392 -16575 -8135 -2263 -10796 6139 14092 6685 5826 -14586 -348 -3936 -2129 3474 13014 10334
15378 10334 3510 -4681 -3467 4603 5487 3182 -12593 -34317 -49087 -36178 -25937 -25947 -11968 2649
15364 2649 -2379 -24410 -28160 -35525 -33853 -41873 -35800 -29645 -21395 -24514 -19271 4862 -12287 -29208
15350 -29208 -10128 -223 -24356 -37693 -39790 -33717 -33557 -35952 -33761 -16606 -12387 -3679 -8718 -14813
15336 -14813 -353 -5536 -9148 -25772 -11795 -2520 -227 2245 233 -1106 20063 25994 -7516
15323 -7516 -16362 -111 22672 28902 4954 927 9699 17074 10422 7190 -10420 -20742 -9159
15310 -9159 -2595 9150 15321 10999 6236 -4174 -4762 79 6503 4738 -3285 3543 9909 12725
15296 12725 6315 -12377 -17435 -24745 -27472 -15254 -14527 -14323 -17342 -34173 -32012 -12204 -32723 -30125
15282 -30125 -6253 18895 3584 -2521 -3659 327 2165 2414 -15684 -29711 -44045 -48485 -43278
15269 -43278 -26580 -10197 -33177 -32477 -14989 -27796 -20214 -4274 -485 913 -9315 -23500 -18175
15256 -18175 -5560 -7926 -21484 -17793 -15276 2050 -935 -15983 -8329 -16946 499 -1662 1728
15243 1728 -27620 -25164 -10922 -12004 -2147 -24204 -26598 -21488 -26875 -19178 -10857 -10021 -6715 14154
15229 14154 10718 -3725 -16845 -28444 -8394 5062 11515 11668 9306 -7832 -25351 -23665 -29665
15216 -29665 -39914 -20002 17982 36395 35786 29584 5775 -17523 -7948 -3112 -15772 -15209 -4051
15203 -4051 69 -8492 5351 14175 31670 7971 2959 18833 125 -25128 -27023 -24926 -26213
15190 -26213 -26321 -36846 -11264 -2278 -5573 -11006 -1699 3626 2200 -8369 -4450 -4706 -20773 -25639
15176 -25639 266 1483 5813 24878 22025 14971 22828 16426 27585 8603 7323 11707 12171 3272
15162 3272 1327 12364 20597 8081 -27214 -53639 -41768 -39239 -28832 -20366 -6433 2074 833
15149 833 -8253 14059 24330 32880 27834 13205 12948 27872 22410 -4021 -29183 -22110 -24029 -18165
15135 -18165 476 21262 26687 33133 22145 -1311 -27672 -23929 4758 12937 9900 14281 12722
15122 12722 2538 -203 -10699 2452 27135 20353 -1315 -9859 -1953 6335 -10790 -35982 -40238
15109 -40238 -46576 -56330 -53300 -33591 -40666 -18963 -3275 348 2005 -10044 -7759 -4734 -11271
15096 -11271 3881 -3416 -1330 -10772 -24991 -47138 -40390 -46909 -34863 -21576 -24275 -17248 2476
15083 2476 7672 -6110 -21503 -19609 -8042 83 13496 21894 7722 -10454 -1577 -1131 -6732
15070 -6732 -17894 -33033 -36474 -13324 -3639 10185 4852 -18689 -36481 -36202 -31780 -24209 -15257
15057 -15257 -2055 -10349 -8901 8577 5988 -4593 -21462 -16343 -19797 -40078 -29023 -3440 -3233
15044 -3233 3906 1139 -5275 318 -16215 -33677 -37222 -38973 -36123 -43449 -54108 -42411 -40033 -39803
15030 -39803 -21763 -14451 -17701 -40245 -52353 -33410 -11039 655 9582 12801 -20828 -31143
15018 -31143 -25897 -1790 -6283 -8116 14795 32915 31801 20140 -4 7146 13915 8499 -1011
15005 -1011 7051 3947 -9410 -12049 11178 11465 -11636 -14673 -23323 -57001 -42849 -7258 383
14992 383 1847 10049 8598 5066 -4974 -21664 1546 7482 -11241 -23096 -12667 -93 -11251
14979 -11251 8660 44125 31061 7110 4935 10292 -2655 -3024 1667 10842 7165 -8505 -15946
14966 -15946 -18896 -26003 -15461 -18567 -6342 -7850 -930 -2679 -18496 -17638 -17723 -22038 -9563 -14881
14952 -14881 -21765 -21002 -24378 -28294 -34705 -35698 -24411 -29084 -23800 -15584 -12579 738 4204 -4556
14938 -4556 -3685 14230 -3984 -12314 -19922 -17516 -16961 -18446 -30606 -37976 -40691 -15674 9395 16755
14924 16755 14614 464 566 8406 -4118 4051 -4916 -34285 -41004 -43553 -20021 -490 -3193
14911 -3193 -4217 6133 10267 21587 20920 -6610 -22360 -20852 -17644 -18602 -12034 9090 38479 26866
14897 26866 38288 37628 22165 25054 28950 20618 6988 7226 1752 11776 9078 -3138 2410 21709
14883 21709 14512 7148 11311 -424 -14948 -7767 9101 5116 -5961 -2068 15808 16554 -3647
14870 -3647 -35420 -50625 -46142 -27824 -14439 -18590 -27072 -12345 -10358 -6430 10455 -641 -21857
14857 -21857 -23174 -12966 5646 8463 -10325 -8528 -9318 -13696 -17831 -24951 -34571 -27845 -24796 -41490
14843 -41490 -28825 -31215 -11100 -850 9230 -2666 706 9066 15327 9069 -4839 -15370 -25642
14830 -25642 -46504 -63152 -48394 -34143 -24030 -10402 -17817 -26981 -29044 -24463 -15615 -17504 -17485
14817 -17485 -9829 -19151 -27587 -28747 -9922 -6080 4663 -13359 -38944 -46082 -44508 -35498 -29750
14804 -29750 -24470 -19091 2243 -6463 -22997 -27553 -28424 -33053 -28546 -16858 -25589 -41556 -27963
14791 -27963 -23769 -14859 -29636 -45562 -28152 -10558 -9794 -19780 -21932 -11148 -2791 11230 5330
14778 5330 2909 6512 551 -2594 -8417 -8806 7193 5698 -2182 4798 8244 -1314 -9362 -19284 -13185
14763 -13185 -19802 -13721 12925 3090 -11414 -20358 -17160 1757 10369 17478 27529 18307 8518
14750 8518 8826 -1375 14184 11876 13041 6842 2419 -5833 -2414 9595 9292 -2841 -12333 -33082
14736 -33082 -25065 -6105 673 -25585 -42834 -33199 -14632 -15429 -20132 -21603 -10332 -7616 13283
14723 13283 25639 17517 5622 -3641 -7280 -18363 -17647 -25335 -30709 -32003 -19903 -31960 -29008
14710 -29008 -8285 5415 1454 9903 12720 22910 32209 29565 4550 -10968 -13961 -21671 -39622
14697 -39622 -40183 -21418 3075 7476 670 12681 4283 -22312 -25391 -17355 -2551 10502 -6593
14684 -6593 4678 38897 39818 1345 -21824 -47876 -35847 -26181 -28298 -19877 -209 16367 24017
14671 24017 19834 4948 -3733 -17868 -26156 -27885 -40682 -37568 -15049 -16347 -7501 -6649 -12200 -29128
14657 -29128 -19786 -17309 -5333 -3814 16389 23433 -9158 -3946 -15707 -37076 -43226 -40527 -9938
14644 -9938 5210 -3348 11189 23185 23894 12387 17549 27790 26836 12607 3434 246 -5328 4182
14630 4182 6606 41485 44230 11763 7023 26267 21610 -25891 -29921 -4956 8896 10322 9790
14617 9790 28046 13944 1809 779 4423 -9082 -15172 -2896 16882 45344 44604 45662 35806
14604 35806 18978 36878 44117 21815 -3194 -12187 -18430 -20822 -22492 -34012 -19477 -7609 -146
14591 -146 -18351 -25031 -5623 5515 5464 5909 -4193 -4146 1957 9250 5198 5124 1953 -5303 -15191 12994
14575 12994 24122 32148 39172 27885 32423 38858 5973 -24165 -26529 -21403 -28681 -39970 -29366
14562 -29366 -5691 -2381 -20583 -24530 -24458 -52066 -48431 -43842 -58118 -58272 -59743 -38765 -18183 -2735
14548 -2735 2073 -21742 -18936 -31175 -36557 -5957 21363 33519 27337 -832 -13820 5267 25328
14535 25328 34907 4789 -27416 -11558 -1355 1854 4978 220 72 -186 -3779 -3746 4661 26449
14521 26449 29138 29411 22634 4010 -9919 -6428 47 3686 -10132 -3910 8149 15727 15016 -1468
14507 -1468 -12662 -19323 -16658 -22167 -24854 -29556 -16610 4494 6990 -1885 8718 9961 12805 23550
14493 23550 28183 7884 -12164 -23374 -13785 -17821 -23858 -34610 -40578 -18166 5097 11265 2888
14480 2888 6291 8713 -946 -7989 -2176 -4317 -7982 -5028 -11027 -24416 -19845 2049 10627 11481
14466 11481 6225 -11429 -17879 -22911 -35322 -34451 -26962 -10790 -14783 -24019 -48068 -62669 -56192
14453 -56192 -31978 -19146 -11423 16835 21004 14423 -19678 -43042 -35194 -6192 3543 -5762 9266
14440 9266 27492 2890 -8628 -14793 -33908 -40567 -45097 -39100 -17363 11054 18065 21853 18787
14427 18787 25829 20821 17363 12825 3202 -14655 -1088 -1346 -8581 916 6524 26462 31191 23299
14413 23299 19648 9636 4361 -10060 -19022 -23877 -30512 -34269 -12022 961 -1540 15080 17659
14400 17659 -6161 -18087 -14399 -10286 -4961 -7689 -13110 -12632 -13995 -17763 -15635 -3207 740 -19407
14386 -19407 -24761 -39801 -28700 -13439 -11619 15311 46173 32839 23665 12910 11568 -4522
14374 -4522 -11154 -8784 -22162 -26529 -801 15103 2749 -1747 -3470 11030 25581 22342 22808
14361 22808 11560 -19661 -14351 -7320 -14614 -13985 -19042 -27146 -21160 -24685 -19745 -10221 -18303 -29554
14347 -29554 -46441 -41343 -38626 -58215 -47475 -26301 -16818 -33137 -46582 -30175 -1610 -7024
14335 -7024 -18690 -43508 -54806 -38408 -28439 -24071 -20822 2284 11223 -8324 -10090 12040 25303
14322 25303 18122 24256 25871 14469 14632 -19077 -27627 -25278 -23065 -28813 -34183 -22839 -9119 -1067
14308 -1067 -16007 -14538 -18993 -8111 -17105 -31145 -32923 -21954 -25162 -29857 -41547 -43687 -33478
14295 -33478 -31200 -32624 -36995 -50976 -43565 -30732 -16490 -6667 6004 -7604 -21241 -12915 -26567
14282 -26567 -27180 -21933 -14059 567 -7239 -24162 -27528 -30682 -18782 -248 -5348 1898 14552
14269 14552 21584 24632 2046 -9815 -5204 -13675 -18254 -29851 -38377 -11694 -1067 5788 -6338
14256 -6338 -11123 8765 2256 -12374 -8493 -5398 -12630 -12287 -20124 -24106 -25033 5461 11327 16566
14242 16566 13615 9507 -9713 -32933 280 -325 -1721 4818 13963 26837 21943 22736 20512 17293
14228 17293 -7014 -16797 15336 19184 30230 36474 36180 36437 21385 7006 -7005 -17709 3966
14215 3966 10051 3102 17298 22499 17719 13295 13061 20625 -238 10875 27532 11754 1509
14202 1509 17123 11912 -11886 -28227 -30737 -28138 -21616 -22448 -11422 -19583 -44390 -38416 -15613
14189 -15613 -18632 -29299 -41175 -52015 -56670 -24909 -3360 11542 12196 -8474 -20265 1749
14177 1749 18466 12480 14901 10543 9405 6134 7129 14005 26174 26336 5292 -16255 -10035 9737
14163 9737 -6726 4697 -2039 -2431 27724 21118 -8127 -26586 -20557 -28303 -29296 -37068 -39062 -29257
14149 -29257 -20787 -26481 -24599 -31826 -47098 -49579 -32120 -24710 -12153 9045 13703 16631 13273
14136 13273 4597 -6016 -11749 9862 5764 -7292 -4711 -15506 -12592 -1469 11829 4794 -25771
14123 -25771 -35251 -20674 -20375 -20468 -29443 -42214 -20699 -1410 15389 4520 332 -10107 -15721
14110 -15721 -41581 -57357 -71905 -81019 -62471 -22151 2206 -17079 -23363 -27825 -6884 6458
14098 6458 12539 15539 4444 -992 12827 4697 -5588 6419 5929 -8261 -3955 11214 6964
14085 6964 -810 1783 7200 20424 -1216 -9543 -16186 -18290 5282 8142 6808 -11476 -29724
14072 -29724 -41639 -24266 19760 18252 -33669 -40064 -16082 3031 14851 4344 -1401 -1429 -5142
14059 -5142 9561 20800 33112 35543 30233 17747 15303 1391 -769 -4891 -1020 4046 5143
14046 5143 -14782 -37143 -37125 -4435 -4065 1461 19907 4811 -5962 1316 13453 1369 -16200
14033 -16200 -5577 15876 26917 13305 5306 4838 941 -16610 -11023 -13235 -21608 -26242 -20372
14020 -20372 -7634 -18239 -17695 -15793 -8417 -9965 -44845 -31930 -21450 -20293 97 1825 -10074
14007 -10074 -8624 1425 -10839 -17956 -169 -272 1458 5318 18997 12416 12526 20003 16915 8573
13993 8573 10249 11984 1637 8211 12658 10772 -16320 -42409 -38853 -7481 12605 7073 7188 6281
13979 6281 2221 110 5502 9154 7070 -21040 -32005 -21529 -11359 -11032 -9291 4564 11968 12727
13965 12727 7099 10827 19505 17761 13703 -8490 -422 10867 3799 10419 7631 -6551 -13614 -25994
13951 -25994 -2544 31588 11225 4791 -14938 -28155 -29246 -19084 -18197 -3674 -11970 -11709 2308
13938 2308 -7662 -14413 -5016 6721 -3116 -20074 -19463 -7362 4456 5522 10047 21776 8604
13925 8604 -4938 -10338 2740 -14101 -14866 -11243 -13806 -12462 -11647 4923 36928 51213 35864
13912 35864 25542 38374 56648 52052 31842 8013 705 -8159 2276 16029 13048 4661 4904
13899 4904 4139 -25837 -33173 -36827 -39695 -49129 -59294 -46969 -19989 17316 33249 14754 693
13886 693 -10531 -21696 -28684 -30010 -17211 -8319 3249 12554 14005 7297 9614 6475 9606 2205
13872 2205 -13579 -18616 -4253 -181 -6336 -9629 -6299 -10128 -7325 22675 34063 14605 -4105
13859 -4105 -4285 18265 37385 25742 7785 2898 -9204 -5799 -16148 -2695 3013 -18361 -15611
13846 -15611 1686 7497 4883 462 -1284 -26336 -29662 -8734 -15805 -45578 -65944 -65898 -48523
13833 -48523 -33635 -18917 -11175 -11879 -23549 -7671 5507 -7632 -10596 5558 -8531 -23293
13821 -23293 -34657 -12571 8176 1802 -14514 -7069 -18538 -34424 -57886 -52332 -25557 -326
13809 -326 -9641 -931 -2658 -16478 -5290 -2210 -24575 4503 26187 14672 12158 1387 -5762
13796 -5762 -4168 2601 2777 -9935 -14143 -3843 -33635 -52432 -47923 -38897 -32567 -15815 -10552 -3268
13782 -3268 6208 3264 -2041 -6052 -24720 -8334 -13966 -15117 -4471 -29535 -19082 -17165 -31435
13769 -31435 -33014 -10252 3156 16417 13355 -10869 -18345 -11732 -2243 -148 -13953 -4593 -5828
13756 -5828 -4559 1441 -11033 -24884 4049 11673 6365 14099 14844 14838 14343 -11303 -2780 -825 1812
13741 1812 3785 -1539 7303 -13753 -37322 -43824 -31074 -36914 -21955 -490 -1686 16454 36001
13728 36001 34327 17962 -1759 827 13118 11891 8074 -7472 -7478 -7906 -13174 -23845 -11751 -3581
13714 -3581 -7894 -15160 -38394 -20127 1325 4505 2780 -5304 -8327 -20809 -9762 -24604 -45905
13701 -45905 -35170 -20498 -20639 -22830 -18332 -9712 1240 35779 23537 1858 -10403 -3608 10307
13688 10307 95 -12578 -5604 -21719 -34400 -24204 6826 16478 29628 26747 21861 9476
13676 9476 3559 -5558 -12253 -7231 -18600 -34921 -27883 -10357 6224 19981 14377 -11722 -18796
13663 -18796 -21678 -47966 -50149 -33086 -10684 -3135 -10957 -12709 -12221 -8890 13274 11753 1521
13650 1521 -9850 -8147 -5570 -1195 1342 -5410 -2258 2529 -3610 -6658 -3557 -8027 -10474 -14065
13636 -14065 -12370 6086 24429 5590 -6521 -10422 -7454 -25241 -19984 -2311 -110 -7274 -29561
13623 -29561 -9658 -5975 -25119 -28110 -29003 -44389 -20049 -2272 -10156 -23218 -14218 -30941 -34139
13610 -34139 -26894 -14934 -15376 -18004 -28065 -30766 -19789 -2623 -1794 1464 6878 23451 15414 -698
13596 -698 17943 30102 8294 -1050 1843 -3643 3898 -11492 -9344 6816 -19492 -9212 6352
13583 6352 6399 1107 -9225 -15526 -973 -12788 -23143 4445 11002 4295 7309 6714 234 5808
13569 5808 -1807 -2593 -1267 -1971 8361 13521 -3569 10497 13231 433 -6231 -23515 -27128 -26495
13555 -26495 -27199 1677 12665 1967 -4301 -18489 -22711 -15788 -11928 -14719 -4659 -769 -11638
13542 -11638 -8752 -599 5109 23557 8458 -7756 -1073 2552 -24864 -8263 -15192 -14875 -13161
13529 -13161 -12117 -15145 -21205 -26963 -11401 -358 7733 6182 22523 15839 7682 -1508 5712 -7433
13515 -7433 -21034 -22418 3380 15343 21772 2866 -10037 -646 -6464 -19558 -27859 -34096 -20385
13502 -20385 -23664 -33020 -36385 -28835 -14309 -23323 -20580 4206 11725 -11119 -15460 -9767 8152
13489 8152 13890 14372 2910 -1431 3466 -6250 -22004 -37266 -32057 -12583 -8126 -14114 -17539 -2742
13475 -2742 -8539 -10333 -16031 -23582 -35903 -32709 -24891 -10602 6958 -13678 8139 -15103 -30608
13462 -30608 -37270 -39598 -33938 -14749 6212 14636 32818 15013 -8511 -20218 -33084 -36280 -34162
13449 -34162 -20758 -14767 -19586 -116 7275 2546 15101 28982 -4186 -29532 -49230 -41300 -12513
13436 -12513 -7812 -25922 -29568 -24747 -12585 12255 7285 -8876 -25154 -38750 -45717 -37221 -22694
13423 -22694 -25836 -12663 2107 -3660 -14138 -13697 -4139 6613 -18208 -36859 -42347 -57410 -43415
13410 -43415 -23528 10637 14375 5403 18128 10906 -18077 -35131 -24947 -14797 -10597 -3849 -4553
13397 -4553 -13742 -3758 8780 8055 2030 -15911 -20707 -8437 -2065 9854 8746 22891 40838
13384 40838 19254 6360 -1005 10190 15735 -16395 -41839 -47301 -59719 -46140 -24302 -17705
13372 -17705 -21357 -34 -8567 -9580 20814 27868 20415 9837 -10648 -2237 5647 -5593 -7386
13359 -7386 -16042 -12323 5669 -13136 -11811 9203 7654 -7629 -12899 -9041 -20023 -21305 -9729
13346 -9729 11373 6963 -8426 -8260 7254 -6991 -25948 -28149 -20526 -24993 -27757 -35666 -34290 -3813
13332 -3813 15206 177 -5900 3486 13799 4838 7087 2070 -11321 -15644 -13226 -23778 -11069
13319 -11069 1574 15503 31220 28480 24451 7722 -4605 1571 -3028 -9095 -13619 -15224 -26818
13306 -26818 -35293 -13994 9606 3060 13037 11173 7229 1071 4704 14687 2376 11938 6657 5922
13292 5922 4227 -1622 2194 -4274 7768 11843 3975 3333 5612 -1596 -15956 -25026 -26887 -26592 -36571
13277 -36571 -32267 -4175 19232 22942 9039 14627 18992 3427 -10507 15920 28065 31331 14101
13264 14101 16426 27393 21444 9965 6016 -6859 -20238 3520 1956 17140 25127 10002 16712
13251 16712 32528 22150 15491 -1641 -12943 -11428 -32679 -39269 -31020 -25121 -27952 -30734 -29246
13238 -29246 -4093 3378 -10254 -14978 -28035 -11593 -4460 -15643 -31509 -32695 -25855 2472 20673
13225 20673 11361 39987 45103 20377 10014 12034 9355 2420 -5331 -13486 12960 23074 14382
13212 14382 21202 20946 9341 -5098 -4935 -853 14539 13216 8664 189 -9123 -10090 -11843 9745
13198 9745 -2943 1995 2197 -11733 -16501 -16944 898 23082 16471 -4837 -23999 -30259 -11560
13185 -11560 -12059 -33733 -32740 -29218 -27772 -22242 4303 22753 25169 11999 8363 19704 10209 -7746
13171 -7746 5285 2433 -7111 -18370 -24674 -29544 -21117 -25628 -36410 -29050 -41490 -39536 -28739
13158 -28739 -16254 -19488 -12097 -13049 -11213 -11000 -19969 -37353 -45063 -36231 -21398 -28553 -29215 -12221
13144 -12221 18528 5411 9150 9619 -9239 -16628 -4360 -6110 -5941 -2344 2196 676 -4128 -3858
13130 -3858 -16673 -26320 -7947 10270 11296 17850 12528 3291 8292 28018 26195 36132 24152
13117 24152 -4361 -13715 -16045 -27955 -43036 -34492 -40475 -36262 -16455 11134 24006 24445 9041
13104 9041 15175 28762 37500 46075 16836 7948 7053 17198 12847 -2186 1001 10904 -780 -10514
13090 -10514 -2313 -11617 -13401 -13112 -13368 -7804 -9088 -13839 1317 3115 -18210 -35414 -9874 19801
13076 19801 1992 -5588 11886 13446 5066 2531 1862 -8011 -17950 -13443 -4246 3972 8706 -12402
13062 -12402 -14794 -9259 2524 682 11521 15487 11987 29358 33795 44480 34859 33391 27134
13049 27134 15917 22681 16744 -7935 -22383 -12066 -1690 -8645 373 5679 1179 5693 7437
13036 7437 807 21572 30309 19115 27949 23918 12049 -19334 -41017 -27042 -10609 -5144 -2252
13023 -2252 -1734 11631 6412 6514 -7600 -15053 -11419 -4071 -11912 -8125 -14373 -17525 -27187 -4425
13009 -4425 5452 11772 18768 20867 14594 -5962 -4684 -14612 -18012 -7161 -2211 -268 -3399 -15268
12995 -15268 -24355 -28343 -24832 -18958 -14119 -12936 9477 1115 -8438 -23619 -15458 3968 22220
12982 22220 36403 39458 26669 39897 21324 5250 -216 -3701 -5299 -26698 -23862 -35243 -49664
12969 -49664 -56095 -50535 -46560 -38962 -12334 -3223 -14425 -10278 1038 -6485 -21007 -10164 -26092
12956 -26092 -34726 -29803 -10568 -2882 1110 6640 10673 26230 25382 35985 36070 26428 36748 25011
12942 25011 7729 6734 12357 29212 39477 36771 14897 9912 4124 12299 16564 7917 14543 12110
12928 12110 -14726 -31604 -24394 -5592 -9975 -13030 11131 12883 33934 47855 31545 28451 18997
12915 18997 688 -6210 -1046 1799 -20676 -26703 -29827 -41685 -25500 -15810 18765 4251 -19607
12902 -19607 -2580 12225 -1170 -21444 -18794 1183 -48 292 14267 9409 -4898 16953 60508
12889 60508 106123 150802 140073 89009 41490 20832 10274 25343 33487 15551 6355 15307
12877 15307 13205 15298 10798 -2215 -18935 -36325 -4284 29127 18918 11011 2991 15263 4272
12864 4272 -3719 -2999 -16315 -16062 3238 24754 27528 33793 13096 7006 -7639 -4726 33042 37267
12850 37267 25776 16447 -7453 -7050 2428 6620 886 -2737 -1055 2763 -8673 -15814 -10605 -2345
12836 -2345 -18785 -15287 -22408 -33906 -22243 -29275 -34707 -15707 -20686 4659 31115 31894 32771 29515
12822 29515 21702 18420 3020 -24785 -8522 -14067 -27231 -26305 -23532 -391 -6987 -7338 -20537
12809 -20537 -23829 -19566 8827 12371 26781 44973 47114 10556 -6904 -9831 -12981 -16422 -9788
12796 -9788 -2776 -1806 40124 42649 19547 5203 -10797 -16379 -3483 10060 -7151 -19995 -11169
12783 -11169 -16905 -13489 5781 9507 28473 45988 48698 29408 30108 33038 14110 20297 29544
12770 29544 25437 17615 11637 8389 10302 12975 -1508 2168 -6289 9163 28429 22340 7651
12757 7651 -15817 -20815 9083 16645 5890 5889 -10463 17272 9314 -15309 -12716 -17476 -5892 17025
12743 17025 12213 -4234 -4802 -9612 4997 22999 17472 3868 9914 10748 14043 14309 23048 44174
12729 44174 49007 35887 11490 1579 19804 11439 9722 10975 13163 2498 139 -21653 -27120
12716 -27120 -23787 -6312 3414 9123 18069 10295 10702 5453 -3526 20998 36574 26068 28946 37192
12702 37192 33011 34165 25218 23228 7455 6320 15084 25473 30284 20557 20201 10591 14445 24740
12688 24740 13601 9962 13878 5819 2266 -1237 -15673 -12233 1707 -7774 -7705 -1994 -3318 589
12674 589 34568 23410 12549 29992 22096 26404 32064 29273 33379 31166 18728 14781 1874
12661 1874 -6800 -8945 -3546 4017 22728 19559 5598 10030 20505 4273 -5694 -23217 -13904
12648 -13904 3241 -3448 -3580 3733 13966 9834 14992 35791 36815 40263 18343 -9115 -6520
12635 -6520 14215 32859 23573 24176 5733 9498 16201 14585 4815 9041 2943 -1360 -143 -4385
12621 -4385 -31643 -28962 -20519 -16670 -19957 -14599 -13557 -11255 6166 19243 41532 38486 27009
12608 27009 20829 29588 34461 28205 49684 53266 8638 1987 -5826 15648 24428 19884 26248 44387
12594 44387 48814 36763 15374 17079 7199 -4223 6317 -12206 -12656 -3141 26534 40163 45838
12581 45838 56425 46909 44888 27559 27939 23136 37957 42239 23661 17599 34036 32202 30760
12568 30760 27590 31133 32831 35381 51234 50541 34436 13093 29062 36860 33953 30481 18925
12555 18925 29421 31536 17808 19826 42006 39958 29670 21269 22815 22200 43912 48456 42602
12542 42602 39289 27675 38011 38371 5557 7427 43873 53771 53186 59409 54444 50356 48091 33347
12528 33347 43008 50817 61187 64334 43608 32380 38951 33511 23564 13180 26306 22984 25574
12515 25574 15391 23189 43483 37390 24747 27563 39875 43900 39414 42910 39549 20760 13691
12502 13691 27528 42343 35529 39674 56784 58741 40973 23610 29299 47004 43354 10852 5787
12489 5787 22611 35270 47239 39968 43072 59375 74549 82214 67229 53148 52100 47414 40523
12476 40523 30606 25674 43675 36495 13461 -12785 -19862 -10307 3024 33733 56164 42783 45528
12463 45528 41499 44664 43924 50976 71076 74629 68610 47485 44376 49003 46512 61352 49357 52063
12449 52063 39210 40751 55916 62954 66536 66796 77062 76471 52152 37970 43171 59011 70836
12436 70836 61289 52362 46510 39924 19130 22868 14617 12708 7874 21484 41811 51999 43790
12423 43790 36118 33519 22202 38370 61287 50194 44943 59611 59234 52510 53460 59152 52036 56016
12409 56016 66352 60453 68100 62579 58016 65157 61168 50438 51122 47938 53721 71423 71987 65682
12395 65682 71373 70940 72132 47330 28991 34412 43252 40007 34017 29360 41373 39241 31450 23930
12381 23930 30437 63127 81716 76473 58888 75942 61535 67014 77084 76105 62737 54907 65584
12368 65584 59430 70660 72297 62907 48684 44069 32693 17068 25887 33900 29283 32129 19995
12355 19995 28366 29403 32752 46663 51499 41363 47841 59551 72460 73111 84010 101229 106007
12342 106007 91935 87862 82731 55370 63947 80798 80487 66934 67897 69734 82447 90752 84657
12329 84657 56118 45688 65166 64929 75212 70021 65309 81585 96751 92709 82896 91933 92832
12316 92832 77273 95766 102243 90656 98097 106288 102102 104619 108221 107355 98293 95129 65502 52236
12302 52236 54398 57827 70084 93804 103761 116689 113619 89335 95504 82862 77280 79831 89955
12289 89955 81444 74126 89786 108143 130470 126688 122659 105302 93851 97832 111652 114060 96367
12276 96367 93672 94842 106641 107709 109394 104386 95828 110638 95751 112780 116341 105164 107318
12263 107318 100709 110640 118994 128518 129586 138285 130316 120462 93580 89834 110668 128649 138699
12250 138699 123745 139427 147401 128832 134724 152568 141651 140518 148801 159353 145436 134276
12238 134276 130761 117533 118606 132336 119762 100444 110331 126377 132588 128958 112933 118612 116731
12225 116731 117644 120319 137667 152011 146877 134789 140337 150433 168174 181518 167963 167038 195254
12212 195254 211577 192320 177023 184245 173025 175005 168388 147284 153749 148630 137307 139880 159399
12199 159399 160362 174987 176599 182599 206551 210619 206930 168691 167490 172676 177617 182417 170138
12186 170138 181588 168534 182326 225844 230316 239027 243321 244694 250528 246583 232053 217911 195003
12173 195003 195361 208164 220773 239850 225526 203345 202438 204350 223125 225358 228326 234919 255341
12160 255341 257711 245829 247539 217797 219563 236530 249428 254076 251715 241167 243057 263521 277315
12147 277315 280559 260229 279324 282213 275936 278021 278341 291809 312785 307333 293552 277195 277151
12134 277151 290697 301798 310780 318895 326408 328597 320021 306663 305831 321614 328741 341213 347180
12121 347180 345582 329320 336312 349228 371538 374611 370908 380884 387646 399391 400796 412070 413155
12108 413155 402026 418388 412269 411910 422550 419131 408146 411770 418329 412105 417762 443439 454467
12095 454467 478384 494024 479628 477147 487417 490443 500441 496160 480373 480175 478363 484283 475884
12082 475884 487994 503515 510335 536642 535867 541178 549306 547500 534889 566356 564143 574038 599080
12069 599080 620230 614773 621259 634686 631065 652809 672087 663354 658860 648021 650492 672349 712276
12056 712276 695923 674086 667238 680602 687176 704480 731885 735157 733781 741062 751488 750257 754880
12043 754880 759822 767408 766628 771265 798103 832993 845148 850923 870977 879248 880899 901901 907820
12030 907820 904327 887805 883262 898482 907759 914858 926065 934360 942877 986964 1001985 1006739 1025897
12017 1025897 1035147 1065844 1110493 1122854 1105035 1091337 1100500 1137124 1171480 1175452 1178804 1171576
12005 1171576 1182405 1208633 1231750 1246624 1251476 1259521 1280054 1292707 1315545 1338341 1361381 1366335
11993 1366335 1353179 1382459 1427593 1429520 1427554 1437487 1444328 1460209 1473212 1502173 1516141 1513594
11981 1513594 1518218 1539175 1545763 1552344 1579820 1617604 1634293 1651169 1658852 1672331 1690414 1694099
11969 1694099 1691011 1737403 1777393 1781748 1796014 1806189 1808272 1801156 1825956 1843920 1866449 1870877
11957 1870877 1864897 1844814 1871878 1893249 1887751 1909123 1953634 1951863 1930045 1938498 1982520 1992828
11945 1992828 2006027 1995526 1992919 2024246 2029511 2026614 2024378 2027313 2034485 2037984 2027519 2036797 2048442
11932 2048442 2051940 2019545 1989841 1984984 2000084 2010564 2007617 2004117 2016618 2018388 2009657 2014142 2010149
11919 2010149 2015785 2007642 2004285 2001732 2001979 1981320 1956088 1943963 1921667 1923798 1928178 1933903 1907637
11906 1907637 1888660 1878891 1870027 1853145 1838855 1818374 1825562 1820943 1790335 1789142 1800120 1781661
11894 1781661 1765760 1764814 1764805 1736347 1717355 1699632 1678284 1657917 1623635 1615255 1615405 1609410 1581256
11881 1581256 1563294 1538057 1504520 1476753 1469742 1466358 1477459 1458313 1441217 1410672 1378158 1378685
11869 1378685 1389396 1393197 1385449 1367853 1354911 1310712 1275111 1270087 1277428 1256671 1237388 1233008
11857 1233008 1235842 1236084 1208998 1201834 1184846 1158869 1135603 1130788 1133629 1129663 1123191 1119211 1104706
11844 1104706 1084230 1045463 1027399 1021739 1008335 1000365 1009712 999005 988810 995418 978044 953079
11832 953079 950244 925569 918633 899344 886415 906248 917286 888583 860250 858226 844450 845923
11820 845923 845365 838389 847461 848484 837820 819378 789127 790016 788999 772102 773256 759885 725456
11807 725456 694236 683721 688226 682568 657718 657906 651218 628588 612235 632999 654338 650849 627434
11794 627434 612418 598317 603306 595422 568306 558017 562759 584492 571283 571790 578634 583677 588792
11781 588792 574441 580023 568333 563431 568436 576682 570893 555877 532318 507994 510885 504320 481823
11768 481823 459771 454221 461755 448137 435409 443112 447389 451944 460939 455125 488314 540103 573392
11755 573392 578696 547711 534269 499087 472047 505768 581193 696083 746879 680360 570107
11744 570107 505337 469350 441601 442022 437663 421603 410924 404924 381574 376991 375343 373536 371415
11731 371415 381081 384211 345683 335018 334840 351633 338672 337306 325875 297037 309283 334077
11719 334077 351926 350958 337935 316245 303693 290369 273522 273532 266021 259474 246880 253582 245265
11706 245265 254640 258102 262862 278498 296209 313138 295095 246308 231430 249044 274683 283927
11694 283927 283831 276838 257590 236735 233764 236546 211971 209645 217870 233508 248433 258930 271911
11681 271911 274173 278859 262111 231462 225451 229837 249402 257019 240723 227315 215469 207842 198508
11668 198508 199254 195859 192952 199007 204327 214843 220906 232249 213671 191826 197736 216522 234153
11655 234153 213049 223950 214681 206706 213636 217318 208927 200243 216458 211255 205311 218965 239761
11642 239761 259988 287637 318537 366102 440591 520085 637448 737911 775985 730463 617730
11631 617730 508685 413258 358904 341828 317658 301211 281904 250870 218847 211321 212875 199139
11619 199139 184168 179005 172227 174916 173733 176909 171598 168249 168228 164813 143997 124369 104816 110129
11605 110129 101964 109500 132212 151735 150970 142011 123860 116071 144110 147585 150595 148734 158811
11592 158811 164563 152535 143566 148411 129639 110016 110852 101980 80302 61456 73310 95446 116474
11579 116474 132940 140177 127634 115152 112045 128109 142367 126278 100065 118290 131209 126162
11567 126162 118023 136778 140537 125478 106043 96505 83844 102494 104416 122511 106045 104622
11555 104622 130545 146163 143951 137198 117921 88794 88855 109367 82928 73887 82177 83839 68556
11542 68556 68161 71368 69583 69386 84653 92296 88876 86470 77418 77906 80836 88348 94275 95066 94062
11527 94062 76797 96918 118382 128233 125438 105081 77578 76072 79700 74971 59756 74942 66784
11514 66784 61709 71292 71478 46089 45500 46229 58265 66051 72874 56859 38937 43701 59719 53735
11500 53735 56075 61892 75761 84217 86314 79624 91419 90506 59407 53566 74621 63390 44514
11487 44514 42084 43124 57520 70520 70015 73747 70616 65173 65805 42764 24591 14947 22832 42337
11473 42337 61702 65585 66096 63903 99418 102019 87898 85718 92356 91796 84206 71557 63595 54446
11459 54446 37850 16761 26414 31044 39720 31247 12175 35467 43481 28034 22880 41797 44413
11446 44413 38918 24484 28564 30183 50976 52870 35591 39627 70707 82769 87062 73341 47391
11433 47391 37430 31615 36640 40051 40377 37834 47370 56984 67422 51608 33083 19029 32422
11420 32422 44173 34308 12049 12981 16057 12581 21258 21357 15451 16659 16122 22105 27074 35853 55976
11405 55976 61869 61229 46710 28096 19186 27189 43132 41134 21987 27291 35679 39380 27324
11392 27324 19005 38656 58402 47769 32072 41323 46690 25787 29501 36250 23298 40287 42545
11379 42545 55646 61889 62173 44960 41360 27996 28048 39944 27458 15262 2899 13545 42962
11366 42962 51536 45923 35612 39116 34543 11066 -3629 -2018 -5236 -18014 -16779 11589 11506 21176
11352 21176 33107 35865 40085 29344 14069 -6640 11917 34526 38354 47258 20960 -11039
11340 -11039 -6243 18720 23809 22351 40037 29775 18459 23876 9354 -9171 -15898 -23385 2872
11327 2872 9034 20301 25223 26679 27688 21374 22021 8767 -20160 -25855 -4572 -678 -7355 -6240
11313 -6240 10393 10391 2335 587 22869 18800 4140 7697 9121 -12086 -19033 -4760 -4779 -13615 -7470
11298 -7470 11449 -8948 -18520 -10171 -10501 -1236 30235 26945 -2975 -2205 21924 36310 38256 43424
11284 43424 41530 24463 7945 16405 26332 10299 -8602 4399 12993 16366 20446 -571 -8937
11271 -8937 -1332 -14519 -27974 -26197 -20815 1512 124 -1874 4064 -8174 -1188 -711 1551 -14913
11257 -14913 -30950 -41869 -24832 -29679 -31683 -15588 15899 35927 45498 62361 42763 25661
11245 25661 23202 15008 7525 10461 10845 -15487 -10606 17509 31312 34729 24589 7454 713
11232 713 -14259 -25884 -30906 -41867 -21875 -11538 -18951 -5401 4876 -11255 -10964 10381 -3740
11219 -3740 -18979 -46285 -33029 -32118 -1731 8690 -4764 -2702 -4162 -16932 -26400 -18347 -15938
11206 -15938 -21273 -17984 6151 21649 -943 -660 26894 34758 18205 5311 2702 -1534 3327
11193 3327 -2295 -12088 -39476 -51754 -50481 -39211 -16263 -16256 -29127 -28210 -7874 -2826 -20858 -30729
11179 -30729 -30617 -21326 -8657 -12317 -12475 -37168 -40011 -19445 -14630 -35233 -36389 -24864 -14973 -3833
11165 -3833 977 -27172 -46858 -43343 -24287 -15689 -24594 -49537 -33787 -40686 -57936 -55715 -45053
11152 -45053 -40581 -52447 -52908 -45715 -36150 -56964 -75567 -66758 -49955 -25241 -15797 -16801 -16441 -12695
11138 -12695 -4568 -1691 -28061 -34376 -46831 -36074 -23191 -19089 -26432 -42932 -52494 -37117 -30393
11125 -30393 -22162 -24351 -30415 -36905 -57679 -66110 -61123 -43986 -32095 -37103 -43711 -46480 -39475 -27338
11111 -27338 -31083 -38899 -53338 -75270 -70610 -68982 -57043 -50576 -52491 -63175 -59587 -28486 -17199
11098 -17199 -16479 -24853 -25870 -54153 -42779 -31499 -9483 7612 16735 767 -11609 -10333 -17127
11085 -17127 -24630 -42654 -48548 -39450 -31335 -32193 -26176 -26177 -25138 -30561 -38634 -51634 -55742 -35366 -29384
11070 -29384 -32623 -27954 -22069 -29952 -29901 -20118 -8334 -7673 -12525 -13169 -32159 -34869 -26394 -18879 -24332
11055 -24332 -17274 -5605 -15512 -3846 8089 15399 21301 10090 -1617 2453 -2667 25320 60762
11042 60762 68489 85087 101374 132296 170773 209961 293682 386621 520895 740476 1065780
11031 1065780 1454228 1612880 1398976 1063234 789651 610906 488521 395350 318570 263285
11021 263285 243943 213887 184738 177246 162586 142117 152803 185802 194070 181102 163408 130045
11009 130045 90703 68922 62523 50082 41619 51157 65212 86419 91668 63380 33102 24934
10997 24934 30033 27386 49082 45673 30347 39116 38489 28055 32227 32693 34739 19516 -4182 -1767
10983 -1767 -19111 -24732 -26745 -41920 -51109 -47934 -41908 -75547 -91899 -115117 -113645 -90783 -82558
10970 -82558 -79398 -75359 -73166 -57228 -43885 -43654 -30695 -40888 -50145 -61738 -70873 -69693 -64263
10957 -64263 -81966 -83935 -62331 -50685 -52880 -49803 -63317 -73053 -74394 -61025 -66787 -79929 -82250
10944 -82250 -75839 -75135 -80392 -78147 -64900 -44275 -50659 -48645 -39115 -63757 -92200 -103014 -122744
10931 -122744 -111194 -104711 -62546 -28232 -12195 2364 -38076 -66694 -67231 -60476 -62402 -62898 -40378
10918 -40378 -15943 -9475 -14295 -34982 -55315 -39623 -33595 -47369 -51592 -44004 -57121 -58950 -32578
10905 -32578 -17656 -37419 -50297 -53447 -54870 -47091 -63302 -74947 -75562 -65702 -30718 -16674 1077
10892 1077 12269 -10471 -4105 20433 35481 23783 24013 29336 31825 40854 50818 69055 100523
10879 100523 153789 194016 196002 175948 120920 68829 21393 -19314 -39221 -61532 -83790 -77019
10867 -77019 -75580 -86790 -87079 -87732 -103730 -89555 -76484 -71925 -79168 -74542 -52199 -45597 -41777 -54960
10853 -54960 -74385 -85524 -53568 -43635 -52818 -49633 -68969 -95765 -81823 -81335 -96476 -90212 -91450
10840 -91450 -109363 -115569 -95216 -79924 -76759 -75888 -81903 -91592 -115885 -127957 -124802 -120037 -113904
10827 -113904 -102616 -108383 -126545 -132194 -130029 -136782 -133284 -142720 -155652 -178816 -222542 -259711 -314986
10814 -314986 -356783 -331157 -238912 -145621 -84889 -32534 -12195 -35817 -66289 -85081 -58063
10803 -58063 -65878 -95989 -102811 -121176 -149104 -160936 -168831 -202438 -225130 -200010 -188888 -166335
10791 -166335 -154800 -170567 -183111 -197212 -179580 -165588 -176610 -174602 -166181 -174629 -193014 -208346
10779 -208346 -206571 -175380 -179230 -197086 -192883 -173665 -160079 -158481 -152169 -126557 -124711 -158664 -191455
10766 -191455 -202000 -225069 -237749 -247151 -269040 -290603 -313069 -346827 -385645 -431073 -484992 -548321
10754 -548321 -638298 -756470 -780088 -568610 -125168 263888 458230 483915 430453 393517
10744 393517 338307 295031 264198 230579 211561 167883 134865 100152 84662 71927 47894
10733 47894 29046 18796 25607 32438 22623 39405 41379 19449 20593 294 1045 19628 32433
10720 32433 36725 42581 48399 46764 63304 57545 22495 -1511 -3922 12374 46543 76063 103586
10707 103586 93589 94572 91009 104158 114862 90468 91633 92652 96226 105288 143691 178851 161565
10694 161565 150731 138314 122210 136444 151033 181361 205489 229276 258155 283806 295350
10683 295350 305443 272800 244107 254222 284262 308551 314998 328229 350892 374826 392352 400973
10671 400973 414806 435309 425867 453445 497331 568722 646796 714917 763758 794532 831718 904931
10659 904931 981997 1054846 1147907 1238984 1349031 1506977 1701561 1870010 2027360 2207746
10649 2207746 2423407 2731590 3197273 3806216 4474599 4877465 4907156 4950868 5194119 5623290
10639 5623290 6264214 7145218 8305922 9785800 11668241 14161978 17527542 21855934
10631 21855934 27113035 33984473 44244706 60407915 86331999 127730793 190633109
10624 190633109 271614166 327231492 295141808 214862409 148412406 105525563 78623428
10617 78623428 61302257 49741683 41737920 35805470 30956053 27091762 24346291 22660879
10609 22660879 21904153 21764441 21679283 21050773 19782609 18316753 17127579 16441768 16357347
10600 16357347 16847259 17655794 19041418 21396458 24343948 26583185 26711177 24790305
10592 24790305 22142755 19922184 18520939 18071557 18649238 20328754 23231677 27251005
10584 27251005 31587580 34315466 33618173 29957915 25539558 21868570 19356337 17929803
10576 17929803 17523214 18100213 19607302 21861117 24145105 25104492 23687314 20493273
10568 20493273 17025634 14221571 12289046 11123555 10575390 10509849 10871223 11482814 11983225
10559 11983225 11879159 10898172 9290985 7589393 6161705 5082692 4259155 3650015 3154998
10550 3154998 2772838 2483307 2257463 2074673 1937558 1830861 1690775 1573346 1501185 1437477
10540 1437477 1352162 1291138 1223895 1145751 1096729 1051300 1004829 940423 887914 843823 810668
10529 810668 781159 723281 712853 709453 686979 660017 638649 606086 571913 573598 576405 569737
10517 569737 576122 581875 555283 525785 497405 488517 473583 439967 410833 378962 344707 300698
10505 300698 261773 216659 193750 163993 133125 81193 11325 -56656 -74142 69009 407170
10494 407170 690960 788988 753699 720034 684239 653983 627349 621902 609882 578890 553668
10483 553668 531961 489161 461693 440805 430208 400157 360374 361004 354787 357598 367608 367804 392253
10470 392253 395213 397306 398254 410117 412584 395195 381485 380420 363476 337713 351098 350775 354317
10457 354317 347274 323473 321060 343938 369943 398869 423663 412655 380917 361055 370840 355598
10445 355598 314454 325676 330195 347830 346251 321415 318140 296877 297750 326518 381052 481008
10433 481008 585189 624340 604969 547369 488876 444425 412672 411518 410743 408728 377019 354219
10421 354219 343161 349739 367199 383448 389049 366819 341889 363502 376196 383644 367707 381222
10409 381222 395482 418694 472035 512882 518151 487406 455767 433589 472590 520928 581139 642251
10397 642251 657677 601956 529162 465003 397493 353689 358029 356001 335052 303976 298533 295086
10385 295086 297745 305306 293390 279030 286991 288208 282274 288708 258546 250414 264912 269027 283088
10372 283088 280536 275941 265294 250298 229284 229698 227542 223318 223431 207852 206648 205567 208106 234446
10358 234446 278294 318614 337593 355848 374117 358024 313512 284534 254292 231189 230151 212609
10346 212609 187269 179673 186852 178305 178183 178474 171206 170722 176825 176290 177624 192381 195518 199205 174220
10331 174220 155408 142972 167967 176155 162275 139160 153877 148647 134750 129222 125937 112646
10319 112646 130204 110668 124368 190748 245354 243723 234267 222725 206167 172618 145089 139346
10307 139346 154329 185555 179433 167568 144365 134850 119942 123789 144088 149162 150535 150434 150415
10294 150415 150193 156439 152777 153859 159774 151401 146526 149697 163197 154801 146429 153688 131928 139898
10280 139898 168636 161704 152522 153456 160223 164891 171016 177359 184039 179493 165675 153484 157883 146074
10266 146074 159212 167654 160607 147620 131594 139598 167148 181065 168222 149793 155414 156633
10254 156633 141461 134973 144553 148129 124618 102989 105049 108307 115242 128471 143312 137716 138712
10241 138712 130860 123028 140668 165988 176272 186467 184471 171443 168421 154859 162427 171870 173553
10228 173553 171045 161829 165600 171766 179576 186556 189099 213428 235570 240547 264289 308816 380176
10215 380176 460167 576067 792330 1126383 1510433 1730991 1564104 1212875 909500 692783
10205 692783 541059 452741 400170 356302 306137 277200 253878 233371 227208 235788 245207 230300
10193 230300 198595 184060 174575 154775 148808 137196 147384 139787 101201 86405 81334 93831
10181 93831 104907 102367 115535 113543 120149 134890 145542 134243 150317 159240 176525 189382
10169 189382 177594 170546 132028 125246 138024 155095 172062 170689 185979 227480 244876 235946
10157 235946 211899 186229 187453 185633 171949 172709 178609 196207 227715 245077 270782 284677
10145 284677 296024 301675 280549 264616 248983 262213 275148 309606 371983 464004 552920 578897
10133 578897 502681 393308 296986 247832 226805 217690 213944 181743 151031 161364 184769 183808
10121 183808 162642 153148 144158 128402 111467 130431 117716 113177 115043 101309 103272 115743
10109 115743 118629 137580 138694 130764 135991 141786 134378 104425 101009 92414 117028 131868 153690
10096 153690 182930 222255 244107 209979 194655 179258 138905 112538 93351 87676 75668 64896
10084 64896 67037 69614 77587 105848 106525 112220 112893 118763 124673 126549 128956 110906 89729 87826
10070 87826 87264 86610 80672 68081 85591 96543 106625 104984 102384 102206 113783 116468 99827 97203
10056 97203 117885 104277 76933 95478 110092 105493 107914 108190 109039 98172 101959 100611 65657
10043 65657 40734 50250 53836 42350 37741 59184 87360 89299 67215 73369 88809 92991 77487
10030 77487 69277 76799 70530 84980 104017 97894 83444 55003 54821 48513 45402 62021 55396
10017 55396 46668 47201 49574 64708 63013 57881 53820 59873 81300 92399 101655 89767 97418 92282
10003 92282 97022 92893 80134 74772 42737 52250 68228 70300 72120 81238 85868 77608 58219
9990 58219 43914 63904 69346 77961 72076 59717 61537 63619 99427 96515 74641 84015 111132
9977 111132 94650 94938 74188 49681 55482 65868 70289 87632 85274 64264 66462 73884 91373
9964 91373 106942 103850 82612 97042 90924 84298 84393 80946 76727 65873 59010 76484 74376 66477
9950 66477 65853 64839 66299 73717 73369 86699 85997 98560 104771 115515 119794 116629 103016 89944
9936 89944 87703 88550 102057 89762 75098 57859 38556 27641 15422 16688 30822 34491 39086
9923 39086 57027 78494 109817 158222 234096 227364 143388 95835 79273 74485 84235 96688
9911 96688 92527 71625 53772 56313 70185 64834 65734 70546 60676 85576 83874 81106 64662 50746
9897 50746 60779 87317 100832 93843 84289 75008 45508 21533 1595 -4145 8629 32745 54973
9884 54973 62669 54515 56288 66153 57950 60099 57719 24770 12341 17885 55739 77258 83410 89996
9870 89996 88268 84519 75510 41763 33195 27544 51350 56024 66790 59119 50211 38215 56861
9857 56861 74433 81032 105093 118500 126798 115783 114379 139191 152013 125187 108888 112120 129661
9844 129661 137190 136216 118305 120663 134903 154425 147453 135745 113134 108623 90834 84994 96884
9831 96884 86156 82115 78443 70066 72102 66903 53413 41787 59642 83735 72855 78133 79349
9818 79349 75449 66627 45784 38807 37274 35857 40067 24436 38688 29309 24603 60467 74683
9805 74683 65403 38934 20656 14977 21747 22726 23372 14337 11539 40197 47872 60077 79393 81056
9791 81056 64483 57590 87774 103130 84195 62008 53449 68015 56768 54545 46134 41069 36655
9778 36655 33272 28803 30262 51215 58016 62708 41481 39640 27075 10000 -5101 -14939 -596
9765 -596 26763 46090 57730 77086 76948 76974 71800 66104 74429 74843 44432 33191 48418 43136
9751 43136 46744 33515 33787 34231 26764 17449 19727 33135 20896 20996 24076 31741 44638 31812
9737 31812 24007 34889 50792 49120 35211 16317 11979 30858 53885 59450 26022 13998 25249
9724 25249 21426 7190 -2649 17680 34018 41151 30103 7863 29238 27245 40575 37355 45042
9711 45042 44176 28779 45191 40072 19688 3028 15620 34653 48434 40653 24047 2717 -1264
9698 -1264 30666 30043 34243 34950 21127 40574 54280 44247 29113 44122 45112 65894 64113 50493
9684 50493 46583 53160 49006 30525 17117 7884 13052 14520 18072 30960 9307 8484 4963 16932
9670 16932 27773 32128 58890 67618 52879 37758 43911 50061 49053 35608 24988 28100 14628
9657 14628 8298 33558 54054 57131 54764 59852 61067 69856 81827 75659 81296 99714 153745
9644 153745 289424 446984 455078 324135 207982 142466 99019 65885 60715 76599 93065
9633 93065 69249 49457 46000 59337 54272 55014 54529 52620 44779 44318 51780 62666 74651 82284
9619 82284 77096 59816 55952 59849 58502 44128 50372 40240 30774 44018 53855 43705 42775 51132
9605 51132 41076 15807 19042 13465 19547 33583 43956 34808 31768 14185 7697 16136 26583
9592 26583 49380 53777 43231 40519 36531 39279 32152 25361 11510 11476 17628 35588 41530 69977
9578 69977 86197 83390 65763 28841 -8361 849 4936 30374 44052 42529 47276 56613 61630
9565 61630 47296 59664 51803 49752 47717 38117 25635 29619 13919 187 1331 8734 20284
9552 20284 33532 46504 42040 40176 24828 26456 35103 37554 44369 50715 53420 42387 40888 53305
9538 53305 40807 26657 41502 59534 46069 36857 24663 17265 14285 8996 15201 44298 36339
9525 36339 40211 54912 48024 32908 28520 22628 35340 24453 25855 53854 71405 71124 53994
9512 53994 22160 14856 8165 -339 -8365 -5424 9461 18324 21618 22545 40233 47282 80594 66135
9498 66135 49507 33658 13341 19495 32681 13561 4647 17608 21397 25874 52091 47454 37294
9485 37294 30382 31258 33312 40962 44436 31753 17897 32683 26114 21050 21842 14150 27512 48332
9471 48332 37665 21741 27518 10026 -7349 -10840 -9648 -20939 -32849 -20743 -17875 -8115 4686
9458 4686 -4441 -1647 20316 31835 28284 -1268 -16875 -13749 -5939 7908 12046 22510 1929
9445 1929 -1731 8302 8432 15682 44381 55677 52784 25596 8834 2416 -11150 -19656 -1428
9432 -1428 6769 21731 29509 30660 32097 42659 41213 47792 55806 61376 48890 23219 40562 62169
9418 62169 55153 68868 78616 73953 63018 39428 31301 41010 57916 59928 58841 60734 53770 34273
9404 34273 33420 17506 -702 3883 6744 10444 6729 22432 40254 35748 34361 37045 23353 22314
9390 22314 1331 10754 26375 15508 -15755 -27118 -23463 -16529 -9970 7287 15014 5165 4379
9377 4379 21913 43802 41218 33091 16832 -3458 -761 18432 32820 46001 57538 57290 32261
9364 32261 -409 1351 18390 11801 5999 34237 48243 48752 53715 42214 26459 36029 38646
9351 38646 26525 28416 25579 34482 34080 29937 48043 56007 63892 53613 30789 12881 23989
9338 23989 47714 44470 42496 43446 45295 42162 51437 43864 45026 33782 29434 34275 26797 26092 19930
9323 19930 28692 21807 -1210 -11584 -13995 -4720 -4077 -2228 324 2594 7664 32225 40287 23904
9309 23904 14411 14609 18752 19312 18585 21120 18385 28441 31169 21965 -2205 -15418 -3765 24980
9295 24980 31933 37764 46147 38270 22001 12878 17961 43894 32544 24536 4467 300 9355 7862
9281 7862 1615 -2452 -2920 20032 9116 18474 40199 45432 29619 7936 9815 19777 18126 14617
9267 14617 9996 21612 38606 12484 -11128 -236 8098 11480 16006 20592 12168 22963 31364
9254 31364 36882 41491 29994 11866 20134 36447 27743 3964 1321 -13233 -11578 201 17694
9241 17694 26277 36303 42244 51453 52941 51589 52647 39974 22022 20791 35329 45673 46003 31271
9227 31271 30070 19012 -2041 4786 10817 17284 1918 10266 24842 29897 33568 556 -6642
9214 -6642 -1730 840 6797 -2337 4814 10591 23771 36895 44931 53927 42267 33627 68739 68549
9200 68549 47782 46508 35083 15380 18260 30565 25919 7920 20463 22286 27747 588 -4882
9187 -4882 3605 13888 19874 905 6080 13186 5376 -9304 -4666 4556 19860 31640 16201
9174 16201 -515 10666 25731 14845 -978 5576 17897 -4245 -24518 -19617 -27879 -13358
9162 -13358 14178 28133 33325 45624 61772 45976 39091 37560 28206 21301 15989 -6050 4545
9149 4545 28820 21341 4246 8556 -1949 4287 26503 13286 -10377 4163 44713 55025 44309
9136 44309 45760 37545 16556 10243 -6160 -6628 -6618 7365 563 -4088 15139 25719 19822 6979
9122 6979 4937 18112 36712 28935 8219 2368 -894 -6889 -13018 -5980 -25585 -28793 2794 13667
9108 13667 6055 4077 15204 32860 18329 6234 12561 10096 17544 13109 1902 17268 29786
9095 29786 26824 17004 5963 6812 21321 36990 41642 28028 16062 22609 34905 33391 44815
9082 44815 54032 65507 38788 11917 1046 6167 -1131 3620 1049 6493 4400 -14002 6178
9069 6178 16200 21062 22543 8667 13466 20157 1758 -6703 -11971 -11362 -6919 -7319 -27442 -27985 -20532
9054 -20532 -36912 -30950 -18780 -6826 -3840 -764 -21499 -17361 -4135 -14914 -13409 6120 10884
9041 10884 7487 9737 5653 -8225 -30639 -8859 -7459 -20408 -4666 -3621 12871 29660 38225
9028 38225 39658 37674 21804 28452 25301 33948 47390 24112 -1972 -4065 4870 13430 -13666
9015 -13666 -30763 -37569 -14306 24109 33312 17326 9156 2323 -11600 514 9687 3511 -1947
9002 -1947 7112 15180 15483 2959 2131 18577 27048 14928 14018 3930 -24044 -14253 1475 11611
8988 11611 22954 20860 7281 13802 27519 29749 20460 23215 14889 9772 10834 7561 6189 20694
8974 20694 19682 5595 -7071 -6382 -32096 -26771 -24079 -17216 -25144 -16317 1485 16652 37623
8961 37623 22513 5352 -11067 -8262 5586 3834 13121 10642 15062 29457 23647 14917 24813
8948 24813 31937 21650 4756 11635 23183 16817 19337 26129 30588 40491 31800 20739 17944 8026
8934 8026 -1613 8112 15044 13355 1222 18907 20817 21321 22296 17299 10506 13662 18213 21322 9344
8919 9344 1061 -7310 -16200 -10738 -4467 -10421 -16109 -13509 -7963 -12973 -1868 6247 3449 2031 29509
8904 29509 21424 -9065 -926 12728 4504 -12097 -10786 -5198 -5101 2575 22186 24089 32018 38628
8890 38628 41135 25978 7238 11063 5598 -3540 6824 6478 17647 38502 13778 90 17279
8877 17279 35251 36285 30566 26409 9506 5719 1412 5098 4261 4136 18071 18585 3614 -20550
8863 -20550 2577 16613 24995 34782 20499 -6299 -11713 16247 27522 29312 25866 6508 -4971
8850 -4971 5989 13686 16453 16883 6350 2306 -4332 -14456 12503 41439 38078 22119 21352 21920
8836 21920 10635 7137 9003 27254 17209 -7361 -29456 -15564 -6747 -16652 -10892 -1889 2220
8823 2220 -6022 -18714 -12637 -8322 6405 19283 35838 40894 49223 52604 30044 13670 -10668
8810 -10668 -24344 -24056 -14568 -6893 4619 6809 16221 36380 38639 33413 34154 12943 24383 18688
8796 18688 3397 -13609 3034 17052 26049 45928 36764 10460 10508 6624 -15741 -18214 -11099
8783 -11099 -5889 -2050 -1988 11585 8109 27090 30866 27837 36294 28956 13112 -12421 -13337 481
8769 481 8831 7089 7869 6063 11855 4951 -6779 -6772 6866 -5011 -4375 -6630 2187 20845 -392
8754 -392 -4116 -6171 1170 -2121 6923 12716 31552 28481 19761 -6269 -1179 12246 -1286 -29198
8740 -29198 -26738 -8766 1118 -1698 -9118 -27682 -17364 -10188 -15007 -20858 -10994 4104 2162 6698
8726 6698 24959 37169 26650 8873 -1978 -11873 11715 16856 12312 21909 31443 36419 34996
8713 34996 22557 9045 -6149 8057 12157 -3177 -10136 -15520 -9201 1181 -2482 -5705 -4233
8700 -4233 -12859 12057 19591 22899 18076 3116 17568 27389 29045 40934 23069 -5173 -14361
8687 -14361 -4282 -3900 6434 12560 26098 40367 43153 41382 21107 8717 7158 292 -49 5083
8673 5083 31357 26731 9155 10322 31358 38916 28184 15280 10113 25853 18507 16167 8500
8660 8500 5325 15197 20165 26557 11174 16495 12503 774 -4033 6112 -7016 -17067 -14242 10876
8646 10876 8016 -5031 2629 -3123 -1952 -12438 -8945 -3698 1138 7185 -14297 7562 21199
8633 21199 35457 16949 5107 -10607 -19199 -17311 -9060 16541 12294 -239 1794 6515 4618
8620 4618 13566 19940 24963 24710 15794 -518 -7960 -7890 648 12294 18582 5488 6855 10258 -4261
8605 -4261 -23151 -20094 3724 17848 12692 4094 18226 12622 -17075 -29334 -31920 -94 11091
8592 11091 -1348 -6796 -3814 -4837 -7452 8399 -1839 -8682 -1856 18376 17494 31119 38870 51315
8578 51315 57812 45452 34058 32602 51714 33148 34192 24747 20696 29218 27776 10966 5910
8565 5910 9089 3769 -1692 4282 20369 48077 59498 52011 41821 44677 39968 30612 42489 47378
8551 47378 32896 32525 35694 21247 10836 8135 -1508 10272 14886 1960 -7895 -15783 -22114 -34550
8537 -34550 -28178 -12147 -13139 -4398 9554 -8048 5159 15509 26782 46248 33875 30756 15966
8524 15966 4155 -26263 -9329 -1619 3742 8102 8002 18239 25395 618 -5266 6655 -4878
8511 -4878 8507 18582 4688 -5962 6092 6287 10025 3382 -8140 3902 27626 24894 28042
8498 28042 25404 21960 25525 28190 15857 13439 21096 1708 -1943 10622 12257 9182 19018 23046
8484 23046 28062 27163 4785 8724 26390 11802 1692 -6469 3606 24863 19654 -4454 -14988
8471 -14988 -2731 21765 27396 24031 7290 2349 -13529 -34603 -53420 -33952 767 3276 -9048
8458 -9048 -7577 -5730 2614 16638 9593 9298 -1591 -24549 -24716 -40780 -41874 -28139 3628 25035
8444 25035 32764 19054 581 16473 31079 16013 10655 6356 8309 23162 39948 32262 28935
8431 28935 51195 48822 35186 21898 6997 26924 29161 37037 36492 40377 34470 24174 25231
8418 25231 20809 24400 31116 30944 27807 39862 26817 21740 2667 -227 9274 12319 271 -5300
8404 -5300 -10151 7230 26335 43978 28806 39778 47563 27976 27987 28417 15312 -9179 -4703 -10262
8390 -10262 -15091 -14878 -12719 -5635 2279 20350 2713 -8168 4793 12462 13552 18683 12565 9489
8376 9489 3391 12319 23600 14081 6547 2439 21816 24687 21993 24043 43968 15619 4525 3705
8362 3705 4191 17395 10162 6171 21615 25305 16395 8699 9021 15230 36585 39962 38315 43000 45362
8347 45362 24645 20163 25114 22032 11795 6812 11589 14440 14478 27100 18035 893 -2472 3837
8333 3837 -12347 -17648 11145 21920 24309 27262 16430 1178 -17163 -16371 -3679 5619 25704
8320 25704 24934 29468 40699 32865 24492 41267 45505 52723 46203 41929 43177 42368 37462 47483
8306 47483 56745 37458 10341 6426 5743 -8069 -13711 -36787 -34725 -32160 -27395 -22725 -43001 -32614
8292 -32614 -24390 -32515 -31234 -13625 -13238 -7282 -99 11537 6132 -6650 -8072 -13615 -16750 5507
8278 5507 15159 24599 22099 6694 5537 -1555 18021 26810 34362 28184 35955 15302 16015 23345
8264 23345 16088 16906 28930 45703 41988 22228 17143 381 -9464 -280 -13177 -5039 -7244 4936
8250 4936 2117 -13715 -22689 -12710 17062 28515 21017 -9923 -10965 10906 12209 30936 35420
8237 35420 56878 35244 39319 73309 102204 131262 158508 141668 100759 88493 63660 61551
8225 61551 76191 53404 29013 7723 -8617 -3588 6432 11344 22195 35611 34543 17923
8213 17923 27705 41958 32676 27135 14424 2955 2437 -689 -17167 -36340 -36442 -30712 -11430 -4773
8199 -4773 3956 4521 2944 13497 28894 39764 90682 154834 175964 174342 141381 107201 54831
8186 54831 34347 31726 15308 22079 20747 17837 18363 27300 23532 10506 -410 -1228 32099 32530
8172 32530 7569 10981 9164 5735 6448 6959 6958 32623 26925 -6924 -10177 14027 9603 -287 -4357
8157 -4357 18107 9854 -589 6362 8426 13070 -3122 -2606 5515 -8518 -6059 -2893 6841 14562
8143 14562 4873 -2884 6904 10866 17262 37273 39875 31743 28456 13505 -4661 -3037 13772 26839
8129 26839 32550 37646 22897 18699 30794 30502 16904 6218 1776 -15788 -16913 -2034 -17574
8116 -17574 -2149 10796 -1278 -8872 -956 7152 -4497 -10606 10043 14463 6464 -19303 -4595
8103 -4595 10538 9360 19548 6245 -16449 -36471 -40354 -34642 -19991 6334 6813 15318 14649 8897
8089 8897 26116 33428 9672 15084 19092 23709 43297 34645 22433 -2413 4567 22582 26304
8076 26304 19756 22960 12549 -3468 -21615 -30861 -14424 3942 21888 31262 30012 19904 14162
8063 14162 14769 32852 36722 25983 19518 9732 9508 6930 8466 16651 24951 20535 -6341 -8026
8049 -8026 -19412 -27688 -5572 23318 21796 30626 40172 1312 1108 14454 19066 7829 -25349
8036 -25349 -34266 -12615 -9265 -20742 -25908 -1865 29709 37137 28433 9129 3356 4186 -14116
8023 -14116 -3549 36661 34348 23922 22591 27812 15222 12515 1409 -7426 -16522 -20423 -24167
8010 -24167 -20789 -15198 -6604 13956 22831 21591 42843 30244 8986 1541 -11311 -7145 16207
7997 16207 19737 14164 5504 18731 23953 15547 6841 18549 19863 11115 38017 52748 29134
7984 29134 8444 5052 -9012 -18249 -1401 21227 23256 13548 14823 8309 -1231 -8252 -4232 -472
7970 -472 -3701 -17925 -19242 -7131 7909 1716 -2509 4110 23416 40586 48337 34886 15201
7957 15201 11620 12433 16120 16262 8282 -765 -13805 -16373 -18279 1978 8487 -5068 -2239 3837
7943 3837 6101 17022 23584 3277 -2634 24612 48409 30690 20849 16429 4277 -4334 10559
7930 10559 25375 2145 -18098 -21489 -26244 -24227 -13204 -11688 -17746 -25901 -22111 -11776 -14259
7917 -14259 -8794 14991 12098 2788 -20950 -19269 -18292 -12950 11353 7297 2391 19455 42239 41530
7903 41530 41245 32408 15551 -4660 -38580 -29167 -22498 -2067 9311 25997 22104 2307 17426
7890 17426 36236 39663 23583 12200 15772 2894 -1160 10533 1834 -5868 5617 29652 45051
7877 45051 30284 245 -5480 5274 17167 6143 3219 1659 -3134 17041 17339 15151 9063
7864 9063 3785 -3692 -12326 1078 9377 13714 17761 10245 -17698 -16887 9062 12006 3782 5522
7850 5522 6149 3487 5981 15087 30451 38977 39774 28062 4524 -4584 -7238 -30260 -49949 -50037 -37498
7835 -37498 -22613 2270 19299 36683 43228 15712 7865 6070 -14965 -6500 -2617 -16023 -24898
7822 -24898 -813 -11656 -15898 -12030 -11479 -11956 -6322 -20638 -27313 -47952 -47226 -29080 -1364 10805
7808 10805 -8655 -12304 -8975 1983 23101 32859 27734 3821 -16130 -31693 -15576 10110 32887
7795 32887 45500 41639 29494 17840 6744 23122 30630 5092 -6453 23304 31359 22851 10497
7782 10497 5197 -4302 -1662 -30403 -48214 -28348 -23393 -19701 -38240 -30074 -15927 -15288 -11473 4237
7768 4237 25977 43261 42555 26511 20466 19294 12448 11815 13654 25511 25577 22736 18461 19522 20683
7753 20683 13684 7551 10662 7685 18476 -1104 -25944 -11078 -11509 -1380 16539 12214 -12373
7740 -12373 -20789 -23129 -16764 -12612 1636 -4614 -17705 -32886 -33261 -25937 -28149 -18342 5024 1402
7726 1402 -12457 -20795 -3554 20764 19494 7723 21078 36981 34354 18108 33461 18652 547
7713 547 17701 20814 19940 1392 -15423 -27400 -23246 -6704 13601 -14437 -30519 -41650 -34453
7700 -34453 -21025 -20728 -27089 -25113 -24419 -20096 -22738 -28449 -14331 -8385 -16511 -3761 -15311 -11487
7686 -11487 -11381 -15113 -13232 -16896 -31877 -8154 25441 31244 13491 8140 16059 16951 2491 4430
7672 4430 3198 -4469 -10885 -12680 -14574 -2985 18502 19846 9031 -1776 -16037 -11509 -898
7659 -898 21458 34369 41585 32917 3876 6671 28570 14836 -10169 -24268 -8120 11348 29598
7646 29598 15674 3376 -15116 -30313 -27085 -12640 2530 12639 24376 26976 585 -6012
7634 -6012 -17792 -13741 11759 11812 -1127 -27215 -22979 -6157 6626 15318 1483 -2231 3408 -14808
7620 -14808 -20153 -18807 -29419 -974 18985 10775 -4858 -1289 -15665 -15672 12489 15030 6293 12309
7606 12309 9540 1338 -12600 -6703 -9009 -5495 -4194 -1536 4727 10352 18492 25274 14419 13535
7592 13535 2087 -7402 7472 30203 18146 3271 7193 3655 -9436 -21505 -21132 -8227 5714
7579 5714 3665 -9124 -9775 -17024 -37841 -31630 -18830 -29930 -27865 -19867 -27944 -33699 -19885 -13485
7565 -13485 -27265 -2078 9555 12294 10231 74 -5549 3141 18424 13193 6204 16877 25915
7552 25915 4870 -11668 -22798 -15125 1716 14561 23947 13094 11454 15604 8208 -17797 -11118
7539 -11118 2470 9312 36194 36044 18832 15063 14544 -2059 -13106 -7233 7485 4922 9973 26859
7525 26859 13805 -2346 -5990 11724 -6277 -15452 -18875 -23567 -20184 1306 28130 30356 21237
7512 21237 30919 27128 15630 25100 32608 15285 -15411 -10165 10797 9342 5754 3452 15181
7499 15181 15831 12693 14287 10564 2507 3958 -8493 -15182 -21488 -13971 -915 1236 6764 16600
7485 16600 20179 22663 25020 30612 48334 33272 20730 -7615 4206 16746 5763 -907 -2040
7472 -2040 -2956 -6909 -18847 -44170 -34968 -5254 -805 -8631 -34038 -24356 -15704 -19272 -6784 -10089
7458 -10089 -17818 -21820 -19796 -25387 -44878 -20216 10785 23839 15365 4578 -25845 -52292 -28796
7445 -28796 -16290 -15894 -4549 -5009 -14043 -7994 -10074 -1613 -3096 7415 3272 11570 12328 694
7431 694 -9567 -3962 3340 -4109 2216 17503 15262 -13715 -25810 -45770 -61893 -35176 -4947
7418 -4947 -9405 -24705 -29560 -29553 -21586 -20197 -15912 -13169 -19335 -16265 -6971 -16391 -20394 -14774 -17681
7403 -17681 -16281 -21132 -24391 -19852 -12835 -13468 -10004 -13180 -17031 -3062 3666 -22363 -35941 -23070
7389 -23070 -8223 -5326 -12555 -18429 -21910 -27127 -24688 -17307 -4341 -1233 -5306 454 10188 13139
7375 13139 33135 26847 -3993 4823 12394 11207 20761 12056 3864 -5261 1330 19931 45805 23942
7361 23942 20332 26619 10296 -3275 14947 20582 20981 9854 -10090 -2811 3998 -9160 -32257
7348 -32257 -32029 -15069 12503 27179 1709 -28874 -38485 -7920 -863 -9496 -13582 -28928 -8353
7335 -8353 25219 44779 46088 9034 -7708 -5130 3445 5218 224 -2393 -12404 -22606 -13003
7322 -13003 -20241 -16458 -18006 -32455 -42272 -63944 -70299 -36352 -38722 -47676 -20412 -9248 5904
7309 5904 1394 -18003 -11956 7354 8522 5345 1177 9161 14679 186 -2542 -1730 5060 300
7295 300 14353 27833 15148 -2172 6635 20560 7977 4715 19501 -766 -13364 -17844 9012
7282 9012 26894 30811 6565 12443 12233 26867 29282 39810 36108 -29 -19538 -28107 -26644 -23593
7268 -23593 -9040 -14610 -26331 -45460 -46013 -27186 -21255 -7181 11922 10101 -10582 -23924 -17608
7255 -17608 -23048 -20103 -40109 -39341 -8324 11736 11278 7090 -30 -943 -3389 -5596 7981 19756
7241 19756 4864 7022 -1069 -17354 -26274 -31527 -34355 -28762 -34525 -17861 -25930 -27938 -9421 -16956
7227 -16956 -21095 -19311 -6095 3820 14745 4006 -5468 6453 570 7358 698 3642 -5683 -23786
7213 -23786 -18565 -6605 4522 4627 -6920 -2956 3689 12610 2502 -18999 -14831 -10261 -3060 -1357
7199 -1357 6327 5984 -770 -22654 -19083 -8577 -9037 -9091 -34340 -42085 -34627 -16254 -8358 -14837 -14023
7184 -14023 -17057 359 14115 -4289 -24694 -14869 -15084 -13791 -2195 184 -2879 5034 2980 -4325
7170 -4325 -9068 -22609 -24711 2590 4528 -13278 -17589 -16553 -22382 -11328 -4369 -3990 12852 19031
7156 19031 31187 20862 3192 -4415 -14928 -20790 -20681 -34591 -53013 -52372 -52085 -18423 -5328
7143 -5328 -3091 -10160 -21343 2456 -8263 -17994 -17215 -14617 18836 35031 23257 15915 6867 25161
7129 25161 6080 -19180 -35522 -25539 -29545 -8268 8296 2399 -10771 -10615 -22922 -6253 -6188
7116 -6188 -38277 -48433 -47225 -31019 -29152 -7615 20033 25465 20813 15993 6327 -12515 -23039
7103 -23039 -34938 -45732 -29360 -26275 -35859 -27811 -22506 4322 7391 -8899 -364 19461 12850
7090 12850 8624 4873 -13619 -22030 780 7686 10742 30797 34985 24875 27999 15420 8693
7077 8693 8417 -4361 -2603 15725 20223 8384 -11248 -15342 -11431 -25257 -20433 -4004 -2945 3799
7063 3799 12822 14397 2775 -291 4422 -1288 -12493 -192 -1792 9288 13651 17350 27876 45857
7049 45857 42030 21292 12837 24849 47231 47157 24995 36489 30271 11856 -5585 4284 34856
7036 34856 19308 1338 9095 8388 14539 15404 19192 31246 15669 6525 2634 6957 30880 30302
7022 30302 26199 12669 344 -10111 -13515 -775 5101 12942 12458 12381 13593 12396 6560 -20179
7008 -20179 -17672 -6081 -974 18147 24424 7429 -10716 16346 27924 7333 -15994 -28318
6996 -28318 -10399 2524 4389 14318 14065 -8686 -16990 -11623 -10600 -7057 -10384 -22584 231 21733
6982 21733 23911 21498 24059 20161 19883 19048 10505 -14052 -14760 -24730 -24343 -8323 5765 9470 3248
6967 3248 2817 14755 -3913 -30174 -22513 -12974 -18464 -10993 -4700 -9714 -8354 4439 25010 34044
6953 34044 37844 30403 23792 30058 15013 1144 402 -13834 -3812 7825 2467 -12887 -12061 9648
6939 9648 6361 2217 -721 -8476 -7917 13359 21010 6003 -9353 -16540 -27134 -27419 -21494 -12759
6925 -12759 -12149 -23410 -31955 -28083 -28389 -50916 -52118 -35615 -24969 -16649 -11179 -6972 -709 -7299
6911 -7299 -11935 -9255 -2278 -8178 -16585 -32172 -34656 -17543 694 14789 9643 20543 10575 -9538
6897 -9538 -19223 -24654 -13222 -13775 -10253 -9952 792 2812 -2962 935 -22729 -22536 -13470 -21412 -26363
6882 -26363 -21230 -31052 -39219 -40229 -23257 -26736 -29310 -14851 -10206 3316 25074 8641 -6704
6869 -6704 4609 7661 -9147 -34650 -26910 -15879 12238 27261 22006 26538 25392 4364 -15911
6856 -15911 -25392 -34489 -44120 -34906 -10177 -1629 2788 3712 9258 7198 5999 -2221 -2612 -1343 -6617
6841 -6617 -16641 -28224 -39571 -24444 -20225 -17235 -22020 -8906 8656 2148 -15224 -24690 -12844
6828 -12844 9398 9563 8251 -2970 -16117 -11463 9874 21505 18230 138 13126 9639 3212
6815 3212 -11690 -17873 -39141 -40238 -20093 -18010 -14495 5998 24079 43055 41374 19972 -4394
6802 -4394 -20659 -19407 -12294 -15556 4416 -10697 -2581 12742 21469 3769 -3868 -33177 -61737
6789 -61737 -50758 -26770 -3552 820 -10209 -19268 -28496 -37479 -30469 -24577 -16523 -3103 -5839
6776 -5839 -10518 -7807 -6895 -1307 -1150 -2621 7711 4711 16676 17461 5513 2870 17282 16310 28760
6761 28760 19525 9238 -11977 -10009 -4296 -5719 -5396 -601 -689 -7657 -3592 -1596 -2366 -28609 -45985
6746 -45985 -55843 -29626 -3975 -5337 -6417 8466 6848 -4890 -6513 4051 -2470 -5802 -5492 6662
6732 6662 8793 -5604 -15901 2547 5031 7905 4246 13111 17962 1322 -20365 -17523 -1366
6719 -1366 -24575 -59139 -32453 -9767 -11426 -11807 -4484 -5699 -3994 -4201 -5585 -33541 -43940 -24781
6705 -24781 3227 -9389 -26443 -23042 -12076 -24552 -42339 -65441 -54646 -33074 -32082 -10314
6693 -10314 -14655 -16788 12992 23292 41427 57367 39030 11217 9086 6665 7613 5180 15948
6680 15948 26266 -2307 -30578 -25717 3277 -906 -1422 -9104 5550 5427 18680 36144 37322
6667 37322 19137 10785 4080 17607 24505 39708 38052 3115 1546 5278 7669 17422 25927 -3014
6653 -3014 -19358 -10832 5647 12575 27943 27075 32393 12652 543 8441 -6940 3581 8342
6640 8342 8555 -3472 -6318 7455 11969 521 -27 5408 5401 -5572 -14572 -11298 -22270 -30547 -28178
6625 -28178 -12412 515 24 -19442 -30349 -34256 -31028 -23199 -27839 -4294 15217 35226 26803
6612 26803 970 -14172 -39326 -15368 -22312 -29407 -32092 -27021 -4732 -2875 -5802 -4155 2322
6599 2322 -4513 -17850 -43806 -49597 -45253 -27800 -8099 -2242 -14223 -19635 1309 29240 38503
6586 38503 41555 30441 9223 -26280 -34268 -26808 -38533 -34423 -23265 -17261 -46915 -32098 -17922
6573 -17922 -9753 -9126 -10955 -16784 -16157 -6771 5664 7441 1975 13836 12047 2774 -17966 -5783
6559 -5783 -351 -16921 -22586 -32654 -15516 -14029 -24116 -26971 -33454 -41898 -37677 -14767 -23273 -28752
6545 -28752 -21140 -17900 -12018 -2358 -16460 -39640 -19154 9244 11226 -5539 2907 4279 -11486
6532 -11486 -21466 -33566 -27898 -20078 -11858 1068 9916 14294 21242 -3006 -2672 6344 10855 155
6518 155 -11864 -20184 -28677 -46482 -48438 -49209 -51884 -41286 -40947 -34298 -17382 -9 14441 10966
6504 10966 -3254 -27966 -10347 -20964 -38113 -28689 -21045 -19976 -33136 -27850 -15477 -9760 -2964
6491 -2964 2227 9365 15924 -9768 -13341 -9931 -10778 -28640 -33504 -29263 -21505 -32705 -39798 -20274
6477 -20274 -9870 -28659 -51928 -55031 -45926 -25631 -1735 157 -25044 -33022 -31682 -37503 -38745
6464 -38745 -30765 -17617 -10843 7888 5570 -5795 -14475 -4028 16081 3566 -14346 7857 7784
6451 7784 -18949 -36403 -14182 3545 -10578 -8856 -13446 -8845 6381 2330 -2415 2159 5145
6438 5145 2396 -2628 -2260 -19196 -51726 -28581 -1289 5855 11470 17731 -713 -17232 -10058 -9958
6424 -9958 -15994 -7596 7312 1700 -8119 -9160 -15032 -13913 -7879 -3289 -21486 -27229 -24994 -25056 -30492
6409 -30492 -25129 -17465 -18178 -18417 12505 20479 -2371 -11392 5020 1646 -4425 -11047 -16679 -9636
6395 -9636 -5671 -10546 -11254 -12789 -42447 -52003 -37419 -32815 -25845 -31431 -13122 -9248 -34512 -28799
6381 -28799 -12933 -5974 8865 5077 3248 18723 5230 858 -2114 -20354 -25626 -13331 -2875
6368 -2875 902 33124 41815 29992 9179 -14624 -29778 -41849 -28766 -9504 -14518 -26551 -11063
6355 -11063 8193 7840 12268 -2764 -16667 -29762 -15133 -1811 -11390 -6020 2076 3357 -12859
6342 -12859 -23093 -18016 216 -10954 -19311 -11918 -2151 10442 -8623 -15645 -7416 -7938 -10278 8997
6328 8997 6212 -11202 -15943 -6333 -7361 -13885 11928 10253 8401 -1780 -25743 -21401 -24307 -19831
6314 -19831 -23081 -6990 12155 -4996 -18449 1590 17913 11927 925 -7015 -10718 -10430 -11922
6301 -11922 -7423 4395 -480 -9480 -7212 4626 -8255 -24513 -13508 -18639 -23121 -47561 -39405
6288 -39405 -13052 -13221 -39318 -27493 -25950 -40178 -30385 -17535 -2896 4537 11107 7372 4340
6275 4340 950 -3764 -18967 -19436 -25708 -29851 -20756 -6885 2666 -7650 -28493 -21857 -2046 -373
6261 -373 792 -3028 -19545 -12961 -3745 -8690 -19010 -17217 -8966 -949 -10652 -16443 -26090 -37171
6247 -37171 -25181 -12433 -2338 -1550 -21580 -38260 -56257 -73482 -47093 -31048 -21912 -2843
6235 -2843 -18 530 3433 -13230 -29067 -31893 -20493 -21048 -29517 -35082 -33042 -26875 -19162 -22787 -6676
6220 -6676 1287 6010 -7072 -16353 -44315 -61990 -51276 -20498 4400 -2138 22614 33162 5682
6207 5682 1965 933 5562 -7641 -29671 -12757 -2442 -4920 -10829 -36040 -24370 -9146 -6282
6194 -6282 -7730 -5834 -14753 -7222 -17714 -18823 -17270 -14074 -8665 -18827 -23610 -34365 -49562 -56628
6180 -56628 -40177 -19349 -5158 -10352 -18674 9156 9406 11463 7393 240 4479 -5475 -15332 2287
6166 2287 2507 5385 17000 10840 25804 14725 24977 -13707 -22271 -21509 -21226 -21396 -20669 -31813 -25983
6151 -25983 -32884 -39270 -14110 16410 15384 2802 -430 -5593 -12436 -26011 -19093 -9219 18024
6138 18024 27571 20203 23833 30342 24888 16167 9466 18722 14437 -28891 -40201 -23290 -18345 -20735
6124 -20735 -18940 -11740 -3111 10441 21411 9630 21988 32115 27087 5905 -20597 -14954 -27388
6111 -27388 -23138 -1472 4089 924 10601 19991 24823 25818 44595 49377 26335 19444 24045 10560
6097 10560 30274 18105 28072 24102 594 -8448 12610 3551 -6796 7477 7008 1155 -11962
6084 -11962 -22991 -9712 -16114 -20834 -17784 -5912 15813 25375 27578 4667 -19278 -36240 -50712
6071 -50712 -41101 -14663 -11978 -16491 -21886 -8593 -3683 -7832 -17306 -23568 -21849 -19692 -8955 -15019
6057 -15019 -4606 1466 -26265 -25993 -15421 -26145 -28903 -33816 -16086 -14666 -26237 -17954 -14600
6044 -14600 -5695 9646 13184 14198 -4139 -31606 -45889 -28386 -5357 19664 7155 -12190
6032 -12190 -19662 -13620 -5119 1251 397 4891 -1097 -11119 -15462 -7980 5952 5345 7737 1752 -20423
6017 -20423 -30665 -33294 -34107 -28886 -20542 3947 9036 4830 -23683 -23725 -22764 -19077 -11268 -8206 -195
6002 -195 3688 -174 2484 -2397 -4736 -3441 -4205 6727 22122 32933 11131 -13109 -17091 -2521
5988 -2521 7093 8142 4028 1346 -16535 -32097 -28149 -19657 1219 6961 3551 1290 9086 10804
5974 10804 4935 2937 7256 15930 4780 -18015 -33117 -30607 6057 22106 3594 6714 13053
5961 13053 4349 -5333 -677 14984 35183 24068 5101 1747 546 -8469 -1089 11094 20985
5948 20985 5629 1041 3453 -182 -5980 -18256 -17008 -7987 -20025 -9218 8242 -34276 -40404
5935 -40404 -16639 9034 18583 13365 16239 8551 -2290 1057 -13430 -12861 -21662 -23704 -27442 -14282
5921 -14282 -2893 -11968 -35532 -31699 -25809 -36437 -26964 -13066 -18259 -32311 -26482 3799 16744
5908 16744 7800 -17381 -14010 8299 21532 24732 16090 -3581 -7051 -8257 -2739 -32121 -39234
5895 -39234 -13973 -11407 -5920 -3568 -3769 -6344 -15463 -30896 -17472 -4507 -1866 -23282 -14563 -14401
5881 -14401 -11626 3491 -4748 -32834 -44884 -10480 7928 16114 17521 -13589 -46784 -47268 -42117
5868 -42117 -43902 -41684 -16597 10111 12403 13864 3157 3151 -10380 -17323 10218 16847 16141 39681
5854 39681 48067 34880 27653 29501 17701 -7616 -3548 -22529 -25244 -6457 -5235 -9238 -6241
5841 -6241 4269 21225 18122 -4884 -15419 -17870 -40010 -41024 -34589 -31527 -28474 -25629 -21331 -24980
5827 -24980 -14812 4357 6455 -2886 -23585 -21637 -23388 -24454 -15599 -26152 -54234 -55132 -51841 -30283
5813 -30283 -32520 -22210 -12178 -14070 -12773 -5606 -7944 -7751 11908 29803 29116 27736 37357 38308
5799 38308 33890 27040 22784 27692 29747 32991 10786 -10758 -24103 -10977 1154 -13444 -17220
5786 -17220 -10935 -2692 -14190 -11394 -2075 -9836 -43522 -27532 -9028 1825 -8040 -21818 -30210
5773 -30210 -13969 8880 17443 25859 -60 -5484 5224 11146 10377 19170 15561 9215 -2217 4260
5759 4260 19943 11677 6818 24811 19952 7110 -6982 -16640 -10771 -28919 -43172 -46229 -54760
5746 -54760 -53745 -44708 -25861 -9578 -23133 -14700 10015 6135 -1409 10074 18402 26572 11805
5733 11805 11358 11383 21569 29418 28620 33844 38861 44921 39405 34914 59593 38899 5326 -27723
5719 -27723 -30421 -18134 -11628 -4560 16289 30711 31879 49893 42004 17279 11900 12167 15189 14628
5705 14628 10051 18852 19858 -3846 -8645 -5676 -21508 -44189 -36132 -41738 -54323 -53689 -51105 -37615
5691 -37615 -16027 4826 25372 27324 27229 14126 18466 41023 50273 32049 21013 12593 28289
5678 28289 38741 27011 7518 -19059 -37527 -37195 -30193 -45557 -45772 -50998 -38173 -12698 -25231
5665 -25231 -39851 -39301 -31731 -10055 17949 23946 27821 19803 975 -17320 -13384 -11261 -19718 -17121
5651 -17121 -294 17178 5581 -24237 -19864 -24868 -17160 13184 25090 12479 -436 532 679
5638 679 8586 -6286 -19810 -20529 -23746 -8093 -20671 -53901 -62215 -50614 -35020 -11369 -6553
5625 -6553 -18790 -47470 -46650 -49786 -52960 -55572 -54366 -42235 -54929 -55680 -42807 -24282 -12524 -1090
5611 -1090 8007 8925 -1069 -3405 -1485 11232 19856 12920 9237 29604 33932 25036 20162 23425 25770
5596 25770 33995 24760 5333 -22007 -26299 -30757 -24226 -16147 -11852 -13906 -28936 -41627 -42852 -24308
5582 -24308 -20492 -23466 -429 5596 -8154 -21895 -17704 -16930 -21760 -33136 -37196 -22433 -15729 -8125
5568 -8125 -11009 -12987 -19430 -21848 -19608 -24482 -46316 -31656 -21097 -7627 8891 21063 19997
5555 19997 18806 14852 1435 -16238 -29481 -21223 6138 33728 13097 -12782 -18948 -10326 8301
5542 8301 -9540 -35167 -25869 -33067 -26232 -13236 -19520 -1762 12453 6584 -2542 -19158 -20181
5529 -20181 -1963 -4704 -8987 -33032 -74674 -86830 -59030 -27754 -22318 -17162 -16400 -9633 -2731
5516 -2731 2311 4523 21307 45635 35390 13190 -9124 -13856 -17577 -26577 -21894 -10175 -4979
5503 -4979 -7632 -13978 924 25805 17965 22719 32607 17307 4647 3264 -5746 656 4700 2015
5489 2015 5804 8627 18533 14826 -13819 -36263 -34744 -20465 -24835 -16912 -3112 12875 27543
5476 27543 16270 -24451 -46240 -31736 -18882 -14683 -14426 -7253 5454 20674 8811 -5737 18713
5463 18713 24093 2113 -9001 -11297 -15246 7223 2436 -23352 -13293 2832 -6710 -16185 -8283
5450 -8283 -31182 -36915 -43738 -46056 -47599 -43147 -28613 -6236 -10943 -18914 -14478 -12354 -26032 -21940
5436 -21940 -20714 -26600 -26052 -25102 -24210 -17113 -26301 -6191 11149 5777 -12858 -10684 -19121 -38415
5422 -38415 -41109 -47810 -45882 -51311 -52333 -43280 -27237 -15967 -12636 -21555 -27289 -22841 -19026 -29749
5408 -29749 -29528 -24532 -44391 -38165 -18029 -13430 -12254 -8738 -3528 -15166 -16145 -13403 2072 6585
5394 6585 -12834 -21701 -52641 -49230 -46453 -54450 -38132 -18956 -11276 -15634 1826 7645 10320 15452
5380 15452 -2738 -8652 -14015 -650 260 -211 -5281 905 -3340 -10067 -15928 -10358 8270 10942
5366 10942 -10435 -28587 -32018 -20827 -16438 -5264 11251 28967 28839 16310 12990 8408 -11418
5353 -11418 -18433 -15002 -26347 -45995 -42296 -40818 -26795 -18736 -21427 -35737 -39614 -9052 9571
5340 9571 2026 3445 3917 -20692 -35132 -44824 -22522 3547 -7592 -4738 12112 -665 -31199
5327 -31199 -14922 1716 -5152 5251 2357 -11734 16019 17813 7025 -27555 -26926 3427 30557
5314 30557 31674 25769 8472 -10286 9276 7059 2930 1201 7400 5538 -9805 -114 -2315 -7769
5300 -7769 -17988 -23099 -31164 -6441 18009 6140 -2180 21203 24154 22873 24860 15783 -1865
5287 -1865 -3291 -14894 -15196 -10486 -9846 -3883 -6635 -10740 -1800 -10257 -23280 -30473 -50984 -35567
5273 -35567 -26370 -38716 -50694 -47259 -14172 -3927 5179 -4301 -2386 5492 -4893 -36145 -34441
5260 -34441 -33179 -42884 -20942 -2327 7783 6251 -5534 -2070 3327 9831 539 -20424 -28856
5247 -28856 -18187 -18415 -16992 -28122 -31140 -24863 -24556 -35916 -23862 1580 2663 5369 -1039 -8340
5233 -8340 -23366 -18621 -6599 11098 28922 44210 20030 -6045 -24940 -20468 -10239 -37103
5221 -37103 -38817 -27432 -28829 -29398 -3660 7751 15342 -5051 -25448 -31886 -23593 -16524 -6908 -3817
5207 -3817 345 -5288 -18055 -8128 4537 -21379 -33755 -19136 -32034 -41112 -19673 635 8086
5194 8086 -7888 3133 -294 -1117 10500 19692 8602 5404 -21762 -25193 -40448 -17658 1074
5181 1074 8769 26014 25440 2372 13055 20188 9584 -1855 7819 3709 11276 3477 2945 1001
5167 1001 -21439 -22008 -10067 7538 10080 3022 -12635 -3894 8746 7875 13226 7426 -884 -25855
5153 -25855 -42372 -24447 -10728 -1180 4586 7020 -5907 -42061 -60114 -30458 -4253 601 889
5140 889 -8023 2527 -353 -1776 1443 21295 3375 1777 1461 4252 -12350 12093 35993 38245
5126 38245 25304 5700 -11024 -21351 -26366 -19675 -12723 3744 18941 23122 6222 -18577 -17846
5113 -17846 -7118 11055 -3501 -23418 -5327 33275 35622 13281 9443 3509 3981 9800 4177
5100 4177 9113 3166 -13313 -7311 -3008 5695 1939 -16545 -25113 -2359 11849 15649 14647 17925
5086 17925 30839 27760 37843 31677 2903 -8546 -10748 -5877 5709 11377 -6840 -16648 16781
5073 16781 38558 29918 -1683 -21327 -19013 -14962 -13651 -19929 -10554 -12071 -28569 -30155 -31236 -38532
5059 -38532 -33958 -6406 -3947 -22787 -36651 -21574 -4575 -1332 -842 -1321 -22773 -12328 -12477 -22207
5045 -22207 -10922 20962 23566 1370 -29589 -26637 -2912 14471 27374 15671 -18831 -24568
5033 -24568 -31505 -44749 -12470 5040 29633 38090 27016 3720 -12077 1508 10496 8275 2201
5020 2201 -14056 -22138 -13305 -6973 2077 -16726 -37816 -36350 -14193 -11936 -8287 -347 -11384 -30958
5006 -30958 -38721 -14483 -9078 10218 3661 -6359 -1176 19812 4721 -24235 -32445 -19192 -1049
4993 -1049 -11249 -14996 -30314 -15413 -12220 -27146 -30346 -34142 -9864 8201 4332 -2393 -6971
4980 -6971 -8018 -10709 -32356 -31228 -10357 9925 12746 8228 17843 778 -24454 -15105 3909
4967 3909 7567 11039 6804 -6149 -20359 -27827 -34402 -41984 -36029 -13405 -2818 -3021 19517 28605
4953 28605 13581 -8425 -18001 -16556 -14293 -8060 199 7242 6303 3391 427 -6715 -18338 -39463
4939 -39463 -28477 -17421 -4891 -5680 -9335 -4552 -5317 -21408 -19954 -7686 -8477 -3264 -2643 -21768
4925 -21768 -11371 1413 13599 12286 17577 17646 2609 -21396 -16364 -13464 -9212 -14264 -36770 -35099
4911 -35099 -7465 9302 5013 -4262 3257 14438 -12218 -20684 -8280 -2474 11376 -5891 -25786
4898 -25786 -17304 1893 -5300 -4237 5365 8015 23195 1494 -4679 2842 7940 2572 4850 13512
4884 13512 -436 223 13528 4098 2204 13779 -686 -12958 -7759 -6962 10627 26592 21990
4871 21990 16413 24855 28082 15587 859 8185 10375 1646 -20522 -20850 -7283 -7783 -5333 -14903
4857 -14903 -26267 -33772 -23325 2513 3694 403 11949 5412 -22557 -6734 5654 16156 21333
4844 21333 7996 -9590 -24458 -19535 -10437 -10475 -14645 -37628 -31027 -27918 -24334 -17199 -1147 27055
4830 27055 18069 2543 9650 -2014 -2238 18573 22145 16846 8911 -7606 -9084 -6826 -15820 -11373
4816 -11373 -4970 -11312 -1689 -7512 -10470 4872 -10807 -15645 5220 18801 -1260 13717 17185
4803 17185 -2831 -12200 12273 4765 -25715 -32084 -29037 -8529 5871 18868 48212 50246 26354
4790 26354 31147 52381 48633 34341 28305 29430 34013 29943 26366 39664 33203 38078 31923 16507
4776 16507 11041 2565 5943 14934 19813 7471 -7362 -26440 -28423 -9671 -7690 -22343 3341
4763 3341 -11441 -18714 -4134 5728 -813 20657 46746 44559 35135 33905 24370 19512 -2380 4779
4749 4779 27601 31121 20002 17948 20717 24258 29459 44333 19355 10304 -493 5994 -6666
4736 -6666 3738 15679 32116 28342 14511 6015 16357 14635 -2886 -16406 -6005 -2121 -28648
4723 -28648 -55719 -46839 -35571 -33807 -22305 -29616 -49422 -39598 -31708 -4779 597 -17896 -16940
4710 -16940 -20789 -23666 -20081 -4897 3790 -8130 -21464 -575 -1750 1048 -2191 -6263 -18056
4697 -18056 -50662 -40974 -36339 -35342 -32636 -23082 -2116 18771 13346 -2281 -158 4262 -6470 -13506
4683 -13506 -14252 -6130 -2116 15144 13210 -24198 -33279 -18322 -7793 2405 3247 9934 18869 1692
4669 1692 -32373 -25585 -6185 11738 9691 5775 19982 21680 26284 25054 8755 -3471 -20578
4656 -20578 -36725 -23927 -23760 -38809 -32561 -33327 -16851 2648 -5854 -20829 -21861 -23676 -11762
4643 -11762 -5279 2738 20137 11192 2923 2860 9452 -8059 225 6117 -13794 -29858 -14942 -10743
4629 -10743 -1283 -740 -8232 -19288 -2098 6860 -568 -17138 -30276 -30077 -14446 24456 31847 206
4615 206 -7169 -3679 -5767 3821 6816 10797 2877 -19252 -8090 13491 7236 8482 14999 1516
4601 1516 -17585 -30316 -43293 -47442 -25391 -33022 -37398 -29561 -19734 -27500 -18070 -5930 467 19441
4587 19441 8498 -11004 -37979 -49285 -29485 -15481 -13779 14733 33662 34929 27187 -226
4575 -226 -15807 -17483 -26844 -34033 -27488 -31024 -17199 -15402 -4957 6716 4439 8095 767 13838
4561 13838 13737 3557 -5324 -4688 -11143 -4114 8843 19545 12228 11881 22533 6269 -3749 -5870
4547 -5870 -23109 -21699 -16218 -13384 134 7400 1367 5465 16004 13822 19420 18866 6870 -14720
4533 -14720 -19827 -13161 -14294 -5636 -7157 -34504 -19963 -9398 -17559 -3129 -5642 2432 26796
4520 26796 30478 7794 7656 24379 24612 -3695 -7757 -5622 -323 3601 5546 16090 28099 22710
4506 22710 -77 -15112 -9542 -8789 -14479 -5594 1315 -20042 1192 25134 6899 3588 2310
4493 2310 -8986 -24530 -21887 -8264 -33315 -31839 -3282 9983 -3765 -19724 -20471 -4923 9321
4480 9321 5819 2849 -3807 -14084 -248 3751 14232 8637 5009 15044 23295 18637 -319 -10605
4466 -10605 -2245 5937 18259 13646 1432 -15453 -15328 -9347 -20331 -18722 -6647 -19730 -16073
4453 -16073 -10011 -16757 -5579 15465 8521 -6241 4871 44 -22752 -18111 -19515 -16005 -10550
4440 -10550 -22613 -24392 -8630 -1506 8481 16404 -10023 -27869 -28935 -22973 -22889 -4775 3898 3907 1879
4425 1879 -27028 -47018 -44495 -24216 -14995 -35737 -55122 -51036 -48493 -30246 -8259 135 -2720
4412 -2720 14528 20765 15155 12108 26993 17395 -5508 -6419 5210 1628 5215 -2447 -12329 -14713
4398 -14713 -9558 -19961 -13900 6082 6175 1559 -2305 2912 28431 21345 -5946 -27322 -5191 16620
4384 16620 16920 6291 12583 30955 36239 21026 19637 19466 8305 17315 38725 33579 28603 11483
4370 11483 -8038 -7761 -7052 -22278 -31391 -20891 11814 1636 -833 -14790 -20321 -27334 -36378 -29403
4356 -29403 -8160 -22756 -25176 -17484 -13464 2647 -2798 -21683 -41629 -29433 -31930 -40333 -32785
4343 -32785 -14603 11190 10291 13168 16202 4786 -2015 -9598 -2965 -7525 18390 19183 -17365 -20137
4329 -20137 -1871 2446 -4185 9565 -15853 -33073 -41945 -50158 -68195 -43687 10325 25333 13192
4316 13192 8837 -15704 -12915 -7410 -5347 -2842 -14861 9292 34952 20554 10049 22732 17654
4303 17654 -4988 -6837 -9166 -5569 17236 20116 13773 15342 2406 -27513 -38614 -39283 -17140
4290 -17140 -2196 -2769 -8451 -5709 -9386 -12795 -13582 -15463 -16100 -12758 739 4055 9481 4118 2308
4275 2308 14098 19076 23612 14959 7037 -6605 -4871 -5234 -22739 -24838 -26021 -17741 -35270 -36791
4261 -36791 -30412 -33259 -31842 -32174 -44899 -46325 -11465 2462 -14752 -22070 -20049 -14727 -30900 -30145
4247 -30145 -15516 -27959 -14014 -5824 -1766 -1168 -32174 -44532 -20683 5388 20571 16259 6572
4234 6572 -9988 -25892 -22582 -36182 -31731 525 7759 -16721 -39641 -43469 -33938 -23564 -9646
4221 -9646 1017 -6699 -8101 -5059 -18348 -27781 -32245 -18567 -2135 -3389 -9596 -9575 -13371 -13111 -3957
4206 -3957 -5955 -14075 -10061 4596 1886 -12253 -31425 -44225 -24382 -8949 6929 3739 2250
4193 2250 8235 4690 -27085 -32910 -48690 -49496 -26318 13177 11087 2934 -16567 -24391 -24742 -2844
4179 -2844 8537 -10472 -4155 4213 -9528 -10113 -18269 -21104 -32081 -44888 -39839 -28555 -27165 -30420
4165 -30420 -52809 -55674 -36582 4479 10560 691 -1464 -2920 -10850 -13861 -19896 -4180 5310 202
4151 202 -13691 -9396 -7295 -12975 -32374 -12293 3674 7264 4012 -4134 -1444 -6835 6851 8317
4137 8317 591 11894 17381 14844 -2538 -33366 -42061 -33287 -12513 -6585 258 -4343 -16416 -5328
4123 -5328 -1462 -1066 -1280 -34025 -36785 -42558 -49161 -47479 -40957 -12323 -3592 2833 19717 48553
4109 48553 28496 17362 10932 21580 -10512 -31339 -57269 -41831 6486 1432 -9474 -27260
4097 -27260 -26793 4858 19307 10774 4505 19417 20940 12301 2470 -5351 -9015 -6789 -5586 -2070
4083 -2070 -1065 4201 2001 -12290 -42398 -55730 -41972 -55145 -38745 -30737 -32422 -6840 5696
4070 5696 -2393 995 21456 16482 19627 3985 -23488 -18994 7321 12922 8117 -6500 -13604 -11274
4056 -11274 -11890 -10947 -23071 -28890 -34411 -28236 -20443 -21314 -16977 -15193 -17936 -14841 -27618 -30282 -27211
4041 -27211 -4104 13987 1561 -31144 -33986 -14956 -25644 -14271 -6990 -3270 -16125 -5967
4029 -5967 -3186 -5401 -27958 -34685 -29880 -23227 -11192 -11734 -13875 -27121 -28473 -7637 252 -8301
4015 -8301 -13458 -31103 -18325 436 15537 9421 -12595 -3079 -9641 -19608 -13098 -11647 -8638 -23760
4001 -23760 -39062 -42558 -31828 -23675 -8787 8323 1730 -12799 -23767 16560 19406 12799 7166
3988 7166 592 6501 -9145 -12007 7455 10680 18172 15378 16214 7842 -9177 -4754 15813 28895
3974 28895 29380 23345 12224 -3644 -3500 -18653 -5452 5368 6427 -844 -21044 -22984 -18912 -8889
3960 -8889 -15498 -6754 -14151 -1792 7053 16263 6034 11999 32604 30641 27685 16558 -15904 -45673
3946 -45673 -27973 -9176 -4198 3475 1317 -5672 -27090 -49915 -50101 -27474 -24762 -19535 -15895 -19801
3932 -19801 -35894 -29980 3081 25318 17875 1556 122 2717 3348 5459 -5486 -5216 -2049 -16782
3918 -16782 -19089 -5738 -6028 14339 13390 14647 22064 12500 4768 16149 1124 -27990 -42426 -34824
3904 -34824 -30930 -21636 -1001 7891 3268 11956 7329 13708 37854 50552 36596 23733 2699
3891 2699 11141 19052 30221 34897 21149 4290 15191 17862 13800 12919 5746 20 -977 4766
3877 4766 2342 25430 27013 27006 30479 48575 51851 48192 22029 27070 24749 6376 17195 14382
3863 14382 5460 8166 4548 -15236 -21544 -36675 -21486 -30652 -40353 -25081 -13441 -2807 4149
3850 4149 560 3470 -5024 -17167 -5765 6514 14571 20184 11192 15457 24116 24631 34248 47198
3836 47198 45012 42694 37682 22798 3702 14746 10788 -4412 -19982 -20539 -31589 -14932 -9803
3823 -9803 -6922 4566 -11568 -39816 -59528 -52820 -43096 -38493 -15840 -5816 -30209 -44693 -47015
3810 -47015 -31980 -434 20018 16585 6917 4806 8793 3519 -11668 -3812 -1414 -12747 3994
3797 3994 18206 19251 7886 4776 666 1381 10186 -3640 -10152 11961 4395 14563 17834 -2497
3783 -2497 -9098 -16930 -3124 6622 25888 28574 18186 26434 31789 5194 -21871 -23844 -8851
3770 -8851 -4478 6268 7442 -3401 -2061 351 -12598 -16586 -5858 2737 -1444 -15290 -22552 -7678
3756 -7678 -8666 -7710 4917 5881 7454 6537 -6780 -262 15585 13735 5415 14937 26513 34819 37538
3741 37538 46336 46585 45372 51237 14573 -9151 -10453 -15265 -3577 1460 -181 7253 14969 24208
3727 24208 33156 21360 6514 9084 -612 -21024 -8281 -5491 917 15772 19315 8387 6939
3714 6939 106 1849 -401 13382 15915 25831 12390 -8929 -13340 -18381 -18819 -15778 -25889 -38051
3700 -38051 -38997 -25384 -28945 -19888 -10025 -6518 -7850 -13826 -22330 -10724 5580 21671 8618 -5308
3686 -5308 -14850 -10038 11583 -2408 -16465 -15586 -13533 -12400 -5996 -5593 -25360 -5077 11378 3790
3672 3790 -1676 -15031 -19713 -8691 -8773 -24583 -27904 -2724 -10235 -21570 -34424 -19490 -151
3659 -151 1725 -2698 -18314 -32259 -31877 -31206 -23479 -15290 -14558 -35164 -35153 -6795 2083 -6603 -9433
3644 -9433 10817 16539 10604 24979 21207 26090 27685 21055 36411 34109 -418 -10740 13458
3631 13458 13426 10843 -11553 -20903 15804 7648 16123 14566 9888 16404 11120 11531 5802 29415 4980
3616 4980 -14153 -19886 -28281 -5935 8243 -15724 -20675 637 13337 23497 33904 51925 44519
3603 44519 18736 -2629 1020 -9588 -18079 -12477 -3291 -13259 -23223 -5091 -12301 -24794 -37704
3590 -37704 -23472 -7431 -21513 -26004 6200 37038 46460 13672 -1365 -4844 -1140 22187 23983
3577 23983 12660 3658 -23502 -18274 -7344 -61 21672 24757 9492 19980 44470 44596 24515
3564 24515 10269 -6908 1102 6217 19671 16619 27363 6654 2662 19409 19924 11353 14096
3551 14096 14345 10154 15776 17361 20692 6664 -4798 -17747 -8244 -7989 -2018 -124 7871 13810
3537 13810 20210 6883 -9806 -5421 -24540 -30251 -36674 -36748 -39708 -21438 3481 -15861 -22344 -28376
3523 -28376 -22409 -9842 -9211 -25879 -27487 -27617 -38448 -23448 -10178 -19698 -25395 -12132 -6491 2615
3509 2615 -1513 -15130 -30048 -20418 -20769 -16294 -17011 -26840 -26020 -33748 -36228 -17129 -27579 -20324 428
3494 428 7780 12728 6293 25956 27353 31056 2952 -5362 6671 16829 22578 13726 2711 -13795
3480 -13795 -10641 -13876 -16349 -11709 -22453 -24413 -25944 -13756 -13105 -16419 -28565 -28533 -36352 -36497 -11442
3465 -11442 15274 14049 3358 -23865 -14513 -6736 -6007 -1578 15559 18351 -5113 -12718 -8832 -11941
3451 -11941 -688 -14477 -34617 -8325 -12758 -37473 -26608 -11074 736 -4933 7188 3473
3439 3473 13152 12068 13824 16124 13244 31083 34823 7266 -3999 -3894 527 -357 5696 -7242
3425 -7242 -2981 13369 11428 -9742 -30264 -23526 -15738 -991 5788 5763 -13177 4379 4349 -849
3411 -849 -9612 5788 11568 18321 26572 42030 34561 22060 10257 -3338 -11077 -13105 -15079 -11826
3397 -11826 -18591 -28525 -10026 -8430 -17108 -10504 -24380 -30019 -17020 -18898 -32552 -38886 -37933 -34869
3383 -34869 -14609 3107 -4748 -4997 -2849 -7309 -19663 -12768 -13850 -30302 -32381 -41164 -38866 -25082
3369 -25082 -44565 -45031 -21857 -17979 -27994 -27603 -15365 -17427 3256 13556 -7749 -19093 -4058
3356 -4058 25552 15640 -9163 -13724 -233 -10066 -11957 -5490 -13881 -18291 -18238 -27085 -21563 -30938 -30788
3341 -30788 93 1805 -13079 -8843 13801 18387 16752 -3791 -22246 4813 4631 -3858 94
3328 94 -8039 -15569 -456 7504 9283 13003 31366 35370 35330 24928 16642 32012 31398 2199 9360
3313 9360 26202 8625 8990 5064 -19631 -13964 6739 10964 966 152 11062 7915 -1571 11137
3299 11137 30817 32060 25987 15804 14004 7499 11430 11709 7981 -21129 -14192 9319 9996 -3219
3285 -3219 7110 14307 9396 1131 11018 -2951 -9920 14749 27249 34325 29697 16715 -3335
3272 -3335 -19370 -32150 -20883 -2929 16154 35386 37680 42318 17402 -7744 -11632 -15441 -20494
3259 -20494 -15365 -11337 -19846 -21781 -13655 -15230 -14932 12434 -1097 -1417 7387 17462 -8708 -5397
3245 -5397 12982 8593 -1031 -24047 -36409 -31382 -22841 -18666 -32280 -29891 -22689 -11143 -4142 -3314
3231 -3314 1341 6284 4981 4896 -11862 -10449 -17006 -14784 -3801 6667 8733 25943 34128 1013
3217 1013 -9607 1016 -7375 -7359 -17435 -36790 -44585 -14799 8570 26878 24501 15081 10689 14659
3203 14659 13227 7182 5310 2898 -1861 -3447 -4082 7589 284 -11295 -14843 -18212 3191 2524
3189 2524 3915 3973 2015 10223 18497 8830 -20381 -13185 18856 5428 -334 1819 4720 17196
3175 17196 23413 14402 -7916 4756 -13999 -13458 -18502 -10661 -1418 -13252 -4159 -257 12437 15109
3161 15109 25371 39636 43592 52681 35149 19367 13728 5218 -2377 -15810 -36639 -25901 -23020
3148 -23020 -20911 6410 21451 29618 40622 40255 35272 15813 10801 14402 17160 7463 190 -13455
3134 -13455 -31707 -41811 -39876 -30917 -10155 3373 17208 22284 6732 -11336 308 22907
3122 22907 29666 22428 20460 -10017 -26148 -28024 -11502 -5776 12663 35936 33382 28155 20019
3109 20019 5593 -20033 -11622 -4585 26333 30488 32828 44582 31923 25677 21828 14850 21244
3096 21244 18336 25577 38413 29751 18442 4888 -9313 -23570 -26518 -21634 3408 6273 10060
3083 10060 12417 -1673 -13070 -28651 -33640 -41055 -30417 -1841 23348 27376 25720 13995 13845
3070 13845 4611 11180 16026 1111 -5745 3232 -2540 -8591 -4959 -7562 -14053 1609 -6233 -14889
3056 -14889 -1698 -14978 -23143 -25884 -32116 -32602 -26089 109 15579 19161 -6197 -21113 -18873
3043 -18873 -32651 -48479 -37104 -8923 17322 31574 30060 13489 35511 49328 43054 51462
3031 51462 52476 36346 31257 11203 6151 10077 -2868 -25317 -3570 -2616 7438 34509 29500
3018 29500 20440 2002 -8755 -8522 461 -2091 -5829 -15730 -9511 6331 6995 1193 -11746 -12325
3004 -12325 -4887 -4839 -1694 1345 10131 12525 -1500 -23463 -29826 -17780 -3931 -7002 -6441 -13291
2990 -13291 -15364 911 18479 25068 20580 24601 3086 -1239 13215 13402 2798 2630 10956 6684
2976 6684 27008 22641 16357 22636 29393 12611 1366 -23443 -9142 408 6766 11984 -14938
2963 -14938 -15160 4195 18304 20458 31565 26373 18357 16001 -9430 -20307 -26484 -27476 -19106 -8840
2949 -8840 -8196 6275 7829 -11971 -12375 -3234 -8124 -11183 -20126 -16184 -741 -6651 -4442 -6947 -26478
2934 -26478 -20744 -953 545 -17993 -37028 -39418 -27236 738 7109 6207 -4960 -246 -4218
2921 -4218 -14296 67 28533 25895 16256 6158 14611 -2370 -1320 -4725 -6429 228 -8508 -21136
2907 -21136 -17946 -8745 -14995 -15606 -5914 -6598 3297 12176 -4103 -15675 -11226 5745 -5948 -15290
2893 -15290 -14859 -11907 -11532 -15729 -2742 10737 3918 10448 24687 3648 -4370 -9859 -2474 -2425 377
2878 377 -10880 -25982 -25077 -2514 23221 19472 27586 14337 16476 21609 16537 30018 32188 18869
2864 18869 6824 -2019 -6594 -3819 -2004 6721 13425 29039 1146 -21282 -29647 -9926 -13950
2851 -13950 9830 26469 28431 25092 24138 19303 5932 -11250 -10005 11001 7823 6495 -2306 285
2837 285 -4812 -24493 -46993 -47483 -24438 -5361 -9664 -9893 -10749 -20736 -18497 -27781 -13261 -2812
2823 -2812 -14545 -23816 -30789 -15581 -16760 -4695 6211 6685 8202 7744 -1351 1906 30082 28150
2809 28150 9867 6982 -10044 -13863 -3905 9108 -11172 -13198 -10654 2959 7199 4177 12259
2796 12259 21969 16457 -3249 -3066 10504 -201 9384 10066 -6019 6392 15872 27448 28245 15190
2782 15190 5830 1350 2851 1879 1669 -21062 -13642 4451 16795 22935 4515 -5628 15418 23853
2768 23853 25500 45309 32126 26894 21272 34511 28990 2626 9120 38444 32362 37362 42977
2755 42977 52103 38577 20818 -2558 12904 30533 18185 -3659 6044 12289 74 -13818
2743 -13818 5172 14306 17675 4216 18059 10269 9352 17118 17257 2987 -9133 -18372 -33371 -24446
2729 -24446 -8760 -1601 -9109 -14692 -21170 -6002 6003 -3731 11341 35165 31498 16848 -16531
2716 -16531 -17805 12046 27246 13797 5050 12002 18379 15541 12152 21714 42185 40678 48085 51292
2702 51292 18547 -9510 -12640 -1807 -4536 -30718 -44816 -14698 8635 -3879 1208 2153 3137
2689 3137 20240 22887 -8292 10307 -2868 -27271 -29394 -38075 -28428 -3621 15401 22928 18901
2676 18901 18797 21937 14196 20363 21112 24148 16800 13953 20071 21818 21450 -8051 10772 32150 38625
2661 38625 32090 13097 30685 33063 11006 17376 27149 14223 5001 1072 13871 6280 14866
2648 14866 29767 12679 11262 19038 29008 32286 5041 -10237 6929 41617 53983 43119 24504
2635 24504 7936 1989 1149 -5097 605 13310 32646 31021 14822 7848 8202 2660 10418 23704
2621 23704 26042 12954 -14741 -25217 -2899 8435 5758 7844 3038 5043 21477 11995 -7516
2608 -7516 -11439 -16526 -26470 -13440 10635 25341 19277 7175 5153 8874 5045 4761 7940 13638
2594 13638 7036 -5939 -21777 -10522 -12546 -8150 -19525 -45691 -36305 -16424 -9172 -5179 -9240
2581 -9240 -5350 -7813 -18450 -21956 1466 6002 -8767 -31379 -37754 -35894 -43767 -40120 -25005 -21477
2567 -21477 -13787 6167 2186 12289 15295 -12819 -32232 -41359 -55278 -51078 -52828 -48128 -39481
2554 -39481 -37449 -19289 -13009 -10051 231 9682 20305 15649 15122 8359 -2232 3601 4833 -19249
2540 -19249 -32682 -25986 -8295 2415 5465 10773 15474 3871 -7951 -16145 -7608 14641 -16579
2527 -16579 -32210 -33830 -33443 -13495 9366 15692 12393 3179 8483 4609 -1377 -7475 14682 26066
2513 26066 2414 -24822 -16900 -7779 -19685 -5442 -13606 -13870 279 24920 19910 12385 13797
2500 13797 9196 -5244 5981 18166 2424 -18053 -46134 -49889 -53916 -21440 23644 24880 -2285
2487 -2285 -14663 -22653 -12902 -13086 8457 17923 12692 9881 -1864 -28555 -32937 -5896 26771 29289
2473 29289 28233 41174 44512 36892 19190 11640 10180 -4471 -40333 -42216 -25393 -14984 -2258
2460 -2258 6108 -5948 -13866 -32808 -3304 -1129 6984 10091 19762 23055 21445 17386 15320 11688
2446 11688 3131 -2480 1543 5745 25993 35913 8339 -16482 -1651 26294 18283 13402 9632
2433 9632 -5184 -3718 -2819 10599 20032 18542 2839 4319 2475 3505 -11328 -19615 1850 15266
2419 15266 1526 -1587 8678 11339 14752 6971 -15219 -39728 -40250 -33969 -29546 -18683 -20308 -18794
2405 -18794 -14375 -24053 -21802 -17874 -5218 -10967 -20657 -35977 -41884 -17880 13960 12283 6706 1795
2391 1795 4729 5662 14937 7448 6140 10823 9360 -7875 -19316 4443 -1392 -11703 11712 33696
2377 33696 42401 49025 37986 21550 14716 32059 17380 -1913 -23289 -26232 -4642 -1948 -12429
2364 -12429 6723 -9244 -12037 -14383 -12464 -18928 -4935 -2291 6744 -8613 -20850 -22866 -11854
2351 -11854 -381 -1465 5774 -10148 -27777 -22331 -7445 6612 24713 22082 16501 18348 2934
2338 2934 -6054 -17382 -14990 -1530 23289 36400 25991 10353 -728 -5898 -20371 -29107 -20522
2325 -20522 -22678 -5628 -3398 -1574 -4657 -13699 -13355 -4693 -14189 -1247 20326 28059 10657 480
2311 480 -2313 -6572 -31957 -23169 4806 21762 7113 2399 -602 -14744 -9840 4497 1937 852
2297 852 1791 4847 -27059 -23711 -12199 -12665 -11591 -12715 145 12609 23592 24931 24098 7827
2283 7827 6544 -10542 -10105 36 16849 20430 2612 -15905 -24800 -16479 -6446 -8782 -9551 3701
2269 3701 15318 10956 -2315 -14467 -24745 -25524 -20978 -20324 -5864 3131 -647 9972 26179 12901
2255 12901 4018 7211 -5224 -23638 -41363 -31091 -32438 -17711 -2068 -6819 3222 -1442 -15839
2242 -15839 -33165 -38156 -40381 -17569 -3374 7079 11032 25587 30531 28209 17629 13591 -364
2229 -364 -15795 -27300 -17170 -15024 -15377 -23955 -12211 2705 3948 1726 2900 10032 -7186 2730
2215 2730 18191 10418 8271 19959 6664 15175 8204 5216 13714 17867 17430 21979 16546 10149
2201 10149 15790 12654 5679 -1309 -11543 -16453 -16000 -10116 9691 15351 7776 -2947 -15153 -28142
2187 -28142 -52075 -42597 -30139 -7386 -8167 2772 11182 23033 26347 -2899 -13287 -7517 -10178
2174 -10178 -12862 -18315 14447 41893 2531 -16134 -21422 -24659 -5021 9174 2077 5092 -6227
2161 -6227 -20261 -21000 -17285 -28968 -23716 -175 11586 2665 -16230 -10278 17379 12110 -5211
2148 -5211 9978 27474 31930 11518 4201 9447 7351 -1353 -6220 -10056 -11720 2830 2706 2935
2134 2935 5408 621 -7146 5854 26607 15248 85 -6702 -18865 -11052 1732 12855 16576
2121 16576 3876 -12080 1003 7376 17891 8939 -6850 -6670 -5243 1994 4316 8165 6271 -3370
2107 -3370 -17294 -18579 -2923 6278 9149 1126 -30281 -35686 -34186 -36306 -23887 3583 4377 -4262
2093 -4262 -1975 -3229 -8889 -4882 -4788 -734 -7847 -17543 -28802 -24604 -23715 -9603 -4110 8124 -1672
2078 -1672 -13641 -7989 -905 -11538 -9866 -742 20678 10777 12641 30426 27201 4249 6987 22414
2064 22414 18121 15332 -6071 -14303 -10894 -15604 -15735 -5293 15852 10733 -3127 -19920 -18701 -11356
2050 -11356 -7002 -4532 -11591 -17374 4218 -3107 -17653 -10807 -20556 -2642 -4693 -16620 -24578 -4242
2036 -4242 12073 4093 -9788 -28637 -36892 -17639 -20073 -17995 -20105 -12914 -6667 12515 28503
2023 28503 17570 -9183 -16681 -16206 -13471 -11401 -224 968 -2796 4014 17042 21338 15187 9917
2009 9917 20964 37129 36044 29559 15376 5183 4662 6670 8899 13616 26130 16974 21890 28805
1995 28805 24283 21732 51148 65001 56908 20053 -4266 -16908 -15268 -23434 -17511 -15320 -24340
1982 -24340 -4068 14423 5066 11753 20005 27728 11847 5984 12347 26013 22930 753 2390
1969 2390 -885 5892 27754 26246 17463 7847 -6340 -12449 -55 10174 18218 15740 31363 40516
1955 40516 24571 18219 -7257 -20404 -23791 -32890 -23150 4969 -8798 -9181 -12812 -20362 -23847 88
1941 88 7482 9062 -9940 8560 15431 2128 15805 16557 8435 620 5239 8424 13199 18098 39931
1926 39931 62798 68252 47388 42160 37834 9514 -20639 -15036 -3637 -3784 -11122 -20951 7197
1913 7197 16189 -10338 -17525 12736 3412 12133 25926 22519 26671 15507 4652 -7881 -4166
1900 -4166 -19147 -14183 492 28478 11055 7182 12847 18754 6350 6275 -952 -3829 -5118 10786
1886 10786 17195 6575 -7047 -12150 -24886 -37685 -24444 8999 16457 12245 7221 -7429 6440
1873 6440 22640 25355 14847 -12847 -11453 -11278 -4650 6720 18730 1421 -32845 -26074 804
1860 804 -15135 -16901 -4852 -3619 4347 -38706 -33564 -6009 -13562 -15834 -11320 -34256 -18184 13867
1846 13867 33191 31510 18911 13342 11373 15367 44337 29056 1592 12905 42671 45853 12666
1833 12666 4117 17827 23155 29369 40269 19094 -4298 -23054 -25344 -11534 -19131 -36959 -23971
1820 -23971 -14607 -21196 -21535 -26894 8203 25362 17158 -9602 -13988 4644 9394 2605 -6973 -14966
1806 -14966 -7313 5505 8259 9288 24619 35972 36341 14269 -10646 -9566 2976 13264 19968
1793 19968 -1296 -12494 -11870 -11926 -4576 1243 -4792 241 -5017 -1214 -767 3751 10192 -2997 -6635
1778 -6635 -23876 -17819 -40279 -37791 -11227 -18061 -12900 -32464 -35877 -15954 -4693 6465 7103
1765 7103 5642 7899 7117 11649 32184 29049 24740 19460 23319 35092 23096 9110 28594 16950
1751 16950 12568 24545 26326 6253 -2307 -7893 2343 1323 -14013 -19904 -9135 2283 20081
1738 20081 22844 13736 18671 17245 -4400 -22246 -17240 -6191 -21763 -29150 -19999 -17102 -18752 1418
1724 1418 18412 9814 -1847 -6495 -8339 -1428 2933 -27142 -11120 8090 2686 4352 10321 13667
1710 13667 3571 -494 3853 4925 -11400 -29961 -26400 -4935 10413 28065 25576 23012 28675
1697 28675 30938 30139 37517 39524 26748 29299 38780 30901 21291 26030 9322 1774 -105 -2584
1683 -2584 -412 -2234 -3636 -7597 -7610 8908 2518 368 10800 13540 16347 13115 2918 -677 -2085
1668 -2085 11310 17136 360 -5862 -6830 -11840 -7381 13027 28239 18715 5587 7298 3171 7966
1654 7966 6706 6408 642 -28315 -38224 -16755 5029 14427 13824 8529 30130 58496 58691 35597
1640 35597 17914 11666 18245 16107 -5615 -25793 -8082 1731 -1659 348 -511 -16244 1676
1627 1676 14234 1574 -409 6844 4665 -10756 -9571 -26255 -46505 -32353 -5603 9301 7421
1614 7421 6096 11520 22401 20714 19181 25602 -1519 2863 3774 3782 7093 2154 15012 23778 9075
1599 9075 -1848 -16166 -28442 -30160 -11637 2509 2151 6811 1769 -16134 -21019 13070 26557
1586 26557 29357 8676 -11299 -2112 14774 9681 10599 13141 19391 22599 14551 11691 7864 8934
1572 8934 22652 15793 16701 36061 39258 13376 7137 -8881 -9472 -7969 -9806 -1521 -6843 -18434
1558 -18434 -11142 647 -570 -6764 8452 16283 21991 13242 3650 -6879 -20366 -12683 19035
1545 19035 15309 -2218 6883 13307 -1387 -12983 -23885 -2177 15049 -2158 -7133 -29989 -13419
1532 -13419 6750 1920 -6109 -6887 19246 10073 -4497 -8659 15574 17171 20424 19341 -7908 -10334
1518 -10334 -14442 -15909 7628 44529 40641 31596 26809 26415 15602 -13043 -12025 -16715 -14248 -16106
1504 -16106 -9660 -8753 -2347 20179 19932 20047 15124 8840 5919 15595 23335 30035 28812 29865 20469
1489 20469 12672 7651 4450 -4066 -15433 -23851 -23103 -48770 -65581 -47183 -23984 -12527 4828
1476 4828 3705 5676 -3671 -17002 -7740 4165 1327 -533 -9662 -23146 -42656 -31806 -16421
1463 -16421 -4556 -8363 -5827 10698 17640 25544 38403 43174 35052 5913 7192 12754 -39
1450 -39 -18042 -52463 -37103 -30897 -3672 -2441 -18201 -20861 15983 39248 16504 11358 14485
1437 14485 -8519 -6338 -1360 -733 33895 29644 25732 21358 28031 34644 30862 24681 16441 22256
1423 22256 29793 32347 36575 23333 18253 18935 23729 11837 11821 15318 -3430 -8290 -17751 -14911 -7
1408 -7 8819 -4701 -15342 -17222 3000 -6928 -17298 -13514 -10686 1381 8944 -41 -12031 -859
1394 -859 21979 33079 27763 14865 11718 -3738 -10631 -1619 8687 -9882 -6892 4068 -2577
1381 -2577 -2658 8762 -478 -24152 -30260 -20561 -1391 -7707 -10069 -20148 -17461 -15907 -8885 6551
1367 6551 9997 1590 -1792 -8395 402 5045 6571 -194 3056 11860 30171 13149 -16838 -6517
1353 -6517 5713 27330 10984 -2805 -2706 -7441 -14001 3560 -2380 2210 20371 16661 17723 12995
1339 12995 -5071 -24009 -12106 5444 9784 -2230 -10697 -18043 -1242 11731 -316 -14980
1327 -14980 -9336 19072 36680 19197 10878 7742 27738 30057 22054 -1162 -9202 -12129 -1580
1314 -1580 -265 6358 15535 17165 4027 -9498 -11621 -13773 -22198 -16105 -13921 -2234 21581 32795
1300 32795 30575 19661 -784 -17571 -18309 -17108 -10123 1199 4003 22187 29056 25123 21602 30609
1286 30609 41311 28153 24475 22885 4980 5765 -6185 -10971 -6434 -21037 -18986 -17380 -21754 12182
1272 12182 16524 3087 3138 5997 10987 17192 22407 11498 19014 31448 15807 5588 15733 23166
1258 23166 14214 2452 -16691 -29165 -22297 -14067 -18530 -30690 -17276 -6688 20687 8588 17603
1245 17603 21274 4958 -8262 6584 -4286 -4306 10896 31090 24438 17526 35179 43386 34548
1232 34548 20898 -343 -10876 -14856 -3332 3154 -13045 -17254 -17112 -22591 -935 -879 725 -3169
1218 -3169 3012 8766 4185 20248 6198 11796 9299 8857 8580 11312 640 7850 26053 39558
1204 39558 43063 41385 11063 -21537 -31879 -7625 2346 28628 26853 18625 12539 -695 4378
1191 4378 -10193 -12207 -25714 -25603 -17280 -11315 6148 11204 12313 23811 33711 30627 22199 45863
1177 45863 42699 18299 11484 19326 17838 20707 19352 13245 5830 27430 20396 2980 10826 19321
1163 19321 13808 36170 55595 54003 35664 33009 40938 25135 10508 2430 -2296 -4157 -10928
1150 -10928 4369 9355 -2619 -1827 22316 13461 17187 22536 34727 26922 25617 36025 19225
1137 19225 -1389 -16081 -20504 -19995 -9139 3843 8315 9571 26012 44096 41535 13713 4126
1124 4126 8193 13722 13443 13826 10179 -6000 3197 7158 -2611 -13996 -4742 6260 7762 7500 1142
1109 1142 -3123 2034 11174 16081 8926 -17481 -22718 -29454 -28810 -20387 -5906 -6965 -16279 -15262 -9105
1094 -9105 -8822 -7737 -14808 -20075 -19641 -10694 -20341 -16937 -14099 9383 29063 34939 29421 19380 28420
1079 28420 6719 1350 -14976 -28790 -28713 -11919 -14594 -33076 -39882 -27759 -15305 -10583 -14248
1066 -14248 2083 16353 27177 29594 12870 6724 -3094 -26451 -13542 -23865 -28307 -2744 16034
1053 16034 -2212 -13460 -5798 5503 4220 -5924 -4538 2082 4769 -6773 -17261 -21407 -4191
1040 -4191 5973 -9270 -35155 -30431 -4835 4551 10985 -5347 -17211 -3258 3752 -12353 -1762
1027 -1762 7899 408 -2666 -4700 2167 9720 4573 3892 -4710 -18159 -27821 -31086 54 20596
1013 20596 31118 31857 19492 9148 6310 8865 16134 18386 20221 21662 30515 45217 54656 37575
999 37575 4552 6414 6557 18919 31115 47042 24509 -28933 -21002 12733 22031 28446 22522
986 22522 4930 5663 33557 13258 2193 5406 -3630 -1667 7204 29214 35529 16032 18815 5941
972 5941 -7727 -8198 8178 12077 17804 30574 23162 11788 15758 13327 24543 26291 26620 18027
958 18027 12108 13674 43985 41503 13589 15352 20050 11032 12348 26569 29845 38032 14301 14244
944 14244 19640 -4421 -29928 -19272 -16123 -6416 7846 13273 11350 31212 43063 44457 29560
931 29560 31943 26892 16491 13541 25706 32466 34727 26593 16907 702 -2030 12965 12762 25161
917 25161 28831 15367 3489 -4415 9893 18105 6984 11540 31862 13427 16872 11207 4514
904 4514 2988 17984 19463 39950 30294 1616 -3194 -161 11103 35065 6671 -16650 -20267
891 -20267 -33041 -28334 -10647 4922 3075 -5336 11103 19513 19080 21707 28389 33336 3160 -3829
877 -3829 -3704 -6879 -4434 9189 9939 -322 -11193 -10290 1741 -3170 -9784 -13444 -4848 -9639 -23742
862 -23742 -38687 -19419 3891 23686 14916 4642 -931 -9113 -18322 -8376 -7885 -12748 -3639 -10253
848 -10253 159 9505 8897 6424 -10212 -9455 14807 16352 11321 2675 4962 4117 -5080 -10556 -24232
833 -24232 -25384 -19109 -9606 -5153 3414 1541 -4300 -14288 -17424 -1040 6760 20763 21790 -1203
819 -1203 -7223 9728 22982 26335 13881 15444 20775 39180 50848 42632 22544 18175 -3053
806 -3053 25888 31137 26177 24958 36513 15887 -11468 2255 21204 50243 43092 58287 75992
793 75992 47966 10992 9626 7671 10669 3034 15575 18668 20601 15725 17038 1870 6016 24716
779 24716 16994 24219 32174 26738 8286 6459 39285 31430 17805 21528 13583 21990 40840 49815
765 49815 33011 17983 22283 23205 23004 13016 6987 18197 29428 41062 30933 20671 6569
752 6569 12464 21147 -478 -23542 -12171 20964 38262 54328 50851 28627 39345 69880 64988
739 64988 57540 53832 43441 35264 52801 56670 40299 33201 37152 36348 37788 54794 40780 23695
725 23695 5454 2044 22180 30599 32981 35381 39784 48214 34142 25615 25807 6125 4968 20910
711 20910 37075 42536 54902 47280 46493 63060 56776 45928 19463 16670 18922 -7643 -19421
698 -19421 -13531 -14024 13489 30514 48294 42878 24997 1667 -22307 -23375 -6466 646 -11177
685 -11177 -19960 118 12626 12195 19123 30395 42914 51926 43722 22292 14951 18184 6487 16908
671 16908 7900 -6407 5573 19184 36754 49076 38142 31345 24422 21523 27958 -2293 -18022
658 -18022 -9893 15230 31571 33768 19899 13180 235 13608 28434 39405 31721 28589 30638
645 30638 35268 42416 56568 51140 23113 24242 27928 41350 24339 36436 24692 20989 17889
632 17889 13062 14976 22230 6847 -7121 6148 17722 25637 33259 10152 -17432 -1500 23312
619 23312 11752 1175 15558 25055 33599 48210 63321 55294 39111 13787 9810 27426 36331
606 36331 22068 1232 -9953 3350 15906 25340 25790 28413 21791 23334 38228 51406 52812
593 52812 52880 27901 11150 9033 -19890 -21968 -2741 27828 16048 6585 -5865 -134 8439 15780
579 15780 40607 49585 45600 36641 30455 31879 20101 11610 5748 18272 45434 60876 57836 34798
565 34798 24184 16543 14064 32300 42189 50630 35488 19189 22455 33069 47666 51047 39301
552 39301 25345 -4356 -6355 -778 17257 22326 19910 29943 31588 15798 29925 61285 39822
539 39822 6468 17260 40779 45169 26601 18075 20500 37015 51141 40101 25744 31432 25447
526 25447 27649 53979 61611 53595 38351 22347 12316 7149 12834 15318 20007 36205 32382 28385
512 28385 25895 15368 16157 16681 -4106 4677 22103 41691 27854 21101 1215 -1202 8270 14568
498 14568 33979 29676 50617 60889 39120 24749 8156 5355 27935 21124 640 -10757 -9894
485 -9894 -2546 26009 44989 31003 28190 20452 14015 18753 11513 10829 5022 22288 22838 31559 42040
470 42040 37504 10676 -8639 -831 7548 14043 18018 23656 24340 20681 28571 41396 39327 48836
456 48836 62469 66717 65781 55198 53585 37776 29556 51645 85484 69029 42703 24274 45262
443 45262 42147 30856 33777 40004 29977 22991 34462 45850 58151 48868 38149 45099 20462
430 20462 8497 14833 26837 36979 46442 41060 34166 30387 31468 22095 19597 20207 18938 5995
416 5995 -13584 -16392 11920 30173 26359 14544 19264 -4884 -2323 -4137 14827 22467 7421
403 7421 -2691 5284 4182 -11684 11962 18403 6104 28620 48920 37770 37536 57024 36810
390 36810 29195 41514 37292 24825 20451 7734 17786 20022 35756 51264 62211 56010 41892
377 41892 26150 14801 21428 32259 20074 16251 29334 40448 42802 54789 43313 40313 34045
364 34045 36545 34886 34389 12175 9298 33842 42788 46048 35650 14644 -596 -5315 5203 16094
350 16094 26933 49881 67744 54296 53059 48189 49676 34632 27619 26592 25090 43593 32873
337 32873 18588 7917 20002 21236 13832 8101 14238 -351 4137 16846 39716 45174 34892
324 34892 23008 28217 18564 2919 15358 25944 34578 44696 30652 23446 9114 6038 -3474
311 -3474 1342 12410 21925 34113 37327 13951 15797 8480 24023 41261 21458 4113 -12929
298 -12929 -21725 -16955 -724 6453 6755 15592 21447 28693 37588 37587 19020 21998 24729 13014 14237
283 14237 16459 8317 20399 30161 25738 34735 32858 25826 25985 28253 37386 24229 31794 40263 31858
268 31858 4832 4918 22206 33877 29359 16342 30608 41522 53482 49630 59001 61321 31953
255 31953 25974 21609 4176 6855 2812 1404 12350 23912 31128 22181 245 -135 13456 48105
241 48105 55990 45676 52220 55087 51253 39963 36180 28704 36750 44718 41232 25844 3373 -4974
227 -4974 3259 10438 22366 30444 36976 13903 10823 33314 44305 35683 40077 36053 30964 52690
213 52690 67878 54422 39098 39087 37409 29245 33021 6516 3792 29798 19841 13462 10550 11723
199 11723 12001 16874 17063 1677 -13087 4744 28967 25347 28475 30889 19608 -986 12666 13997
185 13997 16791 28517 23324 15802 13523 17611 21424 10733 4320 5862 5648 10948 21405 28025
171 28025 32395 26993 14937 19706 41125 54884 69982 61237 42307 43405 40908 55468 56917
158 56917 40120 34592 33110 33673 26980 24508 30247 27855 22535 21491 33528 37289 33209 32576 24807
143 24807 27939 38502 40993 42590 42963 41329 25603 6892 6704 14131 29104 48249 43597 37724
129 37724 38818 51828 51306 36144 13385 16115 24689 29842 15892 11915 9470 21671 31326 4502
115 4502 -1914 10686 19821 23474 26593 8388 -9093 -17989 -7251 7777 22270 26006 22691 21119
101 21119 23477 17392 16876 11941 21059 13256 7697 9950 8085 23865 30859 40332 61740 54427 37933
86 37933 28922 23132 38941 55627 40890 38745 47290 50403 43880 25579 14424 9231 2692 11638
72 11638 27887 33740 19392 10580 11343 22070 31017 36371 35740 33176 40966 46126 59997 77835
58 77835 63518 49164 36471 41709 28011 30709 34904 23637 23100 28811 33914 38471 33139 32546
44 32546 40794 36081 47417 38875 27239 21762 28034 21703 24333 40513 38373 15970 3779 2475
30 2475 29325 37728 34291 23819 19965 33519 46865 57774 57919 44766 33011 17499 4579
17 4579 1877 -10564 -6169 -559 6173 17761 32680 35899 39103 37598 29815 23845 20265 12480 6935
2 6935 8124 19463
0 19463
$$ Imaginary data points
##PAGE= N=2
##DATA TABLE= (X++(I..I)), XYDATA
32767 87166 83487 79588 81386 80572 71408 66755 63576 75559 83407 84550 94316 97701 90271 82479
32753 82479 95559 91137 80873 81876 101637 111458 102958 111208 108309 93350 73336 67682 70767
32740 70767 86094 105967 124542 123255 118551 119259 116853 115002 124126 126101 121516 118031 111580 99030
32726 99030 92139 98359 101804 111170 106522 104695 106135 103027 104483 117354 115458 100921 107972 120082
32712 120082 135367 137067 127652 120184 114445 117806 113541 102505 95455 97977 113005 134411 119423
32699 119423 113374 122023 121993 129899 119648 133570 124711 111243 109572 117855 117050 124146 127467 123119
32685 123119 117410 130302 145679 135893 122657 131326 151140 143245 127849 111548 109689 129076
32673 129076 137210 126471 122428 123225 115578 118270 130530 139251 152792 161250 152278 151600 140480 137863
32659 137863 135242 156300 158118 152576 157530 150002 153806 155996 149348 128807 119539 108630 118701
32646 118701 121014 127344 125390 134974 150921 144652 127102 124390 132711 125693 125682 133633 140061 132485
32632 132485 129717 119809 132115 155089 159074 148203 156987 170165 175457 168621 172951 168762 156825
32619 156825 143651 150088 157200 169955 167336 179644 191396 183232 163316 144668 150461 170702
32607 170702 164979 162492 170229 179137 184843 185215 176393 182116 186818 187338 177702 175860 172307 190593
32593 190593 180243 174829 180310 181215 173711 164233 169045 165412 158055 141979 147540 162045 170652 173217
32579 173217 179597 182092 174931 183264 172490 174743 182103 186160 189006 200590 204748 198116 166865
32566 166865 147586 155750 152883 158255 163227 185461 194127 185808 178244 171020 164890 168051 182838
32553 182838 205158 205442 186807 178725 165622 173286 179869 170306 184409 186817 191805 196117 188586
32540 188586 177182 173452 172845 171580 186308 193226 210305 204528 189515 195618 186528 200811 223211
32527 223211 228034 222757 208161 197801 182055 175391 185749 200063 216544 213808 197150 195454
32515 195454 197201 195319 190146 192638 215778 210403 210811 207582 203579 210675 222435 201335 180785
32502 180785 200998 210617 208491 211128 218758 215000 216462 232922 239132 226480 205473 217891 225702
32489 225702 225273 219664 201163 193576 200433 208274 209637 196975 208113 208395 209304 208422 203532 198725
32475 198725 184799 190573 187269 202875 210161 231487 236297 231910 240565 235280 222589 216631 232156
32462 232156 263519 260620 243369 220629 213954 203241 203694 214744 219324 224832 228352 214766 199762
$$ [...]
##END NTUPLES=NMR SPECTRUM
##END=
