##TITLE=Analysis number 315298
Compound Code cc 16402
Book Reference 350/200/5
Project Code adrs
Chemist Name chrisr
##JCAMPDX= 6.0         $$ Bruker NMR JCAMP-DX V2.0
##DATA TYPE= NMR SPECTRUM
##DATA CLASS= NTUPLES
##ORIGIN= Bruker BioSpin GmbH
##OWNER= NMR
$$ XWIN-NMR		Version 3.5
$$ Mon Nov 14 11:37:09 2005 GMT Standard Time (UT+0h)  MAYBRIDGE\NMR@NMR_250MHZ
##.OBSERVE FREQUENCY= 250.131544655141
##.OBSERVE NUCLEUS= ^1H
##.ACQUISITION MODE= SIMULTANEOUS (DQD)
##.ACQUISITION SCHEME= undefined
##.AVERAGES= 16
##.DIGITISER RES= 18
##SPECTROMETER/DATA SYSTEM= dpx250
##.PULSE SEQUENCE= zg30
##.SOLVENT NAME= CDCl3
##.SHIFT REFERENCE= (INTERNAL, CDCl3, 0, 16.4529)
##AUDIT TRAIL= $$ (NUMBER, WHEN, WHO, WHERE, WHAT)
$$ ##TITLE= Audit trail, XWIN-NMR		Version 3.5
$$ ##JCAMPDX= 5.01
$$ ##ORIGIN= Bruker BioSpin GmbH
$$ ##OWNER= NMR
$$ C:\u/data/dgb/nmr/ADRS/12270/pdata/1/auditp.txt
$$ ##AUDIT TRAIL=  $$ (NUMBER, WHEN, WHO, WHERE, WHAT)
(   1,<2005-11-14 11:36:47.03 +000>,<MAYBRIDGE\NMR>,<NMR_250MHZ>,
      <created by zg, POWCHK disabled, PULCHK disabled
       configuration hash MD5:
       62 19 C7 07 E1 42 D1 B7 37 6C 3D D0 77 39 F9 E6
       data hash MD5: 64K
       B3 FA B4 17 5D 62 07 7C B6 63 C1 7B 28 67 68 93>)
(   2,<2005-11-14 11:37:00.25 +000>,<MAYBRIDGE\NMR>,<NMR_250MHZ>,
      <Start of raw data processing
       ef LB = 0.3 FT_mod = 6 PKNL = 1 SI = 32K 
       data hash MD5: 32K
       ED 20 A1 C3 40 F0 D3 76 43 C3 3A B4 E9 A4 4D 1C>)
(   3,<2005-11-14 11:37:02.10 +000>,<MAYBRIDGE\NMR>,<NMR_250MHZ>,
      <apk 
       data hash MD5: 32K
       AF BB 83 87 79 61 44 D8 3C 23 E8 FA 29 86 79 DE>)
(   4,<2005-11-14 11:37:02.82 +000>,<MAYBRIDGE\NMR>,<NMR_250MHZ>,
      <abs ABSG = 5 
       data hash MD5: 32K
       81 9E 3A 54 26 F4 89 DF DD 93 BF 36 2C 31 5C 6B>)
$$ ##END=
$$ 
$$ hash MD5
$$ 33 D1 F8 18 EA 4D 04 65 F0 D8 C6 D9 50 2C 8A 57
##$RELAX= 
##$RELAX= 
##$RELAX= 
##$RELAX= 
##$RELAX= 
##$RELAX= 
##$RELAX= 
$$ Bruker specific parameters
$$ --------------------------
##$DU= <C:\u>
##$EXPNO= 12270
##$NAME= <ADRS>
##$PROCNO= 1
##$TYPE= <nmr>
##$USER= <dgb>
##$AMP= (0..31)
100 100 100 100 100 100 100 100 100 100 100 100 100 100 100 100 100 100 
100 100 100 100 100 100 100 100 100 100 100 100 100 100 
##$AQSEQ= 0
##$AQ_mod= 3
##$AUNM= <au_zg>
##$AUTOPOS= <23 >
##$BF1= 250.13
##$BF2= 250.13
##$BF3= 250.13
##$BF4= 250.13
##$BF5= 500.13
##$BF6= 500.13
##$BF7= 500.13
##$BF8= 500.13
##$BYTORDA= 1
##$CFDGTYP= 0
##$CFRGTYP= 5
##$CHEMSTR= <none>
##$CNST= (0..31)
1 1 145 1 1 1 1 1 1 1 1 1 1 1 1 1 1 1 1 1 1 1 1 1 1 1 1 1 1 1 1 1 
##$CPDPRG= <>
##$CPDPRG1= <>
##$CPDPRG2= <>
##$CPDPRG3= <>
##$CPDPRG4= <mlev>
##$CPDPRG5= <mlev>
##$CPDPRG6= <mlev>
##$CPDPRG7= <mlev>
##$CPDPRG8= <mlev>
##$CPDPRGB= <>
##$CPDPRGT= <>
##$D= (0..31)
0 1 0 0 0 0 0 0 0 0.06 0 0 0 0 0 0 0.0002 0 0 0 0 0 0 0 0 0 0 0 0 0 0 
0 
##$DATE= 1131968206
##$DBL= (0..7)
120 120 120 120 120 120 120 120 
##$DBP= (0..7)
150 150 150 150 150 150 150 150 
##$DBP07= 0
##$DBPNAM0= <>
##$DBPNAM1= <>
$$ [...]
##$SUBNAM7= <"">
##$SUBNAM8= <"">
##$SUBNAM9= <"">
##$SW= 20.6930455092707
##$SWIBOX= (0..15)
0 0 3 0 0 0 0 0 0 0 0 0 0 0 0 0 
##$SW_h= 5175.983436853
##$TD= 65536
##$TD0= 1
##$TE= 294.16
##$TE2= 300
##$TE3= 300
##$TEG= 300
##$TL= (0..7)
0 120 120 120 120 120 120 120 
##$TP= (0..7)
150 150 150 150 150 150 150 150 
##$TP07= 0
##$TPNAME0= <>
##$TPNAME1= <>
##$TPNAME2= <>
##$TPNAME3= <>
##$TPNAME4= <>
##$TPNAME5= <>
##$TPNAME6= <>
##$TPNAME7= <>
##$TPOAL= (0..7)
0.5 0.5 0.5 0.5 0.5 0.5 0.5 0.5 
##$TPOFFS= (0..7)
0 0 0 0 0 0 0 0 
##$TUNHIN= 0
##$TUNHOUT= 0
##$TUNXOUT= 0
##$USERA1= <user>
##$USERA2= <user>
##$USERA3= <user>
##$USERA4= <user>
##$USERA5= <user>
##$V9= 5
##$VALIST= <valist>
##$VCLIST= <CCCCCCCCCCCCCCC>
##$VD= 0
##$VDLIST= <DDDDDDDDDDDDDDD>
##$VPLIST= <PPPPPPPPPPPPPPP>
##$VTLIST= <TTTTTTTTTTTTTTT>
##$WBST= 1024
##$WBSW= 4
##$XGAIN= (0..3)
0 0 0 0 
##$XL= 0
##$YL= 0
##$YMAX_a= 293311
##$YMIN_a= -320138
##$ZGOPTNS= <>
##$ZL1= 120
##$ZL2= 120
##$ZL3= 120
##$ZL4= 120
##$ABSF1= 16.45295
##$ABSF2= -4.240223
##$ABSG= 5
##$ABSL= 3
##$ALPHA= 0
##$AQORDER= 0
##$ASSFAC= 0
##$ASSFACI= 0
##$ASSFACX= 0
##$ASSWID= 0
##$AUNMP= <proc_1d>
##$AZFE= 0.1
##$AZFW= 0.1
##$BCFW= 0
##$BC_mod= 0
##$BYTORDP= 0
##$COROFFS= 0
##$CY= 12.5
##$DATMOD= 1
##$DC= 0
##$DFILT= <>
##$DTYPP= 0
##$F1P= 14.0000005364418
##$F2P= -0.99999901652339
##$FCOR= 0.5
##$FTSIZE= 32768
##$FT_mod= 6
##$GAMMA= 0
##$GB= 0
##$INTBC= 1
##$INTSCL= 1
##$ISEN= 128
##$LB= 0.3
##$LEV0= 0
##$LPBIN= 0
##$MAXI= 10000
##$MC2= 0
##$MEAN= 0
##$ME_mod= 0
##$MI= 0
##$NCOEF= 0
##$NC_proc= -4
##$NLEV= 6
##$NOISF1= 0
##$NOISF2= 0
##$NSP= 0
##$NTH_PI= 0
##$NZP= 0
##$OFFSET= 16.45295
##$PC= 1
##$PHC0= 87.64713
##$PHC1= 2.094319
##$PH_mod= 1
##$PKNL= yes
##$PPARMOD= 0
##$PSCAL= 4
##$PSIGN= 0
##$REVERSE= no
##$SF= 250.130017269345
##$SI= 32768
##$SIGF1= 0
##$SIGF2= 0
##$SINO= 400
##$SIOLD= 32768
##$SREGLST= <1H.CDCl3>
##$SSB= 0
##$STSI= 32768
##$STSR= 0
##$SW_p= 5175.98343685301
##$SYMM= 0
##$S_DEV= 0
##$TDeff= 65536
##$TDoff= 0
##$TI= <Analysis number 999999
Compound Code 99
Book Reference 9
Project Code 9>
##$TILT= no
##$TM1= 0
##$TM2= 0
##$TOPLEV= 0
##$USERP1= <user>
##$USERP2= <user>
##$USERP3= <user>
##$USERP4= <user>
##$USERP5= <user>
##$WDW= 1
##$XDIM= 32768
##$YMAX_p= 370427801
##$YMIN_p= -484170
$$ End of Bruker specific parameters
$$ ---------------------------------
##NTUPLES= NMR SPECTRUM
##VAR_NAME=  FREQUENCY,     SPECTRUM/REAL,   SPECTRUM/IMAG
##SYMBOL=    X,             R,               I
##VAR_TYPE=  INDEPENDENT,   DEPENDENT,       DEPENDENT
##VAR_FORM=  AFFN,          ASDF,            ASDF
##VAR_DIM=   32768,         32768,           32768
##UNITS=     HZ,            ARBITRARY UNITS, ARBITRARY UNITS
##FACTOR=    0.157963299565203, 1,           1
##FIRST=     4115.37654855122, 0,            0
##LAST=      -1060.60688830179, 0,           0
##MIN=       -1060.60688830179, -484170,     0
##MAX=       4115.37654855122, 370427801,    0
$$ Real data points
##PAGE= N=1
##DATA TABLE= (X++(R..R)), XYDATA
$$ [...]
29276 -16581 60388 124645 -9124 -124298 -160662 -69010 -69113 -71555 -93387 -109269 -104526 -83730
29264 -83730 -37933 19118 -31548 13359 59644 149211 179672 104467 57067 -40890 -27454 -68849
29252 -68849 -148649 -197736 -165494 -76071 -35786 -97283 -4938 62552 79815 87826 75033 38878
29240 38878 97643 125312 139212 251880 225742 101129 -26114 56682 68013 75645 116780
29229 116780 245270 195825 123838 181602 97399 17840 8848 -72477 -20641 45322 144565
29218 144565 124633 63836 83271 66286 80695 -106865 -129500 67010 129855 79145 68349
29207 68349 20681 41268 20724 -67756 -124505 -167985 -84871 -7006 -2188 -36816 -124686 -45880
29195 -45880 34165 15395 -70053 -83552 -104423 -17350 114690 49819 -57061 -113043 -41811
29184 -41811 -43389 -11063 -141435 -89006 -113692 -204 -37422 -68332 -140868 -45628 22284
29173 22284 35069 -32844 -72608 -5295 145297 59701 -40745 -96710 -66900 -94715 -19547
29162 -19547 43864 37141 -6868 -50895 -22556 -138730 -89427 17160 -10304 45787 135251
29151 135251 170451 251466 250875 167726 134692 130791 118969 119537 203815 125532 48586 134034
29139 134034 834 -118454 -150319 -126677 -48262 341 42438 -75005 -100842 -38473 96424
29128 96424 158736 72248 9065 -35787 -65728 -123847 -41230 -29481 -63698 -16737 -79169 -108941
29116 -108941 28171 62213 152707 125952 125901 148071 147882 197111 96600 -23942 -52492 -92599
29104 -92599 -115849 -37849 -116708 -246410 -268722 -256781 -144607 -70757 -61521 -439 50675
29093 50675 19747 108063 -1384 6302 169859 175759 230309 311314 179307 126153 -55960
29082 -55960 -40227 -134795 -46452 123685 139508 192094 164533 181988 117550 76820 150800
29071 150800 176404 161693 117410 -34187 35717 63838 105667 26287 81738 58114 104540
29060 104540 155184 176295 7219 -80341 -96438 -85360 -97237 -97756 -166369 -129810 -76309 27112
29048 27112 82560 -53195 -173936 -238377 -173410 -168871 -43133 -110620 -118380 -93006 9835
29037 9835 31464 7005 -40424 -64604 -100953 15856 123918 -10390 -81043 -153879 -142549
29026 -142549 -13855 186527 186062 195510 242526 94360 49411 -17827 -123660 -206121 -126075
29015 -126075 -62280 -75937 -31526 65415 119189 128263 31611 96965 211376 245513 177755
29004 177755 136111 86343 126628 135078 87276 78641 56633 70644 34825 -35561 -90215 -111874
28992 -111874 -58836 78052 109614 108340 53839 -6694 -173892 -119379 200597 281178 205627
28981 205627 75087 6897 -77259 -9025 64786 93725 81507 -21160 -20313 -23077 -48921 -123110
28969 -123110 17681 234590 212178 260179 287252 185179 28366 11769 130592 101466
28959 101466 156745 163901 -17727 -22458 27736 76380 161358 189013 213024 221763 178572 71446
28947 71446 -25816 -22209 -70722 -79354 -2348 -141779 -80741 -10600 57072 -46087 -104485 -84040
28935 -84040 -142819 -144677 -74224 -17869 37036 148646 173252 171782 115524 112673 121239 146908
28923 146908 145407 175539 86362 -17061 -50390 -7287 184749 278288 193673 165664 175003
28912 175003 140058 114231 81462 -7318 -140951 -35905 -14458 16500 87278 118844 57947
28901 57947 66395 46939 108973 88621 79560 14680 -34915 -17142 90447 43636 -29145 69341
28889 69341 68889 118486 64116 4496 19259 67516 149344 162729 130969 55771 11714 -3460
28877 -3460 28245 137102 151098 53098 60074 -42014 -34735 -14437 21632 46461 154455 217927
28865 217927 89845 94454 158455 161204 78042 35432 50002 8895 10689 -17627 31586 23621
28853 23621 89799 65428 2961 -21359 43721 11882 24414 11539 -65037 -123413 -205678 -200546
28841 -200546 -290630 -379713 -262025 -229631 -200072 -152752 -193525 -203403 -145193 -172563 -26738
28830 -26738 57384 118540 83540 59878 -73566 -125925 -122991 2860 100200 20209 -10833
28819 -10833 67124 24989 -108597 -142128 -169458 -154969 -135749 -71609 -96437 -45939 57303
28808 57303 97583 -435 -69725 53429 126565 106409 80442 125308 -14506 -77678 85829
28797 85829 52223 29136 -37647 -198285 -172526 -257883 -267264 -176869 5775 181884 115081
28786 115081 65415 23423 11845 131047 143715 89150 1048 -15768 -9764 -12626 -17902 22612
28774 22612 102159 50438 45737 -42120 -139811 -135409 -136597 -73946 -85873 -208208 -216948 -304383
28762 -304383 -284134 -247781 -260378 -230912 -147209 -37784 -17026 -64945 23434 209206 208275
28751 208275 187151 203816 38732 53880 64944 -14394 -53023 -47035 -45451 -192020 -147848
28740 -147848 -54473 -98039 -53678 31249 45090 81355 19229 -89562 -96709 57321 50917
28729 50917 -22140 -29510 51444 109576 5121 55259 89575 222541 113909 -57115 -57586
28718 -57586 -71378 -71907 -89102 -60846 -111504 -64612 -53714 62202 -2325 -47645 83881 138531
28706 138531 82704 32027 -838 6104 -25062 26450 78514 114753 22051 -86965 -46812
28695 -46812 -70237 -41230 14575 50785 -8976 -91418 -111289 -180432 -164889 -51397 8248
28684 8248 -23748 -6126 16853 47384 59049 36430 92244 171593 137951 19720 -11234 -63074
28672 -63074 -109311 -92937 -113150 -67061 26279 33153 19008 65969 17277 -26233 10787 -39683
28660 -39683 -131888 -98535 -37163 118425 247745 247253 221021 212309 143528 42055 -33278 -90241
28648 -90241 -46541 -60345 -91926 -14593 37273 106208 105628 27748 73836 94766 36448 8897
28636 8897 4384 122797 255627 145281 42457 3400 -86819 -129182 7129 12516 51370
28625 51370 99306 156181 272725 187943 74470 26290 46633 1641 16586 7301 89257
28614 89257 114797 36799 5502 100997 216985 166553 115657 148428 121491 -37685 -105166
28603 -105166 -11149 33592 -112799 -37259 5204 -8010 -54411 -106939 -51762 -38869 -78584
28592 -78584 -121041 -183229 -41732 57108 81135 197576 175989 26431 27574 -47521 20813
28581 20813 17321 -33628 -36644 -16301 15158 -30652 -35507 -28347 -51502 -126810 -80782 -31043
28569 -31043 91194 111766 97542 64396 102380 152825 84119 8593 12799 14948 22136 -87341
28557 -87341 58084 125083 -3906 -50480 -119279 -4405 88963 60773 7787 62258 -53276
28546 -53276 -133394 14090 16533 -20421 -43019 61839 -46063 -131192 -16828 -16302 -29697
28535 -29697 -9409 -92104 -204251 -195453 -99748 11242 39832 7796 -65967 -81535 -25350
28524 -25350 -27536 42412 5327 -32588 -29408 1040 37969 48968 92470 166644 -49768 -191360
28512 -191360 -188126 -148000 -70366 -134105 -108807 -36764 204662 179768 33331 1787 161843
28501 161843 170765 -20689 -171436 -106754 -84084 -56901 -48700 -6472 -96782 -207951 -313880
28490 -313880 -219162 -103680 2167 -8613 -58222 -15203 55367 -34492 -85840 18365 -9345
28479 -9345 -51030 -143183 -306789 -215290 -35824 167797 200720 194149 99783 12194 15523 131455
28467 131455 82221 10656 14906 -71201 -71868 -43823 -59346 102312 193122 -36480 -243399
28456 -243399 -247537 -212106 -164278 -64117 13065 -20010 -14933 -38075 96197 141810 105276
28445 105276 120821 249222 160052 23243 62075 83612 119232 199965 214721 176252 156626
28434 156626 116984 168011 178365 57676 39734 32449 -72009 -145753 -70213 -4437 14294
28423 14294 14640 -7502 20003 -135082 -205665 -249642 -197674 -255109 -167692 -28436 -10417 68459
28411 68459 90831 82900 12776 -4802 43447 61068 -9398 -3894 -131068 -134269 -69183 -63172
28399 -63172 -63426 -1611 -146542 -246999 -102945 -82369 -139192 -8852 37770 -10228 -18405
28388 -18405 -115751 -211883 -126944 -175285 -227025 -176282 -77409 -12567 28890 106976 34204 -20411
28376 -20411 89430 113336 99052 57956 105067 92188 -2282 -67787 -106265 -82979 -91750 -116503
28364 -116503 -242807 -189802 -93468 -26483 -16794 -21312 67978 123730 108749 101367 40758 -26458
28352 -26458 -140598 -51215 88157 50390 -6520 62684 125547 148417 175931 180560 105493
28341 105493 23021 -32082 -51819 -43222 -8216 20877 91782 152283 143872 92211 70039 61806
28329 61806 41564 -52767 -23567 19746 149479 144632 51225 37419 -10339 32318 121924 108682
28317 108682 26282 -154195 -182526 -55133 -8396 -13391 -95733 -113461 -8072 26946 7691
28306 7691 -14153 15355 39309 85334 165371 216027 173581 198831 123281 42269 56685 14915
28294 14915 30828 -20620 -167234 -192161 -140906 -97898 -139819 -63790 45444 159688 114625
28283 114625 81542 -969 -179930 -76578 -16779 28343 -31629 -57498 -45335 -3899 -62614
28272 -62614 -214595 -165064 -55687 81525 140466 137539 51088 -39246 -128045 -227352 -155668
28261 -155668 -121554 -189597 -162089 -104374 39879 -4633 -84161 -107089 -22207 -27550 -119103
28250 -119103 -115970 -61116 -46251 -50087 -126063 -77767 -72802 -28530 -41855 -23600 28649 118173
28238 118173 204134 229176 219841 192669 113067 87355 64931 67918 156714 128270 77764 134437
28226 134437 103179 -1304 -33423 -46699 -79088 -138191 -87437 -46164 -27271 99201 171200
28215 171200 165145 187432 186049 144920 159552 182821 77065 -102674 -191471 -156930 -139379
28204 -139379 -34115 -2960 -35864 102616 114584 40475 -54559 -130309 -90576 14017 47964
28193 47964 11350 -8793 -33000 -21963 -3884 41853 120842 256292 309239 217051 15359
28182 15359 129345 109983 -19090 82122 42983 246 -14259 169945 205908 25771 -41101
28171 -41101 -15091 63553 99576 118704 106176 152160 78334 -30181 -132859 -215881 -173975
28160 -173975 -99033 -79642 3967 104842 103014 100291 65114 113012 100893 37069 47324 35649
28148 35649 -50663 -37492 60417 125280 145595 121382 133370 39354 -48428 8681 49853 46221
28136 46221 -14715 22721 102531 179089 204736 187982 183678 80502 -98855 -37015 -2716
28125 -2716 42109 196800 170332 15605 11447 50154 39174 22423 91211 30596 29204 105708
28113 105708 59913 44914 108758 7185 -41245 -13165 6282 14900 71209 83352 116251
28102 116251 162615 147420 220794 231600 206917 183129 68586 -46924 18685 10380 64929
28091 64929 131254 165953 80052 -140471 -205576 -87476 -108044 -154988 -97341 -40366 76600
28080 76600 -45 -80355 -113278 -65405 -71318 7901 -26352 51369 104966 -48902 -222525
28069 -222525 -100490 5569 30800 22451 34998 111914 90831 113022 164421 167716 89522
28058 89522 118059 79860 22413 57601 68616 24518 -70851 -190658 -183543 126 50581
28047 50581 17833 -22484 -103861 -158022 -168397 -139655 39229 47071 -34478 -8689 5626 -108676
28035 -108676 -112278 19602 102089 53213 82833 59339 11850 -2661 -61380 -58627 -65951 -18966
28023 -18966 84015 109236 145715 17313 -80562 -127340 -116143 -150028 -105552 -45766 -17100
28012 -17100 29572 62646 55925 -13290 -76292 -7090 147091 134302 27260 -104176 -126578
28001 -126578 -131337 -113472 -6258 59957 111504 135687 73293 7245 -51506 -81230 -98676
27990 -98676 -103035 -79687 -75375 -208666 -259843 -278235 -263142 -254264 -117292 63616 26620 65333
27978 65333 99896 -37818 -143742 -2846 39592 -71903 -124320 -39418 -59217 41337 94667
27967 94667 56374 45928 -3256 -16273 31034 2132 66791 14358 -66295 3467 -42675 -119337
27955 -119337 -81352 -77815 -18173 -81345 -88722 -100479 -88383 -46935 -8788 -19197 -99545 -183739
27943 -183739 -101413 -21899 -5103 -15993 7076 207819 215766 17340 -26517 52873 -80333
27932 -80333 -200662 -214269 -130449 -2502 110566 130803 52388 80658 117995 79488 71894
27921 71894 35521 12325 -74316 -167508 -158595 -146564 -23803 69792 125461 79522 13695 18940
27909 18940 73896 146114 218544 140638 -16549 -3691 -23235 8455 90342 112908 60977
27898 60977 -15774 29507 31373 133900 267955 205291 62794 58526 34220 -13020 -102568
27887 -102568 -120690 18719 168501 200520 152012 30799 -44413 -130010 -196220 -205869 -210162
27876 -210162 -200712 -153300 -90126 -101905 -99172 -92175 -65972 -28099 -963 101871 121446 30964
27864 30964 104568 85155 45530 -14576 -99725 -182008 -24359 130154 156378 99131 -50208
27853 -50208 -42420 -1005 36575 203381 175208 17290 -1238 46411 39353 14328 28093 -43972
27841 -43972 16294 -71391 -135299 42966 21998 -120980 -160836 -13622 64768 36416 46012
27830 46012 143710 140423 95831 111302 30131 -183734 -245993 -345138 -204953 -90946 26460
27819 26460 78594 36742 57183 36829 -95411 -248129 -182484 -132798 -215482 -260837 -242865
27808 -242865 -343233 -236080 -167736 -138665 -159130 -119184 -7797 42164 84178 190144 345613
27797 345613 276815 210154 169683 46831 78858 60277 -13361 -106097 -142028 -215033 -209809
27786 -209809 -109437 -19332 101424 173423 101629 8742 -25008 -105139 -128329 -157271 -187324
27775 -187324 -88372 -76155 -109459 -115298 -13634 -32953 -36245 -52541 -56605 -6984 -71724 -145562
27763 -145562 -112293 -116033 -280797 -164862 -55292 47577 116927 -3221 -39127 -121932 -148760
27752 -148760 -160277 -112528 -128391 -26812 30032 -28598 -120136 -189410 -189822 -90808 2823 -27125
27740 -27125 -145039 -68212 -1358 65429 -11515 -34712 -5750 -64729 -12294 34037 -95023
27729 -95023 -183795 -87153 67147 41792 -6957 -100783 -28586 -72355 -174776 -109760 -153968
27718 -153968 -74525 42575 49702 -37244 24724 75525 106522 154455 30881 -11261 -40911
27707 -40911 -20585 30030 15518 -11335 -30163 -83100 -147344 -151618 -61392 -118680 -123826 -14907
27695 -14907 -65368 -5759 25102 -31181 -81910 -63653 -164718 -181022 -271997 -213463 -130942
27684 -130942 -119982 -39005 26200 13928 78332 176717 198743 145044 64335 8564 -45740
27673 -45740 -106303 -20873 89507 95190 -9292 41729 -21163 6378 12114 -96749 -55203
27662 -55203 67784 -1317 -101648 -76658 -59343 -66238 -603 25391 -45282 83132 128835
27651 128835 -41006 -80092 -18283 -20090 22884 138802 149207 221814 257355 90945 32839
27640 32839 18370 -43174 -32924 69393 140728 119080 53567 1264 -111982 -85432 -74644
27629 -74644 -95177 -54274 -27399 92715 56058 -97927 -69965 -24877 7800 -26566 8484
27618 8484 12799 64923 68306 43262 2492 46387 105496 73626 40537 38128 140776 151703
27606 151703 6794 -149199 -165005 -95484 20917 47439 21320 85386 132977 -66283 -207055
27595 -207055 -174154 -105898 -64651 -27191 -21282 -35744 50810 137277 136377 124743 157267 99865
27583 99865 53716 -21188 -135867 -42610 51135 20349 -125337 -127694 -90776 -2513 117437
27572 117437 37369 -84286 19939 -31402 -14263 113480 125371 37230 72247 95992 116
27561 116 -100459 -115474 -50076 5120 120357 145170 140932 90881 132013 55309 14419 80160
27549 80160 63709 32330 -126505 -113550 -25546 -136432 -118899 -98638 -33932 76979 8177
27538 8177 7965 132996 64225 25642 -9101 -94475 -31392 -114049 -209241 -202570 -65219 -2260
27526 -2260 62944 -1035 -202975 -339197 -369988 -244449 -118509 -99666 -94779 -118140 -109451
27515 -109451 -171901 -265895 -197193 -206077 -151054 -104371 12511 110272 111527 124427 66042 43857
27503 43857 29445 35377 65656 97935 23349 -4731 64580 201258 128161 -14938 -60615
27492 -60615 65940 116630 -32116 -51962 -94047 -172830 -112725 -116484 -156701 -156795 -103778 -90358
27480 -90358 -64195 37310 -31195 -111386 -77239 -38398 56785 111389 100826 73237 153942
27469 153942 119260 42378 -34981 2096 73988 159251 10993 -27964 -6794 76016 -40981
27458 -40981 -22866 -98609 -217929 -110596 21943 -11333 -53498 46795 33912 105159 73539
27447 73539 46426 47742 10953 24640 -66275 -147099 -55523 10972 -8826 54963 32492 33871
27435 33871 -19239 35266 202771 98075 39546 -4742 30264 77039 104372 1090 -20593
27424 -20593 -23126 -106038 -46338 -61943 -122338 -201887 -182701 -149638 -307185 -406973 -293006
27413 -293006 -103763 19842 89992 -9771 -146691 -191708 -79424 22237 81663 22766
27403 22766 -41999 -19066 -70478 -144404 -131248 -64700 -45992 -52183 37230 109715 -81896 -114541
27391 -114541 -77176 -65920 63685 59418 9063 23488 19866 74329 52650 -72586 32928
27380 32928 -222 58177 64414 807 -58777 13726 -25294 -174395 -224098 -111411 -67279
27369 -67279 -16025 10206 -43838 -161244 -196695 -126929 -166766 -197756 -234870 -233861 -107996
27358 -107996 -111872 -160291 -111826 -87784 -67210 -83540 -236005 -164699 18595 25457 15314
27347 15314 37086 15728 -125278 -45806 -57588 -50258 4104 52404 99995 48250 76824 22527
27335 22527 -51696 53206 13811 -124675 -70961 34308 22569 -54191 -71790 -80632 -85594
27324 -85594 -181296 -199310 -200472 -122742 -140305 -260846 -251261 -314192 -283071 -141918 -134883 -151521
27312 -151521 -130103 -38570 53338 80691 102074 94963 43306 44816 57449 81791 66850 81337
27300 81337 -28421 14314 -42710 14840 19316 -105273 -124475 -134876 -200858 -130253 -34987
27289 -34987 -97473 -157253 -122721 -117303 -21113 152184 209477 176021 164745 127297 -2428
27278 -2428 -44087 79698 167079 85267 -12014 5936 47805 -71438 -50725 15423 -28131
27267 -28131 -82486 -66871 -99036 -125684 -118799 -67291 -47547 -28772 -85596 -161395 -223711 -112322
27255 -112322 -24244 29451 69978 81385 80564 -40215 -60604 -81794 1083 67380 -17930 -26114
27243 -26114 111814 35144 -89036 -166205 -139800 -144383 -206350 -52309 -42999 -106739 37591
27232 37591 30011 -82204 -117855 -133772 -154340 -238745 -230939 -198664 -156122 5620 29940 -8350
27220 -8350 9798 81538 196964 203612 149600 53473 -49390 -59214 -123752 6520 152612
27209 152612 83685 36437 32980 18333 -33247 -108381 -101735 -60718 -23978 -42888 33251 76293
27197 76293 103809 208059 159179 109327 61003 22689 97841 206126 220504 104283 -137001
27186 -137001 -153320 -61745 56834 -35304 -137098 -117914 -53667 14322 -3596 32912 45843
27175 45843 88958 89909 71741 20240 100256 97791 174433 203883 222389 182562 147355 17332
27163 17332 77181 20911 -53781 48751 189557 177703 20525 17553 -10672 32322 11855
27152 11855 -26877 -144297 -129092 -149918 -113963 -157662 -116087 -142921 -168040 -161040 -148314 -158921
27140 -158921 -178679 -137606 -224460 -156413 51291 39541 -17149 54885 125227 58230 -35200
27129 -35200 37878 181808 61879 3327 -79862 -95538 -12676 -18787 -59046 -161746 -64413
27118 -64413 -52942 2027 43354 33450 45324 118172 257477 256863 229559 185359 174202 101437
27106 101437 77249 57890 -59269 -86326 -28651 74760 33918 -8950 12037 14265 74224
27095 74224 -11091 7272 110314 157048 156074 80943 83198 126828 108816 83196 84968 23890
27083 23890 50671 173078 265199 105993 -7215 -17428 12903 50272 -27807 -18177 -77287
27072 -77287 -141796 -99501 -61715 30314 -7866 -12884 75065 79603 39532 114319 -4916 -54565
27060 -54565 8167 47539 58248 -16144 -81378 -66688 -86711 -172021 -164305 -131160 -178034 -146787
27048 -146787 -230794 -154494 -52782 -99282 -91600 -65284 -88471 60420 185721 180582 182187
27037 182187 270131 250972 283427 339812 219529 186081 213950 96716 422 -108083 -76405
27026 -76405 -4674 60505 184456 218744 262419 200078 176660 73122 3637 9 -47372
27015 -47372 -62822 -18361 40975 31897 98811 123670 129059 28563 55317 69384 69971 42492
27003 42492 -53099 -161504 -119616 -64040 -24896 -93214 17608 20044 -168077 -220002 -60809
26992 -60809 78915 46694 -33335 20727 -12338 -55136 -159791 -187669 -141495 -15726 100924
26981 100924 27273 -983 -106134 -133733 -63890 -43486 -104721 -190756 -177874 -159468 -157927
26970 -157927 -72462 -177308 -229640 -225237 -177469 -110801 -69871 -13742 -1507 -49287 -83651
26959 -83651 -187007 -88589 -3605 -70745 -39092 -108085 -160685 -84857 -149067 -95335 -19979
26948 -19979 97606 49427 125413 151319 1325 -70632 51327 127604 127043 167504 267317
26937 267317 273697 192702 225877 145697 132242 72954 12552 36051 -9437 -51021 -119292 -61495
26925 -61495 -61871 37193 108008 89058 55019 114883 170467 182431 169187 131058 122418 113520
26913 113520 91072 57439 35996 -45106 -49005 91395 123024 24396 68177 136607 148675
26902 148675 197207 156634 85675 229263 154408 -10902 -13840 134687 218677 178801 -16688
26891 -16688 -107116 -41491 -32860 -23812 30166 106163 71583 -86693 -88005 -50153 -31348 29752
26879 29752 7837 -100795 25339 91314 -33905 -203628 -52803 34240 52720 -6010 -65197
26868 -65197 -153982 -154624 -138711 -167204 -165113 -121996 -108786 -11170 34549 94233 45774 -39651
26856 -39651 -67555 -12225 32042 71981 185719 110036 -65215 -29831 96600 155794 95860
26845 95860 60400 4004 43676 89705 204556 238012 155882 121144 91866 14404 -74948
26834 -74948 -98041 -160277 -77038 37252 17553 27631 -70985 -83064 -74748 -15700 89805
26823 89805 -18585 21449 140035 238710 191233 119638 56195 -48314 -110166 -40667 -20097
26812 -20097 18636 44257 4298 39516 52337 83888 33628 26681 35447 124350 136232 143219
26800 143219 123858 49176 -15295 4483 51002 89953 165734 1338 -65924 -9616 104300
26789 104300 124020 63955 47768 9524 28137 16118 57746 185968 266303 182861 132212
26778 132212 48381 74436 48807 -15517 -62142 -12258 -99959 -72359 -9397 105787 168038
26767 168038 131077 -152460 -309907 -288480 -161217 -19893 16223 -30110 -213362 -199894
26757 -199894 935 -131738 -99188 -6038 -44520 -72077 -9471 29541 104913 101775 186768
26746 186768 89817 -18191 93934 50658 6308 -95951 -76301 -144838 -79195 -25402 -91275
26735 -91275 -104766 -88203 34569 156693 33899 -10376 -43702 -13428 43763 -38404 -206136
26724 -206136 -134085 32948 77621 63486 83354 -7254 -124469 -121831 -86236 -116602 -130281
26713 -130281 -77906 -76446 -184727 -273715 -210029 -69663 -42877 -156472 -166359 -45143 145309
26702 145309 324597 271128 107772 126830 96253 108560 163176 55023 82714 84523 162291
26691 162291 246586 233065 61902 96694 41940 -2661 15776 48802 12714 25858 81748
26680 81748 128213 180790 196945 168095 112046 58010 35344 -78961 7486 152658 257730
26669 257730 218609 252957 241056 188168 98507 134206 162420 96382 -37777 12348 117813
26658 117813 46312 -38753 -201803 -128731 4147 78133 144458 43055 98604 67653 16754
26647 16754 34475 26350 -8690 -103068 -102045 -54631 13258 112846 73849 -23462 -48333 6995
26635 6995 43922 -58594 -192875 -240215 -238150 -258735 -256616 -123692 -89849 -161019 -215474 -131597
26623 -131597 -64496 -42225 -37071 -11101 3492 -60203 -38935 -13176 -35072 6870 102291 115226
26611 115226 71278 96989 58873 -126293 -128755 -81894 -126167 -124728 -191252 -359101 -207803
26600 -207803 -55144 -33078 -52132 -152280 -122241 -17814 16715 -27867 19172 28311 -18551
26589 -18551 -9949 -93664 -135556 -141472 -198006 -120052 41670 62368 171729 184888 128767 162390
26577 162390 258675 307504 213602 123156 123237 192639 121872 8488 -93149 -232080 -255494
26566 -255494 -147798 -15503 44094 112849 155389 237478 221011 38865 -1192 33207 -66871
26555 -66871 -1687 1032 -21117 511 56832 17636 -68993 7613 112423 101580 122804 216611
26543 216611 162495 99211 46416 -3476 64112 -10538 -115510 -233550 -198828 -55934 20217
26532 20217 33414 20536 40155 116280 200531 65447 -45186 114411 115043 55566 -7865
26521 -7865 6783 -40300 -12782 55076 -34756 -86533 -121849 -107709 -33215 77338 237067
26510 237067 188244 -9613 -23067 87201 56859 -23265 22337 50584 24003 -10 -70606
26499 -70606 -88686 -18797 5732 -24485 -5820 -27877 -88633 -178538 -155781 -56795 -12654 -95737
26487 -95737 -236179 -180261 -6666 122996 152459 13803 -22880 30644 -5605 -100543 -79475
26476 -79475 -15011 -54371 -93596 12143 71457 59457 -68560 -68483 -47717 -26364 -57996 -46790
26464 -46790 49200 42069 12691 13402 -6897 -70839 -158707 -162215 -178320 -106921 -21756 109534
26452 109534 203788 195925 182422 123001 181646 193298 259446 213277 79952 -29149 95922
26441 95922 85952 108146 112087 143636 97476 -112515 -45591 59773 134333 254269 256049 74497
26429 74497 -43371 24330 61628 86338 97624 13666 24743 7674 -42623 -84810 -188801
26418 -188801 -30426 77728 77820 15060 -78747 -28960 110882 84042 124826 150856 20358
26407 20358 -111672 -62569 26125 195490 223156 114596 51250 -13009 -19177 75146 65350
26396 65350 50671 -62321 -6756 -78504 -12777 -98230 -47345 -43879 -143497 -224721 -251188 -137054
26384 -137054 -49319 143960 181461 12069 -96630 -123645 -58581 -30235 78601 103438 145763
26373 145763 243821 265103 209353 147476 131854 73076 -68605 -130884 -24608 -103759 -80208
26362 -80208 27135 113749 108808 64305 77247 -13763 38533 17323 18654 -23204 -70192 -72668
26350 -72668 -100751 -175966 -157205 -91683 -57622 -141029 -122212 -141442 7829 54087 77571
26339 77571 -12370 30318 16359 -24100 39697 36961 74239 93689 -10225 -86761 -128984 -156664
26327 -156664 -131804 -160732 -246515 -243545 -76029 81914 190238 76918 30779 77529 105836
26316 105836 149677 125170 83880 75649 128547 109205 146314 90422 53970 56677 -18429 16517
26304 16517 48350 58030 11996 -51147 31056 40345 -46631 -106654 -101182 66853 288011 354366
26292 354366 253352 76006 -2798 -2320 -55080 -123113 -56385 55959 131429 121658 103975
26281 103975 128923 124220 33810 -47055 -40580 -39999 -46325 1418 -24980 46125 64376 39288
26269 39288 -22923 6285 -9643 -29329 -75721 -13323 11475 -10183 99022 130986 18235
26258 18235 -34086 13125 72403 -5360 -69395 -140617 16167 -18136 -112911 -122311 -172131 -118894
26246 -118894 -121765 -45197 -27760 -83213 8723 -43150 -122156 -84474 16037 22801 135937
26235 135937 59527 83102 40708 51736 114706 141020 82936 -1282 -26585 -46729 -1909
26224 -1909 -112463 -138929 -148901 -169757 -147367 -86764 -52674 -96850 30216 75772 -12292 -77778
26212 -77778 -83007 -37478 -110161 66838 93285 -8980 -1707 -15631 -152749 -238093 -203972
26201 -203972 -23160 73800 15843 128224 122318 3128 86 -58353 11817 107368 32969
26190 32969 -8276 61029 76017 97656 106722 40327 -46720 -39621 -30145 -68336 -63626 20129
26178 20129 -36366 -156736 -161616 -216796 -292868 -246105 -204654 -42583 126878 138606 65826
26167 65826 -30318 -93624 -131062 -111547 -7902 -20824 -594 -13044 14500 -4725 -12870 35257
26155 35257 68165 -11852 -53174 -107094 -90029 -23497 -29137 37181 89688 24396 -38260 -110220
26143 -110220 -79028 -90735 -78209 -44609 36490 94675 55542 14299 -28355 70613 93982
26132 93982 31337 -13603 19125 25089 -19952 -57940 137052 141949 60735 -21964 -101139 -152801
26120 -152801 -173469 -47965 -46491 -64189 -158087 -139330 -199572 -267877 -140391 -65690 -51969
26109 -51969 -35718 -29822 27442 74520 39370 -7356 50869 113594 30338 34617 -12498 -76534
26097 -76534 -144663 -124707 -45480 -3699 38490 -72053 -16831 42112 -386 39524 99225
26086 99225 55895 34223 21533 -44064 14225 -4476 -24202 11252 -26569 -647 -124399
26075 -124399 -179175 -94262 -74457 -68019 29146 12767 -61287 -32303 14953 -99214 -57904
26064 -57904 102505 78926 29203 38093 2172 -57315 -76344 -115612 -13728 66469 29389
26053 29389 54905 122029 116741 193793 117351 89943 116200 156057 152673 136357 24015 -10504
26041 -10504 34355 -38153 -92127 -226495 -242685 -218552 -164159 -200182 -231304 -125270 -23272
26030 -23272 96508 119562 37104 -94540 -190967 -145819 -136134 -210990 -212902 -4590 187106
26019 187106 59769 251 -63760 -59872 -103526 -35945 -8733 -82016 -135034 -84356 65633
26008 65633 31617 2016 95988 158678 118800 104962 92195 125714 106888 49576 -12114 -25265
25996 -25265 -31130 79222 137831 13322 -12167 197792 309063 271626 172348 195212 50241
25985 50241 -108358 -65552 -51352 -66534 -75271 -78375 -73140 -148863 -85100 67503 49966 -9237
25973 -9237 -43271 58183 169557 3094 -127305 -119470 -56387 -74345 -63363 -106871 -61284
25962 -61284 -3194 -99673 -102559 -48039 62882 33945 16300 -96099 -27885 55847 27447
25951 27447 -10552 -24686 55862 134375 215067 166058 14973 -62797 -60683 -34921 33609 28451
25939 28451 -33382 -39039 -60893 -68043 56799 285508 237458 101320 51489 63441 28278
25928 28278 -11250 -62453 -143873 -91419 20756 -11097 48807 77633 -54492 -96531 -108673
25917 -108673 -21216 -73214 -39843 -42980 -36715 -73860 28867 164983 154235 126097 191304
25906 191304 168044 108729 -60050 -43859 26824 21527 -19689 -34125 10424 48935 78518
25895 78518 -1733 -71608 -138467 -102215 -182917 -255538 -267359 -201074 -146364 -165948 -203830 -156630
25883 -156630 -13467 188510 337881 334800 327230 179957 130823 188955 171595 66804 2302
25872 2302 -29150 -55189 17642 32916 105511 22720 4038 18761 -36966 -80274 -65665 45054
25860 45054 60147 -27175 -64703 4334 31979 118738 122026 137479 76188 17506 -50370 -39547
25848 -39547 24255 58895 128687 149550 128318 130489 152718 -8957 -33864 60468 19962 -36778
25836 -36778 -64586 -100563 -118182 -87768 67730 46690 35980 39188 15442 20291 21616 69522
25824 69522 64722 77439 111544 139036 66490 125381 165256 195104 226505 138542 65927 18850
25812 18850 -83480 -86272 -116083 -12654 74969 143201 16409 -42937 -62829 5298 5832 -50365
25800 -50365 -515 -19930 -44985 -25804 94691 103145 136922 8847 -34700 -112502 -212738
25789 -212738 -132880 -111716 -235343 -77045 113625 89170 -7250 -68326 -68194 -102369 -149138
25778 -149138 -51129 -58335 -57247 -51940 -1901 100640 85015 28881 59735 115194 30668 34248
25766 34248 1681 -141606 -95165 -77998 -25229 16731 -35339 -144401 -73021 -17049 67191
25755 67191 105678 87078 131419 132547 12283 34556 116228 -4995 -113331 -145317 -126255
25744 -126255 -93843 -17574 -24540 -25300 -54361 -57308 -50757 -74312 -24110 -13803 -26201 -40076
25732 -40076 -133329 -161855 -170746 -239666 -177793 3711 23205 64996 146830 146478 136622 96361
25720 96361 112844 58051 74534 142105 127139 34927 -169273 -234170 -303299 -234543 -54959
25709 -54959 -39437 -104506 -166666 -85375 36379 62975 125305 50137 -116362 -39073 -83508
25698 -83508 -70193 3855 24190 44196 200914 221306 78078 -78464 -30462 -7851 -94574
25687 -94574 -118615 -140007 -54120 -89849 -150449 -190324 -114372 133885 301976 80280 3781
25676 3781 30355 19374 -84787 -64795 -47020 -57477 -73187 -10409 45733 -6359 -95465 -116447
25664 -116447 -137322 -119080 8708 -58177 -95451 -48967 -45581 -46796 12871 -42969 -99712 -132541
25652 -132541 -102341 -12534 123270 287117 189909 128529 222531 178712 580 -184830 -98684
25641 -98684 -61646 -47417 4158 -47134 6719 -11832 -21831 30688 29604 141360 -50556 -189001
25629 -189001 -223859 47809 146047 102482 20562 3195 106624 149254 27192 -183679 -113666
25618 -113666 -116835 -76443 -67955 -5498 -50130 -137117 -120395 -150670 -71299 1272 4040 -103749
25606 -103749 -121741 36679 77886 100034 122738 136522 115263 103342 104181 -19130 -68805
25595 -68805 -58977 -106609 -172134 -213996 -141487 -111174 -98937 -96868 2886 70041 -12059 40719
25583 40719 19421 -143009 -207524 -169590 -77810 -43044 4831 131462 236572 97452 48453
25572 48453 -12025 -73663 -81585 -51278 9907 51912 53694 45661 18613 48185 107624 89746
25560 89746 85273 106506 97425 146955 81632 21770 -85166 -108443 9593 49773 22651 88612
25548 88612 105936 47804 48352 117927 114810 -53629 -125748 -171173 -123493 -103585 27374 18330
25536 18330 50993 29423 69644 82375 61300 -7489 -49848 7397 16797 9414 36784 34574
25524 34574 21955 77490 32198 100437 140448 143121 133211 122780 144309 60044 71276 116748
25512 116748 140108 146223 259993 240779 18164 -181156 -118550 -6307 -16550 -61855 -125199
25501 -125199 -60894 -40330 -20493 61115 182357 212287 256327 217867 245647 230754 124254
25490 124254 -29462 -134139 -92232 -86707 -34046 -65291 -27713 87416 142045 103978 200848
25479 200848 171503 35708 -77181 5075 123602 -45267 -74755 141288 138989 -40957
25469 -40957 -58332 -112881 -91663 112635 78621 -49295 -69421 -8759 -95359 -31794 -36079
25458 -36079 -179013 -204065 -64616 -44850 -35545 4593 13024 53750 -442 10586 -22299 -157503
25446 -157503 -71947 -111288 -68508 13571 56684 33523 -44379 29369 34605 6063 -111943
25435 -111943 -131621 -132985 -162817 -150807 -76296 -97735 80128 170304 116119 26840 -136075
25424 -136075 -129334 48009 37922 56657 -3903 -33879 -47935 -88276 -198295 -249286 -168138
25413 -168138 -85393 -32658 -7111 -55662 -38461 -79778 -175685 -237408 -210428 -182608 -131900
25402 -131900 -39510 65811 153466 107491 -10424 -5568 66132 121270 32002 -45783 -96803
25391 -96803 -93194 -67374 -58060 -39613 -32868 -4138 -82083 -82820 -94415 15053 71759 -25423
25379 -25423 -22393 60903 109344 14586 -34157 -50717 -785 -12254 -60571 -121436 -86050 -54429
25367 -54429 -77377 -46032 99484 87485 96926 126793 193382 239679 226539 197285 159818 115623
25355 115623 50202 -31808 607 -23280 -104941 -127990 -111201 -127019 -162932 -249151 -214579
25344 -214579 -13571 65234 37733 -9390 -42383 -30402 -73044 -61905 -113187 -57384 -16669
25333 -16669 -10982 -49465 -150512 -99525 -54411 -62106 43151 113328 44814 -45596 -34885 -71928
25321 -71928 -48931 -114700 -35468 6907 104598 70899 -31390 26751 199601 110966 78749
25310 78749 112374 70318 109689 201065 155113 85426 57752 4504 -40042 117701 149533
25299 149533 -14329 -119122 -39428 -26974 13145 55405 34954 45026 46126 43073 63532
25288 63532 61619 62888 85114 189033 176997 15004 -152102 -56379 54787 33227 80102
25277 80102 59810 16939 -11481 -27944 -1156 -56333 -4884 79276 93648 19178 -24549 -50890
25265 -50890 -139981 -146513 -120854 -76163 -55089 -159458 -144274 -143461 -144981 -76569 13332 -35418
25253 -35418 -95492 -214283 -234820 -81641 -39035 92798 105245 9761 -29098 63918 55291
25242 55291 17674 70251 175487 162969 198771 217443 208147 70098 -8381 119146 69558
25231 69558 -68846 -175592 -201527 -206721 -252324 -113401 -3539 86150 155573 167708 195546
25220 195546 254966 158673 192097 168343 145955 270130 264707 37810 -94394 -101005 -88920
25209 -88920 -160741 -163578 -73702 -123769 -218955 -155845 -168389 -79082 60478 33543 -133507
25198 -133507 -178879 -49995 36824 24093 -46127 -15115 110556 258444 217026 108424 103196
25187 103196 76938 44006 90193 -27330 -81335 -88085 -127537 -115774 -117696 -141537 -126327 -230542
25175 -230542 -283004 -192820 -71602 23291 52651 1914 -84497 45621 79438 33919 88598
25164 88598 190883 242929 207467 109771 -75006 -159223 -34953 37119 26178 -7474 104939
25153 104939 162008 99639 61076 64169 143574 199202 140532 139596 79772 123865 115238 16540
25141 16540 -29139 -56878 27006 134101 130821 119951 34701 113652 62773 -27951 25870 -40564
25129 -40564 -83938 -90876 -137932 -57466 125684 123242 67734 34229 -31661 -74481 -115317 11565
25117 11565 154668 134889 142542 209195 115497 -76138 -152550 -186295 -165805 -59455 -13322
25106 -13322 41804 114191 59049 -43661 -25668 117176 61470 -147967 -165251 -69023 -41497
25095 -41497 43625 80999 84514 115770 199842 165456 32562 7048 68147 50971 -22073 -17977
25083 -17977 2454 71567 78536 76330 99666 93951 106062 36772 -34995 -51836 -20418 -71213
25071 -71213 -56437 2944 -48656 -159760 -171398 -27326 -93607 -65321 -49879 -106466 -166666
25060 -166666 -129528 -205923 -243274 -262949 -150987 -37384 -15623 -4168 -73145 -140159 -182029
25049 -182029 -222994 -106710 -98869 -36973 -110166 -231795 -149090 -67348 29447 52787 -19424
25038 -19424 -58952 -101674 -90925 13689 38762 -10885 31258 8335 -87807 -127515 -76538
25027 -76538 -76890 -131627 -104098 -15929 -76656 -46413 -70964 22398 78096 42667 50764 155970
25015 155970 198836 82779 16917 -77297 -19933 128536 40073 -69376 -68878 -28086 76782
25004 76782 186591 203097 105749 7493 -27232 58547 29353 35189 -1188 -2337 62090 12321
24992 12321 -170263 -125969 -64939 -10522 -8539 -30545 -11940 125145 134855 88271 125280 179595
24980 179595 190623 122819 43584 47754 40690 70367 47323 73365 190292 311703 274505
24969 274505 149808 392 32420 83011 168041 154911 42354 -54192 -79293 23487 127761
24958 127761 81083 105597 159996 168652 242445 214206 43069 -43291 30668 9418 -30309
24947 -30309 -62057 59523 35406 112486 149557 170918 121206 47606 52261 59296 53401 59970
24935 59970 -6750 14596 65337 136019 153561 100245 -31138 -101186 -10116 89169 17398
24924 17398 -58684 -103042 36105 192315 84376 -6610 -85596 35511 61710 15621 44509
24913 44509 61337 41625 95151 39203 43052 -1077 -2020 38912 47022 50762 -15131 -125947
24901 -125947 -218768 -205672 -134223 -11 126559 122255 -48508 -70397 -43212 -126538 -103352
24890 -103352 -74237 -70722 -81739 -62515 2141 21336 -103401 -155171 -49001 -5940 -396
24879 -396 -89435 57565 196763 180591 174913 152272 78874 78802 47477 -40615 -22933 -80117
24867 -80117 -186966 -173322 -66186 -317 75343 14647 -76530 -44850 4164 -82962 6078
24856 6078 113474 23679 -16378 112410 82478 -13505 13813 -64105 -142682 -152387 -133873 -103826
24844 -103826 -168496 -112101 -119685 -87564 8774 -14938 -93839 -125952 -54228 -39661 40560 -42618
24832 -42618 -198565 -232625 -188632 -48930 13225 -107674 -69754 -33944 -17892 42131 172936
24821 172936 182505 129861 -12979 10676 67512 -20219 -48845 53492 60993 94825 99601 63462
24809 63462 111426 140 -24281 112192 105176 -36843 -83013 -82011 -27931 6820 110961
24798 110961 152082 49990 -41722 -50952 -87900 -152464 -168428 -174593 7361 108547 32951
24787 32951 73606 60659 16191 -100837 -181892 -236716 -183304 -106409 -110656 -255810 -326191
24776 -326191 -230401 -94370 -151713 -253060 -285685 -139491 -16498 -575 71465 72966 105291
24765 105291 207840 213157 149230 119071 146633 260520 178200 -21526 -100776 -117553 -123791
24754 -123791 -192436 -102795 -38356 5327 10069 -46905 11098 -61638 -85156 19923 25572 34003
24742 34003 72887 145680 195408 124422 45854 -4334 -12128 -62155 -96308 -77061 -79234 -89453
24730 -89453 -92049 -48091 117459 137521 179291 77754 30026 60083 859 -180962 -261982
24719 -261982 -161376 -204380 -327467 -301352 -172368 -117791 -109100 -151751 -32554 91796 -37371
24708 -37371 -136670 -136044 -125566 1900 48608 -12280 -2607 50418 90021 98964 158331 256674
24696 256674 202376 -14647 -2838 7498 -101663 -148370 -191849 -179349 -163404 -85200 -70310
24685 -70310 -84531 -67409 -177895 -250842 -258758 -235702 -109256 -175053 -133007 4684 -25094
24674 -25094 -25649 -105256 -94273 -53388 -81386 -14739 15350 81739 118240 63848 122536 67215
24662 67215 -12644 -82763 -60940 38113 100287 126490 110447 127545 151351 181638 105877 -57548
24650 -57548 -64615 14015 35285 106739 116774 131741 153368 75000 -103442 -66415 -114617 -106598
24638 -106598 -11522 65470 139607 183258 87605 -45024 -143757 -197273 -61452 -23660 -51190
24627 -51190 -7906 4195 -32563 -71928 3196 6925 150692 242920 118350 -65697 -110998
24616 -110998 -22216 -67637 -57739 -146346 -83810 112761 209501 287310 234370 41394 -60161
24605 -60161 -106988 -139673 -189374 -270615 -325087 -226057 -127611 -82106 -50331 -22471 32208 67979
24593 67979 92246 72586 -60769 -131471 -26144 56295 56407 44052 56264 -2048 64705 72909
24581 72909 25590 -87355 -79462 -105373 -114691 -61304 -431 -86340 -59660 -19721 -37677 -54148
24569 -54148 19703 124895 165490 32082 -66036 -61071 -42572 -106515 -174028 -173815 -35084 52825
24557 52825 91182 -67343 -210122 -125220 -34210 -125231 -164471 -154194 -189384 -67248 68363
24546 68363 150855 55918 -116382 -128441 -107806 -53654 -44061 -116792 -167850 -129977 -72517 -111289
24534 -111289 -145098 -32260 64250 13337 24540 63347 -32956 -104824 -67819 -96141 -97785
24523 -97785 -44064 80610 169038 139092 202388 160894 169340 267150 168048 174558 204796 168503
24511 168503 82958 144011 277029 282466 140773 239661 224699 52781 -76443 -14183 66449
24500 66449 115317 206201 174034 266697 222615 216717 170775 124525 129837 -37121 30589 41931
24488 41931 -17484 -180200 -188080 -110059 -92700 -89665 -107737 -40731 106701 172305 193626 295947
24476 295947 272390 171797 38227 -84409 -105311 -99492 9970 -68063 75616 92319 15132
24465 15132 16960 -20672 -7347 126025 157780 -42146 -125349 -70354 100599 212393 186740
24454 186740 179770 92982 -19174 44958 107058 139411 86621 84015 41160 88107 55847 -131670
24442 -131670 -125251 -133776 -148257 -99678 -163049 -120921 -67892 -92910 -156350 -157486 -85813 63620
24430 63620 116243 23590 -34156 -47195 -121941 -158924 -72169 114748 52014 -95326 -115110
24419 -115110 -81767 -51306 65674 64773 -140927 -224643 -193145 -224578 -141120 -166425 -93571
24408 -93571 -22242 3820 69533 3266 25913 48537 60661 16605 -5633 -51198 37638 96708
24396 96708 -33219 -111858 -88709 -46209 -107711 -288596 -326622 -212700 -200659 -112927 42320
24385 42320 34595 16224 -72246 -183373 -173072 -211246 -170096 -57530 -45998 26430 12774
24374 12774 -43843 -36773 19139 92615 90851 161566 31501 15146 31317 -87434 -121582 -62137
24362 -62137 80052 9265 -12781 77688 146281 177867 246080 271153 214831 157382 166031 283600
24350 283600 176306 55447 65471 144750 249872 212650 227269 178628 -6756 -111721
24340 -111721 -151324 -170075 -85299 -4514 30139 98012 10871 92278 61520 782 -96942
24329 -96942 -148589 -146495 -172595 -115170 -101070 -67481 -94045 -38897 2605 22691 -33293 -85229
24317 -85229 -67894 -57285 -40826 -121566 -124928 -97977 -75779 391 4472 15356 -44400 -40445
24305 -40445 -58255 -28664 87721 72086 74233 193690 155298 33573 17254 136201 123923
24294 123923 -45102 -238333 -205050 -110372 -128838 -153041 -84542 -67168 -93926 -36133 8249
24283 8249 76854 -1129 -129035 -106716 54373 229517 140423 59354 12352 -68166 -23676
24272 -23676 50406 88387 74369 35244 93245 207020 143518 247539 166440 -35752 -133577
24261 -133577 -161270 -168058 -113919 23683 124129 62411 -122654 -107394 -1489 14209 -72756
24250 -72756 -98199 -64692 -21794 -5232 -75400 -167468 -120504 119294 213032 94361 138477
24239 138477 64443 136931 149610 114071 51118 -28680 -137733 -119628 14353 119213 170251
24228 170251 122282 39727 -126690 -48744 -109774 -151430 -356476 -392553 -170939 -136393 -145453
24217 -145453 -167783 -60754 54071 61105 30467 -34972 -167131 -243513 -233305 -110075 -123332
24206 -123332 -133115 -79937 -79037 -54465 -10204 -47770 -3558 31936 -83874 -159677 -166887 -20005
24194 -20005 30126 -14048 -35847 -41806 -157384 -103046 3799 -7028 -31595 -84301 -156595
24183 -156595 -260676 -262924 -272365 -197898 -108243 -230128 -282863 -223355 -163101 -25023 101210
24172 101210 87773 45105 120688 117239 65417 -7289 88135 86759 -31107 -19440 62978 -46744
24160 -46744 5694 45208 5763 -28485 98879 81884 50993 -4858 12251 -78167 -54299
24149 -54299 -98974 -76016 -142347 -209005 -141694 -100169 -130276 49776 335 -116113 -82254
24138 -82254 15982 105415 74306 79055 109112 137217 138488 78552 63208 151752 227591 261777
24126 261777 127289 7167 76758 168110 156600 168052 69091 39171 35388 -48631 -62721
24115 -62721 116756 109812 143715 117895 27404 -110551 -29739 20349 7133 69529 122693
24104 122693 162589 86867 12837 -76411 -139235 -149524 -86181 -7277 -10362 -29392 -69723 -59464
24092 -59464 -73305 -92180 -93642 8686 -23090 -123299 -152365 -90227 -83211 -163003 -165189 -277465
24080 -277465 -335519 -264217 -160254 -108692 -92728 29737 87143 165384 61427 -104008 -43670
24069 -43670 -38456 12664 136376 999 -5027 -140286 -146010 -57275 -71595 -156519 -193060 -144793
24057 -144793 -85069 38352 111810 152184 90083 130139 134670 37011 22062 82167 135910
24046 135910 155909 106312 3859 54047 -70073 -61213 -138894 -146673 -126961 -96569 -31994
24035 -31994 98629 146068 194894 195739 309921 336709 182930 96971 53941 62250 138783 98357
24023 98357 44486 98067 17531 62510 166304 136397 153976 106409 -64293 -24031 117630
24012 117630 72347 76689 50654 -80776 -63482 -31139 62583 62053 76870 104736 58652 88910
24000 88910 85347 11252 -11348 -48240 -13823 10205 -11396 -5851 -61199 9492 62272 138049
23988 138049 193533 61651 55515 168489 180142 -12972 -3788 76042 37303 -18974 55214
23977 55214 62524 -42761 -43234 65210 87324 89719 105871 -7447 -1646 -58104 -112028 -22006
23965 -22006 14120 -135447 -259782 -212110 -190997 -114397 -98433 -143061 -8187 -30149 -129208
23954 -129208 -93330 -187 76080 106984 24627 62465 -63289 -180432 -115697 -10251 -65541
23943 -65541 -107048 -92650 -99419 -37951 59512 -12137 12343 142013 64525 -69467 -36843
23932 -36843 32749 65413 57994 -16140 -24037 16719 44104 34699 49553 10831 24289 -2266
23920 -2266 -11436 40057 102281 133525 90142 52652 69385 73901 40812 20782 -107238 -117872
23908 -117872 -124590 -194584 -129068 -96937 -109736 -6610 -152716 -217011 -95275 32224 -5490
23897 -5490 37805 84990 100301 69428 123550 284036 288770 179474 179139 193064 179196 97014
23885 97014 35575 113482 164047 202726 138584 119453 145197 67028 -31331 -20637 -137721
23874 -137721 -190738 -137930 -42797 -34832 -110390 -45928 -76926 -87032 -91825 -31723 129126 31145
23862 31145 11950 152263 124680 114389 36979 -58206 -747 -28533 -9950 34733 61547
23851 61547 43923 40221 -83383 -182680 -169439 -159700 -76123 -17008 -19341 -57758 -151037 -29452
23839 -29452 62258 94429 84882 112686 177636 184916 19193 -100070 -172574 -219312 -154299 87273
23827 87273 248634 232114 31737 94681 61958 -38918 -34622 -42931 24432 -55033 -77133
23816 -77133 -89040 -30984 44649 -1718 -23417 -72296 -114447 -200884 -243100 -270063 -126967
23805 -126967 -19354 -75789 -144979 -89809 -61001 -78160 -46217 -79714 -9410 100614 143687
23794 143687 79106 -10324 -86585 -58559 39456 187116 63730 95573 80722 156929 37201
23783 37201 -105694 -42253 -72843 -91296 -28436 -13677 -38747 29431 -68674 -128900 -120417 -90920
23771 -90920 50781 -112 -67846 -120853 -117483 -71738 -15122 47746 67155 -33011 -70809
23760 -70809 -38644 29804 28768 -25433 -46331 30805 110826 154349 252601 283159 220219 208977
23748 208977 194716 78587 68986 81174 96130 134699 60395 78261 164288 124448 32013
23737 32013 -76621 -123950 -33561 -49340 -61123 -79494 -64117 12802 35625 91115 22169
23726 22169 135091 131627 121994 76486 64305 8043 -19313 -32237 -89247 -106600 -7267 -25537
23714 -25537 -206671 -229594 -197587 -134284 -48608 19057 82332 87171 142262 160599 113087 57784
23702 57784 -80207 -124175 -2334 100036 46592 94218 174746 87730 84232 -15501 -59342
23691 -59342 -12830 -69778 -68221 -76430 -98226 -95034 40555 76408 9788 -74205 -18869 -23149
23679 -23149 16118 -15302 -23088 -84543 -161527 -71264 15271 -15653 -196698 -265612 -283733 -216654
23667 -216654 -193232 -50263 -24540 -13724 -89608 -233806 -212290 -154018 -90896 -34744 -135545
23656 -135545 -94060 -90999 -186678 -184648 -146120 -159894 -46647 -47602 -41674 -18537 -127145 -81039
23644 -81039 57339 43035 74595 4909 -139509 -41337 57937 -26763 40966 45112 -39937
23633 -39937 -84928 -72590 -41112 -100925 -164388 -199887 -198513 -212730 -118627 -107646 -96330 -36447
23621 -36447 95387 90298 126007 132758 52142 -8379 -67421 -5760 175228 85642 -15165
23610 -15165 -41612 -83176 -9459 -85739 -71108 35815 -24801 -91841 -72265 -72770 11528 -45190
23598 -45190 -79331 -21798 -20718 -25261 53803 -22495 -106011 -144374 -84139 -1970 -27341 78173
23586 78173 209486 117553 16549 -72063 -173852 -106048 109448 184338 11096 -110497
23576 -110497 -3977 -15137 94581 219454 176283 31839 42250 12150 -22651 16394 1686
23565 1686 9820 123616 204308 172908 132475 49505 -32038 -104200 -143598 -102057 -105187 -37143
23553 -37143 91389 63930 28746 -15083 -35294 -8952 54495 130670 76503 70885 32271 -8519
23541 -8519 30293 -56690 -70821 -98430 -206044 -217477 -142890 -167706 -182246 -193364 -55000
23530 -55000 1469 12350 40958 102702 82074 102883 74678 54106 18017 -59807 -63639 -46982
23518 -46982 -104276 -69847 -126584 -75305 58334 19978 -31208 59381 70903 13048 -22300
23507 -22300 -53651 -108548 -141871 -132377 -217285 -79723 101426 102065 -11944 -39870 -2714 35341
23495 35341 -9839 -85312 -166241 -101487 -96335 -165685 -185928 -125847 -54368 -15456 -114193 -156656
23483 -156656 -195547 -164339 -76918 34977 -77253 -115053 -14226 49976 9281 -20976 -45820
23472 -45820 16619 -6807 -160249 -91064 -86048 -6009 90050 11097 30172 87915 47876 -17924
23460 -17924 8656 -8371 58019 48756 -4520 -8339 -13345 27726 18783 -28415 -88465 -25658
23448 -25658 -80902 -68793 -44973 34219 76392 61498 -95073 -50224 6412 2597 20815 112588
23436 112588 53435 -51058 -128861 -114797 -101702 -161394 -164997 1368 65857 45107 -41727
23425 -41727 -42304 3533 46769 60705 15787 31699 135711 125398 139608 132509 -5290 21185
23413 21185 95887 152450 158223 55523 97413 31860 73007 9088 -65640 20305 40035 -87792
23401 -87792 -66326 33327 111692 113330 259727 210231 192636 207756 88930 34935 35647 6224
23389 6224 -71322 -94829 -169835 -44487 12473 74070 -8802 -52463 -11009 42713 -57246 -91374
23377 -91374 -52363 -81875 6296 121885 230913 93525 2870 -1771 56526 89820 37569
23366 37569 44873 2851 -115439 -67143 -5332 12248 84617 106523 80010 18526 62019 -39520
23354 -39520 3661 -53244 -174009 -41648 51653 56952 12475 -31362 1575 -39703 -143496
23343 -143496 -200824 -180152 -65840 4193 -60324 94742 148526 175251 162104 106869 128814
23332 128814 104402 33349 56953 44642 167852 107980 -23228 -43739 -111130 -194569 -28359
23321 -28359 45125 -691 -2471 -40646 -103947 -248671 -219343 -78484 20646 -10796 -19235 5842
23309 5842 47216 69948 -23350 -41449 -133191 -279064 -285187 -193686 -100136 -52951 -51530 -153741
23297 -153741 -156976 -105028 -30730 57664 7112 -63723 32447 23 -56116 -59497 -143063 -128872
23285 -128872 -50658 15954 29548 -41269 -74274 -185577 -116965 -55211 -113940 -47618 -80674
23274 -80674 -200940 -217547 -275463 -258125 -297943 -327468 -153135 -105794 -100487 -21678 -15508 -12675
23262 -12675 -8296 -94992 -2177 -9342 -87980 -117330 -171350 -71961 -19956 54668 67470 65386
23250 65386 48099 56404 111461 138480 54571 4919 -30770 -91332 -136313 -186966 -135697 -45908
23238 -45908 46776 67257 12149 -42312 -82573 -68027 -50485 -105588 -94561 11297 19110 22606
23226 22606 -120001 -89118 4357 7468 -88952 -164605 -126527 65087 225405 158886 163028
23215 163028 143469 191463 152042 57609 103076 57612 20439 -11805 32057 10946 68744
23204 68744 76969 19404 -12015 -80667 -110151 -37075 54153 71131 66878 110103 84360 -29781
23192 -29781 -162002 -164120 -137554 -248086 -274938 -178769 -159518 -127752 -200033 -49200 185072
23181 185072 254358 175045 16588 94330 110602 14950 -68992 18939 26724 16075 -49812
23170 -49812 17375 82365 160725 288376 254026 181503 126185 20414 -41838 13010 12670 18332
23158 18332 13896 30394 114493 130094 129944 104151 121230 228503 119414 27104 -10222 38538
23146 38538 51483 104973 85833 102558 -9578 16172 38858 5954 -91095 -217066 -134392
23135 -134392 -108780 -92542 -17698 32677 -93820 -132258 -74645 -2989 -16632 -35216 -31783
23124 -31783 -32238 -43794 -36003 -44926 -75982 -114443 -121794 -181728 -148153 -86678 95223 198740
23112 198740 119712 40488 -14583 -6766 -9300 16488 -23212 43428 31666 19447 33773 80530
23100 80530 -104454 -114270 -7857 -72927 -54631 23823 -22522 -154008 -181902 -246061 -86135
23089 -86135 -32937 -57638 -138545 -126857 -34233 -25961 -112803 -167992 -96393 781 -79297 -64474
23077 -64474 -35745 5173 23968 14273 47019 137344 105242 128090 82935 45606 4202 -37433
23065 -37433 -21766 64554 -15762 36125 58117 21267 31553 -60533 -52907 -60303 -45410 25356
23053 25356 105348 88411 211375 85641 -86349 -208787 -217106 -263220 -209474 -206022 -222539
23042 -222539 -218698 -116650 -73610 9745 52093 125369 169701 108290 95096 50506 46997 101085
23030 101085 70455 34438 30876 62479 37378 77418 208814 116965 131756 210588 202941 149298
23018 149298 131277 57104 53663 19980 93940 100904 38334 -27021 -89379 -148699 -160164 -162515
23006 -162515 -202990 -201626 -105427 -39757 -60545 -135106 -44998 112254 146760 97104 50999
22995 50999 -32895 -40051 -81282 -217512 -179004 -75187 -28062 -18205 -85900 -99108 32892
22984 32892 62017 186428 153926 40159 9464 159568 201939 232866 268099 241627 193938
22973 193938 96571 52287 26436 65240 2375 -48510 -85898 -101100 13192 70129 76763
22962 76763 139553 83848 119372 -78608 -146334 -40953 -15090 -161435 -189874 -44597 -40837
22951 -40837 -23807 6285 -65112 -54356 -24048 74448 2017 2165 72485 24973 71300 136331
22939 136331 162928 193365 169708 132896 53613 -54604 164605 142006 195980 212168 68581
22928 68581 13773 7718 1883 47851 63004 -161557 -278394 -163483 -126226 -133683 -20331
22917 -20331 -6960 -123151 -62725 12161 123034 147 21530 63733 44550 -8645 -116320
22906 -116320 -175984 -99224 -29980 149511 72324 3311 -18353 -22924 -87192 14715 50192
22895 50192 -10212 -31796 -40674 71026 100911 201316 202096 190301 178461 209007 157102 41529
22883 41529 17482 5357 73836 163850 127026 31595 67022 167581 137256 109452 44317
22872 44317 94640 28192 107112 262427 360738 321355 162169 128841 35769 17418 -126606
22861 -126606 -85120 31551 14272 71266 176213 123222 21033 92055 158831 48172 -75572
22850 -75572 -67858 -79350 -44668 -43719 -62483 -45127 100971 248113 170544 65102 54032 81340
22838 81340 25761 8240 90337 100802 35355 46907 6991 -70991 -62222 47425 66192 36403
22826 36403 -21928 100347 153799 -43235 -119152 48939 152917 79615 43716 -53004 -61562
22815 -61562 4089 27691 28659 53489 -31017 -169612 -241985 -171736 -293721 -136164 -93870
22804 -93870 -149042 -103168 -52586 30423 65057 2635 60459 51278 -25280 -22782 15830 82591
22792 82591 33402 40325 -31381 -23509 24597 99362 234789 240670 283619 191598 121816 188519
22780 188519 274380 150681 99934 166278 164082 165369 190871 150338 252354 192202 97646
22769 97646 25879 69635 78917 34110 -80966 -28461 14392 -27796 -156508 -124046 127692
22758 127692 205625 45479 -39911 73272 186686 201372 80624 19713 -59204 -42063 -38358
22747 -38358 -51485 -17421 47024 67449 11174 5627 50862 93996 142856 62813 -31568 -68966
22735 -68966 -118536 -112117 -95021 -10017 -26212 8434 32934 21234 -10970 -61190 -109217 116
22723 116 70024 11056 39146 156690 115238 87845 125017 168771 -25055 -43575 3072 29920
22711 29920 78154 97725 79478 156331 232814 234429 139181 81151 28504 68677 -12756 -157912
22699 -157912 -238028 -169223 -43215 -9753 -34154 19495 75918 86934 15054 3217 -63392
22688 -63392 -22154 51071 -3960 -39218 -69832 -130469 -200728 -209623 -158846 -72223 -80331 -93243
22676 -93243 -112206 -125092 -178305 -122570 -6620 74268 -13374 -68169 -8855 35890 -71627
22665 -71627 -114238 -194302 -98238 -32635 -27182 67234 71098 76554 53020 133662 16052 -23583
22653 -23583 -80256 -73000 -132896 -196809 -197665 -198032 -75544 -82493 -219415 -197390 -147796 -175640
22641 -175640 -193703 -54025 -146386 -255967 -259714 -135450 -68743 -92154 -58506 612 68442
22630 68442 20413 -10915 198375 232108 77863 -38376 17414 9062 -77188 -100776 -208121
22619 -208121 -188697 -175082 -139714 5758 77512 69034 53965 25577 -65885 -148456 -211101
22608 -211101 -167330 -111277 23579 84726 159154 118403 147767 183442 232697 198268 118472
22597 118472 -19635 -46702 26905 96371 148379 106073 -17669 -169492 -146629 28072 104639
22586 104639 78577 24237 -36668 -86041 -38197 -75155 22452 26847 -70000 -74034 -58083 57176
22574 57176 -2422 -138523 -156052 -138117 -163888 -227807 -107318 -59103 -98738 -146907 -174528
22563 -174528 -105448 -100825 -223085 -246550 -293703 -356458 -161049 -13423 -29502 -53254 -30509
22552 -30509 -35293 -132336 -132500 -68782 -76245 -61191 -18915 118770 265922 158827 37627 -78593
22540 -78593 -49880 -8996 68620 226717 157241 8833 -12750 54952 39764 -77902 -42137
22529 -42137 -51008 45429 174073 209360 255670 162741 98887 56859 23858 7058 51901 34469
22517 34469 64967 6326 -25256 -33297 1716 83446 130270 63617 136701 188280 163558 45724
22505 45724 -80960 -155650 -211749 -78084 -45939 -52430 37763 70691 52166 91301 96025 105063
22493 105063 -544 -38203 17954 43957 50952 14352 70699 68162 22614 -21640 -42565 -32310
22481 -32310 2814 37630 18309 72918 217000 189040 -50070 -95183 -103908 57112 158067
22470 158067 163202 92896 63448 104636 141756 77456 68303 102115 63622 36065 608 -81427
22458 -81427 -124334 -107984 -32708 -5908 -138685 -228920 -180580 -213544 -168529 -89653 -92374 -118139
22446 -118139 -131406 -90358 -45572 -29036 7878 83926 71506 123383 86505 -62549 -157362
22435 -157362 -15962 62020 -2583 -97596 -221906 -221186 -227958 -246932 -244555 -243865 -286616 -229002
22423 -229002 -97070 104248 89507 62365 57747 3837 39996 55092 -16039 -27241 -90942
22412 -90942 -107720 4672 196853 188735 181339 78880 -2029 -88807 -77281 127296 270443
22401 270443 240198 221141 153579 69294 -70529 -107005 -130349 -121148 -150751 -208911 -193784
22390 -193784 -54761 75751 23897 -36595 16153 125936 223786 150264 77880 52252 109663
22379 109663 172032 96478 -17402 -127619 -189152 -206972 -186063 -68944 2471 31879 -116907
22368 -116907 -160741 -134845 -65821 -108064 -90247 -119809 -192021 -153044 -13938 50880 -29646
22357 -29646 -37747 25922 -6611 -32470 -100895 -156817 -190575 -188171 -57863 26824 -143890 -116080
22345 -116080 -94501 -118563 -60720 56636 130140 43241 29990 -26694 -74317 -127960 -123229
22334 -123229 -70493 -8282 28233 -19747 -50931 2573 89507 65786 38280 47115 -6288 -102340
22322 -102340 -85798 -7468 57802 -34687 -79164 -19992 -36498 -115613 -202650 -188336 -185505 -125958
22310 -125958 -232847 -202627 -147683 -37579 -75240 -203700 -172871 -63538 9565 26966 12848
22299 12848 12571 56940 78447 59500 68879 113458 -27852 -83308 86431 184522 254654 159144
22287 159144 -73238 -130462 -59739 -169808 -279541 -224551 -181605 -90404 2955 -14556 -4378
22276 -4378 -34916 18606 157530 128081 -30854 -212485 -171314 -73092 103545 29502 24838
22265 24838 -21801 -53185 26755 161856 255644 202622 149107 108073 162129 80004 194955
22254 194955 151202 66647 33577 83397 33224 93773 211630 81021 -45710 3304 35559
22243 35559 33249 45521 93169 22646 40443 82544 13221 -73081 -127891 -102956 -142307 -224132
22231 -224132 -253626 -221792 -85924 -108010 -118522 -82532 -17605 -53166 6767 49297 99734
22220 99734 34689 -74122 -168930 -256990 -207005 -51912 -83326 -65291 21424 12383 -167951
22209 -167951 -149733 17932 14661 -42793 -5452 -81778 -151104 -54538 78995 133391 -42792
22198 -42792 -165273 -197537 -211056 -159603 -137832 -96516 -49134 -129661 -193370 -235298 -261097
22187 -261097 -138234 -23834 77652 34679 10964 130730 109581 109725 102169 24872 -59273
22176 -59273 -16105 86740 140488 57542 48819 52258 59448 12812 12532 42690 -14168 16489
22164 16489 -35082 -90414 -141169 -141182 -80213 -79236 -82824 -18098 -8393 17164 -30097 -50900 52181
22151 52181 199768 29522 -44717 -135637 -122500 -99409 -81033 -180895 -93588 -92135 -61906
22140 -61906 -16295 -20116 -65871 -166249 -160019 -123383 -202332 -303590 -360529 -282231 -176445
22129 -176445 -124127 -26486 29040 66192 -83241 -58395 -60445 -128038 -73530 20304 102960
22118 102960 116247 30070 -38176 -81832 -40015 -4798 -42864 -38281 -9608 -135955 -239045
22107 -239045 -204464 -225592 -224433 -105255 -85731 -90815 32149 47244 112789 121392 62594 51068
22095 51068 168321 195217 80008 80161 146657 167982 87385 46351 -139478 -280192 -375585
22084 -375585 -300300 -217231 -197304 -198625 -93136 -98934 -162888 -179635 -224553 -271214 -214465 -210797
22072 -210797 -198137 -130880 -171086 -176685 -124518 -35099 79512 106919 -43389 -35042 110691
22061 110691 117845 -18021 16696 105331 165685 72372 136097 88253 33630 63088 110900
22050 110900 37765 32557 38354 -28112 -80883 6467 38021 93410 149966 186716 182139 88664
22038 88664 16435 40102 119137 111251 101999 136328 105606 159940 144116 95242 138706 240316
22026 240316 137587 96475 198963 140586 -11733 -86465 35503 89694 37137 35849 5146
22015 5146 9777 -8385 54018 52968 -47978 -111340 -7162 106378 92978 63177 71009 28782
22003 28782 52928 70746 52804 40165 127776 108761 159228 291523 304974 329500 279951
21992 279951 140360 84465 95754 96808 66109 70938 31446 47124 -61330 -167222 -175816
21981 -175816 -147029 -83979 -79091 -120730 -77973 42494 57227 -24693 -84015 31229 130502
21970 130502 90026 71406 91017 -28021 -114259 -155478 -47397 -19111 -141585 -187535 37315
21959 37315 124850 77082 15043 -2674 -91688 -104193 -108617 -18255 -17800 -68301 -5215 85517
21947 85517 83674 -21854 -69984 -133210 -123419 -74688 -52450 -132050 -127310 -12911 5333 -80055
21935 -80055 -104702 -187352 -112081 -132682 -173719 1004 -79303 -160768 -118561 -39218 -48327 -160415
21923 -160415 -115081 -70711 -9960 -2202 -12414 54141 27916 -124534 -201691 -108679 -29416
21912 -29416 -19320 -143555 -209225 -169994 -109585 -68451 -101129 -78999 -84700 -90056 -88509 25192
21900 25192 75677 -23392 -115920 -65509 37641 67343 36246 -13647 -134206 -15570 115747
21889 115747 80953 34147 127215 56288 20809 31482 66981 -38523 -84084 -107798 -63080
21878 -63080 -63180 -78920 -48846 -47652 -25402 -3148 58110 23258 -37822 7469 54690 190164
21866 190164 164612 194989 242376 279465 215569 114906 87190 9785 75652 212929 354203
21855 354203 321778 173418 267390 246810 156973 71424 38886 -74608 -61224 -6916 -24257
21844 -24257 81624 172189 121900 22991 67210 108418 36124 40970 38424 111307 185942 87977
21832 87977 -28310 -87961 -121278 -93993 -28477 33887 23200 -111971 -181185 -65922 -62868
21821 -62868 -58930 -121739 -37392 -14927 -817 -2013 51554 -37538 -126475 -98916 68687 45262
21809 45262 77303 -34359 52313 98443 -2402 -131290 -188233 -133146 -59302 12237 58623
21798 58623 -61820 -132819 -116307 -170964 -94549 86405 195786 141212 106284 -46860 15354
21787 15354 127987 79085 14444 103517 141554 94777 65781 85059 -4776 -91430 -105168
21776 -105168 -90219 -36804 -117129 -97446 -40200 13882 24247 -74593 -37244 -8319 -70768
21765 -70768 -162236 -122142 -28835 43637 107058 44538 74452 151970 122783 62550 132439 118956
21753 118956 146524 147041 113872 137145 112987 134687 56062 24716 62985 154042 159691 172887
21741 172887 184723 82604 -15734 62526 135807 39458 -91948 -39510 4254 -10884 -68735
21730 -68735 -126273 371 61352 143877 170033 31022 36340 51766 10044 -39128 -69276
21719 -69276 -95251 -36798 1140 24749 114403 187001 124092 10180 -67815 4923 70818
21708 70818 5157 -99135 -37721 24913 -31110 -104379 -56337 -38779 -63900 1113 58207
21697 58207 81265 -55840 -53999 -153186 -255290 -152314 -98166 -69655 -69748 43053 154426
21686 154426 102366 -5794 -5498 35747 134929 162600 44147 70303 136177 119147 52656
21675 52656 56462 15631 -67624 64668 90705 -55362 -184959 -163974 -89469 -171803 -262093
21664 -262093 -255316 -258765 -234995 -120947 42971 72713 78272 31783 41482 -68577 -162462 -135062
21652 -135062 -10472 -60477 -86548 -105312 -73651 -21548 38873 -66903 -84175 -16886 39424
21641 39424 13045 -19068 101006 108000 10491 -23063 -29914 -14558 -47131 -58565 18023 126591
21629 126591 69206 25712 72404 91538 96876 -43115 -29775 105984 157086 94810 23153
21618 23153 52616 23785 24340 10037 15064 115467 45270 -13244 25218 36881 77347 70553
21606 70553 199139 326439 236827 153386 165135 71895 -5675 -3857 54719 121223 122839 98090
21594 98090 97812 111612 177864 178238 21196 -74641 -113242 -134533 -119597 -159349 -44590 8654
21582 8654 49434 97733 53282 32170 87580 16111 14866 42354 231 7839 -6719 -69048
21570 -69048 41518 35746 22157 55549 71706 81010 85583 78437 96997 117662 84702 51791
21558 51791 34036 28692 -28247 -50753 -64700 12350 44132 76785 -42472 -45374 59295 97074
21546 97074 20931 -41017 -48142 -98087 -25609 49707 22267 3555 129225 202360 58533
21535 58533 -75906 -87774 -35574 16228 80528 90526 -84708 47310 77475 36830 26648
21524 26648 117740 147237 73882 148571 183516 122686 147456 142831 96815 112076 24705 22987
21512 22987 48803 12168 30773 115207 152290 48869 -157128 -297795 -136622 10136 130058
21501 130058 228752 205064 125063 47214 24685 31596 59244 -9114 -185870 -190281 -122846 -126649
21489 -126649 -64357 -68876 -44774 -21714 5757 33909 143868 28364 -44569 -72351 -205407
21478 -205407 -200182 -137931 -79848 -19032 -33275 -42964 38248 3379 -67792 -23517 58880 248064
21466 248064 131259 36247 111880 170330 171021 110618 57216 158919 199476 120618 -27449
21455 -27449 -66324 46296 69650 -28980 -117520 -119294 -164750 -153389 -166053 -106641 -135751 -43651
21443 -43651 27660 -17598 -31630 -134184 -207695 -195583 -67548 -12250 54333 62298 48095
21432 48095 35911 43543 -6571 76641 77248 75971 67990 27667 159093 210789 228286 304495
21420 304495 234998 155280 169124 99979 110126 33320 -30236 38867 46587 -62812 21791
21409 21791 143327 149472 115359 54100 -19250 -75978 -93314 -23678 -62463 -96722 -81194 24918
21397 24918 4106 -2542 -20326 16410 -36485 -92933 -95767 -112606 -75246 -126184 -114053 -65269
21385 -65269 -4526 87244 40745 33319 -232 -55352 -133044 -233015 -108134 -98169 -150003 -125399
21373 -125399 -72940 41262 131830 189602 117550 89314 10502 -28624 28464 9320 -84085
21362 -84085 -226424 -286196 -221538 -169260 -186688 -126187 -98408 -106867 -132043 -115019 -114387 -23621
21350 -23621 -39210 76614 86119 -4245 -47349 -48114 -39127 -45593 -79605 28905 84605 101175
21338 101175 61240 67567 160843 263549 253472 201594 137005 150999 159189 113335 125932 131558
21326 131558 111735 63653 33302 62479 81280 39903 81631 114048 104234 56592 97927 91361
21314 91361 -15751 -133083 -168292 -192075 -109817 -62058 -19853 -53957 -50020 -124763 -29475
21303 -29475 12987 37318 39824 82563 54098 -93089 16524 41405 -111740 -69932 -113883
21292 -113883 -117702 -123636 -145716 -133719 -53750 81137 36988 -143625 -276765 -251190 -173095
21281 -173095 -84442 58927 106881 -56765 -57919 17638 -11354 21548 -12635 22094 50507
21270 50507 -61603 -52981 66955 83029 77789 77553 98346 -85756 -146552 -108397 -20419 60484
21258 60484 19677 27153 126178 200486 114379 112173 141668 126666 72326 36605 79969 146093
21246 146093 -337 -121537 6135 123093 51529 -104305 47056 162953 302205 290230
21236 290230 228927 304979 472135 516732 524021 683434 797833 1000397 1118908 1268530
21226 1268530 1517748 1668175 1727653 1602232 1299662 858697 567238 363035 308141 338803
21216 338803 293508 288988 247146 58333 -623 43903 70654 -101195 -140444 -233671 -271881
21205 -271881 -290313 -225782 -56986 -27446 36206 -11441 41810 64612 71088 61069 5709
21194 5709 15515 -19443 -96769 -112016 -12862 -92165 -27503 -794 35216 2826 -60306 -77473
21182 -77473 -141762 -103930 -48766 -94641 -58008 -132215 -55783 6710 42589 46002 13683 10353
21170 10353 17813 11855 -1372 -56678 38453 118545 150129 142985 -11164 44203 163898 185049
21158 185049 151436 5690 -82146 38910 173480 201979 83102 -14425 15548 25617 21334
21147 21334 34187 19324 67427 5958 -62349 -10311 30665 34051 97624 197490 205428 110999
21135 110999 24258 47990 133167 98901 147201 79518 -40722 83612 71307 106578 116284
21124 116284 134044 118354 33398 -34294 35190 -968 -7986 59729 7509 -11716 -8033 62234
21112 62234 71034 -23205 18178 32864 -39239 -49323 -19529 -91162 -245673 -171291 -71567 -92714
21100 -92714 -222007 -260198 -157699 -53133 9974 71240 86924 65587 43363 -2369 -1341
21089 -1341 -1423 8110 64622 101220 165764 180941 176310 158471 90684 72869 63837 37099 85609
21076 85609 102508 105440 111507 14403 -53125 -31224 799 -55302 -26464 109702 126001 112915
21064 112915 99875 94724 33246 -2493 -27567 -116603 -199102 -138205 -55961 23218 55534 164005
21052 164005 243796 145246 113910 85687 65694 207359 250767 149779 54621 39029 105051
21041 105051 138502 158390 45931 22348 32734 53709 75309 -14102 -131878 -46154 65391
21030 65391 205230 198242 178629 128665 14834 8005 87328 105291 141054 194237 104886 39786
21018 39786 66573 35130 104905 143328 127327 102877 147764 133725 130372 119724 8148 -22946
21006 -22946 -2959 148623 168329 106783 80363 54377 30913 84503 173123 185104 9591
20995 9591 -113681 -104739 -53505 59546 91129 81657 112428 105069 88551 162921 238232 113010
20983 113010 134065 101548 80995 155288 240085 232194 162558 62245 24892 -44578 92343
20972 92343 142107 134341 82370 78549 125601 191586 170175 112231 76912 60203 137941 155839
20960 155839 124028 134684 154064 210633 239307 234291 169042 167783 175982 104878 199356 275908
20948 275908 294172 218543 73034 77134 67534 28443 49253 -35347 21583 134416 149821
20937 149821 183990 208967 210969 107273 -10292 -7562 11790 9 86901 129653 47867
20926 47867 55439 -42647 96450 133019 50900 -45900 -71589 -161188 -116974 -61042 -137109 -164054
20914 -164054 -127555 -162501 -226418 -120877 -65456 -25421 131554 185039 202343 221483 175381
20903 175381 150016 104018 171433 133636 46450 -9184 -3641 -17568 32647 93487 213511
20892 213511 232152 233832 215011 277493 223482 163157 211766 248375 316334 381031 280706
20881 280706 257370 211750 29253 -70381 -15284 105476 186630 183881 209237 114589 -4223
20870 -4223 118989 168656 308016 297716 195613 122455 155837 70945 84813 165178 117454
20859 117454 66334 57739 72232 97008 268716 340356 295939 334612 366415 195690 182513
20848 182513 290541 294432 188223 155655 257855 340160 236798 164338 198009 279455 241005
20837 241005 204084 289749 260152 198911 236407 280560 260789 219883 152389 154499 216486 328176
20825 328176 322137 336503 397498 366906 269963 141663 11742 82611 153325 242215 382549
20814 382549 480107 376498 212626 199001 192261 202427 245534 310307 312812 222270 256844
20803 256844 250589 319705 288949 231280 293946 321787 342664 380829 361933 334072 345113 349331
20791 349331 375944 423016 552315 542530 416249 386640 302594 135240 132400 170686 198682
20780 198682 232543 230243 256310 265089 203046 110185 114331 133471 94069 2241 67300 390202
20768 390202 459834 452482 373492 368939 461369 422613 353616 395404 449336 441867 445785 476251
20756 476251 485626 379701 315178 348819 249658 291674 316874 242480 252953 235706 359330
20745 359330 445113 322679 299697 396985 451840 353452 450792 535587 460459 470436 462842 383774
20733 383774 441581 528779 629733 543864 623223 706360 744526 648942 644425 592882 493924
20722 493924 430440 466333 457955 498145 619501 748264 800578 710860 736513 839428 825524
20711 825524 813738 928860 1038061 1196472 1249171 1196424 1116452 1020702 1088655 1061181 1114479
20700 1114479 1159808 1174205 1312753 1388241 1416743 1362870 1432014 1578605 1782731 1849133 1919070
20689 1919070 2254716 2433262 2604311 2851873 3059505 3071730 3122707 3395258 3606047 3846270
20679 3846270 4272722 4588620 4846471 5042955 5355065 5664744 5920718 6283460 6679206
20670 6679206 6992459 7606759 8209102 8713177 9361108 9938633 10596302 11195815 11830039
20661 11830039 12583547 13372840 14147161 14968638 15928295 17006322 18143919 19162325 20218805
20652 20218805 21454503 22983049 24530468 26019500 27544047 29023996 30595721 32430849
20644 32430849 34698102 37487340 40686245 44491643 49118884 54693734 61791048 71370009
20636 71370009 86222412 110112119 142255838 172910468 199682566 236017839 286253958
20629 286253958 324935994 318391570 280796875 222300386 155803372 104118911 71217844
20622 71217844 50982332 38088118 29456093 23544370 19375712 16249138 13663665 11705141
20614 11705141 10124560 8726576 7698215 7072382 6710129 6488140 6306019 6267876 6178146
20605 6178146 5967032 5350884 4665059 3956086 3452356 3030857 2679043 2342190 2119709
20596 2119709 1890142 1843799 1721319 1506793 1565247 1620507 1653986 1692269 1689758 1600451 1517642
20585 1517642 1379455 1221395 1138488 1102668 1131164 1299053 1129133 959391 923605 790422
20575 790422 833782 905472 899483 1003397 1094118 1221259 1196771 1251623 1292011 1324233 1199610
20564 1199610 1296752 1391080 1314882 1248357 1146742 1090183 1092439 1049032 1115788 1062284 1086277
20553 1086277 1278728 1547340 1815538 2192413 2444431 2713087 3123635 3603372 3541895 3167141
20543 3167141 2702037 2106092 1643299 1391027 1308500 1087335 914331 901071 908200 776761
20533 776761 735022 681897 603876 617740 514779 459458 424689 265925 176484 199408 333041
20522 333041 403408 371047 337778 376942 444204 484887 454268 495575 471424 455685 299255
20511 299255 278608 362470 437319 424648 408290 383393 378015 369201 311800 343757 240940 223822
20499 223822 185615 157477 124213 118596 116605 162357 158720 124001 96856 124460 236867 161058
20487 161058 194040 174418 193033 238738 350026 381513 336932 409762 411281 397560 357231
20476 357231 347527 273508 266761 311797 341225 294907 135371 -69672 -81617 11219 129847
20465 129847 150640 89056 -4818 -30845 -97375 -21754 61540 62131 122891 312994 342792 298951
20453 298951 210715 194242 178305 84926 45895 -50148 -68001 -59718 -5609 22580 33402 123152
20441 123152 271272 242986 178740 278450 186552 4100 82399 192410 60088 49233 159939
20430 159939 248938 233316 229316 251918 290401 337622 184022 20247 -144000 -116904 -85351
20419 -85351 76715 158423 93721 94056 152478 112723 92725 57068 130816 177851 251452 333392
20407 333392 347113 209827 43744 32449 122310 199935 183959 155065 200940 266008 238926
20396 238926 192403 248474 329525 287875 209587 138349 126831 229909 185892 130265 214920
20385 214920 161764 -25623 -81279 -37513 56061 98417 25041 165018 167149 82054 -10691
20374 -10691 31542 81398 51077 116647 108081 15445 10098 52917 42302 -4282 -30674 40652
20362 40652 116403 78174 -7619 87228 184654 245586 281267 267691 206593 160687 131284 148877
20350 148877 285504 277477 284878 296873 333264 324043 299299 218035 201491 200066 95788 32396
20338 32396 159307 350784 257227 220079 194010 205562 218076 170390 132453 107225 114047
20327 114047 180430 179604 128110 180100 228401 98679 34426 85182 132615 260826 273080
20316 273080 184018 41849 -42196 -28592 -80378 -21627 24612 -43245 27506 83785 106846
20305 106846 114093 116941 97838 164775 256360 265277 280730 241615 265990 242108 214060 293659
20293 293659 327154 232155 183223 228564 173124 61819 -48008 -45804 20839 15933 154206
20282 154206 266613 256345 241269 206257 239178 298019 207489 294365 354001 298746 275739
20271 275739 361488 398973 505449 599184 539119 523536 578803 745525 862265 997651 924072
20260 924072 800545 691939 612159 452318 400850 434125 667527 722678 539649 536605 652774
20249 652774 703027 691787 742978 814712 743336 788974 874111 717809 517661 428231 394227
20238 394227 445398 440514 460323 460541 499070 367579 336493 296825 204233 88801 142508 253462
20226 253462 369215 454904 473468 424184 465662 480441 311138 252134 351113 336464 356508
20215 356508 411449 356639 333556 354151 403710 569368 733265 885983 1049379 1164036
20205 1164036 1200341 1097596 1090426 1070777 962121 1006247 1135093 1214105 1258924 1164731 1078486
20194 1078486 1062765 958991 953856 970924 906443 892050 889037 767654 771654 801259 829521
20183 829521 795196 775074 735879 681398 725252 814812 1002487 1000698 1079108 1097050 860757
20172 860757 694707 758218 791390 664488 547644 513109 425057 348847 371770 323576 264405
20161 264405 285473 271388 254389 231001 221495 107201 174531 272448 248509 247149 326700 385262
20149 385262 398644 406887 398338 431731 481515 521077 543118 460159 381772 432989 459892 532383
20137 532383 688956 779150 783140 767013 863989 842520 733552 729801 663499 696839 802862
20126 802862 851501 884427 1024785 1014251 960325 859919 772902 759581 772407 717337 795583
20115 795583 886137 952869 852481 655461 506850 516430 379481 364571 394536 260021 239933
20104 239933 302600 301968 340053 357743 440660 302674 104881 234495 318095 260216 336685
20093 336685 446664 515397 501220 375972 347885 364822 192389 136818 102542 193515 369790
20082 369790 272406 275945 316463 319980 291700 327237 234476 224353 312007 292074 240273 315086
20070 315086 339861 322395 366551 373037 353594 344965 373586 187227 266848 331928 368588 360204
20058 360204 350340 306019 334397 315092 407533 415721 371161 313648 303174 401251 351107 399664
20046 399664 469548 407536 386631 433231 461491 544365 626078 705024 732113 746385 736661 717155
20034 717155 833146 886718 915012 974374 1252046 1521992 1605909 1702029 1892839 1873784 1749365
20023 1749365 1673474 1485349 1132856 808112 649687 542248 511865 490796 577331 530578
20013 530578 444713 391907 447420 469276 475539 381130 331105 283525 406223 532627 588903
20002 588903 572980 490830 489638 533884 419437 438724 517057 428866 308576 224733 183727
19991 183727 202247 308105 401921 474664 445454 310674 303738 316406 421230 485170 335940
19980 335940 337336 342159 340219 333990 417947 419495 374107 337294 323232 339872 344924 391409 459057
19967 459057 514771 464274 430565 424846 415649 435345 441839 428062 384468 305550 248553 232787
19955 232787 353642 470300 537177 503230 483801 381672 332468 345056 286696 235164 275884
19944 275884 337764 425338 560839 461488 272851 342683 421497 425875 375701 385539 457973
19933 457973 525497 590405 483137 467680 456863 423347 376595 387488 481701 638931 627012
19922 627012 553796 506887 536907 541440 490433 381265 317813 330231 380501 509113 521793
19911 521793 518353 568285 563056 652431 807122 803512 790819 696181 645607 607265 578459 683996
19899 683996 817528 737702 751756 727048 572416 611164 722574 757305 627389 578250 574850
19888 574850 590907 565378 376140 377602 445826 644220 584040 514404 591793 673417 621109
19877 621109 656000 610734 581865 539903 575758 581406 608357 610578 622080 625097 655464 723450
19865 723450 743660 609384 660975 883633 927431 854413 910512 906447 955795 1108909 1159146
19854 1159146 1175578 1107064 1129343 1141350 1168085 1219181 1189954 1336570 1473378 1630379 1672325
19843 1672325 1690054 1722039 1726715 1681282 1668599 1681595 1879447 1955518 2099454 2323344 2510162
19832 2510162 2798552 3024763 3073881 3022187 2856837 2797055 2800484 2845227 2756896 2637176 2608585
19821 2608585 2560634 2433988 2464867 2422130 2369415 2377334 2274851 2133700 2059166 2092021 2068290
19810 2068290 2089437 2196622 2307981 2343526 2339088 2324974 2224540 2272176 2435043 2529422 2678361
19799 2678361 2743153 2796877 2946395 3260848 3674075 3844943 4077064 4543676 4775985 5000445
19789 5000445 5194421 5353456 5517478 5650083 5876754 6250956 6652491 7170644 7728443
19780 7728443 8451509 9211547 10047161 10677506 11193563 11630174 11751001 11382462 10790034
19771 10790034 10369538 10208857 10197902 10402389 10654670 11015141 11427295 11735875 12090964
19762 12090964 12662274 13177161 13851385 14581975 15512026 16686792 18130008 19709266 21342985
19753 21342985 23275496 25853049 28871764 31796685 35033520 39358412 44785737 50039913
19745 50039913 55239273 63227297 74718071 84852379 86933719 83582232 77172814 70908178
19737 70908178 67194015 63145306 58048855 52512919 47362947 43589135 41616881 41598848
19729 41598848 43460285 45926209 46537492 44624067 41275062 37115639 33512472 31206875
19721 31206875 29982209 29500324 29684223 30260286 31283864 32610554 34317322 36311076
19713 36311076 38544663 40846029 43447852 46443706 50221066 54538843 59701966 65632527
19705 65632527 71623816 77540248 84188887 92224655 99801546 103862357 104680796 103701880
19697 103701880 102732321 103992618 109171784 119880591 137416513 161375943 189866990
19690 189866990 222482642 261745321 305695967 343884765 366819972 370427801 354342374
19683 354342374 317210159 269122268 222476231 183841619 157636134 139985422 124462527
19676 124462527 110386502 96967028 85206504 76926523 71955231 69133895 68042098
19669 68042098 68331962 69479857 71935223 75969947 82121372 90318964 99603436 109166503
19661 109166503 120605223 136698685 157784292 180168232 201761338 224550253 250606917
19654 250606917 281904049 314393545 338994345 352521144 347712468 319926268 273865446
19647 273865446 220027893 168994161 126880178 97301564 79169128 68849797 63624290
19640 63624290 61240125 60156560 60589455 62601790 63850258 61266102 55313817 47454469
19632 47454469 39136828 32250360 27470631 24508947 22685556 21411111 20457951 19552555
19624 19552555 18710751 18222910 18041827 18060762 18370998 18759910 19344667 20318581 21954164
19615 21954164 24466211 27558100 30763451 33915790 37744308 42371701 45866453 46800879
19607 46800879 46182260 45045931 44468791 45073218 47094045 51370207 58625920 66891028
19599 66891028 71852533 72750996 72008922 73105641 76032987 74308211 66756477 56242015
19591 56242015 43749409 33012719 26032413 22198569 20008092 18217592 15947508 13517885
19583 13517885 11123959 9196040 7783595 6687332 5823274 5203790 4840781 4422297 4146946
19574 4146946 3963919 3862392 3680774 3498237 3365353 3292639 3162377 2937862 2839372 2710754
19564 2710754 2573318 2585764 2568294 2506870 2509543 2416676 2332558 2224790 2039371 2023799 2194110
19553 2194110 2412982 2610812 2715212 2737204 2857898 2946188 2977797 2708297 2400501 2098457
19543 2098457 1896491 1667363 1464264 1537686 1610859 1539906 1442815 1310202 1245456 1165916
19533 1165916 997417 931510 932716 958644 985423 929683 893609 810218 802688 789692 668340
19522 668340 589020 529200 440430 405615 351158 368422 429914 421772 484011 581539 564524 596847
19510 596847 624272 579755 463352 410843 385325 467380 554211 441741 372812 318640 339716
19499 339716 358214 253777 224546 256725 286901 343978 401945 437831 344209 241349 275549
19488 275549 334812 285273 256350 262023 326955 403907 373048 379339 447152 444884 357722 176334
19476 176334 133753 194356 195267 195719 193811 155052 137140 -7788 -45442 61878 113011 158066
19464 158066 265695 246749 307578 324694 279267 320618 353159 224057 141432 143005 177273
19453 177273 272894 245055 248449 238436 143185 145362 234802 210807 165575 150410 186843 204298
19441 204298 173523 108479 60867 44523 139550 183750 261936 254753 172393 128155 72652 39878
19429 39878 164940 164636 188788 95829 25180 71339 103837 109537 77139 -43128 40826 47364
19417 47364 -18378 -23788 -31331 67712 116125 115408 130501 90470 107298 102960 122886 47131 21028
19404 21028 -29948 -39056 46030 89347 183661 124610 -48547 -17567 126231 204814 231216
19393 231216 253121 278780 244194 106165 76169 133894 77876 -38332 28662 84454 145567
19382 145567 156042 83803 115450 -11407 -107528 -75444 178273 162622 140430 55377 62365
19371 62365 50896 -54309 -76506 8320 101059 108782 -18441 -19156 139529 117924 67654 153942
19359 153942 119137 -7739 -34628 -41419 -51073 -15805 141770 62190 -53357 -41679 117950
19348 117950 52738 44843 118305 48997 -52166 -18364 64356 110608 137024 38946 -74707
19337 -74707 -154023 -209868 -212226 -164511 -136059 -74344 -64517 -72005 -79887 -125299 -209121 -219375
19325 -219375 -86678 -42715 5487 -15031 -28435 10849 30029 12513 21423 -18392 7788
19314 7788 -69856 -130927 -51092 -83311 -41794 102394 133817 88654 74304 40938 -8837 -24380
19302 -24380 -24255 16683 22518 -8868 -133004 -204657 -194311 -231209 -253127 -248205 -267692 -178601
19290 -178601 -121773 -35962 -6765 30980 112565 153449 70345 7463 -107765 -143781 -152832
19279 -152832 -191315 -77438 -38487 7752 -118098 -205112 -285177 -228856 -165957 -134889 -166059
19268 -166059 -242843 -145609 -91107 53239 125130 91196 71398 80557 98259 63258 45734
19257 45734 -18357 30743 28445 -36236 -22074 -74463 -43417 74992 9429 -35619 37365 -17551
19245 -17551 -87759 -72323 -148530 -107603 -116525 -43541 72783 100340 31650 48593 106334 123550
19233 123550 104546 126367 83470 133281 210960 145972 122602 182040 255640 189421 87810
19222 87810 -36047 -19155 29836 -26428 148462 274229 362779 467588 444162 462698 613038
19211 613038 626473 752947 856099 941610 806664 669449 705976 733573 719915 679774 759323
19200 759323 915622 848810 656827 391466 428202 421491 543244 567814 506416 488760 449053
19189 449053 320859 316432 155530 107672 144920 125670 150693 79123 131137 269343 255861
19178 255861 132997 165623 225157 277766 325447 348289 280334 301729 218133 368764 537709
19167 537709 506771 597962 680105 704128 688734 623162 625810 544230 522422 537140 620816 604460
19155 604460 675880 880151 926976 995149 991473 976586 938578 924701 1041644 1034784 987741
19144 987741 1143077 1253863 1257143 1269624 1229609 1243950 1253676 1199107 1073354 894010 848079
19133 848079 841718 814722 775713 728271 695999 460135 370220 237282 101979 138526 151035
19122 151035 68528 48374 183134 192164 114346 133225 247028 292276 407322 381965 237911
19111 237911 203358 214877 89977 118315 393658 444112 319350 243628 185316 261476 243961
19100 243961 196789 223348 374137 519005 472950 383286 477444 662286 687309 701057 634505
19089 634505 534212 469944 520468 575626 479357 422646 410454 537575 604315 563893 625535
19078 625535 745870 828159 942250 948610 789544 642670 513113 346640 190662 69529
19068 69529 -97548 13043 21985 98293 82951 -16018 138398 292622 184868 33559 -26533
19057 -26533 -65625 -100516 41838 210314 269471 318000 212861 137442 126578 98463 81167
19046 81167 44537 50898 -19861 27994 114735 119465 -599 -15756 8686 126481 276846
19035 276846 338148 254152 263252 297966 194308 195645 158565 201443 195582 280875 454061 616436
19023 616436 663146 617710 706899 608971 651279 850115 1054943 1287551 1524886 1726580
19013 1726580 2013886 2159747 2069941 2020790 1912353 1699610 1482639 1244450 1031811 916249
19003 916249 842870 882198 1013982 975180 749058 687358 684311 605840 546692 448133 364016
18992 364016 247168 31299 -13984 135615 148440 13631 -247 -47637 34037 10521 41984
18981 41984 81512 61442 178392 349676 362790 376804 410305 319848 309331 424275 565578
18970 565578 674520 792233 878808 871390 865500 810697 879992 1112801 1311466 1489219 1594873
18959 1594873 1681053 1686907 1561268 1475328 1351442 1232119 1078978 803921 527228 351185
18949 351185 314807 251148 230296 300852 368154 246328 39494 -115679 -55336 -40783 -2674
18938 -2674 47779 -32020 -74083 6496 16684 63737 49590 -45284 -11314 -21916 -86398 -97752
18926 -97752 -169816 -165893 -180622 -184607 -170078 -127983 -180377 -97607 -55302 -116094 -118147 -18592
18914 -18592 -61615 -139032 -237106 -195426 -142922 -132791 -36323 8004 20546 53132 27721 60501
18902 60501 218153 347337 381429 305108 204976 119508 53300 25583 40883 51894 45412
18891 45412 39176 32930 116937 142545 50938 29371 73849 -103123 -286830 -309755 -113044
18880 -113044 57206 146333 62375 -42938 -28585 121127 73890 -44570 -85334 -143589 -99546
18869 -99546 -59499 -214 -88865 -145371 -177816 -48571 -48156 -133260 -155580 -51854 42486 18595
18857 18595 -82693 -95649 -122872 -192290 -188186 -117793 -83344 -36410 11230 -57559 -45639 97065
18845 97065 71627 18617 -12185 -57986 -63920 -75166 1207 30334 95681 123960 65142 8316
18833 8316 19378 -35504 -66995 -244651 -383021 -353083 -339847 -231320 39791 42866 -53434
18822 -53434 -40066 -46974 -178694 -127273 -11949 -49707 -23150 -125151 -82978 -42901 19671
18811 19671 26999 57676 19642 44585 628 34338 150088 109790 -36935 -74510 -97519
18800 -97519 -142919 -61300 10143 16734 148894 164710 85200 59894 158122 19993 -14306
18789 -14306 -71751 -37693 39607 170613 267382 245144 29910 -71794 -96850 -152910 -17804
18778 -17804 -57113 -22676 23824 93974 94499 52069 -14148 3635 23622 5413 103388 214912
18766 214912 236745 302844 465966 520526 600993 731674 648373 572732 506120 409121 283778
18755 283778 177711 221992 136125 -3479 -29873 -37152 -46523 12996 39455 31173 44302 182891
18743 182891 166734 -45848 -5498 -27199 2318 61123 175690 162176 26246 -11612 -61687
18732 -61687 -90644 -34866 -143853 -183624 -210445 -155801 5626 -71291 -84666 -11689 -10028
18721 -10028 -11432 99968 193451 170502 202668 174673 56090 -132943 -238644 -26312 199379
18710 199379 176860 84276 101106 296581 392339 282567 103314 -2977 39400 113631 -17703
18699 -17703 -9038 -48361 -82604 -38809 -139702 -229429 290 25465 85461 104889 16341
18688 16341 22377 -53157 -127514 -154137 -84755 -198 -16088 -74020 -34677 -21822 23689 28232
18676 28232 151102 148305 -23451 -143204 -143371 -97403 -55967 -135997 -158394 -204224 -215131 -160571
18664 -160571 -154033 -106763 -26211 5955 20419 14063 -81907 37029 7061 39327 143244
18653 143244 64377 -4590 -24161 -103241 -79802 -91692 29858 33448 -5540 68528 76660 44901
18641 44901 42191 3779 -88157 -56516 19178 82452 93441 19214 32217 16273 -63304 -55160
18629 -55160 -63849 12636 -34915 -116689 29238 125066 84744 11271 -41526 -38110 75990 192306
18617 192306 228921 199077 233949 202316 128288 133815 108520 8109 -56847 -42219 -5813
18606 -5813 -35158 -14091 -6938 -123120 -300226 -329572 -243830 -218062 -149787 -83497 89176
18595 89176 42130 -135249 -136271 -127329 -136425 -166043 -114640 -115665 -54951 31531 31209 -57169 -74924
18582 -74924 22550 85663 -40493 24194 137253 49612 25053 -82694 -146561 -67207 33396
18571 33396 -92113 -157994 -279039 -244668 -112318 -52056 -67451 -12738 -6606 -70212 193
18560 193 104181 86963 28825 35151 175057 127461 83339 86085 74412 113888 13386 -126252
18548 -126252 -174910 -151029 -89331 28403 67201 -117542 -204775 -140702 -82936 -129314 -127945
18537 -127945 -38739 -14156 -3985 -35053 -95339 -136760 -67086 -21433 27068 -57603 -57515 20719
18525 20719 80418 158447 57041 7712 30441 47384 103522 185690 217730 150373 -7809
18514 -7809 76924 199927 170773 40210 -45848 -108157 -65655 -11184 -65417 -57486 -68900 -124773
18502 -124773 -222902 -277083 -156890 -69602 -129109 -146402 -117099 -105869 -131216 -103727 -84238
18491 -84238 -89622 -16826 62160 37245 -3899 61591 -46589 -117309 -139347 -102407 -155891 -28815
18479 -28815 117818 168385 128219 106320 101141 171740 302188 306175 257276 127046 38064
18468 38064 -41669 -92279 -12569 38208 106563 118686 47057 84217 98119 52092 86802 612
18456 612 -126815 -144287 -12380 36782 88699 6376 -103912 -81594 -82543 -156418 -109184 -22590
18444 -22590 78965 207016 98066 32361 43673 63943 68349 189369 116151 3798 -25540
18433 -25540 -105820 -84613 -135275 -61632 -121451 -99007 -42948 31432 27265 -81972 -164522 -123478
18421 -123478 13701 -25579 18354 49242 -13217 58938 93106 43276 -13472 -87416 -28744
18410 -28744 -2983 15198 -92447 -143954 -71703 -15608 14433 -87872 -103819 -116799 -142509
18399 -142509 -134477 -40729 3478 -14754 -88359 -82713 92633 210198 108631 73386 117378
18388 117378 77749 171150 159304 101327 119341 17008 -88049 -60147 -53940 -125237 -180488
18377 -180488 -48335 7021 -90991 -74544 42120 133919 101552 -46528 -172036 -235363 -136460
18366 -136460 4757 -19703 -74410 29569 71957 65344 84979 141676 120185 71929 59134
18355 59134 5020 -18379 59869 156530 78675 94804 169313 178790 209355 238725 228449 129610
18343 129610 2476 -67500 -37099 -55284 16432 45637 38261 38740 -79467 -201354 -242589
18332 -242589 -224949 -276046 -223449 -23806 104845 155404 -21388 -51728 13137 53371 59297
18321 59297 57624 161176 154989 99168 84203 -25897 -97886 19358 97665 78184 140673
18310 140673 176444 205656 153840 112162 124505 138824 82974 66070 -39936 -34167 66454
18299 66454 -46779 -167532 -89541 -135283 -133597 -76608 -1703 11186 -54240 36662 169292
18288 169292 165526 90029 122475 130063 66234 51402 -44449 86376 272160 319715 291297
18277 291297 288724 222203 88623 68567 99355 121030 66018 98629 109354 88460 132103
18266 132103 29099 76303 65386 19743 -65659 -105843 -34036 -114573 -55830 42974 75621
18255 75621 14302 -39626 -45390 -124696 -158717 -162362 -172719 -223814 -197186 -152789 -37161 -16392
18243 -16392 35421 28685 62534 178862 181485 157593 215439 202805 125651 79541 -7304 -2960
18231 -2960 101071 145835 94911 45184 157791 289174 268252 247500 261450 274219 322493
18220 322493 318764 340956 252249 213678 180892 115925 53574 121439 200359 263859 284628 259975
18208 259975 200225 159811 209575 284965 350088 400507 398951 262633 204276 171151 144914
18197 144914 204701 322805 349592 288430 289412 313308 249979 356381 409562 266541 176165
18186 176165 179033 277185 434969 567551 475855 372310 492507 488654 466937 506861 477924
18175 477924 486983 445213 403509 414077 349199 345846 409855 546041 567722 533389 591577 703492
18163 703492 776090 837504 1016843 1224084 1207915 1218399 1350832 1377013 1343868 1507413 1644412
18152 1644412 1798821 2030946 2191856 2309398 2313789 2416465 2541140 2839785 3140304 3361549
18142 3361549 3675191 4022785 4237830 4454114 4720802 4830856 5000273 5417102 5784213
18133 5784213 6040758 6297144 6620210 7083774 7487318 7809458 8299573 8782316 9320767
18124 9320767 9830011 10400674 11016408 11699325 12416486 13213973 14046743 15058533 16289109
18115 16289109 17748782 19412554 21409439 23780463 26638375 30647301 37570173 49575906
18107 49575906 66187423 80225779 91029999 108532679 136300579 157370116 150098164
18100 150098164 130209364 99323787 65270394 41446248 27613956 19669206 14761995
18093 14761995 11572111 9338370 7689100 6497282 5613963 4842684 4105118 3644184 3218369
18084 3218369 2841653 2567840 2458691 2378753 2165502 1916278 1721768 1601316 1522183 1360849
18074 1360849 1215468 1002998 958407 869133 877496 779228 688925 739279 783167 770175 769353
18063 769353 811479 834626 784477 643174 751495 942825 941811 951684 1048076 1283179 1372270
18052 1372270 1533710 1602299 1585013 1664824 1634118 1626843 1563194 1404453 1207296 1098921 1021018
18041 1021018 842329 626567 583002 551639 498429 546289 503750 354505 328776 391389 400676
18030 400676 324894 213645 157673 296841 337424 259956 236364 158760 253202 183448 204194
18019 204194 203642 265017 309122 338960 323284 267921 361099 381637 316762 205806 228809 323418
18007 323418 544608 530919 455137 495785 578495 569147 698363 827592 752640 708298 750977
17996 750977 758763 816410 915714 1153367 1427019 1521622 1539534 1693887 1716774 1791461 1952778
17985 1952778 2039452 2078092 2270532 2285973 2176634 2163363 2062611 1882012 1735062 1688433
17975 1688433 1522486 1330127 1157161 1144298 1096749 921546 667795 577562 567760 523942
17965 523942 364322 323659 556884 611472 505604 467060 427908 318357 394939 578485
17955 578485 561059 485045 450717 402368 504945 446287 438488 444073 624128 787460 883809
17944 883809 799513 806548 812488 774018 830453 905715 830880 854877 956675 917191 976657 1039998
17932 1039998 1039603 1010838 998628 1024756 983745 927600 832337 641320 585356 409586 398683
17921 398683 369179 279360 298702 227288 -8570 -78861 6754 12848 131172 162065 147873
17910 147873 72701 30284 143171 109903 210395 113069 66718 76630 54952 63836 119955
17899 119955 229685 191588 1775 -103192 53 125025 119543 224791 259465 98222
17889 98222 43975 116005 183032 230250 323144 378571 330020 237331 170147 317975 367718
17878 367718 241411 156979 209806 269972 237578 238477 202142 145368 2900 13245 75958
17867 75958 2392 -95256 -50195 75848 99266 -12928 110259 100678 3518 -94432 -161254
17856 -161254 -121931 6174 -46197 -104646 -26596 34006 40903 48425 66259 63262 123209 81251
17844 81251 44966 12478 -63111 -80894 -16460 89772 179536 154512 95099 -65067 -58144
17833 -58144 -29336 -18479 -11965 55959 129698 143062 70262 -17998 -3105 8069 20103 -24806
17821 -24806 61000 73983 105251 66539 12064 35755 -20949 -118346 -156187 -117074 -60223 -83391
17809 -83391 -46084 -90712 -74476 5894 -9405 -31421 -46974 -27141 -101 28343 -38689 -41215
17797 -41215 -130441 -115235 -121440 -137479 -56119 51798 67076 -44945 -156614 -291316 -322172
17786 -322172 -361067 -291471 -157888 -18213 11341 -140202 -214166 -102513 -50581 -64161 -33574
17775 -33574 -37112 -107213 -211983 -318924 -274730 -260454 -191814 -81161 -47132 -127994 -116838
17764 -116838 -45188 58914 13270 -86580 -172012 -34489 99944 49003 64577 158334 129748
17753 129748 96072 213044 194558 83079 44636 -80290 -177030 -230164 -264918 -224080 -178222
17742 -178222 -127612 -159052 -154329 -130447 -115273 -85336 9516 -17545 31995 38145 -65800 -9270
17730 -9270 -863 -32096 39610 85325 113597 40514 43910 16064 5916 -47922 24105 95196
17718 95196 170691 24284 3793 48461 -19907 -122671 -144909 -58018 -78071 -64785 -100880
17707 -100880 -86204 -3376 31395 15523 -29325 -111379 -137570 -50886 -12957 -110325 -172120
17696 -172120 -109976 6647 -46891 5826 141186 36386 -19536 52718 189624 187876 142013
17685 142013 23257 -96838 -44835 17710 81920 120547 122427 62875 -23789 -67616 -748
17674 -748 46822 -73613 -178996 -196307 -121311 -126994 -167689 -66040 -1191 51695 -23857 -48764
17662 -48764 -38291 -74520 -113326 57220 121024 88355 -77263 -125144 -155290 -26320 57657
17651 57657 -1402 -103047 -127230 -85584 -207314 -175706 19378 87513 43707 158 -13028
17640 -13028 -12348 -3223 -71129 -67484 7096 15874 -1657 38719 33722 -82845 -160186 -60366 17069
17627 17069 -111142 -177222 -184851 -139521 -43578 31777 60257 60563 31415 60085 49928 25713
17615 25713 126030 144760 35149 1333 -47420 1057 -51336 -196209 -108890 17521 10405
17604 10405 -63148 -112245 -43665 -43393 -36166 -20179 -18800 25933 35615 83245 140231 78684 -11154
17591 -11154 -37995 -82231 -172672 -87336 5120 -118821 -126228 -7111 -41973 -102664 -97010 -85993
17579 -85993 -147044 -119919 2283 88422 163497 82527 -2680 -71387 -53937 -14627 -4732 -32667
17567 -32667 90467 143743 -14886 -149997 -164762 -14352 88774 23976 -106965 -221823
17557 -221823 -196971 -180452 -163358 -8003 79139 32519 -28486 -86469 -120383 24417 79332
17546 79332 133880 154212 68250 63514 -1 -76032 -188878 -201855 -175523 -156587 -124369 -200446
17534 -200446 -323188 -250972 -238381 -180998 -53545 15899 69429 18834 -96467 -64468 -15669
17523 -15669 -97800 -115574 -10051 74178 16836 53366 -8890 -74150 7375 53529 -35452
17512 -35452 -21042 39038 81937 27596 -41815 -33875 -56709 -62976 23746 65297 -67388 -83182
17500 -83182 8865 -43442 45096 175220 143457 99881 186867 130838 61090 -22323 -51699
17489 -51699 6788 -1448 15504 116220 129302 176724 232021 269188 97621 -52670 -42989
17478 -42989 -50543 -74821 -122591 -84378 -75740 -107869 -107692 -125339 -67169 -11214 -40622 -120991
17466 -120991 -58126 -79893 -25687 64380 -3385 83862 196978 124264 8900 -99063 -136944
17455 -136944 -51120 -50102 -59358 -29300 -18757 -111751 -108787 -77751 -177316 -108808 39749 217540
17443 217540 257727 366678 385389 608964 801014 834843 801468 731799 658045 665653 594004
17432 594004 365883 224981 170679 180109 119399 -57482 -137761 -214442 -233194 -119769 66200
17421 66200 64899 28170 -12344 -1595 21775 86779 73667 125330 -41936 -67789 -65664 -152421
17409 -152421 -257134 -261990 -314066 -244091 -175967 -49374 25758 -51979 -193056 -288024 -135228
17398 -135228 2946 -99937 -94178 -49637 33466 30547 37290 44967 44423 -46171 -202332 -201935
17386 -201935 -125422 11853 -14207 -144193 -46942 -112532 -132118 49906 79244 86699 15617
17375 15617 -5284 -34337 8471 81260 26092 -36541 -11846 -28866 -37357 -28549 161968 275438
17363 275438 121681 56958 -18324 -26868 -101563 -95734 -23179 -69490 -77923 -25540 73359 95450
17351 95450 -48420 -217056 -269647 -208622 -93903 54930 43918 14819 62097 153329 103468
17340 103468 155401 169066 107517 101833 38839 -78654 -44166 16730 35991 64862 37221
17329 37221 38636 -3027 -77135 -98895 -118365 -82616 -14007 34063 67394 41256 -33893 -10014
17317 -10014 -69079 -208996 -210907 -118500 -470 106556 -12626 -37836 11400 -39402 15572
17306 15572 1578 -46663 -138021 -71922 -19837 -12362 -85979 -160980 -193670 -183174 -240000 -252349
17294 -252349 -187170 -205346 -162985 -100326 -107684 -160255 -110272 -76956 -132537 -67289 -17790 -91115
17282 -91115 -130430 -91399 -76772 -47836 -38662 -111896 -36131 151042 286917 310007 270178
17271 270178 99296 -103576 2326 42141 52696 -15674 -194875 -216648 -184647 -178205 -176272
17260 -176272 -153863 -169690 -23755 148576 229454 155035 -32829 -122662 -92171 21936 57564
17249 57564 93533 93147 63307 -97779 -82313 78486 105879 28957 -13374 -13574 -45496 -46103
17237 -46103 28558 80346 74361 9240 78880 50650 101607 150073 129566 142950 130410 150192
17225 150192 138191 53684 16505 -2031 -11949 -117839 -124151 -142281 -189885 -105439 -91686 25644
17213 25644 16515 133932 220459 210062 127503 41270 -90408 -44225 -37767 3823 -11928 -49915
17201 -49915 -39040 -14745 23212 172255 203673 118784 -47651 -35219 -105090 -129695 -176808
17190 -176808 -91992 -44164 -80770 -86140 -75301 -113850 -127471 -90907 -21296 3315 -15292 -16451
17178 -16451 150534 211808 134571 16705 -18760 5167 -119504 -76979 -121974 -219369 -224946
17167 -224946 -163301 -165249 -146545 -76493 -15908 -43173 -144654 -138299 -142902 -130572 -159347 -165758
17155 -165758 -126483 -29361 -32060 -1644 -106219 -127661 -77210 -130741 -122049 923 -24026
17144 -24026 -132757 -57328 41452 163864 139186 -1322 -13824 -97770 -33515 -101710 -262174
17133 -262174 -278135 -111742 -29698 16359 72467 55502 28037 20173 5202 -101027 -184027
17122 -184027 -237454 -124763 -39077 -63691 -113538 -162627 -128454 -62572 -21525 22216 -3135
17111 -3135 -4446 20821 -9483 -8465 -106930 -167873 -193551 -218972 -186806 -115477 -206003 -260885
17099 -260885 -85448 -7969 -63849 -26427 -58232 -165192 -38273 29080 -98870 -298669
17089 -298669 -328891 -215205 -236130 -293753 -224979 -130083 -121722 -203379 -164841 -150008 -143190 -47139
17077 -47139 32937 92440 114956 140141 138392 248174 222453 214013 72172 -6421 -7453 498
17065 498 -66871 69715 195142 166807 157191 39242 -57967 -128729 -212847 -236732 -32566
17054 -32566 6465 -79497 -48881 -57758 -62137 -176232 -177453 -102528 -33817 11122 1946 15633
17042 15633 -43711 -60135 -11186 34333 209613 206181 16038 -21199 14749 9172 -43170 -56295
17030 -56295 21253 126669 137111 -109788 -243086 -266935 60684 195148 -6956 -162876
17020 -162876 -188329 -180734 -155227 -123720 -98417 11652 136682 207841 42624 -55960 -64976
17009 -64976 -160981 -206412 -134730 107819 117212 60978 7006 -38813 49934 31329 -59601 3075
16997 3075 -138044 -96904 6850 4765 -55533 -121317 -27070 7067 -8782 -60698 -59675 -182474
16985 -182474 -136016 -87113 -11641 85184 60556 -38607 -26139 -89984 -94792 -125883 -62125 -24371
16973 -24371 -150731 -191653 -138806 -41504 145556 222812 226656 311402 273814 217263 130481
16962 130481 54264 -64635 -66344 18504 90934 36987 -9381 -60519 19312 2435 -40847
16951 -40847 -33861 40278 -15224 -70994 -58989 6766 86482 73522 -31361 -46024 -8606 -155284
16939 -155284 -190263 -128053 -238486 -205153 -123461 -21516 -9253 -4513 -91799 -130841 -148079
16928 -148079 -235339 -203389 -120621 -35446 44825 42269 -161029 -215343 -279556 -259141 -85636
16917 -85636 37855 66908 -53289 -31102 32177 30923 23981 54877 144872 113989 -27967
16906 -27967 -27488 67729 3113 38555 141399 137077 70503 62295 71546 76778 56855 54045 76
16893 76 23093 -725 -101019 -159367 -114693 -71343 -77354 -55752 -21818 -27128 -41208 11540
16881 11540 -83379 -99308 -18434 126785 50752 -64171 -96709 -50834 -39560 -155264 -161820
16870 -161820 -183799 -144287 -30542 -10251 -371 17159 40069 64743 93555 120681 180404
16859 180404 144183 -4442 -38286 -42622 71238 166268 149426 78766 31001 126600 202700
16848 202700 235730 178599 51274 39707 4548 -102502 23 39614 28083 -3681 33474
16837 33474 2199 5219 43514 78778 -20658 26296 100248 64002 24369 8256 33291 97493
16825 97493 121637 26209 -109952 -87868 -154531 -113321 -143739 -184307 -168441 -232050 -239291 -154812
16813 -154812 -3977 -20596 -109744 -7650 -13347 -69740 -141474 -159430 -85227 -118312 -225244
16802 -225244 -195929 -191911 -248189 -212650 -139063 -264112 -272136 -262185 -180828 -50 70758 2863
16790 2863 33883 16444 -20704 73629 64751 13685 -75931 -55249 89811 77552 -46179 -36153
16778 -36153 -94879 -52020 -86117 -186867 -161260 -95167 102006 168825 188218 151396 176955
16767 176955 6848 -76539 -104513 -2801 75099 -7075 -37944 5742 58118 128967 69044
16756 69044 -32257 14938 7002 -109226 -196860 -316275 -319583 -187689 -74947 -139690 -178986
16745 -178986 -38498 134579 152550 -8333 -68033 -69034 -125455 -194419 -144809 -149858 -161667
16734 -161667 -166543 -54979 53998 16157 -2506 25956 -62288 -57950 49311 -24547 -18103
16723 -18103 117961 98587 92536 122375 88157 56251 9126 -20486 -89062 -149683 -137819 -53524
16711 -53524 -8603 -59597 -177478 -126094 -18683 -70621 39592 35728 7310 -19539 -124418
16700 -124418 -53652 -18632 -54944 -106508 -87609 -68313 -70577 -111557 -121956 -222411 -306984
16689 -306984 -187027 -119490 -55431 6958 -36401 7835 -3826 -70725 -40624 117434 179581
16678 179581 243180 151897 2349 1045 -51092 -45801 104141 151507 175658 92962 5903
16667 5903 -122896 -111134 -19964 46008 19647 57026 -8938 -58052 79032 32652 -58257
16656 -58257 -121072 34205 59755 72808 92236 110713 201586 121976 124620 98026 43306 28595
16644 28595 39531 124751 133716 30793 12894 76105 77112 162246 58132 -3668 31914 50950
16632 50950 -34578 -36152 -69882 -171978 -199837 -199751 -178802 -199360 -218791 -49818 44922 -3751
16620 -3751 9229 31987 73825 30468 13557 29181 -124834 -283304 -246951 -259338 -321642
16609 -321642 -272123 -227155 -206766 -153431 -176080 -185651 -167745 -59032 -22667 -35405 -86105
16598 -86105 -204754 -204507 9980 97016 51012 -46756 33912 52229 -29148 -22071 -76855 -85723
16586 -85723 21493 -22595 10647 -29113 -222400 -215218 -183236 -169724 -74069 -60036 -79637
16575 -79637 32228 112933 188963 197577 135723 104421 1259 -18767 -74377 -4544 122307
16564 122307 68463 64187 70402 91915 136486 73861 49949 29234 29240 -5624 -72334 -113709 -46559
16551 -46559 84670 39199 40417 99840 212173 49620 -36376 7841 47653 100392 142396
16540 142396 168724 167407 68747 85878 9782 -119305 -139075 -173255 -93442 79437 73561
16529 73561 40069 -16466 -50392 49965 110093 155190 -4122 -64761 -3071 38467 71902
16518 71902 82344 47141 7146 -105064 -80236 99488 170564 205450 103732 -37693 -152329
16507 -152329 -180868 -173988 -225591 -191765 -144791 -97974 -191430 -304975 -280854 -134416 -81833
16496 -81833 -212333 -237386 -267289 -118582 -27748 118738 111254 83583 57378 1770 50753
16485 50753 252298 189001 78765 128408 171226 78026 -7030 42756 -13611 785 149144
16474 149144 188267 137535 109836 139327 113298 -42588 -124079 -67708 -66193 -72423 -122176 -119342
16462 -119342 -42157 40797 93852 23856 66866 56031 87101 59954 -1890 -57742 -85965
16451 -85965 -85800 20285 38440 32090 174619 82554 13 -80420 -150998 -186244 -113309 -10853
16439 -10853 60495 48446 8992 118853 186334 102138 16041 -437 -14453 54883 29375
16428 29375 27048 70539 79673 39633 24158 102254 148308 -9423 -125245 -211796 -254925 -199413
16416 -199413 -150015 -207849 -252978 -70726 -56414 -36988 46834 61085 7130 -61180 -33046
16405 -33046 27229 83209 162716 183853 219659 160133 179121 227877 152457 84860 22388 -24014
16393 -24014 34400 103921 83448 -15830 -20415 -7889 -29658 -122408 -174723 -35374 52383 62429
16381 62429 27088 100781 89178 -28791 -15611 17709 19494 23560 -8961 -145909 -127581 6668
16369 6668 6382 38096 178981 157852 8640 49161 50412 30527 105610 159550 209245 145834
16357 145834 71918 1765 -147029 -117115 -139600 -158337 -172588 -111434 -82145 -153363 -249951
16346 -249951 -282799 -281746 -215930 -140824 -168977 -94724 66278 9096 -82522 21610 -30586
16335 -30586 -48729 -64399 -231503 -259332 -220302 -243313 -220931 -186191 -124105 -122318 -96599 20047
16323 20047 104108 95526 34131 122603 3351 -16076 -33576 -61641 -81885 -16838 28976 76834
16311 76834 118018 118369 27272 -104245 -106648 -107957 -137591 -120352 -74893 -110395 -170346 -84817
16299 -84817 -25302 65678 124567 847 24522 -10666 -55064 -150407 -75409 -34210 -28299 -48508
16287 -48508 -142329 -298943 -316071 -154240 38601 147952 94931 52020 15812 -75947 -147200
16276 -147200 -195913 -248031 -209670 -128037 -132025 -98602 -74416 -62902 -116629 -98778 -154740 -171294
16264 -171294 -148152 -167956 -157116 -57504 25255 42 -143190 -292091 -369401 -212895 -235650
16253 -235650 -225980 -121235 -90415 12534 82032 151996 216669 350390 314479 249870 166411
16242 166411 51811 7593 71822 39406 -65460 -136882 -32507 -31709 -154658 -66204 57420
16231 57420 145026 157192 119224 -68444 -112265 18950 -3915 -42767 -106767 -68598 3552
16220 3552 -501 -2988 -19941 95764 164972 77282 150487 287448 274155 111663 -34107
16209 -34107 15447 25218 -168767 -75091 8493 34668 101879 106777 56283 -24910 -55955 -69921
16197 -69921 -45460 -44800 -85598 -118659 -133048 -170692 -82456 78130 47190 -3515 66937 66786
16185 66786 -20309 -83704 -100378 -115586 -159507 -34983 179590 169125 121898 126743 45114
16174 45114 -10022 104584 103752 64931 146293 163818 118519 -10674 -33340 25658 -28146 44412
16162 44412 81297 204375 163346 99196 9741 -20551 -32066 -48827 -1658 111647 94504
16151 94504 -172165 -218734 -218515 -230678 -245872 -301691 -314777 -265411 -192012 -56622 40632 5950
16139 5950 -30277 -70449 -62342 -153891 -191836 -184570 -145151 -43986 -61544 -52929 35420 -6388
16127 -6388 73877 143767 11271 -116069 -122634 -64859 -13467 85780 161049 196673 93639
16116 93639 30900 38888 59566 -6273 -143121 -142243 -42761 -137684 -159700 -221710 -176818 -82590
16104 -82590 -39443 32409 53324 47959 72556 -14731 5417 86762 103619 -27846 -98926 -51302
16092 -51302 26406 51865 -42810 -150530 -159585 -7575 9362 -109788 -145076 -102455 -27288
16081 -27288 -86106 -158339 -118116 -136794 -91792 -50563 -49024 -139209 -42936 -10854 -43934 -25701
16069 -25701 -126716 -122405 -63686 -7792 17454 109425 19353 -124800 -206089 -132153 -2624
16058 -2624 53454 92503 -60386 -278574 -199875 -103475 -23891 84738 183696 223175 213379
16047 213379 160605 11434 -26125 -92640 -121656 -61252 -68649 -68277 -76293 -66070 253 82753
16035 82753 6571 53344 82744 132348 88380 25729 60008 -1405 -36472 19877 139663
16024 139663 192571 97415 23072 26654 41233 97170 97229 104748 23428 -51293 -60366 36728 84002
16011 84002 74889 73503 33537 102804 184701 187885 100410 10330 -96473 -76859 -49209 -110449
15999 -110449 -251393 -236243 -285661 -271431 -242476 -148470 -86334 28760 36029 -53579 -135299
15988 -135299 -85950 -92795 -87673 -46031 -125563 -69743 118936 94121 140923 139769 133427 187751
15976 187751 37543 8153 -115246 -142163 -12097 58393 49908 10341 -83154 14584 148594
15965 148594 122619 30052 -90730 -92434 -91207 -67425 -30119 -40543 16587 112275 57516 -51997
15953 -51997 -104471 -119462 -220617 -242169 -129506 -11577 59185 115741 168232 188493 137231
15942 137231 125772 149642 154073 114727 58605 58883 90490 131680 55254 -42637 -22945 12046
15930 12046 64901 123020 110559 148780 141780 106916 28787 -46704 -80812 -59043 45379 49393
15918 49393 32975 125328 31376 -63392 16911 36602 -3288 -110008 -41476 110530 193169
15907 193169 156114 -14314 -87801 -27712 10191 25877 -44740 -57426 -63052 -92980 -102083 -94916
15895 -94916 -20694 -60444 -143752 -18489 44542 46836 7652 -44872 -106343 -94791 -63793 -58392
15883 -58392 80101 192394 133776 58744 70833 141633 84744 38224 -60912 -13675 62630
15872 62630 58460 174119 245384 63575 -51031 -36098 -13556 -24135 -65370 -11078 -26395
15861 -26395 41668 67073 7144 127223 8312 -30347 -8174 -49460 -151984 -268061 -258490
15850 -258490 -220654 -116452 -88797 -200415 -212865 -265858 -244248 -158075 -130764 -165196 -287459
15839 -287459 -102644 -39450 -71556 -55576 136113 205343 48316 43946 37409 49285 94162
15828 94162 28350 -47797 38248 134423 142371 101102 77588 46313 -33833 -17378 127499 141888
15816 141888 15645 -94325 -107550 -28954 -16357 75364 122230 109554 91924 -24144 27065
15805 27065 41874 128096 85472 69681 185790 75380 16590 18150 -21621 -93365 -124337
15794 -124337 -119784 10557 50273 -30890 -33641 48070 72662 16569 -38618 -56978 -55768 -18603
15782 -18603 -28765 -19871 -58781 30145 141711 164185 47446 -10021 -70920 -61302 -56394 -145537
15770 -145537 -245906 -161947 -35672 -26058 -116784 -137745 -15536 10815 -21679 45806 130546
15759 130546 206181 179785 227584 212638 226519 155482 148014 86709 -29802 45020 80397
15748 80397 70225 33315 -2951 34520 69459 37186 30103 24033 43166 45881 33384 56901
15736 56901 -17729 21080 51064 -17989 -69054 -183347 -257287 -200746 -109145 -35396 -23335
15725 -23335 -12931 -71469 -3196 70312 -12374 -41286 -181985 -151755 -65717 -36718 -73101
15714 -73101 -102951 -173375 -115931 -181048 -56434 -109649 -254078 -122247 30896 30182 -26718
15703 -26718 -53180 -18580 15947 -20769 -22669 71972 68171 -2051 -21056 -2926 40510 -7238
15691 -7238 -7617 42567 49904 25961 -9748 -46567 -40340 70565 161055 161938 170011 126580 54860
15678 54860 49977 14906 51095 -37112 -30374 -50809 -42886 5217 -56512 -84514 -98495 -31519
15666 -31519 -23226 32653 7070 -29546 8155 83876 58607 -85661 -476 74838 98755 25328
15654 25328 -33287 -97708 -58721 -38007 -60769 -82290 -71460 -87027 -137656 -130204 61013 224266
15642 224266 390310 305887 105363 56978 19569 -116612 -119195 -39888 -32862 -65699 -5420
15631 -5420 -21116 43798 177847 111974 -42146 52010 219963 283236 282926 200091 119361 84360
15619 84360 63807 -30184 -89121 -95269 -68412 -38012 47217 203296 238665 202292 126516 -42449
15607 -42449 -91726 -98647 -233724 -136089 -31563 44638 173330 192134 6818 -161527 -242622
15596 -242622 -228889 -161225 -134271 -49093 -38158 -64369 -117116 -61197 -43800 -113327 -116549 -130067
15584 -130067 -171443 -90367 57007 126422 129425 197075 158828 40213 6905 -77760 -169418
15573 -169418 -143660 -64675 41795 -1710 -207102 -238570 -180741 -133062 -68178 -53287 4328
15562 4328 110299 220592 139454 46825 -34702 -48127 30231 110953 154830 54021 -10889
15551 -10889 39007 4676 -51020 -57398 17541 30872 9297 -1909 -130766 -143619 -116925 -102740
15539 -102740 -75462 -60323 -107496 -149376 -207387 -143564 -52802 -27449 -13573 2034 -56976
15528 -56976 -105071 -118476 -143933 -93445 2437 16492 -38791 19203 -2083 -42804 74499
15517 74499 131001 187699 43697 79016 20503 12942 -17003 -148002 -231248 -258767 -147474
15506 -147474 -130257 -144014 -196711 -196579 -173064 -107692 -120583 -112678 -84026 35707 133560 78826
15494 78826 75112 132079 78876 39024 90876 90437 -15996 -81820 25356 -25498 -113118 -113134
15482 -113134 574 -62850 -94068 -155429 -179255 -130327 -101138 -21104 40462 -37867 -42657
15471 -42657 88584 180316 287977 246026 103496 -38784 -88958 -22560 25874 64733 75294
15460 75294 68433 -70367 -137976 -109359 -115774 -93764 87422 209393 128938 139106 100982
15449 100982 -45998 -111252 -125398 -89433 4652 70191 47237 56495 -1641 -12978 -146308
15438 -146308 -242184 -121656 -43995 33420 87248 -67034 -107279 -80779 -86959 -64534 41666
15427 41666 87213 174280 80175 7129 -14378 -67861 -48042 20148 121812 65383 -21061
15416 -21061 -17880 12901 881 118626 162834 211411 154042 -19699 -126440 -196682 -118853
15405 -118853 -51043 -57375 -27026 29680 14552 112486 108362 -87767 -169520 -179777 -142748 -140717
15393 -140717 -48120 52521 100005 -9579 -135928 -117803 -40189 1836 -55971 -105487 -122279
15382 -122279 -95500 -121584 -199020 -200220 -79994 -37381 -122939 -74831 -103862 -87197 -83940 -83437
15370 -83437 14972 60554 -38069 -143293 -126139 -19150 16334 -34426 -50445 65319 224221
15359 224221 81221 -82219 -98403 -61495 -114503 -187816 -199722 -150598 -160891 -206358 -225028
15348 -225028 -202164 -184353 -78857 -62957 -55754 -73597 -65014 -82585 -8918 97836 145848
15337 145848 191748 137639 84235 69603 -17616 -68342 -45291 99696 43750 88331 147828
15326 147828 33410 -1655 5918 15724 -53633 -26054 75777 87425 62141 -59314 -249927
15315 -249927 -332126 -197442 -133638 -144994 -135878 -117983 -96195 -49927 -19821 33087 -32981
15304 -32981 -65039 -103256 -51074 -16045 -43289 -99239 20592 114527 -20327 -42613 16624
15293 16624 33684 47921 20723 -3632 -25270 -6479 -99570 -97494 -71398 -39221 69989 177386
15281 177386 99254 41174 162102 303576 271555 165102 137202 167272 175067 52044 -62849
15270 -62849 -178273 -185094 -287494 -285413 -280739 -195111 -82126 -111375 -21133 14449 11382 -88123
15258 -88123 -166688 -99572 -35149 67318 233278 171568 69082 101908 69486 13286 -67497
15247 -67497 -51924 9720 -100393 -66857 13603 -116064 -179770 -149035 -107027 -82649 -58483
15236 -58483 -155167 -93509 -32522 12676 37578 32680 86681 152870 87484 92214 117122 63745
15224 63745 -47728 -73410 -163097 -186440 -275910 -174385 -158459 -304698 -153023 5205 -37174
15213 -37174 -21619 -106757 -90098 -48174 -22431 31808 70049 119499 61395 76522 121822 99027
15201 99027 -26243 -99341 -212030 -55534 -17112 -139384 -29088 -59325 -67117 -19964 159137
15190 159137 160157 129031 107035 135969 227592 289642 292924 128101 37180 46158 67772 105031
15178 105031 135355 43091 40009 37273 35637 118579 92914 189838 75162 1762 93596 89149
15166 89149 43431 -56621 -38691 79268 44532 -125290 -145688 -54464 -13159 722 154962
15155 154962 125909 45782 -10973 20791 -65248 -92491 -152336 -194217 -61131 138 21278
15144 21278 57130 162908 148454 108434 43206 -3323 14362 53101 63306 37600 88802
15133 88802 158875 157205 86339 34680 44983 57936 76258 135847 57576 21794 11306 11561
15121 11561 -15901 19473 32391 3276 -32567 -39732 -14261 46446 96065 -11048 50167 159008
15109 159008 157613 92252 16398 -61280 -144838 -185324 -79732 122402 171125 103027 87681
15098 87681 -32663 -13210 62488 125919 93820 97389 127924 145774 153142 163743 112639 113526
15086 113526 68460 336 -61930 -67950 -12843 42629 -19857 -72433 -14576 40081 15555 -107215
15074 -107215 -211548 -181320 -91878 -22082 -55962 -148650 -122768 43784 21775 -149083 -238605
15063 -238605 -230579 -250326 -238829 -89043 85600 154043 65268 121192 175139 -37595 -85231
15052 -85231 -80300 20229 78345 25236 -94084 -183095 -238543 -155899 -96484 -99789 -13346 -31319
15040 -31319 -12101 -1685 -75291 -77410 -14667 25071 143279 120964 59777 -111921 -120505 54180
15028 54180 38051 -15614 18693 -26359 -24323 -33487 19393 44401 129984 90291 -40316 -21502
15016 -21502 -95056 -141555 -99606 -82030 -96359 -90930 -48041 -71830 -133527 -124428 13182 2080
15004 2080 122255 76397 6752 93146 107761 112411 179848 136368 114066 191965 130844 101897
14992 101897 -57027 -97237 -2925 27470 1692 -120141 -85678 -97001 -109701 -129839 -168754
14981 -168754 -162594 -45038 141772 62317 -61044 -40578 -36407 46974 151492 111333 -28161
14970 -28161 -115303 -132660 -76053 -111835 -172933 -101883 -2225 20469 20506 139040 239844 261262
14958 261262 233586 159175 104695 98236 201892 270311 333652 347730 286338 139662 96338
14947 96338 55212 77751 -23783 -122282 -142677 -32376 43127 -61932 -79022 -16130 -133109
14936 -133109 -133341 1241 7329 17584 25263 -74317 -38059 36032 70678 19338 -27971 -86537
14924 -86537 -76890 -27281 -89697 -55814 62412 68354 15885 -104750 -150045 -276506 -275107 -176985
14912 -176985 -86164 -31953 -5881 1700 12671 -61332 -34352 58172 49292 74049 30892 -49113
14900 -49113 -23684 -67104 -139460 -138760 -174911 -224965 -213072 -126402 -67757 -140281 -256307 -145102
14888 -145102 -54864 -69484 -136602 -63986 -70592 -5891 118814 118914 99095 91419 7946 -39392
14876 -39392 -132508 -73585 -69467 -172007 -112032 -120230 -130549 -74664 -70774 -59038 -4986 8868
14864 8868 83121 106393 56858 48617 -36536 -67831 44527 70745 134042 174019 138058 29410
14852 29410 29886 77002 -4423 11465 -43853 -56586 4966 87367 53384 22594 94006 35937
14840 35937 20161 6254 -24293 39895 116247 118266 3089 30104 -106314 -93398 25187
14829 25187 -24230 -52283 -86743 -53622 -157925 -158298 -113475 -97605 -82354 42941 -64116
14818 -64116 -85764 19383 40038 25634 -74136 -73096 10197 23866 -28565 -38559 -31147 -6270
14806 -6270 -93940 -125250 -29181 11082 1036 -56621 -59602 103982 17145 -35774 -89900 -151720
14794 -151720 -194717 -202737 -166377 -77907 27870 -22856 18012 114508 143529 69552 -49431
14783 -49431 -140767 -161709 -86355 -9212 111890 6791 -52200 62002 56934 -31423 94188
14772 94188 217905 174610 92945 144982 175704 114542 83615 -51112 -149830 -161601 -241662
14761 -241662 -219356 -124382 19967 53515 -42330 -216665 -99146 27237 90432 60750 -79409
14750 -79409 -180555 -219663 -186049 -90327 51397 -14252 -38728 -5485 96906 37777 19016
14739 19016 -84261 -160076 -121721 -91014 -35613 -41008 -65956 -205038 -248788 -118945 -32404
14728 -32404 -20400 -17471 12281 70650 131188 145046 107759 33824 -66054 -171239 -276839
14717 -276839 -251184 -132771 3898 142217 274606 243311 88704 -149343 -209910 -121218
14707 -121218 -175685 -192805 -173234 -114708 -38346 -45125 47141 33536 -75756 -163895 -204752
14696 -204752 -140169 -80070 -19181 -25851 22224 105158 58775 -68644 -162191 -166370 -69880 -83699
14684 -83699 -113073 -80979 -61991 -91315 -20063 64466 125385 125322 34776 -6938 95783 91680
14672 91680 74387 139041 13167 -990 24501 66584 119911 127461 181613 84333 8033 62021
14660 62021 94010 24881 80886 49252 -11875 -12330 29753 176065 150075 10527 -92208
14649 -92208 -188632 -231094 -357547 -333019 -177345 -84958 -1679 -94551 -211139 -229030 -155086
14638 -155086 -179773 -104239 -185954 -256997 -63718 -79518 -198768 -276767 -161749 -19847 55592
14627 55592 23216 4607 26881 50238 11345 11685 77416 43026 67238 65541 -99875 -30128
14615 -30128 -39260 -6868 5264 117148 106147 52231 21339 101377 21417 -114574 -155118
14604 -155118 -103271 25473 34663 53664 166959 215505 154998 69195 -49336 -41109 -48646
14593 -48646 -66571 -79260 -147463 -146159 -106361 -116025 -76407 8759 20765 26735 -21885 7036
14581 7036 -55836 -101984 9056 95885 104108 63724 40807 42966 -60951 -30647 -70180 7217
14569 7217 75948 104616 80858 5139 -109945 -110933 50224 50391 33676 66414 76717 94420
14557 94420 -33309 -60818 -35858 -42641 61581 134162 58759 -575 -62563 -63566 -97453 -22673
14545 -22673 -84693 -135224 -126881 -121009 -178930 -223153 -160090 -155479 -177946 -45953 49461 35232
14533 35232 93559 91689 95627 120267 140377 95285 10540 102398 226517 152445 104040 161321
14521 161321 181803 81346 -37024 -29788 -67203 -109901 -135294 -58634 -25574 7231 47976
14510 47976 -13720 -120267 -176602 -187643 -112939 -86726 -11092 158531 242837 226649 162842
14499 162842 160971 116901 -64951 -179738 -150158 -81602 -73311 -23389 27059 53529 -18790
14488 -18790 -124989 -153294 -123903 -28143 53599 92285 227819 195987 113234 -46091 -168615
14477 -168615 -204241 -138511 -92441 62632 46735 -25937 -90994 -132830 -122621 -61977 -13327
14466 -13327 -123248 -57680 33461 -40899 -62868 23541 96426 -80578 -73466 153516 247965
14455 247965 226993 211950 154447 114855 99563 126579 147853 136885 164306 85215 86148 133313
14443 133313 62687 -12492 -57063 -49374 13033 26753 -32693 -184877 -189875 -125246 -228147
14432 -228147 -287950 -117610 -59726 42617 220221 227406 101347 -22386 -14818 -89274 -204839
14421 -204839 -220259 -105282 49436 42942 -62327 -99876 611 19348 -6072 -5598 105800
14410 105800 99738 1744 24659 12151 76171 388 28258 146084 240402 210267 -46611
14399 -46611 -259030 -133784 -109790 -107857 54514 181620 217867 167948 111127 108132 135883
14388 135883 125540 84231 64366 99721 119711 95250 74798 47650 18371 14875 41828 51252
14376 51252 88605 15865 -33332 -4889 -103059 -79725 -13992 -36410 -60330 -35808 101290
14365 101290 263761 286287 287690 242721 139050 126290 224923 319469 398558 310992 202699
14354 202699 52363 -22803 -114648 -43852 2782 -56219 -236906 -254469 -222160 -128813 -30760
14343 -30760 97483 83473 4631 -84319 -64099 8842 37816 -91637 -148308 -180273 -72185
14332 -72185 21814 52035 191667 304069 250888 233919 91398 -35653 -12337 -5791 44006
14321 44006 -3959 -61422 -72578 -36295 3684 -61388 -76771 131943 251250 229431 144672
14310 144672 86986 55654 43575 -73166 -119086 -95358 -59044 -97169 -160446 -90079 -130847
14299 -130847 -133213 -168487 -167055 -94031 -41590 -39413 -22994 27832 -53757 -29655 33826 61301
14287 61301 -20118 -78859 -161801 -176045 -78166 -95939 -98863 2718 5199 -115009 -83712 -50853
14275 -50853 -103190 -107005 -88064 17428 51993 29702 41725 -14659 -97736 -47931 -64123 17406
14263 17406 41181 -76192 -107557 -87360 76116 92671 -8270 -97641 -69735 -119297 -18763
14252 -18763 66597 188703 200695 203648 185139 124165 42432 -33321 -26554 4453 80088 118849
14240 118849 159733 137472 142086 5045 -8454 -89234 -46074 -134806 -147639 7963 -21449
14229 -21449 -70535 -22993 18110 -11160 -76135 -90959 -46796 -81428 -89841 -113810 -122582 -60221
14217 -60221 41451 106386 131885 127791 38194 100041 167129 127629 40545 -9974 -82864 -139404
14205 -139404 -97244 34370 6415 18935 23381 -41773 2944 23769 125746 139793 168764
14194 168764 174606 179947 197112 267586 168364 78004 -6194 51649 40607 -8182 -41046 -163886
14182 -163886 -58863 -4958 25142 -96961 -75821 25266 -92245 -108687 7407 53529
14172 53529 96742 61429 69075 178598 225144 85552 -82267 45275 124224 122306 108654
14161 108654 86094 66611 -60907 -162914 -95476 27416 170815 128222 106745 39755 33644
14150 33644 83503 25475 -1139 -54306 -130088 -24235 -64261 -47855 -103614 -156596 -98470
14139 -98470 -118888 -76316 6478 12078 -30981 -96522 -151474 -78887 -28254 32854 -4803 -55870
14127 -55870 -100345 -57812 -89042 -146254 -81493 3320 -61216 -121674 -215061 -235962 -162432 -59798
14115 -59798 46214 71026 60711 79278 155122 180186 176430 178866 11383 -155563 -26094
14104 -26094 -64896 -51339 -36875 28668 19737 -265 17384 -59805 13506 59461 -108145 -54210
14092 -54210 -104852 -149392 -52648 -32345 61470 56592 28019 164999 150072 124285 42328 -38430
14080 -38430 56309 155662 167480 154926 127435 130481 142781 34569 -42115 -13929 107780
14069 107780 63967 94195 84979 98313 94188 117899 40751 -51205 62962 -21260 -12579 135316
14057 135316 122647 119553 112067 185300 107120 3887 -18885 -61370 -95952 -72012 -70408 -63791
14045 -63791 -29931 -36553 -89325 -19708 94091 26743 -5364 -43652 -5172 -14820 21204 -28302
14033 -28302 25512 43546 93137 56234 34745 126031 126193 128480 128195 94172 7195 -53117 32029
14020 32029 -39984 -92312 -40075 40883 110441 58755 85730 133041 154617 195193 56476
14009 56476 43050 165930 204377 227240 193921 164154 95843 -46961 -97808 -58711 14951
13998 14951 -162307 -149879 -110122 -57126 -97807 -122399 -82106 17344 23370 2840 155497
13987 155497 74154 -43625 -55906 -93676 27849 -27047 -123930 -195845 -94397 -30566 5452
13976 5452 -8279 52182 21950 19667 -30559 -3432 7908 11108 124101 110671 -62056 -13232
13964 -13232 -10584 69778 96288 9200 15182 -39283 15927 -8211 25296 -69062 -133122 -196138
13952 -196138 -60406 -10679 -15657 -62638 -67235 -94109 -145052 -101013 -76642 -37864 -115955 -107914
13940 -107914 51762 -22606 -117009 -180742 -196183 -62755 -58105 -37833 3514 -70160 -62858
13929 -62858 -13559 27911 22706 1743 13826 -6822 158642 122764 199981 286725 234380 155200
13917 155200 138950 586 58779 94369 57978 -9053 -115923 -123429 -94162 -25761 17376
13906 17376 -46453 -98387 20324 12467 -54262 -153697 -103312 -156313 -95484 -58992 -74925 -73792
13894 -73792 -37293 61788 228087 274989 215175 206992 209628 201985 177252 39880 80622 68426
13882 68426 66846 107960 168622 206900 173994 130169 52248 -27351 65824 147440 74184 178964
13870 178964 197494 91509 93347 114099 114219 23113 23614 41692 -69709 -78952 34249 65697
13858 65697 100111 44524 -2161 5105 -66307 -165832 -137844 -139766 -131988 18686 113996 28029
13846 28029 25019 -22811 -29028 -40319 -52384 -42504 82214 215966 199773 128588 128959 155202
13834 155202 73250 45011 1961 -51568 -87712 -204 43478 57012 81296 99981 48536
13823 48536 -99455 -121106 -71500 84460 222742 286694 236972 73314 -48605 -50538 -36314
13812 -36314 9206 37175 52453 104789 -33804 -116174 40720 153184 81057 -29897 -28485
13801 -28485 48715 101174 -2834 33758 63723 36132 -3405 54898 12943 72937 106338
13790 106338 34901 56503 53733 27713 56899 135918 52207 51164 82934 101601 157960 22451
13778 22451 4627 86833 -47425 -120085 -34541 -6133 74722 62898 46311 84451 114548
13767 114548 45603 -58923 -15236 14802 126654 130722 63696 48625 8451 19529 -23051
13756 -23051 -106778 -74944 -65277 12788 128266 132766 51450 -63965 16104 -83656 -58335 -80915
13744 -80915 -125006 -178350 -88499 -174090 -158971 -101415 -25093 22681 65753 25743 -94878
13733 -94878 -34345 -70773 -146894 -114505 89564 85070 7446 1791 -100727 -180394 -125874 -119126
13721 -119126 -26661 42097 17534 -21718 -46416 -83971 -109142 -267358 -262686 -91050 64549
13710 64549 145864 2573 -103935 -10165 27715 -4144 134805 131935 208328 319182 168215
13699 168215 152168 323157 292557 215869 264352 174593 48073 -35161 -65958 -3785 -65478
13688 -65478 32102 -10663 -96557 -87302 -90278 -7157 -55332 -72733 76497 144081 -8552 -78364
13676 -78364 -86993 -138252 -2629 19930 4348 -25646 8541 -79513 -147057 -31982 77441
13665 77441 72167 -14480 40631 18932 18730 -60513 -10861 -3759 31617 116040 -9668 -52374
13653 -52374 -62988 78694 156644 65179 -36075 -53978 -75332 -45262 14314 -114083 -200264
13642 -200264 -171363 -22829 31294 48643 42426 -52900 -109546 -161441 -153949 -68014 46883
13631 46883 238082 182019 123849 198486 61213 -34582 -1775 -61482 -116615 -44352 -15727
13620 -15727 139148 224561 115832 79148 120476 106679 131846 191275 202161 232082 253215
13609 253215 134876 -7355 15095 -90749 -206190 -182918 -54856 6856 -48349 -69688
13599 -69688 -35282 -95145 -78760 23528 49754 -12175 998 112286 23988 10637 -96744
13588 -96744 -77478 -90351 -69103 -10101 -118005 -93562 -36483 -4896 107696 8943 -124618
13577 -124618 -133111 -93768 130017 129822 31281 78418 17135 -24235 -50424 -88251 -77557 -95236
13565 -95236 -88478 -152945 -204812 -92584 100809 137379 92106 154312 148484 216874 301394 170117
13553 170117 121230 210757 162950 86809 93273 158169 99069 121517 72919 119029 228474
13542 228474 205327 151651 102892 172231 56234 -60345 -47636 -124761 -136794 -170905 -160229
13531 -160229 -142551 -164252 -54731 39526 -2567 19743 46737 -33716 -14536 7850 66447
13520 66447 214857 218314 123720 75134 17308 -43547 -147458 -74392 46587 70727 72834
13509 72834 51034 17559 18652 70707 76352 22244 -156 10970 24357 -73691 -81425 20638
13497 20638 -15909 -95624 -83630 20422 71292 684 -136553 -241823 -312330 -273443 -203435
13486 -203435 -146817 17360 97494 104040 78490 111319 45419 45780 38757 -25974 61897 48847
13474 48847 112876 35990 13960 25492 124136 170795 149358 124945 216207 176641 36541
13463 36541 -43222 -92862 -153486 -74568 -27685 49801 84866 65313 130036 -43937 -102380
13452 -102380 -62952 12634 43645 -2083 -174102 -250941 -172532 -105985 -189439 -146163 -100969
13441 -100969 -51886 41777 -57714 -183407 -166314 -62440 -74245 -35212 -46732 -113336 -121425
13430 -121425 -108148 -152149 -198443 -177256 -157062 -121412 -158167 -179166 -204958 -123517 -101518
13419 -101518 -78765 -33721 -54904 -114888 -135624 -115976 -69258 -94475 -13736 -19121 -7726 63836
13407 63836 73303 19417 101543 99091 160063 176516 148261 71945 -47963 -61130 -59586 -117811
13395 -117811 -59990 -72783 -221098 -117450 -96105 6486 85259 152954 218095 117230 -23045
13384 -23045 -113635 -223648 -101630 -22496 23434 -6697 -92991 -96092 -126808 -162146 -193091
13373 -193091 -90561 -65013 -112632 -48450 -117542 -48511 1365 2021 859 52982 78755 32031
13361 32031 -30279 -75421 -75661 -136876 -131563 -135659 -137175 -37460 99086 40499 83215 112837
13349 112837 34375 -102907 -114822 -37464 -64128 -66221 33757 75907 1997 33157 106723
13338 106723 167175 101969 126266 54444 -47007 31438 151737 185131 119203 117920 160437
13327 160437 6520 10061 60073 64181 2530 -99721 -144781 -112432 -94056 -56064 -29604
13316 -29604 -88103 -125448 -76878 38248 -2482 -85621 -50313 -23081 -3778 6247 -86911
13305 -86911 -63031 68259 127444 -20369 -104329 2334 -80276 -32 65899 58849 60285
13294 60285 18728 153850 163871 -29788 -61861 -19392 157429 193829 224112 112431 12198
13283 12198 5671 18634 11388 -76728 -94538 9988 -19895 28095 136151 121467 118785 39259
13271 39259 -28776 -73735 -92060 -7044 33818 79285 103355 151469 149676 153587 148939 156983
13259 156983 42149 42198 8468 -90847 -86153 13935 77743 64780 31283 22036 -6299 -23539
13247 -23539 30319 41158 2817 -72750 -67598 55780 66669 -3883 -21270 -35931 574 39728
13235 39728 143210 130014 11616 -23713 65029 -116213 -162139 -170563 -174415 -185171 -171369
13224 -171369 -184006 -132373 -2682 27406 -4349 6893 618 90004 88099 68344 -48832
13213 -48832 -58626 -6863 -19634 -31736 -135289 -178345 -143571 -140118 -104218 -89487 -149589 -155673
13201 -155673 -186522 -231388 -100327 28126 11325 91340 136621 129243 86024 65017 189850
13190 189850 275833 209402 76278 -28605 -131621 -32554 -10043 32405 95629 126413 87695
13179 87695 50298 2355 33587 -12002 -55592 -32562 50053 191943 140323 -77649 -88921
13168 -88921 -37577 245 -75002 -108571 -119045 -22220 -24462 24468 -29527 -153525 -100698 -43004
13156 -43004 -64188 -67950 4817 96436 70881 -3760 -13451 42643 87441 71805 149617 79525
13144 79525 22134 11556 101340 116723 99715 209628 164082 121578 124601 149265 -24506
13133 -24506 -34307 73468 84639 100043 -128912 -282264 -122214 58088 98523 21153 -23941
13122 -23941 5880 38543 -14653 -25371 -84783 -154167 -184884 -62708 12156 32067 153446
13111 153446 207814 126180 74095 -358 -86742 -99652 -140221 -90281 -94364 -135191 -2356
13100 -2356 228877 223202 158583 210635 189385 117424 110483 101362 -7630 32119 69680 105640
13088 105640 125458 87537 71441 137165 135814 129656 88695 110918 -7875 -25862 -18425 84202
13076 84202 61349 66571 97496 115629 154844 106193 -92776 -193379 -63434 22843 -1837
13065 -1837 -92574 -311658 -242074 -58804 13931 -27469 -59102 55060 12043 76518 117202
13054 117202 29944 60538 41843 85567 277263 256535 186440 59241 9285 27590 64516
13043 64516 182261 150352 172866 197820 144954 136991 55098 -51052 -7505 23506 70949
13032 70949 59333 4441 -55660 -66059 -17203 119383 134989 95065 137834 101727 65711
13021 65711 72915 167708 128019 3988 -33158 -70955 -158905 -115372 -32402 20711 57492 48387
13009 48387 -4244 45728 86176 137492 112856 100603 -12877 -36714 -67968 23373 51951
12998 51951 97874 120955 17875 49908 57923 195461 298190 264941 274952 221187 171151
12987 171151 212110 233660 119539 13194 -15129 -73707 -66054 17981 148884 190693 193098
12976 193098 200996 186608 99423 83256 138199 91110 -4256 -35247 -9550 -73261 -120195 -202834
12964 -202834 -218504 -200751 -144710 -185777 -194825 -123028 -43204 -8950 -13759 148270 55260 -100423
12952 -100423 -134226 -40916 -46808 -20632 -36541 1765 -2302 4609 73907 -159 35302 29185
12940 29185 13905 39064 -48787 -148682 -18601 91946 109771 106760 109430 -8047 -32585
12929 -32585 -133561 -119501 -58768 -25363 -31865 -49486 -113500 -81687 -919 19949 -34600 -13903
12917 -13903 -34980 5906 21234 -17109 -101875 -209312 -209279 -270075 -220281 -102575 -150974 -169038
12905 -169038 -120910 -104397 -61913 -16869 19702 56861 51262 47780 44750 -32467 -73885 -86408
12893 -86408 -99821 -95579 -85344 33702 27752 -63568 -57801 -47462 -78084 19820 155264 227592
12881 227592 102905 -45810 -166172 -130832 -77288 24251 71191 47446 -74280 -43080
12871 -43080 48455 -37397 -86284 -128960 -14020 165570 144170 182211 174400 82195 2661
12860 2661 -53918 -1678 34907 -27496 -115067 -128449 -93956 -49787 29093 114283 131404 62864
12848 62864 -1128 42872 39535 -7627 4284 -10933 -14850 -19129 -90176 -129530 8354 128606
12836 128606 78426 126005 103353 80025 -12056 -75213 31825 86309 78 29766 154873
12825 154873 7338 -19151 -1283 1247 51862 186277 53185 120561 183052 113126 10474
12814 10474 -8781 -39397 -167918 -229363 -214818 -118608 46998 141893 131344 133202 5505
12803 5505 -124296 -195655 -100483 7232 -1753 93624 95069 113916 -27209 -28245 15951 -30363
12791 -30363 -40497 37629 64007 46707 51971 49457 -2578 80016 3374 -46654 -62786 -92075
12779 -92075 -237491 -191147 -174236 -162506 -13303 -3653 70247 181503 153839 -4258 -36784
12768 -36784 40682 92347 128480 41388 -178962 -135752 -12370 16274 74546 73741 104947 131719
12756 131719 87017 101448 165944 137769 48362 88211 -41552 -93917 1905 -382 -130781
12745 -130781 44938 140317 89470 147090 137477 204504 155841 -53434 -72038 -82529 -41713
12734 -41713 -52942 52990 61071 -46465 -117418 -73191 -115072 -136885 -70485 34787 16379
12723 16379 63041 90850 78218 -116957 -148218 11270 68030 111859 178171 127432 43260
12712 43260 -22908 -9812 -15682 -90049 -75766 -7560 -13240 -85750 -45176 -91554 -16700 1421
12700 1421 -78176 3252 73595 -29477 -100211 -133073 -213119 -113778 -141104 -229597 -38551
12689 -38551 -99355 -198497 -308679 -255222 -173232 -38627 -12267 6275 -28679 25874 -35045
12678 -35045 7131 76949 102252 160680 43512 116437 237378 205462 217051 161867 -43204
12667 -43204 -75223 -99766 -104308 -170300 -167798 -293796 -359908 -301178 -151995 -128564 -185047 -137415
12655 -137415 -159861 -92722 -147802 -91492 71916 119391 -32967 -231374 -247180 -149273 -151993
12644 -151993 -170359 -170746 -114167 -30738 -95304 -195137 -116678 -76881 -113630 -179676 -97926 -164041
12632 -164041 -199112 -208295 -55133 45446 68610 -18912 61719 89284 86520 -14236 -75318
12621 -75318 -79986 -128125 -29366 31104 23644 100931 155389 194132 230520 177104 26335 -28937
12609 -28937 -39379 -42903 -138029 -137166 35547 91742 108282 12153 -194696 -272476 -182138 -223668
12597 -223668 -210542 -225067 -229715 -229964 -145385 -110287 -130505 -20592 99555 149214 139253 164203
12585 164203 46183 -23551 -114203 -180201 -100222 -137392 -139316 -92057 -163157 -111204 -119054 -12907
12573 -12907 64638 99752 103668 98058 78995 -6882 37299 30716 -75866 -73150 -95433 -171507
12561 -171507 -194755 -143219 -151097 -116270 -168180 -198733 -113109 15779 61411 -20316 -138784
12550 -138784 -144350 -106197 -76460 44097 48700 103047 -2717 -98403 -30970 38256 66329
12539 66329 31654 96033 1543 -25958 -84320 -42377 151009 169899 254408 234007 92664
12528 92664 21772 54310 -76299 -202935 -236984 -60871 43594 168679 23643 -45450
12518 -45450 -42458 -33418 -49134 -2301 23241 -88553 -136703 -39692 -43670 -69079 -64776 -70239
12506 -70239 -106298 -148259 -171371 -237944 -168204 -79613 -123150 -94566 61832 80815 -64485
12495 -64485 -168234 -159595 21075 194303 246315 170314 74334 3667 -7314 -64110 -96839
12484 -96839 17798 88088 62400 -53621 -90104 2040 50133 48091 37829 -51031 -6621
12473 -6621 -28954 20549 67617 20326 32349 -27278 -26522 77378 49570 52724 89936 65173
12461 65173 22337 -80808 -18251 74619 -16559 -19861 -97556 -123314 -90748 -58854 60617
12450 60617 134401 119499 42126 -118124 -125512 -53273 111557 174335 127268 80037 22331
12439 22331 -17518 22126 127725 148593 114475 96832 116382 135483 -4695 -21799 91468
12428 91468 96355 -12955 -48264 47778 29448 -72218 -70934 -66703 -107340 -195101 -4289 -9993
12416 -9993 -14164 76295 -10107 -95298 -65980 -84646 -10955 -46451 -134672 -174686 -110373 18627
12404 18627 63395 88541 124774 89413 76565 -4296 -34217 41895 34108 -59713 -30511 7252
12392 7252 71135 76089 57260 81613 159184 139527 -5325 -150818 -193752 -168993 -110137 -66486
12380 -66486 -40898 -95942 -143150 -179847 -24754 2645 -52518 -119534 -12550 99016 99903
12369 99903 -27850 -126455 -116264 -141207 -43133 60956 98840 42013 70756 118015 80924
12358 80924 59018 37497 54489 -15971 22151 21609 149233 221665 155629 62530 106872 167917
12346 167917 135559 72323 -29613 25442 67391 -37243 -11577 -49763 3025 84129 119490
12335 119490 42758 -5427 -138961 -213424 -236168 -251539 -251530 -233468 -46904 18236 -53924 20819
12323 20819 58371 -48763 -97033 -40651 -112033 -40349 2837 92040 101488 101256 -7014 -28557
12311 -28557 -93501 -109575 -150120 -114175 -74430 -45315 -19472 73874 -12366 -65336 -5323 58912
12299 58912 80791 174100 186818 82413 76491 133834 83739 188890 225129 130294 51618
12288 51618 85129 122579 22369 49581 106713 137317 38147 -66271 -59136 -87227 -121611
12277 -121611 -113681 -178863 -146348 -125552 -140115 -87961 -1154 -57913 26258 84378 82349 28062
12265 28062 -156393 -149352 -182079 -312359 -241698 -176572 -142429 -10543 65975 50308 -8705
12254 -8705 -92794 -83214 12382 23766 67117 170794 127902 9313 -71412 -7723 -10715 8720
12242 8720 -87787 -116598 -124740 -96760 -22033 123040 195863 210778 254077 139508 -7562
12231 -7562 -63267 -77569 -45262 -53393 -45407 -65924 -164060 -115284 -3836 -39391 -10786 -85907
12219 -85907 -124002 -121524 -115574 -144862 52246 98202 29691 68515 105869 97532 40040 64718
12207 64718 49046 43450 19161 88976 111711 55729 -72779 -71766 -95531 -241556 -163932 -62756
12195 -62756 -15250 116073 42192 -42610 -90880 -75398 27430 8308 13397 63632 107548
12184 107548 23811 90230 60574 -19593 -95482 -12704 91940 138936 93915 41495 -20760
12173 -20760 -26678 36407 155115 134337 -47522 -147069 -154209 -95644 107145 111292 77415 -8763
12161 -8763 13915 44540 10895 -72671 -115823 25747 84806 91597 51361 89828 48833 -11971
12149 -11971 -56504 -76064 -92501 34738 47627 118206 100078 59455 106047 14494 -5791
12138 -5791 -56249 13225 80234 -40510 10649 -40093 -51912 65171 139570 87739 22217
12127 22217 84584 142132 60035 31341 -70806 -79872 -72697 -64880 -165145 -93336 147977 156812
12115 156812 87239 -141962 -136997 -76216 -73737 -51007 -149624 -99460 -29428 25231 81310 26603
12103 26603 -68201 -224010 -257043 -266673 -174103 -81689 -37918 -41857 -117041 -131115 -96040 -205414
12091 -205414 -229048 -106231 1862 42991 163637 182363 54679 33152 46622 42725 157678
12080 157678 136214 34900 -3769 48729 31647 -25941 34054 -22333 -48020 -106127 2244
12069 2244 107230 101026 52851 2781 -38188 -157953 -103842 17347 27023 6601 -27731 -83772
12057 -83772 -123262 -77720 45657 120163 140437 145883 143377 -3240 -42961 -81561 -159685 -170091
12045 -170091 -245047 -122045 -7394 -112810 -198555 -225551 -192232 -110307 -63913 -68897 -66883
12034 -66883 -38943 -119454 -100445 -51933 36526 29579 24889 38560 79943 103195 91083 84069
12022 84069 -42991 -7864 32596 -54814 -101581 -57794 68004 167323 112418 155206 164557
12011 164557 146452 63127 30062 21768 -85542 -212139 -75195 70672 104958 123196 187194
12000 187194 168402 50626 -7164 -36004 -77375 -115298 -116515 -84438 39568 163790 120338
11989 120338 51343 -23360 -38516 -79091 -69873 49647 26157 -8914 -4685 -65688 -25926 -93732
11977 -93732 -123870 -35825 104202 43506 -51967 85968 108354 123927 144581 30477 38623
11966 38623 20876 -24389 -119860 -157256 -231976 -58745 71125 157732 205323 126093 122321
11955 122321 192191 162393 -70779 -219731 -212195 -237565 -308894 -313002 -104779 42889 -1912
11944 -1912 -97541 -79307 -33413 -54349 -39553 -24097 2442 -6332 -34776 98157 84549 54090
11932 54090 33101 -60232 -199224 -116077 -54129 -98461 -25784 19985 99871 -15232 -84108
11921 -84108 -8630 -1323 48331 126358 3220 -184005 -96835 95544 170985 117303 72466
11910 72466 124423 80699 95031 101686 59850 163569 180176 89132 -6215 -50744 -15177 -25002
11898 -25002 -52748 -13772 13673 -129987 -265599 -179720 -76082 -24416 50491 109487 -9195
11887 -9195 -28349 -97131 -127231 -148792 -51313 119413 163122 135122 23367 -39790 -53395
11876 -53395 -44913 43621 6234 9235 43791 128367 101270 42824 32940 48296 43677 3228
11864 3228 -105492 -160898 -54995 -5097 -138631 -158441 -174833 -80270 -62749 -95037 -58850
11853 -58850 -139035 -161442 -96792 -60351 -104565 13336 -57588 -129534 -45239 -58708 -37133
11842 -37133 15042 111494 231581 128524 -36709 -54421 25367 32793 44265 80775 94966
11831 94966 41311 -11777 27903 134777 50609 56979 78848 24453 59455 -41259 -124032
11820 -124032 -56083 -28706 48379 38155 -34696 -119158 -95609 -105139 -98536 33646 209695
11809 209695 184487 203368 255666 144123 94365 5599 -17434 -62743 -113904 -89890 -39163
11798 -39163 -19017 -41905 -106922 -126231 -5947 61253 138781 112041 36171 -3616 -103652
11787 -103652 -166766 -136005 -47559 -65714 -67868 -90853 -129044 -138106 -61972 -92545 -178234 -287691
11775 -287691 -81267 -65088 -93937 -41938 -680 14258 71142 93259 153341 131709 27804
11764 27804 -24484 21753 75396 37183 30970 5137 -88490 -186213 -204483 -173633 -123029 -147567
11752 -147567 -170322 -140468 -137094 -101393 -97190 -171862 -180074 -127794 -18195 137022 190041 32763
11740 32763 -31612 -47339 -86938 -86089 -73251 -116520 -102976 -76474 -35178 65540 193180 234494
11728 234494 143882 35027 -13202 -98408 -232403 -233151 -176313 -99801 -111780 -163370 -130172
11717 -130172 -87499 -78228 -117133 -187025 -192402 -132545 -124660 -123656 -39416 -161798 -143376 -21435
11705 -21435 9231 -3498 -97487 -69987 -58617 7270 16650 120435 173467 198098 160389 145631
11693 145631 52792 -54640 -64826 -25011 -50824 -58284 10806 25246 -10983 -61479 -61402 -89958
11681 -89958 -138569 -56230 -8356 105254 17377 -142404 -147888 -177915 -84118 -24751 -14593
11670 -14593 19078 -23102 -52637 -51774 17281 14310 -111433 -62499 46942 136672 214888 217619
11658 217619 214803 179146 43446 -173977 -205266 -147880 -71695 -6179 138453 117454 26162
11647 26162 -39076 -156863 -179654 -30295 -34434 -124547 -209905 -191104 -124341 -89957 -66879
11636 -66879 -13249 26873 173237 159756 96092 123098 79569 178911 230408 102614 97161
11625 97161 -30964 -94196 -83450 -118907 -98451 -138183 -272090 -214450 -196510 -108012 -2214
11614 -2214 -16231 -124414 -241429 -205299 -92021 -65555 -61841 -172186 -212603 -190622 -90484
11603 -90484 15036 29313 69685 99657 92157 63919 76085 128201 109202 956 1186 -23670
11591 -23670 -87419 -10253 -66706 -106850 -87947 -64812 -31384 -32421 -52936 -62395 -75401 -33380
11579 -33380 -89217 -18595 -22577 -12885 -63619 1028 21679 -43962 -97933 -20787 31860 71942
11567 71942 56107 136835 60768 -83805 -33292 30558 92127 211852 252029 139621 151603
11556 151603 220406 203001 130566 49473 72904 7562 -14698 5510 -17728 -4990 -52944
11545 -52944 -10359 -15088 -16889 102195 58259 -66655 -52837 -97957 -133659 -195922 -173362 -102954
11533 -102954 -16235 85315 68009 104337 74535 -145930 -355188 -345643 -178569 1773 -54296
11522 -54296 -168581 -138170 -67319 -34726 -125563 -129636 -82843 -68326 13247 4294 6221 105155
11510 105155 89770 167040 226772 133127 51886 76999 126875 147692 112693 116168 56717 -40919
11498 -40919 -63694 -139287 -93686 -72004 -34154 110444 143365 78499 158028 120317 130269 137658
11486 137658 192459 88741 87508 76674 -34468 -142315 -114933 -47326 -99365 -212490 -158365
11475 -158365 -19303 103949 79659 10845 31329 47681 98037 100948 106506 112146 70682 -14502
11463 -14502 -35436 42955 52348 12463 116914 223824 192269 141764 103622 76454 49154
11452 49154 -50168 1102 24865 36521 67856 127210 24835 -864 69244 161902 122102
11441 122102 26205 -34107 -28002 38574 154066 151868 100726 102922 -12464 -99735 -93730 -114322
11429 -114322 -195185 -173968 -105044 -80441 -75671 -121698 -108023 -9854 -35836 -109288 -33407 -2182
11417 -2182 -35573 11513 -19349 4934 -44347 -73508 -58078 58408 -2383 -52149 -53612 32868
11405 32868 72366 163104 56496 88388 60961 85166 118824 81690 67241 146130 141977 183457
11393 183457 101251 28098 -84770 -74103 -24314 -30411 -120599 -33 31432 42829 81841
11382 81841 140265 103237 67398 40948 -67937 -106977 -145103 -50410 59890 77449 108088
11371 108088 158879 99566 -54106 12147 71356 32251 34470 33989 11085 35365 57535 82119
11359 82119 53564 26037 73019 249390 174989 37634 15560 -71645 -128345 -54708 -13994
11348 -13994 30992 -2731 -80222 -157906 -226930 -264220 -197002 -99451 -176849 -109643 -28930 94684
11336 94684 167236 116589 59867 88938 50728 -100183 -113135 -122992 -128180 -65726 -119312 -116111
11324 -116111 -77157 -143566 -125069 -64352 4404 89332 -5214 35902 118754 17633 -54968
11313 -54968 -87872 -174897 -80679 -37848 -83298 -84734 -62386 -116867 -29916 -4525 -66593 -118606
11301 -118606 -105671 701 159413 108265 44802 46578 13584 -48491 -150322 -90333 -43881
11290 -43881 -3377 25776 20348 -52441 -66662 33288 81334 151032 95700 2139 50322 90735
11278 90735 195358 202340 136097 115921 -31216 -73865 -84325 -113621 173225 278946 259356
11267 259356 243952 262148 123660 121117 117619 88249 105829 148478 157877 132067 38475 257
11255 257 48333 101540 114593 133661 80944 68994 21301 -35525 32979 118101 127235 77497
11243 77497 -23035 -43708 -39703 -116694 -154920 -8978 -35209 -90326 -48128 50438 112341
11232 112341 -39840 -144261 -218619 -150618 -44727 -44006 8477 -81214 -238383 -328753 -274321
11221 -274321 -118169 -14173 71234 98620 -57754 -36439 49359 17314 67927 -26877 -53310
11210 -53310 -29953 1086 66182 95863 150624 80726 64367 16431 -3802 10636 21042 5877
11198 5877 -14614 77580 96994 40247 29469 139154 135475 77501 119708 287193 223243 130776
11186 130776 95199 56542 66037 106620 -55960 -138296 -17678 38975 51615 -13014 -109953
11175 -109953 -147399 -100940 -41726 94170 84996 -77808 65851 218803 164560 -31366 -113235
11164 -113235 -152537 -243138 -337307 -348579 -237738 -119471 -51151 2617 48792 24863 67950
11153 67950 58835 19516 -88782 -146222 -87466 -74310 -196250 -191159 -36594 30284 -24981
11142 -24981 -26150 -17092 58256 51918 -5705 3259 5707 -54899 82719 274635 266800 138207
11130 138207 -124537 -152587 -112490 -45189 -753 30436 92611 20913 -76423 -12419 -29147
11119 -29147 -52721 -2682 19921 46152 3810 18587 25197 -30663 88274 184324 82740
11108 82740 -90345 -197078 -123772 26081 77493 15011 -106715 -136377 -78189 -114956 -214716
11097 -214716 -27459 153973 304419 256890 137430 -51814 34504 115478 76612 36068
11087 36068 29074 65626 32282 -6937 66407 114684 156009 150365 182465 121486 53758 4593
11075 4593 104539 140413 104865 -15343 -46717 51778 142231 119923 25795 -48097 11491 10001
11063 10001 -259668 -360065 -124792 31522 129478 285670 163108 88907 -7408 65751
11053 65751 138924 208789 250072 151176 8876 -74242 -179201 -161680 12061 22109 -4274
11042 -4274 -125984 -52824 30338 -27356 -100071 -64533 202737 255757 195823 159015 120841
11031 120841 48004 -32387 -36921 -104160 -51269 51705 48015 92343 125108 78911 -22975
11020 -22975 -33724 -17769 -142060 -114658 40738 78689 71719 85035 181190 120157 -38143
11009 -38143 -64568 -136804 -215197 -180293 -88003 -64545 -1833 11646 -31361 -29823 24038 101935
10997 101935 140255 124203 128920 79727 18635 -71213 -164632 -31635 75249 -23902 -49349
10986 -49349 34396 52472 13283 -12884 -63698 -96353 -106119 -36569 24793 31223 36658 91135
10974 91135 112035 26703 -20944 20181 24774 1399 83036 -3860 -126140 -174597 -85307 30675
10962 30675 74463 73511 77752 -34750 -227883 -283011 -142657 -98225 -46160 -5203 -44439 -69549
10950 -69549 -58159 -74935 -99909 -49888 13898 50278 70596 131333 51295 -9066 81173 111765
10938 111765 -49324 -140159 -135292 -89435 29580 191189 285856 261655 228445 166675 75171
10927 75171 -23376 -62613 -54662 68599 123949 104077 -12097 -129210 -16250 60742 155676
10916 155676 84165 -121225 -146104 -54752 17488 162658 149494 96792 65244 26261 -27391
10905 -27391 -75528 -112841 -54618 77685 157824 65141 33154 30993 6105 -40637 -12385 49392
10893 49392 51824 96685 133971 78797 37909 20801 74253 46779 40281 17453 -95650 1821
10881 1821 37149 -10605 73773 96226 72809 -29144 38402 40034 -103578 -223779 -194197
10870 -194197 -83356 -41917 22715 63122 52420 -26210 -41122 101186 131840 129844 108245
10859 108245 8411 5222 75035 92584 137005 106194 177916 144428 131321 170250 116812 109282
10847 109282 26462 -26992 -16604 -9433 -98518 -284449 -368137 -258316 -66768 83634 90452
10836 90452 14683 61256 180513 169872 78231 55434 -12984 -18053 39096 85789 145515 117932
10824 117932 22252 133105 153175 200914 132429 113417 54404 88579 175347 192844 133754
10813 133754 96269 139836 49707 -43624 -137512 -77352 -68224 -12667 -44303 -44786 -120511 -122739
10801 -122739 -172204 -134768 -58619 19529 107342 122844 197941 103046 -75022 -183456 -84391
10790 -84391 -111240 -202726 -176712 -67717 5643 -2390 -37054 -54259 -60608 -1333 -1101 -93345
10778 -93345 -69579 -72365 26915 130250 9530 30783 -12277 -40501 -1847 -4336 -59899 -27231
10766 -27231 -80791 -125816 -90689 -48462 72709 45701 75689 64783 84697 122754 116819 36076
10754 36076 -35463 -171870 -250656 -195904 -146258 -144764 -194643 -288888 -200950 -110089 -58407 -88658
10742 -88658 -179210 -71276 -71111 -61990 -36212 45221 118881 73032 56277 66263 -28216 -52025
10730 -52025 -15592 35681 4302 -37220 -104269 -101503 -88334 -117985 -49888 19171 199719 163472
10718 163472 83687 76440 72123 112323 61557 63843 54598 63235 110390 122423 93172 36340
10706 36340 -43314 -22363 -60490 -83418 -91362 -110979 -5500 74194 202464 152037 143478 99333
10694 99333 45249 63813 87578 58110 -26744 -50117 -74647 -181122 -139245 -10151 40340
10683 40340 2487 -40422 23421 89866 -20916 -88307 -23939 -56510 -149691 -124552 -66646
10672 -66646 -34618 -71185 -77364 11101 -12452 22381 69943 15918 72532 5625 -74932 -48389
10660 -48389 36389 89507 62863 180644 254164 181702 75271 -16128 -67106 -89912 -31950
10649 -31950 53901 -21852 -94578 -125370 -134633 -66983 -7442 8407 -30995 -19519 -37192 -91557
10637 -91557 -124532 -79569 -7097 -90852 -98671 -61455 -84540 -60778 -138826 -8665 29217 -1380
10625 -1380 -38129 9278 41698 14410 21721 33398 -32760 49152 133433 132531 133446 158501 185149
10612 185149 42621 19330 8667 42756 9174 35533 -91731 -124555 -52875 1994 827
10601 827 57153 55297 -67881 -39621 -24792 -105092 -138581 -94849 39408 68430 -49979 -125526
10589 -125526 -51768 -8710 -42320 -103693 -67545 -138318 -144771 -176051 -176074 -193317 -24320 41200
10577 41200 46026 55341 23553 81097 -15819 89055 194124 114277 -51390 -57693 18513 102218
10565 102218 102072 59934 -13639 -172567 -222603 -119362 45801 16200 44967 42638 -28684
10554 -28684 -123004 -68774 108465 70146 -110393 -90622 29870 -57691 36165 172571 154177
10543 154177 135254 106865 29032 17861 54557 47771 66420 100642 -4632 9161 12416 -70959
10531 -70959 -82112 79958 72259 -13611 -67318 -136321 -125855 -80183 -93110 -9441 85723 -7158
10519 -7158 -79183 -30103 -20336 63810 64961 55927 141313 82145 -16283 -24578 -787 24966 99522
10506 99522 124301 133538 88379 68004 108711 126546 102285 104752 4645 -36913 -27261 17979
10494 17979 48698 -3875 19681 -12226 -68185 -17817 93342 215386 166248 120147 137542
10483 137542 59735 55817 25932 43066 51269 -48875 -104157 -34008 61358 48389 82515 92908
10471 92908 107612 145475 198495 262253 108715 -20365 30625 88619 -26599 -120040 -111712
10460 -111712 -20528 -57166 -132401 -131153 -96391 -14812 38848 73531 -9030 -54299 43082 146495
10448 146495 85982 88275 217741 255109 105784 14423 30815 123420 176445 218010 288835
10437 288835 151307 78155 115350 209160 141479 5056 -60683 -189575 -209092 -80046 -55024
10426 -55024 -39336 -65355 58533 42384 99304 34556 90570 78695 107741 157537 152710 66492
10414 66492 -14347 -119205 -2042 110749 153334 51726 81273 103681 75938 58383 2390
10403 2390 -42311 170385 130517 67987 131862 142048 220344 290342 161815 76193 161803
10392 161803 94952 -7675 99416 163693 128255 147180 196419 174703 81051 8467 37302
10381 37302 63147 150701 270408 313705 307054 303236 329415 349651 251299 196572 349523 481396
10369 481396 448130 478125 431441 464468 545282 500993 453890 457254 499265 424393 400227 435029
10357 435029 423022 368237 342953 421353 509477 545250 553771 643758 798774 819838 931506
10346 931506 950791 908224 1023452 1079621 1258225 1311499 1392803 1661021 1952026 2297860
10336 2297860 2894066 3497521 4015206 4579945 5019056 5363339 5572273 5512397 5200800 4855018
10326 4855018 4478633 3836053 3128509 2588022 2087766 1664732 1317562 1145303 1038592
10317 1038592 802332 562745 526722 356115 277609 151013 113132 134104 134668 136940 136562
10306 136562 39125 10754 -15823 -13864 70077 125531 98094 78237 -14705 49005 89187 3967
10294 3967 -82130 -116315 -200549 -118786 -60394 -98561 -20447 12504 -6221 -96869 -197428 -205659
10282 -205659 -108068 -47137 -12210 126487 208833 145191 114062 170931 196824 257891 259280
10271 259280 179925 82193 157810 89355 90027 171265 128989 -45000 -113974 -35394 64398 57381
10259 57381 -44570 -151552 -195772 -281577 -223490 -44523 -73032 -35012 180318 146073 112439
10248 112439 80595 52944 7457 79972 111650 140208 148580 79734 -49869 -169310 -191740
10237 -191740 2638 148546 95784 39274 -72151 -90692 -64289 -85479 13123 -31644 -143962
10226 -143962 -67131 28744 -56016 -139529 -62300 83218 77745 -12770 -113964 19391 61662
10215 61662 17504 -46452 -28303 -184986 -193693 -36816 62886 80904 65910 129860 144165
10204 144165 135176 156364 21048 1859 92593 -37018 -206102 -243552 -114573 -61343 -65842
10193 -65842 -253014 -281495 -296118 -232871 -29919 22468 -14887 -10612 75124 103926 135756
10182 135756 187521 183924 192236 64357 -156853 -148247 -205748 -126046 6392 16795 87202
10171 87202 76806 7401 -140446 -87719 37243 30940 65668 35962 -28349 80627 101345
10160 101345 146811 271555 284172 250007 158235 118966 185077 252331 180990 238797 302472
10149 302472 314846 275299 188857 126939 74647 85509 21960 -59466 -6901 -21048 102918
10138 102918 126206 77426 -5226 -62759 -66433 -110534 -145368 -94085 35476 166071 145053
10127 145053 127182 246298 179025 -27860 -45175 -15294 -27362 96630 161308 68572 -58394
10116 -58394 -46334 -144649 -157702 -95334 -163347 -145529 -160637 -175649 -203284 -148780 -116533 -113348
10104 -113348 -45580 -92489 -159483 -154774 -102077 -50792 -5736 27378 30739 -64240 -118896 -93381
10092 -93381 -6326 -49319 -107645 -61997 65347 131151 -74113 -145858 -227101 -240496 -42990
10081 -42990 117687 122979 114243 -67420 -160989 -243831 -216135 -99833 -114592 -16637 44677
$$ [...]
##END NTUPLES=NMR SPECTRUM
##END=
