##TITLE=Analysis number 320268
Compound Code mo 07259
Project Code adrs
Chemist Name fudan
##JCAMPDX= 6.0         $$ Bruker NMR JCAMP-DX V2.0
##DATA TYPE= NMR SPECTRUM
##DATA CLASS= NTUPLES
##ORIGIN= Bruker BioSpin GmbH
##OWNER= nmr
$$ XWIN-NMR		Version 3.5
$$ Tue Jun 20 11:17:27 2006 GMT Daylight Time (UT+1h)  MAYBRIDGE\nmr@NMR_250MHZ
##.OBSERVE FREQUENCY= 250.131544655141
##.OBSERVE NUCLEUS= ^1H
##.ACQUISITION MODE= SIMULTANEOUS (DQD)
##.ACQUISITION SCHEME= undefined
##.AVERAGES= 16
##.DIGITISER RES= 18
##SPECTROMETER/DATA SYSTEM= dpx250
##.PULSE SEQUENCE= zg30
##.SOLVENT NAME= CDCl3
##.SHIFT REFERENCE= (INTERNAL, CDCl3, 0, 16.522)
##AUDIT TRAIL= $$ (NUMBER, WHEN, WHO, WHERE, WHAT)
$$ ##TITLE= Audit trail, XWIN-NMR		Version 3.5
$$ ##JCAMPDX= 5.01
$$ ##ORIGIN= Bruker BioSpin GmbH
$$ ##OWNER= nmr
$$ C:\u/data/dgb/nmr/ADRS/1110/pdata/1/auditp.txt
$$ ##AUDIT TRAIL=  $$ (NUMBER, WHEN, WHO, WHERE, WHAT)
(   1,<2006-06-20 11:17:06.56 +100>,<MAYBRIDGE\nmr>,<NMR_250MHZ>,
      <created by zg, POWCHK disabled, PULCHK disabled
       configuration hash MD5:
       E2 DF 36 D8 04 B2 41 60 5A D7 A3 38 5A 4B D0 FE
       data hash MD5: 64K
       51 5E 81 F5 58 B5 84 0C AB E0 3B BF F3 9C 0A 50>)
(   2,<2006-06-20 11:17:18.98 +100>,<MAYBRIDGE\nmr>,<NMR_250MHZ>,
      <Start of raw data processing
       ef LB = 0.3 FT_mod = 6 PKNL = 1 SI = 32K 
       data hash MD5: 32K
       84 1D BB 14 3D 4B 98 A8 DD 48 30 F8 44 4F 25 05>)
(   3,<2006-06-20 11:17:20.89 +100>,<MAYBRIDGE\nmr>,<NMR_250MHZ>,
      <apk 
       data hash MD5: 32K
       43 E3 7D C4 57 46 FA D8 95 BA D0 5F E3 65 AD E4>)
(   4,<2006-06-20 11:17:21.67 +100>,<MAYBRIDGE\nmr>,<NMR_250MHZ>,
      <abs ABSG = 5 
       data hash MD5: 32K
       FC F6 10 EE 45 26 69 B5 60 BB 8B B0 36 05 EC 3E>)
$$ ##END=
$$ 
$$ hash MD5
$$ 44 1C 9D D0 CF B3 F0 6E 1A 02 2E 60 B8 DB 56 EE
##$RELAX= 
##$RELAX= 
##$RELAX= 
##$RELAX= 
##$RELAX= 
##$RELAX= 
##$RELAX= 
$$ Bruker specific parameters
$$ --------------------------
##$DU= <C:\u>
##$EXPNO= 1110
##$NAME= <ADRS>
##$PROCNO= 1
##$TYPE= <nmr>
##$USER= <dgb>
##$AMP= (0..31)
100 100 100 100 100 100 100 100 100 100 100 100 100 100 100 100 100 100 
100 100 100 100 100 100 100 100 100 100 100 100 100 100 
##$AQSEQ= 0
##$AQ_mod= 3
##$AUNM= <au_zg>
##$AUTOPOS= <18 >
##$BF1= 250.13
##$BF2= 250.13
##$BF3= 250.13
##$BF4= 250.13
##$BF5= 500.13
##$BF6= 500.13
##$BF7= 500.13
##$BF8= 500.13
##$BYTORDA= 1
##$CFDGTYP= 0
##$CFRGTYP= 5
##$CHEMSTR= <none>
##$CNST= (0..31)
1 1 145 1 1 1 1 1 1 1 1 1 1 1 1 1 1 1 1 1 1 1 1 1 1 1 1 1 1 1 1 1 
##$CPDPRG= <>
##$CPDPRG1= <>
##$CPDPRG2= <>
##$CPDPRG3= <>
##$CPDPRG4= <mlev>
##$CPDPRG5= <mlev>
##$CPDPRG6= <mlev>
##$CPDPRG7= <mlev>
##$CPDPRG8= <mlev>
##$CPDPRGB= <>
##$CPDPRGT= <>
##$D= (0..31)
0 1 0 0 0 0 0 0 0 0.06 0 0 0 0 0 0 0.0002 0 0 0 0 0 0 0 0 0 0 0 0 0 0 
0 
##$DATE= 1150798625
##$DBL= (0..7)
120 120 120 120 120 120 120 120 
##$DBP= (0..7)
150 150 150 150 150 150 150 150 
##$DBP07= 0
##$DBPNAM0= <>
##$DBPNAM1= <>
##$DBPNAM2= <>
$$ [...]
##$SUBNAM7= <"">
##$SUBNAM8= <"">
##$SUBNAM9= <"">
##$SW= 20.6930455092707
##$SWIBOX= (0..15)
0 0 3 0 0 0 0 0 0 0 0 0 0 0 0 0 
##$SW_h= 5175.983436853
##$TD= 65536
##$TD0= 1
##$TE= 294.16
##$TE2= 300
##$TE3= 300
##$TEG= 300
##$TL= (0..7)
0 120 120 120 120 120 120 120 
##$TP= (0..7)
150 150 150 150 150 150 150 150 
##$TP07= 0
##$TPNAME0= <>
##$TPNAME1= <>
##$TPNAME2= <>
##$TPNAME3= <>
##$TPNAME4= <>
##$TPNAME5= <>
##$TPNAME6= <>
##$TPNAME7= <>
##$TPOAL= (0..7)
0.5 0.5 0.5 0.5 0.5 0.5 0.5 0.5 
##$TPOFFS= (0..7)
0 0 0 0 0 0 0 0 
##$TUNHIN= 0
##$TUNHOUT= 0
##$TUNXOUT= 0
##$USERA1= <user>
##$USERA2= <user>
##$USERA3= <user>
##$USERA4= <user>
##$USERA5= <user>
##$V9= 5
##$VALIST= <valist>
##$VCLIST= <CCCCCCCCCCCCCCC>
##$VD= 0
##$VDLIST= <DDDDDDDDDDDDDDD>
##$VPLIST= <PPPPPPPPPPPPPPP>
##$VTLIST= <TTTTTTTTTTTTTTT>
##$WBST= 1024
##$WBSW= 4
##$XGAIN= (0..3)
0 0 0 0 
##$XL= 0
##$YL= 0
##$YMAX_a= 436191
##$YMIN_a= -502343
##$ZGOPTNS= <>
##$ZL1= 120
##$ZL2= 120
##$ZL3= 120
##$ZL4= 120
##$ABSF1= 16.522
##$ABSF2= -4.171173
##$ABSG= 5
##$ABSL= 3
##$ALPHA= 0
##$AQORDER= 0
##$ASSFAC= 0
##$ASSFACI= 0
##$ASSFACX= 0
##$ASSWID= 0
##$AUNMP= <proc_1d>
##$AZFE= 0.1
##$AZFW= 0.1
##$BCFW= 0
##$BC_mod= 0
##$BYTORDP= 0
##$COROFFS= 0
##$CY= 12.5
##$DATMOD= 1
##$DC= 0
##$DFILT= <>
##$DTYPP= 0
##$F1P= 14.0000005364418
##$F2P= -0.99999901652339
##$FCOR= 0.5
##$FTSIZE= 32768
##$FT_mod= 6
##$GAMMA= 0
##$GB= 0
##$INTBC= 1
##$INTSCL= 1
##$ISEN= 128
##$LB= 0.3
##$LEV0= 0
##$LPBIN= 0
##$MAXI= 10000
##$MC2= 0
##$MEAN= 0
##$ME_mod= 0
##$MI= 0
##$NCOEF= 0
##$NC_proc= -3
##$NLEV= 6
##$NOISF1= 0
##$NOISF2= 0
##$NSP= 0
##$NTH_PI= 0
##$NZP= 0
##$OFFSET= 16.522
##$PC= 1
##$PHC0= 158.304
##$PHC1= 25.91881
##$PH_mod= 1
##$PKNL= yes
##$PPARMOD= 0
##$PSCAL= 4
##$PSIGN= 0
##$REVERSE= no
##$SF= 250.13
##$SI= 32768
##$SIGF1= 0
##$SIGF2= 0
##$SINO= 400
##$SIOLD= 32768
##$SREGLST= <1H.CDCl3>
##$SSB= 0
##$STSI= 32768
##$STSR= 0
##$SW_p= 5175.98343685301
##$SYMM= 0
##$S_DEV= 0
##$TDeff= 65536
##$TDoff= 0
##$TI= <Analysis number 999999
Compound Code 99
Book Reference 9
Project Code 9>
##$TILT= no
##$TM1= 0
##$TM2= 0
##$TOPLEV= 0
##$USERP1= <user>
##$USERP2= <user>
##$USERP3= <user>
##$USERP4= <user>
##$USERP5= <user>
##$WDW= 1
##$XDIM= 32768
##$YMAX_p= 393781210
##$YMIN_p= -136988
$$ End of Bruker specific parameters
$$ ---------------------------------
##NTUPLES= NMR SPECTRUM
##VAR_NAME=  FREQUENCY,     SPECTRUM/REAL,   SPECTRUM/IMAG
##SYMBOL=    X,             R,               I
##VAR_TYPE=  INDEPENDENT,   DEPENDENT,       DEPENDENT
##VAR_FORM=  AFFN,          ASDF,            ASDF
##VAR_DIM=   32768,         32768,           32768
##UNITS=     HZ,            ARBITRARY UNITS, ARBITRARY UNITS
##FACTOR=    0.157963299565203, 1,           1
##FIRST=     4132.6476996994, 0,             0
##LAST=      -1043.33573715361, 0,           0
##MIN=       -1043.33573715361, -136988,     0
##MAX=       4132.6476996994, 393781210,     0
$$ Real data points
##PAGE= N=1
##DATA TABLE= (X++(R..R)), XYDATA
$$ [...]
14482B0914q440j8230M021Q572m837J6864j0062l5746k3093P568L6702K0156k522
$$ 20914 12474 -5756 -1735 6837 2000 18864 8802 -26944 -50037 -42469 -5767 14389 11867
14469A1867l5000o937P534r81J542N87j647O508K2619R760r524J3367k0531l1161
$$ 11867 -23133 -30070 -22536 -23517 -21975 -21388 -23035 -16527 6092 15852 6328 19695 -836 -31997
14455c1997k665j5520K194J83r867j996K0182j4214L533K1132J8003N640l603
$$ -31997 -34662 -50182 -47988 -47805 -57672 -59668 -39486 -53700 -50167 -29035 -11032 -5392 -8995
14442h995N989M858j1451R937J3493J7846k3796l9666j2805J8947K9602K5225
$$ -8995 -3006 1852 -9599 338 13831 31677 7881 -31785 -44590 -25643 3959 29184
14430B9184j7965o707K2924k6176K1735P607k8795k6047k0426J3949J2243k7333
$$ 29184 11219 4512 27436 1260 22995 30602 1807 -24240 -44666 -30717 -18474 -45807
14418d5807k944N1339J9204k0774j3715j1444j5412K39P841P266j1749j9853J3460
$$ -45807 -48751 2588 21792 1018 -12697 -24141 -39553 -39314 -31473 -24207 -35956 -55809 -42349
14405d2349N533j455r370k2244r319M848J5911j2591K4678M2219M114j1550j0117
$$ -42349 -36816 -38271 -47641 -69885 -79204 -74356 -58445 -71036 -46358 -4139 -25 -11575 -21692
14392b1692j3978p938L8043L5510j2553j1830P439P821R835k0250j0164m110K157
$$ -21692 -35670 -43608 -5565 29945 17392 5562 13001 20822 30657 10407 243 -3867 -1710
14379a710m265m609J6920K906J549J4148k9966j7388Q824m382M4041O090p271
$$ -1710 -5975 -10584 6336 9242 10791 24939 -5027 -22415 -13591 -17973 26068 32158 24887
14366B4887J5735r664k4991m0309l091n966L8492M3350j6420j8228j2454k1213
$$ 24887 40622 30958 5967 -34342 -37433 -43399 -4907 38443 22023 3795 -8659 -29872
14354b9872j6616J4308J1612K5295K0976n277j646k1781r988L7595J6839P397
$$ -29872 -46488 -32180 -20568 4727 25703 20426 18780 -3001 -12989 24606 41445 48842
14342D8842k9495l1940J3222K9558j4159p4991k6496R883K4179o52j4401J3096
$$ 48842 19347 -12593 629 30187 16028 -58963 -85459 -75576 -51397 -52049 -66450 -53354
14330e3354j1690N263j3407k596J0173J7028J1540J0487L657j0225K3237K2569
$$ -53354 -65044 -59781 -73188 -75784 -65611 -48583 -37043 -26556 -22899 -33124 -9887 12682
14318A2682m799j561L072J3410k5938k1007k2836r488J4436Q385K0319R142j4647
$$ 12682 7883 6322 9394 22804 -3134 -24141 -46977 -56465 -42029 -33644 -13325 -4183 -18830
14305a8830K3329l2840k6567m83M453k2378J8761L2170J660L765L0564j5575q029
$$ -18830 4499 -28341 -54908 -55391 -50938 -73316 -54555 -22385 -20725 -16960 13604 -1971 -10000
14292a0000J2708r712P773p273j0672L9504K3065l0410k9403J2092L891Q8j4044
$$ -10000 2708 -7004 769 -6504 -17176 22328 45393 14983 -14420 -2328 1563 1651 -12393
14279a2393j2375o495J4894J3340j5949L455J3074J5631j122l7354j6524K3937
$$ -12393 -24768 -31263 -16369 -3029 -18978 -15523 -2449 13182 12060 -25294 -41818 -17881
14267a7881J8231P530j1243o109K405j6540M654O031P860k3779j7528k5810K115
$$ -17881 350 7880 -3363 -9472 -7067 -23607 -18953 -12922 -5062 -28841 -46369 -72179 -70064
14254g0064K3604q688L6446K1258J2761j2905M21P574K482k0487j6886j0356R954
$$ -70064 -46460 -55148 -18702 2556 15317 2412 2833 10407 12889 -7598 -24484 -34840 -24886
14241b4886K4862j3631k7270K567K1959N1468J5416j8717j0651k2049K9844L2942
$$ -24886 -24 -13655 -40925 -38358 -16399 35069 50485 31768 21117 -932 28912 61854
14229F1854n2195k7785j0834Q20K6725K9174n919J3285Q5k6531J9980k8002j2570
$$ 61854 9659 -18126 -28960 -28140 -1415 27759 21840 35125 35210 8679 28659 657 -11913
14216a1913N991k4989j9228K1669R127l034K0211K4572j268l6271m670O850J7153
$$ -11913 -5922 -30911 -50139 -28470 -19343 -22377 -2166 22406 21138 -15133 -19803 -12953 4200
14203D200p918k6331J5511j6780k1834n93J0744N146k3249J7596L3514K3849j0922
$$ 4200 -3718 -30049 -14538 -31318 -53152 -53745 -43001 -37855 -61104 -43508 -9994 13855 2933
14190B933n665k750O950J588p555J3531J6130J4937j742j9557l1590N534K7535
$$ 2933 -2732 -5482 1468 3056 -4499 9032 25162 40099 38357 18800 -12790 -7256 20279
14177B0279j094k6861k4582q517l375M557j2827P990L3394M050l033M6827K3533
$$ 20279 19185 -7676 -32258 -40775 -44150 -39593 -52420 -44430 -11036 -6986 -10019 36808 60341
14164F0341R125l5902J6210M347Q267p253l6323L5269K1630l1948m4871j0833
$$ 60341 69466 33564 49774 54121 62388 55135 18812 54081 75711 43763 -1108 -11941
14152a1941L0760j4809k6142j7674p243Q030M1111j303k5336J5091k7212J8625
$$ -11941 18819 4010 -22132 -39806 -47049 -39019 2092 789 -24547 -9456 -36668 -18043
14140a8043K3932k3090j9811J9143K7570O997j2056P374q210j7177j4129Q280
$$ -18043 5889 -17201 -37012 -17869 9701 16698 4642 12016 3806 -13371 -27500 -19220
14128a9220O27J3454j3391L552J6035J9464j8125j2478L2797Q484m0749p576K6269
$$ -19220 -18593 -5139 -18530 -14978 1057 20521 2396 -10082 22715 31199 -9550 -17126 9143
14115I143J0052K6298j3133k7039j925J9504k5257j3371M1079M334J6634L592
$$ 9143 19195 45493 32360 5321 3396 22900 -2357 -15728 25351 29685 46319 49911
14103D9911k3435k6713J2021R907j48N572N47o802q751J8856n061j1348j6980
$$ 49911 26476 -237 11784 21691 21543 27115 27662 20860 12109 30965 25904 14556 -2424
14090b424K536q551k4294k6623K2807M9629J5707j2593j6623M318J282N06J6542
$$ -2424 112 -8439 -32733 -59356 -36549 13080 28787 16194 -429 3889 5171 5677 22219
14077B2219L198m521K382k0567o892J1561N108J0351M750m307k3526O405J1936
$$ 22219 25417 20896 23278 2711 -4181 7380 12488 22839 27589 23282 -244 6161 18097
14064A8097o605L325O676N391K2507j9712j8918j4965J8468K887p407L380j70
$$ 18097 11492 14817 21493 26884 49391 29679 10761 -4204 14264 17151 9744 13124 12954
14051A2954q549j1278j0292P489K2112J2887J97k4982j2448J936n563J2818M1338
$$ 12954 4405 -6873 -17165 -9676 12436 25323 25520 538 -11910 -9974 -15537 -2719 38619
14038C8619L7734Q614n034j7939n301l0260j5480J7034J6784j9579j2387P677
$$ 38619 76353 84967 79933 61994 56693 26433 10953 27987 44771 25192 12805 20482
14026B0482q466j0191k013K0169j1051j7875R188P76M3433K4537j3447N996k3022
$$ 20482 12016 1825 -188 19981 8930 -8945 243 1019 44452 68989 55542 61538 38516
14013C8516m2603K0427p521q691M516J3691k514j7704n445j8350l831J3037j1647
$$ 38516 -4087 16340 8819 128 4644 18335 15821 -1883 -7328 -25678 -29509 -16472 -28119
14000b8119p169l3177N310M4064K5775L89K3720n057j2111p390K3719O064k631
$$ -28119 -35288 -68465 -63155 -19091 6684 7073 30793 25736 13625 6235 29954 36018 33387
13987C3387l065j2514r270k604j1423M573J7160q62L9012M813k0102r029J6818
$$ 33387 30322 17808 8538 5934 -5489 -916 16244 15382 54394 59207 39105 30076 46894
13974D6894j7847l4951n296j938j5252K0669O387n796j9756j3188M07m370j027
$$ 46894 29047 -5904 -11200 -13138 -28390 -7721 -1334 -7130 -26886 -40074 -39667 -44037 -45064
13961d5064J4361M1926j1118K0224n338j1589j0997k0022J1220K480p656K3976
$$ -45064 -30703 11223 105 20329 14991 3402 -7595 -27617 -16397 -13917 -21573 2403
13949B403L8086k953L1196l2072l5003k0268j7192Q83K5795Q769K4691p812R480
$$ 2403 40489 37536 68732 36660 1657 -18611 -35803 -34920 -9125 -356 24335 16523 26003
13936B6003L6679N529k5055j2569k0838k1559J6163k5868r164q455J3650N0622
$$ 26003 62682 68211 43156 30587 9749 -11810 4353 -21515 -30679 -39134 -25484 25138
13924B5138M909j7695J4975J0477j1714R483k4276j1681q962J6698q630k541J6695
$$ 25138 30047 12352 27327 37804 26090 35573 11297 -384 -9346 7352 -1278 -3819 12876
13911A2876K6924O886k0261J779j1106r696l653K4237J6096k5589k3333J3295
$$ 12876 39800 46686 26425 28204 17098 7402 3749 27986 44082 18493 -4840 8455
13899H455N9882K1690k8943j5614j4361K649J8191M008m751L210p26K1652J1673
$$ 8455 68337 90027 61084 45470 31109 33758 51949 55957 51206 54416 53690 75342 87015
13886H7015l981k8310l0698k990J1103R857J327O490J9307m0795l7150J7781M7272
$$ 87015 83034 54724 24026 21036 32139 41996 43323 49813 69120 28325 -8825 8956 56228
13873E6228K772q284j7711j2174j754k3476o190K3098J2525l8435k2694J008k5924
$$ 56228 59000 50716 33005 20831 19077 -4399 -10589 12509 25034 -13401 -36095 -35087 -61011
13860f1011J4636K3020J306K5221K5K182k4193M916N7313J3851L913p419j2237
$$ -61011 -46375 -23355 -22049 3172 3197 5379 -18814 -13898 43415 57266 61179 53760 41523
13847D1523L4289J4024J5982j1857l5607l3514l2029M6978J011r66q787J4001
$$ 41523 75812 89836 105818 93961 58354 24840 -7189 39789 40800 39834 31047 45048
13835D5048J5018j2801l573N616K637m527j0936k0816l216n37m215K991L1361
$$ 45048 60066 47265 43692 49308 51945 47418 36482 15666 12450 11913 7698 10689 42050
13822D2050j3320k2399J5610K13L463n237o608j0300l933N5435K0407k8979j7650
$$ 42050 28730 6331 21941 22154 25617 20380 13772 3472 -461 54974 75381 46402 28752
13809B8752J6744J3399p528P42L0635J8913l090m6265k6197O054Q017l9348L7477
$$ 28752 45496 58895 51367 52109 82744 101657 98567 52302 26105 32159 40176 828 38305
13796C8305L0707n651l4711q230J5294J9998R370j708p356r386J0454q151l1016
$$ 38305 69012 63361 28650 20420 35714 55712 65082 63374 56018 46632 57086 48935 17919
13783A7919j3301R802M316J8714n171J6824K0906O025j5144j0817p139O269r671
$$ 17919 4618 14420 18736 37450 32279 49103 70009 76034 60890 50073 42934 49203 39532
13770C9532L5872P531J0600j1100j3955P276K6177K6189L918l0222n4968o196
$$ 39532 75404 82935 93535 82435 68480 75756 101933 128122 132040 101818 46850 40654
13758D0654K8599K8713q983J7233L645L0r91o7j9576K0609J5430j1701m6855K1757
$$ 40654 69253 97966 88983 106216 109861 109891 108900 108833 89257 109866 125296 113595 66740 88497
13744H8497Q487J0468M346l3404k3192p422J2208p288Q857K8671K4463k8470l1059
$$ 88497 96984 107452 111798 78394 55202 47780 59988 52700 61557 90228 114691 86221 55162
13731E5162K3790j3203j0380R415K7988o439m340j9378j2004L596J1477J1896
$$ 55162 78952 65749 55369 64784 92772 86333 81993 62615 50611 54207 65684 77580
13719G7580K0777o038q813K2224Q310k3176J1381N5488k0231j478k0018l7402
$$ 77580 98357 92319 83506 105730 114040 90864 102245 157733 137502 136024 116006 78604
13707G8604p299Q831J4412Q261j7810J1495O179J507N152J3996q847l6960j5855
$$ 78604 71305 80136 94548 102809 84999 96494 102673 104180 109332 123328 114481 77521 61666
13694F1666j8846l320K9337o825K326L166J4936J6718o064L026O614k309k1672
$$ 61666 42820 39500 68837 62012 64338 67504 82440 99158 93094 96120 102734 100425 78753
13681G8753k1541o294L2784L8364q365m8396m5096M477K3686L0523K3565P426
$$ 78753 57212 50918 83702 122066 113701 65305 20209 24686 48372 78895 102460 109886
13669A09886Q925K6860j0826R523M437k3676k1060J0239O279l581M169j0697L544
$$ 109886 118811 145671 134845 144368 148805 125129 104069 114308 120587 117006 121175 110478 114022
13656A14022L3766m65M225o655J0449j099j5698p461j6145j5165R8p138N0734
$$ 114022 147788 147323 151548 144893 155342 154243 138545 131084 114939 99774 99872 92734 143468
13643A43468L4989k3713n934k5066l0133k0978K0908K6573K032J710j336J1927
$$ 143468 178457 154744 148810 123744 93611 72633 93541 120114 122146 123856 122520 134447
13631A34447k3312J4871p136K0057L5866j1065n320k0148j1099n020n827j4179
$$ 134447 111135 126006 118870 138927 174793 163728 158408 138260 127161 122141 116314 102135
13619A02135L8818L4683n0164j3306J4852N776K1459q764k0544j6816j2124J8351
$$ 102135 140953 175636 125472 112166 127018 132794 154253 145489 124945 108129 96005 114356
13607A14356K6067J7232J3211M984K0828k5439m3430k458j6055q079M645p267
$$ 114356 140423 157655 170866 175850 196678 171239 127809 125351 109296 101217 105862 98595
13595I8595k1333K2867M4357n357j5426J019n985K3770j8383k2559r968k5257
$$ 98595 77262 100129 144486 139129 123703 124722 118737 142507 124124 101565 91597 66340
13583F6340M930M4019L4915k0510r97R233k0757J464R815O200J5496K1664k2821
$$ 66340 71270 115289 150204 129694 128697 137930 117173 118637 128452 134652 150148 171812 148991
13570A48991j4062J6025P167k2380J9936k6030j9766J638J6580J2044k3366K7527
$$ 148991 134929 150954 158121 135741 155677 129647 109881 111519 128099 140143 116777 144304
13558A44304J6894j1447p8J8901J875R184K336J6758k9294j7072K0469K5255j6795
$$ 144304 161198 149751 149673 168574 170449 179633 181969 198727 169433 152361 172830 198085 181290
13545A81290q775q983O78j0582p153j1505L949N834M467N0661L6780l1989j8713
$$ 181290 172515 163532 164210 153628 146475 134970 138919 144753 149220 199881 236661 204672 185959
13532A85959O073M2585J0661l2162k0336l3290J4565J5644J319j1484L5697L113
$$ 185959 192032 234617 245278 213116 192780 159490 174055 189699 191018 179534 215231 218344
13520B18344j4990j1890m230K5564N719R351L2410O086r824l5010l9068o417M808
$$ 218344 203354 191464 187234 212798 218517 227868 260278 266364 256540 221530 182462 176045 180853
13507A80853r108J4508L0231J7036J7500j2056L2840r146j7281p982J3507n290
$$ 180853 171745 186253 216484 233520 251020 238964 271804 262658 245377 237395 250902 245612
13495B45612j523K555l931N912j5754P975K8225p960J1034K6841O88p414m2498
$$ 245612 244089 246644 242713 248625 232871 240846 269071 261111 272145 298986 299674 292260 249762
13482B49762j7289J0344J5245M317K794K0095K340p848J7942j2351p89j8113R731
$$ 249762 232473 242817 258062 262379 265173 285268 287608 279760 297702 285351 284562 266449 276180
13469B76180J8214K8076Q795j2769k783j9382J2650M0512L0612m25o85j252J7312
$$ 276180 294394 322470 331265 318496 315713 296331 308981 349493 380105 379680 378995 377743 395055
13456C95055K2698r125j0349j412r116o864J6328Q170O91J8112k49L731n611r62
$$ 395055 417753 408628 398279 396867 387751 380887 397215 405385 406076 424188 423939 427670 422059 421097
13442D21097J8306j6495j1135k7191K7616M8485k212k6496K994L9104J7444K580
$$ 421097 439403 422908 411773 384582 412198 460683 458471 431975 434969 474073 491517 494097
13430D94097l757p490J963J9365K2894p045k3726J4149K0257o632o843J6076l93
$$ 494097 490340 482850 484813 504178 527072 520027 496301 510450 530707 524075 517232 533308 532915
13417E32915K5335J9607K9956M056k3432l2498l0092M9004N4022J0001J1823K0874
$$ 532915 558250 577857 607813 611869 588437 555939 525847 574851 628873 638874 650697 671571
13405F71571J5190J1401M064k0328J7889K6807N275r800K298j0834j0065J6125
$$ 671571 686761 698162 702226 681898 699787 726594 731869 722069 724367 713533 703468 719593
13393G19593M2420L2351J3745j8593L401K1979K9825L8102P655j6005K3332J4862
$$ 719593 762013 794364 808109 789516 792917 814896 844721 882823 890478 874473 897805 912667
13381I12667K3208K072J6567K3243J0245K2736N0580L6182L845N593K8698J4469
$$ 912667 935875 937947 954514 977757 988002 1010738 1061318 1097500 1101345 1106938 1135636 1150105
13369A150105O842M0632N5908M0645K3118L0611L2481P5864J0550J4507R573O9846
$$ 1150105 1156947 1197579 1253487 1294132 1317250 1347861 1380342 1456206 1466756 1481263 1490836 1560682
13357A560682N6569N3637J3128K4670R927N4848N0706P5906N3351L8722N6080
$$ 1560682 1617251 1670888 1684016 1708686 1718613 1773461 1824167 1900073 1953424 1992146 2048226
13346B048226O4412M0363M5283M9577P6301O1633L2886N7478Q6944O8793O7809
$$ 2048226 2112638 2153001 2198284 2247861 2324162 2385795 2418681 2476159 2563103 2631896 2699705
13335B699705Q0577P3156Q7567J22978P3046N7834Q9476R8502P4998J11916J01852
$$ 2699705 2780282 2853438 2941005 3063983 3137029 3194863 3284339 3382841 3457839 3569755 3671607
13324C671607J07820J00792Q7486J34035J34582J14939J00091J01260J04207R6483
$$ 3671607 3779427 3880219 3967705 4101740 4236322 4351261 4451352 4552612 4656819 4753302
13314D753302Q4874J05168J19169R7309P0953P0124J13902J28350R0387N3860
$$ 4753302 4838176 4943344 5062513 5159822 5230775 5300899 5414801 5543151 5633538 5687398
13304E687398J15231R3771Q8952R1850R7891R8391N0846L8917R1701O0752J9774
$$ 5687398 5802629 5896400 5985352 6077202 6175093 6273484 6324330 6363247 6454948 6515700 6535474
13293F535474M5993M1154M3438O4956M0067P780Q223L4929J920J3469M1236L483
$$ 6535474 6581467 6622621 6666059 6731015 6771082 6778862 6787085 6822014 6823934 6837403 6878639 6882122
13281F882122j4887r713j2362N59k0270l9227m7979m7633Q906R865j9173m2674
$$ 6882122 6867235 6857522 6845160 6845719 6825449 6786222 6738243 6690610 6699516 6709381 6690208 6647534
13269F647534n3296l4157k4551j5874k4375k8247o4883p7944j8702j1033k5120
$$ 6647534 6594238 6560081 6535530 6519656 6495281 6467034 6402151 6324207 6305505 6294472 6269352
13258F269352k8675m4803j9599k449m8809j5496K943m5880k6198k7827j7505K706
$$ 6269352 6240677 6195874 6176275 6173826 6125017 6109521 6112464 6066584 6040386 6012559 5995054 5997760
13246E997760K6936J2961L0432J6031M1571M5202M3977L6850j6234P629L8305
$$ 5997760 6024696 6037657 6068089 6084120 6125691 6170893 6214870 6251720 6235486 6243115 6281420
13235F281420Q7580K2441Q487P6820Q3262P5306L3809K1141O7608N4653N6646
$$ 6281420 6369000 6391441 6399928 6476748 6560010 6635316 6669125 6690266 6757874 6812527 6869173
13224F869173O1449O4073N1273N1681K5774M0294L2259L7521K3309M8902N7406
$$ 6869173 6930622 6994695 7045968 7097649 7123423 7163717 7195976 7233497 7256806 7305708 7363114
13213G363114K4956J9292M2839M7321J8149R789J2922K999m270L2783L4272M3142
$$ 7363114 7388070 7407362 7450201 7497522 7515671 7525460 7538382 7541381 7537111 7569894 7604166 7647308
13201G647308P7631J19761J46399R1803M127p4349r3342j37091k03242k61681
$$ 7647308 7724939 7844700 7991099 8082902 8087029 8012680 7919338 7782247 7579005 7317324
13191G317324j95683j50286j36986r1381j04181j08043q2954j06427p5430r6522
$$ 7317324 7121641 6971355 6834369 6742988 6638807 6530764 6447810 6341383 6265953 6169431
13181F169431j43961j22836j07564j28041j06028j03057j38166j28826j01672
$$ 6169431 6025470 5902634 5795070 5667029 5561001 5457944 5319778 5190952 5089280
13172E089280q9575r5134j04129r6778r8416n5889r0327j08773r2500o6517p6281
$$ 5089280 4999705 4904571 4800442 4703664 4605248 4549359 4459032 4350259 4257759 4191242 4114961
13161D114961n6769k1848K4854J12826J47318K44307M02512L78484L03157J26481
$$ 4114961 4058192 4036344 4061198 4174024 4321342 4565649 4968161 5346645 5649802 5776283
13151E776283p280j38641k82478n14706o18010n09186l60169k23969j61951j62674
$$ 5776283 5769003 5630362 5347884 4833178 4215168 3705982 3345813 3121844 2959893 2797219
13141B797219j33657o7528p7606r3485q4095j06278m5595m1406m2818m7228o2092
$$ 2797219 2663562 2596034 2518428 2424943 2340848 2234570 2188975 2147569 2104751 2057523 1995431
13130A995431n4923j8334n4765p8618n6378k6284k4596k2491o324j0427j4662
$$ 1995431 1940508 1922174 1867409 1788791 1732413 1706129 1681533 1659042 1652718 1642291 1627629
13119A627629m483l978Q607J3786N1365Q2718J14294K16690L11709M53667N21414
$$ 1627629 1623146 1619168 1627775 1641561 1692926 1775644 1889938 2106628 2418337 2872004 3393418
13108C393418L82241J89167P4047q4616k34687m21065n40962n46490l78125k28273
$$ 3393418 3775659 3964826 4038873 3954257 3719570 3298505 2757543 2211053 1832928 1604655
13098A604655j28470r4362p1087q9863n8797o7888k6067k5110k1843j9735l6518
$$ 1604655 1476185 1381823 1310736 1220873 1162076 1094188 1068121 1043011 1021168 1001433 964915
13087I64915j4960k1460o551k0746j9620j6972k2601l1800l3782l4246j8887O389
$$ 964915 949955 928495 921944 901198 881578 864606 842005 810205 776423 742177 723290 729679
13075G29679J1886j3976m6025j3308K4178K7024L8092O773M9371J24054J25681
$$ 729679 741565 727589 681564 668256 692434 719458 757550 764323 813694 937748 1063429
13064A063429J67268J33346R0199M2351n130l6108j23734j92529j69306j64986
$$ 1063429 1230697 1364043 1454242 1496593 1491463 1455355 1331621 1139092 969786 804800
13054H04800j01818p2212l2751l854l1200m7080k4720l8957K0089N13k4425j4074
$$ 804800 702982 630770 598019 594165 562965 515885 491165 452208 472297 472810 448385 434311
13042D34311L3854p816k6117n915l542l0372n1788r108j0820j0727J0663M4851
$$ 434311 468165 460349 434232 428317 424775 394403 342615 333507 322687 311960 322623 367474
13030C67474K4536j0259k4226j1675n42K19j6447j0646K634j0301k523j6308k7941
$$ 367474 392010 381751 357525 345850 345308 345527 329080 318434 321068 310767 308244 291936 263995
13017B63995N28K465l890j653j8225j5835J3702j3104j5197J6148J6660N751l457
$$ 263995 264523 266988 263098 261445 243220 227385 241087 227983 212786 228934 245594 251345 247888
13004B47888q195K5470K680l5949J0429r143n1008O722L5405J60J7418o303k0343
$$ 247888 239693 265163 267843 231894 242323 233180 182172 188894 224299 224459 241877 235574 215231
12991B15231k1318J788k6884j7077J0753K110K520l6009o701M2147K8526p37j3903
$$ 215231 193913 195701 168817 151740 162493 164603 167123 131114 124413 166560 195086 194349 180446
12978A80446l2870q691j2265l910o612j5264J5778J1242K248q191j1690m41J2042
$$ 180446 147576 138885 126620 122710 116098 100834 116612 127854 130102 121911 110221 109780 121822
12965A21822K6965J18J1120p295k3063l405K5240q590j0676L002J2630J2713O600
$$ 121822 148787 148905 160025 152730 129667 126262 151502 142912 132236 135238 147868 160581 167181
12952A67181n353N445O973Q946j2110n995j5601J722j7576j5442K8692J126k5079
$$ 167181 161828 167273 174246 183192 171082 165087 149486 151208 133632 118190 146882 148008 122929
12939A22929MJ8229K3743j3239o2465o625R144P494O823L9014L596j5894k1148
$$ 122929 122933 141162 164905 151666 89201 82576 91720 99214 106037 145051 148647 132753 111605
12926A11605j2637n013k0867n737O417J5894l65j0918L213J0653L491m356J8047
$$ 111605 98968 93955 73088 67351 73768 89662 89297 78379 81592 92245 95736 91380 109427
12913A09427l48q026K2912k7267k3437j1215j3639J2794N04M9530K3304Q165J867
$$ 109427 109079 101053 123965 96698 73261 62046 48407 61201 61705 111235 134539 142704 144571
12900A44571j4870L1630K8092j2656K2775K6872M0830J4267K4037L6118M3456
$$ 144571 129701 161331 189423 176767 199542 226414 267244 281511 305548 341666 385122
12889C85122L1746Q669k3337l1738k3437k8686k9322m2026N858j2599j5266k7086
$$ 385122 416868 425537 402200 370462 347025 318339 289017 246991 252849 240250 224984 197898
12877A97898l4547k6258K674J9469J1370k5592k2995J8410j740l3911J1401j2237
$$ 197898 163351 137093 139767 159236 170606 145014 122019 140429 138689 104778 116179 103942
12865A03942k2302j6384r001K6823M0477J7814j5528j1168m423n569j2998j7216
$$ 103942 81640 65256 56255 83078 123555 141369 125841 114673 110250 104681 91683 74467
12853G4467L670P626K0004K790j1229j6923J1357j9097k263r606j5702L4501L9271
$$ 74467 78137 85763 105767 108557 97328 80405 91762 72665 70402 60796 45094 79595 118866
12840A18866K8778k3214n5685K790q542l4841M3965P677P620J6702n03K3825m068
$$ 118866 147644 124430 68745 71535 62993 28152 72117 79794 87414 104116 103613 127438 123370
12827A23370j2709k0884k7476j1873Q707L875J2150K8043p927j3489m350j8018
$$ 123370 110661 89777 62301 50428 59135 63010 75160 103203 95276 81787 77437 59419
12815E9419n783L891j9752m494J9342K5842M757J3900K3121M679r075j8653k4539
$$ 59419 53636 57527 37775 33281 52623 78465 83222 97122 120243 124922 115847 97194 72655
12802G2655N29J7367k7325r924Q043j4615k0714K2855K6655j0280J3236K0141
$$ 72655 73184 90551 63226 53302 61345 46730 26016 48871 75526 65246 78482 98623
12790I8623k86J6790k5706l9126J317L0339K8074k328l2255R170J5838j6086l8980
$$ 98623 98337 115127 89421 50295 51612 81951 110025 107697 75442 84612 100450 84364 45384
12777D5384l0599J4662M3501k4k7258R499o624J12Q959J453L1097L026j7491l5141
$$ 45384 14785 29447 72948 72924 45666 55165 48541 48653 57612 59065 90162 93188 75697 40556
12763D0556j6787K3664K9911K0492J7585n147k3456o23J6993j3683J2741M4121
$$ 40556 23769 47433 77344 97836 115421 110274 86818 86195 103188 89505 102246 146367
12751A46367r48k6255m5987j6397J6679J3028J6769J826J0862J9319L614k6383
$$ 146367 145419 119164 73177 56780 73459 86487 103256 105082 115944 135263 138877 112494
12739A12494p355Q998J9079k1525k4278r773K1436K2606l777j1928K229K330j5935
$$ 112494 105139 114137 133216 111691 87413 77640 99076 121682 117905 105977 108206 110536 94601
12726I4601l5529p341r18j010P638J1225l5064k4691L2606J8778J7944p195P052
$$ 94601 59072 51731 50813 49803 57441 68666 33602 8911 41517 60295 78239 71044 78096
12713G8096J4180J3943o847Q943K2294j5788O130m868j9047k9275Q900K5833k1480
$$ 78096 92276 106219 99372 108315 130609 114821 120951 116083 97036 67761 76661 102494 81014
12700H1014k7528k0484K678K6360M0260L8000O563r884P203J370j206o912M426
$$ 81014 53486 33002 35680 62040 102300 140300 146863 136979 144182 145552 144346 137434 141860
12687A41860N226j0756n83j1677k2980j9479k8685k4968R630J0438J5277K2035
$$ 141860 147086 136330 135747 124070 101090 81611 52926 27958 37588 48026 63303 85338
12675H5338M019P358n639l865K7659M7514O6K0055k2490l7770m161p486k302k1005
$$ 85338 89357 96715 91076 87211 114870 162384 162450 182505 160015 122245 118084 110598 108296 87291
12661H7291o796K5105k658j2915m385j4330K0813J1823k0000J134j4161j775j75
$$ 87291 80495 105600 102942 90027 85642 71312 92125 103948 83948 85082 70921 69146 68971
12648F8971J3622K6219k957Q558j6423K725J5434q736o324M290m370j0817J2811
$$ 68971 82593 108812 105855 114413 97990 100715 116149 107413 101089 105379 101009 90192 103003
12635A03003J8615M638J0901l5385j3505K009J9186K3038L572J7935L930k021
$$ 103003 121618 126256 137157 101772 88267 90276 109462 132500 136072 154007 157937 155916
12623A55916o301j5476N579r994K396j109p811j6113J5734j4751L2125N9049J9486
$$ 155916 149615 134139 139718 129724 132120 131011 123200 107087 122821 108070 140195 199244 218730
12610B18730m620j8462p572L130n868m88K0453j2925R55m1017n5369J2483J6819
$$ 218730 214110 195648 188076 191206 185338 184850 205303 192378 193333 152316 96947 109430 126249
12597A26249M4076J3760k6160k9492M084N8494P920L569l421j9945k238q80j310
$$ 126249 170325 184085 157925 128433 132517 191011 198931 202500 199079 179134 176896 176016 174706
12584A74706J270J5751K6256j267J1593K8760L6277j5030k6256K9256N0124K2435
$$ 174706 175976 191727 217983 216716 228309 257069 293346 278316 252060 281316 331440 353875
12572C53875j2458p040J7313p766k6450k6741j9605j6260k0693J848M462J4924
$$ 353875 341417 334377 351690 343924 317474 290733 271128 254868 234175 236023 240485 255409
12560B55409Q214K3157J5673m87l149j24J3985k9671O198L9086K2644O870l6643
$$ 255409 263623 286780 302453 301966 298817 298693 312678 283007 289205 328291 350935 357805 321162
12547C21162o440M7845K7738N2315J2732j7464r958L127M3318L0211M3753j3617
$$ 321162 314722 362567 390305 442620 455352 437888 427930 431057 474375 504586 548339 534722
12535E34722K347K3815M1839K9790O3668N2988Q7141K4693J1891N3950L7017K1551
$$ 534722 537069 560884 602723 632513 696181 749169 836310 861003 872894 926844 963861 985412
12523I85412k0391n796n52q186J8457P5414L2432M0233Q1179J01313Q1056Q8815
$$ 985412 965021 959225 958673 950487 968944 1044358 1076790 1117023 1198202 1299515 1380571 1469386
12511A469386J27815J19286J76431J54972J73332K14450J84625K12797K66776
$$ 1469386 1597201 1716487 1892918 2047890 2221222 2435672 2620297 2833094 3099870
12502C099870K67393K98653L32441M10295M33173N17491O92266Q89885J099742
$$ 3099870 3367263 3665916 3998357 4408652 4841825 5359316 6051582 6941467 8041209
12493H041209J411735J915110K573163L325649L957800M647164N558597O555758
$$ 8041209 9452944 11368054 13941217 17266866 21224666 25871830 31430427 37986185
12485C7986185O923378N974637M529861M121931M132852K422992j176402l515948
$$ 37986185 44909563 50884200 55414061 59535992 63668844 66091836 64915434 61399486
12477F1399486l603405l572894n061610o720172o641834n538227m565527l922143
$$ 61399486 57796081 54223187 49161577 42441405 35799571 30261344 25695817 21773674
12469B1773674l302707k617845k007290j527135j157005q89773p25156o29387
$$ 21773674 18470967 15853122 13845832 12318697 11161692 10271919 9546763 8917376
12461H917376n27352m53193m28647l57704l35159k96995l21212l45680l18087
$$ 8917376 8390024 7936831 7508184 7150480 6815321 6518326 6197114 5851434 5533347
12452E533347k84277k62552k54574k62762k41444k25300k05490k11955j83721
$$ 5533347 5249070 4986518 4731944 4469182 4227738 4002438 3796948 3584993 3401272
12443C401272j20753j02875j40867j32419j12416j05467j09200p1217r4537r8334
$$ 3401272 3280519 3177644 3036777 2904358 2791942 2686475 2577275 2506058 2411521 2313187
12433B313187r5033j12059j20617q4506n1189n3822o2219o4194o0606q8319o9656
$$ 2313187 2218154 2106095 1985478 1900972 1849783 1795961 1733742 1669548 1608942 1520623 1450967
12422A450967m9346m3387m4151l8844l3575n0957p7684m6835P544k0632m8154
$$ 1450967 1401621 1358234 1314083 1275239 1241664 1190707 1113023 1066188 1073732 1053100 1004946
12411A004946m8083k0850m5334j2570K172n398L518k7671n3646m3271q391p900
$$ 1004946 956863 936013 890679 878109 880281 874883 878401 850730 797084 753813 745422 737522
12399G37522r885k5943k2918k7393l7107q622k0553j9533j4324j1076m5063j9987
$$ 737522 727637 701694 678776 651383 614276 605654 585101 565568 551244 540168 495105 475118
12387D75118j8561j4269k4773m5594m409J2506L318k4834J522k383L234K2834
$$ 475118 456557 442288 417515 371921 367512 380018 383336 358502 360024 357641 360875 383709
12375C83709j1812k2483j8943k6352j6228m1861o531K2133K7283J7599j9556k7579
$$ 383709 371897 349414 330471 304119 287891 246030 239499 261632 288915 306514 286958 259379
12363B59379k9393k7117j9223n153J8203K078l3554o8323k3077N188K8948K379
$$ 259379 229986 202869 183646 178493 196696 198774 165220 96897 73820 79008 107956 110335
12351A10335l7610J9274K1717j6584P562k2951k8991m455o908Q474o500j0663
$$ 110335 72725 91999 113716 97132 104694 81743 52752 48297 41389 49863 43363 32700
12339C2700L9117l7866l3851R173J1275K541j5888j5358j1641O484R795L1137
$$ 32700 71817 33951 100 9273 20548 23089 7201 -8157 -19798 -13314 -3519 27618
12327B7618J2534L614J958K1746j9486l6777J1223l663j4866j3139j3991l2345
$$ 27618 40152 43766 45724 67470 47984 11207 22430 18767 3901 -9238 -23229 -55574
12315e5574K028J2181J4902J8534J6252p035n665Q156n726L91k6989k5368O139
$$ -55574 -53546 -41365 -26463 -7929 8323 1288 -4377 3779 -1947 -1556 -28545 -53913 -47774
12302d7774K1455n214J4465J4737J5868n135l736k5226j1832k1241O054m295J600
$$ -47774 -26319 -31533 -17068 -2331 13537 8402 4666 -20560 -32392 -53633 -47579 -51874 -50274
12289e0274J4318l327J7209N423m471M535L91m70J8699j7886k2661L1575O586
$$ -50274 -35956 -39283 -22074 -16651 -21122 -16587 -16196 -16666 2033 -15853 -38514 -6939 -353
12276c53j473J2861j099k8908k3266M394K1649q456n750j7956L551j1929R983
$$ -353 -1826 11035 9936 -18972 -42238 -37844 -16195 -24651 -30401 -48357 -44806 -56735 -46752
12263d6752M9384J0359j0567R349J0246j4964k3406l372l1487Q00N2788N2797
$$ -46752 2632 12991 2424 11773 22019 7055 -16351 -19723 -51210 -50410 2378 55175
12251E5175l539l1437j3875j5283k018j3577J2705L793J0693o892l379j8552l8115
$$ 55175 51636 20199 6324 -8959 -10977 -24554 -11849 -8056 2637 -4255 -7634 -26186 -64301
12238f4301J7587N423J9462r270q696k1437K778l4076O078J8194J9300q337q83
$$ -64301 -46714 -41291 -21829 -31099 -39795 -61232 -58454 -92530 -86452 -68258 -48958 -57295 -58178
12225e8178Q409j6750J897J0783j0224K5754M2653Q099J5639L337O180j0836k9080
$$ -58178 -49769 -66519 -64622 -53839 -64063 -38309 4344 12443 28082 31419 37599 26763 -2317
12212b317n069q033q584j1462j875J2262M391l0214p662k222K350J1474j9998
$$ -2317 -7386 -15419 -24003 -35465 -37340 -25078 -20687 -50901 -58563 -60785 -58435 -46961 -66959
12199f6959K0118k8629J399L2191j1139k6094N207K7515j3037k0887J8279J1570
$$ -66959 -46841 -75470 -74071 -41880 -53019 -79113 -73906 -46391 -59428 -80315 -62036 -50466
12187e0466p346K2496l359K1412k3724j1436P470o796k4757j4427p01P667J5488
$$ -50466 -57812 -35316 -38675 -17263 -40987 -52423 -44953 -51749 -76506 -90933 -91634 -83967 -68479
12174f8479J9792K123k0103J960K7491K2027k7823l9094J6058l385q757J2230
$$ -68479 -48687 -46564 -66667 -64707 -37216 -15189 -43012 -82106 -66048 -69433 -78190 -65960
12162f5960M2039K3765j4618k0421N048K062j275R279K3094J3818j7871l1107
$$ -65960 -23921 -156 -14774 -35195 -30147 -28085 -29360 -20081 3013 16831 -1040 -32147
12150c2147l6961j2835l501M805Q233M2788L8264k8528j278J5287l3795j2963
$$ -32147 -69108 -81943 -85444 -80639 -72406 -29618 8646 -19882 -21160 -5873 -39668 -52631
12138e2631P04J5512K4842N979N145J6298L179l8482q60P351q717j4129m778L482
$$ -52631 -51927 -36415 -11573 -5594 -449 15849 19028 -19454 -20314 -12963 -21680 -35809 -40587 -37105
12124c7105J6365J9987M200j0583k4075r90J1098j413j3340m850j6946n494K9888
$$ -37105 -20740 -753 3447 -7136 -31211 -32201 -21103 -22516 -35856 -40706 -57652 -63146 -33258
12111c3258L019N122O129j2180J0240L2695j4162j1084m6172k3583m166K2014
$$ -33258 -30239 -25117 -18988 -31168 -20928 11767 -2395 -13479 -59651 -83234 -87400 -65386
12099f5386J8135m834k0442J7166M64R463k701J6776j4831j8298K7659N079l4023
$$ -65386 -47251 -52085 -72527 -55361 -54897 -45434 -48135 -31359 -46190 -64488 -36829 -31750 -65773
12086f5773M3152K8028j7439j035r451Q471K0073j0010l888K2620L2212M7941
$$ -65773 -22621 5407 -12032 -13067 -22518 -14047 6026 -3984 -7872 14748 46960 94901
12074I4901N9243L0899K241K3816L4095K06K4842Q897p855j245l7436J945k8968
$$ 94901 154144 185043 187284 211100 245195 245401 270243 279140 271285 270040 232604 234549 205581
12061B05581k8751j8840k50k3949m0599m4877m064k0957J083p740j124P581J3645
$$ 205581 176830 157990 157740 133791 93192 48315 44251 23294 24377 16637 15513 23094 36739
12048C6739j6823Q641k1811k5694k387K2575J8474N975q537k6277J3162J4985
$$ 36739 19916 28557 6746 -18948 -21335 1240 19714 25689 17152 -9125 4037 19022
12036A9022n995P905M773j8707r784J6128k4025O704q54j8641j6186l1573k183
$$ 19022 13027 20932 25705 6998 -2786 13342 -10683 -3979 -4833 -23474 -39660 -71233 -73416
12023g3416J337j2970R494K3440J6990j8717p886p313R548J9425j3797J129J0108
$$ -73416 -72079 -85049 -75555 -52115 -35125 -53842 -61728 -69041 -59493 -40068 -53865 -52736 -42628
12010d2628M0341j2107p599k6656J4480K9245J4423j1861K75n072j2440n619J2924
$$ -42628 -2287 -14394 -21993 -48649 -34169 -4924 9499 -2362 -2087 -7159 -19599 -25218 -12294
11997a2294K2189O917k5986j6348K5164M2158j3539j8339j2320l3831N628J4147
$$ -12294 9895 16812 -9174 -25522 -358 41800 28261 9922 -2398 -36229 -30601 -16454
11985a6454O565N214j8336j3054k5993k2M0941L479P487J3565K961l0281K4948
$$ -16454 -9889 -4675 -23011 -36065 -62058 -62080 -21139 -17660 -10173 3392 6353 -23928 1020
11972A020Q425J1754R851j0673P92j8161L244J0795P847j7179q310j5314k5695
$$ 1020 9445 21199 31050 20377 21169 3008 6252 17047 24894 7715 -595 -15909 -41604
11959d1604j6581k129J0288J0884O984K8952k822j4220k8351k602Q845L4356o183
$$ -41604 -58185 -60314 -50026 -39142 -32158 -3206 -6028 -20248 -48599 -51201 -42356 -8000 -14183
11946a4183l987o297l258N28o192p481j195N2701J999k7259n63J7753l0129j3497
$$ -14183 -18170 -24467 -27725 -27197 -33389 -40870 -42065 10636 12635 -14624 -15187 2566 -27563 -41060
11932d1060Q679Q585N041J3618J3375j4967j1999K5017K6530l315O47q321j7580
$$ -41060 -32381 -23796 -18755 -5137 8238 -6729 -18728 6289 32819 29504 30151 21830 4250
11919D250J256j364o124K0950l920m3410K165L6244J638K1883l6496k1537K288
$$ 4250 5506 4142 -1982 18968 15048 -28362 -26197 10047 11685 33568 -2928 -24465 -22177
11906b2177p507N989R501o597r036j6585l135K0441L3869K7462J2631K6704l831
$$ -22177 -29684 -23695 -14194 -20791 -29827 -46412 -49547 -29106 4763 32225 44856 71560 67729
11893F7729k4661k0618J6607K1004J3944l9304l7979K352K1411R184r56l0900
$$ 67729 43068 22450 39057 60061 74005 34701 -3278 -926 20485 29669 28713 -2187
11881b187j7897k6264k0336N852K1294m991m26K7253j142k3881K0949J5414J2860
$$ -2187 -20084 -46348 -66684 -60832 -39538 -44529 -44955 -17702 -18844 -42725 -21776 -6362 6498
11868F498K7768J4907k3858j6579Q378J7148Q319j1447k3772P197j2529K0005
$$ 6498 34266 49173 25315 8736 17114 34262 42581 31134 7362 14559 2030 22035
11856B2035K2454k3248j8797j0148j3261R755j766J6540K5422j1312k5520K124
$$ 22035 44489 21241 2444 -7704 -20965 -11210 -12976 3564 28986 17674 -7846 -5722
11844e722k0309K752j966j1918N3602L4386o311k9386j5293P294o811p037K8635
$$ -5722 -26031 -23279 -25245 -37163 16439 50825 44514 15128 -165 7129 318 -6719 21916
11831B1916J1290j4951R711L0806L0260N516k2240j9234m7330l0642n232j344
$$ 21916 33206 18255 27966 58772 89032 94548 72308 53074 5744 -24898 -30130 -31474
11819c1474j674J3753J8892J1488J6251q445l87J7637j7555n1814l598L352J5614
$$ -31474 -33148 -19395 -503 10985 27236 18791 18404 36041 18486 -33328 -36926 -33574 -17960
11806a7960k5128K3075O018o962R749M8187k2373j9471J3266m0304p065J8315
$$ -17960 -43088 -20013 -13995 -20957 -11208 36979 14606 -4865 8401 -31903 -38968 -20653
11794b0653n280J3429o317j2713J7086K3541K3534j7075R526K980l1657N597J1045
$$ -20653 -25933 -12504 -18821 -31534 -14448 9093 32627 15552 25078 28058 -3599 1998 13043
11781A3043j384k9021j6980L6281M6762P79M288k8986K366m594J1997k0065l3752
$$ 13043 11659 -17362 -34342 1939 48701 49480 53768 24782 27148 22554 34551 14486 -19266
11768a9266J1974K4419n185J3870O124M843m686j3298n817M578L41j9648j6914
$$ -19266 -7292 17127 11942 25812 31936 36779 32093 18795 12978 17556 17897 -1751 -18665
11755a8665M500l405j0146n937j1224k1751P500l599K0371K0605R362k894K1946
$$ -18665 -14165 -17570 -27716 -33653 -44877 -66628 -59128 -62727 -42356 -21751 -12389 -15283 6663
11742F663J9502J8400M279n351k5791k1309j8143j856K004j448N362M043L95K3685
$$ 6663 26165 44565 48844 43493 17702 -3607 -21750 -23606 -21602 -23050 -17688 -13645 -13250 10435
11728A0435M099l271L454j603n495p250k2730o414j9825K7455L1128P472J1227
$$ 10435 14534 11263 14717 13114 7619 369 -22361 -28775 -48600 -21145 9983 17455 28682
11715B8682k456K576K9941r912l1724l6652k6365J5271K2940L1445R899l1230
$$ 28682 26226 28802 58743 48831 17107 -19545 -45910 -30639 -7699 23746 33645 2415
11703B415J1353J2404K2216J4753m8422j9261O923j0814J6216k352N868l258N6350
$$ 2415 13768 26172 48388 63141 14719 -4542 2381 -8433 7783 5431 11299 8041 64391
11690F4391p132k2602j2086l4787J1871K169k7809L5004L2923m158L133l524L1772
$$ 64391 57259 34657 22571 -12216 -345 1824 -25985 9019 41942 37784 40917 37393 69165
11677F9165K9808j2960j7639j9839m091N08k748K389J3851p582n063k7855j218
$$ 69165 98973 86013 68374 48535 44444 44952 42204 44593 58444 50862 45799 17944 16726
11664A6726N373J9616J5573j5088P086m560n53j2495k1079K3803k1353p051L7641
$$ 16726 22099 41715 57288 42200 49286 44726 44173 31678 10599 34402 13049 5998 43639
11651D3639M9261o771l4126J4559p194J0118J0215Q785J2041j4510l7931K3632
$$ 43639 92900 86129 52003 66562 59368 69486 79701 88486 100527 86017 48086 71718
11639G1718K8314p219l6188r218K9223L3297N124m682O27p407Q017K0291J6560
$$ 71718 100032 92813 56625 47407 76630 109927 115051 110369 110996 103589 111606 131897 148457
11626A48457L904m5525k1191K1037p170j4043j168N444J6255j5611l195L685N127
$$ 148457 152361 106836 85645 106682 99512 85469 84301 89745 106000 90389 87194 90879 96006
11613I6006L7644K5034n674q155L1917M7823O446q230N7543J5240J4432L4361
$$ 96006 133650 158684 153010 144855 176772 224595 231041 222811 280354 295594 310026 344387
11601C44387l611K7314K8734N1369L3122N2388R9013J46450J51607J24793J33880
$$ 344387 340776 368090 396824 448193 481315 533703 632716 779166 930773 1055566 1189446
11590A189446J68991J73372J54963J24300O7020L2055L4372m3935p1579q4099
$$ 1189446 1358437 1531809 1686772 1811072 1878092 1910147 1944519 1900584 1829005 1744906
11580A744906j24744r0118q5448n2020m9702k0385J4271P4878J16146J37576J73944
$$ 1744906 1620162 1530044 1444596 1392576 1342874 1322489 1336760 1411638 1527784 1665360 1839304
11569A839304K16625K58882L22496L50605K98305K87488K33051J47125M4429l6654
$$ 1839304 2055929 2314811 2637307 2987912 3286217 3573705 3806756 3953881 3998310 3961656
11559C961656j16177k18088k84890k97478k85625k81329k62504j69357j31651
$$ 3961656 3845479 3627391 3342501 3045023 2759398 2478069 2215565 2046208 1914557
11550A914557p6719o5688o6088k2272O6371R7000Q9146J23986J50492J30288J38874
$$ 1914557 1837838 1772150 1706062 1683790 1750161 1847161 1936307 2060293 2210785 2341073 2479947
11539B479947J35070Q5374J0731j3888p3528j38391k07989j78435j37398j47778
$$ 2479947 2615017 2700391 2711122 2697234 2623706 2485315 2277326 2098891 1961493 1813715
11529A813715j16878j01318m8446l7756j1806M7835Q1397J05960J30907J85739
$$ 1813715 1696837 1595519 1547073 1509317 1497511 1545346 1626743 1732703 1863610 2049349
11519B049349K87048L30316L16854L49964L74622L60292K70223J88209R8551J0203
$$ 2049349 2336397 2666713 2983567 3333531 3708153 4068445 4338668 4526877 4625428 4635631
11509D635631j30570k37607k52460k63254k88956k53047j78693j00692k7156J9838
$$ 4635631 4505061 4267454 4014994 3751740 3462784 3209737 3031044 2930352 2903196 2923034
11499B923034Q0019J98410L15130L88351M97869O29565O65698O80800O97774O58241
$$ 2923034 3003053 3201463 3516593 3904944 4402813 5032378 5698076 6378876 7076650 7734891
11489G734891N30778L35958J06484j57811l55166n61670o33563o50912o91769
$$ 7734891 8265669 8601627 8708111 8550300 8195134 7633464 6999901 6348989 5657220
11480E657220o38929n22524l95775l01094k11054j54011r3625J8492J13060J45595
$$ 5657220 5018291 4495767 4099992 3798898 3587844 3433833 3340208 3358700 3471760 3617355
11470C617355K18309K70659K83749K65334K58401J98306R6865Q970j13801k38817
$$ 3617355 3835664 4106323 4390072 4655406 4913807 5112113 5208978 5217948 5104147 4865330
11460D865330l15529l62117l42855l52440l79404l69689k35784j71028j48374
$$ 4865330 4549801 4187684 3844829 3492389 3112985 2743296 2507512 2336484 2188110
11451B188110j05433p2417m7713R316J9686L153J12946J55957J96787J68947J55085
$$ 2188110 2082677 2010260 1962547 1971863 1991549 1994702 2107648 2263605 2460392 2629339 2784424
11440B784424J73552J14247J04938p008m6935j04023j58174j71707j65774j57782
$$ 2784424 2957976 3072223 3177161 3170153 3123218 3019195 2861021 2689314 2523540 2365758
11430B365758j57232j33258o7863j6459R069K4879P2609J37162J59185K60663
$$ 2365758 2208526 2075268 2007405 1990946 2000015 2024894 2097503 2234665 2393850 2654513
11420B654513L25444L65589M03997L53328L22900K81145J61447K6982r2053k12044
$$ 2654513 2979957 3345546 3749543 4102871 4425771 4706916 4868363 4895345 4803292 4591248
11410D591248k97109l45428l89176m06828l59203k60303k08149j49840j08140
$$ 4591248 4294139 3948711 3559535 3152707 2793504 2533201 2325052 2175212 2067072
11401B067072j13840l9448J7110M8853P8997Q3124J45597J37555J15944R5721
$$ 2067072 1953232 1913784 1930894 1979747 2058744 2141868 2287465 2425020 2540964 2636685
11391B636685N9734L7354j9845m6617j07314j67622k00798j91723k00670j89521
$$ 2636685 2696419 2733773 2713928 2667311 2559997 2392375 2191577 1999854 1799184 1609663
11381A609663j79637j63969j18860r2963p1329o1875l9109m7423k9447k6912m4094
$$ 1609663 1430026 1266057 1147197 1054234 982905 921030 881921 834498 805051 778139 734045
11370G34045k8858l6416l8933m0531m6050j8722j1248l4991l1102J5137Q897J17
$$ 734045 705187 668771 629838 589307 543257 524535 513287 478296 447194 462331 471228 471345
11358D71345q162k0948k1289k8043q403R466j9651j6776k8004m3463l3383k366
$$ 471345 463183 442235 420946 392903 384500 393966 374315 357539 329535 286072 252689 250323
11346B50323l206j1463J1735K7950J6056J4653N649J0764J9411j4567l5411J4228
$$ 250323 247117 235654 247389 275339 291395 306048 311697 322461 341872 327305 291894 306122
11334C06122J4725l9632j4112K1019l16l3573r679K7143J5959j2091p608K4038
$$ 306122 320847 281215 267103 288122 287806 254233 244554 271697 287656 275565 267957 291995
11322B91995j3376l4171j1585L102j3639n702K0352J4222J0068j8886J7231K9457
$$ 291995 278619 244448 232863 235965 222326 216624 236976 251198 261266 242380 259611 289068
11310B89068n810q203J3985J1865j0027r486L105O126K298n138k1223k7126k8681
$$ 289068 283258 275055 289040 300905 290878 281392 284497 290623 292921 287783 266560 239434 210753
11297B10753N168M8976M2623L0625l487k0544j6701k5459k1936K0279L1127j86
$$ 210753 215921 264897 307520 338145 334658 314114 297413 271954 250018 270297 301424 301238
11285C01238L5913K7970K437J8327J4735p468J0083O674k0919J764N096R392N4451
$$ 301238 337151 365121 367558 385885 400620 393152 403235 409909 388990 390754 395850 405242 459693
11272D59693Q910l4996K3149M6356j0321P480n069l6148K8293M4553M0917L1484
$$ 459693 468603 433607 456756 503112 492791 500271 495202 459054 487347 531900 572817 604301
11260F04301K8252K1697o060m18j0198K1578L8226L8703L295R259K2653M3226
$$ 604301 632553 654250 648190 647772 637574 659152 697378 736081 739376 748635 771288 814514
11248H14514M2456L5582M9717M735L8067M0407N8716K1815M8666J12494O6439
$$ 814514 856970 892552 942269 947004 985071 1025478 1084194 1106009 1154675 1267169 1333608
11237A333608L0914O0836Q9156Q8124R9718J30572J04128Q5296J16125J11191
$$ 1333608 1364522 1425358 1514514 1602638 1702356 1832928 1937056 2022352 2138477 2249668
11227B249668J48150J61074J54514J44098J50733J73944J85131J56784K00705
$$ 2249668 2397818 2558892 2713406 2857504 3008237 3182181 3367312 3524096 3724801
11218C724801K08980J78917K12224J62365J58386J91632J54576J40310Q6076P5632
$$ 3724801 3933781 4112698 4324922 4487287 4645673 4837305 4991881 5132191 5218267 5293899
11208E293899N6776Q9152J01013P9794P5743L2246N3733J6305j1909L5245K0638
$$ 5293899 5350675 5439827 5540840 5620634 5696377 5728623 5782356 5798661 5786752 5821997 5842635
11197E842635j2005j1895k7722m0266n7447r0042j06043j30559j26945j14792
$$ 5842635 5830630 5818735 5791013 5750747 5693300 5603258 5497215 5366656 5239711 5124919
11187E124919j43372j63292j19517j48900j53005j21916j08265j43319j69282
$$ 5124919 4981547 4818255 4698738 4549838 4396833 4274917 4166652 4023333 3854051
11178C854051j30901r6742r8368o4290n4354m5963n3366m2295j5347n857N127
$$ 3854051 3723150 3626408 3528040 3463750 3409396 3363433 3310067 3267772 3252425 3246568 3251695
11167C251695j6401j6995J2419M181N481L7606L0556P5307Q0518R5455R3107P5682
$$ 3251695 3235294 3218299 3230718 3234899 3240380 3277986 3308542 3383849 3464367 3559822 3652929 3728611
11155C728611N1790Q8952J27414J32400J77580K58653K19938K17167K06065K34092
$$ 3728611 3780401 3869353 3996767 4129167 4306747 4565400 4785338 5002505 5208570 5442662
11145E442662K50950K56188L03730L38184L37164K80501K81636K97817L52281
$$ 5442662 5693612 5949800 6253530 6591714 6928878 7209379 7491015 7788832 8141113
11136H141113L12512K74204K61216K40729K58522K35036J96166J88013J55703
$$ 8141113 8453625 8727829 8989045 9229774 9488296 9723332 9919498 10107511 10263214
11127A0263214J56969J89810J45115J02113Q3002L4695L9754K5583j754o1755
$$ 10263214 10420183 10609993 10755108 10857221 10940223 10974918 11014672 11040255 11038501 10976746
11117A0976746j05218p9347j03848j51107j57928j67004j76203k11449k22404
$$ 10976746 10871528 10792181 10688333 10537226 10379298 10212294 10036091 9824642 9602238
11108I602238k52015k87594l16083k97246k78784k75714k85516l00066l12925
$$ 9602238 9350223 9062629 8746546 8449300 8170516 7894802 7609286 7309220 6996295
11099F996295k70518k67663k52976k06663k33127k36299k02759j91318j97463
$$ 6996295 6725777 6458114 6205138 5998475 5765348 5529049 5326290 5134972 4937509
11090D937509j68195j57944j53812j11310j05768j09881j07164j04175j00722
$$ 4937509 4769314 4611370 4457558 4346248 4240480 4130599 4023435 3919260 3818538
11081C818538p8263n3375m4661q3617n2206j7009p005p072p542N285J9644K0144
$$ 3818538 3740275 3686900 3642239 3558622 3506416 3489407 3482402 3475330 3467788 3473073 3492717 3512861
11069C512861M3585M9868M4778N9686Q3237O4474J06864J27572J54951J38222
$$ 3512861 3556446 3606314 3651092 3710778 3794015 3858489 3965353 4092925 4247876 4386098
11059D386098J20373J41254J75562J35068J37705J84835J98480J18940R6603J31608
$$ 4386098 4506471 4647725 4823287 4958355 5096060 5280895 5479375 5598315 5694918 5826526
11049E826526J03308N6465N4801O7654N8609j2514j7458j7024j0254j1985L0028
$$ 5826526 5929834 5986299 6041100 6108754 6167363 6154849 6137391 6120367 6110113 6098128 6128156
11038F128156l171m5416q2266n3607o9566p7580m7853j12065j52054j47168j32437
$$ 6128156 6124985 6079569 5997303 5943696 5874130 5796550 5748697 5636632 5484578 5337410 5204973
11027E204973j44436j57804k02145j87790j50507j78099j95000j68079j70219
$$ 5204973 5060537 4902733 4700588 4512798 4362291 4184192 3989192 3821113 3650894
11018C650894j49871j40079j41117j35954j47193j02737j30364j32595j20398
$$ 3650894 3501023 3360944 3219827 3083873 2936680 2833943 2703579 2570984 2450586
11009B450586j01584j24156r9933r1720n3276p8109n7691j3897n9247p7932q4042
$$ 2450586 2349002 2224846 2124913 2033193 1979917 1901808 1844117 1830220 1770973 1693041 1608999
10998A608999o9398o2839m6024j0968k3126o0442n9526l2911j5447j3962o2777
$$ 1608999 1539601 1476762 1430738 1419770 1396644 1336202 1276676 1243765 1228318 1214356 1151579
10987A151579n7941l3177l3261m5570n2971k9484j9406j2401k0898j6628j0508
$$ 1151579 1093638 1060461 1027200 981630 928659 899175 879769 867368 846470 829842 819334
10976H19334k0083j5053k9408r202l9541m2321N812k8110p781l52k0046r097l56
$$ 819334 799251 784198 754790 745588 706047 663726 669538 641428 633647 633295 613249 604152 603796
10963F03796j1789m0340k5186j7394k6412o396M854q182J3538l0794q119J0777
$$ 603796 592007 551667 526481 509087 482675 476279 481133 472951 486489 455695 447576 458353
10951D58353k0219r599J2528k6310n639j2482m2049k6939r994k315o928J7366
$$ 458353 438134 428535 441063 414753 409114 396632 354583 327644 317650 315335 308407 325773
10939C25773J7823j2271M505j9089j3768k8942k9467k8917k1302J7817j2686J1182
$$ 325773 343596 331325 335830 316741 302973 274031 244564 215647 194345 212162 199476 210658
10927B10658M6946K0445m5543n4989J6530J4467m155O324k0049J0588J2104j0572
$$ 210658 257604 278049 232506 177517 194047 208514 204359 210683 190634 201222 213326 202754
10915B02754M464j1786j6452J3665k747N33l938k0790r490l5866M62L2398J414
$$ 202754 207218 195432 178980 192645 189898 190431 186493 165703 156213 120347 120809 153207 154621
10902A54621k1542j2160M786O463n575J5948k3067j9733K5390Q017k9188j3771
$$ 154621 133079 120919 125705 132168 126593 142541 119474 99741 125131 133148 103960 90189
10890I0189j7473J3804N99L6994R085m646l169j1146k2686j466Q97J7714J9287
$$ 90189 72716 86520 87119 124113 133198 128552 125383 114237 91551 90085 90982 108696 127983
10877A27983J5953J0362O60l4281j6793P589L447k6642n949n22k6259l624m319
$$ 127983 143936 154298 154958 120677 103884 111473 114920 88278 82329 81807 55548 51924 47605
10864D7605j3690p350J025K1705j8334j1988P410o498j4724J6954L4575J0911
$$ 47605 33915 26565 27590 49295 30961 18973 26383 19885 5161 22115 56690 67601
10852F7601K3799L2966k7854l7537R993l584o340P39M639m159k2936j5341k3171
$$ 67601 91400 124366 96512 58975 68968 65384 59044 59783 64422 60263 37327 21986 -1185
10839a185J3326M714O026m7607k959M7993M5981K00R613J2423l0745k1005L406
$$ -1185 12141 16855 22881 -24726 -27685 20308 66289 66489 76102 88525 57780 36775 40181
10826D0181o0M617l0756M812K214P589J5911j4639k0298k750L9886r757n462J2600
$$ 40181 40121 44738 13982 18794 21008 28597 44508 29869 9571 6821 46707 36950 31488 44088
10812D4088j2052j9011J961P445k7828n926J3482J9042k6857Q204J7700n209o405
$$ 44088 32036 13025 14986 22431 -5397 -11323 2159 21201 -5656 2548 20248 15039 8634
10799H634J1718K5851r373n832j617J7030J5856j3327l4334k1678K6377K8928
$$ 8634 20352 46203 36830 30998 29381 46411 62267 48940 14606 -7072 19305 48233
10787D8233j4655o996K5734K1717J8582K7551k0577j7901j7314j1j8984m24q91
$$ 48233 33578 26582 52316 74033 92615 120166 99589 81688 64374 64363 45379 44955 44064
10774D4064K3281J0114K0784k4242j4919p994j2781k8813k009L8552K8850J4278
$$ 44064 67345 77459 98243 74001 59082 51088 38307 9494 7485 46037 74887 89165
10762H9165j656l898j0793j4733M760O470j0693L9254j4960j1467M2012J9364
$$ 89165 87509 83611 72818 58085 62845 69315 58622 97876 82916 71449 113461 132825
10750A32825j5686q432K4676M1152O2578P8271P7686L4906L7167N4016M9982J5263
$$ 132825 117139 108707 133383 174535 237113 315384 393070 427976 465143 519159 569141 584404
10738E84404l5070J397m8382l4097o3764p9465o6784k0778k7041n9816j0268R174
$$ 584404 549334 550731 502349 468252 404488 325023 258239 237461 210420 150604 140336 149510
10726A49510L900j7597j8102N067J2436N930k7803l9759M699J1872m1081k2456
$$ 149510 153410 135813 117711 122778 135214 141144 113341 73582 78281 90153 49072 26616
10714B6616K5493J6797j0538r294P572o548q020L272j5543J313Q389M357J5664
$$ 26616 52109 68906 58368 49074 56646 50098 42078 45350 29807 31120 39509 43866 59530
10701E9530K5751k353R131k3514k563n431l2564J344j0207p249J4681J0052q06
$$ 59530 85281 82928 92059 68545 65982 60551 27987 29331 19124 11875 26556 36608 35802
10688C5802j7020J4287J1316q681K0873K8719j4411m7548J0600K4364l6078n591
$$ 35802 18782 33069 44385 35704 56577 85296 70885 23337 33937 58301 22223 16632
10676A6632R121L3812K1208k5286j9031j3179P065L593K1322J6125j4358j3018
$$ 16632 25753 59565 80773 55487 36456 23277 30342 33935 55257 71382 57024 44006
10664D4006J3024K67J7553M574k6157l0852r781L4355j3872r710M403k3633R24
$$ 44006 57030 57297 74850 79424 53267 22415 12634 46989 33117 23407 27810 4177 5101
10651E101K3008K904j5782p640l806L7187N0444J812k1460j5951k3443O526J4083
$$ 5101 28109 31013 15231 7591 3785 40972 91416 93228 71768 55817 32374 38900 52983
10638E2983n294R357n667j6316n096m804p40P875K1924M624k5770j5189q121J5033
$$ 52983 47689 57046 51379 35063 29967 25163 24423 32298 54222 58846 33076 17887 9766 24799
10624B4799K1189L3079J7549r041j5972n3921n377J7379J613P0J587n796J443
$$ 24799 45988 79067 96616 87575 71603 17682 12305 29684 31297 31367 32954 27158 28601
10611B8601l469P016L3296L210k2153j9813p279j0613K068R49J9917M72J2197
$$ 28601 25132 32148 65444 68654 46501 26688 19409 8796 10864 11813 31730 32202 44399
10598D4399K2248K2759k7249k0844K652k9897J457L0328J3738J5221m69J1750
$$ 44399 66647 89406 62157 41313 43965 14068 15525 45853 59591 74812 74343 86093
10586H6093J9094O238k7286l354k209j8020j5688m743L683K25P358N407k4427
$$ 86093 105187 111425 84139 80785 78576 60556 44868 40125 43808 44033 51391 56798 32371
10573C2371j6978k5588K4238J3997J2621J7150k4757j9210p042k5030p1J4548
$$ 32371 15393 -10195 14043 28040 40661 57811 33054 13844 6802 -18228 -18299 -3751
10561c751J6200K0756P183J528K8460j2659o370j8908o587L7762J9045K095j9268
$$ -3751 12449 33205 40388 41916 70376 57717 51347 32439 25852 63614 82659 84754 65486
10548F5486j8427O862m8756R272K7946K0213K0284P775j7757q614k3797J749p797
$$ 65486 47059 53921 5165 14437 42383 62596 82880 90655 72898 64284 40487 42236 34439
10535C4439j2259J8971j5905K7601r584j0298K6453J9047j8074j7652K4600O872
$$ 34439 22180 41151 25246 52847 43263 32965 59418 78465 60391 42739 67339 74211
10523G4211Q205j4570j8269K8297J1431m238J319j3765p847j3745L042J6605m202
$$ 74211 82416 67846 49577 77874 89305 85067 86386 72621 64774 51029 54071 70676 66474
10510F6474j1372l0713J0418j1200j3230l3671K1877N425k776o635P459M5706
$$ 66474 55102 24389 34807 23607 10377 -23294 -1417 4008 1232 -5403 2056 47762
10498D7762M3548Q81k0557r960k0054K3103L887K0015m305J4818J3531o150m3124
$$ 47762 91310 92191 71634 61674 41620 64723 68610 88625 84320 99138 112669 106519 63395
10485F3395r850R004l1258J0660L0281K4467K5336k7652m1693K0513R724q276
$$ 63395 53545 62549 31291 41951 72232 96699 122035 94383 52690 73203 82927 74651
10473G4651q58M1866J3159j0855m636L761j6349L1271M9295K6490j275j3272R424
$$ 74651 73793 115659 128818 117963 113327 117088 100739 132010 181305 207795 206520 193248 202672
10460B02672Q746K40j4220k3805j8288j7168K7982j451J3132j4070K981j5726
$$ 202672 211418 211658 197438 173633 155345 138177 166159 164708 177840 163770 166751 151025
10448A51025j7244L499J617Q186P586j702J0637J789O051j8889k7741K0397K2839
$$ 151025 133781 137280 138897 147083 154669 152967 163604 165393 171444 152555 124814 145211 168050
10435A68050L673p29R358J1765K0173K2747J6747O811k1946k0656J828k83n18
$$ 168050 171723 170994 180352 192117 212290 235037 251784 258595 236649 215993 217821 217538 217020
10422B17020J0175k7629l392Q358P817q35K0721k283l021j732L442m877L5351
$$ 217020 227195 199566 196174 204532 212349 211514 232235 229952 226931 225199 228641 223764 259115
10409B59115J0570p68J7393Q721P20K4563M1485m281o253K6065J2j1161O668k4555
$$ 259115 269685 268917 286310 295031 295751 320314 361799 357518 351265 377330 377342 366181 372849 348294
10395C48294l834J3342l088J2408l692P598J1685J6044N4862J8968J4156L5475
$$ 348294 344460 357802 354714 367122 363430 371028 382713 398757 453619 472587 486743 522218
10383E22218J3226K8146M2268J3464L8645K2445J8691K5360L5397L9420M3343
$$ 522218 535444 563590 605858 619322 657967 680412 699103 724463 759860 799280 842623
10372H42623O5016J3701K2996M6436P2162P1096N0549R4794R5628J03212Q6902
$$ 842623 907639 921340 944336 990772 1062934 1134030 1184579 1279373 1375001 1478213 1565115
10361A565115J34733J63209J65877J91820K31056K84732L19503L34461L91044
$$ 1565115 1699848 1863057 2028934 2220754 2451810 2736542 3056045 3390506 3781550
10352C781550M15119M33683N22349N70765O79550Q08775R92149J261845J657122
$$ 3781550 4196669 4630352 5152701 5723466 6403016 7211791 8203940 9465785 11122907
10343A1122907K238248L120783M325792N811631P285800Q644641R955484J1222747
$$ 11122907 13361155 16481938 20807730 26619361 33905161 42549802 52505286 63728033
10335F3728033J2066091J1567921R435044O620852L452253J49059l518845o873254
$$ 63728033 75794124 87362045 96797089 103417941 106870194 107019253 103500408 96627154
10327I6627154r523691j1271332j1157012j0058601q874746p778816o469443m945617
$$ 96627154 87103463 75832131 64675119 54616518 45741772 37962956 31493513 26547896
10319B6547896l637681k635840j990456j541188j210294j011930q35391p20592
$$ 26547896 22910215 20274375 18283919 16742731 15532437 14520507 13685116 12964524
10311A2964524o89597o86556o38079n42322n52303n29575n04523m58157m29519
$$ 12964524 12274927 11588371 10950292 10407970 9855667 9326092 8821569 8363412 7933893
10302G933893m08150l91178l50028l54894l18230k84559k64842k50288k19882
$$ 7933893 7525743 7134565 6784537 6429643 6111413 5826854 5562012 5311724 5091842
10293E091842k42417j90400j65881j81063j65573j30149j25338j63797j36954
$$ 5091842 4849425 4659025 4493144 4312081 4146508 4016359 3891021 3727224 3590270
10284C590270j30708j06903j13691j32737j18919r8444q9962n4280p7308o6559
$$ 3590270 3459562 3352659 3238968 3106231 2987312 2888868 2798906 2744626 2667318 2600759
10274B600759p5223q7511p9929n9507n6502m9102p3233o7977n1878n9546m1849
$$ 2600759 2525536 2438025 2358096 2298589 2242087 2192985 2119752 2051775 1999897 1940351 1898502
10263A898502l6388l9254o8645o7403n8242k3435l9485o7745m7513L248J5181
$$ 1898502 1862114 1822860 1754215 1686812 1628570 1605135 1565650 1497905 1450392 1453640 1468821
10252A468821N691l1687m1469p1624o2419l0899n1457m5761m6121m2214j5618
$$ 1468821 1474512 1442825 1401356 1329732 1267313 1236414 1184957 1139196 1093075 1050861 1035243
10241A035243m4242l3481l2304j3630L805l8756m5707k5161k5507k6504Q358K3690
$$ 1035243 991001 957520 925216 911586 915391 876635 830928 805767 780260 753756 762114 785804
10229G85804Q729k4003l8047n981j7086J3779K8435k6950l8520k9821k8524m1656
$$ 785804 794533 770530 732483 726502 709416 723195 751630 724680 686160 656339 627815 586159
10217E86159l5320n464L916l0454m8624m5785j9811m472J5987K721j5987j9397
$$ 586159 550839 545375 549291 518837 470213 424428 404617 400145 416132 418853 402866 383469
10205C83469P264k8382k2303k6996J9678j1383m0963k0425J0289k1542k2371k0302
$$ 383469 390733 362351 340048 313052 332730 321347 280384 259959 270248 248706 226335 206033
10193B06033j8917r840K4975J8377k9971n954Q670k6849M259K8429N335L297L722
$$ 206033 187116 177276 202251 220628 190657 184703 193373 166524 170783 199212 204547 207844 211566
10180B11566j7264j1437k4372j3004K083J8467J3198j2112j3160j499J6271L0590
$$ 211566 194302 182865 158493 145489 147572 166039 179237 167125 153965 152466 168737 199327
10168A99327M114j5162k5864j1754k3021Q727l378M59K375k2157L2889J7664O521
$$ 199327 203441 188279 162415 150661 127640 136367 132989 133448 135823 113666 146555 164219 170740
10155A70740j5592k93m890l5247k7339J2350J628J6467l098j355j6332K128K6453
$$ 170740 155148 154855 149965 114718 87379 99729 101357 117824 114726 113371 97039 99167 125620
10142A25620O805k7905l0376M415J3546j8006m343R26O477Q518L6107K3063K2489
$$ 125620 132425 104520 74144 78559 92105 74099 69756 70682 77159 85677 121784 144847 167336
10129A67336k003j5121j7965j4551r548m1615j0647K1977n779j4920r632J7030
$$ 167336 165333 150212 132247 117696 108148 66533 55886 77863 72084 57164 47532 64562
10117F4562J2640k8133j8169j1234L4710O044K7987J4778n10k0071J3428j3878
$$ 64562 77202 49069 30900 19666 54376 60420 88407 103185 102675 82604 96032 82154
10105H2154n370K7421J588J6341J890j7902j345N285r95r874m8345j0128M3110
$$ 82154 76784 104205 105793 122134 124024 106122 104777 110062 109067 99193 50848 40720 83830
10092H3830k2135O097M724l5802j4326L1705L4308J1265L5034J7103l6260n2034
$$ 83830 61695 67792 72516 36714 22388 54093 88401 99666 134700 151803 115543 63509
10080F3509l058L0565J0150k9479m455J7101L226j0536k2496j470J086j0638j3593
$$ 63509 60451 91016 101166 71687 67232 84333 87559 77023 54527 53057 54143 43505 29912
10067B9912K1196J0648Q675j1009j1116k2620M196J3027m271m787n017N7320J6688
$$ 29912 51108 61756 70431 59422 48306 25686 29882 42909 38638 33851 28834 86154 102842
10054A02842j4999K5672k5726m547J4812J2895o749p228J1246j9246j0054J560
$$ 102842 87843 113515 87789 83242 98054 110949 104200 96972 108218 88972 78918 80478
10042H0478l630k1936R967M134j6608j3310m9950m677O5458K0827J7952N311Q606
$$ 80478 76848 54912 64879 69013 52405 39095 -10855 -15532 49926 70753 88705 94016 102622
10029A02622k1429K069J4899J573k0091J0438J5915J318M932K7062j658r593j523
$$ 102622 81193 83262 98161 99734 79643 90081 105996 107314 112246 139308 137650 128057 126534
10016A26534q177K411M640K3856j7871j8364K3083J1880r260l3457P515Q822j1849
$$ 126534 118357 120768 125408 149264 131393 113029 136112 147992 138732 105275 112790 121612 109763
10003A09763j3630J1398P162j6049J0987K7717j164l205k8632r242K474j5836
$$ 109763 96133 107531 114693 98644 109631 137348 136184 132979 104347 95105 97579 81743
9991H1743m361L5785J1628L0694k4110k4927j7236n288L5834R752Q448L9751J0376
$$ 81743 77382 113167 124795 155489 131379 106452 89216 83928 119762 129514 137962 177713 188089
9978A88089m41l446k3404q412K7973K3971J5435R899K8684K4877j0106k2892k53
$$ 188089 187648 184202 160798 152386 180359 204330 219765 229664 258348 283225 273119 250227 249974
9965B49974L5401J9861r52n179M930J2902K4770K4937K4450L32K9395N8243N8626
$$ 249974 285375 305236 304284 299105 304035 316937 341707 366644 391094 391426 420821 479064 537690
9952E37690q820J1294L3127P2280M8144M3249N9088P3608J12108Q7000O9687J26062
$$ 537690 528870 540164 573291 645571 693715 736964 796052 869660 981768 1068768 1138455 1264517
9940A264517J98158K13042K26033K46100K47102K59251K32448J96685K21318K62945
$$ 1264517 1462675 1675717 1901750 2147850 2394952 2654203 2886651 3083336 3304654 3567599
9930C567599K97887K92837L52544M43787N10580N99102P25409R72276J366961
$$ 3567599 3865486 4158323 4510867 4954654 5465234 6064336 6789745 7762021 9128982
9921I128982J909411K896475M588534O533543O364037L091956P29412P21817O85789
$$ 9128982 11038393 13934868 18523402 25056945 31420982 34512938 35242350 35964167 36649956
9912C6649956k898160p086804n785137l365204j911803j155569p30346n03211
$$ 36649956 33751796 26664992 20879855 17514651 15602848 14447279 13716933 13213722
9904A3213722l56191k71834k37877j71257k29473j75782j06950m7988j0747n4364
$$ 13213722 12857531 12585697 12347820 12176563 11947090 11771308 11664358 11616370 11605623 11551259
9894A1551259o4203p3681n4510k4211l0892q7500j33918j41262j59260j70432
$$ 11551259 11487056 11413375 11358865 11334654 11303762 11216262 11082344 10941082 10781822 10611390
9884A0611390j89943j86522k39736k67779k99682l09508k85489l39947l17310
$$ 10611390 10421447 10234925 9995189 9727410 9427728 9118220 8832731 8492784 8175474
9875H175474k94603l00715k81535k70179k51182k40666k24328k22299j69039j69673
$$ 8175474 7880871 7580156 7298621 7028442 6777260 6536594 6312266 6089967 5920928 5751255
9865E751255j11100p6628p5810n2495k5467j6809j6902L2019O0141Q4128J62719
$$ 5751255 5640155 5563527 5487717 5435222 5409755 5392946 5376044 5408063 5468204 5552332 5715051
9854E715051K37234L22002M68322P10776J119172J809621K521345K610209J773220
$$ 5715051 5952285 6274287 6742609 7453385 8572557 10382178 12903523 15513732 17286952
9845A7286952P91524M40026K40550q44463k240354k512371j688434p68296l02285
$$ 17286952 18078476 18518502 18759052 17914589 15674235 13161864 11473430 10705134 10402849
9836A0402849l1942J15272K13157K70592K67859K32124K55127K63148K03575K24686
$$ 10402849 10370907 10486179 10699336 10969928 11237787 11469911 11725038 11988186 12191761 12416447
9826A2416447K63031K19553J75560Q9308L8300J5484k2338m8673n9106p5069p0932
$$ 12416447 12679478 12899031 13074591 13163899 13202199 13217683 13195345 13146672 13087566 13012497 12941565
9815A2941565j1910j7972j2175M9368Q876K6323R571l3185p2200j13571j07266
$$ 12941565 12929655 12911683 12899508 12948876 12957752 12984075 12993646 12960461 12888261 12774690 12667424
9804A2667424j24566q9371j39710j82292j77659k32214k59863l31357m36519m11024
$$ 12667424 12542858 12453487 12313777 12131485 11953826 11721612 11461749 11130392 10693873 10282849
9794A0282849m71617m58487m18478l99163l90595m11730l62530k96351k87827
$$ 10282849 9811232 9352745 8934267 8535104 8144509 7732779 7370249 7073898 6786071
9785F786071l08850k70170k62251k70363j88234j89380k20657k24784k64268k76618
$$ 6786071 6477221 6207051 5944800 5674437 5486203 5296823 5076166 4851382 4587114 4310496
9775D310496k53898k48544k51257k51791k43396j93415j91080j73674j06480r9908
$$ 4310496 4056598 3808054 3556797 3305006 3061610 2868195 2677115 2503441 2396961 2297053
9765B297053j04893j08628j25411r5614o7278p2264p9229r5613q0974k4444k6607
$$ 2297053 2192160 2083532 1958121 1862507 1795229 1722965 1643736 1548123 1467149 1442705 1416098
9754A416098m0186k9689l6037q9080o3616m4313m6151k5218l1162m3045j4184
$$ 1416098 1375912 1346223 1310186 1221106 1157490 1113177 1067026 1041808 1010646 967601 953417
9743I53417q870j0375k9621m4980k6530m2145l9483l8074Q731j756j3338l4872
$$ 953417 944547 934172 904551 859571 833041 790896 751413 713339 722070 720314 706976 672104
9731F72104j4835j546k7442j2480K919k8133j4090k7839j9391l1091j3263j1715
$$ 672104 657269 655723 628281 615801 618720 590587 576497 548658 529267 498176 484913 473198
9719D73198j0494J0252m8636l1088K8106K147N234k627j3723r741j994j3895j0111
$$ 473198 462704 472956 424320 393232 421338 423485 428719 426092 412369 402628 400634 386739 376628
9706C76628P302K6119k7740l0929k234L9K1589l71l4866K71J5646j7037l2973
$$ 376628 383930 410049 382309 351380 349146 349185 370774 370403 335537 335808 351454 334417 301444
9693C01444r938j2673n90o453l9621j4034K1527N90j5869J2183J8236K3642j5152
$$ 301444 291506 278833 278243 271790 232169 218135 239662 240252 224383 236566 254802 278444 263292
9680B63292M256j6223k6170j3404K1647O2258m908m9925l0566R974J3551K2443
$$ 263292 267548 251325 225155 211751 233398 295656 290748 240823 210257 220231 233782 256225
9668B56225L0294p656o7274n9380N088o442n573J5566j3112k2054j6924L0107
$$ 256225 286519 278863 211589 152209 157297 150855 145282 160848 147736 125682 108758 138865
9656A38865M4998q026l2242k0028j4945q802k8458O699J6624J7489m390J1527
$$ 138865 183863 175837 143595 123567 108622 99820 71362 78061 94685 112174 107784 119311
9644A19311M5003J8337q865Q763J5j7531r213L7540k644m9230K165k1121j4175
$$ 119311 164314 182651 173786 182549 182564 165033 155820 193360 190716 141486 143651 122530 108355
9631A08355K7144K7454K853q591k3812j3511J3927J2103k6588k3514J5525L2649
$$ 108355 135499 162953 165806 157215 133403 119892 133819 145922 119334 95820 111345 143994
9619A43994J5058Q968M463q580L951j365k7102l5108L573N896K0509L969k4176
$$ 143994 159052 168020 172483 163903 167854 166489 139387 104279 107852 113748 134257 138226 114050
9606A14050j4536P546P524j498M5471j2559o735L835j8457J2388K4956k370j3587
$$ 114050 99514 107060 114584 113086 158557 145998 139263 143098 124641 137029 161985 159615 146028
9593A46028m8012j8525J366K3319L4066O505j6261k0437j751J6332j9310j4496
$$ 146028 98016 79491 80857 104176 138242 144747 128486 108049 106298 122630 103320 88824
9581H8824r036j3035K0145J5891P626l404q344l2033j8198J8560J0761L6416J8202
$$ 88824 79788 66753 86898 102789 110415 107011 98667 66634 48436 66996 77757 114173 132375
9568A32375j5021j1207j62j527J6748l3378k5785l194K5964K9773n030j6387O27
$$ 132375 117354 106147 105985 104458 121206 87828 62043 58849 84813 114586 109556 93169 93796
9555I3796r932N881j8420j3128r023J3197j1285j0184L3607L3374J975j3590j0988
$$ 93796 83864 89745 71325 58197 49174 62371 51086 40902 74509 107883 109858 96268 85280
9542H5280k878R107J5026J1891j7862j5116Q726k0353k1808L0226j7514Q660J5710
$$ 85280 82402 91509 106535 118426 100564 85448 94174 73821 52013 82239 64725 73385 89095
9529H9095k9354j4378J4880o68k4405k2077K0544K5382j1691N598J9088K354j3268
$$ 89095 59741 45363 60243 59575 35170 13093 33637 59019 47328 52926 72014 74368 61100
9516F1100K846K9181J211Q542k0876R505m609j6038J3263K3630O1653L5856K8381
$$ 61100 63946 93127 94338 102880 82004 91509 86900 70862 84125 107755 169408 205264 233645
9503B33645k1085l0278K8554J1453l069l1575j0133k9500m2090l4718k2986K0068
$$ 233645 212560 182282 210836 222289 219220 187645 177512 148012 105922 71204 48218 68286
9491F8286K1827Q110J5249P879j3768J0794o016J3334K8272J4485j4614k5429
$$ 68286 90113 98223 113472 121351 107583 118377 112361 125695 153967 168452 153838 128409
9479A28409J1745q357k1335J5666p791m2555l50K7209K3730r415M656K9207k2599
$$ 128409 140154 131797 110462 126128 118337 75782 75432 102641 126371 116956 121612 150819 128220
9466A28220k1122N901r033n08n644L7640K9902j0024k7532l1873p427j5980L400
$$ 128220 107098 112999 103966 103458 97814 135454 165356 155332 127800 95927 88500 72520 75920
9453G5920J1576l348k9216j6219L0830L6473L270l1960K2293J340k4546N388J7632
$$ 75920 87496 84148 54932 38713 69543 106016 109286 77326 99619 100959 76413 81801 99433
9440I9433j5630k8883K5179J5766L2326J7459L0172N129J4035J6942k9150q931
$$ 99433 83803 54920 80099 95865 128191 145650 175822 180951 194986 211928 182778 173847
9428A73847l2679j0179k5688k8223M916K5647M691K0690Q941L1359l671K2224
$$ 173847 141168 130989 105301 77078 81994 107641 112332 133022 141963 173322 169651 191875
9416A91875M6129J686k6449J8428M237l4020j6214N087O467L4290J2967J1013
$$ 191875 238004 239690 213241 231669 235906 201886 185672 190759 197226 231516 244483 255496
9404B55496K0750M232j7860Q919J561J697K2606M3101L0061M751L050M8581Q1467
$$ 255496 276246 280478 262618 271537 273098 274795 297401 340502 370563 375314 378364 426945 508412
9391E08412R7889P1747M3703N1669O1200P8043J23658J73148J97607J90987K21775
$$ 508412 606301 678048 721751 773420 834620 912663 1036321 1209469 1407076 1598063 1819838
9380A819838K98147L45799L73640M14332L96768L42077K76217J97926L8720n7749
$$ 1819838 2117985 2463784 2837424 3251756 3648524 3990601 4266818 4464744 4503464 4445715
9370D445715j55702k31344k57257k96232k48793k67725k44137j80912j32306j15481
$$ 4445715 4290013 4058669 3801412 3505180 3256387 2988662 2744525 2563613 2431307 2315826
9360B315826l5604j2324J7828K6565R9378J53433J84817K46698L01149L15328
$$ 2315826 2280222 2267898 2285726 2312291 2411669 2565102 2749919 2996617 3297766 3613094
9350C613094L52698L86233L76792K78959J37769O3307n3590j56665k42132l06633
$$ 3613094 3965792 4352025 4728817 5007776 5145545 5208852 5155262 4998597 4756465 4449832
9340D449832l14718k65747k42106j94656j68277r8166j8520l5056l4867R993M9541
$$ 4449832 4135114 3869367 3627261 3432605 3264328 3166162 3147642 3112586 3077719 3087712 3137253
9329C137253M4155P374j6862j8671r2917j45075j40585j39512j46575j32524j09670
$$ 3137253 3181408 3188782 3171920 3153249 3060332 2915257 2774672 2635160 2488585 2356061 2246391
9318B246391l2528r623l3630K2641N5519J01317J30648J74160J56491K11597K82969
$$ 2246391 2213863 2204240 2170610 2193251 2248770 2350087 2480735 2654895 2811386 3022983 3305952
9307C305952L53802M93152N69526O36856P06226P52155P47742P27840O79424N28068
$$ 3305952 3659754 4152906 4722432 5359288 6065514 6817669 7565411 8293251 8972675 9500743
9297I500743L52746J87716N5317l7366j19611k09496k30608k48526k64116l14750
$$ 9500743 9853489 10041205 10096522 10059156 9939545 9730049 9499441 9250915 8986799 8672049
9287H672049l65659l89586m66546m35040k91803j82013o3583K3214J27118K63401
$$ 8672049 8306390 7916804 7450258 7015218 6723415 6541402 6477819 6501033 6628151 6891552
9277F891552L97346N03886N98309O52712O45171O19656N25306L31052J34694k8556
$$ 6891552 7288898 7792784 8391093 9043805 9688976 10308632 10833938 11164990 11299684 11271128
9267A1271128k03789l00191l95455m48035m91136m84925n08390n39913n42278
$$ 11271128 11067339 10767148 10371693 9923658 9432522 8947597 8439207 7899294 7357016
9258G357016n39073n33071n32313m96663l88227l38817l51013k48988j75488j77046
$$ 7357016 6817943 6284872 5752559 5255896 4867669 4528852 4177839 3928851 3753363 3576317
9248C576317j57881j42564j22004j30581j09366j22319p1566J2962Q010r487J2310
$$ 3576317 3418436 3275872 3153868 3023287 2913921 2791602 2720036 2732998 2741008 2731521 2743831
9237B743831K4639O5799J01562J13864J75376J59208J64535K35029L17997L72681
$$ 2743831 2768470 2834269 2935831 3049695 3225071 3384279 3548814 3783843 4101840 4474521
9227D474521M70463M70521N12281N33436N05515M41844L76222L64955L59139L18287
$$ 4474521 4944984 5415505 5927786 6461222 6966737 7408581 7784803 8149758 8508897 8827184
9217H827184K95339K18169J56725P5599l9232k03905l99113m82891n19381n14677
$$ 8827184 9122523 9340692 9497417 9573016 9533784 9329879 8930766 8447875 7928494 7413817
9207G413817m74040l75561l10577k22225j02575K5092J59554K57885L11144M04611
$$ 7413817 6939777 6564216 6253639 6031414 5928839 5953931 6113485 6371370 6682514 7087125
9197G087125M30826M15303L68559L17832K18959J78628J63074J31527M2173J5186
$$ 7087125 7517951 7933254 8301813 8619645 8838604 9017232 9180306 9311833 9354006 9369192
9187I369192k8590j34663k58464m14079n35956n93768o01157o51536o02240n24909
$$ 9369192 9340602 9205939 8947475 8533396 7997440 7403672 6802515 6150979 5548739 5023830
9177E023830m43739l96584l52638k99652k29568k04887j73419j34588j45321j19609
$$ 5023830 4580091 4183507 3830869 3531217 3301649 3096762 2923343 2788755 2643434 2523825
9167B523825q8424p4208j22493q4048o9704o3628l0574m3721l8288l0092m2281
$$ 2523825 2435401 2361193 2238700 2154652 2084948 2021320 1990746 1947025 1908737 1878645 1836364
9156A836364l4107k5966K1750J516K9683N6624N5612Q6077R3079J48240J38836
$$ 1836364 1802257 1776291 1798041 1799557 1829240 1885864 1941476 2027553 2120632 2268872 2407708
9145B407708J83477J88482K20452K45035K67306K34346J25794K8629l4312j11437
$$ 2407708 2591185 2779667 3000119 3245154 3512460 3746806 3872600 3901229 3866917 3755480
9135C755480j88957k34643k96034k81809k13537k15826j55727j01713p0959n3503
$$ 3755480 3566523 3331880 3035846 2754037 2540500 2324674 2168947 2067234 1996275 1942772
9125A942772L058j4845N571M0457Q0704Q2301R5296J42043J43363J75308K43777
$$ 1942772 1945830 1930985 1936556 1977013 2057717 2140018 2235314 2377357 2520720 2696028 2939805
9114B939805J96768J58248J38579P6666r513r2992j94940k10188k49685k76098
$$ 2939805 3136573 3294821 3433400 3510066 3500553 3407561 3212621 3002433 2752748 2476650
9104B476650k50820k19339k19727j96053j31612r8179r2839p1607m0255j0445
$$ 2476650 2225830 2006491 1786764 1590711 1459099 1360920 1268081 1196474 1156219 1145774
9094A145774m6636o5231o6664n7152l1952k8566n581m0318m7651m6671j6629l6884
$$ 1145774 1099138 1033907 967243 910091 878139 849573 843992 803674 756023 709352 692723 655839
9082F55839l222k2627l8847j2747j5960j8950l3641N795J6376q077j6284J8076
$$ 655839 652617 629990 591143 578396 562436 543486 509845 515640 532016 523939 507655 525731
9070E25731J0447R64M76K698K3557P788r242J6012J3110K3723L5052O1525L9088
$$ 525731 536178 537142 537618 540316 563873 571661 562419 578431 591541 615264 650316 711841 750929
9057G50929j481l0090l8995j9114m1359k1827l7596m2696L4915j995k104K1115
$$ 750929 749448 719358 680363 661249 619890 598063 560467 517771 552686 550691 548587 569702
9045E69702m372k0333N678J7827M688m997j478J4715k696L636o73j5751j5101
$$ 569702 565330 544997 550675 568502 573190 568193 566715 581430 578734 582370 581697 565946 550845
9032E50845P127K1318K3627J6651J605J2167P610M539j7961k1850k6656l2010
$$ 550845 557972 579290 602917 619568 621173 633340 640950 645489 627528 605678 579022 547012
9020E47012l633j3144J4600K0486K0637j8481j5604J1658j193O444P012O9892
$$ 547012 543379 530235 544835 565321 585958 567477 551873 563531 562338 568782 575794 645686
9008F45686K1852l6631n159J1102J2099M373K2880L6172N8034K8083Q496l815
$$ 645686 667538 630907 625748 636850 648949 653322 676202 712374 770408 798491 806987 803172
8996H03172j8011K675j177P420P2355M5363M051K5852O5187L5070P5608O2462
$$ 803172 785161 787836 786659 794079 866434 911797 915848 941700 1006887 1041957 1117565 1180027
8984A180027M6827R2562J24620R7638J00638Q9167N5368L4171P959N6143R2220
$$ 1180027 1226854 1319416 1444036 1541674 1642312 1731479 1786847 1821018 1828977 1885120 1977340
8973A977340P6775Q4435Q7222J30024J15616J82015J58725J16781J19927J35499
$$ 1977340 2054115 2138550 2225772 2355796 2471412 2653427 2812152 2928933 3048860 3184359
8963C184359J81507K12150K37004K36923L33338M03625M94134N65527N65785O48438
$$ 3184359 3365866 3578016 3815020 4051943 4385281 4788906 5283040 5848567 6414352 7062790
8953G062790P30491Q33353R97180J177895J424456J662838K017281K464875K869005
$$ 7062790 7793281 8626634 9623814 10801709 12226165 13889003 15906284 18371159 21240164
8944B1240164L270631L668030M182142M943038O126799P930650J0722696J5252187
$$ 21240164 24510795 28178825 32360967 37304005 43430804 51361454 62084150 77336337
8936G7336337K2526901L3688127M9545068O5887840O8782898M7903508K0854377
$$ 77336337 99863238 133551365 183096433 248984273 317767171 365670679 386525056
8929C86525056P256154j065605k5596579o2368067p2689572n6404161l7751487
$$ 386525056 393781210 392715605 367119026 304750959 232061387 175657226 137905739
8922A37905739k4832585j6873078j1923459q801878o769539n430040m517405l918403
$$ 137905739 113073154 96200076 84276617 75474739 68705200 63275160 58757755 54839352
8914E4839352l535596l257347l041584k777353k473914k219136k002716j890568
$$ 54839352 51303756 48046409 45004825 42227472 39753558 37534422 35531706 33641138
8906C3641138j802054j672818j474989j399058j394731j327195j204821j096061
$$ 33641138 31839084 30166266 28691277 27292219 25897488 24570293 23365472 22269411
8898B2269411r97572r80540r54630q74227p81731p41772p27747o82828o00257
$$ 22269411 21271839 20291299 19336669 18462442 17680711 16938939 16211192 15528364 14928107
8889A4928107n55991n22529m87020m74061m68313m63112m95336m25107l68532
$$ 14928107 14372116 13849587 13362567 12888506 12420193 11957081 11461745 11036638 10668106
8880A0668106l33374l09161k95155k91814l04759k93310k78403k34374k22315
$$ 10668106 10334732 10025571 9730416 9438602 9133843 8840533 8562130 8327756 8105441
8871H105441k22085k17239j86227j84958k27168k07357j91590j80118k05734j65117
$$ 8105441 7883356 7666117 7479890 7294932 7067764 6860407 6668817 6488699 6282965 6117848
8861F117848j40175j16777j60884j80195j67969j15672j45164j42063j08436j17423
$$ 6117848 5977673 5860896 5700012 5519817 5351848 5236176 5091012 4948949 4840513 4723090
8851D723090j17956j21697j23103j15711q4648o9223j08687j13058j13638j11049
$$ 4723090 4605134 4483437 4360334 4244623 4159975 4090752 3982065 3869007 3755369 3644320
8841C644320r2480q1696r9931j09399j25073q4823r5108p8288o8760o6207q7946
$$ 3644320 3551840 3470144 3370213 3260814 3135741 3050918 2955810 2877522 2808762 2742555 2654609
8830B654609o0472l8875n02j5027l9345l8009j4634r779l5194o5717k8029m2168
$$ 2654609 2594137 2555262 2554760 2539733 2500388 2462379 2447745 2437966 2402772 2337055 2309026 2266858
8818B266858p6641p0546m4657m2205q1038o9097n2978l3453l2148k1216m8068
$$ 2266858 2190217 2119671 2075014 2032809 1951771 1882674 1829696 1796243 1764095 1742879 1694811
8807A694811k2917l8499r3516j15610q2415l5160l3863p3231o8628l8127p683
$$ 1694811 1671894 1633395 1539879 1424269 1341854 1306694 1272831 1199600 1130972 1092845 1085162
8796A085162m8612m8155m0269m2090l9397k7625p685j207r036R442P666j5382
$$ 1085162 1036550 988395 948126 906036 866639 839014 831329 830122 821086 830528 838194 822812
8784H22812j4087J9731J3246m136m0756j9721o692r662L689j6166k454r601m432
$$ 822812 808725 828456 841702 837566 796810 777089 770397 760735 764424 748258 745804 736203 731771
8771G31771j5996q330j3353k1866N843L3790R455l2204j3509M275N343J0200j8129
$$ 731771 715775 707445 694092 672226 678069 711859 721314 689110 675601 679876 685219 695419 677290
8758F77290k5667K0903K9455J2081L609J0252R17j2703j2997k0543j9275m6977
$$ 677290 651623 672526 701981 714062 717671 727923 728840 716137 703140 682597 663322 616345
8746F16345m7581k7700k7894q098k3984M0K8654K2770J3456j6511j2112k3010
$$ 616345 568764 541064 513170 505072 481088 481128 509782 532552 546008 529497 517385 494375
8734D94375J1783J9313P200M3466L3841K1913j0219M271k3889m4751j6766o0054
$$ 494375 506158 525471 532671 576137 609978 631891 621672 625943 602054 557303 540537 480483
8722D80483k4609k5018O388R107k4249M305J7194j6409k5845K0709N411K570J3668
$$ 480483 455874 430856 437244 446351 422102 426407 443601 427192 401347 422056 427467 430037 443705
8709D43705Q544L374J1237k0938k5929j3664M406J3391K3524r806l2332J612J5813
$$ 443705 452249 455623 466860 445922 419993 406329 410735 424126 447650 437844 405512 407124 422937
8696D22937J8674J9307L471k9812l5390j7115L865j0560k6563L520K6087L8086
$$ 422937 441611 460918 464389 434577 399187 382072 385937 375377 348814 352334 378421 416507
8684D16507M394P271L951q603M7479M8195J2592j5618j8783l0843n896j1302j3465
$$ 416507 420901 428172 432123 423520 470999 519194 531786 516168 497385 466542 460646 449344 435879
8671D35879M216o917m4668j34K2997K168k9980j5814r138j0211k3650R122K854
$$ 435879 440095 433178 388510 388376 411373 413541 383561 367747 358609 348398 324748 333870 336724
8658C36724j0627o959J8720K5191N1534K9169J9202O6042Q9623Q4424J52923K49375
$$ 336724 326097 319138 337858 363049 414583 443752 462954 528996 618619 703043 855966 1105341
8646A105341M10399O52116P21404L83310P7250L6687Q4052k37710p05206o67417
$$ 1105341 1515740 2167856 2889260 3272570 3349820 3386507 3470559 3232849 2527643 1860226
8636A860226l78010k48899j78292r5296l8380r3601l4940k6903l7408m1364j4577
$$ 1860226 1482216 1233317 1055025 959729 921349 827748 792808 765905 728497 687133 672556
8625F72556N789k5125j4761L5400L7724L5239K4206j9699L437O1773K6305n4417
$$ 672556 678345 653220 638459 673859 711583 746822 771028 751329 754766 816539 842844 788427
8613G88427j06949o4822J844K6631J0011K7872O5069O6836J00558J63493K82745
$$ 788427 681478 616656 618500 645131 655142 683014 748083 814919 915477 1078970 1361715
8602A361715M39611P33794J224796J467055R42485K21701O2092K39950j34292
$$ 1361715 1801326 2535120 3759916 5226971 6169456 6391157 6453249 6693199 6558907
8593F558907j350465j539187r43322n38056l04223j76161j43734j24723q8213
$$ 6558907 5208442 3669255 2725933 2187877 1883654 1707493 1563759 1439036 1350823
8584A350823o4359n2224k4360m6820m9173J275j4586k4731O3135O9980L6608k3247
$$ 1350823 1286464 1234240 1209880 1163060 1113887 1115162 1100576 1075845 1138980 1208960 1245568 1222321
8572A222321P83Q908p7984j38208j14215n7238m5293k6833M741j2394L127L0507
$$ 1222321 1223104 1232012 1154028 1015820 901605 844367 799074 772241 776982 764588 767715 798222
8560G98222L4636O5276J17015J62570L05387N26221O86887N23000J91991k2494
$$ 798222 832858 898134 1015149 1177719 1483106 2009327 2696214 3219214 3411205 3388711
8550C388711N8521k50m83183p42119n38162l43977k01980j03962l5294l1672l4537
$$ 3388711 3447232 3446982 2963799 2221680 1683518 1339541 1137561 1033599 998305 966633 932096
8539I32096k8313r588N4978Q2130N9715O6391R3739J21655K00482J76783J42240
$$ 932096 903783 894195 949173 1031303 1091018 1157409 1251148 1372803 1573285 1750068 1892308
8528A892308J10852Q0854N9999l123j07452j05655j39849j43523j39412j40981
$$ 1892308 2003160 2084014 2144013 2140890 2033438 1927783 1787934 1644411 1504999 1364018
8518A364018j71196j40551r1462j08637n5803o5630m9326k6038m7635k0944j7094
$$ 1364018 1192822 1052271 960809 852172 796369 730739 681413 655375 607740 586796 569702
8507E69702o2476o1816l3061j7770r446j646j5374k4237K2300J4024l3715n739
$$ 569702 507226 445410 412349 394579 385133 383487 368113 343876 366176 380200 346485 340746
8495C40746k105R45k596j0935l1946j3724K01L1637O768j2742j0265k8019k37
$$ 340746 338641 339586 336990 326055 294109 280385 280586 312223 318991 306249 295984 267965 267728
8482B67728J0168J1227J2919k1589j3925k4930r691O202J1261m3839m49J0700
$$ 267728 277896 289123 302042 280453 266528 241598 231907 238109 249370 205531 205082 215782
8470B15782l382n739k1350l4872J504O394K5205n843n391J7542l0252k7873J4296
$$ 215782 212400 206661 185311 150439 151943 158337 183542 177699 172308 189850 159598 131725 146021
8457A46021N971k7939J4461M7208J6897N931J1270k3480p572J804M413N711J1768
$$ 146021 151992 124053 138514 185722 202619 208550 219820 196340 188768 190572 194985 200696 212464
8444B12464l0221kJ2900l630k7704Q089J1348j7433j6210O815J362n833j1230
$$ 212464 182243 182241 195141 191511 163807 171896 183244 165811 149601 156416 157778 151945 140715
8431A40715k7712J3745j6037M6071M4975j2672K406J3558R169k5031j8133q67
$$ 140715 113003 126748 110711 156782 201757 189085 191491 205049 214218 189187 171054 170187
8419A70187j0106M879j5095P184j9306j9550p355l022p223K2851K1891j6236l7335
$$ 170187 160081 164960 149865 157049 137743 118193 110838 107816 100593 123444 145335 129099 91764
8406I1764J7473K6806K5089Q890P566m1201k3619M779k858j3197J7123M2373J0744
$$ 91764 109237 136043 161132 170022 177588 136387 112768 117547 114689 101492 118615 160988 171732
8393A71732o1182l2984l407j1591K101J1770j7494K861J408J5024J9267M535m843
$$ 171732 110550 77566 74159 62568 64669 76439 58945 61806 63214 78238 97505 102040 97197
8380I7197J4566L1959k3369j6564o945K545j3902l7447J1539m186j0425M544Q567
$$ 97197 111763 143722 120353 103789 96844 99389 85487 48040 59579 55393 44968 49512 58079
8367E8079N178m178j3930J6733N506J0505K4770o239r728J6332j7739j1113l4023
$$ 58079 63257 59079 45149 61882 67388 77893 102663 96424 86696 103028 85289 74176 40153
8354D0153L956N0976N2316p033k2508J1150J7502O446o201l4664j7291l6331O727
$$ 40153 44109 95085 147401 140368 117860 129010 146512 152958 146757 112093 94802 58471 65198
8341F5198j4298J3275K1548o177k7555J3886K3884k5413l9105j4688N518K5861
$$ 65198 50900 64175 85723 79546 51991 65877 89761 64348 25243 10555 16073 41934
8329D1934L2010K7586L2619j5362k0514k0168j7131j810K776J6033K7750J8930
$$ 41934 73944 101530 134149 118787 98273 78105 60974 59164 61940 77973 105723 124653
8317A24653j796j4496m2943Q513R651j7294l675p406O811j3018J1997K7377m619
$$ 124653 122857 108361 65418 73931 83582 66288 62613 55207 62018 49000 60997 88374 83755
8304H3755N471k4165K481q755M644P208R534j0430k6267P593J2087q938j1642
$$ 83755 89226 65061 67542 58787 63431 70639 80173 69743 43476 51069 63156 54218 42576
8291D2576j6016n759L3518J0376L3942M680R764J4014r044l9936l8718j8752K5820
$$ 42576 26560 20801 54319 64695 98637 103317 113081 127095 118051 78115 39397 20645 46465
8278D6465N490j5498k2728r966K3555K2311L1359L3k7597K1870N638o393j0459
$$ 46465 51955 36457 13729 3763 27318 49629 80988 81021 53424 75294 80932 74539 64080
8265F4080l7842j0820Q348J9485J3577j869J1690k3876n438L6984O577O119Q471
$$ 64080 26238 15418 23766 43251 56828 54959 66649 42773 37335 74319 80896 87015 95486
8252I5486k8631j8429Q594J1472n00K7907k0072j17l317j7686Q064J2164L4226
$$ 95486 66855 48426 57020 68492 67992 95899 75827 75710 72393 54707 62771 74935 109161
8239A09161r463r155R817J361l335n9055k2755O706P194r195R096J3424L1077
$$ 109161 99698 90543 100360 101721 98386 39331 16576 23282 30476 21281 30377 43801 74878
8226G4878p666n641J324k712q292J3837j1789o446l352k3110M181Q671K0381J7976
$$ 74878 67212 61571 62895 60183 51891 65728 53939 47493 44141 21031 25212 33883 54264 72240
8212G2240J5233n325j0593k2866k4797J7048j700J0279P352J4539p842M683O233
$$ 72240 87473 82148 71555 48689 23892 40940 39240 49519 56871 71410 63568 68251 74484
8199G4484K6085R397k9302k2031j2539K9658K4109k2912J3997M092j573l6081
$$ 74484 100569 109966 80664 58633 46094 75752 99861 76949 90946 95038 93465 57384
8187E7384l6387L856l344K2270M0139J3546n811k2001k9850j2759j8759J7938
$$ 57384 20997 24853 21509 43779 83918 97464 91653 69652 39802 27043 8284 26222
8175B6222o48j4460J151N222J4194J9094J0074O096l448j220j1965p895k2492
$$ 26222 25574 11114 12265 17487 31681 50775 60849 66945 63497 62277 50312 42417 19925
8162A9925k339L7426J7923j5687q64j9534o042M148O279J7840K3638J7202m2432
$$ 19925 17586 55012 72935 57248 56384 36850 30808 34956 41235 59075 82713 99915 57483
8149E7483k3286l089K5024j1875j2821Q794o206M040K6159q425J0255J5182j8226
$$ 57483 34197 31108 56132 44257 31436 40230 34024 38064 64223 55798 66053 81235 63009
8136F3009k7488j8053M8083J5176j589q947k1574j0539J9127J2124j2541j4194
$$ 63009 35521 17468 65551 80727 79138 70191 48617 38078 57205 69329 56788 42594
8124D2594k5019k0188K5456J4902L76n378O380L939K7317R236O086k489k874j1269
$$ 42594 17575 -2613 22843 37745 38121 32743 39123 43062 70379 79615 85701 83212 80338 69069
8110F9069J0447K5814K1075l5037l7798l3255l818J1252J2839k1103m7M3682J9969
$$ 69069 79516 105330 126405 91368 53570 20315 16497 27749 40588 19485 19438 63120 83089
8097H3089k6031q634j9573k5770P082J6459P981j1114j01J9405l920p294r940
$$ 83089 57058 48424 28851 3081 10163 26622 34603 23489 23388 42793 38873 31579 21639
8084B1639N439J0446L2509J8515k8796K155J3890k7099n7236j0329M3508K4475
$$ 21639 27078 37524 70033 88548 59752 61907 75797 48698 -8538 -18867 24641 49116
8072D9116j9333k1472O670L8145o598m6643M694o554k326M4821L4235P989j8947
$$ 49116 29783 8311 14981 53126 46528 -115 4579 -1975 -4301 40520 74755 82744 63797
8059F3797j301j9880l1505J7931J2687l5432j9035J6462J4229J9471R255n694
$$ 63797 62496 42616 11111 29042 41729 6297 -12738 3724 17953 37424 46679 40985
8047D0985K4991J2415r586j9090L333j0820n377N513K1879k800l352R665R208
$$ 40985 65976 78391 68805 49715 53048 42228 36851 42364 64243 61443 58091 67756 76964
8034G6964J3967J190k0399l6886N017m28j660K5029K236J251J4503j5598j2957
$$ 76964 90931 92121 71722 34836 39853 39425 37765 62794 65030 66281 80784 65186 52229
8021E2229P288j1941j3551K7123L7091j894j1316k2126k7875Q300j7452j0521
$$ 52229 59517 47576 34025 61148 98239 96345 85029 62903 35028 43328 25876 15355
8009A5355p723j3626p902K3590j7726J4013L3822j2608Q288K1792N693p428K8873
$$ 15355 7632 -5994 -13896 9694 -8032 5981 39803 27195 35483 57275 62968 55540 84413
7996H4413K2201J4716j7778q754m0214O98J4373J2282j3388l676o480J0061J4127
$$ 84413 106614 121330 103552 94798 54584 55282 69655 81937 68549 64873 58393 68454 82581
7983H2581L0688J576j9098j4300j8423R208K8102j1062m143m924p675j7788q770
$$ 82581 113269 114845 95747 81447 63024 72232 100334 89272 85129 80205 72530 54742 45972
7970D5972K6326K5668r843K1379L621k5328j4248j8058L67J5387O463N0267K2265
$$ 45972 72298 97966 88123 109502 113123 87795 73547 55489 55856 71243 77706 127973 150238
7957A50238j2159j3707p600l0225l4589j4409k939R031K2403L257K4740K8831
$$ 150238 138079 124372 116772 86547 51958 37549 34610 43641 66044 69301 94041 122872
7945A22872L4141R095j0528k0819j0680k7167m0022k1479R198l295M19N384L161
$$ 122872 157013 166108 155580 134761 124081 96914 56892 35413 44611 41316 41735 47119 50280
7932E0280N232M2824K7048J6453M006j1247l3959k6860Q191j3807L113K2608l3536
$$ 50280 55512 98336 125384 141837 145843 134596 100637 73777 81968 68161 71274 93882 60346
7919F0346k0745J2524j0302j429J0649L3278K3825J4022j9938l0218j7538J0323
$$ 60346 39601 52125 41823 40394 51043 84321 108146 122168 102230 72012 54474 64797
7907F4797J3050J5548p106j4924J3634R441O466J3600L214k6705k7773J12Q559
$$ 64797 77847 93395 86289 71365 84999 94440 100906 114506 117720 91015 63242 63354 71913
7894G1913J1112J8548J699k3350J3348J9787j442p979J3835m2012l8462j340J8182
$$ 71913 83025 101573 103272 79922 93270 113057 111615 103636 117471 75459 36997 35657 53839
7881E3839k243m778J2638P346J0598K90K4529j4285K369o447k5672k8371m649
$$ 53839 51596 46818 59456 66802 77400 77690 102219 87934 90303 83856 58184 29813 25164
7868B5164N238R969J7479L0766o081k9480k6803l9568j3035K5270K0593j1436
$$ 25164 30402 40371 57850 88616 82535 53055 26252 -13316 -26351 -1081 19512 8076
7856H076K8130K0039J307J8049j2848J0096L983j5782l701O589l144j4321k3570
$$ 8076 36206 56245 57552 75601 62753 72849 76832 61050 57349 63938 60794 46473 22903
7843B2903j7757k3181J4967q171N056J7964j3149l88K4267L5508j4496j5187J2557
$$ 22903 5146 -18035 -3068 -11239 -6183 11781 -1368 -1756 22511 58019 43523 28336 40893
7830D0893O266K756r551N221j5156K58K7217J6441P052O42k018l7106l9171O755
$$ 40893 47159 49915 40364 45585 30429 30687 57904 74345 81397 82039 80021 42915 3744 10499
7816A0499n922L480L2310k8754K10j8029j2096K6713j2399j2839j718L2133P372
$$ 10499 4577 8057 40367 11613 11823 -6206 -18302 8411 -3988 -16827 -18545 13588 20960
7803B0960R182J8385J320j0372j6124k0971J4141K3125j35p116j0035R06R393
$$ 20960 30142 48527 49847 39475 23351 2380 16521 39646 39511 32395 22360 23266 32659
7790C2659r555j275r952l0822k6596J2965L7689J7357q882k227L1415l191m48
$$ 32659 23104 21829 11877 -18945 -45541 -32576 5113 22470 13588 11361 42776 39585 39137
7777C9137j722k4605k9847J4758K41k0540r152P345J3478o411L629P115P837j5958
$$ 39137 37415 12810 -17037 -2279 -2038 -22578 -31730 -24385 -10907 -17318 -13689 -6574 1263 -14695
7763a4695J0131M2974l9639K5819L8359j2190p427l3121l8053l00K2335J9262
$$ -14695 -4564 38410 -1229 24590 62949 50759 43332 10211 -27842 -28142 -5807 13455
7751A3455J0545J0379L213k6809l1315p250k0781J6311J3083p63o663M743L2216
$$ 13455 24000 34379 37592 10783 -20532 -27782 -48563 -32252 -19169 -19932 -26595 -21852 10364
7738A0364L1220N078j0156r231l896J1223J3469j5417l5199j3951J1366R952O35
$$ 10364 41584 46662 36506 27275 23379 34602 48071 32654 -2545 -16496 -5130 4822 5457
7725E457M58J0350L583l8925J219J4355K0254J0375l574l256P749P93J3962J9591
$$ 5457 5915 16265 19848 -19077 -17858 -3503 16751 27126 23552 20296 28045 28838 42800 62391
7711F2391k6715l4658O659J8717m47j3815M252J2156k9910k2685K1554l703N996
$$ 62391 35676 1018 7677 26394 25947 12132 16384 28540 -1370 -24055 -2501 -6204 -208
7698b08P39p442j2437N4648J0672m7708j3308J4399L2705L0319q751k6484J1933
$$ -208 531 -6911 -19348 35300 45972 -1736 -15044 -645 32060 62379 53628 27144 39077
7685C9077J5633j7430k0845m854L714j8488J5786J0409M54J4699j1509j4839J2644
$$ 39077 54710 37280 16435 11581 15295 -3193 12593 23002 23456 38155 26646 11807 24451
7672B4451n136j3763J0119J9926j510k2555P700K1009K157k844l4936o092Q707
$$ 24451 19315 5552 15671 35597 34087 11532 19232 40241 42398 39554 4618 -1474 7233
7659G233K6322Q391k1675o234k4099M533L7121N693l0742l7291J0102J8343J8795
$$ 7233 33555 41946 20271 14037 -10062 -5529 31592 37285 6543 -30748 -20646 -2303 16492
7646A6492j7691m8124j7584M3850L4654l847r364k623K7485M903J5948O754q300
$$ 16492 -1199 -49323 -66907 -23057 11597 7750 -1614 -4237 23248 28151 44099 50853 42553
7633D2553p826j4415J7315K785N494J0264Q711k2292p304j7969o45l9925k4322
$$ 42553 34727 20312 37627 40412 45906 56170 64881 42589 35285 17316 16671 -23254 -47576
7620d7576P062L1095Q632J2987j9869j1568k951K2550M494m587j7144j881N539
$$ -47576 -40514 -9419 -787 12200 -7669 -19237 -22188 362 4856 269 -16875 -18756 -13217
7607a3217JR371J3999r802j8189K8402J1322o84j3560p967j4644J1784J9905l1630
$$ -13217 -13216 -3845 10154 352 -17837 10565 21887 21203 7643 -324 -14968 -3184 16721 -14909
7593a4909L254L2392P705J243J0551M078l147L325r989o702r876J1115O257j5256
$$ -14909 -11655 20737 28442 29685 40236 44314 41167 44492 34503 27801 17925 29040 35297 20041
7579B0041k925M1760n996j0460r369j1607m1965k4889N046K3203L9080J4642k8784
$$ 20041 17116 58876 52880 42420 33051 21444 -20521 -45410 -40364 -17161 21919 36561 7777
7566G777k7911k0092L333J8920K6765j2392j2993k9j8749K014j4187k0539J3829
$$ 7777 -20134 -40226 -36893 -17973 8792 -3600 -16593 -16622 -35371 -33357 -47544 -68083 -54254
7553e4254L2392P2125J8166l6405l826o446j3836m906m2648k2145M550J8260r570
$$ -54254 -21862 50263 68429 32024 28198 21752 7916 3010 -39638 -61783 -57233 -38973 -48543
7540d8543l696J4077l1705J838N712J8356N5272J4603N134M720j9537K4690J7040
$$ -48543 -52239 -38162 -69867 -68029 -62317 -43961 11311 25914 31048 35768 16231 40921 57961
7527E7961P932r231K564m2386M3441J7506k9833j1633j8197p068k8242p027J2789
$$ 57961 65893 56662 59226 16840 60281 77787 47954 36321 18124 11056 -17186 -24213 -11424
7514a1424J4044N773M238q550k9570j4809r936J8954Q425Q0r650O7355J2616m0060
$$ -11424 2620 8393 12631 4081 -25489 -40298 -50234 -31280 -22855 -22775 -32425 34930 47546 7486
7500G486j7060j3291l634J4309O653J74R103K3115J2039j6931j0663L589K637
$$ 7486 -9574 -22865 -26499 -12190 -5537 -5363 3740 26855 38894 21963 11300 14889 17526
7487A7526K2603j3201k3893l715O398M882j2205j3683j4665M252o735K145K0824
$$ 17526 40129 26928 3035 -680 5718 10600 -1605 -15288 -29953 -25701 -32436 -30291 -9467
7474i467M1348l921k3749J6982K912l6990J8671K6559K663J4740k015o785l374
$$ -9467 31881 27960 4211 21193 24105 -12885 5786 32345 35008 49748 47733 40948 37574
7461C7574k3273k4493m747J8166m8988q438K3467L6513L5347m371n2158j1086
$$ 37574 14301 -10192 -14939 3227 -45761 -54199 -30732 5781 41128 36757 -15401 -26487
7449b6487L820Q784K3887K0508K6457p409j174j8584j8412J1035M856K617p53
$$ -26487 -22667 -13883 10004 30512 56969 49560 48386 29802 11390 22425 27281 29898 29145
7436B9145o966q512m284L4685M3636j3114l8547m6243K33K7289K0098J0712K335
$$ 29145 22179 13667 9383 44068 87704 74590 36043 -10200 -9967 17322 37420 48132 50467
7423E0467K757N879k9987m60P782k780J3080j1396k710k9861K1704K2828k6791
$$ 50467 53224 59103 29116 28656 36438 33658 46738 35342 32632 2771 24475 47303 20512
7410B0512j9109J254j1364j5055K0359N42L1100J6993J4880K25k3741o383k303
$$ 20512 1403 2657 -8707 -23762 -3403 -2861 28239 45232 60112 60337 36596 30213 27910
7397B7910K303L42J0086M370j3610l4129k8636J7349K2896O490K8422k4840j3291
$$ 27910 30213 30555 40641 45011 31401 -2728 -31364 -14015 8881 15371 43793 18953 5662
7384E662J5529m243l6885k9157J121j1673K6083J6184j1102k5623l469o834Q831
$$ 5662 21191 16948 -19937 -49094 -47973 -59646 -33563 -17379 -28481 -54104 -57573 -64407 -55576
7371e5576M1421K9667J7727l2178K568K8612l2764J5009K1337K6468m924m7451
$$ -55576 -14155 15512 33239 1061 3629 32241 -523 14486 35823 62291 57367 9916
7359I916j868k9966K8032K3220j1511k1116J6561J7682j1014J0825j5116j3077
$$ 9916 8048 -21918 6114 29334 17823 -3293 13268 30950 19936 30761 15645 2568
7347B568K7217R32k1514J9827K8027K3870l6381l5303J3113N575J3500k7539p691
$$ 2568 29785 30717 9203 29030 57057 80927 44546 9243 22356 27931 41431 13892 6201
7334F201L6640J1511j1516j2925j4120L2490J4008l9884l593j1177q053o892J8015
$$ 6201 42841 54352 42836 29911 15791 48281 62289 22405 18812 7635 -418 -7310 10705
7321A0705Q190J7182q559k791j8079l786J5692p06q50N38l007j4205k6540p355
$$ 10705 18895 36077 27518 24727 6648 2862 18554 17848 16998 17536 14529 324 -26216 -33571
7307c3571M0429J5960K082k364J9641j5107k7008K5767J3685M506k5146r344O265
$$ -33571 6858 22818 24900 22536 42177 27070 62 25829 39514 44020 18874 9530 15795
7294A5795J1081n219m7993j3762K6688L16K46M0653K3616k1156j8674j87J8313
$$ 15795 26876 21657 -26336 -40098 -13410 -13094 -12848 27805 51421 30265 11591 11404 29717
7281B9717k4381R973J7773q367m6980l2401K3257L3106M368J3898L0094R143M031
$$ 29717 5336 15309 33082 24715 -22265 -54666 -31409 1697 6065 19963 50057 59200 63231
7268F3231K87n3972l2241J516j0466m475k830N58K5334Q212J5558N0260J1137
$$ 63231 63518 9546 -22695 -21179 -31645 -36120 -38950 -38392 -13058 -4846 10712 60972 72109
7255G2109k2539l7842O988K9142j5156j3850k185o675K4657j5063j4687o297O995
$$ 72109 49570 11728 18716 47858 32702 18852 16667 9992 34649 19586 4899 -1398 5597
7242E597J7446l084j9064r135k777K4282k1345k6536J682L5886J6312k7395k4058
$$ 5597 23043 19959 895 -8240 -11017 13265 -8080 -34616 -32934 2952 19264 -8131 -32189
7229c2189m267K4100r224J7882n754J8035K5153k941k363j2076j2607j6602Q213
$$ -32189 -36456 -12356 -21580 -3698 -9452 8583 33736 30795 28432 16356 3749 -12853 -4640
7216d640J8372K264R612p908P968j8027k2293L242P132K8534j328J4763J1448
$$ -4640 13732 15996 25608 17700 25668 7641 -14652 -11410 -4278 24256 22928 37691 49139
7203D9139n257j7139j6808n406J3560j4172j4713k8413m2258j0239L028L5246
$$ 49139 43882 26743 9935 4529 18089 3917 -10796 -39209 -81467 -91706 -88678 -53432
7191e3432m576L5016L0143J48j6873l9089j5398P342q039J7821N0066M1509J8058
$$ -53432 -58008 -22992 7151 7299 -9574 -48663 -64061 -56719 -64758 -46937 3129 44638 62696
7178F2696K8085m785k1195k4272J6031O781k4352q480k4436l5304n894L1204J8651
$$ 62696 90781 85996 64801 40529 56560 63341 38989 30509 6073 -29231 -35125 -3921 14730
7165A4730p472k9711r37J8910j1275l1943O970L5655J3626n366L1137L1318j8587
$$ 14730 7258 -22453 -23390 -4480 -15755 -47698 -40728 -5073 8553 3187 34324 65642 47055
7152D7055m0727r27J6983L7474k0924j9315N774k5305j3409o45j4771K0799j8198
$$ 47055 6328 5401 22384 59858 38934 19619 25393 88 -13321 -13966 -28737 -7938 -26136
7139b6136k3947Q757Q884l780P934K2916j7440J795K3670j7629J153K8938m821
$$ -26136 -50083 -41326 -32442 -36222 -28288 -5372 -22812 -21017 2653 -14976 -13823 15115 10294
7126A0294j0599Q145J2503J0500k19K28k1861k675Q813J5734j659p811k8208q454
$$ 10294 -305 7840 20343 30843 30624 30852 8991 6316 15129 30863 29204 21393 -6815 -15269
7112a5269J2994k5193j4591O343J7327K5837K295J7817K3771P667L642K6662M942
$$ -15269 -2275 -27468 -42059 -35716 -18389 7448 9743 27560 51331 58998 62640 89302 94244
7099I4244l1926n5034j5010m602K6119J2640L211j3487k1035P628j983K0705J3200
$$ 94244 62318 7284 -7726 -12328 13791 26431 29642 16155 -4880 2748 765 21470 34670
7086C4670j1163k4156j6652k2612r690M113L4213L569j885j1682o551p572N078
$$ 34670 23507 -649 -17301 -39913 -49603 -45490 -11277 -7708 -9593 -21275 -27826 -35398 -30320
7073c0320L0315L1518j485j2013l0439j9688m3222K3195M3304k928k030o653k5066
$$ -30320 -5 31513 30028 18015 -12424 -32112 -75334 -52139 -8835 -11763 -13793 -20446 -45512
7060d5512J1517J2166J9262J6651J3941J6729p55L245j5400j9766O141j4255j9720
$$ -45512 -33995 -21829 -2567 14084 28025 44754 43999 47244 31844 12078 18219 3964 -15756
7047a5756j2881l6067L5069K1760K3892J066J5581k3594l5471p363n606R333K3346
$$ -15756 -28637 -64704 -29635 -7875 16017 17083 32664 9070 -26401 -33764 -39370 -30037 -6691
7034f691K455k7264M343L4357l3478m4196K4612M500L7535M2452J7392n5180l3019
$$ -6691 -4236 -31500 -27157 7200 -26278 -70474 -45862 -41362 -3827 38625 56017 837 -32182
7021c2182k305J3981J4414J2850K4455K3585j9331j4753O300m652P174N25o373
$$ -32182 -34487 -20506 -6092 6758 31213 54798 35467 20714 27014 22362 29536 30061 23688
7008B3688l8315J7560L5770k8115r438K160K6215j305j7744j9688l840j9342M44
$$ 23688 -14627 2933 38703 10588 1150 3310 29525 28220 10476 -9212 -13052 -32394 -31950
6995c1950K0901K7568K476j1334N433L024l0632k3301m933J3266L70p049j239
$$ -31950 -11049 16519 18995 7661 13094 16118 -14514 -37815 -42748 -29482 -29112 -36161 -37400
6982c7400j69J7268K0122k023j888K8898j1909M551K2018J9233J0834r554l043
$$ -37400 -37569 -20301 -179 -2202 -4090 24808 12899 17450 39468 58701 69535 59981 56938
6969E6938j4391j4707m624L149q719o166j6236l4583l204j2164m812j7824K3714
$$ 56938 42547 27840 23216 26365 17646 11480 -4756 -39339 -42543 -54707 -59519 -77343 -53629
6956e3629N4876L4299r661k2953j1574k9927J5908L7748N4114k0048j8249Q452
$$ -53629 1247 35546 25885 2932 -8642 -38569 -22661 15087 69201 49153 30904 39356
6944C9356j6607m1312o773K8543J6669R123j5003j7530l9768j363R520m162L3459
$$ 39356 22749 -18563 -25336 3207 19876 28999 13996 -3534 -43302 -44665 -35145 -39307 -5848
6931e848L65j8011J5055K9999j856k3795q303J0681K4881K4104j0071K768j3014
$$ -5848 -5483 -23494 -8439 21560 19704 -4091 -12394 -1713 23168 47272 37201 39969 26955
6918B6955l1684K4398J8607j330m26K097j1863k5077K7132J8505m380j0854j632
$$ 26955 -4729 19669 38276 36946 36520 38617 26754 1677 28809 47314 42934 32080 30448
6905C0448k8671r727K2329l3211j5311K2686m970q201J7057K7977K31j2840r178
$$ 30448 1777 -7950 14379 -18832 -34143 -11457 -16427 -24628 -7571 20406 20637 7797 -1381
6892a381k18l37r87R453p504k8450k903k682P014J1757J8807k7883J7614l220
$$ -1381 -1599 -1936 -2923 6530 -974 -29424 -32327 -35009 -27995 -16238 2569 -25314 -7700 -10920
6878a0920j3971r44p601J3848m895K681k080k1629Q202R450J8304Q979q7j6062
$$ -10920 -24891 -25835 -33436 -19588 -24483 -21802 -23882 -45511 -37309 -27859 -9555 -576 -663 -16725
6864a6725q302p19r321L12l287j0146J3605R935m355J4796K9735o405j1858l5847
$$ -16725 -25027 -25746 -35067 -34755 -38042 -48188 -34583 -24648 -29003 -14207 15528 9123 -2735 -38582
6850c8582J6767J6307K0058k1396k9635k4317n243J7600J8656R108R325j0012
$$ -38582 -21815 -5508 14550 -6846 -36481 -60798 -66041 -48441 -29785 -20677 -11352 -21364
6838b1364n1757j4008K7490R791J6620N1975K7330J525l3574j2635p8R394j7503
$$ -21364 -73121 -87129 -59639 -49848 -33228 18747 46077 47602 14028 1393 1315 10709 -6794
6825f794k6052K3517j7555P738r411j5784l469j5128K189K5249M358j124J2004
$$ -6794 -32846 -9329 -26884 -19146 -28557 -44341 -47810 -62938 -60749 -35500 -31142 -32266 -20262
6812b0262K3088L0491j4278j2337L172J4444j0361j4528o512j6139L110Q295J6718
$$ -20262 2826 33317 19039 6702 9874 24318 13957 -571 -7083 -23222 -20112 -11817 4901
6799D901K551j6273J3624K2921k3186n512K9972l896k1897Q381J8033J7594j0325
$$ 4901 7452 -8821 4803 27724 4538 -974 28998 25102 3205 11586 29619 47213 36888
6786C6888j6549K794j6055l5730k3413J8853K4670j1941P882m306K8811J6749
$$ 36888 20339 23133 7078 -28652 -52065 -33212 -8542 -20483 -12601 -16907 11904 28653
6774B8653N889j1086m9788l145p31J0818J5574j7092r602R233J7673l409j1154
$$ 28653 34542 23456 -26332 -29477 -30208 -19390 -3816 -20908 -30510 -21277 -3604 -7013 -18167
6761a8167J3309J07K125J6123K1044J1328k2945J6154k920k9208j5803M750j9959
$$ -18167 -4858 -4751 -2626 13497 34541 45869 22924 39078 36158 6950 -8853 -4103 -24062
6748b4062j3942K6655J2585j5131k1025J0395K5398j374Q590n286j7671k6198
$$ -24062 -38004 -11349 1236 -13895 -34920 -24525 873 -501 8089 2803 -14868 -41066
6736d1066J0210K432j5246J8926K331m0510l2154J2575K6233J9232K3700P471
$$ -41066 -30856 -28424 -43670 -24744 -22413 -62923 -95077 -82502 -56269 -37037 -13337 -5866
6724e866R617L421J981P954J263J4088K565J2960q726j4918k6991L7752P680k1923
$$ -5866 3751 7172 9153 17107 18370 32458 35023 47983 39257 24339 -2652 35100 42780 20857
6710B0857K0426n202j6054j6854J816R951L7102K369k2380k8071j8021Q052j0322
$$ 20857 41283 36081 20027 3173 4989 14940 52042 54411 32031 3960 -14061 -6009 -16331
6697a6331L6552R364k4516M110n016j2361J00P632J6940L9513j0055m3338j689
$$ -16331 20221 29585 5069 9179 4163 -8198 -8098 -466 16474 55987 45932 2594 905
6684I05K0953m617q391M744j560M762k5796M304K6738l130J2387j0566k1487j5843
$$ 905 21858 17241 8850 13594 12034 16796 -9000 -4696 22042 18912 31299 20733 -754 -16597
6670a6597m878q628p499J1290J2830K6529j1097o526n309j5966J2657L1728L2679
$$ -16597 -21475 -30103 -37602 -26312 -13482 13047 1950 -4576 -9885 -25851 -13194 18534 51213
6657E1213J1602j3452k894j096r596r875j616J0481K1760P898k7758n8622n612
$$ 51213 62815 49363 46469 45373 35777 25902 24286 34767 56527 64425 36667 -21955 -27567
6644b7567K407J4871L3201J5o890j7815j9642n518M7272L7169L0500l888m6546
$$ -27567 -25160 -10289 22912 22927 16037 -1778 -21420 -26938 20334 57503 88003 84115 37569
6631C7569k9495J8215j096k7865l615p852J628K2603M348l3365k5689P690R08
$$ 37569 8074 26289 25193 -2672 -6287 -14139 -12511 10092 14440 -18925 -44614 -36924 -36016
6618c6016R308K4126r070j6658K5812P491J5894r182R3J4355j0250J0155p158
$$ -36016 -26708 -2582 -11652 -28310 -2498 4993 20887 11705 11798 26153 15903 26058 18900
6605A8900k2591M629k0736o831J5099L3185p928j9120p709O195j2835j0894P327
$$ 18900 -3691 938 -19798 -26629 -11530 21655 13727 -5393 -13102 -6907 -19742 -30636 -23309
6592b3309L6674k1365q726J1972l192j2601N471J4136p695o834K8159j603m108
$$ -23309 13365 -8000 -16726 -4754 -7946 -20547 -15076 -940 -8635 -15469 12690 11087 6979
6579F979j2345p137K6867m174p812q13k1560n333J5465k342K3351q905O315M6497
$$ 6979 -5366 -12503 14364 10190 2378 1565 -19995 -25328 -9863 -12205 11146 2241 8556 55053
6565E5053r786p018J7165j2258j7164o666K170M380K0993L7274j5215r122n836
$$ 55053 45267 38249 55414 43156 25992 19326 21496 25876 46869 84143 68928 59806 53970
6552E3970j1212k7720j7451j9323j3020k0448M3217n278K028M5800J7230j1878
$$ 53970 42758 15038 -2413 -21736 -34756 -55204 -11987 -17265 -15237 30563 47793 35915
6540C5915r225m4160k8132L702Q673j0661L5278J0232l3937m3906M505N5137K9750
$$ 35915 26690 -17470 -45602 -41900 -33227 -43888 -8610 1622 -32315 -76221 -71716 -16579 13171
6527A3171j157k2430K500L9674O18k4752l6251j2662J1792J8010P445j8504P112
$$ 13171 12014 -10416 -7916 31758 32376 7624 -28627 -41289 -29497 -11487 -4042 -22546 -15434
6514a5434L3483J3884k0141K332J1769r420P055q195O458K7958k4760k1423l2579
$$ -15434 18049 31933 11792 14124 25893 16473 23528 15333 21791 49749 24989 3566 -29013
6501b9013J7718L4511J3135k9819l488J624l553J2171P344q274j6720N559o613
$$ -29013 -11295 23216 36351 6532 3044 4668 1115 13286 20630 12356 -4364 1195 -5418
6488e418J3693N292p164j0213j9287R832R119R906k7338k7448J3329J4691K1573
$$ -5418 8275 13567 6403 -3810 -23097 -13265 -4146 5760 -21578 -49026 -35697 -21006 567
6475E67M520J2052K2032p83K22M819o566k5731m1754j5584N05L8714K4555k0813
$$ 567 5087 17139 39171 38388 38610 43429 36863 11132 -30622 -46206 -45701 -6987 17568 -3245
6461c245j3522j0216m262J7026J8441o344j1648J0773L2956O480j5139j1234m008
$$ -3245 -16767 -26983 -31245 -14219 4222 -2122 -13770 -2997 29959 36439 21300 10066 6058
6448F058K43j6693k0375n531J8354J1842J822j1703j2920r350M073J2621J8641
$$ 6058 6301 -10392 -30767 -36298 -17944 -6102 -4280 -15983 -28903 -38253 -34180 -21559 -2918
6435b918j6540J8675j3110k2547J7332J6820j1082k2953l036j0853p902L9426
$$ -2918 -19458 -783 -13893 -36440 -19108 -2288 -13370 -36323 -39359 -50212 -58114 -18688
6423a8688K7176q75k1476j3193k6475R445K2537K0839j7671J2011Q164q444k9289
$$ -18688 8488 7613 -13863 -27056 -53531 -44086 -21549 -710 -18381 -6370 1794 -6650 -35939
6410c5939J8025j6483l4312L1239J144J2248j4565l2784n773K0946J0822K3559
$$ -35939 -17914 -34397 -68709 -37470 -36326 -24078 -38643 -71427 -77200 -56254 -45432 -21873
6398b1873K5082p177r218L524k241L558J9274J1135M68J0958J4859Q173l9474
$$ -21873 3209 -3968 -13186 -9662 -11903 -8345 10929 22064 22532 33490 48349 56522 17048
6385A7048k4595j0523L6906K4616j8168j0490n848n0734l4890L5087L3261J7480
$$ 17048 -7547 -18070 18836 43452 25284 14794 8946 -41788 -76678 -41591 -8330 9150
6373I150R822Q053J6343k648J285l8737j0412K0143J3754l6404M708K5437J4578
$$ 9150 18972 27025 43368 40720 42005 3268 -7144 12999 26753 -9651 -4943 20494 35072
6360C5072k6968m520R043Q058j3798m5871l7628N528K1589J4600L8126j2849k3824
$$ 35072 8104 3584 12627 20685 6887 -38984 -76612 -71084 -49495 -34895 3231 -9618 -33442
6347c3442R194K3000j2864l3747k7912O758L5627N3398L3432j7325J7347O390
$$ -33442 -24248 -1248 -14112 -47859 -75771 -69013 -33386 20012 53444 36119 53466 59856
6335E9856l3998l9314j8085P248J7292M454k0901N201Q246j3114n4720j000O0964
$$ 59856 25858 -13456 -31541 -24293 -7001 -2547 -23448 -18247 -10001 -23115 -77835 -78835 -17871
6322a7871K6520k8010k1120R12J4407R066j692J0899J1580j8610l549j5411r929
$$ -17871 8649 -19361 -40481 -39569 -25162 -16096 -17788 -6889 4691 -13919 -17468 -32879 -42808
6309d2808L25k566k8855K5490K6836J4952K4420J1032m599m9550j3321J6382J0727
$$ -42808 -42483 -45049 -73904 -48414 -21578 -6626 17794 28826 24227 -25323 -38644 -22262 -11535
6296a1535K0138J0173j8650M603j1279j7162j039J4158K9439L457k9501k8209
$$ -11535 8603 18776 126 4729 -6550 -23712 -24751 -10593 18846 22303 -7198 -35407
6284c5407J4300L5053J7398o347J6782j1254j8123l741j0179j9189K3906L2082
$$ -35407 -21107 13946 31344 24997 41779 30525 12402 8661 -1518 -20707 3199 35281
6272C5281n550j4432r187j0494O787R585K8034l4205m0534j7934j617J9120K7464
$$ 35281 29731 15299 6112 -4382 2405 11990 40024 5819 -34715 -52649 -54266 -35146 -7682
6259g682L0074M746K726O187p499n090j0365J5103l854k0826K0728J2040j589
$$ -7682 22392 27138 29864 36051 28552 23462 13097 28200 24346 3520 24248 36288 34699
6246C4699p276l9794R271j475K976N614K2335k2863k3337J530J3466N478R564
$$ 34699 27423 -12371 -3100 -4575 -1599 4015 26350 3487 -19850 -18320 -4854 624 10188
6233A0188L469k0557k0015M1537K0427j0648K45j3148j9547J7591k733k5004j3169
$$ 10188 13657 -6900 -26915 14622 35049 24401 24646 11498 -8049 9542 6809 -18195 -31364
6220c1364K0297N53K4991J0755l711j7839k480k3322k6701l016m350q700q678
$$ -31364 -11067 -10514 14477 25232 21521 3682 1202 -22120 -48821 -51837 -56187 -64887 -73565
6207g3565K8827N698M981o305M7749J8076n5786j3206J988L5392J6474j395K2562
$$ -73565 -44738 -39040 -34059 -40364 7385 25461 -30325 -43531 -41543 -6151 10323 8928 31490
6194C1490J1930P874q690J1141n106j4395k3661q914P184j5069l7141L3127L2980
$$ 31490 43420 51294 42604 53745 48639 34244 10583 1669 8853 -6216 -43357 -10230 22750
6181B2750J6217k0979l9251J6399J6123p87k1396o495J489m026j909k7978L720
$$ 22750 38967 17988 -21263 -4864 11259 10472 -10924 -17419 -15930 -19956 -21865 -49843 -46123
6168d6123O614L3182P103Q011J1351j2577j8865J8483K5343J976j8204j6368L343
$$ -46123 -39509 -6327 776 8787 20138 7561 -11304 7179 32522 34498 16294 -74 3269
6155C269l775j1180n966K1008J0851j9950K628R221Q570k8963J0437R456P756
$$ 3269 -506 -11686 -17652 3356 14207 -5743 -3115 6106 14676 -14287 -3850 5606 13362
6142A3362j4771k3480k8417N861K3498K4423K9411k0941j197J3654M569j5683
$$ 13362 -1409 -24889 -53306 -47445 -23947 476 29887 8946 7749 21403 25972 10289
6130A0289r717j9772j8923o79K4970j51J340K4982k18j1309O893N0442j5816k1771
$$ 10289 572 -19200 -38123 -38802 -13832 -13983 -12643 12339 12121 812 7705 58147 42331 20560
6116B0560k583p980p280l068n937k1498j6795j6802j3506J5968J1788K4232M884
$$ 20560 17977 9997 2717 -351 -6288 -27786 -44581 -61383 -74889 -58921 -47133 -22901 -18017
6103a8017L0947p862l6815j1150p528K146J2981K4677J0853J5236o67k5218k6061
$$ -18017 12930 5068 -31747 -42897 -50425 -48279 -35298 -10621 232 15468 14801 -10417 -36478
6090c6478K9095K8366q528K127J8218Q807j0384n709q709l411l2544j7551N753
$$ -36478 -7383 20983 12455 14582 32800 41607 31223 25514 16805 13394 -19150 -36701 -30948
6077c0948L5988M2051P661l3600p205p597l1324k1162K4138R086R994j54K1747
$$ -30948 5040 47091 54752 21152 13947 6350 -24974 -46136 -21998 -12912 -2918 -3072 18675
6064A8675M077j7596k7395j7478Q803J7099q643k6070O519J0100N109k6249N935
$$ 18675 22752 5156 -22239 -39717 -30914 -13815 -22458 -48528 -42009 -31909 -26800 -53049 -47114
6051d7114R28q001k6206J9560K9489R94K6650J8419j8221k2496J8101L426k531
$$ -47114 -46186 -54187 -80393 -60833 -31344 -30350 -3700 14719 -3502 -25998 -7897 -4471 -7002
6038g002K546J0310L627Q960j6437j7007L469J1539k2001Q43Q301J7832P968L2840
$$ -7002 -4456 5854 9481 18441 2004 -15003 -11534 5 -21996 -21153 -12852 4980 12948 45788
6024D5788n564k1642j3049q912j994k517J2045J6692l337j9793o285q189j1898
$$ 45788 40224 18582 5533 -3379 -5373 -7890 4155 20847 17510 -2283 -8568 -16757 -28655
6011b8655j1236o456q367j2676n456J4931M1639J3654j4309j1905K5911P045j2897
$$ -28655 -39891 -46347 -54714 -67390 -72846 -57915 -16276 -2622 -16931 -28836 -2925 4120 -8777
5998h777j4458l7588m206K4069K01j0543J1033o793j2660M5278L4506O125N042
$$ -8777 -23235 -60823 -65029 -40960 -40759 -51302 -40269 -47062 -59722 -14444 20062 26187 31229
5985C1229l4238j432K448l787p400K579j4454j5479k963R519p570j608p915R283
$$ 31229 -3009 -4441 -1993 -5780 -13180 -10601 -25055 -40534 -43497 -33978 -41548 -43156 -51071 -41788
5971d1788Q121N921p157M124J3206P251J8824O374O459P986J1529J2075J6095
$$ -41788 -33667 -27746 -34903 -30779 -17573 -10322 8502 14876 21335 29321 40850 52925 69020
5958F9020m1707k7766j053K1549k1929r992r52K5877J8804K033J898N685M853
$$ 69020 27313 -453 -1506 20043 -1886 -11878 -12830 13047 31851 33884 35782 41467 46320
5945D6320j9924m502j9614j6428K0802L6215R981K910p048n264L608j9384K0836
$$ 46320 26396 21894 2280 -14148 6654 42869 52850 55760 48712 43448 47056 27672 48508
5932D8508R606n967L71k4213l3539J7925O59J6560k745j3297j2161K822J3941
$$ 48508 58114 52147 52518 28305 -5234 12691 13350 29910 27165 13868 1707 4529 18470
5919A8470j545j283J7842n2018k8893L718l078K329j2464M2662K0834J571K8884
$$ 18470 16925 15642 33484 -18534 -47427 -43709 -46787 -44458 -56922 -14260 6574 8145 37029
5906C7029j248j2075k750k4433j6791j4087l057K5409K4660N231j1506j1870k3993
$$ 37029 35781 23706 20956 -3477 -20268 -34355 -37412 -12003 12657 17888 6382 -5488 -29481
5893b9481k9859K4828L0509K2153k8284k0596M26P046K6953j6172k1842J778k6201
$$ -29481 -59340 -34512 -4003 18150 -10134 -30730 -30304 -23258 3695 -12477 -34319 -32541 -58742
5880e8742J5606K8133j4133n460R374j9782O262j4437j3576L157N061Q257k9573
$$ -58742 -43136 -15003 -29136 -34596 -25222 -45004 -38742 -53179 -66755 -63598 -58537 -50280 -79853
5867g9853J2526L3424J4557J8287l8017o475J7146K3472j1665L783J7590j3247
$$ -79853 -67327 -33903 -19346 -1059 -39076 -45551 -28405 -4933 -16598 -12815 4775 -8472
5855h472R614j6248l9018J674L9870O014O779P963p591j938K817j1801K6284k8600
$$ -8472 1142 -15106 -54124 -52450 -12580 -6566 213 8176 585 -1353 1464 -10337 15947 -12653
5841a2653k3964K3488L8655K6141k7206k0923n739q294j8811M491L4734J9643
$$ -12653 -36617 -13129 25526 51667 24461 3538 -2201 -10495 -29306 -24815 9919 29562
5829B9562J207J0472r324J5250J539L542o258m3423M284q778R86K7022J2298r615
$$ 29562 30769 41241 31917 47167 48706 52248 45990 2567 6851 -1927 -941 26081 38379 28764
5815B8764l2459j6145R69N695J2522K5826J4488M339l7239p424J0138l773k4611
$$ 28764 -3695 -19840 -18871 -13176 -654 25172 39660 43999 6760 -664 9474 5701 -18910
5802a8910J1133K4150m675m6816J0307P914P326j470r353k9841j0615K8849K9417
$$ -18910 -7777 16373 11698 -35118 -24811 -16897 -9571 -11041 -20394 -50235 -60850 -32001 -2584
5789b584K1475O244o826j0826j1181k0681k525M8818L2162P258j0693l9852j8929
$$ -2584 18891 25135 18309 7483 -3698 -24379 -26904 21914 54076 61334 50641 10789 -8140
5776h140p827M289j3349j4340J8848P064L5462m925k0679k4614J0632p735K0589
$$ -8140 -15967 -11678 -25027 -39367 -20519 -13455 22007 17082 -3597 -28211 -17579 -25314 -4725
5763d725r462R436K4847R93N962k886j4555j7212K2045j4421j2332k5217j8378
$$ -4725 -14187 -4751 20096 21089 27051 24165 9610 -7602 14443 22 -12310 -37527 -55905
5750e5905k8821L4193N0641M9184m618k7624m2541J3141J2680j0015p759j990
$$ -55905 -84726 -50533 108 49292 44674 17050 -25491 -12350 330 -9685 -17444 -19434
5738a9434K910Q344k660j3326J1297K3649K0708l271J0632m4858K780L0725J385
$$ -19434 -16524 -8180 -10840 -24166 -12869 10780 31488 28217 38849 -6009 -3229 27496 28881
5725B8881j2385j2601K2724k6253k7130q154K1078K5786L1893j1121K949J5643
$$ 28881 16496 3895 26619 366 -26764 -34918 -13840 11946 43839 32718 35667 51310
5713E1310j1396j2423J3587K635k6016k3200l5371J3858L1873o408J3723J8748
$$ 51310 39914 27491 41078 43713 17697 -5503 -40874 -27016 4857 -1551 12172 30920
5701C0920o641n350L551L0946P463j8756k2977l138k4524J0873P220n177j3388
$$ 30920 24279 18929 22480 53426 60889 42133 19156 16018 -8506 2367 9587 4410 -8978
5688h978P965q038j6384j2937j995N890L1200J5098j9072k043r024k4381R514
$$ -8978 -1013 -9051 -25435 -38372 -40367 -34477 -3277 11821 -7251 -9294 -18318 -42699 -33185
5675c3185K1456R368p16j7779r9K209K3468M92J5927m781j1992K3779L3545L5888
$$ -33185 -11729 -2361 -3077 -20856 -20955 -18746 4722 5214 21141 16360 4368 28147 61692 97580
5661I7580k7241k9091k6514l2395l007J0451K238r839l2457q702J0231K1718J7409
$$ 97580 70339 41248 14734 -17661 -20668 -10217 -7979 -17818 -50275 -58977 -48746 -27028 -9619
5648i619K111J309j5930j407p693n850K4661k0428P800L5000K8206j7614K038
$$ -9619 -7508 -6199 -22129 -23536 -31229 -37079 -12418 -32846 -25046 9954 38160 20546 22584
5635B2584P193k7233j4391K4479k1477l592q092J7618J454O778J4442J3192j7615
$$ 22584 29777 2544 -11847 12632 -8845 -12437 -20529 -2911 -1457 5321 19763 32955 15340
5622A5340j7853l3489k0901J3923N84J3905K8417k0827J0903K6209J5647m593
$$ 15340 -2513 -36002 -56903 -42980 -42396 -28491 -74 -20901 -9998 16211 31858 27265
5610B7265j669k915j7524R545o067K1274q441l9586Q057J1101J469J4189K5737
$$ 27265 25596 22681 5157 14702 8635 29909 21468 -18118 -10061 1040 2509 16698 42435
5597D2435k9947j9752j330k2097j4086J153K5467J4586m150L2366O027R577k2204
$$ 42435 12488 -7264 -8594 -30691 -44777 -43624 -18157 -3571 -7721 24645 30672 40249 18045
5584A8045j2924J1855l4252k3609J0142K7567M684j5161k0059O282q44J0440j1775
$$ 18045 5121 16976 -17276 -40885 -30743 -3176 1508 -13653 -33712 -27430 -28274 -17834 -29609
5571b9609o49K5979j9571j4512j841p702o82M0015J2949Q181o718k2476o698j6154
$$ -29609 -30258 -4279 -23850 -38362 -40203 -47905 -48587 -8572 4377 12558 5840 -16636 -23334 -39488
5557c9488K924J982J7528j4576R150K0702K0208P183K8340K4490l6811N197k4273
$$ -39488 -36564 -34582 -17054 -31630 -22480 -1778 18430 25613 53953 78443 41632 46829 22556
5544B2556l3815M964J6235K0251J2040j4398R850j4351m0459J316o265l613l3561
$$ 22556 -11259 -6295 9940 30191 42231 27833 37683 23332 -17127 -15811 -22076 -25689 -59250
5531e9250q787L7169K1996J4222q817j5334M816L7526J2104j5467j3588j0480
$$ -59250 -68037 -30868 -8872 5350 -3467 -18801 -13985 23541 35645 20178 6590 -3890
5519c890l1978K286M9301R994j4842p212L4863J6837l3186l317p780m5735j7277
$$ -3890 -35868 -33582 15719 25713 10871 3659 38522 55359 22173 18856 11076 -34659 -51936
5506e1936L3938J8949K5450J5632k4796k536p542m25l1972k63L7361N887J3493
$$ -51936 -17998 951 26401 42033 17237 14701 7159 6734 -25238 -25501 11860 17747 31240
5493C1240k1293k0275J9769J009l981j6752j5650J1195J4554n906n454K2930Q652
$$ 31240 9947 -10328 9441 10450 6469 -10283 -25933 -14738 -184 -6090 -11544 11386 20038
5480B0038j1377l6874q993L1325L0656k6q525j0343m5542k7025J3047J189R967
$$ 20038 8661 -28213 -37206 -5881 24775 24749 16224 5881 -39661 -66686 -53639 -52450 -42483
5467d2483K2860N924j0315j2025J6511K4434q098k5696Q238R000m888q970M2898
$$ -42483 -19623 -13699 -24014 -36039 -19528 4906 -3192 -28888 -20650 -11650 -16538 -25508 17390
5454A7390p173k5184k382P686j4417N364l910o618l6229N1603K5036k2823l771
$$ 17390 10217 -14967 -17349 -9663 -24080 -18716 -22626 -29244 -65473 -13870 11166 -11657 -15428
5441a5428O185q257j05J1773j9070J616Q775j3854k5041j640N838L5663J0191
$$ -15428 -9243 -17500 -17605 -5832 -24902 -23286 -14511 -28365 -53406 -55046 -49208 -13545 -3354
5428c354n152j1836j7946J9921L5448J9491q920n534k248N574j6486J716J5141
$$ -3354 -8506 -20342 -38288 -18367 17081 36572 27652 22118 19870 25444 8958 10674 25815
5415B5815j360J0960p517k7515q452K2128j8421k8484Q987L1304N568k1848j499
$$ 25815 24455 35415 27898 383 -8069 14059 -4362 -32846 -23859 7445 13013 -8835 -10334
5402a0334K883r471K4042O425m6525j4065R070k565J962j464r147J5089J3690
$$ -10334 -7451 -16922 7120 13545 -32980 -47045 -37975 -40540 -38578 -40042 -49189 -34100 -20410
5389b0410J0264R353M332j1526k2231J0441j4836O277J9557J8012K8702L0621
$$ -20410 -10146 -793 3539 -7987 -30218 -19777 -34613 -28336 -8779 9233 37935 68556
5377F8556K0630j0741j0910m801j6996k1137k2962l0121R891L0688L065P108o204
$$ 68556 89186 78445 67535 62734 45738 24601 1639 -28482 -18591 12097 15162 22270 16066
5364A6066j6353k1339J7460q361j4357N003M3687R420q869k4025m498K5786J0728
$$ 16066 -287 -21626 -4166 -12527 -26884 -21881 21806 31226 22357 -1668 -6166 19620 30348
5351C0348l7391k1082Q863O975L4035L673k2338J47q085o19L992j1654J3963J0433
$$ 30348 -7043 -28125 -19262 -12287 21748 25421 3083 3230 -4855 -5474 -1482 -13136 827 11260
5337A1260k292m346k53j3717N421k678J2322l4481k3372R393N092J1197j0314
$$ 11260 8968 4622 4369 -9348 -3927 -6605 5717 -28764 -52136 -42743 -37651 -26454 -36768
5324c6768j8257j2677J5671K2241R238M01l606K0890q05j0057R076Q545j3993
$$ -36768 -55025 -67702 -52031 -29790 -20552 -20151 -23757 -2867 -3672 -13729 -4653 3892 -10101
5311a0101O55K2050k2177j8541K2571J5505Q996m372l982K9170Q7j7149j4793
$$ -10101 -9446 12604 -9573 -28114 -5543 9962 18958 14586 10604 39774 39861 22712 7919
5298G919R341R158J1382k0259l0777J7147m095j9863j6974N411J0824J3395K922
$$ 7919 17260 26418 37800 17541 -13236 3911 -184 -20047 -37021 -31610 -20786 -7391 -4469
5285d469J190j4411P004J1338J4924M280N85K1942j9547j8284R73l131K3749k2540
$$ -4469 -3279 -17690 -10686 652 15576 19856 20441 42383 22836 4552 5525 2394 26143 3603
5271C603l3905j3744K1693r619j5203l09o788R537K1005J9143o746j720q886n055
$$ 3603 -30302 -44046 -22353 -31972 -47175 -47484 -54272 -44735 -23730 -4587 -11333 -13053 -21939 -26994
5257b6994J7385M99n259k6800M0203J5774l7599q423L958K0215q312l8904j0744
$$ -26994 -9609 -9110 -14369 -41169 -966 14808 -22791 -31214 -27256 -7041 -15353 -54257 -65001
5244f5001J6857J8687O813O864j9896J4018N257k6920m897J7570P364K6428K3952
$$ -65001 -48144 -29457 -22644 -15780 -35676 -21658 -16401 -43321 -48218 -30648 -23284 3144 27096
5231B7096N13n2841k0989J1000Q051k6799J2981M8727M0856j5029o517j0051k1825
$$ 27096 27609 -25232 -46221 -35221 -27170 -53969 -40988 7739 48595 33566 27049 16998 -4827
5218d827L265M0307j7416l1309J1582J9059k7p00j1658l647K9852l624j7093q284
$$ -4827 -1562 38745 21329 -9980 1602 20661 20634 19934 8276 4629 34481 30857 13764 5480
5204E480p238j0852r318J5571K0558j0138N377L086R054Q688l0529m1192L908
$$ 5480 -1758 -12610 -21928 -6357 14201 4063 9440 12526 21580 30268 -261 -41453 -37545
5191c7545J6918K9754P958k8907Q140J9008r259l2051k1861J961K5259L0741J217
$$ -37545 -20627 9127 17085 -11822 -3682 15326 6067 -25984 -47845 -45884 -20625 10116 11333
5178A1333q131M114L968j030o038j0141p579J3464j967J1087p524j6459j1781
$$ 11333 3202 7316 11284 10254 4216 -5925 -13504 -40 -2007 9080 1556 -14903 -26684
5165b6684Q38J5651O209j0749q963M4792J3927P195k3085m0668l10L8984L1967
$$ -26684 -25846 -10195 -3986 -14735 -23698 21094 35021 42216 19131 -21537 -21847 17137 49104
5152D9104k6114O514k7114j2777K5223k4176J0902m709k580o81J9771q175m6778
$$ 49104 22990 29504 2390 -10387 14836 -9340 1562 -3147 -5727 -6408 13363 5188 -41590
5139d1590j3628k5952k4402K78l019L3403L7124J2197j3949j0573O417L3525P079
$$ -41590 -55218 -81170 -105572 -105294 -108313 -74910 -37786 -25589 -39538 -50111 -43694 -10169 -3090
5126c090j6186k9662m792K6688K8589k4472q858L746O715K7831J8421k9763k6480
$$ -3090 -19276 -48938 -53730 -27042 1547 -22925 -31783 -28037 -21322 6509 24930 -4833 -31313
5113c1313R434K3857m584j5313Q037k3577O60O237J7747J9965j4622k3473m748
$$ -31313 -21879 1978 -2606 -17919 -9882 -33459 -32799 -26562 -8815 11150 -3472 -26945 -31693
5100c1693K4182K5625K371k0819R248J0129J2532j5188k6349m54l284l8712J296
$$ -31693 -7511 18114 20485 -334 8914 19043 31575 16387 -9962 -10416 -13700 -52412 -51116
5087e1116L1455J4642K4694N350j2558j3894l4854Q152O030k3860N32J4129R488
$$ -51116 -19661 -5019 19675 25025 12467 -1427 -36281 -28129 -22099 -45959 -45427 -31298 -21810
5074b1810p393J463J8765R362O210l8340J2536K0007j6676P146J3160l166k4833
$$ -21810 -29203 -27740 -8975 387 6597 -31743 -19207 800 -15876 -8730 4430 1264 -23569
5061b3569j1236J2150j1832P867O3376L1925j3746m469J750l3206k3155k377k1129
$$ -23569 -34805 -22655 -34487 -26620 36756 68681 54935 50466 52216 19010 -4145 -6522 -27651
5048b7651p129k3394n520k923K1012k5415j9625K1602L0258L3537O012o131j5293
$$ -27651 -34780 -58174 -63694 -66617 -45605 -71020 -90645 -69043 -38785 -5248 764 -5367 -20660
5035b0660j7037q041J0650M9372j1975j748o400j9399m185M77K5492R532L1992
$$ -20660 -37697 -45738 -35088 14284 2309 561 -5839 -25238 -29423 -28946 -3454 6078 38070
5022C8070k0165L075J1560j9294p402p225J507J300j2870Q818P305N198j2172
$$ 38070 17905 20980 32540 13246 5844 -1381 126 1426 -11444 -2626 4679 9877 -2295
5009b295K284j292k1798J6432K0096l220K1683P86j901K2013N261k6229k7278
$$ -2295 -11 -1303 -23101 -6669 13427 10207 31890 32676 30775 52788 58049 31820 4542
4996D542k1543j2238J135L106j5965j3820R883o09j1K1367L4595k2772j521J0280
$$ 4542 -17001 -29239 -28104 -24998 -40963 -54783 -44900 -45509 -45520 -24153 10442 -12330 -13851 -3571
4982c571K8619j8414j9795P748j6681j4803K4725L1645j5653l2550J4334q159
$$ -3571 25048 6634 -13161 -5413 -22094 -36897 -12172 19473 3820 -28730 -14396 -22555
4970b2555J1053J3255j4659N933L4022j970l7259l0806P082J7832K4459m337j2761
$$ -22555 -11502 1753 -12906 -6973 27049 25079 -12180 -42986 -35904 -18072 6387 2050 -10711
4957a0711j1084J0830j7883K2130P953J2145J3154M561j1015K9111M2k4298j9680
$$ -10711 -21795 -10965 -28848 -6718 1235 13380 26534 31095 20080 49191 49233 24935 5255
4944E255o119M23J9508J2264q230J2338K7212k4648l3677j8959J7530j8203k1318
$$ 5255 -864 -441 19067 31331 23101 35439 62651 38003 4326 -14633 2897 -15306 -36624
4931c6624l0050j7167J7069j00L5373J1331J1420j1250k5583j3128Q299j6716
$$ -36624 -66674 -83841 -66772 -66872 -31499 -20168 -8748 -19998 -45581 -58709 -50410 -67126
4919f7126n577M0630J2950K0202L310m605j2701j3274J1186Q005Q057p083j436
$$ -67126 -72703 -32073 -19123 1079 4389 -216 -12917 -26191 -15005 -7000 1057 -6026 -7462
4906g462J6202J1434l3975k6316L1057L927l290L014J8275J621K109j5428j6338
$$ -7462 8740 20174 -13801 -40117 -9060 -5133 -8423 -5409 12866 14487 16596 1168 -15170
4893a5170K2256r010j5985j1884J2411J8713j7180l499l993K2034m904m0803j3745
$$ -15170 7086 -1924 -17909 -29793 -17382 1331 -15849 -19348 -23341 -1307 -6211 -47014 -60759
4880f0759N0611K2954l7196Q148J9537m337l291p802k0907O011Q185j1459j3948
$$ -60759 -10148 12806 -24390 -16242 3295 -1042 -4333 -12135 -33042 -27031 -18846 -30305 -44253
4867d4253j9304R477K5829L775N699j2766o125L5795J8653R999L2259J2254l4149
$$ -44253 -63557 -54080 -28251 -24476 -18777 -31543 -37668 -1873 16780 26779 59038 71292 37143
4854C7143j9895j675l4073l929R321q951n231j5225j5871O716J144K4308K9653
$$ 37143 17248 15573 -18500 -22429 -13108 -22059 -27290 -42515 -58386 -51670 -50526 -26218 3435
4841C435J1596j4029N239J3113O903q818j9058j6227j5731K7233N4328J4702q457
$$ 3435 15031 1002 6241 19354 26257 17439 -1619 -17846 -33577 -6344 47984 62686 54229
4828E4229k1415k1372j5679n51J1746P988P246J3224k8j940P434r133l0063j221
$$ 54229 32814 11442 -4237 -4788 6958 14946 22192 35416 35388 33448 40882 31749 1686 465
4814D65K2532k0072m4334J1462L1538R859J5180k5932k7627J5821N6813P252j4099
$$ 465 22997 2925 -41409 -29947 1591 11450 26630 698 -26929 -11108 45705 52957 38858
4801C8858k734r560j3139J577K6105k9843L580Q247p304k5375k0468j1514J7787
$$ 38858 36124 26564 13425 15002 41107 11264 14844 23091 15787 -9588 -30056 -41570 -23783
4788b3783K0669K2627J7269l3498k0270K0030k666J4251m54k6722k4617K6390
$$ -23783 -3114 19513 36782 3284 -16986 3044 378 14629 14175 -12547 -37164 -10774
4776a0774J5225k589m1443k3671L1049L5262J6079R8M699l849J3611k1620k8417
$$ -10774 4451 1862 -39581 -63252 -32203 3059 19138 19236 23935 20086 33697 12077 -16340
4763a6340k0375k4293o79J3068K1096j492j7667k5238j0039M2920K2444J2923
$$ -16340 -36715 -61008 -61687 -48619 -27523 -29015 -46682 -71920 -81959 -39039 -16595 -3672
4751c672J1948l3069q439J3992o698k102o732j5465L139k304K8833K1440N158
$$ -3672 8276 -24793 -33232 -19240 -25938 -28040 -34772 -50237 -47098 -49402 -20569 871 6029
4738F029L600J1782j6633k4288n5364J5442J8071K6323K6966P420k2340J963o670
$$ 6029 9629 21411 4778 -19510 -74874 -59432 -41361 -15038 11928 19348 -2992 -1029 -7699
4725g699k344J6730P917j3940j162N836l485J7000J8105q070j6338p613j9731
$$ -7699 -10043 6687 14604 664 -498 5338 1853 18853 36958 28888 12550 4937 -14794
4712a4794j3544L0738j331k4926k1032k0019k1794O165L5390K7325K0764J2375
$$ -14794 -28338 2400 1069 -23857 -44889 -64908 -86702 -80537 -45147 -17822 2942 15317
4700A5317j650j978j9032k4877P750J9291L0156j2576k6575J5093j5350r310k995
$$ 15317 13667 11689 -7343 -32220 -24470 -5179 24977 12401 -14174 919 -14431 -23741 -26736
4687b6736k5065J245J7320O072k3227K2233J2518N521K2137r525j6629p294q027
$$ -26736 -51801 -50556 -33236 -27164 -50391 -28158 -15640 -10119 12018 2493 -14136 -21430 -29457
4674b9457K8565J4392j5202q551J0922j038r457J820n667j9802l0866j1086L3632
$$ -29457 -892 13500 -1702 -10253 669 -369 -9826 -8006 -13673 -33475 -64341 -75427 -41795
4661d1795K7424k568k4744j0836J8158K5693j9255K5019K8241P901j9196j3812
$$ -41795 -14371 -16939 -41683 -52519 -34361 -8668 -27923 -2904 25337 33238 14042 230
4649B30K4323J1704J2951j5553o964j1490M494J2210q115J1938j4265j0256J0557
$$ 230 24553 36257 49208 33655 26691 15201 19695 31905 23790 35728 21463 11207 21764
4636B1764j2813k263j2416j1773J2480L997J1675j6124m7022q880N2934J2215
$$ 21764 8951 6688 -5728 -17501 -5021 -1024 10651 -5473 -52495 -61375 -8441 3774
4624C774O998k087j680o500J3001k5227k4294o469J251j7410j3446R050j6404
$$ 3774 10772 8685 7005 505 13506 -11721 -36015 -42484 -41233 -58643 -72089 -63039 -79443
4611g9443L4149L5184L3506J333K0025j7685m4357R45k600n764M3329K4477m9658
$$ -79443 -45294 -10110 23396 24729 44754 27069 -17288 -16343 -18943 -24707 18622 43099 -6559
4598f559R405K4967J9908K068j8669l4990M205m630Q865O405m982O126K9624m661
$$ -6559 2846 27813 47721 49789 31120 -3870 335 -4295 4570 10975 5993 12119 41743 37082
4584C7082m6935l4347K2468L4297j311l0643J9552J4667j4850lj4294k703P559
$$ 37082 -9853 -44200 -21732 12565 11254 -19389 163 14830 -20 -23 -14317 -17020 -9461
4571i461k133J8536l26j8324j8677j5827L0186J8324R716J1238J038k4813n904
$$ -9461 -11594 6942 6616 -11708 -30385 -46212 -16026 2298 12014 23252 24290 -523 -6427
4558f427M2261L8828k6495k2782J224j1190j0572j7685j0091Q250N515k0605j0690
$$ -6427 35834 74662 48167 25385 26609 15419 4847 -12838 -22929 -14679 -9164 -29769 -40459
4545d0459j7233J8907K3719n480j32J7909l4542l7386M2644L5836k1715j1125
$$ -40459 -57692 -38785 -15066 -20546 -20678 -2769 -37311 -74697 -32053 3783 -17932 -29057
4533b9057N912M1779J9979j1956j7544j1970K5281L955l1787L660Q37k956k54
$$ -29057 -23145 18634 38613 26657 9113 -2857 22424 26379 -5408 -1748 -911 -3867 -4121
4520d121J9808k5554k1585L7838J0110M979p648R958l263Q38q439j046Q223M072
$$ -4121 15687 -9867 -31452 6386 16496 21475 13827 23785 20522 21360 12921 11875 20098 24170
4506B4170j9748m1938j8557L7359r908K1723L0453L169k7046j0844J908m18m002
$$ 24170 4422 -37516 -56073 -18714 -28622 -6899 23554 26723 -323 -11167 -9259 -9677 -13679
4493a3679k5718p062L218J2917k0271m908J61j3374O103J0191K2093N90k737J5616
$$ -13679 -39397 -46459 -43241 -30324 -50595 -55503 -55342 -68716 -62613 -52422 -30329 -29739 -32476 -16860
4479a6860L601m142M590o904K1411K3379M725j7581J835N155j099l727k8817n974
$$ -16860 -13259 -17401 -12811 -19715 1696 25075 29800 12219 14054 19209 18110 14383 -14434 -20408
4465b0408L1761Q51k5371j3725J6681j191J0274p624Q376K8002k315r602m8482
$$ -20408 11353 12204 -13167 -26892 -10211 -11402 -1128 -8752 -376 27626 25311 15709 -32773
4452c2773m3266K4826K2532J697J4997L8289p420j4010Q809r967r726L0481q245
$$ -32773 -76039 -51213 -28681 -26984 -11987 26302 18882 4872 13681 3714 -6012 24469 16224
4439A6224N315J1162l226j2543j207l765j9666M2389P146m421J3084l8574J3097
$$ 16224 21539 32701 29475 16932 15725 11960 -7706 34683 41829 37408 50492 11918 25015
4426B5015r26k4101K5587K4999j4883j6482m40P323l986L639j870l4829j7352
$$ 25015 24089 -12 25575 50574 35691 19209 18769 26092 22106 25745 23875 -10954 -28306
4413b8306k9140O783K0339M322P675k036J625J9312j0098L3712J6538j9301M20
$$ -28306 -57446 -50663 -30324 -26002 -18327 -20363 -18738 574 -9524 24188 40726 21425 21845
4400B1845K21j4730M506J111l5981r108j6414n902J082L318K7133J7917J9862
$$ 21845 22066 7336 11842 12953 -23028 -32136 -48550 -54452 -53370 -50052 -22919 -5002 14860
4387A4860j3830N966P837j2756j5564j9147M887J295K033K7182N5198p406m4804
$$ 14860 1030 6996 14833 2077 -13487 -32634 -27747 -26452 -24419 2763 57961 50555 5751
4374E751k2428J1937q90K8293l014j6041k5742Q497L887q46K3710K490k8814O845
$$ 5751 -16677 -4740 -5630 22663 19649 3608 -22134 -13637 -9750 -10596 13114 15604 -13210 -6365
4360f365K5316J9703m1126p462N69P078j0554p46O020L1833J4622m0095q796K4879
$$ -6365 18951 38654 -2472 -9934 -9365 -2287 -12841 -13587 -7567 24266 38888 -1207 -10003 14876
4346A4876R767k2890j3480r8p240m5300K2562J5846J1334J9055P550J231m372
$$ 14876 24643 1753 -11727 -11825 -19065 -64365 -41803 -25957 -14623 4432 11982 13213 8841
4333H841j0486P291J1742N026m853l289p305o276l5078q579Q256J6288o348M357
$$ 8841 -1645 5646 17388 22414 17561 14272 6967 691 -34387 -42966 -34710 -18422 -24770 -20413
4319b0413K7040N936m874p132k6731j3488J1270N346K1739O06L052R486k3923
$$ -20413 6627 12563 7689 557 -26174 -39662 -28392 -23046 -1307 -701 2351 11837 -12086
4306a2086l712K5761M052Q826k782k3256m507j3006P823L673n658O006o202K77
$$ -12086 -15798 9963 14015 22841 20059 -3197 -7704 -20710 -12887 -9214 -14872 -8866 -15068 -14791
4292a4791k444l250pK3393K2350j4918j8777n752M398r516j6493k029Q586K593
$$ -14791 -17235 -20485 -20492 2901 25251 10333 -8444 -14196 -9798 -19314 -35807 -37836 -29250 -26657
4278b6657l764n238k3789l2361K5203M9056K3743L7280M994K2988J0671l6788
$$ -26657 -30421 -35659 -59448 -91809 -66606 -17550 6193 43473 48467 71455 82126 45338
4266D5338k3409k0852l7694j7173J7215J558P54J8946R457l875k541k5968m717
$$ 45338 21929 1077 -36617 -53790 -36575 -35017 -34263 -15317 -5860 -9735 -12276 -38244 -42961
4253d2961k3207J4024L6869L5430L58k6777m192K1596L553M696n055N947K9530
$$ -42961 -66168 -52144 -15275 20155 20513 -6264 -10456 11140 14693 19389 14334 20281 49811
4240D9811Q673p483l0298j8339J684N751k1202q536J716K9560j497l3018j5939
$$ 49811 58484 51001 20703 2364 4048 9799 -11403 -19939 -18223 11337 9840 -23178 -39117
4227c9117l572L0052o994j1750M016M5550J4542j1269l670j9249j9054M720m949
$$ -39117 -42689 -12637 -19631 -31381 -27365 18185 32727 21458 17788 -1461 -20515 -15795 -20744
4214b0744L785n029n271k307k7456m966L8920J6170J7352Q135P051J2781o055
$$ -20744 -16959 -21988 -27259 -29566 -57022 -61988 -23068 -6898 10454 18589 25640 38421 32366
4201C2366l4849k3590j1951N520O368j6232K7619K5931J0467j4146j2168o875
$$ 32366 -2483 -26073 -38024 -32504 -26136 -42368 -14749 11182 21649 7503 -4665 -11540
4189a1540j3903J8120n954Q502q268J2370Q012j6566j98J0071L30K1199R073n149
$$ -11540 -25443 -7323 -13277 -4775 -13043 -673 7339 -9227 -9425 646 976 22175 31248 26099
4175B6099l8285j6525n398p141J4230k3635p320J9929L3600J2995J8609j8780
$$ 26099 -12186 -28711 -34109 -41250 -27020 -50655 -57975 -38046 -4446 8549 27158 8378
4163H378K1960j688j4478j018K4150J143j8286j5859m2368J9203K3186l204J6525
$$ 8378 30338 28650 14172 13154 37304 38447 20161 4302 -38066 -18863 4323 1119 17644
4150A7644J857k3407k8406l36J8675J3062k3019j1106r422P058j7100j2776O423
$$ 17644 19501 -3906 -32312 -32648 -13973 -911 -23930 -35036 -44458 -37400 -54500 -67276 -60853
4137f0853J3729K8077N847J9508K6900j3339m545k6617k7667P653L2676L081k167
$$ -60853 -47124 -19047 -13200 6308 33208 19869 15324 -11293 -38960 -31307 1369 4450 2283
4124B283Q783J2791K374l070j2454j8867n434L0776L2599k4106m513j1556j4688
$$ 2283 11066 23857 26231 23161 10707 -8160 -13594 17182 49781 25675 21162 9606 -5082
4111e082m71J7437p619o654l8219r499J4191P189N784j0112j031J3376J9557q388
$$ -5082 -5553 11884 4265 -2389 -40608 -50107 -35916 -28727 -22943 -33055 -34086 -20710 -1153 -9541
4097i541l8439O673K5127K7420J190r969l506j1346r197K518Q421p029J6716J6051
$$ -9541 -47980 -41307 -16180 11240 12430 2461 -1045 -12391 -21588 -19070 -10649 -17678 -962 15089
4083A5089N834j7174o717n1264r18j021O638J2000K2626K0330J1676Q557k3404
$$ 15089 20923 3749 -2968 -54232 -55150 -56171 -49533 -37533 -14907 5423 17099 25656 2252
4070B252l2064O387N3495k1999k9278k260o878j2841o703J2702L8176Q374J2767
$$ 2252 -29812 -23425 30070 8071 -21207 -23467 -30345 -43186 -49889 -37187 989 9363 22130
4057B2130K5565k994l8775l97K0784J3453m1171n416L2958J6619p804l0956k8114
$$ 22130 47695 44701 5926 5529 26313 39766 -1405 -6821 26137 42756 34952 3996 -24118
4044b4118j7839L0706k8590k3609L9907o001P165N661K5010R892j1605q46o532
$$ -24118 -41957 -11251 -39841 -63450 -23543 -29544 -22379 -16718 8292 18184 6579 5733 -799
4031g99r57P687l342l2047k1851J3123P412J4488J3471m624K1960j2574J9168
$$ -799 -1756 5931 2589 -29458 -51309 -38186 -30774 -16286 -2815 -7439 14521 1947 21115
4018B1115j7812R393O879j274k5395Q744J6549j2497k6587O915J8670R636k2671
$$ 21115 3303 12696 19575 18301 -7094 1650 18199 5702 -20885 -13970 4700 14336 -8335
4005h335q514K1762J8005J345j5570l3283Q118K499k375K2289Q526m513j1459
$$ -8335 -16849 4913 22918 24263 8693 -24590 -16472 -13973 -16348 5941 14467 9954 -1505
3992a505k7149j8485M3417m461j5541N468L0817J5508l8151k9524Q546L0906p075
$$ -1505 -28654 -47139 -3722 -8183 -23724 -18256 12561 28069 -10082 -39606 -31060 -154 -7229
3979g229k2200L271j9058m654r262J3969J9517J9426K8925L4552m1109j8949J9425
$$ -7229 -29429 -26158 -45216 -49870 -59132 -45163 -25646 -6220 22705 57257 16148 -2801 16624
3966A6624j2921q419J5487k4569k8338L665L553r853P009j9499o837Q727M418
$$ 16624 3703 -4716 10771 -13798 -42136 -38471 -34918 -44771 -37762 -57261 -64098 -55371 -50953
3953e0953K0702j2687j7555L4459K5388J415l0878n083K7431J7276j3665L3427
$$ -50953 -30251 -42938 -60493 -26034 -646 769 -30109 -35192 -7761 9515 -4150 29277
3941B9277K9655J0727j1214l1013j0324o206o696l575l333J7855j9909j1096L118
$$ 29277 58932 69659 58445 27432 17108 10902 4206 631 -2702 15153 -4756 -15852 -12734
3928a2734R335l067M356n249j266q705J9387l172j6436r685j5499Q921J6648M224
$$ -12734 -3399 -6466 -2110 -7359 -8625 -17330 2057 -1115 -17551 -27236 -42735 -33814 -17166 -12942
3914a2942J009K8877j7605O118N263K559J3719K2493k924j6091l332q513j0703
$$ -12942 -11933 16944 -661 5457 10720 13279 26998 49491 46567 30476 27144 18631 7928
3901G928l9190q473q155O6P108L0049J8884J2270j1955j9522J8432m430J5691
$$ 7928 -31262 -39735 -47890 -47824 -40716 -10667 8217 20487 8532 -10990 7442 3012 18703
3888A8703J5726k7621O06J3098k9125l8222p555k4588p040K537R719N113N192
$$ 18703 34429 6808 7414 20512 -8613 -46835 -54390 -78978 -86018 -83481 -73762 -68649 -63457
3875f3457J4519R182K5354M6853J9458j7250k4849l1973k9741J1057J7460L176
$$ -63457 -48938 -39756 -14402 32451 51909 34659 9810 -22163 -51904 -40847 -23387 -20211
3863b0211N207n9972j1284K1847J5127n056j4127k292J1939K7642r715j2442J2320
$$ -20211 -15004 -74976 -86260 -64413 -49286 -54342 -68469 -70761 -58822 -31180 -40895 -53337 -41017
3850d1017Q082j2373R883J4597p933R02p455q395k4449J6043M3506K3724N37j6930
$$ -41017 -32935 -45308 -35425 -20828 -28761 -27859 -35314 -43709 -68158 -52115 -8609 15115 15652 -1278
3836a278j4644m776J4867r343K263L6841J9776m479l6902j3458l616l50j7297
$$ -1278 -15922 -20698 -5831 -15174 -12911 23930 43706 39227 2325 -11133 -14749 -15099 -32396
3823c2396J8107M20P763N708K2218K0136J0386n2557k2273J681J2624m33L296
$$ -32396 -14289 -13869 -6106 -398 21820 41956 52342 -215 -22488 -20807 -8183 -8616 -5320
3810e320p91k6007l0138J7647R86K5123K5751j400l874L9781J3142o90Q060R43
$$ -5320 -6111 -32118 -62256 -44609 -43623 -18500 7251 5851 1977 41758 54900 54210 62270 63213
3796F3213l2488m1751l1817N149k1040j2480J9017K0818R262j4589K015n508l263
$$ 63213 30725 -11026 -42843 -37694 -58734 -71214 -52197 -31379 -22117 -36706 -34691 -40199 -43462
3783d3462K8248O460k049J4796k1850r473l538J4764K1209J127l8496l524N596
$$ -43462 -15214 -8754 -10803 3993 -17857 -27330 -30868 -16104 5105 6232 -32264 -35788 -30192
3770c0192J2455J5662n294J009K438J4542J0522l5961m1737k1694N3273L6128
$$ -30192 -17737 -2075 -7369 -6360 -3922 10620 21142 -14819 -56556 -78250 -24977 11151
3758A1151j5018k1747j2485j1960J8136M2081l5694l3365J8267K1188J8890j0205
$$ 11151 -3867 -25614 -38099 -50059 -31923 10158 -25536 -58901 -40634 -19446 -556 -10761
3746a0761o48k0037J0933J6227L967L497O116j3324J2908M906n528r682k9411
$$ -10761 -11409 -31446 -20513 -4286 -319 3178 9294 -4030 8878 13784 8256 -1426 -30837
3733c0837n503J8781k1936j1248M6503K0427k5217j8460M784J4552P897J073J6142
$$ -30837 -36340 -17559 -39495 -50743 -4240 16187 -9030 -27490 -22706 -8154 -257 816 16958
3720A6958L3877J0484j3713l1438m8743k5450J5017R142J0326N385k2346J0057
$$ 16958 50835 61319 47606 16168 -32575 -58025 -43008 -33866 -23540 -18155 -40501 -30444
3708c0444J023L3420j2428m7052q765J8481P684J0123K1594j7922J5735J8860
$$ -30444 -29421 3999 -8429 -55481 -64246 -45765 -38081 -27958 -6364 -24286 -8551 10309
3696A0309J3783J5840j768l1353k5746l379N847j131N404N051K3922j1625j9276
$$ 10309 24092 39932 38164 6811 -18935 -22314 -16467 -17598 -12194 -7143 16779 5154 -14122
3683a4122R608N649K073k8248N598L8684l2313j1342J0794P423k2712r09L5904
$$ -14122 -4514 1135 3208 -25040 -19442 19242 -13071 -24413 -13619 -6196 -28908 -29817 6087
3670F087J0466m2334l9465k470o024O052K7707J7696K615K663M262j5416m957
$$ 6087 16553 -25781 -65246 -67716 -73740 -67688 -39981 -22285 -19670 -17007 -12745 -28161 -33118
3657c3118m28J3604K585j0718L806K7985j8669j6782j4709j9398r869L9288J3269
$$ -33118 -33546 -19942 -17357 -28075 -24269 3716 -14953 -31735 -46444 -65842 -75711 -36423 -23154
3644b3154L901n34J0666j6930L770k3846O881J0344j4175J8329L0826J5036N18
$$ -23154 -19253 -19787 -9121 -26051 -22281 -46127 -39246 -28902 -43077 -24748 6078 21114 21632
3631B1632K1931l8955k1896R856J7318l823k8996p039J7375o298K158K4881J971
$$ 21632 43563 4608 -17288 -7432 9886 6063 -22933 -29972 -12597 -18895 -16737 8144 10115
3618A0115j8567o213j7157k442K969n156L762K9689K2153L628j5360k3969j9497
$$ 10115 -8452 -14665 -31822 -34264 -31295 -36451 -32689 -3000 19153 22781 7421 -16548 -36045
3605c6045M661K6908l2861p231O026K5193M3146k836l6334j8936J1267J7752K830
$$ -36045 -31384 -4476 -37337 -44568 -38542 -13349 29797 26961 -9373 -28309 -17042 710 3540
3592C540l7992q709J2082J9091K0519K5758K5383j3764n0595n387M919l951k1805
$$ 3540 -34452 -43161 -31079 -11988 8531 34289 59672 45908 -4687 -10074 -5155 -9106 -30911
3579c0911K2722K5586K0648j2483l8089p104j1734O757J8256L40r28j6088n5405
$$ -30911 -8189 17397 38045 25562 -12527 -19631 -31365 -24608 -6352 -6012 -6940 -23028 -78433
3566g8433k6750L1985K4518N3973j1636l8779J13K6679J8273K6075j471J1354
$$ -78433 -105183 -73198 -48680 5293 -6343 -45122 -45009 -18330 -57 26018 24547 35901
3554C5901K404o075J9135j2116p937k2314n438K7126j3280p82j1044k3870n537
$$ 35901 38305 32230 51365 39249 31312 8998 3560 30686 17406 16624 5580 -18290 -23827
3541b3827k6370P991K9992j613l3906l6653J9651J1775L6821K6816j6255q446
$$ -23827 -50197 -42206 -12214 -13827 -47733 -84386 -64735 -52960 -16139 10677 -5578 -14024
3529a4024J5756o998n481N129r577j3850K0152K3763m5886J5036M3331K4031m089
$$ -14024 1732 -5266 -10747 -5618 -15195 -29045 -8893 14870 -31016 -15980 27351 51382 47293
3516D7293n2782m2366J3883L542K0014k2696J7940M993l875K363k0069j137J6458
$$ 47293 -5489 -47855 -33972 -30430 -10416 -33112 -15172 -10179 -14054 -11691 -31760 -32897 -16439
3503a6439N536j7643q299K2885j6454K0361j0981L861L6245k542M570j6516L7713
$$ -16439 -10903 -28546 -36845 -13960 -30414 -10053 -21034 -17173 19072 16530 21100 4584 42297
3490D2297q225o0006q772J1750n992J863O067n116j9779P791R41J7571L8476m605
$$ 42297 34072 -25934 -34706 -22956 -28948 -27085 -21018 -26134 -45913 -38122 -37181 -19610 18866 14261
3476A4261j8042j1860m8292j1502O1581P168N846J8049L6766q449l2973J879K7709
$$ 14261 -3781 -15641 -63933 -75435 -13854 -6686 -840 17209 53975 45526 12553 14432 42141
3463D2141k3157l6948j8955K4806j6213M440K1613R486J096r378Q503j916Q651
$$ 42141 18984 -17964 -36919 -12113 -28326 -23886 -2273 7213 8309 -1069 7434 5518 14169
3450A4169K9318j2897j9983J4050K59K8069P22M018L967m0336K1218O070M342
$$ 14169 43487 30590 10607 24657 24916 52985 53707 57725 61692 21356 42574 48644 52986
3437E2986l0897r967Q300J392L82P510k3150j1406J5659J4954K7539j124M854
$$ 52986 22089 12122 20422 21814 22196 29706 6556 -4850 10809 25763 53302 52178 57032
3424E7032O368j4376j6584k4293r511J3918j462l1156j8462L0669J5714k5705
$$ 57032 63400 49024 32440 8147 -1364 12554 11092 -20064 -38526 -7857 7857 -17848
3412a7848k5892j073j2332J0947j2130j4929k295J9528N615q456J4445K7486J1787
$$ -17848 -43740 -44813 -57145 -46198 -58328 -73257 -75552 -56024 -50409 -58865 -44420 -16934 -5147
3399e147j3100o485k322J8236J6307k8096P797J5177j905J600k4543p46K810N119
$$ -5147 -18247 -24732 -27054 -8818 7489 -20607 -12810 2367 462 2062 -22481 -23227 -20417 -15298
3385a5298K3443N1853J7658j3323n3682l1362l1150n6850N768L1807K8241J5361
$$ -15298 8145 59998 77656 64333 10651 -20711 -51861 -108711 -102943 -71136 -42895 -27534
3373b7534k095j3161K2519P505M0943P395P99J24j8967k6404j2463L881j3395
$$ -27534 -29629 -42790 -20271 -12766 28177 35572 36371 36495 17528 -8876 -21339 -17458 -30853
3360c0853k133K935J9731O640j0638K6516K5614m871j1406j8806j6610j1119P99
$$ -30853 -32986 -30051 -10320 -3680 -14318 12198 37812 32941 21535 2729 -13881 -25000 -24201
3347b4201O443j3869j0395j638k2707J0640q978K2917J7950j7246M962J5757M1218
$$ -24201 -17758 -31627 -42022 -43660 -66367 -55727 -64705 -41788 -23838 -41084 -36122 -20365 20853
3334B0853N236R57K731J3345k1224j9796J1628M8685p875P09k4221j4253o804
$$ 20853 26089 27046 29777 43122 21898 2102 13730 62415 54540 55249 31028 16775 9971
3321I971l4250Q868m213q236J5093K3276P219j0280J6617L5256n3537l7614R477
$$ 9971 -24279 -15411 -19624 -27860 -12767 10509 17728 7448 24065 59321 5784 -31830 -22353
3308b2353R572k3995K3907K4295q046j3661m71J3334Q031K2175j6278l5086J944
$$ -22353 -12781 -36776 -12869 11426 3380 -10281 -10752 2582 10613 32788 16510 -18576 -16632
3295a6632k0055j3728M032l5135k8661J9868J9453J5642K435j0183j3085J3575
$$ -16632 -36687 -50415 -46383 -81518 -110179 -90311 -70858 -55216 -52781 -62964 -76049 -62474
3283f2474O613M5526J7364j9855j8719N790J0596K4406K8646m878N409l781l6267
$$ -62474 -55861 -10335 7029 -12826 -31545 -25755 -15159 9247 37893 33015 38424 34643 -1624
3270a624k8518J1660J7371J8575j926k8483q150R482j688J3424j0040j0374j0272
$$ -1624 -30142 -18482 -1111 17464 15538 -12945 -21095 -11613 -13301 123 -9917 -20291 -30563
3257c0563J3897K1120j435j6122l1740r705L61K2136J0215J7743k3236k3018o091
$$ -30563 -16666 4454 3019 -13103 -44843 -54548 -54187 -32051 -21836 -4093 -27329 -50347 -56438
3244e6438p037P710L6215L6491N320L935k3046j4544K526J4494J4108r63l4249
$$ -56438 -63475 -55765 -19550 16941 22261 26196 3150 -11394 -8868 5626 19734 18771 -15478
3231a5478l3565K276J477m599O342J325J9971M5488q395j3066K2338j223R919
$$ -15478 -49043 -46767 -45290 -49889 -43547 -42222 -22251 23237 14842 1776 24114 22891 32810
3218C2810j9022P458J4699j3102J8875P315j0951k9444k1260m480J1132J4025
$$ 32810 13788 21246 35945 22843 41718 49033 38082 8638 -12622 -17102 -5970 8055
3206H055P144k782m7933N217J418n5429q12L1569M5745q236m0608j0232J751L9326
$$ 8055 15199 12417 -35516 -30299 -28881 -84310 -85122 -53553 -7808 -16044 -56652 -66884 -65133 -25807
3192b5807J3990j1075j4287j6623J2307K0736o837n679J754j2977j073M54K4797
$$ -25807 -11817 -22892 -37179 -53802 -41495 -20759 -27596 -33275 -31521 -44498 -45571 -45117 -20320
3179b0320K6087N260n9026j4611M8333J5687r272J7454R627L148k7865R814l041
$$ -20320 5767 11027 -47999 -62610 -14277 1410 -7862 9592 19219 22367 -5498 4316 1275
3166A275J1618k2587j8262J5498J63j5735K036J3499R749R259o39r080M748j1062
$$ 1275 12893 -9694 -27956 -12458 -12295 -28030 -25994 -12495 -2746 6513 5874 -3206 1542 -9520
3152i520j3770Q068k4008j7296K2363J9319N155k5065J2248P10J8699L1J9456
$$ -9520 -23290 -15222 -39230 -56526 -34163 -14844 -9689 -34754 -22506 -21796 -3097 -3066 16390
3139A6390M2921q008m938L129K937l0716j3819J4309K542J0364j1757m350j5029
$$ 16390 59311 51303 46365 49494 52431 21715 7896 22205 24747 35111 23354 19004 3975
3126C975k1107k2660J6210N075L3077J4487k2767k2539j3162L407L8297M612j488
$$ 3975 -17132 -39792 -23582 -18507 14570 29057 6290 -16249 -29411 -26004 12293 16905 15417
3113A5417k7352R417L3935j8277l625j2546k4543j9115M731J0347k997j0642L1835
$$ 15417 -11935 -2518 31417 13140 9515 -3031 -27574 -46689 -41958 -31611 -34608 -45250 -13415
3100a3415q300k9888k041K3239M0788K7588J6552l0126k4146q499n585J0777j2810
$$ -13415 -21715 -51603 -53644 -30405 10383 37971 54523 24397 251 -8248 -13833 -3056 -15866
3087a5866o439m279N89K6103j9837n865N673j3379J3771P051J1438K4504p476
$$ -15866 -22305 -26584 -25995 108 -19729 -25594 -19921 -33300 -19529 -12478 -1040 23464 15988
3074A5988m378J5653M388j5279k3198J790j4200r810K3742L847m295p027K1604
$$ 15988 11610 27263 31651 16372 -6826 -5036 -19236 -29046 -5304 -1457 -5752 -12779 8825
3061H825P199l252l531Q655J1845j7876P590P937j703k9532j4533l445j1877k9729
$$ 8825 16024 12772 9241 17896 29741 11865 19455 27392 25689 -3843 -18376 -21821 -33698 -63427
3047f3427p32L8791n49N658K2115J0654J7233l1913k8940K0271o731J9425J8956
$$ -63427 -64159 -25368 -25917 -20259 1856 12510 29743 -2170 -31110 -10839 -17570 1855 20811
3034B0811K873Q44j434Q79L1120k2733j6544j994M781N765k5248k2392R077M7165
$$ 20811 23684 24528 23094 23973 55093 32360 15816 13822 18603 24368 -880 -23272 -14195 32970
3020C2970J1520j4579k1427j4774l264J3826o604r092n308l507K373j5072k2138
$$ 32970 44490 29911 8484 -6290 -9554 4272 -2332 -11424 -16732 -20239 -17866 -32938 -55076
3007e5076J8118L8548k195q379q109J5021l1208p756J4932J6578K83J2701r912
$$ -55076 -36958 1590 -605 -8984 -17093 -2072 -33280 -41036 -26104 -9526 -9243 3458 -6454
2994f454J206J811l9767j4970L3888J4658l5107K1117L9439k656O434K1087J0587
$$ -6454 -5248 -3437 -43204 -58174 -24286 -9628 -44735 -23618 15821 13165 19599 40686 51273
2981E1273O430k783m9928j7396J7863K8319j5087R531l0853R133K5675m296k7695
$$ 51273 57703 54920 4992 -12404 5459 33778 18691 28222 -2631 6502 32177 27881 186
2968A86j2120N851J8457K4555Q890j5064j6299P849j9093J2041O412L4114l862
$$ 186 -11934 -6083 12374 36929 45819 30755 14456 22305 3212 15253 21665 55779 51917
2955E1917m4547k4523N556n753J6957K702J646K257n393l7229j4341p546L5052
$$ 51917 7370 -17153 -11597 -17350 -393 2309 3955 6212 819 -36410 -50751 -58297 -23245
2942b3245j3609j712Q148M5432R841M222j3721j8721k3229M0533j5212k5009J6153
$$ -23245 -36854 -38566 -30418 15014 24855 29077 15356 -3365 -26594 13939 -1273 -26282 -10129
2929a0129N296j0926m3130j5020J3238L461j4916J2547M0091K9723L2676J2688
$$ -10129 -4833 -15759 -58889 -73909 -60671 -57210 -72126 -59579 -19488 10235 42911 55599
2917E5599k366o54k8746r095m607m754j2802J442o134j8706L6182J1477k7028
$$ 55599 53233 52579 23833 14738 10131 5377 -7425 -5983 -12117 -30823 5359 16836 -10192
2904a0192J5509L0873j2824j9674j0539j4645r798L8893K2189l1128p02l0470
$$ -10192 5317 36190 23366 3692 -6847 -21492 -31290 7603 29792 -1336 -2038 -32508
2892c2508Q424K4908N1705P182l1235L55M509k0249M112J735j0072K8758K0917
$$ -32508 -24084 824 52529 59711 28476 28831 33340 13091 17203 18938 8866 37624 58541
2879E8541l6120n701j2569k8993N339L159J4645J585K5772P100k7706k7568n533
$$ 58541 22421 16720 4151 -24842 -19503 -16344 -1699 -114 25658 32758 5052 -22516 -28049
$$ [...]
##END NTUPLES=NMR SPECTRUM
##END=
