##TITLE=Analysis number 320151
Compound Code mo 07872
Book Reference 492/10/6
Project Code adrs
Chemist Name emmab
##JCAMPDX= 6.0         $$ Bruker NMR JCAMP-DX V2.0
##DATA TYPE= NMR SPECTRUM
##DATA CLASS= NTUPLES
##ORIGIN= Bruker BioSpin GmbH
##OWNER= nmr
$$ XWIN-NMR		Version 3.5
$$ Thu Jun 15 08:03:54 2006 GMT Daylight Time (UT+1h)  MAYBRIDGE\nmr@NMR_250MHZ
##.OBSERVE FREQUENCY= 250.131544655141
##.OBSERVE NUCLEUS= ^1H
##.ACQUISITION MODE= SIMULTANEOUS (DQD)
##.ACQUISITION SCHEME= undefined
##.AVERAGES= 16
##.DIGITISER RES= 18
##SPECTROMETER/DATA SYSTEM= dpx250
##.PULSE SEQUENCE= zg30
##.SOLVENT NAME= CDCl3
##.SHIFT REFERENCE= (INTERNAL, CDCl3, 0, 16.522)
##AUDIT TRAIL= $$ (NUMBER, WHEN, WHO, WHERE, WHAT)
$$ ##TITLE= Audit trail, XWIN-NMR		Version 3.5
$$ ##JCAMPDX= 5.01
$$ ##ORIGIN= Bruker BioSpin GmbH
$$ ##OWNER= nmr
$$ C:\u/data/dgb/nmr/ADRS/780/pdata/1/auditp.txt
$$ ##AUDIT TRAIL=  $$ (NUMBER, WHEN, WHO, WHERE, WHAT)
(   1,<2006-06-15 08:03:23.64 +100>,<MAYBRIDGE\nmr>,<NMR_250MHZ>,
      <created by zg, POWCHK disabled, PULCHK disabled
       configuration hash MD5:
       E2 DF 36 D8 04 B2 41 60 5A D7 A3 38 5A 4B D0 FE
       data hash MD5: 64K
       3A 4C 23 AB 56 DA DB D0 7E 9B 21 33 BE EC 1C 7A>)
(   2,<2006-06-15 08:03:42.73 +100>,<MAYBRIDGE\nmr>,<NMR_250MHZ>,
      <Start of raw data processing
       ef LB = 0.3 FT_mod = 6 PKNL = 1 SI = 32K 
       data hash MD5: 32K
       2C 71 88 5C 83 9F 19 84 F9 4E 2B C8 86 25 A9 D9>)
(   3,<2006-06-15 08:03:44.67 +100>,<MAYBRIDGE\nmr>,<NMR_250MHZ>,
      <apk 
       data hash MD5: 32K
       93 CF C9 16 59 6D 53 12 EA A2 1E F6 55 5E CD 40>)
(   4,<2006-06-15 08:03:45.65 +100>,<MAYBRIDGE\nmr>,<NMR_250MHZ>,
      <abs ABSG = 5 
       data hash MD5: 32K
       2E 5D 87 5D 31 4A 82 9C 6A 72 B0 B1 4A DE 2D CE>)
$$ ##END=
$$ 
$$ hash MD5
$$ 1C 13 70 31 85 9B 46 EB F7 AC 73 85 C4 72 9F ED
##$RELAX= 
##$RELAX= 
##$RELAX= 
##$RELAX= 
##$RELAX= 
##$RELAX= 
##$RELAX= 
$$ Bruker specific parameters
$$ --------------------------
##$DU= <C:\u>
##$EXPNO= 780
##$NAME= <ADRS>
##$PROCNO= 1
##$TYPE= <nmr>
##$USER= <dgb>
##$AMP= (0..31)
100 100 100 100 100 100 100 100 100 100 100 100 100 100 100 100 100 100 
100 100 100 100 100 100 100 100 100 100 100 100 100 100 
##$AQSEQ= 0
##$AQ_mod= 3
##$AUNM= <au_zg>
##$AUTOPOS= <21 >
##$BF1= 250.13
##$BF2= 250.13
##$BF3= 250.13
##$BF4= 250.13
##$BF5= 500.13
##$BF6= 500.13
##$BF7= 500.13
##$BF8= 500.13
##$BYTORDA= 1
##$CFDGTYP= 0
##$CFRGTYP= 5
##$CHEMSTR= <none>
##$CNST= (0..31)
1 1 145 1 1 1 1 1 1 1 1 1 1 1 1 1 1 1 1 1 1 1 1 1 1 1 1 1 1 1 1 1 
##$CPDPRG= <>
##$CPDPRG1= <>
##$CPDPRG2= <>
##$CPDPRG3= <>
##$CPDPRG4= <mlev>
##$CPDPRG5= <mlev>
##$CPDPRG6= <mlev>
##$CPDPRG7= <mlev>
##$CPDPRG8= <mlev>
##$CPDPRGB= <>
##$CPDPRGT= <>
##$D= (0..31)
0 1 0 0 0 0 0 0 0 0.06 0 0 0 0 0 0 0.0002 0 0 0 0 0 0 0 0 0 0 0 0 0 0 
0 
##$DATE= 1150355002
##$DBL= (0..7)
120 120 120 120 120 120 120 120 
##$DBP= (0..7)
150 150 150 150 150 150 150 150 
##$DBP07= 0
##$DBPNAM0= <>
##$DBPNAM1= <>
$$ [...]
##$SUBNAM7= <"">
##$SUBNAM8= <"">
##$SUBNAM9= <"">
##$SW= 20.6930455092707
##$SWIBOX= (0..15)
0 0 3 0 0 0 0 0 0 0 0 0 0 0 0 0 
##$SW_h= 5175.983436853
##$TD= 65536
##$TD0= 1
##$TE= 294.16
##$TE2= 300
##$TE3= 300
##$TEG= 300
##$TL= (0..7)
0 120 120 120 120 120 120 120 
##$TP= (0..7)
150 150 150 150 150 150 150 150 
##$TP07= 0
##$TPNAME0= <>
##$TPNAME1= <>
##$TPNAME2= <>
##$TPNAME3= <>
##$TPNAME4= <>
##$TPNAME5= <>
##$TPNAME6= <>
##$TPNAME7= <>
##$TPOAL= (0..7)
0.5 0.5 0.5 0.5 0.5 0.5 0.5 0.5 
##$TPOFFS= (0..7)
0 0 0 0 0 0 0 0 
##$TUNHIN= 0
##$TUNHOUT= 0
##$TUNXOUT= 0
##$USERA1= <user>
##$USERA2= <user>
##$USERA3= <user>
##$USERA4= <user>
##$USERA5= <user>
##$V9= 5
##$VALIST= <valist>
##$VCLIST= <CCCCCCCCCCCCCCC>
##$VD= 0
##$VDLIST= <DDDDDDDDDDDDDDD>
##$VPLIST= <PPPPPPPPPPPPPPP>
##$VTLIST= <TTTTTTTTTTTTTTT>
##$WBST= 1024
##$WBSW= 4
##$XGAIN= (0..3)
0 0 0 0 
##$XL= 0
##$YL= 0
##$YMAX_a= 564105
##$YMIN_a= -322310
##$ZGOPTNS= <>
##$ZL1= 120
##$ZL2= 120
##$ZL3= 120
##$ZL4= 120
##$ABSF1= 16.522
##$ABSF2= -4.171173
##$ABSG= 5
##$ABSL= 3
##$ALPHA= 0
##$AQORDER= 0
##$ASSFAC= 0
##$ASSFACI= 0
##$ASSFACX= 0
##$ASSWID= 0
##$AUNMP= <proc_1d>
##$AZFE= 0.1
##$AZFW= 0.1
##$BCFW= 0
##$BC_mod= 0
##$BYTORDP= 0
##$COROFFS= 0
##$CY= 12.5
##$DATMOD= 1
##$DC= 0
##$DFILT= <>
##$DTYPP= 0
##$F1P= 14.0000005364418
##$F2P= -0.99999901652339
##$FCOR= 0.5
##$FTSIZE= 32768
##$FT_mod= 6
##$GAMMA= 0
##$GB= 0
##$INTBC= 1
##$INTSCL= 1
##$ISEN= 128
##$LB= 0.3
##$LEV0= 0
##$LPBIN= 0
##$MAXI= 10000
##$MC2= 0
##$MEAN= 0
##$ME_mod= 0
##$MI= 0
##$NCOEF= 0
##$NC_proc= -5
##$NLEV= 6
##$NOISF1= 0
##$NOISF2= 0
##$NSP= 0
##$NTH_PI= 0
##$NZP= 0
##$OFFSET= 16.522
##$PC= 1
##$PHC0= 18.90937
##$PHC1= 8.146709
##$PH_mod= 1
##$PKNL= yes
##$PPARMOD= 0
##$PSCAL= 4
##$PSIGN= 0
##$REVERSE= no
##$SF= 250.13
##$SI= 32768
##$SIGF1= 0
##$SIGF2= 0
##$SINO= 400
##$SIOLD= 32768
##$SREGLST= <1H.CDCl3>
##$SSB= 0
##$STSI= 32768
##$STSR= 0
##$SW_p= 5175.98343685301
##$SYMM= 0
##$S_DEV= 0
##$TDeff= 65536
##$TDoff= 0
##$TI= <Analysis number 999999
Compound Code 99
Book Reference 9
Project Code 9>
##$TILT= no
##$TM1= 0
##$TM2= 0
##$TOPLEV= 0
##$USERP1= <user>
##$USERP2= <user>
##$USERP3= <user>
##$USERP4= <user>
##$USERP5= <user>
##$WDW= 1
##$XDIM= 32768
##$YMAX_p= 441087053
##$YMIN_p= -584542
$$ End of Bruker specific parameters
$$ ---------------------------------
##NTUPLES= NMR SPECTRUM
##VAR_NAME=  FREQUENCY,     SPECTRUM/REAL,   SPECTRUM/IMAG
##SYMBOL=    X,             R,               I
##VAR_TYPE=  INDEPENDENT,   DEPENDENT,       DEPENDENT
##VAR_FORM=  AFFN,          ASDF,            ASDF
##VAR_DIM=   32768,         32768,           32768
##UNITS=     HZ,            ARBITRARY UNITS, ARBITRARY UNITS
##FACTOR=    0.157963299565203, 1,           1
##FIRST=     4132.6476996994, 0,             0
##LAST=      -1043.33573715361, 0,           0
##MIN=       -1043.33573715361, -584542,     0
##MAX=       4132.6476996994, 441087053,     0
$$ Real data points
##PAGE= N=1
##DATA TABLE= (X++(R..R)), XYDATA
$$ [...]
13916A002852M3423L2296N5815M1950K1336M8029P1604P0450N3274L7854O5720
$$ 1002852 1046275 1078571 1134386 1176336 1197672 1245701 1317305 1387755 1441029 1478883 1544603
13905A544603N5194N8972M1078N5151L4977M7679O2482N5595O2422Q3942L6686
$$ 1544603 1599797 1658769 1699847 1754998 1789975 1837654 1900136 1955731 2018153 2102095 2138781
13894B138781J6281K1416P0249J00696N3848J8236M5181L6679N2882O3886R3755
$$ 2138781 2155062 2176478 2246727 2347423 2401271 2419507 2464688 2501367 2554249 2618135 2711890
13883B711890P8363P9871P6641P6233Q3167Q2297P4468J02585J16751R3445R9039
$$ 2711890 2790253 2870124 2946765 3022998 3106165 3188462 3262930 3365515 3482266 3575711 3674750
13872C674750J14530J18566J19119J12001R9169J34838J44045J58987J81765J63701
$$ 3674750 3789280 3907846 4026965 4138966 4238135 4372973 4517018 4676005 4857770 5021471
13862E021471J04832J25034J70984J83394J96679J98310J60440J71880J98326
$$ 5021471 5126303 5251337 5422321 5605715 5802394 6000704 6161144 6333024 6531350
13853F531350J78275K21641K08950K16911K39709K20012K27746K45168K53350
$$ 6531350 6709625 6931266 7140216 7357127 7596836 7816848 8044594 8289762 8543112
13844H543112K43154K56993K69912K95697L11637K83874L17816L48690L31505
$$ 8543112 8786266 9043259 9313171 9608868 9920505 10204379 10522195 10870885 11202390
13835A1202390L36764L56103L70088L67581L53005L84065L99231M49158N08798
$$ 11202390 11539154 11895257 12265345 12632926 12985931 13369996 13769227 14218385 14727183
13826A4727183M80664M34767M42868M97137N58893N30839N37629N98096O78166
$$ 14727183 15207847 15642614 16085482 16582619 17141512 17672351 18209980 18808076 19486242
13817A9486242P08112P09018P89356Q34348Q45193Q68230R63967J048513J103210
$$ 19486242 20194354 20903372 21692728 22527076 23372269 24240499 25204466 26252979 27356189
13808B7356189J199228J333747J457444J587082J701981J866117K031923K186414
$$ 27356189 28555417 29889164 31346608 32933690 34635671 36501788 38533711 40720125
13800D0720125K396511K623512K932458L303985L616329M038329M555463N087468
$$ 40720125 43116636 45740148 48672606 51976591 55592920 59631249 64186712 69274180
13792F9274180N647904O247454O833258P368609P758115P990689P990533P814813
$$ 69274180 74922084 81169538 88002796 95371405 103129520 111120209 119110742 126925555
13784A26925555P503389P097460O651123O260102N947475N609239N127091M341824
$$ 126925555 134428944 141526404 148177527 154437629 160385104 165994343 171121434 175463258
13776A75463258L309444K005305N07417r09149k151813l074254l633884l913702
$$ 175463258 178772702 180778007 181285424 180376275 178224462 175150208 171516324 167602622
13768A67602622m110242m264297m397752m584026m792891m929030m815843m423303
$$ 167602622 163492380 159228083 154830331 150246305 145453414 140524384 135708541 131285238
13760A31285238l801967k917690j865421p36056M06997J484948K478220L350552
$$ 131285238 127483271 124565581 122700160 121964104 122371101 123856049 126334269 129684821
13752A29684821M006668M468617M613372M576367M417998M169740L930496L706576
$$ 129684821 133691489 138160106 142773478 147349845 151767843 155937583 159868079 163574655
13744A63574655L500862L227138K788798J951761Q49563m32162j833685l170489
$$ 163574655 167075517 170302655 173091453 175043214 175892777 175460615 173626930 170456441
13736A70456441m291779n077105n537087n871494o090618o339768o639053p029664
$$ 170456441 166164662 161087557 155550470 149678976 143588358 137248590 130609537 123579873
13728A23579873p354811p599528p656472p511632p123421o630944o052564n476829
$$ 123579873 116225062 108625534 100969062 93457430 86334009 79703065 73650501 68173672
13720F8173672m911999m400497l952588l572338l230328k905563k656758k452651
$$ 68173672 63261673 58861176 54908588 51336250 48105922 45200359 42543601 40090950
13712D0090950k249132k066061j914962j758641j588886j505395j402196j283311
$$ 40090950 37841818 35775757 33860795 32102154 30513268 29007873 27605677 26322366
13704B6322366j219650j126472j040592r89357r62464q55069p54563p67232p31741
$$ 26322366 25102716 23976244 22935652 21946295 20983831 20128762 19374199 18606967 17875226
13695A7875226o94985o58680o19092n45775n49245n53648n69453n29042m70851
$$ 17875226 17180241 16521561 15902469 15356694 14807449 14253801 13684348 13155306 12684455
13686A2684455m47825m22195m24486l97474l67552l62936l69411l30650l39399
$$ 12684455 12236630 11814435 11389949 10992475 10624923 10261987 9892576 9561926 9222527
13677I222527l40672l07158k93651k70253k76238l04194k67812k28427k11762
$$ 9222527 8881855 8574697 8281046 8010793 7734555 7430361 7162549 6934122 6722360
13668F722360k17131k43935k34372k13829j97402j99707j92517j89834j69762
$$ 6722360 6505229 6261294 6026922 5813093 5615691 5415984 5223467 5033633 4863871
13659D863871j51263j57957j48906j08910r6458j21354j11513j25489j25019j50956
$$ 4863871 4712608 4554651 4405745 4296835 4200377 4079023 3967510 3842021 3717002 3566046
13649C566046j05111j02473j01708j24797q2262p7323p0719r2994j23077j01101
$$ 3566046 3460935 3358462 3256754 3131957 3049695 2972372 2901653 2808659 2685582 2584481
13639B584481p5436q0472j06670r5866q4160j03841r5796p2861n5515l6545o3235
$$ 2584481 2509045 2428573 2321903 2226037 2141877 2038036 1942240 1869379 1813864 1777319 1714084
13628A714084p3755m5739k7902l0292j8470n6658n8734n2211l9216l7687o1473
$$ 1714084 1640329 1594590 1566688 1536396 1517926 1461268 1402534 1350323 1311107 1273420 1211947
13617A211947n5865k1452q889K3189j1045k4426Q684J3007p598n555L979r363
$$ 1211947 1156082 1134630 1125741 1148930 1137885 1113459 1122143 1135150 1127552 1121997 1125976 1116613
13605A116613j4886j6151o292k6858j6505L797l182l802J2583K4006j0539j4186
$$ 1116613 1101727 1085576 1079284 1052426 1035921 1039718 1036536 1032734 1045317 1069323 1058784 1044598
13593A044598o540K234k804j9404l4002J6475J633M816L0938P508p071J077J703
$$ 1044598 1038058 1040292 1037488 1018084 984082 1000557 1002190 1007006 1037944 1045452 1038381 1039458 1041161
13580A041161q883l5198j0445q576k3289k6015m951L2942M9446k3894l4884k7039
$$ 1041161 1032278 997080 986635 978059 954770 928755 923804 956746 1006192 982298 947414 920375
13568I20375l0595j5534j7952p953N5757L8458k7703n3505k2332j9652n2604J8785
$$ 920375 889780 874246 856294 848341 904098 942556 914853 861348 839016 819364 766760 785545
13556G85545j8404J476r599k219Q080K0862K7015J8406O96J7345j1772o3223k7773
$$ 785545 767141 768617 759018 756799 764879 785741 812756 831162 831858 849203 837431 774208 746435
13543G46435k3610R334j5452r985r906K0137J4156j3348k4310j1402r43n2631
$$ 746435 722825 732159 716707 706722 696816 716953 731109 717761 693451 682049 681106 628475
13531F28475l2801n834j8524k3087j2914j3844j3795K0310l036m245n070l282
$$ 628475 595674 589840 571316 548229 535315 521471 507676 527986 524950 520705 515635 512353
13519E12353o637j3934p214k3209q557j3389m3433j1037p276k9996j0597J3797
$$ 512353 505716 491782 484568 461359 452802 439413 395980 384943 377667 347671 337074 350871
13507C50871L248J3378m065m207j3367l6546K5740j9305m5588j9246J1432j9572
$$ 350871 354119 367497 363432 359225 345858 309312 335052 315747 270159 250913 262345 242773
13495B42773j8894j623j1304j8980J1793K1813j3721K599J2335J9415j6771r452
$$ 242773 223879 222256 210952 191972 203765 225578 211857 214456 226791 246206 229435 219983
13483B19983k374j6950m900m635l459O170K4363j2606j8644q944k592R670K952
$$ 219983 217609 200659 195759 191124 187665 193835 218198 205592 186948 178004 175412 185082 188034
13470A88034m2247p11j2857p005J2301m641k2892n42L0230m37j8569l477k741
$$ 188034 145787 145076 132219 125214 137515 132874 109982 109440 139670 139233 120664 117187 114446
13457A14446O543K434j1730j6323j5776K1530J7198j1566l15O502l7163l480M1751
$$ 114446 120989 123423 111693 95370 79594 101124 118322 106756 106441 112943 75780 72300 114051
13444A14051J1482R708L448J3375j1027k518k4444q501j060r926j2921k0649r535
$$ 114051 125533 135241 138689 152064 141037 138519 114075 105574 104514 94588 81667 61018 51483
13431E1483l066L6006L0395p122k2538M962K6761k500p544J626p806k0331J9704
$$ 51483 48417 84423 114818 107696 85158 90120 116881 114381 106837 108463 100657 80326 100030
13418A00030L6081K7596J8151m3097m8823k2296K3937j0441N703J8538j1444K113
$$ 100030 136111 163707 181858 138761 89938 67642 91579 81138 86841 105379 93935 96048
13406I6048l4023p056J8824K3727J3303l0093j1998J2227L6480L4406j2082j3454
$$ 96048 62025 54969 73793 97520 110823 80730 68732 80959 117439 151845 139763 126309
13394A26309J267J5143K0716j9921k8527j9546J1171L0951J1449j9643j8286j0946
$$ 126309 127576 142719 163435 143514 114987 95441 106612 137563 149012 129369 111083 100137
13382A00137p323L3234J5382j2863Q82n981P35J7084K3954J1844K221M194k712
$$ 100137 92814 126048 141430 128567 129449 123468 124203 141287 165241 177085 179306 183500 180788
13369A80788M29J0042K1331k4348K02K3030j0468J2430p427q52J9028K0435R866
$$ 180788 181217 191259 212590 188242 188444 211474 201006 213436 206009 205157 224185 244620 254486
13356B54486j7407J4223K2972n952l1200P72J064P811j162J9841L0887p001k1170
$$ 254486 237079 251302 274274 268322 237122 237894 238958 246769 245607 265448 296335 289334 268164
13343B68164O461O974L813L6824K2643K9833j987j0544J591q650j3690m182L1205
$$ 268164 274625 281599 285412 322236 344879 374712 372725 362181 363772 355122 341432 337250 368455
13330C68455L2179O974J4075L6928N391N89M3239M3413M0552L8542N1818L7989
$$ 368455 400634 407608 421683 458611 464002 464591 507830 551243 591795 630337 682155 720144
13318G20144O453L5156J3816L8097M4143P452M4269K9870K0427L7077K3172K0097
$$ 720144 726597 761753 775569 813666 857809 865261 909530 939400 959827 996904 1020076 1040173
13306A040173K1968k5293j2479j1495m5528l0725P346J247k7895j0745j4993m4198
$$ 1040173 1062141 1036848 1024369 1012874 967346 936621 943967 945214 917319 906574 891581 847383
13294H47383k7372l1693j6403k7602k5078n1922k6065N336L7687K8667j455J885
$$ 847383 820011 788318 771915 744313 719235 667313 641248 646584 684271 712938 711483 713368
13282G13368N3326M8413J0489J0855L9062K2833L4392K6402o986j3454J6511P784
$$ 713368 766694 815107 825596 836451 875513 898346 932738 959140 952154 938700 955211 962995
13270I62995l701p297k9478n6621j6231k0562k1521k7485j8587j0186m9751q1148
$$ 962995 959294 951997 922519 865898 849667 829105 807584 780099 761512 751326 701575 620427
13258F20427p2845m7823k3174m3458k5099q209l5313o297J3283l1334o0489j6245
$$ 620427 547582 499759 476585 433127 408028 399819 364506 358209 371492 340158 279669 263424
13246B63424j8828l8280l3509n230K2026k3302j7287K787J3642j4803m736j5523
$$ 263424 244596 206316 172807 167577 189603 166301 149014 151801 165443 150640 145904 130381
13234A30381j3763k6932j785J8988L0699L742j0818N620l265j9244k5741n201
$$ 130381 116618 89686 87901 106889 137588 141330 130512 136132 132867 113623 87882 82681
13222H2681o872J5105l975l6380J3864j1457j352J516N985j5669r335j194m946
$$ 82681 75809 90914 86939 50559 64423 52966 51614 53130 59115 43446 34111 32917 27971
13209B7971J5153Q665k274k3963L262J6939J191l5470J8724K4495j086p651k6124
$$ 27971 43124 51789 49515 25552 28814 45753 46944 11474 30198 54693 53607 45956 19832
13196A9832r348K87M83J51j5218l635J1427j5872p009K9148k1896k4794k777K7149
$$ 19832 10484 10771 11254 11405 -3813 -7448 3979 -11893 -18902 10246 -11650 -36444 -39221 -12072
13182a2072M456k749l972k0794j4218K208K0466j150k1254l161K8664K8395J9048
$$ -12072 -7616 -10365 -14337 -35131 -49349 -47141 -26675 -27825 -49079 -52240 -23576 4819 23867
13169B3867q185j9981K2663k1363r805p207L3933J2726O633L2537J3022k5437
$$ 23867 15682 -4299 18364 -2999 -12804 -20011 13922 26648 33281 65818 78840 53403
13157E3403n0853M4L8729P818j0184j0437r086p216J405J7230R242k2816j0936
$$ 53403 2550 2594 41323 49141 38957 28520 19434 12218 13623 30853 40095 17279 6343
13144F343j0145K762J8189J6586k001K3530K4985k0619k2489J6621J772k7810
$$ 6343 -3802 -1040 17149 33735 31734 55264 80249 59630 37141 53762 55534 27724
13132B7724O299M153m1414k1352J0745M7438L5551j9422l0305j7599j584K6710
$$ 27724 34023 38176 -3238 -24590 -13845 33593 69144 49722 19417 1818 234 26944
13120B6944K9121j3127m0150M513R351l443J3325K1717L0963O246l756n989J8902
$$ 26944 56065 42938 2788 7301 16652 13209 26534 48251 79214 85460 81704 75715 94617
13107I4617K5229L395R429K1942N060K7443J5667N6718J10300J25237J03862M5633
$$ 94617 119846 123241 132670 154612 159672 187115 202782 259500 369800 495037 598899 644532
13095F44532L2363P9537L4477n5949j01565k2664J07348J81237J67364J35627
$$ 644532 676895 756432 790909 734960 633395 610731 718079 899316 1066680 1202307
13085A202307J01806K8141p0057j31935j57380j88394r2224K5207R2036O1313
$$ 1202307 1304113 1332254 1262197 1130262 972882 784488 692264 717471 809507 870820
13075H70820K0997J3625N1581k7797j16383j40854p8738K855O1614Q8686J05774
$$ 870820 891817 905442 957023 929226 812843 671989 593251 596106 657720 746406 852180
13064H52180Q6964J112O0027K1167j00199q0034j9359K6028J63436J81347J78512
$$ 852180 939144 940256 1000283 1021450 921251 841217 821858 847886 1011322 1192669 1371181
13053A371181P8497K5689l9894j31936j91680k06404j30948k3366M7958L4542
$$ 1371181 1449678 1475367 1435473 1303537 1111857 905453 774505 751139 799097 833639
13043H33639J1884K7500J2084o8068j36673j57432p6712p4533l5428j7445q049
$$ 833639 845523 873023 885107 817039 680366 522934 446222 371689 336261 318816 310767
13032C10767k5582j0394l953J1521k2921l9190j2725j5416j5631k0617J8138K8470
$$ 310767 285185 274791 270838 282359 259438 220248 207523 192107 176476 155859 173997 202467
13020B02467K1J961M263r253K8645L309k0043j4857p768p815l0070o1215j2845
$$ 202467 202488 204449 208712 199459 228104 231413 211370 196513 188745 180930 150860 89645 76800
13007G6800J3376o327j6696K4617n83l5889L064J2493J1726K1264M379k3088l4045
$$ 76800 90176 83849 67153 91770 91187 55298 58362 70855 82581 103845 108224 85136 51091
12994E1091j5573K4307L853k7718j1005K0256J7264J489j9828M266N906J6590
$$ 51091 35518 59825 63678 35960 24955 45211 62475 63964 44136 48402 54308 70898
12982G0898k4321l3732j3877K5195J9724j5721L947M278o254q829K2004K192j9243
$$ 70898 46577 12845 -1032 24163 43887 28166 32113 36391 30137 21308 43312 45504 26261
12969B6261q023q338M798K5675j6420k9771j5775Q164J5471R67j7069j3367J634
$$ 26261 18238 9900 14698 40373 23953 -5818 -21593 -13429 2042 3009 -14060 -27427 -25793
12956b5793j029l174J8204n538l301q058p897l1198N623j04O570K976L3148J9494
$$ -25793 -26822 -29996 -11792 -17330 -20631 -28689 -36586 -67784 -62161 -62265 -55695 -52719 -19571 -77
12942g7k3041j9026N854K0275J450M637k2614J0766M677j378j1726k885l2129
$$ -77 -23118 -42144 -36290 -16015 -14565 -9928 -32542 -21776 -17099 -18477 -30203 -33088 -65217
12929f5217N152J0190K8151j0614k5505J2648K6102J1041j2144m598j4435O786
$$ -65217 -60065 -49875 -21724 -32338 -57843 -45195 -19093 -8052 -20196 -24794 -39229 -32443
12917c2443J9628J8872j0939m841p415j6051p080M328J1923J0430L100r084O511
$$ -32443 -12815 6057 -4882 -9723 -17138 -33189 -40269 -35941 -24018 -13588 -10488 -19572 -13061
12904a3061n437k9996j8384L813N745l50O928P840K5606M544j7206J8370j4338
$$ -13061 -18498 -48494 -66878 -63065 -57320 -57670 -50742 -42902 -17296 -12752 -29958 -11588 -25926
12891b5926j0291M4015L2753q923j0663k046K0758q245Q540j2593k6389j4217
$$ -25926 -36217 7798 40551 31628 20965 18919 39677 31432 39972 27379 990 -13227
12879a3227J5219j6396l9664j1801J3824L303k915l164p258j3909Q424J1171j1748
$$ -13227 1992 -14404 -54068 -65869 -52045 -48742 -51657 -54821 -62079 -75988 -67564 -56393 -68141
12866f8141j9568m231J5724K6488M0032L596l2483l0324k1092m820L5325L6192
$$ -68141 -87709 -91940 -76216 -49728 -9696 -6100 -38583 -68907 -89999 -94819 -59494 -23302
12854b3302P043K2229k003j7358j6812q091j9016k740J1813L1079j8342k4353
$$ -23302 -16259 5970 3967 -13391 -30203 -38294 -57310 -60050 -48237 -17158 -35500 -59853
12842e9853J0157J0859j7179j1080K3374K3595K2354J1762J8127J1097l935k6118
$$ -59853 -49696 -38837 -56016 -67096 -43722 -20127 2227 13989 32116 43213 39278 13160
12830A3160j5806Q124k9048j1424J5045J7835r708j1819m824K5099J8814m7754
$$ 13160 -2646 5478 -23570 -34994 -19949 -2114 -11822 -23641 -28465 -3366 15448 -32306
12818c2306m639L113j5353K147J5794J049J2091j0320j5218K8622M891j5886o485
$$ -32306 -36945 -33832 -49185 -47038 -31244 -30195 -18104 -28424 -43642 -15020 -10129 -26015 -32500
12805c2500j2929p73n143j0154J2283J0485K5914K0931l243Q791J2403l3474k4299
$$ -32500 -45429 -46202 -51345 -61499 -49216 -38731 -12817 8114 4871 13662 26065 -7409 -31708
12792c1708K0185J4101J4425r744L591j426p432k1816j7742n293o753Q289j3471
$$ -31708 -11523 2578 17003 7259 10850 9424 1992 -19824 -37566 -42859 -49612 -41323 -54794
12779e4794K3428Q570j4893Q736O324O800K2699k9923m3377L65K5935K4520J113
$$ -54794 -31366 -22796 -37689 -28953 -22629 -15829 6870 -23053 -66430 -66065 -40130 -15610 -14497
12766a4497j0692J0464M182q158j6783n094j0442q494j2710l811K41J4957J2410
$$ -14497 -25189 -14725 -10543 -18701 -35484 -40578 -51020 -59514 -72224 -76035 -75794 -60837 -48427
12753d8427K25m240J2028K084j0357j520L97j0740Q473P780J2227J1609R8K0372
$$ -48427 -48202 -52442 -40414 -38330 -48687 -50207 -49810 -60550 -52077 -44297 -32070 -20461 -20363 9
12739IO969Q293k2207k3475r668j1615N304P986L4384j2795k7341j9009j660J9837
$$ 9 6978 15271 -6936 -30411 -40079 -51694 -46390 -38404 -4020 -16815 -44156 -63165 -64825 -44988
12725d4988k809n98K4562K110l0894N280R325K097r130O927M239o673m421l0383
$$ -44988 -47797 -48395 -23833 -21723 -52617 -47337 -38012 -35915 -45045 -38118 -33879 -40552 -44973 -75356
12711g5356r589M1948N0133m236j391R981QL6k7457k4177k559R760k4522p070
$$ -75356 -84945 -42997 7136 2900 1509 11490 11498 11534 -15923 -40100 -42659 -32899 -57421 -64491
12697f4491K4621J3019j7487k9259j691K2162L2722P906m719j451j7648l7637
$$ -64491 -39870 -26851 -44338 -73597 -75288 -53126 -20404 -12498 -17217 -18668 -36316 -73953
12685g3953O172J9611j7N0188R995P855j813l5132m981Q181J5422M1773j1914
$$ -73953 -67781 -48170 -48187 2001 11996 19851 18038 -17094 -22075 -13894 1528 43301 31387
12672C1387l1352N153m528j2606k5663l2312R358n07K8125K7084Q349J4166j0818
$$ 31387 35 5188 660 -11946 -37609 -69921 -60563 -61070 -32945 -5861 2488 16654 5836
12659E836k0942k2933k7437O325J6633K798J677M3154P661J7152K981l8063l9841
$$ 5836 -15106 -38039 -65476 -59151 -42518 -39720 -38043 5111 12772 29924 32905 -5158 -44999
12646d4999J4234K1819J8253j6294L39L2748j4234j8135j3318m31j6994K5384
$$ -44999 -30765 -8946 9307 -6987 -6648 26100 11866 -6269 -19587 -20018 -37012 -11628
12634a1628L0047j5972j0936J2793k1264P072J8926J1131J3080j602Q902N856
$$ -11628 18419 2447 -8489 4304 -16960 -9888 9038 20169 33249 31647 40549 46405
12622D6405r671j4591q732o440k4142m0909J2902L9529K1893J1345j4309k9766
$$ 46405 36734 22143 13411 6971 -17171 -58080 -45178 -5649 16244 27589 13280 -16486
12610a6486p894J7367N870j6075J3108q115k7843J2415M2337q119K6967J8387
$$ -16486 -24380 -7013 -1143 -17218 -4110 -12225 -40068 -27653 14684 6565 33532 51919
12598E1919j6107Q63J3792L257K3295m641l0811o560M615j0483k6550j2913L0528
$$ 51919 35812 36675 50467 53724 77019 72378 41567 35007 39622 29139 2589 -10324 20204
12585B0204J369K1335J6445o403L615j4672k1813N019p372J9530K5431R932j4707
$$ 20204 21573 42908 59353 52950 56565 41893 20080 25099 17727 37257 62688 72620 57913
12572E7913R203j603k2316j0437q061j8394p921q73J9366j8132j0825j8370j3815
$$ 57913 67116 65513 43197 32760 24699 6305 -1616 -2489 16877 -1255 -12080 -30450 -44265
12559d4265m642J6466K3632L0192r600q419Q859j169K749K719q974p572J1297
$$ -44265 -48907 -32441 -8809 21383 11783 3364 12223 11054 13803 16522 7548 -24 11273
12546A1273j6235m1760k5975K5467r454J8021J9181r630l6968m6700j7876K6156
$$ 11273 -4962 -46722 -72697 -47230 -56684 -38663 -19482 -29112 -66080 -112780 -130656 -104500
12534a04500K6403L381J3859K7379K7945n853j4196j2903j9249Q414l696q129
$$ -104500 -78097 -74716 -60857 -33478 -5533 -11386 -25582 -38485 -57734 -49320 -53016 -61145
12522f1145J0734P989j1928j1187K69K8379K5675J0065j7699j5439p412l62L141
$$ -61145 -50411 -42422 -54350 -65537 -65268 -36889 -11214 -1149 -18848 -34287 -41699 -42061 -38920
12509c8920j7432j1974N0796J8889m597j8572k9196R684J6002P643P18Q44k8296
$$ -38920 -56352 -68326 -17530 1359 -3238 -21810 -51006 -41322 -25320 -17677 -16959 -16115 -44411
12496d4411j5986j624K9467K7562k3223m2392m312K3847k993J5790J2874m366
$$ -44411 -60397 -62021 -32554 -4992 -28215 -70607 -74919 -51072 -54065 -38275 -25401 -29767
12484b9767j3414k191L521k7302l5233N843P070J5864J9891l712L695J4599J4762
$$ -29767 -43181 -45372 -41851 -69153 -104386 -98543 -91473 -75609 -55718 -59430 -55735 -41136 -26374
12471b6374o545j7051Q36R956J20M452J9814k3434l7047J3912l066j538K4490
$$ -26374 -32919 -49970 -49134 -39178 -39058 -34606 -14792 -38226 -75273 -61361 -64427 -65965 -41475
12458d1475P414L7214J4902j5728p485n610J051l21j6266J3327j1974r750m149
$$ -41475 -34061 3153 18055 2327 -5158 -10768 -9717 -10038 -26304 -12977 -24951 -34701 -38850
12445c8850j1967k8237Q945J5385J1027M542k4333q804J4571L507J920m266L569
$$ -38850 -50817 -79054 -70109 -54724 -43697 -39155 -63488 -72292 -57721 -54214 -52294 -56560 -52991
12432e2991L2952K934k6911j006J48K176k758p660k0953J5237K488k3563J3244
$$ -52991 -20039 -17105 -44016 -45022 -44874 -42698 -45456 -53116 -74069 -58832 -56344 -79907 -66663
12419f6663K8106J3810N601m65r698k5286j4211m942J6658M3665J492K3350J4322
$$ -66663 -38557 -24747 -19146 -19611 -29309 -54595 -68806 -73748 -57090 -13425 -11933 11417 25739
12406B5739K1113M901k1271p218n6796k9380K3370L9068O316J2341M6J0826j9855
$$ 25739 46852 51753 30482 23264 -33532 -62912 -39542 -474 5842 18183 18229 29055 9200
12393I200j0993j5136q656P256k9003p237L9858p847J897J0800j3677l140J8859
$$ 9200 -1793 -16929 -25585 -18329 -47332 -54569 -14711 -22558 -20661 -9861 -23538 -26678 -7819
12380g819Q306J1413Q188k2805j6364l232J217j0858j7181K329K8747J4806J9807
$$ -7819 487 11900 20088 -2717 -19081 -22313 -21096 -31954 -49135 -46806 -18059 -3253 16554
12367A6554n525Q58r334L738R184r610j5155R786J9840J6241N006L82n24r982
$$ 16554 11029 11887 2553 6291 15475 5865 -9290 496 20336 36577 41583 41965 41441 31459
12353C1459k6238j314J2966N391m11j6436l7921j6693J9689K513k230N217K7531
$$ 31459 5221 3907 16873 22264 21853 5417 -32504 -49197 -29508 -26995 -29225 -24008 3523
12340C523P253J7374N020n952J0319J4118J3178l0190j7660p412J2918j6101q46
$$ 3523 10776 28150 33170 27218 37537 51655 64833 34643 16983 9571 22489 6388 5542
12327E542J8283k4641j8103J1053P017j6920R541n159o612J0234M241j0739o240
$$ 5542 23825 -816 -18919 -7866 -849 -17769 -8228 -13387 -19999 -9765 -5524 -16263 -22503
12314b2503J6803k958k77o496J0914L394j3300j0884j290J7549K5038J7189n984
$$ -22503 -5700 -8658 -8935 -15431 -4517 -1123 -14423 -25307 -26597 -9048 15990 33179 27195
12301B7195J4787j4556K649J2795N690m979O677k6222n5241J8110J8386J2819
$$ 27195 41982 27426 30075 42870 48560 43581 50258 24036 -31205 -13095 5291 18110
12289A8110R807l515q00j9149k9928K1008O534N63j4052N191L317N732L032j2915
$$ 18110 27917 24402 23602 4453 -25475 -4467 2067 2630 -11422 -6231 -2914 2818 5850 -7065
12275g065j3845J3576Q30j0937L198J0442P048K6137k7136j8426R936K6305r624
$$ -7065 -20910 -7334 -6504 -17441 -14243 -3801 3247 29384 2248 -16178 -6242 20063 10439
12262A0439k0957l970m638J1720j4169J3682o037M555J8954J0950k5217L825j3838
$$ 10439 -10518 -14488 -19126 -7406 -21575 -7893 -13930 -9375 9579 20529 -4688 -863 -14701
12249a4701J6437K1151k392J0650Q812J7858J4662k6838m1268q546J1703l293
$$ -14701 1736 22887 20495 31145 39957 57815 72477 45639 4371 -4175 7528 4235
12237D235p69p287N667M085j6463k5793K6773N8049Q133q630J6434j6170l2263
$$ 4235 3466 -3821 1846 5931 -10532 -36325 -9552 48497 56630 48000 64434 48264 16001
12224A6001j6851j1619k6107k8097L7470M2130J5418r231j8764k4417k0604J655
$$ 16001 -850 -12469 -38576 -66673 -29203 12927 28345 19114 350 -24067 -44671 -43016
12212d3016J4773O875j5006j2227M592L4109J2503k0149K6027K4072M5839j6212
$$ -43016 -28243 -21368 -36374 -48601 -44009 -9900 2603 -17546 8481 32553 78392 62180
12200F2180k7338J141j3108j1153k2824J1402L389J0871m946j2089p808K2507
$$ 62180 34842 35983 22875 11722 -11102 300 3689 14560 9614 -2475 -10283 12224
12188A2224j3187l5064L884M1502L8292N048l07q780k9111k1295J0052n748J542
$$ 12224 -963 -36027 -32143 9359 47651 52699 52392 43612 14501 -6794 3258 -2490 -948
12175i48J5371R494M994J3977l4194r830L8472M995n0480J6863Q258j4905j4253
$$ -948 14423 23917 28911 42888 8694 -1136 37336 42331 -8149 8714 16972 2067 -12186
12162a2186N232K0437j9488N877o00R17J9229J3329K3102K5020n674j1752l159
$$ -12186 -6954 13483 -6005 -128 -728 189 19418 32747 55849 80869 75195 63443 60284
12149F0284Q636Q822J2854K0270L26J4908L4101N555k331O8135M9043K1907M4467
$$ 60284 68920 77742 90596 110866 111192 126100 160201 165756 163425 231560 280603 302510 346977
12136C46977O3621M3636P668Q439m7510j2725K511L814m0558m3800j5356m797
$$ 346977 410598 454234 461902 470341 422831 410106 412617 416431 375873 332073 316717 311920
12124C11920N332O505L8472k917j3622J9146K9079O3815J01737R5961J15306J21251
$$ 311920 317252 323757 362229 359312 345690 364836 393915 457730 559467 655428 770734 891985
12112H91985Q8775Q0220K7477k8087n5911l2875p2313k9000k1733K9248M8964
$$ 891985 980760 1060980 1088457 1060370 1004459 971584 899271 870271 848538 877786 926750
12101I26750O2724N7592L0404M6732J1003N002j6168n0457p8915n7619p1583p9399
$$ 926750 989474 1047066 1077470 1124202 1135205 1140207 1124039 1073582 994667 937048 865465 786066
12089G86066n0870o1388o3266k6358o0989n4730J9224m328m6320k6653J4588N939
$$ 786066 735196 673808 610542 584184 523195 468465 487689 483361 437041 410388 424976 430915
12077D30915J4898n172r013Q555K6547K2166K7914M1755N2806O1785M9198M6539
$$ 430915 445813 440641 431628 440183 466730 488896 516810 558565 611371 673156 722354 768893
12065G68893N8484Q2573O7212P6254O6861M7494K0122j9623l5286l8365l8364
$$ 768893 827377 909950 977162 1053416 1120277 1167771 1187893 1168270 1132984 1094619 1056255
12054A056255l7675k2442R087j5772l4845J367p622l2733m9758n9478n3537q5542
$$ 1056255 1018580 996138 1005225 989453 954608 955975 948353 915620 865862 806384 752847 667305
12042F67305o5988k3651m8311m2656J6288J9273Q008P680o903K354K6415M1154
$$ 667305 601317 577666 529355 486699 502987 522260 530268 537948 531045 533399 559814 600968
12030F00968K2218M6552L5418M3540K6384L4575K9240O0402P2312M0916q671j0343
$$ 600968 623186 669738 705156 748696 775080 809655 838895 899297 971609 1012525 1003854 993511
12018I93511J2672O462k6411k9944m4901m0511l6511m4975n1716o9962k4497j6519
$$ 993511 1006183 1012645 986234 956290 911389 870878 834367 789392 737676 667714 643217 626698
12006F26698j9543P751k1835r694l1430o448j2342N85j8898m1005m9289l8892
$$ 626698 607155 614906 593071 583377 551947 545499 533157 533742 514844 473839 424550 385658
11994C85658j0032p51M432J1108J0773K9427K8332N1197O1282N5302N0730M3841
$$ 385658 375626 374875 379307 390415 401188 430615 458947 510144 571426 626728 677458 721299
11982G21299O265l3886o1329j04988q2420p0471m0134j4707j1826k2275j5591
$$ 721299 727564 693678 632349 527361 444941 374470 334336 319629 307803 285528 269937
11971B69937J3377j2151m5246k7862p876L1399K6366K1402j6421j0347j1185O112
$$ 269937 283314 271163 225917 198055 190179 221578 247944 269346 252925 242578 231393 237505
11959B37505J1236J5681K749J2465j0198j4587k0359k7200n28j1224m174L4025
$$ 237505 248741 264422 267171 279636 269438 254851 234492 207292 206764 195540 191366 225391
11947B25391m743J0385p942j3027l0447q524Q516N382k031k4181m1141J4221K7018
$$ 225391 220648 231033 223091 210064 179617 171093 179609 184991 182960 158779 117638 131859 158877
11934A58877N734j2402k333k442O62j2490J8342K7567M8049J6082m854K587m728
$$ 158877 164611 152209 149876 147434 148096 135606 153948 181515 229564 245646 240792 243379 238651
11921B38651k3335J1972M169J349j935J0423P306j812M2k5817j5394k848o4j2946
$$ 238651 215316 227288 231457 232806 230871 241294 248600 246788 246830 221013 205619 202771 202707 189761
11907A89761l0263M24J8569p211o779k1094J20j916j0914j5658P489K4284P207
$$ 189761 159498 159922 178491 171280 164501 143407 143527 141611 130697 115039 122528 146812 154019
11894A54019o424O824M4611r832J2111J813M9754N936k3347r024o287J6222L1840
$$ 154019 147595 154419 199030 189198 201309 203122 252876 258812 235465 226441 220154 236376 268216
11881B68216L4596l221P329k059M113M603O411k3566m0651m1195j9648r211n77
$$ 268216 302812 299591 306920 304861 308974 313577 319988 296422 255771 214576 194928 185717 185140
11868A85140n017K1741Q785k6474l8751j2235J8181J267J0568p898j6904M10L412
$$ 185140 180123 201864 210649 184175 145424 133189 151370 152637 163205 155307 138403 138813 142225
11855A42225n811L4491M0817M6415J7565k4668J5101J1844K3195R731l718P240
$$ 142225 136414 170905 211722 258137 275702 251034 266135 277979 301174 310905 307187 314427
11843C14427J3409J2729R018N733k971P08Q574M915q388J6836K4104J2203q838
$$ 314427 327836 340565 349583 355316 352345 353053 361627 366542 358154 374990 399094 411297 402459
11830D02459q056M371n988K7521L4212k901k8548j1773j8988l2188l6789L897
$$ 402459 394403 398774 392786 420307 454519 451618 423070 411297 392309 360121 323332 327229
11818C27229J4598L374M5862K7281M880J8925M2289N1129j60q018k3696p657K6409
$$ 327229 341827 345201 391063 418344 423224 442149 484438 535567 535407 527389 503693 496036 522445
11805E22445q962O247M3435L0113L7048L3043K5335J3188K9885L8362N1915P2464
$$ 522445 513483 519730 563165 593278 630326 663369 688704 701892 731777 770139 822054 894518
11793H94518O3781M1797L1604J1117N2125J0330q605J3172N849r61K9334L6211
$$ 894518 958299 1000096 1031700 1042817 1094942 1105272 1096667 1109839 1115688 1114727 1144061 1180272
11781A180272J0577q744j0699j539J2293K9674K631J8050L7194N5096K7397J5995
$$ 1180272 1190849 1182105 1171406 1169867 1182160 1211834 1214465 1232515 1269709 1324805 1352202 1368197
11769A368197L634j7877q044L3952M4314M6523L6560P184L8976O5585M1266O8001
$$ 1368197 1371831 1353954 1345910 1379862 1424176 1470699 1507259 1514443 1553419 1619004 1660270 1728271
11757A728271N1104Q2413P5504O9823Q2186R3397P7065N6805M3942M5827P4517
$$ 1728271 1779375 1861788 1937292 2007115 2089301 2182698 2259763 2316568 2360510 2406337 2480854
11746B480854O0750N3482K2668N4251Q8512R0332P9822Q3227J00441J12495R6146
$$ 2480854 2541604 2595086 2617754 2672005 2760517 2850849 2930671 3013898 3114339 3226834 3322980
11735C322980J30973J77583J53573J90896K17458K07372K32446K50247K75172
$$ 3322980 3453953 3631536 3785109 3976005 4193463 4400835 4633281 4883528 5158700
11726E158700L66621L97840L85920M91909N54768N96241O92517Q33144R37715
$$ 5158700 5525321 5923161 6309081 6800990 7355758 7951999 8644516 9477660 10415375
11717A0415375J069655J273131J492312J757541K066183K445668K940690L535401
$$ 10415375 11485030 12758161 14250473 16008014 18074197 20519865 23460555 26995956
11709B6995956M165955M884012N512948N909507N935210N366549M240830K668179
$$ 26995956 31161911 36045923 41558871 47468378 53403588 58770137 63010967 65679146
11701F5679146P70950j060938k696563l858995m397279m422155m014866l400277
$$ 65679146 66450096 65389158 62692595 58833600 54436321 50014166 45999300 42599023
11693D2599023k772779k187731j637464j165216q26139n37833k06658J28046M97252
$$ 42599023 39826244 37638513 36001049 34835833 34009694 33471861 33265203 33393249 33890501
11684C3890501Q78394J261021J724871K267266K844144L525954M320595N259371
$$ 33890501 34768895 36029916 37754787 40022053 42866197 46392151 50712746 55972117
11676E5972117O280578P419977Q690692J0063830J1541345J2973748J4033965
$$ 55972117 62252695 69672672 78363364 88427194 99968539 112942287 126976252
11669A26976252J4356784J3687622J1911664R100810N517053J514232k461939
$$ 126976252 141333036 155020658 166932322 176033132 181550185 183064417 180602478
11662A80602478n931940q390468r752968j0206020j0099361r596087q940985q138233
$$ 180602478 174670538 166280070 156527102 146321082 136221721 126625634 117684649 109546416
11654A09546416p317251o574840n880245n160028m446349l700850k921189k123967
$$ 109546416 102229165 95654325 89774080 84614052 80167703 76466853 73545664 71421697
11646G1421697j381631o47209J49461R08715J711035K685281L750573M900816
$$ 71421697 70040066 69392857 69542318 70451033 72162068 74847349 78597922 83498738
11638H3498738O165159P576541R123129J0773033J2455673J3901578J4744333
$$ 83498738 89663897 97240438 106363567 117136600 129592273 143493851 158238184
11631A58238184J4526256J3081654J0431716O790121K459964k013647o110168
$$ 158238184 172764440 185846094 196277810 203067931 205527895 203514248 197404080
11624A97404080r258334j1229973j2035541j1956907j1419029j0696001r890251
$$ 197404080 188145746 176915773 164880232 152923325 141504296 130808295 120918044
11617A20918044r036645q203784p494845o850997o165799n478252m823290m176915
$$ 120918044 111881399 103677615 96182770 89331773 83165974 77687722 72864432 68687517
11609F8687517l562625k982553k453321j982931j521874j056946n94941j16176
$$ 68687517 65124892 62142339 59689018 57706087 56184213 55127267 54532326 54416150
11601E4416150M18250J008680J705629K467770L281178M191670N036110N602433
$$ 54416150 54834400 55843080 57548709 60016479 63297657 67489327 72525437 78127870
11593G8127870N704716N160000L911241K122464k6642k270914m303840n769262
$$ 78127870 83832586 88992586 92903827 95026291 94999649 92728735 88424895 82655633
11585H2655633o583585o686342o278696n642199m892033m210131l627799l140423
$$ 82655633 76072048 69385706 63107010 57464811 52572778 48362647 44734848 41594425
11577D1594425k789014k508117k250290k051872j854816j696158j538275j463516
$$ 41594425 38805411 36297294 34047004 31995132 30140316 28444158 26905883 25442367
11569B5442367j338328j176423j103307j036091r74184q79796q28631p70082p22966
$$ 25442367 24104039 22927616 21824309 20788218 19814034 18934238 18105607 17335525 16612559
11560A6612559o90277o53651n73485n65515n58732n33960n01762m85271m79774
$$ 16612559 15922282 15268631 14695146 14129631 13570899 13036939 12535177 12049906 11570132
11551A1570132m20131m14991l98969l92291l56780l07663l01840k87549k73613
$$ 11570132 11150001 10735010 10336041 9943750 9586970 9279307 8977467 8689918 8416305
11542H416305k64376k66679k31332k37826k31870j92769j94601j76450j86855
$$ 8416305 8151929 7885250 7653918 7416092 7184222 6991453 6796852 6620402 6433547
11533F433547k08839k04999k09853k06486j98615k03654j85836j40038j58102
$$ 6433547 6224708 6019709 5809856 5603370 5404755 5201101 5015265 4875227 4717125
11524D717125j61189j42847j56903j65071j25471r3939j28724j30883j15688j06138
$$ 4717125 4555936 4413089 4256186 4091115 3965644 3871705 3742981 3612098 3496410 3390272
11514C390272j02726r9957j27301r7018p7060r5812q2087o6180q6042o8135k7417
$$ 3390272 3287546 3187589 3060288 2963270 2886210 2790398 2708311 2642131 2556089 2487954 2460537
11503B460537l4166n5569j2722l3845l8904p5676n5870o9859m1608n4053l7249
$$ 2460537 2426371 2370802 2358080 2324235 2285331 2209655 2153785 2083926 2042318 1988265 1951016
11492A951016l6976k7514j4423l1929m8845n7631j9294l1396j5109k1626O874
$$ 1951016 1914040 1886526 1872103 1840174 1791329 1733698 1714404 1683008 1667899 1646273 1653147
11481A653147m1352n2765j8574m754O733j152j1953k6256k4433k5795l7487l9892
$$ 1653147 1611795 1559030 1540456 1535702 1542435 1541283 1529330 1503074 1478641 1452846 1415359 1375467
11469A375467p077o681k6698j7599K0815M4505K8086O1789O0373J1164L0431L9846
$$ 1375467 1368390 1361709 1335011 1317412 1338227 1382732 1410818 1472607 1532980 1544144 1574575 1614421
11457A614421N6526R5890Q7961J09669N6661Q1545Q5741R681p475m3519n8424
$$ 1614421 1670947 1766837 1854798 1964467 2021128 2102673 2188414 2198095 2190620 2147101 2088677
11446B088677r7859j32749j25134j13485n3355k8214m9745l7520l8320l6397R663
$$ 2088677 1990818 1858069 1732935 1619450 1566095 1537881 1488136 1450616 1412296 1375899 1385562
11435A385562m1456m4669l3090R459N953K4580p375N997L1945M1535N7255L7687
$$ 1385562 1344106 1299437 1266347 1275806 1281759 1306339 1298964 1304961 1336906 1378441 1435696 1473383
11423A473383N1729M5419M2376M6091L5393M7701M4729O1682O6599O7021O3460
$$ 1473383 1525112 1570531 1612907 1658998 1694391 1742092 1786821 1848503 1915102 1982123 2045583
11412B045583L5623j2920p9584r1936q5080o6781j06482j42342j37003j10913
$$ 2045583 2081206 2068286 1988702 1896766 1811686 1744905 1638423 1496081 1359078 1248165
11402A248165m8850m0458l0826m4619l8199n5050n7803k5597j5323j6373l1145
$$ 1248165 1199315 1158857 1128031 1083412 1045213 990163 932360 906763 891440 875067 843922
11391H43922m8784m6000M985j4616K7199L5378K4920N5652M6807N5484n286J9371
$$ 843922 795138 749138 754123 739507 766706 802084 827004 882656 929463 984947 979661 999032
11379I99032n50j1163Q800q202k6543j5982l3687m1233l4487o8770l6834l7274
$$ 999032 998482 987319 996119 987917 961374 945392 911705 870472 835985 767215 730381 693107
11367F93107k9897p6396o2379m5341p129N810P101k6378j8962J0737j5212l1702
$$ 693107 663210 586814 524435 479094 471965 477775 484876 458498 439536 450273 435061 403359
11355D03359K831J8977P023o752j2834j6528O309k2418l7794K6817n233l8233
$$ 403359 406190 425167 432190 425438 412604 396076 402385 379967 342173 368990 363757 325524
11343C25524j6113J3450Q68j5498m0916k8263j3799J1583L6041r413j6472m725
$$ 325524 309411 322861 323729 308231 267315 239052 225253 236836 272877 263464 246992 242267
11331B42267N449L557M628k8977j2445r73J1488j0790K8200L7216L60J2065K4364
$$ 242267 247716 251273 255901 226924 214479 213506 224994 214204 242404 279620 279980 292045 316409
11318C16409n554l1790j3046k501n921l693m42L2326l898l978j2973J0554J219
$$ 316409 310855 279065 266019 263518 257597 253904 253462 285788 281890 277912 264939 275493 276712
11305B76712k0950J3554L0113J1909j9124n089j0227k0924J8415O50O582L6412
$$ 276712 255762 269316 299429 311338 292214 287125 276898 255974 274389 275039 281621 318033
11293C18033k635J0077O926r155J7561J6705Q844k0889J5674M2028j2247j2708
$$ 318033 315398 325475 332401 323246 340807 357512 366356 345467 361141 403169 390922 378214
11281C78214J0472k4224l0961N364J7677o625M473L101k895Q644J394K4463O551
$$ 378214 388686 364462 333501 338865 356542 349917 354390 357491 354596 363240 364634 389097 395648
11268C95648J4663K4351Q949P763J2765J8029J6288J2438j9916j556L199q672
$$ 395648 410311 434662 443611 451374 464139 482168 498456 510894 490978 489422 492621 483949
11256D83949k2163j2848q14O230M0950K8976J7967J859Q959j5429k9141j1433
$$ 483949 461786 448938 448124 454354 495304 524280 542247 544106 553065 537636 508495 497062
11244D97062J2265N7716M9212K1813J495J6699L8443L6861K7187K9852N1705L8678
$$ 497062 509327 567043 616255 638068 639563 656262 694705 731566 758753 788605 840310 878988
11232H78988M7986K1727O655j8103j3826k1276k3742k1630k805m302l6596l1806
$$ 878988 926974 948701 955356 937253 923427 902151 878409 856779 853974 849672 813076 781270
11220G81270k4762l0929k4813L2258M6928J9911j7155r305k3115m0552O080J0731
$$ 781270 756508 725579 700766 733024 779952 799863 782708 773403 750288 709736 715816 726547
11208G26547J2674J2708L6257M0476J4646n407r429q626K6014L8119O7278M2654
$$ 726547 739221 751929 788186 828662 843308 837901 828472 819846 845860 883979 951257 993911
11196I93911N4184M1891L4210O0725M781j7363j7161j3504j7044k5655n5372q5336
$$ 993911 1048095 1089986 1124196 1184921 1189702 1172339 1155178 1141674 1124630 1098975 1043603 958267
11184I58267j08605p1515m9879j9717L428J4854J6721J1594J4625p659j5643l5712
$$ 958267 849662 778147 728268 708551 711979 726833 743554 755148 769773 762114 746471 710759
11172G10759k3988J7429j8800k9362K3082K7076J2836O244M0650O5053P0960R2760
$$ 710759 686771 704200 685400 656038 679120 706196 719032 725276 765926 830979 901939 994699
11160I94699Q0680O9741O1816P4395J03156M3587L799j8179n5612q0377n7269
$$ 994699 1075379 1145120 1206936 1281331 1384487 1428074 1431873 1413694 1358082 1277705 1220436
11149A220436o3379r2055p2902o3001n4589m6721J9631J7088J3564P200q066n151
$$ 1220436 1157057 1065002 992100 929099 874510 827789 847420 864508 878072 885272 877206 872055
11137H72055J5191R792j3744M598j5753l4897k8268l2249Q14L0802K386L1054
$$ 872055 887246 897038 883294 887892 872139 837242 808974 776725 777539 808341 810727 841781
11125H41781L5636O9655O2065L5864O4102O4857J00672J12723O8198N3288M5202
$$ 841781 877417 947072 1009137 1045001 1109103 1173960 1274632 1387355 1455553 1508841 1554043
11114A554043K037l3445j4040l9276n7541n5724k3758J7440k2880J3682K7029
$$ 1554043 1556080 1522635 1508595 1469319 1411778 1356054 1332296 1349736 1326856 1340538 1367567
11103A367567n934L7272L2606K0430P8442L8967j9407J3258K7305K7400J8851
$$ 1367567 1361633 1398905 1431511 1451941 1530383 1569350 1549943 1563201 1590506 1617906 1636757
11092A636757J9428n960k411M0716M8077L9432M9484N4801Q2224O1149L8655M3808
$$ 1636757 1656185 1650225 1647814 1688530 1736607 1776039 1825523 1880324 1962548 2023697 2062352 2106160
11080B106160O5026P0728J00037P8048Q6109Q9299O8270Q0097R2272J05145J05857
$$ 2106160 2171186 2241914 2341951 2419999 2506108 2595407 2663677 2743774 2836046 2941191 3047048
11069C047048O4696J08030J22623J46916J91649J74569J80689K19520K53526K69880
$$ 3047048 3111744 3219774 3342397 3489313 3680962 3855531 4036220 4255740 4509266 4779146
11059D779146K96321L37108L63716M07391M32359M96660N89135N99441P00721
$$ 4779146 5075467 5412575 5776291 6183682 6616041 7112701 7701836 8301277 9001998
11050I001998Q05644R17678J077532J262322J447214J678403J952252K371445
$$ 9001998 9807642 10725320 11802852 13065174 14512388 16190791 18143043 20514488
11042B0514488K910419L600452M514204N730262P421740R830701J3233678J7864265
$$ 20514488 23424907 27025359 31539563 37269825 44691565 54522266 67755944 85620209
11034H5620209K3373580K8073109K9545285K6281967J8964119R154927j734221
$$ 85620209 108993789 137066898 166612183 192894150 211858269 221013196 219278975
11027B19278975j2813915k2510512k7890893k7172377k2290642j6471216j1621432
$$ 219278975 206465060 183954548 156063655 128891278 106600636 90129420 78507988
11020G8507988q166359n891790m483305l629178l003452k500551j946294j297697
$$ 78507988 70341629 64449839 59966534 56337356 53333904 50833353 48887059 47589362
11012D7589362o09768J28720R16708J813863K892350M238739N902117P798322
$$ 47589362 46979594 47108314 48025022 49838885 52731235 56969974 62872091 70670413
11004G0670413R468575J0691051J1890706J3902249J6404013J7956588J7886298
$$ 70670413 80138988 90830039 102720745 116622994 133027007 150983595 168869893
10997A68869893J8045021K1049161K5764953K8110219K5671145J9009908J0406299
$$ 168869893 186914914 207964075 233729028 261839247 287510392 306520300 316926599
10990C16926599J814960p692652j9298516k9821889l4598439l2491720k6425590
$$ 316926599 318741559 311048907 291750391 261928502 227330063 194838343 168412753
10983A68412753k0405934j6805267j4817043j2817898j0549467q532048p025498
$$ 168412753 148006819 131201552 116384509 103566611 93017144 84485096 77459598
10976G7459598n869396m905769m010757l232585k573829j996873j446380q82391
$$ 77459598 71590202 66684433 62673676 59441091 56867262 54870389 53424009 52541618
10968E2541618k80502L62729J129587K089906L315448M899722P125427J0143304
$$ 52541618 52261116 52623845 53753432 55843338 59158786 64058508 71183935 81327239
10960H1327239J4045843J8168341K1033703K1001468J7728670J1666980L632255
$$ 81327239 95373082 113541423 134575126 155576594 173305264 184972244 188604499
10953A88604499n153425j3281802j9611864k2516347k1259048j7366927j3002032
$$ 188604499 183451074 170169272 150557408 128041061 106782013 89415086 76413054
10946G6413054r508882p040940n465429m489374l945865l553312l209022k882956
$$ 76413054 66904172 59863232 54397803 49908429 45962564 42409252 39200230 36317274
10938C6317274k534373k249936k018600j770954j576341j431356j331382j180995
$$ 36317274 33782901 31532965 29514365 27743411 26167070 24735714 23404332 22223337
10930B2223337j085832r77989r04802q63765p87502p44796o76347o21498o17003
$$ 22223337 21137505 20159516 19254714 18390949 17603447 16858651 16182304 15560806 14943803
10921A4943803o10537n45075n02187m66535m33354m68755m69183m49380m33594
$$ 14943803 14333266 13788191 13286004 12819469 12386115 11917360 11448177 10998797 10565203
10912A0565203l91389l69078l71535l12196k85206k68026k67346k38969j99489
$$ 10565203 10173814 9804736 9433201 9121005 8835799 8567773 8300427 8061458 7861969
10903G861969j77882j83189j88656j47052j68204j86033j78424k20241k31799
$$ 7861969 7684087 7500898 7312242 7165190 6996986 6810953 6632529 6412288 6180489
10894F180489k19282k10390k14889j89514j43459j45801j28031q1525j00556n7572
$$ 6180489 5961207 5750817 5535928 5346414 5202955 5057154 4929123 4847598 4747042 4689470
10884D689470Q353L8111J45515L01935N91744R29843Q90298K70770o2990J15406
$$ 4689470 4697823 4735934 4881449 5183384 5775128 6704971 7595269 7866039 7803049 7918455
10874G918455k82988j068448j256398r02006n40655l35460j91171j00838q4438
$$ 7918455 7635467 6567019 5310621 4408615 3867960 3532500 3341329 3240491 3156053
10865C156053r6772p3867r1888r7797j07693o7855q5878p7129p4820o0686p6788
$$ 3156053 3059281 2985414 2893526 2795729 2688036 2620181 2534303 2457174 2382354 2321668 2244880
10854B244880q4996o8049p6426n2504q9799p2840n2687l9919j6945k4933j1181
$$ 2244880 2159884 2091835 2015409 1962905 1873106 1800266 1747579 1707660 1690715 1665782 1654601
10843A654601K7103J2465k867l0652m7611o2675m9920q0252o5062l6849l9528
$$ 1654601 1681704 1694169 1691302 1660650 1613039 1550364 1500444 1420192 1355130 1318281 1278753
10832A278753l7328j4093J6289K2339M5584J6510j5500j0671O629m3233k0359
$$ 1278753 1241425 1227332 1243621 1265960 1311544 1328054 1312554 1301883 1308512 1265279 1244920
10821A244920j2362l6781j6165k654j7018n5992j8379J3558r171l9351k9832J4400
$$ 1244920 1232558 1195777 1179612 1176958 1159940 1103948 1085569 1099127 1089956 1050605 1020773 1035173
10809A035173K8518J5114J9400J7810j618K2354N2431J5238J2079j2016m2377
$$ 1035173 1063691 1078805 1098205 1116015 1114397 1136751 1189182 1204420 1216499 1204483 1162106
10798A162106j5133r963n6690k3739M205K5565N869l839l6611j5927P87j2095
$$ 1162106 1146973 1137010 1080320 1056581 1060786 1086351 1092220 1088381 1051770 1035843 1036630 1024535
10786A024535m6908m2936l6894k0170k0224k0808k9945k7972k878J0234K6239
$$ 1024535 977627 934691 897797 877627 857403 836595 806650 778678 775800 786034 812273
10775H12273j5749l6863j1500q302m0315l14N751J3746M1649R131J3525O630J8466
$$ 812273 796524 759661 748161 739859 699544 699230 704981 718727 760376 769507 783032 789662 808128
10762H08128K5283L43q775k7653m2246n9374m3652j2380J09K511J334j5775k26
$$ 808128 833411 833754 824979 797326 755080 695706 652054 639674 639783 642294 643628 627853 627627
10749F27627J674O599M536R761P313r978j1585q133j7214k0331n808k5671m7708
$$ 627627 629301 635900 640436 650197 657510 647532 635947 627814 610600 590269 584461 558790 511082
10736E11082k4504k1631j3859j1600l1744l7722j1813L0471J7078j1590J2774
$$ 511082 486578 464947 451088 439488 407744 370022 358209 388680 405758 394168 406942
10725D06942K5351j1366l1257k7451J1887o777j7204O154J8839k7518j037l53
$$ 406942 432293 420927 389670 362219 374106 367329 350125 356279 375118 347600 346563 346210
10713C46210n366j702k7823k9081L824J1179R134j1740l842J0962J7576L3141
$$ 346210 340844 339142 311319 282238 286062 297241 306375 294635 290793 301755 319331 352472
10701C52472J8199o584j1406l1958k8278K8307q217j7618j776j3894p913M1759
$$ 352472 370671 364087 352681 320723 292445 320752 312535 294917 293141 279247 271334 313093
10689C13093L245j3497l1182K2983K7679J0381R800K5672l105m1767m8572l6065
$$ 313093 316338 302841 271659 294642 322321 332702 342502 368174 365069 323302 274730 238665
10677B38665L423J3452k0745l7419P606K8346M540j3295M678k928j6507l1991
$$ 238665 242088 255540 234795 197376 204982 233328 237868 224573 229251 226323 209816 177825
10665A77825j3186j7796K3086M173M053J5004J3863K6635J2677Q078j6696j4509
$$ 177825 164639 146843 169929 174102 178155 193159 207022 233657 246334 254412 237716 223207
10653B23207P241n053k6142J4222K2207q450m032q779K7086k0270k0526j973J1395
$$ 223207 230448 225395 199253 213475 235682 227232 223200 214421 241507 221237 200711 198738 210133
10640B10133M694n218J6473j8262l1099L727j1758k1380j8961O587O320K7776
$$ 210133 214827 209609 226082 207820 176721 180448 168690 147310 128349 134936 141256 169032
10628A69032R610J0245O787j296J0990p514K1437j0637r162n689P965P296j888
$$ 169032 178642 188887 195674 194378 205368 197854 219291 208654 199492 193803 201768 209064 207176
10615B07176j4868M4724L0377J2239J4809J9717L0608J4830L1051N0127P0996
$$ 207176 192308 237032 267409 279648 294457 314174 344782 359612 390663 440790 511786
10604E11786J03147J29649J72292J50393J08624Q5855L5007n2283q7826j18637
$$ 511786 614933 744582 916874 1067267 1175891 1261746 1296753 1244470 1156644 1038007
10594A038007j25758j18917q8470r3782o8783m0744l4864n7299k6571m84q987
$$ 1038007 912249 793332 704862 611080 542297 501553 466689 409390 382819 382335 373348
10583C73348j1375j1000Q862j2212J6137L6612O4707p63K068M7381O4000O6182
$$ 373348 361973 350973 359835 347623 363760 400372 465079 464316 466384 513765 577765 643947
10571F43947O8632J05790R6890R9308J10987J30573J35832J05559J58338J08685
$$ 643947 712579 818369 915259 1014567 1125554 1256127 1391959 1497518 1655856 1764541
10561A764541P6547J497l8820r9891j34657j58202j50944j75587j31056p9575
$$ 1764541 1841088 1842585 1803765 1703874 1569217 1411015 1260071 1084484 953428 873853
10551H73853q1748l2169p9224p7160k6611j8123l6343m8046m5590m548k8913m4361
$$ 873853 792105 759936 680712 603552 576941 558818 522475 474429 428839 424291 395378 351017
10539C51017K6580J6887J7463N966J2551k382M35P109M5155Q9216J00310J38041
$$ 351017 377597 394484 411947 417913 430464 428082 428517 435626 480781 569997 670307 808348
10527H08348J11241P5249J00381L9589j4183m9466q2918j50619j45520r2576p1520
$$ 808348 919589 994838 1095219 1134808 1120625 1071159 988241 837622 692102 599526 528006
10516E28006o0983k6360l9178l0923k9899l2344l135J2030j7909n3502j9860K5780
$$ 528006 467023 440663 401485 370562 340663 308319 305184 317214 299305 245803 225943 251723
10504B51723Q13j4574j2067k9574j553J0284k1038j6688o097n422j3866J9052
$$ 251723 252536 237962 225895 196321 194768 205052 184014 167326 161229 155807 141941 160993
10492A60993L626K128m625k8078q773j6271j9430j3580K1771K7945p374m841R472
$$ 160993 164619 166747 162122 134044 125271 109000 89570 75990 97761 125706 118332 113491 122963
10479A22963o955p788j4168J4748j601k7290j5240k857M399o539K3560K4401j34
$$ 122963 116008 108220 94052 108800 107199 79909 64669 61812 66211 59672 83232 107633 107499
10466A07499j0386j9818o906j2675k3623M150P885r521L4683j2937k2854J8596
$$ 107499 97113 77295 70389 57714 34091 38241 46126 36605 71288 58351 35497 54093
10454E4093K5739K2883N988j6956j2573p059J2578m655k1705m700J810R331J6151
$$ 54093 79832 102715 108703 91747 79174 72115 84693 80038 58333 53633 55443 64774 80925
10441H0925k2037l2503K2871K4061J677J1365q884k0643k3465q350J6385M93K813
$$ 80925 58888 26385 49256 73317 74994 86359 77475 56832 33367 25017 41402 41895 44708
10428D4708r883k3711l1843R070K3105K8033l697K12J1873J0245o658O539K715
$$ 44708 34825 11114 -20729 -11659 11446 39479 35782 35994 47867 58112 51454 57993 60708
10415F0708l640o085n321L507Q957l2299j4118K2690j6473J5604k433J5940K0713
$$ 60708 57068 50983 45662 49169 58126 25827 11709 34399 17926 33530 31097 47037 67750
10402F7750j5536n151k427O625j497o061m926k659J5407L504Q86p938j123n159
$$ 67750 52214 47063 44636 51261 49764 43703 38777 36118 51525 55029 55915 47977 46854 41695
10388D1695j2824n544J2787J6311J3564m338M929m762j3548K3961k857j5609K8743
$$ 41695 28871 23327 36114 52425 65989 61651 66580 61818 48270 72231 69374 53765 82508
10375H2508J0516J8773N3895N5175O6492Q0833L9258l6803m819k0997k6100o8656
$$ 82508 93024 111797 165692 220867 287359 368192 407450 370647 365828 344831 318731 250075
10363B50075o7716k3678j9859J3578J9558j2980k601n804J9028o678j2643j389
$$ 250075 182359 158681 138822 152400 171958 158978 156377 150573 169601 162923 150280 148891
10351A48891l1061Q869q357j9752j2650j1680j8269k845q041n345L1173n994k4467
$$ 148891 117830 126699 118342 98590 85940 74260 55991 53146 45105 39760 70933 64939 40472
10338D0472J2100P127j5134l443Q386j0426k1249k3990K3056K6372Q695J080k5333
$$ 40472 52572 59699 44565 41122 49508 39082 17833 -6157 16899 43271 51966 53046 27713
10325B7713l45J1432j1751N149k529Q8k2899J0667M1083Q177L694Q351l2445j125
$$ 27713 27368 38800 27049 32198 29669 29757 6858 17525 58608 66785 70479 78830 46385 45260
10311D5260J8158j5305j6453k0257j5621J2712K0407M7600M866n684r323N846
$$ 45260 63418 48113 31660 11403 -4218 8494 28901 76501 81367 75683 66360 72206
10299G2206j8417k382Q267q719l8455o665j3058l0121K375M3668K6027K332K2719
$$ 72206 53789 51407 59674 50955 12500 5835 -7223 -37344 -34969 8699 34726 37058 59777
10286E9777N512k039q05l200R200Q491k9674j3847j8136r28K6456o459j1174m943
$$ 59777 65289 63250 62445 59245 68445 76936 47262 33415 15279 14351 40807 34348 23174 18231
10272A8231O591k646j3988j3578j5862J8883K485J6735J5890M899J3342j7105
$$ 18231 24822 22176 8188 -5390 -21252 -2369 116 16851 32741 37640 50982 33877
10260C3877j5975J389j5620J1449R86J0692K7806P967j9406l171q319L430k2049
$$ 33877 17902 19291 3671 15120 16106 26798 54604 62571 43165 39994 31675 35105 13056
10247A3056k4784J0553J0122K0277J3348J330j5602n643J0279m891o510m140K140
$$ 13056 -11728 -1175 8947 29224 42572 43902 28300 22657 32936 28045 21535 17395 19535
10234A9535K163l638j2733l3249m736J1333J3535J2271l683j079L0546J3639j0615
$$ 19535 21698 18060 5327 -27922 -32658 -21325 -7790 4481 798 -281 30265 43904 33289
10221C3289O268J604j7159K504J1243k2206l7080l478J1701Q63J0870P981P847
$$ 33289 39557 41161 24002 26506 37749 15543 -21537 -25015 -13314 -12451 -1581 6400 14247
10208A4247k655m693j0382Q938J3232j3325L839K5460k2980N742l491J4140L581
$$ 14247 11592 6899 -3483 5455 18687 5362 9201 34661 11681 17423 13932 28072 31653
10195C1653k1847k3456O535Q995j5222K5561L619j2533m964n213J1530k3028J9341
$$ 31653 9806 -13650 -7115 1880 -13342 12219 15838 3305 -1659 -6872 4658 -18370 971
10182I71k819k767J1384L3221J9061k2116k3807M1647K4309q451o34J4295m6636
$$ 971 -1848 -4615 6769 39990 59051 36935 13128 54775 79084 70633 69999 84294 37658
10169C7658k3466J3909j4396k4399K169J4859N9m418R899Q470k252j197j394J8961
$$ 37658 14192 28101 13705 -10694 -8525 6334 6393 1975 11874 20344 18092 16895 15501 34462
10155C4462l051k6592l2016o554J3859r858j125O890Q032K1541k2508m356R176
$$ 34462 31411 4819 -27197 -33751 -19892 -29750 -30875 -23985 -15953 5588 -16920 -21276 -12100
10142a2100q816Q900j300l456K585j5768P101K1744p438N989j36r180J0802j9695
$$ -12100 -20916 -12016 -13316 -16772 -14187 -29955 -22854 -1110 -8548 -2559 -2695 -11875 -1073 -20768
10128b0768j8755J8063K2343L35j2826K8651L7328j5468k0452k7869k5632K1541
$$ -20768 -39523 -21460 883 1218 -11608 17043 54371 38903 18451 -9418 -35050 -13509
10116a3509J4350k3033K3434L1962k0948k160m967j8055J060L123P053Q11K544
$$ -13509 841 -22192 1242 33204 12256 10096 5129 -12926 -11866 -8743 -1690 -879 1665
10103A665j2240j1623N500k931J5383J2988J0662j844J0793j929j818j9058J8195
$$ 1665 -10575 -22198 -16698 -19629 -4246 8742 19404 17560 28353 26424 24606 5548 23743
10090B3743M2673K0262j4178l0335k3538n086M073R325m962k1161K994K8723j0862
$$ 23743 66416 86678 72500 42165 18627 13541 17614 26939 21977 816 3810 32533 21671
10077B1671J2517N259j3983Q748K4882q234j7963k5364k2432J4174J4485p080
$$ 21671 34188 39447 25464 34212 59094 50860 32897 7533 -14899 -725 13760 6680
10065F680K5066M381j3685j8718m142K2175j6954j1617J1667J3235J460J4145
$$ 6680 31746 36127 22442 3724 -418 21757 4803 -6814 4853 18088 19548 33693
10053C3693j3100k5082O10o633k1158k5595P624J8557N3546k284l5084k3373j8456
$$ 33693 20593 -4489 -3879 -10512 -31670 -57265 -49641 -31084 22462 20178 -14906 -38279 -56735
10040e6735j1842J9059J4218n643k6585Q327L6903P187j7772N864L624J3228K5469
$$ -56735 -68577 -49518 -35300 -40943 -67528 -59201 -22298 -15111 -32883 -27019 -23395 -10167 15302
10027A5302J3902k5479k6026J2854j1102R648J0577L4472j6507j1552Q400m363
$$ 15302 29204 3725 -22301 -9447 -20549 -10901 -324 34148 17641 6089 14489 10126
10015A0126J3552K3206j7310j2459j8877K456j8040q39K6406k0666k7610K0072
$$ 10126 23678 46884 29574 17115 -1762 694 -17346 -18185 8221 -12445 -40055 -19983
10003a9983m683M580k113K7206k126q303N08P427R175j1298k107K7848q298l3670
$$ -19983 -24666 -20086 -22199 5007 2881 -5422 -4914 2513 11688 390 -1717 26131 17833 -15837
9989a5837j5742j095j253J7107Q024N783m45L920j3773k3781Q807N610J6760L0762
$$ -15837 -31579 -32674 -33927 -16820 -8796 -3013 -3458 462 -13311 -37092 -28285 -22675 -5915 24847
9975B4847k7104R668J5786j2341l459r580R699k1842p243n229K5518K0920l6222
$$ 24847 -2257 7411 23197 10856 7397 -2183 7516 -14326 -21569 -26798 -1280 19640 -16582
9962a6582m675o499J4818J7281k859Q267l6235K651K9714j3954j5366J3838J999
$$ -16582 -21257 -27756 -12938 4343 1484 9751 -26484 -23833 5881 -8073 -23439 -9601 -7602
9949g602Q781J1125j3928k1658K723P369j0618r897J6690K9370L8247J2135k3290
$$ -7602 1179 12304 -1624 -23282 -20559 -13190 -23808 -33705 -17015 12355 50602 62737 39447
9936C9447j4371k1088J5976K49r21J8874j230k2244R30J0448j5445k6470q338
$$ 39447 25076 3988 19964 20213 19292 38166 36936 14692 15622 26070 10625 -15845 -24183
9923b4183J429J6100k4891o358p047K105R190k87N786J2026j2013K3379l78q057
$$ -24183 -22754 -6654 -31545 -37903 -44950 -42845 -33655 -33942 -28156 -16130 -28143 -4764 -5142 -13199
9909a3199N7J5934l1074m1472J0574K9916r985Q912J0534j4000J135O689J058
$$ -13199 -13142 2792 -28282 -69754 -59180 -29264 -39249 -30337 -19803 -33803 -32668 -25979 -24921
9896b4921n637o401m288J7709L5727J3355j2846J687j9970p441m452J908J0199
$$ -24921 -30558 -36959 -41247 -23538 12189 25544 12698 14385 -5585 -13026 -17478 -15570 -5371
9883e371K289j1847j880j3204J409J7915j5013j5680Q309J4982J0210m310K6720
$$ -5371 -3082 -14929 -16809 -30013 -28604 -10689 -25702 -41382 -33073 -18091 -7881 -12191 14529
9870A4529K8176J5875k3029k2407q971p2o226l0778q700q335K2270K9494k0622
$$ 14529 42705 58580 35551 13144 4173 4101 -2125 -32903 -41603 -49938 -27668 1826 -18796
9857a8796L013o499k6628l0539L1906J8797K3546p402q977k3830j7993J7681L2851
$$ -18796 -15783 -22282 -48910 -79449 -47543 -28746 -5200 -12602 -21579 -45409 -63402 -45721 -12870
9844a2870J5532J4956J9257j3678L89l8765J0780K9053J0594k9117N824j308P099
$$ -12870 2662 17618 36875 23197 23586 -15179 -4399 24654 35248 6131 11955 10647 17746
9831A7746L515k3355j6099K5573J8217J2621J2553l8948l7562J347J1524k2922
$$ 17746 21261 -2094 -18193 7380 25597 38218 50771 11823 -25739 -24392 -12868 -35790
9819c5790J6085K5103J7533L846k8026m8129M87L5968K6997r316K6305m321k3021
$$ -35790 -19705 5398 22931 26777 -1249 -49378 -48891 -12923 14074 4758 31063 26742 3721
9806C721k0512p00L4393J3900k9679P314N832J3766L969Q995l6876k0135J0571
$$ 3721 -16791 -17491 16902 30802 1123 8437 14269 28035 32004 40999 4123 -16012 -5441
9793e441J6387k7230p443r31L480J8256L807l445j3046P547K319j6392J9636J1373
$$ -5441 10946 -16284 -23727 -24658 -21178 -2922 885 -2560 -15606 -8059 -5740 -22132 -2496 8877
9779H877P409N168L3417l1547j2860Q680j0919k3939k295L1576k5791j0897j1671
$$ 8877 16286 21454 54871 23324 10464 19144 8225 -15714 -18009 13567 -12224 -23121 -34792
9766c4792p31J0435J2793j1400j9330K3788J1191R207o68j256J0458J2564r354
$$ -34792 -35523 -25088 -12295 -23695 -43025 -19237 -8046 1161 493 -763 9695 22259 12905
9753A2905j5493J643O456l6245q852K4453J4222j027k7398j7826K047L4762J3369
$$ 12905 -2588 -945 5511 -30734 -39586 -15133 -911 -1938 -29336 -47162 -45115 -10353 3016
9740C016o852R88l153R34M036J2345k392J3834j4796J3258O936P056j0876j9091
$$ 3016 -3836 -2848 -6001 -5067 -1031 11314 8922 22756 7960 21218 28154 35210 24334 5243
9726E243m298j5364k2048J4244J6007J59K607l638J8742L1830n904k6928k4659
$$ 5243 945 -14419 -36467 -22223 -6216 -6057 -3450 -7088 11654 43484 37580 10652 -14007
9713a4007j7743J6129N2928p842l6910p187j3778o888J7140R397J1540N542P932
$$ -14007 -31750 -15621 37307 29465 -7445 -14632 -28410 -35298 -18158 -8761 2779 8321 16253
9700A6253K8225k7122l6555J7528K3305M529k7989l0486N568J3281K0158M6126
$$ 16253 44478 17356 -19199 -1671 21634 26163 -1826 -32312 -26744 -13463 6695 52821
9688E2821L2641J7096m763o998j8678j8531j3190m797L1886L217J011L2035j5778
$$ 52821 85462 102558 97795 90797 72119 53588 40398 35601 67487 70704 71715 103750 87972
9675H7972j7728L484R51J2472K8978J2613J9793j3134n1457o660P510J4710L3587
$$ 87972 70244 73728 74679 87151 116129 128742 148535 135401 83944 77284 84794 99504 133091
9662A33091j8463l4130j6374p844n62K1895p342m4134l9337J3632K3908K3265
$$ 133091 114628 80498 64124 56280 55718 77613 70271 26137 -13200 432 24340 47605
9650D7605p179K3884l328q086N566J4535J0007j9658j1189J8317P049J6041K5466
$$ 47605 40426 64310 60982 52896 58462 72997 83004 63346 52157 70474 77523 93564 119030
9637A19030L6795k1686m1892j8264k2718l579k810J53l816L5946O993j8716k7367
$$ 119030 155825 134139 92247 73983 51265 47686 44876 45029 41213 77159 84152 65436 38069
9624C8069m0364j5198K0832K8974L0865m2118n164Q038l2621j0787J9473m958
$$ 38069 -2295 -17493 3339 32313 63178 21060 15896 23934 -8687 -19474 -1 -4959
9612d959J1697N665n333P931N910J6875Q187j9007k8564L397K4350J3909K8740
$$ -4959 6738 12403 7070 15001 20911 37786 45973 26966 -1598 1799 26149 40058 68798
9599F8798l2408j4272J7448K1088L730j2362k0047k7258R00O867K5290j1544n0089
$$ 68798 36390 22118 39566 60654 64384 52022 31975 4717 5617 12484 37774 26230 -23859
9586b3859k198L3373J557N832K3089j3645l9014k5553M475K1218P098J807L2011
$$ -23859 -26057 7316 8873 14705 37794 24149 -14865 -40418 -35943 -14725 -7627 -5820 26191
9573B6191j2219j9862J7583J6171J6531j3981l65J3835K544m1837k7243M629j0895
$$ 26191 13972 -5890 11693 27864 44395 30414 30049 43884 46428 4591 -22652 -18023 -28918
9560b8918J1337q669j1025J1191k801K782L274J3900O092K1713N67M2799J2631
$$ -28918 -17581 -26250 -37275 -26084 -28885 -26103 -22829 -8929 -2837 18876 19443 62242 74873
9547G4873j5256k0850k9891n044J7201o516j0102n840p723k1785p112r150J1283
$$ 74873 59617 38767 8876 3832 21033 14517 4415 -1425 -9148 -30933 -38045 -47195 -35912
9534c5912N431p004K763K0003R868p964n291r317J6175J8112p807J2651n340j5791
$$ -35912 -30481 -37485 -34722 -14719 -4851 -12815 -18106 -27423 -11248 6864 -943 11708 6368 -9423
9520i423O233R338P725q77K520K558J6312N587j5809j0903k0209J3766J5527j3313
$$ -9423 -3190 6148 13873 12996 15516 18074 34386 39973 24164 13261 -6948 6818 22345 9032
9506I032k4124k3142K1408M4994K8736o689r354q185j2652r387J6131J7217L201
$$ 9032 -15092 -38234 -16826 28168 56904 50215 40861 32676 20024 10637 26768 43985 47186
9493D7186k7702n8313L377K6677J953L113J2763J5207j885k7310l686J3475j7657
$$ 47186 19484 -38829 -35452 -8775 -6822 -3709 9054 24261 22376 -4934 -8620 4855 -12802
9480a2802j6117L599K0124l0951q836J4288Q255J9306j3178n580K289j6568J684
$$ -12802 -28919 -25320 -5196 -36147 -44983 -30695 -22440 -3134 -16312 -21892 -19603 -36171 -34487
9467c4487K8007l0n278m660k1212K524M050j1120L1815k120j3847j3026j5273
$$ -34487 -6480 -6510 -11788 -16448 -37660 -35136 -31086 -42206 -10391 -12511 -26358 -39384 -54657
9454e4657j990J3893K2099o69J7488M24Q393N991J618K5354K23j4614M307j9066
$$ -54657 -56647 -42754 -20655 -21324 -3836 -3412 4981 10972 12590 37944 38167 23553 27860 8794
9440H794N273Q441lj4188J6135j7455r585O112j147n021P066J0824J1060j7973
$$ 8794 14067 22508 22505 8317 24452 6997 -2588 3524 2377 -2644 4422 15246 26306 8333
9426H333j1961O610O36q590Q736L667j6803p29P997J1762K1786L973J1900k6553
$$ 8333 -3628 2982 3618 -4972 3764 7431 -9372 -10101 -2104 9658 31444 35417 47317 20764
9412B0764m0497K0267K7888j7390j2476l543L814J1708K643r499q222j886k3111
$$ 20764 -19733 534 28422 11032 -1444 -4987 -1173 10535 13178 3679 -4543 -6429 -29540
9399b9540j88R389K9900J257P158j2038l3718p045M951p840r568L6826k554O494
$$ -29540 -29728 -20339 9561 10818 17976 5938 -27780 -34825 -29874 -37714 -47282 -10456 -13010 -6516
9385f516K3152J72M894J5148O214j4585O440p99J1516j8145j5461L51k0550l0460
$$ -6516 16636 16808 21702 36850 43064 28479 34919 34120 45636 27491 12030 12381 -8169 -38629
9371c8629R012J7496k4453k298O512k6160j8197K263J0310K2474L1744L3659N294
$$ -38629 -29617 -12121 -36574 -38872 -32360 -58520 -76717 -74454 -64144 -41670 -9926 23733 29027
9358B9027k4037k1986o074j2566k1082K3009J4819j3264k207J2828K5801j6521
$$ 29027 4990 -16996 -23070 -35636 -56718 -33709 -18890 -32154 -34361 -21533 4268 -12253
9346a2253k1008j2482N358K9134j9688p570j3323N69J4408M2799q224o851P064
$$ -12253 -33261 -45743 -40385 -11251 -30939 -38509 -51832 -51263 -36855 5944 -2280 -9131 -2067
9333b067J5016p266j3399k278K5816J0650l0718k0804J0389L0275K0131l6514
$$ -2067 12949 5683 -7716 -9994 15822 26472 -4246 -25050 -14661 15614 35745 -769
9321g69M359j39j7327J0510j6781K9782K3561m683n189j7225N854k19j6615k4065
$$ -769 3590 3451 -13876 -3366 -20147 9635 33196 28513 23324 6099 11953 11734 -4881 -28946
9307b8946l206P530L1641Q943p847j6653j3718j2088R676n601J0001J1911L766
$$ -28946 -32152 -24622 7019 15962 8115 -8538 -22256 -34344 -24668 -30269 -20268 -8357 -4591
9294d591M039J4386K4658j566o076j5197j5063K684n122l7527k2479J372K1951
$$ -4591 -552 13834 38492 36926 30850 15653 590 3274 -1848 -39375 -61854 -60482 -38531
9281c8531K3317R3L599K3874o349P041J742k2585k1591K3898J4011L766q890k8856
$$ -38531 -15214 -15121 -11522 12352 6003 13044 14786 -7799 -29390 -5492 8519 12285 3395 -25461
9267b5461m162n542J2543M439o892J1093J1032J3614K2624j0938l564K932q856
$$ -25461 -29623 -35165 -22622 -18183 -25075 -13982 -2950 10664 33288 22350 18786 21718 12862
9254A2862k4351L212J9443J3859j1173j0687j2965M590K2042j4577k2909m626
$$ 12862 -11489 -8277 11166 25025 13852 3165 -9800 -5210 16832 2255 -20654 -25280
9242b5280J2547L690P385j6779k137j5672M508J668L209q721j3209K6651P154
$$ -25280 -12733 -9043 -1658 -18437 -20574 -36246 -31738 -30070 -26861 -35582 -48791 -22140 -14986
9229a4986K2918J2832j8722O505J7464J2301j0347j1798L84p593k0821J3313M766
$$ -14986 7932 20764 2042 8547 26011 38312 27965 16167 16551 8958 -11863 1450 6216
9216F216M407R908j3172k9994m181N13O500J3884Q319J525j3778o161J3692p860
$$ 6216 10623 20531 7359 -22635 -26816 -26303 -19803 -5919 2400 3925 -9853 -16014 -2322 -10182
9202a0182q800J3339K2005J86j0444j2306k3623o85k1097R380K3633K92O84J029
$$ -10182 -18982 -5643 16362 16548 6104 -6202 -29825 -30510 -51607 -42227 -18594 -18302 -17618 -16589
9188a6589K9868k4814o935J6992J2062J8232l88J989J9240R537j4233j3934L510
$$ -16589 13279 -11535 -18470 -1478 10584 28816 28428 30417 49657 59194 44961 31027 34537
9175C4537N806J395q0k3610k510k13r023p088j6198p640k875J6920l711m100j4802
$$ 34537 40343 41738 41658 18048 15538 15325 6302 -786 -16984 -24624 -27499 -10579 -14290 -18390 -33192
9160c3192P582K0045r396K282K9987J6949r266k5290j8385m466J5894j5465J0860
$$ -33192 -25610 -5565 -14961 -12679 17308 34257 24991 -299 -18684 -23150 -7256 -22721 -11861
9147a1861M3367Q648M1k0903j3680Q700J8128K1958R18j1905Q833j9308k5598
$$ -11861 31506 40154 40195 19292 5612 14312 32440 54398 55316 43411 52244 32936 7338
9134G338L391K9333K0917k6609k8026Q903K1825L808N59J0188j9553p355m606
$$ 7338 10729 40062 60979 34370 6344 15247 37072 40880 41439 51627 32074 24719 20113
9121B0113J0689n012J9433j1585L06l449M80O706J9960j7625l0434j4026J4624
$$ 20113 30802 25790 45223 33638 33944 30495 30975 37681 57641 40016 9582 -4444 10180
9108A0180j5532K212L5264K9861l403l4192l9424L3034L3723o593k5922J9361
$$ 10180 -5352 -3140 32124 61985 58582 24390 -15034 18000 51723 45130 19208 38569
9096C8569L2202J2198J4122j1145r040p41o541J5227L4800j1685J73N379k5565
$$ 38569 70771 82969 97091 85946 76906 76165 69624 84851 119651 107966 108139 113518 87953
9083H7953m4799l7005J945M7805j1098l5411p437J9157K4736J5658j9732j1561
$$ 87953 43154 6149 8094 55899 44801 9390 1953 21110 45846 61504 41772 30211
9071C0211j4040P666J9592j856j5326J0086m985j4599K3709J4939j074q628j9948
$$ 30211 16171 23837 43429 41573 26247 36333 31348 16749 40458 55397 54323 45695 25747
9058B5747j028j5037J5558M1764J5674P998j3731j5296k048K5594L486k424j5952
$$ 25747 24719 9682 25240 67004 82678 90676 76945 61649 59601 85195 88681 86257 70305
9045G0305j569k465p341k4245j6308j3541r605J4958L2862J44k1833K2628O492
$$ 70305 68736 66271 58930 34685 18377 4836 -4769 10189 43051 43195 21362 43990 50482
9032E0482j3446q321o895J7878L5596N326l3852K737J8498n547r109K5444R313
$$ 50482 37036 28715 21820 39698 75294 80620 46768 49505 68003 62456 53347 78791 88104
9019H8104j4513j9622J2674K2411m006j7757m927o647K007j7971k730K0623l1
$$ 88104 73591 53969 66643 89054 85048 67291 62364 55717 57724 39753 37023 57646 57615
9006E7615k4520J1570J4856r451l4074K0056M6799q157k0701O704j2517k0561
$$ 57615 33095 44665 59521 50070 15996 36052 82851 74694 53993 60697 48180 27619
8994B7619L467J8329L759J868j7814k3817p344L7775J8908m871P277k45K9776
$$ 27619 31086 49415 53174 55042 37228 13411 6067 43842 62750 57879 65156 64911 94687
8981I4687j1805o295P737N916P011o432j5093j5324J7911j9915j0919o305k266
$$ 94687 82882 76587 84324 90240 97251 90819 75726 60402 78313 58398 47479 41174 38908
8968C8908q420J5115K4540K0117J2344J2032j5697j0229L33j2100o372L476m142
$$ 38908 30488 45603 70143 90260 102604 114636 98939 88710 89043 76943 70571 74047 69905
8955F9905j7290J819Q154K7063K1402r803J4655J7154K680k267j9213R863O130
$$ 69905 52615 54434 62588 89651 111053 101250 115905 133059 135739 133472 114259 124122 130252
8942A30252k0963J2297J1123j3788l4175m034K8904p232j9134k4157J8728R518
$$ 130252 109289 121586 132709 118921 84746 80712 109616 102384 83250 59093 77821 87339
8930H7339j4909q279q732P707R100P169n298K605L461K1257K3402j6217j4713
$$ 87339 72430 64151 55419 63126 72226 79395 74097 76702 80163 101420 124822 108605 93892
8917I3892J4254J0115k0465k7856R387j8875Q897Q659J2332L0915J7851j6616
$$ 93892 108146 118261 97796 69940 79327 60452 69349 78008 90340 121255 139106 122490
8905A22490j0730p372N052p327o372k933m856K5602J5151r152J1734j0242k9335
$$ 122490 111760 104388 109440 102113 95741 92808 87952 113554 128705 119553 131287 121045 91710
8892I1710j0789J3859j6152j2800o998J1230J6526M123j9957k1295K640n31M946
$$ 91710 80921 94780 78628 65828 58830 70060 86586 90709 70752 49457 52097 51566 56512
8879E6512J9931P638K745k1616K6290J1912j8751m467K130p30K776R037j7542
$$ 56512 76443 84081 86826 65210 91500 103412 84661 80194 82324 81594 84370 93407 75865
8866G5865p628j3453n366L831J1519P090K692m345K0583J1024j480j7730l1914
$$ 75865 68237 54784 49418 53249 64768 71858 74550 70205 90788 101812 100332 82602 50688
8853E0688j8341K460J9029J6476j0346K8440R382l343J2709J592k6808j284j185
$$ 50688 32347 34807 53836 70312 59966 88406 97788 94445 107154 108746 81938 80654 79469
8840G9469K850j4144k589K0360K4294K364J0019j0457k9992l4280o385K5327K2047
$$ 79469 82319 68175 65586 85946 110240 112604 122623 112166 82174 47894 41509 66836 88883
8827H8883j685J4261j9596r20J9331K209K2735J8755k8804k3015k4527N23J7115
$$ 88883 87198 101459 81863 80943 100274 102483 125218 143973 115169 92154 67627 68150 85265
8814H5265j2140j4555J2573J1327l070J3735P801N076j7709p891l280J2405O518
$$ 85265 73125 58570 71143 82470 79400 93135 100936 106012 88303 80412 77132 89537 96055
8801I6055J0893j0964l2885o856J4306j850J0070R987M3896J2391j0950o485j5290
$$ 96055 106948 95984 63099 56243 70549 68699 78769 88756 132652 145043 134093 127608 112318
8788A12318Q549K2742j7300k5137j4476K2526L0437m90q453R705k069m458L9451
$$ 112318 120867 143609 126309 101172 86696 109222 139659 139169 130716 140421 138352 133894 173345
8775A73345J6457J1018K285Q358J643n747j1166j8618L4805R133j7310j222j2096
$$ 173345 189802 200820 203105 211463 213106 207359 196193 177575 212380 221513 204203 202981 190885
8762A90885k5208N273L8726K6669N061j4086k8732l211L5074J3682j6101k7275
$$ 190885 165677 170950 209676 236345 241406 227320 198588 195377 230451 244133 228032 200757
8750B00757K1671K9821r960q16k707l072j3108m071J7553K1038K1018J9484K2430
$$ 200757 222428 252249 242289 241473 238766 235694 222586 218515 236068 257106 278124 297608 320038
8737C20038J4739j5326j485Q884j4953j6758j3610K7927R174j7645L5246J5673
$$ 320038 334777 319451 317966 326850 311897 295139 281529 309456 318630 300985 336231 351904
8725C51904O554J9076L6911J9691j2715k73L0207J776j4805m778N162j5498K0786
$$ 351904 358458 377534 414445 434136 421421 421148 451355 453131 438326 433548 438710 423212 443998
8712D43998J1540j4015j625l2276k7325K2548o864l9788M191M3256J9425l963
$$ 443998 455538 441523 439898 407622 380297 402845 395981 356193 360384 403640 423065 419102
8700D19102J184P270N329j6664j2341j032j272j7337K070K8655J1429K050J2898
$$ 419102 420286 427556 432885 416221 403880 402848 401576 384239 386309 414964 426393 428443 441341
8687D41341R401J4932N179K2629J4426K9159J6155L4077M2740K1643L060l349
$$ 441341 450742 465674 470853 493482 507908 537067 553222 587299 630039 651682 654742 651393
8675F51393L2476L7969J049k027n907P130J3510M3278K0345K993k063k9611J038
$$ 651393 683869 721838 722887 720860 714953 722083 735593 778871 799216 802209 800146 770535 771573
8662G71573j1549k3078m280J298m7159j1425r89p112j467O713k2822m376o85J8314
$$ 771573 760024 736946 732666 733964 686805 675380 674391 667279 665812 672525 649703 645327 644642 662956
8648F62956J2541m1579j6046r51j7217l2254j3691K1859L774l149L7192l447m7346
$$ 662956 675497 633918 617872 616921 599704 567450 553759 575618 579392 576243 613435 609988 562642
8635E62642q115N323j9065p368j8211j9835J871K2099n617l1118k2157r467r622
$$ 562642 554527 559850 540785 533417 515206 495371 497242 519341 513724 482606 460449 450982 441360
8622D41360k4570M365r83l8385j0901P151K313L1271k5862N996j0380K311j3246
$$ 441360 416790 421155 420172 381787 370886 378037 380350 411621 385759 391755 381375 383686 370440
8609C70440r288J8272L9923K0864L0069M0489M8304O9670N1780R0553N6952K6899
$$ 370440 361152 379424 419347 440211 470280 510769 559073 628743 680523 771076 828028 854927
8597H54927n932K7722N411J6577L3514J6979J9294j9391j5965J5766O463K2419
$$ 854927 848995 876717 882128 898705 932219 949198 968492 949101 933136 948902 955365 977784
8585I77784J4799J7703M410K4611O2196L1715J0718l1932j2466L3569K7177J8196
$$ 977784 992583 1010286 1014696 1039307 1101503 1133218 1143936 1112004 1099538 1133107 1160284 1178480
8573A178480L6099J872J8897J3740k0605j964J7259J9417J1553J1463J1529Q464
$$ 1178480 1214579 1216451 1235348 1249088 1228483 1226519 1243778 1263195 1274748 1286211 1297740 1306204
8561A306204L0009L8553L8898K8745R444N0712J073J2574L9976M4547N9888O2966
$$ 1306204 1336213 1374766 1413664 1442409 1451853 1502565 1503638 1516212 1556188 1600735 1660623 1723589
8549A723589J18914J09728O7523J15266J59242J57970J40378J36149P3471O4326
$$ 1723589 1842503 1952231 2019754 2135020 2294262 2452232 2592610 2728759 2802230 2866556
8539B866556P1273M8601M1868J3391k5070l4404J4799L4862J3626K8143K2035
$$ 2866556 2937829 2986430 3028298 3041689 3016619 2982215 2997014 3031876 3045502 3073645 3095680
8528C095680K0147L1810L2013N5087M3509K9516K3425L2952J3125J5266L1288
$$ 3095680 3115827 3147637 3179650 3234737 3278246 3307762 3331187 3364139 3377264 3392530 3423818
8517C423818L4799K9962K6081O7071M8902K858K5316L8990M1121N7144J04181
$$ 3423818 3458617 3488579 3514660 3581731 3630633 3633491 3658807 3697797 3738918 3796062 3900243
8506C900243Q4606O0142L1212J02373Q4802J15900J55836J15853J19277J22217
$$ 3900243 3984849 4044991 4076203 4178576 4263378 4379278 4535114 4650967 4770244 4892461
8496D892461J40744J51501J34161R7146R0024J02290J22511J31798J64112J39763
$$ 4892461 5033205 5184706 5318867 5416013 5506037 5608327 5730838 5862636 6026748 6166511
8486F166511J34820J57334J66851J99046K03261J96154K18105K09811K24759K48515
$$ 6166511 6301331 6458665 6625516 6824562 7027823 7223977 7442082 7651893 7876652 8125167
8476H125167K48779K38116K48737K54461K58653K61606K67345K95566L25122L84783
$$ 8125167 8373946 8612062 8860799 9115260 9373913 9635519 9902864 10198430 10523552 10908335
8466A0908335M19989M41684M84716N38958N61235N76706O30070O59342O76678
$$ 10908335 11328324 11770008 12254724 12793682 13354917 13931623 14561693 15221035 15897713
8457A5897713P08833P47250Q33233R22770R96184J046557J080839J178746J308892
$$ 15897713 16606546 17353796 18187029 19109799 20105983 21152540 22233379 23412125 24721017
8448B4721017J441178J554411J688018J800914K003525K242504K437880K701261
$$ 24721017 26162195 27716606 29404624 31205538 33209063 35451567 37889447 40590708
8440D0590708L027798L331077L716546M155697M633484N195869N842622O552535
$$ 40590708 43618506 46949583 50666129 54821826 59455310 64651179 70493801 77046336
8432G7046336P420496Q405404R558066J0932305J2544645J4413520J6526034J8951425
$$ 77046336 84466832 92872236 102430302 113362607 125907252 140320772 156846806 175798231
8424A75798231K1679597K4601241K7626268L0400030L2442447L3157402L1860935
$$ 175798231 197477828 222079069 249705337 280105367 312547814 345705216 377566151
8417C77566151K7960884K1255810J2299737K004471q253106j7181255k3861674
$$ 377566151 405527035 426782845 439082582 441087053 432833947 415652692 391791018
8410C91791018k7844609k9277294k8673596k6866577k4420078k1840517j9345806
$$ 391791018 363946409 334669115 305995519 279128942 254708864 232868347 213522541
8403B13522541j7153729j5246857j3624293j2254277j1045942r966527r020211
$$ 213522541 196368812 181121955 167497662 155243385 144197443 134230916 125210705
8396A25210705q179524p441592o750782o117208n607761n141879m665645m288059
$$ 125210705 117031181 109589589 102838807 96721599 91113838 85971959 81306314 77018255
8388G7018255l927289l619854l366100l097119k871555k714323k564058k372407
$$ 77018255 73090966 69471112 66105012 63007893 60136338 57422015 54857957 52485550
8380E2485550k204875k112620j980941j843091j760354j680860j616321j514453
$$ 52485550 50280675 48168055 46187114 44344023 42583669 40902809 39286488 37772035
8372C7772035j431948j318505j235146j212930j153446j055802j017603r50184
$$ 37772035 36340087 35021582 33786436 32573506 31420060 30364258 29346655 28396471
8364B8396471r06369q70550q59543p88815p25253p05648p15715o88970o61702
$$ 28396471 27490102 26619552 25760009 24971194 24245941 23540293 22824578 22135608 21473906
8355B1473906o19693o00848o14973n68515n42273n02589m83475m61297m57568
$$ 21473906 20854213 20253365 19638392 19069877 18527604 18025015 17541540 17080243 16622675
8346A6622675m63449m61383m25783m35669m00360l94377l40470l29100l34228
$$ 16622675 16159226 15697843 15272060 14836391 14436031 14041654 13701184 13372084 13037856
8337A3037856l27158l55695l19263k69571k65129k93079k94572k74676k33283
$$ 13037856 12710698 12355003 12035740 11766169 11501040 11207961 10913389 10638713 10405430
8328A0405430k58869k34669k21402k08076k29392k45182k81080k45329k43655
$$ 10405430 10146561 9911892 9690490 9482414 9253022 9007840 8726760 8481431 8237776
8319H237776k63015k63595k49257k67186k61807k23448k21606k39117k11888k15969
$$ 8237776 7974761 7711166 7461909 7194723 6932916 6709468 6487862 6248745 6036857 5820888
8309E820888k03356k15171k13013j93473j68246j60292j66803j82752j56703j07753
$$ 5820888 5617532 5402361 5189348 4995875 4827629 4667337 4500534 4317782 4161079 4053326
8299D053326j23232j65875j51600r5219q7292p9153r7032o6583m3380l0900l0852
$$ 4053326 3930094 3764219 3612619 3517400 3430108 3350955 3253923 3187340 3143960 3113060 3082208
8288C082208j7566j7361p429j3726k7513l1106m4317n689J2072j7080l2059j6205
$$ 3082208 3064642 3047281 3039852 3026126 2998613 2967507 2923190 2917501 2929573 2912493 2880434 2864229
8276B864229O779k426l407m2265l1549O400L084K5865O5390J0257O345k1415o232
$$ 2864229 2871008 2868582 2865175 2822910 2791361 2797761 2800845 2826710 2892100 2902357 2908702 2887287 2881055
8263B881055m3998q9644j03064q5557n2337r0828q2139m3326l2615l0256l3211
$$ 2881055 2837057 2747413 2644349 2558792 2506455 2415627 2333488 2290162 2257547 2227291 2194080
8252B194080l4258k2420l2307J0956l5737n0563l6116J5826q437j9765k3640j5207
$$ 2194080 2159822 2137402 2105095 2116051 2080314 2029751 1993635 2009461 2001024 1981259 1957619 1942412
8240A942412l1720l3305j8033O334l7581n537L025j4632m0622J2270K8859M6253
$$ 1942412 1910692 1877387 1859354 1865688 1828107 1822570 1825595 1810963 1770341 1782611 1811470 1857723
8228A857723Q0339O1597K0689K3877M6382J0715J7567K7238j7568j3283j2030
$$ 1857723 1938062 1999659 2020348 2044225 2090607 2101322 2118889 2146127 2128559 2115276 2103246
8217B103246n1650o8137q5421n6327l7119l3672j2163j5584j0538j0577j9149
$$ 2103246 2051596 1983459 1898038 1841711 1804592 1770920 1758757 1743173 1732635 1722058 1702909
8206A702909j8487m7449l6215l0577k5077j7291j5526j6570j0459J827N815n559
$$ 1702909 1684422 1636973 1600758 1570181 1545104 1527813 1512287 1495717 1485258 1487085 1492900 1487341
8194A487341p422l2714m9988l573N495j8142q882m0179k5521l622j7983m6155
$$ 1487341 1479919 1447205 1397217 1393644 1399139 1380997 1372115 1331936 1306415 1302793 1284810 1238655
8182A238655k3798l1108l4678k5586J1124K680k7774k0003j9038k8553k0121j6421
$$ 1238655 1214857 1183749 1149071 1123485 1134609 1137289 1109515 1089512 1070474 1041921 1021800 1005379
8170A005379k9867k8968l3788p800m405l9697k5029Q697M635q558j4562k2495
$$ 1005379 975512 946544 912756 904956 900551 860854 835825 844522 849157 840599 826037 803542
8158H03542k8973j3192k854J250M440j0195N541j8598j4362j2016J1072L6497
$$ 803542 774569 761377 758523 759773 764213 754018 759559 740961 726599 714583 725655 762152
8146G62152k841K216J5528J2271j6066m0074m9565j9533K0747O225K449k3627
$$ 762152 759311 761527 777055 789326 773260 733186 683621 664088 684835 691060 693509 669882
8134F69882Q79j0269j1909j0279j6120k4886q001r073J1101n386j2128n031j6455
$$ 669882 670761 660492 648583 638304 622184 597298 589297 580224 591325 585939 573811 568780 552325
8121E52325k9085J3675k808K77K0783L3612J443p347j4809J107j3793l7120j7617
$$ 552325 523240 536915 534107 534384 555167 588779 590222 582875 568066 569173 555380 518260 500643
8108E00643l082k836K974n171k8645j8777K5000J2961J62k2489l2207j48o372
$$ 500643 497561 494725 497699 492528 463883 445106 470106 483067 483229 460740 428533 428385 422013
8095D22013R178N596j5104Q297M11R661J4002L472k1834J3638m255q433p519n59
$$ 422013 431191 436787 421683 429980 430391 440052 454054 457526 435692 449330 445075 436642 429123 428564
8081D28564J0391j3550j9528M385o080K529l7296j4972R773L1030J6145m606q483
$$ 428564 438955 425405 405877 410262 404182 406711 369415 354443 364216 395246 411391 406785 398302
8068C98302K203j5204k7039j3719M054J8959J3102O285K0246n097q6J6184k4991
$$ 398302 400505 385301 358262 344543 348597 367556 380658 386943 407189 402092 402006 418190 393199
8055C93199j6242L945L905j5251o818K0637K8408p081J0469p458K667N79l456
$$ 393199 376957 380902 384807 369556 362738 383375 411783 404702 415171 407713 410380 410959 407503
8042D07503R487J7967J0104k0669l5064m885r08p258L9795J8884Q62j2168j0729
$$ 407503 416990 434957 445061 424392 389328 384443 383535 376277 416072 434956 435818 423650 412921
8029D12921j1439m582K679J2459K1891K119j3528K457L3549p0K0670O669m532
$$ 412921 401482 396900 399579 412038 433929 436048 422520 424977 458526 458456 479126 485795 481263
8016D81263M7757L2359N0254P9362K3473n41J057l8175k3047j7230l2254k5859
$$ 481263 529020 561379 611633 690995 714468 713927 714984 676809 653762 636532 604278 578419
8004E78419k2161l4682l1810m4361m0182k6278J9166K2036J2821l042m0431k9461
$$ 578419 556258 521576 489766 445405 405223 378945 398111 420147 432968 429926 389495 360034
7992C60034k026J9815K8532K6673N385n7532k2333L2092K9820n915j4384J953
$$ 360034 358008 377823 406355 433028 438413 380881 358548 390640 420460 414545 400161 402114
7980D02114R668J0345k020l722N1Q335J4544M7704M1015L1085K7288o143K9234
$$ 402114 411782 422127 420107 416385 416436 424771 439315 487019 528034 559119 586407 580264 609498
7967F09498O121k5112l5607l9146m2855k599l6991m1336l8954j16j8943J1282
$$ 609498 615619 590507 554900 515754 472899 470300 433309 391973 353019 352903 333960 345242
7955C45242j6198j3130k2577k9061P513J3260j0565p013O883M158k541N024j3914
$$ 345242 329044 315914 293337 264276 271789 285049 274484 267471 274354 278512 275971 280995 267081
7942B67081o79P168j8319k1029J314N646k7198j5674k631K9815K1698k073P381
$$ 267081 266402 273570 255251 234222 235536 241182 213984 198310 195679 225494 247192 245119 252500
7929B52500j1361j2364j4493m130J4651J8179K2665L958l38j5583R004P96j1434
$$ 252500 241139 228775 214282 210152 224803 242982 265647 269605 269267 253684 262688 263484 252050
7916B52050j8219j2441j771R658M69k049J8634J6025J4096j2064j9891n709j3398
$$ 252050 233831 221390 219619 229277 229746 227697 246331 262356 276452 264388 244497 238788 225390
7903B25390k2952m684j5647m748J1543J0164L933L91k639J9884P234J5795J9634
$$ 225390 202438 197754 182107 177359 188902 199066 202999 203390 200751 220635 227869 243664 263298
7890B63298j0687k6950m2398K7780Q995l7468k636J4317j4012j3030p704K6022
$$ 263298 252611 225661 183263 211043 220038 182570 179934 194251 180239 167209 159505 185527
7878A85527K1500k4952k917j5672m979J0858J9729L59N828J310k129k337k158
$$ 185527 207027 182075 179158 163486 158507 169365 189094 189453 195281 196591 194462 192125 189967
7865A89967J9597N869P827O202j1173j6024n177M47r370l5166j5085N193o292
$$ 189967 209564 215433 223260 229462 218289 202265 197088 197535 188165 152999 137914 143107 136815
7852A36815j8260L676Q862J0216J0132M9260j5308O24J0579j1818l522k058K528
$$ 136815 118555 122231 131093 141309 151441 200701 185393 186017 196596 184778 181256 179198 181726
7839A81726K1321n550j0724j5045J853O32p134n400j6998r813O32m562M116R042
$$ 181726 203047 197497 186773 171728 173581 174213 167079 161679 144681 134868 135500 130938 135054 144096
7825A44096K035J0092K322K8344j825Q377j8356j6664j6857j542m59p624P042
$$ 144096 146131 156223 158545 186889 185064 193441 175085 158421 141564 140022 139563 131939 138981
7812A38981K5772K2360Q601P308M395j6382k0721l6469R610J6709J0878l0398
$$ 138981 164753 187113 195714 203022 207417 191035 170314 133845 143455 160164 171042 140644
7800A40644j7063K0426j2299n6712k65K6441L8234J7615k6883j9457J3845n500
$$ 140644 123581 144007 131708 74996 74731 101172 139406 157021 130138 110681 124526 119026
7788A19026m358K2990O622K2595K7976J6939j5833K4756K8197j7440l5156j3804
$$ 119026 114668 137658 144280 166875 194851 211790 195957 220713 248910 231470 196314 182510
7776A82510K2410J7802O434r254j7435j2333k3540l617j4055k0664j6569l1462
$$ 182510 204920 222722 229156 219902 202467 190134 166594 162977 148922 128258 111689 80227
7764H0227m799j2397j8079l870O609q855o908K23N4383M2685j2267n027J1947
$$ 80227 75428 63031 44952 41082 47691 38836 31928 32151 86534 129219 116952 111925 123872
7751A23872o200j8659l5609p259m920M6203K4528M3358j4374l7300n121l239p922
$$ 123872 117672 99013 63404 56145 51225 97428 121956 165314 150940 113640 108519 105280 97358
7738I7358J1358m162k586K115N569o900j2412j6029J1183j2771J6961j4635j4573
$$ 97358 108716 104554 101968 104083 109652 102752 90340 74311 85494 72723 89684 75049 60476
7725F0476K3842J4006J4291r183j287R381L5320L6269j725k4360j1611k2695k2505
$$ 60476 84318 98324 112615 103432 102145 111526 146846 183115 181390 157030 145419 122724 100219
7712A00219J1131M050j4053K6659K586J864J4959J1200k2568r406J1194n094n018
$$ 100219 111350 115400 101347 128006 130592 132456 147415 158615 136047 126641 137835 132741 127723
7699A27723j3635n121O1q743N57j2991j6049j8703q443J6599M615J508K2229Q815
$$ 127723 114088 108967 109028 100285 100842 87851 71802 53099 44656 61255 65870 67378 89607 98422
7685I8422r527o397P556k550k0829j1905L0140J2244n699j5855K0180j1133j6517
$$ 98422 88895 82498 90054 87504 66675 54770 84910 97154 91455 75600 95780 84647 68130
7672F8130J5199J7547j712j96J1605k347j1539k2786l1940J4312Q02M362r431
$$ 68130 83329 100876 99164 98968 110573 108226 96687 73901 41961 56273 57075 61437 52006
7659E2006n073q477k5307K2836L5621j2212J2187j2400J549n132j1489K0703K3426
$$ 52006 46933 38456 13149 35985 71606 59394 71581 59181 60730 55598 44109 64812 88238
7646H8238k9199k684J5001P664J3086k6j5326K2475j284j2847j9240j0625Q73
$$ 88238 59039 56355 71356 79020 92106 92080 76754 99229 97945 85098 65858 55233 56106
7633E6106j1848J832J1979L3098K1200j4839k6299J3454n232J895Q779J4385l974
$$ 56106 44258 46090 58069 91167 112367 97528 71229 84683 79451 81346 90125 104510 100536
7620A00536l1770k0251k34K7074j7225o555j4159J318Q730Q411K0327n021K8150
$$ 100536 68766 48515 48281 75355 58130 51575 37416 38734 47464 55875 76202 71181 99331
7607I9331k593j5977j453j7142j644K0948J1490p927l650J1054M748k2490j0985
$$ 99331 96738 80761 79308 62166 60522 81470 92960 85033 81383 92437 97185 74695 63710
7594F3710r104m342K7003R886k3096k4103P601r0J5874K1053O387Q48l0799J6869
$$ 63710 54606 50264 77267 87153 64057 39954 47555 47465 63339 84392 90779 91627 60828 77697
7580G7697k464n895p281J0538r475O270k67J284L0298J4124j3801k792j5778l1460
$$ 77697 75233 69338 62057 72595 63120 69390 69123 70407 100705 114829 101028 98236 82458 50998
7566E0998J2756N794k7958P477J372M956n546o718K119J6684o345P421q050r112
$$ 50998 63754 69548 41590 49067 50439 55395 49849 43131 45250 61934 55589 63010 54960 45848
7552D5848J1259r116K178K4461J7326M49j9491k2103j0094L0411N362j5686K2348
$$ 45848 57107 47991 50169 74630 91956 92405 72914 50811 40717 71128 76490 60804 83152
7539H3152J8363j1825j6158k9359q647j1682J248K3316j0152L488P180r693R440
$$ 83152 101515 89690 73532 44173 35526 23844 25092 48408 38256 41744 48924 39231 48671
7526D8671J1546j4459p448J7096J8643o185q002j4116l1338j4157n935J9952L0426
$$ 48671 60217 45758 38310 55406 74049 67864 59862 45746 14408 251 -5684 14268 44694
7513D4694K7902j7515k8899k9752J0541M0482K5477j6819J6670M019j1730M277
$$ 44694 72596 55081 26182 -3570 6971 47453 72930 56111 72781 76800 65070 69347
7501F9347l704j319J289O389j8492l5590R612J4677k66K125j769J850K3399P56
$$ 69347 65643 64324 65613 72002 53510 17920 27532 42209 41943 44068 42299 44149 67548 68304
7487F8304K203Q41J105j5995M412k1770k3583J737L5043K344P094N547Q059n587
$$ 68304 70507 71348 72453 56458 60870 39100 15517 17254 52297 54641 61735 67282 75341 69754
7473F9754m044J4932J2101J5989P69k4824l6443m559m671k445K6861L908l700
$$ 69754 65710 80642 92743 108732 109501 84677 48234 43675 39004 36559 63420 67328 63628
7460F3628J7719P861j1409k8663j7016P005L019J5020j7896j6596n83j4794j7066
$$ 63628 81347 89208 77799 49136 32120 39125 42144 57164 39268 22672 22089 7295 -9771
7447i771R93M868L9819O707j5067L058o323N834M881J0662K5052p411k9321L792
$$ -9771 -8778 -3910 35909 42616 27549 30607 24284 30118 34999 45661 70713 63302 33981 37773
7433C7773l221k682o378l354N575J215K6783n588j6642L5516J0201p676j1296
$$ 37773 34552 31870 25492 22138 27713 28928 55711 50123 33481 68997 79198 71522 60226
7420F0226k8082j2803K4848J8322O638k853k3805j4241N720J7811M878m6929r668
$$ 60226 32144 19341 44189 62511 69149 66296 42491 28250 33970 51781 56659 9730 62
7407F2L722J2361R847J1860j936J3931J4037O828l485J487j964J948M831k3630
$$ 62 3784 16145 25992 37852 35916 49847 63884 70712 67227 68714 66750 68698 73529 49899
7393D9899j411K1000J0230J3201l2623Q652J3530J3855r533j6375r333O303K5480
$$ 49899 48488 69488 79718 92919 60296 68948 82478 96333 86800 70425 61092 67395 92875
7380I2875K476m5428j7023j2054k3956p71j0095j3497J3280J3715J6811m894J0464
$$ 92875 95351 49923 32900 20846 -3110 -3881 -13976 -27473 -14193 -478 16333 11439 21903
7367B1903o278L3363J5765R241j8643J3744m120k556j1457k4991m115L1387K3827
$$ 21903 15625 48988 64753 73994 55351 69095 64975 62419 50962 25971 21856 53243 77070
7354G7070l804l8405p960L9275K852k3241j5443m444J9724J9176j5258n677k0114
$$ 77070 73266 34861 26901 66176 69028 45787 30344 25900 45624 64800 49542 43865 23751
7341B3751n872j2824K294J465n805O774n948k5869K5268J3120J066K071J9829
$$ 23751 17879 5055 7349 8814 3009 9783 3835 -22034 3234 16354 17420 19491 39320
7328C9320r719j9640P609J4927N146k2358k3921N047n357j1052J6089k969K3285
$$ 39320 29601 9961 17570 32497 37643 15285 -8636 -3589 -8946 -19998 -3909 -6878 16407
7315A6407J1924O343J4033l477M258j2861K396j8313l7162K6795L8055J1754J966
$$ 16407 28331 34674 48707 45230 49488 36627 39023 20710 -16452 10343 48398 60152 62118
7302F2118m531p837k1157j8795p820j2479j6980M0828K9946j4602Q992j284J1710
$$ 62118 57587 49750 28593 9798 1978 -10501 -27481 13347 43293 28691 37683 36399 48109
7289D8109J3417J887J314k8786j0105L079m747K8949k0923j6776o576m586K0220
$$ 48109 61526 63413 64727 35941 25836 28915 24168 53117 32194 15418 8842 4256 24476
7276B4476K7564N461k8556M1936j4469k9482R777J5455L097J2598l4483k3894
$$ 24476 52040 57501 28945 70881 56412 26930 36707 52162 55259 67857 33374 9480
7264I480j71R046N461J0933O341k3342k561J1843j6936j0370J5585j5193j3923
$$ 9480 9309 18355 23816 34749 41090 17748 15187 27030 10094 -276 15309 116 -13807
7251a3807p069K2619M702J0227K07J5290j197O121J5769j7939o247k3323P063
$$ -13807 -20876 1743 6445 16672 16879 32169 30972 37093 52862 34923 28676 5353 12416
7238A2416k150J1690O752l5974j2382K9673R468j768J3621N993p046p814P717
$$ 12416 10266 21956 28708 -7266 -19648 10025 19493 17725 31346 37339 30293 22479 30196
7225C0196l188R055j3878n592Q73J2526J6344R17J6942j3320l0393K836q679k0645
$$ 30196 27008 36063 22185 16593 17466 29992 46336 47253 64195 50875 20482 23318 14639 -6006
7211f006K4464J1954Q096K360K463j4025J4655K8989j7385r73k2179l1226k2161
$$ -6006 18458 30412 38508 40868 43331 29306 43961 72950 55565 54592 32413 1187 -20974
7198b0974q51L6208K1240p345K434J8887j4563m860K8776J5101J454r740j4489
$$ -20974 -21825 14383 35623 28278 30712 49599 35036 30176 58952 74053 75507 65767 51278
7185E1278M290k3429q996j0293k1820P40J8707J4495q345M576n581J4388J1554
$$ 51278 55568 32139 23143 12850 -8970 -8230 10477 24972 16627 21203 15622 30010 41564
7172D1564O421j0483j3638r755K3694m297o80K0450k1700l5008J9351K2948J3784
$$ 41564 47985 37502 23864 14109 37803 33506 32826 53276 31576 -3432 15919 38867 52651
7159E2651j0938l6768j5567M313j5900k8750K5912K8782K9181r04q015J58r969
$$ 52651 41713 4945 -10622 -6309 -22209 -50959 -25047 3735 32916 32012 23997 24155 14186
7146A4186J9970p760j4010j5864j5692J5433K1337K7970K0246N428Q575j5241
$$ 14186 34156 26396 12386 -3478 -19170 -3737 17600 45570 65816 71244 79819 64578
7134F4578j2453k1050N583m033J151j2331k1717J4746K7664k679k9735O493O064
$$ 64578 52125 31075 36658 32625 33776 21445 -272 14474 42138 39459 9724 16217 22281
7121B2281K2138k909l2028p777K6306k088K85P732K4087N817l0512n545j391K4763
$$ 22281 44419 41510 9482 1705 28011 25923 26208 33940 58027 63844 33332 27787 26396 51159
7107E1159j3847j4192k495m708p885j9400J3913j5696k6356Q549J5010q535N294
$$ 51159 37312 23120 20625 15917 8032 -11368 2545 -13151 -39507 -30958 -15948 -24483 -19189
7094a9189k419K2058j063J2320J4117R59j8646j8654L0925j1088p350L3451J2749
$$ -19189 -21608 450 -613 11707 25824 26783 8137 -10517 20408 9320 1970 35421 48170
7081D8170k0441k0218j5525J1286L9474r824j715R575k7248r670r726J4126K1156
$$ 48170 27729 7511 -8014 3272 42746 32922 31207 40782 13534 3864 -5862 8264 29420
7068B9420r797j8352P007J1628J191j426j8303o729l342L2218j915j1028j622
$$ 29420 19623 1271 8278 19906 21097 19671 1368 -5361 -8703 23515 21600 10572 8950
7055H950P271K4766J2392k698m0092K1640J8872J300j7258m9171j2132M0219J6705
$$ 8950 16221 40987 53379 50681 10589 32229 51101 52401 35143 -14028 -26160 14059 30764
7042C0764K040J926Q388O296j3143N759l3409k8229j40R154Q732K7164k4J0742
$$ 30764 32804 34730 43118 49414 36271 42030 8621 -19608 -19748 -10594 -1862 25302 25278 36020
7028C6020j7368M653O303p657K4646r911k7202J4362m777k4868L0983o1j0342
$$ 36020 18652 23305 29608 21951 46597 36686 9484 23846 19069 -5799 25184 25123 14781
7015A4781j1163k0379J1420O058J4183M228J098K8087O658k138K1518K219l1431
$$ 14781 3618 -16761 -5341 717 14900 19128 20226 48313 54971 52833 74351 76570 45139
7002D5139j8725O863j4378j5542J3805n156o45Q129R366J3058j5551J271K9834
$$ 45139 26414 33277 18899 3357 17162 12006 11361 19490 28856 41914 26363 27634 57468
6989E7468J9624j0177j4692l1608j8233K3289p453L893l5100l6551k776L8318
$$ 57468 77092 66915 52223 20615 2382 25671 18218 22111 -12989 -49540 -52316 -13998
6977a3998K1964j7291j8597R023J981k100M049J4056k873j4169J8294K3667J0359
$$ -13998 7966 -9325 -27922 -18899 -16918 -19018 -14969 -913 -3786 -17955 339 24006 34365
6964C4365k9053K9076K4438j6536l4329l1974J6450J2091P622J6173J2946J012
$$ 34365 5312 34388 58826 42290 7961 -24013 -7563 4528 12150 28323 41269 42281
6952D2281j9660l304j8r197Q019J3878k192l4264j641l97N42J249k1270j8024
$$ 42281 22621 19317 19299 10102 18121 31999 29807 -4457 -6098 -6495 -5953 -4704 -25974 -43998
6938d3998M3075J7716k1199M658J2658p981J1385N924p060j2781k344k987o19
$$ -43998 -923 16793 -4406 252 12910 4929 16314 22238 15178 2397 53 -2934 -3553
6925c553J8028J1696J0552o179n3939n729L7229n460j2501m366J6120R437M515
$$ -3553 14475 26171 36723 30544 -23395 -29124 8105 2645 -9856 -14222 1898 11335 15850
6912A5850q962O007k2317J9053J0370k3972J519L1931Q626J4908j618k0357o986
$$ 15850 6888 12895 -9422 9631 20001 -3971 -2452 29479 38105 53013 51395 31038 24052
6899B4052j1623K5007Q733l2979k11p675n228j5820M653J2265J687j4282P672
$$ 24052 12429 37436 46169 13190 12979 5304 76 -15744 -11091 1174 2861 -11421 -3749
6886c749J8209j0761l328P298J0186L2140J1839j3733J2161j8428J3671M639j0576
$$ -3749 14460 3699 371 7669 17855 49995 61834 48101 60262 41834 55505 60144 49568
6873D9568l9577l1609M0772n590k5015K634m558n281j6036J1730M5322m332j5168
$$ 49568 9991 -21618 19154 13564 -11451 -8817 -13375 -18656 -34692 -22962 22360 18028 2860
6860B860L222J5867p470k1932k50k003L137P015k7428p467J9371J9071R279l0900
$$ 2860 6082 21949 14479 -7453 -7703 -9706 -6569 446 -26982 -34449 -15078 3993 13272 -17628
6846a7628j3742K5453K5580j1121m615q028J7155J9027J77k4722R556n635j1312
$$ -17628 -31370 -5917 19663 8542 3927 -4101 13054 32081 32258 7536 17092 11457 145
6833A45m812L6678M505j4349J5809j3951r165J0008j6592j4294j867r311Q4n485
$$ 145 -4667 32011 36516 22167 37976 24025 14860 24868 8276 -6018 -7885 -17196 -17112 -22597
6819b2597J1192Q276j0081k5333J0624J8753Q675Q948j4774l3016J3178J0474
$$ -22597 -11405 -3129 -13210 -38543 -27919 -9166 -491 8457 -6317 -39333 -26155 -15681
6807a5681M418J1959m920j6142K1099K1074j3054j2969J5509K8796l5629j9519
$$ -15681 -11263 696 -4224 -20366 733 21807 8753 -4216 11293 40089 4460 -15059
6795a5059M240J0492J2784j4212q486n208Q462L6492j8766j0268j4732N870k0536
$$ -15059 -10819 -327 12457 -1755 -10241 -15449 -6987 29505 10739 471 -14261 -8391 -28927
6782b8927M599R773k1227j6874l919K9166P561L432L0317P458L854l08j0435j9907
$$ -28927 -24328 -14555 -35782 -52656 -56575 -27409 -19848 -16416 13901 21359 25213 24905 14470 -5437
6768e437J904p08j4883M282L063J4272r130J1143j536Q559k844n495m327K058
$$ -5437 -3533 -4241 -19124 -14842 -11779 2493 -6637 4506 2970 11529 8685 3190 -1137 921
6754I21R499N27m311l008j376k644L055J5088m9638K3920K8743r960j3842p109
$$ 921 10420 10947 6636 3628 2252 -392 2663 17751 -31887 -7967 20776 10816 -3026 -10135
6740a0135k8000P596K4001K3520j2024K27j949J2741j9408K940J6099P969J0761
$$ -10135 -38135 -30539 -6538 16982 4958 5185 3236 15977 -3431 -491 15608 23577 34338
6727C4338l8581j856K2350P262J0132m0860j6169M201J6115m554m997L854j4422
$$ 34338 -4243 -6099 16251 23513 33645 -7215 -23384 -19183 -3068 -7622 -12619 -8765 -23187
6714b3187K8546J4136l980J356o670j0101l7571K186K2153J1029L805O430j5199
$$ -23187 5359 19495 15515 16871 10201 100 -37471 -35285 -13132 -2103 1702 8132 -7067
6701g067j2203L509K9514K0336q695k7773K394J868l967k63L1608K2095r688k3820
$$ -7067 -19270 -15761 13753 34089 25394 -2379 15 1883 -2084 -2347 29261 51356 41668 17848
6687A7848k0622M992K9470j2781j9525N623O644J1101J5176q981l37j7202k9154
$$ 17848 -2774 2218 31688 18907 -618 5005 11649 22750 37926 28945 28608 11406 -17748
6674a7748J3360j9599k5572k1725k1124K4404K9847M842q462o864J1802J2126
$$ -17748 -4388 -23987 -49559 -71284 -92408 -68004 -38157 -33315 -41777 -48641 -36839 -24713
6662b4713O264j5996J1415K5215o235q299j9740Q236K7428J3669M859J1581Q235
$$ -24713 -18449 -34445 -23030 2185 -4050 -12349 -32089 -23853 3575 17244 22103 33684 41919
6649D1919r590j0603l6211j4937K892J0098J617o096K1887J1516j6671J5777J9465
$$ 41919 32329 21726 -14485 -29422 -26530 -16432 -14815 -20911 976 12492 -4179 11598 31063
6636C1063P73j9674j5577m450K1561J6831j8044k4574j7163L7873J2085J9329
$$ 31063 31836 12162 -3415 -7865 13696 30527 12483 -12091 -29254 8619 20704 40033
6624D0033o634p807m4507r467K2933J2668j4809j8264R30J8643M463l2572L080
$$ 40033 33399 25592 -18915 -28382 -5449 7219 -7590 -25854 -24924 -6281 -1818 -34390 -31310
6611c1310L5470J2199K8815j3824j2558k2847n337J2015Q397j9777L25l369j1717
$$ -31310 4160 16359 45174 31350 18792 -4055 -9392 2623 11020 -8757 -8432 -11801 -23518
6598b3518j583M705k6716j1398k75K0274N194j394j0885l824J9601L0480j2944
$$ -23518 -25101 -20396 -47112 -58510 -58785 -38511 -33317 -34711 -45596 -49420 -29819 661 -12283
6585a2283M252l683j2168m960J0190J980r237P137J3013J6646J5796o674q610
$$ -12283 -8031 -11714 -23882 -28842 -18652 -16672 -25909 -18772 -5759 10887 26683 20009 11399
6572A1399j205K564J5817j5683k5128R458l979j2211J3185l913k0516N935o126
$$ 11399 10194 12758 28575 12892 -12236 -2778 -6757 -18968 -5783 -9696 -30212 -24277 -30403
6559c0403P45o348Q269o258N026J1798J3379j6554j2376o764J3031K1713p456
$$ -30403 -29658 -36006 -27737 -33995 -28969 -17171 -3792 -20346 -32722 -39486 -26455 -4742 -12198
6546a2198n478N526K0358J4610J3799L120J4954k5667j2491k0992k4858l1624
$$ -12198 -17676 -12150 8208 22818 36617 39737 54691 29024 16533 -4459 -29317 -60941
6534f0941N624L3235M17k191J5661K5566n57j6145l705N89O873j974j4724j1346
$$ -60941 -55317 -22082 -21665 -23856 -8195 17371 16814 669 -3036 -2447 4426 2452 -12272 -23618
6520b3618Q894J349J9161O724k4274j0061P41q299l279L0625q942m62J8309K369
$$ -23618 -14724 -13375 5786 12510 -11764 -21825 -21084 -29383 -32662 -2037 -10979 -11441 6868 9237
6506I237k907j2251k092o080j1615K702J1266K9052J2083k7653r990p613N923
$$ 9237 6330 -5921 -8013 -14093 -25708 -23006 -11740 17312 29395 1742 -8248 -15861 -9938
6493i938K9218K3674m823j838k3257j7207j8455J1249J8206O368L664k221M79
$$ -9938 19280 42954 38131 36293 13036 -4171 -22626 -11377 6829 13197 16861 14640 15119
6480A5119o285J7j7119k2611N987l0954k2005J0779N994N191N976O984K5905l651
$$ 15119 8834 8851 -8268 -30879 -24892 -55846 -77851 -67072 -61078 -55887 -49911 -42927 -17022 -20673
6466b0673k00J3023J8359M477l725j4111m583L5742k7722r109J5187J935J9947
$$ -20673 -20873 -7850 10509 14986 11261 -2850 -7433 28309 587 -8522 6665 8600 28547
6453B8547l401l6305j1962n591J3056J1377J8290j7704K7394j0763k8425J6161
$$ 28547 25146 -11159 -23121 -28712 -15656 -4279 14011 -3693 23701 12938 -15487 674
6441F74j851k20q672k928L1777r157O505m681o454M6945J4309j2465m1984l1379
$$ 674 -1177 -1397 -10069 -12997 18780 9623 16128 11447 4993 51938 66247 53782 11798 -19581
6427a9581j2585P765J0302J8692L1300o368k8246j0333M681N580k7p849K8464
$$ -19581 -32166 -24401 -14099 4593 35893 29525 1279 -9054 -4373 1207 1180 -6669 21795
6414B1795J3091j7212k3978j2375Q373j4019m651L134j5985q849r782J3732J8630
$$ 21795 34886 17674 -6304 -18679 -10306 -24325 -28976 -25842 -41827 -50676 -60458 -46726 -28096
6401b8096n07N799J977J4879J8335j5544j5205J9820p95j5773n07o98O580j0275
$$ -28096 -28603 -22804 -20827 -5948 12387 -3157 -18362 1458 663 -15110 -15617 -16315 -9735 -20010
6387b0010J1726J6308K8986J2320j9474j7936k2717l0443p937P960J8132J3299
$$ -20010 -8284 8024 37010 49330 29856 11920 -10797 -41240 -49177 -41217 -23085 -9786
6375i786J9007R307j0916j2810j2758l4661J4617J8390n557O078P394J6525k3042
$$ -9786 9221 18528 7612 -5198 -17956 -52617 -38000 -19610 -25167 -19089 -11695 4830 -18212
6362a8212q5M0302j0576m66Q391m480j0664j5416j6001J5073p140r047o47j9638
$$ -18212 -18297 22005 11429 10963 19354 14874 4210 -11206 -27207 -12134 -19274 -28321 -28968 -48606
6348d8606p34J0758R513K0209J3796m0868n999Q626N277l4132O183L1251l722
$$ -48606 -49340 -38582 -29069 -8860 4936 -35932 -41931 -33305 -28028 -62160 -55977 -24726 -28448
6335b8448p74j776L53Q229L0675Q11k6224J1298M128N173j4597J6708l86j2798
$$ -28448 -29222 -30998 -30645 -22416 8259 9070 -17154 -5856 -1728 3445 -11152 5556 5170 -7628
6321g628j3162R337N79k4986k310j0066J5401j0249J4228L2199j562l2283j5609
$$ -7628 -20790 -11453 -10874 -35860 -38170 -48236 -32835 -43084 -28856 3343 1781 -30502 -46111
6308d6111J6629j398K1109J5089k0112K8198K5541j7796j0697j6196Q520q634
$$ -46111 -29482 -30880 -9771 5318 -14794 13404 38945 21149 10452 -5744 2776 -5858
6296e858j2139J7108M491P071n9j339M1o43K3384J9705k653n112R397o645q932
$$ -5858 -17997 -889 3602 10673 10614 9275 9316 8673 32057 51762 49109 43997 53394 46749 37817
6281C7817j3661j7621j8594P265n59L039q779j2327J4881J4174J1140J5135n710
$$ 37817 24156 6535 -12059 -4794 -5353 -2314 -11093 -23420 -8539 5635 16775 31910 26200
6268B6200j0063q245r165l149j2010j1755J7539n792N529K1711j8738l9785K678
$$ 26200 16137 7892 -1273 -4422 -16432 -28187 -10648 -16440 -10911 10800 -7938 -47723 -45045
6255d5045J0769K4840K2190N49R777o970j2925k160J1582j1156R482m359k8249
$$ -45045 -34276 -9436 12754 13303 23080 16110 3185 1025 12607 1451 10933 6574 -21675
6242b1675k2046R26L1236j4013k9422K569L9526K559m8329k648L6864L374j4440
$$ -21675 -43721 -42795 -11559 -25572 -54994 -52425 -12899 -10340 -58669 -61317 -24453 -21079 -35519
6229c5519j0874K5201J4140J0035J1195j5343J535J5603j3538j7693j1504N369
$$ -35519 -46393 -21192 -7052 2983 14178 -1165 370 15973 2435 -15258 -26762 -21393
6217b1393p14q412L555J5637j4543k8150J453K5805J4080P475J0422k4790J1893
$$ -21393 -22107 -30519 -26964 -11327 -25870 -54020 -52567 -26762 -12682 -5207 5215 -19575 -7682
6204g682J0351j6931R061N783k6295J7069L0476l006k3542k5317k5931J855O705
$$ -7682 2669 -14262 -5201 582 -25713 -8644 21832 18826 -4716 -30033 -55964 -54109 -47404
6191d7404K3442P752K555O700r109M148J581j4574j5786k288L01k3617K617K4672
$$ -47404 -23962 -16210 -13655 -6955 -16064 -11916 -10335 -24909 -40695 -42983 -42682 -66299 -63682 -39010
6177c9010k554o598K6348N983m784j3015j0452J4701j4466L602K3501M026j3070
$$ -39010 -41564 -48162 -21814 -15831 -20615 -33630 -44082 -29381 -43847 -40245 -16744 -12718 -25788
6164b5788N937K8810k7926R184K3725J6815j0189q545n103J2664j8001J7907K1374
$$ -25788 -19851 8959 -18967 -9783 13942 30757 20568 12023 6920 19584 1583 19490 40864
6151D0864o496m1456l1894l910K0684k231k132j9776J515M828J5754J4973J4837
$$ 40864 34368 -7088 -38982 -42892 -22208 -24439 -26571 -46347 -44832 -40004 -24250 -9277 5560
6138E560o386O226o978J941n534j1394J2266J9369j7545l0137K700O3727J1949
$$ 5560 -826 5400 -1578 363 -5171 -16565 -4299 15070 -2475 -32612 -29912 33815 45764
6125D5764k7574j6776O765l786k7240q497R3K7296p5P102O36o64M143p355n757
$$ 45764 18190 1414 8179 4393 -22847 -31344 -31251 -3955 -4030 3072 3708 3044 7187 -168 -5925
6110e925n920N794j3119m885J7670K7308J867l888j4171m6421k2421J2027K8927
$$ -5925 -11845 -6051 -19170 -24055 -6385 20923 22790 18902 4731 -41690 -64111 -52084 -23157
6097b3157K5147P994P722J7844k0222k2227j2063J8368m439j4996j4554J534J250
$$ -23157 1990 9984 17706 35550 15328 -6899 -18962 -594 -5033 -20029 -34583 -33049 -31799
6084c1799J369K118J0620l404j5628L383J2973K9462m007k6728N361P929M460
$$ -31799 -30430 -28312 -17692 -21096 -36724 -33341 -20368 9094 5087 -21641 -16280 -8351 -3891
6071c891J1766q772o015O366J848J6862M971l306p538j1496p072m5311M899J7763
$$ -3891 7875 -897 -6912 -546 1302 18164 23135 19829 12291 795 -6277 -51588 -46689 -28926
6057b8926J2751q989k1677M612J2558J3938r701P409J8578J819J6526J3389j6731
$$ -28926 -16175 -25164 -46841 -42229 -29671 -15733 -25434 -18025 553 2372 18898 32287 15556
6044A5556j9672j772m558J4073r719K77p294R166L0674o561p097q453n321J731
$$ 15556 -4116 -5888 -10446 3627 -6092 -5815 -13109 -3943 26731 20170 13073 4620 -701 1030
6030A030J6486K9163M260j7151k2806k6031j4001j9069R581K2200K0615j699K768
$$ 1030 17516 46679 50939 33788 10982 -15049 -29050 -48119 -38538 -16338 4277 2578 5346
6017E346m101k5040J5150l316J6697K65m964R660o338p868J7651L612L790K4463
$$ 5346 1245 -23795 -8645 -11961 4736 5001 37 9697 3359 -4509 13142 16754 20544 45007
6003D5007k7540k0247k045K965m729N201J8272p931j0595m800J3106n944L652
$$ 45007 17467 -2780 -4825 -1860 -6589 -1388 16884 8953 -1642 -6442 6664 720 4372
5990D372j826J8703K1963j490m675L917j3170n862j5408j5215j6840j1170q773
$$ 4372 2546 21249 43212 41722 37047 40964 27794 21932 6524 -8691 -25531 -36701 -45474
5977d5474o898M427K762K0319K1953p221j3511R786K7228K3253m934J1967J4774
$$ -45474 -52372 -47945 -45183 -24864 -2911 -10132 -23643 -13857 13371 36624 31690 43657 58431
5964E8431q829l4236k3417K246p576k0517J2432J7960o105K7966K5257l6536l4004
$$ 58431 49602 15366 -8051 -5805 -13381 -33898 -21466 -3506 -9611 18355 43612 7076 -26928
5951b6928J6687l623K577p124Q177n456J0426K0771J1217o2125k1576j9195J5132
$$ -26928 -10241 -13864 -11287 -18411 -10234 -15690 -5264 15507 26724 -35401 -56977 -76172 -61040
5938f1040L2204k2919J0085P945L94K7110L7472J2449k8318k6206J0877J7172
$$ -61040 -28836 -51755 -41670 -33725 -33331 -6221 31251 43700 15382 -10824 53 17225
5926A7225k1578j9979K3585K4940L046p462j4462N510j8403m3807q152K1569p624
$$ 17225 -4353 -24332 -747 24193 27239 19777 5315 10825 -7578 -51385 -59537 -37968 -45592
5913d5592j4837K1145J0303K52l1073L130J4871l200j6242k713k881L1634K4524
$$ -45592 -60429 -39284 -28981 -28729 -59802 -56672 -41801 -45001 -61243 -63956 -66837 -35203 -10679
5900a0679J9082Q69J8151P784j2458k8562k2182K219J6429j7368n517J1937Q918
$$ -10679 8403 9272 27423 35207 22749 -5813 -27995 -25776 -9347 -26715 -32232 -20295 -11377
5887a1377k1358k3461L8407J3314J8966K0816J2487p489j1065j4374k499j2224
$$ -11377 -32735 -56196 -17789 -4475 14491 35307 47794 40305 29240 14866 12367 143
5875A43Q519J9261J5542p801j3629O305q070n015K8994k830l9976l2249j4191
$$ 143 8662 27923 43465 35664 22035 28340 20270 15255 44249 41419 1443 -30806 -44997
5862d4997j227l156j9417Q57k960J5180K5411m752L1975P756k6607j0782P854
$$ -44997 -46224 -49380 -68797 -67940 -70900 -55720 -30309 -35061 -3086 4670 -21937 -32719 -24865
5849b4865J8632R934l386j3953n077L2823J2250J2187l953K3297L629R899M922
$$ -24865 -6233 3701 315 -13638 -18715 14108 26358 38545 34592 57889 61518 71417 76339
5836G6339j6138j4816k2216l5272k627K8233l6961r566k890P331j72R962Q011
$$ 76339 60201 45385 23169 -12103 -14730 13503 -23458 -33024 -35914 -28583 -28755 -18793 -10782
5823a0782J521Q912o765j6301p863O868k327j5744M069M280j5823K5836K8128
$$ -10782 -9261 -349 -7114 -23415 -31278 -24410 -26737 -42481 -38412 -34132 -49955 -24119 4009
5810D009M1615j5258q068j08r207o390j326J0094K5079J4766k0432J3034j6252
$$ 4009 45624 30366 22298 22190 12983 6593 5267 15361 40440 55206 34774 47808 31556
5797C1556q445l650k8768l2917J5914K9846m167k1778J3321J2124l4859n75P897
$$ 31556 23111 19461 -9307 -42224 -26310 3536 -631 -22409 -9088 3036 -31823 -32398 -24501
5784b4501K5930k6k1235j5093K357O843L2584K5565P644n270l5706k6730J481
$$ -24501 1429 1403 -19832 -34925 -32568 -25725 6859 32424 40068 34798 -908 -27638 -26157
5771b6157n306J2839j0701j660M6058J4741J4947j2678q616k7080l2619o360J5015
$$ -26157 -31463 -18624 -29325 -30985 15073 29814 44761 32083 23467 -3613 -36232 -42592 -27577
5758b7577L006O09P198J0384L1923j0455m1736k0854K1005K4986M149k0904k2899
$$ -27577 -24571 -23962 -16764 -6380 25543 15088 -26648 -47502 -26497 -1511 2638 -18266 -41165
5745d1165K0008J9010m8549k144L0188J2262m175m1262j5972L2005J7765j9330
$$ -41165 -21157 -2147 -50696 -52840 -22652 -10390 -14565 -55827 -71799 -39794 -22029 -41359
5733d1359L083M3236K493k4577l8330K536j2524M4175K9054J1816J3133k9642
$$ -41359 -38276 4960 7453 -17124 -55454 -52918 -65442 -21267 7787 19603 32736 3094
5721C094k1911L353L366L0031r667m0570m5721r167M8232M5979K1945l0771k4509
$$ 3094 -18817 -15464 -12098 17933 8266 -32304 -78025 -87192 -38960 7019 28964 -1807 -26316
5708b6316j3110L0655K8705j0522j4924L674j3131N146L387k866K7052J4351Q400
$$ -26316 -39426 -8771 19934 9412 -5512 -1838 -14969 -9823 -6436 -9302 17750 32101 40501
5695D0501J5663m2764k2736k8220L028N777j2847k9854M190M9462J9517N117k9797
$$ 40501 56164 13400 -9336 -37556 -34528 -28751 -41598 -71452 -67262 -17800 1717 6834 -22963
5682b2963q003j5989j1543K3922L2238J9548q26P807k7227P132J4041j2261j1324
$$ -22963 -30966 -46955 -58498 -34576 -2338 17210 16384 24191 -3036 4096 18137 5876 -5448
5669e448Q208J614K9639j8007l0443j3787j4219J2349J3277j0490O186J5221J3109
$$ -5448 2760 4374 34013 16006 -14437 -28224 -42443 -30094 -16817 -27307 -21121 -5900 7209
5656G209j1866j4459k599J4830j0467r189l0230K660j632J4808K9524J1441P801
$$ 7209 -4657 -19116 -21715 -6885 -17352 -26541 -56771 -54111 -55743 -40935 -11411 30 7831
5643G831K516K928k3837k1808j1886L6916J7856k1412k5162n226k184J4837j2725
$$ 7831 10347 13275 -10562 -32370 -44256 -7340 10516 -10896 -36058 -41284 -43468 -28631 -41356
5630d1356J9589Q362K1221k460l1790j6074K359p594N414k2359q947m610K0844
$$ -41356 -21767 -13405 7816 5356 -26434 -42508 -40149 -47743 -42329 -64688 -73635 -78245 -57401
5617e7401k550K5065P572J8946p177r519k1359k0114O489J5452J3455N349k1502
$$ -57401 -59951 -34886 -27314 -8368 -15545 -25064 -46423 -66537 -60048 -44596 -31141 -25792 -47294
5604d7294J5862p035J1003J196k1731l7450k2424K5803J0727J4264K9989K0729
$$ -47294 -31432 -38467 -27464 -26268 -47999 -85449 -107873 -82070 -71343 -57079 -27090 -6361
5592f361q030J8780K285o439j0280k1348J1870J8120J4609O64k1668q195k198
$$ -6361 -14391 4389 6674 235 -10045 -31393 -19523 -1403 13206 13870 -7798 -15993 -18191
5579a8191J4432r261j5887q854K2258J1733j8265J609j6843j6487J0163O001o066
$$ -18191 -3759 -13020 -28907 -37761 -15503 -3770 -22035 -20426 -37269 -53756 -43593 -37592 -43658
5566d3658K2402M993L5K3317o675j6476j4910j881l757J4529m1135M449M091m2226
$$ -43658 -21256 -16263 -16228 7089 414 -16062 -30972 -32853 -36610 -22081 -63216 -58767 -54676 -96902
5552i6902N251L5019Q780J0460m507L219j8539j1393J0918L1826j1557l7567K493
$$ -96902 -91651 -56632 -47852 -37392 -41899 -38680 -57219 -68612 -57694 -25868 -37425 -74992 -72499
5539g2499K2980J8135n05k3997J9727J104j2760J4786J5088R034K4766K6609q549
$$ -72499 -49519 -31384 -31889 -55886 -36159 -35055 -47815 -33029 -17941 -8907 15859 42468 33919
5526C3919k6338m133j0994j409j3235j3159j8702J3835l827J2219J4490K627j5946
$$ 33919 7581 3448 -7546 -8955 -22190 -35349 -54051 -40216 -44043 -31824 -17334 -14707 -30653
5513c0653p899j0647m15O415L3564j580l6380J5236L2250j63j9220k4336k0751
$$ -30653 -38552 -49199 -49614 -43199 -9635 -11215 -47595 -32359 -109 -272 -19492 -43828 -64579
5500f4579J0464L1635J2566N23k405k0798j2364K8125J4990J93j5921l6500J7316
$$ -64579 -54115 -22480 -9914 -9391 -11796 -32594 -44958 -16833 -1843 -1650 -17571 -54071 -36755
5487c6755L6384J6810k0770O275Q631O821k4966p160j0923K232J7280N397k4800
$$ -36755 -371 16439 -4331 1944 10575 17396 -7570 -14730 -25653 -23421 -6141 -744 -25544
5474b5544p831K7606J1698P289j3754l4924p85J589O960q056J0345R676j903k064
$$ -25544 -33375 -5769 5929 13218 -536 -35460 -36245 -34656 -27696 -35752 -25407 -15731 -17634 -19698
5460a9698M995j1161j6184j9328J2380J8627J2480Q229j1329j7296J0243J7741
$$ -19698 -14703 -25864 -42048 -61376 -48996 -30369 -17889 -9660 -20989 -38285 -28042 -10301
5448a0301j4511O465J208m624K9650L6810k906m0532k760J5569j9484j8121K6101
$$ -10301 -24812 -18347 -17139 -21763 7887 44697 41791 1259 -1501 14068 -5416 -23537 2564
5435B564K519j1437J4655J1068J2639R39k2266j414L059j0369j1122k6098l929
$$ 2564 5083 -6354 8301 19369 32008 32947 10681 9267 12326 1957 -9165 -35263 -39192
5422c9192K0832L3253n589k5058r317m692o861j4924n373K1864J5348l069r747
$$ -39192 -18360 14893 9304 -15754 -25071 -29763 -36624 -51548 -56921 -35057 -19709 -22778 -32525
5409c2525j3724J9254P140p508k1046p585R341n084L720R047p138r993J541Q089
$$ -32525 -46249 -26995 -19855 -27363 -48409 -55994 -46653 -51737 -48017 -38970 -46108 -56101 -54560 -46471
5395d6471O388J4589j7499n201M7071k3014k4135M829J3443O995J4527j7295p452
$$ -46471 -40083 -25494 -42993 -48194 -1123 -24137 -48272 -43443 -30000 -23005 -8478 -25773 -33225
5382c3225l45L3683O036K097q711J8082l767l6458R838R066j8050m8897K557M3147
$$ -33225 -33570 113 6149 8246 -465 17617 13850 -22608 -12770 -3704 -21754 -70651 -68094 -24947
5368b4947N5347K6733m5681j4119L3902o102j8710k8474j1630j5799n425P0J0522
$$ -24947 30400 57133 11452 -2667 31235 25133 6423 -22051 -33681 -49480 -54905 -54835 -44313
5355d4313J0217k2885J4364k298k6693j834L1739R315k041j8057m129J9313M0998
$$ -44313 -34096 -56981 -42617 -44915 -71608 -73442 -41703 -32388 -34429 -52486 -56615 -37302 3696
5342C696L8874j8509l1760j5594j5568k5530K634L337J9861K0278M424J4326P308
$$ 3696 42570 24061 -7699 -23293 -38861 -64391 -61757 -58420 -38559 -18281 -13857 469 7777
5329G777j1364J0974k62k0541O696r728J858K2156k4442o41J5497K305J9380l177
$$ 7777 -3587 7387 7125 -13416 -6720 -16448 -14590 7566 -16876 -17517 -2020 285 19665 16488
5315A6488k5131J5279J3808l81j9028q8k5200M197J6285j3016J8590L4855m930
$$ 16488 -8643 6636 20444 20063 1035 947 -24253 -20056 -3771 -16787 1803 36658 31728
5302C1728l2840k3904k518L721k9343J0466K2871j4622M0J7904Q447J0232J2468
$$ 31728 -1112 -25016 -27534 -23813 -53156 -42690 -19819 -34441 -34401 -16497 -8050 2182 14650
5289A4650L554j9285K3491Pp390P921r616l1631p449K0270L182J2801o628r043
$$ 14650 18204 -1081 22410 22417 15027 22948 13332 -18299 -25748 -5478 -2296 10505 3877 -5166
5275e166j9384J7970L3675k266j2701p41j3839n87K1727J1607n309j0680j2543
$$ -5166 -24550 -6580 27095 24829 12128 11387 -2452 -3039 18688 30295 24986 14306 1763
5262A763j5959j4343L171K5893j5558r210K9091j8200j0168k999k2622j4325M5331
$$ 1763 -14196 -28539 -25368 525 -15033 -24243 4848 -13352 -23520 -26519 -49141 -63466 -18135
5249a8135k180j541m12R400J6813Q087Q50P046j9285q839J4326j6994k7469J6702
$$ -18135 -20315 -21856 -22268 -12868 3945 12032 12882 19928 643 -8196 6130 -10864 -38333 -21631
5235b1631O981J3579J1070r163l441q201k0182r298K120r715N596L5564J7734
$$ -21631 -14650 -1071 9999 836 -2605 -10806 -30988 -40286 -38166 -47881 -42285 -6721 11013
5222A1013j9826J0700M283j2708k5063Q116Q086j3988p86j8675L1636Q548o530
$$ 11013 -8813 1887 6170 -6538 -31601 -23485 -15399 -29387 -30173 -48848 -17212 -8664 -15194
5209a5194l1049J3097K9781N039j2811j3799M37K3959J309l6849k2664K5605J8343
$$ -15194 -46243 -33146 -3365 1674 -11137 -24936 -24499 -540 769 -36080 -58744 -33139 -14796
5196a4796J6733K8756j7302j666J529n847R690M215k2486k3881m167j0572k1472
$$ -14796 1937 30693 13391 11725 13254 7407 17097 21312 -1174 -25055 -29222 -39794 -61266
5183f1266J0084J1307K8203R13j3152J7337K3494P247J7095L6l5701K014J3279
$$ -61266 -51182 -39875 -11672 -10759 -23911 -6574 16920 24167 41262 41298 5597 7611 20890
5170B0890m792k8191r486r332N0678J0275l0515Q785J8210M24J968j8997j9584
$$ 20890 16098 -12093 -21579 -30911 19767 30042 -473 8312 26522 26946 28914 9917 -9667
5157i667j4349k0516j2822J3101J6034j0603k2894M105m693j6521P09J6078R19
$$ -9667 -24016 -44532 -57354 -44253 -28219 -38822 -61716 -57611 -62304 -78825 -78116 -62038 -61119
5144f1119J134K5172P000P684J0760r84j5813J57J3134p455p645J0606j0421J746
$$ -61119 -59985 -34813 -27813 -20129 -9369 -10353 -26166 -26009 -12875 -20330 -27975 -17369 -27790 -26044
5130b6044J5331j1775O973J3522J6355J6624l4704m6611o901J9291l336k0372
$$ -26044 -10713 -22488 -15515 -1993 14362 30986 -3718 -50329 -57230 -37939 -41275 -61647
5118f1647j274O2954L3389L800j5608q57l154j5831p497K5533p251j3238j0725
$$ -61647 -62921 33 33422 37222 21614 20757 17603 1772 -5725 19808 12557 -681 -11406
5105a1406J5537J0292Q332K0065N90j1053m038l125Q303k3221l0842L146j210
$$ -11406 4131 14423 22755 42820 43410 32357 28319 25194 33497 10276 -20566 -17420 -18630
5092a8630k3789j7792P471n180m626O30n340J0902J0925K0330o309j9628j2541
$$ -18630 -42419 -60211 -52740 -57920 -62546 -61916 -67256 -56354 -45429 -25099 -31408 -51036 -63577
5079f3577L0185K0402p075k120j4707k0329k174M238J070J1850n708j6253J8249
$$ -63577 -33392 -12990 -20065 -22185 -36892 -57221 -59395 -55157 -54087 -42237 -47945 -64198 -45949
5066d5949L9977K2836l4517k9148k1761K0320K5217K9117J8040k3143N772K5406
$$ -45949 -5972 16864 -17653 -46801 -68562 -48242 -23025 6092 24132 989 6761 32167
5054C2167j9860k0490J9324r572k3032Q226J1438M246j2242j5328K048R217p917
$$ 32167 12307 -8183 11141 1569 -21463 -13237 -1799 2447 -9795 -25123 -23075 -13858 -21775
5041b1775j589k2146l844J1248l09o941L1707K5003Q399k3419j5012M68N945K0125
$$ -21775 -23364 -45510 -49354 -38106 -38415 -45356 -13649 11354 19753 -3666 -18678 -18210 -12265 7860
5027G860J0165j0902k2630n507Q428R408k0414L127M793j7663j6026M267K1145
$$ 7860 18025 7123 -15507 -21014 -12586 -3178 -23592 -20465 -15672 -33335 -49361 -45094 -23949
5014b3949J1989o209m313q059J1173k598n10J2932J2966P490k4700k9783L3822
$$ -23949 -11960 -18169 -22482 -30541 -19368 -21966 -22476 -9544 3422 10912 -13788 -43571 -9749
5001i749J5464n3048M036J2451J0525k880o418o02K654R626r098R01l605J9370
$$ -9749 5715 -47333 -43297 -30846 -20321 -23201 -29619 -30221 -27567 -17941 -27039 -26138 -29743 -10373
4987a0373K8368k0045J4933L03j5130j9996q809M6996M182j2216J5852n127j6917
$$ -10373 17995 -2050 12883 13186 -1944 -21940 -30749 16247 20429 8213 24065 18938 2021
4974B021l1409j8366K3986j4300k2970J7580J7962J5825K6020J2967k6641k472
$$ 2021 -29388 -47754 -23768 -38068 -61038 -43458 -25496 -9671 16349 29316 2675 203
4962B03Q047k500k9394j1138J4611K1050K2979j040m1428k2179j5315J4747o736
$$ 203 8250 5750 -23644 -34782 -20171 879 23858 22818 -18610 -40789 -56104 -41357 -48093
4949d8093Q652N118K824K3540L2024k1829l9291L787J6713R026J7090J3680j3372
$$ -48093 -39441 -34323 -31499 -7959 24065 2236 -37055 -33268 -16555 -7529 9561 23241 9869
4936I869J1645r931l5302k5478K3571J5395j0368j5462K4715K1452r17J299j6954
$$ 9869 21514 11583 -23719 -49197 -25626 -10231 -20599 -36061 -11346 10106 9189 10488 -6466
4923f466J8175J1554j1047j3520m289q492j2119J3686M652j4751j6673j4334l0
$$ -6466 11709 23263 12216 -1304 -5593 -14085 -26204 -12518 -7866 -22617 -39290 -53624 -53654
4910e3654J9105K8181K8552l296j7954k222J7058J5617k4811j2701Q505J0787
$$ -53654 -34549 -6368 22184 18888 934 -1288 15770 31387 6576 -6125 2380 13167
4898A3167j4638n602M559M715n030M015j4448J0642j1685q847j2961J314Q525
$$ 13167 -1471 -7073 -2514 2201 -2829 1186 -13262 -2620 -14305 -23152 -36113 -34799 -26274
4885b6274j531L307L144J678k0696K4894K1847K80l2414l1319k5512Q995q747
$$ -26274 -27805 -24498 -21354 -19676 -40372 -15478 6369 6649 -25765 -57084 -82596 -73601 -82348
4872h2348N485K8931K9364j3650k6711q68P830J3654J6261J6136k1852j9329Q833
$$ -82348 -76863 -47932 -18568 -32218 -58929 -59797 -51967 -38313 -22052 -5916 -27768 -47097 -38264
4859c8264j794j5644J8725J3125n972j3294j7406J6719L0755L1330q384j7204
$$ -38264 -40058 -55702 -36977 -23852 -29824 -43118 -60524 -43805 -13050 18280 9896 -7308
4847g308Q984j0040j9540j0125r452r694K6501J5839K590N429N479j2457K678
$$ -7308 1676 -8364 -27904 -38029 -47481 -57175 -30674 -14835 -12245 -6816 -1337 -13794 -11116
4834a1116J9099k1729j2563K1150L23O377K9220P001k7099k2054n2405o1919K6779
$$ -11116 7983 -13746 -26309 -5159 -4836 1541 30761 37762 10663 -11391 -63796 -125715 -98936
4821i8936N8699K276q689p806J2753O183j1127K1263J9912K464M1931K268O358
$$ -98936 -40237 -37961 -46650 -54456 -41703 -35520 -46647 -25384 -5472 -3008 38923 41191 47549
4808D7549r333j5040n67l4616m608O071q850j2073k0182J7080L2020K716Q62L494
$$ 47549 38216 23176 22609 -12007 -16615 -10544 -19394 -31467 -51649 -34569 -2549 167 1029 4523
4794D523j588J6420k547j5439Q291J4453j0059j1468k1031l8236o453J6102Q889
$$ 4523 2935 19355 16808 1369 9660 24113 14054 2586 -18445 -56681 -63134 -47032 -38143
4781c8143M0853K4209r511j1050k0434k5088j6857K4573Q282k8179J3802L71k781
$$ -38143 2710 26919 17408 6358 -14076 -39164 -56021 -31448 -23166 -51345 -37543 -37172 -39953
4768c9953O418j4947J3810p148j7357K2438J9644J3794K1719j6316M239j6609
$$ -39953 -33535 -48482 -34672 -41820 -59177 -36739 -17095 -3301 18418 2102 6341 -10268
4756a0268k0316L225L5028J6655j3775o868m55m14K0566N018o05j138j5760k2223
$$ -10268 -30584 -27359 7669 24324 10549 3681 3226 2812 23378 28396 27791 26653 10893 -11330
4742a1330M579J3218J5798l3294k8431J961M148j4537m421k551K8357n099O101
$$ -11330 -6751 6467 22265 -11029 -39460 -37499 -33351 -47888 -52309 -54860 -26503 -31602 -25501
4729b5501j5208l7645k214o76J7592J7399k5655j5361K0501O1874L8037k5399
$$ -25501 -40709 -78354 -80568 -81244 -63652 -46253 -71908 -87269 -66768 -4894 33143 7744
4717G744j2887K597j9845o580P598K062m028J1095j6529l9308J8340J9915J4387
$$ 7744 -5143 -2546 -22391 -28971 -21373 -19311 -23339 -12244 -28773 -68081 -49741 -29826 -15439
4704a5439K2308J5509M660K3677k9736j645L956P930R299l1136l4377L2822P599
$$ -15439 6869 22378 27038 50715 20979 19334 23290 31220 40519 9383 -24994 7828 15427
4691A5427p362m6437M101J9121O079k107K915J9731K0694N638j7946k071k1191
$$ 15427 8065 -38372 -34271 -15150 -9071 -11178 -8263 11468 32162 37800 19854 17783 -3408
4678c408k5155j921L7783J3759j2788j934k929n4650j0299J2721Q283N159j628
$$ -3408 -28563 -30484 7299 21058 8270 6336 3407 -51243 -61542 -48821 -40538 -35379 -37007
4665c7007K6377J8962K0264K640m741o613K6189r367j8391l0658j0933J1665n679
$$ -37007 -10630 8332 28596 31236 26495 19882 46071 36704 18313 -12345 -23278 -11613 -17292
4652a7292k4618j7039M1091K9443j569k526l957o523j923r999K208j1473N56k1227
$$ -17292 -41910 -58949 -17858 11585 10016 7490 3533 -2990 -4913 -14912 -12704 -24177 -23621 -44848
4638d4848P492L1794O957P731K272j1574J215J3408M470j2403k4802j6869J6870
$$ -44848 -37356 -5562 1395 9126 11398 -176 1039 14447 18917 6514 -18288 -35157 -18287
4625a8287P146p174k347p552k0652k0068j0467K3314L0618J4406m1329J0825J5877
$$ -18287 -11141 -18315 -20662 -28214 -48866 -68934 -79401 -56087 -25469 -11063 -52392 -41567 -25690
4612b5690K047n257J1095K3804o338k5515k9547o148K7050L3081K4706Q696k7405
$$ -25690 -23643 -28900 -17805 5999 -339 -25854 -55401 -61549 -34499 -1418 23288 31984 4579
4599D579j8411k3287j6251L4594j3207j5333p046P215K0251N2019L3126k5741
$$ 4579 -13832 -37119 -53370 -18776 -31983 -47316 -54362 -47147 -26896 25123 58249 32508
4587C2508k9107k878J7440n665k6065j9209j999J5812J1239M13K248Q550l743
$$ 32508 3401 523 17963 12298 -13767 -32976 -34975 -19163 -7924 -7511 -5263 3287 -456
4574d56j5024N778j473k1093k1971j0955J3170K8842J6986K557q589j3960J9520
$$ -456 -15480 -9702 -11175 -32268 -54239 -65194 -52024 -23182 -6196 -3639 -12228 -26188 -6668
4561f668j5628j6230J0815J0891J0897j7031R682L0561K0874j2927k0199j5681
$$ -6668 -22296 -38526 -27711 -16820 -5923 -22954 -13272 17289 38163 25236 5037 -10644
4549a0644k103j4977J9167J7416q752j4964j741PM198q42k1827J1705L1922R784
$$ -10644 -12747 -27724 -8557 8859 107 -14857 -16598 -16591 -12393 -13235 -35062 -23357 8565 18349
4535A8349j1171l7014J0520L578p423j5558K0926K767k733O018K3846K3585k9511
$$ 18349 7178 -29836 -19316 -15738 -23161 -38719 -17793 -15026 -17759 -11741 12105 35690 6179
4522F179j4413P114j0815j8967K5376J5823J2188j2810k569k6010k8394K7754
$$ 6179 -8234 -1120 -11935 -30902 -5526 10297 22485 9675 7106 -18904 -47298 -19544
4510a9544K1364K6624J5063l148l7613l8106k1118l6110k6127K8518J6118K0004
$$ -19544 1820 28444 43507 40359 2746 -35360 -56478 -92588 -118715 -90197 -74079 -54075
4498e4075l096p28n98j8733K1751L1367j4531L191j1969o25j856K0145M0630k632
$$ -54075 -57171 -57899 -58497 -77230 -55479 -24112 -38643 -35452 -47421 -48046 -49902 -29757 10873 8241
4484H241l0011j6361K9077K8818R578L044K1j9720j3185R865r044j4352k0808
$$ 8241 -21770 -38131 -9054 19764 29342 32386 32407 12687 -498 9367 323 -14029 -34837
4471c4837N843J7537J2503j3058n641m868Q8K306k820J3880J4888m06l3132k9693
$$ -34837 -28994 -11457 1046 -12012 -17653 -22521 -22433 -20127 -22947 -9067 5821 5415 -27717 -57410
4457e7410J8643Q35j2402J4821j0353j2059j7856o435K0741K4797j3313r719j734
$$ -57410 -38767 -37932 -50334 -35513 -45866 -57925 -75781 -82216 -61475 -36678 -49991 -59710 -61444
4444f1444Q603L8518J0114M307J4743L975m25j8582q976N325n774j46J6642k4634
$$ -61444 -52841 -14323 -4209 98 14841 18816 18391 -191 -9167 -3842 -9616 -9762 6880 -17754
4430a7754k2314J5228q855J640Q749K2610J264p006m197K2090j3217k8707r397
$$ -17754 -40068 -24840 -33695 -32055 -23306 -696 568 -6438 -10635 11455 -1762 -30469 -39866
4417c9866J1369L535k1457J0178K2837K101k625j4164l602o828j50J0506o620
$$ -39866 -28497 -24962 -46419 -36241 -13404 -11303 -13928 -28092 -31694 -38522 -38672 -28166 -34786
4404c4786j0526O437J0636P308M550R994n903K154r375J2680R416J5195J0189
$$ -34786 -45312 -38875 -28239 -20931 -16381 -6387 -12290 -10136 -19511 -6831 2585 17780 27969
4391B7969l3026r88o239j0048j5986O811K949P136K8554K1326o1j0714j1295j646
$$ 27969 -5057 -6045 -12284 -22332 -38318 -31507 -28558 -21422 7132 28458 28397 17683 6388 4742
4377D742o127K2379J442j0325J1923k7270r358J5309Q88q074O113r119M664j5709
$$ 4742 -1385 20994 22436 12111 24034 -3236 -12594 2715 3603 -4471 1642 -7477 -2813 -18522
4363a8522J6504K35L0925K2577k7214l5300j6793J2120N466N040k0138n712k6527
$$ -18522 -2018 -1783 29142 51719 24505 -10795 -27588 -15468 -10002 -4962 -25100 -30812 -57339
4350e7339L939r651j6954N370J5049L8270K6989N90J2040k4614j6636j8779K238
$$ -57339 -53400 -63051 -80005 -74635 -59586 -21316 5673 6263 18303 -6311 -22947 -41726 -39488
4337c9488J5869K533O486K8865j0924J6804P534l122O009J2182j7378j5054j3592
$$ -39488 -23619 -21086 -14600 14265 3341 20145 27679 24557 30566 42748 25370 10316 -3276
4324c276k4979J1625k3369l262L8434L4267J8621k0992l9719j8060q933J0391
$$ -3276 -28255 -16630 -39999 -43261 -4827 29440 48061 27069 -12650 -30710 -39643 -29252
4312b9252J4344K5322J9433L774k5442k3607l0075J8622Q856L92L8476P925m1840
$$ -29252 -14908 10414 29847 33621 8179 -15428 -45503 -26881 -18025 -17633 20843 28768 -13072
4299a3072m8292K8299K9456J212j739j1099k4283R71K1171N663j3847j0997K3100
$$ -13072 -61364 -33065 -3609 -2397 -4136 -15235 -39518 -38547 -17376 -11713 -25560 -36557 -13457
4286a3457l954n924n382o667J1070M308j5357j9205r364o07J9988K8958P055M392
$$ -13457 -17411 -23335 -28717 -35384 -24314 -20006 -35363 -54568 -63932 -64539 -44551 -15593 -8538 -4146
4272d146K454k725J0687j0104j2210q689R389J1418l1075j0340Q613j7631k520
$$ -4146 -1692 -4417 6270 -3834 -16044 -24733 -15344 -3926 -35001 -45341 -36728 -54359 -56879
4259e6879J2542N04j2251O72J9240M747l64J7934j2737j3195K859j438J969Oj5089
$$ -56879 -44337 -43833 -56084 -55412 -36172 -31425 -31789 -13855 -26592 -39787 -36928 -38366 -36397 -36391 -51480
4244e1480K7535K3717j9640l078J4915M761m9315k1730K0388L0407R970L699O005
$$ -51480 -23945 -228 -19868 -22946 -8031 -3270 -52585 -74315 -53927 -23520 -13550 -9851 -3846
4231c846l570j1212M4632K6583k6186L287j7079l5314m944j841J1291K0525M290
$$ -3846 -7416 -18628 26004 52587 26401 29688 12609 -22705 -27649 -29490 -18199 2326 6616
4218F616P97j9502J9070J3737j4845M740j9313l9892l1878k784K2536K7418M414
$$ 6616 7413 -12089 6981 20718 5873 10613 -8700 -48592 -80470 -83254 -60718 -33300 -28886
4205b8886q00j251M595k1521M17J1868J6270k425J4086J4082j2519K1795J0126
$$ -28886 -29686 -30937 -26342 -47863 -47446 -35578 -19308 -21733 -7647 6435 -6084 15711 25837
4192B5837L904k3104k8301n804j5793J9366K2197P324Q572p491k1594l81K4646
$$ 25837 29741 6637 -21664 -27468 -43261 -23895 -1698 5626 14198 6707 -14887 -15268 9378
4179I378K2482k2460j1338j1613J4808J1443k7371j6237o784P442K8375N644q071
$$ 9378 31860 9400 -1938 -13551 1257 12700 -14671 -30908 -37692 -30250 -1875 3769 -4302
4166d302r548r148j682J5468J0889L999q983j6873M099K881k4409r933K2422J5021
$$ -4302 -13850 -22998 -24680 -9212 1677 5676 -3307 -20180 -16081 -13200 -37609 -47542 -25120 -10099
4152a0099O957o830j2058r67j3453L744K3361J4527l1731j7657r380q267K621
$$ -10099 -3142 -9972 -22030 -22997 -36450 -32706 -9345 5182 -26549 -44206 -53586 -61853 -59232
4139e9232R461J3000K6631J85l2972j5229O832l4073j7645L2915K4934n254K2793
$$ -59232 -49771 -36771 -10140 -9955 -42927 -58156 -51324 -85397 -103042 -70127 -45193 -50447 -27654
4126b7654P79j7674L9726j2444j1537J1661J9376n718J6652m933j2289j4086J2795
$$ -27654 -26875 -44549 -4823 -17267 -28804 -17143 2233 -3485 13167 8234 -4055 -18141 -5346
4113e346J1247j552k888n448m019N185J389K384N445r164L288r116j2006j5238
$$ -5346 5901 4349 1461 -3987 -8006 -2821 -1432 952 6397 -2767 521 -8595 -20601 -35839
4099c5839q297L618K1688r757l116J3485J9815J8967n714k6099j1654O029J5840
$$ -35839 -44136 -40518 -18830 -28587 -31703 -18218 1597 20564 14850 -11249 -22903 -16874 -1034
4086a034o732k3595P223j7812p67M0565R630j7224k172K8547o830k2649N38j291
$$ -1034 -7766 -31361 -24138 -41950 -42717 -2152 7478 -9746 -11918 16629 9799 -12850 -12312 -13603
4072a3603m0732k513L0780k689M855J9724J2604K5859L764k9982j2763j0233j8130
$$ -13603 -54335 -56848 -26068 -28757 -23902 -4178 8426 34285 38049 8067 -4696 -14929 -33059
4059c3059M623K1979L2848N44l8458k9964J9661J1837k5086L628K1967J3480k956
$$ -33059 -28436 -6457 26391 26935 -11523 -41487 -21826 -9989 -35075 -31447 -9480 4000 1044
4046A044k1367n505p882j3085J6075L6671L7361j180j8528k4999j663R829M409
$$ 1044 -20323 -25828 -33710 -46795 -30720 5951 43312 42132 23604 -1395 -3058 6771 11180
4033A1180k2278p558p358J6645P071M847j6741j0962R601J9769j4396r724K7818
$$ 11180 -11098 -18656 -26014 -9369 -2298 2549 -14192 -25154 -15553 4216 -10180 -19904 7914
4020G914J6789l596k082J2460j0585k4464l6352o376J267M412L8238l336r292
$$ 7914 24703 21107 19025 31485 20900 -3564 -39916 -46292 -45025 -40613 -2375 -5711 -15003
4007a5003L782j0765j7696J1281K3368j1057k3622j4088k203J860M2240J6821
$$ -15003 -11221 -21986 -39682 -28401 -5033 -16090 -39712 -53800 -56003 -54143 -11903 4918
3995D918j3397J3469j8095j0320n051j5359r14J2621j7330K248M425K0149J0342
$$ 4918 -8479 4990 -13105 -23425 -28476 -43835 -44749 -32128 -49458 -47210 -42785 -22636 -12294
3982a2294j5965J1935p301N159l6373j5430K0936R296M290K8003J7530M31p434
$$ -12294 -28259 -16324 -23625 -18466 -54839 -70269 -49333 -40037 -35747 -7744 9786 10217 2783
3969B783q17k968Q929k7728j2901J5780R002Q088N042m1288K13J2557R174J5216
$$ 2783 1966 -1002 7927 -19801 -32702 -16922 -7920 168 5210 -36078 -35865 -23308 -14134 1082
3955A082l1982j80r663K540K1235j1605R93K9880K2225O056j4237K287l4645R30
$$ 1082 -30900 -31080 -40743 -38203 -16968 -28573 -27580 2300 24525 30581 16344 18631 -16014 -15084
3941a5084P756O065K0314L260K387q632j9789L029R404k0003l3445M713J9593
$$ -15084 -7328 -1263 19051 22311 24698 16066 -3723 -694 8710 -11293 -44738 -40025 -20432
3928b0432j6461o115p993K5235J9088L629j8177k1054J677L4468j847j5196O19
$$ -20432 -36893 -43008 -51001 -25766 -6678 -3049 -21226 -42280 -40603 -6135 -7982 -23178 -22559
3915b2559K1091o430J2061J8433l4907n0886j4041Q974M056m90l267l806J178
$$ -22559 -1468 -7898 4163 22596 -12311 -63197 -77238 -68264 -64208 -64698 -67965 -71771 -70593
3902g0593l372k3109J3159M2015K4727k9031J5361K3411L468j0661P867K087K244
$$ -70593 -73965 -97074 -83915 -41900 -17173 -46204 -30843 -7432 -3964 -14625 -6758 -4671 -2427
3889b427L75O774k921N080l528m5350j0449K2167R06K0284j2457k2813k3614M019
$$ -2427 -2052 4722 1801 6881 3353 -41997 -52446 -30279 -29373 -9089 -21546 -44359 -67973 -63954
3875f3954N753K6000N278J523L1872J672k7821j12Q772K1766J0010M726j696n698
$$ -63954 -58201 -32201 -26923 -25400 6472 8144 -19677 -19789 -11017 10749 20759 25485 23789 18091
3861A8091k118j4443q662J1631J6182K0144l1656j9489K6584K3042J0716j034
$$ 18091 15973 1530 -7132 4499 20681 40825 9169 -10320 16264 39306 50022 48988
3849D8988K542k7439l6918L795P033k2540j1147Q777K6141R061M551q362j8379
$$ 48988 51530 24091 -12827 -9032 -1999 -24539 -35686 -26909 -768 8293 12844 4482 -13897
3836a3897k483j4347l2781M067N247J6082R723P294N525J5005J0253o37j2214
$$ -13897 -16380 -30727 -63508 -59441 -54194 -38112 -28389 -21095 -15570 -565 9688 9051 -3163
3823c163O486L401k5730k3052L175p376M669P890J1728j0009j0664L4513J9325
$$ -3163 3323 6724 -19006 -42058 -38883 -46259 -41590 -33700 -21972 -31981 -42645 -8132 11193
3810A1193q586j2939J1914q317j828Q65K1605j0579j8681j2089j4633k774K0622
$$ 11193 2607 -10332 1582 -6735 -8563 -7698 13907 3328 -15353 -27442 -42075 -44849 -24227
3797b4227j7904j9113R536L0582K0113J9434j1286j9193J6940K3861N975L1021
$$ -24227 -42131 -61244 -51708 -21126 -1013 18421 7135 -12058 4882 28743 34718 65739
3785F5739p473k8203m48j1720j1667j7808j2216M222K4774j4506q653l598R829
$$ 65739 58266 30063 29615 17895 6228 -11580 -23796 -19574 5200 -9306 -17959 -21557 -11728
3772a1728j0875K2747J7831Q017j6992r482K2930K4545J2671j1582j3732j8993
$$ -11728 -22603 144 17975 25992 9000 -482 22448 46993 59664 48082 34350 15357
3760A5357J411j2491j8627l1116J7298K0002P299p902O67r785j2063k958K6970
$$ 15357 16768 4277 -14350 -45466 -28168 -8166 -867 -8769 -8102 -17887 -29950 -32908 -5938
3747e938j7496j155L12r361K8032p126J055N311j6752o240j2263K2859J8075k6074
$$ -5938 -23434 -24589 -24277 -33638 -5606 -12732 -11677 -6366 -23118 -29358 -41621 -18762 -687 -26761
3733b6761k8736P935K0557r572j5524P619L7267R944j4096n473J304J5190J4731
$$ -26761 -55497 -47562 -27005 -36577 -52101 -44482 -7215 2729 -11367 -16840 -15536 -346 14385
3720A4385O717j181R463k257m7522j1357K3784J6410r803k4851k4889P461K1183
$$ 14385 21102 19921 29384 27127 -20395 -31752 -7968 8442 -1361 -26212 -51101 -43640 -22457
3707b2457J1813K9709L747L969o065J4571j2631p775P08K322j1903k1503P650
$$ -22457 -10644 19065 22812 26781 20716 35287 22656 14881 15589 17911 6008 -15495 -7845
3694g845n576l6131L107P535K6256P468j1645L490o612k1694m51l683K3956J5160
$$ -7845 -13421 -49552 -46445 -38910 -12654 -5186 -16831 -13341 -19953 -41647 -42098 -45781 -21825 -6665
3680f665k0484L05K0165R983J1005k769j2406q043Q501o92K475l6320k2778k346
$$ -6665 -27149 -26844 -6679 3304 14309 11540 -866 -8909 -408 -1100 1375 -34945 -57723 -60069
3666f0069N234O429N526J6053j7869n399l2329j7423J0194L3146K0604K2465K5442
$$ -60069 -54835 -48406 -42880 -26827 -44696 -50095 -82424 -99847 -89653 -56507 -35903 -13438 12004
3653A2004j3158j8168j3581K3349J07j2140r523O520j0315p600L2904r122J0823
$$ 12004 -1154 -19322 -32903 -9554 -9447 -21587 -31110 -24590 -34905 -42505 -9601 -18723 -7900
3640g900J4982J3281n023j8081J848M018k2493J734k463M802J0751k7942k6989
$$ -7900 7082 20363 15340 -2741 -893 3125 -19368 -17634 -20097 -15295 -4544 -32486 -59475
3627e9475J2391L0087K4580P041j8652p520r097J7061K2945J3379L975J659j6609
$$ -59475 -47084 -16997 7583 14624 -4028 -11548 -20645 -3584 19361 32740 36715 38374 21765
3614B1765n358K212J8891j5010p589k7080k0845k6146Q047J1582K810J7381O054
$$ 21765 16407 18619 37510 22500 14911 -12169 -33014 -59160 -51113 -39531 -36721 -19340 -13286
3601a3286o569o199j1044J3043J2981p329j423m648m105j445m694P169j265K3669
$$ -13286 -19855 -26054 -37098 -24055 -11074 -18403 -19826 -24474 -28579 -30024 -34718 -27549 -28814 -5145
3587e145J0103l4783k5504K3309K3066m553J891R372M1382l7435l8055j0421L448
$$ -5145 4958 -29825 -55329 -32020 -8954 -13507 -11616 -2244 39138 1703 -36352 -46773 -43325
3574d3325N877O159n70n058q78n780K0004M6757L7267j3488m1268m0724k3714
$$ -43325 -37448 -31289 -31859 -36917 -37795 -43575 -23571 23186 60453 46965 5697 -35027 -58741
3561e8741K9838L4724K1303R159N334M782k1872k7699k3019n139K9487J9020K3869
$$ -58741 -28903 5821 27124 36283 41617 46399 24527 -3172 -26191 -31330 -1843 17177 41046
3548D1046J086m4886l8099P605K65K1744k6058r408j475J4959J3332J6751J4803
$$ 41046 42132 -2754 -40853 -33248 -32983 -11239 -37297 -46705 -48180 -33221 -19889 -3138 11665
3535A1665j9074k9764K2867J4637j0036j1568l7646P413L103P287J4243J7357
$$ 11665 -7409 -37173 -14306 331 -9705 -21273 -58919 -51506 -48403 -41116 -26873 -9516
3523i516L0452j1869q162l842j7735j3721Q465M6110K6107k8451k2522j0534N998
$$ -9516 20936 9067 905 -2937 -20672 -34393 -25928 20182 46289 17838 -4684 -15218 -9220
3510i220K0172r583o961K7404K594j0570l2273O386r804l0085L555P241m637l896
$$ -9220 10952 1369 -5592 21812 24406 13836 -18437 -12051 -21855 -51940 -48385 -41144 -45781 -49677
3496d9677L385J0177K052Q935M2417j878n221J2578k3004l1427j3052n546o552
$$ -49677 -46292 -36115 -34063 -25128 17289 15411 10190 22768 -236 -31663 -44715 -50261 -56813
3483e6813O163J7751J4217L5982K5365q941j5718q511p379k0246P899K2272P211
$$ -56813 -50650 -32899 -18682 17300 42665 33724 18006 9495 2116 -18130 -10231 12041 19252
3470A9252L911K2801P798j0538j0648j6110n853o192o142j4133m936N233N378
$$ 19252 23163 45964 53762 43224 32576 16466 10613 4421 -1721 -15854 -20790 -15557 -10179
3457a0179n614o26r366L899J3322J8312K609K1471r470m3709N289q838p4J8050
$$ -10179 -15793 -16419 -25785 -21886 -8564 9748 12357 33828 24358 -19351 -14062 -22900 -22974 -4924
3443d924J9164l919k4803K5523L80k6526l8193j6847K6389L3891k598k365j0316
$$ -4924 14240 10321 -14482 11041 11421 -15105 -53298 -70145 -43756 -9865 -12463 -14828 -25144
3430b5144l006Q817M228j3646J6687J73L038Q715j4544R635k0509R463J5451P93
$$ -25144 -28150 -19333 -15105 -28751 -12064 -11891 -8853 -138 -14682 -5047 -25556 -16093 -642 151
3416A51O753K654K690K5584N112k0611k766M038P713K8298J6310j442j7771m8962
$$ 151 6904 9558 12248 37832 42944 22333 19567 23605 31318 59616 75926 74484 56713 7751
3402G751k0398q667j3925O277J5599J9276M692O284M878L006k3696j5906P044
$$ 7751 -12647 -21314 -35239 -28962 -13363 5913 10605 16889 21767 24773 1077 -14829 -7785
3389g785m584J0976O419N762p23n964P881j1268j0964p745l0706J484L9802J7020
$$ -7785 -12369 -1393 5026 10788 10065 4101 11982 714 -10250 -17995 -48701 -47217 -7415 9605
3375I605k692Q698P928j2385r643l518j8113k7932j806K3602M182K2416K0084
$$ 9605 6913 15611 23539 11154 1511 -2007 -20120 -48052 -49858 -26256 -22074 342 20426
3362B0426K8147J8468k3113m2597m0543P20J2607p899N269K5714p07J8767N816
$$ 20426 48573 67041 43928 1331 -39212 -38492 -25885 -33784 -28515 -2801 -3508 15259 21075
3349B1075k487O851m656k4760Q938L181r690j2850j5142K763R744K1824j0650
$$ 21075 18588 25439 20783 -3977 4961 8142 -1548 -14398 -29540 -26777 -17033 4791 -5859
3336e859j1363K5540M265p326j9249L933n698J271J5587J6117j4410k2931J0537
$$ -5859 -17222 8318 12583 5257 -13992 -10059 -15757 -14486 1101 17218 2808 -20123 -9586
3323i586P23k337M30Q557P172L191K4421j0926m21j8865q264m116q9j1045K1039
$$ -9586 -8863 -11200 -10770 -2213 4959 8150 32571 21645 21224 2359 -5905 -10021 -10110 -21155 -116
3308a16M917K3904n343q591k5932r097K3642j3754j3524k1915M203J8113K656
$$ -116 4801 28705 23362 14771 -11161 -20258 3384 -10370 -23894 -45809 -41606 -23493 -20837
3295b0837J1167J9902Q648m000P393l4242j5835J2490j677Q328J3030k3375J7487
$$ -20837 -9670 10232 18880 14880 22273 -11969 -27804 -15314 -16991 -8663 4367 -19008 -1521
3282a521M5125J1097k2870j5423o316K746m720j0068M601J6847j9521N875J8448
$$ -1521 43604 54701 31831 16408 10092 12838 8118 -1950 2651 19498 -23 5852 24300
3269B4300k1637p589Q35k1634k770lQ764N570j1419J123L0214M4722O598l0762
$$ 24300 2663 -4926 -4091 -25725 -28495 -28498 -19734 -14164 -25583 -24460 5754 50476 57074 26312
3255B6312m3136j7636K8501L5q931O499K2599K2871l4622L64J5778j4680j9497
$$ 26312 -16824 -34460 -5959 -5924 -14855 -8356 14243 37114 2492 2856 18634 3954 -15543
3242a5543o088J505K1256K3131Q992m0303j5998j8648J5601N7566L267j4258l881
$$ -15543 -21631 -20126 1130 24261 33253 -7050 -23048 -41696 -26095 31471 34738 20480 16599
3229A6599M03j6152O282j4759l182J4225J9952j6112k8122k1432l1503N586K2128
$$ 16599 17002 850 7132 -7627 -10809 3416 23368 7256 -20866 -42298 -73801 -68215 -46087
3216d6087J4445p32L2718K3763O417j5872l1357J5146J4431k1056l4317j3588
$$ -46087 -31642 -32374 344 24107 30524 14652 -16705 -1559 12872 -8184 -42501 -56089
3204e6089J023M8556M2736P7j5316j0899K927N134j7439j2361j1563j6222L2830
$$ -56089 -55066 -6510 36226 36303 20987 10088 13015 18149 710 -11651 -23214 -39436 -6606
3191f606J57N508j5349k1513K4757J6586J2687J704j8602K0699O49m9780l4169
$$ -6606 -6449 -941 -16290 -37803 -13046 3540 16227 17931 -671 20028 20677 -29103 -63272
3178f3272K3889J7084J9817j1372p526j3810l578L3847p012j3561j6351j9642
$$ -63272 -39383 -22299 -2482 -13854 -21380 -35190 -38768 -4921 -11933 -25494 -41845 -61487
3166f1487k06K5268K5640J6749J303r076k3274j1252J0217J7311J6112l3806k979
$$ -61487 -61693 -36425 -10785 5964 7267 -1809 -25083 -36335 -26118 -8807 7305 -26501 -29480
3153b9480K7624K5903J1432R124j000M872l3841j0106J1719k8127k5870k026p777
$$ -29480 -1856 24047 35479 44603 43603 48475 14634 4528 16247 -11880 -37750 -39776 -47553
3140d7553K7441P882Q682J3113l0528l2485j2832K4579J040Q799M256m301k0680
$$ -47553 -20112 -12230 -3548 9565 -20963 -53448 -66280 -41701 -40661 -31862 -27606 -31907 -52587
3127e2587l654K7944L4970K0409l2809l6422j4035J7754J3907k413J6810L411
$$ -52587 -56241 -28297 6673 27082 -5727 -42149 -56184 -38430 -24523 -26936 -10126 -6715
3115f715K1876M778O614k4218j2161m7159J279Q370J2369L4125k6020k3242q777
$$ -6715 15161 19939 26553 2335 -9826 -56985 -55706 -47336 -34967 -842 -26862 -50104 -58881
3102e8881q775L0206K7235j551O305m752j561J8673R925j4140j4168j4341L4982
$$ -58881 -67656 -37450 -10215 -11766 -5461 -10213 -11774 6899 16824 2684 -11484 -25825 9157
3089I157L7134j1806j2249J647j646J078J4356r400l5953k1781K856L1723K7567
$$ 9157 46291 34485 22236 23883 22237 23315 37671 28271 -7682 -29463 -26607 5116 32683
3076C2683j7099k2302j0629m568p155J5093L128J4135j9145p187K1886K0724P970
$$ 32683 15584 -6718 -17347 -21915 -29070 -13977 -10849 3286 -15859 -23046 -1160 19564 27534
3063B7534r390k7664K3567K3841j7128k6118l968J3381L0625J0130k9089j4242
$$ 27534 18144 -9520 14047 37888 20760 -5358 -9326 4055 34680 44810 15721 1479
3051A479K030J390r410L760J0539J5360m577K0994J6479l966j7556k3701O430
$$ 1479 3509 4899 -4511 -751 9788 25148 20571 41565 58044 54078 36522 12821 19251
3038A9251p919k7532p283K779r445J3190O517J0716k2859j6459R29R503J0554
$$ 19251 11332 -16200 -23483 -20704 -30149 -16959 -10442 274 -22585 -39044 -38115 -28612 -18058
3025a8058n801J7080J0539o607l250J5122P421j1795r29j841j3108n030j267m2920
$$ -18058 -23859 -6779 3760 -2847 -6097 9025 16446 4651 3722 1881 -11227 -16257 -17524 -60444
3011f0444j0456J1105J3005o736m781Q483M358L0676O797o340k0895P304J7108
$$ -60444 -70900 -59795 -46790 -53526 -58307 -49824 -45466 -14790 -7993 -14333 -35228 -27924 -10816
2998a0816J4548r857k7268L832R929k071j0790k3266R148K4150L3019j2640k7243
$$ -10816 3732 -6125 -33393 -29561 -19632 -21703 -32493 -55759 -46611 -22461 10558 -2082 -29325
2985b9325O459J9430m273j2600M22L084J1028J589l18r201j752o01j070N959J2975
$$ -29325 -22866 -3436 -7709 -20309 -19887 -16803 -5775 -4186 -4504 -13705 -15457 -16058 -17128 -11169 1806
2970A806k464K1662J747P921j1977l2248r375L3033L1629K225j2149l3665j3014
$$ 1806 -658 21004 22751 30672 18695 -13553 -22928 10105 41734 43959 31810 -1855 -14869
2957a4869J4293N714K3832j649m750j4776l1345o401J8229O723J1837j2843j7927
$$ -14869 -576 5138 28970 27321 22571 7795 -23550 -29951 -11722 -4999 6838 -6005 -23932
2944b3932P741K3566r672o025j638J7865j7133J084O08Q807J1275J4694j0571
$$ -23932 -16191 7375 -2297 -8322 -9960 7905 -9228 -8144 -7536 1271 12546 27240 16669
2931A6669j8630j7328P951J2337L2528j7741l431n132l0113J8362r433r503J4185
$$ 16669 -1961 -19289 -11338 999 33527 15786 12355 7223 -22890 -4528 -13961 -23464 -9279
2918i279j5169l5077k3998K2094K4532l6855L0461L4802L3657l3978j4513n465
$$ -9279 -24448 -59525 -83523 -61429 -36897 -73752 -43291 -8489 25168 -8810 -23323 -28788
2906b8788N011n055K5601Q691k7660J4367l21O591j211K9457J6434j641j600j8425
$$ -28788 -23777 -28832 -3231 5460 -22200 -7833 -8154 -1563 -2774 26683 43117 41476 39876 21451
2892B1451K3292N034k528n981j2297N882J7701r159k9452l2581J0110L3083q840
$$ 21451 44743 49777 47249 41268 28971 34853 52554 43395 13943 -18638 -8528 24555 15715
2879A5715p774m998n64R222K0614L894k5874M894J1560J7847j1875L436K1335
$$ 15715 7941 2943 2379 11601 32215 36109 10235 15129 26689 44536 32661 36097 57432
2866E7432j1763j3217j7281L056K7345j090j9720P183j4467q539j3145n672p513
$$ 57432 45669 32452 15171 18227 45572 44482 24762 31945 17478 8939 -4206 -9878 -17391
2853a7391J3815L818k521L731p857j4043N233J3333J8618R857M672M908n013O411
$$ -17391 -3576 242 -2279 1452 -6405 -20448 -15215 -1882 16736 26593 31265 36173 31160 37571
2839C7571j7717k6738p562K5050l875j9233r673J7645K1198Q041J7245l7391O724
$$ 37571 19854 -6884 -14446 10604 6729 -12504 -22177 -4532 16666 24707 41952 4561 11285
2826A1285J3023l2768m504K5430q414l0372p788L389J1478L3769j451p5q32j2816
$$ 11285 24308 -8460 -12964 12466 4052 -26320 -34108 -30719 -19241 14528 13077 13002 12170 -646
2812f46k6778j4102J6651J8565n118K2877J2155J70j9804j0029M770O744J6383
$$ -646 -27424 -41526 -24875 -6310 -11428 11449 23604 23774 3970 -6059 -1289 5455 21838
2799B1838o139O808J4173o721j0549n421L442J8943q739r831q234j2079J9237
$$ 21838 15699 22507 36680 29959 19410 13989 17431 36374 27635 17804 9570 -2509 16728
2786A6728r290l2582o847k931O614L170L1384K0918k9832l7089M1266M6803j3392
$$ 16728 7438 -25144 -31991 -34922 -28308 -25138 6246 27164 -2668 -39757 1509 48312 34920
2773C4920o050j1949r750Q240P571k5932l938j4865q047q453J2488m052k658M0209
$$ 34920 28870 16921 7171 15411 22982 -2950 -6888 -21753 -29800 -38253 -25765 -29817 -32475 7734
2759G734j6058j5240L5910k153M662J246k8503j8012k745j1309L1736J9807k2455
$$ 7734 -8324 -23564 12346 10193 14855 16101 -12402 -30414 -33159 -44468 -12732 7075 -15380
2746a5380m080J964K1489m917R385J2973j8043j0207J2173n920k2543K1073K3235
$$ -15380 -19460 -17496 3993 -924 8461 21434 3391 -6816 5357 -563 -23106 -2033 21202
2733B1202k4258q297J1431k3326R811r03O862L550R25K0540K6544k0148L362j5218
$$ 21202 -3056 -11353 78 -23248 -13437 -14340 -7478 -3928 -3003 17537 44081 23933 27295 12077
2719A2077J132N860j525q366M247n315n448J236p29n349L4404P75k6083k5281
$$ 12077 13209 19069 17544 9178 13425 8110 2662 3898 3169 -2180 32224 32999 6916 -18365
2705a8365N024J1625j092P920j2387j7248N052J0400J9340Q704L936j530Q433
$$ -18365 -13341 -1716 -2808 5112 -7275 -24523 -19471 -9071 10269 18973 22909 21379 29812
2692B9812P557j5768k2978J12m718L116R380P82j4038j8898l699j1952J9445M380
$$ 29812 37369 21601 -1377 -1265 -5983 -2867 6513 7295 -6743 -25641 -29340 -41292 -21847 -17467
2678a7467j325k304J9003k392l2137m076J4304L360j1532N064Q695M9529J1633
$$ -17467 -18792 -21096 -2093 -4485 -36622 -40698 -26394 -23034 -34566 -29502 -20807 28722 40355
2665D0355m662j9718p947P709r418j92k4952K332J5603J7075L2259J212m378K1636
$$ 40355 35693 15975 8028 15737 6319 6127 -18825 -16493 -890 16185 48444 49656 45278 66914
2651F6914q223k308j688l8031k9336p248L419N983P741l899k757J013L1078o586
$$ 66914 58691 56383 54695 16664 -12672 -19920 -16501 -10518 -2777 -6676 -9433 -8420 22658 16072
2637A6072j5715q075P356j3953R088N989K1271K7127q945k5091o892K4188Q41
$$ 16072 357 -7718 -362 -14315 -5227 762 22033 49160 40215 15124 8232 32420 33261
2624C3261J2927p999m8719k3309J3099L8124j8345l0217m315M5603K0773l7830
$$ 33261 46188 38189 -10530 -33839 -20740 17384 -961 -31178 -35493 10110 30883 -6947
2612f947m8169L945M1765L2476J213j6196j7350K694m953N443m79j4084j498Q078
$$ -6947 -55116 -51171 -9406 23070 24283 8087 -9263 -6569 -11522 -6079 -6558 -20642 -22140 -14062
2598a4062j6980J2950J5340J5256j8014J454J1500l283k6660l544m826L518l551
$$ -14062 -31042 -18092 -2752 12504 -5510 -4056 7444 4161 -22499 -26043 -30869 -27351 -30902
2585c0902j0816J8016M341K7391K2231j690k3378j7376J0825J4070n918k552m962
$$ -30902 -41718 -23702 -19361 8030 30261 28571 5193 -12183 -1358 12712 6794 4242 -720
2572g20p002J6314m816Q751K8146J8286m6186K193j9737n3858m002J480n345J0043
$$ -720 -7722 8592 3776 12527 40673 58959 12773 14966 -4771 -58629 -62631 -61151 -66496 -56453
2558e6453J9252L2265r375r302M142J2552k893p19J2062j356j7814j8287N559
$$ -56453 -37201 -4936 -14311 -23613 -19471 -6919 -9812 -10531 1531 175 -17639 -35926 -30367
2545c0367K3360J1770o96Q644j3466p087k386J5287L553k9200J8966M7136j3645
$$ -30367 -7007 4763 4067 12711 -755 -7842 -10228 5059 8612 -20588 -1622 45514 31869
2532C1869k3179l849j4848K921j3858j7514K7571J4201n42P738K4739k192l157
$$ 31869 8690 4841 -10007 -7086 -20944 -38458 -10887 3314 2772 10510 35249 33057 29900
2519B9900j2103l810j3672q25K874R561L102l7930o546j063J561k2905K0731K8991
$$ 29900 17797 13987 315 -510 2364 11925 15027 -22903 -29449 -30512 -28951 -51856 -31125 -2134
2505b134J3430N546j1329j8418O615K4206R774O564j5360j0063Q180j5403L046
$$ -2134 11296 16842 5513 -12905 -6290 17916 27690 34254 18894 8831 17011 1608 4654
2492D654J8340j936m34P027l482J3582j4804k1661j3164J6037J7809k2128j5273
$$ 4654 22994 21058 20624 27651 24169 37751 22947 1286 -11878 4159 21968 -160 -15433
2479a5433J3449K6809j3344j2264k3149m939J2732k0495P962K4478J4648j9181
$$ -15433 -1984 24825 11481 -783 -23932 -28871 -16139 -36634 -28672 -4194 10454 -8727
2467h727o398j1679N473J2221n507k5723L4521J3826j1601R561r959r684j4183
$$ -8727 -15125 -26804 -21331 -9110 -14617 -40340 -5819 8007 -3594 5967 -3992 -13676 -27859
2454b7859m598j8486N149J2120K2564l064l0201j578R614l0778R882J7424J5109
$$ -27859 -32457 -50943 -45794 -33674 -11110 -14174 -44375 -45953 -36339 -67117 -57235 -39811 -24702
2441b4702K1273o826N894K0637K8981l123j3230r183J4587q912m1918J7433P944
$$ -24702 -3429 -10255 -4361 16276 45257 42134 28904 19721 34308 25396 -16522 911 8855
2428H855j4196j6703J2445j8157L952N665M610L3967K3395R862l7063j1722R932
$$ 8855 -5341 -22044 -9599 -27756 -23804 -18139 -13529 20438 43833 53695 16632 4910 14842
2415A4842J073l2502j6939j2198J6881M2183j7747k7468J5427Q666m767R197J9403
$$ 14842 15915 -16587 -33526 -45724 -28843 13340 -4407 -31875 -16448 -7782 -12549 -3352 16051
2402A6051q136l1384m087K5539R97J5296j6200k2132J3529r238p301N038k2930
$$ 16051 7915 -23469 -27556 -2017 -1020 14276 -1924 -24056 -10527 -19765 -27066 -22028 -44958
2389d4958j8989P716J6168J1081K7011K5417m150j6317o124m4681J0347J1021
$$ -44958 -63947 -56231 -40063 -28982 -1971 23446 19296 2979 -3145 -47826 -37479 -26458
2377b6458M736J4595K828L749K4035K8413K0152k6689L89j0066k4272O330K5748
$$ -26458 -21722 -7127 -4299 -550 23485 51898 72050 45361 45750 35684 11412 17742 43490
2364D3490L2487k2001k6508L3290R812l5887j3527J0518j2362M030j5389K975
$$ 43490 75977 53976 27468 60758 70570 34683 21156 31674 19312 23342 7953 10928
2352A0928L0728L3740o654l1379l3457k5327M973J8561o292J0050O56m460j6856
$$ 10928 41656 75396 68742 37363 3906 -21421 -16448 2113 -4179 5871 6527 2067 -14789
2339a4789l2549L5380O808J2509J1747l095p660j6219L576q633k664P602O670
$$ -14789 -47338 -11958 -5150 7359 19106 16011 8351 -7868 -4292 -12925 -15589 -7987 -1317
2326a317j5087K575J2432J4371p160r675m84m444P299M7676j9235o828j2183k0615
$$ -1317 -16404 -13829 -1397 12974 5814 -3861 -4345 -8789 -1490 46186 26951 20123 7940 -12675
$$ [...]
##END NTUPLES=NMR SPECTRUM
##END=
