##TITLE=Analysis number 320307
Compound Code mo 07890
Book Reference 420/162/11
Project Code adrs
Chemist Name stuartg
##JCAMPDX= 6.0         $$ Bruker NMR JCAMP-DX V2.0
##DATA TYPE= NMR SPECTRUM
##DATA CLASS= NTUPLES
##ORIGIN= Bruker BioSpin GmbH
##OWNER= nmr
$$ XWIN-NMR		Version 3.5
$$ Wed Jun 21 11:30:27 2006 GMT Daylight Time (UT+1h)  MAYBRIDGE\nmr@NMR_250MHZ
##.OBSERVE FREQUENCY= 250.131544655141
##.OBSERVE NUCLEUS= ^1H
##.ACQUISITION MODE= SIMULTANEOUS (DQD)
##.ACQUISITION SCHEME= undefined
##.AVERAGES= 16
##.DIGITISER RES= 18
##SPECTROMETER/DATA SYSTEM= dpx250
##.PULSE SEQUENCE= zg30
##.SOLVENT NAME= CDCl3
##.SHIFT REFERENCE= (INTERNAL, CDCl3, 0, 16.522)
##AUDIT TRAIL= $$ (NUMBER, WHEN, WHO, WHERE, WHAT)
$$ ##TITLE= Audit trail, XWIN-NMR		Version 3.5
$$ ##JCAMPDX= 5.01
$$ ##ORIGIN= Bruker BioSpin GmbH
$$ ##OWNER= nmr
$$ C:\u/data/dgb/nmr/ADRS/1170/pdata/1/auditp.txt
$$ ##AUDIT TRAIL=  $$ (NUMBER, WHEN, WHO, WHERE, WHAT)
(   1,<2006-06-21 11:29:59.61 +100>,<MAYBRIDGE\nmr>,<NMR_250MHZ>,
      <created by zg, POWCHK disabled, PULCHK disabled
       configuration hash MD5:
       E2 DF 36 D8 04 B2 41 60 5A D7 A3 38 5A 4B D0 FE
       data hash MD5: 64K
       0D D2 6D 25 F8 93 49 3D E5 15 47 3C 1C EA E6 65>)
(   2,<2006-06-21 11:30:20.18 +100>,<MAYBRIDGE\nmr>,<NMR_250MHZ>,
      <Start of raw data processing
       ef LB = 0.3 FT_mod = 6 PKNL = 1 SI = 32K 
       data hash MD5: 32K
       70 AC 6F CF 8E 14 9B 92 90 F5 8A 1A A7 7D 7C DD>)
(   3,<2006-06-21 11:30:21.85 +100>,<MAYBRIDGE\nmr>,<NMR_250MHZ>,
      <apk 
       data hash MD5: 32K
       05 53 33 09 37 E8 F4 B0 C0 53 38 F7 36 E1 C3 3D>)
(   4,<2006-06-21 11:30:22.69 +100>,<MAYBRIDGE\nmr>,<NMR_250MHZ>,
      <abs ABSG = 5 
       data hash MD5: 32K
       17 A6 7C 00 B1 6A 49 7A 06 09 93 FE A2 2B DD A5>)
$$ ##END=
$$ 
$$ hash MD5
$$ B3 57 E4 B1 73 02 AE CA 7E 26 0B 93 17 E6 B1 2C
##$RELAX= 
##$RELAX= 
##$RELAX= 
##$RELAX= 
##$RELAX= 
##$RELAX= 
##$RELAX= 
$$ Bruker specific parameters
$$ --------------------------
##$DU= <C:\u>
##$EXPNO= 1170
##$NAME= <ADRS>
##$PROCNO= 1
##$TYPE= <nmr>
##$USER= <dgb>
##$AMP= (0..31)
100 100 100 100 100 100 100 100 100 100 100 100 100 100 100 100 100 100 
100 100 100 100 100 100 100 100 100 100 100 100 100 100 
##$AQSEQ= 0
##$AQ_mod= 3
##$AUNM= <au_zg>
##$AUTOPOS= <22 >
##$BF1= 250.13
##$BF2= 250.13
##$BF3= 250.13
##$BF4= 250.13
##$BF5= 500.13
##$BF6= 500.13
##$BF7= 500.13
##$BF8= 500.13
##$BYTORDA= 1
##$CFDGTYP= 0
##$CFRGTYP= 5
##$CHEMSTR= <none>
##$CNST= (0..31)
1 1 145 1 1 1 1 1 1 1 1 1 1 1 1 1 1 1 1 1 1 1 1 1 1 1 1 1 1 1 1 1 
##$CPDPRG= <>
##$CPDPRG1= <>
##$CPDPRG2= <>
##$CPDPRG3= <>
##$CPDPRG4= <mlev>
##$CPDPRG5= <mlev>
##$CPDPRG6= <mlev>
##$CPDPRG7= <mlev>
##$CPDPRG8= <mlev>
##$CPDPRGB= <>
##$CPDPRGT= <>
##$D= (0..31)
0 1 0 0 0 0 0 0 0 0.06 0 0 0 0 0 0 0.0002 0 0 0 0 0 0 0 0 0 0 0 0 0 0 
0 
##$DATE= 1150885798
##$DBL= (0..7)
120 120 120 120 120 120 120 120 
##$DBP= (0..7)
150 150 150 150 150 150 150 150 
##$DBP07= 0
##$DBPNAM0= <>
##$DBPNAM1= <>
$$ [...]
##$SUBNAM7= <"">
##$SUBNAM8= <"">
##$SUBNAM9= <"">
##$SW= 20.6930455092707
##$SWIBOX= (0..15)
0 0 3 0 0 0 0 0 0 0 0 0 0 0 0 0 
##$SW_h= 5175.983436853
##$TD= 65536
##$TD0= 1
##$TE= 294.16
##$TE2= 300
##$TE3= 300
##$TEG= 300
##$TL= (0..7)
0 120 120 120 120 120 120 120 
##$TP= (0..7)
150 150 150 150 150 150 150 150 
##$TP07= 0
##$TPNAME0= <>
##$TPNAME1= <>
##$TPNAME2= <>
##$TPNAME3= <>
##$TPNAME4= <>
##$TPNAME5= <>
##$TPNAME6= <>
##$TPNAME7= <>
##$TPOAL= (0..7)
0.5 0.5 0.5 0.5 0.5 0.5 0.5 0.5 
##$TPOFFS= (0..7)
0 0 0 0 0 0 0 0 
##$TUNHIN= 0
##$TUNHOUT= 0
##$TUNXOUT= 0
##$USERA1= <user>
##$USERA2= <user>
##$USERA3= <user>
##$USERA4= <user>
##$USERA5= <user>
##$V9= 5
##$VALIST= <valist>
##$VCLIST= <CCCCCCCCCCCCCCC>
##$VD= 0
##$VDLIST= <DDDDDDDDDDDDDDD>
##$VPLIST= <PPPPPPPPPPPPPPP>
##$VTLIST= <TTTTTTTTTTTTTTT>
##$WBST= 1024
##$WBSW= 4
##$XGAIN= (0..3)
0 0 0 0 
##$XL= 0
##$YL= 0
##$YMAX_a= 268730
##$YMIN_a= -338008
##$ZGOPTNS= <>
##$ZL1= 120
##$ZL2= 120
##$ZL3= 120
##$ZL4= 120
##$ABSF1= 16.522
##$ABSF2= -4.171173
##$ABSG= 5
##$ABSL= 3
##$ALPHA= 0
##$AQORDER= 0
##$ASSFAC= 0
##$ASSFACI= 0
##$ASSFACX= 0
##$ASSWID= 0
##$AUNMP= <proc_1d>
##$AZFE= 0.1
##$AZFW= 0.1
##$BCFW= 0
##$BC_mod= 0
##$BYTORDP= 0
##$COROFFS= 0
##$CY= 12.5
##$DATMOD= 1
##$DC= 0
##$DFILT= <>
##$DTYPP= 0
##$F1P= 14.0000005364418
##$F2P= -0.99999901652339
##$FCOR= 0.5
##$FTSIZE= 32768
##$FT_mod= 6
##$GAMMA= 0
##$GB= 0
##$INTBC= 1
##$INTSCL= 1
##$ISEN= 128
##$LB= 0.3
##$LEV0= 0
##$LPBIN= 0
##$MAXI= 10000
##$MC2= 0
##$MEAN= 0
##$ME_mod= 0
##$MI= 0
##$NCOEF= 0
##$NC_proc= -5
##$NLEV= 6
##$NOISF1= 0
##$NOISF2= 0
##$NSP= 0
##$NTH_PI= 0
##$NZP= 0
##$OFFSET= 16.522
##$PC= 1
##$PHC0= 181.7054
##$PHC1= 1.15667
##$PH_mod= 1
##$PKNL= yes
##$PPARMOD= 0
##$PSCAL= 4
##$PSIGN= 0
##$REVERSE= no
##$SF= 250.13
##$SI= 32768
##$SIGF1= 0
##$SIGF2= 0
##$SINO= 400
##$SIOLD= 32768
##$SREGLST= <1H.CDCl3>
##$SSB= 0
##$STSI= 32768
##$STSR= 0
##$SW_p= 5175.98343685301
##$SYMM= 0
##$S_DEV= 0
##$TDeff= 65536
##$TDoff= 0
##$TI= <Analysis number 999999
Compound Code 99
Book Reference 9
Project Code 9>
##$TILT= no
##$TM1= 0
##$TM2= 0
##$TOPLEV= 0
##$USERP1= <user>
##$USERP2= <user>
##$USERP3= <user>
##$USERP4= <user>
##$USERP5= <user>
##$WDW= 1
##$XDIM= 32768
##$YMAX_p= 428202871
##$YMIN_p= -908595
$$ End of Bruker specific parameters
$$ ---------------------------------
##NTUPLES= NMR SPECTRUM
##VAR_NAME=  FREQUENCY,     SPECTRUM/REAL,   SPECTRUM/IMAG
##SYMBOL=    X,             R,               I
##VAR_TYPE=  INDEPENDENT,   DEPENDENT,       DEPENDENT
##VAR_FORM=  AFFN,          ASDF,            ASDF
##VAR_DIM=   32768,         32768,           32768
##UNITS=     HZ,            ARBITRARY UNITS, ARBITRARY UNITS
##FACTOR=    0.157963299565203, 1,           1
##FIRST=     4132.6476996994, 0,             0
##LAST=      -1043.33573715361, 0,           0
##MIN=       -1043.33573715361, -908595,     0
##MAX=       4132.6476996994, 428202871,     0
$$ Real data points
##PAGE= N=1
##DATA TABLE= (X++(R..R)), XYDATA
$$ [...]
23415i4570n6264J24098O4774N8244j55601K5048L7227r8649o050j0704J46145
$$ -94570 -150834 -26736 38038 96282 -59319 -34271 2956 -95693 -101743 -112447 33698
23404C3698L7706k86654L3037K55809J60911j45234j53092j61282J0187K03537
$$ 33698 71404 -215250 -182213 73596 234507 89273 -63819 -225101 -214914 -11377
23394a1377J09686j15867j04343j09651Q3184m5494r423j8088j35039K5512K38364
$$ -11377 98309 -17558 -121901 -231552 -148368 -193862 -203285 -221373 -356412 -330900 -92536
23383i2536K5382j88561N5132K40729Q6403k88357k38569k7028j88065J88895
$$ -92536 -67154 -255715 -200583 40146 126549 -161808 -400377 -427405 -615470 -426575
23373d26575Q7767L7059J82666m4641Q3640m6006j69760j9558K60880Q4662Q4689
$$ -426575 -338808 -301749 -119083 -163724 -80084 -126090 -295850 -315408 -54528 30134 114823
23362A14823M8953J3360J44929m0839M5180M9512J23531l84490k08647j138J84240
$$ 114823 163776 177136 322065 281226 326406 375918 499449 114959 -93688 -94826 89414
23351H9414n6346K2076k98489l2344J64806M9040J48003J9986j03128k4057P0992
$$ 89414 33068 55144 -243345 -275689 -110883 -61843 86160 106146 3018 -21039 49953
23340D9953j00318K2044k6904K04831K7667o4048K10715N8874k34681m79459J13425
$$ 49953 -50365 -28321 -55225 149606 177273 113225 323940 382814 148133 -331326 -217901
23329b17901K03742j54763Q2489M22368p5382k16878l6158j49028n7486O97l8775
$$ -217901 -14159 -168922 -86433 335935 260553 43675 7517 -141511 -198997 -198300 -237075
23318b37075j88505M16349J91907o8733j84072M6095k6509J03114q206j8840l15488
$$ -237075 -425580 -9231 182676 113943 -70129 -24034 -50543 52571 44365 25525 -289963
23307b89963N239q9915J02262J93192N8992J08262j15568o4927K943j4881O5841
$$ -289963 -284724 -374639 -272377 -79185 -20193 88069 -27499 -92426 -89483 -104364 -38523
23296c8523j80987l7100m4690m8418K22840Q2780J01402j7823j75094P5406K94863
$$ -38523 -219510 -256610 -301300 -349718 -126878 -44098 57304 39481 -135613 -60207 234656
23285B34656O6488k66692j94768J29243K08348J1395J7389k14691o2327J56438
$$ 234656 301144 34452 -160316 -31073 177275 188670 206059 -8632 -70959 85479
23275H5479J3878O2141k7097r6482r2261q7676M8928K13660j15994p4442K9955
$$ 85479 99357 161498 134401 37919 -54342 -142018 -93090 120570 4576 -69866 -39911
23264c9911l2163K93l02104k6876J75866K18109L1878l84m657j09676m9712N2394
$$ -39911 -72074 -71781 -373885 -400761 -224895 -6786 25092 24708 20051 -89625 -139337 -86943
23252h6943P3569o4242j717j68535O3259Q7686j01377M4954o3322k42203P1213
$$ -86943 -13374 -77616 -79333 -247868 -184609 -96923 -198300 -153346 -216668 -458871 -387658
23241c87658J12036p7622J65665o6333p7916R1511Q8842J92017M9164J9991m5532
$$ -387658 -275622 -353244 -187579 -253912 -331828 -240317 -151475 40542 89706 109697 64165
23230F4165O5649r1460j60881p295L06543j8387M1817j20045k33513r7804J22074
$$ 64165 129814 38354 -122527 -129822 176721 158334 200151 80106 -153407 -251211 -129137
23219a29137q0992K4555O6391J8484m0915K28331j9873k43722Q0879L08541L25307
$$ -129137 -210129 -185574 -119183 -100699 -141614 86717 66844 -176878 -95999 212542 537849
23208E37849N2171K1209m01219L1498N6499J88950q1858j30920J7968j95659j86598
$$ 537849 590020 611229 210010 241508 298007 486957 405099 274179 292147 96488 -90110
23197i0110l46842r5878J33818O9171k6222L5280K80232M1419j57773j89793N7741
$$ -90110 -436952 -532830 -399012 -329841 -356063 -320783 -40551 868 -156905 -346698 -288957
23186b88957K6275K59271J46204l42612r5521J10759R4075J27406l1122j60026
$$ -288957 -262682 -3411 142793 -199819 -295340 -184581 -90506 36900 5778 -154248
23176a54248Q294M1114J45559j8078n8703j63349K37234L3601k32032O7433k2040
$$ -154248 -145954 -104840 40719 22641 -36062 -199411 37823 71424 -160608 -93175 -115215
23165a15215k13973R2848J72495J29719J9731Q3872r7477j66032j2093m7617J84543
$$ -115215 -329188 -236340 -63845 65874 85605 169477 72000 -94032 -106125 -153742 30801
23154C0801J51199M6938l14569n1864J92672K28878p2919O459O1431p9060J68835
$$ 30801 182000 228938 -85631 -137495 55177 284055 211136 217595 279026 199966 368801
23143C68801L29235j1527j37552k45098p2825l54460j7674K38814J10060P247
$$ 368801 698036 686509 548957 303859 231034 -123426 -141100 97714 207774 215021
23133B15021o3272j19152J23774k53136k65411k71470J02350R2315l384K32144
$$ 215021 151749 32597 156371 -96765 -362176 -633646 -531296 -438981 -442365 -210221
23123b10221K21298p6994k02461J69852J76999J27036q8906O6337O4325j23871
$$ -210221 11077 -65917 -268378 -98526 78473 205509 116603 182940 247265 123394
23113A23394k85834p2347O3317Q1836j2185n1835n5881K39931K50404q183M6066
$$ 123394 -162440 -234787 -171470 -89634 -101819 -153654 -209535 30396 280800 272617 318683
23102C18683J411k20456l9951k7647N2456r4325l92074m2497J65991J05883Q228
$$ 318683 320094 99638 59687 32040 84496 -9829 -401903 -444400 -278409 -172526 -164298
23091a64298J58284Q9376j48105j37416J50065K39234N5877j22017k09555O5961
$$ -164298 -6014 83362 -64743 -202159 -52094 187140 243017 121000 -88555 -22594
23081b2594P8560J07580P46n4802j12774m13777n7231K6774M9791J67758j2547
$$ -22594 55966 163546 164292 109490 -3284 -417061 -474292 -447518 -397727 -229969 -242516
23070b42516j43260N8565R0515K91617R6478k10058k16434j3761K8131R8728J09229
$$ -242516 -385776 -327211 -236696 54921 151399 -58659 -275093 -288854 -260723 -161995 -52766
23059e2766k19756J32228P206J1792J02518Q2693j46759j62152l752J82107p3618
$$ -52766 -272522 -140294 -133088 -121296 -18778 63915 -82844 -244996 -248748 -66641 -140259
23048a40259q5283J72878M349j13159O5448l6801k91079m0506R0228R398j99392
$$ -140259 -225542 -52664 -48315 -161474 -96026 -132827 -423906 -464412 -374184 -364786 -564178
23037e64178Q7172o7135O6939J30103J55931Q6263P5988m4132J45377K48404k10212
$$ -564178 -477006 -544141 -477202 -347099 -191168 -104905 -28917 -73049 72328 320732 110520
23026A10520k87065N2685J09622j40101J8565J5949K88330K23077j27029k7802
$$ 110520 -176545 -123860 -14238 -154339 -135774 -119825 168505 391582 264553 236751
23016B36751j27570k81012M3563L8488J14087K2046j89569j27506j51605J69643
$$ 236751 109181 -171831 -128268 -89780 24307 46353 -143216 -270722 -422327 -252684
23006b52684K03225j8513R2007P556j70022L188Q5004J691n7671l11587k23679
$$ -252684 -49459 -67972 24035 31591 -138431 -135243 -50239 -48548 -106219 -417806 -641485
22995f41485J53430R9291K1820J25538o974J23191O2544K26255N4596l37373o3355
$$ -641485 -488055 -388764 -366944 -241406 -248380 -125189 -62645 163610 218206 -119167 -182522
22984a82522j1029J595O5892n7365l1082J9670J90097P7548j47690j39317J60375
$$ -182522 -193551 -191956 -126064 -183429 -214511 -194841 -4744 72804 -74886 -214203 -53828
22973e3828N4403J28014k5981k63918K5532P9014j34151n3071N1348L14309J4560
$$ -53828 575 128589 102608 -161310 -135778 -56764 -190915 -243986 -192638 121671 136231
22962A36231J49710j40584m0242n0935j93568n6672K7687J89284k9041j40324
$$ 136231 285941 145357 105115 54180 -139388 -196060 -168373 20911 -8130 -148454
22952a48454k55550l4234j08442K82018J66381j89740L1221K69285R5223r5466
$$ -148454 -404004 -438238 -546680 -264662 -98281 -288021 -256800 12485 107708 12242
22942A2242j42234j06882j2791M14267R4273k73451j38694n3901k4416j81582
$$ 12242 -129992 -236874 -249665 164602 258875 -14576 -153270 -207171 -231587 -413169
22932d13169l0737J77217K48062m7980n8357R9419K57377m488l4418l33767m9699
$$ -413169 -443906 -266689 -18627 -66607 -124964 -25545 231832 227344 192926 -140841 -190540
22921a90540M37676Q808m6397J33459p9361K7345J73444j91123M4768k34061k19823
$$ -190540 247136 255944 209547 343006 263645 290990 464434 273311 318079 84018 -135805
22910a35805M1163J88736J78077L2450l22258k22600j1392o9394J42337K89779
$$ -135805 -94642 94094 272171 304621 -17637 -240237 -251629 -321023 -178686 111093
22900A11093K20697J49968k5143k09002k41939K922o6382j628l644R7673j68706
$$ 111093 331790 481758 456615 247613 5674 8596 -57786 -59414 -63058 34615 -134091
22889a34091J5368j68496j05207J02031J43389l3793K07711J00162j62857j20878
$$ -134091 -118723 -287219 -392426 -290395 -147006 -180799 26912 127074 -35783 -156661
22879a56661k922n332J17127l2362q1467J0791r0929R5908K81264J89512L934
$$ -156661 -159583 -164915 -47788 -80150 -161617 -150826 -241755 -145847 135417 324929 328863
22868C28863j17347j14969M3715J30754M7845k76334j78727k09170P9019j1167
$$ 328863 211516 96547 140262 271016 318861 42527 -136200 -345370 -266351 -277518
22858b77518r659K41318l18702o1998J02348j6753L97961L87321o5543k52178
$$ -277518 -287177 -45859 -364561 -426559 -324211 -340964 56997 444318 378775 126597
22848A26597q1073K391J58042J04427j5976l48793k14936J14162l9655K8030j50709
$$ 126597 45524 47915 205957 310384 294408 -54385 -269321 -155159 -194814 -166784 -317493
22837c17493l9855J34918J00911N0704R0472n0205k39926m4018j22628L9704J00065
$$ -317493 -357348 -222430 -121519 -70815 19657 -30548 -270474 -314492 -437120 -397416 -297351
22826b97351J17984j71520J6928J30774K34962Q2350L2072L89788K67472j22602
$$ -297351 -179367 -350887 -333959 -203185 31777 114127 146199 535987 803459 680857
22816F80857k78009j73138q0896L6401K23932R2177j52528r0527l9963k6905j39386
$$ 680857 402848 229710 148814 185215 409147 501324 348796 258269 218306 191401 52015
22805E2015k05446R1432K99544l5824j76459P3812J23153N2617k46J05904k5065
$$ 52015 -153431 -61999 237545 201721 25262 99074 222227 274844 274598 380502 355437
22794C55437l67649l34256P6734J37274J56009P7607j50553l07170j04078K42364
$$ 355437 -12212 -346468 -269734 -132460 23549 101156 -49397 -356567 -460645 -218281
22784b18281N65151j46931k60417j00796p7983p7184j22181R8598L671k01076
$$ -218281 346870 199939 -60478 -161274 -239257 -316441 -438622 -340024 -336353 -537429
22774e37429K76197J11464J49074M5074R247J65018P941o9233L4965J60511p5159
$$ -537429 -261232 -149768 -694 44380 53627 218645 226586 157353 192318 352829 277670
22763B77670j65064j56499l1190j21375M5048J41935j2880P1414P988J51527o5876
$$ 277670 112606 -43893 -75083 -196458 -151410 -9475 -22355 49059 57047 208574 142698
22752A42698l672L4687k34007o3113O6302k7582J94990k07698r036K2360J68654
$$ 142698 139026 173713 -60294 -123407 -57105 -84687 110303 -97395 -106431 -84071 84583
22741H4583J39817j80546Q7644k18972j85354K10760K11773M6247k38500R8839
$$ 84583 224400 43854 131498 -87474 -272828 -62068 149705 195952 -42548 56291
22731E6291J38907k47965k26501R592J08583J27833J05026K41811k51778k05636
$$ 56291 195198 -52767 -279268 -269676 -161093 -33260 71766 313577 61799 -143837
22721a43837K44637L9855J02107K69432m1362k51929k54992o2592K25925j40550
$$ -143837 100800 140655 242762 512194 470832 218903 -36089 -98681 127244 -13306
22711a3306L06283K69451j71906k66858l01719j7398n005M3287L64126K79011
$$ -13306 292977 562428 390522 123664 -178055 -195453 -200458 -157171 206955 485966
22701D85966j45380k02174l5972K8379l25462j80721J31683M34385P803O9092
$$ 485966 340586 138412 102440 130819 -194643 -375364 -243681 190704 198507 267599
22691B67599l2323M3802j14226j9640M7993p9085o8036k2205L13603j85623j26293
$$ 267599 235276 279078 164852 145212 193205 114120 46084 23879 337482 151859 25566
22680B5566k62986j33916M7533q3631K08547q0504q9196K43084L3872p8859J11687
$$ 25566 -237420 -371336 -323803 -407434 -198887 -279391 -368587 -125503 -91631 -170490 -58803
22669e8803J46699J26951j94954l21926j11675r9139J3321k4307J61467k1798
$$ -58803 87896 214847 19893 -302033 -413708 -512847 -499526 -523833 -362366 -384164
22659c84164j02585J53898J37892k8080j54040J00612r7882J9513Q8072j6767
$$ -384164 -486749 -332851 -194959 -223039 -377079 -276467 -374349 -354836 -266764 -283531
22649b83531J76276K9966p3501R329Q6538P930N1024J41469K43539m0516j33707
$$ -283531 -107255 -77289 -150790 -141461 -54923 -46993 4031 145500 389039 348523 214816
22638B14816m8551j90579J69079j34053j13545M9948j34456k26549Q3125J90061
$$ 214816 166265 -24314 144765 10712 -102833 -52885 -187341 -413890 -330765 -140704
22628a40704o5623j395M4187R1606J73767L6344p4281N1649J26417k03538j77919
$$ -140704 -206327 -207722 -163535 -71929 101838 138182 63901 115550 241967 38429 -139490
22617a39490J10522j58225p5042J18157M4571j46121J06537r6565l6422O829J45259
$$ -139490 -28968 -187193 -262235 -144078 -99507 -245628 -139091 -235656 -272078 -265249 -119990
22606a19990J82268j06428L8237K04472R0986J13388k22326J25043J74282k88467
$$ -119990 62278 -44150 -5913 198559 289545 402933 180607 305650 479932 191465
22596A91465N9048M9551k58949q2945Q3904j3784m301j13237j21421J72379J30043
$$ 191465 250513 300064 41115 -41830 42074 28290 23989 -89248 -210669 -38290 91753
22585I1753j0683L1785j23010r8034K4449J4517j72621j4743J90740M2490j95158
$$ 91753 81070 112855 -10155 -108189 -83740 -69223 -241844 -256587 -65847 -23357 -218515
22574b18515J30759q9229k38259N1487K18196N403J18057L11484P6841k39406
$$ -218515 -87756 -176985 -415244 -363757 -145561 -140158 -22101 289383 366224 126818
22564A26818j49943j1973P0471J25475j2216q5971K92275O6395q3809q4656O551
$$ 126818 -23125 -35098 35373 160848 148632 62661 354936 421331 337522 252866 259417
22553B59417l2817j12804j05199K29896l2490k04194j73239j10665K897J4612
$$ 259417 226600 113796 8597 238493 206003 1809 -171430 -282095 -279198 -264586
22543b64586L0006P954K4356o7768K70864K41155k10297j41805J78986J09546
$$ -264586 -234580 -226626 -202270 -270038 826 241981 31684 -110121 68865 178411
22533A78411j45231j09377J33764J15160n4037l46810j11773M0371K63046J15944
$$ 178411 33180 -76197 57567 172727 118690 -228120 -339893 -299522 -36476 79468
22523G9468j84584k34641J90115J75002P0126R7495j45253N4938J57003R8106
$$ 79468 -105116 -339757 -149642 25360 95486 192981 47728 102666 259669 357775
22513C57775r8266j16738L3559j26384R3685j78623j31089J4613k43101j3872
$$ 357775 259509 142771 176330 49946 143631 -34992 -166081 -151468 -394569 -408441
22503d08441j88985m5706R2354J54953l00069L1117N32474K19441j75885q9070
$$ -408441 -597426 -643132 -550778 -395825 -695894 -664777 -132303 87138 -88747 -177817
22493a77817J34480J53786p0433l6928P4671N2814k7068j38465l3327o5482j66772
$$ -177817 -43337 110449 40016 3088 77759 130573 103505 -34960 -68287 -133769 -300541
22482c00541Q5489J62114J77150L8470p5111R2477m821l14356j19943J66548l7885
$$ -300541 -215052 -52938 124212 162682 87571 180048 175227 -139129 -259072 -92524 -130409
22471a30409j24792p2694R9493n7727J17450P7841O986m6681J197m0793p8172
$$ -130409 -255201 -327895 -228402 -286129 -168679 -90838 -83852 -130533 -129336 -170129 -248301
22460b48301k27405J39120M78560J1942j4625J48007Q8206k34722J64216o5137
$$ -248301 -475706 -336586 141974 153916 139291 287298 375504 140782 304998 239861
22450B39861j63060J47407O6075R4217k50482j91206J61353J06198j73273k11790
$$ 239861 76801 224208 290283 384500 134018 -57188 104165 210363 37090 -174700
22440a74700K1249k4219j27731M7041n8426L33047R2142l6722j36401j01922l2626
$$ -174700 -153451 -177670 -305401 -258360 -316786 16261 108403 71681 -64720 -166642 -199268
22429a99268j504J67000j8637j45028P1011M7573k17410L6228K8581j7436j74033
$$ -199268 -200772 -33772 -52409 -197437 -126426 -78853 -296263 -260035 -231454 -248890 -422923
22418d22923M8980J30621r425J51915J38431p0015k1022p6051k08673K6624j83998
$$ -422923 -373943 -243322 -252747 -100832 37599 -32416 -53438 -129489 -338162 -311538 -495536
22407d95536M9569N4262J23087J61193L4273K57611M8551l55753k01158M6571
$$ -495536 -445967 -391705 -268618 -107425 -73152 184459 233010 -122743 -323901 -277330
22397b77330N3990J34688j08685N1945J79992j957o6235K8191j19646J6375M4346
$$ -277330 -223340 -88652 -197337 -145392 34600 32643 -33592 -5401 -125047 -108672 -64326
22386f4326M5567j48859j01849J62140M5214j96284J30903J20214K8255L16770
$$ -64326 -18759 -167618 -269467 -107327 -62113 -258397 -127494 -7280 20975 337745
22376C37745Q7684k98629k7361j64201L7843J6639q8068n2122j31712J79316M7335
$$ 337745 425429 126800 99439 -64762 -26919 -10280 -98348 -150470 -282182 -102866 -55531
22365e5531k79306j47604p0109L9670P1422J75329j7905J20001J4522M1612K59913
$$ -55531 -334837 -482441 -552550 -512880 -441458 -266129 -284034 -164033 -149511 -107899 152014
22354A52014r4909k16556j3718M08658K60456J19459K0270j18132l22900k82819
$$ 152014 57105 -159451 -173169 235489 495945 615404 635674 517542 194642 -88177
22344h8177j52833l42182Q0387K28054J00196L25503J52870j68033j78560K7319
$$ -88177 -241010 -583192 -502805 -274751 -174555 150948 303818 135785 -42775 -15456
22334a5456l6923j13722k14131j03332J05305L87874J36732J97054J68892K0098
$$ -15456 -52379 -166101 -380232 -483564 -378259 9615 146347 343401 512293 532391
22324E32391k24940o5191l16164m68358j58326J77303K89364l4949k54328J69814
$$ 532391 307451 242260 -73904 -542262 -700588 -523285 -233921 -268870 -523198 -353384
22314c53384J91700J42004l2795R959j13641J07448J81526J30870j51955k84922
$$ -353384 -161684 -19680 -52475 -42516 -156157 -48709 132817 263687 111732 -173190
22304a73190l8453p342J8925K48380K05019o6858o8441k21776J068O8069O1774
$$ -173190 -211643 -218985 -200060 48320 253339 186481 118040 -103736 -102668 -34599 27175
22293B7175l165J54339j12826J02148j76450L7951q6034k45797j41355m1796K01062
$$ 27175 24010 178349 65523 167671 -8779 29172 -56862 -302659 -444014 -485810 -284748
22282b84748L82714J09321j66082N90m4568j98481l5689j158J30386j20380m17783
$$ -284748 97966 207287 41205 41795 -2773 -201254 -236943 -238101 -107715 -228095 -645878
22271f45878N2284K93657K95583L25121j46244j93603q5240J71707n9071R9828
$$ -645878 -593594 -299937 -4354 320767 174523 -19080 -104320 67387 8316 108144
22261A08144J99090J02640j50411j79913P6705K02600k9105j31662j7965K0149
$$ 108144 307234 409874 259463 79550 156255 358855 329750 198088 180123 200272
22251B00272k28914j29429j27894R9481M4282O254J02169j77426j87006K68721
$$ 200272 -28642 -158071 -285965 -186484 -142202 -135948 -33779 -211205 -398211 -129490
22241a29490L04135J87358j48957m23289O3322P8553P9923K04863J80082j56426
$$ -129490 174645 362003 213046 -210243 -146921 -68368 11555 216418 396500 240074
22231B40074j35044j8119p6947K4966R9056q8015K9715J57940m0971r3628k11013
$$ 240074 105030 86911 9964 34930 133986 45971 75686 233626 192655 99027 -111986
22220a11986J5004J30119J36496n6507j05574k04774J13160j74318j21553M5178
$$ -111986 -96982 33137 169633 113126 7552 -197222 -84062 -258380 -379933 -334755
22210c34755J07440J72141j40603J02371Q3400j43377M0947J02368j2476m6303
$$ -334755 -227315 -55174 -195777 -93406 -10006 -153383 -112436 -10068 -22544 -68847
22200f8847R3644j65855O2788Q3126j56792M8727k40056j17947M0951J76570J57532
$$ -68847 24797 -141058 -78270 4856 -151936 -103209 -343265 -461212 -420261 -243691 -86159
22189h6159L5782J1090j39613j12318L2027L32592K81063N5035m5534k79595j48112
$$ -86159 -50377 -39287 -178900 -291218 -259191 73401 354464 409499 363965 84370 -63742
22178f3742n5154j17559j6813N0236R3233j23120j15694K11731M8898j01959M8492
$$ -63742 -118896 -236455 -253268 -203032 -109799 -232919 -348613 -136882 -87984 -189943 -141451
22167a41451L5236P8789P5554m458n6888j07078O3923K39147o4145l29941j61581
$$ -141451 -106215 -27426 48128 43670 -13218 -120296 -56373 182774 118629 -211312 -372893
22156c72893K43561K48933P8418R7740p3739j11552M2339o2993K2970m1986l7560
$$ -372893 -129332 119601 198019 295759 222020 110468 152807 89814 112784 70798 33238
22145C3238m2998j82691K19210L22540j2848k21194o2536k3492L6317k8747l17538
$$ 33238 -9760 -192451 26759 349299 336451 115257 52721 29229 65546 36799 -280739
22134b80739r2944J68934m5728L6786K65347J32893j92522k10039j21807K87968
$$ -280739 -373683 -204749 -250477 -213691 51656 184549 -7973 -218012 -339819 -51851
22124e1851K21766M2010j83650K118o1602J50057L00118p1188J7723N9565n4270
$$ -51851 169915 211925 28275 30393 -31209 118848 418966 347778 365501 425066 370796
22113C70796J3887j14939k25264k20354j24444j00893r7105R1278R3145j71524
$$ 370796 384683 269744 44480 -175874 -300318 -401211 -498316 -407038 -313893 -485417
22103d85417J4136J61139L6905J42458P48R7102M1351k36523O3187P6557j08675
$$ -485417 -471281 -310142 -273237 -130779 -130031 -32929 8422 -228101 -164914 -88357 -197032
22092a97032K25032o9888O2041l6350j50064p5882k2664o1420J00933L2992R9692
$$ -197032 28000 -41888 20153 -16197 -166261 -242143 -264807 -326227 -225294 -192302 -92610
22081i2610J18371J77655k62778q989j7021r4751M9544L3315Q9502k79137j8578
$$ -92610 25761 203416 -59362 -68351 -85372 -180123 -130579 -97264 -7762 -286899 -305477
22070c05477Q7203J38345p1423l43423K21975J13857K65442J87363k75425k57779
$$ -305477 -218274 -79929 -151352 -494775 -272800 -158943 106499 293862 18437 -239342
22060b39342K96048R5039k26583j58748M6426K13164l4080J1848J0678Q9375k66656
$$ -239342 56706 151745 -74838 -233586 -187160 26004 -8076 3772 14450 103825 -162831
22049a62831j76186m1487J83298J34017r6693o7094O7781r1386N5211O8603J61619
$$ -162831 -339017 -380504 -197206 -63189 -159882 -226976 -159195 -250581 -195370 -126767 34852
22038C4852J83398k09595J03721R9517j92233J13244R5275L3012p3034J00777
$$ 34852 218250 8655 112376 211893 19660 132904 228179 261191 188157 288934
22028B88934J6715N4545j08109r3832N8201l19673j40740J78832n4332j02535
$$ 288934 305649 360194 252085 158253 216454 -103219 -243959 -65127 -119459 -221994
22018b21994J28925M1745j58868j43827q0593K3348J07541k8169j8718k4727L06595
$$ -221994 -93069 -51324 -210192 -354019 -434612 -411264 -303723 -331892 -350610 -375337 -68742
22007f8742J60415q5176J39050j91867j69472O4439k0611k17612R6553o8584q9179
$$ -68742 91673 6497 145547 -46320 -215792 -151353 -171964 -389576 -293023 -361607 -450786
21996d50786K29142J87105K6293o6194J35596J46242m9291k18208K30439P2332
$$ -450786 -221644 -34539 -8246 -74440 61156 207398 158107 -60101 170338 242670
21986B42670j70270j99907L3547J83551P6698j32325k5544K56169L9892j29303
$$ 242670 72400 -127507 -93960 89591 166289 33964 8420 264589 304481 175178
21976A75178j74880k09288j86279K0864K51663J91772R6536j42285k19174K691
$$ 175178 298 -208990 -395269 -374405 -122742 69030 165566 23281 -195893 -193202
21966a93202m0234j23484r1558J72517M5238J71068R052M8444k04689j32554J12804
$$ -193202 -233436 -356920 -448478 -275961 -230723 -59655 -50603 -2159 -206848 -339402 -226598
21955b26598j92501k31365p5471K92242J66513Q184j25195K7099k61574J81296
$$ -226598 -419099 -650464 -725935 -433693 -267180 -258996 -384191 -357092 -618666 -437370
21945d37370J17411K75980q563K39761K18655k00537k39088J00429k5529p4730
$$ -437370 -319959 -43979 -52542 187219 405874 205337 -33751 66678 41149 -33581
21935c3581j84643O740R9939J72622p4503j36432j2943j19430M4703P2804O9214
$$ -33581 -218224 -211484 -111545 61077 -13426 -149858 -162801 -282231 -237528 -164724 -95510
21924i5510J28546K21080m0219k6259k83056r8661J79320O3240K8334j59835j64566
$$ -95510 33036 254116 213897 187638 -95418 -194079 -14759 48481 76815 -83020 -247586
21913b47586j46467j04996Q8233j0242K36037L23652j65978k98983O0699J10445
$$ -247586 -394053 -499049 -410816 -421058 -185021 138631 -27347 -326330 -265631 -155186
21903a55186L56821J21954M7034m2319k51154j98637N3943P3860p2372m2502J28581
$$ -155186 201635 323589 370623 328304 77150 -121487 -67544 6316 -66056 -108558 20023
21892B0023K17053j56821l44447j04288j37726N6693L08008K63281N346j9419
$$ 20023 237076 80255 -264192 -368480 -506206 -449513 -141505 121776 127122 107703
21882A07703q660l31333j5182r4066M7845N9384j7875k0766l617M6831N3755R9542
$$ 107703 99043 -232290 -247472 -341538 -293693 -234309 -252184 -272950 -276567 -229736 -175981 -76439
21870g6439m7945K30074K21712o3598l43476l86623K576J09379L19982L19738
$$ -76439 -124384 105690 327402 263804 -79672 -466295 -463719 -354340 -34358 285380
21860B85380q7392k01634r3027P7623J4405J1761L523J59808R7174k52151k25722
$$ 285380 197988 -3646 -96673 -19050 -4645 7116 10639 170447 267621 15470 -210252
21849b10252N6292J66615K7082m31653k65244r682Q157K65160K30578K00017r3974
$$ -210252 -153960 12655 39737 -391916 -657160 -666842 -658685 -393525 -162947 37070 -56904
21838e6904j56049K12036j6224k1225Q3918l885N0940p6999J65951Q1745n0084
$$ -56904 -212953 -917 -17141 -38366 45552 41667 92607 15608 181559 263304 213220
21827B13220k8251k10434j03081j08268L9880J51976m4265j71363o601K61947
$$ 213220 184969 -25465 -128546 -236814 -196934 -44958 -89223 -260586 -267187 -5240
21817e240K93052j07766l29548k83101M3844m5120R0887k1156O8451J16734R2095
$$ -5240 287812 180046 -149502 -432603 -388759 -433879 -342992 -364148 -295697 -178963 -86868
21806h6868J21577o3965p8919j86070J38143P9023p0174r6679k67693j92519J34137
$$ -86868 34709 -29256 -108175 -294245 -156102 -77079 -147253 -243932 -511625 -704144 -570007
21795e70007K98669K95209j13871r8059K64712j2143k83861j61424K3773J10901
$$ -570007 -271338 23871 -90000 -188059 76653 64510 -219351 -380775 -357002 -246101
21785b46101K10540o9597j42942K6469q8589p9077Q4595K75891J99466O6002K20863
$$ -246101 -35561 -105158 -248100 -221631 -310220 -389297 -304702 -28811 170655 236657 457520
21774D57520r9224j595q0210j03611l13335N3693K16964M17005K9343J82133j50769
$$ 457520 358296 356701 276491 172880 -140455 -86762 130202 547207 576550 758683 607914
21763F07914k03356j03756m5111j25083K9316j6832l39096k13328o0886J834m1291
$$ 607914 404558 300802 255691 130608 159924 143092 -196004 -409332 -470218 -468384 -509675
21752e09675J02548L17189J5976j4925j21388K8254O1777k77519m38846K45252
$$ -509675 -407127 -89938 -73962 -88887 -210275 -182021 -120244 -397763 -836609 -591357
21742e91357L34308j00419j6261J93374N3260M3246N1015n9902j946J37731j56210
$$ -591357 -257049 -357468 -373729 -180355 -127095 -83849 -32834 -92736 -94682 43049 -113161
21731a13161j75298K21760K52080P7880j62239j9537J70126k13386k26033l3587
$$ -113161 -288459 -66699 185381 263261 101022 81485 251611 38225 -187808 -221395
21721b21395K57208o0178j40137O8297M2255j49548k47963L7353J26674Q7976
$$ -221395 35813 -24365 -164502 -96205 -53950 -203498 -451461 -414108 -287434 -199458
21711a99458K31167K62575J14841n9360j28077J25094j82617m0430j44780j44140
$$ -199458 31709 294284 409125 349765 221688 346782 164165 123735 -21045 -165185
21701a65185J06405K88896j74952o123J41310n4076j09227n410r5370k34800J64739
$$ -165185 -58780 230116 55164 49041 190351 136275 27048 21638 -73732 -308532 -143793
21690a43793j5097o2358p8861j33183J24940J76530j26016M4421J43452M00627
$$ -143793 -158890 -221248 -300109 -433292 -308352 -131822 -257838 -213417 -69965 330662
21680C30662m383j89528N9146k31485k94617L5224J16132K609K6884R8282J23959
$$ 330662 326279 136751 195897 -35588 -330205 -294981 -178849 -176240 -149356 -51074 72885
21669G2885o2472m638j095o1605O3346M5811m2386l1239k30900j15271l2430K20197
$$ 72885 10413 5775 4680 -56925 6421 52232 9846 -21393 -252293 -367564 -399994 -179797
21657a79797J11172J4349M0045j57514k21849R5183L94431R0121m8984l34179
$$ -179797 -68625 -54276 -14231 -171745 -393594 -298411 96020 186141 137157 -197022
21647a97022q4541m7678j7970O6170o8247l49327J05283N17434L39614J00843
$$ -197022 -281563 -329241 -347211 -281041 -349288 -698615 -593332 -75898 263716 364559
21637C64559M2247j09648k32655k09258O4205J09214K75330P0656J57208q7419
$$ 364559 406806 297158 64503 -144755 -80550 28664 303994 374650 531858 444439
21627D44439l24368n1839K19684J29116q0982j16698j26297n5837N1527l353j47556
$$ 444439 120071 68232 287916 417032 336050 219352 93055 37218 88745 85392 -62164
21616f2164K93j30744l18883P4127N1815K05368J43511p9179L0508l0813m3048
$$ -62164 -61871 -192615 -511498 -437371 -385556 -180188 -36677 -115856 -85348 -116161 -159209
21605a59209K71016Q8332j79820m4679j65025p7634K60066J08128J09770j92817
$$ -159209 111807 200139 20319 -24360 -189385 -267019 -6953 101175 210945 18128
21595A8128j73330j03998Q7006K44973k60169o025K5641J02096M2297k70597N2653
$$ 18128 -155202 -259200 -172194 72779 -187390 -193415 -167774 -65678 -23381 -293978 -241325
21584b41325K46963J0839j10010J69581j96110K7699P0297O4012n9887J6009j00541
$$ -241325 5638 16477 -93533 76048 -120062 -92363 -22066 41946 -17941 -1932 -102473
21573a02473j38882K87212J34631m8209K01262l7062j53620N0712m2291j6864
$$ -102473 -241355 45857 180488 132279 333541 296479 142859 193571 151280 134416
21563A34416P2792J5250J27515k62047l09262J55762J9554j7237P8321J19240
$$ 134416 207208 222458 349973 87926 -221336 -65574 -46020 -63257 15064 134304
21553A34304j02020m66558k22388K65059L70233Q2023l9715M6019K436j80135
$$ 134304 32284 -434274 -656662 -391603 -21370 60653 20938 66957 69393 -110742
21543a10742n2763L3277k260m991K83763J7478k523J50047J8735j81359L5361
$$ -110742 -163505 -130228 -132488 -137479 146284 163762 161239 311286 330021 148662 184023
21532A84023j24518m6108m3597J37047K49350m7361m50250p5931k56970j80695
$$ 184023 59505 13397 -30200 106847 356197 308836 -141414 -217345 -474315 -655010
21522f55010J23162R1960J51242l0439P0790l7574Q6213M927K84898K3247j13258
$$ -655010 -531848 -439888 -288646 -319085 -248295 -285869 -199656 -194729 90169 113416 158
21511A58j9620j59519J43204k3404j75708J64075L6238l65385r8906M47404J58056
$$ 158 -19462 -178981 -35777 -59181 -234889 -70814 -34576 -399961 -498867 -51463 106593
21500A06593q6282l56326j20340M4357J69299J40935q5320K87310K22339j21847
$$ 106593 20311 -336015 -456355 -411998 -242699 -101764 -187084 100226 322565 200718
21490B00718m5324N6252l2477k62263n1558j36494K55675J99180J57379O1695
$$ 200718 155394 211646 179169 -83094 -134652 -271146 -15471 183709 341088 402783
21480D02783j35004j69254k69717j83550J31361J21091J53507J22916q602j52876
$$ 402783 267779 98525 -171192 -354742 -223381 -102290 51217 174133 165531 12655
21470A2655l13775k33537K16474L27108n8413p4134j43021K1156l7221P2858n1408
$$ 12655 -301120 -534657 -318183 8925 -49488 -123622 -266643 -245487 -282708 -209850 -261258
21459b61258j30144q3273J21784M5408Q5130K9768l8551R6814P8611j33982K1513
$$ -261258 -391402 -474675 -352891 -307483 -222353 -192585 -231136 -134322 -55711 -189693 -168180
21448a68180K1983p8828j03809J97010l9958k09782J74788J12608Q7708M1136
$$ -168180 -146197 -225025 -328834 -131824 -171782 -381564 -206776 -94168 -6460 34676
21438C4676l9231m2923j72670J4252R8576J53012j4419j96067p7812J36662j61683
$$ 34676 -4555 -47478 -220148 -205896 -107320 45692 31273 -164794 -242606 -105944 -267627
21427b67627Q738K00891j22903j71063J05646K4856O1545J55185j40111m5421
$$ -267627 -258889 -57998 -180901 -351964 -246318 -221462 -159917 -4732 -144843 -190264
21417a90264N4627j31908K4190P4393p3597q3503J77377K34791J5003K2475J57434
$$ -190264 -135637 -267545 -243355 -168962 -242559 -326062 -148685 86106 101109 123584 281018
21406B81018p38j64716j46131j58733O6284r2826j57096r1274O2385K48340J59815
$$ 281018 280280 115564 -30567 -189300 -123016 -215842 -372938 -464212 -401827 -153487 6328
21395F328K19189k46567j24609J60031R5260p9695R6073J61942k49928k33998
$$ 6328 225517 -21050 -145659 14372 109632 29937 126010 287952 38024 -195974
21385a95974Q1628L9695J66752k63933j72647N121p779K47714J41774K8757k79869
$$ -195974 -114346 -74651 92101 -171832 -344479 -339358 -347137 -99423 42351 71108 -208761
21374b08761k82331k11156M2859M38438J17830J01306J37865J61153o327J13296
$$ -208761 -491092 -702248 -659389 -220951 -103121 -1815 136050 297203 290876 404172
21364D04172k82996k60707j07731j03807j71013Q5887K44043O1149o0112J74001
$$ 404172 121176 -139531 -247262 -351069 -522082 -436195 -192152 -131003 -191115 -17114
21354a7114L93398J26196k36171k91596J70419p895r3421n6635n3493J06354q6153
$$ -17114 376284 502480 266309 -25287 145132 137237 43816 -12819 -66312 40042 -46111
21343d6111J10900J39543O6040J3361k13669k60190q8042Q5192J40339J08687
$$ -46111 64789 204332 270372 283733 70064 -190126 -278168 -192976 -52637 56050
21333E6050n4626Q6641j6232l2998J6925j82789p6869J82057o9070l4509j84466
$$ 56050 1424 88065 71833 38835 55760 -127029 -203898 -21841 -90911 -125420 -309886
21322c09886j9414J50228J69542J15160l712n4428l21604m7962J59107j83223
$$ -309886 -329300 -179072 -9530 105630 101918 47490 -274114 -322076 -162969 -346192
21312c46192j0238J85850n338J40912J56213j29177k2062N8559L335j90520Q5221
$$ -346192 -356430 -170580 -175918 -35006 121207 -7970 -30032 28527 31862 -158658 -73437
21301g3437K32453O8248O3902L4907M6776p0221j25568j21671o5027J49533k5847
$$ -73437 159016 227264 291166 326073 372849 302628 177060 55389 -9638 139895 114048
21290A14048j69928m29349j01928k8748O9589L40769O9082j07176K9096J73418
$$ 114048 -55880 -485229 -587157 -615905 -546316 -205547 -136465 -243641 -214545 -41127
21280d1127K19807p9532l08216J48524K26996K26973j38716l20260K1181l2023
$$ -41127 178680 99148 -209068 -60544 166452 393425 254709 -65551 -44370 -76393
21270g6393J01434K09583j9660k05173K15714O1286j80225K64935O4380k28739
$$ -76393 25041 234624 214964 9791 225505 286791 106566 371501 435881 207142
21260B07142L9683k58995k58717k47111J65918J89251J78379m3504l9109k0695
$$ 207142 246825 -12170 -270887 -517998 -352080 -162829 15550 -27954 -67063 -87758
21250h7758p5414K11512P175l2200M4440L0132N6701k86333p8220J26895j7967
$$ -87758 -163172 48340 55515 23315 67755 97887 154588 -131745 -209965 -83070 -101037
21239a01037p4034J47542q5958p6084O4452L2281l6352J65844m3088o0548J09203
$$ -101037 -175071 -27529 -113487 -189571 -125119 -92838 -129190 36654 -6434 -66982 42221
21228D2221k24012k5318j11216n0944j40477J02612m220p7154j8058J44197k23202
$$ 42221 -181791 -207109 -318325 -369269 -509746 -407134 -411354 -488508 -506566 -362369 -585571
21217e85571j19311Q8649J87735k59458J39318l8179J94198K07932k2533j49585
$$ -585571 -704882 -616233 -428498 -687956 -548638 -586817 -392619 -184687 -207220 -356805
21207c56805j1038R5689Q6968K26000J23751q7665J19920M6462j72320j02103
$$ -356805 -367843 -272154 -185186 40814 164565 76900 196820 243282 70962 -31141
21197c1141k260M3011j68109o497R5844L1251J23746N9083j10533o3915J20063
$$ -31141 -33401 9610 -158499 -164996 -69152 -37901 85845 144928 34395 -29520 90543
21186I0543O2575o2374l1061k620J16655k22587K00658J43643P6610q7984j54922
$$ 90543 153118 90744 59683 57063 173718 -48869 151789 295432 372042 284058 129136
21175A29136K26552K0384j50669K0492j31693k25736j13216Q0841J34805J85561
$$ 129136 355688 376072 225403 245895 114202 -111534 -224750 -143909 -9104 176457
21165A76457k51407j20294K12146R9451k04625J30243J17977j11454J68980m4002
$$ 176457 -74950 -195244 16902 116353 -88272 41971 159948 48494 217474 173472
21155A73472j15587l2789j76722k1703N4081j16521m0230M8946Q6359j87891j67535
$$ 173472 57885 25096 -151626 -173329 -119248 -235769 -275999 -227053 -140694 -328585 -496120
21144d96120n6837J64142l2812j27364P0148Q7084N7242J97939O9068J27653J00704
$$ -496120 -552957 -388815 -421627 -548991 -478843 -391759 -334517 -136578 -67510 60143 160847
21133A60847o5709j97136Q241o6516j98191J88955K00009p385l4727k5534l5708
$$ 160847 95138 -101998 -93757 -160273 -358464 -169509 30500 23115 -11612 -37146 -72854
21122g2854q0820J8880R1228J15364J1919N4755K39785r0054L548O700k19865
$$ -72854 -153674 -134794 -43566 71798 83717 138472 378257 288203 291751 298451 78586
21111G8586k15748N7170K00117q649k90030R8141j81213j4945J0596K58423J02440
$$ 78586 -137162 -79992 120125 111476 -178554 -80413 -261626 -276571 -265975 -7552 94888
21100I4888k16280j65857K02635K52330J34421J25588j00862k12296k34074j30792
$$ 94888 -121392 -287249 -84614 167716 302137 427725 326863 114567 -119507 -250299
21090b50299O1330L29712K99560j86851j31727p4230j73761j69161m0088p4649
$$ -250299 -188969 140743 440303 253452 121725 47495 -126266 -295427 -335515 -410164
21080d10164K40373J85603k071q6784k40671J67202N1127q4277K4255J95585J80690
$$ -410164 -169791 15812 13741 -73043 -313714 -146512 -95385 -179662 -155407 40178 220868
21069B20868j28166k2016n5940J5354n7080J60189K7073K15258j10520j75414
$$ 220868 92702 70686 14746 30100 -26980 133209 160282 375540 265020 89606
21059H9606m9005J01903Q604k17966j24535j59005Q4601L6238j24526j80753J13009
$$ 89606 40601 142504 151108 -66858 -191393 -350398 -265797 -229559 -354085 -534838 -421829
21048d21829K17625J66820R1403q3379L09399R0861l04672j24497p8850P5118
$$ -421829 -204204 -37384 54019 -29360 280039 370900 66228 -58269 -137119 -62001
21038f2001P0247m3440j9382k7433j37682J47604N621M8397k2969l19069j99278
$$ -62001 8246 -35194 -54576 -82009 -219691 -72087 -66466 -18069 -41038 -360107 -559385
21027e59385k04793J00307K27750M38527J7819k52680k23362l7858R5854j6879
$$ -559385 -764178 -663871 -436121 2406 20225 -232455 -455817 -493675 -397821 -414700
21017d14700J08389K35692J9679j30297j71233P3084J64311L0879J13491j42360
$$ -414700 -306311 -70619 -50940 -181237 -352470 -279386 -115075 -84196 29295 -113065
21007a13065j25182K41974K13052K01304n5927j70460j56039j98831q1829q1188
$$ -113065 -238247 3727 216779 418083 362156 191696 35657 -163174 -245003 -326191
20997c26191n9331J39152J92973J1629l22220K9936J78499K41357J76566J3664
$$ -326191 -385522 -246370 -53397 -41768 -363988 -334052 -155553 85804 262370 276034
20987B76034R005n2458R533N5902o0175j0781j88510l87924k73374J95451J10516
$$ 276034 285039 232581 242114 298016 237841 227060 38550 -349374 -622748 -427297 -316781
20976c16781j47533r109L30707j8743j5437P7592n4406J00373J89427o0623k9359
$$ -316781 -464314 -473423 -142716 -161459 -176896 -99304 -153710 -53337 136090 75467 46108
20965D6108k04677K7432K80833L3547L6213p7547j27579Q435N3666j34540M5241
$$ 46108 -158569 -131137 149696 183243 219456 141909 14330 22765 76431 -58109 -12868
20954a2868p1992K0596j15670Q9634K16143j55077J01268N7712J99818R6053k2166
$$ -12868 -84860 -64264 -179934 -90300 125843 -29234 72034 129746 329564 425617 403451
20943D03451k771j34430j27343o2200m4060N6352J13857k23752m8899J27842O4909
$$ 403451 400680 266250 138907 76707 32647 88999 202856 -20896 -69795 58047 122956
20932A22956r8320j12585K4130n6230l4265N6970K53950O9109J5312k30730j74824
$$ 122956 24636 -87949 -63819 -120049 -154314 -97344 156606 225715 241027 10297 -164527
20921a64527j46576j4831j3149k8375q8096o0332N1647J99374K14636O3456m5449
$$ -164527 -311103 -325934 -339083 -367458 -455554 -515886 -464239 -264865 -50229 13227 -32222
20910c2222n3015J2564K23791L25666N187j75336Q7549j82318m13209J39664J96793
$$ -32222 -85237 -72673 151118 476784 481971 306635 394184 211866 -201343 -61679 135114
20899A35114j95711l44334Q4423J12048l349o9577n9553o0174M5181N6720L15033
$$ 135114 -60597 -404931 -320508 -208460 -211809 -281386 -340939 -401113 -355932 -299212 15821
20888A5821O0414J71067n8462L09803J6701j25828Q480q3716N8376k72338M298
$$ 15821 76235 247302 188840 498643 515344 389516 397996 314280 372656 100318 104616
20877A04616J29924R128n9600j78994k003k7896k55750k14402j18915J00791J69434
$$ 104616 234540 243668 184068 5074 3071 -24825 -280575 -494977 -613892 -513101 -343667
20866c43667J40889K79659L1418j21047j09404j5523J58130K87943J08856j68749
$$ -343667 -202778 76881 108299 -12748 -122152 -137675 20455 308398 417254 248505
20856B48505j91579j46754q5659K72365j42794M9901O4667N4078P5487j31186
$$ 248505 56926 -89828 -175487 96878 -45916 3985 68652 122730 198217 67031
20846F7031q5370J01180Q316R8460O1490j06413K57756L17841J40230l78415j88726
$$ 67031 -18339 82841 91157 189617 251107 144694 402450 720291 860521 482106 293380
20835B93380j34758N749J66858R5215k38931j22851L4561n9266k26719N5461q4178
$$ 293380 158622 164371 331229 426444 187513 64662 99223 39957 -186762 -131301 -215479
20824b15479L4468K31416J42023k19813j35957J07369Q683J85717O6184n6757
$$ -215479 -181011 50405 192428 -27385 -163342 -55973 -47290 138427 204611 147854
20814A47854k04992J6726k07742j42684J41074K06643J53238k03037k80376j22222
$$ 147854 -57138 -40412 -248154 -390838 -249764 -43121 110117 -92920 -373296 -495518
20804d95518J46677n1165J41713J63504O3473O7427J39079M3499j0703k98053
$$ -495518 -348841 -400006 -258293 -94789 -31316 36111 175190 218689 207986 -90067
20794i0067j94441o053O3364k4624L85621K64314k40226j46319j71152q932O7370
$$ -90067 -284508 -290561 -227197 -251821 133800 398114 157888 11569 -159583 -168515 -101145
20783a01145J13032k39235k26486K27226J71492J5573K8352J18722m782R8852
$$ -101145 11887 -227348 -453834 -226608 -55116 -39543 -11191 107531 102749 201601
20773B01601o5140o4889J31350N1894m54729q2526J05915K55826N192j88902l2913
$$ 201601 136461 71572 202922 254816 -199913 -282439 -176524 79302 84494 -104408 -137321
20762a37321J2162R6866q3629O8688J30222J07616K9426l07479L01348J78202
$$ -137321 -125159 -28293 -111922 -43234 86988 194604 224030 -83449 217899 396101
20752C96101l61878L3952K12806k61363k29068L28240m8701j68608q8029K2116
$$ 396101 34223 68175 280981 19618 -209450 118790 70089 -98519 -186548 -164432
20742a64432K79658j27009j13959J47809K4638J28443K01985j08877J22961P1950
$$ -164432 115226 -11783 -125742 22067 46705 175148 377133 268256 391217 463167
20732D63167M85949M33784l7884J78020j30773l92229k36757j67876j388J47090
$$ 463167 949116 1382900 1345016 1523036 1392263 1000034 763277 595401 594013 741103
20722G41103j24720k9400P9330j36661k47192l53009j00452L5875N4374R0765
$$ 741103 616383 586983 666313 529652 282460 -70549 -171001 -135126 -80752 10013
20712A0013K16457J80994j10802J1571L0329m756j48163N0950O3814M5371r5049
$$ 10013 226470 407464 296662 308233 338562 333806 185643 236593 300407 345778 250729
20701B50729Q2228N9256K66303N34700M13818L71088J95686m64215o00953l67707
$$ 250729 332957 392213 658516 1193216 1607034 1978122 2173808 1709593 1108640 740933
20691G40933k05309j07469q5814m1964L709k6992j58065J10014M3755m8892j77406
$$ 740933 535624 428155 342341 300377 304086 277094 119029 229043 272798 223906 46500
20680D6500L782J69315K32740K44470k36443J9895m1839k7402j76645J8398o0206
$$ 46500 50282 219597 452337 696807 460364 480259 438420 411018 234373 252771 192565
20669A92565J51907k80706k64311j36921J2073K82651r6587Q1699J30879k42058
$$ 192565 344472 63766 -200545 -337466 -325393 -42742 -139329 -57630 73249 -168809
20659a68809J26177j6804M6666l7591J7170j90996k88608n2907J54932J91745
$$ -168809 -42632 -59436 -12770 -50361 -33191 -224187 -512795 -565702 -410770 -219025
20649b19025p497L5717j12236k27515K07208J26107L6852M8992j4227N9675k31349
$$ -219025 -226522 -190805 -303041 -530556 -323348 -197241 -160389 -111397 -125624 -65949 -297298
20638b97298j50333L9997J74294O2836n1860k4402O6436J69334K67517j66690
$$ -297298 -447631 -407634 -233340 -170504 -222364 -246766 -180330 -10996 256521 89831
20628H9831k20643q3153J69259K06750K18549M9242j95308k90171J00054J36885
$$ 89831 -130812 -213965 -44706 162044 380593 429835 234527 -55644 44410 181295
20618A81295K09405O5178k36567j0813l90482J37160J14823o7899N3784J51274
$$ 181295 390700 455878 219311 208498 -181984 -44824 69999 2100 55884 207158
20608B07158J50558j38985j14260L4249J86790O8210K803M6906j40240k91227
$$ 207158 357716 218731 104471 138720 325510 393720 396523 443429 303189 11962
20598A1962j37364L49418J4958m9131k92715k43338l25873n8589K11891K78829
$$ 11962 -125402 224016 238974 189843 -102872 -346210 -672083 -730672 -518781 -239952
20588b39952K32006K55152k40893J00764K25196J09519j2723j24533l537m738
$$ -239952 -7946 247206 6313 107077 332273 441792 429069 304536 300999 296261
20578B96261N8844P7185q4512l5095J40625q9382m20152M8083O2329p3572L7396
$$ 296261 355105 432290 347778 312683 453308 363926 -56226 -8143 54186 -19386 18010
20567A8010N1798j15021k98935P4019o3734q7370Q8766K31426J05439J81847J75765
$$ 18010 69808 -45213 -344148 -270129 -333863 -421233 -332467 -101041 4398 186245 362010
20556C62010Q9628J35056Q570o3892j66659k54673j60878K9860k03913P7136J91937
$$ 362010 451638 586694 595264 531372 364713 110040 -50838 -20978 -224891 -147755 44182
20545D4182K09588R0010j81844k23506m2653K27189j54762j64921k73225K00881
$$ 44182 253770 343780 161936 -61570 -104223 122966 -31796 -196717 -469942 -269061
20535b69061M0646N2702J74569J18991M955k00892o0245j59300m2470M1839M6954
$$ -269061 -228415 -175713 -1144 117847 122802 -78090 -138335 -297635 -340105 -298266 -251312
20524b51312j47488j6695j2711n7028K75955K13716K79195n2350m4597k39821
$$ -251312 -398800 -415495 -428206 -485234 -209279 4437 283632 231282 186685 -53136
20514e3136n8703L35672k20349N1506J25293k27083j77717N7835r3098k61660
$$ -53136 -111839 223833 3484 54990 180283 -46800 -224517 -166682 -259780 -521440
20504e21440N8221L5248K18118j14279K00855J07553j81588J72833L3302k79914
$$ -521440 -463219 -427971 -209853 -324132 -123277 -15724 -197312 -24479 8823 -271091
20494b71091j96238L6473K7711k4927O4466K17699J78813P1784k6753O9277K4091
$$ -271091 -467329 -430856 -403145 -428072 -363606 -145907 32906 104690 77937 147214 171305
20483A71305j2077p0230l40803M280R2514J20665j20155J05195K56958N920j92039
$$ 171305 159228 88998 -251805 -247525 -155011 -34346 -154501 -49306 207652 213572 21533
20472B1533j89866J39399P9025K5657j41669j17421K63466j13030K56139j62333
$$ 21533 -168333 -28934 50091 75748 -65921 -183342 80124 -32906 223233 60900
20462F0900j72234j23507L8114M7051R0606N5081j58245j70933j09228P7052P2581
$$ 60900 -111334 -234841 -196727 -149676 -59070 -3989 -162234 -333167 -442395 -365343 -292762
20451b92762K20476l4783o2470J9349P7124M0505r0424o6942l0996K851j60591
$$ -292762 -72286 -107069 -169539 -150190 -73066 -32561 -122985 -189927 -220923 -218072 -378663
20440c78663j02582K89133L81814j81143Q4383R5990J9008k34511j94019p7447
$$ -378663 -481245 -192112 189702 8559 92942 188932 207940 -26571 -220590 -298037
20430b98037q4882K69145J6574j92887j70156n8446J85575K22678K08588o7255
$$ -298037 -382919 -113774 -97200 -290087 -460243 -518689 -333114 -110436 98152 30897
20420C0897m0805j15514k4516j4176p1561o4151Q3625J24927J67169q8722j38350
$$ 30897 -9908 -125422 -149938 -164114 -235675 -299826 -216201 -91274 75895 -12827 -151177
20409a51177q5383l3841K35345L05002N7815P4202K25701m0857j37372q2901P2135
$$ -151177 -236560 -270401 -35056 269946 327761 401963 627664 586807 449435 366534 438669
20398D38669k74762k95130j16637P0754Q8354j52553J68683K68837r757k0641
$$ 438669 163907 -131223 -247860 -177106 -88752 -241305 -72622 196215 186458 165817
20388A65817K00298R2570j40691k68263L1616L0344j05791K68431k54419j81124
$$ 165817 366115 458685 317994 49731 81347 111691 5900 274331 19912 -161212
20378a61212K8489Q2091l153j82247J33446J03367J98750J15111L8932J8612m0000
$$ -161212 -132723 -50632 -53785 -236032 -102586 781 199531 314642 353574 372186 332186
20367C32186j67246m4943J25477Q307l3405J8133l04802J62536L5961j34448m4030
$$ 332186 164940 119997 245474 253781 220376 238509 -66293 96243 132204 -2244 -46274
20356d6274K90241K06624P1445q5868l452k07575m06275j85859J96545J40871
$$ -46274 243967 450591 522036 436168 432716 225141 -181134 -366993 -170448 -29577
20346b9577J13481q2567R238J95709Q2838l67319p8337K47502M4122k02441k4822
$$ -29577 83904 1337 10575 206284 289122 -78197 -156534 90968 135090 -67351 -92173
20335i2173p5068q1842L5373j17892o4219K19789K09198n5923J2024J00377J18107
$$ -92173 -167241 -249083 -213710 -331602 -395821 -176032 33166 -22757 -10733 89644 207751
20324B07751r9141n5195J63K68648p6008o9240K69315J29062J18P8000k40962
$$ 207751 108610 53415 53578 322226 246218 176978 446293 575355 575473 653473 412511
20313D12511k01042j38928L4648q7583L28401p7246k70885m9217j45954j60674
$$ 412511 211469 72541 107189 19606 348007 270761 -124 -49341 -195295 -355969
20303c55969k49301J72664J92417J42799Q3942K5370j25036J33497J77321K80392
$$ -355969 -605270 -432606 -240189 -97390 -13448 11922 -113114 20383 197704 478096
20293D78096o7389j61049k19378l1232n2488J00631M5464p3869M65330J99717
$$ 478096 410707 249658 30280 -952 -53440 47191 92655 18786 484116 683833
20283F83833r9185l81947k20589K9146J40016K12275m4325j15811K36621L15811
$$ 683833 584648 202701 -17888 11258 151274 363549 319224 203413 440034 755845
20273G55845n1943j81976m02236j65703L9743Q8590J26459M6475j54671P314J78679
$$ 755845 703902 521926 119690 -46013 -6270 82320 208779 255254 100583 107897 286576
20262B86576J42350k47627P1801Q2510q0471q1594p4889R5576j9728N0728j78815
$$ 286576 428926 181299 253100 335610 255139 173545 98656 194232 174504 225232 46417
20251D6417j76150J74374J93495R0309k01933J96145J37249J82637K7541r1155
$$ 46417 -129733 44641 238136 328445 126512 322657 459906 642543 670084 578929
20241E78929j16396j29552l3523r1306k98235J30761P1312j0245J8988m2890J04503
$$ 578929 462533 332981 299458 208152 -90083 40678 111990 101745 120733 77843 182346
20230A82346K61545J77631r3005l10956k1189J89620N8221q9464r3802o8832M0190
$$ 182346 443891 621522 528517 217561 196372 385992 444213 354749 260947 192115 232305
20219B32305k9897R9084P5248K6383k56855J40958j28669j78505o784K60620P3769
$$ 232305 202408 301492 376740 403123 146268 287226 158557 -19948 -26732 233888 307657
20208C07657J1827J1190J91522P437j84000k48766J43656J28882O2755J99597
$$ 307657 319484 330674 522196 529633 345633 96867 240523 369405 432160 631757
20198F31757M97382O53719L51669M4992L13057K70255p080m19508l91141O1404
$$ 631757 1129139 1782858 2134527 2179519 2492576 2762831 2755751 2336243 1945102 2006506
20188B006506Q4476L06793j38732L0947k8593n4333M1162L57393k26268J84914
$$ 2006506 2090982 2397775 2259043 2289990 2261397 2207064 2248226 2605619 2379351 2564265
20178B564265O45711P02754P49683O63753K55856M55795M98628J44425n4210J87352
$$ 2564265 3209976 3912730 4662413 5326166 5582022 6037817 6536445 6680870 6626660 6814012
20168F814012M7228Q232K94869Q60256J030142J527029K111221K355464K887280
$$ 6814012 6861240 6869472 7164341 8024597 9054739 10581768 12692989 15048453 17935733
20159A7935733L896525N842865Q042276J2194004J9739740L4950439O1498105
$$ 17935733 21832258 27675123 35717399 47911403 67651143 102601582 164099687
20152A64099687Q5452471P3342674M1041794J0409839n3747193r7399217p0466208
$$ 164099687 249552158 322894832 363936626 374346465 320599272 223200055 152733847
20145A52733847l9621078k2770800j4118997r809081o921187m750779l570953
$$ 152733847 113112769 90341969 76222972 66413891 59492704 54741925 51170972
20138E1170972l230870k933769k406629k365007j902786j472621j027568m64978
$$ 51170972 47940102 45006333 42599704 40234697 38331911 36859290 35831722 35366744
20130C5366744N9860P33090M20793J034188K844898M672204O658466R781645J5281723
$$ 35366744 35426604 36159694 36580487 37614675 40459573 45131777 51790243 61571888 76853611
20121G6853611K5673449M6385987P6361608Q7975052N9844726K8652734j4652229
$$ 76853611 102527060 148913047 225274655 313249707 373094433 401747167 387094938
20114C87094938q7422134r4778602n7920932l2959235j9698940j2806031r178310
$$ 387094938 299672804 204894202 146973270 114014035 94315095 81509064 72330754
20107G2330754o842923m956574m002982l795859l823978k785493k657498k069654
$$ 72330754 65487831 60531257 56528275 52732416 48908438 46122945 43465447 41395793
20099D1395793j851883j563131j131542j562979j754541j625698j196923r49013
$$ 41395793 39543910 37980779 36849237 35286258 33531717 31906019 30709096 29760083
20091B9760083q73661r64682p59853o05230r82012r62423p02116j097933q64974
$$ 29760083 28886422 27921740 27161887 26556657 25574645 24612222 23910106 22812173 21947199
20082B1947199l71097m89864o40383o93115o98295r87484o71667j62600K96895
$$ 21947199 21576102 21086238 20445855 19752740 19054445 18066961 17395294 17232694 17529589
20073A7529589K44745j95880n41213q21518j045116q85070n25630o13498l73672
$$ 17529589 17774334 17578454 17037241 16215723 15170607 14285537 13759907 13146409 12772737
20064A2772737l29128l67562j04191l78554m29413k27171m20329j48239l53082
$$ 12772737 12443609 12076047 11971856 11593302 11163889 10936718 10516389 10368150 10015068
20055A0015068n46297j35072J26200l30138k19354j98558l3367j84006m39979
$$ 10015068 9468771 9333699 9459899 9129761 8910407 8711849 8678482 8494476 8054497
20046H054497k10148n4848m9713m20976l99201j47760l76610l10741j56488K4492
$$ 8054497 7844349 7789501 7739788 7318812 6919611 6771851 6395241 6084500 5928012 5952504
20036E952504j84129l84597k446L45455l3850n6781j87823j07862j07704j06171
$$ 5952504 5768375 5383778 5381332 5726787 5692937 5636156 5448333 5340471 5232767 5126596
20026E126596J13508n0272j47447j37508j97583k9851j12348j33395j97034l68101
$$ 5126596 5240104 5189832 5042385 4904877 4707294 4677443 4565095 4431700 4234666 3866565
20016C866565m50044j82492J62088J88394J6861k35422j19521K11139P00k92331
$$ 3866565 3416521 3234029 3396117 3584511 3601372 3365950 3246429 3457568 3458268 3165937
20006C165937Q2666j12531L991l9011K32089l44801j35200p0651q7509j355j12547
$$ 3165937 3248603 3136072 3140063 3101052 3333141 2988340 2853140 2782489 2694980 2693625 2581078
19995B581078m9842j34259l30511j84423Q5885J94176J52107N274q3166j20741
$$ 2581078 2531236 2396977 2066466 1882043 1967928 2162104 2314211 2319485 2236319 2115578
19985B115578j09926p3321r7835p2258p2322J49769K66864j21748l2588J16179
$$ 2115578 2005652 1932331 1834496 1762238 1689916 1839685 2106549 1984801 1952213 2068392
19975B068392M2105m553j50332j94790j27743j73082m9383L907M166j8110j15471
$$ 2068392 2110497 2105944 1955612 1760822 1633079 1459997 1410614 1414521 1418687 1400577 1285106
19964A285106P3913m4545j78853J6690K87043o8701j9292m9831p9060j34558O2633
$$ 1285106 1359019 1314474 1135621 1152311 1439354 1370653 1351361 1301530 1222470 1087912 1150545
19953A150545k88598k15669K87147L74998r0207j45435j70101m6292J71074K48067
$$ 1150545 861947 646278 933425 1308423 1218216 1072781 902680 856388 1027462 1275529
19943A275529j11412j44845P644J8781l39598p8244J038j29078M8558L8211K4179
$$ 1275529 1164117 1019272 1026916 1045697 706099 627855 628893 499815 548373 586584 610763
19932F10763j7806R529M5066j03617J58007J39099o7913j92100o9106p4972j8657
$$ 610763 592957 602486 647552 543935 701942 841041 773128 581028 511922 436950 418293
19921D18293j36917O6099O9641j05370k0495k4782q2688q4696l3249J29291J2777
$$ 418293 281376 347475 417116 311746 291251 266469 183781 99085 65836 195127 207904
19910B07904o3221p486j21620J16382k19849p3468l9492R291J73620K68475K18323
$$ 207904 144683 137197 15577 131959 -87890 -161358 -200850 -191559 -17939 250536 468859
19899D68859k18909k61758j15673K7043K1992L81931Q7689n8603R8224k4964K2439
$$ 468859 249950 -11808 -127481 -100438 -78446 303485 391174 332571 430795 405831 428270
19888D28270r993K09123P6877k55501k8029j9336j32274J22787p0313K6635p7978
$$ 428270 418277 627400 704277 448776 420747 401411 269137 391924 321611 348246 270268
19877B70268R2245K85055q0502k06766R281j063M1149n8423L3267o6773J3980
$$ 270268 362513 647568 567066 360300 369581 368518 409667 351244 384511 317738 331718
19866C31718J3841j30869M4117l5258j27266j44700q9746K03287L07011k00968
$$ 331718 345559 214690 258807 223549 96283 -48417 -138163 65124 372135 171167
19856A71167o7713j99638K31287J6649j61002K1320L9247J5283j8710j05260O1726
$$ 171167 103454 -96184 135103 151752 -9250 12070 51317 66600 47890 -57370 4356
19845D356Q8600l2279j03541L0192M24490K94841k00842j53906j80319j65770
$$ 4356 92956 60677 -42864 -12672 411818 706659 505817 351911 171592 5822
19835E822j73472K76922L07166K3183k16637L1002J38327J11575p9662p6121p5647
$$ 5822 -167650 109272 416438 439621 222984 253986 392313 503888 424226 348105 272458
19824B72458J26873J19332j80214j56377j7074k86139J50479R4178r1112P6562
$$ 272458 399331 518663 338449 182072 164998 -121141 29338 123516 32404 108966
19814A08966o0496J81662l7519j3953N2087j74761j71862k33377r6406J14488
$$ 108966 48470 230132 192613 178660 230747 55986 -115876 -349253 -445659 -331171
19804c31171L8046K12719L11591p8509m3961J60436J16401k05623P7019k3249
$$ -331171 -293125 -80406 231185 152676 108715 269151 385552 179929 256948 233699
19794B33699m0933J82729o0593k00198l70410j6726J15436J04523J08691k34687
$$ 233699 192766 375495 314902 114704 -255706 -272432 -156996 -52473 56218 -178469
19784a78469j0320L5421J43536J82767J05082k19942j80156N0873j1762j30316
$$ -178469 -188789 -153368 -9832 172935 278017 58075 -122081 -71208 -82970 -213286
19774b13286J47743p935r2464k65760R6528M51872j0489j04724m4621P9909P8569
$$ -213286 -65543 -73478 -165942 -431702 -335174 116698 106209 1485 -43136 36773 115342
19763A15342K05074k76966m7263J09995p9591n1763J96998k31192q7845J57773
$$ 115342 320416 43450 -3813 106182 26591 -25172 171826 -59366 -147211 10562
19753A0562J22865j62491j19782q451J35360J01825r673L4689J12636M6589k79483
$$ 10562 133427 -29064 -148846 -157297 -21937 79888 70215 104904 217540 264129 -15354
19742a5354j6945N9349m0202k465O0591Q2303K0159r2821j70215r3499Q6738K04250
$$ -15354 -32299 27050 -13152 -15617 44974 127277 147436 54615 -115600 -209099 -122361 81889
19730H1889J69222L08044K6082m5026l056j87147j13208J8144J02934P4829n1802
$$ 81889 251111 559155 585237 540211 537155 350008 236800 254944 357878 432707 380905
19719C80905j85215r4219J74018l27910j96170j02493J13749J73598M1196o9014
$$ 380905 195690 101471 275489 -52421 -248591 -351084 -237335 -63737 -22541 -91555
19709i1555N7597K58163k13774j6205j93157o1054K3835K26420j8818m0301q9257
$$ -91555 -33958 224205 10431 -5774 -198931 -259985 -236150 -9730 -28548 -68849 -158106
19698a58106k07954l4190L16102o7625K0583R1079j02152k91817K46492M30020
$$ -158106 -366060 -400250 -84148 -151773 -131190 -40111 -142263 -434080 -187588 242432
19688B42432m8216j33349k14299J34300J94435J55579l3576k16853K11883M19633
$$ 242432 194216 60867 -153432 -19132 175303 330882 297306 80453 292336 711969
19678G11969J53j34682k11650j83103O8217j28969j47445p696N0659m9060j73259
$$ 711969 712122 577440 365790 182687 250904 121935 -25510 -33206 17453 -31607 -204866
19667b04866j5128K36695k43738l26076J58511N3990J82674J99711l0383q9806
$$ -204866 -219994 16701 -227037 -553113 -394602 -340612 -157938 41773 11390 -78416
19657g8416o4164j77485J2591K09930j09675j86790m0404J73595k07611J08461
$$ -78416 -142580 -320065 -307474 -97544 -207219 -394009 -434413 -260818 -468429 -359968
19647c59968p40p2181r5276L1216k4675J85008J05571O0521q3150m2102L99118
$$ -359968 -360708 -432889 -528165 -496949 -521624 -336616 -231045 -170524 -253674 -295776 103342
19636A03342Q0456M1670k83398m0526l9595O1816J88146R3249K4376j95280j90145
$$ 103342 183798 225468 -57930 -98456 -138051 -76235 111911 205160 229536 34256 -155889
19625a55889M9340m8105J38529J46946J42673K45115r6786l12436j47433k6303
$$ -155889 -106549 -154654 -16125 130821 273494 518609 421823 109387 -38046 -64349
19615f4349r4869J1822K9299L21783O003k602o4822J8778j3455R8531o493l37077
$$ -64349 -159218 -147396 -118097 203686 209689 207087 142265 161043 147588 246119 239626 -97451
19603i7451j60465K06301K22426o1960j30719j59481j82850J35234K39591q7829
$$ -97451 -257916 -51615 170811 108851 -21868 -181349 -364199 -228965 10626 -77203
19593g7203j64486j45551k1742J01134L00159j9750p2841m6177m7231k3001P4430
$$ -77203 -241689 -387240 -408982 -307848 -7689 -27439 -100280 -146457 -193688 -216689 -142259
19582a42259l4856m272J28357Q8689J03761N3970r6856Q5953k09864O3430J16258
$$ -142259 -177115 -181387 -53030 35659 139420 193390 96534 182487 -27377 36053 152311
19571A52311j15040r9573P8719K80725K64346L6890L82801M60512M86413K52514
$$ 152311 37271 -62302 16417 297142 561488 598378 981179 1441691 1928104 2180618
19561B180618J9966l48386m99187m72168j15614r5100N2335R038K41441K06291
$$ 2180618 2200584 1852198 1353011 880843 765229 670129 722464 731502 972943 1179234
19551A179234J54796q5006j58572l66710j51926K46403L53122K38791O5388j48339
$$ 1179234 1334030 1249024 1090452 723742 571816 818219 1171341 1410132 1475520 1327181
19541A327181k73420k09427l1357k99617O4234k07638j60334K46374J86460K42923
$$ 1327181 1053761 844334 812977 513360 577594 369956 209622 455996 642456 885379
19531H85379P13823O13023P58650M78407k06880k29161k32875l25532l16320n67859
$$ 885379 1599202 2212225 2970875 3449282 3242402 3013241 2780366 2454834 2138514 1570655
19521A570655k5636K55232N2410j06621j15319k68180l57018k12574J17267q8716
$$ 1570655 1545019 1800251 1852661 1746040 1630721 1362541 1005523 792949 910216 821500
19511H21500r8699l12j1160q3268K1353K18302j9510k71584l62604r9269K15384
$$ 821500 722801 722489 711329 628061 649414 867716 848206 576622 214018 114749 330133
19500C30133k24697j7535M4333J66181J14244j43578p7685j88868m5092j1399
$$ 330133 105436 87901 132234 298415 412659 269081 191396 2528 -42564 -53963
19490e3963J50726J96497L251k36748j95628r5974J4752j11077K21709L22685
$$ -53963 96763 293260 296511 59763 -135865 -231839 -217087 -328164 -106455 216230
19480B16230j2457j41633J55802k11197j06260R6279j31579m900k289r7313m6284
$$ 216230 203773 62140 217942 6745 -99515 -3236 -134815 -139715 -142004 -239317 -285601
19469b85601J74607m9630J84210Q5179O1450J05082Q384J56995O9267k50620j65547
$$ -285601 -110994 -160624 23586 108765 170215 275297 283681 440676 509943 259323 93776
19458I3776k2914K2870J25235K23323M2997q3256M2816j6131k69351j61576M3824
$$ 93776 70862 93732 218967 442290 485287 402031 444847 428716 159365 -2211 41613
19447D1613P2395j15135R2046p3761k06185j19422R5245l48282Q5507K17643n9697
$$ 41613 114008 -1127 90919 17158 -189027 -308449 -213204 -561486 -475979 -258336 -318033
19436c18033l7635L7540J05358J31075L6691O6586L66767K38437l79727j04739
$$ -318033 -355668 -318128 -212770 -81695 -45004 21582 388349 626786 247059 142320
19426A42320j00332J33725N8993N7253q2265m7250L68j08717r5419m1762n3012
$$ 142320 41988 175713 234706 291959 209694 162444 162812 54095 -41324 -83086 -136098
19415a36098P038J42306p3507k44001M5637k4864J89068L26757r8994j44578j8335
$$ -136098 -129060 13246 -60261 -304262 -258625 -283489 -94421 232336 133342 -11236 -29571
19404b9571j23007j31477J76772J77479j25241R5982J00879l4664N3851N1796
$$ -29571 -152578 -284055 -107283 70196 -55045 40937 141816 107152 161003 212799
19394B12799j96794j14787K2003J87011j46855q1957J63468l3376n4121L4933
$$ 212799 16005 -98782 -76779 110232 -36623 -118580 44888 11512 -42609 -7676
19384g676K03188j41727L8920j10841J53955L70771j05983k15601k09869k64683
$$ -7676 195512 53785 92705 -18136 135819 506590 400607 185006 -24863 -289546
19374b89546o621M6831j57081L3423J50174L98328p5931j22572j36624o0017K9969
$$ -289546 -296167 -249336 -406417 -372994 -222820 175508 99577 -22995 -159619 -219636 -189667
19363a89667J60788K0046n6717j8422j04008j15967j22193Q2290k09784J74607
$$ -189667 -28879 -8833 -65550 -83972 -187980 -303947 -426140 -343850 -553634 -379027
19353c79027p3614j0243o2398J03510L57235J15316j14374j58384j53237P9899
$$ -379027 -452641 -462884 -525282 -421772 -64537 50779 -63595 -221979 -375216 -295317
19343b95317L04851K42049O0927j16720j35666l909Q8085K47622n2664k70815
$$ -295317 9534 251583 312510 195790 60124 56215 144300 391922 339258 68443
19333F8443J17904J26731N2294j93160j65546p5744J40224q3618l5949M8461k3039
$$ 68443 186347 313078 365372 172212 6666 -69078 71146 -12472 -48421 40 -22999
19322b2999J15018l5140j185p9730L9055P4406q0566k08456J02417j45055k6470
$$ -22999 92019 56879 55694 -24036 15019 89425 8859 -199597 -97180 -242235 -268705
19311b68705O1440K12388K35929O6833j30717M9603J41297j52151j37408l40r5072
$$ -268705 -207265 5123 241052 307885 177168 226771 368068 215917 78509 78169 -16903
19300a6903j64725k16697P7444M52186P3460r7757J17791J67669r9299K29789
$$ -16903 -181628 -398325 -320881 131305 204765 107008 224799 392468 293169 522958
19290E22958l5011l0250P3580k07155j09962j00781L9197J46965P7330j78065
$$ 522958 487947 457697 531277 324122 214160 113379 152576 299541 376871 198806
19280A98806q1223J7318p5882J16744K50359K7755k77502M12j08282J1669q1400
$$ 198806 117583 134901 59019 175763 426122 453877 176375 176787 68505 80174 -1226
19269a226j92150j05235J47668J75858L38498O303o191j11733k22029J52757J77720
$$ -1226 -193376 -298611 -150943 24915 363413 369716 363525 251792 29763 182520 360240
19258C60240j30950J14600K4970l9881J29814N904j33434O2957J70342J04372
$$ 360240 229290 343890 368860 328979 458793 464697 331263 394220 564562 668934
19248F68934J77089M3038L33916L11421Q2437j13595l28605k49234K6294K09657
$$ 668934 846023 889061 1222977 1534398 1616835 1503240 1174635 925401 951695 1161352
19238A161352k4823O3129P840m59946k59437L2280m872k1061j40582o7430J1213
$$ 1161352 1136529 1199658 1207498 747552 488115 520395 515523 494462 353880 286450 297663
19227B97663n8321j8402Q6538l6741p6376J11072L26681J11491j75682J3855K40166
$$ 297663 239342 220940 307478 270737 194361 305433 632114 743605 567923 581778 821944
19216H21944m571J19043K38626K67974N2203j20606n3928M0440P7689J35138L65303
$$ 821944 817373 936416 1175042 1443016 1495219 1374613 1320685 1361125 1438814 1573952 1939255
19205A939255R276l30509l75283l79690k40448k53716r9023K37296L2339k25505
$$ 1939255 1948531 1618022 1242739 863049 622601 368885 269862 507158 539497 313992
19195C13992j57026J47642L41851J22598R7654P9752j03103l10987k05481K7864
$$ 313992 156966 304608 646459 769057 866711 946463 843360 532373 326892 354756
19185C54756l1069J43092L9960r3239J03205J37440O6137j06714k95252l46605
$$ 354756 323687 466779 506739 413500 516705 654145 720282 613568 318316 -28289
19175b8289j9717J35462J02836m1755k02080j66682K14229L63103Q5613O9871
$$ -28289 -48006 87456 190292 148537 -53543 -220225 -5996 357107 442720 512591
19165E12591n1554j90858J82295J06179J7738j19201P966k22945p5451L4716Q9728
$$ 512591 461037 270179 452474 558653 576391 457190 465156 242211 166760 201476 291204
19154B91204q3241j37567J89174K9608K4725n7810M5336J17839l23199o8998L43507
$$ 291204 207963 70396 259570 289178 313903 256093 301429 419268 96069 27071 370578
19143C70578O0477O8157q0617k88544m1697O3435L6853M338j72584j47119P9538
$$ 370578 431055 499212 418595 130051 88354 151789 188642 192980 20396 -126723 -47185
19132d7185K75094J67031k0109j68941N7675K35740o8004l9330n7527Q2914p862
$$ -47185 227909 394940 374831 205890 263565 499305 431301 391971 334444 417358 409496
19121D09496j30312n8054K08690K0105q9223K8810J26699j64941k40733j71102
$$ 409496 279184 221130 429820 449925 360702 389512 516211 351270 110537 -60565
19111f0565J66467Q5438L1070R8000j8149j0444l7630J19951L3172q6236k27807
$$ -60565 105902 191340 222410 320410 302261 291817 254187 374138 407310 321074 93267
19100I3267N5828K65183J12068Q9625p626j18926j49807K25441J23643p9525j42958
$$ 93267 149095 414278 526346 615971 608345 489419 339612 565053 688696 609171 466213
19089D66213j09212N1698j62488j76984K90673L3186j34743J37911K65408K46156
$$ 466213 357001 408699 246211 69227 359900 393086 258343 396254 661662 907818
19079I07818k8843j42249j91986J17392J51041K12950J13351j49592j68036R1634
$$ 907818 878975 736726 544740 662132 813173 1026123 1139474 989882 821846 913480
19069I13480j10166m5376J08516K64238L20240N2173r5847Q9608J04373j5142
$$ 913480 803314 757938 866454 1130692 1450932 1503105 1407258 1496866 1601239 1586097
19059A586097K11530Q0949J85376K3479j04956j81084K29284O74681J42088p1103
$$ 1586097 1797627 1878576 2063952 2087431 1982475 1801391 2030675 2705356 2847444 2776341
19049B776341K99374J00054l99616j09709L30753K86182P14765O18951L83829
$$ 2776341 3075715 3175769 2776153 2666444 2997197 3283379 3998144 4617095 5000924
19040E000924N11159L00000N60528Q63336J389916J500913J532421K114160K450100
$$ 5000924 5512083 5812083 6372611 7235947 8625863 10126776 11659197 13773357 16223457
19031A6223457K873559M568155P401565J2998929K4490358M3063292N0877273
$$ 16223457 19097016 23665171 31066736 44065665 68556023 111619315 162496588
19024A62496588L3777075K0294137L92924m0856980k9909345J0168973L7444848
$$ 162496588 196273663 216567800 216960724 176103744 146194399 156363372 193808220
19017A93808220L0743744J4591524O87975m3180914o2061817l6699092j8750186
$$ 193808220 224551964 239143488 239831463 196650549 134588732 97889640 79139454
19010G9139454r961997n434083k583726l81928J613784M608660J0348304K2569642
$$ 79139454 69177457 63743374 61159648 60777720 62391504 67000164 77348468 99918110
19002I9918110M2087048N1733787L5183359K0716165J859217m2259555l5588969
$$ 99918110 142005158 193738945 228922304 249638469 251497686 209238131 173649162
18995A73649162O884575L6379940L1871854J4501539J008284m1823317o7193594
$$ 173649162 180533737 216913677 248785531 263287070 264295354 222472037 155278443
18988A55278443m2372314k2544246j3015611q329926n982382m397471l643891
$$ 155278443 112906129 90361883 77346272 69016346 63033964 58636493 54992602
18981E4992602l431225l170971k386961k213277k301592k184615j934420k031666
$$ 54992602 51561377 48390406 46003445 43790168 41488576 39303961 37369541 35337875
18973C5337875j624457j353061r15203j062509j384553q99361o85998q32391l78699
$$ 35337875 33713418 32360357 31445154 30382645 28998092 28098731 27412733 26580342 26201643
18964B6201643n91428p34632n63682j77735k23031j99817l31273p78363j193253
$$ 26201643 25610215 24875583 24311901 24134166 23911135 23711318 23380045 22601682 21408429
18955B1408429j401848j159038q33667n54342m69041k90094m92928o83747o60095
$$ 21408429 20006581 18847543 18013876 17459534 16990493 16700399 16207471 15523724 14863629
18946A4863629m53811m77449m05267j68244j26019o05924n28606j92014k94837
$$ 14863629 14409818 13932369 13527102 13358858 13232839 12626915 12098309 11906295 11611458
18937A1611458k14786k13292l09381m56114n65542m5847k17469m54710O0800J48090
$$ 11611458 11396672 11183380 10873999 10417885 9852343 9806496 9589027 9134317 9195117 9343207
18927I343207k36961n09863k44589k37249j94330k08108j11571j82147m15186
$$ 9343207 9106246 8596383 8351794 8114545 7920215 7712107 7600536 7418389 7003203
18918G003203k67431k94807j14729L8723J26627j9806k29334l60449j54494k60842
$$ 7003203 6735772 6440965 6326236 6364959 6491586 6471780 6242446 5881997 5727503 5466661
18908E466661N7966m7812j77348k55515j14001P3956k14799Q7439L0827l83369
$$ 5466661 5524627 5476815 5299467 5043952 4929951 5003907 4789108 4876547 4907374 4524005
18898D524005j75390j80180q6436j08565L7813Q4199K05771K3710k26988J6872
$$ 4524005 4348615 4168435 4081999 3973434 4011247 4095446 4301217 4324927 4097939 4114811
18888D114811j74577k31271P1680L5666l94154O9117K4643k00443n2507M2133
$$ 4114811 3940234 3708963 3780643 3816309 3422155 3491272 3515915 3315472 3262965 3305098
18878C305098Q5081j07658k83811j24096j39031j05310j84150j83664O5938J21949
$$ 3305098 3390179 3282521 2998710 2874614 2735583 2630273 2446123 2262459 2328397 2450346
18868B450346j54433j43475J4861j41067K26809L0338r6097l51771j16037l25500
$$ 2450346 2295913 2152438 2167299 2026232 2253041 2283379 2187282 1835511 1719474 1393974
18858A393974Q2107K57666L15210K02183o6417k95883K9652k080J2163j8111R4083
$$ 1393974 1476081 1733747 2048957 2251140 2184723 1888840 1918492 1916412 1928575 1910464 2004547
18847B004547q6467L3239k4946r8351j56019j8366j63088L816P5661R3626J67341
$$ 2004547 1918080 1951319 1926373 1828022 1672003 1653637 1490549 1494365 1570026 1663652 1830993
18836A830993J57672j76850l55559j76495J07279j15531l13906j45468J25084
$$ 1830993 1988665 1811815 1456256 1279761 1387040 1271509 957603 812135 937219
18827I37219r3149J3291J439K89766R8727j23112p4725n5881k21851j50732K66209
$$ 937219 844070 857361 858800 1148566 1247293 1124181 1049456 993575 771724 620992 887201
18816H87201j1852j67871J60509J78512l5056P4652n2340j01395o0749O3077J60885
$$ 887201 875349 707478 867987 1046499 1011443 1086095 1033755 932360 871611 934688 1095573
18805A095573j91263J2697m9683m6297K13818J24820P9943o5531k46326k22935
$$ 1095573 904310 917007 867324 821027 1034845 1159665 1239608 1174077 927751 704816
18795G04816P8438O8049q519j96784Q519N0261n7482K8029J77048L4830k00043
$$ 704816 783254 851303 842784 646000 654519 704780 647298 675327 852375 887205 687162
18784F87162R32J38393J56035K5883j77873K287L30207n3350L16213J53142N2145
$$ 687162 688094 826487 982522 1008405 830532 832819 1163026 1109676 1425889 1579031 1631176
18773A631176J13944K6464L97786N47402M07537K93019M23411l9205n30297o01788
$$ 1631176 1745120 1771584 2169370 2716772 3124309 3417328 3840739 3801534 3271237 2669449
18763B669449k90053k17609L5232l8020j60985j20387k85379q8070J56074R1336
$$ 2669449 2379396 2161787 2197019 2158999 1998014 1877627 1592248 1504178 1660252 1751588
18753A751588j78750j85370j18198j14454p9931J79661p0615m9206K10631L34064
$$ 1751588 1572838 1387468 1269270 1154816 1074885 1254546 1183931 1134725 1345356 1679420
18743A679420R4211L01895K68631J8975K37007J35411J14719J47988K34139K37862
$$ 1679420 1773631 2075526 2344157 2363132 2600139 2735550 2850269 2998257 3232396 3470258
18733C470258P2810j17927K70424J18933P2425o5400J01354q2601k76404J80840
$$ 3470258 3543068 3425141 3695565 3814498 3886923 3821523 3922877 3840276 3563872 3744712
18723C744712J71654j47554j12445k7987l03935l84261r7998K0518K07505o7773
$$ 3744712 3916366 3768812 3656367 3628380 3324445 2940184 2842186 2862704 3070209 3002436
18713C002436J4624N9391P2902j61264l26939j51436j10029J13654M82602K75867
$$ 3002436 3017060 3076451 3149353 2988089 2661150 2509714 2399685 2513339 2995941 3271808
18703C271808p0716j78900J82240K85925L00199L7005m8135n7946L51953L72499
$$ 3271808 3201092 3022192 3204432 3490357 3790556 3827561 3779426 3721480 4073433 4445932
18693D445932K7036K13971O32438O14009M68984M36684R9399p1273j0466J1268
$$ 4445932 4472968 4686939 5319377 5933386 6402370 6839054 6938453 6867180 6856714 6867982
18683F867982J76695J29955K54561L26119M44159K47310P3095J28655j29618K14326
$$ 6867982 7044677 7174632 7429193 7755312 8199471 8446781 8519876 8648531 8518913 8733239
18673H733239M40498N38183R79765J097633J249928K119036L564121N763688Q602350
$$ 8733239 9173737 9711920 10691685 11789318 13039246 15158282 18722403 24486091 33088441
18664C3088441J5132591K8432039M4101723M5836815L1407552J7464384q791048
$$ 33088441 48221032 76653071 120754794 166591609 197999161 215463545 206672497
18657B06672497l6571962k2508518J1795951L0483436K3749993J0366229r599626
$$ 206672497 170100535 147592017 159387968 189871404 213621397 223987626 214388000
18650B14388000m3669236n1254954l1874854j6929545r525012o112572m459293
$$ 214388000 170718764 119463810 87588956 70659411 61134399 55021827 50562534
18643E0562534l455178k050293j397212r15500o94353o47839l6914J217819L180689
$$ 50562534 47107356 45057063 43659851 42744351 42049998 41402159 41365245 42583064 45763753
18634D5763753N467819R848541J8439632L3844745M9570429M7194645L0393835
$$ 45763753 51231572 61080113 79519745 113364490 162934919 210129564 240523399
18627B40523399J4188431j8247220m2597610j9023524J7589623L1825889K1291296
$$ 240523399 254711830 236464610 193867000 174843476 192433099 224258988 245550284
18620B45550284P184082j8455985n3255739n2926935l1367194j7029596j0612020
$$ 245550284 252734366 234278381 181022642 128095707 96728513 79698917 69086897
18613F9086897p399512n560155m177296l348524k716372k339466j991662k000366
$$ 69086897 61687385 56127230 51949934 48601410 45885038 43545572 41553910 39553544
18605C9553544k099453j857031j412333j383492j075265r74602j393127j318908
$$ 39553544 37454091 35597060 34184727 32801235 31725970 30751368 29358241 28039333
18597B8039333j114240q27640o24220o41455p21049n31242o35395o93304q04758
$$ 28039333 26925093 26097453 25473233 24831778 24110729 23579487 22944092 22250788 21446030
18588B1446030p99907p67514q60934m86199o04605m46261l84459n61493n08118
$$ 21446030 20646123 19878609 19017675 18531476 17926871 17480610 17096151 16534658 16026540
18579A6026540o02323m29556m03586k97775l86095l53215l41925n27462k80713
$$ 16026540 15424217 14994661 14591075 14293300 13907205 13553990 13212065 12684603 12403890
18570A2403890k18382j13660k17069j60333k61515l65734l58373j86348k68836
$$ 12403890 12185508 12071848 11854779 11694446 11432931 11067197 10708824 10522476 10253640
18561A0253640l69019k39920k33338l46288m06933n9865j27356j68468k79286
$$ 10253640 9884621 9644701 9411363 9065075 8658142 8598277 8470921 8302453 8023167
18552H023167l46390j40552o3637J48050j42283q5015n2950l31364l31571O9357
$$ 8023167 7676777 7536225 7472588 7620638 7478355 7393340 7340390 7009026 6677455 6746812
18542F746812j05933p1731K40434L09642M4405k9029m4291l52801n63026k16175
$$ 6746812 6640879 6569148 6809582 7119224 7163629 7134600 7090309 6737508 6174482 5958307
18532E958307j5613j92870k26295q2090k19824j47311q3573l20810k92051J62250
$$ 5958307 5942694 5749824 5523529 5441439 5221615 5074304 4990731 4669921 4377870 4540120
18522D540120J29203r0669J797o8565m6310J75572O2146L30656M21593Q334K459
$$ 4540120 4669323 4578654 4580451 4511886 4465576 4641148 4703294 5033950 5455543 5463877 5466336
18511E466336l32139l74151m24555K54525L48286J54801j4808n0113j93173l92677
$$ 5466336 5134197 4760046 4335491 4590016 4938302 5093103 5078295 5028182 4835009 4442332
18501D442332l99110m1735N8893j53386q2184J74163J35424J45845M37854J01213
$$ 4442332 4043222 4001487 4060380 3906994 3824810 3998973 4134397 4280242 4718096 4819309
18491D819309K72431M47264L97642J62238m4318L10835K15153L21471M44193K38989
$$ 4819309 5091740 5539004 5936646 6098884 6054566 6365401 6580554 6902025 7346218 7585207
18481G585207O1454L4513J83845K94439Q02817J100688J718167K215038K997012
$$ 7585207 7646661 7681174 7865019 8159458 8962275 10062963 11781130 13996168 16993180
18472A6993180M367834N994011P854739J0907115J5688160K6251195N1839061
$$ 16993180 21361014 27355025 35209764 46116879 61805039 88056234 139895295
18465A39895295Q8953214R9643946O6578436L3131980k0571333j03145131j07264119
$$ 139895295 228848509 328492455 395070891 428202871 407631538 304486407 197222288
18458A97222288o0775710l1978256j8531298j1497866p846875n859869m397191
$$ 197222288 136446578 104468322 85937024 74439158 66592283 60732414 56335223
18451E6335223l942237l853676l625327l031351k780539k156558j294063p78673
$$ 56335223 52392986 48539310 44913983 41882632 39102093 36945535 35651472 34872799
18443C4872799o69324j14673L68813J410575K779705M115968N769469P918997
$$ 34872799 34203475 34088802 34457615 35868190 38647895 42763863 48533332 56452329
18435E6452329J1157437J7818999L3706772O4763683R5047712Q4166431M7860735
$$ 56452329 67609766 85428765 119135537 183899220 278946932 363113363 410974098
18428D10974098J4814368n8788767j15014363q4569760m4343251k4458713j4403972
$$ 410974098 425788466 366999699 251985336 167415576 123072325 98613612 84209640
18421H4209640r319143p057025n431857m115647m108666l932580l417859k876266
$$ 84209640 74890497 67833472 62401615 58285968 54177302 50244722 46826863 43950597
18413D3950597k767612k442295k132993j896585j640453j436542j513171j628569
$$ 43950597 41182985 38740690 36607697 34711112 33070659 31634117 30120946 28492377
18405B8492377j136367r22521j057214q41976m07410n18783n43712o98103l90887
$$ 28492377 27356010 26433489 25376275 24534299 24126889 23608106 23064394 22366291 21975404
18396B1975404j69814n95153q72690p78225o02548o01794n28958m67790n95132
$$ 21975404 21805590 21210437 20337747 19559522 18956974 18355180 17826222 17358432 16763300
18387A6763300p53102q00788o40401J58741j35159n57529l25380k66865k64432
$$ 16763300 16010198 15209410 14569009 14727750 14592591 14035062 13709682 13442817 13178385
18378A3178385l78160k14311k90975k68550j94015j35353l95051k94986k72765
$$ 13178385 12800225 12585914 12294939 12026389 11832374 11697021 11301970 11006984 10734219
18369A0734219j64287j23534j9142l06520n74513l75186J977r1367j27721j56209
$$ 10734219 10569932 10446398 10427256 10120736 9546223 9171037 9173014 9081647 8953926 8797717
18359H797717n8753p8561k48801k91499k23679j73231k19436p3540l26836k32641
$$ 8797717 8738964 8660403 8411602 8120103 7896424 7723193 7503757 7430217 7103381 6870740
18349F870740j25362O5306l9269k70098m95776k00005m4609K9314j12926q6392
$$ 6870740 6745378 6810684 6771415 6501317 6005541 5805536 5760927 5790241 5677315 5590923
18339E590923j16176l56163r7440j81967K21190J47621k81477j85802j39196k556
$$ 5590923 5474747 5118584 5021144 4839177 5060367 5207988 4926511 4740709 4601513 4598957
18329D598957n500o357K12465J95836L40971N4364m2521K39368k62184k51114
$$ 4598957 4593457 4587100 4799565 4995401 5336372 5390736 5348215 5587583 5325399 5074285
18319E074285l2521j65884j83448q3300o3387j53177L5676q0415p2982j33736
$$ 5074285 5041764 4875880 4692432 4609132 4545745 4392568 4428244 4347829 4274847 4141111
18309D141111l83071L7104Q6344j18969Q2881j56312j30710o7384j43499J5918
$$ 4141111 3758040 3795144 3881488 3762519 3845400 3689088 3558378 3490994 3347495 3363413
18299C363413R884j28306j42381r8492k75122j43672K78645P5027K85399K11793
$$ 3363413 3373297 3244991 3102610 3004118 2728996 2585324 2863969 2938996 3224395 3436188
18289C436188n6891j17867j86296K93193K90532j31717L0132q923J34581K53534
$$ 3436188 3379297 3261430 3075134 3368327 3658859 3527142 3557274 3548351 3682932 3936466
18279C936466J1094j65632r7903J05080J46449p6858j71830J33252J622J4212
$$ 3936466 3947560 3781928 3684025 3789105 3935554 3858696 3686866 3820118 3821740 3835952
18269C835952j78689M3820l8708n1858q1972l99559j44053q0970k90036j93675
$$ 3835952 3657263 3701083 3662375 3610517 3528545 3128986 2984933 2903963 2613927 2420252
18259B420252K10870J3178J8566J77319J74238K1633J87785o048M35590J96962
$$ 2420252 2631122 2644300 2662866 2840185 3014423 3036056 3223841 3217793 3653383 3850345
18249C850345O8213R5991M03541J36806N7334J07176n169M5564L26210Q8263j3502
$$ 3850345 3918558 4014549 4418090 4554896 4612230 4719406 4714237 4759801 5086011 5174274 5160772
18238E160772p6111r0057j08722j40263j31662O0833j15425k99715k41026k57089
$$ 5160772 5084661 4994604 4885882 4745619 4613957 4674790 4559365 4259650 4018624 3761535
18228C761535n22578k16290j44361r9190k3711L5496k65987k40783K7277R6758
$$ 3761535 3238957 3022667 2878306 2779116 2755405 2790901 2524914 2284131 2311408 2408166
18218B408166l6757L13399R8096l66279j12356M8357K8578K879K30268K40928
$$ 2408166 2371409 2684808 2782904 2416625 2304269 2352626 2381204 2384083 2614351 2855279
18208B855279P3459K34658L04089L95905K35853J51862K99657j37557l666L1461
$$ 2855279 2928738 3163396 3467485 3863390 4099243 4251105 4550762 4413205 4409539 4441000
18198D441000K02527K08640K65217J92660J45229o4431l83549k07491o2878k10708
$$ 4441000 4643527 4852167 5117384 5310044 5455273 5390842 5007293 4799802 4736924 4526216
18188D526216k5741N4240q0563k35444P3291j67927l97616k44112l81953l32989
$$ 4526216 4500475 4554715 4474152 4238708 4311999 4144072 3746456 3502344 3120391 2787402
18178B787402j13692j09571k96360p8445K37237J04587o7924j96954j39982q791
$$ 2787402 2673710 2564139 2267779 2189334 2426571 2531158 2463234 2266280 2126298 2117507
18168B117507L9173J4064J4854j77377k11825n172K20327J71710J32247Q8578
$$ 2117507 2156680 2170744 2185598 2008221 1796396 1791224 2011551 2183261 2315508 2404086
18158B404086M4610q9229L1502J42816L86959O0758J23912Q8549j5939r0051j88992
$$ 2404086 2448696 2359467 2390969 2533785 2920744 2981502 3105414 3193963 3178024 3087973 2898981
18147B898981m25376l819L49794J87083J10667J988J57088P4933m5211q298k09897
$$ 2898981 2473605 2469786 2819580 3006663 3117330 3119318 3276406 3351339 3306128 3297830 3087933
18136C087933j90336j9997M09693M71168m6683k09060J08772J52212J97968K9618
$$ 3087933 2897597 2877600 3287293 3758461 3711778 3502718 3611490 3763702 3961670 3991288
18126C991288j056M51223M60322N19485N32714Q73719J336966J549903K188229
$$ 3991288 3990232 4441455 4901777 5421262 5953976 6827695 8164661 9714564 11902793
18117A1902793L195929M895225P939579J3991431K7561663N5604037P9804051
$$ 11902793 15098722 19993947 27933526 41924957 69486620 125090657 204894708
18110B04894708N8570449K9493966J1029987o4620231r5457429n1664870k5091376
$$ 204894708 263465157 292959123 303989110 239368879 143911450 92246580 67155204
18103F7155204j3961469q376784n466181m046767l225708k607996k206155j675561
$$ 67155204 53193735 44816951 39350770 35304003 32078295 29470299 27264144 25588583
18095B5588583j295523j197193j305961j480986j292505j151041r13264o49121
$$ 25588583 24293060 23095867 21789906 20308920 19016415 17865374 16952110 16302989
18087A6302989p34680o99498p09898n79051l76775m72779m19947j68090o9192
$$ 16302989 15568309 14868811 14158913 13579862 13203087 12730308 12310361 12142271 12073079
18078A2073079j77220k76901k60165k52932o5117l09956l61327j14965K0624l25965
$$ 12073079 11895859 11618958 11358793 11105861 11040744 10730788 10369461 10254496 10275120 9949155
18068I949155k81729k96543o10097l02335p0209N5219k36786k64926K2357q5093
$$ 9949155 9667426 9370883 8760786 8458451 8388242 8443461 8206675 7941749 7964106 7879013
18058G879013j17429K8266k63390k09980k33719m70284l19104j08290k29249r7349
$$ 7879013 7761584 7789850 7526460 7316480 7082761 6612477 6293373 6185083 5955834 5858485
18048E858485j23749q9177k31342Q7003L8417j72826j11629J72404K81864L33177
$$ 5858485 5734736 5645559 5414217 5501220 5539637 5366811 5255182 5427586 5709450 6042627
18038F042627L36514K45635K28643K67569j05977K61940J40808p4790K26611N3382
$$ 6042627 6379141 6624776 6853419 7120988 7015011 7276951 7417759 7342969 7569580 7622962
18028G622962j78909j75747j69679k04918K60236K92394k0303k52980L193K97361
$$ 7622962 7444053 7268306 7098627 6893709 7153945 7446339 7426036 7173056 7176249 7473610
18018G473610P5080M21351O78850J029688J239534K167327L217702M615098O974349
$$ 7473610 7548690 7970041 8648891 9678579 10918113 13085440 16303142 20918240 27892589
18009B7892589J1435807K1037726L9289356N5476892M3338503K2545348O776887
$$ 27892589 39328396 60366122 99655478 155132370 198470873 221016221 227793108
18002B27793108m0657320o4253549l8915162k0438299j1682614o781733m310492
$$ 227793108 187135788 122882239 83967077 63528778 51846164 45064431 40753939
17995D0753939k986880k026667j614850q34555l74744M3963Q00579J945454L460369
$$ 40753939 37767059 35740392 34125542 33290987 32916243 32960206 33760785 35706239 39166608
17986C9166608N661389J0126201J9242155L6088994N2476720M3807141K4634936
$$ 39166608 44827997 54954198 74196353 110285347 162762067 206569208 231204144
17979B31204144J1398881k8723198n0669347j8180213J7811602L7931763K7282986
$$ 231204144 242603025 213879827 163210480 145030267 162841869 200773632 228056618
17972B28056618J2373648l433591m8352427n7837599l3512207j7899929j1195471
$$ 228056618 240430266 236996675 188644248 130806649 97294442 79394513 68199042
17965F8199042p456333n015319l501923l055211k374382j687582j332926o22136
$$ 68199042 60742709 55727390 52225467 49170256 46795874 45108292 43775366 43153230
17957D3153230K85045J479377K931803N014208R428586J8986163L5212367M7303685
$$ 43153230 43438275 44917652 47849455 52863663 62292249 81278412 116490779 163794464
17949A63794464L3624250J6104122J374967m2005938n6107203l2473643j7169469
$$ 163794464 197418714 213522836 214897803 172891865 116784662 84311019 67141550
17942F7141550j0192643o988778n232025l503410k572745k033204k103609j808299
$$ 67141550 56948907 49960129 44728104 41224694 38651949 36618745 34515136 32706837
17934C2706837j497907j418639j122988q42592q38859p87040n22329p18292n77299
$$ 32706837 31208930 29790291 28667303 27824711 26985852 26198812 25676483 24958191 24380892
17925B4380892o07479o71060r93838j036827n89549m61380m9070m01111r42437
$$ 24380892 23773413 23102353 22108515 21071688 20482139 20020759 19971689 19570578 18628141
17916A8628141p87911p16230q16027o18322n19849m50645m57804m45643n25115
$$ 18628141 17840230 17124000 16307973 15689651 15169802 14719157 14261353 13815710 13290595
17907A3290595l79026n00265n31949k85387l92955k50073k30043k36503l07016
$$ 13290595 12911569 12411304 11879355 11593968 11201013 10950940 10720897 10484394 10177378
17898A0177378k45137J23741K5999M94391O66083J12958j32249j63323m68141
$$ 10177378 9932241 10055982 10081981 10576372 11242455 11355413 11223164 11059841 10591700
17889A0591700q09645q43175n24066n56801l07106k63346j1429l05728j97999
$$ 10591700 9782055 8938880 8414814 7858013 7550907 7287561 7276132 6970404 6772405
17880F772405o1880k08086O8636j11632q0565n0484j41008l13185k53432p3478
$$ 6772405 6710525 6502439 6571075 6459443 6378878 6328394 6187386 5874201 5620769 5547291
17870E547291j82488l97381j76836J75115n0017J00530j72921J2465k93455k54317
$$ 5547291 5364803 4967422 4790586 4965701 4915684 5016214 4843293 4855758 4562303 4307986
17860D307986j6268J08090m898j89620k34310j59997k2664M9048j97077P8553
$$ 4307986 4291718 4399808 4394910 4205290 3970980 3810983 3788319 3837367 3640290 3718843
17850C718843j65725k70637K3822M2983q1595k56708N0425r2133J72690m4994
$$ 3718843 3553118 3282481 3306303 3349286 3267691 3010983 3061408 2969275 3141965 3096971
17840C096971l02993j04323K07381Q1333p7776k19358J35194O8979k52511l41374
$$ 3096971 2793978 2689655 2897036 2978369 2900593 2681235 2816429 2885408 2632897 2291523
17830B291523r0211J58929J73359j75744l00498J50246r6763k20683j079j55032
$$ 2291523 2201312 2360241 2533600 2357856 2057358 2207604 2110841 1890158 1889079 1734047
17820A734047p3723N4297J91309M1354j90812l51459L3960j44636L8289K80598
$$ 1734047 1660324 1714621 1905930 1947284 1756472 1405013 1438973 1294337 1332626 1613224
17810A613224K050j89285j00792q2332J43425J26260o3542m8426J31339j28585
$$ 1613224 1615274 1425989 1325197 1242865 1386290 1512550 1449008 1400582 1531921 1403336
17800A403336k82877j28464m6210K63267J71962p8685m5516M131N6266P9224j00168
$$ 1403336 1120459 991995 945785 1209052 1381014 1302329 1256813 1260944 1317210 1396434 1296266
17789A296266j39526n3123o21j31524K11681r2578k70016J63629P966k21769k35073
$$ 1296266 1156740 1103617 1102996 971472 1183153 1090575 820559 984188 992154 770385 535312
17778E35312k2138J71701K62270J86484o0653q0924J29497J5330j67778l28499
$$ 535312 513174 684875 947145 1133629 1072976 992052 1121549 1136879 969101 640602
17768F40602j27193K99877j51248j20149J69940J21339p2416q4218j5353q6604
$$ 640602 513409 813286 662038 541889 711829 833168 760752 676534 661181 574577
17758E74577l0796j1660p3885j87162J7290K73409J8900j88762j28902j41037
$$ 574577 543781 532121 458236 271074 288364 561773 580673 391911 263009 121972
17748A21972J32739K73681l5763k35453m7700N1624J77672L5278L5116M7862j33461
$$ 121972 254711 528392 492629 257176 209476 261100 438772 474050 509166 557028 423567
17737D23567l2911J44025r9704k04215Q2216K11246J37029N160j2511k20551J8603
$$ 423567 390656 534681 434977 230762 312978 524224 661253 666413 653902 433351 451954
17726D51954R3289j83380J9972j30537j62703q4343Q4031o8693o530l1643J6573
$$ 451954 545243 361863 381835 251298 88595 4252 88283 19590 13060 -18583 -2010
17715b010J39816J84850p4531j25165k1974m1059M9008K2132K13120M7403m2362
$$ -2010 137806 322656 248125 122960 100986 59927 108935 131067 344187 391590 349228
17704C49228K32338k0752N4331L4418j79920j00364m3611M13K85253j36305k03055
$$ 349228 581566 560814 615145 649563 469643 369279 325668 326081 611334 475029 271974
17693B71974k37491j38932J00804L29517k1215p1471K22630L72307K0333k33803
$$ 271974 34483 -104449 -3645 325872 304657 233186 455816 828123 848456 614653
17683F14653j58179o7823J12252J59421k12816j35142j84290j15868j36348K30553
$$ 614653 456474 388651 500903 660324 447508 312366 128076 12208 -124140 106413
17673A06413K46106m3848q9510k52855J4484Q9423J15792n6121K10095K16988
$$ 106413 352519 308671 219161 -33694 -19210 70213 186005 129884 339979 556967
17663E56967K67647q6135m12284J15659J12770j11037J18542Q8299o3421j60376
$$ 556967 824614 738479 326195 441854 554624 443587 562129 650428 587007 426631
17653D26631L5870J91857j491k74956n4613R7794j843j51817j82408j74863Q92
$$ 426631 462501 654358 652867 377911 323298 421092 419249 267432 85024 -89839 -88947
17642h8947L41245Q5703j05786j82938J9183k4891k72308J17106L35143j49483
$$ -88947 252298 338001 232215 49277 68460 43569 -228739 -111633 223510 74027
17632G4027o1320J49541K23996j78242o9805J26048q6158L9981J3003n6039k7035
$$ 74027 12707 162248 386244 208002 138197 264245 178087 218068 231071 175032 147997
17621A47997n5702Q7595k8211l7679M5431M0986k59584j52134J67032L61281J68515
$$ 147997 92295 179890 151679 114000 159431 200417 -59167 -211301 -44269 317012 485527
17610D85527J2949l58071j70321p3111J5719J16254K2852k85897m9971p2961L24228
$$ 485527 498476 140405 -29916 -103027 -87308 28946 51798 -234099 -284070 -357031 -32803
17599c2803L92130l09688k44692J58069O5891n8691K27043J96766K48j88526r8397
$$ -32803 359327 49639 -195053 -36984 28907 -29784 197259 394025 394273 205747 107350
17588A07350r8732q4408J72419J1238j47797J03263J1309J02230j2700N8529M1308
$$ 107350 8618 -75790 96629 107867 -39930 63333 74642 176872 164172 222701 264009
17577B64009q6627j86924j82546j36019o2693n4099J01848J84057O8045R158K90461
$$ 264009 177382 -9542 -192088 -328107 -390800 -444899 -343051 -158994 -90949 -81791 208670
17566B08670K18343Q9020L6035j27525j17864K07529P3303j26036M0592N8567
$$ 208670 427013 516033 552068 424543 306679 514208 587511 461475 502067 560634
17556E60634r0527j53978j2013M8975J19373j26237k22074k39064L1665j17285
$$ 560634 470107 316129 304116 353091 472464 346227 124153 -114911 -83246 -200531
17546b00531j6471J2064J92913Q6341j05020K5740J06207R3708j26375k58749
$$ -200531 -217002 -204938 -12025 74316 -30704 -4964 101243 194951 68576 -190173
17536a90173J96594k6745N4323J5432q6281O6255l4249l0831K01790k44052j92273
$$ -190173 6421 -20324 33999 49431 -36850 29405 -4844 -35675 166115 -77937 -270210
17525b70210L64401L4724j22056M6821M1013j12291Q6052r8401j66143L5533J25213
$$ -270210 94191 128915 6859 53680 94693 -17598 68454 -29947 -196090 -160557 -35344
17514c5344Q9724K0028k57918M5874J46526J96494k4983o2762O125K24260K01743
$$ -35344 54380 74408 -183510 -137636 8890 205384 180401 117639 123764 348024 549767
17503E49767j52666m1486K7242J52490j2265o880p8769l503J8141j3017k31573
$$ 549767 397101 355615 382857 535347 523082 516202 437433 433930 452071 439054 207481
17492B07481l00255K66482K32189L3906j14243j9842q4505J5009k49026o4176
$$ 207481 -92774 173708 405897 439803 325560 305718 221213 236222 -12804 -76980
17482g6980J60609j83550k3326K55518m3313l70825o9994L35894M74622M3620
$$ -76980 83629 -99921 -123247 132271 88958 -281867 -351861 -15967 458655 502275
17472E02275P5043p4821M704j34726M3682r9847J40077L25146K17641M05332L69548
$$ 502275 577318 502497 507201 372475 416157 316310 456387 781533 999174 1404506 1774054
17461A774054P236k70823l76260k92315j01009L1850o3083l28845j40881K89709
$$ 1774054 1781290 1510467 1134207 841892 740883 772733 709650 380805 239924 529633
17451E29633O9099l6266m9216N9418K04206M51089M97942N57158K51896Q8686
$$ 529633 598732 562466 513250 572668 776874 1227963 1725905 2283063 2534959 2623645
17441B623645m0271m13665j19558k05762m49745k06264j64786M68655N16821J39913
$$ 2623645 2583374 2169709 2050151 1844389 1394644 1188380 1023594 1492249 2009070 2148983
17431B148983p4143k33751r6264k86551k00026k14165J23934m9040l6101M9671
$$ 2148983 2074840 1841089 1744825 1458274 1258248 1044083 1168017 1118977 1082876 1132547
17421A132547J60394K60871j35983j76634j24278j80550j24474k34714j77316
$$ 1132547 1292941 1553812 1417829 1241195 1116917 936367 811893 577179 399863
17412C99863J67256K03168L62289L40098J38950k04323l1755j30720j56460l42649
$$ 399863 567119 770287 1132576 1472674 1611624 1407301 1375546 1244826 1088366 745717
17402G45717l36732j83288L5689k7471K8539J25861o2030j13671L0149j16707
$$ 745717 408985 225697 261386 233915 262454 388315 326285 212614 242763 126056
17392A26056j85330j54272n3702J10911K80339Q8465O8884L492j27758L34721
$$ 126056 -59274 -213546 -267248 -156337 124002 212467 281351 284843 157085 491806
17382D91806L4772r8809N676k53611n3992J29308j65051k0358O2004n1658L3790
$$ 491806 526578 427769 433445 179834 125842 255150 90099 69741 131745 80087 113877
17371A13877R3215J55591N3440k32854k95332K2105K65236o5981j0795K7519m1883
$$ 113877 207092 362683 416123 183269 -112063 -89958 175278 109297 98502 126021 84138
17360H4138L963N7526J49018M1418K29425j28866k42689j48058O1528o5763M7030
$$ 84138 88101 145627 294645 336063 565488 436622 193933 45875 107403 41640 88670
17349H8670M64122J29384j98804n9979j6373q2001J67356j7150k49944r7921R9797
$$ 88670 552792 682176 483372 423393 407020 325019 492375 475225 225281 127360 227157
17338B27157j70448m3020P0311J50676L7041K14406N3164j76598m09142j96699
$$ 227157 56709 13689 84000 234676 271717 486123 539287 362689 -46453 -243152
17328b43152K38365K60035j06777J2113M5653r9759J35879L6180p7132j17203
$$ -243152 -4787 255248 148471 160584 206237 106478 242357 278537 201405 84202
17318H4202J8411J17017j23994j63052J62241K85824J91518J04462j69788j68108
$$ 84202 102613 219630 95636 -67416 94825 380649 572167 676629 506841 338733
17308C38733P0030k28607j95570L34222P4403q4573p0308J4101m2109j52215M9404
$$ 338733 408763 180156 -15414 318808 393211 308638 238330 252431 210322 58107 107511
17297A07511K0037o5909K526j32660L3235M6854K0619k15842l7588q1696O1635
$$ 107511 127548 61639 64165 -68495 -35260 11594 32213 -183629 -221217 -302913 -241278
17286b41278k00815J77462J95301J13998J32512N3365k43610p664O2789O8088
$$ -241278 -442093 -264631 -69330 44668 177180 230545 -13065 -20729 42060 110148
17276A10148J82457m7568K3046J4718m3749m318j0981k90080m6006K25377M9866
$$ 110148 292605 245037 268083 282801 239052 234734 223753 -66327 -112333 113044 162910
17265A62910j46301J1013j92307j3978J55138n1337n5033K59545o4806j19419
$$ 162910 16609 27622 -164685 -178663 -23525 -74862 -129895 129650 64844 -54575
17255e4575r3972P9088J09820m3486K3331J45074j27124J16036j29377J49645
$$ -54575 -148547 -69459 40361 -3125 20206 165280 38156 154192 24815 174460
17245A74460J52968O5693q2056r7906K7696l138j54011k61015j4877J82282N0232
$$ 174460 327428 393121 311065 213159 240855 237717 83706 -177309 -192186 -9904 40328
17234D0328l6968J24155J04490j50653k25711J29488j99069l1586j46970K3150
$$ 40328 3360 127515 232005 81352 -144359 -14871 -213940 -245526 -392496 -369346
17224c69346L44160o8419p4415p9303O5151o740M0346N4997J00100r1337l9048
$$ -369346 -25186 -93605 -168020 -247323 -182172 -188912 -148566 -93569 6531 -84806 -123854
17213a23854o4889M2342j40568k71047J36419J09869L21696K77897j51710j7641
$$ -123854 -188743 -146401 -286969 -558016 -421597 -311728 9968 287865 136155 118514
17203A18514j30010J26855K38021o6240J03143L28925J35290K7825O6141n2885
$$ 118514 -11496 115359 353380 287140 390283 719208 854498 882323 948464 895579
17193H95579l02774k26912j48944R8647J62766J19941j9631M9568j07025l5835
$$ 895579 592805 365893 216949 315596 478362 598303 578672 628240 521215 485380
17183D85380K30580j20732l93112k55801j25391r3151J40217J06567m2959p7243
$$ 485380 715960 595228 202116 -53685 -179076 -272227 -132010 -25443 -68402 -145645
17173a45645j86092P261M7235K96286J06856Q4315J51781K79690J49382q6917
$$ -145645 -331737 -324476 -277241 19045 125901 210216 361997 641687 791069 704152
17163G04152J89093K28880O3729l41340l08424j77939o6257k087J42060l9464
$$ 704152 893245 1122125 1185854 844514 536090 358151 291894 289807 431867 392403
17153C92403j56309L9764m3665q8124k429l8650J29856K31306j26062j93655k68060
$$ 392403 236094 275858 232193 144069 141640 102990 232846 464152 338090 144435 -123625
17142a23625m1049Q6337K98735M8142J85467J08924j75900n31623j54141l9564
$$ -123625 -164674 -78337 220398 268540 454007 562931 387031 -144592 -298733 -338297
17132c38297j51724L29319J96815m6031j94524J11996L09070m1754N2498j5596
$$ -338297 -490021 -160702 36113 -9918 -204442 -92446 216624 174870 227368 211772
17122B11772J12283K24938j08750j61162k76455j79015m3540N5340N5208k192
$$ 211772 324055 548993 440243 279081 2626 -176389 -219929 -164589 -109381 -111573
17112a11573O2701k48880j66337O2445J69377K33650K48977l3206R6679p3050
$$ -111573 -48872 -297752 -464089 -401644 -232267 1383 250360 217154 313833 240783
17102B40783n5185l3563N9674l36366P7798K12392J74366N7475k0646p8741k11871
$$ 240783 185598 152035 211709 -124657 -46859 165533 339899 397374 376728 297987 86116
17091H6116P9032J26713q8313l77837j3902j2153K43937J51496R3486N3374l49718
$$ 86116 165148 291861 203548 -174289 -188191 -200344 43593 195089 288575 341949 -7769
17080g769l0523R1737l3391J20299n2119k30137j51911K44050J20048j0780j7580
$$ -7769 -38292 53445 20054 140353 88234 -141903 -293814 -49764 70284 59504 41924
17069D1924P5636N6976L8244J67488J96464q7929j65376j2450k46692k15510K72501
$$ 41924 117560 174536 212780 380268 576732 488803 323427 310977 64285 -151225 121276
17058A21276J98752J53149n7518k32039j56502p5516K78087l1801j1938k70102
$$ 121276 320028 473177 415659 183620 27118 -48398 229689 197888 185950 -84152
17048h4152k20273K14518J79235J02835l0186L4880m8870k18243L7619M4010K6589
$$ -84152 -304425 -89907 89328 192163 161977 196857 147987 -70256 -32637 11373 37962
17037C7962l0315N6603K5659r0565j16648o9421L7725O8628J88387j37324J8238
$$ 37962 7647 64250 89909 -656 -117304 -186725 -149000 -80372 108015 -29309 -11071
17026a1071k8209L6010K35387K4357p5704k06066J98768k0610Q646M9104k30244
$$ -11071 -39280 -3270 232117 256474 180770 -25296 173472 152862 161508 210612 -19632
17015a9632k10432j30459j4164J26363j16266N0856k1355M7657K38199m8295q5699
$$ -19632 -230064 -360523 -374687 -248324 -364590 -313734 -335089 -287432 -49233 -97528 -183227
17004a83227K35465K06343j39109N7255K12127j51241k74078k0307o1340O3515
$$ -183227 52238 258581 119472 176727 388854 237613 -36465 -56772 -118112 -54597
16994e4597L600J62059j2798k63021m9901J4715J50565J02753m4379k8096J54845
$$ -54597 -50997 111062 98264 -164757 -214658 -199943 -49378 53375 8996 -19100 135745
16983A35745J64422q713l03202j10136q6433Q5193J81177K24126o9359J80517
$$ 135745 300167 291454 -11748 -121884 -208317 -123124 58053 282179 212820 393337
16973C93337N5243k33021j08448k33597j9666J78372o4048j37881p2307r198P7382
$$ 393337 448580 215559 107111 -126486 -146152 32220 -31828 -169709 -242016 -251214 -173832
16962a73832J4485l3990O6423q3002j50485K54596K8982L01429J35320K14908
$$ -173832 -159347 -193337 -126914 -209916 -360401 -105805 -76823 224606 359926 574834
16952E74834j60400l66244p5606k92517J1624N5091o9225P8601J28615R2275J06344
$$ 574834 414434 48190 -27416 -319933 -308309 -253218 -322443 -243842 -115227 -22952 83392
16941H3392k0769L41566j69030j83564K07610K44010O3025k07529k98100K08340
$$ 83392 62623 404189 235159 51595 259205 503215 566240 358711 60611 268951
16931B68951J08060q8197l22597j02121J93420J44260n8837k10203J01678J47285
$$ 268951 377011 288814 -33783 -135904 57516 201776 142939 -67264 34414 181699
16921A81699m7988k18592r5341M528l3036K9925L03604r905k60621j00145K98625
$$ 181699 133711 -84881 -180222 -175694 -208730 -178805 124799 114894 -145727 -245872 52753
16910E2753O6938K4914O5782j93176N6962k94496k02697L67711K1857l0550J00964
$$ 52753 119691 144605 210387 17211 74173 -220323 -423020 -55309 -33452 -64002 36962
16899C6962j33921L6042n2472M9172j8265M7093N9042j21831O9945K95367J93908
$$ 36962 -96959 -60917 -113389 -64217 -82482 -35389 23653 -98178 -28233 267134 461042
16888D61042K3286l22437j44190R7524P7603m1749O7424R895L6288l44881k91818
$$ 461042 484328 161891 17701 115225 192828 151079 218503 228398 264686 -80195 -372013
16877c72013K18862K09398j86014p920K0805O7692n0584j22887r1033J04183M1511
$$ -372013 -153151 56247 -129767 -137687 -116882 -49190 -99774 -222661 -313694 -209511 -168000
16866a68000K5527l2814K1126O3577J07160j41762j12149J17808q5318o0568J67124
$$ -168000 -142473 -175287 -154161 -90584 16576 -125186 -237335 -119527 -204845 -265413 -98289
16855i8289Q4251Q7513j88L1179k36642Q588K93405p4126k25417O6766M0141p07
$$ -98289 -14038 73475 73287 104466 -132176 -123588 169817 95691 -129726 -62960 -22819 -23526
16843b3526k9188J19443l23461l7106K21174J86707r0054n1192P0062K5765J93751
$$ -23526 -52714 66729 -256732 -293838 -72664 114043 23989 -27203 42859 68624 262375
16832B62375J01457j91733l473n5853j60497j85194K11327J30801p1135M1977
$$ 262375 363832 172099 168626 112773 -47724 -232918 -21591 109210 38075 80052
16822H0052M4408J15641j01081k48706M881J65345J68790j91553l1497j3906M7607
$$ 80052 124460 240101 139020 -109686 -104805 60540 229330 37777 6280 -7626 39981
16811C9981n4572j23845J93059L3394J82818q449P2762L4618j12184j99405j35102
$$ 39981 -14591 -138436 54623 88017 270835 262386 335148 369766 257582 58177 -76925
16800g6925K66244N5882m9329K71590K34423j54505k60490K1606J08064l01812
$$ -76925 189319 245201 195872 467462 701885 547380 286890 308496 416560 114748
16790A14748k33606M4874J77592N7490J83462O4081n2693L2088N4362k1435J1501
$$ 114748 -118858 -73984 103608 161098 344560 408641 355948 388036 442398 420963 432464
16779D32464K30109k22701k20495J63489J79884k09000j19794q5356j90999p79
$$ 432464 662573 439872 219377 382866 562750 353750 233956 148600 -42399 -43178
16769d3178O7197J82877M8993M4209j6722j53508o0754j25639j81216r6489J79703
$$ -43178 24019 206896 255889 300098 283376 129868 69114 -56525 -237741 -334230 -154527
16758a54527K33194J36188q6704j30437L1934k2272Q4424K03842O7268k9853r7320
$$ -154527 78667 214855 128151 -2286 29648 7376 91800 295642 362910 333057 235737
16747B35737k45552K73122J08556J84607j40413j90139j15796j59287L258J55592
$$ 235737 -9815 263307 371863 556470 416057 225918 110122 -49165 -45907 109685
16737A09685q4521P0362K0531K5204q1623O516j81153n1106J74015J2152O5422
$$ 109685 25164 95526 116057 141261 59638 66154 -114999 -166105 7910 20062 85484
16726H5484n3789K87991M8264J4223m42797O1981P0519J57886P1919j3657K4163
$$ 85484 31695 319686 367950 382173 -60624 1357 71876 229762 301681 288024 312187
16715C12187n9003l12831j70494J40469O9240N6427q2290k5727R2207O5703l2208
$$ 312187 253184 -59647 -230141 -89672 -20432 35995 -46295 -72022 20185 85888 53680
16704E3680q187K437n5109J27446j04323O0570J94811k39573j14616P827R2822
$$ 53680 45493 47930 -7179 120267 15944 76514 271325 31752 -82864 -75037 17785
16693A7785Q2409O7350k00899J19141K58888N6546L4156j11203k04505k4888l40480
$$ 17785 100194 167544 -33355 85786 344674 401220 435376 324173 119668 94780 -245700
16682b45700k6947L7098o3317K42079J39710q1281K80461M6532j40702J57616
$$ -245700 -272647 -235549 -298866 -56787 82923 1642 282103 328635 187933 345549
16672C45549j15387k97740k10196L16982L85041r1882m13436k80126J39010O4004
$$ 345549 230162 -67578 -277774 39208 424249 332367 -81069 -361195 -222185 -158181
16662a58181o7491J51650J06225M7748J35323J2635k91220j60264J2045K17522
$$ -158181 -225672 -74022 32203 79951 215274 227909 -63311 -223575 -211530 5992
16652E992k672j00363j2752r9615P0393J18854m9634Q5808J28899j3507k68364
$$ 5992 3320 -97043 -109795 -209410 -139017 -20163 -69797 16011 144910 131403 -136961
16641a36961j32027N2379j26342J99047J94194K3258o481J09327k3066k18087
$$ -136961 -268988 -216609 -342951 -143904 50290 73548 67067 176394 153328 -64759
16631f4759J61262O4134j36968o9389O3967Q4017J99J1588M368m8243L0534p9543
$$ -64759 96503 160637 23669 -45720 18247 102264 102463 114051 118419 70176 100710 21167
16619B1167j34100J27676K17200O661R631q0104J38178M2373n080l09191j76193
$$ 21167 -112933 14743 231943 238604 248235 168131 306309 348682 343602 34411 -141782
16608a41782q2031K03580P6016j28854k72560K112L2349O8432j7359J70879K72784
$$ -141782 -223813 -20233 55783 -73071 -345631 -343519 -311170 -242738 -260097 -89218 183566
16597A83566o4823j75720J00970Q535J7391J676o79j29607o7790K74801J88645
$$ 183566 118743 -56977 43993 52528 69919 71595 70916 -58691 -126481 148320 336965
16586C36965m8740j02963o122j61574J20892K78602j95304j05865K42288j89798
$$ 336965 288225 185262 179140 17566 138458 417060 221756 115891 358179 168381
16576A68381j40646K73541o0142l86557q0778Q8797K76613J29571j73044k2979
$$ 168381 27735 301276 241134 -145423 -226201 -137404 139209 268780 95736 72757
16566G2757j16715J21521Q6288K08363J90165l03386k34627k59972r8846J48730
$$ 72757 -43958 77563 163851 372214 562379 258993 24366 -235606 -334452 -185722
16556a85722J58812j3801k19185K8484K01274N3576l110j1473O3652J22036K8845
$$ -185722 -26910 -40711 -259896 -231412 -30138 23438 20328 8855 72507 194543 223388
16545B23388o618j27220j53019l30381j15497K92626J97172N1967J47001Q0379
$$ 223388 216770 89550 -63469 -393850 -509347 -216721 -19549 32418 179419 259798
16535B59798j61821p4042K0095K0872O5073n9379q4628j8864m3985l7196n3509
$$ 259798 97977 23935 44030 64902 129975 70596 -14032 -32896 -76881 -114077 -167586
16524a67586J16448L2248J80598J47421L0125j10094j11483J48603J0510j94584
$$ -167586 -51138 -18890 161708 309129 339254 229160 117677 266280 276790 82206
16514H2206j20037J52487j36489o5020R6568m249n2301n1214m1715j08412K57087
$$ 82206 -37831 114656 -21833 -86853 9715 5466 -46835 -98049 -139764 -248176 8911
16503H911J69323m2687k16068O2992R7035j65643K53167L5543K743Q399j73295
$$ 8911 178234 135547 -80521 -17529 79506 -86137 167030 202573 205316 213715 40420
16492D0420k21986l5703Q4236J52692L03612L51m21677l7990K01807P3419J01376
$$ 40420 -181566 -217269 -133033 19659 323271 323622 -98055 -136045 65762 139181 240557
16481B40557j9782N3312l2600q1158k20265J93434N02413J72266l27360k88110
$$ 240557 220775 274087 241487 160329 -59936 133498 635911 808177 480817 192707
16471A92707J9283k97815l93787K74951K69276j89218j55835M8131R8429J89147
$$ 192707 211990 -85825 -479612 -204661 64615 -124603 -280438 -232307 -133878 55269
16461E5269K55242k0102K0454J1648r0863j6756k26286k06310p634m3571J16490
$$ 55269 310511 290409 310863 322511 231648 214892 -11394 -217704 -225338 -268909 -152419
16450a52419K52522r3134J09129k46561j71343K27089L58459j40105k98163O7606
$$ -152419 100103 6969 116098 -130463 -301806 -74717 283742 143637 -154526 -86920
16440h6920J36340O7322o8200j0110n1897m130M8756N9807O5843o5254k20190
$$ -86920 49420 116742 48542 38432 -13465 -17595 31161 90968 156811 91557 -128633
16429a28633Q5000N4344p4386Q7639J96287M882j18025j34114j95435q5493J67590
$$ -128633 -43633 10711 -63675 23964 220251 225133 107108 -27006 -222441 -307934 -140344
16418a40344j51660j28207J38813j20306k52109J09635k3887K04502K75903K17708
$$ -140344 -292004 -420211 -281398 -401704 -653813 -544178 -568065 -363563 -87660 130048
16408A30048j62878j28022m8982j11715J67609L21439M9804J36934p032j3133
$$ 130048 -32830 -160852 -209834 -321549 -153940 167499 217303 354237 347205 334072
16398C34072q4591p2552n3992j36244k6626O3976K2316J89801K4501o4367k0357
$$ 334072 249481 176929 122937 -13307 -39933 24043 46359 236160 260661 196294 175937
16387A75937j21478j69693k78241o2432K68610k1788N3813n6039O3582J59581
$$ 175937 54459 -115234 -393475 -455907 -187297 -209085 -155272 -211311 -147729 11852
16377A1852K91876R6406j07808o1360m7931N535k38987M5186O1090L5490j04022
$$ 11852 303728 400134 292326 230966 183035 188570 -50417 -5231 55859 91349 -12673
16366a2673N8009O1620J77393J18556J78057j79899j13850K6761p175l30817n2699
$$ -12673 45336 106956 284349 402905 580962 401063 287213 313974 306799 -24018 -76717
16355g6717J74327k6567K81112l990p8718j1771K25996K133l38230k71760l5772
$$ -76717 97610 71043 352155 348165 269447 257676 483672 485805 147575 -124185 -159957
16344a59957J50654K72404K2104k89472k45367N3381k5996M31K12000J51928L9992
$$ -159957 -9303 263101 285205 -4267 -249634 -196253 -222249 -221818 -9818 142110 182102
16333A82102j718J10300j14292o7124K2007P9763n516j05828j61202J8962p7549
$$ 182102 180384 290684 176392 109268 131275 211038 205522 99694 -61508 -42546 -120095
16322a20095Q1950J19853J89678l8795j77823J66869j06390r6046J13915J48378
$$ -120095 -38145 81708 271386 232591 54768 221637 115247 19201 133116 281494
16312B81494m2410p623k93972k23268J67628J47296L2976P1404J07689p0724k0520
$$ 281494 239084 231461 -62511 -285779 -118151 29145 62121 133525 241214 170490 149970
16301A49970K84744O924K764j61262l4102j98927j52819j98735M1649K34744p1335
$$ 149970 434714 441638 444402 283140 249038 50111 -102708 -301443 -259794 -25050 -96385
16290i6385j58762j63397J65889K12430J0350l35809l30838Q2255P6806K65147
$$ -96385 -255147 -418544 -252655 -40225 -29875 -365684 -696522 -614267 -537461 -272314
16280b72314J60321K60676L53763k49306l99267o0498J72609r3986j2871J18404
$$ -272314 -111993 148683 502446 253140 -146127 -206625 -34016 -128002 -140873 -22469
16270b2469J94382R1332j12224j31438N5809Q3353j60337j89051L0562R8334l6075
$$ -22469 171913 263245 151021 19583 75392 158745 -1592 -190643 -160081 -61747 -97822
16259i7822j90793p2439q0637p8696Q6508J52425K9549J28714Q3789K35503N6553
$$ -97822 -288615 -361054 -441691 -520387 -433879 -281454 -251905 -123191 -39402 196101 252654
16248B52654J49166j32728J12912J65028l62261j54069N4018Q7319o8682J44177
$$ 252654 401820 269092 382004 547032 184771 30702 84720 172039 103357 247534
16238B47534k18630Q3891K88096J5935l48070j1209J17842j66698k28334P2420
$$ 247534 28904 112795 400891 416826 68756 57547 175389 8691 -219643 -147223
16228a47223K78426k3556j53293M5568R6871p1539K8828K9214j78006N0985j17429
$$ -147223 131203 107647 -45646 -78 96793 25254 54082 83296 -94710 -43725 -161154
16217a61154k40326J17030P4368k49514N055M54139P7675j36043P5377l8209k95729
$$ -161154 -401480 -284450 -210082 -459596 -454541 -402 77273 -58770 16607 -21602 -317331
16206c17331l2916M10273K45526N1252j706l3543M0803n4050j17512N4176k81129
$$ -317331 -350247 60026 305552 356804 355098 321555 362358 308308 190796 244972 -36157
16195c6157j71585M7007J59498J2238O3912J26865P6780k75067j16439k6127l0347
$$ -36157 -207742 -160735 -1237 11001 74913 201778 278558 3491 -112948 -139075 -169422
16184a69422Q4273j13625J60940P0556M1391k06637l0535K51162P7854Q1575J39576
$$ -169422 -85149 -198774 -37834 32722 74113 -132524 -163059 88103 165957 247532 387108
16173C87108k57162j65002l4295J40533j4862l8736K69900K28072l9362k43568
$$ 387108 129946 -35056 -69351 71182 56320 17584 287484 515556 476194 232626
16163B32626j70590J59469M1090L6414r0264q3773L3042j08551k40559j19145
$$ 232626 62036 221505 262595 299009 208745 124972 158014 49463 -191096 -310241
16153c10241R7055J10544j38900l9864L37452K23892j36291J8112L8790L4245
$$ -310241 -213186 -102642 -241542 -281406 56046 279938 143647 161759 200549 234794
16143B34794K7873j33984j01420j3827j59261O3350J87677j10402L0348q7646
$$ 234794 262667 128683 27263 13436 -145825 -82475 105202 -5200 25148 -62498
16133f2498Q6787J37868j96641j22548k8890J4459J63082J51345J08523N4251
$$ -62498 24289 162157 -34484 -157032 -185922 -171463 -8381 142964 251487 305738
16123C05738j00581n9105K5701o8097j5587R1965O5162K51550J70320r5138l11470
$$ 305738 205157 146052 171753 103656 88069 180034 245196 496746 667066 571928 260458
16112B60458k26829k20647k65085L97360K10067j7551M260j51430j5249P7333
$$ 260458 33629 -187018 -452103 -54743 155324 137773 142033 -9397 -24646 52687
16102E2687P2862K50702j66839k02444j91068O2789J44674J7103j27178p6950
$$ 52687 125549 376251 209412 6968 -184100 -121311 23363 40466 -86712 -163662
16092a63662j67294k08107k87190L58097K32558q7836L1574J1205L6208R8054
$$ -163662 -330956 -539063 -826253 -468156 -235598 -323434 -291860 -280655 -244447 -146393
16082a46393q6799r1970J86663J62637n2114q6757N444j8173j181r2086k43429
$$ -146393 -233192 -325162 -138499 24138 -27976 -114733 -109289 -127462 -128643 -220729 -464158
16071d64158N4379M74781J9387R3912J7287j23431o3510k10077j51740K54663
$$ -464158 -409779 65002 84389 178301 195588 72157 8647 -201430 -353170 -98507
16061i8507M04449p1682j60382k0056k10908k50984j80215N6915K38663R4570
$$ -98507 305942 234260 73878 53822 -157086 -408070 -588285 -531370 -292707 -198137
16051a98137J14448j08062n4799J46915J23921J16702q2076k9889k38238j4520
$$ -198137 -83689 -191751 -246550 -99635 24286 140988 58912 29023 -209215 -223735
16041b23735J89181K37579Q1896P4049j95257l13072k3770L96622K30426M2838
$$ -223735 -34554 203025 284921 358970 163713 -149359 -173129 223493 453919 496757
16031D96757q392j74788j59811o7383K51181j41480k04619J28079O3811q0689
$$ 496757 488365 313577 153766 86383 337564 196084 -8535 119544 183355 102666
16021A02666J9890J29303P4087j06890K3846J10518r060n1110j94111j96950K7467
$$ 102666 122556 251859 325946 219056 242902 353420 344360 293250 99139 -97811 -70344
16010g0344K22743O4985j50069M3348M1924j64812j25369K94832R813k05324M8556
$$ -70344 152399 217384 67315 110663 152587 -12225 -137594 157238 167051 -38273 10283
15999A0283K76586J10717j49578j58903P434K44053j94316j54802o1496j16717
$$ 10283 286869 397586 248008 89105 96539 340592 146276 -8526 -70022 -186739
15989a86739j58506r5671Q1410J88089J63244J46014k16075p446J25763k62491
$$ -186739 -345245 -440916 -359506 -171417 -8173 137841 -78234 -85680 40083 -222408
15979b22408L0474J24944K6130J4704j40431j84761K02059p55O4489m9983k39938
$$ -222408 -191934 -66990 -40860 -26156 -166587 -351348 -149289 -150044 -85555 -135538 -375476
15968c75476K02195L42687P8421j81911k45780l70690j45831L80196K26551q6595
$$ -375476 -173281 169406 247827 65916 -179864 -550554 -696385 -316189 -89638 -176233
15958a76233m3227J83848J76652k45157O1470j46803l3126J03287O9935j36874
$$ -176233 -219460 -35612 141040 -104117 -42647 -189450 -222576 -119289 -49354 -186228
15948a86228k34302J44568K92091K2386p8626K9792L9436Q319l126K29599J06784
$$ -186228 -420530 -275962 16129 38515 -40111 -10319 29117 37436 34310 263909 370693
15937C70693r2094j67673j10374R8762o0577j64979r9787p853o5691L6392K83480
$$ 370693 278599 110926 552 99314 38737 -126242 -226029 -233882 -299573 -263181 20299
15926B0299K09039K30247q4006k07568k11252r5501q5181J11783J73793R6311
$$ 20299 229338 459585 375579 168011 -43241 -138742 -223923 -112140 61653 157964
15916A57964j51074j21516K25177n8025j45775J81859L8649n3305k28546k00759
$$ 157964 6890 -114626 110551 52526 -93249 88610 127259 73954 -154592 -355351
15906c55351Q7355M9436J16196J95301L0703q5795L5262N962r2006p2398J74982
$$ -355351 -267996 -218560 -102364 92937 123640 37845 73107 79069 -12937 -85335 89647
15895H9647J44224J59680P4361j72129j78810l6748Q0123J90856n8411j89528
$$ 89647 233871 393551 467912 295783 116973 80225 160348 351204 292793 103265
15885A03265k35314J96K06136J0546j79078J23305o6608l5433N8857M9401M0693
$$ 103265 -132049 -131853 74283 84829 -94249 29056 -37552 -72985 -14128 35273 75966
15874G5966J59869J05335j97313k07746o0341J04532R459L12979L14885J94820
$$ 75966 235835 341170 143857 -63889 -124230 -19698 -10239 302740 617625 812445
15864H12445l63819l40248j74314L781J20641j13957j97514j65374M7273K30367
$$ 812445 448626 108378 -65936 -62155 58486 -55471 -252985 -418359 -371086 -140719
15854a40719K42250J48004j9766p1423R8604q8594N2202j01206p3985K4535R5093
$$ -140719 101531 249535 229769 158346 256950 168356 220558 119352 45367 69902 164995
15843A64995O6804L8789k839j82794j59375j73276J85879J00491m0655J14262
$$ 164995 231799 270588 267749 84955 -74420 -247696 -61817 38674 -1981 112281
15833A12281J26191J60713p6402l03997j49070n2019J13276K17228j11525J00543
$$ 112281 238472 399185 322783 18786 -130284 -182303 -69027 148201 36676 137219
15823A37219K09958r5384j15356j53525K1496o7445j40167N4429K59370n9396
$$ 137219 347177 251793 136437 -17088 4408 -63037 -203204 -148775 110595 51199
15813E1199m2455l24168q5356J31143j20672p2586K97348K08212j32993j02857
$$ 51199 8744 -315424 -400780 -269637 -390309 -462895 -165547 42665 -90328 -193185
15803a93185J38845K72518j92663r0098J14136Q1146L7412K5846k7635j69724
$$ -193185 -54340 218178 25515 -64583 49553 130699 168111 193957 166322 -3402
15793c402k98290N319J03550J45752K61593k57503m61608K0968K58508R3239K25592
$$ -3402 -301692 -296373 -192823 -47071 214522 -42981 -504589 -483621 -225113 -131874 93718
15782I3718J25280k4671j70609l16305j44998K29418m5878j68121J85563J10135
$$ 93718 218998 194327 23718 -292587 -437585 -208167 -254045 -422166 -236603 -126468
15772a26468J61034J39809J66366j87233m36241J8930K06366J59092K10304L2889
$$ -126468 34566 174375 340741 153508 -282733 -263803 -57437 101655 311959 344848
15762C44848j07814j80697m1914J34021q5575j26996n0126J55758J1792k13426
$$ 344848 237034 56337 14423 148444 62869 -64127 -114253 41505 53297 -160129
15752a60129q7651N8632K98360J7867P4150j77813k00215k304J17481R0757J0086
$$ -160129 -247780 -189148 109212 127079 201229 23416 -176799 -179103 -61622 29135 39221
15741C9221n6410m1255j55663M0506K9167L63843j60515l84780K29430L08861
$$ 39221 -17189 -58444 -214107 -173601 -144434 219409 58894 -325886 -96456 212405
15731B12405Q3949j72799k57980j12956J69609K667j4270J63973j76342N7239
$$ 212405 296354 123555 -134425 -247381 -77772 -75105 -89375 74598 -101744 -44505
15721d4505q5122k36442R4266R381J48377Q7837K70665q9551j68584o5244Q6762
$$ -44505 -129627 -366069 -271803 -262422 -114045 -26208 244457 154906 -13678 -78922 7840
15710G840Q7398R3299m3760j46142l8299P2144k0801K08792K36993J3050l12213
$$ 7840 95238 188537 144777 -1365 -39664 32480 11679 220471 457464 470514 158301
15699A58301j18884M0161k32338k0333J57555J38082J18084j94268P2475q8704
$$ 158301 39417 79578 -152760 -173093 -15538 122544 240628 46360 118835 30131
15689C0131N0455l873k18111L5147L43380L3439j78259q0685P1008j582J44553
$$ 30131 80586 76713 -141398 -106251 237129 270568 92309 11624 82632 81050 225603
15678B25603J59327j59411l41517l39231J33682K27548J67502K7622J7993l0317
$$ 225603 384930 225519 -115998 -455229 -321547 -93999 73503 101125 119118 88801
15668H8801M5810j08599j02831j13615j31874j3072J63409J24267j62557r2476
$$ 88801 134611 26012 -76819 -190434 -322308 -335380 -171971 -47704 -210261 -302737
15658c02737j945J43368K58612Q2998l82624J84397J37045K2613j03580j15075
$$ -302737 -304682 -161314 97298 180296 -202328 -17931 119114 141727 38147 -76928
15648g6928L22786J46192j23211j90342L8771k2218R7660J35527k58494k12496
$$ -76928 245858 392050 268839 78497 117268 95050 192710 328237 69743 -142753
15638a42753K17652K89830J90653l80909k6977K56713O1928P5333l3450j07613
$$ -142753 74899 364729 555382 174473 147496 404209 466137 541470 508020 400407
15628D00407m20659Q7969J7669K0700m1663K37764O2902K9321N5809k44087j89616
$$ 400407 -20252 67717 85386 106086 64423 302187 365089 394410 450219 206132 16516
15617A6516J46125P4162j28678j47437Q7820J2984j16R8809J90357k00677m9121
$$ 16516 162641 236803 108125 -39312 48508 61492 61376 160185 350542 149865 100744
15606A00744r1283K7178j75522k18821J00914J32296K34780J51840j37786n0364
$$ 100744 9461 36639 -138883 -357704 -256790 -124494 110286 262126 124340 73976
15596G3976J33737j22608k7097k33892R4906j3847M8836j74911k00446O5296M34022
$$ 73976 207713 85105 58008 -175884 -80978 -94825 -45989 -220900 -421346 -356050 77972
15585G7972J41687J8890K5485j05670j46419p357j39401N0672K93947M5575q5021
$$ 77972 219659 238549 264034 158364 11945 4588 -134813 -84141 209806 255381 170360
15574A70360n4168J96612J60641j82917j80454j17803M2876k0409j53970k5077
$$ 170360 116192 312804 473445 290528 110074 -7729 35147 14738 -139232 -164309
15564a64309K42527Q9203J4177R697J39013k4416k2157O9589j24091j68616J16529
$$ -164309 78218 167421 181598 191295 330308 305892 283735 353324 229233 60617 177146
15553A77146k6518M5613J72820j2938r5713j26611q865K46794M3781j73437j49549
$$ 177146 150628 196241 369061 356123 260410 133799 124934 371728 415509 242072 92523
15542I2523j14082q195K17734K31o3162K8850K492j390p512j22845j39738n831
$$ 92523 -21559 -29754 187980 188211 125049 153899 156391 155001 147489 24644 -115094 -120925
15530a20925J11342j28463j31298o728j80595p8188N7650J48167K47400N2098
$$ -120925 -9583 -138046 -269344 -276072 -456667 -534855 -477205 -329038 -81638 -29540
15520b9540K5944Q2488l1665P0270p243j30956j81227j92440o5645K10509R0427
$$ -29540 -3596 78892 47227 117497 110254 -20702 -201929 -394369 -460014 -249505 -159078
15509a59078J43720K75081k40630p1878J52313J25657J87980l2245j43906q9313
$$ -159078 -15358 259723 19093 -52785 99528 225185 413165 380920 237014 147701
15499A47701J72582j07O5611O1292j61986K4243k26684L9014J7127j74251j52865
$$ 147701 320283 320176 385787 447079 285093 309336 82652 121666 138793 -35458 -188323
15488a88323J02362J43070j74524q9426J10549L06213j4573k36020P7945J41828
$$ -188323 -85961 57109 -117415 -206841 -96292 209921 195348 -40672 37273 179101
15478A79101j29554O20j42482l93448r4716o1242j21247P8823K99172J65282K13943
$$ 179101 49547 50167 -92315 -485763 -580479 -641721 -762968 -684145 -384973 -219691 -5748
15467e748J51111k7394K16808M4913j01631k07611m5090r5624j0875K68167K6107
$$ -5748 145363 117969 334777 379690 278059 70448 25358 -70266 -81141 187026 213133
15456B13133L3865k4245l520P9529j54872k36358o3684N837N4635J8178o8163
$$ 213133 246998 222753 219233 298762 143890 -92468 -156152 -150315 -95680 -77502 -145665
15445a45665j99398J14395K55102O4389n4243o9804m5J19951J34339j7528p3230
$$ -145665 -345063 -230668 24434 88823 34580 -35224 -35269 84682 219021 201493 128263
15434A28263J26360J86760j42657k19094n9375n2508j61643l3149J78318l5785
$$ 128263 254623 441383 298726 79632 20257 -32251 -193894 -227043 -48725 -84510
15424h4510J31431R6168R9973j44515j16656N633n0429k85553j1578J36444K08282
$$ -84510 46921 143089 243062 98547 -18109 -12476 -62905 -348458 -360036 -223592 -15310
15413a5310J71581J13740j86324r1618J27737K847k2039R1302N5058J1343n8249
$$ -15310 156271 270011 83687 -7931 119806 122653 100614 191916 246974 258317 200068
15402B00068k34044j11195K84797J98507P7237k5909N892j20016k21063J04749
$$ 200068 -33976 -145171 139626 338133 415370 389461 395353 275337 54274 159023
15392A59023n5209N9767L49095q3521j61799J04079j8784N9236l63522l67124
$$ 159023 103814 163581 512676 429155 267356 371435 352651 411887 48365 -318759
15382c18759j9679o662J75906J05472l08069j12790K14848J68665K14708k23966
$$ -318759 -338438 -345100 -169194 -63722 -371791 -484581 -269733 -101068 113640 -110326
15372a10326k25937l1451K12211K09659L0671j4942j66225j70954J69626j1052
$$ -110326 -336263 -367714 -155503 54156 84827 69885 -96340 -267294 -97668 -108720
15362a08720J26635J38333J03823k3441j90034j32542J46079Q5507Q6622j62685
$$ -108720 17915 156248 260071 236630 46596 -85946 60133 145640 232262 69577
15352F9577n7307L77526m0706k13123J32551J26675j21779p6040j11994N2356
$$ 69577 12270 389796 349090 135967 268518 395193 273414 197374 85380 137736
15342A37736Q2070m0781k74715p3040M0665j21433P9j01697j73354K70263K66693
$$ 137736 219806 179025 -95690 -168730 -128065 -249498 -249419 -351116 -524470 -254207 12486
15331A2486p8328q7267N075r9548k60590J04744J24839j63351q4028J69117J19641
$$ 12486 -65842 -153109 -148034 -247582 -508172 -403428 -278589 -441940 -525968 -356851 -237210
15320b37210O6848L43502L44805k67778k78633o8766o6910J86878J16255m4571
$$ -237210 -170362 173140 517945 250167 -28466 -97232 -164142 22736 138991 94420
15310I4420K6769L4997j33868j26401J26188K01840J9394j71058o9461N3632N2574
$$ 94420 121189 156186 22318 -104083 22105 223945 243339 72281 2820 56452 109026
15299A09026J20126R4754l1792k6177M6161j96437j98680j11382j3453j07239
$$ 109026 229152 323906 292114 265937 312098 115661 -83019 -194401 -207854 -315093
15289c15093j0856K55305K17667J48172J2722P0559m0888l48565l01907J9343
$$ -315093 -325949 -70644 147023 295195 307917 378476 337588 -10977 -312884 -293541
15279b93541p4697O0744K76911J28130m0841j23802o6076O1872j30196l2970O6202
$$ -293541 -368238 -307494 -30583 97547 56706 -67096 -133172 -71300 -201496 -234466 -168264
15268a68264k3929J68683p2862j52578m2457l2775K23168m827k94962m3995K97391
$$ -168264 -192193 -23510 -96372 -248950 -291407 -324182 -101014 -105841 -400803 -444798 -147407
15257a47407K52298k4503j30336K38463L3723k05744m7916o9709k06791q8362
$$ -147407 104891 80388 -49948 188515 222238 16494 -31422 -101131 -307922 -396284
15247c96284j80558j45816K92655K45026L86851k19468q417l0347n9585l64463
$$ -396284 -576842 -722658 -430003 -184977 201874 -17594 -26011 -56358 -115943 -480406
15237d80406K3081J14164K45195J66989O3752k01713j5080K69323K12817r8955
$$ -480406 -457325 -343161 -97966 69023 132775 -68938 -84018 185305 398122 299167
15227B99167k99766l08764j33303K22145K53450J68790j83630M8621J36402K4334
$$ 299167 -599 -309363 -442666 -220521 32929 201719 18089 66710 203112 227446
15217B27446P178j53716k59276k24409K8766K3231j47419M7747K53701J43166
$$ 227446 234624 80908 -178368 -402777 -374011 -350780 -498199 -450452 -196751 -53585
15207e3585j03626j0917L7135J01884m4649K5202Q3414r1764J02067k9900j44865
$$ -53585 -157211 -168128 -130993 -29109 -73758 -48556 34858 -56906 45161 15261 -129604
15196a29604Q3454Q5131J25054M9815j35300k36391l6557p6879m01382j22768
$$ -129604 -46150 38981 164035 213850 78550 -157841 -194398 -271277 -672659 -795427
15186g95427K12876M34035P3897j60421K3842m830J36876K1786j24031k0437J56405
$$ -795427 -582551 -148516 -74619 -235040 -211198 -216028 -79152 -57366 -181397 -201834 -45429
15175d5429J68313K8492J26399j53228j73469P8591j26330J83243M35852P4630
$$ -45429 122884 151376 277775 124547 -48922 29669 -96661 86582 522434 597064
15165E97064j93553k28406l87142k66749Q2692J08405Q9465o7925j3543J23271
$$ 597064 403511 175105 -212037 -478786 -396094 -287689 -198224 -266149 -279692 -156421
15155a56421L8371J68990P9013p5711k44983l4390P4926K28077J45247K3018j15331
$$ -156421 -118050 50940 129953 54242 -190741 -225131 -150205 77872 223119 246137 130806
15144A30806J34010J10315J7094j63865m32K3235k54522j54039K136l0561j49683
$$ 130806 264816 375131 392225 228360 227928 251163 -3359 -157398 -155262 -185823 -335506
15133c35506Q9253K16736J81163J18963K31848r7138J48218l42443l46116P546
$$ -335506 -246253 -29517 151646 270609 502457 405319 553537 211094 -135022 -127476
15123a27476Q8312J61734J98440J63970l07k40224L4242j17462k56753j11719
$$ -127476 -39164 122570 321010 484980 484673 244449 278691 161229 -95524 -207243
15113b07243L1323N1239J97083P6498j36817r1456j11437Q0996J96568J13901
$$ -207243 -175920 -124681 72402 148900 12083 -79373 -190810 -109814 86754 200655
15103B00655j31351J40091J2230k24283k76831o3806J27711L63326L7650p6171
$$ 200655 69304 209395 221625 -2658 -279489 -343295 -215584 147742 185392 109221
15093A09221j99675J80610K15251k4267l8055p7662j14180j2017j79930k23309
$$ 109221 -90454 90156 305407 281140 243085 165423 51243 39226 -140704 -364013
15083c64013Q4848P5575Q5934J46066J09362m8667J835K7516n7934m951n7832
$$ -364013 -279165 -203590 -117656 28410 137772 89105 90940 118456 60522 55571 -2261
15072b261o2333k9857J8267L0690J72532o727k437k6563J00885P3023J27994r0766
$$ -2261 -64594 -94451 -76184 -45494 127038 120311 117874 91311 192196 265219 393213 302447
15060C02447l24631j81468K48215j83467j71426J17155J04936M6930l5533j22130
$$ 302447 -22184 -203652 44563 -138904 -310330 -193175 -88239 -41309 -76842 -198972
15050a98972K64914P9381j29621j50962J8310J03675R7474O3863k31046j79053
$$ -198972 65942 145323 15702 -135260 -116950 -13275 84199 148062 -82984 -262037
15040b62037M5987K52779K39988k97496K8225O7842j10665J6507q7655O240j5466
$$ -262037 -216050 36729 276717 -20779 7446 75288 -35377 -18870 -106525 -100285 -115751
15029a15751o0874K126K07808K3193r305p4506J85826K29877p4750k9753J4167
$$ -115751 -176625 -174499 33309 56502 47197 -27309 158517 388394 313644 283891 298058
15018B98058J8205J61381j41618o8458j17679k00251n0593P9554M3131m5388O2562
$$ 298058 316263 477644 336026 267568 149889 -50362 -100955 -21401 21730 -23658 38904
15007C8904K7093j49790k25213Q9934K24932M7398J07505j16104k31979n020L35567
$$ 38904 65997 -83793 -309006 -219072 5860 53258 160763 44659 -187320 -192340 143227
14996A43227K64639j7643j01437r9044j83445j93345Q5614J7586k09727P8558
$$ 143227 407866 390223 288786 189742 6297 -187048 -101434 -83848 -293575 -215017
14986b15017L03439N2899J04117L23418K1031l83668j27555K3315Q1261J3308
$$ -215017 88422 141321 245438 568856 589887 206219 78664 101979 183240 196548
14976A96548o2329j27957N7161J24577Q3359O6815q3976l9784k00450j15520P1796
$$ 196548 134219 6262 63423 188000 271359 338174 254198 214414 13964 -101556 -29760
14965b9760P8172l9460J35413J06956k21068J54364J4915j86488j10859J56866
$$ -29760 48412 8952 144365 251321 30253 184617 199532 13044 -97815 59051
14955E9051R30J02306K37467k00056J62233j02263L2201j66153p0370R9649n5494
$$ 59051 59981 162287 399754 199698 361931 259668 291869 125716 55346 154995 99501
14944I9501j1558J2321l3265L9593n6421Q0342l4879k19995P2565j09999R609
$$ 99501 87943 100264 66999 106592 50171 130513 95634 -124361 -51796 -161795 -152186
14933a52186K74668j0955J70894L8703J74880k58619k34379M0151K20924K04683
$$ -152186 122482 111527 282421 321124 496004 237385 3006 43157 264081 468764
14923D68764n3608k68160n4770L56493J72267j61279m32487k54061J47544k38471
$$ 468764 415156 146996 92226 448719 620986 459707 27220 -226841 -79297 -317768
14913c17768M2953K83755J40636n8144L4695P4882j60178o4941K9905K16393N1505
$$ -317768 -274815 8940 149576 91432 126127 201009 40831 -24110 5795 222188 273693
14902B73693l20253L5703Q08L26513R5119l60842k40855M3495J49000J17027R8832
$$ 273693 -46560 -10857 -10049 316464 411583 50741 -190114 -146619 2381 119408 218240
14891B18240J089m3110j39465r0111j39446K84365J94637M3385Q8041k42669r8638
$$ 218240 219329 176219 36754 -53357 -192803 91562 286199 329584 417625 174956 76318
14880G6318j51098j09305m1891J45599K31988k44497j96770k2500j3520j56849
$$ 76318 -74780 -184085 -225976 -80377 151611 -92886 -289656 -312156 -325676 -482525
14870d82525K9266J19314K87487K01908j7511k07286r6287K17347o3148j81777
$$ -482525 -453259 -333945 -46458 155450 137939 -69347 -165634 51713 -11435 -193212
14860a93212J22796M44268O0094N3426l0336J0105j49586J85796j61486k56535
$$ -193212 -70416 373852 433946 487372 457036 467141 317555 503351 341865 85330
14850H5330M0499M0610J59776J9195K61173r8638q1075j89287j02033p2034J28762
$$ 85330 125829 166439 326215 345410 606583 507945 426870 237583 135550 63516 192278
14839A92278K99534j90871k27731J7725K01987L8732n7452k21383r1284J22188
$$ 192278 491812 300941 73210 90935 292922 331654 274202 52819 -38465 83723
14829H3723L46092k73760l57663j42809K02725q0863J5771J02781O506J11330
$$ 83723 429815 156055 -201608 -344417 -141692 -222555 -206784 -104003 -97497 13833
14819A3833j14752j97624K7033K27846O818l1143N5685k15369J80020Q3250j37995
$$ 13833 -100919 -298543 -271510 -43664 -36846 -67989 -12304 -227673 -47653 35597 -102398
14808a02398j01718J58308N3175j38556N5075K61924Q4841n3626O759p6115j95694
$$ -102398 -204116 -45808 7367 -131189 -76114 185810 270651 217025 223784 147669 -48025
14797d8025P922q047o7656j57085j7591P2740O6368O35j54633m3688p958J88933
$$ -48025 -40103 -48150 -115806 -272891 -290482 -217742 -151374 -150739 -305372 -349060 -357018 -168085
14785a68085J54555J41602N7398j51799J19219o113J64743L11108j96891m56694
$$ -168085 -13530 128072 185470 33671 152890 146777 311520 622628 425737 -30957
14775c0957N1500K65983J08956k89657j66583n2230N2583j27105r7336J42309
$$ -30957 20543 286526 395482 105825 -60758 -112988 -60405 -187510 -284846 -142537
14765a42537L01189j19424k16154L3831l9703P4513R8781J34572m4429l0631k19393
$$ -142537 158652 39228 -176926 -143095 -182798 -108285 -9504 125068 80639 50008 -169385
14754a69385m6173L1260L44J36824R4088J09285n8028k32246l8950L60771J01090
$$ -169385 -215558 -184298 -183954 -47130 46958 156243 98215 -134031 -172981 187790 288880
14743B88880j79218J2076k37549R6404M7388j92291j953P2958Q2339N0989J21995
$$ 288880 109662 121738 -115811 -19407 27981 -164310 -166263 -93305 -10966 40023 162018
14732A62018k8744j26271p7657J09687J04620j8504n0596j08389n8182J74469
$$ 162018 133274 7003 -70654 39033 143653 125149 74553 -33836 -92018 82451
14722H2451J23402P7351n3331j49339j30019j09207K5493L83098K07920j12499
$$ 82451 205853 283204 229873 80534 -49485 -158692 -133199 249899 457819 345320
14712C45320k75322P458J01839N1157J02711n5144r4907k08756J22023J15773
$$ 345320 69998 77456 179295 230452 333163 278019 183112 -25644 96379 212152
14702B12152m9283M2981R0216O206m6493L5655j91091j43693l8891J72468Q3930
$$ 212152 162869 205850 296066 302272 255779 291434 100343 -43350 -82241 90227 174157
14691A74157J55407j43280o3303N0375q4032j06982R9446O4041o1573q8840K00687
$$ 174157 329564 186284 122981 173356 89324 -17658 81788 145829 84256 -4584 196103
14680A96103P1743p1617j73358j06315k5064j3300J2108K48248O7471n9578L6878
$$ 196103 267846 196229 22871 -83444 -108508 -121808 -109700 138548 206019 146441 183319
14669A83319O4530j6920R4428M2657L634j16981k31598k09075M0642J89714J53927
$$ 183319 247849 230929 325357 368014 371648 254667 23069 -186006 -145364 44350 198277
14658A98277n376O4065r520j89910j51354r9199J29730K01769R2600j55584l6492
$$ 198277 192901 256966 247446 57536 -93818 -193017 -63287 138482 231082 75498 39006
14647C9006K45560R7933k36092r7943o8781N3132L7132j7417L0201N2754K87691
$$ 39006 284566 382499 146407 48464 -20317 32815 69947 52530 82731 135485 423176
14636D23176P3197O3347l55548k42900k14863N9574J71491R1434k02604q0682
$$ 423176 496373 559720 204172 -38728 -253591 -194017 -22526 68908 -133696 -214378
14626b14378K9869K9472O0516J59007j75647k9883k45441j57826M04686L00984
$$ -214378 -184509 -155037 -94521 64486 -111161 -141044 -386485 -544311 -139625 161359
14616A61359M2943j13904j09097l4171P0917R7691M9072n3668o1q0601j2269n4126
$$ 161359 204302 90398 -18699 -52870 18047 115738 164810 111142 111081 30480 18211 -35915
14604c5915p6337j20619J59418q667n5884l7294J57265J99259O238l12994Q7090
$$ -35915 -112252 -232871 -73453 -82120 -138004 -175298 -18033 181226 187464 -125530 -38440
14593c8440L57764N9544j01833q5718j79523j39273K09495m3854j5311K77925
$$ -38440 319324 378868 277035 191317 11794 -127479 82016 38162 22851 300776
14583C00776q5940j55392O3123j00495J23706O4182k47884j53280n1032J32098
$$ 300776 214836 59444 122567 22072 145778 209960 -37924 -191204 -242236 -110138
14573a10138R0744k14606j35270N5670J50463m6399n4392K86637J14707j72617
$$ -110138 -19394 -234000 -369270 -313600 -163137 -209536 -263928 22709 137416 -35201
14563c5201k6274J94741P0121J73099j8698j28554j43833j31904M9696o0861k36405
$$ -35201 -61475 133266 203387 376486 357788 229234 85401 -46503 3193 -57668 -294073
14552b94073R6825J53226J29601j19673j09291j05872o1456m5321R2049L50156
$$ -294073 -197248 -44022 85579 -34094 -143385 -249257 -310713 -356034 -263985 86171
14542H6171K87237J07532l04591p2031r8625j23119j4327K72328l0715k80962
$$ 86171 373408 480940 176349 104318 5693 -117426 -131753 140575 109860 -171102
14532a71102k82145N32483M28878j33960k19503j97485l4413p2968k28560N6551
$$ -171102 -453247 79236 508114 374154 154651 -42834 -77247 -150215 -378775 -322224
14522c22224P1855k3985k1849J08467J29896J36096m0731L9551J6488o4801j51714
$$ -322224 -250369 -274354 -296203 -187736 -57840 78256 37525 77076 93564 28763 -122951
14511a22951j62956L4683J59084N7187J21698J88532J1504j9648n9001L802j18478
$$ -122951 -285907 -251224 -92140 -34953 86745 275277 286781 267133 208132 211934 93456
14500I3456L2754L0883j55447J05863j39488k46026j9406J82898K57452J20844
$$ 93456 126210 157093 1646 107509 -31979 -278005 -297411 -114513 142939 263783
14490B63783J0621j04408q3591L33522K50613l04912l17828n3152O7764J9075
$$ 263783 274404 169996 86405 419927 670540 365628 47800 -5352 62412 81487
14480H1487j8546J49197p4627N234j58878l5607j13045M2376K28625k11827j43628
$$ 81487 62941 212138 137511 142745 -16133 -51740 -164785 -122409 106216 -105611 -249239
14469b49239J96967k4030L1195Q2015K07453K87238k0228l61900R9889L6903j46777
$$ -249239 -52272 -76302 -45107 36908 244361 531599 511371 149471 249360 286263 139486
14458A39486k71329J38741j5081k42178K215K48963L44627J21731J29927o7259
$$ 139486 -131843 6898 -8183 -250361 -248146 817 345444 467175 597102 529843
14448E29843q6705J39827Q3517j64414k09584j73181N8846q0753k78242p571q5092
$$ 529843 443138 582965 666482 502068 292484 119303 178149 97396 -180846 -188417 -273509
14437b73509j66624K10390J75443m4347o2802n8226P6088J75530K1277j14899
$$ -273509 -440133 -229743 -54300 -98647 -161449 -219675 -143587 31943 53220 -61679
14427f1679l5418q9641J48280j2376k1949J44637j10661k8679J63939J59027L2701
$$ -61679 -97097 -186738 -38458 -50834 -72783 71854 -38807 -67486 96453 255480 288181
14416B88181j11699j77285j42825k28302J75495J70198N0963k3995J48875j226
$$ 288181 176482 -803 -143628 -371930 -196435 -26237 24726 731 149606 148380
14406A48380K11210n7727k62287J3136m5829q1312J94172L19990j43152p436k8343
$$ 148380 359590 301863 39576 52712 6883 -74429 119743 439733 296581 289145 260802
14395B60802k17629L37500p82k44466j04560K61822K7745k82019k72692j37740
$$ 260802 43173 380673 379891 135425 30865 292687 320432 38413 -234279 -372019
14385c72019J98062l5760J84279K34629j4653m7752k32224L9583P6023R5388o1684
$$ -372019 -173957 -209717 -25438 209191 194538 146786 -85438 -45855 30168 125556 63872
14374F3872R7775O655J44028j32242j3189K26768j87706l86512K9006O62K02363
$$ 63872 161647 168302 312330 180088 166899 393667 205961 -180551 -151545 -150883 51480
14363E1480k6592J27001j49508k15988p3076J58072l2193J26342k39276N4452
$$ 51480 24888 151889 2381 -213607 -286683 -128611 -160804 -34462 -273738 -219286
14353b19286J48802Q1959k81591k05889M11229K37624O2012j94069J14883J80874
$$ -219286 -70484 11475 -270116 -476005 -64776 172848 234860 40791 155674 336548
14343C36548k0335l32641L4208J70830Q2552k7128j4313j07707j49216j60905
$$ 336548 316213 -16428 17780 188610 271162 244034 229721 122014 -27202 -188107
14333a88107J05032N1541l5865J92171K2318o2491J28410n4421j29113O6356J07397
$$ -188107 -83075 -31534 -67399 124772 147090 84599 213009 158588 29475 95831 203228
14322B03228j68646l368k1748K10655R6695j8795J10446j18162K32r8550j60278
$$ 203228 34582 31214 9466 220121 316816 298021 408467 290305 290537 191987 31709
14311C1709J41271j62274r4312j35890k12119J54162M82527J60231q2196k76596
$$ 31709 172980 10706 -83606 -219496 -431615 -277453 205074 365305 283109 6513
14301F513q8690J12321j97956q2626J19447R2592K22692k87832p7047L51307O9756
$$ 6513 -82177 30144 -167812 -250438 -130991 -38399 184293 -103539 -180586 170721 240477
14290B40477j86903k3750K13875J79371k95662j41434O7168j19847J3136L36970
$$ 240477 53574 29824 243699 423070 127408 -14026 53142 -66705 -53569 283401
14280B83401L9552J9476m2559l318j37637l63904M6358K64095J98555r1345k21275
$$ 283401 322953 342429 299870 296552 158915 -204989 -158631 105464 304019 212674 -8601
14269h601o8280n3888p015Q4906J96183m1845J72449j74340j89583m4228R5482
$$ -8601 -76881 -130769 -137784 -52878 143305 101460 273909 99569 -90014 -134242 -38760
14258c8760J31359K794P1752j73247K146K7402k58115j82445J79404L39282Q4288
$$ -38760 92599 95393 167145 -6102 -3956 23446 -234669 -417114 -237710 101572 185860
14247A85860m06525j85148K20357K91190l406j4843J57312n9292J99222K2546
$$ 185860 -220665 -405813 -185456 105734 102328 87485 244797 185505 384727 407273
14237D07273l5162p0633j5503K3657J03077K2066L3166l0572q1706q3159J863
$$ 407273 372111 301478 285975 309632 412709 434775 467941 437369 355663 272504 274367
14226B74367n5397J95924j77134l34004k8363K77084K9090r0988N1423O5621j92409
$$ 274367 218970 414894 237760 -96244 -124607 152477 181567 90579 142002 207623 15214
14215A5214K1192J18649M1391k95395j19277J55779J81973j09617j38187K2523
$$ 15214 36406 155055 196446 -98949 -218226 -62447 119526 9909 -128278 -105755
14205a05755J8682N7905Q2583j15582p99K67448J24037l37636k83182P1784O003
$$ -105755 -87073 -29168 53415 -62167 -62966 204482 328519 -9117 -292299 -220515 -214512
14194b14512k28017k7515K30507K31180J77511R641n1194M3918p8973j59712L9882
$$ -214512 -442529 -470044 -239537 -8357 169154 178795 127601 171519 92546 -67166 -27284
14183b7284r8421j68286J57193N5363j06657o9462J33548j3463j53342J5522J93998
$$ -27284 -125705 -293991 -136798 -81435 -188092 -257554 -124006 -137469 -290811 -275289 -81291
14172h1291P8196R4763q9883r3374J412J53914J37522j55723k89040O7461J5956
$$ -81291 -3095 91668 1785 -91589 -90177 63737 201259 45536 -243504 -176043 -160087
14161a60087j43566o5174J63314L1229o9686K6295k36139J07851J89791J11433
$$ -160087 -303653 -368827 -205513 -174284 -243970 -217675 -453814 -345963 -156172 -44739
14151d4739j2901J17411j63310J77183J05678m1158m04557j48161J79619J04130
$$ -44739 -57640 59771 -103539 73644 179322 138164 -266393 -414554 -234935 -130805
14141a30805M33672R6327j95746n0545K44432m3675j82620L9845K00281o8165
$$ -130805 302867 399194 203448 152903 397335 353660 171040 210885 411166 343001
14131C43001l01830k18718r1429K54744J14736m6516l0976m3598J57737j11218
$$ 343001 41171 -177547 -268976 -14232 100504 53988 23012 -20586 137151 25933
14121B5933p3663K5690n028J76569J81283l4075Q4235J15075m0954j8062j70293
$$ 25933 -47730 -22040 -27068 149501 330784 296709 380944 496019 455065 437003 266710
14110B66710j28422j0865o3025j90321p2711L46120J61516O1648J92623J00463
$$ 266710 138288 127423 64398 -125923 -198634 147486 309002 370650 563273 663736
14100F63736l62112k12233L8937n6999J66386K38191q1495P5426o2958Q1894k41642
$$ 663736 301624 89391 128328 71329 237715 475906 394411 469837 406879 488773 247131
14089B47131l94482k92362R7291M29221K45120j0082K9955l64822j59003N4585
$$ 247131 -147351 -439713 -342422 86799 331919 321837 351792 -13030 -172033 -117448
14079a17448J62765j71151J40335L976J02746M7036N2279j9217q9015j80242K21368
$$ -117448 45317 -125834 14501 18477 121223 168259 220538 201321 112306 -67936 153432
14068A53432j5648k73227k3028L03818J86325j11440j00537p5799J89116J49582
$$ 153432 137784 -135443 -158471 145347 331672 220232 119695 43896 233012 382594
14058C82594m2142k10633j08172J9658k3792J73925J13623j19811j47601j31493
$$ 382594 340452 129819 21647 41305 17513 191438 305061 185250 37649 -93844
14048i3844Q3927K12588n8936R2211R3842j52174J35369K506Q4173k939m4134
$$ -93844 -9917 202671 143735 235946 329788 177614 312983 315489 399662 396723 352589
14037C52589J61248O6799j41292L3099l4689k05599k72950K5119R499o5562O0294
$$ 352589 513837 580636 439344 472443 437754 232155 -40795 -15676 -6177 -71739 -11445
14026a1445J08961M6634K30641J97229l23372k61793q2590O7830Q90R4386j96442
$$ -11445 97516 144150 374791 572020 248648 -13145 -95735 -27905 -27015 67371 -129071
14015a29071j03319M8133J90119O1134j85506j0031k71523j81349J35454N1614
$$ -129071 -232390 -184257 5862 66996 -118510 -128541 -400064 -581413 -445959 -394345
14005c94345J13753J51268j07733R4269J46113Q1921K59976l2016K6440J6563
$$ -394345 -280592 -129324 -237057 -142788 3325 85246 345222 313206 339646 356209
13995C56209r5150j35201j47789k15655j3541J19910k0398K12407K60966J5147
$$ 356209 261059 125858 -21931 -237586 -251127 -131217 -151615 60792 321758 336905
13985C36905k7059r2747j63209Q9362n162J44963P9868r1708l0639L607l5528
$$ 336905 309846 217099 53890 143252 138090 283053 362921 271213 240574 244181 208653
13974B08653K49422j01844j67226n7240j97277J55732Q0351k23859k50457j44291
$$ 208653 458075 356231 189005 131765 -65512 90220 170571 -53288 -303745 -448036
13964d48036m8856O2996K26594O3776k43006O3898K67188J22282K6184k1862J4564
$$ -448036 -496892 -433896 -207302 -143526 -386532 -322634 -55446 66836 93020 71158 85722
13953H5722P1169j07075j8470j87151k66462J86580R2188J90985J54870j10223
$$ 85722 156891 49816 31346 -155805 -422267 -235687 -143499 47486 202356 92133
13943I2133r3014m4081J82824K01804l62815n3388K85912J99436L7285p1851O9856
$$ 92133 -881 -44962 137862 339666 -23149 -76537 209375 408811 446096 374245 444101
13932D44101N3519N2527K02888j53517k28332r7975q1004J3534Q3975k03717j14861
$$ 444101 497620 550147 753035 599518 371186 273211 192207 205741 289716 85999 -28862
13921b8862m5848j373k24331R635L35211J06349L6175o7055K19840J03405J09679
$$ -28862 -74710 -76083 -300414 -290779 44432 150781 186956 119901 339741 443146 552825
13910E52825j02307k22509K19404J9689j62663j89897O1400j3560j30113n3975
$$ 552825 450518 228009 447413 467102 304439 114542 175942 162382 32269 -21706
13900b1706P0101Q1425P7413j2728Q0082m0793k52523J37698p3002k68872j49644
$$ -21706 48395 129820 207233 194505 274587 233794 -18729 118969 45967 -222905 -372549
13889c72549J88922J12214O3139J05235K09139k04016J4652J72180j30968l05975
$$ -372549 -183627 -71413 -8274 96961 306100 102084 116736 288916 157948 -148027
13879a48027M1262K14421K37811q5667j07970J27564k88172l30257J95938l2731
$$ -148027 -106765 107656 345467 259800 151830 279394 -8778 -339035 -143097 -175828
13869a75828p3808L7545K46707J15679r563O9186J62961j85847k17636M021J92371
$$ -175828 -249636 -212091 34616 150295 140732 209918 372879 187032 -30604 -26583 165788
13858A65788n4613j32208j3417j6606q4935j16676R8297K53325Q9501r1044J16829
$$ 165788 111175 -21033 -34450 -51056 -135991 -252667 -154370 98955 188456 97412 214241
13847B14241R665k69192j0377J04612N1684o5357q1075j36407j70973K9009K53301
$$ 214241 223906 -45286 -55663 48949 100633 35276 -45799 -182206 -353179 -324170 -70869
13836g0869j42030J03638J36562l37323k72941P9320R4410K18745M26401K21682
$$ -70869 -212899 -109261 27301 -310022 -582963 -503643 -409233 -190488 235913 457595
13826D57595j66597j95213l7529r2464n38q8969N925Q4956j34392j69492J31689
$$ 457595 290998 95785 58256 -34208 -34746 -123715 -117790 -32834 -167226 -336718 -205029
13815b05029J83782K51408j09707J17173J01299k22530Q894m0069k4167O5900
$$ -205029 -21247 230161 120454 237627 338926 116396 125290 85221 61054 126954
13805A26954k21544p9880J61381M0872M7273l4452m4239J79764K3310j67610q0678
$$ 126954 -94590 -174470 -13089 27783 75056 40604 -3635 176129 199439 31829 -48849
13794d8849N143j19035J65068o713O6225J47320M4667l90341j54901j7896L3082
$$ -48849 -43706 -162741 2327 -4386 61839 209159 253826 -136515 -291416 -309312 -276230
13783b76230K37140K77906p5240k29567r6521n429J65632J24700p1843q3182j20359
$$ -276230 -39090 238816 163576 -65991 -162512 -167941 -2309 122391 50548 -32634 -152993
13772a52993K8459p6388N6215K78215K44760k00065j35035j72536M1547p8820
$$ -152993 -124534 -200922 -144707 133508 378268 178203 43168 -129368 -87821 -166641
13762a66641R1121m4426k11228k7052J24693J5866m7641M1456J23891j01164m3070
$$ -166641 -75520 -119946 -331174 -358226 -233533 -217667 -265308 -223852 -99961 -201125 -244195
13751b44195P4269K89075N6181k02871j21756N9297j28311j10739J27635J53531
$$ -244195 -169926 119149 175330 -27541 -149297 -90000 -218311 -329050 -201415 -47884
13741d7884L234M2431L19608P7331J7510j43596k86745k12542R3991J519J60877
$$ -47884 -44650 -2219 317389 394720 412230 268634 -18111 -230653 -136662 -135143 25734
13730B5734J6087Q699r67N1711o4138j01975O8023K0842n4759j06245n5839n9056
$$ 25734 41821 50520 49553 101264 37126 -64849 3174 24016 -30743 -136988 -192827 -251883
13718b51883j69192o2832N8855Q1911j3772L08814J94882K16963R3559k06719
$$ -251883 -421075 -483907 -425052 -343141 -356913 -48099 146783 363746 457305 250586
13708B50586l26078M5508r6402q4186J40832L7733n5339l5021l4532M6342n6542
$$ 250586 -75492 -29984 -126386 -210572 -69740 -32007 -87346 -122367 -156899 -110557 -167099
13697a67099j20410N7518J51513J27946n009Q859J54735O3374J64972J7233m14394
$$ -167099 -287509 -229991 -78478 49468 44459 53318 208053 271427 436399 453632 39238
13686C9238j0678J76199K14946k7701K9454P8301k03907j20269n2988M213K8435
$$ 39238 28560 204759 419705 392004 421458 499759 295852 175583 122595 126808 155243
13675A55243O6030J15776j16906J2053k8276P9676j91814j22314M8307P9924R1651
$$ 155243 221273 337049 220143 232196 203920 283596 91782 -30532 17775 97699 189350
13664A89350L01958j68294R0413j34391j79015m9911j06267k48937J06710J08365
$$ 189350 491308 323014 413427 279036 100021 50110 -56157 -305094 -198384 -90019
13654i0019L7505J19791K05886N565j02693k54125r6966Q7595o0595k5117j20600
$$ -90019 -52514 67277 273163 278728 176035 -78090 -175056 -87461 -148056 -173173 -293773
13643b93773J64069M7544J4662k0201k47315j61839K29027L08466N26306r218
$$ -293773 -129704 -82160 -67498 -87699 -335014 -496853 -267826 40640 566946 557728
13633E57728k40274k69978j83997N0089Q0703j422J72352R7312l12446J92303
$$ 557728 317454 47476 -136521 -86432 -5729 -7151 165201 262513 -49933 142370
13623A42370K06335J43110j62639k25445p1356k63866n8419L1897j42266K00559
$$ 142370 348705 491815 329176 103731 32375 -231491 -289910 -258013 -400279 -199720
13613a99720J19046J9575J88177o4781k70215L7705r768j09081J7338J58414J12326
$$ -199720 -80674 -61099 127078 62297 -207918 -170213 -179981 -289062 -271724 -113310 -984
13602i84J8138p2684N3452P6116J5808J67408o2592j65402M2792l9602j35457
$$ -984 17154 -55530 -2078 74038 89846 257254 194662 29260 72052 32450 -103007
13591a03007k8766J26877N1321j31855J26489j26504O1880P5123Q7342q3001M4620
$$ -103007 -131773 -4896 46425 -85430 41059 -85445 -23565 51558 138900 55899 100519
13580A00519J03464J42367J25720k17428k02498j05184P0921j07656n8843J2665
$$ 100519 203983 346350 472070 254642 52144 -53040 17881 -89775 -148618 -135953
13570a35953J4194P4122o9789K4391M98254J76698M5242m0175n3943j26336n8481
$$ -135953 -121759 -47637 -117426 -93035 405219 581917 627159 586984 533041 406705 348224
13559C48224q9436k3509j41723k51239j99542J28366q2115o3889j10011M0419
$$ 348224 258788 235279 93556 -157683 -357225 -228859 -310974 -374863 -484874 -444455
13549d44455q9475J62485L24749P4990j4174j15878m05782k25428K86052K00605
$$ -444455 -533930 -371445 -46696 28294 14120 -101758 -507540 -732968 -446916 -246311
13539b46311J04022J87839P9603j95048j3369K7831O5091M6318K26402r8189j04547
$$ -246311 -142289 45550 125153 -69895 -83264 -55433 9658 55976 282378 184189 79642
13528G9642k52928k24828j63902J27487L27038j84131o7825J72895J68515n2658
$$ 79642 -173286 -398114 -562016 -434529 -107491 -291622 -359447 -186552 -18037 -70695
13518g0695j97283N5597L24954J69022K3688r8532j09346m8042q1334j22678j8351
$$ -70695 -267978 -212381 112573 281595 305283 206751 97405 49363 -31971 -154649 -173000
13507a73000J52138J57588j37664N2849J55100k8958o376j75635L2727K85312
$$ -173000 -20862 136726 -938 51911 207011 178053 171677 -3958 28769 314081
13497C14081p6456l33557j23930J10457j33526o7689R0657P1781Q4370j01344
$$ 314081 237625 -95932 -219862 -109405 -242931 -310620 -219963 -148182 -63812 -165156
13487a65156j11002J77912Q0948L42536l2781J86223j93791k35168N6998K00026
$$ -165156 -276158 -98246 -17298 325238 292457 478680 284889 49721 106719 306745
13477C06745j7433k71810j4659J31589l07556k87135l46877J95831K67120J90410
$$ 306745 289312 17502 2843 134432 -173124 -460259 -807136 -611305 -344185 -153775
13467a53775N8944q6832P8866J59105m98j25268k3957J37150J03246j22090n8844
$$ -153775 -94831 -181663 -102797 56308 55810 -69458 -93415 43735 146981 24891 -33953
13456c3953m3461j79463j45731P3920L4619J75679N0722M1876J31745j45656j81355
$$ -33953 -77414 -256877 -402608 -328688 -294069 -118390 -67668 -25792 105953 -39703 -221058
13445b21058k78479j10801J23229K56125O6349N5648R2124Q1863p9877j86629
$$ -221058 -499537 -610338 -487109 -230984 -164635 -108987 -16863 65000 -14877 -201506
13435b01506m2756M2347j74993K00406J62361K4608j8680n9425j13358n3180R5334
$$ -201506 -244262 -201915 -376908 -176502 -14141 10467 -8213 -67638 -180996 -234176 -138842
13424a38842j5298J74034j39028k9885n2831j53893J44319J84127m9276J62311
$$ -138842 -154140 19894 -119134 -149019 -201850 -355743 -211424 -27297 -76573 85738
13414H5738j2543j85357q2144k59548J88106K70525J96743N4689k1526k76520
$$ 85738 73195 -112162 -194306 -453854 -265748 4777 201520 256209 234683 -41837
13404d1837j12832K41555L8469j88251Q8526J32388j28524K0854R5947q3328k09723
$$ -41837 -154669 86886 125355 -62896 25630 158018 29494 50348 146295 62967 -146756
13393a46756m206k59719J73874K22686R6482j45497P8817L6236o2776r5444k96710
$$ -146756 -150962 -410681 -236807 -14121 82361 -63136 15681 51917 -10859 -106303 -403013
$$ [...]
##END NTUPLES=NMR SPECTRUM
##END=
