##TITLE=Analysis number 317298
Compound Code cc 16908
Project Code adrs
Chemist Name avocado
##JCAMPDX= 6.0         $$ Bruker NMR JCAMP-DX V2.0
##DATA TYPE= NMR SPECTRUM
##DATA CLASS= NTUPLES
##ORIGIN= Bruker BioSpin GmbH
##OWNER= nmr
$$ XWIN-NMR		Version 3.5
$$ Wed Feb 15 11:37:08 2006 GMT Standard Time (UT+0h)  MAYBRIDGE\nmr@NMR_250MHZ
##.OBSERVE FREQUENCY= 250.131544655141
##.OBSERVE NUCLEUS= ^1H
##.ACQUISITION MODE= SIMULTANEOUS (DQD)
##.ACQUISITION SCHEME= undefined
##.AVERAGES= 16
##.DIGITISER RES= 18
##SPECTROMETER/DATA SYSTEM= dpx250
##.PULSE SEQUENCE= zg30
##.SOLVENT NAME= CDCl3
##.SHIFT REFERENCE= (INTERNAL, CDCl3, 0, 16.522)
##AUDIT TRAIL= $$ (NUMBER, WHEN, WHO, WHERE, WHAT)
$$ ##TITLE= Audit trail, XWIN-NMR		Version 3.5
$$ ##JCAMPDX= 5.01
$$ ##ORIGIN= Bruker BioSpin GmbH
$$ ##OWNER= nmr
$$ C:\u/data/dgb/nmr/ADRS/16070/pdata/1/auditp.txt
$$ ##AUDIT TRAIL=  $$ (NUMBER, WHEN, WHO, WHERE, WHAT)
(   1,<2006-02-15 11:36:45.06 +000>,<MAYBRIDGE\nmr>,<NMR_250MHZ>,
      <created by zg, POWCHK disabled, PULCHK disabled
       configuration hash MD5:
       84 BC 41 DB A1 6E 1D 46 DA 25 12 A5 C1 ED C5 3A
       data hash MD5: 64K
       37 2F D3 BD 21 3F 8B A6 6F B6 DD 5C 18 A3 54 A6>)
(   2,<2006-02-15 11:37:00.02 +000>,<MAYBRIDGE\nmr>,<NMR_250MHZ>,
      <Start of raw data processing
       ef LB = 0.3 FT_mod = 6 PKNL = 1 SI = 32K 
       data hash MD5: 32K
       A8 9B 84 10 41 9E 10 9D 25 D0 4F F9 27 E6 B2 4F>)
(   3,<2006-02-15 11:37:02.46 +000>,<MAYBRIDGE\nmr>,<NMR_250MHZ>,
      <apk 
       data hash MD5: 32K
       44 65 6F F1 28 DE C1 4E F0 31 B0 2E 08 8E 81 0E>)
(   4,<2006-02-15 11:37:03.23 +000>,<MAYBRIDGE\nmr>,<NMR_250MHZ>,
      <abs ABSG = 5 
       data hash MD5: 32K
       D1 2D 9D 35 82 44 E0 33 EE 17 76 DA 48 B2 2E 72>)
$$ ##END=
$$ 
$$ hash MD5
$$ 04 C2 56 9C 19 23 A5 55 B5 44 FE 36 BA 9B F5 59
##$RELAX= 
##$RELAX= 
##$RELAX= 
##$RELAX= 
##$RELAX= 
##$RELAX= 
##$RELAX= 
$$ Bruker specific parameters
$$ --------------------------
##$DU= <C:\u>
##$EXPNO= 16070
##$NAME= <ADRS>
##$PROCNO= 1
##$TYPE= <nmr>
##$USER= <dgb>
##$AMP= (0..31)
100 100 100 100 100 100 100 100 100 100 100 100 100 100 100 100 100 100 
100 100 100 100 100 100 100 100 100 100 100 100 100 100 
##$AQSEQ= 0
##$AQ_mod= 3
##$AUNM= <au_zg>
##$AUTOPOS= <19 >
##$BF1= 250.13
##$BF2= 250.13
##$BF3= 250.13
##$BF4= 250.13
##$BF5= 500.13
##$BF6= 500.13
##$BF7= 500.13
##$BF8= 500.13
##$BYTORDA= 1
##$CFDGTYP= 0
##$CFRGTYP= 5
##$CHEMSTR= <none>
##$CNST= (0..31)
1 1 145 1 1 1 1 1 1 1 1 1 1 1 1 1 1 1 1 1 1 1 1 1 1 1 1 1 1 1 1 1 
##$CPDPRG= <>
##$CPDPRG1= <>
##$CPDPRG2= <>
##$CPDPRG3= <>
##$CPDPRG4= <mlev>
##$CPDPRG5= <mlev>
##$CPDPRG6= <mlev>
##$CPDPRG7= <mlev>
##$CPDPRG8= <mlev>
##$CPDPRGB= <>
##$CPDPRGT= <>
##$D= (0..31)
0 1 0 0 0 0 0 0 0 0.06 0 0 0 0 0 0 0.0002 0 0 0 0 0 0 0 0 0 0 0 0 0 0 
0 
##$DATE= 1140003403
##$DBL= (0..7)
120 120 120 120 120 120 120 120 
##$DBP= (0..7)
150 150 150 150 150 150 150 150 
##$DBP07= 0
##$DBPNAM0= <>
##$DBPNAM1= <>
##$DBPNAM2= <>
$$ [...]
##$SUBNAM7= <"">
##$SUBNAM8= <"">
##$SUBNAM9= <"">
##$SW= 20.6930455092707
##$SWIBOX= (0..15)
0 0 3 0 0 0 0 0 0 0 0 0 0 0 0 0 
##$SW_h= 5175.983436853
##$TD= 65536
##$TD0= 1
##$TE= 294.16
##$TE2= 300
##$TE3= 300
##$TEG= 300
##$TL= (0..7)
0 120 120 120 120 120 120 120 
##$TP= (0..7)
150 150 150 150 150 150 150 150 
##$TP07= 0
##$TPNAME0= <>
##$TPNAME1= <>
##$TPNAME2= <>
##$TPNAME3= <>
##$TPNAME4= <>
##$TPNAME5= <>
##$TPNAME6= <>
##$TPNAME7= <>
##$TPOAL= (0..7)
0.5 0.5 0.5 0.5 0.5 0.5 0.5 0.5 
##$TPOFFS= (0..7)
0 0 0 0 0 0 0 0 
##$TUNHIN= 0
##$TUNHOUT= 0
##$TUNXOUT= 0
##$USERA1= <user>
##$USERA2= <user>
##$USERA3= <user>
##$USERA4= <user>
##$USERA5= <user>
##$V9= 5
##$VALIST= <valist>
##$VCLIST= <CCCCCCCCCCCCCCC>
##$VD= 0
##$VDLIST= <DDDDDDDDDDDDDDD>
##$VPLIST= <PPPPPPPPPPPPPPP>
##$VTLIST= <TTTTTTTTTTTTTTT>
##$WBST= 1024
##$WBSW= 4
##$XGAIN= (0..3)
0 0 0 0 
##$XL= 0
##$YL= 0
##$YMAX_a= 728597
##$YMIN_a= -408902
##$ZGOPTNS= <>
##$ZL1= 120
##$ZL2= 120
##$ZL3= 120
##$ZL4= 120
##$ABSF1= 16.522
##$ABSF2= -4.171173
##$ABSG= 5
##$ABSL= 3
##$ALPHA= 0
##$AQORDER= 0
##$ASSFAC= 0
##$ASSFACI= 0
##$ASSFACX= 0
##$ASSWID= 0
##$AUNMP= <proc_1d>
##$AZFE= 0.1
##$AZFW= 0.1
##$BCFW= 0
##$BC_mod= 0
##$BYTORDP= 0
##$COROFFS= 0
##$CY= 12.5
##$DATMOD= 1
##$DC= 0
##$DFILT= <>
##$DTYPP= 0
##$F1P= 14.0000005364418
##$F2P= -0.99999901652339
##$FCOR= 0.5
##$FTSIZE= 32768
##$FT_mod= 6
##$GAMMA= 0
##$GB= 0
##$INTBC= 1
##$INTSCL= 1
##$ISEN= 128
##$LB= 0.3
##$LEV0= 0
##$LPBIN= 0
##$MAXI= 10000
##$MC2= 0
##$MEAN= 0
##$ME_mod= 0
##$MI= 0
##$NCOEF= 0
##$NC_proc= -4
##$NLEV= 6
##$NOISF1= 0
##$NOISF2= 0
##$NSP= 0
##$NTH_PI= 0
##$NZP= 0
##$OFFSET= 16.522
##$PC= 1
##$PHC0= 107.1881
##$PHC1= -7.836783
##$PH_mod= 1
##$PKNL= yes
##$PPARMOD= 0
##$PSCAL= 4
##$PSIGN= 0
##$REVERSE= no
##$SF= 250.13
##$SI= 32768
##$SIGF1= 0
##$SIGF2= 0
##$SINO= 400
##$SIOLD= 32768
##$SREGLST= <1H.CDCl3>
##$SSB= 0
##$STSI= 32768
##$STSR= 0
##$SW_p= 5175.98343685301
##$SYMM= 0
##$S_DEV= 0
##$TDeff= 65536
##$TDoff= 0
##$TI= <Analysis number 999999
Compound Code 99
Book Reference 9
Project Code 9>
##$TILT= no
##$TM1= 0
##$TM2= 0
##$TOPLEV= 0
##$USERP1= <user>
##$USERP2= <user>
##$USERP3= <user>
##$USERP4= <user>
##$USERP5= <user>
##$WDW= 1
##$XDIM= 32768
##$YMAX_p= 460456763
##$YMIN_p= -576157
$$ End of Bruker specific parameters
$$ ---------------------------------
##NTUPLES= NMR SPECTRUM
##VAR_NAME=  FREQUENCY,     SPECTRUM/REAL,   SPECTRUM/IMAG
##SYMBOL=    X,             R,               I
##VAR_TYPE=  INDEPENDENT,   DEPENDENT,       DEPENDENT
##VAR_FORM=  AFFN,          ASDF,            ASDF
##VAR_DIM=   32768,         32768,           32768
##UNITS=     HZ,            ARBITRARY UNITS, ARBITRARY UNITS
##FACTOR=    0.157963299565203, 1,           1
##FIRST=     4132.6476996994, 0,             0
##LAST=      -1043.33573715361, 0,           0
##MIN=       -1043.33573715361, -576157,     0
##MAX=       4132.6476996994, 460456763,     0
$$ Real data points
##PAGE= N=1
##DATA TABLE= (X++(R..R)), XYDATA
$$ [...]
22123 -18682 -36161 -17390 4818 33356 52118 53455 63085 21813 -5075 -1442 10456 -10360
22111 -10360 -23606 -13712 10198 17362 1696 -19005 -3993 -16010 -3604 10755 -2634 13065
22099 13065 10023 12790 36923 32802 14539 7595 -4682 10395 40056 23799 20223 16801 -6851
22086 -6851 -12444 -20644 -33069 -39273 -34669 -16356 11362 1346 -4226 23174 15453 -14986 695
22073 695 8923 51228 63274 15670 -24020 -4618 4262 -3772 -35562 -42060 6015 21560 9344
22060 9344 16894 8834 -39843 -55738 -29213 -14309 10043 -4035 -25897 -9550 -8613 -17905 -6778
22047 -6778 -8304 -4462 8952 23509 38821 31197 5044 40 -9550 -37220 -34815 -37120 -32953
22034 -32953 -15156 -28692 -8033 32091 24114 10777 -13251 22222 26046 -18134 -31588 -5984
22022 -5984 6944 24736 27496 25584 9967 -5755 -3328 -7606 10508 22968 30868 67879 83348
22009 83348 29973 9162 -6060 -11585 -2096 41843 35374 3753 13906 -441 -18041 -14177
21997 -14177 23572 14771 13854 14908 40187 49003 23510 5595 -3481 19889 12192 2265 -8868
21984 -8868 -7378 25562 27116 13376 -4739 10490 7970 10047 11779 -7846 -22331 -10779 -13165
21971 -13165 -22425 -36262 -37272 -30152 -13721 18562 12674 -11529 -26637 -12234 -5328 -9210 -9511
21958 -9511 -31740 -59180 -38870 -26494 -13079 4289 13910 31967 17108 11290 -24467 -28232
21946 -28232 -4779 1641 -17586 -10673 -22332 -30568 -13283 9805 6316 3292 -4805 1195 -31548
21933 -31548 -18858 3045 5645 9432 -5871 -22720 -11238 -1508 -672 -19886 -37642 -23445 12394
21920 12394 1803 11214 13053 -10482 -25150 -20575 -34955 -46144 -30896 1017 20575 -2519
21908 -2519 -16827 21731 32221 31143 33665 27819 24628 8891 20998 42480 47645 44889 15716
21895 15716 -22196 -29430 -34668 -1317 -7122 -1097 2705 -15597 -24022 -42768 -52331 -28979 8488
21882 8488 8576 1732 2259 -16970 1844 -335 -16740 -23060 -18838 -35332 -21083 -16998 -1727 21263
21868 21263 38257 7524 -10530 5787 21283 10658 18087 -2192 -13987 -21280 -36945 -51283
21856 -51283 -48333 -5494 34600 19488 -10395 -49636 -50114 -46313 -29355 -4910 21030 38073
21844 38073 52639 35733 30311 48571 53160 10375 -41600 -37587 -14291 -8582 -19630 -26470 -24485
21831 -24485 5022 21360 4178 -30924 -6501 32038 28358 38585 25379 22090 22187 27348 13436
21818 13436 -223 23092 40835 59317 43996 38328 47002 38963 25617 20535 10819 5354 20566
21805 20566 18325 20831 18547 5902 30337 61295 16209 -5406 -8034 570 1448 3749 9728
21792 9728 15413 22071 26504 23485 -1623 -4085 17876 22696 4821 -16155 -35468 -36667 -20029
21779 -20029 -7209 -18878 -24611 -16349 -10905 -26299 -49131 -50518 -51501 -41301 -27198 -10147 5920
21766 5920 7372 -5027 8039 8369 -15291 -42228 -56515 -28721 -5371 16060 3381 -22316
21754 -22316 -23181 12980 38449 39293 31138 -500 -28379 -24372 -4027 7100 11355 6867 11640
21741 11640 23666 -12130 -8348 1929 7129 17475 21688 11548 21952 34877 -6895 -10091
21729 -10091 4749 31642 39846 35206 30075 48693 42879 35106 40455 20911 12723 23534 17828
21716 17828 927 -15740 -9809 9667 14710 7480 12192 22608 13171 2837 33382 43638 9701
21703 9701 -8332 18595 28139 -10140 1466 -3884 -9367 169 4047 8789 12498 3283 -4041 5405
21689 5405 -12287 -35166 -23991 1391 -26808 -42863 -37507 -10908 8592 859 -11988 -17036
21677 -17036 -15843 -31970 -30458 -21473 -5760 -9940 -3285 20836 26129 42923 40348 33203 38024
21664 38024 31728 7067 -318 11523 6719 -4612 -6973 -13878 -49466 -32731 10600 11483 -13723
21651 -13723 -35020 -16187 -20055 -33809 -25881 -20115 -455 2336 20069 42223 40640 41434 30363
21638 30363 28217 30325 19013 17994 3251 -1764 13028 13369 5367 -20789 -38865 -61172 -52119
21625 -52119 -18107 -25934 -5971 17390 38430 36579 35201 28075 7715 3768 26672 15478 10523
21612 10523 577 4272 43538 44474 61076 56504 40640 46858 46855 44642 20926 11014 26921 41816
21598 41816 33771 31064 9867 10868 21151 22054 1198 -25744 -32136 -7254 -16383 -3168 9346
21585 9346 8957 6439 5266 -17744 -17990 -17404 -4310 95 -1442 -2473 3735 -13080 4402 14186
21571 14186 1295 -8946 -9564 -9364 -1471 -11774 -10231 -9120 4137 7647 579 18117 7072
21558 7072 -21714 -24905 -3600 -4203 -3309 -5690 -21874 -28962 -21363 252 -9780 -28464 -8020
21545 -8020 929 5225 -2274 -16803 -6442 3942 12398 9150 2859 8877 40995 35112 1953
21532 1953 -12855 -16811 -15881 -19230 -4084 -1886 7911 2739 -12979 -30999 -15102 8544 17469
21519 17469 39371 70873 95541 75389 77455 94652 77417 45960 20703 22795 1358 8253
21507 8253 -11583 42 12566 -2494 37031 43218 32864 32889 1495 -19063 -18957 4807 26373
21494 26373 32810 14170 -7232 -10910 -2925 3799 -1186 -17516 -13993 -19296 -16042 -16223 -14481 -19914
21480 -19914 -20329 -14186 -8140 -28329 -54002 -36709 -6576 706 260 -17285 -6052 16787 41084
21467 41084 14173 -10691 -8135 -7023 11283 11512 15325 23831 43565 58690 48543 37094 35805
21454 35805 10507 -12918 -6652 3293 31583 50116 54046 24911 -13173 -14113 -2825 29799 18340
21441 18340 25203 4803 -19206 -27464 -21589 4478 5961 -6577 -50185 -56809 -30379 -2771 21597
21428 21597 14057 30297 48033 44707 42639 26131 -13140 5518 26566 21724 229 12148
21416 12148 19863 39787 76076 31025 -10485 2201 6275 3701 19556 25284 50459 51906 4613
21403 4613 -14371 16635 72802 84206 63879 64124 61078 50073 25698 9803 -17495 -30798
21391 -30798 -42993 -45250 -60733 -50124 -23571 -8243 -21222 -24853 -13736 -8138 -13151 3130
21379 3130 15434 26094 -5328 -1049 16368 53060 61174 40823 3452 -13163 13935 53224
21367 53224 67154 63380 34343 26841 31486 44437 57433 49683 46991 66096 59353 12120 1644
21354 1644 34829 45682 28036 24597 41175 55541 44344 21017 -22816 -18887 14620 15923
21342 15923 -8427 -20538 -28931 -26936 -38975 -27925 4539 5644 -10343 -34281 -38704 -28944 -23137
21329 -23137 -14883 19767 15823 -20745 -24683 -8528 8509 29005 34582 31524 24805 24538 50172
21316 50172 39324 2671 -23101 -20546 -28231 -14800 -4874 -9861 -12239 -24723 -38262 -1379 14605
21303 14605 3617 -19907 -50074 -12229 35501 25359 6740 13567 -2825 -9314 -27695 -43792
21291 -43792 -30435 -12125 15805 34450 19240 -14003 -12713 4723 -8626 -19200 -25853 -3895
21279 -3895 16986 30940 44328 24932 10153 10780 16267 23326 -11741 -38839 -11184 -9599 -28758
21266 -28758 -30014 -15490 18521 -1194 4471 -6710 2157 -4180 11919 17209 -969 17350 25742
21253 25742 -4550 -13378 -21751 -49165 -56763 -46550 -34741 -34335 -16109 -14418 -29704 -45440 -15716
21240 -15716 3658 6596 12669 9876 7883 -764 -23366 -17177 -12118 -14538 -1286 2606 -17777
21227 -17777 -32610 -26589 2847 31891 50996 60318 25776 497 15484 42282 11684 -9262
21215 -9262 -27589 -33486 -20957 -18170 -15177 8388 8055 -1311 14381 28987 31608 21936 22710 -11357
21201 -11357 -20147 -22954 -4147 25719 13895 14525 11528 13413 28165 47044 31593 11827 -29043
21188 -29043 -50471 -46441 -51766 -26461 -32362 -11319 11415 3749 -6640 -10793 -3673 14082 -7257
21175 -7257 -20423 -38717 -33703 -26824 -12085 -12677 7435 33110 36396 3231 -29453 -35375 -40339
21162 -40339 -14552 -29742 -61807 -38842 -29069 -40246 -45872 -5575 -10064 993 -15764 -23571
21150 -23571 6460 5757 -28618 -16296 3744 -898 -7999 -10224 -17107 -27430 -13597 12973 28039
21137 28039 15134 -7899 2842 4250 -9933 -19539 -29027 -7440 32148 41164 27505 4121
21125 4121 10368 -5353 -4812 -2984 12274 15954 -580 -11851 263 8624 -6634 -18057 -965
21112 -965 7169 36678 62445 48685 13691 -13968 15332 36339 31438 1681 -27365 -22101 -6845
21099 -6845 16904 10970 -13302 -20035 -23055 -30458 12484 38248 -14575 -31698 -25922 -7216 15514
21086 15514 24134 22161 38298 45341 1633 -10488 11774 26543 22046 39819 17627 -4242
21074 -4242 2530 22792 23756 33422 8955 -2766 -5218 27621 16222 9173 -5937 -11114 -12192
21061 -12192 -25001 -14854 640 -4702 -5493 10095 26658 21028 29688 13982 -8264 990 -3645
21048 -3645 14786 34042 46937 22206 -9290 -11250 5187 14919 5152 -7227 -12281 -26074 -49254
21035 -49254 -46124 -45582 -40721 -26585 -36415 -31245 -13772 -14163 -35871 -19830 -4490 -9510 941
21022 941 -20137 -24825 -30449 -43243 -33632 10580 37707 32990 976 -10518 2100 13241 33332
21009 33332 63974 62437 49942 43030 14678 15341 -13854 -10871 8911 18600 28820 17557 -13806
20996 -13806 1899 713 11263 -413 -10527 -40818 -38228 5027 34258 57913 57439 62974 78997
20983 78997 58583 19685 10941 25772 42999 35992 21858 6027 1593 -2815 -37382 -38003 -34542
20970 -34542 -36826 -18086 -7837 -12835 -30067 -51066 -81766 -56635 -33367 -22479 -24117 7322
20958 7322 27168 35189 30774 14715 -7769 -36659 -39372 -7778 -915 8029 -6661 -18094 11321
20945 11321 49583 38696 13270 13645 34303 52753 39400 45124 28619 22579 15865 6022 23313
20932 23313 27103 12680 3924 -20483 -41204 -47488 -28023 1706 23081 32361 27125 18671 7531
20919 7531 13274 8195 -9109 -1719 8915 -16325 -52017 -34677 -16688 -14944 -17504 -47426 -57321
20906 -57321 -68443 -49745 -30258 -46601 -43847 -34586 -22785 -12147 -17052 -11637 -12829 -6705 9845
20893 9845 -9539 3994 53112 56006 23405 -12053 -11534 25933 32894 -9211 5172 11167 14877
20880 14877 14795 41607 56657 55438 46997 34429 10454 11825 3150 6911 14015 -6857 5404
20867 5404 27093 29476 28961 36693 32830 39495 22177 -547 7553 -11824 -21762 3881 17938
20854 17938 18778 6659 -10029 -7784 6683 22949 -12062 -33029 1822 7172 6969 24265 17072
20841 17072 -1085 15681 20348 30300 22940 53575 51213 25648 28382 -1819 -11745 -21761 -7778
20828 -7778 4944 864 8975 16485 12483 1847 3894 3278 10249 -12350 -24265 -27888 -16281 13332
20814 13332 20181 12033 5781 5026 8199 -7832 -27446 -40616 -32105 -42865 -37670 -1910 7117
20801 7117 -2581 23979 12086 18607 22557 19409 7531 13244 10724 8082 6060 3932 9696 21556
20787 21556 33849 36521 23367 -8469 7822 6290 5607 7436 9628 14102 -10597 14178 17532
20774 17532 -14062 -24086 -35060 -10869 -4481 -23098 -23692 -16070 -18527 -16052 -31452 -36649 -60860
20761 -60860 -59836 -35106 -27554 -15643 -26970 -19974 -9781 -16695 -15288 -8049 -23201 -42986 -41048
20748 -41048 -26409 -22875 10349 26980 19916 251 -5261 -15306 -11736 -15043 -17844 11774 11976
20735 11976 9663 36751 33094 20047 -4003 -25245 -33932 -27069 -16375 -19781 -29003 -10049 -2064
20722 -2064 -12993 -10524 -30035 -31862 -34394 -17163 -12407 -13887 -9561 3570 2122 725 -5754 -1898
20708 -1898 19443 13338 -3817 15637 34870 48396 50592 24449 3456 -8570 -28861 -54519
20696 -54519 -28281 -18251 -25545 -21961 -11699 16509 19983 13852 -11494 -14162 -5086 20930 -4795
20683 -4795 -20723 -16105 3626 40459 31865 8149 -2936 -5946 -14832 -22551 9600 12449 -5530
20670 -5530 8540 2012 -24594 -22703 -9106 1022 -20508 -49482 -57705 -50892 -60777 -60881 -53056
20657 -53056 -52318 -45035 -28794 -37392 -19861 4875 38401 47264 30334 11174 -2378 -26398 -29798
20644 -29798 -23140 -14280 26312 28943 33229 20782 366 2687 8183 19102 25680 35829 14166
20631 14166 734 -9987 -4459 -6780 16423 26894 1778 -15819 -19595 2872 7104 1709 3717
20618 3717 18034 34110 33387 6173 -3483 -3387 18051 53110 56609 34989 43181 55232 78750
20605 78750 86976 61975 48613 40750 31227 20361 -6229 -12111 -674 -17688 -51236 -42370 -15012
20592 -15012 -6823 -15333 -11486 -13209 21075 63419 60198 41585 20920 21221 -1285 -40660 -55491
20579 -55491 -37006 -38408 -42111 -49354 -37285 -20448 -2551 6445 3770 -4658 -25215 -52730 -42601
20566 -42601 -19547 -38318 -13628 -10542 -22736 -2348 3186 -19502 -24835 -4914 11700 2780
20554 2780 1377 33378 29640 1879 -1623 5678 13386 34554 48922 48681 29553 -5902 -9411
20541 -9411 19456 37542 36571 24453 6534 17249 20239 11342 13587 14018 4348 21201 42078
20528 42078 21498 13762 24309 2838 -14967 -19219 -23723 -16854 -23665 -21258 -36763 -19869 -8359
20515 -8359 -13423 -9475 -2892 -5655 -6998 19340 23224 19417 22448 -7273 -7760 36108 67212 69324
20501 69324 63996 51476 46209 22312 28319 13054 3459 44099 47224 14831 5234 23257 16553
20488 16553 -7323 15527 29195 8178 -25609 -55247 -56106 -32909 -13159 -8400 -22598 -41888
20476 -41888 -40422 -30894 5262 6987 2652 -17523 -25811 -29927 -7024 4787 -19675 -31278 -18277
20463 -18277 6229 10242 12185 8691 -1292 -21243 -21886 -5994 -1361 -16351 -39567 -60485 -40789
20450 -40789 -22715 1401 16311 -16000 -13716 -20472 -3058 23136 37049 9386 -6334 -18166
20438 -18166 -10846 13297 19567 2847 9301 24217 -4884 -18308 -16526 -19741 -34122 -26230 -18781
20425 -18781 -18331 -2634 -24911 -28992 -27731 -34351 -7632 18837 36831 24856 24540 24982 -9916
20412 -9916 -23018 -6651 18284 5756 -2748 10859 37074 35691 31874 52961 38975 26620
20400 26620 9501 -681 -6264 5706 -7278 3023 23722 -2984 -5658 11337 33293 31606
20388 31606 26372 34169 25661 -3717 -10257 -1876 5800 35109 48850 33632 26028 31814 34424
20375 34424 20334 10066 4148 -1221 -17400 -25345 -26221 -12050 30284 35860 39229 39567 24044
20362 24044 3614 -19299 -22532 -2929 1866 -14789 -15793 -19475 19894 27280 21593 12299 8871
20349 8871 -3731 -6765 9936 14525 18137 8818 11883 4354 11143 32753 17926 -15682 -30459
20336 -30459 -31656 -17636 -2570 16498 17164 11000 25795 2826 -3238 20480 17346 -13532 -29148
20323 -29148 -19553 -9580 -5264 -1975 4193 29147 35321 -18593 -19976 10929 6284 -6799 -24140
20310 -24140 -14003 -14772 4838 -7236 -19474 -4552 21622 46961 29966 33272 32618 35563 46073
20297 46073 40876 29384 39531 56120 39011 20809 26366 6012 13698 34393 50144 49799 19740
20284 19740 -8573 -7226 -2336 -9145 -18208 -15577 -29362 -30365 -22151 -49315 -43881 -25259 -10225
20271 -10225 -16449 -29580 -41506 -47666 -44923 -46961 -55480 -44577 -18260 -24769 -38121 -31001 -10727
20258 -10727 3291 -7786 -15058 17920 35995 51030 29547 5427 22209 28696 5098 383
20246 383 -11907 354 15128 32351 23345 -6222 -31966 -26401 11078 18871 14916 2662 -3947
20233 -3947 19471 -2778 -2781 11878 -7440 -25384 -38730 -29963 -14497 7075 14212 21868 -2922
20220 -2922 4857 16785 14279 4141 26523 63248 76539 47486 29169 41675 38629 32655 567
20207 567 -12029 -8739 -14023 15438 29000 -5440 -20278 -11563 -35494 -26162 -13434 -9483 -11167
20194 -11167 -202 7546 -12762 -27673 -36145 -38992 -46993 -35450 -30339 -14543 -26426 -16587 -262
20181 -262 3008 9624 -4244 -30568 -19300 -2982 -5047 -8304 -16327 -42961 -26034 -9035 1025
20168 1025 5848 -27724 -14410 -16332 -16880 -10576 -10860 -26659 -18572 8245 29582 11655 -10042
20155 -10042 -11857 -8998 -42117 -72143 -74044 -51055 -34733 -42500 -278 13018 -13401 -43787
20143 -43787 -26000 -40672 -54708 -76644 -61838 -64303 -42129 -11902 -10924 -2431 29378 7828
20131 7828 9032 22700 19707 20562 -12280 -19589 5668 -20234 -71928 -90325 -80772 -42639 -42048
20118 -42048 -38074 -26448 -16035 -1181 -15504 -15948 5274 1127 25548 -5479 -22475 -36040
20106 -36040 -35029 -14118 12247 27769 17273 29651 25574 24428 -3091 8046 12822 10523 -11170
20093 -11170 -9968 -21114 -38124 -49666 -38815 -51503 -63495 -41512 -25378 -5569 22836 29970
20081 29970 56 -17971 -7864 -20387 -15667 10026 16731 16919 12156 -1659 4015 16764 13498
20068 13498 -5666 3893 8563 -26884 -47399 -40584 -14128 -9888 6180 23886 28249 20815 28264
20055 28264 36818 33542 1589 -5571 8279 -9711 -40541 -48249 -49991 -19154 40972 50998 32001
20042 32001 -2310 -35132 -39366 -43718 -28685 -14712 7010 23211 16470 2934 -18119 -12584
20030 -12584 -2330 -14177 -32483 -35153 -15767 -22354 -39981 -39356 -42422 -38300 13496 29606 12073
20017 12073 -5064 -27322 -26359 -14490 6177 8259 4263 19790 16539 -4901 -42121 -47847 -14812
20004 -14812 -3910 23884 13073 4751 15986 17314 828 1070 -2447 -22121 -23510 3741 30767
19991 30767 24594 39567 54843 44933 19042 11880 29651 29430 47456 47851 20977 15807 -3345
19978 -3345 20830 29737 24252 23216 44699 33312 9855 12913 12832 3936 1411 -23803 -39639 348
19964 348 25914 28463 22491 745 -19044 -33127 -22047 -14263 -25866 -28534 -8221 2632 -5548
19951 -5548 668 43586 37747 48867 38308 7758 -1588 -10524 8868 11445 12975 2397 -20228
19938 -20228 -2514 2895 -15059 -11875 10005 6884 -7412 -32795 -29677 6614 13568 1159 5816
19925 5816 -15023 -30743 -14560 24846 -6882 -38117 -62091 -56291 -22016 -13991 -13044 -8985 -9974
19912 -9974 -13435 -3785 1652 6525 14039 22065 15362 -3489 -21933 -35760 -24302 -9888 18092
19899 18092 9335 -28679 -45522 -34707 -26422 -14034 -276 8113 -1715 -12642 -11160 -22741 -29617
19886 -29617 -22219 13474 28838 22956 5203 23220 32170 31466 24514 58028 26680 13455 -20837
19873 -20837 -32752 -41861 -49506 -79498 -98390 -68934 -42384 -6175 11613 11322 22338 30691 21634
19860 21634 8121 -2984 -5887 17641 -1283 -6360 3434 4355 -9204 9041 -7666 -19269 -24267
19847 -24267 1611 12902 6180 20924 17686 15445 43633 68868 50635 35092 35187 22670 12707
19834 12707 4949 15763 22215 18019 15874 14979 28223 40578 15122 -15413 1998 3586 -10378
19821 -10378 -23207 -14416 -4777 1670 -18089 -47888 -31662 9239 -5115 -11737 -6846 -21525 -38922
19808 -38922 -31997 14265 50101 33697 -12030 -25703 -6919 117 -43516 -42966 -23779 -25699 -24837
19795 -24837 -23253 -24651 -25363 -47558 -45707 -45135 -42390 -17276 -3821 -1629 2003 8963 30915 13194
19781 13194 9459 20486 11860 -11847 -18126 5606 20222 30996 16869 373 -11642 -20109
19769 -20109 -6980 26777 30056 48323 28761 -2411 -22481 -27413 -16365 -3085 -21588 -6494
19757 -6494 -8097 -4922 -10945 -9757 -13146 -19663 -14475 -3451 -3091 -14477 -12343 -198 -7932 -35
19743 -35 -19896 -51019 -67439 -52337 -42932 -31283 -30091 -15369 -10842 -13094 -11637 -13419 -19039 -6647
19729 -6647 6682 7748 -10947 -23737 -34222 -31373 -26949 1865 9454 -7653 -30742 -27578 6233
19716 6233 13848 24707 10049 -9749 -31149 -46241 -39442 -2963 779 -18511 -21927 -27766 -21055
19703 -21055 -15904 3980 1773 6722 27614 -1016 -40149 -57421 -31670 -4306 -13786 -58781
19691 -58781 -39946 -31915 -25950 -27980 -36084 -41480 -36424 -7863 -15246 -18942 -28992 -27686 -12056
19678 -12056 -3416 -10743 -32932 -20342 -20579 -40604 -32549 -19280 -13452 -26997 -24443 -21071 -49956
19665 -49956 -58285 -44599 -28464 -21858 -19058 -35195 -28628 -25978 -15776 -16322 -2521 -19809 -34097
19652 -34097 -44099 -13379 -815 1459 -5287 9066 -2532 10939 11512 12551 16447 15161 34639
19639 34639 41753 30413 24078 1398 -18220 -23869 -31363 -46569 -48827 -52296 -24807 -10662 -2287
19626 -2287 -23227 -19315 -3448 -14985 -23524 -31730 -27899 -18481 6917 42884 58011 38759 25450
19613 25450 -13298 -7002 24170 5381 -24883 -12392 14962 -15573 -52894 -57643 -57916 -30099
19601 -30099 -19774 -11184 -8810 -15757 -4486 -36286 -25008 -18120 -17405 -26886 -12937 -20389 -24928
19588 -24928 4355 23046 22319 8192 -19762 -33240 -31164 -45088 -61128 -80890 -72610 -39201
19576 -39201 -36409 -22882 4476 -19767 -14819 -1208 731 -17297 20854 47791 16644 -2440
19564 -2440 -3021 -8081 -935 4468 390 7973 13563 14910 2248 -31916 -21178 -13911 -6438 1333
19550 1333 -21079 -28338 -50238 -46288 -23059 -6452 -9381 -14454 -10104 -18882 -4855 -3111 -21370
19537 -21370 2342 -7788 -8309 -22681 -45918 -41105 -18043 1084 2287 -44966 -59053 -56055 -48323
19524 -48323 -37347 -36521 -30513 -25405 4607 11691 -32640 -16820 3192 -893 -268 13257 9849
19511 9849 -5392 -5168 -13124 9000 30802 25833 -10331 -16813 -1022 4350 1425 9014 -3145
19498 -3145 -9946 -14003 -14572 -15954 -36987 -25135 -15291 -29160 -18720 2204 6253 10902 22999
19485 22999 45440 31349 7020 -27283 -36656 -32882 -23927 -31535 -15702 801 -5141 -6315 -48699
19472 -48699 -38220 -23041 -12990 -36532 -18011 2183 14570 -2674 -13412 -13513 -18720 2259
19460 2259 28834 14689 -7967 -10388 -24551 -18256 -10259 -1689 686 -18138 -52758 -63601 -74543
19447 -74543 -31902 -24759 -38582 -20591 10544 18241 12542 -5876 -20738 -16191 -18536 -895 20641
19434 20641 4370 -8244 -35094 -66833 -81825 -59768 -25533 -34658 -29581 -25580 -8714 15431
19422 15431 20599 21101 34888 46842 80559 92733 78010 50901 46542 62808 52759 32579
19410 32579 21763 50836 42732 31371 33688 21387 -11215 -31154 -48294 -44371 -35163 8493
19398 8493 30291 -13668 -7238 -23423 -43724 -36786 -6520 21041 26332 3732 -2526 -7500 11595
19385 11595 33113 18503 2586 -29411 -35677 -38710 -32114 -32813 -46395 -33566 -12654 -16357 14796
19372 14796 14087 -27898 -54702 -23882 3162 11143 3520 -27853 -29178 -12299 4777 16777 29762
19359 29762 9207 5685 -16706 -15897 2612 -12710 -110 8240 14463 5083 -24445 -24729 -9183
19346 -9183 -9673 -8579 -13257 4698 28870 20891 96 -4542 -9800 -12027 -14189 -9201 -14920 -19923
19332 -19923 -42533 -25578 -22777 -26582 -18905 -15665 -7311 17471 568 16431 16084 12664 -5734
19319 -5734 -34234 -15150 1039 -14417 -33311 -40903 -46412 -26977 -20918 653 6000 -15580 2866
19306 2866 12185 2084 -8539 -404 447 -20031 -51129 -70850 -51643 -36223 -19597 -37435 -41863
19293 -41863 -46810 -36767 -33040 -21506 -14223 -127 10652 18658 4568 -7704 23870 16554 17551
19280 17551 16665 10105 11362 27880 33270 5347 9221 23106 29130 31465 29916 39495 116878 197478
19266 197478 195967 144194 99311 48404 23970 4771 1646 8004 14718 -17849 -34930 2887
19254 2887 5511 -22621 -24316 -701 12927 -4215 -9379 -15894 -24789 -37643 -12398 -17527 -21651
19241 -21651 -34174 -34812 -48606 -61085 -39141 -29783 -27259 -17347 -1425 19872 -2430 -44524 -62783
19228 -62783 -41720 -25847 -6586 -4925 -26713 -33029 -17045 -901 8344 27228 33686 41957 26750
19215 26750 14599 -23813 -37447 -18221 -4765 5415 12652 9557 -821 3299 -23917 -16339
19203 -16339 -10864 3135 10596 578 10791 26054 31045 45563 9467 -9306 14351 10966
19191 10966 -645 8105 8924 -11354 -24866 -32894 -31571 1774 11208 -14526 -42688 -6796 -9969
19178 -9969 -20141 -23697 -21835 -15952 -4442 -4972 -11010 -25090 -17948 -50868 -52964 -26918 -19072 -10929
19164 -10929 2461 -7626 -8293 19350 50681 53157 20606 -24024 -53853 -58304 -46643 -36398
19152 -36398 -34408 -27272 -41338 -37693 -16097 -4303 6264 7649 25710 9109 -5062 -5303 23961
19139 23961 30244 29140 -2717 -13426 -5705 10723 1133 -20584 -8365 -970 13776 9205 -5983
19126 -5983 -5798 -750 5975 -14078 -30677 -19610 -19325 -44228 -46326 -9928 8869 10172 12116 -1577
19112 -1577 27679 61468 52876 31818 9678 -5536 -20944 -33609 -31047 -12880 -5452 28011
19100 28011 22274 7404 20029 27462 17300 3748 -7992 -15242 -28671 -30650 -4880 478 5616
19087 5616 -19453 -21639 18340 8688 -23690 -25161 -31460 -19021 -32620 -62591 -73115 -49515 -40465
19074 -40465 -34781 -36173 -45836 -43119 -33629 -27531 -24803 -36590 -16796 1559 -15436 -35098 -22387
19061 -22387 -1767 -14366 -17521 15714 11240 -8500 13912 30023 27755 -2361 -21508 -20995 -39889
19048 -39889 -12353 2555 12681 26044 33619 44533 49431 46274 35738 12935 -12074 -37595
19036 -37595 -76618 -75248 -37261 -19453 -30380 -20203 -1841 25510 38464 4721 -3874 -13886
19024 -13886 -17604 -8163 -19530 -1684 773 -32390 -29560 -16386 -11375 -8640 -19401 -51266 -46955
19011 -46955 -46842 -30465 -18023 -35557 -54125 -63705 -81390 -73970 -27690 -28020 -45085 -47697 -35366
18998 -35366 -29574 -32572 -12438 -18434 -19119 -4898 -21467 -18572 -28053 -52026 -36967 -26214 -40852
18985 -40852 -18990 -10845 8578 20726 43146 26165 26459 14297 -2723 -28031 -42114 -20436
18973 -20436 -6834 -35098 -33898 -42765 -56408 -37913 -19308 -2582 597 20290 38266 14949
18961 14949 -4540 -41101 -45009 -25247 5279 8576 -19710 -48372 -27658 -20064 -16092 -23821 -29716
18948 -29716 -46406 -38651 -29565 -16894 -22813 -10724 7131 25266 39894 20501 223 -30982
18936 -30982 -22636 -42770 -52877 -45184 -38308 -15857 -6746 -30911 -13417 28241 27660 19158 37567
18923 37567 41028 -19786 -29669 -12706 -2569 -12778 -8576 330 -5613 -17956 -27621 -6755 -8349
18910 -8349 3418 27747 18742 9716 -10110 -30865 -47573 -39992 -56363 -72671 -46935 -30644
18898 -30644 -62527 -117966 -99934 -77921 -40823 -15255 -11786 -11947 -22943 -30896 -28591 -15881 -2357
18885 -2357 -23103 -45477 -36866 -23965 -21296 -38158 -39014 -9993 19520 26245 17922 31401 17519
18872 17519 -21537 -24980 -28413 -26811 -46317 -38266 -24481 -1452 2530 -8131 -18209 -14678 -28420
18859 -28420 -16266 -18070 -30797 -17792 -25799 -31002 -30621 -28953 -37204 -22997 -10379 -26998 -28201
18846 -28201 -13786 -7459 -23572 -5991 -6701 4434 5711 11740 12845 -5622 24330 23455 12113
18833 12113 9262 24647 22270 4176 -8478 24568 28689 615 11167 28643 13995 7983
18821 7983 21075 14622 -8198 -21999 -14168 21692 12488 8241 -4155 -788 4796 13061 28352
18808 28352 27890 35387 43471 24560 19381 26961 36187 21471 -3399 10072 23852 9549 -1086
18795 -1086 9709 15287 -5318 -23442 -47334 -44128 -19219 13647 14724 15703 570 -6041 11969
18782 11969 2769 -15967 -37853 -29251 -24127 -21782 1269 15343 25208 7863 -22841 -37609 1829
18769 1829 36603 24624 13889 17756 43392 126471 198569 215564 164131 93320 19542 5581
18757 5581 17610 9332 -30941 -50590 -42791 -28490 -12547 -11626 -1884 11956 -22741 -46589 -14249
18744 -14249 -3775 -13855 -17631 -26779 -46459 -61716 -59369 -49829 -33846 -23388 -39393 -22414
18732 -22414 -19131 -3806 -2819 -25241 -43171 -37049 -35015 -34654 -28043 -47876 -32919 -35215 -24294
18719 -24294 8252 -22841 -31130 15062 24875 -9844 -17604 -28572 -36693 -18509 -8587 16271 25187
18706 25187 21880 23210 41321 38687 20111 32066 32720 18192 21580 -10505 -6769 -6779 -14771 1269
18692 1269 -9160 -17489 2296 38824 47118 40285 22766 17318 35954 17142 -17333 -20565 -21210
18679 -21210 1489 -1133 -7931 -705 -9822 4818 -8812 -12999 -27695 -29700 -26020 -41484 -37191
18666 -37191 -20683 -20558 -22755 -12412 -3551 20622 8212 -16112 -10298 -35137 -39252 -25000 -9953
18653 -9953 7513 -502 -3546 -11893 -16097 -44952 -52025 -40092 -50406 -49217 -43686 -27768 -35553
18640 -35553 -61700 -88367 -62126 -9682 -6855 -15009 -51453 -49276 -23428 -18438 -12077 18940 5924
18627 5924 598 14373 7460 -6639 -28489 -17963 5864 516 -10271 -1828 17771 47199 52577
18614 52577 32342 15647 494 -14096 480 17008 2295 -18766 -24357 -31381 -37950 -45873
18602 -45873 -43400 -62392 -56215 -41730 -9975 -290 28808 24272 -1478 24298 2448 3341 2775
18589 2775 24447 10343 -1097 -21248 -21238 -29772 -36046 -27882 -46031 -48497 -35923 -32413 -37319 -33485
18575 -33485 -34675 -42563 -47723 -39532 -18170 -1085 -5565 -15485 -21364 -5827 -22339 -50128 -44621
18562 -44621 -25715 -21838 -14142 -20700 -18286 -7219 4399 24803 50661 40612 50960 29613
18550 29613 -6485 -34037 -32156 -2694 344 -1404 -5612 -8045 -7957 -10059 -28711 -37094 -22154 -27235
18536 -27235 -21000 -43544 -26029 13068 25450 40827 3461 -32101 -53398 -79153 -41365 -52904
18524 -52904 -52305 -51171 -32575 -37788 -43352 -35132 -37890 -62159 -80665 -69774 -60120 -62745 -84327
18511 -84327 -66506 -63619 -44153 -37649 -48420 -45412 -40269 -9527 -21611 -31121 -11088 33297 17082
18498 17082 4444 11644 -517 26060 43090 26797 10457 -6537 -928 3722 -24970 -51812
18486 -51812 -42846 -46805 -47562 -32437 -3967 -7122 4358 -2307 3247 5159 -30961 -21747 77
18473 77 -14566 -36831 -16825 11507 24060 27455 24152 13039 -23017 -47380 -39503 -47509 -49048
18460 -49048 -25593 8934 37537 27367 23671 1017 -413 468 -15613 -13345 -2875 2025 -3309
18447 -3309 -25260 -36812 -52708 -14389 3809 -20467 -30269 -57782 -70584 -65159 -26517 -17365
18435 -17365 -46705 -77351 -70338 -29824 -20058 8620 -3563 -32707 -11347 -1016 -2967 -14768
18423 -14768 -32967 -6376 2844 -13227 -20907 -34576 -50097 -43198 3404 22490 8052 -10814
18411 -10814 -22637 -51375 -51071 -25881 7640 17121 23477 -10877 -36380 -37582 -33583 -34754 -28476
18398 -28476 -30092 -14147 -8193 5748 2484 -4686 -4751 -5671 -29767 -37076 -7813 -28580 -43118 -34591
18384 -34591 -8052 6854 34498 18928 -20846 -47782 -37935 -50408 -27800 -22044 -57801 -63739
18372 -63739 -58713 -39230 -25515 -15679 -17898 -23453 -15735 3908 18178 7046 -30645 -47585 -22067
18359 -22067 -12213 -8852 -2188 -17415 -18606 -3335 -10628 -51011 -70342 -57883 -78255 -89133 -37656
18346 -37656 -18790 -32652 -34325 -56012 -62789 -67805 -68571 -35013 -15579 -41906 -62556 -45149 -23722
18333 -23722 -14884 -22062 -24593 -44408 -61231 -49970 -38311 -40753 -54283 -71682 -73799 -91050 -98365
18320 -98365 -79479 -49771 -47244 -37525 -40341 -42486 -49262 -41889 -29123 -31556 -40048 -29889 -28052
18307 -28052 -20929 -27600 -11965 -6632 -31832 -54745 -53786 -28806 12273 40484 48483 89134 70906
18294 70906 58163 46738 32167 80093 137139 150825 120913 77366 23956 -7683 -3740 -7252
18282 -7252 -1823 -26186 -57150 -90428 -73217 -69735 -34199 15483 21118 4166 -8224 16984
18270 16984 38877 28447 19006 3360 -19354 -33328 -29666 -23916 -39820 -34740 -17180 -16136 -10371
18257 -10371 -5071 -25873 -47723 -23970 -13322 -8109 838 13283 26655 55445 61067 51985 21139
18244 21139 56487 83395 145763 311876 590945 751164 678560 482880 288895 183778
18234 183778 147194 170185 173847 157207 122086 92890 42307 28729 37618 23393 -6919 -6366
18222 -6366 -19199 -26945 -3568 -5467 -5158 -20776 -29015 -21726 978 -28442 -38146 -50998 -70023
18209 -70023 -65600 -69931 -69181 -63234 -37617 -47715 -57530 -58872 -74422 -86036 -89580 -71075 -23907
18196 -23907 -56149 -73961 -73736 -73960 -50705 -23190 -12594 -12741 -41431 -49560 -50465 -34818 -24352
18183 -24352 -41657 -40927 -60787 -67491 -50229 -39240 -56761 -66607 -65165 -101278 -114188 -88814 -48215
18170 -48215 -18501 -26221 -13839 -17380 -49069 -84591 -73426 -62864 -75352 -78186 -52196 -37571
18158 -37571 -41242 -30999 -2789 6625 -19465 -55509 -60245 -54419 -16639 -119 -5195 -19929 -23827
18145 -23827 -17932 -27138 -23445 -25604 -34274 -12213 -11817 -15248 -6334 -14503 -42111 -31124 11360 6423
18131 6423 -23938 -8443 9376 43489 41779 50042 62011 64996 94018 134687 148858 201603
18119 201603 318307 375412 466439 620799 822443 1077618 1474510 1999989 2760012 3921766
18109 3921766 5929665 9825265 18221307 34615493 50955056 50813466 40632327 27500650
18101 27500650 17266464 11275053 7928992 5976569 4798218 4068523 3522073 3034890
18093 3034890 2632728 2348493 2059880 1829686 1672377 1524875 1361173 1223601 1129439 1021406
18083 1021406 904943 801738 745660 733637 705500 647556 611280 555171 504638 499981 483202
18072 483202 465098 456265 445832 406107 342559 327490 330082 333381 337462 329323 309888 291034
18060 291034 263888 199105 178216 196434 169581 165991 182587 189658 186926 179984 176454 168948 156054
18047 156054 166666 150795 169954 179367 136215 132042 148817 113692 100666 127294 136395 112146
18035 112146 70927 85033 120894 106632 108552 103363 98188 66934 48647 78865 108865 101052
18023 101052 77225 43571 23693 24120 49785 76708 98626 89588 50589 58470 63916 66156 97864
18010 97864 96201 84542 54103 63102 63546 45589 21909 66568 83545 64272 55995 41576 29041
17997 29041 39401 67368 74387 77535 41673 57744 90784 62000 52551 47365 45186 30469 33447
17984 33447 71070 74278 49826 55833 56165 37577 34585 26776 22320 20934 35743 79544 62098
17971 62098 50213 52825 13826 -1487 -5231 26964 63414 70732 72766 86000 89808 74641 60716
17958 60716 54549 53761 47583 32567 26059 52251 65805 74364 56750 29695 -6435 -18501 12582
17945 12582 26034 16082 13022 34355 46337 38296 48079 51515 36623 18630 24923 50697 71996
17932 71996 60164 42707 28555 18911 36096 57366 54940 32245 55884 72412 72086 89161
17920 89161 81646 68190 60535 15148 -12069 -14792 -33557 -35466 -52610 -43780 -6918 237 -2508
17907 -2508 10380 16532 -6494 9020 32848 38165 43243 17382 19941 37878 40047 63709 56957
17894 56957 23269 -3439 9723 39107 50721 33255 43851 44836 31660 35276 46888 34699
17882 34699 18843 13169 21455 29902 34830 38755 32867 25457 24346 25682 25869 28583 21550 14420
17868 14420 -6002 -22641 10095 17719 29104 65609 83699 82918 69082 62209 51763 15911
17856 15911 16132 36628 64338 54638 34426 15474 15270 22827 32359 52466 34193 25240 20209
17843 20209 48335 60018 56249 47310 24927 6863 23775 21333 36959 63109 38689 53575
17831 53575 56762 49168 40885 58686 77670 62795 46117 46043 25622 6228 33765 35381 14541
17818 14541 25820 52525 50394 52344 26059 10622 -6173 7398 32888 29083 39703 48220
17806 48220 36170 18228 17256 18959 29843 52133 46860 31763 31766 16693 -23126 -10580 16842
17793 16842 16763 11762 -4338 -6015 4750 2809 -22751 -8325 21817 34108 15083 16348 24822
17780 24822 47714 51002 50977 29844 10404 8773 -2147 26534 23233 18167 31452 20674 21982
17767 21982 44317 40495 -3661 -6467 409 23470 21978 17535 24757 34275 26141 33580 -19567
17754 -19567 -52661 -30104 -10447 9697 15825 11229 -8339 -27841 -15589 1099 -8764 -459
17742 -459 2101 -27811 -25686 -32939 -25453 -4430 -24471 -44105 -48106 -55030 -36915 -12326 -21240
17729 -21240 -44686 -72763 -63700 -45847 -43622 -18693 7599 20137 23534 16324 -4673 -19861
17717 -19861 -22598 -17170 -144 6951 31561 37608 7884 -15005 -8975 46333 49645 39277 42641
17704 42641 21378 -6601 15787 28062 38059 29285 62478 52585 40521 38622 16465 5146
17692 5146 -35326 -55703 -65099 -48159 -18703 -21364 -44787 -36892 -22383 -38148 -15087 -1853
17680 -1853 -26289 -41771 -29242 10173 20006 -9046 -29806 -13756 10849 8484 13331 27425
17668 27425 33870 18469 -12460 -9065 11426 34342 25611 11737 12533 24393 49051 45580 17095
17655 17095 5083 -16521 -20371 -15313 865 37808 35888 54015 41122 5940 15950 17424
17643 17424 39915 25948 5820 -14746 -14163 -16044 -11342 -9605 3509 -3425 -14143 1362 18454
17630 18454 36772 40870 7144 -7566 4145 17720 13988 -16292 -17817 -4448 10889 28368
17618 28368 1236 -3077 2235 -38149 -44542 -24522 -17868 -26110 -30968 -44854 -57016 -58570 -29431
17605 -29431 -16019 -4951 -3708 9095 20157 21998 48162 55578 28947 12349 12497 -7095 2842
17592 2842 15831 21711 31446 25766 -1694 1741 -17177 2199 27857 53759 34876 17838 -8128
17579 -8128 -8512 10345 8695 -23623 -19188 -38895 -51278 -41515 -26635 -732 -4837 -41333 -54629
17566 -54629 -39175 -27614 7882 47945 34351 29929 21240 22426 12586 -13773 -26522 -28043 -4622
17553 -4622 1944 29208 30206 -17356 4159 41525 26357 14107 5418 -4993 -4746 18371 12064
17540 12064 -1154 156 13209 32946 32263 25875 2596 2409 -16491 4801 42688 60377 25441
17527 25441 19862 40432 35187 41303 59020 58792 10405 -24445 -21127 -5480 841 21981 35529
17514 35529 2818 -32071 -13876 -2622 1316 -15519 -33777 -42681 -4047 16603 -8820 -20088
17502 -20088 12123 -1547 -27452 -11572 3369 -916 1989 -3837 -26540 -32326 -15464 15863
17490 15863 38712 11716 -27338 -13125 7732 17352 17292 19854 26613 -3794 -2737 -22592 -41696
17477 -41696 -36786 -36124 -37657 -25441 -31273 -9239 13061 8935 13064 -4931 -16720 -38677 -51990
17464 -51990 -36234 -29120 -12357 -11326 -14840 -13961 -16517 -19673 -9384 5560 32727 22433 5130
17451 5130 29318 39860 49028 36691 7277 -24181 -18741 5101 624 -2477 46860 122487 232210
17438 232210 300897 267198 206976 96394 35496 45975 56936 56891 51446 54099 52073 48046 62031
17425 62031 37588 28885 32810 19199 59155 76104 60322 49677 49093 21288 -3751 11580
17413 11580 25875 25310 43898 28174 13303 -16454 -37510 -57738 -42382 -41177 -17417 8009
17401 8009 9563 29255 38318 6336 -5026 -36835 -53747 -35350 -30518 -38003 -12673 -23278 -13612
17388 -13612 -5091 -41911 -60868 -54716 -76526 -83084 -69264 -43105 -17753 -9498 -3792 -11911 3220
17375 3220 19952 6433 -3611 -11554 -19481 -20943 -33811 -46313 -49316 -43923 -34354 -49643 -47599
17362 -47599 -6838 -12746 3253 15498 14602 8144 15890 73888 137307 156703 141225 135749 99505
17349 99505 49457 37575 44992 26841 17185 13534 21883 49810 27154 13199 10856 37515 52161
17336 52161 10964 -8499 -5691 4804 -2121 -6137 -9638 -5318 -2956 -6028 13399 17340 -1843
17323 -1843 -1296 22714 32763 16416 21469 -5508 -34889 -21586 894 11162 3575 -124 -4977
17310 -4977 6780 235 -987 13128 16935 -21677 -7982 -4441 24585 44633 54337 70015 116294
17297 116294 156385 166832 147908 132722 94553 46138 19991 -9623 -12019 -28884 -18392 -32159
17285 -32159 -38924 -7859 14986 -9790 -1891 7814 -14352 -5321 2368 -2469 -24291 -30929 -39845
17272 -39845 -52964 -41423 -21500 -26984 -43336 -52643 -26049 -17701 -17905 -33998 -29509 -2735 22256
17259 22256 -3437 -32294 -33777 -9482 7387 -7586 -50411 -30223 -2326 -9882 3121 5195
17247 5195 29840 32772 15944 19221 27829 37752 13530 13859 -14664 -21840 -28641 -19764 -7455 -7300
17233 -7300 -14989 -46387 -65995 -48417 -28489 -53346 -42987 -40624 -39843 -73926 -66012 -38065 4208
17220 4208 29341 14974 14258 16490 22316 23760 8198 8784 18527 -15774 -34214 -18253 7733
17207 7733 18194 14025 26490 14498 7212 2213 -11238 -15522 -3944 2679 -5413 -33218 -39131
17194 -39131 -13622 -11525 -13516 -9617 -18963 -15601 -29709 -37959 -6846 2171 -3695 -24612 -7203
17181 -7203 21800 34408 23946 -735 -26302 -30606 -12873 -20659 14966 36020 13364 -15527
17169 -15527 -5874 10059 9801 215 -4669 -19899 -33914 -39361 -26688 -10056 -35912 -46809 -32754
17156 -32754 -24293 -26999 -20074 -28798 -52573 -64851 -71975 -54608 -42302 -15543 -2227 -8814 -2778
17143 -2778 -1783 -2243 -21108 -13676 -13834 -37165 -51952 -46076 -24667 -24661 -27110 -30228 -8028 -402 -13420
17128 -13420 -19509 -23011 -32658 -69988 -83228 -86280 -63956 -55890 -85983 -75269 -51136 -19996 2235
17115 2235 16479 -5532 -10695 13440 -4369 4456 40913 41312 -7406 7222 14688 12520 11852
17102 11852 10708 -15952 -36628 -15484 8674 10276 10996 25023 31026 32219 38993 39023 11502 -8181
17088 -8181 -21461 -30989 -38421 -46627 -49372 -59719 -37240 -25093 15620 33189 11227 -14012 -4432
17075 -4432 10414 2091 -14249 -13699 -33076 -45408 -55357 -20983 22984 34213 30698 35256 28956
17062 28956 15876 7735 13154 -16072 -47186 -49430 -39469 -6606 -12250 -15931 -22068 -36501 -17730
17049 -17730 12352 26538 55173 58587 47464 18226 955 5227 8411 -5247 -34564 -46146
17037 -46146 -16631 8502 1662 -14136 -30564 -20190 -16051 -17974 -10186 8443 58175 49514 -7474
17024 -7474 -17353 22291 44616 17723 22124 36312 20099 19787 532 -19636 -11998 -29283 -23191
17011 -23191 -9699 -5456 -17335 -46281 -40931 -26459 -830 -10401 -28134 -13534 -37101 -52402
16999 -52402 -51476 -42504 -29752 -28994 -14838 -28472 -46034 -45390 -18755 18829 11968 33711 45210
16986 45210 31009 6880 -19918 -3083 20259 27582 23860 25707 22050 6286 -4314 -16138
16974 -16138 -19776 5499 -6947 -21307 -18944 -4588 14217 -14848 -42103 -72438 -72020 -46272
16962 -46272 -38762 -32921 -32138 -59093 -50888 -38580 -29478 -45343 -33679 -8911 -1470 3208 237
16949 237 -29773 -26011 -42482 -34850 -21869 -21226 5069 35974 17684 18685 31025 21189 18669
16936 18669 4706 -25629 -22930 1501 31285 10086 994 17140 30423 11378 -9019 -20948
16924 -20948 -27802 6172 25697 5107 -32807 -60562 -49578 -9370 20539 34646 25431 22066
16912 22066 5176 2849 -3184 -19070 9878 15770 5469 -92 -1479 -19559 -29515 -28690 -22649
16899 -22649 -8778 2598 13997 557 -1225 22534 -1244 13485 33313 27024 31613 28464
16887 28464 1409 -12421 -28940 -31259 -8651 8683 16915 2665 -11717 -16577 -2488 -5570
16875 -5570 9997 -16588 -13197 15113 34739 37775 13663 -10034 -35357 -29384 -39390 -34482 -34322
16862 -34322 -17218 39796 63962 49135 3699 -16457 -23085 -7664 16543 -6297 -10317 -2290
16850 -2290 5255 -24479 -11931 5938 1464 -13485 9329 -13958 -27208 -4505 20768 48510
16838 48510 60360 45537 49627 -9288 -42896 -28473 -25000 -1775 -3512 -4582 -3469 -8824 2077
16825 2077 4329 8084 44496 59317 64048 67722 44874 12668 -3993 -16461 -23934 -1906 3344
16812 3344 958 -1769 -24913 -16186 -27301 -22716 9713 7124 3377 2591 -15609 -33659 -38584 -61195
16798 -61195 -55810 -53882 -57382 -58710 -21169 -16305 -3161 -18112 -36771 -10932 8574 -21111 -14490
16785 -14490 -14577 -14873 -2073 -3440 -29315 -16388 -8368 13806 26119 6164 870 -5133 -14770 -11582
16771 -11582 -32731 -11866 -20042 -12795 -921 -29577 -38005 154 -8097 -14583 2712 -7803 1635
16758 1635 5354 -8709 -15456 9017 -343 -13676 -43209 -63085 -50396 -51011 -27624 -39507 -66532
16745 -66532 -57047 -8878 11689 4208 839 -6484 -18846 -9855 9946 3389 -8163 -3609 6069
16732 6069 -12379 -42802 -37305 -24005 -476 7648 30731 15830 3842 12014 15610 14480 -11355
16719 -11355 -15897 21147 42647 22524 -21663 -54872 -57660 -58125 -67461 -41280 -10788 -7706 -7350
16706 -7350 16339 9376 14212 16870 22258 -2634 -15927 6373 21353 -1117 -24086 -18406 -13129
16693 -13129 -33651 -30296 5615 -7699 807 7757 -16328 -21517 7857 4625 -3431 -12155 -16571
16680 -16571 -27652 -23609 -26238 -17207 -10033 -5496 2667 13828 -5412 -13371 -28863 -15228 -18837
16667 -18837 -42088 -33881 -25547 -33120 -16682 -35270 -62982 -47426 -17133 20106 20107 8541 14770
16654 14770 30051 24059 -8181 -9113 -10284 -39905 -32555 -12355 -26987 -40323 -10807 -19774 -46162
16641 -46162 -38228 -5589 5277 -6021 -29960 -24412 -35272 -41633 -59971 -56876 -38633 -17369
16629 -17369 -14028 -35593 -39289 -30770 -23616 -27055 -49046 -36308 -21591 -3227 -10416 -13338 5375
16616 5375 24085 31177 17116 41169 60266 39233 45947 21446 -15439 7405 12621 1187
16604 1187 7270 -13527 -21368 9198 33460 38286 33313 13931 10230 9910 -8030 8497 33911
16591 33911 41097 25311 188 -5640 1801 2873 -19616 -21458 -27308 -22915 -4365 -13548 -43656
16578 -43656 -40702 -53226 -43929 -38564 -36881 -24403 -4322 -685 -3217 -16202 -34846 -63435 -59873
16565 -59873 -52800 -44669 -18647 -26129 -20226 -14857 -14697 -38534 -18613 -9349 -5890 1311 547 -12288
16551 -12288 -27613 -26394 -28664 -59377 -49881 -28460 -15015 -16947 -3354 -2130 13090 39212 24957
16538 24957 18343 5191 5072 1820 9758 2393 10073 12479 -14298 -17587 10311 684 -1366 12804
16524 12804 17007 1470 2638 6015 -6466 17421 11503 2557 22979 26858 -22654 -43972 -67949
16511 -67949 -74077 -58514 -50061 -48019 -35592 -3925 28446 31285 50247 45113 29065 21222 33164
16498 33164 29471 34981 44749 36987 38611 15601 -9421 -8947 16731 22086 43132 39769 22045
16485 22045 19303 -18081 -21971 16910 20586 9621 12127 42598 52149 38608 4896 19069 7710
16472 7710 -8581 -1226 14251 13501 15552 104 6377 9565 9593 -13742 -2472 10542 26302 40513
16458 40513 48174 20749 37353 42945 5485 1853 -14517 9287 1290 6012 20430 -3331 -25399
16445 -25399 1210 25889 6422 20810 15759 17475 36684 54938 47218 37329 25078 37020
16433 37020 16396 6266 9773 1321 3850 2591 24259 33215 10564 9620 -16463 -15289 -23322
16420 -23322 -37991 3083 22467 12193 1142 -16051 -43718 -49379 -25307 -6970 -12259 -9808
16408 -9808 9071 -2140 -22362 -46881 -25438 -26937 -64530 -69037 -49841 -5354 46725 27207
16396 27207 16087 -945 -12147 19219 16423 -17075 -52023 -54652 -17645 -22202 -25535 -25037 -36355
16383 -36355 -46606 -43786 -23048 -12871 -16378 -41472 -54662 -41017 -44921 -36602 -34835 -47402 -48773
16370 -48773 -22236 22408 29782 10187 7802 2437 18176 65 29888 41054 46665 23513
16358 23513 5309 28370 27107 34991 15990 18824 20530 25671 -4175 -15038 -43270 -51260 -34644
16345 -34644 4378 -6939 -44599 -17909 5625 2430 -4721 -13463 -14783 -3785 -25314 -32564 -38846
16332 -38846 -8545 11236 24325 41020 9110 -20513 -47423 -44148 -20721 -13722 -12182 9117
16320 9117 -13950 -18668 -15904 -34393 -32773 -33814 -33665 -14611 7123 8007 12207 15873 38775 31546
16306 31546 2894 -19784 -39900 -40357 -35299 -34584 -8734 9141 23378 23936 5433 -9251 -3500
16293 -3500 32849 51314 18434 1605 20457 48513 47367 54003 60714 67477 18753 -6235 -24282
16280 -24282 -24392 10708 9068 -11515 -22674 -25055 -18469 6489 19799 23437 3114 12266 -1862
16267 -1862 14646 44324 33292 41304 47390 29246 18078 9514 -12851 -36665 -33261 -35859 -39858
16254 -39858 -34134 -56859 -36162 -5846 -8371 -13687 -25067 -19978 -4143 25550 22744 19831 33666
16241 33666 24089 14177 12065 -23957 -68003 -58061 -41482 -17233 -13591 -11241 10218 41881 30961
16228 30961 26913 47362 67822 54531 44911 24943 18810 14596 21102 39065 77883 93851 52804
16215 52804 4640 -3088 -386 10794 36425 40430 49860 38880 26962 36899 37875 20542 26502
16202 26502 13541 13023 43736 42980 13065 15910 10781 -1574 10308 4696 -6251 -22082 -13795
16189 -13795 -46455 -71814 -41723 6463 13848 18959 5275 449 16675 65752 41339 22902
16177 22902 11898 6912 13989 13564 30315 61185 42769 26784 36605 45067 16667 994 -7312
16164 -7312 -9223 273 15720 14548 11833 27134 32369 34214 4407 -3198 -11111 -13864 -27215 -30458
16150 -30458 -19034 -2751 -1400 -17863 -22370 -7484 -8641 -9323 -45315 -56463 -14982 -3499 9661
16137 9661 5617 -9780 -22620 -13317 11271 16933 -4438 -27006 -24906 -16419 -25098 -35346 -23705
16124 -23705 -22163 -18945 -17069 26318 23927 -9093 -21387 -19320 6317 20893 17071 39275 34486
16111 34486 19784 -9265 -18829 -32176 -14667 7805 -64 -18046 -40861 -34520 -34584 -30207 -22591
16098 -22591 -40162 -50170 -41023 -33986 -10074 -10383 -1473 11306 -13383 -9263 -2306 1150 19010
16085 19010 11155 4462 23337 13757 716 -26739 -47785 -21798 4731 -10114 5802 13074
16073 13074 -11476 -30816 -13575 -1534 -14207 -35742 -38131 -31581 -63950 -65043 -35448 -10345
16061 -10345 -36095 -27862 -16882 -5607 12350 15145 -6092 -6074 -19939 -37975 -48057 -53131 -47951
16048 -47951 -31310 -51644 -58293 -46637 -48659 -23978 -1398 -6225 -8591 -2520 24288 21472 25178
16035 25178 12058 1436 -15613 -14455 432 -178 133 -6886 -8651 6214 16544 5432 2737
16022 2737 -2843 -33123 -9975 7412 25421 46067 22919 21568 29526 37809 44723 27864 6089
16009 6089 -8219 -23342 -25911 -17893 -26505 -4028 7574 31586 29491 27845 24067 -15982 -1960
15996 -1960 7705 11418 12448 16563 16624 4993 18007 11978 -2936 17637 4132 -2220 22065 31376
15982 31376 43141 31542 17037 23268 27357 36288 11379 -5830 -23125 -19763 63 16869
15970 16869 41138 41918 26103 25625 -10959 -39055 -29391 -37189 -35565 -5395 5216 -8177 -1393
15957 -1393 -3697 -13303 8250 19621 47421 81027 49320 1295 -22429 -22009 3046 -11279 -46174
15944 -46174 -55481 -47928 -23576 -2102 -3508 3392 -2756 -23196 -38355 -21317 -200 4090 -18358
15931 -18358 -40242 -25150 -33038 -30379 2888 3997 15224 11106 17428 -2843 -17638 -45298 -37860
15918 -37860 -57306 -26150 -1750 -16604 -20176 -38473 -42944 -35015 -10806 268 -11195 -13821
15906 -13821 -18437 -68111 -81123 -57516 -46062 -25464 -36495 -22533 -25359 -38310 -34536 -14961
15894 -14961 -4350 23578 19393 -14571 -22394 -788 -23177 -40981 -35908 -32442 -21426 16491
15882 16491 10448 13476 32134 45081 49682 61841 26512 11687 32929 45366 44880 46996 45520
15869 45520 6455 -19726 -38197 -18287 24428 45894 23821 20696 15858 30651 36017 33546
15857 33546 36743 29975 44389 46916 37475 48106 48208 34535 29356 30886 36954 28817 10519 13477
15843 13477 16517 5251 18592 11082 -5258 -16989 -7750 -19970 -18286 -13218 -4782 6272 -13802
15830 -13802 -16743 -15838 -27673 -338 24184 33859 32238 60032 68372 53734 71593 86425 53725
15817 53725 23445 22266 14683 37924 36373 33317 27307 41240 61293 90004 85147 64853 45873
15804 45873 28793 25509 7140 -30016 -59998 -50732 -54383 -35984 -7934 22862 37378 36336
15792 36336 25310 25103 19611 888 -25742 -27257 -37621 -6118 31747 54124 45201 27212 30340
15779 30340 -2655 12423 38300 60694 68843 37038 29760 34332 55431 74307 65145 96476
15767 96476 113586 113788 97668 57464 30564 -16417 2197 31434 13337 11090 22611 21546
15755 21546 18341 14745 20287 50338 57672 34338 32166 53182 47568 31673 19109 32552 50594
15742 50594 53176 66628 117274 131385 95058 59989 38886 51426 76183 47210 40041 48330
15730 48330 47340 57684 72507 62764 35442 40454 57703 42795 27508 3008 -3732 -406 -4882
15717 -4882 650 10480 28812 41976 45492 19202 10508 -23016 -33232 -50677 -43542 -1763 28220
15704 28220 46211 55378 59629 67741 57756 23287 11060 -1335 -7797 -2781 -9813 -42485 -54858
15691 -54858 -12297 2356 9805 12483 7976 20090 23031 9439 26027 54918 53675 41033 48599
15678 48599 39999 22672 14492 11269 1526 7838 2353 1762 -1844 -16851 2832 488 -34844 -31850
15664 -31850 -22904 -33498 -53803 -57269 -24500 -7067 -15464 -63956 -71059 -43127 -22999 -16483 -33502
15651 -33502 -32782 -50160 -47274 -36537 -23461 -28345 -19400 1822 9151 6646 4676 -8649 4242
15638 4242 21857 17425 20829 31359 20780 13709 -15550 -16991 -21700 -26981 -34384 -16839 3454
15625 3454 2868 9753 8818 7154 3935 -17682 4468 11896 31210 11720 -6305 -10544 -42886 -64100
15611 -64100 -51846 -38693 -23774 -25924 -21868 -4137 5401 -10636 -20507 -9590 -5730 -12514 -4259
15598 -4259 11299 36837 69773 64839 38142 46009 49071 56535 53180 37882 39272 57803 46959
15585 46959 3711 -4636 -1089 -18126 6500 12663 25841 47502 41782 41095 39041 45417 22445
15572 22445 -19252 -26223 4909 29897 61579 40275 31832 63201 68169 43530 14811 26968
15560 26968 41151 62888 70217 66730 50485 21913 -9376 538 -19187 -16373 -36357 -38482 -9732
15547 -9732 226 -21913 -35243 -10906 -1512 9593 30466 8535 5829 15849 5370 -8299
15535 -8299 -21942 -27094 -51276 -83312 -94698 -50574 -4951 -6311 -4254 12254 858 -12798
15523 -12798 -7923 -1620 -23038 -32853 -9010 -18870 -43840 -46591 -26275 2285 -16515 -39405 -19437
15510 -19437 -6301 -38165 -44581 -19362 -13005 -13111 -17884 -23732 -31134 -16574 -2418 14336 20415
15497 20415 11687 -7426 11341 -5636 -4071 3857 17107 10852 -18365 -31841 -29714 -23790 -20762
15484 -20762 -20294 -2528 17058 22981 19616 14354 15239 -3223 -24523 -24345 -16005 -7218 6388 -7856
15470 -7856 -2607 6684 24686 -1748 -16787 -29476 -15485 -27573 -27979 -14541 -2292 -22165 -7938
15457 -7938 5129 -4770 6009 5313 8985 -14312 -27488 -25722 -11339 -30377 -53764 -45001 -45631
15444 -45631 -45058 -22357 -27688 -17483 20729 35894 24468 25388 9515 2352 -3916 -38875 -26722
15431 -26722 7296 22943 36277 28501 11507 26821 50920 38824 2521 -33083 -43492 -35852
15419 -35852 -216 -5466 -21190 -1786 12769 -16085 -11617 6237 12847 -10016 6717 19818
15407 19818 -21959 -24814 -32306 -36178 -46392 -45016 -39872 -24544 -13570 -15855 29964 21132 -7464
15394 -7464 11430 19787 40574 11646 -28381 -9765 14975 15686 -21761 -25976 -11980 -8791 -15307
15381 -15307 4263 14260 -26372 -66273 -69257 -58019 -48463 -40118 -10164 -8978 -11035 9518 15200
15368 15200 7417 -10444 -20946 -15273 -33803 -45242 -28314 -10869 6072 -24248 -40330 -25920
15356 -25920 -3519 197 -27871 -43759 -22651 9551 7073 -19089 -38514 -10664 23320 9156
15344 9156 28270 12397 -9887 -13997 -9751 -1170 -14046 -38758 -50633 -22391 10633 12750 -16013
15331 -16013 -37394 -21256 -11878 12126 45762 57504 30849 9240 7284 33874 49678 42555
15319 42555 42998 11563 -19261 -41732 -58982 -60625 -29608 14769 15472 14477 2381 -10464 -24996
15306 -24996 -21184 -22507 -10530 -3807 -3546 -4602 -1528 -10984 -25453 -10621 -3815 -4913 -33011 -34197
15292 -34197 -9752 -21034 -39779 -26819 -5190 -31966 -80842 -104253 -88870 -61646 -74646 -82713
15280 -82713 -22348 17915 11607 -24587 -52828 -21440 -33673 -33625 -789 2665 17292 23930 -631
15267 -631 -2514 4487 24225 19313 28379 8481 -23974 -32321 -20564 -6790 13774 19193 11794
15254 11794 20179 46053 79387 99049 86718 46811 18902 29448 12581 -5124 -1497 4777
15242 4777 14353 3562 2579 -6480 2868 33527 24317 8009 -4058 -666 10675 -2852 -3921
15229 -3921 5253 -17574 -41656 -31622 -19890 -25421 -23570 1660 29541 36506 37091 48709 5862
15216 5862 -8480 6602 -11029 -6441 -28370 -32511 -8041 5676 48642 59277 58567 42212 30079
15203 30079 33748 35516 3869 -21162 -27545 -4992 120 -11666 -37378 -54086 -33710 -43450 -28870
15190 -28870 -33782 -25820 -26780 -41596 -44692 -37890 -17673 -27842 -34152 -46548 -37950 5163 34281
15177 34281 15987 -6606 -19159 -36001 -9680 -12751 -31894 -59161 -39484 -20442 -17088 -7066
15165 -7066 4536 -11917 14632 40220 -10305 -57773 -44006 -52746 -43950 -36954 -36091 -25823 -21994
15152 -21994 -16461 -471 12884 -19758 -21043 -25702 -27275 -12907 9940 19331 2974 -20480 -47804
15139 -47804 -52711 -35401 -10989 -9184 -8282 -23959 -47881 -51822 -27763 -8787 -6794 -17396 -2167
15126 -2167 1064 -11682 -4583 2675 4736 18200 10810 13210 19074 5237 5237 15063 8360 11198 26581
15111 26581 40848 57026 50218 32207 2165 11749 9884 1664 6894 5701 -1487 17734 32662
15098 32662 11016 -663 -15367 -9460 -8210 -8228 6836 14629 23774 21422 -7793 -20252 -18747
15085 -18747 13206 -380 -33590 -50270 -2941 31415 13631 -19488 -42079 -22990 -7894 -18409
15073 -18409 -32711 -44915 -31230 -27914 -15386 -10921 5461 -6582 -39533 -55393 -46444 -38891
15061 -38891 3918 13979 1245 -12920 -8121 8370 31399 43128 42005 38132 40320 26446
15049 26446 -6580 -5057 -1338 15664 2293 -17396 -15031 -81 -1512 -12961 -11709 -7473 2860
15036 2860 -5284 12715 29222 -1987 -8207 -8890 -15018 3311 16398 -12913 -34574 -49536 -23845
15023 -23845 -1024 3117 20776 19806 -1942 11289 24618 4447 14206 -17799 -46590 -28914
15011 -28914 -13762 -21083 -2809 -23694 -30829 -21549 11714 21197 14430 2222 16079 -3960 -4930
14998 -4930 -19340 -17855 6958 -5877 -5079 5392 -15139 -14619 -8966 -27922 -70785 -73675 -61102
14985 -61102 -65313 -58078 -27791 14174 35999 27842 22084 30725 34800 49802 38645 22813 -22901
14972 -22901 -48409 -40988 -10928 39462 30975 7034 -1283 1938 -9726 -23996 -15437 -13305 -45418
14959 -45418 -51049 -47723 -33072 -11505 -21623 -19245 43440 74148 64259 39481 30589 33457 41226
14946 41226 48646 96308 94249 77979 46105 24004 23548 13971 575 31879 29624 -4449 11528
14933 11528 49428 62128 37934 5223 973 9025 48570 60227 59396 45059 26113 11894
14921 11894 -123 5433 6211 17024 32118 34079 18871 7690 -25704 -25816 1594 29498 61190
14908 61190 70817 71813 58836 45266 50717 45305 49840 25864 -3404 20845 35403 42523 62899
14895 62899 60268 63914 53380 49606 55257 63285 34912 29397 45370 55274 33081 6431 40836
14882 40836 60290 59923 34950 -13848 -18540 5285 -685 -16746 8408 4764 -12276 4795 3925
14869 3925 1362 9542 4990 -4672 -15773 2703 35700 33983 53092 55004 31174 31194 30032 9325
14855 9325 -11308 -9216 3374 9976 -7243 -23277 -45323 -35212 -1106 17022 3195 18327
14843 18327 31846 -3073 23681 29041 16794 22120 27645 50506 66529 57082 44727 28586
14831 28586 45820 59419 40107 24732 36285 47520 32012 23120 6050 22018 23837 -15879
14819 -15879 -37872 -28735 -21539 -2427 -1770 909 31020 49642 25977 25272 39591 76000 63004
14806 63004 28169 -1918 -30350 -47217 -41339 -28300 -5301 12445 -744 -14467 -1018 16754
14794 16754 -2600 -6313 -2307 -3862 1436 30213 23403 52485 32358 6706 9618 3489 5772
14781 5772 13771 6484 -10104 -38562 -20021 13905 22995 20616 6962 7744 -14766 -17219 -31455
14768 -31455 -44566 -54375 -50252 -57322 -59591 -47919 -21765 -32619 -44478 -21624 -3271 -2575 13135
14755 13135 38118 53954 65832 36473 25017 13086 -12215 -4354 -8754 -23852 -26968 -26451 -29265
14742 -29265 -37382 -54491 -79852 -65657 -27852 -17931 -6492 33372 50250 47586 31165 9974
14730 9974 6460 14544 11347 -14977 -12095 6674 7589 1563 -8380 16919 26320 10725 -4245 126
14716 126 -1273 33648 34784 21610 22420 11887 28154 27478 9122 21081 30884 14099 -24061
14703 -24061 -21538 -17871 -476 -13464 -27475 -6149 26336 43635 35691 34171 -2326 -20653
14691 -20653 -3645 -15772 -17906 2518 -2248 -16043 -906 -12442 -8651 6345 15714 51636
14679 51636 58293 61461 61865 38246 33997 56260 17096 -4090 -5245 6021 14863 -10566 -38848
14666 -38848 -64679 -31104 -19046 406 11406 18400 27970 10183 4870 15602 23377 -6808
14654 -6808 -8040 6230 -24171 -44951 -63195 -47333 -21980 -8916 19780 23886 47834 39815
14642 39815 19809 15577 -8806 -29477 -28498 -18818 -37265 -54798 -64829 -48205 -21907 6240
14630 6240 33880 21410 4077 2908 1323 -21900 -35060 -16192 -402 -7339 793 -12407 -43632
14617 -43632 -31271 -1970 -19027 -46296 -73217 -43272 -7633 -376 -17697 -24993 -17594 -10930
14605 -10930 -16404 -18479 -3202 28883 28241 21928 -5546 -40554 -30155 -30417 -39413 -44605 -39901 -26109
14591 -26109 -2634 -8302 -13766 -33056 -13661 -103 402 -19960 -22482 -39877 -32430 -28294 -52332
14578 -52332 -48212 -4013 20612 24709 20176 13653 24470 6202 -7989 8626 38269 24437
14566 24437 16975 39528 60928 54447 38805 9174 5712 5043 -7434 -20408 -6266 -22109 -20174
14553 -20174 -25439 -11841 14280 20998 24972 14264 -1607 -13660 -8850 -22742 -9402 3758
14541 3758 2564 -5431 -28949 -58254 -44307 -5107 6043 -4301 2315 -17826 -41431 -37603 -44789
14528 -44789 -30674 -4634 31258 31293 12252 -3517 -20826 -34267 -17048 -7803 12190 -8359
14516 -8359 283 29727 33850 28243 9503 25872 36131 41145 34455 22683 32202 54776 66417
14503 66417 81548 75759 87293 87344 60530 24704 -10854 -16222 -15861 -18527 -3033 -18100 -41117
14490 -41117 -12960 -30370 -36951 -32190 -25502 -15189 -33949 -31440 -15509 7192 8305 4754 -13023
14477 -13023 -29490 -10030 21495 39061 24495 6773 10408 41599 45212 15987 -4694 -34767
14465 -34767 -18013 9052 -19177 -15888 -14795 -981 1263 11790 -28404 -43273 -30922 -19303
14453 -19303 -39115 -26312 -30730 -44644 -45856 -35945 -14125 -17552 -48227 -58198 -75453 -74632 -53999
14440 -53999 -30764 -30574 -53547 -59451 -55860 -51249 -59624 -68538 -49706 -39469 -32506 -12583 -4191
14427 -4191 1439 -10225 -20909 -3991 -7028 -29357 -23662 -28290 -38888 -45141 -48976 -32499 -16074
14414 -16074 -15518 -4176 6941 -22137 -48744 -37702 -34776 -42998 -21681 1746 27266 15992
14402 15992 6883 21003 31564 15274 1824 7047 -10123 -6557 -12555 -25666 -25881 -34430 -999
14389 -999 -11269 -17579 -25121 -53325 -26388 -13184 -22927 6463 -1573 -23355 -10937 -16662 -4624
14376 -4624 14478 10515 13900 8467 -3992 17235 42510 40674 33525 3706 -2962 -29513 -45740
14363 -45740 -32227 -38194 -34694 -2898 24073 38859 3556 -40598 -33642 -35674 -23070 6826
14351 6826 -3080 -13405 15632 -1222 -37867 -56102 -39496 -39348 -38427 -37775 -21051 -14324 -4778 4395
14337 4395 4018 24403 28068 61274 53692 17829 3719 -4096 -278 4395 -18431 -22198 -11615
14324 -11615 3318 40652 46037 13613 -7060 -25570 -34662 -12304 7230 -10293 -28992 -38223
14312 -38223 -16929 -17515 -16315 4093 11977 38305 58270 62780 37337 11742 -6998 -8012 -9867
14299 -9867 -11268 -42865 -63737 -56602 -62788 -40833 -26640 -32001 -35593 -20641 -11075 10281 24239
14286 24239 26978 9427 15126 40484 22530 23646 28115 50435 55679 36176 52512 60479 30418
14273 30418 30719 6718 -35413 -49936 -16412 -24317 -30486 5377 23800 -2239 -2498 4779 -9231
14260 -9231 -20255 -26072 -23220 -28829 -23848 2622 20231 39227 20576 22072 52907 63337 29296
14247 29296 10814 -722 2530 2934 -16287 -34385 -27378 -7755 7707 5314 -1958 -11085 -12572
14234 -12572 -11421 -20915 -39575 -31574 1080 11912 -23320 -23642 14255 1634 -27384 -21925 -2613
14221 -2613 -16091 -36240 -60018 -76360 -55510 -38450 -30301 -2804 2529 -2084 -12614 -17702 -10150
14208 -10150 -5841 -13997 -26368 -21309 2059 15946 32904 43187 15657 -6447 -28904 -21319
14196 -21319 -37107 -50164 -53584 -49401 -11801 29184 45668 25344 14793 30135 54523 54122
14184 54122 24845 -41328 -34374 5657 31175 44068 15459 -25208 -28855 -34755 -44100 -54553
14172 -54553 -56964 -12516 18776 25783 17007 -23132 -43770 -59395 -55028 -32178 -14407 10881
14160 10881 43348 34011 -5009 -15391 -9893 -7183 -4529 -22917 -19875 9548 39536 69226 49232
14147 49232 49703 42684 21792 35745 27660 44841 84678 65497 62543 72297 50585 15033 8575
14134 8575 25460 25833 5652 -20464 -18826 -37399 -56043 -49646 -11949 12330 -5504 -5233 4272
14121 4272 18027 24080 63699 73257 45790 28246 19061 17559 27455 42989 21967 16733 -12499
14108 -12499 -10676 -5713 6913 18909 19365 -7859 2974 23258 8281 -27192 -29511 -14103 -349
14095 -349 5636 -1474 -22832 -35812 -18232 -19334 16722 46448 13921 -32503 787 31780 31834
14082 31834 23800 17046 18356 23799 9508 710 -3263 15309 42709 73142 53232 33257 32952
14069 32952 46239 45539 40642 10200 -9982 -21035 -19313 19162 16359 13631 23710 9570 31309
14056 31309 3448 -33918 -43709 -37822 4152 20638 8216 7083 -14346 -34102 -36083 -34474 -26640
14043 -26640 -36094 -31051 -45382 -34930 -35550 -48025 -61240 -65587 -66922 -41891 1882 1298 -23219
14030 -23219 -36234 -20882 18343 51165 50377 38677 26570 24196 48226 41419 4530 39429
14018 39429 21856 22915 44281 50823 26641 26687 26968 15427 18695 17525 7364 -13022 -10759 -16256
14004 -16256 10225 16287 8583 3926 -14128 -6688 8463 26928 28983 13854 12669 -650 -24231
13991 -24231 -6845 1515 -4740 16495 27118 27817 14698 6042 31241 32733 15823 19823 27672
13978 27672 33978 20254 7648 3975 9028 15501 66866 61964 28301 17951 37460 47399 50583
13965 50583 22930 20865 27991 22745 1327 5890 1224 -21654 -9395 632 18337 -9250 -26029
13952 -26029 -9771 27486 34487 17585 13575 -20855 -65499 -48658 -51236 -49410 -25013 -9101
13940 -9101 11829 26436 26969 359 -10815 -15311 -26194 -17756 7477 -23720 -47277 -20492 -16944
13927 -16944 -35244 -16072 -19473 350 -3168 -16494 -10027 -10423 3810 -15665 -32449 -30886 -24527
13914 -24527 -8343 -180 -12160 -25031 -31293 -29255 -33840 -12337 -18347 -11992 -24488 -46682 -39547
13901 -39547 -17083 -26901 -34403 -42759 -21673 9154 42936 34931 28235 -11505 -25446 -29995 -16040
13888 -16040 -327 -22038 -4317 32463 67349 65795 94464 92948 58720 57886 69868 71628 51432
13875 51432 42244 41301 48551 62241 57062 51435 68841 47324 19625 519 -8177 12370 19338
13862 19338 19763 24520 36042 57692 54004 44548 44162 65625 83260 94335 130949 143654 147752
13849 147752 155169 183302 209882 206712 193700 134089 98210 93230 96332 86651 79465 58213 52739
13836 52739 38850 30562 34713 39060 60051 89183 120599 120454 125399 118083 119331 136087 129242
13823 129242 125213 116009 109181 103224 105933 95464 92643 112354 124885 119680 103495 103917 87860
13810 87860 105487 119801 106366 89587 78119 92043 110168 139740 143794 134920 137116 129951
13798 129951 143266 151936 173487 169305 209419 210517 190494 178036 167240 133845 130829 114116
13786 114116 68695 67209 62880 53727 51772 22362 -7121 24073 51916 60880 53097 19835 161
13773 161 -10887 6129 10127 -4216 3010 40759 52851 81828 78755 56306 68350 96804 98584
13760 98584 89271 66682 74417 66017 59115 77819 70200 66571 84952 107561 113559 107227 105481
13747 105481 68749 57801 40647 15448 -13827 -27757 -11871 2809 15328 23717 32828 24363
13735 24363 -2630 -7837 25750 31236 2420 9307 6750 -3775 2668 11966 8891 -5728 -13313
13722 -13313 14496 48013 57787 74435 67506 54371 35608 32627 31715 28721 31734 9295 16679
13709 16679 2456 4844 11333 40278 56849 76366 104446 137970 145625 135718 118582 76813
13697 76813 18564 -13083 -41275 -38598 -14790 -22621 5216 34529 6167 -26349 -27578 2700
13685 2700 12469 36886 37812 42302 25226 3303 12736 49588 83774 65127 65032 97091 113598
13672 113598 116337 151864 172497 211262 237782 271397 280444 309804 363713 421791 441918 460969
13660 460969 421582 345648 274748 223818 174430 127121 112562 117802 135842 141658 117887 115921
13648 115921 130590 134288 132809 130141 125923 104344 117264 107599 127910 118706 98332 93410 96730
13635 96730 88355 119654 153951 211014 248149 327233 448631 531243 561265 541681 534808 539366
13623 539366 535236 542412 554588 536740 476804 429923 384651 308016 255823 231387 183424 147093
13611 147093 132967 111563 98645 93257 81135 67819 83328 87163 101353 101087 92563 109327
13599 109327 119075 97061 59928 64541 72233 79155 107882 139213 227254 311314 379221 421161
13587 421161 430405 444310 439490 437618 399397 370107 340709 319185 286087 244235 199017 162735
13575 162735 133419 111892 115298 83358 77798 99805 117459 91339 56058 40988 89167 74825
13563 74825 60334 19405 14062 53325 49513 32218 28627 51165 56934 47088 55902 71503 66260
13550 66260 52771 65598 83737 138177 198218 185104 169099 156274 150554 112462 56627 54161
13538 54161 58883 40326 32401 44103 53416 48271 43256 39676 56950 64421 74481 125931 164158
13525 164158 179091 175547 141836 114786 97282 76866 99660 124845 128612 94695 89915 98708
13513 98708 101390 89370 61477 60658 50183 40323 43637 47735 30625 44527 59113 31236 5614
13500 5614 9791 27680 61407 53655 55262 65769 61682 76628 74307 71063 77154 55818 43028
13487 43028 49065 72174 69640 121237 169707 188837 240617 255221 232386 175268 128025 124379
13475 124379 119101 96261 112181 129400 138444 124064 112935 101583 78825 54388 39998 60967
13463 60967 100265 103772 95254 56823 58075 68125 96287 114494 102631 114731 128334 130253
13451 130253 114567 114917 129238 144918 167854 175310 160289 153198 117442 83138 62076 79809
13439 79809 119098 141098 175573 164409 146955 149803 145384 135034 150508 130321 113108 128123
13427 128123 137238 157547 160392 167931 158753 145716 139964 150715 156556 158614 174927 162961 179174
13414 179174 202934 226945 215791 226273 247173 251643 232280 221444 215419 199550 205976 195763
13402 195763 170449 156902 149551 159680 122740 133886 129862 140549 161557 159401 162921 162444 162750
13389 162750 152882 166292 198664 255141 287679 256986 239400 222160 186643 165740 156021 144365
13377 144365 126586 134644 145892 138198 149646 156721 170892 181428 176507 144901 124608 125041 158592
13364 158592 177790 168350 152949 143804 134559 139679 143082 151117 174915 194583 227758 252692 280888
13351 280888 312392 351432 371663 430036 485179 519752 570248 625434 604920 520325 431845
13340 431845 373669 304353 263199 232683 192880 152671 132531 104439 79479 42252 40031 56014
13328 56014 69366 77837 63680 67738 79201 89849 66050 47401 50153 44127 36171 65627 85507
13315 85507 102704 155993 187906 225902 271081 298957 322796 329364 330887 394277 462498 508350
13303 508350 563726 628668 613228 586368 571304 495832 387811 340654 349674 365232 392116
13292 392116 478226 564638 616810 597542 537000 437835 356986 313128 295300 262009 236094
13281 236094 236447 243998 245126 209588 210198 211163 213570 238241 240338 255957 271501 299774 338690
13268 338690 372191 423588 476692 509256 513416 543365 613042 674032 734711 765666 760299 759494
13256 759494 737624 713280 705033 792466 936557 1112700 1304701 1561752 1747333 1824593 1876599
13245 1876599 1965727 2119230 2419988 2954915 3782513 5100754 7143533 10169173 14304692
13236 14304692 19482104 24694254 27540713 26614477 22663456 17510954 12892178 9498776
13228 9498776 7270690 5834561 4910542 4294849 3856999 3503358 3214587 3001173 2896807
13219 2896807 2885599 2981485 3073164 3112518 3107606 3117757 3226324 3439718 3767072 4280018 5026958
13208 5026958 6077714 7524760 9570096 12479343 16461352 21829434 28668992 36025761
13200 36025761 41925879 45668307 48745413 53650537 61206902 69260843 75979268 79118707
13192 79118707 76552247 68510715 56486715 43677895 32870270 25150994 20212272 17005305
13184 17005305 14677305 12841507 11337315 10230414 9443425 8785746 8186731 7696524 7341077
13175 7341077 7151774 7186525 7417664 7859589 8538423 9421349 10624596 12475264 15361371
13166 15361371 19714652 25889488 34376447 45702733 58937889 71793531 82915648
13159 82915648 90663017 94020392 94129107 93186581 93948542 95681572 95333280 91301612 83164009
13150 83164009 73107385 63367941 54278411 45563264 37264920 29794627 23736071 19208561
13142 19208561 16015893 13770061 12135551 10874623 9931952 9250831 8740470 8421152 8383283
13133 8383283 8586462 9027147 9544915 9973760 10400776 11071194 12343635 14580450 18339519
13124 18339519 24344550 33221572 45160866 59180561 71611229 78885337 80039762 76052910
13116 76052910 70074202 64743429 60941155 58456050 56256286 53501022 49710971 44090783
13108 44090783 36836736 29232375 22630614 17696236 14245161 11845853 10134365 8840322
13100 8840322 7911920 7253549 6710632 6212115 5768660 5376891 5047648 4789556 4545230
13091 4545230 4323572 4174170 4139823 4221061 4413755 4719049 5188236 5892735 6980069 8764836
13081 8764836 11705841 16320151 22199450 27916643 32074151 33599802 31826335 27398436
13073 27398436 21865921 16730731 12757699 9998538 8146104 6863125 5916854 5175895
13065 5175895 4548185 4010012 3583047 3272310 3014703 2757197 2514831 2315860 2174301
13056 2174301 2043321 1897142 1804860 1757333 1735565 1751664 1820249 1913530 2045517 2166935
13046 2166935 2151638 2097014 2073495 2030568 2011039 1984628 1911324 1794492 1655240 1518705 1441982
13035 1441982 1393891 1374687 1394393 1382491 1350452 1316518 1284078 1249612 1262459 1292140 1356241
13024 1356241 1515523 1682564 1834626 1935839 1961661 1936356 1902701 1964662 2124969 2347262
13014 2347262 2565826 2697228 2719364 2639506 2516508 2424255 2313450 2168737 1995795 1896989
13004 1896989 1904639 2017034 2146845 2264780 2328189 2372586 2411618 2448189 2590777 2820930
12994 2820930 3134550 3456986 3642807 3579703 3308201 2930499 2611339 2400145 2318098 2364595
12984 2364595 2473492 2635794 2814016 3039092 3239101 3398078 3418145 3317935 3084139 2811909
12974 2811909 2548720 2266484 2012726 1860703 1718293 1578223 1476454 1427655 1409878 1467945
12964 1467945 1600941 1794088 2009385 2216996 2391249 2557652 2695522 2773953 2764012 2627181
12954 2627181 2471345 2332586 2197796 2061016 1954534 1849215 1757389 1757315 1857940 2045529
12944 2045529 2316611 2678243 3129179 3594167 3987287 4284576 4395544 4271089 3983953
12935 3983953 3687895 3449939 3231065 3039375 2906561 2775695 2663557 2558575 2444105
12926 2444105 2293129 2149619 2062185 2059207 2176162 2426956 2746484 3096476 3428672 3696434
12916 3696434 3802631 3729556 3606878 3411503 3142403 2846216 2555348 2312604 2216438 2187816
12906 2187816 2201520 2283890 2315470 2323154 2345371 2389902 2448472 2585661 2806330 3042638 3316458
12895 3316458 3571268 3812205 4039737 4346932 4889150 5761192 7176571 9619344 14123207
12886 14123207 22236075 33432352 43026419 46824963 43830799 36001877 26850517 19167282
12878 19167282 13870970 10644591 8738820 7579029 6781747 6182625 5676595 5238971 4841575
12869 4841575 4440436 4073015 3761143 3506604 3303737 3138609 3012985 2978618 2957556 2992377
12859 2992377 3100431 3294554 3578308 3939164 4384201 4949656 5595309 6302810 7157917
12850 7157917 8275549 9889327 12465680 16890587 24909825 37991901 53041502 67038168
12842 67038168 79952817 86717987 84314132 74563553 61390470 49085410 40613315 37509322
12834 37509322 41158416 53680793 73525286 89926087 93655623 83906858 66394425
12827 66394425 48669703 34881239 25728308 20076781 16515695 14145734 12546812 11379505
12819 11379505 10417962 9610679 8934437 8371030 7907751 7575097 7392046 7311543 7379726 7580186
12809 7580186 7910984 8520985 9560403 11263108 14151143 19188357 27350965 37084243
12801 37084243 44798133 49533313 52143308 53266047 52222380 48624060 44983282 44936055
12793 44936055 51966825 67967079 90384735 114314884 136696220 149769873 144077109
12786 144077109 122608927 94903744 69419146 50502272 37893538 29944633 25001316
12779 25001316 22124176 20422445 18902463 17078994 15088015 13110249 11397331 10059494
12771 10059494 9086143 8396418 7953782 7776018 7887135 8343192 8899657 9161074 8947391
12762 8947391 8452480 7931295 7598684 7528563 7686292 8098425 8750485 9760650 11282968
12753 11282968 13685057 17816065 25169400 37570947 54239481 69238574 76626109 76300956
12745 76300956 69190554 57269523 44068462 32659531 24421103 19134394 15789849 13541226
12737 13541226 11841592 10577759 9676884 9099681 8755327 8673156 8751404 8754353 8364207 7557518
12727 7557518 6590166 5733970 5123502 4711656 4448318 4221990 4058194 4034992 4076302 4162077
12717 4162077 4289224 4472713 4700162 4913432 5137128 5503988 6105799 6830145 7653714
12708 7653714 8683930 10022015 11825475 14688367 19589867 27634760 39063943 52634341
12700 52634341 65615502 74100719 75493843 69593219 58134223 44829927 33272666
12693 33272666 25022034 19882059 16818096 15009609 13940596 13285228 12630982 11832912
12685 11832912 10860471 9861378 8975884 8321689 7918798 7649800 7368508 7074413 6775156
12676 6775156 6580176 6503557 6589647 6830791 7280084 7984055 9005237 10303503 11874538
12667 11874538 13902445 16729222 20990047 27777272 38413701 53204441 70041581 85266924
12659 85266924 96972657 105789415 111728130 114311348 113908243 110954465 104357968 92598150
12651 92598150 78545947 67245136 61150713 59446519 59246666 57992700 54750461 49847304
12643 49847304 43262148 35689519 28632151 22977851 18913010 16136881 14146368 12678498
12635 12678498 11636820 10873465 10266300 9816919 9512330 9313470 9165343 9075980 9144191
12626 9144191 9397539 9865778 10597303 11737115 13497917 16399716 21289622 29588299 42595733
12617 42595733 58790920 73690013 83660395 87055640 83062527 73808257 64606917 59644459
12609 59644459 59361192 61462828 63384894 64561245 66457597 69535555 71032096 68430009
12601 68430009 61947487 53288071 44122946 35286925 27579210 21516545 17177815 14237873
12593 14237873 12246118 10900294 10017089 9420687 9067063 8989682 9173511 9272581 8961094
12584 8961094 8362068 7750706 7396617 7381433 7562935 7712575 7713588 7531328 7246714 6963529
12574 6963529 6741535 6661548 6795927 7243483 8069838 9317791 11153221 14037038 18658242
12565 18658242 25422533 33471190 40423705 43943881 43585334 39430426 32442131 24838859
12557 24838859 18366796 13746059 10875110 9127014 7929138 6976603 6158804 5451079
12549 5451079 4835444 4361842 3971527 3661618 3477668 3306058 3085733 2821169 2541034
12540 2541034 2290903 2082631 1951219 1852377 1790868 1752923 1691811 1650472 1626894 1626823 1669264
12529 1669264 1722721 1780279 1784331 1808206 1821849 1840559 1818547 1755308 1678595 1665358 1659163 1685424
12517 1685424 1736983 1811312 1888148 1966139 1941207 1859199 1736080 1605150 1457691 1313082
12507 1313082 1174080 1089759 1003744 972424 952368 922875 907718 951793 960817 892740 823408
12496 823408 811490 825387 830012 828621 817762 854828 891105 905630 897353 902379 896785 927709
12484 927709 991816 1057721 1206440 1519550 1884029 2091745 2008119 1746331 1457946 1245025
12474 1245025 1101957 970188 890613 873064 850409 845161 806655 784129 820067 871551 966345
12463 966345 1096126 1266300 1568932 1933102 2413256 2976467 3445719 3642388 3544922 3193012
12453 3193012 2772592 2401151 2138186 1981678 1950995 2089816 2374192 2726558 3060070 3323687
12443 3323687 3410969 3261373 3006998 2823499 2805191 3004593 3354981 3690746 3802982 3649421
12433 3649421 3226908 2747209 2310715 1914154 1617125 1393118 1226836 1112992 1022508 931739
12423 931739 867713 829971 846143 839437 815390 795581 805996 840680 883148 903336 876026 814086
12411 814086 784186 791666 835765 950205 1125666 1347259 1656997 1948621 2006756 1860639
12401 1860639 1648858 1480337 1407302 1465863 1578776 1656899 1644879 1576172 1528708 1532551 1634391
12390 1634391 1843174 2150005 2568243 3202116 4040565 4920149 5539803 5705294 5393174
12381 5393174 4789067 4107971 3482504 2974669 2650348 2419794 2245546 2162387 2142028 2124203
12371 2124203 2123627 2131244 2216796 2419297 2789660 3400417 4159303 4967898 5617648 5747306
12361 5747306 5359765 4637502 3799875 3016425 2431781 2031993 1752919 1548507 1411487
12352 1411487 1305058 1228080 1159007 1118178 1078749 1008139 969584 957227 967797 948506 980048
12341 980048 1033676 1080270 1125438 1169045 1238102 1329544 1382107 1433438 1489433 1492411 1457224 1356104
12329 1356104 1229784 1091592 972516 912665 910086 962759 1044312 1146857 1238356 1319210 1287450
12318 1287450 1178910 1057021 905135 774394 693148 635886 591207 572935 541889 523011
12308 523011 519613 511121 523259 561587 574631 528831 546471 571896 571407 575508 575431 559329 526581
12295 526581 512476 500118 497406 520441 558170 584597 622699 680735 703738 749600 849163 940826
12283 940826 1006378 1043978 1031958 1015187 1000215 951537 871964 791907 698297 651473 657806 695574
12271 695574 758722 791918 804999 771252 708642 694319 705884 708112 748655 819480 861742 937337
12259 937337 1102147 1250396 1300461 1264710 1172817 1015426 897223 810063 751074 690969 640704
12248 640704 643971 683543 693941 713256 755419 810702 892700 989380 1075550 1192561 1266980
12237 1266980 1238557 1178675 1191208 1254824 1321655 1438439 1616160 1823664 2061126 2265946
12227 2265946 2419974 2505844 2545590 2569376 2568115 2497025 2363286 2165285 1933820 1735103
12217 1735103 1619081 1506064 1389878 1303564 1232494 1256328 1401992 1584253 1731426 1754664
12207 1754664 1698121 1584037 1413161 1271223 1161884 1075588 1049966 1025510 1035791 1039129 1101537
12196 1101537 1255124 1514727 1770382 1873037 1888905 1955119 2079282 2250257 2460318 2605745
12186 2605745 2708592 2728136 2674598 2606111 2614289 2768440 3126151 3735367 4758737 6070543
12176 6070543 7201320 7665255 7410578 6702482 5866842 5201739 4770113 4456072 4153689
12167 4153689 3732729 3244603 2775262 2439137 2267843 2294691 2495675 2793422 3128084 3374312
12157 3374312 3553494 3665908 3615262 3437735 3208001 2984752 2869000 2798750 2731922 2681205
12147 2681205 2651460 2615719 2569694 2524617 2531225 2634902 2925031 3418717 4230868 5371977
12137 5371977 6516271 7182119 7024155 6242673 5177232 4195132 3447143 3002799 2734052
12128 2734052 2623469 2579939 2544256 2457008 2298112 2186453 2118022 2078607 2061911 2015347 1930630
12117 1930630 1840666 1801105 1850758 1938385 1985897 2033883 2129147 2229990 2342274 2500126 2803068
12106 2803068 3357071 4085624 4859049 5401361 5524084 5270283 4837093 4410720 4040184
12097 4040184 3690037 3430374 3298476 3387099 3577585 3578266 3325924 2930548 2515202 2222563
12087 2222563 2044765 1937623 1913719 1948375 2063903 2276479 2609627 3034799 3508495 3987212
12077 3987212 4540847 5171168 5931871 7039994 8910129 12234043 18585288 30446741
12069 30446741 47416665 59929414 59084471 48507152 35581335 25275708 18608468
12062 18608468 14341388 11449146 9502365 8249241 7516889 7123408 6978026 7034906 7357717
12053 7357717 7710653 7767544 7455309 6854425 6103091 5441679 5044977 4921301 4977601 5162831
12043 5162831 5494248 6017981 6802227 7975267 9904653 13327632 20029977 32487400
12035 32487400 49262841 59972283 57085947 45250433 31785607 21436654 15115404
12028 15115404 11606233 9719391 8733011 8182856 7894545 7702238 7518190 7347506 7266011
12019 7266011 7439133 7925181 8774910 10060847 11694104 13623119 16026958 18831675 22010831
12010 22010831 26186620 32748679 44276095 65807686 106433457 171608127 237000215
12003 237000215 256939078 224793115 168521698 114816271 76935618 53978129 40631223
11996 40631223 32794893 28114524 25288148 23328371 21546936 19625248 17661172 16048866
11988 16048866 14879796 14140022 13819071 13944022 14534071 15634454 17298567 19509345 22303412
11979 22303412 25746056 29930191 35374905 42985671 54513216 73501770 107491847 170247958
11971 170247958 272590532 389752501 460456763 448527239 370511499 270672639 184725245
11964 184725245 125306350 88797851 67178454 54325455 46537632 41332957 37006743
11957 37006743 32781664 28635997 24932020 21926680 19590492 17726355 16153341 14785939
11949 14785939 13635723 12650594 11877753 11435445 11318123 11482046 11946533 12707845 13793891
11940 13793891 15172045 16843278 19076087 22133978 26540969 33463278 45393135 67435484
11932 67435484 107293441 166013255 220057140 234121018 203812105 152789221 104292139
11925 104292139 69630893 48342816 35897167 28633759 24331191 21550667 19359022
11918 19359022 17319297 15399682 13770474 12540050 11708620 11220999 11030748 11064716 11536895
11909 11536895 12836000 15822496 22212635 34045453 49554966 59875309 58079008 47204058
11901 47204058 34055866 23362583 16419197 12317803 9954554 8562587 7730856 7107187
11893 7107187 6514075 5855720 5204272 4646640 4264651 4028967 3802124 3584021 3337318
11884 3337318 3086359 2885960 2760370 2696269 2686890 2717156 2832048 3095316 3456258 3854557
11874 3854557 4318647 4923323 5748959 6985000 9020337 12809362 20130854 32850920
11866 32850920 48320641 57238854 53736226 42156410 29213514 19199000 12922325
11859 12922325 9331072 7312610 6141038 5434854 4905357 4381111 3859875 3356480 2920164
11850 2920164 2598297 2365944 2205132 2040655 1867749 1705476 1538354 1426591 1399640 1402988
11840 1402988 1409345 1348083 1269605 1202000 1140530 1088738 1049580 1046418 1048651 1068180 1065639 995901
11828 995901 925336 845678 800442 792685 775333 725099 692763 709508 689623 633880 581559 559048
11816 559048 462725 323264 186389 109340 144995 256694 383274 445642 478867 490596 491706
11805 491706 496730 489346 477365 522713 554364 582767 571132 533615 479197 434987 407248 420439
11793 420439 431235 442026 443665 426992 418507 429309 444992 470825 450023 396854 336183 177380
11781 177380 -61130 -340970 -553955 -576157 -470208 -296423 -144834 -22704 76807 115362
11771 115362 141318 161954 208396 221582 217911 214060 198793 199676 248462 293581 299314 285803
11759 285803 276190 293511 310685 298617 282272 259278 282311 318819 337769 361759 350928 317765
11747 317765 304333 288092 268351 232748 195373 111561 -2026 -122163 -194173 -130409 -18108
11736 -18108 69659 135118 169538 176488 167773 176652 215534 265622 274351 281678 290966 289877 286910
11723 286910 278454 261008 244799 226716 223495 211963 209028 187233 157696 141475 140505 164431
11711 164431 139673 138806 126789 112522 115330 120171 138135 122546 132435 178952 185466 189647 183477
11698 183477 173933 174148 158102 152760 129972 143137 185795 155190 142428 166400 203461 235473
11686 235473 252647 263631 262734 240528 208544 169380 168121 174619 161935 128658 104699 127132
11674 127132 134684 119204 124327 149286 173512 166843 143605 187340 213246 242618 255006 235331
11662 235331 203471 147429 126929 139492 162133 178276 184988 172618 172754 174483 179297 172433 206428
11649 206428 226771 200622 190676 169225 160658 148579 135291 122225 148598 182840 172342 151546
11637 151546 139907 130629 138379 169163 175887 182273 194643 182512 158833 168438 178191 185836 184518
11624 184518 212505 246347 246274 219767 214504 187439 177792 162659 136000 163255 194160 217604
11612 217604 195719 164095 157889 167793 175107 170337 177685 160114 146922 146677 146176 146693 137974 150443
11598 150443 142609 132658 117008 100429 113853 120721 103861 139401 178270 225405 248990 303706
11586 303706 370739 436242 434298 373025 305412 230414 214263 210750 143321 127812 131234 149532
11574 149532 149578 121766 124339 141030 133959 163121 150856 135548 131340 111987 123526 142349 141715
11561 141715 149606 160254 165410 142629 145733 163833 203191 224152 303713 383594 440450 421381
11549 421381 338112 270487 203431 175737 145637 126424 117288 155873 182847 168406 122294 73470
11537 73470 76313 96390 120352 124018 139455 161891 188001 176053 201583 261698 288399 301761
11525 301761 341593 478687 720299 1076512 1406213 1455070 1260672 961206 677658 494860
11515 494860 388783 336295 289796 267434 259867 223264 211542 196099 202140 178090 173713 193790
11503 193790 180039 148435 154366 170140 202806 236544 266234 304624 335364 363978 391758 504363
11491 504363 653657 944910 1454765 2117980 2621042 2651920 2242970 1665496 1153375 814005
11481 814005 615387 507369 440105 374522 322602 300521 295175 295746 271978 266047 238626 203384
11469 203384 179672 191682 225722 218852 176688 137026 128122 142109 150931 153579 196285 227496
11457 227496 253640 274889 294706 323283 355946 472340 654257 907145 1209635 1350930
11447 1350930 1275971 1033678 766294 564238 448644 339478 265695 256282 241310 205569
11437 205569 169012 164897 184235 201699 188091 169843 167765 161505 173724 184714 216631 226997
11425 226997 270042 347516 417136 412668 393036 353474 294136 210547 161290 151559 125652 90529
11413 90529 95655 116989 138438 153142 143920 138306 167993 167851 124084 126612 125104 133290 106855
11400 106855 101122 91709 84156 111166 146772 185942 181065 162941 139717 153166 149990 179490
11388 179490 200420 233575 283786 393860 472955 447557 374131 292749 245261 185481 154616
11377 154616 145082 154188 150908 165002 162897 156444 163189 129165 119153 134747 151844 148335 131394
11364 131394 121761 91076 108320 151756 180624 180456 163195 153867 137989 131869 127308 122595 120475
11351 120475 138724 150764 154996 149029 146830 122543 92401 97571 123108 140877 158076 168605
11339 168605 172907 165855 176473 186653 184783 160990 140514 142894 130488 117699 111749 126306
11327 126306 138186 166544 164350 138729 123291 106312 108632 148897 159619 171117 178023 178260
11315 178260 148468 152697 170401 167188 146295 135736 150517 157504 147403 155790 132877 130698
11303 130698 149774 172092 166869 168018 182352 180587 187633 171176 165641 147212 146153 132921 155721
11290 155721 173211 176727 185062 167655 154355 127472 122335 148321 184911 202550 191276 151206
11278 151206 163135 168600 163746 164720 148451 165365 181588 169521 107356 80578 79255 109303
11266 109303 138898 135552 144069 150452 101541 95804 130479 137487 130714 119052 132756 161601 155965
11253 155965 133498 138701 120648 132328 142466 164311 157731 151357 136915 133435 138851 140967 184523
11240 184523 209896 183403 168974 158363 186654 194091 200522 174769 183832 210047 189615 209401
11228 209401 221720 237363 233638 195941 164904 161987 173723 196515 197136 193015 207230 208722 175132
11215 175132 153061 168252 183180 190273 207003 196942 173689 171708 173131 164389 171435 129395
11203 129395 113825 104154 108621 145469 160024 189804 207156 185036 168709 179884 201019 229342
11191 229342 240337 248685 245668 232918 203886 210083 244245 239753 206913 173551 152347 167979
11179 167979 194897 202729 168769 145693 158289 158360 143179 154976 169338 191679 193299 199044 185696
11166 185696 177173 173503 168705 166550 184507 203830 182011 207338 214418 214227 207930 176429 179577
11153 179577 216094 243631 287995 300550 321743 314632 309904 282402 238205 232074 232200 221753
11141 221753 225489 213566 199340 199397 197477 217661 275547 280989 249190 263937 274391 239409 189464
11128 189464 154241 150328 144103 130716 116717 130772 166993 159218 134775 132879 148860 137210
11116 137210 142514 168356 203717 226210 240253 228599 226405 230931 208466 216076 234198 232946
11104 232946 259869 294311 284061 273995 262839 259466 253282 250542 232647 218037 175823 155790
11092 155790 158815 188514 217432 214317 189807 176752 171170 160918 151895 148667 163656 179935
11080 179935 187386 187869 182277 173186 151226 158073 159670 177756 195807 206513 183420 166397 166400 191023
11066 191023 174418 167068 141354 128042 139106 155673 146264 134886 127355 127114 145641 151091 142799
11053 142799 135759 148621 180913 198611 190202 188147 178312 159406 167780 183078 198834 223819
11041 223819 218926 182109 151153 147185 145022 167360 169958 159580 193205 216036 209706 218571 198047
11028 198047 199915 191586 169766 140796 121257 120032 139920 139397 163659 165143 172873 177150 176124
11015 176124 179299 162512 137055 121395 123503 145739 154008 152325 116946 91252 102718 107395
11003 107395 142035 185881 174960 173368 191598 169518 157833 169434 170671 175015 185662 171722
10991 171722 167365 150016 163892 162425 142013 132738 146208 134795 133719 142741 139769 141100 138200
10978 138200 128474 138103 127741 145406 188634 220828 214422 192495 176842 191747 195531 200928
10966 200928 192158 168952 179393 186645 170892 151470 159948 182856 183178 179809 170331 168077 191667
10953 191667 171134 162901 143745 133325 141745 137803 126621 163444 186818 210014 184007 186020
10941 186020 187836 151341 140774 154762 155391 140970 148511 156527 165499 182594 156955 137113 134401
10928 134401 143987 140931 116019 139615 178055 173792 180078 191756 195406 194966 179714 143491 138444
10915 138444 122251 117058 118684 117758 140083 164579 194644 204831 176316 168289 178333 162192
10903 162192 158959 177038 171875 203288 214456 213933 208779 194359 200224 202365 157319 158959 177970
10890 177970 179406 179542 192877 181762 173108 188142 194264 180372 147875 149584 160833 166285 179106
10877 179106 160181 154927 146266 123686 167868 166222 142821 158662 182070 196891 217368 253325
10865 253325 239195 213379 190340 195530 221359 226919 241401 252037 251881 208582 196404 203309
10853 203309 203584 194573 209322 236458 223772 208645 192868 205378 234464 257741 293258 323107
10841 323107 323800 300743 270267 249298 262010 290356 284508 274583 295147 319268 347390 397913
10829 397913 464420 562062 675900 806404 984232 1116767 1242379 1282637 1269382 1220858
10819 1220858 1122120 988695 799305 641116 544791 462775 401226 371378 354457 320732 264938
10808 264938 248960 257578 270862 284339 295437 303559 295414 285680 330115 344210 342600 354940
10796 354940 336864 319945 357922 385733 390683 409131 423612 447042 491455 573328 676594
10785 676594 858578 1073824 1332108 1631957 1953672 2267200 2474706 2560576 2491818 2308714
10775 2308714 2018760 1695682 1396933 1125484 912467 744357 611379 544336 495334 463234
10765 463234 465557 486427 450425 435932 438957 429773 423003 437826 464168 473926 463086 434192
10753 434192 433750 418583 416286 433647 431994 410182 412041 455595 480736 497217 538213 607095
10741 607095 708916 825088 927446 1069389 1250006 1385609 1493656 1542940 1509618 1434805
10731 1434805 1299729 1096847 904213 761544 641247 570478 529592 498500 471382 461037
10721 461037 444626 413721 378639 371829 367183 381560 412287 440324 467001 479664 481861 466106
10709 466106 465873 478134 452776 426688 440140 445767 414056 382901 367860 372788 406755 407426 367152
10696 367152 305095 279648 264931 295500 333788 329335 284890 245964 230792 261458 304051 329433
10684 329433 321200 317610 303790 315980 310682 316324 322939 337612 341263 337168 318794 335003 317097
10671 317097 299645 326445 312068 324064 336997 332071 353602 352825 326487 287598 288571 319666
10659 319666 351368 376880 348253 331929 335431 349851 359091 346982 335352 329849 300915 285837
10647 285837 281894 293325 295274 297723 289474 278719 281952 298598 299429 311927 295027 254850 269124
10634 269124 279101 308356 309181 349480 376214 362119 337528 300964 327037 336265 293508 270994
10622 270994 246148 246090 274302 307514 302461 272408 271091 281067 309256 321047 351949 358620 329898
10609 329898 332203 346830 340421 303197 289739 312971 327046 338161 352468 351286 336929 332366
10597 332366 333712 341472 327886 336896 343777 326384 314618 315534 311479 285561 278639 279823 290266
10584 290266 290496 307457 322725 314175 283763 263569 274071 281392 298519 292880 265782 276283
10572 276283 265444 253952 227223 234613 279666 284848 261869 248184 260789 254253 275627 326529
10560 326529 331831 327668 338333 323911 310296 307770 327082 333560 347543 335609 334932 320563 292588
10547 292588 311862 373077 428646 460653 452702 421136 404644 398764 373653 350412 330929 325776
10535 325776 310949 289872 299648 296203 307469 287598 264750 287282 292130 289877 282566 275843 256032
10522 256032 259232 284063 277944 274222 292279 303035 313639 328284 329315 300284 326283 360603
10510 360603 378533 363152 340167 349286 364352 358779 358238 350995 342052 342033 346189 365230 392832
10497 392832 466497 499175 515612 481293 440306 439216 443767 396527 367225 337490 303900 297817
10485 297817 288453 284147 306347 290399 292086 320112 355804 356137 360998 354837 353554 359694 354979
10472 354979 367049 419820 444920 435219 396540 376253 376524 373076 398929 437199 473336 501497
10460 501497 515853 495257 483089 450595 418342 397982 372604 380872 358424 354122 362183 356287
10448 356287 330806 310219 305838 317535 354212 393122 389132 383289 408387 414029 402523 405463
10436 405463 427222 428967 408249 415252 409238 425321 449794 472418 496252 533800 588339 607334
10424 607334 585521 552540 546300 573794 614091 679901 827896 1127916 1608974 2137904 2445606
10413 2445606 2354232 1951824 1490014 1131137 951472 847845 789066 744363 702700 650445
10403 650445 612538 601942 606004 604170 609539 613911 625842 651278 704206 686001 683288 712138
10391 712138 796761 929729 1089980 1272098 1458507 1680214 1884977 1983227 1954119 1817901
10381 1817901 1636593 1478002 1320431 1183864 1095585 1052260 1025686 1012103 1011719 1000703 946760
10370 946760 903173 871225 852651 822918 814011 806986 855945 905860 938665 942040 919949 915302
10358 915302 933880 936723 901421 881405 880603 888330 897230 935472 955898 979136 973323 983265 1000833
10345 1000833 1049892 1071329 1036538 1008335 1021933 1066451 1118545 1179209 1205691 1186892 1159994
10334 1159994 1145930 1160489 1175857 1232104 1286634 1285224 1256443 1206434 1084217 990283 933233
10323 933233 907064 897265 911236 956904 963238 954904 936094 935955 956443 1022190 1057716 1065394 1066971
10310 1066971 1067351 1072050 1077972 1106430 1081458 1067949 1054238 1039497 1019590 983668 958353 912529
10298 912529 869048 884862 925945 961769 1001384 1044531 1094874 1138311 1172577 1199538 1185425
10287 1185425 1157734 1174333 1159235 1122999 1084708 1029990 983385 964685 938501 932844 939675 925596
10275 925596 950680 958207 994726 1028913 1057693 1087215 1088815 1090501 1125198 1210202 1331565 1385716
10263 1385716 1392875 1364248 1331673 1284737 1191000 1109341 1076166 1080446 1099445 1100015 1105266 1096597
10251 1096597 1110305 1129974 1149322 1166070 1195670 1236378 1273296 1277020 1249949 1279172 1279557 1281449
10239 1281449 1322564 1368493 1367659 1322335 1278206 1219385 1148701 1084278 1021624 978554 966487 991246
10227 991246 1041285 1090885 1128524 1108097 1069882 1031719 977933 931700 865232 864723 903646 901704
10215 901704 916385 925808 919816 922234 909231 921458 914022 890342 864609 832212 809362 794951
10203 794951 801446 785750 828062 821928 784720 747074 730110 713303 717275 726803 715117 701062
10191 701062 712816 702614 712325 735745 753796 737075 730647 728212 717124 700913 692941 690485
10179 690485 687860 697047 693679 684329 695496 710968 694649 667850 697076 751203 775636 760405
10167 760405 742502 747752 755512 786676 804352 835919 871508 852653 836308 832584 818920 776991
10155 776991 746918 739996 747433 747697 785734 845508 880498 911299 935732 993883 1021850 998421
10143 998421 980340 962439 943586 936082 908717 870144 857648 848176 850867 868942 884780 880359
10131 880359 821176 796143 787400 805999 836308 859908 889566 911279 948249 974584 992070 1023637
10119 1023637 1076275 1086572 1122716 1193980 1266397 1284573 1237603 1152913 1078424 1019404 991245
10108 991245 1018474 1054723 1104527 1143611 1190531 1221943 1210501 1187620 1127762 1065202 1041076
10097 1041076 1060014 1114985 1194630 1263448 1308350 1306312 1262800 1210556 1111531 1028307 971326
10086 971326 927972 919274 928606 959515 987664 1050107 1090304 1126891 1164682 1238102 1301952 1404878
10074 1404878 1498666 1575719 1626152 1646156 1649375 1629336 1558497 1446307 1333954 1264513 1257924
10063 1257924 1272760 1287017 1296315 1307486 1341551 1369760 1390501 1435224 1435595 1434849 1472378 1458091
10051 1458091 1414507 1392917 1377286 1364575 1339845 1324727 1358202 1390077 1396784 1418008 1470073
10040 1470073 1500206 1556192 1649701 1760276 1914565 2099940 2355966 2787666 3631962 5022475
10030 5022475 6660740 8150416 9759667 10869756 10772112 10137341 8938053 7272115 5683569
10021 5683569 4367205 3458855 2938355 2648424 2495158 2390605 2290619 2203332 2146341 2160005
10011 2160005 2227429 2308969 2393065 2542082 2714661 2836669 3017444 3284003 3652984 4226495
10001 4226495 5166583 6778768 9434707 13122533 17151751 20159334 20984194 19684339
9993 19684339 16894106 13446509 10315328 7967802 6410760 5497719 5032418 4864286 4862317
9984 4862317 4911847 4865953 4732338 4577021 4368320 4170732 3964728 3759899 3599020 3510295
9974 3510295 3519115 3622772 3790654 3988068 4263372 4622154 5114183 5795230 6909284 8718167
9964 8718167 11652403 16065090 21479610 26482357 29251445 28938476 26289682 23069943
9956 23069943 21162486 21466070 23693769 27011309 30471562 33590660 36000097 36956273
9948 36956273 36439595 34890974 32169877 27879546 22662141 17877167 14315173 11947366
9940 11947366 10431470 9411524 8705194 8196218 7800596 7499307 7257375 7092720 7033830
9931 7033830 7101821 7381230 7915834 8770833 10225166 12716166 16637466 21975831 27610466
9922 27610466 31928482 34585676 36412986 38169854 39828735 40590963 40363627 40144389 41226518
9913 41226518 43541371 45534752 45797108 43552833 39053022 34131136 31176831 31174827 32938957
9904 32938957 34575211 35244567 34438090 31633314 27266672 22806438 19365695 17546589
9896 17546589 17639312 19988756 24783922 30546037 34606005 35676576 33945488 29995479
9888 29995479 24935350 20132202 16541239 14508816 14046855 15123844 17760971 21241560
9880 21241560 24204862 25847365 25998524 24768896 22933074 21789961 22697130 26979762
9872 26979762 35435114 46626995 57501926 65535667 68588184 65461009 57103979 45981427
9864 45981427 34952834 26175604 20119092 16393778 14338499 13337934 13049869 13329170
9856 13329170 14363820 16467145 19263589 21870377 23893998 25160330 26201170 27797835
9848 27797835 28880600 27703067 24710187 21538756 19658138 20074845 23607089 31428901
9840 31428901 43629306 55333138 60187900 58206137 52151231 43697372 34750465 27110558
9832 27110558 21724913 18891339 18486390 20460902 24384686 28607466 31293635 31550114
9824 31550114 29523572 26791418 25228716 24722363 23318050 20417542 17023748 14223470
9816 14223470 12674910 12516285 13601089 14911692 14896353 13553314 11744021 10172109 9219253
9807 9219253 8844025 8868647 9160378 9694151 10684052 12410814 15593956 21054125 28938320
9798 28938320 37850210 46071011 53720163 60435176 62301076 56315094 45400978 34323738
9790 34323738 25947739 20562956 17165643 14680902 12597910 10915985 9587946 8551973
9782 8551973 7748740 7124863 6612560 6224927 5893255 5680062 5636834 5701193 5808998 5918953
9772 5918953 6083865 6364784 6855955 7687155 8882829 10419938 12454029 15746122 21346797
9763 21346797 30129236 39734121 43882461 40878448 34416935 28007948 23405169 20618686
9755 20618686 19034782 18144197 17756552 18034585 18942308 20445272 22881506 26938231 31782264
9746 31782264 34518906 34269276 33091022 33008760 33674078 32425609 28781627 24434275 21122684
9737 21122684 19876179 20680653 22371854 23603167 24483404 25069096 24621662 23567043 23084300
9728 23084300 24147172 27132749 32302641 40365399 50131439 57579755 60935374 62127731
9720 62127731 61754204 58244764 51735376 44872062 40519748 40398948 44506699 50838884
9712 50838884 56327254 58983059 57166667 51872967 46200197 42189380 40848758 43026000
9704 43026000 49872748 61818749 75920242 87383607 94769297 98124175 97072745 89855181
9696 89855181 78135626 66678754 57976329 52925616 50882592 49953766 49379577 49498278
9688 49498278 49604747 48166364 45152842 41777705 40273263 42420688 47962074 54109972
9680 54109972 58420760 60330605 60689001 60491022 61174813 62874980 65598368 69153377 73260820
9671 73260820 78644731 82856949 83764722 81777920 76274755 67400091 57858523 50251573
9663 50251573 46293111 46918562 52978639 65045353 80754488 94469487 102502243 105252913
9655 105252913 102703202 95131907 85459251 79120766 79492779 84135243 86569346 82382370
9647 82382370 72688367 62611491 56148958 52554230 48698785 44728501 42394999 43305810
9639 43305810 47783802 53985999 60206069 65983442 70034540 71510499 70706299 68988006
9631 68988006 67161073 65906821 64694319 63439021 61130627 56417661 50460356 44959258
9623 44959258 40682685 37139273 33728747 30660610 28790506 28806186 31354123 37234355
9615 37234355 46258677 55380148 60622380 61395213 61319138 62795663 63556907 62403388 62400186
9606 62400186 65905194 69748181 68526785 61228253 50974877 41635768 34999922 30970094
9598 30970094 29009870 29234181 32040779 36431644 39892205 41355228 40720960 37093071
9590 37093071 31357273 25397149 20521663 17173102 15185344 14279048 14354481 15418988 16948428
9581 16948428 18158600 18599766 18468194 18045509 17363249 16663652 16604981 17375577 18009360
9572 18009360 17801412 17360667 17417165 18507271 21176808 26376152 33839511 39301977 38656108
9563 38656108 33289047 26444631 20588213 16567423 14042135 12435021 11300588 10424892
9555 10424892 9592780 8773818 7944979 7154273 6456164 5917669 5527360 5258973 5088783
9546 5088783 4960999 4907445 4950279 5114609 5395402 5768751 6326283 7230775 8552585 9940562
9536 9940562 10900452 11513581 12186280 12601084 12500921 12599571 13402491 13968945 13108781 11237457
9526 11237457 9237216 7777220 6948405 6577157 6459308 6438851 6366481 6219668 6037538
9517 6037538 5940237 6011941 6097232 6002793 5659363 5227358 4841954 4530323 4293583 4126858
9507 4126858 3987676 3868691 3802114 3763486 3731931 3734058 3786110 3875131 3979037 4061474 4112898
9496 4112898 4124467 4215332 4401121 4721488 5381492 6598983 8284524 9566982 9489589 8421578
9486 8421578 7071077 5924969 5119901 4624202 4312713 4104457 3998659 3935315 3891328 3875006
9476 3875006 3864046 3878660 3918274 3945227 3999065 4068506 4092588 4060473 3986526 3944012 3895093
9465 3895093 3885063 3865893 3868319 3906346 3992022 4157572 4372013 4698066 5183331 5768900 6499163
9454 6499163 7386813 8494877 10053338 12451477 16527986 23520670 33689762 44218740
9446 44218740 51506752 53661752 49421981 40569936 30883736 22796555 17146317 13503309
9438 13503309 11163592 9647469 8595070 7816205 7258509 6782228 6421512 6136810 5910680
9429 5910680 5765399 5725958 5793079 5913011 6066741 6203085 6304076 6393085 6509306 6660610
9419 6660610 6931122 7406470 8015959 8650893 9291849 9958285 10816874 12158946 14402430
9410 14402430 18434550 25414725 35468234 47188824 59628600 69567513 71857216 68258305
9402 68258305 61900994 52682800 42114236 32473424 25234090 20659137 18307457 17594421
9394 17594421 18349064 20796134 24988735 30053362 35198106 39075329 39061474 34656900 28056280
9385 28056280 21805535 17197452 14312949 12660967 11811003 11535113 11722325 12528638 14359302
9376 14359302 17881969 23782465 31165356 37777736 41895628 42280466 39062432 34598547
9368 34598547 31847774 32038778 34644417 37763108 38345288 36208104 32638256 27982768
9360 27982768 23265577 19485375 17045635 15831057 15684632 16634032 19104299 23551609
9352 23551609 29749511 37224475 44596954 49315718 49356722 46003534 42191468 38232642
9344 38232642 33098283 27191529 21707127 17605698 15077317 13729949 13233600 13405539
9336 13405539 14390936 16511680 20542903 27383556 36643612 46718549 55623676 60255421
9328 60255421 59216227 54281350 47012547 39219282 33455322 31193378 32143736 34313071
9320 34313071 35296033 33697152 29727226 24817586 20449827 17357681 15853179 16004398
9312 16004398 18069663 21885510 26240318 29668480 30528523 28112074 23345717 18123518
9304 18123518 13823417 10866151 9027060 7927727 7288141 6994209 6885036 6907785 6978202
9295 6978202 7051761 7219917 7634558 8404153 9790431 12289147 16498245 22362998 28088661
9286 28088661 32291275 34951051 35719012 35340193 35814209 37773849 40587240 43741033 45016420
9277 45016420 42395145 36861476 30414516 24198995 18780988 14560882 11502803 9443632
9269 9443632 8079682 7113015 6349789 5730195 5232198 4869657 4728781 4656857 4629998 4646704
9259 4646704 4685954 4680670 4599240 4509906 4509209 4537566 4385358 4082466 3727147 3458035 3270682
9248 3270682 3170176 3128942 3196594 3377481 3650466 4142680 4971667 6369460 8294125 9956985
9238 9956985 11205794 13009627 16101524 18910730 18658224 15649008 11781852 8530660
9230 8530660 6443983 5309950 4765170 4493231 4352815 4246395 4043400 3733107 3348337
9221 3348337 2984699 2713315 2548919 2472973 2452188 2487213 2587782 2771852 2975234 3044168
9211 3044168 3052445 2957853 2790605 2588656 2403189 2252498 2153997 2089614 2044135 2098595 2189699
9200 2189699 2243905 2210120 2049503 1822930 1614034 1441750 1339107 1285497 1266931 1287569
9190 1287569 1354686 1374136 1372171 1352679 1358281 1441724 1611853 1835824 2138758 2445738 2723018
9179 2723018 2910926 2969404 2875464 2646371 2361136 2090904 1829478 1605828 1450210 1352333
9169 1352333 1278011 1224139 1214983 1261135 1314139 1333769 1370897 1381984 1349724 1307666 1301559 1345103
9157 1345103 1449960 1617788 1754894 1766506 1665420 1508596 1341088 1189989 1111921 1132724
9147 1132724 1168207 1220775 1294401 1359225 1431733 1487056 1467091 1399703 1328369 1290189 1325240
9136 1325240 1427851 1501571 1580461 1619034 1650663 1702579 1684248 1606545 1472846 1345522 1185780
9125 1185780 1073089 1006124 950250 862619 787623 726774 696171 681827 695708 686400 658399
9114 658399 638726 596058 572915 572727 592548 594800 593013 620287 644321 622872 624011 632766 668264
9101 668264 685753 684945 634047 568145 502851 465353 460300 488250 510460 536009 566703 557776
9089 557776 565445 551953 536903 526545 492365 441982 414898 401423 382522 385696 376110 398620
9077 398620 427293 423429 387419 353919 322414 312424 308291 318387 311984 302570 302332 295830 305795
9064 305795 319097 298264 302461 304319 327102 330999 324844 311741 355277 382954 364799 351859
9052 351859 346775 350359 369171 376150 402323 444913 513146 570047 603180 604955 572795 543797
9040 543797 544748 519659 539145 587867 638849 722416 775389 803650 799843 771922 670748 596660
9028 596660 559816 500337 453312 396224 361075 327832 294816 283837 267205 249049 234295 216479
9016 216479 208853 205288 188935 196359 233734 229894 239089 212303 201788 231071 245651 264327 279317
9003 279317 300647 287806 277771 332419 395634 419000 449852 474375 507524 556413 596266 621733
8991 621733 655848 673429 642523 623707 566592 506861 420488 370392 339860 367800 412116 424330
8979 424330 426511 389071 363539 364918 324580 304042 270003 251580 264854 238151 203726 187538
8967 187538 178017 160244 125402 111904 118676 146868 186401 226257 248680 294676 329959 363080
8955 363080 388562 388306 369584 362789 403742 424023 472139 522781 497914 444483 422630 381768
8943 381768 344388 326474 350705 413718 462778 476922 474426 459899 426802 398493 379882 354228
8931 354228 297234 271992 259263 255601 255305 266589 299360 292486 286798 251245 232776 213965 227784
8918 227784 247302 251585 289521 326759 383035 407782 422907 416295 373002 341194 338215 335329
8906 335329 332147 344485 302648 288499 259436 216537 188040 170267 169408 195158 242012 288528
8894 288528 332587 379096 420153 473301 560968 609551 612943 564249 496568 424990 356538 336285
8882 336285 313432 288659 252861 234697 194987 191342 179649 175435 187283 212866 227940 227215
8870 227215 185489 203638 225979 204765 224973 266894 277569 291786 317431 336874 345272 344663
8858 344663 365311 366027 312305 259919 248225 236792 193918 166569 180979 187378 184939 165065
8846 165065 142105 105974 101114 140319 145478 147335 136094 120122 97510 90645 85981 39917 40590
8833 40590 65981 60044 52194 26729 51664 46088 57722 61613 58259 67030 78838 88385 77764
8820 77764 57180 37780 54015 101967 166559 196065 175303 153169 133718 107641 98826 136215
8808 136215 156463 133734 104943 113193 88990 60730 44938 31290 38827 20004 2347 76759
8796 76759 101965 75598 33700 -7102 -3929 2314 1225 14490 13807 1569 -2458 -51368 -48311
8783 -48311 -18470 -16692 11762 25215 42701 60651 36712 21843 40940 54496 53999 37937
8771 37937 12298 -6037 2754 -2331 -9742 4210 33361 23860 -379 -19254 -14886 -2031 43078
8758 43078 64998 58051 65143 38742 37759 50928 35666 -17687 -30467 -34983 -336 19931 19243
8745 19243 10698 6011 -9863 -22243 -11847 -14415 -38732 -50950 -21016 8241 -2068 -18335
8733 -18335 -14077 -6589 7900 -6559 -27205 -21555 -20249 -27666 -44189 -54990 -55112 -36756 7557
8720 7557 35660 22224 -10747 -23641 -13423 26068 36001 12084 15505 15054 -7983 12992 1389
8707 1389 -7109 -37302 -36553 -10867 -5284 -13599 -8819 -18811 -46251 -44874 -17121 -14185 -9569 -6995
8693 -6995 -10859 -32746 -22959 -25099 3835 14890 -27444 -27590 -32345 -25765 -19876 -12023 -14427 -46641
8679 -46641 -50754 -39479 -3189 -11005 -20233 22831 13255 -25056 -36175 -39426 -41062 -6794 20501
8666 20501 51049 78884 73856 78021 63830 31102 246 12340 22440 26948 7048 -26792
8654 -26792 -40841 -38662 -42912 -48615 -25123 -37364 -31391 -33349 -52254 -41787 -20642 662 -20876
8641 -20876 -45239 -46942 -67861 -66011 -44109 -31522 -26982 -25322 -29638 -11991 13330 14818 18466
8628 18466 -18211 -19767 12138 14288 -2342 -5281 110 15309 -4252 -25946 -1777 -10002 -7838
8615 -7838 3501 14828 48476 57596 56369 55416 70908 94108 126580 195437 282821 463052 746920
8602 746920 1072286 1218700 1109243 862852 603309 387551 247878 183775 151982 142214
8592 142214 125978 102876 106369 127856 157429 187239 248502 274861 257090 210010 180959 163798
8580 163798 161267 148837 128212 125028 149674 118340 125633 175983 221998 258180 269232 288007
8568 288007 324134 420344 564367 766430 1048883 1259083 1238557 1042632 783628 526837
8558 526837 361832 286172 228387 200046 206187 212553 224335 240648 219003 196647 246580 267632
8546 267632 264641 189278 115132 47669 35861 25173 12155 1564 8876 8138 14392 30193 65614
8533 65614 38521 60532 57551 55501 47294 16297 -9143 930 8214 7674 11336 -4174 -25101
8520 -25101 3245 3754 -8532 6284 66112 107278 161184 181309 187224 150229 91427 49816
8508 49816 29015 1013 -4021 -8335 -13936 -19819 -37505 -33359 -50529 -53774 -61895 -56940 -54749 -52450
8494 -52450 -51126 -45411 -50930 -50315 -42796 -32393 -37688 -23180 5822 -2166 -12076 -30116 -53565 -58821
8480 -58821 -37226 -18941 -24442 -42896 -28283 -20542 -17220 -16838 -18987 -19617 8015 28587 20249 24451
8466 24451 5723 -39942 -18890 -8528 -43382 -49253 -45643 -46825 -44795 -56785 -51168 -31037 -15129
8453 -15129 -17452 -49668 -45262 -30932 -47041 -75359 -64577 -52166 -40323 -42994 -54007 -67047
8441 -67047 -49561 -28407 -28495 -26946 -39585 -73960 -77319 -54007 -38739 -38636 -14094 -17095 -18706 -32455
8427 -32455 -62320 -88254 -85337 -59087 -25813 -20445 -50618 -62635 -61773 -45576 -46863 -44497 -49746
8414 -49746 -48995 -22085 -23255 -29193 -49807 -43689 -45916 -46561 -33545 -56240 -77949 -62987 -52688
8401 -52688 -25600 -30960 -33446 -39667 -43933 -56132 -19663 -18410 -21373 9479 18701 -12111 -19887
8388 -19887 -15703 -8453 -18061 -22433 -22256 -18867 -35845 -76732 -94750 -60079 -32161 -12525 -24828
8375 -24828 -52257 -51848 -43571 -35617 -16231 -27981 -28622 -7337 -16493 -41418 -41409 -32920 -44390 -45735
8361 -45735 -50749 -67834 -54980 -23890 8416 -17860 -35873 -42010 -45626 -93655 -103182 -74628 -53431
8348 -53431 -26450 -29171 -46042 -51284 -43684 -22714 -30496 -25185 -28900 -37789 -71456 -78382 -65540
8335 -65540 -56805 -74924 -62516 -50802 -36795 -48940 -61088 -52698 -36359 -16202 6218 36885
8323 36885 66764 73756 105083 123875 100493 50776 21631 33619 -6878 -33751 -7323 4837
8311 4837 17900 11836 12597 19702 -8130 -22413 -21497 -44800 -20678 -31908 -78126 -72058 -53862
8298 -53862 -54933 -56218 -45242 -3408 -16262 -27656 -34735 -32895 -7219 4343 -9860 -23277 -27173
8285 -27173 -26763 -41278 -55023 -97627 -85882 -54887 2369 53762 108661 207337 311117 357331
8273 357331 342167 266416 163555 71457 40238 26028 22733 3859 -20120 -45451 -71065 -64904
8261 -64904 -41314 -54485 -41997 -18562 -14765 17644 37177 42046 7562 -4531 1310 -18181
8249 -18181 -32733 -42600 -63205 -61253 -55735 -15687 8575 3608 -12131 -7467 -19537 -29154 -23213
8236 -23213 -55775 -56074 -10452 10386 30050 78103 126065 170602 159752 139278 89644 70342
8224 70342 66685 27818 -12507 -10839 -12218 -2844 16845 25630 14837 18228 19343 21958 -19634
8211 -19634 -52275 -18231 27031 47741 34452 14351 -17701 2685 32987 36679 21727 14245
8199 14245 -7499 -19005 -12794 -15133 10326 39904 58248 45600 34371 40108 55980 46541 20544
8186 20544 21161 8394 -842 23957 13431 19752 13752 5352 24460 21786 -11157 -33252 -32505 -18997
8172 -18997 14760 35936 52602 60422 72586 61643 41060 38037 88192 117752 96999 109691
8160 109691 160185 238729 374208 546220 724022 896878 1050177 1110234 1031653 889784
8150 889784 692526 518983 370982 295930 252974 233933 247499 266010 222274 178406 143905
8139 143905 112347 108258 86560 90402 110722 170887 259732 341081 406509 473948 548295 580836
8127 580836 586968 525930 446281 415710 380754 384568 358529 336075 320907 303556 296256 294416
8115 294416 319300 377010 445395 532252 744587 1054013 1514623 2058759 2384975 2330188 1947502
8104 1947502 1435346 1018915 714596 542440 446967 370102 335321 338386 323331 296743 248219
8093 248219 235972 242837 254311 255563 286083 287362 321725 430271 628828 878699 1097691
8082 1097691 1151850 1067911 916111 717168 601836 519669 436578 367185 320672 319757 318283
8071 318283 297907 284367 288078 314778 360395 378937 467633 598531 745851 906748 998150
8060 998150 1016273 955545 834716 696912 552018 404482 282579 239248 230857 200329 170464
8049 170464 154950 150050 162708 154473 143905 147162 138502 163683 184488 195436 240738 304008
8037 304008 359494 385701 361620 321561 251216 203160 162097 148520 123214 94485 59191 73310
8025 73310 86922 78436 51156 75958 87213 40899 30926 29267 39326 2372 -13631 19235
8013 19235 43041 41473 -29655 -56237 -41670 -17322 -19257 -15992 7103 44392 23072 -2776
8001 -2776 -24784 -15893 12248 11853 -28847 -16043 844 12 4301 13426 21829 20047 25860 18844
7987 18844 45391 27200 30953 26892 -23627 -13276 -18625 -31289 -34543 -18972 3360 22926 28810
7974 28810 7171 -10007 -31327 -26279 2319 16172 -10595 -11676 12917 6927 26065 36725
7962 36725 29640 29071 32242 13386 -1032 14362 -11512 -14372 20807 44090 8239 -14865 -15029
7949 -15029 16152 9662 -18362 -20482 -34517 -40006 -34514 -21049 -26249 -14092 -4514 -17025 15618
7936 15618 23930 440 -9814 -30446 -10062 36785 47041 29273 8964 -2481 -3477 -10681 -12679
7923 -12679 -23287 -7419 -5732 -27479 -32573 -23135 -29498 -32154 -6478 27989 8509 21065 -6447
7910 -6447 17224 22207 20747 433 -25333 -24803 -17011 -7558 4208 -3595 12087 26398 -5922
7897 -5922 -37116 -47948 -33306 -15026 -1565 7541 13813 14029 6273 11144 23368 -36537 -67024
7884 -67024 -26840 4072 14995 8570 -7630 -36822 -27117 -17998 -17540 -14523 -7747 -47642 -54141
7871 -54141 -37936 -14797 -3872 459 14945 18723 -888 -18519 -47344 -23177 -3876 -18596
7859 -18596 -8131 -16241 -42564 -49418 -42821 -40461 -45417 -61138 -35630 6945 -14617 -21997 -38613
7846 -38613 -45443 -37924 -29707 -24056 -31162 -46328 -56525 -24406 -14887 -25143 -50642 -54501 -57962
7833 -57962 -27213 -26164 -26872 -15699 -11715 -21681 -36788 -30991 -8612 3603 18159 11444 12374 2627
7819 2627 7313 15845 9192 -10603 -8267 -15034 -53763 -68524 -47812 -42018 -32233 -35667 -57364 -74712
7805 -74712 -81771 -61716 -44790 -59360 -61395 -23341 -36915 -61083 -51260 -19313 -28378 -30183 -24060
7792 -24060 -36799 -40031 -37897 -26721 -31443 -26664 -24557 -50441 -59881 -66004 -99941 -130048 -105090
7779 -105090 -46243 -14867 -25602 -72686 -70628 -17025 -10048 -17423 -2156 -11790 -15671 5469 -8217
7766 -8217 -29018 -12076 -15365 -21123 -31395 -44897 -44960 -17946 -47046 -40962 -21762 -14962 210
7753 210 -8175 -34732 -56325 -52377 -5305 23431 19795 -2758 129 9900 26655 27651 7252 -7052
7739 -7052 -20596 -4045 8445 7313 1318 -22557 -7542 15140 15015 2350 -33820 -48190 -38694
7726 -38694 -6340 7751 6117 -25451 -35369 -19618 -28921 -47869 -60324 -60837 -49415 -24394 -4652
7713 -4652 -1548 -4875 -31309 -47283 -26344 -19585 -18166 11468 12209 -22642 -21514 5906 -4439
7700 -4439 -4361 -15899 -1365 -1706 8323 8177 -8514 -16793 -1954 -24168 -34893 -19131 -12507 -22967
7686 -22967 -45942 -70542 -68950 -32644 -37326 -51573 -60798 -40282 -33862 -44996 -47870 -46568 -58324
7673 -58324 -68396 -65505 -99037 -83527 -41282 -24214 14741 18084 3347 -3047 8097 13874 10112
7660 10112 -24042 -10251 12337 16127 6864 -26534 -53038 -47988 -26777 -23689 -46422 -54869 -35768
7647 -35768 -42888 -60386 -30495 -30322 -59550 -72522 -58053 -36254 -38328 -46399 -62906 -50232 -35776
7634 -35776 -37157 -51833 -89262 -75058 -49220 -23487 -7793 162 -9594 -33283 -54447 -41577
7622 -41577 -24638 -26243 -41084 -21737 -17454 -27771 -50649 -61519 -70698 -61014 -39006 -17682 -21549
7609 -21549 -25048 -43937 -46298 -38304 -36175 -35399 -54243 -75918 -62340 -45104 -40766 -34172 -28521 -39475
7595 -39475 -38226 -30228 -13475 -1463 6946 -12440 -27326 -17659 -11739 11251 26899 38525 21337
7582 21337 -5002 -6683 -21581 -12902 -31823 -91659 -92715 -70062 -35883 -33613 -20296 -28067 -52911
7569 -52911 -70333 -77409 -57392 -41206 -40836 -51577 -54485 -65639 -81211 -74123 -54926 -41390 -49545
7556 -49545 -43351 -19656 -15040 -18552 -33259 -22796 -16048 -31521 -41553 -42014 -37289 -38490 -31154 -8757
7542 -8757 -1143 -30360 -21784 -16635 -37200 -40327 1113 1029 16108 13311 -21174 -52774 -54140 -45982
7528 -45982 -44211 -33669 -23954 -41455 -68169 -66541 -48215 -22002 -21420 -23248 -39053 -52179 -57897
7515 -57897 -73129 -50432 -16864 11008 20812 -2871 -5342 -23486 -27310 -24833 -21827 -44762 -43033
7502 -43033 -37172 -10077 -26967 -18986 -1914 -625 -8703 -29631 -59257 -67301 -60225 -88870 -72757
7489 -72757 -48017 -43003 -62132 -77821 -112728 -96670 -49640 -34285 -41865 -60596 -67054 -58443 -61256
7476 -61256 -82046 -97370 -109552 -102485 -77211 -48033 -16563 -23634 -41023 -34952 -21633 16205
7464 16205 22959 5150 2669 -39099 -38950 -27257 -39119 -58032 -53576 5907 27790 3205 -11597
7451 -11597 -27712 -30104 -20724 -35676 -67104 -48458 -32339 -33401 -39175 -38361 -21665 -3570 10234
7438 10234 10854 -16035 -17862 -15699 -10511 -18638 -26835 -25343 -13050 -17091 -13353 -14311 -30638 -21431
7424 -21431 -583 -3017 -21816 -11955 -22156 -43860 -30687 -31879 -40448 -55655 -71598 -70417 -74094
7411 -74094 -65441 -47444 -50430 -34532 -3543 4815 -15194 -48363 -77355 -79114 -74187 -76002 -46344
7398 -46344 -26936 -37437 -46656 -61419 -66319 -71568 -86972 -75491 -39539 -6870 -14460 -27668 -22986
7385 -22986 -16864 -31189 -42042 -53669 -45401 -28838 -12671 28543 26040 9607 13323 2388 -18254
7372 -18254 -13877 8257 13637 -10190 -26534 -61169 -96339 -78745 -87997 -68716 -31911 -11103
7360 -11103 -44525 -56811 -51363 -44661 -44562 -43927 -32679 -52440 -85153 -82711 -63968 -61738 -59899 -44733
7346 -44733 -29919 -29469 -51897 -43290 -28847 -34737 -41425 -44784 -26557 -45360 -54049 -40468 -60965
7333 -60965 -42723 -41410 -52548 -51983 -55808 -42605 -55466 -72977 -76231 -66097 -53545 -24491 -14436
7320 -14436 -37502 -49376 -39293 -38924 -49416 -49323 -37431 -38582 -46683 -27546 -13127 -27349 -6955
7307 -6955 -14864 -5848 -30289 -52295 -26657 6638 507 2315 9217 3730 -7215 -20479 -40941
7294 -40941 -48472 -35384 -24296 -43647 -51441 -46603 -31187 -29427 -54275 -62053 -38088 -31531 -27625
7281 -27625 -8292 -1487 -18758 -47066 -71482 -50389 -18757 -12337 -4489 -4759 -6702 385 -380 -20440
7267 -20440 -39728 -28410 -10147 -8312 -30666 -50741 -66749 -46008 -31952 -1610 14854 27271
7255 27271 20224 5468 -1422 10376 14897 -1366 -14186 -35199 -33342 -54762 -33355 -32 -29268
7242 -29268 -52826 -68381 -61412 -63948 -91456 -83256 -39481 -43552 -46427 -44631 -17314 -6788 -12291
7229 -12291 -19413 -32414 -53168 -41144 -45368 -20959 16887 30056 27159 -1138 2739 12859 -19894
7216 -19894 -13270 -8573 -33950 -31325 -3161 8867 -11007 -46541 -27574 -8643 11278 -16297
7204 -16297 -31735 -50954 -46037 -50992 -34146 -16061 -266 3619 -1086 -24108 -58541 -58708 -44940
7191 -44940 -58491 -43331 -52548 -47125 -26743 -829 -3043 5694 20459 -2578 10498 -2074 -2353
7178 -2353 -8720 -15340 1328 26494 3707 -569 12988 7712 -5348 -13587 -6493 -21986 -30232
7165 -30232 -28866 -11657 -14877 -33693 -38788 -46874 -42997 -50791 -54525 -52276 -29498 -6515 7025
7152 7025 -13028 -38165 -23183 -5015 -1232 6421 9749 -16363 -17962 -231 14230 3215 3796
7139 3796 -15406 -14637 -16806 -43474 -45739 -29640 8113 12436 -23398 -49005 -33898 -19199 -22451
7126 -22451 -52194 -41912 -34371 -17100 -23865 -30635 1729 -3230 11708 9745 -42076 -88477 -89730
7113 -89730 -75297 -55924 -55664 -53003 -64292 -72499 -48617 -42384 -59112 -37725 -32473 -33650 -22344
7100 -22344 6546 50024 29132 -5579 -4074 -9080 -22237 -15653 -7948 21289 17592 7985 29107
7087 29107 6381 -32273 -28779 -12608 -14672 1086 37410 46625 45260 40968 28027 11219 7324
7074 7324 10690 -8224 -32184 -25788 -22343 -15293 -2829 -5649 -34676 -55204 -74724 -77555 -93626
7061 -93626 -86435 -61998 -47146 -19575 18319 25070 5901 -22553 -24807 -10091 -6690 -5759 -8965
7048 -8965 14577 -5918 -28089 -29445 -16837 12280 -3596 -25615 -7341 5773 -30581 -17028
7036 -17028 -36978 -33370 -33963 -61228 -66187 -57533 -34280 -12691 -2578 5960 -9518 -12759 -10376
7023 -10376 -30688 -46829 -37990 -37919 -16096 -7954 -14041 -23931 -31467 -30114 -31093 -5820 13847 -764
7009 -764 -3171 14298 19047 20255 18638 13449 3218 -21874 -30494 -45832 -46031 8724 29994 9944
6995 9944 -10730 -27116 -30179 -17204 -14486 -15295 -7495 -36360 -51245 -33898 -12213 -14934 -7545
6982 -7545 -6793 -18726 -60813 -82104 -73012 -65013 -36824 -30729 -14903 8802 -5436 -29417 -19951
6969 -19951 -4976 19480 32532 14925 16813 16313 -6008 -23019 -35913 -30084 -18139 -32643 -22252
6956 -22252 -9192 7162 12078 -2677 11589 14422 -12320 -20919 1569 14845 19290 18905 16938
6943 16938 11642 19145 39427 14989 -37422 -33515 -43952 -55283 -60218 -72981 -75994 -48645 -46395
6930 -46395 -54211 -51845 -38117 -51340 -39552 -15075 -13612 -53241 -47376 -26625 -25219 -10667 -5827
6917 -5827 -19661 -36307 -32206 -26503 11034 45368 14000 7875 -16987 -30615 -17465 12731 29801
6904 29801 -8255 -35132 -40899 -56789 -59700 -36787 -4274 22261 23462 -5417 4697 28318
6892 28318 -1250 1942 25811 21286 17444 40257 37612 26408 44267 51306 35813 -16823 -56239
6879 -56239 -59712 -41031 -26736 -42062 -40842 -36764 -26524 -38998 -59939 -45503 -21805 -7924
6867 -7924 5409 21096 4294 -13723 -22741 -1945 14473 10104 9760 22802 5055 4846 -7653
6854 -7653 -18677 -33076 -22931 -5634 -10071 -6650 14408 -952 -38247 -67449 -36733 -9419
6842 -9419 -8226 -15071 -4792 -15699 -31086 -15553 -19988 -17165 -6575 9686 15184 -6351 -8999
6829 -8999 -13706 -50695 -60689 -45840 -26519 -36131 -36068 -49055 -47864 -33415 8347 27907 31021 27199
6815 27199 10940 -17923 -26980 4917 12818 25959 14828 -10522 2860 16700 -20021 -31064
6803 -31064 -35327 -20062 -14489 -16203 -4712 -3245 -9796 -38142 -75990 -80263 -35746 13037 9452
6790 9452 -2823 -23934 -35614 -32072 -60551 -46560 -22557 4562 5608 -23232 -76964 -90980
6778 -90980 -56601 -50167 -33183 -21420 -10899 -10843 -11210 -21068 -19477 -7292 5073 45751 32428
6765 32428 23500 9932 3029 -7682 -5709 10528 -5109 -6535 -18522 -17152 -8821 -11623 -605
6752 -605 11037 9387 -26520 -43979 -52081 -38534 -20550 -31883 -43624 -57453 -36973 -25579 -34114
6739 -34114 -3759 13378 3181 -38058 -61927 -41505 -37924 -43763 -39388 -50605 -47201 -29728 -49193
6726 -49193 -46502 -35647 -18411 12763 -104 -5530 -13633 -22642 8741 -14691 -32618 -58672 -66066
6713 -66066 -72234 -71292 -19470 24514 32661 6031 -8542 -4190 24744 37316 15918 17769 23797
6700 23797 14689 5471 -4010 -8343 7269 24496 -3705 -24005 -33988 -37354 -20571 -19688 -25660 -20332
6686 -20332 -22336 -18477 -20440 -5787 -8923 -21924 -4484 -23490 -47025 -70435 -75771 -72714 -75033
6673 -75033 -68428 -25480 14410 9495 -13338 -11905 -1256 3971 -17514 -39167 -46978 -42008 -36377
6660 -36377 -33787 -43982 -55226 -20520 619 -27279 -40269 -52890 -16408 3737 8732 -4798
6648 -4798 -22 -13279 -13698 10888 -17774 -34118 -38702 -73785 -46861 -1144 -5383 -23581 -4590
6635 -4590 36109 38399 31933 16745 4842 -2806 -16977 -36893 -38089 -36389 70 -14143 -19984
6622 -19984 -20215 -3999 -14563 -46587 -56611 -57537 -49565 -30926 -20465 -27199 -21775 -33831 -31012
6609 -31012 -22720 -2739 1411 -24741 -34793 -28687 -38424 -29423 -22630 -30900 -32808 -15103 -6738 -5103
6595 -5103 1095 -3162 -11969 -3605 6871 8818 2448 -9373 15100 28253 36580 11447 4972 13045
6581 13045 3282 13857 -5904 13563 11966 -3439 -17903 -19289 -4716 18298 20745 32461 19217
6568 19217 -17969 -16746 -17529 -36508 -25737 1121 14346 -8027 -20681 -60420 -81249 -80239 -48933
6555 -48933 -27099 -27125 -19035 16836 18168 22276 6440 -7832 2584 17929 6258 26849 36279
6542 36279 16103 18767 28992 11654 -16660 4390 11747 13445 2267 -16682 -18061 -8019 -749
6529 -749 -37213 -51981 -10168 7107 -7706 -18285 -10879 13370 19309 21108 20821 -3124 -47181
6516 -47181 -32158 -27724 -24196 -13649 -15777 -24680 -21223 -40432 -46295 -30493 -14378 19338 35890
6503 35890 37548 9841 177 -29366 -38481 -37920 -46176 -43251 -37591 -15038 -13686 -40176 -35642 -36272
6489 -36272 -22649 5785 12773 -8168 -15971 -2645 -5673 -23326 -13735 -12554 -23157 -18261 -5774
6476 -5774 13540 -4812 -29015 -39528 -29910 -35064 -41440 -64585 -56243 -31305 -8718 9431 -3743
6463 -3743 -4380 1370 -3507 -19945 -7430 -19611 -26915 -15231 -28073 -22416 -23126 -51321 -62754 -30618
6449 -30618 -28313 -38758 -14030 -7690 -35954 -36530 -1019 -39801 -58595 -28715 -30615 -69672 -41714
6436 -41714 -36808 -37060 -37091 -19642 -27490 -49126 -26807 11690 -2302 -42843 -44031 -32213 -46370
6423 -46370 -58865 -54771 -36373 -25860 -10691 -10967 -28405 -16771 7196 35230 61936 60325 23564
6410 23564 4390 -5442 -17853 -15052 -14686 -30219 -27311 -4045 8576 24291 7034 8730 37431
6397 37431 52802 40602 8415 -8964 -25577 -30588 -52877 -36192 -23670 -23878 -21372 -15727 -19225
6384 -19225 -5576 8223 -8334 -10627 -11318 13177 15423 4522 -4661 -25803 -19274 -30237 -37702
6371 -37702 -21565 -24779 -52614 -34099 -3731 -10645 1428 44089 36435 531 -23582 -34914
6359 -34914 -30657 -39015 -38732 -29461 -32100 -5285 -16253 -19085 -9082 6964 -18905 -36781 -25413
6346 -25413 -24226 -8821 19586 41511 30256 -874 -5011 -638 19913 11984 10681 20904 22122
6333 22122 10769 6691 15188 -6239 16744 40822 38164 51990 69545 71719 28383 36385 48217
6320 48217 27199 19437 22570 6545 -25316 -29775 -19449 -11274 -25885 -36103 -43836 -25225 -23504
6307 -23504 -37513 -10158 3344 3924 3283 12612 25780 30480 22702 20712 5234 -11412 -965
6294 -965 23410 22647 30719 24387 -19264 -37948 -36327 -23266 -26066 -41550 -38175 -38282 -46502 -57690
6280 -57690 -51502 -43305 -37299 -56643 -43214 -18415 -12939 -16561 -43981 -29715 -26246 -15086 -22242
6267 -22242 -20374 -13308 -17025 -33120 -33319 -36929 -15825 7354 7992 13089 24074 24260 9372 -3390
6253 -3390 9179 11151 17339 9681 19251 27655 3032 -7174 7697 14477 4479 -38006 -55934
6240 -55934 -41545 -30297 -39840 -43628 -32300 5990 25384 2166 -15419 -50537 -41656 -37739 -6738
6227 -6738 28755 29758 26810 2117 -25123 -10118 10553 8166 8997 -186 -749 836 -22318 -9193
6213 -9193 6559 4512 -223 -2507 14954 11138 22455 16844 24719 21096 301 4816 -391 -6646
6199 -6646 -6044 18096 25283 -2761 8178 23903 24734 41334 49221 11945 -13814 -7358 -21849
6186 -21849 -27138 -36508 -12141 5922 -27775 -11917 13879 2033 -6348 -33178 -42712 -8330 -16926
6173 -16926 -25179 4110 15830 21147 14706 6511 7155 -29287 -27119 -29933 -18825 5679 -9192
6160 -9192 -17904 6024 -12730 -37447 -15652 -20860 -10006 -8854 -5949 -3281 27522 19546 2349
6147 2349 -22966 -30246 -1430 -10858 -10819 -15178 -4478 -10130 -10298 -4549 6340 -22662 -21941 5074
6133 5074 15657 25861 24498 25858 45255 46654 21102 149 8205 -13591 -23408 -36549 -32208
6120 -32208 3579 16862 27631 27103 5909 9703 27305 43031 38523 37697 35084 21932 -2222
6107 -2222 -30656 -35446 -27035 -34447 -33173 -23907 -924 9786 -5003 -13279 -31079 -32557 -26465 -30397
6093 -30397 -40715 -33830 -12072 -8994 1627 4700 22000 6683 -24746 -24362 -1624 9588 9130
6080 9130 22867 26122 34320 50646 50725 40100 9289 -3677 -12395 -10915 -6911 -29657 -37299 -27927
6066 -27927 941 2719 -6655 -6814 8474 17777 10609 20361 9564 3564 -10901 -2263 23975 -12530
6052 -12530 -32851 -65529 -48715 -53298 -41502 -24793 -22107 7544 -18768 -24831 -1914 1037 -28998
6039 -28998 -43712 -34950 -47225 -49653 -9574 22229 15220 12465 -14734 -13727 -3941 -12113 14967
6026 14967 41787 33065 13232 579 13147 15185 6408 -7105 -27944 -47196 -22353 7239
6014 7239 30551 17495 31522 15215 -3564 -364 12324 5533 -9077 -20147 -22402 -8316 8527
6001 8527 3663 15655 19532 26719 32757 20089 -10156 -42548 -34644 -35711 -39851 -40967 -86520 -78190
5987 -78190 -56340 -26480 5157 -16691 -30320 -37059 -38654 -22955 3971 20715 -3346 -80
5975 -80 6815 -16344 -29820 1016 -2528 -6160 -11830 -1421 34575 46363 33211 21911 23181
5962 23181 28217 45066 33019 13108 27040 43978 53351 33035 -5403 -13612 9456 27872
5950 27872 18614 -9967 -29403 -19253 -12025 -19085 -23343 -27003 -15418 -33897 -5179 -5669 -18425
5937 -18425 -16796 15916 26960 29006 11631 11744 1006 12984 10419 -40770 -54622 -76472 -73415
5924 -73415 -27220 -23630 -28051 -22676 -26230 -36399 -34714 -11770 11270 13969 26085 20968 -15320
5911 -15320 -33326 -65612 -70966 -45636 -39412 -43991 -29791 -20171 -13872 -10713 -5064 4702 11416 18685
5897 18685 21809 23801 4612 21216 23010 14964 22637 16497 8700 16824 34104 39690 7107 5986
5883 5986 1005 -6964 40 17928 32927 17965 12558 9011 -15121 -43627 -65483 -59041 -52569
5870 -52569 -48225 -30493 3078 33 18473 -18993 -22887 -22262 -11273 -5929 -12434 -30554 -42433
5857 -42433 -7355 -20632 -51944 -59243 -29970 -32610 -38021 -21871 -8743 -2422 -6429 13084 43579
5844 43579 31972 54529 60958 66597 29992 10848 15791 38711 51207 42832 52933 52431 42071
5831 42071 643 -56794 -50862 -8266 29660 9436 11212 -9070 -998 -22776 -36147 -28189 -30525
5818 -30525 -16361 213 1904 5438 20811 30648 41584 20204 -14350 -20105 -23707 -12964 -12995
5805 -12995 -4519 13206 722 -8045 18070 8447 -15703 -10866 -22345 -24866 -20712 -31009 -29214
5792 -29214 -18310 -15394 6454 34016 44192 38100 -484 -19325 -32849 -32497 -12008 -6184 -16142
5779 -16142 -40511 -49545 -36907 -33213 -7532 13585 24393 24400 8029 -8329 -6603 -12816 -62803
5766 -62803 -57677 -16974 -7691 3118 22634 27037 2118 209 9034 13325 9549 18511 16890 12261
5752 12261 13067 -6839 284 -17121 -17596 -27558 -25175 -16338 -17747 -18349 -18937 -29008 -17490 -17295 -21389
5737 -21389 -18608 -13051 -20580 -8518 40460 40477 10909 -4877 858 -29155 -39868 -16660 -12939
5724 -12939 -29164 6617 24846 4471 392 12932 12931 6791 2993 -6702 -21664 10776 19757 -5788
5710 -5788 -2090 828 -7545 26 4765 2333 -25354 -30384 -7507 -17275 -9919 14485 9543 1998
5696 1998 -25501 -23538 9631 42167 25328 17312 3634 -868 11540 33757 27089 -14039 -40607
5683 -40607 -32726 -28431 -17159 -5041 -6002 -4121 -24098 -7488 17438 9524 -11375 -27476 -30366
5670 -30366 -25052 -37608 -28939 -12384 -5435 2592 -11102 -23209 19179 37008 15661 -10146 1701
5657 1701 -13865 -26255 -31741 -35507 -7203 16065 -2182 -10919 -19847 -25307 -44207 -36561 -18352
5644 -18352 -13092 -9242 -20 -12046 -22197 -45768 -43713 -15671 -20077 -42426 -8188 32219 19310
5631 19310 -6431 -14769 -26390 -34007 -24073 -15831 -49190 -44386 -16225 23248 29947 6226 7586
5618 7586 15614 2314 -10674 -11806 -16644 -19016 -14740 8426 15038 13798 -2820 -2352 23662 11449
5604 11449 19101 -2849 -37782 -44866 -8261 12469 21078 29387 43503 55127 56647 20885 5055
5591 5055 4956 23979 36520 11146 10430 12093 -5403 -27527 -37919 -30094 -18454 -7319 -20096
5578 -20096 87 21799 14505 -25030 -28791 12597 2189 -35628 -20857 13565 8577 -12909
5566 -12909 -20156 778 22168 16396 31730 46652 40926 39260 59860 37481 5584 -17718 -2647
5553 -2647 -11925 -11871 -36413 -60051 -40417 8899 1369 -35909 -28476 -4855 -6252 -3508 15115 24033
5539 24033 12833 -7835 1218 -1375 -14188 -6458 -18391 -26215 -21729 -18421 -6988 -4952 -6458
5526 -6458 -2038 -9127 -27171 -33 7370 13399 34181 28269 22239 11197 -2686 -11476 4790
5513 4790 -2518 2863 11115 8110 15548 -1896 2537 29893 26672 17684 -2751 -41552 -33588 -4137
5499 -4137 1178 19699 42107 12978 6005 14954 25066 19083 -939 -6137 11472 -18350 -15668
5486 -15668 -2159 14774 49157 42025 22672 -6183 -23200 -17006 -17161 524 -28477 -32455 -6242
5473 -6242 8380 9541 31570 25790 11254 1347 -15590 -13948 -28671 -16361 15704 29075 32702
5460 32702 27624 -1063 -17998 -10350 -14904 -13625 9665 26776 5665 -347 33608 40005 18732
5447 18732 -8628 3308 28035 25608 26958 -20107 -60072 -34580 1699 29116 27758 16711
5435 16711 22739 9707 -13318 -12744 -20335 -20244 8713 13903 24322 -2378 -29314 65 57428
5422 57428 61012 41320 9491 4994 -52 13274 13397 -24055 -24912 -16828 18381 10260 11879 -6545
5408 -6545 -8303 6446 -2345 -26617 -25751 -31618 -7933 -7471 -22967 -20286 -9384 -16243 -31488 -21204
5394 -21204 -6905 -12642 -7395 4096 15886 -427 -1753 -8112 8444 18691 2914 -35621 -30112
5381 -30112 -4227 -5014 -10926 318 10907 27001 16639 1617 6976 7358 8739 27322 56067
5368 56067 35302 31604 28942 26846 22576 5061 31171 62137 41250 13581 6687 33467 36980
5355 36980 35154 34238 51528 73341 45088 8215 -2953 10079 13265 28937 25613 14222 23817
5342 23817 25841 13551 19298 43395 53935 42653 22224 31319 25808 8260 -25506 -2818 13548
5329 13548 47558 31523 47853 28846 16876 47587 39820 41231 31427 25342 12885 573 -5040
5316 -5040 23287 28515 6962 -8306 -9150 30089 50770 31784 8998 -695 4719 3113 36681
5303 36681 49871 27764 22813 13497 5487 8478 9267 -354 -4742 22559 5301 -7870 7322
5290 7322 9699 19881 34588 23214 17356 31148 27512 14783 12808 29700 45761 46535 26555
5277 26555 10965 6576 -24360 -32078 -14730 -2925 -20575 -19424 3382 -9259 -30908 -21725 9772
5264 9772 579 4176 20594 3974 -741 -5124 -23433 -5996 14958 22287 13981 22298 37129
5251 37129 32034 7280 -30894 -38603 7649 54134 29948 -6400 -17326 -11627 -1998 -4045 19082
5238 19082 45322 42685 13569 3555 11758 -22958 -36415 -10076 7656 32518 8308 -3441
5226 -3441 3049 5954 -8827 1802 -8629 -6864 1233 8673 -5901 -8242 48858 60292 38892
5213 38892 19801 -15953 -26340 -22632 -22873 -34226 -16262 17391 25898 20281 21561 22055 16992 36800
5199 36800 9683 -2153 12088 13683 14746 9838 1886 23496 53269 30628 22866 12956 3239
5186 3239 12890 5085 -19942 -16352 2559 -5506 2477 10357 -305 25545 8659 5070 -13578
5173 -13578 -16486 8083 8104 -9621 -10885 -15354 -21519 -1288 19817 61 -26187 -33957 -28519 -27159
5159 -27159 -14317 -12922 6113 -2416 -7920 502 24161 19904 -17704 -61915 -53198 -27252 -30566
5146 -30566 -53574 -53580 -13843 27664 30564 4354 12289 17349 3375 -34247 -56710 -38822 -27945
5133 -27945 -5850 24481 41094 29298 30703 55913 36161 13305 5187 15589 -8190 -23333
5121 -23333 -36878 -46328 -21487 -6185 -21847 -7069 17727 5004 -9834 -25015 -40425 -27517
5109 -27517 -33076 -15749 -8760 412 543 -7180 -9864 4435 38791 29927 34872 7332 22026 10184
5095 10184 -24553 -39356 -19686 -11479 4150 30547 15784 -13719 -6251 -9314 -9451 -27574 -34814
5082 -34814 446 29630 17289 8115 -2159 -4908 -7621 25058 43587 31368 22435 -25528 -24635
5069 -24635 -4946 -10391 -21667 -40596 -33901 -28852 -22835 -18077 -10650 4465 12230 -18331 -18060 6209
5055 6209 35639 23003 14332 14758 3460 -6476 -24112 -41009 -20191 7054 28409 37059 24052
5042 24052 14683 10016 12995 18983 27006 5572 -11556 5342 -5287 -12753 4784 -20686 -50026
5029 -50026 -21620 -5618 39133 45882 48064 38072 13804 -13963 -7694 17090 33069 24379 17544
5016 17544 -8665 7162 6736 10451 24743 37387 24756 -2586 6725 21860 -3173 -30829 -10309
5003 -10309 -581 -9469 7511 16945 38145 66320 65895 46406 42693 47794 37676 25773 7755
4990 7755 -2650 -20753 -29289 -62636 -45005 -2288 -24292 -34097 -35697 -1878 20459 7151 -20694
4977 -20694 -32561 -7551 12680 -19816 -34097 -8964 -2030 -8006 -4053 -2251 -7638 15776 36302
4964 36302 57244 42223 17477 12620 19752 36717 24288 -1456 12259 6595 5647 3424 142
4951 142 32001 36255 26109 28824 14504 54052 49309 13889 29962 63246 64314 67611 60952
4938 60952 46179 1163 -18888 -31194 -15384 -2584 -2244 9996 10012 33012 31805 25415 31593
4925 31593 37955 23017 8965 -11064 2652 -25440 -25082 -2971 24695 26329 33394 18019 19084
4912 19084 17557 5602 -8363 3002 25811 30754 4998 9218 23712 53494 41618 15446
4900 15446 -616 23819 21617 2295 1808 19025 29306 26845 8194 -270 13189 10696 22902
4887 22902 16253 4067 -17983 -31897 -28953 -31151 -25244 -16774 -15648 34969 45525 41657 55488
4874 55488 27744 15493 21241 11350 -2689 -26589 -27812 -14949 -24588 -28412 -15885 -11232 11127
4861 11127 11097 8850 495 11770 13255 22725 24563 24434 14254 -4773 5571 -4681 -34630 -14969
4847 -14969 -7942 -8865 736 -11922 -8412 4296 -4722 -8394 -14844 106 -21820 -22240 -8617 -10267
4833 -10267 -1766 7268 -12564 -36641 -12117 21560 34630 42998 23326 -6642 -11443 -13652 -47818
4820 -47818 -25624 4920 26008 12306 -20953 -30228 5848 -242 2554 205 3265 16093 26458
4807 26458 35855 13105 -20856 -28832 -3035 -14256 3481 -797 -1754 10335 -7928 -30197 -15056
4794 -15056 -27560 -6830 -10231 5170 -145 13075 10778 13474 22661 23947 1483 -1036 43912
4781 43912 51723 47477 9159 38420 63911 47466 20967 -2400 19888 18450 -5514 7257
4769 7257 18242 38899 13770 -8683 -9818 4220 29411 48789 61758 54306 49460 41723 16681
4756 16681 2557 6717 21105 39581 19669 -20736 -29154 2363 14461 14022 -14563 -19754 -21613
4743 -21613 -11475 38513 52312 32574 3710 2119 12905 -15351 -17199 4363 2369 -321 -1583
4730 -1583 12218 9674 16563 30278 25816 45827 56232 45287 31665 19893 15911 1752 10600
4717 10600 -3991 -34856 -22754 -4247 -8085 -20083 2859 30942 37392 28907 10041 3061 3788
4704 3788 8193 -4480 -21348 -26866 1540 50495 44640 14484 -7749 1866 4558 4470 37519 59621
4690 59621 53583 46636 45369 19334 -27297 -50658 -57477 -71586 -72837 -48804 -41238 -19299 12602
4677 12602 -5059 4752 8853 3317 620 1182 -12213 -11834 -2653 27991 46279 32933 17193 15602
4663 15602 26499 25287 19628 11509 -3007 -14312 18497 12189 35662 55866 27037 -4917 -14895
4650 -14895 -6605 4355 -6590 6092 3933 -10874 14658 18869 17788 10219 -10837 -5747 -3238
4637 -3238 6172 7815 -8402 4091 -554 -12576 -10417 -14717 3212 844 -12903 -24668 -3875
4624 -3875 26685 35822 11114 -3789 11689 37127 52581 55287 32413 19321 1134 -7356 -2206
4611 -2206 -20736 -39383 -56123 -53829 -35193 -3615 -5665 116 -12320 -3671 16245 53835 57462
4598 57462 52763 67019 52851 29607 52459 59673 55239 41359 29391 -3865 -28967 -17235
4586 -17235 17161 27941 -10229 -12449 -3049 3700 34944 32243 25784 5349 -3893 -4615 -9250 6606
4572 6606 9037 11551 2329 -8403 -19573 -30182 -43052 -41744 -28805 -18745 -21390 -33519 -36951
4559 -36951 -31749 -27969 -13843 -18324 6475 10022 -5400 6998 17344 6287 3470 45150 55774
4546 55774 41179 33038 33681 14561 7643 18720 4179 -10369 1539 9112 12117 965 -30363
4533 -30363 -38425 -12416 34706 29980 27464 28117 -47 -16854 -21616 -11800 3186 24147 54714
4520 54714 73791 57324 60821 66976 47688 42345 31320 18199 27521 44135 42300 34004 20223
4507 20223 -18687 -35734 -7355 -11621 -4182 -5579 -23429 -24037 -21627 -25784 -18539 16638 45720
4494 45720 28306 40513 51212 48866 47104 38939 17950 -2685 -18240 4931 28621 27688 15439
4481 15439 8542 15265 -421 -4168 639 8549 22008 27338 65471 74890 66870 49669 41718 43745
4467 43745 55020 65493 55372 35834 33386 43059 26241 20864 44266 48489 18995 27746 42910
4454 42910 32469 27143 25770 1473 11168 -33 -16491 15283 17744 30862 14240 -964 9526
4441 9526 9566 27559 21335 12117 1532 -2223 17662 37119 17897 10390 8368 9839 20387 6102
4427 6102 -16139 -12196 -7686 -8870 -39116 -41849 -21543 -13126 -8352 -18121 -26546 -17416 -6410 27028
4413 27028 26870 30266 17620 1252 -765 2914 25541 22249 -9265 -14095 -20752 -28401 -12656 -24522
4399 -24522 -28364 -33052 -42604 -29778 922 28641 27928 44628 70549 53556 59679 80907 62479
4386 62479 51645 38145 15564 810 13673 34243 46679 39823 25965 4385 1063 14191
4374 14191 36037 52804 13816 12196 28561 -2387 -16304 -13864 -10653 -16138 -41673 -34961 -21110
4361 -21110 20555 40689 28641 34266 29238 9824 27119 14330 19660 8026 -11618 6861
4349 6861 17664 -10574 -41066 -76364 -78714 -51111 13093 29219 7703 9062 7006 -6712 14109
4336 14109 38137 36305 35005 36877 39888 38615 51006 56366 39911 43558 54813 17252 12243
4323 12243 31315 59870 43663 43840 33232 17719 11173 -12970 -28534 -24270 4478 -12275 -41209
4310 -41209 -47308 -7314 39104 37307 18910 7715 -2830 -26395 -38540 -26162 -4304 -788
4298 -788 3182 24643 27431 15233 -7940 -20823 -4879 -5881 7653 6068 7508 45507 85149
4285 85149 86423 71851 64140 58435 55411 34166 -9886 8176 18943 24587 49226 38024 11639
4272 11639 3511 25958 29677 19087 24364 20747 1915 -27589 -13560 27647 63877 24917 7998
4259 7998 10721 -1435 6090 18229 22400 9002 8911 -9002 -31849 6129 9879 6185 -1045 -20963
4245 -20963 -18329 19000 24356 27383 40929 51499 49006 24816 44973 51158 26367 -267 -24466
4232 -24466 -20026 6164 16992 10922 -16342 -16508 11119 11203 17282 6371 114 16903 14594 7284
4218 7284 24692 31249 -2619 -13642 12060 22733 28473 21916 9941 12113 33482 40527 30190
4205 30190 42941 74171 60008 38131 20286 10775 -5704 11635 10124 -7095 6552 1101
4193 1101 -17391 -35792 2830 42659 41038 42305 30763 8156 29304 47482 47189 54630 49972
4180 49972 35351 39836 19458 13578 -824 -9777 -6535 14524 8227 22828 45187 15597 19074
4167 19074 46815 34144 32921 13458 -8718 -33021 -15866 -14736 -28797 -20667 -26589 -32082 -35971
4154 -35971 -31427 -30950 7194 4960 21167 47499 34085 3788 12811 12873 -7375 -15393 -9196 -2702
4140 -2702 -24544 -20469 14479 31276 16047 4197 8525 29429 17191 1503 684 -5378 -9718
4127 -9718 -1410 14311 -4357 -4989 25229 16792 -3884 4639 3498 -11887 -21456 -26867 -14241 -1375
4113 -1375 -9859 -19128 22992 32660 18573 19028 19327 23625 17364 17757 15301 5833 22465 32069 25321
4098 25321 19429 11692 24364 36414 77995 74367 33174 6112 -6187 29776 62057 46818
4086 46818 32173 25376 -5958 -7986 12965 3451 -22059 1242 4082 12473 11281 -15899 -10653
4073 -10653 30962 40260 41825 4001 -34118 -40971 -13587 8237 31802 38210 30409 48756 49841
4060 49841 53344 70458 45665 41769 43318 38412 28993 28685 15302 20617 40575 14302 -12796
4047 -12796 -42738 -43921 -31897 -30810 -44337 -35138 -24136 6488 33760 60018 87785 63432
4035 63432 33106 32054 27812 19212 33083 44520 26832 37065 46598 14916 17455 -18204 -28015
4022 -28015 -13680 -6748 21742 38424 37334 25070 25003 6286 11716 16784 14001 -1687 -2187 16683
4008 16683 39535 36029 26000 37402 33873 20176 45751 48188 45655 24384 26571 32116 39723
3995 39723 25535 28045 48075 48756 42112 38904 33851 38792 37333 44643 57110 59804 13630 -579
3981 -579 23073 41407 22373 14609 49356 43580 36884 15140 9330 2930 10788 33000 29875 26454
3967 26454 18519 332 -18920 -35762 -40806 -1098 35289 23321 1373 -21142 -8571 18375
3955 18375 44234 45565 47656 13399 20713 21118 7396 19335 52977 51802 51873 50029 35917 34940
3941 34940 41085 43174 27301 13526 14906 31008 44004 66744 71980 8454 9723 33392 35190
3928 35190 4177 -21324 -16595 -9962 -8400 -5939 -13730 -19456 -6608 3076 14759 23628 9197
3915 9197 -15566 -6755 -17679 -25965 -43817 -51525 -38957 -18973 -7083 -1275 1267 4742 2522
3902 2522 -6461 -6570 39090 50624 22205 16482 3195 -7365 -21941 -21215 -2660 16094 26600
3889 26600 44716 56716 34972 41425 27901 13293 -1116 3880 32727 19107 28929 21407 -19478
3876 -19478 -12887 10035 27938 45775 23662 22779 19457 9735 16235 24295 8561 2627 -24474
3863 -24474 -14328 -33 -3902 -10424 -19499 -38506 -35945 -17365 -34775 -17686 -29207 -13199 4039
3850 4039 6622 27017 51057 51311 22538 -16562 -17074 -33757 -25003 27856 41156 31145 33885
3837 33885 48136 46512 19113 21471 18994 29347 31011 7388 -5308 10391 -17192 -48382 -47824
3824 -47824 -16627 1156 -5686 -2951 30465 16083 -19369 -24896 -29383 -22892 28932 36450 811
3811 811 -9885 -33657 -57293 -55676 -23491 -11174 -623 8072 22038 52291 43869 10808 -18782
3798 -18782 -33207 -25300 12976 18417 31886 26975 33704 37261 12616 -2572 1517 -2864 -21448
3785 -21448 -16954 -16493 -15001 -16911 2429 404 15792 34010 49222 45303 43858 53505 6622 -3937
3771 -3937 12743 19041 10613 18063 14621 -17458 -49446 -20343 13620 22228 13868 19317 8180
3758 8180 -2993 18 -4443 -12086 -24419 -20317 -10081 -3594 822 30888 49413 43869 27531
3745 27531 -4265 -9225 -2918 4265 -1925 14880 42161 36647 15404 25828 15684 42440 37276
3732 37276 28133 44234 65929 48560 14500 3117 27233 22679 1030 -21173 -22544 -18760 -28717
3719 -28717 -23032 -24935 -2402 -425 -7591 161 771 6416 18568 16263 27238 37341 14053 20338
3705 20338 22976 17565 -5767 -561 -10596 -10923 -13028 -4116 -4025 -27427 1832 15420 5578 -6725
3691 -6725 -90 15812 39680 42801 20769 -6997 10608 6999 4991 3310 15787 32890 6601
3678 6601 -16142 -58092 -43288 -21640 -1488 22276 27849 11146 -5564 -7317 -11198 -11080 -1807
3665 -1807 -32729 -51696 -32349 6261 21729 -829 -7681 -8125 -9414 962 21406 13830 -19158
3652 -19158 -38785 -31418 -6256 928 31711 34274 58092 58766 46202 20141 33806 44955 44709
3639 44709 5724 -25801 -13759 11549 -373 -249 9025 19736 8969 6089 -25766 -54964 -21058
3626 -21058 17308 39054 46089 5127 116 35067 28666 -5836 18876 19945 23074 43876 46639
3613 46639 21124 5767 11715 21741 14420 -6693 -31957 -22901 -11970 4172 2415 4807 34665
3600 34665 39826 41994 26062 21770 -914 -29022 -8227 10199 18658 33401 33390 10947 -12620
3587 -12620 -6110 -27490 -51164 -39964 -9194 -605 2689 -15067 -62432 -42571 -8571 -14919 -8196
3574 -8196 15817 8692 13614 -8107 -16361 4084 24254 10410 -14588 -4192 -8341 10581 24207
3561 24207 35164 42561 -20029 -20235 16038 31951 11701 22546 17593 -16240 -31711 -30070 -37789
3548 -37789 -59882 -39058 -17003 -9620 -22719 -6022 -10767 6199 33826 26498 7198 2051 -1518
3535 -1518 -10023 12004 12685 10491 48906 61089 37169 4622 -1554 55038 53784 23938 17781
3522 17781 38841 52623 28107 -5227 -21001 -18806 10025 21323 24224 26347 8334 -4713
3510 -4713 -2437 17226 12456 30768 21047 6940 16829 27059 -4392 -17712 -8266 -741 3865
3497 3865 11547 12864 36321 38143 25827 46577 28671 -4610 -52743 -56811 -25922 -23110 -22765
3484 -22765 -15605 3655 31860 22341 -20855 -38254 -6337 -10017 6310 27170 11333 -9417
3472 -9417 21018 14585 -1396 25028 17190 12713 11901 -189 14992 66433 38540 15493 21822
3459 21822 17792 25686 32735 20955 -24060 -36380 -22666 13245 12578 -9283 -28654 11014 43502
3446 43502 17654 22993 61823 24327 24813 42105 23977 -1925 -27533 -39434 -22175 -27473 3367
3433 3367 23483 28714 23533 20885 20751 -10943 -5633 -28779 -28664 6636 3511 -22957 -52758 -61139
3419 -61139 -46475 -18920 1909 27843 19870 -5403 18200 -6100 -4107 -3022 -3186 3257 3442
3406 3442 -1029 -46808 -53147 -40775 2600 27605 13283 -14516 13736 15906 40844 41140 29884
3393 29884 9214 24380 29367 32355 34584 24220 23779 18729 -2701 4411 19205 1670 -17639
3380 -17639 -14293 24213 25423 21070 12040 3193 -6359 21373 52553 41732 77049 88918 40077
3367 40077 15489 14598 22373 34990 49401 66034 67983 53472 23747 36884 33898 55370 60107
3354 60107 21867 29217 28596 10448 9763 6942 -13073 14101 17646 -11133 -18604 -17980 2751 34920
3340 34920 32821 25147 -1981 9434 -6767 -15822 12998 21582 4869 28846 32793 -6538 -10326
3327 -10326 26401 18367 10707 -6474 -15887 -12111 3720 22343 10668 8561 4016 -15231 -29831
3314 -29831 -24128 -25203 -10241 -7841 -21544 -19160 -11553 -17910 8768 -3687 -15150 -10176 -20424
3301 -20424 -23499 15309 12276 5426 11017 -5719 -13212 -24465 -25992 -18497 -5141 -9938 26669
3288 26669 26829 1150 -8046 12228 17178 16472 21667 15663 1823 -23298 -52495 -53153 -29866 27752
3274 27752 38441 5139 -5456 17288 12853 9183 -3231 5682 20823 -3850 4094 8606 17986
3261 17986 17255 10677 -10326 -45818 -42208 -11916 17994 35661 46939 47953 51529 50559 64165
3248 64165 58622 33838 15151 35083 34923 81 -6365 25491 48346 38753 33620 34109 32223 4834
3234 4834 29092 17101 -14548 -11941 19391 14512 8025 25654 21792 -7090 13710 9220 -10042
3221 -10042 -4416 8634 14243 27493 30649 25146 25809 30493 53384 64634 27912 19255 27635 25997
3207 25997 22079 8224 7630 7553 -8929 -29444 -36567 -9255 -5749 1799 19360 35929 46019 39680
3193 39680 44938 34377 25543 34639 9499 -12655 -3098 148 -132 11701 4551 38900 70636
3180 70636 71593 71271 59644 40152 43235 43396 42259 35798 32728 23262 33915 33116 25544 22636 8335
3165 8335 10414 12242 46059 73734 40276 12613 -9788 -35864 -53080 -10304 12199 36433
3153 36433 50180 30972 9468 26524 18841 4920 1600 2760 -23484 -12968 7775 2145 18839
3140 18839 6207 -12920 10296 14864 1530 18226 17985 8269 15649 24205 24146 6089 -20185 -5234
3126 -5234 14249 10299 45430 41409 31847 30878 25996 45404 51821 19951 21049 27272 -10107 -27061
3112 -27061 -21776 -25373 -54343 -50968 -48315 -31915 -22194 -31753 -21098 -15259 2273 14480 11557
3099 11557 -7837 10763 38037 36509 43545 51128 62425 39921 35857 3446 -9661 9363 7833
3086 7833 -16313 5160 44753 48468 30206 15456 2793 -9288 23653 54838 23244 -3739
3074 -3739 4795 17550 25142 43046 44444 12070 3931 -30442 -44536 -28878 -9391 2344 26114
3061 26114 34411 15685 15613 30563 43830 21886 -4507 -23487 -27054 -22756 -5871 -4949 5090
3048 5090 -7686 -23262 -19734 -26478 -49154 -33395 -2562 14508 6262 14769 20874 33171 47067
3035 47067 53627 50918 19582 15572 8760 -22696 -181 -7905 -7338 -5794 -9216 -13977 -15051 14375
3021 14375 22946 24595 4923 -10876 12072 12391 -18017 -29970 -33116 -20096 -8025 -523 -6236
3008 -6236 10857 2289 -13833 -28397 -33989 -10540 -4861 -76 -11062 -32149 -33261 -31257 -4751
2995 -4751 4974 4714 -1634 -6586 -5529 8 12191 7221 6548 -12730 -5699 23837 32488 21019
2981 21019 -14430 -22318 -31403 -46005 -40262 -16487 -3538 7805 28894 33239 1820 -19541 -9995
2968 -9995 8523 28652 32999 22056 14537 -3137 24447 -1946 -16024 10547 28712 19039 20556
2955 20556 10030 -1978 -4471 -11492 8305 18266 -5208 208 -527 -45279 -43328 -31990 -27299
2942 -27299 20844 36836 53629 46524 28364 1647 -8082 -8418 9404 6433 7102 204 3926 14609
2928 14609 6937 6294 13258 -37 13163 2001 -26674 -28161 -35171 -27324 -22958 -19093 -4932 4557
2914 4557 3017 -2545 -5595 577 -830 -4267 756 23382 -4190 -43466 -53148 -22857 6766 11354
2900 11354 -4124 -3643 15112 24668 33973 9121 -5750 3102 15720 35835 31785 8368 -1879
2887 -1879 -12783 5571 48284 38998 26287 10290 -3810 3445 15030 23294 13779 -7514 -26093
2874 -26093 13313 29574 3944 -6796 14282 29153 43994 44024 28653 17803 -995 -4439 16020
2861 16020 26800 -8635 -39727 -35538 -40350 -35771 -29760 -16091 -9251 17606 20470 12471 1235
2848 1235 9107 -407 -20167 -30534 252 11776 957 5831 23910 23287 14525 33029 21258
2835 21258 -22776 -39980 -29509 -9537 3222 -3322 -18399 -9389 -17092 -25516 -27391 -1223 -3384
2822 -3384 -14882 -10242 9349 -6182 -31236 -7362 22639 56610 59404 56288 64464 42413 19813
2809 19813 16810 -2369 -23336 -20550 -13958 841 10722 -4183 3147 9050 -190 24449 14298
2796 14298 8133 11745 -5766 -6795 8213 18088 46161 74102 59116 13728 -10666 23207 31584
2783 31584 20965 32767 61412 62601 34152 133 -12959 22245 35100 12445 -11235 -3159
2771 -3159 -1973 -3390 -2931 2857 4154 15872 -1575 -224 12350 10215 1604 -19320 -33357 -11176
2757 -11176 2989 18856 20750 -3164 17048 6245 -10531 -785 3638 23988 44038 41262 20314
2744 20314 7651 4795 10075 14218 10995 11852 -22251 -25451 -10988 -12477 -13435 20660 17861 1638
2730 1638 7948 -23003 -27011 -18670 -631 792 12009 -4615 -12389 -12762 -2727 22716 11993
2717 11993 -6042 -2872 -13528 -6172 5662 12974 32628 21234 -9468 -5694 -3958 -10389 -16374
2704 -16374 -15044 5511 26238 30116 19937 36985 34075 32968 19545 21239 32921 24876 -8084
2691 -8084 -27264 -10324 10314 33665 37235 34355 43600 21609 20783 15899 17652 3194 -20119
2678 -20119 -26919 -23334 -4792 -11066 -8779 3153 -9911 -15257 23597 24985 22735 15978 27961
2665 27961 35256 5388 2835 126 7676 15919 25441 23075 37235 24807 -10250 -25966 -13022
2652 -13022 -23141 -30454 -14952 -1668 5067 -2353 -8404 -6273 6640 22005 23316 31961 16681
2639 16681 18518 32868 23025 8978 -7991 -24557 -50046 -36495 -4923 5327 -31467 -33179
2627 -33179 -20151 -26524 -40169 -21429 2923 166 -14126 8093 40502 42738 494 -20020
2615 -20020 -15977 -25110 -18231 -8482 -8840 -3204 2656 20465 10106 -15250 3127 10585 3765 7328
2601 7328 37222 20080 21587 20424 3467 -25554 15764 40801 58928 49375 24684 31771 28078
2588 28078 8467 8530 16706 9676 16216 -10621 -29027 -35743 -45057 -24663 12318 -6471 -21796
2575 -21796 3227 12666 4265 13821 -599 17387 14388 -8181 -18486 10710 32179 39603 50367
2562 50367 51340 42122 8156 -11684 846 -19072 299 5719 34 607 9111 14928 16348 26399
2548 26399 12783 26685 19708 3117 14164 5989 5947 -843 -249 1650 12321 34333 53921 35687
2534 35687 31187 47367 51517 70705 63068 31301 27787 -743 -17897 -14995 -6365 25314 26420
2521 26420 -3938 -7100 -32575 -27416 -15773 -12005 -869 26560 24113 20986 -318 3813 58110
2508 58110 67377 54932 41905 18228 -19152 -40852 -47763 -42146 -28810 -8387 -15298 -10569 -19212
2495 -19212 5081 9959 212 12198 -6552 -14938 -3331 5736 4993 -5647 1938 16969 23367
2482 23367 27135 11386 8791 4951 6309 10416 -14288 9214 32778 12394 3621 3649 -2049 -29966
2468 -29966 -23937 4525 13138 25599 28805 42000 57976 22044 5738 10304 22081 21316 -1736
2455 -1736 -13884 -13984 -10700 21054 17967 33892 26311 36655 20820 18141 14814 26059 36327
2442 36327 54807 69994 50501 49093 44656 52690 44839 31710 21001 1631 -1826 -21654 -7022
2429 -7022 13850 13087 29879 35669 22256 -19291 -28430 -18631 2546 26348 16564 -184 -41998
2416 -41998 -12751 15021 10268 11411 10758 13518 78 -1676 -12324 21398 41366 18739 11928
2403 11928 20711 5699 12289 33009 32176 39910 44638 47020 58844 54877 11648 -37729 -19264
2390 -19264 19360 50059 56850 22152 -10571 -448 -4914 -13250 -4664 -3479 24028 10204 -9454
2377 -9454 -21471 -39030 -43895 -18544 -185 -7102 -866 7784 2116 -6990 -9985 27485 56104
2364 56104 56671 51458 35557 12140 35896 48783 33349 17394 4403 -29749 -32748 -7500 20949
2351 20949 23397 1440 -24858 -29422 14017 20217 7330 11473 8567 8000 -7241 -4430 14825
2338 14825 3557 9228 30697 7504 5671 -5137 -10738 -3470 8497 -4217 215 -1457 -8845
2325 -8845 3336 -2159 14147 44250 41359 15744 -20854 -17031 5100 18371 16478 1551 21927
2312 21927 24142 -72 -16305 -44465 -55446 -34911 3919 7469 -6174 -31200 -23538 -4516
2300 -4516 25218 31739 32009 18852 17466 18323 16947 25444 23313 16333 -815 -20267 -54221 -36833
2286 -36833 -8853 -17215 -11473 -2985 33021 31925 27281 -5105 -11367 2079 -28433 -41416 -66476
2273 -66476 -34641 -18191 -37533 -23117 -25876 -39800 -19160 -11461 -27230 -21762 -22910 -43968 -44349
2260 -44349 -14483 -224 -45257 -36481 -6795 39064 34543 29125 23918 31396 29482 2234 -4767
2247 -4767 19626 36732 41446 15442 9181 29686 19165 -4127 -11841 -6139 -17845 -2112 -2586
2234 -2586 -17685 -37996 -41256 -25285 -26724 -50203 -31302 -2197 -501 -1355 -10868 -17621 8427
2221 8427 -17124 -29797 -48206 -46404 -7456 5091 2684 5805 8383 1954 1433 -9419 3321
2208 3321 3432 -8680 -8115 -37498 -34472 -12783 26059 26831 4685 8331 24095 -3848 -34429 -24137
2194 -24137 -15229 -38465 -30766 6636 45009 24819 22069 28648 3235 -13442 10420 23870 39808
2181 39808 33382 18477 19894 29199 29117 21158 25803 33483 29888 23976 32922 9866 -13675 -7210
2167 -7210 23047 24549 25517 7754 -22109 -41002 -17877 -3344 -14819 -20715 -27814 -29677 -40584
2154 -40584 -36188 -28589 -22026 -19723 -28058 -13066 7099 -7904 4243 955 2511 -2369 -903 5179
2140 5179 5732 31217 954 -23199 7358 5443 1364 6010 2267 6054 17114 39574 33031 14791
2126 14791 17814 20096 3137 -7187 -1404 11058 14116 11364 -8657 -43407 -21930 -7047 3104
2113 3104 14380 30793 22075 13629 11642 16313 -13455 -45560 -29947 3565 16050 14470 34041
2100 34041 14947 -24654 -22561 -9329 -9046 -983 -17360 -18542 -12033 -12674 -33727 -31494 -15337 15202
2086 15202 47346 65039 73551 58904 33277 33940 24135 -4421 576 45107 29111 4253 1296
2073 1296 9940 -20039 -48278 -41693 -17022 -4177 19670 22783 13289 9443 11402 -2670 -4627
2060 -4627 -22200 -26501 10167 37464 26554 24491 -10242 -37371 -30298 -35920 -56344 -63705 -35426
2047 -35426 -18980 -19238 -14172 -6881 -31627 -43532 -26809 -7248 -607 -2432 2253 -3391 -14539
2034 -14539 -11801 5881 9785 -13499 -21621 -25109 -3145 34276 63155 76392 57610 48743 32670
2021 32670 18847 10508 7639 -8376 6134 13924 -18719 -36558 -48326 -52084 -48844 -28943 -24538
2008 -24538 -19031 4158 -3678 -7417 -5958 14189 23880 7859 7881 1880 -20796 -50834 -44894 -27613
1994 -27613 -29334 -38564 -3371 2056 13691 13179 -2487 -30872 -35315 -18960 13437 5677 -2493
1981 -2493 17259 34968 40544 49720 32992 11444 41461 53128 68806 28940 12368 21117 25751
1968 25751 1748 8922 53679 71048 63093 58253 44657 44988 27784 15392 17039 32349 20424
1955 20424 7619 -5911 -13883 -27017 -23087 -29279 -33957 -40462 -17355 -12350 -16512 -8557 -34725
1942 -34725 -41446 -37848 -22045 -293 8470 2031 -7472 7466 25757 14672 -19582 -17880 -6421
1929 -6421 -14947 -46298 -18262 96 23883 18945 14319 20917 21495 14498 12251 18367 9182 14870
1915 14870 23460 41789 29142 22161 9422 36640 34394 2451 -18899 -20765 -43229 -36329 -25308
1902 -25308 -23009 -34609 -22529 -8491 -2652 -6011 -29885 -43139 -59066 -61548 -36207 -4880 -23853
$$ [...]
##END NTUPLES=NMR SPECTRUM
##END=
