##TITLE=Analysis number 313517
Compound Code cc 17405
Project Code adrs
Chemist Name stores
##JCAMPDX= 6.0         $$ Bruker NMR JCAMP-DX V2.0
##DATA TYPE= NMR SPECTRUM
##DATA CLASS= NTUPLES
##ORIGIN= Bruker BioSpin GmbH
##OWNER= NMR
$$ XWIN-NMR		Version 3.5
$$ Mon Sep 12 16:14:03 2005 GMT Daylight Time (UT+1h)  MAYBRIDGE\NMR@NMR_250MHZ
##.OBSERVE FREQUENCY= 250.131544655141
##.OBSERVE NUCLEUS= ^1H
##.ACQUISITION MODE= SIMULTANEOUS (DQD)
##.ACQUISITION SCHEME= undefined
##.AVERAGES= 16
##.DIGITISER RES= 18
##SPECTROMETER/DATA SYSTEM= dpx250
##.PULSE SEQUENCE= zg30
##.SOLVENT NAME= CDCl3
##.SHIFT REFERENCE= (INTERNAL, CDCl3, 0, 16.522)
##AUDIT TRAIL= $$ (NUMBER, WHEN, WHO, WHERE, WHAT)
$$ ##TITLE= Audit trail, XWIN-NMR		Version 3.5
$$ ##JCAMPDX= 5.01
$$ ##ORIGIN= Bruker BioSpin GmbH
$$ ##OWNER= NMR
$$ C:\u/data/dgb/nmr/ADRS/9310/pdata/1/auditp.txt
$$ ##AUDIT TRAIL=  $$ (NUMBER, WHEN, WHO, WHERE, WHAT)
(   1,<2005-09-12 16:13:43.78 +100>,<MAYBRIDGE\NMR>,<NMR_250MHZ>,
      <created by zg, POWCHK disabled, PULCHK disabled
       configuration hash MD5:
       62 19 C7 07 E1 42 D1 B7 37 6C 3D D0 77 39 F9 E6
       data hash MD5: 64K
       82 1F AF 87 A4 7A 2B B1 A3 3B 95 34 B7 27 3D 21>)
(   2,<2005-09-12 16:13:54.85 +100>,<MAYBRIDGE\NMR>,<NMR_250MHZ>,
      <Start of raw data processing
       ef LB = 0.3 FT_mod = 6 PKNL = 1 SI = 32K 
       data hash MD5: 32K
       7C 88 CC D6 F9 42 D5 F2 42 E9 C9 42 8A 12 57 6E>)
(   3,<2005-09-12 16:13:56.56 +100>,<MAYBRIDGE\NMR>,<NMR_250MHZ>,
      <apk 
       data hash MD5: 32K
       11 9D 00 45 62 5F 28 03 D1 DA AD 9D 80 02 C2 FA>)
(   4,<2005-09-12 16:13:57.31 +100>,<MAYBRIDGE\NMR>,<NMR_250MHZ>,
      <abs ABSG = 5 
       data hash MD5: 32K
       CB 25 DA 6A DE 23 9B F7 91 1D 1A C5 33 FE 81 F6>)
$$ ##END=
$$ 
$$ hash MD5
$$ F5 20 8D EF 71 E3 CA AF 6C 08 FE 68 38 25 B3 6A
##$RELAX= 
##$RELAX= 
##$RELAX= 
##$RELAX= 
##$RELAX= 
##$RELAX= 
##$RELAX= 
$$ Bruker specific parameters
$$ --------------------------
##$DU= <C:\u>
##$EXPNO= 9310
##$NAME= <ADRS>
##$PROCNO= 1
##$TYPE= <nmr>
##$USER= <dgb>
##$AMP= (0..31)
100 100 100 100 100 100 100 100 100 100 100 100 100 100 100 100 100 100 
100 100 100 100 100 100 100 100 100 100 100 100 100 100 
##$AQSEQ= 0
##$AQ_mod= 3
##$AUNM= <au_zg>
##$AUTOPOS= <47 >
##$BF1= 250.13
##$BF2= 250.13
##$BF3= 250.13
##$BF4= 250.13
##$BF5= 500.13
##$BF6= 500.13
##$BF7= 500.13
##$BF8= 500.13
##$BYTORDA= 1
##$CFDGTYP= 0
##$CFRGTYP= 5
##$CHEMSTR= <none>
##$CNST= (0..31)
1 1 145 1 1 1 1 1 1 1 1 1 1 1 1 1 1 1 1 1 1 1 1 1 1 1 1 1 1 1 1 1 
##$CPDPRG= <>
##$CPDPRG1= <>
##$CPDPRG2= <>
##$CPDPRG3= <>
##$CPDPRG4= <mlev>
##$CPDPRG5= <mlev>
##$CPDPRG6= <mlev>
##$CPDPRG7= <mlev>
##$CPDPRG8= <mlev>
##$CPDPRGB= <>
##$CPDPRGT= <>
##$D= (0..31)
0 1 0 0 0 0 0 0 0 0.06 0 0 0 0 0 0 0.0002 0 0 0 0 0 0 0 0 0 0 0 0 0 0 
0 
##$DATE= 1126538022
##$DBL= (0..7)
120 120 120 120 120 120 120 120 
##$DBP= (0..7)
150 150 150 150 150 150 150 150 
##$DBP07= 0
##$DBPNAM0= <>
##$DBPNAM1= <>
##$DBPNAM2= <>
$$ [...]
##$SUBNAM7= <"">
##$SUBNAM8= <"">
##$SUBNAM9= <"">
##$SW= 20.6930455092707
##$SWIBOX= (0..15)
0 0 3 0 0 0 0 0 0 0 0 0 0 0 0 0 
##$SW_h= 5175.983436853
##$TD= 65536
##$TD0= 1
##$TE= 295.16
##$TE2= 300
##$TE3= 300
##$TEG= 300
##$TL= (0..7)
0 120 120 120 120 120 120 120 
##$TP= (0..7)
150 150 150 150 150 150 150 150 
##$TP07= 0
##$TPNAME0= <>
##$TPNAME1= <>
##$TPNAME2= <>
##$TPNAME3= <>
##$TPNAME4= <>
##$TPNAME5= <>
##$TPNAME6= <>
##$TPNAME7= <>
##$TPOAL= (0..7)
0.5 0.5 0.5 0.5 0.5 0.5 0.5 0.5 
##$TPOFFS= (0..7)
0 0 0 0 0 0 0 0 
##$TUNHIN= 0
##$TUNHOUT= 0
##$TUNXOUT= 0
##$USERA1= <user>
##$USERA2= <user>
##$USERA3= <user>
##$USERA4= <user>
##$USERA5= <user>
##$V9= 5
##$VALIST= <valist>
##$VCLIST= <CCCCCCCCCCCCCCC>
##$VD= 0
##$VDLIST= <DDDDDDDDDDDDDDD>
##$VPLIST= <PPPPPPPPPPPPPPP>
##$VTLIST= <TTTTTTTTTTTTTTT>
##$WBST= 1024
##$WBSW= 4
##$XGAIN= (0..3)
0 0 0 0 
##$XL= 0
##$YL= 0
##$YMAX_a= 460690
##$YMIN_a= -503992
##$ZGOPTNS= <>
##$ZL1= 120
##$ZL2= 120
##$ZL3= 120
##$ZL4= 120
##$ABSF1= 16.522
##$ABSF2= -4.171173
##$ABSG= 5
##$ABSL= 3
##$ALPHA= 0
##$AQORDER= 0
##$ASSFAC= 0
##$ASSFACI= 0
##$ASSFACX= 0
##$ASSWID= 0
##$AUNMP= <proc_1d>
##$AZFE= 0.1
##$AZFW= 0.1
##$BCFW= 0
##$BC_mod= 0
##$BYTORDP= 0
##$COROFFS= 0
##$CY= 12.5
##$DATMOD= 1
##$DC= 0
##$DFILT= <>
##$DTYPP= 0
##$F1P= 14.0000005364418
##$F2P= -0.99999901652339
##$FCOR= 0.5
##$FTSIZE= 32768
##$FT_mod= 6
##$GAMMA= 0
##$GB= 0
##$INTBC= 1
##$INTSCL= 1
##$ISEN= 128
##$LB= 0.3
##$LEV0= 0
##$LPBIN= 0
##$MAXI= 10000
##$MC2= 0
##$MEAN= 0
##$ME_mod= 0
##$MI= 0
##$NCOEF= 0
##$NC_proc= -4
##$NLEV= 6
##$NOISF1= 0
##$NOISF2= 0
##$NSP= 0
##$NTH_PI= 0
##$NZP= 0
##$OFFSET= 16.522
##$PC= 1
##$PHC0= -79.1438
##$PHC1= 3.879691
##$PH_mod= 1
##$PKNL= yes
##$PPARMOD= 0
##$PSCAL= 4
##$PSIGN= 0
##$REVERSE= no
##$SF= 250.13
##$SI= 32768
##$SIGF1= 0
##$SIGF2= 0
##$SINO= 400
##$SIOLD= 32768
##$SREGLST= <1H.CDCl3>
##$SSB= 0
##$STSI= 32768
##$STSR= 0
##$SW_p= 5175.98343685301
##$SYMM= 0
##$S_DEV= 0
##$TDeff= 65536
##$TDoff= 0
##$TI= <Analysis number 999999
Compound Code 99
Book Reference 9
Project Code 9>
##$TILT= no
##$TM1= 0
##$TM2= 0
##$TOPLEV= 0
##$USERP1= <user>
##$USERP2= <user>
##$USERP3= <user>
##$USERP4= <user>
##$USERP5= <user>
##$WDW= 1
##$XDIM= 32768
##$YMAX_p= 380491444
##$YMIN_p= -214377
$$ End of Bruker specific parameters
$$ ---------------------------------
##NTUPLES= NMR SPECTRUM
##VAR_NAME=  FREQUENCY,     SPECTRUM/REAL,   SPECTRUM/IMAG
##SYMBOL=    X,             R,               I
##VAR_TYPE=  INDEPENDENT,   DEPENDENT,       DEPENDENT
##VAR_FORM=  AFFN,          ASDF,            ASDF
##VAR_DIM=   32768,         32768,           32768
##UNITS=     HZ,            ARBITRARY UNITS, ARBITRARY UNITS
##FACTOR=    0.157963299565203, 1,           1
##FIRST=     4132.6476996994, 0,             0
##LAST=      -1043.33573715361, 0,           0
##MIN=       -1043.33573715361, -214377,     0
##MAX=       4132.6476996994, 380491444,     0
$$ Real data points
##PAGE= N=1
##DATA TABLE= (X++(R..R)), XYDATA
$$ [...]
19145A6580978j506453j042293o57500m20615j49788l298L7315J58964K66493
19136A3263803K34752L45822M44909N31855P48344J098341J510532K062369K793422
19127B3034149L597293M438276M966684M874238L880099K040883J24257j060710
19119D5895169j022986Q3017K058711M674307P785246J1029454J3905353J5905252
19111A00313523J5590399J1882367M568217n471835j4748340j9349008j8999871
19104G3785452j6029719j2407505r121266o607426m726359l402464k382861j667581
19096A7440271j092755m97165J4002M02243M69462K05413l72035j146678j791478
19087A3631280j839979j599723j337548j049315q43271o57489n37856m74751m60239
$$ plain form
19145 16580978 15074525 14032232 13374732 12954117 12804329 12801031 12838346 12997310 13263803
19136 13263803 13498555 13844377 14289286 14821141 15569485 16667826 18178358 20240727 23034149
19127 23034149 26631442 31069718 36036402 40910640 44790739 46831622 46955879 45895169
19119 45895169 44872183 44955200 47013911 51688218 59473464 70502918 84408271 100313523
19111 100313523 115903922 127786289 132354506 126882671 112134331 92785323 73785452
19104 73785452 57755733 45348228 36226962 29619536 24893177 21490713 19107852 17440271
19096 17440271 16347516 15850351 15864353 16266596 16736058 16941471 16569436 15422758 13631280
19087 13631280 11791301 10191578 8854030 7804715 6961444 6303955 5766099 5291348 4831109
19078D831109m14009l61334k86618k51899k59766j98424j67890j17574o1244p7781
19068B634570j44257j40376j75750j74189j34403j89536j11939m8792p9507m8736
19058A387085m0237K2275k8309m3700k4575J788L0885k893k0328m6309m0796j3906
19046A180980J0817J23p2943k9725m5925p2352l9575m1441K953J6884M9082M9869
19034A008747o0149n3857j6613l5058n0728k4618l5031l4262j122j4544n5344
19023F27421P819l4032n27M0730J9769k4659r836n4619m5497k7161N995J0018
19011E15421L304J1848L7881q451p4137o3815l2637m9724J7013N4403O0369O09
18999D72084k4684o269j0046L5130R1206M9390L3774O5805O9383p6892j9186M4590
$$ plain form
19078 4831109 4417100 4055766 3769148 3517249 3257483 3059059 2891169 2773595 2712351 2634570
19068 2634570 2490313 2349937 2174187 1999998 1865595 1676059 1564120 1515328 1435821 1387085
19058 1387085 1346848 1369123 1340814 1297114 1272539 1274327 1305212 1302319 1281991 1235682 1194886 1180980
19046 1180980 1191797 1191920 1118977 1089252 1043327 970975 931400 889959 892912 909796 958878 1008747
19034 1008747 948598 894741 878128 843070 792342 767724 732693 698431 697309 682765 627421
19023 627421 635240 601208 600681 641411 661180 636521 626685 572066 526569 499408 505403 515421
19011 515421 518725 530573 568454 560003 485866 422051 389414 339690 356703 411106 471475 472084
18999 472084 447400 441131 431085 466215 557421 606811 640585 706390 775773 698881 679695 724285
18987G24285j3053l5109j8353m9301m9138l0070J5566m4424o4897K5571k0284
18976D40793J840M2323J1333n3705L346m940j2795j6359J2152K7612J6485k5629
18964D42456l3815j7137j7244n3509n1303j3756N8989O0834M6253l4980n7094
18953C29694q579k4892K1506K1704k9368k8541p9310l0546P231M6203P3957N9877
18941C58936O980m9176M3288K091m7018o8120m9797J1817M22n7493L573j1609
18929A43894j3573j0818N0502J3492j6456J447q774M6798K3208j05440q6981q6834
18917d9535L7340J05700L6547k9223l1366K442K2875N4374K8237j2903J6585K5168
18905B06241K9657m5354m7105J8156m8967l1019K5083N0875k1301k1199k0655
$$ plain form
18987 724285 711232 676123 657770 608469 559331 529261 544827 500403 435506 461077 440793
18976 440793 442633 484956 496289 442584 445930 440990 428195 411836 423988 451600 468085 442456
18964 442456 408641 391504 374260 320751 269448 255692 314681 375515 421768 386788 329694
18953 329694 321115 296223 317729 339433 310065 281524 202214 171668 178899 225102 299059 358936
18941 358936 365916 316740 360028 362119 315101 246981 197184 209001 209423 151930 155503 143894
18929 143894 130321 119503 170005 183497 167041 168488 159714 206512 229720 124280 37299 -49535
18917 -49535 -12195 93505 130052 100829 69463 71905 94780 149154 177391 164488 181073 206241
18905 206241 235898 190544 143439 161595 112628 81609 106692 157567 136266 115067 94412
18894I4412M358R965o3847j1179K0272J5732j2409K1778N9242k5526j7108q017
18882H7673j8274q000l3137j6719j4288M5928K5509k1179l4866j9299k9421j5243
18870e1316O3488N7691J8237n8793m2120k4416L8321K7403L9015q942P76K3049
18858H2393j1048k059J3816j12l5873K100M0110K5992J5052j6322L433r21l8353
18845G8208j4998K0526k5230j876J7016Q230l745n9727m7464L741O570K0484M8392
18832E0127l1982K740k6258J4083N1886J5596k4149m676J0630k9833k0326K0077
18820B7915J5978j2404n3589L2460J2733N4849Q1318J2522m7881J9345J7670k5119
18808A35797n2952n0847k4112p712O169K1838k297l711K5659M7699j0663M2784
$$ plain form
18894 94412 98770 108735 44888 33709 53981 69713 57304 79082 138324 112798 95690 87673
18882 87673 69399 61399 28262 11543 -2745 43183 68692 47513 12647 -6652 -36073 -51316
18870 -51316 12172 69863 88100 29307 -12813 -37229 1092 28495 67510 58568 59344 82393
18858 82393 71345 69286 83102 82990 47117 49217 89327 115319 130371 114049 117482 116561 78208
18845 78208 63210 83736 58506 56630 73646 81876 78131 18404 -29060 -25319 -18749 1735 50127
18832 50127 18145 20885 -5373 8710 60596 76192 52043 47367 57997 28164 7838 27915
18820 27915 43893 31489 -22100 10360 23093 77942 159260 171782 123901 143246 160916 135797
18808 135797 82845 31998 7886 174 6343 28181 25884 22173 47832 95531 84868 127652
18796A27652L6963q3885o2388j6889J7688L1114K9191P7348J1680l1271J4301
18785A51504K655k4815l0232l3100m5277K9786J6058J9239L9072N967l7385k3211
18773G0261k3839n083R235N6190J16231R9704K7950O1632K5930k5358m1975p3491
18761B97387m8226o3574l0416L850o2104n2798J3666l9246N492p97K0104k2885
18749B0453k5848N018j6680N207K1011M6707J4715J7055n2546j1544K6082J9400
18737F9030L0040p3630k0621K2445j1916J8450K3234J1844l6960m416P3168J0131
18725A10799o6089m1681M206j0237K8949J316K7780J0681l5746j3317L6305n559
18713D7407J0563J4035O094K3725l8497j5497j0027l539M8297J5937m571j8892
$$ plain form
18796 127652 164615 80730 18342 1453 19141 50255 79446 156794 168474 137203 151504
18785 151504 154159 129344 99112 66012 20735 50521 66579 85818 124890 130857 93472 70261
18773 70261 46422 41339 50574 106764 222995 322699 350649 412281 438211 412853 370878 297387
18761 297387 249161 185587 155171 159021 96917 44119 57785 18539 24031 23234 43338 20453
18749 20453 -5395 -377 -17057 -11850 9161 55868 70583 87638 35092 23548 49630 69030
18737 69030 99070 25440 4819 27264 15348 33798 57032 68876 31916 27500 100668 110799
18725 110799 44710 3029 7235 -3002 25947 27263 55043 65724 29978 16661 52966 47407
18713 47407 57970 72005 78099 101824 63327 47830 37803 34264 82561 98498 93927 75035
18701G5035k9793k0251j2141o361L0552k5619K2911n399L3307L9113L686j724
18689A03316o6119k4960K7965K6515P0037J1877k8639k5528M126R329M8593k86
18677A56226L8021j642j8619l1024K730J0687M7381L1440M3905M1680M0759J4368
18665C75912k3K1043j9951m4821o1566K1331N9244K7044k4289J8540N4554l2475
18653C94543l473l0075k4253l9134k3338K8736o26l3631j4683j4502k0032j6580
18641B02952J3952K0263j4824q006o5148k8929k4672p666m4547m6526K0841K7396
18629D5086K7978k029J7972r67k2978M891J2350p120P077L9659P3794M483K662
18616B02858L2055N6949R2857l3400m2662L747L4607J9769K1985O75j5556R265
$$ plain form
18701 75035 45242 24991 12850 6489 37041 11422 34333 28934 62241 101354 105040 103316
18689 103316 37197 12237 40202 66717 136754 148631 119992 94464 98590 107919 156512 156226
18677 156226 194247 192605 173986 142962 145692 156379 203760 235200 279105 320785 361544 375912
18665 375912 375889 396932 376981 332160 270594 291925 351169 378213 353924 372464 427018 394543
18653 394543 391070 360995 336742 297608 274270 303006 302380 268749 254066 239564 219532 202952
18641 202952 216904 237167 222343 214337 149189 120260 95588 87922 43375 -3151 17690 45086
18629 45086 73064 71035 89007 88040 65062 69953 82303 75183 82260 121919 195713 200196 202858
18616 202858 234913 291862 384719 351319 308657 312404 347011 366780 388765 389440 373884 383149
18604C83149m2295p2046q3526J2020M5179j1194l321M2241O3286L7017J7112N404
18592C93026l0019J0573q641n6219k8713m2485J6310n774j3387m0900m8765m6855
18580I8151l4474o883k684K888M577J1037J3420J8637k2399r643K3548j2467j1600
18567G2108j992K0012K8990j8722q989j8907l2197j0397L369L0679n938n5520
18555B496l4214j9112J0928j2650q474R7284K4605p0599m0029L6010M4769J4898
18543D5912l2049l0590k6814n849M6808K7047L6966O6202n8938p8800j6892l4319
18531f1316j0726L6182L0935J0051k0551p2115j2700K9573M1594K3997j3845M1879
18519B2958M9310M0232k5697k6253l9238P696M908k6418J486M8094J912k5673
$$ plain form
18604 383149 340854 268808 185282 197302 242481 231287 227966 270207 333493 370510 387622 393026
18592 393026 363007 373580 364939 308720 280007 237522 253832 248058 234671 193771 145006 98151
18580 98151 63677 56794 54110 56998 61575 72612 86032 104669 82270 72627 96175 83708 72108
18567 72108 70116 90128 119118 100396 91407 72500 40303 29906 33275 63954 58016 2496
18555 2496 -31718 -50830 -39902 -52552 -61026 36258 60863 -9736 -49765 -13755 31014 45912
18543 45912 13863 -16727 -43541 -49390 -2582 24465 61431 127633 68695 -10105 -26997 -61316
18531 -61316 -72042 -35860 -4925 5126 -15425 -87540 -100240 -70667 -29073 -5076 -18921 22958
18519 22958 72268 112500 86803 60550 21312 29008 33916 7498 8984 57078 58990 33317
18507C3317k9127K805N8567q026n8936n738R437J6959O581k0263L1348K488m292
18494C5120K3132n8872l7786L3936j3273q036J602M5600J4157M148K3195k6096
18482C6827j5470P947K3848J3608J3722k7068n7560k8382k8260N366L9627Q7318
18470G1523M4288j3603m0925k8363j9985j759o374l0674J2912J1795M4085L6584
18458G9504K6984k7716o5143r348J4185j1926K0066J5884n0440r4453N7620L5266
18446i517L5635O623n7569l4192K0785J09776M1924l6455J1962o760j409m309
18434G6494m5752m001L0766n2288k7219p807j7463Q968M7297k350k6600j1202
18422c1157J024P428J1543M0112N6650l6565p6817l1672M7213L3551O568L1960
$$ plain form
18507 33317 4190 6995 65562 57536 -1400 -7138 2299 19258 25839 5576 36924 39412 35120
18494 35120 58252 -620 -38406 -4470 -17743 -25779 -24177 21423 35580 39728 62923 36827
18482 36827 21357 29304 53152 66760 80482 53414 -4146 -32528 -60788 -55422 -15795 71523
18470 71523 115811 102208 61283 32920 12935 11176 4802 -25872 -12960 -1165 42920 79504
18458 79504 106488 78772 13629 4281 18466 6540 26606 42490 -7950 -102403 -44783 -9517
18446 -9517 26118 32741 -24828 -59020 -38235 71541 113465 77010 88972 82212 80803 76494
18434 76494 30742 26741 57507 5219 -22000 -29807 -47270 -38302 8995 6645 -19955 -31157
18422 -31157 -30133 -22705 -11162 28950 85600 49035 -27782 -59454 -12241 21310 27878 59838
18410E9838j2054q116J5315J590j3429q312K2600J8885m7545k9116j6351m4234
18398f0929l3557L3819J904K3895N0386N908j4174m1446k876P5511L0877p5582
18386f264k5237J8476K069L2898N9065l6421o9151o3093k9127L6439J2303N1035
18374a7008J5470J1448R226K6281j5289l7968J3918K9865L2023r843n8791R174
18362H506n330J7942K7909L2749J0870J3973n2997m0806Q014p752n5460o7545
18350a09927K1597P957K5948P250L4166R8332J8242k315k0631k461k6790L067
18338E4435L6883K3726J6202p219l0139j0909j9446k7783L481N7327J3162q066
18326A01654k0468J2725L1573o1116o1475M6405K2627k3915k288j27J9460r437
$$ plain form
18410 59838 47784 39668 54983 56573 43144 34832 57432 76317 28772 -344 -16695 -60929
18398 -60929 -94486 -60667 -58763 -34868 15518 21426 7252 -34194 -37070 38441 69318 -6264
18386 -6264 -31501 -13025 -10956 21942 81007 44586 -24565 -87658 -116785 -80346 -68043 -17008
18374 -17008 -1538 9910 19136 45417 30128 -7840 6078 35943 67966 58123 -668 8506
18362 8506 3176 21118 49027 81776 92646 106619 53622 12816 20830 13078 -42382 -109927
18350 -109927 -88330 -80373 -54425 -47175 -13009 85323 103565 101250 80619 78158 51368 54435
18338 54435 91318 115044 131246 124027 93888 82979 63533 35750 39231 96558 109720 101654
18326 101654 81186 93911 125484 64368 2893 49298 71925 48010 45722 45595 65055 55618
18314E5618m7447m633N7656K4834n9268k3210j0289K7170M3926N0043K4757P1701
18302B10858l1726o3758K037M8373m4324p8418k6977K0251m2295K0253K6686L125
18290D4085m9846q394k6195K3186k6314M916o238j6663L9540Q0527N1820l2266
18278G8158n4832k5j6508k92M9566J4132J975k1331j8589q088Q7585N745O741
18265A24237m390m0078p3906l5540o8895L1124j0503J9754P9036J0519j2415m97
18253A8446N0920n904l3648m8054j3111L4660M8079m3433k0934k7152J5174J4280
18241a0677J480K4511J2864j008j101k0296L0771m1343k3916M9771k2549p293
18229h786n6754O666l1014K2538P2878O4271j7576k0703l4663o29J2764j2951
$$ plain form
18314 55618 8171 3538 61194 86028 26760 3550 -6739 20431 64357 114400 139157 210858
18302 210858 179132 115374 117411 165784 121460 43042 16065 36316 -5979 14274 40960 44085
18290 44085 -5761 -14155 -40350 -17164 -43478 -38562 -44800 -61463 -21923 58604 110424 78158
18278 78158 23326 23301 6793 6501 56067 70199 72174 50843 32254 24166 111751 117496 124237
18265 124237 119847 79769 5863 -29677 -98572 -67448 -77951 -58197 20839 31358 18943 18446
18253 18446 69366 63462 29814 -18240 -31351 3309 51388 7955 -12979 -40131 -24957 -10677
18241 -10677 -9197 15314 28178 27170 26069 5773 36544 -4799 -28715 21056 -1493 -8786
18229 -8786 -65540 -58874 -89888 -67350 5528 69799 52223 31520 -3143 -3772 8992 -3959
18217c959P169J0840N690N3363K683M1241j961p3041l082J4930R095j1331j4565
18204C7072M9760M0884N27M1959O6766J4295n9585j23894J8764N8894l6017o0685
18192D8740M778j426r393k4255M4368L4015j4267L8500K7967K5010R576j9319
18180A64294l2998l8847N6221Q4372k9150l8489J7701J4818N8253J3830J8332
18169B88337n6445j2005k9339M139J3503l9812J2117L8612O0388K1033j4307M034
18157B90255n138O993o3906L8635J06154N2699K4944O0719j3177L3113k9775k5461
18145D76055O6414J03365J16166J11600M3330J5391R0556R2769Q9384O9965Q5989
18134A360984Q1835J66624K11584J63851J04083J45519K24120K33812K36181J79752
$$ plain form
18217 -3959 3210 14050 19740 73103 75786 117027 115066 42025 38943 53873 62968 51637 37072
18204 37072 86832 127716 128243 170202 236968 251263 191678 67784 86548 145442 109425 48740
18192 48740 53518 52092 42699 18444 62812 96827 82560 121060 149027 174037 183613 164294
18180 164294 131296 92449 148670 233042 203892 165403 183104 197922 256175 270005 288337
18169 288337 231892 219887 190548 194687 208190 168378 180495 219107 279495 300528 286221 290255
18157 290255 285117 292110 228204 266839 372993 425692 450636 511355 498178 531291 501516 476055
18145 476055 542469 645834 762000 873600 916930 932321 1022877 1115646 1205030 1274995 1360984
18134 1360984 1442819 1609443 1821027 1984878 2088961 2234480 2458600 2692412 2928593 3108345
18124C108345J71956K64048L06867L64888L72965M01007N43766P58036J011753
18115G303631J373618J932417K807414M198350O347107R132972J1621320J1950525
18107E6667354R002638J607568p528241j2347112j1887356r579176p066980m786326
18099A4082369l292292k363258j720680j255621q43325p22082o46930n27628l79616
18090B330937k81463k09400j73190j88467j10601q8447j60525m8782q171j07024
18080I54867r3916k3843p3626k4509p2556n0561n5665j2873J2964k0273l2259
18069E07750m6614k0913L4598q797k6034O128k5858k2469q4654m6037k1906j8110
18057B27084j4017k2520K3985k564J1040L8917j08J3504L1831Q160Q145k0441
$$ plain form
18124 3108345 3280301 3544349 3851216 4216104 4589069 4990076 5533842 6291878 7303631
18115 7303631 8677249 10609666 13417080 17615430 23962537 33095509 44716829 56667354
18107 56667354 65669992 67277560 59749319 47402207 35514851 25935675 18868695 14082369
18099 14082369 10790077 8426819 6706139 5450518 4607193 3885111 3238181 2710553 2330937
18090 2330937 2049474 1840074 1666884 1478417 1367816 1279369 1118844 1070062 1061891 954867
18080 954867 860951 837108 763482 738973 666417 615856 560191 547318 560282 540009 507750
18069 507750 461136 440223 474821 466024 439990 446118 420260 397791 313137 267100 245194 227084
18057 227084 213067 190547 214532 211968 223008 261925 261817 275321 307152 315312 323457 303016
18045C03016K8124J7230l0213o8161k7492Q861O2943L7231L2377o600l2978J3079
18033C37417k963P813J9252M2858l6194l0609J5355m96J2591J3857K2013j6163
18021C84731k7642j2476M3860K308J7586L7741K0365n5388o0143k7792J730j5308
18009C09572P4041K0435k6960l5061r4065j4341M7765N686l8687j01376m2570
17998A04439M686p583K8324K9416K2797m622J975J0874o171P81K6490M7607M573
17985B63586L8479L2511j3198j0659J9660k0169R880J3643m455p2412J2368K9841
17973B99075K5989Q483L2879k7761M6938Q052k7147N7016L0785r807k1778k0694
17961D02030M2019R935j8692N61m1758m6809K1572O517m077n0522l5712l649L3066
$$ plain form
18045 303016 331140 348370 318157 249996 222504 231365 294308 331539 363916 357316 324338 337417
18033 337417 334454 342267 361519 404377 368183 337574 352929 352433 365024 378881 400894 384731
18021 384731 357089 344613 388473 390781 408367 446108 466473 411085 350942 323150 324880 309572
18009 309572 383613 404048 377088 342027 247962 233621 281386 287072 248385 147009 104439
17998 104439 109125 101542 129866 159282 182079 177457 179432 190306 184135 184916 211406 259013 263586
17985 263586 302065 334576 321378 310719 330379 310210 320090 333733 329278 256866 269234 299075
17973 299075 325064 333547 366426 338665 385603 393655 366508 423524 454309 444502 422724 402030
17961 402030 444049 453984 435292 435853 394095 347286 368858 375375 371298 320776 285064 281415 314481
17948C14481o955j7580l3143k1188l3396k1381Q392j7329o0326k2083j9753K5290
17936I5029J4382O5137O6262n6280j4344k5214l9051N45K7676L1308k166J8459
17924A81743p381n733m5198p4852r0755N8537P4201o3817m6811K4500L9423j2097
17912C1760j944K514K2006J3410K2442l2527K5425m8078J9092j1010M086J4587
17900F1763j8416m9098M1413L9716M7085o3759o454K0763O196K0955K3099n3588
17888F9675o1367n736n219k3724J0020N8989L4268q5750K037L7319j3231k7438
17876a0157l5348N4857O6956K4667K0068l6079J6046k7598j5723j7447L85j6746
17864B3881J2334J9362J2799J387k0824n0272r865O1571k4213m8859k4577L8103
$$ plain form
17948 314481 307526 289946 256803 235615 202219 180838 189230 171901 111575 89492 69739 95029
17936 95029 109411 174548 240810 184530 170186 144972 105921 106466 134142 165450 163284 181743
17924 181743 174362 168629 123431 48579 -42176 16361 90562 26745 -20066 4434 43857 31760
17912 31760 29816 32330 54336 67746 90188 57661 83086 35008 54100 43090 47176 61763
17900 61763 43347 -5751 35662 75378 122463 58704 52250 73013 79209 100164 123263 69675
17888 69675 8308 2572 -2647 -26371 -16351 42638 76906 -8844 -6807 30512 17281 -10157
17876 -10157 -45505 9352 76308 100975 121043 84964 101010 73412 57689 40242 40627 23881
17864 23881 36215 55577 68376 69763 48939 -1333 -11198 50373 26160 -22699 -47276 -9173
17852i173M703j8145O589M9353M7963k356o154k6401k1713J996O347k879k5231
17839D899Q009L4979l136M5625k2887j6071l3253l11K939N1561M3210j5360l7773
17826F2431M828j5865n7788j236J8199N0369K2450J5860m3172n8037K5378J9217
17814D2634O5039K8214o675K1863k8075N801j5643k6561k9218M8751N79o8L4967
17801A41608O5958N1277N786o7746L737K2862j5401m5600k8055l1899L0828l5601
17789I7754j2079M7947O5587K8281J1060j6360j8123k0106n8621m9359k6773K8727
17777G7935Q998k0092J7433J705K8209L2746O8551o701j5525q952J507k9098k8064
17764A28652K2622k6001j1020k874J8058M2546P0546J3885j7921J2010R744j1979
$$ plain form
17852 -9173 -4470 -22615 -16026 33327 81290 78934 72780 46379 24666 26662 33009 30130 4899
17839 4899 12908 47887 44751 90376 67489 51418 18165 17854 20793 72354 115564 100204 62431
17826 62431 67259 51394 -6394 -7630 10569 60938 83388 99248 56076 -1961 23417 42634
17814 42634 107673 135887 129212 151075 123000 128801 113158 86597 57379 106130 106709 106641 141608
17801 141608 207566 258843 264629 196883 200620 223482 208081 162481 134426 102527 133355 97754
17789 97754 85675 133622 199209 227490 238550 222190 204067 183961 125340 75981 49208 77935
17777 77935 86933 66841 84274 85979 114188 146934 215485 208784 193259 184307 185814 156716 128652
17764 128652 151274 125273 114253 111379 129437 171983 242529 256414 238493 250503 260247 248268
17752B48268k0700j3468J7036J1418K4419J0209O968k504k188J0374k2273m147
17740B63412n6524j4800P856k3065k8329M3894L5332m104l6723m124j7467K6687
17728A92045k532J532j4364K6200l3744N060l1120k056P8514K9013j7319p6018
17716A55211j2179k2797n3351j9256Q528K8160O9721M6042j9003j5277L2247o256
17704A91790k8331J1446P725q686L1225L9914j05415q4662L2772M5367K3360k5463
17692A31042k6612j5116m2678l7898N2684N0570J2995k6138L8726l6221l7981
17681F3373k1921j2985N1149K3837n4607r202J6678J8503K9546J6754j3937o6042
17669D1146k4828j3270K6494Q2225K2156N313K3762q446l5065N059L7491j6788
$$ plain form
17752 248268 227568 214100 231136 242554 266973 277182 284150 281646 279458 289832 267559 263412
17740 263412 206888 192088 199944 176879 148550 192444 227776 223672 186949 182825 165358 192045
17728 192045 189513 191045 176681 202881 169137 174197 143077 141021 219535 248548 231229 155211
17716 155211 143032 120235 66884 47628 56156 84316 154037 200079 181076 165799 198046 191790
17704 191790 163459 174905 182630 173944 205169 245083 139668 55006 87778 133145 156505 131042
17692 131042 104430 89314 46636 8738 61422 111992 124987 98849 137575 101354 63373
17681 63373 41452 28467 79616 103453 48846 39644 56322 74825 104371 121125 107188 41146
17669 41146 16318 3048 29542 111767 133923 139236 162998 154552 119487 124546 162037 145249
17657A45249q769j5838J5211k9357L7577J4128K3695n3282q0009k2358K7044K3961
17645G7252J1212j4991L2974L3762N452p3342j4191L3463J9101O2126L3127j0969
17633A94976N962N7087N3031J6472m7481r569L0029M3955M6316K5728L7542k387
17621D51661N2616J5616o9118m9384j2903J8307J9353q03K3494k891L991O3992
17609E13931j8424q501M0037O9249K8308j5506l8252k5290M65M8407M0142N2488
17597F87054K0749k2642k7915Q167L4034N5862L5844N7501Q8242K0224k8483l3731
17585H94906K459p672N0963N9403O2684L7370N6150J54338J16078M4971j2708
17574A458942M7473J03657J18463K2188P9111P0858J07443J45351J74584J33106
$$ plain form
17657 145249 136480 120642 135853 106496 144073 158201 181896 128614 48605 26247 53291 77252
17645 77252 88464 73473 106447 140209 145661 72319 58128 91591 110692 172818 205945 194976
17633 194976 200938 258025 311056 327528 280047 270478 300507 344462 390778 416506 454048 451661
17621 451661 504277 519893 450775 401391 388488 406795 426148 425345 448839 445948 449939 513931
17609 513931 495507 487006 527043 596292 624600 609094 570842 545552 546017 594424 634566 687054
17597 687054 707803 685161 657246 665413 699447 755309 791153 848654 936896 957120 928637 894906
17585 894906 897365 889693 940656 1000059 1062743 1100113 1156263 1310601 1426679 1471650 1458942
17574 1458942 1506415 1610072 1728535 1750723 1829834 1900692 2008135 2153486 2328070 2461176
17564B461176J03790J06617J03199J55675J95770J51571J80870K10924K13796
17555C883388K12309K96638L31464L43531L85102M76813N16610N62713P30303
17546G738871Q60341J021051J199554J369171J563929J648911J611519J464026
17538A8477373J107073O75275L77181J33008J02887L71702P38532J255445J932285
17529B5170761K689923L660322N075471O838903Q941324J1203627J3157255J3880683
17521I0618269J2615343R152119L758528k199345p180957j0246486j1323889j0765855
17513G4427727r219704p214726n137506l339632j984904j189153j023007j442933
17505D3876162k334653l254296l836763l963758l637601l107605k561604k037706
$$ plain form
17564 2461176 2564966 2671583 2774782 2930457 3126227 3277798 3458668 3669592 3883388
17555 3883388 4095697 4392335 4723799 5067330 5452432 5929245 6445855 7008568 7738871
17546 7738871 8599212 9620263 10819817 12188988 13752917 15401828 17013347 18477373
17538 18477373 19584446 20259721 20636902 20769910 20872797 21244499 21983031 23238476 25170761
17529 25170761 27860684 31521006 36596477 43435380 52376704 63580331 76737586 90618269
17521 90618269 103233612 112385731 116144259 113944914 106763957 96517471 85193582 74427727
17513 74427727 65208023 57993297 52855791 49516159 47531255 46342102 45319095 43876162
17505 43876162 41541509 38287213 34450450 30486692 26849091 23741486 21179882 19142176
17497A9142176j564675j206772r22339o86163n03848l35328k05983p741J40960
17488A3850287K64390M89833P20686Q59935J125583J425652J841900K243853K753002
17479B5575121L267729L665436L734674L281446K483565J576672P81266N69188
17471D4935097R76853K045921L647504N607715P607529R324741J0427930J0260264
17463I4833554Q349646M609290n25952o031734j0349331j2591242j2794687j1505106
17455E3994438r452724p388900n754584m419565l395231k595075j904763j360439
17447A7723157r12865m39975j32265j19847l26250o27426r89492j272451j395711
17438A1506875j353855j263625j102013r06268p42441o55788n63738m81988m19096
$$ plain form
17497 19142176 17577501 16370729 15448390 14762227 14258379 13923051 13717068 13709327 13850287
17488 13850287 14114677 14604510 15325196 16185131 17310714 18736366 20578266 22822119 25575121
17479 25575121 28842850 32508286 36242960 39524406 42007971 43584643 44365909 44935097
17471 44935097 45911950 47957871 51605375 57213090 64820619 74145360 84573290 94833554
17463 94833554 103183200 107792490 107266538 101234804 90885473 78294231 65499544 53994438
17455 53994438 44541714 37152814 31398230 26978665 23583434 20988359 19083596 17723157
17447 17723157 16810292 16370317 16238052 16118205 15791955 15164529 14175037 12902586 11506875
17438 11506875 10153020 8889395 7787382 6881114 6138673 5482885 4919147 4437159 4018063
17429D018063l72351k62831j96508k52101k36880k00553j17224j21337j35635
17420B122643q7009q0302p0800j05338n8502m8590q5279m7721k8979n6849n0854
17409A402420n2173j10393q1541j4035k9996m8892j0460o3270j2397l405l3675
17398I42183M005N4777M0186j5857k9794k7999m1481l08q9877n7194l1187M3601
17386G91055k2196l4179K9755J5099l4770j6416j8899J3376k004j799K247m9415
17374F71854m3742K6150l0064l1380o62O265l0058L5930k3902m1350K3663K53
17362E62957l5922j0966K7730J7797n9326j6686n4853m0552J8757l4254k0674
17351C54008R1126O4930k346m260K3386l3767m5009J1026k8880O6180R8853K9718
$$ plain form
17429 4018063 3645712 3382881 3186373 2934272 2697392 2496839 2379615 2258278 2122643
17420 2122643 2035634 1955332 1884532 1779194 1720692 1672102 1586823 1539102 1510123 1453274 1402420
17409 1402420 1350247 1239854 1158313 1144278 1114282 1065390 1054930 991660 979263 975858 942183
17398 942183 946188 1000965 1041151 1025294 995500 967501 926020 925712 835835 778641 747454 791055
17386 791055 768859 734680 764435 779534 744764 728348 709449 722825 720821 719022 721269 671854
17374 671854 628112 654262 624198 592818 592156 598421 568363 604293 580391 539041 562704 562957
17362 562957 527035 516069 543799 561596 502270 485584 430731 390179 408936 374682 354008
17351 354008 445134 510064 507718 503458 526844 493077 448068 459094 430214 496394 595247 624965
17339F24965o1477M627L0584k7297l9191n2322k3764j1081j3680l392J3868n2734
17327C89106n2887M4904N1571p945m9298j2954K0234j8854n42O4591J3393m0563
17315D00756q5172j9998K9416M1167M318k9585k5069j7155k714j281m4486K820
17303B53017J6425N793N607J6093o688J6176R766l122l9827k3854n253J6425k1612
17290B38946J2851J1520k7573k127j0459n5898l6086M6079k6304O957J2558m155
17278A66309J9527K8653L2068n0200r0129n313L2594J3789l4464m2702K3598L9163
17266A32893K7505L415K9521l5449J2709J0113Q6070m9612n4451n9506O104M1756
17254A51068p8K381p060N792J3751j5067l4799k7118K185k6885K187m741j606
$$ plain form
17339 624965 563488 568115 598699 571402 532211 479889 456125 445044 431364 427972 441840 389106
17327 389106 336219 381123 432694 424749 375451 362497 382731 363877 363335 427926 441319 400756
17315 400756 315584 295586 325002 366169 370487 340902 315833 298678 295964 294683 250197 253017
17303 253017 269442 275235 280842 296935 290247 306423 316189 313067 273240 249386 244133 260558 238946
17290 238946 251797 263317 235744 233617 223158 167260 131174 177253 150949 157906 170464 166309
17278 166309 185836 214489 246557 196357 106228 100915 133509 147298 112834 70132 93730 132893
17266 132893 160398 163813 193334 157885 170594 180707 266777 217165 162714 103208 109312 151068
17254 151068 150990 153371 146311 152103 165854 150787 115988 88870 91055 64170 66357 61616 60010
17241F0010M3296L4907j6609q525n525j0850L2732k1424l024L7450j2917l2056
17229I7465j8077o3742l0431K5997J3062j8784P6809N2183j98k459L4345l388
17217A62782m0694J8099o7441n0544O2506O4781k4310M0776r578n861o6900j5700
17205F7916M5906O7872M0378k353p1557k6155J1225J7465J4708k7213J6757K8062
17193A83011j7816M212R937N301L1919J6050K0283J5230P4853J186l348J6614
17181C57432M0028n6906m294O1807O6841J35978J68806K58005L97682M45335N40454
17170B411168N47120L22212M4113l33225n25053n35436m33357l80753k58572j37644
17160G20573q9357n3521j17464j14677n4606q8858m4604k4547K9464l4103L906
$$ plain form
17241 60010 103306 138213 121604 113079 107554 96704 129436 108012 104988 142438 129521 97465
17229 97465 79388 15646 -14785 11212 24274 5490 82299 134482 134284 131825 166170 162782
17217 162782 122088 140187 72746 22202 84708 149489 125179 165955 156377 150516 83616 67916
17205 67916 113822 181694 222072 219719 148162 122007 133232 150697 165405 138192 154949 183011
17193 183011 165195 169407 179344 184645 216564 232614 252897 268127 342980 344166 340818 357432
17181 357432 397460 340554 336260 398067 464908 600886 769692 1027697 1425379 1870714 2411168
17170 2411168 2958288 3280500 3324613 2991388 2466335 1930899 1497542 1116789 858217 720573
17160 720573 631216 577695 460231 345554 290948 202090 157486 132939 162403 128300 132206
17149A32206j492j9563l0474P4663m134K4080Q147k9064q9298l8670O9916K9900
17137A26217o191J9959K8464j3352l4968l4887l1037l9780K8330L6468N8703K0353
17125A58279j8989j6718l9835l1340q498r900P926M1345L4313M5135o0934l3075
17113F7709n7456q609p02j2567O1154L470m4652k1040L4940j2055O791P201N7766
17100H1950J461m779J2900k0336m6721k0173K0651Q430j9122p239k13J204K7264
17087C5277P279J0871O6586L738l6365o3269M7566l200k6212l70J4816P564Q1738
17074A46019N0708j3746q1819m7431J0761R404j9103j7204l9488j4763P0479N7439
17062A11256N555m3240q937J9460k290J9114q217n0205K9786L0046m5731k1454
$$ plain form
17149 132206 130714 111151 80677 155340 151206 175286 183433 154369 65071 26401 96317 126217
17137 126217 120026 139985 168449 155097 120129 85242 54205 14425 42755 79223 137926 158279
17125 158279 139290 122572 82737 51397 42899 32999 40925 82270 116583 161718 100784 67709
17113 67709 10253 1644 942 -11625 49529 52999 8347 -12693 22247 10192 16983 24184 81950
17100 81950 83411 78632 91532 71196 24475 4302 24953 33383 14261 7022 6809 8013 35277
17087 35277 42556 53427 120013 123751 87386 24117 71683 68483 42271 41901 56717 64281 146019
17074 146019 196727 182981 101162 53731 64492 73896 54793 37589 -1899 -16662 53817 111256
17062 111256 116811 73571 64634 84094 81804 100918 92701 42496 72282 102328 56597 35143
17050C5143q180k3034l4590J242M7270K0018O0931k4863n0290j3235L0033P502
17038D7947j3910L0903M408O8052O9841k0257m5969N8820K1175M5074L0123j6058
17026B80149j4212L4408J2601N942L6916K8387j3250O922m515j2637k401j3605
17014C44705r33O063j5971M1498N0786K8293k1582k3942m8854j3492M0040J1122
17002C97733o2701m5471o3723j8009J6697n1212m2370j6900K1801M5646K8040
16991B09531k3526k5023M5095l7740n8227K3350L4818o1063q1058j0919K6119
16980D1357M0609Q0633L7823J2975K8052K9507M1954J539K9208k7236R544L4806
16968C60771L3528Q687R510J2835k3393k4657k4945m3057j9087j5253n0912l494
$$ plain form
17050 35143 26963 3929 -30661 -29419 17851 37869 98800 73937 23647 10412 40445 47947
17038 47947 34037 64940 69348 137400 207241 186984 141015 199835 221010 266084 296207 280149
17026 280149 265937 300345 312946 318888 355804 384191 370941 377863 373348 360711 358310 344705
17014 344705 343772 349835 333864 375362 426148 454441 432859 408917 360063 346571 386611 397733
17002 397733 335032 289561 225838 207829 224526 173314 130944 114044 135845 181491 209531
16991 209531 186005 160982 206077 168337 110110 133460 168278 107215 26157 15238 41357
16980 41357 81966 162599 200422 213397 241449 270956 312910 314449 343657 316421 325965 360771
16968 360771 394299 402986 412496 425331 401938 377281 352336 309279 290192 274939 224027 220533
16956B20533K4028n159p717P742m05K6825N6445l7939j4606Q7494j628J1260k7535
16943C39338j25652m4729j7715K682j0982k6657l3981j5800j1351l5267R08n2278
16931c1484l3590P5010k5844p3097k405J2947O634J4106P6041M3627J9868k59
16919H1554N2487l8108m9050n0723K8371K7722j1311K882J9886o3944k4951r631
16907c4816J0667j5869Q872M5059K0893L5812J0326o879k0959m647j2404l0318
16895E737J838P475M034K3086j7931p2552k7679K9039M5405O1830J9895k6921
16883E3256j0915m526M477n231k1875l2071J5017k2826j9140J8770k983j5133
16871d3180K8264N6337p3881J0493o554m0783J3801O526K4366N0991J9762j5663
$$ plain form
16956 220533 244561 239402 231685 239427 239022 265847 322292 284353 269747 357241 355613 366873 339338
16943 339338 213686 168957 151242 153924 142942 116285 82304 66504 55153 19886 20794 -31484
16931 -31484 -65074 9936 -15908 -89005 -91410 -78463 -71829 -57723 18318 61945 81813 81554
16919 81554 134041 95933 46883 -3840 24531 52253 40942 43824 63710 -234 -25185 -34816
16907 -34816 -24149 -40018 -31146 13913 34806 70618 80944 74065 53106 48459 36055 5737
16895 5737 7575 15050 19084 42170 24239 -48313 -75992 -46953 -1548 60282 80177 53256
16883 53256 42341 37815 42292 37061 15186 -16885 -1868 -24694 -43834 -25064 -28047 -43180
16871 -43180 -14916 41421 -32460 -21967 -28521 -69304 -55503 -48977 -24611 26380 46142 30479
16859C0479p7398K037K1973l1155L0335K1844J7045L2345J795J6578L312n4285
16847A4905j4054m9434K2058M207J7434J9666m2421k0666L7845K8904O498k6074
16835a132o8743n6231O7807O7663j781k3899k794M2197M6419J2070j8689m2939
16823A9948N1136L8222n9937r0683l5726p25N7269O7471M7491m7462n7912K560
16811h348K2877M0824l9515j3931K9238j3903j1995N563j7250K2877L5857m5253
16799G041l6346n2154J1615j1399o821N8707p839j2705J4391J3620r714n2403
16787h4007o6257K3623P9904L052l5856M3232k15J2620K5801m114k4015j8867
16775d5099J6332j0972Q795K1045n35k7506k384J8866K7889J7256J2069j8424
$$ plain form
16859 30479 -46919 -44882 -22909 -54064 -23729 -1885 15160 47505 49300 65878 69190 14905
16847 14905 851 -48583 -26525 -22318 -4884 14782 -27639 -48305 -10460 18444 24942 -1132
16835 -1132 -69875 -126106 -58299 9364 7583 -16316 -19110 23087 69506 81576 62887 19948
16823 19948 71084 109306 49369 -41314 -77040 -77765 -20496 46975 94466 47004 -10908 -8348
16811 -8348 14529 55353 15838 1907 31145 17242 5247 10810 -6440 16437 52294 7041
16799 7041 -29305 -81459 -69844 -81243 -88064 -29357 -37196 -49901 -35510 -21890 -31604 -84007
16787 -84007 -150264 -126641 -46737 -43685 -79541 -36309 -36524 -23904 1897 -2217 -26232 -45099
16775 -45099 -28767 -39739 -30944 -9899 -10434 -37940 -40324 -21458 6431 23687 35756 17332
16763A7332o6394K1433O9159l6696M515M1220o1796n7146J2113J7619J5818L3476
16751A0653O7745j946m9805L9640J4760l651k2909m5054l2605J6141J4006j8816
16739a1841j9393J616J4593n2157k5783K8218L2591L5159m560K9311j3060n3303
16727c8609N327n495R1682Q1570j4120n0717k1592l6318k4439O193L4109N273
16715C2864k264l826k666j3562M4220K6354j4343J0663J6726K4873l0919l7278
16703E0842j6656o041k9136n3217o3626K4752N0230M046o421j8585K2950K027
16691c8835k4690j2432Q988K3404o3900R435K8985L2552N6556J6294m335J9509
16679E1531j7794j8735l5855j0027K8169J6398R070O454n3821m916K8929n0808
$$ plain form
16763 17332 -49062 -27629 41530 4834 9349 50569 -11227 -68373 -56260 -38641 -22823 10653
16751 10653 78398 76452 26647 66287 81047 77396 54487 9433 -23172 -7031 6975 -11841
16739 -11841 -31234 -29618 -15025 -67182 -92965 -64747 -32156 3003 -1557 27754 14694 -38609
16727 -38609 -33282 -38777 52905 134475 120355 69638 48046 11728 -12711 -6518 27591 32864
16715 32864 30600 26774 24108 10546 54766 81120 66777 77440 94166 119039 88120 50842
16703 50842 34186 28145 -991 -54208 -117834 -93082 -42852 -38806 -45227 -63812 -40862 -38835
16691 -38835 -63525 -75957 -66969 -43565 -107465 -98030 -69045 -36493 20063 36357 32022 51531
16679 51531 33737 15002 -20853 -30880 -2711 13687 22757 29211 -24610 -29526 -597 -51405
16667e1405k7386M6148L2996J6499J1863n415n185M6276o137N796L7551j6349
16655H5252k9904L662n44m3233m6010j1112L2832O123m1776m4165J6972Q368J0160
16642e3375L3407N689L4233k99l111J0849L0833j7312j7086K4143l6173m0141
16630b8343K3414o339K0503J4904j0356m0867N1451M9998N994m4455o3283j0706
16618c8085k7003j4606Q6602K4185l0717l4451R273o6389R543P8476j9508j9094
16606d1774L784j9726M2451N530k4884k0092k6177k8776J7740K8402R6932M9472
16594H2882P765l425m8204M257n4089p259k9127j5997N1370l5650l9789R124K9572
16581d8570K3239J0177j4182l7274M3762J3015n5416j147o13m372M8775M6566
$$ plain form
16667 -51405 -78791 -32643 353 16852 28715 23300 18115 64391 58254 64050 101601 85252
16655 85252 55348 59010 58466 15233 -30777 -41889 -9057 -2934 -44710 -88875 -71903 -63535 -53375
16642 -53375 -19968 -14279 19954 19655 16544 27393 58226 40914 23828 47971 11798 -28343
16630 -28343 -4929 -11268 9235 24139 13783 -27084 24367 74365 80359 35904 -27379 -38085
16618 -38085 -65088 -79694 6908 31093 376 -34075 -24802 -91191 -81648 -3172 -22680 -41774
16606 -41774 -37990 -57716 -15265 -9735 -34619 -54711 -80888 -109664 -91924 -63522 33410 82882
16594 82882 90647 87222 39018 43275 -10814 -18073 -47200 -63197 -11827 -47477 -87266 -78142 -48570
16581 -48570 -25331 -15154 -29336 -66610 -22848 -9833 -65249 -66396 -67009 -71381 -22606 23960
16569B3960l1193j0109r92k7895j4873j2538K5259M6002K6828K891j1004K6870
16557D3206l911K2440J0776R825j3064J593j7915l1364j8131j6221j2704P499
16545a7971K9662j1620l2605K102j9530q411m7632n3101J5107P7038L7049m8459
16533g8371p901K3076K9066J0547j5606J5447N8909j8930l7342l0078N5537R935
16521A4289P884o92P532M7109j2083o1837J0903L8131k5927k7370R715l1316j0809
16508c4471l664J0182l983L2711j5087l2418J1941L9240k9773l9703M8480N8668
16496D2123p82m1898r80m1370m129L4464K4212j716o067l3231K3522L1285J2792
16483C8225j4438L3871j5363k1947l0222K6961m295K9526L0844l2177p405l4848
$$ plain form
16569 23960 -7233 -17342 -18334 -46229 -61102 -73640 -48381 -2379 24449 27340 16336 43206
16557 43206 39295 61735 72511 82336 69272 70865 52950 21586 3455 -12766 -25470 -17971
16545 -17971 11691 71 -32534 -30432 -49962 -58373 -106005 -159106 -143999 -66961 -29912 -78371
16533 -78371 -86272 -63196 -34130 -23583 -39189 -23742 35167 16237 -21105 -51183 4354 14289
16521 14289 22173 21481 29013 76122 64039 2202 13105 51236 25309 -2061 7654 -23662 -34471
16508 -34471 -38135 -27953 -31936 775 -14312 -46730 -34789 4451 -25322 -65025 -16545 42123
16496 42123 41341 -557 -1537 -42907 -47036 -12572 11640 9924 3857 -29374 -5852 25433 38225
16483 38225 23787 57658 42295 20348 -9874 17087 12792 42318 73162 40985 33580 -1268
16471a268n2011m9861m18K2665M8315J1701L3005j0837k4606n07o717L7187M3858
16458E0506m239l341p455o8759J7468L2516L7299K319k768p016n8392R45O8925
16445E8008p999j5592l5041o340l2459J7866l947o099l5201k6892K6344K4720
16433d2632J4633m3211m3119O407M3182N0460K4859m9034J7519j2010n4767o655
16421i4368J5540L5834L2516Q470M2054l510j4886q198k1004o9586k0434J5137
16409h2435N4031N1089K6151L871l1941k2800K1075L3105m9290l1907j0334J4022
16397b5363M6964J3510j3247o1364m4342M1982j3324k2678n907J1907K9432N6791
16385A4361K4664k3204l6330m7403J9247L7403j095k3811l2597o414K0432K0411
$$ plain form
16471 -1268 -53279 -103140 -103558 -80893 -32578 -20877 12128 1291 -23315 -23822 -30539 6648 50506
16458 50506 46267 42926 35471 -33288 -15820 16696 53995 56314 53546 46530 -11862 -10917 58008
16445 58008 50009 34417 -624 -6964 -39423 -21557 -25504 -31603 -66804 -93696 -67352 -42632
16433 -42632 -27999 -71210 -114329 -107922 -64740 -14280 10579 -38455 -20936 -32946 -87713 -94368
16421 -94368 -78828 -42994 -10478 -2008 40046 36536 21650 13452 -7552 -77138 -97572 -82435
16409 -82435 -28404 22685 48836 52707 20766 -2034 19041 52146 2856 -29051 -39385 -25363
16397 -25363 21601 35111 21864 -39500 -83842 -41860 -55184 -77862 -83769 -71862 -42430 14361
16385 14361 39025 15821 -20509 -67912 -48665 -11262 -12357 -36168 -68765 -75179 -54747 -34336
16373c4336l4531J0716J6090K9110o649K7837P0860J1172m2702J1489k0126K314
16361D1244J7940o7537m6339j1795J541k1321j0720Q8862N2435K4730K171l1469
16349C9742m1423J7963j363k0739R15M5427l275P309q0137l6774O1530k2456p8463
16336a11744q121j6992j1045Q4113L2601m7415r503N4661L1984k3426j0004k2181
16324e7072J2757K8403J2721n718j6526q334j8401k1449j9065l393J2992K8892
16312e4193L5088J3993l0615l3904j2408K1102J7064N043J0697L2083J1306M863
16300B0119j4734M815K6410l1776J6978J4717k6929m89J3657k8566n0078M5352
16288a0524L9541m2030j9416l9285j9666M3922K0130P4070M2009J8083m2209M614
$$ plain form
16373 -34336 -68867 -58151 -42061 -12951 -19600 8237 79097 90269 47567 59056 38930 41244
16361 41244 59184 -8353 -54692 -66487 -64946 -86267 -96987 -8125 44310 69040 71211 39742
16349 39742 -1681 16282 14919 -5820 -4905 40522 37247 44556 -35581 -72355 -10825 -33281 -111744
16336 -111744 -119865 -136857 -147902 -63789 -31188 -78603 -88106 -33445 -1461 -24887 -34891 -57072
16324 -57072 -44315 -15912 -3191 -8909 -25435 -33769 -52170 -73619 -92684 -96077 -83085 -54193
16312 -54193 -19105 -5112 -35727 -69631 -82039 -60937 -43873 -38830 -28133 3950 15256 20119
16300 20119 5385 10200 36610 4834 21812 36529 9600 9111 22768 -5798 -55876 -10524
16288 -10524 29017 -13013 -32429 -71714 -91380 -47458 -27328 46742 88751 106834 64625 69239
16276F9239K3698j737m7751l4152j0345n97n6023m0413Q5753J8401r0964j8697
16264a03588k3055O3634N9560N323n4082o3211k9221L2279O1686J4300n0284J2859
16252g3800k495o433K3885L5871k16K0977j6575K4338m540j5420N179L152O223
16239A46n134r495k4056j2449k5644R794n479J7414k618q2394J996O2295J6807
16226e8817k186j7164j791p192J420R58J3391L5555j0700L598K0930N871l8374
16213e4501R059l5074l79m6615K8081O9228P715J3039j0238m2995p498N7154L5301
16200B2277J5472k3116r355j9002j3890R007j0973k1737j1566M8652l913o4827
16188h2971J2635N0362K2671K2349j7005j8082L3665K9227j5841Q50N9532K524
$$ plain form
16276 69239 92937 91200 43449 9297 -1048 -1645 -57668 -98081 -12328 6073 -84891 -103588
16264 -103588 -126643 -63009 -3449 1874 -52208 -115419 -144640 -112361 -50675 -36375 -86659 -73800
16252 -73800 -76295 -82728 -58843 -22972 -23188 -2211 -18786 5552 1012 -14408 -9229 -6077 146
16239 146 -4988 -14483 -38539 -50988 -76632 -66838 -72317 -54903 -57521 -139915 -137919 -75624 -58817
16226 -58817 -61003 -78167 -79958 -87150 -85730 -84772 -71381 -35826 -46526 -42928 -21998 -16127 -54501
16213 -54501 -45442 -80516 -80895 -127510 -99429 -30201 -22486 -9447 -19685 -62680 -70178 -13024 22277
16200 22277 37749 14633 5278 -13724 -27614 -18607 -29580 -51317 -62883 -14231 -18144 -82971
16188 -82971 -70336 -19974 2697 25046 8041 -10041 23624 52851 37010 37860 97392 99916
16176I9916P72k361j352n1127k4570L2784k7143m6844L647L597j8308M7676N8894
16163G5581L6334j2866j5045k0291l7232j273L1751l7447j2240j4494m4003j9428
16151g0653J6718K7093J4808J5396m429Q456o863j3996j3727k5078L2760L4865
16139A5350m6073l1217N1759M674j6586k9981N4707M2558m8706m9159J1686J8553
16127b2435m7222J6254K9240o929L9555N4065Q357j8279l4371k0049R713L265
16115A1164p5872L226J2868p808j5187N067p864j8386o552M4237J7286o016L3435
16102a0402M628j2258p00L3048K5712K5787m4569j186o0027j2092R595L2068p591
16089a7987l5937K9310K1903k6475J5412O871n009K3148L0352m644l8019n841
$$ plain form
16176 99916 100688 98327 96975 45848 21278 54062 26919 -19925 -16278 -12681 -30989 16687 75581
16163 75581 111915 99049 84004 63713 26481 25208 56959 19512 7272 -7222 -51225 -70653
16151 -70653 -53935 -26842 -12034 3362 -1067 7389 526 -13470 -27197 -52275 -19515 15350
16139 15350 -30723 -61940 -10181 -5507 -22093 -52074 2633 45191 -3515 -52674 -40988 -22435
16127 -22435 -69657 -53403 -24163 -31092 8463 62528 70885 52606 18235 -1814 7899 11164
16115 11164 -64708 -61482 -48614 -56422 -71609 -66542 -74406 -92792 -99344 -55107 -37821 -43837 -10402
16102 -10402 -5774 -18032 -18732 14316 40028 65815 21246 20060 -39967 -52059 -42464 -10396 -17987
16089 -17987 -53924 -24614 -2711 -29186 -13774 -6903 -11912 11236 41588 36944 -1075 -6916
16077f916m2445l4858m5771n8796K5484J00873M2612m6661m6069k33O034M165
16065a02581K3680j939j454l6217K5232R2172o005J0789j0289P531M8246r732
16053C9433l1664j9884J1978J5984m5722M3421K4879m6697l1188k8285J1176l9927
16041i6496L1156K9178J2898j0647L7596L4047l1058n8682M0202N219k6203R026
16029b3764m5330o77M7892K3737m0993L5107j9377j2716M4073j2110j113J5361
16017A0090L850M4846m1139J4294O1682k1054K3188r903l9292j296k0201l2275
16005g210l270K2286j5784n3508N338Q7455L4149k2892l8164L8852k8491j2082
15993F679L736m4530n2526j3262k7610J5496K8957L0462J2318J4034m1050j4578
$$ plain form
16077 -6916 -49361 -84219 -129990 -188786 -163302 -62429 -19817 -66478 -112547 -112780 -106746 -102581
16065 -102581 -78901 -80840 -82294 -118511 -93279 -1107 -7112 3677 -6612 919 49165 39433
16053 39433 7769 -12115 -137 15847 -29875 13546 38425 -8272 -39460 -67745 -56569 -96496
16041 -96496 -65340 -36162 -23264 -33911 3685 37732 6674 -52008 -11806 -6587 -32790 -23764
16029 -23764 -69094 -69771 -21879 1858 -39135 -4028 -23405 -36121 7952 -4158 -5271 10090
16017 10090 13940 58786 17647 31941 93623 72569 95757 85854 46562 45266 25065 -7210
16005 -7210 -10480 11806 -3978 -57486 -52148 35307 69456 46564 8400 47252 18761 6679
15993 6679 10415 -34115 -86641 -99903 -127513 -112017 -83060 -52598 -40280 -26246 -67296 -81874
15981h1874L4929j6544l2152K4382K4074k247K7105N235o2937j7047L9877M318
15969e2881l0123K7786J6867n918l7126p836K7405M878K5018M6623j5185l240
15957c732J990O586r707j991k128O661L3986k3825p9522m777J7762l1546N5592
15944c4651J7138k544n3788q367J3779M0713j620k1927M2668m3594o261k5905
15932h4359J391O1368L9397O2944j2425k4377r422k6472k8948Q605P0810j5067
15920D3445k2245j6800o760N4442L2546k2469m5971n5667m8102N502K9106L3043
15908a9930l6649J0856N1893N4771N7836m3407l4835m4466l5161K5896J542J4408
15896B754m2905l794j8149K0661J4232j3561l050r184q318n431J8324J7185k0682
$$ plain form
15981 -81874 -46945 -63489 -95641 -71259 -47185 -49432 -22327 -17092 -80029 -97076 -57199 -52881
15969 -52881 -83004 -55218 -38351 -44269 -81395 -89231 -61826 -56948 -31930 14693 -492 -3732
15957 -3732 -1742 4844 -4863 -6854 -8982 -2321 31665 7840 -71682 -76459 -58697 -90243 -34651
15944 -34651 -17513 -20057 -73845 -82212 -68433 -27720 -29340 -51267 -8599 -52193 -58454 -84359
15932 -84359 -82968 -21600 17797 80741 68316 43939 34517 8045 -20903 -12298 58512 43445
15920 43445 21200 4400 -2360 52082 84628 62159 16188 -39479 -87581 -82079 -52973 -19930
15908 -19930 -56579 -45723 6170 60941 118777 75370 40535 -3931 -39092 -13196 -11654 2754
15896 2754 -40151 -43945 -62094 -41433 -27201 -40762 -43812 -52996 -61314 -66745 -48421 -31236 -51918
15883e1918q013l6022K9915M7777L3331M7724l1804j8091l5164q8957K6306M6389
15871c8527K9069j9231J6462l384o2785j1016K623M0236K5455K8233m933j7060
15859a4858k0130K3026j3236j7561l2443K8708J1453J6531j2115K6148K6187J6162
15847C7872j2323k0490L1236j426k9619K1578m2811n7246q011M3873L1843l066
15835h590L2910p524l2245J9813J5802q462j3943l8098j8446J9532q962N6120
15823G907L004k2826k7872k8619j6119L5316O498O329j1107r483o7442r8l943
15810a28455L3441O0326J5314n536j0303n18n38L3224L9903q347m3721j083L5674
15797A9381l2126l7206k508P9199N6042n7274r7875j3184J06301L7950Q190K9349
$$ plain form
15883 -51918 -59931 -95953 -66038 -18261 15070 62794 30990 12899 -22265 -111222 -84916 -38527
15871 -38527 -9458 -28689 -12227 -15611 -78396 -89412 -86789 -46553 -21098 7135 2202 -14858
15859 -14858 -34988 -11962 -25198 -42759 -75202 -46494 -35041 -18510 -30625 -4477 21710 37872
15847 37872 25549 5059 36295 34869 5250 26828 -15983 -73229 -81240 -37367 -5524 -8590
15835 -8590 24320 16796 -15449 4364 20166 11704 -2239 -40337 -58783 -39251 -48213 7907
15823 7907 10911 -11915 -39787 -68406 -84525 -49209 -42711 -36382 -47489 -56972 -124414 -124512 -128455
15810 -128455 -95014 -34688 -19374 -24910 -35213 -35731 -36269 -3045 36858 28511 -15210 -16293 19381
15797 19381 -12745 -49951 -52459 26740 82782 25508 -72367 -85551 20750 58700 66890 96239
15785I6239Q227k9862k7540o2772K00j4533j3465j7184n3862j5697M3938L3503
15773e2808M8948q909o1928J2242o306K9269k9370n049N7666K2580L0272r045
15761B7562o5776j6242l4652p5J713n3616N3073J9953j3403P1588j267m4903l5
15748e6080J9192L4581J170N5333J1660j7828q154j7781k1421L0804p119m1356
15736a6999m2425n906j797K2608r806J1154l588j4972N0263N6670n287k9589l1254
15723b0928j7908j388R694m248J1976J2050J5160k0383k8391r988J2454R483k7031
15710e9448m127K8645K9059J232J0991n4994P790L4380q138M1870L4136k823j8199
15697D0374k6687l5723K0835n0027k4117K9304J7119q214k310J2858J4879O909
$$ plain form
15785 96239 104466 74604 47064 -15708 -15508 -30041 -43506 -60690 -114552 -130249 -86311 -52808
15773 -52808 -3860 -12769 -74697 -62455 -68761 -39492 -68862 -73911 -16245 6335 36607 27562
15761 27562 -38214 -54456 -89108 -89183 -87470 -141086 -88013 -68060 -81463 -9875 -11142 -56045 -56080
15748 -56080 -36888 -2307 -1137 54196 65856 48028 39874 22093 672 31476 24357 -16999
15736 -16999 -59424 -65330 -67127 -44519 -54325 -43171 -46759 -61731 -11468 45202 39915 10326 -20928
15723 -20928 -38836 -40224 -30530 -34778 -22802 -10752 4408 -15975 -44366 -54354 -41900 -32417 -59448
15710 -59448 -63575 -34930 -5871 -4639 6352 -48642 -40852 -6472 -14610 27260 61396 58573 40374
15697 40374 13687 -22036 -1201 -51228 -75345 -46041 -28922 -37136 -39446 -26588 -11709 -4800
15685d800l1290n2289N7257N5726K3980J4331L5357j3785p7245n8115o0794L4457
15673g7210N5535l225J5515k4704l4156k4885K8919K5761m845J5085Q207J1021
15661h982k2411l315K1808K654n6248o6071j2758M6192N907K2973O4479n240j5409
15648b6421l7002j1625l3595j378N150Q3664J7018L3071k2590l8452j3351M4879
15636f32M3479m6814n9386N0955K9506O225q148l1810k0626O359m541J7212k0268
15623c8489N471O0724J4662m7705k2203L1579j3564K0533N5195r050J8324O935
15611H2412m3800k8011J3540l1036K3883O992l4506O7199O5391m2103q6853o9414
15599g6306k8555j347n764O5724J2488j6106K5550L3795l4167m7949L4300K0487
$$ plain form
15685 -4800 -36090 -88379 -31122 24604 48584 62915 98272 84487 7242 -50873 -111667 -77210
15673 -77210 -21675 -24900 -9385 -34089 -68245 -93130 -64211 -38450 -43295 -28210 -20003 -8982
15661 -8982 -31393 -34708 -12900 -10246 -66494 -132565 -145323 -99131 -93224 -70251 -5772 -11012 -26421
15648 -26421 -63423 -75048 -108643 -110021 -104871 -21207 -4189 28882 6292 -32160 -45511 -632
15636 -632 42847 -3967 -63353 -12398 17108 23333 15185 -16625 -37251 -30892 -35433 -18221 -38489
15623 -38489 -33018 27706 42368 -5337 -27540 4039 -9525 11008 66203 57153 75477 82412
15611 82412 38612 10601 24141 -6895 16988 23980 -10526 56673 122064 79961 -6892 -76306
15599 -76306 -104861 -106208 -111972 -46248 -33760 -49866 -24316 9479 -24688 -72637 -38337 -17850
15587a7850M2762R133K6521n2692J8982m522r359L1216k7732p954k8064k2417
15575d1976N3900N4890j7431m6244n6672m9257j836L7237L3724L3106O2449K649
15563F4539Q866k8659l8417j4691J5223J8529n658N832k6480l3460M6800n246
15551G178J0042K515k3431m3540o9543J1353N248M1619M9395L2687k6198n4978
15539e7653N502P4174j0721p3759j8017K8748M5642J02416J3726l7950k3075j373
15527D7660l6561o8929m6910l042P2691K7437K0654m635M3309o061j8004l881
15515B3728K9846k8449L0461K7680j1559p304L4788j6685j3894l4306m7891L1078
15503A7493k8236k0268m1010k1619O2914j6898O1737K9977k2852k6668K6187l2339
$$ plain form
15587 -17850 24912 34045 60566 7874 26856 22334 12975 44191 16459 8505 -19559 -41976
15575 -41976 11924 66814 49383 3139 -53533 -102790 -104626 -67389 -33665 -559 61890 64539
15563 64539 73405 44746 6329 -8362 6861 25390 19732 25564 -916 -34376 12424 7178
15551 7178 17220 19735 -3696 -47236 -116779 -105426 -100178 -58559 -9164 23523 -2675 -57653
15539 -57653 -52151 22023 11302 -62457 -80474 -51726 -6084 96332 110058 72108 49033 47660
15527 47660 11099 -57830 -104740 -107782 -35091 -7654 13000 8365 51674 45613 27609 23728
15515 23728 53574 25125 55586 83266 71707 64403 99191 82506 68612 34306 -13585 17493
15503 17493 -10743 -31011 -72021 -93640 -30726 -47624 14113 44090 21238 -5430 20757 -11582
15491a1582m269j3807M5122N8447K4797m85o0750m7614O454p74J6209k1278j2864
15478b2394p139K5107P0k8394j390J9037j1591k5275L4850J5148j4892j4542O3345
15465C1940J8796J2120l489k8724j9954Q028J9187K4634L4393j9046o4833L6210
15453D9262J9573K7134q0733n7220l9721p91J3563j4064l6793K4090Q604Q059
15441g9037K8665K1589o408j9804M000K3752L3799m848K5310j9622l0582J5131
15429h055L215J9809J2959m1401m1619M087J3312J660Q0288K9363j5929Q502k034
15416F4157O456R896k8403j2634n9754n9283J6395N8931l3111K1468K1146j810
15404C454K3416k4393k1355N23J6391k9897P763j5732m3811j3906J2888P1197
$$ plain form
15491 -11582 -15851 -29658 15464 73911 98708 98223 37473 -10141 -3687 -4461 11748 -9530 -22394
15478 -22394 -29533 -4426 -4356 -32750 -34140 -15103 -26694 -51969 -17119 -1971 -16863 -31405 31940
15465 31940 50736 62856 59367 30643 10689 18717 37904 62538 96931 77885 13052 49262
15453 49262 68835 95969 15236 -41984 -81705 -82496 -68933 -82997 -119790 -95700 -87096 -79037
15441 -79037 -50372 -28783 -35191 -54995 -50995 -27243 6556 1708 27018 7396 -23186 -8055
15429 -8055 -4840 14969 27928 -13473 -55092 -51005 -37693 -36033 44255 73618 57689 66191 64157
15416 64157 70613 80509 52106 39472 -20282 -79565 -63170 -4239 -37350 -15882 5264 3454
15404 3454 26870 2477 -18878 -18355 -1964 -31861 -24098 -39830 -83641 -97547 -84659 -13462
15392a3462M5974l4901N586L3372O6488K3304p0161l7150l8973Q035O2616J3811
15380F4539l611L7411N937m5294m6621m9589L0625K9917m883j6046M8381q778
15368D1988o1902R009M7674j0198M060J71j1375N3136o346n5020k4295M5258L6380
15355F8540m4891q6320k9688O0505M2928j7341j0497k1783N576m870K4315L0143
15343A6617L0189K4489J6147k4654j2710M8951K8378k3774m4071j9371L997l8067
15331F121N9754M0093k6938o8462k8116p187l5715J5222Q163J7927j402J8805
15319a735j0299m5688L2189N0627O844m781k5765j8769K7165J8121n848J912M0828
15306F4801m355j4145l9802q109P3104L2473n1208K5135j1198l5335j0526J103
$$ plain form
15392 -13462 32512 -2389 3197 36569 103057 126361 56200 19050 -19923 -11888 50728 64539
15380 64539 60928 98339 104276 58982 12361 -37228 -6603 23314 18431 2385 50766 41988
15368 41988 -19914 -10905 36769 26571 30631 30802 19427 72563 66217 11197 -13098 32160 68540
15355 68540 23649 -62671 -92359 -31854 11074 -6267 -16764 -38547 -32971 -37841 -13526 16617
15343 16617 46806 71295 87442 62788 50078 99029 127407 103633 59562 40191 44188 6121
15331 6121 65875 105968 79030 10568 -17548 -24735 -60450 -45228 -37065 -19138 -20540 -1735
15319 -1735 -12034 -57722 -25533 25094 31938 27157 1392 -17377 9788 27909 22061 23973 64801
15306 64801 60446 46301 6499 -1610 71494 103967 52759 77894 66696 31361 20835 21938
15294B1938j0832j3937l3497K6199L0061L6254J3745M620L6611P21k2632l5768
15282E3483J5320K7188k9216l2634k9871Q491k438j5997m9392r324r80K9895K4491
15269a0984K7945m332k3310O018l160J7757j9664L9528Q6252k250m1733O58K5926
15256I8651k906q8111m9772J8798l5458k3974j077o68O4031M016O780L6184K8523
15243E5017l1872k4046n5377P806O2003Q2685J2305m4381m5932p7816J5640l1453
15231g5421J8357K9725J0118j5010n2813N478M2524M3365K9619r18n5833p312
15219b8121k0457j7534k5723O495M0903m408k0836P537K6553P4309J7046m9628
15207F136n096l2161q994j4815m4374N834L8958P1210Q5594L6979o6099o7446
$$ plain form
15294 21938 11106 -2831 -36328 -10129 19932 56186 69931 74551 111162 111883 89251 53483
15282 53483 68803 95991 66775 34141 4270 12761 10323 -5674 -55066 -64390 -65370 -35475 -10984
15269 -10984 16961 12629 -10681 -4663 -7823 9934 -9730 29798 116050 113800 72067 72725 98651
15256 98651 95745 7634 -42138 -23340 -58798 -82772 -83849 -84517 -20486 -16470 -9690 26494 55017
15243 55017 23145 -901 -56278 -48472 13531 96216 108521 64140 18208 -59608 -43968 -75421
15231 -75421 -57064 -27339 -17221 -32231 -85044 -79566 -37042 6323 35942 35024 -20809 -28121
15219 -28121 -48578 -66112 -91835 -85340 -44437 -48845 -69681 -62144 -35591 38718 55764 6136
15207 6136 1040 -31121 -40115 -54930 -99304 -93470 -54512 16698 102292 139271 73172 5726
15195E726k7784j1610k4269K3193R392P787Q5150M2070k0774Q818j2055k010J3693
15182I7327l1162p1787j1607Q9639K9261m2324j842q98p6441M175L3501l8505
15170b0663k3519J4385o142k8187j1783O287O1484L1343L1346m2136k6270J807
15158a2048O088L920L3716J1273Q602J0930M7189K7013m3902n3972J9191K0315
15146G8315l8961l8574l3860J2674K8783j6238k521L1243j4239k076j5727j9021
15134c0202R306q523R499K4552k193M3567K9577l0176l1424L787k7210J5564p415
15121a291k1687P297P325k742N1096l3124o8697J42M3073L036j0345k7758J2483
15108d1192J1490K4722m4277j7614O3986P86O3492M6355j897j5428J5203J2454
$$ plain form
15195 5726 -22058 -33668 -57937 -34744 -25352 -17565 67585 109655 88881 97699 85644 83634 97327
15182 97327 66165 -5622 -17229 72410 101671 59347 57505 56607 -19834 -15659 17842 -20663
15170 -20663 -44182 -29797 -35939 -64126 -75909 -69622 -8138 23205 54551 12415 -13855 -12048
15158 -12048 -5960 -2040 31676 42949 51551 62481 109670 136683 92781 38809 58000 78315
15146 78315 39354 780 -33080 -20406 8377 -7861 -10382 20861 6622 4546 -11181 -30202
15134 -30202 -20896 -29419 -19920 4632 2439 46006 75583 45407 13983 17770 -9440 6124 -1291
15121 -1291 -22978 -15681 -8356 -11098 39998 6874 -61823 -61681 -18608 -15572 -25917 -53675 -41192
15108 -41192 -29702 -4980 -49257 -66871 -2885 -2099 61393 107748 105851 90423 105626 118080
15096A18080k7965m6221r314l6008L616k3021P3798L8461j7985r809l803k0527
15084C9302j4500K0836L7077j3920K237m1471k6685J1820o216m5619o178J9817
15072b3500j682K524J2451K131M841M6874j5953n9030J0206L8903L3191m1499
15060I457j9625K8153j4597k1799J1808L7949N1441j8243k6687n1480J2551L5353
15048C4281K1782l3167K7658K4627j5273k0410k3001J3168K6067j7049J6498J0698
15036F5879j423l118k2805N2685N7176N2864K203l8362n7596m9548J1453J03986
15024A73394l5819o5030l3766j0484J6082k3208l4137p250J3290N0057K1369n4821
15012I677J3424l2685K7824K3517j1448j1562k0078J1228m2417L762l359l160
$$ plain form
15096 118080 90115 43894 34580 -1428 2188 -20833 52965 91426 73441 63632 59829 39302
15084 39302 24802 45638 82715 68795 71032 29561 2876 14696 8480 -37139 -43317 -23500
15072 -23500 -25182 -22658 -10207 -8076 -3235 43639 27686 -31344 -21138 17765 50956 9457
15060 9457 -10168 17985 3388 -18411 -6603 31346 82787 64544 37857 -13623 -1072 34281
15048 34281 56063 22896 50554 75181 59908 39498 16497 29665 55732 38683 55181 65879
15036 65879 64456 61338 38533 91218 148394 201258 203461 165099 107503 57955 69408 173394
15024 173394 137575 72545 38779 28295 44377 21169 -12968 -20218 -6928 43129 64498 9677
15012 9677 23101 -9584 18240 41757 30309 18747 -1331 9897 -32520 -28758 -32117 -35277
15000c5277M9726k4657p3840r101K3191P1228J5011m0219q63J2115L3543K3830
14988D4687k2712J6020r849j5691J0928L3305J80k8391J0631L3886j4583P727
14976F6138J2861K9538l6237l7843M7482K3494k8858m3394l9327J5814j9601K5804
14964A5871l3436n1818R240J8955m838L1065N2464M6964j8374L1895N790o4109
14952C9669r744j5045L9109k05L5646k4558k8217l3232l4125l2752j9105R255
14940g3304K7149L7741L283k4189J3841O7858L3120J212j3473l7854n1324Q864
14928g076L4178r991L0323l4778r670K0960j5190L3702o372p387l506K9055L3328
14915H7576M2860l3574q2561l2361J1859K197K065o212L2668K4267j2834m5151
$$ plain form
15000 -35277 14449 -10208 -84048 -93149 -69958 1270 16281 -23938 -24801 -12686 20857 44687
14988 44687 21975 37995 28146 12455 23383 56688 56868 28477 39108 72994 58411 66138
14976 66138 78999 108537 72300 34457 81939 105433 76575 33181 -6146 9668 -9933 15871
14964 15871 -17565 -69383 -60143 -41188 -46026 -14961 37503 84467 66093 97988 103778 39669
14952 39669 29925 14880 53989 53784 89430 64872 36655 3423 -30702 -63454 -82559 -73304
14940 -73304 -46155 -8414 -5131 -29320 -15479 52379 85499 86711 73238 35384 -15940 -7076
14928 -7076 27102 17111 47434 12656 2986 23946 8756 42458 36086 28699 25193 54248 87576
14915 87576 130436 96862 14301 -18060 -6201 -4004 -1939 -8151 24517 48784 35950 -9201
14903i201J3050J7274P2344M3357j3577K2737j4806L2146j4041o6521L0424J2549
14891A25735o8630m1440l002l8165m9644m4308L5570Q677R9536Q7498R507r655
14879A11679m0746q0241m2214M4581N5869L2742m019k7237N681l2437l152K010
14867B2516j5985j2866j9505j581J8394J4138K8899k0565k9379K811q041O0286
14855C9122l8588M6373m9899l5024N9773K4748r935l4801j9779k1129N5382M1215
14843E7458j0586l215j4334k7460Q31l1662k5442n908o872J3999L7008R758J4824
14830H399P957J9176k145j5414k9967q719M0902J1092q410L6564o4986l0290K6684
14817i157l6907p794r564n3631O3659P5594M7858K47l8051l9426J450J7436K1118
$$ plain form
14903 -9201 3849 21123 93467 136824 123247 145984 131178 163324 149283 82762 113186 125735
14891 125735 57105 15665 12663 -25502 -75146 -119454 -83884 -75207 24329 111827 121334 111679
14879 111679 70933 -9308 -51522 -6941 48928 81670 77651 50414 56095 23658 20506 22516
14867 22516 6531 -6335 -25840 -27421 -9027 5111 34010 13445 -15934 -13123 -21164 39122
14855 39122 534 46907 -2992 -38016 21757 46505 36570 1769 -18010 -39139 16243 57458
14843 57458 46872 43657 29323 1863 2694 -28968 -54410 -60318 -67190 -53191 -16183 -6425 8399
14830 8399 16356 35532 33387 17973 -11994 -20713 20189 31281 22871 59435 -5551 -35841 -9157
14817 -9157 -46064 -53858 -63422 -117053 -53394 22200 70058 70305 32254 -7172 -5722 11714 32832
14804C2832K5995n2447L3707J655n669M1722K3506n4454l9744k5371N390M4021
14792C1143k8077p266K8269k6718j0036l4178P049j8660j4620L5677O3460M9876
14780G5919K9387o9993k6137p180m6154k6182j7625J1955J3067l3779k76J1171
14768h5827J4431J8398J6368K8062O5974M3330l0633l4006l2070K6088L7564k5059
14756D2620l969J492k5316n9161p766K2367N8600m3294k5022J7009K8810K8813
14744C5183J2297m0829l7694j0012M3371K7845l1867m1096J4095J2789l5764J194
14732e0488R094K6257M015m1428k8946j2029p139O44K8526L1084J3700o51O35
14719b6726P546l5901p406L2935K087J3913K3008J7155j9297l5985k0634L2010
$$ plain form
14804 32832 58827 6380 40087 41742 36073 77795 101301 46847 7103 -18268 -12878 31143
14792 31143 3066 -4200 24069 -2649 -12685 -46863 -39814 -58474 -73094 -37417 26043 75919
14780 75919 105306 35313 9176 1996 -44158 -70340 -87965 -76010 -62943 -96722 -96998 -85827
14768 -85827 -71396 -52998 -36630 -8568 57406 100736 70103 36097 4027 30115 67679 42620
14756 42620 38651 40143 14827 -44334 -52100 -29733 28867 -14427 -39449 -22440 6370 35183
14744 35183 47480 6651 -31043 -41055 2316 30161 -1706 -42802 -28707 -15918 -51682 -50488
14732 -50488 -41394 -15137 -11122 -52550 -81496 -93525 -100664 -100020 -71494 -40410 -26710 -27361 -26726
14719 -26726 -19180 -55081 -62487 -29552 -27465 -13552 9456 26611 7314 -28671 -49305 -17295
14707a7295J5973R675J0701l3947J3887M192l6385k8406J5099M6557M2949p3579
14695c0579J8669R603L5515M270j3749n1486J5443K9959j0530J821j2448J0829
14683G317n0111k5639k1276R571M6905K2859K5817L1316L1969p632k9082k6369
14671A5645l0671l4026k7706R277K4838P554O5882o652K8960N077j6124r644M3051
14658G5461p616r259K6324n2216j5978k9536r417J0726M4692n791k2035J9008
14646B4363m6326j3416N81R533L6039N768k2553M7300m3183o6955j3884K1352
14634f1381J4258j707J2693J071p745j4515k162L2930j4378L1061l19J2677j0561
14621h078l4183j8912K6490L3623k4360K8580K8519Q142k790r591l6207K3413
$$ plain form
14707 -17295 -1322 8353 19054 -14893 -1006 3186 -33199 -61605 -46506 51 43000 -30579
14695 -30579 -11910 -2307 33208 37478 23729 -27757 -12314 17645 7115 8936 -3512 7317
14683 7317 -42794 -68433 -89709 -80138 -33233 -10374 15443 46759 78728 71096 42014 15645
14671 15645 -15026 -49052 -76758 -67481 -42643 -35089 30793 24141 53101 58178 42054 32410 75461
14658 75461 67845 58586 84910 32694 16716 -12820 -22237 -11511 33181 27390 5355 24363
14646 24363 -21963 -35379 -34798 -25265 10774 16542 -6011 41289 -1894 -68849 -82733 -61381
14634 -61381 -47123 -48830 -36137 -35066 -42811 -57326 -59488 -26558 -40936 -9875 -10194 2483 -8078
14621 -8078 -42261 -61173 -34683 -1060 -25420 3160 31679 39821 37031 27440 -8767 14646
14609A4646P672m5654j1925P0323j1344n0447J704j5561p606K3809M8437K452
14597B6506j044J627L8301M5788K0447l6605m8119j1727L7279R623n4857j4204
14585A3015m891l1121L1470M9471m568j1401l6820j6174J9762l8408l9951J4827
14573e4789K0279j6056k5516r531P3012N204P812L6468k958p9529j5259O2348
14561A485N3040o272m3540p1794P250N5668N5252n251l2637J9848p207j0506j6744
14548a408m4834l8209K1147R097Q894r385l617J0129N5558O281l6667L068L1145
14535A1199N1715M1188p711k3236m2682n7322J7206K9564l0292p3102j6579N6912
14523d3140M2619j3855m8267l6481j0804O89J9132L7809K9339J2605L5925k5150
$$ plain form
14609 14646 22318 -23336 -35261 35062 23718 -26729 -25025 -40586 -48192 -24383 24054 26506
14597 26506 25462 27089 65390 111178 131625 95020 46901 35174 72453 82076 27219 13015
14585 13015 8124 -22997 8473 57944 53376 41975 5155 -11019 8743 -29665 -69616 -54789
14573 -54789 -34510 -50566 -76082 -85613 -12601 -7397 415 36883 33925 -45604 -60863 1485
14561 1485 54525 48253 4713 -67081 -59831 -4163 51089 45838 13201 33049 25842 15336 -1408
14548 -1408 -46242 -84451 -63304 -54207 -45313 -54698 -58315 -48186 7372 13653 -23014 -19946 11199
14535 11199 62914 104102 96391 73155 30473 -26849 -9643 19921 -10371 -83473 -100052 -43140
14523 -43140 -521 -14376 -62643 -99124 -109928 -109239 -90107 -52298 -22959 -10354 25571 421
14511D21m2445k856K0403k4570j333m4976J5980O54j0665o0914k111M9491n377
14498a08298M7966L4400N518J9576j3670m5735K87L0288Q99L0218l901j6491L291
14485a5652Q074r918k2440q13P938M1163Q922l6452l7293K9232L2650l8599q562
14472d1750N5091N2082l657l1868k4658j6383k7023N9469K8576J0632M764m3529
14460B1746o5522J8441L0455L5780L5139K8584j8878Q994j2290l7341l1299j2047
14448A762N8858L2774Q367J670j7473k9353M7655J0172m5729K467p520k4374j2708
14435B6568o1259R734l0630j1780j1824P988M8273J03015L1159j2050R227l9315
14423F9106m712l0776p826K432K2062k9035p372l992Q554k36J4393M5074m5516
$$ plain form
14511 421 -42024 -44880 -24477 -49047 -50380 -95356 -79376 -78722 -89387 -150301 -152412 -102921 -108298
14498 -108298 -60332 -25932 -20414 -838 -14508 -60243 -59956 -29668 -28769 1449 -2452 -18943 -15652
14485 -15652 -7578 -17496 -39936 -40749 -32811 8352 17274 -19178 -56471 -27239 5411 -33188 -41750
14472 -41750 13341 65423 61766 29898 5240 -11143 -38166 21303 49879 60511 65275 21746
14460 21746 -43776 -25335 5120 40900 76039 104623 85745 94739 82449 45108 13809 1762
14448 1762 60620 93394 101761 103431 85958 56605 104260 114432 68703 71170 63650 39276 26568
14435 26568 -34691 -24957 -55587 -67367 -79191 -71203 -22930 80085 111244 99194 108421 69106
14423 69106 64394 33618 25792 28224 50286 21251 13879 9887 18441 18205 32598 77672 32156
14410C2156N544o268k9323m6986L4283Q0753L4520j0069l626j6565m6771m6030
14398a8382p087L4998k1738n6789N0813R262K4024j6898j4818j340j5222n97O128
14385b7646L0977L5466k8897j0533J443n773J346L2018m472P50k8577l3172K1080
14372a5990k1183q874K3854K9304O805k638m4819L9597M6548J0476l9358j8691
14360E031L8580L3231m1475m5647L0378P231k1203j6994j8637M91j7990k9374
14348g6378J7049P608J2310J2197J0732J3837N2735K8565K5267N856j8750P749
14336I8777n3533o333R606p1021k9459M6327L3511J3273K2326k0167j8841J7183
14324D1649M4176k2369o1663m0726p816J7714Q9747M8138m2145m7633l5609p951
$$ plain form
14410 32156 37700 31432 2109 -44877 -10594 70159 104679 94610 90984 74419 27648 -18382
14398 -18382 -25469 9529 -12209 -68998 -18185 -8923 15101 -1797 -16615 -17955 -33177 -33774 -27646
14385 -27646 3331 38797 9900 -633 810 -4963 -3617 28401 23929 24679 -3898 -37070 -15990
14372 -15990 -37173 -46047 -22193 7111 13916 11278 -33541 6056 52604 63080 23722 5031
14360 5031 43611 76842 35367 -10280 20098 27329 6126 -10868 -29505 -29014 -47004 -76378
14348 -76378 -59329 -51721 -39411 -27214 -16482 -2645 50090 78655 103922 109778 91028 98777
14336 98777 45244 38911 48517 -22504 -51963 -5636 27875 41148 63474 43307 24466 41649
14324 41649 85825 63456 1793 -38933 -46749 -29035 60712 108850 66705 19072 -16537 -24488
14312b4488M5826N9707J0546n1536k7753K2479k9613j9052J2508J677j1819L7897
14300B6379M4170K9757l8373j4789J9103l1458j6442J6413m838J8042J7844j8664
14288D7144l114n0172k5073J7831k9059j0552P377j893L7362p211K2720p082J8370
14275A6648j6768P575L6166j5434L7486m3737o5794J4674j4344j1339L0579j4686
14263c8974k6623J826k5669o3276P1152O1166k0485M0418j3709j4053K5018j8917
14251b2126N0382M525l1419o696J3940l091J3721M540k2498j7175j2540M929L9974
14238A6466Q022j2105K991J2894Q649l6680k7812j5454J6663M4086M2974n466
14226E5228L26j7308M9527j4828l4704q514Q376k9550K1462L38k3371j279J0613
$$ plain form
14312 -24488 21338 81045 91591 40055 12302 34781 5168 -13884 -1376 301 -11518 26379
14300 26379 70549 100306 61933 47144 66247 34789 18347 34760 29922 47964 65808 47144
14288 47144 44030 -6142 -31215 -13384 -42443 -52995 -45618 -47511 -10149 -17360 5360 -1722 16648
14275 16648 -120 7455 43621 28187 65673 21936 -43858 -29184 -43528 -54867 -24288 -38974
14263 -38974 -65597 -63771 -89440 -152716 -81564 -20398 -40883 -465 -14174 -28227 -3209 -22126
14251 -22126 28256 32781 1362 -5334 8606 5515 19236 23776 1278 -15897 -28437 -23508 16466
14238 16466 24488 12383 15374 28268 36917 237 -27575 -43029 -26366 17720 60694 55228
14226 55228 55554 38246 87773 72945 38241 29727 38103 8553 30015 30353 6982 5703 16316
14213A6316k7031o815j1531l0538L8410N8620N7261L1836j6559m2807r006K3311
14201H1467M8933L0959N7160j1382p7263M15L0091m589R5388O6303O867M7774
14189C72123Q7814M276K133n5830r5581j06716m6336o0893m5041N5553O2160K490
14177A76152j4764q177K7030l3634j3327n933j0330j798m5011j3861k9470k7348
14165d71L1856L6044p6885j8890J5628N7221K5969l3150k1644N2919L036J662
14153G3295o316n7589o0690j3856L9287j9588k4185j6018L5949Q803j5455L8963
14141a7400J3930N4414J4727j7587j5378j028J9206Q349m3785p592q533M4745
14129D4068j427j0393o09J7485N350m4267k3022J6219N7303P1821j7007k4465
$$ plain form
14213 16316 -10715 -17530 -29061 -59599 -21189 37431 94692 126528 109969 67162 58156 81467
14201 81467 130400 161359 218519 207137 129874 130289 160380 155791 251179 317482 324349 372123
14189 372123 459937 464213 466346 410516 314935 208219 161883 100990 55949 111502 173662 176152
14177 176152 161388 153211 180241 146607 133280 127347 117017 115219 70208 56347 26877 -471
14165 -471 31385 67429 -9456 -28346 -12718 44503 70472 37322 15678 68597 71633 73295
14153 73295 66979 9390 -51300 -65156 -25869 -45457 -69642 -85660 -49711 -40908 -56363 -17400
14141 -17400 -3470 50944 65671 48084 32706 31678 50884 59233 15448 7856 -677 44068
14129 44068 42641 32248 31639 49124 54474 10207 -12815 3404 60707 132528 115521 91056
14117I1056j676j312J8892J538q550j7884j7456r597n2457l3137J2714L8002K0371
14104D0504o920o9991n7176m390N0916K2529K7328P0032K0958j6393R943m1839
14092D5501m9832k8736j3303M891L4912k7692K201O051k883L8475l150o337k9743
14079b9645k3782J6973M8087r17j4302k6418N19J8422R681n0687o6143K0875l9105
14066a36442L6052J4226l3172M3037M1955M9335O1564L2665L0577j3629m4447
14055H1721p0912k5069j9112L5409K0560m450l375L3544J2141m2606L645j535
14043A9961l2106K5247M311K6110j716L2573J8330K580K2054O914n189J9459J1649
14030A50177l7835j4588l0402K490L573L2716j4373l0329K4986N8912L4079j8029
$$ plain form
14117 91056 89380 88068 106960 108498 99948 82064 64608 55011 2554 -30583 -17869 20133 40504
14104 40504 33584 -36407 -93583 -97973 -47057 -24528 2800 72832 93790 77397 87340 45501
14092 45501 -4331 -33067 -46370 -41479 -6567 -34259 -32058 -26007 -28890 9585 6435 98 -29645
14079 -29645 -53427 -36454 11633 10716 -3586 -30004 -29485 -11063 -1382 -52069 -118212 -97337 -136442
14066 -136442 -100390 -86164 -119336 -76299 -34344 14991 76555 109220 139797 126168 81721
14055 81721 10809 -14260 -33372 2037 22597 18147 14772 48316 60457 17851 21496 19961
14043 19961 -12145 13102 17413 43523 41807 74380 92710 95290 117344 124258 119069 138528 150177
14030 150177 112342 97754 67352 69842 73415 106131 91758 61429 86415 145327 179406 161377
14018A61377L2005K2681l651L9581J7400R1976M5799J2864N2180R3246J74260
14007G39718J51460K16209L20905L19484K07852O8507j14783k98198l30595l25612
13997I54947k71979j48578o4382q0043p1611k226l6099o9372l3735L163k9043
13986A51042l2019l8182m6608k9938M2554P8736l0623K1151J7104l9469m6112
13975D7636R993L5915M1042j7494R502k2465o0049O417O744j592J6846N221o7538
13962A0178n4386P860P5301N7897O1813J3059j293j0843o2502l3928M1536Q282
13950A12974Q138R472J6940J4413j2577Q110j1314J7920N4204O6063M3577L1471
13938C59391K5610j511m6596n5571O3796J69002J81417K43572J82919K15658J84899
$$ plain form
14018 161377 193382 216063 212412 251993 269393 361369 407168 420032 472212 565458 739718
14007 739718 891178 1107387 1428292 1747776 1955628 2024135 1909352 1611154 1280559 954947
13997 954947 682968 534390 470008 389965 318354 316128 280029 210657 176922 180085 151042
13986 151042 119023 80841 34233 4295 46849 125585 94962 116113 133217 93748 47636
13975 47636 57629 93544 134586 117092 126594 104129 44080 50497 57241 55649 72495 77716 10178
13962 10178 -44208 -36348 38953 96850 158663 171722 170429 159586 97084 63156 104692 112974
13950 112974 121112 130584 147524 161937 149360 157470 146156 164076 218280 284343 327920 359391
13938 359391 385001 383490 336894 281323 345119 514121 695538 939110 1122029 1337687 1522586
13927A522586o8274k26527k15781j96881j89352j77488j03874q0122r5810m6138
13917A22339L3674o806l9247K9738M1675j572n0971m693l210n259J7336O225j9006
13904A20223p685L1284K4986o2454J8889k3554m9978k4522J7691j3439k3714l048
13892D679J9340P379J6717N040L3047J9728N9851O274m9468p3578N2391K4529
13880A25929n9427j2565j868K208J4927J1532j7714M988j1201l0142O0613j2761
13868G4519k8574j7379l2878j8297L2257K3824q42N2458n125l5709N315Q2340
13856A31909L4086K037k5276k8501J0274K4578m0524j3061J3184M2713k7574p3996
13844D9849O432l5137k6882L5233P5201J4910j2509J0883l3308n0094J4742J7706
$$ plain form
13927 1522586 1454312 1227785 1012004 815123 625771 448283 344409 264287 168477 122339
13917 122339 156013 149207 109960 139698 181373 179801 128830 124137 120927 115668 133004 139229 120223
13904 120223 112538 143822 168808 106354 125243 101689 51711 27189 44880 31441 7727 4679
13892 4679 24019 31398 48115 53155 86202 105930 165781 172055 122587 49009 101400 125929
13880 125929 66502 53937 52069 54277 69204 80736 63022 68010 56809 26667 87280 74519
13868 74519 45945 28566 -4312 -22609 9648 33472 32630 85088 79963 44254 49569 131909
13856 131909 165995 168032 142756 114255 124529 149107 108583 95522 108706 151419 123845 49849
13844 49849 56281 21144 -5738 29495 104696 119606 107097 117980 84672 34578 49320 67026
13832F7026j3214K201J5507J6140K2181n333k3204k8101l6346k0652P922N3865
13820E7992L2052N0329J0866K1526l9814l4595l1001k5582j5572k5313L0922r792
13808B2018K7345k0118m2894j6265j5381J0422Q0651L6327K4575o589n6594K1491
13796F4988j642N8777L2173M4358l998j5045j2428l3456k6721K0592J3165K1218
13784A61981l6554J7829L0602k921N0676K2406l6149n8680o5530k298j2147P2658
13772A41873P3330J3224K8712K2393j5814J6632J2075l9247K7172n578l7969k8120
13760B08683K9602j2920n5804l3501l8121J3068P4953N1736l2946k2052M431K7280
13748B14409K1678l4142L0783O420l7793l9240k0851P2321L0028j1654p785j410
$$ plain form
13832 67026 53812 56013 71520 87660 109841 104508 81304 53203 16857 -3795 4127 57992
13820 57992 90044 140373 151239 172765 132951 98356 67355 41773 26201 888 31810 22018
13808 22018 49363 29245 -13649 -29914 -45295 -34873 45778 82105 106680 100091 43497 64988
13796 64988 63346 122123 154296 198654 194656 179611 167183 133727 107006 127598 140763 161981
13784 161981 125427 143256 173858 170937 221613 244019 207870 149190 83660 81362 69215 141873
13772 141873 215203 228427 257139 279532 263718 280350 292425 253178 280350 274772 236803 208683
13760 208683 238285 225365 169561 136060 97939 111007 185960 237696 204750 182698 187129 214409
13748 214409 236087 201945 232728 239148 201355 162115 141264 213585 243613 231959 224174 222764
13736B22764l8154r490J8852J8514M0002J1116J589l162K3647J7809K9721N764
13724C38972L3155N8271j0190N291l7173q8546n7620k9745J2602q3281l1554L1785
13712A41967m9950m9897k7816L1722L3621j4024j3848O6620j550l6317K1319K1751
13700A23598n644l3252o5454R403Q0476M7382M1092N7559J6110l8445m3265j9660
13688A69900l1241J1786m3547k7343j6529L418q974k5174O525l4831j0321J078
13676e253K541J6565j0620j499K7840K9609O994P0013M8112Q859l4221p2233l1953
13663E4754J6054K6673L0254J3566J4329k3882k1032o3374k5401k4517J4192N6259
13651F7875J4223r8527p679M2769P2567Q8332Q4845N0216O3472O1641Q8302R7058
$$ plain form
13736 222764 184610 175120 193972 212486 252488 263604 265193 262031 285678 303487 333208 338972
13724 338972 372127 430398 420208 425499 388326 299780 242160 212415 225017 141736 110182 141967
13712 141967 92017 42120 14304 46026 79647 65623 51775 118395 116845 80528 101847 123598
13700 123598 117954 84702 19248 28651 109127 156509 197601 255160 271270 232825 189560 169900
13688 169900 138659 150445 106898 79555 63026 66444 57470 32296 38821 3990 -6331 -5253
13676 -5253 -2712 13853 3233 1734 29574 59183 66177 136190 184302 193161 158940 86707 54754
13663 54754 70808 97481 127735 141301 155630 131748 110716 47342 21941 -2576 11616 67875
13651 67875 82098 -16429 -24108 18661 91228 179560 264405 314621 378093 439734 528036 625094
13639F25094J3218M889K3585m42J4846P6264P3502M6137o7769l9948R89l6980
13627G33385j9502o945L7492M6947R620j6295j331J6575K1563O7033L4101k0564
13615I02079k2927K4481l4491r006J6662r111L8525O9911K4460J9298R346M8649
13603A077876J05370Q5403J2066L5653J4402J5212N5161j9039r090J01796R9876
13592A574686L1438O675m1654M9903P3163L3811O2080J03309Q3547Q3728N6440
13581B117126L5132P1918J28507J23676J20483J38350J52726K14889J77465J70267
13571C450539J61607J61218K52961K03530J77428L29900L81091L73341L68425
13562E860040M33805M85468N86810O63445O08330O26465O60108P52636Q82139
$$ plain form
13639 625094 638312 643201 666786 666344 681190 757454 830956 877093 809324 769376 770365 733385
13627 733385 713883 706938 744430 791377 800997 784702 783371 799946 821509 888542 922643 902079
13615 902079 879152 903633 869142 860136 876798 867687 906212 976123 1000583 1019881 1029227 1077876
13603 1077876 1183246 1268649 1280715 1316368 1330770 1345982 1401143 1382104 1373014 1474810 1574686
13592 1574686 1606124 1612799 1571145 1621048 1694211 1728022 1790102 1893411 1976958 2060686 2117126
13581 2117126 2152258 2224176 2352683 2476359 2596842 2735192 2887918 3102807 3280272 3450539
13571 3450539 3612146 3773364 4026325 4229855 4407283 4737183 5118274 5491615 5860040
13562 5860040 6293845 6779313 7366123 8029568 8637898 9264363 9924471 10677107 11559246
13553A1559246R55179R78107J140350J202351J300053J384469J494450J682277
13545B1696482J829052J996765K321981K639235L273520L958633N031956O372346
13537D9119970Q299863J1249859J5866122K2810500L2763193M5382407N7658804
13530B43150718O2138704N1870715K3331307j8100835n1958894o3109168n7765459
13523A89557088m6553839l4593592k4715413j7620883j2763329r455871p229604
13516C6624557n727340m635563l903313l174583k557104k035712j652642j337781
13508A1600519j129028r52492q04082p11668n97088n04739m37589m40788l65908
13499E657137l53008k91910k50203k28371k31359k17711k58813k42964j81240
$$ plain form
13553 11559246 12514425 13492532 14632882 15835233 17135286 18519755 20014205 21696482
13545 21696482 23525534 25522299 27844280 30483515 33757035 37715668 42747624 49119970
13537 49119970 57419833 68669692 84535814 107346314 140109507 185491914 243150718
13530 243150718 305289422 357160137 380491444 362390609 310431715 247322547 189557088
13523 189557088 143003249 108409657 83694244 66073361 53310032 43854161 36624557
13516 36624557 30897217 26261654 22358341 19183758 16626654 14590942 12938300 11600519
13508 11600519 10471491 9518999 8714917 8003249 7406161 6901422 6463833 6023045 5657137
13499 5657137 5304129 5012219 4762016 4533645 4302286 4084575 3825762 3582798 3401558
13490C401558j42984j47636j58593j62447j61372j55212j24868j32606j06195
13481B109645l6785n7150r7974p8231m8790r6625k4832l6779p7287r1137l9856
13470A424199k7819p623k6049n8114k8832m5752l3277k9906j3478m1143J1530
13459A123736m4678n3571l0828n8277J1348l2085n4921J6890l2711q9712o2804
13448F92387l6197J186M7421O734l4861R84M8671k9114l5666l5047q1413p1938
13436D73147p362N2480n06p834l9683l216J2221Q744n1255q0074m2117o9006j8978
13423B26561L4719P3643R1139p551k0727m6943M4727O1328m6653r6483j4046m881
13411B94833N8630Q2749P4660J09732J20726M0481p115j6068J2404J3442M0222
$$ plain form
13490 3401558 3258574 3110938 2952345 2789898 2628526 2473314 2348446 2215840 2109645
13481 2109645 2072860 2015710 1917736 1839505 1790715 1694090 1669258 1632479 1555192 1464055 1424199
13470 1424199 1396380 1388757 1362708 1304594 1275762 1230010 1196733 1166827 1153349 1112206 1123736
13459 1123736 1079058 1025487 994659 936382 947730 915645 860724 877614 844903 755191 692387
13448 692387 656190 657376 704797 711531 676670 677654 726325 697211 661545 626498 545085 473147
13436 473147 465785 518265 517759 509925 470242 467026 479247 487991 436736 356662 314545 245539 226561
13423 226561 261280 334923 426062 418511 397784 350841 395568 456896 410243 313760 299714 294833
13411 294833 353463 436212 510872 620604 741330 781811 774696 758628 771032 784474 824696
13400H24696K0720k6545j11335q3939l2570j6132j3553K4861P7446q304m7513
13389F07832j8813k0157l1663Q474k1966K6334K5423O853J4653R18J6855k1n3516
13376E61206j8685l4757k2646j7455o4215l7429K1436J5471j906l487o8488o5184
13364B63861Q596J2881n010o520N6754Q3427O1155k3386n8555j7944M372Q242
13352C87873J1640k0816j145n174j368j4557r855l010m5306j4208l1636r193K3752
13339B66997j7207l5644m8845o3942l2890J9795J4971j4837j1033Q871O0343M4419
13327A90998J625M2095l490l0115j3843p318J6491J1459Q304k568o042M728K8314
13314B40638m9421j5334k5966Q1335J4239P981k0945L5228J6669O636m4784l3016
$$ plain form
13400 824696 845416 818871 707536 623597 591027 574895 561342 586203 663649 655345 607832
13389 607832 589019 568862 537199 545673 523707 550041 575464 582317 596970 597888 614743 614722 561206
13376 561206 542521 507764 485118 467663 403448 366019 387455 402926 401020 397533 329045 263861
13364 263861 272457 285338 280328 273808 330562 413989 475144 451758 393203 375259 379631 387873
13352 387873 399513 378697 377552 372378 371010 356453 346598 343588 298282 284074 252438 243245 266997
13339 266997 249790 214146 165301 101359 68469 88264 103235 88398 77365 86236 146579 190998
13327 190998 192623 234718 231228 201113 187270 179952 196443 207902 216206 213638 207596 212324 240638
13314 240638 191217 175883 149917 231252 245491 253472 232527 267755 284424 291060 246276 213260
13302B13260k2513L5320J9235K256k50l3291k4989k0509n3172k4077J2378K6600
13290A30248O965j78R318L8398L3815M2278N9553J3984k4062j177k4707j4665
13278B69770K6515o6083m7094k0613N224K1604p616K7901O834l271k3120J9396
13266B09447j227m4315K5530L6622m228L850P648k7865k6344j3268l8721M4054
13254A71183L4821k7876k9475k6243j8863L2400n8785l2839N3157L0265O1116
13243A88861j0678J9966K3445O172J0003K1130l5493k4455K3069J1968L6849j6544
13231B54293j9238K2646j7402n4848l726K7241L0246L0618J353j2085Q925l0298
13219B37725Q733L4626L5323l150K2885M2156p642K4398P4216L6649J4910J0108
$$ plain form
13302 213260 190747 226067 245302 247558 247308 214017 189028 168519 115347 91270 103648 130248
13290 130248 137213 137035 146353 184751 218566 260844 320397 334381 310319 309142 284435 269770
13278 269770 296285 230202 183108 162495 167719 189323 181707 209608 216442 213171 190051 209447
13266 209447 208220 163905 189435 226057 221829 225679 233327 205462 179118 165850 127129 171183
13254 171183 206004 178128 148653 122410 103547 135947 77162 44323 97480 127745 188861
13243 188861 178183 198149 221594 227766 237769 258899 223406 198951 222020 233988 270837 254293
13231 254293 235055 257701 240299 185451 181725 208966 239212 269830 271183 259098 268023 237725
13219 237725 246458 281084 316407 313257 336142 378298 370656 395054 469270 505919 520829 530937
13207E30937k5951J9591P1301K4071N5144N8706O089J12397R7059N2202P7698
13196A079244p414o7219j42116p4786n9194o4638j2636j3999r734j7907m3770
13185E65831j9428M5159O8352Q5344r453o3463L2106R6073K3208K3144J15758
13174I62631R0051J5826J7978N4184J22605J01306R3016J13641O7157L1189J1037
13163A680621L5213o9177j67314p2232m8108p9917n5430n3431p7543O124m9089
13152A049717q7762l7886r627K2042j6537p8468n790j2316n6182P317Q572M1946
13140H25026N0936P7308J30227M1530L3242K6598n6710p1540n0894r8514o3168
13129H44041j08740k6843K8664M320m611R1000N6119P2167O4891P2799J1427K2249
$$ plain form
13207 530937 504986 524577 595878 619949 675093 733799 739888 852285 949344 1001546 1079244
13196 1079244 1071830 1004611 862495 787709 728515 663877 651241 637242 627508 609601 565831
13185 565831 546403 591562 659914 745258 735805 672342 704448 800521 823729 846873 962631
13174 962631 1052682 1068508 1086486 1140670 1263275 1364581 1457597 1571238 1638395 1669584 1680621
13163 1680621 1715834 1646657 1479343 1407111 1359003 1279086 1223656 1170225 1092682 1098806 1049717
13152 1049717 961955 924069 914442 936484 919947 841479 835689 823373 767191 774508 783080 825026
13140 825026 875962 953270 1083497 1125027 1158269 1184867 1128157 1056617 1005723 907209 844041
13129 844041 735301 708458 737122 741442 736831 827831 883950 956117 1021008 1093807 1105234 1127483
13117A127483J9989q164j829o913n8878r1150j00253n2523r1142k8968L626l6378
13105F74900m0865l2167j9472o8718k0886m9382j3334l7972j2093k3054J2282
13094C69239O219M182o8860j4287M2384r542M9382J3636r529J0264N8415J0743
13082D62246k4687J0854Q40M3982j5403j4526J20790J29214J38000N3940M737
13071I09987o2313N885l095l7953m2691j8106q3689n8433K5004O4299K0136j3233
13059G05798m8346j7861L3353m619M8790R0173J20343J86747J84364K92011L30928
13048A921681K06194J16473k8938k31778l51652k96724k70281j57158j38787q9097
13038F79933m8339l0049o0388l5972q1620n1992N454K3410L0833J867J6644L8054
$$ plain form
13117 1127483 1147472 1139308 1137479 1130566 1071688 980538 880285 827762 736620 707652 711278 674900
13105 674900 634035 601868 582396 513678 492792 443410 430076 392104 380011 356957 369239
13094 369239 375458 379640 310780 296493 338877 329335 378717 392353 382824 393088 451503 462246
13082 462246 437559 448413 449253 493235 477832 463306 584096 713310 851310 905250 909987
13071 909987 847674 853559 850464 812511 769820 751714 668025 609592 634596 698895 719031 705798
13059 705798 657452 639591 672944 668325 717115 807288 927631 1114378 1298742 1590753 1921681
13048 1921681 2127875 2244348 2215410 1983632 1631980 1335256 1064975 907817 769030 679933
13038 679933 631594 601545 541157 505185 423565 371573 377027 400437 431270 433137 449781 487835
13026D87835L5168j1716l1664n6015p2564k4644J1346J8087l9021R20L9627l6512
13014C20847k5207j441N22K0117j6923M191L8009K4675k4509k2074J2103l1039
13002B99271k4610j2882L4931p870R226K3369O4896N4300n9281q2990L1840j343
12990C28857j5687Q523j1638M1009m5995K0734j8947l738l4662j3225l7866P0997
12978B88362P3335K7832k2534l8132n1337j9399R841O713N0924p494M532L8172
12966C60815l400k0563N56J0366L1046J7342j557j0142L756M5259L0091O391j7492
12953D52468N412m812l5677J1M2509L111j4156L9543P851J9075K5353P7182O581
12940F24451q530k2797l0724l1032L4976o6215q4048J3993m5302k0347N6162J349
$$ plain form
13026 487835 523003 511287 479623 423608 351044 326400 337746 355833 316812 317732 357359 320847
13014 320847 295640 294199 294721 314838 297915 302106 340115 364790 340281 318207 330310 299271
13002 299271 274661 261779 296710 288840 298066 321435 386331 440631 381350 298360 330200 328857
12990 328857 313170 321693 310055 351064 305069 325803 306856 303118 268456 255231 217365 288362
12978 288362 361697 389529 366995 328863 277526 258127 267968 274681 325605 318111 322643 360815
12966 360815 357415 336852 337408 347774 378820 396162 394605 384463 388219 433478 463569 469960 452468
12953 452468 457880 453068 417391 417402 459911 463022 448866 488409 496260 515335 540688 617870 624451
12940 624451 615921 593124 562400 531368 566344 500129 416081 430074 384772 364425 420587 421936
12928D21936O4167j4980o9860k4683K5916M4850k304R953J1189p975o792K0611
12916D72028M646k3213m2148K4631L4869L493q3K3115l0121k8938n162M1326N6679
12903E31122M800m5269n1552k3718o8051R902P038O900m1824j3743M1378L386
12891C60369N238m135R389N4741P0374n7820n7239k696M445N8858J0647J4183
12879D66354J1151M3705j4402k7014J6989j0448O675O0576O369q128l2092j8313
12867E01422M517k2965L3552K5899J1900k942l0133j918q040N940P6070K7993
12855F21295M1234J541l3909l5472j5417Q589O7681k3602K9089L7978J0022J5512
12843G24541j2837j6539M7779K1552k8726L2158R2609j099j2739l281K6426K9362
$$ plain form
12928 421936 486103 471123 401263 376580 402496 447346 445042 454995 466184 458209 451417 472028
12916 472028 476674 453461 411313 435944 470813 474306 474223 497338 467217 438279 433117 474443 531122
12903 531122 535922 490653 439101 415383 347332 357234 364272 371172 329348 315605 356983 360369
12891 360369 365607 361472 370861 425602 495976 438156 380917 378221 382666 441524 452171 466354
12879 466354 477505 521210 506808 479794 496783 486335 493010 553586 559955 551827 519735 501422
12867 501422 505939 482974 516526 542425 554325 551383 521250 519332 511292 517232 593302 621295
12855 621295 662529 664070 630161 594689 579272 587861 655542 631940 661029 699007 709029 724541
12843 724541 711704 695165 742944 764496 735770 767928 860537 859438 846699 843418 869844 899206
12831H99206L9269P2611Q2860L3491P4247P3827N620M3199L4849P3812P5529K4152
12819A532672K4783O348P3608O5849J730j3920M2696M4154O602N4485J22411P4363
12807B035781O0617J01915J05198R9696P1251J25315O9571P0190J28077J06820
12797B974431R8430N5002R9578P6501R0128J65868J43515R8592J71605J84274
12787D157924J33794J82755K26206K29694K31582K42501K63330K73735L65288
12778F306809M05915M38132M00062L87897M45094M70927N21279N99913O71631
12769A0647659O98144P65293Q46457R68310J084118J170179J223308J364166J537656
12760B0305290J807954K062675K525250L122873L870720M874675O310990Q150501
$$ plain form
12831 899206 938475 1011086 1093946 1127437 1201684 1275511 1281131 1324330 1359179 1432991 1508520 1532672
12819 1532672 1557455 1563803 1637411 1703260 1704990 1691070 1733766 1777920 1784522 1839007 1961418 2035781
12807 2035781 2096398 2198313 2303511 2403207 2474458 2599773 2669344 2739534 2867611 2974431
12797 2974431 3072861 3127863 3227441 3303942 3394070 3559938 3703453 3802045 3973650 4157924
12787 4157924 4291718 4474473 4700679 4930373 5161955 5404456 5667786 5941521 6306809
12778 6306809 6712724 7150856 7550918 7938815 8383909 8854836 9376115 9976028 10647659
12769 10647659 11345803 12111096 12957553 13925863 15009981 16180160 17403468 18767634 20305290
12760 20305290 22113244 24175919 26701169 29824042 33694762 38569437 44880427 53030928
12752E3030928J0354896J2822275J5117258J6413338J5800025J2560602O602844
12745A42702166q17699p597073j2034184j3756502j3290262j1490219r151137
12738G4565090o859020m649386k648891r70978N44447J952455L206453M323736
12730F9463906N252417N889062O173336O392713O485751O538909O613358O628679
12722A19438131O821814P424626Q453928R470108R841064Q750294N789637J217003
12714A77206605m019939q417454j0825004j1060073r775925p791044n775432m237218
12706A15304516l396073l144290l387974l975046m452183m843035n158188n255921
12698H1691806n164933m683329l915036k745869j279271M66749K377597M616514
$$ plain form
12752 53030928 63385824 76208099 91325357 107738695 123538720 136099322 142702166
12745 142702166 141884467 134287394 122253210 108496708 95206446 83716227 74565090
12738 74565090 67706070 63056684 60407793 59436815 59981262 61933717 65140170 69463906
12730 69463906 74716323 80605385 86778721 93171434 99657185 106196094 112809452 119438131
12722 119438131 126259945 133684571 142138499 151608607 161449671 170199965 175989602 177206605
12714 177206605 173186666 164769212 153944208 142884135 133108210 125317166 119541734 115304516
12706 115304516 111908443 108764153 105376179 101401133 96948950 92105915 86947727 81691806
12698 81691806 76526873 71843544 67928508 65182639 63903368 64370117 66747714 71364228
12690G1364228P338613J0239551J3116338J5601527J6423821J4658419R797529
12683A58540026K194406o338476j3579062j7851487j8969592j7767670j5394876
12676G0833269j2692785j0117040p974118o278876m937666l923501l138554k596210
12668A9174519k068300j750659j497816j288918j154390j012988q60797o98219
12660H842432o19006n90327n35067m38941m19072l87076l27308l14727l09654
12651D901254k37654k03290j75578k31330j66383j65508k06917j71872j06209
12642C236513j69644j23695j25448r7266j04807j22120p6239p4396r9403o6483
12632B177012l2487k0748l9782m0131m6118n6989o3322R263K0301l2219q1732
$$ plain form
12690 71364228 78702841 88942392 102058730 117660257 134084078 148742497 158540026
12683 158540026 160734432 154395956 140816894 122965407 103995815 86228145 70833269
12676 70833269 58140484 48023444 40049326 33770450 28832784 24909283 21770729 19174519
12668 19174519 17106219 15355560 13857744 12568826 11414436 10401448 9540651 8842432
12660 8842432 8223426 7633099 7098032 6659091 6240019 5852943 5525635 5210908 4901254
12651 4901254 4663600 4460310 4284732 4053402 3887019 3721511 3514594 3342722 3236513
12642 3236513 3066869 2943174 2817726 2720460 2615653 2493533 2417294 2342898 2243495 2177012
12632 2177012 2144525 2123777 2083995 2043864 1997746 1940757 1877435 1886698 1906999 1874780 1793048
12621A793048j28711o7283N0818j62k1002r7776j09138o3296l7439r600k9296
12610A280163L2014l4645l3823k0334j7662k4203k2773J9382j9479k4914j4085
12599A119641L3516N5334k5946P726O7754k8887k5491p176k7544j5045p925q61
12587A145096J5926k7353m2900k3960j9276K1349m94O56p319j1291J0386K0220
12575A081040J2307L2094K148L1527N705N5943K5976M6128L0109J00285R4908
12564A518170P9610K7256l5943m9848n6408p1244k9305m6348j04201q6019m9390
12553A096330p4739q8454m9118k6867J2183r268k3514l5786K425J5034r175L862
12541H12913K9034J1263k5465m0132N0079K4084J7040j9653j5127p3078l8031
$$ plain form
12621 1793048 1664337 1597054 1647872 1647710 1626708 1528932 1419794 1356498 1319059 1309459 1280163
12610 1280163 1312177 1277532 1243709 1223375 1205713 1181510 1158737 1178119 1158640 1133726 1119641
12599 1119641 1153157 1208491 1182545 1190271 1258025 1229138 1203647 1196471 1168927 1153882 1145957 1145096
12587 1145096 1161022 1133669 1090769 1066809 1047533 1068882 1068388 1069044 1061725 1050434 1060820 1081040
12575 1081040 1093347 1125441 1127589 1159116 1164821 1220764 1246740 1292868 1322977 1423262 1518170
12564 1518170 1597780 1625036 1589093 1539245 1482837 1411593 1382288 1335940 1231739 1145720 1096330
12553 1096330 1021591 933137 884019 857152 869335 860067 836553 800767 803192 818226 809051 812913
12541 812913 841947 853210 827745 787613 837692 861776 878816 859163 844036 770958 732927
12530G32927n1500J0870N8315K0657m9167l9369m0176m5936M7703M7107p011M3040
12518G27460M851o6815j05053p8736Q360J3735J9927n8330l1337J6134M160k5735
12506D28621k6373k2152K5480N74N106L4313k7056j1278P5633K5877l4251k2659
12494D51835n9465R460O856l3918j14782J2130p382K985k3982m0536o726P4529
12482B71004N8714M1041L7342N5308L3555K8945j4689k468J6519r4181r8004l5732
12470B97354l4591L0205M0851J2837r101j2300l3126k8272J0631j3653n8564M2384
12458B44655K5706J2232J6267l6377k1013m1122R501P6925q746j255j1162J7117
12446B82728K6771o5242o0419J8636K5950J1094r466l3861N50K7034L6498m3886
$$ plain form
12530 732927 681427 692297 750612 771269 722102 682733 642557 596621 644324 691431 684420 727460
12518 727460 732311 665496 560443 481707 490067 503802 523729 465399 434062 450196 454356 428621
12506 428621 402248 380096 405576 406150 411256 445569 418513 407235 482868 508745 474494 451835
12494 451835 392370 401830 408686 374768 259986 272116 264734 267719 243737 203201 196475 271004
12482 271004 329718 370759 408101 463409 496964 525909 511220 508752 525271 431090 333086 297354
12470 297354 262763 292968 333819 346656 337555 325255 292129 263857 274488 260835 202271 244655
12458 244655 270361 282593 298860 262483 241470 200348 209849 286774 278028 276773 265611 282728
12446 282728 309499 244257 183838 202474 228424 239518 230052 196191 196741 223775 260273 216387
12434B16387O6070K3814L6295J0026l1976r559l5184m2168m4779m0773j6810N0281
12422A81624L7564K7357J1103J8704O648j2258L7032K6596j439j14286k4136O5015
12410B59524j5346m9938L7215j2688K9023r577j0595n0102m2156Q0543Q6088J5830
12398C17821j185M5009J5892j3517R167j3452j2681J404r539K6041k9975o0914
12386B74071J7743L7469K7195r933m3740q6214J9072N3530K1353K5790o689l0587
12374B99060l435N2175K2191J7312N1481O4234N1099N3853L6428Q4556P9203M1060
12362H49217M4152J15891L0501L5633k0753p0327n5941m4064n7413n2759j36184
12351F37953l8386N62j5073n465K8702L912L0351N6907N2553P8124K5096r075
$$ plain form
12434 216387 282457 306271 342566 352592 320616 311057 275873 233705 188926 148153 131343 181624
12422 181624 219188 246545 257648 276352 283000 270742 307774 334370 332931 218645 194509 259524
12410 259524 244178 194240 231455 218767 247790 238213 227618 177516 135360 215903 301991 317821
12398 317821 316636 361645 377537 364020 373187 359735 347054 348458 338919 364960 334985 274071
12386 274071 291814 329283 356478 346545 302805 216591 235663 289193 310546 336336 329647 299060
12374 299060 295625 347800 369991 387303 438784 503018 554117 607970 644398 728954 808157 849217
12362 849217 893369 1009260 1039761 1075394 1054641 984314 928373 884309 826896 774137 637953
12351 637953 599567 600129 585056 579591 608293 612205 642556 699463 752016 830140 855236 846161
12339H46161k4668J6226J2884J24J2384N3769K7114o817k4321O0593J05345J5362
12327A094156q614N619l6950o576j7988L288K5884n4897j40516j04840k7987l1840
12315F98739n0241k3509j7839k4915m2845l2384M271M2223J7905m4333L4625O8686
12303F30383K8719N5934M7216J8516J28778J21728N7521q892p2998l4509k341
12292I70055R540M7577k7749m9313j6655l1737n0528J9534l9571p7765p7629n5584
12280F20175m6046o0642k2157L0085M6008J7850j1506k3017o1874L4132P9021
12269F02029J24764J8955L3979N1595j327Q8592O0138L644Q2851O8909o045o3132
12257A064952l5491p339k4919p6008l7089n7338q2897o1261N6116K5573k8036
$$ plain form
12339 846161 821493 837719 850603 850727 863111 916880 943994 937177 912856 973449 1078794 1094156
12327 1094156 1085542 1091161 1054211 1047635 1029647 1032935 1058819 1003922 863406 758566 730579 698739
12315 698739 648498 624989 607150 582235 539390 507006 511277 553500 571405 527072 561697 630383
12303 630383 659102 715036 762252 780768 909546 1031274 1088795 1079903 1006905 972396 970055
12292 970055 979595 1027172 999423 950110 933455 901718 851190 870724 831153 753388 675759 620175
12280 620175 574129 513487 491330 521415 567423 585273 573767 550750 488876 523008 602029
12269 602029 726793 745748 779727 831322 829995 918587 978725 982369 1065220 1134129 1128084 1064952
12257 1064952 1029461 1022122 997203 921195 884106 826768 743871 682610 738726 764299 736263
12246G36263j6957m8883k8995k130J3935o631m1004m5179j790J8556k040M9891
12234F25036J1213K2734K5709K1401P7975Q2010J38334M3896Q505J6546m9729
12223A023630o8344j11969j44563r6180q2419l8971l9432o3399m5911J6271l5034
12212C13679M3422N3777k9741J6827j2942m7854m780L1235j8473j8004j6355P146
12200C17937P488L1411k2724l2234k5333n7516j700j3576l4126M020L3459J5593
12188B22699M1670N796K04L9241j4681Q043j204J4886L5840J0267J7030O0807
12176D40598l3020j5865q282r027L6253K3986n0590j4114J2897L610J631K1932
12164D10009k3606k4585j1825m8107J4282J8949j10249j8807K9686m118K6903
$$ plain form
12246 736263 719306 670423 641428 639298 653233 646602 605598 560419 558629 577185 575145 625036
12234 625036 636249 658983 684692 706093 784068 866078 1004412 1048308 1056813 1073359 1023630
12223 1023630 955286 843317 698754 602574 520155 481184 441752 378353 332442 348713 313679
12212 313679 357101 410878 381137 397964 385022 337168 332388 363623 345150 327146 310791 317937
12200 317937 325425 356836 334112 301878 276545 219029 217329 203753 169627 173647 207106 222699
12188 222699 264369 270165 270369 309610 294929 302972 301768 316654 352494 362761 379791 440598
12176 440598 407578 391713 383431 374404 410657 434643 384053 369939 382836 386446 388077 410009
12164 410009 386403 361818 349993 301886 316168 335117 224868 206061 235747 231629 258532
12153B58532Q0153M2820n910J6768l5339j5593N6043j3028L6746O524k6326o141
12141C95249l6244j7849o615r479L7429L1422L9935M3528J7689k2578q696K0369
12129D84160O8761r166l4061J1269L02K528j590n7954k8981J998o0848m4489j7064
12116C14865k991P80N1236K5663M1558j5254J0328O011j9607L0462J4838o0j847
12103D55982k4450J7018K6204L1070L3639j4121m9817j767J1725J5115j1910n0940
12091D37748J3028L8802m3398q5153j3477m5490K3000M8469m4063j3135Q838K8291
12079C53460q090j0478J1634J9570L6229j8149l5270K7308P2816K4242J189K1990
12067D96451k0644P4691Q581n797J1029k563j171O8670O1483N666M7481M087R023
$$ plain form
12153 258532 338685 381505 375595 392363 357024 341431 397474 384446 421192 427716 401390 395249
12141 395249 359005 341156 334541 325062 362491 393913 433848 477376 495065 472487 463791 484160
12129 484160 552921 543755 509694 520963 521265 523793 522203 464249 435268 437266 376418 331929 314865
12116 314865 311874 312654 363890 389553 431111 415857 426185 432196 412589 443051 457889 457829 455982
12103 455982 431532 448550 474754 505824 539463 525342 475525 473758 485483 500598 488688 437748
12091 437748 450776 489578 446180 361027 347550 302060 325060 373529 329466 316331 325169 353460
12079 353460 345370 334892 346526 366096 402325 384176 348906 376214 449030 473272 474461 496451
12067 496451 475807 550498 559079 553282 564311 561748 560577 629247 690730 696396 743877 747964 756987
12054G56987J5809M5861k8634N329l2665k9360k4873r46Q7463l2453p4892J2353
12042F99979M9811j8232m1313j5526n200K6506J9928N578K1712J4668k2695J2547
12030G47763j066l807N9709J8034P0339k881m0061m1631j0227P8734P9784M6596
12018A001286O987J8607O9035N1209L1729M2762O9819J06189R1017N6814J0693
12007A556147M5303O8970Q9142O3396M9602K2438M9276r95N648N7904O1518M4628
11995B112977P1959J05620N3231K0746J03604J51555R9988J45093J95532J83209
11985C243514K20038J95980K91303L35714L38162L55171M51131N00129M01914
11976F333056K61213R7058P5409l1700q8722o9879O1805J11982J37143J82698
$$ plain form
12054 756987 772796 818657 790023 795352 762687 733327 708454 707508 794971 762518 687626 699979
12042 699979 749790 731558 690245 674719 669519 696025 715953 721531 743243 757911 735216 747763
12030 747763 746697 742890 802599 820633 890972 888091 848030 806399 796172 874906 954690 1001286
12018 1001286 1008273 1026880 1095915 1147124 1178853 1221615 1291434 1397623 1488640 1545454 1556147
12007 1556147 1601450 1670420 1759562 1822958 1872560 1894998 1944274 1943279 1948927 2006831 2068349 2112977
11995 2112977 2184936 2290556 2343787 2364533 2468137 2619692 2719680 2864773 3060305 3243514
11985 3243514 3463552 3659532 3950835 4286549 4624711 4979882 5431013 5931142 6333056
11976 6333056 6594269 6691327 6766736 6735036 6646314 6576435 6638240 6750222 6887365 7070063
11966G070063K92890L84557M03350M70646N13204N06436N11096O08456O95384
11957A1456082P76723Q03117Q44486J002949J065212J144023J285037J460821
11949A9838450J660794J876727K190967K514817K924224L485255M205243N201755
11941D3898232O593943Q490253J0852108J3571104J6163236J7940713J7885856
11934A35395445J5183211R507629J926828n939571j2065586j5282599j5697246
11927A13028111j4262303j1854044q953987o200093l743669j641331K00553J835355
11919F8408592L080466L958713M564003M804298M851742M951637M812634M523593
11911A03955678M039047L402778K941157L169882M170945O049166Q183267R914759
$$ plain form
11966 7070063 7362953 7747510 8150860 8621506 9134710 9641146 10152242 10760698 11456082
11957 11456082 12232805 13035922 13880408 14883357 15948569 17092592 18377629 19838450
11949 19838450 21499244 23375971 25566938 28081755 31005979 34491234 38696477 43898232
11941 43898232 50492175 58982428 69834536 83405640 99568876 117509589 135395445
11934 135395445 150578656 160086285 162013113 156073542 144007956 128725357 113028111
11927 113028111 98765808 86911764 77957777 71757684 68014015 66372684 66573237 68408592
11919 68408592 71489058 75447771 80011774 84816072 89667814 94619451 99432085 103955678
11911 103955678 107994725 111397503 114338660 117508542 121679487 127728653 135911920 145826679
11903A45826679J0504518R136675N911010J418697l252136o862880q851640r321353
11895A44509570q741160q033773p532052p363213p132639o893524o631706o309443
11887H5872060o044072n835639n598496n065210m126488l014756j714922j83665
11879E4288812J483914L220241N115232P303163R677929J1751728J3059564J2822519
11871A18723102J0291026N330118j276745p918896j2997433j5450204j5409038
11864H1291930j3942724j1780500r564046p618637o062117m751168l781100l096226
11856B0695412k582628k161194j805393j483731j281806j029782q42188p20118
11848H788572n92617n52172m56362m34785l88223l13767l36796l80839k63412
$$ plain form
11903 145826679 156331197 165467872 171378882 172797579 169545443 162682563 153830923 144509570
11895 144509570 135768410 127734637 120202585 112839372 105706733 98813209 92181503 85872060
11887 85872060 79827988 73992349 68393853 63328643 59202155 56187399 54472477 54288812
11879 54288812 55772726 58992967 64108199 71411362 81089291 92841019 105900583 118723102
11871 118723102 129014128 134344246 133067501 125148605 112151172 96700968 81291930
11864 81291930 67349206 55568706 46004660 38386023 32323906 27572738 23791638 20695412
11856 20695412 18112784 15951590 14146197 12662466 11380660 10350878 9508690 8788572
11848 8788572 8195955 7643783 7187421 6752636 6364413 6050646 5713850 5333011 5069599
11839E069599k31441k97934k39441j85896j54053k20769k17214j53648j24312
11830C244891j88940j75702j10822q1931l9075r1920r7834r1621k9748l4035Q724
11819B311987M852P366n3549m5471n0217r188k5979j19035o0492n2190r5946j37136
11807A675002q1707n3665o1237l2367n6495k4929j019l9272o5079m1246J2129
11796A230115j4200m8195o1374j1854L2843N065j087j3453J7630M8732k7362k9156
11784A127704K3883L816k6205k3194j349Q2752m0478n3209o4061k1352J566M942
11772A014815m2096m8011l7536k4416J0563l347n1736J9895O1126L4716l9250
11761H94723L631O920J2371l7230K28O6533O718k5705O6293N4202L6410M3118
$$ plain form
11839 5069599 4838158 4540224 4300783 4114887 3960834 3740065 3522851 3369203 3244891
11830 3244891 3055951 2880249 2769427 2687496 2648421 2556501 2458667 2367046 2337298 2303263 2311987
11819 2311987 2316839 2324205 2270656 2225185 2174968 2165780 2139801 2020766 1960274 1908084 1812138 1675002
11807 1675002 1593295 1539630 1478393 1446026 1389531 1364602 1363583 1324311 1259232 1217986 1230115
11796 1230115 1215915 1167720 1106346 1094492 1127335 1132400 1131313 1117860 1135490 1184222 1156860 1127704
11784 1127704 1151587 1155403 1129198 1106004 1104655 1187407 1146929 1093720 1029659 1008307 1009873 1014815
11772 1014815 972719 924708 887172 862756 873319 869972 818236 838131 899257 933973 894723
11761 894723 898354 905274 917645 880415 880643 947176 953894 928189 994482 1048684 1085094 1128212
11749A128212M9820m1018n6974k8563m0628p2079q9781m2189o2273m4135o6050
11738F34342n1235k2816j2819k7017L7282l4155r479J2149K1497M9003M4117j8419
11726F22450m2939l7257J0919j2511O4395N8827l7049o3465o5351m2330K3064
11715D78753K7642k1634j9162j2055l1415n9579m0271L2427M691r222Qj4054p843
11702C28286Q5619J3076n8589k6875o837K3641L3059k2763J5980L1630K5549l4518
11690D07258j7897N1250J9201O476K2850m2426l6607j7642M244n5098k9763M6184
11678C58030k0700k7713k2171R483N1894M2722K1425M6985L1008L2425N6051O4871
11666F44310M4493l811m3245L7581M5905L3765l1847N390L0741O4264M0644N8715
$$ plain form
11749 1128212 1178032 1137014 1080040 1051477 1010849 938770 848989 806800 744527 700392 634342
11738 634342 583107 560291 547472 520455 557737 523582 514103 526252 547749 596752 640869 622450
11726 622450 579511 542254 553173 540662 605057 663884 626835 563370 498019 455689 478753
11715 478753 506395 484761 465599 453544 422129 362550 322279 354706 359397 350175 350183 336129 328286
11702 328286 413905 426981 368392 341517 334680 358321 391380 368617 384597 416227 441776 407258
11690 407258 389361 440611 459812 466288 489138 446712 410105 392463 396707 341609 311846 358030
11678 358030 337330 309617 287446 296929 348823 391545 412970 459955 490963 523388 579439 644310
11666 644310 688803 684992 641747 679328 725233 758998 727151 732541 763282 827546 868190 926905
11654I26905L1998Q168j919R221p2780l6501r642l1719l5943l3556j2225J8786
11642G60793j569j8173k127M3435J2777L7780K9305J8619m5326p9857j4068P7173
11630H18762O7677M6486M5454M5635J6389K7481k7834O6806J08989N676k4195
11619A197326o59j3985l665L4085O6947N5131P0413R5857J18019J41556R6304
11608A857329O3509p08N267k3618m5666r7452j15392j23189j55193j03612p6958
11597A184317l8123p9651j09020l6697K1177M7781M7081O7107J4147M4898M2018
11586A205035L1283l969P2115J30676O3506N9810P1021J05968R8497M3387L0981
11575A908310K0433q1075o6879l3837m4928r4643j7360n594M0937J2096M4135
$$ plain form
11654 926905 958903 967071 965152 974373 901593 865092 855450 823731 787788 754232 742007 760793
11642 760793 759224 741051 738924 782359 795136 832916 862221 880840 835514 755657 741589 818762
11630 818762 886439 932925 978379 1024014 1040403 1067884 1040050 1106856 1215845 1221521 1197326
11619 1197326 1196667 1182682 1179017 1213102 1280049 1335180 1405593 1501450 1619469 1761025 1857329
11608 1857329 1920838 1920130 1925397 1901779 1856113 1758661 1643269 1520080 1364887 1261275 1184317
11597 1184317 1146194 1066543 957523 920826 942003 989784 1036865 1103972 1118119 1163017 1205035
11586 1205035 1236318 1232349 1304464 1435140 1498646 1558456 1629477 1735445 1833942 1877329 1908310
11575 1908310 1928743 1847668 1780789 1746952 1702024 1607381 1590021 1584427 1625364 1637460 1681595
11564A681595M3927P1536O3464L7710M8842k410o8791r0584j21024r0286j15387
11553A458592j20444j28354j02685n8935j0546K1591k6636n3337m2395k5966M5462
11542I56347K5730P469L5990J9647O1300O359N3122J01558R9557R2458J10530
11531A570067N7402K344m1300j7871o4500l8874q8503r1343n3476o4832j187o6246
11519A101681n9895k1044k8358k6222K5079j3683o9076p1195K744k4518p051j91
11507H08271J2956k1611j2684N0220K8450Q1335J01757P6834N5724Q524l9772
11496A150004j0052J516m8826p7939l3752o9717q0823j633M4111l4446N2174P8939
11484I69556J7938N7014K1184K0323l4066r4091o07K6817K953j8906n040L757
$$ plain form
11564 1681595 1725522 1797058 1860522 1898232 1947074 1944664 1875873 1785289 1664265 1573979 1458592
11553 1458592 1338148 1209794 1107109 1048174 1037628 1059219 1032583 979246 936851 910885 956347
11542 956347 982077 989546 1025536 1045183 1106483 1112842 1165964 1267522 1367079 1459537 1570067
11531 1570067 1627469 1629813 1588513 1570642 1506142 1467268 1378765 1287422 1233946 1169114 1167927 1101681
11519 1101681 1041786 1020742 992384 966162 991241 977558 908482 837287 840031 815513 808462 808271
11507 808271 821227 799616 786932 837152 865602 946937 1048694 1125528 1181252 1189776 1150004
11496 1150004 1139952 1141468 1092642 1014703 980951 911234 830411 828778 872889 838443 890617 969556
11484 969556 987494 1044508 1065692 1086015 1051949 957858 957251 984068 987021 968115 963075 966832
11472I66832o0788Q001N4955O2089M6612K6135p0555o4465m6046p0066l0826k7172
11460G94706L4371k0381q8402p6010k9549J4312n3170o8433L7954J3591q8338
11449D70651o1333m2795n238O1282l958n9854j660N8826K5346N8184R0731P8895
11437F69077Q284J6089J1580k0994K529m0384j5362n8057j09981r8658p7409m5727
11425B40987l3052m0128j2614L1475m4075l5364k5434j8310M2139N869j0369L6099
11413A37223l05j2446K9813J6420l642k9110l8689n5443k1010j0619j150j3639
11401b597k6832k2601N0216O5545J626K789q343K8740j7542j7260m727L1040k2601
11388E7453m9987m8594l1742J4626R4959O9237Q324J796p9263J7708M2602J0166
$$ plain form
11472 966832 906044 914045 969000 1031089 1077701 1103836 1033281 968816 922770 852704 821878 794706
11460 794706 829077 808696 720294 644284 614735 629047 575877 507444 545398 558989 470651
11449 470651 409318 366523 361285 422567 418609 358755 357095 415921 441267 499451 590182 669077
11437 669077 677361 693450 705030 684036 686565 646181 630819 572762 462781 364123 286714 240987
11425 240987 207935 167807 155193 186668 142593 107229 81795 63485 105624 111493 101124 137223
11413 137223 136918 124472 154285 170705 167063 137953 99264 43821 22811 12192 11042 -2597
11401 -2597 -29429 -52030 -1814 63731 65357 68146 59803 88543 71001 53741 49014 80054 57453
11388 57453 7466 -41128 -72870 -58244 36715 105952 114276 116072 36809 54517 97119 107285
11376A07285N002n525L79o7525k1516K5005m872n0947J8281J2758m6636l0751
11364e9062n234j7024L9619Q401n285Q597K0050M1654J4259m1502j3978l6497
11352d6002k5365J7909K5418Q093J5659j6980K7902L1082J3259J1793o8434j8567
11340b4233K4573k8217J914L1045J1338K0680k2146j3662K6044M0725k2859n8215
11328a3013l8976K4424O0307M7987K1585J0628j0119j7923m8802j1293o128J2589
11316C1266J3608M063j6654j1954K8483K1358l0703p5507l1419l865O2K1348M2004
11303g910M0991J1516M1972K5645J3174N541j9456p6432o6653o5475k1024Q3885
11291c4226N3049L6491n7209m7969L4842J6991l4424P1708j5847o3554j3258k0434
$$ plain form
11376 107285 112287 106762 107141 39616 18100 43105 38233 -12714 5567 18325 -28311 -59062
11364 -59062 -64296 -81320 -41701 -33300 -38585 -29988 -9938 31716 45975 4473 -9505 -46002
11352 -46002 -71367 -53458 -28040 -19947 -4288 -21268 6634 37716 50975 62768 -5666 -24233
11340 -24233 340 -27877 -25963 5082 16420 37100 14954 1292 27336 68061 45202 -13013
11328 -13013 -51989 -27565 32742 80729 102314 112942 102823 84900 36098 24805 18677 31266
11316 31266 44874 48937 32283 20329 48812 70170 39467 -36040 -67459 -71324 -71262 -49914 -7910
11303 -7910 33081 44597 86569 112214 125388 130929 111473 35041 -31612 -97087 -118111 -34226
11291 -34226 18823 55314 -1895 -49864 -15022 1969 -32455 39253 23406 -40148 -53406 -73840
11279g3840P76k6867P820N7101O1938J5020j6328m5254L055k7177R408L9210J9645
11266B4507J3174k1757l2747j9779r004o938p809J2152j2820N4582O575K6081
11254B6217M236L2813K3245l3855K4904m8985m9135k0073n5643k8637J5912O837
11242a02164J0421K2498N006M0748J4368M7806K5826p5328k8106M2969j1175J3390
11230F259l253j476J0070K147j9357L755J2376p091k2686P745L2870k0959L5344
11217C5744L7138N8857r909n3632p4769l1476K5064j4905j9664O5806O5404K0269
11205A03927L3422m7979o1317L7513M025n9999Q197q972J835m9526k6156K3560
11193d1470K1732L7512M005j3945k9486K0982Q874O107L2518L7089j1344j1654
$$ plain form
11279 -73840 -73064 -99931 -92111 -35010 26928 41948 25620 -19634 -16579 -43756 -34348 4862 24507
11266 24507 37681 15924 -16823 -36602 -45606 -52544 -60353 -48201 -61021 -6439 136 26217
11254 26217 30453 63266 86511 52656 77560 28575 -20560 -40633 -96276 -124913 -109001 -102164
11242 -102164 -91743 -69245 -64239 -23491 -9123 38683 64509 -10819 -38925 4044 -7131 6259
11230 6259 3006 1530 11600 13747 -5610 -1855 10521 3430 -19256 -11511 21359 400 35744
11217 35744 72882 131739 121830 68198 -6571 -38047 -12983 -27888 -47552 18254 83658 103927
11205 103927 137349 89370 28053 65566 69591 9592 17789 8817 10652 -38874 -65030 -41470
11193 -41470 -19738 17774 21779 7834 -21652 -670 8204 14311 46829 83918 72574 60920
11181F0920K9754L500P52n796j5941j8363j6575k946k0618l1964k629P193m278
11168a6991J1533Q85N730J6956l2130O592L1661Q724l2088K9328N2050K2988l0421
11155G4817m8823o1995o6950K2750L3618J1058J1375Q556l6791K1813J4945J3923
11143a704j4104J64L5190j5100j6418J9446K3318L0716K3218Q531k936k478l0663
11130E7180r2775j9280j985l7204M3296O1976J318p832k2106m2431l4130m867
11118i8840k5371P997M0043L6172K5713q385N273K6878J7398j750n4100j9611
11106d8583j8394K5620M5759j0444m8553J2490L6643k7374l3871M023j0678Q6563
11094A3201L9417l8091l3898l0678R097J5653J6028o910O3584k1428n9372m4026
$$ plain form
11181 60920 90674 94174 94926 89130 73189 54826 38251 35305 14687 -17277 -19906 -12713 -16991
11168 -16991 -5458 -4573 1157 18113 -14017 -7425 24236 32960 872 30200 82250 105238 74817
11155 74817 25994 -36001 -102951 -80201 -46583 -35525 -24150 -15594 -52385 -30572 -15627 -1704
11143 -1704 -15808 -15644 19546 4446 -11972 7474 30792 61508 84726 93257 90321 87843 57180
11130 57180 -35595 -54875 -56860 -94064 -50768 11208 12526 4694 -17412 -59843 -93973 -98840
11118 -98840 -124211 -116214 -76171 -39999 -14286 -22671 -17398 9480 26878 25128 -28972 -48583
11106 -48583 -66977 -41357 4402 -6042 -54595 -42105 -5462 -32836 -66707 -62684 -73362 13201
11094 13201 52618 14527 -19371 -50049 -40952 -25299 -9271 -16181 47403 25975 -33397 -77423
11082g7423k0312J8276k948L8623j2983r558j5O7596O6141o259n4470J3027K8337
11069D8032j9635M3053K0235m9106o1649J685L6187j5678m3081K7155L4733K4312
11057D6243K3555p1990j9826K3221k7511N39o509j4555j6346J2704J7029r624
11045d3070J9599n453j5251K6443k1332l1512J94L0665J3762J2162n624j3458
11033c2875K437l7698J240j4097J5530J7550k7741K7355K7410J6751j2161K94
11021a6005J2789M871m1138k3289l1884L3059j2845j0556k046N4570L4332K5366
11009B7224K5946k0933n3588J4752K7050o3090p5547k7481J3862R3135N8151m130
10997A5351L1546k0252j4078m8705j0554R18K9052l4077j4392K2828L3779K4141
$$ plain form
11082 -77423 -97735 -79459 -82407 -43784 -56767 -66325 -66340 1256 67397 61138 6668 19695 48032
11069 48032 28397 71450 91685 42579 -19070 -17385 18802 3124 -39957 -12802 21931 46243
11057 46243 69798 -2192 -22018 1203 -26308 -25769 -32278 -46833 -63179 -50475 -33446 -43070
11045 -43070 -23471 -28924 -44175 -17732 -39064 -70576 -70382 -39717 -25955 -13793 -19417 -32875
11033 -32875 -30438 -68136 -66896 -80993 -65463 -47913 -75654 -48299 -20889 -4138 -16299 -16005
11021 -16005 -3216 1655 -39483 -62772 -94656 -61597 -74442 -84998 -87044 -32474 1858 27224
11009 27224 53170 32237 -21351 -6599 20451 -42639 -118186 -145667 -131805 -38670 19481 15351
10997 15351 46897 26645 12567 -36138 -46692 -45774 -16722 -50799 -65191 -42363 -8584 15557
10985A5557m8477j4223J4726L8621R816j4586N334r197J8097N6557K2857n0111
10973D4971j0297K4190J5621j0838k582j8781J9237L3536n7240m9823L6737O115
10961C0846J6681J7929r829N716R133J2088J2108K1966J2462k1907j4155j9301
10949G3737j9897k5848J3469O188j4349Q306j0904j2775j6345L4213M1863j0169
10937F7489r318j6059n2232o0650k0886J2512N052K2502n812N382K5197M0245
10925A3422j8066j2777l0238J7297n99K8273O3383k2696j7430k510l1168n0891
10913f4000L505L0614m01J7827k8176o5753j3714M752Q3824K0888q138k2631k3487
10900f4890K819P5729j5363k3869K4895M051J7570M636n4653k0589n259k4210
$$ plain form
10985 15557 -32920 -47143 -32417 6204 16020 1434 6768 -2429 15668 72225 95082 44971
10973 44971 34674 58864 74485 63647 61065 42284 61521 95057 37817 -12006 24731 30846
10961 30846 47527 65456 55627 61343 70476 82564 94672 116638 129100 107193 93038 73737
10949 73737 53840 27992 41461 47649 33300 41606 30702 17927 1582 35795 77658 67489
10937 67489 58171 42112 -10120 -70770 -91656 -79144 -74092 -51590 -57402 -52020 -26823 13422
10925 13422 -4644 -17421 -47659 -30362 -30961 -2688 60695 37999 20569 18059 -13109 -64000
10913 -64000 -60495 -29881 -30282 -12455 -40631 -106384 -120098 -115346 -31522 -10634 -18772 -41403 -64890
10900 -64890 -62071 13658 -1705 -25574 -679 3372 20942 25578 -29075 -49664 -54923 -79133
10888g9133P32k1149Q260P4457K1862J9285L9425j9343n0430o735K7864o5609
10876e0514n6839R6199M6580j8810j3937k1040L6906j7779k4692j0197k1288q516
10864f3927J340K8533L417o760j0288K014j2437j6200k1733O8072N1115k0692
10852B454K0995j521k9727M22l6380N9247O1048m2176m5240n890L4042l8543R381
10839a1888N6072q050k1735l4579J5588r31j0002q559j5049j5329M7112K1554
10827A4204Q965k1009k9389N548k2078N544N9972O9136k200K9221k6805k7090
10815F4019k4338p689P046O971L9450Q343l0569j7224K6854n1288m5352k5744
10803d9521K2684j1560l5662M7303M1014n2898p3781l6647Q9883O9744k2257M773
$$ plain form
10888 -79133 -78401 -99550 -91290 -16833 5029 24314 63739 44396 -6034 -12769 15095 -50514
10876 -50514 -107353 -11154 35426 16616 2679 -18361 18545 766 -23926 -34123 -55411 -63927
10864 -63927 -62587 -34054 -30637 -37397 -47685 -45671 -58108 -74308 -96041 -27969 23146 2454
10852 2454 23449 21928 -7799 -7377 -43757 15490 76538 34362 -10878 -16768 17274 -21269 -11888
10839 -11888 44184 36134 14399 -20180 -4592 -5523 -15525 -24084 -39133 -54462 -7350 14204
10827 14204 23169 2160 -27229 -21681 -43759 -38215 21757 90893 88693 117914 91109 64019
10815 64019 39681 31992 39038 46009 85459 93802 63233 46009 72863 21575 -23777 -49521
10803 -49521 -26837 -38397 -74059 -26756 14258 -38640 -112421 -149068 -59185 10559 -11698 -6925
10791f925K329j8250J3201m5281M340J7051m4290L9386J00887q871j5497l276
10779C4804j6359L6879k9823k4142L6566k8521k5379J2746P697K2662J5097k205
10767D0022k5108k8746L2858J1851J0432p317k3635K1762L8924j7565L0205j740
10755H1943n109R7J3877l8023l8721J0375n1016N319K3280j0440N0943k7582m7137
10742c2194J5556n12m6759j7831P1304L863J265J2581j8124Q3124N1962k531k3942
10729I7762k5459L6359k92k9114k5958l8634m6121N776L0549p7083j7358N2295
10717c7278N7549J4396k4470l7470M012M9812j6884m4707L5305j8812p3219n748
10705i7514N1895L9261m653j2410J7845L3787J8295r867q6965n004M4788O4681
$$ plain form
10791 -6925 -4596 -22846 -9645 -54926 -50586 -33535 -77825 -38439 62448 53577 38080 34804
10779 34804 18445 55324 25501 1359 37925 9404 -15975 -3229 4468 27130 42227 40022
10767 40022 14914 -13832 19026 30877 41309 33992 10357 32119 71043 53478 83683 81943
10755 81943 76834 76931 90808 52785 14064 24439 -26577 -21258 2022 -8418 42525 14943 -32194
10742 -32194 -16638 -17150 -63909 -81740 -10436 -6573 -5308 7273 -10851 72273 124235 121704 97762
10729 97762 72303 108662 108370 79256 53298 14664 -31457 -25681 4868 -72215 -89573 -37278
10717 -37278 20271 34667 10197 -27273 -23261 26551 9667 -35040 265 -18547 -91766 -97514
10705 -97514 -45619 -6358 -11011 -23421 -5576 28211 46506 36639 -50326 -55330 -10542 54139
10693E4139O4686j0548k1201n911n1165L6835R66j3939l3010o4001j3725N9658
10681B784N8687M3540L9400j5724l1501N2879m4530p7114l4670O7404l271J5452
10669G3336O6050j4296p0578n0697L9169K1623M6675J6528n7628j3130k6324l1374
10657f46K6352K3294k0601j0295M1835M1362K8367L1044K9382J3762k4300l2053
10645A47503M4358M9791q7294p4806j1661O171L1858N467j4388O48N1051K8145
10633A76843K706j6752J4152j4004l2323p229j0016j6656M6280L986L6403O9333
10621B52723O0217O9181J51429J79626J89759K66530L37665J65905m3318j61387
10611A468330k94369k91292k14452j49607r9284r3294q0359j39888m8426K0717
$$ plain form
10693 54139 118825 108277 87076 81165 30000 66835 67801 53862 20852 -43149 -56874 2784
10681 2784 61471 105011 144411 128687 97186 150065 105535 28421 -6249 61155 57884 73336
10669 73336 139386 125090 54512 3815 42984 64607 111282 127810 70182 57052 30728 -646
10657 -646 25706 49000 28399 18104 59939 101301 129668 160712 190094 203856 179556 147503
10645 147503 191861 241652 154358 79552 67891 74062 105920 111387 96999 97647 148698 176843
10633 176843 179549 162797 176949 162945 130622 123393 113377 96721 143001 146987 183390 252723
10621 252723 312940 382121 533550 713176 902935 1169465 1507130 1673035 1629717 1468330
10611 1468330 1173961 882669 668217 518610 419326 326032 245673 105785 57359 78076
10601G8076m927L9839R2225K2426k7501j8660m6121m0294o7522j6445Q88N0103
10589F2087N2623k2936q900K9146m8862L0729o614l0570l9523L2739P726J9746
10577G7391L0893l963K4659J3239k8132n1906m9708J9161M3702n137J7419J8781
10565A06399m4411r149O794l2570K9789Q292l8894n882K3857o6030k827K8943
10553D311m0421m6989K6880M2235K9644M062K1738n3591m1807l6155j5506K2524
10541h3075J4657k5747N7197M2993L4208r147n867o8205j2357K1618J5698J8277
10529B50J7361m6468j418J0819K8702p2863k3488P8458O5955n0178l1716M4855
10517B0269K5499n718l9937k7889M658P3319K4636k0249k0863j3922J9009l43
$$ plain form
10601 78076 73149 112988 205213 227639 200138 181478 135357 95063 27541 11096 11984 62087
10589 62087 114710 91774 82874 112020 63158 93887 87273 56703 17180 49919 57645 77391
10577 77391 108284 104321 128980 142219 114087 62181 12473 31634 75336 70199 87618 106399
10565 106399 61988 52839 59633 27063 56852 65144 26250 20368 44225 -21805 -24632 4311
10553 4311 -36110 -83099 -56219 -13984 15660 19722 41460 -12131 -53938 -90093 -105599 -83075
10541 -83075 -68418 -94165 -36968 6025 40233 31086 25219 -42986 -55343 -33725 -18027 250
10529 250 17611 -28857 -30275 -19456 9246 -63617 -87105 -8647 57308 7130 -24586 20269
10517 20269 45768 40050 113 -27776 -23118 50201 74837 54588 33725 19803 38812 38469
10505C8469n587n066K3333J3288J5862k420J8044k2392k7199l1653M50k266j3369
10492e06J9718j2769m5647l0789L3905K9384J5605k0565k7847J4705L872j8415
10480c9349N2678l2665l976O4119m123l5647j8148l5465n279L1121L6884K2503
10468C2653L9866k7061m256J8276n4169m3297j6695P7909P8533o4968m1862n8807
10456f3878N017O6990J2884L3712J7671L004K0395J4629j7937J115n187r4251
10444e836m4259N5920K3921l7688k7102k1806K1784M7874L1371K473P234J9741
10432G3627J6997l1805p4050k9869O7259L77j9155J8581J1096K9824K1783n7736
10420B6929r314l3446j1746m059R736L736k6059L309K0612L5754m1748r4j418
$$ plain form
10505 38469 32882 27816 51149 64437 80299 77879 95923 73531 46332 14679 15129 12863 -506
10492 -506 19212 6443 -39204 -69993 -36088 -6704 8901 -11664 -39511 -24806 -20934 -39349
10480 -39349 13329 -19336 -23312 40807 36684 1037 -17111 -52576 -57855 -26734 10150 32653
10468 32653 72519 45458 41202 59478 5309 -37988 -54683 23226 101759 36791 -5071 -63878
10456 -63878 -58861 8129 21013 54725 72396 75400 95795 110424 92487 93602 88415 -5836
10444 -5836 -50095 5825 29746 -7942 -35044 -56850 -35066 12808 44179 46652 53886 73627
10432 73627 90624 58819 -15231 -45100 22159 22536 3381 21962 33058 62882 84665 26929
10420 26929 17615 -15831 -27577 -31636 -21900 -18164 -44223 -40914 -20302 15452 -26296 -26390 -27808
10407b7808j2799L0763L2564o431K7587L5737J4938J4814m0370n8988P99M0477
10395E1283l1966j6575J302J9761J2624K2714j9697j4488R219j0342M9414L5527
10383A08776n150q408o2698k0471r617M8671k4472k9932L238N855J2752j991q577
10370G976K3723j2997o203L0817j1224o7556J465k4251J9907M6759M7674K157
10358E8247k2108j3917K652K6351p472o7658o986N0696K2893N0676J9436n858
10346A06952m8693o770K6445m3391m2202n245K1059N7911m009P449L5566J056
10334A06128j2358k6612k3618l3362l2051K2492L8607M5637j9813j874m4521j2593
10322F062P8069K4154q8748k1455J2681N1292l311j7418P368k793J7235M50n7886
$$ plain form
10407 -27808 -40607 -9844 22720 16289 43876 79613 94551 109365 68995 10007 10806 51283
10395 51283 19317 2742 4044 23805 36429 59143 39446 24958 34177 23835 73249 108776
10383 108776 103626 95218 32520 12049 2432 51103 26631 -3301 -63 5792 18544 16553 7976
10370 7976 31699 18702 12499 43316 32092 -35464 -33999 -58250 -38343 8416 56090 58247
10358 58247 36139 22222 24874 51225 43753 -23905 -30891 19805 42698 93374 112810 106952
10346 106952 58259 51489 77934 34543 -7659 -12904 8155 66066 62057 69506 105072 106128
10334 106128 93770 67158 43540 10178 -21873 619 39226 84863 65050 63176 18655 6062
10322 6062 84131 108285 19537 -1918 10763 62055 58744 41326 48694 45901 63136 63586 5700
10309E700o3702J6918l54k0295j5210K2188k3550J5573M0111O78O856N2640J2831
10296E0384P022M6998J0122l8213o6317p410M4844L4692k7749j5673P922k8024
10284A8598O123M777J4205P92m7763j1461p733L585N7308Q4986K3688k1153J7087
10271A43039j6434m1424k3646j7656R225m0908L7602P3059n2048l2890L275j6264
10259B4930L4141M7780L000l066M2778J3431l2636k6180j3359m5492K2843O3932
10247A32102k5151p405k015m6672k8134r493k4649j771R322J1800K0832m2175
10235a3409l319J6469N0837M6327j4871k237j3036j5370o4838n2078j3465P0487
10223h503M5572q664J4280K41j5962P889L7796l2091j3746k1426N2770L6868j1549
$$ plain form
10309 5700 -58002 -41084 -41438 -61733 -76943 -54755 -78305 -62732 -22621 -21943 -15087 37553 50384
10296 50384 57406 104404 114526 76313 9996 2586 47430 82122 54373 38700 46622 18598
10284 18598 24721 29498 43703 44495 -3268 -14729 -22462 -18877 38431 123417 147105 125952 143039
10271 143039 126605 85181 61535 43879 53104 12196 49798 122857 70809 37919 41194 24930
10259 24930 59071 106851 109851 106785 149563 162994 130358 104178 90819 45327 68170 132102
10247 132102 106951 99546 97531 50859 22725 13232 -11417 -13188 -3866 7934 28766 -13409
10235 -13409 -16728 -259 50578 96905 82034 79797 66761 51391 -13447 -65525 -78990 -8503
10223 -8503 37069 28405 42685 42926 26964 34853 72649 40558 26812 5386 58156 95024 83475
10210H3475j4290k3703Q319q582j3639m7585n4254K0541K3453L8595P133J6479
10198C5942K3009l953K8228l6617l286j6273k8589Q017p309J2720L1796J7747
10186F1432O594N2292J4236l5452j5175o1494J0324K3756M9238K7339j2988m3385
10174G6717k3207l3474k0617j6926J0050N1217K7397J7388Q629l1338n1616q906
10162E314J2322K4733Q4254M5271K5361l2502l4749l7684j0150m7565J9799K5200
10150G9604k2370n433K870J8268J851K2246N5585K4754k1356k4530l3616J1766
10138A09639k1640o980l3595L2308K8588k6440K0940l7914J4628P923j7373k0407
10126D9677m778Q707j691j3017j6316J3043l1781J7458K0802l2548m2287k019
$$ plain form
10210 83475 69185 45482 53801 45219 31580 -16005 -70259 -49718 -26265 12330 19463 35942
10198 35942 58951 54998 83226 46609 43323 27050 -1539 6478 -831 11889 43685 61432
10186 61432 68026 120318 134554 99102 83927 22433 32757 56513 105751 133090 120102 76717
10174 76717 53510 20036 -581 -17507 -7457 43760 71157 88545 97174 65836 14220 5314
10162 5314 17636 42369 126623 171894 197255 164753 130004 92320 82170 34605 54404 79604
10150 79604 57234 51801 54671 72939 74790 97036 152621 177375 156019 131489 97873 109639
10138 109639 87999 81019 47424 79732 108320 81880 102820 64906 79534 87457 70084 49677
10126 49677 44899 53606 51915 38898 22582 35625 3844 21302 42104 9556 -32731 -34750
10114c4750M3514L473j1701O9539K3547p0297q803N346q034l4959q827N6252Q5472
10101A09772P7648R019n0096j2010O490n5695j8274J2133M0147k5407j0564L527
10089H6690M227K0996R824k5719J442J3664j4445J7347r232k4986m928l2781K3140
10076F5239L300j4088M843l2886J2107k3389K219K8516N0250o10J2591R573m3325
10063G4340m8102m9494K6722K2624K2210J0958K5978J5540O3130j3927r3768n400
10051E0811k808J8657M2283j0532N2904p05r106N3483J8736m3084l298J405r738
10038A59008o970q871j9091P49K187J7375l4532K6386L1803m2170j3160r588n030
10025I8096J5145L160L7355n2855k3903L8255L9011k4438l918L3245r457j6784
$$ plain form
10114 -34750 8764 12237 536 70075 93622 23325 14522 19868 11834 -23125 -31952 24300 109772
10101 109772 187420 196439 146343 134333 140823 85128 66854 78987 119134 93727 83163 86690
10089 86690 90917 111913 121737 96018 97460 111124 96679 114026 104794 79808 74880 42099 65239
10076 65239 68539 54451 59294 26408 38515 15126 17345 45861 96111 95501 108092 117665 74340
10063 74340 26238 -23256 3466 26090 48300 59258 85236 100776 163906 149979 56211 50811
10051 50811 48003 66660 108943 98411 151315 150610 141504 194987 213723 170639 167341 168746 159008
10038 159008 152038 143167 124076 124825 127012 144387 109855 136241 168044 125874 112714 103126 98096
10025 98096 113241 116401 153756 100901 76998 115253 154264 129826 125908 159153 149696 132912
10013A32912k09J8211J3171M830M3142L2002k0368o264n0653n2093j2292l2349
10001G0040L2263O3124j5796m2102m0848k6668N4224N8665L7011j0400q95L0425
9989B09043j7125J667J2777p784J0678M4927j3609j7884j2907K2120J5650q795
9977B38758r934k9205j3225J2508N068L670N40K4389l8914l9882j2923N0474M2310
9964B33634J3935N3249m1494j00465j9896N3469J9161j1776j5426N5802M5874
9953B86067n313L3542l5375l8552j0844O871j1004k8105k0939L4662N7958N7985
9941C26953J8024m8684n3639l3216L3551K8593r55Q179J1180M25J3887L297K1765
9928C29360N1753j2661K1742M09M4099R9800J33074J57746J92678K43476K18459
$$ plain form
10013 132912 132703 150914 164085 168915 212057 244059 223691 217427 166774 114681 102389 70040
10001 70040 102303 165427 149631 107529 66681 40013 94237 152902 189913 179513 178618 209043
9989 209043 191918 193585 206362 198578 209256 254183 240574 222690 209783 231903 247553 238758
9977 238758 228824 199619 186394 198902 203970 207640 208180 232569 193655 153773 140850 191324 233634
9964 233634 247569 300818 259324 158859 138963 192432 211593 199817 184391 240193 286067
9953 286067 280754 314296 278921 240369 229525 236396 225392 197287 176348 211010 268968 326953
9941 326953 344977 296293 242654 209438 242989 271582 270627 278806 289986 290411 304298 307595 329360
9928 329360 381113 368452 390194 390603 434702 534502 667576 825322 1018000 1261476 1479935
9917A479935J28134K782j58697k85800k40191j80381j15646o6823n4247q3817
9907D25249k4102j288J5219R710k565j1085k0600m6868k2158L7788N058m720K9497
9894C89135L0480k5877J9343K7804k433P477K8961L0281k8029j4335j0457J0892
9882D63242k4099m4931k1188l2076K6882P0856L0721k1091k0396n7976J12N788
9870C75844k58n566o488R4122O3187m046J9912k5608r37m6510j3021p14K7276
9857D77193K4189M7564M0092M0751L6465K6834k8093L4059M3622K8925J18008
9846H89609J62050J37623J37787Q420J0183l3652j46621j51763j18434j05629
9836G89573p7088k5155k2304o1231K3534K9184P857k8388q8082K5715K1338K8298
$$ plain form
9917 1479935 1608069 1610851 1452154 1166354 926163 745782 630136 563313 509066 425249
9907 425249 401147 399859 415078 424788 422223 411138 390538 343670 321512 359300 364358 359638 389135
9894 389135 419615 393738 413081 440885 438452 445929 474890 505171 477142 462807 452350 463242
9882 463242 439143 394212 373024 340948 367830 438686 469407 448316 427920 369944 370056 375844
9870 375844 375586 370020 363532 457654 520841 516795 536707 511099 510162 463652 450631 449917 477193
9857 477193 501382 548946 589038 629789 666254 693088 664995 699054 742676 771601 889609
9846 889609 1051659 1189282 1327069 1335489 1345672 1312020 1165399 1013636 895202 789573
9836 789573 712485 687330 665026 603795 627329 656513 664370 635982 547900 573615 594953 623251
9824F23251M1971J9951j1051k0156n7915k4986M0352P5287K9206j0263k40m0687
9812F64720n8286l3704m1588j8423O8183M2580K1189j6527M6390j4457k36O0137
9800G19978M2572K621L0715K5996J5270l6379m379K2173j4955l9381j767O3102
9788H25566K4210Q2720M5540j2812J8399O728J5582k5663n2926k2962k8426k2396
9776H53560P6161N0323O1225M1310J6861l2258N6774N5049o0984J1139J346l6837
9764A093669k1353l1502N7801O5195K7859K1818N5538K3587k7456n2217K6329
9753A239268P9551M2073m990j1531Q884L230o602L1139O0386O8432P6640J6542
9741A603022N508Q0135L1568P589l4177m0036Q381K8315L2687M1557K2452Q706
$$ plain form
9824 623251 665222 685173 674122 653966 596051 571065 611417 686704 715910 705647 705407 664720
9812 664720 606434 572730 531142 512719 580902 623482 644671 628144 674534 660077 659841 719978
9800 719978 762550 765171 795886 821882 837152 800773 796394 818567 803612 764231 762464 825566
9788 825566 849776 932496 978036 965224 983623 990351 1005933 980270 927344 904382 875956 853560
9776 853560 929721 980044 1041269 1082579 1099440 1067182 1123956 1179005 1118021 1129160 1130506 1093669
9764 1093669 1072316 1040814 1098615 1163810 1191669 1213487 1269025 1292612 1265156 1212939 1239268
9753 1239268 1318819 1360892 1355902 1344371 1353255 1356485 1349883 1381022 1441408 1509840 1586480 1603022
9741 1603022 1608530 1688665 1720233 1727822 1693645 1653609 1661990 1690305 1722992 1764549 1787001 1795707
9729A795707Q5377M6393M9844K2144P452J0402L9619M1792L1274M5073L2348M1827
9717B249252L7808N6514K5694l8513j9032J6529J02472P0426L5241O5746J10913
9706B713050L8217k6131p241K6927K1358P6606M6273O8831J08327N2845L8194
9695C157256k9496N3287Q5123M6143K3206O34P8112O9832P4951O5800J5359O551
9683C646758O3816J0934L5619O5158L0520Q131M5658R6193K8942K8396O3065K7153
9671D150343P6130O9052M9130J2363O9290M8253M461l8938N5513L8032N084j416
9659D537297L5668L5737k586O429M7641K0436r431O707M7337m086m5087K2319
9647D698381K2988K7553J0383K8654n4876n2745j4498k4075K3247k9291L994j3680
$$ plain form
9729 1795707 1881084 1927477 1977321 1999465 2006917 2017319 2056938 2098730 2130004 2175077 2207425 2249252
9717 2249252 2287060 2343574 2369268 2330755 2311723 2328252 2430724 2501150 2536391 2602137 2713050
9706 2713050 2751267 2725136 2717895 2744822 2766180 2842786 2889059 2957890 3066217 3119062 3157256
9695 3157256 3127760 3181047 3266170 3312313 3335519 3336153 3414265 3484097 3559048 3624848 3640207 3646758
9683 3646758 3710574 3721508 3757127 3822285 3852805 3860936 3906594 4002787 4031729 4060125 4123190 4150343
9671 4150343 4226473 4295525 4344655 4357018 4426308 4474561 4479022 4440084 4495597 4533629 4538713 4537297
9659 4537297 4572965 4608702 4606116 4612545 4660186 4680622 4671191 4677898 4725235 4721149 4676062 4698381
9647 4698381 4721369 4748922 4759305 4787959 4733083 4680338 4665840 4641765 4665012 4635721 4639715 4626035
9635D626035j8080l6659J3201O478k9548k4018q7056p9384j1782o2049j13820
9624D183318k9153j7085l4572l4627j7807K3270m7314n1686q4743m5261n6506
9613C787834m0629R839P156q0274q4098o3903l2209q605l3195p1939r8473p2535
9601C218969k044m667n6908m6333m5689k1831j16919q4078l1645o2011n6964j1888
9589B677992m6095k0159q0990k7066n28l5985o4825m4855r824J0475j3831l7465
9577B306844K1797j7515p5238o9792o0094l6841M266J2548o8687j7175o6677o3639
9565A869797l9582k717j6504M627m2073L2986P524m4605n4169k7526q7066j5570
9553A585122J7880K4238k1786n6498N4642L9058m9736o3715l7906m3035m3377
$$ plain form
9635 4626035 4607955 4571296 4584497 4590975 4561427 4537409 4450353 4370969 4359187 4297138 4183318
9624 4183318 4154165 4137080 4102508 4067881 4050074 4073344 4026030 3974344 3889601 3844340 3787834
9613 3787834 3747205 3757044 3764200 3683926 3599828 3535925 3503716 3495111 3461916 3389977 3291504 3218969
9601 3218969 3216925 3212258 3155350 3109017 3063328 3041497 2924578 2840500 2808855 2746844 2689880 2677992
9589 2677992 2631897 2611738 2530748 2503682 2503154 2467169 2402344 2357489 2347665 2358140 2344309 2306844
9577 2306844 2328641 2311126 2235888 2166096 2106002 2069161 2073427 2085975 2017288 2000113 1933436 1869797
9565 1869797 1830215 1827498 1810994 1815621 1773548 1806534 1814058 1769453 1715284 1687758 1600692 1585122
9553 1585122 1603002 1627240 1605454 1548956 1603598 1642656 1592920 1529205 1491299 1448264 1404887
9542A404887j9902P029M0041M4013J2421k6813m9102M61j5684l7193r467l4704
9530A315987m1700q9255r5460r276K0140L9839p561K8159l7481r9844j8292J120
9518A006376M6547m4081R742N2060l865m700j5377k9259j202P083l7368p3703
9506I12253q932p688l0734L0580K5204j6323l0730n2076r1307l9967j2357J4722
9494F92645j5238j3816j987L1379K062j6351P627l343l242k0158J0754K4206l0975
9481F63563q400K0625m3358k8428K3699j9453o0748q3425M8744M6794J8048K6798
9469F04459J7969j4284j9424m7412q2195k955n8p186K5946N7859L5825M75q853
9456E60166K9872m2343l9461j9104M9638l570P112k1443n2333m4663k0773m2Q923
$$ plain form
9542 1404887 1384985 1392014 1432055 1476068 1488489 1461676 1412574 1413035 1397351 1360158 1350691 1315987
9530 1315987 1274287 1185032 1089572 1080296 1100436 1140275 1132714 1160873 1123392 1023548 1005256 1006376
9518 1006376 1052923 1008842 1018584 1070644 1066779 1062079 1046702 1017443 1016241 1023324 985956 912253
9506 912253 903321 895633 864899 895479 920683 904360 873630 821554 730247 690280 677923 692645
9494 692645 677407 663591 661604 692983 695045 678694 686321 682978 679736 659578 670332 694538 663563
9481 663563 655163 675788 632430 604002 627701 608248 547500 464075 512819 559613 577661 604459
9469 604459 622428 608144 588720 541308 459113 456158 456100 448914 474860 532719 568544 569019 560166
9456 560166 590038 547695 508234 489130 538768 535198 542310 520867 468534 423871 403098 403056 411979
9443D11979l904n664L3389N9437J4024j8332j3604m3647o714l4366l1965j986
9431C58647K6578j9194K3167l0270n6195Q074J3465N8340L7848J8591k8863j4322
9419C95866j471j9147O869m1856M059j3014j8320L238n3850L2026M8823K0061
9407C63284n0247n3436K1203P1596m109k0152Q769R971j2558j849r555k2733k9979
9394B70205J5591K643k5121n0770O0142K2533m4696l8607L0901L8181L233n4652
9382B29583q685p301j0159P6062L1211L6225L8420r767k1574j2959q461j7286
9370C15309K1704K5347j6249k6825j6953J0969J1348n0017l3707J0044M612J6888
9358B72470k573J4199m0803m6885l2421j2455r691J505K7224J3440J5210L2634
$$ plain form
9443 411979 408075 402411 435800 495237 509261 490929 477325 433678 426964 392598 360633 358647
9431 358647 385225 366031 389198 358928 302733 310807 324272 382612 420460 439051 410188 395866
9419 395866 394395 375248 382117 340261 344320 331306 312986 316224 262374 294400 343223 363284
9407 363284 313037 259601 280804 352400 348291 328139 336908 346879 334321 332472 322917 300184 270205
9394 270205 285796 288439 263318 212548 272690 295223 250527 211920 242821 281002 284235 229583
9382 229583 220898 213597 203438 279500 310711 346936 385356 375589 354015 341056 332595 315309
9370 315309 337013 362360 346111 319286 302333 313302 324650 274633 240926 250970 255582 272470
9358 272470 269897 284096 243293 196408 163987 151532 141841 143346 170570 184010 199220 231854
9346B31854P902k595l0554L4816L07P160l0224l9206J0211J0343K1965K7545r037
9333B40487p766n94l5487k2902J2444N783o8668k2252k704l1145K1935M1784L7024
9320A67939O580K2649K1550L3336p903k1007K2744j5310j4668k3333k4365J9027
9308A87239N4333K1518l3586q007J3254Q52j0907l1477l2507k3801L5549j0286
9296A62174l3540J4605L6287J4371l1507k1490R107P3193j51O982k0062q5744
9284A24225l7061J0497L2063j9923l3958m172k2938r730J2695P8926R6621l0610
9272A96635l4879L1555k7435p9250J5805K2532P594K9621j057K438L0450n0417
9260A43592o097L6386K2827J4629j1381l9579n0070p948m070j8318Q816L7801
$$ plain form
9346 231854 239756 237161 206607 241423 241730 248890 218666 179460 189671 200014 221979 249524 240487
9333 240487 232721 232127 196640 173738 186182 191965 123297 101045 98341 67196 89131 130915 167939
9320 167939 174519 197168 218718 252054 244151 223144 245888 230578 215910 192577 168212 187239
9308 187239 241572 263090 229504 221497 234751 235603 224696 193219 160712 136911 172460 162174
9296 162174 128634 143239 179526 193897 162390 140900 150007 223200 223049 230031 209969 124225
9284 124225 87164 97661 129724 109801 75843 71671 48733 39003 51698 130624 227245 196635
9272 196635 161756 193311 165876 86626 102431 124963 132557 162178 161121 163559 194009 143592
9260 143592 137495 173881 196708 211337 199956 160377 110307 102359 98289 79971 88787 126588
9248A26588M9287l3553l1853R107K4563J7331L1336O0211m1234P215q420l3983
9236A76595k088l7586L6161J3561l5204k2926k5349K6747j4630j4298K2943K404
9224A26330k025j0789j5711k0716J3159P260M153j1389p959k4557R827N1908K4278
9211A43769J1113j912k3664m8666J6866K2252j2805M6321M442j9512l1358k3681
9199H3165M8757J6708Q645J0299p054p848j0172M522j7910j8786Q838n027m0657
9186G3480J1457K1914J4176k8386Q56p509N826L2017L3491j7713l8914n2721l5571
9173A2403k655K9506M3656k2183r317L964K0074J0578p66q082k4313L3475o461
9160G9879j6022J4818k3515J8210N4815J9930j23L0346J8295m870o4069l4114
$$ plain form
9248 126588 175875 142322 110469 119576 144139 161470 192806 253017 211783 218998 210578 176595
9236 176595 174507 136921 173082 186643 151439 128513 103164 129911 115281 100983 123926 126330
9224 126330 124305 113516 97805 77089 90248 97508 101661 90272 82313 57756 67583 119491 143769
9211 143769 154882 152970 129306 80640 97506 119758 106953 153274 157716 138204 106846 83165
9199 83165 131922 148630 157275 167574 160520 152672 142500 147022 129112 110326 119164 114137 73480
9186 73480 84937 106851 121027 92641 93497 85988 91814 123831 157322 139609 100695 47974 12403
9173 12403 9748 39254 82910 60727 51410 55374 75448 86026 85260 77178 52865 86340 79879
9160 79879 63857 78675 55160 73370 128185 148115 147992 178338 196633 191763 127694 93580
9148I3580K6210j1366m5610l4641m1299o1406K7045J2559N510L177L854O6597
9136D4210N8670J8591j5720l7075l3794j9116O1690R190n5115J9507O3924K4008
9124A38970o1297j866k8472k6796O627L2490Q670J0333J3238K845J4815j1474
9112I8083l1100J7510l570J1850j4337Q17J2045p602N2511L8015j6440j961l1247
9099A24574l9524J3739J9917P13r374j2266m520k9162j2735N794m230J575O8137
9086A22638J9436n608l1519l057L697r889j8296k144N328O8549J9779q0909k4794
9073F3211q515m02R3Q730K4762k1438J5914L3079n1393k7681L1572M5674r29J0992
9059A23669K0146l8795L680M963m6313j940j4291K7366r616K0400L7636m7394
$$ plain form
9148 93580 119790 108424 62814 28173 -13126 -74532 -47487 -34928 -29418 -26241 -22387 44210
9136 44210 102880 121471 105751 68676 34882 15766 77456 86646 31531 51038 114962 138970
9124 138970 77673 75807 47335 20539 27166 59656 68326 78659 91897 94742 109557 98083
9112 98083 66983 84493 80923 92773 78436 79253 91298 83696 136207 174222 157782 155821 124574
9099 124574 85050 98789 118706 119419 110045 97779 93259 64097 51362 57156 52926 54501 122638
9086 122638 142074 136466 104947 101890 105587 95698 77402 75258 80586 149135 168914 88005 63211
9073 63211 54696 54294 54387 63117 87879 66441 82355 115434 64041 36360 67932 113606 112677 123669
9059 123669 143815 105020 108700 113663 67350 65410 51119 78485 68869 89269 126905 79511
9047G9511k9695L1526k419j2085m062m0173j268L832K1227r283M7851J4939o5335
9034C4566j866K5829L6703K4466J031k9347m8387k3037L5778M0918K7835N085
9022A29574J3536J145M997o0158j2204K132j8067j1980N624O678L003q354O921
9009F2847L1403L1515R33j9941K6658O4076j7916n6089L2705L4600n7997k520
8997A30274L4952J3358m2195k5294L2703K2071L4777q6813m4069J3644L2485j8049
8985I7844J4827L3698J9686l3029M8249K0151j6800j0705l7550J536N1185M0330
8973B29422j6519O922M4652n970K5169J989J9293k761K3233k064k0187K5871k2640
8960C06410L2118P9051L0626K1967O3962M5248L5717N2802K4668N6530Q7231R2640
$$ plain form
9047 79511 49816 81342 78923 66838 62776 22603 21335 25167 46394 37111 84962 99901 34566
9034 34566 32700 58529 95232 119698 120729 91382 42995 19958 55736 96654 124489 129574
9022 129574 143110 144255 149252 89094 76890 79022 60955 48975 54599 61277 64280 55926 62847
9009 62847 94250 125765 126698 106757 133415 197491 179575 123486 156191 190791 132794 130274
8997 130274 165226 178584 136389 111095 143798 165869 200646 113833 69764 83408 115893 97844
8985 97844 112671 146369 166055 133026 181275 201426 184626 173921 136371 137907 189092 229422
8973 229422 212903 219825 264477 258507 283676 285665 304958 302197 325430 323366 303179 329050 306410
8960 306410 338528 417579 448205 470172 534134 579382 615099 667901 692569 749099 836330 928970
8948I28970J96438K04952J61850J89602K39169L49401M08432M47681L79896K42469
8938C748860N9634q9563k75947l78668l66852l04490l47327k90191k18667j63595
8928A373194j22072m4032q2335j13838j34244r7252L4671j1733j0715O1495N0257
8917I03396N5913L558j5516Q1439K3053K7878r520K5512N6436Q4994J61411J04644
8905A503198M6671J42884K71988J90540J79973L68845N01396N89985O40407P48649
8895E184536Q25345P66385N26116J99509k53450m98159p11876q10461p72443o07055
8885C848447n45114n16112m34461k91669k11760j97978j92542j25878j35133n7511
8875A140289n7918l0959m3168l7335j0933o911k9240K0325K5896J6464K2481N0508
$$ plain form
8948 928970 1125408 1330360 1492210 1681812 1920981 2270382 2678814 3126495 3506391 3748860
8938 3748860 3808494 3718931 3442984 3064316 2697464 2392974 2045647 1755456 1536789 1373194
8928 1373194 1251122 1207090 1124755 1010917 876673 779421 814092 802359 791644 853139 903396
8917 903396 959309 962867 947351 1028790 1051843 1079721 1070201 1095713 1152149 1237143 1398554 1503198
8905 1503198 1549869 1692753 1964741 2155281 2335254 2704099 3205495 3795480 4435887 5184536
8895 5184536 6009881 6776266 7302382 7501891 7248441 6750282 6038406 5227945 4455502 3848447
8885 3848447 3303333 2787221 2352760 2061091 1849331 1651353 1458811 1332933 1197800 1140289
8875 1140289 1082371 1051412 1008244 970909 959976 953065 923825 944150 970046 986510 1008991 1059499
8863A059499L4463M29R722L5329N2550M4703P9017P1622P7487J95120K43127K51775
8851B154843K26565K70567L60987L41534K43289J18037O399j64131k63108l46970
8841B948012l48565l56743l44856k72114j91446j72925j31920j02350r6231o0485
8831H70377n6457k8865k5432m4669l1542k8031j0523j5227O579o466K3115O2353
8819G15212L0055n9643m8606k9495m701k4685r49Q36J86P023J2981m7415k6397
8806E24402l0263J7729r402K0568K8805l5382J3949J9652k1968o575m2490M465
8794D83490j0502L2575R5243O0429O5753R0746R4299J22386O6639R6932K6678
8783A224668n644Q123l9175P826J99m6112j39316j41311j23861p0605k5747k227
$$ plain form
8863 1059499 1093962 1094391 1104113 1139442 1191992 1236695 1315712 1387334 1464821 1659941 1903068 2154843
8851 2154843 2381408 2651975 3012962 3354496 3597785 3715822 3722221 3558090 3294982 2948012
8841 2948012 2599447 2242704 1897848 1625734 1434288 1261363 1129443 1027093 930862 870377
8831 870377 813920 785055 759623 714954 683412 655381 644858 629631 636210 629744 652859 715212
8819 715212 745267 685624 637018 607523 602822 578137 577188 578024 578210 585233 598214 550799 524402
8806 524402 494139 511868 502466 523034 551839 516457 530406 550058 528090 521515 479025 483490
8794 483490 472988 505563 600806 661235 726988 817734 912033 1034419 1101058 1197990 1224668
8783 1224668 1219024 1227147 1187972 1195798 1195997 1149885 1010569 869258 745397 674792 649045 646818
8771F46818k7681m9141M4293J5948k691p686o0757o8218L1524M5915l7741n6325
8759D74258O5678l9841q1431k099M4569M3636N8589N0478k447j8706m24N4233
8747F46493Q9340R8011J11382K02262K56648J65123J53753R2402J1747J638k5704
8736A803095l1955J287n2861j33219j60073k23997j90724j56592j07041l3797
8726G14123k9312p3750o3747o6003n0935J1984L646j5870k6936k1940K2015r397
8714C93878J6545l3423j2167j5617O511K492J3320K9408L3796J375K3267J4019
8702D73404N4204K6982K9418R5340J51298M2183L6332M5218O8006l100q008j3100
8690I98177j8847q4499r8478j40490j23965r1976o7891m0116m5755l1393p951
$$ plain form
8771 646818 619137 569996 614289 630237 627546 619860 559103 490885 522409 568324 530583 474258
8759 474258 539936 500095 418664 416565 461134 504770 563359 613837 611390 592684 592260 646493
8747 646493 735833 833844 945226 1147488 1404136 1569259 1723012 1815414 1827161 1828799 1803095
8736 1803095 1771140 1772427 1719566 1586347 1426274 1202277 1011553 854961 747920 714123
8726 714123 684811 611061 547314 481311 430376 442360 446006 430136 403200 381260 403275 393878
8714 393878 410423 377000 364833 349216 355727 358219 371539 400947 434743 436118 459385 473404
8702 473404 527608 554590 584008 679348 830646 872829 909161 954379 1022385 1019285 1011277 998177
8690 998177 979330 894831 796353 655863 531898 439922 372031 331915 286160 254767 246816
8679B46816o0m9920k6352j1914j1667k1832j9699k1269P0923l84p6949k0875K4862
8666H1680N1823P5352n1877o8097l0983J2906K0349q631J5803k3093l211J3332
8654H5353K7801L7885j5470M1177q027K8663L3877l272j0489P6095N2224J0488
8642C56305N5539N681k7729l1497m8639l0015k0718m3971l6012k559l840P241
8630A79786r159k7689J6386O4911q280j1348j572J7893J9115O398l9557K2479
8618B29363P4167O1691O6367N2274m2725l9033n6100q9918n4681M148M3250p986
8606B40817N017l812J6631k476j6342j9331N2187R7510J31764J33760M1988p3111
8594F04602k6179o9935p2575l7053o1224r0397k4044J573p12k5465J2827K8969
$$ plain form
8679 246816 246756 196836 170484 158570 146903 125071 105372 84103 155026 154642 77693 56818 81680
8666 81680 133503 208855 156978 88881 57898 70804 91153 82522 98325 75232 72021 85353
8654 85353 113154 151039 135569 176746 168719 197382 231259 227987 217498 293593 345817 356305
8642 356305 411844 417525 389796 358299 309660 279645 258927 214956 178944 176385 172545 179786
8630 179786 170627 142938 159324 224235 215955 204607 203035 220928 240043 246441 206884 229363
8618 229363 303530 365221 431588 483862 441137 402104 346004 256086 201405 205553 248803 240817
8606 240817 245834 242022 258653 256177 239835 220504 272691 370201 501965 635725 677713 604602
8594 604602 578423 508488 435913 398860 337636 247239 223195 224768 224056 198591 211418 240387
8582B40387q0o3703o469J5600P4159J03993M4409R2039J38189P9977K833j05352
8570F15982r4622j00208q2067p0118o1547n2850k7101K1962O907J0732l4730l889
8558A28451j4179m5390N7610N5898N198L4619K2255L8521J43k9717j6306n6149
8546A80954k5675l8556J4681J0011n9341n79J8039m3803k8505L5216R559o389
8534F5612O913P9449N7015L3007M3850J7626N5878J0773j7995n4623r5012n0448
8522A52045k7259j0029q117l4786m6174k537J9784p596m7206j853M2037j1274
8510A7035l0313j5117k1206K6888L9147m9256m6913m2962L8223M3729O3195L3512
8498E5962r642k5679k7094j3493j472J9962K8611J5903J8205K7192j7981l9457
$$ plain form
8582 240387 240307 176604 170135 185735 259894 363887 408296 500335 638524 718501 721334 615982
8570 615982 521360 421152 339085 268967 207420 154570 127469 149431 156338 167070 132340 128451
8558 128451 114272 68882 126492 182390 187588 222207 244462 282983 283126 253409 237103 180954
8546 180954 155279 116723 131404 141415 82074 81495 99534 55731 27226 62442 72001 65612
8534 65612 72525 151974 208989 241996 285846 303472 359350 370123 352128 297505 202493 152045
8522 152045 124786 114757 106640 71854 25680 23143 42927 35331 -11875 -13728 28309 17035
8510 17035 -13278 -28395 -49601 -22713 16434 -32822 -79735 -122697 -84474 -40745 22450 55962
8498 55962 46320 20641 -6453 -19946 -21418 -1456 27155 43058 61263 88455 70474 31017
8486C1017L0194K7345J1905k1859k3555p633O25l1349N8816M5917k694m9645k5637
8473D3447k2540J1040K7654O413J599k4221l1127k850r722k3909M3234M2446J2482
8460G3946M5289l5081j1325L2952m1790n1997L9517L3445o6922l8858l4030l0043
8448h4897O2245L6101K5365q352l2587J166L303J2146N432J2245K1498o4680n2567
8435f3582j799L8489M0075K3949J9079L718K4213J6181K8935k024m9469l5621
8423D2144j6713j7325j9159J1650j7859N3376J3047M670k1612l323J5977Q321
8411E3194n5140L1568K6040m4889k6631M5665K2247l656J8189j0317n9950m9209
8399e2889k0254K8419Q075N796L3718M444j2894j4755L6830n4153l1746L7911
$$ plain form
8486 31017 61211 88556 100461 78602 55047 47414 48039 16690 75506 121423 118729 69084 43447
8473 43447 20907 31947 59601 66014 67613 43392 12265 9415 -307 -24216 19018 61464 73946
8460 73946 119235 84154 72829 105781 63991 11994 51511 84956 18034 -20824 -54854 -84897
8448 -84897 -22652 13449 38814 30462 -2125 -959 2344 14490 19922 32167 53665 -11015 -63582
8435 -63582 -65381 -26892 13183 37132 56211 59929 84142 100323 129258 127234 77765 42144
8423 42144 25431 8106 -11053 597 -17262 36114 49161 53831 32219 28896 44873 53194
8411 53194 -1946 29622 55662 10773 -15858 29807 52054 48398 66587 56270 -3680 -52889
8399 -52889 -73143 -44724 -36649 -30853 2865 7309 -5585 -20340 16490 -37663 -69409 -31498
8387c1498M3894k5230l8081P599j7886j4031L1538k8346j7774J8366N6831L3360
8375A8742j4522n7393l476O7354R648J8529J9800j9167K1020n7523l4823N433
8363b6378m272L9836K4198l2454J2078K2816K4426k2654l2073m7979j9276k1495
8351h3227j0952O2766M7065J4677k7063o3376j0261O3973J8871j9317J1866Q447
8339A3469K3773J8988J0084M9476O298n178o1230j0104l7686K7002J3248K2179
8327G0319L883r517n1601J7043O4524J488j6454m7304n5431l1350L7224L1693
8315A4517K037j7928r604j464N785M6734J459R854p7342l5523N5299k031k1303
8302b9510k406M9878L6897J5014k7780m8779l8880N5769L7188k2967o796k048
$$ plain form
8387 -31498 12396 -12834 -50915 -43316 -61202 -75233 -43695 -72041 -89815 -71449 -14618 18742
8375 18742 4220 -53173 -56649 10705 20353 38882 58682 39515 60535 3012 -31811 -26378
8363 -26378 -30650 9186 33384 930 13008 35824 60250 37596 5523 -42456 -61732 -83227
8351 -83227 -94179 -31413 15652 30329 3266 -60110 -70371 -6398 12473 -6844 5022 13469
8339 13469 37242 56230 66314 115790 122088 116910 55680 45576 7890 34892 48140 70319
8327 70319 74202 64685 13084 30127 94651 96139 79685 32381 -23050 -54400 -17176 14517
8315 14517 16554 -1374 -10978 -12442 -6657 40077 41536 51390 -25952 -61475 -6176 -8207 -29510
8302 -29510 -31916 17962 54859 69873 42093 -6686 -45566 10203 47391 24424 17628 15580
8290A5580J3879k8685J0162L0407l2109J6011L1214R864m0010k458O425k7010
8278C270q5922j6983P4871K0548k9160m2532O1596M9250j050p803L353L4537K8174
8265I2149m0721j5121K8231j844l5645l6316j7695k6625J473L2017m230k9337
8253e3664k1695l1988p963j6206K8140Q1510K2964N5089J990o095L4313j0116
8241G6279m5346l7274J0297j0394J679j1873K577j0018k9647N7536J5182l9821
8229b0823J3977p017J7906L719l5625l4632p239L0123R514m1513J7512n708l2925
8216i2731M43Q40L5818L7905N2865j4745l0927K1625m4888J7231L9463K4290O343
8203E3532k101J6765r067o934j8030M033J9663J5515J2512j261l9595J2077n97
$$ plain form
8290 15580 29459 774 10936 41343 9234 25245 56459 66323 26313 23855 30280 3270
8278 3270 -82652 -99635 -24764 -4216 -33376 -75908 -14312 34938 33888 26085 29438 63975 92149
8265 92149 51428 36307 64538 62694 27049 -9267 -26962 -53587 -52114 -20097 -24327 -53664
8253 -53664 -75359 -107347 -115310 -131516 -103376 -21866 1098 56187 58177 52082 86395 76279
8241 76279 30933 -6341 3956 -6438 -4759 -16632 -14055 -24073 -53720 3816 18998 -20823
8229 -20823 -6846 -13863 4043 7762 -27863 -62495 -69734 -39611 -30097 -71610 -54098 -59806 -92731
8216 -92731 -92288 -91448 -55630 -17725 35140 20395 -10532 11093 -33795 -16564 22899 47189 53532
8203 53532 51431 68196 59129 52195 34165 38198 57861 73376 85888 84627 45032 57109 56512
8190E6512l7151l6663j1646j5476m63K7007m9421k7403m6656l550J5464O5072
8178f4374K9357L2513K1045j389J7643K4205j143R622l9087p0770o549p67J8742
8165c0952K6656J6545L9776l3733j135L210k1522J2217J1794p349M0322J0645
8153F6474l4132K6176k9587l4037J5319J7751j931j7758l0512n9682k2876m988
8141a09783N9360M0384K1206K7228j8236o0593n8123K9351l0360k8806Q6987J2612
8129b8773O1458k5695l6591l818l926K3258j5268J5744r650m4199j0644M4600
8117c3504K9481j5861m612J7521l9775N754k9310l3602O397j4764j3996J9031
8105a07240R480K0383L4450J0165o891M4007N5061L9423j59j6945j9212j1618
$$ plain form
8190 56512 19361 -17302 -28948 -44424 -44887 -17880 -67301 -94704 -141360 -144910 -129446 -64374
8178 -64374 -35017 -2504 18541 17152 34795 59000 57857 67479 28392 -42378 -48927 -49694 -30952
8165 -30952 -4296 12249 52025 18292 17157 20367 -1155 11062 22856 15507 55829 66474
8153 66474 32342 58518 28931 -5106 10213 27964 26033 8275 -22237 -81919 -104795 -109783
8141 -109783 -50423 -10039 11167 38395 20159 -40434 -98557 -69206 -99566 -128372 -41385 -28773
8129 -28773 32685 6990 -29601 -33419 -37345 -14087 -29355 -13611 -23261 -67460 -78104 -33504
8117 -33504 -4023 -19884 -24496 -6975 -46750 -40996 -70306 -103908 -97511 -112275 -126271 -107240
8105 -107240 -97760 -77377 -42927 -32762 -39653 4354 59415 98838 98679 81734 62522 50904
8093E0904l5527k2469N6902N4906p331l0304q136l9983l3138J4014M7904M956
8081E2698m2567j8182J3131k4022J3973J7460k1259J1915K2240O0092M902J3139
8069A03520j7679o6686J9420K7208l9945r3338M550j2653k5188M5560L5017O957
8057a3257m8655j3986O0160r776K6571K9806l6176k0884R086n32J9322N6178J5020
8044G2877n6945q02J3652L1684j1963j8471J0773j8439m3954j5202l9731M7713
8032b8808R8204O4146j6203o0687n3521j3235O004M0594J2027p124k9599l4142
8020b2344K813L9198m9278K1015R108J2506J1152K3929j9228M82k9155j9392K862
8007a6332M325L150K681N8842K208j887K3476k1754n433k3498K9435M4053m9840
$$ plain form
8093 50904 15377 -7092 49810 104716 97385 67081 58945 18962 -14176 -162 47742 52698
8081 52698 10131 -8051 5080 -18942 -4969 12491 -8768 3147 25387 85479 90381 103520
8069 103520 85841 19155 38575 65783 25838 -67500 -62950 -75603 -100791 -55231 -20214 -13257
8057 -13257 -61912 -75898 -15738 -25514 1057 30863 -5313 -26197 -17111 -17643 1679 57857 72877
8044 72877 15932 15130 28782 60466 48503 30032 40805 22366 -21588 -36790 -76521 -28808
8032 -28808 69396 133542 117339 56652 3131 -10104 -4100 36494 48521 41397 11798 -22344
8020 -22344 -19531 19667 -29611 -8596 512 13018 24170 48099 28871 29353 198 -19194 -16332
8007 -16332 -12007 -8857 -6176 52666 54874 52987 76463 54709 49276 25778 55213 99266 49426
$$ [...]
##END NTUPLES=NMR SPECTRUM
##END=
