##TITLE=Analysis number 319995
Compound Code s 05248
Book Reference 469/154/4
Project Code adrs
Chemist Name davec
##JCAMPDX= 6.0         $$ Bruker NMR JCAMP-DX V2.0
##DATA TYPE= NMR SPECTRUM
##DATA CLASS= NTUPLES
##ORIGIN= Bruker BioSpin GmbH
##OWNER= nmr
$$ XWIN-NMR		Version 3.5
$$ Wed Jun  7 09:25:00 2006 GMT Daylight Time (UT+1h)  MAYBRIDGE\nmr@NMR_250MHZ
##.OBSERVE FREQUENCY= 250.131544655141
##.OBSERVE NUCLEUS= ^1H
##.ACQUISITION MODE= SIMULTANEOUS (DQD)
##.ACQUISITION SCHEME= undefined
##.AVERAGES= 16
##.DIGITISER RES= 18
##SPECTROMETER/DATA SYSTEM= dpx250
##.PULSE SEQUENCE= zg30
##.SOLVENT NAME= DMSO
##.SHIFT REFERENCE= (INTERNAL, DMSO, 0, 16.522)
##AUDIT TRAIL= $$ (NUMBER, WHEN, WHO, WHERE, WHAT)
$$ ##TITLE= Audit trail, XWIN-NMR		Version 3.5
$$ ##JCAMPDX= 5.01
$$ ##ORIGIN= Bruker BioSpin GmbH
$$ ##OWNER= nmr
$$ C:\u/data/dgb/nmr/ADRS/370/pdata/1/auditp.txt
$$ ##AUDIT TRAIL=  $$ (NUMBER, WHEN, WHO, WHERE, WHAT)
(   1,<2006-06-07 09:24:38.64 +100>,<MAYBRIDGE\nmr>,<NMR_250MHZ>,
      <created by zg, POWCHK disabled, PULCHK disabled
       configuration hash MD5:
       E2 DF 36 D8 04 B2 41 60 5A D7 A3 38 5A 4B D0 FE
       data hash MD5: 64K
       6A F3 ED B7 88 8D E8 E7 32 4E E4 3D D3 64 18 D5>)
(   2,<2006-06-07 09:24:51.53 +100>,<MAYBRIDGE\nmr>,<NMR_250MHZ>,
      <Start of raw data processing
       ef LB = 0.3 FT_mod = 6 PKNL = 1 SI = 32K 
       data hash MD5: 32K
       14 8C D8 14 46 9C D5 05 F5 90 17 C6 3E 19 DE BA>)
(   3,<2006-06-07 09:24:53.15 +100>,<MAYBRIDGE\nmr>,<NMR_250MHZ>,
      <apk 
       data hash MD5: 32K
       12 82 B7 D2 69 0E 2E 1B CF 68 CA E7 3F C8 FE FF>)
(   4,<2006-06-07 09:24:54.08 +100>,<MAYBRIDGE\nmr>,<NMR_250MHZ>,
      <abs ABSG = 5 
       data hash MD5: 32K
       75 F9 11 2E 00 F2 FE F6 98 7C 96 F4 44 DF 03 EA>)
$$ ##END=
$$ 
$$ hash MD5
$$ 9F A5 84 7B 3E 3A AB 08 9C E2 8C D4 20 A4 61 C4
##$RELAX= 
##$RELAX= 
##$RELAX= 
##$RELAX= 
##$RELAX= 
##$RELAX= 
##$RELAX= 
$$ Bruker specific parameters
$$ --------------------------
##$DU= <C:\u>
##$EXPNO= 370
##$NAME= <ADRS>
##$PROCNO= 1
##$TYPE= <nmr>
##$USER= <dgb>
##$AMP= (0..31)
100 100 100 100 100 100 100 100 100 100 100 100 100 100 100 100 100 100 
100 100 100 100 100 100 100 100 100 100 100 100 100 100 
##$AQSEQ= 0
##$AQ_mod= 3
##$AUNM= <au_zg>
##$AUTOPOS= <5 >
##$BF1= 250.13
##$BF2= 250.13
##$BF3= 250.13
##$BF4= 250.13
##$BF5= 500.13
##$BF6= 500.13
##$BF7= 500.13
##$BF8= 500.13
##$BYTORDA= 1
##$CFDGTYP= 0
##$CFRGTYP= 5
##$CHEMSTR= <none>
##$CNST= (0..31)
1 1 145 1 1 1 1 1 1 1 1 1 1 1 1 1 1 1 1 1 1 1 1 1 1 1 1 1 1 1 1 1 
##$CPDPRG= <>
##$CPDPRG1= <>
##$CPDPRG2= <>
##$CPDPRG3= <>
##$CPDPRG4= <mlev>
##$CPDPRG5= <mlev>
##$CPDPRG6= <mlev>
##$CPDPRG7= <mlev>
##$CPDPRG8= <mlev>
##$CPDPRGB= <>
##$CPDPRGT= <>
##$D= (0..31)
0 1 0 0 0 0 0 0 0 0.06 0 0 0 0 0 0 0.0002 0 0 0 0 0 0 0 0 0 0 0 0 0 0 
0 
##$DATE= 1149668677
##$DBL= (0..7)
120 120 120 120 120 120 120 120 
##$DBP= (0..7)
150 150 150 150 150 150 150 150 
##$DBP07= 0
##$DBPNAM0= <>
##$DBPNAM1= <>
$$ [...]
##$SUBNAM6= <"">
##$SUBNAM7= <"">
##$SUBNAM8= <"">
##$SUBNAM9= <"">
##$SW= 20.6930455092707
##$SWIBOX= (0..15)
0 0 3 0 0 0 0 0 0 0 0 0 0 0 0 0 
##$SW_h= 5175.983436853
##$TD= 65536
##$TD0= 1
##$TE= 296.16
##$TE2= 300
##$TE3= 300
##$TEG= 300
##$TL= (0..7)
0 120 120 120 120 120 120 120 
##$TP= (0..7)
150 150 150 150 150 150 150 150 
##$TP07= 0
##$TPNAME0= <>
##$TPNAME1= <>
##$TPNAME2= <>
##$TPNAME3= <>
##$TPNAME4= <>
##$TPNAME5= <>
##$TPNAME6= <>
##$TPNAME7= <>
##$TPOAL= (0..7)
0.5 0.5 0.5 0.5 0.5 0.5 0.5 0.5 
##$TPOFFS= (0..7)
0 0 0 0 0 0 0 0 
##$TUNHIN= 0
##$TUNHOUT= 0
##$TUNXOUT= 0
##$USERA1= <user>
##$USERA2= <user>
##$USERA3= <user>
##$USERA4= <user>
##$USERA5= <user>
##$V9= 5
##$VALIST= <valist>
##$VCLIST= <CCCCCCCCCCCCCCC>
##$VD= 0
##$VDLIST= <DDDDDDDDDDDDDDD>
##$VPLIST= <PPPPPPPPPPPPPPP>
##$VTLIST= <TTTTTTTTTTTTTTT>
##$WBST= 1024
##$WBSW= 4
##$XGAIN= (0..3)
0 0 0 0 
##$XL= 0
##$YL= 0
##$YMAX_a= 401289
##$YMIN_a= -533397
##$ZGOPTNS= <>
##$ZL1= 120
##$ZL2= 120
##$ZL3= 120
##$ZL4= 120
##$ABSF1= 16.522
##$ABSF2= -4.171173
##$ABSG= 5
##$ABSL= 3
##$ALPHA= 0
##$AQORDER= 0
##$ASSFAC= 0
##$ASSFACI= 0
##$ASSFACX= 0
##$ASSWID= 0
##$AUNMP= <proc_1d>
##$AZFE= 0.1
##$AZFW= 0.1
##$BCFW= 0
##$BC_mod= 0
##$BYTORDP= 0
##$COROFFS= 0
##$CY= 12.5
##$DATMOD= 1
##$DC= 0
##$DFILT= <>
##$DTYPP= 0
##$F1P= 14.0000005364418
##$F2P= -0.99999901652339
##$FCOR= 0.5
##$FTSIZE= 32768
##$FT_mod= 6
##$GAMMA= 0
##$GB= 0
##$INTBC= 1
##$INTSCL= 1
##$ISEN= 128
##$LB= 0.3
##$LEV0= 0
##$LPBIN= 0
##$MAXI= 10000
##$MC2= 0
##$MEAN= 0
##$ME_mod= 0
##$MI= 0
##$NCOEF= 0
##$NC_proc= -4
##$NLEV= 6
##$NOISF1= 0
##$NOISF2= 0
##$NSP= 0
##$NTH_PI= 0
##$NZP= 0
##$OFFSET= 16.522
##$PC= 1
##$PHC0= 160.816
##$PHC1= 4.917204
##$PH_mod= 1
##$PKNL= yes
##$PPARMOD= 0
##$PSCAL= 4
##$PSIGN= 0
##$REVERSE= no
##$SF= 250.13
##$SI= 32768
##$SIGF1= 0
##$SIGF2= 0
##$SINO= 400
##$SIOLD= 32768
##$SREGLST= <1H.DMSO>
##$SSB= 0
##$STSI= 32768
##$STSR= 0
##$SW_p= 5175.98343685301
##$SYMM= 0
##$S_DEV= 0
##$TDeff= 65536
##$TDoff= 0
##$TI= <Analysis number 999999
Compound Code 99
Book Reference 9
Project Code 9>
##$TILT= no
##$TM1= 0
##$TM2= 0
##$TOPLEV= 0
##$USERP1= <user>
##$USERP2= <user>
##$USERP3= <user>
##$USERP4= <user>
##$USERP5= <user>
##$WDW= 1
##$XDIM= 32768
##$YMAX_p= 381501134
##$YMIN_p= -450444
$$ End of Bruker specific parameters
$$ ---------------------------------
##NTUPLES= NMR SPECTRUM
##VAR_NAME=  FREQUENCY,     SPECTRUM/REAL,   SPECTRUM/IMAG
##SYMBOL=    X,             R,               I
##VAR_TYPE=  INDEPENDENT,   DEPENDENT,       DEPENDENT
##VAR_FORM=  AFFN,          ASDF,            ASDF
##VAR_DIM=   32768,         32768,           32768
##UNITS=     HZ,            ARBITRARY UNITS, ARBITRARY UNITS
##FACTOR=    0.157963299565203, 1,           1
##FIRST=     4132.6476996994, 0,             0
##LAST=      -1043.33573715361, 0,           0
##MIN=       -1043.33573715361, -450444,     0
##MAX=       4132.6476996994, 381501134,     0
$$ Real data points
##PAGE= N=1
##DATA TABLE= (X++(R..R)), XYDATA
$$ [...]
17984I64810l6104J8504J4987j8333q3859n9573k0979J0166M6325J4223n0728
17973G99439P266l5393J348Q1444R3395M6102N5297L7511J5153J0675j5959J8624
17961A114902J8031m5308n1226m4549m4562p1008o2810o1105m4409k4990j4225
17950F68741j0206k8183l5678l9589m4014l6646l3042o3301l0135K2559J8206
17939C88712n426M157n365q336l4148j3513L6507K9161l1490k5067J8294K741
17927C56227K8714M5830N2861J9348J174M3123N5870K7431L3267J0438j2205K471
17915F64549o230j3456P232L9381J3573l82r896m4558l5975l0647r176m8612p536
17902E18267K132k9227l1816j5630K3188k1000m2135k3630j1793Q611R652R367
$$ plain form
17984 964810 928706 947210 962197 943864 860005 800432 779453 789619 835944 850167 799439
17973 799439 806705 771312 772660 854104 947499 993601 1048898 1086409 1101562 1112237 1096278 1114902
17961 1114902 1132933 1087625 1036399 991850 947288 876280 813470 752365 707956 682966 668741
17950 668741 658535 630352 594674 555085 511071 474425 441383 378082 347947 370506 388712
17939 388712 383286 387443 382078 373742 339594 326081 362588 391749 360259 335192 353486 356227
17927 356227 384941 430771 483632 502980 504154 547277 603147 630578 663845 674283 662078 664549
17915 664549 658319 644863 652095 691476 705049 704667 694771 650213 614238 583591 574415 525803 518267
17902 518267 520399 491172 459356 443726 466914 445914 403779 380149 368356 376967 386619 395986
17890C95986n932j0327j7321J5202K5619N6857N2360J6908P332P1015Q3058L6388
17878G27145J3786L5032J9996J9583K9245O119P03k2143m0731l4364j4255j9851
17866G20265k8602m7562m2456o4432l1556l0642j5510M736k9691m7903j2765l980
17854C69902l0605l5622n0333n5733P492M2618j0298l5595L2116K5195k4694P666
17842B42109k272l818K1754L8187j1739K3030M6413p792P599K3040K6208J0168
17830D12887M1040Q5264K2641o035L398P928k4481K2223L9588L1450P657j5561
17818F27999n390L763l6400l6875l2565Q287l0714k9520j9210o7717n0585m7139
17806B83934k7508k3343j4800k6747K2480K7933Q286J5839k2740j1452J7506J5218
$$ plain form
17890 395986 390054 379727 362406 377608 403227 460084 512444 529352 536684 607699 690757 727145
17878 727145 740931 775963 795959 815542 844787 850906 851609 829466 788735 754371 740116 720265
17866 720265 691663 644101 601645 537213 505657 475015 459505 464241 434550 386647 373882 369902
17854 369902 339297 303675 253342 197609 205101 247719 237421 201826 233942 259137 234443 242109
17842 242109 239837 236019 257773 295960 284221 307251 353664 345872 353471 376511 402719 412887
17830 412887 453927 539191 561832 555797 559195 567123 542642 564865 604453 635903 643560 627999
17818 627999 622609 626372 589972 553097 520532 528819 498105 468585 449375 381658 331073 283934
17806 283934 256426 233083 218283 191536 214016 241949 250235 266074 243334 231882 249388 264606
17794B64606k7656p444M6801J6127j5580p199J9028L1343l441J477N2274M2353
17782D12689O0073K6502K7533J9154M7908L1170K8762j152M1752P1056k345M1604
17770H04706M5663J9848O8003J0226q973j3359J6025K7291L2810L1157R269l0755
17758A011911m4366L873j9798m0986M755k0791m6026l3102q508l3116J3463P942
17746G95251j9175K6364l960m0351k9053j9366J8668j621l2754J127m310m3263
17734F47557m4963l1885P970q098n4243q0046K1616J8020J9672J9604k7271q0215
17722D07718k6581J5496m1287l3653k5029k2261j1674k8023o431J9054J5529j9447
17710B43411m3205Q160L0071M63J4063J0962K9979K9278J8644L9014L0749J6402
$$ plain form
17794 264606 236950 229506 276307 292434 276854 269655 288683 320026 316585 318062 370336 412689
17782 412689 472762 499264 526797 545951 593859 625029 653791 652639 694391 765447 763102 804706
17770 804706 850369 870217 938220 948446 939473 926114 942139 969430 1002240 1033397 1042666 1011911
17758 1011911 967545 971418 951620 910634 915389 894598 848572 815470 806962 773846 787309 795251
17746 795251 776076 802440 798480 758129 729076 709710 728378 726757 694003 695130 690820 647557
17734 647557 602594 570709 578679 570581 516338 436292 457908 475928 495600 515204 487933 407718
17722 407718 381137 396633 355346 321693 296664 274403 262729 234706 228275 247329 262858 243411
17710 243411 200206 208366 238437 238900 252963 263925 293904 323182 341826 380840 411589 427991
17698D27991N5840J6211K6968J2613k2567l964J4091r523L7605K8494Q867P506
17686F00132l4860m7346L386J2523K6930k934L4360j2639k6342l9790r918N850
17674E09352l3653n7270N30j7780m3490l3618j4149j754l3157j9520K1571L0540
17662C07602m189m4766l1086R010j0887j2572J7304j7160J1992l627o724J7077
17650B31974J353r905k3041j7094J3746J4894K6220j8902k3512Q98K4637K6033
17638B47301N1125P0203M1629N0868L6533L4768M417O824J3823L8230N9257N8726
17626G13704J7184o2082m7316l1288M799k3419j4765L286o7202l7574J1237m6369
17614D20195j2502q613k1531q1040l0784J2439K175j8146j146L4092j8696j7499
$$ plain form
17698 427991 483831 500042 527010 539623 517056 513092 527183 517660 555265 583759 592626 600132
17686 600132 565272 517926 521312 533835 560765 557831 592191 579552 553210 513420 503502 509352
17674 509352 475699 418429 418959 401179 357689 324071 309922 308168 275011 255491 277062 307602
17662 307602 303413 258647 227561 236571 225684 213112 230416 213256 225248 221621 214897 231974
17650 231974 233327 223422 200381 183287 197033 211927 238147 219245 195733 196631 221268 247301
17638 247301 298426 368629 410258 461126 497659 532427 536844 543668 557491 595721 654978 713704
17626 713704 730888 668806 621490 590202 595001 571582 556817 560103 492901 455327 466564 420195
17614 420195 407693 399080 377549 296509 265725 278164 280339 262193 261047 295139 276443 258944
17602B58944L2478k186k219J9628J619K1087L1613P818j0172Q676L3435J05132
17590E05853O5178L5279N8997O1870M2521L5871R3727R0421j1964j8849r66J6205
17578I74143J8529k5200n4986p2784p4905k6978l3464n0398l1579m0382n5032
17567E26964k4214k8484n5088k0263l903k7623k5220l1490K1662K8107K014K1817
17555C84279o1913j0700M5162J92j9212O501J1578L1510k570k2940N033j9953
17543C46967K2215O245M1228O0313J3194J4483L6224M5754l0299J1922j7705l8863
17531E11678m671Q515o3188n8337Q833j4946k6795l6593k1702k8764k917k4809
17519B46304M0144l0074q0704L8040M6524J5189q450k6665J2491P2431K0483j0944
$$ plain form
17602 258944 291422 289236 287017 306645 308264 329351 360964 368782 358610 367286 400721 505853
17590 505853 571031 606310 665307 727177 769698 805569 899296 989717 977753 958904 957938 974143
17578 974143 992672 967472 912486 839702 764797 737819 704355 653957 622378 581996 526964
17567 526964 502750 474266 419178 398915 395012 367389 342169 310679 332341 360448 362462 384279
17555 384279 322366 311666 356828 357020 337808 344309 355887 387397 384827 361887 366920 346967
17543 346967 369182 375427 416655 476968 490162 504645 540869 586623 556324 568246 550541 511678
17531 511678 507007 515522 452334 393997 402830 387884 361089 324496 302794 274030 271113 246304
17519 246304 286448 256374 175670 213710 260234 275423 266973 240308 252799 325230 345713 334769
17507C34769j384K0644L5871j2427l7655l6555J2564L1279K3634K5543M773J2219
17495D13275J6455L2170j134K3993L0081N2776N1185l2616l8872j5245P575p825
17483E31818L0603J6899J6634l4507n5150J7168P357k1370m2624l42K6839R150
17471E02475M2175O587R182J7068l04J1896o866k465J7095K0989q328J657J3854
17458F25015K3902J9167M9699K2774p662j7841J314m858J7177L5101L1653R699
17446H05140K2073R9941Q1048O6097N9200P8755J04823O8633N2239N8273O1648
17435A557870Q5051R8349L9567L4399J3030o60N0049r989k0160j4737l4124n0638
17423A748007n3134o1851m4276j8045k9803l0618j7403k9694m2068J8519K7127
$$ plain form
17507 334769 333385 354029 389900 377473 339818 303263 315827 347106 370740 396283 401056 413275
17495 413275 429730 461900 460766 484759 514840 567616 618801 586185 547313 532068 539643 531818
17483 531818 562421 579320 595954 561447 506297 523465 530822 509452 466828 466486 493325 502475
17471 502475 544650 551237 560419 577487 577183 589079 582213 579748 596843 617832 609504 611161 625015
17458 625015 648917 668084 717783 740557 732895 715054 716368 711510 728687 763788 795441 805140
17446 805140 827213 927154 1008202 1074299 1133499 1212254 1317077 1385710 1437949 1496222 1557870
17435 1557870 1642921 1741270 1780837 1815236 1828266 1827606 1877655 1867666 1847506 1832769 1798645 1748007
17423 1748007 1694873 1633022 1588746 1570701 1540898 1510280 1492877 1463183 1421115 1439634 1466761
17412A466761K402K4721K8779J3920J6059O0550N4550N6509O8984J01115Q1058
17401A975408Q9856J46350J39558K27405K25618J98555K38343L00453L18784L14157
17391D174487L24689K77208K77255K93819K74403L08272L00976K81147L06372
17382F818628L13398L17931L53010M26396N10298O10493P78863R63433J236364
17373A2328814J536241J962217K541672L260248M136795N206371O426587P774254
17365D5173199R032507J0055355J0696739J1115309J0632674R301963P801766
17358A13809512O174397M139476J856641p9550j512885k820667m502588o490969
17350A10573367p815439q420341r150144r793156r349734q359554p307091o195953
$$ plain form
17412 1466761 1469163 1493884 1522663 1536583 1552642 1613192 1667742 1724251 1793235 1894350 1975408
17401 1975408 2065264 2211614 2351172 2578577 2804195 3002750 3241093 3541546 3860330 4174487
17391 4174487 4499176 4776384 5053639 5347458 5621861 5930133 6231109 6512256 6818628
17382 6818628 7132026 7449957 7802967 8229363 8739661 9350154 10129017 11092450 12328814
17373 12328814 13865055 15827272 18368944 21629192 25765987 30972358 37398945 45173199
17365 45173199 54205706 64261061 74957800 86073109 96705783 106007746 113809512
17358 113809512 119983909 124123385 125980026 125900476 124387591 121566924 117064336 110573367
17350 110573367 102757928 94337587 85187443 75394287 66044553 57684999 50377908 44181955
17342D4181955n170492m155439l316374k698972k219678j864690j578112j353156
17334B1825042j170596r96814q43190o93785n10504l80080k64132j29963M9879
17325A6885857J90936L43943O18813R21188J287570J723145K291937K993439L898733
17316C1155561M921249O083368P305261Q405411R103212R609162R597893Q700919
17308I4882036P417722O131276M485674K423944N21929r02989k073667l467993
17300A09417932n208106o742409p428578q044111q840041q893134q080791p143097
17292D9037665o182711n226220m294675l501943k896466k352245j985217j700709
17284B0897479j461710j261041j120674r97436r23630q37278p07892o81615o22587
$$ plain form
17342 44181955 39011463 34856024 31539650 28840678 26621000 24756310 23178198 21825042
17334 21825042 20654446 19657632 18814442 18120657 17610153 17230073 16965941 16835978 16885857
17325 16885857 17076793 17420736 18039549 18960737 20248307 21971452 24263389 27256828 31155561
17316 31155561 36076810 42160178 49465439 57870850 66974062 76583224 86181117 94882036
17308 94882036 102299758 108431034 112916708 115340652 115862581 114959592 112885925 109417932
17300 109417932 104209826 97467417 90038839 81994728 73154687 64261553 56180762 49037665
17292 49037665 42854954 37628734 33334059 29832116 26935650 24583405 22598188 20897479
17284 20897479 19435769 18174728 17054054 16056618 15132988 14295710 13587818 12906203 12283616
17275A2283616n55437n11683m60690m76900m75728m37398m27446l97613l58488
17266H182233l59953l39378l00574l42310l15727k67917l07215k46811j81299
17257E521049j89128j94892j34314j60928j56384j00187j08787j23370j34194
17248D218865j23898j14634j29839j19696m9602o2993j05412j27485r4828n4534
17238C235944q8433j06361j19754j07216q3495q0839r3762n5215k8908p6359r0215
17227B305387r5954o9239j02175n2900J356n3921o5532q0393m3473l8359k4807
17216A679990m4872k2115j3031o3126q9707l6972n3234o3433o8399n4302m2319
17205A128480l8049M2673J4481r230Pk5856M639R390J6245J022R761K7979J5362
$$ plain form
17275 12283616 11728179 11216496 10755806 10278906 9803178 9365780 8938334 8540721 8182233
17266 8182233 7822280 7482902 7182328 6840018 6524291 6256374 5949159 5702348 5521049
17257 5521049 5331921 5137029 5002715 4841787 4685403 4585216 4476429 4353059 4218865
17248 4218865 4094967 3980333 3850494 3730798 3681196 3618203 3512791 3385306 3290478 3235944
17238 3235944 3147511 3041150 2921396 2814180 2730685 2649846 2556084 2500869 2471961 2395602 2305387
17227 2305387 2209433 2140194 2038019 1985119 1986475 1932554 1867022 1786629 1743156 1704797 1679990
17216 1679990 1635118 1613003 1599972 1536846 1447139 1410167 1356933 1293500 1225101 1170799 1128480
17205 1128480 1090431 1133104 1147585 1138355 1138362 1112506 1117145 1126535 1142780 1143802 1153563 1181542 1196904
17192A196904o789l9496l4182l790l1995j9258n235m762L353J7261l852r135l0824
17179A028200l0036j8081n1358m9786l4053n4807m4909k5423k0496m3973l6923
17168F18355k4429l2651O730k6446n6784m1440j9463j9212O014k4651J4474L177
17156D03674L629m935m6631j1963P76K9055K2152P125N0234k1774J7051P258j9667
17143D35984l5401j2266J9495J514q268M236K4538N1068l1356j2901k6741Q11
17131D10713p957J079J8955j0608n6865n4025l2059K4051M4757M1702M6527n0673
17119C75597j9487j3388l7515j6317J4055k6182J187K389j1547p031o199P493
17107B63055J6373M348k3338k920o462j5661k120K8509K3281n7225p0116o012
$$ plain form
17192 1196904 1190115 1150619 1116437 1112647 1080652 1061394 1056159 1051397 1054750 1072011 1068159 1059024 1028200
17179 1028200 998164 980083 928725 878939 844886 790079 745170 719747 699251 655278 618355
17168 618355 593926 561275 568005 541559 484775 443335 423872 404660 410674 386023 400497 403674
17156 403674 407303 402368 355737 343774 344550 373605 395757 402882 453116 431342 448393 455651 435984
17143 435984 400583 388317 407812 409326 401058 405294 429832 480900 449544 436643 409902 410713
17131 410713 402756 403835 422790 412182 355317 301292 269233 293284 338041 379743 426270 375597
17119 375597 356110 342722 305207 288890 302945 276763 277950 280339 268792 261761 255562 263055
17107 263055 279428 283776 260438 257518 251056 235395 233275 261784 285065 227840 157724 151712
17095A51712P317L7202r797j7274K1391O2181K3024m7883j8794q029j8461K339
17083A84928J6569P692k6816k870r881o450j710O041Q826N618k775j2490k4613
17070A42069M0009K8400p286J5262L634J8549k2863j1665J6906r486k8734k0017
17058A64778l105R723k4851J6621P270j7370k1432p621M321P44k0954P503r102
17045A06525l0151k0315j3477K0055J0095K5087j4490j234O390n216J5735q92
17033I8112K5359k3430l6330j6033J3051r131J2760J7147J8448K4543K6428n3825
17021I7099o000r418j2279o486l2007J8125j6242O984M3862Q56k282j2239p944
17008F2029R553K2331K0582J531m7457l0839K7666K0871M552r476L57k4365j4923
$$ plain form
17095 151712 159029 196231 186434 169160 190551 252732 275756 227873 209079 201050 182589 184928
17083 184928 201497 209189 182373 179503 169622 163172 161462 167503 176329 181947 179172 166682 142069
17070 142069 182078 210478 203192 218454 222088 240637 217774 206109 223015 213529 184795 164778
17058 164778 161673 171396 146545 163166 170436 153066 131634 124013 128334 129078 108124 115627 106525
17045 106525 76374 56059 42582 62637 72732 97819 83329 82095 88485 83269 99004 98112
17033 98112 123471 100041 63711 47678 60729 51598 64358 81505 99953 124496 150924 97099
17021 97099 91099 81681 69402 62916 30909 49034 32792 39776 83638 84494 82212 69973 62029
17008 62029 71582 93913 114495 116026 68569 37730 65396 86267 90819 81343 81700 57335 42412
16995D2412j9213J4208j5033k7577J7287J6792K9163P530Q490J1101k6831j4045
16983D4284L7881L1853l2140J5062J5302L0677p783m5177J0444J293K4809k260
16971A24245n0843k9775J3823j6764J6901J2594k0468J9195J0030J2721K1164
16960A12823K8641m0401l7659k2987m530m858J9040j6153k3659R15k2241J1618
16948E49N0943J1900J0258q575J1664o879k9020k6520k0045K5661L2473r662R41
16935D3688L8951j0429l4341j1773O404M1493K2548k2911N4490k2104m6484K1937
16923H1469L4704k3385k6209J8052j2206l1381r637K7913j0554m517l053L3157
16911G4353J1277O333J9379q000k6072l5865J5373Q372l7787J5182j1329j4955
$$ plain form
16995 42412 23199 37407 22374 -5203 12084 28876 58039 65569 74059 85160 58329 44284
16983 44284 82165 114018 81878 96940 112242 142919 135136 89959 100403 101696 126505 124245
16971 124245 73402 43627 57450 40686 57587 70181 49713 68908 78938 91659 112823
16960 112823 141464 101063 63404 40417 35887 31029 50069 33916 10257 11172 -11069 549
16948 549 51492 63392 73650 65075 76739 69860 40840 14320 -5725 19936 52409 42747 43688
16935 43688 82639 72210 37869 26096 32500 73993 96541 73630 128120 106016 59532 81469
16923 81469 116173 92788 66579 84631 72425 41044 31407 59320 48766 44249 41196 74353
16911 74353 85630 91963 111342 103342 77270 41405 56778 65150 27363 42545 31216 16261
16899A6261l0507O029O950M6948O622k0289p869l660R388L6392j5506J552K3710
16886G6021J1285l048k6661J2978m30l7288J6080N190k359o724J4111O603j3067
16873E2691k9361k9663O313J1791N2961k4084j2982L7764J0814k6823J136J604
16861E2161p606K91J3375J0998n463M000J2127k1258L784K9959K179Q301J9989
16848A22837p652K8446M584N0517N1643N4858K3404k528J0339Q3723P2117N7729
16836E50017K1168L1160K0104j9910k3173J6882L0738j2892p137l4061o2773k4972
16824D85151j1113o4357m3417j8524k8332j9026k5624p428k7724n6599j7988n285
16812A59734R764J4039L33l1045k3568J68K4282J6189J8692m936m3142L00r731
$$ plain form
16899 16261 -14246 -8217 -1267 45681 52303 32014 24145 20485 29873 66265 50759 52311 76021
16886 76021 87306 84258 57597 70575 70145 32857 48937 54127 51768 45044 59155 65758 52691
16873 52691 23330 -6333 -20 11771 64732 40648 27666 65430 76244 49421 50557 52161
16861 52161 44555 44846 58221 69219 63756 67756 79883 58625 62409 92368 94547 102848 122837
16848 122837 115185 143631 148215 198732 250375 305233 328637 326109 336448 420171 492288 550017
16836 550017 571185 602345 622449 602539 579366 596248 626986 614094 606957 572896 510123 485151
16824 485151 474038 409681 366264 347740 319408 300382 274758 267330 239606 183007 165019 159734
16812 159734 169498 183537 183870 152825 129257 129425 153707 169896 188588 183652 140510 140810 131079
16799A31079J8346L3086j4896K456K708K8345K1989M037K4933O2143O3482K0670
16787C98378Q799N9569M8861M5816j2584R905N7270J5425l3066l3616l417l5490
16775E25850j4123m3948j0892l5116o002n2925n4731n3276k2946o1414k1677M1819
16763A90619J2846l1115j8859j7415k3200K0590m733n047j8507m7248j0437K5668
16751G3162M2683k5734p214k8824k0052L6082L2742m1206l045L2546l5562j5681
16739C9897J5212R432k8861n789J559L5893K245K9496L805k0959k1087l1625l1440
16726b222N009J7506Q106l3452j2016J268j7298L2067M2431J1492l897J3031o719
16713E5306l2865k036k1471n288K7292N0469K3503j9906K454k944l9303n5870
$$ plain form
16799 131079 149425 182511 167615 170071 172779 201124 223113 227150 252083 314226 377708 398378
16787 398378 407177 466746 515607 561423 548839 558744 616014 631439 598373 564757 561340 525850
16775 525850 511727 467779 456887 421771 415769 362844 308113 254837 231891 170477 148800 190619
16763 190619 203465 172350 153491 136076 112876 133466 128733 123686 105179 57931 47494 73162
16751 73162 115845 90111 82897 54073 34021 70103 102845 61639 58594 91140 55578 39897
16739 39897 55109 64541 35680 29891 31450 67343 69588 99084 102889 81930 60843 29218 -2222
16726 -2222 2787 20293 28399 -5053 -17069 -15801 -33099 -1032 41399 52891 48994 62025 55306
16713 55306 22441 20405 -1066 -6354 20938 71407 94910 75004 77458 74514 35211 -20659
16701b0659j2706J8381k4864J5678K9257K2490k4399k9361K049Q133M7742L6151
16689F7892k8775n1964K3222k7065j9487L4805L186J123L3155K7811K7922m760
16677H7065l9950l83k6882l5180L153M0796K5869m5758m0234K5276j0263l799
16665b0290K80k3178j6197R84n976j709K9092P0893l0169k9505K7605j966J1383
16652A1247l8324L958K6544N588P345j100n2441k9861L1926J7513j2431J9985
16640a0051j3482J1194k8K1518J5204L353j5602O289L985K1591K9756J530k5888
16627D9369r154K347L386k7122m306L0029J7510l9448l0772m218K6742O692j681
16614A9374O552j8802j5429m3151l0300K1533K9981L9192K2307k5915L236M7878
$$ plain form
16701 -20659 -33365 -14984 -39848 -24170 5087 27577 3178 -26183 -24134 -16001 31741 67892
16689 67892 39117 -12847 10375 -16690 -36177 -1372 1814 2937 36092 63903 91825 87065
16677 87065 47115 46732 19850 -15330 -12177 28619 54488 8730 -31504 -6228 -16491 -20290
16665 -20290 -20010 -43188 -59385 -58401 -64377 -66086 -36994 33899 3730 -25775 1830 -136 11247
16652 11247 -27077 -23119 3425 9013 16358 15258 -37183 -67044 -35118 -17605 -30036 -10051
16640 -10051 -23533 -12339 -12367 9151 24355 27708 12106 18395 22380 43971 73727 75257 49369
16627 49369 40215 42562 45948 18826 14520 44549 62059 22611 -8161 -12379 14363 21055 19374
16614 19374 25926 7124 -8305 -51456 -81756 -60223 -30242 8950 31257 5342 8578 56456
16602E6456k0347k2496j4357o401P255J6803m996l1902L3245K3249j4770L88j431
16589B0696j8035k9646K9988L6634J4520J6715J5193m2329J7855K5433L5507l8871
16577H3660j2397J8092m3341m8338j609m4554R558N4782N7193l6988k9935K624
16565H747n833j2932L0137k1286K362j7925L4839P726j0969n340l19o745K5421
16552B7883J0397m1794L317o33J41L315K0844P449j9141m6784j3544R056R852
16539b9642K5749k2098q390R230R445j4530K7563J1017j8343l878P27k6386J1478
16526b8058L1080K9104l2679n2838r271N1486L3083k94l964l647n172o774m8106
16513d6050n455K1812p980J5261J7274k8176k5460L5472M6567P148k5042K2231
$$ plain form
16602 56456 36109 13613 -744 -7145 110 16913 11917 -19985 13260 36509 21739 22127 20696
16589 20696 2661 -26985 3003 39637 54157 70872 86065 43736 61591 87024 122531 83660
16577 83660 71263 89355 46014 -2324 -3933 -48487 -38929 15853 73046 36058 6123 8747
16565 8747 2914 -10018 20119 -1167 1195 -16730 18109 25835 14866 9526 9207 2462 27883
16552 27883 38280 -3514 -197 -830 -689 2626 23470 30919 11778 -35006 -48550 -39494 -29642
16539 -29642 -3893 -25991 -34381 -25151 -15706 -30236 -2673 8344 -9999 -13877 -13150 -39536 -28058
16526 -28058 3022 32126 -553 -53391 -62662 -11176 21907 21613 17649 14002 8830 2056 -46050
16513 -46050 -51505 -29693 -37673 -22412 -5138 -33314 -58774 -23302 23265 30413 5371 27602
16501B7602m842k5035N532k0989J9295K163J8052k246K4979k6107k7419l1042
16489d0057K2591L8583k7987k1885L058L4803m7589l0655Q483N3194O4456o640
16477E0355l1635j8609K3023K0230l7947j422L3603l180l7077J4722J2238q015
16465A6286k1177j5830K3437J7465j7152q264k2588l3726j0112M2307M5547O600
16453B2793J4357m869K0883M263n3853l8264j2165J3373M2893N7145r005j7279
16441D0272n1911k7093K9916j5447k1410Q552N536J1794r898o837K984M4990k831
16428H617q573K1887o5097k8897L4999l706n787N2401J7706k8741K9730j3295
16416A1244m17j6473j2111l463j2615p261M4016J194k7335m3948j7957K2919K1638
$$ plain form
16501 27602 22760 -2275 3257 -17732 1563 3726 21778 19532 44511 18404 -9015 -40057
16489 -40057 -17466 21117 -6870 -28755 -25697 9106 -38483 -69138 -60655 -7461 56995 50355
16477 50355 18720 111 23134 43364 5417 3995 37598 34418 -2659 12063 24301 16286
16465 16286 -4891 -20721 2716 20181 3029 -5235 -27823 -61549 -71661 -29354 16193 22793
16453 22793 37150 32281 53164 57427 3574 -34690 -46855 -33482 9411 66556 57551 40272
16441 40272 -11639 -38732 -8816 -24263 -45673 -37121 -31585 -19791 -29689 -36526 -33542 11448 8617
16428 8617 44 21931 -43166 -72063 -37064 -40770 -46557 5844 23550 -5191 24539 11244
16416 11244 10827 -5646 -17757 -21220 -33835 -41096 2920 4114 -23221 -67169 -85126 -62207 -40569
16403d0569J8407J160J3036J1607k0925j1921K8224K9477K0606k158k7764K5110
16391D4290j0230M428j6536Q778m0481K2948J2455j4470k8013J3405J0442l473
16379C543k5222j280K4034N493l8110m6866K5353O0517R0P166K0504J435O73j6867
16365B0463j5470k6036k1795j4632p612M7240K1329R477J3863K1984J8529k4336
16353D3004m4486j5422L3632M4311k2584m2689m0008n259L7961J5460j7343M8878
16341C5455O4229j7652o4211O030j917L158L0034j7695k4962m2291K5930k934
16329f826n985K469j7097J6894j5141k1856L1567L9560L2240J8463n4086m8662
16317b8460J7956j9679L555M5467J4449l7911Q437m7156j8991K312K0340K5171
$$ plain form
16403 -40569 -22162 -21002 -7966 3641 -17284 -29205 -981 28496 49102 46944 19180 44290
16391 44290 34060 38488 21952 30730 -9751 13197 25652 11182 -16831 -3426 7016 3543
16379 3543 -21679 -22959 1075 6568 -31542 -78408 -53055 7462 7552 14718 35222 36657 37330 20463
16365 20463 4993 -21043 -42838 -57470 -65082 -17842 3487 12964 26827 48811 67340 43004
16353 43004 -1482 -16904 16728 61039 38455 -4234 -44242 -49501 -11540 3920 -13423 35455
16341 35455 99684 82032 17821 23851 21934 25092 55126 37431 12469 -29822 -3892 -6826
16329 -6826 -12811 -10342 -27439 -10545 -25686 -47542 -15975 23585 55825 74288 20202 -28460
16317 -28460 -10504 -30183 -26628 18839 33288 -4623 3814 -43342 -62333 -60021 -39681 -14510
16305a4510J1987L1886L3124j3275l585J724n951j2047l3252k812m526l095K824
16292a1508J9862K4491K9179j7519n2810J4532M591j9572K7627j8549Q699O7669
16280G6692k3710j779O852k4381n9713j724Q5268J8783j7820j3974m30J5874q090
16267E1848l2224n786l3209K1357L4035N134l708M666l8744l0097k712L3723M9413
16254E3696l7322k6312k522j030n530L8012r86p898o8275m136K3167K369K9582
16241g185j8737J1551M166j0582K8621l143O643O509l5550k1231N91K1902O4503
16228D8058J2762k7285j762k9839m3997j9001L4907L427k0902k1899j2072L4750
16216d2853J710J967J4539r53M2987K2456k6257n9714j36K8456l3270L660J1480
$$ plain form
16305 -14510 -2523 29363 62487 49212 45627 47351 41400 29353 -3899 -6711 -11237 -14332 -11508
16292 -11508 8354 32845 62024 44505 -8305 6227 10818 -8754 18873 324 9023 76692
16280 76692 52982 51203 58055 33674 -26039 -27763 57505 76288 58468 44494 44064 59938 51848
16267 51848 19624 13838 -19371 1986 36021 41155 37447 42113 3369 -26728 -29440 4283 53696
16254 53696 16374 -9938 -12460 -13490 -19020 18992 18006 10108 -58167 -62303 -39136 -36767 -7185
16241 -7185 -25922 -14371 -10205 -20787 7834 4691 11334 17843 -17707 -38938 -38347 -16445 48058
16228 48058 60820 33535 31773 1934 -42063 -61064 -26157 -22730 -43632 -65531 -77603 -42853
16216 -42853 -41143 -39176 -24637 -25590 17397 39853 13596 -46118 -46254 -17798 -51068 -47408 -35928
16203c5928J6515L009L5918l105m7197J6889m48N521J348r89p4159M150N1038
16190b7438L0307J1912k6041l1903N488L7981J2835R195L0166k748n2227m6429
16178d8902R967K62K7224K6387m6018L000J3041O477O481o395J145k6564k2452
16165e6347J1344L7201J1117P422j3534l324j7291j941o26J2375K7756J4521j928
16152B6745k0723j0359p512M5554L0016o213j812j0350m2858k4278J7808p722
16140a1704l9628L4725J6201r915l475j4559MM1868J9658o941j448j9938k9075
16127b4227j7938k8996k715K4322K5615K5607K9426m7950J380k5071n768K9368
16115a6947J9330J98k7587J8471R518r428j358j8777l9483L8311L6292P30N322
$$ plain form
16203 -35928 -19413 -16404 19514 16409 -30788 -13899 -14347 -8826 -7478 -8467 -82626 -78476 -27438
16190 -27438 2869 14781 -11260 -43163 -37675 306 13141 22336 52502 49754 -2473 -48902
16178 -48902 -38935 -38673 -11449 14938 -31080 -28080 -15039 -8562 -2081 -8476 -7331 -33895 -56347
16165 -56347 -45003 -7802 3315 10737 -2797 -6121 -23412 -25353 -25979 -13604 14152 28673 26745
16152 26745 6022 -4337 -11849 33705 63721 57508 55696 45346 2488 -21790 -3982 -11704
16140 -11704 -51332 -16607 -406 -10321 -13796 -28355 -28351 13517 33175 26234 24786 4848 -24227
16127 -24227 -42165 -71161 -73876 -49554 -23939 1668 31094 -16856 -15476 -40547 -46315 -16947
16115 -16947 2383 2581 -25006 -6535 2983 -6445 -7803 -26580 -66063 -27752 8540 9270 14592
16102A4592J4332J5625j3331l1153k0837q274O1074N544l944M521p317k4215r788
16089c171j0373K7547K8026o483K4879q090k6772l8847j6129m042k687p220J8405
16076b4957k9154o250K3337L9237l348N502N417n4585k9587L6853J7177K1281
16064I23N3036l3699l8277R801o827j3442L2778l1194l0075j322L1607J2593k4950
16051c9048R509j8590j5498j4483m780J691J1471N9138o758L6791L702J049p369
16038A6825q583M683j240j9113K133l506n428j1389K612k3671M826Q383J5357
16025a8111n3658K3438L3319k1240L443J4261K032j728L3721J4215p236k8079
16013e623l8165j6536K523M7632J6707j9036L3952m667j2712m141J068p504m2689
$$ plain form
16102 14592 28924 44549 31218 65 -20772 -29046 32028 37572 33628 38149 30832 6617 -3171
16089 -3171 -13544 14003 42029 35546 60425 52335 25563 -13284 -29413 -33455 -36142 -43362 -24957
16076 -24957 -54111 -60361 -37024 2213 -1135 4367 9784 -44801 -74388 -37535 -20358 923
16064 923 53959 20260 -18017 -8216 -15043 -28485 4293 -26901 -56976 -58298 -26691 -14098 -39048
16051 -39048 -29539 -48129 -63627 -78110 -82890 -81199 -69728 -10590 -17348 19443 23145 24194 16825
16038 16825 8242 12925 11685 -7428 -5295 -8801 -14229 -25618 -23006 -46677 -41851 -33468 -18111
16025 -18111 -71769 -48331 -15012 -36252 -32809 -18548 -16516 -18244 15477 29692 22456 -5623
16013 -5623 -43788 -60324 -57801 -10169 6538 -12498 21454 16787 4075 -66 1002 -6502 -49191
16000d9191j8761R859q397K769L4880J656M761J3999p360L4256K3369l4058l6357
15987b8575J0000L7164k7014J3669k5486J1498K0690m9275l3417K8147J4847Q496
15975a9256l8896M794K7694L4700k4507j5771N3438L2624l4440l635o113p407
15963C225j5215k9810m5810M1145J5109k0448l7099P969R076M4997J8557O345
15951a959J3546J2780o931n1865L0M660r598k5733J1731M5993J2003m575j6333
15938a6251n2613p555R265O296N428r471N508M1014K5700l6097m3295j7408J0487
15925g8992K4844j9047P0013O392k5175p37L470J1993J3351K4276m9961j3475
15913c3048K079k5846j0682j624J2647K0266J7397J0592k448J1184L5134j3570
$$ plain form
16000 -49191 -67952 -58093 -66490 -63721 -28841 -27185 -22424 -8425 -15785 18471 41840 7782 -28575
15987 -28575 -18575 18589 -8425 5244 -20242 -8744 11946 -37329 -70746 -42599 -27752 -19256
15975 -19256 -58152 -53358 -25664 9036 -15471 -31242 22196 54820 20380 16745 10632 3225
15963 3225 -11990 -41800 -87610 -46465 -31356 -51804 -88903 -80934 -71858 -26861 -8304 -1959
15951 -1959 11587 24367 17436 -34429 -34399 -29739 -39337 -65070 -53339 -7346 4657 82 -16251
15938 -16251 -68864 -76419 -67154 -60858 -55430 -64901 -59393 -18379 7321 -28776 -72071 -89479 -78992
15925 -78992 -54148 -73195 -3182 3210 -21965 -22702 -19232 -7239 6112 30388 -19573 -33048
15913 -33048 -30969 -56815 -67497 -69121 -56474 -36208 -18811 -8219 -10667 517 35651 22081
15901B2081J0855q380j1685j9375k1514k6429O631P810R859K2813J024k4371l1116
15888f1797j2230N0430K8398r910k069k008K619j0758o9J1973j1233K3433J7357
15875B4136j8042j1478J2846L0048l98k8215O726j5676l9l236j3536j4776k00
15862c1840k517K6990L5843J2283j806k1642l03j5193J2833J4273j9185j8613
15850h877R25K9108K9166l8477j9121O369J1693j5784k1867Q486Q901P17J3082
15837D321j1355l964N249l560p786n328k1930N3211L9326p680n0203L029R254
15824B584K3735K8246j2498n677o492k0871k1181n4453o631M2656K9792R566k065
15811F711m150J2814Q357j4540q209J9908k7970N558L1004N1981Q945N99j8582
$$ plain form
15901 22081 32936 24556 12871 -6504 -28018 -54447 -47816 -40006 -30147 -7334 -6310 -30681 -61797
15888 -61797 -74027 -23597 4801 -5109 -7178 -9186 -6567 -17325 -17394 -5421 -16654 6779 24136
15875 24136 6094 -5384 7462 37510 37112 8897 15623 -53 -92 -3328 -16864 -31640 -31840
15862 -31840 -34357 -7367 28476 40759 38953 17311 17008 1815 14648 28921 9736 -8877
15850 -8877 -7952 21156 50322 11845 -7276 -907 10786 -4998 -26865 -18379 -9478 -8761 4321
15837 4321 -7034 -10998 -5749 -9309 -17095 -22423 -44353 8858 48184 40504 -9699 -6670 2584
15824 2584 26319 54565 42067 36390 29898 9027 -12154 -66607 -73238 -30582 -790 8776 6711
15811 6711 2561 15375 23732 9192 983 20891 -7079 -1521 29483 81464 90409 91008 72426
15798G2426l4818n0742o2760k653J02N4463L0287j7414r605r392K153L2080K968
15785G095j2097N114k2241J054J2578r159R676K5646k990M012Q371k6555k2543
15772b2039l127J8722K0447K9534m0709k8407k6053J02k572j0131M2356L5385
15760A3508j2300k8782L3022J0026l2765J3632K5012L3001k6352m1230j881M1066
15748B5957K6395l0974k5902j9790j7194l9820K4180L0444L9696j0255j0149j6000
15736b3412k868J5662J3432K2541l363r337j1597Q015P060J2108k6069p582J6955
15723A1545k4626j3094k691L0391j7296l1980m528L9105J1964l3k2846M1650R115
15710B6676j770l0617m5033L3717q036Q949o169j7345J1177k9445j2576M8462
$$ plain form
15798 72426 37608 -13134 -75894 -78547 -78445 -23982 6305 -11109 -20714 -30106 -27953 4127 7095
15785 7095 -5002 112 -22129 -21075 -8497 -17656 -7980 17666 14676 18688 27059 504 -22039
15772 -22039 -25166 -6444 14003 43537 2828 -25579 -51632 -51530 -54102 -64233 -21877 13508
15760 13508 1208 -27574 5448 15474 -17291 -3659 21353 54354 28002 -13228 -15109 25957
15748 25957 52352 21378 -4524 -24314 -41508 -81328 -57148 -26704 12992 2737 -7412 -23412
15736 -23412 -26280 -10618 2814 25355 21992 12655 1058 9073 16133 28241 2172 -5410 11545
15723 11545 -13081 -26175 -28866 1525 -15771 -47751 -52279 -13174 -1210 -1243 -24089 17561 26676
15710 26676 24906 -5711 -50744 -17027 -25063 -16114 -22283 -39628 -28451 -57896 -70472 -22010
15698b2010N5065R6303j0548p4961l6625Q624L2116j3798l4274J4216p473m7913
15686d1278r361J0376R433R093j470Q703J4231J341L802j6574R525M861J0533
15673A3215l6057n300R774N1397K7995K7044l0899o504j024J2565K4375j6753
15661F9828k4189J1853K4518K854J7173J1188n2805k2579j3374m05J9944L1211
15649G5217j0238l0385l6071j3978J5556j971k5547O815Q86l936J5419K4871J2165
15636B8803J5820N330j1797L260j2316l4910J0287O431j8710J3763L903k2283
15624a2419j1269K804R612J6523J6822K6708r100m9459M624R383k4941j6110l2032
15611f8854l19R334L5062J9648r613O701N1412J7795J1413k6529k0129m6417k8449
$$ plain form
15698 -22010 33055 129358 118810 43849 7224 15848 47964 34166 -108 14108 6635 -41278
15686 -41278 -50639 -40263 -30830 -21737 -23207 -14504 -273 1068 4870 -11704 -2179 2682 13215
15673 13215 -22842 -28142 -18368 33029 61024 88068 57169 50665 49641 62206 86581 69828
15661 69828 45639 57492 82010 84864 102037 113225 60420 37841 24467 24062 44006 75217
15649 75217 64979 34594 -1477 -15455 101 -1870 -27417 -20602 -19716 -23652 -8233 16638 28803
15636 28803 44623 49953 38156 41416 29100 -5810 4477 10908 -7802 5961 9864 -12419
15624 -12419 -23688 -20884 -11272 5251 22073 48781 39681 -9778 -5154 4229 -20712 -36822 -68854
15611 -68854 -69173 -59839 -24777 -5129 -14742 -8041 43371 61166 72579 46050 25921 -20496 -48945
15598d8945k784o92L7581J3396j6225l3454k5552K8545K7640l507k3145J8098
15586b9044J300j4868L1603K2404j7339M181n000M0863k6607k9099J9050j9100
15574b1656j0163k3947K4461k093m1545j0035k8855p292N8804L5881j0746j2539
15562d9725J9427K9697J0204K272J641l749L984J9707N3868j1242j8902m7199
15550I983m5711k4403J7658M6158Q280m3905q068L9797j0360q254L8845J8838
15538C8858j420l7328r529j9757Q411J0677m807K0027O2838r520q092l6537o895
15525F926l393j5783L1310L953j537r702k2611m830j0199Q075J039j0831N857
15512b1726J9580j3707j0576K229J1264J8767k3560j7445R267j6086J8250J5201
$$ plain form
15598 -48945 -51729 -52421 -14840 -1444 -17669 -51123 -76675 -48130 -20490 -23997 -47142 -29044
15586 -29044 -27744 -42612 -11009 11395 -5944 -1763 -6763 34100 7493 -21606 -2556 -21656
15574 -21656 -31819 -55766 -31305 -33398 -74943 -84978 -113833 -121125 -62321 -26440 -37186 -49725
15562 -49725 -30298 -601 9603 11875 13516 9767 13751 33458 87326 76084 57182 9983
15550 9983 -35728 -60131 -42473 3685 11965 -31940 -40008 -211 -10571 -18825 20020 38858
15538 38858 37438 110 -9419 -29176 -20765 -10088 -14895 5132 67970 58450 50358 13821 6926
15525 6926 3533 -12250 19060 23013 21476 11774 -10837 -15667 -25866 -17791 -16752 -27583 -21726
15512 -21726 -2146 -15853 -26429 -24200 -12936 5831 -17729 -35174 -25907 -41993 -23743 -8542
15500h542k1434r700K5870J0379M974o932J7054R916J745j8548r067j0374Q640
15487f019J4648K9237k2692J148j1677j2471J0299K4927k096m017l0427l8261
15475d7401J8707r774n582K3513J0944J6749K1027l0869J990k904J9688j877J9769
15462C3980k3200p728k9457k3508n2196M968M3995K5185M2366J6366k1414k6656
15450a7299N1209j2822l2081L3161k082L516m6289l8327J2066N600J3615J9330
15438a0403q050l711k667j8487K3210K678k1571K040K6182K9447L49J5616P49
15425C5382K058J7572m1593q179L4350J0432p083n047o901J6391J1800J1691k0009
15412E0864j2014R651r739j3673j4080k818j181k2543Q922j967m9500k4736J3896
$$ plain form
15500 -8542 -29976 -39676 -13806 -3427 1547 -5385 11669 21585 23330 4782 -4285 -14659 -6019
15487 -6019 8629 37866 15174 16322 4645 -7826 2473 27400 25304 21287 -9140 -47401
15475 -47401 -28694 -38468 -44050 -20537 -9593 7156 28183 -2686 -696 -3600 16088 14211 33980
15462 33980 10780 3052 -26405 -49913 -102109 -97141 -53146 -27961 14405 30771 9357 -17299
15450 -17299 33910 21088 -10993 22168 20086 23602 -22687 -61014 -48948 -43348 -29733 -10403
15438 -10403 -18453 -22164 -24831 -43318 -20108 -17430 -39001 -36961 -10779 18668 19017 34633 35382
15425 35382 37440 55012 13419 5240 39590 50022 42939 37892 30991 47382 59182 70873 50864
15412 50864 38850 48501 38762 25089 11009 8191 7010 -15533 -6611 -8578 -58078 -82814 -68918
15399f8918n806J8900L7964m618P606p359M2266j4967m9582k7797J6971l532n158
15386f4030j3717o486K1516K1102M2366M8923J2907k9490k5247J6923j9327j821
15374C619R692o646R232K0307k782K1860k108n873k6556n1527n624J0718L1147
15361E459J705j0157j6749q344N875q250j7046Q203M6991L2628L3806l1762k8723
15348A3636n014j8014k2358M1540J3423k87k6526k9603j2513J5264L0675l9892
15336c9669k74J5014L660J117k3934k2558M555j8408L8643M6212J7631J3534K0095
15323E5618j0291j4139L8276l6290j2929J3541J0514l759l2265j9746m2664m852
15311e8986K1460J225n800j30J3415j1012n633n956O772J7329K8289K9325K6917
$$ plain form
15399 -68918 -74724 -55824 -17860 -22478 -14872 -22231 20035 5068 -44514 -72311 -55340 -58872 -64030
15386 -64030 -77747 -84233 -62717 -41615 751 49674 62581 33091 7844 24767 5440 3619
15374 3619 13311 6665 15897 36204 33422 55282 53174 47301 20745 -30782 -36406 -25688 5459
15361 5459 7164 -2993 -19742 -28086 -22211 -30461 -47507 -39304 7687 40315 74121 42359 13636
15348 13636 8622 -9392 -31750 9790 23213 22926 -3600 -33203 -45716 -30452 223 -39669
15336 -39669 -39943 -24929 -21269 -20152 -44086 -66644 -62089 -80497 -41854 4358 21989 35523 55618
15323 55618 45327 31188 69464 33174 20245 33786 44300 40541 8276 -11470 -54134 -58986
15311 -58986 -37526 -36301 -42101 -42231 -28816 -39828 -45461 -51417 -44645 -27316 973 30298 57215
15298E7215m940j0592j2411k0864m1585k5487k613K7188Q615O355L4468k7941
15286a2592n9661r728L6967N1798k6540k3240o524L0299L1238m22o308p074l5983
15273c7770l6181J3221K6158K9360J4009n6555J0672j1351p951l2002q365J8933
15261g7822L9618K7217J2966k0573j1340k0580Q375J1022K5341L059o329K4177
15249A5131J085J3360J0485j8867P225j79k7494j1061q073Q084k1493n791m647
15236d2235j0628J4903q265r356l870K7797L2841o47J2989j5974l276k997l2549
15223d1267o247l5330r476L6329N658K1875J523M7710M0157p649m2920j7365l444
15210a0446j5084K4921J4201J7659k4980l4658K9714M4361k7710j4435K2652N107
$$ plain form
15298 57215 52275 41683 29272 8408 -33177 -58664 -61277 -34089 -25474 -19119 15349 -12592
15286 -12592 -72253 -81981 -45014 6784 -19756 -42996 -49520 -19221 12017 11595 5287 -1787 -37770
15273 -37770 -73951 -60730 -34572 -5212 8797 -47758 -37086 -48437 -56388 -88390 -96755 -77822
15261 -77822 -38204 -10987 1979 -18594 -29934 -50514 -42139 -31117 -5776 -2717 -9046 15131
15249 15131 16216 29576 40061 21194 28419 28240 746 -10315 -18388 -10304 -31797 -37588 -42235
15236 -42235 -52863 -37960 -46225 -55581 -59451 -31654 1187 540 13529 -2445 -5721 -8718 -41267
15223 -41267 -47514 -82844 -92320 -55991 -50333 -28458 -26935 20775 60932 53283 10363 -7002 -10446
15210 -10446 -25530 -609 13592 31251 6271 -28387 1327 45688 17978 3543 26195 31302
15198C1302l7562l4260j3966l5859O0452m116j2512j6088j5573M8631L6549J8574
15186B5572k4967R177o644j3112l7628k9654r820j274O860K4651M128L674l594
15173e2631J8976K0268p477l9599r429J9440M5789J9011q326k1083j9505M506
15161c0060j3444j8585j8733j0844K7040M5668J8521j1654J5212L7695K4419O694
15149G1929j6884o6739l3426n512k202L354J696l7145j3086j930K6374J6395J3583
15136d3593K9643k6297l576L6808j8984J5146L731k7327n537j3547j9402J4273
15124e8662l6331j228N3938L216p817K0749O081J566j1808O590j0883J7331l403
15111b0661M5801n771m1273l8211J0792J6306j4878n936K8179L6095L9249J2485
$$ plain form
15198 31302 -6260 -40520 -54486 -90345 -29893 -34009 -46521 -62609 -78182 -29551 6998 25572
15186 25572 605 9782 3138 -9974 -47602 -77256 -87076 -88350 -81490 -56839 -52711 -49037 -52631
15173 -52631 -33655 -13387 -20864 -60463 -69892 -50452 -4663 14348 6022 -15061 -34566 -30060
15161 -30060 -43504 -62089 -80822 -91666 -64626 -18958 -437 -12091 3121 40816 65235 71929
15149 71929 55045 -11694 -45120 -50632 -52834 -49480 -47784 -84929 -98015 -99945 -73571 -57176 -43593
15136 -43593 -13950 -40247 -43823 -7015 -25999 -10853 -7122 -34449 -39986 -53533 -72935 -58662
15124 -58662 -94993 -96221 -42283 -39067 -46884 -26135 -20054 -18488 -30296 -23706 -34589 -17258 -20661
15111 -20661 25140 19369 -21904 -60115 -49323 -33017 -47895 -53831 -25652 10443 49692 62177
15099F2177K8288o552m4072l6476j6403l194M99K6543K3471j1154J6896j1953
15087B8070K318r784l8180k3755J9905J0264j939k0366k3260R669J0929K3118
15075a3011K5558J1141P394j707j5968j8576p812j666j5158l5563K2331J2967
15063c0070k4050r16K7740q497L0033J5854j2539j6161j1823P052K4532K6849
15051B8004K2250j6654k1384k7109j20m701R542J5561J0115k723j1122K932J623
15038F214p879P508J3226P734r022o366L689O32k4232j3020K7982J2017l0137
15025a1654k150K8634J4791J3858J2488J2402j9983k4105m0468m0837J2475o8
15013d4617M554j4230K8244J4904K344K2845l4893M327L164J4812K3069J028l4706
$$ plain form
15099 62177 90465 83913 39841 3365 -13038 -16232 -15733 10810 34281 23127 40023 28070
15087 28070 30388 20604 -17576 -41331 -21426 -11162 -13101 -33467 -56727 -47058 -36129 -13011
15075 -13011 12547 23688 31082 29375 13407 -5169 -12981 -14647 -29805 -65368 -43037 -30070
15063 -30070 -54120 -55036 -27296 -35793 -5760 10094 -2445 -18606 -30429 -23377 1155 28004
15051 28004 50254 33600 12216 -14893 -15013 -19714 -10172 5389 15504 12781 1659 4591 6214
15038 6214 -1665 5843 19069 26803 17781 11415 15104 15736 -8496 -21516 6466 18483 -11654
15025 -11654 -13804 14830 29621 43479 55967 68369 48386 24281 -16187 -57024 -44549 -44617
15013 -44617 -40063 -54293 -26049 -11145 -8801 14044 -20849 -16522 -13358 1454 24523 25551 -9155
15000i155k9773k7740J137K2452J2014K8436M2331k29J30j4883j9371l1250j1020
14987c6921L953K285m632o998L0508P790J832k3517L0184J6126r417l624l0581
14974b3012k8j4804k9307L4815J1676M070j1502l435J2837j7342J0503K7971m037
14961a595j8925L2079J4811p499M52J792k6241K3174K9324j6311r279r947l2098
14948b0263j84J9747R401K3755q665K4193Q242m867m0749m6826j7567L1378J0207
14935a2198J7810L3963L8763q328j6195o6028n2702K5208L6625O687k6406J1879
14923a0922J7417L334n330J190O386m561j6302J6017k3101l2887N51K8775L1695
14910A2262K709q830J0056l0204q43R299P225m01m020p647J6237K043J850P065
$$ plain form
15000 -9155 -38928 -66668 -65531 -43079 -31065 -2629 39702 39473 39603 24720 5349 -25901 -36921
14987 -36921 -32968 -30683 -35315 -42313 -11805 -4015 -2183 -25700 4484 20610 11193 7569 -23012
14974 -23012 -23040 -37844 -67151 -32336 -20660 -16590 -28092 -31527 -18690 -36032 -25529 2442 -1595
14961 -1595 -20520 11559 26370 18871 19323 21115 -5126 18048 47372 31061 21782 11835 -20263
14948 -20263 -20447 -700 8701 32456 23791 47984 56226 51359 10610 -36216 -53783 -22405 -12198
14935 -12198 5612 39575 78338 70010 53815 -12213 -64915 -39707 -3082 3605 -22801 -10922
14923 -10922 6495 9829 4499 5689 12075 7514 -8788 7229 -15872 -48759 -48208 -19433 12262
14910 12262 14971 6141 16197 -14007 -14850 -5551 1674 1273 -2747 -10394 5843 7886 9736 16801
14896A6801J5619p330R448j3847j7394j7512j308J1251J3971j7274k4813K8921
14884c467k6314r716J8584l3j3366L6034M3645K1776N749k0011o2084o1555K1225
14871d9533K7081J3133K2736M360M938K8778n659m4147L781p325k8028J4407k0904
14858c6382j4012R729M9652J9463j826O595K0001K1350k0181l3705n9851M325
14846c4842P709k7685k2311J4436L2054O7585J231k8419l7420L5394L4020J5775
14834E7527L1778k2755m7595k3784k5188l17l4030p085N5397O084K1872K5161
14822C7065L534q603j884P946l5944P721L8669l0904k5734q19K1287K3828J5592
14809E1754j6196j5424j0032l1880j9250L6358K0935k0524k0613J1224K298J8402
$$ plain form
14896 16801 32420 25090 34538 20691 3297 -14215 -15523 -4272 9699 -7575 -32388 -3467
14884 -3467 -29781 -39497 -20913 -20946 -34312 1722 45367 67143 72892 52881 -9203 -70758 -49533
14871 -49533 -22452 -9319 13417 17777 22715 51493 45834 1687 5468 -1857 -29885 -15478 -36382
14858 -36382 -50394 -40665 8987 28450 26624 33219 53220 74570 54389 20684 -39167 -34842
14846 -34842 -27133 -54818 -77129 -62693 -30639 36946 38177 9758 -27662 7732 41752 57527
14834 57527 89305 66550 18955 -4829 -30017 -30334 -64364 -71449 -16052 -9968 11904 37065
14822 37065 40599 31996 30112 38058 2114 9835 48504 17600 -8134 -8953 12334 36162 51754
14809 51754 35558 20134 10102 -21778 -41028 -4670 16265 -4259 -24872 -13648 -11350 7052
14797G052J0161N986j4975m2125n56r133J228J2582K1810J7835k4609j7774P958
14784b4560R482p999m659n55J3597L3254l4482l7093m135P0337L8405k2732R00
14771B9760k6190p364J2060K1183K915j5853j2917k053J7864j2363R629K473j7052
14758B092r509R024k4775J4491K2001J1883o280J11m3870l3679N5805k574o1125
14745f6405Q474O670P74K3427r803L4874M4291N8306L8434l5474m2005j6641M839
14732D9761o384l7254J7147J5167l6403j0761K9528J4k0990R734k0126O573K7722
14719B3728J9894j5081l2985j8089J0443k1208J2692M0204K0560l3172J13j4315
14707g216j7508j3386n768N2884Q370j4920k9595n4727L9036L6818l984K9908
$$ plain form
14797 7052 17213 23199 8224 -33901 -34457 -43590 -42362 -29780 -7970 9865 -14744 -32518 -24560
14784 -24560 -15078 -23077 -27736 -28291 -14694 18560 -15922 -53015 -57150 13187 51592 28860 29760
14771 29760 3570 -3794 8266 29449 32364 16511 3594 1541 19405 7042 16671 19144 2092
14758 2092 -7417 1607 -23168 -8677 13324 25207 18927 19038 -24832 -58511 -2706 -5280 -66405
14745 -66405 -57931 -51261 -50487 -27060 -36863 -1989 42302 100608 139042 103568 61563 44922 49761
14732 49761 43377 6123 23270 38437 2034 -8727 20801 20815 -175 9559 -10567 -3994 23728
14719 23728 43622 28541 -4444 -22533 -12090 -33298 -20606 19598 40158 6986 7099 -7216
14707 -7216 -24724 -38110 -43878 9006 17376 2456 -27139 -81866 -42830 -6012 -9996 19912
14695A9912J4979m6498N258K8920k6711J5301n253J0082O930J1307L4806o049
14683F2984l449j3466L697O565j8940k1490M6460J0609l1959p6478k7733P052
14671e6148j035k488L1195L6715j482l3697j9829r088J3229L8363J2391j3575
14659e449m6992j4457L3676J8701K7575k967p216o716l8303k8152J6286K7016
14647b6998O570o718n083K2453J2524R322k9077o066M3798M3652J0334l677k4799
14634D6235N911j981l5759l7476j0048K3214L2408M791L2470k1264p575j7446
14622A3480k6973j9143k2659K277N5880M9090K3250m9873m8038l167J7506m055
14610a2425J927l2944J0305K6281P144J0090j3620k1997k4618L751O191J6416
$$ plain form
14695 19912 34891 -11607 -6349 22571 -4140 11161 5908 15990 22920 34227 69033 62984
14683 62984 59535 46069 49766 56331 37391 15901 62361 72970 41011 -35467 -63200 -56148
14671 -56148 -57183 -59671 -28476 8239 6757 -26940 -46769 -55857 -42628 -4265 8126 -5449
14659 -5449 -52441 -66898 -33222 -14521 13054 10087 2871 -3845 -42148 -70300 -54014 -26998
14647 -26998 -20428 -27146 -32229 -9776 2748 12070 -17007 -23073 20725 64377 74711 71034 46235
14634 46235 52146 50165 14406 -23070 -33118 -9904 22504 27295 59765 38501 30926 13480
14622 13480 -13493 -32636 -55295 -53018 2862 51952 75202 25329 -22709 -25876 -8370 -12425
14610 -12425 -10498 -43442 -33137 -6856 288 10378 -3242 -25239 -49857 -46106 -39915 -23499
14598b3499J4848p823J4703J0644J3140M940k8435p171r267l0879J1039j701L9855
14585C94J2119N178j0335j0774K853j3968l4904j3216J4002K4339k3919K4569
14573b3662L3361J4092Q174l0068j8925k9807k0267K0054L3758K1796L355l380
14561H481o092L2467K6478K4760l0810m829j1793l854k1151j9738j0735J0197
14549f619L646r466J625K6532L7137K2588l1864m1498k3395N71n759k4875k5774
14536g7151L5161L6587J7569M765p5782o6437R525K8569N9548J7486j1575k0224
14524d1959J3328L0966N230K369j5160k6644k9932m6230K189O4937M4282j0137
14512f761l7900Q548j3756K4703K1831K8448M605j4407J37k4751m6953L618K3000
$$ plain form
14598 -23499 -8651 -16474 -1771 8873 22013 26953 -1482 -8653 -17920 -48799 -37760 -39461 394
14585 394 12513 17691 7356 -3418 -565 -14533 -49437 -62653 -48651 -24312 -48231 -23662
14573 -23662 9699 23791 31965 1897 -17028 -46835 -67102 -47048 -13290 8506 11861 8481
14561 8481 2389 34856 61334 86094 55284 50455 38662 34808 13657 -6081 -16816 -6619
14549 -6619 -2973 -12439 -10814 15718 52855 75443 43579 2081 -21314 -20743 -26502 -51377 -77151
14536 -77151 -41990 -5403 12166 16931 -58851 -125288 -115763 -87194 -27646 -10160 -21735 -41959
14524 -41959 -28631 2335 7565 9934 -5226 -31870 -61802 -108032 -105843 -40906 3376 -6761
14512 -6761 -44661 -36113 -49869 -25166 -3335 25113 29718 15311 15448 -9303 -56256 -52638 -29638
14499b9638K843q653J0095L4719N5620j0251m0321M315L4980K2983P003m3244
14487D0451m7326m5522k0043K5850l231k2044p981K5487J8805K867K013j779R045
14474b3408j3365j8103j7120K6247L3939J177k3345K7233M6703J3418P208m4969
14462A5615k1371m008L6177K948k5807n704M067J1979j2483n7961n13J2336k5744
14449g0469J5119L5776l823k2979K3921K6759j4078j5022L5826j523n952K6190
14437B9745m934j1505K5381K3966m809m7739m9685L230Q876k7110Q34K1967l337
14424c5120L1036k7200q112J4812J8788K756J4456j4709q207J5209p543k2969
14412b6803m572L1307K431j1932J3663j6860k1494k719J3670J9433j6869k3838
$$ plain form
14499 -29638 -26795 -35448 -25353 9366 64986 54735 14414 18729 53709 76692 83695 40451
14487 40451 -6875 -52397 -72440 -46590 -49821 -71865 -79846 -54359 -35554 -32687 -30674 -32453 -23408
14474 -23408 -36773 -54876 -71996 -45749 -11810 -10633 -33978 -6745 39958 53376 60584 15615
14462 15615 -5756 -9764 26413 29361 3554 -2150 1917 13896 1413 -56548 -57061 -44725 -70469
14449 -70469 -55350 -19574 -23397 -46376 -22455 4304 -9774 -24796 11030 9507 3555 29745
14437 29745 24811 13306 38687 62653 57844 10105 -39580 -36350 -27474 -54584 -53750 -31783 -35120
14424 -35120 -4084 -31284 -39396 -24584 -5796 -3040 11416 -3293 -11500 3709 -3834 -26803
14412 -26803 -31375 -68 2363 -9569 4094 -12766 -34260 -36979 -23309 -3876 -20745 -44583
14400d4583l2426M175J1527j845L5850K4685J081J5725J03j2009k8665J2756J7164
14387C538j1207L584j3686l824J221J6462O810L553K5004k8226m440o596j8709
14374b6516Q856J0846J693K7871l097m6739k4440J1774L8681j4035k2818K350
14362c5574K5788K190K1760K0077k4718k7612O445J1855k4423k7449M0471M4911
14350C3721K2670M0905j5428j9350l6208j6480J5966l1071j8768K5327j1013r203
14338a8932J6693L018k2240l3867J3321K2705N7556K2136j7772k8352L0661J0692
14326E5619J3622l7087j1767l956j3714J3523N613j484l0065j0176m055P892N048
14313a0987j3626L6735J7643l3183M750j348k8633o852J9876q057Q039k0182n942
$$ plain form
14400 -44583 -77009 -72834 -61307 -63152 -27302 -2617 -1536 14189 14292 2283 -26382 -13626 3538
14387 3538 -7669 -4085 -17771 -21595 -20374 -3912 2898 6451 31455 3229 -1211 -7807 -26516
14374 -26516 -17660 -6814 -5121 22750 19653 -27086 -51526 -39752 -1071 -15106 -37924 -35574
14362 -35574 -9786 -7596 14164 34241 9523 -18089 -11644 211 -24212 -51661 -11190 33721
14350 33721 56391 97296 81868 62518 26310 9830 25796 -5275 -24043 1284 -9729 -18932
14338 -18932 -2239 779 -21461 -55328 -42007 -19302 38254 60390 42618 14266 44927 55619
14326 55619 69241 32154 20387 16431 2717 16240 21853 20369 -9696 -19872 -23927 -16035 -10987
14313 -10987 -24613 12122 29765 -3418 1332 -16 -28649 -35501 -15625 -23682 -15643 -35825 -41767
14300d1767m23J6504n386j0391j7757Q824R991j6969J302M5342L4895j4879J750
14287A1036m8335n5154J054M3071M9734r559j2642j943j8382m5547j3136M5820
14275e3983L1012K9828M3899k169l9998R565q705K8883l7513m0940K4683L9292
14263B3854j535K2006j6943j6139m8845K6896J7478m1051l9293K3821k1644j0142
14251h1537L6414J4967r561l2308Q030j5405M24Q027J2195K0498P451O602L625
14238b0578M114J0020Q352L828J7624J1861j1088r353m1257k4865K2012M6834
14226A7504J4567l8885J6854k6809l2726J6624K1393J7151L953J1237l3625M409
14214h353l4576k1539J813K2946J8812K5082J462j506l845K516j8328j8915K4571
$$ plain form
14300 -41767 -42190 -25686 -31072 -41463 -59220 -50396 -40405 -57374 -56072 -10730 24165 9286 11036
14287 11036 -37299 -92453 -91399 -48328 1406 -8153 -20795 -22738 -41120 -86667 -99803 -53983
14275 -53983 -22971 6857 50756 48587 8589 18154 9449 38332 819 -40121 -15438 23854
14263 23854 22319 44325 27382 11243 -37602 -10706 6772 -34279 -73572 -49751 -71395 -81537
14251 -81537 -45123 -30156 -39717 -72025 -63995 -79400 -78976 -70949 -58754 -38256 -30805 -24203 -20578
14238 -20578 -16464 -6444 1908 5736 23360 35221 24133 14780 -26477 -51342 -29330 17504
14226 17504 32071 -6814 10040 -16769 -49495 -32871 -11478 5673 9626 20863 -12762 -8353
14214 -8353 -42929 -64468 -62655 -39709 -20897 4185 5647 4141 296 2812 -15516 -34431 -9860
14201i860J2071J8517O0275J392o1606q66j2404l1425L6358M118j1985l1394l281
14188c0090P398K024O960J087J1019j6460r061Q48K2029R55o202j5883M924l3146
14174e3598j2575j625K1223j6261L5421M030J4216k816k5061J3228K4678q306
14162g446j7255K215J8869K0209j9943M614k2345R879J0569K0718k3515K5428
14150B1997J5594m398m6477j2249j9707L1363j724j2228K6236j2434j5179K1309
14138g897Q216l92m4342l3407K5217M4607j2008q696j7446N9354N160Q18P817
14125B7001k9064J2005J9939k2569j4836J5668Q173K9539L3219j183o503k9455
14113D1934l6161p950k3021P566K1478k6902l0139M0889K7080m2657k6010j9825
$$ plain form
14201 -9860 2211 20728 81003 82395 20789 19923 7519 -23906 12452 16570 4585 -26809 -30090
14188 -30090 -22692 -20668 -13708 -12621 -1602 -18062 -27123 -26275 -4246 -3291 -9493 -25376 -20452 -53598
14174 -53598 -66173 -67798 -46575 -62836 -27415 -23385 -9169 -11985 -37046 -23818 860 -7446
14162 -7446 -24701 -22486 -3617 16592 -3351 1263 -21082 -11203 -634 20084 -3431 21997
14150 21997 37591 33193 -13284 -25533 -45240 -13877 -15601 -27829 -1593 -14027 -29206 -7897
14138 -7897 319 -73 -44415 -77822 -52605 -7998 -20006 -28702 -46148 13206 18366 19184 27001
14125 27001 -2063 9942 29881 7312 -7524 8144 16317 45856 79075 77892 71389 41934
14113 41934 5773 -2177 -25198 -17632 3846 -23056 -53195 -12306 14774 -27883 -53893 -73718
14101g3718j1061M9900Q516J7356N558j1280K8238j9925K2065l311k0938k9387
14089c7987J0991j0567j4771O6204L2601k519P499l2205j3223k9643j9711K842
14077d0489k6995O253J1092M7406J3713j3814J058j2113j8168j2048J5173K1419
14065g513J5888p732n409J5262N4274J0047l6141L7622l375m7215k7876j0277
14053a2445J8944L1126K6908M36p275k8096l5591K4198n21K66Q654o642k166J4413
14039C2209J863p469k1943k5080M102J0848L8250m6671n4395k0150O168K802J3605
14026f5861K1967N145K362R188j1138k8871j3393N911o975J1768M3058J3680K6280
14013A3121M076m4252K6184L1119j8612l1281L130q595Q880q554r648J9601J8649
$$ plain form
14101 -73718 -84779 -34879 -26363 -9007 -3449 -14729 13509 -6416 15649 12338 -8600 -37987
14089 -37987 -26996 -37563 -52334 13870 46471 43952 51451 19246 6023 -23620 -43331 -40489
14077 -40489 -67484 -61231 -50139 -2733 10980 -2834 -1776 -13889 -32057 -44105 -28932 -7513
14065 -7513 8375 643 -4766 10496 64770 74817 38676 76298 72923 25708 -2168 -12445
14053 -12445 6499 37625 64533 64969 57694 29598 -5993 18205 17684 17950 26604 19962 17796 32209
14039 32209 34072 26603 4660 -20420 -16318 -5470 32780 -13891 -68286 -88436 -82268 -79466 -65861
14026 -65861 -43894 -38749 -36387 -27199 -38337 -67208 -80601 -74690 -81665 -69897 -26839 -13159 13121
14013 13121 17197 -27055 -871 30248 11636 -19645 -16515 -25110 -16230 -24784 -34432 -14831 3818
14000C818J7652Q119l2478q0668p77P9565l240K439J2994J0187l9417j1601Q831
13987b4576J3841P356J2455j529j1163k1906K717O610l227K7221K2446k8085N970
13974H130J5392O397r523j7132r235j125k6721j0458j33k4972l1222K3377M7548
13961b9677L1215p135k5408l2799J955j7985K9966M7524j448j7745L6701K1110
13949C6274k9047J4155J3940n3156k4427J2551L9828K3308m285J2670K0940l6735
13937B6016j7460K785j3180k3634k3594j8365L0473L898K2037K32K4093j2531
13925G70K418p666J714l158L22n633M6046J8690k964J511j5963j1777J8605k6349
13911A6566j307K06j5960k956l285k9955J6109L682k818j6716j1747l9864K6545
$$ plain form
14000 3818 21470 29589 -2889 -83557 -84334 -4769 -8009 -5570 7424 17611 -21806 -33407 -24576
13987 -24576 -10735 -3379 9076 7547 -3616 -25522 -22805 -16195 -19422 7799 30245 2160 8130
13974 8130 23522 29919 20396 3264 -5971 -7096 -33817 -44275 -44408 -69380 -100602 -77225 -29677
13961 -29677 1538 -5597 -31005 -63804 -61849 -79834 -49868 -2344 -3792 -21537 15164 36274
13949 36274 7227 21382 35322 -17834 -42261 -29710 10118 33426 29141 41811 62751 26016
13937 26016 8556 11341 -1839 -25473 -49067 -67432 -36959 -33061 -11024 -10792 13301 770
13925 770 3188 -4478 -2764 -5922 -5600 -11233 34813 53503 50539 52050 36087 24310 42915 16566
13911 16566 15259 15465 -495 -3451 -6736 -36691 -20582 -16900 -19718 -36434 -48181 -88045 -61500
13898f1500P4679K2840n4317k8648k2299P4176J5227K3259N49m0436m1166M7017
13886I381N988o743k6926j1564k5052r670M7335K3796J3181K1266j2253m8967
13874b0228m038K4248k5935l3078k6183j535P6477M3552J6670R480O251o454J050
13861F0277l0856l8040j6178L628k3370J5010K7954Q585n940O001j6459j4588
13849b3976o382j9396P055J6122J733M605J1612J795J189o855j2566M796K23L1268
13835A1223Q704j3203l0957J0396k040O851n7J3124r863j523J6314K427R198L0111
13821E0705K2263m663k0120j7163m2707l7317j2905K0362J5363m982J2731r467
13809b7900m370M8453L2709l190l2851j3387q719k8279M4105K8211R909k0803
$$ plain form
13898 -61500 13179 36019 -18298 -46946 -69245 4931 20158 43417 43966 3530 -37636 9381
13886 9381 15369 8626 -18300 -29864 -54916 -64586 -17251 6545 19726 40992 28739 -20228
13874 -20228 -24266 -18 -25953 -59031 -85214 -86749 -10272 33280 49950 59430 65681 59227 60277
13861 60277 29421 -8619 -24797 -21169 -44539 -29529 -1575 7010 1070 7071 -9388 -23976
13849 -23976 -30358 -49754 -42699 -26577 -24844 -20239 -8627 -6832 -5643 -12498 -25064 -20268 -20045 11223
13835 11223 19927 6724 -24233 -13837 -15877 -9026 -9083 4041 -5822 -7345 8969 11396 20594 50705
13821 50705 72968 68305 48185 31022 -11685 -49002 -61907 -41545 -26182 -31164 -18433 -27900
13809 -27900 -32270 16183 48892 45702 12851 -536 -9255 -37534 6571 34782 44691 23888
13797B3888l3356m440N319K3248l867K4367K945j3064l4362N165k2697k888J6920
13784a2822k5689K4854J6456J4266l336L39n274P023m186q893M054R12j6833m8041
13770e7170L8746K2787r223K0111j0658R148J9940Q991j5706j9352L970k3742
13758a2158l899K7707K5536o72L1589l823q3752l2458K3425L8616Q696M387j103
13745B2091K4039J4862j2081J521K5350n323m6076l752m1641J0968j0250m4240
13733f4532J2250M2894O423l4783P761J8114r232l3176K803K8315K4195J4611
13721A5643R249j6674k1806Q20M2129J795n572j3656J7552J4409N4035o385j8871
13708G2668l1945m8390j7811j8586N064J1707j66j3089j6019K3481M0306M076
$$ plain form
13797 23888 -9468 -13908 -8589 14659 10792 35159 38104 25040 -9322 -4157 -26854 -29742 -12822
13784 -12822 -38511 -13657 2799 17065 13729 14068 8794 15817 11631 2738 6792 7704 -9129 -57170
13770 -57170 -18424 4363 -4860 15251 4593 13741 33681 42672 26966 7614 11584 -12158
13758 -12158 -16057 11650 37186 36514 68103 64280 -19472 -51930 -28505 10111 18807 23194 22091
13745 22091 46130 60992 48911 50432 75782 70459 24383 20631 -21010 -10042 -20292 -64532
13733 -64532 -52282 -9388 -2965 -37748 -29987 -11873 -21105 -54281 -51478 -23163 1032 15643
13721 15643 24892 8218 -13588 -12768 29361 31156 25584 11928 29480 43889 97924 91539 72668
13708 72668 40723 -7667 -25478 -44064 -39000 -27293 -27459 -40548 -56567 -33086 7220 11296
13696A1296o166n900P969l4000J2045M4189k305P187j180L8603O801r306l592
13683F5641l1574l6270m5993O946K0810L9110p017N02J0734k1202N698k1850k6522
13670d0987L48k3052j655Q306p586j4418K631N7365R329J631K7289K1442m1928
13657a285l9052M096j8509N727M1086K6485L256j2633j5847J3360J6944R338k7865
13644E101k9194J620n434K498n820L2380k2832p154N679l536l8838j0643M82j8307
13630i3998M8682L9934K0182J136Q470l4902k5606N525R6m578J387k5832L358
13617e6146N1979M816j0420J3374J5259k2116K658K10J9992j2664L599l0316k1380
13604d1155J3212K1938k183l837J0612j6629j1241K3086K7543J2535j0066M4615
$$ plain form
13696 11296 5130 -770 7199 -26801 -14756 29433 27128 34315 33135 71738 78539 69233 65641
13683 65641 34067 -2203 -48196 -41250 -20440 18670 11653 12155 22889 1687 7385 -14465 -40987
13670 -40987 -40639 -63691 -65346 -57040 -64626 -79044 -76413 -19048 -9719 -8088 19201 40643 -1285
13657 -1285 -40337 -36241 -54750 -49023 -7937 18548 21804 9171 -6676 6684 23628 32966 5101
13644 5101 -24093 -22473 -27907 -25409 -31229 1151 -21681 -28835 -23156 -26692 -65530 -76173 -75691 -93998
13630 -93998 -45316 -5382 14800 15936 24406 -10496 -36102 -30577 -30481 -35059 -33672 -59504 -56146
13617 -56146 -4167 649 -9771 3603 18862 -3254 -596 -386 19606 6942 10541 -19775 -41155
13604 -41155 -27943 -6005 -8188 -12025 -1413 -18042 -29283 -6197 21346 33881 23815 68430
13592F8430n98m6818k8384P074J8246N360j3042k8223L0779J5455j9354l830q429
13579c334j6101J3726Q13j0128K6839N1265K7699j8473k2808k4505k148o814j2051
13566C980J0867K8448j615p651p391j0376n275N267q831L4864Q729O121P932j0539
13552E4530k6278k0207Q23K1449K2076j9619k4032k7976k59J7199J3942J8898
13540C0546j3517l739j1398K6444M0979j2738J7786L798l3925l907k2666j1034
13528F629j2057J0637j212J3958K8604l4503k3463j9058j3044N188L1542J7038
13516A0259P892k8294L7135M2742J083m6414o4138l2351k102J581K8397J2363
13504c1847J271M409J1971J105L532J1837k6178P429J0714K0212K5301n859k2314
$$ plain form
13592 68430 67832 21014 -7370 -296 17950 23310 10268 -17955 12824 28279 8925 5095 -3334
13579 -3334 -19435 -5709 -4896 -15024 11815 63080 90779 72306 49498 24993 22845 16031 3980
13566 3980 14847 43295 41680 34029 26638 16262 10987 16254 7423 42287 51016 57137 65069 54530
13552 54530 28252 8045 8868 30317 52393 32774 8742 -19234 -19493 -2294 11648 30546
13540 30546 17029 13290 1892 28336 69315 56577 74363 78161 44236 40329 17663 6629
13528 6629 -5428 5209 3997 17955 46559 12056 -11407 -30465 -43509 -38321 -6779 10259
13516 10259 18151 -10143 26992 69734 70817 24403 -39735 -72086 -74188 -72607 -44210 -31847
13504 -31847 -30576 -26167 -14196 -13091 -9559 2278 -23900 -16471 -5757 14455 39756 33897 11583
13491A1583J622k8518l9256m700P657l223K953L505l9555K8271J8239J8166j6652
13478c9908J8963j5277j1008L9983J2649r073m2539j6062K8613L4131J6436L1290
13466D8198j8402k0910j2042k982L4415m3895q848L4543n473J5759L8818J2378
13454G1559p993l1472k7494J6710m449K5971m105j1194o845o445j6359J2837J1669
13441B2390m462k093Q714J7620k5064m5148l238N408l5866P13k09j434M6523K4189
13427H043O827j378k8177J3079l977j4983K5602L6118K1196J3915J9388M548J2863
13414A13064q046n5714m0964k2664L228K331J2923M2413J3832l5811m0759j202
13402a7369M4429K2202k5313Q054L3074k3832k7607J8301k55j5025K28L496j2641
$$ plain form
13491 11583 13205 -15313 -54569 -59269 -51612 -54835 -51882 -48377 -87932 -59661 -41422 -23256 -39908
13478 -39908 -20945 -36222 -47230 -7247 5402 -3671 -46210 -62272 -33659 472 16908 48198
13466 48198 29796 8886 -3156 -6138 28277 -15618 -24466 10077 4604 20363 59181 71559
13454 71559 63566 32094 4600 21310 16861 42832 38727 27533 20688 14243 -2116 10721 22390
13441 22390 17928 15835 24549 42169 17105 -28043 -31281 -25873 -61739 -61026 -61235 -62669 -16146 8043
13427 8043 14870 13492 -14685 -1606 -5583 -20566 5036 41154 62350 76265 95653 100201 113064
13414 113064 105018 49304 8340 -14324 -11096 -8765 4158 46571 60403 24592 -16167 -17369
13402 -17369 27060 49262 23949 32003 65077 41245 13638 31939 31684 16659 16887 20383 7742
13389G742L0232L567j3177j0251j0173P336j1292m5072p792L4009J297l5634N566
13376d3642K6361k7477n920M0127K5831J7520j2734j6238j9281O778q018j3377
13364c0070Q756O982K4284K3409l5835J7695J4727l818N18p954N01N45K3152K3930
13350F6822p18n4618j8361q146J8026N318N27k4475r088L8060k3580O273l898
13337g858l8818O331M6438J7216J1419L5852N8023K361N536k7973j2259K8772
13325A25040l2561m5614J8177r420k9089l1096J7987p300k2794Q704L7446L5096
13313F4576k8672l091p849P546m202J8198k1446k7394n981K0617k4529o954J1597
13300g584J2651j2655n158K4812J9616J3434J2432j489j017m8546Q260J5376R360
$$ plain form
13389 7742 37974 41541 28364 18113 7940 15276 3984 -41088 -48880 -14871 -13574 -49208 -43642
13376 -43642 -17281 -44758 -50678 -10551 15280 32800 20066 3828 -15453 -8675 -16693 -30070
13364 -30070 -21314 -14332 9952 33361 -2474 15221 29948 26130 26648 18694 19195 19740 42892 66822
13350 66822 66104 11486 -6875 -15021 3005 8323 8850 -15625 -24713 13347 -10233 -3960 -7858
13337 -7858 -46676 -40345 6093 23309 34728 70580 128603 130964 136500 108527 96268 125040
13325 125040 92479 46865 65042 55622 26533 -4563 13424 6124 -16670 -7966 29480 64576
13313 64576 35904 32813 24964 32510 28308 46506 25060 -2334 -8315 12302 -12227 -19181 -7584
13300 -7584 5067 -7588 -12746 12066 31682 45116 57548 56059 55042 6496 14756 30132 39492
13287C9492J03k1950l5783O586M3948M9751k8282n9279J1985M9804K6630l1194
13275E1811q034k1015l6542j3937J2592J3190J7563m926J4158K8153r825n1202
13263h014J1031J4160K5695K1022k4231p471L1013L7708K661l6675p222k672m592
13250E2413k6876M6386K7589o247l6976j5372m7912N2811N2949j7499l3797k941
13238D4528p961J3645J0598q630m7503n3995r970L7436J5258J2709q458N0235
13226D7892O3273j1473k6031k1984l2251l1705j5606l1149K1761J3070J0145M7637
13214C3579O550J3507n6608k2997J2879k1041p429k342J3603K5549J2520M272
13202A2042N517J424m742k6265n556k793J028L08M121q771O420J1870K9578l246
$$ plain form
13287 39492 39595 17645 -18138 -11552 32396 82147 53865 -5414 6571 56375 83005 51811
13275 51811 43777 22762 -13780 -27717 -15125 -1935 15628 10702 24860 53013 43188 -8014
13263 -8014 3017 17177 42872 63894 39663 32192 63205 100913 103574 66899 59677 57005 52413
13250 52413 25537 71923 99512 93265 56289 40917 -6995 45816 98765 81266 47469 44528
13238 44528 36567 50212 60810 52180 4677 -49318 -59288 -21852 -6594 6115 -2343 47892
13226 47892 111165 99692 73661 51677 19426 -12279 -27885 -59034 -37273 -24203 -14058 33579
13214 33579 40129 53636 -2972 -25969 -13090 -34131 -41560 -43902 -30299 -4750 7770 12042
13202 12042 17559 18983 14241 -12024 -17580 -20373 -19345 -19037 -14916 -23687 -17267 -5397 24181 20935
13188B0935J53r853j6443O085L27k3280j8860K6768L7539K6777K3029n6348J2071
13175B8900K4413J5059n4818R76m922O746n885k1233N2458L3394k5461L4567j7505
13162F6689l7641l8338M664N5540K2985j5470l0180j3747k9377n722L5178J4218
13150B8799J1484K3480J9858k4007j1903j5678L3485l7O417N265J053m625l1591
13137D2000k822P588l585m2198j5606j1242l8472K179J6892L2566L2595J345j5430
13124E810J254M3261j3463l0960K3001M6545L2511j7784j4290l4299q848L0760
13112F3498L881l1529j0685J6265O802k7290n129j9286k3974j9982l8044J8146
13100f7327O321J1463k1286L9114O1300M6323J5439j2708k5443J300l1727j6281
$$ plain form
13188 20935 21088 11235 -5208 877 1204 -22076 -40936 -14168 23371 50148 73177 16829 28900
13175 28900 53313 68372 13554 14530 9608 16354 10469 -10764 41694 75088 49627 84194 66689
13162 66689 29048 -9290 -4626 50914 73899 58429 28249 14502 -14875 -20597 14581 28799
13150 28799 40283 63763 83621 59614 47711 32033 65518 65481 71898 77163 78216 73591 42000
13137 42000 39178 46766 43181 983 -14623 -25865 -64337 -62158 -45266 -12700 19895 21240 5810
13124 5810 7064 50325 36862 5902 28903 75448 107959 90175 75885 41586 32738 63498
13112 63498 67379 35850 25165 41430 48232 20942 15813 -3473 -27447 -47429 -85473 -67327
13100 -67327 -61006 -49543 -70829 -31715 29585 75908 91347 78639 53196 54496 22769 6488
13088F488K7355K3095J6070J5183M7299j2736l950r640k8359k6750R265j2188
13076E1132J980R775j4092J0315J3150j4660J5966m460R49J5057j9630J8334k5006
13063E8810j9652J4284j5283l0783j6165K3225Q536k9277K1958Q939k4938n467
13051e813J8308J3107k8524N62M5128j584o159m8207J0891L4861K0537r152k0847
13038B3108K22K4757k3700k4831P648J1954k3225k6979j4894J8968L2958K2765
13026B8751J3462L9265o035m1271p085K251K4554j7912l3304m727K3401L0118
13014E1468k3058l1376O917o831K4053j7453l850O474j177j0454K4861L420K4712
13001D7706q279M23P494l521L8901J707j4909n040p531k242j0127j1964l2522
$$ plain form
13088 6488 33843 56938 73008 88191 135490 122754 118804 109164 80805 54055 63320 51132
13076 51132 53112 62887 48795 59110 72260 57600 73566 69106 70055 85112 65482 83816 58810
13063 58810 39158 53442 38159 7376 -8789 14436 22972 -6305 15653 24592 -346 -5813
13051 -5813 12495 25602 -2922 -2360 42768 41184 35025 -13182 -2291 32570 53107 43955 23108
13038 23108 23330 48087 24387 -444 7204 19158 -4067 -31046 -45940 -26972 5986 28751
13026 28751 42213 81478 75443 34172 27087 29338 53892 35980 2676 -2051 21350 51468
13014 51468 28410 -2966 3951 -2880 21173 3720 -130 6344 5167 -5287 19574 22994 47706
13001 47706 39427 39850 47344 43823 82724 84431 69522 64482 56951 54709 44582 32618 96
12988I6k4436N6447j967l9403j3430K3398J6637k2200l1024n888J8777L1407o658
12975A756J0770J3685Q940j0745K1591o21l8205L3203K6688k2229K3172J66l119
12962F5052J4516L3707J4523j386k422K6997k8142j5950j9985j5480r074K2836
12950H5192q16n3319P18M9464l034l5114j7795M827J4490j4820j2936J9232L5680
12937G1769M5560K0676k7376l2125J7056l600M769m519P781k1952k1630J8764
12925G5173k7637N541q196j1659L0147J3767J6438J5N863k5115k0237k5390L4075
12912F2785J3434m8257j5575r257K988J9007j5821k9829o070K921J3036M0454
12900B9816L8217R394j6493o142k8258N043J0179k622o519n361k426n315P04J7548
$$ plain form
12988 96 -24340 32107 30140 -9263 -22693 705 17342 -4858 -35882 -41770 -22993 8414 1756
12975 1756 12526 26211 35151 24406 45997 45376 7171 40374 67062 44833 68005 68171 65052
12962 65052 79568 113275 127798 126412 123990 150987 122845 106895 86910 71430 62356 85192
12950 85192 84376 31057 31775 81239 78205 43091 25296 30123 44613 29793 16857 36089 71769
12937 71769 117329 138005 110629 78504 95560 91960 96729 92210 99991 78039 56409 75173
12925 75173 47536 53077 44881 33222 63369 77136 93574 93589 99452 74337 54100 28710 62785
12912 62785 76219 27962 12387 3130 6118 25125 9304 -20525 -26595 -23674 -10638 29816
12900 29816 68033 77427 60934 54792 26534 31577 41756 39134 32615 27254 24828 19513 20217 37765
12886C7765k0823J5023N8633J1626k7126k4775J1782J3113l6k5990K6511K1599
12874I7302j295j9004O702p735j5543K6667J0027K649j8793j5565J3224j7841
12862F0795o644m873J9582l3095R724L3432N1367k9603p1300l5765N711J5032
12850A4363P448l431R697L173j8521J9819L0584l5428o199k6028M298L2855r70
12837C1660J4337J9180L642K2700K1919j3810l7932k3293K6547K7019j4145q010
12825F9814l4281P341j319k5401k8501j4045J9923N5778K8934K7557L1440K6561
12813A63801j0129m4133r259j8126l6588j5185N58M1636L0026k6155k8989j740
12801D5717j3483N8821N1961j5635j6516j8951J788K6664j0503l157N589m937
$$ plain form
12886 37765 16942 31965 90598 102224 75098 50323 62105 75218 75182 49192 75703 97302
12874 97302 96007 77003 83705 75970 60427 87094 97121 99770 80977 65412 78636 60795
12862 60795 54151 49278 68860 35765 45489 78921 130288 100685 29385 -6380 -669 14363
12850 14363 21811 18380 28077 31250 12729 32548 63132 27704 21505 -4523 -225 32630 31660
12837 31660 45997 65177 68819 91519 113438 99628 61696 38403 64950 91969 77824 69814
12825 69814 35533 42874 41555 16154 -12347 -26392 -6469 49309 78243 105800 137240 163801
12813 163801 153672 109539 100280 82154 45566 30381 30939 72575 102601 76446 47457 45717
12801 45717 32234 91055 143016 127381 110865 91914 93702 120366 109863 106706 112295 107358
12789A07358j4273l506M5396K6491j346m1464l6666R9l28J5251M2467O777k2398
12776A23858l334k4540K1432J4958n3267k1711K2202K9855m669n434K3052o783
12764A15619k3267m96j26o241r569J6461J8139J9397L3676J0563p3582M645K3308
12751A28527J9946p270k0326K408J4851m4976n973K4172k6215m4416j036J8519
12739E8211K0274j9847l8005N4309J4307K0892K4956k3329j3769N130J8247j2453
12727A08923o3323j0650K0526K399J9322k0723p0884M183L9993K0341K2567J133
12715G3807J3370J6339j824k9892j2247K8621L5678J1012l5825l8457m0801M1942
12703F1723L7053J5416K9920J0578j1100K8395K9309n576l5916j9300L15J2526
$$ plain form
12789 107358 93085 89579 134975 161466 160120 118656 81990 82089 81761 97012 139479 146256 123858
12776 123858 120524 95984 117416 132374 79107 57396 79598 109453 104784 99350 122402 115619
12764 115619 92352 91856 91730 85489 75920 92381 110520 129917 163593 174156 100574 105219 128527
12751 128527 148473 141203 120877 123285 138136 93160 87187 111359 85144 40728 39692 58211
12739 58211 78485 58638 20633 74942 89249 110141 135097 111768 97999 103129 121376 108923
12727 108923 45600 34950 55476 57875 77197 56474 -14410 -10227 29766 50107 72674 73807
12715 73807 87177 103516 101692 71800 59553 88174 123852 134864 99039 60582 19781 61723
12703 61723 98776 114192 144112 154690 143590 171985 201294 195718 159802 140502 140817 153343
12691A53343J6583n543P794j1967K553M538k3065m263J9575j3914n1819j3683
12679H0132j2826K2991M4394J8459k844j7095L617L4391J7296m8028j7604K3579
12667A46462Q083j2393L5815Q716l2225l1923k2514Q063K1630r6j353k327K3789
12654A49727j6345j1704l144k2794j0732L6221M8974k3605Q818K3787r179l7287
12642A32737K0493M497L476j0975j6276l3962N966P0697P68j5976K5309N614j8776
12629A73592K8462J2117J9202K5833J6546p750m4403L1317K5964L5312K971K9408
12617C48571M09L2671N8210L3298O7062M5623R9036O8135R3738J16088Q8852R8860
12605A150553J06952J28581J17886M8396Q7752J26218Q6663J7731M4274P9046
$$ plain form
12691 153343 169926 164383 172177 160210 162763 167301 144236 139973 159548 145634 93815 80132
12679 80132 67306 90297 134691 153150 150306 133211 136828 171219 188515 140487 122883 146462
12667 146462 154545 142152 177967 186683 154458 122535 100021 108084 129714 129618 128265 125938 149727
12654 149727 133382 121678 118534 95740 85008 121229 170203 146598 155416 179203 170024 132737
12642 132737 153230 157727 161203 150228 133952 99990 105956 176653 177421 161445 186754 192368 173592
12629 173592 202054 214171 233373 259206 275752 268002 223599 254916 280880 316192 319163 348571
12617 348571 348980 381651 439861 473159 540221 585844 684880 753015 846753 962841 1051693 1150553
12605 1150553 1257505 1386086 1503972 1552368 1640120 1766338 1853001 1870732 1915006 1994052
12595A994052R739k0818n6791n5145k0557p6646j11195p6805q2688r3938j19430
12584A289778p3377j02160r6196r1789o8759p7160o8441m5008l6407l0755n3326
12573E46400k3189j0023m3197l2091j4469l3467j9300k4222j1931l0649p594K4609
12561C20877J2809n0895R867O463k4867m819K0290M899p377k9436j1905Q749q194
12548B46461O308K4598M535j4382K0035j6984k9926m4277L023k2505L3199K1022
12536B31107l8567P307K9548J7322j4449n2902m9283l825M3937N1578L5835k4040
12524B33568o9390L9699k3674P858K4638o238M244J9963R859j3478L5589O490
12512B69128J5881K8323m3907o0444j0326J9101q54p420j2526J9081K1012J6497
$$ plain form
12595 1994052 2003791 1982973 1926182 1871037 1850480 1773834 1662639 1585834 1503146 1409208 1289778
12584 1289778 1216401 1114241 1018045 926256 857497 780337 711896 666888 630481 599726 546400
12573 546400 523211 513188 469991 437900 423431 389964 370664 346442 334511 303862 296268 320877
12561 320877 333686 282791 292658 299121 274254 269435 289725 294624 287247 257811 245906 254655 246461
12548 246461 252769 277367 281902 267520 287555 270571 240645 196368 199391 176886 210085 231107
12536 231107 192540 199847 229395 246717 232268 179366 130083 126258 170195 221773 257608 233568
12524 233568 164178 203877 180203 188061 212699 206461 210705 230668 240527 227049 262638 269128
12512 269128 285009 313332 269425 208981 198655 217756 216902 209482 196956 216037 237049 253546
12500B53546k959j6701J3435p474N111J6872O598j4970j2766J1049m1003R531
12488B20269N2472L6123l265k6712j6424l2012k5873k3624K176L2495j8088j8112
12476A79425j8395Q643K4800M2180J8514K329l371Q444l6860l4360r481J9607
12464B01475M7233L6335j5470J2918m395J2855K6758M310R892n581l3438j4008
12452B78884K767J4085K4559j5157J8768K5276J2574O155K6056j2620M830k0916
12440C65261K5843L5120J0559K4247J1984j2638J3121O488j3314P74m620k1803
12428D41022L7374K6715J8266n571k1763o859k228L6640J9820l5530l0617M374
12416D81643K894k3863j0978j8613r569P651K4239O3099j4964n2404l0228J1659
$$ plain form
12500 253546 250587 233886 247321 239847 244958 261830 268428 253458 240692 251741 210738 220269
12488 220269 272741 308864 305599 278887 262463 230451 204578 180954 183130 215625 197537 179425
12476 179425 161030 169673 194473 236653 255167 257496 254125 262569 225709 191349 181868 201475
12464 201475 248708 285043 269573 282491 278096 290951 317709 322019 331911 326330 292892 278884
12452 278884 281651 295736 320295 305138 323906 349182 361756 367911 393967 381347 386177 365261
12440 365261 391104 426224 436783 461030 473014 460376 473497 479985 466671 467445 462825 441022
12428 441022 478396 505111 523377 517806 496043 489184 486956 523596 543416 507886 477269 481643
12416 481643 484537 460674 449696 431083 421514 429165 453404 516503 501539 449135 418907 430566
12404D30566p502J5645r652q108J0561N601j4640k9859n276J7458j7482K9599
12392D16911K2406J448n545m729n3653m8360J152j4916K2178L0443L617N668M5398
12379D22018M4023J450j6919L3707p111o809o151k5589J6434M8563N2406O903
12367E62925L5505L3457m63k8232n4890j1378J7867K4629l3616l891J0331L747
12355E55991l9894n2234k8102r243o918k3104J7979L3958m8511k1142K7835M332
12343D10947J733Q099L5282K2005K7740L1256m6971J5152K9049L6318O5787P38
12331F37135Q972L1944M2324N9279M5141M1362Q201K0226K7255L6514N6298K3108
12319A037759J5475O3239Q6865Q0859O2408P6805N7299O4991L5949N6587O5282
$$ plain form
12404 430566 423064 438709 429057 420949 431510 437111 422471 392612 387336 404794 387312 416911
12392 416911 439317 440765 435220 430491 376838 328478 329630 314714 336892 367335 370952 376620 422018
12379 422018 466041 467491 450572 484279 477168 470359 464208 438619 455053 503616 556022 562925
12367 562925 598430 631887 631424 603192 548302 536924 554791 579420 545804 541913 552244 555991
12355 555991 516097 463863 435761 426518 419600 396496 414475 448433 399922 378780 406615 410947
12343 410947 412680 420779 456061 478066 505806 537062 490091 505243 534292 570610 636397 637135
12331 637135 646107 678051 720375 779654 824795 866157 874358 894584 921839 958353 1014651 1037759
12319 1037759 1053234 1116473 1203338 1284197 1346605 1423410 1480709 1545700 1581649 1638236 1703518
12308A703518M7423O9884N0450K0972N8763M5878K5937K712L151o291j1543l83
12296B010471J1834K4506M0908J296r263L1461j5929o9193l1536j2396k8629o336
12284A947194K4968l367l767j2034N0093J4882J3494N839k8602L5766M1147K0045
12272B105658K8258M9482K2677j8822l7451q219K0070j2567k3718P3061O1726
12261B260155K0097M3570L0152M5023J5079K6957O5527M4608P1774O7327K2387
12250B712656N3527N9963P6054P7624M6935L4371O9232P0168Q8456P9938M9759
12239C418683J14165J09213J04288J23710Q3863J06213J24512J22288J70832J32772
12229D610539J84178J81078K00495J67926K00139K00127K18232K80463L09449
$$ plain form
12308 1703518 1750941 1820825 1871275 1892247 1951010 1996888 2022825 2025537 2028688 2022397 2010854 2010471
12296 2010471 2022305 2046811 2087719 2089015 2079752 2111213 2095284 2026091 1994555 1982159 1953530 1947194
12284 1947194 1972162 1968795 1965028 1952994 2003087 2017969 2031463 2037302 2008700 2044466 2085613 2105658
12272 2105658 2133916 2183398 2206075 2187253 2149802 2141583 2161653 2149086 2125368 2198429 2260155
12261 2260155 2280252 2323822 2353974 2398997 2414076 2441033 2506560 2551168 2622942 2690269 2712656
12250 2712656 2766183 2826146 2902200 2979824 3026759 3061130 3130362 3200530 3288986 3368924 3418683
12239 3418683 3532848 3642061 3746349 3870059 3953922 4060135 4184647 4306935 4477767 4610539
12229 4610539 4794717 4975795 5176290 5344216 5544355 5744482 5962714 6243177 6552626
12220F552626K78665K88501L30086M04960L75974M37281M65692N14225N79725
12211A0227735O38229O84017P89679Q98666J023593J127894J265358J415874J623285
12202A9694330J849230K104301K387737K708124L118251L674245M267773N055332
12194D4859323N942444P046959Q416283J0061711J1932246J3961103J5961850
12187A18181919J7943320J9742133K1156825K2270754K3225343K3708187K3565639
12180B69794120K2910948K1673851J9752650J6956816J3416972R482637N614738
12173C79602732J898402j944747n712247r358600j2788644j5949947j8463080
12166C17283869k0116210k1057753k1424341k1267143k0569442j9472458j8334164
$$ plain form
12220 6552626 6831291 7119792 7449878 7854838 8230812 8668093 9133785 9648010 10227735
12211 10227735 10865964 11549981 12339660 13238326 14261919 15389813 16655171 18071045 19694330
12202 19694330 21543560 23647861 26035598 28743722 31861973 35536218 39803991 44859323
12194 44859323 50801767 57848726 66265009 76326720 88258966 102220069 118181919
12187 118181919 136125239 155867372 177024197 199294951 222520294 246228481 269794120
12180 269794120 292705068 314378919 334131569 351088385 364505357 373987994 379602732
12173 379602732 381501134 379556387 373844140 364485540 351696896 335746949 317283869
12166 317283869 297167659 276109906 254685565 233418422 212848980 193376522 175042358
12159A75042358j7229139j6050546j4430668j2640816j0883867r415253q136849
12152H6255220p124452o256239n484736m905835m420381l993951l568159l197487
12144D7303980k943654k727427k473893k216009k011150j833949j659764j500058
12136B9938076j399485j323990j205930j094713r73948r30932q71714q08069p51719
12127B0577576p12077o72321o09621n55602m99487m53816m68413m56673l97757
12118A5751809l56727l29826k61432k88978k49780k00956k47990k42127j67199
12109A3406794j34378j52306k00002k51856k75522k60074k50865k80790k71242
12100A1329759l31905l59537l32518l32112l52963m01014l78681l50215l31002
$$ plain form
12159 175042358 157813219 141762673 127332005 114691189 103807322 94392069 86255220
12152 86255220 79130768 72874529 67389793 62483958 58063577 54069626 50501467 47303980
12144 47303980 44360326 41632899 39159006 36942997 34931847 33097898 31438134 29938076
12136 29938076 28538591 27214601 26008671 24913958 23940010 23009078 22137364 21329295 20577576
12127 20577576 19865499 19193178 18583557 18027955 17528468 17074652 16606239 16149566 15751809
12118 15751809 15395082 15065256 14803824 14514846 14265066 14064110 13816120 13573993 13406794
12109 13406794 13272416 13120110 12920108 12668252 12392730 12132656 11881791 11601001 11329759
12100 11329759 10997854 10638317 10305799 9973687 9620724 9219710 8841029 8490814 8159812
12091H159812k75505k94624k49255k39736k80195k85665j82842j84052j63456
12082F004482j48254j58795j07423p2594j02515r5158j29271q3114k8196o4656
12072E014506m7697o1493q1411p8217l6018o06k7466j6451n7202l5427j6049k0847
12060D535622j5019m2259p1095o4415o31l8073m2979n7153o1024l9824k8753p2266
12048D002131m3278o7644q1009K67j5987m3534l7167j2171m0655n1119k2830J5741
12036C602745M634Q539j933K5223J9196K3894R0999P2628O8771R6793J11353J22688
12024D245530K01595J92272K49253L32535L09967L50727L91566N02424O42432
12015G418301O82468P96661R29060J101312J298318J541123J771424K057854K376778
$$ plain form
12091 8159812 7884307 7589683 7340428 7100692 6820497 6534832 6351990 6167938 6004482
12082 6004482 5856228 5697433 5590010 5517416 5414901 5319743 5190472 5107358 5079162 5014506
12072 5014506 4966809 4905316 4823905 4745688 4709670 4709064 4681598 4665147 4607945 4572518 4556469 4535622
12060 4535622 4520603 4478344 4407249 4342834 4342203 4304130 4261151 4203998 4142974 4103150 4074397 4002131
12048 4002131 3958853 3891209 3810200 3810467 3794480 3750946 3713779 3701608 3660953 3609834 3587004 3602745
12036 3602745 3607379 3615918 3613985 3639208 3658404 3682298 3773297 3845925 3914696 4011489 4122842 4245530
12024 4245530 4447125 4639397 4888650 5221185 5531152 5881879 6273445 6775869 7418301
12015 7418301 8100769 8897430 9826490 10927802 12226120 13767243 15538667 17596521 19973299
12006A9973299K710916K979179L211631L316577L248539K971287K526286J942369
11998D2880083J345410P51919J82380k62961o27074j089084j580000k005533k488374
11989C7106766k824441l037207l027642k813235k542344k253042j963244j707563
11981A6938048j476747j263647j115258r86239r16791p83913p08916o48018n77147
11972H461372n11128m73191l85591l69722l71032l13450k96135k64072k47750
11963E229301k21224k33648j87213j43178j75845j61660j25261j47719j47672
11954C685881j43140j25607j29401q7469o4799p3987j25386j27847n4091m5658
11944B708496o9876q4179p8550n7048k7571n5944r4147l5431k9786q8834o7852
$$ plain form
12006 19973299 22684215 25663394 28875025 32191602 35440141 38411428 40937714 42880083
11998 42880083 44225493 44977412 45159792 44896831 44269757 43180673 41600673 39595140 37106766
11989 37106766 34282325 31245118 28217476 25404241 22861897 20608855 18645611 16938048
11981 16938048 15461301 14197654 13082396 12096157 11179366 10395453 9686537 9038519 8461372
11972 8461372 7950244 7477053 7091462 6721740 6350708 6037258 5741123 5477051 5229301
11963 5229301 5008077 4774429 4587216 4444038 4268193 4106533 3981272 3833553 3685881
11954 3685881 3542741 3417134 3287733 3200264 3135465 3061478 2936092 2808245 2754154 2708496
11944 2708496 2638620 2554441 2475891 2418843 2391272 2335328 2241181 2205750 2175964 2087130 2019278
11933B019278l3233p834m7697m1885l4924n1647o3527p2926n8617p104m2069n7573
11921A500242m059l0586r646n6968k9346m6588m4740j7561l5667n3710k6360o618
11909A138393k9079o9858O814j594j2072J8817p091j8554j0299n0991p2897m0735
11897H50854J3447R005J7949j1863N171k0139J4008l528N31n1936n5177q237o266
11884G53819k2377n190K8276l4338j7583j8405j4230K4104l4575k3853j5169k6509
11872E93970J9648k3351k5387m6608j1905O037J6396N0040k0804o4030j8216O099
11860D81889Q96K6833k9028j1787j7304k9552n7308l8307M39l102K1842K9019
11848C74530J8373j5557j7942O810N72O472j8397j2506J9811j4343k9192p056
$$ plain form
11933 2019278 1986045 1978211 1930514 1888629 1853705 1802058 1738531 1665605 1606988 1599884 1557815 1500242
11921 1500242 1496183 1465597 1455951 1398983 1369637 1323049 1278309 1260748 1225081 1171371 1145011 1138393
11909 1138393 1109314 1039456 1046270 1044676 1032604 1051421 1044330 1025776 1015477 964486 891589 850854
11897 850854 864301 873306 891255 879392 884563 864424 878432 874904 875435 823499 768322 760085 753819
11884 753819 731442 726252 754528 720190 702607 684202 669972 694076 659501 635648 620479 593970
11872 593970 613618 590267 564880 518272 506367 512404 528800 578840 558036 494006 475790 481889
11860 481889 482785 509618 480590 468803 451499 421947 364639 326332 326771 323669 345511 374530
11848 374530 392903 377346 359404 366214 366786 373258 354861 342355 362166 347823 318631 311575
11836C11575K5373k957J7617M1458K2383j926k2668p0106l5086j1912J2590m155
11824B82186R860L324J3754m614j6588r070K7491J0326l1631K431J4642l7455
11812B64656n2134K2286j7225J9559K3794p05j0727j6922J4281K2016J2634K5671
11800C07184k3035k3301K8890l488k9444o298M1467K7505r682j2577j3833q168
11788B75220q685K8836J9807k5248j6535j4122K8085K2294J5434J118l633J1176
11776C33747k169l8032O3202L3252R128L1271j6588J2439Q1240L6574R356K9279
11764E82699K4269O2089O8504Q2999P9881Q4067J18532J16536J11801R9999J00324
11753A531700R0532J11572R9373O4921M4511K4469P738O1101L9246o5402m4194
$$ plain form
11836 311575 336948 333991 351608 393066 415449 413523 390855 320749 285663 273751 286341 282186
11824 282186 292046 295370 309124 304510 287922 278852 306343 316669 285038 287469 302111 264656
11812 264656 212522 234808 217583 237142 260936 260231 249504 232582 246863 268879 281513 307184
11800 307184 284149 260848 289738 286250 256806 250508 291975 319480 309798 297221 283388 275220
11788 275220 266535 295371 315178 289930 273395 259273 287358 309652 325086 326204 322571 333747
11776 333747 331578 293546 356748 390000 399128 430399 413811 426250 507490 544064 553420 582699
11764 582699 606968 669057 737561 820560 900441 984508 1103040 1219576 1331377 1431376 1531700
11753 1531700 1622232 1733804 1833177 1898098 1942609 1967078 1974816 2035917 2075163 2009761 1965567
11742A965567o9054n6768m6738q4546j17526o3984p1689j10663r4516r4342r5240
11731A060501p1235o4961p9310n0875m4356n1612n3790m0788j5208k8761k8351
11720E31254k7387j7399k0812k7891l3937k8606j5496j1904k6106k1038l4723
11709B65955k8183O257J9270j2625j6491K9034R316l8661q614r204n102j4473
11697A96479J3482L5559J4188k365k7228R99j072o327K830j1960J2419o052k9062
11684A91890k6217l1098L2674M1207j8262m1902j9081K2621J4814N3584J4999
11673B35229K4258n742k0414n173M3713K2247l984K6252J5348L7617Q6352P0260
11661E25963P6588M2629r466j6865m0229l3512R766J2369l0103j9820l6816p3233
$$ plain form
11742 1965567 1896513 1839745 1793007 1708461 1590935 1526951 1455262 1344599 1250083 1155741 1060501
11731 1060501 989266 924305 844995 794120 749764 698152 644362 603574 588366 559605 531254
11720 531254 503867 486468 465656 437765 403828 375222 359726 347822 321716 300678 265955
11709 265955 237772 244029 263299 250674 234183 263217 272533 233872 225258 216054 210952 196479
11697 196479 209961 245520 259708 257343 230115 231114 230042 223715 226545 214585 227004 220952 191890
11684 191890 165673 134575 167249 208456 190194 148292 129211 151832 166646 220230 235229
11673 235229 259487 253745 233331 228158 271871 294118 290134 316386 331734 369351 455703 525963
11661 525963 602551 645180 635714 618849 578620 545108 554874 567243 537140 517320 480504 407271
11649D07271p5103n7923n9645l4570N496j66j8471j6319K4849M1006l6473k5666
11637A54286O487J5106j5380j8605J146l619j4474l138K1266M129j9049L6507
11625A64662L0416j4248k4455k0478k6567j1877K3372J6359p584R371r804j2582
11613A16585l2579R985L9329N458j6659j9439J0420j449n991j7219l3004J6978
11601G2415P981J1788q300L308j8238R18L872L8693J2211j2241L722k1494l315
11588I1320l736k8392j5273P392K7369K1189l569N046j1288k928k2068n2112J184
11575A4134K5228K8368j3312j2081K4432l8790M628K5443L85K7169J7992j6362
11563H7234m545l7582J5009r429L562J8818k1779m4309J5388r407J7084M9299
$$ plain form
11649 407271 332168 274245 214600 180030 185526 185360 166889 150570 175419 216425 179952 154286
11637 154286 160773 175879 160499 141894 143040 139421 124947 121809 143075 147204 128155 164662
11625 164662 195078 180830 156375 135897 109330 97453 120825 137184 129600 138971 129167 116585
11613 116585 84006 93991 133320 138778 122119 102680 113100 111651 105660 88441 55437 72415
11601 72415 80396 92184 83884 87192 68954 69872 73744 112437 124648 112407 116129 94635 91320
11588 91320 87584 59192 43919 51311 78680 99869 96300 101346 90058 87130 65062 12950 14134
11575 14134 39362 67730 54418 42337 66769 27979 32607 58050 58435 85604 103596 87234
11563 87234 82689 45107 60116 50687 54249 73067 51288 6979 22367 12960 30044 79343
11551G9343M1766k373q490l7385m147O357K911n962K418k2619K606q983k1572
11538B3870J8452K7696L805k3018K511K875L1997K8685k8753j9278k1839K345
11526D9348K9431J0986k6928l2847L9293L3244o123k0862J7424K0074r690l1101
11514G2249m9197j5078r511N3144L8949q497j3244J1500p020j4845j5560k3358
11502A9532K1475R9393l194l0812j3736j604j2147J2541j3451p454K5482J0102
11490A06127J363o233K8677k1955l238l609j197j5507K038j6435k5853R854Q904
11477F2936k6460l9945k4701J4039k330K496L1779k3449L317J6724p633j3665
11465f892J563N5535q795k7482N622K2111j6887k2025O6979N3774k2208j1784
$$ plain form
11551 79343 121109 118736 110246 72861 68714 75071 77982 72020 74438 51819 54425 45442 23870
11538 23870 42322 70018 73823 50805 53316 56191 88188 116873 88120 68842 47003 49348
11526 49348 78779 89765 62837 29990 69283 102527 96404 75542 92966 113040 103350 72249
11514 72249 23052 7974 -1537 51607 90556 82059 68815 80315 73295 58450 42890 19532
11502 19532 41007 140400 137206 106394 92658 91054 78907 91448 77997 70543 96025 106127
11490 106127 107490 101257 129934 107979 104741 101132 99935 84428 86466 70031 44178 54032 62936
11477 62936 36476 -3469 -28170 -14131 -16461 -13965 17814 -5635 -2318 14406 6773 -6892
11465 -6892 -5329 50206 41411 13929 19551 41662 24775 2750 69729 123503 101295 89511
11453H9511j1978l3297k0101M2177K2222n034j2997o541L1178j0536m1328n1434
11441h158K8986k104l4206Q021N7548J6530J3542q387O657j0698K0099L4656j3932
11428A08554j525J813N382k0772k3484l3820l2235m161k061m556K4059K9839P547
11415E4580j4315K5275N2142m2500m4734J41J9267j4455k7239q955K1130N0832
11403G1169P192k7583J7748J4806m5016k0265j3317K8288K9353j7990r358J2275
11391D7302j4223n7475o11L4884M0794J1858J1191J3136l6139k8130j4282l7642
11379b9337K058L3923K4709P453m7524K4078j4804J0387K5677k4497k4643N262
11367g258k2258k4421J6583L4529J8401L3358k4628l815n12Q396J662k1759J7075
$$ plain form
11453 89511 77533 44236 24135 66312 88534 83500 70503 63962 95140 84604 43276 -8158
11441 -8158 20828 18724 -15482 -7461 50087 66617 80159 71772 78429 67731 87830 122486 108554
11428 108554 107029 108842 114224 93452 69968 36148 3913 -248 -2309 -6865 17194 47033 54580
11415 54580 40265 65540 117682 75182 30448 30589 49856 35401 8162 -793 20337 71169
11403 71169 78361 50778 68526 83332 38316 18051 4734 33022 62375 44385 35027 47302
11391 47302 33079 -24396 -25007 9877 50671 62529 73720 86856 50717 22587 8305 -29337
11379 -29337 -27279 6644 31353 38806 -8718 15360 556 10943 36620 12123 -12520 -7258
11367 -7258 -29516 -53937 -37354 -2825 15576 48934 24306 20491 19979 28375 30037 8278 25353
11354B5353J5427K5226p981l7606L1750J1477M6752J6824k5433p6802k0727L1135
11342C5395L8698m1883k1206J8459J2485M275L315l780K2969K0303J0628j3624
11330H6034r929j9227m3172j0294L053n075m943M0616L2696M376R298q152k2954
11317E2327j5007N220J3040N167l9005j3487j384K8541N671j9863l2121N385K4591
11304A9075L4908J988P383J5349N22m9254k6958M9933M2296J9601m0232o3226
11292A1385o146j85j0480k0214O588L8805K0209r193j3490J7177K461N699k1340
11279B1276J2987q640m897k4279K397J4343j3200j1729o304L8889L8364k9185
11267C0022R009L5476l2715m0188K7049J3606j8097J4742o862j8024o714j6218
$$ plain form
11354 25353 40780 66006 58025 20419 52169 63646 110398 127222 101789 24987 4260 35395
11342 35395 74093 32210 11004 29463 41948 46223 49538 45758 68727 89030 99658 86034
11330 86034 76105 56878 13706 3412 6465 1390 -3553 37063 69759 74135 83433 75281 52327
11317 52327 37320 42540 55580 60747 21742 8255 6871 35412 41083 21220 -10901 -5516 19075
11304 19075 53983 55971 63354 78703 79225 29971 3013 52946 95242 114843 74611 11385
11292 11385 5239 5054 -5426 -25640 -19052 19753 39962 30769 17279 34456 36917 42616 21276
11279 21276 34263 25623 20726 -3553 -1156 13187 -13 -11742 -18046 20843 59207 30022
11267 30022 39031 74507 41792 1604 28653 42259 24162 38904 32042 14018 7304 -8914
11255h914K9545K0174m4891m0911j9716K5942K3763K3973q201Q413j5738j4317
11243b0878n021L8279M0591m4460N505J8906p998k129L3410k4316j1512j6978
11231C399K5080J5765l8048l4237Q122k468R761K3609K8640M238j2804j8778j2728
11218d49k2845J7661L1887J2616L70J3256J514j774k5282l1844k0373n796P236
11205b3823m181k743J9079K0238p429K292j7537L8717J0512l0189m106M3922Q574
11192E3326J9328J3070m3030m0182m202J0483p91q743O509K0938J6680L6636J6513
11179I6535l8353m4668r600N676K0740j6057K1535L3944L0754l4197l6978J0648
11167C9979k251p645m69K583l660L163J9188R310l336j9516k1638k2365Q509l111
$$ plain form
11255 -8914 20631 40805 -4086 -44997 -64713 -38771 -15008 8965 764 9177 -6561 -20878
11243 -20878 -25899 12380 52971 8511 14016 32922 24924 22795 56205 31889 20377 3399
11231 3399 28479 44244 6196 -28041 -19919 -22387 -12626 10983 39623 43861 31057 12279 -449
11218 -449 -23294 -5633 26254 38870 39240 52496 54010 52236 26954 -4890 -25263 -31059 -23823
11205 -23823 -28004 -30747 -11668 8570 1141 3433 -14104 24613 35125 4936 830 44752 53326
11192 53326 72654 85724 42694 2512 -1690 8793 8002 -741 5768 26706 43386 80022 96535
11179 96535 58182 13514 3914 9590 30330 14273 35808 69752 100506 66309 29331 39979
11167 39979 37728 30083 29614 32197 28537 31700 50888 60198 56862 37346 15708 -6657 1852 -1259
11153a259K1447l831j1545L553j0698R882l645j3250M952J5745J9728J403k0802
11140A1680j3180N14J9650J4151R620J5674L957l9669k2724J9292M2112L208l3262
11127C1023m1730j3564L8161J0898j096j610j7008k344m562J6675K3448J6919
11115E5210k3847Q103K2274J6605p849Q368l438q359K0000l0134k0545l129k6551
11102F708l945M1511O789l412K4299l764k4058o435m2057J9301K7100J8291J1875
11089G2203L664j9002k4305k0969j6361n338j0274K7917N7195K5483m1212l9388
11077I613m8m0650k3456R427K1091L1784j747K4511K1614j5039j9271J0175K4951
11064E2955j2209K7416j2084m268J9719j1114j413K3452M220M4889J421l8720
$$ plain form
11153 -1259 20188 16357 4812 8365 -2333 7549 3904 -9346 -4394 11351 31079 32482 11680
11140 11680 -1500 -986 18664 32815 42435 58109 62066 22397 -327 18965 61077 64285 31023
11127 31023 -10707 -24271 13890 24788 23692 22082 5074 2730 -1832 14843 38291 55210
11115 55210 31363 39466 61740 78345 70496 78864 75426 67067 87067 56933 36388 33259 6708
11102 6708 2763 44274 51063 47651 71950 68186 44128 37693 -4364 14937 42037 60328 72203
11089 72203 75867 56865 32560 11591 -4770 -10108 -20382 7535 64730 90213 49001 9613
11077 9613 9565 -31085 -54541 -45114 -24023 7761 6014 30525 52139 37100 17829 28004 52955
11064 52955 40746 68162 56078 51810 71529 60415 59002 82454 86674 131563 132984 94264
11052I4264J1266L3984J9617l4063m0230k8509O7719K4596J0924L3597k4297m0427
11040A28441J4320K9486J6086J0729l702J1707K2613p433l529o11k4224J5401
11028B09284N6376M2644k9355k4367K372k5425K5773k4022k7343J451j7524l581
11016A86283K131m4004l2934M168K6797O2381j0633k6279m8081j3979O679R772
11004A22301j431j7364j8905k243N6059J0051j1404n0174l1585j4142K5229j1934
10992E4458j0887J2760K0046k272r76j0888j3215k0991m0864R952K764q445L8522
10979B9964K024O382K640k9203r69L3508l6800N324L1150j9531o0357j5743K2657
10966b8954L4068k416j0839K4831R366O888M162m008j4523P51K5212K2849k312
$$ plain form
11052 94264 105530 139514 159131 125068 84838 56329 124048 148644 159568 193165 168868 128441
11040 128441 142761 172247 188333 199062 195360 207067 229680 222247 218718 218107 193883 209284
11028 209284 265660 308304 278949 254582 256954 231529 257302 233280 205937 207388 189864 186283
11016 186283 188414 144410 111476 115644 142441 204822 194189 167910 119829 105850 112529 122301
11004 122301 120870 103506 84601 82358 138417 148468 137064 86890 55305 41163 66392 54458
10992 54458 43571 56331 76377 74105 73129 62241 49026 28035 -12829 -2877 -113 -8558 29964
10979 29964 31988 38370 41010 11807 10838 44346 7546 12870 44020 24489 -35868 -51611 -28954
10966 -28954 5114 2698 -8141 16690 26056 32944 37106 33098 18575 19326 44538 67387 65075
10953F5075q468n255J923q515n485J1427J9881L038k3928n8658Q995p149j6773
10940b3892n201J5344J7446J9811m362L6520K5094j0108K1484j3638l1875o104
10928D0519k3331m329J8341J4967m8258p1940L1543J6051P816K1440m683R151
10916G287K1270N918K6914o693k4146J375Q313j5740J7619j0387O71K1126K299
10903E5826j4274q297k2454k0536R449K1521K7536N741j7351j8452n509M699K1795
10890C9694J9237P146l815j5301M05k6426m6835M7073M9177J1122J2564J2773
10878A06814j5487J0506j3639m3232m542P25n095l0510K2351J7800j9745l1752
10866e806o53j3816J7394J8762J4497M3925K541k4442P664R089j5346l1132j2908
$$ plain form
10953 65075 56607 51352 53275 44760 39275 50702 70583 73621 49693 -8965 30 -7119 -23892
10940 -23892 -29093 -13749 3697 23508 19146 55666 80760 70652 92136 78498 46623 40519
10928 40519 17188 12859 31200 46167 -2091 -74031 -42488 -26437 -18621 2819 -1864 7287
10916 7287 28557 34475 61389 54696 30550 31925 40238 24498 42117 31730 32401 53527 55826
10903 55826 41552 33255 10801 -9735 -286 21235 48771 54512 37161 18709 13200 17899 39694
10890 39694 58931 66077 62262 46961 47366 20940 -25895 21178 70355 81477 94041 106814
10878 106814 91327 101833 88194 44962 40420 41145 36050 5540 27891 45691 25946 -5806
10866 -5806 -6459 -20275 -2881 15881 30378 74303 76844 52402 60066 69155 53809 22677 9769
10853I769L8990O147q335k2713K353N6436L8361R649j1340P183m4874l8443J1798
10840E4981L0516k5552l104L019m604M85J6304J4540k0807L0974L8198j3623k0687
10827A00640j9579l285l2697l1161L4157o141p591O1969J4318l7216m6713l5051
10815h350J749n498j7423R56P115K5167J8317J2421l4098j5761j4994K584M6516
10802A8701K3799J2292J144j9613j3128k2277J4784K7878R996o081m595J6798
10790E9698N205J6878J5734j2026m7155k1580K3003J9386j5200k4801P139J3942
10778D0223q311K3340K0980k8725j5244R78O074p214l1126K881J378J6470L4821
10765E6525K6173j7540K7658o800m3245p075J2829J7787j6102R755J3259L0079
$$ plain form
10853 9769 48759 54906 46571 23858 26211 82647 121008 130657 119317 126500 81626 43183 54981
10840 54981 85497 59945 56841 59860 55256 55741 72045 86585 65778 96752 134950 121327 100640
10827 100640 81061 77776 45079 13918 48075 41934 34343 96312 110630 73414 26701 -8350
10815 -8350 -6601 -12099 -29522 -28566 -21451 3716 22033 34454 356 -15405 -30399 -27815 18701
10802 18701 42500 54792 55936 36323 23195 918 15702 43580 53576 47495 42900 59698
10790 59698 64903 81781 97515 85489 38334 16754 39757 59143 43943 19142 26281 40223
10778 40223 31912 55252 76232 47507 32263 33241 39315 32101 975 3856 5234 21704 56525
10765 56525 82698 65158 92816 86016 42771 35696 48525 66312 50210 59965 73224 103303
10753A03303M138j1418M2884K8629p419J4246J0044L4382J5049m1840m1162o399
10741A44437j5835K3077o174L0984K7231J6279L1658k1547k8554M886j3066m77
10729A92899M4514J3230r130J9066Q037q719l0839K6084N7391k1450m416L3167
10717C19834N4021Q190n08m0624k6703J5654L7753L9064K8245j9882L9014O2476
10705E16534J01029R9239J37769J62743J08033J08035J24070P2037M0341J6360
10695A486190N5987J2389l8554k2413j5055k4019j13023j27339j15682r4986q9291
10684I14204j23924o8544k7620n3400r756p685l6909j3599m4923l5305k2576J3165
10672D83128N137j6943k4031K1858K5348M0951L6283o219J5026N1190J6012k550
$$ plain form
10753 103303 107441 96023 138907 167536 160117 174363 184407 218789 233838 191998 150836 144437
10741 144437 128602 151679 145505 176489 203720 219999 251657 230110 201556 206442 193376 192899
10729 192899 237413 250643 241513 260579 268616 259897 229058 255142 312533 291083 286667 319834
10717 319834 373855 382045 381537 340913 314210 329864 367617 406681 434926 415044 454058 516534
10705 516534 617563 716802 854571 1017314 1125347 1233382 1357452 1429489 1469830 1486190
10695 1486190 1542177 1554566 1516012 1493599 1478544 1454525 1341502 1214163 1098481 1003495 914204
10684 914204 790280 721736 694116 640716 630960 623275 586366 572767 527844 492539 469963 483128
10672 483128 488265 471322 447291 469149 494497 535448 571731 565512 580538 631728 647740 645190
10660F45190P756K3374K1902M0369K6788o109J9429M3117N0291N1315O8517N0203
10648A042142O7313M2244N1901J14026R0679Q0105J20162J44300J48936K15613
10638B117421J85912K29866L12793L54584M43925N40074O09223P76762Q46440
10629F417000R10789R56845J042038J028576R66559R19731R77465J054547J102122
10620A5375672J270231J433733J472257J538821J448713J374235J216042J017469
10612B6147173R20188R30674J018504J078553J256797J449487J540737J456257
10604C5798370J155271Q12038M76938J55315J5547j20053j01528m8565J12437
10595C8255770J61908P1630k29955o50457r74852j158538j287355j249217j176933
$$ plain form
10660 645190 652946 676320 698222 738591 765379 759270 778699 821816 872107 923422 991939 1042142
10648 1042142 1109455 1151699 1203600 1317626 1408305 1488410 1608572 1752872 1901808 2117421
10638 2117421 2303333 2533199 2845992 3200576 3644501 4184575 4793798 5570560 6417000
10629 6417000 7327789 8284634 9326672 10355248 11321807 12241538 13219003 14273550 15375672
10620 15375672 16645903 18079636 19551893 21090714 22539427 23913662 25129704 26147173
10612 26147173 27067361 27998035 29016539 30095092 31351889 32801376 34342113 35798370
10604 35798370 36953641 37765679 38242617 38397932 38413479 38293426 38191898 38143333 38255770
10595 38255770 38417678 38489308 38259353 37608896 36634044 35475506 34188151 32938934 31762001
10586C1762001j073189j027933q93493q32167q52821j036410j270000j495361
10578B3280627j485460j420679j296538j222928j104926j025772j037734r80099
10570A3706491r50761r90195j048703j041471r16159q53315o94369n61895n09769
10561F139854m30181l87617l57528l17765k70895k59441k09638k22701j97873
10552C486215j25454j59175j79429j20548j35669r8431r2140j08047j32901j00203
10542B234218o2493m6878r9724q6979p1914m8603k7883m2954n3517m4205o9289
10531A579779m4173j08857p8254q533j7245n3224n5845p739k9983l3053j1218
10520A131655j5963p0816p0876k9348l0125L794j21o1698m9625M969P661r137
$$ plain form
10586 31762001 30688812 29660879 28767386 27935219 27082398 26045988 24775988 23280627
10578 23280627 21795167 20374488 19077950 17855022 16750096 15724324 14686590 13706491
10570 13706491 12755730 11765535 10716832 9675361 8759202 7905887 7211518 6649623 6139854
10561 6139854 5709673 5322056 4964528 4646763 4375868 4116427 3906789 3684088 3486215
10552 3486215 3360761 3201586 3022157 2901609 2765940 2667509 2575369 2467322 2334421 2234218
10542 2234218 2171725 2124847 2025123 1938144 1866230 1817627 1789744 1746790 1693273 1649068 1579779
10531 1579779 1535606 1426749 1348495 1339962 1322717 1269493 1213648 1205909 1175926 1142873 1131655
10520 1131655 1115692 1044876 974000 944652 914527 918321 918200 856502 806877 811846 819507 810370
10508H10370r969K8140l0388o6060o20q573l4328j6223j0823k3776l1070r651
10496E97029j9765J1287J4021M294J3336m1811K5637R707j4216j4270L5712k0205
10484F00756n5108J5616R083j1938j2341m1263k9600l5625M720L455Q272j5761
10472D40266n1973m0303K549k113Q185K029l0297k7904Q516r244k0256j5365j0198
10459B53892j7640N2229o057m6303j3503n2165J749K6058l166J2901j2695k9241
10447A66059j1475K7782m1807m316j333J155J1616J081O682O3l4168j2830N6648
10434A65157L4586j8053j6378l0303j4042j7688k4324L7179L7838K870k3579q127
10422A25136l2885Q969L5585R326j7281k6319J2538j4530J4005K0131O024m0195
$$ plain form
10508 810370 800401 828541 798153 732093 731473 722900 688572 672349 661526 637750 606680 597029
10496 597029 577264 588551 602572 606866 620202 578391 604028 613735 599519 585249 620961 600756
10484 600756 545648 561264 570347 558409 546068 504805 475205 439580 444300 447755 456027 440266
10472 440266 388293 347990 350539 348426 356611 358640 328343 300439 308955 299711 279455 264090 253892
10459 253892 236252 288481 282424 236121 222618 170453 172202 198260 195094 207995 195300 166059
10447 166059 154584 182366 140559 136243 134910 136065 147681 148762 155444 155507 121339 108509 165157
10434 165157 199743 181690 165312 135009 120967 103279 78955 116134 153972 156842 133263 125136
10422 125136 92251 101220 136805 146131 128850 102531 115069 100539 114544 134675 140699 100504
10410A00504j8487L9319l845k9847l9630K0638K8994K1641J871l0984r621Q64
10398H1417o306M056J7910j9161L4828K7248n4443k0502k7654k4036O485L6502
10386E6344O271r329k348J1015J3142j7543J6335K8746L5107j7026j2945q560
10374I9209K721j9414Q101J3719l5273m760J8453j0744k3543L1560n283L49L0652
10361A05747K4813k2304l126Q384m976O648K4026l903n4038n034J8768q375j3625
10348G3005R718L0906j8919l1035j0331M0081n064k8994j143l5320L2210K2131
10336G7245Q474k315K2212M1789n1692j1287o116k3401L1987K8264J5322M112
10324A34594n1359n734k0615n1172P605k3558l6814M536j5695L4194L1246m2461
$$ plain form
10410 100504 82017 121336 117491 87644 48014 68652 97646 119287 121158 90174 80553 81417
10398 81417 75111 79167 97077 77916 112744 139992 85549 65047 37393 13357 19842 56344
10386 56344 62615 53286 50938 61953 75095 57552 73887 102633 137740 120714 107769 99209
10374 99209 101930 82516 90617 104336 69063 64303 82756 72012 48469 80029 74746 75095 105747
10361 105747 130560 108256 105130 113514 108538 115186 139212 135309 81271 76237 95005 86630 73005
10348 73005 82723 113629 94710 63675 53344 93425 88361 59367 58224 22904 55114 77245
10336 77245 85719 83404 105616 147405 95713 84426 78310 54909 86896 115160 130482 134594
10324 134594 83235 77501 56886 5714 13319 -10239 -47053 -42517 -58212 -24018 7228 -35233
10312c5233J401L4344M1037r644m165n508k3496l6079m849K9128j1512k2960J4078
10299c3458J0613n3962J9858K8143J3128K2495K7514L5816L750l0135L226O38
10287D7626m2501M106M613q875p820k3013J0699J2754k3209j3634J9178Q594j503
10274a2985M9362k937n7357k1730K6102J1322M7272k174q750K6461j0054l6362
10262H170j9880N503N1182O738l783j154L261L813k6408k3930j2047k8601L0729
10249f407J8938J5657L0946Q386j1753l7354m5284r587J1708J1637K5373J6449
10237B8709K35K4056K5885M478k949k6806K5402o47l2670n7006j9477J6009J0836
10224c945k4601K1538j6715k1855L6362O0564k5605r787J507k2852j3073L6514
$$ plain form
10312 -35233 -33832 512 41549 31905 27740 22232 -1264 -37343 -42192 -13064 -24576 -47536 -33458
10299 -33458 -22845 -76807 -56949 -28806 -15678 6817 34331 70147 73897 43762 46988 47626
10287 47626 5125 9231 13844 4969 -2851 -25864 -15165 -2411 -25620 -39254 -20076 -11482 -12985
10274 -12985 36377 33440 -23917 -45647 -19545 -8223 39049 36875 28125 54586 44532 8170
10262 8170 -11710 -6207 44975 51713 47930 46776 50037 53850 27442 3512 -8535 -37136 -6407
10249 -6407 12531 28188 59134 67520 55767 18413 -26871 -36458 -24750 -13113 12260 28709
10237 28709 28944 53000 78885 83363 80414 53608 79010 78363 45693 -11313 -30790 -14781 -3945
10224 -3945 -28546 -7008 -23723 -45578 -9216 51348 25743 15956 17463 -5389 -18462 18052
10212A8052L2378Q225j395k2824J3676J2741j3846M927l0224m157K3502k0674
10200B0381j2098J1924k6764j4422K8506K517l762j9150m891J733O52J961K9671
10187A6258N7846q833m2613j9346L7256K6362q544J750M4750O8115L1878N895
10175B10774j2603j0937j641L0497j0614k6762M6513q88K8654j1456m6798j0572
10163A84167L1090q043L7719N3670k8131o195m9956l5937j0864J7179J4234l2322
10151A66611K022M886J3801J225J3928l0747j1124o628j800j9404J2641J2434
10139A57845j2216o1538m8475K5867K3023k2037l1933K0719L2783l9553n2814
10128h329K78j7719J0853K9778K1510O411J5899r147l0456j5231J0535l2745k0973
$$ plain form
10212 18052 50430 58655 57260 34436 48112 60853 47007 51934 21710 17553 41055 20381
10200 20381 8283 20207 -6557 -20979 7527 10044 6282 -12868 -17759 -16026 -15374 -13413 16258
10187 16258 74104 65271 22658 3312 40568 66930 58386 60136 104886 173001 204879 210774
10175 210774 198171 187234 185593 216090 205476 178714 225227 224339 252993 241537 194739 184167
10163 184167 215257 207214 244933 298603 270472 264277 214321 178384 167520 184699 198933 166611
10151 166611 168633 173519 187320 188545 202473 171726 160602 153974 152174 132770 145411 157845
10139 157845 145629 84091 35616 61483 84506 62469 30536 51255 84038 44485 -8329
10128 -8329 -8051 -25770 -14917 14861 36371 42782 58681 49534 19078 3847 14382 -18363 -39336
10115c9336J7939N738q364K7645J2499l0591J482M1702j9965m2673K6144K4102
10103A6322J7071l2258j9793j5357M939M1345M9604J9781n199m7114k2593j4532
10091g784k1852L3370L9105N013k1290l5749J0800l305J0183l7431l637M1900
10079I323K6487k4351K3K276J0248M450n413L236k9762R071K4326o417L650J403
10065B8550j655Q313J0956j755K5726j9335K0550k7819l5909L58Q038l868J4323
10052B6473k9115k2641n818P370j9912J2175J3604K1570K8785l109l3864j1632
10040a6114j8815K8952L7379J5599j7306l1068k939j7624J63J5602J5479N4585
10028F3893l1718k9643l8593L537J3930L3399R045J2831L145q655R881K5410l1066
$$ plain form
10115 -39336 -21397 -15659 -24023 3622 16121 -14470 -12988 28714 8749 -33924 -7780 16322
10103 16322 33393 1135 -18658 -34015 -29076 12269 61873 81654 76455 29341 6748 -7784
10091 -7784 -29636 3734 42839 47852 26562 -9187 1613 -1692 8491 -28940 -32577 9323
10079 9323 35810 11459 11482 13758 24006 28456 23043 26279 -3483 5588 29914 23497 27147 28550
10065 28550 26895 35208 46164 44409 70135 50800 71350 43531 7622 7980 16018 12150 26473
10052 26473 -2642 -25283 -31101 -23731 -43643 -31468 -17864 3706 32491 29382 -4482 -16114
10040 -16114 -34929 -5977 31402 47001 29695 -1373 -4312 -21936 -21773 -6171 9308 63893
10028 63893 32175 2532 -36061 -32524 -18594 14805 23850 36681 39826 31171 41052 66462 35396
10015C5396l7638n912l257k7532P390M2528Q812K2525Q839q053m7956O893J4917
10002A6952K2362k117l10J609p576j267j3148j3572m37j0511k1914L84N313K1075
9988c157Q708q161n99J6386M1322k6441k8744J4096O594J0111q781Q303j6145
9975A3492m3128p3364j025K7917N2763k270j8862J8291J887M810R661Q824L1277
9962C0273J6607J5234K553j1943o578J1580j0933O483N2002l6994m01K5507j5216
9949G8174k6089j8501K1179j8330M5451j4186o193M0521J1536j9020J0411L3149
9937A38102K8414k7535M4617M6978L5360J07890J11141J32263J49864J98996K73283
9926A239373K86771K60657K73231J59798P8032O285R332j6914r2562m4370Q323
$$ plain form
10015 35396 -2242 -8154 -11411 -38943 -31553 10975 19787 42312 51151 43098 -4858 2035 16952
10002 16952 39314 37197 36887 38496 30920 29653 16505 2933 2496 -8015 -29929 -29545 -24232 -3157
9988 -3157 5551 -2610 -3209 13177 54499 28058 -686 13410 20004 30115 21334 29637 13492
9975 13492 -29636 -103000 -104025 -76108 -23345 -25615 -44477 -26186 -24299 -19489 -9828 -1004 30273
9962 30273 46880 62114 64667 52724 46146 57726 46793 53276 105278 68284 67883 93390 78174
9949 78174 52085 33584 54763 36433 81884 67698 61505 102026 113562 94542 104953 138102
9937 138102 166516 138981 183598 230576 265936 373826 484967 617230 767094 966090 1239373
9926 1239373 1526144 1786801 2060032 2219830 2297862 2304147 2313479 2296565 2204003 2159633 2167956
9915B167956j8064r4669k86375l58063k62628j81943j40101j12636r8171n9351
9905E55955k4678j8456o3158p1861n6662k9526M307k4131n7164j0599j4103k4962
9893A64962J8821l2360l0800n10L1969r260l0262J7304k3066m1953J4979l186
9881G6638p150J8113k5459o153k5994n893J52M3841K8650J0479K3179K3256o2675
9868I0984l2089K3634j5032J749J2005r303n3894j9047J0320K8313Q065j2761
9856C2944M452j0605j325N1613L9365l3729j3550P329j2556k4048L1334j4285
9844E6939j3553J0631j5279j3259J7211n97k8130m6340j612k0012J2908L7683
9832c410L3512L4669j9392j6537K8009j1093l790j8750j5992N671p650k1101j6957
$$ plain form
9915 2167956 2149892 2055223 1768848 1410785 1148157 966214 826113 713477 615306 555955
9905 555955 531277 512821 449663 377802 321140 291614 295921 271790 214626 204027 189924 164962
9893 164962 183783 151423 120623 120113 152082 142822 112560 129864 106798 64845 79824 76638
9881 76638 69488 87601 62142 55989 29995 24102 24254 68095 96745 107224 130403 153659 90984
9868 90984 58895 82529 67497 69246 81251 71948 18054 -993 9327 37640 45705 32944
9856 32944 37396 26791 25466 77079 116444 82715 69165 76494 63938 39890 71224 56939
9844 56939 43386 54017 38738 25479 42690 42093 13963 -32377 -33989 -54001 -41093 -3410
9832 -3410 30102 64771 45379 28842 56851 45758 41968 23218 7226 12897 5247 -15854 -32811
9819c2811K6507K4255p910l003J1766q716p002K0304j7448l1491m740j457k398
9806c4144L2534M115l2658K7150M380P267L3468o051L472q174k3077k706J7561
9793B3137K821j5392J0706Q145m777j9814k6976J3745k859m778l4478j2872K386
9780f1006L0761O260q603j8158L4366j5567j6825M1005O2541K5221j0972m1618
9768B7405j8296m3520j948l70N3189Q021K5896j0635m9187n166O67j1354J0691
9755a4607L0547j2628l1828R630J872O975N06L101j0589j6427o42M6332r976j1250
9741h984L153O909J1547J835P778K0589m2971k6734k8N730M1842L907l5871j545
9727a2843O90Q594j4746K022L1680Q712j3930K685l2549l1525m274P762O9139
$$ plain form
9819 -32811 -6304 17951 10041 7038 18804 10088 3086 23390 5942 -25549 -30289 -31746 -34144
9806 -34144 -1610 2505 -30153 -3003 1377 8644 42112 36061 39533 31359 8282 5576 23137
9793 23137 25958 10566 21272 29417 24640 4826 -22150 -8405 -11264 -16042 -50520 -63392 -61006
9780 -61006 -30245 -23985 -32588 -50746 -16380 -31947 -48772 -7767 54774 79995 69023 27405
9768 27405 9109 -34411 -36359 -36729 16460 24481 50377 39742 -9445 -14611 -13944 -25298 -14607
9755 -14607 15940 3312 -28516 -18886 -17014 -10039 -9533 -6432 -17021 -33448 -34090 12242 2266 -8984
9741 -8984 -5831 1078 12625 14460 22238 42827 -144 -26878 -26906 -21176 20666 24573 -11298 -12843
9727 -12843 -12153 -3559 -18305 -16283 15397 24109 10179 12864 -19685 -51210 -55484 -47722 21417
9714B1417M1922m3744m4292P155K6440J8237K0051q454P896k0945k6685L0313
9702B9311J0681l1788j1669J7183k2792j2343Q532K5006k1305J5249K6389J876
9690C4330k8277q038J7657L1696J776j4315j2137R646j9133l2806j121J421J3362
9677e939L807L1042k473L953K3648k4536m6402N642O6283K7519k0550m866l885
9664E3243J7983q923l9533J2656M1935n425o389m0966K3204R104R575k1814l8441
9651F209p34J1182J7094l258m1085K460M6736J4811j8523m1884O842R675P311
9638A6836L1266j76q1418o7520L8732M4819K5782K5743j0629k664K4857m6294
9626f66k0787k2343J2541K6248R955o160k6849K3514J997l759L0700Q251Q777
$$ plain form
9714 21417 63339 19595 -24697 -17542 8898 27135 47186 38732 46628 25683 -1002 29311
9702 29311 39992 8204 -3465 13718 -9074 -21417 -12885 12121 -9184 6065 32454 34330
9690 34330 6053 -1985 15672 47368 49144 34829 22692 32338 13205 -19601 -20722 -19301 -5939
9677 -5939 -2132 28910 26437 30390 54038 29502 -16900 -11258 55025 82544 61994 57128 53243
9664 53243 71226 62303 22770 35426 77361 71936 65547 24581 47785 56889 66464 44650 6209
9651 6209 5475 16657 33751 30493 -10592 -8132 38604 53415 34892 -6992 -150 9525 16836
9638 16836 48102 47926 -33492 -101012 -62280 -17461 8321 34064 23435 20771 45628 -666
9626 -666 -21453 -43796 -31255 -5007 4948 -1212 -28061 -4547 -2550 -6309 24391 32642 41419
9613D1419j0870k2162p955N549K8339K3535o3430m4958J1299L2585K0704N137
9601A9192r752j8272j3597p258N910J5311j1793l9263l3021J8626M3850L8300
9589H233K9501l1662l0460N9365L747j2948l959K483l2434K756l501J366P0r31
9575h374N69l391j186P374j869k2702j9470J1292J7397q061L78N368J9396m1333
9561d4612l828L1182L7312l105j4015l050q081k3836j9610M176k7733P576L1544
9548c6080K2566l780J0635K0039j2372n090k9901k7777q412r183J1584L447m892
9535f9216l5825j7910O0931K7572l333N269Q558n3515j8815L7630N2784L4065
9523B8195j2927k0980k8713J3116M6836K1944K8484j1058l2028l4194j7943j370
$$ plain form
9613 41419 30549 8387 432 5981 34320 57855 -5575 -50533 -39234 -6649 14055 19192
9601 19192 9440 -8832 -22429 -29687 -23777 -8466 -20259 -59522 -92543 -73917 -30067 8233
9589 8233 37734 6072 -24388 34977 38724 25776 21817 24300 -8134 -5378 -8879 -7513 -7443 -8374
9575 -8374 -7805 -11196 -12382 -5008 -6877 -29579 -49049 -37757 -20360 -28421 -28043 -22675 -3279 -44612
9561 -44612 -48440 -17258 20054 16949 2934 -116 -8197 -32033 -51643 -47467 -75200 -67624 -36080
9548 -36080 -13514 -17294 -6659 13380 1008 -4082 -33983 -61760 -70172 -79355 -67771 -64324 -69216
9535 -69216 -105041 -122951 -62020 -34448 -37781 -32512 -23954 -77469 -96284 -58654 -5870 28195
9523 28195 15268 -5712 -34425 -21309 25527 47471 75955 64897 32869 -1325 -19268 -20638
9511b0638L6413l9170j8229J6582L446j5733J2483o981L1794J5515l5455r990
9499b9963j1606J3583M60N042J5579j3552m0416J7689L0147j624K298Q620K9352
9486B5609J6684k1435j7860J1726k4248l054L1957j0734k0602K3943J4026l246
9474B2766R76k1551j8437o290o366J0954j8844Q92K7014J1173M949k0323k8619
9461d1706l713k0705K7421L4802k4276q191j1320K1035j9048l1018o540L1455
9449e1804L8656K2897k6523k79p17o693j2307K953n344k1478l7846m318J6807
9436h5996K0937L3967J6404J2556K3850J4358P280k2198l51P492k5874Q245L6794
9423D7464Q730K1802K4580l7358k4847r124L310K7157k2106l3284J3668q55j5041
$$ plain form
9511 -20638 15775 -23395 -41624 -25042 -21596 -37329 -24846 -31827 -33 15482 -19973 -29963
9499 -29963 -41569 -27986 -27526 -22484 -6905 -20457 -60873 -43184 -13037 -14661 -12363 -3743 25609
9486 25609 42293 20858 2998 14724 -9524 -12578 19379 8645 -11957 11986 26012 22766
9474 22766 23742 2191 -16246 -22536 -28902 -17948 -36792 -35900 -8886 2287 7236 -13087 -41706
9461 -41706 -45419 -66124 -38703 -3901 -28177 -36368 -47688 -26653 -45701 -76719 -83259 -51804
9449 -51804 -13148 9749 -16774 -17053 -17770 -24463 -36770 -33817 -39161 -60639 -98485 -102803 -85996
9436 -85996 -65059 -31092 -14688 -2132 21718 36076 43356 21158 20807 28299 2425 10670 47464
9423 47464 56194 77996 102576 65218 40371 31247 34557 61714 39608 6324 19992 19137 4096
9410D096K5106n897j1501K0974J8586O566l2775k8386O706j3737J8898l2129J3499
9397i994L8324k8445l2048j9317j0382j2696M7846O7882J4304j5081j4481p415
9385A8497j912l304j4386p3864j9855J0228M6836N4603k0117O458k6740K06J8370
9372d980j619J8493K1677L1567l8333l5071m994j1474j0186r728j2249j7922L8706
9359c6113p865k1053r107k5021k9276N6854P6172J5016k1866L4235l8230l6049
9347d2303J2551J3237L2708L4465N1865j7626m9253l6507M777J4596P13m437j3074
9334A712k5208j8957j5897r176J0O560J6905k816L0862Q6533K1470k3521R713
9321G8190K2030j7612l6719m6343O174L2597j7222k9700o43O215k0453L0441M229
$$ plain form
9410 4096 29202 23305 11804 32778 51364 57930 25155 -3231 3475 -10262 8636 -23493 -9994
9397 -9994 28330 -115 -32163 -51480 -61862 -74558 -26712 41170 55474 40393 25912 18497
9385 18497 16585 13281 -1105 -74969 -94824 -84596 -37760 16843 -3274 3184 -23556 -23350 -4980
9372 -4980 -6599 11894 33571 65138 26805 -8266 -13260 -24734 -34920 -44648 -56897 -74819 -36113
9359 -36113 -43978 -65031 -74138 -99159 -128435 -71581 4591 19607 -2259 31976 -6254 -42303
9347 -42303 -29752 -16515 16193 50658 102523 84897 35644 -863 3914 18510 19223 14786 1712
9334 1712 -23496 -42453 -58350 -67526 -67516 -60956 -44051 -46867 -16005 70528 91998 68477 78190
9321 78190 100220 82608 45889 -454 5720 38317 21095 -8605 -9248 -3033 -23486 6955 11184
9308A1184m0903k465K1664k549k9982l6390J5218O8943L3234j5813r721n008k690
9295D722M4696q045q861J6458j4802l2026k362J794j8288l2632K1340L3970L9186
9282D5150l4309l0756o161M780L2891J0590j6974J7776l5064l0522O515K230L628
9269c0226l107k3706J9100L1395k2821j6022l987K2190K4118k9832K423j7196
9257d7671K4915R94R813M4472M53j6632M7493o107r323J1531M637k3980k6512
9244A4083k3948K3128j0864o899j1126Q232L2394J4859n1874n9911L057M4165
9232b4704J4232j5652M027M0849k7052n5374K565k727n934K7697J2223J5728Q0065
9219F5943n292l4077M46l9280k6272L681M0956j8087j472R962J9590L4962j651
$$ plain form
9308 11184 -29719 -32184 -10520 -13069 -43051 -79441 -64223 4720 37954 22141 12420 7412 4722
9295 4722 49418 41373 32512 48970 34168 2142 -220 1574 -16714 -49346 -28006 5964 45150
9282 45150 10841 -19915 -26076 -21296 11595 22185 5211 22987 -12077 -42599 -36084 -33854 -30226
9269 -30226 -33333 -57039 -37939 -6544 -29365 -45387 -49374 -27184 -3066 -32898 -30475 -47671
9257 -47671 -22756 -21762 -11949 32523 32976 16344 63837 57730 48407 59938 64575 40595 14083
9244 14083 -9865 13263 2399 -4500 -15626 -7394 25000 39859 -12015 -71926 -68869 -24704
9232 -24704 -10472 -26124 -22097 18752 -8300 -63674 -61109 -63836 -69770 -42073 -29850 -14122 65943
9219 65943 60651 26574 27020 -12260 -38532 -34851 6105 -11982 -13454 -3492 16098 51060 49409
9206D9409R76J393l4976k4337P66j064l6736j3311k7019P619J4215N8554J3523
9193I012l49m0861k0756M5221J1745l4941K7967O073l0557K7847r164k8251P628
9180b9386J5646q192j4839k7778k8225K3578n957p5706l0603O4877J6241J7788
9168h2556N9485M175j3632N160m182K5878J7556m1411q4K3017J037P597J4165
9155A6205o655m1420n6438P185J8718K3635k243j2806Q834L7766O325J5172j5916
9142a638k1669m007j1278L262j3509l248l0709k6989r600K677M2304L6562K5377
9129a2465O267N905j9567j5792L7308L978k2252K3632K1883K749j1058j9496K4918
9116B6010k1462j4020N427M989L5025Q341k313K4304J6905j9170j3695J1687O314
$$ plain form
9206 49409 50385 51778 16802 -7535 -6769 -7833 -44569 -57880 -84899 -77280 -63065 -4511 9012
9193 9012 8663 -32198 -52954 -7733 4012 -30929 -2962 3111 -27446 401 -8763 -37014 -29386
9180 -29386 -13740 -21932 -36771 -64549 -92774 -69196 -75153 -150859 -181462 -116585 -100344 -82556
9168 -82556 -23071 -18896 -32528 -27368 -31550 -5672 11884 -29527 -29611 -6594 -5557 2040 16205
9155 16205 9550 -31870 -88308 -81123 -62405 -38770 -41013 -53819 -44985 -7219 -894 14278 -1638
9142 -1638 -23307 -27314 -38592 -35330 -48839 -52087 -82796 -109785 -119385 -116708 -74404 -37842 -12465
9129 -12465 -6198 -293 -19860 -35652 1656 5634 -16618 7014 28897 31646 20588 1092 26010
9116 26010 4548 -9472 -4045 944 35969 44310 41997 66301 83206 64036 50341 62028 68342
9103F8342K6365J8156o2251P041J3063K537k8848l9743J9057Q548l280j6109m607
9090H271J1792q246k7792k957j0606l7498J1530R231J1493K8166K3921J4640j0227
9077B1718l8306J2047J7225j3056k6793Q109k602k0126J9960O402m7548J5343
9065d7627K2076K9116j0396K9517J9780l0167k0884J6779Q834K1935J5840j7769
9053C7034j9060K1937J7345k885j6830K405j2813J1336R306m1088J95P986M2882
9040E7750j4916k9420k2926l0910j2568j7248N8143L0910j0996l3129l576j7400
9028d6286O591J319k9405K2461L8172J9867M343K3727k2932m074R864K382k7073
9015a044l2175K6607L7413j2934j3977P209j1888n2328Q71J0638K3484Q689K2502
$$ plain form
9103 68342 94707 112863 50612 57653 70716 73253 44405 4662 23719 32267 28987 12878 8271
9090 8271 20063 11817 -15975 -18932 -29538 -67036 -55506 -46275 -34782 -6616 17305 31945 21718
9077 21718 -16588 -4541 12684 -372 -27165 -19056 -21658 -41784 -21824 -15422 -62970 -47627
9065 -47627 -25551 3565 -6831 22686 42466 12299 -8585 8194 17028 38963 54803 37034
9053 37034 17974 39911 57256 54371 37541 39946 27133 38469 47775 6687 6882 14868 57750
9040 57750 42834 13414 -9512 -40422 -52990 -70238 -12095 18815 7819 -25310 -28886 -46286
9028 -46286 -39695 -38376 -67781 -45320 -7148 12719 17062 40789 17857 13783 23647 26029 -1044
9015 -1044 -33219 -6612 30801 17867 3890 11099 -789 -53117 -52246 -41608 -18124 -9435 13067
9002A3067l5640j755J1334k7370k7755j5339L6479N015J2181M8996K4253o881
8990C6585j9673K3079K3113m213j5159J065j2607j6020K2j858j0789J2049M680
8977B0274l7062l1137K3937M6570J5841j4361L7417k1368l1268K8322L0793j2602
8965E5356R213K520j2924J9621K7544m9427m549j5520k1101j2644Q476k9959j6176
8952c9570K3664K5843N033l5981R123K3246j1190k1646k174K9771K0858k5346
8940A631q617j0911m32Q452O832O569N760N606l9830m6135Q127L2240L3226K1123
8926B3641K4825O554j3283q370P109k5049j153j6609l4715J8538l477M624J864
8913a5501K0156L0817M872j6837j6806J4588p755J5390k4659j8377L2166J4596
$$ plain form
9002 13067 -22573 -24328 -12994 -40364 -68119 -83458 -46979 -41964 -29783 19213 43466 36585
8990 36585 16912 39991 63104 58891 43732 44797 32190 16170 16192 14334 3545 15594 20274
8977 20274 -16788 -47925 -23988 22582 38423 24062 61479 40111 8843 37165 67958 55356
8965 55356 64569 67089 54165 73786 101330 51903 47354 31834 10733 -1911 6565 -23394 -39570
8952 -39570 -15906 9937 14970 -21011 -11888 11358 168 -21478 -23652 6119 26977 1631
8940 1631 -6986 -17897 -18329 -9877 -3045 3524 9284 14890 -24940 -71075 -62948 -30708 2518 23641
8926 23641 48466 55020 41737 33367 40476 15427 14274 -2335 -37050 -18512 -21989 -17365 -15501
8913 -15501 4655 35472 40344 23507 6701 21289 13534 28924 4265 -14112 18054 32650
8901C2650J0472l3045k1281P572k1079l8797n766K4947K5481P835K3443p841l669
8888I22J3705J1841n5948k0921J7923J4612R386M833J9228n555m00k0514j9860
8875c0748J3846k512l3860l036J6355n135J2103K1812R998K711j9410P664K8652
8862A8440p246o765k7316N115Q166n241J5617J4135m0013m0003J0483O8509N9104
8849G2985l9662j1691J4749n1712k3806l9508K653O3424L1974j0341J4023j1063
8837A2025j0173P907m037k2611k433K0719j6620j1817J2385L5001j5137k2388
8825a7179J127J9044n706l516j4533J9705K5050n2664k2268K3019J7342j1336
8813b1915j3397j2644J340K7516k218L9642K447k4497P735J4055j117j6917J2305
$$ plain form
8901 32650 43122 10077 -11204 -3632 -24711 -63508 -69274 -44327 -18846 -11011 12432 4591 922
8888 922 14627 26468 -29480 -50401 -32478 -17866 -8480 -3647 15581 10026 9626 -10888 -30748
8875 -30748 -16902 -19414 -53274 -56310 -39955 -45090 -32987 -11175 -1177 1534 -17876 -10212 18440
8862 18440 11194 4429 -22887 -17772 -9606 -14847 770 14905 -25108 -65111 -54628 13881 72985
8849 72985 33323 21632 36381 -15331 -39137 -78645 -75992 -12568 19406 9065 23088 12025
8837 12025 1852 9759 5722 -16889 -19322 1397 -15223 -27040 -14655 20346 5209 -17179
8825 -17179 -16052 2992 -2714 -6230 -20763 -1058 23992 -28672 -50940 -27921 -10579 -21915
8813 -21915 -35312 -47956 -46616 -19100 -21318 18324 20771 -3726 4009 18064 16947 30 12335
8800A2335l5515j4483L7486K9954o170k6894l7815l0780J2016K1503J0880K8648
8788A165N4853q377k06k8877l837j5752J2086j431n2014l4337J2161P5772L4415
8775D5621m080j1888p151j8512n923M194k1921J658J5881j3219k4754L7377O5237
8762F2520j3198l8619n0441k5184M0447M3812k682l837n0290n1641q082L0102
8750f7093q217K2870L823l8972j4516L321K7610K8744K9181L3691k402k3698k0856
8737b6514k2890L0155K4590J1154J650R557p128K2301K7140J6130K897j3784n0030
8724B5228l1514O685K8423O605k2461l8484j3620J7673k1106j9774K2322k795
8712d2818n23j1771L0897K8432k0340l129k4336l5078K618L3610R327j2810K5400
$$ plain form
8800 12335 -23180 -37663 -177 29777 23607 -3287 -41102 -71882 -59866 -38363 -27483 1165
8788 1165 56018 47641 47435 18558 14721 -1031 11055 9624 -42390 -76727 -64566 11206 45621
8775 45621 41541 29653 22502 3990 -1933 2261 -19660 -18002 -2121 -15340 -40094 -2717 62520
8762 62520 49322 10703 -39738 -64922 -24475 19337 16655 12818 -37472 -89113 -97195 -67093
8750 -67093 -75310 -52440 -48617 -87589 -102105 -98784 -71174 -42430 -13249 20442 18040 -5658 -26514
8737 -26514 -49404 -19249 5341 16495 18145 27702 20574 42875 70015 86145 89042 75258 25228
8724 25228 -6286 399 28822 35427 12966 -25518 -39138 -21465 -42571 -62345 -40023 -42818
8712 -42818 -43341 -55112 -24215 4217 -16123 -19252 -43588 -78666 -76048 -42438 -33111 -45921 -20521
8699b0521K4057j426K8726M7926k8245n6676n2819L8740L3924k7435j1146K3235
8687a660J8238M506J886J2490l4008k361K5811j4242q891K7364P648N6790r423
8674H4148l2742K517j4525k2846P50k420k1468j5484O175Q472p079p192k4069
8661d5763M0289j7732n2272R739L6638M335k6815k4975J8161M2248K4847N513
8649A4213J5298j4585Q998k1193N042J766K6809L938N169j1003k6665k1973J3577
8636f09O417L911K116J345j6425q118N1791j3692k7512J5721j5521l5149J1105
8623b4620j3630j7468j4396j8118j334K034L9590L5489q261o20k870J9537K2388
8610A7721K5058l0719K939J8928J9362o013l6707l1402j8306K401M1322K5856
$$ plain form
8699 -20521 3536 2110 30836 78762 50517 -6159 -58978 -20238 13686 -13749 -24895 -1660
8687 -1660 16578 21084 22970 35460 1452 -909 24902 10660 1769 29133 36781 93571 84148
8674 84148 51406 53923 39398 16552 17302 14882 -6586 -22070 -15895 -7423 -14502 -21694 -45763
8661 -45763 -5474 -23206 -75478 -65739 -29101 -24766 -51581 -76556 -58395 -16147 8700 14213
8649 14213 29511 14926 23924 2731 7773 9539 36348 40286 45455 34452 7787 -14186 -609
8636 -609 5808 9719 11835 13180 -3245 -11363 40428 26736 -776 14945 -576 -35725 -24620
8623 -24620 -38250 -55718 -70114 -88232 -89566 -87532 -47942 -12453 -20714 -21334 -24204 -4667 17721
8610 17721 42779 12060 14999 33927 53289 47276 10569 -20833 -39139 -36738 4584 30440
8598C0440O458k1020L6181K4707m4689l151K0554q513l1685j2482j5336J0925
8586g611M2644J8399K996K7109j5982m2054l2597k5917n013J9136L4076J1120
8574B6306j5109j1677K2302M313K696k938J2494L602Q301j034Q351j3836j1361
8561C2410j5877L3197J5563l3006j009O533j3617o5650j9651O1883n674J9301
8549A4403J8477R37J87m3141k5565K810L6030J4732k3792k0444r70N482M9667
8536B8813K7184J0616n747l4716n0391N4922j4122m4200l4421P293K2841J9777
8524a2151M4723K3214L69K6853m500n4411l4821L411J9986K9564j688n70k0054
8511A9925j3346k6300k9471K372j7036k1262J3996J9167K2403J6750J1805j6072
$$ plain form
8598 30440 36898 15878 52059 76766 32077 28926 49480 40967 9282 -3200 -18536 -7611
8586 -7611 35033 53432 56428 83537 67555 25501 -7096 -33013 -38026 -18890 15186 26306
8574 26306 11197 -480 21822 26135 28831 25893 38387 41989 50290 49256 57607 43771 32410
8561 32410 16533 49730 65293 32287 31278 37811 24194 -41456 -61107 776 -4898 14403
8549 14403 32880 33817 34004 -9137 -34702 -31892 4138 18870 -4922 -25366 -26336 -20854 28813
8536 28813 55997 66613 60866 26150 -24241 30681 16559 -27641 -62062 -54769 -31928 -12151
8524 -12151 32572 55786 56155 83008 78508 24097 -10724 -7313 12673 42237 40549 39979 19925
8511 19925 6579 -19721 -49192 -46820 -63856 -85118 -71122 -51955 -29552 -12802 -997 -17069
8499a7069K597J1725l1329M016O32k0512O779M8879r854L7387q426l1915j6908
8486b3998j7230K3923K2462j1390j7476k0320r472J0585K1692J9447K4253Q249
8474C0725q453j2669K9086J2268l2560p70K8017K4976j7663o465k4244m986l7152
8461a9890M194M1526K8985M578q953k8219k2020j711J6990R864K0760K4435Q025
8448G8564j1603j2107j7549j0458J2956k2372K7189K3641J3982l4301j4961q950
8436B4031k816n724O051J8357m82l6463o614L1109J9012k2302o23Q313n5883m0492
8422f4526o98L5095K4973k2475p149k5417O172N0023J2966l3388N886m494J0619
8409a2413p597j4382l4079M955J7324j272M8457M0288k9532o2504L0224K8327
$$ plain form
8499 -17069 -14472 -2747 -34076 -30060 -29428 -49940 -43161 5718 -4136 33251 24825 -7090 -23998
8486 -23998 -41228 -17305 5157 -6233 -23709 -44029 -53501 -42916 -21224 -1777 22476 30725
8474 30725 22272 9603 38689 50957 18397 17627 45644 70620 52957 46492 22248 17262 -19890
8461 -19890 -15696 25830 54815 59393 50440 22221 201 -1510 15480 25344 46104 70539 78564
8448 78564 66961 54854 37305 26847 39803 17431 44620 68261 82243 47942 32981 24031
8436 24031 21215 15491 21542 39899 39417 2954 -3660 27449 46461 24159 23536 31849 -24034 -64526
8422 -64526 -65224 -30129 -5156 -27631 -34780 -60197 -54025 -4002 8964 -24424 -18538 -23032 -12413
8409 -12413 -20010 -34392 -68471 -63516 -46192 -47464 993 41281 11749 -50755 -20531 7796
8397G796j1316l5284l0848O266K3449O625K2258K6145K1881K074n9096j4853J6492
8384a8411J6415K5532K627R83O87m125J2204L1435P519j4479l272o589j9484k6081
8370D961k8235m787m384k6405m1231R661N8004J3648K5201j7574p6969J5681M4360
8357b8069L1750P570K6279L2740j907q183l4515j5607J640o275l6892K3029j1537
8344a9977J0316J942J9551P253m0637l9028J2296M4118O680o0734j4184Q647K0212
8331d3545P292j7049N060K2402N3508J578o6117j5760K1920j8603Q384J1662K2032
8318g236k5470J0066j1996J9012K7932k0888l2654J6985k2643M753K918R406L0999
8305A184L4835O676k2012n211j5400O993K7069j578k6840K195m1649m9789L687
$$ plain form
8397 7796 -3520 -38804 -69652 -63386 -39937 -33312 -11054 15091 36972 39046 -20050 -34903 -18411
8384 -18411 -1996 23536 26163 27146 27833 23708 35912 67347 74866 60387 57115 50526 31042 4961
8370 4961 -23274 -28061 -32445 -58850 -100081 -90420 -32416 -18768 6433 -11141 -88110 -72429 -28069
8357 -28069 3681 11251 37530 70270 68363 60180 25665 10058 11698 5423 -31469 -8440 -19977
8344 -19977 -9661 -7719 11832 19085 -21552 -60580 -48284 -4166 2514 -58220 -72404 -63757 -43545
8331 -43545 -36253 -53302 -48242 -25840 27668 29246 -36871 -52631 -30711 -49314 -40930 -29268 -7236
8318 -7236 -32706 -22640 -34636 -15624 12308 -8580 -41234 -24249 -46892 -42139 -39221 -29815 1184
8305 1184 36019 42695 20683 15472 72 7065 34134 32556 5716 7911 -33738 -83527 -79840
8292g9840M3384L8676l7332m156Q537K483n793M501P612j6553J966j2001N531
8279d2985R303K0965n142k299k7703M032k14J2073J6931p599j9260J1672o909
8266c7135K4605K0581p031N994P31J4838J1072j4697k638l5318m3154k0595K356
8253h0391j0315O239M077m580K0657K3491O116j0209l44k1585k453P683K3092
8240c8522L0309k5746l4572r930K1294K9427l3251k3111L1566K9170l1225P104
8228d7487J7761J8005J9735r119J1860k1698O338k100m759j033J0666q853j7987
8215b8671L0815j0450j5948J5231M2669O38n237l2288m43j954M881K4701l292
8202B0652j2215l9465k2472K5469L1047K994j7159k0453j6602O005M8536o482
$$ plain form
8292 -79840 -36456 2220 -35112 -39268 -30731 -28248 -34041 -29540 -21928 -38481 -36515 -48516 -42985
8279 -42985 -33682 -12717 -17859 -20158 -47861 -43829 -44043 -31970 -15039 -22638 -41898 -30226 -37135
8266 -37135 -12530 8051 1020 7014 7745 22583 33655 18958 16320 -18998 -62152 -82747 -80391
8253 -80391 -90706 -84467 -80390 -84970 -64313 -40822 -34706 -44915 -45259 -66844 -69297 -61614 -38522
8240 -38522 -8213 -33959 -68531 -78461 -57167 -27740 -60991 -84102 -52536 -23366 -54591 -47487
8228 -47487 -29726 -11721 8014 -1105 10755 -10943 -4605 -6705 -11464 -12497 -1831 -10684 -28671
8215 -28671 2144 -8306 -24254 -9023 33646 34284 29047 -3241 -3684 -5638 -757 23944 20652
8202 20652 8437 -31028 -53500 -28031 3016 6010 -11149 -31602 -48204 -42199 6337 -145
8190a45j5522J9084l2156m4441K6100K2876M335P560J9341J770m0934L0546K6987
8177B5401K9685k7489l1715m0058K34K0153j244n442J2604j3065l8787o529k1312
8164i7564J6649J4366L6172K5613J7438J8256L2618k5459k1831m585k0391j7823
8152b6541l8067k8918K1148N3752L1555j1013j4275J084Q147K561k0918j6238
8140c7723O216K9849L2584j4991n954J88r049k2108J505j262J9957J6345j3733
8127A824K6314o0763m1203K1185M8344j5373j0327J7583M6566J9982o5803k5951
8115c7622j4377j4876j8641J4966Q3L115J7567N4811k9954l2707R463N0782P559
8102A0169j6708L1208J3960l1754L6367n518J2720l1731p0207n5202j1676K3612
$$ plain form
8190 -145 -15667 3417 -28739 -73180 -47080 -24204 -19869 -12309 7032 8802 -32132 -1586 25401
8177 25401 55086 27597 -4118 -44176 -43942 -23789 -25033 -30475 -17871 -30936 -69723 -76252 -97564
8164 -97564 -80915 -66549 -30377 -4764 12674 30930 63548 38089 16258 11673 -8718 -26541
8152 -26541 -64608 -93526 -72378 -18626 12929 1916 -12359 -11275 -3128 -567 -21485 -37723
8140 -37723 -31507 -1658 30926 15935 9981 10169 1120 -20988 -19483 -20745 -788 15557 1824
8127 1824 28138 -32625 -73828 -52643 -4299 -19672 -29999 -12416 34150 54132 -11671 -37622
8115 -37622 -51999 -66875 -85516 -70550 -70467 -67352 -49785 5026 -24928 -57635 -48172 2610 10169
8102 10169 -6539 24669 38629 6875 43242 37724 50444 18713 -51494 -106696 -118372 -94760
8090i4760L3832J5420m125k84j0206K498Q700J497J5006L551j225l1303P5341
8077A3942O2265j564j1372r509k2203k3887j7417j4821M994K730K7639j7253R628
8064C172J9260J2818K1016J5348P985k1410j3496l5012m4202n247j8582L2192
8052b6158K2880J884J4442K546J0082n400m3254l5316j6695J6566J4076k1414
8040f5761k9489M3671J4227p952K9145J2363k218L1826j5219j8455J2136j6545
8028a2271P350L5124m0088m8147k1522K4918L7742p863n155K6420J0652j3088
8016e928j3237k593Q924l219m041K5698K7434O590j570Q635j4126K0678J3769
8003F7014m2187m023j2760N90O938L663l642L4676K4862l3741m1188L8383L0941
$$ plain form
8090 -94760 -60928 -45508 -49633 -49917 -60123 -57625 -48925 -47428 -32422 -28871 -30096 -61399 13942
8077 13942 76207 74643 63271 53762 31559 7672 -9745 -24566 -19572 -16842 10797 -6456 3172
8064 3172 22432 35250 56266 71614 79599 58189 44693 9681 -34521 -39768 -58350 -26158
8052 -26158 -3278 -1394 13048 15594 25676 20276 -22978 -58294 -74989 -58423 -44347 -65761
8040 -65761 -95250 -51579 -37352 -45304 -16159 -3796 -6014 25812 10593 -7862 4274 -12271
8028 -12271 -4921 30203 -9885 -58032 -79554 -54636 -16894 -24757 -29912 -3492 7160 -5928
8016 -5928 -19165 -21758 -12834 -16053 -20094 5604 33038 39628 38058 46693 32567 53245 67014
8003 67014 24827 20804 8044 8634 15572 19235 15593 50269 75131 41390 202 38585 69526
7990F9526J4551O845J193l5476k2395J5905k4334l9447k1002q256K6777l943k6904
7977d6960k1273O5252M6661K1917n9660p5918M6966M0333L9018K4514p244k9850
7965D3756m9517k6232j8837N00R326L7979K641k8273J2635L3149R81o827r345
7952A936K709M864j5220j96o114J8404P043L8049r688j8013o608L810k2642k749
7938d415R769l9783K6868M4098J0341m0561j7515J573J4592L3293R113p528l0924
7925H921j4104M75k3509J5044j193j2885j5463K0676K0947m246q851K8598k6116
7912a1706p848j0248j4864n729M8621N2602m5285n562j619K1550j2422m433M965
7899H022m8445k8259j8314k6599J5375K7724L4303N853K6086k5242k6172r841
$$ plain form
7990 69526 84077 90922 92115 56639 34244 50149 25815 -13632 -34634 -42890 -16113 -20056 -46960
7977 -46960 -68233 -2981 43680 65597 5937 -69981 -23015 17318 56336 80850 73606 43756
7965 43756 -5761 -31993 -50830 -50330 -41004 -3025 -384 -28657 -16022 17127 18108 11281 1936
7952 1936 4645 9509 -5711 -5907 -12021 6383 13426 51475 41787 23774 17166 20976 -1666 -4415
7938 -4415 5354 -34429 -7561 36537 46878 6317 -11198 -9625 4967 38260 47373 39845 8921
7925 8921 -5183 -4708 -28217 -13173 -14366 -27251 -42714 -22038 -1091 -5337 -14188 14410 -11706
7912 -11706 -19554 -29802 -44666 -50395 -1774 50828 5543 -19 -1638 19912 7490 3057 8022
7899 8022 -40423 -68682 -86996 -113595 -98220 -70496 -36193 -30340 -4254 -29496 -55668 -65509
7887f5509M1376M0880K0888j0180j9097O734j3253j5150K1359k4242l0974p853
7875e5021m550k2750N109N8147K8988k6759K1120j8954l3574L25K4405J7881o5173
7862g0806J5687K0442m157K6036M8900l6506m5449Q237L4477K1426j1832m459
7850A996q134l1775l7580j0745j3239L7243J0662j2902j7769O887L7866K8206
7838i284l56j4656j3347K7824O467j2841N040j9216J9810j0219n8505j5657K5108
7825f9832P26O920L3963L6790L0225o045j1747k1175k3630K136M7167j5996l0991
7812b1489j791m1189J9105M6318P424k8451l2693L0376K7022n824j733Q414P106
7799A2595J2230M08j5330j1563j1702j2541J4538L0818K2369j5479j3140j1566
$$ plain form
7887 -65509 -24133 16747 37635 27455 8358 15092 1839 -13311 8048 -16194 -47168 -55021
7875 -55021 -59571 -82321 -77212 -19065 9923 -16836 4284 -14670 -48244 -47919 -23514 -5633 -70806
7862 -70806 -55119 -34677 -38834 -12798 36102 -404 -45853 -37616 -3139 18287 6455 1996
7850 1996 -6138 -37913 -75493 -86238 -99477 -62234 -51572 -64474 -82243 -75356 -37490 -9284
7838 -9284 -9640 -24296 -37643 -9819 -3352 -16193 -11153 -30369 -10559 -20778 -79283 -94940 -69832
7825 -69832 -69106 -62186 -28223 8567 38792 32747 21000 -175 -23805 -21669 25498 9502 -21489
7812 -21489 -23280 -64469 -45364 954 8378 -20073 -52766 -22390 4632 -1192 -2925 5489 12595
7799 12595 24825 25233 9903 -1660 -13362 -25903 -11365 19453 41822 26343 13203 1637
7787A637n2383p211K0862j0362o789K7464J9683M509L0106j9883n5993J8399J6222
7774a3739J4530L2519J1327k5689k7565l8985l3426k2982j9179K2023J9169o60
7762h2657L2337K5220K9044Q143k3153R217r519j4260K9681j0659K1183J7722
7750C2299J7721k8861L2367K2449R730k8060N904L052l5591j4125J0812K6333
7738E4030o170l7497m8090K7045J4396j2485O478K2615J7843K427k8974l5599
7726b3981J7359j0480J0015K7857J477l441M288K873l531J0737L6786k554k3748
7713D3657m5865k7206P479l35J093O082j4580J4221K0460J2505q098l8102K0247
7700h442j715o456K9634J9502N779k229k0669m337K0706L5666j3907j8726k0391
$$ plain form
7787 1637 -50746 -57957 -37095 -47457 -54246 -26782 -7099 -2590 27516 7633 -48360 -29961 -13739
7774 -13739 791 33310 44637 18948 -8617 -47602 -81028 -104010 -123189 -101166 -81997 -82657
7762 -82657 -50320 -25100 3944 12087 -11066 -1849 -11368 -25628 4053 -6606 14577 32299
7750 32299 50020 21159 53526 75975 85705 57645 63549 66601 31010 16885 27697 54030
7738 54030 47860 10363 -37727 -10682 3714 -8771 -2293 20322 38165 40592 11618 -23981
7726 -23981 -6622 -17102 -7087 20770 22247 18806 23094 25967 22436 33173 69959 67405 43657
7713 43657 -2208 -29414 -21935 -22270 -21177 -15095 -29675 -15454 5006 17511 9413 -28689 -8442
7700 -8442 -10157 -16613 13021 32523 38302 36073 15404 11067 31773 67439 53532 34806 14415
7687A4415K3095Q634k0758l6201Q635l480L4528K7425N798m3302n0849J8296L7668
7674B3904M460N629L4999J9255n4416k8540R40k1115m957r123j78J7347K0473
7661H678R814l6765k922l4154N1645O8883J4923n2167k2596l1163j9989L4010
7649a1803L7512J1796K2089n911M572N656n26k1158k8781k0050J025Q837j2019
7636h761J6965J8481P975J5426j323j4354p5399l1431L0284J3834k3442J871l163
7623e3037N192K2914M0749o103l6083j0168r620K9401L3485l72L172J4720K7551
7610F1801p907r318l6377k2862k8797N839L9902m174J9805J2852O084J3402j8684
7597C1566n2822l4021J3239L2071j2229K6803K2052J2876K482k5074M9700J560
$$ plain form
7687 14415 37510 46144 25386 -10815 -2180 -5660 28868 56293 62091 18789 -32060 -13764 23904
7674 23904 28364 33993 68992 88247 33831 5291 6231 -14884 -19841 -28964 -29142 -11795 8678
7661 8678 18492 -18273 -21195 -55349 -3704 65179 80102 27935 5339 -25824 -45813 -11803
7649 -11803 25709 37505 59594 53683 58255 63911 63385 42227 13446 -6604 -5579 3258 -8761
7636 -8761 8204 26685 34660 50086 48763 34409 -40990 -72421 -42137 -28303 -51745 -49874 -53037
7623 -53037 -47845 -24931 15818 9715 -26368 -36536 -46156 -16755 16730 16358 19530 34250 61801
7610 61801 53894 44576 8199 -14663 -43460 -37621 2281 -1893 17912 30764 36848 50250 31566
7597 31566 -21256 -55277 -42038 -9967 -22196 4607 26659 39535 42017 16943 66643 68203
7585F8203m4932j3682M6231L4072J579k2693m0889k9737m26o372J6533M537j8595
7572f171j0787K8312J8764K6996j410J321j6240j5113k6929j8208m78K0005j2404
7559a2342J7575j2278l0522q698R123P72O5535J1796l7465l6294j3662L1560M8923
7546C4023k204k2635N549J5538J525m287k5595O884K6420k4107q322p34q319K6552
7532B0288k7304j8893m800L7350M4991j5321L82L2498K0382M703m5965l5121p808
7519E382O76l4303l9387p194L2388l593j6804p127L8039K2235k386j2784J3082
7506a1776J3701M027j5333j5239P200K1313r445J3202J5383l7681n9245N817N622
7493f2454K6998J3504J9631J7761K4329l798K0604k2252m6801k8077K5858J1597
$$ plain form
7585 68203 23271 9589 55820 89892 91471 68778 27889 -1848 -2274 -8646 7887 12424 -6171
7572 -6171 -16958 11354 30118 57114 55704 57025 40785 25672 -1257 -19465 -19943 62 -12342
7559 -12342 5233 -7045 -37567 -46265 -37142 -36370 29165 40961 3496 -32798 -46460 -14900 34023
7546 34023 31819 9184 14733 30271 31796 27509 1914 8798 35218 11111 2789 2055 -6264 20288
7532 20288 -7016 -25909 -30709 6641 51632 36311 36693 69191 89573 94276 48311 13190 5382
7519 5382 6058 -28245 -67632 -74826 -42438 -46031 -62835 -69962 -31923 -9688 -12074 -24858 -11776
7506 -11776 1925 5952 -9381 -24620 -17420 3893 -5552 7650 23033 -14648 -73893 -68076 -62454
7493 -62454 -35456 -21952 -2321 15440 39769 35971 56575 34323 -12478 -40555 -14697 -3100
7481c100K5340K2561M839k0382Q142j0802l377P793k9275r947J579K5570k266
7468A6675n960K1931l4527n070k3125j9913K6456q689J3643K0032k754j8802n561
7455b5664M299K6238r589N905N176J0737J4622j9744k5416K5070j168O646j3125
7442C987m9444j0210J3758L225j969P773P641N872K403j7096K6883J7052m2426
7429c2551k9009N297j6812L0493L1591K1996o582k6071m3912k0466K9715M0736
7417a5575K1611N909n320n090O41L096j7026k297J7518m1515m2109J6806j4993
7404g8344P490M4297q356j5977l152m115j4181M4983J7249j5290L2829L1781n263
7391C3951k2663m0521j9229J533L3996j3474R956K2597j9J6747K1730k6782k836
$$ plain form
7481 -3100 22240 44801 49640 29258 37400 26598 23221 31014 1739 -8208 -6629 18941 16675
7468 16675 10715 32646 -1881 -6951 -30076 -49989 -23533 -32222 -18579 1453 -1301 -20103 -25664
7455 -25664 -21365 4873 -4716 1189 6365 17102 31724 11980 -13436 11634 10466 17112 3987
7442 3987 -45457 -55667 -41909 -38684 -40653 -32880 -25239 -19367 -16964 -34060 -7177 9875 -32551
7429 -32551 -61560 -56263 -73075 -42582 -10991 11005 4423 -21648 -65560 -86026 -56311 -15575
7417 -15575 6036 11945 6625 1535 2176 5272 -11754 -14051 3467 -38048 -80157 -63351 -78344
7404 -78344 -70854 -26557 -34913 -50890 -54042 -58157 -72338 -27355 -10106 -25396 7433 39214 33951
7391 33951 11288 -29233 -48462 -46929 -12933 -26407 -16451 6146 6127 22874 44604 17822 14986
7378A4986O585m0990j0027R820L2005J9085J1010k6607l0796j013j088p668l5580
7365f0278m3869L1513L9284J9248J0232L3179J9861J2528k1932m1934j3808K5569
7353I593j609k1028j634P39j1301l003J4288J2664m679o658J6115k3134K6153
7340F506P4157j7982o5602k0794J5204J182O376k0711k8008n725j2365L500L3843
7327c0419J3039j1899J6651K7206K5886j7362j5347k1179M285j4491k2659o894
7315e3183j1127K0200J8357J87j334P262j9646j7850K916l462J0596j7843K618
7302f2309N427J5752m1087k1295O1848M7025L5738j612J7588K901j1195J0000
7290E8781M045o0998m8413J0529j0502J9609P2891N863j1353j269j5489l2767
$$ plain form
7378 14986 21571 -19419 -29446 -19626 12379 31464 42474 15867 -14929 -15942 -17030 -24698 -60278
7365 -60278 -104147 -72634 -33350 -14102 -3870 29309 49170 61698 39766 -2168 -15976 9593
7353 9593 7984 -13044 -14678 -13939 -25240 -28243 -13955 -1291 -5970 -12628 3487 -19647 6506
7340 6506 80663 62681 -2921 -23715 -8511 -7329 -953 -21664 -49672 -55397 -67762 -64262 -30419
7327 -30419 -17380 -29279 -12628 14578 40464 23102 7755 -13424 -9139 -23630 -46289 -53183
7315 -53183 -64310 -44110 -25753 -25566 -26900 -19638 -39284 -57134 -54218 -57680 -47084 -64927 -62309
7302 -62309 -56882 -41130 -82217 -103512 -41664 5361 41099 39487 57075 59976 48781 58781
7290 58781 62826 1828 -46585 -36056 -46558 -26949 45942 51805 40452 39183 23694 -9073
7278i073j6133o921p985L0380M2367J6371m4916j3376J5996J1105k2962L68J9092
7265A4313J6093m269q656k2352J5687j0302l148J0300J9945K490R11J4113J8007
7252F3132l5157l1471K2949j2309k8444l674J4391k471k1278J3004M187l7423
7240e4564L8092K6926j7361J7857J6915j6247j1293j3375n2k9044J6K8719k0325
7227c3736j5255K8020K4045k1815n0171K2244J3977K6968O864l5011M696K0183
7215h991M3490j7461k1882q210J0746j4193m1998k1380L5008R615L037K9220N658
7202B659R905j7172j8007k6106J0999J0944J2052K3129J76j4531r45K6493K0279
7189C9875k6103j3202k069m5706Q813Q567N1927O966k7075k7945j4698j3152J3221
$$ plain form
7278 -9073 -25206 -32127 -40112 -9732 32635 49006 4090 -9286 6710 17815 -5147 -4779 14313
7265 14313 30406 26137 17481 -4871 10816 514 -2634 7666 27611 30101 31012 45125 63132
7252 63132 27975 -3496 19453 7144 -21300 -24974 -10583 -13054 -34332 -21328 -17141 -54564
7240 -54564 -16472 10454 -6907 10950 27865 11618 325 -13050 -13102 -42146 -42130 -13411 -33736
7227 -33736 -48991 -20971 3074 -18741 -68912 -46668 -32691 -5723 1141 -33870 -29174 -8991
7215 -8991 34499 17038 -4844 -13054 -2308 -16501 -58499 -79879 -44871 -35256 -32219 -2999 2659
7202 2659 12564 -4608 -22615 -48721 -37722 -26778 -14726 8403 8579 -5952 -6897 19596 39875
7189 39875 13772 570 -1499 -47205 -38392 -29825 22102 29068 1993 -25952 -40650 -53802 -40581
7176d0581j8528J4633L4152J5627n790J2212q896o169j4679J9841P1489J1529
7164H4840l8260k6327j6974J7047k7754k0298J5132O2460j6899j3617j6666M298
7152F982L3014K56J209j1170k3201J390J9236j9551Q462p148N490Q383L023J3925
7138D0300p130m6492Q741J5101J7956n0976k2291J3664L500J1003N913l1563K4853
7125a7421K5778j2607l3529k316J9742K294k0367k2081k3119M0715L693j7520
7113e6738O308O538k683k049L2697P164q635P310q030K6973Q036l70j3921k6874
7099b4274l3461J302J6060j103J1436K6942K791Q475N0793m156N586M57k2804
7086C8044l9488j9973q67J4810J1822j1466J5880J0263L5829j4606l3207k1495
$$ plain form
7176 -40581 -59109 -44476 -10324 5303 -487 11725 2829 -3340 -18019 1822 73311 84840
7164 84840 46580 20253 3279 20326 -7428 -27726 -12594 49866 32967 19350 2684 6982
7152 6982 39996 40252 41461 30291 7090 8480 27716 8165 16627 9479 14969 23352 26375 40300
7138 40300 33170 -13322 -4581 10520 28476 -22500 -44791 -31127 -27627 -16624 -10711 -42274 -17421
7125 -17421 8357 -4250 -37779 -40095 -20353 -18059 -38426 -60507 -83626 -42911 -39218 -56738
7113 -56738 -50430 -43892 -46575 -48624 -15927 -8763 -17398 -10088 -18118 8855 16891 16521 2600 -24274
7099 -24274 -57735 -56433 -40373 -41476 -30040 -3098 -307 8168 58961 54805 60391 60848 38044
7086 38044 -1444 -21417 -22284 -7474 4348 -7118 8762 19025 54854 40248 7041 -14454
7074a4454R979n832K486J1062k690m7570Q350k181j0266l4112j8877r207k2471
7061a35783l002P9031J6669r248m168O076M4466R623N2271j363M526K527m061
7048E7564l8486k9398M259L0896K8925l4040Q578K8516j0239L292P077K3431k1055
7035E9320k3010l261n7178o4756k5405n187L0965L0895J0495k1245K036K6138
7023d0193J1293O435l1764j6273M3038k1493k146J4161m445Q227L0967K9335J4661
7010D1803J6256m2057k5893K2620M0664r259m2287J8818P116P956j747k0424r491
6997D075K3659q671k691j347j9478N6420j9925l9011j4868J175J6360L169J7675
6984A6542L6531m6869L135p412n993J2030L2709k9896j9416J2358n688j2681m8572
$$ plain form
7074 -14454 -4475 -10307 -7821 3241 551 -47019 -38669 -40850 -51116 -85228 -104105 -113312 -135783
7061 -135783 -138785 -59754 -43085 -52333 -56501 -50425 -5959 3664 55935 54572 59098 61625 57564
7048 57564 19078 -10320 -6061 24835 53760 19720 28298 56814 46575 49867 56944 80375 59320
7035 59320 36310 33049 -24129 -88885 -114290 -119477 -88512 -57617 -47122 -68367 -66331 -40193
7023 -40193 -28900 -22465 -54229 -70502 -27464 -48957 -51103 -36942 -41387 -33160 -2193 27142 41803
7010 41803 58059 16002 -9891 12729 53393 44134 1847 20665 27781 35737 33990 13566 4075
6997 4075 27734 19063 16372 15025 -4453 51967 32042 -6969 -21837 -20662 -4302 -1133 16542
6984 16542 53073 6204 9339 1927 -4066 7964 40673 10777 -8639 3719 -1969 -14650 -63222
6971f3222o98O837J0364L778n750L4150N454L30j1199l1828J9927R311k7528K2973
6957b7101O2853q338j5965k7050j0444k0594J9252J1773j5962Q289K8074J6652
6945B1439o139k6462k8129R693P204K8561K970K3478m146k1184m711k2985J1684
6932h727J8021K4055P677j1739J722j2330K1693J3662m2015k9311m0232l4167
6920i1691K490M0657J9897k1067J240M8079L542m1131J089J5599p999j1882J9423
6907b1754J3504L4011L767l7471j4639kL7316L7715O300O69r145K9147j3036k9028
6893C7354j2110O86r656P002K7729l1256m2034K5567J1906J4877o2395k70R46
6880c1654m0936p228L3927K7695K6235J7633K0112l5420k6338N710J923j4610
$$ plain form
6971 -63222 -63920 -57083 -46719 -42941 -48691 -14541 -9087 -8757 -19956 -51784 -31857 -22546 -50074 -27101
6957 -27101 35752 27414 11449 -15601 -26045 -46639 -27387 -15614 -31576 -23287 4787 21439
6945 21439 15300 -11162 -39291 -29598 -22394 6167 9137 32615 28469 7285 2574 -20411 -8727
6932 -8727 9294 33349 41026 29287 31009 18679 40372 54034 12019 -17292 -57524 -91691
6920 -91691 -89201 -48544 -28647 -49714 -48474 -395 3147 -37984 -36895 -21296 -29295 -41177 -21754
6907 -21754 -8250 25761 29528 -7943 -22582 -22584 14732 52447 58747 59416 50271 79418 66382 37354
6893 37354 25244 25930 16274 23276 51005 19749 -22285 3282 15188 30065 -32330 -32600 -31654
6880 -31654 -72590 -79818 -45891 -18196 8039 25672 45784 10364 -15974 -10264 -8341 -22951
6868b2951j5906k2646J3808L5669J4098K8902k0568n0026M701J5971j2434J6409
6856a4973k8826J1900r19L152k608P126N712j1766J4096J3615K5503O944M877
6843C3833l7311n050K335J9079K8155L5873j3304p0733m9795q860K940J1017m211
6830e6032j5290j0211n733J7602K340Q454M768K2029K9986l3415n9425L674N7542
6817c3711M4395O316j0149J1720k5084k3105j4955k2265j8896K124L2927q44J0709
6804d0818j7355K9944k4268j132l86J7492J0537N060l8967r618L2822R930M0574
6791A3815j1639N345J585J1533j6389k1729J9336M176j8230j1200l079L2496o511
6778d91k2454j1877P549P493j6977r134m242K5396m451R806K8123K685l625Q158
$$ plain form
6868 -22951 -38857 -61503 -47695 -12026 2072 30974 10406 -39620 -34919 -18948 -31382 -14973
6856 -14973 -43799 -31899 -32818 -29666 -32274 -25148 -19436 -31202 -17106 -3491 22012 28956 33833
6843 33833 -3478 -8528 -6193 12886 41041 76914 63610 -7123 -56918 -65778 -62838 -51821 -56032
6830 -56032 -71322 -81533 -87266 -69664 -67324 -58870 -54102 -32073 -2087 -35502 -94927 -91253 -33711
6817 -33711 10684 17000 6851 18571 -6513 -29618 -44573 -66838 -85734 -83610 -50683 -51527 -40818
6804 -40818 -58173 -28229 -52497 -53629 -54015 -36523 -25986 -20926 -59893 -69511 -36689 -26759 13815
6791 13815 2176 7521 9106 20639 4250 -17479 1857 6033 -12197 -23397 -26476 6020 -491
6778 -491 -22945 -34822 -27273 -19780 -36757 -45891 -50133 -24737 -29188 -19382 8741 11426 7801 15959
6764A5959j2684k7290J6514J834M260j1739J1317L2202L0897K4402R206l8830
6752E6048l6072j3597r807O908P266R974k8248m144R821p321l052N422K017K1712
6738A6927j5897q230m2423L4537J7317J3144Q567k514j7249k942K7174J6119m8982
6725d452m5402M145L2859k4841J5517J3980j0727K1789p972J2672J1514n777K1559
6712C4864J3727K154k3066m904m8035m6005L7583K8079L1856k5976K891J0583
6700A3751j2207o260K7955J2623j7011J5147R007m5789j5444J5818L323k4813
6688b3900j1517k726n722K3082L6063Q610l894K861p024k9141k6675K2621j1955
6675b9317q642K2713j6516j9407J3164J2292J2183j0933o466J3758J2292k4551
$$ plain form
6764 15959 3275 -24015 -7501 -5667 -1407 -13146 -1829 30373 61270 85672 94878 56048
6752 56048 19976 6379 -3428 3480 10746 20720 -7528 -11672 -1851 -9172 -12224 -6802 -4785 16927
6738 16927 1030 -7200 -49623 -15086 2231 15375 23942 21428 4179 1237 28411 44530 -4452
6725 -4452 -49854 -45709 -12850 -37691 -22174 -8194 -18921 2868 -5104 7568 19082 13305 34864
6712 34864 48591 50745 27679 22775 -25260 -71265 -33682 -5603 26253 277 3168 13751
6700 13751 1544 -4716 23239 35862 18851 33998 43005 -2784 -18228 -2410 913 -23900
6688 -23900 -35417 -38143 -43865 -20783 15280 23890 19996 22857 15833 -13308 -39983 -17362 -29317
6675 -29317 -37959 -15246 -31762 -51169 -38005 -25713 -13530 -24463 -30929 -17171 -4879 -29430
6663b9430j9791L3960K3052r903j7503K3837K7458j4710m6241K2272J2049n184
6651a34J6395N080R664J1629m806J1700o117R502L0621l7202k4468L273J3756
6638C8893J303j875L777m648k4230k58k3213m1288k0128O503J7578J0069j1882
6625d9399k4762N800K6634J3374R103j1278j247J3864l352l7899o572j0183P548
6612f8369K3446L0025K6162k3743j2375J3786j1678o960K1346L9585J2719l1674
6600A2270k5051j7825J6925J6836J933j6802M4343L8870k5288l5822R680L66j7855
6587B580k007J6752R131k4369r876K3945m611o284J2034m2822O841M1383K7334
6574E0031j3062m2786j7735L1950M1963J0304m2548l4140M401L2141n3j2589n354
$$ plain form
6663 -29430 -49221 -15261 7791 -2112 -19615 4222 31680 16970 -29271 -6999 5050 -134
6651 -134 16261 21341 31005 42634 37828 49528 43411 52913 83534 46332 21864 25137 38893
6638 38893 40196 38321 42098 37450 13220 12962 -10251 -51539 -71667 -65164 -47586 -37517 -49399
6625 -49399 -74161 -68361 -41727 -28353 -19250 -30528 -31775 -17911 -21263 -59162 -65734 -75917 -68369
6612 -68369 -44923 -14898 11264 -12479 -24854 -11068 -22746 -29706 -8360 31225 43944 12270
6600 12270 -12781 -30606 -13681 3155 5088 -11714 32629 71499 46211 10389 20069 20435 2580
6587 2580 573 17325 26456 2087 -7789 16156 11545 5261 17295 -25527 -18686 22697 50031
6574 50031 36969 -5817 -23552 8398 50361 60665 18117 -16023 -11622 20519 20466 7877 2523
6561B523J4483n719k188j0127j2199M023K2461k1218L105m115j369m520J2998
6548a862k0910j5262j3586l21J680J9568L3489O962P518Q625K0286j540k6168
6535A8479q135K6071J6083l5758k7563K0442J3518o273k8313k0268J3860R119
6523h738l545L651j4604K3036J1707k7609j098n977Q65J8538j1408k4908K9799
6510a0291J1136J4312J9903m122J3699k2589j6867J9229k0078j3254l6750m8732
6498i4404M826L8094Q3001j4480n0944l769J2723j0125r785L4017P242j9998O061
6485a7541k1601l5655L4905L4338q18j9775N411K047L10J5709j0336l7909N506
6472d5409M6074K8076j7611l1901N114K6902J0403J2140k2747m1628L843m134
$$ plain form
6561 2523 17006 11287 9099 -1028 -13227 -9204 13257 -7961 -4856 -8971 -10340 -14860 -1862
6548 -1862 -22772 -38034 -51620 -51941 -50261 -30693 2796 9758 17276 25901 46187 44647 18479
6535 18479 10344 36415 52498 16740 -10823 9619 23137 16864 -11449 -31717 -17857 -8738
6523 -8738 -12283 -8632 -23236 -200 11507 -16102 -17200 -23177 -22312 -3774 -15182 -40090 -10291
6510 -10291 845 15157 35060 30938 44637 22048 5181 24410 4332 -8922 -45672 -94404
6498 -94404 -89578 -51484 31517 17037 -33907 -37676 -24953 -35078 -44863 -10846 -3604 -23602 -17541
6485 -17541 -39142 -74797 -39892 -5554 -6372 -26147 -20736 -18689 -18379 -2670 -13006 -50915 -45409
6472 -45409 665 28741 11130 -20771 -15657 11245 21648 33788 11041 -30587 -26744 -30878
6460c0878K7846J1959j278k6562J7644r688O011K8239l450N995r739K102J7712
6447C5913j3835j9789j2686M979K3224j1088j4781o501J3469k8701m4060M1929
6435c1927O8473L5122N857r1905j8494Q64l721K4990r915l2825o871K5153J4598
6422b0601r155O238K3035j9674l4587L3556L3215k7490l2188p756N3900M160l4490
6409c1837j8708k6635J423k219K2636j1410p683R804J7496k3373J6571O764J7108
6396c0063N82j8716J6518M0397M586l6377j5692Q846K477j23J9993L2400q562
6383A6266j487Q370K0433l0273q39K7078j6104j624l8057l4047J4789J6866O447
6370a2182k972n847K7884l140k0070j4553l5299J532J4814N327J2261P442K5551
$$ plain form
6460 -30878 -3032 8927 7649 -18913 -1269 -10957 -4946 23293 19843 25838 16099 18201 35913
6447 35913 22078 2289 -10397 -5418 17806 6718 -8063 -14564 -1095 -29796 -73856 -31927
6435 -31927 36546 71668 77525 -14380 -32874 -32010 -35731 -10741 -20656 -53481 -60352 -35199 -20601
6422 -20601 -29756 -23518 -483 -20157 -54744 -21188 12027 -15463 -47651 -55407 -1507 2653 -31837
6409 -31837 -50545 -77180 -75757 -77976 -55340 -66750 -74433 -64629 -47133 -70506 -53935 -47171 -30063
6396 -30063 -29481 -48197 -31679 8718 13304 -23073 -38765 -29919 -27442 -27565 -7572 24828 16266
6383 16266 14779 23149 43582 13309 12470 39548 23444 21820 -16237 -50284 -35495 -18629 -12182
6370 -12182 -15154 -21001 6883 3743 -16327 -30880 -66179 -64647 -49833 -44506 -32245 -24803 748
6357G48p937K0363l7516L6095O502j1618L035J5462K5710Q50q149K1270J817k1002
6343D5630l2034j1827j0557l0577j3343N4386q252m8122J8705K8151N123O647
6331C930L6767m332n2472j0417J7077P463j6599K0263K383L09J4608o074M020
6318A6926L0024j0240K8338j7954j6740k913o349P721m832l9396r478Q431J7512
6305A050M389l1812m4125m969M1574J7874j709J3001J1989J5305N7900j5542q05
$$ plain form
6357 748 -7189 13174 -24342 11753 18255 6637 9672 25134 50844 51694 43545 64815 66632 45630
6343 45630 13596 1769 -8788 -39365 -52708 1678 -6574 -54696 -35991 -7840 -2717 3930
6331 3930 40697 36365 -16107 -26524 -9447 -1984 -18583 1680 4063 4372 18980 12906 16926
6318 16926 46950 36710 65048 47094 30354 27441 21092 28813 23981 -15415 -24893 -16462 1050
6305 1050 5439 -26373 -70498 -75467 -33893 -16019 -17728 -4727 7262 22567 80467 64925 64120
$$ [...]
##END NTUPLES=NMR SPECTRUM
##END=
