##TITLE=Analysis number 318181
Compound Code cc 17511
Project Code adrs
Chemist Name durham
##JCAMPDX= 6.0         $$ Bruker NMR JCAMP-DX V2.0
##DATA TYPE= NMR SPECTRUM
##DATA CLASS= NTUPLES
##ORIGIN= Bruker BioSpin GmbH
##OWNER= nmr
$$ XWIN-NMR		Version 3.5
$$ Mon Mar 20 08:28:38 2006 GMT Standard Time (UT+0h)  MAYBRIDGE\nmr@NMR_250MHZ
##.OBSERVE FREQUENCY= 250.131544655141
##.OBSERVE NUCLEUS= ^1H
##.ACQUISITION MODE= SIMULTANEOUS (DQD)
##.ACQUISITION SCHEME= undefined
##.AVERAGES= 16
##.DIGITISER RES= 18
##SPECTROMETER/DATA SYSTEM= dpx250
##.PULSE SEQUENCE= zg30
##.SOLVENT NAME= CDCl3
##.SHIFT REFERENCE= (INTERNAL, CDCl3, 0, 16.522)
##AUDIT TRAIL= $$ (NUMBER, WHEN, WHO, WHERE, WHAT)
$$ ##TITLE= Audit trail, XWIN-NMR		Version 3.5
$$ ##JCAMPDX= 5.01
$$ ##ORIGIN= Bruker BioSpin GmbH
$$ ##OWNER= nmr
$$ C:\u/data/dgb/nmr/ADRS/960/pdata/1/auditp.txt
$$ ##AUDIT TRAIL=  $$ (NUMBER, WHEN, WHO, WHERE, WHAT)
(   1,<2006-03-20 08:28:13.93 +000>,<MAYBRIDGE\nmr>,<NMR_250MHZ>,
      <created by zg, POWCHK disabled, PULCHK disabled
       configuration hash MD5:
       84 BC 41 DB A1 6E 1D 46 DA 25 12 A5 C1 ED C5 3A
       data hash MD5: 64K
       24 4F CC EC A1 6F DC B9 1F 0E 58 B3 82 A6 D2 E2>)
(   2,<2006-03-20 08:28:28.01 +000>,<MAYBRIDGE\nmr>,<NMR_250MHZ>,
      <Start of raw data processing
       ef LB = 0.3 FT_mod = 6 PKNL = 1 SI = 32K 
       data hash MD5: 32K
       68 6B 38 60 D4 E2 C7 17 A7 01 68 52 61 35 FD FE>)
(   3,<2006-03-20 08:28:29.54 +000>,<MAYBRIDGE\nmr>,<NMR_250MHZ>,
      <apk 
       data hash MD5: 32K
       74 10 4B 0B 84 37 7A A6 B9 9B 4E BB CF 48 2A 56>)
(   4,<2006-03-20 08:28:30.30 +000>,<MAYBRIDGE\nmr>,<NMR_250MHZ>,
      <abs ABSG = 5 
       data hash MD5: 32K
       DA DD 90 D1 C2 74 77 37 F7 CA 9F 71 C5 E9 16 3E>)
$$ ##END=
$$ 
$$ hash MD5
$$ 17 FA AE B4 48 83 4F 74 3B D4 9E 0B C1 87 B8 BF
##$RELAX= 
##$RELAX= 
##$RELAX= 
##$RELAX= 
##$RELAX= 
##$RELAX= 
##$RELAX= 
$$ Bruker specific parameters
$$ --------------------------
##$DU= <C:\u>
##$EXPNO= 960
##$NAME= <ADRS>
##$PROCNO= 1
##$TYPE= <nmr>
##$USER= <dgb>
##$AMP= (0..31)
100 100 100 100 100 100 100 100 100 100 100 100 100 100 100 100 100 100 
100 100 100 100 100 100 100 100 100 100 100 100 100 100 
##$AQSEQ= 0
##$AQ_mod= 3
##$AUNM= <au_zg>
##$AUTOPOS= <2 >
##$BF1= 250.13
##$BF2= 250.13
##$BF3= 250.13
##$BF4= 250.13
##$BF5= 500.13
##$BF6= 500.13
##$BF7= 500.13
##$BF8= 500.13
##$BYTORDA= 1
##$CFDGTYP= 0
##$CFRGTYP= 5
##$CHEMSTR= <none>
##$CNST= (0..31)
1 1 145 1 1 1 1 1 1 1 1 1 1 1 1 1 1 1 1 1 1 1 1 1 1 1 1 1 1 1 1 1 
##$CPDPRG= <>
##$CPDPRG1= <>
##$CPDPRG2= <>
##$CPDPRG3= <>
##$CPDPRG4= <mlev>
##$CPDPRG5= <mlev>
##$CPDPRG6= <mlev>
##$CPDPRG7= <mlev>
##$CPDPRG8= <mlev>
##$CPDPRGB= <>
##$CPDPRGT= <>
##$D= (0..31)
0 1 0 0 0 0 0 0 0 0.06 0 0 0 0 0 0 0.0002 0 0 0 0 0 0 0 0 0 0 0 0 0 0 
0 
##$DATE= 1142843292
##$DBL= (0..7)
120 120 120 120 120 120 120 120 
##$DBP= (0..7)
150 150 150 150 150 150 150 150 
##$DBP07= 0
##$DBPNAM0= <>
##$DBPNAM1= <>
##$DBPNAM2= <>
##$DBPNAM3= <>
$$ [...]
##$SUBNAM6= <"">
##$SUBNAM7= <"">
##$SUBNAM8= <"">
##$SUBNAM9= <"">
##$SW= 20.6930455092707
##$SWIBOX= (0..15)
0 0 3 0 0 0 0 0 0 0 0 0 0 0 0 0 
##$SW_h= 5175.983436853
##$TD= 65536
##$TD0= 1
##$TE= 294.16
##$TE2= 300
##$TE3= 300
##$TEG= 300
##$TL= (0..7)
0 120 120 120 120 120 120 120 
##$TP= (0..7)
150 150 150 150 150 150 150 150 
##$TP07= 0
##$TPNAME0= <>
##$TPNAME1= <>
##$TPNAME2= <>
##$TPNAME3= <>
##$TPNAME4= <>
##$TPNAME5= <>
##$TPNAME6= <>
##$TPNAME7= <>
##$TPOAL= (0..7)
0.5 0.5 0.5 0.5 0.5 0.5 0.5 0.5 
##$TPOFFS= (0..7)
0 0 0 0 0 0 0 0 
##$TUNHIN= 0
##$TUNHOUT= 0
##$TUNXOUT= 0
##$USERA1= <user>
##$USERA2= <user>
##$USERA3= <user>
##$USERA4= <user>
##$USERA5= <user>
##$V9= 5
##$VALIST= <valist>
##$VCLIST= <CCCCCCCCCCCCCCC>
##$VD= 0
##$VDLIST= <DDDDDDDDDDDDDDD>
##$VPLIST= <PPPPPPPPPPPPPPP>
##$VTLIST= <TTTTTTTTTTTTTTT>
##$WBST= 1024
##$WBSW= 4
##$XGAIN= (0..3)
0 0 0 0 
##$XL= 0
##$YL= 0
##$YMAX_a= 325740
##$YMIN_a= -412146
##$ZGOPTNS= <>
##$ZL1= 120
##$ZL2= 120
##$ZL3= 120
##$ZL4= 120
##$ABSF1= 16.522
##$ABSF2= -4.171173
##$ABSG= 5
##$ABSL= 3
##$ALPHA= 0
##$AQORDER= 0
##$ASSFAC= 0
##$ASSFACI= 0
##$ASSFACX= 0
##$ASSWID= 0
##$AUNMP= <proc_1d>
##$AZFE= 0.1
##$AZFW= 0.1
##$BCFW= 0
##$BC_mod= 0
##$BYTORDP= 0
##$COROFFS= 0
##$CY= 12.5
##$DATMOD= 1
##$DC= 0
##$DFILT= <>
##$DTYPP= 0
##$F1P= 14.0000005364418
##$F2P= -0.99999901652339
##$FCOR= 0.5
##$FTSIZE= 32768
##$FT_mod= 6
##$GAMMA= 0
##$GB= 0
##$INTBC= 1
##$INTSCL= 1
##$ISEN= 128
##$LB= 0.3
##$LEV0= 0
##$LPBIN= 0
##$MAXI= 10000
##$MC2= 0
##$MEAN= 0
##$ME_mod= 0
##$MI= 0
##$NCOEF= 0
##$NC_proc= -5
##$NLEV= 6
##$NOISF1= 0
##$NOISF2= 0
##$NSP= 0
##$NTH_PI= 0
##$NZP= 0
##$OFFSET= 16.522
##$PC= 1
##$PHC0= 178.4208
##$PHC1= 9.0512
##$PH_mod= 1
##$PKNL= yes
##$PPARMOD= 0
##$PSCAL= 4
##$PSIGN= 0
##$REVERSE= no
##$SF= 250.13
##$SI= 32768
##$SIGF1= 0
##$SIGF2= 0
##$SINO= 400
##$SIOLD= 32768
##$SREGLST= <1H.CDCl3>
##$SSB= 0
##$STSI= 32768
##$STSR= 0
##$SW_p= 5175.98343685301
##$SYMM= 0
##$S_DEV= 0
##$TDeff= 65536
##$TDoff= 0
##$TI= <Analysis number 999999
Compound Code 99
Book Reference 9
Project Code 9>
##$TILT= no
##$TM1= 0
##$TM2= 0
##$TOPLEV= 0
##$USERP1= <user>
##$USERP2= <user>
##$USERP3= <user>
##$USERP4= <user>
##$USERP5= <user>
##$WDW= 1
##$XDIM= 32768
##$YMAX_p= 479736894
##$YMIN_p= -633329
$$ End of Bruker specific parameters
$$ ---------------------------------
##NTUPLES= NMR SPECTRUM
##VAR_NAME=  FREQUENCY,     SPECTRUM/REAL,   SPECTRUM/IMAG
##SYMBOL=    X,             R,               I
##VAR_TYPE=  INDEPENDENT,   DEPENDENT,       DEPENDENT
##VAR_FORM=  AFFN,          ASDF,            ASDF
##VAR_DIM=   32768,         32768,           32768
##UNITS=     HZ,            ARBITRARY UNITS, ARBITRARY UNITS
##FACTOR=    0.157963299565203, 1,           1
##FIRST=     4132.6476996994, 0,             0
##LAST=      -1043.33573715361, 0,           0
##MIN=       -1043.33573715361, -633329,     0
##MAX=       4132.6476996994, 479736894,     0
$$ Real data points
##PAGE= N=1
##DATA TABLE= (X++(R..R)), XYDATA
$$ [...]
17840b14153K1256K42535j974j19049q9587J02881k718J5495p7827j14141m2160
17829b79442q3858m5632J10778L38257J09526k29426j37416j0447j4067O360J15583
17818a19784J31967L444O5994r8565j27660N8698J17628J72021q3091P7946k38955
17807d0357k27733J55402J19216J90362j02090m676k9648k683j15010K3690j9666
17796e3193k3284o2794K5702N8260O6605q034p1905k1761J93517l4501j96073
17785a27461K3397l7087o3252l5591M6816j08106J52717J74966Q618Q8239L874
17774A27130j79515l4867J07188J80260j09863o2677Q3455l9475j37861m8992
17764a15217j4090k14011m9652M8182P3799J04353J11M5316J33673J41619l4108
$$ y = [-214153, -192897, 49638, 47664, -71385, -160972, -58091, -60809, -45314, -123141, -237282, -279442, -363300, -408932, -298154, 40103, 149629, -79797, -217213, -227660, -241727, -235367, -119784, 12183, 15627, 81621, -16944, -144604, -85906, 31722, 203743, 120652, 198598, -40357, -268090, -112688, 6528, 196890, 94800, 90124, 60476, 57793, -57217, -33527, -53193, -76477, -139271, -113569, -55309, 11296, 3262, -68643, -90404, 103113, 68612, -127461, -104064, -141151, -204403, -239994, -193178, -301284, -148567, 26399, 35017, 123256, 127130, -52385, -87252, 19936, 200196, 90333, 27656, 111111, 71636, -66225, -115217, -129307, -343318, -392970, -344788, -270989, -166636, -166525, -121209, 12464, 154083, 119975]
17753A19975K5401K9679l7724k19298N0843J09387N3538o653l59742k39504J15646
17742c58452J20565K21993M0618M4706n2948q433L8348j20900m6346J34626J07412
17731A21189j09746O0109J18224k992r7255j14888J9206k9558O1265j2036r8431
17720h4913M77j3735n8442j33268J55741K64672r355k93733j47553l274J88008
17709a35375K0075L0828P9963j00359R1317J2910k2374K0759j03529o6335J27403
17698d4717J50614J9090m9946j77927J1365Q7053p1827p7309Q0444J16713p6684
17687c3131j06925p4344N3526R5052r5050j60942J2473Q1779J09733l5135K1066
17676a31898P2414M1189Q607j34838r4104o4660J42267J4131Q5071P7920Q374
$$ y = [119975, 145376, 175055, 137331, -81967, -31124, 78263, 131801, 125148, -234594, -474098, -358452, -237887, -15894, 24724, 69430, 16482, 8049, 46397, -74503, -120849, 13777, 121189, 11443, 71552, 189776, 186784, 89529, -25359, -6153, -35711, 25554, 13518, -84913, -84436, -98171, -156613, -289881, -134140, 130532, 121177, -172556, -320109, -323383, -135375, -115300, -84472, -4509, -104868, -13551, -641, -23015, -2256, -105785, -172120, -44717, 105897, 124987, 75041, -102886, -91521, -4468, -76295, -153604, -73160, 43553, -33131, -140056, -214400, -160874, -65822, -160872, -321814, -309341, -227562, -117829, -152964, -131898, -59484, -18295, -9688, -144526, -238630, -303290, -161023, -146892, -61821, 16099, 24473]
17665B4473j36110j63060O8483M8014J17737J64P844k5230N7340J16725l498j28836
17653a5954p1346J64160K5623O1872L301p7244m1106J3018l8212q5778K39571
17642A77905j8324j29838J8749o7693m9895K2064j11673j03216J73695M4939j28577
17631a71864n3924R5054J8050Q9351k6884j42541m6177J48724J02013J08885M7812
17620A68499P2889K9296q7332j45017r5330L9875K1111Q7047q1449j48525M3861
17609i5075N8607m1872o2302R6967J19001m2180r1908P08N3871K76914K5165k98882
17597i86r2025J65502M9139j15561J6266M5923p0052m2834o0827j15386N4443
17586a66398K6779r2393L1157k5610j1921o985K00434J36131j0528n4214j37303
$$ y = [24473, -111637, -274697, -206214, -158200, -40463, -40299, -32455, -57685, -345, 116380, 112882, -15954, -87300, 76860, 102483, 164355, 167656, 90412, 49306, 62324, 24112, -61666, 177905, 159581, 29743, 48492, -19201, -69096, -47032, -158705, -261921, -88226, -43287, -171864, -225788, -130734, -112684, -23333, -50217, -192758, -238935, -90211, 11802, 120687, 168499, 241388, 270684, 183352, 38335, -56995, -17120, 3991, 91038, 9589, -138936, -95075, -36468, -78340, -140642, -43675, 75326, 33146, -58762, -58054, -4183, 272731, 297896, -986, -93011, 72491, 121630, 6069, 22335, 68258, -1794, -44628, -105455, -220841, -166398, -139619, -232012, -200855, -226465, -238386, -245371, -44937, 91194, 80666, 26452, -110851]
17575a10851N6805J56159r0442j55593J33920Q0828m7583J2247k280j5668K0087
17564C7629J01704l7137r78K4907k8914L864L249l2141j845j88174q2704q9190
17552b89730p2862J20255N4440j39171M9833J55720n849M870J24313l6485j26512
17541a61178L3342J0733n4283m9948J05217N9681J59444n3672l3151k264P8824
17530I2745J67010r0835N0052j1806j25364j49860K121K07348J09479m5530Q4114
17519B89474L996k07522j66491j44468j40259J752K44501j39R3079R0559J36637
17508B01119L9823K8231q6309j35297n3648q5671j21461l5852J96879K16994j7485
17497A47323L9372K918j29279n3784k1352K7513J7263m7910J05059Q1871O6947
$$ y = [-110851, -54046, 102113, 11671, -143922, -10002, 70826, 23243, 35490, 33210, 17542, 37629, 139333, 102196, 101218, 126125, 97211, 101075, 104324, 72183, 70338, -117836, -200540, -289730, -362592, -242337, -187897, -327068, -277235, -121515, -127364, -122494, 1819, -34666, -161178, -127836, -117103, -171386, -221334, -116117, -56436, 103008, 49336, 16185, 13921, 92745, 259755, 168920, 218972, 207166, 81802, -68058, -65937, 141411, 250890, 205360, 289474, 293470, 85948, -80543, -225011, -365270, -363518, -119017, -119156, -26077, 64482, 201119, 240942, 269173, 182864, 47567, -6081, -91752, -213213, -249065, -52186, 164808, 147323, 186695, 189613, 60334, 6550, -14802, 12711, 29974, -17936, 87123, 168994, 235941]
17486B35941j20708o4587l549j5566r2991o3620J07375m190p7237n9702L470L3133
17474a22231M6639M2664J05998J45263l0995J5976J4367j04108j38438j32691
17464a57556J3013J82123J1686o1459j67136J60812K25251m4583j40860n8650
17454c7359J69000J00192n254R505l6126j58775L2198n5895j4474K10816M51553
17443F65381N10505Q8370j60948l56369l84432j31880l4992m5816J3008j01764
17433F1063K439J31413n7791k3071n2306j09872j33641K51623P3252q6983O696
17422F2822k7259j9446K9349J11590o639N2033R5538O8845j16104o3606K8276
17411B15399j13034j16004k9561J45445J51632O7375J38321J23447L41209J61196
$$ y = [235941, 115233, 50646, 47097, 31531, -61460, -125080, -17705, -21895, -99132, -158834, -155364, -122231, -75592, -32928, 73070, 218333, 187338, 203314, 217681, 113573, -24865, -157556, -144543, 37580, 49266, -12193, -179329, -18517, 206734, 162151, 21291, -37359, 131641, 231833, 226579, 236084, 199958, 41183, 73381, 17486, 3012, 213828, 665381, 1175886, 1264256, 1103308, 746939, 362507, 230627, 195635, 149819, 162827, 61063, 63502, 194915, 137124, 114053, 61747, -48125, -181766, 69857, 143109, 56126, 62822, 35563, 16117, 45466, 157056, 150417, 202450, 297988, 366833, 250729, 187123, 215399, 102365, -13639, -43200, 102245, 253877, 321252, 459573, 583020, 924229, 1085425]
17401A085425o2937j30823j16255j19059K4727o1930o5986j16896r9513j39721
17391A97032q0608j28644j19357K40749J25524R9104j38444p9550o2485K0592
17381G3913j5774m4179P4436K30829m266j30422q316J09065j43880j90791J07346
17370E7961j19149r9126K0294n2118J48358K34844q6962j5265J71890L8416k0431
17359B78712r1008p2586L8254n2162j9034l6279J55815R0127q816p2305P6324
17348B87042K69663J62215R9938N5814M173K0731J25349j8562k37733k27242j12247
17337D29141J8876J30177k03644k34706j92383j07805J75420K56927J36543l4275
17327C74271j77369j00674n6645j36531j53630J03738J76621J53247J49968J13992
$$ y = [1085425, 1022488, 891665, 775410, 656351, 681078, 619148, 553162, 436266, 336753, 197032, 116424, -12220, -131577, 109172, 234696, 333800, 195356, 115806, 53321, 73913, 58139, 13960, 88396, 319225, 314959, 184537, 176221, 285286, 141406, -49385, 57961, -61188, -160314, -140020, -192138, -43780, 191064, 104102, 88837, 260727, 299143, 278712, 187704, 115118, 153372, 101210, 82176, 45897, 201712, 291839, 283023, 210718, 287042, 556705, 718920, 818858, 874672, 878845, 899576, 1024925, 1006363, 768630, 541388, 429141, 448017, 578194, 374550, 139844, -52539, -160344, 15076, 272003, 408546, 374271, 196902, 96228, 39583, -96948, -250578, -146840, 29781, 183028, 332996, 446988]
17317D46988k38190j89678j60476r6791O1037J30375K8870O9876M2285K5286l5867
17306H3715j35529q1852m9641j33894K8788K22616O1578Q4213j50829K3869j3301
17295f0267m8615J29073J70050j63842q6362J61958K7175K4890j39925l1645J94649
17284A77139J31361P4965j57834j2712j02108p2329j1477Q6148j81728o8405J31743
17273e237p3054K63166M5409j42144k06132L9677Q5258j20577P2424J12502J36816
17262B08108m2347k91384l7976N732O9931R7998J36056J49543N2435j3664k05987
17251A28445j42666p376J64949R5292M1330O9172j31522P7168j65817j79458P3950
17240B3467O5480L9596L5694k7851j03642J35443J0005q959o8240k6975j35791
$$ y = [446988, 208798, 19120, -141356, -238147, -177110, -46735, -17865, 52011, 94296, 119582, 83715, -51814, -133666, -183307, -317201, -288413, -65797, -4219, 79994, -70835, -46966, -60267, -108882, 20191, 190241, 26399, -59963, 101995, 129170, 154060, 14135, -17510, 177139, 308500, 383465, 225631, 212919, 110811, 38482, 27005, 113153, -68575, -136980, -5237, -78291, 184875, 230284, 88140, -117992, -78315, 6943, -113634, -41210, 71292, 208108, 165761, -125623, -163599, -157867, -87936, 10062, 146118, 295661, 348096, 334432, 128445, -14221, -21597, 143352, 238644, 279974, 349146, 217624, 294792, 128975, -50483, 23467, 88947, 128543, 164237, 136386, 32744, 168187, 178192, 169233, 100993, 74018, -61773]
17229f1773j69938m8583J57475K06070O3585j32369j91990Q9719q7630k3416J45983
17218e2867J22389J40699P8777O4274j16062j10807l7731o8932m2808J792J3198
17207h078J28904j83872j33060J29934K49774N4087k19797o4148Q2727Q3680j92023
17196g1872j04714J34751k2259L788K41390L4376j88212o5476J7836k19764q1456
17185c21612n7278J10244K26566K33090n5469l35060k34541M1238J96517O341
17175a89964Q7039Q1517m1990j31718j86122L9092Q1233n135l4164J31126m3404
17164b12490Q4054J91097J12261o4940j88966j46919j9342Q5054O3068R2130o6047
17153g1040p4840J47631j09999o9952Q5331J28777j0355j24849O3749N6859j17342
$$ y = [-61773, -231711, -280294, -122819, 83251, 146836, 14467, -177523, -87804, -175434, -198850, -52867, 69522, 210221, 288998, 353272, 237210, 126403, 88672, 19740, -23068, -21276, -8078, 120826, -63046, -196106, -66172, 183602, 237689, 17892, -46256, 36471, 120151, -71872, -176586, -41835, -64094, -60306, 181084, 215460, 27248, -38228, -20392, -240156, -321612, -378890, -268646, -42080, 191010, 135541, -199519, -434060, -392822, -196305, -189964, -102925, -21408, -63398, -195116, -381238, -342146, -260913, -266048, -300212, -169086, -212490, -128436, 62661, 174922, 109982, -78984, -225903, -245245, -160191, -97123, -4993, -71040, -145880, 1751, -108248, -178200, -92869, 35908, 25553, -99296, -35547, 21312, -96030]
17142i6030Q6270j9172K46931K94978J974j46246j07989q4662Q4203M5860r991
17131B96126j18563j23074p359p4995l4843p133J21007O858j13005M7262J07866
17120A00147r9432k382j33977n2851P1041M9389R5190n7767K19283J861j70623
17109A9879m7913m8052J19178o6529k349N7738P0079J01338J2595R0485j50539
17098A55910j69877k68015L723J89845m364k8230J225m641l1001J18664P9767
17087D3006J85193J23385J6899l8246q714K0989j07098j79486l06544j75694K53140
17076a73170Q5820j28510J84929J48306j01146j09624J49044L4709O213J3091
17066A09662J6671J06194J36806k39134k9159J16194J90782r6487K2897J6758
$$ y = [-96030, -9760, -28932, 217999, 512977, 514951, 368705, 260716, 176054, 260257, 306117, 296126, 177563, 54489, 47130, -27865, -62708, -69841, 51166, 58024, -54981, -7719, 100147, 715, -1667, -135644, -188495, -117454, -68065, 27125, -30642, 188641, 190502, 19879, -28034, -76086, 43092, -23437, -25786, 31952, 102031, 203369, 215964, 306449, 155910, -13967, -281982, -278259, -88414, -92778, -121008, -119783, -124424, -155425, -36761, 43006, 228199, 351584, 368483, 330237, 321523, 342512, 235414, 55928, -250616, -426310, -173170, -87350, -215860, -30931, 117375, 16229, -93395, 55649, 90358, 96571, 109662, 126333, 232527, 369333, 130199, 101040, 217234, 408016, 311529, 334426, 351184]
17056C51184j52313q5591o8517j53748J54298Q7876k49375n1214J70568R8984
17046A02152R9839J8507j19174K9010j19475j97079R0295L59518P7409r1208j68039
17035H1755l3614n8655N5953J74046k0140j74663r7669J18480J9521J03390j37416
17024C0988J0093J8205o077J15397J9859M9356L4312R5347J7843Q014O5970L4428
17012D93735R7545J03372Q796j42339j46538M4765k11310j58850J65036K06547
17002D60759o8662J86860N7728r4920q0329o9208k19570o9277O1750J0575j47506
16991B8200o2479q0748R528o6016J42022J65489K08613J34451j58475j35987M4209
16980B28807q6783k11152j50886j3052J82793J6309J8027N3197N095M4798K67801
$$ y = [351184, 198871, 113280, 44763, -108985, 45313, 133189, -116186, -167400, 3168, 102152, 201991, 220498, 101324, 130334, 10859, -186220, -95925, 263593, 341002, 249794, 81755, 48141, -10514, 45439, 219485, 199345, 24682, -72987, 45493, 65014, 168404, 30988, 41081, 59286, 53209, 168606, 188465, 237821, 272133, 367480, 385323, 393337, 459307, 493735, 591280, 694652, 703448, 561109, 414571, 459336, 248026, 89176, 254212, 460759, 392097, 578957, 636685, 541765, 461436, 392228, 172658, 103381, 165131, 175706, 28200, -34279, -115027, -105499, -171515, -29493, 135996, 344609, 479060, 320585, 184598, 228807, 142024, -69128, -220014, -233066, -50273, -33964, -15937, 37260, 42355, 87153, 354954]
16969C54954K4235l3433o58P6462l3011j46719j21108J55211k0418o0538J32589
16958C27566J91334m7880J28310l6233j14998M17m1454j01886q4023j89475R0680
16947A22358J99777K05369K1330J45469j3756o6171j02789R177J88848Q5300j05262
16936F89650R539m4385J66288M17j1563K12709K02287k6850o0333N911L2566O1621
16924A237857L34137J08446J27954K59847K44140J74265K66783K50020Q7502J75170
16914C266121K18955L36386K54976J91375K18091M21639L73779L64762O46870
16905F292954Q65336J072816J636244J941891K493996L684981N406073Q406128
16897C1800419J3386616K0929679K9772780L3916319K6468049J1593641P88094
$$ y = [354954, 379189, 345756, 345098, 421560, 388549, 241830, 120722, 275933, 255515, 194977, 327566, 518900, 471020, 599330, 563097, 448099, 448516, 407062, 305176, 221153, 31678, 122358, 322135, 527504, 548834, 694303, 680547, 614376, 511587, 520764, 709612, 794912, 689650, 699189, 654804, 821092, 821509, 809946, 1022655, 1224942, 1198092, 1137759, 1143670, 1176236, 1237857, 1571994, 1680440, 1808394, 2068241, 2312381, 2486646, 2753429, 3003449, 3090951, 3266121, 3485076, 3821462, 4076438, 4267813, 4485904, 4907543, 5281322, 5646084, 6292954, 7158290, 8231106, 9867350, 11809241, 14303237, 17988218, 23394291, 31800419, 45187035, 66116714, 95889494, 129805813, 156273862, 167867503, 168655597]
16890A68655597N35326M140111j184007j5233095k8130275l1838322k6595919
16883G0349416j8949993j2777308q343025n700449m287329l069937k384838j783933
16875A3052604j536304j210523q93608n43855n28565m26913k68995k55242k54902
16866G133697l21040j99944j26925J16008Q0008M8572k74784k69630L3886j64471
16856F055377o4882O4P9873J51990K63910K33527L01584P14204R02616J130975
16846I769238J402211K118215K992770L966519N865399R381465J5170235K3072367
16838G3738419L0344181L0711369K0137456O015862r91228J126264K921253n362034
16830A58641542j9737230k9751125k9568272k2909172j5320056r815221o649002
$$ y = [168655597, 169190923, 173331034, 172147027, 156913932, 128783657, 96945335, 70349416, 51399423, 38622115, 30279090, 24578641, 20291312, 17221375, 14836537, 13052604, 11516300, 10305777, 9412169, 8868314, 8339749, 7912836, 7643841, 7388599, 7133697, 6812657, 6612713, 6485788, 6601796, 6681804, 6730376, 6455592, 6185962, 6219848, 6055377, 5990495, 5990559, 6070432, 6222422, 6486332, 6719859, 7021443, 7735647, 8638263, 9769238, 11171449, 13289664, 16282434, 20248953, 26114352, 35495817, 50666052, 73738419, 104082600, 134793969, 154931425, 160947287, 159956059, 161082323, 164003576, 158641542, 138904312, 109153187, 79584915, 56675743, 41355687, 31540466, 24891464]
16823B4891464m665761l478508k567454j975728j441475j058341q52450q23475
16815H028272q14340n85424k41188k69014m21980l22396l37464l89494l14793
16806D332179j49576j74532l72042m78602m52661k27806o9514K6650J20521p9490
16796B475127l30260k52634k41151J0637j54868j98071j390j45954k90989j17729
16786G52718K7551P1717P2954J55177J6858k56914k28889N5102j24747k6855K59799
16775G74471N4722j03443o5254j98030j20774K8120j09762q2561j34410j09696
16765f6617J84999r9501j19118J2560R743K42080p440l3287K3014j7783J36643
16754B65293O1109k5936j48510J20534J7546K8295j48551J63314J92460k4743
$$ y = [24891464, 20225703, 16747195, 14179741, 12204013, 10762538, 9704197, 8851747, 8028272, 7213932, 6628508, 6387320, 6118306, 5696326, 5373930, 5036466, 4646972, 4332179, 4182603, 4008071, 3636029, 3157427, 2704766, 2476960, 2407446, 2434096, 2554617, 2475127, 2144867, 1892233, 1651082, 1661719, 1506851, 1308780, 1307390, 1161436, 870447, 752718, 780269, 851986, 924940, 1080117, 1096975, 840061, 611172, 666274, 541527, 514672, 774471, 829193, 725750, 660496, 462466, 341692, 369812, 260050, 177489, 43079, -66617, 118382, 18881, -100237, -87677, -77934, 164146, 156706, 123419, 146433, 128650, 265293, 326402, 300466, 151956, 272490, 290036, 318331, 169780, 333094, 525554, 500811]
16744E00811j71269l4614P3746R9087K0566L1280k0446j00158j84465j1483r1588
16733A11467k6835M7935Q539L0276j56205m0987O1103m8933J95169j0194q5809
16722H5526o7292J8478K7820k2545J53547J59240M4352p6441r7396q5015k07181
16711f6907l0938K5359o4100J10206N5975J20284Q0174R8077J58171j58683n8252
16700B69366r4982p6618J22468K8172j26544n5074J2849M0999j00593r8518j50431
16689b28906L9359J79146J21321q4214o4045J27581J45303o9420p2901O7298j15032
16678D5490r7813o107J28894J09908K2173k9604o8670j66981j22584J37087j7741
16667f5948k2275R9143J41956p1794j15831o3914P3546J27446l2221J42289j40015
$$ y = [500811, 329542, 294928, 368674, 467761, 488327, 519607, 499161, 399003, 214538, 203055, 111467, 84632, 132567, 141106, 171382, 15177, -25810, 35293, -13640, 181529, 171335, 85526, 18234, 36712, 64532, 41987, 195534, 354774, 399126, 322685, 225289, 140274, -66907, -97845, -72486, -136586, -26380, 29595, 149879, 230053, 328130, 486301, 327618, 269366, 174384, 97766, 220234, 248406, 121862, 66788, 79637, 120636, 20043, -78475, -228906, -189547, -10401, 110920, 26706, -37339, 90242, 235545, 166125, 93224, 160522, 45490, -52323, -58430, 70464, 180372, 202545, 172941, 104271, -62710, -185294, -48207, -65948, -88223, 10920, 152876, 81082, -34749, -98663, -25117, 102329, 70108, 212397, 72382]
16656G2382r9807k195J55408P9587j26791j28253R0078O6452M734J1413k16210
16645i3202J11005M2246j26132L4777l287r9255l6744L0603K72408q5689j875
16634D4855O3688j97947J13401n3957q6191J60545l4465j01024m241j08201p2684
16623b76221n2001P7620J29178j11023j3785Q0670l6397M1097P3844O5123J1516
16612a0379M4520m8593P5828P037j12725j4869j09959m8528J38381O2110o1057
16601g8234L6988m3655Q9466K9453q3619O3382K24213J22025k19903j80119j11706
16590a51709n4752R7390J7616O7851P2350K8000J9778J44204J23896Q0921O371
16579D51916j2198k52248j54986J98984J46793N4299j56863j06699j01688j29554
$$ y = [72382, -27425, -29620, 125788, 205375, 78584, -49669, 40409, 106861, 111595, 123008, -93202, 17803, 60049, -66083, -31306, -34593, -133848, -170592, -139989, 132419, 46730, 44855, 108543, -89404, 23997, -29960, -116151, 44394, 9929, -91095, -95336, -203537, -276221, -328222, -250602, -121424, -232447, -246232, -165562, -201959, -160862, -87018, -21895, -10379, 34141, -14452, 61376, 68413, -44312, -59181, -169140, -217668, -79287, -17177, -78234, -41246, -84901, 4565, 34018, -49601, 13781, 237994, 360019, 140116, -40003, -151709, -206461, -109071, -91455, -23604, 48746, 76746, 96524, 240728, 364624, 445545, 451916, 439718, 187470, 32484, 231468, 378261, 432560, 275697, 168998, 67310, -62244]
16569f2244J9271J22572O6088j21178n2389K8051n5696o8096l9039Q1885L94172
16558C13397k144j38796k27294R6765J41134j25098J1850j32436j04047J05946
16548f0723J26391J52302O8315k12401j76023M0254K10151p7278j67737l5515
16538a32264j4916O7385Q4890k886p101R0154J57721l6083k05595j72600r1610
16527b62905O2014J53397N2646q5925J09734J32257j01229k45128M5105L1299
16517a08735K6178R0963n3505N0418P1061Q332m929J1066k77025M0549J0606k45478
16505c80499J11247J43613J0541R697O6774J22426q4349q0623N3649J23911J5013
16494A11400m2570k7045j12355n3626j4338L1114O2252L4485J4705k2198o5782
$$ y = [-62244, -42973, 79599, 145687, 24509, -27880, 171, -55525, -123621, -162660, -80775, 313397, 311253, 172457, -54837, 41928, 183062, 57964, 69814, -62622, -166669, -60723, 65668, 217970, 286285, 73884, -102139, -61885, 148266, 70988, -96749, -132264, -147180, -79795, 5095, 2209, -4892, 85262, 242983, 206900, 1305, -171295, -262905, -200891, -47494, 5152, -80773, 28961, 161218, 59989, -185139, -140034, -108735, -82557, 8406, -45099, 5319, 76380, 84712, 79783, 90849, -186176, -145627, -135021, -380499, -269252, -125639, -115098, -105401, -38627, 83799, -550, -81173, -27524, 96387, 111400, 68830, 41785, -70570, -124196, -138534, -107420, -45168, -10683, 4022, -18176, -83958]
16483h3958k4463M2270k52190o5704O5819O6195Q2851P0807K5817R603J9288k3122
16471f6787m1204q3696L8380J41479N3446j27511l2409Q6328p2347k4641p1776
16460b00738J1057J81694J20373q9836k82594k4274P7774N7440N1808J49743P6666
16449A29113q0431n6514K1492K5528J84738o5406j3035r5686r6565R9276n2966
16438d56J09974J47615K947Q1282j98331j04049M305q4923J52412O1539l1605
16427A40710j08730L6001J06084j51975K4877K41624O8487j28835j72927q2969
16417b7653o1799P7595R0587r0574N6636K5320M2884p7534k5953n6710J7363J19220
16405H9382L6738p2114n9787N7213o5069J5573K9849K859j8578L0369j33097j78871
$$ y = [-83958, -108421, -66151, -318341, -384045, -318226, -252031, -169180, -98373, -72556, -62953, -43665, -66787, -107991, -191687, -153307, -11828, 41618, -85893, -118302, -31974, -104321, -128962, -200738, -189681, -7987, 112386, 22550, -260044, -284318, -206544, -149104, -97296, 52447, 129113, 48682, -7832, 13660, 39188, 223926, 158520, 145485, 49799, -46766, 52510, -456, 109518, 257133, 260080, 341362, 143031, 38982, 43287, -41636, 110776, 172315, 140710, 31980, 67981, 174065, 22090, 46967, 288591, 357078, 228243, 55316, -27653, -89452, -11857, 78730, -11844, 44792, 70112, 112996, 35462, 9509, -47201, -29838, 89382, 126120, 54006, -5781, 51432, -13637, 1936, 31785, 34644, 16066, 46435, -86662, -265533]
16393b65533O7231K08649J11859q9393P053M6889l9205o153N2178J89142J69133
16382D51850J2870p8359Q0144L36813K49783J12289J41364j33285j56958Q2897
16372A099408j9290j23637r4651j97270k41283j87446p9712N8453p519K9819L9323
16361B76195L6025J01544o7689q3873j94113J28229J754l8532q5545j14796J03342
16350F2541K7521J2369L352j36080j929J36961n1956k7047o8295k4550k15557
16339b82670N0814L6950j89865M9759J76626J13464m3716l8806J09459P2660n2733
16328A942J10427J51814l07201r4J97556P2386J01103P8617J1644J26980R0562
16317F35736O570K25619M4167m8759M9835k14695j71715k32727k39972j21541
$$ y = [-265533, -198302, 10347, 122206, 32813, 39866, 86755, 47550, 41397, 93575, 282717, 451850, 464720, 386361, 466505, 803318, 1053101, 1165390, 1306754, 1173469, 1016511, 1099408, 1080118, 956481, 861830, 664560, 423277, 235831, 156119, 214572, 207053, 236872, 276195, 312220, 413764, 346075, 262202, 68089, 196318, 198072, 159540, 73995, -40801, 62541, 90062, 102431, 105783, -30297, -32226, 104735, 52779, 25732, -42563, -67113, -282670, -231856, -194906, -384771, -335012, -158386, -44922, -88638, -127444, -17985, 54675, 1942, 112369, 264183, -43018, -43112, 154444, 226830, 327933, 406550, 418194, 545174, 635736, 642306, 867925, 912092, 863333, 913168, 698473, 526758, 294031, 54059, -67482]
16307f7482J86888m4854J6061K6760N8218k5663j56789l8643K02656J96507j51394
16296B02265j74645j39021P0522J36074l3847j8430j02793k1308n1441M5108n139
16285i2655j9631P5111k504j32308j02041K9795J56900L3732J80256q0759j35822
16274h9926q6291J02277o6042L5467L3483J75274J70952n6765j39203l4356o6890
16263b2020j23416o8007j58714O6699P0970L5478O3361J11543L3929K6931N0382
16252H7136j36537j44924K0270o0574M4730J21362n3649Q6004K5206m9794K17639
16241A56869J11160J06551q9241j84728j05961l5929R4014j72558k6591R228L6919
16230a00267J0804P9105K01871K0083k6188j52416O5006n8527m5400K05902P768
$$ y = [-67482, 119406, 74552, 90613, 117373, 175591, 149928, -6861, -45504, 157152, 353659, 202265, 27620, -111401, -40879, 95195, 61348, 42918, -59875, -81183, -132624, -87516, -92655, -112286, -37175, -39679, -171987, -274028, -244233, -87333, -53601, 126655, 45896, -89926, -176217, -73940, -139982, -104515, -71032, 104242, 275194, 218429, 79226, 44870, -22020, -145436, -213443, -372157, -305458, -234488, -199010, -135649, -24106, 9823, 36754, 87136, -49401, -194325, -174055, -234629, -189899, -68537, -122186, -36182, -10976, -60770, 156869, 268029, 374580, 285339, 100611, -5350, -41279, 52735, -119823, -146414, -137186, -100267, -89463, -10358, 191513, 211596, 185408, 32992, 97998, 39471, -5929, 199973, 207741]
16219B07741n1154n8988J0296J4642R4498j3166q4108j19229K9548J68882j09664
16208H9298l26236j17566J93606j01328n9107J30788J73788K8737n4746O5135
16198B2369R0207P7080J36248J33130j7707j66642q0460m3920Q9254n4192q1328
16187A04039l6462M0516j31141m8460J10408j56372N7914J18446p0568r1568J2498
16176i0750j9916J52350P5942r0682k97771j6582J25157R1050L8014l7572j51294
16165b22054m2887J11309R8235j8482N0089j03170j99621J67801J10009k49539
16155b98310K2976J21535q2998j48679M7658K6634L495M8593J56785J71238k16213
16144a47286m1351J20977L9101M0911n9203p816r7293N4901J25728N7316n3524
$$ y = [207741, 156587, 97599, 107895, 122537, 217035, 203869, 119761, 532, 30080, 198962, 89298, -236938, -354504, -160898, -262226, -321333, -190545, -16757, 11980, -42766, 22369, 112576, 189656, 325904, 459034, 441327, 274685, 194225, 150305, 239559, 185367, 104039, 67577, 108093, -23048, -71508, 38900, -117472, -59558, 58888, -11680, -103248, -90750, -110666, 41684, 117626, 26944, -270827, -287409, -162252, -71202, -33188, -70760, -222054, -264941, -153632, -55397, -73879, -23790, -126960, -326581, -158780, -48771, -298310, -275334, -153799, -236797, -385476, -337818, -311184, -307689, -259096, -102311, 68927, -147286, -188637, -67660, -28559, 12352, -46851, -54667, -151960, -97059, 28669, 85985, 32461]
16133C2461J8893N3568j71899p9729M3837J78276K93j25801l1416O7106O2912
16122D8501K4764J10265l2720K0882j39335j59466k7518o003P1383Q384N0275
16111c0588r8761j67541r4828K44311J21382q1560q5472J87059J84626O0083q004
16100B30707j10749j27208o8916m3787P4573K4703J27019J53451P7948k06292
16090A31449r1774J21248r2688j09414J61625M7572P697l2307p6339O1784n1937
16079G6916J2393p2110J34229O4330j47108k29818J15931K30406k374j6662j62877
16068C256j88469K42100J12684q5562q7878j9972o2419o461J42117L1463m4589
16057C6270j6257k2128Q4087R3564J00595j28693r1873n6859k2896J7244R5632
$$ y = [32461, 51354, 104922, -66977, -146706, -102869, 75407, 75700, -50101, -81517, -14411, 48501, 73265, 183530, 150810, 171692, 32357, -127109, -154627, -160630, -89247, -80863, -30588, -129349, -296890, -391718, -147407, -26025, -107585, -193057, -5998, 178628, 238711, 230707, 119958, -7250, -76166, -119953, -45380, -20677, 106342, 259793, 337741, 131449, 39675, 160923, 68235, -41179, 120446, 168018, 175715, 143408, 67069, 128853, 76916, 89309, 17199, 151428, 215758, 68650, -161168, -45237, 185169, 182795, 166133, 3256, -185213, 56887, 169571, 84009, -3869, -23841, -86260, -92721, 49396, 80859, 36270, 20013, -2115, 81972, 175536, 276131, 147438, 55565, -1294, -24190, -6946, 88686]
16046H8686m5139k7397J0122j40500j792M6220q8279J4766K73041J7550m9517
16035I7761j9492J7805j71345p2894N5276k4037j71215Q4188K85308l7234k39617
16024a95496K5524J18345P4222o3311o1022o7153l3891M7650N246J23839J3959
16013a2088j48180r6928J45595J34892N8290m5495J63336k0800K2882o3175j50612
16002a2283l3624j33123j54212O2776J31327Q1530L8340K49803n4807k11029k05060
15991b40362M3535J92182R1830m1178j07420q8273P1511K12786r7211j78015P2926
15980f7689q664j25653K9051n7350P3724J85234J08734m128j98364l491L53p9871
15968a48114O4723O3604k6053j76921r0728l7604K00463Q3034P597m9331J8337
$$ y = [88686, 43547, 16150, 26272, -114228, -116020, -69800, -158079, -143313, 129728, 147278, 97761, 78269, 96074, -75271, -148165, -92889, -116926, -288141, -203953, 81355, 44121, -195496, -169972, -51627, 22595, -40716, -101738, -168891, -202782, -155132, -149886, -26047, -12088, -160268, -257196, -111601, 23291, 81581, 36086, 199422, 178622, 201504, 138329, -12283, -45907, -179030, -333242, -270466, -139139, -57609, -19269, 230534, 175727, -35302, -240362, -196827, -4645, 87185, 46007, -61413, -149686, -78175, 134611, 37400, -140615, -67689, -76353, -202006, -172955, -230305, -156581, 28653, 137387, 133259, -65105, -68596, -68243, -148114, -83391, -19787, -45840, -222761, -313489, -351093, -150630, -67596, -59999, -109330, -90993]
15957i0993M9261O1412J28147L8703q0869K4072L794k52191j00674j46096j10707
15946d76141L165K03650M6733K4788M2213J51213L5711j66047K04238Q3681j3551
15935A39653j7970J13940K3382k07257q1627j91356M8571J61340J3055Q2114K7694
15924A11539k4390l2207K655j57844q2224O2425P264o6351R6099J61056J7793
15913I5815L4025J40997L1176p0667k7778j37208k2156j2350Q2137K8694o9884
15902G2801j90808p5585j66751m670L0247J38266R6860k15355r6629n3198J74969
15891b89853K58075l1428j09263j4357M0901k5350k4926J01426K7355J36923n889
15880F3614o8338r6188J44861r9016J5710J0199O8976R2939J09079j09207r9558
$$ y = [-90993, -41732, 19680, 147827, 186530, 105661, 129733, 133527, -118664, -219338, -365434, -476141, -472976, -269326, -222593, -197805, -155592, -4379, 31332, -134715, 69523, 153204, 139653, 121683, 235623, 259005, 51748, -29879, -221235, -172664, -11324, 1731, 83845, 111539, 87149, 54942, 57597, -100247, -182471, -120046, -112782, -179133, -83034, 78022, 95815, 129840, 270837, 302013, 231346, 203568, 66360, 44204, 31854, 113991, 142685, 72801, -118007, -193592, -360343, -365013, -334766, -196500, -99640, -314995, -411624, -464822, -289853, -31778, -63206, -172469, -186826, -145925, -171275, -196201, -94775, -67420, 69503, 63614, -4724, -100912, 43949, -55067, -39357, -29158, 39818, 132757, 241836, 132629, 33071]
15869C3071M0631J6403p4552m258Q6597m7409j38629p9441k3561O8464J2043O5160
15857d5481J06471K5059J01890n2433j14380j44598j86856R3858K36176J53125
15847A72831o6077j7244n6272j95568l2902P6025K06210k1666M9869m0692j14656
15836d0142k3517j53020j69896K9328K30508J31230q7147r9498j8520p0867k09128
15825d80669J73247K63610J41347J0328O0159l4876o0253n6559L5644n918L6123
15814H2183k81320j76653N3360m9340Q2459R5767K34333r6541j31571p0916R2271
15803a65968J40767L7902m6105k4876M8292P537k2687K5216J18669o5583n3172
15792hn9262j10950R1512r3866j0866L9750J05494R457J6011M638j20622R9429
$$ y = [33071, 73702, 90105, 15553, 11295, 97892, 50483, -88146, -167587, -191148, -122684, -110641, -45481, 60990, 86049, 187939, 135506, 21126, -123472, -310328, -216470, 19706, 172831, 106754, 89510, 33238, -162330, -195232, -119207, 87003, 65337, 115206, 74514, -40142, -63659, -216679, -386575, -357247, -126739, 4491, -82656, -182154, -200674, -271541, -480669, -307422, -43812, 97535, 107863, 168022, 133146, 72893, 16334, 51978, 46060, 82183, -199137, -375790, -322430, -371770, -289311, -193544, 40789, -55752, -187323, -258239, -165968, -25201, 12701, -33404, -58280, -9988, -2451, -25138, 78, 118747, 53164, -8, -59270, -170220, -78708, -172574, -183440, -143690, -38196, -28739, -12728, -8090, -128712, -29283]
15780b9283K06973n86n2750j8220O9125j8933q9034p4502Q8700P9480J38670j7462
15768B82178j81606k62124j62281j25564K42126K4408k2390J89175l4116j66698
15758b16892k0346K3709j3564J92404O3362j40379n9592M198L3102r621j88076
15747c31695m1859o7075K5219K31569J09717o6588l8192l3790J73864J54062k00785
15736h5553j9318K14778o8785j99046k8940j3565M4480J24793N6760j58964n2962
15725a86322l5346M0923N4392J09159O7271j86370p5797q3889K46532K28688R5019
15714B74260J37232j71042q4359n7091j70861q4738p1934J48896J53453j51678
15704g7862j0657L56014J2358j32581o7211j4619j45981k9632M374O8764n7091
$$ y = [-29283, 177690, 177104, 124354, 106134, 175259, 156326, 67292, -7210, 81490, 160970, 299640, 282178, 100572, -161552, -323833, -449397, -207271, -182863, -205253, -16078, -50194, -216892, -237238, -213529, -227093, -34689, 28673, -111706, -171298, -167100, -133998, -143619, -331695, -373554, -440629, -415410, -183841, -74124, -140712, -178904, -212694, -38830, 115232, -85553, -104871, 109907, 41122, -157924, -186864, -200429, -155949, -31156, 25604, -133360, -186322, -221668, -180745, -126353, -17194, 50077, -136293, -212090, -295979, -49447, 179241, 274260, 411492, 240450, 156091, 99000, -71861, -156599, -228533, -79637, 73816, -77862, -88519, 267495, 279853, 147272, 80061, 65442, -80539, -110171, -105797, -37033, -94124]
15693i4124R019Q8613n9794m654k2391j7854l3958j40520j6206K63930J24598
15682I6659J94649l8601r8558O5320P1932j93776n9342j09972Q2454M8514J35290
15671A94569j22126k10126J1732r2565m0105J66923m2399j21678r4789J56883
15661a93681M0498p840r4270j32146K47073J43561M6010O1974M9039j10551k34716
15650a85049j02781j45314R1876J00641J74464J99165r4376J6841P057K44680
15640C07204J03297j81904j3478K566j09074l9648R4733J12846J6836j27054j414
15629A64910m4973j74674k16269Q9945J42401J72153M3772p5630q0367k1784J9068
15618A8552J16508Q7000r9536j05109o5588M9315j25837K223K2897j5047L176
$$ y = [-94124, -85105, 3508, -56286, -60940, -83331, -101185, -135143, -275663, -291869, -27939, 96659, 291308, 252707, 154149, 219469, 291401, 97625, 38283, -71689, 10765, 59279, 194569, 72443, -137683, -125951, -218516, -258621, -91698, -134097, -255775, -350564, -193681, -153183, -161023, -255293, -387439, -140366, 3195, 49205, 111179, 160218, 49667, -185049, -287830, -433144, -341268, -240627, -66163, 133002, 38626, 55467, 62524, 307204, 410501, 228597, 215119, 217685, 108611, 68963, 163696, 276542, 293378, 166324, 164910, 119937, -54737, -271006, -181061, -38660, 133493, 177265, 101635, 21268, -516, 18552, 135060, 222060, 122524, 17415, -48173, 1142, -124695, -122472, -99575, -114622, -111446]
15607a11446N3271Q6150N8395j39693j04731O3544K6694R6793J2137M2365M3276
15596A26755l0605Q3537L2849j12110o0761l9017n9225J981J50988N1413J80034
15585C25839N77j48108M1604j18750k000n0727o8176M9736j38752K9320l13J9816
15573e9934L814N9100P1309j2395j60341J6260R9608m1588k0324n0473k06K884
15561i2286j30634J42081J62661n4580m8640J8486j0054J8328l6923r8577l7149
15550a67287J19971J80990Q778l0686l2901k116j30638k5542j3715O4927j30972
15539a59191q6678N1443p776R8525m8471k8215P7320N9081O1839j3426k23519
15528b19068m9792K3311p95M0755J5638P7774l453K4494J7387J6443j20359k4289
$$ y = [-111446, -58175, 27975, 86370, -53323, -158054, -94510, -67816, 28977, 41114, 83479, 126755, 96150, 179687, 212536, 100426, 39665, 648, -58577, -56596, 94392, 145805, 325839, 326416, 178308, 219912, 101162, 99162, 48435, -19741, 29995, -108757, -79437, -79750, -59934, -56120, 2980, 74289, 61894, -98447, -82187, 17421, -24167, -44491, -94964, -95170, -92286, -222920, -80839, 81822, 27242, -21398, -2912, -12966, 5362, -31561, -130138, -167287, -47316, 133674, 142452, 111766, 78865, 76749, -53889, -79431, -93146, -28219, -159191, -245869, -194426, -202202, -103677, -152148, -180363, -103043, -43962, 17877, 4451, -219068, -268860, -245549, -246344, -205589, -189951, -112177, -115630, -91136, -73749, -57306, -177665, -201954]
15516b01954Q6156P9184N5605o3521j64807p2747K74780j39644L3204J45026L1379
15505F2661N9975j37243m9862L4924j47432j53998r5033o2818P0224L9934J43327
15494b35341j195J01756r1285j01706L9724m3743M166N5312J19418L8720o682
15483a20856J24699p9109j74282m5083N1581J43507j2457j28722o9886M6645M5494
15472b18469J14154O819Q5546L291M4885J32759P274j69776k75285M0275K27476
15461a051J84331j24275m3988o2326q1640J57486l340n9212N5429k6799N4459
15450D9074J29141o1005p46J21369O2458k9541n298K1377j36924q190k1540l7610
15438H2565n3873r6541m6768l5554K2185P1484n499Q764K16782Q6266j36613j12948
$$ y = [-201954, -115798, -36614, 18991, -44530, -209337, -282084, -7304, -146948, -113744, 31282, 62661, 122636, -14607, -64469, -29545, -176977, -330975, -426008, -488826, -418602, -378668, -235341, -236536, -134780, -226065, -327771, -288047, -331790, -327624, -272312, -152894, -114174, -120856, 3843, -75266, -249548, -294631, -243050, -99543, -112000, -240722, -310608, -263963, -218469, -104315, -97496, -11950, -8659, 36226, 168985, 176259, 6483, -268802, -228527, -1051, 183280, 59005, 15017, -47309, -128949, 28537, 25197, -34015, 21414, -5385, 49074, 178215, 117210, 116464, 237833, 300291, 270750, 265452, 286829, 149905, 141715, 120175, 82565, 28692, -67849, -114617, -150171, -127986, -56502, -62001, -53237, 163545, 249811, 113198, 250]
15426B50j3563J26361r2149J8037J16305k46624j95829j06731J01771L9058J64190
15415h8924J25991j6921j82742J1827J13115p3498M7155j1960N8368m601j6264
15404c8454J74063O1179P744L4137q8757r0028j12162p3497P1847M7818J01399
15393I5289r3717j29177Q8542R2204o400Q764k29525k17193R9584J02820j48849
15382c37658N6706M9990L3671q7484K8326K2037n1158L9356N3696J1031M3646
15371a37841o5763q0764J18472j12934j92783k1249K21518J17345M8545n949l0642
15360a42045j24557J37790P5391J221N8413J11574m6840k6797r4028l7186J71400
15349H4336j80788j06095J0860J1405R5875n4267N5573J0878M1096K9323p0594
$$ y = [250, -13313, 113048, 20899, 38936, 155241, -91383, -287212, -393943, -292172, -253114, -88924, 37067, 20146, -162596, -150769, -37654, -111152, -63997, -75957, -17589, -22190, -38454, 135609, 196788, 204532, 238669, 149912, 59884, -52278, -125775, -53928, -6110, 95289, 1572, -127605, -39063, 53141, 46741, 55505, -174020, -391213, -291629, -188809, -337658, -280952, -230962, -197291, -284775, -256449, -234412, -285570, -246214, -192518, -181487, -137841, -203604, -284368, -165896, -278830, -471613, -492862, -271344, -153999, -105454, -111403, -142045, -266602, -128812, -53421, -52200, 6213, 117787, 70947, 44150, -49878, -87064, 84336, -96452, -202547, -191687, -180282, -84407, -138674, -83101, -72223, -31127, -1804, -72398]
15338g2398J54521n6227l6694J7079J4989l2300N5129j08295j5836L115k05370
15327b82287n8951K01783P1703q2357M1089P6103j37902K5214L4055j2206L5175
15316h8581n8187r7119p7929k8474J42059N8500P3888L4658J1722l0101j1275
15305g0839p5664M1139q377j15535j81536j98385R5375J70646K1775n6719N3824
15294c24296L0087k7434J66003J81270N3014n6263Q022l1709J03235L1629j35770
15283b212m4258n3063p1664Q9737J41602J34694j17532k21311r2760P9156Q93
15272a56718L8039P7028K23445K52783Q806O6797Q9934l727p1933j71587P528
15261C60395m7577j75177j56479R7106J465J02784J11619k58545j32706q204j14657
$$ y = [-72398, 82123, 25896, -10798, 6281, 21270, -11030, 44099, -64196, -80032, -76917, -282287, -341238, -139455, -67752, -150109, -109020, -32917, -170819, -145605, -111550, -123756, -88581, -146768, -243887, -321816, -350290, -208231, -149731, -75843, -41185, -29463, -59564, -70839, -146503, -105364, -113741, -229276, -410812, -609197, -513822, -343176, -321401, -378120, -324296, -294209, -321643, -155640, 25630, 78644, 22381, 30403, -1306, 101929, 133558, -2212, -46470, -99533, -171197, -81460, 60142, 194836, 77304, -144007, -236767, -157611, -156718, -118679, -41651, 181794, 434577, 443383, 510180, 600114, 596387, 524454, 352867, 360395, 312818, 137641, -18838, 78268, 79733, 182517, 294136, 35591, -97115, -105319, -219976]
15250b19976M7093M6490J16844J34692j1481k05834m0989P1999J33058L71229
15240D43125P1125k87932j33825L9895l6624m4273n4236P2019j11664m4735P1673
15229a5452j3031l6104K2630p2103m357R4197J29121J7495k19776j27768L3751
15218a91397J84140J3864K0131j9034m702n4089j01563P3130J07827J02629n1954
15207G8982M7978n3795k33942r725J05218P7716k4859q5353p0169j12892j39071
15196d19912l4215J88212L23783m2979j0728O7072j64607j25934Q0727k3225P3689
15185h8117J01649o3197M6067J26548l4339j35234k87556j20939J04618O5914
15175b84586P2401P7615Q2670n7182J44122N3659k30500N4876J1399j55554P6840
$$ y = [-219976, -172883, -126393, -9549, 125143, 113662, -92172, -133161, -61162, 71896, 443125, 514250, 226318, 92493, 132388, 95764, 51491, -2745, 69274, -42390, -87125, -15452, -28483, -64587, -41957, -114060, -118417, -24220, 104901, 122396, -97380, -225148, -191397, -7257, 6607, 26738, 7704, 3002, -51087, -152650, -79520, 28307, 130936, 78982, 126960, 73165, -160777, -170502, -65284, 12432, -12427, -97780, -167949, -280841, -419912, -454127, -265915, 57868, 14889, 4161, 71233, -93374, -219308, -138581, -161806, -88117, 13532, -49665, -3598, 122950, 88611, -46623, -334179, -455118, -350500, -284586, -212185, -134570, -51900, -109082, 35040, 88699, -141801, -86925, -75526, -231080, -154240]
15164a54240R6985n862j04372r4492r605q901k554K8855N3248J86468j94300m0845
15152b49615J72166J44001J34104J787n3285L8278l6520j13328n2L3376J4573
15141H5485N1622J44834p6544j41151L2375k01078K8326J22972J05433j1946J52240
15130B92568J8629p4998p548P5778k1801k32554m9569M360M2590J59669j9467
15119A87657J02466q8646o2800M052O25k5213J1584J8472m5254r3740r6912l673
15107i1382M8132m9541K9850J37643j12558r2131k0351M1065J94408o8810K0025
15096C6350n5984j1043J14219Q1427q7608J39301j09690k00913K03923Q4166p7368
15085A16780l8540m7156j26950K7468j6967l4402J85157J12960o7458O6890J7673
$$ y = [-154240, -57255, -63117, -167489, -261981, -271586, -280487, -283041, -254186, -200938, -14470, -208770, -249615, -77449, 66552, 200656, 202443, 149158, 187436, 150916, 37588, 37536, 70912, 85485, 137107, 281941, 205397, 64246, 96621, -104457, -76131, 46841, 152274, 140328, 292568, 311197, 236199, 228651, 304429, 282628, 50074, 505, 4865, 47455, 207124, 187657, 290123, 201477, 138677, 142729, 143354, 118141, 129725, 148197, 102943, 9203, -87709, -91382, -43250, -92791, -62941, 74702, -37856, -129987, -150338, -109273, 85135, 16325, 36350, -19634, -30677, 83542, 164969, 77361, 216662, 106972, -93941, 109982, 194148, 116780, 78240, 31084, -95866, -68398, -85365, -119767, 65390, 178350, 110892, 177782, 195455]
15074A95455J5828M520M3791j6149l50987j2421O9421O0506q0066Q7335q5238
15063f8005q0155J82769l5703j01170J74336P5317O8140o9888j66733p5707j0550
15052a07349q0033l504J15428K699p8750Q4174J61999n1069k83029J10301J20019
15041i114P0858j66420R0934J56763r0305j88654p5924O2994N2693l0340l2954
15030a59469R4044L4355j87757j4657L1319J9031O2079K0026n9648L6417j6916
15019a41176J59297N7021j06467j04484J19564Q2622L00q5774j26331p1263Q3065
15008a33626M0054j78486q0583n441J80499J4331K7291M6835K4789j8173k17085
14997b99595J8084R8051L4019J05364J24988J49709q3645j81891k4860j50427
$$ y = [195455, 211283, 215803, 259594, 243445, -107542, -119963, -50542, 9964, -70102, 17233, -68005, -148160, 34609, -1094, -102264, 72072, 147389, 215529, 145641, -21092, -96799, -107349, -187382, -190886, -75458, -72759, -151509, -67335, 94664, 43595, -239434, -129133, -9114, 61744, -104676, -13742, 143021, 52716, -135938, -211862, -148868, -96175, -126515, -159469, -65425, -31070, -218827, -233484, -202165, -183134, -121055, -101029, -160677, -124260, -141176, 18121, 75142, -31325, -135809, -16245, 66377, 66677, -19097, -145428, -216691, -133626, -93572, -272058, -352641, -358082, -177583, -163252, -135961, -89126, -64337, -82510, -299595, -281511, -183460, -149441, -44077, 80911, 230620, 146975, -34916, -59776, -210203]
14987b10203L4458J25013J09303O6486L9042k24630j92282o6707K49627J1662
14977e8231j24973Q6364J63314J08086j05942j15553j15519j77495O2061N5293
14967b22595J85643K1375j45468j03944L4396K851j23894n9096j1792L67793K40499
14956A85768r6793j73652p3590O7613n8353O9964J16963l8093j25586k10758j07762
14945d44279K6125J39224J7942L4213M6322N0471J14045O5550o2238J4444P7464
14934G9283j65037O595J32663j17422k26415O2708J45812L56236N8991j7064N3386
14923C69736j40690l26649j7330J04495N7057l746J6365L960M3523q0114p2014
14912d5407p8215j22693O2657J79022P2719J6102j93582q1862J07935n4483j407
$$ y = [-210203, -175745, -50732, 58571, 125057, 164099, -60531, -252813, -319520, -69893, -58231, -183204, -96840, 66474, 174560, 68618, -46935, -162454, -339949, -277888, -222595, -36952, -15577, -161045, -264989, -230593, -227742, -351636, -410732, -422524, -54731, 185768, 88975, -84677, -158267, -90654, -149007, -79043, 37920, -173, -125759, -336517, -444279, -418154, -278930, -260988, -226775, -180453, -129982, -15937, 49613, -12625, 1819, 79283, -85754, -79159, 53504, -63918, -290333, -227625, -81813, 274423, 333414, 316350, 369736, 229046, -97603, -114933, -10438, 46619, 42873, 59238, 63198, 106721, 26607, -45407, -123622, -246315, -183658, -4636, 68083, 84185, -109397, -191259, -83324, -137807, -139214]
14901a39214N9694j22750N5522K76777m8079j80103j04953j11038k4253J24175
14891b14222J89059J90006L7407m2929L6311j07039o3739r6465j07400J4856J15763
14880d8392P0477j00229k32953m3548L5887K9988k6673K17283J92699q046L7279
14869A23772J28929q0931k03279j3666N4456o578m9521j50905o7001J3938M1317
14858b09469K6148j7481j4889P7292M4455m5865l8577N7879O0536m8309j415k4805
14846a34500j14692Q5496J33073P2980M8471J42097J57848N8134o6844K6266j95926
14835B12403n9730j38060j32206k2442J80327P0895p787j63031o7815K13267O4132
14824A49953j51113K8666J32938k29878j22353N2131j9991J77974J04395j14598
$$ y = [-139214, -79520, -202270, -146748, 130029, 81950, -98153, -203106, -314144, -338397, -214222, -25163, 164843, 202250, 159321, 195632, 88593, 24854, -71611, -179011, -164155, -48392, 22085, -78144, -311097, -354645, -318758, -288770, -315443, -98160, 94539, 86493, 123772, 252701, 171770, -31509, -45175, 9281, 2703, -46818, -197723, -264724, -250786, -209469, -183321, -200802, -215691, -138399, -93944, -139809, -178386, -120507, -59971, -108280, -109695, -134500, -249192, -163696, -30623, 42357, 90828, 232925, 390773, 448907, 382063, 408329, 212403, 152673, 14613, -117593, -140035, 40292, 111187, 103400, -59631, -127446, 85821, 149953, -1160, 27506, 160444, -69434, -191787, -139656, -159647, 18327, 122722, 8124]
14814H124l2046R439q8275j31665M7781K09522J44697P9983p7406k29457J37339
14803G8036J13436M7790k38940l4950j72040l4656J90763J68645j40538j38713
14793a61167O3230J45784P1563j85971j94352Q2418N0138j52310j87169j7106
14783d84942N1218J34208J43346L17947K0731k15486j26175j93149j03094Q1646
14773c73750J62933J08517O2166j33329j91210K6295K34992Q4020k7918o0241
14763a07525o6750r3899q7583J11993K16264j63383J3057j72863P5464N7189o2903
14752b80939R436N0713N7543m1945M1026J43626p5008J24316j04270R4901M2543
14741F1942r3312j15291J05039R4100j34665m4255N0529j16967j53040j8437k0227
$$ y = [8124, -23922, -14483, -102758, -234423, -186642, 22880, 167577, 247560, 170154, -59303, 78036, 191472, 239262, 322, -34628, -206668, -241324, -50561, 118084, -22454, -161167, -97937, 47847, 119410, -66561, -260913, -178495, -128357, -280667, -467836, -484942, -433724, -299516, -156170, 161777, 182508, -32978, -159153, -352302, -455396, -373750, -210817, -102300, -40134, -173463, -364673, -338378, -103386, -19366, -47284, -107525, -174275, -268174, -355757, -243764, -27500, -190883, -177826, -350689, -275225, -218036, -280939, -271503, -220790, -163247, -205192, -164166, -20540, -95548, 28768, -75502, 19399, 61942, -31370, -146661, -41622, 52478, -82187, -126442, -75913, -192880, -345920, -364357, -384584]
14730c84584P6229P1429J96582J37327O8204J2202j25052r8201N5047P3135q2799
14719d81m3287k428J11910J01595k52771j38108K2254R3438j04160k4161K04841
14708c1358J88628o1404j02846j01422j84540L1588J49283P760j73937j89314
14698d67562j38758J96541J94292L9256r1336R7192K33399m590j27148j1061N7776
14687b1999k7735Q4092R7729K7008k7992k41358J87343J32812j16466K467q406
14676H7495J01524k8487o7387k14260Q3022Q0473k04098j22436J8726L8783m0201
14665b66846n5470J19174j33089n6397R2669K9437J3497l3086R0364J14744J5309
14654f9694Q1120Q047N3258r3855q5153k375p9755J585N9194J02807m9154R3319
$$ y = [-384584, -308355, -236926, -40344, 96983, 165187, 177389, 52337, -45864, 9183, 82318, -481, -43768, -46196, 65714, 167309, -85462, -223570, -201316, -107878, -212038, -236199, -31358, 157270, 95866, -6980, -108402, -292942, -261354, -112071, -104311, -278248, -467562, -606320, -409779, -215487, -176231, -267567, -170375, 63024, 58434, -68714, -79775, -21999, -49734, 34358, 132087, 159095, 131103, -110255, 77088, 209900, 93434, 95901, 87495, 189019, 160532, 93145, -121115, -38093, 42380, -161718, -284154, -265428, -226645, -266846, -322316, -203142, -336231, -392628, -299959, -270522, -257025, -290111, -199747, -85003, -69694, 11426, 19473, 72731, -21124, -106277, -108652, -188407, -186822, -127628, -24821, -73975, 19344]
14642A9344M5721K2066Q882n9908j09505k4544k3501j82614n2164n0009K7894
14631c78338J57870J77923n7849j28362n8115P5483l379j4900k8530M8493J20733
14620h8971O0632o1742Q2348j72283r9367R9970M2861N2152N4328L3268K65900
14609B69096J35972j30924m8464j70980k26812P024K7095K33666K5789o4932N9725
14598A16255l4894p9566N5174L9371M8740l4637k0265q6569j59509N3871M2236
14587e9793j21855L1781R5203J875P016k49594j40328j63461K24355L31228J28411
14576H4838j06005N5382J92528P7084j85636k65715K0390K9843J3142j24087j95531
14565d03767R46K49339K18443m2930J1844o2018Q5975N3865p5357M3980N7120
$$ y = [19344, 65065, 87131, 96013, 36105, -73400, -97944, -121445, -304059, -356223, -406232, -378338, -220468, -42545, -100394, -228756, -286871, -211388, -214767, -229667, -258197, -209704, -88971, -28339, -90081, -7733, -180016, -279383, -179413, -136552, -84400, -30072, 3196, 269096, 405068, 274144, 225680, 54700, -172112, -165088, -137993, 95673, 121462, 56530, 116255, 81361, 1795, 56969, 96340, 145080, 110443, 90178, 3609, -155900, -102029, -59793, -181648, -149867, -54664, -52789, -45773, -295367, -435695, -599156, -374801, -43573, 84838, -21167, 34215, 226743, 303827, 118191, -147524, -127134, -97291, -84149, -208236, -403767, -402821, -153482, 64961, 22031, 33875, -28143, 57832, 111697, 36340, 80320, 137440]
14554A37440K5889L5661k59422k9288J10224j66823j74343o5816j1098J68747
14544b28829J72791J169r6617R768J09610O6417K018O351J0631j18856M8247j55725
14532a73025P5279J37702m9753J9879J70568k61556k01397P8327J26484k13252
14522b90744L467K22974K04229l9404k25730j96201M2968R341m0203J17067J16818
14511g5418N9666j0202O095L4230j2786o1905J41119K0292o3597j85220N8379
14500h9347K07609J03334j15413j18225M8811M1399k4600j16215n5452K32915
14490A14816Q6619j67286j66906J14004K31125J23503j05465k0788k4945J2242
14480A96919o7846j85115n6279L4473M7857k4282M9144L5046j3112J23694O3032
$$ y = [137440, 163329, 198990, -60432, -89720, 20504, -146319, -320662, -386478, -397576, -228829, -56038, -54869, -151486, -141718, -32108, 34309, 36327, 42678, 53309, -65547, -17300, -173025, -97746, 39956, -9797, 10082, 180650, -80906, -282303, -203976, -77492, -290744, -287277, -64303, 139926, 100522, -125208, -321409, -278441, -269100, -309303, -192236, -75418, -15752, -25954, -19859, 14371, 1585, -60320, 80799, 101091, 37494, -147726, -89347, 118262, 221596, 106183, -12042, 36769, 78168, 53568, -62647, -118099, 114816, 201435, 34149, -132757, -18753, 212372, 335875, 230410, 209622, 184677, 196919, 129073, -56042, -112321, -77848, -29991, -54273, -5129, 29917, 16805, 140499, 203531]
14469B03531J13694K7252J5206j2943k12078k96478j22882P2547k8767j3942J42606
14458a12254K01520r4089k09452n2178R4194K798L4589k7287O1401P1270N1569
14447B2081j42513k08143R1800J34791o0905l5805J58169L7748k1322j9999j8068
14436f2166M2288l8858j13446J9354J68894K03516r1524p6131N5446q8792l784
14425A4797j66547m7159J66403R9302q3745j58078L3643J21334K16209q9237j35746
14414b8824j2118P6109O0475J43452N4656L519O8781l8829L5042q2456O3473j69668
14402A73612p5246R213j60039M882J05485R0067q0305J4630Q3703o5635n6889
14391D3478j30445J37997J06743L2146O1526l5307j29245k11282K0105N2615J80651
$$ y = [203531, 317225, 344477, 359683, 346740, 134662, -161816, -284698, -212151, -240918, -254860, -112254, 89266, -4823, -214275, -266453, -172259, -169461, -134872, -162159, -100758, -29488, 22081, -120432, -328575, -236775, -101984, -162889, -198694, -40525, -2777, -24099, -44098, -62166, -19878, -58736, -172182, -152828, 16066, 219582, 128058, 51927, 107373, 18581, 14797, -151750, -198909, -32506, 66796, -16949, -175027, -141384, -20050, 196159, 106922, -28824, -40942, 35167, 95642, 239094, 293750, 297269, 366050, 327221, 362263, 279807, 343280, 173612, 98366, 107579, -52460, -47578, 57907, 147974, 67669, 82299, 166002, 100367, 43478, -86967, 51030, 157773, 189919, 251445, 216138, 86893, -124389, -104284, -51669, 128982]
14380A28982N695o4250q2975M2782P3960j41906M1406L28027R1057k97540j25383
14369a45O3137q284J84467J74468r59j89014l21898k03835J59167J73949k4787
14358F266p3193n2023N6681J99031n9059k13061q6915J2241L2845J86331L9621
14347D8765L5947M7136l5457n0099o9838J0986L399M369p659j0374j37571Q8585
14335g1811N4417o184o3442p8645l9262P8687P3831j14133L0959K5893p454J14123
14323c021j71049M6040J4101K3691P1037j27611j61806K29534p4816m552K40841
14312H2389K25495n6954j83391K2021r4313m9970O6468L2118R3520k520j39638
14301d775M1810M3509N3757R7947k79483j08758J47275j6143K1498j26553j00936
$$ y = [128982, 134677, 70427, -12548, 30234, 104194, -37712, 3694, 331721, 422778, 125238, -145, 62992, 54708, 239175, 413643, 412684, 223670, -98228, -302063, -142896, 31053, 6266, -66927, -118950, -62269, 136762, 77703, -135358, -222273, -210032, -177187, 9144, 48765, 84712, 131848, 96391, 46292, -23546, -12560, -9161, -4792, -12451, -22825, -160396, -71811, -17394, -23578, -87020, -165665, -204927, -126240, -52409, -166542, -135583, -109690, -117144, -3021, -174070, -128030, -113929, -90238, -19201, -146812, -308618, -79084, -153900, -158452, 82389, 307884, 250930, 67539, 89560, -4753, -54723, 11745, 43863, 137383, 134863, -4775, 37035, 80544, 134301, 232248, -47235, -155993, -8718, -24861, -3363, -129916, -230852]
14290b30852j55638k7245J9277N1992J67803L9240K483L9594o5871l3970L26800
14279A33613K45553r0998j58353N5620J9192l4795j8580l3481j97553r5901n5093
14268b30776M7731j27135n7340Q4440J21413J41721M8320r5361j18130J13623
14258g1494L7143P32o4527j77364j7624N210J20159J44895m751n6507j7085N2415
14246d8798M351n0312L6098j0192O7059l0519k14167q673J02718J24957l1411
14235e8889J00625M0254R1381k3887j46392k677o6689r85n438j1870j23390o5835
14223b73792N5132R8376j02838M4357m6193r0054o1074K70770J34628j07128J049
14212g6767Q8373R4192l113N3050j16028J9126M6944J83880q9599k95494j94771
$$ y = [-230852, -386490, -413735, -394458, -342466, -174663, -135423, -132940, -93346, -159217, -193187, 133613, 379166, 288168, 129815, 185435, 204627, 169832, 151252, 117771, -79782, -175683, -230776, -183045, -310180, -367520, -283080, -161667, -19946, 28374, -66987, -185117, -71494, -34351, -33619, -98146, -275510, -293134, -287924, -167765, -22870, -27621, -84128, -101213, -48798, -44447, -94759, -58661, -68853, -1794, -32313, -246480, -255153, -152435, -27478, -58889, 41736, 81990, 173371, 149484, 3092, 415, -66274, -67259, -72697, -84567, -207957, -273792, -218660, -120284, -223122, -178765, -224958, -315012, -376086, -105316, 29312, -77816, -76767, 11606, 105798, 102685, 155735, 39707, 58833, 105777, 289657, 200058, -95436, -290207]
14201b90207l3787n8599R6244J95128J99616P929j10723q1858r4125J09268K9738
14190c1376R8635M1913j14730l0538Q7551R6814j67897q9908L3525Q5187J73949
14179A83125J44811j39833l3182R5641k52214n1353R0015J54597j3580j42049
14169C5978j22714l0654J66330p5079j51764J1321J51686J71264r392j32671j94953
14158a80648q7917K03960J60838J03449k41597k70152j14164O1834m757J08967
14148b60187J35826j02027j21223j86227J7217J70522l06Q620J31356J15982K6761
14137f3686M3162K3383O395j58841r277M6802j21470l3606n130L7108R7863J110
14125a36187k4458O9795J02259J7310j14375j51964P6866K03183Q7186k56925
$$ y = [-290207, -323994, -382593, -286349, -91221, 108395, 116324, 5601, -76257, -170382, -61114, -31376, 67259, 109172, -5558, -36096, 51455, 148269, -19628, -109536, -76011, 9176, 183125, 327936, 188103, 154921, 250562, -1652, -53005, 37010, 191607, 178027, 35978, -86736, -117390, 48940, -26139, -177903, -166582, -14896, 156368, 146976, 14305, -180648, -268565, -64605, 96233, 199682, -41915, -312067, -426231, -364397, -369154, -260187, -124361, -226388, -347611, -533838, -516621, -346099, -346405, -337785, -206429, -90447, -63686, -20524, 2859, 9254, -149587, -158864, -112062, -233532, -267138, -272268, -235160, -137297, -136187, -160645, -90850, 11409, 28719, -85656, -237620, -160754, 42429, 129615, -127310]
14115a27310J6226J06512m2302j3735Q459p0098J47759P7768l6389M427p093j33472
14103f9248R598m6362j18939J81130J26211n7993M7757j23120M2587N5338O1001
14092A07960k7673p5989j19289P0994K15638O2412j1837O5354j4055o1016j22057
14081I0442p486J20005L915j46027j65892J07825J9736j28512j8981J41103J47928
14070A64056j27827k01861k6469n5760K21657R9407P279J21286j1221r3820n9703
14059C7024j61647j76879m8159J39231M9644j44369K33552J77065p7998M0518
14049F7982j21304r2578J1718J10317J33964R5090N0449K2419m0616k19967J9934
14038C7408J26455j5400j52978O528J37877Q0083k50142j46360l6024L7673j57351
$$ y = [-127310, -111084, -4572, -46874, -60609, -52150, -122248, 25511, 103279, 66890, 71317, 64224, -69248, -59650, -106012, -224951, -43821, 82390, 24397, 72154, -50966, -8379, 46959, 107960, 80287, 4298, -114991, -43997, 171641, 234053, 222216, 287570, 273515, 212499, 90442, 82956, 202961, 206876, 60849, -105043, 2782, 22518, -105994, -124975, 16128, 164056, 36229, -165632, -192101, -247861, -26204, 73203, 80482, 201768, 190547, 96727, 37024, -124623, -301502, -349661, -210430, -160786, -305155, -71603, 105462, 27464, 67982, -53322, -145900, -134182, -23865, 110099, 205189, 255638, 278057, 237441, 17474, 37408, 163863, 148463, -4515, 2013, 139890, 219973, -30169, -176529, -212553, -174880, -332231]
14027c32231j6418J32713J7066Q391m4941p089m3920R9443m9365k05267M7281
14016c94337K18509P4271r520q5146M1404J80021K9676j05019L1069Q3794j68569
14005a03847o8543n021K11009J04218j93389o8927Q9969j5955R6910q2136P7290
13994D1578n0117L7221R3742j06278o5803P3111k6007m4483l1977l4250J64885
13983E1622k3851Q5451r1555n6666K269P2928M8035k2005N7341J48517q9991l9775
13971A42320m2692P899k2166m2741p4556j38489j08580L5507K3781N4390j2783
13960a78110L1605M0373J01470L4322r0888j26119m6308M8597M1698j23j89281
13949c32764J0894K31577J7560l9257J54218J96918K8097k2797j38357k46202
$$ y = [-332231, -348649, -215936, -198870, -190479, -235420, -242509, -286429, -186986, -236351, -441618, -394337, -175828, -101557, -111077, -196223, -154819, 25202, 54878, -50141, -19072, 64722, -103847, -172390, -177411, 33598, 137816, -55573, -124500, -34531, -50486, 46424, -35712, 41578, -8539, 28682, 122424, 16146, -49657, 23454, -2553, -47036, -79013, -113263, 51622, 27771, 113222, 21667, -34999, -32730, 40198, 88233, 66228, 123569, 272086, 182095, 142320, 99628, 107527, 85361, 42620, -31936, -170425, -279005, -243498, -219717, -165327, -178110, -146505, -106132, -4662, 29660, -61228, -187347, -233655, -185058, -143360, -143483, -332764, -321870, -90293, -72733, -111990, 42228, 239146, 267243, 244446, 106089, -140113]
13939a40113q1115j6715J45277R7827L9254M4936R9410K886j60487j57577K7477
13928i8940n3519q0464J3989l874n4508K24714N2268N2936j08011J80074N1161
13917A75826O1110k18015j25392j2494k1924K18772J83180k0562l5083M6288o8333
13906A83373p8724j99680J3863o1277j37159j22526j20680O9279J39022n6244
13896c70753J21017J05983K01603j38101r9169K7736k7674o3893K08657j5317
13886d9911n3610j59830J40397N1857J39640j11139Q5478O7100j15976j02731
13876a08725N2901l1113M4685n230J01221R9076J004J6726q8938m2584J01737
13865A40760k17296N3975J43160N5263p9758j11116L4053J47081J63198O184j11643
$$ y = [-140113, -221228, -237943, -92666, 5161, 44415, 89351, 188761, 191647, 31160, -126417, -98940, -152459, -232923, -218934, -222808, -277316, -52602, -334, 52602, -55409, 124665, 175826, 236936, 18921, -106471, -118965, -140889, 77883, 261063, 240501, 205418, 251706, 183373, 104649, -95031, -81168, -142445, -279604, -402130, -522810, -453531, -314509, -370753, -249736, -143753, 57850, -80251, -179420, -151684, -179358, -243251, -34594, -49911, -103521, -263351, -122954, -71097, 68543, -42596, 42882, 109982, -5994, -108725, -55824, -86937, -42252, -47482, 53739, 152815, 153819, 170545, 81607, 39023, 140760, -76536, -22561, 120599, 175862, 96104, -15012, 19041, 166122, 329320, 335504, 223861]
13854B23861k43249j02358j15391N674L7835q1512p333J23851J35651J6448L6009
13843B9486J52185j71500j71854n4668J07508r2234j673O6606J02939k0719k6988
13832h0912L4913Q2206o6625j43754J41529j3063J1466P2743Q5148M1157n5544
13821A09264p3744o5516P3335O3366P368L1339q3864j03984j02333N6103J1978
13810g6688J5212N5006k379q6338n4233O6644j2614p5366l7852J21860K41801
13799A55053l3426k5086l0581k37366o1741J17740m248o8992m6637J77936k9279
13788h6627J07641q6j33947n1848P7111J32554j30647j18992n0911Q9572J90086
13777B3906J25964k489l987K2233k50496j51931J60568o1068j17547K1971K23910
$$ y = [223861, -19388, -121746, -237137, -231463, -193628, -275140, -282473, -158622, -22971, -6523, 29486, 181671, 10171, -161683, -216351, -108843, -201077, -202750, -136144, -33205, -53924, -80912, -45999, 36207, -30418, -174172, -32643, -45706, -34240, 38503, 123651, 164808, 109264, 35520, -29996, 43339, 106705, 114073, 145412, 61548, -42436, -144769, -88666, -76688, -61476, -6470, -8849, -95187, -149420, -82776, -95390, -170756, -208608, -86748, 155053, 121627, 96541, 65960, -171406, -233147, -115407, -119655, -188647, -235284, -57348, -86627, 21014, 20928, -113019, -164867, -87756, 44798, -85849, -204841, -255752, -166180, 23906, 149870, 147381, 143394, 165627, -84869, -236800, -76232, -137300, -254847, -232876, -8966]
13766h966m2329q395K48371k8070K8075k2398n4290J1013k2913m5228p3561N3067
13754C4376n2330M2975N3989j35378l566R2410n403j4620m6869L0745l3637j38630
13742a75938p3892J11021P0194N3444q7641l8428L5741M2808J16665L1271K8355
13731A13600p9736J0845N9876J26040K0085j58065o7323J35087L1050q5569r9331
13720F559j1547O317L968M6335M118J0446M9318k8891j49520j00890J50243K335
13708a1209k4384j4425q7212j10594J9831K9800l2735m2502N6880R6415J34769
13697A4634J47791j88659q3986J26812M7854j24795j50077j7812J17386J30033
13687A9181J54803P432j96856j15326P0555l3393J02121L5413J26692P9104o2829
$$ y = [-8966, -51295, -59690, 188681, 160611, 188686, 166288, 111998, 123011, 100098, 54870, -18691, 34376, -17954, 25021, 79010, -56368, -59934, 32476, 27073, 12453, -34416, -3671, -37308, -175938, -249830, -138809, -68615, -15171, -102812, -141240, -105499, -62691, 53974, 85245, 113600, 33864, 44709, 104585, 230625, 250710, 92645, 25322, 160409, 191459, 105890, 6559, -4988, 1329, 5297, 51632, 55750, 66196, 115514, 86623, -62897, -163787, -13544, -11209, -35593, -50018, -137230, -247824, -227993, -198193, -230928, -273430, -216550, -120135, 14634, 162425, -26234, -110220, 16592, 64446, -60349, -210426, -228238, -110852, 19181, 173984, 181416, -15440, -130766, -60211, -93604, 8517, 43930, 170622, 249726, 186897]
13676A86897Q683n2725j24853j43866k5055P7425J47807J05073l1373k3688P7455
13665B01780J54256l3746M1749j64465Q188k01038r2532J5323K5378o1488J37119
13654C0524M8339o1166j37069j88510J22020K2272j25271J52980L6498J16900
13644A7517J81103Q4203K9522k2935P8712j77990l31474k19735l8275M5116J61479
13633a92757K99234M4494J04888j6014j67137j5508n1756J04220J77032j57429
13623A29267p0924Q4175J1987j02934j0018J35546R601l2641r6649j2764j06175
13612f1529j11309m6905L8291m2750K2232J88824J84109j10982q5290M6479j2139
13601I031P2620k279j80442N2872M9809P559L872L2446n4847j16559L1737J03817
$$ y = [186897, 195580, 142855, 18002, -125864, -150919, -73494, 74313, 179386, 148013, 124325, 201780, 356036, 322290, 364039, 199574, 207762, 6724, -85808, -70485, -45107, -106595, 30524, 78863, 17697, -119372, -307882, -185862, -163590, -288861, -135881, -99383, 17517, 198620, 282823, 312345, 289410, 368122, 190132, -141342, -361077, -399352, -354236, -192757, 106477, 150971, 255859, 239845, 72708, 57200, 5444, 109664, 286696, 129267, 58343, 142518, 154505, 51571, 41553, 177099, 186700, 154059, 57410, 44646, -61529, -172838, -219743, -181452, -224202, -201970, -13146, 170963, 59981, -25309, 21170, 9031, 81651, 79372, -101070, -48198, 1611, 9170, 13042, 45488, -9359, -125918, -94181, 9636]
13589I636m6148k30521j14327K5780J61869J88974J08819J16277j4907l61543
13579a56091j27977K34559N5783O6092N688j27081M1926N431j04289j2974K37104
13568A18171L6804k469p9895r6718l6334m954O7448J00585j36051n9946j3760
13557a07119m5031J54382J4283L0034j87210P8787N8411l06830o5317J96191J57197
13546b2222j55646j80736J60281O2879N4021P2568l1874Q1487L3036j46108K9304
13535d3010J0207j05950K3486K61436J90662K0374j97876o0001q0216K4750K70225
13524C14087R5129r0323m0380O8351o1574j23576P6761j2888j72216L5629J58094
13513B47094M666P1722m9997j18109j03178Q4118P280o3377L5154j07748n7453
$$ y = [9636, -36512, -267033, -381360, -355580, -193711, -4737, 104082, 220359, 205452, -156091, -284068, -49509, 6274, 72366, 78054, -49027, -7101, -1670, -105959, -118933, 118171, 154975, 152506, 72611, -24107, -60441, -65395, 2053, 102638, -33413, -93359, -107119, -152150, 2232, 16515, 46549, -140661, -61874, -3463, -310293, -375610, -179419, -22222, -177868, -358604, -198323, -135444, -81423, -8855, -40729, 40758, 73794, -72314, -43010, -32803, -138753, -115267, 146169, 336831, 357205, 159329, 99328, 19112, 43862, 314087, 409216, 318893, 278513, 346864, 285290, 161714, 238475, 225587, 53371, 89000, 247094, 251760, 323482, 273485, 155376, 52198, 136316, 143596, 80219, 115373, 7625, -49828]
13502d9828j23710p699P2837M7902J26363K38096J5973k20473L437J31949j42501
13491I2346l3180P3090j17252j66536j57160m1258K61508m871j28351j45109J0813
13480c55960J51184k0880P166P3151R2039J23434R2406J02350j7179j06290p068
13469A34353j13739J33582j3494q4633J2342K6235j09749j89464J25388N1218
13459b7961k3237j20571o5018L5731N3406p600J02376J21984m2720O10j73556
13448a46556m0527p3809N9704K23624P7424j40044K3961J5412k11651p5965j20907
13437d09334J27887J6055k7274j2323n9850J65797N6198J25113J07035J04032
13427A93336j12886J4384K5415J01647r2851l246L0837j06775j60926j49689O9331
$$ y = [-49828, -173538, -181237, -108400, -60498, 65865, 303961, 319934, 99461, 102898, 234847, 92346, 59166, 132256, 15004, -151532, -308692, -349950, -88442, -93313, -221664, -366773, -355960, -204776, -225656, -218490, -145339, -53300, 70134, 162540, 264890, 247711, 141421, 134353, 20614, 154196, 140702, 56069, 68411, 94646, -15103, -204567, -79179, -27961, -51198, -171769, -236787, -201056, -147650, -155250, -52874, 69110, 26390, 27000, -146556, -187083, -260892, -201188, 22436, 99860, -40184, -16223, -811, -212462, -288427, -409334, -281447, -265392, -292666, -304989, -364839, -199042, -142844, -17731, 89304, 193336, 80450, 94834, 120249, 221896, 129045, 125799, 156636, 49861, -111065, -260754, -191423]
13416a91423P1843j06466K1308K4324J51426N4476m8262j27129p0056O5367J87189
13405C2597L4008o1248J7490J54595l3674O7800R364q5920p7280j47664m0182
13394a30114L8643L029j2296j04006r1778J0573m9636J32361K04258J12639P178
13383A20851j95538r2208J59243J06886N9169M4059j88332j2082m6625k47848
13373b92425L9131j8604J03067J31132j5141n9514l5804Q053J29516M555j28386
13362a34420O9978R5327O4870Q0239m2562K797j69258j91957j3387M8560J0478
13351a79335J28211N246Q8819K5283K0265l6116j11066O5271L5519q3255j26580
13340a67738j22527J37716K12724j10079j07755o5685R0462L7851k6753J2935
$$ y = [-191423, -119580, -226046, -204738, -180414, -28988, 25488, -22774, -149903, -219959, -154592, 32597, 66605, 5357, 22847, 177442, 143768, 211568, 220932, 135012, 57732, -89932, -130114, -91471, -88442, -100738, -204744, -296522, -285949, -335585, -203224, 1034, 113673, 120851, -74687, -166895, -7652, 99234, 158403, 202462, 14130, 2048, -44577, -292425, -253294, -271898, -168831, -37699, -52840, -112354, -148158, -140105, -10589, -6034, -134420, -64442, 30885, 95755, 175994, 133432, 136229, -33029, -224986, -238373, -189813, -179335, -51124, -45878, 42941, 68224, 88489, 52373, -58693, 6578, 42097, -41158, -167738, -290265, -152549, 60175, -49904, -157659, -223344, -132882, -95031, -121784, -108849]
13330a08849L7121L9751L1343k41036j48296O7652J04762J82324O2260j36075
13320a09043J30653k12319L9529Q1197j35004k7277P1651j6434n378Q0428J38557
13309C6560P571q8122J1196p5346j1650J27120R6538j8431J09255J82362j24949
13298B52104j66968J0940L4414J5465j44383r3725P5865k33407k231L01652n7205
13287g479k1493Q5985k6698m9076m3815J09994j7592N7695J23890r2037j13889
13276E485k8117j53307j62300J23043K52020J0397n9921R1600P8666L0013J16669
13265C04248M2745q6093j59829j0683L2538M3186q6909m1294l1746j6717K2498
13254A1944N7568j22251P6967j02098j20197j3616K9304J81244J46196J6988j11410
$$ y = [-108849, -71728, -31977, -634, -241670, -389966, -322314, -217552, -35228, 27032, -109043, 21610, -190709, -151180, -69983, -204987, -232264, -160613, -177047, -182425, -101997, 36560, 44131, -43991, -32795, -108141, -119791, 7329, 103867, 85436, 194691, 377053, 252104, 85136, 96076, 130490, 145955, 1572, -92153, -16288, -249695, -251926, 49726, -7479, -28972, 57013, 30315, -18761, -62576, 47418, 29826, 87521, 211411, 119374, 5485, -22632, -175939, -338239, -215196, 36824, 47221, -12700, 78900, 157566, 187579, 304248, 346993, 260900, 101071, 90388, 122926, 166112, 79203, 37909, 6163, -10554, 11944, 69512, -52739, 24228, -77870, -198067, -211683, -182379, -1135, 145061, 162049, 50639]
13243E0639j4140r1191J2227M0307R7046J37907j30214j38238J39282l7278q2584
13232a6237j05931M5418L1378k4699l1798n6358O2462l6731P6117l5957r5529
13221a87865O9359K8735p0850O2174O5080P5163n9681Q6359R8626j45882q9037
13210f7819j5378m1985J16034J10824q0555k13563m6825N2142J15479N9038J4614
13199B006J3266J18323M0491j53005O8201j68591l4151P4162l7847p3706J04447
13188d6404Q1536k6771M6479P4476j23837J05430L7009j47231j69493k6527J03761
13177i1572n5881N569K12121L4823K1289l6110j84767O4353K73526J50549j80735
13166B13165k5991o4703j75781j76981j36956J50017Q2629L2126L493N2955J4357
$$ y = [50639, 36499, -54692, -42465, -2158, 94888, 232795, 102581, -35657, 103625, 66347, -16237, -122168, -76750, -45372, -70071, -101869, -158227, -95765, -132496, -56379, -92336, -187865, -118506, -89771, -160621, -98447, -33367, 41796, -17885, 68474, 167100, 21218, -67819, -83197, -125182, -9148, 101676, 21121, -192442, -239267, -187125, -71646, -12608, 2006, 15272, 133595, 174086, 21081, 89282, -79309, -113460, -39298, -77145, -150851, -46404, 35132, 8361, 54840, 129316, 5479, 110909, 147918, 687, -168806, -195333, -91572, -147453, -141884, 70237, 105060, 126349, 90239, -94528, -30175, 243351, 393900, 213165, 187174, 122471, -53310, -230291, -367247, -217230, -134601, -102475, -98982, -46027, -31670]
13155c1670l9192k8756j51746N5656J31331J69053N5547K05000r8082p9975n700
13144A81466J18106P4240j5653j1835j06505k8996p7876n6387l8565p7751m2380
13133h2136Q2502N6562n6199j22301R8040j973J65911K35848K29869o9057j11517
13122D25549K2445K4068J33259J84341L08794N62308K57726J18702l5382k75780
13112A726030m26682l18209n4820j09410j2190j39984n1140k7848J94406J99194
13102I79347o5457j54848k2485M4497O9548m3874k4459K07194J68084M5049o9541
13091A133055J11392J87203J72723K56221J86098K80770J21970k4106j1912l60742
13081B052672l79327j00915q4518j72633k6683m3098J875K9873k72835j43690
$$ y = [-31670, -70862, -99618, -251364, -195708, -64377, 104676, 160223, 365223, 267141, 187166, 181466, 299572, 373812, 358159, 346324, 239819, 210823, 132947, 76560, 37995, -39756, -82136, 366, 56928, 729, -121572, -23532, -25505, 140406, 376254, 606123, 537066, 425549, 447994, 472062, 605321, 789662, 1098456, 1660764, 1918490, 2037192, 2001810, 1726030, 1299348, 981139, 926319, 816909, 804719, 664735, 613595, 585747, 780153, 979347, 913890, 759042, 736557, 781054, 850602, 806728, 782269, 989463, 1157547, 1202596, 1133055, 1244447, 1431650, 1604373, 1860594, 2046692, 2327462, 2449432, 2425326, 2413414, 2052672, 1673345, 1572430, 1487912, 1315279, 1288596, 1245498, 1247373, 1277246, 1004411, 860721]
13071H60721j18132J32227J56064j88343j03333j58542J57273N4391k57062R7622
13061F32886J38318J38947l8178J12535K45502J85025K60649M70390K79535n9176
13051B366433l03449k82572k44077j67689k00313k58844j65848j13996k70716
13042C58929j60050L5611k12139j84959M7287L14453o9199j99186K5194J45337
13032A01278m4517m9118J86049N5998j39972j57715q13R715N6852j4457J5033
13021A8333J84003J20263j49096q3374j50411J54394l3022L5032p4610m5952J31518
13010A07078M8030n6447L8888K06756M6810M2776j60972j12519m1659r3040l2861
12999g160J84292O6961r6697J4194k3856q0633p6089j11857l8189J51737N4308
$$ y = [860721, 742589, 874816, 1030880, 842537, 739204, 580662, 737935, 792326, 535264, 632886, 771204, 910151, 871973, 984508, 1230010, 1415035, 1675684, 2146074, 2425609, 2366433, 2062984, 1780412, 1536335, 1368646, 1168333, 909489, 743641, 629645, 358929, 198879, 234490, 22351, -162608, -115321, 199132, 129933, -69253, -44059, 101278, 56761, 7643, 193692, 249690, 109718, -47997, -48810, -39095, 17757, 3300, 18333, 202336, 322599, 173503, 90129, -60282, 94112, 61090, 96122, 21512, -24440, 107078, 155108, 98661, 137549, 344305, 391115, 433891, 272919, 160400, 118741, 25701, -7160, 177132, 244093, 147396, 161590, 137734, 57101, -18988, -130845, -169034, -17297, 37011]
12988C7011l3842j7382j30998L8481J23864Q8160l8576l6715J32300P1224j97033
12977C6494K5786J59460l2834j8543j32262R3110k6004j12910J21620J02998J00605
12966C17520R3689Q6898p9111j79012o0865Q4349n27J5523q2818J48394O9795
12955D13835J75637M0206r4460j28310N7197n9568p5978m4384j4616q5309j90925
12944f675M5774p8962m903J34517J2573J8043J50159k3656o5220j56205O61p8877
12932e2771J29533J42366k9473j27541j58488p7134N5780j6112J68619R6191m5381
12921H5589M3782O7315J22111M5127l7216P4596n2110j80576o9047J613J55981
12910B57165j20148k4858R5481o4438j69728K22554J37043j51247j76132j42433
$$ y = [37011, 3169, -14213, -145211, -106730, 17134, 105294, 66718, 30003, 162303, 233527, 36494, 62280, 221740, 188906, 170363, 38101, 131211, 105207, -7703, 113917, 216915, 317520, 411209, 498107, 418996, 239984, 179119, 263468, 262941, 278464, 195646, 344040, 413835, 589472, 629678, 535218, 406908, 464105, 404537, 328559, 284175, 269559, 184250, -6675, 39099, -39863, -44766, 89751, 102324, 120367, 270526, 246870, 181650, 25445, 26106, -52771, 76762, 219128, 189655, 62114, -96374, -173508, -117728, -133840, 34779, 130970, 85589, 129371, 196686, 318797, 363924, 326708, 401304, 349194, 168618, 99571, 101184, 257165, 137017, 112159, 207640, 143202, -26526, 196028, 333071, 181824, 5692, -136741]
12900a36741q8091J61312L25656j124m4819n5015J0020N4749L273J48689R7722
12889D75631q2316O5377L3736r2105j55241J17080k5128p8861m8835K0240R7755
12878C27333j04168q1439Q2747o6554m693L8480j40336j7515k9992J03240N917
12867A13020j50562j97296O0265R3749K03155p1315j21740J5059P0123O2053J05340
12856A81851M1635M8474R4094J70613P2373l00326r1934K471j8255k9850j72559
12845a413k41476J52621J88509Q9638r4723J38306M7664j12603r8672j16282m2223
12834i0654j12753k3560L38388K36537J4318j11466r3100l0867J42769J42411
12824D12023N2919K212j6413L4916j03036p0197j11667Q4834l979k3678j55725
$$ y = [-136741, -224832, -63520, 262136, 261012, 216193, 161178, 171198, 225947, 229220, 377909, 475631, 393315, 458692, 492428, 400323, 245082, 362162, 337034, 258173, 209338, 229578, 327333, 223165, 141726, 224473, 157919, 153226, 191706, 51370, 33855, 3863, 107103, 113020, -37542, -234838, -174573, -80824, 122331, 51016, -70724, -55665, 14458, 76511, 181851, 223486, 271960, 366054, 536667, 609040, 308714, 216780, 219251, 200996, 171146, -1413, -242889, -90268, 98241, 187879, 93156, 231462, 279126, 166523, 67851, -48431, -90654, -203407, -226967, 111421, 347958, 362276, 250810, 157710, 126843, 269612, 412023, 464942, 467154, 450741, 485657, 382621, 312424, 200757, 285591, 281612, 257934, 102209]
12813A02209k6827O5235m8708k4445K2112J30983P6659o4833M8128j62997j49325
12802c1809j4146J2669O7212P544J82666J40840J57037J62966K03591J01294J10625
12791A100489K09110J46036r5091m32385j41512l8812q081j2540M711j83346l6956
12780E11623j42897j42387j51019J3293N5569l6735Q7787K14633J77597j49665
12770D37799q7734J02709L2753J11582K10282o165O8901K54698J79176Q6699K888
12759A393588q360j80283r6537r1891n5993L6667m0868k3896J35651j41403j5103
12748I11572N6843n371M1019q7561J6043J80456M4756J7075k96371k28208N5660
12737G05913j00903J3001M3785L9153J43836J39968J21734L0600J29879L1400
$$ y = [102209, 75382, 140617, 91909, 67464, 89576, 220559, 297218, 232385, 280513, 117516, -31809, -45955, -33286, 33926, 41470, 224136, 364976, 522013, 684979, 888570, 989864, 1100489, 1309599, 1455635, 1360544, 928159, 786647, 747835, 739754, 727214, 731925, 548579, 511623, 368726, 226339, 75320, 88613, 144182, 107447, 195234, 409867, 587464, 437799, 350065, 452774, 485527, 597109, 807391, 801226, 870127, 1124825, 1304001, 1390700, 1393588, 1385228, 1204945, 1108408, 1016517, 960524, 997191, 956323, 932427, 1068078, 926675, 911572, 968415, 963044, 1004063, 916502, 932545, 1113001, 1157757, 1174832, 878461, 650253, 705913, 605010, 618011, 661796, 700949, 844785, 984753, 1106487, 1137087, 1266966, 1298366]
12727A298366l0075J88388P8720j38637R605K7804j74439q5678K3145J23148J05799
12716A426146J72557r0725J32986R9222k046O6693l9605Q1266P2344J39397K51045
12705B309280P5128M3410j7182K34806K85265Q961K70388K41760N562J76427Q1420
12694C715225K33483L46290L34659L78293N09327N21391L35295L60324N63727
12685G298014P28315J063562J361873J606099J590430J752850J787983K044939
12677A9234065K707702L562743M437901O136872Q105683J1523588J6584599K3822922
12669I6116075L4226609M7238546O0958305O6208125N1354503J5495256k4819703
12662C46777716n1620014n7587813m9818895l8122382k7283007j8487249j1755583
$$ y = [1298366, 1268291, 1456679, 1535399, 1396762, 1406367, 1434171, 1259732, 1174054, 1197199, 1320347, 1426146, 1598703, 1507978, 1640964, 1740186, 1738140, 1804833, 1765228, 1846494, 1918838, 2058235, 2309280, 2384408, 2427818, 2410636, 2645442, 2930707, 2939668, 3210056, 3451816, 3457378, 3633805, 3715225, 3948708, 4294998, 4629657, 5007950, 5517277, 6038668, 6373963, 6734287, 7298014, 8026329, 9089891, 10451764, 12057863, 13648293, 15401143, 17189126, 19234065, 21941767, 25504510, 29942411, 36079283, 44184966, 55708554, 72293153, 96116075, 130342684, 177581230, 238539535, 304747660, 356102163, 371597419, 346777716, 295157702, 237569889, 187750994, 149628612, 122345605, 103858356, 92102773]
12655I2102773o481682k293580J070560M615096P875987J0018352R882117P361391
12647A24151014M299975L689918P204946J4268941K2156728K8059787L0020764
12640B33852073K8776647K8037906L1392879L9144284M6442732M1537257J6641251
12633D65825029j9356588m7304545n5407917m6239836l1557207j8715471r668002
12626B37575463m827326m141983p124226j2555922j7547877j8784029j5214976
12619A57379124q680487l139900j685122m241394p807941r041775p346594m050022
12611A11385889l13284M479986J1470624K1322684L5204646N2175059O8126145
12604C03851749P6357552O6793157L2734436j7839563o1287314p9942096p4893678
$$ y = [92102773, 85621091, 83327511, 84398071, 89013167, 96889154, 106907506, 116789623, 124151014, 128450989, 132140907, 139345853, 153614794, 175771522, 203831309, 233852073, 262628720, 290666626, 322059505, 361203789, 407646521, 449183778, 465825029, 446468441, 399163896, 343755979, 297516143, 265958936, 247243465, 237575463, 232748137, 228606154, 221481928, 208926006, 191378129, 172594100, 157379124, 148698637, 145558737, 143873615, 139632221, 131824280, 122782505, 115435911, 111385889, 111072605, 115552591, 127023215, 148345899, 183550545, 235725604, 303851749, 380209301, 447002458, 479736894, 461897331, 400610017, 320667921, 245774243]
12597B45774243n8811643m3031797l0809951k1898099j5711377j1709135q838823
12590E4963418o794666n047727m151759l440645k952786k822989k819190k590649
12582B4343007k012635j887053j797711j561565j266756j292776j090642q36837
12574A2597032n76136o53396o53224n14444o90865m52169l33682n32357j11197
12565H079562O4925J03347J7672q871j07708r816M426j24815j15239p3742K59213
12554H088954m9488k58314n04813n22477m81385l62144j66631Q9813J60850M22189
12544F416554Q20122L74477k96177q29745j095979o72333k06641k24574l50055
12535C935649k41063q3763j13416k77402j0901K79084P5912J0007r5801j89779
$$ y = [245774243, 186962600, 143930803, 113120852, 91222753, 75511376, 63802241, 54963418, 48168752, 43121025, 38969266, 35528621, 32575835, 29752846, 26933656, 24343007, 22330372, 20443319, 18645608, 17084043, 15817287, 14524511, 13433869, 12597032, 12020896, 11367500, 10714276, 10199832, 9508967, 9056798, 8723116, 8190759, 8079562, 8144487, 8247834, 8265506, 8256635, 8148927, 8139111, 8143537, 8018722, 7903483, 7829741, 8088954, 8039466, 7781152, 7276339, 6753862, 6272477, 5910333, 5743702, 5833515, 5994365, 6416554, 7236676, 7611153, 7314976, 6485231, 5389252, 4716919, 4510278, 4285704, 3935649, 3694586, 3610823, 3497407, 3220005, 3209104, 3488188, 3564100, 3574107, 3478306, 3288527]
12525C288527n6467p7488k3461j71603m7909J05826O8921j07550J41139J39930
12515C259865N5562J46000L53403N47657R95841Q21026k16798q91453j023721
12506D047382p21559l06014M9496J54384K87677P02269J420482J163847L027r63213
12496E837778j121240q52905n48192r3033k48952j80012m69m7791j3162j68403
12486B563619q0370J9621J06166M7406J34959J50490k5433j95363k43517j06945
12476B370633k17025j89449r7315L8262K07747K14491J15431J58113M63608Q68516
12466C933012J202618M06756m12981r49113r76189m99479l57869j51965J07484
12457B302274j29419r2114K93398K08053j36254k37728k99195m15124j42608r2540
$$ y = [3288527, 3232060, 3154572, 3131111, 2959508, 2911599, 3017425, 3086346, 2978796, 3119935, 3259865, 3315427, 3461427, 3814830, 4362487, 5358328, 6179354, 5962556, 5071103, 4047382, 3325823, 3019809, 3069305, 3223689, 3511366, 4213635, 5634117, 6797964, 6800991, 5837778, 4716538, 3863633, 3315441, 3222408, 2973456, 2793444, 2792975, 2745184, 2732022, 2563619, 2483249, 2502870, 2609036, 2656442, 2791401, 2941891, 2916458, 2721095, 2477578, 2370633, 2153608, 1964159, 1866844, 1905106, 2112853, 2327344, 2442775, 2600888, 3064496, 3933012, 5135630, 5542386, 5129405, 4180292, 3204103, 2704624, 2346755, 2194790, 2302274, 2172855, 2080741, 2374139, 2582192, 2445938, 2208210, 1909015, 1493891, 1351283, 1258743]
12447A258743l7536M8528j26161j53812J7938Q7819q2068P2037M1484J8579j914
12436A143637k4624k3190p6615l4595j0111m2384M1867j72319p9759J03968K50517
12425A076392K2527l607J27417N12348K92310j36907k35851j90302m06239Q3103
12415A141191K5624j18924r8731l4823j05018J6482M4826L4910J5977j19888J7571
12404H19197n8068j17559j13568J00808Q2681j35748O2819K1248r1739l4987J84303
12393G19387M3291m9048L5024j34339J7030r2834k3421L0620J49180J18267q0878
12382G32279R644J27119P9904o5339O4396O9688q3168j57352k04452p2751K2186
12371E22154Q8099M9147N851L3587j57906j06434m201n5699J97339K84810P4116
$$ y = [1258743, 1221207, 1269735, 1143574, 989762, 1007700, 1095519, 1013451, 1085488, 1126972, 1145551, 1143637, 1119013, 1095823, 1019208, 984613, 974502, 932118, 973985, 801666, 721907, 825875, 1076392, 1098919, 1095312, 1222729, 1735077, 2027387, 1890480, 1654629, 1464327, 1058088, 1141191, 1166815, 1047891, 949160, 914337, 809319, 825801, 870627, 905537, 921514, 801626, 819197, 761129, 643570, 530002, 630810, 713491, 577743, 640562, 661810, 570071, 535084, 719387, 762678, 713630, 748654, 614315, 631345, 538511, 515090, 545710, 694890, 813157, 732279, 741923, 869042, 948946, 883607, 948003, 1017691, 934523, 777171, 572719, 499968, 522154, 610253, 659400, 665251, 698838, 540932, 434498, 430297, 374598, 571937, 856747, 930863]
12360I30863l158j72582m7296l5812P1950l5728j06025K9998J58111O908j08143
12349F89086j25356r0522J64158J02605j38854r9933J11958P4512L842r2509j5325
12338E83662L393Q7732J85646J10048j25006k53042m4895N04J43252R833k26569
12327D74558m6462J19135J16231j17610j76614J40272N5027p5833m5487J01370
12317E44587j426J10258L3108K2086J9597j35912j19957j68759j6127J90840j0166
12306D68129k7009j14817k02879j59531k0642J73203L0893J18968l3093O812j18491
12295A21543J6965K1666N812K8960J19011O3093Q189j2868R8178Q163o3171P2809
12283D88350n3737o0039L7601J58636m4666l1942j23332M0124o8364p2506R6501
$$ y = [930863, 927705, 755123, 707827, 672015, 743965, 708237, 602212, 632210, 790321, 797229, 689086, 563730, 473208, 637366, 739971, 601117, 501184, 613142, 687654, 691496, 598987, 583662, 587055, 674787, 860433, 970481, 845475, 592433, 547538, 548042, 691294, 701127, 474558, 428096, 547231, 663462, 545852, 369238, 509510, 564537, 488704, 443217, 544587, 543161, 653419, 686527, 708613, 728210, 592298, 472341, 303582, 287455, 478295, 468129, 441120, 326303, 123424, -36107, -56749, 116454, 147347, 266315, 233222, 240034, 121543, 138508, 160174, 165986, 194946, 313957, 377050, 385239, 372371, 470549, 478712, 415541, 488350, 434613, 374574, 412175, 570811, 526145, 494203, 370871, 410995, 342631, 270125, 366626]
12272C66626R3831o7724j48518Q1038N4673M6724N9398J9189J2438q5305M7790
12261D80160K2040K82542M64525L06035K53449K51180L72032J53846k21j62567
12251B423021l02161j4607j13512l82774j75574j10972n3260r2589j29874j18051
12241I29647M2166j77438k7664n229k06521M4252K40769l2081r9894P2587p3475
12230G07119J81371P1523q5146Q8177K76843J34649Q9938M684m1680N8390q0294
12219A405574O3988J28599J20793q6907k57325l20647j23266L6710R5867J72903
12209A236289l6911j85255K8124K29982R532K64775P3625k35868N8868L8375M4222
12198A525758K03420K15969P3684Q5924J40086J91908M8869r2028K069J20096
$$ y = [366626, 460457, 392733, 244215, 325253, 379926, 426650, 486048, 505237, 517675, 432370, 480160, 502200, 784742, 1249267, 1555302, 1808751, 2059931, 2431963, 2585809, 2585588, 2423021, 2120860, 2106253, 1992741, 1609967, 1434393, 1323421, 1270161, 1177572, 1047698, 929647, 971813, 794375, 766711, 761482, 554961, 599213, 839982, 807901, 708007, 780594, 707119, 888490, 960013, 874867, 963044, 1239887, 1374536, 1464474, 1469158, 1427478, 1485868, 1405574, 1469562, 1598161, 1718954, 1632047, 1374722, 1054075, 930809, 967519, 1063386, 1236289, 1199378, 1014123, 1042247, 1272229, 1281761, 1546536, 1620161, 1384293, 1443161, 1481536, 1525758, 1729178, 1945147, 2018831, 2104755, 2244841, 2436749, 2485618, 2393590, 2395659, 2515755]
12188B515755j54282j70568O6314R3266M8921J73340M2334r7313J7768K42623
12178B778158K38892J30302J39766l6196L3762K22283J75665P8511J80345J35711
12168D077199K89334J78258Q4081K53834M67290K40896K63351L93622L25253O22758
12158G195876Q04840O81965Q34817R60486P52678O58267P65088P39521N68157
12149A3961695N38336P54347J339685J901679K006763K587063L649079M470770
12141C1209417N613841P154612R289747J2955961J8593531K7203622L9583995
12134A51604726N5738078P2389109Q0608433O8581290L3060681j3666449n2118677
12127C96197191o9731441o7466740n4613074l9453709k5928286j5463070p799943
$$ y = [2515755, 2361473, 2190905, 2257219, 2350485, 2399406, 2572746, 2615080, 2517767, 2535535, 2778158, 3017050, 3147352, 3287118, 3250922, 3284684, 3506967, 3682632, 3761143, 3941488, 4077199, 4366533, 4544791, 4628872, 4882706, 5349996, 5590892, 5854243, 6247865, 6573118, 7195876, 8000716, 8682681, 9517498, 10477984, 11230662, 11888929, 12654017, 13393538, 13961695, 14500031, 15254378, 16594063, 18495742, 20502505, 23089568, 26738647, 31209417, 36823258, 43977870, 53267617, 66223578, 84817109, 112020731, 151604726, 207342804, 279731913, 360340346, 428921636, 461982317, 448315868, 396197191, 326465750, 258999010, 204385936, 164932227, 139003941, 123540871, 115740928]
12120A15740928j401324L556978O543436O210405K975706n47173j289032J547152
12112A33337076O954289J3486981J9919952K3344561K0643294J2857432L041197
12105B33584782k381338J199232J3001776K9349017M4054319N1546504M6188127
12098D16542419K6854632K23663k1934167l2345626l2734281l0398586l0029224
12091B96178830l1810336l2893168l0997070k5981263j8838026j1674745o170058
12084A37814164l283018m008327p586918j0628705j0826486q210473m269223j34146
12076H8866868L824004Q359822J4431708K2263701L2300190M3516202N4416145
12069B67978640N6922612M0508301N344765l3440935n7363484o0348013n0564934
$$ y = [115740928, 114339604, 117896582, 124440018, 130650423, 133626129, 133078956, 131789924, 133337076, 140291365, 153778346, 173698298, 197042859, 217686153, 230543585, 233584782, 231203444, 232402676, 245404452, 274753469, 318807788, 370354292, 416542419, 443397051, 443620714, 421686547, 389340921, 356606640, 326208054, 296178830, 264368494, 231475326, 200478256, 174496993, 155658967, 143984222, 137814164, 134531146, 130522819, 122935901, 112307196, 101480710, 93270237, 89001014, 88866868, 92690872, 101050694, 115482402, 137746103, 170046293, 213562495, 267978640, 324901252, 365409553, 370754318, 337313383, 279949899, 219601886, 169036952]
12062A69036952l8068776k7580450j9626387j4462944j0407785q169717o738215
12055D3982678n740610m889817l945452l223289k677678k233871j854463j516604
12047A7900894j278661j161542j188589j060093p98632q05151n52324o43451q27858
12038I584593m91523l45128k97831n52628n98794m04725k68054k24327j43472
12029F258111k05651q0040l65421l03231k18753j57474p4795j17249k30936k57455
12019D247106j89824k42295j45926k88252m3251j66885k30874J5133q2125l23914
12009B548893k98473l2066J99250p4254p6348L3058n3686o1789J89034J08822
11999B482441J68298q8838j40215K8137O9858p0292j86117j24829p417k1970n2805
$$ y = [169036952, 130968176, 103387726, 83761339, 69298395, 58890610, 50720893, 43982678, 38242068, 33352251, 29406799, 26183510, 23505832, 21271961, 19417498, 17900894, 16622233, 15460691, 14272102, 13212009, 12413377, 11608226, 11055902, 10412451, 9584593, 9093070, 8747942, 8450111, 7897483, 7298689, 6893964, 6625910, 6401583, 6258111, 6052460, 5972420, 5606999, 5303768, 5085015, 4927541, 4852746, 4735497, 4504561, 4247106, 4057282, 3814987, 3669061, 3380809, 3337558, 3170673, 2939799, 2954932, 2872807, 2548893, 2250420, 2218354, 2417604, 2343350, 2267002, 2300060, 2246374, 2184585, 2373619, 2482441, 2650739, 2561901, 2421686, 2449823, 2519681, 2449389, 2263272, 2138443, 2131026, 2109056, 2056251]
11988B056251o7616o7796J09603o7536p8303N0240M6282L09j06149q5561j01308
11977A688416j60183Q0423k89364k43232m9522j00983j31172J77181K19161L3367
11967A224092n1802P1451j15139Q1482J21968j2486L8284n4738O3476J23934N5589
11956A546111l33105j24416J2163J52020K60404K1792j13796n1355J70363J30600
11946A670781R1277j6294k09045k97551n0132n6985j03455k7139J16760O3190
11936A181407n4133o0182j774k9954q6114k2775J71965K14983P5090o7837n5296
11925A265380M3580k43195j31354m7335j62343n0201J18878Q2030M8365M341j95597
11914G32549R1435k2941j03804j39654O1751O6497P6065J52679J6222R827O8149
$$ y = [2056251, 1988635, 1920839, 2030442, 1962906, 1884603, 1934843, 1981125, 1981434, 1875285, 1789724, 1688416, 1528233, 1608656, 1319292, 1076060, 1026538, 925555, 794383, 971564, 1190725, 1224092, 1172290, 1243741, 1128602, 1210084, 1332052, 1319566, 1357850, 1303112, 1366588, 1490522, 1546111, 1213006, 1088590, 1100753, 1252773, 1513177, 1534969, 1421173, 1369818, 1540181, 1670781, 1762058, 1745764, 1536719, 1239168, 1189036, 1132051, 1028596, 1001457, 1118217, 1181407, 1127274, 1067092, 1065318, 1035364, 949250, 926475, 1098440, 1313423, 1388513, 1320676, 1265380, 1308960, 1065765, 934411, 887076, 724733, 674532, 793410, 875440, 923805, 928146, 732549, 823984, 801043, 697239, 557585, 619336, 685833, 761898, 914577, 930799, 940626, 1008775]
11903A008775J14737k2059j07696O5508q8775O7594M4968j00711j47930j18081
11893G16330q3825J057k8616R6596P9452p7861J33659j69565P712k6666p0261
11882E78012P1925P0591P2148L6620L6424r466n6567J38785K61172M9821l2207
11871A217258L4846l0723k00950k412j35461j64682k1192J67105q2710m6083J67565
11860I02561j0836k36539l79775K6235J51804L01522J76525j14785k17721j84565
11850D14426K3402J59329P2599j67082p8050l0854M4523J15489k7571P0495l180
11839E93526P8294j1203M6255N3526J1565p425j61893p6170k6307M2459J79487
11828G22114L3817q0464o6322M1596j37502k01448K15254M6643j11314J58040
$$ y = [1008775, 1123512, 1101453, 993757, 1059265, 970490, 1038084, 1083052, 982341, 834411, 716330, 632505, 633562, 604946, 701542, 780994, 703133, 836792, 667227, 674939, 648273, 578012, 649937, 720528, 792676, 829296, 865720, 856254, 799687, 938472, 1199644, 1249465, 1217258, 1252104, 1221381, 1020431, 1018019, 882558, 717876, 696684, 863789, 781079, 734996, 902561, 891725, 655186, 275411, 301646, 453450, 754972, 931497, 816712, 598991, 414426, 437828, 597157, 669756, 502674, 424624, 393770, 438293, 553782, 526211, 596706, 593526, 671820, 660617, 706872, 760398, 771963, 764538, 602645, 526475, 500168, 542627, 722114, 755931, 675467, 609145, 650741, 513239, 311791, 527045, 573688, 462374, 620414]
11818F20414r8630j08923r0099L1411J6427J18353J59355n8401k0551n1070j7759
11807E00527q889p9575J48725J5330J3505l3747M067O4702J4324o3582j18174
11796D57213M7270M255j04013J06469m260j15710J3513j60983n170Q5569J75865
11785E00018P8882k6104n8374l0903j01216j53563N8308J01327J33860l439r8175
11774D00621k06471k07115k6468L01796J24999j37343L7209K46580R1471P4864
11764G00143l1439k12590j14005Q7251l5815j0117J23024q7217j15355q7021O1273
11753B78132P707q664m0149K4315k9650J43531k1198m8677n4609Q0376O6364j58731
11741B38747k14196p8788J35661J30289P7737J24662Q4712p6390n37K46529L0068
$$ y = [620414, 521784, 412861, 322762, 354173, 370600, 488953, 648308, 589907, 569356, 518286, 500527, 491638, 412063, 560788, 576118, 589623, 555876, 559943, 624645, 638969, 575387, 457213, 504483, 508738, 404725, 511194, 506934, 391224, 404737, 243754, 238584, 324153, 500018, 578900, 552796, 494422, 463519, 362303, 208740, 267048, 368375, 502235, 498796, 400621, 194150, -12965, -39433, 262363, 387362, 250019, 287228, 533808, 625279, 700143, 668704, 456114, 342109, 429360, 393545, 383428, 506452, 419235, 303880, 216859, 278132, 285839, 277175, 237026, 261341, 231691, 375222, 354024, 305347, 250738, 331114, 397478, 238747, 24551, -54237, 81424, 211713, 289450, 414112, 498824, 422434, 421897, 668426, 698494]
11730F98494j74918j68416r1520k7477j5411p693l2251r8812J49543J39296K2404
11719C93239l0338N7766l3719j84308K4343j93611L6206J06949N1408N9704k9393
11708B58246j13925q490J94953J44074J32988n4176J10402l5010O1002K36589
11698I26653J77025J52374M41562L42269Q4275P5270l3137p7204l18623l35964
11688A434500k81883k03792j57378L7575O4760m083J30629j0292J70687L3691
11678A214414q7599O989Q3204j28928L541K18718J12384J9757J42208J25839K3149
11667A733676l2569M981J27198J48443K30344J95615J08581o7170k43907q2484
11657B122708l5010r4735j74069k62761k88724r3191n7754l9181j02201j181J73436
$$ y = [698494, 523576, 355160, 263640, 236163, 220752, 213059, 180808, 81996, 231539, 370835, 393239, 362901, 420667, 386948, 202640, 226983, 33372, 69578, 176527, 227935, 287639, 258246, 144321, 135831, 330784, 474858, 607846, 553670, 664072, 629062, 690064, 926653, 1103678, 1256052, 1697614, 2039883, 2124158, 2199428, 2166291, 2089087, 1770464, 1434500, 1152617, 948825, 791447, 829022, 893782, 889699, 1020328, 1010036, 1180723, 1214414, 1126815, 1133804, 1217008, 1088080, 1091621, 1310339, 1422723, 1442480, 1584688, 1710527, 1733676, 1701107, 1706088, 1833286, 1981729, 2212073, 2407688, 2516269, 2449099, 2205192, 2122708, 2087698, 1992963, 1818894, 1556133, 1267409, 1174218, 1116464, 1077283, 975082, 973901, 1147337]
11646A147337q3062n8088r1378r0677q0458o3081J07543j90563L9641K18656J04920
11635I60790K60796K51416K02125L58495J44717j576l37964k50809k34805k02162
11625A151023k28999l34209M4771K09718j66923j96817j11230q6513K06568j53133
11615C34256k80158J1043L3544l9427J13302K272L862q40p9200O8451J03119m4105
11603B26119p8694N4526K22525j53896j42144p507J08610M0969r822k0875r3164
11592A46647j54704j4838J93589K13783K32832p8534j89648K7989k42391r503
11582A25222P1273j9850J1462j11441J23964J52803O1630K1470n1697q5651j10545
11571A88640L8928m0894N3624Q9689J31355N5584P3130J89745N4792j12853j22185
$$ y = [1147337, 1064275, 1006187, 914809, 824132, 743674, 680593, 788136, 597573, 637214, 855870, 960790, 1221586, 1473002, 1675127, 2033622, 2178339, 2176763, 1838799, 1587990, 1353185, 1151023, 922024, 587815, 632586, 842304, 675381, 478564, 367334, 280821, 487389, 334256, 54098, 65141, 98685, 59258, 172560, 174832, 178694, 177854, 98654, 167105, 270224, 226119, 147425, 201951, 424476, 270580, 128436, 120929, 229539, 270508, 260686, 239811, 146647, -8057, -22895, 170694, 384477, 617309, 538775, 349127, 377116, 134725, 125222, 196495, 176645, 188107, 76666, 200630, 353433, 415063, 436533, 384836, 299185, 188640, 227568, 186674, 240298, 329987, 461342, 516926, 590056, 779801, 834593, 721740, 599555]
11560E99555K4080j58623k28549m4198q9450q1673O1824O9333k0669K1531P58
11549A53919R3039N5874l1977j80153q7586M34J99471j23265j31342j0304N6434
11538e456J16443R4980k4776j21585J06737K44292p5000k27043n4222J36605K04372
11527C95347J88l9298q9631j10476p5724o9563L1673O3469N2041J2829n9826k345
11515A08684j2852O1664J5543R3857M6045o3499j40474j61298m2717K7254M4180
11504b3613k9641p9821j29853J3149R2277O0581j5995J67292O2138j20632l3673
11493c7791K7778j21014l0868O6926Q4868J5897N9529O332P17j4681j5979j09254
11481f7540K15403N5242m198o5472r1685j0825N9349O4489p8779l8973J7314r516
$$ y = [599555, 623635, 465012, 236463, 192265, 102815, 21142, 82966, 152299, 131630, 153161, 153919, 246958, 302832, 270855, 90702, 3116, 3550, 203021, 79756, -51586, -61890, -5456, 110987, 205967, 181191, 59606, 166343, 410635, 335635, 108592, 54370, 190975, 395347, 395535, 356237, 266606, 156130, 80406, 10843, 42516, 105985, 158026, 170855, 111029, 108684, 95832, 157496, 173039, 266896, 312941, 249442, 108968, -52330, -95047, -67793, -23613, -53254, -133075, -262928, -249779, -157502, -96921, -112916, 54376, 116514, -4118, -37791, -10013, -131027, -161895, -94969, -10101, 5796, 65325, 71657, 72374, 57693, 41714, -67540, 147863, 203105, 198907, 133435, 41750, 30925, 90274, 154763, 75984, 37011, 54325, 44809]
11469D4809n4700L9767q7591n5910N2183K06652J969j83100R3516K23111j50443
11458A30263j100O7251L4379l4498n735l1758N8654J8605k5964j34974J55362
11447B30485P5628L9193m2112P355K6008j24469j11037K2778Q0543j30144l0122
11436D4106q3588N3810P7347n4711J6780J1437l1846O3389P3017o7330j8997r8926
11424a5512j21136k4373J04611J67557P1052J63468q3979o9435q0391k0059l5138
11413E6665j3608N6267N7136K102j9362j70542k7283o8673m926J68205J08910
11402A44891k34431P7357J7717l8852j32919J01567J12038P1910M5993l4661j1645
11391A18965j00342M2283p0906K5456O904J06411N1699J53269j41948p5825p4524
$$ y = [44809, -9891, 29876, -57715, -113625, -61442, 145210, 147179, -35921, 57595, 280706, 130263, 129163, 196414, 230793, 196295, 190560, 158802, 217456, 236061, 210097, 75123, 230485, 306113, 345306, 303194, 310549, 336557, 212088, 101051, 123829, 204372, 74228, 44106, -39482, 14328, 91675, 36964, 53744, 65181, 33335, 96724, 169741, 102411, 83414, -15512, -136648, -161021, -56410, 111147, 182199, 345667, 261688, 192253, 111862, 91803, 56665, 43057, 99324, 156460, 158562, 139200, -31342, -58625, -127298, -132224, 35981, 144891, -89540, -12183, 5534, -33318, -166237, -64670, 47368, 119278, 165271, 130610, 118965, 18623, 60906, -10000, 15456, 22360, 128771, 180470, 333739, 191791, 115966, 41442]
11380D1442n4267j36674n2169J30160N2028Q6419L00715Q998k96734N8693J21872
11369B60483K4426k26252k3124N8462K729J14309J02181R2890o0655L0967q3872
11358B92544M5284O3316L8904O5544j58968j27973N8804J34137k8699j87644m3132
11347A52117q2809o4346P4391K4105j00157O6586j2420k2800M0454R4699J39825
11336C09645k92123p9162m63m1318J55877J07282m2065j71698r3478k978K40238
11325H9757O770l0961J10466M3256o4552m6794J49966J25169J6158o9252M9643
11314C79626R4693q8996n347j64628n4984J05760J13618p010L011p7033n583J57401
11302D50528j64210j01564R0971J57794k7813j67599k1206K08027M2852O1461
$$ y = [41442, -12825, -149499, -201668, -71508, -19480, 66939, 367654, 376652, 79918, 138611, 260483, 284909, 58657, 35533, 93995, 96724, 211033, 313214, 406104, 345449, 376416, 292544, 337828, 401144, 440048, 505592, 346624, 218651, 277455, 411592, 382893, 195249, 152117, 69308, 4962, 79353, 103458, 3301, 69887, 57467, 34667, 75121, 169820, 309645, 17522, -61640, -62103, -103421, 52456, 159738, 117673, -54025, -147503, -150481, 89757, 96527, 65566, 176032, 219288, 154736, 107942, 257908, 383077, 399235, 329983, 379626, 474319, 385323, 379976, 215348, 160364, 266124, 379742, 372732, 375743, 298710, 293127, 450528, 286318, 184754, 275725, 433519, 405706, 238107, 216901, 424928, 467780, 529241]
11292E29241k04963l06834j25008K3107K8191j068j81936J8677J75507j59283
11282b04369o8631j06210n3218J02930K28252R4763P1023J1072P6427k24378k9408
11271a01747K05362m9731j79997L6863J11098R2393p909j60684r8871j11638r2773
11260c57634M9721p3650J02147J19423K36482Q7420K8082M163j34818j58797p897
11249a05358m4607J69933M06625q9602j05959k2201j0863m9669q6242l8985Q5093
11238A08165J67913K7617j12277n3949n9702J3745P9461J94535l0100j00007j33998
11227A01403l0776m5246m7776K288N6090J00341R1437J1721M932r3248Q2900M2349
11215B76415j64777j27791k1766J49120K86405j301k56285j06042r4786j61174
$$ y = [529241, 324278, 17444, -107564, -84457, -56266, -57334, -239270, -220593, -45086, -204369, -273000, -379210, -432428, -329498, -101246, -6483, 64540, 75612, 152039, -72339, -101747, 103615, 53884, -126113, -89250, 21848, 114241, 106332, -54352, -153223, -264861, -357634, -307913, -381563, -279416, -159993, 76489, 163909, 191991, 196154, 61336, -97461, -105358, -149965, 19968, 426593, 336991, 231032, 208831, 197968, 148299, 62057, 23072, 108165, 276078, 303695, 191418, 137469, 77767, 91512, 170973, 365508, 335408, 235401, 101403, 70627, 25381, -22395, -20107, 35983, 136324, 227761, 239482, 244414, 151166, 234066, 276415, 111638, -16153, -37919, 111201, 397606, 396305, 140020, 33978, -60808, -221982]
11205b21982n438J36987K70259O7440k56190j4079K8862j6450l2001j11112j8952
11194a72656N5331n6592k08352Q8152J18750J58223M3255j8774q043r922P5971
11183F5343J47920j9026k0559j20166J5209N6140p7253j02234J892J46422j746
11172I1942j25803n9996J51758R7323j9898M6039J28627K368M0101j66157j12479
11161G3825L1566j31530r3450O1926p5009M7174J61563J47503n4534j29457q2344
11150d2767r0569L3149J09989l4663r5409K84613K30090J3318q3748K3995M1080
11139C89078o7076Q961N714p0375j43569j44432k811N3748L5149J27667P5098
11128B67152p745O0482K162n992n8707m1180l1202j31772L4146j50768p7525J8653
$$ y = [-221982, -227420, -90433, 179826, 247266, -8924, -23003, 5859, -10591, -42592, -153704, -172656, -117325, -173917, -382269, -294117, -175367, -17144, 26111, 7337, -706, -10628, 65343, 213263, 194237, 173678, 53512, 68721, 124861, 47608, -54626, -52734, 93688, 91942, -33861, -93857, 57901, 155224, 135326, 181365, 309992, 312360, 352461, 186304, 73825, 105391, -26139, -119589, -57663, -132672, -85498, 76065, 223568, 169034, 39577, -42767, -133336, -100187, 9802, -24861, -120270, 164343, 394433, 407751, 324003, 347998, 389078, 322002, 330963, 336677, 266302, 122733, -21699, -24510, 29238, 64387, 192054, 267152, 259407, 319889, 322051, 316059, 257352, 216172, 184970, 53198, 87344, -63424, -140949, -122296]
11116a22296j25601L5144J22241J93952J47548n9890j02854K4915l7519k7319
11106D8321J13939P276q699j28269L7334N9235M3551k06210o8918j17896L4346
11095a85990r18j48985n0653R9777J34590L2687m8676Q037J18634P5798P1008
11084A05309K1786j12334j8K0436N3523r6318j14829k228O5553L17096K1198O1483
11072C40657N4423j4545J51779j34931k28200j60482p2992q929R4080J48498j94485
11061b5127j10709K1959O6574j0013j34370J00939R1963N4550j55940k8089J33266
11050E003J55313R6482R8128Q7487J581j33527j18904j37487p3911j0195J59629
11039A29599m9385r4140J14265M0311j8918o2257q2357J31136J89408J4547k2010
$$ y = [-122296, -247897, -212753, -90512, 103440, 250988, 191098, 88244, 113159, 75640, 48321, 162260, 169536, 160837, 32568, 69902, 129137, 172688, -33522, -102440, -220336, -185990, -186908, -335893, -386546, -286769, -152179, -119492, -168168, -160131, -41497, 34301, 105309, 127095, 14761, 14743, 35179, 88702, -7616, -122445, -124673, -59120, 257976, 279174, 340657, 395080, 380535, 532314, 397383, 169183, 8701, -64291, -73220, 20860, 169358, -25127, -135836, -113877, -47303, -57316, -191686, -90747, 1216, 55766, -100174, -128263, 5003, 160316, 256798, 354926, 442413, 443994, 310467, 191563, 54076, -19835, -30030, 129599, 80214, -13926, 100339, 140650, 121732, 59475, -22882, 108254, 297662, 312209, 290199]
11028B90199L3989o1224j32955k41076M7706J74471K6479J6232K2207J24233K8240
11017C28501l0601p0089j39096Q8242j118j21691q7940j7619R433J34265J5751
11006A08038j22149j24311J47503O2015P3292p7368Q8826J48826m0287j18508
10996A45877M6186q8959m0061o2634j01133L2558R646P9444l4632J14656J93973
10985B94921M9363n7112j14443j11229k9216L8687j67677L7981J19649k514k8945
10974B9465o0974P0482J3070p9779J61753N9770k8027N4430P1367K4402j43574
10963A72385j9408J19641j16919R5197P1039k9174j22292j53079m4195R3475N775
10952G2445j57219O7739J27919j16888k02571J88865J7900l277J01437j68070
$$ y = [290199, 324188, 262964, 130009, -111067, -63361, 111110, 137589, 153821, 176028, 300261, 328501, 297900, 227811, 88715, 176957, 175839, 54148, -33792, -51411, -41978, 92287, 108038, -14111, -138422, 9081, 71096, 144388, 67020, 155846, 304672, 264385, 145877, 192063, 103104, 63043, 409, -100724, -68166, -58520, 20924, -13708, 100948, 294921, 344284, 287172, 172729, 61500, 32284, 70971, -96706, -58725, 60924, 58410, 29465, -31509, 38973, 52043, -27736, 134017, 193787, 165760, 220190, 291557, 315959, 172385, 152977, 272618, 155699, 250896, 321935, 292761, 170469, 17390, -26805, 66670, 72445, -84774, -17035, 110884, -6004, -208575, -19710, -1810, -5087, 96350, -71720]
10942g1720k0694K51322J2841r4943J03781J17756q1277o3504O3149L343m3805
10931A76249P9298R5817p6158j46513q4513l4615K5763Q7448R433L2872O3985
10920B29066L356n5278n4582L2467L5847N303n0720o9085R7075k5699j69288K3232
10908A694P8504j3497L8842O5147J15560q9488j59455j37654P4867Q7807M7869
10897A10196j7594J32931q2585k3584J08826j03479k07332r1510j7031q4678J7624
10886b58216J22959J55754j79114q3143K6936k6413M6759L8850q5443l8017J45857
10875a33231J73761J82290K7220J7804K795n7207k28929J90591l9017j00827J0550
10864D5800r1609N9675L3473j30782R8691Q7470j1918M7495k1370l9874l1078
$$ y = [-71720, -92414, 158908, 171749, 76806, 180587, 298343, 217066, 153562, 216711, 220054, 176249, 255547, 351364, 275206, 128693, 44180, 9565, 35328, 122776, 132209, 165081, 229066, 232422, 177144, 122562, 155029, 190876, 196179, 145459, 76374, 173449, 147750, -21538, 1694, 80198, 66701, 105543, 170690, 286250, 196762, 37307, -100347, -25480, 62327, 110196, 92602, 225533, 142948, 119364, 228190, 124711, -82621, -174131, -191162, -275840, -258216, -135257, 20497, -158617, -241760, -214824, -241237, -194478, -155628, -241071, -279088, -133231, 40530, 222820, 250040, 267844, 270639, 213432, -15497, 175094, 136077, 35250, 45800, -45809, 13866, 47339, -83443, 15248, 102718, 90800, 138295, 116925, 77051, 45973]
10853D5973p2209p9542p1967N0256J77681j1190r4555K0464N2029J31813j5883
10842A32870P0902j66568p0042O7101k6460l36418r7813O947N720J05934L9858
10831b67969J60863j5733M7101J50973n9469J10501M6391Q905j22726k60774j53214
10820c55151P9642J74302M7026j808l2806j39380R7163j0719P8507J61040J1693
10809A09509M3100N0256Q5505j33147o9207P3962N1472j10464R9198Q1107k13753
10798F7538j54469J02293K01763M8689j69011Q710J02826N2779j21295l4423l4943
10787G0457j30740k5649Q9393J88074P7261j97671k53577n9631Q1741l0514O0614
10776a30242J36226J63244j03864k71841K5337K8030J81315J71924p1723j00495
$$ y = [45973, -26236, -105778, -177745, -127489, 50192, 39002, -55553, -35089, 16940, 148753, 132870, 203772, 37204, -32838, 34263, 7803, -328615, -426428, -419481, -413761, -307827, -267969, -107106, -122839, -75738, 75235, 15766, 126267, 172658, 181563, 58837, -201937, -355151, -275509, -101207, -54181, -55989, -88795, -228175, -131012, -141731, -63224, 97816, 109509, 152609, 202865, 288370, 155223, 86016, 159978, 211450, 100986, 200184, 281291, 67538, -86931, 15362, 217125, 265814, 96803, 105513, 208339, 261118, 139823, 105400, 70457, -60283, -85932, 3461, 191535, 268796, 71125, -182452, -242083, -160342, -190856, -130242, 5984, 169228, 65364, -206477, -181140, -153110, 28205, 200129, 128406, 27911]
10766B7911o106J60908J23728j8807j36463r1834p670Q056J38511J7030O256L4435
10754B55955l7697j12147P8529J62752m060q161l4475j44640j19079r679p7699
10743e0401n77J1973Q1758k8763q3372p5402J3456L8419J74361o0437k1301Q2326
10731H2040j11254M8802j5413j05232O5854r3934o622Q6633M0815J01452J53724
10720B46865l6316l7971j13979j28930k3303J80253J73549N8732j75750k5875
10710A17275p6440j66627J30618N0045n0596p9681p4167k6184J8060O8608J8333
10699g0756J25353J16541J4641M3807K9689j03329j54508j88450j01342R181l0879
10688c10052N4762L1558M809J06447J30591j44643M9551K74262M0102k5350P662
$$ y = [27911, 21805, 182713, 306441, 287634, 151171, 59337, 51667, 59723, 198234, 215264, 221520, 255955, 218258, 106111, 184640, 347392, 343332, 335171, 300696, 156056, 36977, 27298, -50401, -50978, -39005, 42753, 13990, -69382, -144784, -131328, -92909, 81452, 21015, -286, 82040, -29214, 19588, 4175, -101057, -35203, -129137, -135759, -49126, -8311, 93141, 246865, 210549, 172578, 58599, -70331, -93634, 86619, 260168, 318900, 143150, 117275, 40835, -125792, 4826, 54871, 4275, -75406, -149573, -175757, -157697, -89089, -70756, 54597, 171138, 185779, 229586, 259275, 155946, 1438, -187012, -288354, -279173, -310052, -255290, -223732, -218923, -112476, 18115, -126528, -76977, 197285, 237387, 212037, 219699]
10677B19699k9640j83925Q2524k4912N4643R748j30761l1958R6972N2203M2818
10666A57411j3904j02770j50606P2534J0568k166q4057n8449m3561M5563J61159
10655h278m4315J87458R7057q1497j17094M4788J25173j1450j63534J52266J10813
10644B91387j99315L5791r8214j54989J2706J0792j14634j21524N4132Q4554K14432
10633A5118J15469j07702P0731J5500o4659P1416j24324o3388R6547J28749j17524
10622C5933m7501m7232r4184P3662l904J41117R3815j63394k5401n1376l2087
10611a20552K6961q7546J30683K00837L4581k51566M1832J33324r1472m5853O8619
10600C9848K62347J6221n0958j0793j25311r7399j20625O8945J47878N0546k04121
$$ y = [219699, 190059, 6134, 88658, 63746, 118389, 128137, -2624, -34582, 62390, 114593, 157411, 143507, 40737, -109869, -37335, -26767, -28933, -112990, -171439, -215000, -169437, -8278, -52593, 134865, 231922, 150425, 33331, 78119, 203292, 191842, 28308, 180574, 291387, 92072, 127863, 29649, -125340, -112634, -101842, -216476, -338000, -283868, -199314, 15118, 130587, 22885, 93616, 109116, 44457, 115873, -8451, -71839, 24708, 153457, 35933, -11568, -58800, -152984, -79322, -83226, 57891, 151706, -11688, -37089, -88465, -120552, -93591, -181137, -50454, 150383, 184964, -66602, -24770, 108554, 17082, -28771, 39848, 302195, 318416, 267458, 256665, 131354, 33955, -86670, -17725, 130153, 180699, -23422]
10589b3422q9693n3604n0900j15432l5575K7691J30331J29814K0150j1859k9532
10578a02031J35301J8483r1712J55788K40709J5138k79815j93544o4037J60182
10568e538J56122K12986R7574j15280k14044O723M368q2777R6310L7591m6681
10557A47354j55815o8073j23788k05954j5169J01647R6089R9887P0256J60802
10547A07236N1683l3998M3328P9432j91775l11659M8390J10141j18572N7860J69138
10536A1204J4375j6828K05353m0831l4819O0216m5992k64381j55199L9356L46171
10525A18625J63817J09879M3130j17099j44444m095j76509m0081Q5702J73322
10515B12247O4408L5509M8839L6616j29238n9152j6462K7271n2393J26435o0259
$$ y = [-23422, -113115, -166719, -217619, -333051, -368626, -340935, -210604, -80790, -60640, -72499, -102031, 33270, 51753, -39959, 115829, 356538, 371676, 91861, -101683, -165720, -5538, 150584, 363570, 461144, 345864, 131820, 138543, 142911, 60134, 156444, 194035, 147354, -8461, -76534, -200322, -406276, -421445, -319798, -223709, -123822, -53566, 107236, 158919, 124921, 168249, 247681, 55906, -255753, -207363, -97222, -215794, -157934, 11204, 25579, 8751, 214104, 173273, 138454, 198670, 152678, -111703, -266902, -227546, 118625, 282442, 392321, 435451, 318352, 173908, 169813, -6696, -46777, 38925, 212247, 276655, 312164, 361003, 397619, 268381, 209229, 192767, 220038, 167645, 294080, 233821]
10504B33821l3339N088n5657k14756j51509J91656O8609L3714p2161O1652M2781
10493A09899k0821Q170p9932N2340J50744o682l1462Q472j31904k20322p0409
10482b31907J10667J53221j7546Q1723k4058l7511o3158r3345J45869R3036j02981
10471A4010j07769J6263n8029q0120K1233J33942O3519Q6206k2383k3763l3236
10460I873M2954o7341J10376K11183J40583p6410q9965p3065l7641q0862R5171
10449A84856p1329q4155J43173j46011k42462j22344J43813J74519J10835r7710
10439f815j46776J7313j0470M9317j8521m9376M1440o4301J78699K23873j6580
10428A97803N2614K8872j50188j14267p8263l3009k17547Q7149J47580R1772o4245
$$ y = [233821, 200482, 205570, 149913, -64843, -216352, -24696, 43913, 77627, 5466, 67118, 109899, 89078, 97248, 17316, 69656, 220400, 213718, 182256, 190728, 58824, -161498, -231907, -121240, 31981, 14435, 96158, 72100, 34589, -28569, -121914, 23955, 116991, 14010, -93759, -77496, -135525, -215645, -194412, -60470, 3049, 89255, 66872, 43109, 9873, 52827, -14514, 95862, 307045, 447628, 371218, 281253, 208188, 170547, 89685, 184856, 113527, 29372, 172545, 26534, -215928, -338272, -194459, -19940, 90895, -6815, -153591, -136278, -146748, -97431, -115952, -165328, -123888, -188189, -9490, 214383, 197803, 250417, 279289, 129101, 14834, -63429, -96438, -313985, -226836, -79256, 12516, -51729]
10417e1729P7668r7582o6900j03225O4160j7128J83400J45952m7337L9287j15014
10406A1552r1304L7217R0811l5003M0984q497j13236j12741O1333J1965q860q7892
10394b03671L1388P5314K06182l5956j4631N0432Q3980L8017N5834k7296j86586
10383G3007K6593O3901n3790j14821j82623M3208O202J06763J17049M1242o2738
10372F3993n1654R4882Q8148q2485j95699P8496R2507M4714N8469m3525j66033
10361a8187j16815j6791n922j3744J16340K77442K46536J09451k54251m6994n0908
10350B26157k15702k48147m9334K54848K14324l922r3412j90243N770R8043j7319
10339a8937p2716n8474L8233j836o0297j09373L7315K18434K58113L8279o811
$$ y = [-51729, 25939, -71643, -138543, -241768, -177608, -194736, -11336, 134616, 87279, 126566, 11552, -79752, -42535, 48276, 13273, 54257, 45760, -67476, -180217, -118884, -106919, -115779, -203671, -172283, -96969, 109213, 73257, 58626, 109058, 193038, 231055, 286889, 259593, 73007, 99600, 163501, 109711, -5110, -187733, -144525, -138323, -31560, 85489, 126731, 63993, 12339, 107221, 195369, 112884, -82815, -4319, 88188, 132902, 191371, 147846, -18187, -135002, -151793, -157715, -171459, -55119, 222323, 468859, 578310, 324059, 277065, 226157, 10455, -237692, -287026, -32178, 182146, 178224, 84812, -105431, -99661, -1618, -18937, -91653, -150127, -111894, -113730, -174027, -283400, -246085, -27651, 230462, 268741, 261930]
10328B61930k03622j56762L2454L4628j9904k2760p9678Q7801P0639K5472j1508
10317A8690j458q5966O6868J64756j37977j40270l3569J64747K08592j95504j29796
10306a00887Q1181P0543j07156k0948J31087R290m6455K6988R0950j39927j43240
10295a48574l2396J5061r615J66548K7665P0434N3606R0756l6076p3063j64207
10284c9861r4260K5880n437M9785Q9290O1471n0585j26078K0541M6543K8020m329
10272I80r1080j4775J7102P5957J20358k3643j24049n924J01138k8844q8166j7853
10260g8799J18709O04k25516Q7856m9265Q1740K3103J13061j34716j03666J54692
10249a2197O4008j59790j75718O6893j12910Q1338N2263n7164M2768L4409L7427
$$ y = [261930, 58308, -98454, -66000, -31372, -51276, -74036, -153714, -65913, 4726, 30198, 18690, 17232, -68734, -1866, 162890, 24913, -115357, -148926, 15821, 224413, 28909, -100887, -19706, 50837, -56319, -77267, 53820, 63110, 16655, 43643, 134593, -5334, -148574, -180970, -165909, -175524, -8976, 18689, 89123, 142729, 233485, 197409, 124346, -39861, -134121, -108241, -113678, -63893, 25397, 86868, 36283, -89795, -69254, -22711, 5309, 980, -90100, -104875, -87773, -11816, 108542, 84899, -39150, -45074, 56064, 27220, -60946, -78799, 39910, 40514, -185002, -97146, -146411, -64671, -41568, 71493, -63223, -166889, -12197, 51811, -107979, -283697, -216804, -329714, -248376, -196113, -253277, -210509, -176100, -138673]
10238a38673L5306P1934Q6625J35166M6377j22190j42796Q0790p1074j43965j53575
10227c16075k7488L9792J29975L744j5397J69031J03748n3808J02357j8155k9077
10216H8647r758j55090K3340p7276j08158K91632J91884R6539N1175k422j73759
10205B16754k20640r4003l4899J58770O9864K1782K7576L4129N600j43563j1181
10194C0189J2952J8395o2579J87316O1221n5439j52558M4697L6484J00549R9471
10183C20698q0120j20267j01457O251J38132K04672k4754j59975O1341j03551
10173A40970k04913N0362J83366o6896M3714j76371j54782O6837Q6796R3019o2370
10162b68q1949l9753J34102O5679m2669M4430k13947j20546j26017J56017P9970
$$ y = [-138673, -103367, -31433, 55192, 190358, 236735, 114545, -28251, 52539, -18535, -162500, -316075, -343563, -303771, -173796, -170052, -185449, -16418, 87330, 33522, 135879, 117724, 88647, 78889, -76201, -52861, -130137, -238295, 53337, 245221, 341760, 392935, 390513, 216754, -3886, -97889, -132788, 25982, 95846, 117628, 145204, 179333, 184933, 41370, 30189, 43141, 61536, -1043, 186273, 247494, 192055, 39497, 84194, 120678, 221227, 320698, 240578, 120311, 18854, 25105, 163237, 367909, 343155, 183180, 244521, 140970, -63943, -13581, 169785, 102889, 146603, -29768, -184550, -117713, -30917, 62102, -268, -82217, -121970, 12132, 77811, 35142, 79572, -134375, -254921, -380938, -224921, -144951]
10151a44951O2641m0185o2275k5409K7189J15744o9095J2785O0437M0661J14939
10140I2481O64j27785Q471k8885L0702n8989n5017P3529j52491r399O8457J38405
10128a9857k5439j73395J7951K2115J26171J04799j59715n8819k3890R6825J24635
10117C1381L9873k06881r5989O8943K2943p6852J39566P8131j49358o5873J38224
10106g5892l1958J67576N7129j35851O6966O3996o0540N1211J18087l83r1824
10095A28517j90231M7301N9514O9851J03437m9582j8693j60674k04387P9891O0873
10084g4183Q3389L1786j31452m7975M7486K5620o4971J11518Q2864J5963J67761
10073B47806m2371J07717Q0071j15571j5799j07254L1689m1751j38994r7341l6225
$$ y = [-144951, -82310, -122495, -184770, -210179, -182990, -67246, -136341, -123556, -63119, -22458, 92481, 93145, -34640, -26169, -55054, -24352, -83341, -138358, -64829, -217320, -226719, -158262, -19857, -45296, -218691, -200740, -178625, -52454, 52345, -107370, -166189, -190079, -93254, 31381, 71254, -135627, -231616, -162673, -139730, -216582, -77016, 1115, -148243, -214116, -75892, -107850, 59726, 116855, -18996, 47970, 111966, 51426, 102637, 220724, 220341, 128517, -61714, -14413, 45101, 114952, 218389, 168807, 150114, -10560, -214947, -135056, -74183, 9206, 40992, -90460, -138435, -90949, -65329, -130300, -18782, 64082, 80045, 247806, 205435, 313152, 393223, 277652, 261853, 154599, 186288, 144537, 5543, -91798, -128023]
10062a28023j00496n0024Q49R7000J05915J41203j1941r2773r6259n3496K00954
10051A2909K79340N0448j26231q9037m8966R7623M9901j60442m9285j3565k3385
10040b0690r214m1995o5750J28484J73439j498j37059k9843J7529M7093O8210
10029A28706m7966l7837Q232L3743R0518j04529j27851N1536J3219M3419J10117
10018A61307J58556P5912j88283j04912n4191M5853J46146K7184r4788n8550k6329
10007H7905l9165n3330N2252J07395J32225m0096J169o6484n0521J1978j6316
9996A27012q7090j09497J40293R476l8655j156M6915n3520k38521k1221P9546
9985a46418K50644m4322j09203J31235J40176l1670j44568J15608M2076r7206
$$ y = [-128023, -228519, -278543, -277694, -180694, -74779, 66424, 54483, -38290, -134549, -188045, 12909, 292249, 342697, 216466, 127429, 78463, 176086, 225987, 65545, 16260, 2695, -20690, -29904, -71899, -137649, -9165, 164274, 162776, 25717, -4126, 13403, 60496, 128706, 80740, 42903, 51135, 84878, 175396, 70867, -56984, -5448, 7771, 51190, 161307, 319863, 395775, 207492, 102580, 48389, 94242, 240388, 267572, 172784, 114234, 87905, 48740, -4590, 47662, 155057, 287282, 247186, 248355, 181871, 131350, 143328, 127012, 39922, -69575, 70718, 80194, 41539, 40383, 87298, 33778, -204743, -225964, -146418, 104226, 59904, -49299, 81936, 222112, 190442, 45874, 161482, 203558, 106352]
9975A06352k6688q3867o1970k3164J97666K7209j07504O8066M8047j25765j38684
9964a20302q8335j7186Q7713l2209m358O3283P1423O9081J63099o7165p5899J19954
9952A69099L2940k6769m0312j3647r8986j71569k5672q9371m9362J54365k4741
9941a84025m0564j7162K35496n5361O973J53484o4211j31301j60966J11498L7695
9930a08444J38984j12779P118j0648J24107M626J02394R2709o8668l4454k5250
9919A09695J18566m9919J764P0631j1774K6234j05857p3000n8851j97992N8731
9908a11772J2822J16772j13091k6118K5925L4793L2643o7349r5684k3927J11536
9897a03450l8424J95486K14410r1501j55999J56351P0027K1513r5873m9653r2216
$$ y = [106352, 79664, -4203, -66173, -89337, 108329, 135538, 28034, 96100, 144147, 18382, -120302, -208637, -225823, -138110, -170319, -174677, -111394, -39971, 29110, 192209, 125044, 49145, 169099, 202039, 175270, 134958, 121311, 22325, -149244, -174916, -264287, -313649, -159284, -184025, -224589, -241751, -6255, -61616, -54643, 98841, 34630, -96671, -257637, -146139, -108444, 30540, -82239, -75121, -85769, 38338, 42964, 145358, 238067, 169399, 134945, 109695, 228261, 178342, 180106, 250737, 238963, 265197, 159340, 86340, 27489, -170503, -111772, -98950, 17822, -95269, -121387, -95462, -60669, -28026, -95375, -191059, -214986, -103450, -141874, 53612, 268022, 176521, 20522, 176873, 246900, 268413, 172540, 122887, 30671]
9886C0671n6506M516J532k50676j54561K18899J15554M6299j47053J24655J19221
9875E2551l9787n2491k7534o9879O6228J94585P7479j29886q2897J62945R5016
9864B46330Q3867R9394q2480j98959J59J62713J10256m9667l5340p1258j87826
9853G7189j07949M8568J36242K2168j47668q3187l51793J8088L12212J68216j13263
9842b1177q2211k4753k17515K3389Q708J05905m6575J41356J62339L3109p7044
9831E531k3874p1193j81436L9446n8266p9804K41878J14511j238P4759m1610L6803
9819E5507q6014N3255L2926L1031n0052o7244K8648M2514n3226n0380J5470J3172
9807c4393k2466r3303k8834j0442p9312L8010M9496J49437R3206q570j05308J82438
$$ y = [30671, -25835, -21319, -19787, -270463, -425024, -206125, -90571, -44272, -191325, -66670, 52551, 12764, -39727, -67261, -137140, -70912, 123673, 201152, 71266, -11631, 151314, 246330, 330197, 429591, 347111, 148152, 148311, 311024, 421280, 371613, 336273, 265015, 77189, -30760, 17808, 154050, 176218, 28550, -54637, -406430, -388342, -76130, 92086, -21177, -103388, -128141, -345656, -322267, -313559, -207654, -254229, -112873, 49466, 82575, 5531, -18343, -89536, -270972, -231526, -289792, -369596, -127718, -13207, -14445, 60314, 18704, 55507, -30507, 22748, 55674, 86705, 36653, -30591, -1943, 40571, -12655, -63035, -47565, -34393, -56859, -150162, -178996, -189438, -268750, -230740, -181244, -31807, 61399, 52829, -52479, 129959]
9795A29959M5755l1779O62q3681l3449J45887J22573P7988j89360k73448j17752
9784b06645J25538L2694j08768O1368n518M2140J70310J77572j17115k6400n234
9773A39942o8032l0477K1645j14103N7515R9373Q5075Q8180M2956j57811j11125
9762E3138N9307n9549l7643j76512O4706J89485J9389O1798q4470j92681o8819
9751a71851j109O6613J44269p5393k20176Q6235K06372J17910N7419k10763j39470
9740a39944R5805N6834n4469N05q5588o0330k13068J31060N9315O0092P4778p1490
9728a46500q3316m3793N2867K57549j29168j63216J96698J11839M584r1569n697
9717c9722r9078N1483J33709j2306R9177j20211k35258J4305k2330J07687J69908
$$ y = [129959, 175714, 143935, 144597, 60916, 27467, 173354, 295927, 373915, 184555, -88893, -206645, -81107, -48413, -157181, -95813, -101331, -59191, 111119, 288691, 171576, 145176, 139942, 71910, 41433, 63078, -51025, 6490, 105863, 190938, 279118, 322074, 164263, 53138, 112445, 52896, 15253, -161259, -96553, 92932, 112321, 174119, 89649, -103032, -171851, -172960, -106347, 37922, -37471, -257647, -171412, 34960, 152870, 210289, -474, -139944, -44139, 12695, -41774, -41269, -126857, -187187, -400255, -269195, -209880, -149788, -75010, -146500, -229816, -273609, -220742, 36807, -92361, -255577, -58879, 52960, 57544, -34025, -39722, -138800, -87317, 46392, 34086, 133263, 13052, -222206, -207901, -230231, -122544, 47364]
9706D7364P8886m222j05960j15517l9936K6425J62175j5077O026K2479k1970P6561
9694A17234j50262Q0860K21545K2723l23721p1015J63528L2198m3294k8048l6425
9683a4677M5219j04527q3758R4396m4338K1900L1836q9950k03082J04856J44489
9672i7636J77437N1698m1904m9666j53328j11101R7910L75237Q8546j41475m6141
9661A49577N282p5545n5374J66527j5871o957o0606L0893J80318j42909l82584
9650b07249o9970N1837R9796R989M5572R5631k2308L6074K4759m7361p4573J3079
9638d4724K2621m0715p7258Q8501K49076J2758L3366l972r8532J1879p224N1697
9626A97473j17348O9356m6174J02002J7529m2152K1905K4836p6344m3950L2841
$$ y = [47364, 126250, 122028, 16068, -99449, -139385, -112960, 49215, 34138, 40164, 62643, 40673, 117234, -33028, 47832, 269377, 292100, -31621, -102636, 60892, 93090, 49796, 21748, -14677, 30542, -73985, -157743, -63347, -107685, -85785, -53949, -143899, -346981, -242125, -97636, 79801, 131499, 89595, 39929, -113399, -224500, -126590, 248647, 337193, 195718, 149577, 154859, 79314, 23940, 190467, 174596, 167639, 107033, 137926, 318244, 175335, -207249, -277219, -225382, -125586, -115597, -70025, 25606, 3298, 39372, 64131, 16770, -57803, -44724, -22103, -62818, -140076, -51575, 197501, 210259, 243625, 239653, 141121, 153000, 145776, 197473, 80125, 149481, 103307, 205309, 222838, 180686, 202591, 227427, 151083, 107133, 139974]
9615A39974o8631k25099j46028J97436J08479J21686L7286q5356K2679j8698l318
9604H0410K12562Q1397o3k94458j57104l8630k2281M1368K01614M9489j19467
9593C4837r081j3517K7233j32749k712K0575K68323j6528p9709m250m9649P6305
9581A19078L93n8510K3211L8497J4852m8259l9189k5060l839j89271j56281K04969
9569a19409M8993j32680J82077K48630L4559M9843j27026k29664j16692M4720
9559a16649O7757n0743j125q0217q7917L4141J14723K7923M0661j22592J6501
9548a57537O2430k469J25628o766r2793L6017o1075o0403L4104n7968o8845J64017
9536h5660J31701o0306j1040o7831k7639K17277J39706o2463O2359q2129J086
$$ y = [139974, 71343, -153756, -299784, -102348, 6131, 127817, 165103, 79747, 102426, 83728, 80410, 292972, 374369, 374306, 79848, -77256, -115886, -138167, -96799, 104815, 154304, 34837, 25756, 12239, 39472, -93277, -95989, -75414, 192909, 176381, 96672, 92422, 42773, 119078, 119471, 60961, 84172, 122669, 137521, 89262, 50073, 25013, 21174, -168097, -324378, -119409, -70416, -203096, -21019, 227611, 262170, 312013, 184987, -44677, -161369, -116649, -48892, -99635, -100760, -180977, -268894, -234753, -120030, -92107, -51446, -174038, -157537, -95107, -97576, 28052, 21286, -71507, -35490, -96565, -156968, -122864, -180832, -249677, -85660, 46041, -14265, -25305, -93136, -120775, 96502, 236208, 173745, 236104, 153975, 155061]
9525A55061Q2215J15679q2255j4599J2746j10727l1795K419J51307r4701j71649
9514A3701J61711j2543L4572n9608j40747m5286n842R4691P0240L6262M21j6332
9502A31240J35693m9128j21996m776J36065j4433k9689J0723J10465j32039j58851
9491A3274O7050J11171M3031n6245k7986J1669j16247l7037K8460o327L58N3158
9479H4329P80r5191n0147R7652M2726n3379J62772j42677j16458N6929N487l0082
9467c7259J88975J00833J45525j48178L1773N3179L639k3218P5897J2282k44387
9456A59061o1065N4675l7241J05634m2249k7333j35339o781O0785O9940J04064
9445B44151N756k8129m141r9391p1509J91186N6608L0883j40002J3392J55391
$$ y = [155061, 237276, 352955, 270700, 256101, 268847, 158120, 126325, 128744, 280051, 185350, 13701, 175412, 162869, 197441, 137833, -2914, -48200, -54042, 40649, 110889, 147151, 147572, 131240, 266933, 217805, 95809, 91033, 227098, 212665, 182976, 193699, 304164, 172125, 13274, 80324, 191495, 234526, 178281, 150295, 161964, 45717, 8680, 37140, 30813, 31171, 84329, 85109, -10082, -60229, 37423, 80149, 26770, 189542, 46865, -69593, -12664, -7177, -37259, 151716, 252549, 398074, 249896, 281669, 334848, 338487, 315269, 391166, 403448, 159061, 97996, 152671, 115430, 221064, 178815, 151482, 16143, 9362, 70147, 140087, 244151, 249907, 221778, 217637, 118246, 46737, 237923, 294531, 325414, 185412, 198804, 354195]
9434C54195j95075k21030k2784k0044j932k221l4412k6231P2471L8725k0068L8232
9422d0174l4202n3887O237m7475j9436J08875J22116k5669J5615M5218O6754k1581
9410A22391j13790j16212K6974k4145j8820J54700P8322k5780o5883j96828J83748
9399D677N1277j56958j68210L6956N217r8386l0223J77785K04760J98029K34428
9388D59352p9302k92125J7069P1421p6216J00896O4203K076l8562n9896J62230
9377C31146m6886j46810n4560j53750j77024p3721K17373J60974Q4250j18339
9367B2653q6588j48054K5183K2225M9960J1626m6801p2472K10766K90963L2277
9356C11738n6709K7742k10165k10970m7355j59245P1272j0862O015J37692m7635
$$ y = [354195, 159120, -61910, -84694, -104738, -106670, -108891, -143303, -169534, -97063, -58338, -78406, -40174, -74376, -128263, -122026, -169501, -188937, -80062, 42054, 16385, 32000, 77218, 143972, 122391, 8601, -107611, -80637, -104782, -123602, 31098, 109420, 83640, 17757, -179071, 4677, 55954, -101004, -269214, -232258, -227041, -325427, -355650, -177865, 26895, 224924, 459352, 380050, 87925, 104994, 176415, 100199, 201095, 265298, 267374, 228812, 168916, 331146, 284260, 137450, 82890, -70860, -247884, -321605, -104232, 56742, 140992, 22653, -63935, -211989, -186806, -164581, -114621, -102995, -149796, -222268, -11502, 279461, 311738, 255029, 282771, 72606, -138364, -185719, -344964, -273692, -284554, -278539, -140847, -188482]
9345a88482J02999J67999K6915R2512K33120j3643j88001j32124k2090q330l2320
9334C8555j09337j74681J5199Q5526K80578j7438o2158P937L9043j6227n654k62589
9322a81246k45945p3213K27994J18693o017O8627Q2641k11433J29141Q0430K1810
9311A1482K0046o6066q442J06965R7372K7980m5041m0311p587k10506p4606J84928
9299c786J69131M0790j49023j12904P370J28970P7528J5377k5817o9395R4553
9288A72794J30106k7645o0841N4613J51126m4024j79139k010L2702M179j35398
9277I6463q0526P5958Q1775k9928L8890j02237o9907l5439J14973Q9702r5296
9266H4428p4433P7772n8930l443r8776n4935J8737M6368p318n341j12350q4154
$$ y = [-188482, -85483, 82516, 109431, 201943, 435063, 421420, 233419, 101295, 79205, 70875, 38555, -70782, -245463, -230264, -144738, 135840, 118402, 56244, 64181, 103224, 86997, 81343, -181246, -427191, -500404, -272410, -153717, -159734, -91107, -8466, -219899, -90758, -10328, 11482, 31528, -34538, -42980, 63985, 161357, 189337, 144296, 103985, 96398, -114108, -188714, -3786, 165345, 206135, 57112, -55792, -48422, 80548, 158076, 173453, 147636, 78241, 172794, 302900, 275255, 214414, 269027, 420153, 376129, 196990, 194980, 227682, 231861, 96463, 15937, 91895, 173670, 143742, 182632, 80395, 10488, -24951, 90022, 179724, 84428, 9995, 87767, 28837, 25394, -73382, -128317, -109580, -63212, -70530, -75871, -188221, -272375]
9254b72375P1506p8467K33066R6945O1841j15557K7668j1357r6301K7737J03318
9243D8024P6848j34568p7483P7121L2811N7771p1669k1812K7637n5834j25380
9232a66534p333m842J11395P652Q6530J12474K6094M3198k89165j19139L832o5970
9220b61808q4819J71631J75498m5183q2285j99858j24377J74535J08872J12504
9210e5290J15434j6985o958K2907p919J11557N6799R0469J103j53411l8157M7321
9198A66870M7344N6441k30975j49292L3993J65516l9584r0853j29488M7598L04686
9187A82256k8803P1674n5276q7402N2342r5916J29627J0867k6381q8963j20157
9176e6132p3074o0845J72743K60054j09814j20615j18432J56691J59815l8321
$$ y = [-272375, -200869, -279336, -46270, 50675, 112516, -3041, 24627, 13270, -83031, -55294, 48024, 124872, -9696, -87179, -10058, 22753, 80524, 8855, -12957, 14680, -41154, -166534, -173867, -178709, -67314, -59662, 26868, 139342, 165436, 208634, -80531, -199670, -195838, -261808, -346627, -174996, 502, -44681, -126966, -326824, -451201, -276666, -167794, -55290, 60144, 43159, 36201, 59108, 51189, 162746, 219545, 310014, 311117, 157706, 119549, 166870, 214214, 270655, 39680, -109612, -75619, 89897, 50313, -40540, -170028, -122430, 182256, 153453, 225127, 169851, 82449, 134791, 38875, 168502, 179369, 152988, 64025, -56132, -129206, -190051, -17308, 242746, 132932, 12317, -106115, 50576, 210391, 172070]
9166A72070M1725q7676L9005J2838l1455J3174R9115J11326o4089o2086P4481
9155C18428k795J6732M1301K63274L3521j53989m6839J87926M5420Q0537l7456
9144G46060R5377J5004O1663L58569M09775J52483K86487N02388P99638J182334
9134D609778J935579L224905N297354R098016J2383340J1710129P204569K213851
9126E7677521l124068j3608724j6333290r397632n070384k699678j585140j090725
9118D767880r89797o82299l82976k48468l06645l63644q9853p4940k8224j4137
9108A586897j09225r4608m1697j13524j58927l5226j72651p1249J14574o1679
9098H42685j74294k26187r9829N7954l178M9138j25527r7755K27830J36909o0854
$$ y = [172070, 213795, 126119, 165124, 177962, 146507, 159681, 258796, 370122, 306033, 243947, 318428, 315633, 332365, 373666, 636940, 670461, 516472, 469633, 657559, 702979, 783516, 746060, 841437, 856441, 918104, 1276673, 1686448, 1838931, 2125418, 2627806, 3427444, 4609778, 6545357, 9770262, 15067616, 24165632, 36548972, 48259101, 55463670, 57677521, 54553453, 40944729, 24611439, 15213807, 10143423, 7443745, 5858605, 4767880, 3778083, 3095784, 2712808, 2464340, 2157695, 1794051, 1704198, 1629258, 1601034, 1586897, 1477672, 1383064, 1341367, 1227843, 1068916, 1033690, 861039, 789790, 904364, 842685, 668391, 442204, 342375, 400329, 397151, 446289, 320762, 223007, 450837, 587746, 526892]
9087E26892K5242j33709P4412N8432k877P3212j51596k27035j25967Q069K9156
9076A54231o0641N4847P6958j25047L4239P5777O848l2106J21678N7152J51106
9065E15042j07086l1248l7827q1296J01769m3481k60436q2833q3251J48081L8300
9054G5734K719j98038l3188J69859K76725J89092M2553l28l3671k34330j87480
9043F9647R54O7864j76726j54982R3856J53494L0601q0772J1857K1468J9322q699
9031D7884k400k0826j97362q9983O0799M5472m8620j13430L2448n962n6995J23333
9019b25642J35762k5181N6193M033q4329J93074N8651o2156L7853l7932M1911
9008I2237J96894r6751M8891J08896q4249r0063l794j24599j81223J54017J98411
$$ y = [526892, 552134, 418425, 492837, 551269, 548392, 621604, 470008, 242973, 117006, 125075, 154231, 93590, 148437, 225395, 100348, 134587, 210364, 217212, 185106, 306784, 363936, 515042, 407956, 376708, 338881, 257585, 359354, 315873, 55437, -27396, -110647, 37434, 75734, 78453, -119585, -152773, 17086, 293811, 482903, 525456, 525128, 491457, 257127, 69647, 70601, 138465, -38261, -193243, -99387, 54107, 84708, 3936, 15793, 37261, 56583, 47884, 45484, 24658, -172704, -262687, -201888, -156416, -205036, -318466, -286018, -291980, -348975, -225642, -89880, -115061, -58868, -54835, -139164, 53910, 112561, 50405, 88258, 50326, 92237, 289131, 192380, 241271, 350167, 265918, 175855, 172061, 47462, -133761, 20256, 218667]
8997B18667l0823L0430P5130j73364l104R177J40071R0175m1590p8243n0297l3537
8985A52692j0553n8850L6047K8202j04919j5629O7578J50643q3931o3955K21636
8974C18961M6263n3828j3412K4276j11144l0479m5215j60153j02p7851J42099
8963C9415J18225L0864L5282r1074k8103L1884j17977K0175M6977j3166N1507
8952A24009J20354r4321r9979n5028K8549k5950j06193n2017K4782K34536N8640
8941A57382j75611q0118P6269K6100Q1059L6491o9676o4973J6665O3554K321O8890
8929A38353O6332k9127l6492j52912L7164L5103p3323J12075R7099p2914k1989
8918I9369j34243l7242J6184J70983K17354p8634m1805P6993o1374j12779k24136
$$ y = [218667, 187844, 218274, 293404, 120040, 116936, 126113, 266184, 356359, 314769, 236526, 186229, 152692, 142139, 83289, 119336, 147538, 42619, 26990, 94568, 245211, 161280, 97325, 318961, 365224, 311396, 297984, 322260, 211116, 180637, 135422, -24731, -24833, -102684, 39415, 157640, 188504, 223786, 132712, 104609, 136493, 18516, 38691, 85668, 72502, 124009, 244363, 150042, 50063, -4965, 23584, -2366, -108559, -160576, -135794, 98742, 157382, -18229, -98347, -22078, 4022, 85081, 121572, 51896, -13077, 3588, 67142, 69463, 138353, 204685, 175558, 139066, -13846, 23318, 58421, -14902, 97173, 194272, 121358, 99369, -34874, -72116, -55932, 115051, 332405, 253771, 211966, 288959, 227585, 114806, -109330]
8907a09330L7592m0983m9874J528J40532q922J37841n367l1278j19479j20551
8896a68291K573J83660k223o7764N7654K3445M619O1242j08283k13425q4617L9998
8884b71412R1017j7644j00555K7207N7867M6167Q7369n9374k46324L6162J48479
8873b01041J56859J81834k5713m1446P5967j79189j8620J89947L2096l3535p2632
8862F4527o0050l01211J14914K29518Q0676n9809n6587O3259M305m380j58322
8851h3160m298J18627K4082j40947p9340N6497J54793l9823l4923N0703J10651
8840A32862Q7841K7172r2541o6576J16034L8409m6784J68047n1963l32771j69778
8829a90048K046L5755r9142j55788L6588J28070P0112J25258J22858N5702q7527
$$ y = [-109330, -71738, -112721, -162595, -161067, -20535, -29457, 108384, 103017, 71739, -47740, -168291, -165718, 17942, 15719, -52045, 5609, 29054, 33673, 94915, -13368, -226793, -311410, -271412, -180395, -198039, -298594, -271387, -213520, -167353, -79984, -139358, -385682, -349520, -201041, -44182, 137652, 111939, 70493, 146460, -32729, -51349, 138598, 170694, 137159, 64527, 4477, -296734, -181820, 47698, 128374, 68565, 11978, 75237, 79542, 75162, -83160, -87458, 31169, 55251, -85696, -165036, -108539, 46254, 6431, -28492, 22211, 132862, 220703, 247875, 155334, 88758, 204792, 243201, 196417, 364464, 312501, -20270, -190048, -188002, -152247, -251389, -407177, -370589, -242519, -172407, -47149, 75709, 131411, 43884]
8818D3884j27226j0748P5992J15202P7366P8517L9981j09385k04442o1028q6802
8807a68689R2620Q0685p4997m8053K0213l357N8677O9315m1302O1247N9126J11414
8795B16899j16521q3167j59641j79786J40007O656P7594Q5897L1426J08507l8500
8784H9371J42389K782k28661j26200J00933P9555K0580m1081J10276k20539l20348
8773c90943J64063P9736m8811j0221k2182R5420m0763r1083m3906N5287j233R2706
8761a61930J62920M7319n2621K6543o2637j10202r8233J58533j3282Q0538M2401
8750A9349j7704m2419k9662N5153q4020j28359L9573J44879j3958R7555M3591
8739H3978J30657N4868O4038j37955p6962k19593j44413R1120J26545J23250O4698
$$ y = [43884, -83342, -94090, -18098, 97104, 174470, 252987, 292968, 183583, -20859, -81887, -168689, -76069, 4616, -70381, -118434, -98221, -101578, -42901, 26414, -14888, 46359, 105485, 216899, 100378, 17211, -142430, -322216, -182209, -175553, -97959, -12062, 19364, 127871, 89371, 231760, 234542, 5881, -120319, -19386, 60169, 80749, 39668, 149944, -70595, -390943, -226880, -147144, -195955, -206176, -228358, -132938, -173701, -264784, -308690, -253403, -254636, -161930, 990, 48309, -4312, 22231, -40406, -150608, -248841, -90308, -103590, -23052, 19349, 1645, -40774, -70436, -15283, -99303, -227662, -188089, -43210, -57168, 40387, 83978, 214635, 269503, 333541, 195586, 118624, -100969, -245382, -154262, -27717, 95533, 160231]
8728A60231l5894q712J79142q8025j64050J363L1448r2414R7030J21840J8966
8717B20925j46003j1428K34215R0272P5624k86959l9339O7601o1848j92995o164
8706e6099L7198J91940P1368N7370n8359M2146K282O0136J16714q3552k23242
8695A57902j98348o7368L6741J86188J32303m6645l0910Q0406j82314j81509J9118
8684i4436q1227p7303J11157R686J10129P6793P8998O8336M1231j83319k09389
8673a49344M1958J2683J84551J30868P004j43359j60428j27436l2708K38340J36192
8662A38321J6603n618j8035q7841L5945O7529L4682j02733j05084n6480J46413
8651F3702m1063L4840p9249r5183J74344J33221l242j11090n7991J26706J08324
$$ y = [160231, 124337, 115625, 294767, 206742, 42692, 44055, 75503, -16911, 80119, 201959, 220925, 74922, 63494, 297709, 387981, 463605, 176646, 137307, 204908, 143060, -49935, -56099, -18901, 173039, 244407, 301777, 243418, 285564, 287846, 347982, 464696, 381144, 157902, -40446, -107814, -71073, 115115, 247418, 200773, 169863, 250269, 67955, -113554, -94436, -175663, -252966, -141809, -132123, -21994, 54799, 133797, 202133, 243364, 60045, -149344, -107386, -94703, 89848, 220716, 227720, 84361, -76067, -203503, -236211, 2129, 138321, 154924, 149306, 131271, 43430, 79375, 146904, 181586, 78853, -26231, -82711, 63702, 22639, 57479, -21770, -116953, 57391, 190612, 187370, 76280, 18289, 144995, 253319]
8640B53319r1661J4919j6224J97125Q7425j30913R0984O6949L9913J77662N6866
8629G46364j9350K95000P07686R60149J916331L063005J845744m84344k151750
8620F878835k263465j125831n68292k03045n2593L6549J54884N5355j38521l34617
8610B439259o86156n63444k17356p2598k3182j65805j88772j51977O064O2849
8600D38882P7763n9504R0179J21986K51853J04204j91378J42073Q1142j679J74086
8589A229607K51898Q8146J36943M95128P62212R88267J767481K139287L489704
8580A1348673N540051N359697M01180m520184o216281m158521k433134j378958
8572C942523q23209p96083l35934k31340k00587o8188o2451j17209j93299k03888
$$ y = [253319, 161658, 176577, 160353, 357478, 444903, 313990, 404974, 471923, 511836, 689498, 746364, 727014, 1022014, 1729700, 2689849, 4606180, 7669185, 9514929, 9030585, 6878835, 4615370, 3489539, 2921247, 2718202, 2665609, 2702158, 2857042, 2912397, 2773876, 2439259, 1753103, 1189659, 972303, 899705, 876523, 710718, 521946, 369969, 376033, 438882, 516645, 457141, 547320, 669306, 921159, 1025363, 833985, 976058, 1057200, 1055521, 1229607, 1481505, 1569651, 1706594, 2201722, 2963934, 3952201, 5719682, 7858969, 11348673, 16888724, 22248421, 22649601, 18129417, 11913136, 7754615, 5321481, 3942523, 3119314, 2323231, 1987297, 1755957, 1555370, 1487182, 1424731, 1307522, 1114223, 910335]
8562I10335j80134m8017K39L9473P7266R6001j9042k0730n8307K25088K03374
8551A225546L54678M50953J82178K77936L28521Q7388l6249n58667o06511l40775
8541A364998k41424K70667L52590M71016Q97065J913932K656887J620572p64514
8532H541789k217986k269295j496737p95717n08970k07377j40212q2788l0845
8523G91862k27707l62562r0568J48917J62819J63273l7548l2256K0136j95620
8513C40746k58111k9945m4782J43696J65377N1348M6034M7725j66468j05713k6889
8502A63018P3009N4435N3549M4538l4813N71j21709M0165j7930K9821J0655j1569
8490B83740j3571j82030k63719N499n3888j8667R1271P9774J92080J25115J07027
$$ y = [910335, 730201, 682184, 682423, 721896, 799162, 895163, 876121, 855391, 797084, 1022172, 1225546, 1580224, 2031177, 2213355, 2491291, 2819812, 2907200, 2870951, 2312284, 1705773, 1364998, 1123574, 1394241, 1746831, 2217847, 3114912, 5028844, 7685731, 9306303, 8541789, 6323803, 4054508, 2557771, 1762054, 1253084, 1045707, 905495, 822707, 791862, 564155, 201593, 111025, 259942, 422761, 586034, 548486, 516230, 536366, 340746, 82635, 52690, 7908, 151604, 316981, 368329, 414363, 462088, 295620, 189907, 163018, 236027, 290462, 344011, 388549, 353736, 354307, 232598, 272763, 254833, 284654, 295309, 283740, 270169, 88139, -175580, -170081, -223969, -242636, -151365, -71591, 120489, 245604, 352631]
8479C52631M9629j74220j09096J0362l1576m8962m8965M980L8500K3332j16830
8468e0215j05491J40057n0467k1145P027N8101m2987R8429k09033Q7737J26216
8457C8229N2691o9449j02824k06046j00785K26611J93583n0051J68922m0627r8106
8446A2148r7423J7889J55046J33433Q0898l8503j21307o594j30421j47198k7094
8435a69126J03187Q5143o0654k2936j25509K7970N8209j565j60930o1258J76633
8424a50836R4807J0795J64219j4476j38146M2863P8692o7611k24321m7875m4642
8413b96531K6123L5876K0726P5799o3056j37215J89672J51195J76175J93899j70482
8402B02181k53659j18244P6055m3232j41996j0910N5329J25887M6444j03440L3878
$$ y = [352631, 402260, 228040, 118944, 129306, 97730, 48768, -197, 4783, 43283, 66615, -50215, -155706, -15649, -66116, -87261, -80234, -22133, -65120, 33309, -175724, -87987, 38229, 90920, 21471, -81353, -287399, -388184, -161573, 32010, -18041, 150881, 110254, 12148, -85275, -67386, 87660, 221093, 301991, 263488, 142181, 135587, 5166, -142032, -169126, -65939, 19204, -41450, -64386, -189895, -161925, -103716, -105281, -266211, -327469, -150836, -56029, -45234, 118985, 104509, -33637, 9226, 87918, 20307, -204014, -251889, -296531, -270408, -234532, -213806, -138007, -201063, -338278, -148606, 2589, 178764, 372663, 202181, -51478, -169722, -93667, -136899, -278895, -289805, -234476, -108589, -62145, -165585, -131707]
8391a31707J09422N1800j1020N7957P615N9119j07827j31841K8195J20185J04821
8380A56719o7262k5568J37527j585J21752L1954m3787j29370m4973j38436k08550
8369b11579R1209Q3680Q2401L6881j83684M441q1421l9448K25204O0880N1016
8358A19580k8767K3870J83415l3023j32958j65833j57413l12Q2313m0935J87730
8347C7667N3231O7985r3271J1223j20697q5388J54096l4964r4172l8149k3418
8336a65857J09052n2081J05737J87359p0053j24964m8102Q8087L2283r59l6719
8325B3783j22750N8787L652p4188J4503o6026L0337J49143l1938l0834K19115
8314A73584J80509j78710j42611q6475k8776l3303N7990P2350q7387n6695N371
$$ y = [-131707, -22285, 29515, 18495, 76452, 84067, 143186, 35359, -96482, -68287, 51898, 156719, 89457, 63889, 201416, 199831, 321583, 353537, 309750, 180380, 135407, -3029, -211579, -120370, -36690, 45711, 82592, -101092, -96651, -178072, -217520, 7684, 68564, 119580, 90813, 114683, 298098, 265075, 132117, -33716, -191129, -191441, -109128, -150063, 37667, 90898, 158883, 65612, 76835, -43862, -129250, 24846, -10118, -104290, -142439, -165857, -56805, -108886, -3149, 184210, 114157, -10807, -58909, 29178, 61461, 60502, 23783, -98967, -40180, -36528, -110716, -96213, -162239, -131902, 17241, -14697, -45531, 173584, 354093, 175383, 32772, -53703, -82479, -115782, -57792, 14558, -72829, -129524, -124153]
8303a24153O7334k5766P4034j58586R2175J45718J7099o2911j56805j15175m3842
8292b90878O7117O1398J81769j2158N7638j5191l0949J19253j7918j6632m6652
8281E6797j27074k0444O9582M3931k37688j41746J15942J91332J87109K5824n6656
8270A06909L6012J32784Q6217m3791p8969j00020j11228J64745J02104j5625M6986
8259C26124k4518q9475O299O414J17400m4714j28956Q8911l6394j836q2834j48761
8247a2340n5000J38119q6081j10233R6521r0890N8863O6176K1604J33308J61471
8236C21518q4030j24214o9777N6162j83317k08752P6829J80583M5261n1474J06795
8225F5584k0521l8978L9051J56980K5014q4223j42700j55214M9870R9987J5865
$$ y = [-124153, -56819, -82585, -8551, -167137, -74962, 70756, 87855, 24944, -131861, -247036, -290878, -223761, -162363, 19406, 7248, 64886, 49695, 18746, 137999, 120081, 103449, 56797, -70277, -90721, -21139, 22792, -214896, -356642, -240700, -49368, 137741, 163565, 106909, 142921, 275705, 361922, 318131, 239162, 139142, 27914, 192659, 294763, 279138, 326124, 301606, 212131, 218430, 224844, 342244, 297530, 168574, 257485, 221091, 219255, 136421, -12340, -67340, 70779, -15302, -125535, -29014, -119904, -61041, 5135, 26739, 160047, 321518, 237488, 113274, 43497, 99659, -83658, -292410, -215581, -34998, 10263, -41211, 65584, 45063, 6085, 45136, 202116, 227130, 142907, 207, -155007, -105137, -5150, 10715]
8214A0715J02096K08924j35341k46435L8314J65296j35062j75250m8833O1288
8204a54288J16871M4238r5701J62963l9943j46684m0966N7464K2030j36137J05978
8193a04175n401J68713R2761J55707M8939j56183N3037O2957j30680p9376l9626
8182F6673j01177o6763k116Q6062P6779J44422O1823k601k99349m7473o8604N1009
8170a01315P3847M5289L4627n0619r3610R5071o693k6031K0334L2947j60541j78010
8158c14704j46403N1071J90537J54423k1252Q8845R4799n2904K054J4450J7292
8147G8208j3599p2641q7463R4380J38220K1247k8930m8485N892N1484n0609j69745
8135h2041Q8498k5499j5047m0797o1168O0567J4710J0426q0995Q5796M0333L4662
$$ y = [10715, 112811, 321735, 186394, -60041, -21727, 143569, 8507, -166743, -215576, -154288, -37417, 6821, -88880, 74083, 34140, -112544, -153510, -96046, -74016, -210153, -104175, -109576, 59137, 151898, 307605, 356544, 200361, 253398, 316355, 185675, 106299, 66673, -34504, -101267, -103383, -17321, 59458, 203880, 265703, 263102, -36247, -83720, -152324, -101315, -27468, 17821, 52448, 1829, -91781, 3290, -3403, -29434, -9100, 23847, -136694, -314704, -461107, -410036, -219499, -65076, -86328, 2517, 97316, 44412, 46466, 60916, 78208, 64609, -8032, -95495, -1115, 137105, 158352, 129422, 80937, 86829, 138313, 87704, -82041, 6457, -19042, -34089, -74886, -136054, -75487, -60777, -50351, -131346, -45550, -5217, 29445]
8123B9445L5178J04399k29339k75310J34017j08507m6030L4831J39887K11947
8113C0518K39156N9378k8503r3192q4996k6979q0783k6732n462N1859K57909J34225
8101D26398q0066j83528r9234j75985R8450m0009M863K2542o685r2102m7703M8834
8089a24225O6915j6093j8335J2352N5932N6961k08379o9464O5468m7959J9911
8078b06916P0483p6452k62P6077K0310m7009N2291K19499J25142M3677q5212o9196
8066A22432l5500M3444l7670k7385L0121J28766q2681j04822m8592O50J89577
8055A78340J8750k84301m4915R439q5747J51017J66307N1168L0721j43741L4100
8044H1138J70255J48625q3529k5524O4074o3660j86706j96542q2936M2830N6898
$$ y = [29445, 64623, 169022, -60317, -335627, -201610, -310117, -356147, -321316, -181429, 30518, 269674, 329052, 300549, 207357, 122361, 95382, 14599, -12133, -17595, 34264, 292173, 426398, 346332, 162804, 63570, -112415, -13965, -53974, -49111, -26569, -33254, -125356, -173059, -124225, -57310, -73403, -91738, -79386, -23454, 33507, -174872, -244336, -178868, -226827, -206916, -136433, -212885, -213147, -137070, -116760, -163769, -111478, 108021, 233163, 276840, 191628, 122432, 86932, 130376, 92706, 65321, 95442, 224208, 141527, 36705, -11887, -11237, 178340, 197090, -87211, -132126, -122687, -208434, -57417, 108890, 160058, 190779, 47038, 81138, 251393, 400018, 316489, 290965, 355039, 291379, 104673, -91869, -174805, -131975, -75077]
8033g5077K78827K91499o0132j29287j03080J6890J19277M3881k1215p8020m2410
8022B41153N5407M9682l5096J20662j51574j57872K5269j28152P8390J68491R4529
8011C60889j27206K3587r2379n5117Q1860M7996j37797j12044m2496j8719J64857
8000I3431p9803n1873K29K9686P8106k6591P723K7605j42130r3811M408R3541
7988e9479K6971j39970J81544J48863M1207J25456j66994R6049m6813j7701N9954
7977B49087j02914p5190M5790n4047k6101j0537k10298L1610N883p3467m7834
7966b68018J60074R4176J12739P2941P831j6552j0327o3491j41509J17193J05200
7955A70257N0778Q5899J5891R670m9434r3469M1957j8023q1886O1529k4162n1384
$$ y = [-75077, 203750, 495249, 435117, 305830, 202750, 219640, 338917, 382798, 361583, 283563, 241153, 296560, 346242, 311146, 431808, 280234, 122362, 147631, 19479, 97869, 266360, 360889, 233683, 257270, 164891, 109774, 191634, 239630, 101833, -10211, -52707, -71426, 93431, 13628, -38245, -38016, -8330, 69776, 43185, 50908, 78513, -63617, -157428, -153020, -59479, -32508, -172478, 9066, 157929, 199136, 324592, 157598, 253647, 206834, 189133, 249087, 146173, 70983, 116773, 62726, 36625, 26088, -184210, -152600, -146717, -220184, -268018, -107944, -13768, 98971, 171912, 179743, 163191, 152864, 89373, -52136, 65057, 170257, 221035, 306934, 322825, 332495, 283061, 189592, 231549, 213526, 131640, 193169, 169007, 117623]
7943A17623L4304O1199j18442N6302o6544j70575m326Q4062j37775j06427n0313
7932c00912P5788K01087j81K4249N4493j59328R865Q2962l856L345J98731l4407
7920A51836j35252k8294K33499O8447q5492j0729j82803n7024Q6308J43630m2413
7909A41713o7616p0662O8472l5466j45417o2244R2429K0037J11340N6647o3125
7898D6108j72703N5568k020M991K8279M2325J71417L3454K4748j60779m1190j05854
7886g5656o3410r1440l3381K73502j09948j44835J41172J13224R3419Q7703J49038
7875C39388J17055k01779j39537m5840m5047j06921l3146m1249k199M4361J23854
7864H940o3661J9669M1223M4839M0802M0407j07352M8830l6724l8185N2898N0314
$$ y = [117623, 151927, 213126, 94684, 150986, 84442, -86133, -90459, -6397, -144172, -250599, -300912, -225124, -24037, -24218, 31, 54524, -104804, -94939, -11977, -15833, -12488, 186243, 151836, 16584, -11710, 221789, 290236, 204744, 194015, 11212, -45812, 40496, 184126, 141713, 74097, 3435, 71907, 36441, -108976, -171220, -78791, -58754, 52586, 109233, 46108, -126595, -71027, -73047, -68056, -39777, 2548, 173965, 207419, 232167, 71388, 30198, -75656, -139066, -230506, -263887, 9615, -100333, -245168, -103996, 9228, 102647, 190350, 339388, 456443, 254664, 115127, 69287, 24240, -82681, -115827, -157076, -159275, -114914, 8940, -54721, -35052, 6171, 51010, 91812, 132219, 24867, 73697, 36973, -1212, 51686, 102000]
7852A02000j06139k0674N8312R833k37207O4111l32Q1995J57121q338n5645N5885
7840A00922J05508O7185j538K2875o957M1652M5644k53845j99797p8568j97255
7829c54174J19107K93432J19895j41272q7138L9609N5773J72324o5168k4394J7024
7818A45018j78915p8525J20405k8519j23292L5234k7721L0855O3082K10032j7073
7807A50581j20353k07919J0703M8853Q9040P054l767o3614o3003O9804K05356
7796A22735j05761j16370O6705J11252J21046j18179r6009K12924k4021j5752
7786A58570O949j27578K8440J48507L1688j14591N2325P1417k7095L2653l9287
7775B21998j18423j56097Q2505O1569r0905j09052J26141P9041k4300q6487n1039
$$ y = [102000, -4139, -24813, 33499, 43332, -193875, -129764, -130096, -48101, 109020, 100682, 45037, 100922, 206430, 273615, 272077, 294952, 287995, 329647, 375291, 121446, -78351, -156919, -354174, -235067, 58365, 178260, 36988, -50150, -10541, 45232, 217556, 152388, 127994, 145018, -33897, -112422, 7983, -20536, -143828, -108594, -136315, -105460, -42378, 167654, 150581, 30228, -177691, -166988, -118135, -29095, -22041, -25808, -89422, -152425, -82621, 122735, 16974, -99396, -32691, 78561, 199607, 81428, -14581, 198343, 174322, 158570, 165519, 37941, 66381, 214888, 246576, 131985, 184310, 255727, 228632, 261285, 221998, 103575, -52522, 29983, 91552, 647, -108405, 17736, 96777, 72477, -14010, -65049]
7764f5049N5469J02185j12214K2152J49775q5658l423R0870R730j17103m6516
7753B18j4595K18520J0594m7582N4467P8556N3345J8399j23078k39570j24971
7742a15697P6757K6988N737L2235k4313J08599j6958k5035r0360L5142q566J82296
7730A86825q0396Q0943P0892j383M9280L7178r3430k41099q0538K8101j4596j7826
7718g6049J24487R5962J51825j74072p3989J60190j42009l6223J84229P4425j67786
7707A20990P468O1770m0349P6149R3673j98495j03795M9325J10972K9910o5810
7696A41808j48664J4679M2215j9504R6993m8335j79513j8434J0159P8988N1291
7685B1683m6848j25383N4644n0852R76J6744n440M9614j1379l589L8663K25853
$$ y = [-65049, -9580, 92605, -19609, 2543, 152318, 66660, 63237, 154107, 163837, 46734, 218, -14377, 204143, 214737, 167155, 221622, 300178, 353523, 371922, 248844, 9274, -115697, -38940, -11952, -6215, 26020, 1707, 110306, 93348, 68313, -22047, 13095, 4529, 186825, 106429, 187372, 258264, 256881, 306161, 343339, 249909, 8810, -71728, -43627, -58223, -76049, 48438, 144400, 296225, 122153, 48164, 208354, 66345, 30122, 214351, 288776, 120990, 128458, 190228, 149879, 226028, 319701, 121206, 17411, 66736, 177708, 207618, 141808, -6856, 7823, 50038, 30534, 127527, 79192, -100321, -118755, -108596, -29608, 21683, -25165, -150548, -95904, -146756, -145780, -129036, -134476, -84862, -96241, -99830, -61167, 164686]
7673A64686r4296R4489k07421M5803k4893m4650j23932j8085R259n9146J7081
7662b41105J30953K2222j73511Q7228Q6108m1593p8433N9870N9703J87254N5813
7651A54509P705J4440j63890j57109P4552O9178L6511m4999q415K58747o8729
7640A72500K2552q7311k59799Q9486P748j00782J71430J14732q4182j8117j14468
7629h6211m2816P8919m166N9788k0288j74691j34257O1761P0092N9331P399M5597
7617g9542J84158M3768p0028J8616q5015M6920Q4637O8371j41073k7773k6695
7606A6344K2913j683r2696r2358m7534N2096J19090k3871j67505M7219K5082o3625
7594b06528P4372j1626j32312K951K23920J33295J2862j20963l4282M3502j01572
$$ y = [164686, 70390, 164879, -42542, 3261, -21632, -66282, -190214, -208299, -199040, -258186, -241105, -110152, -87930, -261441, -174213, -88105, -129698, -208131, -148261, -88558, 98696, 154509, 162214, 176654, 12764, -144345, -69793, -615, 35896, -9103, -17518, 241229, 172500, 195052, 107741, -152058, -62572, -54824, -155606, 15824, 130556, 46374, 28257, -86211, -129027, -50108, -54274, 5514, -14774, -189465, -323722, -261961, -191869, -132538, -125139, -79542, 104616, 148384, 78356, 96972, 11957, 58877, 143514, 211885, 70812, 43039, 16344, 39257, 37574, -55122, -147480, -195014, -142918, -23828, -47699, -215204, -167985, -142903, -206528, -132156, -143782, -276094, -273143, -49223, 84072, 96934, -24029, -58311, -14809, -116381]
7583a16381r8076k282J42836J09683j53864n4754K15335K17600L05421j60533
7573D04985j46376o3117j69751j00973M6175R7726o5828m7271k2506j64l8191
7562a05291p3353R2743Q2815K9272O3956j1733m1460j53860M9063M1306j27715
7551a54257j05515Q6144J55164O6379J26622R8846r8027j4102J1759q7454j86630
7540a01071J0833L1606k04282m2206K25649p8490p8794K65017J11464k2433N2832
7529A70125k99592r8411J09073K30306l43q430j71449J31975J45873n8599o8299
7518H2229K1168J3291j01308j10653N0727r9699N0001P4824J02704M6427Q7301
7507B17012n6721m5776k05624l5904J74503J60507M8068j16958M55k29162m3133
$$ y = [-116381, -214457, -216739, -73903, 35780, -118084, -172838, 42497, 260097, 565518, 404985, 258609, 195492, 25741, -75232, -29057, 68669, 2841, -44430, -66936, -67100, -105291, -178644, -85901, -3086, 26186, 90142, 78409, 36949, -116911, -67848, -26542, -154257, -259772, -173628, -18464, 47915, 174537, 273383, 175356, 161254, 173013, 85559, -101071, -90238, -58632, -262914, -305120, -79471, -157961, -236755, 28262, 139726, 117293, 170125, -129467, -227878, -118805, 111501, 111158, 102728, -68721, 63254, 209127, 150528, 82229, 103397, 116688, 15380, -95273, -44546, -144245, -94244, -19420, 83284, 129711, 217012, 160291, 114515, -91109, -127013, 47490, 207997, 256065, 139107, 139562, -89600, -132733]
7496a32733J05089k06076j67093O6780p1196r2220p240K4440K3334K72646K32472
7485D8203K4120L0179p8703r3620k12562O0381J57167M2997J19914J541Q2308
7474A81925j0292p0243m5077k7500j0034q1822K9904J28607M7266l0452j41493
7463b9211j3217P5277J31922J03166o9007j86562j9464M2911N8825j12590j26157
7452a44107j8106J769j8618j8977O9498K1622M2072J4345n493N2191J36907p7308
7440E5795j49791m1348M728N4387j01594k7679K4760Q6744j0470N2501K7206j63419
7428a88180l454K54159J28043p9796j83766K2873j7968M4393j7076O5318K4196
7417D8742k1452L822l172P3476K279k06662k7599J9843P14R8325k496l8982p4860
$$ y = [-132733, -27644, -233720, -400813, -334033, -405229, -497449, -504689, -480249, -456915, -184269, 48203, 72323, 102502, 23799, -69821, -282383, -222002, -64835, -21838, 98076, 99617, 181925, 171633, 101390, 56313, 28813, 18779, -63043, -33139, 95468, 142734, 112282, -29211, -42428, 32849, 164771, 267937, 198930, 12368, -7096, 35815, 94640, -17950, -144107, -162213, -160444, -179062, -198039, -128541, -106919, -64847, -50502, -55995, -3804, 133103, 55795, -93996, -135344, -130616, -76229, -177823, -205502, -180742, -93998, -104468, -51967, -24761, -188180, -191634, 62525, 190568, 110772, -72994, -50121, -68089, -23696, -40772, 24546, 48742, 27290, 31112, 27940, 101416, 103695, -102967, -130566, -110723, -110009, -11684, -14180, -53162, -128022]
$$ [...]
##END NTUPLES=NMR SPECTRUM
##END=
