##TITLE=Analysis number 315157
Compound Code cc 18304
Project Code adrs
Chemist Name ugmt
##JCAMPDX= 6.0         $$ Bruker NMR JCAMP-DX V2.0
##DATA TYPE= NMR SPECTRUM
##DATA CLASS= NTUPLES
##ORIGIN= Bruker BioSpin GmbH
##OWNER= NMR
$$ XWIN-NMR		Version 3.5
$$ Wed Nov  9 13:14:49 2005 GMT Standard Time (UT+0h)  MAYBRIDGE\NMR@NMR_250MHZ
##.OBSERVE FREQUENCY= 250.131544655141
##.OBSERVE NUCLEUS= ^1H
##.ACQUISITION MODE= SIMULTANEOUS (DQD)
##.ACQUISITION SCHEME= undefined
##.AVERAGES= 16
##.DIGITISER RES= 18
##SPECTROMETER/DATA SYSTEM= dpx250
##.PULSE SEQUENCE= zg30
##.SOLVENT NAME= CDCl3
##.SHIFT REFERENCE= (INTERNAL, CDCl3, 0, 16.522)
##AUDIT TRAIL= $$ (NUMBER, WHEN, WHO, WHERE, WHAT)
$$ ##TITLE= Audit trail, XWIN-NMR		Version 3.5
$$ ##JCAMPDX= 5.01
$$ ##ORIGIN= Bruker BioSpin GmbH
$$ ##OWNER= NMR
$$ C:\u/data/dgb/nmr/ADRS/12100/pdata/1/auditp.txt
$$ ##AUDIT TRAIL=  $$ (NUMBER, WHEN, WHO, WHERE, WHAT)
(   1,<2005-11-09 13:14:22.36 +000>,<MAYBRIDGE\NMR>,<NMR_250MHZ>,
      <created by zg, POWCHK disabled, PULCHK disabled
       configuration hash MD5:
       62 19 C7 07 E1 42 D1 B7 37 6C 3D D0 77 39 F9 E6
       data hash MD5: 64K
       F4 68 7A DB 7F BA C1 4C B0 B4 F6 7F B3 D5 0E 1C>)
(   2,<2005-11-09 13:14:37.11 +000>,<MAYBRIDGE\NMR>,<NMR_250MHZ>,
      <Start of raw data processing
       ef LB = 0.3 FT_mod = 6 PKNL = 1 SI = 32K 
       data hash MD5: 32K
       C8 A6 97 FA 39 B7 E7 11 8B 8A 36 10 48 D3 70 1F>)
(   3,<2005-11-09 13:14:38.99 +000>,<MAYBRIDGE\NMR>,<NMR_250MHZ>,
      <apk 
       data hash MD5: 32K
       4E FD 6F C5 44 FD 2D 65 70 99 5A EF 01 59 36 D1>)
(   4,<2005-11-09 13:14:39.99 +000>,<MAYBRIDGE\NMR>,<NMR_250MHZ>,
      <abs ABSG = 5 
       data hash MD5: 32K
       65 83 5F 26 04 9D EB 52 3E 76 45 1E 6E 09 B4 FB>)
$$ ##END=
$$ 
$$ hash MD5
$$ B8 76 1D C4 0F 0D 00 FC EF D7 40 5D 45 E2 2F 0B
##$RELAX= 
##$RELAX= 
##$RELAX= 
##$RELAX= 
##$RELAX= 
##$RELAX= 
##$RELAX= 
$$ Bruker specific parameters
$$ --------------------------
##$DU= <C:\u>
##$EXPNO= 12100
##$NAME= <ADRS>
##$PROCNO= 1
##$TYPE= <nmr>
##$USER= <dgb>
##$AMP= (0..31)
100 100 100 100 100 100 100 100 100 100 100 100 100 100 100 100 100 100 
100 100 100 100 100 100 100 100 100 100 100 100 100 100 
##$AQSEQ= 0
##$AQ_mod= 3
##$AUNM= <au_zg>
##$AUTOPOS= <33 >
##$BF1= 250.13
##$BF2= 250.13
##$BF3= 250.13
##$BF4= 250.13
##$BF5= 500.13
##$BF6= 500.13
##$BF7= 500.13
##$BF8= 500.13
##$BYTORDA= 1
##$CFDGTYP= 0
##$CFRGTYP= 5
##$CHEMSTR= <none>
##$CNST= (0..31)
1 1 145 1 1 1 1 1 1 1 1 1 1 1 1 1 1 1 1 1 1 1 1 1 1 1 1 1 1 1 1 1 
##$CPDPRG= <>
##$CPDPRG1= <>
##$CPDPRG2= <>
##$CPDPRG3= <>
##$CPDPRG4= <mlev>
##$CPDPRG5= <mlev>
##$CPDPRG6= <mlev>
##$CPDPRG7= <mlev>
##$CPDPRG8= <mlev>
##$CPDPRGB= <>
##$CPDPRGT= <>
##$D= (0..31)
0 1 0 0 0 0 0 0 0 0.06 0 0 0 0 0 0 0.0002 0 0 0 0 0 0 0 0 0 0 0 0 0 0 
0 
##$DATE= 1131542061
##$DBL= (0..7)
120 120 120 120 120 120 120 120 
##$DBP= (0..7)
150 150 150 150 150 150 150 150 
##$DBP07= 0
##$DBPNAM0= <>
##$DBPNAM1= <>
##$DBPNAM2= <>
$$ [...]
##$SUBNAM7= <"">
##$SUBNAM8= <"">
##$SUBNAM9= <"">
##$SW= 20.6930455092707
##$SWIBOX= (0..15)
0 0 3 0 0 0 0 0 0 0 0 0 0 0 0 0 
##$SW_h= 5175.983436853
##$TD= 65536
##$TD0= 1
##$TE= 295.16
##$TE2= 300
##$TE3= 300
##$TEG= 300
##$TL= (0..7)
0 120 120 120 120 120 120 120 
##$TP= (0..7)
150 150 150 150 150 150 150 150 
##$TP07= 0
##$TPNAME0= <>
##$TPNAME1= <>
##$TPNAME2= <>
##$TPNAME3= <>
##$TPNAME4= <>
##$TPNAME5= <>
##$TPNAME6= <>
##$TPNAME7= <>
##$TPOAL= (0..7)
0.5 0.5 0.5 0.5 0.5 0.5 0.5 0.5 
##$TPOFFS= (0..7)
0 0 0 0 0 0 0 0 
##$TUNHIN= 0
##$TUNHOUT= 0
##$TUNXOUT= 0
##$USERA1= <user>
##$USERA2= <user>
##$USERA3= <user>
##$USERA4= <user>
##$USERA5= <user>
##$V9= 5
##$VALIST= <valist>
##$VCLIST= <CCCCCCCCCCCCCCC>
##$VD= 0
##$VDLIST= <DDDDDDDDDDDDDDD>
##$VPLIST= <PPPPPPPPPPPPPPP>
##$VTLIST= <TTTTTTTTTTTTTTT>
##$WBST= 1024
##$WBSW= 4
##$XGAIN= (0..3)
0 0 0 0 
##$XL= 0
##$YL= 0
##$YMAX_a= 493382
##$YMIN_a= -485427
##$ZGOPTNS= <>
##$ZL1= 120
##$ZL2= 120
##$ZL3= 120
##$ZL4= 120
##$ABSF1= 16.522
##$ABSF2= -4.171173
##$ABSG= 5
##$ABSL= 3
##$ALPHA= 0
##$AQORDER= 0
##$ASSFAC= 0
##$ASSFACI= 0
##$ASSFACX= 0
##$ASSWID= 0
##$AUNMP= <proc_1d>
##$AZFE= 0.1
##$AZFW= 0.1
##$BCFW= 0
##$BC_mod= 0
##$BYTORDP= 0
##$COROFFS= 0
##$CY= 12.5
##$DATMOD= 1
##$DC= 0
##$DFILT= <>
##$DTYPP= 0
##$F1P= 14.0000005364418
##$F2P= -0.99999901652339
##$FCOR= 0.5
##$FTSIZE= 32768
##$FT_mod= 6
##$GAMMA= 0
##$GB= 0
##$INTBC= 1
##$INTSCL= 1
##$ISEN= 128
##$LB= 0.3
##$LEV0= 0
##$LPBIN= 0
##$MAXI= 10000
##$MC2= 0
##$MEAN= 0
##$ME_mod= 0
##$MI= 0
##$NCOEF= 0
##$NC_proc= -3
##$NLEV= 6
##$NOISF1= 0
##$NOISF2= 0
##$NSP= 0
##$NTH_PI= 0
##$NZP= 0
##$OFFSET= 16.522
##$PC= 1
##$PHC0= 78.47842
##$PHC1= 5.16513
##$PH_mod= 1
##$PKNL= yes
##$PPARMOD= 0
##$PSCAL= 4
##$PSIGN= 0
##$REVERSE= no
##$SF= 250.13
##$SI= 32768
##$SIGF1= 0
##$SIGF2= 0
##$SINO= 400
##$SIOLD= 32768
##$SREGLST= <1H.CDCl3>
##$SSB= 0
##$STSI= 32768
##$STSR= 0
##$SW_p= 5175.98343685301
##$SYMM= 0
##$S_DEV= 0
##$TDeff= 65536
##$TDoff= 0
##$TI= <Analysis number 999999
Compound Code 99
Book Reference 9
Project Code 9>
##$TILT= no
##$TM1= 0
##$TM2= 0
##$TOPLEV= 0
##$USERP1= <user>
##$USERP2= <user>
##$USERP3= <user>
##$USERP4= <user>
##$USERP5= <user>
##$WDW= 1
##$XDIM= 32768
##$YMAX_p= 310763599
##$YMIN_p= -240537
$$ End of Bruker specific parameters
$$ ---------------------------------
##NTUPLES= NMR SPECTRUM
##VAR_NAME=  FREQUENCY,     SPECTRUM/REAL,   SPECTRUM/IMAG
##SYMBOL=    X,             R,               I
##VAR_TYPE=  INDEPENDENT,   DEPENDENT,       DEPENDENT
##VAR_FORM=  AFFN,          ASDF,            ASDF
##VAR_DIM=   32768,         32768,           32768
##UNITS=     HZ,            ARBITRARY UNITS, ARBITRARY UNITS
##FACTOR=    0.157963299565203, 1,           1
##FIRST=     4132.6476996994, 0,             0
##LAST=      -1043.33573715361, 0,           0
##MIN=       -1043.33573715361, -240537,     0
##MAX=       4132.6476996994, 310763599,     0
$$ Real data points
##PAGE= N=1
##DATA TABLE= (X++(R..R)), XYDATA
32767 -26291 -32807 -17657 -324 2017 2192 3231 -6342 -4996 -10800 -7352 -8368 6364 14120 -3395
32753 -3395 -12831 -21694 -18629 -30151 -11808 8302 14927 4894 -14242 -26719 -15326 -5671 -3442
32740 -3442 -9022 -15111 -20645 -39866 -35512 -23492 -25050 -17249 -9713 939 -7515 -13641 -15501 -29534
32726 -29534 -49166 -45555 -29196 -20857 -21229 -17762 -14628 -21128 -17722 -8752 -11382 -2239 -5755 -21812
32712 -21812 -38978 -27824 -19507 -10109 -7493 -11962 -11524 -713 10326 942 -7376 -2997 8781
32699 8781 10530 17897 16056 1745 2332 -8 12100 -6809 -18176 -13071 -13603 -7493 774 -10535
32685 -10535 -10913 -12012 -7818 -962 -6127 -7064 4303 8719 -6707 -14936 -24950 -24002 -30886 -27694
32671 -27694 -15565 -34883 -46017 -30041 -4975 -3976 -18822 -22535 -35009 -29994 -8317 1472 3931
32658 3931 3914 1797 -8568 -20302 -5915 5219 8032 -2471 -17588 -31686 -16874 -582 18234
32645 18234 6512 -13804 -10301 -2437 2686 5241 -11475 -19837 -24511 -17052 -245 -5827 -12385
32632 -12385 -17634 -17420 -20891 -20556 9261 6344 1250 -18019 -27719 -18941 -2779 -7347 -3028 12898
32618 12898 8202 -15305 -24660 -23407 -14988 -14041 -40600 -46717 -37372 -30043 -11857 1959 -3991 -12723
32604 -12723 -21225 -37534 -39284 -16130 -5236 -15566 -22515 -41312 -54972 -67320 -43991 -31234
32592 -31234 -10573 -9133 -15768 8498 -4009 -28976 -36880 -29639 -5761 5183 463 4646 -10408
32579 -10408 -27794 -21114 -45546 -39075 -22308 -1741 2411 22682 31276 13614 14883 14887 7926 -6992
32565 -6992 -28554 -36514 -26591 -30508 -29195 -15999 -12743 -19490 -39915 -37796 -26916 -16987 -27165
32552 -27165 -28980 -21421 -9819 8642 2088 -18874 -20560 -22043 -29778 -23055 -12407 -18616 -17685 -21591
32538 -21591 -29303 -55239 -37435 -16542 -25346 -29473 -25396 -21260 -9484 -1247 -12525 -8995 12238
32525 12238 6011 2594 -14966 -20379 -16571 -5333 5564 6831 4945 20143 34737 19922 4982
32512 4982 -4100 -3951 -3043 4737 -14577 -14840 -9547 -10949 9258 6859 13581 28609 38439 31138 23242
32497 23242 26687 6863 -3726 -3485 -144 -5426 -14735 -10103 -11222 -1289 1514 -166 7276 -2259
32483 -2259 -1973 -7609 1696 16827 2932 -20676 -16334 3126 1543 5777 23990 18970 2550
32470 2550 5093 27110 11643 -22400 -15374 -19543 -27383 4041 17779 -8459 -22204 -28883 -38061
32457 -38061 -35326 -33442 -41914 -57845 -53438 -44049 -40616 -21465 -24433 -21509 -17466 -7700 -2363 672
32443 672 -10065 -26303 -21849 -10241 9510 11819 -10943 -22623 -27681 -32690 -26446 -10551 -17896
32430 -17896 -21119 -15823 -8216 -6057 -4445 -6577 -1676 -812 -11829 -24868 -22670 -22330 -35841 -26751
32416 -26751 -20148 -18348 -24121 -38680 -26616 -2681 -3773 -15658 -20641 -18412 -21933 -31507 -40586
32403 -40586 -52501 -61209 -48543 -20654 -6405 -9422 -15086 -26606 -62092 -52303 -43439 -38413 -32270
32390 -32270 -27596 -22770 -5504 -13758 -10308 11101 2228 8148 -5125 -14211 -3879 1099 -4466
32377 -4466 -20870 -13309 -18730 -9411 4605 11999 4135 -8013 -21420 -33508 -31643 -12752 3341
32364 3341 14017 -18162 -42684 -22754 -15867 -18199 -80 -21876 -13507 8393 27364 17364
32352 17364 -7994 1672 19927 20455 26565 20144 14892 2130 422 3427 6330 23228 9928
32339 9928 -584 -16529 -20090 -26027 -16908 -14996 -17355 -13357 -25813 -28064 -38037 -61061 -61026 -61497
32325 -61497 -31534 -1160 21481 12522 11222 15948 2727 -18919 -10680 1543 23746 2398
32313 2398 -30093 -26463 -19748 -16495 -23771 -5567 13465 8307 -3575 -13291 -24041 -47610 -41473
32300 -41473 -33087 -36289 -53250 -49457 -26912 -7356 -12450 -17701 -8834 4458 -1740 10584 12584
32287 12584 1619 -14104 -20840 -17939 -11281 -25970 -23671 -26493 -52884 -63850 -56675 -27838 6809
32274 6809 4568 13549 -5781 -23598 -34019 -27568 -25262 -30447 -18962 -21737 -17149 11205 23182
32261 23182 1353 -15162 -11292 -5318 -26088 -16956 -14328 -19810 2407 -15047 -39782 -39117 -25504
32248 -25504 -17442 -16234 -9964 -13097 -30861 -35810 -28570 -7192 -3909 -16375 -14084 -8219 8381
32235 8381 11165 11110 -4373 -18950 7698 27055 25253 27042 19095 834 176 -12484 -21906 -22664
32221 -22664 -47853 -48167 -10716 16542 17213 -6937 -18658 -1443 -9444 -26571 -8389 -6785 -24579
32208 -24579 -34140 -18680 -14186 -24230 -17831 -24428 -26180 -38379 -38869 -13138 -10947 -8066 -9328 -37376
32194 -37376 -14714 -6533 -12761 -7035 -9106 -3069 -17418 -33254 -40937 -12646 21399 14946 -863
32181 -863 -18464 -20559 -9366 5310 3030 -24445 -33072 -37856 -19148 6232 38393 49324 43844
32168 43844 11390 -2022 4394 24109 21536 19435 33206 45995 43335 4991 -7455 2053 6355
32155 6355 -24533 -73649 -73245 -47272 -20031 -4512 -10350 -5636 -26889 -31118 -20248 -23685 -10583
32142 -10583 -3974 5985 9504 -23064 -26966 -29643 -54210 -57054 -51287 -66462 -68381 -55197 -25278
32129 -25278 -13635 -30025 -18754 -7702 -3494 -33011 -23929 -36347 -44587 -27111 8509 1948
32117 1948 -10975 -19557 -29775 -37054 -10559 7535 -1807 -4438 -13185 -23420 -38032 -14917 -5238
32104 -5238 -13578 -36650 -41254 -33253 -11826 -2577 -15666 -27792 -30822 -7249 23112 34373 31277
32091 31277 8976 -6605 -7870 16580 15673 -8259 1734 10841 17942 9118 21537 18348 13481
32078 13481 12027 24704 -14269 -39814 -47441 -33221 -12313 -13122 -29659 -46642 -50823 -24415 -1012
32065 -1012 6335 5146 2436 -996 845 -2715 144 -7294 -38307 -38677 -32523 -4150 4243 13086
32051 13086 15266 -217 -40649 -55655 -27785 -6124 -16918 -19618 -16407 -32188 -31916 -7957 1167
32038 1167 3610 15636 4816 16644 11613 -6602 -16158 -31695 -54287 -38793 -34501 -27686 -17676
32025 -17676 -27551 -35747 -27068 -37927 -40365 -35839 -65448 -73472 -45994 -19889 4252 25659 12549
32012 12549 3582 9210 -6602 -16853 -35506 -35328 -35600 -23769 -2950 21893 1710 -7028 -8185
31999 -8185 -21789 -21916 -16579 -14893 -11883 -3427 9299 11519 18961 7878 5137 467 -6415 -25674
31985 -25674 -24213 -15701 -14135 -15832 1754 7077 -14256 -24103 882 13873 4563 -22211 -36839
31972 -36839 -47760 -35634 -21900 -16743 10969 37420 22260 -2721 -20469 -29287 -19558 -5790
31960 -5790 -22293 -2513 22642 -7236 -35475 -26941 -26076 -35174 -20269 -23948 -28660 -11603 -23876
31947 -23876 -19896 -25934 -31278 -36509 -29246 -20344 -12118 -24964 -18879 242 19145 15724 -1590
31934 -1590 -7310 -249 -16739 -25378 -42612 -44859 -14914 -8404 -5086 -8127 -26279 6241 8556
31921 8556 -6926 -30590 -39374 -23472 12828 31682 27359 22911 35022 40093 19389 -3818 -7881
31908 -7881 16255 43459 17762 -26877 -31592 -5027 23463 24892 -594 -31580 -48734 -65096
31896 -65096 -72465 -59014 -33105 -15835 10968 6053 -5435 -31350 -66539 -60099 -22833 -27236
31884 -27236 -19088 5905 8429 4808 16959 14158 -9724 -15705 -23748 -41143 -38442 -31069 -6120
31871 -6120 -8452 -27452 -71 -1576 -18381 -19489 9381 23083 1982 -3387 -14948 2526 841
31858 841 -6589 -9145 -11723 4252 3384 -20164 -16108 -3575 3725 12325 20623 15193 -3774 -11844
31844 -11844 9428 18989 35017 28796 14397 21684 16479 10249 16122 19674 36431 26306 -3371
31831 -3371 -16410 -5206 -6976 -27123 -18963 -16033 -17570 -33840 -26516 1339 11652 16713 2945
31818 2945 -5291 -11242 -6417 -1718 -32991 -47354 -42778 -16987 -15063 8754 26281 9056 34831
31805 34831 45235 36508 22433 14283 27398 50137 41618 1003 -5390 21489 21206 5585 -5436
31792 -5436 -13338 -2879 15761 14643 -6239 3466 -8114 -15067 -7605 -9822 -24818 -22374 -27335
31779 -27335 -2199 27519 15625 634 1210 1462 -22120 -23130 -18259 -299 -12672 4417 20395
31766 20395 6374 -25778 -25885 -31121 -34201 -36048 -21500 -13631 4678 -3122 1450 12984 -4166
31753 -4166 -6816 -14130 -835 541 -5834 -17632 -19905 -10270 -42514 -46359 -19024 12739 18243
31740 18243 14435 8499 -2773 -23636 -46772 -28703 -18527 -16984 -13243 2864 17143 27582
31728 27582 16368 20654 13561 7758 10123 1476 -157 1642 -3296 5940 3969 -11640 -883 5973
31714 5973 4474 7343 -18623 -30382 -25372 -20031 -15640 -5543 4550 1965 21474 12145 -19641
31701 -19641 -43953 -40304 -23071 5355 14962 -17642 -20617 -13110 8596 9065 -5691 -17416 -18131
31688 -18131 -23683 -18970 -6222 -827 -522 -6755 -14063 -698 -5851 -6034 -23683 -39247 -28364 -18751
31674 -18751 -17947 -20961 -26148 -12829 -7377 -16500 -43530 -50261 -52844 -35618 -11335 7580 32694
31661 32694 33874 40951 16299 -11666 -25157 -12346 -20166 -18478 -27212 -41052 -37162 -5039 -2023
31648 -2023 4486 -11311 -22651 -16755 -11633 -22695 -16412 -22219 -30017 -28842 -48099 -34043 -5839
31635 -5839 -2913 -3234 12081 24595 20877 -4540 -8697 2233 -11318 -9350 -11805 -2227 11240
31622 11240 33970 31132 40997 27323 -17181 -45887 -48072 -22288 1114 15693 10776 -11829
31610 -11829 -35721 -25967 -4197 3605 -25385 -34089 -17993 -9511 16913 15389 8264 2472 -6223
31597 -6223 17411 36051 26910 12607 -12227 -6337 -19279 -38828 -35311 -23475 -18988 -25739 -19539
31584 -19539 -22779 -28777 -14676 25384 22688 16521 17352 7946 -808 -24717 -43774 -57846 -51415
31571 -51415 -42337 -28341 -3310 12428 23264 -12089 -26207 -24338 -54505 -68285 -47057 -2702
31559 -2702 22409 23660 11597 -603 6779 7107 -12331 -14383 -8136 -13781 -14118 -19742 -10053 13041
31545 13041 -1171 17151 23661 -1411 -30475 -31168 -28408 -32387 -30031 -30799 -37635 -22565 3365
31532 3365 21895 5078 -9188 -1228 -4411 1398 9460 -7162 -12985 -21584 -38253 -32296 4003
31519 4003 29831 17447 14047 11152 -9006 -35487 -28836 -12239 -660 -14843 -9087 15570 11014
31506 11014 18322 28193 10431 -2232 3770 -5780 12032 4355 1482 -7253 -30915 -17424 -502
31493 -502 34585 21754 11155 19916 29372 39496 24854 14740 28439 13459 5506 117 6895
31480 6895 -1325 -20676 -36224 -39913 -57790 -47587 -14629 -388 5792 20446 35971 19126
31468 19126 13325 24506 31419 15400 10752 31304 32106 8314 -21072 -26629 -35760 -34658 -45145
31455 -45145 -48286 -22588 -4994 -33 1162 5505 -5154 -7958 -14993 -23298 -55180 -93954 -72789
31442 -72789 -36728 -23933 -36005 -20990 -25091 -23016 -24620 -20069 -3846 3696 5783 503 -8642
31429 -8642 -6988 -16443 -18357 -13966 -28045 -31179 -30608 -10440 3892 27262 35630 32280 10935 4940
31415 4940 24483 27362 13661 12458 7895 -4619 -5207 -8215 2950 -7721 22277 23973 10444
31402 10444 5583 2414 2208 34409 23392 -5588 -27723 -11911 18843 30626 810 -32130
31390 -32130 -52793 -63212 -55158 -73811 -75683 -60488 -47610 -34521 -8633 13784 20493 8554
31378 8554 -15357 -37513 -49053 -37579 -18379 11814 -5630 -14991 -6443 18465 21723 24905 11329
31365 11329 6523 -21936 -25389 -31529 -24949 -25716 -24197 -18986 -25806 -18395 -9951 3907 17081 21523
31351 21523 24605 10417 636 -1099 18936 -10210 -13410 -24428 -26967 -9074 -30759 -51388 -72860
31338 -72860 -66662 -35711 -24770 -3032 18737 13003 7581 19255 6919 -4856 -20808 -27265
31326 -27265 -21092 -41652 -36373 -33832 -48297 -56390 -57788 -52986 -43333 -21942 -22050 -20142 -11134 -2371
31312 -2371 10517 17957 23132 16233 -7438 -10077 -15086 -39903 -31789 -6235 15476 10091 4468
31299 4468 -25251 -46648 -14442 12339 10558 -6669 -5185 7956 5416 -9305 9251 -13591
31287 -13591 -27262 -22776 -3453 -675 -7618 814 -16723 -16363 140 -12787 -35958 -28137 -10902
31274 -10902 -708 -4404 -1944 21457 40254 64149 41165 22976 10865 26058 44341 50715
31262 50715 36638 39786 54304 20693 3627 -11530 -15556 -8694 10274 14426 9108 -1703 3042
31249 3042 -15632 -32208 -48896 -21460 -6663 -23039 -44361 -37096 -55487 -54933 -23662 7434
31237 7434 15006 16535 35492 41281 53111 49418 26145 27173 24960 24546 22476 5723 -27113 -41003
31223 -41003 -23667 -12684 1342 -5769 -21235 -18000 -18210 -19928 5182 23004 7206 32141 42455
31210 42455 32971 13606 871 -862 18656 -1234 -20793 -11576 38 -20825 -25355 -18218 -20102
31197 -20102 -20052 9644 19894 16115 12885 -4161 -28239 -22563 -7011 3396 -9705 51 1770
31184 1770 14626 -10498 -14653 -9443 -13057 -34395 -31427 -13742 -25037 -31396 -27322 -24102 -24940 -19467
31170 -19467 -2567 -7007 6040 24602 19800 -109 13385 29419 52320 47813 16438 -9363
31158 -9363 -18176 -17271 -13583 -29694 -13356 -18402 -42958 -46407 -23126 -7873 -6824 -35650 -27361
31145 -27361 -17203 -18320 -22413 -30106 -33049 -16197 -16937 7635 22863 18627 -10989 -25598 -21470
31132 -21470 -14583 19285 701 -12897 -3048 -748 -5094 -3159 10455 -3449 2838 -1114 -11022
31119 -11022 -27605 -24805 -28233 -13975 -3879 -19635 -11383 -5221 -9743 -9570 -8478 1671 -8662
31106 -8662 -12227 -1689 -10587 -7356 14161 19347 31430 30078 23291 22242 14063 14510 16406 10647
31092 10647 21725 -504 -1068 16725 -7682 -1919 -3311 -13626 -10037 -6551 -7293 2414 -3567 -16061
31078 -16061 -23928 -3923 6883 262 -28773 -37201 -5840 -4307 -22765 -34098 -21430 -8947
31066 -8947 9086 8411 1830 -1887 -7067 -10970 1844 22783 41673 29001 29599 17871 19965 24043
31052 24043 20054 7890 -2931 -4509 -11645 -12313 -22697 -690 13403 12833 -8032 -3876 -658
31039 -658 -5083 -29070 -26186 -30163 -24608 -28870 -31284 -2823 -4598 -992 10855 -1882 13090 37982
31025 37982 42859 21288 -4701 -18221 2046 13588 24789 9055 -8090 -6238 -28159 -34531
31013 -34531 -25094 -19790 -31073 -23173 4044 27077 6406 -5857 -2387 -11403 -24704 -3270 26731
31000 26731 26652 17402 9026 10856 19112 16459 6392 -6240 -1934 -12264 -19285 -19545 -12042 -759
30986 -759 -6681 -6242 10429 -6164 -11967 5023 20128 -3996 -14138 2842 -933 -14541 -12160
30973 -12160 -516 193 -28777 -28039 -5581 -2175 -14064 -25240 -11259 -12329 -20444 -6943 -7540
30960 -7540 -11863 1471 24723 -5196 -11145 -27187 -38950 -30264 -25046 2869 17956 4605 2049
30947 2049 -14049 -6105 -8702 -18019 10530 16002 -8952 -24195 -23660 -24167 -37049 -25018 -6704
30934 -6704 -12492 -22 13834 2621 -8024 -7018 13267 16746 6934 -1079 4884 28792 19993
30921 19993 21282 45678 35607 18620 19703 33291 6467 -22936 -50472 -56014 -32408 -12097
30909 -12097 -4556 17871 38234 12277 9950 4857 -9863 -5816 -6980 8311 19477 20862 14811
30896 14811 11948 22055 31011 11635 24456 2339 -12395 3796 18893 10979 24161 33707
30884 33707 21270 22561 15123 17291 -16574 -29202 3667 24386 7105 21250 26932 46581
30872 46581 50582 39884 35696 30539 15633 7423 6518 6337 14355 35581 61158 60160 43438 17175
30858 17175 -15730 -1342 5703 -11494 -4784 12884 25456 27804 31314 199 -29009 -53766
30846 -53766 -47787 -23774 -12372 -5715 9203 13006 21596 19932 14050 28344 37777 33223 7605
30833 7605 -18150 -17053 -23059 -32693 -30644 -25823 -28242 -9715 3987 6639 -5364 -24685 -33780
30820 -33780 -24800 -29554 -22325 -19063 -20800 -352 16574 22254 12493 11812 25006 15605 10154 -998
30806 -998 -5987 -18837 -16870 -42377 -45122 -20985 -7274 1461 1324 5693 4414 -10059 -13052 -9509
30792 -9509 -20579 -3401 2761 -13546 -13619 -10265 -12263 -11128 2549 22097 42590 47529 26358
30779 26358 11295 -22754 -25429 -192 11909 -11884 -16076 -9541 -6313 3652 -5414 1294 -65
30766 -65 -8852 -21676 -7076 -11518 -2482 3067 16443 32504 -3929 -15130 -6359 2210 7649 15692
30752 15692 716 14185 15813 -987 -8367 11850 23549 15632 16364 23120 32501 -589 -28144
30739 -28144 -36902 -26390 -22763 3563 3999 7509 29020 24380 26196 38338 37065 27019 30265
30726 30265 21968 14103 6135 -397 2345 -373 -4399 -3426 -4406 -9104 -20374 -4820 105 6504
30712 6504 33913 15944 2915 -2239 -16348 -35362 -29519 -12162 -4465 -4791 -11068 -15327 9452
30699 9452 42673 43316 20391 2980 6427 32907 42783 37137 40845 27804 9873 -4160 11900
30686 11900 26057 -537 -21998 -17804 -35718 -27195 -21731 -39005 -45621 -52649 -44208 -36802 -23912
30673 -23912 -24676 -19657 -26828 -16066 3827 5447 7334 -7661 -47 14466 5111 16465 18843
30660 18843 22859 22256 29957 -10276 -55486 -58715 -27533 -22592 -33362 -31664 -17920 -37099 -50242
30647 -50242 -39521 -18986 -1086 5904 3832 2441 -15922 -22371 -12870 -23462 -17535 -18428 -26916
30634 -26916 -2052 27461 5520 -24302 -31019 1160 10193 3956 -11901 -2926 16157 27337
30622 27337 27415 32792 9862 -19274 -20002 -21641 -24440 -18230 -4692 5697 13172 2383 -1874 -7927
30608 -7927 788 -8293 -9133 -2330 17450 14631 3809 8251 7901 -4536 -17624 -26242 -2442 15568
30594 15568 17329 -1894 -11352 -16729 -11178 -348 322 -9578 -23555 -28057 -2368 12672 -457
30581 -457 -1610 -820 -9405 2746 -225 -21155 -33629 -47544 -39465 -24390 11390 23630 30697
30568 30697 5555 -26199 -22750 -6570 -1833 -4604 -7380 12643 2746 -9383 -2652 -11954 -10501
30555 -10501 -14520 -6050 -17127 -37748 -31811 -7392 11896 5442 18961 8558 -9386 -16556 -24093
30542 -24093 -18688 5256 14986 -2090 4671 -945 5329 -6034 -11427 -32750 -29374 -11607 13565
30529 13565 28600 32608 7456 7460 10303 10739 23189 48060 44839 18620 16516 14391 11574 3175
30515 3175 9668 1566 -14260 13618 47781 57707 48970 38675 30446 22133 11674 9265 5651
30502 5651 -5599 -11764 2343 16254 39579 48904 46795 36802 52432 59790 51033 50043 36059
30489 36059 26688 -3515 -6640 -6814 14808 7929 -777 1954 -16105 -30786 -22975 -12957 -5715
30476 -5715 20324 12470 -22419 -7609 9315 1939 -9148 -22284 -19438 4416 -4420 -1597 -2566
30463 -2566 -15727 -30184 -16490 15868 23392 25960 22382 -2776 19705 38872 42355 25339 -15
30450 -15 -35023 -31813 -10184 -20795 -21244 -15546 -10570 16713 31594 -708 3896 9859 4781 -17267
30436 -17267 -32092 -32441 -24443 9972 30346 10896 -9389 -6353 -15898 -30163 -19247 -11747 -26873
30423 -26873 -7686 10078 5643 16264 21273 22540 -7643 -6029 -3416 5373 8553 7524 -668
30410 -668 -13743 -3389 13200 28401 13711 1189 -4968 -9544 -1069 -8020 -12029 -9017 -35252
30397 -35252 -28893 -24462 -6787 22541 1798 -12179 1782 4810 29269 49340 44196 29588
30385 29588 22269 13462 23158 28924 15232 33366 20745 25955 36677 31506 11390 16284 38294
30372 38294 43574 10300 -6745 8206 -4734 -7239 -337 31504 32263 6603 -6917 1594 12034
30359 12034 26062 6378 -5051 4269 -2837 -13162 -23565 -34740 -49344 -42083 -28286 -24065
30347 -24065 4119 27525 38884 26847 13242 9932 8623 26759 43923 32461 26766 5890
30335 5890 1092 -25072 -61686 -60599 -50993 -38277 -6870 -2547 393 8837 22503 33918 40701
30322 40701 25703 -1522 -5780 -1256 10468 23047 8246 5686 -93 -13300 26140 37784
30310 37784 27022 21454 15779 7883 -4527 3680 8671 5450 -11155 -9050 -3273 8831 1522
30297 1522 12710 26751 26347 33976 26128 38819 50590 37753 34971 36951 18427 7130 13740
30284 13740 -11476 -14370 -7301 -7104 -5050 -3529 -82 5853 80 2324 10558 -7446 -18046 -15801
30270 -15801 -16129 -11350 2175 4715 -9828 6404 -12445 -27882 -32904 -25088 -10016 -8468 -4441
30257 -4441 4066 -2617 -4009 17693 16618 368 -3871 -5390 -10571 -12457 4005 15643 -1409
30244 -1409 -8688 -23529 697 25831 29588 -20054 -17359 8404 134 -13235 -7437 -545 21233
30231 21233 2232 -10406 -16150 -10643 -7079 -1474 9598 4755 -7013 -4709 -5265 7103 23897
30218 23897 27614 15947 24556 16820 -22478 -13516 -17112 -29861 -44298 -39490 -10506 -8763 -15135
30205 -15135 -14990 -18054 -10447 -10899 -23997 17247 -3686 -16618 -20500 -9285 -13179 -3130 14450
30192 14450 27638 46209 32851 23376 19590 12245 12974 1255 -11860 -16486 -26544 -15149 -13873
30179 -13873 -13048 4870 13656 8894 -4886 -2620 -17354 -16169 -15550 -16333 -5532 -5177 8258 10491
30165 10491 -12783 -9899 -1321 -9392 -19517 -11890 12492 19504 3369 -30307 -38765 -30790 -49368
30152 -49368 -50455 -32677 -25989 -14457 5659 -9686 -12794 -32231 -38732 -18381 -6458 -12312 -2979
30139 -2979 -9101 -13681 4162 -1457 -3130 -1003 12616 12279 -7551 -5039 -18516 -12487 6597 18780
30125 18780 16212 33886 26806 3009 16749 27132 -7170 -21009 2342 -9947 -10083 -9783 -30807
30112 -30807 -35778 -3446 11805 -11081 -32841 -39003 -33105 -16218 -12833 -16995 405 9270 8494
30099 8494 -3625 -28902 -24962 -20187 -15144 -20277 -23727 -20192 4546 22172 29234 20339 26759 22357
30085 22357 8388 7759 19101 2519 7544 16517 37636 29301 11247 5915 3786 -8238 -18551
30072 -18551 -24655 -13044 5537 22102 30193 20917 -12905 -33962 -18452 -14375 13202 22422 19349
30059 19349 31226 38589 28744 47170 55467 53810 26602 18479 9133 -11944 -33114 -32117 -29846
30046 -29846 -40425 -34103 -34819 -8877 28255 17132 -15087 -20123 -7306 -13292 -2424 6769 42850
30033 42850 47497 39591 43188 21445 8720 2772 25125 38117 55125 28438 3909 -11981
30021 -11981 -13989 -14414 11704 -1661 -6163 -14510 770 -8598 -35264 -12119 2754 -7306 -16086
30008 -16086 -11995 8229 15302 -9541 -12677 -6048 5209 12025 32376 21483 -3337 -17746 -21377
29995 -21377 -14832 -15294 -14731 -15249 -27514 -19436 -2272 5006 8126 15087 15412 2388 29595 32309
29981 32309 8197 -20315 -33508 -14794 -16348 -17752 -1404 -7167 -15180 -30295 -36829 -10174 -5477
29968 -5477 -13049 -14349 -18132 -16957 -25939 -25137 -14820 -220 -14605 -17029 -5162 13691 20131 17531
29954 17531 22562 22182 34764 23358 7834 3715 3706 7284 -3991 8135 16371 19118 11398 -17969
29940 -17969 -19026 3219 -8964 -2529 -4996 -22362 -41952 -30541 -22817 -4197 18238 23981 33523
29927 33523 36484 33940 2875 -8215 -12343 -17811 1035 -5738 -13741 -8541 -13950 -23792 -22518 -20452
29913 -20452 -24055 -10982 -15077 -18503 -6811 -2149 4992 2153 11731 25665 2593 -12202 -10763
29900 -10763 -8763 -17187 -10799 1466 -8785 -15123 -15568 -9494 -18257 -40482 -34164 -14750 1911
29887 1911 10432 10005 7851 4870 9602 -2397 -28667 -25864 -14728 -15397 -13856 2294 3535 13361
29873 13361 23981 26491 7648 -2134 -13504 -10157 8079 5463 -528 -3887 15736 26133 13723
29860 13723 7574 20464 40606 38321 42764 56081 20017 22180 27716 24455 13576 35771 51970
29847 51970 19338 -15131 -6597 -10606 -3413 1748 -8000 -4137 19856 37171 53166 56537 62355
29834 62355 54109 23193 18560 31571 27027 16450 4119 17968 -2799 -12997 10296 776
29822 776 -2495 15359 17846 13098 -2727 -1523 -10893 -21803 -14656 -7618 14405 15913 15159 20794
29808 20794 -1665 -14643 -31304 -20871 -985 14702 29065 31220 35135 29655 6235 18931
29796 18931 17219 -12422 -23050 3682 29203 13833 21387 26341 5915 -9295 -27130 -29467
29784 -29467 -7524 9413 22520 25724 21343 17433 18778 -11187 -25155 -15626 -23465 -20405 1046
29771 1046 -17415 3122 20655 32039 29597 20619 29944 21852 24250 24764 19248 -7257 13258
29758 13258 44909 29590 9481 -3453 11003 19403 17531 17625 -6157 -6825 4031 41553 47812
29745 47812 19072 11953 4632 -12742 -15428 -23024 -16283 -6124 5412 -1174 -11447 -932 20739
29732 20739 30083 31452 28920 35360 42114 31863 -148 17520 32357 22725 13967 7617 -6038
29719 -6038 12335 20270 14611 6578 18886 9582 -4952 -14128 -22196 4742 23801 35001 19905
29706 19905 15016 -13669 -44218 -53543 -56812 -43600 -19664 -16751 -24608 -25436 -13380 -4622 -24031
29693 -24031 -16859 -14502 -6505 -2755 17294 -2340 -26071 -29464 10481 14611 -25366 -38914 -20369
29680 -20369 -21931 -30795 -29361 -14021 13858 3358 -10181 -27036 -9325 33246 55986 51122
29668 51122 50333 41937 8169 -6767 -1574 -22353 -3192 8618 8252 24377 18025 -10554 -19061
29655 -19061 -12463 3890 -5196 -11223 -9774 -13311 -8287 -18346 -28474 -33489 -24934 2872 14398
29642 14398 2042 4538 -11562 -25401 -27310 -11470 -7772 -25143 -24582 -24525 -23390 -9853 -24966
29629 -24966 -25424 -18282 21363 32330 14666 -9206 -10274 -8045 -8471 22606 39827 51649 44196
29616 44196 60998 54710 26413 -20343 -41674 -40441 -47167 -35322 -25671 -25234 -10845 -12318 15883
29603 15883 11606 -1914 -2586 5511 -9185 11712 16194 -9764 -28939 -53982 -42143 -39290 -32606
29590 -32606 -20843 -19934 -9185 -6912 -19827 -13041 9237 19195 9698 11940 5777 4133 20765
29577 20765 24390 40405 27485 10667 10954 -8460 -18579 -26033 -29218 -18796 1825 20125 17714
29564 17714 15153 25638 5065 -32177 -33449 -17891 -10295 -11378 -10243 -25914 -14933 11184 19223
29551 19223 21433 6983 1781 -16788 -28270 -3069 -15577 -25973 -33950 367 7960 13519 15643
29538 15643 38971 19643 -11221 -14664 -257 17946 31896 38950 25547 30723 5748 -5010
29526 -5010 4826 -4057 -15896 16759 46036 45391 21432 -938 -9081 -2591 1683 16447 14378
29513 14378 -447 -18723 -21309 -16514 -30346 -24847 -1743 -14053 -2622 16993 26024 29377 15585
29500 15585 13657 -2684 -29621 -41176 -43225 -27203 -16887 -8196 -18226 -16882 -9375 2979 1198
29487 1198 45 -23969 -34737 -21192 -4317 1562 -9566 -24106 -32031 -11881 -15724 -24518 -11772
29474 -11772 -25336 -5195 9069 3686 12414 -5571 -10334 -1781 4129 5536 4639 14861 -601
29461 -601 -8753 7966 42810 34256 10435 -6919 -13289 -7276 1138 22574 47077 14402 -17509
29448 -17509 -17192 -975 10702 13155 17358 22535 51458 48376 42280 34031 31954 12324 14863 42940
29434 42940 58350 38281 6012 -6867 -7622 2277 16104 4524 -14785 -37110 -30525 -16710
29422 -16710 -5409 -1744 -15549 -31688 -34526 -21633 6238 -4054 -27321 -29197 -24354 -9398
29410 -9398 -6630 -395 12951 553 -11838 -6451 -2656 18649 39690 44069 44919 27167 -18609
29397 -18609 -25813 -4719 -16754 -22591 -35009 -27663 -38928 -52273 -40055 -27722 -32024 -25982 -26650
29384 -26650 -15055 -20333 -27030 -7656 6900 10543 27666 9612 13512 12947 -10293 2157 20861
29371 20861 6312 -279 -14816 -14931 10881 16565 16935 17398 -11046 -10227 -5808 -4557 6417 29587
29357 29587 37425 33020 34740 17442 -12099 2539 -4315 -13615 -26653 -10883 5585 -30282 -45221
29344 -45221 -42558 -26568 3271 16398 32054 27353 24830 50219 50112 25945 16220 -238 -18698
29331 -18698 -17069 -14252 -18621 -16804 -23956 -26405 -13703 25948 22434 24375 776 -8371 -22469
29318 -22469 -24159 -1411 -4468 1495 9245 25273 28777 6165 -7713 -2259 13250 29212 21044
29305 21044 -514 9672 43390 47441 38337 -159 -12419 -16761 -23850 -39722 -4896 -7139 -28942
29292 -28942 -19640 -26380 -18944 -10939 -4815 -8379 3377 8609 2913 12771 30007 42958 40421 8515
29278 8515 5134 -13187 -27620 -37120 -30874 -23061 -23208 -21578 -408 6498 2115 -12371 -23513 -17588
29264 -17588 4619 8873 2070 9215 21553 32130 26622 28768 31944 17039 9259 3916 -11800
29251 -11800 -10312 13690 -1341 -27881 -4371 3082 21282 31568 26007 220 2026 -2087 -10991
29238 -10991 -7043 10046 7504 3367 -4660 -15011 -6310 3265 -18884 -15770 -18622 -30786 -55232
29225 -55232 -29448 4345 21107 9564 -5654 -7222 -882 3256 -6335 -4753 -15032 -20060 -3285
29212 -3285 1709 -5243 -14517 9892 14218 7441 27973 11293 -805 -20446 -22524 -19061 -26675
29199 -26675 -26403 10277 7406 -23143 -1359 4565 -12646 -19948 -24409 -17442 -7581 -8466 16079 33961
29185 33961 12437 -16295 -46284 -25170 -6661 13952 12117 7070 25265 28614 27862 23873 22873
29172 22873 24266 22704 22670 11777 2438 16861 -7237 -5010 11392 29155 6491 713 12012
29159 12012 27292 3556 16593 34980 33165 14860 12982 48424 58034 49539 36593 31164 26416
29146 26416 10356 -4399 -7258 -12161 -6881 -7728 -2215 1577 482 -27227 -24402 -24169 -5259 -18911
29132 -18911 -34168 -24855 -13964 -17211 -5249 -2148 -8202 8091 1600 -13830 -22504 -16690 11163
29119 11163 20060 7114 -2992 6880 -10279 -13236 -5402 19777 2710 -7342 -9443 15153 27565
29106 27565 33104 27591 18832 -7161 -1683 9892 4412 -17476 -1046 26661 27915 25666 3315
29093 3315 11755 13778 20440 28580 19947 8638 12743 21874 -7448 -25592 -18831 6741 -1127 11650
29079 11650 -9240 -30705 -27675 -30303 -16559 -3383 8216 29832 27991 -5348 -451 5928 26975
29066 26975 23641 24639 24285 29613 9680 -10582 -3664 16789 35215 37363 21192 25627 25569 2162
29052 2162 -1220 3521 -4122 -12693 -16428 -22261 -25919 -27108 -39564 -35558 -26538 -22413 -14291 15346
29038 15346 39216 25156 7578 2621 13123 6843 -3317 -4443 11455 2899 -12959 -26131
29026 -26131 -12407 -213 -5330 -18530 -25579 -16768 -23931 -24101 -20192 -23875 5547 -2580 -41844
29013 -41844 -39234 -15059 6590 -4745 -20637 7103 12373 -13155 -4396 -4823 10868 29336 18570
29000 18570 20965 16149 -5223 11881 15178 24825 8001 5906 6096 11933 39170 40735 22137
28987 22137 16796 26438 36948 11411 -21507 -46202 -30445 -18357 1099 24064 29949 11474
28975 11474 -6543 1129 12160 25149 35031 39655 14352 7828 7210 -11358 -15308 -15696 -15576 -8073
28961 -8073 -20226 -25091 -7763 10006 11098 22559 29014 14057 11979 6752 -14265 -25523 2031
28948 2031 14501 6215 4687 -7707 -9363 -12868 -28448 -11912 19258 16401 2143 3126 3598 1023
28934 1023 -2689 -23641 -25957 -40169 -18296 -7788 -15495 -24229 -18459 -5607 19582 21638 24181
28921 24181 33947 15735 10092 19472 -11481 -30451 -17975 1257 8869 12977 32060 33342 29828
28908 29828 14954 -11157 -28943 -12714 -15235 -4726 -2722 5286 14765 28277 16305 -6270
28896 -6270 -15862 -15813 -16400 -33607 -47445 -50225 -40570 -20845 11198 18630 -11303 -38733 -22854 -7207
28882 -7207 12596 18854 4737 15583 31141 30711 19136 -8277 -23774 -1816 4348 7694 -17340
28869 -17340 -45453 -34418 -28433 -33598 -22940 -29330 -34262 -34316 -27098 -5553 7523 -13502 -15654
28856 -15654 10409 20239 6220 4199 634 -11288 1216 21256 21393 50216 50226 32669 19172
28843 19172 15093 24911 12232 14162 -3149 -3557 5310 1379 1207 5132 27596 24945 23813 8932
28829 8932 5291 19845 11988 -3512 13693 46006 39211 14472 10999 30584 22550 12470 34279
28816 34279 23905 6040 -470 -27821 -16905 9148 20437 11452 3193 -9972 -18684 -18276 -7477
28803 -7477 10401 14517 2787 -16814 -1419 -374 -26680 -18397 10016 12614 2867 9365 9154
28790 9154 25663 34374 18452 -9 18432 19496 -3596 -33137 -24361 -6857 -13993 -13951 -15842
28777 -15842 -28827 -21329 -17575 -23707 -35600 -9882 10898 -3372 -13496 -23314 -11858 16104
28765 16104 22712 13316 -15258 2728 11396 -3246 9058 21873 17105 31070 28994 5942 -16657
28752 -16657 -37766 -62568 -41516 -29156 -43797 -55093 -49610 -40193 -24497 -12370 1186 8918
28740 8918 17805 -8039 -47317 -40634 -38965 -40533 -26889 -9669 -14894 3200 3865 -1191 -11301
28727 -11301 -24461 -15625 1392 6086 -7106 -9892 -27104 -17700 831 14485 26796 35324 23453
28714 23453 14785 18479 6951 46669 59138 67477 59750 61061 59498 40992 620 9144 15328
28701 15328 3465 14650 27047 3753 -20034 -18685 -10844 6896 -3693 18023 28712 21497
28689 21497 26624 2942 7290 -6035 -22208 -18133 -11290 -1893 11707 12923 9943 14084 25420
28676 25420 12858 -7090 -9093 2732 8880 9014 22991 43387 44452 7200 -12246 -28197 -19037
28663 -19037 14680 10362 -12555 -5921 -8203 -14636 4092 14108 11174 29079 32166 32220 15831
28650 15831 8204 -9197 -17343 -6617 3517 -2025 5266 16291 26475 31406 45891 23237 10228
28637 10228 -15041 -16850 -19373 -22145 12185 18293 20145 10638 8601 9835 26 -12020 1302
28624 1302 3015 826 -119 -12301 -17615 -22258 -13496 17413 40444 32583 21293 26318 -4798 -6066
28610 -6066 -12435 -12223 -34180 -28916 -4769 -4918 -10075 12556 49573 50103 30568 36409 17293 -16358
28596 -16358 -15284 -4427 79 -2541 -20632 -31702 -1949 13947 9529 9967 14033 18617 14596
28583 14596 6661 12296 20363 20338 20540 27076 32549 30162 6561 -22112 -19933 -12575 -20144 -2159
28569 -2159 5235 3498 -2927 -11029 721 33992 42984 21339 8859 9933 20665 6050 8205
28556 8205 31536 27658 15780 6583 15584 12341 -16309 -11169 19171 -12217 -46753 -46444 -19500
28543 -19500 -8147 -22742 -27873 -9405 -2155 -2668 -8824 -19541 -7755 1107 25517 34823 50234
28530 50234 33021 9175 -12716 -9207 -9256 3396 22998 21851 6805 6138 5867 7012 14907 7545
28516 7545 -12057 -18800 1731 16460 6552 9931 -4895 3542 10134 -964 -18278 -7220 9694
28503 9694 1317 -6878 -19049 -1606 -17786 -7076 380 27270 31813 15663 -8576 -29448 -22762
28490 -22762 -11136 -22061 -32658 -25710 -13643 -24740 -2610 12535 5619 5963 -4383 -17077
28478 -17077 174 8171 26808 35816 33957 28279 27608 13762 8245 44455 37724 19909 276
28465 276 13020 23517 19363 17702 29709 9670 -1907 -20338 -15373 -881 -400 13345 21165
28452 21165 29050 53795 40267 3054 -21675 -27864 -14469 17188 17312 -15245 -43731 -36007 -14515
28439 -14515 -8359 -3858 -5155 7249 12337 19060 12382 -7129 -19929 -32558 -30631 -23313 2549
28426 2549 7191 -7317 -24964 -20091 -21081 -10235 -20743 -41048 -48124 -27572 -14533 -5733 -19987
28413 -19987 -52459 -36379 3406 14911 15578 7524 12927 27074 -2629 -24575 -6092 14369
28401 14369 48406 46947 44393 31787 9092 5437 8497 24856 25751 30623 31890 22291 15792 861
28387 861 25215 26010 -8020 -12051 8304 30810 11231 987 7080 -19754 -41343 -26583 -3968
28374 -3968 -4492 -3472 4099 7865 -15743 -40016 -20268 1043 -10396 -37084 -14489 4104 10889
28361 10889 -3511 -12620 712 9961 5426 -1020 -10104 3559 9181 13870 7605 49502 41711
28348 41711 22469 12323 15671 -2025 2655 17835 17361 9336 5272 21095 30412 25351 31553
28335 31553 29563 12802 13154 26921 19867 17141 -3352 -12442 -23854 -26029 -11179 -7221 -5114
28322 -5114 -68 15589 34366 22467 23511 16107 506 4707 31159 30958 16529 -7542 -7092
28309 -7092 -4581 -10054 -14686 -13654 -640 4698 -8548 -18381 -30822 -11925 -9977 -5922 1461 12088
28295 12088 40182 39130 22342 -171 -315 4760 -5123 -5839 -27799 -27235 -2233 27654 34593 23389
28281 23389 32373 27887 9274 -11744 -18091 -17427 -33210 -33540 -21035 997 26041 30913 30495 6997
28267 6997 -4086 2851 13641 -11337 15306 44029 44850 29154 18871 13621 -1055 -24978 -26624
28254 -26624 -3027 -18524 -7401 7174 19530 25639 27785 10874 5554 -22191 -41270 -6376
28242 -6376 6024 16008 1977 5114 29981 25029 24311 34797 21025 4465 9951 -521 -1
28229 -1 20556 49682 45474 24124 18585 6673 -14165 -12945 -11486 -19562 -13329 -7277 6913 11399
28215 11399 -9803 -16931 627 -2611 23779 35095 37901 20559 -1483 -3287 22900 40117
28203 40117 36928 34080 15749 3884 -10460 -26339 -18933 -13955 13618 19221 -5478 5507 7710
28190 7710 -10640 27444 54426 41313 33808 32468 20926 17452 6739 -8073 -19337 -22046 -3531
28177 -3531 -12910 -13822 -26493 -16187 15142 22750 9845 -22600 -27726 -19397 7597 18501 32173
28164 32173 32850 13969 20810 4057 -22086 -19842 -19213 -18786 -13969 -13523 -25840 -30820 -47023 -26410
28150 -26410 -2859 -3943 -8101 1748 3509 7990 20494 27719 22306 6825 16588 27437 7855
28137 7855 18989 12772 -13878 -10975 -6273 9096 32888 41855 31666 20776 23366 30439 28662
28124 28662 22002 12474 9597 10513 18112 19357 21399 28577 41683 42919 24708 30435 8965 4747
28110 4747 26022 31837 44435 68684 57948 46225 52047 43072 28960 6002 24671 21417 19476
28097 19476 15716 14745 29854 18528 3669 13924 19448 15648 20017 11506 -3215 6992 24969
28084 24969 23846 14453 -18899 -8530 -9392 -6961 -21439 -16218 -1228 -9374 6510 22850 13915
28071 13915 13469 11583 12434 6574 3979 -19648 -36922 -13094 7254 -496 1130 9468 21877 25674
28057 25674 34040 16050 -2703 -2302 620 7388 1432 15542 23188 15761 7447 14343 2844 10083
28043 10083 26231 28360 37346 27055 10110 15836 4046 -4914 -30190 -9735 8971 24426
28031 24426 27079 16199 2652 5464 16292 42080 19910 28645 30867 24070 6855 7426 35081
28018 35081 34041 24557 14975 2462 2002 -3609 22417 40184 4106 -23132 -35421 -14170 1723
28005 1723 -6831 -6308 14187 33968 34871 27147 21580 5444 -27360 -27347 -21743 -11543 301 2808
27991 2808 22254 24935 23671 684 8397 4459 -6023 20339 30042 6665 3063 7912 -8695
27978 -8695 15466 59088 71851 76748 53993 28750 18386 4918 16733 4016 8180 25895
27966 25895 31771 40818 46196 52185 32251 -8768 -22452 -9968 -5840 -4244 15007 4648 -5963
27953 -5963 -3225 6853 21624 18847 11090 -9560 -18375 -15647 7278 13719 6359 13697 4073 7466
27939 7466 915 12833 9197 -3915 17014 26187 16756 1251 -10179 -15779 -21864 -12676 1434
27926 1434 -19069 -14255 234 5222 -17282 -35032 -22486 3477 29648 33027 9601 108 -5445
27913 -5445 7157 -26587 -49382 -26650 -29337 -29593 -37201 -35687 -22469 7984 5102 -35584 -53342
27900 -53342 -31616 4240 -13376 -20916 -12874 5582 17572 18044 26319 17189 7639 17042 14703
27887 14703 1375 8477 -11708 -18315 -13422 -11999 -15223 -24381 -15114 -12963 992 -16403 -19202
27874 -19202 463 17394 14037 7938 7459 2070 -4212 9032 4115 -13241 -7242 6381 5557 6340
27860 6340 6533 5178 -14516 -2272 16465 -144 -22058 -39340 -45738 -23444 2273 24754 37565
27847 37565 46060 35644 11909 4872 -74 -17148 -5370 20157 27976 22289 8682 -5968 17205
27834 17205 7278 11864 35215 22676 63 -4642 -5679 -11303 -23841 -6268 11751 12813 13330
27821 13330 3016 1586 10060 16890 8422 -12779 -21801 -8331 11155 10421 15024 23326 25516 8344
27807 8344 1947 -19151 -31625 -7594 -283 7207 -323 -11825 6404 19395 35605 21729 25045
27794 25045 24052 2217 -29128 -37435 -43320 -39938 -57408 -56264 -41027 -34133 -38472 -34369 -26870 -7281
27780 -7281 -1130 -2107 -4695 -9149 8856 4422 -2088 16390 38908 34335 37972 33791 29671 14304
27766 14304 22362 15372 38043 36694 18402 2092 14804 11409 216 -22066 -4408 20489
27754 20489 30944 31401 39422 46221 46590 51581 39912 50711 62002 46951 30711 20302 14983
27741 14983 8367 28469 41390 48253 33855 16149 7751 12039 12529 5133 3469 2388 -6120 -8177
27727 -8177 -20459 -27228 -39453 -63770 -47454 -16135 -2 15779 23677 18718 25958 13516 18048
27714 18048 23404 12943 372 -19321 -7464 -23185 -10948 21904 23606 8202 -10639 -11918
27702 -11918 -1860 -6914 -20784 -13306 15416 12359 -1284 -5768 22703 41578 14190 3674
27690 3674 -3049 -7540 -25058 -27809 -40633 -33651 -38273 -41919 -43190 3001 13803 1656 -24137
27677 -24137 -30990 1005 16247 -19153 -26955 -33249 -26735 -25736 -26031 -5042 -5039 6368 -2030 -15433
27663 -15433 18786 30330 17918 2402 -13273 1948 -15757 -36261 -14256 9690 5933 1135
27651 1135 19178 30763 33999 21426 189 -19755 -14254 -437 9416 6514 2978 9547 2391
27638 2391 52 8218 12957 -4403 2742 24066 18457 11043 18209 7484 -8962 -21753 -11886
27625 -11886 -13515 -23562 -8545 10739 24765 27646 35640 43940 36924 1067 -2294 -30289 -21195
27612 -21195 613 8375 6851 -9493 339 16403 29529 13709 -6233 -17078 -44720 -55859
27600 -55859 -57079 -34861 -22237 -35599 -40528 -40100 -18782 6695 -2329 12953 22987 23499 23113
27587 23113 24699 -530 4216 1735 10468 5712 9917 8892 26568 53231 43035 -1672 -3648
27574 -3648 7345 7208 10048 -2521 -22956 -17916 -8728 7360 17449 15862 27429 7457 -9194
27561 -9194 -6440 -5492 -5544 12927 21371 37735 37927 33931 50577 18512 -22981 -25293 13748 10892
27547 10892 -5721 13189 3192 -13758 -22786 -1082 13166 1597 11628 10241 27666 17279
27535 17279 -3396 -6594 279 1495 -14047 -5389 21100 50814 60401 21996 3884 27402 12472
27522 12472 -9027 -14662 -24103 -39356 -22429 -15657 -35340 -35606 -12867 -21691 -32101 -22630 -23769
27509 -23769 -34275 -39500 -32604 -11188 -153 -16386 -17379 4442 12712 25554 20882 26377 17271
27496 17271 6089 6121 5021 -8626 -16800 -7771 5902 15161 8741 11659 17676 21486 27784 14710
27482 14710 4944 3765 -4258 4062 20001 36381 39109 17863 -2820 -3830 14830 29956 43091
27469 43091 24135 -8979 -16775 -30170 -1170 24975 34391 14318 9326 14488 33112 34505 14129
27456 14129 10995 -18005 -14195 1848 15157 28878 31233 27468 37480 51426 31420 23388 11059
27443 11059 10641 -4829 -28065 -40330 -23879 -226 -9422 2176 -18648 -27048 -17372 -13172 4436
27430 4436 8667 9449 17314 18749 38182 37918 33559 43042 56618 36367 11561 19271 20922 33365
27416 33365 28817 39143 50761 69440 72448 51681 32526 9828 -3389 -9904 -8445 20903
27404 20903 37655 28366 20018 9637 14249 -711 4465 8184 -18215 -4304 6138 25997 13069
27391 13069 18317 2586 -18874 -21799 -7816 11364 12325 7384 2081 -14832 -21112 -21744 -19346 -22245
27377 -22245 -4566 5514 29691 39067 19412 23421 7830 4099 -4105 -19886 -8644 4214
27365 4214 14102 19108 4548 -24094 -36131 -34736 -41508 -45368 -45377 -14178 -2654 -4087 -8505 -1091
27351 -1091 -25616 -31469 15672 23727 -12017 -26063 -16441 -11870 6750 -3366 -9631 -15102 -16608
27338 -16608 -3405 13076 -9919 -5468 31857 45865 5666 -29859 -23553 -29515 -22175 1236
27326 1236 19820 28252 860 -3603 -4728 -11403 -26392 -14424 17332 8719 3038 12518 3392
27313 3392 -908 3005 19232 43039 52624 47249 22793 -20102 -13709 -1756 11402 8948 9809
27300 9809 15369 16407 24909 26359 11106 6490 -1448 1374 -5367 -4377 6406 -14127 -1763 -6502
27286 -6502 -16663 3799 16231 -325 -2408 12989 17620 24892 13494 -10606 -11078 -24996 -22898
27273 -22898 18326 29644 38084 39793 29466 10906 -2577 15007 21246 -10015 -22465 10061
27261 10061 8607 -4515 -17806 16721 51049 23047 4073 8320 5210 -14164 -12751 8308
27249 8308 17472 7985 492 -16428 -12961 -8303 -31559 -25249 -7456 14817 35185 36274 25963
27236 25963 22339 -13756 -39734 -17209 15402 31684 28350 10871 7778 4737 16217 13038 29240
27223 29240 11116 -16668 -24797 -3558 -2257 -8163 7600 18210 -3239 -5064 8306 15878 -2606
27210 -2606 9176 10168 3103 -2788 -6261 4242 23171 34774 55013 32086 37729 20392 9913
27197 9913 14102 20930 22070 5421 14232 23958 27129 18868 3384 14128 22573 8594 -15418
27184 -15418 -15645 -5641 18310 55300 40452 21426 6375 -14011 -25276 -23948 -8536 -15236
27172 -15236 -6356 10739 10759 -4256 -11809 6116 6899 5444 -1299 -11114 -5798 4252 13238 -1144
27158 -1144 313 9580 17620 -8259 -2820 10993 -3212 1971 -3884 -17503 -10106 -4776 1219 9998
27144 9998 6378 -2174 -759 -16894 -27603 -18254 -24441 -28831 -18029 -184 -8290 -3031 -10194 -23314
27130 -23314 -48913 -18683 15762 32839 32797 30863 934 -13582 -32773 -30639 822 7881 3916
27117 3916 3494 19216 17983 3085 -11748 -24169 -29287 -15220 24232 31214 16922 10122 11069
27104 11069 16035 22008 39973 43308 32615 13915 6312 -3722 59 -4545 -3930 -5563 -8030 5314
27090 5314 9026 -1187 -4692 8066 22677 31940 41998 23840 13365 5779 -794 -870 -8089 -9118
27076 -9118 488 -10819 -9133 -40736 -53816 -59412 -28378 4787 18795 20560 -602 -16730 -6155
27063 -6155 -9201 4139 5476 8615 355 -16828 -16818 -8874 15850 8945 3136 7531 14491 -9985
27049 -9985 -12503 12973 27098 25757 22067 23823 31204 43710 47244 50299 43467 38703 47125 53861
27035 53861 47136 36613 33222 27217 9253 14024 29788 39854 36789 31728 38220 27730 18583
27022 18583 16426 -146 -11829 -25748 -41160 -31428 2163 -2851 -12609 -15286 -15463 -2587 30442
27009 30442 50075 27448 6355 5666 18366 10131 5181 -12585 -41523 -21407 -12695 -5471 -3794
26996 -3794 9704 4585 -4613 -2711 -12747 -19988 -21601 -806 5680 -2789 -12129 -17170 -29373 -30422
26982 -30422 8940 -8280 -27231 4761 1132 -3009 15589 26455 32853 19778 10569 -18365
26970 -18365 -26226 -14791 -10039 -2313 12574 46479 49032 12273 10497 29015 7877 14359 2019
26957 2019 7459 32534 27297 39024 40971 16524 28005 32698 11679 -13838 -9697 9724 7921
26944 7921 16886 50330 45053 25454 3794 -23083 -10358 16517 14846 -2149 -11899 -3535 13729
26931 13729 39350 40820 10429 1173 27722 28094 24916 9487 20671 31134 21111 20583 14362
26918 14362 33303 47401 49580 19629 1653 12883 20096 6044 -422 -24387 -31164 -14967
26906 -14967 7609 22590 22987 -3519 -16798 -26423 -24999 -11041 -18756 -29575 -14692 15027 14442
26893 14442 18365 32368 35048 45825 42028 18796 -3292 -8532 -41669 -37220 -9811 12546 24337
26880 24337 23631 24055 24641 14351 19629 14386 19533 12309 17190 29005 23674 11932 -4189 -11201
26866 -11201 13900 27292 21949 35459 38583 50378 61721 57489 46236 46996 43277 41420 76665
26853 76665 64638 33290 23071 18430 7340 20556 39824 32412 25925 21999 21728 5983 8250
26840 8250 2952 18136 29633 20209 13116 19110 89 -18408 -37809 -24539 -35490 -37238 -22415
26827 -22415 -3006 -12592 -21552 -30025 -27066 -4582 15779 18038 17611 8917 15473 14011 4493 4011
26813 4011 -5593 9362 35309 44205 56861 53475 49285 22813 623 -16906 -5669 -518 -191
26800 -191 -23381 -35690 -15300 -21308 -35725 -15849 10464 13959 11740 -15 -6718 -12798 -30336
26787 -30336 -11301 3916 2191 -10939 -11529 -6621 18490 41184 15735 -15894 -8952 5736 27188
26774 27188 30686 56575 55800 25672 -1667 18435 30351 25051 8460 9362 -304 -11331 -11466
26761 -11466 -25466 -43649 -30092 -21919 -24648 -18719 -8820 -588 -9553 -4954 16069 14102 5113
26748 5113 13731 20399 21273 15927 19568 13251 7874 -9840 -18006 -14061 4830 -22270 -27612 -7706
26734 -7706 26828 27830 6255 2379 20736 35033 10282 697 1027 9748 -15260 -14493 -4245
26721 -4245 9515 6037 11978 6407 31509 64507 54115 19363 -3851 -11412 3156 -8618 -9145
26708 -9145 4075 -13243 -11831 -13925 -5948 7122 33910 56754 58068 50577 42217 61161 51055
26695 51055 35203 17388 17569 32493 28061 14523 -1354 804 15615 495 5751 4720 -38941
26682 -38941 -48519 -22525 4997 -2697 3558 -480 -6630 -815 66 -1666 4525 -13606 -14580 5788
26668 5788 4763 10681 11492 11844 12793 15586 19389 5726 5644 9141 25366 5184 6567 19507 15344
26653 15344 3577 8267 24748 19174 -3795 -14300 -11278 -8825 31525 69793 62539 29610 10757
26640 10757 15149 6874 25194 48065 37455 23354 13080 21584 14684 3066 14829 34006
26628 34006 29744 56539 66822 49304 40525 48223 32997 9317 -13204 -31858 -23409 -32166 -22922
26615 -22922 -16363 -6885 -4547 3262 -11130 -16245 -28479 -32806 -43490 -35213 -33458 -32572 -26448 -35568
26601 -35568 -10952 -12721 -23878 -25314 -19070 -15400 3042 10873 195 -2144 3030 1063 9895
26588 9895 10964 31212 29890 38186 32670 38165 39266 1862 -16010 -28223 -19386 -5870 3085
26575 3085 4240 -8981 -11768 -1710 18439 5125 8130 5693 6869 9880 18163 -9841 -25547
26562 -25547 -10380 7251 -5485 -7669 21786 37879 31235 23807 26779 28035 38000 54717 73862
26549 73862 62281 29446 22642 9068 14954 41677 51273 64050 51759 23273 -9309 -4873
26537 -4873 -24588 -28227 1195 5639 15383 26746 6540 -8940 -4366 5732 5007 959 8359
26524 8359 6657 17453 19370 3921 7235 -14765 -235 -16077 -35436 -37137 -16383 6305 24499
26511 24499 9916 12836 1646 -6593 1964 -3739 1438 -1918 6450 21947 21833 11375 10239 9800
26497 9800 600 17022 20717 12788 -18680 -6162 -2500 -22959 -37545 -25775 -8147 2948 18287
26484 18287 39899 27745 808 -9083 4285 26555 35859 10259 33099 37683 -16764 -22411
26472 -22411 -30211 -13241 13609 27817 14371 39825 40617 40935 27657 9546 22684 -2151 12875
26459 12875 12879 -523 -4733 2588 3476 21272 34438 11828 -15523 -14007 -16069 -37123 -29793 -3593
26445 -3593 10981 3703 -28792 -17544 -18970 -18775 -10167 -4434 -3059 -9919 -21548 -33854 -37244 -27449
26431 -27449 -24312 -28260 -21884 -4147 28324 40216 22717 14072 17388 9182 -11150 -12532 -10060
26418 -10060 1504 -17408 -21636 -21302 7399 18304 -13959 -45537 -62097 -35167 -13789 -14438 -45217
26405 -45217 -52271 -22723 -19355 -7453 -13769 -9641 -5240 -25363 -22270 -39804 -34619 -10909 -31219
26392 -31219 -40486 -33593 -9910 -840 17997 27160 13724 3828 -4722 -8880 -27645 -10599 4336
26379 4336 5829 -7349 -48656 -43315 -24436 -15609 -26361 -19370 -13329 -9969 -23008 -19870 -8950
26366 -8950 9982 24730 34762 52263 59840 56108 31974 16661 22158 -13164 -32272 -40831 -43346
26353 -43346 -25906 -13618 739 3276 -7886 -11972 -30142 -49344 -23566 -9603 -26654 -13300
26341 -13300 -18725 -33335 -39280 -27335 -5691 5503 8307 -12682 5275 -4230 4721 3054 -20322
26328 -20322 -20081 17361 34945 12226 18189 43478 41236 51003 52660 52498 16254 2280 39613
26315 39613 38606 3152 -1513 30959 54035 52463 35171 10232 -6954 -17380 -8807 3213
26303 3213 -4122 -194 11759 20080 23061 694 -4209 5725 4967 9447 11729 6021 29925 49835
26289 49835 25969 13961 4528 894 24054 34222 41633 48633 39630 19642 9244 3459 14649
26276 14649 25831 46627 41327 20662 9040 -24448 -41363 -23013 -25876 -21538 -9232 -9895 2231
26263 2231 24268 38283 41772 24142 25813 18664 9947 15641 20528 24613 -479 -3883 26696
26250 26696 15839 -4072 7595 24588 31922 32030 31048 17786 3717 7993 9680 15451 29050
26237 29050 43475 45262 32440 15086 -10369 -13449 -3487 -4395 11839 5150 -932 -2223 24692
26224 24692 27921 21120 22092 15482 5945 -13882 -956 -5599 3102 10194 -4362 -2661 -8497 -1382
26210 -1382 24404 37913 27587 21504 17523 9988 -2350 10119 13880 11677 7665 3478 -985
26197 -985 6914 13853 -6411 -3080 1503 1865 3437 21257 22374 80 -28047 -14207 -13725 -14690
26183 -14690 -32482 -36012 -16147 10480 25619 46197 51220 30597 5405 -497 21788 -145
26171 -145 -21743 -23709 -33478 -2091 13749 10285 -4968 -715 -6519 -30479 -46072 -51166 -55842
26158 -55842 -44699 -31710 -25596 -29119 -12230 -327 -5498 16267 28162 28514 -140 -12250 -16210
26145 -16210 -4903 12424 31079 41292 48532 31997 25143 18681 32449 44683 41352 59149
26133 59149 57042 31419 25221 10191 1704 2029 -11951 -11361 1604 825 4768 -1302 6124 15090
26119 15090 9415 10940 12692 2393 -5176 -11103 -10988 -16071 1170 25125 31882 47054 53144 23119
26105 23119 -27533 -29654 -18336 -10043 303 2125 27725 33735 34256 34963 33147 4469 2414 -8815
26091 -8815 -2875 -7344 -18962 -13253 -10396 19622 18208 7242 -3922 -16744 -54415 -56256 -35623
26078 -35623 -8573 8627 5261 29236 50188 19909 2504 -6908 2213 8486 22327 38206
26066 38206 30556 13570 11776 3724 11286 14465 6745 8391 11751 7388 144 -3951 30417 38084
26052 38084 15706 -29234 -33260 -24186 -19757 3236 2866 -23885 -37997 518 -13283 -37743 -38343
26039 -38343 -19835 5269 8024 2697 25473 21442 4870 -23 -3929 -4692 -10197 19141 24010
26026 24010 4362 7199 36420 51766 39887 20872 15317 -8709 -8948 -131 -13020 -9620 -18614
26013 -18614 -36497 -22448 -15281 -19044 -7134 -3261 -19222 -16058 6774 5109 1553 21915 26065
26000 26065 -23188 -32210 -12262 -22408 -27443 -9245 18469 34274 52393 28788 20601 19666 10927
25987 10927 -1554 -8218 22538 16048 20308 41863 44267 30316 11164 36249 42134 36452 24185
25974 24185 20311 17849 13275 28258 30747 22272 705 9439 24955 32938 43771 32272 7345
25961 7345 -2378 11537 778 28894 40700 63830 55924 27746 7028 5496 16484 27455
25949 27455 19469 -13424 -43165 -51517 -8241 17938 12302 27121 31063 20406 30280 44539 33282
25936 33282 13447 -31224 -19513 -23918 -26100 -19354 19089 25217 -4843 -20263 -12285 -15130 -23014
25923 -23014 -16099 -41278 -39259 -24682 -555 -4151 -7585 -21054 -3980 1526 -16147 -13523 -7789
25910 -7789 -9755 -20024 -38932 -54500 -29360 -24813 -27197 -13221 -13189 -25641 -18045 13265 49955
25897 49955 51116 21095 -3210 5757 10698 22596 18692 -24426 -54958 -52276 -22873 -14984 -11466
25884 -11466 5292 -6607 -39090 -39952 -34674 -26119 -26091 -11956 -8571 -12154 22494 31704 35962 18407
25870 18407 -5891 -26979 -17366 -10649 8483 56534 64343 21398 14364 19636 22374 4769 -3863
25857 -3863 -8274 13299 10893 18330 10480 17229 24243 21135 3137 18379 20104 9640 6247 -15127
25843 -15127 -21184 -16993 -7233 -5355 9926 34522 41235 23711 21516 6232 -11366 3815 7569
25830 7569 6149 40179 41523 5122 -5535 -12898 -7516 7254 -1462 -10557 -13696 -18686 -2427
25817 -2427 -131 9731 23390 -4409 -32819 -25731 -14687 -152 10132 6986 11747 -12674 -6570
25804 -6570 -8967 -14256 -19271 -37179 -26414 -16927 -12838 23686 22254 24273 30320 34216 22835 11700
25790 11700 -3475 -16989 -8599 5498 7779 -5978 7839 4944 13742 38727 49982 57820 31565
25777 31565 14206 12884 6309 28612 36668 15399 -3084 5340 598 1270 4276 18420 25295
25764 25295 14159 -13374 -41406 -35522 -6644 14245 20482 8447 -1895 20265 13519 20768
25752 20768 -4111 -4476 -1743 -1402 1821 7749 23031 31683 19034 24410 20780 -15645 2921 1478
25738 1478 2620 23065 20607 1172 271 23591 30292 9911 1748 -24399 -26433 -19395 7448
25725 7448 15872 -8934 -26854 -18833 -16166 -20302 -28499 -18909 -7459 6543 3352 6638 17165
25712 17165 14195 1105 -2923 -6123 -15023 -9802 4409 9609 17075 12182 8686 8779 4279 -20001
25698 -20001 -47057 -43039 3061 24576 25456 23095 21477 11542 2027 -13998 -16654 4742 5423 -1144
25684 -1144 12884 11879 13673 25345 35222 31294 21751 22488 39008 20462 -9172 -17531 -7226
25671 -7226 -903 -14017 -21602 -6890 10300 14737 17438 23557 14684 8286 22536 -5357 -6255 6097
25657 6097 -12987 -22879 -16507 206 12796 26814 9443 -15283 16998 20437 24859 31218 28264
25644 28264 8937 8559 -4360 -13692 -14999 19877 17882 -17825 -38022 -18107 -27294 -12885 -3323
25631 -3323 -10041 -40195 -62031 -30315 -6117 -10340 -17868 -19112 -12996 -15619 -27300 -19165 -20400
25618 -20400 -36781 -23039 -5284 -31125 -60650 -68564 -38850 -20561 -20140 -16892 -9781 -24060 -25566
25605 -25566 -26756 -17148 -2782 -9568 -13293 26460 45096 21234 11844 -170 -31280 -35455 -12993
25592 -12993 -2276 -3399 31023 52136 43056 46883 47989 39266 35758 37489 40155 22211 4563
25579 4563 -658 -8277 -11017 3142 -10836 -41535 -36947 -13762 -379 -26117 -34245 -28498 12840
25566 12840 15863 637 -3279 -3151 -13630 -20126 -13981 -12669 -12354 -9024 -9836 -11085 -22644 -19333
25552 -19333 -25460 -18096 -36861 -37689 -35787 -37242 -45808 -41254 -14624 2035 240 -89 16514 7787
25538 7787 -33312 -54369 -31630 -18512 -4040 -4219 17246 18741 14129 -3275 -8615 1294 1092
25525 1092 -17197 -23549 -1205 -10461 -22196 -25653 -22111 -495 6352 -3716 -273 -11605 1449
25512 1449 9834 -16926 -11986 3532 8307 1290 -14137 -19544 -20673 -21276 -17122 -24110 -46966 -40590
25498 -40590 -9262 20607 8468 -28768 -38641 -25517 -16649 -37599 -36244 -2560 -15350 -22798
25486 -22798 -30544 -20808 -26238 -18632 -26901 -10394 -13958 -28951 -29226 -7852 1074 8463 34493 26608
25472 26608 6527 1510 -447 -11192 -3742 4487 6744 8274 6332 7072 -14074 -13970 -10393 -2777
25458 -2777 6365 26977 21888 10119 2982 9018 2266 1800 -13981 -26230 -14362 -14392 -27667 -21270
25444 -21270 8916 21825 34596 25998 10185 -7634 -9061 -824 17766 30489 53521 38957
25432 38957 28306 33009 37925 23945 671 5203 520 -7212 3547 5326 629 -31046 -43793
25419 -43793 -15000 9611 9245 1534 -1221 6854 12437 -117 5464 22921 16852 6542 8355
25406 8355 -246 9836 36021 48380 17662 -16042 -12949 -502 -27772 -24736 -2372 6900 29033
25393 29033 53010 29545 24823 19210 25557 23916 -6545 -11065 -4954 7979 14438 16849 -3358
25380 -3358 -6910 -15021 -20196 -25854 7386 19187 -15796 -18094 -17947 4616 22467 32511 36774
25367 36774 18540 2808 7021 -216 -11989 -32451 -24587 -18861 -1101 2137 -3731 -17282 2847
25354 2847 31355 25418 12174 -10338 -17152 -3887 -9216 -12300 -19742 -8616 10101 16198 8241
25341 8241 5035 -6865 -35010 -28667 -30598 -9260 10808 13727 29170 47819 32948 -17069 -9910
25328 -9910 22199 11669 -12017 -4674 5952 18153 34581 22417 -17242 -34043 -51127 -54603
25316 -54603 -48558 -25656 -14232 -3236 -10833 -3546 9523 21284 15664 6466 1464 16038 21436
25303 21436 11461 21336 6519 -83 -7083 -8267 -5270 -21435 -23546 -10969 -25122 -12063 -8528
25290 -8528 -21084 -31866 -36945 -19268 -20320 -18538 -93 -14998 -6900 3075 12188 18578 28406
25277 28406 -4076 -15898 -8845 -15595 11357 19174 24998 21373 8545 18968 32366 13607 3294
25264 3294 12697 -1063 -16254 -18818 -21135 -8217 -8069 -33701 -37373 -22889 -3921 -8688 -17293
25251 -17293 -44152 -46093 -25825 -28791 -7493 17511 12844 -10443 -22151 -27593 -50710 -22508
25239 -22508 12737 10314 -514 -1038 -6060 1948 -15923 -15982 758 338 9051 28436 42320 12678
25225 12678 8013 4409 11290 397 -13945 5037 10359 -19690 -42712 -39991 -31449 -13848 -4214
25212 -4214 26916 29617 33018 34367 28134 8754 -2864 3602 -1523 -5845 -11386 -19880 9750 16231
25198 16231 2357 2306 1449 25604 38512 22333 25382 44672 24271 6141 9596 8431 76
25185 76 -12111 -14571 -17731 -25852 -47636 -36706 -11258 -1028 3972 1470 5161 2475 -17462 -36044
25171 -36044 -37934 -36676 -13947 -10224 3387 339 -12424 -32567 -52870 -43482 -39921 -35320 -35013
25158 -35013 -35399 -35631 -49695 -55512 -46063 -45641 -52572 -40917 -8342 -569 14723 16921 8496 5177
25144 5177 -4033 -13122 -15529 -46819 -57271 -46105 -34281 -27228 1345 17089 28241 42798 49299
25131 49299 38187 47305 26995 44380 19024 21317 45693 35743 5118 -15451 2258 20
25119 20 12117 25022 36047 53445 66883 51664 37001 7668 20464 47935 44506 33493
25107 33493 25248 22041 3659 -4309 -13837 -4814 12592 -3529 -20447 -14721 -11260 -2908 -3123 -14836
25093 -14836 -18363 -23064 -15522 -4982 13003 5078 21466 3612 -10059 -2493 -2501 7321 -13728 -25330
25079 -25330 -28591 -21965 18883 26201 263 -14470 5804 4065 -12637 -32935 -23732 1013 345
25066 345 -1072 6284 30221 30953 26680 17702 7559 -1989 2701 -18180 -23039 -30954 -33880 -9021
25052 -9021 2931 3825 15961 19684 13732 6714 17323 24724 -16213 -21552 -20346 -19054 -23919 -19782
25038 -19782 -14512 -17420 -8107 -18201 -23756 -42128 -29160 -23831 -15483 7051 -927 -76 -10006 -14373
25024 -14373 2320 -2969 -26488 -24260 -17124 -36272 -35683 -10278 -5720 7110 -14796 -14533 -1844
25011 -1844 -14616 -7741 -7210 -976 4645 1276 2951 -510 -9346 -13954 -18763 -21302 -427 7773
24997 7773 17606 10252 -15205 -7570 10323 8599 3990 -35361 -27207 -34483 -43690 -44028 -14217 -4195
24983 -4195 -698 5641 21757 -6998 -4937 -7030 -16468 -28095 -20183 -7874 5058 17166 -25405
24970 -25405 -48623 -21715 -24358 -27418 -4357 20722 29290 6717 23959 7857 -42784 -31320
24958 -31320 -3557 -11905 -4776 -3751 -27626 -27097 -15008 -4619 -13031 1306 15573 32581 20846
24945 20846 15121 -673 -10856 -4665 3547 3492 19793 -5639 12782 9321 -14732 -20164 -8100
24932 -8100 -10025 -16124 -8250 -21030 -38138 -24486 -14060 -23706 -33424 -6467 12867 9592 -5865
24919 -5865 -34568 -28512 1179 14932 20978 4525 15322 22612 36924 23824 -5527 -10385 -35348
24906 -35348 -59999 -65288 -64345 -51703 -40490 -19316 -20343 -10454 16147 12093 3752 9343 22463
24893 22463 37989 34246 18599 5918 -5337 5946 1909 4261 8869 14098 -1085 -16046 -11694
24880 -11694 618 -8627 -16631 -29586 -26184 -3253 1665 26914 33271 27111 17771 -1679 11899
24867 11899 -5064 -14538 -16691 -15453 -28296 -61341 -66091 -55087 -13370 2279 -4448 -17882 -21908
24854 -21908 -5060 -5448 -4536 10301 32349 33361 16714 6332 10347 17364 10632 407 -31203
24841 -31203 -19270 14870 11370 -14230 -3681 -13945 -17406 6907 13104 7068 10747 18175 -95
24828 -95 9006 11083 -4584 -33391 -51647 -26226 -5490 -8995 -8206 -1359 22754 5787 -6889
24815 -6889 -25844 -20206 -27970 -39963 -50828 -41940 -32477 -22406 -18526 -37178 -22069 -25081 -40323
24802 -40323 -16053 13533 10256 1249 -5030 -9483 -9677 -2226 3509 11635 12192 11506 -8335 -21649
24788 -21649 -25058 -6436 -2322 5716 -26647 -34383 -26600 -15690 -4011 -3476 -18803 -20386 -22469
24775 -22469 -50525 -24507 -11013 -27601 -29334 -33814 -42482 -33115 -11422 4917 -5921 6682
24763 6682 43861 31851 15274 6325 -10361 -10385 7972 11240 12136 -5174 -6949 9787 39679
24750 39679 36279 11605 7008 -20156 -26188 -35390 -35748 -16261 -5379 2278 8819 24244 9117
24737 9117 27383 53804 36727 16156 25456 38206 24983 855 9682 21724 20353 -9915
24725 -9915 -18790 -28649 -39679 -41730 -27168 -31306 -19518 -3930 8937 14409 -8190 -19008 3480
24712 3480 10131 10056 7634 -16270 -16917 -14824 -9626 13995 10069 -11361 1749 18667 16881 27342
24698 27342 40584 31817 13351 29973 24938 13300 22472 10807 -18050 -9939 -9739 -4435 5112
24685 5112 1250 -1939 1354 6351 -914 -4019 -14417 -2280 -4804 -29725 -24111 9401 36010
24672 36010 44970 13265 -2776 4987 -22694 -25318 -16591 -23773 -47940 -49233 -60704 -51095 -62013
24659 -62013 -47590 -16942 -25161 -28438 -12825 -7269 -13857 -19987 -26751 -18757 3729 -1877 -9297
24646 -9297 10478 1124 -22540 -22245 2979 5411 -9940 19111 13804 1226 15451 737 -13209
24633 -13209 -26576 -21650 6234 713 2075 -22037 -23737 -6383 17221 -1135 18295 30657
24621 30657 -1507 -24656 -30030 -33682 -24537 -25258 -26046 -11191 1820 -15409 -30304 -32908 -6840
24608 -6840 12743 21015 52789 84542 84978 96292 85791 109224 106213 63706 41124 7964 -14894
24595 -14894 -8884 32313 32717 17826 38 6233 6769 -285 -12130 -12106 -20671 -7072 -1279 -5507
24581 -5507 -10843 -36082 -27662 -26493 -16192 -14130 -18500 -5901 13557 19155 1520 -14393 -9862
24568 -9862 -11642 5051 17740 -103 1854 2657 -3439 -6727 -21787 -36497 -33760 -28549 -18583 -5817
24554 -5817 6215 -15828 -19972 -15482 -4487 8731 21350 33246 58506 51284 17889 8199 -10007
24541 -10007 3007 16017 19735 -14684 -9790 7022 17345 22470 13930 9707 20174 30815 24999
24528 24999 -2384 -18348 -7777 2409 13502 37582 38246 8991 11138 22882 26777 12556
24516 12556 14689 12217 1457 -9592 536 -36214 -67492 -53650 -34227 -18037 -12499 -30405
24504 -30405 -30863 -15230 -19463 -38682 -45178 -53949 -58060 -35765 -38877 -33284 -40701 -49177 -48324 -32307
24490 -32307 -17284 -20560 -31833 -15248 3798 13784 3846 6684 31781 10348 -17234 -12708 30022
24477 30022 45069 35222 3436 -25683 -6851 33690 8954 1827 16609 29671 15045 -2261
24465 -2261 -29002 -32503 -14359 -69 -18475 -38464 -31451 -4468 26786 41143 22953 17857
24453 17857 -1393 -9748 -6147 -7105 -26241 -16751 -27407 -21338 -307 7987 -2643 -27774 -50258
24440 -50258 -14537 32708 53638 54782 36166 29998 41433 50605 48624 32556 18552 21553 15200
24427 15200 -1084 15667 45123 41288 45992 40945 34137 26629 -9018 -32639 -33879 -35744 -18416
24414 -18416 5363 -10122 -1722 12017 3532 -12564 -15458 -22746 -38135 -33330 -9821 25440 41760
24401 41760 34892 10091 -3876 4473 -7993 -26066 -30235 -22671 -2724 11621 -2244 8102
24389 8102 13463 25770 39175 43712 37726 33536 23203 15000 8722 -3247 -22404 -32386 -20077
24376 -20077 -13524 -20668 -26683 -27385 -11209 -13704 -6644 -7854 -24313 -38691 -47665 -18711 1384
24363 1384 -8923 -13378 -18097 7510 9214 -4146 -6224 2383 -8311 -8934 -14756 -12734 -10694 -10433
24349 -10433 979 -2568 -30054 -15892 20970 15456 18391 36963 4933 -12136 -712 12428
24337 12428 44433 53462 47574 36968 15557 -317 -28910 -29159 -24548 -33279 -31261 -46700 -42521
24324 -42521 -35620 -32030 -43898 -41758 -28863 -6333 -42166 -45153 -31712 -10559 -18722 -19024 -5037
24311 -5037 -2419 22413 16991 17884 18441 1344 -16885 -25933 -35488 -26979 -2965 -5514 -10619 10188
24297 10188 21398 -5429 -5437 6413 -10107 -21771 -325 -7022 -24756 -22244 10863 12917 13889
24284 13889 -16463 -24130 -30918 -16346 813 7143 9103 -18598 -33228 -26960 -5935 10793 4804
24271 4804 11083 9612 11311 57 -809 20412 17067 14355 3333 6876 14598 -11033 -23953 -21933
24257 -21933 -29111 -20156 -5425 -1980 -5668 935 764 -5821 -30703 -20679 -28458 -30616 -14141 6565
24243 6565 -5235 -2151 -11855 -28353 -13256 -1780 32415 49283 35709 15487 2639 9487
24231 9487 24514 5725 -1479 -4069 -6621 9137 -15995 -10658 -5191 -17728 -34720 -16244 -23341
24218 -23341 -41589 -27479 -20605 -7183 -10667 -1167 -7404 -9928 -16978 -32313 -29503 -29631 -41649
24205 -41649 -41475 -21820 -7446 6514 120 -28686 -22240 -7155 -7254 -9647 8618 16965 -3648
24192 -3648 -36386 -38667 -20224 -4787 -9759 -20643 -23406 -20325 -21752 -20911 -7610 -11581 1837
24179 1837 -10596 5079 -5582 -15619 -21924 -3682 12370 24310 17047 14543 17465 55583 58765
24166 58765 42156 32069 33990 18557 5953 -16956 7856 27479 3715 -8814 37 17228
24154 17228 -9007 -29393 -37677 -59977 -52024 -57698 -46366 -36247 -36037 -51956 -25792 1416 2299
24141 2299 -2496 -17303 -38461 -54872 -40443 -26263 -26606 -21291 -715 4409 -6874 -6094 2607
24128 2607 -482 -7312 -13670 10238 -2063 -10404 -8358 -9006 -14210 -2934 -2286 531 8895 10131
24114 10131 15153 2990 -11789 -33316 -31632 -18227 -18157 -30145 -10511 -14900 -23921 -15705 -18274
24101 -18274 -10833 -5371 4230 -2841 13903 41131 43864 28371 32160 17285 -24743 -27283 -10935
24088 -10935 -14324 -16114 -21829 -35581 -22286 -9802 6830 34857 38244 10123 15109 12304 -1207
24075 -1207 15480 14053 28685 26424 -4908 3870 598 11604 30892 29234 9982 -4989 19058
24062 19058 45855 46951 16612 -7163 11296 29531 24023 8648 -1752 -14149 -20505 -10074
24050 -10074 -20205 -28093 -14798 -15365 -23948 -36349 -16144 -14007 -8420 -22266 -17630 -27887 -54970
24037 -54970 -50061 -28695 -8528 -12420 -6871 -5820 -5238 6763 -1850 -4797 -21582 -32706 -22105
24024 -22105 -11858 4071 -18936 -20789 4025 27484 22854 954 -15215 6282 20186 15633
24012 15633 28580 15551 -18129 -40578 -25421 -8481 3829 -1472 -8198 -9883 4864 3252
24000 3252 -3950 -4805 4642 9001 15656 15541 9062 506 -13010 -25376 2194 45058 56690 47327
23986 47327 24776 -1514 -20747 -33551 -14671 -5514 -150 421 -19715 -23219 -16676 -4683 15894
23973 15894 17089 21313 15253 -5170 -6463 -7349 -10027 19354 51610 54654 33693 30446 11313
23960 11313 -6360 -9553 10122 15165 17773 25093 39277 37716 35595 26622 14842 11170 -9167
23947 -9167 -14719 -23457 -34916 4534 17427 -4139 -9531 -12804 -7357 -44050 -78132 -56266 -31226
23934 -31226 -28584 -14861 -1776 -4793 -25761 -21627 4108 21174 21557 8152 10062 -19579 -44515
23921 -44515 -57585 -58550 -71760 -72263 -41576 -139 6924 -3031 -286 -4840 8727 43119 63326
23908 63326 41253 38097 33317 14073 35704 28299 22242 -4237 -8757 -19540 -49153 -52841 -45392
23895 -45392 -50934 -48244 -54271 -51806 -35451 -13923 -3663 12064 7145 7759 -13439 -17670 8790
23882 8790 23502 12377 13595 -15768 -24254 -27134 -8249 4856 -6210 -11433 -325 9364 17249
23869 17249 22632 12228 12067 -14095 -49042 -66655 -53873 -44357 -28329 -761 5911 -11706 -31292
23856 -31292 -37760 -35141 -34929 -34637 -50163 -39572 -26953 -17502 -28198 -11671 6141 29990 23070
23843 23070 22495 16445 -354 1206 20042 1192 -9358 -23851 -43972 -45309 -49523 -31310 12804
23830 12804 29298 10150 -12707 -22461 2939 11002 4941 7817 10569 -4859 26765 45329 66725
23817 66725 61008 55257 37762 3127 -36850 -50441 -40518 -26042 -30263 -41189 -41553 -17054 17853
23804 17853 39656 24718 -17523 -23534 18668 42987 28741 -21405 -35475 -22277 -3894 3073
23792 3073 17171 21245 1009 -16743 -2593 10788 -19272 -12643 6071 -5372 -17359 -22350
23780 -22350 -30177 -38525 -14955 -8480 -40737 -44080 -27332 -13379 -30259 -38075 -18210 4660 -5793
23767 -5793 6239 -1895 -24544 -581 -387 -11786 -1174 -6496 -11383 -27566 -11872 18547 25857
23754 25857 21964 20298 7903 26084 9454 -34818 -35908 -11398 11372 24993 18836 -7870
23742 -7870 -6784 -16005 -16535 -9568 -51356 -58296 -55047 -48825 -34282 -32677 -56755 -36479 -1736 24150
23728 24150 19228 20752 -10468 -23600 -31957 -36172 -21732 -19413 -19366 -7186 3779 29441 29373 13181
23714 13181 8302 103 3655 -223 -4440 -1363 -28535 -34589 -19635 -3883 27579 69090 49114
23701 49114 25028 3941 -1107 -6490 -3705 -7131 -13838 -18603 -39957 -42790 -19736 272 -10978
23688 -10978 -38358 -23993 739 25263 23274 4500 -9848 4579 3571 8647 7950 -6151 -9526
23675 -9526 -104 -12873 -21872 -6144 -10193 -6186 -8312 -5459 -7317 -8034 -14934 -19657 24454 33497
23661 33497 26271 42113 17306 3025 6372 -16762 -21340 -11800 -15497 -19282 -14487 1469 1041
23648 1041 11666 11737 21023 5181 902 21204 13259 21618 28356 20094 14578 -3922 -940 5809
23634 5809 -25875 -8562 15198 -7223 -29182 -22274 -732 5889 417 19352 10353 -8243 7663
23621 7663 13407 15986 8382 -12313 3237 17627 10353 9816 13758 22229 15294 -1150 777 13547
23607 13547 -7428 -6342 3554 -469 6390 10073 7701 -3518 -14647 -32116 -32615 -24845 -21086 -8363
23593 -8363 -31334 3141 18559 22004 38000 35652 11104 534 -3511 14443 20035 7617 -3420
23580 -3420 -21204 -6846 36668 48771 42421 21653 -957 -5504 -5236 -5987 -10878 2294 12028
23567 12028 19817 6214 2638 4908 3753 16166 17666 19689 19066 -247 29782 42573 30401
23554 30401 17694 12002 8980 10373 4507 -623 3356 8291 2979 1759 -1797 5484 -7094 -36930
23540 -36930 -27726 -18365 -38821 -11428 -6740 6922 16040 15024 17138 24098 271 -18006 -36398
23527 -36398 -22429 26900 49240 39711 21162 -4253 -5162 21472 18728 -7337 11455 38673
23515 38673 27888 29038 13261 -2167 -12871 -12854 -14544 -25295 -17482 8850 2121 -27831 -17921
23502 -17921 22 4805 -1484 -851 -24840 -30783 -18005 -22128 -21759 -28270 -19093 -6272 9682 18306
23488 18306 -5035 -27670 -37244 -21030 -11844 -27559 -15300 -3213 -29228 -23130 -17329 -5559
23476 -5559 75 1284 -16235 -12068 -11344 -19111 -22562 -11176 -3646 -1538 14464 -11154 -19204 7263
23462 7263 38173 23648 20812 -4916 -14909 -5911 31571 11387 -32084 -23961 6601 6915 1967
23449 1967 -7881 -4264 8463 16738 5406 -2290 5954 18371 3677 -16331 -35718 -31732 -29595
23436 -29595 -15732 -3544 -12849 -23645 -25540 -36835 -9677 10361 29350 28913 21736 -16311 -47015
23423 -47015 -45577 -19851 4614 22930 16679 16432 10987 5175 -4963 -5800 247 -12466 -22182 -35023
23409 -35023 -48905 -30549 1352 14162 11374 -8813 -20915 -20617 -46540 -51292 -32429 -13676
23397 -13676 23353 30780 6861 5088 13878 8201 -11695 -30548 4443 18479 -11529 -9054 -7391
23384 -7391 -22653 -23285 -17278 -37687 -19629 -3173 -18626 -14532 -8568 -7182 -5393 11670 -10462
23371 -10462 -34050 -20467 -5232 -13541 -28330 -24635 -20333 8311 39950 38036 2132 16961
23359 16961 11149 7319 443 -5105 -22279 -8923 216 -656 -2912 11017 18039 -17030 -25865 -34566
23345 -34566 -31582 -18349 -18825 -9140 -18249 -35087 -8000 -3713 -156 -5154 -8483 2846 15094
23332 15094 291 -8134 -11785 -5636 -1835 -8171 -20090 -29052 -12032 -9983 -11182 -27307 -20528
23319 -20528 -17783 -19234 -11235 -22195 -41030 -21478 12406 -7238 -31421 -21280 -2279 150
23307 150 982 7074 25368 34084 36277 38362 37578 28221 36031 48375 35141 30530 33872 18532
23293 18532 -2757 -30151 -54446 -28669 22418 25940 18550 7153 -16568 10697 26687 20128
23281 20128 4095 -6522 -17819 -273 29498 19120 30128 24732 -8621 -1057 -34765 -68126
23269 -68126 -55252 -45692 -37723 -34973 -30998 -25717 -5092 -6378 2445 13490 -2465 -937 -17129
23256 -17129 -24949 -43274 -48673 -14195 -18370 -21364 -13082 -33222 -42882 -49209 -33399 11536 8644
23243 8644 -6367 -8920 -1425 12053 17273 -1259 -13585 109 23157 24950 25096 19773 10379
23230 10379 19075 -1209 -10112 5388 39427 43795 8730 -6162 13716 20444 17422 31249 38005
23217 38005 27023 4167 -43414 -29005 -3126 26692 36178 10970 -14419 -12156 -11565 -18879 -25271
23204 -25271 10165 40338 34264 -18459 -23710 250 -13457 -31030 -26847 -6006 -4554 4323 19404
23191 19404 6283 -16125 -20498 282 5690 -407 8227 -1120 19962 23975 -1666 -878 840
23178 840 -14146 -14409 5152 17742 21770 36239 54128 63724 104815 104881 114911 131224 145582
23165 145582 177583 238413 349267 574290 972701 1513065 1829629 1696765 1407848 1163408
23155 1163408 872250 583362 404567 301047 199846 136322 129116 111480 51320 30694
23145 30694 9464 6437 -7980 -8275 -17808 -9289 -845 25076 53219 35700 8311 10584 16513
23132 16513 13510 12005 -1369 -9974 -3696 38174 42205 15769 4026 12112 19626 17195 22446
23119 22446 15981 -4370 -22475 -28472 -16071 23019 18041 14067 35666 45530 36990 39611 50103
23106 50103 57513 43493 12485 379 15554 21970 15467 20778 25341 -4719 -27368 -41230 -45305
23093 -45305 124 36429 42998 41652 25565 7969 9313 17466 41473 26603 -2141 -4270 9005
23080 9005 -434 16081 24010 37847 24747 26461 15368 -1784 -17691 -16187 7169 -715 17461
23067 17461 20523 22240 14330 -1962 -4007 -12437 -3622 7960 20356 12401 -1384 -8347 15555
23054 15555 13090 -17413 -29774 -15059 19453 25197 18809 16893 13088 -2995 -3428 -4851 -28825
23041 -28825 -39526 -20250 5729 9614 -12978 18529 32102 20199 -1343 8256 32054 42549
23029 42549 39973 26492 11225 19068 17292 27255 28515 21101 39281 32015 -2695 -8798 -10124
23016 -10124 -36320 -35719 -1820 15446 15298 3872 -10711 -9155 -1647 1062 20491 22265 -2858
23003 -2858 -19226 -22164 -24194 2992 20267 -8658 -15863 -14358 -17922 -6684 -3220 -8421 -45497
22990 -45497 -37865 -29861 -9645 17750 32042 34048 36356 36035 25359 16854 4264 -7045 -19074
22977 -19074 -13437 -888 -962 4326 12061 17344 13737 32808 35106 36814 40849 30239 24416 28950
22963 28950 17973 15400 6625 15132 15327 21285 9322 6452 1967 -8596 939 1813 7469 2146
22949 2146 5666 12923 29282 34670 25327 15005 1919 1521 -10315 -1434 18289 37609 38065 23142
22935 23142 15491 1839 -6799 -18452 -11802 -14831 409 25376 15271 22919 35766 27195 19460
22922 19460 24043 7524 -6488 738 -2138 -20355 6783 26428 44683 65974 75999 61060
22910 61060 44331 37920 16757 14284 24028 39647 24775 31352 45571 55401 43964 39017 15682
22897 15682 -9284 -56675 -111535 -134995 -111805 -77453 -76364 -70783 -45222 -25073 -33827 -35341
22885 -35341 -34892 -33662 -12568 -11487 1097 21677 5465 -19248 -1847 761 -13714 -42630 -29171
22872 -29171 4400 23934 -2016 -7829 -94 873 2001 29887 16853 -2778 4396 11994 22327
22859 22327 21570 34869 48536 56114 45947 30135 4720 1714 2470 32850 50113 62619 112583
22846 112583 157478 130741 91717 128812 136933 149933 127378 72329 39459 27358 15660 -14043
22834 -14043 -26282 -20803 -36879 -23939 -4809 19573 56885 34521 10778 8522 -10656 -15759
22822 -15759 -2939 5469 -25908 -48692 -47787 -32657 -19575 -13372 -16481 -12811 3077 15994 19167
22809 19167 8072 20519 2745 -16048 -1900 24509 46415 44283 48446 50333 26163 26416 27977
22796 27977 54756 61961 35187 39751 20868 -4127 917 21605 18665 15938 35468 70165 120758
22783 120758 163447 161134 161050 141948 146198 145849 132113 111049 95039 97702 81207 80195 89965
22770 89965 80889 81030 94374 119358 153844 158998 115766 104847 122938 135298 146829 138198 111183
22757 111183 106049 85613 96392 108255 122935 148085 185406 230876 305970 340127 299131 222377
22745 222377 169113 88604 44813 22998 18016 10419 5499 -5258 1609 24413 14760 26678
22733 26678 37886 55304 83076 68152 45412 37687 57774 64577 81297 110763 146989 177401
22721 177401 217925 237236 256476 277988 311691 331682 322377 267467 181701 112948 66048 43717
22709 43717 20620 37258 38833 54354 64377 60358 66323 62982 63878 70200 77859 82761 88379 66698
22695 66698 35384 35314 19497 20418 44378 42394 36436 38802 29860 40091 46626 51362 71592 89042
22681 89042 108311 124329 165637 216589 291720 437158 685418 1131475 1660190 1860638 1663271
22670 1663271 1431125 1190002 895525 626148 450181 365092 330481 299677 282458 287381
22660 287381 267112 277919 282592 303931 288159 261415 258610 295981 354313 411609 457077 471342
22648 471342 499513 515891 502403 464245 417559 409215 422927 440897 457928 527420 564965 605254
22636 605254 641921 636992 618805 613241 614672 614840 594017 596249 612229 641674 694975 749491 810524
22623 810524 889295 997265 1114053 1234651 1337609 1422199 1536692 1702491 1841223 1994087
22613 1994087 2235402 2526799 2883327 3364098 3977157 4647130 5463127 6562427 7944152
22604 7944152 9547386 11178442 12984194 15550558 19518966 25758214 35430277 50847905
22596 50847905 77610351 128294777 216916507 304345293 310763599 259497570 214334319
22589 214334319 172118352 120823437 77631013 51267733 36565702 27977671 22575311
22582 22575311 18643217 15216252 12370242 10259314 8554647 7157286 6140276 5374561
22574 5374561 4733434 4235163 3826152 3419695 3037993 2742685 2520748 2284419 2055660
22565 2055660 1902179 1801523 1696906 1596816 1502338 1428525 1361320 1278240 1166345 1090420
22555 1090420 1038942 974978 902090 837132 772589 674604 585112 545116 511495 497789 513169
22544 513169 537989 532376 511582 482046 448148 444436 440641 420994 365016 348769 325082 322863
22532 322863 359007 358593 322475 327631 328028 332714 327083 331160 335778 343993 341796 358211 372263 390347
22518 390347 397447 429121 484503 600097 831625 1287283 1793080 1950276 1707362 1440070
22508 1440070 1227602 954364 707717 550160 468482 389186 350625 317804 304006 309612 303460
22497 303460 316155 312102 264082 242372 241287 226390 216337 219551 193429 178812 175823 175395 180745
22484 180745 161615 147693 161219 150259 138664 125444 104217 102209 128518 144593 162006 177007
22472 177007 183113 172857 164710 131331 79643 53546 49763 35701 9173 23057 17059 -2062
22460 -2062 13990 20903 29145 24586 9829 -6277 -2585 20795 27426 28379 52315 66694 68030
22447 68030 75570 84922 83024 74484 72193 33034 14197 -5805 -79245 -186180 -240537 -221719
22435 -221719 -184895 -161827 -146308 -118385 -83644 -78587 -89412 -75914 -38508 -39425 -26375 -43148
22423 -43148 -37820 -26051 -20815 -20222 -29321 -60186 -62630 -45872 -35858 -28537 -5922 5893 19075
22410 19075 12273 -3763 -18876 6571 -28111 -83928 -140822 -178826 -132292 -59063 -30929 -25163
22398 -25163 14178 67939 61375 40932 56906 85424 97524 82520 58122 44259 18909 7166
22386 7166 -15480 -28714 -14700 -13881 -51810 -47334 -34255 -10849 29594 40464 35360 36523 47044
22373 47044 41906 21289 27799 55452 47121 53316 46471 36630 28525 32557 35481 35683 60657 57491
22359 57491 35178 34100 60669 65820 78830 78277 58732 46806 74676 67856 58130 44825 42560
22346 42560 18925 21563 22018 19498 19314 47536 51724 38770 27605 47166 62785 57907 28265
22333 28265 10367 40575 42186 47312 26249 32533 48942 37370 21213 38170 33655 12814
22321 12814 13394 8247 7727 4584 -14584 -13378 5042 3005 18930 48197 30149 20444 23658 36305
22307 36305 23346 19277 39789 57698 24459 -15413 -28952 -14845 -3740 15389 17804 47916
22295 47916 68239 53906 54613 56022 88721 124360 128232 118522 90415 26467 -9322 -10566 17205
22282 17205 26291 5743 -37004 -37520 -19017 -34386 -40383 -30986 -31004 -28552 -43494 -40555 -42189 -13920
22268 -13920 -7325 -11027 5976 13949 3864 -18892 -29688 -16866 -3624 -10809 -19923 -14826 -3589
22255 -3589 4421 -5252 -2492 -10903 -8925 280 -3906 -6538 13758 53921 45434 8455 -7759 2002
22241 2002 9077 559 -1435 -18597 -20048 -26403 -18084 -4269 2580 24859 38211 -3082 -27933
22228 -27933 -26559 -28079 -22130 -15593 5152 30046 39457 31520 3189 -3932 -23609 -41156 -43077
22215 -43077 -25018 -9262 2979 -15124 -23402 -10223 21179 35570 30484 32671 11051 6089
22203 6089 -6181 25176 33148 28554 26034 -8441 14818 18666 -5858 -15909 -31589 -30372 -47681
22190 -47681 -48433 -13785 7328 14300 963 -3189 7377 10037 9125 -21833 -29203 -25956 -17487 -31720
22176 -31720 -43987 -13290 -9180 -8409 -14213 -1001 -6481 -14870 -29274 -39372 -13317 341 -1248
22163 -1248 -14605 -27763 -24556 -24998 -22470 -25106 -17261 -12156 -6810 13337 10997 -774 -24491 -25535
22149 -25535 -3429 -7038 -13167 -395 301 9743 -19481 -22657 -14434 6334 22441 23390 -6326
22136 -6326 -11957 -16119 -2788 17516 12157 16301 -7846 -22276 -38660 -50184 -31128 -21656 -14699
22123 -14699 -41180 -38943 -21537 -3009 5428 5031 -18390 -22780 -29603 -37614 -45675 -44081 -38842 -33073
22109 -33073 -23750 -3869 -1289 -6338 -11505 -7805 19970 38629 26005 -12740 -14302 -4178 3685
22096 3685 -10945 -28147 -17781 -14215 -14254 -11830 -2230 9421 13663 20580 12940 8858 -18452 -30522
22082 -30522 -21191 19482 34350 34347 41770 34132 -2008 -48630 -50763 -37368 -39661 -34530 -7955 -1089
22068 -1089 -14508 -26944 -14618 -13961 -32779 -34311 -50875 -47831 -39681 -50423 -31537 -21013 -15642
22055 -15642 -4183 21570 19482 11564 11268 14374 -1644 -27455 -24871 10768 15225 41240 36794
22042 36794 30655 7416 6397 24004 52574 56009 30817 13344 17255 1418 13388 35128
22030 35128 41203 60422 99111 128042 135954 142829 171633 182754 218283 326402 502241 818110
22018 818110 1321518 1752643 1760764 1475443 1221490 951996 652432 440440 307334 215698
22008 215698 150442 120978 96692 83786 51085 34275 34909 23228 19400 34066 33102 29212 5943
21995 5943 2808 7977 16506 3790 8574 -9656 915 11203 12358 7174 21232 24514 3387
21982 3387 -12704 -10576 -23673 -29341 -46815 -35589 -23051 -21348 -44454 -63891 -70416 -51709 -25087
21969 -25087 8392 38381 60713 47803 23212 21123 15307 5619 15179 20005 -5122 -17125 -14202
21956 -14202 -13856 -20780 -21669 -15088 1213 878 -9124 -20296 -25866 -49783 -28624 1522 -25542
21943 -25542 -38756 -48014 -44083 -10653 -9442 -4223 5334 10423 15925 36423 30766 15607 -23532
21930 -23532 -26254 -34732 -24778 12841 21034 17270 -2252 -14573 -11185 -3438 10275 12135 -10638
21917 -10638 -20894 -17667 -27676 -14713 -6813 -11197 -17540 6687 28353 27566 9806 1939 9812
21904 9812 -4907 -7150 -19880 -10952 -23174 -20506 -16495 -5031 -22382 -48708 -34465 -38393 -35249
21891 -35249 -38569 -29185 -33133 -55765 -40675 -13845 -9614 -12301 -34486 -37849 -26902 -42808 -41737
21878 -41737 -18472 -6909 4538 3059 -6102 -322 25879 32177 29238 26189 21092 1255 4913
21865 4913 11165 -14255 -22081 -9600 -15312 -21334 -14077 -22756 -24841 -45826 -45881 -52631 -37068 -6482
21851 -6482 2305 -13100 -31198 -42412 -26828 -14687 -3206 2194 2675 -3960 -22703 -30438 -47775
21838 -47775 -34814 -30046 -20267 -13911 -11498 3841 2946 -7804 -7 17656 -8891 -32858 -16984
21825 -16984 -1004 3515 -13955 -22883 -7989 -14932 -16896 3387 3697 -5026 -18842 -15275 -7189
21812 -7189 1459 975 -14051 -35253 -14605 -9543 -4225 -7837 -11695 -7223 6005 9954 8470 10617
21798 10617 -9588 -29291 -2841 -13527 -22371 6185 23868 12515 7661 -9672 5347 23395
21786 23395 13136 -5879 -19619 -17039 -36967 -30759 -14020 341 3715 18243 -3980 -9266
21774 -9266 -4240 1455 -13004 -33587 -17004 -27673 -47214 -37892 -28990 -10921 -24406 -22050 -6764
21761 -6764 14656 20395 14923 19708 23004 37598 32395 7204 -8876 -24565 -42622 -54784 -51772
21748 -51772 -32260 -27383 -40101 -41166 -53622 -48909 -48689 -64253 -67625 -57774 -46756 -41712 -31582
21735 -31582 -16964 -34847 -41236 -30799 -26479 -30707 -6496 6845 -14047 -39869 -32667 -18522
21723 -18522 -35745 -39066 -11771 8250 5863 -1232 -833 -17703 -10724 -33629 -24895 -17470 -10076
21710 -10076 -27886 -26083 -358 11037 5444 -4042 7590 5258 -4376 -10202 -29992 -17073 -1873
21697 -1873 -26217 -18992 -27787 -13478 10243 7722 15058 -506 -13204 -916 5973 -9174 -17044
21684 -17044 14324 5223 186 -17813 -38485 -45809 -27086 5850 33707 36136 8560 22987
21672 22987 21474 2175 -3932 -13988 -11037 -7530 -8251 -21631 -14403 10506 2124 -9156 -14406
21659 -14406 -23197 -19912 -16591 -19195 6570 3583 -14774 -25392 -19386 -6916 6525 347 -19293
21646 -19293 -17853 -19050 -7959 -13492 -16553 -31799 -45080 -31786 -17586 -19111 8993 12587 -1795
21633 -1795 -35524 -48411 -46399 -49909 -22423 -30848 -35464 -34070 -14869 4459 13606 -13466 -40158
21620 -40158 -40445 -38522 -35011 -26815 -26731 -16061 -12911 -22729 -26356 -15170 12545 8192 16670 41902
21606 41902 52577 32383 -14 4965 -5970 -12325 -11389 -7500 -25313 -13303 8630 24489 11229
21593 11229 -21291 -32053 -32871 -19853 3260 9911 2476 7440 2155 -13678 -7728 5491 16846
21580 16846 -8756 -18242 -7618 -27492 -27237 -16084 -14479 3156 20758 14182 27506 22325 7810
21567 7810 -7201 -28971 -29808 -36354 -31286 -12177 -14892 -18419 -34737 -52867 -49557 -23175 -18132
21554 -18132 -9079 2405 18433 14581 -11130 -24598 -33244 -41772 -55169 -42547 -27621 -16848
21542 -16848 -17862 -29839 -33222 -8956 -2956 -8433 1863 -10258 -44805 -51083 -38645 -37545 -17377
21529 -17377 -1415 2844 9795 22451 9424 -630 -2111 -9437 -19314 -38537 -51458 -38742 -13047
21516 -13047 -8519 -9500 -6108 1238 -12431 -19157 -8140 -14658 13354 38929 23464 16483 307
21503 307 -19085 -33933 -57755 -70604 -48264 -25807 -9136 -6127 4878 -10407 -5612 -3635 15086
21490 15086 1265 -9499 -18221 -13277 -17449 -16434 -9591 24058 36197 14993 8090 10998 -4369
21477 -4369 -6495 -7161 -29541 -76240 -81826 -51248 -12551 -20847 -45805 -41575 -30859 -14932 1576
21464 1576 10775 20164 12730 13158 -2213 -28866 -57963 -39696 -32562 -58191 -44673 -51964 -34812
21451 -34812 4912 -2321 -25525 -19583 9045 16168 30585 33646 9668 3874 -1156 -6949 -3667
21438 -3667 -9865 -28319 -20011 -8618 -5615 -6346 -3590 -22651 -30346 -27630 -25836 -50125 -19985 -11137
21424 -11137 649 -18838 -22957 3638 5033 -948 -7393 -25673 -26169 -43062 -31302 -31103 -11225
21411 -11225 -7509 -25226 -32024 -19767 8990 -3859 8877 13032 2957 -18031 -26586 -19987 -15585
21398 -15585 -27178 -14467 3005 -20010 -21984 -11538 -17241 -11943 -18191 -23393 -39211 -32673 -8953
21385 -8953 -19640 -30139 -41391 -24666 -13922 500 26952 38098 22976 20609 28948 9341
21373 9341 14371 37178 27455 -4278 -37964 -48765 -59577 -36923 -32700 -16357 7528 3028 5015
21360 5015 17024 33197 27977 16265 -5273 18235 28577 17330 -9934 -23816 -48939 -56661
21348 -56661 -61685 -48087 -49239 -49842 -33249 -34344 -46918 -57066 -18930 -18573 -38131 -47723 -34780
21335 -34780 -11526 13672 -4326 -4791 -354 22774 -1735 -38522 -34399 1890 11142 -7259 -1358
21322 -1358 -14126 -46197 -50716 -37753 -16170 -2035 -3969 -30162 -40741 -33264 -33525 -42030 -36913
21309 -36913 -24927 -12444 -28460 -51287 -51427 -54974 -48522 -20481 -16445 1910 16067 12703 20912
21296 20912 19987 -6025 -28710 -31489 -39833 -24641 2095 8218 21785 -91 -14954 -30157 -27737
21283 -27737 -18791 -22922 -3084 -6824 -13066 -17058 -2861 1123 -1818 -784 -9967 -11985 -30521 -37060
21269 -37060 -18117 -22200 -1968 4405 -20042 -27733 -28237 -4669 2559 -18718 -39788 -50813 -54548
21256 -54548 -49552 -31539 -24978 -34938 -35549 -29067 -29044 -26988 -28632 -25300 -34649 -38314 -42322 -45700 -38597
21241 -38597 -38850 -31499 -44036 -21203 -18667 -27414 -24616 -1623 22603 24634 6395 -16072 -25416
21228 -25416 -19304 -28002 -28711 -5872 1206 1214 -2437 -11363 -18445 -20817 -16637 -19294 -44524 -38092 -22461
21213 -22461 -8030 7132 2906 -3928 18592 21501 1977 -29053 -34953 -29597 -3084 10342 6559
21200 6559 -19079 -36664 -25647 -25538 -18488 -23137 -34549 -26667 -11541 -18824 -25866 -37839 -29685
21187 -29685 -24313 -30592 -43878 -25382 5775 2135 -1831 -14833 7429 16796 -21997 -33869 -10924
21174 -10924 -12058 -6843 15142 9617 3012 -6103 430 -2112 1203 -14531 -22544 -3263 8367
21161 8367 -813 -16872 -11405 -10653 -16334 -13184 -42393 -48868 -22779 600 -9577 -2346 3475 -11154
21147 -11154 -24097 -50818 -49311 -30795 -30058 -35225 -35424 -26105 -19451 -3729 -18264 -31986 -18857
21134 -18857 -2044 -1559 -14004 -9060 -5146 -14386 -29285 -23370 -30608 -20007 10566 5068 21836
21121 21836 43434 30061 26088 34437 22384 16005 15125 -11513 -963 6455 -11194 -9633 2833
21108 2833 11972 14757 6487 -18709 6184 14464 9375 -29351 -44380 -36182 -23542 -43688 -28864
21095 -28864 639 9078 -14378 -8887 9964 45517 16059 -5739 4047 31539 40114 26129
21083 26129 17706 33272 34462 42664 29405 -5438 980 4500 -9159 -20520 -12390 1008 -1581
21070 -1581 2588 -26603 -66684 -75519 -62302 -47636 -30981 4221 9424 2061 2469 -12395 -15748
21057 -15748 -19660 -12021 -3794 -2894 -6866 -13598 -12406 2797 4119 -6485 9556 24605 48334
21044 48334 32702 22872 -8531 663 -10413 -3635 11563 19339 33855 22375 -5722 11221
21032 11221 -2993 -20318 -18104 -603 -9578 -7962 -2343 22293 44209 36402 34173 26441 25867
21019 25867 -14862 -45230 -37229 -15157 7077 4621 4193 7820 -1016 -5793 11037 22242 -697
21006 -697 -32552 -40178 -26884 -27710 -34791 -24067 -4315 -13326 -47980 -44535 -38873 -33668 -7011 11690
20992 11690 4165 -6535 -6443 -5335 -10995 -1908 -16558 -26002 -63417 -63222 -43345 -11158 505 12351
20978 12351 23992 19594 16077 3369 13090 11517 5673 -9028 -16102 -20380 -31946 -41594 -47122
20965 -47122 -25662 -5794 -7326 -10095 -9268 -34707 -47932 -36660 -31626 -28856 -21552 -17425 -23016
20952 -23016 -42492 -37776 -30006 -35619 -35214 -39103 -19547 -22942 -15278 -9423 -8225 -1267 8634 -483
20938 -483 -15996 -14399 6049 -3621 -2917 -12979 -7165 4363 8698 1599 3355 13796 20207 3484
20924 3484 -11454 9111 19412 10215 13744 23166 1364 1760 14835 4245 -22589 -18206 -9049
20911 -9049 -6164 -136 3874 -13315 -19213 10026 25918 12226 -12934 -13225 15278 9839 -13002
20898 -13002 -10859 -1427 -9657 -32577 -13636 22203 5581 -4841 2140 12336 20761 9551 -1926
20885 -1926 15482 21530 -1793 -5541 9221 3474 12182 15792 19069 34922 4463 -51395 -70212
20872 -70212 -60407 -47783 -52728 -40815 -22734 -21784 -788 7900 1137 -2732 -4585 -8647 -26649
20859 -26649 -11007 -2618 -14819 -983 5601 -248 -11744 -17660 -34834 -42403 -35219 -23025 -7030
20846 -7030 15314 3876 -13844 -34971 -48565 -26198 -6893 -1220 -9940 -10843 5945 31582 9477
20833 9477 -6677 -13570 3006 -7930 -11952 -5205 -20786 -20368 541 20129 10359 27030 31499
20820 31499 13066 17254 -6819 -54430 -58056 -63513 -59849 -59810 -66905 -69438 -57160 -33835 -28649 -46705
20806 -46705 -51534 -19578 -6950 -5820 -7594 -3237 -844 -12583 -13479 -2147 -2046 -18852 -29473
20793 -29473 -44873 -27575 -17376 -41736 -33329 -25210 -378 -16873 -18942 -5886 -2347 5660 -13664
20780 -13664 -2546 14970 29928 12268 7005 14122 9757 5640 -15646 -5478 6973 7446 15021
20767 15021 6360 -7940 -1241 739 26508 15781 -2151 -4523 13042 28936 24024 6273 1018
20754 1018 -471 23321 41541 31132 23136 13391 -13800 -11790 -15034 -21987 -38233 -34412 -38095
20741 -38095 -43552 -51629 -37912 -17724 -25083 -43256 -32949 -20440 2057 -1846 -32935 -32087 -10142
20728 -10142 392 -25623 -51392 -49785 -38797 -21223 -23327 -48416 -49175 -54212 -51041 -39045 -25544
20715 -25544 -4589 -7091 -33198 -58656 -61115 -49431 -37744 -24444 350 4770 3068 -17128
20703 -17128 -29920 -27921 -21763 -32320 -33076 -23521 -31345 -6759 10824 4819 -28939 -53703 -56374
20690 -56374 -36670 -26846 -17438 13295 24911 48671 47259 19548 13006 17876 28034 36369 50930
20677 50930 33328 22736 12507 28093 26398 25914 12457 -6422 -3442 -17072 -47108 -51820 -47334
20664 -47334 -38112 -50605 -50945 -32946 -24922 -9647 -12540 -7876 -2586 23860 21002 13293 18772 12003
20650 12003 21028 23565 27011 23890 31947 31586 24272 10908 -6989 -26992 -32689 -26140 -11547 -16497
20636 -16497 12517 22818 555 -2227 -5410 11277 6786 -5655 5957 3899 11430 19604 -147
20623 -147 -21260 -42879 -39589 -3809 25720 18873 -6255 -8358 -10335 -12196 14006 36033 21492
20610 21492 25082 16730 7379 3137 6689 -8095 -22972 18438 44948 29763 -5691 5046 23379
20597 23379 28211 29416 48349 58922 29039 25124 13184 7863 15274 19255 37436 23831 -565
20584 -565 -13763 -47007 -46144 -29949 8515 -5544 -17321 -12524 -10473 10982 290 -14489 -14511
20571 -14511 10100 15072 15458 32399 925 -14600 -24548 -24009 -14919 -7347 -6598 18418 21252 7861
20557 7861 4130 926 -17605 4114 23095 13065 239 7881 2041 16921 12994 6826 1430
20544 1430 1378 517 8369 40462 86810 107775 128595 141678 153202 162083 158292 139752 111444
20531 111444 83048 73349 102022 146033 192251 196609 159913 118796 107379 97306 87750 68456
20519 68456 40437 41564 55938 96567 91321 81955 86617 81149 70087 77280 81189 56149 34961
20506 34961 57578 78238 52763 29682 48448 76198 71545 66324 70378 66078 42937 34266 50252
20493 50252 66406 72468 62988 86418 101304 84864 86804 98558 105756 91913 73394 67843 55782
20480 55782 66735 97009 108361 141626 177648 186199 154434 123630 113476 69911 45026 25144
20468 25144 30444 44702 51036 68417 63077 59910 45226 31515 3770 -9757 -6260 -14588 -28942
20455 -28942 -24430 -3342 -17301 -34420 -18243 -1299 12318 17592 15891 17670 7747 14665 11922
20442 11922 18892 35432 28731 17573 17046 10136 -1941 2853 16489 18867 14848 -15551 -20559
20429 -20559 -15289 -36324 -62100 -56951 -46422 -61437 -54203 -35994 -7056 6425 12751 136
20417 136 -8105 -8072 -10231 -26074 -9349 8679 34724 19740 -2121 -9369 -8419 -13670 -10708 7742
20403 7742 -28523 -52806 -28679 -40106 -33575 -11377 1251 -5686 -3142 -6214 6774 30432 28485
20390 28485 -11727 -37183 -21468 -14762 7096 15934 12106 9345 9033 1945 -9295 6524 11097
20377 11097 1838 6171 9081 4167 7547 17853 3235 -11452 -28980 -30146 -14064 1889 12417
20364 12417 7265 -11438 -22377 -31464 -17557 -11600 -13603 -34553 -35701 -7892 22068 6849 -14942
20351 -14942 -11507 -5230 -8794 -12821 -23870 -13222 9347 27290 14160 -6392 -23417 59
20339 59 7328 11323 8919 7365 15003 21655 15507 11817 -3873 -12674 8002 8408 -17297 -15888 -1124
20324 -1124 -5017 -2475 -691 -2643 5256 40570 60090 40025 31588 14646 -28793 -35998 -16736
20311 -16736 -3625 -11060 -5690 13607 21712 4868 -31202 -16201 14881 23339 10134 2555 4976
20298 4976 3920 27254 39225 40756 13406 16446 35810 23649 26926 25834 15902 -4635 -1274
20285 -1274 11136 27318 12486 -31705 -20448 -12365 -6315 -20825 -49200 -48463 -41084 12607 38658
20272 38658 18996 -13091 -23252 -13949 -20398 -9948 1326 -1481 -14413 -14569 -10859 -11644 -8372
20259 -8372 -15685 -39555 -42974 -34595 -6998 8331 -13137 -17339 -13050 5194 -5197 -23194 -3489
20246 -3489 21171 11738 -12876 -17237 -30648 -15997 -4605 9106 29698 32726 14537 8573 22730
20233 22730 29123 41472 13246 25661 47533 47086 37632 43913 26950 9657 -2979 -7152 -13982
20220 -13982 -17856 -30558 -23354 -20616 -27168 -29154 -12033 -3111 -27072 -36782 -34699 -26509 -25173 -35577
20206 -35577 -26047 -2387 4278 -8359 2486 -3049 -5912 725 2722 24343 10775 -20594 -9907
20193 -9907 2025 9764 -12081 -1481 9648 4658 15761 15225 41936 63861 59357 45486 50654
20180 50654 36654 31507 30123 11456 -22134 -40418 -23869 15710 25413 7178 2714 15078
20168 15078 27597 3341 15481 31590 33514 31217 40566 44043 45861 41420 41700 43353 27160
20155 27160 13566 41324 51413 40128 23103 29620 32242 43027 65757 81348 158625 282807
20143 282807 396658 589985 905989 1298998 1500642 1411488 1206953 999568 769906 545499
20133 545499 371633 272052 231404 189704 155990 131858 115576 93410 82163 71204 59121
20122 59121 54940 48771 58373 61597 48779 34757 40610 50754 75327 68199 38373 15189 2562
20109 2562 -8461 -27164 -19147 -21477 -25966 -29998 -30777 -12488 -21744 -35993 -29267 -13933 2788
20096 2788 -3772 -13100 -3748 -4095 -17247 -10157 3581 -17326 -30511 -14083 11309 28804 11820
20083 11820 7104 39412 33849 4901 -3389 -6128 -5302 -9982 -596 -26308 -29486 -1662 20558
20070 20558 24023 21784 28561 31440 39233 24395 28518 18042 5991 9613 -2972 6708 24338
20057 24338 20772 25641 50669 54689 49475 52579 48754 28548 2787 19354 28547 26480 26816 14885
20043 14885 9925 -11510 -2620 32456 7529 -14402 4801 3806 7516 33384 31238 33096 21475
20030 21475 6491 -2057 -18602 -36118 -30097 11742 17053 12941 21671 3781 -7409 12050 10122
20017 10122 15829 39024 20327 25889 32279 32629 28127 26603 27196 30245 17665 -7851 -21222 11695
20003 11695 21243 17139 14877 23958 29447 18314 16579 17024 32736 35162 42331 33445 27077 23829
19989 23829 18952 -3214 -7465 -6526 13003 26701 40988 44634 39052 41009 44081 67275 54103
19976 54103 17398 20816 51298 61701 67324 55038 16611 -1095 6647 16475 21710 28239 27840
19963 27840 61314 74833 41914 34355 28567 11707 24126 48974 52804 40190 18347 -2758
19951 -2758 6455 29779 52899 33621 3706 22652 4847 -17503 -29488 -14450 5448 -2153
19939 -2153 1859 4919 2892 -3374 -13052 -5113 2603 33116 28757 27285 30019 44358 37833 24387
19925 24387 23872 14772 19878 44404 39868 25399 6569 22084 37527 50458 42265 12874 -2183
19912 -2183 16774 44905 17761 4310 -29778 -21965 1089 25151 21827 31590 57267 57046 49803
19899 49803 55844 58745 33192 5256 -15563 -3169 8064 -9166 -19189 -19295 14104 51156
19887 51156 57281 35618 30429 28972 -2910 -6370 16520 20091 21133 45050 47525 33769 11620
19874 11620 26667 37840 3458 9238 -8632 -16021 -30473 -16936 15488 49750 56891 76225
19862 76225 67490 59215 55981 49415 69053 63916 67754 68313 53883 55303 52898 51712 50315 63441
19848 63441 70767 85843 83263 55065 23047 5559 -11278 -35390 -40740 -59737 -43804 -22336
19836 -22336 1880 12729 31543 68608 67930 54033 45003 67699 85518 81967 89256 94453 93141
19823 93141 110755 124698 136306 147939 131029 145421 175356 203657 237019 292535 306830 277637
19811 277637 237687 213114 212836 203378 219465 243498 283945 333033 392226 418727 400958 353667
19799 353667 310525 277205 263772 319248 370635 428959 467267 514516 522211 534316 571195 542812
19787 542812 502055 442242 372497 325698 293277 291483 296902 307184 323217 355238 347941 354941
19775 354941 394345 444176 430535 381099 334289 318512 316187 329814 367007 385678 388453 422953
19763 422953 480497 537819 569700 549732 497328 459439 436926 406204 393749 416520 432468
19752 432468 411138 388368 381822 400447 451168 475501 442620 394515 390065 385184 382880 391678
19740 391678 404035 340951 270610 243019 175524 141758 133411 111295 95461 127715 198174 259753
19728 259753 280997 265016 265280 232716 233695 225439 211088 197759 180504 180032 183837 176005 176644 155858
19714 155858 152047 162531 145973 139230 168793 181919 163594 149026 175614 195443 204095 203694
19702 203694 182777 166352 191796 221423 249608 288185 337061 365314 389603 350359 307382
19691 307382 253828 164429 121563 127765 120440 124059 126143 96110 78761 77065 87652 80628 99935
19678 99935 102548 111279 128171 128067 116819 117438 146028 179434 194109 203852 235389 272264 281330
19665 281330 271030 278306 341950 370940 326603 265083 202748 144627 98719 119659 102531 51098
19653 51098 32397 53356 64644 73180 91676 106278 121538 136763 107572 94822 96766 114190
19641 114190 113563 115601 94566 84782 88160 97024 82131 67290 78865 89197 97828 77226 59357
19628 59357 93580 126801 127595 123313 112480 117402 136463 155596 162833 225669 299075 356868 351934
19615 351934 338444 285714 271022 252582 228245 243366 236189 217802 232263 248117 235032 235241
19603 235241 233798 254101 274465 270477 275669 310342 346865 378760 384455 390060 384863 401774 387857
19590 387857 380111 378362 386912 410664 466400 534609 603239 651308 659175 665442 662356 687737 697578
19577 697578 712202 733494 774033 806913 823579 849940 931087 1039401 1127913 1222979 1384056
19566 1384056 1594692 1818004 2130311 2670735 3353401 3754937 3763266 3739328 3841218 3994976
19556 3994976 4286906 4837791 5715791 6876123 7968501 8823736 9760044 11060282 12944158
19547 12944158 15761429 20174653 26921218 36780959 51919825 77838836 125968130 206781844
19539 206781844 288053244 303607949 261445918 215877061 173936347 125724282 82979315
19532 82979315 55076770 38901543 29197645 22808117 18196752 14680477 12085286 10313032
19524 10313032 9229390 8622034 8060303 7336045 6716458 6335680 6178220 6478873 7561348
19515 7561348 8681236 8438816 7270969 6222563 5235372 4155355 3254667 2633097 2273137
19506 2273137 2040792 1843554 1669592 1516889 1385432 1306470 1239244 1170554 1093342 984280
19496 984280 895323 831527 795969 754001 714416 708603 718484 706364 653023 612790 575692 556574
19484 556574 555367 531931 507373 504898 507286 505966 513412 511575 521490 506078 487256 482588 465757
19471 465757 490638 488289 454790 432537 428978 455258 487458 479261 451907 435890 422802 433828
19459 433828 446427 460104 466959 462503 474626 442371 426309 440778 451869 470371 455763 456709
19447 456709 460336 463593 483539 494109 502244 496322 500293 509806 477730 468114 463468 443286 428532
19434 428532 383388 385335 432360 496455 510735 483898 474641 476677 491381 497536 519723 492269
19422 492269 472693 495761 511675 497485 517343 506030 477475 441574 381557 330035 321392 346425
19410 346425 342767 344137 358218 327672 307411 316526 350869 366521 353657 358424 378474 390692
19398 390692 413658 409971 396596 371087 353093 355257 368215 378534 392236 397575 394088 383766
19386 383766 320485 235383 143024 65213 42133 78868 127427 161918 221977 258940 274213
19375 274213 288633 322008 361191 380001 383215 393485 377298 370320 379615 418879 463923 470371
19363 470371 474034 477043 473548 467965 474917 477524 495320 500979 536155 587237 644436 669886 681887
19350 681887 681490 706103 839799 1029789 1217355 1377971 1534149 1718243 1982540 2409911
19340 2409911 2984036 3516475 3901775 4258720 4483747 4490163 4540474 4740189 4910512 5169076
19330 5169076 5883472 7065513 8024213 8094148 7673409 7320570 7155140 7265186 7991065
19321 7991065 9494624 11201243 12273096 12381788 11798747 11121913 10586508 10125781 9875919
19312 9875919 10168813 11225161 13222487 16507515 21382917 28211410 36983520 48846444
19304 48846444 66574443 83939038 86806052 77447606 66950473 57034482 46663501
19297 46663501 38823608 35956287 38708799 46213065 52711513 53955465 54853730 59490455
19289 59490455 66331789 73401960 81230490 85865179 80598692 69491765 59703492 51826822
19281 51826822 45225730 40409103 37909231 38562581 42861776 51254660 61474877 66367810
19273 66367810 63223744 57645045 53012675 49150594 47924943 52387950 63775040 78889211
19265 78889211 90455627 96403969 97401166 91948915 81068180 69968957 61656490 56558947
19257 56558947 55374477 56136510 54526529 50799441 47999516 47159672 49155047 53225901
19249 53225901 53931556 51140909 50172112 51480866 52911435 57214653 69620332 87579355
19241 87579355 95016818 86039821 73537126 63370866 53261612 44976364 40616527 38414427
19233 38414427 36163009 32370627 27356558 22491340 18268777 14716896 12063487 10292267
19225 10292267 9069056 8144944 7499663 7120149 7103943 7559687 8597289 9766176 10492674
19216 10492674 11138187 11943303 12408654 11920082 10597909 9172313 7977252 6962186 6206321
19207 6206321 5820999 5685298 5525346 5287504 5150385 5106506 4952074 4607590 4313624 4144540
19197 4144540 3895699 3563721 3291955 3108068 2984308 2929392 2909246 2894926 2895036 2889988 2831233
19186 2831233 2751110 2716057 2751506 2782888 2799124 2850494 2888485 2879975 2902763 2942329 2961057
19175 2961057 2963828 2913190 2858066 2744720 2642627 2587554 2614152 2647263 2616537 2545832 2445027
19164 2445027 2356692 2322446 2358882 2448910 2525863 2567378 2540732 2495779 2396505 2270208 2239547
19153 2239547 2306124 2460265 2654893 2729117 2722887 2772638 2882741 2904544 2815815 2711116 2556738
19142 2556738 2344049 2136876 2010732 1964768 2054425 2213943 2269428 2180348 2043144 1896357
19132 1896357 1778713 1629822 1464708 1340720 1257306 1209657 1175631 1154254 1142313 1126755
19122 1126755 1094889 1065624 1031136 991673 962628 949579 926849 923195 953371 945906 950725 962704
19110 962704 967863 955135 940290 915172 901472 892946 868223 832914 826872 831327 811931 761939
19098 761939 698038 636745 599129 560377 537254 562359 587449 614311 667560 724167 753248
19087 753248 745976 746179 764825 753507 712341 693791 684654 664904 635917 596101 585339 563991
19075 563991 526008 512599 518111 580395 654984 712764 743201 711154 653316 613722 587646 561567
19063 561567 521161 483561 482995 470181 457002 451653 464712 442023 448156 447738 431820 428825 446934
19050 446934 480245 504586 512010 513159 508043 492158 479279 470077 455611 425575 421239 430529 430322
19037 430322 432887 458856 464723 466534 459941 443435 427667 414101 431727 451925 438374 448037
19025 448037 494910 514286 521953 528223 527620 510709 498724 515895 545450 551573 563831 599951
19013 599951 650635 701693 779619 816770 810365 758647 698823 651156 607092 569877 549833 545732
19001 545732 537647 552850 573495 579399 586867 562597 548182 557473 586731 644025 661644 650373
18989 650373 598508 571542 547399 540820 555769 563999 558812 562458 534361 515410 516822 512347 531762
18976 531762 552023 564010 584759 650528 718456 758738 785647 768149 753639 791469 847927
18965 847927 903354 898128 849105 818354 770266 729002 704904 712785 729751 789079 851239 867800
18953 867800 884503 845981 779528 707906 632758 585105 578279 605918 606312 576028 549108 525406
18941 525406 501270 483475 474864 509319 543206 590661 661667 751786 948982 1278760 1699101
18930 1699101 1989039 1951183 1754482 1567328 1381544 1183417 974029 823022 722416 691931
18920 691931 707172 719861 740626 733394 672538 591512 541966 520787 502643 481459 471269 521321
18908 521321 576724 577269 529159 457705 420870 422080 436043 458049 491806 502996 464849 441946
18896 441946 404065 364063 352562 316887 278591 266257 251843 249099 247216 255510 257908 258295 254387
18883 254387 260433 272433 282543 273789 266614 250184 268601 306075 336229 362732 351903 355980
18871 355980 385441 421526 435379 434051 415531 389621 344117 336393 343095 346995 361085 349121
18859 349121 329220 328070 304799 254915 211835 185352 186312 177730 161094 165353 156059 171898 204623
18846 204623 205732 157437 137174 120282 111425 133671 155445 149962 153940 169664 168999 156115 150862
18833 150862 162339 127264 120177 130662 121391 129302 145779 149999 159789 155180 161202 182237 224193
18820 224193 262667 309520 341924 364595 353691 308816 281139 273969 275076 277268 274549 269250
18808 269250 249790 249164 266769 295947 348365 389929 434405 471176 538813 562160 512033 453572
18796 453572 413621 379721 376512 382102 403503 427992 439357 421085 445491 470198 466553 445317
18784 445317 440469 427508 406163 394501 407717 427204 479850 522587 640751 815117 1002290
18773 1002290 1094934 1122677 1110618 1081871 988198 902032 827524 731117 693413 710376 717505
18762 717505 665788 620619 621376 599111 546868 543334 563280 557737 599260 631109 625422 595559
18750 595559 570460 582174 636285 694680 683878 627064 573921 524687 476525 461320 490012
18739 490012 541142 639562 690455 624830 548571 484879 403647 343910 322823 332024 372141 423198
18727 423198 479465 559142 611455 624943 545358 491973 472293 421487 349322 301402 298162 252398
18715 252398 229234 227025 233107 254072 274821 279339 275138 270399 263561 257013 259978 249457 265928
18702 265928 276894 282930 270202 242585 206949 206520 248733 286701 283272 269939 268309 257779
18690 257779 225010 225901 220965 199423 200484 231947 259612 261445 275872 280952 279865 290271 261230
18677 261230 234246 205952 202701 192831 187091 180853 175602 209537 229109 210407 187023 176420
18665 176420 189294 224404 240997 256887 313026 337986 328158 323767 301381 289533 280750 275110
18653 275110 276957 313193 337845 363992 399653 420731 433056 458137 483854 498191 565390 639957
18641 639957 688449 724444 737317 748934 782362 797515 776678 754829 713019 671324 639799
18630 639799 643443 636043 646494 661566 659556 617957 589816 549424 518070 503159 510552 506543
18618 506543 524531 534150 518771 502381 494605 510882 530904 554879 569792 601007 618756 645147
18606 645147 657663 654588 638921 658238 707415 788243 902713 984032 1063658 1094231 1092394 1044167
18594 1044167 1003070 953283 881179 795150 733710 689801 670212 638779 601306 597721 591722 591391
18582 591391 593923 589198 602203 656807 686136 702616 717346 700004 662143 597551 553882 549773
18570 549773 563474 555656 537983 517495 484609 484588 497870 481252 459747 468135 516980 575837
18558 575837 621867 650531 671329 681176 670331 645671 626961 605978 651190 667355 680465 699501
18546 699501 725001 745023 748577 763432 797293 860637 973549 1097120 1143099 1142061 1118749
18535 1118749 1085927 1060618 1028648 1009223 1046416 1126617 1172574 1197936 1214336 1222246 1215912 1226798
18523 1226798 1261493 1316770 1413524 1480060 1549825 1637197 1798983 1995753 2243922 2647632
18513 2647632 3214953 3632589 3682158 3622930 3647807 3670195 3767177 4057447 4610178 5229410
18503 5229410 5773317 6428000 7335837 8478582 10062283 12625721 16625013 21047676 23238195
18494 23238195 22780365 21565593 19925816 17615814 15476718 14174373 13691520 13862033
18486 13862033 14794905 16793504 20315066 25826835 31983116 36581764 41567933 50407497
18478 50407497 62342546 70011624 71462088 75020150 86354882 109576463 150809957
18471 150809957 195428046 206598519 185394863 160855070 138866519 115488237 97613901
18464 97613901 88857836 86590532 90558849 95997419 96360254 96298327 102396693 111948193
18456 111948193 118689175 126289556 143187975 166097934 179751072 175179980 160733340
18449 160733340 146841806 132185858 115734337 101799580 91287947 85514279 85952211
18442 85952211 87665595 84328921 79040620 77145525 79272477 82313242 82030210 81269769
18434 81269769 86759124 99112559 111478441 121398528 136110567 152229472 153068279 135312285
18426 135312285 112655288 92676718 74459140 59786624 51095158 45784402 41085144
18419 41085144 37697617 36271662 35488493 33470978 31290913 31316001 34208381 37978198
18411 37978198 37832527 33554322 29301579 25931780 22489120 19716673 18410828 18064532
18403 18064532 18064503 18255313 17955607 17071533 16074799 14767462 13084819 11566870 10354529
18394 10354529 9352864 8582209 8016517 7551959 7178401 6978029 6975180 6997512 6919757 6767214
18384 6767214 6596759 6474744 6492407 6754136 7216377 7788977 8160651 8083377 7752286 7531126
18374 7531126 7505008 7411727 7138661 6879063 6736192 6672794 6686669 6914497 7316017 7578676
18364 7578676 7520623 7387939 7290372 7042689 6747567 6595002 6493312 6370367 6116126 5819866
18354 5819866 5566566 5296523 5028682 4760224 4478726 4296526 4197485 4149173 4246205 4536009
18344 4536009 5024243 5604518 5726936 5446073 5211453 5037745 4784447 4561679 4371820
18335 4371820 4158996 3928136 3699264 3515173 3356583 3225643 3099540 3034376 3104497 3246114
18325 3246114 3447206 3663832 3814927 3781859 3653999 3535225 3423513 3202479 2919839 2640655
18315 2640655 2407465 2251337 2152266 2085730 2034325 1989526 1929296 1868704 1784397 1695065 1620185
18304 1620185 1583868 1560651 1498257 1456392 1427833 1381018 1313934 1272556 1297431 1357462 1432156
18293 1432156 1456750 1445597 1416367 1407254 1340889 1263026 1207762 1160061 1097253 999543 921817
18282 921817 884341 868573 871631 927355 1015417 1138170 1270121 1321406 1230772 1124325 1039018
18271 1039018 948559 890226 848718 777042 714671 701406 692945 689407 696723 728566 772887 833764
18259 833764 931164 1062964 1196158 1304503 1406424 1425625 1399348 1342318 1221029 1077590
18249 1077590 968490 867574 763204 702142 647319 615229 574939 558627 569382 559363 528901
18238 528901 528295 535062 532671 544905 549295 582481 591581 602059 613018 622497 636304 637524 630769
18225 630769 634177 605184 585638 576433 575185 550100 546416 551501 546231 530081 545865 572921 577741
18212 577741 585047 593058 588298 613465 638456 663212 647407 615890 592159 606879 621295 623469
18200 623469 637750 663496 654205 631705 597793 589989 571228 560847 537123 526258 523889 514249
18188 514249 509263 521382 531560 536811 558904 566268 561672 549301 519413 517000 517003 529169 543802
18175 543802 539060 556122 588477 599909 627386 691264 751298 798907 840026 895401 953218 939305
18163 939305 876778 845508 814787 772250 775518 791460 754650 698100 621848 541301 489275 469931
18151 469931 459308 442643 440914 451617 443057 411155 403318 416877 422973 433172 451781 452914
18139 452914 476235 524491 563460 599096 647479 698838 722786 744933 739197 741780 754539 778676
18127 778676 794197 784181 769267 781136 826473 872658 907668 969315 1082584 1209560 1372638
18116 1372638 1564114 1786306 2074292 2456434 3043831 4008091 5490967 7811919 11831095
18107 11831095 19536286 33240491 45631622 43953570 35707431 29802299 23620341 16040763
18099 16040763 10292415 6992582 5131648 4002744 3216537 2641170 2188095 1844415 1572633
18090 1572633 1362586 1201044 1092345 1018506 944913 882434 811628 759234 705666 681017 640702
18079 640702 593527 552021 492958 429161 418147 423022 409832 389528 367027 360861 355625 346217
18067 346217 338796 335361 337106 315707 301501 287784 301816 306881 292122 288486 285410 268882 280024
18054 280024 269842 285552 296903 300286 346134 424390 483465 526799 532289 533054 558609 593379
18042 593379 669730 686590 633545 586418 573520 569165 546379 500768 456214 418373 381543 349029
18030 349029 317734 292463 259358 241613 238285 238720 253759 248264 246377 250495 232360 233120 263478
18017 263478 257890 257830 239624 232710 243670 268907 304814 362032 404990 473683 522754 582964
18005 582964 639904 761290 870711 914558 891601 887468 974312 1116432 1220821 1219907 1139952
17994 1139952 1081279 1054500 1059402 1064177 1047355 1048160 1046246 1017415 951420 901449 912135 999478
17982 999478 1199377 1458738 1619881 1630425 1624114 1702466 1915481 2238048 2356043 2207727
17972 2207727 2054150 1949849 1852907 1760830 1615601 1406888 1205789 1045012 878904 769720
17962 769720 661602 574146 539866 523043 517166 500920 504390 501557 501359 473288 456234 451999
17950 451999 458315 474899 517947 514243 499015 510135 561717 657111 741994 797974 795486 800480
17938 800480 825405 857423 871874 869783 912096 944693 951889 908440 799499 693236 601367
17927 601367 528334 453852 416733 388640 396668 379738 407334 462840 479165 472414 456299 440719
17915 440719 439297 442180 440295 446096 480141 531032 600456 693719 867828 1076099 1267494 1350452
17903 1350452 1324307 1195784 1026406 861582 677349 554921 472656 440172 459028 503159
17893 503159 550426 566540 571711 547452 515366 507402 486367 469484 440823 405634 382992 389337
17881 389337 444542 533992 680536 808161 881481 909918 886767 821871 696891 559671 447118
17870 447118 376097 327391 286584 287895 280688 273220 264176 245529 221140 194403 185278 170363
17858 170363 152710 153730 144933 128806 120906 120646 106913 107876 131319 132228 142341 139397 125325
17845 125325 110593 126196 151365 153740 138067 144302 148857 159786 188324 207997 216290 192895
17833 192895 186511 183582 184738 183443 169776 156446 126828 103134 101401 98646 79048 62588 76134
17820 76134 109572 121793 108477 118480 100412 104709 102833 91327 82047 90044 112642 131697
17808 131697 133302 127561 139923 157484 156741 140463 115212 133601 133231 114168 103026 76312 83669
17795 83669 98039 105142 81332 78993 85644 110735 124057 126152 138014 137795 155296 172997 229799
17782 229799 292604 390258 487692 516268 531811 558235 556782 495390 413519 357755 292249 207892
17770 207892 158290 140352 122038 121392 101989 65122 89139 86565 54791 30003 65811 85486
17758 85486 69175 57528 68038 69163 44949 42115 52536 56765 58285 54166 48434 48110 44282
17745 44282 22376 -2573 -4916 15076 47930 67525 71750 60654 56833 64582 58977 53241 46177
17732 46177 47272 44822 59566 81111 77471 76169 60543 35050 41360 57102 66270 64151 61841
17719 61841 59745 71733 64518 54067 47161 35433 35187 20916 17207 46688 48973 63013 68959
17706 68959 42491 23670 23744 53564 58813 36122 56693 78406 71658 58529 62952 75107 99723
17693 99723 86435 66072 59240 66342 90195 95434 97509 93128 62018 59498 66797 41334 33698
17680 33698 39727 29752 33035 27983 5059 8899 17127 31197 40845 10268 -16702 -8174 27846
17667 27846 25397 55390 83920 83786 83845 70970 78882 98636 107004 118400 148068 142890 127195
17654 127195 114067 83953 76771 76175 77446 96338 96990 72174 63718 47617 25980 44494 81453
17641 81453 91835 74220 48288 40506 39296 57348 80605 96148 134031 154208 180922 194135
17629 194135 201857 228300 238111 226553 180448 124060 80191 84962 98054 80886 74595 57479
17617 57479 68437 60102 37686 16419 27172 62574 75816 65332 62530 66937 80146 57864
17605 57864 49920 65089 72121 79381 85660 70451 58349 75615 73668 60386 38828 10472 10605
17592 10605 14841 21220 33619 32196 29806 31107 61518 73848 38473 1636 6841 14233 20871
17579 20871 36495 48774 36959 26625 41514 42563 31936 33206 50110 66108 83472 85082
17567 85082 75551 82478 89916 89196 73873 59864 40389 28672 20834 33715 38951 6767 -3618
17554 -3618 5039 31502 47711 70155 75526 67074 38387 12191 3323 -10333 5379 25865 30952
17541 30952 34827 31038 15747 27537 37517 58074 72019 52533 15667 -18113 -19603 -5858
17529 -5858 -11131 6067 17877 29210 37652 22640 39866 42325 46722 65129 86632 83405 40929
17516 40929 14395 -2686 -3389 -9844 -4938 2318 18283 14714 13046 15020 -622 7165 9293 -3894
17502 -3894 -1110 16901 35160 44142 28719 11607 -10835 -11071 17415 26345 25678 43173 19996
17489 19996 9411 7647 -972 6744 1061 -7087 -1863 -16580 -27935 -38936 -41334 -45750 -34019
17476 -34019 -17850 -3478 7115 11473 -11982 -34587 -40684 -56625 -72952 -62809 -57580 -36984
17464 -36984 -16163 21583 31151 10367 -3318 -7751 298 4026 20910 49104 79047 114577
17452 114577 144772 174418 199894 203578 184544 160925 139570 119421 102410 91044 68133 66448
17440 66448 117735 207619 260783 243205 190916 154162 107804 77163 53530 22216 17584 32600
17428 32600 61584 74761 66700 49042 13372 7483 -352 -14460 18828 12227 4430 12223 10342
17415 10342 15279 25539 10620 14045 8950 -15916 -37100 -32539 -43767 -36875 -36469 -15738 4278
17402 4278 2573 8733 -14152 1285 3074 -1820 -4623 3891 24265 27017 24745 10617 1114 16787
17388 16787 26107 13547 12946 -2663 3293 3198 10404 12348 5328 -3870 18186 25115 28105 29367
17374 29367 29787 26567 27796 34743 33185 23490 22561 14116 -8091 -16869 -18467 -21299 -19324 14746
17360 14746 34563 21049 5264 14784 29230 41313 50888 42583 14558 31782 30557 24043 25969
17347 25969 46309 47192 32876 24598 36300 31518 24178 24907 16348 8033 2391 15406 2402 -3405
17333 -3405 9112 24959 27020 26462 1932 -10315 -11590 3281 35579 16681 -534 18809 33912
17320 33912 37121 34849 13238 8027 5648 -14549 -9679 18819 53851 48224 24210 8589 -2627
17307 -2627 -5724 -18638 -8026 -20902 -27054 -21496 -27961 -28623 1092 16986 37980 44972 19411
17294 19411 -4194 -6832 -10082 -1055 24225 42345 43486 58029 61546 37548 3794 612 14983
17281 14983 893 2709 1184 16860 38820 23824 21623 35862 37201 16692 -8414 -21518
17269 -21518 -12189 -20961 -12060 8693 19061 33917 15501 32783 56638 57674 16550 -12138
17257 -12138 -7047 -9962 -12626 -18289 -15533 -9030 -33834 -28740 -25472 -23457 8228 25132 15066
17244 15066 11604 29534 26714 31365 23273 5755 12481 18846 20784 31737 27782 4399 3078
17231 3078 21860 8699 8456 -12999 932 16219 14081 13391 9978 6192 21163 34093 36045
17218 36045 32302 48348 56827 33561 5026 -8593 4636 -4134 -11658 -1627 17990 29706
17206 29706 12380 3035 8773 25973 11863 17474 45158 57257 80525 86174 73446 44368
17194 44368 18602 13464 27406 33802 44771 55577 38704 21661 36140 34397 33787 50831 46307
17181 46307 13686 29529 49573 55527 35768 38169 37090 9796 6349 -326 24597 57246 28270
17168 28270 33892 19799 1375 -657 1617 15809 7453 12663 17862 20026 13794 16842 23507 4805
17154 4805 -14634 -26559 -18014 -12191 4463 13316 7007 2043 -3050 19919 49124 69947 77905
17141 77905 54217 54759 51494 47402 36750 36133 29629 46820 68022 32643 30452 54252 42018
17128 42018 52599 64361 57173 41210 30445 50646 35352 30803 44319 24673 7585 -4071
17116 -4071 1082 3369 6930 1653 -9355 -28463 -35357 -49788 -41315 -12310 1269 -15488 -7384
17103 -7384 8017 13859 17142 32584 12974 -10168 -14785 -9241 -4403 -10725 1896 -10461 -26089
17090 -26089 -22245 -1725 -4242 6212 -11203 -40966 -37926 -33822 -46832 -23360 5726 -9159
17078 -9159 -25887 -19631 -26179 -43719 -48311 -24741 18507 32920 5130 -13902 -38620 -47332 -40012
17065 -40012 -10344 -18800 -33860 -13768 -4394 5364 5279 -22965 -39448 -42293 -23231 -34759 -36097
17052 -36097 -30582 -5287 45105 53101 23669 4819 6271 20124 10546 -16974 -24943 4541 -6704
17039 -6704 1950 -1786 -4587 8243 -13345 -9914 -5380 -4669 7878 1977 1534 2659 -1929 -13497
17025 -13497 -37808 -36554 1311 46080 52957 20034 -5800 25009 52398 33627 19301 -13306
17013 -13306 -31054 -10390 -3755 -17513 -9824 -12367 -11445 -9126 -12450 -23403 -43944 -57640 -42776
17000 -42776 -27783 -10502 -13794 -20284 -36433 -21118 10103 -5166 -10882 -2354 23377 43332
16988 43332 34695 22907 17728 11173 26309 19165 7825 16137 27952 36333 15095 -9734 -23772
16975 -23772 -35732 -20021 -6874 1543 22904 35645 37350 30225 9396 -16135 -14760 -35727
16963 -35727 -52662 -57591 -61025 -26820 -8685 -19253 -18288 -32933 -22650 314 -6258 -2245 -29180
16950 -29180 -41214 -18040 -12812 -31867 -6339 -1073 -7210 -23577 -25074 -1123 -2215 8234 17136
16937 17136 34913 32779 -486 -37382 -63031 -63250 -50268 -12910 -10669 -21967 -40906 -47908 -34044
16924 -34044 -19650 -27092 -4531 -7187 -1669 -3859 -10113 1734 5186 31055 40213 41665 25555
16911 25555 16606 23105 6474 -10896 -15604 -13005 -16272 -7051 -293 1738 17155 16951 29320 37415
16897 37415 18201 1343 -3605 -13191 -6765 -536 1920 8412 25658 21716 14706 3598 15411
16884 15411 22445 37822 47640 45609 18878 14107 7362 4774 27079 20278 16915 15409 -9463
16871 -9463 -13913 18683 9299 -4351 1692 4022 -6323 -3619 991 1580 2432 9119 11842 -1682
16857 -1682 -21821 -19996 -26322 -15088 -17519 -8478 -23105 -17743 -876 22629 38838 34401 19564
16844 19564 5408 -5786 -12497 13246 15996 -3806 80 -7404 -20615 -21814 -7779 -15443 -29618
16831 -29618 -19612 -8954 5722 16920 -3177 -7440 1345 -12265 -32762 -31580 -13960 -8941
16819 -8941 -17777 -33099 -34538 -30814 -24621 9474 34315 33988 12876 14054 14065 2047 10786 -2877
16805 -2877 -8728 -20941 -16022 -11894 -33797 -42305 -41630 -26989 -25796 -9661 -11248 -19346 -30392 -57959
16791 -57959 -41680 -19018 -9268 20336 47078 46299 44206 44846 33921 -11531 -23475 -11072 696
16778 696 18644 26232 37453 12118 -25112 -17334 -6636 -20191 -28997 -32444 -29492 -3687 -14160
16765 -14160 -27257 -24170 -4017 -1636 -43726 -51059 -53590 -63926 -38425 -36426 -30809 -12317 1389
16752 1389 10292 12639 5612 691 3919 -13063 -23129 -31956 -47433 -44610 -27831 -37637 -35152 25430
16738 25430 47312 42368 14082 -7242 -25577 -31582 -12975 -24464 -53060 -37218 -8690 -11137
16726 -11137 -14886 -21908 -37082 -9366 27819 27205 12337 -17035 -24478 -21701 -18343 -39013 -26146
16713 -26146 -25039 -35641 -29604 -6733 -2536 21964 34524 28282 19449 3729 -8905 3033 733
16700 733 -20828 -25980 -36984 -74002 -83764 -53997 -38280 -42009 -51364 -64516 -54491 -28216 -1206
16687 -1206 -17694 -38737 -36012 -30933 -19169 -9267 -16574 -16598 -15445 -10065 8716 10982 12795 4690
16673 4690 -6189 -6827 -38014 -45716 -39497 -17600 -1859 10682 8139 2123 2542 6598 -2757 -13297
16659 -13297 -16357 -29007 -13485 -8962 -5514 23718 23548 11510 -11500 -14831 2940 9657 12157
16646 12157 4744 -4939 -26886 -34514 -38497 -35911 -18946 -24893 -19991 -6619 1496 -5731 6335
16633 6335 -4660 -29249 -37114 -31820 -14176 -7540 -21481 -31111 -8227 -5638 -15456 -11716 7915
16620 7915 19564 23772 3037 -16924 -16453 -7887 -29195 -43952 -21766 5729 42802 75639 72537
16607 72537 62999 52036 65079 73617 62210 35500 26777 7725 2436 3404 -5849 -3037 11585
16594 11585 22999 13958 13492 19176 16443 10848 -13954 -18038 2614 -9864 -8442 -17880 -47592
16581 -47592 -41507 -13234 -6776 -27257 -31145 -12433 -4883 9632 22048 20848 -5537 -16355 -10390
16568 -10390 -11215 17292 29756 34524 26844 22451 5295 -13189 -5728 -35538 -46237 -52220 -53288
16555 -53288 -34993 -26734 -19043 -4305 -2561 11216 15930 14396 6328 11397 17807 13311 2060
16542 2060 17180 27945 23417 10187 -2628 12880 8042 10945 17219 -3427 -28399 -44258 -46289
16529 -46289 -52689 -61924 -41722 -47703 -58243 -46970 -26940 -27434 -23904 1898 11766 7178 -320
16516 -320 -472 -819 14320 8230 -6343 6073 6257 -15193 -18200 -35318 -49644 -47421 -48022 -50846
16502 -50846 -43164 -37562 -23351 -19952 -23267 -26703 -8026 -11521 -23769 -26093 -31640 -39670 -21370
16489 -21370 -991 5435 28294 43470 47471 45605 35324 -2425 -29495 -20209 -16122 -32396 -44227
16476 -44227 -15360 8884 2256 -9852 -10655 -18045 -23528 -25398 -22431 -32088 -34516 -41651 -30435 -36402
16462 -36402 -21199 2977 2494 -14691 -33222 -47071 -50482 -32757 -29359 -25585 -17764 -14083 -21761
16449 -21761 -6320 13748 3713 -939 -14599 -12989 -1975 -20569 -13712 -13181 -6467 -5125 3651
16436 3651 17809 14322 25135 48516 32821 14957 -1162 -5831 6891 4436 3011 9680 13461
16423 13461 19678 27909 30958 16275 -11688 -719 4302 15056 37892 15957 1080 -12599
16411 -12599 -31776 -19405 -22032 -13511 -17276 -27832 -24286 -6063 -15735 -27245 -11193 -29614 -37235
16398 -37235 -44941 -24220 -6077 7651 1113 -16112 -17358 -13271 -10455 971 -4561 520 9499
16385 9499 1342 18163 31480 -5240 -24295 -23119 -781 -5619 -17531 -23990 2485 26179 13364
16372 13364 -17152 -7923 7713 16909 39983 50877 34740 16246 11551 2153 4586 9975 419
16359 419 -16160 -3669 17155 11296 -7011 -38684 -22769 -7219 -8161 -24819 -16572 -373 -9854
16346 -9854 -34 14322 14600 6115 -4624 -14657 -23454 -29792 -28957 -35286 -31639 -25314 -30174 -20848
16332 -20848 -28788 -16839 -15219 -29760 -26838 -25288 -20426 -22489 -8111 -5459 -19235 -4626 2457
16319 2457 19903 25465 29502 3992 14656 21520 32949 30344 27722 13942 5443 15614 -10796
16306 -10796 -13189 16597 26874 -16075 -28935 -10108 4000 -453 -3474 -8113 -33410 -13555
16294 -13555 9401 155 -13477 1966 2491 -17021 -13497 3003 15064 26575 51252 41233
16282 41233 11250 11254 18310 13014 18218 46077 62666 70869 56099 62179 49030 32396 27166 26011
16268 26011 18155 -2041 -28640 -30227 -16457 -26323 -37387 -46856 -55392 -54189 -51519 -50019 -31315
16255 -31315 -16001 -15049 -13106 -10260 -41663 -46922 -41091 -20996 -13897 -19645 -25300 -21824 -20779 -1606
16241 -1606 18384 19109 18968 8686 -12584 -20239 -10042 -16017 -5655 5481 -16434 -33110 -34210
16228 -34210 -34868 -18103 -3539 633 -11138 -22600 -22693 -12546 8269 1516 -37767 -42330 -29023
16215 -29023 -31100 -38636 -36054 -20729 -11820 22978 47612 34252 12903 -14936 -18877 -5866 20018
16202 20018 33821 42936 27692 -5985 -35350 -32587 -27149 -17985 -12306 -3799 -4472 -4478 3865 5153
16188 5153 18536 38940 29632 11616 -1839 11854 17533 17274 19885 6563 -17705 -20022 -18867
16175 -18867 -5745 -6209 3223 2452 -9936 -6573 6087 28128 19656 -4070 480 -142 7215 17489
16161 17489 24374 20352 5078 -3682 -43732 -52000 -22088 -25674 -46394 -34825 -17065 -15266 -1361
16148 -1361 25412 33869 12938 11420 23952 5929 -14572 -23369 -5846 -14057 -20261 -29054 -34727
16135 -34727 -26581 -28205 -26793 -19821 5468 19798 15437 34815 14606 3598 1228 -13114 -22584
16122 -22584 16416 22425 -122 335 5720 -15470 -7178 -5846 18883 35295 36243 22835 -9176
16109 -9176 217 -4614 -10844 7266 -6032 -36867 -29519 3987 -708 -28205 -63491 -48710 -12382
16096 -12382 12711 15735 19222 8451 8408 -2886 -16249 -24607 -10254 -3479 -6736 -9735 -14473 -21414
16082 -21414 -37159 -39308 -50473 -26825 4186 -730 -12615 -15765 -14580 -27536 -24048 -21642 -5537
16069 -5537 -2073 -16913 -35853 -37356 -26358 -4184 19406 18341 977 -2665 2486 -2699 12347
16056 12347 15672 -3395 -30362 -47986 -18469 -13923 -6233 440 7404 -6037 -29896 -23865 -17108
16043 -17108 -6532 24063 41994 35389 34635 4240 -8291 -22945 -45488 -39238 -19415 -6273
16031 -6273 -4336 -11762 -27564 -26515 -33172 -40896 -58612 -54569 -20150 -15661 -8924 -10899 -12530 6672
16017 6672 25705 16093 -23438 -55830 -53882 -55063 -26929 -19338 -15360 -27168 -34291 -41826 -31404
16004 -31404 2346 4468 981 -4026 -11388 -11966 -14689 6128 19233 34540 40708 56114 74124
15991 74124 72128 53570 44299 57703 84789 72632 49417 46817 53578 47782 33156 32783 5473
15978 5473 -6748 18815 8919 -14946 -48954 -60183 -44508 -15084 -10665 -29297 -15716 14523
15966 14523 4873 -16323 -15285 -23448 -31702 -34155 -54409 -44200 -18176 -5806 5864 18975 31526
15953 31526 17638 5619 20581 -1945 -29393 -22716 9679 20251 16387 -17049 -36800 -35734
15941 -35734 -17403 6938 9507 20147 24245 5374 -13179 -19837 -19942 -234 14681 -6372 -42449
15928 -42449 -44652 -51659 -50149 -54002 -50169 -42607 -58250 -74177 -73881 -55689 -35813 -8456 -1316
15915 -1316 -1004 -2513 -19627 -16102 -19525 -32999 -40357 -43281 -41666 -31422 -5799 26660 48397
15902 48397 57547 59837 4527 -33883 -40716 -8111 -23535 -51099 -37694 -20579 -22792 -20374 -1313
15889 -1313 -3133 -4383 -10769 -3616 1663 6152 11333 23897 9939 -10351 -33346 -57402 -63344
15876 -63344 -49475 -18545 -3016 -848 -28244 -56519 -47626 -24911 -24022 -17463 -13717 -2411 -16766
15863 -16766 -29617 -34178 -18828 -10363 -17481 -32653 -36405 -38150 -49956 -48422 -18783 4846 -750
15850 -750 -3215 11676 17341 14606 -2570 1173 -2539 -10588 -29887 -37933 -24637 -4961 2148 14753
15836 14753 17150 1541 20470 15171 -902 9246 28473 21240 -9402 -37132 -20289 -16575
15824 -16575 -24398 -21386 -18994 -37372 -53393 -49478 -30129 -18363 -2110 -1165 -11598 -12489 -7552
15811 -7552 10081 9708 14970 9758 -2962 14464 15441 -120 -28060 -16122 -256 -11099 -3694
15798 -3694 -14960 -30227 -22914 -35806 -48636 -31470 -28141 -39912 -14250 6018 15633 5951 -3
15785 -3 -6512 -1645 -7886 -22222 -10014 5622 13944 6423 -9927 -14278 -38791 -32147 -9175 -19503
15771 -19503 -4754 10685 -1056 -26958 -22103 1297 18375 17715 16536 11954 9744 8003 1001
15758 1001 5847 10201 19323 31450 8332 6049 7451 5979 -5147 -25935 -17109 -4022 -19327
15745 -19327 -18944 -20606 -5796 -8942 -15941 -18963 -6022 1515 -2925 -32715 -24167 -6827 17981
15732 17981 27484 11729 -9269 -8979 9743 17060 30078 17167 23507 26836 29131 28903 20766 3623
15718 3623 12812 14405 6880 5740 1647 2580 -2259 8366 14348 -5199 -18006 -1602 -11338 -1812
15704 -1812 4260 5493 -9236 -24377 -31388 -34093 -25329 -12118 4292 11032 -4289 -9149 8657
15691 8657 37492 46297 28971 37422 43068 28685 19664 17798 -2447 1470 2146 -913 -697 -17948
15677 -17948 -26502 -31472 -17602 -9168 -23379 -19138 -24685 -1859 4639 -21881 -47286 -65974 -43917
15664 -43917 -15253 -4864 -15802 -13115 -18306 -38551 -31823 1403 18204 14177 -2532 -15460
15652 -15460 -23960 -31189 -43568 -32455 -23187 -13300 29767 58942 45647 8155 -12378 -8262 -20058
15639 -20058 -39596 -33112 -20587 4718 6625 -25969 -32409 -15780 13131 33412 33335 15656 4356
15626 4356 -21354 -27647 -22760 -15720 -3555 -21602 -27705 4802 35678 18775 -9428 -28567 -21851
15613 -21851 -19926 -27922 -26543 -35312 -4475 14962 5269 21181 7516 -482 -2801 -3553 -5455 -4342
15599 -4342 -5699 16424 13434 7293 2910 -14686 -8185 12119 28879 44426 34036 20256 21023
15586 21023 29600 22172 18248 -11426 -1717 -12269 -28950 -38166 -40453 -31922 -16440 -8961 -16838
15573 -16838 -16096 -16459 -25459 -22763 -12625 -20538 -27289 3735 2600 -13467 -23716 -17625 -8092 -29178
15559 -29178 -36492 30 12883 2354 -13024 -13286 9226 14195 -14115 -44465 -51527 -19226 16349
15546 16349 23304 18574 -14286 -18348 -12522 -33379 -25640 9639 2596 1207 19589 28975 32789
15533 32789 19720 25377 37606 34076 43078 35577 1435 -31971 -22553 -9630 163 -2751 -18832
15520 -18832 -36144 -39089 -19223 -2444 -7375 2987 -9771 -3844 -8701 -17730 -10506 -19211 -37594
15507 -37594 -46660 -54381 -48867 -40760 -28879 -24649 -22992 -21249 2809 12119 10356 -1641 -19904
15494 -19904 -12371 -7456 -14503 -16246 -6444 -2937 14368 6573 -6609 3770 6603 8472 -14405
15481 -14405 -7800 -16434 -15849 -18101 -10185 16937 36607 27193 15431 15186 -3971 -9116 -26270 -20330
15467 -20330 -29313 -33869 -23408 -22945 -10991 -38224 -29734 -8816 8650 18727 15130 6061 20981
15454 20981 48301 50912 24054 -12841 -21128 16105 42954 17282 -11029 -13711 4333 40036
15442 40036 71577 67991 85690 132807 166292 178622 176147 150063 137555 126101 117878 91625
15430 91625 72025 60948 63271 58930 19546 871 8626 15743 13736 2126 -8756 8434 49491
15417 49491 82753 111232 79550 28916 41555 40794 8837 5744 20020 27150 9291 2814 -17181
15404 -17181 -44597 -37035 -3776 -13282 1243 15517 17835 31983 27207 35065 34032 26510 19235
15391 19235 9140 2840 -753 6721 -5558 -9939 -6952 22765 39223 14984 10697 2199 -23317
15378 -23317 -24863 6133 20158 19090 19107 30829 -6737 -33296 -2491 -10365 -29500 -7772 9046
15365 9046 -4269 -20380 -15016 -23783 -15629 2057 9594 -4306 -6968 -18475 -41859 -26482 -17740
15352 -17740 -13300 -18700 -13507 -17655 -18111 -14542 6751 4757 5863 10257 -22901 -36577 -21728 -6581
15338 -6581 -15032 -22164 -19647 2402 6672 2325 6444 11789 -2606 -21573 -31302 -24932 -12702 -25192
15324 -25192 -16101 -4158 -5807 -650 8818 -701 -26606 -21738 -13927 -6324 -11405 -9441 -13309 -4871
15310 -4871 1653 32182 31379 17510 11506 4480 -1285 1426 9160 12637 16819 -93 -18260 -22931
15296 -22931 -11229 -10740 14049 30291 30186 17684 28252 32931 21199 10111 -23003 -15581 -2569
15283 -2569 -15909 -7836 22875 19365 8886 6028 -7385 -15969 -21780 -16663 -32714 -49941 -15327
15270 -15327 62 13234 -14279 -31193 -18005 3974 -17600 -14270 -4962 -10317 -4367 4266 26347
15257 26347 18705 22206 21452 -2186 -25760 -24362 -25275 -13782 4530 24435 35311 59984 62134
15244 62134 32629 24207 17829 10879 8758 13844 20377 20094 28670 43265 38301 63718 54145 47563
15230 47563 32832 18783 2262 -14134 -26304 -25676 -466 6363 13023 15586 17169 6211 -8752
15217 -8752 -16476 14374 19183 6907 4748 17520 26475 30517 18438 -4306 9052 40032 60841
15204 60841 94230 113304 109855 96825 78294 51564 34436 30148 29152 36332 45550 49912 54717
15191 54717 82135 72506 79704 76743 72125 66498 78132 85722 55457 33349 35020 46530 53106
15178 53106 102784 129560 124369 144092 159156 153815 141433 130584 115200 85257 70314 59679
15166 59679 55406 47773 23117 5910 9888 34398 42481 43565 18976 21772 11301 22022 40105
15153 40105 54606 33507 28831 52614 43056 31009 24552 37323 41970 51890 43601 20401 14515
15140 14515 -10611 -4214 19376 53668 56262 82298 99219 99862 100749 97944 82469 94653 124238
15127 124238 133748 126615 124397 135433 126828 82696 51507 44664 67059 85623 58079 1565
15115 1565 -16100 16347 46502 28016 5709 11973 19764 29464 28125 29561 35233 44986 31219
15102 31219 30970 12199 -18425 -27445 -8521 -8539 23244 7839 -27845 -23869 -18460 -19983 -11055 -1711
15088 -1711 -1775 27261 52421 42225 29077 27871 34486 40400 26606 3873 9449 1834 18074
15075 18074 15281 1553 6807 4774 -21486 -12696 23893 41706 41449 46903 27568 20194 9197
15062 9197 11064 7889 11176 29126 21018 25848 17185 10888 28603 55164 59863 47842 33799
15049 33799 664 10650 36399 18645 2066 -5505 -9391 3745 18009 53551 52525 24322
15037 24322 26113 27093 28818 26885 30109 39453 53315 37062 10586 9124 12197 7409 1291 5102
15023 5102 17093 25060 3073 -91 -8719 -16106 21526 13972 17870 11253 14213 -3524 -28564
15010 -28564 -23847 -7163 14094 20397 31445 45920 33390 43965 46801 24893 4636 -7089
14998 -7089 257 15264 17440 16458 -590 2975 32350 13131 -18106 -27712 -33300 -46384 -35028
14985 -35028 -36396 -24224 -13564 -6242 -17963 -14065 18029 33704 22022 14805 38240 36240 33821
14972 33821 15198 -876 -5199 9031 28016 29197 11507 12556 26457 40641 40221 43932 37255
14959 37255 38995 56953 40379 38259 21159 -6640 8933 32445 39998 52909 47821 59348
14947 59348 75636 52942 74447 106970 122704 129162 99426 73593 89081 123631 167126 245904
14935 245904 354303 419905 448327 478579 530315 587898 603631 584969 511617 444185 360649
14924 360649 320813 318819 333618 402566 501442 666034 952224 1312597 1546677 1556589 1481643
14913 1481643 1458229 1527425 1648366 1689563 1513986 1267004 1061129 842184 617448 450658
14903 450658 326286 254209 205687 180604 151542 127443 141817 112999 92890 90578 64015
14892 64015 43382 14401 13416 5390 -1692 19299 39250 43299 42836 48727 36174 27649 36759 30729
14878 30729 33354 29834 29213 41093 43645 6792 21454 49980 79354 97983 102523 92239 96129
14865 96129 105498 115339 118671 134176 127112 111819 73064 42905 43374 50208 42041 40033 22251
14852 22251 16034 8737 -5546 7473 10640 1533 -12135 -15454 12129 15846 20407 33435 10593
14839 10593 -1161 17930 23345 28794 11869 10032 9619 22603 37309 30397 26285 14493 26425
14826 26425 45607 15828 -17455 -18078 -24387 -36084 -24342 6824 14659 23643 14483 20703 17954
14813 17954 38060 30715 33499 34955 22658 4362 -15071 -23265 31372 31300 6107 7450 3765
14800 3765 -412 12053 -5241 -31080 -13487 -3644 -13516 -25772 -14882 8348 11870 16527 11305
14787 11305 5443 9680 18444 16812 15372 11693 -8332 -7536 12256 14350 15582 10941 12953 16816
14773 16816 24897 26184 38766 37722 23950 -1305 -22 11229 18698 22830 19560 10949 17260
14760 17260 27766 37115 37838 23567 24769 3336 -9530 -13784 -10024 11459 18018 9099 -14882
14747 -14882 -6279 -10565 -6723 -6256 -17385 -8389 -1308 5593 36388 30185 29776 18713 -12209 6522
14733 6522 37623 30654 1126 6355 13119 15111 31067 33222 35252 34573 46694 44726 22326 31773
14719 31773 38101 22844 -3997 -3294 -6365 2148 18058 20855 19540 -33072 -53084 -31763 10346
14706 10346 29697 15627 -8870 -1992 6345 -2857 1006 7297 8703 -24027 -46313 -39035 2402
14693 2402 11236 6289 14392 28202 25576 24430 20309 19346 17515 19255 37859 46335 38597 1704
14679 1704 2516 17492 22569 7146 268 8601 12106 -5226 -4449 21088 23443 14653 25562 33220
14665 33220 -11341 -15747 -12636 -7036 6083 -3692 -1290 -14422 -41831 -36532 -21736 -14142 -10479
14652 -10479 -15189 -6886 5788 15853 27637 26302 31991 18649 20056 8849 15218 27039 9133
14639 9133 -8446 -12665 -48662 -62508 -11946 -248 34527 35508 13008 12316 14389 13696 -37
14626 -37 10042 15617 4144 -14336 -14610 -13782 -28443 -8747 -3629 1217 44374 67271 70289 58485
14612 58485 35868 42554 50122 56619 55504 72077 89619 91625 100330 111491 121020 143562 141079
14599 141079 141297 93548 77412 48945 39531 35866 40787 41388 40743 22308 9917 -4011 -1624
14586 -1624 -4768 11688 48121 44263 14280 16512 17611 35477 32786 45763 31855 12585 9841
14573 9841 11056 -7668 5425 15743 17986 4466 3998 -19968 -27262 -16597 -233 -11817 -13992
14560 -13992 -8833 -11745 -19709 -8252 -7437 -10698 8099 16573 19438 21092 31681 45968 39841 16044
14546 16044 4686 7768 12533 18433 2558 -1757 -2096 12147 -541 -16185 -7726 -21757 -44842
14533 -44842 -33320 -16969 -17997 -18720 -16883 -6412 7213 11493 1646 -5471 -20888 -42504 -61953
14520 -61953 -44836 -33516 -57152 -58194 -33233 -16693 2348 240 -25926 -26730 -21322 -13175 -2194
14507 -2194 18697 31535 29134 5295 -7577 -319 7174 4484 13689 3679 -6200 7529 -3870
14494 -3870 -7823 -12866 -35968 -6574 13257 15271 21523 -615 9580 10426 6000 -12507 -28538
14481 -28538 -55429 -71585 -42797 -14589 -21170 -22151 -27447 -18086 -20109 -30052 -31326 -24342 -36709
14468 -36709 -25560 -5402 11448 19970 -11222 -40160 -25496 -21243 -16287 -21267 -16514 6475 19355
14455 19355 24743 25535 6674 5444 11616 8883 15243 15766 11914 12642 -5506 4827 -1867 -39088
14441 -39088 -43924 -30558 -12340 -14858 -19275 11956 4845 -25770 -22687 -11397 23916 16047 -30915
14428 -30915 -44020 -26002 5525 272 -12411 -8662 3029 6263 11108 11121 26712 30597 30657 23617
14414 23617 1434 2739 13003 10775 7901 8282 22721 -1946 -8345 -5919 -14811 -22231 -27059 11178
14400 11178 30892 15090 20579 22762 18260 10410 7380 -23997 -24115 9023 4297 -722 -13294
14387 -13294 -12467 -23184 -31975 -8929 13477 17777 -271 -4557 -7084 -10724 -13752 -22491 -19364 -13676
14373 -13676 858 -4802 18113 33793 36034 58057 46227 6357 -4259 -1358 14828 -1492
14361 -1492 -3842 -9714 -19761 -23486 -34187 -17325 -2738 7328 10867 15280 8995 -6998 -11626
14348 -11626 -21963 -21949 -17789 -23488 -33393 -16742 13610 32717 24121 15985 19583 25886 36348 61957
14334 61957 63354 69947 54424 48519 55802 73096 71814 41294 21269 10067 1761 3196 11792
14321 11792 14359 10292 -368 -10845 20628 22613 5946 -5208 -3376 -1560 12475 26844 28598
14308 28598 36389 42182 53945 41874 54184 34955 18110 36683 52742 43219 44144 61708 56169
14295 56169 73274 65271 59595 51599 44611 63426 104417 146269 199766 250141 286649 342385
14283 342385 428341 574188 750675 998428 1254244 1440482 1535027 1593276 1657289 1714495
14273 1714495 1728543 1691151 1552483 1351195 1139519 951466 774240 647367 570682 499311
14263 499311 429802 358603 328988 319434 332692 322871 296736 266311 246721 256049 278448 273855
14251 273855 269766 295648 344397 396836 448400 515640 611068 740278 915216 1142777 1367299
14240 1367299 1537173 1624360 1658966 1686892 1712317 1684554 1594042 1442885 1246113 1045996
14230 1045996 835252 635959 457129 356004 302004 270704 209186 159225 127675 127401 95241
14219 95241 70864 66202 82219 68166 50747 62760 50757 23790 29880 47543 39508 16176
14207 16176 24912 30452 6511 6256 30624 54113 67440 91572 73420 66053 51508 39674 58856
14194 58856 66575 37070 29366 20479 8963 14931 1093 -5247 -972 20248 24658 3464 -1660
14181 -1660 1976 -13290 -27018 -35802 -928 -56 12283 16555 193 1904 32002 24322 4209
14168 4209 -23962 -19992 2459 8883 -21429 -39741 -29778 -25183 -24194 -12116 2730 7456 22370
14155 22370 17531 5052 660 15350 32536 48250 35001 22095 23673 2144 -2584 21556
14143 21556 32106 40149 49562 69534 94544 78896 50652 32590 39297 46788 55474 62871 67517
14130 67517 75719 98302 109818 100439 160356 253305 386243 563151 692916 705184 692279
14119 692279 733802 824541 812260 644528 492492 397524 314426 195913 124779 101143 79988
14108 79988 68914 55410 34984 14246 -23328 -24475 3374 4331 10314 35868 47734 31951
14096 31951 11937 -25624 -30931 -1319 18531 3826 5509 15762 12586 27607 23374 7569
14084 7569 -7596 -1054 9079 -11902 -19982 -34200 -45780 -21133 -2865 15729 13254 -6480
14072 -6480 -19101 -9347 -11890 -12795 -17268 754 18167 47060 50549 28690 19408 17578 -6524
14059 -6524 -21095 -17213 -17668 -16668 -1723 3461 18424 22266 24345 22753 25492 23282 10316 1945
14045 1945 15705 31240 33230 15092 27099 61973 59780 67900 82788 102493 105534 120452 144508
14032 144508 191332 252442 349254 529218 746396 870118 824648 785266 797219 900597 1008050
14021 1008050 949588 789753 622017 487667 367222 271504 195662 145028 141012 132499 90300
14010 90300 80437 78041 58494 39791 35721 27266 -2829 -8530 -12834 16631 17243 3478 -24026
13997 -24026 12031 19758 9705 3887 9578 -6697 13284 25210 45703 32770 25188 6251
13985 6251 9919 4348 -7532 14400 22317 8399 13557 33261 17509 4500 -1675 -1884 19550
13972 19550 2685 -27540 -50809 -48193 -7583 -7697 4762 -12383 -30952 -41303 -39276 -45137 -46833
13959 -46833 -45024 -37207 -22457 -3583 -3591 -1052 -9668 -60062 -53972 -33769 -8130 -6241 -8639 11644
13945 11644 17722 15464 2619 5082 1588 11354 -2495 -12176 266 -10503 -22539 -14764 -43595
13932 -43595 -54266 -61204 -61895 -56006 -36207 -6022 -3433 2387 8719 18788 -348 -18345 -32798
13919 -32798 -28953 -4130 25039 23737 13290 15344 13087 8893 8206 12467 8100 1767 492 12607
13905 12607 10606 3772 1190 -10523 4497 6987 -343 -1768 1507 -3679 10193 -1876 -20275
13892 -20275 -46264 -36086 -15719 -27193 -30980 -11778 -13640 -15204 -1824 21077 15692 -12386
13880 -12386 -30448 -53227 -46998 -16805 -325 32319 32778 15681 -26428 -40989 -41414 -19717 1714
13867 1714 15803 5677 1604 -11699 -25239 -52941 -53268 -31824 -16318 -30310 -46571 -51386 -30161
13854 -30161 -20829 -36540 -31259 -18501 -22198 -18513 -16780 -19826 -27557 -40426 -50485 -28628 12563
13841 12563 -2124 -23717 -7976 -18046 -16376 8285 13578 1955 37351 68687 40406 31436
13829 31436 38026 32230 6244 -12361 -19942 3312 -2906 -17953 -48138 -43782 -16978 -5184 -17126
13816 -17126 -16231 -16490 5392 12594 3093 1124 -13996 -21783 -9068 -2502 25702 42235 28424
13803 28424 6099 10611 10181 20844 12245 21057 17087 42121 53979 71655 67975 45649 40600
13790 40600 51153 52792 60273 61440 53303 49327 39922 30877 16086 8287 10349 7196 8384 28003
13776 28003 18478 9527 12939 3775 454 -9598 -13964 -12034 -3234 622 18080 41764 33837 1841
13762 1841 -9682 -2383 -5099 -15351 -37060 -37774 11519 41117 32966 30490 26389 44742 46150
13749 46150 31564 22698 16601 -229 -12653 -26561 -36754 -13607 17790 32355 27356 -11191
13737 -11191 -28179 -27858 -14514 546 10892 14755 19883 39025 38262 43863 38012 46356 26077
13724 26077 35610 41720 73376 110402 141088 210132 291506 402554 626422 822358 861092
13713 861092 773225 657905 557796 437906 298701 228280 172980 133599 118978 96032 108334
13702 108334 110290 85554 64286 57190 57390 60411 46634 47897 29379 8888 -2431 3708 15343
13689 15343 39151 37966 22373 37318 70034 80059 88908 104428 122175 156166 171703 206025
13677 206025 268775 313698 387505 527386 779069 1174254 1762764 2424390 2688575 2466696
13667 2466696 2118567 1742761 1329218 944360 672257 483802 361250 277121 229013 205615
13657 205615 179537 150122 134744 114108 80510 86657 106803 101035 103995 81033 64980 54951
13645 54951 42985 53719 44576 23777 17177 45124 84133 107767 116910 129609 159877 176915
13633 176915 220987 300413 397060 489353 598246 817165 1182924 1740083 2412672 2768840
13623 2768840 2565749 2176127 1793533 1365725 965716 691222 505138 394212 312374 252236
13613 252236 233608 215392 174293 143258 153129 153757 154232 137303 117397 104852 121237 139200
13601 139200 117106 54676 42367 51493 42343 48396 52130 65615 72363 61828 33259 31189 60075
13588 60075 84304 122862 127939 132399 163391 236141 367445 569572 779937 900590 843811
13577 843811 712936 589568 457950 313507 192569 131531 112951 101852 72536 57325
13567 57325 40254 37953 17296 23936 51488 50393 67228 76404 41629 25027 45235 47785 28646
13554 28646 34362 29404 16308 21237 19426 942 1922 10928 27864 13341 5826 -7126 -2840
13541 -2840 -15826 -15934 7890 27340 4492 4243 4471 4585 483 -5629 -6686 -11252 -19677 -20879 -34350
13526 -34350 -25149 -20802 -6561 -10564 -18075 -31524 -36935 -35312 -31232 -24519 -21597 -1229 17762
13513 17762 39084 51866 39969 22493 50618 69071 77242 117261 133319 119992 97443 99027
13501 99027 96199 62452 43885 52557 33587 41565 45195 57316 75295 116012 143939 171902
13489 171902 182493 203752 203531 200381 176551 140529 107555 65488 41447 22606 6187 14328
13477 14328 10835 29135 26247 28234 31291 23159 25331 19839 33827 33049 31700 957 1721 5539
13463 5539 -24682 -39548 -38132 -30505 -25156 6057 22047 -10411 -10019 18460 30462 38401 25452
13450 25452 30593 42075 33182 42607 22948 24461 32157 45071 65562 102955 114279 134290 183574
13437 183574 214184 188222 168546 163256 128552 99418 88008 66513 58347 53669 70643 82254
13425 82254 80951 95549 122562 149507 162392 159157 155873 147145 104262 71046 72334 55829 30988
13412 30988 39717 42251 44583 38485 44721 17160 3993 35392 50264 26145 23679 10614 18709
13399 18709 17494 10750 14824 24827 38550 45950 10985 5303 1709 3157 3184 -15940 -32921 -28777
13385 -28777 -15783 4526 19626 19498 24485 26234 29891 19765 30381 24622 5406 2877 16507
13372 16507 5462 25683 55984 39552 25712 20469 14172 11113 17745 501 15833 15184 -7854
13359 -7854 -6439 13760 27913 32212 41669 44507 2579 -20204 -6132 12583 10293 18900 22292
13346 22292 42672 40182 17488 31730 30835 9283 10770 8250 9782 -4630 2280 -9860 -12390
13333 -12390 -9249 10699 -379 1855 4526 13122 39631 47501 34701 13548 1099 -12389 -16158
13320 -16158 -8921 -11963 -23807 -11914 -30036 -30279 -21676 267 10551 30052 43638 23768 -21326
13307 -21326 -22609 287 -5807 -3763 9083 5748 2142 -8791 -23629 -18299 -8571 -8356 -6764 -28075
13293 -28075 -29957 -16973 20864 48125 61876 59144 47909 55560 25973 26813 32425 22171 12660
13280 12660 -1355 4035 977 -7445 4196 10875 -12261 -18997 -18439 4681 22149 27022 32278
13267 32278 13001 26744 24888 6289 18441 7435 -8829 -11527 3785 24674 31217 40979
13255 40979 38211 18427 8643 17660 -213 -20868 -21157 -13915 -22576 -15809 6122 22685 34995
13242 34995 28821 13877 26996 44081 28834 15189 9401 3693 -144 -8538 -9514 -6215 -1804
13229 -1804 18870 21917 -1796 -15210 -2106 697 -10280 8182 2175 -14105 -25162 -14075
13217 -14075 -2318 307 3154 -10554 2943 15608 26463 13554 -20525 -29436 -20746 -2716
13205 -2716 588 -16924 -16908 -6439 -7504 7425 22168 46960 65692 93834 130232 188781 278140
13192 278140 437344 623407 810410 910560 878120 763411 630735 511441 393534 289833
13182 289833 237457 172749 108430 84432 53317 23212 10330 26206 41543 52963 46070 35953
13170 35953 43699 56392 44654 55621 80563 81343 62415 52572 61775 78989 60091 81591 81788
13157 81788 88445 113525 153230 174457 198040 251746 318494 395714 521481 735314 1081370
13146 1081370 1633888 2262187 2724725 2776940 2492031 2081694 1637977 1217003 854646 598733
13136 598733 449432 356786 298632 238841 191687 155176 126591 89356 91855 82209 75668 72027
13124 72027 85681 103554 102004 92544 89155 77569 59585 45103 72127 98593 112164 117751
13112 117751 110218 131828 165846 208161 250860 301771 342595 426555 571889 765935 1078584
13101 1078584 1580054 2199850 2701841 2862392 2655931 2267474 1819994 1355882 940730
13092 940730 639746 430462 331490 271350 232437 207084 172247 132981 108356 66675 65836
13081 65836 77113 77444 69802 58125 81747 86753 90613 84025 71754 64559 51374 59286 88795
13068 88795 102722 89585 68014 58582 77752 89536 118153 134976 152956 196487 270211 370403
13056 370403 510764 729039 935170 1010982 957856 832494 687814 536855 371339 265547
13046 265547 218569 176093 156689 142938 107016 87370 63044 50652 64658 74763 71041 34001
13034 34001 14050 29582 34997 10695 -4385 6936 11422 15637 6738 1939 3663 15510 20360
13021 20360 17201 1047 -12130 -19977 -28885 -22817 865 22735 9423 8039 4128 9707 7546
13008 7546 -20791 -34635 -33403 -20424 -4465 25522 54930 37524 9534 20743 37007 39573
12996 39573 44411 41747 34153 27803 15056 2907 -6169 5427 -4778 -30614 -17757 6877 13954
12983 13954 47396 44989 28460 31038 34578 26325 22823 28080 19285 -5236 -24555 -11933 21213
12970 21213 36236 37147 25307 -1413 472 26965 47648 65923 50543 12727 -9421 2088
12958 2088 -18034 -36873 -24267 -4256 13493 12506 15204 19318 12997 6256 -5935 -5464 6125
12945 6125 959 17831 7191 4053 -3005 867 1378 -9489 -26983 -26463 -37815 -52881 -34216
12932 -34216 -25808 -32385 -43571 -32395 -20170 -349 20847 35040 55796 29121 -1416 4199
12920 4199 12231 11285 -7012 -31419 -30865 -24656 -24935 -30817 -17353 -4981 -2613 -6186 -1288 -1488 34053
12905 34053 16770 -2866 12537 29829 9870 -20181 -26648 -6882 -7632 -31886 -38525 -12911
12893 -12911 21996 25410 -2976 10089 16837 14283 23399 1552 -8820 -7792 4525 19733 30274
12880 30274 24651 37242 18470 8995 25719 53249 45311 24882 52630 67411 50937 45948
12868 45948 38461 3252 -3344 -16672 -17318 8886 14732 -9376 1991 -5807 5471 46237 58352
12855 58352 37934 41063 19422 31994 42236 24595 34145 46111 19112 6899 -4421 7321
12843 7321 2041 7484 4135 -5720 -15347 -125 4337 -14204 -6242 -1519 -18326 -19697 -14858 -18066
12829 -18066 -3018 337 318 -20315 -15588 -22156 -33212 -27536 -18237 -14824 -12534 26140 43794 15334
12815 15334 5909 -5078 -20883 -30585 -35912 -31301 -35019 -28541 -30688 -20438 -23977 -54064 -59030
12802 -59030 -21848 17881 28709 9963 -1132 4287 10839 -1838 -3235 19107 1455 575 28683
12789 28683 50539 42265 44785 28275 13760 30261 27120 12092 12679 22013 2924 -16759 3207
12776 3207 8496 7661 32738 34705 13709 -3050 4325 10607 -3586 -1571 -238 2062 14816 19217
12762 19217 4242 -23521 -5019 -599 13176 11381 5077 2256 7181 -1096 -8117 -1979 -12798
12749 -12798 -9151 20676 20607 5813 -19560 -32272 -33963 -32008 -19752 -39485 -25292 -32207 -46145
12736 -46145 -61088 -61867 -33249 -15295 -11235 -21003 -21558 4412 -919 -6603 -3860 -12667 -11238 -8804
12722 -8804 12265 28592 61970 65994 55253 53624 33427 9889 5469 4278 -6600 -18005 -42136
12709 -42136 -28855 9525 27316 2928 -19107 -14384 -30096 -60743 -64714 -73114 -54859 -32573
12697 -32573 -44237 -5195 -5501 -20422 -42603 -42264 -32633 -42030 -48116 -19216 -8023 -15643 4877
12684 4877 25772 27469 43323 44418 38186 39408 24867 21906 21822 16432 17598 14075 5379 -6278
12670 -6278 -19934 -22331 -14554 5056 16098 8648 4312 19275 16870 -4302 -23251 -18722 -7539
12657 -7539 -4387 20097 -5801 -20747 -27361 -43473 -8697 9725 25473 12011 -10120 5589
12645 5589 31570 61858 39236 -7568 -816 17483 20798 14350 -9195 -22120 -15647 -31805 -29803
12632 -29803 -20893 -14934 -7131 2115 19421 43255 45120 24275 21935 34732 22489 33372 25931
12619 25931 -1048 10439 39364 28668 1153 11584 10565 7529 25648 28102 46462 99551
12607 99551 126311 113692 134380 148068 191767 200235 181813 137632 108248 104789 99316 105601
12595 105601 79948 56240 46776 33549 37295 19785 4582 13764 8987 2613 2610 12408 20739 26082
12581 26082 20516 18784 23899 43383 61893 71432 73242 63198 53846 36530 15529 10090 7746
12568 7746 12159 -4167 -9199 7438 6086 -2492 1614 248 -6587 -3254 -5391 2315 6867 20288
12554 20288 10972 -13028 -28256 -8337 12311 -10010 -17618 10548 16408 15009 9186 37855 59347
12541 59347 65347 81114 90693 91171 104118 153479 192677 211696 198578 190219 160569 117622 84948
12528 84948 69019 33803 23313 11814 11072 32452 43449 68877 84391 79714 64538 62663
12516 62663 29667 -3128 8658 -559 -16991 8616 21649 23542 47157 45578 54331 61774 88413
12503 88413 95001 114108 145671 167020 171904 181098 193378 183948 157269 151503 114935 103529 91403
12490 91403 58025 51927 46806 46850 67557 74186 65052 93533 135799 160569 168924 158834 160972
12477 160972 141738 110217 80128 54094 58754 82439 90909 91659 82614 49175 24888 29902 38053
12464 38053 -713 -20917 -15145 13700 15516 6396 1527 27745 47640 42977 4021 -12448 14875
12451 14875 9169 5312 19280 42670 36486 24014 43222 60208 73589 94127 128174 177994
12439 177994 254416 385556 542601 614351 588118 520247 456117 427406 400473 354478 312432
12428 312432 255023 212433 193150 160412 156732 150639 112853 77369 68818 50673 31893 22659
12416 22659 48679 61819 47371 51907 73347 103483 123490 127682 168825 198375 157274 113811
12404 113811 105892 98685 93383 77604 77766 77014 109292 145365 185786 231480 331242 476709 598996
12391 598996 591229 508148 424036 343167 257261 166072 123392 115722 107339 98055 70732 46805
12379 46805 28239 51213 52274 21878 23091 33305 22997 14119 36384 60307 62570 58853 64796
12366 64796 69470 63829 71596 112152 141858 138440 138481 119990 80258 42978 32584 19052 34020
12353 34020 35703 64352 87875 115084 155001 182053 193100 181009 149096 131867 95776 70716
12341 70716 58457 58268 54895 23516 32565 15719 -4471 13851 11177 -13048 -41047 -29023 -1628
12328 -1628 -7712 -2748 5906 35324 36422 36126 38739 26789 23507 10718 -1893 -1320 -1231 4549 27956
12313 27956 49384 39357 27553 43889 40428 19392 -14724 -12380 5937 2673 -16523 8902
12301 8902 40271 30393 -22926 -40762 -37418 -36245 -35276 -45363 -55499 -31114 -8516 -9399 26323
12288 26323 24491 -10520 -35104 -36611 1788 48347 47139 20598 2564 -34962 -40704 -5749
12276 -5749 -6667 -6209 13225 9864 5989 20618 38401 19303 31114 46656 45307 17982 8180
12263 8180 -3553 -23559 -23431 -18185 -15932 -15577 -25485 -44639 -53327 -48645 -34921 -10613 7707 12481
12249 12481 -9237 -26773 -13566 26732 39989 43684 21255 -15970 -30568 -10573 12022 3506
12237 3506 2616 9924 3127 12179 2206 -6526 -3407 -3786 -11722 6177 11738 -23632 -34323 2898
12223 2898 -3355 -23067 -37499 -58562 -20010 12376 19668 16736 25315 19576 6527 -3913 -1282
12210 -1282 13731 35418 21718 15711 9347 35585 40416 44856 39479 28068 34839 31854 8224
12197 8224 16450 1146 -10437 -13900 23884 28148 -4197 -3625 -10667 -20219 -4990 16267 9594
12184 9594 -5250 7472 -4397 -9843 -10635 -7451 -13606 -23433 -23036 -19688 -12840 4053 9715 -1828
12170 -1828 -5284 6740 10226 31117 28043 40613 29628 -6082 -12315 -18093 -18445 -4005 -12422
12157 -12422 -24549 -21814 -1755 7981 -5315 5530 23247 25242 14151 33468 12883 8507
12145 8507 16753 29596 37675 39838 68402 73862 77405 79357 74187 65364 65364 26893 3747 14067
12131 14067 17873 -23703 -33111 -7539 307 15105 14160 6824 -10078 9714 25424 6477 -10940
12118 -10940 3562 6476 -10078 -19905 8478 51733 42667 57743 68051 32710 27853 26010 41435
12105 41435 39652 31336 39928 25292 25770 15515 32803 22830 8545 31567 25217 -1623 -9300
12092 -9300 -12441 -32158 -35414 -32025 -18019 12792 36391 18720 30528 32324 49223 43887 10968
12079 10968 2934 3960 7798 38128 60978 59603 31543 12129 -2372 11824 36076 33872 20773
12066 20773 22397 48556 49046 48071 44198 34287 44037 39319 50156 47273 77121 116332 132160 145603
12052 145603 156805 172539 165669 176237 167524 166875 154585 140280 124479 88010 73517 71270
12040 71270 56414 28948 18087 27407 60828 80390 92998 99619 89197 53038 32396 34652
12028 34652 18956 14302 -11367 -25896 -14999 -9362 -26044 -20654 -16270 1548 4355 13781 10217
12015 10217 -8319 -25656 -10705 -5601 -1851 5241 1035 -5012 -22478 -29163 -35645 -34835 -19266
12002 -19266 -36559 -56452 -38216 -32075 -51068 -21393 -31490 -44812 -23677 1305 -4290 -6746
11990 -6746 16713 31631 10202 -6364 -2918 2321 -39035 -39116 -9023 9643 -4702 2209 9670
11977 9670 -1501 -5417 15824 15759 -7018 -17340 -13547 -29675 -31775 -10217 9292 26365 28491
11964 28491 27927 13475 9739 11226 12722 9504 -47 15033 39297 28002 26060 4903 -21225
11951 -21225 -21549 -6249 -15526 -30593 -30715 -6383 18088 19753 10384 22324 19811 27775 17894 27324
11937 27324 718 -9558 -24188 -29836 -51171 -31123 -20235 -25047 -27609 -22402 -20250 -34442 -27754
11924 -27754 -20811 -23893 -28354 -26417 -2622 17829 17314 11837 -16279 -10345 5797 28682 27661
11911 27661 44786 34913 14615 14299 18002 18444 18641 -9981 -20185 -10074 -6327 -7035 -13899 10788
11897 10788 18349 22880 51145 5928 -18326 -11072 8895 6018 530 2446 4122 11631 13146
11884 13146 9452 1460 -7054 -15050 -18441 -13784 4031 8101 4947 7373 7883 -2657 -4631 -8913
11870 -8913 -19146 -10067 -4144 19252 13977 -17642 -20418 -8820 -19610 -4765 -22073 -7082 1085
11857 1085 -13161 -19069 -11286 -4946 -26850 -39295 -30391 -19933 -17479 -12858 -15591 -7087 9809
11844 9809 22646 15457 13219 7736 29720 42428 41834 59124 38806 35276 24996 12508 10826
11831 10826 20564 39829 39455 29149 31393 328 -7197 7339 -3386 -10139 1131 1038 -6788 -9680
11817 -9680 19840 27502 27822 23894 12115 17978 51580 51867 27008 21936 17689 7730 5907 11690
11803 11690 -294 -32599 -31537 -19567 -16052 -4827 1631 17523 27724 16080 8278 16283 17367
11790 17367 20318 8389 11946 19617 38406 34399 24703 28625 29243 947 -6027 -31048 -26083 -6401
11776 -6401 9099 5799 1251 6692 14588 18008 11902 44355 36636 12275 5017 14735 24148 33552
11762 33552 -827 -23214 -25293 -30437 -29117 -40477 -22584 -825 40334 26481 18308 10748 13149
11749 13149 11708 8414 -6472 -16009 -30560 -27412 -16516 -28670 -36274 -15673 1875 -14444 3239
11736 3239 15622 25077 35169 26479 17462 17839 30693 29393 4952 15435 38410 17625 -390
11723 -390 -1363 16075 25612 7927 11829 20229 14166 -9112 -38635 -29137 -11037 4940 9258 21690
11709 21690 27239 20465 13075 -16603 -10078 17258 10707 -2586 -1911 -14351 -24872 -44829 -54658
11696 -54658 -49549 -53456 -33643 -16864 -7260 -1593 -17191 -20728 -14761 -3956 -11759 -3456 19270
11683 19270 15231 -1868 -10666 -18126 -5551 -17876 -32087 -25027 -24446 -7883 30500 37058 46514
11670 46514 47665 39200 36422 40198 41785 44382 22736 -181 -11188 -6859 1662 8273 19691
11657 19691 22709 19612 -131 -7584 -29735 -30593 -11726 4282 40343 30200 18750 6223 -400
11644 -400 -29572 -27961 -1611 11779 1217 -22404 -36974 -7884 -3388 -23672 -7545 -15720 -23042
11631 -23042 -12270 2848 9494 27682 17460 110 5357 11309 6724 -2191 4678 -2926 -4799
$$ [...]
##END NTUPLES=NMR SPECTRUM
##END=
