##TITLE=Analysis number 319935
Compound Code sb 00532
Project Code adrs
Chemist Name stores
##JCAMPDX= 6.0         $$ Bruker NMR JCAMP-DX V2.0
##DATA TYPE= NMR SPECTRUM
##DATA CLASS= NTUPLES
##ORIGIN= Bruker BioSpin GmbH
##OWNER= nmr
$$ XWIN-NMR		Version 3.5
$$ Fri Jun  2 12:56:31 2006 GMT Daylight Time (UT+1h)  MAYBRIDGE\nmr@NMR_250MHZ
##.OBSERVE FREQUENCY= 250.131544655141
##.OBSERVE NUCLEUS= ^1H
##.ACQUISITION MODE= SIMULTANEOUS (DQD)
##.ACQUISITION SCHEME= undefined
##.AVERAGES= 16
##.DIGITISER RES= 18
##SPECTROMETER/DATA SYSTEM= dpx250
##.PULSE SEQUENCE= zg30
##.SOLVENT NAME= DMSO
##.SHIFT REFERENCE= (INTERNAL, DMSO, 0, 16.522)
##AUDIT TRAIL= $$ (NUMBER, WHEN, WHO, WHERE, WHAT)
$$ ##TITLE= Audit trail, XWIN-NMR		Version 3.5
$$ ##JCAMPDX= 5.01
$$ ##ORIGIN= Bruker BioSpin GmbH
$$ ##OWNER= nmr
$$ C:\u/data/dgb/nmr/ADRS/250/pdata/1/auditp.txt
$$ ##AUDIT TRAIL=  $$ (NUMBER, WHEN, WHO, WHERE, WHAT)
(   1,<2006-06-02 12:55:49.97 +100>,<MAYBRIDGE\nmr>,<NMR_250MHZ>,
      <created by zg, POWCHK disabled, PULCHK disabled
       configuration hash MD5:
       E2 DF 36 D8 04 B2 41 60 5A D7 A3 38 5A 4B D0 FE
       data hash MD5: 64K
       0D 4C 47 A9 D5 95 B8 FD 1B C5 C3 F7 34 A1 F5 3F>)
(   2,<2006-06-02 12:56:08.10 +100>,<MAYBRIDGE\nmr>,<NMR_250MHZ>,
      <Start of raw data processing
       ef LB = 0.3 FT_mod = 6 PKNL = 1 SI = 32K 
       data hash MD5: 32K
       B4 FB A4 F5 C1 5E B6 BC 04 9D 54 EA 44 0B 3B D0>)
(   3,<2006-06-02 12:56:15.52 +100>,<MAYBRIDGE\nmr>,<NMR_250MHZ>,
      <apk 
       data hash MD5: 32K
       F0 C9 78 1D 8E 32 0A 28 70 18 C9 2B E0 F1 C3 59>)
(   4,<2006-06-02 12:56:17.13 +100>,<MAYBRIDGE\nmr>,<NMR_250MHZ>,
      <abs ABSG = 5 
       data hash MD5: 32K
       31 A0 44 6F 00 34 2C F5 D1 6B 00 1D 19 2E 5D 42>)
$$ ##END=
$$ 
$$ hash MD5
$$ 28 DE 8E 35 9F 0C 6C 9F CF 9A C5 6D EC 7C DD 52
##$RELAX= 
##$RELAX= 
##$RELAX= 
##$RELAX= 
##$RELAX= 
##$RELAX= 
##$RELAX= 
$$ Bruker specific parameters
$$ --------------------------
##$DU= <C:\u>
##$EXPNO= 250
##$NAME= <ADRS>
##$PROCNO= 1
##$TYPE= <nmr>
##$USER= <dgb>
##$AMP= (0..31)
100 100 100 100 100 100 100 100 100 100 100 100 100 100 100 100 100 100 
100 100 100 100 100 100 100 100 100 100 100 100 100 100 
##$AQSEQ= 0
##$AQ_mod= 3
##$AUNM= <au_zg>
##$AUTOPOS= <30 >
##$BF1= 250.13
##$BF2= 250.13
##$BF3= 250.13
##$BF4= 250.13
##$BF5= 500.13
##$BF6= 500.13
##$BF7= 500.13
##$BF8= 500.13
##$BYTORDA= 1
##$CFDGTYP= 0
##$CFRGTYP= 5
##$CHEMSTR= <none>
##$CNST= (0..31)
1 1 145 1 1 1 1 1 1 1 1 1 1 1 1 1 1 1 1 1 1 1 1 1 1 1 1 1 1 1 1 1 
##$CPDPRG= <>
##$CPDPRG1= <>
##$CPDPRG2= <>
##$CPDPRG3= <>
##$CPDPRG4= <mlev>
##$CPDPRG5= <mlev>
##$CPDPRG6= <mlev>
##$CPDPRG7= <mlev>
##$CPDPRG8= <mlev>
##$CPDPRGB= <>
##$CPDPRGT= <>
##$D= (0..31)
0 1 0 0 0 0 0 0 0 0.06 0 0 0 0 0 0 0.0002 0 0 0 0 0 0 0 0 0 0 0 0 0 0 
0 
##$DATE= 1149249348
##$DBL= (0..7)
120 120 120 120 120 120 120 120 
##$DBP= (0..7)
150 150 150 150 150 150 150 150 
##$DBP07= 0
##$DBPNAM0= <>
##$DBPNAM1= <>
##$DBPNAM2= <>
##$DBPNAM3= <>
$$ [...]
##$SUBNAM7= <"">
##$SUBNAM8= <"">
##$SUBNAM9= <"">
##$SW= 20.6930455092707
##$SWIBOX= (0..15)
0 0 3 0 0 0 0 0 0 0 0 0 0 0 0 0 
##$SW_h= 5175.983436853
##$TD= 65536
##$TD0= 1
##$TE= 295.16
##$TE2= 300
##$TE3= 300
##$TEG= 300
##$TL= (0..7)
0 120 120 120 120 120 120 120 
##$TP= (0..7)
150 150 150 150 150 150 150 150 
##$TP07= 0
##$TPNAME0= <>
##$TPNAME1= <>
##$TPNAME2= <>
##$TPNAME3= <>
##$TPNAME4= <>
##$TPNAME5= <>
##$TPNAME6= <>
##$TPNAME7= <>
##$TPOAL= (0..7)
0.5 0.5 0.5 0.5 0.5 0.5 0.5 0.5 
##$TPOFFS= (0..7)
0 0 0 0 0 0 0 0 
##$TUNHIN= 0
##$TUNHOUT= 0
##$TUNXOUT= 0
##$USERA1= <user>
##$USERA2= <user>
##$USERA3= <user>
##$USERA4= <user>
##$USERA5= <user>
##$V9= 5
##$VALIST= <valist>
##$VCLIST= <CCCCCCCCCCCCCCC>
##$VD= 0
##$VDLIST= <DDDDDDDDDDDDDDD>
##$VPLIST= <PPPPPPPPPPPPPPP>
##$VTLIST= <TTTTTTTTTTTTTTT>
##$WBST= 1024
##$WBSW= 4
##$XGAIN= (0..3)
0 0 0 0 
##$XL= 0
##$YL= 0
##$YMAX_a= 378262
##$YMIN_a= -351669
##$ZGOPTNS= <>
##$ZL1= 120
##$ZL2= 120
##$ZL3= 120
##$ZL4= 120
##$ABSF1= 16.522
##$ABSF2= -4.171173
##$ABSG= 5
##$ABSL= 3
##$ALPHA= 0
##$AQORDER= 0
##$ASSFAC= 0
##$ASSFACI= 0
##$ASSFACX= 0
##$ASSWID= 0
##$AUNMP= <proc_1d>
##$AZFE= 0.1
##$AZFW= 0.1
##$BCFW= 0
##$BC_mod= 0
##$BYTORDP= 0
##$COROFFS= 0
##$CY= 12.5
##$DATMOD= 1
##$DC= 0
##$DFILT= <>
##$DTYPP= 0
##$F1P= 14.0000005364418
##$F2P= -0.99999901652339
##$FCOR= 0.5
##$FTSIZE= 32768
##$FT_mod= 6
##$GAMMA= 0
##$GB= 0
##$INTBC= 1
##$INTSCL= 1
##$ISEN= 128
##$LB= 0.3
##$LEV0= 0
##$LPBIN= 0
##$MAXI= 10000
##$MC2= 0
##$MEAN= 0
##$ME_mod= 0
##$MI= 0
##$NCOEF= 0
##$NC_proc= -5
##$NLEV= 6
##$NOISF1= 0
##$NOISF2= 0
##$NSP= 0
##$NTH_PI= 0
##$NZP= 0
##$OFFSET= 16.522
##$PC= 1
##$PHC0= 132.9433
##$PHC1= 81.76203
##$PH_mod= 1
##$PKNL= yes
##$PPARMOD= 0
##$PSCAL= 4
##$PSIGN= 0
##$REVERSE= no
##$SF= 250.13
##$SI= 32768
##$SIGF1= 0
##$SIGF2= 0
##$SINO= 400
##$SIOLD= 32768
##$SREGLST= <1H.DMSO>
##$SSB= 0
##$STSI= 32768
##$STSR= 0
##$SW_p= 5175.98343685301
##$SYMM= 0
##$S_DEV= 0
##$TDeff= 65536
##$TDoff= 0
##$TI= <Analysis number 999999
Compound Code 99
Book Reference 9
Project Code 9>
##$TILT= no
##$TM1= 0
##$TM2= 0
##$TOPLEV= 0
##$USERP1= <user>
##$USERP2= <user>
##$USERP3= <user>
##$USERP4= <user>
##$USERP5= <user>
##$WDW= 1
##$XDIM= 32768
##$YMAX_p= 559267377
##$YMIN_p= -22620652
$$ End of Bruker specific parameters
$$ ---------------------------------
##NTUPLES= NMR SPECTRUM
##VAR_NAME=  FREQUENCY,     SPECTRUM/REAL,   SPECTRUM/IMAG
##SYMBOL=    X,             R,               I
##VAR_TYPE=  INDEPENDENT,   DEPENDENT,       DEPENDENT
##VAR_FORM=  AFFN,          ASDF,            ASDF
##VAR_DIM=   32768,         32768,           32768
##UNITS=     HZ,            ARBITRARY UNITS, ARBITRARY UNITS
##FACTOR=    0.157963299565203, 1,           1
##FIRST=     4132.6476996994, 0,             0
##LAST=      -1043.33573715361, 0,           0
##MIN=       -1043.33573715361, -22620652,   0
##MAX=       4132.6476996994, 559267377,     0
$$ Real data points
##PAGE= N=1
##DATA TABLE= (X++(R..R)), XYDATA
$$ [...]
24204c36284q889J36874J85256M0000Q5022R5311M4605j72167j48214O3468k12977
24193b27995j18602M2561J28037N7579j4185J19926L3470j17989j21042j4612
24183b32852n5614j50008J61858K59358P9437M2389l4899K58864K3552j59336
24173A92749n868O1009L7518o8022l6780p0997K1612p5966J76284o5142k56518
24162i0121j45820o3781J44463L4188j8356L3423o1563J25153J0824p335M7659
24151H734j31904q1783r5549P6950m1387n4838K16148J87252k8760j48392k85145
24140c78674j26973K32272J49554Q0234q280K1605Q4573N5282k5928l0143m4777
24129H745j59274q0541P4610K40669Q8838k09584J8397J3505j11691J27201N0526
$$ y = [-336284, -345173, -208299, -23043, 16957, 101979, 197290, 241895, 69728, -78486, -15018, -227995, -346597, -304036, -175999, -118420, -132605, -12679, 20791, -97198, -218240, -232852, -288466, -438474, -276616, -17258, 62179, 104568, 69669, 328533, 352085, 192749, 186881, 247890, 285408, 217386, 180606, 109609, 131221, 55255, 231539, 166397, -90121, -235941, -299722, -155259, -121071, -139427, -106004, -167567, -42414, -31590, -38925, 8734, -123170, -204953, -300502, -223552, -264939, -319777, -103629, 83623, 54863, -93529, -378674, -505647, -273375, -123821, -43587, -51867, -30262, 54311, 109593, 83665, 53522, 8745, -150529, -231070, -156460, 84209, 173047, -36537, -18140, -4635, -116326, 10875, 61401]
24118F1401n6471m9482j10855k25327l0938J64809J75533J19876J12343j00262
24108F0627j57285Q6199N6058r1031k12687J5199J33241Q6998M7681K28539O8530
24097C22069j16658j02053o5296q9436j75028L3894m5626J56018L19933p8253
24087A59564k52922j6923N4662m2028P916N6087J28396O695J27085j3618o6537
24076A48377k7009j3379q2327M8485J7621q7680Q1561j15833J80456N7814m9855
24065A58231j30029n9809O2662j61115l4842J92534q1397J66007L6134j72551
24055b4175l5781J0139L2984p0455l8458j06760q826J17153K26071r7310j2566
24044g984O2256J65072P9556j34578m1599k5238r9586j45556R3734J38336O1355
$$ y = [61401, 4930, -44552, -155407, -380734, -411672, -246863, -71330, 48546, 160889, 60627, -96658, -10459, 45599, -45432, -258119, -242920, -109679, -22681, 25000, 253539, 322069, 205411, 103358, 38062, -51374, -226402, -192508, -238134, -82116, 237817, 159564, -93358, -110281, -55619, -97647, -89731, -33644, 94752, 101447, 228532, 214914, 148377, 121368, 107989, 25662, 74147, 91768, 4088, 85649, -30184, 150272, 208086, 158231, 28202, -31607, 31055, -130060, -164902, 27632, -53765, 112242, 148376, -24175, -59956, -49817, -16833, -87288, -125746, -232506, -241332, -124179, 101892, 4582, -7984, 54272, 219344, 298900, 164322, 122723, 97485, -2101, -147657, -53923, 84413, 145768]
24033A45768l3536o921q2230j34585k00364J57909M2053K40858L98199K77972
24023H05123k43582m73287j06015P8147J18733k1082j92715l5680J33408J54811
24013B17861J25263k92300j38038j4306n1423J83965j94179P5020L47347k3814
24003B35396j04082k33963j21544j864J56374K01399K01806J50773n6921k0684
23993D06690j49359r6877N5110p2460j04493N6996M2258j5364n2034M3942k7014
23982H7395j03071K05386O2399j13211J30302J71509k0409k27567M5753o1030
23972A77456l0063M3733k61770L6624J41515J92983j03413j32082J10884J24133
23962C00000k618j16378q3473K07565R7522j82626r8747m5698k62886j96364K60138
$$ y = [145768, 112232, 105311, 23081, -111504, -311868, -153959, -111906, 128952, 527151, 805123, 561541, 88254, -17761, 60386, 179119, 158037, -34678, -70358, 63050, 217861, 343124, 50824, -87214, -101520, -152943, 31022, -163157, -88137, 259210, 235396, 131314, -102649, -224193, -226057, -69683, 131716, 333522, 484295, 427374, 406690, 257331, 160454, 215564, 143104, 38611, 95607, 137865, 122501, 70467, 114409, 87395, -15676, 189710, 252109, 138898, 269200, 440709, 420300, 192733, 238486, 177456, 147393, 191126, -70644, -34020, 107495, 300478, 197065, 64983, 175867, 300000, 297382, 181004, 97531, 305096, 402618, 219992, 121245, 75547, -187339, -383703, -123565]
23951a23565J32647m30j24175l3858P932O3399J3787m1775K0523P8682j33101
23940a39934J12145R1997p2151R4883J04989k05922l2950J22196q1650K1477N7190
23929G2270l5989j07976p4715Q1170J88917q2965K14865J32191q8407k3189j46129
23918A30043n9991j63615Q0899M2490J3070P1827J3019n3283O0156O6161N5094
23907B55870p7541m6743j7159o4626k06816O1301R6525K43607J39900n6037K0026
23896C48307J45710N0172j6172j61694p4398j63311j24715j08530j31795k6326
23886b62752R3918j04112p0529j79225J01644J66393Q2658O7760k23665J16308
23876b11602J10350J28457k04967k58639k90J97170J79231l9077l2316K26113
$$ y = [-123565, 9082, 8652, -115523, -149381, -141449, -78050, -64263, -106038, -85515, -6833, -139934, -27789, 64208, -7943, 86940, 191929, -13993, -46943, 75253, -6397, 15080, 72270, 36281, -71695, -146410, -65240, 123677, 40712, 255577, 387768, 299361, 276172, 130043, 70052, -93563, -12664, 29826, 42896, 114723, 127742, 74459, 134615, 200776, 255870, 178329, 131586, 114427, 49801, -157015, -95714, 811, 244418, 384318, 328281, 348307, 494017, 544189, 528017, 366323, 291925, 128614, 3899, -104631, -236426, -262752, -168834, -272946, -343475, -522700, -421056, -254663, -172005, -104245, -327910, -211602, -101252, 27205, -177762, -436401, -436691, -239521, -60290, -99367, -131683, 94430]
23866I4430L2900R7496p6356p3034j01206J9556J75535j35811k78618Q6519O5341
23855i3248M3689j41711K6303k2276l177J72166P9751J829r426k280R0587m9103
23843I3104j42347Q930N9525r6691o6775n047m9104O0048l8703j08546P9256j49855
23831c56205J48652K72238m6580n6479R7430k0208k55356j60836Q7329K52362
23821c7653R0133L8311J93640R9707n8213q8954O4865j01313j56739K13535J78620
23810D35939q4002J54581p8566k75017j87958k4219J06377L700L2941K5378q6988
23799B2166N0162P444j30478o3552j3577p6001k47377j16965J2032J24258k6621
23788d58509M7044N2715j27068P0951K24702J81617J85449N0104k09415P6681
$$ y = [94430, 127330, 224826, 148470, 75436, -25770, -6214, 169321, 33510, -245108, -158589, -93248, -49559, -191270, -164967, -187243, -190420, -18254, 61497, 63326, 53900, 51620, 142207, 93104, -49243, -40313, 19212, -77479, -144254, -149301, -198405, -138357, -177060, -285606, -206350, -356205, -207553, 64685, 18105, -38374, 59056, 38848, -216508, -377344, -290015, -37653, 52480, 90791, 284431, 384138, 325925, 236971, 301836, 200523, 43784, 257319, 435939, 351937, 506518, 427952, 152935, -35023, -59242, 47135, 50835, 83776, 109154, 22166, 72328, 79772, -50706, -114258, -127835, -203836, -451213, -568178, -556146, -431888, -458509, -411465, -358750, -485818, -414867, -190165, -8548, 176901, 227005, 17590, 94271]
23778I4271j89641p8217J64115J43009K57640J60502q401j31514j48133J07202
23768C70833q4668n6122Q0867J25185Q5767k6404j63565j93576j66988j48233
23758a76904M2671J08913j13139M6366J78604j57090k15944r1850j59779J70040
23748c68112J32204K0789J12466N963M4696L15997j01476J13395l573k73228o0484
23737f1363J1612p9797K17977J12927r4376j36316J54094J6656n5282j93434O5968
23726d1334K9501j5193j82078R3875J65231m9699n0755o3559J9181J85714J64442
23715B55326j76166m3787J5305N2584q5452j01339K0072j19336j13456J8845l4987
23704c12391N9960J12126m2513M9031J08988l8812M0537J74973J75520j61454
$$ y = [94271, -95370, -173587, -9472, 133537, 391177, 551679, 543278, 411764, 263631, 370833, 286165, 230043, 310910, 436095, 521862, 495458, 331893, 138317, -28671, -176904, -134233, -25320, -138459, -92093, 86511, -70579, -286523, -378373, -538152, -368112, -235908, -215119, -102653, -96690, -51994, 264003, 162527, 275922, 272349, -879, -61363, -49751, -129548, 88429, 201356, 106980, -29336, 124758, 141414, 86132, -107302, -41334, -11833, -27026, -209104, -115229, 50002, 303, -50452, -114011, -94830, 90884, 255326, 79160, 35373, 50678, 103262, 17810, -83529, -63457, -182793, -296249, -277404, -312391, -252431, -140305, -182818, -133787, -24799, -63611, -23074, 151899, 327419, 165965]
23694A65965j17145k536K4895p3220O0415m726p44K2681k3020p2490k12691N2582
23682a80034N9060J9163j1974P4284j19270J34025R7573l0936J1027j30275j11214
23671a88571J89959L1107q0362L4653j33414l2654p0220R2265K45612R7770l28394
23660a42249r7650J50334J75455N1442k18520k19515k96J55441P2578J41998O1099
23649A30117m02360J84510J58488M5090k870K6807j93286m7479O4315N5742j22274
23638a03200N9590N6601l7560P6563N9223j14296n6335m6478R0701P8144j01006
23627c8053J21523R0031P7206k1134M7831j38611k5794R7347m7396j79552L3415
23616A6813R5691n0670K8859l6701P3540p9895j49907m9678l7987K39529j96692
$$ y = [165965, 48820, 46284, 71179, -2041, 58374, 53648, 52904, 75585, 52565, -19925, -232616, -180034, -120974, -101811, -113785, -39501, -158771, -24746, 72827, 41891, 52918, -77357, -188571, 1388, 32495, -47867, -13214, -146628, -179282, -249502, -157237, 88375, 186145, -142249, -239899, -89565, 85890, 137332, -81188, -300703, -300999, -145558, -72980, 69018, 130117, -272243, -87733, 70755, 115845, 112975, 139782, -53504, -100983, -36668, 19074, -103200, -43610, 12991, -24569, 51994, 111217, -3079, -59414, -105892, -15191, 62953, -38053, 83470, 173501, 250707, 229573, 277404, 138793, 112999, 210346, 162950, -16602, 16813, 112504, 61834, 90693, 53992, 127532, 47637, -102270, -151948, -189935, 49594, -147098]
23605a47098j20267J9611J11753J64543N9880O2166j59785j46180O0146J19811
23595B4580j24503n0985O610j36070J15710j21580j27237J37304J24983M3451
23585a07737J38475K6851j70513J02624J51943Q1572k08942j28611Q2615J86971
23575A55248o5629j52404k8439R8030j4657j9470J77117N1451O7862j52872o6619
23564D9618K1543K08137l1111k39438k00638K4271l7748j62541k3393J99505J367
23553a90428n9603K28785J45183m9303J48536J34742j89853j46500K785k2126
23543B218m7510j45316n078J45350J54073L4933k6927j87483o3645p3808O012
23532b07181J84865P3143J9716r8355J33684l4481L3449P8256j64520j09265j87935
$$ y = [-147098, -267365, -247754, -136001, 28542, 88422, 150588, -9197, -155377, -95231, 24580, -99923, -150908, -144298, -280368, -164658, -286238, -413475, -276171, -151188, -107737, 30738, 57589, -112924, -10300, 141643, 223215, 14273, -114338, -31723, 155248, 89619, -62785, -91224, 6806, -7851, -27321, 149796, 201247, 269109, 116237, 49618, 71161, 279298, 248187, 8749, -191889, -167618, -205366, -367907, -391300, -191795, -190428, -250031, -21246, 123937, 74634, 223170, 357912, 168059, 21559, 24344, 2218, -45292, -190608, -195686, -50336, 103737, 138670, 111743, -75740, -139385, -213193, -207181, -22316, 50827, 70543, -27812, 105872, 71391, 104840, 183096, 18576, -90689, -278624]
23521b78624j0142L4503R2124N7038N4888J11281m6983O3802J09264P712j91130
23510C733O9611P6457L5324j52977J32893J21412k56252k29728N8808K93773j8973
23499A34081j80424K0090J661J37876n990k26302j41089j4927J59786K60913J68368
23488C14043J2533p7937k10935k11562r56J53812R2804L9446n4429J18271O0958
23477B36048n3604j10951j73464q5492J9265P1679J29744j74733j05352J35904
23467a10956L0470p8720N3946O5075j03031j4592L4078N898K0823l8182J39222
23456D031p5874p6128J48499J16784m5771j68258j61044J66785R2547K5413K9529
23445E6513Q2358R1023n8221P8360L1377n2852o537K1376j93142P5662p990j77996
$$ y = [-278624, -288766, -254263, -162139, -105101, -50213, 61068, 14085, 77887, 187151, 194863, 3733, 73344, 149801, 185125, 32148, 165041, 286453, 30201, -199527, -140719, 153054, 134081, -46343, -26253, -24592, 113284, 107294, -119008, -260097, -275024, -115238, 145675, 314043, 326576, 248639, 37704, -173858, -174814, -21002, 71802, 111248, 56819, 175090, 236048, 182444, 71493, -101971, -187463, -168198, -96519, 33225, -141508, -246860, -110956, -80486, -159206, -105260, -40185, -143216, -157808, -123730, -117832, -97009, -135191, 4031, -71843, -147971, 528, 117312, 71541, -96717, -257761, -90976, 1571, 26984, 56513, 138871, 229894, 171673, 250033, 281410, 228558, 222021, 243397, 50255, 125917, 117927, -60069]
23433f0069j04301j43226J06648L6788O0393J35776K2990Q903J1664m5645j39569
23422a09648J04936Q4108K36874K3609j7531j93384j10107J11097q6208n3672
23412i926k8897J6575o6552K5335O77O7182J12057P7035p9477j2455R8859j56193
23400D4220j94811j98791J77572J95828P573j4394K7227J2635J9928l612j79474
23389a06099j29802J19072r2697N6862j0943J60577n8315J7789M8025O9655l2528
23378D1596J7045J35887j6766n7069K7382j35213m8907p8658K8423R4143q5253
23367g7390j96938K45978j9659o716J79174r7372J38930Q7806o1641r5051j47325
23356e0204j56020P1747j85622K6128K03199j67865N0957M0636r7979q272j85090
$$ y = [-60069, -164370, -307596, -200948, -164160, -103767, 32009, 54999, 63902, 75566, 29921, -109648, -4712, 79396, 316270, 339879, 322348, 128964, 18857, 129954, 43746, -9926, -38823, -22248, -88800, -63465, -62788, 4394, 116451, 193486, 114009, 101554, 200413, 44220, -150591, -349382, -171810, 24018, 31591, 17197, 44424, 57059, 76987, 73375, -106099, -235901, -116829, -209526, -152664, -163607, -3030, -61345, -43556, 4469, 74124, 41596, 58641, 194528, 177762, 120693, 148075, 12862, -36045, -114703, -86280, 7863, -77390, -274328, -28350, -48009, -54725, 124449, 27077, 166007, 253813, 192172, 97121, -50204, -206224, -134477, -320099, -293971, -90772, -258637, -207680, -167044, -265023, -273295, -458385]
23345d58385O0334K35620r1033r807K35922J85885j60333j24808J06391p7317
23335i7531J4644Q2331o9356j17622M6225p9261j20980L2184K66195J14412m4656
23324B6585R2572M9846j22337l0752N8551q1134r445o8815j96804j01294K01337
23313a81690L1271P6292J09908J54710q7341N8591J48803j01549k00176j08908
23303a00089j0259n7865j66747R5720J86734J26681Q8615p6897o4525K0506k2310
23292A9564J7221N5014j51942K38797J49304j45290j91008j3869P8747J25921
23282A82459P3267J5813k14497r8839J17179k8944j13086l0948J3663k54709j25111
23271d63753J34790K96544K51063r4639j19330J37381j28645J16936J9654n9429
$$ y = [-458385, -398051, -162431, -253464, -263271, -27349, 158536, -1797, -126605, -20214, -97531, -82887, -556, -69912, -187534, -141309, -220570, -341550, -309366, -43171, 71241, 26585, 119157, 169003, 46666, 15914, 74465, -6669, -16114, -84929, -281733, -383027, -181690, -150419, -74127, 35781, 190491, 103150, 161741, 310544, 208995, 8819, -100089, -110348, -168213, -334960, -239240, -52506, 74175, 162790, 85893, 21368, 41874, 19564, 36785, 91799, -60143, 178654, 327958, 182668, -8340, -22209, 56538, 182459, 255726, 271539, 57042, -41797, 75382, 46438, -66648, -97596, -83933, -338642, -463753, -328963, -32419, 218644, 124005, 4675, 142056, 13411, 130347, 150001, 90572]
23261I0572J0217j57538M353J50343J7995j8710j31086m180R6326p6352p9197
23250i7257Q1911N217m7085L1285R5280N857j17744J03919J01672j25042j19355
23239h1342J01033j6670R6066J42374J4428n1112N5940p0575q7418p7344n1015
23228b5635j49525j30860o2840O0901J12751l4884K11965R0470j08910Q5457n1419
23217b529k3923Q7441k5430n2246r8213l644J32587N7631r0231k9294k09213n5605
23205c12669J53936K7203N6031k02272p4948l9911K5643J15011K73086L03311
23195C24421j39787M5553L6058j07680j78009o4448r4189J27533J18917J49636
23185B18005K46425j537k02831r0221N4234K6398q6814k00032r817J10636J43233
$$ y = [90572, 100789, -56749, -52396, 97947, 115942, 97232, -33854, -38034, 58292, -18060, -97257, -15346, -10129, -57214, -25929, 69351, 75208, -42536, 61383, 163055, 38013, -81342, 19691, 3021, 99087, 241461, 255889, 204777, 260717, 190142, 102724, 25380, -25635, -175160, -306020, -368860, -307959, -195208, -230092, -18127, 72343, -36567, 48890, -2529, -26452, 60989, 35559, -16687, -114900, -118544, 14043, 71674, -18557, -47851, -257064, -312669, -158733, -131530, -75499, -277771, -352719, -392630, -366987, -251976, 21110, 324421, 184634, 230187, 266245, 158565, -19444, -83892, -178081, -50548, 68369, 218005, 464430, 462893, 260062, 169841, 224075, 250473, 163659, -36373, -46190, 64446, 207679]
23174B07679j47617j5364p3489J3735J12780R0548O9486q0621M0356O377L1045
23163B54915k0200j31791k55591J1238J18485J27133n8218j29240J46832j10327
23153d6764L4827K00156L7719k80890m3238J03923q6278J55744Q2657j67081m4458
23142e3683r5096k121k3851p4626J86934J61815J20650p1997N5468K4895Q2555
23131C10943r0711q0504k0619K68031N2172j27567j13650r895O3030j31266n3028
23120F6936J12784N0582j67699n1639j03672j53234N450O8977J47063p0573j21793
23109b16818L01912P4498q7253K3287r7941J15546J22028k1240J41792j50024
23099B05787j94404J6698L7430J20569j08291j09179l6689N0233k57213r3853
$$ y = [207679, 60062, 44698, -28791, -15056, 97724, 188272, 257758, 177137, 217493, 223870, 254915, 234715, 102924, -152667, -141429, -22944, 104189, 45971, -83269, 63563, -46764, -11937, 188219, 225938, -54952, -98190, 5733, -80545, 75199, 157856, -9225, -53683, -148779, -150900, -174751, -249377, -62443, 99372, 220022, 148025, 203493, 228388, 310943, 220232, 139728, 119109, 387140, 439312, 311745, 198095, 188200, 251230, 119964, 66936, 179720, 230302, 62603, 10964, -92708, -245942, -240492, -171515, -24452, -95025, -216818, 85094, 159592, 72339, 95626, -2315, 113231, 235259, 214019, 355811, 205787, 11383, 28081, 65511, 186080, 77789, -31390, -68079, -17846, -275059, -368912]
23089c68912K83708J80305k17557m2985J88052q7844j9605J33535j0062P2007
23079A10642J54087o4247l0109k63898r0763j40170L7160R2931j6691P616j45534
23068c48976M0630J89270J16999J4067j1449J13312r0295j04909R9191m1133m0473
23057f3766k11330j14976J22844K95509L07774L9412k08515J47623N1670k39148
23047A27097j04262j20647J20773J71292n5088k9432J36291K3321j94838o2117
23037A2390r4622P04j5476J70618l7410p2112K26909Q6909o1212K0182k04981
23026C1899p043j42831Q425J003n3185j15943K66899L7776O3443M0838J42814
23015B74095n8907j79762J04491m3230q3440J18002r7497m8992r7618j81666N674
$$ y = [-368912, -85204, 95101, -122456, -165441, 22611, -65233, -84838, 48697, 38635, 110642, 264729, 200482, 170373, -93525, -184288, -324458, -287298, -194367, -211058, -203442, -348976, -308346, -119076, -2077, 11990, 541, 113853, 23558, -81351, 17840, -23293, -63766, -275096, -390072, -267228, 28281, 336055, 375467, 166952, 314575, 366245, 127097, 22835, -97812, 22961, 194253, 139165, 109733, 246024, 269345, 74507, 12390, -82232, -81528, -97004, 73614, 36204, -35908, 191001, 277910, 216698, 236880, 31899, 24856, -117975, -109550, -108547, -161732, -277675, -10776, 27000, 90443, 131281, 274095, 215188, 35426, 139917, 96687, 13247, 131249, 33752, -15240, -112858, -294524, -288850]
23004b88850J63329K37966J76642J19659Q4676J1421j94164l47633n1993R1153
22994B206J65484M5342R103r779L2332j91110o4515K05295J45481K0239M2974
22983D03052m0130k86676J26006M6102r7104n3823J112j9012k25601k48443J00738
22972b93779K62506J09265J02456J65411k02124M8837k02684l04427J19264K11114
22962A5839J58125p517L6596m0779p6435K28456K3627M131r4607j79552k77983
22951b10099m9065J30463Q9480J31824k59793Q8173O8836K23372j2211o5028P0401
22940B06353k83545j20329K25352N5199J46388m7377J1044p9353j75392j21191
22930a82851P9140K08401l9374j15818P6914R1261q5636K2647J01919M5930k7631
$$ y = [-288850, -125521, 112445, 289087, 408746, 493422, 504843, 310679, -36954, -88947, 2206, 167690, 213032, 222135, 212356, 244688, 53578, -10937, 194358, 339839, 360078, 403052, 362922, 76246, 202252, 248354, 151250, 97427, 98539, 79527, -146074, -394517, -293779, -31273, 77992, 180448, 345859, 143735, 192572, -10112, -314539, -195275, 15839, 173964, 166447, 203043, 162264, 85829, 314285, 337912, 342043, 247436, 67884, -210099, -259164, -128701, -39221, 92603, -167190, -79017, -10181, 213191, 200980, 135952, 206353, -77192, -197521, 27831, 83030, 229418, 182041, 193085, 113732, -61660, -182851, -103711, 104690, 65316, -50502, 26412, 117673, 32037, 54684, 156603, 202533, 174902]
22919A74902O2677J39976j50886q6991Q644J17102J05069q7257n5751j35707J71284
22908B63062J05768L1349j3115o5937j26105K1539K28129K473N1108j96937J5573
22897C16907m426j12933K2378p0546j30396k55015J12873K24384K5038l5367o2950
22886B9947j66610k3017L7608K02233o0259p8803j2106j51784r9789k9839J01462
22875b50957j5373n9463j00362R6724J60209J09668O6418m8588J20273p106j4034
22864E7409k13947m6051J55444J03937j51647q3148K66150J22763J2091j14491
22854A08510L6287j0772o977j37070k41809o6600K44779K15268p2286Q9230L1765
22843A90325j88338K9790p896k2666l3895m3600L1931K60561k7750l7330j02925
$$ y = [174902, 237579, 377555, 226669, 139678, 148322, 265424, 370493, 283236, 227485, 91778, 263062, 368830, 400179, 387064, 321127, 195022, 216561, 444690, 447163, 498271, 301334, 316907, 312481, 199548, 221926, 151380, 20984, -234031, -121158, 103226, 128264, 92897, 29947, -136663, -159680, -122072, 80161, 19902, -58901, -71007, -222791, -322580, -352419, -250957, -266330, -325793, -426155, -329431, -169222, -59554, 6864, -41724, 78549, 71443, 57409, -156538, -202589, -47145, 56792, -94855, -178003, 88147, 210910, 223001, 108510, 144797, 134025, 127048, -10022, -251831, -318431, -73652, 141616, 69330, 158560, 190325, 1987, 31777, 23881, 1215, -32680, -76280, -44349, 216212, 188462, 151132, 48207]
22832D8207L4539M3842k28247m4626K00156J96772k22099j46552K37066J016j33103
22821a3029j81091Q4403J44900O1657O1972j48417j85210p3705M4928l2090L1800
22810b03882K07538K75357R2147j0163P8772m8448j75705P3462M2675j50667q0301
22799A00785q3959j01692K13689l7515J23981J95736k03174k00142K0684q1083
22789e2690j7956k0371J37761J77826k01652j14079m4737J81369J11952q3816
22779G3607m8182l0892r3839N9391K64720N1594K8659L5567k14376j89574j25640
22768a88965L6781K47623J78782j52883p8510J90439k1121j03388j49720p1802
22758a12764J9873j6205l9961j36912K05013J63419j19825k00426K17367J9284
$$ y = [48207, 82746, 126588, -101659, -146285, 53871, 250643, 28544, -118008, 119058, 120074, -13029, -194120, -109717, 35183, 96840, 158812, 10395, -174815, -248520, -203592, -235682, -203882, 3656, 279013, 371160, 360997, 439769, 391321, 215616, 289078, 331753, 181086, 100785, 16826, -84866, 128823, 91308, 215289, 411025, 207851, 7709, 28393, -52690, -70646, -91017, 46744, 224570, 22918, -91161, -135898, 45471, 157423, 73607, 25425, -5467, -99306, -39915, 224805, 276399, 305058, 340625, 126249, -63325, -188965, -152184, 95439, 274221, 121338, 42828, 233267, 212146, 108758, -40962, -112764, -92891, -109096, -149057, -285969, -80956, 82463, -37362, -237788, -20421, -1137]
22748a137M3802m4559j68945K17192J26787p3907k7025J29622K83103J27009M159
22737F16101j32657k39175k61936P0079J32669p9729j74308K60749Q136P9924
22727B79853n0091J14655l6352p7111j87644p791K33873Q9483J6021p9843J0621
22716C05674k45807k53384N013N9056J40651J55140j03659j63121j36936J20292
22706a17081J82099j243J5212j78350P3673j1665K6312k6587J36588j36188j9870
22695e7100L2072R4390r3970K633J52842K0279M4306N7002p4019k4881n5615o6252
22683C1687l183M8448K40252N8896N8124j90759N7172j97961j14744J73784k9784
22672A31932j15735K57389J50669j34272j29194l4557J97581l2582k53712J07682
$$ y = [-1137, 42665, -1894, -170839, 46353, 173140, 99233, 72208, 201830, 484933, 611942, 616101, 483444, 244269, -17667, 52412, 185081, 105352, -68956, 191793, 199929, 279853, 229762, 344417, 308065, 230954, 43310, 35519, 269392, 358875, 374896, 295053, 305674, 59867, -193517, -188504, -129448, 11203, 166343, 62684, -100437, -237373, -117081, 65018, 63775, 78987, -99363, -25690, -37355, -11043, -37630, 98958, -37230, -57100, -25028, 69362, -24608, -21975, 130867, 151146, 195452, 252454, 178435, 153554, 97939, 31687, 28504, 76952, 317204, 376100, 434224, 243465, 300637, 102676, -12068, 161716, 131932, 16197, 273586, 424255, 289983, 160789, 126232, 323813, 291231, 37519, 145201]
22662A45201j4290j26334R412K93743N4997J35949j23438k27149J3178j47455
22652A3814o6453J62120J90192k20705j56980R3341L9042K00955J69209J26388
22642E50923J17690j91496j26583k0642O3972l7035J1509q2083k2563J05140o6173
22631C02659o1956j47272K3023J90131j1030o7598J41557J129k44349j19208l9901
22620c2815P8136l4101J7742J62379J5297k27152o0838K4124n8011O4875L1756
22609a8608K664j565K13513J45290k40586j05092p6107M5546M1695p4484l8501
22598a06235J85648k5699O9872K64854r7598k58355O9226J4697n348j5516k39845
22587a44299P6935J10501O3857M1860J72105P660n7672j03050k0417K6134j68825
$$ y = [145201, 130911, 4577, 13989, 307732, 362729, 498678, 375240, 148091, 161269, 13814, -52639, 109481, 299673, 78968, -78012, 15329, 54371, 255326, 424535, 550923, 668613, 477117, 350534, 329892, 393864, 356829, 368338, 286255, 263692, 368832, 302659, 240703, 93431, 116454, 306585, 295555, 227957, 369514, 370643, 126294, 7086, -32815, 45321, 11220, 28962, 191341, 206638, -20514, -81352, -57228, -115239, -50364, -18608, -15944, -17509, 196004, 341294, 100708, -4384, -80491, -34945, 6750, -67734, -106235, 79413, 53714, 123586, 388440, 290842, 32487, 101713, 116410, 111062, 95546, -144299, -67364, 43137, 106994, 148854, 320959, 328619, 270947, 167897, 147480, 173614, 4789]
22576D789j29710r2945r3143q6579J28114J76299K9172m3880m3497j61007P4485
22565b37902N5446M073M5576K18302J65103J28033R7386j20918j37525Q721j30367
22554I5928L3891j1963k33917q4498J95061J66476N9971k35502j60118K63948
22544H9277L4217p8252J91403N5598j27225O6919K22807o7669k07086j17352m0627
22533B2010R3044Q2732j69840N2116k2185j86125K9482P9247r6709K13591K17493
22522C14856j28508j29424Q2912P2101j95228j5482J17671m9053O8584K7599O5395
22511B31423o8401j61266q7021p6686N7703K36002R1007m16005o0908j4751J15353
22500a53550K26438m3959j6114o3814O9952j04319J24080k3752N5718k8137j16004
$$ y = [4789, -124921, -217866, -311009, -397588, -269474, -93175, -64003, -107883, -151380, -312387, -237902, -182456, -178383, -132807, 85495, 250598, 378631, 476017, 355099, 217574, 226295, 95928, 129819, 117856, -116061, -200559, -5498, 160978, 220949, -14553, -174671, 89277, 123494, 45242, 236645, 292243, 165018, 231937, 454744, 387075, 179989, 62637, 22010, 115054, 197786, 27946, 80062, 57877, -128248, -98766, -19519, -116228, 97363, 314856, 186348, 56924, 139836, 211937, 16709, 1227, 118898, 69845, 138429, 166028, 231423, 163022, 1756, -85265, -161951, -104248, 131754, 222761, -193244, -254152, -268903, -153550, 72888, 28929, 12815, -50999, 18953, -85366, 38714, 14962, 70680, 42543, -73461]
22489g3461J65390m5269j18920O2455j56200K2740K00041R291j9243J46392j51480
22478D1736p2306k1112o2166P9119N651l5841k3595K02234N4824q3457L8917N5856
22466A79860j4301J10273q581j55377N1539J89924J2703j80850j88548J79013
22456A75655K46122K000j36368l62086q1082J95611m7943n3907N0852J60570O6812
22445B16236k1911j09778J7487J02752J03634Q0800k29258j91611K08138J85813
22435C62302j11770o2189J61299n6138k30034j4722J08247J44163k9534K499J07566
22424C81689n074j31700k2769N1208o4245q696j21350O7215J20859P820R4998
22413C69955j14863q0937j46474m3426p0420R2038Q0255J52498j86592Q6329K17167
$$ y = [-73461, 91929, 46660, -72260, -9805, -166005, -143265, 56776, 66067, 46824, 193216, 41736, -30570, -51682, -113848, -34729, -29078, -64919, -88514, 113720, 168544, 85087, 124004, 179860, 165559, 275832, 267251, 111874, 163413, 353337, 366040, 185190, -3358, 175655, 421777, 423777, 287409, -74677, -155759, 39852, -8091, -61998, -11146, 149424, 216236, 194325, 84547, 102034, 204786, 308420, 389220, 159962, -31649, 176489, 362302, 250532, 188343, 349642, 293504, 63470, 48748, 156995, 301158, 271624, 274123, 381689, 376615, 244915, 222146, 273354, 209109, 200413, 79063, 146278, 267137, 274957, 369955, 255092, 174155, 27681, -15745, -86165, 5873, 86128, 238626, 52034, 138363, 355530]
22402C55530o1119n4611j04221Q618q0338M3157J0463k84858q6711K70698P1762
22391H8370J15428o544J84074M1974j55182j89365j02961J51178J3745n4137L2826
22380A19406o989J82841j08671K0844n5258j35683J09967J16258Q7104K0302q3784
22369B66337j3035k0655n7067j27975P2723K137J32946n5587j35360J07956J61065
22358C33485j24887J25192m9177j28692j2600m2925j62739j03042J63101K31794
22348B29510N053j21237l5197n8031j8866J87847p94J63614p1000j75140j56083
22337e0324O7412k17491k17304K17651M33992J04103k43401k77788j89908O095
22327c66963L9310J9057J8232J59866Q4057j00411L9126J79329J64432o8758j72447
$$ y = [355530, 294411, 239800, 135579, 144197, 63859, 107016, 117479, -167379, -254090, 16608, 88370, 203798, 197254, 381328, 423302, 268120, 78755, -24206, 126972, 140717, 86580, 119406, 112417, 295258, 186587, 207431, 152173, 16490, 126457, 242715, 329819, 350121, 266337, 253302, 232647, 175580, 47605, 120328, 122465, 255411, 199824, 64464, 172420, 333485, 208598, 333790, 284613, 155921, 143321, 100396, -62343, -165385, -2284, 229510, 234563, 113326, 78129, 20098, 1232, 189079, 188285, 351899, 280899, 105759, -50324, 17088, -200403, -417707, -200056, 233936, 338039, 94638, -183150, -373058, -366963, -327653, -308596, -290364, -130498, -46441, -146852, -107726, 71603, 236035, 167277, -5170]
22316e170K90258J50974o0083l01126m3161K43736K30052j39654k60895o3807
22306D1124j4230N2884J85483Q5254j51483p7217j05661p9082n8032K8811P2254
22295a9895J52255q3454k27746O5726J94346R9901k37302Q5223O5200m3749M6135
22284I6640l5362q3878O3234J02542J4437m2382O7757j06572Q7169q403l8110
22273A17072P27k2526J06180Q8008j13963R403Q2341l7891o949l0511N9121l6674
22261B14338L2151K11179m4785j8268j13905k0402R424j55895j48592j01808J21743
22250a4820R5167n163j06048q1964l2982L86524R6233r9868j37150j45052K75499
22239B30376K3825j80006j34273O572N0772Q5442K31248j7247o5149j52926J17286
$$ y = [-5170, 285088, 436062, 375979, 74853, 31692, 275428, 505480, 365826, 104931, 41124, 26894, 79778, 265261, 350515, 199032, 121815, 16154, -62928, -120960, -92149, -19895, 132360, 48906, -178840, -113114, 81232, 181133, -56169, 29054, 94254, 50505, 96640, 61278, -22600, 40634, 143176, 157613, 115231, 182988, 76416, 163585, 155182, 117072, 117799, 95273, 201453, 289461, 175498, 184901, 267242, 229351, 222402, 191891, 251012, 214338, 246489, 457668, 412883, 394615, 280710, 260308, 269732, 113837, -34755, -136563, -14820, 80347, 75184, -30864, -112828, -145810, 240714, 336947, 237079, 99929, -45123, 230376, 254201, 74195, -60078, -53506, -2734, 82708, 313956, 296709, 231560, 78634, 195920]
22228A95920q1650j69952k3525K75742R1059j35272N2023P6015n5597P6428M1431
22217C42622N5509K5140j8862m4495r2962K4363P0368P7544j40816p2796L8617
22206B64232M7367o1750k66643N2016J47383m8419j65611j34715J31609O7610
22196C3079j26453j13628j5070L0745J85256o8362k7848r7171L7140J07653Q4299
22185B9640O8604K74177o7263L5449r2114k29972Q5139J23143J04215J56106L5918
22174E23042j16963j34398k45834Q2060n312J13374J77249K7015j95319k14056
22164A0858j9007J48051J13814J71338L353j42524k28724p2072J88432L14390
22154D87909N2238k72505k98009j63853j32958L5638K79481K88357O8798n5642
$$ y = [195920, 114270, -55682, -79207, 196535, 287594, 152322, 204345, 280360, 224763, 301191, 342622, 398131, 423271, 404409, 359914, 266952, 291315, 361683, 439227, 298411, 225615, 264232, 311599, 249849, -16794, 35222, 182605, 134186, -31425, -166140, -34531, 33079, -93374, -207002, -222072, -191327, -6071, -74433, -102281, -199452, -162312, -54659, 29640, 98244, 372421, 305158, 340607, 248493, 18521, 103660, 226803, 331018, 487124, 523042, 406079, 271681, 25847, 107907, 102595, 215969, 393218, 420233, 224914, 10858, -8149, 139902, 253716, 425054, 428407, 285883, 57159, -14913, 173519, 487909, 540147, 267642, -30367, -194220, -327178, -291540, -12059, 276298, 345096, 289454]
22144B89454j447J8984j55636L1994r9650o3865L0034Q3123m5561R1113r0894
22133H7649m2084N74M3062R6677J04975L9943m0767j28843J16440p6656j39827
22122F1143k9007K443R6871J176j12004L2870j44596O7110k0194p9337N7343J04135
22110C7953O8903l4129p8931J34433K34899J20321j82334L5897k98218j63337
22100a24543J20657L6673n0250J5906n9282P6164j703j78912o7412J80548R4879
22089D2725q3336p9379K4475j8326J80086K29715k8110j70075m9563j0149N8655
22078I6718J9995q7934o4634l3876l5452n8266J41991K2378J00892K162N7246
22067A61220L8707j24604K8170n8417j23405M3992R5256K38801J33604o3055j16446
$$ y = [289454, 288007, 306991, 151355, 183349, 83699, 19834, 49868, 132991, 87430, 178543, 87649, 45565, 46139, 89201, 185878, 290853, 330796, 290029, 161186, 277626, 200970, 61143, 32136, 34579, 131450, 132626, 20622, 53492, -91104, -23994, -44188, -123525, -66182, 37953, 106856, 72727, -6204, 128229, 363128, 483449, 301115, 337012, 38794, -124543, -3886, 32787, -17463, -1557, -60839, 15325, 13622, -165290, -232702, -52154, 42725, -40611, -119990, -95515, -113841, 66245, 295960, 267850, 97775, 48212, 38063, 96718, 116713, 28779, -35855, -69731, -105183, -163449, -21458, 920, 101812, 103974, 161220, 199927, 75323, 103493, 45076, -78329, -34337, 60919, 299720, 433324, 370269, 253823]
22056B53823o0575L096l9167K7040m0708J702o4972j43535P0151N2010J9364Q9461
22044A67690p4006o5774L1965J76460r2840j68372J26689J79877k5375K0247m8575
22033B27986R3524N7247p6514n2119j74440J43288p1064k81685j21041l619Q2434
22022a76003K95328K59303m1620q1425k02163o3878J59083J64883m0509R0615
22012C63614O3417j80871j43469J7048p6536p1394P1275J51811q2904k08061k0142
22001a16212L8641Q398R6118P6447l4960k2114J61133r943j27268j76678K2807
21990h3631J03647J47239m4324J68097L7976j15623k30084k39307R6626J4125
21980a45259J89117M2954n2743j59582N301J51946K31760J19276k6295k40132
$$ y = [253823, 193248, 196344, 157177, 184217, 143509, 145211, 80239, -63296, 6855, 58865, 78229, 167690, 93684, 27910, 59875, 236335, 143495, -24877, 101812, 281689, 256314, 276561, 227986, 321510, 378757, 302243, 250124, 75684, 218972, 147908, -133777, -254818, -258437, -176003, 119325, 378628, 337008, 255583, 53420, -10458, 148625, 313508, 272999, 363614, 427031, 246160, 102691, 119739, 43203, -28191, 43084, 194895, 111991, -96070, -116212, -77571, -69173, 26945, 103392, 68432, 46318, 207451, 197508, 70240, -106438, -83631, 20016, 167255, 122931, 291028, 329004, 213381, -16703, -256010, -159384, -145259, 43858, 86812, 34069, -125513, -120212, 31734, 263494, 382770, 356475, 116343]
21970A16343j92587o6567J73444n9269M9822J29868j39354r8598q3302J71754
21960A554J56333K79564P929j71961p6164l59879K9887J60693J00748P2297q1086
21949A19915J88522l0003k54826j52025O0725K2911j23719p6514K29466L3523
21939A7975O1544r6631k4546j4943L05704J56433j57808k05101o849k6771M0697
21928D9704J45501J9825m8264m3120j79810j11508r4503J28712M9960J72395J40529
21917B29421k2460p7149O904k28300R2007O5052j04507R9857J52931m5562J12966
21906B81160M2093k20047j28295o3443O0146K1920Q448j0064n9878J20994P231
21895F0265r3186j09322p1215L5384L3360Q7023m2021j10545J04369J69203J51335
$$ y = [116343, -76244, -142811, 30633, -28636, 21186, 151054, 11700, -86898, -170200, 1554, 157887, 437451, 445380, 273419, 197255, -162624, -132737, 27956, 128704, 201001, 119915, 308437, 278434, 23608, -128417, -67692, -44781, -168500, -245014, -15548, 17975, 79519, -17112, -41658, -56601, 249103, 405536, 247728, 42627, 35778, 9007, 49704, 195205, 215030, 166766, 123646, -56164, -167672, -262175, -133463, -83503, 88892, 229421, 206961, 129812, 136716, -91584, 423, 65475, -39032, 60825, 213756, 168194, 281160, 323253, 103206, -25089, -88532, -28386, -6466, 1982, -8082, -67960, 53034, 60265, -32921, -142243, -213458, -178074, -144714, -57691, -99712, -210257, -105888, 63315, 214650]
21884B14650J8684j8829j7181p3755j21651o4267M6130J09221R9831L6604r7069
21873A32368p6136O7221M9238R1283j5047k42571r1478J76814J27719k25782N1785
21862D5414q9946j14347J80580P8546O3663R9746o1264j04679r187j0335J46249
21851B24440j010o1889L0804p5730n823l8748k1738O743J97780N3201q0500j73549
21839E3981p2661J14571K16486M418j57691k7802J11241J07414J6903n8942l4642
21828B73276L4993j13595j7898j07275j5576r7569J8341P6167J91229j1883O3540
21817B93750j9710l3074n7574k41116m8703J61683R0976j79876j87424N0789M1560
21806a28719K25990K11672L8575k37036n6524K10214Q1149j25747l82459J3673
$$ y = [214650, 233334, 214505, 197324, 123569, 1918, -62349, -16219, 93002, 192833, 229437, 132368, 56232, 123453, 172691, 263974, 248927, 6356, -85122, 91692, 219411, -6371, 45414, -44532, -158879, 21701, 100247, 163910, 263656, 202392, 97713, 88526, 78191, 224440, 223430, 161541, 192345, 116615, 110792, 72044, 50306, 57049, 254829, 308030, 227530, 53981, -18680, 95891, 312377, 316795, 159104, 131302, 242543, 349957, 366860, 307918, 273276, 308269, 194674, 176776, 69501, 53925, -43644, -25303, 50864, 242093, 230210, 293750, 274040, 240966, 183392, -57724, -106427, 55256, 146232, -33644, -221068, -170279, -128719, 97271, 308943, 347518, 110482, 53958, 264172, 345321, 219574, -162885, -149212]
21796a49212K18824J44887P6258m9840q0177j0375j90291p9740N4838J04747k07831
21785a67912L531N8495K20700J00744J34433N1139n2656q5874j18535J03065L3049
21774B80179j98681k10717m7166M9649K69766N570Q1549J5602J86154o9376j15120
21763B47409p3826l374j55251P6208J91583o939r1084P5096M9225Q9865m6923
21752C51989o4952L9939r4626j9844p6067R0283r760k24621j24222M4288M1764
21741d5829J33378o7107j04832j5343P3912J4486N2964k812j40580J45969N2872
21730I7078J03943L08121J47838j79603k82114q5146j16801K59694J85645J04731
21720E43386O7296r2435k30849r7556L777q5129J53464P2479N8441j3593P3933
$$ y = [-149212, 69612, 214499, 290757, 240917, 160740, 150365, -39926, -119666, -64828, 39919, -167912, -164381, -105886, 114814, 215558, 349991, 401130, 348474, 262600, 144065, 247130, 280179, 81498, -129219, -176385, -126736, 143030, 148600, 230149, 245751, 431905, 362529, 247409, 173583, 170209, 14958, 91166, 282749, 275810, 184726, 259822, 309047, 398912, 351989, 287037, 326976, 232350, 212506, 136439, 226722, 216962, -7659, -131881, -87593, -45829, 87549, 20442, -84390, -99733, -25821, -11335, 41629, 38817, -101763, 44206, 97078, 201021, 509142, 656980, 477377, 195263, 110117, -6684, 253010, 438655, 543386, 610682, 518247, 287398, 189842, 193619, 108490, 261954, 334433, 392874, 379281, 453214]
21709D53214j49001j34591J4289Q6882J04465L0950m36772p3390L17635Q9357
21699C03038r8489J2409n9538J13171O5808j84541o0781p4817J41953k9627j34274
21688e688J6251J72955J91810R7304J2042k20169r0898q8631m6803m3686J61405
21677A55892j4558j02053r853n5516L32440K14433J700k2729j2746j03284R0130
21666D73856j33277j70096l6304K2693p1849n283J16400r4129J02195N4722j17425
21655A41503M365L0244j74830o3492J70539R9083K83931J65223l26033k04897
21645A25636k11283j27608j3267L7940p7719J15315O2523j37789K11699Q1496
21635F6943J3846J52862l8071n9258L63018P2766K3262m23134j36206J17140J06756
$$ y = [453214, 304213, 169622, 183911, 270793, 375258, 406208, -30564, -103954, 213681, 303038, 204549, 216958, 157420, 270591, 336399, 151858, 91077, 16260, 158213, 128586, -5688, 10563, 183518, 375328, 472632, 484674, 264505, 173607, 84976, 38173, -5513, 155892, 141334, 39281, 29428, -26088, 306352, 520785, 522485, 499756, 487010, 383726, 473856, 340579, 170483, 134179, 156872, 85023, 79740, 196140, 102011, 204206, 258928, 141503, 145868, 176112, 1282, -62210, 108329, 207412, 491343, 656566, 330533, 125636, -85647, -213255, -226522, -188582, -266301, -150986, -88463, -226252, -14553, 66943, 80789, 233651, 195580, 136322, 499340, 572106, 595368, 172234, 36028, 153168, 259924]
21624B59924m8276P4989R0506j82608j03803m715n7149J40472M868o5839k05693
21613i7324j41007K34368J50273J5543J26229K33500j14248l80520j35719p169
21603a16074J97813j9770J10298K83205l5729k2684k32640k80320O6771P7717
21593B8587J10658R2795k036K6478j27505J44593k77418o1395J9389Q9586J02596
21582A46328J2330o5071k5020J78891K19865j17020k00303P3038L1786K1347j68190
21571A07981j01030r7329L8698o2893L1612J19851M1681k4736N4644j72801q1149
21560a45471K41266J3609j44226j03168J07753K93137Q1116L7997r8370k30830
21550E2813m5280Q2579K44520j0739P0212j58673l16779j13477N005R2249j6891
$$ y = [259924, 211648, 286637, 377143, 194535, 90732, 86017, 28868, 169340, 174208, 108369, -97324, -238331, -3963, 146310, 161853, 288082, 521582, 407334, 26814, -108905, -116074, 81739, 61969, 172267, 455472, 419743, 397059, 164419, -115901, -49130, 28587, 139245, 232040, 230004, 256482, 128977, 273570, -3848, -65243, -45854, 43732, 146328, 158658, 93587, 68567, 247458, 467323, 350303, 150000, 223038, 254824, 276171, 107981, 6951, -90378, -51680, -114573, -82961, 36890, 78571, 53835, 108479, -64322, -145471, 95795, 109404, -34822, -137990, -30237, 262900, 344016, 382013, 283643, 52813, 7533, 90112, 334632, 323893, 394105, 235432, -81347, -194824, -189819, -97570, -114461]
21539a14461K9872K07856j2974O0723k26578K33458J25600q7220J4689O0206k51673
21528C9498p6714K24960J86477j17130j8282K23294o5236k96701O7336J27512
21518B95014J03258N0694m3853J07437q5748o2712k5121o1131j93227K215Q3211
21507A70037R4779P1342r642k32219j16681k47281l4326J60991P4306k2211J98159
21496A07254J78493j52756k32200M5628K36573J07257k39618p5372Q0126j04976
21486d9591O4423O704p6524J39476n393K3180J69872J84809p5560Q260o5422j13162
21474B11072N0067J66149j38775O2381k67751p6366R8132J45938r0388k13833
21464e3374Q0905P4513L4571K01981n6635j09172j70190q4388K53741J00805m5014
$$ y = [-114461, -84589, 123267, 110293, 171016, -55562, 177896, 303496, 216276, 230965, 291171, 39498, -37216, 187744, 374221, 257091, 238809, 462103, 396867, 100166, 167502, 295014, 398272, 448966, 405113, 512550, 426802, 364090, 338969, 277838, 84611, 86826, 170037, 264816, 336158, 326516, 94297, -22384, -269665, -303991, -143000, -68694, -90905, 107254, 285747, 132991, -99209, -53581, 182992, 290249, 50631, -24741, 55385, -49591, 14832, 21536, -54988, 84488, 79095, 102275, 272147, 456956, 381396, 389656, 324234, 211072, 261139, 427288, 288513, 350894, 83143, 6777, 104909, 250847, 160459, -53374, 27531, 102044, 136615, 338596, 281961, 172789, 2599, -81789, 171952, 272757, 227743]
21453B27743M5425m7574k0350N4658L4968L8233k29951k1418N5769j16779J24520
21442A45244N7459p6165j1721l8377j70195r0754j43058n9156J73428L28667O1208
21431A76580J09646J82314r23k06170j15765J22616L681k0139j29207r0455L8733
21420G0911J84837O9930q5765o1342J71679Q6258q4022o1390J77763q6678j56254
21409B25927l7484P8762J6922P9878l7250j72469O1517K24106k11089k26509j06864
21398a04553Q7493k47865J96943K65985q608J51017r3874j86994q2K1419k2425
21387E8456m1963j53554r3344O6957J07822J45014Q1358J20950L5089J67284p4123
21376D19946p9269K15186R9299j39969j95388j6590M0515R7753l6828j20338l76314
$$ y = [227743, 273168, 225594, 205244, 259902, 294870, 333103, 103152, 81734, 137503, 20724, 145244, 202703, 126538, 114817, 76440, -93755, -184509, -327567, -386723, -213295, 115372, 176580, 286226, 468540, 467617, 261447, 145682, 268298, 271979, 251840, 122633, 32178, 70911, 255748, 325678, 239913, 178571, 350250, 436508, 352486, 291096, 468859, 382181, 225927, 188443, 267205, 284127, 364005, 326755, 154286, 215803, 439909, 228820, 2311, -104553, -17060, -264925, -67982, 198003, 189395, 340412, 246538, 59544, 59462, 80881, 58456, 16493, -137061, -230405, -163448, -55626, 89388, 170746, 291696, 326785, 494069, 419946, 340677, 555863, 655162, 515193, 319805, 303215, 343730, 441483, 404655, 284317, -91997]
21365i1997j81781J47061P5786q883j7732k4059K08059J55783Q4838J01450j7834
21354D30691J2483j88096k47716J5025J85123J60014o7789L4356p8139m1636n1994
21343A62322j49665P3324K36787J02746j51619n1146l3071Q9708j26069r6210
21333E7107M1441R8119O8130K12421j27091k29447q2506j50756o8797J47195R7482
21322F3298M0315L4525J19316K8193J64941J12731J4891l00138j48065O146L645
21311A39798o1869j05725j21809P7416q2768J18414K17871Q9381q8662k06431
21301b4384J47990Q1691j987P0183j82886j85693P496J98340M9652r1516L2440
21290A01326P8331R922k36927q7333J02701L11828j08529j50574Q2068R5416K9903
$$ y = [-91997, -273778, -126717, -50931, -59814, -77546, -101605, 106454, 262237, 347075, 448525, 430691, 443174, 255078, 7362, 22387, 207510, 367524, 299735, 334091, 255952, 214316, 162322, 12657, 85981, 322768, 425514, 273895, 222749, 189678, 279386, 153317, 57107, 98548, 196667, 264797, 477218, 350127, 120680, 38174, -112582, -181379, -34184, 63298, 103613, 138138, 257454, 285647, 450588, 563319, 578210, 278072, 130007, 136153, 139798, 77929, -27796, -149605, -72189, -154957, -36543, 181328, 270709, 182047, -24384, 123606, 205297, 203310, 273493, 90607, -95086, -87590, 110750, 160402, 68886, 101326, 179657, 189579, -47348, -134681, -31980, 279848, 171319, 20745, 102813, 198229, 228132]
21279B28132j43061k93173L3335K74311J28695p3462j6619K024l27329j93923
21269c81070N5246J19289J41576K32573K9426K7965n6149N8408r4385k73186k3618
21258a63925p8294k3024p7941R5344K54995J77137k00797n4301O124q7436M57
21247a51661J73472K87140J20475j03269q807L5464j03912R423K9563o1344m505
21236B22039R8775j25248k22755j5918J4227m0097j67712j58656P980J77615M0893
21225a68857J24398j26574l7378l912o6864K60909J54186j1520k6881P6324J90808
21214C64639K21208K22260j9350k5503o0897m3900j9389j3961j20238Q8921n4744
21203E39046j34134L9589M0380Q4664j6854J6289j60194j58977O8115J23477O08
$$ y = [228132, 85071, -208102, -174767, 99544, 228239, 154777, 138158, 140182, -187147, -381070, -325824, -206535, -64959, 167614, 197040, 225005, 168856, 227264, 132879, -140307, -163925, -242219, -265243, -343184, -247840, 7155, 184292, -16505, -70806, -64682, -152118, -151661, 21811, 308951, 429426, 326157, 317350, 352814, 248902, 258325, 287888, 226544, 222039, 320814, 195566, -27189, -43107, -28880, -68977, -236689, -395345, -387365, -209750, -168857, -44459, -171033, -208411, -212323, -279187, -18278, 135908, 124388, 97507, 173831, 364639, 585847, 808107, 788757, 763254, 702357, 658457, 639068, 625107, 504869, 593790, 539046, 404912, 444501, 484881, 569545, 552691, 568980, 408786, 249809, 317924, 441401, 442009]
21192D42009j71796q0521M1232L7275M1637j93434j97091K20956J77709J40396
21182D58372j22085m4836l2731k18763k8896P8234N2619r0679k1068J08866j39328
21171b95o1076q9315j98476J97571J45619J31112J60830j82616J6644J90730q7605
21160B23123o7604q336m2511r9565J98763J49984P0362j03799P1754j90012j11316
21149I0843J07604N5323j9324q8066o498m1765L2647J26834q8898j97330j93336
21138b21966P9308K41642l3369p8335M157J02976q8351l03636j14735J58753n5853
21127c09409J98046Q4572j70511r0460J45866J18176O1947L5957k25980O0042
21117i1754K25163J02328m4241k81469n5360J40067K80321l2428l4071j41272
$$ y = [442009, 270213, 189692, 230924, 268199, 309836, 116402, -80689, 140267, 317976, 458372, 336287, 291451, 258720, 39957, 11061, 89295, 141914, 51235, 30167, 139033, -295, -61371, -150686, -349162, -151591, -5972, 125140, 285970, 103354, 119998, 310728, 223123, 155519, 147183, 104672, 5107, 203870, 353854, 424216, 320417, 392171, 202159, 90843, 198447, 253770, 234446, 146380, 139882, 98117, 130764, 257598, 168700, -28630, -221966, -142658, 98984, 65615, -12720, -8563, 94413, 6062, -297574, -412309, -253556, -309409, -111363, -26791, -197302, -287762, -141896, -23720, 38227, 74184, -151796, -91754, 133409, 235737, 191496, -89973, -145333, -5266, 275055, 242627, 208556, 67284]
21107F7284k63280K9797j03687j10293J61553M78617R0725O6446r8896j24708
21097A93558j84870j12743J04788m7837J8834K05448m9926j88930k36250K60845
21087c7083L7002K1637N984K3507Q4868K13950K0612J8246P1635R8029l15902
21076B42485j32459R7078P1126m0600k32161j33473J73490K90021R8552q2750
21066C51309Q795q3735j14698O1015J10025P3612j02915q8105m0579j79628r7532
21055a02436M1881J59082K61832j00968j06039J38621o509k8306j57320O7920
21045A67758j9143m1934J66680P9546L2327j65483k00864n4438J00921J84535
21035B49905j08881L5210j70541r7685K3860K58967o0727j6050j14074r8980P4170
$$ y = [67284, -195996, -166199, -269886, -380179, -218626, 259991, 350716, 417162, 318266, 193558, 8688, -104055, 733, -47104, -28270, 177178, 127252, -61678, -297928, -37083, -81, 21556, 27540, 51047, 135915, 349865, 370477, 388723, 460358, 558387, 242485, 110026, 207104, 278230, 237630, 5469, -128004, 45486, 335507, 434059, 351309, 360104, 276369, 161671, 222686, 332711, 406323, 303408, 215303, 174724, -4904, -102436, -60555, 98527, 360359, 259391, 153352, 291973, 285464, 257158, 99838, 167758, 148615, 106681, 273361, 352907, 385234, 219751, 18887, -35551, 65370, 249905, 141024, 176234, 5693, -91992, -68132, 190835, 130108, 114058, -16, -98996, -24826]
21024b4826J40596p0614k8203J09136Q4003j46203K7042J71956L9224O3022J1422
21013C76555j02660J38988N6890q3712k31656r8380j04809j18712m0737J07450
21003a00783K89311J40989L8839k62136j05167J38256J67937J4288J53571m2960
20993D32145l13115M9958M4538q0939J90229N5038J6376m3633q941P346k05430
20982A43572n4123q2493M8767J00544j16440Q5050j06820l2501P7607O3407n4124
20971G2446l9209L16750n2433o6751n0713J87o3445l4029L6025P1427l8455L2524
20959A84324m6295j31789p9842j4266J28803r8253k21664K49375L03111J70033
20949D43537o3990k2595j23772j09939l1893o3758N6341J93379k4986j08917m7328
$$ y = [-24826, 115770, 45156, 16953, 126089, 210092, 63889, 90931, 262887, 302111, 365133, 376555, 273895, 412883, 469773, 386061, 154405, 56025, -48784, -167496, -208233, -100783, 188528, 329517, 368356, 106220, 1053, 139309, 307246, 321534, 475105, 432145, 119030, 168988, 213526, 132587, 322816, 377854, 394230, 350597, 341656, 349002, 143572, 89449, 6956, 55723, 156267, 39827, 124877, 18057, -14444, 63163, 126570, 72446, 33237, 349987, 297554, 230803, 180090, 180277, 116832, 82803, 118828, 190255, 151800, 184324, 138029, 6240, -73602, -87868, 40935, -57318, -278982, -29607, 273504, 443537, 379547, 356952, 233180, 123241, 91348, 27590, 83931, 277310, 252324, 143407, 96079]
20938I6079R6606r0355r1739K6218J20649K5480J31221K9233m7480r5564J04162
20927C04510J16533L4687q9364q4443o3940M3861k2185l25729q3480Q5411J76683
20916I2544p1789o3647L711R3727P6708q098O4057o5057j91762n2932P9109J15216
20904G1787j0645M2210J58025J61058j44639r6323O5673r8594J71046K50665n9698
20893E10565j47451k18010L0606P052N8301P6585p5873j34776R4622O9513J33832
20882D04966j24226j60019L8802J26924k3210r3719k60482o9540K21329J22691
20872A83516J57520N1223j24153o8670l4133J38549M8420O9680J7482q7197l09721
20861D2516m3041J34843M5726J19498N3058l3041J8086L3495m7849j70757K23409
$$ y = [96079, 192685, 102330, 10591, 36809, 157458, 182938, 314159, 343392, 295912, 200348, 304510, 421043, 455730, 366366, 281923, 217983, 261844, 239659, -86070, -169550, -84139, 92544, 20755, -42892, -39181, 54546, 131254, 123156, 187213, 122156, -69606, -122538, -43429, 71787, 61142, 103352, 261377, 422435, 277796, 181473, 247146, 148552, 319598, 570263, 510565, 363114, 145104, 175710, 182762, 241063, 317648, 241775, 106999, 201621, 271134, 404966, 280740, 120721, 159523, 286447, 263237, 169518, -90964, -160504, 60825, 183516, 341036, 392259, 268106, 199436, 165303, 303852, 352272, 421952, 439434, 352237, 42516, -525, 134318, 180044, 299542, 352600, 319559, 337645, 371140, 323291, 152534, 375943]
20850C75943j7723j32113k8900o8402L7570J09784M9717N5577l82985k03456P7010
20839a27978l5113J09111J77875J31927P6547M8995j65751P2742L8624r4305P1985
20828C04659l0199J05523q836r3155j38334J54761K8954j21063k9645J15676K35080
20817E23421N3378j33479o1791N5575l9088r5129L2047R5417J19321j26843M4811
20806D67640j66489j12178J60224j11233j26974j00089k11973p152R0998J18575
20796A349L6427j6051Q4041j03630Q9948K21429N1316J00492K7662k11480j69193
20785A12310J565M0364N0028J4553j4770J62790j36472l14234k1183J97681l7667
20774E4965J42655k7609m305J0068O9640J01784j99408j15786p669j0963J53931
$$ y = [375943, 358220, 226107, 197207, 128805, 166375, 276159, 325876, 381453, -1532, -204988, -127978, -163091, -53980, 123895, 255822, 332369, 381364, 215613, 288355, 326979, 232674, 304659, 274460, 379983, 371147, 277992, 139658, 294419, 323373, 202310, 172665, 288341, 523421, 576799, 443320, 381529, 437104, 398016, 302887, 334934, 430351, 549672, 422829, 467640, 301151, 188973, 349197, 237964, 110990, 10901, -201072, -208224, -117226, 1349, 37776, 21725, 105766, 2136, 92084, 313513, 364829, 465321, 492983, 281503, 112310, 113875, 154239, 204267, 218820, 204050, 366840, 230368, -83866, -105049, 92632, 54965, 197620, 170011, 165706, 175774, 245414, 347198, 147790, 32004, 24335, 13372, 167303]
20763A67303r4632m2797K74109L54726J02190j30097q6912k9066O0896k79026
20753B96694k43094J8738K19858o046M1930o4549k33920j2256Q0951N1245R1546
20742B41097l1003j01092j06258J38301K73900l7225l00249j46433K08118P0793
20732B09949k32302P840L14003Q4011l9459j92329k0450J2427j33626Q5397R5849
20721A91310K09930k4162j06575M7569J15980q6672P7024j13924p9629n4446p962
20710A68443j40219O3549J81856L7823J4461j8922j71568M5494m5906p7012J7340
20699G5339J05729K11898k9280j02028r4598J566j2311j63464J76824J8070n1778
20688A35967j61476R6145K90266J38559O1948p6628j50777J13601O7942p1131
$$ y = [167303, 72671, 29874, 303983, 658709, 760899, 630802, 543890, 514824, 575720, 296694, 53600, 72338, 292196, 286150, 328080, 263531, 29611, 17355, 98306, 149551, 241097, 210094, 109002, 2744, 141045, 414945, 377720, 77471, -68962, 139156, 209949, -22353, -14513, 299490, 383501, 344042, 151713, 131263, 143690, 10064, 95461, 191310, 401240, 377078, 270503, 318072, 434052, 347380, 424404, 310480, 230851, 176405, 168443, 28224, 91773, 273629, 311452, 325913, 306991, 135423, 180917, 135011, 57999, 75339, 181068, 392966, 363686, 261658, 167060, 168626, 156315, -7149, 169675, 187745, 135967, -25509, 70636, 360902, 499461, 561409, 484781, 334004, 447605, 515547, 444416]
20678D44416j38013p8406M7212M6626N3798K770J25147N503j83890j27639l9488
20667A58036Q5766k033L3631m514j93138j13286k7525J58332k0930M4397J72580
20656B91316q3199J09000j82k23854J2157K943P193p4556R7591O9154P453j04031
20644A10985q3255K61607J39507p6565j78788N1181J26982j51222m7855j5640
20634A36937L8273J54014R4932j67176M8885K9089n6333j04621K8694J19226o1969
20623B59951j50768o3887K065J70687M6973Q9186k35516k4374J06442J15948Q0969
20612C97676n7362q0117k907K8870L9319K3369J2633j53558L6453O3028p6332
20601B31072P8150p7345L509n6990P8121J6662L2408J24693j29059r048r814k5315
$$ y = [444416, 306403, 227997, 275209, 321835, 375633, 378403, 503550, 509053, 325163, 197524, 158036, 243802, 241769, 275400, 270886, 77748, -35538, -63063, 95269, 74339, 118736, 291316, 208117, 317117, 316935, 93081, 105238, 108181, 115374, 40818, 138409, 207563, 215016, 110985, 27730, 289337, 428844, 352279, 173491, 224672, 351654, 200432, 152577, 136937, 175210, 329224, 424156, 256980, 305865, 334954, 278621, 174000, 202694, 321920, 259951, 109183, 45296, 47361, 218048, 265021, 354207, 118691, 94317, 200759, 316707, 397676, 340314, 260197, 257290, 286160, 325479, 348848, 361481, 207923, 244376, 307404, 231072, 309222, 231877, 235386, 178396, 256517, 273179, 305587, 430280, 301221, 292173, 282359, 257044]
20589B57044p7048N4509J35186j54246l28053J47989p1134J3901J08755K32190
20579C19093J6297j43900r2617q2669j08308k395N6504j38189j71248J16675L36602
20568A05845J70549j85182j80533J73957R2957j61573N8979J00093q0800r7476
20558c184o7114P1548j48039j0276J37032J60716J49174J00687M1562k70804j21810
20547C9492R5243K32467K35259m1649j2525j8246K0569k21391R0616O2101r1573
20536C90363k755p9991q6060J03474K4658P8589j28962n3110K32314n2409l0464
20525C95647n1156o6455j337J98139M6866j23055p431j84157j6883o0560k6859
20514A02759p5749L4513j5527k8316r6174J48660m204n3967J21701L35707q5309
$$ y = [257044, 179996, 234505, 369691, 215445, -112608, 35381, -35753, -21852, 86903, 319093, 335390, 191490, 98873, 16204, -92104, -94499, -37995, -176184, -347432, -230757, 105845, 276394, 91212, -89321, 84636, 177593, 16020, 74999, 175092, 94292, -3184, -70298, 1250, -146789, -157065, -20033, 140683, 289857, 390544, 432106, 161302, 39492, 134735, 367202, 602461, 560812, 548287, 530041, 550610, 329219, 419835, 481936, 390363, 387608, 307617, 221557, 325031, 349689, 428278, 299316, 246206, 478520, 426111, 395647, 344491, 278036, 276699, 474838, 521704, 398649, 391218, 207061, 190178, 129618, 102759, 27010, 61523, 45996, 17680, -78494, 70166, 65962, 11995, 133696, 469403, 384094]
20503C84094r9749J82195p881j9004j89028j49304j00417J62070J07133j43349
20493A26760J5508J60322K92737J02963k52402j33033q6531K2287J25549M9664
20483D23824r6259j14008M844q6926L4791K5735M4603K31366k28776J4571M9566
20472C03331j84644n5118K02304N1333k0321Q4451k7208j57005J29990J15006
20462D42119J4096k28132k97871O4299p656M6848Q4869K16735J33693J12113k31332
20451C49781j08997J18818J67635n6387k7408o282l511P2101j07534m9437J365
20440C50144K47221J24262k99287j99226K1520q2512J5507Q1372J61522Q4565
20430E05088R1461j773j00610j68064j09442J00342k8968J88175l1513o3264P2756
$$ y = [384094, 284345, 466540, 458659, 439655, 250627, 101323, 906, 162976, 270109, 126760, 142268, 302590, 595327, 698290, 445888, 312855, 226324, 248611, 374160, 423824, 327565, 213557, 218401, 131475, 166266, 192001, 236604, 467970, 239194, 253765, 303331, 118687, 63569, 265873, 317206, 296885, 381336, 354128, 197123, 327113, 442119, 456215, 228083, -69788, -5489, -13145, 33703, 118572, 335307, 469000, 581113, 349781, 240784, 359602, 527237, 470850, 443442, 437160, 433649, 505750, 398216, 348779, 350144, 597365, 721627, 422340, 223114, 244634, 162122, 177629, 259001, 420523, 505088, 596549, 594776, 494166, 326102, 216660, 317002, 288034, 476209, 444696, 381432, 454188]
20419D54188P3437k47133j98253L8017q4183J31597K14243K6851o7443k7448k23898
20408H9975J9681J46995J51864J4876n5361j07872m1656P10j98816K25770k0870
20397B25296k79356K3833L08787J69504J2522j51902L7033J31737J05374k7776
20387E55052k18048m6137o5648n1129J18689l6565J93344P6709j15684j49181
20377B61402j51016k41671N083J19585K77058J47659q7035o3342j7139l45181
20367i4597k63025R5176L27876M5835K3814m2820n1060J28469L0857R4979J34402
20356D29906J05846O5630r154l708q6409p4894j39461j49627n8828m5441J5144
20345D9004O0838N616j5469K18254J52413o1037q382k37617m847k7798Q6508J37027
$$ y = [454188, 527625, 280492, 82239, 120256, 36073, 167670, 381913, 408764, 341321, 313873, 89975, 109656, 256651, 408515, 423391, 368030, 260158, 218502, 219212, 20396, 246166, 225296, -54060, -30227, 278560, 448064, 460586, 308684, 345717, 477454, 582828, 555052, 337004, 290867, 225219, 174090, 292779, 256214, 449558, 526267, 410583, 261402, 110386, -131285, -126202, -6617, 270441, 418100, 331065, 267723, 250584, -94597, -357622, -262446, 65430, 111265, 135079, 92259, 41199, 169668, 200525, 295504, 429906, 535752, 601382, 592228, 588520, 502111, 427217, 287756, 138129, 79301, 33860, 49004, 109842, 115458, 99989, 318243, 470656, 409619, 401237, 163620, 158773, 130975, 217483, 354510]
20333C54510Q6817j6104J06895j36901j55626J31878j88312j62439j56821k0137
20323a56240K73358J17691j9884L0458J6461L9725J81078j2460j40989k2651M3542
20312C50089J51250M0378r8730j78780r5229J61232J28374q7815j46133K4747
20302B49383L5344J53840J23412K7851J21792q0225p1791M870j73723j15913j15081
20291A59759R9850M5804q6635j1284J9391p8048R9148K2007R1886l7406L9929
20280C64401J58102j73236j21328k19141J28745J49424j45714J4922K22159j28795
20270B49539j71216n8573K59570J55403k06363j85620N2324K7667j17893J07242
20260A12080J92077P2407m8549P9563L9405R5346j21607j41182o1448j70519R9104
$$ y = [354510, 441327, 425223, 532118, 395217, 239591, 371469, 183157, 20718, -136103, -156240, 117118, 234809, 214925, 245383, 261844, 301569, 482647, 470187, 329198, 306547, 350089, 501339, 541717, 442987, 264207, 168978, 330210, 458584, 370769, 224636, 249383, 284727, 438567, 561979, 589830, 711622, 631397, 559606, 564476, 390753, 274840, 159759, 259609, 305413, 218778, 207494, 226885, 148837, 247985, 269992, 361878, 324472, 364401, 522503, 349267, 227939, 8798, 137543, 286967, 141253, 156175, 378334, 249539, 78323, 19750, 279320, 434723, 228360, 42740, 95064, 122731, 4838, 112080, 304157, 376564, 328015, 407578, 446983, 542329, 420722, 279540, 218092, 47573, 146677]
20249A46677N4650O7409Q3200q3621j60606Q8738J7592j0263j32654J09982J68778
20238C49882j23616o2798K57625R0315j7655q1547n4853R7626J356m1042P5009
20227D90302K7567O9795q8314K2437K1827j71403n6023K16346j31387J6042j52073
20216B65116J16289K38344o0646Q6607j91164o4213J2609p456J52788j61115j40072
20205B47087J01011m8850k0768J0312N0775q1988M1188j7073K60656K39528j3110
20194G68768j97008q6746O9543j35652j90835L45344J47625k98292q0637J45054
20184D87164J8583q27J03942o1243M1175q3255j69657j09453L06786J1460j07332
20173D37343L5218j46135r1652o5954Q5871J39543R2384J05043k8618l5648k03589
$$ y = [146677, 201327, 268736, 351936, 268315, 107709, 196447, 214039, 203776, 71122, 181104, 349882, 226266, 163468, 421093, 511408, 493753, 412206, 357353, 454979, 456335, 415293, 490302, 517869, 587664, 499350, 521787, 543614, 372211, 316188, 532534, 401147, 417189, 265116, 381405, 619749, 559103, 645710, 454546, 390333, 402942, 395486, 548274, 387159, 247087, 348098, 299248, 278480, 288792, 339567, 257579, 298767, 281694, 542350, 781878, 768768, 571760, 485014, 554557, 418905, 228070, 573414, 721039, 422747, 342110, 487164, 505747, 504920, 608862, 547619, 588794, 505539, 335882, 226429, 533215, 544675, 437343, 472561, 326426, 234774, 168820, 254691, 394234, 486618, 591661, 563043, 527395, 323806]
20162C23806k48632j56124K53024J38387J73661J05979K7690J6803P2534N0473
20152G57601J4747l14740j06582N5618J85644J65076J58405o0580j31243J53234
20142H77180K58537K40156J57327J36673p5898O6624P7076K38244J02315J41377
20132B219611M80055l0702k61961J8624j48087k3858M6666k8314o004O9983J57510
20121B493523j54679j01363q0368l20527j95748N0092k32001l16176l33709j40900
20111F68144k2267k7420K02944J39798j04927j33360j05285j29931K1521J6228
20101E25445j3254K1229m8319n1702J18333O6834O171p7574j23015K78926K69406
20090I72480k11402j34105M9310r7795j30673q4304J47771N2681j56017o5964
$$ y = [323806, 75174, -80950, 172074, 310461, 484122, 590101, 617791, 634594, 707128, 757601, 772348, 457608, 351026, 406644, 592288, 757364, 915769, 855189, 723946, 877180, 1135717, 1375873, 1533200, 1669873, 1593975, 1660599, 1737675, 1975919, 2078234, 2219611, 2699666, 2668964, 2407003, 2425627, 2277540, 2253682, 2300348, 2272034, 2266030, 2336013, 2493523, 2338844, 2237481, 2157113, 1836586, 1640838, 1690930, 1458929, 1142753, 809044, 668144, 645877, 618457, 821401, 961199, 856272, 722912, 617627, 487696, 509217, 525445, 512191, 533420, 485101, 433399, 551732, 618566, 624737, 547163, 424148, 703074, 972480, 761078, 626973, 676283, 578488, 447815, 363511, 511282, 563963, 407946, 341982]
20080C41982L9592K4739p4984J1717J63696L115m2954j59973k4842Q6958Q7358
20069D56404l3206k4696K9673L6743J91515J11964j11187k2235q4013j41959J6530
20058D25533J06753j28490J6923M6858L587O4134Q7278J30425o6528K3728O2839
20047G73040j27625R9637J19313j4836l23399j15947k7221k39750O7990J06461
20037C17663O1036M5508P8795l8049K10909J85849J78709m30689k10047L154n9903
20026C42935o1801j1999J98119K00674M1519m8190R048m2207j77481r8314j07414
20015B44889N2243J66090K8275N215j16057p0642K56393M5987k00680o60p541
20004D03512j45806R4033K47277n3717p1390j588q1785o2768j44852j6933J78797
$$ y = [341982, 381574, 406313, 331329, 343046, 506742, 509857, 466903, 306930, 282088, 369046, 456404, 423198, 398502, 428175, 464918, 656433, 768397, 657210, 634975, 550962, 409003, 425533, 532286, 403796, 420719, 467577, 471164, 535298, 622576, 753001, 686473, 710201, 773040, 645415, 745052, 864365, 849529, 526130, 410183, 382962, 143212, 211202, 317663, 378699, 424207, 503002, 464953, 675862, 861711, 1040420, 609731, 399684, 402838, 342935, 281134, 269135, 467254, 667928, 709447, 661257, 670305, 628098, 450617, 352303, 244889, 297132, 463222, 491497, 496712, 380655, 310013, 566406, 612393, 411713, 411053, 403512, 257706, 351739, 599016, 545299, 473909, 472321, 390536, 327768, 182916, 165983, 344780]
19993C44780j04569j88050K46671L11348J20577k3314l0478J49849L739q5219
19983G45334l8631q4198k9506K6235o7051o9327j8483J61026J5203k0201J68433
19972G88834n2367j00505M6331m0768k54553j53428P7680K95145m7963j76411
19962C81995k27710J76030J53292L2016M194N0609p7154J09459J8075r8768K6962
19951E49000j30214K9130k5857l2263Q9056R92N0240J55903p9699j15711j50592
19940C39985R8916P3688K23191K15586N7321k35293j36450M6275k20455M9094
19930E11858K39074N3946q4022p5143j31047k4719O0964J89909J70858J07710
19920A019388p4158K4756p4805q6376r1837p4120J21053j52368R9060J57456K24089
$$ y = [344780, 240211, 52161, 298832, 610180, 730757, 707443, 676965, 826814, 830553, 745334, 706703, 622505, 592999, 619234, 552183, 482856, 464373, 625399, 640602, 620401, 788834, 736467, 635962, 682293, 641525, 386972, 233544, 311224, 606369, 558406, 381995, 154285, 330315, 483607, 515623, 519817, 570426, 493272, 602731, 620806, 522038, 549000, 418786, 447916, 422059, 389796, 478852, 479844, 530084, 685987, 606288, 490577, 339985, 438901, 512589, 735780, 951366, 1008687, 773394, 636944, 683219, 462764, 511858, 750932, 804878, 720856, 645713, 514666, 489947, 550911, 740820, 911678, 1019388, 945230, 969986, 895181, 808805, 716968, 642848, 763901, 611533, 710593, 868049, 1092138]
19909A092138j92281j62580j41746p8189J79360j05359j74896J12342j50383j24685
19899B53721J88042J7473J8478N6960M1934l3417M6205J74593M5812p4876J02561
19888H37486J39242j28964J4526j10274N5229l6914o3675o3772m1735J61901J6024
19877G79074j01451j08568K31687J26851o2319Q0333N3840n0248o7431K8573j81996
19866G28345p2877K41196J77181l79j18441p4302j21554n2777M8342K0780N1925
19855H27439J42189l201k24348l5236l3057J27793J95355j20903k4094J81492
19845A033429m393j91815J8814L3403m7869l0523k03177j27840L49712L04059
19835A133800N7193j49734n9297q9839Q7550J75617J00905Q1841j19755L3087
$$ y = [1092138, 899857, 737277, 595531, 517342, 696702, 591343, 416447, 528789, 378406, 253721, 441763, 459236, 477714, 534674, 576608, 543191, 589396, 763989, 809801, 734925, 837486, 976728, 847764, 862290, 752016, 807245, 770331, 706656, 642884, 601149, 763050, 779074, 677623, 569055, 800742, 927593, 865274, 945607, 999447, 949199, 881768, 910341, 728345, 655468, 896664, 1073845, 1073466, 955025, 880723, 759169, 706392, 754734, 775514, 827439, 969628, 966427, 742079, 706843, 673786, 801579, 996934, 876031, 851937, 1033429, 1029036, 837221, 856035, 889438, 841569, 811046, 607869, 480029, 829741, 1133800, 1190993, 1041259, 981962, 892123, 979673, 1155290, 1256195, 1338036, 1218281, 1251368]
19825A251368k4038j7889p1007j66457j09436N8835j76815J08320K49300N6361
19815A158542r8899J45733R8222j43930J60401M8044o6191k50937j84053j70860
19805F96072J9852J66795k9714m1629L96005K2692o011J1135J12729K4332j72099
19794A200159o8428r5545J7101J0037Q0486P8358l6829k0193j18728j41906J16238
19783A020750L0975m8764k7199P7244O8398N7639m0652j886J25315N1038j01728
19772A211130j04448j75053j00369o5518k182J86204j34038j38482q3942K29416
19762H22718J69419O4320j24157n2399q4345O0503o4994j41805j50604J77581
19752F76237R9556O1936K25474M7860k2680R6378j04077L9454n1442L6130r3140
$$ y = [1251368, 1227330, 1209441, 1138434, 971977, 862541, 921376, 744561, 852881, 1102181, 1158542, 1059643, 1205376, 1303598, 1159668, 1320069, 1368113, 1301922, 1050985, 866932, 696072, 715924, 882719, 853005, 811376, 1207381, 1230073, 1224062, 1235197, 1347926, 1372258, 1200159, 1131731, 1036186, 1053287, 1063324, 1143810, 1222168, 1185339, 1165146, 1046418, 904512, 1020750, 1051725, 1002961, 975762, 1053006, 1121404, 1179043, 1138391, 1136505, 1261820, 1312858, 1211130, 1106682, 931629, 831260, 765742, 763560, 949764, 815726, 677244, 593302, 822718, 992137, 1056457, 932300, 879901, 795556, 856059, 791065, 649260, 498656, 676237, 775793, 837729, 1063203, 1111063, 1088383, 1184761, 1080684, 1120138, 1068696, 1104826, 1011686]
19741A011686j20287j01265J15806L6152J41757N3791N0437J07624K47315J43340
19731A686356q0146o3631l19687o5111J52514K23452K70737K3488J25019K11847
19721B164838K820j01320l8572L07004K63008K64417K85626J45475J30975k03158
19711C221113k67770k27993k20594k98461O9136p51m1354p6275J97272n3274L6630
19700B337679J55232o2845j6825J24683L04K7026j29308k27332J13081K27056
19690B548751J05808m8383k8569O1985o4102k1441r0086j06057J20822K50501
19680B729229J24530J87440K07343J19906O2345k36999q6284J36611M12431N38139
19670D194691L14911K65620J99981K08066j09357p697P7300J67425j67370k3024
$$ y = [1011686, 891399, 790134, 905940, 942092, 1083849, 1137640, 1188077, 1295701, 1543016, 1686356, 1606210, 1542579, 1222892, 1157781, 1310295, 1533747, 1804484, 1827972, 1952991, 2164838, 2167658, 2066338, 2027766, 2334770, 2597778, 2862195, 3147821, 3293296, 3424271, 3221113, 2953343, 2725350, 2504756, 2206295, 2275431, 2274680, 2233326, 2157051, 2354323, 2301049, 2337679, 2492911, 2430066, 2413241, 2537924, 2538228, 2565254, 2435946, 2208614, 2321695, 2548751, 2654559, 2606176, 2577607, 2639592, 2575490, 2554049, 2463963, 2357906, 2478728, 2729229, 2853759, 3041199, 3248542, 3368448, 3430793, 3193794, 3107510, 3244121, 3656552, 4194691, 4509602, 4775222, 4975203, 5183269, 5073912, 5066215, 5143515, 5310940, 5143570, 5120546]
19660E120546K19104J16435j33782j07675j17869l40645l94371j97634K6534L5765
19650D226408j33217L8188p785l34432J30009J23118j15586j67633L1308K05137
19640C995515J55528K63744J76131l07874j94370l145N1477l2417j4788K34347
19630D324148K12901L08777K78643K49089J23712J71950L96258K87660L06181
19621F659319K65552K14805M38271K95887L10288M29829N99355N55090N57959
19612A0326355O22217O26824Q19725Q75625R38044J478715J747931J533507J601392
19603B0570335J613024J639610J999710K369195K965599L617017M583008N798964
19595D5156462P756047J0260670J4294048K1073493K9443543L5008754L2358411
$$ y = [5120546, 5339650, 5456085, 5322303, 5214628, 5096759, 4756114, 4361743, 4164109, 4190643, 4226408, 4093191, 4131379, 4123594, 3789162, 3919171, 4042289, 3926703, 3759070, 3790378, 3995515, 4151043, 4414787, 4590918, 4283044, 4088674, 4085529, 4137006, 4104589, 4089801, 4324148, 4537049, 4845826, 5124469, 5373558, 5497270, 5669220, 6065478, 6353138, 6659319, 6924871, 7139676, 7577947, 7873834, 8184122, 8613951, 9213306, 9768396, 10326355, 10948572, 11575396, 12395121, 13270746, 14208790, 15687505, 17435436, 18968943, 20570335, 22183359, 23822969, 25822679, 28191874, 31157473, 34774490, 39357498, 45156462, 52912509, 63173179, 77467227, 98540720, 127984263, 162993017, 195351428]
19588A95351428K7039714K9207205L0056777K0526374J2599652J4928409J8298792
19581C48008351J9486751J1660136Q878108J4497959K568249k4931693k2131094
19574C58036767p374602m520852k069024J204691J507716p687521k6855254l2433806
19566B79808115k8939120l9885838n1396463m0575693k4092261j4522937r956013
19559G0439790o902778n118624m142988l791962l444342l028328k489686k621712
19551C8899370k814959k559278k363329k198669j938387j842801j313775j356985
19543B2511187j011105j050262j097940p25663q91779q19508q57908o96004o52991
19534A4708027o98163m93934o58356l92448k72068n28790m49950n55767l82310
$$ y = [195351428, 222391142, 251598347, 281655124, 302181498, 314781150, 329709559, 348008351, 367495102, 379155238, 388033346, 402531305, 405099554, 380167861, 358036767, 350662165, 346141313, 344072289, 345276980, 346784696, 339097175, 312241921, 279808115, 250868995, 210983157, 159586694, 119011001, 94918740, 80395803, 70439790, 63537012, 58418388, 54275400, 50483438, 47039096, 44010768, 41521082, 38899370, 36084411, 33525133, 31161804, 28963135, 27024748, 25181947, 23868172, 22511187, 21500082, 20449820, 19351880, 18626217, 17734438, 16914930, 16057022, 15361018, 14708027, 14009864, 13515930, 12857574, 12465126, 12193058, 11664268, 11214318, 10658551, 10276241]
19525A0276241j72201k06661k57536l57492l32468k61942n05135l07938k49778
19516G625090m93239k96178k25648m41664q0159J95739r1094k66903k05687j8885
19506E701372M0030q4668o1090J5486o5600L5646m7320m93770j97715k6023k24030
19495D592318k25582k91566k54482q4196j07280j40794j20721J17549j8108o0990
19485C406148k25881n6944J48695j49407j10371k51984j49772o4826o7422k9658
19475B448578J3021K2729k46870j28739m3852K8538j60648k01185o9537J31966
19465A794001J33714q9245j20499N2991O6190j65728k10535j05921n7463N9281
19455A356786o0626J0979J24571J74792K05618l9437j96008n8394n3130k6632
$$ y = [10276241, 10104040, 9897379, 9639843, 9282351, 8949883, 8687941, 8182806, 7874868, 7625090, 7131851, 6835673, 6610025, 6168361, 6088202, 6283941, 6192847, 5925944, 5720257, 5701372, 5741402, 5656734, 5595644, 5611130, 5545530, 5581176, 5533856, 5040086, 4842371, 4816348, 4592318, 4366736, 4075170, 3820688, 3736492, 3629212, 3488418, 3367697, 3485246, 3467138, 3406148, 3180267, 3123323, 3272018, 3122611, 3012240, 2760256, 2610484, 2545658, 2478236, 2448578, 2461599, 2484328, 2237458, 2108719, 2064867, 2093405, 1932757, 1731572, 1662035, 1794001, 1927715, 1838470, 1717971, 1770962, 1837152, 1671424, 1460889, 1354968, 1297505, 1356786, 1296160, 1307139, 1431710, 1606502, 1812120, 1772683, 1576675, 1518281, 1465151, 1438519]
19445A438519J97524j16673j69356j89186p6986q3398k3320N8145K3917j4531
19435A044655k14986j02422l766K20877j43250j57485R4263K1472K3054J45707
19425I28119L500R862o8379K767r4024r7041K48181j22826m9720j02779m7369
19414F10291O559J07269k9513k7979L2454p3634p4964p2470J35692J10165p2132
19403F51738K04765o9020P2493J83658J79865j2180j58477L5030O9660N2892J7689
19392A228113j97709R8502J18500R973r9623j73686L7173J4621Q872m1997J40543
19381A143282j78304p7972M4837J82265R0456l8123j61304j084L1156q602K0819
19370A047426l202N2591R849J07783R9965l6389m7322n0758k950l1583j6036M1883
$$ y = [1438519, 1636043, 1519370, 1350014, 1160828, 1083842, 1000444, 977124, 1035269, 1059186, 1044655, 829669, 727247, 723481, 944358, 801108, 643623, 737886, 759358, 782412, 928119, 931619, 941481, 873102, 875869, 781845, 684804, 932985, 810159, 760439, 657660, 610291, 616850, 724119, 694606, 666627, 699081, 625447, 550483, 478013, 613705, 723870, 651738, 856503, 787483, 859976, 1043634, 1223499, 1211319, 1052842, 1087872, 1157532, 1210424, 1228113, 1030404, 1128906, 1247406, 1257379, 1157756, 984070, 1021243, 1035864, 1044736, 1002739, 1143282, 964978, 887006, 931843, 1114108, 1204564, 1166441, 1005137, 1004053, 1035209, 1026607, 1047426, 1044224, 1096815, 1106664, 1214447, 1314412, 1278023, 1230701, 1179943, 1176993, 1145410, 1129374, 1171257]
19358A171257Q7645m955L1156N9035o2071L2403l8531m6370K25119J64671R4371
19347A713730o656K79887N6212k03001J04264R8659j28481j11140p1025m621j14691
19336A613137j41230j47667L2066K4094O3880K8036O7394j05476j40305m6992
19326A246937L3705J34478J38630J32421o1417J25137L3490R672M7441p7080q5897
19315A677517J63396K67940P8458k2673q591j69441l21804k90838o1978K13175
19305A525161m5667j80971j47844k67391J27489K38348J88546L01719K38420K32904
19295B210714K6902J86662Q7740k10632Q9338P1074K70311O5018l2186j77463
19285B587478l65139m33772k19035n766l82956j20736J03025n8157n2501K81016
$$ y = [1171257, 1258902, 1253947, 1285103, 1344138, 1282067, 1314470, 1275939, 1229569, 1454688, 1619359, 1713730, 1707074, 1986961, 2043173, 1840172, 1944436, 2043095, 1914614, 1803474, 1732449, 1727828, 1613137, 1471907, 1324240, 1356306, 1380400, 1444280, 1472316, 1539710, 1434234, 1293929, 1246937, 1280642, 1415120, 1553750, 1686171, 1624754, 1749891, 1783381, 1793053, 1840494, 1763414, 1677517, 1840913, 2108853, 2187311, 2164638, 2156047, 1986606, 1664802, 1373964, 1311986, 1525161, 1479494, 1298523, 1150679, 883288, 1010777, 1249125, 1437671, 1739390, 1977810, 2210714, 2237616, 2424278, 2512018, 2301386, 2390724, 2461798, 2732109, 2797127, 2764941, 2587478, 2222339, 1788567, 1569532, 1563766, 1180810, 1060074, 1163099, 1104942, 1052441, 1333457]
19275A333457J49424K1067O9304k34043j09710L88372M59040J79142J96268M21735
19265B874056J59324P7362K3118j6799o1451J82299L03882p9106m0710p626j15625
19254C298724l06680j11194j17128q4711k3465P9961J55537j4548r6374l3305
19244B746817K21120K95095r4277k42349N0208J66827J29703O1397j09767j3982
19234C210792o1816r2898K01555J42312J66016J46455J20912M54356J32739L12898
19224D733321L06757K21279J10471L91898L26269k0438L9808J17145K5223J27173
19214F378906K83068P9482n7896L4291J52484K84983N07574L15512L35178R28264
19204I241846P98803Q71588J552733J666605K444204L803496N956656Q717869
$$ y = [1333457, 1482881, 1503948, 1573252, 1339209, 1229499, 1617871, 2076911, 2256053, 2452321, 2874056, 3033380, 3110742, 3133860, 3117061, 3055610, 3237909, 3541791, 3462685, 3421975, 3414349, 3298724, 2992044, 2880850, 2763722, 2679011, 2655546, 2735507, 2891044, 2876496, 2780122, 2746817, 2967937, 3263032, 3168755, 2926406, 2976614, 3143441, 3273144, 3334541, 3224774, 3210792, 3148976, 3056078, 3257633, 3399945, 3565961, 3712416, 3833328, 4287684, 4420423, 4733321, 5040078, 5261357, 5371828, 5763726, 6089995, 6069557, 6109365, 6226510, 6251733, 6378906, 6661974, 6741456, 6683560, 6717851, 6870335, 7155318, 7662892, 7978404, 8313582, 9241846, 10040649, 10912237, 12464970, 14131575, 16575779, 20379275, 26335931, 35053800]
19196C5053800J0821288J0740748Q685100Q806579R981068P271048K874365K224565
19188I6458561K468505L001186R55505o047455p739883n330004j0374084j7803781
19180E5588550j4290973p618520m025717k442848j669627r39972m00513k33071
19172B3967309j45930k28083k10446r1110q693Q6591R8027k13817J4027M91124
19162B3758999M46208M64928M74906P82801J137990J249112J610609K422013L157446
19153C5505012L484158M180288N514033O769141R184619J2503846J7297952K5448424
19145A19887473L8452750N4741765O4790791N7501999M2773100M2013068M2613430
19138D62774376K9309068J7734398J7959010J6919038J4571487r682936m6766363
$$ y = [35053800, 45875088, 56615836, 65300936, 74107515, 84088583, 91359631, 94233996, 96458561, 98927066, 101928252, 102883757, 96836302, 89096419, 83766415, 73392331, 55588550, 41297577, 33679057, 29653340, 27210492, 25540865, 24600893, 24200380, 23967309, 23821379, 23593296, 23382850, 23291740, 23283047, 23369638, 23467665, 23253848, 23267875, 23758999, 24205207, 24670135, 25145041, 25927842, 27065832, 28314944, 29925553, 32347566, 35505012, 38989170, 43169458, 48683491, 55452632, 64637251, 77141097, 94439049, 119887473, 158340223, 213081988, 277872779, 335374778, 378147878, 420160946, 462774376, 492083444, 509817842, 527776852, 544695890, 559267377, 549584441, 502818078]
19131E02818078m7067061l5189207n6309381p1431859m4586929j0540145J7066182
19124B54759678L5877320L6574639J5790965k933532n541427M44377J1502580
19117C46474600K3292832K7499686K5778358J5901966j7149134k8393497j7464991
19110C75939820j9465306k1856292j7381280q148688L631306J2270294J0152539
19103C35142393J443536k5707768o4127684o4098558m2107013k5580744j6183992
19096I8780170j1003799q118378o439878n094136m333474l921075l453729k836852
19088E3578849k524755k461232k197163k119932j577234j324972j211605r72837
19080C9189119j135722r07375q20482l16683J21789P50092K116667L887813O467329
$$ y = [502818078, 455751017, 420561810, 364252429, 292820570, 248233641, 237693496, 254759678, 290636998, 327211637, 343002602, 340069070, 334527643, 334972020, 346474600, 369767432, 397267118, 423045476, 438947442, 421798308, 393404811, 375939820, 356474514, 334618222, 317236942, 309088254, 312719560, 324989854, 335142393, 336585929, 310878161, 246750477, 182651919, 140544906, 114964162, 98780170, 87776371, 79657993, 73218115, 68123979, 63790505, 59869430, 56415701, 53578849, 51054094, 48592862, 46395699, 44275767, 42698533, 41373561, 40161956, 39189119, 38053397, 37146022, 36325540, 36008857, 36130646, 36880738, 38997405, 42885218, 49352547]
19071D9352547Q351587P013532K295445p92547r37061M49726K677194M957867
19063G3368290N510785N299305L138001k812710k584530j645059l875648m151823
19055G2246611k799441j033503J970202L667025K347549O72877p465784j6240871
19047E3364665j3198180p722731m541003k911456j999003j497718j174393q78718
19039A9441463q77857j098517q10340n35396o22120m73568p88666n81150l33196
19030A3320653k79141k71504k19853m26743n42539m58962l48870k47386l23007
19021A0202648m15418l74991n75662m23005m45145j64779K1306m37607j24162
19012G263185j48250k14628m00195j41468k41792l63659l68787k65105k53546
$$ y = [49352547, 57704134, 64717666, 67013111, 66220564, 65283503, 65733229, 68410423, 73368290, 78879075, 84178380, 87316381, 84503671, 81919141, 80274082, 76398434, 72246611, 69447170, 68413667, 70383869, 74050894, 76398443, 77071320, 69605536, 53364665, 40166485, 32443754, 27902751, 24991295, 22992292, 21494574, 20320181, 19441463, 18563606, 17465089, 16654749, 16119353, 15497233, 15023665, 14234999, 13653849, 13320653, 13041512, 12770008, 12550155, 12123412, 11580873, 11121911, 10773041, 10525655, 10202648, 9787230, 9412239, 8836577, 8413572, 7968427, 7803648, 7824954, 7387347, 7263185, 7114935, 6900307, 6500112, 6358644, 6116852, 5753193, 5384406, 5119301, 4865755]
19003D865755k64906k34152L3552k09786j20904q2288j13692J4929j18765k90850
18993C478893k103j31633l61508k09875q5841M7835j2560J23108L3569j41320
18983B738565k68530j01944j14652j21266j61J54963J42096p8405k76124J48133
18973B222675p0518K694R433J20313Q7300j40062m21446j68026j12590j0171j76358
18962A343244j66348L00000J6435k49116K7873N3234J13911M415o2446l5682k16678
18951A128842L9674M9150j89565J9840R1225q0262j40931L9115n8040j08265j47775
18940F43008j7037K1229J34676L1858m5157j05939R3249j2563n6239N9462K9627
18929G76174K5460J54071j61771j57197N4370K1722p2116K20728m1502n7017J7314
$$ y = [4865755, 4600849, 4366697, 4400249, 4190463, 4069559, 3987271, 3873579, 3888508, 3769743, 3478893, 3476790, 3345157, 2983649, 2773774, 2687933, 2735768, 2723208, 2846316, 2879885, 2738565, 2470035, 2368091, 2253439, 2132173, 2132012, 2286975, 2429071, 2350666, 2074542, 2222675, 2152157, 2154851, 2164284, 2284597, 2371897, 2231835, 1810389, 1642363, 1529773, 1519602, 1343244, 1176896, 1476896, 1493331, 1244215, 1272088, 1325322, 1439233, 1443648, 1381202, 1345520, 1128842, 1168516, 1217666, 1028101, 1047941, 1139166, 1058904, 917973, 957088, 899048, 790783, 643008, 625971, 647200, 781876, 813734, 768577, 662638, 755887, 743324, 687085, 746547, 776174, 801634, 955705, 793934, 636737, 691107, 712829, 640713, 861441, 819939, 762922, 780236]
18918G80236Q6398o9005l41908j56615K6933k09159k29167L84292J74329q9534
18908C56800k10625P0299m3942R0193J28820K0760J09684j5653j9792j29330J34993
18897D92207k5400O1711j12307j72363j19959M2713K2142L33356J82370o0901
18887F43569K7519j95048j33085j14198J1543K22390K17977q2945l7922j03284
18877D56516j07968j71960J02760k14898j14789J80574R3731k5684K14586J8403
18867D31271j37008O702q8759p5225K28462J02159N436q0528k5566p0066j85794
18856A11084j12705r6048j28232l34804K0656N3987Q0218J10905J04570N7366
18846a33003k3484N0371K91665j4953j59235j47789K26422R0144j94875K920O0625
$$ y = [780236, 866634, 797629, 455721, 299106, 326039, 116880, -112287, 272005, 446334, 356800, 146175, 216474, 172532, 262725, 391545, 412305, 521989, 506336, 486544, 357214, 492207, 466807, 528518, 416211, 243848, 123889, 166602, 188744, 522100, 704470, 643569, 671088, 476040, 342955, 228757, 240300, 462690, 680667, 597722, 559800, 456516, 348548, 176588, 279348, 64450, -50339, 130235, 223966, 198282, 412868, 431271, 294263, 300965, 212206, 136981, 365443, 467602, 473038, 392510, 366944, 296878, 111084, -1621, -97669, -225901, -560705, -540049, -486062, -405844, -294939, -190369, -133003, -156487, -106116, 185549, 170596, 11361, -136428, 89994, 180138, -14737, -11817, 48808]
18835D8808r2220j32119m3467p2504J18919Q9857K7832j16309K5999l5348J93201
18824A2649J07835p5044q0430L29387J29111o0497j72460j53493q5620j57747
18814b06309J41882J02915O1693m5063J2743k3672O4636Q7747M6945o8096J75191
18803C50612Q5136R2678K1517n2761j43969l1614o6071J00633K75755J66810k31065
18792E67661j24224P2366P5986K12856M6411J28067j15108j50161k13170k63J42984
18781F43405J20380o8466k45293r9520J68404q0334k40836j60295p0807j39612
18771a72974K70347J12380p5751r6500R6467Q8867J26608j50622Q948p0694k39878
18760a02802j3281J58577N818P1907j16529N085j41406K0480o0098K02441J62576
$$ y = [48808, -43412, -175531, -218998, -291502, -172583, -82726, -54894, -171203, -145204, -180552, 12649, 120484, 45440, -34990, 294397, 423508, 363011, 190551, 37058, -48562, -206309, -64427, 38488, 100181, 55118, 67861, 44189, 108825, 196572, 243517, 175421, 350612, 435748, 528426, 549943, 497182, 353213, 321599, 255528, 356161, 631916, 798726, 567661, 443437, 515803, 591789, 804645, 851056, 979123, 864015, 713854, 500684, 500421, 643405, 763785, 695319, 450026, 350506, 518910, 438576, 197740, 37445, -33362, -172974, 97373, 209753, 134002, 37502, 133969, 222836, 349444, 198822, 207770, 137076, -102802, -116083, 42494, 48312, 120219, 3690, 8775, -132631, -112151, -172249, 30192, 192768]
18749A92768Q5942J07647P5943K41433J42346k6838j9102r0413o8646k14460j87458
18738B39162J1597K0241K29643J83385p3911o1864r381l3488p1787j47116L6694
18727C23175n1516j69660m0306O224J14729J10637j3652J4381j87002k45016j10361
18716b48367R0370K9065J31575J35011J26129K3627K7302k6267O7106j9947k34143
18705A01461J2751N1460j79510j49334J46036J29194l4444j18269N1396m3235
18695c2494m8230o5555j40248n06176l5901J37940J56672P0368L01890R5321r5361
18684a61774o8513L0207m3357m5992K28844M6012K7891M9699m0120n248N4753
18673G2402J6928r8442K55553p527M7771J78170J26107J56570J16433K2253J16631
$$ y = [192768, 278710, 386357, 462300, 703733, 846079, 819241, 800139, 709726, 641080, 426620, 239162, 250759, 271000, 500643, 684028, 610117, 548253, 538872, 505384, 433597, 286481, 323175, 271659, 101999, 61693, 67917, 182646, 293283, 279631, 294012, 107010, -138006, -248367, -157997, -128932, 2643, 137654, 263783, 287410, 314712, 288445, 355551, 335604, 101461, 114212, 165672, -13838, -163172, -17136, 112058, 77614, -40655, 10741, -32494, -80724, -146279, -286527, -792703, -828604, -690664, -533992, -463624, -161734, -66413, -161774, -230287, -200080, -243437, -289429, -60585, -14573, 13318, 63017, 22897, 17649, 72402, 89330, -9112, 246441, 238914, 286685, 464855, 590962, 747532, 863965, 886218, 1002849]
18662A002849o481j1285m3154O2781N8573m2768L2137J83002K62300L60190J13195
18651A971339J67677J66814k8555J00274L1706J06785L94329J258m9038j71401
18641B691188k01263j01540j20401k06748j42866o8704J06774j11167O5848N6507
18631A967628J4639m8033k03904k96308k41036l77513j65563j20563k69443k17428
18621D2476O9516Q1969m4710L7605J42785M9151K30324K98490J8048o7433k02611
18610F55610j10233J05964J80833o4718j54811q1342k3649r0062P2473K23848
18600G13913J56941N6225J55931J27785k33336k51108Q9928O2700K85861J49974
18590A314814J2493J70378j0879K86753K34960L03541J19522Q3466o0442N1571
$$ y = [1002849, 996368, 985083, 941929, 1004710, 1063283, 1020515, 1052652, 1235654, 1497954, 1858144, 1971339, 2139016, 2305830, 2277275, 2377549, 2409255, 2516040, 2910369, 2911627, 2862589, 2691188, 2489925, 2388385, 2267984, 2061236, 1918370, 1849666, 1956440, 1845273, 1911121, 1967628, 1982267, 1934234, 1730330, 1434022, 1192986, 815473, 649910, 529347, 259904, 42476, 111992, 193961, 149251, 186856, 329641, 378792, 609116, 907606, 925654, 858221, 655610, 545377, 651341, 832174, 767456, 612645, 531303, 507654, 417592, 490065, 713913, 870854, 927079, 1083010, 1210795, 977459, 726351, 816279, 878979, 1164840, 1314814, 1327307, 1497685, 1486806, 1773559, 2008519, 2312060, 2431582, 2515048, 2454606, 2506177]
18580B506177L529J52114j4337l01059l04541l53036p9906J66080j30680k46990
18570A397351j7973K7116l5576J20495L2075q3948j29410j84786j33072j23395
18560H68877k34889n6000J4458j85394j13187j33623k2858j4044R4304n7926L4746
18549A94464k7491r2581n3232J10901J56128N11P1004n0136k239O8142j3829j34985
18537B26657q8329K27607M82570J03631j96400j75224Q927N0788n4695p0845K91876
18526H06563O3617j84795j60286K63034J36026O5149J99883K5764j80084j7410
18516A017461J31313k13446M9200N4887Q4389k4847k51353j55971j89325j48061
18506C54247N9561P8529M0661q0693k51027M611K35024K601k50590l9336M4316
$$ y = [2506177, 2509706, 2661820, 2647483, 2346424, 2041883, 1688847, 1608941, 1775021, 1644341, 1397351, 1379378, 1406494, 1370918, 1491413, 1523488, 1439540, 1310130, 1125344, 992272, 868877, 633988, 577988, 592446, 407052, 293865, 160242, 137384, 123340, 217644, 159718, 194464, 166973, 74392, 21160, 132061, 288189, 288700, 359704, 309568, 307329, 375471, 361642, 226657, 138328, 365935, 848505, 952136, 755736, 580512, 589439, 640227, 585532, 514687, 806563, 870180, 685385, 525099, 788133, 924159, 989308, 1189191, 1214955, 1034871, 1017461, 1148774, 935328, 984528, 1039415, 1123804, 1098957, 847604, 691633, 502308, 354247, 413808, 492337, 532998, 452305, 201278, 205889, 440913, 443514, 192924, 153588, 197904]
18495A97904O6533J28174j50683j23918Q1285j12858p7775j32523P1217K27783
18485A75139K8919l62898j72768Q8521K25894P8613J8965o6306J07991k7991j0287
18474H3792J02850o5049J9775k5640j22808j92700j04021q7219J05231O9943K3626
18463a92220J81695J33106J31858j1981l9462J0546L5880l4928j90640j29520
18453a05666j08726M0111p8855P3987R1186j1612L3565l5960r9154k13390j70104
18442e84618N8969K03549j04165l1378Q3190k652J71134J41930M0066j61241o7859
18431b53075j20976j78968p7041K08118J73621J24391j42574j07639R8756J29614
18421a45773L14084J78253j39299o8645j14615l3054p4050m0409j86670n7866
$$ y = [197904, 264437, 392611, 241928, 118010, 199295, 86437, 8662, -123861, -52644, 175139, 204058, -158840, -331608, -243087, -17193, 61420, 80385, 14079, 122070, 94079, 83792, 186642, 121593, 141368, 115728, -7080, -199780, -303801, -391020, -285789, -215846, -192220, -10525, 122581, 254439, 242458, 202996, 213542, 249422, 214494, 23854, -105666, -214392, -174281, -253136, -179149, -87963, -99575, -66010, -101970, -201124, -414514, -584618, -525649, -322100, -426265, -457643, -374453, -377105, -205971, -64041, -23975, -185216, -253075, -374051, -553019, -630060, -421942, -248321, -123930, -266504, -374143, -275387, -145773, 168311, 346564, 207265, 138620, 24005, -9049, -83099, -123508, -310178, -368044]
18411c68044k9450J40860K26547J46522m7924m3766k8954j36980m463J23039J36258
18400A13645J09218m1105o4438r6834K20414K10034J81376k02142k16883j12300
18390A00985q07j03271k15550j7094L39530P3611j60721J11532K19120j34054
18380B13281j33519m6151N2100K2833K10630J35499J7091J97492J67616O1381
18370H98253L4850k41527J06118L42203l430j31058j33951J16365Q4040p0142
18360A001721j74893j6005K9180M5096J16423n0149k00278J56883l5658k34558
18350F37762r7787Q2740K1144j80176j16399j70230L5869N1873m9654j68841J26427
18339A72728J28974o6885J41601M6799j65353q4127j00936j09507P2246l3160
$$ y = [-368044, -397494, -256634, -30087, 116435, 68511, 24745, -4209, -141189, -145652, -22613, 113645, 222863, 181758, 117320, 20486, 240900, 450934, 632310, 430168, 213285, 100985, 100178, -3093, -218643, -235737, 103793, 177404, 16683, 128215, 347335, 213281, 79762, 33611, 85711, 108544, 319174, 454673, 471764, 669256, 836872, 898253, 933103, 691576, 797694, 1139897, 1136467, 1005409, 871458, 987823, 1071863, 1001721, 826828, 810823, 840003, 885099, 1001522, 951373, 751095, 907978, 872320, 637762, 539975, 622715, 643859, 463683, 347284, 177054, 212923, 264796, 215142, 46301, 172728, 301702, 234817, 376418, 423217, 257864, 173737, 72801, -36706, 35540, 2380]
18329B380L2439L41542L1564O1621L60481K58991J57732J52890m4991o5169J97700
18318A487180L6473n7107o9407R7823M0404j24613l1643J13515k91832l54912
18308H45881l21914k80966p5946o1857K2637J35787r1013j04794J83884k03205
18298D8494k02872k80961o7568J64858P4799o874R8785J82055L6125l20663j27415
18287d01237K18606n1955j45944j60455l7394J18756K75791P3322J13392J2735
18277A5617J50710m1009k89969O0970J58014q6776J3711R2622K30733j00263k99835
18266i5475j0038Q7569J07120j06888j32808j0223k17082K03003J52059m8885
18256g1648P9597L4134J52994j98589j23964n6538o400J83478O4015J15470k05201
$$ y = [2380, 34819, 376361, 407925, 469546, 830027, 1089018, 1246750, 1399640, 1354649, 1289480, 1487180, 1523653, 1466546, 1397139, 1494962, 1535366, 1410753, 1379110, 1492625, 1200793, 845881, 523967, 243001, 167055, 105198, 127835, 263622, 172609, 67815, 251699, 48494, -154378, -435339, -502907, -338049, -263250, -270124, -171339, 10716, 46841, -273822, -401237, -182631, -234586, -380530, -540985, -578379, -459623, -183832, -110510, 2882, 15617, 166327, 125318, -164651, -103681, 54333, -32443, -18732, 73890, 304623, 204360, -95475, -105513, -17944, 89176, -17712, -150520, -160743, -377825, -174822, -22763, -71648, 7949, 42083, 195077, -3512, -127476, -184014, -190414, -6936, 57079, 172549, -32652]
18245c2652r2421m4524J54904J38854n7652q8567J45575R7126j07913o8897L7027
18234H0860R5643K04025n4389m4093K4554j35193p1751Q7711j8120j0775J21655
18223B80127L9186j4274N89k1659R4577p9748J61417R1032j955j78266k90336
18212H0690J23112J28411q8477M8532O3084o00j29798j31687j05363L0611j76667
18201a58152p8943Q845J49721J96867r0335j78483k329N7484K15522P4404m2761
18190A51840l8339j58837k5440m3173K8657j08727p7537R3809q8237k2450r268
18179b97702Q3547M14152L0198k30971l7173K593P3607J16679J44159q5732N1389
18168B64746R411j00740j14949J87531K03980n195j50417k26121m2138k6078N9791
$$ y = [-32652, -125073, -169597, -14693, 124161, 66509, -22058, 123517, 220643, 112730, 43833, 80860, 176503, 380528, 326139, 282046, 306600, 171407, 99656, 187367, 169247, 158472, 280127, 319313, 305039, 305628, 283969, 378546, 298798, 460215, 551247, 549292, 371026, 80690, 203802, 332213, 243736, 292268, 355352, 354752, 224954, 93267, -12096, 18515, -158152, -237095, -228250, -78529, 118338, 28003, -150480, -152809, -95325, 120197, 194601, 151840, 113501, -45336, -70776, -113949, -85292, -194019, -271556, -177747, -265984, -288434, -297702, -214155, 199997, 230195, -776, -37949, -35356, 38251, 154930, 299089, 213357, 264746, 274157, 173417, 58468, 245999, 449979, 444784, 294367, 68246, 26108, 30, 59821]
18157E9821J12605K30143p2204r5391j98292m8213J9885P2721r4543J6079J4608
18146A7219K61226M66478J02180J07259J85921J22050j24914J21037J35003j04991
18136A288468O0072j09781K0478J84291N3175l6405k24262k8737K8019J09123
18126A344441k2995N5923k7970r7044j6668j57766J42511K78600K23500k86861
18116A435671m09321j20808k28604O1585J06350n5935j46729q7502j43911L1352
18106D42148n6131j42342k58941r0095K8039r8686J59076K70587K32745n2125
18096D34275j5312l9040j12204J1984J64150j27947k82970j24891j752n5273Q270
18085a40710M5001r932J02733J39492o7855r1446J43903P9681n1867R7707n4351
$$ y = [59821, 172426, 402569, 330365, 234974, 36682, -11531, 8354, 81075, -13468, 2611, 17219, 278445, 744923, 847103, 954362, 1140283, 1262333, 1137419, 1258456, 1393459, 1288468, 1348540, 1238759, 1259237, 1443528, 1496703, 1460298, 1236036, 1207299, 1235318, 1344441, 1321446, 1377369, 1349399, 1252355, 1235687, 1077921, 1220432, 1499032, 1722532, 1435671, 1026350, 905542, 676938, 738523, 844873, 788938, 642209, 554707, 410796, 442148, 386017, 243675, -15266, -105361, -77322, -176008, -16932, 253655, 486400, 434275, 418963, 379923, 267719, 279703, 443853, 315906, 32936, -91955, -93707, -148980, -140710, -95709, -105641, -2908, 136584, 68729, -22717, 121186, 200867, 149000, 246707, 192356]
18074A92356O587J49073K09931J29878l01717j03455K69517K48406k22129j33257
18064D45190L8372N3277o1217J28282j29992k00544l9978p6485n6538J49794Q1745
18053C31906k48989o0199K6772j43870j22022K58261j6199j12470o2664M6215
18043a03259j02588K19225J18808m8924j56565q2492j04848O5641J46642J47124
18033I8764q233m2421J37093q1524k61847Q98N635K7236q0880J34819J75772J48378
18021B53690j26925l0131M8433K30300K0875J47822J82873k4419M183J14765J9348
18010H40814J02940K27065J78828k50904k9535Q1502J48157j37807j45707K9761
18000A045114R9182N3128j88918k92585k12454j5802j30705J7807J84355Q8172
$$ y = [192356, 198943, 348016, 557947, 687825, 386108, 282653, 552170, 800576, 578447, 445190, 483562, 536839, 475622, 603904, 473912, 273368, 233390, 156905, 100367, 250161, 331906, 82917, 22718, 49490, -94380, -216402, 41859, 25660, -86810, -149474, -103259, -205847, 13378, 132186, 83262, -73303, -155795, -260643, -195002, -48360, 98764, 90531, 48110, 185203, 103679, -158168, -157270, -151635, -124399, -205279, -70460, 105312, 253690, 126765, 96634, 145067, 375367, 396242, 544064, 726937, 702518, 706701, 821466, 840814, 943754, 1170819, 1349647, 1098743, 1069208, 1150710, 1298867, 1161060, 1015353, 1045114, 1144296, 1197424, 1008506, 715921, 503467, 487665, 356960, 374767, 559122, 647294]
17990F47294j85969r6707l4591p6728J29414P8438q6197m5708l3955Q7137J93855
17979E76283o4469p3340J0429J18398J09163O284o236r9534q2379l4721L1212
17968D91090J59351n9299p6462N8120j2125r383M0737M2992n8863R2359k18907
17957D49610k66978k84874K54516R4328l6298R1057l8850j24878l00376L1850
17947a30893K79880R6729q4825R554J50219O4811R6660J6173p204L6510q694n0440
17935D68480j28924Q368j18798r2959M2173J03921J12551O8557Q4744j36767j42112
17924B69234p7416k27027N1908R7863j14072j64181j59256j22077J56706J53449
17914a34869J13594K18287P7044j5593k47824k4278J07710K4912j67183j07020
$$ y = [647294, 461325, 364618, 330027, 253299, 382713, 461151, 374954, 329246, 295291, 382428, 576283, 511814, 438474, 448903, 567301, 676464, 682748, 676512, 576978, 494599, 459878, 491090, 650441, 591142, 514680, 572800, 560675, 551292, 592029, 635021, 576158, 668517, 449610, 182632, -102242, 152274, 246602, 210304, 301361, 262511, 137633, -162743, -130893, 148987, 245716, 160891, 170445, 320664, 385475, 482135, 498308, 491104, 527614, 518920, 468480, 339556, 347924, 229126, 136167, 178340, 282261, 394812, 463369, 548113, 411346, 269234, 191818, -35209, 16699, 114562, 490, -163691, -322947, -445024, -288318, -134869, -21275, 197012, 274056, 258463, 10639, -13639, 94071, 118983, -48200, -155220]
17904a55220k6534K18353R7193j79358J70484K16111j63930l43066R2475J21867
17894D8375L4120R9227n7299P2242p3339L3421R6397r2519j7339J06629J42972
17883C92887M0672j75770j02483o6086P6688r3767k03390j01712j41247j02365
17873d76573Q4881Q6503N6240M3794N0778l2854N3876j58531J08888P1176q9637
17862b01459P3815J0418m4152j96697N7861J47558K19828L5597k29299j59292
17852b85822J04555l2814L1535L1708k39840j43604P4572k2789J92844L7017m403
17841b57041J271r8335J10104P7121k7762J64345Q8842m3616J06150j4457p5403
17830C1219q7307M8371r275j46207o4146L3090J11434j01575M1933J11607J54092
$$ y = [-155220, -181754, 36599, 133792, -45566, 124918, 341029, 177099, -165967, -73492, 48375, 82495, 181722, 124423, 196665, 123326, 156747, 253144, 160625, 143286, 249915, 392887, 433559, 257789, 155306, 89220, 165908, 72141, -131249, -232961, -374208, -476573, -391692, -305189, -248949, -205155, -154377, -187231, -133355, -291886, -182998, -111822, -201459, -127644, -117226, -161378, -358075, -300214, -152656, 67172, 102769, -126530, -285822, -181267, -214081, -182546, -150838, -390678, -534282, -459710, -482499, -289655, -252638, -257041, -255770, -354105, -244001, -166880, -194642, -30297, 58545, 14929, 121079, 106622, 31219, -56088, -7717, -16992, -163199, -227345, -194255, -82821, -184396, -142463, -30856, 123236]
17819A23236J24735k7374N8861J14683M8295j62822o4580n4528k35563M227l5599
17808a06429n6302J55152l4508n6426o624L5130j51030j63716K5278L5286p3887
17797c98076R7379J10278O4306M236J05327j8769O0789J2685j66078K8701l9403
17786a38625J40940K14142R9406j15397j95948p4683n779J2243k1753n8242m5127
17775a88823r1456p2397j0194Q9817R183L0922r5617n2776J31402q9607J3922
17764c25624J92888Q4653N9115r9150j02434l407K0094L18235j85772k13573j10089
17753c65064J0142P0430m6709j78845n1438J58078j51675r142J89443J5953J81477
17742a77350n9436J35496J21460N7394Q6857K0122k70713J488Q3139J25276k765
$$ y = [123236, 247971, 220597, 279458, 394141, 442436, 279614, 215034, 160506, -75057, -70830, -106429, -162731, -7579, -42087, -98513, -105137, -70007, -221037, -384753, -359475, -324189, -398076, -300697, -190419, -126113, -121877, -16550, -35319, 25470, 38155, -127923, -99222, -138625, 2315, 216457, 315863, 200466, 4518, -70165, -75944, -63701, -85454, -143696, -188823, -280279, -352676, -362870, -273053, -263870, -232948, -328565, -381341, -249939, -339546, -325624, -132736, -48083, 11032, -88118, -190552, -193959, -173865, 144370, -41402, -254975, -365064, -354922, -284492, -331201, -510046, -561484, -403406, -555081, -564223, -374780, -358827, -177350, -236786, -101290, 20170, 77564, 164421, 184543, -86170, -84682, -1543, 123733, 120968]
17731A20968j65716k13260k25981J42947J01271Q6464m3938j257j48275J87432
17721a59345J63042m028j79591j27026l10778O1237R1418K20941P3208J35727
17711c5195o5580j11386L9912L3550j15894k16571m5733J8986J29727k0550Q0214
17700c08520J06905P9603P464M4065J11615J23171J8374J52725p0958j38766k39235
17689a13557o7769J89330L3765k22432N4326O7448j26060j13341L8873J91821
17679f7596M0714o4612O7486k02044j95918P0186J1543q0236P1425J1547K37191
17668a00314n0533j81911J7577N7743R788j16524J28903n0545N8379J96900q6966
17657a17503j52432P2705K53628k1564k08411m4350o8856L4208j81170r3444K31435
$$ y = [120968, -44748, -258008, -483989, -341042, -239771, -153307, -197245, -198502, -346777, -159345, 3697, -331, -179922, -306948, -617726, -556489, -465071, -244130, -170922, -35195, -100775, -212161, -172249, -138699, -254593, -471164, -516897, -497911, -368184, -388734, -308520, -201615, -122012, -114548, -70483, 41132, 164303, 182677, 335402, 264444, 125678, -113557, -181326, 8004, 41769, -180663, -126337, -58889, -184949, -298290, -259417, -67596, -26882, -91494, -24008, -226052, -421970, -351784, -340241, -420477, -349052, -337505, -100314, -150847, -332758, -315181, -257438, -247650, -364174, -235271, -285816, -227437, -30537, -117503, -269935, -197230, 56398, 34834, -173577, -217927, -286783, -252575, -433745, -527189, -295754]
17646b95754J82604J28307J60642p0000j89665J1570P6802O7811o824j29992j04098
17635a68597J19668K32417Q6767j49386j76479J7387l9911K43449J9116q3153
17625A01278p3125n8594R1837J26648M4366n7184r9290L5071j55275j02730L522
17614a43476q852J89522J07940o2332j10235l1361Q3625l9282p6461j14154J8797
17603a86269m8664j45169R1703K65841P1539M212j32338P4104j15582j48228k33
17592b69084K4180R1787R3233M2980o4539p6949j61834K6894O7167J50013O5861
17581a0291k2174K81723O8876n3421l7002k08773J9222k1484j40827O7391K8354
17570b8406P150k6179j87691j8304K51301j0718p141k32618p6634J13392J24844
$$ y = [-295754, -113150, 15157, 175799, 105799, -83866, -72296, 4506, 72317, 65493, -64499, -168597, -48929, 183488, 270255, 120869, -55610, -38223, -78134, 165315, 184431, 101278, 28153, -30441, 61396, 188044, 232410, 175226, 75936, 111007, -44268, -146998, -143476, -152328, 37194, 145134, 82802, -27433, -58794, 24831, -14451, -90912, -205066, -186269, -234933, -380102, -288399, -22558, 48981, 53193, -79145, -5041, -120623, -268851, -269084, -244904, -153117, -59884, -16904, -81443, -158392, -320226, -293332, -226165, -76152, -10291, -32465, 249258, 318134, 264713, 227711, 18938, 38160, 16676, -124151, -56760, -28406, -21256, -47435, -235126, -253430, -2129, -12847, -19988, -252606, -329240, -215848, -91004]
17559i1004L7941p1158p304r4390K08816M0337p1252l9061m6935r6755p9850J75115
17547a35500M2886q3454j71531M8985J61044J73795R3312j49361Q7901k4510j18493
17536g4926Q1180Q7293j92215q210M357R360R7306J2825q5354O229K11509k0442
17524A28912j45095j07663j19259J42908L8986K4139K33702j36782J43631r4282
17514A09197j31005j5820P0324O6303l7717j06073r2413j46000o7909o8143m5105
17503d64361M8519r002J28484J02282j29012n5143j12952L5917K15199J83062
17493e7007j8088n7862O2486j06661R0318J49741P9422q3137k2914j1603l3298
17482h603m429l870k81569K157J52191O6487j11682K63503N4676q2029R0657r525
$$ y = [-91004, -53063, -124221, -131525, -225915, -17099, 23238, -48014, -87075, -134010, -230765, -310615, -135500, -92614, -176068, -347599, -298614, -137570, 36225, 129537, -19824, 68077, 43567, -74926, 6254, 93547, -98668, -106878, -102521, -93161, 4145, 16970, -68384, -62155, 149354, 128912, -16183, -123846, -243105, -100197, -61211, -37072, 196630, 59848, 203479, 109197, -21808, -37628, 32696, 98999, 61282, -44791, -137204, -283204, -351113, -419256, -464361, -415842, -424844, -296360, -194078, -323090, -378233, -491185, -455268, -240069, -57007, -75095, -132957, -70471, -177132, -86814, 62927, 142349, 59212, 36298, 24695, -8603, -13032, -16902, -298471, -296314, -144123, -77636, -189318, 74185, 128861, 46832, 137489, 127964]
17470A27964m62046j3147J99009K7735j09849k6728Q0596K35428K38403r3702
17460B03663j59769j43370p5949m7681k1233j3930j02970M816R0271L60343j6667
17449G7524p3831k0665m016j70035k05818K7190J70862K82732j87372j32136k3032
17438b58597p7n5599o0387j58052j76068J52063L91294n0202m3208J89477L1979
17427c7377j57661n0450j43551n7183J49461K01802J39705m6904j74834r3248
17417b70240L37295L25247k9121j89737j79308R9202J5670r0673N0242k13842
17407a45265o9923L9316l3839J27249N8658k06681N110K15727O5726J50610P7503
17396B84191J8088m5139m5215O1457j79072j44555j01204R300j3155j32782O8001
$$ y = [127964, -334082, -347229, -148220, -120485, -230334, -257062, -176466, 58962, 297365, 203663, 43894, -99476, -175425, -223106, -244339, -258269, -361239, -356423, -266152, 94191, 77524, 3693, -16972, -20988, -191023, -396841, -369651, -198789, 83943, -103429, -235565, -258597, -258674, -314273, -374660, -532712, -708780, -556717, -165423, -215625, -258833, -69356, -37377, -195038, -245488, -389039, -446222, -296761, -94959, 44746, -2158, -176992, -270240, 67055, 392302, 363181, 173444, -5864, 93338, 109008, 18335, 68577, -145265, -215188, -175872, -209711, -82462, -23804, -230485, -225375, -9648, 56078, 206688, 284191, 302279, 257140, 211925, 273382, 94310, -50245, -151449, -142149, -155304, -288086, -220085]
17385b20085M4378j9823j48856M6189Q5064K9291l2435o5813j883r187N1485J66049
17373g5626k10154l18681k1896J45993K19294J00788P5847j68354N3903O9848
17363a29038J04248P6150q5413j33568M200R2576J4420j4619p3129m9620j31703
17352c25496o2835L1215J18699o846L8165J36415K14767N826j43156r4867L1370
17341e6743m18L4628J36263m8538k08567o8063J19096k3451q8209j60922L02677
17330f2247J32753l5263J4151j43527j40983Q03m2587r1618J34437P6579J20216
17319c7286N984L6032k47672l2402L2923J98640M5104k11051j28453j09178J507
17308d45852J55063J35850m9056j7300j7201n6921Q6845j48492O2193J31160j637
$$ y = [-220085, -175707, -195530, -344386, -298197, -213133, -183842, -216277, -282090, -283973, -293160, -241675, -75626, -285780, -604461, -626357, -480364, -261070, -160282, -84435, -252789, -198886, -129038, -24790, 51360, -34053, -167621, -163421, -70845, -56425, -71044, -144173, -193793, -325496, -388331, -357116, -238417, -245263, -207098, -70683, 144084, 149910, 6754, -88113, -56743, -57161, -22533, 113730, 65192, -143375, -211438, -92342, -115793, -204002, -364924, -62247, 70506, 35243, 49394, -94133, -235116, -234313, -276900, -368518, -234081, -157502, -37286, -31302, 4730, -242942, -275344, -242421, -43781, 1323, -209728, -338181, -447359, -445852, -290789, -154939, -203995, -221295, -238496, -295417, -208572, -357064, -294871, -163711, -165348]
17297a65348r5185j7514j3443j20136O9180J30884J36408J3092J18045L6980o1519
17286C1444P806l8856R2392M884N5365K6675j41117k91891j16216J13684m432
17275b60262J53366J55238l5190o8067M3003j74541j01194j97126Q3155q9154
17265d90772j37799K36443J53742m5657N5131j55919J59969J60798J03707J36285
17255A75928j97003l94397J66884J59336o4794k64977K8240k11554N8988J42140
17245d01209J94572M6426m6183j70442p1837J26339K22530m6336m4144P3928n7190
17234a73546K2123J05443L1754j73584k998K15494q2906j39002J5094j0002o7147
17223b59277J2847J47625n498j23101l0224p6592q4357J46867L08729J50323k9626
$$ y = [-165348, -260533, -278047, -291490, -411626, -342446, -211562, -75154, -62062, 55983, 92963, 31444, 39250, 394, 92786, 97670, 153035, 179710, 38593, -253298, -369514, -255830, -260262, -106896, 48342, 13152, -54915, -11912, -186453, -287647, -484773, -401618, -490772, -628571, -392128, -238386, -284043, -228912, -384831, -224862, -64064, 39643, 175928, -21075, -415472, -248588, -89252, -154046, -419023, -390783, -602337, -543349, -401209, -206637, -160211, -206394, -376836, -448673, -322334, -99804, -146140, -190284, -116356, -173546, -151423, -45980, -14226, -187810, -190808, 24686, -58220, -197222, -182128, -192130, -259277, -246430, -98805, -104303, -227404, -257628, -334220, -418577, -271710, 37019, 187342, 157716]
17212A57716k82544j18980l0846j3700m0778j09650O8987J34743k0854M2547K39910
17201B6551k952j92069l7016o0935j89653n2765K7334L21665J27207J76q5168
17190a17625j14196m7982J22041m1975o2259M4064J00400m1632J36764J9539p0814
17179g3675k48632M7864O4387O9444j16255k7854J00254J85614K0358k39761j30299
17168c48555J04014j92448K3126K37050J13062L1084l5991j47883j89849J8314
17158c88076K8182K3665O2413l3427J25392J05231K9529k04816J01381J66576
17148A6050j36869j26616j95499J64959j29276P7095J30995q0289m5150M2206
17138b82394k4242P6378K8381N3433J64504P3331l0859k17224j16922r6312J15530
$$ y = [157716, -124828, -243808, -274654, -288354, -329132, -438782, -369795, -235052, -255906, -213359, 26551, 23599, -168470, -205486, -266421, -456074, -508839, -481505, -159840, -32633, -32457, -117625, -231821, -279803, -157762, -199737, -261996, -217932, -117532, -159164, -22400, -2861, -73675, -322307, -274443, -210056, -140612, -256867, -284721, -184467, 1147, 21505, -218256, -348555, -244541, -436989, -413863, -176813, -63751, -32667, -68658, -216541, -406390, -388076, -359894, -336229, -273816, -307243, -181851, -76620, -47091, -251907, -150526, 16050, -120819, -247435, -442934, -277975, -407251, -330156, -199161, -279450, -324600, -282394, -306636, -230258, -201877, -148444, 16060, 89391, 58532, -158692, -275614, -371926, -256396]
17127b56396j45743m0144N5741j14692k76138o6385J65916N5310o5316J02628
17117e85219J00105J76153j17497q9011J31259J19568l6413J5928p6956k0976
17107c83059O4599J32595L13289n8354r9204k24561L1632j0744o6035J08560N7224
17096a34058m0943p7999m5717M3756J44267q848j44652M6287Q9951J44838p1214
17085e4332r254J30694p2104o8780j71237P7550Q8003p8071k05409O3433K77981
17074b1526p8348J35038l7298R8429j75991k54748J34027R749m4445N5520n5084
17063b34677J3985J69571K2614J63385m4161k68842l1060J15857k6151p6333O060
17052a89752j06172j9027M9524m4075L241K37442p0885K7148Q1282n0306o6681
$$ y = [-256396, -402139, -442283, -386542, -501234, -777372, -843757, -677841, -622531, -687847, -585219, -485114, -308961, -426458, -515469, -384210, -264642, -301055, -285127, -362083, -383059, -318460, -185865, 127424, 69070, -30134, -254695, -223063, -233807, -299842, -191282, -134058, -175001, -253000, -298717, -254961, -110694, -119542, -264194, -217907, -127956, 16882, -54332, -63586, 67108, -4996, -73776, -245013, -167463, -79460, -157531, -362940, -299507, -21526, -99874, 35164, -2134, 96295, -79696, -334444, -200417, -190668, -235113, -179593, -234677, -220692, -51121, -28507, 134878, 90717, -178125, -209185, -93328, -119479, -195812, -189752, -295924, -314951, -265427, -309502, -306261, -68819, -139704, -112556, -31274, -81580, -148261]
17041a48261j50856o7479P2810J91959j7449k72217N4364M3015l4358K21473j2947
17030a19946k28152k02598O6130L04814J2413Q0576r2190r9829r6759J10020L2754
17019b32767J88718J3578j11962J58390m2602p1536L5454M3654j10476j95304
17009c24853N7291J67778n4260O1795M0846j57757k2138j06368J1886J74078R0834
16998f0868q0769o664r0236l5457J40639j36020j12399P7226J10338R424N6057
16987a28729j463N8670p9300p6236K3594j64779j51432k5038K13968J83876P0737
16976g6132n187p3428J62718O4099q6057M5918p3832J0356J35419j32257J857
16965b6526M1921J64984N1318L6483q9987p289j02462j08556R7807j51390n3629
$$ y = [-148261, -299117, -366596, -293786, -101827, -119276, -391493, -337129, -294114, -328472, -106999, -119946, -348098, -550696, -484566, -179752, -167339, -86763, -178953, -278782, -375541, -265521, -232767, -44049, -30471, -142433, 15957, -26645, -98181, -62727, -19073, -129549, -324853, -267562, -99784, -154044, -92249, -51403, -209160, -231298, -337666, -325780, -151702, -60868, -141637, -148301, -238537, -273994, -133355, -269375, -381774, -304548, -194210, -184786, -128729, -130192, -71522, -150822, -227058, -203464, -368243, -519675, -544713, -330745, -146869, -76132, -81319, -154747, 7971, 72070, -13987, 31931, -41901, -31545, 103874, -28383, -26526, 15395, 180379, 231697, 268180, 178193, 170904, 68442, -40114, 57693, -93697, -147326]
16954a47326Q5507J66470J63063k36080p1644m3480l4493m8516j98345L6102J62838
16943a65904l7388l39381p4298K35030N701n4757L8483P0096K03537O1382M3699
16932a3800m6072J48751K01071Q2860j09017j39918j22808j80100j62899j44888
16922d86820L5080K43024o12j9438K32761J69018m7161k24558R4718J27121P307
16911A30440j22152N0520n1866r9767K0988n9312l018R7194P0275p6227J34273
16900I1348l8974j86750j73022q5726o4292K14175J60106m8961q7467j11128k54598
16889e85289Q7526J51330J26832Q8802K256j60930J6860J84167N4313J71267k7267
16878A09867j89946r3006p3802k7536j28970l1172J69300J61554p9932m1581K19104
$$ y = [-147326, -61819, 104651, 267714, 31634, -40010, -83490, -117983, -166499, -364844, -328742, -165904, -203292, -542673, -616971, -381941, -376240, -430997, -392514, -322418, -118881, -57499, -13800, -59872, 88879, 289950, 372810, 263793, 123875, 1067, -179033, -341932, -486820, -451740, -208716, -209328, -228766, 3995, 173013, 125852, -98706, -3988, 123133, 130440, 8288, 58808, 6942, -92825, -71837, -131149, -134167, -36973, 33302, -42925, 91348, 52374, -134376, -307398, -393124, -457416, -243241, -83135, -132096, -219563, -330691, -585289, -497763, -346433, -219601, -130799, -128543, -289473, -272613, -88446, -34133, 137134, 109867, -80079, -173085, -246887, -274423, -403393, -434565, -265265, -103711, -183643, -225224, -6120]
16867f120J18868j63649j45359J19755J85285J42049j23658l22507K02671n9434
16857e2099l99089K20806J06757L8322K360l5260m4413O4044j92746O3127j39708
16846c67899J11251P9246R5253l8217M2421j82034l71216p7752J16324J55326
16836d37297N0256j12471Q7332K08787R4577J2369k5520k25634j11277J45648
16826c13230q9077P3167L6257k1167J31744J84797k97188p251K96770j29373J08727
16815b5824j97455j04053J74861J08683J54200k41484M5868J33115l6641j83107
16805a71837M5377J46967j29583J03237k0123j6031K6644l5353p9253o8122j62904
16794c60981R1624K31267j55603r2709q4017j14744m9874o3363J8342J34683J59720
$$ y = [-6120, 112748, -50901, -196260, -76505, 108780, 250829, 127171, -195336, 7335, -52099, -451188, -230382, -123625, -85303, -82943, -118203, -162616, -98572, -291318, -228191, -367899, -256648, -177402, -82149, -120366, -77945, -259979, -631195, -708947, -592623, -437297, -387041, -499512, -412180, -203393, -108816, -96447, -121967, -347601, -458878, -313230, -402307, -329140, -292883, -314050, -182306, 2491, -294697, -301948, -5178, -134551, -25824, -223279, -327332, -152471, -43788, 110412, -131072, -85204, 47911, 11270, -171837, -126460, 20507, -109076, -5839, -25962, -41993, -15349, -50702, -129955, -198077, -360981, -269357, -38090, -193693, -286402, -370419, -485163, -535037, -598400, -580058, -445375, -285655]
16783b85655k265P2296p7193J6685L3083O4603j09225K4449k31382O0782L17344
16772a16478L9363k55695q4604K15838K10908J85567J13817r8955k92763j7610
16762a00612l6284m020q3890j86176R8543n2535k8477j08143q5775K60828K55339
16751g1202m3191o1141k1214q2137j56943R3691J48019N5181O6554R5653r097
16740A4173j40742K9818Q2776j11934j69506n1300J3709J65647k7767q5839j09194
16729c90159k724j68193J26373l3802j9214K46293k2071n1229K27739l8797k34341
16718c60125K1227q238o5100j39071J05975J03418J9522P6287J02127q3139j75243
16707d02360J8684L41317M7012r3147k31347k79040N3114N6943q805R4427r9957
$$ y = [-285655, -287920, -215624, -292817, -276132, -243049, -178446, -287671, -263222, -494604, -433822, -116478, -77115, -332810, -417414, -201576, 9332, 194899, 308716, 209761, -83002, -100612, -136896, -140916, -224806, -410982, -312439, -364974, -393451, -501594, -587369, -326541, -71202, -114393, -175534, -196748, -278885, -435828, -342137, -194118, -138937, -72383, 23270, 14173, -126569, -96751, -13975, -125909, -295415, -346715, -333006, -167359, -195126, -280965, -390159, -392883, -561076, -434703, -468505, -487719, -241426, -263497, -314726, -86987, -125784, -360125, -338898, -347136, -412236, -551307, -445332, -341914, -322392, -246105, -143978, -227117, -402360, -383676, -42359, 4653, -88494, -319841, -598881, -545767, -488824, -497629, -403202, -503159]
16696e03159J47181M8485N2152J5939R438j43919J07902J43653r9894j42222P8524
16685b85920J09726k086j53892Q3258K5721q4252K8087J78801M7231j62720O1447
16674a54599J31530r3771l27402q6933Q0202k7132n2190J09753J22041j78361
16664d76862M1988J5568J14826J65751R0521j6398k15952n5947K08758N9989k34768
16653c02526n6046J91052K15747j3656J93950k3393l21265N9011J58176j14004
16643a2954j10399n9101k12238N6888K830O6819K24783J07506j42700m3382O2099
16632e9849K423l0039O6882p4242m7930J59158m5821j81515l6440r7430P7018
16621b67785M3591J88948K97044j59347j49721J04530J42738j29253Q6953l2076
$$ y = [-503159, -355978, -307493, -255341, -239402, -229964, -373883, -265981, -122328, -222222, -364444, -285920, -176194, -178280, -332172, -248914, -223193, -307445, -279358, -100557, -53326, -216046, -154599, -23069, -116840, -444242, -531175, -450973, -478105, -530295, -420542, -298501, -476862, -434874, -419306, -304480, -138729, -48208, -64606, -280558, -336505, -127747, -67758, -302526, -358572, -167520, 48227, 34571, 228521, 205128, -116137, -57126, 101050, -12954, -123353, -182454, -394692, -337804, -334974, -268155, -43372, 64134, -78566, -121948, -59849, -57426, -87465, -20583, -94825, -142755, 16403, -29418, -210933, -247373, -344803, -267785, -224194, -35246, 261798, 102451, -47270, 57260, 199998, 70745, 157698, 125622]
16611A25622P5201j04886j66106J43830K1707j00794j02302j2987L17625j12283
16601H4627l96558j92622o9014K8239K75818K86003K05737o9203L718r20m8762
16590A07063j59505j14324j14924k62015P6225J13250K2511O0957O9771n612K8367
16579a78236N0111k09176o8639p6261J8561j3307l6817J3560J25409J97895m5786
16568b22686L6370j23847O6724K54710q4177j55735L3966k8441J05280K4242j6099
16557a09693r4980j42584q5319n3742K70794r3387p3704o9599J1661O7352P4161
16546b99040r533K04204K00000L9347j86413q3963R1417Q9393j91989j62275j81982
16535d90834l7470o9742n1878Q3901J18425Q4571j47956j22835J72J91875J63158
$$ y = [125622, 200823, 95937, -70169, 73661, 95368, -5426, -107728, -120715, 196910, 84627, -311931, -504553, -573567, -545328, -269510, 16493, 222230, 153027, 156745, 155825, 107063, -52442, -166766, -281690, -543705, -467480, -354230, -331719, -270762, -200991, -206603, -178236, -128125, -337301, -405940, -482201, -463640, -476947, -513764, -500204, -374795, -176900, -222686, -186316, -310163, -243439, 11271, -72906, -228641, -194675, -223116, -117836, -93594, -109693, -204673, -347257, -432576, -486318, -215524, -308911, -382615, -452214, -440553, -373201, -299040, -308573, -104369, 95631, 134978, -51435, -135398, -43981, 45412, -146577, -308852, -490834, -528304, -598046, -649924, -566023, -447598, -363027, -510983, -633818, -633646, -441771, -278613]
16524b78613j076J47795J2537M2541k95335j6736k31739L6849N0536J69579J99999
16513a63663k4412J1051j71789m3285L2020N663N0545j35597Q9018K27471p3571
16502a96549j30658P3221J42588l1786k14468J02803j1685m0354J72735l8969
16492a73122p8268J79874l3630M1005j22470J60219J10771M3812n048j37832j58992
16481a73681m1457j99245l909P2187n6586j1657r6757L726q4442j42579K40700
16470d93700O4702K2616K10747L9365j0017J04196l25746l00070O899K25157J96287
16459b59564L8593N4136M3338O8669O7588k79613k62578R4899N9846O5030J29646
16448a80010K43404J41252K3281J27046j62215k24668k17542j3904k35800r570
$$ y = [-278613, -279689, -131894, -119357, -76816, -372151, -388887, -620626, -583777, -533241, -363662, -163663, -188075, -177024, -348813, -392098, -360078, -354415, -303870, -439467, -350449, -122978, -196549, -327207, -253986, -111398, -143184, -357652, -254849, -266534, -306888, -134153, -173122, -251390, -71516, -105146, -64141, -186611, -26392, 84379, 128191, 123143, -14689, -173681, -215138, -414383, -418292, -346105, -402691, -414348, -511105, -507379, -591821, -734400, -493700, -428998, -406382, -195635, -156270, -166287, -62091, -387837, -687907, -681008, -455851, -259564, -220971, -166835, -123497, -54828, 12760, -266853, -529431, -434532, -374686, -309656, -180010, 63394, 204646, 227927, 354973, 192758, -31910, -249452, -263356, -499156, -508726]
16438e08726N3847J78966M7913J09276K7945L3886R8916p0700l1803n1295M2079
16427f9696r6470l39052M029K24730K05263O4792l20J20669k02592L9620Q9999
16416D0972L0438j53781j03629P126n4724j5932k0286n7217R3874J63370J1026
16405e8763l1383Q4107l2431j59402N0532J04449j33400o8117K9328R1255M9108
16394g4717P7336j25749j44908j69625J47420L494p5631k07972R8830K52883O5332
16383a53307p9025m6787o999J07976K5536k4662K193J23807P1997p1816r4026
16372a45113j78526m3750j5254j51881j7004k0450N6870O3392J22691J17035j24572
16361c36562L562m8812J4554J78537J10130j32702m2800N016L02663N5290j07369
$$ y = [-508726, -454879, -275913, -228000, -118724, -90779, -56893, 42023, -28677, -60480, -111775, -69696, -166166, -505218, -501189, -276459, -71196, -6404, -6724, 113945, -88647, -49027, 40972, 71410, -82371, -186000, -178874, -233598, -249530, -269816, -327033, -233159, -69789, -58763, -90146, -6039, -38470, -197872, -147340, -42891, -176291, -244408, -215080, -123825, -74717, 2619, -123130, -268038, -437663, -290243, -286749, -362380, -570352, -471522, -218639, -153307, -232332, -279119, -286118, -178142, -152606, -177268, -175075, -51268, 20729, -51087, -145113, -323639, -367389, -382643, -534524, -551528, -571978, -515108, -451716, -329025, -211990, -336562, -333000, -381812, -367258, -188721, -78591, -211293, -254093, -249077, 53586, 108876, 1507]
16350A507n8939J16011O251j33129k14582J5994J60901L5036Q8500J0522j16213
16339h8141k34029l8631r729J12680Q6538K23550P6810r3016k56451j7269k6650
16328b64338K53741Q7525J57326j91733l9503p1472j14845j16551J83108K00376
16318H3634J9258q468Q942j07488j50662O9035J60078r1693m12963q1422J41369
16307c70380O6405j17080J46982K50891l0183l8077P225k06094j86788j7712m2576
16296e37387j9718L27473L21695r8043k51813M2177q8826J17974j0401k62540
16286d59409L0292J56267m057Q588K0509O6766K6729J624p4645j38804j15013
16275d81153R0081r2763M1034K31084K29076j7262j6372j4814o3099R2016L2947
$$ y = [1507, -57432, 58579, 64830, -68299, -282881, -266887, -105986, -70950, 17550, 28072, -88141, -322170, -360801, -370530, -257850, -171312, 52238, 129048, 36032, -220419, -237688, -264338, -10597, 76928, 234254, 42521, 3018, -68454, -183299, -299850, -116742, 83634, 102892, 94424, 103366, -4122, -154784, -85749, 74329, -17364, -430327, -511749, -370380, -303975, -421055, -274073, -23182, -53365, -91442, -84217, -290311, -477099, -494811, -537387, -557105, -229632, 92063, -5980, -257793, -215616, -304442, -186468, -196869, -459409, -429117, -272850, -276907, -268319, -247810, -181044, -154315, -152691, -227336, -366140, -481153, -391072, -483835, -442801, -211717, 17359, 97, -16275, -31089, -94188, -2172, 30775]
16264C0775k64487p8129L7546J53953O8597j8496m01317M6070Q5593J86859J03184
16253d9852m8994j60103j85406J65987J52921k9281J40637l2940j91088j47449
16243c85568L1870J45354J65176P2561R2179p5483j09646q755j6698J26851p7308
16232c9467k56023n1905K8584j32263J32798J82100R2104k0000K5886M8995j31413
16221a20604Q0357K25286N1295j96073Q1110p1459l0808p1868L9210l829j19969
16210a37352j91278k7090J01853J44949j3893O6297o894q0113J10092j41062j26552
16199c01043J81728J64485r005l6973k09283j44074J52808K99354K9120L8521
16189A65638l0958j46081k04571n6969p3478J1253J25522K53562k3320J38275
$$ y = [30775, -233712, -311841, -274295, -120342, -51745, -70241, -471558, -425488, -339895, -153036, -49852, -98846, -258949, -444355, -278368, -125447, -154728, -14091, -47031, -238119, -385568, -353698, -208344, -43168, 29393, 121572, 46089, -63557, -72312, -89010, 37841, -39467, -295490, -347395, -318811, -451074, -318276, -136176, -44072, -64072, -38186, 10809, -120604, -40247, 185039, 236334, 40261, 121371, 49912, 19104, -52764, -13554, -17383, -137352, -328630, -355720, -253867, -108918, -122811, -56514, -63408, -143521, -33429, -174491, -301043, -119315, 45170, 36165, -808, -210091, -354165, -201357, 97997, 127117, 165638, 134680, -11401, -215972, -272941, -346419, -335166, -209644, 43918, 20598, 158873]
16179A58873k47730l98970j04142J4609L538j0417J57308J09670M7806n405J41252
16168a33608P3269n486k74956K0482R0586j44446J41698J34558l9202K3134n2111
16157a66082j84796j692J9494J16127J17270J30437J6893j18517j48316k11819
16147d31001J85535J51926R2326J18581m9739l24995J68344n5311j85453j06083
16137d35870o3062j13019J14799K47927J76487j25010j87381q3243O9030J78060
16127b21282K33660J16352J58755j254j03149k43913J65415K54423l26876k67537
16117b35406k45546O176R7530l6450J46945r4059R8676O4834L5862M3801j42169
16106b59806n3425p4639k06418l0291K83661J17586K01905o4629j66383Q9678
$$ y = [158873, -88857, -487827, -591969, -577360, -573822, -584239, -426931, -317261, -269455, -274860, -133608, -60339, -65825, -340781, -320299, -229713, -374159, -232461, -97903, -137105, -113971, -166082, -350878, -352570, -333076, -216949, -99679, 30758, 47651, -70866, -219182, -431001, -245466, -93540, -1214, 117367, 67628, -257367, -89023, -144334, -329787, -435870, -498932, -611951, -497152, -249225, -72738, -197748, -385129, -468372, -399342, -221282, 12378, 128730, 287485, 286231, 183082, -60831, 104584, 359007, 32131, -235406, -480952, -474776, -377246, -413696, -266751, -360810, -262134, -197300, -161438, -117637, -259806, -313231, -387870, -594288, -624579, -340918, -223332, -21427, -86056, -252439, -162761]
16096a62761K10717p6507k4342j60535Q9271R2907j40592j44453j09733l8366
16086d64394R8746J52746L9090M1261J50575N8631j3595J6016k42669j61443J40926
16075a84110J90111R4856N4278r4100j41499j53843J68483k4528j42681J8255
16065b14778J56137J5019L3185K5548J16474L6395R6815j48675j90562J48553
16055G4111j29316l3150J46534k35007p1020K8357l0099N6173J65716k0931J59936
16044A11304n9986J49163R0075R5041k3220k64705k02516L3291J1453j87941m8249
16033b96290K89170l5741k64573j03635J91275k4902j22757m8877r8645O9848
16023d45127K92238J30711j80372j25854j79739Q1333J07180K599J66973J9316
$$ y = [-162761, 47956, -28551, -52893, -213428, -124157, -31250, -171842, -316295, -426028, -464394, -365648, -212902, -173812, -132551, 18024, 76655, 63060, 79076, -163593, -325036, -184110, 6001, 100857, 155135, 61035, -80464, -234307, -65824, -90352, -233033, -214778, -58641, -43622, -10437, 15111, 131585, 167980, 264795, 116120, -74442, 74111, -55205, -88355, 58179, -176828, -247848, -219491, -249590, -193417, -27701, -48632, 111304, 51318, 200481, 290556, 385597, 362377, 97672, -104844, -71553, -60100, -248041, -296290, -7120, -42861, -307434, -411069, -219794, -244696, -367453, -416330, -514975, -445127, -152889, -22178, -202550, -328404, -508143, -426810, -319630, -317031, -150058, -130742]
16013a30742k3096J00888k8306P7642r1512k87909J10441J20976J15388j07908
16003a44138j49897N8291K5949n8226j5838J10965M1982k30490m559J88302P7192
15992a00467Q869K6208N2188r0346r4876J21087K1416k6991l6239M7877O154j56601
15980b21721J28437J18813k30960k44801p6162J75004J51212K35544J31691j38157
15970B8900j32259L0181R3440j87155j48822k9363J66858O9317O747J00690P64
15959g02k5219n8472k13678j67867j0922K31084J71505O4179m1381r8601j72511
15948c22585o9029l7184O1312J21425J8913L9705J01840l8626j89092J6376P9631
15937b17314j6109L1597L8366L0601j05812j43604O920j39752J41198K40790Q0053
$$ y = [-130742, -153838, -52950, -81256, -3614, -95126, -383035, -272594, -151618, -36230, -144138, -294035, -235744, -209795, -268021, -283859, -172894, -130912, -361402, -365961, -177659, -100467, -91598, -65390, -13202, -103548, -198424, -77337, -55921, -82912, -119151, -71274, -65120, -221721, -93284, 25529, -205431, -450232, -526394, -351390, -200178, 35366, 167057, 28900, -103359, -73178, 20262, -166893, -315715, -345078, -178220, -108903, -102156, -1466, -702, -25921, -84393, -298071, -465938, -476860, -245776, -74271, -10092, -51473, -150074, -322585, -391614, -428798, -367486, -246061, -227148, -187443, -85603, -124229, -313321, -296945, -217314, -233423, -201826, -163460, -132859, -238671, -382275, -375355, -515107, -373909, -133119, -53066]
15926e3066N3173j5820j3839k64651r9370J41235R7753l0603k46952o7974J80474
15915c19640J76310M8080j0328N1939K7541k52228k32164o5141O1880J84438K46321
15904h2992R2018j95836j38331M284j63849N8308l9517O0031N7458O060j574K25754
15892a18186J53797N3765j92545j51033J41767R2765O0458q0705j46451m6064
15882b32432R6782k8483M7474L0424O1566k66143j45066R9625J29297L3458j18695
15871b92193k02080p381k543P598J24506j10564P8131J97666J738J03606r9877
15860b01393J91098P8574l9610j51992k18960j4353M8544r1851J25876R5717Q1984
15849i6366J18618j1821O468p4083k05229N8673q3328j53845k088J35112m7164
$$ y = [-53066, 107, -15713, -29552, -294203, -393573, -252338, -154585, -185188, -432140, -500114, -319640, -143330, -95250, -105578, -53639, -26098, -278326, -510490, -575631, -513751, -329313, -82992, 9026, -186810, -325141, -320857, -484706, -426398, -465915, -405884, -348426, -342366, -343940, -118186, 35611, 89376, -103169, -254202, -112435, -19670, 40788, -39917, -186368, -232432, -135650, -164133, -116659, -86235, -24669, -290812, -435878, -336253, -206956, -173498, -292193, -494273, -501654, -504197, -496599, -372093, -482657, -404526, -206860, -205122, -101516, -201393, -10295, 68279, 28669, -123323, -342283, -356636, -308092, -399943, -274067, -178350, -96366, 22252, 10431, 16899, -57184, -262413, -203740, -287068, -440913, -443001, -307889, -355053]
15838c55053R4887J7102J24034J09973q6702m0768j28582l03535O3591K26659
15828b78394l0987m2694R8565k6670n3053p5643J7596P3093j01942j7386k4058
15817d61573J88361J21893l8735o7879k56932k12300K63689P8522J16809K05676
15807f2469K8382m209O0126J13772j06961J7199j00660j62575n9096j13253K7588
15796c62156L9647j60080P1336J29713J9884R9627K45848l2261j55208m2358J9378
15785a26630k921o2665J15039L6724J0512J08406k6565k20294j07192N212J40622
15774a29752j00129l0964j7695j48295j44749J3271L13511K23140L8526m01410
15764c84546k32686O8632J32898J75220J97927M6279J37768J88420j92605j33045
$$ y = [-355053, -260166, -243064, -119030, -9057, -95759, -136527, -265109, -568644, -505053, -278394, -309381, -352075, -253510, -280180, -333233, -408876, -391280, -318187, -420129, -437515, -461573, -273212, -151319, -190054, -257933, -514865, -727165, -463476, -384954, -268145, -62469, -34087, -38296, 21830, 135602, 28641, 45840, -54820, -217395, -276491, -389744, -362156, -322509, -482589, -411253, -281540, -261656, -162029, 83819, 51558, -103650, -146008, -126630, -129551, -192216, -77177, -40453, -29941, 78465, 51900, -168394, -275586, -270374, -129752, -229881, -260845, -278540, -426835, -571584, -558313, -244802, -21662, 16864, -384546, -617232, -548600, -415702, -240482, -42555, 3724, 141492, 329912, 137307, 4262]
15754D262j63436J13218J11239J28371m4829k02322j98573n2984R0463P387j44455
15743c51659N6960P4503p4087l00961l5005K03114n2685K2719R3231K13310J27238
15732b3322m8235m8831l2507r2885j46932j17570r9006O623K83847K56180O5327
15721B689k6607m1834K1012j14565j2498M5069K5506k0210k04281M3174J63817
15710a18728m6343q612M8330o5444k1059m8214k4389j24505J40261q3195L6664
15699c15234J33508Q2810n8872R552K3605M2316l0575j16471k28281j37023M107
15688e90558K27078K49861k4341o8559M4885P0640p7829N6844J46022O3214M5704
15677A42961n6335J6788J11233N2751j59733J04675j30095L397N5971k13269j29684
$$ y = [4262, -159174, -45956, 65283, 193654, 148825, -53497, -252070, -305054, -214591, -207204, -351659, -294699, -220196, -294283, -595244, -630249, -427135, -479820, -457101, -363870, -150560, -23322, -71557, -120388, -152895, -245780, -392712, -510282, -609288, -602665, -318818, -62638, 2689, -23918, -65752, -44740, -159305, -171803, -126734, -101228, -121438, -325719, -282545, -118728, -165071, -173683, -125353, -190797, -211856, -260070, -284459, -408964, -268703, -351898, -315234, -181726, -98916, -157788, -148236, -124631, -82315, -112890, -229361, -457642, -594665, -590558, -363480, -113619, -137960, -206519, -161634, -90994, -168823, -111979, 34043, 97257, 142961, 86626, 103414, 214647, 267398, 107665, 212340, 82245, 85642, 141613, -71656, -201340]
15666b01340j7486r3368J16161J80857Q3339j9185j36120J5121J1671J89606k05473
15655g6217j82194k6246P1251q4971k49083K73458L6830r0376L4823N1087J05555
15644a36083L6289j27903j68356m4898K35745K9058N4330o5545j9471J47299M1601
15633a7934L8510p0953j56635j64283k5946Q8407J41818m4935J02142p7348L3619
15622a53538K13849m6115r3570N6252m1857J40362J58689m60p5570k9268r5504
15611C3270l0478j36075j825J05991J14448k0572m7652L9590l2439j81662j40856
15600b98260O5115n9195R1492M0668k9395j857l0558J21582K7915Q0507J3163
15589B1177J30612k92263Q7839p3386j89754j45429J25761n84O0749J85885Q9738
$$ y = [-201340, -218826, -312194, -196033, -15176, 68163, 48978, -87142, -72021, -60350, 129256, -76217, -258411, -284657, -213406, -298377, -547460, -274002, -237172, -327548, -292725, -241638, -136083, -99794, -227697, -396053, -440951, -205206, -176148, -121818, -187363, -206834, -59535, -17934, 20576, -50377, -207012, -371295, -397241, -308834, -167016, -211951, -109809, -187157, -153538, 60311, 14196, -79374, -23122, -64979, 75383, 234072, 233612, 158042, 128774, 33270, 2792, -133283, -135108, -29117, 85331, 64759, 17107, 56697, 24258, -157404, -298260, -233145, -292340, -200848, -160180, -189575, -191432, -221990, -100408, -72493, 8014, 21177, 151789, -140474, -52635, -126021, -315775, -461204, -335443, -336027, -275278, -89393, 345]
15578C45m7568j11893k9478J19090k06775n3435l4926j5967K2887M1181p697J24529
15566a99707r2240j36736j05569K23203J19357n5227j42960j63733m7602J95950
15556d05264L83629K68193j08776n32721R9117K6234J35301K64497J46627J1911
15546B88748k48738k43771j58888J83584j04610k01911O5490P771P9972J63562
15536a68791M027L82k5347q1424L6818M4079N7524J01752r2147j30797R5435j80563
15524c39052l0806k5982j02374k3525N4106K09986k4723M028J98143n1418j42636
15513b74253N4570j951N1054j00920q8689l2413J3435j2002r0755P1368l51j00920
15501e11827J78693k35472m1381R8414J87634P246o2887K2688R8189k56513J11814
$$ y = [345, -47223, -159116, -188594, -69504, -276279, -329714, -364640, -380607, -357720, -316539, -324236, -199707, -291947, -428683, -534252, -311049, -191692, -246919, -389879, -553612, -601214, -405264, -21635, 246558, 137782, -394939, -295822, -269588, -134287, 130210, 276837, 288748, 40010, -203761, -362649, -179065, -283675, -485586, -420096, -412325, -332353, -168791, -164764, -164382, -189729, -271153, -234335, -190256, -132732, -30980, -123127, -253924, -158489, -339052, -369858, -395840, -498214, -521739, -467633, -257647, -282370, -278342, -80199, -131617, -274253, -219683, -221634, -170580, -271500, -360189, -392602, -379167, -391169, -481924, -410556, -410907, -511827, -333134, -568606, -609987, -511573, -323939, -316693, -379580, -356892, -258703, -515216, -403402]
15490d03402O6543Q684J20804j6201j45654o0999J35747m3296j93664j6449J02042
15479d45845Q9406p4229q2652p2176r6914P6175J77260K41165j94258m5381M8849
15468c78600o9035k69807l6194K36417M023J79669J01882n725L5488L502j89689
15457c88069j38209N0794l3934P193J95002J75701j20911j6719M1909n6810M9897
15446b34156P9689m0488o4677j316K4695O1446K67343j5059k17477n5380J51192
15435d4188p631j28276N9033o3793R1409J86707O9361m3757j07985k27329k26985
15424d43434j12252l569J13789j08698r4042K8928L22640J25498J20004q2776
15414a33912n5176j11582o8479j07316j05663J15320K00441l8119N1984J03803
$$ y = [-403402, -336859, -328175, -207371, -223572, -369226, -430225, -294478, -337774, -531438, -547887, -445845, -356439, -430668, -513320, -585496, -682410, -606235, -428975, -187810, -382068, -427449, -378600, -447635, -717442, -753636, -517219, -513196, -333527, -231645, -237370, -201882, -198380, -388069, -526278, -475484, -509418, -502225, -307223, -131522, -252433, -269152, -227243, -284053, -234156, -154467, -194955, -259632, -260948, -236253, -174807, 92536, 77477, -140000, -195380, -44188, -51819, -180095, -121062, -184855, -93446, 93261, 162622, 118865, 10880, -216449, -443434, -555686, -559255, -445466, -554164, -648206, -619278, -296638, -171140, -51136, -133912, -189088, -300670, -369149, -476465, -582128, -466808, -266367, -304486, -252502, -148699]
15404a48699O0510j04880o5772O7197m1809l4097m5963j5520q4567M28514J44573
15393A59487k33379k11707k80028O2033K89922J22457j8061Q5231L8381r9060
15383h4724r5019J8116N1267J99332J1188l00413j60467q682J62412K7129j33367
15372c13228k6640n7683K7196K7494J08140j23848l4124O4673M8131O2072r1856
15361c09673j14631k1802j03577p4357J36285j07950M8924K2225k30507l7380
15351g92443K53282J23270M6723k43750k0044J10264O1509K1724j27994K07939
15341c59520J36169r837q9284l5113R7909J7632j60771R6661O7150P0534l6453
15330b04923M8184J98836J94284j31059j53889k26713k9621K14525j67997k03791
$$ y = [-148699, -88189, -193069, -258841, -191644, -233453, -267550, -313513, -329033, -413600, 14914, 159487, -73892, -285599, -565627, -503594, -213672, -91215, -109276, -24045, 14336, -84724, -179743, -161627, -110360, 88972, 100160, -200253, -360720, -369402, -206990, -179861, -313228, -339868, -397551, -370355, -342861, -234721, -358569, -392693, -328020, -279889, -217817, -309673, -424304, -446106, -549683, -624040, -487755, -595705, -546781, -524556, -755063, -792443, -539161, -415891, -369168, -612918, -632962, -522698, -461189, -439465, -567459, -359520, -223351, -233188, -322472, -357585, -259676, -242044, -402815, -306154, -239004, -168470, -204923, -156739, 42097, 236381, 105322, -48567, -275280, -304901, -90376, -258373, -462164]
15320d62164j15218j07871K4988j24813r9884J66738L50186m6136L5484Q3767
15310b94923m3740L0780p6755j74180O7142N6299J53834j4544l5482J00561J43589
15299h7419N6032l0099K8497j43982K1939Q336p1893Q8994o4721j10924j97977
15288e03217l7930R3770J1006Q5969K284n9350M9675J13531K74941K29637k80699
15277b0383o7527r1589k12519O7962M4613j46612m6369P4122J99888N3852k3011
15266a67573j16097R2677K7082K0046n2378R5315J85357P5317O0675m1271j12253
15255F6897o193l0025j15922k64049R6018J89253q3421j51296l6824n0950J69793
15244b16719M2197m6989r6465o5533k30405K00556K80063P7365j26102j15775
$$ y = [-462164, -577382, -685253, -660265, -785078, -884962, -718224, -368038, -414174, -378690, -294923, -338663, -307883, -384638, -558818, -491676, -435377, -281543, -296087, -331569, -231008, -87419, -31387, -61486, -32989, -176971, -155032, -146696, -218589, -129595, -194316, -305240, -503217, -541147, -447377, -436371, -350402, -348118, -407468, -357793, -244262, 30679, 260316, -20383, -87910, -179499, -392018, -324056, -279443, -426055, -472424, -398302, -198414, -144562, -167573, -283670, -190993, -163911, -143865, -196243, -100928, 84429, 159746, 220421, 179150, 66897, 60704, 30679, -85243, -349292, -253274, -64021, -147442, -298738, -335562, -386512, -216719, -174522, -221511, -317976, -383509, -613914, -413358, -133295, -55930, -182032, -297807]
15234b97807j8005N4153k18117m2272J48442L1748j30938k3672J34355j6133J79244
15223a99002J52430j14030K5491j02058K38853j40776l0990j1359j14079J97317
15213i8203L6004q0747j00653j67209m1288K29415K38792j02638k1326o310j24768
15202b38931O6004r239O0792J015m3560j15981n7085K27077q01J21348Q827p1244
15190e1778j08034j57369r9448l6124M3981O3309P7310Q1522P8805r8615j08092
15179c14533l8858K7299O7098j27510j28091Q1093n8784m1768j04080O6214O4801
15168e07119J30266J03010N5581J4274j79283j20601K29655K0678M6103J23041
15158h4395J7746p5041m4826o5203j0975P9598k8794j83664j4156Q3005J26891
$$ y = [-297807, -315812, -261659, -479776, -522048, -373606, -341858, -472796, -496468, -362113, -378246, -199002, -46572, -160602, -135111, -237169, 1684, -139092, -170082, -181441, -295520, -98203, -62199, -142946, -243599, -410808, -452096, -222681, 16111, -86527, -107853, -114163, -238931, -172927, -182166, -121374, -120359, -163919, -279900, -336985, -109908, -110709, 10639, 19466, -51778, -159812, -317181, -416629, -452753, -408772, -345463, -268153, -186631, -107826, -206441, -314533, -353391, -326092, -258994, -386504, -514595, -433502, -492286, -534054, -638134, -571920, -507119, -376853, -273843, -218262, -203988, -383271, -503872, -274217, -253539, -207436, -84395, -66649, -141690, -186516, -251719, -262694, -183096, -211890, -395554, -409710, -326705, -199814]
15147a99814J52241o0408j36910n7042J20723O0988O3474J23890J0303j7504J72128
15136B32069K29059p6566l39093k68758k6052L2954P8699R2137k88513j97650
15126e31714O4631R88o3173K42001J73313J3261q3759m1299k72898j19752J94171
15115d24230M97J78912M0752R9374R102j22422n5707j2436n4897L08587J29631
15104I7163j56162k36805r2437o8398p6202K3798J08572Q3220o328j65119j25670
15093f14368J14647J31201J9847J2386m285n478K1795J85779n5309K6696j85979
15082c53068j0490N2426J05745j343N8631k1701l4893Q4039o4673m9142K49205
15071A4736n6563k18901j30879j0129p9588j10193R4478J5574j709J50279q1664
$$ y = [-199814, -47573, -107981, -244891, -301933, -181210, -120222, -56748, 67142, 77445, 59941, 232069, 461128, 384562, 45469, -223289, -249341, -216387, -137688, -45551, -334064, -531714, -467083, -466095, -529268, -287267, -113954, -100693, -184452, -225751, -498649, -618401, -424230, -423733, -244821, -204069, -104695, -95593, -218015, -273722, -286158, -341055, -32468, 97163, -58999, -295804, -388241, -456639, -532841, -509043, -400471, -317251, -323579, -488698, -614368, -499721, -368520, -348673, -336287, -340572, -346050, -324255, -138476, -193785, -167089, -353068, -363558, -311132, -205387, -206730, -148099, -169800, -204693, -120654, -185327, -234469, 14736, -41827, -260728, -391607, -401736, -481324, -591517, -497039, -481465, -483174, -332895, -414559]
15060d14559o6900N9863N0138J4889j22211j7531j1314J84631n182j22968J20413
15049c30731L3678J2740N1037L5297r168N2011j03538j33051q3772J71276J06062
15038a98159j22741k62756j21163Q4021J55292j35493L4756m9051Q769N5508J61903
15027c89114Q0882m1810J42052K8995O8041k2803r8250o1160j69371R1447J8647
15016c52444Q0628l1530j27057P8582j70828J18416n935J6967J60217N1461O9951
15005a11572p4057r0009o8264N7294K00110j61994k45757j03399K26374K02713
14995a68561l7209N1424j73152J26949K11192p2293k6806M1681k15728J6745j75843
14984d21601O2784l1087j14596J64688J05316J09249L7148j08934j73550q339
$$ y = [-414559, -481459, -421596, -371458, -356569, -478780, -496311, -507625, -322994, -328176, -451144, -330731, -297053, -284313, -233276, -197979, -207147, -155136, -258674, -391725, -475497, -304221, -198159, -320900, -583656, -704819, -620798, -465506, -600999, -566243, -615294, -606525, -551017, -389114, -308232, -350042, -207990, -178995, -110954, -133757, -232007, -293167, -462538, -371091, -352444, -271816, -303346, -430403, -351821, -522649, -404233, -410168, -393201, -232984, -181523, -111572, -185629, -275638, -343902, -286608, -86498, -248492, -494249, -597648, -371274, -168561, -205770, -154346, -327498, -200549, 10643, -61650, -88456, -46775, -262503, -245758, -421601, -358817, -389904, -504500, -339812, -234496, -125247, -88099, -197033, -370583, -378922]
14974c78922L1551J984L3957Q3920J9926j73438L3987M9527J09562j0541k2049
14963b20536n5523M3809j60073j3513O1479K7030R8413J70663R5771j13377j75791
14952b41648O2760j93169k04323q5090J02604Q0848n5458J34707J20428k24354
14942e02695r1108K25178J24027J9114j8180J5257R4375J11859N6790j38250o8295
14931a71928o8366J74717M9208j02901o5792L3285k02493p2199J46978o375j68770
14920d54636j0467J19702P474L7236o5430R8034K22282j68693j26054j58845K1033
14909d78364L14105K32053p9985k6740j60006l162Q948J72609j3589j09255J01152
14898d2234q3722o4269N3937O0801J17916j2316j90828j55509l2111p6560L395
$$ y = [-378922, -347371, -345387, -311430, -227510, -207584, -381022, -347035, -297508, -187946, -198487, -220536, -276059, -232250, -392323, -405836, -344357, -317327, -218914, -48251, 47520, -65857, -241648, -178888, -372057, -576380, -661470, -558866, -478018, -533476, -398769, -278341, -502695, -593803, -368625, -244598, -225484, -243664, -228407, -134032, -22173, 34617, -103633, -171928, -240294, -65577, -16369, -119270, -185062, -151777, -354270, -426469, -279491, -285866, -454636, -465103, -345401, -337927, -300691, -366121, -268087, -45805, -214498, -340552, -499397, -478364, -164259, 67794, -12191, -38931, -198937, -202099, -193151, -20542, -34131, -143386, -42234, -125956, -190225, -136288, -75487, 42429, 30113, -160715, -316224, -348335, -424895, -421500]
14887d21500J05364J75308O9944p1056k86460p9584j7568n835N0797j82381J5339
14876f47632J78073K1920j6100j43725n1792o8742J53836K77988J08255j28440
14866c16359J9633m7338O1917j6714Q9516q3494J0187n737j3069J778j43254K8202
14854d14732j3858P7687J26598P5281k10453r675K97261J2797j97305r3356R6588
14843b53167o5021j96232p0549L61202L60646k5697j28845r7827l7755J81509
14833B8264j68570k03644p3135J93379K41750J39371r3658k26992o4126j38527
14823c65888j76616J11423K45915J46391k0806j33770J2676k3440k080K4886n5409
14812b36718K9519K07966J14670j60580j94068j751n5766N7229j4375l1698Q1249
$$ y = [-421500, -316136, -140828, -70884, -141940, -428400, -507984, -525552, -531387, -480590, -662971, -647632, -469559, -447639, -463739, -607464, -659256, -727998, -574162, -296174, -187919, -316359, -296726, -344064, -282147, -298861, -209345, -292839, -282652, -288389, -301458, -299680, -442934, -414732, -428590, -350903, -224305, -149024, -359477, -369152, -71891, -59094, -256399, -349755, -253167, -318188, -514420, -584969, -223767, 136879, 111182, -17663, -115490, -153245, 28264, -140306, -343950, -417085, -223706, 18044, 157415, 63757, -163235, -227361, -365888, -542504, -431081, -185166, -38775, -59581, -193351, -180675, -204115, -206195, -181309, -236718, -207199, 767, 115437, -45143, -239211, -240962, -296728, -239499, -253874, -285572, -204323]
14801b04323J26372J01283J22649k2208l51920q5821J20061j3940k6309l2446
14791b66602O0106J67705Q5875m6849p0011k52382K5676J69334j21562j72012
14781d20722M6796o4552J8275Q9773j56996m5032N5277j20257n24P0710J87090
14770c40162Q007J0073K25033J46361k35773j24803o1172j96914P4971J77121
14760c17258K15826J46277J03412j85069p1721J61683J0645r2944j4320k929j02959
14749a49357M1486L3447M7757m8360k97024j15569J56358L1279k8498n0188J1899
14738c66770Q6490r5108m0427j80289J17882J01341l2690j3425K37780P7913L7925
14727f9378j05728j16176N9497j20865J65461J96989J17450j2899q4679k08086
$$ y = [-204323, -77951, 23332, 145981, 123773, -228147, -313968, -193907, -207847, -234156, -266602, -206496, -38791, 47084, 235, -69776, -322158, -296482, -127148, -248710, -420722, -373926, -438478, -420203, -330430, -487426, -532458, -477181, -597438, -597962, -527252, -340162, -332155, -322082, -97049, 49312, -186461, -311264, -372436, -569350, -494379, -317258, -101432, 44845, 148257, -36812, -108533, 53150, 63795, -29149, -43469, -46398, -149357, -107871, -74424, -26667, -75027, -372051, -487620, -331262, -299983, -328481, -378669, -366770, -280280, -375388, -415815, -596104, -478222, -376881, -409571, -422996, -185216, -107303, -69378, -175106, -291282, -231785, -352650, -187189, 9800, 127250, 114351, 29672, -178414]
14717a78414j53066R229p7864M4724K7370j28245J2955J23492p6542j90235m5052
14706f31648J15439l2429J01202J06591J41696P4236R5557J9001j15640p6236
14696b02231J676J692j39981J01097L06532O1609k46351k71686r6808k1643m5688
14685e51782J16767L6019j2417N5177J46027p7278K07165J5941j14020j50087
14675c28488J7964P3488J41530J59710q283j48023j99335q6737J4476R3558K06807
14664f3333J06685N3550j23624k51470n9441p7662k74629N0514M64945J98295
14654B3830k15795j73506O0370J18983L8077M6018k2651P272r0970k64206k1180
14643d93758L33215L12860k75820k63033L6837Q578o751O8243J07716J58932J33390
$$ y = [-178414, -331480, -322251, -400115, -355391, -328021, -456266, -443311, -319819, -396361, -586596, -631648, -516209, -548638, -447436, -340845, -199149, -124913, -29356, -10355, -125995, -202231, -200555, -198863, -338844, -237747, 68785, 130394, -115957, -387643, -484451, -506094, -551782, -435015, -398996, -411413, -356236, -210209, -287487, -80322, -64381, -178401, -328488, -310524, -237036, -95506, 64204, 55921, -92102, -291437, -378174, -363698, -270140, -63333, 43352, 96902, -26722, -278192, -337633, -415295, -689924, -639410, -174465, 23830, -191965, -365471, -305101, -186118, -148041, -102023, -124674, -117402, -208372, -472578, -493758, -160543, 152317, -123503, -386536, -349699, -341121, -347872, -279629, -171913, -12981, 120409]
14632A20409j39350k82163K96044n057j74860K2838k04643j61067R038j7323j6045
14621e52179Q8267J38482n0602j96394N2755r6219j67398J70427K7807q6729N9986
14610f11797L2153J82596O125l900L4363Q4226K0316J13493J43505k54990p9949
14599c33859P5112j09432j48781J72886K38605J88000L3716k99315k23558P6573
14589c30053j1562J38447K21015k2133j53848M5521P2264m8025p0690m9259p1640
14578b79963K3981J9009m042n2244P9001K42704p5950K5995r1772l59110l07431
14567g79822j23430J79916J56552P6497M9921Q1205L9836j00884j50352k39250
14557h09811j16693K6706P5641M2241J38102K02426J19058N8118K1458M3441O4355
$$ y = [120409, -18941, -301104, -5060, -10117, -184977, -162139, -366782, -527849, -518811, -536134, -552179, -463912, -325430, -376032, -572426, -519671, -615890, -783288, -612861, -585054, -671783, -611797, -579644, -397048, -390923, -394823, -360460, -276234, -255918, -142425, 1080, -253910, -333859, -258747, -368179, -516960, -344074, -105469, 82531, 116247, -183068, -406626, -330053, -341615, -203168, 17847, -4286, -158134, -112613, -40349, -88374, -159064, -208323, -279963, -255982, -236973, -241015, -293259, -214258, 28446, -47504, -21509, -113281, -472391, -779822, -903252, -723336, -566784, -490287, -440366, -359161, -319325, -420209, -570561, -809811, -926504, -899798, -824157, -781916, -643814, -441388, -322330, -264212, -242754, -199313, -134958]
14546a34958o9675j34817J5201L0868j28164j33147r588J03735P9106R38N5242
14535c25259r1476M1859J68105O8946J56899J5463k31663R9557K14002L0752k15736
14524f8551k32919q1621L5383j67119N7800j7668K64494J15256j78793p5821J6643
14513c32916M8756J56843K8848m9623j03311m9207l5376N8662p720o1177J4495
14502c31726J4748M4078m4057J87217J89411j24267K679J18343k9749j16587k12416
14491c02326J15973j31609r9951L02378n2947K0183k2941j97186K2944q616n2958
14480d07056M0083R1440m8701J15919l12394k7543K50995J76324j22381m8035
14470b91349k4110J33950J25285k58517j15801n9899R4012k7756J06612K12938
$$ y = [-134958, -204633, -339450, -324249, -293381, -421545, -554692, -564280, -460545, -381439, -380501, -325259, -416735, -374876, -206771, -137825, 19074, 34537, -197126, -97569, 116433, 147185, -68551, -301470, -383091, -347708, -514827, -457027, -474695, -210201, -94945, -273738, -349559, -332916, -284160, -127317, -98469, -148092, -251403, -300610, -335986, -277324, -285044, -346221, -331726, -316978, -272900, -316957, -129740, 59671, -64596, -61917, 56426, 26677, -89910, -302326, -186353, -317962, -417913, -115535, -168482, -148299, -171240, -368426, -345482, -354098, -407056, -366973, -275533, -324234, -208315, -520709, -548252, -297257, -120933, -243314, -291349, -315459, -181509, -56224, -314741, -430542, -490441, -396429, -424185, -317573, -104635]
14460a04635r5540k31160j64728J11753L7854n3818K7432J83633K23119l4977
14450a01067m6998M6816j02372m5721M3433J3865j34497j41105J297J40039J07100
14439b19210J46688n8061j76877j25165J71871J75700m0751q8082k15106j97880
14429f26873K10092K07975J53539K6301k20591j19773O5871K21013J24330k5712
14419A6172L0127q0226j3441n126k3095L7798j49098M6244j2424J27093N9139
14408C3163k24751Q485J29323P1945j84907m4918J16873m2343p6958O7541k05760
14397c52307j3341J52180m2499k13351j83850R5056K30627J31475R9188M3724
14387e3098j55887j26055N8140J31852l24198J11978N5203Q0809L9858p0108j1577
$$ y = [-104635, -200175, -431335, -596063, -484310, -446456, -500274, -472842, -289209, -66090, -101067, -148065, -101249, -203621, -249342, -205909, -192044, -326541, -467646, -466349, -326310, -219210, -72522, -130583, -307460, -432625, -260754, -85054, -125805, -213887, -428993, -626873, -416781, -208806, -55267, -28966, -249557, -369330, -303459, -82446, 41884, 16172, 46299, -33927, -47368, -52494, -75589, -37791, -186889, -140645, -153069, -25976, 33163, -191588, -183103, -53780, 18165, -166742, -211660, -94787, -137130, -214088, -146547, -352307, -365648, -213468, -255967, -469318, -653168, -558112, -327485, -196010, -96822, -53098, -208985, -335040, -276900, -145048, -469246, -357268, -302065, -221256, -181398, -251506, -263083]
14376b63083o529J66229K45542m0071j93881k12927Q0467J97225m6919j93501
14366b67448m5507O1625l915Q9893J19367k569J1279j73362j74502k406J47715
14355b39830J30105K0490k32337j21818n599J82367n9147m5006m3873J78735Q6070
14344a49843J31364J41258j32942j08622j8710N1791j65717O5701J76460j11663
14334a20923o4692j48463J63810Q4612J20022k9980l1137q3477j01411M7278j78552
14323c42913m6889P527O718P9322J2535J20566K21131K7149o7508k84871j15420
14312c82653j160K68181J86625j61438r488K2754J14608L9902k61002j46200O887
14301c22984N3229j3241J9343K1354J05025r6616j24881P2919j19964j4924K1626
$$ y = [-263083, -269612, -103383, 142159, 102088, -91793, -304720, -224253, -27028, -73947, -267448, -312955, -251330, -255245, -165352, -45985, -48554, -37275, -210637, -385139, -387545, -239830, -109725, -89235, -321572, -443390, -448989, -266622, -325769, -370775, -414648, -235913, -149843, -18479, 122779, -10163, -118785, -137495, -85704, -251421, -185720, -9260, -120923, -185615, -334078, -170268, -85656, 34366, 4386, -26751, -110228, -211639, -164361, -342913, -389802, -382275, -375557, -296235, -283700, -163134, 57997, 85146, 17638, -267233, -382653, -383813, -115632, 70993, -90445, -99933, -77179, 37429, 77331, -183671, -329871, -322984, -269755, -282996, -263653, -242299, -137274, -233890, -358771, -285852, -405816, -420740, -399114]
14290c99114J16250J92274Q2428J754o2523q8180j51719j4207O9695K8590R1411
14279a33341k33263K6422R311M7245j50639q380K08628K39735K4628n2583r1055
14268a13292O39O3271n6137M999O9163K7120j05988q6340m2000n0989L00268m5330
14256c4616j54499J36424N3140j24806j80767j56213M7373J58530J5106j04083
14246c44411j22362n0946J52764P3359o5058J45532J13526k4922j19250J22946
14236a18822j8531j83774K1118M8716J09044o6712j4480n4685J3533J23157J29977
14225a1459n8932N843J35465J34701j55058q2985j41614j14279J50453P6176M3672
14214a8017n945p4236l4503j67568p2706J3727R8850J75530R5017o451m5093k60240
$$ y = [-399114, -282864, -90590, -8162, -6408, -68931, -157111, -308830, -323037, -253342, -224752, -133341, -366604, -340182, -330871, -283626, -434265, -442645, -234017, 5718, 30346, -22237, -113292, -112653, -49382, -105519, -100520, -31357, -4237, -110225, -196565, -238565, -289554, 10714, -34616, -189115, -52691, 449, -124357, -305124, -461337, -413964, -255434, -240328, -344411, -466773, -517719, -364955, -291596, -356654, -211122, -97596, -122518, -241768, -118822, -137353, -321127, -300009, -251293, -142249, -208961, -223441, -278126, -264593, -141436, -11459, -70391, -64548, 70917, 205618, 50560, -32425, -174039, -288318, -137865, -61689, -18017, -23962, -98198, -132701, -300269, -372975, -359248, -260398, -84868, 10149, 3698, -41395, -301635]
14202c01635p6264p0828j25121J17132J80798R1163J01255J35498P4347j30155
14192c810j47289J01144Q2876j73345m0128M6876J6828J93139j31550o6874j8614
14181a40747l4468J16045M0303L8246M2674J34663j18319k40061J0115k09611
14171c61160o9089Q2335Q6638l4849j41167j00322j5865J03859K60431J69000
14161b0189M1881J47023J05332j67999k15242p9725l8841j02161L04590Q8728
14151F3397L3646m8680l2910o0279k5618o7714o4010j12783n609r0790R2208R248
14139c09894J38345N3634l2295m9419k306J25404p2050l90014k2175K3630N2575
14128d84565J43633K4526N5337p996q4942k17598j19421P9856L37451J68598j36445
$$ y = [-301635, -377899, -448727, -573848, -456716, -275918, -184755, -83500, 51998, 126345, -3810, -151099, -49955, 32921, -140424, -180552, -133676, -116848, 76291, -55259, -122133, -140747, -175215, -59170, -18867, 19379, 62053, 196716, 78397, -161664, -151549, -361160, -430249, -347914, -261276, -296125, -437292, -537614, -553479, -449620, -189189, -20189, 21692, 168715, 274047, 106048, -109194, -188919, -227760, -329921, -25331, 63397, 97043, 48363, 15453, -44826, -70444, -138158, -202168, -314951, -320560, -411350, -319142, -309894, -171549, -117915, -150210, -199629, -201935, -76531, -148581, -538595, -560770, -537140, -484565, -340932, -316406, -261069, -269065, -354007, -571605, -691026, -611170, -273719, -105121, -241566]
14117b41566N6862l4782M7267O3343j86238k16864K70845L05093J4170k35691
14107a57561j50879k4537J28493R2759L0780r1221j0579K17294l8795p6054j25163
14096b05463r6716j1748j75870J11793n3043O5827K27304j95816l6899R3312k42764
14085e20083J42317L51624j02359j96630O9038P2288j39042j26970L3880M9465
14075c66472J33781J4338j74702K0480K20141J79566j42318l8098J29585k5125
14065d8824o7231r4649M3543R8829j71886Q5691K11992n2658j85558P6414J63144
14054E8807j13109k35260J76138k474m9076J15214J25567l9304r1465M6113k6498
14043c5347k2837j17282J15217J34050M3199P5843j91642k87598j32433k08243
$$ y = [-241566, -184704, -219486, -172219, -108876, -295114, -511978, -241133, 63960, 78130, -157561, -308440, -332977, -204484, -111725, -80945, -172166, -182745, 34549, -4246, -80300, -205463, -302179, -313927, -489797, -378004, -431047, -365220, -137916, -333732, -370631, -277319, -520083, -377766, -26142, -128501, -325131, -256093, -183805, -322847, -449817, -415937, -366472, -232691, -218353, -393055, -372575, -152434, 27132, -115186, -153284, -23699, -48824, -116055, -210704, -167161, -68332, -240218, -154527, 57465, 4807, -180751, -104337, 58807, -54302, -289562, -113424, -115898, -164974, -49760, 75807, 36503, -54962, -8849, -35347, -58184, -175466, -60249, 73801, 117000, 192843, 1201, -286397, -418830, -627073]
14033f27073N9823J36041q0216K26597J20734n3732J62054J24923r0197O2252
$$ y = [-627073, -567250, -431209, -511425, -284828, -164094, -217826, -55772, 69151, -21046, 41206]
$$ [...]
##END NTUPLES=NMR SPECTRUM
##END=
